##TITLE=Analysis number 325314
Compound Code cc 29410
Project Code adrs
Chemist Name endeavour
##JCAMPDX= 6.0         $$ Bruker NMR JCAMP-DX V2.0
##DATA TYPE= NMR SPECTRUM
##DATA CLASS= NTUPLES
##ORIGIN= Bruker BioSpin GmbH
##OWNER= nmr
$$ XWIN-NMR		Version 3.5
$$ Mon Dec 18 13:51:04 2006 GMT Standard Time (UT+0h)  MAYBRIDGE\nmr@NMR_250MHZ
##.OBSERVE FREQUENCY= 250.131544655141
##.OBSERVE NUCLEUS= ^1H
##.ACQUISITION MODE= SIMULTANEOUS (DQD)
##.ACQUISITION SCHEME= undefined
##.AVERAGES= 16
##.DIGITISER RES= 18
##SPECTROMETER/DATA SYSTEM= dpx250
##.PULSE SEQUENCE= zg30
##.SOLVENT NAME= CDCl3
##.SHIFT REFERENCE= (INTERNAL, CDCl3, 0, 16.4943)
##AUDIT TRAIL= $$ (NUMBER, WHEN, WHO, WHERE, WHAT)
$$ ##TITLE= Audit trail, XWIN-NMR		Version 3.5
$$ ##JCAMPDX= 5.01
$$ ##ORIGIN= Bruker BioSpin GmbH
$$ ##OWNER= nmr
$$ C:\u/data/dgb/nmr/ADRS/1850/pdata/1/auditp.txt
$$ ##AUDIT TRAIL=  $$ (NUMBER, WHEN, WHO, WHERE, WHAT)
(   1,<2006-12-18 13:50:13.85 +000>,<MAYBRIDGE\nmr>,<NMR_250MHZ>,
      <created by zg, POWCHK disabled, PULCHK disabled
       configuration hash MD5:
       49 4B E0 1D 92 C2 6B 37 9F E6 65 BC 52 41 86 1D
       data hash MD5: 64K
       0D C4 E5 C6 08 62 AD C9 D7 D9 59 74 32 00 D4 CF>)
(   2,<2006-12-18 13:50:39.66 +000>,<MAYBRIDGE\nmr>,<NMR_250MHZ>,
      <Start of raw data processing
       ef LB = 0.3 FT_mod = 6 PKNL = 1 SI = 32K 
       data hash MD5: 32K
       C1 5B 38 12 8A 03 93 A8 87 12 67 78 E8 1C 32 E9>)
(   3,<2006-12-18 13:50:44.36 +000>,<MAYBRIDGE\nmr>,<NMR_250MHZ>,
      <apk 
       data hash MD5: 32K
       A2 68 E5 A7 6E D1 85 F2 62 75 F2 67 5C 37 7D DD>)
(   4,<2006-12-18 13:50:46.11 +000>,<MAYBRIDGE\nmr>,<NMR_250MHZ>,
      <abs ABSG = 5 
       data hash MD5: 32K
       9A 25 A8 59 99 BF 6F 1C C4 F9 16 33 06 E0 F4 E0>)
$$ ##END=
$$ 
$$ hash MD5
$$ AC 9B 8D B7 CE 19 3B 77 39 14 47 82 68 C1 50 E9
##$RELAX= 
##$RELAX= 
##$RELAX= 
##$RELAX= 
##$RELAX= 
##$RELAX= 
##$RELAX= 
$$ Bruker specific parameters
$$ --------------------------
##$DU= <C:\u>
##$EXPNO= 1850
##$NAME= <ADRS>
##$PROCNO= 1
##$TYPE= <nmr>
##$USER= <dgb>
##$AMP= (0..31)
100 100 100 100 100 100 100 100 100 100 100 100 100 100 100 100 100 100 
100 100 100 100 100 100 100 100 100 100 100 100 100 100 
##$AQSEQ= 0
##$AQ_mod= 3
##$AUNM= <au_zg>
##$AUTOPOS= <24 >
##$BF1= 250.13
##$BF2= 250.13
##$BF3= 250.13
##$BF4= 250.13
##$BF5= 500.13
##$BF6= 500.13
##$BF7= 500.13
##$BF8= 500.13
##$BYTORDA= 1
##$CFDGTYP= 0
##$CFRGTYP= 5
##$CHEMSTR= <none>
##$CNST= (0..31)
1 1 145 1 1 1 1 1 1 1 1 1 1 1 1 1 1 1 1 1 1 1 1 1 1 1 1 1 1 1 1 1 
##$CPDPRG= <>
##$CPDPRG1= <>
##$CPDPRG2= <>
##$CPDPRG3= <>
##$CPDPRG4= <mlev>
##$CPDPRG5= <mlev>
##$CPDPRG6= <mlev>
##$CPDPRG7= <mlev>
##$CPDPRG8= <mlev>
##$CPDPRGB= <>
##$CPDPRGT= <>
##$D= (0..31)
0 1 0 0 0 0 0 0 0 0.06 0 0 0 0 0 0 0.0002 0 0 0 0 0 0 0 0 0 0 0 0 0 0 
0 
##$DATE= 1166449810
##$DBL= (0..7)
120 120 120 120 120 120 120 120 
##$DBP= (0..7)
150 150 150 150 150 150 150 150 
##$DBP07= 0
##$DBPNAM0= <>
##$DBPNAM1= <>
##$DBPNAM2= <>
$$ [...]
##$SUBNAM7= <"">
##$SUBNAM8= <"">
##$SUBNAM9= <"">
##$SW= 20.6930455092707
##$SWIBOX= (0..15)
0 0 3 0 0 0 0 0 0 0 0 0 0 0 0 0 
##$SW_h= 5175.983436853
##$TD= 65536
##$TD0= 1
##$TE= 295.16
##$TE2= 300
##$TE3= 300
##$TEG= 300
##$TL= (0..7)
0 120 120 120 120 120 120 120 
##$TP= (0..7)
150 150 150 150 150 150 150 150 
##$TP07= 0
##$TPNAME0= <>
##$TPNAME1= <>
##$TPNAME2= <>
##$TPNAME3= <>
##$TPNAME4= <>
##$TPNAME5= <>
##$TPNAME6= <>
##$TPNAME7= <>
##$TPOAL= (0..7)
0.5 0.5 0.5 0.5 0.5 0.5 0.5 0.5 
##$TPOFFS= (0..7)
0 0 0 0 0 0 0 0 
##$TUNHIN= 0
##$TUNHOUT= 0
##$TUNXOUT= 0
##$USERA1= <user>
##$USERA2= <user>
##$USERA3= <user>
##$USERA4= <user>
##$USERA5= <user>
##$V9= 5
##$VALIST= <valist>
##$VCLIST= <CCCCCCCCCCCCCCC>
##$VD= 0
##$VDLIST= <DDDDDDDDDDDDDDD>
##$VPLIST= <PPPPPPPPPPPPPPP>
##$VTLIST= <TTTTTTTTTTTTTTT>
##$WBST= 1024
##$WBSW= 4
##$XGAIN= (0..3)
0 0 0 0 
##$XL= 0
##$YL= 0
##$YMAX_a= 475038
##$YMIN_a= -537066
##$ZGOPTNS= <>
##$ZL1= 120
##$ZL2= 120
##$ZL3= 120
##$ZL4= 120
##$ABSF1= 16.49426
##$ABSF2= -4.198912
##$ABSG= 5
##$ABSL= 3
##$ALPHA= 0
##$AQORDER= 0
##$ASSFAC= 0
##$ASSFACI= 0
##$ASSFACX= 0
##$ASSWID= 0
##$AUNMP= <proc_1d>
##$AZFE= 0.1
##$AZFW= 0.1
##$BCFW= 0
##$BC_mod= 0
##$BYTORDP= 0
##$COROFFS= 0
##$CY= 12.5
##$DATMOD= 1
##$DC= 0
##$DFILT= <>
##$DTYPP= 0
##$F1P= 14.0000005364418
##$F2P= -0.99999901652339
##$FCOR= 0.5
##$FTSIZE= 32768
##$FT_mod= 6
##$GAMMA= 0
##$GB= 0
##$INTBC= 1
##$INTSCL= 1
##$ISEN= 128
##$LB= 0.3
##$LEV0= 0
##$LPBIN= 0
##$MAXI= 10000
##$MC2= 0
##$MEAN= 0
##$ME_mod= 0
##$MI= 0
##$NCOEF= 0
##$NC_proc= -4
##$NLEV= 6
##$NOISF1= 0
##$NOISF2= 0
##$NSP= 0
##$NTH_PI= 0
##$NZP= 0
##$OFFSET= 16.49426
##$PC= 1
##$PHC0= 228.6022
##$PHC1= -1.223034
##$PH_mod= 1
##$PKNL= yes
##$PPARMOD= 0
##$PSCAL= 4
##$PSIGN= 0
##$REVERSE= no
##$SF= 250.130006936331
##$SI= 32768
##$SIGF1= 0
##$SIGF2= 0
##$SINO= 400
##$SIOLD= 32768
##$SREGLST= <1H.CDCl3>
##$SSB= 0
##$STSI= 32768
##$STSR= 0
##$SW_p= 5175.98343685301
##$SYMM= 0
##$S_DEV= 0
##$TDeff= 65536
##$TDoff= 0
##$TI= <Analysis number 999999
Compound Code 99
Book Reference 9
Project Code 9>
##$TILT= no
##$TM1= 0
##$TM2= 0
##$TOPLEV= 0
##$USERP1= <user>
##$USERP2= <user>
##$USERP3= <user>
##$USERP4= <user>
##$USERP5= <user>
##$WDW= 1
##$XDIM= 32768
##$YMAX_p= 509047129
##$YMIN_p= -149725
$$ End of Bruker specific parameters
$$ ---------------------------------
##NTUPLES= NMR SPECTRUM
##VAR_NAME=  FREQUENCY,     SPECTRUM/REAL,   SPECTRUM/IMAG
##SYMBOL=    X,             R,               I
##VAR_TYPE=  INDEPENDENT,   DEPENDENT,       DEPENDENT
##VAR_FORM=  AFFN,          ASDF,            ASDF
##VAR_DIM=   32768,         32768,           32768
##UNITS=     HZ,            ARBITRARY UNITS, ARBITRARY UNITS
##FACTOR=    0.157963299565203, 1,           1
##FIRST=     4125.70956530305, 0,            0
##LAST=      -1050.27387154996, 0,           0
##MIN=       -1050.27387154996, -149725,     0
##MAX=       4125.70956530305, 509047129,    0
$$ Real data points
##PAGE= N=1
##DATA TABLE= (X++(R..R)), XYDATA
$$ [...]
24209d0096q747k6926J1825N2243J3047R07K1084K4624J2651m350k8076l1869
$$ -40096 -48843 -75769 -63944 -11701 1346 2253 23337 47961 60612 56262 28186 -3683
24197c683l0590J8496j3545J762L336K289N81q579l3222K0489L1589J596m6986
$$ -3683 -34273 -15777 -29322 -27560 -24224 -21935 -21354 -29933 -63155 -42666 -11077 -9481 -56467
24184e6467J235O8976L7668j1184j5685m814n780j9728j2277Q754N591m19k5182
$$ -56467 -55232 13744 51412 40228 24543 19729 13949 -5779 -18056 -9302 -3711 -4130 -29312
24171b9312J126M683K3784L3380j5063q030k1536l4035k72K8251K1004J5500J8499
$$ -29312 -28186 -23503 281 33661 18598 10568 -10968 -45003 -45275 -17024 3980 19480 37979
24158C7979j8577k1376L922k4794j3124P3845K3976m7431k4038l547J1799k5532
$$ 37979 19402 -1974 1948 -22846 -35970 37875 61851 14420 -9618 -13165 -1366 -26898
24146b6898j5907m480J7981J5280R873j5391N688k949j4634k2524j6548J1530
$$ -26898 -42805 -47285 -29304 -14024 -4151 -19542 -13854 -16803 -31437 -53961 -70509 -58979
24134e8979P5649L9688l1440l0071n151k4183Q716L8748J0882k2129j4944Q502
$$ -58979 16670 56358 24918 -5153 -10304 -34487 -25771 12977 23859 1730 -13214 -4712
24122d712R179Q18j8224j3818l2833K1577L548j308L6999j6369j8612k5108R408
$$ -4712 4467 5285 -12939 -26757 -59590 -38013 -34465 -35773 1226 -15143 -33755 -58863 -49455
24109d9455N1239P609j0627j6535r52R050K4011j7536L6284L2182j8525L591Q4848
$$ -49455 1784 9393 -1234 -17769 -18721 -9671 14340 -3196 33088 65270 46745 50336 135184
24096A35184K5503j9592l2788n3551k8165k0232L3972K4063n974K6279r393m7546
$$ 135184 160687 141095 108307 54756 26591 6359 40331 64394 58420 84699 75306 27760
24084B7760k4401m2851L7959M9938P389m0675L672J6218j8392k5280j3967N6684
$$ 27760 3359 -39492 -1533 48405 55794 15119 18791 35009 16617 -8663 -22630 34054
24072C4054m0131l8933L0349M3240O913l4139K384O280j3714r330N716L668L1274
$$ 34054 -6077 -45010 -14661 28579 35492 1353 3737 10017 -3697 -13027 -7311 -3643 27631
24059B7631L6611J0429k525j1088K3909l9527n1332M74J1523Q719m670j9821M777
$$ 27631 64242 74671 72146 61058 84967 45440 -5892 -5418 6105 14824 10154 -9667 -4890
24046d890N0051K2267l8732o5140o003j3577N9336O4938j82l2828n704J827j44
$$ -4890 45161 67428 28696 -36444 -42447 -56024 3312 68250 68068 35240 29536 31363 31219
24033C1219R536J2409j225p6k1791r844L751j0956J1408M1919J3144l0672l4809
$$ 31219 40755 53164 51939 51863 30072 20228 23979 13023 24431 66350 79494 48822 14013
24020A4013j0394j0439P352k3366k7114O309L7080k4853p813K2363k0833J1567
$$ 14013 3619 -6820 532 -22834 -49948 -43639 -6559 -31412 -39225 -16862 -37695 -26128
24008b6128Q29J0857J6749R432k2421J4683J4951P485N161J0622j2615k8051K16
$$ -26128 -25299 -14442 2307 11739 -10682 4001 18952 26437 31598 42220 29605 1554 1770
23995A770J3288k4100n134l1908Q017Q665K4433L4237K6959m2978j7809o490j6829
$$ 1770 15058 -9042 -14176 -46084 -38067 -29402 -4969 29268 56227 13249 -4560 -11050 -27879
23982b7879M3285K8253J886K154k1415m1710k0769j7395Q990K9352n729n042L314
$$ -27879 15406 43659 45545 47699 26284 -15426 -36195 -53590 -44600 -15248 -20977 -26019 -22705
23969b2705m366r805J2976p669P36M1758N461q336o076J4751J0207P794k6540
$$ -22705 -27071 -36876 -23900 -31569 -30833 10925 16386 8050 1974 16725 26932 34726 8186
23956H186N515J729k9668q718K3670r378J8361o382m3222J3653L599M2503K1523
$$ 8186 13701 15430 -14238 -22956 714 -8664 9697 3315 -39907 -26254 -22655 19848 41371
23943D1371l4188m5675j6753M3921K5759R430K7253j3723p868k4326k3202J6160
$$ 41371 7183 -38492 -55245 -11324 14435 23865 51118 37395 29527 5201 -18001 -1841
23931a841k9979k4320J1669p44Q808K15n653K4028L4527q902j4094L6016J5962
$$ -1841 -31820 -56140 -44471 -45215 -36407 -36192 -41845 -17817 16710 7808 -6286 29730 45692
23918D5692r784l127n0286r063J1027J9971p95j5122m986K6812R579j6025m1740
$$ 45692 35908 32781 -17505 -26568 -15541 4430 3635 -11487 -16473 10339 19918 3893 -37847
23905c7847K5138J0121j3349K8060J8649j2119k5951j6666J4770K0189K438%l424
$$ -37847 -12709 -2588 -15937 12123 30772 18653 -7298 -23964 -9194 10995 13433 13433 10009
23892A0009J5887m104l6756Q147R773k1940j5876J9304Q510j6479l645K6577J3973
$$ 10009 25896 21792 -14964 -6817 2956 -18984 -34860 -15556 -7046 -23525 -27170 -593 13380
23879A3380R652J1876r967K79k7111k4537j417L4003J0588l1888P813k9176j4893
$$ 13380 23032 34908 24941 25220 -1891 -26428 -27845 6158 16746 -15142 -7329 -36505 -51398
23866e1398L0939J1369l0551L1769L0493k595M613K6613N429L799p431J3532K7346
$$ -51398 -20459 -9090 -39641 -7872 22621 20026 24639 51252 56681 60480 53049 66581 93927
23853I3927k9189K5917J6941j6370m7443k5469p429l6725J539M3863m683p301
$$ 93927 64738 90655 107596 91226 43783 18314 10885 -25840 -24301 19562 14879 7578
23841G578o931o773j8230j1336K2301k600m1617j5745N2576P4468J6091k2448
$$ 7578 647 -6126 -24356 -35692 -13391 -15991 -57608 -73353 -20777 53691 69782 47334
23829D7334j3821l8366k503L515k2237j8826J6157q958m6442K495K1020m2325
$$ 47334 33513 -4853 -7356 -3841 -26078 -44904 -28747 -37705 -84147 -81652 -60632 -102957
23817a02957K1892J0196M4869P356l6492K7269n162j1798p390K2771o797K5640
$$ -102957 -81065 -70869 -26000 -18644 -55136 -27867 -33029 -44827 -52217 -29446 -36243 -10603
23805a0603L0727L455j8911l2947j8522J6929L4841L4889k2265M832J7911r129
$$ -10603 20124 23579 4668 -28279 -46801 -29872 4969 39858 17593 22425 40336 31207
23793C1207k5253n565n216J0124R875L352l5247J1159L1910m283k0793L5121k1667
$$ 31207 5954 389 -4827 5297 15172 18524 -16723 -5564 26346 22063 1270 36391 14724
23780A4724m687J9126j1857J76L5592q35n3279J0896Q931J2373K315J1528j8534
$$ 14724 10037 29163 17306 17482 53074 52239 -1040 9856 18787 31160 33475 45003 26469
23767B6469n1022k5572L4414M2082J8576l9878m2871p240l534L1642L7927j3744
$$ 26469 -24553 -50125 -15711 26371 44947 5069 -37802 -45042 -48576 -16934 20993 7249
23755G249m2510N624J939J4086J4115j2699l8487J6185R24J5570J4475l3939l7837
$$ 7249 -35261 -29637 -27698 -13612 503 -12196 -50683 -34498 -33574 -18004 -3529 -37468 -75305
23742g5305M6754J2270j177J3200N310n7020l7580K2740K3396L4988M7269J6784
$$ -75305 -28551 -16281 -17458 -4258 1052 -55968 -93548 -70808 -47412 -12424 34845 51629
23730E1629m794p09J2442k0322P656J1654J7751j7720k1557J1992k8085m6940
$$ 51629 46835 46126 58568 38246 45902 57556 75307 57587 36030 48022 19937 -27003
23718b7003K2143O8787K0688l6867l8973J1270J8071N988p102l0149q151J1897
$$ -27003 -4860 63927 84615 47748 8775 20045 38116 44104 37002 6853 -1298 10599
23706A0599M098j7922K0183k3820m439N3577L1810n0484r530J0811Q812J647k3136
$$ 10599 14697 -3225 16958 -6862 -11301 42276 74086 23602 14072 24883 33695 35342 12206
23693A2206L0500K3939k2906k6805N301j676k5770L1956l53l1089n5091L681L6096
$$ 12206 42706 66645 43739 16934 22235 20559 -5211 26745 26392 -4697 -59788 -56107 -20011
23680b0011J1776k1134J9616k736P172N992j3180J7749L5279J5082j4391j5953
$$ -20011 -8235 -29369 -9753 -12489 -5317 675 -12505 5244 40523 55605 41214 25261
23668B5261j5282n60J4196K2458J7603K2136k6883k3321k1082o586O774K3373
$$ 25261 9979 9419 23615 46073 63676 85812 58929 35608 14526 7940 14714 38087
23656C8087K7944N548m4613k6137L358k4022k026L367J8686K7377P66m4860J0277
$$ 38087 66031 71579 26966 829 4187 -19835 -21861 -18494 192 27569 28335 -16525 -6248
23643f248J1873k5172l416k7624j9529k2635l3619J7597O932n131M0754L1317
$$ -6248 5625 -19547 -22963 -50587 -70116 -92751 -126370 -108773 -101841 -106972 -66218 -34901
23631c4901J8125L2014k245J2672R658m8569j3209K4158o551L0172K8758l363
$$ -34901 -16776 15238 12993 25665 35323 -13246 -26455 -2297 -8848 21324 50082 46719
23619D6719m2429k7272J2281J9755K9241J9493l1956k4673O199P42K0922k9941
$$ 46719 4290 -22982 -10701 9054 38295 57788 25832 1159 7358 8100 29022 -919
23607i19K0054N2427R742P162N545k4157k058o997j6441o697k0953j3480J7274
$$ -919 19135 71562 81304 88466 94011 69854 67796 60799 44358 37661 16708 3228 20502
23594B0502K4403j6718l5412l3976j6160j5843p316R829J0745R719K3251J7944
$$ 20502 44905 28187 -7225 -41201 -57361 -73204 -80520 -70691 -59946 -50227 -26976 -9032
23582i032o630P8k1141J2204O908l2457k0253J7283K0756k488K1409P244k4733
$$ -9032 -15662 -15584 -36725 -24521 -17613 -50070 -70323 -53040 -32284 -34772 -13363 -6119 -30852
23569c0852j3714M2024K0313j0640j4917J6770Q591J6876R021L547p106k7016
$$ -30852 -44566 -2542 17771 7131 -7786 8984 17575 34451 43472 47019 39913 12897
23557A2897M1178M0096o735k395k0524q321o622l3309n0506R77M88K784N319P144
$$ 12897 54075 94171 87436 85041 64517 56196 49574 16265 -34241 -33264 -32776 -29992 -24673 -17529
23543a7529J3441K4027J7446n202j7612K0878M011l9542K8040L2918k1475m2530
$$ -17529 -4088 19939 37385 32183 14571 35449 39460 -82 27958 60876 39401 -3129
23531c129j207j5021P302r425M559K8979M717n42l5740m294j9859m1984O434L852
$$ -3129 -4336 -19357 -12055 -21480 -16921 12058 16775 16233 -19507 -23801 -43660 -85644 -79210 -75358
23517g5358J5494L2998J2459J1716J5262p298L460j221J863k2895j1157k670k793
$$ -75358 -59864 -26866 -14407 -2691 12571 5273 8733 7512 9375 -13520 -24677 -27347 -30140
23504c0140K4413P227K252j1375K2813j8786J7857j603l6404K9211l0265m4413
$$ -30140 -5727 1500 3752 -7623 15190 -3596 14261 12658 -23746 5465 -24800 -69213
23492f9213R074O837N8242L6862K2026j9107j2992m797k2956P351K8401j3252
$$ -69213 -60139 -53302 4940 41802 63828 44721 31729 26932 3976 11327 39728 26476
23480B6476k5197j8925k4154l4850l065L3523K9062J6008K6000J8909l4743l3856
$$ 26476 1279 -17646 -41800 -76650 -79715 -46192 -17130 -1122 24878 43787 9044 -24812
23468b4812M739K5601j0104m1558k7801N583L5774L4915M508K534M528l1955j2031
$$ -24812 -20073 5528 -4576 -46134 -73935 -68352 -32578 2337 6845 9379 13907 -18048 -30079
23455c0079j3584r651m97L7861K2738q949p406O571L2745r510j707j029K878l5878
$$ -30079 -43663 -53314 -53811 -15950 6788 -2161 -9567 -2996 29749 20239 18532 17503 20381 -15497
23441a5497j5196J1847m62j524m983J3834J8763r988q540K472K5811N0752j6856
$$ -15497 -30693 -18846 -19308 -20832 -25815 -11981 6782 -3206 -11746 -9274 16537 67289 50433
23428E0433j5836L698O425J5021J7814k8122m9558l7021o196K8577J6676L8579
$$ 50433 34597 38295 44720 59741 77555 49433 -125 -37146 -43342 -14765 1911 40490
23416D0490l198m1644j2169J4761l8541o106p538J9073J5894J3435o810k3017
$$ 40490 37292 -4352 -16521 -1760 -40301 -46407 -53945 -34872 -18978 -5543 -12353 -35370
23404c5370k3361k8943j2772M5325M4697j6689K605J6784m6874k0998J4393M6878
$$ -35370 -58731 -87674 -100446 -55121 -10424 -27113 -24508 -7724 -54598 -75596 -61203 -14325
23392a4325L8151o509j7539j1679L2485J4383k4373j3235L8213Q519j7175j5548
$$ -14325 23826 17317 -222 -11901 20584 34967 10594 -2641 35572 44091 26916 11368
23380A1368r031k2211L2484J5236k0075j3561o223J5687r952l319L2615J9904
$$ 11368 2337 -19874 12610 27846 7771 -5790 -12013 3674 -6278 -9597 23018 42922
23368D2922K3709j0777j9326R047L862k7941j4126n4248j4809K2613L8808J4491
$$ 42922 66631 55854 36528 45575 49437 21496 7370 -46878 -61687 -39074 -266 14225
23356A4225j0818j0044l765j0463N557N10K3285m397p519R442K2317L767l2106
$$ 14225 3407 -6637 -10402 -20865 -15308 -14798 8487 4090 -3429 6013 28330 32097 -9
23343iL022N086Q537J1869J5999j8952l4859k5871J5766R962N844K2149l199j654
$$ -9 3013 8099 16636 28505 44504 25552 -9307 -35178 -19412 -9450 -3606 18543 15344 13690
23329A3690k3228j503J3752J5753k2356j6517m8957o479Q873N0752L0285L9287
$$ 13690 -9538 -11041 2711 18464 -3892 -20409 -69366 -75845 -66972 -16220 14065 53352
23317E3352m0022n6120j6040J2775J9475J6680j1038k8115n401Q793M8088J2138
$$ 53352 13330 -42790 -58830 -46055 -26580 -9900 -20938 -49053 -54454 -45661 2427 14565
23305A4565k5744j3431j967p290k5310R82k0654k5912J1009P166L2808N0762j1231
$$ 14565 -11179 -24610 -26577 -33867 -59177 -58195 -78849 -104761 -93752 -86586 -53778 -3016 -14247
23292a4247l0551m766L0398J3852r166J1538M281J2690J8469l3015k6343K0325
$$ -14247 -44798 -49564 -19166 -5314 -14480 -2942 1339 14029 32498 -517 -26860 -6535
23280f535K4699J512L084j1119k7362K1302O125o084j0485J9481j3041J486K2858
$$ -6535 18164 19676 22760 11641 -15721 5581 11706 5622 -4863 14618 1577 3063 25921
23267B5921r430k327j4205j705J2419J5245j5731Q322k4022k5753K205M5893K9288
$$ 25921 16491 14164 -41 -1746 10673 25918 10187 18509 -5513 -31266 -29061 16832 46120
23254D6120r799p860m4984J3631M7511q199L741K8630J3877l2657m3236q155N523
$$ 46120 36321 28461 -16523 -2892 44619 36420 40161 68791 82668 50011 6775 -1380 4143
23241D143n317j7882j5146l9510l063J1527M4087J6430o593L0559O477K367k6668
$$ 4143 -1174 -19056 -34202 -73712 -76775 -65248 -21161 -4731 -11324 19235 25712 28079 1411
23228A411J1945K6523j6350k060l6871k2047N2190K3720R734K906k1848j891J1989
$$ 1411 13356 39879 23529 21469 -15402 -37449 14741 38461 48195 51101 29253 27362 39351
23215C9351j4212j6717l319J0650l3492J3028J2319J3639L706j8281l4151P381
$$ 39351 25139 8422 5103 15753 -17739 -4711 7608 21247 24953 6672 -27479 -20098
23203b0098L484K6638K9030J4959J187j7084l2769j0994j4611k2609j7057P228
$$ -20098 -16614 10024 39054 54013 55200 38116 5347 -5647 -20258 -42867 -59924 -52696
23191e2696j001K586L0274J4339J1180o072k886K78j5963j5445J3065J1136m516
$$ -52696 -53697 -51111 -20837 -6498 4682 -1390 -4276 -3998 -19961 -35406 -22341 -11205 -15721
23178a5721k2252j090J1924k3745P973n928K8391K5066k5060k053k1833L1468
$$ -15721 -37973 -39063 -27139 -50884 -42911 -48839 -20448 4618 -20442 -22495 -44328 -12860
23166a2860N555j6700p58j4686n327J0420K5977k3546K847K8596k1904m296P495
$$ -12860 -7305 -24005 -24763 -39449 -44776 -34356 -8379 -31925 -29078 -482 -22386 -26682 -19187
23153a9187R482n754j0270j4356P919L5654k5559l6854N623L8510J7231j3690
$$ -19187 -9705 -15459 -25729 -40085 -32166 3488 -22071 -58925 -53302 -14792 2439 -11251
23141a1251L484K2033M074M542l746J0696j1192J6054j2220M256p345l367J3034
$$ -11251 -7767 14266 18340 22882 19136 29832 18640 34694 22474 26730 19385 16018 29052
23128B9052N32j763j3380j0773j6342m0299k980M3604L5883j7177J836K927k6973
$$ 29052 29584 27821 14441 3668 -12674 -52973 -55953 -12349 23534 6357 8193 11120 -15853
23115a5853J0276O2861j898m2195j7728k463k8188k8388K3629K3867l680K0575
$$ -15853 -5577 57284 55386 13191 -4537 -7000 -35188 -63576 -39947 -16080 -19760 815
23103H15j9937j540j9206j8922N372K2606P501l883K675K4994m402j3522k6549
$$ 815 -19122 -20662 -39868 -58790 -53418 -30812 -23311 -27194 -24519 475 -3927 -17449 -43998
23090d3998q379j6071K2473p716j2288J6803N2907L5652R669q431l4543l9560
$$ -43998 -52377 -68448 -45975 -53691 -65979 -49176 3731 39383 49052 40621 6078 -33482
23078c3482l1549k684K6758J0371J4128j4509r757K284l882J4188J2904p068R303
$$ -33482 -65031 -67715 -40957 -30586 -16458 -30967 -40724 -38440 -42322 -28134 -15230 -22298 -12995
23065a2995j6368M4178K5211j473j4490m0752j6933k6420J7747J8182j1917j604
$$ -12995 -29363 14815 40026 38553 24063 -16689 -33622 -60042 -42295 -24113 -36030 -37634
23053c7634J2904l6036j1808M1105J8503L5793k1420j129l4885k0918K4686o790
$$ -37634 -24730 -60766 -72574 -31469 -12966 22827 1407 278 -34607 -55525 -30839 -37629
23041c7629J7173K1799M6771o176p970N1461j9138n5913j7141L0300K021p464
$$ -37629 -20456 1343 48114 41938 33968 85429 66291 10378 -6763 23537 25558 18094
23029A8094m7160k4204L347L260N093J437L0802K08j6232j360K2019L155J694
$$ 18094 -29066 -53270 -49923 -46663 -41570 -40133 -9331 -9123 -25355 -26715 -4696 -1541 153
23016A53J5798k9125J8623j2607j4794J6437K2903K2723k2705j6816n920L239
$$ 153 15951 -13174 5449 -7158 -21952 -5515 17388 40111 17406 590 -5330 -2091
23004b091k4643K2408J3763J8413K818K501k159n66k905m8576k569l262J3158
$$ -2091 -26734 -4326 9437 27850 30668 33169 31010 30444 27539 -21037 -23606 -26868 -13710
22991a3710L3816j1730j603J4128L1054J6159J9024p003n9817l9503j2031k39
$$ -13710 20106 8376 6773 20901 51955 68114 87138 80135 20318 -19185 -31216 -31455
22979c1455K9183K6794J0921j4825j1355k2068j2347J9119J0989K1631O290k0643
$$ -31455 -2272 24522 35443 20618 9263 -12805 -25152 -6033 4956 26587 32877 12234
22967A2234o164q480l2745k2334J821n95K9820K9515l6527q31j267k568j772J37
$$ 12234 6070 -2410 -35155 -57489 -55668 -56263 -26443 3072 -33455 -34286 -35553 -38121 -39893 -39756
22953c9756J4268L995k7287J018O318j1857J150J2858M1491k3461P456K2459R143
$$ -39756 -25488 -21493 -48780 -47762 -41444 -53301 -52151 -39293 2198 -21263 -13807 8652 17795
22940A7795O423j9799J9879j1596k0815k2422R116L8819M5768m3439n2170L5483
$$ 17795 24218 4419 24298 12702 -8113 -30535 -21419 17400 63168 19729 -32441 3042
22928C042L2562o020k4339p700m201j7082J1793P357L9607L4662j027o674j8741
$$ 3042 35604 29584 5245 -2455 -6656 -23738 -11945 -4588 35019 69681 68654 61980 43239
22915D3239k0757r751J0989j3537k445l0621j6620K718m800l076Q451k926J3438
$$ 43239 22482 12731 23720 10183 7738 -22883 -39503 -36785 -41585 -44661 -36210 -39136 -25698
22902b5698N695J272L9116p093J7774K7661n0805J0051m116q648k5051j773P810
$$ -25698 -20003 -18731 20385 13292 31066 58727 7922 17973 13857 5209 -19842 -21615 -13805
22889a3805j1134R110P472J8716R12p9L8973J0240l8150j5890j8759j8844k7206
$$ -13805 -24939 -15829 -8357 10359 11271 11192 50165 60405 22255 6365 -12394 -31238 -58444
22876e8444K3050L0033o12k2588P522j7857K579K5911J1299j1437n320l6045J6496
$$ -58444 -35394 -5361 -5973 -28561 -21039 -38896 -36317 -10406 893 -10544 -15864 -51909 -35413
22863c5413K8826k5049j3415J5133J9050M6673J6327j4259j0875k0258k6053k6489
$$ -35413 -6587 -31636 -45051 -29918 -10868 35805 52132 37873 26998 6740 -19313 -45802
22851d5802k4098J8502K815N471r333k0530k2870p859J3617M3840O1746o358R712
$$ -45802 -69900 -51398 -48583 -43112 -52445 -72975 -95845 -103704 -90087 -46247 15499 9141 18853
22838A8853r654N181l2216j2585L399M9396M342k1444j7279J8133O372J5382K8087
$$ 18853 9199 14380 -17836 -30421 -27022 22374 26716 5272 -12007 6126 12498 27880 55967
22825E5967k931o5514J3612M2839L2602n033o9550m0415K5985l7118j105J8632
$$ 55967 53036 -12478 1134 43973 76575 71542 1992 -38423 -12438 -49556 -50661 -32029
22813c2029K1412j186j8513n945l3733j8532j706M1847L6415p884j6712J4217
$$ -32029 -10617 -11803 -30316 -36261 -69994 -88526 -90232 -48385 -11970 -19854 -36566 -22349
22801b2349k717J5134q44L0816J9459l3914k8163l0634N195L7998L2603Q718j8803
$$ -22349 -25066 -9932 -10776 20040 39499 5585 -22578 -53212 -48017 -10019 22584 31302 12499
22788A2499j9051n1185m2502j0175J0001M6158J4513J7217J5095l184j3750J2440
$$ 12499 -6552 -57737 -100239 -110414 -100413 -54255 -39742 -22525 -7430 -10614 -24364 -11924
22776a1924K2104Q629q483n297j1207j8010n369j6114P501m8640l1508M4212K0320
$$ -11924 10180 18809 10326 5029 -6178 -24188 -29557 -45671 -38170 -86810 -118318 -74106 -53786
22763e3786K0940J5119J2541j8033k0827p701J0779J4568Q631J823l5232j8719
$$ -53786 -32846 -17727 -5186 -23219 -44046 -51747 -40968 -26400 -17769 -15946 -51178 -69897
22751f9897R787r017K9010L0914j4073K9899R399n6948l2134q44L7444p067J2718
$$ -69897 -60110 -69127 -40117 -9203 -23276 6623 16022 -40926 -73060 -73904 -36460 -43527 -30809
22738c0809l930J8017J3208j7913J9528L716k0554k5513M0130K155J7778k6366
$$ -30809 -34739 -16722 -3514 -21427 -1899 1817 -18737 -44250 -4120 -1965 15813 -10553
22726a0553k7244m616N842r059K1848L3614l7795k3376R764J652j7412r066J7273
$$ -10553 -37797 -42413 -36571 -45630 -23782 9832 -27963 -51339 -41575 -39923 -57335 -66401 -49128
22713d9128k318M915P095l6277j3066J2431M3673J9750j1566J2312J3595l8922
$$ -49128 -51446 -46531 -39436 -75713 -88779 -76348 -32675 -12925 -24491 -12179 1416 -37506
22701c7506k2379J2391j5735p43M5525R584j6135J0925j9102n328l3474l3610
$$ -37506 -59885 -47494 -63229 -63972 -18447 -8863 -24998 -14073 -33175 -38503 -71977 -105587
22689a05587M1279K8189K0610P24j5465K3165K5380J8676K4086j2421P257j7675
$$ -105587 -64308 -36119 -15509 -14785 -30250 -7085 18295 36971 61057 48636 55893 38218
22677C8218l9335k3264l0249P911J2150J3800M6858J1877K4984l4453K425L730
$$ 38218 -1117 -24381 -54630 -46719 -34569 -20769 26089 37966 62950 28497 30922 34652
22665C4652l3114p666j188J699j8706l203L5098M8180L092k2152l0471l3974q902
$$ 34652 1538 -6128 -7316 -5617 -24323 -27526 7572 55752 58844 36692 6221 -27753 -36655
22652c6655K4067K3104M5322J2655j9515j6033J0873l9139j0225p830L6239m013
$$ -36655 -12588 10516 55838 68493 48978 32945 43818 4679 -5546 -13376 22863 18850
22640A8850k9562k5110J3594K4286n221j2708j0804J0269M5726J7243m8873p547
$$ 18850 -10712 -35822 -22228 2058 -3163 -15871 -26675 -16406 29320 46563 -2310 -9857
22628i857K1338J2139l0186j331K6288j8115j4840K3333J8380L601j9650l5672
$$ -9857 11481 23620 -6566 -7897 18391 276 -14564 8769 27149 30750 11100 -24572
22616b4572k7575j6067K449K4233L3014q406k3865j2605L0171j1124k5550J2290
$$ -24572 -52147 -68214 -65765 -41532 -8518 -16924 -40789 -53394 -23223 -34347 -59897 -47607
22604d7607M4m803p22M0869K03k7352j4560L5264K1483M3369J3483r472l3189
$$ -47607 -47563 -52366 -53088 -12219 -12016 -39368 -53928 -18664 2819 46188 59671 50199 17010
22591A7010m2821k2775j7992K6362N5458O801o494K884n0639p925M514m0723l480
$$ 17010 -25811 -48586 -66578 -40216 15242 22043 15549 18433 -32206 -40131 -35617 -76340 -79820
22578g9820J2969J2936R597O498O742O023K3560J2092K0686k5576J4444m3833
$$ -79820 -66851 -53915 -44318 -37820 -31078 -25055 -1495 10597 31283 5707 20151 -23682
22566b3682n152J9779j4841k5704J1243K0859j0908J1420J3347k28J8011q501
$$ -23682 -28834 -9055 -23896 -49600 -38357 -17498 -28406 -16986 -3639 -3867 14144 5643
22554E643j3387j1323J8210q885n049J9915J7722j8882k9073m776K1370P811m0349
$$ 5643 -7744 -19067 -857 -9742 -14791 5124 22846 3964 -25109 -29885 -8515 -704 -41053
22541d1053J9191j4277j3743R091k4142n01K0671J3777j8782p298J91Q671J0495
$$ -41053 -21862 -36139 -49882 -40791 -64933 -65434 -44763 -30986 -49768 -57066 -56875 -48204 -37709
22528c7709J2730L5031K4226l1739j8546N771j0848L4308m733j9347q325l0120
$$ -37709 -24979 10052 34278 2539 -16007 -10236 -21084 13224 8491 -10856 -19181 -49301
22516d9301L926J1612J4328J2626p366P706L1377J5707j1747k3104j0555k7065
$$ -49301 -45375 -33763 -19435 -6809 -14175 -6469 24908 40615 28868 5764 -4791 -31856
22504c1856m5950K6600J7927M176K2173J7365Q970o001m2097J521j6522J885K9010
$$ -31856 -77806 -51206 -33279 -29103 -6930 10435 19405 13404 -28693 -27172 -43694 -41809 -12799
22491a2799K7861J3201J1018N527j434m0910K2518j3387l9858K2152L3513k7924
$$ -12799 15062 28263 39281 44808 43374 2464 24982 11595 -28263 -6111 27402 -522
22479e22l565K8579L165p126l9802K2459N897l7053j3705k0457K7169M0889J7651
$$ -522 -4087 24492 27657 20531 -19271 3188 9085 -27968 -41673 -62130 -34961 5928 23579
22466B3579p179j2999m2009J4989L751j7826p699J8739K321K8687j0939j6332
$$ 23579 16400 3401 -38608 -23619 -19868 -37694 -45393 -26654 -24333 4354 -6585 -22917
22454b2917j0258k209L314N7048K3003m7458j6856K53P821R215j5762l1974k574
$$ -22917 -33175 -35384 -32070 24978 47981 523 -16333 -16080 -8259 956 -14806 -46780 -49354
22441d9354N1819K4216q335k5532K5442k755m7828k215Q898M6758L2927N8469
$$ -49354 2465 26681 18346 -7186 18256 15501 -32327 -34542 -25644 21114 54041 112510
22429A12510m1504m5496k7936l7352k597J2830L4722p834J636K3763j1279j2148
$$ 112510 71006 25510 -2426 -39778 -42375 -29545 5177 -2657 -1021 22742 11463 -685
22417f85K4826k2092Q72j2368l8682l0380K0080O819j0053J0732K6949K6162o312
$$ -685 24141 2049 2921 -9447 -48129 -78509 -58429 -51610 -61663 -50931 -23982 2180 -4132
22404d132k2449j50L0980J6215m621k9922k3227j276l5842J212J7563k2545k8792
$$ -4132 -26581 -26731 4249 20464 15843 -14079 -37306 -38582 -74424 -73212 -55649 -78194 -106986
22391a06986K6003K0864K8708K4055L2066k8869J7834j7709j8754K3189N1935
$$ -106986 -80983 -60119 -31411 -7356 24710 -4159 13675 -4034 -22788 401 52336
22380E2336M891j3982l3316n286o930j280M3894j5105l4888j586N065L692M706
$$ 52336 57227 43245 9929 4643 -2287 -3567 40327 25222 -9666 -11252 -6187 -2495 2211
22367B211J5666L8828l1180n2439O746K4384L8127j6935M680k6006o836J4809
$$ 2211 17877 56705 25525 -26914 -20168 4216 42343 25408 30088 4082 -2754 12055
22355A2055M2559Q570J923J3051j6402j8239J5570k4714J1404k4356J0485O000
$$ 12055 54614 63184 65107 78158 61756 43517 59087 34373 45777 21421 31906 37906
22343C7906m9102p584K1846M671l0898M785L1447j5635l5911n722J5093J0146
$$ 37906 -11196 -18780 3066 7737 -23161 -18376 13071 -2564 -38475 -44197 -29104 -18958
22331a8958J6631J8961j7281J2500k443k2878J7276M6362n1806n2454L239L2485
$$ -18958 -2327 16634 -647 11853 9410 -13468 3808 50170 -1636 -54090 -50851 -18366
22319a8366k6257l5091L735j0963O642J5565J4405m902K1993O160K362J9811j1694
$$ -18366 -44623 -79714 -75979 -86942 -80300 -64735 -50330 -55232 -33239 -27079 -24717 -4906 -16600
22306a6600n274M256J2395N5949L6453J0438m2143l8581j3589j4551K57k0727
$$ -16600 -21874 -17618 -5223 50726 87179 97617 55474 16893 3304 -11247 -10990 -31717
22294c1717p637K7099L243J5938Q89J456R551j5687o421j0819j5857K2110k3390
$$ -31717 -39354 -12255 -9012 6926 7815 9271 18822 3135 -3286 -14105 -29962 -7852 -31242
22281c1242j3049J1700l6492K1438P28K1151M3823K2287l3233k3974l3193L7572
$$ -31242 -44291 -32591 -69083 -47645 -46917 -25766 18057 40344 7111 -16863 -50056 -12484
22269a2484O4329k8749J8327o320j2348l4830k3446j6796L795K0905j4252l3140
$$ -12484 51845 23096 41423 35103 22755 -12075 -35521 -52317 -48522 -27617 -41869 -75009
22257g5009p717j0010L0492K5788Q747j2704J1805k1880p342p260J1865J7060
$$ -75009 -82726 -92736 -62244 -36456 -27709 -40413 -28608 -50488 -57830 -65090 -53225 -36165
22245c6165j0122o372j5163M393L1922p057N615j5055j0799K7443L7633K07J4970
$$ -36165 -46287 -52659 -67822 -63429 -31507 -38564 -32949 -48004 -58803 -31360 6273 6480 21450
22232B1450l0908j6858R435K3413L459j1013K0500P734M118l5591q980K0395j5183
$$ 21450 -9458 -26316 -16881 6532 9991 -1022 19478 27212 31330 -4261 -13241 7154 -8029
22219h029K6208P6944k9985p2901m5241n632L4055K615J7134n705j7690j9873
$$ -8029 18179 95123 65138 -7763 -53004 -58636 -24581 -21966 -4832 -10537 -28227 -48100
22207d8100K1982L279Q614K467K2304r563j0180J5293j240k5217j1464J1257L4342
$$ -48100 -26118 -22839 -14225 -11758 10546 983 -9197 6096 4856 -20361 -31825 -20568 13774
22194A3774J3728R725j1882l7264k0729k3923k7276R284M2678L0329J7581m4083
$$ 13774 27502 37227 25345 -11919 -32648 -56571 -83847 -74563 -31885 -1556 16025 -28058
22182b8058j8650J7564P846J4645N704P702n392J1444m124J1995j6876j7205r033
$$ -28058 -46708 -29144 -21298 -6653 -949 6753 1361 12805 8681 20676 3800 -13405 -22438
22169b2438o864l8877m487K4475j2753n1163J1282J6533L3206J5224K9665j9910
$$ -22438 -29302 -68179 -72666 -48191 -60944 -112107 -100825 -84292 -51086 -35862 -6197 -26107
22157b6107K4345P822K279j888l8191j2144K8462J2750L236M387k3609j7234o810
$$ -26107 -1762 6060 8339 6451 -31740 -43884 -15422 -2672 564 4951 -18658 -35892 -42702
22144d2702j9524Q385L1723r345j0850J032j4066j1989N1387L1903l3850K7112
$$ -42702 -62226 -53841 -22118 -31463 -42313 -41281 -55347 -67336 -15949 15954 -17896 9216
22132I216K4989J5089N559l1194J1538j9048o5646Q145J7401k912P730L0545J4839
$$ 9216 34205 49294 54853 23659 35197 16149 -49497 -41352 -23951 -26863 -19133 11412 26251
22119B6251M163M47k4922j3717j8938l304r020o265K0335K2487L2231K5978p172
$$ 26251 30414 30861 5939 -7778 -26716 -30020 -39040 -45305 -24970 -2483 29748 55726 48554
22106D8554k4282J9955r577P374m9163l5735J0645K4929M894K0333j2722j6267
$$ 48554 24272 44227 34650 42024 -7139 -42874 -32229 -7300 -2406 17927 5205 -11062
22094a1062k0672l3581j1333n223J6048K3699J5203K3856J2018j4520J83M411
$$ -11062 -31734 -65315 -76648 -81871 -65823 -42124 -26921 -3065 8953 -5567 -5384 -973
22082i73J0646N220k7075k7832j1463L4423K0093R688L1903k1303m5614j4975
$$ -973 9673 14893 -12182 -40014 -51477 -17054 3039 12727 44630 23327 -22287 -37262
22070c7262M3805K3341L107J6798m515j1397j1080j1011R655J3456l2371j4210
$$ -37262 6543 29884 32991 49789 45274 33877 22797 11786 21441 34897 2526 -11684
22058a1684K1882M4406n2254k7114K5700j8964K527K8868n417l5856m5731N481
$$ -11684 10198 54604 2350 -24764 936 -18028 -15501 13367 7950 -27906 -73637 -68156
22046f8156L6552J358j3997n902J6399K4047O1926Q298m716o588k258j3382r356
$$ -68156 -31604 -30246 -44243 -50145 -33746 -9699 52227 60525 55809 49221 46963 33581 24225
22033B4225J7023p095n518k8869n23j981O119k028K3022k5302M53k951k0286r599
$$ 24225 41248 34153 28635 -234 -757 -2738 3381 1353 24375 -927 -474 -3425 -23711 -33310
22019c3310p71J3692J8107L2714J5336n4299l9455j5425k4531J5048L4825N1880
$$ -33310 -34081 -20389 -2282 30432 45768 -8531 -47986 -63411 -87942 -72894 -38069 13811
22007A3811K3928j6944k5787j0992j5278o25P230P052M7450m1403k2123q008k6952
$$ 13811 37739 20795 -4992 -15984 -31262 -31887 -24657 -17605 29845 -11558 -33681 -41689 -68641
21994f8641J9231L4192o46K381Q989l808J0383M1486M419l4976n72k2007m5261
$$ -68641 -49410 -15218 -15864 -13483 -4494 -8302 2081 43567 47986 13010 12438 -9569 -54830
21981e4830l296O6782J7968l072J7114O713J1297j0597j16k5770j1892m2035k5296
$$ -54830 -58126 8656 26624 23552 40666 47379 58676 48079 47963 22193 10301 -31734 -57030
21968e7030r075R422j7832J0748K3917K9488Q512N952r887m1090J4816L9747J0941
$$ -57030 -66105 -56683 -74515 -63767 -39850 -10362 -1850 4102 -5785 -46875 -32059 7688 18629
21955A8629p049j5998k6162N160L3215j1478J7083J9530j896o502k3658j7070
$$ 18629 11580 -4418 -30580 -25420 7795 -3683 13400 32930 31034 24532 874 -16196
21943a6196O687K9994k342J2157q169P136l814N384M486l4058j9080k2358N026
$$ -16196 -9509 20485 18143 30300 22131 29267 25453 30837 35323 1265 -17815 -40173 -35147
21930c5147P009L9414P540q271k59j7841k3568l8145o441j0089J3704K1783J5044
$$ -35147 -28138 11276 18816 10545 10286 -7555 -31123 -69268 -75709 -85798 -72094 -50311 -35267
21917c5267l1728O713L2684j0877J9476M7358l0948j5624O783l9340j3405o126
$$ -35267 -66995 -60282 -27598 -38475 -18999 28359 -2589 -18213 -11430 -50770 -64175 -70301
21905g0301N768L2895K377J6222J763K1028Q360m101k4572J0619k8193R099K6690
$$ -70301 -64533 -31638 -29261 -13039 -11276 9752 18112 14011 -10561 58 -28135 -19036 7654
21892G654N594O575j7740J7594k2374j6853M399R22J9672L2198l787n9170j7629
$$ 7654 13248 19823 2083 19677 -2697 -19550 -15151 -14229 5443 37641 33854 -25316 -42945
21879d2945j0002M15J5446K3650j7170j5801J1017J0627m0056P77L537l435K0724
$$ -42945 -52947 -52532 -37086 -13436 -30606 -46407 -35390 -24763 -64819 -64042 -60505 -63940 -43216
21866d3216K4131L7895N1883j2675n6777j7802j9975J4384l8511n7356J5487K8753
$$ -43216 -19085 18810 70693 58018 1241 -16561 -36536 -22152 -60663 -118019 -102532 -73779
21854g3779J1040M4147J8823J3195K89J6891l8529M356L1225k7437l6045K7131
$$ -73779 -62739 -18592 231 13426 13715 30606 -7923 -3567 27658 221 -35824 -8693
21842h693K2055K6799J8597k9881m2682k086r84j8551k155J7563k3633l255M2028
$$ -8693 13362 40161 58758 28877 -13805 -15891 -16875 -35426 -37581 -20018 -43651 -46906 -4878
21829d878K0203J788k3845K4847J6432k1278j9705k2887n220O257J6817j8402
$$ -4878 15325 17113 -6732 18115 34547 13269 -6436 -29323 -34543 -28286 -11469 -29871
21817b9871O352k447J2236m584k8368k9729K1631K7971K4214J376J6818j7592
$$ -29871 -23519 -25966 -13730 -18314 -46682 -76411 -54780 -26809 -2595 -1219 15599 -1993
21805a993k6099j991L5458k0259N451k460J8288N722Q866J8150l820l3467j6528
$$ -1993 -28092 -30083 5375 -14884 -9433 -11893 6395 12117 20983 39133 35313 1846 -14682
21792a4682J3432P092k2037m3018j3225J2330M9697L3750k4658Q694R581L590
$$ -14682 -1250 5842 -16195 -59213 -72438 -60108 -10411 23339 -1319 7375 16956 20546
21780B0546r834k9631Q288j8345j3874L6566J3022k0598k1275n9782O3580M4876
$$ 20546 10712 -18919 -10631 -28976 -42850 -6284 6738 -13860 -35135 -94917 -31337 13539
21768A3539n1849k8652r195j2364L9821J5890j2293M136J8426J0174J9997K2004
$$ 13539 -38310 -66962 -76157 -88521 -48700 -32810 -45103 -40967 -22541 -12367 7630 29634
21756B9634p943J3658j9130L0863P657j0898l0028l2763j753O469j9932j0579
$$ 29634 21691 35349 16219 47082 54739 43841 13813 -18950 -20703 -14234 -34166 -44745
21744d4745j1669K133K2607N8542K6826J4723j4406k5575j5189l8710n967J6299
$$ -44745 -56414 -54281 -31674 26868 53694 68417 54011 28436 13247 -25463 -31430 -15131
21732a5131k6918o601K1895K5641n295K5524K1224J9830k982j6333j1763J0328
$$ -15131 -42049 -48650 -26755 -1114 -6409 19115 40339 60169 57187 40854 29091 39419
21720C9419K0500k4727l1755r65J4871O229J625k4003k0324k7900K4158J9861
$$ 39419 59919 35192 3437 2472 17343 23572 25197 1194 -19130 -47030 -22872 -3011
21708c011K0921j0290m349L20j2416j9542k0055k2358L6648K9242L4909N2898
$$ -3011 17910 7620 3271 3591 -8825 -28367 -48422 -70780 -34132 -4890 30019 82917
21696H2917M966m0890k7894k0523m6787J3562K1994J6839Q778J953M446L1115
$$ 82917 87883 46993 19099 -1424 -48211 -34649 -12655 4184 12962 14915 19361 50476
21684E0476J3720k0886n7048j8295P394J1823J9621n704m636N581J9445n323m486
$$ 50476 64196 43310 -13738 -32033 -24639 -12816 6805 1101 -3535 2046 21491 16168 11682
21671A1682j3903R549q073m744J7012j3180j1038k8778N368K9345j0113l644p973
$$ 11682 -2221 7328 -745 -5489 11523 -1657 -12695 -41473 -36105 -6760 -16873 -20517 -28490
21658b8490j6432J901l091L1573J9355j0845M526p735r215j7677k1972k3570M7407
$$ -28490 -44922 -43021 -46112 -14539 4816 -6029 -1503 -9238 -18453 -36130 -58102 -81672 -34265
21645c4265L2383m2718j2179K2774J3655j5581K5046K5230j5368K352q204j4803
$$ -34265 -1882 -44600 -56779 -34005 -20350 -35931 -10885 14345 -1023 1329 -6875 -21678
21633b1678N180J4690K8633n0213P202K0247j6675l2219R563j6239l1055k805
$$ -21678 -16498 -1808 26825 -23388 -16186 4061 -12614 -44833 -35270 -51509 -82564 -85369
21621h5369J3054J1501K8452J9649K1162j6256l5647J8916J9581J9714j4970J106
$$ -85369 -72315 -60814 -32362 -12713 8449 -7807 -43454 -24538 -4957 14757 -213 893
21609H93j8036Q029K4976L003k4515j6843J0912M9377Q642l9186J6510O898j4150
$$ 893 -17143 -9114 15862 18865 -5650 -22493 -11581 37796 46438 7252 23762 30660 16510
21596A6510m0075k626j0713p63o288r169J2487K0193j0429j1651M54M1761R452
$$ 16510 -23565 -26191 -36904 -37667 -43955 -53124 -40637 -20444 -30873 -42524 -42070 -309 9143
21583I143j4154r193l3572j3546l898p253k437l010j0241o220J9764N4046L6289
$$ 9143 -5011 -14204 -47776 -61322 -65220 -72473 -74910 -77920 -88161 -94381 -74617 -20571 15718
21570A5718m225l6014J6274L4585N574l704j2831j4791j6874k2768k5274M2434
$$ 15718 11493 -24521 -8247 26338 31912 28208 15377 586 -16288 -39056 -64330 -21896
21558b1896K6859o722j672O08N320j9031k1142j9160R466J4877j1722j4778K6697
$$ -21896 4963 -1759 -3431 -2823 2497 -16534 -37676 -56836 -47370 -32493 -44215 -58993 -32296
21545c2296j6979J7903K6794q842p557j127q405k2535J6408r682q295N942J9916
$$ -32296 -49275 -31372 -4578 -13420 -20977 -22104 -30509 -53044 -36636 -46318 -54613 -48671 -28755
21532b8755N3976K2539q817k6775j3562l0427j0458R936M0094j2357l2824M3357
$$ -28755 25221 47760 38943 12168 -1394 -31821 -42279 -32343 7751 -4606 -37430 5927
21520E927J6913k5535j1290L6582M1878J9278k2811k6009Q604l3177k0865J8088
$$ 5927 22840 -2695 -13985 22597 64475 83753 60942 34933 43537 10360 -10505 7583
21508G583j5535l0913J9960M2954j0687n3964j3589L8745L6945R642l3605J9350
$$ 7583 -7952 -38865 -18905 24049 13362 -40602 -54191 -15446 21499 31141 -2464 16886
21496A6886j8220l0935L633K8868j394j7762Q497J0123J4991J873r065n465K4617
$$ 16886 -1334 -32269 -28636 232 -1162 -18924 -10427 -304 14687 16560 7495 2030 26647
21483B6647o466Q280j5248J2332K3768J6344l1050l971l913j8053p119N131N279
$$ 26647 20181 28461 13213 25545 49313 65657 34607 30636 26723 8670 1551 6682 11961
21470A1961M7496k5084k5269j9614m308K1552k5713K8907j2244j6215J3695J4628
$$ 11961 59457 34373 9104 -10510 -14818 6734 -18979 9928 -2316 -18531 -4836 9792
21458I792m5051j8713K3786j9076K6728J0606j116K1289J4275j9781L0661O0573
$$ 9792 -35259 -53972 -30186 -49262 -22534 -11928 -13044 8245 22520 2739 33400 93973
21446I3973O196m2634j8383k4216j8484k5641k4473J81L8530M2038k52m000j3934
$$ 93973 100169 57535 39152 14936 -3548 -29189 -53662 -53481 -14951 27087 26835 22835 8901
21433H901R68k2300m1072M452L5002Q516k299k1395k1355k4824K8998K5363k8842
$$ 8901 9869 -12431 -53503 -49051 -14049 -5533 -7832 -29227 -50582 -75406 -46408 -21045 -49887
21420d9887o678J0669J8793k970j250N857P168n147J0128j6029o065n657Q88K0224
$$ -49887 -56565 -45896 -27103 -30073 -31323 -25466 -18298 -23445 -13317 -29346 -35411 -41068 -40180 -19956
21406a9956K9781O558n1819l5163j8596j4621K9338L7382J8043q179J1005J9637
$$ -19956 9825 16383 -35436 -70599 -89195 -103816 -74478 -37096 -19053 -27232 -16227 3410
21394C410K3262j6629n9919p872Q279L009N066K7106K9840L1863K50j3921k3478
$$ 3410 26672 10043 -49876 -57748 -49469 -46460 -41394 -14288 15552 47415 47665 33744 10266
21381A0266k6505j0457J7138K441j6224J5724j5771o485j8598o565J8469M9923
$$ 10266 -16239 -26696 -9558 -7117 -23341 -7617 -23388 -29873 -48471 -55036 -36567 13356
21369A3356M1008j3688j5116l5327J925O762J8270l571j7872j4090M0L2230j2542
$$ 13356 54364 40676 25560 -9767 -7842 -1080 17190 13619 -4253 -18343 -18303 13927 1385
21356A385k8803J6991p622J503Q978J1616m077k9481j9848M1179K5860k5711j0679
$$ 1385 -27418 -10427 -18049 -16546 -7568 4048 -29 -29510 -49358 -8179 17681 -8030 -18709
21343a8709k34J0771N369k0345p292K6659K9099j7351J633k593k2078J2993J2471
$$ -18709 -18943 -8172 -2803 -23148 -30440 -3781 25318 7967 9600 7007 -15071 -2078 10393
21330A0393j0598L1915n184j4575M45j9161j9093L161J2242L7890k275l4578j4987
$$ 10393 -205 31710 26526 11951 12396 -6765 -25858 -22697 -10455 27435 25160 -9418 -24405
21317b4405Q406j1074M044l8270j136J0982O31j3977L7662K9349l404m466k562
$$ -24405 -15999 -27073 -23029 -61299 -62435 -51453 -50822 -64799 -27137 2212 -1192 -5658 -8220
21304h220K6538k714k1471p785j8265k9487K0173L567j8982r233k478Q0203L7562
$$ -8220 18318 15604 -5867 -13652 -31917 -61404 -41231 -37664 -56646 -65879 -68357 11846 49408
21291D9408k1077n538m8888j9259R413j8263K4101K0880o384m9432q840L4944
$$ 49408 28331 22793 -26095 -45354 -35941 -54204 -30103 -9223 -15607 -65039 -73879 -38935
21279c8935L6713L3193n953j5259l0943j3010q844K2880J2740J0142k4548l127
$$ -38935 -2222 30971 25018 9759 -21184 -34194 -43038 -20158 -7418 2724 -21824 -24951
21267b4951j6964P819K7649M8184o315l899R558j067o197n340l4047k0378k535
$$ -24951 -41915 -34096 -6447 41737 35422 31523 41081 40014 33817 28477 -5570 -25948 -28483
21254b8483L5269O3790J272j2789q849l4653j4267P313K8233Q707m8876l4896
$$ -28483 6786 70576 71848 59059 50210 15557 1290 8603 36836 45543 -3333 -38229
21242c8229k5172p430K6268J1244j7849K3590L5416j5482l0236m3528j3353L5945
$$ -38229 -63401 -70831 -44563 -33319 -51168 -27578 7838 -7644 -37880 -81408 -94761 -58816
21230e8816L8657o771J0852n707j3202K8645k4619r395K2144J5442J950j7877
$$ -58816 -20159 -26930 -16078 -21785 -34987 -6342 -30961 -40356 -18212 -2770 -820 -18697
21218a8697q778o789J3516j8023k3166J1830K3559M2351o074r718L809k8614l5629
$$ -18697 -27475 -34264 -20748 -38771 -61937 -50107 -26548 15803 9729 11 3820 -24794 -60423
21205f0423o998K9489K6001K1193j6670K1376k646j6278K5900O449m8891k2501
$$ -60423 -67421 -37932 -11931 9262 -7408 13968 11322 -4956 20944 27393 -21498 -43999
21193d3999k1911m278K0325K0380L1491j6204R136K6737M0978L680n715j3050
$$ -43999 -65910 -70188 -49863 -29483 2008 -14196 -5060 21677 62655 66335 60620 47570
21181D7570k131j9139k4814J4543J267n339k4727J0212K293l9230p414K8552j1375
$$ 47570 45439 26300 1486 16029 17296 11957 -12770 -2558 -265 -39495 -46909 -18357 -29732
21168b9732J1293J1216l6165P018k589j4054K0738K8405P390K945j9012m4494
$$ -29732 -18439 -7223 -43388 -36370 -38959 -53013 -32275 -3870 3520 6465 -12547 -57041
21156e7041p044n342P448M0331L1419K5963j5747o6330j8199N640L6948N0272
$$ -57041 -64085 -69427 -61979 -21648 9771 35734 19987 -46343 -64542 -58902 -21954 28318
21144B8318M8525q23k3996j2355j4804p713k3610p410l71J5555J5111p555O258
$$ 28318 76843 76020 52024 39669 24865 17152 -6458 -13868 -14239 1316 16427 8872 15130
21131A5130j2566J5237j9987l9685k3529L9227L4468n768j5614j3335M563M0247
$$ 15130 2564 17801 -2186 -41871 -65400 -26173 8295 2527 -13087 -26422 -21859 18388
21119A8388l0899m8687L0941K066O589k0855k458r9J4033K2622j3792m896K0931
$$ 18388 -12511 -61198 -30257 -28191 -21602 -42457 -44915 -45014 -30981 -8359 -22151 -27047 -6116
21106f116O132J2141J0521J8653K339o5727o577L9169L3301l8837k9523K8657
$$ -6116 16 12157 22678 41331 43670 -22057 -28634 10535 43836 4999 -24524 4133
21094D133K6558K5545j9957m4955J986j9974p626q742J8493J0964k3430j1637
$$ 4133 30691 56236 36279 -8676 -6690 -26664 -34290 -43032 -24539 -13575 -37005 -48642
21082d8642q933L3223m3502N7741K1219P100k5031m5816J256K5691K5595j0730
$$ -48642 -57575 -24352 -67854 -10113 11106 18206 -6825 -52641 -51385 -25694 -99 -10829
21070a0829K6571M796j9664j3276j07J4398J2593j5897k8368l3040J2865K9701
$$ -10829 15742 20538 874 -12402 -12509 1889 14482 -1415 -29783 -62823 -49958 -20257
21058b0257j0718j318j0976J2175l246j4927l126J2245J045N4130K4100J4277
$$ -20257 -30975 -32293 -43269 -31094 -34340 -49267 -52393 -40148 -39103 15027 39127 53404
21046E3404n2056m3804K2833J3995J7451J0251k5793k0684q673j391k1882p699
$$ 53404 1348 -42456 -19623 -5628 11823 22074 -3719 -24403 -33076 -34467 -56349 -64048
21034f4048K7939N698M4242M0741K795k2905k8153m717K7055j225l385o362j1939
$$ -64048 -36109 -30411 13831 54572 57367 34462 6309 1592 28647 27422 24037 17675 5736
21021E736l0704K795J2691N65j803k3426N895l8186N933K3275J6192P146L852
$$ 5736 -24968 -22173 -9482 -8917 -10720 -34146 -28251 -66437 -60504 -37229 -21037 -13891 -10039
21008a0039N0684L5221k7273m2751j7842Q326k9075k8624L3093L5065P181k4294
$$ -10039 40645 75866 48593 5842 -12000 -3674 -32749 -61373 -28280 6785 13966 -10328
20996a0328Q120J0458j795m638N2375k243k3570j3972O401K2541k5666j1515k3443
$$ -10328 -2208 8250 6455 1817 54192 51949 28379 14407 20808 43349 17683 6168 -17275
20983a7275J9591J680J580L848M252m030J2882n300l5471j0274k0348K300L3954
$$ -17275 2316 3996 5576 9424 13676 9646 22528 17228 -18243 -28517 -48865 -46565 -12611
20970a2611K1908j457j9441k5740N281O219L3192j302j2342m6620Q837O4359N3584
$$ -12611 9297 7840 -11601 -37341 -32060 -25841 7351 6049 -6293 -52913 -44076 20283 73867
20957G3867L930n8611n5788J3200J4175M692K764K8621j2919k5056N596M3055
$$ 73867 77797 19186 -36602 -23402 -9227 -4535 -1771 26850 13931 -11125 -5529 37526
20945C7526k142m3476m0896k101J9187O00L5926M7756K0305m8652o5088k6342
$$ 37526 35384 -8092 -48988 -51089 -31902 -31302 4624 52380 72685 24033 -41055 -67397
20933f7397k628K9793K2787m036l462L5004J9312n683K0671l5881j5768k4645
$$ -67397 -70025 -40232 -17445 -21481 -24943 10061 29373 23690 44361 8480 -7288 -31933
20921c1933r007K905j0049P631L5161L8408j7595k7292k4234P863J5169o134l11
$$ -31933 -40940 -38035 -48084 -40453 -5292 33116 15521 -11771 -36005 -28142 -12973 -19107 -19418
20908a9418m4567L724L4042J910j8536o477K326J6911N382J2282J4349m4653k6216
$$ -19418 -63985 -60261 -26219 -24309 -42845 -49322 -46996 -30085 -24703 -12421 1928 -42725 -68941
20895f8941L1387K6573P267j62k4166N325J2824K9369q427k9886k0161j3855J2000
$$ -68941 -37554 -10981 -3714 -3876 -28042 -22717 -9893 19476 11049 -18837 -38998 -52853 -40853
20882d0853j5271L3102J2081N7376L475j9716j4385j097L7803l5154o4935k09
$$ -40853 -56124 -23022 -10941 46435 49910 30194 15809 14712 52515 17361 -47574 -47783
20870d7783O6481J8133m5970l0645K387K5988J4461K0739J2306j5668j8487j3931
$$ -47783 18698 36831 -9139 -39784 -37397 -11409 3052 23791 36097 20429 1942 -11989
20858a1989l8864l886j0053M488M3283K8756k420K1763k2761K221M360j5527K0165
$$ -11989 -50853 -54739 -64792 -60304 -17021 11735 9315 31078 8317 10538 14898 -629 19536
20845A9536M1674K6430m930l7062n4245m8808j32K8195J4949j2173k4537k0709
$$ 19536 61210 87640 82710 45648 -8597 -57405 -57537 -29342 -14393 -26566 -51103 -71812
20833g1812N783J7569P58J4006K5465k9575K749k3595Q277J4635J6917M5587L1090
$$ -71812 -66029 -48460 -47702 -33696 -8231 -37806 -35057 -58652 -50375 -35740 -18823 26764 57854
20820E7854K184k6032m2944m5958J2854p622j5776j834j5434O344P0856L4436
$$ 57854 60038 34006 -8938 -54896 -42042 -49664 -65440 -67274 -82708 -76364 -5508 28928
20808B8928j8951P342j5655M949p293p295L3076P383K6906J6143k9516o182l276
$$ 28928 9977 17319 1664 6613 -680 -7975 25101 32484 59390 75533 46017 39835 36559
20795C6559K9910r115k2904p57n7168k7580P919K866j1838J0483J7215P156k8138
$$ 36559 66469 57354 34450 33693 -23475 -51055 -43136 -40270 -52108 -41625 -24410 -17254 -45392
20782d5392K8839P540k9125P989L3585R14k1763j0441j7084J6144L8348p57j2940
$$ -45392 -16553 -9013 -38138 -30149 3436 4350 -17413 -27854 -44938 -28794 9554 8797 -4143
20769d143J8338L814m181M2490q562m2383M782o23o551j4536m1906j20M5213j7015
$$ -4143 14195 18009 13828 56318 47756 5373 10155 9532 2981 -11555 -53461 -53581 -8368 -25383
20755b5383l8098K3924N572J5418K7469N0089k9241j5907l4399J8950K9245J5965
$$ -25383 -63481 -39557 -33985 -18567 8902 58991 29750 13843 -20556 -1606 27639 43604
20743D3604K972n449n4821m656K6420J0551j497P660J2373J2762k2348j0047j813
$$ 43604 46576 41127 -13694 -18350 8070 18621 17124 24784 37157 49919 27571 17524 15711
20730A5711k6564P338j9317l6333m554l757O331N331l188K3140N2225O042O847
$$ 15711 -10853 -3515 -22832 -59165 -63719 -67476 -61145 -55814 -59002 -35862 16363 22405 29252
20717B9252L7391K1584r799l1814m0680k182J2696j4735R645L3945j5574L4702
$$ 29252 66643 88227 78428 46614 5934 3752 16448 1713 11358 45303 29729 64431
20705F4431l062m4107l6137j960p834J3013J5650J2207q890J815J7761n803M403
$$ 64431 61369 17262 -18875 -20835 -28669 -15656 -6 12201 3311 5126 22887 17084 21487
20692B1487O546p138k6798J3540k4098m2493j5524j1897M533M452j3589M4736
$$ 21487 28033 20895 -5903 7637 -16461 -58954 -74478 -86375 -81842 -77390 -90979 -46243
20680d6243N2640J0658J8679K2485r092m0854J9510J1105n0217l1466K547J2874
$$ -46243 6397 17055 35734 58219 49127 8273 27783 38888 -11329 -42795 -40248 -27374
20668b7374L9313q526l9667j7192L9619L4320j0887k1934j0856p057j9585J2031
$$ -27374 11939 3413 -36254 -53446 -13827 20493 9606 -12328 -23184 -30241 -49826 -37795
20656c7795K2600l101L0313J2604m7254k1959j0255J4806j484J1966J9832j462
$$ -37795 -15195 -18296 12017 24621 -22633 -44592 -54847 -40041 -41525 -29559 -9727 -11189
20644a1189r816j8051q709L4300j3011M0297M0460j4328o9107j3345j862k3467
$$ -11189 -21005 -39056 -47765 -13465 -26476 13821 54281 39953 -29154 -42499 -44361 -67828
20632f7828j2794j7251l15r82k6553r32j879L4261L3310j3791K0472L1732k594
$$ -67828 -80622 -97873 -98188 -99170 -125723 -126655 -128534 -94273 -60963 -74754 -54282 -22550 -25144
20619b5144k812q498K3779J736M794k3452J7789L1857m904l542K3114l0815K445
$$ -25144 -27956 -36454 -12675 -10939 -6145 -29597 -11808 20049 15145 11603 34717 3902 6347
20606F347j4144J725K3724n0003l846M2549K0109j4917j8007L355K2090Q05P392
$$ 6347 -7797 -6072 17652 -32351 -36197 6352 26461 11544 -6463 -3108 18982 19787 27179
20593B7179N856m0053k7412r330m0958m246M2320M3901K3092k543k4273j3258
$$ 27179 33035 -7018 -34430 -43760 -84718 -88964 -46644 -2743 20349 17806 -6467 -19725
20581a9725o669j0367k564K1724J9446J7222j7560m9989k9689K0811N3378L5179
$$ -19725 -26394 -36761 -39325 -17601 1845 19067 1507 -48482 -78171 -57360 -3982 31197
20569C1197k410l5473k7943J6648L6067j1687p810K9159P640o348k5031m1891
$$ 31197 28787 -6686 -34629 -17981 18086 6399 -1411 27748 35388 29040 4009 -37882
20557c7882j3672M3562J3336l4973J4678q969J0603j5394k9574j006J3782o399
$$ -37882 -51554 -7992 5344 -29629 -14951 -23920 -13317 -28711 -58285 -59291 -45509 -51908
20545e1908k0696L8307L7531J7251j265j7287k7933K2000K0205J4266l2329l1815
$$ -51908 -72604 -34297 3234 20485 19220 1933 -26000 -4000 16205 30471 -1858 -33673
20533c3673R807Q556J3594J0919j8964k493J8150j1606n3792J3117K1837n06k2546
$$ -33673 -23866 -15310 -1716 9203 -9761 -12254 5896 -5710 -59502 -46385 -24548 -25054 -47600
20520d7600K2980L0025l960J48L0359j994l2350j340J531m6881R926J6514L3052
$$ -47600 -24620 5405 1445 1593 31952 29958 -2392 -3732 -2201 -49082 -39156 -22642 10410
20507A0410l9060j7305Q229J3357Q385l260L3148J3r401k8403j1254j955k6154
$$ 10410 -28650 -45955 -37726 -24369 -15984 -19244 13904 13917 4516 -23887 -35141 -37096 -63250
20494f3250L3866K3223j5993J9793K704o756J2497O947k5465l352n420K8502L5898
$$ -63250 -29384 -6161 -22154 -2361 343 -6413 6084 13031 -12434 -15786 -21206 7296 43194
20481D3194k4964k6199j514J8160O33l850o802K9214J5626j5399M350j2932r466
$$ 43194 18230 -7969 -9483 8677 9310 5460 -1342 27872 43498 28099 32449 19517 10051
20468A0051K1731R731m60j7137P431J2597k1800l0864j2742l0097p990K5556J6670
$$ 10051 31782 41513 41053 23916 31347 43944 22144 -8720 -21462 -51559 -59549 -33993 -17323
20455a7323L2961q752j4992j5811J6556L0484L347K0570j4276j4985m5212M014
$$ -17323 15638 6886 -8106 -23917 -7361 23123 26470 47040 32764 17779 -27433 -23419
20443b3419L0429m692l5258O609K7284K538o661J2836J5736m7284j4651m732j4186
$$ -23419 7010 2318 -32940 -26331 953 3491 -3170 9666 25402 -21882 -36533 -41265 -55451
20430e5451N352K3456J1229n547k869P102q695k6895j1712j2735M7170J4967Q182
$$ -55451 -50099 -26643 -15414 -20961 -23830 -16728 -25423 -52318 -64030 -76765 -29595 -14628 -6446
20417f446k1596J2206K3710M4410k1184m5307k6477j1451q672l727j42K7315l017
$$ -6446 -28042 -15836 7874 52284 31100 -14207 -40684 -52135 -60807 -64534 -64676 -37361 -40378
20404d0378l5293K1925K4007r899m1203k0227O0743M1307K1750l1981l2031j4817
$$ -40378 -75671 -53746 -29739 -39638 -80841 -101068 -40325 982 22732 -9249 -41280 -56097
20392e6097p335L4061M2010l0308L5359M0540l8190l0493j0168Q391l659K2648
$$ -56097 -63432 -29371 12639 -17669 17690 58230 20040 -10453 -20621 -12230 -15889 6759
20380F759J5122m0002J0860p495J1474n62J1231N539K503q423k6619j1710K1522
$$ 6759 21881 -18121 -7261 -14756 -3282 -3844 7387 12926 15429 7006 -19613 -31323 -9801
20367i801K0999j7924k9881k0975L2815L0433k4689J7829J6424K9R049j7721k0116
$$ -9801 11198 -6726 -36607 -57582 -24767 5666 -19023 -1194 15230 15259 24308 6587 -13529
20354a3529j1546K9210M6224j8148l1927m3562k8560K4936J9669l4041J4297n138
$$ -13529 -25075 4135 50359 32211 284 -43278 -71838 -46902 -27233 -61274 -46977 -52115
20342e2115L6742M8049q3326m0437J6787N1763M5673p539r961o736J8850l433
$$ -52115 -15373 32676 -50650 -91087 -74300 -22537 23136 15597 5636 -1100 17750 14317
20330A4317Q802j9323j3732J7018j5271j4528l706J1365m6843k734K214M2973
$$ 14317 23119 3796 -9936 7082 -8189 -22717 -26423 -15058 -61901 -64635 -62421 -19448
20318a9448L2324R17l3468j1802l6018p16J9185M8531k1776l1129J4026L5502
$$ -19448 12876 13793 -19675 -31477 -67495 -68211 -49026 -495 -22271 -53400 -39374 -3872
20306c872J9515R773J6602R164J292j0650j0715k5709j3990J1933J2702r642k0592
$$ -3872 15643 25416 42018 51182 52474 41824 31109 5400 -8590 3343 16045 6403 -14189
20293a4189K3755p126j7458J786J1807J8223J4140J5387O337j4019p59r645k9550
$$ -14189 9566 2440 -15018 -13232 -1425 16798 30938 46325 52662 38643 37884 28239 -1311
20280a311j7852n861J9321K4094N130k5926J2840M2177l0426o3900r124L7697
$$ -1311 -19163 -25024 -5703 18391 23521 -2405 10435 52612 22186 -41714 -50838 -13141
20268a3141L2950J7927j8589l8769k489J1574l648p791M9491M4810J902k4892
$$ -13141 19809 37736 19147 -19622 -22111 -10537 -14185 -21976 27515 72325 74227 49335
20256D9335k7114k3833k6676k3462k4791P037J6644K035K5131k4741L527M0392
$$ 49335 22221 -1612 -28288 -51750 -76541 -69504 -52860 -50825 -25694 -50435 -46908 -6516
20244f516M1536J674o335J6005K3101j3136k8713j637L6371J0702n3306p0720
$$ -6516 35020 36694 30359 46364 69465 56329 27616 25979 62350 73052 19746 -50974
20232e0974N181N2335J8899j0385J6801J2309k017j8831k1749k0947k4936J8596
$$ -50974 -45793 6542 25441 15056 31857 44166 42149 23318 1569 -19378 -44314 -25718
20220b5718J9483l718j4053j1773j8110K6164J7878O809J8259p305J0930j718
$$ -25718 -6235 -9953 -24006 -35779 -53889 -27725 -9847 -3038 15221 7916 18846 17128
20208A7128J0983m941k4278r845J7463J3715q63M1126J1128l1872m6905j4759
$$ 17128 28111 23170 -1108 -10953 6510 20225 19362 60488 71616 39744 -7161 -21920
20196b1920L879K4696P907k1250K1437j9632k8137l0093m954K6398L1498N6670
$$ -21920 -18041 6655 14562 -6688 14749 -4883 -33020 -63113 -68067 -41669 -10171 46499
20184D6499O371k1262O119n511l0541L7999M8511j8671j8231K4457n4298m3547
$$ 46499 52870 31608 37727 32216 1675 39674 88185 69514 51283 75740 21442 -22105
20172b2105K7690J6359j1837k137K4056l7818l9548j2024K7281K8557j144k8873
$$ -22105 5585 21944 10107 7970 32026 -5792 -45340 -57364 -30083 -1526 -2670 -31543
20160c1543L5812K3647o4216j9546M5651K3439j5732m5845P011K1789J521J0671
$$ -31543 4269 27916 -36300 -55846 -10195 13244 -2488 -48333 -41322 -19533 -18012 -7341
20148g341N174k7034J6415K0684J1470p467j4435K3198j2378m6784m051L0533
$$ -7341 -2167 -29201 -12786 7898 19368 11901 -2534 20664 8286 -38498 -42549 -12016
20136a2016K9522o91J7727J0744m8303l3654K3474J6356j8626J1049M7429m832
$$ -12016 17506 16815 34542 45286 -3017 -36671 -13197 3159 -15467 -4418 43011 38179
20124C8179l3205j917J0216J1946k9692j496L529m530m597K4855K6625l4588k2536
$$ 38179 4974 3057 13273 25219 -4473 -5969 -2440 -6970 -11567 13288 39913 5325 -17211
20111a7211K5415L6528J6657j3858Q760m2935k6489J7753J8960r211O927j8499
$$ -17211 8204 44732 61389 47531 56291 13356 -13133 4620 23580 14369 21296 2797
20099B797L855J4590j9029K7653Q263N9k1631O69l4920K463L129o664J0863K3271
$$ 2797 6652 21242 2213 29866 38129 38188 16557 17226 -17694 -15231 -12102 -18766 -7903 15368
20085A5368P37j0844j1934N357k0972K494j6237m911J0865J4198j1442K1706J898
$$ 15368 16105 5261 -6673 -1316 -22288 -19794 -36031 -40942 -30077 -15879 -27321 -5615 -3717
20072c717q566k1307Q473N422l4251J0334K9616j5958K461M7521o690j4463k1894
$$ -3717 -12283 -33590 -25117 -19695 -53946 -43612 -13996 -29954 -27493 20028 13338 -1125 -23019
20059b3019N302K5745J8408Q690m2004l7417K2091K1861O918n910k9866k3534
$$ -23019 -17717 8028 26436 35126 -6878 -44295 -22204 -343 6575 665 -29201 -52735
20047e2735j9392M4383Q359Q04J9356J8353K6939k729j0116k7887l629O484J3940
$$ -52735 -72127 -27744 -19385 -18581 775 19128 46067 43338 33222 5335 1706 8190 22130
20034B2130j0994k25p97M2656N4008k928q160j4173l6486n0217k2275j8974K305
$$ 22130 11136 10911 10114 52770 106778 103850 95690 81517 45031 -5186 -27461 -46435 -44130
20021d4130n852M123J8165N3288k2391J828j7054K2125L2839k2407l0063j4445
$$ -44130 -49982 -45859 -27694 25594 3203 5031 -12023 10102 42941 20534 -9529 -23974
20009b3974L043O199J0186J6228j3927k5572L3298j3776J2466P5207O651l4005
$$ -23974 -20931 -14732 -4546 11682 -2245 -27817 5481 -8295 4171 79378 86029 52024
19997E2024l9466O840J5928j8490k3257q616K0359K0244J2169P570J307m0601
$$ 52024 12558 19398 35326 16836 -6421 -15037 5322 25566 37735 45305 46612 6011
19985F011q658M894N455L9782j1986m985J23j2453j1730j554j189k200J6620j4940
$$ 6011 -2647 2247 7702 47484 35498 30513 30636 18183 6453 4899 3710 1510 18130 3190
19971C190l4257J973j8583J614K6691J2479J675K7258K5932J3842L566l6899j0066
$$ 3190 -31067 -29094 -47677 -46063 -19372 -6893 -5218 22040 47972 61814 65380 28481 18415
19958A8415n512K382j7619j296k4366j792L3960J3925Q005m9433N626j834k1665
$$ 18415 12903 15285 -2334 -3630 -27996 -29788 4172 18097 26102 -23331 -17705 -19539 -41204
19945d1204J2699N9587l3153J461K3314k495j3259P874j771j3247M7533K3248
$$ -41204 -28505 31082 -2071 -610 22704 20209 6950 14824 13053 -194 47339 70587
19933G0587n2435l4031k6451k2385p025K2957L1645K8204j573p463m315K1779
$$ 70587 18152 -15879 -42330 -64715 -71740 -48783 -17138 11066 9493 2030 -2285 19494
19921A9494K7031K7374p035m6480k186J63N701K0650J6501k989n314r422J027
$$ 19494 46525 73899 66864 20384 18198 18361 24062 44712 61213 58224 52910 43488 44515
19908D4515J7553k7058m0030k8997m828N0038N188R96K7053l3507l8341j9693
$$ 44515 62068 35010 -5020 -34017 -38845 11193 16381 17377 44430 10923 -27418 -47111
19896d7111N8651L6337m627M167L2270k9973m1629R68k664j018n350l5888j6978
$$ -47111 11540 47877 43250 47417 79687 49714 8085 9053 6389 5371 21 -35867 -52845
19883e2845J1631K0015k7628J10K8990J6668k7156L9090L9610k8304K1822J997
$$ -52845 -41214 -21199 -48827 -48717 -19727 -3059 -30215 8875 48485 20181 42003 44000
19871D4000l4315n362K2321K2095m9886k5417n682j9461R924L2305J0983J8986
$$ 44000 9685 4323 26644 48739 -1147 -26564 -32246 -51707 -41783 -9478 1505 20491
19859B0491j999L3703L2406j3302j5265p794L7965k364l1727l3696j679q220l13
$$ 20491 18492 52195 84601 71299 56034 48240 86205 83841 52114 18418 16739 8519 8206
19846H206L1830J3145n3206Q101m773j8522R862p597J230M076j0554n979R5229
$$ 8206 40036 53181 -25 8076 3303 -15219 -5357 -12954 -11724 -7648 -18202 -24181 71048
19833G1048N5249M235l2883j5801j6782J7500l0178l3216K3133j2342j8646j2348
$$ 71048 126297 130532 97649 81848 65066 82566 52388 19172 42305 29963 11317 -1031
19821a031K6474P892j2270J0542k077j3088j3854J3283j6461j0096L1736k9751
$$ -1031 25443 33335 21065 31607 29530 16442 2588 15871 -590 -10686 21050 -8701
19809h701k1719K7686k0666l0369J5367K9803j0933L1991L3n4689n7611j5385
$$ -8701 -30420 -2734 -23400 -53769 -38402 -8599 -19532 12459 12492 -42197 -99808 -115193
19797a15193M7085L2616K5528K159J4531M336j3457J4037J8375l166l100J3003
$$ -115193 -68108 -35492 -9964 -7805 6726 11062 -2395 11642 30017 26851 23751 36754
19785C6754k1459p5203j3380M8068J6552J9613j4130J2491m073J5186l810k5716
$$ 36754 15295 -59908 -73288 -25220 -8668 10945 -3185 9306 5233 20419 16609 -9107
19773i107L399J4104J2167j2246R114K1974j355n4853j4594K2824K1268n55j7999
$$ -9107 -5708 8396 20563 8317 17431 39405 38050 -16803 -31397 -8573 12695 12140 -5859
19760e859m123J4989J1938o27P153j0499L4973m8006l0500K6653J3262j3796k7683
$$ -5859 -9982 5007 16945 16318 23471 12972 47945 -61 -30561 -3908 9354 -4442 -32125
19747c2125J3115l22J1473j3966Q194M0956K3800j5752k9275j0563l9386l306
$$ -32125 -19010 -19332 -7859 -21825 -13631 27325 51125 35373 6098 -4465 -43851 -47157
19735d7157L4726O4196o832m3857l938K5939o699R290k0999n4429Q432K2150L1158
$$ -47157 -12431 51765 44933 1076 -2862 23077 16378 25668 4669 -49760 -41328 -19178 11980
19722A1980m739N131J6201p323n427L214J6200L254J4872K1406o378l8354j8174
$$ 11980 7241 12372 28573 21250 15823 19037 35237 38491 53363 74769 68391 30037 11863
19709A1863P015L5740j829m8202K838n136m3566j3091J1620L9817L573j757K4474
$$ 11863 18878 54618 52789 4587 7425 2289 -41277 -54368 -42748 -2931 642 -1115 23359
19696B3359q077l4761J0501K0682M801K9052K3704j6076j696j5338k7109l202
$$ 23359 15282 -19479 -8978 11704 16505 45557 69261 53185 51489 36151 9042 5840
19684E840J1614j9574p582K8001K6740M152m486Q576K9154Q396k8413j2758J6007
$$ 5840 17454 -2120 -9702 18299 45039 49191 44705 53281 82435 90831 62418 49660 65667
19671F5667q114j5348l560k3635J0907j2353j244m4092p370j5740j3406J5738
$$ 65667 57553 42205 38645 15010 25917 13564 12320 -31772 -39142 -54882 -68288 -52550
19659e2550L2290l1500j6637J4657K9252K4102K3300k4180n224k4243j0844R619
$$ -52550 -20260 -51760 -68397 -53740 -24488 -386 22914 -1266 -6490 -30733 -41577 -31958
19647c1958K782l0488J6667N1900j7864k9331k5406L8559K921L1249K0519j6525
$$ -31958 -29176 -59664 -42997 8903 -8961 -38292 -63698 -25139 -22218 9031 29550 13025
19635A3025J3139L1352K9224k372K541K3867J2810j5063o4124l8034j2720K0193
$$ 13025 26164 57516 86740 84368 86909 110776 123586 108523 44399 6365 -6355 13838
19623A3838K0453L34J8289J9996J8156m4639n090M8780J8590m1010m1370o149
$$ 13838 34291 34625 52914 72910 91066 46427 41337 90117 108707 67697 26327 20178
19611B0178l0177Q447J5625J532J5351K3049l3332J2355N085J648J51J4652j7527
$$ 20178 -9999 -1552 14073 15605 30956 54005 20673 33028 38113 39761 39912 54564 37037
19598C7037n994J7415k2731l8196l9759N8950J8301K616k4272m2318J5092M1475
$$ 37037 31043 48458 25727 -12469 -52228 6722 25023 27639 3367 -38951 -23859 17616
19586A7616O7289J3082l6026l801L513l3155o9441l6223L5050P1748K5255J2050
$$ 17616 84905 97987 61961 58160 61673 28518 -40923 -77146 -42096 29652 54907 66957
19574F6957Q012m1109k6982l003P836K7913K176J8324j3064M402k6898Q675j5550
$$ 66957 74969 33860 6878 3875 11711 39624 41800 60124 47060 51462 24564 33239 17689
19561A7689M406q598j7175J2299j6356J5139M5755N1861K4102k8859n1526o127
$$ 17689 22095 13497 -3678 8621 -7735 7404 53159 105020 129122 100263 48737 42610
19549D2610k6368l933J3696J5719l459K8221l036l8855L6393P555k8438J2850
$$ 42610 16242 12309 26005 41724 38265 66486 63450 24595 60988 68543 40105 52955
19537E2955K1345k5602l6687J5073J4066L097j5997K3590J0990p756K5824P473
$$ 52955 74300 48698 12011 27084 41150 44247 28250 51840 62830 55074 80898 88371
19525H8371J784k9818l3018L7074J1096m1744j6923l845J8586L8916M451J6549
$$ 88371 90155 60337 27319 64393 75489 33745 16822 12977 31563 70479 74930 91479
19513I1479K0698k8891m7604J8410Q24K7838J6108l8599m6749j1079L052J9360
$$ 91479 112177 83286 35682 54092 54916 82754 98862 60263 13514 2435 5487 24847
19501B4847K1517K6240K9865O10L0866J7191j1338j9248k0216k8152k8207n882
$$ 24847 46364 72604 102469 103079 133945 151136 139798 120550 100334 72182 43975 38093
19489C8093L6974K0350j3046K687l77j8186L8277K6680k4954l7627K2937L8818
$$ 38093 75067 95417 82371 85058 84681 66495 104772 131452 106498 68871 91808 130626
19477A30626L3649K3297O7287J36086K69581K80009J70394M5425o1775r1221L992
$$ 130626 164275 187572 254859 390945 660526 940535 1110929 1156354 1094579 1003358 1007350
19466A007350J47839J17724m3388j86362k35270k41685j77506j03265n4940l3643
$$ 1007350 1155189 1272913 1229525 1043163 807893 566208 388702 285437 230497 196854
19456A96854l0178j1843L8139k481o4014m980J5907M286k509m2452j9362M787
$$ 196854 166676 154833 192972 190491 126477 121497 137404 141690 139181 96729 77367 82154
19444H2154K5700J2762j0541l987j356m2696j9376J0918j0986L1189J8625J0045
$$ 82154 107854 120616 110075 106088 104732 62036 42660 53578 42592 73781 92406 102451
19432A02451k8466m542L9535J0343j0337K2752N1427Q0393J17437K23681K92390
$$ 102451 73985 69443 108978 119321 108984 131736 183163 263556 380993 604674 897064
19421H97064K64805J09145p8132j12758p400P4934J40070O834j56541k35002k43474
$$ 897064 1161869 1271014 1192882 1080124 1072724 1147658 1287728 1294562 1138021 903019 659545
19410F59545k12731j22839o3926j7960l5892j9773k7719p597q843l4231k5263
$$ 659545 446814 323975 260049 242089 206197 186424 158705 151108 142265 108034 82771
19399H2771J594K7854n789k1144m6097m267K2752n913K6915j2484J1410N1350
$$ 82771 84365 112219 106430 85286 39189 34922 57674 51761 78676 66192 77602 128952
19387A28952J6511l6036l6222L501J2665m581J1336k1467k3294L4279J4085L756
$$ 128952 145463 109427 73205 76706 89371 84790 96126 74659 51365 85644 99729 103485
19375A03485j4302k4476m953J7570j2913j677l5022l6204N158M0632M4016K1564
$$ 103485 89183 64707 59754 77324 64411 62734 27712 -8492 -3334 37298 81314 102878
19363A02878q016j2265k1826k4062j5944L742N5327j4058J931k1475j7981L7920
$$ 102878 94862 82597 60771 36709 20765 24507 79834 65776 67707 46232 28251 66171
19351F6171K1474n4928k1369Q018r200N0483J0556k7980m117P733K8567K4765
$$ 66171 87645 32717 11348 19366 10166 60649 71205 43225 39108 46841 75408 100173
19339A00173k3937j6108J1943K059M0595J4130m112K2090L7125J1271L9293k6131
$$ 100173 76236 60128 72071 74130 114725 128855 124743 146833 183958 195229 234522 208391
19327B08391k5302j6952k8897j5082j9996J2237j800l4662j6522R459L5201j5941
$$ 208391 183089 166137 137240 122158 102162 114399 112599 77937 61415 70874 106075 90134
19315I0134o872k2207m3839L6028N031j0727N440o19n204j8835l9330K3866O1768
$$ 90134 83262 61055 17216 53244 58275 47548 52988 52369 47165 28330 -11000 12866 74634
19302G4634L6279j6565o634l265L1853L9948m602j043j0201n8126k2434J0769
$$ 74634 110913 94348 87714 84449 116302 156250 151648 150605 140404 82278 59844 70613
19290G0613L216l3713k8943K5947j184l812j0620l3458K851K0004L1369P71k1909
$$ 70613 73829 40116 11173 37120 35936 32124 21504 -11954 -9103 10901 42270 43041 21132
19277B1132K9485J5762k0128m4733O613J4512m1172Q153L8878N6170L3230o1398
$$ 21132 50617 66379 46251 1518 8131 22643 -18529 -10376 28502 84672 117902 56504
19265E6504l9807k2676J2888O509K273J9303L3676o9811K389L0159M6636j2626
$$ 56504 16697 -5979 6909 13418 15691 34994 68670 -1141 1248 31407 78043 65417
19253F5417n0932o489m3958L251M3219O2689N1529J4257j3871l9839k096j00R76
$$ 65417 14485 7996 -35962 -32711 10508 73197 124726 138983 125112 85273 83177 83077 84053
19240H4053k9467q230Q280N5871L4572q737l1063l3457m0085K6312J9367M3089
$$ 84053 54586 46356 54636 110507 145079 136342 105279 71822 31737 58049 77416 120505
19228A20505l113j7449j2248k5345j4615m4112M0744J2491k6564J4293M6060Q4514
$$ 120505 117392 99943 87695 62350 47735 3623 44367 56858 30294 44587 90647 175161
19216A75161O1465l024j8395L810j3566R438R221K5948j143k735m3003m9231m5726
$$ 175161 236626 233602 215207 219017 205451 214889 224110 250058 248915 246180 203177 153946 108220
19203A08220l495r111m8012p377K3302j5958J4607K9568L4731p0375l2168M120
$$ 108220 104725 95614 47602 40225 63527 47569 62176 91744 126475 56100 23932 28052
19191B8052K4532m547k7575j4748N3253L8643J993K2531k855k687k3924O315Q672
$$ 28052 52584 48037 20462 5714 58967 97610 99603 122134 119279 116592 92668 98983 107655
19178A07655j7419J9480j9617K06O541K6560M3047J776j0604l5623m062Q1505
$$ 107655 90236 109716 90099 90305 96846 123406 166453 168229 157625 122002 117940 199445
19166A99445J18789L7606m0216l1214k9455J683N928k295o022P739l3944o8546
$$ 199445 318234 355840 315624 284410 254955 256638 262566 260271 254249 261988 228044 159498
19154A59498n7133l663q338M936L5912j4806j3454k299P325q271J6939L2597K1530
$$ 159498 102365 98702 90364 95300 131212 116406 102952 100653 107978 99707 116646 149243 170773
19141A70773J2455R792q996J2550k681R671j2361L3080J6668j5946l8047m6565
$$ 170773 183228 193020 184024 196574 193893 203564 191203 224283 240951 225005 186958 140393
19129A40393J8211J8621l548m5599j6910n42J7942J183m177J4300J0241k76L6518
$$ 140393 158604 177225 173677 128078 111168 110626 128568 129751 125574 139874 150115 149839 186357
19116A86357L3408j482M3106J00641M8504Q9445J97220L52487L68479K30066J21948
$$ 186357 219765 218283 261389 362030 410534 499979 697199 1049686 1418165 1648231 1770179
19105A770179N9659q7360k77368m02200k95361j78495j17684m2793k3593l8546
$$ 1770179 1829838 1742478 1465110 1062910 767549 589054 471370 428577 404984 366438
19095C66438j4793j0514l8225r999m7058n7754j3660K1169K2677k6396K9524N305
$$ 366438 351645 341131 302906 292907 245849 188095 174435 195604 218281 191885 221409 226714
19083B26714J1416M3348N0985M6647J8813K4200J02577J90035L22808M87087L46222
$$ 226714 238130 281478 332463 379110 397923 422123 524700 714735 1037543 1524630 1870852
19072A870852J04947M6339K8067j94061m04500m13245l03814j54297j13173n0091
$$ 1870852 1975799 2022138 2050205 1856144 1451644 1038399 734585 580288 467115 417024
19062D17024l1092j5074l3904O261J4563Q571N383p163P5458J55723J83282K30680
$$ 417024 385932 370858 336954 343215 357778 366349 371732 364569 440027 595750 779032 1009712
19050A009712J31589Q6209J17265J24097Q0601N6416o7271j15569l5347o5953
$$ 1009712 1141301 1227510 1344775 1468872 1549473 1605889 1538618 1423049 1387702 1321749
19040A321749k04340k66246j83570q8781k2132k611o1451r0441l1013k200J3507
$$ 1321749 1117409 851163 667593 578812 556680 554069 492618 402177 371164 368964 382471
19029C82471O379L63K8028P2193O4157N1422n384K5359N0882L2912J3287M916
$$ 382471 388850 389213 417241 489434 553591 605013 599629 624988 675870 708782 722069 726985
19017G26985J1040n7970l2436M9520M2848M1696N8178K7120O2695N0765J6463
$$ 726985 738025 680055 647619 697139 739987 781683 839861 866981 929676 980441 996904
19006I96904N6695J39860J79983K04251J50491Q9142K03403K02795J16873J25664
$$ 996904 1053599 1193459 1373442 1577693 1728184 1817326 2020729 2223524 2340397 2466061
18996B466061N8791J895N3068J8014k9112j1323J81153M68140N70886M26683M4542
$$ 2466061 2524852 2526747 2579815 2597829 2568717 2557394 2738547 3206687 3777573 4204256 4248798
18985D248798j23965Q3051L85873M36543K35111J7j20187j32330M7840K73746
$$ 4248798 4124833 4207884 4593757 5030300 5265411 5265428 5145241 5012911 5060751 5334497
18975E334497N18136Q01276J027350J218392J516323K042767K875621M074724
$$ 5334497 5852633 6653909 7681259 8899651 10415974 12458741 15334362 19409086
18967A9409086O066082R758510J7614395L2680769M8304074M3415515J6734943
$$ 19409086 25475168 35233678 52848073 85528842 133832916 177248431 193983374
18960A93983374o515726j3486945m864821K0353384K7194168J196356k5232116
$$ 193983374 187467648 173980703 169115882 189469266 216663434 217859790 192627674
18953A92627674m3210230m2614743l1961549k1185718j3061168q416867n640932
$$ 192627674 149417444 106802701 74841152 53655434 40594266 32177399 26536467
18946B6536467m046149l205710k615957k141035j730188j292699p78143k15850
$$ 26536467 22490318 19284608 16668651 14527616 12797428 11504729 10726586 10510736
18938A0510736K87520M76936J82360l28038o32015m78327r322L45525K86649n3458
$$ 10510736 10798256 11275192 11457552 11129514 10497499 10019172 10009850 10355375 10642024 10588566
18928A0588566l47280m32854l11647K2391M81597R31148J339828J913924K695900
$$ 10588566 10241286 9808432 9496785 9519176 10000773 10931921 12271749 14185673 16881573
18919A6881573L614210M627675O175648R350029J6726831L2002055N1785480N5299420
$$ 16881573 20495783 25123458 31299106 40649135 57375966 89378021 141163501 196462921
18911A96462921L3183074k466602k7109456j8149107J3071937L1157922J8381068
$$ 196462921 229645995 227179393 200069937 181920830 194992767 226150689 244531757
18904B44531757j5633376m7407958n4420660m1729174k5927670j4860688r261700
$$ 244531757 228898381 181490423 127069763 85340589 59412919 44552231 35290531
18897C5290531o415138m724958l642028k958265k501654k097885j682261j305318
$$ 35290531 28875393 24150435 20508407 17550142 15048488 12950603 11268342 9963024
18889I963024q88871m27644j65473k28192n17265p85271p78646m58020o4244Q4832
$$ 9963024 9074153 8646509 8481036 8252844 7735579 6950308 6171662 5713642 5649398 5734230
18879E734230p5180l95994o66834o91434n94781m65510l29940k69317j65364j61244
$$ 5734230 5659050 5263056 4596222 3904788 3310007 2844497 2514557 2245240 2079876 1918632
18869A918632j36282r5430r3858o8777l6241o1781r3842r1767o5214o7125j00983
$$ 1918632 1782350 1686920 1593062 1524285 1488044 1426263 1332421 1240654 1175440 1108315 1007332
18858A007332k3906o309j4038n691n2282q0435n8774K9081R026l8634J0332L9318
$$ 1007332 983426 977117 963079 957388 905106 824671 765897 794978 804004 765370 775702 815020
18846H15020J5133k5905m9315o2843j4716l035K1321k0714J7905J0450M454K100
$$ 815020 830153 804248 754933 692090 677374 674339 695660 674946 692851 703301 707755 709855
18834G09855L1937L8102m369n3823k1776k27l348K882k5857m3556q9237n1191
$$ 709855 741792 779894 775525 721702 699926 699699 696351 699233 673376 629820 540583 489392
18822D89392J8062M4765J8629M455k3771j4012m474P384N97n4758j2997K2334
$$ 489392 507454 552219 570848 575303 551532 537520 533046 540430 541027 486269 473272 495606
18810D95606n162M58n576r43J0603K715K463p123j6018J3204l3534o466K248p136
$$ 495606 490444 490902 485326 484383 494986 497701 500164 493041 477023 490227 456693 450227 452475 445339
18796D45339R737K6416K8034J5387l9130j4967K5141l2749m4545L7223L5591O7860
$$ 445339 455076 481492 509526 524913 485783 470816 495957 463208 418663 455886 491477 559337
18784E59337R3478O6194R3775O7473Q7628J815n1684p6427o4940l8747n5099n1397
$$ 559337 652815 719009 812784 880257 967885 969700 918016 841589 776649 737902 682803 631406
18772F31406k807N9333O8461M6478K4885R0150Q6493m462r4490j73497j31382
$$ 631406 628599 687932 756393 802871 827756 917906 1004399 999937 905447 731950 600568
18761F00568q4211l1816L8656P7915J9697k1141n8148n437N3513O5674L2297j7771
$$ 600568 516357 484541 523197 601112 620809 599668 541520 536083 589596 655270 687567 669796
18749F69796P85J2515L3661M8480J5667k5255o4860o0404m7187q2455o6044m4476
$$ 669796 670581 683096 716757 765237 780904 755649 690789 630385 583198 500743 434699 390223
18737C90223k8105k2803J0389P2527N1234J5516M8042L4192j5290n040n1870q8928
$$ 390223 362118 339315 349704 422231 473465 488981 537023 571215 555925 550885 499015 410087
18725D10087n8217l2082l7851J9872K0161L3712J6253K5397o172m5875K4423O165
$$ 410087 351870 319788 281937 301809 321970 355682 371935 397332 391160 345285 369708 375873
18713C75873n69L569l8506k7837P030M9371N1257J474j5043j9094J330O186K0599
$$ 375873 375304 378873 340367 312530 319560 368931 420188 421662 406619 387525 388855 395041 415640
18700D15640M9519J8884k4689N260J7347M1471l663o1209j00047n2604K9359K0046
$$ 415640 465159 484043 459354 464614 481961 523432 519769 458560 358513 305909 335268 355314
18688C55314J788L0961J7857j0460k1076J5639k845j9280j4617K0965M2390M5647
$$ 355314 357102 388063 405920 395460 374384 390023 387178 367898 353281 374246 416636 462283
18676D62283K2510L3754P1031J04415J43132K01742L02865L59923J24458k40504
$$ 462283 484793 518547 589578 693993 837125 1038867 1341732 1701655 1826113 1585609
18666A585609l40848k90227j50038o7197k8208m8420p1236p6974j8329k1294m2074
$$ 1585609 1244761 954534 804496 737299 709091 660671 589435 512461 494132 472838 430764
18655D30764p9636l9491l3514L0780O0946k2250L607J6897J3392L9327N1714P0089
$$ 430764 351128 311637 278123 308903 369849 347599 351206 368103 381495 420822 472536 542625
18643E42625O0320l2727q6557l2491M626P1388R0807M4872P2903O6749J8807j0081
$$ 542625 602945 570218 483661 451170 455796 527184 617991 662863 735766 802515 821322 811241
18631H11241J6866J0914o856j5650J1168K1776Q7293J55466K13430L99389O64652
$$ 811241 828107 839021 832165 816515 827683 849459 936752 1092218 1305648 1705037 2369689
18620B369689M45436k26994n81328m41135k46534j35395r6622o4485m3698k4585
$$ 2369689 2815125 2588131 2006803 1565668 1319134 1183739 1087117 1022632 978934 954349
18610I54349k9799k8357k2243o5681R451O5445J5040p762r606K5239O5420J40930
$$ 954349 924550 896193 873950 808269 817720 883165 898205 890443 880837 906076 971496 1112426
18598A112426J21687O8503Q9945K4419p8602o8956K1633M8577J13494R6308N7746
$$ 1112426 1234113 1302616 1392561 1416980 1338378 1269422 1291055 1339632 1453126 1549434 1607180
18587A607180M6553o3377n2889j0283j3847l361J4304K9656K1742L1363P0755
$$ 1607180 1653733 1590356 1537467 1527184 1513337 1509976 1524280 1553936 1575678 1607041 1677796
18576A677796J11965J94154K72298M51968N48361K39485j55858l00232l03981
$$ 1677796 1789761 1983915 2256213 2708181 3256542 3496027 3340169 3039937 2735956
18567B735956j86282p5318K9543J58615K32041L19826M07446M20448K35970J26257
$$ 2735956 2549674 2474356 2503899 2662514 2894555 3214381 3621827 4042275 4278245 4404502
18557D404502J81923J04783Q9298K24566L53367M37468O51754Q99500Q86652N57739
$$ 4404502 4586425 4691208 4780506 5005072 5358439 5795907 6447661 7347161 8233813 8791552
18547H791552M95764N72880M12311J73959J61956L02043O61921J235176J671811
$$ 8791552 9287316 9860196 10272507 10446466 10608422 10910465 11572386 12807562 14479373
18538A4479373K128086K745731L638047N119808P456314J1498487J9201033L4250222
$$ 14479373 16607459 19353190 22991237 28111045 35567359 47065846 66266879 100517101
18530A00517101O0047767Q6298134R1567421P1625926K3551565l3056239p0023062
$$ 100517101 160564868 246863002 338430423 410056349 433607914 400551675 330528613
18523C30528613n5757604k5447395j7314910k2059157j8343712k5531884l4997505
$$ 330528613 274771009 249323614 232008704 209949547 191605835 166073951 131076446
18516A31076446l3983706k4928992j5390560r149752n932858m255146l332154
$$ 131076446 97092740 72163748 56773188 47623436 41690578 37435432 34103278
18509C4103278k647351k021009j209590l46074M17261J218273K079780L288847
$$ 34103278 31455927 29434918 28225328 27879254 28296515 29514788 31594568 34883415
18501C4883415N074432P913971J2686681K1591736L9207069P3073834J04204408
$$ 34883415 39957847 47871818 60558499 82150235 121357304 194431138 298635546
18494B98635546P7606221K6202957K0747653M438203n5904727r6315908q8538592
$$ 298635546 376241767 402444724 423192377 427630580 371725853 275409945 186871353
18487A86871353n8988257l1681076j5516193n327662L695377J6154817L7164196
$$ 186871353 127883096 96202020 80685827 75358165 79053542 95208359 132372555
18480A32372555N5612411K9748454L12675O649968J0323162K085273J1317933
$$ 132372555 187984966 217733420 218046095 224696063 235019225 237104498 248422431
18473B48422431k037151k2889399j5270655j2812184l4175451m2533279l5963388
$$ 248422431 246385280 223495881 208225226 195413042 161237591 118704312 82740924
18466H2740924k3251793j3462874q154366n524585m191602l330415k728860k411792
$$ 82740924 59489131 46026257 37871891 32347306 28155704 24825289 22096429 19684637
18458A9684637k171602j752014j227315j049705r65102o42799m33407m45365k32582
$$ 19684637 17513035 15761021 14533706 13484001 12518899 11876100 11442693 10997328 10764746
18449A0764746q6201j70225r2721q0216k02381j88020K03268N48233P14103M58010
$$ 10764746 10678545 10508320 10415599 10335383 10133002 9944982 10148250 10696483 11410586 11868596
18439A1868596n0876j58586j20866Q9204K76550J76304J5963j41737J00503M39718
$$ 11868596 11817720 11659134 11538268 11627472 11904022 12080326 12096289 11954552 12055055 12494773
18429A2494773O49408R82100J501922K402114L837935N904792Q867502J3349704
$$ 12494773 13144181 14126281 15628203 18030317 21868252 27773044 36640546 49990250
18421D9990250K2054679L9862998P6385837J28529657J34261114N7962594k3250439
$$ 49990250 72044929 111907927 188293764 316823421 451084535 509047129 485796690
18414D85796690j02521245j12632992q8366254n6709972l3719541k1843108j4600001
$$ 485796690 383275445 270642453 182276199 125566227 91846686 70003578 55403577
18407E5403577r920366o933243n082977l919184l148273k534948j894155j301689
$$ 55403577 45483211 38549968 33466991 29547807 26399534 23864586 21970431 20668742
18399B0668742n42711K57613N13381O9786p31875j245277n62369P58070J979686
$$ 20668742 20126031 20383644 20897025 20966811 20234936 18989659 18427290 19185360 21165046
18390B1165046K742680K775371L312378N865606J1734522K3431167M6583805P5368670
$$ 21165046 23907726 26683097 29995475 35861081 47595603 71026770 117610575 192979245
18382A92979245O7274690K2976053l1560183o4620323o2750363m4244100k5962741
$$ 192979245 260253935 283229988 251669805 187049482 124299119 80055019 54092278
18375E4092278j4629091q914213n951770m197940l038511k270813j871197j471041
$$ 54092278 39463187 30548974 24597204 20399264 17360753 15089940 13218743 11747702
18367A1747702j100237q08259o22365k02938K87284K99550j22948p50213j112133
$$ 11747702 10647465 9839206 9216841 9013903 9301187 9600737 9477789 8727576 7615443
18358G615443r15668m67621l34491m41106o40276o59830m90832l27968j97071
$$ 7615443 6699775 6232154 5897663 5456557 4816281 4156451 3665619 3337651 3140580
18349C140580j38282j36999j54276j24945j36893j02197j25046j39867j52103
$$ 3140580 3002298 2865299 2711023 2586078 2449185 2346988 2221942 2082075 1929972
18340A929972j05502j18230o6431o4903q0229m8289k0042l5100o769J6438m5277
$$ 1929972 1824470 1706240 1639809 1574906 1494677 1446388 1426346 1391246 1384477 1400915 1355638
18329A355638o9863m6473l4844n3726j9897k3454J5377O342J4571j1914l3976
$$ 1355638 1285775 1239302 1204458 1150732 1130835 1107381 1122758 1129100 1143671 1131757 1097781
18318A097781m3371j7395L8654j254k5010o8774m3919M6776l888L9977K0412l3944
$$ 1097781 1054410 1037015 1075669 1074415 1049405 980631 936712 983488 979600 1019577 1039989 1006045
18306A006045o5391l0359k3357l4431o4333J0296J98k278J9152J6880K1615J0356
$$ 1006045 940654 910295 886938 852507 788174 798470 798668 796390 815542 832422 854037 864393
18294H64393M2899R5999M6807N3658Q8672R5742M5337J4443r4072j20989j16621
$$ 864393 907292 1003291 1050098 1103756 1192428 1288170 1333507 1347950 1253878 1132889 1016268
18283A016268j35572j82592l7142P7762M5964K3408J9959p547j8846J6220k8004
$$ 1016268 880696 698104 660962 738724 784688 808096 828055 820508 801662 817882 789878
18272G89878M523N010l4227m4786o393J392P379q703r796K2155O407L7536L3219
$$ 789878 794401 799411 765184 720398 714005 715397 722776 714073 704277 726432 732839 770375 803594
18259H03594O5479P4190M7031M2264N2455M1137j0105R066p7181j33865j33676
$$ 803594 869073 943263 990294 1032558 1085013 1126150 1116045 1125111 1047930 914065 780389
18248G80389q8047l3914L1244M1255J928k813L7183K4978m9834j3312p298J0956
$$ 780389 692342 658428 689672 730927 732855 730042 767225 792203 742369 729057 721759 732715
18236G32715l0065j6360j6381n1393p0429j134N5910M2494K7062O2859M5537J5376
$$ 732715 702650 686290 669909 618516 548087 546953 602863 645357 672419 735278 780815 796191
18224G96191j4998o2608j2363J5667O9549J05386Q2856k14n7856n4107j7597n9806
$$ 796191 781193 718585 706222 721889 791438 896824 979680 979466 921610 867503 849906 790100
18212G90100J8721J8582P9343R0888j102n1142k6229n778J5288Q921M0878M6150
$$ 790100 808821 827403 906746 997634 996532 945390 919161 913383 928671 937592 978470 1024620
18200A024620N6849M8254P6857N2365O2387J25478K47523M96061O09778J00772
$$ 1024620 1081469 1129723 1206580 1258945 1321332 1446810 1694333 2190394 2800172 2900944
18190B900944k78674l30538j40257J874J27764K93146M49483L15368m9200k53656
$$ 2900944 2622270 2291732 2151475 2153349 2281113 2574259 3023742 3339110 3289910 3036254
18180C036254k66761j58078N359N5818J01504J14454K16424K53949K66542K86108
$$ 3036254 2769493 2611415 2616774 2672592 2774096 2888550 3104974 3358923 3625465 3911573
18170C911573L75218M40957N80007P33798Q92160J104399J634298K570992L897679
$$ 3911573 4286791 4727748 5307755 6041553 6933713 8038112 9672410 12243402 16141081
18161A6141081N661278Q562879J4329546K3473031L6515096O3276860P6797689
$$ 16141081 21802359 30365238 44694784 68167815 104682911 167959771 244757460
18154B44757460J4599748m8881504o6923589n2209984l0732894j7020808j0341296
$$ 244757460 259357208 210475704 143552115 91342131 60609237 43588429 33247133
18147C3247133o727692m620134l013747j899502j340923j030341j066450j109320
$$ 33247133 26519441 21899307 18885560 16986058 15645135 14614794 13548344 12439024
18139A2439024j168148j162607q91309m56866r1990K1983r1859m37021o25996
$$ 12439024 11270876 10108269 9216960 8760094 8668104 8690087 8598228 8161207 7535211
18130G535211l87646j0611L09290N48987M04452P6949L7173L45488Q22618R67872
$$ 7535211 7147565 7136954 7446244 7995231 8399683 8476632 8513805 8859293 9681911 10649783
18120A0649783P80563R50068J169072J408007K026961L167703N217157Q146817
$$ 10649783 11430346 12380414 13549486 14957493 16984454 20152157 25369314 33516131
18112C3516131J2349519J9744337L5472227O3171149P5531259P4315421O7961366
$$ 33516131 45865650 65609987 101082214 164253363 239784622 314100043 382061409
18105C82061409L6684063l2783203r5189968r5766107o9114483m0028885k2772083
$$ 382061409 418745472 385962269 290772301 195006194 125891711 85862826 63090743
18098F3090743j4097879r495403o866871n050732l759718l071243k702007k276634
$$ 63090743 48992864 39497461 32630590 27579858 23820140 20748897 18046890 15770256
18090A5770256j829815j482318j228934q14140k28499O9670l57633q15900q73060
$$ 15770256 13940441 12458123 11229189 10415049 10186550 10256220 9898587 9082687 8209627
18081H209627o76496l02483J74545N32966M67345Q1498n82589o98226l92305K1497
$$ 8209627 7533131 7230648 7405193 7938159 8405504 8487002 7904413 7206187 6813882 6835379
18071F835379L11323N66518O65010M44514N4576J01048P24184J728095K791136
$$ 6835379 7146702 7713220 8378230 8822744 8877320 8978368 9702552 11430647 14221783
18062A4221783L988129O156883J0641611K0062518L9029690O1904596L9447767
$$ 14221783 18209912 24366795 35008406 55070924 94100614 156005210 195452977
18055A95452977k4550373n0483507m5043561k7150894j4314390q102907n132186
$$ 195452977 170902604 120419097 75375536 48224642 33910252 25807345 20675159
18048B0675159l853530l051185k376446j861623j447012j119408r34554p49646
$$ 20675159 16821629 13770444 11393998 9532375 8085363 6965955 6031401 5281755
18040E281755o02079m99354l64620k91440j95930j87744j99502j48093o7670l3960
$$ 5281755 4679676 4180322 3815702 3524262 3328332 3140588 2941086 2792993 2725323 2691363
18030B691363Q4122K54011L27348j8829l66702m57455l62618j97321k7909O2268
$$ 2691363 2775485 3029496 3356844 3338015 2971313 2513858 2151240 1953919 1926010 1988278
18020A988278K11013K31318j09460l36543k95175k41631j47884q3308k7223o660
$$ 1988278 2199291 2430609 2321149 1984606 1689431 1447800 1299916 1216608 1189385 1182725
18010A182725j3577l510K70r373l7273n3267j9598j1467j0738L8587N9979O3851
$$ 1182725 1169148 1165638 1165908 1156535 1119262 1065995 1046397 1034930 1024192 1062779 1122758 1186609
17998A186609M9084P1862P9967J75409K92097J87277N2049Q1749O1465o2401r8922
$$ 1186609 1235693 1307555 1387522 1562931 1855028 2042305 2094354 2176103 2237568 2175167 2076245
17987B076245Q0348J95107N5070L0997r392j38031k31727j91625j34671j29460
$$ 2076245 2156593 2351700 2406770 2437767 2428375 2290344 2058617 1866992 1732321 1602861
17977A602861j11984j31215j54330j48428r8442n2455n151L8670O6026P8823Q5247
$$ 1602861 1490877 1359662 1205332 1056904 958462 906007 900856 939526 1005552 1084375 1169622
17966A169622K5573k8616p1405p3176q3161j05843n5431J7736N046m5947j6702
$$ 1169622 1195195 1166579 1095174 1021998 938837 832994 777563 795299 800345 754398 737696
17955G37696P863O4392R1718J10113R6545N0540N5186N6771J28847K37999J51361
$$ 737696 745559 809951 901669 1011782 1108327 1158867 1214053 1270824 1399671 1637670 1789031
17944A789031J7408K3641P1600K9899J39179K82295M19055L61940J43945l600
$$ 1789031 1806439 1830080 1901680 1931579 2070758 2353053 2772108 3134048 3277993 3274393
17934C274393m3122k06132m28908m45653l03484j94386j54696j40939j54478j43165
$$ 3274393 3231271 3025139 2596231 2150578 1847094 1652708 1498012 1357073 1202595 1059430
17924A059430o4082n4189m3130l7128o9158m6336K3454q309m4430P071k627Q334
$$ 1059430 995348 941159 898029 860901 791743 745407 768861 760552 716122 723193 720566 728900
17912G28900L373Q1235J07877J16660O1995m5761j5605Q7837K36186L99871L36091
$$ 728900 732273 813508 921385 1038045 1100040 1054279 1038674 1126511 1362697 1762568 2098659
17901B098659J49245O1818J5177j94243l91454l72629k33863r3145K0210N513
$$ 2098659 2247904 2309722 2324899 2130656 1739202 1366573 1132710 1039565 1059775 1065288
17891A065288m8612m9791J0867m6634l2588L047M4318N9372O3897J66362L88453
$$ 1065288 1016676 966885 977752 931118 898530 901577 945895 1005267 1069164 1235526 1623979
17880A623979O67142Q02232L90377L9183l65867n38076m72481l25787k41757j44381
$$ 1623979 2291121 3093353 3483730 3522913 3157046 2618970 2146489 1820702 1578945 1434564
17870A434564p0541m2198m0855j1344o6483j07621q7046r4218j12582J0448N1600
$$ 1434564 1364023 1321825 1280970 1269626 1203143 1095522 1008476 914258 801676 812124 863724
17859H63724K0156j9141r976k2556l0891r880j9172L6613Q0430J40932K03591
$$ 863724 883880 864739 854763 832207 801316 791436 772264 808877 889307 1030239 1233830
17848A233830L31459N39571P71994J064256Q69090K67468m35214q59405r08710
$$ 1233830 1565289 2104860 2876854 3941110 4810200 5077668 4642454 3783049 2874339
17839B874339p12643n17292l46801k45453j65373r6580n5294l0730m4537J5724
$$ 2874339 2161696 1644404 1297603 1052150 886777 790197 734903 704173 659636 675360
17829F75360m414m2663k551K7393M2188M4210l6056k9606P79l8563j6665j9818
$$ 675360 670946 628283 625732 653125 695313 739523 703467 673861 674640 636077 619412 599594
17817E99594j4507k0397p4104j4252m6076m0844p771O5421M7620J7455k2379j8498
$$ 599594 585087 564690 490586 476334 430258 389414 381643 447064 494684 512139 489760 471262
17805D71262k9060k8971j1196Q910N137J851P457k1999K8202J3005K3129j8983
$$ 471262 442202 413231 402035 410945 416082 417933 425390 403391 431593 444598 467727 448744
17793D48744l4907l9273l8703p530l0410J7137K6943Q105j5363L7069N5406p691
$$ 448744 413837 374564 335861 328331 297921 315058 342001 350106 334743 371812 427218 419527
17781D19527l0740n661Q9387Q5606M6538o2275p5674o3727k9856K4513N0795l6360
$$ 419527 388787 383126 472513 558119 604657 542382 466708 402981 373125 397638 448433 412073
17769D12073p0929k2145O1508J10594J35935J62503P1050m0253j07561j7634q640
$$ 412073 341144 318999 380507 491101 627036 789539 860589 820336 712775 695141 686501
17758F86501m3652m2870n5324j7579K9316L5691M9185k3502o8838j4805J6698
$$ 686501 642849 599979 544655 527076 556392 592083 641268 617766 548928 534123 550821
17747E50821p0079o5565j962l3664P417j6892l3686j8090K1224K6554K9865K8591
$$ 550821 480742 415177 413215 379551 386968 370076 336390 318300 339524 366078 395943 424534
17735D24534R0975K4246m6427J0596J0135p475K0281O3620L7855o2187p6463o3239
$$ 424534 515509 539755 493328 503924 514059 506584 526865 590485 628340 566153 489690 426451
17723D26451J5967L4085N0887L9035n2964j5675L2602P9585Q3752J12611O7169
$$ 426451 442418 476503 527390 566425 513461 497786 530388 609973 693725 806336 873505
17712H73505o4738j55624p4940l2422k6146l854l5198q6684J1346L2372n22k7247
$$ 873505 808767 653143 578203 545781 519635 515781 480583 393899 405245 437617 437095 409848
17700D09848o0019k3934q432k8643j1652Q635M7692j9480j5591n0808m1694N2555
$$ 409848 349829 325895 317463 288820 277168 285803 333495 314015 298424 247616 205922 258477
17688B58477M7155K5556K1195J0601j8188l5534o2434l0518l1207K4582L589l7374
$$ 258477 305632 331188 352383 362984 344796 309262 246828 216310 185103 209685 213274 175900
17676A75900K659L7525m388J4379P7497L8113N360l3648k1262M852k3653l8938
$$ 175900 178559 216084 211696 226075 303572 341685 347045 313397 292135 296987 273334 234396
17664B34396k8697j4428J1156N1887m0047o2804j2530Q402J4441J4822M2752J1921
$$ 234396 205699 191271 202427 254314 214267 151463 138933 147335 161776 176598 219350 231271
17652B31271M8890l970o9354o3979k1878O7115M5110P2561N5202R9035K27548
$$ 231271 280161 276191 206837 142858 120980 188095 233205 305766 360968 460003 687551
17641F87551M44173K38207j62474l12891k78818k04670j10581p3047K4932j9260
$$ 687551 1131724 1369931 1207457 894566 615748 411078 300497 227450 252382 233122
17631B33122l6912k91M971P706l8921l8577k733k9471k4861k3589K0064L6880
$$ 233122 196210 195919 200890 208596 169675 131098 128365 98894 74033 50444 70508 107388
17619A07388j5054J4580o355J8151j3019n1317k7291N0896R958k068K2098M7502
$$ 107388 92334 106914 100559 118710 105691 54374 27083 77979 87937 85869 107967 155469
17607A55469o184l8937P054j9463l1310L2832J2663o488J1161L0844O3019O9596
$$ 155469 149285 110348 117402 97939 66629 99461 112124 105636 116797 147641 210660 280256
17595B80256J45979L07627M69917M92113L03555J0960l66583m85765l91993k58755
$$ 280256 426235 733862 1203779 1695892 1999447 2010407 1643824 1158059 766066 507311
17585E07311j31039n3655j5331n5503k4358m2887n4816l3184K704K3521l049l714
$$ 507311 376272 322617 307286 251783 227425 184538 129722 96538 99242 122763 119714 116000
17573A16000m845k5729r762K4996L7434K4448L9333J7940k1925k3551O538l0719
$$ 116000 111155 85426 75664 100660 138094 162542 201875 219815 197890 174339 180877 150158
17561A50158q768l6003O270j4079n050m7588l9492N1072O285o159K7001L3968
$$ 150158 141390 105387 111657 97578 92528 44940 5448 56520 62805 56646 83647 117615
17549A17615n07M1409N2176l683M8172J46875L08043L49551O4370k61298k97009
$$ 117615 117108 158517 210693 207010 255182 402057 710100 1059651 1124021 862723 565714
17538E65714j74484j07840m8298l2617m7084n3033O875J3344o7288l398L723K4484
$$ 565714 391230 283390 235092 202475 155391 102358 109233 122577 55289 51891 55614 80098
17526H0098J346p306j4229n8856j4013J8150M0707L5869J075J6658K082k5514
$$ 80098 81444 74138 59909 1053 -12960 5190 45897 81766 82841 99499 101581 76067
17514G6067K422J2602j9526o036K2174J2934m2205q628k6289n553j862m5172l1638
$$ 76067 78489 91091 71565 65529 87703 100637 58432 49804 23515 17962 16100 -29072 -60710
17501f0710K7745K069O163k3795M2693J9044J8409N966k3151M821J3649k7476
$$ -60710 -32965 -30896 -24733 -48528 -5835 13209 31618 37584 14433 19254 32903 5427
17489E427l3261J249M4109K0577k2403l6490K0321N2034O6901J01728K3101k8069
$$ 5427 -27834 -26585 17524 38101 15698 -20792 -471 51563 118464 220192 243293 215224
17477B15224l6474J749O8250J4025r2089n2789k0534L414k2407k9364j7521m519
$$ 215224 178750 180499 248749 262774 170685 117896 97362 100776 78369 49005 31484 26965
17465B6965p732L3214J4808J9371R5930R7890M9953n7410l6551l4810l0789P9060
$$ 26965 19233 52447 67255 86626 182556 280446 330399 272989 236438 201628 170839 249899
17453B49899L5553o7291o3571l6393k1732m0818k0618l015O8617Q1716J36269
$$ 249899 285452 218161 154590 118197 96465 55647 35029 32014 100631 182347 318616
17442C18616Q7484q0597j19476p1645k5900j5978K0031j5249o5823l4944M8035
$$ 318616 406100 325503 206027 134382 108482 92504 112535 97286 31463 -3481 44554
17431D4554O2028l0243j3387P368K1139j0520m2887k2982K4651J1607l8300l3352
$$ 44554 106582 76339 62952 70320 91459 80939 38052 15070 39721 51328 13028 -20324
17419b0324j2660K6741O0527Q444k8708m797k3945j4681Q374n9475R118Q227j9907
$$ -20324 -32984 -6243 54284 62728 34020 29223 5278 -9403 -1029 -60504 -51386 -43159 -63066
17406f3066J6263N8795K7424l5557o057O449J5516m953m0833l1044L5281L5458
$$ -63066 -46803 11992 39416 3859 -2198 4251 19767 14814 -26019 -57063 -21782 13676
17394A3676L9904j8517l466j884k5087n6343K46M6782K7328L1038j6543j7114
$$ 13676 53580 35063 31597 29713 4626 -51717 -51471 -4689 22639 53677 37134 20020
17382B0020K604r359o609K0564j3871J3494p386k1387k4017J2321J2422j5387
$$ 20020 22624 13265 6656 27220 13349 26843 19457 -1930 -25947 -13626 -1204 -16591
17370a6591J9136K9843k0868J1214N5269n919k8931n2009j4018o519J0925K1253
$$ -16591 2545 32388 11520 22734 78003 72084 43153 -8856 -22874 -29393 -18468 2785
17358B785J8667k0239o842K0789j5240k7461l503K569O334L9301N6980R695q976
$$ 2785 21452 1213 -5629 15160 -80 -27541 -31044 -28475 -22141 17160 74140 83835 74859
17345G4859K7262q630l5381l0959m2281q760N2546J5756k3634O355j1387m3265
$$ 74859 102121 93491 58110 27151 -15130 -23890 28656 44412 20778 27133 15746 -27519
17333b7519j6441K627j189N4990L9031l1740m552J1988J9627j5920k485k3479
$$ -27519 -43960 -41333 -42522 12468 51499 19759 15207 27195 46822 30902 28417 4938
17321D938j5346J1277O554P918j7421M0143k4064j7251J5289p078j6376j1265
$$ 4938 -10408 869 7423 15341 -2080 38063 13999 -3252 12037 4959 -11417 -22682
17309b2682o61L2487Q565J3220r842q616J492j7344J9234K7569K8881m878l0081
$$ -22682 -23343 9144 17709 30929 21087 12471 13963 -3381 15853 43422 72303 67425 37344
17296C7344j1846p418j5590P183Q880j6598K5434O7813L6079l6537p966K045l0530
$$ 37344 25498 18080 2490 9673 18553 1955 27389 95202 131281 94744 86778 88823 58293
17283E8293K336L755P175J5547Q455j8302m9134R597j0477p806l8043j7837N4151
$$ 58293 60629 64384 71559 87106 95561 77259 28125 37722 27245 19439 -18604 -36441 17710
17270A7710J1003k6651m4094j5828J2271j1830p703j140j7537N0733N0485J8118
$$ 17710 28713 2062 -42032 -57860 -45589 -57419 -65122 -66262 -83799 -33066 17419 35537
17258C5537L0545K8596m073j7379J0627K0336R145J4673K6578K8713j4122m0197
$$ 35537 66082 94678 90605 73226 83853 104189 113334 128007 154585 183298 169176 128979
17246A28979n4677m7857J4482M1560N5583J4991K4024k6649o9222l8130k6530
$$ 128979 74302 26445 40927 82487 138070 153061 177085 150436 81214 43084 16554
17235A6554j2674j21m0522K1690J0152l3256K1362o687J2143M1903j5032o2639
$$ 16554 3880 3759 -36763 -15073 -4921 -38177 -16815 -23502 -11359 30544 15512 -47127
17223d7127K5178K3581M5573o165o7110j5523M2645K1574j0430J3720k1343k0242
$$ -47127 -21949 1632 47205 41040 -26070 -41593 1052 22626 12196 25916 4573 -15669
17211a5669N7912k199j2157J4535K51J72j0707O700K7950N8481L6235J2809k7411
$$ -15669 42243 40044 27887 42422 42673 42845 32138 38838 66788 125269 161504 174313 146902
17198A46902k0049m6067m9899K3366K6394K9087N1862O994q166l880k6028m4692
$$ 146902 126853 80786 30887 54253 80647 109734 161596 168590 160424 156544 130516 85824
17186H5824k1698J3348K2991p809j4934l6205j3296L0294M317N156l1927k5095
$$ 85824 64126 77474 100465 92656 77722 41517 28221 58515 62832 67988 36061 10966
17174A0966j0048O156L4199L5326L6461l9999m6309o679k9490j0240k2250k6853
$$ 10966 918 7074 41273 76599 113060 73061 26752 20073 -9417 -19657 -41907 -68760
17162f8760M1418L4090J4251J0472k1656J5962l4681o013J0643l8226k0569K9629
$$ -68760 -27342 6748 20999 31471 9815 25777 -8904 -14917 -4274 -42500 -63069 -33440
17150c3440J6627K3729L9634k7336m0900J49M2491K3082j1507l3302k9041m3696
$$ -33440 -16813 6916 46550 19214 -21686 -21537 20954 44036 32529 -773 -29814 -73510
17138g3510j275N4016N8601R918P97J7667j0369k8732n0878R809K5498K4764M064
$$ -73510 -74785 -20769 37832 47750 48547 66214 55845 27113 -23765 -13956 11542 36306 40370
17125D0370l7101R25n439m7571n0582k1288L6383K7274L8075K847j8031k4231
$$ 40370 3269 4194 -1245 -48816 -99398 -120686 -84303 -57029 -18954 -16107 -34138 -58369
17113e8369l6943K0432L7169K2705J5703k8315j2063Q584J9058J8123o443j5455
$$ -58369 -95312 -74880 -37711 -15006 697 -27618 -39681 -31097 -12039 6084 -359 -15814
17101a5814K005o282j0618j6921K0340L5168L2649J1879m1036r246K8884J5720
$$ -15814 -13809 -20091 -30709 -47630 -27290 7878 40527 52406 11370 2124 31008 46728
17089D6728J7879j5223K487K5956k8313l8105k1762o385j6094m3940K3545N6999
$$ 46728 64607 49384 51871 77827 49514 11409 -10353 -16738 -32832 -76772 -53227 3772
17077C772L496K1747M9744J8708n2374n5118j0215M017J7356K0697m455j2089
$$ 3772 7268 29015 78759 97467 45093 -10025 -20240 -16223 1133 21830 17375 5286
17065E286M8155K7670l4971n3640l028j1140j0788J22L904J2074P837m460k9996
$$ 5286 53441 81111 46140 -7500 -10528 -21668 -32456 -32334 -28430 -16356 -8519 -12979 -42975
17052d2975L59L1772j1099k5586K952O267L745j7290k6048O01N3434K4941J1171
$$ -42975 -42616 -10844 -21943 -47529 -44577 -38310 -34565 -51855 -77903 -77302 -23868 1073 12244
17039A2244k1623L4252O613j5596r659j2038J9048k1637M217k9504N531o89K5938
$$ 12244 -9379 24873 31486 15890 6231 -5807 13241 -8396 -4179 -33683 -28152 -28841 -2903
17026b903M744k5404R051k935K4991L380o648p945k6026o794J5206K296K0583
$$ -2903 1841 -23563 -14512 -17447 7544 10924 4276 -3669 -29695 -36489 -21283 -18987 1596
17013A596M0449L3845J5884j6708n8722j6599J1038j7329j6536q102j5253L5031
$$ 1596 42045 75890 91774 75066 16344 -255 10783 -6546 -23082 -31184 -46437 -11406
17001a1406N0341p846n229k2885j6526p995L1739P9481O1145N8090J8900n2456
$$ -11406 38935 31089 25860 2975 -13551 -21546 10193 89674 150819 208909 227809 175353
16989A75353o3537m9617j7979J5567k1542k378K0673J6093L3132P2025j260p0484
$$ 175353 111816 62199 44220 59787 38245 35867 56540 72633 105765 177790 176530 106046
16977A06046m8636j4350J8808L4629N2858M1063L6513n3870m7662j3553o0375
$$ 106046 57410 43060 61868 96497 149355 190418 226931 173061 125399 111846 51471
16966E1471j9856J3781k1101l231J9145K7327O2176M4448k2920l6015m1194n5646
$$ 51471 31615 45396 24295 21064 40209 67536 129712 174160 151240 115225 74031 18385
16954A8385k1836N150M4836j5875k5428j1086j4168J2867J8354K113l859J0653
$$ 18385 -3451 1699 46535 30660 5232 -5854 -20022 -7155 11199 13312 9453 20106
16942B0106j5313m886P582j440p777k9812O214J159k33j7399P049J5912R229k8646
$$ 20106 4793 -93 7489 6049 -1728 -31540 -25326 -24167 -24400 -41799 -34750 -18838 -9609 -38255
16928c8255j3660O0981K7886j9355Q414M9322p674j799k567k0220k9655k2129
$$ -38255 -51915 9066 36952 17597 26011 75333 67659 65860 63293 43073 13418 -8711
16916h711m351K1024Q43J0042J9671j275k9570k273K2107J4745j2980J6380J3081
$$ -8711 -13062 7962 8805 18847 38518 37243 7673 5400 27507 42252 29272 45652 58733
16903E8733J422J6060m3226k1172l2915L5057N8062J6376k1152m2520p778L511
$$ 58733 60155 76215 32989 11817 -21098 13959 72021 88397 67245 24725 16947 20458
16891B0458J6216o324l1500o468j4715m6403n847M2356J8060R036J1379n2676
$$ 20458 36674 30350 -1150 -7618 -22333 -68736 -74583 -32227 -14167 -5131 6248 -46428
16879d6428q798M730J9857K6355J5115R984J3860l1467j3468Q695L483J9554r956
$$ -46428 -55226 -50496 -30639 -4284 10831 20815 34675 3208 -10260 -1565 1918 21472 11516
16866A1516k8006J6875K5148J454J1010l1264l631J0457n716l6325j3032L2518
$$ 11516 -16490 385 25533 26987 37997 6733 3102 13559 7843 -28482 -41514 -8996
16854h996M5019l1665J096N0034l9377n7734l4643N339J1108J8127Q170j4704
$$ -8996 36023 4358 5454 55488 16111 -41623 -76266 -70927 -59819 -41692 -33522 -48226
16842d8226l978O9557L8843k5554j9636O943l0060j8633o357p177J8453M6360
$$ -48226 -52204 17353 56196 30642 11006 17949 -12111 -30744 -37101 -44278 -25825 20535
16830B0535r502n4394K1363J4656l851j2031K2437Q607k1876K5768n996r222o293
$$ 20535 11033 -43361 -21998 -7342 -11193 -23224 -787 7820 -14056 11712 5716 -3506 -9799
16817i799m1388j8667r574R272M4273O0366j6640l863J3285M302J2146l9683l1116
$$ -9799 -51187 -69854 -79428 -70156 -25883 34483 17843 13980 27265 31567 43713 4030 -27086
16804b7086j4593K1583k4854K832j820O814R745K0853k1390j9883J5248J8622
$$ -27086 -41679 -20096 -44950 -42118 -43938 -37124 -27379 -6526 -27916 -47799 -32551 -13929
16792a3929K334q500P44m05K3535R339J4949q700l1339m41L154J9732R389q113
$$ -13929 -11595 -20095 -19351 -19756 3779 13118 28067 19367 -11972 -12413 -9259 10473 19862 11749
16778A1749q195k2016j6100K5750R399j4544J1785o821J3606j1866l704l1412
$$ 11749 3554 -18462 -34562 -8812 587 -13957 -2172 -8993 4613 -7253 -10957 -42369
16766d2369N524L8074J2610k4608Q413K4852k3460M522J7302K1242J8444p896
$$ -42369 -36845 1229 13839 -10769 -2356 22496 -964 3558 20860 42102 60546 52650
16754E2650k168P925r96q993j5219r220r816R677J7361K4325K3050p562j3846
$$ 52650 50482 58407 57411 48418 33199 23979 14163 23840 41201 65526 88576 81014 67168
16741F7168L6262L201k9202l6075j0355J5100j8494j482K138k8513K1934n259
$$ 67168 103430 106631 77429 41354 30999 46099 27605 26123 28261 -252 21682 16423
16729A6423n9231k7067j9023L7799K6670q562M067M7554j5794M537l296L805j388
$$ 16423 -42808 -69875 -88898 -51099 -24429 -32991 -28924 18630 2836 7373 4077 7882 6494
16716F494j9237j6772l0094r405M0159p858J87N2691M9084J5300m2969m1077l3201
$$ 6494 -12743 -29515 -59609 -69014 -28855 -36713 -36526 16165 65249 80549 37580 -3497 -36698
16703c6698K0266M1177p898l2389l193Q511k760K5243K8305K5884o213J9466R914
$$ -36698 -16432 24745 16847 -15542 -18735 -10224 -12984 12259 40564 66448 60235 79701 89615
16690H9615m5378m8709m774j2048j4077K9015q420m600m8068k3097K6181O2659
$$ 89615 44237 -4472 -9246 -21294 -35371 -6356 -14776 -19376 -67444 -90541 -64360 -1701
16678a701L4640K812p893m3321o6966J894J8085L0066O989J7727j4891n956J2185
$$ -1701 32939 35751 27858 -15463 -82429 -80535 -62450 -32384 -25395 -7668 -22559 -28515 -16330
16665a6330L946k7790J0398L0951J4759r116k1535J0758K2254L5422l9055j086
$$ -16330 -12384 -40174 -29776 1175 15934 6818 -14717 -3959 18295 53717 14662 13576
16653A3576j1988q104j4323m4229K7919N096K7563L1126K9886K1976k8077j6930
$$ 13576 1588 -6516 -20839 -65068 -37149 -32053 -4490 26636 56522 78498 50421 33491
16641C3491k8922r438l0496j7385J7140Q134K1928j2879J3304J1645m3183k0955
$$ 33491 4569 -4869 -35365 -52750 -35610 -27476 -5548 -18427 -5123 6522 -36661 -57616
16629e7616j6998o791J2530K4173K7605K6893R426l8869j0847j4596R013K4462
$$ -57616 -74614 -81405 -68875 -44702 -17097 9796 19222 -19647 -30494 -45090 -36077 -11615
16617a1615L6693J0668p61j9265m1529n402L9526P631q777n019m641J2306k6406
$$ -11615 25078 35746 34985 15720 -25809 -31211 8315 15946 7169 2150 -2491 9815 -16591
16604a6591m3169K7218K9179n128j9005K406O049j2145j4397K9391J9945R054
$$ -16591 -59760 -32542 -3363 -8491 -27496 -25090 -19041 -31186 -45583 -16192 3753 12807
16592A2807R819k1530j8428l3199j4017J2217k4659K1115J2128Q10P115M8767
$$ 12807 22626 1096 -17332 -50531 -64548 -52331 -76990 -55875 -43747 -42937 -35822 12945
16580A2945M243j4882j2086J2980n972m6215l3268J5112K4455j9877o400K1873
$$ 12945 17188 2306 -9780 3200 -2772 -48987 -82255 -67143 -42688 -62565 -68965 -47092
16568d7092L192K0255J9634k7132m0642L450M9619K8086J3303r795k5153L1608
$$ -47092 -43900 -23645 -4011 -31143 -71785 -68335 -18716 9370 22673 12878 -12275 19333
16556A9333l468m693L631p453N125l1850k0026K9908M3916P757K504L571K779
$$ 19333 15865 11172 14803 7350 12475 -19375 -39401 -9493 34423 42180 44684 48255 51034
16543E1034l5854l1975k4898j7482K6130J5933n641J3997l083j2234l904K0238
$$ 51034 15180 -16795 -41693 -59175 -33045 -17112 -22753 -8756 -11839 -24073 -27977 -7739
16531g739L0989j0061m5063J9693Q729N902P55K5463K8707k1410m2941M311J7938
$$ -7739 23250 13189 -31874 -12181 -3452 2450 3205 28668 57375 35965 -6976 -2665 15273
16518A5273j591J7357j887l474K750k5544L1787L3157J4777m0235r899J9513k7518
$$ 15273 13682 31039 29152 25678 28428 2884 34671 67828 82605 42370 32471 51984 24466
16505B4466O977J3617M887p597Q039j3496k2004l3074R88K6184j7975P053k6702
$$ 24466 31443 45060 49947 42350 50389 36893 14889 -18185 -17197 8987 -8988 -1935 -28637
16492b8637K1035L4120k3876k1335Q761j0273K5662K0066m4961l4954J873p65
$$ -28637 -7602 26518 2642 -18693 -9932 -20205 5457 25523 -19438 -54392 -52519 -53284
16480e3284L1814R075l535j9744K183J4146Q730K5089k067K6239P439l3322l5668
$$ -53284 -21470 -12395 -15930 -35674 -33491 -19345 -10615 14474 12407 38646 46085 12763 -22905
16467b2905o290K2938k3418r560r94O401K7146J2137p67L9415J0149K0610k9930
$$ -22905 -29195 -6257 -29675 -39235 -40229 -33828 -6682 5455 4688 44103 54252 74862 44932
16454D4932l1214K850J702k080O008l6615K309J4151p874r358n775J2523l140
$$ 44932 13718 16568 18270 16190 22198 -14417 -12108 2043 -5831 -15189 -20964 -8441 -11581
16441a1581j362K0760J3249K0943J6385m159o249j4173k8267k8387L8798J9536
$$ -11581 -12943 7817 21066 42009 58394 54235 47986 33813 5546 -22841 15957 35493
16429C5493p049j2098n513p936n661J705J3361j3416k167p832p386l5213J4100
$$ 35493 28444 16346 10833 2897 -2764 -1059 12302 -1114 -3281 -11113 -18499 -53712 -39612
16416c9612J5415J7523j4170o376J2241K868m6133J3122L5043J10o089Q467J6881
$$ -39612 -24197 -6674 -20844 -27220 -14979 -12111 -58244 -45122 -10079 -9969 -16058 -7591 9290
16403I290l2582j3836k766K6623J3035o228j8344l543J8168M3569J1170k6392
$$ 9290 -23292 -37128 -39894 -13271 -236 -6464 -24808 -28351 -10183 33386 44556 18164
16391A8164J58j4457o771q284N574K9984n238j7619K8384N699j2873k7144k2548
$$ 18164 18322 3865 -2906 -11190 -5616 24368 19130 1511 29895 35594 22721 -4423 -26971
16378b6971j7200R210J4917K5303N372l5707j1545j1634L0946J4352J5286R432
$$ -26971 -44171 -34961 -20044 5259 10631 -25076 -36621 -48255 -17309 -2957 12329 21761
16366B1761m958j2361j672j1847m5959N880L7172k6075k3488L5872Q866q460l3622
$$ 21761 16803 4442 2770 -9077 -55036 -49156 -11984 -38059 -61547 -25675 -16809 -25269 -58891
16353e8891N874J3681k1839k2592M3169K5125l6001J0069L2237K2397J3359l3613
$$ -58891 -53017 -39336 -61175 -83767 -40598 -15473 -51474 -41405 -9168 13229 26588 -7025
16341g025m1322q12J559J8689L475K5621L225R12j6744k712K5581k8587k3046
$$ -7025 -48347 -49159 -47600 -28911 -25436 185 3410 4322 -12422 -15134 10447 -18140 -41186
16328d1186J7282J1488N094L3030j4960l1686n0509J677N13L2286L2805J0486
$$ -41186 -23904 -12416 -7322 25708 10748 -20938 -71447 -69770 -69257 -36971 -4166 6320
16316F320k916m6893n0215J9371J6098J3114L6368J14l8051o301P1618n654j6884
$$ 6320 3404 -43489 -93704 -74333 -58235 -45121 -8753 -8639 -46690 -52991 18627 12973 -3911
16303c911j5855m1584k80J3089M2320Q848K0631k3717m8462L3509k82l8693k5749
$$ -3911 -19766 -61350 -61630 -48541 -6221 2627 23258 -459 -48921 -15412 -15694 -54387 -80136
16290h0136O301J590J7077O07K953N2769N8622j9033k3951K8575J8041J432j819
$$ -80136 -73835 -72245 -55168 -54561 -51608 1161 59783 40750 16799 45374 63415 64847 63028
16277F3028m3163l7914m608L960k3337r415N403J2998J1442r951M4915R086j3999
$$ 63028 19865 -18049 -22657 -18697 -42034 -51449 -46046 -33048 -21606 -31557 13358 22444 8445
16264H445m9051l155L6777L6373j6366j963l1696R703O1297j366m3899k4733J3721
$$ 8445 -40606 -43761 -6984 29389 13023 11060 -20636 -10933 50364 48998 5099 -19634 -5913
16251e913M0756J0102K39j9815k2862j9741M333N1960J4982j279j0851k1656K8137
$$ -5913 34843 44945 45184 25369 2507 -17234 -12901 39059 54041 52762 41911 20255 48392
16238D8392l2579l0639k7653k313k2221q640j984K335M0299M344n9723L9865L2329
$$ 48392 15813 -14826 -42479 -44792 -67013 -75653 -77637 -75302 -35003 -30659 -90382 -50517 -18188
16225a8188L0425K3706j1291j1241J4415l9730j785n85m8506J638L3142K4309
$$ -18188 12237 35943 24652 13411 27826 -11904 -13689 -14274 -62780 -61142 -28000 -3691
16213c691j9k6409R755N6286l5794m5859q677J7903o135J4691M8919J2783J4925
$$ -3691 -3710 -30119 -20364 35922 128 -45731 -54408 -36505 -42640 -27949 20970 33753 48678
16200D8678r86J461M84j9196j1859K4206k5536k463K0961j4304q418j2425m2712
$$ 48678 47692 49153 49637 30441 18582 42788 17252 14789 35750 21446 13028 603 -42109
16187d2109k746K5997j3866k9509p410O419M364j2335n383N676m282J7351m277
$$ -42109 -44855 -18858 -32724 -62233 -69643 -63224 -58860 -71195 -76578 -70902 -75184 -57833 -62110
16174f2110K1561J5697J6930J0001M5041L8695k2085j8387J5351p939K0249J1227
$$ -62110 -40549 -24852 -7922 2079 47120 85815 63730 45343 60694 52755 73004 84231
16162H4231R230k6118l6256R065P676n1044l3062R223J4715o195q997J6691L1932
$$ 84231 93461 67343 31087 40152 47828 -3216 -36278 -27055 -12340 -18535 -27532 -10841 21091
16149B1091p49k3439k8974K5595R115r526P878P057P3J3371P92L622m0494k2700
$$ 21091 20342 -3097 -32071 -6476 2639 -6887 991 8048 8121 21492 22284 25906 -14588 -37288
16135c7288k2240J1839j1357P208K3068l2617l5289k3724L9586M2728J9m029K3562
$$ -37288 -59528 -47689 -59046 -51838 -28770 -61387 -96676 -120400 -80814 -38086 -38067 -42096 -18534
16122a8534K3405O545k1565N429J2356J1074j109J4464J7327L409j6436J3447
$$ -18534 4871 11416 -10149 -4720 7636 18710 17601 32065 49392 52801 36365 49812
16110D9812M970l8591k6587J8116L2854m264J1227K5928j5176l7114l0995J4124
$$ 49812 54782 16191 -10396 7720 40574 36310 47537 73465 58289 21175 -9820 4304
16098D304j4115j4192K242j0235m0222r93K0732J3277K6585J9314K2615l9332
$$ 4304 -9811 -24003 -21761 -31996 -72218 -73211 -52479 -39202 -12617 6697 29312 -10020
16086a0020k6147J448J8710K2570m562J4280j7981P340J5493j610j9273l4281
$$ -10020 -36167 -34719 -16009 6561 1999 16279 -1702 5638 21131 19521 248 -34033
16074c4033l0026J1293N043K5263j205K2485K625o604j8673o398j0404J9987n083
$$ -34033 -64059 -52766 -47723 -22460 -23665 -1180 1445 -5159 -23832 -30230 -40634 -20647 -25730
16061b5730K6100L223n3155r424J4339L3034P3700K4468q0147l6004J52J8251
$$ -25730 370 3593 -49562 -58986 -44647 -11613 62087 86555 6408 -29596 -29444 -11193
16049a1193l435R245J2624r181q552k030Q783L276J3155o950l346R151P622k9846
$$ -11193 -14628 -5383 7241 -1940 -10492 -12522 -3739 -463 12692 5742 2396 11547 19169 -10677
16035a0677l2498l1188O5116J2798n6994l1609J4485K2121K8272J7312J4889k0449
$$ -10677 -43175 -74363 -9247 3551 -53443 -85052 -70567 -48446 -20174 -2862 12027 -8422
16023h422j493J5548j2779N657j9490Q051M2024J6253k1158m7668N435K2527j4368
$$ -8422 -9915 5633 -7146 -1489 -20979 -12928 29096 45349 24191 -23477 -18042 4485 -9883
16010i883J4911j4496n4149m396j197L0388K1612L3779k08k1382k0735O999l6891
$$ -9883 5028 -9468 -63617 -68013 -69210 -38822 -17210 16569 16361 -5021 -25756 -18757 -55648
15997e5648o342j3129j90j6222l57Q7153M4654J7822k9523m2840l7483J3676J8689
$$ -55648 -61990 -75119 -75309 -91531 -91888 -4735 39919 57741 28218 -14622 -52105 -38429 -19740
15984a9740J7321K0713j6348m2014k2673L2485J4610m1794k7178L3260m744K3513
$$ -19740 -2419 18294 1946 -40068 -62741 -30256 -15646 -57440 -84618 -51358 -56102 -32589
15972c2589K6217o762j02K3351j4637r478R670k3870n75n1870n783N2273K8956
$$ -32589 -6372 -13134 -13236 10115 -4522 -14000 -4330 -28200 -28775 -80645 -86428 -34155 -5199
15959e199J5118J8767J85j5850J1185L0490j3020k2985J2399l29R743l2028k3250
$$ -5199 9919 28686 28871 13021 24206 54696 41676 18691 31090 30761 40504 8476 -14774
15946a4774J6335K2614J194m0240l805K0072R037j8956J9809j0131J8756J2389
$$ -14774 1561 24175 25369 -14871 -18676 1396 10433 -8523 11286 1155 19911 32300
15934C2300k065j2400j119p304R735K559J9777k3744m6096J1663j624j4673J5180
$$ 32300 30235 17835 16716 9412 19147 21706 41483 17739 -28357 -16694 -18318 -32991 -17811
15921a7811k303L0326L9824j2322m1325r429j2589j0157N549K6008J4032k3021
$$ -17811 -20114 10212 50036 37714 -3611 -13040 -25629 -35786 -30237 -4229 9803 -13218
15909a3218J4847o40j0798K2575L745L840k7890j1837J2514O513l1499K670O475
$$ -13218 1629 989 -9809 12766 16511 20351 -7539 -19376 -6862 -349 -31848 -29178 -22703
15896b2703O576L4426j0553j2990R485o23n466L5229L3727l0596m8322m438k5184
$$ -22703 -16127 18299 7746 -5244 4241 3618 -1848 33381 67108 36512 -11810 -16248 -41432
15883d1432J0479L3748k955p843K9023j2620J065o08p423j2523L1254J2991n8476
$$ -41432 -30953 2795 -160 -8003 21020 8400 9465 8857 1434 -11089 20165 33156 -25320
15870b5320j6676M5765K395K699O803j9140n408P368P813J1808K2888k327K1909
$$ -25320 -41996 3769 6164 8863 15666 -3474 -8882 -1514 6299 18107 40995 38668 60577
15857F0577J0488l0019j6781K4603m608j2293l9154j7438M8500N343o2791N945
$$ 60577 71065 41046 24265 48868 44260 31967 -7187 -24625 23875 29218 -33573 -27628
15845b7628J5447J9277J780J9241L7245O46k2657k557J1650j7559k2337k036K2002
$$ -27628 -12181 7096 8876 28117 65362 66008 43351 40794 52444 34885 12548 10512 32514
15832C2514l8017k368L3734p945o4978l5529o7136M5707K5510j6792N9801L6479
$$ 32514 -5503 -7871 25863 17918 -47060 -82589 -149725 -104018 -78508 -95300 -35499 980
15820I80J9723m353k8550j9243J8918K4789j8176n0913j581o437K7271Q673j3251
$$ 980 20703 16350 -12200 -31443 -12525 12264 -5912 -56825 -58406 -64843 -37572 -28899 -42150
15807d2150N0741K7424P971J1963m6673l2335l901K6669M8797r451j6140j6549
$$ -42150 8591 36015 43986 55949 9276 -23059 -26960 -291 48506 39055 22915 6366
15795F366l2578j475q073L8854L2859p331J6684k0131k3889P463k1004K3039K7046
$$ 6366 -26212 -27687 -35760 3094 35953 28622 45306 25175 1286 8749 -12255 10784 37830
15782C7830q918l1294N21J9531j0815j3876K861m294k1115N658r939P054L3400
$$ 37830 28912 -2382 -1861 17670 6855 -7021 -4160 -8454 -29569 -23911 -33850 -26796 6604
15769F604L7931j4925r861l3503N245M8362J6293k5332m6930k9886M9021l1826
$$ 6604 44535 29610 19749 -13754 -8509 39853 56146 30814 -16116 -46002 3019 -28807
15757b8807J1090M1734L2649k6242O505q91m6412p499K7395j1048j6153J3837
$$ -28807 -17717 24017 56666 30424 36929 36038 -10374 -17873 9522 -1526 -17679 -3842
15745c842N251k86j0043l1980M394k3435N520L1041j122j5484K685n57J3391L2781
$$ -3842 1409 1123 -8920 -40900 -36506 -59941 -54421 -23380 -24502 -39986 -37301 -37858 -24467 8314
15731H314j6746j0225j1436o256L846q163k4355J8521l354J4060j3008j6942J0856
$$ 8314 -8432 -18657 -30093 -36349 -32503 -40666 -65021 -46500 -49854 -35794 -48802 -65744 -54888
15718e4888j59M4807J5134j4805J4097L105J6226J1673l5976l0991j3373o204
$$ -54888 -55047 -10240 4894 -9911 4186 7291 23517 35190 -786 -31777 -45150 -51354
15706e1354j2366J3377k801K5695M07L012K6366k449K6312J9313M1330k6457m4673
$$ -51354 -63720 -50343 -53144 -27449 -27042 -24030 2336 -113 26199 45512 86842 60385 15712
15693A5712k1199R580M0328k9818k2353l7044J9615N3921n913j5965k5739K0385
$$ 15712 -5487 4093 44421 14603 -7750 -44794 -25179 28742 22829 6864 -18875 1510
15681A510K1107j9286j9014j8657r056K644K6759L3164J8276q410j703p452k4046
$$ 1510 22617 3331 -15683 -34340 -43396 -40752 -13993 19171 37447 29037 27334 19882 -4164
15668d164J6518k4138N806K8506j5965j483k6177l3424L811K7569J1025j6362
$$ -4164 12354 -11784 -5978 22528 6563 5080 -21097 -54521 -50710 -23141 -12116 -28478
15656b8478j1819R977l720j2710k5579J5185J5765l4233K1149K6815j1605J5612
$$ -28478 -40297 -30320 -34040 -46750 -72329 -57144 -41379 -75612 -54463 -27648 -39253 -23641
15644b3641J1530J8258J9063k7338k302j1125O663O789k124J0488L9549k1984
$$ -23641 -12111 6147 25210 -2128 -4430 -15555 -8892 -2103 -4227 6261 45810 23826
15632B3826j6545K2324q716k4198K1470J2172r220l007K3873j3925j8631M131
$$ 23826 7281 29605 20889 -3309 18161 30333 21113 18106 41979 28054 9423 13554
15620A3554j2889m590Q117K8865j4069p857n542j739j3013m017N551j3512L690
$$ 13554 665 -3925 4192 33057 18988 11131 5589 3850 -9163 -13180 -7629 -21141 -17451
15607a7451j5767J0254K7189K6977k1648J796J3713K898n3358k8435K5025m4998
$$ -17451 -33218 -22964 4225 31202 9554 11350 25063 27961 -25397 -53832 -28807 -73805
15595g3805k7952K1972M5622K4428N561j647P943j8094j4845j1121l801J3420
$$ -73805 -101757 -79785 -34163 -9735 -4174 -5821 2122 -15972 -30817 -41938 -45739 -32319
15583c2319L250N915j2625l413Q802P807r731J837R25j2024M905k8437K7672L2043
$$ -32319 -29069 -23154 -35779 -39192 -30390 -22583 -32314 -30477 -29552 -41576 -36671 -65108 -37436 -5393
15569e393L866k4956J8145P212k1800p39q583q951K718N1152K8876m7523o811
$$ -5393 -1527 -26483 -8338 -1126 -22926 -23665 -32248 -41199 -38481 12671 41547 -5976 -12787
15556a2787L9763M188M9566M1517k3419l0106l2059j3280l4221j4796K8264J0116
$$ -12787 26976 31164 80730 122247 98828 68722 36663 23383 -10838 -25634 2630 12746
15544A2746J0932K4763L897n8558m8709m959j5930o55L7233L0694J1497k3163
$$ 12746 23678 48441 52338 -6220 -54929 -59888 -75818 -76473 -39240 -8546 2951 -20212
15532b0212K4495L790m5421k7217M5719K7600J193m12P527p497k5417m6902m3029
$$ -20212 4283 8073 -37348 -64565 -18846 8754 9947 9535 17062 9565 -15852 -62754 -105783
15519a05783K4109P2686Q084J665J3277l9363p901Q143K5080j8035m6998L323
$$ -105783 -81674 -8988 -904 761 14038 -25325 -33226 -25083 -3 -18038 -65036 -61713
15507f1713J6643j1405K3535K7121N844K8032j3132j2939j3724m8665r985j32
$$ -61713 -45070 -56475 -32940 -5819 25 28057 14925 1986 -11738 -60403 -70388 -70520
15495g0520L2149j8084R084J9927k0175j0151J2080J0490L6987j133L890m61l7818
$$ -70520 -38371 -56455 -47371 -27444 -47619 -57770 -45690 -35200 1787 654 4544 4083 -33735
15482c3735k5673K2599J6252K4180q126o15k8187o837K0591J7836m8587P680J6685
$$ -33735 -59408 -36809 -20557 3623 -4503 -5118 -33305 -40142 -19551 -1715 -50302 -42622 -25937
15469b5937K1318K7446k053k4177K6256P793o06l5197j2290K1496K4215k8878
$$ -25937 -4619 22827 20774 -3403 22853 30646 30040 -5157 -17447 4049 28264 -614
15457f14k8085L4234L3948J6039k8376k8177k3440Q170K525K4523J4304l1438
$$ -614 -28699 5535 39483 55522 27146 -1031 -24471 -16301 -13776 10747 25051 -6387
15445f387J5645o062j1914K6399j293J1760K0749J1320o320k8454j6794M132k4752
$$ -6387 9258 3196 -8718 17681 16388 28148 48897 60217 53897 25443 8649 12781 -11971
15432a1971p010k7813J2429J2311M3919K3479k2557K687L1565O885N483k7074
$$ -11971 -18981 -46794 -34365 -22054 21865 45344 22787 25474 57039 63924 69407 42333
15420D2333j5849j5404l3951j630K8337O607J4170J0633k4340O801J5142o967
$$ 42333 26484 11080 -22871 -24501 3836 10443 24613 35246 10906 17707 32849 25882
15408B5882J88M290j7398K753N910K2065l326l6101L0317k7337k9268p015q547
$$ 25882 26070 30360 12962 15715 21625 43690 40364 4263 34580 7243 -22025 -29040 -37587
15395c7587k0046j6774K710p304J3144K251j0745p415k1348L8628J3015j528L2122
$$ -37587 -57633 -74407 -71697 -79001 -65857 -63606 -74351 -81766 -103114 -64486 -51471 -52999 -20877
15382b0877J1505p181K0606J6240j738o791k6089n3621J0278J7440l8136J5633
$$ -20877 -9372 -16553 4053 20293 18555 11764 -14325 -67946 -57668 -40228 -78364 -62731
15370f2731L5607L0164J1483J5180j8300j8439J130k4678o698k663M563J5988
$$ -62731 -27124 3040 14523 29703 11403 -7036 -5906 -30584 -37282 -39945 -35382 -19394
15358a9394l8341l1092L421M1820L9073M2810j025k5776J3590R495K8564L388
$$ -19394 -57735 -88827 -85406 -43586 -4513 38297 37272 11496 25086 34581 63145 66533
15346F6533l4520m294J8809n984J569l600K1771j4643o4147n4959Q705r7J0671
$$ 66533 32013 27719 46528 40544 42113 38513 60284 45641 -18506 -73465 -64760 -64857 -54186
15333e4186O396O323K6758k909k9962K2195R299J3345k5890L3684M3463j8268
$$ -54186 -47790 -41467 -14709 -17618 -47580 -25385 -16086 -2741 -28631 5053 48516 30248
15321C0248k0318k1200n916j0340q228j4860o341M1377m25J3663j5138r32Q80
$$ 30248 9930 -11270 -17186 -27526 -35754 -50614 -56955 -15578 -16003 -2340 -17478 -18410 -17530
15308a7530j2455K4802L3903L7232L637K9136j9977n2460j5675J4483J2859r469
$$ -17530 -29985 -5183 28720 65952 69589 98725 78748 26288 10613 25096 37955 28486
15296B8486q533P884l1572k505j6431j4841l5028j1294K2993O3167Q059R162J2642
$$ 28486 19953 27837 -3735 -6240 -22671 -37512 -72540 -83834 -60841 2326 10385 19547 32189
15283C2189k0673J1019k2182j1580J4732J5621J6185L08l4223J582l8486O446
$$ 32189 11516 22535 353 -11227 3505 19126 35311 35619 1396 2978 -35508 -29062
15271b9062L1871K0459r233m806Q156j7940k4119j9994m16j3013j1187K0422J6610
$$ -29062 2809 23268 14035 9229 17385 -555 -24674 -44668 -45084 -58097 -69284 -48862 -32252
15258c2252P252p837j8804K1968L3016j4176n364M5741j061j6561j6064J2376
$$ -32252 -25000 -32837 -51641 -29673 3343 -10833 -16197 29544 28483 11922 -4142 8234
15246H234J2102k5107o128P257R618P021j1199k7571j6970j7087K0837m614L2320
$$ 8234 20336 -4771 -10899 -3642 5976 12997 1798 -25773 -42743 -59830 -38993 -43607 -11287
15233a1287J9916j1364j9937r038k598o413k7205J152M8406J195N688J4869n6227
$$ -11287 8629 -2735 -22672 -31710 -34308 -40721 -67926 -66774 -18368 -17173 -11485 3384 -52843
15220e2843j9783q205L6537J8640K8940l4562m0893L943J8329J6489K4418j3533
$$ -52843 -72626 -80831 -44294 -25654 3286 -31276 -72169 -68226 -49897 -33408 -8990 -22523
15208b2523P50L5266o6253k0931K9671R707M0312L3493l8137q408M683J1381j1296
$$ -22523 -21773 13493 -52760 -73691 -44020 -34313 5999 39492 1355 -7053 -2370 9011 -2285
15195b285l5892k391K7231K6414J317J1592j9310k0185k2817O115K5316M321O725
$$ -2285 -38177 -40568 -13337 13077 14394 25986 6676 -13509 -36326 -30211 -4895 -574 6151
15182F151r54K4531j3789o1096k0979L3274j2103j0100P381R190M6780L6511j4850
$$ 6151 5197 29728 15939 -45157 -66136 -32862 -44965 -55065 -47684 -38494 8286 44797 29947
15169B9947N9352K3417m1098k5158j2025j8391m1222J0040L6725o09K8674L057
$$ 29947 89299 112716 71618 46460 34435 16044 -25178 -15138 21587 20978 49652 52709
15157E2709n4108j1036K4422l1914m173l398k0695J4522N4140J3743k2072L118
$$ 52709 -1399 -12435 11987 -19927 -24100 -27498 -48193 -33671 20469 34212 12140 15258
15145A5258J4870K1451p610m1415k8171j4840K8184J142q384j5757N466K9036
$$ 15258 30128 51579 43969 2554 -25617 -40457 -12273 -11131 -19515 -35272 -29806 -770
15133g70K1557j0170m1452K2182J4102J3982j024J004L162l4483l3264n868K1122
$$ -770 20787 10617 -30835 -8653 5449 19431 18407 19411 22573 -11910 -45174 -51042 -29920
15120b9920n551j2042k78K1285M8883L1081K571l7033l0663L9j0306J3006k2759
$$ -29920 -35471 -47513 -47791 -26506 22377 53458 56029 18996 -11667 -11628 -21934 -8928 -31687
15107c1687r276k3739J5592K0636Q949J4088l6710o023M850o1L636j3738J5262
$$ -31687 -40963 -64702 -49110 -28474 -19525 -5437 -42147 -48170 -43320 -43381 -39745 -53483 -38221
15094c8221j3201j4691k1537n3L9680J2558l154l2406K2811K9721L617J512J023
$$ -38221 -51422 -66113 -87650 -87703 -48023 -35465 -38619 -71025 -48214 -18493 -14876 -13364 -12341
15081a2341r661j0317l3224M389j1457j4721K8932R217J9804N8126L2094n6697
$$ -12341 -22002 -32319 -65543 -61154 -72611 -87332 -58400 -49183 -29379 28747 60841 4144
15069D144n0460r293M9022q065j681P4044L4374l2749n1244k2803J8773J063Q723
$$ 4144 -46316 -55609 -6587 -14652 -16333 57711 92085 59336 8092 -14711 4062 5125 13848
15056A3848R551r637j4745l760L4307J4065k2423k4021l5284L979M8913p718N981
$$ 13848 23399 13762 -983 -4743 29564 43629 21206 -2815 -38099 -34120 14793 7075 13056
15043A3056K563P739J1080k2375L075J1400j256J545J3629k5059m405J2069k1421
$$ 13056 15619 23358 34438 12063 15138 26538 25282 26827 40456 15397 10992 23061 1640
15030A640k6194Q777L5300j9857j4635M0449J2266m173j6734J1540j2134L8328
$$ 1640 -24554 -15777 19523 -334 -14969 25480 37746 33573 16839 28379 16245 54573
15018E4573l3720k6608J973p029k1578m603J6160j6256n085J447j1661L8061J5148
$$ 54573 20853 -5755 -3782 -10811 -32389 -36992 -20832 -37088 -42173 -40726 -52387 -14326 822
15005H22q337J1068L0390j3879j1928K65j6073J4194J1546j4461k8167j629j6010
$$ 822 -7515 3553 33943 20064 8136 8401 -7672 6522 18068 3607 -24560 -26189 -42199
14992d2199N113K0432R413j3829L2114j7056K4508J3045m4635j2161J5566O927
$$ -42199 -37086 -16654 -7241 -21070 11044 -6012 18496 31541 -13094 -25255 -9689 -2762
14980b762j0882m233k0606j1700K8939K9918o505j0742o184j4841K0472J2752
$$ -2762 -13644 -17877 -38483 -50183 -21244 8674 2169 -8573 -14757 -29598 -9126 3626
14968C626k8751K5002O1448J1426k5387k2977k541l2085o578j0958j8442m170
$$ 3626 -25125 -123 61325 72751 47364 24387 21846 -10239 -16817 -27775 -46217 -50387
14956e0387j7247K5423J759j4695Q49j3693J2086p768K5911K2807J0391L0041
$$ -50387 -67634 -42211 -40452 -55147 -54298 -67991 -55905 -63673 -37762 -14955 -4564 25477
14944B5477j8694o13J1095j4183j2482L237j917j1785P599M176Q87N007L6027
$$ 25477 6783 6170 17265 3082 -9400 -6163 -8080 -19865 -12266 -8090 -7203 -2196 33831
14931C3831K168l891r933k599J8452m6658l6555R270M1263L6315j8102m5486k3288
$$ 33831 35999 32108 22175 19576 38028 -8630 -45185 -35915 5348 41663 23561 -21925 -45213
14918d5213L4436K0088J3525l4261L018J4332m273l0354M291O282J5907M40q335
$$ -45213 -10777 9311 22836 -11425 -8407 5925 1652 -28702 -24411 -18129 -2222 -1782 -10117
14905a0117K276p710l86j9820K6022N8746j6048o489p248M1872j2408m9325k8516
$$ -10117 -7841 -15551 -15937 -35757 -9735 49011 32963 26474 19226 61098 48690 -635 -29151
14892b9151P999O253R9r731M0446K3326n6859j3275J5747m300J4499J0774R903
$$ -29151 -21152 -14899 -14800 -24531 15915 39241 -17618 -30893 -15146 -19446 -4947 5827 15730
14879A5730M5683J47m1368J6622K0662o574l1734N896K0508L7961l018l6478J8139
$$ 15730 61413 61560 20192 36814 57476 50902 19168 25064 45572 83533 80515 44037 62176
14866F2176k022m0243k1267K4925k4501j3706J1383j1519m4622J559L6278K9044
$$ 62176 60154 19911 -1356 23569 -932 -14638 -3255 -14774 -59396 -57837 -21559 7485
14854G485M897K2544n1881n605j4812j7746p724M414L8402K7711j8992m1095k5960
$$ 7485 12382 34926 -16955 -22560 -37372 -55118 -62842 -58428 -20026 7685 -11307 -52402 -78362
14841g8362J8857L2193N2860R587j1479n1508m4208J3146K6571M0841k9095j7172
$$ -78362 -59505 -27312 25548 35135 23656 -27852 -72060 -58914 -32343 8498 -20597 -37769
14829c7769p096l7122R87L2014J2785P604L0036K6039k5437l2377J7841K9626
$$ -37769 -44865 -81987 -81000 -48986 -36201 -28597 1439 27478 2041 -30336 -12495 17131
14817A7131N622m3269K1897O861J0897N883J1036Q278K704o135Q290k3820m1140
$$ 17131 22753 -20516 1381 8242 19139 25022 36058 44336 47040 40905 49195 25375 -15765
14804a5765K449P143J005k1009m263L6622O201m1571p30J8988L668r337l4414
$$ -15765 -13316 -6173 -5168 -26177 -30440 6182 12383 -29188 -29918 -10930 -7262 -16599 -51013
14791e1013j1314K7338K794n938J3132M5286K448k4059j782j4515M461J1262n877
$$ -51013 -62327 -34989 -32195 -38133 -25001 20285 22733 -1326 -3108 -17623 -13162 -1900 -7777
14778g777j6612K7229j8858K5768j810K2320M35l48k7255o612j0577K0133j0375
$$ -7777 -24389 2840 -16018 9750 7940 30260 30695 30347 3092 -3520 -14097 6036 -4339
14765d339k4378P075k7410J4169J917J1373j084R894l729J268q938J5732k1409
$$ -4339 -28717 -21642 -49052 -34883 -32966 -21593 -22677 -12783 -16512 -15244 -24182 -8450 -29859
14752b9859k9902k0351J9173M3412m561m6105p169J7801K2678J9993M4173O3268
$$ -29859 -59761 -80112 -60939 -17527 -22088 -68193 -75362 -57561 -34883 -14890 29283 92551
14740I2551K080n2928o1107Q325R610r113j7130L2579J7617P874l9970n721K3117
$$ 92551 94631 41703 -19404 -11079 -1469 -10582 -27712 4867 22484 30358 -9612 -15333 7784
14727G784l9412j827k362o341k9102j6515P107K3062J9534K0724k655j4720L3757
$$ 7784 -31628 -33455 -35817 -42158 -71260 -87775 -80668 -57606 -38072 -17348 -20003 -34723 -966
14714i66J6719j854N11l5882L0391J4455m1304m3685j6507J2574n383J0882L311
$$ -966 15753 13899 14410 -21472 8919 23374 -17930 -61615 -78122 -65548 -70931 -60049 -56738
14701e6738N1271L3983k2098n7559K797L7167Q499L59P506j2286L2624J3342P174
$$ -56738 -5467 28516 6418 -51141 -48344 -11177 -2678 -2319 5187 -7099 25525 38867 46041
14688D6041j9144L3409K4748n084n7542M664m699l8611K0020N7901J5349k7625
$$ 46041 26897 60306 85054 79970 22428 27092 22393 -16218 3802 61703 77052 49427
14676D9427j4540j0197O616J2028j2844k2801k0074k972J4791k241M6829l372
$$ 49427 34887 24690 31306 43334 30490 7689 -12385 -15357 -566 -2807 44022 40650
14664D0650l5817k1970M832j1835j3970j3736l1336M1860J0049L531J1919J1114
$$ 40650 4833 -17137 -12305 -24140 -38110 -51846 -83182 -41322 -31273 -27742 -15823 -4709
14652d709P223J580J0459k4505n5857k8395J6274N7373M5572j1181K0733o443
$$ -4709 2514 4094 14553 -9952 -65809 -94204 -77930 -20557 25015 13834 34567 28124
14640B8124m2898l4321M6051L1273K6081j7977k1668l1215j2018j1550j0572Q982
$$ 28124 -14774 -49095 -3044 28229 54310 36333 14665 -16550 -28568 -40118 -50690 -41708
14628d1708L1697m4638Q499K1455K224R554O145k4192k6353M4715L7361J0340
$$ -41708 -10011 -54649 -46150 -24695 -22471 -12917 -6772 -30964 -57317 -12602 24759 35099
14616C5099J8569J0841l4759m0947j4797J9173j6652n7306J0178J5361M5155l3970
$$ 35099 53668 64509 29750 -11197 -25994 -6821 -23473 -80779 -70601 -55240 -10085 -44055
14604d4055j2707M8130L7344k7744j0108n161q928K1244K5319j8973L156j8271
$$ -44055 -56762 -8632 28712 968 -9140 -14301 -23229 -1985 23334 4361 7517 -10754
14592a0754K7054j0225n5931l9180j8187N2051K2720J6412K8622L5502k0737j106
$$ -10754 16300 6075 -49856 -89036 -107223 -55172 -32452 -16040 12582 48084 27347 26241
14580B6241L7078J8685k8974N183o222j7091j6359K694L390K0118J7346k6004
$$ 26241 63319 82004 53030 58213 51991 34900 18541 21235 24625 44743 62089 36085
14568C6085L346j0221J3101j8333j8330Q698j2023R506k7377m759K7149r077p0056
$$ 36085 39431 29210 42311 23978 5648 14346 2323 11829 -15548 -20307 6842 -2235 -72291
14555g2291M067K7750R957j3443J6750J8996j6473q206L2946N9988j2465l5285
$$ -72291 -68224 -40474 -30517 -43960 -27210 -8214 -24687 -32893 53 60041 47576 12291
14543A2291m5105K249K0521K5827J2039K932m884J2824K662m431K6261m407l7003
$$ 12291 -32814 -30565 -10044 15783 27822 30754 25870 38694 41356 36925 63186 58779 21776
14530B1776m6054k924K5630k0785j7497m2600K405K2854L2118K3033j1838J9256
$$ 21776 -24278 -27202 -1572 -22357 -39854 -82454 -80049 -57195 -25077 -2044 -13882 5374
14518E374R90l1835m377Q777K8880L3364k5140l2461j2911k830M2309j4034j3545
$$ 5374 6364 -25471 -29848 -21071 7809 41173 16033 -16428 -29339 -32169 10140 -3894 -17439
14505a7439q808K9596o766j1646l0376K2055K9491L1018k4539k6535Q899k6720
$$ -17439 -26247 3349 -3417 -15063 -45439 -23384 6107 37125 12586 -13949 -5050 -31770
14493c1770j2043K32M5234J7649J3147j430l2948k9544o485p534L3618J5464j532
$$ -31770 -43813 -43581 1653 19302 32449 31019 -1929 -31473 -37958 -45492 -11874 3590 2058
14480B058m003k4330j3689J0339K0293K2911K4658k3035n887J0071m053j3373
$$ 2058 -1945 -26275 -39964 -29625 -9332 13579 38237 15202 9315 19386 15333 1960
14468A960m5274l0443L0450N3483R925J0785l055o894N305l4863k2548J7645m811
$$ 1960 -43314 -73757 -43307 10176 20101 30886 27831 20937 26242 -8621 -31169 -13524 -18335
14455a8335M717K1398J4574j0230j7990q12k6709Q619j2445J7738J6456k2062
$$ -18335 -13618 7780 22354 12124 -5866 -6678 -33387 -24768 -37213 -19475 -3019 -25081
14443b5081J361L0635K4489Q638P971j6265q039J2564M360R00k3941P3J5690k7341
$$ -25081 -23720 6915 31404 40042 48013 31748 23709 36273 40633 41533 17592 17665 33355 6014
14429F014j1844K3214J7828j3228J786r625j4988J8361K4670l701P666k4575m390
$$ 6014 -5830 17384 35212 21984 23770 14145 -843 17518 42188 38487 46153 21578 17188
14416A7188Q068l0458k5305J6909J8520q348K2541l1519j5354L7482J1422k378
$$ 17188 25256 -5202 -30507 -13598 4922 -3426 19115 -12404 -27758 9724 21146 18768
14404A8768M0056N20k9476n243O507k5540o6035j8158J0063L5600J0476j1037
$$ 18768 58824 59344 29868 24625 31132 5592 -60443 -78601 -68538 -32938 -22462 -33499
14392c3499L5201J5934J6252k0607r966K217J890l3169m4209j1972L3087L8447
$$ -33499 1702 17636 33888 13281 3315 5532 7422 -25747 -69956 -81928 -48841 -10394
14380a0394K2353K755N307N521j8234m5048K2738O9219J9385p306k095l5029k7850
$$ -10394 11959 14714 20021 25542 7308 -37740 -15002 54217 73602 66296 64201 29172 1322
14367A322o6036j6059L4049L2575L125n715O169K8252J4783j1242j2032k0504
$$ 1322 -64714 -80773 -46724 -14149 -11024 -16739 -10570 17682 32465 21223 9191 -11313
14355a1313M602k7579m368l3062L2971M4297N1647k1256J0357K1117k0189l3840
$$ -11313 -6711 -34290 -38658 -71720 -38749 5548 57195 35939 46296 67413 47224 13384
14343A3384l2297r029J764L8982J2931N435k1410j6447n652L6112l048l9295K891
$$ 13384 -18913 -27942 -26178 12804 25735 31170 9760 -6687 -12339 23773 20725 -18570 -15679
14330a5679J1826j8522L0949L0452l500J5500J3725l4473j8296K5883m662k4254
$$ -15679 -3853 -22375 8574 39026 35526 51026 64751 30278 11982 37865 33203 8949
14318H949j9965j5256R940L4556K1838k6987k9065R717l6102j7334L6947P123
$$ 8949 -11016 -26272 -16332 18224 40062 13075 -15990 -6273 -42375 -59709 -22762 -15639
14306a5639k7729l451M1201L8470k1876j1028p83l1544r736K3027J4825J5213
$$ -15639 -43368 -46819 -5618 32852 10976 -52 -835 -32379 -42115 -19088 -4263 10950
14294A0950m728j5629j7818l050P770L3515J8444j9516k1483J514K7712l715q264
$$ 10950 6222 -9407 -27225 -30275 -22505 11010 29454 9938 -11545 -10031 17681 13966 5702
14281E702j1101P762K4966k1441l7470j4067k1688J4424J408p4J9899M3947J0563
$$ 5702 -5399 2363 27329 5888 -31582 -45649 -67337 -52913 -51505 -51579 -31680 12267 22830
14268B2830m7193l0122R021j1411K9524O6550J2447k7805k9330L206J8586J8687
$$ 22830 -24363 -54485 -45464 -56875 -27351 39199 51646 23841 -5489 -2283 16303 34990
14256C4990j7721k1841l244J2358J4602n566N91K0854K79P418K0316n77k9357
$$ 34990 17269 -4572 -7816 4542 19144 13578 14169 35023 35302 42720 63036 62459 33102
14243C3102k8893L657O172j6754L0728K6685N827l5786k8078j7137N0745K7879
$$ 33102 4209 7866 14038 -2716 28012 54697 60524 24738 -3340 -20477 30268 58147
14231E8147k4352p364k234l3965L6702J1916j5224m2800k1739m319O088L9152
$$ 58147 33795 26431 24197 -9768 26934 38850 23626 -19174 -40913 -45232 -39144 8
14219Hk6838j7330K4806K7097k0011k4928K9349P140J810J6649j4505M0125p864
$$ 8 -26830 -44160 -19354 7743 -12268 -37196 -7847 -707 1103 17752 3247 43372 35508
14206C5508m4297M281j8829j725K1573N419j1789j1423J1084j7685k2365J0317
$$ 35508 -8789 -4508 -23337 -25062 -3489 1930 -9859 -21282 -10198 -27883 -50248 -39931
14194c9931O0626m855j3765L830K120l041l6117l9025K5761L4195K4366J2860
$$ -39931 20695 15840 2075 5905 8025 4984 -31133 -70158 -44397 -10202 14164 27024
14182B7024q247k2750o827L8213M6189j215k9618K142K0395J4648k1384j4948
$$ 27024 18777 -3973 -10800 27413 73602 72387 42769 44911 65306 79954 58570 43622
14170D3622j5482l1545l1706j2696J0956J511J3116K4850J7475N579r564N981
$$ 43622 28140 -3405 -35111 -47807 -36851 -35340 -22224 2626 20101 25680 16116 22097
14158B2097J7009j0671K213k522k2213j5411K4952J1334o478j0059K7634N254
$$ 22097 39106 28435 30648 28126 5913 -9498 15454 26788 20310 10251 37885 43139
14146D3139m8667o533j5253K7909J6179k9781k6949J923R809L2994K4814m7388
$$ 43139 -5528 -12061 -27314 595 16774 -13007 -39956 -38033 -28224 4770 29584 -17804
14134a7804k3927M179r119K0774J2086p033j315k221j0615O787K5994o547J5143
$$ -17804 -41731 -37552 -46671 -25897 -13811 -20844 -22159 -24380 -34995 -28208 -2214 -8761 6382
14121F382l4035n909q961J3921O821J1605p941J8302j3867k1417K4113L1359j2374
$$ 6382 -27653 -33562 -42523 -28602 -21781 -10176 -18117 185 -13682 -35099 -10986 20373 7999
14108G999L8019J2220j8630k4633k6460l1673K1309M5477R294l6464L7125o9j4709
$$ 7999 46018 58238 39608 14975 -11485 -43158 -21849 23628 32922 -3542 33583 33514 18805
14095A8805J5718J9703L524j5906k1690j0790j04r779k301J4169J0419K1879j4047
$$ 18805 34523 54226 57750 41844 20154 9364 9260 -519 -2820 11349 21768 43647 29600
14082B9600k0946l5698r16n27j9334j9447L6011p122k826O8004n826k3432o884
$$ 29600 8654 -27044 -27960 -28487 -47821 -67268 -31257 -38379 -41205 26799 20973 -2459 -9343
14069i343m093o623J4225K0178J9027J3812l9114l5879l9376m08M5108L2823M6297
$$ -9343 -13436 -20059 -5834 14344 33371 47183 8069 -27810 -67186 -67594 -22486 10337 56634
14056E6634K843l4824L704L0243k8637L652N448j4554K9697j1055l4719L789J833
$$ 56634 59477 24653 28357 58600 29963 33615 39063 24509 54206 43151 8432 12221 14054
14043A4054j158L4078K55j7267M930j3967l490n759K0269j5683k0113N604k4592
$$ 14054 12896 46974 47229 29962 34892 20925 17435 11676 31945 16262 -3851 1753 -22839
14030b2839N543N7026K3534P749N435r927k9501o0292j2213Q011J4660L4610M599
$$ -22839 -17296 39730 63264 71013 76448 66521 37020 -23272 -35485 -27474 -12814 21796 26395
14017B6395k7987l0059j9333L8505K9550K2293p347j5737J0833j3133m4643K2923
$$ 26395 -1592 -31651 -50984 -12479 17071 39364 32017 16280 27113 13980 -30663 -7740
14005g740K2773m9578k2831L3548j008p349M5058K1091j7994J0346L3924K5468
$$ -7740 15033 -34545 -57376 -23828 -24836 -32185 12873 33964 15970 26316 60240 85708
13993H5708m2575n5781K540P177j889M2225o966k2770j1855M2289K4604m4907
$$ 85708 43133 -12648 -10108 -2931 -4820 37405 30439 7669 -4186 38103 62707 17800
13981A7800j3492P114k1806j5207M777l9208l7927N240M5069J0555K3661P094
$$ 17800 4308 11422 -10384 -25591 -20814 -60022 -97949 -92709 -47640 -37085 -13424 -6330
13969f330K0900O894j7849j2260O752r250N17j8201L1711K9929j3393n2208q179
$$ -6330 14570 21464 3615 -8645 -1893 -11143 -10626 -28827 2884 32813 19420 -32788 -40967
13956d0967k889O994L8591M5095J5325j5385m8694m8092J0123j7108L0762M8479
$$ -40967 -43856 -36862 1729 46824 62149 46764 -1930 -50022 -39899 -57007 -26245 22234
13944B2234L992k5354r889j7053J5132O424p200j4650l194o920k2083j0758N888
$$ 22234 26226 872 -9017 -26070 -10938 -4514 -11714 -26364 -29558 -36478 -58561 -69319 -63431
13931f3431K6229K7237L1301K5802pn1575J4719L086o532J951k6759q841J8191
$$ -63431 -37202 -9965 21336 47138 47131 -4444 10275 13361 6829 8780 -17979 -26820 -8629
13918h629J2224k1315j3541K8119M4653P120J3907j8644k826L094n4666l4327
$$ -8629 3595 -17720 -31261 -3142 41511 48631 62538 43894 41068 44162 -10504 -44831
13906d4831M829j3994J5570K0273o787O426K29q833K3261J3620k1546k4653J6592
$$ -44831 -40002 -53996 -38426 -18153 -24940 -18514 -18285 -27118 -3857 9763 -11783 -36436 -19844
13893a9844k5850n486p744j9420J587K7529K0624K5365J1561m1597k7745M733
$$ -19844 -45694 -51180 -58924 -78344 -76757 -49228 -28604 -3239 8322 -33275 -61020 -56287
13881e6287L1664J1918j5914k994K8630L768m3878n271J5126J2128L1171M3339
$$ -56287 -24623 -12705 -28619 -31613 -2983 785 -43093 -48364 -33238 -21110 10061 53400
13869E3400J6576k2059o1339j4637r941L085K9031k7757m1379J4104k686k2596
$$ 53400 69976 47917 -13422 -28059 -38000 -34915 -5884 -33641 -75020 -60916 -63602 -86198
13857h6198k0816M618K4890q856l414K8618J7585N213J3734J8925p04R995O678
$$ -86198 -107014 -102396 -77506 -86362 -89776 -61158 -43573 -38360 -24626 -5701 -6405 3590 10268
13844A0268l218J3675J964L0566k3479l3149M3318K3300j3551l4450k373J391
$$ 10268 7050 20725 22689 53255 29776 -3373 39945 63245 49694 15244 12871 14262
13832A4262O420k7845K3550J2329k0787k0467O97N380k9888m509K8507P248J4045
$$ 14262 20682 -7163 16387 28716 7929 -12538 -11841 -6461 -36349 -40858 -12351 -5103 8942
13819H942k0162j9109k3586L3978q15j5399J125n367M1797n1523n252Q6736J5912
$$ 8942 -11220 -30329 -53915 -19937 -20752 -36151 -35026 -40393 1404 -50119 -55371 31365 47277
13806D7277N625j5459n3115l2305J9916j126p532M573m0596O166J7456N796k292
$$ 47277 52902 37443 -15672 -47977 -28061 -29187 -36719 -32146 -72742 -66576 -49120 -43324 -45616
13793d5616J2839m076n451J9180J145j8175r868j069N8767L9684K1632k0313n1017
$$ -45616 -32777 -36853 -42304 -23124 -21979 -40154 -50022 -51091 7676 47360 68992 48679 -2338
13780b338m9635R563R311R809L237J1855k0876K3260o07k792L6751r192J722M175
$$ -2338 -51973 -42410 -33099 -23290 -20053 -8198 -29074 -5814 -6421 -9213 27538 18346 20068 24243
13766B4243J2855k4870l142j0608J3722L058o0732J1202L7141K1568k0403K1718
$$ 24243 37098 12228 9086 -1522 12200 15258 -45474 -34272 2869 24437 4034 25752
13754B5752L7736o808j4236l0628j4550J5647J7850O912k2438J5537l3203O834
$$ 25752 63488 56680 42444 11816 -2734 12913 30763 37675 15237 30774 -2429 4405
13742D405L1944J6035j436l0805j0879K6894L4118R338J4724O883k4607k221K2795
$$ 4405 36349 52384 50948 20143 9264 36158 70276 79614 94338 101221 76614 74393 97188
13729I7188N2947J9740P2557J72725K88703L24896k0514k90300k93429j68264
$$ 97188 150135 169875 242432 415157 703860 1028756 1008242 717942 424513 256249
13719B56249o3343o5460k0988j8340m0150j4794k2003m967J4303K795P3531M9924
$$ 256249 192906 127446 106458 88118 47968 33174 11171 6204 20507 23302 96833 146757
13707A46757l6960l6883k5663N449O519K800k1468l8003j4934L031j19P854R863
$$ 146757 109797 72914 47251 52700 59219 62019 40551 2548 -12386 -9355 -9474 -1620 8243
13694H243K3354l3460n3058K5308O7300j6008l3520k0230L6937L4405J4478j6617
$$ 8243 31597 -1863 -54921 -29613 37687 21679 -11841 -32071 4866 39271 53749 37132
13682C7132j6624l9185j9147L4988M5450N485n564j3973n012p914l2374o172K0341
$$ 37132 20508 -18677 -37824 -2836 42614 48099 42535 28562 23550 15636 -16738 -22910 -2569
13669b569M069J7974l374l5556L5276O599J5106K1155R92m167j5642k0534q336
$$ -2569 1500 19474 16100 -19456 15820 22419 37525 58680 59672 55505 39863 19329 10993
13656A0993o206J5275j2739j9007M789L264k5463j4416J6097k1621N517L6775
$$ 10993 4787 20062 7323 -11684 -6895 -3631 -29094 -43510 -27413 -49034 -43517 -6742
13644f742N464K7420L5108m768J920j1461K7355k2313j3193J7846k8413j1089
$$ -6742 -1278 26142 61250 56482 58402 46941 74296 51983 38790 56636 28223 17134
13632A7134j6813o0730m9177J9191L2307Q847K5465L7226J112q546J1249l0862
$$ 17134 321 -60409 -109586 -90395 -58088 -49241 -23776 13450 14562 6016 17265 -13597
13620a3597j9694N0908K1477j0543L1076j7673m8092N935n534J05K9823L9943
$$ -13597 -33291 17617 39094 28551 59627 41954 -6138 -203 -5737 -5632 24191 64134
13608F4134m967k5062l280l0271k2094J0110J0989L2989K1992k0720j3762O829
$$ 64134 59167 34105 30825 554 -21540 -11430 -441 32548 54540 33820 20058 26887
13596B6887J345m3585K5903N520Q07R878k0522l0080k3774j2791L3945M5430K5886
$$ 26887 28232 -15353 10550 16070 16877 26755 6233 -23847 -47621 -60412 -26467 18963 44849
13583D4849J8068p141m1026n4668J0449N1055k7198k4950o167L1188K9948L018
$$ 44849 62917 55776 14750 -39918 -29469 21586 -5612 -30562 -36729 -5541 24407 27425
13571B7425j1323j7707k7723j1054K8485L5005j4234j6129p408j0996o7K9154
$$ 27425 16102 -1605 -29328 -40382 -11897 23108 8874 -7255 -14663 -25659 -25726 3428
13559C428M1048J8613j8338L216k3445k5384P413R96K4279M8114j8634r2l0521
$$ 3428 44476 63089 44751 47967 24522 -862 6551 7547 31826 79940 61306 61214 30693
13546C0693k0807K7245M620m0392k7691J0994j2267m6826M3770M4858k9993j7292
$$ 30693 9886 37131 41751 1359 -26332 -15338 -27605 -74431 -30661 14197 -15796 -33088
13534c3088K0445K3957P113n133K8463K0213p108J6079m1392k8271j3582j2028
$$ -33088 -12643 11314 18427 13294 41757 61970 54862 70941 29549 1278 -12304 -24332
13522b4332k041K7001K1983m125N904j252O789j4205k6021m9138L5798J8959k139
$$ -24332 -26373 628 22611 18486 24390 23138 29927 15722 -10299 -59437 -23639 -4680 -6819
13509f819k7256j305K836J4374Q01k884J5024K7043J8814j2039l3928j7086n025
$$ -6819 -34075 -35380 -32544 -18170 -17369 -20253 -5229 21814 40628 28589 -5339 -22425 -27450
13496b7450L812m2093P562L8457P41M206J4883J1669j5979J4311j9595L668O795
$$ -27450 -23638 -65731 -58169 -19712 -18971 -14765 118 11787 -4192 10119 -9476 -5808 987
13483I87R158j7259L5850j5314j0802K149J5302K7725l8319l5676r333K0595N9944
$$ 987 10145 -7114 28736 13422 2620 4769 20071 47796 9477 -26199 -35532 -14937 45007
13470D5007L1306q745K001M040k7424q80O592O279l0240l1334L7113L2939q805
$$ 45007 76313 67568 69569 73609 46185 45305 51897 58176 27936 -3398 33715 66654 57849
13457E7849k0152n494J2221L5770j853m0989n1689l512J0462J64R516p021n086
$$ 57849 37697 32203 44424 80194 78341 37352 -14337 -17849 -7387 -7223 2293 -4728 -9814
13444i814k1214L448J7491J7044k131m898q848k7252n519K3425O189j3790o524
$$ -9814 -31028 -27580 -10089 6955 4824 -74 -8922 -36174 -41693 -18268 -12079 -25869 -32393
13431c2393J4296j8506N827L9819m147j3943n113K5077J4938j7226O548n336J1128
$$ -32393 -18097 -36603 -30776 9043 4896 -9047 -14160 10917 25855 8629 15177 9841 20969
13418B0969k0647m4696j9747J804O816M2119J9054j2640j529J0915J5768j3957
$$ 20969 322 -44374 -64121 -62317 -55501 -13382 5672 -6968 -8497 2418 18186 4229
13406D229L692k636j3400m2436n751r136L3189L4257K8010l418k0500l6725K3221
$$ 4229 7921 5285 -8115 -50551 -56302 -65438 -32249 2008 30018 26600 6100 -30625 -7404
13393g404M3666J9733l89m7916l1703J0770N170N075J2192j8036k4796j5399l595
$$ -7404 36262 55995 55606 7690 -24013 -13243 -8073 -2998 9194 -8842 -33638 -49037 -52632
13380e2632J3710L393p274J379J3148r630j8069r950L6154K3408J7679J0120k0945
$$ -52632 -38922 -35529 -42803 -41424 -28276 -37906 -55975 -65925 -29771 -6363 11316 21436 491
13367D91r084M8316K9895k3391n0206j2407j2348K9786L2161l7606M826M7395
$$ 491 -8593 39723 69618 46227 -3979 -16386 -28734 1052 33213 -4393 433 47828
13355D7828P214j4750J6642K1342m6756k5976k9365N047M5742N6935k3234k3893
$$ 47828 55042 40292 56934 78276 31520 5544 -23821 -18774 26968 83903 60669 36776
13343C6776o132k002j392L6960J5187j8268O014j4052j2855j6163k0643R240K5658
$$ 36776 30644 28642 27250 64210 79397 61129 67143 53091 40236 24073 3430 12670 38328
13330C8328M4481P404k8425j4445o489l7619L9604L9141j0302L5687L0332q151
$$ 38328 82809 90213 61788 47343 40854 3235 42839 81980 71678 107365 137697 129546
13318A29546k6566j7606J1570p473j7596O506k7553J3002K0714j7083k0337k014
$$ 129546 102980 85374 96944 89471 71875 78381 50828 63830 84544 67461 47124 45110
13306D5110l4762J1329M0610N321k9713m272k0310j2792N872J1734m924l4763
$$ 45110 10348 21677 62287 67608 37895 33623 13313 521 6393 18127 13203 -21560
13294b1560r475K1496M956R248K5498M3758L3641J8993P4037R7427J10979J98434
$$ -21560 -31035 -9539 -4583 4665 30163 73921 107562 126555 200592 298019 408998 607432
13282F07432N113j37596j40540m7362l9807L8153Q2076k1132o6515o6002r9492
$$ 607432 612545 474949 334409 287047 247240 285393 367469 346337 279822 213820 114328
13271A14328n9329k2040j8652K7507J0946M3377M4697M842L5855J7583j018m4319
$$ 114328 54999 32959 14307 41814 52760 96137 140834 145676 181531 199114 198096 153777
13259A53777j3217p462J4018M5308L5742Q8351J18724K60804L43859R7163j68849
$$ 153777 140560 133098 147116 192424 228166 316517 435241 696045 1039904 1137067 968218
13248I68218k56485k02205j23637j13233q1441j7579k3182j1474J9107K5923J5975
$$ 968218 711733 509528 385891 272658 191217 173638 150456 138982 158089 184012 199987
13237A99987L1003j1754n0133k6546O0310R9225P6566K4648m9466o6071q6707
$$ 199987 230990 219236 169103 142557 202867 302092 378658 403306 353840 287769 201062
13226B01062n3115k6676j6895M500K4432L5703N0780J0556K122r378j9237l5632
$$ 201062 147947 121271 104376 108876 133308 169011 219791 230347 232469 223091 203854 168222
13214A68222K6468J15179Q2038O3493J68527L08916N47064Q63676J034677J80490
$$ 168222 194690 309869 391907 455400 623927 932843 1479907 2343583 3378260 3558750
13204C558750o36543p46667l96527m6183r9171l00433l51714k57719j75187q3093
$$ 3558750 2922207 2175540 1779013 1732830 1633659 1333226 981512 723793 548606 465513
13194D65513m1040m5208k3760o2638p739L0473Q4875k858k9806k2159j1939n5163
$$ 465513 424473 379265 355505 292867 285128 315601 400476 397618 367812 345653 333714 278551
13182B78551k1007K9079K0538j7393j6000M4582N0280N0961J6984M7233K3632
$$ 278551 257544 286623 307161 289768 273768 318350 368630 419591 436575 483808 507440
13171E07440O1787P6796M6206Q2444J42981J80506K51818M14180P31106J104677
$$ 507440 569227 646023 692229 774673 917654 1098160 1349978 1764158 2495264 3599941
13161C599941J133832J90944m18890k76532L47916Q41080K81078o57258q75012
$$ 3599941 4733773 4924717 4505827 4229295 4577211 5418291 5699369 5042111 4167099
13152D167099p72104n57922l78210l21283k86763k38630j73419j88026j62377
$$ 4167099 3394995 2837073 2458863 2137580 1850817 1612187 1438768 1250742 1088365
13143A088365j50995r2779o6649r5261p0637o9046m6571l8865m60l274m8464m3647
$$ 1088365 937370 844591 777942 682681 612044 542998 496427 457562 457102 453828 405364 361717
13131C61717k9382J9060j0574L1113J4169j0181J8754P694j6934L125P8159J02663
$$ 361717 332335 351395 340821 371934 386103 375922 394676 402370 385436 388561 466720 569383
13119E69383J58734K67749L76421L19816Q1134J8856K08417O64063Q57376N2359
$$ 569383 728117 995866 1372287 1692103 1773237 1792093 2000510 2664573 3521949 3574308
13109C574308p73504q95393o55340m20336k09528j08088p1696m9696n3190o5230
$$ 3574308 2800804 1905411 1250071 829735 620207 512119 440423 390727 337537 272307
13099B72307p378k1588m1770j8093j2456j9032n5844l5561J7677m349Q525j3133
$$ 272307 264929 243341 201571 183478 171022 151990 96146 60585 78262 73913 82438 69305
13087F9305m246l511k3432J332R079K2145Q01k4589k613N3684L4416l985k6659
$$ 69305 65059 61548 38116 39448 48527 70672 71473 46884 44271 97955 132371 128386 101727
13074A01727l339Q392k3666M4403P1949J44326K30826L66295K55073q4060k53080
$$ 101727 98388 106780 83114 127517 199466 343792 574618 940913 1195986 1111926 858846
13063H58846l03771k18369j19958q2482m9827k2977J3504q222L2861R592l1045
$$ 858846 555075 336706 216748 134266 84439 61462 74966 66744 99605 109197 78152
13052G8152l4395k37J529L294n0816j4584k691N553K8015J7399M795m759k8203
$$ 78152 43757 43520 45049 48343 -2473 -17057 -19748 -14195 13820 31219 36014 31255 3052
13039C052l0677j8694M2862K9266j7956j1368L5809K554K841m5915j1087J0358
$$ 3052 -27625 -46319 -3457 25809 7853 -3515 32294 34848 37689 -8226 -19313 -8955
13027h955K5108j7668J4019P365j7149k0380K6328O5095j2724R60J0538l1296
$$ -8955 16153 -1515 12504 19869 2720 -17660 8668 73763 61039 61999 72537 41241
13015D1241k3520N0129R245l97j6570k5458n033l3824J0521K9546K6919n1761
$$ 41241 17721 67850 77095 76698 60128 34670 29637 -4187 6334 35880 62799 11038
13003A1038l4429j3997Q454M7099K1123l2634Q987O580J1684J255m615k7318J8388
$$ 11038 -23391 -37388 -28934 18165 39288 6654 15641 22221 33905 35160 30545 3227 21615
12990B1615m433l762Q068J4190K5935R437o186k9824n3434l7760k0257M5448l721
$$ 21615 17182 13420 21488 35678 61613 71050 64864 35040 -18394 -56154 -76411 -30963 -34684
12977c4684k9537K576J957j7780k3998K5214N5866L1734M460k5352J004N443K475
$$ -34684 -64221 -61645 -59688 -77468 -101466 -76252 -20386 11348 15808 -9544 -8540 -3097 -622
12964f22K2235M3297J693j5366o313n532q876k9646j0639L4754M7255k0229l8641
$$ -622 21613 64910 66603 51237 44924 39392 30516 870 -9769 24985 72240 52011 13370
12951A3370l1561L2216M3598n055j1751P330k7280k8670j7304J1490j4407O995
$$ 13370 -18191 14025 57623 52568 40817 48147 20867 -7803 -25107 -13617 -28024 -21029
12939b1029J6355k908p893r568J2948R293J0754j3970p54L0728J0368M944r625
$$ -21029 -4674 -7582 -15475 -25043 -12095 -2802 7952 -6018 -6772 23956 34324 39268 29643
12926B9643j7637j545J7195P139l2883m480J220J1197J2712L172N483k1513j339
$$ 29643 12006 10461 27656 34795 1912 -2568 -1348 9849 22561 25733 31216 9703 8364
12913H364J9410k2184j1425P769j4776J0365K3050k958J117K073K2458K8567j1978
$$ 8364 27774 5590 -5835 1934 -12842 -2477 20573 17615 18732 20805 43263 71830 59852
12900E9852J3284j3475J121k5413k3234J480L172K0240J6556J7490J9769K4211
$$ 59852 73136 59661 60782 35369 12135 13615 16787 37027 53583 71073 90842 115053
12888A15053K2723J564P1879O0610L9652Q976K8708M1982L6669L3740M703M4912
$$ 115053 137776 139340 211219 271829 311481 320457 349165 391147 427816 461556 466259 511171
12876E11171k5203q104K8569m6924n3332r5296p7578n2090k1784k1496j555n6613
$$ 511171 485968 477864 506433 459509 406177 310881 233303 181213 159429 137933 136378 79765
12864G9765k7012K4208J7383N389j4142m9718M443M9373n0441l0960k6540K6086
$$ 79765 52753 76961 94344 99733 85591 35873 40316 89689 39248 8288 -18252 7834
12852G834M093J1604J249L894N061q336k1496M8583r375j0601j2898j9681p815
$$ 7834 11927 23531 24780 28674 33735 25399 3903 52486 43111 32510 19612 -69 -7884
12839g884R851O1084K9146O534J8695L194L0629j8718m914K9055K7165M3424k9796
$$ -7884 1967 63051 92197 98731 117426 120620 151249 132531 127617 156672 183837 227261 197465
12826A97465k8260J128j2560K1340M6361J0583N593L4821L1615O0372Q2442N5845
$$ 197465 169205 170333 157773 179113 225474 236057 241650 276471 308086 368458 450900 506745
12814E06745N164k1207r502O706J2425n5802r9464l3614l8302n7680l4980l5029
$$ 506745 511909 490702 481200 487906 500331 444529 345065 311451 273149 215469 180489 145460
12802A45460l7076j117j8423l4729p230J3139Q947n4608k4201N300J5601l7569
$$ 145460 108384 107267 88844 54115 46885 60024 68971 14363 -9838 -4538 11063 -26506
12790b6506M5831L208M1315K3791k6984L852Q809J2929N318K0860k2398m8353
$$ -26506 19325 22533 63848 87639 60655 64507 73316 86245 91563 112423 90025 41672
12778D1672l1056L6835J2886l1232K2118j7208l4159J1927l279k0644K8227l02
$$ 41672 10616 47451 60337 29105 51223 34015 -144 11783 8504 -12140 16087 15785
12766A5785O313q534r52j223R631K4438j9287O055K7075p579n587j5738k7493
$$ 15785 22098 13564 12612 11389 21020 45458 26171 32226 59301 51722 46135 30397 2904
12753B904K4255o691j8370j4969r265k3108j6229J1791L8170L2305m055j9650
$$ 2904 27159 20468 2098 -12871 -22136 -45244 -61473 -49682 -11512 20793 16738 -2912
12741b912J1166K5714k2716k2243J395j9657K8907L8692j7326j1083j1016L391
$$ -2912 8254 33968 11252 -10991 -9596 -29253 -346 38346 21020 9937 -1079 2312
12729B312j2019k7210K758M4676J3803J482k7744j7230o747k6870L9127K1171
$$ 2312 -9707 -36917 -34159 10517 24320 25802 -1942 -19172 -25919 -52789 -13662 7509
12717G509J1090l2300O297L7449j6759L651q812J307l2961P23P905L0383Q543
$$ 7509 18599 -13701 -7404 30045 13286 16937 8125 9432 -23529 -22806 -14901 15482 24025
12704B4025l3777l5788O787L5259R728k353j0146k9503o684j1206l456n216M1364
$$ 24025 -9752 -45540 -38753 -3494 6234 3881 -6265 -35768 -42452 -53658 -57114 -62330 -20966
12691b0966M2362k179j1224J6367L9834n698l944l2285j8610k6577k1490j1220
$$ -20966 21396 19217 7993 24360 64194 58496 54552 22267 3657 -22920 -44410 -55630
12679e5630J7152K3982M8843j1316l7617J496p108J5113L6740K2556l4401m2719
$$ -55630 -38478 -14496 34347 23031 -14586 -13090 -20198 -5085 31655 54211 19810 -22909
12667b2909l9508r127J1253J9666K916J3310K4968o363J4261l8251j0276M1899
$$ -22909 -62417 -71544 -60291 -40625 -37709 -24399 569 -5794 8467 -29784 -40060 1839
12655A839J7866o793j9224J8703J5408L2628q942J5736J5204k4108l6850k1575
$$ 1839 19705 12912 -6312 12391 27799 60427 51485 67221 82425 58317 21467 -108
12643a08j3758J2489m3369K2923M327J4574l7121j3100k7522J0335N7274K5484
$$ -108 -13866 -1377 -44746 -21823 -17496 -2922 -40043 -53143 -80665 -70330 -13056 12428
$$ [...]
##END NTUPLES=NMR SPECTRUM
##END=
