##TITLE=Analysis number 325233
Compound Code cc 33916
Book Reference 403/106
Project Code adrs
Chemist Name carlr
##JCAMPDX= 6.0         $$ Bruker NMR JCAMP-DX V2.0
##DATA TYPE= NMR SPECTRUM
##DATA CLASS= NTUPLES
##ORIGIN= Bruker BioSpin GmbH
##OWNER= nmr
$$ XWIN-NMR		Version 3.5
$$ Thu Dec 14 16:22:14 2006 GMT Standard Time (UT+0h)  MAYBRIDGE\nmr@NMR_250MHZ
##.OBSERVE FREQUENCY= 250.131544655141
##.OBSERVE NUCLEUS= ^1H
##.ACQUISITION MODE= SIMULTANEOUS (DQD)
##.ACQUISITION SCHEME= undefined
##.AVERAGES= 16
##.DIGITISER RES= 18
##SPECTROMETER/DATA SYSTEM= dpx250
##.PULSE SEQUENCE= zg30
##.SOLVENT NAME= CDCl3
##.SHIFT REFERENCE= (INTERNAL, CDCl3, 0, 16.5251)
##AUDIT TRAIL= $$ (NUMBER, WHEN, WHO, WHERE, WHAT)
$$ ##TITLE= Audit trail, XWIN-NMR		Version 3.5
$$ ##JCAMPDX= 5.01
$$ ##ORIGIN= Bruker BioSpin GmbH
$$ ##OWNER= nmr
$$ C:\u/data/dgb/nmr/ADRS/1670/pdata/1/auditp.txt
$$ ##AUDIT TRAIL=  $$ (NUMBER, WHEN, WHO, WHERE, WHAT)
(   1,<2006-12-14 16:21:52.46 +000>,<MAYBRIDGE\nmr>,<NMR_250MHZ>,
      <created by zg, POWCHK disabled, PULCHK disabled
       configuration hash MD5:
       49 4B E0 1D 92 C2 6B 37 9F E6 65 BC 52 41 86 1D
       data hash MD5: 64K
       4F 81 11 D5 E7 EA 4B 72 07 DB 86 E1 D4 BD DB FB>)
(   2,<2006-12-14 16:22:06.00 +000>,<MAYBRIDGE\nmr>,<NMR_250MHZ>,
      <Start of raw data processing
       ef LB = 0.3 FT_mod = 6 PKNL = 1 SI = 32K 
       data hash MD5: 32K
       C9 8A 12 DE 32 A1 9A 29 65 B0 69 C6 13 46 86 5B>)
(   3,<2006-12-14 16:22:07.54 +000>,<MAYBRIDGE\nmr>,<NMR_250MHZ>,
      <apk 
       data hash MD5: 32K
       8C C2 32 0C 63 E4 12 C4 16 A3 28 C6 5E 8B 04 38>)
(   4,<2006-12-14 16:22:08.23 +000>,<MAYBRIDGE\nmr>,<NMR_250MHZ>,
      <abs ABSG = 5 
       data hash MD5: 32K
       AD 42 E5 71 2E 99 A0 A3 41 A7 CE 5B 73 F8 1C 65>)
$$ ##END=
$$ 
$$ hash MD5
$$ AB 07 1A 51 3B 80 5F 3C 3A 12 D8 48 CF 82 58 B1
##$RELAX= 
##$RELAX= 
##$RELAX= 
##$RELAX= 
##$RELAX= 
##$RELAX= 
##$RELAX= 
$$ Bruker specific parameters
$$ --------------------------
##$DU= <C:\u>
##$EXPNO= 1670
##$NAME= <ADRS>
##$PROCNO= 1
##$TYPE= <nmr>
##$USER= <dgb>
##$AMP= (0..31)
100 100 100 100 100 100 100 100 100 100 100 100 100 100 100 100 100 100 
100 100 100 100 100 100 100 100 100 100 100 100 100 100 
##$AQSEQ= 0
##$AQ_mod= 3
##$AUNM= <au_zg>
##$AUTOPOS= <36 >
##$BF1= 250.13
##$BF2= 250.13
##$BF3= 250.13
##$BF4= 250.13
##$BF5= 500.13
##$BF6= 500.13
##$BF7= 500.13
##$BF8= 500.13
##$BYTORDA= 1
##$CFDGTYP= 0
##$CFRGTYP= 5
##$CHEMSTR= <none>
##$CNST= (0..31)
1 1 145 1 1 1 1 1 1 1 1 1 1 1 1 1 1 1 1 1 1 1 1 1 1 1 1 1 1 1 1 1 
##$CPDPRG= <>
##$CPDPRG1= <>
##$CPDPRG2= <>
##$CPDPRG3= <>
##$CPDPRG4= <mlev>
##$CPDPRG5= <mlev>
##$CPDPRG6= <mlev>
##$CPDPRG7= <mlev>
##$CPDPRG8= <mlev>
##$CPDPRGB= <>
##$CPDPRGT= <>
##$D= (0..31)
0 1 0 0 0 0 0 0 0 0.06 0 0 0 0 0 0 0.0002 0 0 0 0 0 0 0 0 0 0 0 0 0 0 
0 
##$DATE= 1166113310
##$DBL= (0..7)
120 120 120 120 120 120 120 120 
##$DBP= (0..7)
150 150 150 150 150 150 150 150 
##$DBP07= 0
##$DBPNAM0= <>
##$DBPNAM1= <>
$$ [...]
##$SUBNAM7= <"">
##$SUBNAM8= <"">
##$SUBNAM9= <"">
##$SW= 20.6930455092707
##$SWIBOX= (0..15)
0 0 3 0 0 0 0 0 0 0 0 0 0 0 0 0 
##$SW_h= 5175.983436853
##$TD= 65536
##$TD0= 1
##$TE= 295.16
##$TE2= 300
##$TE3= 300
##$TEG= 300
##$TL= (0..7)
0 120 120 120 120 120 120 120 
##$TP= (0..7)
150 150 150 150 150 150 150 150 
##$TP07= 0
##$TPNAME0= <>
##$TPNAME1= <>
##$TPNAME2= <>
##$TPNAME3= <>
##$TPNAME4= <>
##$TPNAME5= <>
##$TPNAME6= <>
##$TPNAME7= <>
##$TPOAL= (0..7)
0.5 0.5 0.5 0.5 0.5 0.5 0.5 0.5 
##$TPOFFS= (0..7)
0 0 0 0 0 0 0 0 
##$TUNHIN= 0
##$TUNHOUT= 0
##$TUNXOUT= 0
##$USERA1= <user>
##$USERA2= <user>
##$USERA3= <user>
##$USERA4= <user>
##$USERA5= <user>
##$V9= 5
##$VALIST= <valist>
##$VCLIST= <CCCCCCCCCCCCCCC>
##$VD= 0
##$VDLIST= <DDDDDDDDDDDDDDD>
##$VPLIST= <PPPPPPPPPPPPPPP>
##$VTLIST= <TTTTTTTTTTTTTTT>
##$WBST= 1024
##$WBSW= 4
##$XGAIN= (0..3)
0 0 0 0 
##$XL= 0
##$YL= 0
##$YMAX_a= 584871
##$YMIN_a= -553613
##$ZGOPTNS= <>
##$ZL1= 120
##$ZL2= 120
##$ZL3= 120
##$ZL4= 120
##$ABSF1= 16.52514
##$ABSF2= -4.168032
##$ABSG= 5
##$ABSL= 3
##$ALPHA= 0
##$AQORDER= 0
##$ASSFAC= 0
##$ASSFACI= 0
##$ASSFACX= 0
##$ASSWID= 0
##$AUNMP= <proc_1d>
##$AZFE= 0.1
##$AZFW= 0.1
##$BCFW= 0
##$BC_mod= 0
##$BYTORDP= 0
##$COROFFS= 0
##$CY= 12.5
##$DATMOD= 1
##$DC= 0
##$DFILT= <>
##$DTYPP= 0
##$F1P= 14.0000005364418
##$F2P= -0.99999901652339
##$FCOR= 0.5
##$FTSIZE= 32768
##$FT_mod= 6
##$GAMMA= 0
##$GB= 0
##$INTBC= 1
##$INTSCL= 1
##$ISEN= 128
##$LB= 0.3
##$LEV0= 0
##$LPBIN= 0
##$MAXI= 10000
##$MC2= 0
##$MEAN= 0
##$ME_mod= 0
##$MI= 0
##$NCOEF= 0
##$NC_proc= -4
##$NLEV= 6
##$NOISF1= 0
##$NOISF2= 0
##$NSP= 0
##$NTH_PI= 0
##$NZP= 0
##$OFFSET= 16.52514
##$PC= 1
##$PHC0= 221.5901
##$PHC1= 6.654844
##$PH_mod= 1
##$PKNL= yes
##$PPARMOD= 0
##$PSCAL= 4
##$PSIGN= 0
##$REVERSE= no
##$SF= 250.12999921395
##$SI= 32768
##$SIGF1= 0
##$SIGF2= 0
##$SINO= 400
##$SIOLD= 32768
##$SREGLST= <1H.CDCl3>
##$SSB= 0
##$STSI= 32768
##$STSR= 0
##$SW_p= 5175.98343685301
##$SYMM= 0
##$S_DEV= 0
##$TDeff= 65536
##$TDoff= 0
##$TI= <Analysis number 999999
Compound Code 99
Book Reference 9
Project Code 9>
##$TILT= no
##$TM1= 0
##$TM2= 0
##$TOPLEV= 0
##$USERP1= <user>
##$USERP2= <user>
##$USERP3= <user>
##$USERP4= <user>
##$USERP5= <user>
##$WDW= 1
##$XDIM= 32768
##$YMAX_p= 431817807
##$YMIN_p= -118583
$$ End of Bruker specific parameters
$$ ---------------------------------
##NTUPLES= NMR SPECTRUM
##VAR_NAME=  FREQUENCY,     SPECTRUM/REAL,   SPECTRUM/IMAG
##SYMBOL=    X,             R,               I
##VAR_TYPE=  INDEPENDENT,   DEPENDENT,       DEPENDENT
##VAR_FORM=  AFFN,          ASDF,            ASDF
##VAR_DIM=   32768,         32768,           32768
##UNITS=     HZ,            ARBITRARY UNITS, ARBITRARY UNITS
##FACTOR=    0.157963299565203, 1,           1
##FIRST=     4133.43344589179, 0,            0
##LAST=      -1042.54999096122, 0,           0
##MIN=       -1042.54999096122, -118583,     0
##MAX=       4133.43344589179, 431817807,    0
$$ Real data points
##PAGE= N=1
##DATA TABLE= (X++(R..R)), XYDATA
$$ [...]
15075b7497Q399P334J5847J2038J454M634l436j3139j4648l4938o318K3951P292
15062a9027k4438L275K2236Q812J4101j0787K549q67p155L517M258j6442p683
15049b7651j9223n208K6657n512J446N757m439P617q607k91J3401O005l1361J1273
15035c0136L388j9191J7384J2185M164Q778l0291j5418J4103q047L774J8722J9985
15022f00k271O413L0723k8956l0402M057j3688n718j6933J6805L6812J0218j2497
15009f037J09j5674n808L1526O873o730j7976l0543M615J3741r259q343j0637
14996e4143k2755K4917L8002K4357k5904j534N363l352J3501J484k1409l0680
14984e2153N257O794J50K1174J6190J8003j1334l7496j7067J9793q474k9488K2507
$$ y = [-27497, -19098, -11764, 4083, 16121, 17575, 22209, 18773, 5634, -9014, -43952, -50270, -26319, -19027, -43465, -40190, -17954, -9142, 4959, -5828, -3279, -4146, -11301, -7784, -3526, -19968, -27651, -46874, -52082, -25425, -30937, -29491, -23734, -28173, -20556, -29163, -29454, -16053, -10048, -41409, -30136, -26748, -45939, -28555, -16370, -12206, -3428, -33719, -49137, -35034, -43081, -39307, -20585, -600, -2871, 3542, 34265, 5309, -25093, -21036, -34724, -40442, -57375, -40570, -3758, 6460, -6037, -5928, -21602, -27410, 4116, 10989, 4259, -13717, -44260, -39645, -25904, -35163, -43506, -54143, -76898, -51981, -13979, 10378, -15526, -17060, -11697, -15049, -1548, -64, -21473, -52153, -46896, -40102, -39952, -18778, -2588, 15415, 4081, -33415, -50482, -30689, -39163, -68651, -46144]
14971d6144L449m716L968J4838K0796m088J5431J4534k6399l2982J0838J3116
14959a7359j0652j8399j6280L2307Q35L4559J3135k9421J1106M956l2794j3763
14947d1770M337K4405j214r581J9235J9941j4127j032N979j86j6184q086l336
14934b1619J3494j0600M932K2J43J3964J9130O027n674r88m55k6052j3792J4870
14920f598j3430J5782n606q611J6426j6287J6312L205k0469j8505k1706j1973
14908g1460P920J0123J507M818L860K4328o429k504l090J6355j633J374J8545
14895C714k2681j037M012J906L2706p307L6O102k6311j5772K129N122M118j866
14881a5129J420p982N842P59M201J3245j2616J7999L3719j4665l6176N55R031
$$ y = [-46144, -42695, -47411, -43443, -28605, -7809, -11897, 3534, 18068, -8331, -41313, -30475, -17359, -28011, -46410, -62690, -30383, -29548, 5011, 18146, -11275, -169, 4787, -28007, -41770, -37433, -13028, -14242, -23823, -4588, 15353, 1226, 194, 6173, 5987, -10197, -18283, -21619, -8125, -18725, -13793, -13771, -13628, 336, 19466, 25493, 19819, 18831, 18376, -7676, -21468, -6598, -20028, -4246, -9852, -18463, -2037, -18324, -2012, 1193, -19276, -37781, -59487, -71460, -63540, -53417, -51910, -47092, -43232, -18904, -25333, -27837, -30927, -14572, -16205, -14831, 3714, -18967, -20004, -15992, -14086, 18620, 11313, 11349, 17451, -8860, -24632, -22503, -17381, -13263, -15129, -13709, -21691, -15849, -15090, -10889, 2356, -10260, 7739, 41458, 26793, -9383, -8828, 203]
14868B03J757k4253P170J1004k1330k91J8628L809o43k286O341r471r621n328
14854b4311j3727j5285J2032O11K5014K4296p861N526m849k3811l3401j60l4708
14841i0634J3643J6096p385K5880K0115K0903O411r896k0145j0882j996J211K6096
14828a0583J9887J5312n212j9437j4888j7596j1231j8444R497P310K2652k867
14816b5600j1457Q99J7265k1085J7390n086j930L723Q625O986k1451K2325M746
14803d650o166k1055K194M465K2661q318o174j6246k5563M5819L2443L027k933
14790A9504l1774K291o779M087K7122M279l1871k0867L494K5111l514j1752K4479
14777C810O009n056O883K506l5870j7699q222O666j014M675J0751K2m67m826j0941
$$ y = [203, 1960, -22293, -15123, -4119, -25449, -25740, -7112, -3303, -3946, -6232, 109, -9362, -18983, -24311, -38038, -53323, -41291, -40680, -15666, 8630, 769, 6295, 1446, -22365, -55766, -55926, -90634, -76991, -60895, -68280, -42400, -22285, -1382, 5029, -4867, -25012, -35894, -37890, -36679, -10583, 9304, 24616, 19404, -33, -14921, -32517, -43748, -62192, -52695, -45385, -22733, -25600, -37057, -36158, -18893, -39978, -22588, -27674, -29604, -25881, -17256, -10270, -31721, -9396, -4650, -10816, -31871, -29677, -25212, -2551, -10869, -17043, -33289, -58852, -13033, 19410, 22437, 19504, -12270, -9979, -16758, -12671, 14451, 18730, -13141, -34008, -30514, -5403, -8917, -20669, 3810, 9819, 4763, 11646, 14152, -21718, -39417, -47639, -40973, -41987, -37312, -26561, -26539, -27006, -31832, -42773]
14762d2773N634Q007L336J2431K1147k7717j5742j1056L5701r344p266J5543K0588
14749H489N869r363k4316m070N236j4880m494J6652K7920K0682j2479k2107L240
14736c621J5275j8166j4673j9723n059J0491J8638O735r906j8190J4115j28J0817
14723a3395j4076l961J9908J7327p652q568M86j4320k5771k868k07J5636K5530
14710a1931Q486k1901j3002J5323K7421K228n476m1072k3952J9642J0411N3014
14698A9191J1935q168R15j543k8409j5195M2080L5441j2686n0141l5395J1794
14686c0181J052K619O645k626N045J5584j225j3454K0279J4553J0540k023J1752
14673C8560k1371j5932J1444m4483j9009J2031j648K737J0979k2294K6271L6433
$$ y = [-42773, -37139, -29132, -25796, -13365, 7782, -19935, -35677, -46733, -11032, -20376, -27642, -12099, 8489, 14358, 4995, -19321, -23391, -18155, -33035, -37529, -20877, 7043, 27725, 15246, -6861, -3621, 11654, -6512, -21185, -40908, -45967, -35476, -16838, -10103, -20009, -38199, -24084, -24212, -13395, -27471, -31432, -11524, 5803, -1849, -10417, -9931, -24251, -50022, -52890, -53097, -37461, -11931, -3445, -25346, -38348, -23025, 4396, 6624, 1148, -39924, -63876, -44234, -33823, 19191, 31126, 22958, 23873, 22330, -6079, -21274, 20806, 56247, 43561, -6580, -41975, -30181, -29129, -26510, -19865, -22491, -17446, -1862, -3087, -16541, 3738, 18291, 28831, 26808, 38560, 17189, 1257, 12701, -31782, -50791, -38760, -40408, -37671, -26692, -48986, -22715, 13718]
14661A3718J591J3703l6129R379k968k5027J1953M679j0299k985K6545j5066j328
14648a2234J6392O20N986K669J2532j7600K8577K1440j5948q286K080j3948k8344
14635f064k0090Q618k7551l627J5859J8244K9973J905l4008r955L2512O028l2583
14622b0739j7831K9741M389o880j282k3021l0097M81J5552Q341K2552L63O264
14609a2167J9865K1657j3640j1604j7537r255J7281M988L086l533k8773o213K4650
14596a1195J197R637l541q170J7278K485r17m315m0597k545q132O082J4595k248
14582c0386k12k3209p911J9505Q402M4J3623O153N342K2580J9008r837l6109j4420
14568b7427j0277q719l888j3714J2424M9689J5468l2847L830Q14J647o826J6850
$$ y = [13718, 15309, 29012, -7117, 2262, -706, -25733, -13780, -9101, -19400, -22385, 4160, -10906, -12234, 4158, 4778, 10764, 13433, 25965, 8365, 36942, 58382, 42434, 34148, 36228, 22280, -6064, -26154, -17536, -45087, -48714, -32855, -14611, 15362, 17267, -16741, -26696, 5816, 11844, -20739, -38570, -8829, -4440, -11320, -12602, -35623, -65720, -65239, -49687, -41346, -18794, -18431, -12167, 7698, 29355, 15715, 4111, -13426, -22681, -5400, -412, 2674, -859, -29632, -35845, -11195, -9998, -361, -3902, -12072, 5206, 7691, 6774, 2459, -38138, -40683, -48815, -42733, -28138, -30386, -30598, -53807, -61718, -42213, -33811, -33767, -20144, -13991, -8649, 13931, 32939, 23102, -13007, -27427, -37704, -46423, -50311, -64025, -51601, -1912, 13556, -19291, -15461, -14647, -13000, -19826, -2976]
14555b976J8560r271j8743J2863m682J4427o545n88J4314l013j8004j6430p402
14542b7490m1145k0437J3207K2799L5286J6416k3719m532L5189P851R231k681
14530A9975j2611j4755O572K982N649K0711J247P840p103j4612J8112J7186q152
14517D3041l0788k1353l151J6834Q870K1583q746k2869N606p516j8031j1721K7393
14504h48K4061n805j0541Q065K563L298N073K232l622M586O45o74K5084K4184
14490G8301j4793m1976q921j2936j7140q493K6214j512j476J391j0655j7630j4008
14477d3634K4512J8848J9431K5477k2979l2698j5010L3211K0250j6639k9365J614
14465a6982J793l4034n477m235M159J8435n4K1096m248J8888J4287l4721Q925
$$ y = [-2976, 15584, 6313, -12430, 433, -4249, 10178, 3633, 3045, 17359, 14346, -3658, -20088, -27490, -68635, -89072, -75865, -53066, -17780, -1364, -25083, -29615, 5574, 13425, 22656, 19975, 7364, -7391, -819, 2163, 7812, 28523, 29770, 37610, 30507, 15895, 34007, 51193, 43041, 12253, -9100, -12251, 4583, 13453, 35036, 26290, 3421, 9027, 1511, -16520, -28241, -848, 23213, 17408, 6867, 14932, 17495, 20793, 25866, 28098, 24476, 29062, 29707, 29033, 54117, 78301, 63508, 21532, 12611, -325, -17465, -25958, 256, -1256, -2732, -1341, -11996, -29626, -43634, -19122, -274, 19157, 44634, 21655, -11043, -26053, 7158, 27408, 10769, -18596, -16982, -15189, -49223, -54700, -58935, -54776, -36341, -36395, -15299, -19547, -659, 13628, -21093, -12168]
14452a2168J5113m1758m5552J2872K0903K8885o651Q225L530J3272M040j1328
14440a0617J3716j331k5840m0106j2650J1967J2310N290k2748J1629J7609J9704
14428b1067m454N919K543k9742r480L396J6267J6033K5309K0673L312j0485j3476
14415D748j907j1026J028j88j1128j471L719j5379q823R285L164O861q032O107
14401b3042J6790N380k223L448K2478J7599j9550k8363P103P752k793J603M785
14388A0967J206K2834K7245o312m011k824k2863k0208k9653j7252M7387J6365
14376B2881k127j5320l277j6094l4773j3580L969P006L457m284j0314J1661K987
14363d7808J4205L4086P746k9266Q043L0731Q44J152k0839J9741j0341o0510j2303
$$ y = [-12168, 2945, -38813, -84365, -71493, -50590, -21705, -28356, -20131, -16601, -3329, 711, -10617, 3099, 1768, -24072, -64178, -76828, -64861, -52551, -47261, -70009, -58380, -40771, -21067, -25521, -19602, -17059, -46801, -56281, -52885, -36618, -20585, 4724, 25397, 28709, 18224, 4748, 2841, -8185, -7157, -7345, -18473, -19944, -16225, -31604, -40427, -31142, -27978, -21117, -29149, -23042, -6252, -872, -3095, 353, 22831, 40430, 20880, -7483, -380, 7372, 4579, 6182, 10967, 12173, 35007, 62252, 55940, 51929, 49105, 26242, 6034, -23619, -40871, 6516, 22881, 20754, 5434, 2157, -13937, -48710, -62290, -58321, -51315, -47858, -52142, -62456, -50795, -47808, -33603, 483, 8229, -21037, -12994, 17737, 18581, 19733, -1106, 18635, 8294, -52216, -64519]
14350f4519j4114K0119J9211j367k267j1830p946K4460L5510k5672n457N229J2160
14337a6483P565K9860M793k2129j2713N578k9299l2795j1369K223K1029K2861
14325c0879q39J0747O583J3911q681j7467j1511k2675J5424N622j8908j633K0738
14312c9568j8783Q912J4317j3909Q428n170n290J5456J2060L0344j4923l2613
14300d0739M21J3656q512M809R495J1071o224j083o063j92R69k4226P148N097
14286c4373j0289j3771K201M1219J2363J7131N959k7650l1339l1948r420O183
14274g3734P509r260J1513K6909K2132J6817Q243l337j2144k2671l1180J8614
14262d0589J3290P070j6201n386J7793K535j0921O682L675r48K1224J9153o456
$$ y = [-64519, -78633, -58514, -39303, -40670, -42937, -54767, -62713, -38253, -2743, -28415, -33872, -28643, -16483, -8918, 20942, 25735, 3606, -9107, -3529, -32828, -65623, -76992, -74769, -53740, -30879, -31718, -20971, -14388, -477, -9158, -26625, -38136, -60811, -45387, -39765, -58673, -60306, -39568, -58351, -49439, -35122, -49031, -40603, -45773, -51063, -35607, -23547, 6797, -8126, -40739, -40318, -26662, -35174, -30365, -20870, -9799, -16023, -17106, -23169, -23361, -22392, -46618, -39470, -34373, -44662, -58433, -56232, -15013, -2650, 14481, 20440, -7210, -38549, -70497, -79917, -73734, -66225, -75485, -63972, -37063, -14931, 1886, 10129, 6792, -5352, -28023, -59203, -40589, -27299, -20229, -36430, -41816, -24023, -21488, -32409, -25727, -22052, -23000, -1776, 17377, 10921]
14249A0921L124m084j2729K5455k6322J0865J0100p534j8213j026n46L85K086
14236g518k1936l566N073m707k697K5510M2183J6558k0083j2664r825j5231j16
14223i019n19J0546j534J5504M0656j8093m5939k8949K1269R088J0466k411M787
14210E852p42k0193O969j6861j0329R875J37k4191l6423K9119K6356L381j736
14197b8786N739K2047J8513J3576Q626J6542j5825l5803L204J9780J3936M886
14185D6435o301k8402l0903k2282o501J9606P057l32J3969J1087j0238p242q059
14172b2106Q946R882J208O169K818K815p138j388j3667P4R009J4096J3115m195
14158A9638l379r322n769l229j4756k1065J9370j682j6798K698n912L3883Q39
$$ y = [10921, 14045, 9961, -2768, 22687, -3635, 7230, 17330, 9796, -8417, -9443, -9989, -9604, -7518, -29454, -33020, -27947, -32654, -35351, -9841, 32342, 48900, 28817, 16153, 6328, -8903, -9019, -9538, 1008, -526, 14978, 55634, 37541, -8398, -37347, -16078, -6990, 3476, 1065, 5852, 5110, -15083, -8114, -24975, -35304, -25429, -25292, -49483, -85906, -56787, -30431, -27050, -28786, -23047, -1000, 17513, 31089, 39715, 56257, 40432, 4629, 7833, 27613, 41549, 46435, 40134, 11732, -19171, -41453, -47954, -28348, -21291, -21623, -7654, 3433, -6805, -14047, -22106, -13160, -3278, -2070, 4099, 6917, 9732, 2594, 1206, -12461, -12387, -3378, 10718, 23833, 19638, 16259, 6937, 1168, -2061, -16817, -37882, -18512, -20194, -36992, -34294, -40206, -6323, -5484]
14145e484k1875j2307j867m149k850L2517p21k908K5479j4435k3985J4581P848
14132a0156j7009J388O590K9124J5198r508l3692j1939j4557J9454K5941q446
14120g612j684K0897j8892k9796p892J1131K6358J9629l3395K409J1538Q448n817
14107d678P800n179J2756P382k2888j791K6058L1061m838j2599j4452N452J648
14094B5732q211q262k6760J7320J176o771p280m119n32J3260K8504J461q791N695
14080B2422M864j0460j2515r088J2243n954p950J4629P483l76k0044M79k349R868
14066C252j3620L6145J7786l0128l8355l116L469Q666j3627n450K4803K0438j6774
14053f511N527K630j1350L465J0436r217M941q310k0799N741j2315j1613Q656
$$ y = [-5484, -27359, -39666, -41533, -45682, -48532, -16015, -16736, -19644, 5835, -8600, -32585, -18004, -10156, -27165, -25777, -19187, 9937, 25135, 15627, -18065, -30004, -44561, -25107, 834, -7612, -9296, 11601, -7291, -37087, -44979, -33848, -7490, 12139, -21256, -18847, -7309, 1139, -4678, 3122, -2057, 10699, 18081, -4807, -6598, 19460, 50521, 45683, 33084, 18632, 24084, 25732, 17521, 9259, -17501, -181, 995, -5776, -13056, -17175, -17707, -4447, 24057, 25518, 16727, 22422, 27286, 16826, 4311, -4777, 7466, 1512, -6438, 8191, 15674, 15298, -4746, -4267, -6616, 3252, -10368, 25777, 43563, 13435, -24920, -28036, -24567, -15901, -29528, -34978, -10175, 10263, -6511, -984, 1646, -9704, -6239, 4197, -5020, -79, -8389, -29188, -23447, -35762, -47375, -38719]
14040c8719L1917L4781R108K8887J320q231j1149j1989j9790n848R655n738j6299
14027b095N682N195r642l7863l4209m173K8903K822k932l469J607J9456l8661
14014f9379k3456J1221K7841K4455J4340Q842R316J5076q925K568J1588Q140Q92
14001C2519k2265o655J5725j7474j5113j384p805O427o567O25k1631N047K30j6573
13987e4894J5936J0196K1396l922n084j0862n433j5070p245P195J9963K9945M711
13974F832o707J285K970j130l1604L233K8140O875j0176R23M826J560J6786J7108
13960D0921n400l2339k3533P572L522k445o782P549K2240q209q713n995J895K3153
13946A3436m54J714K4276k498o998j3273K972k1659j9464L629K1589m168j3350
$$ y = [-38719, -6802, 27979, 37087, 65974, 67294, 59063, 47914, 35925, 16135, 10287, 19942, 14204, -2095, 3587, 8782, -860, -38723, -72932, -77105, -48202, -45380, -48312, -51781, -50174, -30718, -69379, -92835, -81614, -53773, -29318, -14978, -6136, 3180, 18256, 9331, 11899, 23487, 31627, 32519, 10254, 3599, 19324, 1850, -13263, -14647, -22452, -16025, -22592, -21967, -43598, -38551, -38321, -54894, -38958, -28762, -7366, -11288, -16372, -27234, -32667, -47737, -54982, -47787, -27824, 2121, 6832, 125, 1410, 4380, 3250, -28354, -25121, 3019, 9894, -282, 641, 5467, 7027, 23813, 40921, 35521, 3182, -20351, -12779, -9257, -11702, -18484, -10935, 11305, 3096, -5617, -11612, -9717, 13436, 12982, 14696, 38972, 36474, 29476, 16203, 19175, -2484, -21948, -18319, 3270, -898, -14248]
13933a4248R088j023O4P393j7625j8188n671J347L1475K4656j4990j9290n239
13920b2251J936P681J1792J4094K3122L100k9219j0351J5341j1100J24J9283L885
13907B7437l838O27k4326j8109k283K0696J101J0227l065q497K6110K6607p659
13894D5028l628j1291j9450j9991j3627N410J39n430l743K3848L186k1663J4469
13881f743L9377K2664k8302k8875j7507p32J940p839j9689m348J9249J1382j414
13868b0837J9503j8833j6553j9622L637J5783K2103K0315J5046o657L530j1338
13856F077Q593k2433l9159Q731K8872k482k5623K0856K4475O115k0404l211J66
13843i427M5212J1797l4123k5054O037L196j7713l1491K035O445K7602J2676j7339
$$ y = [-14248, -5160, -6183, -6119, 1274, -16351, -34539, -40210, -38863, -7388, 17268, 2278, -17012, -22251, -20315, -12634, -842, 13252, 36374, 39474, 10255, -96, 15245, 4145, 4269, 23552, 27437, 23599, 24226, -100, -18209, -20492, 204, 1305, 11532, 8467, -30, 26080, 52687, 45028, 41400, 30109, 10659, -9332, -22959, -17549, -17410, -22840, -26583, -2735, 451, -21212, -6743, 32634, 55298, 26996, -1879, -19386, -20118, -18178, -26017, -45706, -50054, -30805, -19423, -20837, -1334, -20167, -36720, -56342, -52705, -36922, -14819, 5496, 20542, 13885, 17415, 6077, 14670, -7763, -46922, -38191, -9319, -11801, -37424, -16568, 7907, 14022, -6382, -9593, -9427, 35785, 47582, 13459, -11595, -5558, -2362, -20075, -51566, -49531, -43086, -15484, -2808, -20147]
13830b0147p023J3276k4445N150j2409r106K1123K4523J6900j8958l546q801q422
13817c1885K4657J3562k960R044k2126m860j3960j2280J2119j7818p952M776J6955
13804c2728J1506n716l589O827K115O789l298j5276K1307j6567R570J563J1749
13791e748j0508J1012K168j0252N489n075j1525j2784J6391L6073J6709J0663
13779D2613j0642o114j9123n1648P344j203j3733j2787J8156J7032j4720q366
13767e3191Q014J3661J8153J5923p047j3713K2044J3229j34k3452j1673J7793
13755c93K3995L2220j3025k1015j3486O044Q212k358j325J1356q803K4182J1623
13742E7227k8042k6521J6837J4520j9014k4673L064o285l315R678j6976j4035
$$ y = [-20147, -27170, -13894, -38339, -33189, -45598, -54704, -33581, -9058, 7842, -11116, -14662, -23463, -31885, -7228, 6334, 3374, 12418, -9708, -14568, -28528, -40808, -28689, -46507, -54459, -49683, -32728, -21222, -26938, -30527, -23700, -21585, -14796, -18094, -33370, -12063, -28630, -19060, -17497, -5748, -16256, -5244, -3076, -13328, -7839, -12914, -24439, -37223, -20832, 15241, 31950, 42613, 31971, 25857, 6734, -44914, -37570, -38773, -52506, -65293, -47137, -30105, -44825, -53191, -45177, -31516, -13363, 2560, -4487, -18200, 3844, 17073, 16939, -6513, -18186, -393, 23602, 55822, 42797, 21782, 8296, 14340, 22552, 20194, 18869, 30225, 21422, 45604, 57227, 29185, 2664, 19501, 34021, 15007, -9666, -6602, -12887, -16202, -6524, -23500, -37535]
13730c7535K7515J5225K548o414q06k1267q138p641o572J9061j203L390m301p24
13716b6862J8130J3789r348P362J4998p598j9039k1730l3966k3514K5256L7538
13704b4984N9424J9324k4129l1488l026O895K473n782r560L087m757k6309J0292
13691b8540L0743j463k26k6450P610J6842p22q724N886R160K2161J5663m396k7861
13677I683J3345K0572k6510j0662O906j8482j7049q346j7420q447J8880O133L8940
13664G543o877K7862J3627j8546Q563Q846j0124k7763P950L6268R002j8568N84
13651C8367J2447j1658p823P819o762j1988Q173J5219j8634l5726M943K1266K2547
13638C8190q285J875k0919N06L0269l830j4282j4759k0548j5761K6528K1572J7416
$$ y = [-37535, -10020, 5205, 7753, 1339, 533, -20734, -28872, -36513, -43085, -24024, -25227, -21837, -26138, -26862, -8732, 5057, -4291, 3071, 18069, 10471, -8568, -30298, -64264, -87778, -62522, -24984, 34440, 53764, 29635, -1853, -4879, 2016, 4489, -1293, -10853, -7766, -12523, -38832, -28540, 2203, 740, 514, -25936, -18326, -1484, -2206, -10930, -5044, 4116, 26277, 41940, 37544, 9683, 23028, 43600, 17090, 6428, 13334, -5148, -22197, -30543, -47963, -56410, -37530, -31397, 7543, 666, 28528, 42155, 23609, 32172, 41018, 30894, 3131, 11081, 47349, 56351, 37783, 38367, 50814, 39156, 31333, 39152, 32390, 20402, 28575, 43794, 25160, -10566, -5623, 15643, 38190, 29905, 31780, 10861, 11367, 41636, 37806, 23524, 8765, -11783, -27544, -1016, 20556, 37972]
13625C7972J035j6888j9316j1172J2922R188k8376k534K3633L5365k0335j5404
13613F090J8943R77j8052o989J2451K4503j2649m4577L703K7764J3601j1170o277
13600H318k2028m1108k2758K8867J3315N840J4121R134j9208J01o371J5240J7233
13587F96l0616n488J4330N875q73n06J2577Q071K3440k8420j5027R255J4118L76
13573G808J813p478o837K759k9937n731P407L2929J656n022M163J569Q066K1685
13559C4850m510J9404N76j9368k5300J995J409N296J1161k8368M714J0361j6063
13546c843p309l0205n745J5579M165j6003J4147J7505J474K1245m175k1025k6490
13533d0680O571K5077J4171N363N385n375q26j5127J5560m795j2808K2798j9048
$$ y = [37972, 39007, 22119, 2803, -8369, 4553, 13741, -14635, -17169, 6464, 41829, 21494, 6090, 25033, 26010, 7958, 969, 13420, 37923, 25274, -19303, -15600, 12164, 25765, 14595, 8318, -13710, -54818, -77576, -48709, -35394, -29554, -15433, -6299, -25507, -25406, -31777, -16537, 696, -29920, -35408, -21078, -15203, -16076, -16582, -4005, 4066, 27506, -914, -15941, -6686, 7432, 7808, 9621, 2143, -4694, -1935, -31872, -37603, -30196, 2733, 4389, -633, 3530, 5099, 13165, 34850, 30340, 49744, 50320, 30952, 5652, 7647, 9056, 14352, 25513, -2855, 1859, 12220, -3843, -11152, -41357, -47102, -31523, -27358, -43361, -29214, -11709, -10235, 11010, 6835, -14190, -40680, -34109, -9032, 5139, 10502, 15887, 10512, 9686, -5441, 10119, 5324, -7484, 15314, -3734]
13520c734J0548J2220J5828l1951j6262j2482p994J8119M9888J2850l5156N143
13508A7017J5504J2231K2612J3519l4195l777o720k2236J226K1631m425k6792
13496E595j014j6756r61J5955j2351j7918N46K5637j755n610k542K196J6132L1205
13482C8359k190p679j4348j1217l197J4994k2919J7959J7291L3597j9687m2543
13470a580O438K9866J1295k226j0401Q988k2297j8078l417o565l570N107L3194
13457B6754J6785n675m0542k267K8935j517j8611K1881J3437k0248K850J3313
13445C5095Q396r712j6288K560k2868r731Q12k9240j7463K0057o32k265L2193
13432i086L6036O326j8071k3593k93L690m561q220Q084K2528R923l606N887k064
$$ y = [-3734, 6814, 19034, 34862, 2911, -13351, -25833, -33827, -15708, 34180, 47030, 11874, 17017, 32521, 44752, 67364, 80883, 46688, 42911, 36191, 13955, 15181, 36812, 32387, 5595, 4581, -12175, -13136, 2819, -9532, -27450, -26904, -1267, -3022, -8632, -11174, -8978, 7154, 38359, 36169, 28490, 14142, 2925, -272, 14722, -8197, 9762, 27053, 60650, 40963, -1580, 4858, 34724, 46019, 43793, 33392, 42380, 20083, 2005, -1412, -7977, -11547, -6440, 26754, 43539, 37864, -2678, -4945, 23990, 22473, 3862, 25743, 39180, 18932, 21782, 35095, 43491, 33779, 17491, 20051, -2817, -12548, -11736, -40976, -58439, -38382, -39014, -41279, -9086, 26950, 33276, 15205, -8388, -8681, -4991, -9552, -17772, -9688, 12840, 22763, 19157, 25044, 22980]
13418B2980K497J2243K1007j2999N811J7786k1411j5030P046J1177k0627O450
13406C6930K2254l3286k7282R918Q857j2144k7872l260m392r387N706M060J826
13393b8072M5952k137m166K1920j9251O661J036n261q300k463l115P17k2793n80
13379a9852L8756K1771q717j4682J097n854J3105J9047j1916k1093J8494J0158
13367D0314l299K0055J1006k146k7860j6501J2679L2274Q139m075j5330j4447
13355D0809J789j2431r133k1494N388L1120K8853k9953j4502J2685J9730j3570
13343C9291j4954j3052J0051J2327J8111q900k4654J3688J0024o482M258R192
13331D8900K6784k0862k0035J846k235K929O444j221L9509k179k4007q424l6117
$$ y = [22980, 25477, 37720, 58727, 45728, 51539, 69325, 47914, 32884, 39930, 51107, 30480, 36930, 59184, 25898, -1384, 8534, 17391, 5247, -22625, -25885, -30277, -39664, -33958, -29898, -28072, 17880, 15743, 11577, 33497, 14246, 20907, 21943, 16682, 8382, 5919, 2804, 3521, -19272, -19852, 18904, 40675, 31958, 17276, 18373, 12519, 25624, 44671, 32755, 11662, 30156, 40314, 37015, 57070, 68076, 65930, 38070, 21569, 34248, 66522, 74661, 70586, 55256, 40809, 42598, 30167, 21034, -460, 4928, 36048, 64901, 34948, 20446, 33131, 52861, 39291, 24337, 11285, 21336, 33663, 51774, 42874, 18220, 31908, 41932, 35450, 39708, 48900, 75684, 54822, 34787, 36633, 34398, 37327, 43771, 42550, 82059, 79880, 55873, 47449, 11332]
13318A1332m2007J3279k975Q730j2896r679J4379P475p144j8483K3921J1875K498
13305C05K274n086J0982K653r787k145N529P095r797k0555n82k800R896k763J2079
13290b702P349L047j8801J0647m256P089R211P827j521J6947J0570m0395m901
13277A11J0754J7660k275k2353n66L195j0640k3667j7740J3074L0956M259l09
13264B459J1719J9829Q487l686r771k7457k168M011k4922l3395J1862p61k152
13251d5945J1699l123J1347O149J006N770J6245j777k8936j589J6435J1395J1684
13238A0360J2553j3521j1749n041p893k0306K7845L0297L1K402J196k6729k0294
13225b0849O560J3790o550k3946q717k926K7310J5941K4478J0773k0431m295K1526
$$ y = [11332, -30675, -17396, -20371, -11641, -24537, -34216, -19837, -12362, -19506, -37989, -14068, -2193, 305, 2579, -2507, 8475, 11128, 1341, -804, 4725, 11820, 2023, -18532, -19114, -21914, -12018, -14781, -2702, 4647, 7694, -11107, -460, -4716, 2373, 11584, 19411, 17890, 34837, 45407, 5012, 111, 10865, 28525, 26250, 3897, 3331, 6526, -4114, -27781, -45521, -32447, -1491, 2768, 2459, 14178, 34007, 42494, 38808, 29037, 1580, -588, 3423, -21499, -54894, -43032, -43793, -45945, -34246, -37369, -26022, -19873, -18867, -13097, 3148, 1371, -27565, -29154, -12719, -1324, 10360, 22913, 9392, -2357, -7398, -15291, -35597, -7752, 22545, 22576, 24978, 26174, -555, -20849, -14289, -499, -7049, -30995, -39712, -42638, -15328, 613, 25091, 35864, 15433, 11138, 32664]
13212C2664m163l4437j3772O787J7914N339J4363k5155k8852K923J22k059K062
13199b6264K0083R285j7529K8094Q572m994q785Q223k86r238j2294J7469k312
13186A0024j0160J6815J0147K085j4608p887O408N668P027j1904l3332J4542J9065
13173A3890K5426j0469k2590j4449p748L5817O707k4007j5375J7615M419J2578
13161B1814o947N653R27j156o574L898j5590q301L413j5374j3390J35k9102J742
13147e8852K9479J5943k1601j3936M1142K0779K422O221O409l1282j2589M055
13135a1810J237L1400Q507o357l2203j8507M715q152p380K0243K4883j4798j3725
13122b1947N466K7375J673k3928l799K3398K7508p509k4839l7668J5091M273O951
$$ y = [32664, 28501, -5936, -19708, -12921, 4993, 10332, 24695, -460, -29312, -26389, -26267, -28326, -26264, -6181, 3104, -14425, 13669, 22241, 17247, 8462, 16685, 16399, 7161, -5133, 12336, 10024, -136, 16679, 26826, 28911, 14303, 6416, 12824, 18492, 25519, 13615, -19717, -5175, 13890, 39316, 28847, 6257, -8192, -15940, 19877, 26584, 2577, -12798, 4817, 9236, 21814, 14867, 20520, 21447, 20291, 13717, 17615, 2025, -6276, -2863, -18237, -31627, -31492, -60594, -58852, -29373, -13430, -35031, -48967, -7825, 12954, 15376, 21597, 28006, -3276, -15865, -11810, -10573, 20827, 29334, 22977, -9226, -27733, -23018, -31170, -38550, -18307, 6576, -8222, -21947, -16481, 10894, 12567, -11361, -15160, 8238, 35746, 28237, 3398, -34270, -19179, -14906, -7955]
13109g955j872q372K9971l540j2316K3997J0956j6261k3563k067K5540J8282j6319
13096A6481j5754O925J8228Q677J627l1611k7183k6727J8841M0143K3491J4176
13084D7314k3866k0655k4984J8311J074l3175p274K0330J8557K0112K5935N568
13072D7247l8571o312k0056K864J3476q442L74j933J9618K1542K532j4371j0189
13059G779j953J7634j4024j2892J2271M691K1219m257k3192J5010M9296l263j2060
13046E6259J449m0322l5636r039J7550J5530r538j1068r910j8472r427M719J177
13033d6728J4057J8610J1869j1686L507K698k768L445k4693J4092J2482J4632
13021I517k312o45k453J6525m948j3669J901r942J0061n992K6082m855l87j4613
$$ y = [-7955, -9827, -18199, 11772, 8232, -4084, 19913, 30869, 14608, -8955, -11022, 14518, 32800, 16481, 727, 7652, 25880, 34557, 36184, 4573, -22610, -49337, -30496, 9647, 33138, 47314, 23448, 2793, -22191, -3880, -2806, -35981, -43255, -22925, -4368, 15744, 41679, 47247, 8676, 2364, -17692, -14828, -1352, -9794, -9420, -11353, 8265, 29807, 32339, 17968, 7779, 5826, 23460, 9436, -3456, 8815, 13506, 34725, 30468, 7276, 22286, 71582, 68319, 56259, 57708, 17386, -18250, -27289, -9739, 5791, -3747, -14815, -24725, -43197, -52624, -47905, -46728, -32671, -14061, -2192, -13878, -10371, -7673, -10441, -6996, -31689, -17597, -5115, 9517, 7205, 6560, 4107, 20632, 15684, 2015, 3916, -6026, 4035, -1957, 24125, 19270, 18883, 4270]
13007D270j5218r10J9379o229K4809J8532k4507j0661L3892L2523j3112R887k16
12994G2439k5259n2432k8199J7540Q024N077K1761J5991m877K2304M108m9371
12982G106J4632O92q169j943q171Q503J0451j1104J186q876R796K346j1376l4796
12968b9723j855L3459J5579J6629k196l082n284m311Q466O548k6532Q159L5495
12955E1352n714j2601j4314k3180O999O631J5220Q904l2704j5778L367K680L401
12942e737K8420J1379l348J3825J8085Q555n104k2373K4319j875J0132N033k9735
12929E1576k7423j3639N29J6777j7596L694O998K5078L3522j2706k124j2977l3206
12916A8503j1901k7020q592K5543K2498j3497O812l0010J2388K7518o154R37m63
$$ y = [4270, -10948, -11858, 7521, 1292, 26101, 44633, 20126, 9465, 43357, 75880, 62768, 72655, 72439, 47180, -5252, -33451, -15911, -7887, -2810, 18951, 34942, 30065, 52369, 56477, 7106, 21738, 22430, 14261, 12318, 4147, 12650, 23101, 11997, 13183, 4307, 14103, 16449, 5073, -29723, -31578, 1881, 17460, 34089, 31893, 28811, 23527, 19216, 27682, 34230, 7698, 15857, 51352, 45638, 33037, 18723, -4457, 2542, 9173, 24393, 33297, 593, -15185, -11818, -9138, -5737, 22683, 34062, 30714, 44539, 62624, 71179, 66075, 43702, 68021, 66146, 76278, 81311, 51576, 24153, 10514, 11043, 27820, 10224, 13918, 20916, 45994, 79516, 66810, 64686, 51709, 18503, 6602, -20418, -29010, -3467, 19031, 5534, 12346, -17664, -5276, 22242, 16088, 17025, 16562]
12903A6562L103Q772k748j8982l2483M501J0023Q346L1716J236O796k0652j3692
12890B498K3098K7181J5916p159k9312J3744J319J673n746l183N579q811K331
12877C9128q818l1612j4319q757J7526K3359L1437j0517L784j33n984j9495J7758
12864C3357j088J2993Q065J534J4217j7180k8513k2525j9328K4937N168J9041
12852C0678J4724j1348r295l6070j4582K0001J8720R857k1885j3630J6311L683
12840G164L825J421K0746j0923j8912o998P655K558K368r961J9486K43k398P513
12826B3787J00J1526J4741j0k7167k1763J7251L7833J0982j1232J118j6624m2743
12813b201k4336J6414Q643J492J3921J9211q207P524K145k6495K5429K2353k2529
$$ y = [16562, 19665, 28437, 25689, 6707, -25776, -21275, -11252, -2906, 28810, 30046, 36842, 16190, 2498, 25596, 52777, 68693, 61534, 32222, 45966, 47285, 48958, 43212, 40029, 45608, 36797, 39128, 30310, -1302, -15621, -24378, -6852, 16507, 47944, 37427, 41211, 41078, 35094, 15599, 33357, 32269, 45262, 53327, 54861, 69078, 51898, 23385, 860, -18468, 6469, 11637, 30678, 45402, 34054, 24759, -11311, -25893, -5892, 12828, 22685, 800, -12830, 3481, 7164, 10989, 12410, 33156, 22233, 3321, -3677, 3978, 6536, 8904, -1057, 18429, 18672, 16274, 23787, 23887, 35413, 50154, 50144, 22977, 1214, 18465, 56298, 67280, 56048, 57166, 40542, -2201, -26537, -10123, -1480, 12, 13933, 33144, 24937, 32461, 34606, 8111, 33540, 55893, 33364]
12800C3364j6292j577K5917L5327Nk5756k7762J6090J2413l8965j6484J4662N248
12787A6190J8837L356l018k3570K389J5936R709j6426r836j0466K0667Q921l0812
12774A877j4666L9138M2507j1317J82r649N957j1629j0600J1974r90j5757l8745
12761a1718J4090K9684J299q167Q908J1152J771J5874o449j3576l6819j2945M0079
12748C3183R347k8802O64k1071R4J2648K801J2978m979p836l526Q8K2080Q941
12734C6610K9685k1333j2291r80j8762J2363L033q491O588J3579L922j6025m0275
12721a2377q972L0731J6957l127j8896n422k1874l925J1021k996j0k64J9590J3485
12707A3921M5897L364j8381n980K350j837J3716m537j0347j105l0023J0565K2390
$$ y = [33364, 17072, 15495, 41412, 76739, 76744, 50988, 23226, 39316, 51729, 12764, -3720, 10942, 16190, 35027, 38383, 35365, 11795, 14184, 30120, 39829, 23403, 13567, 3101, 23768, 32689, 1877, -12789, 26349, 68856, 57539, 57721, 48072, 54029, 42400, 31800, 43774, 42784, 27027, -11718, 2372, 32056, 33355, 25188, 34096, 45248, 47019, 62893, 56444, 42868, 6049, -6896, 33183, 42530, 13728, 14392, -6679, -6585, 6063, 8864, 21842, 16863, 9027, 5501, 5589, 27669, 36610, 66295, 44962, 32671, 31691, 12929, 25292, 28325, 19834, 26422, 40001, 43923, 27898, -12377, -21349, 9382, 26339, 23212, 4316, -1106, -22980, -26905, -15884, -18880, -18890, -19154, 436, 13921, 59818, 63182, 44801, 38821, 41171, 39334, 53050, 48513, 38166, 37061, 7038, 17603, 39993]
12694C9993j5833O525l096L3226j586j3399K3357K0257j2228j0277j2450k1436
12682C3053k6797n819l0200q702q271K8560J4394L218M3931m308l936k8293n925
12669I05P924N407J1187K5014J983j753k5120k5280j0112p776Q151L242j843L3809
12655B5738J0063M811k1224M873M1774K3004k1236L586q76j9328l6010j6729K2743
12642B1189J7042R291R177o48j4348m098J0176J7719J826j0461R536k6527N267
12629D5141J0518J4796L4724J2005n9858k226L3055j5129m683O446Q06o672m312
12616F4611j3102p794j5914m107J5431J9185O142k0328p795J2806j3271Q664M0363
12603H4891r827o970J8648j5686l9392j4137L882K7622L1011P379j1335j1475
$$ y = [39993, 24160, 30685, 27589, 60815, 59229, 45830, 69187, 89444, 77216, 66939, 54489, 33053, 6256, 437, -29763, -38465, -46736, -18176, -3782, -564, 43367, 39059, 35123, 6830, 905, 8829, 14236, 25423, 50437, 52420, 50667, 25547, 267, -9845, -17621, -9470, -6228, -8071, 25738, 35801, 40612, 19388, 24261, 66035, 89039, 67803, 71389, 70513, 51185, 15175, -1554, 21189, 38231, 47522, 56699, 56051, 41703, 37605, 47781, 65500, 67326, 56865, 66401, 39874, 45141, 55659, 70455, 105179, 117184, 57326, 55100, 88155, 73026, 68343, 74789, 75595, 68923, 64611, 51509, 43715, 27801, 23694, 39125, 58310, 64452, 44124, 36329, 49135, 35864, 44528, 84891, 75064, 68094, 86742, 71056, 31664, 17527, 21409, 49031, 80042, 87421, 76086, 64611]
12591F4611j6412j238k320l1701r842J9428R362J224m762k526j4852N447k3985
12578g566j5520K4954O569J0466J3911J1764k1079K1946j7586n683J1100J0596
12566D3872J9048j372j3553O747j4087P825M821j2973j1533j3636N050J2432J0516
12553D3157k8784q325N489M5036K3558J892j6054j6740j0338k2060P052L1379
12541E5262Q472l4635j0698j6183p705K237L722J9004L8674l7598k1529K1133
12529B0156J4915K5790K2226k721k1250k329l719q507j2112l0464K865N768L1539
12516D2157J7596K737j8803k1643N470j7983l191r327K1298K8790K2445j7076
12504E2470J1836j960m567R529Q741J1123J3257j4858j4648j8714P192m242n872
$$ y = [64611, 48199, 46961, 44641, 12940, 3098, 22526, 31888, 33112, 28350, 25824, 10972, 16419, -7566, -23086, 1868, 8437, 18903, 32814, 44578, 23499, 45445, 27859, 22176, 33276, 43872, 62920, 61548, 47995, 54742, 40655, 48480, 53301, 40328, 28795, 15159, 20209, 32641, 43157, 14373, 6048, 11537, 56573, 80131, 82023, 65969, 49229, 38891, 16831, 23883, 55262, 63734, 29099, 18401, 2218, -5487, -3250, 472, 19476, 58150, 20552, -977, 20156, 35071, 60861, 83087, 80366, 59116, 56787, 53068, 44561, 32449, 1985, 4850, 10618, 42157, 59753, 62490, 43687, 22044, 27514, 9531, 6340, -2987, 18311, 47101, 69546, 52470, 64306, 62346, 57779, 67308, 76049, 87172, 100429, 85571, 70923, 52209, 59401, 55159, 49287]
12491D9287j2609j1136k095J0006J3190j0568j3705m406K9475J7801o561j2795
12479D5884K3579P329p700N046m858n178M637J3736j1843N26k0246l465J9558
12466F7005K1707J400q91L4189k1753Q095K6905k2228j6586k3425k9540N119k059
12453D7938l951j2752K358O430j4014q123L470n512P169K5295J2173k1381k1565
12440A7535j095J9601K2791J6223r333J441j7698q898K219n405J2070l167n788
12427D0496L514K2852l3657O830K9185k1206k216L2665J9049j6562r920k2561
12415D8469j0393j0676K0703P44J7757l7551j1105M0767J51J2419J4327l302j2817
12402F9493l857q615n325J2752O841L0534P707k1231r049O667j6774k041J4708
$$ y = [49287, 36678, 25542, 23447, 33453, 46643, 36075, 22370, 17964, 47439, 65240, 58679, 45884, 69463, 76792, 69092, 74138, 69280, 64102, 68739, 82475, 70632, 71158, 50912, 47447, 67005, 88712, 90112, 89221, 123410, 101657, 109752, 136657, 114429, 97843, 74418, 44878, 49997, 47938, 43987, 31235, 33593, 40023, 26009, 17886, 21356, 15844, 23013, 48308, 60481, 39100, 17535, 16440, 36041, 58832, 75055, 65722, 67163, 49465, 40567, 42786, 37381, 49451, 46284, 40496, 44010, 66862, 33205, 40035, 69220, 48014, 45798, 78463, 97512, 80950, 71030, 48469, 38076, 27400, 48103, 48847, 66604, 29053, 17948, 58715, 58866, 71285, 85612, 82310, 69493, 65636, 57021, 51696, 64448, 71289, 101823, 109530, 88299, 79250, 85917, 69143, 67102, 81810]
12389H1810K4707K446P295k016j3736p73j2805j5952j8107k985J1255J2199l642
12376F9696q263j4527K7449J8511J3503j1094l104j5783k4911K2173M8856J6800
12364A39306O013j7101o030K4512L826k4697j5211O416K0108J7668k085j1220
12352A41505j5455K3874J0745m400K3591n874j1664J4624J5474J8051L6081M37
12340B46989j474j9231J2367K0198J9201K9014M1685L3804M3360L3070L3549K9758
12328E22290L1011M3820N7504L3029m679J9428K3581n607n52L704J5908r434j3981
12315G16022J6955L461j2784L5612P884K8229J6586J8732M6267N6131M7909J160
12303I82164J266L870J3340J7835J4321N0763M7545j120l689l6373k0694J933
$$ y = [81810, 106517, 108963, 116258, 114242, 100506, 99733, 86928, 70976, 52869, 49884, 61139, 73338, 69696, 61433, 46906, 74355, 92866, 106369, 95275, 92171, 76388, 51477, 73650, 122506, 139306, 145319, 128218, 122188, 146700, 150526, 125829, 110618, 117034, 137142, 154810, 152725, 141505, 126050, 149924, 160669, 156269, 179860, 173986, 162322, 176946, 192420, 210471, 246552, 246989, 245515, 226284, 238651, 258849, 278050, 307064, 348749, 382553, 425913, 458983, 492532, 522290, 553301, 597121, 654625, 687654, 682975, 702403, 725984, 720377, 719825, 723529, 739437, 730003, 716022, 732977, 736438, 723654, 759266, 767150, 795379, 811965, 830697, 876964, 933095, 981004, 982164, 983430, 987300, 1000640, 1018475, 1032796, 1083559, 1131104, 1129984, 1126295, 1089922, 1069228, 1071161]
12291A071161J3257l754j832k4221k5781k0381j4055m1238j9120m1202l1118N470
12279H67186J1950j2438j7645k0500j9538p693n4718l7069j52P919K5762k834
12267G40230l2109K2288J735o419K605l1168j90j5840j6834l6485o3066p1357
12255D93390o4450k7892j2776n477l3630o6836k8960M044q044K1762q794l3714
12243B28623j3714j0296q175J7653N840j0853q705k4939q661j7716O652O232O542
12230A68483j1044J5294P510k9582k3717p055j334j0001J3803j0277K855p778
12218A07157l791q803J0165J8852K8245o217j1200l1857J4611K6732K414k145
12206A44163k7915n4733Q640K4592j1818J1982J9780N23l396N896J5948O780j0983
$$ y = [1071161, 1084418, 1080664, 1078832, 1054611, 1028830, 1008449, 994394, 953156, 934036, 892834, 861716, 867186, 879136, 866698, 849053, 828553, 809015, 801322, 746604, 709535, 709383, 717302, 743064, 740230, 708121, 730409, 732144, 725725, 728330, 697162, 696972, 681132, 664298, 627813, 564747, 493390, 428940, 401048, 388272, 382795, 349165, 282329, 253369, 257413, 249369, 271131, 262337, 228623, 214909, 204613, 196438, 214091, 219931, 209078, 200373, 175434, 166773, 149057, 155709, 161941, 168483, 157439, 172733, 180243, 150661, 126944, 119889, 118555, 108554, 122357, 112080, 114935, 107157, 103366, 94563, 104728, 123580, 151825, 145608, 134408, 102551, 117162, 143894, 146308, 144163, 116248, 61515, 70155, 94747, 82929, 94911, 114691, 115214, 111818, 117714, 133662, 140442, 129459]
12193A29459m926l546K3384L8775J5481K2266j3604K170k6613j2864M185K5334
12181A99501m220m187q838J0057R474j1173r810K7425K0948q061K1644r723j4791
12168B18246J6178J7777J1581j0557j1215J7942p55j4893k935O603M467J7168
12156B69607K6135K8867Q322k8680M859l275k784n623R056J1282k2145k0074o838
12143B68709J6215J3142N275K2741q336l0342K2225K1344J1394L54J0114J336
12131C54171K0346J999M94j192q336J4156L4716J3640j1012k0689q021o990j0640
12118C72642l086r676L475N356k3064J5084J1603o382n888l904k142K8914N456
12105C88388O444j3699l1950j2388k8338K5345r342j0682j094j2251J4810N666
$$ y = [129459, 124533, 120987, 144371, 183146, 198627, 220893, 207289, 209459, 182846, 169982, 174167, 199501, 195281, 191094, 182256, 192313, 201787, 190614, 180804, 208229, 229177, 221116, 242760, 233037, 218246, 234424, 252201, 263782, 253225, 242010, 259952, 259197, 244304, 241369, 247972, 252439, 269607, 295742, 324609, 332931, 304251, 309110, 305835, 303051, 297428, 306484, 317766, 295621, 275547, 268709, 284924, 298066, 303341, 326082, 317746, 287404, 309629, 330973, 342367, 342721, 352835, 354171, 374517, 376516, 377010, 375818, 367482, 381638, 416354, 429994, 418982, 398293, 390272, 383282, 372642, 369556, 359880, 363355, 368711, 345647, 360731, 372334, 365952, 360064, 356160, 354018, 382932, 388388, 394832, 381133, 349183, 336795, 308457, 333802, 324460, 313778, 312684, 300433, 315243, 320909]
12093C20909J4269J7527n189k2042j7366J8103L1375K3891R500k0459P199J8506
12081C96223K0060j943l928l7300q539J8663R721j8350j6366K9175j9505k738
12069C65173J7955M29k8402K6036J3410N445k621j7700j6108J2021L0973J071
12057D07682j4740n839l6658q559L4165M3117N1824j519N535J8907L6546J3763
12045E44224r704j4258l648K6008l322j373J4134J2548j8726R73Q950R665J6779
12032E82250J6053J7021J2953J3791j1182L506L3223L2545K9964N8383M0215J734
12020H30456k224k545M1888L7357K3534n475n937N991K9808K3528K3440J6133
12008A015954J3221J8734R098O863L1082L7821J9704O753J9090K4796M7135M5155
$$ y = [320909, 335178, 352705, 347516, 325474, 308108, 326211, 357586, 381477, 390977, 370518, 377717, 396223, 416283, 414340, 410412, 373112, 364573, 383236, 392957, 374607, 358241, 387416, 367911, 365173, 383128, 383557, 355155, 381191, 394601, 400046, 397425, 379725, 363617, 375638, 406611, 407682, 392942, 387103, 350445, 341886, 376051, 419168, 470992, 469473, 475008, 493915, 530461, 544224, 534520, 520262, 516614, 542622, 539300, 537927, 552061, 564609, 545883, 546856, 555806, 565471, 582250, 598303, 615324, 628277, 642068, 630886, 634392, 667615, 700160, 730124, 788507, 828722, 830456, 828232, 825687, 867575, 904932, 928466, 922991, 917054, 923045, 952853, 976381, 999821, 1015954, 1029175, 1047909, 1057007, 1063870, 1094952, 1132773, 1152477, 1159230, 1178320, 1203116, 1250251, 1295406]
11996A295406O0139O9302O1425J9792L6814L1379M4970L2320K4206l035K6478
11985A699196J4414L655O041J9528N3495K3667J7091J5913L5535M2178M3146O7900
11973B041759N8672O5752O5843R6609Q6442R0122Q0225O7916J35726J09812J18151
11962C017029J20894J06905J63654J33790J19091J23928J16825J17726J21662
11953D141504J44135J49137J34208J50671J75983J93242K58126K43461K29488
11944E819955K48791K65837L02862L07846K94291K90779K94798K55436K75401
11935H355996K96267K65746K53350L02102L55378M45959N27705O52101Q02968
11926A2257572R67374J099631J243751J361491J497942J640856J795058J907593
$$ y = [1295406, 1355545, 1424847, 1486272, 1506064, 1542878, 1574257, 1619227, 1651547, 1675753, 1672718, 1699196, 1713610, 1717265, 1723306, 1742834, 1796329, 1819996, 1837087, 1853000, 1888535, 1930713, 1973859, 2041759, 2100431, 2166183, 2232026, 2328635, 2415077, 2505199, 2585424, 2653340, 2789066, 2898878, 3017029, 3137923, 3244828, 3408482, 3542272, 3661363, 3785291, 3902116, 4019842, 4141504, 4285639, 4434776, 4568984, 4719655, 4895638, 5088880, 5347006, 5590467, 5819955, 6068746, 6334583, 6637445, 6945291, 7239582, 7530361, 7825159, 8080595, 8355996, 8652263, 8918009, 9171359, 9473461, 9828839, 10274798, 10802503, 11454604, 12257572, 13224946, 14324577, 15568328, 16929819, 18427761, 20068617, 21863675, 23771268]
11918B3771268J986232K019238K145494K291648K427785K633033K821364L129654
11910D3225716L548300M170662N037583N974016O684542O679057N961635N008809
11902H6290320M446558M460363M650323M631380M325211L917805L668046L556858
11894A19946864L416468L101322K677315K249440J934539J664568J470039J466598
11886A37927153J676893K167434K796868L348187L840658M458562N216853N866771
11878A67299379O279906O253805N893533N431087N115357M979082M727444L963879
11870B09943472K475472K28307k642739n509673p529735q074482p328834n882405
11862A75679383m544091l749037l546442l770341m108888m386404m384623m077647
$$ y = [23771268, 25757500, 27776738, 29922232, 32213880, 34641665, 37274698, 40096062, 43225716, 46774016, 50944678, 55982261, 61956277, 68640819, 75319876, 81281511, 86290320, 90736878, 95197241, 99847564, 104478944, 108804155, 112721960, 116390006, 119946864, 123363332, 126464654, 129141969, 131391409, 133325948, 134990516, 136460555, 137927153, 139604046, 141771480, 144568348, 147916535, 151757193, 156215755, 161432608, 167299379, 173579285, 179833090, 185726623, 191157710, 196273067, 201252149, 205979593, 209943472, 212418944, 212647251, 210004512, 204494839, 196965104, 188890622, 181561788, 175679383, 171135292, 167386255, 163839813, 160069472, 155960584, 151574180, 147189557, 143111910]
11854A43111910l599936l198769l102472l360908l708943l810101l450585k696065
11846A16184131j676097m26337Q59240J971955K889573L571796L928303L798055
11838A31100619L037537J527609n28233k788913m918790o971120r063157j0971030
11830A00424522j1998187j1663134j0156474q183602o335088m890970l911612
11823D3285455l301836k897693k572302k280005k080841j912049j873142j977190
11815B4390397j996966j900832j745634j515482j261351j023689q37101p72406
11807A3336936p25048p24311p46549p14460o90556o70022o02996n77417n30480
11798G355097m71925m11106l65884l43092l05723k60475k22360k30762k31305
$$ y = [143111910, 139511974, 136313205, 133210733, 129849825, 126140882, 122330781, 118880196, 116184131, 114508034, 114081697, 114940937, 116912892, 119802465, 123374261, 127302564, 131100619, 134138156, 135665765, 135137532, 132348619, 127429829, 120458709, 111395552, 100424522, 88426335, 76763201, 66606727, 58423125, 52088037, 47197067, 43285455, 39983619, 37085926, 34513624, 32233619, 30152778, 28240729, 26367587, 24390397, 22393431, 20492599, 18746965, 17231483, 15970132, 14946443, 14109342, 13336936, 12611888, 11887577, 11141028, 10426568, 9736012, 9065990, 8462994, 7885577, 7355097, 6883172, 6472066, 6106182, 5763090, 5457367, 5196892, 4974532, 4743770, 4512465]
11789D512465j86004j52124j74457j55943j34395j28586r9710r8099j06296j07852
11779C168999j12931j17937j23692j12494j31175j38398j24794r5869r4224q2642
11769B034843n5672m6493n3079q5750l3341l0646q9048j02274p0357q2403p3144
11758A312636p9349o1072j3563m049l3247r071j5282p032k0857j7899k1728j0875
11746A018612m3720j8428J3739K158J7363j1705m0737m4243k4047m1141k8229
11735G99622l5986k953j2256q943J7558R499k4204o86k5048l9711m4915m7385
11723E84592K784K6729J0900j0910K3310J73J4058K258l0657O798K0897p491J7525
11710F60966K6595K4010Q701m9870l2853K7989L5867n302k6336k9539l9918j8583
$$ y = [4512465, 4326461, 4174337, 3999880, 3843937, 3709542, 3580956, 3481246, 3383147, 3276851, 3168999, 3056068, 2938131, 2814439, 2701945, 2570770, 2432372, 2307578, 2211709, 2117485, 2034843, 1979171, 1932678, 1879599, 1793849, 1760508, 1729862, 1640814, 1538540, 1468183, 1385780, 1312636, 1233287, 1172215, 1158652, 1154603, 1121356, 1112285, 1097003, 1089971, 1069114, 1051215, 1029487, 1018612, 974892, 956464, 970203, 972361, 989724, 978019, 937282, 893039, 868992, 827851, 799622, 763636, 760683, 748427, 739484, 757042, 766541, 742337, 741651, 716603, 676892, 631977, 584592, 587376, 614105, 625005, 614095, 637405, 637578, 651636, 653894, 623237, 630035, 650932, 643441, 660966, 687561, 711571, 720272, 670402, 637549, 665538, 701405, 696103, 669767, 640228, 600310, 581727]
11698E81727J8669q788j579j9873J947j0748j8190m5356j3961k4501k4164k4720
11686D10463J5076K1042L7760k0141l4837r373Q089k9612m0532l602J9309q613
11674C65029J6881K7472K8969q020l1737k3547N892m0005k0424l855J1844k1602
11662C06897l04l3422k2585J4311K394n935k7838j564J6153k554J1582P92Q06
11649B58733k3090J402K6741J9289J7000q317j115k7463r223L372K0267Q192Q228
11636B94016k7932k0937j1352J426j3161k4488j7815j5088J8731Q425k4995J5816
11624A82646K3428J0836r951j4891j900J12k0520j2082m457J5430N420j0437j1070
11611A52564R387M001n324K5312O524l6119l4494R716j120J5739q244l0046J4110
$$ y = [581727, 600396, 591608, 590029, 570156, 572103, 561355, 543165, 497809, 483848, 459347, 435183, 410463, 425539, 446581, 484341, 464200, 429363, 419990, 428079, 398467, 357935, 354333, 373642, 365029, 381910, 409382, 438351, 430331, 398594, 375047, 380939, 340934, 320510, 316655, 328499, 306897, 306593, 273171, 250586, 264897, 267291, 261356, 233518, 231954, 248107, 245553, 257135, 257927, 258733, 235643, 237045, 263786, 283075, 300075, 291758, 290643, 263180, 253957, 257329, 277596, 285788, 294016, 266084, 245147, 233795, 235221, 222060, 197572, 179757, 164669, 183400, 191825, 166830, 182646, 206074, 216910, 206959, 192068, 190168, 190280, 169760, 157678, 153221, 168651, 174071, 163634, 152564, 161951, 165952, 160628, 185940, 192464, 156345, 121851, 131567, 130447, 146186, 137942, 107896, 122006]
11598A22006J340j914j2k7385J6731l2181J077R352K4964o475k26N076K265J2322
11584A26940K63n723p618q812l619p501m3542l3396J9515K2498J6665K3531j1982
11571H7219q523J3836m545k7174K3523m553O26P971r90N714J9495K345j5187o810
11557I2947J5400Q755j3493m529L2364J1143J901l1312k6180P636j5053j2885
11545F6694J0082J8011p651J0484J4345j0488Q475o368j5929j58L776jO018O268
11531A03558P273j6582M603J7931O469j1899K2411j8274l4321l7181k912J8875
11519E9951K3126J3481j302p957j1262l660o276k7792K4370N153J2640j603K146
11506H1015J2158J5203M0637P845R726j9018j582K3954K8770k1043k6091q683
$$ y = [122006, 123346, 121432, 121420, 94035, 110766, 78585, 79662, 89014, 113978, 107503, 107277, 112353, 114618, 126940, 127203, 121480, 113862, 105050, 101431, 93930, 50388, 16992, 36507, 59005, 75670, 99201, 87219, 78696, 92532, 87987, 60813, 84336, 79783, 80409, 88380, 87390, 93104, 112599, 114944, 99757, 92947, 108347, 117102, 103609, 99080, 131444, 142587, 144488, 113176, 86996, 94632, 79579, 66694, 76776, 94787, 87136, 97620, 111965, 101477, 109952, 103584, 87655, 87497, 91273, 91272, 97290, 103558, 110831, 94249, 98852, 116783, 123252, 111353, 133764, 115490, 81169, 43988, 41076, 59951, 83077, 96558, 95256, 87299, 76037, 72377, 66101, 38309, 62679, 67832, 80472, 78869, 81015, 93173, 108376, 149013, 156858, 166584, 147566, 145984, 169938, 198708, 177665, 151574, 142891]
11494A42891M885j8188K2081J2327J244K029J9252r188m990K8708p111k215K5253
11481B16978J572L4667L5363L4721J5876L274L3332M8076M5266O3806L0323K6219
11469E89473L6693K4469J1105M5091p943j187J4047K2735K1734L755J5161n10
11457G74623r500N590K1971K2074L044j60M1699J2832J1144k89J8141L5337N4139
11444I90645N8578K2518L3930L7738J4313j0353j4701k5296k4725k3004l2468
11433A027175k9161k5998j6519L671k4835m9919k1349l3147j0172n6409k4864
11422G38473j1886k5925k9438j3430L969k9679j9463j206P151N394J4186L0145
11410F68291J3586L802J0527K3622M3874J3828j212o843J459p920o9546p1572
$$ y = [142891, 147776, 129588, 151669, 163996, 165240, 167269, 186521, 177333, 172343, 201051, 193940, 191725, 216978, 218550, 253217, 288580, 323301, 339177, 342451, 375783, 423859, 469125, 532931, 563254, 589473, 626166, 650635, 661740, 706831, 698888, 697701, 711748, 734483, 756217, 759972, 775133, 774623, 765123, 770713, 792684, 814758, 817802, 817642, 859341, 872173, 883317, 883028, 901169, 936506, 990645, 1049223, 1071741, 1105671, 1143409, 1157722, 1147369, 1132668, 1107372, 1082647, 1059643, 1027175, 998014, 972016, 955497, 959168, 934333, 884414, 863065, 829918, 819746, 763337, 738473, 726587, 700662, 671224, 657794, 661763, 632084, 612621, 611415, 618566, 623960, 638146, 668291, 681877, 685679, 696206, 719828, 763702, 777530, 776318, 769475, 770934, 763014, 693468, 621896]
11398F21896m1966l5347n5572n4978p4580p9064j7676k8013l3546k4012j7677
11387A59465m956K8933o100o282r810Q884j9618l5091r804q2n161j9124P905J0138
11373I9297Q528k2576j8901l6636M059J6770p004j987k5742k5435o716K3768J2509
11360A9934J2346J9180r704J9791J7129k8130j869j2975o115Q444K709M040l9584
11347E196q328n141K1324J3574P003J8645k5725k3257J2734L945p99K3853J4903
11334E7927j8673p792j0505k3383M241M0470K5170j0395j0639j1368k1698J9096
11322C2451J4587l4803j1765K7670L843k4451j3913j5J9885J5063M454M712J3937
11309E1655k328m650l591K5970k2338p929k1479o674R666J3268J4300j3775m68
$$ y = [621896, 579930, 544583, 489011, 434033, 359453, 280389, 262713, 234700, 201154, 177142, 159465, 154509, 183442, 177342, 171060, 161250, 170134, 150516, 115425, 105621, 105539, 100378, 81254, 89159, 99297, 107825, 85249, 66348, 29712, 33771, 50541, 43537, 41550, 15808, -9627, -16343, 7425, 19934, 32280, 51460, 41756, 61547, 78676, 50546, 48677, 35702, 29587, 38031, 40740, 44780, 5196, -3132, -8273, 13051, 26625, 33628, 52273, 26548, 3291, 16025, 19970, 19171, 43024, 57927, 39254, 31462, 20957, -2426, 1815, 42285, 67455, 57060, 46421, 35053, 13355, 32451, 47038, 12235, 470, 28140, 31983, 7532, -6381, -6396, 13489, 28552, 33006, 37718, 51655, 49327, 44677, 41086, 67056, 44718, 36789, 15310, 8636, 18302, 31570, 45870, 32095, 31627]
11296C1627r024J3412j4510l974K6114j1341l9113K4658J3633j7805j186K713
11284A5204p367K4855k640m366r500M323j9764k1865j196K5439O405m893j5267
11271a0632J141K4143L0263r579j7003J006j4157j7989J3209L177P550J4267j9030
11258F366j0674J3177k514p417J43L8366J5386j5588j4403J0008J0891k981j6061
11245B4699j4764m507J1902N765k1804K436J5552n57r533j0273k670J1969K9628
11232C7843K7152j6271m5691o292j2619k6525j2253Q940J1727Q773P79N891R97
11219a7549K9068N450J8887J4485M573k8955k4707L358k663J7172j330k1343k8261
11206c1815l579J9872K1883J73k8790K1795Q351j7092j3826J0031K9718K2961
$$ y = [31627, 22603, 36015, 21505, 17531, 43645, 32304, -6809, 17849, 31482, 13677, 12491, 15204, 7837, 32692, 30052, 25686, 16186, 20509, 745, -21120, -22316, 3123, 9528, 4635, -10632, -9491, 14652, 44915, 35336, 18333, 19339, 5182, -12807, 402, 3579, 11129, 25396, 6366, -4308, 8869, 6355, -1062, -919, 37447, 52833, 37245, 22842, 32850, 43741, 40760, 24699, 9935, 5428, 17330, 23095, 1291, 3727, 19279, 18722, 9189, -1084, -3754, 8215, 37843, 64995, 48724, 3033, -3259, -15878, -42403, -54656, -45716, -33989, -25216, -24437, -18546, -17549, 11519, 16969, 35856, 50341, 54914, 25959, 1252, 4610, 1947, 19119, 17789, -3554, -31815, -35394, -15522, 6361, 6534, -22256, -461, 7890, -9202, -23028, -12997, 16721, 39682]
11194C9682J2873k4634m7416L97R510k1038J6203K138J0770J2416M322J1422K7207
11181E3852M4279N3581M2265J4903P451k521O089R904O49n3275n5655k2514j0444
11168H8564j3118L770o414o270K07M264l0641l6267J2143L9538J087j2671j7007
11155B7185j0461k3012j6907m066J2755J8541Q494J5331j6890k5270L5178J6597
11143C7475j0335l3410l3216l9716q39J8806P605M6629m407j2187k6305R711M3048
11130B859K7684k3087n829j9350k582J5805n428r419l242j8533k29L7206K1252
11117A7107J200J6087Q506J0903N305p815k7406J9346L1899qk8433l2187M600
11104A9104J7093L6475J3215K0605K1228M3825N9463P0080O9618R5963M1551k3015
$$ y = [39682, 52555, 27921, -19495, -19098, -9588, -30626, -14423, -12285, -1515, 10901, 15223, 26645, 53852, 98131, 151712, 193977, 208880, 216331, 213810, 219899, 229803, 230452, 177177, 121522, 99008, 88564, 75446, 79216, 72802, 66532, 66739, 71003, 40362, 4095, 16238, 55776, 56863, 44192, 27185, 16724, -6288, -23195, -27261, -14506, 4035, 12529, 27860, 10970, -14300, 20878, 37475, 27140, -6270, -39486, -79202, -80041, -61235, -53630, -7001, -11408, -23595, -49900, -40189, 2859, 30543, 7456, 1627, -17723, -20305, -4500, -9928, -19347, -22589, -41122, -41351, -4145, 17107, 18307, 34394, 42900, 53803, 59108, 51293, 23887, 43233, 75132, 75124, 46691, 14504, 19104, 36197, 72672, 85887, 106492, 127720, 171545, 231008, 301088, 370706, 466669, 508220, 485205]
11092D85205o7536j25253o6306l0939l3968m2696k5144n660k698j3043j5389j5830
11080D0743j0349O622R936r516j2380J6305j7579P931J723k463N657p462k0421
11067H747k0264J3667K2088K2762o150k8237k343m175j67L08j712K1006J9371
11054D4901j8608p731M726K9085k0478j2418J0586J6595J8179J4258J8766M6325
11042A44186j3143m4582l2461j2654J2132N991K5496l633p711j2365J649l715
11030E9190L163J3798o19L971J3414J7618p888n120M216k2895k5160j3257K3648
11017F4079M9105k220m3425j548M156r176r621O219J799J3651Q533R092J600r979
11003H2265L843j9676J93K074j9883J9302K5058j2851J151n581l0923j3513q895
$$ y = [485205, 417669, 292416, 226110, 195171, 161203, 118507, 93363, 87703, 85005, 71962, 56573, 40743, 30394, 37016, 46952, 37436, 25056, 41361, 23782, 31713, 33436, 30973, 36630, 29168, 8747, -11517, 2150, 24238, 47000, 40850, 12613, 10270, 6095, 5928, 6236, 4524, 25530, 44901, 26293, 18562, 23288, 52373, 31895, 19477, 30063, 46658, 64837, 79095, 97861, 144186, 131043, 86461, 54000, 41346, 53478, 59469, 84965, 81332, 73621, 61256, 62905, 59190, 62353, 76151, 75532, 79503, 92917, 110535, 102647, 97527, 101743, 78848, 53688, 40431, 64079, 113184, 110964, 67539, 65991, 70147, 60971, 51350, 57569, 59368, 73019, 81552, 90644, 92244, 82265, 86108, 66432, 66625, 68699, 48816, 68118, 93176, 80325, 81476, 75895, 44972, 31459, 22564]
10990B2564k8304N064O527Q680J8359j6859j7272M660J590K4344P428k9693j2451
10977e363J1857j0522R344L654k9643P783P050k6352M325J7926K3258J3586r639
10964A7264n6R930R478K0664k3561r589J3947j3857J0645J4997j2105K2380K1808
10951H1945K6074p807j0888k6408k6314o404m274l960J5262p433m741K5710l293
10938D7469j7869n144J4162K159m682k5260K0535K9023N880N302j9140j9571m482
10925B8382j0878J2648K2172k285k5837J3929K944N541l3987K713j0542p343J0832
10912H289R7q0o551j0722Q923K4057K8869k0680k1344l4424m015P652J6013J5616
10898A1700J2939j4455p742N241r685n004J415K3146K6489J6893N418K8809M911
$$ y = [22564, -5740, -676, 5851, 14531, 32890, 16031, -1241, 3419, 5009, 29353, 36781, 7088, -5363, 6494, -4028, 5316, 8970, -20673, -12890, -5840, -32192, -27867, -9941, 13317, 26903, 17264, 17208, 27138, 36616, 57280, 33719, 24130, 38077, 24220, 34865, 49862, 37757, 60137, 81945, 108019, 100212, 89324, 62916, 36602, 30198, 25924, 21964, 37226, 29793, 25052, 50762, 47469, 29600, 24456, 38618, 40777, 36095, 10835, 31370, 60393, 66273, 71575, 52435, 32864, 28382, 17504, 30152, 52324, 50039, 24202, 38131, 41075, 46616, 12629, 15342, 4800, -2543, 8289, 8386, 8306, 1755, -8967, -44, 24013, 52882, 32202, 10858, -23566, -27581, -19929, -3916, 11700, 24639, 10184, 2442, 7683, -2002, -7006, -5591, 17555, 44044, 60937, 66355, 95164, 100075]
10885A00075l8646j1546M820k5151j2096l857J9730J859j2809L278r854j1903
10873C900j4919q169L1351M3409L3783r116j2261k0214k993J0994J6555L076L1223
10860A06619J4056q605r346J592L432q662K6805M6580j4880k5216r507j2729j4415
10847I5724n594K1737K1814j7052m2508J1406J4698K3976M225k3120l6477J9500
10835H8329L6136m473m5028J633J2092j0344K1846Q179j3434L313R617J0439Q911
10822A27216j7693Q912L1008J6391R433j0237o858p103P992l2313k7461K969j4030
10809H8226k1971J5882N4480M6329m71n561m0447k2010L2005K0367J8055O11k3446
10796A62049k0255J861J081J793N510K2235R582N045K1509K4878j128r042j4257
$$ y = [100075, 61429, 49883, 54703, 29552, 17456, 13599, 33329, 35188, 22379, 25657, 15803, 3900, -11019, -19188, 12163, 55572, 89355, 80239, 67978, 47764, 44771, 55765, 72320, 75396, 106619, 120675, 112070, 102724, 104316, 107748, 99086, 125891, 172471, 157591, 132375, 122868, 110139, 95724, 90130, 111867, 133681, 116629, 74121, 85527, 100225, 124201, 128426, 105306, 68829, 88329, 124465, 119992, 74964, 76597, 88689, 78345, 100191, 108370, 94936, 98249, 107866, 118305, 127216, 109523, 118435, 149443, 165834, 175267, 165030, 158172, 151069, 159061, 126748, 99287, 102256, 88226, 66255, 82137, 136617, 182946, 182475, 176914, 136467, 114457, 146462, 166829, 184884, 185495, 162049, 141794, 143655, 144736, 146529, 152039, 174274, 183856, 188901, 210410, 235288, 234160, 225118, 210861]
10783B10861P259J5051R152K0770L6181J6744J7772K09n419J6572n14N9321K3526
10770D27485m436K6062K1129P4813Q0979O0743P4604P7829J11054J19902J63098
10759A233262J95725J91875K10941K71918L39476N03910O53189R34423J350449
10750E885168J788849K488451L807850O413562J1082794J7222832J5758286m705879
10742E9741913j4074781j5858501j1643659o317503l434919k027483j312766r45363
10734D126938o94129n38904l95299l42990k68606k00074j57039j51408j53343
10725A225146j47689j25241j23141j10267p2137p1515j5322j5106k0731k7514
10715D96483l6040n0131k5671k5264l9613k9741l388j0549l7189Q598l0847l0045
$$ y = [210861, 218120, 233171, 242323, 263093, 299274, 316018, 333790, 333999, 328580, 345152, 344638, 403959, 427485, 423049, 449111, 470240, 545053, 626032, 686775, 761379, 839208, 950262, 1070164, 1233262, 1428987, 1620862, 1831803, 2103721, 2443197, 2947107, 3600296, 4534719, 5885168, 7674017, 10162468, 13970318, 20383880, 31466674, 48689506, 64447792, 59741913, 45667132, 29808631, 18164972, 11847469, 8412550, 6385067, 5072301, 4126938, 3432809, 2893905, 2498606, 2155616, 1887010, 1686936, 1529897, 1378489, 1225146, 1077457, 952216, 829075, 718808, 646671, 575156, 559834, 544728, 523997, 496483, 460443, 410312, 384641, 359377, 319764, 290023, 286635, 276086, 238897, 247495, 216648, 186603]
10703A86603l2038l344q903r710J416K13k2833K0794J6407j1712k2533r789J3479
10690A18050K6342L9541k6432k2445l0612K47P694n152l7541l0540L1091J9738
10678H9981o77k2707J6953L116j7410j9712q976J6153M544m852L3525L6769l1373
10665I5334k2853q084Q228J86k8621l1295m780n153J9873L0128J0964N899K4813
10652I4639k1728k1082j0882R593k2731K651k235J4560l386n483j4734K2934k3538
10639A8578M438k3307j9994J2820M3691J4316q465k2523L0503j3786j6238l547
10627A6486J6199n390P53K034p55J5942j208l0122l6990M289J8419L0723J3419
10614D3799n563l179j7943K771L722n181N906j6182j3684P349M3411J3058k7335
$$ y = [186603, 154565, 151221, 142318, 132608, 134024, 134237, 111404, 132198, 148605, 136893, 114360, 104571, 118050, 144392, 183933, 157501, 135056, 104444, 104691, 112385, 107233, 69692, 39152, 70243, 89981, 89304, 66597, 83550, 86666, 69256, 49544, 40568, 56721, 61265, 56413, 89938, 126707, 95334, 72481, 64397, 72625, 72811, 44190, 12895, 8115, 2962, 22835, 52963, 63927, 69826, 94639, 72911, 51829, 40947, 50540, 27809, 30460, 28225, 42785, 39399, 33916, 19182, 42116, 18578, 23016, -291, -20285, -7465, 36226, 50542, 42077, 19554, 50057, 36271, 20033, 16486, 32685, 27295, 28048, 30082, 29327, 45269, 44061, 13939, -23051, -18762, -343, 30380, 43799, 38236, 35057, 17114, 19885, 23607, 18426, 24332, 8150, -5534, 1815, 45226, 58284, 30949]
10601C0949j6626j6451k0101j8203P512L8814M0211Q060k6893j5795m379j3398
10589f300r200m259K9842K3465J0427K366l149J2198j4620l2178k453L2089j0683
10576B7545k5277j0497R893J7513J8489R256j4936j1648J5582q397k1881o569
10564i27j50J6245J4082Q729j287K412k630k4532J60K1724K7980N249m910J6738
10550G8883K183r833j9847j0041P772j1636m709J9220j5056P791Q535P817j2181
10537D8898j0870l7848j1198K3086j15o300o526j7313K0694J2051K0506J0164
10525D5229k7333j467K7647j5261O830M868P461q347l2752j7918K716J424K612
10512d291K988K7350N967J1481j1114K317L951J8547j7897j2149Q200J8272j6477
$$ y = [30949, 14323, -2128, -22229, -40432, -32920, 5894, 46105, 54165, 27272, 11477, 7098, -6300, -15500, -19759, 10083, 33548, 43975, 46341, 43192, 55390, 40770, 8592, 6139, 38228, 27545, 2268, -8229, 1664, 19177, 37666, 46922, 31986, 20338, 35920, 27523, 5642, -927, -1077, 15168, 29250, 37979, 36692, 39104, 36474, 11942, 12102, 33826, 61806, 67055, 62145, 78883, 81066, 71233, 51386, 41345, 49117, 37481, 32772, 51992, 36936, 44727, 53262, 61079, 48898, 38028, 180, -11018, 12068, 11953, 5653, -873, -18186, 2508, 14559, 35065, 45229, 17896, 16429, 44076, 28815, 35645, 40513, 47974, 39627, 6875, -11043, -8327, -6903, -4291, -1303, 26047, 32014, 43495, 32381, 34698, 38649, 57196, 39299, 27150, 35350, 53622, 37145]
10499C7145j4723o27J0802L013j4753j5105M2173J6593k053k0978k2104q09J3331
10486C1905J3373O446j3265J819O30j9487k1118K1761J9257M431K2172M994j7761
10473E5157j508L9129N643m54k801l3372k8548o422J2872N793P141N437L0105
10460H8172n781O248K8598J8604K6266j7327r202N853M2034K0396j3015j3488
10448A77358P461j021R230Q680o013p884K1553K6729K6458j2022j5331j5347L327
10435B23178l3027J9226J2088k9188R829J2358M2437m312j6857Q882K389Q640
10423B55643J4306J7001j4310Q772K5502O355m772j4712r104J6757J3643O794
10411C21875o815J6584L150n799M099r777k7615J8219k782l2484j4074j2355j6497
$$ y = [37145, 22422, 21795, 32597, 35610, 20857, 5752, 47925, 64518, 62465, 41487, 19383, 18574, 31905, 45278, 51724, 38459, 40278, 40908, 21421, 303, 22064, 41321, 45752, 67924, 72918, 55157, 53649, 92778, 98421, 97967, 95166, 61794, 33246, 26824, 39696, 45489, 52630, 58067, 88172, 82391, 88639, 117237, 135841, 162107, 144780, 135578, 141431, 183465, 203861, 190846, 177358, 184819, 183798, 193028, 201708, 195695, 187811, 209364, 236093, 262551, 250529, 235198, 219851, 223178, 190151, 209377, 221465, 192277, 202106, 214464, 256901, 252589, 235732, 244614, 247003, 255643, 269949, 286950, 272640, 281412, 306914, 313269, 308497, 293785, 284681, 301438, 315081, 321875, 315060, 331644, 334794, 328995, 333094, 323317, 295702, 313921, 311139, 278655, 264581, 252226, 235729]
10398B35729J2867j832J3197Q876o0460q081K233j4663L986M381o500J9672J0961
10385B20366K0307L6933J0580q699l1921j4191Q613k6094j8133L1810o83N403
10373B34291k469k3428l730l307K119p038j833q342k8014j0958k1796k0303J1876
10360A17068K1347k4868m5999j219k022j1621k2045j0518J6590K7929q251m063
10348E2328J9816K1799n747j9056j4661K964R295j026k2302O041J0684r036j3843
10335C7256j076M516J3066J4294r362L529Q313j2947j2146k6986j3277j497k123
10322A560r986K168J5242J3471j5137K875M366R722j820k370L7242L5877K3109
10309A16319o694L9776N8200J2335L79j914J664m4925k4464j3397l6706n610K344
$$ y = [235729, 248596, 246764, 259961, 268837, 208377, 200296, 202529, 187866, 191852, 196233, 189733, 209405, 220366, 240673, 277606, 288186, 279487, 247566, 233375, 241988, 215894, 197761, 229571, 228888, 234291, 231822, 208394, 204664, 201357, 203476, 196438, 194605, 186263, 158249, 147291, 125495, 105192, 117068, 138415, 113547, 67548, 66329, 64307, 52686, 30641, 20123, 36713, 64642, 56391, 52328, 72144, 93943, 88196, 69140, 54479, 57443, 66738, 65712, 43410, 49451, 60135, 51099, 37256, 36180, 40696, 53762, 68056, 58694, 62223, 70536, 57589, 45443, 18457, 5180, 3683, 1560, -8426, -6258, 8984, 22455, 7318, 10193, 14559, 24281, 22461, 20091, 57333, 93210, 116319, 109625, 149401, 207601, 219936, 220315, 218401, 220065, 175140, 150676, 137279, 100573, 94963, 97307]
10296I7307m222j2662j1884n520n529q931J8199O477k4876l116L230l6060K8699
10283D1112J8637Q405J2199K0942K61j2868j1619r048r411k4339l5690j2654o059
10270b0132N669R655o284j997N3573L2656J2708l0085k4271J33K4256j1499q570
10257C5812k3291p016P497J3879K2633K7567k6615j6550J5990j7001m103j120
10245B7682J065j9531k6442O388K5713J8286N755Q477R334k4727k2579r597J8831
10232A8655j4925j3860j7895R923K4069J2490L7118J721l6423j4161j3242J9326
10220A2796K6304k971K3119N793k5376K6083K7654L9304r508l6258k2323O171
10208G0788j4818k4232n450m13P482j1767n753P223J5174J817K8610p174j7280
$$ y = [97307, 93085, 80423, 68539, 63019, 57490, 48559, 66758, 73235, 48359, 45243, 48473, 12413, 41112, 59749, 68154, 80353, 101295, 101556, 88688, 77069, 68021, 58610, 34271, -1419, -14073, -20132, -14463, -4808, -11092, -13089, 40484, 73140, 85848, 55763, 31492, 31625, 55881, 44382, 35812, 12521, 5505, 13002, 26881, 49514, 77081, 50466, 33916, 49906, 32905, 28802, 27682, 28747, 9216, -17226, -10838, 14875, 33161, 38916, 47393, 56727, 32000, 9421, -176, 18655, 3730, -10130, -28025, -18102, 5967, 18457, 55575, 57296, 20873, 6712, -6530, 12796, 39100, 36129, 59248, 65041, 39665, 65748, 93402, 132706, 123198, 86940, 64617, 70788, 55970, 31738, 26288, 25875, 33357, 21590, 15837, 23060, 38234, 40051, 68661, 61487, 44207]
10195D4207k1479k0814J5150K2585K8103O007q52k9160n66k9794j2210K601O412
10182A0190K0005k5643r972L5563N792n338n247K377J0339P632r611j2860R886
10169C3113J1941N664M555k57l549j6052J9156R55L509O439j3722O94K2600J1265
10155H6311m476j5769J8052J3184k4303j661J98M764L269o239j3960J1126j3601
10142E6895K7353J8598j6751m958j4513j0971J2623l5923N418p113J1441K1837
10130F3936L060j2533k0509K2407L8512j8683p038L7954N64l1350j7341J6442
10118G5421J8000k8163j085l021O578j7352k0615q460r57q304k1105J3284L820
10105H041J3133O324L504k0090J6960J1356K1769o354p121J3110l015P002J479
$$ y = [44207, 22728, 1914, 17064, 39649, 67752, 73759, 72907, 43747, 43181, 13387, 1177, 3778, 10190, 30195, 4552, -5420, 30143, 35935, 30597, 25350, 27727, 38066, 45698, 36087, 23227, 33113, 45054, 50718, 55273, 55016, 51467, 35415, 54571, 55526, 59035, 65474, 51752, 52446, 75046, 86311, 81835, 66066, 84118, 97302, 72999, 71338, 71536, 76300, 79569, 73330, 59370, 70496, 56895, 84248, 102846, 86095, 81137, 66624, 55653, 68276, 32353, 37771, 30658, 42099, 63936, 66996, 54463, 33954, 56361, 94873, 76190, 69152, 107106, 107670, 76320, 58979, 75421, 93421, 65258, 64173, 61152, 67730, 50378, 29763, 21303, 20346, 12042, -9063, 4221, 8041, 21174, 27498, 31002, 10912, 27872, 39228, 60997, 54643, 47522, 60632, 57617, 64619, 66098]
10092F6098k153j9628J0591K0192j0865N046j811n74j7070Q356l522j597P116
10079F0179N169j3172j3263l689j3111Q236r24j2830k345M5285p070k6896J7744
10066D3313k562O163K3689J9461j1152N15j6522j3708m789j1136k9364J4750K3181
10053D1839j041J8350j5495j0490j0747j6863N977o76J9667K1806R839M1247L170
10040A06583k5764k9954k16k876l4193J367P794K1836K450r378j637k7877m3579
10027c5444Q920K4005K2185J6540R01p91O330K177N44J7219p714j2917M469q584
10013C7840n344M1968K4724l109k5729J792r792j4600k5941M294J753L33p289
10000B0900K3515l314K0672O880k0548r054J5599L9368K5100j5345j9817K476
$$ y = [66098, 63945, 44317, 54908, 75100, 64235, 69281, 67470, 66896, 49826, 58182, 54660, 53063, 60179, 65348, 52176, 38913, 35224, 22113, 30349, 29425, 16595, 14250, 59535, 52465, 25569, 43313, 40751, 46914, 70603, 90064, 78912, 79427, 62905, 49197, 44408, 33272, 3908, 18658, 41839, 40798, 59148, 43653, 33163, 22416, 5553, 11530, 10854, 30521, 52327, 62166, 103413, 106583, 80819, 50865, 50649, 47773, 13580, 14947, 22741, 44577, 47027, 37649, 36012, 8135, -35444, -26524, -2519, 19666, 36206, 37107, 36316, 42646, 44823, 45367, 62586, 54872, 41955, 46424, 37840, 32496, 74464, 99188, 96079, 70350, 72142, 62350, 47750, 21809, 26103, 27856, 28189, 20900, 44415, 41101, 61773, 68653, 48105, 39051, 54650, 94018, 119118, 103773, 83956, 86432]
9988H6432j5633j3139J0490j733M147q400n973j1645j7565m312M536P144l489
9975C0860J9859j4412p566K1108K6337k510j2112n35J2284n040l582R96K144K3691
9961I1522j8585L227k1082j0530J042J525K3683r119r767J5133Q207K5213O735
9948A07204j0323q818q650m3362k4674K1658K5619k6880L588P608L937L6775L1290
9935A14972j7026l4528l202k3522k6174J9091J9008J9991K8250j4714l4799j4441
9923C2906M0571J2041j4889l8759j5283K3863J6822L3222M931j8699k7140O539
9911E6125j6057q353j1956R235J9640J7633j4301j2504O276K632N697l8409k2444
9898f786J5118K1344K0689L4919j2759J2149J725J1833J9423l743j9091k3374
$$ y = [86432, 70799, 57660, 68150, 66417, 70564, 62164, 56191, 44546, 26981, 22669, 27205, 34349, 30860, 50719, 36307, 28741, 49849, 76186, 73676, 61564, 61029, 73313, 68273, 64691, 65687, 67831, 91522, 72937, 76164, 55082, 44552, 45594, 47119, 70802, 61683, 51916, 67049, 75256, 100469, 107204, 96881, 88063, 79413, 36051, 11377, 33035, 58654, 31774, 35362, 42970, 46907, 83682, 114972, 97946, 63418, 60216, 36694, 10520, 29611, 48619, 68610, 96860, 82146, 47347, 32906, 73477, 85518, 70629, 31870, 16587, 40450, 57272, 90494, 95425, 76726, 49586, 56125, 40068, 31715, 19759, 28994, 48634, 66267, 51966, 39462, 45738, 48370, 54067, 15658, -6786, 8332, 29676, 50365, 85284, 72525, 84674, 86399, 98232, 117655, 113912, 94821, 71447]
9886G1447Q312J4184k2513O327K484j1805M608Q05P12J1631j2432J817m67N983
9872H1093j8030n3549K7303L8839K2313l6224j3328K4112J8032j496l62J8874
9860A07577J3364L589j8626j5871k600k1552o684K4966q838j1620j4388q283k0346
9847B0688K4882K9713J9787j8098k2436k0370L6046q659j0169j130N246J5080
9835G0580J7464J3054k2282N800K4733M468k7423k5929n188J4485J3340N561j4566
9822G4097K2513K2962j4599p117K3500L0172j0673k8307j4881k7770j0698J4028
9810G3227K9734J4200j4268j7691J4835L0196j54k7891J3683O008m400Q096j0497
9797A15078L634J202j1568J1220K4230j485j2296j9928K380j383k9682J7316M311
$$ y = [71447, 79759, 93943, 71430, 77757, 80241, 68436, 73044, 73849, 74561, 86192, 73760, 75577, 75110, 81093, 63063, 9514, 36817, 75656, 97969, 61745, 48417, 72529, 90561, 89065, 88703, 107577, 120941, 124530, 105904, 90033, 87433, 65881, 59197, 84163, 75325, 63705, 49317, 41034, 20688, 45570, 75283, 95070, 76972, 54536, 34166, 70212, 61553, 51384, 50254, 55500, 70580, 88044, 101098, 78816, 84616, 109349, 113817, 86394, 60465, 55277, 69762, 83102, 88663, 74097, 96610, 119572, 104973, 97856, 121356, 151528, 140855, 112548, 97667, 69897, 59199, 73227, 102961, 117161, 102893, 85202, 100037, 130233, 130079, 102188, 115871, 121879, 117479, 125575, 115078, 118712, 119914, 108346, 119566, 143796, 142311, 130015, 110087, 112467, 111084, 81402, 98718, 103029]
9784A03029l0410M298J372m446k073j3632K9115L9319K5274l0282j9911K3772
9772A25425k192j0755l2752m560R470n35l019J0223o24K382J2418K34L028J7614
9758A26357N294k4865j2957r534R086O678l0929J4654J7685J3245K4745j4008
9746A25451o021j3617P30K868j0944N4150L1116k0187j9318P994J3661q197n9797
9733I7889l708J8950K1791R720k823j3270o269j4095o594J6539K0055P258j7090
9720A28353Q638M7141J7812j582K1261L8688Q840J572J1238k42J1496R613J8291
9707C21119K200J2657r780k5012k1987M380n711l175J3540P688J2312J6884K7948
9694C53063M2808K722j4781j321o74M181j342K3301J3066J0977K2176J8585Q903
$$ y = [103029, 72619, 76917, 78289, 73843, 71770, 58138, 87253, 126572, 151846, 121564, 101653, 125425, 123233, 112478, 79726, 75166, 84636, 84101, 81082, 91305, 90681, 93063, 105481, 105715, 108743, 126357, 131651, 106786, 93829, 84295, 93381, 100059, 69130, 83784, 101469, 114714, 139459, 125451, 119430, 105813, 106543, 109411, 98467, 152617, 183733, 163546, 144228, 152222, 165883, 157686, 97889, 94181, 113131, 134922, 144642, 141819, 128549, 122280, 108185, 101591, 118130, 138185, 145443, 128353, 136991, 184132, 201944, 200362, 221623, 260311, 269151, 270723, 281961, 281719, 293215, 302828, 321119, 323319, 335976, 326196, 301184, 279197, 283577, 277866, 274691, 288231, 295919, 308231, 325115, 353063, 395871, 398593, 383812, 382491, 381817, 385998, 384656, 407957, 421023, 432000, 454176, 472761, 481664]
9681D81664L4059M4166J3147n880L6695O76o285K4834P8529K5277o726J0727K9763
9668G60646K4077m169n406J4017j1464j220L689j2897q163K7456J0406J1460L5670
9655H44102K5390K3031p452j6041r476O479L6137J5186j7881l4436K1804N3006
9643I39849L0910M094J9969L5266M4445O4202J4282j4823l2681m0358m2404k2038
9631A000713j39k2661l26K2772r979k2830q268k0005j407J3838K3201M2928L7012
9618A054849K5457K4609K9620M0787M277m3108k6489o3422m5916l9509l4283N263
9606I32135j0503k6895J8998J6115R812m374j7133J9113k6571l6682l1937m7584
9594G94494r795k3659n880L0137m821l4565l5280p685J4532r673R033J5738K9197
$$ y = [481664, 515723, 559889, 573036, 567156, 603851, 604527, 598242, 623076, 701605, 726882, 720156, 730883, 760646, 784723, 780554, 775148, 789165, 777701, 776481, 780170, 767273, 759110, 786566, 796972, 808432, 844102, 869492, 892523, 885071, 869030, 859554, 866033, 902170, 917356, 899475, 865039, 886843, 939849, 970759, 974853, 994822, 1030088, 1074533, 1138735, 1153017, 1138194, 1105513, 1065155, 1022751, 1000713, 1000574, 977913, 977587, 1000359, 990380, 967550, 959282, 939277, 937870, 951708, 974909, 1017837, 1054849, 1080306, 1104915, 1134535, 1175322, 1179599, 1136491, 1110002, 1046580, 1000664, 961155, 926872, 932135, 921632, 894737, 913735, 929850, 939662, 935288, 918155, 937268, 910697, 874015, 842078, 794494, 784699, 761040, 755160, 785297, 780476, 745911, 710631, 702946, 717478, 707805, 716838, 732576, 761773]
9581G61773K9505k4253m7074R926k0763k9844j26l9106n4314l3415K5812R206
9569E87327j66k31l6090j280J0683o488l1147o2895k8825k6815n9824k1357K9189
9556C52081j0500j8924M335q230n524k3986K226J2303q71j0471K7897K2409J1434
9543C54179J8024K7928q989j6465L393M0952K1726j6834l9648n1341R179K0524
9531C62628j0899J52K1489K3421n837r225j8681j2669L7824K5733L9740k042k1783
9518D29851J0918K9265k6555R478J0163k4728K0969J566O957J9914K3635J3795
9506E25228k270r931j5846L511L334j9391j076k457j9720j7344M3152O0108J064
9493E48362j3000j7175J9756L5268J4686j492K5036K5057J1851K406k6921n121
$$ y = [761773, 791278, 767025, 719951, 729877, 709114, 679270, 679144, 640038, 585724, 552309, 578121, 587327, 587161, 586930, 550840, 549560, 560243, 553755, 522608, 459713, 430888, 404073, 344249, 322892, 352081, 341581, 322657, 326992, 318762, 313238, 289252, 291478, 303781, 302910, 292439, 320336, 342745, 354179, 372203, 400131, 391142, 374677, 378070, 419022, 440748, 423914, 384266, 332925, 342104, 362628, 351729, 351881, 373370, 396791, 390954, 381729, 363048, 350379, 388203, 413936, 453676, 451634, 429851, 440769, 470034, 443479, 452957, 463120, 438392, 459361, 460927, 467884, 487798, 511433, 525228, 522958, 513027, 497181, 500692, 504026, 484635, 483559, 481102, 461382, 444038, 487190, 547298, 548362, 535362, 518187, 537943, 573211, 587897, 586405, 611441, 636498, 648349, 650755, 623834, 618713]
9481F18713R140K1657O015j764j0246l9253n1249j0120J6147J0609n787J5828
9469E79690J8665J1522j7400m1965P333J6432l966j2889l9283Q160J7545o139
9457E37705k4341M796j0639l5278q92K849K3370j1957j4697O320K0518j0600K601
9444D89755M484J3333K1834p656j4177l072J1168K4688m279j8903L057K8838L006
9431E52076K2621j7482l7869k4082L7608J8043M907J3752K333J9794o986J422
9419E86137L1293O217j4193M9057O1782M071r241L4502K7634J6047L938J7020
9407H14264O708q230J2695L6817K1034J8312J388k3045n366M8322r940P274J1733
9394I31966K2077j7478j4087O049P86q371M0947N6184J5177l3681l778L7173K1902
$$ y = [618713, 627853, 649510, 655525, 653761, 643515, 604262, 553013, 542893, 559040, 569649, 563862, 579690, 598355, 609877, 592477, 550512, 557845, 574277, 570311, 557422, 518139, 526299, 543844, 537705, 513364, 518160, 507521, 472243, 471351, 474200, 497570, 485613, 470916, 477236, 497754, 487154, 489755, 494239, 507572, 529406, 521750, 507573, 504501, 515669, 540357, 536078, 517175, 520232, 549070, 552076, 574697, 557215, 519346, 495264, 532872, 550915, 555822, 569574, 571907, 591701, 584715, 586137, 617430, 623647, 609454, 658511, 720293, 724364, 715123, 749625, 777259, 793306, 797244, 814264, 820972, 812742, 825437, 862254, 883288, 901600, 902988, 879943, 874577, 922899, 912959, 920233, 931966, 954043, 936565, 922478, 928527, 929313, 920942, 961889, 1018073, 1033250, 999569, 995791, 1032964, 1054866]
9381A054866J2161J2775M6746L8360N3526M4655M6339L6018J2796L5192M6859
9370A440293M1745L8724J8651M1801K3585J5304M8123O2527Q2845Q0364Q0361
9359A974323J04898J07934J05312J21192J40589J72815J82151J27976J33527K13193
9349C383910K33623K10145J85367J34162L1993n9160r524O344L2917P2294O4451
9338D286522R9566R4771P6052Q1645Q2102J03994J65036K26342K50238K05978
9328E672246J73524J47594J41590J66975J82401K74303L12929L10077L17161L42262
9318H041062L30931L06813L12177L57808M73168N88243P09050P09150N81313L97760
9308A2807475K56728K31424K72823K95457K68242K74200L76183N48842P68115
$$ y = [1054866, 1067027, 1079802, 1126548, 1164908, 1218434, 1263089, 1309428, 1345446, 1358242, 1393434, 1440293, 1482038, 1520762, 1539413, 1581214, 1604799, 1620103, 1668226, 1730753, 1813598, 1893962, 1974323, 2079221, 2187155, 2292467, 2413659, 2554248, 2727063, 2909214, 3037190, 3170717, 3383910, 3617533, 3827678, 4013045, 4147207, 4179200, 4120040, 4110516, 4116860, 4149777, 4222071, 4286522, 4386088, 4480859, 4556911, 4638556, 4720658, 4824652, 4989688, 5216030, 5466268, 5672246, 5845770, 5993364, 6134954, 6301929, 6484330, 6758633, 7071562, 7381639, 7698800, 8041062, 8371993, 8678806, 8990983, 9348791, 9821959, 10410202, 11119252, 11828402, 12409715, 12807475, 13064203, 13295627, 13568450, 13863907, 14132149, 14406349, 14782532, 15331374, 16099489]
9299A6099489R99007J094970J034994Q18805N84474L97411K24874P6160o078J23709
9289B1447815L44604O05216Q22888J084648J467698J908156K469448L036721L471339
9280C6658533L667775L662506L514606L301983L085332K952956L020601L219665
9272F3083957L327241L268293K891907K098672J001382j65077r61552j141977
9264G3402846o43910L50745J608353K871269M089305N400616O670580P726693
9256A01476497Q435039Q804677Q835261Q321261P232773N919168M644901L538210
9248A57207787K711374K567112L235622M405252N849475P376900R127777J1254058
9240B03735357J3668714J6475396J9133909K1043092K1512324K0617849J9265245
$$ y = [16099489, 17098496, 18193466, 19228460, 20047265, 20631739, 21029150, 21254024, 21330184, 21324106, 21447815, 21792419, 22397635, 23220523, 24305171, 25772869, 27681025, 30150473, 33187194, 36658533, 40326308, 43988814, 47503420, 50805403, 53890735, 56843691, 59864292, 63083957, 66411198, 69679491, 72571398, 74670070, 75671452, 75506375, 74544823, 73402846, 72758936, 73109681, 74718034, 77589303, 81678608, 87079224, 93749804, 101476497, 109911536, 118716213, 127551474, 135872735, 143105508, 149024676, 153669577, 157207787, 159919161, 162486273, 165721895, 170127147, 175976622, 183353522, 192481299, 203735357, 217404071, 233879467, 253013376, 274056468, 295568792, 316186641, 335451886]
9233C35451886J7830777J6057888J4061031J2898247J2806247J2119437Q638065
9226D29863578J954229n696704j1459201j4173292j4524994j3607485j1667194
9219C60688937r117167o889799n421928m570291m290237m807574o644283r520290
9211C09427368j2142898j3245725j2412199j0064886o686929l548136l051645
9204B48274950o983017j3577273j9652113k3356962k4257602k2359257j8861129
9197A19227597j5140072j2113579j0055659q523779p132496n790550m572101l662712
9189E2236649k990136k513136k135106j813387j553307j232411r52136q47398
9181C8199632r94855j256423j591699j919330k122046k151796k054997j854466
$$ y = [335451886, 353282663, 369340551, 383401582, 396299829, 409106076, 421225513, 429863578, 431817807, 426121103, 414661902, 400488610, 385963616, 372356131, 360688937, 351571770, 344681971, 339260043, 334689752, 330399515, 325591941, 318947658, 309427368, 297284470, 284038745, 271626546, 261561660, 254874731, 251326595, 248274950, 241291933, 227714660, 208062547, 184705585, 160447983, 138088726, 119227597, 104087525, 91973946, 81918287, 73394508, 66262012, 60471462, 55899361, 52236649, 49246513, 46733377, 44598271, 42784884, 41231577, 39999166, 39047030, 38199632, 37204777, 35948354, 34356655, 32437325, 30315279, 28163483, 26108486, 24254020]
9173B4254020j746963j638544j535789j379215j221002j074361r62873q03176
9165A3892097p21572o61577n85260n65792n79350n94747o11601n82519n24485
9156H465194m54040m29515l55273k60822k00121j88118j70210j13257j15672q0167
9146F097999p4855j07007j39616k18728k84113k11660q0440l0544N751k0877j20359
9135D815551k61077l64538l63213k83628k34335k16228j43369j31579r8374q0025
9125B639185j14191j09327q3525o9111p8167q9251o5019r0165n2720l4878m7624
9114A805207n7431k9640j1029L7J4863N7075K4905j2066m5245j05484o4736m4839
9102A531617m0044n2470n0851l8583R12J231L587l3794l062l393m8573m2066j6663
$$ y = [24254020, 22507057, 20868513, 19332724, 17953509, 16732507, 15658146, 14695273, 13892097, 13170525, 12508948, 11923688, 11357896, 10778546, 10183799, 9572198, 8989679, 8465194, 8011154, 7581639, 7226366, 6965544, 6765423, 6577305, 6407095, 6293838, 6178166, 6097999, 6023144, 5916137, 5776521, 5557793, 5273680, 5062020, 4981580, 4951036, 4956787, 4935910, 4815551, 4554474, 4189936, 3826723, 3543095, 3308760, 3092532, 2949163, 2817584, 2719210, 2639185, 2524994, 2415667, 2332142, 2263031, 2184864, 2095613, 2030594, 1940429, 1887709, 1852831, 1805207, 1747776, 1718136, 1707107, 1707144, 1722007, 1779082, 1803987, 1791921, 1746676, 1641192, 1576456, 1531617, 1491573, 1439103, 1388252, 1349669, 1350581, 1351812, 1355399, 1321605, 1318543, 1315150, 1266577, 1224511, 1207848]
9089A207848r771J1459q474m233J1237J6653K2859Q924j5679Q791J3813q252j9882
9076A235293K1849J6997j1269k7675m045k7499k9908K29j3659q519k390j0282
9064A139122j3945j2376J6632k8810o3346l6269j5700N901O412R30j4798Q111
9052I91864o973j1536j4011J2944j8792K1725L3499J6435O900j1912k0887j7917
9040I81339Q353Q893J5864k7754l3433n242J937j2957J7887k1557m3874j5448
9028H74008L926p388l3705j1836r234J0543K4615j1922m0261q783o78n121O373
9015G90537J8054j207K9057J0074l967L613n323j1132j2068k6765l5203J3370
9003G69040l546l5275o573l4200k2480k5454j3592k3090j2814N621N938J3238
$$ y = [1207848, 1198077, 1209536, 1201062, 1196829, 1208066, 1224719, 1247578, 1256502, 1240823, 1249614, 1263427, 1255175, 1235293, 1257142, 1274139, 1262870, 1235195, 1231150, 1203651, 1173743, 1173972, 1160313, 1151794, 1149404, 1139122, 1125177, 1112801, 1129433, 1100623, 1037277, 1001008, 985308, 991209, 997621, 998551, 983753, 991864, 984891, 973355, 959344, 972288, 953496, 975221, 1008720, 1025155, 1032055, 1020143, 999256, 981339, 989692, 998585, 1014449, 986695, 953262, 948020, 949957, 937000, 954887, 933330, 889456, 874008, 877934, 870546, 836841, 825005, 815771, 826314, 850929, 839007, 798746, 789963, 789285, 784164, 790537, 808591, 807384, 836441, 846515, 842548, 846161, 840838, 829706, 817638, 790873, 755670, 769040, 765494, 730219, 723646, 689446, 666966, 641512, 627920, 604830, 592016, 597637, 603575, 616813]
8991F16813J5864o195j8528J8846K3729k4269l5629l9747l199P520K940K1795
8979E79940J8650N57j1276l4901j3998J6608m049l1570j0725J4127k4108k4233
8967D75022j3281J7984j3035n4455k6139L04J8262J5300j120L537J7988l6551
8955D03816l0802k0960n4562J590J1131J2346k6393l3950k139J5454r60l3985
8943B40586j2424J558J2718K9269n352k5887k2013j9096L875J2271r36j3530m118
8930A96921o844q23j6479L178L6311K2368K1366K1963M4018J3959M919P039j6083
8917C31813n944L2020K9124J3033J3030L0961J2062k7267k3899k6157O778N2634
8905D38188K9173J7258J3895O990K127K1697L6752j2110k2368K1556K5268L3625
$$ y = [616813, 632677, 626482, 607954, 626800, 650529, 626260, 590631, 550884, 547685, 555205, 558145, 579940, 598590, 599147, 587871, 552970, 538972, 555580, 551531, 519961, 509236, 523363, 499255, 475022, 461741, 479725, 466690, 412235, 386096, 386400, 404662, 419962, 418842, 422379, 440367, 403816, 373014, 352054, 297492, 299082, 310213, 322559, 296166, 262216, 260077, 275531, 274571, 240586, 228162, 229720, 242438, 271707, 266355, 240468, 218455, 199359, 203234, 215505, 214569, 201039, 196921, 190077, 189254, 172775, 175953, 212264, 234632, 255998, 277961, 321979, 335938, 340857, 347896, 331813, 325869, 357889, 387013, 400046, 413076, 444037, 456099, 428832, 404933, 378776, 385554, 438188, 467361, 484619, 498514, 505504, 507631, 529328, 566080, 553970, 531602, 553158, 578426, 612051]
8893F12051k7442k9660N885J2056j354K267J2198O826L9510K9998M499L3616J7336
8880G17786K6110O2540M0024L3618M6442L397j9490K8683L199k0865l3765k3080
8868H64599J4647M69j8643J597R540K8723q861j5791M08K3638M2174K857L7980
8855I83337K0943K1767J7933m869K4889K0578M400j979j2398j138K9854J0395
8843A113712K5742J6193K4969L2866J3292M5025K9463M7989n314m2406o656r474
8831A285401j9649j0539k8354J7016J808j6304k068l1581l8641j2487k9956j3840
8819A100806r031l0640j0667j7326l1093J730j7613j6879O021Q71j342M3101L9990
8806A057928K8236L1083K1953K2869M5103M1440j0384m1625l3068o0632m9376
$$ y = [612051, 584609, 554949, 560834, 572890, 571536, 573803, 586001, 592827, 632337, 662335, 666834, 700450, 717786, 743896, 806436, 846460, 880078, 926520, 929917, 910427, 939110, 942309, 921444, 887679, 864599, 879246, 879715, 861072, 862669, 872209, 900932, 892071, 876280, 876688, 900326, 942500, 945357, 983337, 1004280, 1026047, 1043980, 1039111, 1064000, 1084578, 1088978, 1086999, 1074601, 1073463, 1103317, 1113712, 1139454, 1155647, 1180616, 1213482, 1226774, 1271799, 1301262, 1349251, 1343937, 1301531, 1294875, 1285401, 1265752, 1255213, 1226859, 1243875, 1245683, 1229379, 1227311, 1195730, 1157089, 1144602, 1114646, 1100806, 1091775, 1061135, 1050468, 1033142, 1002049, 1003779, 986166, 969287, 975308, 976179, 974837, 1017938, 1057928, 1086164, 1117247, 1139200, 1162069, 1207172, 1248612, 1238228, 1196603, 1163535, 1102903, 1053527]
8795A053527l8955l5627l8315l0669n6487j4886k2140k4712j8542m7687k9259
8784F96248O638k4901k9784J4098J4783j9681j1106l1742j5890r519n6496k1121
8772E11527j2366k6183n30j5616r457L0332J9782J1922J2189m131l1974m0632
8760D44863J4827k254k9398l8113L190j7285n32J295j9677N041o509l0326n7399
8747B67723m9291J4593l610k2846k1869j2612q867l1973j4331P820j4847k2466
8735H7424n8Q770Q662J8679J1376J8854K4834k4622l1614n910K5948J332k568
8722A41107q252l145j5128k1737j1315J7783p871k5541J6165K9775k4346n733
8710H1762K0356K6399k016k9215k6159L311J5836j02j4277j9841m580R501n279
$$ y = [1053527, 1014572, 978945, 940630, 909961, 853474, 838588, 816448, 791736, 773194, 725507, 696248, 702886, 677985, 648201, 662299, 677082, 657401, 646295, 614553, 598663, 589144, 532648, 511527, 499161, 472978, 472448, 456832, 447375, 477707, 497489, 509411, 521600, 517469, 485495, 444863, 459690, 457436, 428038, 389925, 393115, 375830, 375298, 376593, 356916, 361957, 355448, 325122, 267723, 218432, 233025, 229415, 206569, 184700, 172088, 163221, 131248, 116917, 124737, 109890, 87424, 87366, 96136, 104798, 123477, 134853, 153707, 178541, 153919, 122305, 116395, 142343, 143675, 141107, 132855, 129710, 114582, 92845, 81530, 99313, 91442, 65901, 82066, 111841, 87495, 81762, 102118, 128517, 126501, 97286, 71127, 74438, 90274, 90172, 75895, 56054, 51474, 60975, 55696]
8697E5696j6008J8110J0787J7392l549K978K0032K511j1902k4890l3212L525r372
8684C2098J3726K6076k0089j7920m0789m14K1448N956m906j2718K2684M1716K4495
8671I1363j0831P983R044m0193l978J756K0128k652l420k0926k1543j817J6853
8658D1767O423n341p795j1976P35r720L987K4637k0929K1656R808m69K339N281
8644F0403j2483j4182q92j3056k0825k093L9287K781j9947Q898j3163j2836j33
8631A759J2991k106j5641Q874L4651K5783j1194J979j2103j2950P293J8124j0058
8618D7402l6888M716Q077J920j2085q478L7150J7161j334O348m729k4532j1551
8605B3177K919N786j697P019J939N94J1609m309M10O38m03N051j7965l0716o447
$$ y = [55696, 39688, 57798, 68585, 85977, 82428, 85406, 105438, 107949, 96047, 71157, 37945, 41470, 32098, 45824, 71900, 51811, 33891, -6898, -7312, 14136, 20092, 15186, 2468, 25152, 66868, 91363, 80532, 88515, 97559, 57366, 53388, 55144, 75272, 72620, 69200, 48274, 26731, 24914, 41767, 48190, 42849, 35054, 23078, 23813, 14093, 18080, 42717, 21788, 43444, 53252, 52783, 55122, 60403, 47920, 33738, 32846, 19790, -1035, -3128, 36159, 38940, 18993, 27891, 14728, 1892, 1759, 14750, 12644, -2997, 5877, 40528, 66311, 55117, 57096, 44993, 32043, 39336, 57460, 47402, 10514, 15230, 23307, 25227, 13142, 4664, 41814, 58975, 57641, 63989, 59260, 34728, 23177, 26096, 31882, 30185, 37204, 39143, 39737, 51346, 47037, 47447, 48085, 47682, 52733, 34768, 4052, -2395]
8590b395K8625J8304J0228j358j6750o268m3919j1868L3625R391j0615q303K411
8577A108j2742j1695J4908K757p517o979K2490J5189K364R448J501J9534L9l0912
8563A9493P632J5842k1213k8290k632j3371k6932L916J9710M0168J0698J1889
8551C6910l5839k0004J6383j309L550k146k590J434J95n594J2233L5979j3621
8538B5581m034j7082M018K5445P742j9266l6948K352J5108K17j8819P046P972
8525f68L570j1409m222N373j8913N648R361O004j652j9216P288L4368J2690k3599
8511D623J296J0238J9185J4034J362m812k0568k7863J2821L0974m265k0102J2055
8498B8978K0678j2083r567k1218n648q737K988J9510N017J9979K716j5493l474
$$ y = [-2395, 26230, 44534, 54762, 53404, 36654, 30386, -13533, -25401, 8224, 17615, 7000, -1303, 1108, -11634, -23329, -8421, -5664, -13181, -20160, 2330, 17519, 19883, 29331, 30832, 50366, 50405, 19493, 27125, 42967, 21754, -6536, -9168, -22539, -49471, -45555, -25845, 14323, 25021, 36910, 1071, -18933, -2550, -3859, -309, -2455, -5045, -3611, -3416, -9010, 3223, 39202, 25581, 21547, 4465, 8483, 33928, 41670, 22404, -14544, -12192, 2916, 3133, -15686, -8640, -668, 2902, -8507, -12729, -7356, -26269, -20621, -11260, -5256, -6908, -26124, -18836, 15532, 28222, 4623, 5919, 16157, 35342, 49376, 50738, 45926, 25358, -2505, 10316, 41290, 37025, 16923, 28978, 49656, 37573, 28006, 6788, 1140, -7597, -4609, 14901, 19918, 39897, 42613, 27120, 23646]
8485B3646o313J8748K9260l004K2718J2311k0013k3986l4276j8856J0830L7904
8473D8969K7334j5905k2631j6349J0571l485M786L3760J579k2731k3639k0394
8461A865R462K5065P008K999j0493O550J3389j7422j8433O60q350L936P282j0960
8447A2558m977J1094K0306Q522J6471K9600K7552m2267m5918j9322q452J069j1322
8434e086q753K7755K8466k0555j3846O715J9196K0934K835K2149q034m2073j1110
8421A8593k6159J6780K0425K5133j942P30L394r791m992j3042j5176K4367r952
8408B8368J507j336k2158O464R889M191j5859k0151q284K8359K3501k2344k0028
8395g881K721k524j2634L43j0243K5434K4863o503k7249p833J5286L1076P520
$$ y = [23646, 17333, 36081, 65341, 62337, 85055, 97366, 77353, 53367, 19091, 235, 11065, 48969, 76303, 60398, 37767, 21418, 31989, 28504, 33290, 67050, 68629, 45898, 22259, 1865, 11327, 36392, 43400, 46399, 35906, 42456, 55845, 38423, 19990, 20650, 12300, 16236, 23518, 12558, 7581, 18675, 38981, 47503, 63974, 93574, 121126, 78859, 32941, 13619, 5167, 6236, -5086, -13839, 13916, 42382, 21827, 7981, 14696, 33892, 54826, 57661, 79810, 71776, 29703, 18593, -7566, 9214, 29639, 54772, 52830, 53560, 56954, 47163, 42171, 29129, 13953, 38320, 28368, 29875, 28539, 6381, 12845, 22734, 26925, 11066, -9085, -17369, 10990, 34491, 12147, -7881, -5160, -7684, -20318, -19975, -30218, -4784, 20079, 13576, -13673, -21506, -6220, 24856, 32376]
8382C2376k8500J4757K7366j9021q669j1393J4468Q568l809o322J5065p322k1544
8369F020j0046K341K0180k297L368j4189k4609j8462J6210J8543o176K421L935
8356b761J1465N029j456j0687j8234n646K0869L833J5759J0751J4758k7849l648
8343A2183Q222p522j8988Q186k665J5401K2616m4164k9915O822N084J3352K7597
8330A6209J7475J784j3154l9286J7716K5801p088j7049k8673N969K0768K2888
8318B3360K1604J0191k7408m2004j6016N448J7992n310m324n602k685N515J732
8305a7507N177K20p97K5986J7096j4957R02J2869j3073K953K0453m4252j503K2705
8291A6272J4702j7168n55M970J4273K1514j4111l633j2476r112k4586q009J1346
$$ y = [32376, 3876, 18633, 45999, 26978, 18309, 6916, 21384, 29952, 26143, 19821, 34886, 27564, 6020, -4026, -1685, 18495, 16198, 19566, 5377, -19232, -37694, -21484, -2941, -9117, -6696, -2761, 8704, 13733, 12277, 1590, -16644, -22290, -1421, 2412, 18171, 28922, 43680, 15831, 12183, 20405, 12883, -6105, 2081, -584, 14817, 37433, -6731, -36646, -29824, -24740, -11388, 16209, 33684, 35468, 22314, -16972, 744, 26545, 19457, 2408, -26265, -20296, 472, 23360, 44964, 55155, 27747, -14257, -30273, -24825, -6833, -12143, -16467, -22069, -24754, -19239, -17507, -12330, -12110, -12907, 13079, 30175, 15218, 16120, 28989, 15916, 18869, 39322, -4930, -6433, 16272, 30974, 13806, 13251, 18221, 32494, 54008, 39897, 36264, 23788, 14676, -9910, -17919, -6573]
8278f573K58K0028q430N8n91j4527j4483N033L0909m2k1212k4989j4316O601J1140
8263c1136K099N775K2189P094p076M789K047j1149L229k2776J458L740k940K2114
8249e43J1961K8358N208P418n607l569q585O39J1986J456M407j5300k3456k2989
8235h616R342j2583r666r639k376L24J1409J7352J1255M546j0107j2826K736q761
8221a7610j5262K37K0719J5382Q42j3977O718k3398k5708J9859R173r060K0319
8208a1766R906j9448J4539j348j7622J3054n247K864K813j4094n48J307J0653
8195a4937j6788j7842J7978k263j0920J228J2570K4745l295j788J6234j2379K942
8182d515K9137j1016k177J1657j2825j8295J0622J0016J2364K4403J2000k6882
$$ y = [-6573, -6315, 13713, 5283, 5341, 4750, -9777, -24260, -19227, 11682, 11640, -9572, -34561, -48877, -42276, -31136, -29037, -23262, -1073, 6021, -1055, 3734, 5781, -5368, -2139, -24915, -23457, -19717, -22657, -543, 11418, 39776, 44984, 52402, 46795, 43226, 34641, 35280, 47266, 48722, 53129, 37829, 14373, -8616, 726, -11857, -21523, -31162, -33538, -33214, -21805, -4453, 6802, 11348, 1241, -11585, -8849, -17610, -32872, -32635, -11916, 3466, 4308, -9669, -2951, -26349, -52057, -32198, -23025, -32085, -11766, -1860, -21308, -6769, -8117, -25739, -12685, -17932, -15068, -12255, -26349, -26897, -25590, -14937, -31725, -49567, -31589, -33852, -44772, -43544, -30974, -6229, -9524, -11312, 4922, -7457, -4515, 24622, 13606, 11429, 23086, 10261, -8034, 2588, 12604, 24968, 49371, 61371, 34489]
8170C4489l0881J8456K365m0325k9221p909K6324M791k824P943J6599r453m4970
8157e4616l159L2938P377K964J0722o033J6964j8120j265k2277k019L031j2963
8144d6456l355K7143K2033j0243J3469J815o602J7083J1615O623l4605k0026K2995
8131A489n755J8132K3445j5454k7077k29k089p151J3351K450k8411q622M3180
8118G259J82m188q515n372K5838m827k0833j3402J7390M071R054r16J0106M67
8104A6314k8315k2827q996K9053J6166L18j6737J7451p862j5549l496n668J6754
8091a3394J2730j4673J4592J3441n512j6167j3653l2552Q645N1522L4451j2358
8079B7072J2401k3940k2902M417N798N495L4622j9251j5885r120j0756Q611r89
$$ y = [34489, 3608, 22064, 24429, -15896, -45117, -53026, -26702, -21911, -24735, -16792, -193, -9646, -54616, -57775, -24837, -17460, -14496, -3774, -9807, 7157, -10963, -12228, -34505, -36524, -33493, -46456, -49811, -22668, -635, -10878, 2591, 4406, -2196, 14887, 26502, 33125, -1480, -21506, 1489, -4266, 13866, 37311, 21857, -5220, -5449, -7538, -14689, -1338, 1112, -27299, -35921, 7259, 7441, 3253, -5262, -10634, 15204, 10377, -10456, -23858, -6468, -2397, 6657, 5741, 15847, 16314, -12001, -34828, -43824, -14771, 1395, 1713, -15024, 2427, -5435, -20984, -24480, -30148, -13394, -664, -15337, -745, 12696, 7184, -8983, -22636, -55188, -46543, 4979, 39430, 27072, 39473, 15533, -7369, -2952, 2846, 8341, 42963, 23712, 7827, -1293, -12049, -3438, -4427]
8066d427j3474J9831p90K2610K1462m388J2253k8299j2098j1302k5167J8262K7618
8053B2091j2543j3453p008l380l935j691n838k300K0150M905J7794l55n120l2869
8039b3552j6639K9481n108n92L0557K8804j4180l2515K771J2172M729j9239j8299
8026b1610K370j881k794j3194J0732K2975j6078O157P187N543j0472M631L828
8013b606M910o475J3312L4416j1588k0117k4447j3870K4041J0697J0349R575Q528
8000C6725j841j3826j8035j4322j0084R574l577k0624R216J8172J5366J7737o65
7987B3816j0798j7547N42K233J6699j5862J376P416k4638j5501K794J1083J5457
7974b930R128L876j5689j4282J6034J6212J348m778P272K6993l606k1123p319
$$ y = [-4427, -17901, 1930, 1140, 23750, 45212, 40824, 53077, 24778, 12680, 1378, -23789, -5527, 22091, 9548, -3905, -10913, -14293, -18228, -19919, -25757, -28057, -7907, -3002, 14792, 14437, 9317, -23552, -40191, -10710, -15818, -16410, 14147, 42951, 28771, -3744, -973, 11199, 15928, -3311, -21610, -19240, -21121, -23915, -37109, -26377, -3402, -19480, -13323, -6136, -593, -11065, -6434, -2606, 2304, -4171, 9141, 43557, 31969, 11852, -12595, -26465, -2424, 8273, 18622, 28197, 36725, 34884, 21058, 3023, -11299, -21383, -11809, -15386, -36010, -26794, -8622, 6744, 24481, 23816, 13018, -4529, -3987, -1754, 14945, -917, 459, 7875, -16763, -32264, -29470, -18387, -2930, 6198, 10074, -5615, -19897, -3863, 12349, 13697, 8919, 16191, 43184, 39578, 18455, 11136]
7961A1136k9500p441j7769O7K77Q394j9450J2087K9573M8083m054r607j3921O993
7947A4868J6177j8745j0752M8688J6795j7911J560j527p273k2787l2489j8436
7935c1832L742Q015j7555R690P803l65M4262o679j2831J3437n944k1742O402M698
7921A101k1026K3873K2613L5820o061m2309k2129J6511J3057N643j142L980l225
7908B6706l3753k217q579J577k910j9268j60K897K0686J2366j0076J3316R373
7895I958k2259r50L1669j0144k8029j5831N376l101R752j2311j8538K1110K3528
7882i770n586R106k0885L821j5236P732J4975n286J0599J5834l616k2344m1971
7869f2627J60J7149k7449R517M5690K9404k9690R0O423p399O803j0769k6803j372
$$ y = [11136, -18364, -25805, -43574, -43507, -43230, -34836, -54286, -42199, -12626, 35457, 31403, 21796, 7875, 14868, 31045, 12300, 1548, 50236, 67031, 49120, 50680, 49153, 41880, 19093, -13396, -31832, -28090, -20075, -37630, -27940, -20137, -20502, 23760, 17081, 4250, 17687, 11743, -9999, -3597, 1101, -19925, 3948, 26561, 62381, 56320, 14011, -8118, 8393, 21450, 27093, 25951, 29931, 26706, -7047, -9264, -17843, -16266, -19176, -38444, -38604, -35707, -15021, -2655, -12731, 585, 9958, -12301, -13251, 18418, 8274, -19755, -35586, -30210, -33311, -23559, -35870, -54408, -33298, -9770, -15356, -6250, -27135, -23314, -38550, -30818, -15843, -21129, -10530, 5304, 1688, -20656, -62627, -62467, -45318, -72767, -63250, -17560, 11844, -17846, -17756, -11333, -18732, -11929, -22698, -49501, -50873]
7855e0873L4897k750k270J2766J0632J3509o969J743j2652k6613l124Q739K4248
7842A283k0253O80P106j9156j0609K6803P722k0460l3077k2951L352M1263J6875
7829b1422r132j2019J1125J9231K14J8528O630j9906l096N664l9057j8388L858
7816e7770L8407L1178J6342J520j1311j5582o1j7793p007J6885o804l2818l142
7803d7956J9716j1520P214M332k105R456j4167J0560K5037l0595q217J81J772
7790c6292K6500M062k9443j1885J1460n741Q796M5623j9178k9890r833R636J6967
7777a9218n740K5745L3522Q573l3129k9471q665m979j6908K5225J2906J3861j1650
7764i928J282k510M37m109O873K4507R209l6129l4232k628J1199J9507N913j5188
$$ y = [-50873, -15976, -18726, -20996, -8230, 2402, 15911, 8942, 10685, -1967, -28580, -31704, -22965, 1283, -18970, -18290, -11184, -30340, -40949, -14146, -6424, -26884, -59961, -82912, -79560, -38297, -21422, -30554, -42573, -31448, -12217, -12003, 6525, 13155, -6751, -9847, -4183, -43240, -61628, -57770, -19363, 11815, 28157, 29677, 18366, 2784, 2723, -15070, -22077, -5192, -11996, -44814, -47956, -28240, -39760, -32546, -28214, -30319, -20863, -35030, -24470, 567, -30028, -38245, -38064, -36292, -9792, -5730, -35173, -47058, -35598, -41339, -32543, 13080, -6098, -35988, -45821, -36185, -19218, -24958, 787, 34309, 42882, 9753, -19718, -28383, -33362, -50270, -25045, -12139, 1722, -9928, -8646, -11156, -10719, -14828, -7955, 16552, 25761, -10368, -44600, -47228, -36029, -16522, -10609, -25797]
7750b5797l748J214p836M196L8261K5157l1322J7460K5626J121J2948k0599m4665
7737g984k3591j1826L2192M244P21J6109j9989k6480j7651K4337N996K6825n90
7724B313r060K6598N812O097r266R556P844j8600m4073K514j0748m757m173J1267
7710b8676K8753Q095P324N662j1971q990J1534k3931j24K0757K9235j8434m8552
7697b9318J4839J2515J3467j4795j0366J2646k4906K2820J8803j1917j8718J7456
7685B526L0220P737m691j5896l5339r496j211r486J1498J7661L9929j4897l8591
7672b0036j7536O255K5562P800j8096j3890n845J5185R89o19J1729j4876J1468
7659a1910K8586P719p729r817J964L344j2941L382J352r613l0364J3538P95q405
$$ y = [-25797, -29545, -28331, -36167, -31971, 6290, 31447, 125, 17585, 43211, 44332, 57280, 36681, -7984, -31575, -43401, -11209, -6965, -6244, 9865, -10124, -36604, -54255, -29918, -23922, 2903, 2313, -6747, 19851, 25663, 31760, 22494, 32050, 39894, 21294, -22779, -20265, -31013, -35770, -39943, -28676, 77, 8172, 15496, 21158, 9187, 197, 11731, -12200, -12324, 8433, 37668, 19234, -29318, -14479, -1964, 11503, -3292, -13658, -1012, -25918, -3098, 15705, 3788, -14930, 2526, 32746, 40483, 35792, 19896, -15443, -24939, -26150, -35636, -24138, -6477, 33452, 18555, -20036, -37572, -31317, -5755, 2045, -16051, -29941, -35786, -20601, -19612, -20231, -8502, -23378, -11910, 16676, 24395, 16666, 6849, 8813, 12157, -784, 2598, 3950, -5663, -36027, -22489, -21694, -30099]
7645c0099j2099J1627R553r027j0327J77J4551J6505o490k8382j4017l861p09
7632f2598N226r841j0852J2066K6994N0006j6668p640j0554j2633L0236J5983
7620I725P192P884j4666j1162K2681J820q652K873k6581j4247J9035J8697j4749
7607a50j1057l669r464J0146j2342J3514J8246Q078j4476j3347L289Q464j105
7594c873k3825O736J4367o150k1552J9011P692J1624j5368K7307m390O257K785
7581B0621m15m096J8897J5357k1808m437j3856r763n779n548j1834k901n455j6091
7567d7108P638o984R334l4095j1687K1251j4116n419J4316K5373J3072k157P242
7554b3340p889J3127R906l166k0563j6837K0611K434J4931N105k5302k0168j3825
$$ y = [-30099, -42198, -30571, -21018, -30045, -40372, -40195, -25644, -9139, -15629, -44011, -58028, -61889, -62598, -57372, -67213, -78065, -65999, -39005, 11001, -5667, -13307, -23861, -36494, -6258, 9725, 16917, 24801, 10135, -1027, 21654, 23474, 14822, 17695, -8886, -23133, -4098, 14599, -150, -11207, -14876, -24340, -14194, -26536, -13022, 5224, 13302, -1174, -14521, -11232, -2768, -3873, -27698, -20962, -6595, -12745, -34297, -15286, -7594, 4030, -11338, 15969, 11579, 17836, 20621, 20206, 16110, 35007, 50364, 28556, 24119, 10263, 500, -5279, -10827, -22661, -25562, -31017, -47108, -39470, -46454, -37120, -71215, -82902, -61651, -75767, -81186, -66870, -41497, -28425, -30582, -23340, -31229, -18102, -8196, -11362, -31925, -48762, -28151, -25717, -10786, -5681, -30983, -51151, -64976]
7541f4976J3655L1772L5181N138j8458j5750j5748q359n577J3470L3136K7523
7529C1007j3826k5087j1486k0257j5752P992M526K032K3725j551K6940J0796J3710
7516C2769J5013l8386j8213k2104j6619K3641K4008j4519j0784J6393l188J3083
7504A094K3016o263J1731L3991j4943l6524l2071j9628Q791L2157j3980o232M020
7491a4841J5449n273J528J0889R704j4662N589j5097k3507o656N371J1645J1439
7478h422O850o51j9380o086q36L625j1940r849J5572P037J6904K8340q262p795
7464E107J1372O618j3162j1489M616J9801k5072k9753M029Q673R04J5968J5783
7451A3395m890n431R564J5207o05J1086k1212j5363J693j2918k4253K193O391
$$ y = [-64976, -51321, -19549, 15632, 20770, 2312, -13438, -29186, -37545, -43122, -29652, 3484, 31007, 17181, -7906, -19392, -39649, -55401, -47409, -42883, -40851, -17126, -18677, 8263, 19059, 32769, 47782, 9396, -8817, -30921, -47540, -23899, 109, -14410, -25194, -8801, -11989, 1094, 24110, 17847, 29578, 63569, 48626, 12102, -19969, -39597, -30806, 1351, -12629, -18861, -14841, 608, -4665, -3137, 7752, 17456, 2794, 8383, -6714, -30221, -36877, -31506, -19861, -8422, -1572, -2223, -21603, -27689, -28525, -24900, -36840, -46689, -31117, -24080, -7176, 21164, 12902, 5107, 16479, 23097, 9935, -1554, 3062, 22863, -2209, -31962, -27933, -19260, -18356, -2388, 13395, 8505, 3074, 12638, 27845, 27240, 38326, 17114, 1751, 3444, -9474, -33727, -31534, -25143]
7438b5143J2876p409j2870J1286q556N627J27K91J5362N755r234p876k455m650
7424b6869J555K4579K1250o567k4465j375r639m005L725P374j9538j0170N909
7411c8236j476k7409J6795R793L68K2675J5042J7595J3596p028k3431k5237J3989
7398a2964K130K072l583k6188P069R103K1244K4634N798j9579k4834n557K7526
7385F871J4868k8596k7238j7726j2635L2292L4207Q89j8491N444K3422K964q340
7372G931J3044K964j1533n292R003K3297O673k4314k8365K137R898P529j1526
7359A446Q868m439j8308l4450K2496J2691J1519j7j676O320k7563k4926n346n721
7345e9106k2509J9505M8676J0153k0084k0839J0747K3463k548k5622J444L4035
$$ y = [-25143, -12267, -19676, -32546, -21260, -29816, -24189, -24062, -23771, -8409, -2654, -11888, -19764, -22219, -26869, -25314, -735, 20515, 13948, -10517, -11892, -21531, -25536, -21811, -14437, -33975, -44145, -38236, -39712, -67121, -50326, -40533, -40165, -17490, -2448, 15147, 28743, 21715, -1716, -26953, -12964, -10834, -8762, -12345, -38533, -31464, -22361, -1117, 23517, 29315, 9736, -15098, -20655, 6871, 21739, -6857, -34095, -51821, -64456, -32164, 2043, 2932, -15559, -10115, 13307, 16271, 7931, 20975, 23939, 12406, 7114, 16117, 39414, 46087, 21773, -6592, -4455, 5443, 12972, 1446, 10314, 5875, -12433, -46883, -24387, -11696, -177, -194, -1870, 4450, -23113, -48039, -53385, -59106, -81615, -62110, -13434, -3281, -23365, -44204, -33457, -9994, -12542, -38164, -36720, -2685]
7333b685J2330L029o997j2307P05j301j2326O041J1539k3206n985M547J5892J1257
7319E33m0861k1607j4552K0337K5667N6679j7001k9616J965k9892p044K2989J0242
7306b2161M017J2813J8194k2923k7102k183N558n364j0247J7001O877q076J7626
7293a5970K216J6680J5722j3379j6909k364n366l258K2349M0433N895k5189o3412
7280d2552j1708p785K6758K2142P193j2033j528o248j2063N018J2388R405K734
7267h279L2428J4283j2174J4299L7415l0949k8209l229j1935k1078J5949j4906
7255a6385j0273n022J0724J6387j8043j3928m406M721q479j6568J1888J8917R065
7242b1402o978N120O252m929p342Q755P638N134o945j054J7256J0466l2042J0566
$$ y = [-2685, 9645, 12674, 5677, -6630, -5925, -7226, -19552, -13511, -1972, -25178, -31163, -26616, -10724, 533, -40328, -61935, -76487, -56150, -30483, 26196, 9195, -20421, -18456, -48348, -55392, -32403, -22161, -18144, -5331, 12863, -10060, -37162, -39345, -33787, -39151, -49398, -32397, -25520, -33596, -15970, -13754, 2926, 18648, 5269, -11640, -14004, -19370, -22628, -279, 40154, 46049, 20860, -42552, -54260, -62045, -35287, -13145, -5952, -17985, -19513, -25761, -37824, -32806, -20418, -11013, -8279, 24149, 38432, 26258, 40557, 77972, 47023, 18814, 15585, 3650, -17428, -1479, -16385, -26658, -31680, -20956, -4569, -22612, -36540, -40946, -36225, -44704, -61272, -49384, -30467, -21402, -28380, -23260, -17008, -21937, -29279, -20524, -12886, -7752, -14697, -15751, 1505, 11971, -20071, -9505]
7228i505O3j0050J2713l425J6974L1039P983l5451m0077o900L2708K3542k690
7215A6924R573k0364j9174N403j158k6419N308P08J2902q31P400J5813m844p857
7201f616j3592q071K3269O965k7887J0485K7764m65j8829k7895l505J9752P329
7188a1296k427o275M058J9496K3504k6608k4104k2370J6515L6497Q363k4736j143
7175a0526N070p199l501P385R345R522R415j7015J9229k1432p285L4943n348l4934
7161a2331j4286J7154M7862k4133Q637j31k3523j9749P605L1213j2535r354P094
7148C523j9029k2099j0603R033j0276M345M686L1390J8688m331k2136k3156k4887
7135f4852j8875n712K3829J8712R009j2713J5321J1317j1335M196J4625o382k481
$$ y = [-9505, -9442, -19492, -6779, -10204, 6770, 37809, 45792, 10341, -29736, -36636, -3928, 19614, 16924, 26497, 6133, -13041, -7638, -8796, -35215, -29907, -29199, -16297, -17128, -9728, 6085, 1241, -6616, -20208, -28279, -5010, 1955, -25932, -15447, 12317, 11852, -6977, -34872, -38377, -18625, -11296, -13723, -19998, -15940, 3556, 27060, 452, -23652, -46022, -29507, 6990, 15353, -9383, -10526, -5456, -12655, -16156, -8771, 574, 10096, 19511, 2496, 21725, 293, -6992, 27951, 22603, -12331, -26617, -9463, 38399, 14266, 22903, 22772, -751, -20500, -12895, 18318, 5783, -3571, 3523, -15506, -37605, -48208, -39175, -49451, -45106, -40420, -9030, 9658, 5327, -16809, -39965, -64852, -83727, -89439, -65610, -46898, -37889, -50602, -35281, -23964, -35299, -31103, -16478, -22860, -25341]
7122b5341J5225r182j1717L430L9595K4140k0329k9854j956k1763j0461P309N980
7109c4924L1397l601k3007k3388K0505Q782J228J5270j6888k8069J6085L8779
7097B169L706k391J2245p785j9362J8671J3742k4172p696J582l1417k5639J0087
7084e6260P866N161K4570J8257L3610k5267k5105j0909M5782j331m052J301j6018
7071b395j7701j1225j6207M927J4923m001j4105J4921r054k095k106J5012J0421
7058a8685J8237N996J8513J799K9190K919l6759j8088M741J2144k941K423j0964
7045H525L420k3045q570K5457J4290q056k6812j7918M26J1765J7687J5759J380
7032A4308o473o103J7695j0852J4455j6972l3828q239O720o626j9458L3559J0012
$$ y = [-25341, -10116, -19298, -31015, -27585, 12010, 36150, 15821, -14033, -15989, -37752, -48213, -40904, -34924, -3527, -7128, -30135, -53523, -33018, -24236, -23008, -7738, -24626, -52695, -36610, 2169, 5875, 3484, 15729, 7944, -11418, 7253, 20995, -3177, -10873, -9291, -40708, -66347, -56260, -48394, -43233, -18663, -406, 33204, 7937, -17168, -28077, 17705, 16374, 12322, 13623, -2395, -20096, -31321, -47528, -42601, -27678, -31679, -45784, -30863, -39917, -42012, -44118, -29106, -18685, -448, 5548, 24061, 25860, 55050, 57969, 21210, 3122, 7863, 20007, 17066, 19489, 8525, 11945, -11100, -19670, 5787, 20077, 12021, -14791, -32709, -32283, -20518, -2831, 12928, 14308, 7835, 1732, 19427, 8575, 23030, 6058, -27770, -36009, -29289, -35915, -55373, -21814, -11802]
7019a1802j2355k817J4219k8007k403o924k609j0385r983J6645L9478k8201r629
7006e4773P315j385r061L744J3439J1883L132j853Q198M456r859K662K3270M17
6992A585k4814j3916L0557J4415q139R409k893R248j4672K2365l278k2622J6549
6979A3794l107O03R729L1787N3170Q047l0826J29J984j5057j3635J6701k0727
6966E2592k2131j298k6024k151K7977N689r54j9541q944K5084j7388k8878p285
6953b3252J8142J6682J4564j3929j6357j4200K235K3721K0722j6l6903j0671K2312
6940C050m220J1393K4907Q656j6273m0137J1550j6347l516m135l896k0442J5770
6927c3640j101K579K4973J6967J9989j0312O761K1771k2115k397k388q851J2315
$$ y = [-11802, -24157, -26974, -12755, -40762, -43165, -50089, -52698, -63083, -73066, -56421, -16943, -45144, -54773, -47458, -48843, -57904, -54160, -40721, -28838, -25706, -27559, -19361, -14905, -24764, -22102, 1168, 1585, -23229, -37145, -6588, 7827, -312, 9097, 6204, 15452, 780, 23145, 19867, -2755, 13794, 10687, 11290, 21019, 52806, 105976, 114023, 83197, 83326, 85310, 70253, 56618, 73319, 52592, 30461, 29163, 3139, 988, 28965, 34654, 33700, 14159, 5215, 30299, 12911, -15967, -23252, -5110, 11572, 26136, 12207, -4150, -18350, -16115, 7606, 28328, 28312, -8591, -19262, 3050, -1170, 10223, 35130, 43786, 27513, -12624, -1074, -17421, -20937, -25072, -28968, -49410, -33640, -34741, -32162, -7189, 9778, 29767, 19455, 26216, 47987, 25872, 23475, 21087, 12236, 24551]
6914B4551j9793k3500l989Q49r860k3885k964J6199L9618J7581o253l0183n955
6901b7584J2616J627n415o990L1961J7387k7006K1595Q570k1813R081K513J0138
6888B6680j0655o202K701J0329J1269n352n605P226o593k4896k2370j5580J9831
6875a9217J8464K341L515j7771j0439J3152J029n599k2403l5205J4431K5585K5277
6862f840M826j570j0517Q275M182P47L350Q081K94J037j9146M892J9159k76j5924
6847E70j8422k189J8480r31L150P082L099r753r310r029j6153L634j3302P928
6833c5146j2375j1589M579R319n942J8469K7241O844k8336j3129j4294j742Q849
6820d7252L8896J1449l257r247J815J2689j8630k0388k831P886J9021N549J0345
$$ y = [24551, 4758, -18742, -22731, -21882, -31742, -55627, -58591, -42392, -2774, 14807, 8554, -21629, -27584, -14968, -13341, -18756, -25746, 6215, 23602, -3404, 18191, 26761, 4948, 14029, 16542, 26680, 16025, 9823, 12524, 22853, 34122, 28770, 23165, 30391, 23798, -1098, -23468, -39048, -19217, -753, 1588, 5103, -12668, -23107, -9955, -8926, -14525, -36928, -72133, -57702, -32117, -6840, -2014, -3584, -14101, -5826, -1644, -897, 2453, 10534, 10828, 11865, -7281, -2389, 16770, 16494, 570, -17852, -20041, -1561, -2492, 658, 7740, 10839, 1086, -8224, -17253, -33406, -29772, -43074, -35146, -47521, -59110, -54531, -45212, -51154, -32685, -5444, 1400, -26936, -40065, -54359, -56101, -47252, -8356, 3093, -164, -9411, -7596, 5093, -13537, -33925, -36756, -28870, -9849, -4300, 6045]
6807F045n490J1510J3045k6028l955j0287j8572P134R678q260J8817K806j0243
6794a3800j6461m6702j6289L2025J7964j431J3819M872m758m840j4996q020J6053
6781d2564J4758Q585p446j1526l013J1552p623j6925K5368r045q265J4628J7010
6768a4506K2745J1035r847j3609L007O008l3038o911J5646J8346K0776j7766l3388
6755c1502Q634r97n66Q452j244k1923J2224K1822l634l0832l2366J2380L5257
6742b4295L95K2031p715p162J8243j2696K0886R421k6452j3042j4992L7356J6509
6729A8487j6940K2085L7085M050p019k9046r875j6396j1826J5333J1834l2640
6717a4868r313M415J5781J1813j8054k292q585J1657R677K437R148k051l438l128
$$ y = [6045, 555, 12065, 25110, -918, -4873, -15160, -33732, -26598, -16920, -25180, -6363, -3557, -13800, -30261, -76963, -93252, -61227, -43263, -44694, -30875, -26003, -30761, -35601, -50597, -58617, -42564, -27806, -19221, -26667, -38193, -41206, -29654, -37277, -54202, -28834, -37879, -46144, -31516, -14506, 8239, 19274, 9427, -4182, -1175, 4833, -28205, -35116, -19470, -1124, 19652, 1886, -31502, -22868, -23865, -24431, -15979, -17223, -39146, -26922, -5100, -8734, -39566, -71932, -59552, -24295, -23900, -1869, -9584, -16746, 1497, -11199, 9687, 19108, -7344, -20386, -35378, 1978, 18487, 1547, 23632, 60717, 64767, 57748, 28702, 18827, 2431, -9395, 5938, 17772, -14868, -24181, -19766, -3985, 7828, -10226, -12518, -21103, -9446, 231, 2668, 11816, 9765, 6327, 3199]
6703C199l4209k7067K9006P6793J3994j8923j3605J9117o847l3740m1336o05Q966
6690b5257K5439J1217j1132j2850M879K8152j8549j7046j2j1406J639K5652K8054
6677B8780O488p448j0915n920K1379j4545r644K397J0213P723K0356M103k0678
6664C2289j9620P74j212P755J3720m610j0179R56j6795M35K2553q659p592J3317
6650B3132r324p71M870K820j2752P492K0480J0243J7094m742l0117m360L0932
6637E4997n610k230K1200J6658M0812O645j6374K6558J9228Q000L3288O8180P6494
6624C47846Q1197J21553J97076J05738o9205j03117j18039m7540J1227M6417N8957
6613F32110O3618Q3622J65880K60598L40731M65263N97635P69306J056601J645400
$$ y = [3199, -31010, -58077, -29071, 47722, 61716, 42793, 29188, 48305, 41458, 7718, -33618, -34223, -25257, 182, 11399, 267, -12583, -7704, 20448, 1899, -15147, -15159, -26565, -24926, 726, 28780, 35268, 27820, 16905, 10985, 32364, 17819, 8175, 10572, 20785, 28508, 48864, 52967, 32289, 12669, 13443, 12231, 19986, 33706, 29096, 18917, 19873, 3078, 3513, 26066, 17407, 9815, 23132, 13808, 13037, 17907, 20727, 7975, 15467, 35947, 46190, 63284, 58542, 28425, 24065, 54997, 49387, 47157, 68357, 85015, 125827, 132472, 116098, 142656, 161884, 169884, 203172, 271352, 347846, 429043, 550596, 747672, 853410, 784205, 681088, 563049, 515509, 526736, 573153, 632110, 695728, 779350, 945230, 1205828, 1546559, 2011822, 2609457, 3378763, 4435364, 6080764]
6603F080764K955274N124402O860124K266056m342897n551477n130331l006304
6595E255611j536436q40846n41977m09835l61998k94681k40164j47797j03512
6586G78365p7801n8517l2954O113K3694N9525J26022L3664j43464j62524j51265
6575D00858r4696l5442j2042j0641k6716l6196j8342k2123j365P604j2533p218
6563A31148j4482l3447j7479l5269R01J8804J4311K0696J2381N733j6952l4338
6551E2007o656o670l547o863n223Q5R363L639j7479j8081K281O432j7219k0321
6537b8252J3368M902J650j3529k170r429J8029K0763j9090p687P776o003k2L995
6523a5699l375l068k296J7368J0130J8540J6032j6008j1160r41N023j8633j7852
$$ y = [6080764, 9036038, 14160440, 21020564, 23286620, 18943723, 13392246, 8261915, 5255611, 3719175, 2878329, 2336352, 1926517, 1564519, 1269838, 1029674, 881877, 778365, 700564, 642047, 609093, 615206, 638900, 698425, 824447, 858111, 714647, 552123, 400858, 306162, 270720, 258678, 248037, 221321, 185125, 166783, 144660, 143295, 150899, 138366, 131148, 116666, 83219, 65740, 30471, 31372, 50176, 64487, 85183, 97564, 103297, 86345, 52007, 45351, 38681, 35134, 28271, 23048, 23133, 32496, 36135, 18656, 575, 2856, 9288, -7931, -28252, -14884, -9982, -8332, -21861, -24031, -33460, -15431, 5332, -13758, -21445, -13669, -19672, -19694, -15699, -19074, -22142, -24438, -7070, 3060, 21600, 37632, 21624, 10464, 9523, 14546, -4087, -21939]
6510b1939J4075j9654j0646K8751M381M160j8774n861j5241j4877L868j7229K4396
6497d4590M3935J1465K088k1544M839O820R70p920k4155p910j517j8028k757J7836
6483d0468Q394j3258J6300K6064P71K8422J3956k2941M15j1112P800L890j7241
6470I92k2559o563L6043K3883L331j0379J300p697M664O979k6408q561m794J6750
6456F981j8425K2492J2368K937n77j6269k0072K4849K0257j0472o260k1864j6930
6443b0985j2051P203j1191k3157q79K744J1572J770M4522J9997k0129j7432q100
6430b6116K315P952J3817j3259j5022J4828O467o315J3193j6550j7586q72M640
6417c2508n632K5490K2631J9853K3258l95k4535j2848j5917j6306r558M654N907
$$ y = [-21939, -7864, -27518, -38164, -9413, -5032, -872, -19646, -25507, -40748, -55625, -51757, -68986, -44590, -655, 10810, 12898, -8646, -3807, 3013, 3983, -3937, -28092, -36002, -37519, -55547, -58304, -40468, -32074, -45332, -29032, -2968, -2197, 26225, 40181, 17240, 17655, 6543, 14343, 18233, 992, -21567, -28130, 7913, 31796, 35127, 24748, 26048, 18351, 23015, 29994, 3586, -4975, -9769, 6981, -11444, 11048, 23416, 26353, 25776, 9507, -10565, 14284, 34541, 24069, 17809, -4055, -20985, -33036, -25833, -37024, -60181, -61060, -58316, -46744, -44974, -452, 19545, -584, -18016, -26116, -23801, -15849, -2032, -15291, -30313, -15485, -9018, -15333, -2140, -18690, -36276, -37148, -32508, -38140, -12650, 9981, 29834, 53092, 52697, 28162, 15314, -603, -16909, -26467, -21813, -15906]
6404a5906J0982K0730N140o626O302J139j3839l935r518q217J8568k2406k3872
6391d1458o746j1233j5226J1449L0997J3559o045k500K3722K4821j1715j0324
6379f99j5207J4623K1872m172m800l388K3679Q666j8375n634l8913k2505M3805
6366a048M6045l8665j1721K8010L22R28J4856k895l1380l5711m681M132j7176
6353d8984M0905l72j1596P100L1589K673j1280j1698O445j527l661o9l06K0651
6339A9870k452M345r231q876k50m374R752N245j9542j9721K4922J8101J29j1691
6325F227Q547k649K5940q876j7626k2418q430K062q057J636L0648L1237J0895
6312D9136J0006j3670j6664j4248j7941o157K4649k269j8796J0529o104l806k4275
$$ y = [-15906, -4924, 15806, 20946, 14320, 20622, 21761, 7922, 3987, -5531, -13748, 4820, -17586, -41458, -48204, -59437, -74663, -63214, -32217, -18658, -24703, -27203, -3481, 21340, 9625, -699, -15906, -1283, 20589, 16417, 11617, 8229, 31908, 40574, 22199, 16565, -22348, -44853, -1048, 44997, 6332, -5389, 22621, 22943, 23871, 38727, 35832, 4452, -31259, -35940, -31808, -48984, -8079, -8451, -20047, -12947, 18642, 21315, 10035, -1663, 4782, 3255, -406, -475, -781, 19870, 17418, 21763, 12532, 3656, 3406, -968, 8784, 14029, -5513, -25234, -312, 17789, 17918, 6227, 14774, 12125, 38065, 29189, 11563, -10855, -19285, -17223, -25280, -23644, 7004, 38241, 49136, 59142, 45472, 28808, 14560, -3381, -9538, 15111, 12842, -5954, 4575, -1529, -5335, -29610]
6299b9610j8437J097J4287N272P45j237j2474j8688Q614L5715j6310k2156J4854
6286c8328O780L8788K1625j010m655L699j7196k2518k3116j5193O163J7414K8031
6273D84L712m6326j0026n84K2635K3015k142K770j4118l5703j6367L7092K7480
6260h078j298j876J0746o34J8600k232j5948J0337K8235r668k4537m588L744P623
6246A0426o0734J8958jk04J5473J4597m986k2250j9046O447j098j125k2923L440
6232f3026L4846L8156K382M088P192p338L7386K8487L4297J5909q50k1581l2912
6219G7036k3440l0441k5029j0599J7125K2787m547J0369k556k9995l1082j4993
6207d5365J2669L795O742K872j012J2259k6452O629n804j2315J9785K582j4112
$$ y = [-29610, -48047, -46950, -32663, -27391, -26646, -27883, -40357, -59045, -50431, -14716, -31026, -53182, -38328, -31548, 7240, 28865, 27855, 23200, 26899, 9703, -12815, -35931, -51124, -44961, -27547, 484, 4196, -42130, -52156, -52740, -30105, -7090, -9232, -6462, -20580, -56283, -72650, -35558, -8078, -9376, -11252, -506, -1140, 17460, 15228, -720, 9617, 37852, 28184, 3647, -941, 2803, 10426, -50308, -31350, -31351, -31555, -16082, -1485, -6471, -28721, -47767, -41320, -42418, -43543, -66466, -63026, -28180, 9976, 12358, 16446, 23638, 16300, 53686, 82173, 116470, 132379, 131529, 109948, 77036, 53596, 23155, -1874, -12473, 4652, 27439, 22892, 33261, 30705, 710, -30372, -45365, -32696, -28901, -22159, -19287, -20299, -8040, -34492, -27863, -33667, -45982, -26197, -23615, -37727]
6194c7727K7470L4754n66k5216l026O317J5690J0527j3109m4238K4119M546o316
6181f775L4859J5899n920j5668j4657j0066P450j278k0005j8839r648L0769R192
6168d687J4656K6836K1738k7143l7576J5441K640j7617o559K0869L2103j535K107
6155D1273J600n51k2138l9865p82J4508p190j9069k2285j2686L999O253K6090
6142c0843J1999L907K8300K2616L592l1805j5922R651O218r123k4298N039r358
6129c0027n793J4609N978N050j4868k0907o796K9242P532k3261J5567J2474Q135
6116c065k3624r529j1237K2411j5226J8408J8628R61O027j274p688j0701j6922
6103c2831L771J2198p36K0982K6536n04j4648m8643k6864J5499K4139J8L34K377
$$ y = [-37727, -10257, 24497, 23931, -1285, -4311, 2006, 17696, 28223, 15114, -29124, -5005, -459, -6775, 28084, 43983, 38063, 22395, 7738, -2328, 5122, 3844, -16161, -35000, -44648, -13879, -4687, 9969, 36805, 58543, 31400, -6176, 9265, 11905, -5712, -12271, 8598, 40701, 39166, 41273, 42873, 42322, 20184, -19681, -20463, -5955, -13145, -32214, -54499, -67185, -63186, -56933, -30843, -18844, -14937, 13363, 35979, 39571, 7766, -8156, 1495, 7713, -1410, -25708, -20669, -30027, -35820, -21211, -15233, -10183, -25051, -45958, -52754, -23512, -15980, -39241, -23674, -11200, -3065, -26689, -36218, -47455, -25044, -40270, -21862, -3234, -2273, 3754, 2480, -5208, -15909, -32831, -29060, -16862, -17598, 3384, 29920, 29416, 14768, -33875, -60739, -45240, -21101, -21083, -20749, -18372]
6089a8372m403O08L0004O20l2215P09L2911j311j0909j1813n68j1239O610K0432
6075A064K6888L156l1328l6322q460J8046J9815K7155k7861r941M8J8899J6867
6062A8026j832l194j2547R244j9149r686J388K8618o804l426J6529j3644p319
6049c796K2914R615K2317r879m3083m090j1502j1587K3144K8021j1844j8884q360
6036a7014k476L752M947L42N071j2011l1683m555K2743M4546J703p268k691J9281
6022B4687K4497l3443k7472j4348k195n229K6087P805j2724k0672K6838o094k4270
6009c6533J2008L2736M4802P279m8187l5586j4800J9418K4867J4639k3575K932
5997@J6188p568R176Q842j769J1985j9330j6275L0274j3069k3265r885j9704j3031
$$ y = [-18372, -22775, -22167, 7837, 8457, -23758, -23049, 9862, 8551, -2358, -14171, -14739, -25978, -19368, 1064, 27952, 31108, -220, -36542, -45002, -26956, -7141, 20014, -7847, -17788, -17740, 1159, 18026, 16194, 13000, 453, 9697, -9452, -19138, -17750, 10868, 4064, 638, 17167, 3523, -3796, 19118, 28733, 51050, 41171, -1912, -6002, -17504, -29091, -5947, 22074, 10230, -8654, -17014, -19490, -15738, -10791, -10449, -5378, -17389, -49072, -53627, -30884, 13662, 15365, 8097, 5406, 24687, 49184, 15741, -11731, -26079, -28274, -33503, -7416, 389, -12335, -33007, -6169, -12263, -36533, -24525, 8211, 53013, 60292, 12105, -23481, -38281, -18863, 6004, 20643, -2932, 0, 16188, 8620, 17796, 26638, 24869, 36854, 17524, 1249, 31523, 18454, -4811, -14696, -34400, -47431]
5983d7431k680J5475J7055J3235k9985O47J2292J0813n718j1015p430O359J2149
5970a6234M085J6870j6084j4911R995L4728j9845l3013r365j6048j2840K2032
5958e0630L5489J0046J303j4731Q58K2828L1184n891j5025J295j5059J1358j7775
5945d750k7856j0517K2249J8207l8607L36J4647r828k616J6737J2397Q595k6372
5932b7378j0014P871K3130j737q63r256p796K4033N390J1635N270L980o861J3915
5918C1319L355l8500l9048J1316n562j7847k294n805K8284J5165K0585k4527r212
5905c2771J8083P834p681Q059K5188J8301k6395l9516J1731M713k6331j586K2180
5892a8191O286J511M136M685j315j764k3935J3448K2577l104j9661o815k221K6414
$$ y = [-47431, -50111, -34636, -17581, -4346, -34331, -33684, -21392, -10579, -16297, -27312, -34742, -28383, -16234, -12149, 4721, -11363, -26274, -16279, 18449, -1396, -34409, -43774, -59822, -72662, -50630, -15141, -5095, -3792, -18523, -17665, 5163, 36347, 30456, 15431, 16726, 1667, 13025, -4750, -32606, -43123, -20874, -2667, -41274, -40938, -26291, -36119, -38735, -21998, -9601, -1006, -27378, -37392, -29521, -6391, -8128, -8991, -18247, -26043, -2010, 3380, 15015, 20285, 24265, 17404, 31319, 34674, -3826, -42874, -31558, -37120, -54967, -57261, -63066, -34782, -19617, 968, -23559, -32771, -14688, -6854, -14535, -6476, 18712, 37013, 10618, -28898, -17167, -12454, -38785, -40371, -18191, -11905, -10394, -6258, -1573, -2888, -4652, -28587, -15139, 7438, 4334, -15327, -22142, -24363, 2051]
5878B051j3676L1245K6038j4187k0485p928r136R855L0002Q720j8987k9331j0331
5865a6150J6260j7372j8496J1816J2964O641J2744r151n469O984O88k5164j6313
5852d0018k1687J9100J7621r731j431J0160n095j5059Q242R978J0522m613j7828
5839c9839J7214J4682j563l0958l3598J5116K2309O793j9075J1451Q593Q548j0158
5826c0485R236O217J4372K7765j7570k8551R066l034j2063k826O42K0304L9198
5813C2271K292j8389l3821j8564K82J8303R218k7347J2582R899J6687r056L2618
5800B6975K1924k9593j5934q115Q77j5537K373K8075m850r075J0055J5129n45
5787B1759J2234k2777k7755j2343N801J0678O883O54J0383Q256j3023J5461j358
$$ y = [2051, -11625, 19620, 45658, 31471, 10986, 3058, -6078, 3777, 33779, 42499, 23512, -5819, -16150, 110, -17262, -35758, -23942, -10978, -4337, 8407, -744, -6213, 771, 1459, -23705, -40018, -61705, -42605, -24984, -34715, -36146, -25986, -31081, -46140, -37898, -27920, -17398, -22011, -39839, -22625, -7943, -9506, -40464, -74062, -58946, -36637, -29844, -48919, -37468, -28875, -20327, -30485, -21249, -15032, -660, 27105, 9535, -19016, -9950, -12984, -25047, -27873, -27231, -6927, 32271, 34563, 16174, -17647, -36211, -35929, -17626, -8408, -35755, -23173, -13274, 3413, -5643, 26975, 48899, 19306, 3372, -4743, -3866, -19403, -17030, 11045, 6195, -2880, 7175, 22304, 21759, 33993, 11216, -16539, -28882, -23081, -12403, -5520, -4866, 5517, 13773, 750, 16211, 14853]
5774A4853J6223n764O580J4454j4018k59J7315l7751k7038j4297k740k4563R367
5761d7638J5130M1064M8955O042l0171j4187m968j8711p885L1455o96Q960N449
5748C2799k6534r536k4047j5695J7225j3367k902J0184J7807P961j0671j1333
5736b8109O102k3116j1542J9265J7637R362P62K1200K6332k1729m64j38k6417
5723a0855j7739J0095k606l645k1816L849L3748J2216k1392J4513L2429n824r954
5710A3019J64j448O910O48K090j2904k3984R750K2390K2342K1682r548Q540J5371
5696G5022j9304m5289l542K1516r709J5664k549k6616k9141J2024P028J719Q736
5683E559n215k4802k0164J1116K6302J0077O420J233l893j88n112m447l2191j760
$$ y = [14853, 31076, 25312, 31892, 46346, 32328, 32069, 49384, 11633, -15405, -29702, -32442, -57005, -47638, -32508, 8556, 57511, 63553, 33382, 19195, 14227, -4484, -12369, 19086, 18390, 27350, 32799, 6265, -3271, -27318, -43013, -25788, -39155, -42057, -31873, -14066, -6105, -16776, -28109, -22007, -45123, -56665, -37400, -19763, -10401, -9639, 11561, 37893, 16164, 15700, 15562, -10855, -28594, -18499, -21105, -24750, -46566, -42717, -8969, 3247, -18145, -3632, 28797, 22973, 13019, 13183, 11735, 18645, 19293, 21383, 8479, -15505, -5755, 16635, 38977, 60659, 51111, 59651, 75022, 55718, 10429, 6887, 28403, 18694, 34358, 31809, 5193, -23948, -11924, -4896, -3177, 5559, 344, -24458, -44622, -33506, -7204, 2873, 9293, 10526, 6633, 6445, 1333, -3114, -35305, -37065]
5669c7065j572O575R496J4022n512k2722o225j7732r393K0746L6032J1886k7710
5656b9174j2606j357l95Q039O568K256N051Q634j7240k0648l30K2037K2626K6285
5642A9746J2150j4454k7941j3169j1427P428j0305J2412J3557Q10m427n76O581
5629i615J263K6282j6841l7611l147K833K911l7065P722K0251K0190L7475K7528
5616D2176k715l6968j3113L2258M556q528J1806r872R62j3742n536l860j5726
5603a8302J4993O641R506j4743r472n672N806j8460j3616K9223K8976j790J1521
5590B4611l3245j3125J5464R244R995n98R132N383k1171k8831j1610N849N445
5577b3457M409j4667j688K2610K0403k37n13m319p047j6898k4560J2193K5357
$$ y = [-37065, -38637, -32062, -22566, -8544, -14056, -36778, -43003, -60735, -70128, -49382, -13350, -1464, -29174, -41780, -43137, -43532, -35493, -28925, -26669, -21618, -12984, -30224, -50872, -51202, -29165, -6539, 19746, 31896, 17442, -10499, -23668, -35095, -27667, -37972, -25560, -12003, -11193, -15620, -16196, -9615, -8352, 17930, 1089, -36522, -39669, -36836, -33925, -70990, -63268, -43017, -22827, 14648, 42176, 39461, 2493, -10620, 21638, 26194, 17666, 29472, 19600, 20562, 6820, 1284, -2576, -18302, -3309, 3332, 12838, -1905, -11377, -17049, -11243, -29703, -43319, -14096, 14880, 13090, 24611, -8634, -21759, -6295, 2949, 12944, 12346, 21478, 26861, 5690, -23141, -34751, -28902, -23457, -19048, -33715, -35403, -12793, 7610, 7373, 6860, 2541, -4506, -21404, -45964, -33771, -8414]
5564h414L1043R320j6854j7956j1172J9290r30j6565k0657J9581K5430j0234j6484
5551a4602n765K0859K2546m703j6719o161j9623J368L364K95K9429R525M706j0764
5537A3755l247j772p628K655J3754J1983j1987k8038k2251P861J8342J949M103
5524e21o520k7205q41J1177n103K8395J6347p530l6594M440q559J8167K0357L047
5510I057j8783k5827j0768N744L2512J6010r51o699n563K8453j3796q482m970
5497d063j1161Q246J5657j9829J2835L064j0419O504J0578j5032p355m935l569
5484a9479q911R874K6156K87k5863p394j302K4520j6553j3773r33r64O031J705
5470b6599k132J1756Q681j6348j1922K3785K0186n179k686l814l801j0173j3718
$$ y = [-8414, 22629, 31949, 15095, -2861, -14033, 5257, 4327, -12238, -32895, -13314, 12116, 1882, -14602, -20367, 492, 23038, 18335, 1616, -4545, -24168, -22800, -19436, -19141, 10288, 19813, 24519, 13755, 10508, 8736, 1108, 3763, 17517, 29500, 17513, -10525, -32776, -24915, -6573, -4624, -521, -7041, -34246, -35087, -23910, -29013, -618, 15729, 8199, -28395, -23955, -32514, -14347, 6010, 9057, -9726, -35553, -46321, -40577, -8065, 7945, 6994, 295, -5268, 23185, 9389, 907, -4063, -15224, -6978, 8679, -11150, 1685, 4749, -5670, 834, 11412, -3620, -10975, -15910, -19479, -28390, -18516, 7640, 7927, -17936, -25330, -26632, -2112, -18665, -32438, -33371, -34335, -28304, -26599, -28731, -16975, -8294, -24642, -36564, -12779, 7407, 2228, -458, -4272, -8073, -18246, -31964]
5457c1964N384J8581L3742J950j3282j6747R091L8602o743l2916R621J3670N355
5444C4344r25L057k9303n965l1363J7725K3518k1681j4667J4285k6312j5254R738
5431d2803J6550K7802P512l805l1975J341M82K6411J5609J9834J2620k8493l5227
5418a4142m033M242k6142J5422O112J3182K5085o244k8738k963K5144j8776N68
5405a1283k279q795R553j2402p034K0715R551J1749k8859j4152J0280m92k4624
5392d8072r307Q948J5506k899J1913j1354M67J9875l489j3037k955r368J7707
5379b6065L0179q787l045q16J663J0947j9J1985K249k3729J2481K1030l3980m7523
5365e3430k284O301q363Q612L2029M545k2352J6513l642N303k203P601J5955K0832
$$ y = [-31964, -26580, -7999, 25743, 27693, 14411, -2336, 6755, 45357, 38614, 5698, 15319, 28989, 34344, 33419, 36476, 7173, 1208, -30155, -12430, 11088, -10593, -25260, -10975, -37287, -52541, -42803, -26253, 1549, 9061, 5256, -26719, -25378, -24896, 1515, 17124, 36958, 49578, 21085, -14142, -18175, -13933, -40075, -24653, -18541, -5359, 19726, 13482, -15256, -18219, 6925, -11851, -11283, -13562, -22357, -12804, -25206, -32240, -11525, -1974, 9775, -19084, -33236, -22956, -23448, -48072, -57379, -48431, -32925, -35824, -23911, -35265, -34798, -14923, -18412, -31449, -34404, -43772, -26065, 4114, -4673, -7718, -8534, -6871, 4076, 4057, 16042, 18291, -5438, 7043, 28073, -5907, -53430, -55714, -49413, -57776, -49164, -17135, -12590, -34942, -18429, -22071, -16768, -18971, -11370, 4585, 25417]
5351B5417K427P712K637k7671j5487j3691p551Q497J652J7589N044j5076J0927
5338B426K2415l6942j7723J8476n038j0424l2291P141K5887R973k7864j1653J3240
5325d2377O346L1779K0897Q172j0025o5l402j7892P279L2471K684q906j8631N483
5311A3813L6024L84n485m063K888j5968k9059k398P405l340N301j6668K3513M0980
5297E3327o312q801j9805R539Q490j5834k2631J9367J7713O903k0579j9884R230
5284A0723R227Q149j1649l021k00j0545j7894l1562n705J90P240K9772J4573k9602
5270c0304j9069K2576M773J3470P715r539j223Q06l959j2376O721K6113j2323
5257f619k0729k074N41K3432N280P668k417M424J5560j5676k2462J0300J5211
$$ y = [25417, 27844, 35556, 38193, 10522, -4965, -18656, -26207, -17710, -16058, 1531, 6575, -8501, 2426, 24841, -12101, -29824, -11348, -16386, -26810, -59101, -51960, -26073, -16100, -43964, -55617, -42377, -36031, -4252, 16645, 24817, 14792, 14727, 11325, -6567, 712, 33183, 35867, 26961, 8330, 13813, 49837, 50221, 44736, 40673, 43561, 27593, -1466, -3864, 3541, 201, 5502, -11166, 12347, 53327, 47015, 38214, 18409, 27948, 36438, 20604, -2027, 17340, 35053, 41956, 21377, 1493, 10723, 19950, 28099, 16450, 13429, 13229, 2684, -15210, -46772, -52477, -52287, -45047, -15275, -702, -30304, -49373, -26797, -22024, -8554, -839, -10378, -11601, -10795, -14754, -27130, -20409, 5704, -6619, -27348, -29422, -28881, -5449, -169, 7499, 5082, 9506, 25066, 9390, -13072, -2772, 12439]
5244A2439K1651l3801o567j3041j9870K6000J1914j1226j388J5507L862p649P146
5231D977K1216K2702n354k2742o175k9617k689J4090J8766O438L488L8544J6234
5218G9878p094q318m003j4784k336J1197o056r480j7094m34k6587l2846K865J0387
5204b4705r141O654J8560q973J5839o447m6911j2967M446O058K8885J5638n398
5191a8462p211l031k1445j1033K3909K1602j0806j6642r381J4733K1401K6652
5179A0286q169R741n766k716J6544J362k4706j1779M81r772J1421J7992J4016
5166A8935M544J3628n096k4976k5441R37k0514k013M9638R643k5608j9821N370
5153b0774J3474j800m5929O791m026j404J1188K1785J0704p558Q706P822k7118
$$ y = [12439, 34090, 289, -6278, -19319, -39189, -13189, -1275, -12501, -13889, 1618, 5480, -2169, 4977, 26193, 48895, 43541, 20799, 14624, -14993, -17682, -3592, 15174, 21612, 25100, 63644, 79878, 72784, 64466, 60463, 45679, 43343, 54540, 48484, 39004, 21910, 21476, -5111, -37957, -35092, -24705, -33846, -27192, -8632, -17605, -1766, -8213, -55124, -68091, -63645, -57587, -28702, -13064, -18462, -25673, -28704, -50149, -61182, -37273, -15671, -26477, -43119, -52500, -37767, -16366, 10286, 2117, 11858, 6092, 3376, 19920, 21282, -3424, -15203, -14722, -24494, -13073, 4919, 18935, 23479, 37107, 32011, 7035, -18406, -17469, -37983, -39996, 9642, 19285, -6323, -26144, -20774, -7300, -9100, -55029, -48238, -52264, -53668, -42480, -20695, -9991, -17549, -8843, -1021, -28139]
5140b8139j6535k477P292J7025j5805J0021k4025j0932J6741J8983K1225j779
5128h405n68P97M6521J3952k3855n971J1422j9497K1423j1640k0839j1835j61
5115h656l822K2472J7540n903q738k7959k6696L1478K775J491M096J064j4436
5102a5294J789J2773n509j0946J1647j451q200N276R745J1859J2975k8197k2965
5089b6498j3002K8108J6802j0289P138j3374L122j0349j7128N080m161k4279k2339
5076h1169n073L3836K7737L3080r970m993l634j6693O011J1772L109J1507J4781
5063B0301r465j9531k1893K079J7957j1654k8506J514K6845J0278N975J1081j0641
5050e660J3300K291j1223k9916J919j772r995K8603K0042r435j1551j9093N222
$$ y = [-28139, -44674, -47151, -39859, -22834, -38639, -28618, -52643, -63575, -46834, -27851, -6626, -8405, -8973, -8176, 38345, 52297, 28442, 22471, 33893, 14396, 35819, 24179, 3340, -8495, -8656, -12478, 9994, 27534, 21631, 12893, -15066, -41762, -10284, -7509, -6018, -1922, -858, -15294, -13505, -732, -6241, -17187, -5540, -6991, -15191, -9915, -170, 11689, 24664, -3533, -26498, -39500, -11392, 5410, -4879, 2259, -11115, -7993, -18342, -35470, -30390, -34551, -58830, -81169, -86242, -52406, -24669, 8411, -1559, -6552, -10186, -26879, -20868, -9096, -5987, 5520, 20301, 10836, -8695, -30588, -28509, -10552, -22206, -50712, -49198, -22353, -12075, -6100, 4981, -5660, 7640, 9931, -1292, -31208, -29289, -31061, -41056, -12453, 7589, -1846, -13397, -32490, -27268]
5037b7268M1629k895k6591k7360l225L3498k5976j4670K4761j679k4290L841M396
5024d5829K9216L3804j90m638q000o714k2380j6590J4976o796j5853N860q565
5011e1699J4438P642k406j612o648J7787m382R494j0894j7953K7189J0273J0783
4998B012K3397O19k3981k7383K1908J7194j3990m931J2470K3045q476j3879j1083
4985c078K0672k827j0522O826m74j9014M327j2291j1852K5028P749k9121k4704
4972d9281K807P419J3126J3889l423J7331J4685p208l008r503J5209m051l7991
4959b9999m674L3337q445M862m747Q5n215K8069p6j3256l965n531K834J5640K2816
4944C1735K4586m3075l283l934k3126k1971J1447M1516J5770j3127K552Q05j2502
$$ y = [-27268, 14361, 11466, -15125, -42485, -45710, -12212, -38188, -52858, -28097, -29776, -54066, -50225, -45829, -16613, 17191, 17001, 12363, 4363, -2351, -24731, -41321, -26345, -33141, -48994, -43134, -51699, -37261, -29619, -32025, -33637, -40285, -22498, -26880, -17386, -28280, -46233, -19044, -8771, 2012, 25409, 26028, 2047, -25336, -3428, 13766, -224, -5155, 7315, 30360, 21884, 8005, -3078, 17594, 14767, 4245, 11071, 10597, -8417, -4090, -16381, -28233, -3205, 4544, -24577, -49281, -46474, -39055, -25929, -12040, -15463, 1868, 16553, 9345, 6337, -3166, 12043, 7992, -29999, -34673, -1336, -9781, -4919, -9666, -9581, -14796, 13273, 13197, -59, -4024, -9555, -6721, 8919, 31735, 56321, 13246, 9963, 6029, -17097, -39068, -27621, 13895, 29665, 16538, 19090, 19895, 7393]
4931G393J681K166L108L528M357K0974K4224j76j1939p407j7199j5477q695k8899
4917b2361k7684k4523R255L4267j1128j4820J5441R282j1308j0623j2015J1870
4905e4347J0614L2577j2615r487J1208M6181P464k8315k7667j3493O762K5770
4893e348K0697Q584J0758k4674k498M121J6742k1438j8977j5186l4378O568M6116
4880h913Q630k3878L251j732L7763J4000k4681p721K0088n244k2277P922k0251
4867b3043k931L2076J0490l5146L129J1558j6902q162K0009R516L3367m878k5845
4854C238j5290j1385r809r170M745J6862J1907l343j1539k6844J0070K9391J8519
4841G352J0201q988k9455N210J1047o198J3660j4040N072l177mp849k394J416
$$ y = [7393, 9074, 11240, 14348, 17876, 22233, 43207, 67431, 67255, 55316, 47909, 30710, 15233, 6538, -22361, -50045, -74568, -65313, -31046, -42174, -56994, -41553, -32271, -43579, -54202, -66217, -54347, -43733, -11156, -23771, -33258, -22050, 24131, 31595, 3280, -24387, -37880, -31118, -5348, 15349, 23933, 34691, 10017, 7519, 11640, 28382, 6944, -12033, -27219, -61597, -55029, -8913, -283, -24161, -20910, -22642, 15121, 29121, 4440, -3281, 16807, 11563, -10714, -2792, -23043, -25974, 6102, 16592, -18554, -15425, -3867, -20769, -28931, -8922, 594, 33961, 29083, 3238, -12052, -23437, -33246, -42416, -37671, -20809, -8902, -12245, -23784, -50628, -40558, -11167, 7352, 17553, 8565, -20890, -15680, -4633, -10831, 2829, -11211, -6139, -9316, -9320, -17169, -19563, -18147]
4827a8147N243K2876J4097j7788j3564r993o881J4857K1831L254k2550l1586j6871
4814e5222J9547J9615N454J8670P655J5828j0802k0883J6541K7277J603q126k1978
4801A5179j4138M142o014l200J3068P426k4548J4272j54K2624J9536r213m474
4788C4506q314o221r748r365J4783J523J6595J5771q16k7098r606m581J5323j506
4774B1246j9164J297L2290m508l7315j2882M481J8293J632J0958K4279K3260k0076
4761D3791o650j8232L385k4450l5204k5832K1504L3455o16o228j336K1820q008
4748b601k9139R878k412j1671J6140J5951K5838N174l6820k4129J0563J0764K0993
4735H529R950K41j0028k1418j9525J3565M1391O397j5513n060K729L7268J0530
$$ y = [-18147, -12904, 9972, 24069, 6281, -7283, -17276, -24157, -9300, 12531, 15785, -6765, -38351, -55222, -35675, -16060, -10606, 8064, 15719, 31547, 20745, -138, 16403, 43680, 45283, 37157, 15179, 1041, 5183, -831, -4031, 9037, 16463, -8085, 6187, 6033, 28657, 48193, 38980, 34506, 26192, 19971, 10223, 858, 15641, 17164, 33759, 49530, 48714, 21616, 12010, 7429, 22752, 21246, 2082, 3379, 35669, 31161, -6154, -19036, -14555, 3738, 5370, 16328, 40607, 63867, 43791, 37141, 18909, 22294, -2156, -37360, -63192, -41688, -8233, -8849, -15077, -16413, 5407, -2601, -31740, -21862, -24274, -35945, -19805, -3854, 21984, 27158, -9662, -33791, -23228, -12464, 8529, 18479, 18720, 8692, -12726, -32251, -18686, 22705, 29102, 13589, 8529, 11258, 48526, 59056]
4722E9056o439j3974m0837m403J1407j4631k007m404j773O271P149j1487k517
4709a8589J1202J2160l102J0873j1733k2273M66J4608J4103K9901K4608p794j3134
4696D1296l488j4551j0378p900J9705J5562k1513J1912N445o433l066l572j23
4683B2896R382K3537j4340l1337n28J8827J524l442k9363k8329k320N183J0136
4670a8174K225K217k404j428K689k6929o944k786J0138J5759L380J3317L9995
4657C1055j9625k5691K440r734J8095P281N012k4037l414K4930j1130o9627K3186
4644e1259M0142J2407N251Q325k0543j6735J5461O419k9319J0337J0826J046L980
4631c662J0097k978j6885M932m590J666L8018Q992k2993k7871m3499q985J2135
$$ y = [59056, 52617, 38643, -2194, -6597, 4810, -9821, -11828, -16232, -18005, -11734, -4585, -16072, -18589, -7387, 4773, 1671, 12544, 811, -21462, -20996, -6388, 7715, 37616, 62224, 54430, 41296, 37808, 23257, 12879, 4979, 24684, 40246, 18733, 30645, 36090, 29657, 26591, 23019, 22896, 32278, 55815, 41475, 10138, 9610, 28437, 29961, 26519, -2844, -31173, -33493, -28310, -18174, -15949, -13732, -16136, -17564, -14875, -41804, -48748, -51534, -41396, -25637, -22257, -8940, 31055, 11430, -14261, -11821, -21555, -3460, 3821, 8833, -15204, -18618, 6312, -4818, -74445, -51259, -11117, 1290, 6541, 14866, -5677, -22412, -6951, -532, -29851, -19514, -8688, -7642, -3662, 6435, 3457, -13428, -8496, -13086, -11420, 26598, 35590, 12597, -15274, -58773, -67758, -55623]
4618e5623p805j2322K806L0913J5717J9802O247j0289k4700L397L2885N101j0298
4605d169M716l9605j9927l663K3258J1644J4404J3281L419j5946o274p13J8883
4592f92r920j1467r165k726P470J73Q458Q40k155R621o650k9609L484K1367j6182
4577c7153r531J1354j4776n566J2254P626m159q085J3150K8154K255k0726k4470
4564d9673K5671K8527J343L437K7255R397j0479j3632j5127k1761O256J0675k9034
4551b7145q895K7221N4392K354j7433j9384N526J1540m963l2084j9499P967K5919
4538E516Q954K344M404k125k2884J9482J091k4399l9819k7108J4120L7439j2529
4525c5514j4513M4596L9170K766j7581l0774k3517K0867p059o4j4741j1566J8669
$$ y = [-55623, -63428, -75750, -72944, -42031, -26314, -6512, -265, -10554, -35254, -31857, 1028, 6129, -4169, 547, -39058, -58985, -62648, -39390, -27746, -13342, -61, 3358, -12588, -18862, -19575, -692, -10612, -22079, -31244, -33970, -26500, -26327, -17869, -17029, -19184, -9563, -16213, -45822, -42338, -20971, -37153, -46684, -35330, -50106, -55672, -43418, -35792, -39951, -48036, -34886, -6732, -4477, -25203, -49673, -24002, 4525, 5868, 9305, 36560, 45957, 35478, 21846, 6719, -15042, -8786, 1889, -27145, -36040, -8819, 45573, 47927, 30494, 11110, 16636, 28176, 23213, -8871, -28370, -20403, 5516, 14470, 16814, 21218, 19093, -3791, 15691, 16782, -7617, -47436, -74544, -60424, -22985, -35514, -50027, -5431, 33739, 36505, 18924, -11850, -35367, -14500, -21559, -21623, -36364, -47930, -29261]
4512b9261L823J6814l066k9496J1131J3173q450p57q802J3108O786N684K0327
4499A1014R699J8310l2385l2297k2310p997K6131J8603O818j5822q414P36o135
4486c4049P796M788j0433P599K1624J5763J6962K849k951N075J4705k9928j1246
4473H554Q925l0192k5310R64p725L0475p191k017L4217J6300k3165o703m89K094
4459a263r501N618R337l277p57k1510K057N568n350K7144k906r206j9392M575
4445a8863k9428j7694J1231P563q968J8207L3071J8323k714j1944k1291J9307
4433c200J4922J0568k222J4301r951k1378r52m91J577M537K2544J7146l6794k0791
4419a0184J6309J1615l692k3610Q949n922j897Q278M461o706j6380j0070m441
$$ y = [-29261, -25438, -8624, -11690, -41186, -30055, -16882, -25332, -26089, -34891, -21783, -14997, -9313, 11014, 20713, 39023, 6638, -25659, -47969, -55966, -29835, -11232, -4414, -20236, -28650, -27914, -34049, -26253, -21465, -31898, -24299, -2675, 13088, 30050, 32899, 29948, 35023, 49728, 19800, 8554, 17479, -12713, -38023, -37059, -44784, -14309, -21500, -23517, 10700, 27000, 3835, -2868, -3357, -1263, -10764, -5146, 4191, 914, 157, -21353, -19296, -13728, -19078, 8066, 5160, -4046, -23438, -18863, -48291, -65985, -54754, -47191, -56159, -37952, -4881, 13442, 10728, -1216, -22507, -3200, 11722, 22290, 20068, 34369, 24418, 3040, 2088, 1597, 3174, 7711, 30255, 47401, 10607, -10184, 6125, 17740, 14048, -9562, -613, -6535, -8432, -154, 4307, -2399, -18779, -28849, -33290]
4406c3290M829K2655Q756k0487j1438o558m734L3478O580q326r197j3637L2542
4393A173j4912l2688J8211J8912Q487J4461j4357N329K0639n429K0470k5630m1330
4380b6664J3215M3925J5123J2273J1063j9146k8713P129k776l5863k2165k057
4368c4656L7940J2797j8906K6260J14k9342j1048M1843q383m7095j0027J7215
4356b3288l461n150j7645K794J4411j4434P62K9750M6489M650J056j3890j0573
4343A1471j3895P750J5966k5337o720P397j9814K2694J6145j6660J1118J974M385
4330A6474n271O32K4254o744l8872j3500m0l532J1054q284k373l257o134j0206
4316d5799k494J1593P870J7382K0772N598L460J661J479j5669q129m888k3091
$$ y = [-33290, -28461, -5806, 2950, -17537, -28975, -35533, -40267, -6789, -209, -8535, -17732, -31369, 1173, -13739, -46427, -28216, -9304, -817, 13644, -713, 4616, 25255, 19826, 40296, 14666, -26664, -13449, 30476, 45599, 57872, 68935, 49789, 21076, 28205, 25429, -10434, -32599, -34656, 3284, 16081, -2825, 23435, 23549, -5793, -16841, 25002, 16619, -30476, -40503, -23288, -26749, -31899, -49544, -46750, -32339, -46773, -46011, -16261, 30228, 34878, 35934, 22044, 11471, -2424, 5326, 21292, -4045, -10765, -3368, -23182, -488, 15657, -1003, 10115, 12089, 16474, 11203, 11835, 36089, 29345, -9527, -23027, -23067, -26599, -15545, -23829, -26202, -29459, -35593, -45799, -48293, -36700, -28830, -11448, 9324, 14922, 18382, 20043, 21522, 5853, -2276, -7164, -30255]
4303c0255n600J1615o396j4187J3632K3475Q475N052N062M808l5806j187M827
4290a6485j5689J9658L4625K351q331j1801l4612P77J0019P651r182j9552p01
4277d1272M7232K2200J743N357r722J435o293N499j4154l7816j5558J4883K2217
4264d249j4438o449K3385J6258k3064Q108n866k3616K410q853M559J4033P986
4251i796M447K5026P898J7509j1526j6623l665L91j5836k0372p825M013K2967
4238c392j2415q734J9828Q18j40m449J6441L743J2603J7987K13k1432k2884J799
4224a4J7415l2472k7755K2738O627K5336Q162j2746l009j0586J294J551k945r033
4210a5437J5688J5760J2708J7458J342k5913j4113J2096l011r766K146q623p965
$$ y = [-30255, -35855, -24240, -30636, -44823, -31191, -7716, 759, 5811, 10873, 15681, -20125, -21312, -16485, -32174, -12516, 22109, 24460, 16129, 4328, -30284, -29507, -19488, -11837, -21019, -40571, -41272, 5960, 28160, 29903, 35260, 25538, 26973, 20680, 26179, 12025, -25791, -41349, -26466, -4249, -18687, -25136, -1751, 14507, -8557, -449, -6315, -29931, -27521, -36374, -31815, -17782, -9796, -5349, 19677, 27575, 45084, 33558, 16935, 13270, 13661, -2175, -22547, -30372, -26359, -3392, -15807, -24541, -4713, -3895, -4035, -8484, 7957, 11700, 24303, 42290, 42503, 21071, -1813, -14, 17401, -15071, -42826, -20088, -13461, 11875, 20037, 7291, 4282, -6304, -5010, -3459, -6404, -15437, 251, 16011, 28719, 46177, 47519, 21606, 7493, 19589, 16578, 6812, 8958, 335, -7630]
4197g630r449j774J3867K4876K7277l546j4719O321P757M550j9656m0096k3540
4184c5762J6400J5575J6159p033j2551J2470J8607o390Q681J057j6463j4637P878
4171C991m443j5685L110J3193J3173J4411J3386o73l7029j649J7408j2612l54
4158F227J3999M441k7385O081J0250J2988j0755J637R08Q59j0332q335J4227n254
4144I556K1362j5378m0212j6021j3845K1977M5421L448m699J5947l097J929j1704
4131A4684k761j2742k0518m174J5842J9093n179m329L712J7258k0761j5036k145
4118a7056r865j5584L2682K0098n143J600R385M521l2726m6422J991L584N487
4105d7448K8574R39j1283J313J2354j895L338J0763j2128L297q782O653l695r688
$$ y = [-7630, -17079, -18853, -4986, 19890, 47167, 43621, 28902, 35223, 42980, 47530, 27874, -12222, -35762, -19362, -3787, 12372, 5339, -7212, 5258, 23865, 17475, 26156, 27213, 10750, -3887, 3991, -452, -16137, -13027, 166, 13339, 27750, 41136, 40463, 3434, 1785, 19193, 6581, 6227, 20226, 24667, -2718, 3363, 13613, 26601, 15846, 17483, 18391, 19250, 8918, 583, 14810, 9556, 30918, 15540, -24672, -40693, -54538, -32561, 12860, 16308, 11609, 27556, 24459, 26388, 14684, 11923, -819, -21337, -25511, -9669, 9424, 4245, -84, 3628, 20886, 125, -14911, -17056, -26921, -42505, -9823, 10275, 5132, 6732, 16117, 20638, -12088, -58510, -56519, -52935, -47448, -18874, -17935, -29218, -27905, -15551, -17446, -14108, -3345, -15473, -12176, -20958, -14305, -18000, -27688]
4091b7688J0660K325O935J1023J7444l0317l8810L783L0362L6083J3171Q44j0940
4078B4875j0207j7215j2548K165M389k3856l1810j1585n9K3738L8711L6235j605
4065B1228m956N259l687j3659O545m536j8331J1505j1824J4264j3384n128J8196
4052A492J9796j0174l2057J1373K7194n765q819r114J3225K6972j4840k6231o048
4039a2996j2604j9207O24L030K3294K4108J5985p093J6922k1561k6232R885Q818
4026B973J2393N002o517j6284j8843K105M6436L4033j717k1750l0761q557Q632
4013G145M964J817j0057J4267J4395L397o638j1033j9879j2073J4246K7245n707
4000B2089J204J0913j4306j0832l2600k697P173J2958m925j4241o694J0325m650
$$ y = [-27688, -17028, -14703, -7768, 3255, 20699, -9618, -48428, -44645, -14283, 21800, 34971, 35815, 24875, 14668, -2547, -15095, -12930, -8541, -32397, -64207, -75792, -75851, -52113, -13402, 22833, 21228, 16272, 21531, 17844, 4185, 10730, 6194, -12137, -632, -12456, 1808, -11576, -16704, 1492, 21288, 11114, -20943, -9570, 17624, 11859, 3040, -6074, 7151, 34123, 19283, -6948, -12996, -25600, -44807, -44183, -41153, -17859, 6249, 22234, 15141, 32063, 10502, -15730, -5845, 2973, 15366, 20368, 13851, -2433, -21276, -19171, 27265, 61298, 59581, 37831, 7070, -1487, 7145, 12109, 13926, 3869, 18136, 32531, 35928, 29290, 18257, -1622, -13695, 551, 27796, 22089, 23293, 34206, 19900, 9068, -23532, -26229, -19056, -6098, -11023, -25264, -31958, -21633, -26283]
3987b6283j3825K6083L1514j085j1049O368M368r743l2659q764M8285P950k8745
3974g585j769m2955k1943l346J0895K1835j1637J0176n04K1513O28L346J290k824
3960b2880K4560j575k9244J7715K9972P85q245l2706m358r938k6294J0635J390
3947e0183K8527J2284J4905j3456K4066R834k8677o598K1851K2273r89R696o160
3934C7373O617J665j9645l5761q79J0158L0699J2751j7141l4093j6441n407K62
3921b9842k0609K1454K1318L0782K4538j3737j1775P987j9180l9269o427N777
3909b8983J5925J6365m813j1613k6573J9966K8658K139J3798j8430j0875j0280
3897a4716o013K4896J7233R061k0635j0059J4561K5699N994Q731j984j9964n2759
$$ y = [-26283, -40108, -14025, 17489, 16404, 5355, 11723, 16091, 6348, -26311, -35075, 13210, 21160, -7585, -9354, -52309, -74252, -77598, -66703, -44868, -56505, -46329, -46833, -25320, -24692, -21346, -20056, -22880, 1680, 105, -29139, -11424, 18548, 19333, 11088, -21618, -25976, -35914, -62208, -51573, -50183, -21656, -9372, 5533, -7923, 16143, 25977, -2700, -9298, 12553, 34826, 33837, 43533, 37373, 43990, 45655, 26010, -9751, -10630, -472, 30227, 42978, 25837, -8256, -24697, -30104, -29842, -50451, -28997, -7679, 23103, 47641, 33904, 22129, 30116, 10936, -28333, -34760, -28983, -13058, 3307, -1506, -13119, -39692, -19726, 8932, 11071, 24869, 6439, -4436, -14716, -20729, 4167, 21400, 30461, 9826, -233, 14328, 40027, 46021, 54752, 52768, 32804, -19955]
3884a9955J678J4318J0720J3540r471K1627N985j6020j5034J1796N068k1925j1101
3871h774J3176j2338P539k667j094J5847J2408L527k4851k554J3379j964l351
3858H283J5239J82K6594R401j9560l8149m096J2118l734K0242J1563j5999o103
3845A5981J878j8962l7845N741O476j158J6436j3562R400l582l932n711J6970
3832a1870J7217j121k0851K7065J2666k7055o73K1755j9071j5017K4090J5843
3820B2978j887j9048j77k226k251M760k1801j3043J0182R926K2719p359l1635
3807b8862k26P732M005r921j325J7638J8510K3796r46M559n325k5748n980q596
3793a0689r446J1536l670j9773l135j0140K2503M719j3150J7503J1419J2562P814
$$ y = [-19955, -18277, -3959, 6761, 20301, 10830, 32457, 38442, 22422, 7388, 19184, 24252, 2327, -8774, 4402, -7936, -397, -3064, -4158, 11689, 24097, 27624, 2773, 219, 13598, 11634, 8283, 23522, 23704, 50298, 59699, 40139, 1990, -2106, 10012, 6278, 26520, 38083, 22084, 15981, 17859, -1103, -38948, -33207, -26731, -27889, -11453, -25015, -15615, -19197, -23129, -28840, -11870, 5347, 4226, -16625, 10440, 23106, -3949, -4622, 17133, -1938, -16955, 7135, 22978, 21091, 2043, 1866, -360, -2611, 2149, -19652, -32695, -22513, -12587, 10132, 2773, -28862, -29088, -21356, -17351, -27272, -28597, -10959, 7551, 31347, 30401, 34960, 29635, 3887, -2093, -10689, -20135, -8599, -12269, -32042, -35177, -45317, -22814, -18095, -31245, -13742, -2323, 10239, 18053]
3780A8053J816k0780j0446R416L0183L808R936j2306j1461j1919J7454j2559j9166
3767g971j7501m211j6882J2442R931J1240L6563k0622k3224L700o515K927p57
3754b0880R591J4356K6611n396k2892m1705J0412M505R959J9305J3229n11k0814
3741d230j7210l1486J6880L4180O319J0353q698l0961J1158J0017l482j1918K1409
3728B331L3402J0715k7175K515p68o625J7082Q879L697l8j8212r843k5502j4334
3714b3876N928P205k448j9472j356L6378J9251O890K9931O058l8308k7686j3778
3701a5283l552J5657J6370L771p145j8219M541O048j118j223J5006N175R652j9537
3687A0143j8915P668j2911j4043k2203K579n759K3007M1109O134J0702J7785l818
$$ y = [18053, 19869, -911, -11357, -1941, 28242, 32050, 41986, 29680, 18219, 6300, 23754, 11195, -7971, -25472, -29683, -46565, -34123, -24192, -12952, 23611, 2989, -20235, -16535, -23050, -20123, -20880, -11289, 3067, 29678, 24282, 1390, -40315, -29903, -25398, -15439, 3866, 17095, 16584, -4230, -21440, -52926, -36046, -1866, 4453, 14806, 6108, -24853, -13695, -3678, -7160, -19078, 2331, 35733, 46448, 19273, 21788, 21020, 14395, 31477, 40356, 44053, 44015, 25803, 15960, -9542, -23876, -17948, -10743, -13191, -32663, -34019, 2359, 21610, 28500, 58431, 64489, 26181, -1505, -15283, -18835, -3178, 13192, 16963, 9818, -8401, -3860, 2188, 1070, -153, 14853, 20028, 29680, 10143, -8772, -1104, -14015, -28058, -50261, -47682, -53441, -30434, 10675, 16809, 27511, 45296, 41478]
3674D1478k1701k5200l2852k7674L4449J2916R40J2229o930L539k0023O817K9171
3661G159k0048q24J7007k268j4056n447k28K5326r208K1400J0023J7686m970j6373
3647B5179J1463m279l8098k4997l388K2280L1080j9898j7468J1037j04k556J1968
3634B219N167o180L19k1182Q852J5487m966j0861m698O004R335j3758K1135J0505
3620A7378L804j7750N950R851K4146K810m092M407J1906J7257k6019k0042j575
3607B8031j0058p369j6273j7020o236J9488j665j3229p1K7512K0627l2391l5251
3594d3905K110M1441J0288k0132j6038R51P421p727J170K0878J1901L6536Q698
3581E3592J671k9704k3978k795j1373j1138M662L2428P292r666j2832j3612J0684
$$ y = [41478, 19777, -5423, -38275, -65949, -31500, -18584, -17644, -5415, -12345, -8806, -28829, -22012, 7159, -12889, -13713, 3294, 1026, -13030, -18477, -18705, 6621, -2587, 18813, 28836, 46522, 41552, 25179, 36642, 32363, -5735, -30732, -34120, -11840, 19240, -658, -18126, -7089, -7193, -9749, 2219, 7386, 1206, 1525, -19657, -10805, 4682, -284, -11145, -15843, -9839, -504, -14262, 6873, 17378, 21182, 3432, 9382, 19233, 43379, 46189, 42097, 46504, 58410, 75667, 49648, 29606, 28031, 17973, 10604, -5669, -22689, -28925, -9437, -11102, -24331, -24402, 3110, 23737, -8654, -43905, -41795, -354, 9934, -10198, -26236, -25285, -17864, -25591, -24421, -3543, 8358, 44894, 53592, 55263, 25559, 1581, -1214, -12587, -23725, -19063, 13365, 20657, 10991, -1841, -15453, -4769]
3568d769j376O885j0864K4684L283k0964k9062J3815J3960J6730R366L641j3735
3555A1594k9029r600Q546p881n38K3189K4637j1765K5910J7419p525L230j8098
3542C0089q917O887m4k0056l0637r661K835K1514J4107K036k0995n198L928Q151
3528e961k1521l996J1500L0950J6479q304l7545j6797K7438j413k0830k618J0040
3515b2578J635O22j0457M080K5429J3165J3573j2342m471j4486l4689J0899K7131
3502b489N558P709K3837N046j8386k6762l4400L3K769L9332K8235k2017j2497
3489d032J2181n299O513K6153K4031K878j7784k3727r104O371R659k4172j7702
3476a4034r502P948R853J019R70k1845k2353l084O640m034O224L6167K0092j1074
$$ y = [-4769, -6145, 740, -10124, 14560, 17843, -3121, -32183, -18368, -4408, 12322, 21688, 25329, 11594, -17435, -27035, -18489, -26370, -26908, -3719, 20918, 9153, 35063, 52482, 44957, 48187, 30089, 21172, 28059, 28015, 7959, -22678, -32339, -29504, -7990, 6117, 8153, -12842, -18040, -14112, -5961, -27482, -31478, -19978, 10972, 27451, 19147, -18398, -35195, -7757, -9170, -30000, -32618, -22578, -20943, -20321, -30778, -26698, -1269, 11896, 25469, 13127, 8656, -5830, -40519, -29620, -2489, 3069, 10778, 34615, 39661, 21275, -5487, -39887, -39854, -37085, 2247, 30482, 8465, -4032, 8149, 2850, 9363, 35516, 59547, 62425, 44641, 20914, 11810, 18181, 27840, 3668, -14034, -23536, -15588, -5735, -4716, -3746, -25591, -47944, -51028, -44388, -48422, -42198, -6031, 14061, 2987]
3462B987J7900j7456M831j2481j6031n94J9040J8779Q479k3502k7155J1198J1506
3449b499j4504J7538K9286J1723l1616M698Q7j2218k3501j268o526j3893m847
3436d7540L0033L8753K0628j8481j8416q42j9989j4774J072J541L3055L1412K2911
3423E9363k623l4000K7333q538j5169N656k1953j9185k5999k0943p792J9498J911
3410d2441q292K9304M075O233r342L8920J5422M397j3711k1896l2094j7105j628
3397d8158K0298M989K4582J0682L636J2439n602j9044k512j8835J137L7100J1
3384B0723j8201j3196K15j750K841j0304l4047J1044J4603j1848O185P597J0770
3371a5368p148j1833J7727n475O87J8615J2509R287n172k0648j6747j9258r709
$$ y = [2987, 20887, 3431, 8262, -4219, -20250, -20844, -1804, 16975, 25454, 1952, -25203, -14005, -2499, -17003, 535, 29821, 41544, 9928, 14626, 14713, 2495, -21006, -22274, -28800, -42693, -47540, -17507, 21246, 41874, 23393, 4977, 4135, -15854, -30628, -29556, -28015, 5040, 36452, 59363, 56740, 22740, 50073, 41535, 26366, 32022, 10069, -9116, -35115, -56058, -63850, -44352, -42441, -50733, -21429, -17354, -11121, -20463, 18457, 33879, 38276, 24565, 2669, -29425, -46530, -48158, -27860, -22871, 1711, 12393, 16029, 28468, 22866, 3822, 1310, -17525, -16388, 20712, 20723, 2522, -10674, -10459, -12209, -9368, -19672, -53719, -42675, -28072, -39920, -33735, -26138, -15368, -22516, -34349, -16622, -22097, -21410, -2795, 9714, 19001, 13829, -6819, -23566, -42824, -52533]
3358e2533k4096N891J3045j1078K146K3019K5131J9421K89j0323l165j8411k138
3345c2802j5914K3226P061L420J0762J670K15O243K636o040J0449l3320m00J275
3331b1519k7089j9199L1719M0185l870j3915J4430k5786J3254p713j2108O705
3319b4906j9486n048J3426r886K651J3615K7840k2070O677K7297L820j8960l3682
3306c8712K132K2136K2816M0900j224j1645p489k2901j3722P387K4670k1544l3924
3293c1120K1309K3098J4698L755K3076l3062k6562J5568j9266j2075r963K0151
3281a0393L169J5502K5028J2133R64n056P705k967k9242j4967k876q143l2456
3268d1599n480M5379Q721R303j4488l6668J2351Q287Q063J2874P04L669O033l008
$$ y = [-52533, -76629, -70738, -57693, -68771, -66625, -43606, -18475, 946, 1235, -9088, -12253, -30664, -32802, -48716, -25490, -18429, -15009, -4247, -2577, -2362, 3881, 6517, 477, 10926, -22394, -22794, -21519, -48608, -67807, -36088, 4097, 227, -13688, 742, -25044, -11790, -19503, -31611, -24906, -44392, -49440, -36014, -45900, -43249, -29634, -1794, -23864, -17187, 10110, 13930, -5030, -38712, -36580, -14444, 8372, 49272, 48048, 36403, 28914, 6013, -7709, -322, 24348, 2804, -31120, -9811, 13287, 27985, 31740, 54816, 21754, -4808, 10760, -8506, -20581, -30544, -10393, -7224, 8278, 33306, 45439, 46403, 41347, 49052, 46085, 16843, 1876, -1000, -9143, -41599, -47079, -1700, 7021, 16324, 1836, -34832, -22481, -14194, -6131, 6743, 7447, 11116, 17149, 14141]
3254A4141Q01K4903j0205q93j6333k4318o162m160J0688L9734J6462k8391n941
3241A0326j1642R051l941l044N700k602j6195k2780K2165K0704r464j658l8943
3228d2323k929J6448K6444O866n630k8938J4448J5527K0468j725m540L1264k3789
3215B1591k0116M736n64j7010o20N511R455K1260j880j6134j7474J8402p846r218
3201i907p969K0359K1158j3197J4568J2876j4379l279J5989j7938n086J4705k6999
3188I01q776Q670m928p172O558J2870j7877Q051K4862J5087R530o155P650J3849
3174F3120k7399l688j3276n7848o049J6873L3600K7282r388p923j3294j0664j1643
3161b0297k5961o189J4151P122L4628o089j8055K0357K613O963M738n657K2026
$$ y = [14141, 14942, 39845, 29640, 28747, 12414, -11904, -18066, -22226, -11538, 28196, 44658, 16267, 10326, -1316, 7735, 3794, 750, 6450, 3848, -12347, -35127, -12962, 7742, -1722, -3380, -42323, -45252, -28804, -2360, 4506, -1124, -30062, -15614, -87, 20381, 18656, 14116, 45380, 21591, 1475, 6211, 5647, -11363, -11983, -6472, 2983, 24243, 22363, 6229, -11245, 7157, -689, -9907, -17876, 2483, 23641, 10444, 25012, 37888, 23509, 20230, 36219, 18281, 13195, 27900, 901, -7875, 795, -4133, -11305, -4747, 8123, -9754, -1703, 23159, 38246, 47776, 41621, 49271, 63120, 35721, 32033, 18757, -39091, -45140, -28267, 5333, 32615, 23227, 15304, 2010, -8654, -20297, -46258, -52447, -38296, -31174, 3454, -2635, -20690, -333, 2280, 9243, 13981, 8324, 30350]
3148C0350J8864J7065j1690l0866j2155L23k9086j7944R145M484J7222K2137J1774
3135B9623j0026j7160o970M291J6885j1198n867k6659K436J2742L1442l094m331
3122A2114J9597k6707q359Q28j7521p98j8035J4493K2494K0182K8743p254j1430
3109B8347l0667J2906m510j9825J5440J7168J0738r764m414m891j3303K2760q750
$$ y = [30350, 49214, 66279, 54589, 23723, 11568, 11891, -17195, -35139, -25994, -21510, -4288, 17849, 29623, 19597, 2437, -4533, -242, 16643, 5445, -422, -27081, -24645, -11903, 19539, 16445, 12114, 31711, 5004, -3355, -2527, -20048, -20846, -38881, -24388, -1894, 18288, 47031, 39777, 28347, -2320, 10586, 6076, -13749, 1691, 18859, 29597, 19833, 15419, 10528, -2775, 19985, 11235]
$$ [...]
##END NTUPLES=NMR SPECTRUM
##END=
