##TITLE=Analysis number 325389
Compound Code cc 36501
Book Reference 518/27
Project Code adrs
Chemist Name colinb
##JCAMPDX= 6.0         $$ Bruker NMR JCAMP-DX V2.0
##DATA TYPE= NMR SPECTRUM
##DATA CLASS= NTUPLES
##ORIGIN= Bruker BioSpin GmbH
##OWNER= nmr
$$ XWIN-NMR		Version 3.5
$$ Tue Jan  2 10:46:31 2007 GMT Standard Time (UT+0h)  MAYBRIDGE\nmr@NMR_250MHZ
##.OBSERVE FREQUENCY= 250.131544655141
##.OBSERVE NUCLEUS= ^1H
##.ACQUISITION MODE= SIMULTANEOUS (DQD)
##.ACQUISITION SCHEME= undefined
##.AVERAGES= 16
##.DIGITISER RES= 18
##SPECTROMETER/DATA SYSTEM= dpx250
##.PULSE SEQUENCE= zg30
##.SOLVENT NAME= DMSO
##.SHIFT REFERENCE= (INTERNAL, DMSO, 0, 16.522)
##AUDIT TRAIL= $$ (NUMBER, WHEN, WHO, WHERE, WHAT)
$$ ##TITLE= Audit trail, XWIN-NMR		Version 3.5
$$ ##JCAMPDX= 5.01
$$ ##ORIGIN= Bruker BioSpin GmbH
$$ ##OWNER= nmr
$$ C:\u/data/dgb/nmr/ADRS/50/pdata/1/auditp.txt
$$ ##AUDIT TRAIL=  $$ (NUMBER, WHEN, WHO, WHERE, WHAT)
(   1,<2007-01-02 10:46:03.36 +000>,<MAYBRIDGE\nmr>,<NMR_250MHZ>,
      <created by zg, POWCHK disabled, PULCHK disabled
       configuration hash MD5:
       49 4B E0 1D 92 C2 6B 37 9F E6 65 BC 52 41 86 1D
       data hash MD5: 64K
       64 60 56 44 45 83 88 7D D5 D3 86 E5 97 59 79 8E>)
(   2,<2007-01-02 10:46:21.67 +000>,<MAYBRIDGE\nmr>,<NMR_250MHZ>,
      <Start of raw data processing
       ef LB = 0.3 FT_mod = 6 PKNL = 1 SI = 32K 
       data hash MD5: 32K
       CA 1D 65 24 9A 4F AC D2 40 F9 04 1F F0 7E 1B 43>)
(   3,<2007-01-02 10:46:23.47 +000>,<MAYBRIDGE\nmr>,<NMR_250MHZ>,
      <apk 
       data hash MD5: 32K
       B1 E8 5F 48 C5 39 65 26 06 20 80 52 6C E6 7F A8>)
(   4,<2007-01-02 10:46:24.33 +000>,<MAYBRIDGE\nmr>,<NMR_250MHZ>,
      <abs ABSG = 5 
       data hash MD5: 32K
       33 BD C5 1C 97 A3 C1 6A B7 FF EF 45 C8 55 41 9E>)
$$ ##END=
$$ 
$$ hash MD5
$$ FE 0D E3 76 83 C3 38 1A 2E ED 24 FE FD D7 73 E1
##$RELAX= 
##$RELAX= 
##$RELAX= 
##$RELAX= 
##$RELAX= 
##$RELAX= 
##$RELAX= 
$$ Bruker specific parameters
$$ --------------------------
##$DU= <C:\u>
##$EXPNO= 50
##$NAME= <ADRS>
##$PROCNO= 1
##$TYPE= <nmr>
##$USER= <dgb>
##$AMP= (0..31)
100 100 100 100 100 100 100 100 100 100 100 100 100 100 100 100 100 100 
100 100 100 100 100 100 100 100 100 100 100 100 100 100 
##$AQSEQ= 0
##$AQ_mod= 3
##$AUNM= <au_zg>
##$AUTOPOS= <9 >
##$BF1= 250.13
##$BF2= 250.13
##$BF3= 250.13
##$BF4= 250.13
##$BF5= 500.13
##$BF6= 500.13
##$BF7= 500.13
##$BF8= 500.13
##$BYTORDA= 1
##$CFDGTYP= 0
##$CFRGTYP= 5
##$CHEMSTR= <none>
##$CNST= (0..31)
1 1 145 1 1 1 1 1 1 1 1 1 1 1 1 1 1 1 1 1 1 1 1 1 1 1 1 1 1 1 1 1 
##$CPDPRG= <>
##$CPDPRG1= <>
##$CPDPRG2= <>
##$CPDPRG3= <>
##$CPDPRG4= <mlev>
##$CPDPRG5= <mlev>
##$CPDPRG6= <mlev>
##$CPDPRG7= <mlev>
##$CPDPRG8= <mlev>
##$CPDPRGB= <>
##$CPDPRGT= <>
##$D= (0..31)
0 1 0 0 0 0 0 0 0 0.06 0 0 0 0 0 0 0.0002 0 0 0 0 0 0 0 0 0 0 0 0 0 0 
0 
##$DATE= 1167734762
##$DBL= (0..7)
120 120 120 120 120 120 120 120 
##$DBP= (0..7)
150 150 150 150 150 150 150 150 
##$DBP07= 0
##$DBPNAM0= <>
##$DBPNAM1= <>
$$ [...]
##$SUBNAM6= <"">
##$SUBNAM7= <"">
##$SUBNAM8= <"">
##$SUBNAM9= <"">
##$SW= 20.6930455092707
##$SWIBOX= (0..15)
0 0 3 0 0 0 0 0 0 0 0 0 0 0 0 0 
##$SW_h= 5175.983436853
##$TD= 65536
##$TD0= 1
##$TE= 294.16
##$TE2= 300
##$TE3= 300
##$TEG= 300
##$TL= (0..7)
0 120 120 120 120 120 120 120 
##$TP= (0..7)
150 150 150 150 150 150 150 150 
##$TP07= 0
##$TPNAME0= <>
##$TPNAME1= <>
##$TPNAME2= <>
##$TPNAME3= <>
##$TPNAME4= <>
##$TPNAME5= <>
##$TPNAME6= <>
##$TPNAME7= <>
##$TPOAL= (0..7)
0.5 0.5 0.5 0.5 0.5 0.5 0.5 0.5 
##$TPOFFS= (0..7)
0 0 0 0 0 0 0 0 
##$TUNHIN= 0
##$TUNHOUT= 0
##$TUNXOUT= 0
##$USERA1= <user>
##$USERA2= <user>
##$USERA3= <user>
##$USERA4= <user>
##$USERA5= <user>
##$V9= 5
##$VALIST= <valist>
##$VCLIST= <CCCCCCCCCCCCCCC>
##$VD= 0
##$VDLIST= <DDDDDDDDDDDDDDD>
##$VPLIST= <PPPPPPPPPPPPPPP>
##$VTLIST= <TTTTTTTTTTTTTTT>
##$WBST= 1024
##$WBSW= 4
##$XGAIN= (0..3)
0 0 0 0 
##$XL= 0
##$YL= 0
##$YMAX_a= 285561
##$YMIN_a= -273377
##$ZGOPTNS= <>
##$ZL1= 120
##$ZL2= 120
##$ZL3= 120
##$ZL4= 120
##$ABSF1= 16.522
##$ABSF2= -4.171173
##$ABSG= 5
##$ABSL= 3
##$ALPHA= 0
##$AQORDER= 0
##$ASSFAC= 0
##$ASSFACI= 0
##$ASSFACX= 0
##$ASSWID= 0
##$AUNMP= <proc_1d>
##$AZFE= 0.1
##$AZFW= 0.1
##$BCFW= 0
##$BC_mod= 0
##$BYTORDP= 0
##$COROFFS= 0
##$CY= 12.5
##$DATMOD= 1
##$DC= 0
##$DFILT= <>
##$DTYPP= 0
##$F1P= 14.0000005364418
##$F2P= -0.99999901652339
##$FCOR= 0.5
##$FTSIZE= 32768
##$FT_mod= 6
##$GAMMA= 0
##$GB= 0
##$INTBC= 1
##$INTSCL= 1
##$ISEN= 128
##$LB= 0.3
##$LEV0= 0
##$LPBIN= 0
##$MAXI= 10000
##$MC2= 0
##$MEAN= 0
##$ME_mod= 0
##$MI= 0
##$NCOEF= 0
##$NC_proc= -5
##$NLEV= 6
##$NOISF1= 0
##$NOISF2= 0
##$NSP= 0
##$NTH_PI= 0
##$NZP= 0
##$OFFSET= 16.522
##$PC= 1
##$PHC0= 219.3165
##$PHC1= 8.58401
##$PH_mod= 1
##$PKNL= yes
##$PPARMOD= 0
##$PSCAL= 4
##$PSIGN= 0
##$REVERSE= no
##$SF= 250.13
##$SI= 32768
##$SIGF1= 0
##$SIGF2= 0
##$SINO= 400
##$SIOLD= 32768
##$SREGLST= <1H.DMSO>
##$SSB= 0
##$STSI= 32768
##$STSR= 0
##$SW_p= 5175.98343685301
##$SYMM= 0
##$S_DEV= 0
##$TDeff= 65536
##$TDoff= 0
##$TI= <Analysis number 999999
Compound Code 99
Book Reference 9
Project Code 9>
##$TILT= no
##$TM1= 0
##$TM2= 0
##$TOPLEV= 0
##$USERP1= <user>
##$USERP2= <user>
##$USERP3= <user>
##$USERP4= <user>
##$USERP5= <user>
##$WDW= 1
##$XDIM= 32768
##$YMAX_p= 308564606
##$YMIN_p= -658541
$$ End of Bruker specific parameters
$$ ---------------------------------
##NTUPLES= NMR SPECTRUM
##VAR_NAME=  FREQUENCY,     SPECTRUM/REAL,   SPECTRUM/IMAG
##SYMBOL=    X,             R,               I
##VAR_TYPE=  INDEPENDENT,   DEPENDENT,       DEPENDENT
##VAR_FORM=  AFFN,          ASDF,            ASDF
##VAR_DIM=   32768,         32768,           32768
##UNITS=     HZ,            ARBITRARY UNITS, ARBITRARY UNITS
##FACTOR=    0.157963299565203, 1,           1
##FIRST=     4132.6476996994, 0,             0
##LAST=      -1043.33573715361, 0,           0
##MIN=       -1043.33573715361, -658541,     0
##MAX=       4132.6476996994, 308564606,     0
$$ Real data points
##PAGE= N=1
##DATA TABLE= (X++(R..R)), XYDATA
$$ [...]
15833a20786k6223o4897j2396J81612Q5075O2042J14727k00467k92294O6072N5887
15822a51648j38643M4264J51507J15408j3333k71251o4307P5180K9948j1348P2517
15811a61706j4453J10856m8151k7683N4173O4470O5726J12530J11760m1937j67
15800B25418K3872j62334K0037N7103j1379j96945o1884n0651J47474M5806k38107
15789b01590j41770j14458J69991K66629k2200j3204N1534m6357M9835J39936
15779A38346p7656j53795j53671M2404J21367o1575J01030O687k2095q3112P8548
15768f3522n4968r4372J10766J19071J0109m519j90700j17946K9152M6838R0849
15757a19242R0139N8627j70118r106J34346K9362j81507o8402Q5021o0037J46418
$$ plain form
15833 -120786 -147009 -211906 -224302 -42690 42385 104427 219154 18687 -273607 -207535 -151648
15822 -151648 -290291 -246027 -94520 20888 7555 -263696 -328003 -252823 -222875 -234223 -161706
15811 -161706 -176159 -65303 -113454 -141137 -86964 -22494 43232 155762 267522 225585 225418
15800 225418 249290 86956 106993 164096 152717 -44228 -106112 -156763 -9289 36517 -201590
15789 -201590 -343360 -457818 -287827 -21198 -43398 -56602 -5068 -51425 -1590 138346
15779 138346 60690 -93105 -246776 -204372 -83005 -144580 -43550 -36863 -58958 -142070 -63522
15768 -63522 -118490 -212862 -102096 16975 27084 22565 -168135 -286081 -256929 -210091 -119242
15757 -119242 -29103 29524 -140594 -149700 -15354 14008 -167499 -235901 -150880 -210917 -64499
15746f4499J20779J13j08063r8083R295j2148j04541o6979J06846P8372J07042
15735c1866j96350j27944R3233J95344J05277P4010J21130m0122q2084K6795J9288
15724A56711k30l5940j98444p0997K344j938k4257Q084J7587j8224K06209J15793
15712A56698P1362K2324j55418j41219p0293L2798J1702L5873R7199k26276N8357
15701a06893J98510P838O8930m3388n8900p0831K1307j0624K7608P5196n1187
15690E7566k41J28571L2747p341n1059p1065j31908r9889j71939O6861J76506
15679g1191N0065J78208M5299M7750j51422q6864J44511O2354j76947l01083j41078
15668d00398j14725O4526J68119K04495J19489j6068k6583L8068j31428j21047
$$ plain form
15746 -64499 56280 56393 -51670 -149753 -140458 -152606 -257147 -324126 -217280 -138908 -31866
15735 -31866 -228216 -356160 -262927 -67583 37694 111704 232834 192712 110628 137423 156711
15724 156711 156481 120541 -77903 -148900 -146556 -148494 -172751 -164667 -147080 -165304 40905 156698
15712 156698 228060 250384 94966 -46253 -116546 -83748 -72046 -36173 61026 -165250 -106893
15701 -106893 91617 99455 168385 124997 66097 -4734 16573 5949 33557 108753 57566
15690 57566 57325 185896 218643 211302 160243 89178 -42730 -142619 -314558 -247697 -71191
15679 -71191 -21126 157082 202381 250131 98709 11845 156356 218710 41763 -259320 -400398
15668 -400398 -515123 -450597 -282478 -77983 41506 25438 -1145 36923 -94505 -215552
15658b15552p9383q8658J59635n7272J59926J07829M0080o3591M7538L721p6518
15647f2245q9061l7362O249r2966j10779J63037J76713J22530J77937J35730R2555
15636D82338k1947l12052q9961j71163j49322j21083P2395J47541J11998r8643
15626a49899j4623J41343K025k104K7058p4194o3758l3114j08041j36557Q6011
15615c25853J87119O7975J14322j33251k00450p8728K64426Q3117J22362Q5118
15605A86157j0543l197j960q0473j68590l3805K19212m7388k18148p5933o2980
15594b97648m802R6946J66409J46340M8398j9060n834R702q024j22692j58448
15583a48713P2109K3604r9241P9510J15215j13626j33048N9554K5039l395R1572
$$ plain form
15658 -215552 -294935 -383593 -223958 -281230 -121304 -13475 26605 -36986 10552 14273 -62245
15647 -62245 -151306 -188668 -182419 -275385 -386164 -223127 -46414 76116 254053 389783 482338
15636 482338 460391 148339 58378 -112785 -262107 -383190 -310795 -163254 -51256 -149899
15626 -149899 -164522 -23179 -21154 -23258 3800 -70394 -134152 -167266 -275307 -411864 -325853
15615 -325853 -138734 -70759 43563 -89688 -290138 -368866 -104440 -21323 101039 186157
15605 186157 175614 172417 170457 89984 -78606 -112411 106801 59413 -158735 -234668 -297648
15594 -297648 -302450 -205504 -39095 107245 155643 136583 130749 140451 132427 9735 -148713
15583 -148713 -76604 -53000 -152241 -72731 42484 -71142 -204190 -144636 -119597 -122992 -31420
15572c1420J5817k8364o034P0774J03677P0438l8548j44852l1477p2822q4614
15561a77425m7997J63020J24286N3902j5o2460j45928L5998N7455L9669J21350
15550A61855O7759o085J05201j72348j59375j29183J11790J96205L0749j3283
15540A93285m43o9373l1120J05846Q3709j64179n741J69713Q7202r3212j81008
15529I4679r2522q9657J51132o8893N0286R4724o3021j35840M3205R0173l8794
15518C5472q0421J15410m8189j54267M3635K39201K8006J3744Q227j06391j41229
15507d6802j27626o3010R5679J57604J48534L9797j55294r7295p7316k0914k8094
15496a74737k347Q7691q8875j12288J5091J88546J54854q2233m2189j25712r411
$$ plain form
15572 -31420 -15603 -43967 -50001 20773 124450 194888 156340 11488 -19989 -92811 -177425
15561 -177425 -225422 -62402 61884 115786 115771 53311 -92617 -56619 836 40505 161855
15550 161855 229614 223529 328730 156382 -2993 -132176 -20386 175819 206568 193285
15540 193285 192842 123469 92349 198195 281904 117725 111984 281697 368899 275687 94679
15529 94679 2157 -87500 63632 -5261 45025 139749 76728 -59112 -15907 74266 35472
15518 35472 -44949 70461 22272 -131995 -88360 150841 178847 192591 200818 94427 -46802
15507 -46802 -174428 -237438 -141759 15845 164379 204176 48882 -48413 -125729 -146643 -174737
15496 -174737 -177084 -89393 -178268 -290556 -275465 -86919 67935 -14298 -56487 -182199 -191610
15485a91610N2417J52116l9412j89142Q6090Q6035L054J7766j43934n5012J26307
15474i5325J61709Q5732l6048k01649j2267R9001k0875k3374r4451j5196J88216
15463C5473M1992o1879J8768j54243j64460J85217J56802J85089N8852k564l8089
15452B60958j82382k09640K7848J85343J8736k5095o1708P2166j24506l2766n2641
15441a23687o292K1225J16817N7518n0573O380O5073o3659r5707N3497o8892J4574
15429g3726P6650L6784l018r3154j03048N3170Q1017K980Q7112Q4785O4194o1244
15417A52502o4358j9716K7358o6090k24016K09171L35240R0476l9198k79875k075
15406A19419j11267K0898R4075J5677j7935j52288l9199K8063O8772J3294l03564
$$ plain form
15485 -191610 -139193 12923 -26489 -215631 -129541 -43506 -40452 -22686 -166620 -221632 -95325
15474 -95325 66384 152116 116068 -85581 -97848 1153 -19722 -43096 -137547 -152743 35473
15463 35473 77465 15586 34354 -119889 -284349 -99132 57670 242759 301611 299047 260958
15452 260958 78576 -131064 -103216 82127 100863 75768 14060 86226 -38280 -71046 -123687
15441 -123687 -129979 -108754 8063 65581 15008 21388 86461 22802 -72905 -19408 -88300 -73726
15429 -73726 2924 39708 36690 -56464 -159512 -106342 -25325 -22345 64767 149552 213746 152502
15417 152502 88144 68428 95786 29696 -194320 14851 350091 440567 401369 121494 119419
15406 119419 8152 29050 123125 138802 120867 -31421 -70620 -42557 26215 39509 -264055
15395b64055n4332L5886J79392L3774J42894L1702j45916r5386N5065j9924o0178
15384a61078M0831J63503R345l1130k09167j36874O4761O2011J04529J11674J24951
15373A43356q7478r3422n6407N6079n708R0837P4228j8868Q717k4141j87558k6370
15361a26735j06195P4437O9175j53862j41157J43823j25093k3005R7811P5550
15351b15251P4733j2979j85879M7647J25641p4775q0349J45750J08632J29750
15341F2920Q3594k3146k0978j15783k0703l8426N5005O8587L5561M9859L7746
15330A74236j09958p973j33198K5629J42771j29791J12463l0174q015k0180K4096
15319C9906K10154j78167o1220l9382Q6818J23875M832p4670j25714j75806m6407
$$ plain form
15395 -264055 -318387 -282501 -103109 -69335 73559 105261 -40655 -136041 -80976 -100900 -161078
15384 -161078 -120247 43256 52601 21471 -187696 -324570 -259809 -197798 -93269 18405 143356
15373 143356 55878 -37544 -93951 -37872 -43580 47257 121485 102617 111334 87193 -100365 -126735
15361 -126735 -232930 -158493 -89318 -243180 -384337 -240514 -365607 -388612 -290801 -215251
15351 -215251 -140518 -153497 -339376 -291729 -166088 -240863 -321212 -175462 -66830 62920
15341 62920 146514 123368 102390 -13393 -34096 -72522 -17517 51070 86631 136490 174236
15330 174236 64278 56305 -76893 -51264 91507 -38284 74179 44005 35990 15810 39906
15319 39906 250060 71893 10673 -28709 58109 181984 186816 112146 -13568 -189374 -235781
15308b35781J60895J08042m5686M9450K24012O8064l1451l8014M5582q5935l804
15297B15374j01851j23253j39493j9845M4405Q9876N0223k0879l2516J37188J05572
15286B04801M4527n1977l32194l3826K52125K0847J80686m0757q6216L7875O9327
15275B65218k9051k39030q3547J42496j4885K2212P8000P0495j34260j68039j36108
15264b26499J84376J07460J22839P1086j40466j30203m030L5182k66323R4043
15254a52535P6290o8925j4355J68181m714n2450N9816p0004p5658L0259J5602
15243h8493K7801l6177l1308o4772N7811N3334J02565k21676R9975J09326q5138
15232g6752p9690O9290R0326j58091j70390M2630Q9648J41439J6345q0847P3612
$$ plain form
15308 -235781 -74886 33156 -12530 36920 260932 328996 297545 259531 305113 219178 215374
15297 215374 113523 -9730 -149223 -169068 -124663 -34787 15436 -5443 -37959 99229 204801
15286 204801 249328 197351 -134843 -168669 83456 104303 284989 244232 158016 195891 265218
15275 265218 236167 -2863 -86410 56086 41201 63413 141413 211908 77648 -90391 -226499
15264 -226499 -42123 65337 188176 259262 118796 -11407 -15437 19745 -246578 -152535
15254 -152535 -76245 -145170 -159525 8656 3942 -48508 11308 -58696 -134354 -104095 -88493
15243 -88493 -60692 -96869 -128177 -192949 -135138 -81804 20761 -200915 -100940 8386 -76752
15232 -76752 -156442 -87152 3174 -154917 -325307 -282677 -193029 -51590 -35245 -116092 -42480
15221d2480J27429M5841P0741J07247n231k232p3140j59823n4701J3044J87536
15210B14231J47042j84639k4757N0887L399p6951q2123J85697J71208P575p7154
15199C34415N0910j84738k7614Q0299J24747k7045j43135L7931N1484k11792j19763
15188c4301R4555j31235L908j08459k9928J62280J36121J81290p8187r0184j36373
15177c0513o0279k9990R2691l7969N2432n8468j79393N8025N8564J6679k4134
15166a42355N7512O938k662r3490j15558J15809J58205J21487j583k1235K2693
15155A05761k8845L6722l5532j14498m4804J21231J7886l5957L276J29177j04402
15144E0015j42070J26403J33664K5551l5362j59357j89288J2068Q2087M0150J54235
$$ plain form
15221 -42480 84949 130790 201531 308778 303547 301315 228175 68352 13651 26695 214231
15210 214231 361273 176634 151877 202764 206163 129212 47089 232786 403994 411569 334415
15199 334415 385325 200587 172973 253272 378019 350974 207839 245770 297254 85462 -34301
15188 -34301 60254 -70981 -67073 -175532 -205460 -43180 92941 274231 196044 105860 -30513
15177 -30513 -90792 -120782 -28091 -66060 -13628 -72096 -251489 -193464 -134900 -118221 -142355
15166 -142355 -84843 -77905 -80567 -174057 -289615 -173806 -15601 105886 104303 83068 105761
15155 105761 76916 113638 78106 -36392 -81196 40035 57921 21964 25240 154417 50015
15144 50015 -92055 34348 168012 193563 158201 -1156 -190444 -178376 -96289 -56139 98096
15133I8096j25442j20123P6699N6712j61090M1054P8620J2535N8605J24139K0735
15122A60540n7369n6908n8969q5797m2184J58712J21923J2411m3566J32297n81
15111B40509q3816P9399l8004j32719N6598J1674r6093j84431J21751N6315j37053
15100a05870o5579R6565Q176j83539r0130R8820J37653J64995O2629J16239J20640
15089C60599J34108k52045o9288J09041J78245p7077j30316o9682j07967N9123
15079A34741k15413r4030K7085J39759n2167J10272j12663q1977k4368n4341j2790
15068b35892J50874Q1083j8559M5648M9618j35726l4408J05363p7125o1919r7755
15057b28798J12953J47136J72432j45638j24698J37635O7552j69663j92342J4811
$$ plain form
15133 98096 -27346 -147469 -70770 -14058 -175148 -134094 -55474 -42939 15666 139805 160540
15122 160540 103171 46263 -12706 -98503 -140687 18025 139948 152359 108793 241090 240509
15111 240509 156693 236092 198088 65369 121967 133641 37548 -146883 -25132 31183 -105870
15100 -105870 -171449 -74884 -66708 -250247 -340377 -241557 -103904 61091 123720 239959 360599
15089 360599 494707 242662 173374 282415 460660 383583 253267 183585 75618 134741
15079 134741 -80672 -174702 -147617 -7858 -60025 50247 -62416 -144393 -168761 -223102 -235892
15068 -235892 -85018 -3935 -22494 23154 72772 -62954 -97362 8001 -69124 -131043 -228798
15057 -228798 -115845 31291 203723 58085 -66613 71022 138574 -31089 -223431 -208620
15047b08620q249J55165R3881r6762j14238N3313J60222N6052o8742j14680k36283
15036c28941j04316J5796J73797M6417n7440M9385K2361p7279J1669l1722n7912
15025c38185J49843Q84M1699J41038O9778n1255l4736M7650j88651j87200J65200
15014a83935j4074o3866J51108o5088l6016P8024K23896J13103k4887j32088P1793
15003A17970J4082K6486K8539n0403p2721o7698r1881J49647K09416l3436k66199
14992c6198j0179O1439q8860N5911M6778k06063K8411j7942m4479k7339L9278
14981a99243Q7151K45681J36814k29618L2120K56548K7219n7971j60483k22546
14971h4328j78199K8314K85406m265l4998N3295N2339K9794J2615j76420o8457
$$ plain form
15047 -208620 -216869 -61704 32177 -64585 -178823 -125510 34712 90764 22022 -92658 -328941
15036 -328941 -433257 -417461 -243664 -197247 -254687 -205302 -182941 -260220 -248551 -280273 -338185
15025 -338185 -188342 -187458 -145759 -4721 65057 13802 -20934 26716 -161935 -349135 -183935
15014 -183935 -198009 -261875 -110767 -175855 -211871 -133847 90049 203152 178265 46177 117970
15003 117970 132052 158538 187077 136674 63953 -3745 -95626 54021 263437 230001 -36198
14992 -36198 -46377 15062 -73798 -17887 28891 -177172 -148761 -166703 -211182 -238521 -199243
14981 -199243 -112092 133589 270403 40785 72905 329453 356672 298701 138218 -84328
14971 -84328 -262527 -234213 51193 46928 11930 65225 117564 147358 159973 -16447 -84904
14960h4904k8845L52116K30347j16872k34053q4691R8624j24071j49814L6838
14950a05325J32244P0541l9775j19366L2452k2800J6079k5550P9120J87244o2733
14939A42131m4086n481j20019j87188P1737P7228O1931j9199J3453j5105K3771
14928h27J7398j55351l9915N0242p1173L8500l6720J74597k8312j9544J04190
14917C3085k0920J22530l5332q4126L4443J01039J46825Q7513k2418m4388N9932
14906C78183M4460o9482j80306j51750K5239J4066j12672J61210P4979o3499j78177
14895e7749j384l4597q7328J9870J67858K26755j57821p2915O0094n9076q1736
14884g8029J45102R8365m802K0123K3668m0314m1405l041K4702j34466q2402m4734
$$ plain form
14960 -84904 -113749 238367 468714 351842 117789 33098 131722 7651 -142163 -105325
14950 -105325 26919 97460 57685 -61681 -29229 -52029 -35950 -61500 17620 204864 142131
14939 142131 98045 92564 -27455 -214643 -142906 -65678 -3747 -22946 -9493 -24598 -827
14928 -827 16571 -138780 -178695 -128453 -199626 -161126 -197846 -23249 -51561 -71105 33085
14917 33085 12165 134695 99363 15237 49680 150719 297544 385057 362639 318251 378183
14906 378183 422643 353161 172855 21105 46344 60410 -52262 108948 183927 120428 -57749
14895 -57749 -59133 -93730 -181058 -161188 6670 233425 75604 2689 62783 3707 -78029
14884 -78029 67073 165438 160636 180759 204427 164113 122708 119667 144369 9903 -72499 -117233
14872a17233P6670R3476M0053k458j03700K7787J75551r8268k59977O9399K26002
14861A27302l3566q6860o3024j8467J03577O2288j92999r9795O3939P3216Q9337
14850B4948J11482j3489q8196n9545j14020p2366L4262R7281Q5225j79673l502
14839a77593q4535j26340J58472K23883J3304j76259p3726O5703N7735J81496
14829F2140P2983q6607R7600J06004J1293j06609j68628N6005J75810P032m6701
14818A80322M3024j01214j31242o8882Q9579J20445o8995k927o5346l8906M1180
14807b962J17705k2675J0476N8401o2741L2318k08124q1089J26239j346n1491
14796h5289J03721J75770m4381J1118j07181l6338m3379k9475Q3229j36274M0220
$$ plain form
14872 -117233 -40563 52913 92966 90508 -13192 14595 190146 91878 -168099 -98700 127302
14861 127302 93736 6876 -56148 -74615 28962 91250 -101749 -201544 -137605 -64389 24948
14850 24948 136430 122941 34745 -24800 -138820 -211186 -176924 -79643 5582 -174091 -177593
14839 -177593 -262128 -388468 -229996 -6113 7191 -169068 -242794 -177091 -119356 62140
14829 62140 135123 48516 146116 252120 263413 156804 -11824 44181 219991 227023 180322
14818 180322 223346 122132 -9110 -77992 11587 132032 63037 60110 -5236 -44142 -2962
14807 -2962 114743 92068 102544 160945 98204 130522 -77602 -158691 -32452 -33798 -85289
14796 -85289 18432 194202 149821 160939 53758 17420 -25959 -55434 27795 -108479 -68259
14785f8259J70099q172j52783j10177r1477j38841K93435J09148J270J78760j3090
14774A69913j49237j11487J43842P5033j4102J40661J77638r2732n0065m8063
14764B41401p5251J37763Q3123p5256j17254q6242n7583l3819N6505L3053J5354
14753A21794R2183j03378j80312K5506p1529j5083j1720k01880l8413J50595J37652
14742i4585J29924L6383j08613o5212l4259M3600Q0108L1388j29897j04716L7801
14731a78078J24852J52157K5733j58131m9868J37232K4487j78937K5129J37134
14721F1710n7305j77976k15839O9454K00363P0115J23812K1279J20164N474L7697
14710B58948K0187N4249N4095m0624l170k51113K7856j33698j10329M044p0664
$$ plain form
14785 -68259 101840 93668 -59115 -169292 -260769 -399610 -106175 2973 4243 183003 169913
14774 169913 20676 -90811 53031 128064 113962 254623 432261 339529 289464 241401
14764 241401 166150 303913 387036 311780 194526 108284 50701 16882 73387 106440 121794
14753 121794 213977 110599 -69713 -44207 -115736 -130819 -142539 -344419 -382832 -232237 -94585
14742 -94585 35339 71722 -36891 -102103 -136362 -92762 -12654 18734 -111163 -215879 -178078
14731 -178078 -53226 98931 124664 -33467 -83335 53897 78384 -100553 -75424 61710
14721 61710 4405 -173571 -389410 -319956 -119593 -49478 74334 95613 215777 221251 258948
14710 258948 279135 333384 387479 346855 343685 92572 120428 -13270 -123599 -119555 -190219
14699a90219p1904J47325o6413j84482r0301K06454J16256J74973p6680M4860
14689I869J6380o2373n31m5919l1720j46579n2183P7099o0152J9475P862P6054
14677a92718r4473J41107J5756K8732m4635Q7999J84863O9044n7984p6244R580
14666G1027J10286p6145o3160o5711L1570M3212n5802n2157j50951m5966Q7324
14655a66473L9006L6236j43633m9107L5368J9272j5435n3079O1983Q8370K9914
14644a17578j10970l431R8111J43837J89556J45365l4912l30909j88561Q029O0739
14633a40724K8189o7717n7764Q2357O5230r2901n3181R7992J22526Q8691M5935
14622A18633k45095O823m0602J13102j8604j05364J6110J5681J80091J65203q3099
$$ plain form
14699 -190219 -262123 -114798 -181211 -365693 -455994 -249540 -133284 41689 -34991 9869
14689 9869 26249 -36124 -36655 -82574 -114294 -260873 -313056 -235957 -296109 -276634 -268772 -192718
14677 -192718 -287191 -146084 -130328 -101596 -146231 -58232 126631 195675 137691 61447 71027
14666 71027 181313 105168 42008 -23703 7867 51079 -4723 -56880 -207831 -253797 -166473
14655 -166473 -127467 -91231 -234864 -283971 -248603 -229331 -244766 -297845 -235862 -147492 -117578
14644 -117578 -228548 -231979 -133868 9969 199525 344890 309978 -20931 -209492 -201463 -140724
14633 -140724 -112535 -180252 -238016 -155659 -90429 -183330 -236511 -138519 -15993 72698 118633
14622 118633 -126462 -119639 -160241 -47139 -65743 -171107 -154997 -139316 40775 205978 122879
14611A22879r707j8808j63462r8951N3779J02864Q0665J92314j49421L7303o5020
14600H4435l656o1301j58407J64374J35025K1881p2049O3834J54659j03502r6553
14589A28740k29792j17423J19964R7648J46463L7405p3791o016j08407n0661O8955
14578A3085J2969J49052J10589j526q4304p6135j13255j6633j42455m5281M5668
14567a48226J25463K9208J01157j14794j56758N0633J20973n6478j09439M9988
14557a08273J15121P0196n3303J05215P5914M4151o8706l8115n2457j62888j44393
14546b17538P9728M0986q2015k5341P3047O4518N6676j2989l332L2875J04935
14535A11550K15495P800l07968n7505L4207R4241j16212P5006J4688n559k8838
$$ plain form
14611 122879 113172 94364 -69098 -168049 -114270 -11406 69259 261573 112152 149455 84435
14600 84435 80779 19478 -138929 25445 160470 182351 110302 174136 328795 225293 128740
14589 128740 -101052 -218475 -98511 -863 145600 183005 109214 103198 -5209 -55870 13085
14578 13085 26054 175106 285695 284169 199865 123730 10475 -6158 -148613 -193894 -148226
14567 -148226 -22763 6445 107602 -7192 -163950 -113317 7656 -48822 -158261 -108273
14557 -108273 6848 77044 23741 128956 204870 249021 180315 142200 89743 -73145 -217538
14546 -217538 -137810 -96824 -178839 -204180 -131133 -66615 -9939 -22928 -26260 6615 111550
14535 111550 327045 334845 26877 -30628 3579 97820 -18392 56614 71302 65743 36905
14524C6905O317J0067L0512n3279P664J02364J8451r4117l3000o4155N8182J78811
14512B04722K43399l4569l23593j80073J14753K04685P1784j06643j93188j4113
14502a2836k8629P8487R0377L1837k17414j66233R6384J47496R37J74600O7468
14491B62474q9630j134j28461L8904J42414p4451j93649M455q443p2720R9930
14480b0311J62592n5626m8027M7008k9396j24577j5622K1108N9567K1786R986
14469B8488n0420P533j24920O5289J69112J9893m2903q638J0429o7392j54829
14458a48358p3876J2220J4111K29003J48595N706N5635N597l9479k04519o9396
14447f4761L216L2176R5198M7761o8192R3734m8642P9481Q640O540J04764N1160
$$ plain form
14524 36905 43222 53289 83801 30522 38186 140550 159001 64884 31884 -32271 25911 204722
14512 204722 448121 413552 89959 -90114 24639 229324 301108 194465 1277 -12836
14502 -12836 -41465 37022 127399 159236 -58178 -224411 -128027 19469 20406 195006 262474
14491 262474 172844 171710 43249 82153 224567 150116 -43533 -39078 -47521 -120241 -20311
14480 -20311 142281 86655 38628 85636 56240 -68337 -83959 -62851 -3284 18502 28488
14469 28488 -21932 -14399 -139319 -74030 95082 114975 72072 63434 73863 6471 -148358
14458 -148358 -222234 -210014 -195903 33100 181695 187401 243036 248633 209154 4635 -64761
14447 -64761 -61545 -29369 65829 113590 45398 139132 90490 169971 178611 185151 289915 341075
14435C41075J98591j62259k26388j07853j3347n9517j31059J41433J28298p6188
14425C2786P2853J07420q8211j00325N5232M819p5336m9666j95517J42415l071
14414i6601j369J06771r1278l7288r9964L4988J6241L9957k3492J13329J53034
14403A14328J12720J08583p684j95685o6767j24764k410P7384J15133Q0901Q8576
14392C00315j05400j53552n4117r5142J71281J97456o5149p1559m939k20436j81664
14381b82906P3553J35041j33459n2825n7689K24403O5018O423P4467R1864K038
14370A45928L1628J24902j60551k64949J9067O9925J82882m7585j5995r0777r3340
14359i8865J24372J23497j7633M8720r1382J0150M686L0171N3672J7861j41247
$$ plain form
14435 341075 539666 377407 151019 43166 29819 -29698 -160757 -19324 108974 32786
14425 32786 105639 213059 124848 24523 79755 84574 9238 -40428 -235945 -93530 -96601
14414 -96601 -97970 8801 -82477 -119765 -219729 -184741 -168500 -128543 -152035 -38706 114328
14403 114328 227048 335631 327947 132262 65495 -59269 -61679 15705 130838 211739 300315
14392 300315 194915 41363 -12754 -107896 63385 260841 195692 124133 119194 -101242 -282906
14381 -282906 -209353 -74312 -207771 -260596 -318285 -93882 -28864 -22441 52026 143890 145928
14370 145928 177556 302458 141907 -123042 -103975 -34050 148832 101247 85252 -5525 -98865
14359 -98865 25507 149004 131371 180091 88709 98859 103545 133716 187388 205249 64002
14348F4002P8459M5950l7446n8875m0091J1153J61824k7706M196j1155n0697J41269
14336B80883j6716n2491j73323J52066N7067j29852M7569M0762J2497j50128k57375
14325a89041l4310K07857P0069p4537m9055J37333K3579Q45j66477O2737J59350
14314A48350J31599q4116m1356q0666q0159L5244J62292j5678j80795L7277K5234
14303E7226m8329l172k937l1535p088M925K32733L6373j56325j0241k7489Q4062
14291A28203Q0935M6638O6158J6371l2031j54806J8125K65856k1290j34778r8217
14280A81164N7258J54385n4930k00793l7660o4371j9594k509L792j22382L548
14269a02092J37881j14870j42296n8466J11372J6439j31013O4435J19777J12950
$$ plain form
14348 64002 142461 188411 150965 92090 51999 63152 224976 197270 201466 190311 139614 280883
14336 280883 264167 211676 38353 190419 247486 117634 165203 205965 218462 68334 -189041
14325 -189041 -223351 -15494 54575 -19962 -69017 68316 91895 92740 -73737 -11000 148350
14314 148350 279949 195833 154477 73811 -6348 28896 191188 175510 -5285 31992 57226
14303 57226 8897 5725 2788 -28747 -35835 -30910 201823 238196 81871 71630 44141 128203
14291 128203 209138 255776 321934 338305 306274 151468 169593 435449 414159 279381 181164
14280 181164 238422 392807 337877 137084 99424 35053 15459 12950 16742 -105640 -102092
14269 -102092 35789 -79081 -221377 -279843 -168471 -152032 -283045 -218610 -98833 14117
14259A4117j3585O8620Q3184j7947J27896p9662j5035R5736J49561o6213K1772
14248C68444J06097P1293l3650m1009k61522k82029r237J5796k5826p6179J4182
14237a53640J16319J62689j32053n6548J19249J61446N7236j70548p5116j41551
14227a12517n1326J67888K77665R0512Q2927O6941l9654j41783o179l6827j08719
14216A88928k6706R042m2948k9721j59374l9584r4939K35676J49527N8879k45897
14205B883k55515l7066N6424M2717N2599j14877Q3834J60173M8488n9431k5347
14194d5118l3449O0514K43286J37221N3261P31k33120j14453o1693j2660j06838
14183a12318l1764J58815j42979j18996J13434J33409J9698j083P405O9880j00489
$$ plain form
14259 14117 532 69152 152336 134389 262285 182623 167588 263324 412885 346672 368444
14248 368444 474541 545834 512184 471175 209653 -72376 -81613 -65817 -91643 -167822 -153640
14237 -153640 -37321 125368 -6685 -63233 56016 217462 274698 104150 29034 -112517
14227 -112517 -163843 4045 281710 372222 455149 522090 482436 340653 334474 297647 188928
14216 188928 162222 171264 128316 98595 -60779 -100363 -195302 40374 189901 248780 2883
14205 2883 -252632 -289698 -233274 -190557 -137958 -252835 -169001 -8828 39660 -19771 -45118
14194 -45118 -78567 -18053 225233 362454 415715 416446 183326 68873 7180 -5480 -112318
14183 -112318 -144082 14733 -128246 -247242 -133808 -399 19299 18216 25621 95501 -4988
14172d988q6723N9794j06160q9788R585J5200j4740P0403p2327j36662J43273
14161b13133J07064J58757j8476j08334R2073n8710k0214K21862R502j54240r8146
14150h1995Q437l7324J10465J26928N1216l9213m742j051l5790o9110j18752j64272
14138b55203l3679J84223J08603O5799J51J00417j2143o0146m4169j40037K7820
14127e8364J65545j9233j73096Q9330j54086k4167r0364j5675l0227j1793R2951
14116b29179M0045O4154j1253J7408J28786J5596n1480N607O3051L3755J63366
14105B39856j64936j7811O6366n5206r9846o6735J64751Q0682J6757J09187j68074
14094A04991o1803j78605m9979K85645J33336j48845l3532O1833J22857j45686
$$ plain form
14172 -4988 -91711 -31917 -138077 -227865 -218280 -203080 -217820 -147417 -219744 -356406 -213133
14161 -213133 -106069 52688 34212 -74122 17951 -40759 -60973 160889 170391 16151 -81995
14150 -81995 -73558 -110882 -417 126511 177727 138514 133772 132721 96931 27821 -90931 -255203
14138 -255203 -288882 -104659 3944 69743 69894 170311 158168 98022 53853 -86184 -58364
14127 -58364 107181 87948 -85148 4182 -149904 -174071 -264435 -280110 -310337 -322130 -229179
14116 -229179 -189134 -124980 -136233 -118825 9961 25557 -25923 -20316 42735 76490 239856
14105 239856 74920 57109 123475 68269 -31577 -98312 66439 147121 163878 273065 104991
14094 104991 43188 -135417 -185396 100249 233585 84740 51208 113041 235898 90212
14084I0212m4230k1963o3479j39254O4574J13294R6020m8444l9147n1372N2677
14073H888J02146O76l5720j52275L7114M7222J01861Q316j64356j35488j16820
14062b98436L1585L7793l3068q7056N6412K04530Q0365j3999J33133N4129o5984
14051I9404J1664m6329L1583j03447M8762L0667o4169m5025J32547L9908K3996
14040A59561j0658l603k3535M264n0908p0622r8010Q8811L8574N3550K7821m93
14028A14752O1943o7907j95998J26866K07852n8931L6634q3058j22739K3740O0132
14017A03286L2878l7781l8485m1185R6993r9384n7306l2801Q6772K1065M6135
14006H0187j07200q2922M5073Q2243M1183M1652M0944L905j35664k3636k03638
$$ plain form
14084 90212 45982 24019 -39460 -178714 -114140 -846 95174 46730 7583 -43789 8888
14073 8888 111034 111710 75990 -76285 -39171 8051 109912 118228 -46128 -181616 -298436
14062 -298436 -266851 -229058 -262126 -349182 -292770 -88240 -7875 -21874 111259 165388 99404
14051 99404 111068 64739 96322 -7125 41637 72304 8135 -36890 95657 135565 159561
14040 159561 148903 145300 121765 126029 75121 4499 -93511 -4700 33874 87424 115245 114752
14028 114752 176695 108788 -87210 39656 247508 188577 225211 142153 19414 43154 103286
14017 103286 136164 98383 59898 18713 115706 16322 -40984 -73785 12987 34052 80187
14006 80187 -27013 -109935 -64862 17381 58564 100216 141160 145065 9401 -14235 -217873
13995b17873l2048R7828N4263l7369m5800J75289J30996J32503p9556j84435n5750
13984f1952J16526r2852k11563J25310J37229k0377N1260l6993K4337j2063j7047
13973A815P2530L6811J25483k2978j19500q5314L6095N4870R4755k2973R3103
13962B64697l0083J25775K2780j13041p4608l4271k6026m6639p612l2322o5467
13951a6817L0543J77563l0222j64818k4528R8537N5311j9818n92J26903K6706
13940B58768k89892L4453J48745m704j06402p6805k1084j40899j65241J13709
13930b49352K12038R966n7199j0001l2090J81195N8457Q50k27561r5900j26089
13919c35686J0521K08294l8570R4655R2320L7866j06627m2464j30997R1610J55976
$$ plain form
13995 -217873 -249921 -152093 -97830 -135199 -180999 -5710 125286 257789 178233 -6202 -61952
13984 -61952 54574 -38278 -249841 -124531 12698 -7679 43581 6588 30925 18862 1815
13973 1815 74345 111156 236639 213661 94161 8847 44942 99812 194567 171594 264697
13962 264697 234614 360389 383169 270128 195520 161249 135223 88584 80972 48650 -16817
13951 -16817 13726 191289 161067 -3751 -28279 70258 125569 105751 105159 232062 258768
13940 258768 -31124 3329 152074 147370 40968 -35837 -56921 -197820 -363061 -249352
13930 -249352 -37314 -27348 -84547 -94548 -126638 54557 113014 113864 -113697 -209597 -335686
13919 -335686 -325165 -116871 -155441 -60786 31534 69400 -37227 -79691 -210688 -119078 36898
13908C6898N6340l8367r457K5718j2070R5996o9902j74375K267L0008o0837j05331
13896b23112k06J33742p6710l5493N1646O5986M8593m3689R7623j8792J4435J43229
13884A57252n1898q2569N6610n6789O5881p7261j50260q1544R0277K9797J73500
13873G2996M5252l6721l8535n7413j2790j2598O1499n4623r4752J51858P6326
13862A00499J9443J71877r1276l9563k533j26978j61737M1483o344M7369L7210
13851a0550r8464M0408J08514J43592k1705q2449n9587k31446j56919l0929J32024
13840b67511J39138L6871p9785q0932Q2887J97993j9897r530l3014M1161p6942
13829f9561j49069q4538K38638J14867m4515j36236j397M616J26082O2895r1085
$$ plain form
13908 36898 93238 54871 45414 71132 59062 155058 85156 -89219 -86952 -56944 -117781 -223112
13896 -223112 -223318 -89576 -166286 -201779 -150133 -84147 -35554 -79243 18380 -412 14023 157252
13884 157252 105354 22785 79395 22606 88487 11226 -139034 -220578 -130301 -100504 72996
13873 72996 118248 81527 42992 -14421 -27211 -39809 21690 -32933 -127685 24173 100499
13862 100499 119942 291819 200543 160980 158447 31469 -130268 -88785 -95129 -47760 -10550
13851 -10550 -109014 -68606 39908 183500 161795 79346 19759 -211687 -368606 -399535 -267511
13840 -267511 -128373 -91502 -171287 -252219 -169332 28661 8764 -766 -33780 7381 -69561
13829 -69561 -218630 -303168 -64530 50337 5822 -130414 -131811 -127195 -1113 61782 -29303
13818b9303k5355l9737m0768j26041l6265n2257l0334M389K05527K7188j58877
13807c01833o6397J81677K03963L5800P445j5290R8715R0827J569k01660j41517
13796a06701J9137L2419J32557k41379k01903q6322K12716j37920q6815J27459
13786c36752J52509P2108R5986p280l0366k7462J695O5161p3280j33215j9888
13775b40784J16897M326j02908q6543J37937K20209O5495k0860j07865o0965M2734
13764c2327N7364K7408l763o9275O2973J0369M803R3562j66432N9336N2561j29249
13752c2670R9395j6171j04115R7825j08430k6792J82162k3572j31970J749J31915
13741F9326q168R3278m3920n750M0914o0375j56976N9595k996r4610j08230J31026
$$ plain form
13818 -29303 -54658 -94395 -135163 -261204 -297469 -349726 -380060 -375671 -170144 -142956 -301833
13807 -301833 -368230 -186553 17410 53210 60655 45365 144080 234907 236476 34816 -106701
13796 -106701 -87564 -55145 77412 -163967 -365870 -452192 -239476 -377396 -464211 -336752
13786 -336752 -184243 -112135 -16149 -23429 -53795 -81257 -79562 -14401 -87681 -220896 -240784
13775 -240784 -123887 -119561 -222469 -309012 -171075 49134 114629 93769 -14096 -75061 -32327
13764 -32327 25037 52445 48682 -20593 42380 52749 57552 151114 -15318 44018 96579 -32670
13752 -32670 66725 50554 -53561 44264 -64166 -90958 91204 67632 -64338 -62589 69326
13741 69326 61158 154436 110516 104766 145680 85305 -71671 -12076 -15072 -109682 -217912 -86886
13729h6886J70148o3757O5288j1430j73812q8015r9700K0028K04522N2417K4758
13718A3561J51388L9687q3969j13333m3607O4467J06131Q036m1123p9596j4552
13707G090r79Q222j8313O3936O0273P2397J07783p8329K0140j69862l7767L6313
13695G0904M91j29119K3196J75881R4085o2029j03265j24923j10995J15616o6365
13684a16523o5913N5941n7537q2027O9140J42857O6677j07221r8614J2244J38121
13673d2855J01854m7082Q2469o963R2934p6609j03879J29670R0861r7344J5243
13662A38299n4902q6163j97874k332J55175N6010j6462m0488m2360J33664j13329
13651g0762J27384o928K3749n5623k3383J93220J23460q2816k6386L4753o4123
$$ plain form
13729 -86886 83262 19505 84793 73363 -100449 -188464 -288164 -268136 -63614 -11197 13561
13718 13561 164949 204636 120667 7334 -36273 28194 134325 142361 101238 21642 7090
13707 7090 6111 14333 -3980 59956 120229 192626 300409 222080 242220 72358 34591 70904
13695 70904 71395 -57724 -34528 141353 235438 173409 70144 -54779 -165774 -50158 -116523
13684 -116523 -182436 -126495 -184032 -266059 -196919 -54062 12615 -94606 -193220 -180976 -42855
13673 -42855 58999 11917 94386 87423 180357 103748 -131 129539 220400 123056 138299
13662 138299 83397 -2766 -200640 -202972 -47797 8213 -8249 -48737 -91097 42567 -70762
13651 -70762 56622 49694 73443 17820 -5563 187657 311117 228301 201915 236668 172545
13640A72545j41571o2481M2234j33900l7423L8026k5596P8178p281p295O7369
13629a7195J09384j9486j34953j36917K924j62305J38449P2825J5268K5217M0499
13618f6290M2255O4377n5021p0308l308J3800O9612J29646N7661J07778l3682
13607B56520k35814o5488R1232J4528j07446k8905Q0550J74373K7926R9640K6452
13596C33568j23478j60875J03477o397p6702J19858K6851O0370j67071k07588
13586i7987L2568N6716q8551J39721J61617j03735j84460j4432J29846K87030
13576C18333J39692j58977j16349J9716k8265p3498r9883p5118r7217n4110J22604
13565a03072K21003n7522k24622Q2646J37926K7534m560j77420J28362M8330j33613
$$ plain form
13640 172545 30974 -31507 10727 -123173 -160596 -122570 -148166 -69988 -77269 -84564 -17195
13629 -17195 92189 72703 -62250 -199167 -196243 -358548 -220099 -147274 -132006 -106789 -66290
13618 -66290 -24035 40342 -14679 -84987 -88295 -74495 -4883 124763 182424 290202 256520
13607 256520 20706 -44782 46450 60978 -46468 -75373 5177 179550 207476 307116 333568
13596 333568 210090 49215 152692 146295 69593 189451 216302 276672 109601 -97987
13586 -97987 -65419 -8703 -97254 42467 204084 100349 -84111 -98543 31303 318333
13576 318333 458025 299048 182699 202415 174150 100652 769 -74349 -171566 -225676 -103072
13565 -103072 117931 60409 -164213 -81567 56359 83893 79333 -98087 30275 78605 -55008
13554e5008j16243R8779j2562j26769M493O6564R0464k5159J27400J01724L9449
13543A93132j60018j64400O2759J34892j02173j24811M8604j30364l3627J21614
13533a54392R611J07185M5091M3570m0115j85025K2261J85469M106j76732m0972
13522a79943M2228O5366J42522L2070Q9920K7102m6997o7180m4304j38383o9036
13511a46635M1147J30107j2576j46543R1897K96436k07961n8862j4525m619J4490
13500a7644N7419J03083R9879M5160q1592o9276j6367m0674J9772j07440p333
13489a5013J80018P5801O9299p3266j68683p3819O0201l2097j236j0292j33668
13478a22755o4714k5133K26354l7694k4987K61976N7627k84231O5084R9678n1276
$$ plain form
13554 -55008 -171251 -72472 -85034 -211803 -207310 -140746 -50282 -75441 51959 153683 193132
13543 193132 33114 -131286 -68527 66365 -35808 -160619 -112015 -242379 -276006 -154392
13533 -154392 -144781 -37596 7495 51065 10950 -174075 -151814 33655 37761 -138971 -179943
13522 -179943 -137715 -72349 70173 102243 192163 219265 172268 105088 60784 -77599 -146635
13511 -146635 -105488 24619 12043 -134500 -42603 253833 45872 -12990 -27515 -32134 -17644
13500 -17644 39775 142858 242737 287897 206305 137029 120662 79988 99760 -7680 -15013
13489 -15013 165005 240806 310105 236839 68156 -5663 54538 22441 21205 10913 -122755
13478 -122755 -187469 -212602 13752 -23942 -48929 213047 270674 -13557 51527 151205 99929
13467I9929q6475R1644K4989n357K114n7032M943q5955k01180k8869J64704j47074
13455b23619j7682n5423P6172N8350k7501n3770p9212J29166K18891J75673j22195
13444G8850o9361M3364J0277j5385j5390r1131J5910j59847q7756L6794J35832
13433a17843R6773m9694o1348l0391o9626k6474J51525n5912Q0361K2132J13201
13422E2704M4495m7588o7138k2140j50712p1448l2061J19109M0158j4934N946
13411a43609r9243J18950n6542k37588J18774J18434j31241l81J16954m80k1279
13400b17251p869l0503J75230R1428K8389n887p18p6900R182J1356j57632l2996
13388b14171J07866K20064N9995j33341J6166p8942l1864N775J20770J39714p5228
$$ plain form
13467 99929 13454 105098 130087 124730 126844 69812 74755 -11200 -212380 -241249 -76545 -223619
13455 -223619 -241301 -296724 -220552 -162202 -189703 -243473 -322685 -193519 25372 201045 78850
13444 78850 9489 52853 63130 47745 32355 -58776 -42866 -202713 -290469 -253675 -117843
13433 -117843 -21070 -70764 -132112 -162503 -232129 -258603 -107078 -162990 -82629 -60497 52704
13422 52704 97199 49611 -17527 -39667 -190379 -261827 -293888 -174779 -134621 -149555 -143609
13411 -143609 -242852 -123902 -180444 -418032 -299258 -180824 -312065 -312446 -195492 -195972 -217251
13400 -217251 -225120 -255623 -80393 11035 39424 33537 32819 -44081 -34899 -23543 -181175 -214171
13388 -214171 -106305 113759 173754 40413 56579 -22363 -54227 -48452 72318 212032 136804
13377A36804j28023K016l5623j6406j86536o1124P1568J51304o9373Q1244O0043
13366E894j83989o1062M9006Q461m6639L8780J4576Q5495k0909q4249k6150R4162
13354a26624o3034r1160J5673J64546n0129j10360J8896l9349J18255N2227O6528
13343d4531K1017K18690O3933j20228k17249p8451q3537n242J69254k5067l1891
13332a33302n1588J89279N8565L4635l7761j44402q1881J20050m0054j38571j00575
13321c25605j12534J51649J44221p7894K8142J08905Q0163J37969J46596K8135
13311C09747j63871j86599K6974J38941L1271J37973j33288p9601m1514j44901
13301a04868j05801J46483l8478l4410L4408N0330l4190N0553L1795J97457O7992
$$ plain form
13377 136804 8781 10797 -24826 -41232 -227768 -288892 -217324 -66020 -135393 -54149 5894
13366 5894 -178095 -239157 -190151 -181690 -228329 -189549 -174973 -89478 -110387 -194636 -220786 -126624
13354 -126624 -189658 -280818 -265145 -100599 -150728 -261088 -242192 -281541 -163286 -111059 -44531
13343 -44531 -23514 195176 259109 138881 -78368 -156819 -240356 -245598 -76344 -101411 -133302
13332 -133302 -184890 4389 62954 97589 59828 -84574 -166455 -46405 -86459 -225030 -325605
13321 -325605 -438139 -286490 -142269 -220163 -192021 -83116 -2953 135016 281612 309747
13311 309747 145876 -40723 -13749 125192 156463 294436 161148 81547 40033 -104868
13301 -104868 -210669 -64186 -102664 -137074 -102666 -52336 -86526 -35973 -4178 193279 261271
13290B61271o9026j96613j11172N8471K74540K2070j17473j51570m3599j1196
13280h4297l2715l0596p3468J26873Q1982j15950j13742L3935J18386L3941N8012
13269B361r4350K3053J19450J614l9634j886j09054j5939K6236K5513K043J62802
13257A02209n166o9215j11918Q5927j9804l0958j18304q4436L1979K11156K20258
13246B11728n2218k75174J6167J51209M9933J0341j89215r0689k8189K5008J35506
13235c5593J19503n5059m8221n3841k61629N9816N7578J94939K61255j6323q9762
13224A32663j35293O4573q502m1077P8387L0934J09315M1959K9573Q5804o5539
13213C22797j61038O3606L9852j13830l1237P5152R4353q7501j21859r1115P7206
$$ plain form
13290 261271 192245 -4368 -115540 -57069 217471 239541 122068 -29502 -73101 -84297
13280 -84297 -117012 -147608 -221076 -94203 -12221 -128171 -241913 -207978 -89592 -55651 2361
13269 2361 -91989 -68936 50514 52128 12494 10608 -98446 -114385 -88149 -62636 -60593 102209
13257 102209 97043 27828 -84090 1837 -17967 -48925 -167229 -251665 -219686 -8530 211728
13246 211728 159510 -115664 -99497 51712 101645 111986 -77229 -167918 -196107 -171099 -35593
13235 -35593 83910 28851 -19370 -73211 -334840 -275024 -217446 -22507 238748 222425 132663
13224 132663 -2630 61943 53441 12364 90751 121685 231000 272959 302532 388336 322797
13213 322797 161759 225365 265217 151387 120150 195302 289655 202154 80295 -10820 66386
13202F6386K6735K2471J84254M9743K3972k80297j32913J8855Q936J06797j7910
13191G7029o5785p0543P6696j05274r9938J24982J48285j15175j01200n4699o948
13180a92570R1682M5397n8982P4869J67118N4835q2178l4228p3215J6743L2760
13169D2231q7302P7720P7638J53824j83565M1074M3498Q821R6480p0328j14558
13158H5533j936N0039j1191k8316p7705j62239J2239o0782O3815L6799J36862
13147D3118M5999L4935O2704j03218l0412N2917N6133L6442k3810l2508l6317
13136A05983j01449P1492J0986J05272m6793K6329R3902J0574j93260L4742J7257
13125A35035m4594j17742m3673N4806J5468r2963l9290K11344k3535j42134P3014
$$ plain form
13202 66386 93121 115592 299846 349589 373561 93264 -39649 -20794 -11858 94939 77029
13191 77029 11244 -59299 17397 -87877 -187815 -62833 85452 -29723 -130923 -185622 -192570
13180 -192570 -100888 -55491 -114473 -39604 127514 182349 100171 65943 -7272 9471 42231
13169 42231 -45071 32649 110287 264111 80546 121620 165118 173939 270419 200091 85533
13158 85533 83597 133636 122445 94129 16424 -145815 -133576 -194358 -130543 -93744 43118
13147 43118 89117 124052 186756 83538 53126 106043 162176 198618 174808 142300 105983
13136 105983 4534 76026 87012 192284 145491 171820 265722 276296 83036 117778 135035
13125 135035 90441 -27301 -70974 -16168 -700 -93663 -132953 78391 54856 -87278 -14264
13114a4264m2904M3288n2354j36370K7850J6457j39387K9147J03409p8286R8491
13103a44923K22411Q7881l9241q2456J07995q6598n6035L2847Q7150L6427o7564
13092I7894Q8952k3247o6156M4156K0357l5579l4292N4326J11017R4998n4307
13081B98119k2551m267r7770j41243j12090o7662J73793M1l8189L8034l6093j05483
13069a15361L5112O6422K0787P9051q6810j2123N1343R8357N5558r7631j2988
13058H1717J8081j2226l0742l9771K4764O9991J4830j44989j03959P6859o7739
13047a13184Q6876j7483J7869n0176J9144j17098m167k8282N9803J64849R8251
13036A16402J11376M6247j37755r0946j35829L6822j3250J02638k587j1213P1667
$$ plain form
13114 -14264 -57168 -13880 -66234 -202604 -174754 -158297 -297684 -268537 -165128 -243414 -144923
13103 -144923 77488 165369 126128 43672 151667 65069 9034 41881 129031 165458 97894
13092 97894 186846 163599 97443 141599 161956 126377 92085 146411 257428 352426 298119
13081 298119 275568 271301 173531 32288 -79802 -147464 26329 26370 -11819 26215 -9878 -115361
13069 -115361 -80249 -13827 6960 86011 -799 -12922 38421 136778 192336 94705 81717
13058 81717 99798 87572 56830 17059 41823 111814 126644 -18345 -122304 -45445 -113184
13047 -113184 -26308 -43791 -25922 -76098 -56954 -174052 -178219 -206501 -146698 18151 116402
13036 116402 227778 274025 136270 45324 -90505 -53683 -66933 35705 33118 21905 93572
13025I3572j6583k9554l0481L8185K42994l06K5129J16397j14875j94397l08441
13014a78360p6553M6070M234m297K42144O2456k8485l7326O6458Q0371o8804J17048
13002B24956k8572j58224j8095j14400Q593m7892K15207J63466p3022j02338j27824
12991e8145P2989k6702p3548J34j51373j1963J53428m4094n9630m491N1733R2111
12979e9551Q6837K63087M9431o3823j45368R332K3671K6742o6011j99166Q0577
12968E758J68592J12697j14018n6788j51757q0037J31131r582Q8286J26096k9996
12957A90382j08413r0178j50902J9396j37214j03588j3512J36073m7007O9897
12947b35066J8732N9800N0180J6440P784J10642J47601k17763k46379J69713J17604
$$ plain form
13025 93572 76989 47435 16954 55139 298133 297827 322956 439353 324478 130081 -178360
13014 -178360 -254913 -208843 -204609 -208906 33238 95694 67209 29883 96341 176712 107908 224956
13002 224956 196384 38160 20065 -94335 -85742 -133634 81573 245039 172017 69679 -58145
12991 -58145 14844 -11858 -85406 -85272 -236645 -248608 -95180 -139274 -198904 -203395 -151662 -59551
12979 -59551 27286 290373 339804 275981 130613 139945 163616 190358 124347 -74819 5758
12968 5758 174350 287047 173029 116241 -35516 -115553 15578 5996 94282 220378 190382
12957 190382 81969 -8209 -159111 -139715 -276929 -380517 -394029 -257956 -304963 -235066
12947 -235066 -216334 -156534 -106354 -89914 -82130 28512 176113 -41650 -288029 -118316 -712
12936g12n0687o6645k5226j00923J70512K41619j9511j20955P4901N3614q0024
12925G5963J53292N2150J2789o3043k38389p6136J97644O1261K076N4659P6998
12914C09264r7264j55229J9151K1673j86521j18833Q9905J49036M2394R9932j12989
12903F0519n51O5042M2155m7338P891m5436j9787J16257j5172L7725J20262m2719
12891B78848j87861n7660p4639K0032p27P4457J32463q7765j05690m0004L0627
12880a7919J8399k11538Q7547O3043n7660L3113K4578K3251N7941j53201m3361
12869a75807n1223k6713R1186M6291j45852K31409J10499r1180N1459J71n320
12858C4920j11342R0268R5251l3795j21056o9424K38N6945j4756j21426J14861
$$ plain form
12936 -712 -51399 -118044 -143270 -244193 -73681 167938 148427 27472 102373 155987 75963
12925 75963 229255 281405 294194 231151 -7238 -83374 114270 175531 177607 232266 309264
12914 309264 212000 56771 75922 97595 -88926 -207759 -117854 31182 73576 173508 60519
12903 60519 59968 125010 167165 119827 127718 82282 62495 178752 163580 201305 321567 278848
12891 278848 90987 33327 -41312 -21280 -22007 52450 184913 97148 -8542 -48546 -17919
12880 -17919 480 -211058 -123511 -60468 -118128 -85015 -60437 -37186 20755 -132446 -175807
12869 -175807 -227030 -253743 -162557 -116266 -262118 -30709 79790 -11390 40069 40240 34920
12858 34920 -76422 13846 109097 75302 -45754 -115178 -114940 -57995 -72751 -194177 -79316
12847g9316O3499O0287Q957O4539j05664j59550K7936J14692M6010o5379m4699
12836f8688L9252j8248o091J5368L1669J30600Q8920l453j40409N3795Q4787K6629
12824B34131j18371M2696m0426J5667J0320J00369M245j04613J0617K8893q9280
12813I4248K6579m0921j870J6129L576N5620K4083r0689P5669J13752L5073m1561
12801B69688j16979j79431Q3677K00991J4724n3028n0226j4221r8449q907J10031
12790A57870P9295j00968q5383K11394J67545j38943j20758q7021p6419j1817
12780e205J5098l3993o9250J12097j51955M5407J32316L3252J81395k8754J0491
12769B40899J1267O2647j08158j77824q3794J490p6608o8280K06738M658j10630
$$ plain form
12847 -79316 -15817 44470 53427 117966 12302 -147248 -119312 -4620 41390 -23989 -68688
12836 -68688 -29436 -47684 -53775 -38407 -6738 123862 212782 209329 68920 122715 207502 234131
12824 234131 115760 158456 118030 133697 144017 244386 248631 144018 154635 183528 94248
12813 94248 120827 79906 78036 94165 97741 153361 177444 86755 162424 276176 311249 269688
12801 269688 152709 -26722 56955 257946 272670 219642 169416 155195 56746 47839 157870
12790 157870 237165 136197 50814 262208 429753 290810 170052 83031 6612 -5205
12780 -5205 9893 -24100 -93350 18747 -133208 -87801 44515 77767 259162 230408 240899
12769 240899 252166 314813 206655 28831 -54963 -53473 -130081 -198361 8377 13035 -97595
12758i7595k0248J7249Q3974J66228l6480j80589j9181k4114r1227J42797O5795
12747F609m0664K7536O1815J9688j2482j46148K47927r6260k47895k0505J74671
12736b5708L1718k8160j3137R9150R0682j4973M5284n9767N679j8610k5493j08
12724H6557O4262p873o1341J78770J56128m1229q9888J276k9962j43912p817j35984
12712c1013R4126M7371R9408K01385j54879j28894n4820M458j18434M0095N2250
12701E1053Q9053K8355O7637l1132J29776m4549L107k5226M5568L8982N2662k93934
12689A11352j96749J18757N3728J855J02679R9040j380k63930r8255m3121m7727
12678a63751J96229p6084J12653J01518J40238k2590j43109j35298J56330N5956
$$ plain form
12758 -97595 -117843 -100594 -16620 149608 113128 -67461 -86642 -110756 -201983 -59186 6609
12747 6609 -34055 -6519 55296 74984 62502 -83646 164281 68021 -179874 -200379 -25708
12736 -25708 6010 -22150 -35287 63863 154545 139572 184856 125089 130768 112158 86665 86557
12724 86557 150819 142946 81605 260375 416503 375274 285386 286662 256700 112788 104971 -31013
12712 -31013 63113 110484 209892 411277 256398 127504 72684 77142 -41292 -1197 51053
12701 51053 140106 168461 236098 204966 334742 290193 293300 268074 313642 352624 405286 111352
12689 111352 -85397 33360 87088 88943 191622 290662 289282 25352 -72903 -116024 -163751
12678 -163751 32478 -43606 69047 170565 310803 288213 145104 9806 166136 222092
12668B22092k23539k04328J98743K31613r0920k05255N3713l2732o954K36141
12658A78574Q0640P5772P9711j64504j28308j99487j18020P4247L7227O4017K57044
12647B36913j76598p5402j0396j45885p3765J40525J00660l4301j4108Q0025j6308
12636A1360k2173K9198J88766J7180J28699l7381l4279K7667O0506j21166k3148
12625B25229J36756L1926q535k4465j14526j80781n0729J4794P8828j653p029
12614I9815m2921K4421K6028k3697J3473l5547N9714J88630p4022p3720q7545
12603G4629P0903m3315r172O5904j60197l498L066j29112N2024o5469N8938N918
12591g9381L0570K5225j134J32664k7996P9418o547K3199n8190J25841m0223j34686
$$ plain form
12668 222092 -1447 -205775 -7032 224581 133661 -71594 -17881 -50613 -57567 178574
12658 178574 259214 334986 414697 250193 121885 -77602 -195622 -121375 -84148 -20131 236913
12647 236913 60315 -15087 -25483 -171368 -245133 -104608 -3948 -38249 -52357 27668 11360
12636 11360 -10813 18385 207151 224331 353030 315649 281370 309037 369543 248377 225229
12625 225229 361985 393911 385376 360911 246385 65604 14875 29669 108497 106844 99815
12614 99815 56894 81315 107343 83646 97119 61572 121286 309916 235894 162174 74629
12603 74629 145532 102217 93045 158949 -1248 -4746 -1680 -130792 -78768 -144237 -85299 -79381
12591 -79381 -48811 -23586 -24720 107944 79948 159366 152819 176018 117828 243669 203446 68760
12579F8760q8555O5111p6050K13950Q9339L077n9719l9951M1344j03236L3234
12568A47304O9317j28285r9100l8862J134J589L8650J60997N6201k61477q8745
12557a41277L35600O1489k4871o0487L7733m9731K42457N2760k22241l3420K9390
12546B27402m6448o4219J3054P8214R1263J65158Q9943j18359k73758j61461j72886
12535a72097k0316k6179O5823J41267l4051l0490J66243J02748P10J4067m5005
12524A62720J5070K3373l2094j04772P4647k3421l4875o3778p566r3323o0105
12513a44124R4052o190Q544P463Q079p2183J20287J48650J60058P5263j07356
12502B92543j04151n7858j23963l062l4024o1377m3551j13484m154l6796m1543
$$ plain form
12579 68760 -19795 45316 -30734 183216 272555 275632 215913 175962 217306 114070 147304
12568 147304 216621 88336 -10764 -49626 -48492 -46903 -8253 152744 208945 -52532 -141277
12557 -141277 194323 255812 230941 170454 208187 158456 400913 453673 231432 198012 227402
12546 227402 180954 116735 129789 208003 299266 464424 554367 436008 162250 789 -172097
12535 -172097 -192413 -218592 -152769 -11502 -45553 -76043 90200 192948 193658 207725 162720
12524 162720 177790 201163 169069 64297 138944 115523 80648 16870 9304 -84019 -144124
12513 -144124 -50072 -56262 -47718 -40255 -32176 -104359 15928 164578 324636 399899 292543
12502 292543 188392 130534 6571 3509 -30515 -91892 -135443 -248927 -253081 -289877 -331420
12491c31420Q2781R6774K17236P890l8106m8969l8359p1368L615Q8986M4964N9145
12479G3169q858l530K5362J5164J8276K0235Q9277o0010j18225K1969J35196K17246
12467D25271J8740m9579r0852j06942m0218J22960J370k7936o6680K7J0263m0805
12455A55619J8193n670n1325O7053j6397q3819K15350k05j80416J4414j0242J08320
12443B30875m523r5101L0974n4313j8195k2779N0930L3964J18090o5710k61685
12432e7473O2523K05866r3789J7561Q0509M1765Q3803J52526r622o1630k40750
12421A81289j43387J56819J42593j51742r0654N6457L0460m1448m2809j108J9299
12410A15769J04602J01443N8946M2065l9842j21440M0342p870j4165O5452p6273
$$ plain form
12491 -331420 -248639 -151865 65371 73261 35155 -13814 -52173 -123541 -119926 -30940 14024 73169
12479 73169 64311 60781 86143 101307 119583 139818 229095 169085 50860 72829 208025 425271
12467 425271 444011 394432 303580 196638 156420 279380 280750 252814 186134 186161 196424 155619
12455 155619 173812 168142 116817 183870 167473 83654 299004 298799 118383 132797 122555 230875
12443 230875 226352 131251 162225 107912 89717 66938 117868 151832 269922 204212 -57473
12432 -57473 5050 210916 117127 134688 215197 256962 340765 493291 483669 422039 181289
12421 181289 37902 194721 337314 185572 94918 151375 181835 140387 97578 96470 115769
12410 115769 220371 321814 380760 422825 382983 261543 301885 294015 279850 345302 269029
12399B69029N8219J9137k7923q0282N3796J36685p2045K422K8095o2320p5837
12388B48976M0155j59337m8237J3361p7032n7096J41360R7650P3411j73712q3286
12377A6213J31211P0368O1637j576o4284l8275J61250j18095M0858k1124j45971
12366I2212m4949l9417l4962J12823J22514L0885k31569r1999J8065o140O9376
12355c161J29793q5061R8685J56915q966J10797j40078j82870k0382R1217k0429
12344A26460O4766R3922j94946J26805j5749K960M5193N4190m2263j30542J27047
12333B57843J66708m3685j07570j25578j16471L3469Q3373R7845L1706q5861l5670
12322A56109K2530M8993o2293Q4552m6667J20627Q5227p5967K8007k10731j38044
$$ plain form
12399 269029 327248 346385 318462 238180 291976 428661 356616 359038 387133 324813 248976
12388 248976 289131 129794 81557 94918 17886 -39210 102150 199800 273211 99499 16213
12377 16213 147424 217792 279429 277853 213569 175294 336544 218449 259307 238183 92212
12366 92212 47263 7846 -27116 85707 208221 239106 7537 -84462 -66397 -72537 -3161
12355 -3161 126632 41571 140256 297171 288205 399002 258924 76054 55672 146889 126460
12344 126460 191226 285148 90202 217007 201258 204218 249411 303601 261338 130796 257843
12333 257843 424551 380866 273296 147718 31247 64716 148089 245934 277640 191779 156109
12322 156109 178639 227632 165339 249891 203224 323851 409078 333111 361118 150387 12343
12311A2343Q1796m8388k0239J06610J42013K7027j09170J29264K6977k07458m2046
12300I8729J08314J34012K0509j63387Q168N5877j42285j22459J07352j27095
12290b2265P180k9301L1596Q2404P169Q8495j58369k61091k687J23198K21052
12279H7381R7597Q8729K3807m0182j38974k7067O6568r766o081M5823n2287j02913
12267C2635J19671J50646p7997j35132J18722J29909q3008j93419q9527J11500
12257H4000J74133P6811k6486m5415O5265O2622n0473r9093n0654j06371J88571
12246B72910p0330q8001J24374Q9308j1254Q7167J33291J20366J15397j25337
12236F47891q1965j51326l692m0276p9247j5979j53369j1021N6509N7404M9877
$$ plain form
12311 12343 94139 45751 25512 132122 274135 301162 191992 321256 348233 140775 98729
12300 98729 207043 341055 361564 198177 206345 262222 119937 -2522 104830 -22265
12290 -22265 -15085 -44386 -12790 69614 76783 165278 6909 -254182 -256869 -133671 87381
12279 87381 184978 273707 297514 257332 118358 91291 157859 148093 142012 187835 135548 32635
12267 32635 152306 302952 224955 89823 208545 338454 255446 62027 -27500 84000
12257 84000 258133 334944 308458 263043 328308 390930 340457 241364 190710 84339 272910
12246 272910 202580 114579 238953 328261 317007 404174 537465 657831 773228 647891
12236 647891 565926 414600 410908 370632 291385 275406 122037 111016 167525 224929 274806
12225B74806J12431L0761K215k3297m337J93584q2985j93302K8680J41813j3097
12214D67272j79939J92572N2577r231q5409j3737k10798l3169K83168l1295N3676
12203D85687J5836L199l8301m4041r1287J43481Q5982j67718n1181o6367p2968
12192B02322J73284J81478K02232j8148m0614p2609m7895L6097o6516q8748j6990
12181D43893J07693o4950r1464O5268r4882Q1924j55409r7970l6818J03510P4022
12170C34817K6278M2582p7691L084q1579L9609M5527J23201J80257J17836J7738
12159G71659k7989j6515J15105J15816L2406k01892j10048j26550J2637p580K5727
12148E82776K9067K32599J19388j46932j82293n8049K0815O5028J44814j73927
$$ plain form
12225 274806 387237 417998 420213 396916 392579 586163 503178 309876 338556 480369 467272
12214 467272 287333 479905 532482 523251 437842 424105 213307 180138 463306 432011 485687
12203 485687 501523 504722 466421 422380 331093 474574 560556 392838 341657 275290 202322
12192 202322 375606 557084 759316 741168 700554 627945 580050 616147 549631 460883 443893
12181 443893 551586 486636 395172 460440 365558 447482 292073 194103 157285 260795 334817
12170 334817 361095 403677 325986 329070 247491 287100 332627 455828 636085 753921 771659
12159 771659 743670 727155 842260 958076 990482 788590 678542 551992 564629 557049 582776
12148 582776 611843 844442 963830 816898 634605 576556 597371 662399 807213 633286
12138F33286k36497J94324J91859j8616J5754j69606p2654j18710m7062J04828
12128D76906M4763n2354K2088K15045m0416p9145L4025O422J867L9001o1521J20371
12116G27052K45106J00879P1640Q8821o624j50316q6510j22331j36406j4194J19324
12105H36441n0044q6890m8299J17627L08162r3063p4175K41534J48136j01100
12095A198329K7580l3149n4211m2478j11155M6833K35053j2825k6319m765n3676
12084A169217J72825J93745J738n8433j46514p9152k2533l427j05167m7498N2376
12073A127177J64592l6572j0046K1932J62086R07j71488j01113R0352m6103P6475
12062A278199J32387o746n1385j7827J61454K11966o6967q2318p6445J11468J55789
$$ plain form
12138 633286 396789 591113 782972 764356 780110 610504 537850 419140 372078 476906
12128 476906 521669 469315 491403 706448 666032 586887 620912 627334 629201 668202 606681 727052
12116 727052 972158 1073037 1144677 1233498 1226874 1076558 990048 867717 731311 717117 836441
12105 836441 786397 699507 651208 768835 1076997 983934 909759 1151293 1299429 1198329
12095 1198329 1225909 1192760 1138549 1096071 984916 1031749 1266802 1253977 1227658 1222893 1169217
12084 1169217 1342042 1535787 1537525 1479092 1332578 1253426 1230893 1227466 1122299 1074801 1127177
12073 1127177 1291769 1255197 1245151 1267083 1429169 1430076 1258588 1157475 1247827 1201724 1278199
12062 1278199 1410586 1403840 1352455 1334628 1496082 1708048 1641081 1558763 1482318 1593786 1749575
12051A749575J1981P4683K8851n8370j611J1973K60212J67938j56207M4082P4689
12040B207796j10080J42425K97491J34762O6704L3375K0260j5144M2674M6351
12030B866614J61721J41793j5527n4860N366O4888K6536Q2985J0843Q9921R3339
12019C473619O2668J03739N5441J71090J47542J08487J44296K36822N0967J07174
12009D661845N4389O6361K47451J31193k2270J48561J93454J4485j5478J86014
11999E666005J93199M9172J68301K74498K17278J25933o736L34002M33012K03288
11989G657952K28131J86860K72540J76240L33314K51554K86045L29403K77018
11980I999057K37696K32741N04798O21231M53621K80336N39550N79402M12102
$$ plain form
12051 1749575 1761556 1836239 1865090 1806720 1805109 1817082 2077294 2245232 2089025 2133107 2207796
12040 2207796 2097716 2240141 2537632 2672394 2739098 2772473 2792733 2777589 2820263 2866614
12030 2866614 3028335 3170128 3154601 3099741 3105107 3169995 3196531 3279516 3290359 3380280 3473619
12019 3473619 3536287 3640026 3695467 3866557 4014099 4122586 4266882 4503704 4554671 4661845
12009 4661845 4716234 4782595 5030046 5161239 5138969 5287530 5480984 5495469 5479991 5666005
11999 5666005 5859204 5908376 6076677 6351175 6568453 6694386 6687650 7021652 7454664 7657952
11989 7657952 7886083 8072943 8345483 8521723 8855037 9106591 9392636 9722039 9999057
11980 9999057 10236753 10469494 10974292 11595523 12049144 12329480 12869030 13448432 13860534
11971A3860534P43242N57656N98277O55861Q00483P45222Q05162Q35491R27263
11962B0529191Q54446J104283J213849J238952J183412J252729J315124J325482
11954C0017468J295454J699695K107333K038620J982891K122039K436543K475222
11946D6175265K627254K935559K788769L042753L000711L083715L642648L531776
11938G0828450L222496L433281L522288L452219L122858K748624K436293J901715
11930I4668224J230033R13165N71517n9411p13467j429956j793509k247232k713852
11921H8425512k793287l104993l231112l276501l433925l464873l442885l331482
11913F2346454l001261k792486k816566k732292k855165k616766k184721k146332
$$ plain form
11971 13860534 14603776 15161432 15759709 16415570 17216053 17961275 18766437 19601928 20529191
11962 20529191 21383637 22487920 23701769 24940721 26124133 27376862 28691986 30017468
11954 30017468 31312922 33012617 35119950 37158570 39141461 41263500 43700043 46175265
11946 46175265 48802519 51738078 54526847 57569600 60570311 63654026 67296674 70828450
11938 70828450 74050946 77484227 81006515 84458734 87581592 90330216 92766509 94668224
11930 94668224 95898257 96811422 97382939 97323528 96610061 95180105 93386596 91139364 88425512
11921 88425512 85632225 82527232 79296120 76019619 72585694 69120821 65677936 62346454
11913 62346454 59345193 56552707 53736141 51003849 48148684 45531918 43347197 41200865
11905D1200865k136770k033362j945827j843223j782466j447364j390041j474858
11897B7146954j193521j017198j090981j026299r86250j029743r39919q25449
11889A9037594r77674o92927p19607n72761o31691n21500m55356o90357n97740
11880A3177981l51643m46232m05682l04006l77393l72849l51193m74633m48374
11871I645976l04259j58199k16967l20749n81431k64771m0902k6614k08390l92416
11861G131278k86289j23146q686j73534k01403l32329j10076l4749j32069m6230
11851E682767O0053j68849k34726k75625k65904p1614m8585L2080r8923l28199
11841D282475l75863p6209n3383P9126J47957q3224o6192j21696j33154r5592
$$ plain form
11905 41200865 39064095 37030733 35084906 33241683 31459217 30011853 28621812 27146954
11897 27146954 25953433 24936235 23845254 22818955 21832705 20802962 19863043 19037594
11889 19037594 18059920 17366993 16647386 16074625 15442934 14921434 14466078 13775721 13177981
11880 13177981 12826338 12380106 11974424 11670418 11293025 10920176 10568983 10094350 9645976
11871 9645976 9341717 9183518 8966551 8645802 8064371 7799600 7758698 7732084 7523694 7131278
11861 7131278 6844989 6721843 6713157 6539623 6338220 6005891 5895815 5861066 5728997 5682767
11851 5682767 5742820 5573971 5339245 5063620 4797716 4726102 4677517 4709597 4610674 4282475
11841 4282475 3906612 3830403 3777020 3856146 4004103 3920879 3854687 3732991 3599837 3504245
11831C504245j2708p1067n2605j2760J4543n2594J25360k15988j48428O588J03580
11820C188166r8683j31698j6280J40899j50326j1581l0111j19174p829K8178k1564
11809B769997m5078j13406K4453q8168Q965O6701n4361l6081j27169k24707J09393
11798B290539l6671r5492O0558n7523M5360J10976j85247j00984o0181M9522J62369
11787B183226j45631k93226j45756L3209N1155l7842l1114P4042J57667j2542
11777A833188j07681k4457J24174J9069r5299l919k38624O5353Q2015R7975J97776
11766A949570r8458j85802j43792j10149k05665L5054R6327J16873J2592k7339
11756A439211L8271k06222j45200J38244J4737O1127K6686k46082o7290k3335
$$ plain form
11831 3504245 3491537 3420470 3367865 3355105 3369648 3317054 3442414 3226426 3077998 3084586 3188166
11820 3188166 3089483 2957785 2941505 3082404 2932078 2920497 2890386 2771212 2763383 2791561 2769997
11809 2769997 2724919 2611513 2635966 2547798 2556763 2623464 2569103 2533022 2405853 2181146 2290539
11798 2290539 2253868 2158376 2218934 2161411 2206771 2317747 2132500 2031516 1971335 2020857 2183226
11787 2183226 2037595 1744369 1598613 1631822 1682977 1645135 1614021 1688063 1845730 1833188
11777 1833188 1725507 1701050 1825224 1844293 1748994 1745075 1506451 1571804 1653819 1751794 1949570
11766 1949570 1851112 1665310 1521518 1411369 1205704 1240758 1337085 1453958 1466550 1439211
11756 1439211 1477482 1271260 1126060 1264304 1279041 1340168 1366854 1120772 1053482 1030147
11746A030147O8516K0431l9303j37869p3839O115O0738J40589j7501N5815r8879
11735A014960j84261n1780O7112L67616k0946j91111j03338L67l1580J17571j1246
11724I73364j2827J56318q9290j15945K2412N1619j68012J55553J22408j35225
11714I60375j81945j18319m4338q96J18173R7268m3099J8159r6179k80831p3404
11703C54964O2759L6742Q0379k2206J56630J82782j10470r6703J31070p0153j14586
11692E91208j86362n295J42176N5588o1468J59476J6518j87490k2156J34994O7189
11681G04378m3784q921l7057j15579k5141n7292n8351N944j4091n8310R2786K00121
11669E84703L0819M9907J4310j04267O3926m6538q8915j55391l6105R9169K6376
$$ plain form
11746 1030147 1098663 1119094 1079791 941922 868083 874198 934936 1075525 1058024 1113839 1014960
11735 1014960 830699 778919 846031 1213647 1192701 1001590 898252 898619 867039 984610 973364
11724 973364 960537 1116855 1027565 911620 934032 985651 817639 973192 1095600 960375
11714 960375 778430 660111 615773 614877 733050 830318 787219 805378 709199 428368 354964
11703 354964 417723 454465 534844 512638 669268 852050 741580 644877 775947 705794 591208
11692 591208 404846 399551 541727 597315 535847 695323 711841 524351 502195 637189 704378
11681 704378 660594 651673 614616 499037 473896 416604 358253 364197 350106 291796 384582 584703
11669 584703 615522 665429 679739 575472 639398 592860 503945 348554 312449 411618 437994
11658D37994L0550l2307l7613Q2301l8725O2590j8486P6230J4344l9279J1146
11647E48745M694j32261q607O8023Q5105p1136n5698n3707P8277r816K0801M2200
11635E16620M8213J22682J74295J4487r5580l0514J04609o0459k03887l9057n9254
11624D92155k2580j8298j02244n9078L8534N0861N2321L7269l4499n5974J23932
11613E02399R8444K5021n7846j50973k35401k6895Q3775r285M5549R806P829R9429
11601C91852K70807M3049k7411M6743r3744k55074m9999k706l3412l4511J89884
11590D45478L1887l4237R0679N3244j09993n1234k6117J32581J5414j05941r9676
11579C42085L8471j053k6614Q6982j4047n3277K5532k3914n8414p8001l2325q917
$$ plain form
11658 437994 468544 436237 398624 480925 442200 504790 486304 562534 576878 537599 548745
11647 548745 553439 421178 412571 480594 565699 494563 438865 385158 463435 453619 474420 516620
11635 516620 564833 687515 861810 876297 780717 750203 854812 794353 590466 551409 492155
11624 492155 469575 451277 349033 289955 328489 379350 431671 468940 434441 378467 502399
11613 502399 600843 625864 568018 417045 181644 154749 238524 229239 274788 284594 292423 391852
11601 391852 662659 705708 678297 725040 631296 376222 326223 323517 290105 255594 445478
11590 445478 477365 443128 533807 587051 477058 425824 399707 532288 547702 441761 342085
11579 342085 380556 379503 352889 439871 425824 372547 398079 374165 315751 237750 205425 196508
11567A96508j23554J08157N1574r4060n5440r5397O5650P5141J69475p4662j46244
11556G7148J14366J14137j04011Q550K43189P5165j23575k9513r7948o0376o946
11545B10186N5492N948P7469K38908L8613K0634j57992o0188n7890N064P7595
11534D53839j60560q9354J2522N12O6101M1488j8822j12841J47372J10657J1397
11523D62311m2029o7482o8249J8980k1490l5656r9214K51532k2337j01478l2852
11512B42036j37254K74J61069J26141O2615j8580j03640p1061r0145j15086L024
11501E9393J7849O0112R5324j68151j08283J9303j00906J48833K05457P3744j30532
11490A72143q5184K6933J24004J52764r8690j06429m4103j34544J47315P3034
$$ plain form
11567 196508 72954 181111 232685 138625 83185 -12212 53438 128579 298054 223392 77148
11556 77148 191514 305651 201640 210190 453379 528544 404969 375456 277508 217132 210186
11545 210186 265678 271626 349095 588003 626616 647250 489258 429070 371180 376244 453839
11534 453839 293279 203925 216447 216959 283060 324548 305726 192885 340257 450914 462311
11523 462311 420282 352800 284551 303531 282041 246385 147171 398703 376366 274888 242036
11512 242036 104782 105056 266125 392266 454881 436301 332661 261600 171455 56369 59393
11501 59393 77242 137354 232678 64527 -43756 -24453 -125359 23474 228931 302675 172143
11490 172143 86959 113892 237896 390660 291970 185541 141438 6894 154209 227243
11480B27243J36871k07314j36721O8040j1840J9343R0390K0584j57517Q4999O4362
11469A98440j15432j49584J02461K10799K3947l2039j17264n1645R1493K02441
11459C63617l8165q4640J2735J55808n9024O0521J03827n6116j10305j31835q2589
11448A33834P1958M9447l6716p8698p0582M2210J56949K6043o9194K2578Q9584
11437C37413k3831j87354J3913P0022O3761j43087k47080n6343Q2026k4748J02945
11426a2363J46785j03279j66520l0669J57841J92861R2995n5573q9793p1687r9211
11415c8613k6474R9263J41243J38299j10396j97516j36261l2638R1020J0502J83922
11404A22351O8378P5643j99844o6687j32763j60438O2777K14849J91435J07241
$$ plain form
11480 227243 364114 156800 20079 88119 76279 95622 186012 206596 49079 134078 198440
11469 198440 83008 -66576 35885 246684 270631 238592 121328 69683 161176 363617
11459 363617 325452 240812 253547 409355 350331 410852 514679 458563 348258 216423 133834
11448 133834 205792 255239 218523 139825 69243 111453 268402 294445 225251 247829 337413
11437 337413 313582 126228 140141 210163 273924 130837 -116243 -172586 -90560 -115308 -12363
11426 -12363 134422 31143 -135377 -166046 -8205 184656 277651 222078 132285 60598 -38613
11415 -38613 -65087 34176 175419 313718 203322 5806 -130455 -163093 -72073 -61571 122351
11404 122351 190729 266372 66528 -159 -132922 -293360 -230583 -15734 175701 282942
11394B82942O7497j3394n7502J10929L5857P9369l2161j66052k38341L6183k9190
11383G6137m6534j29240K6106O4971J06311k0289P295L4538L2756J47512K11715
11372E11278K4581Q1746n1427J01890m482l13712m3791l8120j3506j37591n9068
11361E7798J08039P5439K7031j18828k65262m7677J78237P4838L7509K4556n3099
11350I8581j24801L9931p3808L6323J87049J46821k1511k0324m6725o195o6357
11339A48984L7183j03521k32952o2764L9887J15849J10951m4792J3154l1961m1899
11328e1881o743J23519L6499j1373M8152n4j97698m3641m0659j5856Q5668L3906
11316d0161L7193m2440M7120L0174J28191J12021j18103j17821M7266l6141q1008
$$ plain form
11394 282942 350439 337045 279543 390472 426329 505698 473537 307485 69144 105327 76137
11383 76137 29603 -99637 -73531 -8560 97751 77462 84757 119295 152051 299563 511278
11372 511278 535859 617605 566178 668068 663586 349874 306083 267963 254457 116866 57798
11361 57798 165837 241276 268307 149479 -115783 -163460 14777 89615 127124 151680 98581
11350 98581 -26220 13711 -60097 -23774 163275 310096 288585 268261 221536 215341 148984
11339 148984 186167 82646 -150306 -213070 -173183 -57334 53617 8825 21979 -9982 -51881
11328 -51881 -58624 64895 101394 90021 138173 138119 -59579 -103220 -143879 -159735 -74067 -40161
11316 -40161 -2968 -45408 1712 31886 160077 272098 153995 36174 83440 47299 -33709
11305c3709O0019N0664Q750K45855n915j30115J08025R943K63j32585j09222O9477
11293A41450J34670n4610R3351L4841m9039k8457n5561j99639j45303J65162J74236
11282B11101n2105j30779j96383r5643j5380L8310P3058K22467J78452j1227L3155
11271B55026k1652j79507j64904K4474J30792R1328J4281j9295j14537j61375
11261a45369n3698l9075K0309J06525J87870L0097p0552n5566J02813J26433N1083
11250B60870o4655o0542m2669j29136J29032m076N1009N2513J31723O5766k37965
11239A51870j67363L6195j43534n4288n1724n4328K18445M4948L5686Q7600M539
11228A08046j9797J9935J20319q3957j18014N7966L1325J10959k2125j00545r5464
$$ plain form
11305 -33709 26310 76974 85724 331579 325664 195549 303574 313517 313780 181195 71973 141450
11293 141450 276120 221510 314861 349702 300663 272206 216645 17006 -128297 36865 211101
11282 211101 158996 28217 -168166 -263809 -279189 -240879 -167821 54646 233098 221871 255026
11271 255026 233374 53867 -111037 -86563 44229 135557 149838 130543 16006 -145369
11261 -145369 -199067 -238142 -217833 -111308 76562 106659 36107 -19459 83354 209787 260870
11250 260870 196215 135673 93004 -36132 92900 88824 139833 192346 324069 389835 151870
11239 151870 -15493 20702 -122832 -177120 -228844 -283172 -64727 -19779 15907 103507 108046
11228 108046 88249 108184 228503 144546 26532 84498 115823 226782 204657 104112 8648
11217H648q6312l1352J34943J57677J63743N9783R2871k64028k33108p3314O0527
11206i922K1334J7665M1495K365J6398L7229J323o7903j02595p0516M0703K58050
11194A85626n5792p7366j92729m1929M7111m5404p8504M046K76547K32617q9618
11183A64605j46229q8130j04492J14458o834n610P3865k45593k9019r6540J51815
11172b17704J61320J93340j8984k15503P9791O5635M5900j2098m8415j10659O7036
11161a0341P5131N1670r9469K1908J43950j57767n7474K5104k970q9902r3070
11150a93230m0290L6056m7491J7838J03114R3991N6367q8609L3998J31008J22397
11139B25149l0864J8143R263j94847k4265J73959n3053K6543j28978j73443P053
$$ plain form
11217 8648 -77664 -109016 25927 183604 347347 407130 500001 235973 2865 -70449 -9922
11206 -9922 11412 29077 70572 72937 89335 126564 127887 59984 -42611 -113127 -72424 185626
11194 185626 129834 52468 -140261 -182190 -135079 -180483 -258987 -254941 21606 254223 164605
11183 164605 18376 -69754 -174246 -59788 -66622 -72232 1633 -243960 -272979 -369519 -217704
11172 -217704 -56384 136956 117972 -97531 -17740 47895 93795 81697 33282 -77377 -10341
11161 -10341 64790 116460 16991 38899 182849 25082 -32392 -7288 -10258 -100160 -193230
11150 -193230 -233520 -197464 -244955 -227117 -124003 -30012 26355 -62254 -28256 102752 225149
11139 225149 194285 212428 221691 26844 2579 176538 123485 150028 21050 -152393 -145340
11128a45340q0392L8444r324p2479M2283K03677m0999q735J0075q7246J42942
11117g094N3781O029K1988N1735P4395j56683m9074j34758o1684Q8351L1654P2690
11105h670R589J03704j8442j26959n226q9401L4458J05653n8752k16751j13126
11094c83923P1289N8475J44220J32804j8566o2837k16680o536N9173j1477J36713
11083i7345M1942j39860K9095J14131J24433k3936n2786o2258K683L4441N6959
11072B7499P2855O5666j66836j57180q5766j057J62955J65278J16254o8450n6960
11061G4258Q8215P1763L9741j52843r0472M4529J23999R9468j33519J1052J40420
11050C16611n2662n6425L0372J92328K58315K7828q145J1713q0865k46713j90990
$$ plain form
11128 -145340 -225732 -187288 -196612 -269091 -226808 -23131 -64130 -72865 -62790 -150036 -7094
11117 -7094 46687 52716 74704 126439 200834 44151 -4923 -139681 -201365 -113014 -81360 -8670
11105 -8670 919 104623 86181 -40778 -46004 -135405 -100947 4706 -54046 -270797 -383923
11094 -383923 -312634 -254159 -109939 22865 4299 -58538 -275218 -281754 -222581 -234058 -97345
11083 -97345 -55403 -195263 -166168 -52037 72396 48460 -4326 -66584 -63901 -29460 27499
11072 27499 100354 166020 -816 -157996 -243762 -244819 -81864 83414 199668 131218 74258
11061 74258 162473 234236 273977 121134 30662 75191 199190 298658 165139 176191 316611
11050 316611 263949 207524 237896 430224 688539 716367 708222 719935 639070 392357 201367
11039B01367l6569j3466J28063L20290K04456O0738j13303J0174J66072K29535
11029A157357L3872j35846M2816P8381Q7386J01712K89561Q1389L5798N368k07445
11018A570349l05881k07588R7817J26109r0499j17089L155J06113R5269m721k4226
11007A248808j06102j83977j36708J16065o7654j05518r5075p9088o7927P3028
10997E95852Q5051M581p9682p8327m7180j76930j88445r8643q915N972J47600
10986A60934J43979k98264j79338q4426J19051L6913M1276P3564j72263p1659
10976b30233P5459Q8863Q1513j0179q1813P1888O1946O4208N8860L6101k08072
10965H541l08542O913N3311K11685P5720J50416o3801p8340N2084o0262J04877
$$ plain form
11039 201367 164798 151332 279395 599685 804141 864879 751576 761750 927822 1157357
11029 1157357 1191229 1055383 1098199 1176580 1263966 1365678 1655239 1736628 1772426 1777794 1570349
11018 1570349 1264468 1056880 1154697 1280806 1190307 1073218 1076373 1182486 1277755 1273034 1248808
11007 1248808 1142706 958729 822021 938086 870432 764914 669839 590751 522824 595852
10997 595852 680903 685484 605802 527475 480295 303365 114920 16277 7362 13334 160934
10986 160934 304913 6649 -172689 -257115 -138064 -101151 -59875 13689 -158574 -230233
10976 -230233 -154774 -65911 15602 5423 -76390 -4502 57444 121652 180512 216613 8541
10965 8541 -300001 -293088 -239777 -28092 47628 198044 134243 55903 107987 47725 152602
10954A52602j43121n8175P3512J16345p4830J4662r8589o3423J72664J71452j19335
10943A43764j64395L4208K7103p7139J6361N3572m4022q8644j37613O9428O9510
10932i7867M3196j57980m4145k9260J29125J34923L4762o5734r8740l6972L9303
10921a49389J68433J71916p9151n622K67151o2197l04826j00427p080O713j22997
10910b17476O5361N4002N3935K42982M3846j17779j36080P4227O2460n9261L866
10899G0083O8830r0203j25880j06299j10579K01325K23746L8557j72867J07844
10889A04557J17353j50736j25282P1163M8191J73907n6850j0900k07725j5877
10879e2199J39778l9507n9322n5827p9879o6173J23046O2370j11573l6725O3624
$$ plain form
10954 152602 9481 -48694 24818 141163 66333 80995 -17594 -81017 91647 263099 143764
10943 143764 -20631 13577 40680 -36459 -20098 33474 -10548 -99192 -236805 -167377 -97867
10932 -97867 -54671 -212651 -256796 -286056 -156931 -22008 12754 -52980 -151720 -188692 -149389
10921 -149389 19044 190960 111809 106187 373338 311141 6315 -94112 -101192 -94479 -217476
10910 -217476 -152115 -98113 -44178 198804 242650 124871 -11209 63018 125478 66217 70083
10899 70083 138913 48710 -77170 -183469 -294048 -92723 131023 169580 -3287 104557
10889 104557 221910 71174 -54108 17055 65246 239153 182303 171403 -36322 -52199
10879 -52199 87579 48072 -11250 -67077 -146956 -213129 -90083 -27713 -139286 -176011 -112387
10868a12387q4920J9860J30867q5387q7605j06421r905J01140Q7752q6288J05131
10857a28163J10642j0073n9301o8919K05418n97P49J78545K56296l5599q5381
10846C63617q1933L2831j8259j18449k11505m2535J46519O1887n5597J8930l2758
10835F2748j26721l8845m9285J54358L4074J20498o9526p4207R85j50791J1838
10824a24874J71691N4024l2337m7827q4278L7162J80994J35990j9365Q19n5427
10813B16572q1749N0623O2090m9821J584j28719j4321P6563M081j72778p2948
10802a08823n7386o3217K4201n0957K7994Q9762n7035o5955M9361N3697J78231
10791A9873k9559j41395L4497O185o0042m6408O2745P687J43299o7930p7712J2971
$$ plain form
10868 -112387 -197307 -177447 -46580 -131967 -219572 -325993 -335898 -234758 -147006 -233294 -128163
10857 -128163 -17521 -27594 -86895 -155814 49604 49007 49756 228301 484597 448998 363617
10846 363617 281684 314515 296256 177807 -33698 -76233 70286 132173 76576 95506 62748
10835 62748 -63973 -102818 -152103 2255 36329 156827 87301 13094 14079 -136712 -124874
10824 -124874 46817 100841 68504 20677 -63601 -26439 154555 290545 271180 271999 216572
10813 216572 134823 185446 247536 197715 199299 70580 56259 132822 136903 -35875 -108823
10802 -108823 -166209 -229426 -205225 -256182 -228188 -138426 -195461 -261416 -212055 -158358 19873
10791 19873 -9686 -151081 -116584 -110399 -170441 -216849 -154104 -146417 -3118 -71048 -148760 -135789
10779a35789J65788L4224j7122m1986j06154K7778J22856J84869L7512o8178k16284
10768a2486k62645p788Q9467J75625P0155r1062k40791l9486J86444K12061N1512
10757A31006j01007o3153O5351O4284J06078o1657l583j106L6492J43761p5007
10746B41459j51637j77001J58426Q5282n8699j94135m5434j14099R1717N5751
10736a08370J5039N2445M4848o7147q3445N0266m1905q1366k6469o6274m0726
10725c53104K09479J33525q6560j18564l3079p9705j11443k19090K4347J50782
10715d83412J84537P2438q4419J39834Q0354P6226j80582n0050j5292J62545J18629
10704B0808r1539m9661Q7352m1268J67360K5786P1449J1351L9812n9970J16113
$$ plain form
10779 -135789 29999 64223 47101 5115 -101039 -73261 49595 234464 271976 203798 -12486
10768 -12486 -275131 -282919 -193452 -17827 52328 -38734 -279525 -319011 -132567 79494 131006
10757 131006 29999 -33154 32197 96481 202559 140902 137319 136213 172705 316466 241459
10746 241459 89822 -87179 71247 156529 97830 -96305 -141739 -255838 -164121 -108370
10736 -108370 -93331 -40886 3962 -63185 -146630 -96364 -138269 -219635 -246104 -312378 -353104
10725 -353104 -143625 -10100 -96660 -215224 -248303 -328008 -439451 -658541 -634194 -483412
10715 -483412 -298875 -226437 -310856 -171022 -90668 -14442 -195024 -245074 -260366 -97821 20808
10704 20808 -70731 -120392 -33040 -74308 93052 118838 190287 201638 241450 181480 297593
10693B97593o0384L893o9640l0369J16071J02597J6011j95612J26464O1582j5866
10682C52340R5238j5541j23274L4863j3276Q9956J79789j182k04154j00191J80130
10671D74698P1898l9854O0963P710o5471o8435J5374K76321K38090M1147j24438
10660H88003j10620K4188M4957o4348J27738L57695M13553J09537J61927K22446
10650B175076J08562N09844M35082k50676m25657m33474k17838L0183O554P1130
10640B008786P898K3877L71803M00491M69937L95259O33272P53694P79184Q43013
10630F687214L37741L18247N36491P32637R56251J331732J907836K603790L493348
10621A8905287M669946O318549Q520554J1251568J3455337J4673179J3167466
$$ plain form
10693 297593 237209 241102 171462 141093 257164 359761 375772 180160 306624 368206 352340
10682 352340 447578 432037 308763 343626 330350 420306 600095 598913 394759 294568 474698
10671 474698 546596 506742 567705 575415 509944 441509 456883 733204 971294 1012441 888003
10660 888003 777383 801571 846528 782180 909918 1267613 1681166 1790703 1952630 2175076
10650 2175076 2283638 2793482 3228564 2977888 2552231 2118757 1900919 1931102 1937656 2008786
10640 2008786 2016684 2040561 2412364 2812855 3282792 3678051 4311323 5065017 5844201 6687214
10630 6687214 7024955 7343202 7879693 8612330 9568581 10900313 12808149 15411939 18905287
10621 18905287 23575233 29893782 38414336 49665904 63121241 77794420 90961886
10614I0961886Q101278J282224l823691m743727k737049J487747O634858J2858787
10606A10022313K0151958K6600076K9623136K5317908J0942681p762206j9340631
10599A95555235j9516694j3107007m103233N355635J5794366K6190429L4572348
10592B40741079L6714324K7056675M052528k2944793l7695511l6453218k7199144
10585A84271940j6286258n759199L834621J1988864J7720777J8295427J0552946
10578B24619118n650558k3081778l1029318k8350949k0973219j3290823o899270
10571I5343203j734633K113481M173947L785211K138o601272j2767496j5420806
10563F8893773j4307956j1519249q800408o563825m739637l599646k595202k147544
$$ plain form
10614 90961886 99063164 100345388 96521697 91777970 89040921 90528668 97163526 110022313
10606 110022313 130174271 156774347 186397483 211715391 222658072 214895866 195555235
10599 195555235 176038541 162931534 158828301 164183936 179978302 206168731 240741079
10592 240741079 277455403 304512078 308564606 285619813 247924302 211471084 184271940
10585 184271940 167985682 162226483 166061104 178049968 195770745 214066172 224619118
10578 224619118 218968560 195886782 164857464 136506515 115533296 102242473 95343203
10571 95343203 93608570 95722051 99895998 103681209 103683347 97082075 84314579 68893773
10563 68893773 54585817 43066568 34266160 27702335 22962698 19363052 16767850 14620306
10555A4620306j739189j536907j250777j025332q63513o41357n90708n31654m69266
10546E971603m20789l56423l25209l92403k86682l13142k09100k47464r1423j53868
10536C175100j75629o2082j8473j25788j07966j81170j44270k51728n9234J45311
10526B194071p700k36378j00056n1934l8894K02568r2175j47681m5409J8128J21614
10515A816154J55j67164j54841j92944j73481m4018l4704J4740j8130m5783p1738
10504I28246j00822L1792j03936R0197K0217j02749J22172K20785j00410j53099
10494H52393o4026R077P8134J18713R625J15611k1344p655k25588j08225L1938
10483G88653K3647M9791O1828K3082N5472l358O2337J62389l416l4521J61422
$$ plain form
10555 14620306 12881117 11344210 10093433 9068101 8204588 7563231 6972523 6440869 5971603
10546 5971603 5550814 5194391 4869182 4476779 4190097 3876955 3667855 3420391 3328968 3175100
10536 3175100 2999471 2937389 2918916 2793128 2685162 2503992 2359722 2107994 2048760 2194071
10526 2194071 2186371 1949993 1849937 1798003 1759109 1961677 1869502 1721821 1676412 1694540 1816154
10515 1816154 1816309 1649145 1494304 1301360 1127879 1083861 1049157 1063897 1045767 999984 928246
10504 928246 827424 859216 755280 845477 865694 762945 885117 1105902 1005492 852393
10494 852393 788367 797444 875578 994291 1003916 1119527 1098183 1090528 864940 756715 788653
10483 788653 812300 862091 923919 947001 1002473 999115 1061452 1223841 1220425 1185904 1347326
10472A347326L9416j16479M1150j600p8780M201J53183q3129k9575m714m126N4543
10460A321416J5003l3509o3873j25814Q9181O4724l28501k5932J52671J58906
10450A224272R5377m4559k52551q1322j28102j66156j03975J9174K18048J724
10440G81930l5719Q8160J11276r8496j70479l09493j4400J7046J69580J38131
10430F77536Q4658J38816J0752j45982j59406L1937P5269M7134l192J23998p227
10419H74293j67032r6308q1148J0693J11655q4977j1065J40708j47671P152P7728
10408F34028L3576N0620q09k6315L2595j3823J73441J5624j27335m8074k4313
10397F99215m8735j29630j5486p0743J49893j66537J6503J3160o1822j37217k9416
$$ plain form
10472 1347326 1386742 1270263 1311413 1309813 1231033 1235234 1388417 1305288 1275713 1270999 1266873 1321416
10460 1321416 1336419 1302910 1239037 1113223 1202404 1267128 938627 912695 1065366 1224272
10450 1224272 1319649 1275090 1022539 941217 813115 646959 542984 562158 780206 781930
10440 781930 746211 834371 945647 847151 676672 367179 352779 369825 539405 677536
10430 677536 762194 901010 911762 765780 606374 638311 713580 760714 757522 881520 874293
10419 874293 707261 610953 529805 540498 652153 567176 556111 696819 549148 556300 634028
10408 634028 667604 718224 717415 691100 723695 709872 883313 898937 771602 723528 699215
10397 699215 650480 520850 505364 434621 584514 417977 434480 447640 385818 248601 219185
10386B19185O9105N5841L10292J54754m346l05745j87789l316J500R242P4461
10375C93184M5039m9506j22277j24697R6752m1261M7437K0381l5039M843K42931
10364D77787K5060k8338k23199j81360O3568K00326J17682J13626m3119m55j14808
10353D06770j82826J01722j5492M448J9303K6912J49771J16875K1874k14837r7154
10342C37366J2094K5534l7392N351P3126N4381j03456j07461J48321J50534n0192
10331E08206Q1024M9512o2010j83045j56293L2033M49n3733N5668J45158R795
10320D26764p9659n3783N9500N4985j04662N0685N6885L7864j61335n461l0166
10309B51617q4113J46709K66921l0993n2727n3793m4166r206J8780j74249j42190
$$ plain form
10386 219185 288290 344131 654423 809177 804831 499086 311297 307981 309481 318723 393184
10375 393184 438223 388717 266440 141743 238495 197234 244671 265052 230013 234856 477787
10364 477787 502847 474509 251310 69950 133518 333844 451526 565152 522033 521578 406770
10353 406770 223944 325666 310174 314622 333925 360837 510608 627483 649357 434520 337366
10342 337366 349460 374994 337602 342953 416079 470460 367004 259543 407864 558398 508206
10331 508206 589230 638742 576732 393687 237394 269427 269876 216143 271811 416969 426764
10320 426764 347105 293322 352822 407807 303145 353830 410715 448579 287244 281783 251617
10309 251617 167504 314213 581134 550141 497414 443621 399455 390249 409029 234780 92590
10298I2590J38441m8851N1450L7200l4860o2389j3872n4714j17159Q5689K36569
10287C10094J6414K3098J74729L4721k9467m8473j13502j28658o9857N6845N1282
10276B77226J09978P0260J21807J41382J47741q4044K74357M70205K75584J46066
10266A950562J89258J00937j15339n4314k5434l20831m21997j61460p7664j78328
10256H85390j98182k15843j76715O800J60957j46195j7832M0537n2525O1005K0215
10245C67612o0200L1569M7224q8802o300J14990j32312o0455M7471m2939J15382
10234C33240J77505m5613k09299j63125M9953K96336R1501k00480j38000k17438
10224b5420L4293Q901K0007o1813O200l9766K9262J44097o5698R0357P3657q3647
$$ plain form
10298 92590 231031 182180 233630 270830 235970 173581 159709 104995 -12164 73525 310094
10287 310094 326508 349606 524335 559056 529589 481116 367614 238956 169099 225944 277226
10276 277226 387204 457464 579271 720653 868394 784350 1058707 1528912 1804496 1950562
10266 1950562 2139820 2240757 2125418 2071104 2045670 1724839 1302842 1141382 1063718 885390
10256 885390 687208 471365 294650 301450 462407 316212 298380 338917 286392 347397 367612
10245 367612 307412 338981 386205 297403 291103 406093 273781 213326 260797 217858 333240
10234 333240 510745 465132 255833 92708 142661 438997 530498 330018 192018 -25420
10224 -25420 8873 17774 37781 -24032 -17832 -57598 -28336 115761 50063 140420 214077 130430
10212A30430l1597L9112j06003m7009K2086O8971L2754j08325q8806N6168J16590
10201H4371K9931j0056n1903K8268k4047k2740j36055J59057J92974k251m1906
10190B05643j5275J21865n560n1938j53673K50377l9626L4064L2844J3319P5684
10179D67724J72025P0831p3463n941M8102M7823p0462L5661L03441N5831m6019
10168A005553L0666J76440O9826p5952J4412m8457k744j44501n4074R4549O5105
10157A130823R7088K39348L63590J44947l44714k43438j57438k28255r2795N6469
10147I65625j48610K5231R817K28204J29738P3860k1655j40232l07469k09129
10137F05380m8173l9558k5360k8213N3791Q8320M7794J0309J52387m7783p370
$$ plain form
10212 130430 98833 137945 31942 -15067 7019 75990 108744 419 -88387 -32219 84371
10201 84371 114302 104246 52343 80611 56564 33824 -102231 56826 249800 247549 205643
10190 205643 190368 312233 306673 254735 101062 351439 311813 345877 378721 392040 467724
10179 467724 639749 710580 637117 631176 679278 727101 656639 692300 995741 1051572 1005553
10168 1005553 1036219 1212659 1282485 1206533 1220945 1172488 1169744 1025243 971169 1065718 1130823
10157 1130823 1227911 1467259 1830849 1975796 1631082 1387644 1230206 1001951 909156 965625
10147 965625 817015 842246 852063 1080267 1210005 1283865 1262210 1121978 814509 605380
10137 605380 557207 517649 492289 464076 517867 606187 653981 664290 816677 768894 761524
10126G61524j2100j67851j12931O0048o845j37588j51602J538K8218L795j49134
10115A17072L2684O004J11527K27618O3233j11113L8006L7141N9420p0202r5726
10104D15664k28441k547J9181R4898P2187j59729o0950J15783j7045j49782N173
10093A04392J96989M3258m7494k16470r2621P7218o0924K0605l8896j02323j45749
10082b62015p3165R5406K6556l8667k0391J25832O343n2421J46222J01371Q612
10071F3683N818R0651J32809j03257k45333o2590J26284J48675P8924k22052K6959
10060D0571J33796j42624n808M6886r342m456L897J53498J3719J09858j16938
10049B23057j66501j25273q7592O546M7636j0069P3381P6931J32530m4866j6383
$$ plain form
10126 761524 749424 581573 468642 528690 521845 384257 232655 234193 262411 266206 117072
10115 117072 149756 155760 267287 494905 558138 447025 485031 522172 581592 511390 415664
10104 415664 187223 184676 203857 298755 370942 211213 150263 266046 249001 99219 104392
10093 104392 301381 344639 297145 80675 -11946 65272 4348 24953 -13943 -116266 -262015
10082 -262015 -335180 -239774 -213218 -251885 -272276 -146444 -140101 -192522 -46300 55071 63683
10071 63683 69501 160152 292961 189704 -55629 -118219 8065 156740 235664 13612 40571
10060 40571 174367 31743 25935 72821 63479 59023 62920 216418 230137 339995 223057
10049 223057 56556 -68717 -156309 -149763 -102127 -112196 -38815 38116 170646 125780 109397
10038A09397m8481n5236P293o981l0442O8078J19205O4132m0671m458j1685j4248
10026A55903P1598l7147L3807J6279j10487N4289N277j00146P9550j1794k5523
10015A31606K340m0537j41422o0437J42405l7168q2375j6384P2084j6099P8420
10004C2433J36517k0502N5189m2112q2192P5534n9055L8610m9140K5155O9195
9993A79632j58368N3525R6977M1551j51336o7779J18726J57698O0755j29765j80521
9982B1095M931j31253j4403Q0919O5033M0246j38773j4016M8824K3763J7519m7613
9970d3728Q824M3265j9254k04908N5537J06073q4700m115P587K4401r7809K09621
9958G94K63891R6723n4001j36740p7929L4400l3715J51428r284j88313k19944
$$ plain form
10038 109397 60916 5680 12973 5992 -24450 43628 162833 226965 186294 181836 170151 155903
10026 155903 227501 190354 224161 240440 129953 184242 189519 89373 168923 157129 131606
10015 131606 133946 93409 -48013 -108450 33955 -3213 -85588 -101972 -29888 -45987 32433
10004 32433 168950 148448 203637 161525 79333 154867 95812 134422 85282 110437 179632
9993 179632 21264 74789 171766 213317 61981 -5798 112928 270626 331381 201616 21095
9982 21095 26026 -105227 -119630 -38711 26322 66568 -72205 -86221 -37397 -13634 3885 -43728
9970 -43728 -34904 8361 -10893 -215801 -160264 -54191 -138891 -143006 -135419 -111018 -208827 794
9958 794 264685 361408 307407 170667 92738 127138 93423 244851 235567 47254 -172690
9947a72690j33597J75515J53062l3017j11342j09931J42985J16426M8924o6277
9937A0058n3024M1920j5232j0638j56932L7858J28899N2138J17424j09084j3768
9926B9619K6023R9415J50773j6263j79656j07112j90024j19044L5438L5082Q8487
9915a47262P9713O4507J0736M4706O5981j97151j5908Q0732J06501j0392M9836
9904A31999k7262r3198q2653J82230J35374K0629o0776o8054J17684K405l9849
9893B18529k608p296p5224j56489j82461o9815l3910P1257J97727J02334j09622
9882d7578j1597K3645l1147J9274k630O8630k186k5117j20702M6428Q8025K4729
9870B9774J50518l7196j63187j11871J21993L5814J36156q6164j54056J07228
$$ plain form
9947 -172690 -306287 -130772 22290 -10727 -122069 -232000 -89015 27411 76335 10058
9937 10058 -42966 -1046 -16278 -26916 -183848 -145990 -17091 35047 152471 43387 29619
9926 29619 55642 155057 305830 289567 109911 2799 -187225 -306269 -270831 -235749 -147262
9915 -147262 -67549 -3042 7694 52400 118381 -78770 -94678 -13946 92555 82163 131999
9904 131999 104737 11539 -71114 111116 246490 267119 206343 138289 255973 258378 218529
9893 218529 215921 208625 133401 -23088 -205549 -275364 -309274 -238017 -40290 62044 -47578
9882 -47578 -59175 -35530 -66677 -47403 -50033 18597 16411 -8706 -129408 -82980 5045 29774
9870 29774 180292 143096 -20091 -131962 -9969 25845 162001 75837 -78219 29009
9860B9009j34581r7246J44721J2606m9909p466J6241J2847l7124O7083J11906
9849F8087J097o7275M2181Q7818J13793j620j05033n0791j3285Q8933M3850L0229
9837B37984j3258n5905m9482j13364k88693J13605P0815o2327P9180J98718O6199
9826A83472J13569M3379p5796M9217L701j95009l1911J31601P267k8907j22261
9815G8322j08647O6784K79900M1220n5666n4213p8213l8480j0677J0153q045L2316
9803A54754o8578Q431j42657o6566J08858N8196q4144J6778O4680J45443j42958
9792E2237j51883n0422K1764o5454K4518O4538P1152K00333N551j43676n6985
9781b8327m3075m4517R52o0539L1487J8478k4663N9112Q0430L4397m2802o8321
$$ plain form
9860 29009 -105572 -202818 -58097 -45491 -95400 -102866 -86625 -73778 -110902 -43819 68087
9849 68087 69184 1909 44090 131908 245701 244081 139048 88257 74972 163905 207755 237984
9837 237984 224726 168821 119339 5975 -282718 -169113 -98298 -160625 -81445 117273 183472
9826 183472 297041 340420 264624 313841 317542 122533 90622 222223 229490 200583 78322
9815 78322 -30325 36459 316359 357579 301913 247700 169487 131007 120330 130483 122438 154754
9803 154754 86176 94607 -48050 -114616 -5758 52438 -31706 -14928 49752 195195 52237
9792 52237 -99646 -150068 -128304 -193758 -169240 -104702 -33550 166783 172334 28658 -28327
9781 -28327 -71402 -115919 -114967 -175506 -144019 -125541 -150204 -91092 -10662 23735 -19067 -87388
9769h7388k8264Q3777O5189J07520n6238K8249P730q270K57197r1159j75204j44019
9757d0880R648J95047N0489n0660O828L9220j36957j44108R896K6763J16062K8069
9745A09417r9778k7400J38727J37815l3473l5338p2768j39081j83608n2499m192
9734b62178J36902R8690l6429n1011J78426J44856q1346k88824k6494K528l6975
9723b21855L7053j4557K036l9769J93018P4053p3812k12549q4J04132J18500j15569
9711a49403O5810J30041r851M7762J9093J04048M3838M3631J01765r6666j30843
9700A69225p5655r4779m5997n0212o7103o4485n8722K4502J05491J62318J92347
9689A96930m841J26217q4457j34029l9722K5192k28493l6291L5463K19093O5378
$$ plain form
9769 -87388 -115652 -31875 33314 140834 84596 112845 120575 112305 369502 278343 103139 -40880
9757 -40880 -31232 163815 214304 163644 170472 209692 72735 -71373 -61477 -34714 81348 109417
9745 109417 9639 -17761 120966 258781 225308 189970 117202 -21879 -205487 -257986 -262178
9734 -262178 -125276 -26586 -63015 -114026 64400 209256 127910 -160914 -187408 -184880 -221855
9723 -221855 -184802 -199359 -197323 -237092 -44074 29979 -43833 -256382 -256466 -152334 -33834 -149403
9711 -149403 -83593 46448 36597 84359 103452 207500 251338 294969 396734 300068 169225
9700 169225 93570 -1209 -47206 -97418 -164521 -229006 -287728 -263226 -157735 4583 196930
9689 196930 192089 318306 233849 99820 60098 85290 -143203 -179494 -144031 75062 140440
9678A40440j73700j75202O857P0889J4827k4871N6748J5897n4774K6588J14735
9667A8434j4852k19889j27877L9890K68831J47378M8337J32596R1603k46247k92054
9656a53850l6636J9728P6929O5607J88166K96190M2018j12836j57452r0941j61519
9645b4596P4099O1556N4840j59071p2596K29462K8776p8291r6263j6519l1080
9634b9683k3751l614O2561Q8949j99488l2684j0390J74577J25894j3960k6392
9623A12019n0067N1918j0469M2101O6311K6809j70257L5230K59261J31541j65872
9612C28525k70238o6201N9512J2065n8968K31187Q1202j59585k18469J59036O9206
9601A67272k03651r1594J32083O2710N1965q7750j50921j40423N6363J32626O349
$$ plain form
9678 140440 -33260 -208462 -201605 -130716 -115889 -140760 -84012 -68115 -122889 -96301 18434
9667 18434 3582 -216307 -344184 -304294 -35463 111915 160252 292848 384451 138204 -153850
9656 -153850 -190486 -170758 -93829 -28222 159944 456134 498152 385316 227864 136923 -24596
9645 -24596 49503 111059 165899 6828 -65768 163694 192470 114179 17916 1397 -29683
9634 -29683 -53434 -57048 5513 94462 -105026 -137710 -148100 26477 152371 138411 112019
9623 112019 61952 113870 103401 145502 211813 238622 68365 103595 362856 494397 328525
9612 328525 58287 -7914 51598 63663 4695 235882 317084 157499 -60970 98066 167272
9601 167272 -36379 -127973 4110 66820 118785 31035 -119886 -260309 -203946 -71320 -64971
9590f4971N4522J20439J38872r0314j00649k11102n8884o1620J29159J93347M872
9579E3671j98289q3412J10545J00593j65619m8753O7962j52924r4547J53935L7388
9568b19450P6888r1005j36445J53445m1999J5357l8839J59658O5063J72789p686
9557A07776j62576j13548P4571J81986N3294M1042j67549n1044J27094J82543
9547B73589L2253k07619p2276j53662N9500l5578j59066J59813J13347o3556l9553
9536i2808N0351q4229q5522O3155o2034q6659N0389N3896j09659q0971n4595n837
9524d44523J93220K04202M9296n3779K8027J662K0385K18515J03717j56678k07571
9513d3527l5705j06219N8553J76351J85331r7065j15304J14060M5323j93568p9116
$$ plain form
9590 -64971 -10449 109990 248862 158548 57899 -153203 -212087 -273707 -144548 48799 53671
9579 53671 -144618 -228030 -117485 -16892 -182511 -231264 -163302 -316226 -410773 -256838 -219450
9568 -219450 -142562 -233567 -370012 -216567 -258566 -243209 -282048 -122390 -57327 115462 107776
9557 107776 -54800 -168348 -93777 88209 141503 182545 14996 -36048 91046 273589
9547 273589 305842 98223 25947 -127715 -68215 -103793 -262859 -103046 10301 -53255 -92808
9536 -92808 -42457 -126686 -212208 -149053 -211087 -297746 -247357 -193461 -303120 -384091 -438686 -444523
9524 -444523 -251303 -47101 2195 -51584 -23557 -21895 -1510 217005 320722 164044 -43527
9513 -43527 -79232 -185451 -126898 49453 234784 137719 22415 136475 181798 -11770 -90886
9502i0886L0451N4817J09302p8648m486k04688n6907J47729J67388K1106j28529
9491c3351p1827R8266J18475M383j10133L6373J03278K3485j18125k5612j14919
9480h9707j43356J36299J19776l5559p1002R0O2530R7342j34512o3703J42358
9469B0556N5051p5554R7640R8431l0160L2934j22210m6347P0883R4849K9251l1541
9457A93783p7181k0912l2774q1373K4627L0215J18909q0970j03203p8461J27888
9446B0548O6023o0459j28979j11575j4130K37765K3608J91430N8033k2118q1026
9435A79120J40658o7432j53896k33237K086j26109N1268J4780J14864M4333L0655
9424b910N1626j93526n0846K35757J18608K991j28258j61773j24666M040n8391
$$ plain form
9502 -90886 -60435 -5618 103684 25036 20550 -184138 -241045 -93316 74072 95178 -33351
9491 -33351 -105178 -6912 111563 115946 5813 42186 145464 168949 50824 25212 -89707
9480 -89707 -233063 -96764 23012 -12547 -83549 -83459 -20929 76413 -58099 -121802 20556
9469 20556 75607 53 97693 196124 165964 198898 76688 30341 101224 196073 225324 193783
9457 193783 116602 95690 62916 -18457 6170 36385 155294 74324 -28879 -107340 20548
9446 20548 86571 26112 -102867 -214442 -228572 9193 32801 224231 282264 260146 179120
9435 179120 319778 252346 98450 -134787 -132701 -258810 -207542 -192762 -77898 -33565 -2910
9424 -2910 48716 -144810 -195656 40101 158709 161700 33442 -128331 -252997 -248957 -307348
9413c07348J08232J49372K7786r2009R8256m3158p4416J4532K6364l1025l5282
9402a58696J29174n0529N0794J84258O0992r3811M2379j7090Q9440l9048j99052
9391a189o8780q2941M6451K3139N913L2217l831L3759J08287K458J6400q3368
9379B8515n4608M8962K65008m3368j71839k3244J01497m6P3223L987j5941m5436
9367A66710m7998l1056j55925n1697N2823k4722J69514O6390j58369j38577R4943
9356e7964M6420L2229L8110q2852j47031L2529R6423k7890p456P4043J01323k0985
9344G6899r7253j17152M8701J4793L3923O771j39119m0876Q9875K1103Q6244k5080
9332d1171J5702K2645M5762L8093J77700q4500q7171n7087n6756l482P3399M998
$$ plain form
9413 -307348 -199116 -49744 -21958 -113967 -15711 -58869 -133285 -118753 -92389 -123414 -158696
9402 -158696 -29522 -80051 -29257 155001 215993 122182 164561 147471 236911 197863 -1189
9391 -1189 -69969 -152910 -106459 -83320 -77407 -45190 -49021 -15262 93025 95483 111883 28515
9379 28515 -26093 22869 287877 244509 72670 49426 150923 150877 224100 228087 212146 166710
9367 166710 118712 87656 -68269 -119966 -67143 -91865 77649 144039 -14330 -152907 -57964
9356 -57964 -11544 20685 58795 -24057 -171088 -138559 -42136 -70026 -77482 -3439 97884 76899
9344 76899 -20354 -137506 -88805 -74012 -40089 -33318 -172437 -213313 -123438 -102335 -16091 -41171
9332 -41171 -25469 -2824 42938 81031 258731 174231 87060 29973 -26783 -30265 43134 48132
9320D8132o7608J35352K45748p2705j36263p4054l4818M2619M7m9117n0395j56691
9308a69753J2156R0500k3489O619J58272L6532m7002j92902n6742Q2463J3480
9297h9866J3614K41833k04154j55078k9814J21625J97097j0951o2909P6227p4076
9286B3548m9043J8481J06513M6252O5738J8964q244j60693j54718q9910l8934
9275b22046j19716K03319R7001j3525r9026P8550K6637n1369R3869m2651o7843
9264a16800M4498M4278k6576j9279n7316K40413M02017N334K232j71983j37391
9253B09427j40599n0837K065N9372m6978K3308j56013J0967O3927r609j4844K008
9241d7806j13304r3212M0672J00604n2001P4786J83596k6111j62343n8574J35875
$$ plain form
9320 48132 -19476 115876 361624 288919 152656 78602 43784 86403 86450 37333 -13062 -169753
9308 -169753 -157597 -67097 -90586 -83967 74305 110837 63835 -129067 -185809 -103346 -89866
9297 -89866 -76252 165581 -38573 -193651 -223465 -101840 95257 84306 21397 97624 23548
9286 23548 -25495 -7014 99499 145751 211489 230453 222209 61516 -93202 -183112 -222046
9275 -222046 -341762 -138443 -41442 -54967 -153993 -75443 -48806 -100175 -6306 -48957 -116800
9264 -116800 -72302 -28024 -54600 -73879 -131195 109218 511235 516569 518801 346818 209427
9253 209427 68828 17991 20056 79428 32450 55758 -100255 -89288 -25361 -34970 -49814 -47806
9241 -47806 -161110 -254322 -213650 -113046 -165047 -90261 93335 67224 -95119 -153693 -17818
9230a7818Q586L0223k4587o6361R5466N6563Q557k5742r0189n2764K3478M1593
9218a2995K26113L5031o8562K371o3157K0863j5467j12735J3699o4402k01763
9207b41004m0945K7986K48751K00507n2044j98093q5372l8656j04302K2983K29740
9196c0449N6265j80583q5017J01136P3689R4529Q4753O0499R8j17785j02932p2936
9184a18733O0342J49401K30951M2728l00028j01026p933J06055k837N8135p478
9173A09577K2279j1566l56M5928j67456Q4522q5585r0912K52974Q3420n3569J9712
9161B08968p8151J2406N810k6912L3419j59789j53441J61748O9140m874M3611
9150A11935L3033j36204n1774N0231J46695P4968m7933l5139o6725j15238j92886
$$ plain form
9230 -17818 -9232 20991 -3596 -69957 25509 82072 90629 64887 -25302 -78066 -54588 -12995
9218 -12995 213118 248149 179587 181958 118801 139664 124197 11462 25161 -39241 -241004
9207 -241004 -281949 -253963 -5212 195295 143251 -54842 -140214 -178870 -283172 -260189 -30449
9196 -30449 25816 -154767 -239784 -138648 -64959 29570 114323 174822 174920 57135 -45797 -118733
9184 -118733 -58391 91010 321961 364689 64661 -36365 -44298 61757 58920 117055 109577
9173 109577 131856 120290 119934 165862 -1594 82928 -2657 -93569 159405 242825 189256 208968
9161 208968 130817 143223 149033 122121 155540 -4249 -157690 4058 73198 68324 111935
9150 111935 144968 8764 -43010 7221 153916 228884 180951 145812 79087 -36151 -229037
9139b29037r404J01462l9306J22037O9752j542R4637m8890j8439k1459N9230n2599
9127B6442j76080R6676J50346j15439j504q5637j55628J26903M2872M4518P7388
9116C0857m188r2738n343J00391l1277L9109j06777R2011J2490K0618L5415n2430
9104C8138j97431n0870K44272J36114j11674q2327N0542m132R9105L8364j16958
9093D3143l3550N2442r8785p5891q1993l5388K231K38171J23770r0842n6833o1336
9081g4861m9595N4557L1311n1587J33252K81442l9635j55476r0054j44921k3979
9070a29546m1046Q3307k2164j61585j56903K6542J56963N9882j5438J05237J25007
9059C0256J45367j57490n9449R7917K19107M1061j63762k1719l658J04535J9256
$$ plain form
9139 -229037 -238441 -136979 -176285 -54248 15504 13962 108599 59709 41270 19811 79041 26442
9127 26442 -149638 -52962 97384 -18055 -19559 -105196 -260824 -133921 -91049 -46531 30857
9116 30857 26669 -66069 -71412 28979 -2298 36811 -69966 22045 34535 55153 90568 38138
9104 38138 -159293 -210163 34109 170223 58549 -23778 26764 22632 121737 160101 43143
9093 43143 9593 62035 -36750 -112641 -194634 -230022 -227791 10380 134150 43308 -13525 -74861
9081 -74861 -124456 -69899 -38588 -90175 43077 324519 284884 129408 39354 -105567 -129546
9070 -129546 -170592 -87285 -109449 -271034 -427937 -401395 -244432 -184550 -199988 -94751 30256
9059 30256 175623 18133 -41316 56601 275708 316769 153007 131288 127630 232165 251421
9048B51421n3168j6004K5593q5855o1888n2834L3347r4998j17563p632N7906N4253
9036f7422Q8482Q3599j24685m8551q3972r290L15579N8449Q0732n6633j50435
9025H5853j61259k3357j46614K0493n1895N5287N6369J9389L0078j1119N015j2431
9013a34191k6561P7754O3810m7078J29128J29725Q5989p4735j0842p1338m0118
9002H1543J41796l5044r0339j26461j44231J66643L5447M2265M9558k571J0225
8991A28831N522m8994j06354p3875R8800K62188L1944j32861k01730q6293K27428
8980A04606Q5317m0287k2412j18499k7048K3889P4951L5433l2426J54436J3513
8969B51473j32824Q8775q5360q5753m1426j42393o9027K7756k7158l2643P2703
$$ plain form
9048 251421 198253 182249 207842 121987 60099 7265 40612 -54386 -171949 -179581 -121675 -67422
9036 -67422 21060 104659 -20026 -68577 -152549 -161839 153740 212189 292921 236288 85853
9025 85853 -75406 -98763 -245377 -224884 -276779 -221492 -165123 -145734 -115656 -126775 -121760 -134191
9013 -134191 -160752 -82998 -19188 -66266 62862 192587 278576 203841 192999 121661 81543
9002 81543 223339 188295 97956 -28505 -172736 -6093 29354 71619 121177 118606 128831
8991 128831 134353 85359 -20995 -94870 3930 266118 298062 165201 -36529 -122822 104606
8980 104606 189923 149636 127224 8725 -18323 5566 80517 115950 83524 237960 251473
8969 251473 118649 207424 122064 36311 -5115 -147508 -216535 -188779 -215937 -248580 -175877
8958a75877K07142K14220m3895q4816J397J2851R6402N3k02352r2804Q0824P5191
8946H8336n4016j60852k670J36066O4384P2421Q1837j32373p474K54J9730L0397
8934A36040l604j89190o2208p481j20857J4306J70267J57930q7858q1071O7154
8923f572J09190n3982j04844M2154J0280L7316j1141J6237l4530m4827j62168
8912b02887o8385l3327J30516K97374p6093j34869Q0428P3798Q0410n447p2395
8901F9123j28718l240n2058R2940J13250N6562J6146r5776j12364j34234n0423
8890b28792P2655K42715Q7118N5298j06110O3241q4607j7552n2335j3036Q8817
8879A07412k9603m6229r799r7505o4557m5553J27964m903N0589n5942J00727o1150
$$ plain form
8958 -175877 31265 245485 201590 116774 118171 131022 227424 227477 25125 -67679 13145 88336
8946 88336 34320 -126532 -129202 6864 71248 143669 225506 93133 85659 85913 105643 136040
8934 136040 132436 -56754 -118962 -126443 -247300 -232994 -62727 95203 7345 -73726 -6572
8923 -6572 102618 48636 -56208 -14054 -3774 33542 22401 38638 4108 -40719 -202887
8912 -202887 -271272 -304599 -174083 123291 47198 -87671 -7243 66555 146965 141518 69123
8901 69123 -59595 -62835 -114893 -21953 91297 147859 164005 68229 -44135 -178369 -228792
8890 -228792 -156137 86578 173696 228994 122884 186125 101518 83966 31631 18595 107412
8879 107412 77809 31580 21781 -75724 -140281 -185834 -57870 -62773 -12184 -68126 32601 -28549
8867b8549j34082J0196O492O9614K01257N6390j42880Q0153J25616M1564P7704
8856C63475n5581j69358j44404j15408J31288J30237O1585k5067k5675O169q0237
8845G7024j67955l9243M4330N9235O3890n8777j60985L4311j29739K7793o2475
8834c12591J35347J84292N2278J38785R2403k45783l3630j09677J2802j00911
8824a86685o8421K19016J00116J05811j68642N4555j08571M314q7782L0878K83373
8813A77962L9269r9039r8765k32329K1190J51406J11943N7542p8172J3739m855
8802E9891P3185j29484j27134p6379k0891J57348j5883M7707n6078n4807J55738
8791A3213P4697j19272j47468K4803J60164L5947k9533J5110J32793k5526n6760
$$ plain form
8867 -28549 -162631 -152435 -145943 -76329 124928 181318 38438 118591 244207 285771 363475
8856 363475 307894 138536 -5868 -121276 10012 140249 201834 176767 151092 157261 77024
8845 77024 -90931 -130174 -85844 -26609 37281 -21496 -182481 -148170 -277909 -250116 -312591
8834 -312591 -177244 7048 59326 198111 290514 44731 11101 -98576 -85774 -186685
8824 -186685 -255106 -36090 64026 169837 1195 55750 -52821 -48507 -136289 -105411 177962
8813 177962 217231 118192 19427 -212902 -191712 -40306 71637 129179 51007 64746 59891
8802 59891 133076 3592 -123542 -199921 -220812 -63464 -79347 -31640 -87718 -142525 13213
8791 13213 87910 -31362 -178830 -154027 6137 42084 12551 27661 160454 134928 78168
8780G8168n6998l2317j01226r9757P055K22662J91190K6526l3439p8071l307M886
8768A25372k35493j18062N1867j0333j3490l9563J15191J76075J8055j42682m5506
8757a18569k9166p0137J63855o0170q4150J88336R7959K9163J5908r0207j9111
8746B3711M3476K1428l0562J28990K9684j51656j94279L2436J76213K0040j90315
8735i0834j5492n5932j1658K2623K3242L5981J16835L9796k6607l3553j2430o3846
8723g1875L5347J08422k3559n3824m8403m1725J09823N3878j2040M5484L1963
8712A33491m3411k6791M4425Q4367k7670k8692j14897j87360j0457k1000j06641
8701c04636r0407R4857J30143K44790J55094k7074p7145j04174L8473K4170O9986
$$ plain form
8780 78168 21170 -11147 -112373 -212130 -205075 17587 208777 235303 201864 123793 120486 125372
8768 125372 -110121 -228183 -176316 -186649 -200139 -239702 -124511 51564 69619 -73063 -118569
8757 -118569 -147735 -217872 -54017 -114187 -198337 -10001 87958 117121 133029 42822 23711
8746 23711 67187 88615 58053 187043 216727 65071 -129208 -96772 79441 99481 -90834
8735 -90834 -106326 -162258 -173916 -151293 -128051 -92070 24765 64561 37954 4401 -8029 -71875
8723 -71875 -36528 71894 48335 -5489 -53892 -95617 14206 68084 56044 101528 133491
8712 133491 90080 63289 107714 192081 164411 135719 20822 -166538 -176995 -197995 -304636
8701 -304636 -395043 -300186 -170043 74747 229841 202767 125622 21448 59921 84091 154077
8690A54077j59176N5242M4367j31387j08425K5035J39618q4497q3946N9980r2066
8679a81178J54669P3878O9671M1619k05829m2463l5214k3950J34025K9119j14341
8668i9994N7293N7052O7108K0745l03785M7770J66157k5963m3615N2097m0975
8657d6110n964O2873J0402M7266j08194p4991N3699Q1237j8390Q724j3001p9317
8645h1766p1452J27498o9368P1778J62735j29370O8259J17457l0438m3366m0482
8634H1485L9530k4598j77532k59669L8883K33325o6578J6016P9016R3447j61377
8623a08052o1316N4952j43011J3843J67859J02653O6303o089q9004j03254N7565
8612d7551n3767J96918J48906J1090j7152o3190j25981l4422n1819n9450o2093
$$ plain form
8690 154077 -5099 50143 94510 -36877 -145302 -120267 19351 -65146 -149092 -89112 -181178
8679 -181178 -26509 47369 117040 158659 -47170 -89633 -124847 -148797 -14772 14347 -99994
8668 -99994 -42701 14351 81459 102204 -201581 -153811 12346 -13617 -57232 -5135 -46110
8657 -46110 -52074 10799 21201 68467 -39727 -114718 -61019 20218 1828 10552 -2449 -81766
8645 -81766 -153218 -25720 -95088 -23310 139425 10055 78314 195771 165333 121967 81485
8634 81485 121015 96417 -81115 -340784 -301901 -68576 -135154 -119138 -40122 53325 -108052
8623 -108052 -169368 -114416 -257427 -243584 -75725 26928 93231 87142 -1862 -105116 -47551
8612 -47551 -101318 95600 244506 255596 238444 175254 49273 14851 -36968 -96418 -158511
8601a58511J41407J23996o0838j8249l0351j18589J35425p4109l9549K51878J21448
8590B73958K9668j77071j09894L6864J16117J41174L5977J25733N1523j16107
8580D07942n5486M9465j30496K34K5595j7580j46268o376N7533L2809r6003M478
8568A25847J55528k805j69108j83492k6961K2515N4557j2267l2394k9714N8192
8557d0102Q807n9765j749p5322M072P2040l3935O1105K23436n4606j54732j91671
8545b42422j45835J19858J96203R8330l9240p1864J00493J10806j0159q2185l1272
8534B713n4525k3041J80832K07307Q9832J8086q0862j90314k8645q5764j61361
8523a25742l9375J37247J5635K9725k30q5953m8758j3109j28139k14651m7395
$$ plain form
8601 -158511 -17104 106892 46054 27805 -2546 -121135 14290 -59819 -99368 152510 273958
8590 273958 303626 126555 16661 53525 169642 310816 346793 472526 524049 407942
8580 407942 352456 401921 271425 271659 297254 279674 133406 127030 184563 217372 121369 125847
8568 125847 281375 278570 109462 -74030 -100991 -78476 -23919 -36186 -68580 -98294 -40102
8557 -40102 -31295 -91060 -92809 -168131 -164059 -92019 -125954 -64849 158587 103981 -50751 -242422
8545 -242422 -388257 -268399 -72196 26134 -13106 -84970 15523 126329 116170 33985 2713
8534 2713 -51812 -74853 105979 313286 403118 421204 340342 150028 121383 35619 -125742
8523 -125742 -165117 -27870 -12235 17490 17260 -68693 -117451 -130560 -258699 -473350 -520745
8512e20745J37223R6510P3385J19146o4939l416R4738Q5464L7709m0736k5269
8501a0930J16491J25227K0808j22700j72194R610M2154m6230O6541J28137R9802
8490B56716Q7249n2271j22925j02432p3680k7107J99225J36323j37000k3753J04058
8479B44403o7865j75754p8411J57464J22129j08244l2952m8678K7159M3288N493
8468H8032o6379j18281M2208m957j1436j01243P2014Q8791k7107r15j0723J7729
8456c2267N9268R3781R7534m5509j08937R8210J1278j50424q4417J50092j48557
8445e9948p5233J49428K2224J13864P300L8187J93175n032j27542q2192j87266
8434a3035j18914K8120Q5931K4783k758J13944l664l066p3028q6960l443j44085
$$ plain form
8512 -520745 -383522 -287012 -213627 -94481 -159420 -162836 -68098 17366 55075 14339 -10930
8501 -10930 105561 230788 251596 128896 -43298 -33688 8466 -37764 28777 156914 256716
8490 256716 343965 291694 168769 66337 -7343 -34450 164775 301098 164098 140345 244403
8479 244403 176538 784 -77627 79837 201966 93722 60770 12092 39251 82539 88032
8468 88032 21653 -96628 -54420 -59377 -70813 -172056 -100042 -11251 -38358 -39273 -49996 -32267
8456 -32267 27001 120782 218316 172807 63870 162080 173358 22934 -61483 88609 -59948
8445 -59948 -135181 14247 36471 150335 157635 195822 388997 383965 256423 174231 -13035
8434 -13035 -131949 -103829 -17898 6885 4127 118071 114407 111341 38313 -48647 -52090 -196175
8422a96175j08128Q9355O0396J22114R5196j20450j22149l3197L6427J47125N3712
8411B4226r3241N6729J33006q3854j29375j50531L4839o6213M7884J450K3480
8400b01600J01039O7899O7538J5945j75246R1658Q9815n8659l4415P7857j53617
8389a11786p9198J04206K0997P19J6256j15480k05241J54706J62418J02131p9195
8378b9467J33004o716p8732n9688j10332j08714N3971P4896Q368M4271j31766
8367b10905j09576J53919R090r9722K7944J06013O8942j0075M0362j31324o5595
8356b20927r7168o1881J77159M0896o4868N132j39974P6839J31679J05634J03777
8345E6298J27363J30794n3277k9215O3394j76733k41683K6559J66633L9361J08426
$$ plain form
8422 -196175 -304303 -214948 -154552 -32438 62758 -57692 -179841 -213038 -176611 -29486 24226
8411 24226 -69015 -12286 120720 36866 -92509 -243040 -208201 -274414 -226530 -225080 -201600
8400 -201600 -100561 -32662 34876 50821 -124425 -32767 57048 -1611 -36026 41831 -111786
8389 -111786 -190984 -86778 -65781 -65062 -48806 -164286 -369527 -214821 -52403 49728 -29467
8378 -29467 103537 96821 18089 -41599 -151931 -260645 -206674 -131778 -123410 -79139 -210905
8367 -210905 -320481 -166562 -157472 -257194 -229250 -123237 -54295 -64370 -24008 -155332 -220927
8356 -220927 -318095 -379976 -202817 -161921 -226789 -221657 -361631 -284792 -153113 -47479 56298
8345 56298 183661 314455 261178 231963 295357 118624 -123059 -96500 70133 109494 217920
8334B17920j62755k63701r3887K03585R6092J44079M7195l55391q9978J78345
8324g8496j84959k13484L3008J76552P051R9379J26935n0770j07963r1523L332
8313b80938L599J09758J05250k3779J467j22095j14953M906j29442O3132K54607
8302a28488K16065q892l1556l4214p8356N8639M0851J08834l8202j36549J29164
8291I7296j26591q3651O8475Q7024p157j57051n6170P4587k6858L7795j103j4628
8279a08032o2124J41632k844j11098l0651J4969J03719j54418m5572J22496J2574
8268a19349M0657Q9569K03274M8951j57471q8229l4986R0959O6944R3195L3511
8257B67025j49987j8416q683m4443k41822j15444J64810P3197Q974n2331Q6410
$$ plain form
8334 217920 55165 -208536 -302423 -98838 -2746 141333 188528 -166863 -256841 -78496
8324 -78496 -263455 -476939 -443931 -267379 -260328 -160949 -34014 -84784 -192747 -284270 -280938
8313 -280938 -277339 -167581 -62331 -86110 -84643 -206738 -321691 -316785 -446227 -383095 -128488
8302 -128488 87577 78685 47129 12915 -65441 -6802 34049 142883 104681 -31868 97296
8291 97296 -29295 -112946 -44471 42553 35396 -121655 -177825 -103238 -130096 -92301 -93404 -108032
8279 -108032 -170156 -28524 -31368 -142466 -173117 -158148 -54429 -208847 -254419 -131923 -119349
8268 -119349 -78692 10877 214151 263102 105631 17402 -17584 73375 140319 233514 267025
8257 267025 117038 98622 89939 45496 -196326 -311770 -146960 -73763 -64789 -117120 -30710
8246c0710M786j09264l5551J0238k3725n5086N7749J24507p010Q2597J2263L5546
8234F6340M1949k4661j45069p564Q6301o8871p9523N1474P2941K9334J01446o6599
8222E7498R054l9686M1029j29157r4308m7131J00423j08616j32767k8005K41719
8211a29947K49631n9215N3794p4500K8826n5108j17136P8324K5724J38062j07521
8200C0934l2568J90936p5802q2631M557q1683J03290J03387j15647q3184o0795
8189i9206o1841o898R655J15012m0667Q9973J16537n7628Q6706J06161R8843j02114
8177B54533j54545n4967j92455O1151J48119j6694j44086l154J2996k4642M3834
8166f9910J41468R4064J38815j68108j95306l6223Q5811J58815p9341m2223J7161
$$ plain form
8246 -30710 -25924 -135188 -170739 -160501 -184226 -239312 -181563 -57056 -64066 18531 30794 66340
8234 66340 108289 83628 -61441 -69005 17296 -51575 -131098 -79624 -6683 22651 124097 57498
8222 57498 66552 26866 67895 -61262 -155570 -202701 -102278 -210894 -343661 -371666 -129947
8211 -129947 119684 60469 114263 39763 68589 13481 -103655 -25331 393 138455 30934
8200 30934 -1634 189302 113500 30869 35426 -46257 57033 160420 44773 -38411 -99206
8189 -99206 -161047 -167945 -158290 -43278 -83945 6028 122565 64937 151643 257804 356647 254533
8177 254533 99988 45021 -147434 -86283 61836 45142 -98944 -102098 -89102 -113744 -69910
8166 -69910 71558 165622 304437 136329 -58977 -95200 -9389 149426 70085 27862 45023
8155D5023n9691J95909O9760j25710N3487p312K8008J75698J1441l20983m3144
8144B2486l3093n5267j19606j8966K021J82011N2853K3328O2207j84186k42834
8133c09046r4839Q5334P3841J46262o2937l1183R4559l1491N3564J76210J48328
8122B48602n755m7100L773L4766r9889q288m1265k9371P5237p2474p4981p0390
8110h7135J30968J8504q5876m684J17744j2251j05179L345L2062J10007j07490
8099A0015o7999k7437m0283m1228Q3089R2555j34882Q6522J83477J44536j09194
8088A79171l4555P3106r4522q612j98209j98598K47190J14844j14070J3215O9038
8077D7998J04595M9378Q568j55606r8115n2894r6422J11742l3507j13313K42545
$$ plain form
8155 45023 -14668 181241 251001 125291 178778 171466 199474 375172 386613 65630 22486
8144 22486 -10607 -65874 -185480 -204446 -202425 -20414 32439 55767 117974 -66212 -309046
8133 -309046 -403885 -318551 -244710 -98448 -161385 -192568 -98009 -129500 -75936 100274 248602
8122 248602 242847 195747 199520 234286 134397 126109 84844 55473 130710 58236 -16745 -87135
8110 -87135 43833 62337 -23539 -28223 89521 77270 -27909 -24564 7498 117505 10015
8099 10015 -57984 -85421 -125704 -166932 -83843 8712 -126170 -39648 143829 288365 179171
8088 179171 144616 217722 123200 114588 -83621 -282219 -35029 79815 -34255 -21040 47998
8077 47998 152593 201971 210539 54933 -43182 -96076 -192498 -80756 -114263 -227576 14969
8066A4969J63043J82970j41837j06841P3095l5734P5196P4273q3954j34297m6760
8055C4123r2685J22714n8937q8619m3060M6000k0450M497N1162q479q422j8279
8043h0435j17587k5761K5026P8713J12567P1010j68557L0693N496l6962j03145
8032b08942l1153K2104K2276K4415J65957m0194J56587Q4758m2965Q5471K3611
8021B61925j76401L2566J08105J76987j10001r0896q7818l1520M9926j23846q5058
8010g6031r1430P1959M1628Q3157q0733j77182n0334J00360r0673R8919R5109
7999g5251k0723p9010J48825J26960m7583r9051K5025m0986J07898l0196K7617
7988D3525P2972J25092p3933j35345r365L9516j07847J10685Q2145j06470o1822
$$ plain form
8066 14969 178012 360982 219145 112304 185399 149665 224861 299134 215180 80883 34123
8055 34123 -58562 64152 5215 -83404 -126464 -80464 -100914 -96417 -45255 -53734 -62156 -80435
8043 -80435 -198022 -223783 -198757 -120044 -7477 63533 -105024 -74331 -68835 -105797 -208942
8032 -208942 -240095 -217991 -195715 -171300 -5343 -45537 111050 195808 152843 238314 261925
8021 261925 85524 118090 226195 403182 293181 202285 114467 82947 132873 9027 -76031
8010 -76031 -167461 -95502 -53874 29283 -51450 -228632 -278966 -178606 -269279 -170360 -75251
7999 -75251 -95974 -174984 -26159 100801 53218 -45833 -20808 -61794 46104 15908 43525
7988 43525 116497 241589 167656 32311 22946 62462 -45385 65300 147445 40975 -20847
7977b0847j1651J6257J97736l8066p4988J01149O4734j01469P7237O6797j53304
7966A23585k35079j31700R8332J64535n3868P0412j24597q5024J12131K8546K1832
7955a0895J7789L6907M1411q4914j07065J6266J34091r776O919K0751L3552O3544
7943A58580k109l9167k01613j9516R979J5025o2419j15862K04977Q6783o6223
7932c1565n9573j1836j6986O2764J66021q2747p9930P1892L2459Q0890L3328M5356
7920B10073J0834m201o0459j16616j16284j87445r228R5822J41392P3687M7321
7909H4896J3360l2211j33590K2416m1209J15246N9041n4008l2886Q1783R7325
7898A80163M8536k4242P7697q5364N9391O5042j07827j88386j1789L1911R0180
$$ plain form
7977 -20847 -32498 -16241 181495 143429 68441 169590 234324 132855 210092 276889 123585
7966 123585 -111494 -243194 -144862 19673 -34195 36217 -88380 -173404 -61273 -32727 -10895
7955 -10895 6894 43801 85212 298 -106767 -90501 43590 33814 40733 61484 95036 158580
7943 158580 156471 117304 -84309 -103825 -93846 -78821 -141240 -257102 -52125 34658 -31565
7932 -31565 -91138 -102974 -119960 -57196 108825 26078 -53852 18040 50499 131389 164717 210073
7920 210073 220907 216706 156247 39631 -76653 -264098 -273326 -177504 -36112 37575 84896
7909 84896 98256 66045 -67545 -45129 -86338 28908 87949 33941 1055 82838 180163
7898 180163 228699 204457 282154 196790 256181 321223 213396 25010 13221 45132 135312
7887A35312j66953O6404J28250N4939j70925l40709r5391J85791K05460l8910
7877c6732q8347J04906J16181M101p4227j31804K5967M4338K6814j82980j18907
7866c10690J07212P7757n0512J4103J15778J23724j6194Q6680K95j7409K8207
7855A58951m885p6249q9876j62739J14719K53527m1162k72087L3002m113q0450
7844a71362O4506j16455K7461J1437L0630J9588J36121j78836l7239O8635J33072
7833a2442l4397j43137j00890K8204K06251p8681o5213J12007l8470Q0387P8581
7822C2200r011n8016r7768p6218L4522J67565J70047K9478J24728J3410k02259
7811A28678k1994n0041m0283n2228Q1379j17784P7462R2645J29365j15191k20030
$$ plain form
7887 135312 -31641 34763 163013 217952 47027 -293682 -389073 -203282 2178 -36732
7877 -36732 -125079 -20173 96008 100109 25882 -105922 -79955 -35617 -8803 -191783 -310690
7866 -310690 -203478 -125721 -176233 -162130 -46352 77372 61178 147858 148153 130744 158951
7855 158951 154066 77817 -12059 -174798 -60079 193448 152286 -119801 -86799 -90912 -171362
7844 -171362 -106856 -223311 -195850 -184413 -153783 -134195 1926 -176910 -214149 -145514 -12442
7833 -12442 -46839 -189976 -290866 -262662 -56411 -135092 -200305 -88298 -126768 -46381 32200
7822 32200 23189 -34827 -132595 -208813 -174291 -6726 163321 192799 317527 330937 128678
7811 128678 106684 56643 16360 -35868 45511 -72273 5189 97834 227199 112008 -108022
7800a08022J6919L0372j30020m242J00087J69008M4497l1640j13421N7650q6056
7789e4868j19614N8497J07038j15371r1129K4061K8105Q6640R1000O3213j16858
7778c9286k6210O6729r0777Q5631k8473j9765J74925P8047J2038j8038N3806J1580
7766B60207j14644j12076q4636j19088K842J12706J63539j7787L8515Q7158q9451
7755A27285j29326O4357M7632j47392j76744M9894J29113j78183o063J72656N57
7744d6214j11569M8397l4507N8289J74778q2298j01601J41319J34525J04400K7251
7733C12770k1275P8639j03365k01909r6367J21475k36553k54760J47259J68885
7723h5201J96680O3997j6578j02072k71856L4351R8264L6363P3738K06313l666
$$ plain form
7800 -108022 -91103 -60731 -190751 -194993 -94906 74102 118599 86959 -26462 31188 -54868
7789 -54868 -174482 -115985 -8947 -124318 -215447 -191386 -163281 -76641 14359 77572 -39286
7778 -39286 -65496 1233 -89544 -3913 -32386 -52151 122774 200821 212859 194821 248627 260207
7766 260207 145563 33487 -51149 -170237 -167395 -54689 108850 91063 129578 216736 127285
7755 127285 -2041 62316 109948 -37444 -214188 -164294 -35181 -213364 -219427 -46771 -46214
7744 -46214 -157783 -109386 -143893 -85604 89174 6876 -94725 46594 181119 285519 312770
7733 312770 291495 370134 266769 64860 -31507 89968 -146585 -401345 -254086 -85201
7723 -85201 111479 175476 158898 56826 -215030 -180679 -82415 -46052 27686 233999 230333
7712B30333k56753j436M2456j09289K3825N6367p6766Q2923K5604N6837M7143
7701A21244l219m3098k405K8244Q1462j23432j32263J35782q4205p8614q015J88659
7689H0140l5300o6814J3380K7930K30782M4133p1106n6707M0176J7333m485j71169
7677D8293j67103P8791J01543j62360p9156J76574L5235k09088j39877P2669K4564
7666b19915K9874J51117P6759n859j75670O7855J66843J9927j37072l5078J11255
7655E0036M349j14488R0836J73268j15900o9694O8716J65043k3853q5929j22757
7644A9627l4881J23084k4313l6349n3220k09470k7158K40477J08522L4336r0830
7633D9825k44R5084m9292m9312M8351j77719j74228K9419N8271J4810J35756j2881
$$ plain form
7712 230333 -26420 -27856 14600 -94689 -70864 -14497 -91263 -8340 17264 74101 121244
7701 121244 118025 74927 72522 100766 182228 58796 -73467 62315 -21890 -100504 -108519 80140
7689 80140 44840 -21974 -8594 19336 250118 294251 223145 166438 206614 223947 219462 48293
7677 48293 -118810 -40019 61524 -100836 -179992 -3418 31817 -177271 -317148 -244479 -219915
7666 -219915 -190041 -38924 37835 31976 -143694 -75839 91004 110931 -26141 -61219 50036
7655 50036 54385 -60103 30733 204001 88101 18407 87123 252166 228313 142384 19627
7644 19627 -15254 107830 83517 47168 -6052 -215522 -242680 -2203 106319 140655 49825
7633 49825 49581 144665 95373 46061 94412 -83307 -257535 -228116 -169845 -155035 -19279 -32160
7621c2160J6790R727j644R1689J47806j80463j9823p7343L8071Q481k3838j15538
7609a38245J1402k5701j22111J12674k016J05271J7210Q3027n7657q3003j16073
7598b15222j62326N7265K8084L780O8708R9364J51764L7773L8647o7420j32994
7587i2577M0694L8404l4847j6685R2946J45599J62350k4109p3492r881k2628k23513
7575a7739P8118J13470j0327j74585J25937Q250l7607m2786O9299l3165L7583
7564A16448l1106N1155J73236J48395j43691k38581j8010j6597Q0021j6027k5918
7553G9325m9477j31607M5749J43729J67739o5482j74805j12793j2762j97414l5126
7542c42924J4740q446J25593N8192O8054J5553j26470K5573j4099J15096m611
$$ plain form
7621 -32160 -15370 -5643 -7287 84402 232208 51745 31922 -45421 -7350 1131 -22707 -138245
7609 -138245 -126843 -152544 -274655 -161981 -163997 -58726 -41516 41511 -16146 -99149 -215222
7598 -215222 -377548 -320283 -292199 -288419 -219711 -120347 31417 69190 107837 40417 -92577
7587 -92577 -51883 -13479 -48326 -65011 27935 173534 335884 311775 238283 228402 205774 -17739
7575 -17739 60379 173849 163522 -11063 114874 123124 85517 42731 112030 78865 116448
7564 116448 85342 136497 309733 458128 314437 75856 57846 41249 121270 105243 79325
7553 79325 29848 -101759 -56010 87719 255458 189976 15171 -97622 -110384 -307798 -342924
7542 -342924 -328184 -336630 -211037 -152845 -84791 -69238 -195708 -170135 -184234 -69138 -73749
7531g3749L3366p4966l798J30966O1625k8197k3178r5474O2639P3327j05319k2187
7519f4945L7100m8827j41874O3758K8080L8475J64811O3509q8298R645j10766
7508d9332J315P1730J63475r3163n345o9867N3491K9416N9145l0269j43771J1196
7496a979j7782o4718j54513J19586J9707m4891J04483L6883N5127j2022O0434
7485A00315K3165n0381j62478j74920k351Q2371Q2613K02736j959o0921r8209
7474f0019q7865m7684J06950K25471k531r8341q8861Q1220L3827j5472j00558
7463e3863j46592J80130J09804Q0736Q5494L4852J95791N5085j63612r5340k48716
7452C3769n3072Q1110L9347N7455R6516j62505k80837K4602K3832O455q6013O2485
$$ plain form
7531 -73749 -40383 -115349 -119147 11819 73444 45247 22069 -73405 -10766 62561 -42758 -64945
7519 -64945 -27845 -76672 -218546 -154788 -126708 -88233 76578 140087 51789 61434 -49332
7508 -49332 -48017 23713 187188 94025 88680 18813 72304 101720 160865 130596 -13175 -1979
7496 -1979 -19761 -84479 -238992 -119406 -99699 -144590 -40107 -3224 51903 39881 100315
7485 100315 123480 73099 -89379 -264299 -266650 -184279 -101666 101070 99111 38190 -60019
7474 -60019 -147884 -195568 -88618 136853 134322 35981 -52880 28340 62167 46695 -53863
7463 -53863 -200455 -20325 89479 170215 255709 290561 486352 541437 377825 282485 33769
7452 33769 -19303 61807 101154 158609 255125 92620 -188217 -163615 -139783 -133328 -219341 -156856
7440a56856l612r026n8026j36282k4746J73710J01105K5708m0583L228J9882J10266
7428D768l1205N5484K6781j55024j17067O120R3907q373O4889Q1866Q5045P6368
7416A83559j584J04011k3707k08827r9515O0524j32832P9257K2309n3152j3549
7405h3506j9804P7504J27285l9052q8311J9136j07448j28100o070J19889J18703
7394i774j2839j60541K3856P5259M9420j3667L7314P8808P5668r5873Q7280P2258
7382B07169j2796j9521O2309L3348n2448j67825r3430m5860O9394m6066j25290
7371a91016J10067J785k6365L1446J02908m8952p8397R9526l2385M1378o7545
7360e7550J06683R6000j30072j11357l4401K9551K6708k7865k9700L8969J13000
$$ plain form
7440 -156856 -160468 -169494 -227520 -363802 -388548 -214838 -113733 -88025 -128608 -125380 -105498 4768
7428 4768 -26437 29047 55828 -99196 -216263 -210143 -116236 -124609 -59720 22146 107191 183559
7416 183559 181975 285986 262279 53452 -46063 14461 -118371 -39114 -16805 -69957 -83506
7405 -83506 -103310 -25806 101479 62427 -25884 -6748 -114196 -242296 -248366 -128477 -9774
7394 -9774 -22613 -183154 -159298 -84039 -34619 -48286 -10972 67836 143504 47631 134911 207169
7382 207169 194373 174852 237161 270509 218061 50236 -43194 -89054 -19660 -65726 -191016
7371 -191016 -80949 -79164 -105529 -74083 28825 -20127 -98524 1002 -31383 9995 -57550
7360 -57550 49133 145133 15061 -96296 -130697 -101146 -74438 -102303 -132003 -93034 19966
7349A9966Q5811N9164J07968O0028k95320j13551m1755P0187K708j55485l9566
7338b39845N1677J57247L0527p1637M4711l8084L426M4453O254J4148N4309L2503
7326H9689o4811j1495K2250m2011k21343j65371J38680J00576l0213O9112k4192
7315a39129k069r016M0623K4824K8153N9171O1946O3159R9098k6112M2092k00800
7303D1940j50325L2132M6512K6872p9990j02833j13505K02687J13283L6211J31717
7292A84701p2541k48700j16842j38394j20976n0271J53782J44660j36225M2003
7282c58803J80893K68664O7031R658o9192L4595q4915j08379q9891k9858l2158
7271b12355q6837K5221R6073j1015J20831J11320J475L0672K5946k00788j48646
$$ plain form
7349 19966 105777 164941 272909 332937 37617 -75934 -117689 -47502 -44794 -200279 -239845
7338 -239845 -188168 -30921 -394 -72031 -27320 -65404 -61978 -17525 -11271 2877 57186 89689
7326 89689 24878 13383 35633 -6378 -227721 -393092 -254412 -153836 -184049 -114937 -139129
7315 -139129 -141198 -150214 -109591 -84767 -56614 2557 64503 127662 226760 200648 242740 41940
7303 41940 -108385 -76253 -29741 -2869 -82859 -185692 -299197 -96510 16773 52984 184701
7292 184701 112160 -136540 -253382 -391776 -512752 -563023 -409241 -264581 -400806 -358803
7282 -358803 -177910 90754 157785 167443 98251 132846 47931 -60448 -150339 -180197 -212355
7271 -212355 -299192 -273971 -177898 -188913 -68082 43238 44713 75385 101331 -99457 -248103
7260b48103J49033R0532J1949m1148j23812j33212R7604L8852J47567k4627o9608
7249a04973J5902K18868J49742j96928k51033J01309o0063j60714K3174J36477
7239a28239K22661O0814j35317k52623j87Q9506P4890K42719J01518o2404O6111
7228B79449j9542j63101n9839J8412n4732m7728m5502K21113j2332P0285m0344
7217A46139j18700K2710Q139j21581j07925m2378R129J04214J53213J07356K5592
7206A85908j48446k30588n1692J00235J37552K5863N6581K6528r1862N9380J16167
7195A85626j34406r9237K4161P2490j16831r1718m3660n7801n2669Q5148R5946
7184a32951j46470j19996J33724o2308Q0808J47832j49856P1379r1233J0872K50482
$$ plain form
7260 -248103 -99070 -8538 3411 -37737 -161549 -294761 -197157 -158305 -10738 -35365 -104973
7249 -104973 -89071 129797 279539 82611 -168422 -67113 -127176 -287890 -264716 -128239
7239 -128239 94422 155236 19919 -232704 -232891 -143385 -68495 174224 275742 213338 279449
7228 279449 259907 96806 36967 55379 647 -47081 -92583 128530 116198 186483 146139
7217 146139 27439 50149 58288 -63293 -171218 -213596 -204467 -100253 52960 160316 185908
7206 185908 37462 -193126 -244818 -144583 -7031 18832 75413 101941 10079 69459 185626
7195 185626 51220 -48017 -23856 48634 -68197 -159915 -203575 -261376 -314045 -228897 -132951
7184 -132951 -279421 -399417 -265693 -328001 -247193 -99361 -249217 -177838 -269071 -258199 -7717
7173g717K13951n5845J72916n0126k02647j08003j27171o8661j5631M0349J04610
7162a03975N6784n2687O8878k5040k73650o3066J11584k551O0966R701Q7138J91713
7150F5795J4827q5052q5966K39k7997r6150p6525M7629K22096K2989L8352N9188
7138I9425j17549o5583r4120j90963o5641J20534N4328L3974Q172M7107M4149
7127a26167j1810M9495K8845l0466j45825o4790J35799J38676Q0813K01674j11823
7116A44421m5991q1503M5417j10241n3773l1528j90094M8512K15085J84300N5985
7105A80590j16679n8078J124j43747j12433O9926J12483M4601K7659n829J1894
7094A1511J1188J47029N161l0368l4507j47152q8916o7965j47303J65708J83342
$$ plain form
7173 -7717 206234 150389 323305 273179 70532 -37471 -164642 -233303 -248934 -208585 -103975
7162 -103975 -47191 -99878 -31000 -56040 -329690 -392756 -281172 -283723 -222757 -213056 -125918 65795
7150 65795 80622 -4430 -90396 -90157 -118154 -214304 -290829 -243200 -21104 1885 40237 99425
7138 99425 -18124 -83707 -177827 -368790 -434431 -313897 -259569 -225595 -217423 -170316 -126167
7127 -126167 -137977 -88482 -59637 -90103 -235928 -300718 -164919 -26243 54570 256244 144421
7116 144421 98430 16927 62344 -47897 -101670 -133198 -323292 -274780 -59695 124605 180590
7105 180590 63911 5833 6957 -136790 -249223 -179297 -66814 -22213 5446 -383 11511
7094 11511 22699 169728 174889 144521 110014 -37138 -126054 -194019 -341322 -175614 7728
7083G728N1911o4658j50554k09802J09261L1851J61092R051L9121K3055J0692
7072A8748k7258L8235P3783J45773N7790j10471j11576o5410L525J24727M8139
7061A96005o8327J2577K468P9460j06516j89647p0750m9337J54213R9930j08968
7050d8892N7204j02388j01749q2611k4854M9843O914L2083J53714N6096n2086
7039e6726j61j29165J7091m6699j11118R8794J1910q9452K9840O1327J74207J00690
7027F0538J21691j30055k21018q8647j00754L5083J11262Q0854n8403p0097K6580
7016b32966R0266J70536K56329m5444J58504j7789j68598L481j53161j06500o3906
7005a09248L6170J16771N4513j28427j5690J38518J51240l2570k91800M0920J7074
$$ plain form
7083 7728 59639 -5019 -155573 -365375 -256114 -224263 -63171 -54120 -14999 8056 18748
7072 18748 -8510 29725 103508 249281 307071 196600 85024 19614 23139 147866 196005
7061 196005 127678 140255 142723 222183 115667 -73980 -144730 -194067 -39854 60076 -48892
7050 -48892 8312 -94076 -195825 -278436 -303290 -253447 -246533 -214450 -60736 -4640 -56726
7039 -56726 -56887 -186052 -168961 -215660 -326778 -227984 -216074 -305526 -275686 -214359 -40152 60538
7027 60538 182229 52174 -168844 -257491 -358245 -323162 -211900 -131046 -189449 -259546 -232966
7016 -232966 -142700 27836 284165 238721 397225 379436 210838 214319 61158 -45342 -109248
7005 -109248 -73078 43693 98206 -30221 -45911 92607 243847 211277 -80523 -39603 -22529
6994b2529m4947r3787q6247K78053J44431j82737o6134K3903J4636j25057N8076
6983a02339l4201J19933M0748j84198r131J69548J28135K19291L6462j71272o1529
6972A51447k3084n4063l0942q380m3332R6002j22564j47570J49384L301j9088
6961d8889k01418L1348K8964j12751Q1707K35214L0889j77149p1012M8971Q1178
6950g2948j5814M1802O9582k3547l2l3280Q9728J94829n2821j09589j15468j477
6938b9035O5941L134J6667p3376Q4739J32619J4097p2096j27202j4063J1690P1442
6926H4557J7827q4565n3393n3744O2968m4144J12294M5975j34224j6493J18357
6915E5415m9915n5206L256N3078n1139k25903k8626J66618j76463P4772P9453
$$ plain form
6994 -22529 -67476 -161263 -247510 30543 174974 -7763 -73897 -49994 -35358 -160415 -102339
6983 -102339 -136540 -16607 24141 -160057 -169188 360 128495 347786 384248 212976 151447
6972 151447 128363 74300 43358 34978 -8354 87648 -34916 -182486 -33102 -29801 -48889
6961 -48889 -250307 -218959 -189995 -302746 -221039 14175 45064 -132085 -203097 -154126 -72948
6950 -72948 -88762 -46960 22622 -925 -957 -34237 55491 250320 197499 87910 -27558 -29035
6938 -29035 36906 40040 56707 -16669 68070 200689 214786 142690 15488 1425 13115 84557
6926 84557 102384 17819 -35574 -89318 -26350 -70494 41800 87775 -46449 -62942 55415
6915 55415 5500 -49706 -46450 6628 -44511 -270414 -299040 -132422 -308885 -234113 -154660
6904a54660J02498n7444j46810K761R6572n851J48631R6787J48098p0986L7717
6893A97313k0558N064k9499k13576p479j17175J44623J53463j43925K6556k8296
6882c3489N0854J39227J124j23366j12336p3336Q5518j6089J5290L5517K0621
6871a0465N3870J35431q3614j45591O2929N267k385M2487K8231J18937O1591k11518
6859E5170j85601j229k04521j1626J86782J66878K9129o5345J30775l4137O7718
6848A33993L2637Q2472k38068n5244P7135r96k9538P0826o8808k16839m8209k9910
6836b90549p9461J5197J30762j6826P084K37026J07695L95P6441O1759j56724
6825I2799j42411J02246J32671p5326k21385p7622J0259N4818K81829Q1171P9547
$$ plain form
6904 -154660 -52162 -109606 -256416 -253655 -157083 -162934 -14303 82484 230582 159596 197313
6893 197313 176755 181819 152320 -61256 -68735 -185910 -41287 112176 -31749 -5193 -33489
6882 -33489 17365 156592 157716 34350 -77986 -151322 -65804 -81893 -66603 -31086 -10465
6871 -10465 43405 178836 95222 -50369 12560 17827 15442 57929 86160 205097 266688 55170
6859 55170 -130431 -131660 -336181 -347807 -161025 5853 34982 -30363 100412 66275 133993
6848 133993 166630 249102 11034 -44210 32925 31929 2391 73217 4409 -212430 -260639 -290549
6836 -290549 -370010 -354813 -224051 -240877 -233793 3233 110928 111323 187764 249523 92799
6825 92799 -49612 52634 185305 109979 -111406 -189028 -178769 -123951 157878 239049 318596
6814C18596p8574o4526r4418l3105N3419j39632R161m3194J56353l6682j62067
6803a14669j18232m4215K1554M2929O8474J7144J2377r2742j63926j11560K7335
6792d55531O6849M3553J01366J04678O613J4989J36004j968n2649j03898Q6792
6781e3202r1302o875J42009J8830O0787j02797l1953K2350J33983O5886J37662
6770B95378j6376l8199M300p8718Q467l9640j59677j46512q9886o5133M9879K2707
6758b53410J15691J25908O3226j0437k4799P3830J19986l8724q3210n5477q3104
6747e0520j14450O6911Q7828N8090N2931k5996j3689O2899n1786j36492L3544
6736c0730J41269K4719P2800M3239n7460m4544p6575o2436k7695K0222R229J26567
$$ plain form
6814 318596 240022 175496 81078 47973 101392 -38240 -29079 -72273 84080 47398 -114669
6803 -114669 -232901 -277116 -255562 -212633 -144159 -127015 -114638 -207380 -371306 -482866 -455531
6792 -455531 -388682 -345129 -243763 -139085 -132472 -117483 18521 16553 -36096 -139994 -53202
6781 -53202 -144504 -151379 -9370 9460 70247 -32550 -64503 -42153 91830 157716 295378
6770 295378 279002 240803 245103 166385 174852 135212 -24465 -170977 -260863 -325996 -276117 -253410
6758 -253410 -137719 -11811 51415 40978 16179 90009 209995 171271 88061 32584 -50520
6747 -50520 -164970 -98059 -10231 47859 100790 74794 61105 124004 72218 -64274 -30730
6736 -30730 110539 135258 208058 251297 193837 149293 72718 10282 -17413 2809 12038 138605
6724A38605j04298N5987J32955j16440k70663j0824j2831k9720J58737P9185M4494
6713F5187l0190P9178J1508k3449J27595P1112j15425j3510j30969k04324o0102
6702b23389O1510P3820R1379M6702j088j16546j2078J27822j42513J8883j03837
6691a79335j35058Q0267J8177p1202J7046J59593r7557j34034J31787K49411J16336
6680A55431j26604o2147R5232M2040o2582k52720p6251J99986J10386j8688J6086
6669B0169L4292J6894R1346l1184k569l3750J13346j27055j29112L383q7176O5222
6657f6194o7312n9126J8017r2843J58305J72220J74474M6388j96984n1197J72266
6646B08014R816j95501j25521j0902Q7675P7165k0926q6843Q9088M6242j58203
$$ plain form
6724 138605 34307 90294 223249 106809 -163854 -174678 -187509 -217229 -58492 20693 65187
6713 65187 34997 114175 125683 102234 229829 300941 185516 172006 41037 -163287 -223389
6702 -223389 -161879 -88059 3320 50022 48934 -67612 -79690 48132 -94381 -75498 -179335
6691 -179335 -314393 -234126 -215949 -287151 -270105 -110512 -208069 -342103 -210316 39095 155431
6680 155431 28827 -33320 61912 103952 41370 -211350 -287601 -87615 22771 4083 20169
6669 20169 54461 71355 162701 131517 128948 95198 208544 81489 -47623 -44240 -131416 -66194
6657 -66194 -133506 -192632 -174615 -267458 -109153 63067 237541 283929 86945 35748 208014
6646 208014 217830 22329 -103192 -114094 -26419 50746 29820 -57023 32065 78307 -79896
6635g9896L0592K18253J48719q5620k3041k05481R3607j6137l0352k1616m0943
6624a1915J19892J74174j72196r198J12117p2888l9454N279M0917N0822n5536
6613A42014Q8995J08877m045k21612o9811o4209O5320j2945j089J31273j17298
6602D5470n8974J9739o8527J89170J55928j39194L6159K3977q4753r4754j404
6591B2837L9292R3576K5924m0228o6115m0833M2576N3490p9920j26551N1932m0999
6579f5019J29426P6882l710N027L1610j14713j64753O288J79539N0008j50994
6568b0409K16145K6461k8214N7890j37453M5096L0762j15998j0822J04817j03234
6557F5041j77813j00948J29716J06771P3840j6692K540m9162N3343n4144j10710
$$ plain form
6635 -79896 -49304 168949 317668 232048 209007 3526 97133 80996 50644 29028 -11915
6624 -11915 107977 282151 109955 100757 212874 139986 100532 105811 146728 197550 142014
6613 142014 231009 339886 335841 114229 44418 -19791 45529 32584 31495 162768 45470
6602 45470 -13504 6235 -62292 126878 282806 143612 179771 203748 118995 24241 22837
6591 22837 62129 155705 181629 141401 75286 34453 77029 130519 50599 -75952 -24020 -65019
6579 -65019 64407 141289 137579 142606 174216 59503 -105250 -98962 80577 130585 -20409
6568 -20409 195736 222197 193983 251873 114420 159516 190278 74280 63458 168275 65041
6557 65041 -112772 -213720 -84004 22767 96607 79915 82455 33293 86636 32492 -78218
6546g8218J45971J1333N396m2023j79255J7397K29832j14340q3985N2883l247
6535c8256K82006k3222n7860k1311J95945J8262L5986m2416j32044n1123j0191
6524A55776o5221j41841p4353K5798O0100n9684J73226j03713j62114M8528j8199
6513a61697l0846L2599K7110J52775j31237j85061Q3901O2068q9189r8141m7692
6502c85410p9859J94939K18204k2725K994j58930m4448M8669J12948N6952j07516
6491a64182p7791Q6879J13487J5239k7882O4796J5023n8291R748J06113O2025
6480A45164J78498j80840m9093p1996K6613o7255l7668L2958q2272j64398J8769
6469b51520M9207o454N3144n8186J38369K48873M4312Q4400L6961l1757R1975
$$ plain form
6546 -78218 67753 79086 84482 42459 -136796 -119399 110433 -3907 -87892 -35009 -38256
6535 -38256 243750 220528 162668 141357 337302 355564 391550 349134 217090 165967 155776
6524 155776 90555 -51286 -125639 -99841 -39741 -99425 73801 -29912 -192026 -143498 -161697
6513 -161697 -192543 -159944 -132834 19941 -111296 -296357 -212456 -150388 -239577 -337718 -385410
6502 -385410 -465269 -270330 -52126 -74851 -71857 -230787 -275235 -226566 -113618 -56666 -164182
6491 -164182 -241973 -155094 -41607 -26368 -54250 10546 25569 -32722 -22974 83139 145164
6480 145164 323662 142822 93729 21733 48346 -18909 -56577 -23619 -105891 -270289 -251520
6469 -251520 -202313 -208767 -155623 -213809 -75440 173433 217745 302145 339106 307349 399324
6458C99324k09873k20046n3914P3759J6087j23107l7053N0690J37415J44906R35
6447A79123K03355k7409k33754j91807p331J7061m68r5996k4149m5794N9249J81286
6435A3366j04435q898J1092n5757M7076L4417P9391l3252q1621k8191R9506J75025
6423A47719J46131j99984k56326r8649K33945M2673q9576j03505P5407K0032O5297
6412a6836K91649Q7014n1656o5404k7656j24319o3276n7203m9474M6961o6136
6401i6336k2701J04006J7393l23924J4009K78147J15895m2286k9982n1115n7642
6390i4536J04905J18911J03132L0559O9972M002j97109k45995L6379K08931l0252
6379A08899m6178j369O3640j4999o3410j05524N4434P445J7001K3281J12772m1438
$$ plain form
6458 399324 189451 -30595 -84509 -10750 5337 -117770 -154823 -104133 33282 178188 179123
6447 179123 382478 355069 121315 -70492 -77823 -60762 -61230 -157226 -181375 -227169 -167920 13366
6435 13366 -91069 -99967 -88875 -144632 -97556 -63139 16252 -17000 -98621 -126812 -27306 147719
6423 147719 293850 93866 -162460 -261109 -27164 15509 -74067 -177572 -102165 -82133 -16836
6412 -16836 274813 361827 310171 244767 217111 92792 29516 -27687 -77161 -30200 -96336
6401 -96336 -119037 -15031 2362 -321562 -307553 -29406 86489 44203 14221 -36894 -94536
6390 -94536 10369 129280 232412 262971 332943 336945 139836 -106159 -69780 139151 108899
6379 108899 62721 61352 124992 109993 46583 -58941 -4507 2938 19939 43220 155992 114554
6367A14554n1407O6343L7429k16299P6581J49305K0959j37704m5188O0927m7902
6356B7598p49l1338K6070R3134j1484k40039l33851O6225J53719J53133K86453
6345A88871R6092n7862j80251k69480R7266l480q9172o2251j17646J59686J54765
6334h3462k9269l3781L3497L9286N7642j19338J23149P7906K9227N4542o7834
6323H1565N0058L5282j24232j07308O0938m1957j67746m8518R3577J41167J523
6312b5651j14709k0618p7652M697K52380P5075o6577J03688L10384K0977j64960
6301B97034p4747l7553k97833k74458o5268J20934J10828l9839P251j54540O9602
6290c38589K13586q414J06570J5313q2312j0255P496M5219P303n2212O0774N6497
$$ plain form
6367 114554 63147 129490 166919 -49380 27201 176506 197465 59761 14573 75500 27598
6356 27598 26849 -4489 21581 114715 103231 -136808 -470659 -404434 -250715 -97582 188871
6345 188871 284963 227101 46850 -222630 -125364 -128844 -218016 -280267 -397913 -238227 -83462
6334 -83462 -112731 -146512 -113015 -73729 -16087 -135425 -12276 65630 94857 149399 81565
6323 81565 131623 166905 42673 -64635 -3697 -45654 -213400 -261918 -168341 -27174 -25651
6312 -25651 -140360 -160978 -238630 -233933 18447 93522 26945 130633 441017 461994 297034
6301 297034 222287 184734 -113099 -387557 -452825 -331891 -221063 -260902 -253651 -408191 -338589
6290 -338589 -125003 -133417 -26847 -11534 -93846 -104101 -96605 -51386 -44083 -96295 -35521 20976
6278B0976j63544k491P8158J52756R0067j00015r2241J27934o526M2311j57609
6267a0224n3465M4704M9829K3R462j52215m029N5351L5919o5504l6518o1077N8777
6254a28967N2487J36287j5367j45299J22911M3463R906j2590J54092M2609j6935
6243B42597j08521p9252j38269N3258n3615q6237M0531M5918R4129n2506J3540
6232b8427K1401n6361O1685J00483O2303P730o9975j30303o1561N9656J32033
6221I8664m0917j77683n2783k5939J55630o6760k40303N0830J69296J38876j699
6210G212q3237J44105j18869j3720K17449J32424J15672q8352j33602k4213j10674
6199D4195j14130k300q4432k4481j17259J21060J08405m594j50717o0933L18777
$$ plain form
6278 20976 -142568 -145059 -66901 85855 175922 75907 -16334 111600 105074 147385 -10224
6267 -10224 -63689 -18985 30844 30867 40329 -111886 -115915 -60564 -24645 -90149 -126667 -187744 -128967
6254 -128967 -76480 59807 44440 -100859 22052 65515 75421 62831 216923 259532 242597
6243 242597 134076 54824 -83445 -30187 -83802 -170039 -129508 -83590 10539 -41967 -28427
6232 -28427 -7026 -63387 -1702 98781 161084 168814 98839 -31464 -93025 -33369 98664
6221 98664 57747 -119936 -172719 -198658 -43028 -109788 -350091 -299261 -129965 8911 7212
6210 7212 -76025 68080 -50789 -64509 152940 285364 401036 312684 179082 154869 44195
6199 44195 -69935 -72235 -156667 -181148 -298407 -177347 -68942 -73536 -224253 -285186 33591
6188C3591J26829l007j89993o6042K6071R288q5963O8852J01963M8807L7209j55001
6176d7396o2941L4583M2983l3105k3630R2905j6292p736m6186j2208j71845M8519
6164b02349J46163o9455O7207J08060m1772p1454k9158j56700j6070J80315J14549
6153B9336k4240N4407R4261p6428j14980J44199j92632j42592J16317K4542M6802
6142d1008p6784L9464J0387j67441j30290M9853K13862l2435L4831N5110j1126
6131e5577n9957r9694l11j6744m9216K5327J9550R5652O1170j3962j8331Q0093
6119c2000r5418K6036L7000O6003J22246Q6985j26130l00414j60037J16815K45165
6108a3749L4374r9630j46555m3013P4124L9688j03992J12020K14052K6732m4545
$$ plain form
6188 33591 160420 157413 -32580 -98622 -72551 -63263 -149226 -80374 21589 70396 107605 -47396
6176 -47396 -110337 -75754 -32771 -65876 -89506 3399 -12893 -20629 -66815 -79023 -250868 -202349
6164 -202349 -56186 -125641 -58434 49626 7854 -63600 -92758 -249458 -265528 -85213 29336
6153 29336 5096 59503 153764 77336 -37644 106555 -86077 -228669 -112352 -87810 -41008
6142 -41008 -117792 -78328 -67941 -235382 -365672 -315819 -101957 -134392 -99561 -44451 -55577
6131 -55577 -115534 -215228 -215539 -232283 -281499 -256172 -236622 -140970 -79800 -93762 -112093 -32000
6119 -32000 -127418 -101382 -64382 1621 123867 210852 84722 -215692 -375729 -258914 -13749
6108 -13749 20625 -79005 -225560 -268573 -194449 -154761 -258753 -146733 67319 94051 49506
6097D9506n8098j47900l1040j2894J25929J59931o4191m2799J17675M5542j96203
6086e4542r6782L2764P7988q6203J20793R9066R2169J3110j17926r4965K0802
6075F274K1091q6732j07231K5717K8960o3308L8167m5470Q9725J80624M0127N0633
6063A78577J4918j35569k1178j21631j02736j77982J32654Q4603R5511Q5657Q115
6052D0939k7948m6585K6342r6182o0801N8121K20109p5000K9607J88118m0494
6041B16226K0506j71104j12544J56720Q9780R892l540q6914n6267m3917r8541
6030g9703l6019m5120J3076k244J41954K46971j59603j98430K7521R8198p7082
6019g0481j6364J20258R988j29515p162j40293n0606J64078K4205l6538l6353
$$ plain form
6097 49506 -8592 -156492 -187532 -200426 -74497 85434 21243 -21556 96119 141661 -54542
6086 -54542 -151324 -118560 -40572 -126775 -5982 93084 185253 198363 80437 -14528 6274
6075 6274 27365 -59367 -166598 -140881 -111921 -175229 -137062 -182532 -92807 87817 127944 178577
6063 178577 193495 57926 36748 -84883 -187619 -365601 -232947 -148344 -52833 32824 40939
6052 40939 12991 -33594 -7252 -103434 -164235 -106114 113995 38995 68602 256720 216226
6041 216226 236732 65628 -46916 109804 199584 209476 205936 119022 62755 18838 -79703
6030 -79703 -115722 -160842 -147766 -150010 -8056 238915 79312 -119118 -91597 6601 -70481
6019 -70481 -86845 33413 43401 -86114 -93276 -233569 -284175 -120097 -95892 -132430 -168783
6008a68783j37755J30415J19237p344L2054K5125P9566n7702r6710P9293p0439
5997g3043J40269J15406r4596O325p0253j09510K8564J45096J12296o2733j47446
5986i625k1233R6368j12491J704J05279q3861m7298m8792r5948J08091J46728
5975C8922k3070j46360P1009O9689J12936J36133p945k49373j28257l4536r634
5964a70486j52927n0105p7676L1984J93138M1820Q0773m0330j34149R0299J53748
5953c3911k1534J31314p2216k2665J89136k2219k9733j4624j00136k43407j03464
5942c43459J51661R4461j71758p6240K2833J07245M3885N3268J03801o9955n0227
5931a34485m0423q0006j0384P7741J44022J00863j3682o4297m3905n5123J19678
$$ plain form
6008 -168783 -306538 -176123 -56886 -64230 -32176 -7051 72515 14813 -81897 -2604 -73043
5997 -73043 67226 182632 88036 94361 24108 -85402 -56838 88258 200554 137821 -9625
5986 -9625 -30858 65510 -46981 -45277 60002 -23859 -71157 -119949 -215897 -107806 38922
5975 38922 15852 -130508 -59499 10190 123126 259259 251314 1941 -126316 -160852 -170486
5964 -170486 -323413 -373518 -451194 -419210 -226072 -184252 -103479 -143809 -277958 -187659 -33911
5953 -33911 -55445 75869 3653 -19012 170124 147905 118172 103548 3412 -239995 -343459
5942 -343459 -191798 -97337 -269095 -345335 -322502 -215257 -171372 -118104 -14303 -84258 -134485
5931 -134485 -174908 -254914 -265298 -187557 -43535 57328 43646 -20651 -64556 -119679 -1
5920ao4640p5834j00080n8485Q5607M7771l0009N4348J31689J9882J3047l9628
5908a6333q7046j37598K15735n6971L1063L5047L9634j03321R995N5665j51757
5897a65887o6462K56397K05687O5855l6793O3884N4796j35281j31961J15840L659
5886B29734j44784l9554j762q730n2957o3138l9361k2330J11995k5271K1535l081
5874c7704K418M6139q1714J1477P3118l8843L4083n3372O8981n8944j89926k0771
5862b45058J92095M1802L0452p6552L3385r3910j04531J43966J03504K75940J5939
5851C17032j54228j59149j74135o8961l5679m3188J1397K13333n6676j07723J33647
5840a24330L4786Q7916K86584J30985l8964r2263n6706J7133o506l2314p7940
$$ plain form
5920 -1 -64641 -140475 -240555 -299040 -213433 -165662 -195671 -141323 -9634 10248 23295 -16333
5908 -16333 -103379 -240977 -25242 -82213 -51150 -16103 23531 -79790 -69795 -14130 -165887
5897 -165887 -232349 24048 229735 295590 258797 322681 377477 242196 110235 226075 229734
5886 229734 84950 45396 43634 34904 -18053 -81191 -120552 -142882 -30887 -56158 -34623 -37704
5874 -37704 -35286 10853 -70861 -59384 13734 -25109 8974 -44398 24583 -34361 -224287 -245058
5862 -245058 -52963 -11161 19291 -57261 -23876 -117786 -222317 -78351 25153 301093 317032
5851 317032 162804 3655 -170480 -239441 -275120 -318308 -306911 -93578 -150254 -257977 -124330
5840 -124330 -89544 -1628 284956 415941 376977 284714 228008 245141 238635 206321 128381
5829A28381k7994J36603o7277K7333N8664n280j09243o8477N2221p8992j40632
5818i4693N2893n1746j25005j25555J16455J76418K4203r3377q0342j5708o8379
5807b84836n6956m5909O5290K65423P7767p8195p7025P3218K33580J20156k3517
5796B68996n1322p1212m6731k8408j36048n2933o588r736J04828q6J49497L6461
5784A56718k26107j35907L5430J57136O214r1273j16426j4286l9215l2037J1062
5773b88691l9757L3922O7995J11165M8518l5705J26836n8104Q7279k9389O15p3840
5761d9156m0135L4345q419J00179j37914j29963q2811J5838Q4008N9852J21382
5750c2794N8013j06630l2788K811l7337r224m4483l3632Q2009M7809o0379p1665
$$ plain form
5829 128381 100387 236990 169713 197046 255710 250430 141187 72710 124931 45939 -94693
5818 -94693 -41800 -93546 -218551 -344106 -227651 -51233 -27030 -120407 -200749 -216457 -284836
5807 -284836 -341792 -387701 -322411 -56988 20779 -57416 -134441 -61223 172357 292513 268996
5796 268996 217674 146462 99731 71323 -64725 -117658 -124246 -133982 -29154 -29240 120257 156718
5784 156718 -69389 -205296 -169866 -12730 -6516 -97789 -214215 -228501 -267716 -299753 -288691
5773 -288691 -328448 -294526 -226531 -115366 -66848 -102553 24283 -33821 53458 24069 24684 -49156
5761 -49156 -89291 -54946 -63365 36814 -101100 -231063 -313874 -298036 -214028 -154176 -32794
5750 -32794 25219 -81411 -114199 -111388 -148725 -157949 -202432 -236064 -154055 -106246 -166625 -238290
5738b38290N7046J77704K7931K3696j04013p0071r9705L9963J67223J12480J28400
5727B22364j5343j07221k26157P5329N9431P9354l8350k13016j14934J40532J47460
5716I449N2894K0553O0214O2780q5941K6390q1385r6796k11477M6816K41545O6217
5704A11259n8426j70645p0187J95541j8501r2029r629Q2494n2283j65533N3370
5693a94569M6500m8141J13498j05038j12717m9904J95285J07265p4247o1028l2614
5682b15710j4330K9525R8487J18784N8845L4724l498j02389J145M1791j56512
5671a09138j97306Q005J8954j27M1526J6736Q7816Q9329J77191P8326r6486p8413
5659C6413m3400J49792R9145q0437j70032J737p5102Q2957J34261N0243N5679
$$ plain form
5738 -238290 -181244 -3540 24391 48087 -55926 -125997 -225702 -185739 -18516 93964 222364
5727 222364 207021 99800 -126357 -51028 8403 87757 49407 -163609 -278543 -138011 9449
5716 9449 62343 82896 143110 205890 119949 146339 64954 -31842 -243319 -196503 45042 111259
5704 111259 52833 -117812 -187999 7542 -10959 -102988 -112617 -30123 -82406 -247939 -194569
5693 -194569 -148069 -196210 -82712 -187750 -300467 -350371 -155086 -47821 -122068 -183096 -215710
5682 -215710 -230040 -200515 -102028 16756 75601 110325 106827 4438 5583 47374 -109138
5671 -109138 -306444 -298439 -279485 -279612 -238086 -221350 -133534 -44205 132986 211312 114826 36413
5659 36413 -6987 142805 241950 161513 -8519 -6782 -81884 1073 135334 185577 241256
5648B41256J6278l13271j7773L059J09999n5472m4086Q0778o555k58399J61600
5637h2586J25083j78036j17779J13897J94983Q0284K5296j56652j00995J79040
5627H2535J37585k1275n3441j4750l4354l2405M768q781N9345r63r1368m5958
5615a9062J21044M8549j25563j53317j17544j30852m7225J08804K12642N9882
5605d2642k50189J08175Q7371J2592J62111R5489P0094r7398n4603P5023p4870
5594I1153j3177K22511j459o9684j21371k0657l722j17847M0262L4038m1631j59481
5582a61065j24033O8317K03424O9755k14368p098J35103k8293n093J01785k2024
5571A6410o2263K3605P6618K0405L7890r335M921J91754k89613j35436R9125k858
$$ plain form
5648 241256 257534 -55737 -73510 -70451 39548 -15924 -60010 20768 14213 -244186 -82586
5637 -82586 42497 -135539 -253318 -139421 55562 135846 161142 4490 -96505 82535
5627 82535 220120 198845 145404 130654 96300 63895 68663 59882 119227 118264 26896 -19062
5615 -19062 101982 150531 24968 -128349 -245893 -376745 -423970 -315166 -102524 -42642
5605 -42642 -292831 -184656 -97285 -84693 77418 172907 243001 145603 91000 166023 91153
5594 91153 77976 300487 299028 229344 107973 87316 83594 -34253 6009 40047 -1584 -161065
5582 -161065 -285098 -216781 -13357 56398 -157970 -165068 -29965 -58258 -63351 38434 16410
5571 16410 -45853 -22248 54370 74775 112665 103330 108251 300005 10392 -125044 -25919 -28777
5559b8777J7929L9063m364N3429q1260j24364j25683R4266r554o0443M263M0876
5547a84619J03632J16980q1216j795K16635k4280j66411R1262R5881L2413k5274
5536A73208j42551L489P2711J0987n3848k07083j24120p5489P9378J72169N094
5525h6055K32546N0691L0401r1505m3901p9108j58838j31142J8567N5557M4305
5514a58482k8563j9423m2584P9203J55815j09703l4397P9264L302M5383l8196
5503f8381L9799k5291P380J44679J12348J37675o3415j00550j08622j00009k1200
5492d5587q4214R3303K27316m5463o5824r1169j1629j6969j02648J47553P1208
5481G5877k03625j59154j03656P3150J86219J69965R1507l7700j76663k20351
$$ plain form
5559 -28777 -10848 28215 23851 77280 -3980 -128344 -254027 -159761 -169315 -229758 -225495 -184619
5547 -184619 -80987 35993 -45223 -47018 169617 145337 -21074 70188 166069 198482 173208
5536 173208 30657 34146 106857 117844 63996 -143087 -267207 -342696 -263318 -91149 -86055
5525 -86055 146491 197182 227583 136078 92177 13069 -145769 -276911 -258344 -202787 -158482
5514 -158482 -187045 -206468 -249052 -169849 -14034 -123737 -158134 -78870 -75568 -30185 -68381
5503 -68381 -28582 -53873 -46493 98186 210534 348209 284794 184244 75622 -24387 -45587
5492 -45587 -129801 -36498 190818 145355 79531 -11638 -23267 -40236 -142884 4669 75877
5481 75877 -127748 -286902 -390558 -317408 -131189 38776 130283 92583 -84080 -304431
5471c04431P8445J15542N8205k211P3233K38300n780j7961J9776j43440O068L5848
5459A51594o6041j00696m0897k2071J7763j3r7751J01451J20831j53501N652M4507
5447c9172R3223j2530J13932P8013j25349j68126O2711J66817R5848r4539q0522
5436I0306Q890J8082l6949R0755J27898j07l6828j50770j8242n1924o421M2064
5424G6754p9419M2778k3548p6150r3310j47289J81994J45417q2798L3331R3158
5413G0918J0912j34572j7337J16106p0004j07964N0879P8082q552k7428q9225
5402a28185p7562N8262J79612R5314J54304j914n6343r6630n2126k1041p2140
5391a8449j39682J04906O2313o9042k0408K509k62387N0735O6350R7836K011K0594
$$ plain form
5471 -304431 -225986 -110444 -52239 -54450 18783 257083 251303 233342 253118 109678 115746 151594
5459 151594 85553 -15143 -56040 -78111 -60348 -60361 -158112 -56661 64170 -89331 -83679 -39172
5447 -39172 54051 41521 155453 233466 108117 -60009 2702 169519 265367 170828 90306
5436 90306 99196 117278 80329 171084 298982 298875 262047 111277 93035 41111 34690 76754
5424 76754 -2665 40113 16565 -59585 -152895 -300184 -118190 27227 -55571 -22240 70918
5413 70918 81830 -52742 -70079 46027 -23977 -131941 -81062 -2980 -11532 -38960 -128185
5402 -128185 -205747 -147485 32127 127441 281745 279831 223488 126858 74732 53691 -18449
5391 -18449 -158131 -53225 9088 -59954 -80362 -77853 -340240 -289505 -223155 -125319 -123308 -102714
5379a02714O3246K851j43537p2450P2531j46779J35715q866K9144J01052m1474
5368a11281L0072l1066j37940k1457M844J08638J41211j5441k659j17305R6882
5357e5502Q857J4199L4644L2500l1261j08378m107K59969K04806J54914j33620
5346C77021l16898k63531J8020J03492p304J05337m0642j2671m1420p1802j977
5335a52375k2020j42491R2096J90109m1294j18673r164q3033o0380j25756J53671
5324c19310L1907j7938L2263k1538J32166k1239j09223j137n6097J85888R7299
5313f6959n4737P0829R3984Q5055n1657n3267L2478J6844M2714j97099n7488J6755
5301a22548N6661K56785J11534o4674j68158k19541j25411J8157O3875q2530J65856
$$ plain form
5379 -102714 -39468 -36617 -180154 -252604 -180073 -326852 -191137 -200003 -170859 -69807 -111281
5368 -111281 -81209 -112275 -250215 -271672 -266828 -158190 -16979 -32420 -35079 -152384 -55502
5357 -55502 -46645 -32446 2198 34698 3437 -104941 -109048 150921 355727 510641 377021
5346 377021 60123 -203408 -185388 -81896 -89200 16137 -24505 -37176 -78596 -150398 -152375
5335 -152375 -174395 -316886 -224790 -34681 -75975 -194648 -203812 -286845 -347225 -472981 -319310
5324 -319310 -287403 -305341 -273078 -294616 -162450 -183689 -292912 -294049 -350146 -164258 -66959
5313 -66959 -121696 -50867 43117 128172 76515 23248 55726 72570 115284 -81815 -139303 -122548
5301 -122548 -65887 190898 302432 237758 69600 -149941 -275352 -257195 -193320 -275850 -109994
5290a09994m1358r3699J44470J46684j03016j78075M3712J12736j7528k1844N1687
5279f6225L0255q6012J19959K31408M2141j21098k45440P9190O8181J61838k00109
5268A4088j13769p88J30254K16712j3051j86048j24719P2232M7939n8635j02753
5257a18538M4197P8499j00448o8707L1387J10667J24523K7134o9397j0762k9515
5246A9040N4657R8368p5221l3999P450K2642k2866j59419N5765J66173j21915
5235A0675L392J4669j17543j44894l9732P2085M8551q2082K3975J09388J40634
5224C9118L8846o2714n2668k8161r0890o5284K5123l9854O0690K1757K03990J12535
$$ plain form
5290 -109994 -151352 -245051 -100581 46103 -56913 -234988 -191276 -78540 -96068 -117912 -66225
5279 -66225 -35970 -121982 -2023 229385 271526 150428 -95012 -15822 52359 214197 14088
5268 14088 -99681 -100469 29785 246497 233446 47398 -77321 -5089 42850 -15785 -118538
5257 -118538 -74341 4158 -96290 -164997 -133610 -22943 101580 128714 59317 48555 19040
5246 19040 73697 172065 96844 62845 70295 92937 70071 -89348 -33583 132590 10675
5235 10675 14067 28736 -88807 -233701 -273433 -201348 -152797 -234879 -210904 -101516 39118
5224 39118 77964 15250 -37418 -65579 -156469 -221753 -196630 -236484 -175794 -154037 49953 162488
$$ [...]
##END NTUPLES=NMR SPECTRUM
##END=
