##TITLE=Analysis number 325388
Compound Code cc 36523
Book Reference 518/20
Project Code adrs
Chemist Name colinb
##JCAMPDX= 6.0         $$ Bruker NMR JCAMP-DX V2.0
##DATA TYPE= NMR SPECTRUM
##DATA CLASS= NTUPLES
##ORIGIN= Bruker BioSpin GmbH
##OWNER= nmr
$$ XWIN-NMR		Version 3.5
$$ Tue Jan  2 10:38:51 2007 GMT Standard Time (UT+0h)  MAYBRIDGE\nmr@NMR_250MHZ
##.OBSERVE FREQUENCY= 250.131544655141
##.OBSERVE NUCLEUS= ^1H
##.ACQUISITION MODE= SIMULTANEOUS (DQD)
##.ACQUISITION SCHEME= undefined
##.AVERAGES= 16
##.DIGITISER RES= 18
##SPECTROMETER/DATA SYSTEM= dpx250
##.PULSE SEQUENCE= zg30
##.SOLVENT NAME= CDCl3
##.SHIFT REFERENCE= (INTERNAL, CDCl3, 0, 16.5255)
##AUDIT TRAIL= $$ (NUMBER, WHEN, WHO, WHERE, WHAT)
$$ ##TITLE= Audit trail, XWIN-NMR		Version 3.5
$$ ##JCAMPDX= 5.01
$$ ##ORIGIN= Bruker BioSpin GmbH
$$ ##OWNER= nmr
$$ C:\u/data/dgb/nmr/ADRS/40/pdata/1/auditp.txt
$$ ##AUDIT TRAIL=  $$ (NUMBER, WHEN, WHO, WHERE, WHAT)
(   1,<2007-01-02 10:38:18.47 +000>,<MAYBRIDGE\nmr>,<NMR_250MHZ>,
      <created by zg, POWCHK disabled, PULCHK disabled
       configuration hash MD5:
       49 4B E0 1D 92 C2 6B 37 9F E6 65 BC 52 41 86 1D
       data hash MD5: 64K
       A9 73 A3 DD 24 D3 19 74 32 80 CC F9 F1 81 C0 CC>)
(   2,<2007-01-02 10:38:34.64 +000>,<MAYBRIDGE\nmr>,<NMR_250MHZ>,
      <Start of raw data processing
       ef LB = 0.3 FT_mod = 6 PKNL = 1 SI = 32K 
       data hash MD5: 32K
       E9 55 26 AA 4A 5F F4 78 27 F1 1F 34 11 54 DE 90>)
(   3,<2007-01-02 10:38:39.82 +000>,<MAYBRIDGE\nmr>,<NMR_250MHZ>,
      <apk 
       data hash MD5: 32K
       E3 9F EB 63 81 7E 81 E2 BE A2 D9 00 20 49 BB C4>)
(   4,<2007-01-02 10:38:41.35 +000>,<MAYBRIDGE\nmr>,<NMR_250MHZ>,
      <abs ABSG = 5 
       data hash MD5: 32K
       1A A0 78 D2 55 46 B8 2A F6 74 24 00 42 CC CE 22>)
$$ ##END=
$$ 
$$ hash MD5
$$ DE 18 FD 69 71 DF BC 6F 59 26 31 20 6C 99 FC 3E
##$RELAX= 
##$RELAX= 
##$RELAX= 
##$RELAX= 
##$RELAX= 
##$RELAX= 
##$RELAX= 
$$ Bruker specific parameters
$$ --------------------------
##$DU= <C:\u>
##$EXPNO= 40
##$NAME= <ADRS>
##$PROCNO= 1
##$TYPE= <nmr>
##$USER= <dgb>
##$AMP= (0..31)
100 100 100 100 100 100 100 100 100 100 100 100 100 100 100 100 100 100 
100 100 100 100 100 100 100 100 100 100 100 100 100 100 
##$AQSEQ= 0
##$AQ_mod= 3
##$AUNM= <au_zg>
##$AUTOPOS= <8 >
##$BF1= 250.13
##$BF2= 250.13
##$BF3= 250.13
##$BF4= 250.13
##$BF5= 500.13
##$BF6= 500.13
##$BF7= 500.13
##$BF8= 500.13
##$BYTORDA= 1
##$CFDGTYP= 0
##$CFRGTYP= 5
##$CHEMSTR= <none>
##$CNST= (0..31)
1 1 145 1 1 1 1 1 1 1 1 1 1 1 1 1 1 1 1 1 1 1 1 1 1 1 1 1 1 1 1 1 
##$CPDPRG= <>
##$CPDPRG1= <>
##$CPDPRG2= <>
##$CPDPRG3= <>
##$CPDPRG4= <mlev>
##$CPDPRG5= <mlev>
##$CPDPRG6= <mlev>
##$CPDPRG7= <mlev>
##$CPDPRG8= <mlev>
##$CPDPRGB= <>
##$CPDPRGT= <>
##$D= (0..31)
0 1 0 0 0 0 0 0 0 0.06 0 0 0 0 0 0 0.0002 0 0 0 0 0 0 0 0 0 0 0 0 0 0 
0 
##$DATE= 1167734297
##$DBL= (0..7)
120 120 120 120 120 120 120 120 
##$DBP= (0..7)
150 150 150 150 150 150 150 150 
##$DBP07= 0
##$DBPNAM0= <>
##$DBPNAM1= <>
$$ [...]
##$SUBNAM7= <"">
##$SUBNAM8= <"">
##$SUBNAM9= <"">
##$SW= 20.6930455092707
##$SWIBOX= (0..15)
0 0 3 0 0 0 0 0 0 0 0 0 0 0 0 0 
##$SW_h= 5175.983436853
##$TD= 65536
##$TD0= 1
##$TE= 294.16
##$TE2= 300
##$TE3= 300
##$TEG= 300
##$TL= (0..7)
0 120 120 120 120 120 120 120 
##$TP= (0..7)
150 150 150 150 150 150 150 150 
##$TP07= 0
##$TPNAME0= <>
##$TPNAME1= <>
##$TPNAME2= <>
##$TPNAME3= <>
##$TPNAME4= <>
##$TPNAME5= <>
##$TPNAME6= <>
##$TPNAME7= <>
##$TPOAL= (0..7)
0.5 0.5 0.5 0.5 0.5 0.5 0.5 0.5 
##$TPOFFS= (0..7)
0 0 0 0 0 0 0 0 
##$TUNHIN= 0
##$TUNHOUT= 0
##$TUNXOUT= 0
##$USERA1= <user>
##$USERA2= <user>
##$USERA3= <user>
##$USERA4= <user>
##$USERA5= <user>
##$V9= 5
##$VALIST= <valist>
##$VCLIST= <CCCCCCCCCCCCCCC>
##$VD= 0
##$VDLIST= <DDDDDDDDDDDDDDD>
##$VPLIST= <PPPPPPPPPPPPPPP>
##$VTLIST= <TTTTTTTTTTTTTTT>
##$WBST= 1024
##$WBSW= 4
##$XGAIN= (0..3)
0 0 0 0 
##$XL= 0
##$YL= 0
##$YMAX_a= 436356
##$YMIN_a= -470256
##$ZGOPTNS= <>
##$ZL1= 120
##$ZL2= 120
##$ZL3= 120
##$ZL4= 120
##$ABSF1= 16.5255
##$ABSF2= -4.167673
##$ABSG= 5
##$ABSL= 3
##$ALPHA= 0
##$AQORDER= 0
##$ASSFAC= 0
##$ASSFACI= 0
##$ASSFACX= 0
##$ASSWID= 0
##$AUNMP= <proc_1d>
##$AZFE= 0.1
##$AZFW= 0.1
##$BCFW= 0
##$BC_mod= 0
##$BYTORDP= 0
##$COROFFS= 0
##$CY= 12.5
##$DATMOD= 1
##$DC= 0
##$DFILT= <>
##$DTYPP= 0
##$F1P= 14.0000005364418
##$F2P= -0.99999901652339
##$FCOR= 0.5
##$FTSIZE= 32768
##$FT_mod= 6
##$GAMMA= 0
##$GB= 0
##$INTBC= 1
##$INTSCL= 1
##$ISEN= 128
##$LB= 0.3
##$LEV0= 0
##$LPBIN= 0
##$MAXI= 10000
##$MC2= 0
##$MEAN= 0
##$ME_mod= 0
##$MI= 0
##$NCOEF= 0
##$NC_proc= -3
##$NLEV= 6
##$NOISF1= 0
##$NOISF2= 0
##$NSP= 0
##$NTH_PI= 0
##$NZP= 0
##$OFFSET= 16.5255
##$PC= 1
##$PHC0= 227.675
##$PHC1= 6.1677
##$PH_mod= 1
##$PKNL= yes
##$PPARMOD= 0
##$PSCAL= 4
##$PSIGN= 0
##$REVERSE= no
##$SF= 250.129999122631
##$SI= 32768
##$SIGF1= 0
##$SIGF2= 0
##$SINO= 400
##$SIOLD= 32768
##$SREGLST= <1H.CDCl3>
##$SSB= 0
##$STSI= 32768
##$STSR= 0
##$SW_p= 5175.98343685301
##$SYMM= 0
##$S_DEV= 0
##$TDeff= 65536
##$TDoff= 0
##$TI= <Analysis number 999999
Compound Code 99
Book Reference 9
Project Code 9>
##$TILT= no
##$TM1= 0
##$TM2= 0
##$TOPLEV= 0
##$USERP1= <user>
##$USERP2= <user>
##$USERP3= <user>
##$USERP4= <user>
##$USERP5= <user>
##$WDW= 1
##$XDIM= 32768
##$YMAX_p= 326336478
##$YMIN_p= -89625
$$ End of Bruker specific parameters
$$ ---------------------------------
##NTUPLES= NMR SPECTRUM
##VAR_NAME=  FREQUENCY,     SPECTRUM/REAL,   SPECTRUM/IMAG
##SYMBOL=    X,             R,               I
##VAR_TYPE=  INDEPENDENT,   DEPENDENT,       DEPENDENT
##VAR_FORM=  AFFN,          ASDF,            ASDF
##VAR_DIM=   32768,         32768,           32768
##UNITS=     HZ,            ARBITRARY UNITS, ARBITRARY UNITS
##FACTOR=    0.157963299565203, 1,           1
##FIRST=     4133.52313638376, 0,            0
##LAST=      -1042.46030046925, 0,           0
##MIN=       -1042.46030046925, -89625,      0
##MAX=       4133.52313638376, 326336478,    0
$$ Real data points
##PAGE= N=1
##DATA TABLE= (X++(R..R)), XYDATA
$$ [...]
$$ plain form
14920 -7053 -15495 -3012 -10748 -744 2258 -11699 11804 12161 -1758 10716 -13256 -22456 -13630
14907 -13630 -18456 -3716 16267 19709 24618 20056 17502 -7877 -576 -6173 -15376 -6988 4375
14894 4375 20448 5890 14211 20761 5842 2569 9434 16105 25191 37043 36906 41396 34407 39527
14880 39527 31838 10778 -11299 -25188 -17073 -3977 1548 -4138 2757 44991 67800 59099 49202
14867 49202 24238 18174 17102 17607 29364 26954 19349 27024 39147 21914 -6633 -14906 -13287
14854 -13287 15745 55276 17806 -358 7163 6553 14619 -9128 -22758 7300 28322 -2156
14842 -2156 -321 3684 16529 24339 -7716 468 6608 4193 5105 -19364 -22832 17761 14997 27585
14828 27585 29190 37133 30784 28843 16366 6614 12412 -863 -10880 17718 28922 29914 19251
$$ packed form
14920g053q442J2483p736J0004L002j3957K3503L57j3919J2474k3972r200Q826
14907a3630m826J4740J9983L442M909m562k554k5379P301n597r203Q388J1363
14894D375J6073j4558Q321O550j4919l273O865O671R086J1852j37M490o989N120
14880C9527p689k1060k2077j3889Q115J3096N525n686O895M2234K2809q701r897
14867D9202k4964o064j072N05J1757k410p605P675J2123j7233k8547q273J619
14854a3287K9032L9531l7470j8164P521o10Q066k3747j3630L0058K1022l0478
14842b156J835M005J2845P810l2055Q184O140k415R12k4469l468M0593k764J2588
14828B7585J605P943o349j941j2477r752N798j3275j0017K8598J1204R92j0663
$$ plain form
14815 19251 -55 9200 12529 13360 19948 -1815 -6320 -1977 9226 9219 8050 9468 18485 29225
14801 29225 55379 40158 21244 26168 31038 41708 24070 15434 23193 25188 36504 46522 33679
14788 33679 28291 35512 25760 17633 19872 24867 10381 22541 6931 -575 -15775 -26712 -20255
14775 -20255 -3196 -1262 -8496 -20024 -20097 -5651 24606 26681 48858 53304 52919 39203 9255
14762 9255 13950 37808 14188 14061 10925 5905 4956 4366 -12135 -11632 -1861 17193 26023 2449
14748 2449 1998 -7885 -5850 24380 33751 5128 -6437 -10738 11827 16124 -3257 -3009 -2385 -23897
14734 -23897 -31293 -4981 6816 3592 15935 16037 12707 35978 20708 12441 16638 4418 -4326
14721 -4326 -12244 -41595 -24084 -2002 -2484 -16407 -1746 14538 16292 6126 16838 16942 -12315
$$ packed form
14815A9251j9306R255L329Q31O588k1763m505M343J1203pj169J418R017J0740
14801B9225K6154j5221j8914M924M870J0670j7638q636P759J995J1316J0018j2843
14788C3679n388P221r752q127K239M995j4486J2160j5610p506j5200j0937O457
14775b0255J7059J934p234j1528p3J4446L0257K075K2177M446l85j3716k9948
14762I255M695K3858k3620j27l136n020r49n90j6501N03R771J9054Q830k3574
14748B449m51r883K035L0230R371k8623j1565m301K2565M297j9381K48O24k1512
14734b3897p396K6312J1797l224J2343J02l330K3271j5270q267M197j2220q744
14721d326p918k9351J7511K2082m82j3923J4661J6284J754j0166J0712J04k9257
$$ plain form
14708 -12315 -7265 10321 -2322 -25254 -3656 -9005 -5435 23232 16739 8426 11058 -976 -1824
14695 -1824 -4123 1184 28898 41323 47768 24076 28345 37933 24273 24601 31679 32710 12009 13199
14681 13199 3592 -10472 -17539 -37830 -18083 4535 12803 27649 21106 26119 23127 16286 6858
14668 6858 1154 -1599 -16768 -7576 15661 20245 5560 4870 26036 28053 205 12946 16400
14655 16400 19503 28252 33173 25687 20084 5436 -2913 -21297 -15049 5827 22561 2812 -26742
14642 -26742 -33104 -1914 42214 40811 7356 -12904 -33430 -37274 -29588 -23651 28718 33585 37499
14629 37499 28750 7140 -3364 1711 24285 33465 36742 41947 22946 15525 5059 -4789 3148
14616 3148 -15750 -31252 -36600 -39252 -39830 -24879 -28823 -18038 -10951 -10625 -29594 -35921 -27909 -8243
$$ packed form
14708a2315N050J7586j2643k2932K1598n349L570K8667o493q313K632j2034q48
14695a824k299N307K7714J2425O445k3692M269R588j3660L28P078J031k0701J190
14681A3199r607j4064p067k0291J9747K2618Q268J4846o543N013k992o841r428
14668F858n704k753j5169R192K3237M584j4685o90K1166K017k7848J2741L454
14655A6400L103Q749M921p486n603j4648q349j8384O248K0876J6734j9749k9554
14642b6742o362L1190M4128j403l3455k0260k0526l844P686N937N2369M867L914
14629C7499q749k1610j0504N075K2574R180L277N205j9001p421j0466r848P937
14616C148j8898j5502n348k652n78J4951l944J0785P087L26j8969o327Q012J9666
$$ plain form
14602 -8243 666 8310 13728 19695 23670 -27080 -71403 -43285 -23509 -13220 -22386 -15030 -8448
14589 -8448 6126 -3302 -4704 12487 -2048 -4372 -29605 -48421 -45357 -19067 -12270 -10899 -10343
14576 -10343 1712 13158 30987 57119 47602 35616 51414 61047 41373 27762 17558 17663
14564 17663 20195 23690 31576 5432 5422 17728 51853 80158 91688 100667 103086 100047 86799
14551 86799 53094 52629 66950 57694 37281 23664 24396 12605 10072 -2690 -1091 4611 21292
14538 21292 34553 16000 7563 6308 12186 2672 23510 23547 13083 -9244 -20817 -29457 -21567
14525 -21567 -14433 -15176 3950 17286 11809 -3825 -13611 -32787 -43505 -22892 493 4496 14233
14512 14233 35978 45307 49555 26560 11742 -7424 -23987 -22597 -3968 -8775 5035 46485
$$ packed form
14602h243Q909P644N418N967L975n0750m4323K8118J9776J0289r166P356O582
14589h448J4574r428j402J7191j4535k324k5233j8816L064K6290O797J371N56
14576a0343J2055J1446J7829K6132r517j1986J5798R633j9674j3611j0204J05
14564A7663K532L495P886k6144j0J2306L4125K8305J1530Q979K419l039j3248
14551H6799l3705m65J4321r256k0413j3617P32j1791k533j2762J599N702J6681
14538B1292J3261j8553q437j255N878r514K0838L7j0464k2327j1573q640P890
14525b1567P134p43J9126J3336n477j5634r786j9176j0718K0613K3385M003R737
14512A4233K1745R329M248k2995j4818j9166j6563J390J8629m807J3810M1450
$$ plain form
14500 46485 46476 25535 13956 -9492 -9400 -4144 -1896 -5395 -5287 8705 10422 5115 -10002 -11353 9397
14485 9397 18967 24004 15386 -18388 -25457 -12239 -1259 1250 4435 20824 44046 34235 7381
14472 7381 -16891 -13846 -26410 -23877 -1102 27006 35720 10134 3702 38080 38726 33760 31111
14459 31111 20100 11773 -4729 -21889 -11042 -3141 -10987 -8779 8832 12404 7361 5989 3986
14446 3986 -17673 -31956 -16417 -3040 -7534 -8404 -12886 -22043 -31260 -35099 -25759 -18402 -19126 -22873
14432 -22873 -3753 8746 18247 16451 34396 39468 40000 23941 13501 28180 23091 -13781 -27903
14419 -27903 -22819 -16886 -9628 8629 11811 23729 10285 7206 530 2378 -2711 -24339 -32824
14406 -32824 -26658 -18868 -16126 -14727 -28377 -44620 -49122 -49825 -27624 -18742 -11530 7888 21227
$$ packed form
14500D6485rk0941j1579k3448R2N256K248l499J08J3992J717n307j5117j351K0750
14485I397R570N037q618l3774p069J3218J0980K509L185J6389K3222r811k6854
14472G381k4272L045j2564K533K2775K8108Q714k5586o432L4378O46m966k649
14459C1111j1011q327j6502j7160J0847P901p846K208J7611L572n043j372k003
14446C986k1659j4283J5539J3377m494q70m482r157r217l839R340P357p24l747
14432b2873J9120J2499R501j796J7945N072N32j6059j0440J4679n089l6872j4122
14419b7903N084N933P258J8257L182J1918j3444l079o676J848n089k1628q485
14406c2824O166P790K742J399j3650j6243m502p03K2201Q882P212J9418J3339
$$ plain form
14393 21227 21870 -5545 6584 52243 62553 38947 6226 -196 16139 22479 31396 70219 94502
14380 94502 70864 62307 54109 41389 21344 5092 -10320 -9947 1052 30601 60367 42843
14368 42843 30631 11704 1525 11172 25309 32840 4369 -14349 -6164 1962 7908 5402 15826
14355 15826 1865 3709 -5008 6735 4905 8660 21399 -9814 -45834 -47547 -44903 -7665 3670
14342 3670 14906 11005 -9291 -869 5888 8780 22344 55633 62487 38483 16153 9975 17106
14329 17106 7227 -18605 -22009 -11839 15517 23294 -3401 -12355 1820 19305 23574 36309 29187
14316 29187 -12415 -13088 6336 14955 23733 30686 29597 15298 34957 30290 31643 36429 45299 10767
14302 10767 -15628 -22468 -7478 -12546 -22415 -25140 -24288 -13208 -2038 -11280 -34802 -32959 -40147
$$ packed form
14393B1227O43k7415J2129M5659J0310k3606l2721o422J6335O340Q917L8823K4283
14380I4502k3638q557q198j2720k0045j6252j5412L73J0999K9549K9766j7524
14368D2843j2212j8927j0179R647J4137P531k8471j8718Q185Q126N946k506J0424
14355A5826j3961J844q717J1743j830L755J2739l1213l6020j713K644L7238J1335
14342C670J1236l901k0296Q422O757K892J3564L3289O854k4004k2330o178P131
14329A7106r879k5832l404J0170K7356P777k6695q954J4175J7485M269J2735p122
14316B9187m1602o73J9424Q619Q778O953j089j4299J9659m667J353M786Q870l4532
14302A0767k6395o840J4990n068r869k725Q52J1080J1170r242k3522J843p188
$$ plain form
14289 -40147 -32971 -17086 -15584 -19910 -11654 -8754 -7331 5954 5766 13423 8571 15298 22845 40271
14275 40271 23157 31936 37704 -2728 -18941 -14921 -10129 -7178 13952 30838 21037 31323 35532
14262 35532 13879 -9778 -11954 -16759 -8667 12619 3286 -18243 -26176 -25869 -42329 -27667 -3433
14249 -3433 3820 2500 1523 -13725 -19841 -19700 -20590 -8277 5721 1050 -14006 -9498 -504 -12913
14235 -12913 -12270 -11568 -7380 -7592 9876 -4070 -27549 -23682 -6260 7862 28936 37389 40141 13105
14221 13105 16292 34950 19314 -5811 -10999 -6120 1292 -12353 -23224 -5012 18071 12065 5393
14208 5393 6230 250 5733 8334 17789 28349 32905 37573 39595 19006 5544 21775 44594 54463
14194 54463 53994 38083 26908 19452 11635 27574 52038 52563 22788 15255 -2801 -5876 -13056
$$ packed form
14289d0147P176J5885J502m326Q256K900J423J3285j88P657m852O727P547J7426
14275D0271j7114Q779N768m0432j6213M020M792K951K1130J6886r801J0286M209
14262C5532k1653k3657k176m805Q092K1286r333k1529p933L07j6460J4662K4234
14249c433P253j320r77j5248o116J41q90J2313J3998m671j5056M508Q994j2409
14235a2913O43P02M188k12J7468j3946k3479L867J7422J4122K1074Q453K752k7036
14221A3105L187J8658j5636k5125n188M879P412j3645j0871J8212K3083o006o672
14208E393Q37n980N483K601R455J0560M556M668K022k0589j3462J6231K2819R869
14194E4463m69j5911j1175p456p817J5939K4464N25k9775p533j8056l075p180
$$ plain form
14181 -13056 -3572 -27724 -23534 -9739 -10891 -18223 -21566 356 6154 -6106 -17560 -1584 4064
14168 4064 -5089 -22019 -32142 -30758 -31299 9119 26071 4530 -4079 10290 53260 63087 50888
14155 50888 39569 26014 30852 34426 -5592 -43237 -10477 31441 32734 16476 43233 49387
14143 49387 63387 79621 118865 208602 272477 245865 196473 149804 92873 65757 38942 26214
14131 26214 34605 20281 930 15598 26472 25068 41385 39012 32438 18524 19043 17315 29414
14118 29414 26351 14515 28984 16784 1512 23533 16474 17394 28353 34965 33540 37507 40534
14105 40534 39827 65032 85824 89439 84119 95245 136880 202806 273470 377383 568709 731224
14093 731224 746079 614514 450548 324852 229768 175548 151548 139644 136796 122401 76867
$$ packed form
14181a3056R484k4152M190J3795j152p332l343K1922N798j2260j1454J5976N648
14168D064r153j6930j0123J384n41M0418J6952k1541q609J4369M2970R827j2199
14155E0888j1319j3555M838L574m0018l7645L2760M1918J293j6258K6757O154
14143D9387J4000J6234L9244Q9737O3875k6612m9392m6669n6931k7116k6815j2728
14131B6214Q391j4324j9351J4668J0874j404J6317k373o574j3914N19j728J2099
14118B9414l063j1836J4469j2200j5272K2021p059R20J0959O612j425L967L027
14105D0534p07K5205K0792L615n320J1126M1635O5926P0664J03913J91326J62515
14093G31224J4855j31565j63966j25696r5084n4220k4000j1904k848j4395m5534
$$ plain form
14082 76867 60318 59627 66247 66941 75587 80186 58671 62892 56344 39844 32443 30911 9637 16247
14068 16247 27105 21753 40128 48059 67367 65703 58295 47303 49524 43242 55713 88425 119492
14055 119492 135579 147844 179297 274822 393277 553111 728527 790495 662613 470992
14045 470992 320456 223268 160399 131813 125546 110732 114371 86826 51548 38983 38885 44435
14033 44435 40219 44731 45165 39732 28871 41266 27223 14776 14683 43493 41056 33449 17213 17968
14019 17968 38541 57398 37133 37792 71671 90489 87739 80838 94606 104724 80804 94420
14007 94420 93661 115459 185592 273119 286976 238531 182375 149829 120569 84499 71218 56857
13995 56857 51111 52319 49818 37686 41395 49435 36349 44263 29449 20790 30691 30502 19851 -10537
$$ packed form
14082G6867j6549o91O620O94Q646M599k1515M221o548j6500p401j532k1274O610
14068A6247J0858n352J8375P931J9308j664p408j0992K221o282J2471L2712L1067
14055A19492J6087J2265L1453R5525J18455J59834J75416O1968j27882j91621
14045D70992j50536r7188o2869k8586o267j4814L639k7545l5278j2565r8N550
14033D4435m216M512M34n433j0861J2395j4043j2447r3K8810k437p607j6236P55
14019A7968K0573J8857k0265O59L3879J8818k750o901J3768J0118k3920J3616
14007I4420p59K1798P0133Q7527J3857m8445n6156l2546k9260l6070j3281j4361
13995E6857n746J208k501j2132L709Q040j3086P914j4814q659R901j89j0651l0388
$$ plain form
13981 -10537 -25373 -26058 -44946 -46416 -32528 -9001 17289 42741 54063 45714 27381 15942
13969 15942 19466 17040 -286 4731 37575 22503 -3019 -13475 -11700 -36560 -35059 -13295 15369
13956 15369 37333 17265 16801 7774 853 9926 26607 29167 -529 -6863 7550 -11574 -60242
13943 -60242 -41956 -15055 6515 5907 20026 36677 24508 31739 38651 50731 42402 25279 13876
13930 13876 18343 43225 49488 48300 50349 40766 37823 27641 14092 12803 46214 44928 16286
13917 16286 16337 31904 48884 33590 21650 12294 17612 25061 28380 49363 26509 -5091 -2730
13904 -2730 97 3342 24919 31966 27499 11327 -35 25858 34966 50137 45175 33553 22323
13891 22323 40305 53105 46305 38464 35803 60753 87632 63917 23949 40315 54108 54047 38750
$$ packed form
13981a0537j4836o85j8888j470J3888K3527K6290K5452J1322q349j8333j1439
13969A5942L524k426j7326N017L2844j5072k5522j0456J775k4860J501K1764K8664
13956A5369K1964k0068m64r027o921R073J6681K560k9696o334J4413j9124m8668
13943f0242J8286K6901K1570o08J4119J6651j2169P231O912J2080q329j7123j1403
13930A3876M467K4882O263j188K049r583k943j0182j3549j289L3411j286k8642
13917A6286N1J5567J6980j5294j1940r356N318P449L319K0983k2854l1600K361
13904b730K827L245K1577P047m467j6172j1362K5893R108J5171m962j1622j1230
13891B2323J7982J2800o800p841k661K4950K6879k3715l9968J6366J3793o1j5297
$$ plain form
13878 38750 63435 82917 71786 71694 83322 89605 78145 33671 26803 45539 63824 55277 32562
13865 32562 37480 33065 23604 33230 39789 38492 61326 76412 65071 69592 64497 44744 32748
13852 32748 45487 36578 28175 51035 71210 63904 68302 59928 55304 50869 44468 48687 65258
13839 65258 66291 37461 30028 33290 41742 53411 66140 75482 69162 40502 48195 59136 62106
13826 62106 71728 69243 59851 62704 69309 47427 47395 35978 37030 40282 59698 83380 85849 102013
13812 102013 119525 103128 100964 116889 140560 117559 81094 52965 33634 13348 15722 30360
13800 30360 61813 63667 85356 89917 85598 69356 44042 33081 45737 31887 11104 31297
13788 31297 43958 23914 16606 37524 56044 80737 98380 90979 87382 91220 98999 89798 95620
$$ packed form
13878C8750K4685J9482j1131r2J1628O283j1460m4474o868J8736J8285q547k2715
13865C2562M918m415r461R626O559j297K2834J5086j1341M521n095j9753j1996
13852C2748J2739q909q403K2860K0175p306M398q374m624m435o401M219J6571
13839F5258J033k8830p433L262Q452J1669J2729R342o320k8660P693J0941K970
13826F2106R622k485r392K853O605k1882l2j1417J052L252J9416K3682K469J6164
13812A02013J7512j6397k164J5925K3671k3001l6465k8129j9331k0286K374J4638
13800C0360L1453J854K1689M561m319j6242k5314j0961J2656j3850k0783K0193
13788C1297J2661k0044p308K0918J8520K4693J7643p401l597L838P779r201N822
$$ plain form
13775 95620 94002 80499 76089 73026 70645 115031 134222 129461 98087 85854 100554 97959 135409
13762 135409 170412 171284 152461 149763 142002 148237 142557 142795 134339 115895 103588 93496 96202
13749 96202 138339 141518 125372 103446 109677 113569 103354 74085 68013 74436 87094 98866 132019
13736 132019 166687 159923 150697 172775 192024 194644 205675 189947 178298 174209 188070 221690
13724 221690 238190 253511 251071 250812 246556 248884 240694 250083 262087 289370 319359 333210 337512
13711 337512 364419 390366 383672 371546 381742 404108 403780 413440 444062 465195 500385 547475
13699 547475 606759 646174 689771 732704 762999 843030 957382 1082022 1195608 1353138 1567259
13688 1567259 1827316 2157594 2596843 3157757 3858948 4702214 5828896 7509418 10261151
$$ packed form
13775I5620j618j3503m410l063k381M4386J9191m761l1374j2233J4700k595L7450
13762A35409L5003Q72j8823k698p761O235n680K38q456j8444j2307j0092K706
13749I6202M2137L179j6146k1926O231L892j0215k9269o072O423J2658J1772L3153
13736A32019L4668o764r226K2078J9249K620J1031j5728j1649m089J3861L3620
13724B21690J6500J5321k440k59m256K328q190R389J2004K7283K9989J3851M302
13711C37512K6907K5947o694j2126J0196K2366l28R660L0622K1133L5190M7090
13699E47475N9284L9415M3597M2933L0295Q0031J14352J24640J13586J57530K14121
13688A567259K60057L30278M39249N60914P01191Q43266J126682J680522K751733
$$ plain form
13679 10261151 14779565 22099455 32920568 44136000 47651364 41204386 30543960 21122943
13671 21122943 14807970 10901377 8426283 6829574 5763802 5031011 4459368 3949192
13663 3949192 3490004 3153452 2919155 2736007 2605660 2534961 2480669 2452272 2418387 2421104
13653 2421104 2452923 2525027 2638187 2767639 2943562 3152498 3418796 3733462 4162254 4698676
13643 4698676 5375537 6328526 7606977 9253648 11234975 13629693 16750570 21362175
13635 21362175 28797633 41127393 61580937 93533910 132767699 152901946 135640603
13628 135640603 100118880 66976311 45130528 32143740 24197072 19172984 15900968
13621 15900968 13650716 11858463 10224637 8759644 7596950 6728727 6085024 5611809
$$ packed form
13679A0261151M518414P319890J0821113J1215432L515364o446978j0660426r421017
13671B1122943o314973l906593k475094j596709j065772p32791n71643n10176
13663C949192m59188l36552k34297j83148j30347p0699n4292k8397l3885K717
13653B421104L1819P2104J13160J29452J75923K08936K66298L14666M28792N36422
13643D698676O76861R52989J278451J646671J981327K394718L120877M611605
13635B1362175P435458J2329760K0453544L1952973L9233789K0134247j7261343
13628A35640603l5521723l3142569k1845783j2986788p946668n024088l272016
13621A5900968k250252j792253j633826j464993j162694q68223o43703m73215
$$ plain form
13613 5611809 5251503 4979791 4748926 4508797 4306745 4147046 4075047 4060398 4100183 4209099
13603 4209099 4376592 4603770 4858835 5210203 5694267 6332378 7212821 8400673 9984153
13594 9984153 11950319 14290515 17313275 21669306 28593480 40040535 59099865 89406129
13586 89406129 129266278 155660789 143341109 108167050 72608603 48279958 33807670
13579 33807670 25085264 19587482 16032590 13664012 11818471 10114202 8598570 7365474
13571 7365474 6423203 5706925 5155696 4721283 4393755 4119969 3847880 3580228 3352246
13562 3352246 3143462 2989613 2871924 2799013 2789612 2847002 2881720 2883013 2949268 3109874 3357260
13551 3357260 3707950 4191108 4814910 5608357 6592259 7988022 10196446 13809577 19787404
$$ packed form
13613E611809l60306k71712k30865k40129k02052j59699p1999j4649L9785J08916
13603D209099J67493K27178K55065L51368M84064O38111Q80443J187852J583480
13594I984153J966166K340196L022760M356031O924174J1447055J9059330L0306264
13586H9406129L9860149K6394511j2319680l5174059l5558447k4328645j4472288
13579C3807670q722406n497782l554892k368578j845541j704269j515632j233096
13571G365474r42271p16278n51229m34413l27528k73786k72089k67652k27982
13562C352246k08784j53849j17689p2911r401N7390L4718J293O6255J60606K47386
13551C357260L50690M83158O23802P93447R83902J395763K208424L613131N977827
$$ plain form
13542 19787404 29273210 41712238 50547018 48208859 37884244 26425936 17926150 12617231
13534 12617231 9361578 7298386 5959645 5049688 4324278 3732906 3187257 2756704 2426492
13525 2426492 2170083 1965579 1819605 1708051 1633188 1532656 1408719 1293861 1169664 1028065
13515 1028065 948437 896142 865428 828223 784196 747497 718071 682947 616385 564065 549361
13504 549361 518353 492473 462374 440225 407707 380027 377125 362576 348712 337190 322106 320664
13492 320664 319540 314570 330845 320483 295355 280161 273361 264924 278095 291648 284288 261807
13480 261807 236237 255511 281374 297886 322641 349022 376933 344446 286474 245894 237638 219032
13468 219032 217122 212286 187830 193766 214938 221927 203211 180299 166018 153299 155266 171307
$$ packed form
13542A9787404R485806J2439028Q834780k338159j0324615j1458308q499786n308919
13534A2617231l255653k063192j338741r09957p25410n91372n45649m30553l30212
13525B426492k56409k04504j45974j11554p4863j00532j23937j14858j24197j41599
13515A028065p9628n2295l0714l7205m4027l6699k9426l5124o6562n2320j4704
13504E49361l1008k5880l0099k2149l2518k7680k902j4549j3864j1522j5084j442
13492C20664j124m970J6275j0362k5128j5194o800q437J3171J3553p360k2481
13480B61807k5570J9274K5863J6512K4755K6381K7911l2487n7972m0580q256j8606
13468B19032j910m836k4456N936K1172O989j8716k2912j4281j2719J967J6041
$$ plain form
13456 171307 177386 146652 132662 164482 151089 116122 119143 117209 91403 81341 80016 93059
13444 93059 114809 122054 127222 134318 111638 92419 90591 72274 75054 63598 50665 66858 113023
13431 113023 140393 141676 116047 121497 150115 148942 133072 119111 102600 109664 130339 130211 117836
13418 117836 104222 111174 99335 95497 89453 94730 91111 88005 69961 76664 68408 54767 56173
13405 56173 76352 59340 46406 56451 91166 112137 116088 118477 103970 85622 68128 58758
13393 58758 73737 101603 98988 90796 62995 42348 87337 119399 99155 77263 77984 82763 99755
13380 99755 111220 112647 101033 73972 51054 78735 89680 74184 83534 75775 62128 60729
13368 60729 57039 62110 74167 74785 51382 35324 56577 68620 72610 74952 51609 56767 84435
$$ packed form
13456A71307O079l0734j3990L1820j3393l4967L021j934k5806j0062j325J3043
13444I3059K1750P245N168P096k2680j9219j828j8317K780j1456j2933J6193M6165
13431A13023K7370J283k5629N450K8618j173j5870j3961j6511P064K0675j28j2375
13418A17836j3614O952j1839l838o044N277l619l106j8044O703q256j3641J406
13405E6173K0179j7012j2934J0045L4715K0971L951K389j4507j8348j7494r370
13393E8758J4979K7866k615q192k7801k0647M4989L2062k0244k1892P21M779J6992
13380I9755J1465J427j1614k7061k2918K7681J0945j5496R350p759j3647j399
13368F0729l690N071J2057O18k3403j6058K1253J2043L990K342k3343N158K7668
$$ plain form
13355 84435 95416 87546 75050 68649 37859 41953 72154 84233 72999 53368 31075 32954
13343 32954 65582 74620 85340 97920 106672 95721 93116 75871 50061 50643 77616 82720 54299
13330 54299 55957 76869 57258 54035 45556 59552 66656 71411 73086 64197 54002 44265 36469
13317 36469 55624 72734 57835 34859 46076 49469 24360 12985 34649 55244 41143 20896
13305 20896 41619 44489 33853 32537 17074 12389 18289 5861 16939 46962 61483 53293 53844
13292 53844 54418 37411 23082 32828 56522 55890 34607 20229 16376 55065 73974 71826 44067
13279 44067 8969 38427 92423 96443 66622 45469 44625 31248 24097 25363 35499 52660 45472
13266 45472 51636 49889 55434 54940 46428 48637 62712 47260 30457 17276 4094 506 9958
$$ packed form
13355H4435J0981p870j2496o401l0790M094L0201J2079j1234j9631k2293J879
13343C2954L2628R038J0720J2580Q752j0951k605j7245k5810N82K6973N104k8421
13330E4299J658K0912j9611l223q479J3996P104M755J675q889j0195r737p796
13317C6469J9155J7110j4899k2976J1217L393k5109j1375K1664K0595j4101k0247
13305B0896K0723K870j0636j316j5463m685N900j2428J1078L0023J4521q190N51
13292E3844N74j7007j4329R746K3694o32k1283j4378l853L8689J8909k148k7759
13279D4067l5098K9458N3996M020k9821k1153q44j3377p151J266J0136J7161p188
13266D5472O164j747N545m94q512K209J4075j5452j6803j3181j3182l588R452
$$ plain form
13253 9958 -2094 2692 19241 22292 11647 2947 17674 28760 31624 29403 38198 18820 33132
13240 33132 47971 29691 34700 50734 42988 37714 46848 35410 34459 43228 46540 50803 30498
13227 30498 11198 29658 65312 99019 99106 88517 51164 27219 10337 10748 17393 39447 35771
13214 35771 43349 31860 57483 77172 87866 91697 76573 93379 138603 227688 292191 298091
13202 298091 252517 172627 121604 71145 69380 67572 54020 42532 32072 11308 12172 11320 16337
13189 16337 15403 50594 63956 62295 70110 73765 68759 48047 36704 43564 65903 51855 31837
13176 31837 30952 34289 22414 30763 34331 19063 8679 20672 60333 75442 77191 102951 143513
13163 143513 179340 242726 346668 533261 723539 797696 689330 515088 379429 303946
$$ packed form
13253I958j2052M786J6549L051j0645q700J4727J1086K864k221Q795j9378J4312
13240C3132J4839j8280N009J6034p746n274R134j1438r51Q769L312M263k0305
13227C0498j9300J8460L5654L3707Q7j0589l7353k3945j6882M11O645K2054l676
13214C5771P578j1489K5623J9689J0694L831j5124J6806M5224Q9085O4503N900
13202B98091m5574p9890n1023n0459j765j808j3552j1488j0460k0764Q64q52N017
13189A6337r34L5191J3362j661P815L655n006k0712j1343O860K2339j4048k0018
13176C1837q85L337j1875Q349L568j5268j0384J1993L9661J5109J749K5760M0562
13163A43513L5827O3386J03942J86593J90278P4157j08366j74242j35659p5483
$$ plain form
13153 303946 243566 173425 144841 127105 120748 104954 95869 86392 83960 90250 90019 73750 44707
13140 44707 20303 21809 26636 28563 49237 44292 23303 5571 12037 26372 42402 37508 13359
13127 13359 22990 37095 34317 50081 51610 60734 85442 144433 200818 226938 250784 315114
13115 315114 443390 630798 765299 743491 578433 381476 259263 198145 149544 121845
13105 121845 117580 115892 124086 116263 77959 84659 59250 69880 34920 3042 840 20721 28460
13092 28460 16962 9372 5314 8236 20304 26047 6629 4355 8790 14003 12124 37046 58007
13079 58007 74936 73346 66532 48566 16692 30454 78218 105068 102892 156020 224843 274025
13067 274025 261769 206978 143404 86597 60714 50776 57673 46285 6704 10480 20934 28729
$$ packed form
13153C03946o0380p0141k8584j7736o357j5794r085r477k432O290k31j6269k9043
13140D4707k4404J506M827J927K0674m945k0989j7732O466J4335J6030m894k4149
13127A3359R631J4105k778J5764J529R124K4708N8991N6385K6120K3846O4330
13115C15114J28276J87408J34501k1808j65058j96957j22213o1118m8601k7699
13105A21845m265j688Q194p823l8304O700k5409J0630l4960l1878k202J9881P739
13092B8460j1498p590m058K922J2068N743j9418k274M435N213j879K4922K0961
13079E8007J6929j590o814j7966l1874J3762M7764K6850k176N3128O8823M9182
13067B74025j2256n4791o3574n6807k5883r938O897j1388l9581L776J0454P795
$$ plain form
13055 28729 45338 43522 25753 15026 30974 31307 28839 28807 20821 13076 10410 12318 5334 -21647
13041 -21647 -39684 -11184 16385 11937 11060 14299 22646 33577 13181 -4576 6089 15324 12420
13028 12420 21432 13423 7814 8100 -14953 -23000 -6970 -4313 4817 -13542 -19520 -28899 -31165 -14237
13014 -14237 -6327 -4188 7052 41793 72081 70656 46517 23718 3892 14801 39032 45618
13002 45618 42786 45196 31372 43218 21178 -16280 -27057 -40556 -37275 -35779 -3122 -4272 -15289
12989 -15289 20591 32722 25268 -19743 -57336 -45785 -27864 -5238 6250 2025 -15177 -38612
12977 -38612 -57015 -31926 -34591 -31316 -17060 8603 -3969 -15841 -7373 -27974 -45812 -28779
12965 -28779 -11306 3538 4846 29644 18062 19670 24772 18170 8434 -1546 -6741 -15884 481
$$ packed form
13055B8729J6609j816j7769j0727J5948L33k468l2p986p745k666J908o984k6981
13041b1647j8037K8500K7569m448q77L239Q347J0931k0396j7757J0665R235k904
13028A2420R012q009n609K86k3053q047J6030K657R130j8359n978r379k266J6928
13014a4237P910K139J1240L4741L0288j425k4139k2799j9826J0909K4231O586
13002D5618k832K410j3824J1846k2040l7458j0777j3499L281J496L2657j150j1017
12989a5289L5880J2131p454m5011l7593J1551J7921K2626J1488m225j7202k3435
12977c8612j8403K5089k665L275J4256K5663j2572j1872Q468k0601j7838J7033
12965b8779J7473J4844J308K4798j1582J608N102o602r736r980n195r143J6365
$$ plain form
12952 481 -10224 10356 32388 34591 18605 22521 12588 -8292 -2369 3956 35293 38282 19133
12939 19133 -5671 6382 4739 932 2314 2834 9016 15767 10081 -1660 -19779 -48754 -15015
12926 -15015 -19339 -34837 -34564 -10677 -7804 -1538 6620 20049 15751 1307 13734 24395 31830
12913 31830 52551 54451 36580 15351 14147 14698 -5126 2205 10195 16617 12085 14159 23397 35595
12899 35595 14690 1888 -11803 -1230 10772 9054 11474 32011 25360 13577 16992 23788 25703
12886 25703 21530 -7700 -2524 5527 8240 -2457 1741 29904 42373 54473 77108 117347 167824
12873 167824 189258 165274 120251 82776 71958 62547 46217 37026 17691 -11531 -9755 8707
12861 8707 13964 -5061 4189 6735 33698 33488 -5505 -34058 -35447 -47101 -18836 -18571 -24721 -20933
$$ packed form
12952D81j0705K0580K2032K203j5986L916r933k0880N923O325L1337K989j9149
12939A9133k4804J2053j643l807J382N20O182O751n686j1741j8119k8975L3739
12926a5015m324j5498K73K3887K873O266Q158J3429m298j4444J2427J0661P435
12913C1830K0721J900j7871k1229j204N51j9824P331P990O422m532K074R238J2198
12899C5595k0905j2802j3691J0573J2002j718K420K0537o651j1783L415O796J915
12886B5703m173k9230N176Q051K713j0697M198K8163J2469J2100K2635M0239N0477
12873A67824K1434k3984m5023l7475j0818r411j6330r191j9335k9222J776J8462
12861H707N257j9025R250K546K6963k10l8993k8553j389j1654K8265K65o150L788
$$ plain form
12847 -20933 -16010 -4642 12983 22565 7446 -3908 -10183 1198 1667 -7723 -7126 1929 15101
12834 15101 9479 434 -96 -24243 -25329 -16686 -24428 -4715 -7366 -27507 -23687 -25644 -30256 -18984
12820 -18984 16010 7242 -19358 -13325 -11288 -358 20309 31536 19767 16186 10277 14785 -7184
12807 -7184 -20738 -4219 7148 14944 20670 -464 -25999 -25154 -811 31828 43685 53118 25345
12794 25345 -11384 -35252 -38321 -27227 -35686 -47697 -49769 -26023 9249 25276 801 6804
12782 6804 11333 9779 -10429 -17919 -11382 7612 16307 16053 4273 -7301 -3296 1169 10824 24146
12768 24146 6654 -12298 -17040 -11700 6200 12859 3910 -11395 -17514 -14132 2812 13978 -3792
12755 -3792 -3123 -33461 -51239 -35875 -32146 -3362 16146 -12550 -21324 -16424 8194 15881 1207
$$ packed form
12847b0933M923J1368J7625R582j5119j1354o275J1381M69r390N97R055J3172
12834A5101n622r045n30k4147j086Q643p742J9713k651k0141L820j957m612J1272
12820a8984L4994q768k6600O033K037J0930K0667J1227j1769l581n909M508k1969
12807g184j3554J6519J1367P796N726k1134k5535Q45K4343L2639J1857R433k7773
12794B5345l6729k3868l069J1094q459j2011k072K3746L5272J6027k4475O003
12782F804M529j554k0208p490O537J8994Q695k54j1780j1574M005M465R655J3322
12768B4146j7492j8952m742N340J7900O659q949j5305o119L382J6944J1166j7770
12755c792O69l0338j7778J5364L729K8784J9508k8696q774M900K4618P687j4674
$$ plain form
12742 1207 1216 14481 7379 -10870 408 1111 -1231 -2153 3893 21263 20209 35741 28066 6817
12728 6817 21501 37946 29404 12238 7999 6169 7942 20700 4545 19437 26184 6667 13582
12715 13582 -3930 -11341 17105 15226 7641 1807 -8037 4198 25502 28982 29941 13418 -4449
12702 -4449 -6063 -2042 -3281 -16330 -19394 -15479 -25562 -29707 -43513 -55197 -61965 -43367 -24412
12689 -24412 -23527 -18730 -7475 -11778 -11890 -10338 7577 22348 30579 29057 23281 12064 41755 41690
12675 41690 26978 10238 27076 29034 37280 41402 33786 39496 25118 17895 5507 -11267 -2498
12662 -2498 -3213 4566 17307 25863 33339 36745 33853 37205 16138 560 -20765 -12817 -5006 2651
12648 2651 4747 20216 10131 -13827 -4508 1116 14441 9407 9337 -6608 1331 4954 21720 19479
$$ packed form
12742A207RJ3265p102j8249J1278P03k342r22O046J7370j054J5532p675k1249
12728F817J4684J6445q542j7166m239j830J773J2758j6155J4892O747j9517O915
12715A3582j7512p411K8446j879p585n834r844J2235K1304L480R59j6523j7867
12702d449j614M021j239j3049l064L915j0083m145j3806j1684o768J8598J8955
12689b4412Q85M797J1255m303j12J552J7915J4771Q231j522n776j1217K9691o5
12675D1690j4712j6740J6838J958Q246M122p616N710j4378p223j2388j6774Q769
12662b498p15P779J2741Q556P476L406k892L352k1067j5578k1325P948P811P657
12648B651K096J5469j0085k3958R319N624J3325n034p0j5945P939L623J6766k241
$$ plain form
12634 19479 -2211 -24321 -26275 186 8344 21383 4722 -31709 -65221 -17658 6676 -7994
12622 -7994 -22369 -31970 -44661 -18981 15532 12588 6765 13220 1046 -7494 2210 11147 -936
12609 -936 -8164 -5244 -32821 -22455 -933 -4049 -33416 -34180 -39859 -36367 -36278 -18958 -11004 -24927
12595 -24927 -2961 1803 -1356 25025 32838 5571 -17273 -25538 -38971 -8986 -2146 -883 17531
12582 17531 -14440 -31336 -27225 -15260 -6970 24568 32319 20474 -4859 -33069 -3478 6756
12570 6756 28730 39554 34659 7718 29 4824 -8407 -24471 -26268 -8213 5472 8711 7676
12557 7676 -1667 -10314 -12127 1724 18109 18470 8391 14387 32711 22560 14311 2740 -16471
12544 -16471 -11418 11442 24531 31942 29766 11121 -15213 -17997 -34971 -14141 -11121 -6714 -26120
$$ packed form
12634A9479k1690k2110j954K6461Q158J3039j6661l6431l3512M7563K4334j4670
12622g994j4375r601j2691K5680L4513k944n823O455j2174q540R704Q937j2083
12609i36p228K920k7577J0366K1522l116k9367p64n679L492Q9J7320P954j3923
12595b4927K1966M764l159K6381P813k7267k2844q265j3433K9985O840J263J8414
12582A7531l1971j6896M111J1965Q290L1538P751j1845k5333k8210K9591J0234
12570F756K1974J0824m895k6941p689M795j3231j6064j797J8055J3685L239j035
12557G676r343q647j813J3851J6385L61j0079N996J8324j0151q249j1571j9211
12544a6471N053K2860J3089P411k176j8645k6334k784j6974K0830L020M407j9406
$$ plain form
12531 -26120 -30544 -48479 -28515 -30302 -25550 -24590 -24849 -30476 -22023 -8154 -3678 -8986 -15217 -19327
12517 -19327 -24189 -12046 -5965 3063 -11197 -38369 -40751 -31664 -15618 -28393 -35829 -34877 -14028
12504 -14028 -8111 -12211 -987 12683 15352 8164 -6918 -10792 -22708 -27302 -30465 -7477 12220
12491 12220 6177 -2196 -16708 -8162 10335 2975 -10863 -7681 8616 646 3069 -15954 -48540
12478 -48540 -22403 -25803 -25570 -10303 -8571 3541 11762 7355 -6346 881 -8827 -348 6860 -4613
12464 -4613 -14566 10522 23237 16046 861 5572 -19474 -23711 6428 9276 6162 36726 24600
12451 24600 -9289 11655 30231 -3438 -36410 -19824 -5973 16760 23445 41928 49104 15968
12439 15968 -16624 -18759 -22490 -22088 5958 21284 17310 4119 -7152 -8140 -2401 -4967 -16707
$$ packed form
12531b6120m424j7935J9964j787M752R60k59n627Q453J3869M476n308o231m110
12517a9327m862J2143O081R028j4260k7172k382R087J6046j2775p436R52K0849
12504a4028N917m100J1224J3670K669p188j5082l874j1916m594l163K2988J9697
12491A2220o043q373j4512Q546J8497p360j3838L182J6297p970K423j9023l2586
12478d8540K6137l400K33J5267J732J2112Q221m407j3701P227r708Q479P208j1473
12464d613r953K5088J2715p191j5185M711k5046m237L0139K848l114L0564j2126
12451B4600l3889K0944J8576l3669l2972J6586J3851K2733O685J8483P176l3136
12439A5968l2592k135l731M02K8046J5326l974j3191j1271r88N739k566j1740
$$ plain form
12426 -16707 -18435 -9995 10409 -7932 -15514 13103 22183 -6025 -7198 -20509 -29555 -32086 -13960
12413 -13960 17842 17936 9085 22715 26251 12257 -957 -2730 -5075 4175 7242 -17572 -22317 -22855
12399 -22855 -31770 -19854 -525 -5752 -26800 -32085 -51734 -47093 -18011 -14351 -23505 -17826 -6545
12386 -6545 2532 7859 -5347 25971 34085 23685 12951 830 -5237 -9575 17473 10816 -15257
12373 -15257 -22693 -1887 -182 -3914 18367 13717 7332 17428 14926 2763 16097 39531 36071
12360 36071 18196 20675 36797 40934 15075 21725 14539 -16135 -11308 -924 16594 19719 816
12347 816 -16436 -50577 -49604 -49605 -55588 -47051 -17433 -12196 -27839 -15743 -4025 -3175 -16640 -17879
12333 -17879 -19082 -19490 -23082 -4515 -1242 -17316 -4695 12763 11770 45429 61946 30644 4976
$$ packed form
12426a6707j728Q440K0404j8341p582K8617R080k8208j173j3311r046k531J8126
12413a3960L1802R4q851J3630L536j3994j3214j773k345R250L067k4814m745n38
12399b2855q915J1916J9329n227k1048n285j9649M641K9082L660r154N679J1281
12386f545R077N327j3206L1318Q114j0400j0734j2121o067m338K7048o657k6073
12373a5257p436K0806J705l732K2281m650o385J0096k502j2163J3334K3434l460
12360C6071j7875K479J6122M137k5859O650p186l0674M827J0384J7518L125j8903
12347H16j7252l4141R73jn983Q537K9618N237j5643J2096J1718Q50j3465j239
12333a7879j203m08l592J8567L273j6074J2621J7458r93L3659J6517l1302k5668
$$ plain form
12320 4976 -511 -17349 -32521 -24956 -10533 909 11590 23972 23567 25259 25992 16296 6068
12307 6068 -21134 -40138 -28179 -29642 -50586 -47886 -22072 9652 9639 -1148 -8003 6934 -3374
12294 -3374 2467 202 -24550 -17180 3818 -12898 -15734 666 6755 -6386 -1797 -14467 -6427
12281 -6427 4657 113 -22864 -15015 -19484 -18796 19489 38204 -2725 -20706 -14888 -5915 7423
12268 7423 -6200 -13126 -39364 -63540 -57918 -47962 -28858 -5536 -3945 -13238 -24060 -11786 -1620
12255 -1620 -17817 -14979 -8741 -11709 -26006 -29761 -15011 2251 -20710 -17893 -8526 -8664 -5782 -28886
12241 -28886 -34415 -23364 -33968 -32717 -14603 4211 5605 -4333 -2084 -21939 -10821 8077 7088
12228 7088 7380 2188 -12012 -11482 -17214 -15730 1650 300 501 18085 5806 -5209 -15632 -28042
$$ packed form
12320D976n487j6838j5172P565J4423J1442J0681J2382m05J692P33r696j0228
12307F068k7202j9004J1959j463k0944K700K5814L1724j3j0787o855J4937j0308
12294c374N841k265k4752P370K0998j6716k836J6400O089j3141M589j2670Q040
12281f427J1084m544k2977P849m469O88L8285J8715m0929j7981N818Q973J3338
12268G423j3623o926k6238k4176N622R956J9104K3322J591r293j0822J2274J0166
12255a620j6197K838O238k968j4297l755J4750J7262k2961K817R367j38K882k3104
12241b8886n529J1051j0604J251J8114J8814J394r938K249j9855J1118J8898r89
12228G088K92n192j4200N30n732J484J7380j350K01J7584j2279j1015j0423j2410
$$ plain form
12214 -28042 -316 1581 11082 20060 -2070 -19012 -19853 -11305 -2177 -7144 -17105 -22010 -22277 -22117
12200 -22117 -14635 -21988 62 18805 22587 30635 27680 20112 -2758 -28372 -11638 33365 30698
12187 30698 26212 37100 51471 49428 28439 32047 7285 -3698 -7482 -13757 -13396 -18240 -27421
12174 -27421 -16564 -6429 10175 31282 10436 12666 38286 21933 4565 21480 14959 9418
12162 9418 -4202 1444 19547 26507 6398 -5714 -25437 -32210 -16949 -12106 10523 9846 -11212
12149 -11212 -13743 -6474 -21495 -31797 -65005 -68275 -62451 -55556 -56774 -69060 -67601 -64944 -38029
12136 -38029 -18228 -14905 -6413 7189 7724 29410 24287 -5074 -21738 -26153 -14962 -2603 10567
12123 10567 30074 29450 27051 31836 45225 40006 22864 16912 -4885 -14795 -4481 8001 12149
$$ packed form
12214b8042K7726J897R501Q978k2130j6942q41Q548R128m967r961m905k67J60
12200b2117P482p353K2050J8743L782Q048k955p568k2870k5614J6734M5003k667
12187C0698m486J0888J4371k043k0989L608k4762j0983l784o275L61m844r181
12174b7421J0857J0135J6604K1107k0846K230K5620j6353j7368J6915o521n541
12162I418j3620N646J8103O960k0109j2112j9723o773J5261M843K2629o77k1058
12149a1212k531P269j5021j0302l3208l270N824O895j218j2286J459K657K6915
12136c8029J9801L323Q492J3602N35K1686n123k9361j6664m415J1191J2359J3170
12123A0567J9507o24k399M785J3389n219j7142n952k1797r910J0314J2482M148
$$ plain form
12110 12149 12736 13807 -7344 -473 10134 2377 -2304 -14225 -7864 8269 -5344 -32467 -30693
12097 -30693 -21424 -20766 -19432 -14031 5939 7779 -6363 -26477 -26821 -22525 -5447 2171 6977 -743
12083 -743 -7307 -4701 9735 27676 -9194 -20106 -2794 -216 -13490 -44614 -28183 2691 15596
12070 15596 9520 31585 25183 18086 10929 2320 -8462 -1209 21102 34983 13094 -5300 8709
12057 8709 23708 14040 5797 -13634 -15969 -14256 -20211 -20014 -38261 -36562 -15110 4126 1680 1190
12043 1190 21543 -694 2141 31606 50969 57214 64005 22669 -5462 12289 10502 157 -14798
12030 -14798 -5403 35288 38285 30564 17084 -904 3510 -12243 -43059 -20248 -14892 -23584 -7054
12017 -7054 12251 23193 30035 27125 29929 31348 15967 9888 31043 43286 57851 31652 -13734
$$ packed form
12110A2149N87J071k1151O871J0607p757m681j1921O361J6133j3613k7123J774
12097c0693R269O58J334N401J9970J840j4142k0114l44M296J7078P618M806p720
12083g43o564K606J4436J7941l6870j0912J7312K578j3274l1124J6431L0874J2905
12070A5596o076K2065o402p097p157q609j0782P253K2311J3881k1889j8394J4009
12057H709J4999r668q243j9431k335J713n955J97j8247J699K1452J9236k446m90
12043A190K0353k2237K835K9465J9363O245O791m1336k8131J7751j787j0345j4955
12030a4798R395M0691K997p721j3480j7988M414j5753l0816K2811N356q692J6530
12017g054J9305J0942O842k910K804J419j5381o079K1155J2243J4565k6199m5386
$$ plain form
12004 -13734 -20791 5788 25413 33484 33135 -1165 -8610 5127 8081 -10475 -17595 -45473 -42153
11991 -42153 -9965 -9233 -23355 -41824 -61146 -47029 -10796 -6079 -22881 -34197 -20487 -889
11979 -889 3282 6542 -1692 -21991 -17658 -12806 -38448 -41787 -22763 -10423 6787 28694 19432
11966 19432 15047 28091 37374 28567 17681 15560 8973 -4706 -16217 -11962 -4367 -11187 -19484
11953 -19484 -13926 7113 15718 13421 -7423 5003 22390 7096 -14483 -4604 -6099 -12646 -9939
11940 -9939 -9463 -6724 -28475 -28254 -12516 -1337 -11929 -15622 -11176 -4853 9368 18465 9295 2406
11926 2406 18672 8319 -16288 -25243 -5597 7210 14677 28329 21258 -3347 -17408 -12524 -2445
11913 -2445 -4927 -14929 -24745 5217 12451 -5606 1962 -2100 -17170 -30383 -34151 -25053 -14505
$$ packed form
12004a3734p057K6579J9625Q071l49l4300p445J3737K954j8556p120k7878L320
11991d2153L2188P32j4122j8469j9322J4117L6233M717j6802j1316J3710J9598
11979h89M171L260q234k0299M333M852k5642l339J9024J2340J7210K1907r262
11966A9432m385J3044R283q807j0886k121o587j3679j1511M255P595o820q297
11953a9484N558K1039Q605k297k0844J2426J7387j5294k1579R879j495o547K707
11940i939M76K739k1751K21J5738J1179j0592l693M446O323J4221R097r170o889
11926B406J6266j0353k4607q955J9646J2807P467J3652p071k4605j4061M884J0079
11913b445k482j0002r816K9962P234j8057P568m062j5070j3213l768R098J0548
$$ plain form
11900 -14505 10819 374 -15099 -22473 -22221 -5631 9382 7907 240 1634 -2703 -2623 -7949 -3777
11886 -3777 -5496 10186 10801 -1772 3760 -8262 -9917 -8310 -25172 -14784 -37192 -30326 -11828
11873 -11828 -32052 -48359 -39079 11566 8783 -468 -11458 -14856 5455 -11041 11552 35029
11861 35029 13256 4659 -2908 -7667 5774 35145 49358 34727 1252 -2323 22995 3467
11849 3467 -4647 862 3814 -8322 14946 17300 16877 -4322 11909 18463 -2956 -30989 -42442
11836 -42442 -43213 -17736 -7045 -26495 -31110 -6843 13412 16300 27118 16534 -1688 -23974
11824 -23974 -19761 -11622 2715 12970 6401 -478 -20667 -11826 -10383 -20049 -5473 -12814 -19908
11811 -19908 -15010 10509 26100 -19 10981 19664 -197 -9874 -1685 24380 15479 -10980 -5632
$$ packed form
11900a4505K5324j0445j5473p374K52J6590J5013j475p667J394m337Q0n326M172
11886c777j719J5682O15j2573N532j2022j655J607j6862J0388k2408O866J8498
11873a1828k0224j6307R280N0645k783r251j0990l398K0311j6496K2593K3477
11861C5029k1773q597p567m759J3441K9371J4213j4631l3475l575K5318j9528
11849C467q114N509K952j2136K3268K354m23k1199J6231O554k1419k8033j1453
11836d2442p71K5477J0691j9450m615K4267K0255K888J0818j0584j8222k2286
11824b3974M213Q139J4337J0255o569o879k0189Q841J443r666J4576p341p094
11811a9908M898K5519J5591k6119J1000Q683j9861r677Q189K6065q901k6459N348
$$ plain form
11798 -5632 4070 -1783 -9593 -4178 -20417 -39379 -28118 -20605 -32640 -39043 -3762 16509 20333
11785 20333 13759 30873 1784 -11905 -11193 -16584 4931 17318 17191 2540 10969 -3563 10163
11772 10163 33097 56036 68571 53775 31493 20663 35876 30407 32771 7085 -14589 -8020
11760 -8020 -11525 -19686 -932 3913 -10537 -33312 -56370 -56158 -53240 -50108 -27986 -17283 -31307
11747 -31307 -40505 -44935 -68569 -56759 -39209 -33471 -32200 -39670 -57945 -61645 -35675 -17787 2808
11734 2808 2944 -8522 -35913 -27875 -21848 -19233 -33616 -31893 -21549 -9438 3965 28715 11934
11721 11934 -13429 -51970 -35290 -18370 -16960 -20760 -25609 -21000 -16179 -15104 509 4621 4808
11708 4808 15613 4590 -19644 692 -14565 -36664 -8545 4589 10182 3522 -7293 -32609
$$ packed form
11798e632R702n853p810N415j6239j8962J1261P513j2035o403L5281K0271L824
11785B0333o574J7114k9089j3689P12n391K1515J2387j27j4651Q429j4532J3726
11772A0163K2934K2939J2535j4796k2282j0830J5213n469K364k5686k1674O569
11760h020l505q161J8754M845j4450k2775k3058K12K918L132K2122J0703j4024
11747c1307r198m430k3634J1810J7550N738J271p470j8275l700K5970J7888K0595
11734B808J36j1466k7391Q038O027K615j4383J723J0344J2111J3403K4750j6781
11721A1934k5363l8541J6680J6920J410l800m849M609M821J075J5613M112J87
11708D808J0805j1023k4234K0336j5257k2099K8119J3134N593o660j0815k5316
$$ plain form
11696 -32609 -31061 -8783 -30324 -28513 -18336 -15994 -26638 -16563 -415 -2261 20414 -9615
11684 -9615 -29651 -19406 -35235 -44444 -27892 -18021 8622 -1251 9323 27299 26817 25050 12039
11671 12039 -16949 -14841 -14207 -98 18971 9573 383 9175 -9491 -9178 3126 14959 16519
11658 16519 -104 -31875 -48835 -51077 -6074 23859 25049 -8870 -43174 -30885 -18368 -9920
11646 -9920 -7446 -12397 2187 1373 4457 1674 18711 24111 17878 29700 37590 4930 -3329 -15073
11632 -15073 6316 11539 -6580 -11315 -15073 -18408 -39022 -56555 -50794 -6693 21928 21417 -1175
11619 -1175 -5467 2300 -236 11976 17312 19260 5940 5461 -930 -22 239 -5042 -18660 -10477 8873
11604 8873 14160 3173 -32399 -30136 -1417 -8454 -15574 -38924 -34152 8828 7776 -1950 18112
$$ packed form
11696c2609J548K2278k1541J811J0177K342j0644J0075J6148j846K2675l0029
11684i615k0036J0245j5829r209J6552R871K6643r873J0574J7976m82j767j3011
11671A2039k8988K108O34J4109J9069r398r190Q792j8666L13J2304J1833J560
11658A6519j6623l1771j6960k242M5003K9933J190l3919l4304J2289J2517Q448
11646i920K474m951J4584q14L084k783J7037N400o233J1822P890l2660q259j1744
11632a5073K1389N223j8119m735l758l335k0614j7533N761M4101K8621n11k2592
11619a175m292P767k536J2212N336J948j3320m79o391R08K61n281j3618Q183J9350
11604H873N287j0987l5572K263K8719p037p120k3350M772M2980j052r726K0062
$$ plain form
11591 18112 33426 22368 6177 106 -7747 -656 -2258 3613 -9145 -3461 1233 9622 10501 24029
11577 24029 26357 -2794 4899 14823 20907 24686 43233 33162 14824 -1359 -6180 -26877 -23318
11564 -23318 -36814 -32071 -6417 -17310 -10392 -10618 -18435 -7300 -12183 -19153 -10424 3805 24699
11551 24699 17120 -3733 -17028 -36851 -20596 -17499 -34491 -48088 -46048 -56048 -38507 -24400
11539 -24400 -14036 -5725 -12228 -18160 -16717 -6380 -10423 -6257 -6798 -21504 -2284 -10271 -3801 22241
11525 22241 32934 32479 18970 14678 26533 -667 -36749 -40143 -25348 -2843 -8527 -33918 -24152
11512 -24152 -8197 -6624 -1221 -14011 -18650 -9615 4841 -24621 -27700 -9999 -426 387 7195
11499 7195 4523 -1313 -22049 -25881 -20198 9533 42201 50545 41148 43108 11113 -22239 -18401
$$ packed form
11591A8112J5314j1058j6191o071p853P091j602N871j2758N684M694Q389Q79J3528
11577B4029K328k9151P693R924O084L779J8547j0071j8338j6183m821k0697L559
11564b3318j3496M743K5654j0893O918k26p817J1135m883o970Q729J4229K0894
11551B4699p579k0853j3295j9823J6255L097j6992j3597K040j0000J7541J4107
11539b4400J0364Q311o503n932J443J0337m043M166n41j4706J9220p987O470K6042
11525B2241J0693m55j3509m292J1855k7200l6082l394J4795K2505n684k5391R766
11512b4152J5955J573N403j2790m639R035J4456k9462l079J7701R573Q13O808
11499G195k672n836k0736l832N683K9731L2668Q344r397J960l1995l3352L838
$$ plain form
11486 -18401 -33428 -48636 -46999 -29386 -14474 -4302 12549 12722 554 -3930 -13521 -26015 -22300
11473 -22300 -26246 -18810 -33553 -34800 -696 -6664 -23972 -18858 -11883 -6853 936 1987 -821 -10559
11459 -10559 -16758 -2767 -26788 -8393 3742 -5224 -823 3127 8502 27104 11274 21476 24299
11446 24299 3235 -12856 -10064 8263 -8023 -22664 -32370 -33864 -44314 -21634 -10320 12104
11434 12104 -8605 -43297 -31753 -12286 14270 25121 16737 22041 27239 32241 30137 23731 16122
11421 16122 -15020 -19366 -5758 3908 8477 15255 28972 35346 27894 19154 28315 28883 41137 28542
11407 28542 13616 -17889 -15931 -5791 -19389 -18964 -5828 392 17671 48778 36977 15682
11395 15682 2400 194 3263 4296 -2128 -11884 -29263 -10646 44019 62986 47299 25774 9974
$$ packed form
11486a8401j5027j5208J637J7613J4912J0172J6851J73j2168m484r591j2494L715
11473b2300l946P436j4743j247L4104n968j7308N114O975N030P789J051k808r738
11459a0559o199J3991k4021J8395J2135q966M401L950N375J8602j5830J0202K823
11446B4299k1064j6091K792J8327j6286j4641r706j494j0450K2680J1314K2424
11434A2104k0709l4692J1544J9467K6556J0851q384N304N198N002k104o406p609
11421A6122l1142m346J3608R666M569O778J3717O374p452q740R161N68J2254j2595
11407B8542j4926l1505J958J0140j3598M25J3136O220J7279L1107j1801k1295
11395A5682j3282k206L069J033o424r756j7379J8617N4665J8967j5687k1525j5800
$$ plain form
11382 9974 16291 21545 17135 -3850 -16747 -20686 -23048 -30913 -15123 9587 16791 24939 36848
11369 36848 29642 13981 2126 8579 14948 8613 -249 35 -723 -4421 856 16789 2053 1111
11355 1111 6671 6621 21857 46611 30099 7710 16707 10852 9482 -28810 -44250 -31485 -31553 -22127
11341 -22127 447 -4345 -26488 -43829 -51129 -38886 -32131 -32967 -37555 -25066 -6095 8315 11053
11328 11053 25938 32973 50372 73617 59475 40416 33355 2384 -3033 -5929 -16328 7634
11316 7634 19491 18982 -12758 -53004 -62233 -53577 -50017 -31732 -42856 -34961 -38864 -47083 -47293 -43048
11302 -43048 -30382 -19687 -8124 -8032 -5018 2497 2284 -2577 -5702 3851 6077 -2966 -10164 -9255 -21310
11287 -21310 -28741 -28763 -32927 -30177 -26653 -28351 -23618 -9965 -3258 -12825 -15775 -917 -9673 -16417
$$ packed form
11382I974O317N254m410k0985j2897l939k362p865J5790K4710P204Q148J1909
11369C6848p206j5661j1855O453O369o335q862K84p58l698N277J5933j4736r42
11355A111N560n0J5236K4754j6512k2389Q997n855j370l8292j5440J2765o8R426
11341b2127K2574m792k2143j7341p300J2243O755q36m588J2489J8971J4410K738
11328A1053J4885P035J7399K3245j4142j9059p061l0971n417k896j0399K3962
11316G634J1857n09l1740m0246r229Q656L560J8285j1124P895l903q219k10M245
11302d3048J2666J0695J1563R2L014P515k13m861l125R553K226r043p198R09j2055
11287b1310p431k2m164K750L524j698M733J3653O707r567k950J4858q756o744
$$ plain form
11273 -16417 -38668 -72645 -57990 -48989 -66214 -53564 -45957 -28757 -10471 -14358 -3666 3496
11261 3496 -3733 -12602 -15968 -12500 -17952 -11149 6670 3269 -13452 -9926 -10070 -5181 9022 10798
11247 10798 -3335 -19783 -25878 -21410 -25383 -29978 -28181 -27354 -38649 -24679 -18034 -15350 -10153 9937
11233 9937 16272 19298 7302 -10406 9601 5830 2110 10687 1443 1269 -19627 3362 -501 -1847
11219 -1847 -11488 -363 -7864 -7294 -9604 2425 14082 2141 -38771 -62698 -47809 -32260 -10670
11206 -10670 -19032 -9778 2558 9344 5834 4690 -28931 -41664 -11015 -12034 -10898 -692 -5637
11193 -5637 -6636 -8044 -20192 -26684 -12209 2371 12870 13106 8529 11183 -3108 5663 -12234 -35466
11179 -35466 -17359 -7410 -1933 -10194 -5504 -26007 -47019 -23439 3849 19495 19796 17352 28410
$$ packed form
11273a6417k2251l3977J4655R001j7225J2650P607J7200J8286l887J0692P162
11261C496p229q869l366L468n452O803J7819l401j6721L526j44M889J4203J776
11247A0798j4133j6448o095M468l973m595J797Q27j1295J3970O645K684N197K0090
11233I937O335L026j1996j7708K0007l771l720Q577r244j74k0896K2989l863j346
11219a847r641J1125p501N70k310J2029J1657j1941m0912k3927J4889J5549K1590
11206a0670q362R254J2336O786l510j144l3621j2733L0649j019J136J0206m945
11193e637r99j408j2148o492J4475J4580J0499K36m577K654j4291Q771j7897k3232
11179c5466J8107R949N477q261M690k0503k1012K3580K7288J5646L01k444J1058
$$ plain form
11166 28410 19999 -4110 3564 16618 25605 1269 -5899 -19010 -27063 -5165 10658 12806 -2312
11153 -2312 -18899 -12558 -15726 419 9783 8092 -10165 -21035 -9066 7783 12481 -6218 -24140
11140 -24140 -20638 -13719 -7816 -3682 -10162 -23444 -21035 14271 44402 40884 12924 -19699 -12736
11127 -12736 -7212 268 19141 50329 51244 16697 -4242 -40090 -24720 12671 13006 -5814 -37850
11114 -37850 -43983 -29506 -5803 -4802 -22426 14285 21524 25782 23610 16406 21706 17004 -5675
11101 -5675 -6648 -6780 -3881 -5911 -10105 -12487 -10872 -19554 -16731 -12259 -30080 -35953 -30497 -44868 -43874
11086 -43874 -13892 -13854 -26347 -37410 -35642 -57947 -63172 -36960 -44002 -42416 -27405 -31554 -34048
11073 -34048 -4498 -5867 3529 1148 -9156 -25461 -18077 -13050 8778 11787 16056 17744 5477
$$ packed form
11166B8410q411k4109P674J3054Q987k4336p168j3111q053K1898J5823K148j5118
11153b312j6587O341l168J6145R364j691j8257j0870J1969J6849M698j8699j7922
11140b4140L502O919N903M134o480j3282K409L5306L0131l518k7960l2623O963
11127a2736N524P480J8873L1188R15l4547k0939l5848J5370L7391L35j8820l2036
11114c7850o133J4477K3703J001j7624L6711P239M258k172p204N300m702k2679
11101e675r73j32K899k030m194k382J615q682K823M472j7821n873N456j4371R94
11086d3874K9982L8j2493j1063J768k2305n225K6212p042J586J5011m149k494
11073c4048K9550j369R396k381j0304j6305P384N027K1828L009M269J688j2267
$$ plain form
11060 5477 -10072 -7749 -16968 -26902 -35496 -53343 -41866 -34965 -31342 -13664 -5543 26725 20224
11047 20224 14666 15250 20244 35602 26950 -11016 -21014 -7807 -21869 -40960 -45075 -29291 -15530
11034 -15530 3955 16383 12874 -21593 -27098 -36613 -51150 -54595 -31855 -37651 -29348 -16270 -17583
11021 -17583 14192 7037 -2390 10572 10613 19078 36750 27855 23538 23185 -6381 -42978 -15808 -11727
11007 -11727 -18713 -21551 -28862 -23881 -10701 6268 8894 -4018 -11736 -4808 -19224 -14141 -32800
10994 -32800 -29919 6291 -364 -4233 -21742 -17247 -44770 -23592 -85 8704 4297 13403 42004
10981 42004 29109 11361 29 -3799 -2620 -20927 -32599 -17303 -16740 -15556 -13027 -38297 -32292
10968 -32292 -19523 -7494 -3298 -26167 -35697 -14086 -4684 17003 16428 11607 21330 8537 -1313
$$ packed form
11060E477j5549K323r219r934q594j7847J1477O901L623J7678Q121L2268o501
11047B0224n558N84M994J5358q652l7966r998J3207j4062j9091m115J5784J3761
11034a5530J9485J2428l509l4467n505r515j4537l445K2740n796Q303J3078j313
11021a7583L1775p155r427J2962M1Q465J7672q895m317l53k9566l6597K7170M081
11007a1727o986k838p311M981J3180J6969K626j2912p718O928j4416N083j8659
10994c2800K881L6210o655l869j7509M495k7523K1178K3507Q789m407R106K8601
10981D2004j2895j7748j1332l828J179j8307j1672J5296N63J184K529k5270O005
10968c2292J2769J2029M196k2869r530K1611R402K1687n75m821R723j2793r850
$$ plain form
10955 -1313 -8936 -4724 -267 6583 7675 13525 4388 -21210 -26717 -19942 -23429 -34072 -57877 -77161
10941 -77161 -65422 -44107 -36012 -41138 -26494 6346 2515 -30247 -50703 -36299 -23540 -3620
10929 -3620 9744 -2263 -7003 -14528 6401 22221 17273 -3731 16449 33397 19265 2026
10917 2026 -1376 -13201 -19859 -17054 -3828 27581 23679 -18892 -60955 -48894 -44660 -38789 -26351
10904 -26351 -24854 -11495 -8286 -30143 -26450 4818 12396 8157 4791 8910 -13701 -23272 -8661
10891 -8661 10616 20781 28697 18459 -24340 -42679 -5207 17952 16115 5214 16624 17779
10879 17779 -1945 -2085 1461 -2302 2456 -1457 3430 -5757 -14624 -19930 -34597 -21038 -25568 -30875
10865 -30875 -13818 -11592 1812 18372 -6993 -35501 -35733 -44418 -40586 -29333 -40937 -17547 -34311
$$ packed form
10955a313p623M212M457O850J092N850r137k5598n507O775l487j0643k3805j9284
10941g7161J1739K1315Q095n126J4644L2840l831l2762k0456J4404J2759J9920
10929c620J3364j2007m740p525K0929J5820m948k1004K0180J6948j4132j7239
10917B026l402j1825o658K805J3226L1409l902m2571m2063J2061M234N871J2438
10904b6351J497J3359L209k1857L693L1268P578m239l366M119k2611r571J4611
10891h661J9277J0165P916j0238m2799j8339L7472K3159j837j0901J1410J155
10879A7779j9724j40L546l763M758l913M887r187q867n306j4667J3559m530n307
10865c0875J7057K226J3404J6560k5365k8508k32q685L832J1253j1604K3390j6764
$$ plain form
10852 -34311 -22188 -28322 -38295 -42207 -55006 -56632 -49949 -35579 -40051 -53289 -40232 -23506 -6339
10839 -6339 12049 5484 5454 27659 3314 -26763 -37041 -32168 -32277 -34471 -33690 -18196 -4816 -21260
10825 -21260 -48451 -46910 -20904 5449 2059 -14474 -31748 -58231 -43307 -32726 -27450 3751
10813 3751 26444 32963 15177 9808 5091 16538 1754 -5270 -2470 1772 -11583 -25535 -30692
10800 -30692 -16072 -10770 -16717 -16060 -18278 -60181 -69821 -42148 -42596 -42554 -36910 -38496 -22819 -20218
10786 -20218 -25051 -2802 9571 16955 4244 -17788 -25487 -25509 -20745 -21043 -35126 -38923 -29733 -27026
10772 -27026 -39026 -44803 -19400 -15484 -38943 -57591 -57833 -43395 -29513 -38617 -36413 -14286 -15299
10759 -15299 -33385 -59828 -62135 -70732 -59652 -43447 -32148 -36534 -32406 -40828 -48242 -44507 -28188
$$ packed form
10852c4311J2123o134r973l912j2799j626O683J4370m472j3238J3057J6726J7167
10839f339J8388o565l0K2205k4345l0077j0278M873j09k194P81J5494J3380j6444
10825b1260k7191J541K6006K6353l390j6533j7274k6483J4924J0581N276L1201
10813C751K2693O519j7786n369m717J1447j4784p024K800M242j3355j3952n157
10800c0692J4620N302n947O57k218m1903r640K7673m48M2N644j586J5677K601
10786b0218m833K2249J2373P384j2711k2032p699k2M764k98j4083l797R190K707
10772b7026j2000n777K5403L916k3459j8648k42J4438J3882r104K204K2127j013
10759a5299j8086k6443k307q597J1080J6205J1299m386M128q422p414L735J6319
$$ plain form
10746 -28188 -28194 -33794 -49778 -51813 -32343 -18551 -42991 -31658 -22488 -33710 -21568 -27386 -9825
10733 -9825 -23806 -39611 2861 14404 16826 23848 51363 43952 6945 -15658 -14067 -14192 -14588
10720 -14588 -3947 5405 16350 8547 3721 -12399 -23764 -21842 -12751 -4104 13413 -11516 -18736
10707 -18736 -15477 -21010 -23469 -36546 -38778 -20173 -32279 -23090 -12052 -12340 -33918 -11116 -3061
10694 -3061 -24582 -27079 -21118 -13552 5190 16571 13016 9799 23341 6122 3151 22004 32393
10681 32393 27102 23038 17478 12748 5896 -5795 -19588 -44165 -45556 -23774 -8450 12233 7698
10668 7698 2430 -11098 -6401 1121 -503 1713 -7787 -23368 -19816 -18290 -2289 2473 13672 -1490
10654 -1490 -10163 -15571 -22686 -30185 -14251 -4855 -1432 -15404 -28141 -45446 -69730 -61613 -18577
$$ packed form
10746b8188on600j5984k035J9470J3792k4440J1333R170j1222J2142n818J7561
10733i825j3981j5805M2472J1543K422P022K7515p411l7007k2603J591j25l96
10720a4588J0641R352J0945p803m826j6120j1365J922R091Q647J7517k4929p220
10707a8736L259n533k459j3077k232J8605j2106R189J1038k88k1578K2802Q055
10694c061k1521k497N961P566J8742J1381l555l217J3542j7219k971J8853J0389
10681C2393n291m064n560m730o852j1691j3793k4577j391K1782J5324K0683m535
10668G698n268j3528M697P522j624K216r500j5581L552J526J6001M762J1199j5162
10654a490q673n408p115p499J5934R396L423j3972j2737j7305k4284Q117M3036
$$ plain form
10641 -18577 5333 12161 4202 -8031 -1245 -2307 5114 20668 13983 -8356 -12687 -22570 -27831
10628 -27831 -17086 -35479 -30717 -19267 -16002 -20495 -35529 -53820 -52319 -25732 -20315 -30448 -25135
10615 -25135 -35123 -24070 -22624 -30561 -28429 -19875 -10590 -740 1170 -16441 -935 22360 17579
10602 17579 -6101 -37015 -51120 -46654 -53341 -35066 -11628 -7725 -16622 -29782 -21855 -17281 -20
10589 -20 8781 -2206 -20501 -28280 -35823 -57076 -32986 -8784 -13961 -3000 13644 16085 29307
10576 29307 56504 42323 29348 33946 16153 7570 10026 4218 -5156 -4706 6147 1215 5224
10563 5224 23174 6999 -13142 -16765 3228 29817 5657 1949 4844 -3007 -20759 -29794 -21492
10550 -21492 -21173 -21927 -7919 -10003 -33819 -39178 -33943 -29473 -14606 -20150 -30137 -43695 -34120 -25104
$$ packed form
10641a8577K3910O828p959j2233O786j062P421J5554o685k2339m331r883n261
10628b7831J0745j8393M762J1450L265m493j5034j8291J501K6587N417j0133N313
10615b5135r988J1053J446p937K132Q554R285R850J910j7611J5506K3295m781
10602A7579k3680l0914j4105M466o687J8275K3438L903q897j3160P927M574J7261
10589b0Q801j0987j8295p779p543k1253K4090K4202n177J0961J6644K441J3222
10576B9307K7197j4181j2975M598j7793q583K456n808r374M50J0853m932M009
10563E224J7950j6175k0141l623J9993K6589k4160l708K895p851j7752r035Q302
10550b1492L19p54J4008k084k3816n359N235M470J4867n544r987j3558R575R016
$$ plain form
10536 -25104 -8970 26488 22867 12231 24145 17773 307 5732 -4935 -5562 -32933 -45863 -20962
10523 -20962 -21871 -22039 -2400 -3837 -3872 -14729 -5774 23020 37459 10139 5086 30475 47515 43197
10509 43197 36029 14247 -239 4597 5033 -19021 -17596 -13468 -3923 17467 10634 10664 9857 621
10495 621 12502 13112 23190 15452 -8626 -32369 -35452 -12823 5037 2811 -27610 -21814 -25924
10482 -25924 -44604 -45923 -37138 -24029 -1198 8010 9303 11359 12819 5170 -80 13994 2678
10469 2678 -10305 11958 35019 14717 -1569 8939 29568 -5716 -15988 -2090 -15565 -19660
10457 -19660 5531 -14145 -45793 -43115 -32807 -30121 -38920 -24849 -16775 -23611 -29200 -23179 -13927
10444 -13927 -9588 -6539 -22930 -8288 -1501 -22586 -20303 -11416 -29317 -22805 -22130 -2884 -5754
$$ packed form
10536b5104J6134L5458l621j0636J1914o372j7466N425j0667o27k7371j2930K4901
10523b0962r09j68J9639j437l5j0857Q955K8794J4439k7320n053K5389J7040m318
10509D3197p168k1782j4486M836M36k4054J425M128R545K1390o833L0q07r236
10495F21J1881O10J0078p738k4078k3743l083K2629J7860k226l0421N796m110
10482b5924j8680j319Q785J3109K2831R208J293K056J460p649n250J4074j1316
10469B678j2983K2263K3061k0302j6286J0508K0629l5284j0272J3898j3475m095
10457a9660K5191j9676l1648K678J0308K686q799J4071Q074o836n589O021R252
10444a3927M339L049j6391J4642O787k1085K283Q887j7901O512O75J9246k870
$$ plain form
10431 -5754 -941 -2447 3751 34470 33590 29559 39613 30077 7564 -7811 -30191 -32558 -28594 -5546
10417 -5546 33898 6379 -17209 -6959 7343 11412 2980 -22419 -17495 229 -5806 20562 5882
10404 5882 -3452 -2489 7305 12504 -12742 -37420 -59315 -73354 -71759 -47144 -16970 -5364 -15663
10391 -15663 5343 9402 -1276 -31876 -35092 -18960 -24809 -40073 -21842 -16265 -32692 -55166
10379 -55166 -60930 -43905 -22882 -7726 -18974 -28787 -43383 -24631 -19583 -40482 -47286 -33817
10367 -33817 -23708 -33338 -33136 -22396 -33313 -36726 -33785 -37493 -11331 13313 6402 4334 4069 4064
10353 4064 -2988 6578 6402 -10367 -9727 -7446 -19288 -16305 -2493 7288 3758 -15211 -22192 -19031
10339 -19031 -26259 -43098 -67575 -58305 -38196 -24959 -21721 -38122 -35302 -44468 -37988 -29681 -5769
$$ packed form
10431e754M813j506O198L0719q80m031J0054r536k2513j5375k2380k367L964K3048
10417e546L9444k7519k3588J0250J4302M069q432k5399M924J7724o035K6368j4680
10404E882r334R63R794N199k5246k4678k1895j4039J595K4615L0174J1606j0299
10391a5663K1006M059j0678l0600l216J6132n849j5264J8231N577j6427k2474
10379e5166n764J7025K1023J5156j1248r813j4596J8752N048k0899o804J3469
10367c3817J0109r630K02J0740j0917l413K941l708K6162K4644o911k068k65n
10353D064p052R566j76j6769O40K281j1842K983J3812R781l530j8969o981L161
10339a9031p228j6839k4477R270K0109J3237L238j6401K820r166O480Q307K3912
$$ plain form
10326 -5769 4525 7811 -8051 -21071 -27982 -23883 -7685 -5678 -10891 -25227 -13526 -4328 -1829
10313 -1829 6995 249 -2620 18656 17443 23715 2482 4335 19434 22351 14339 13440 2398 19412
10299 19412 38048 27522 24501 5549 -9897 -11048 -25034 -23069 13939 13863 -9126 -17585 -17707
10286 -17707 -27886 -37857 -689 12102 14120 28357 7395 -9719 -6772 -7669 -35719 -29820 -13090
10273 -13090 -6225 -17759 -43549 -52626 -47658 -53642 -36219 -10945 15546 4729 -11584 -22504
10261 -22504 -18907 -1974 14330 -636 -11560 19260 32573 -2944 -2733 280 -11406 -12291 -11565
10248 -11565 216 -29402 -23570 3776 11462 2112 -15701 -27615 -7387 17603 -2201 -14000
10236 -14000 16370 4326 374 -7416 -29477 -30971 -10575 7099 3199 -6759 -2728 5805 -7201
$$ packed form
10326e769J0294L286j5862j3020o911M099J6198K007n213j4336J1701R198K499
10313a829Q824o746k869K1276j213O272k1233J853J5099K917q012q99j1042J7014
10299A9412J8636j0526l021j8952j5446j151j3986J965L7008p6k2989q459j22
10286a7707j0179r971L7168J2791K018J4237k0962j7114K947q97k8050N899J6730
10273a3090O865j1534k5790r077M968n984J7423K5274K6491j0817j6313j0920
10261b2504L597J6933J6304j4966j0924L0820J3313l5517K11L013j1686q85P26
10248a1565J1781k9618N832K7346P686r350j7813j1914K0228K4990j9804j1799
10236a4000L0370j2044l952p790k2061j494K0396J7674l900r958M031Q533j3006
$$ plain form
10223 -7201 -1308 22448 20055 -1229 -13405 -35597 -25689 8106 15201 15964 3812 -323 17212
10210 17212 32885 26459 53483 98737 141736 175913 208754 249858 287393 311974 306115 281710
10198 281710 240367 206490 175100 151116 126447 99549 79755 67420 64619 75597 83443 45051
10186 45051 10698 27796 21956 -3482 -4786 6588 -516 -3242 -8562 1124 7487 1905 11565
10173 11565 -7790 -8858 22603 25421 3144 -503 19210 32006 36538 7962 -1830 8820 14202
10160 14202 4959 -7894 19528 31404 30881 9310 -18646 -27037 -40004 -51530 -48213 -30239 -39487
10147 -39487 -39079 -27217 -37085 -32388 -15789 13372 23198 31805 27001 15501 8140 17494 10246 -32195
10133 -32195 -52625 -16588 587 -779 -21240 -21370 -33326 -26541 -33240 -28351 -17548 7833 21143
$$ packed form
10223g201N893K3756k393k1284j2176k2192R908L3795P095P63j2152m135J7535
10210A7212J5673o426K7024M5254M2999L4177L2841M1104L7535K4581n859k4405
10198B81710m1343l3877l1390k3984k4669k6898j9794j2335k801J0978P846l8392
10186D5051l4353J7098n840k5438j304J1374p104k726n320R686O363n582R660
10173A1565j9355j068L1461K818k2277l647J9713J2796M532k8576r792J0650N382
10160A4202r243j2853K7422J1876n23k1571k7956q391j2967j1526L317J7974r248
10147c9487M08J1862r868M697J6599K9161R826Q607m804j1500p361R354p248m2441
10133c2195k0430L6037J7175j366k0461j30j1956O785o699M889J0803K5381J3310
$$ plain form
10120 21143 32263 28704 -6595 -20598 -26986 -19660 -37029 -25136 1313 -10393 -6119 -5773 13314
10107 13314 20345 -4424 -923 8188 2798 9612 4428 -10329 12679 10523 1559 12205 23608
10094 23608 7266 -3131 -19132 -14698 -18717 -9473 -1228 -4763 -17724 -34330 -57364 -45237 -41991
10081 -41991 -26626 -26252 -33707 -7896 -8756 -1077 -18328 -16709 -16487 -42098 -42717 -37590 -43057 -15566
10067 -15566 -19279 -4437 15887 10443 -406 -11581 -13465 -35885 -56420 -76021 -67298 -68125 -53956
10054 -53956 -37030 -18576 -8994 -19667 -17313 -1742 -8772 3079 9655 17849 -7068 -57832 -68459
10041 -68459 -31150 10562 26931 29953 -4230 -15765 -25686 -37107 -33268 -49536 -57805 -34649
10029 -34649 -8159 -14286 -25421 -25855 -19156 -2796 4698 -3557 -10066 -6968 9229 9756 -3374 -758
$$ packed form
10120B1143J1120l559l5299j4003o388P326j7369J1893K6449j1706M274L46J9087
10107A3314P031k4769L501R111n390O814n184j4757K3008k156q964J0646J1403
10094B3608j6342j0397j6001M434m019R244Q245l535j2961j6606k3034J2127L246
10081d1991J5365L74p455K5811q60P679j7251J619K22k5611o19N127n467K7491
10067a5566l713J4842K0324n444j0849j1175j884k2420k0535j9601Q723q27J4169
10054e3956J6926J8454R582j0673K354J5571p030J1851O576Q194k4917n0764j0627
10041f8459L7309M1712J6369L022l4183j1535r921j1421L839j6268q269K3156
10029c4649K6490o127j1135m34O699J6360P494q255o509L098J6197N27j3130K616
$$ plain form
10015 -758 -13880 -9573 -4431 29318 29983 8 7310 12489 -11319 -12820 -16451 -12879 -8164 -19086
10001 -19086 -36107 -32290 -32099 -35217 -53277 -20904 7086 1703 -13874 2228 -9765 7363 6709
9988 6709 -26344 -39654 -35793 -14929 -4101 -11295 -17330 -41743 -62025 -67778 -67589 -61310 -35017
9975 -35017 -7152 -8986 -19622 -21010 14970 37572 6139 -53961 -57372 -28404 -27267 -45135 -30287
9962 -30287 -39096 -32807 -20875 -2709 -3460 -12173 -13469 -18818 -11884 -1760 -1630 -16602 -11436 -839
9948 -839 17537 -18077 -23211 -8174 -570 20416 30519 39689 24980 1384 -17527 -15083 7019
9935 7019 4925 -3794 2044 -1548 -30742 -45364 -38469 -38604 -17381 -16584 -16320 -40124 -51582 -35187
9921 -35187 -21633 -10230 -19130 1141 30013 26368 -3985 12048 -1137 -6143 -3755 18916 7987
$$ packed form
10015g58j3122M307N142L3749O65k9975P302N179k3808j501l631L572M715j0922
10001a9086j7021L817J91l118j8060L2373K7990n383j5577J6102j1993J7128o54
9988F709l3053j3310L861K0864J0828p194o035k4413k0282n753J89O279K6293
9975c5017K7865j834j0636j388L5980K2602l1433o0100l411K8968J137j7868J4848
9962c0287q809O289J1932J8166p51q713j296n349O934J0124J30j4972N166J0597
9948h39J8376l5614n134J5037P604K0986J0103R170j4709k3596j8911K444K2102
9935G019k094q719N838l592k9194j4622O895j35K1223P97K64k3804j1458J6395
9921c5187J3554J1403q900K0271K8872l645l0353J6033j3185n006K388K2671j0929
$$ plain form
9908 7987 1241 -6494 11384 21567 27448 20728 18447 8737 17015 25345 -9287 -40944 -49539 -45433
9894 -45433 -22215 -17382 -14192 -22475 -7403 -10270 -1851 18892 31848 23646 19455 9238 13192
9881 13192 19751 11405 -3624 -15162 -14159 -21672 -18284 -4269 -12197 -14603 -3193 322 16145
9868 16145 -5108 -25062 -13203 -24111 -47922 -52495 -26276 -23156 -27325 -27492 14334 4500 -20130
9855 -20130 -20480 -12937 20194 29057 29044 13817 26524 17473 2455 19833 24599 19674 12486 29724
9841 29724 49132 44153 35171 30807 46693 41236 -1846 -13059 11574 18254 16886 3965 8113
9828 8113 20691 4206 -11836 -15447 -13862 -2715 11052 5530 18779 13239 25243 12457 18989
9815 18989 24050 21956 16229 1585 -17158 -31544 -38459 -27806 -14067 -869 26490 31201 13087
$$ packed form
9908G987o746p735J7878J0183N881o720k281r710Q278Q330l4632l1657q595M106
9894d5433K3218M833L190q283J5072k867Q419K0743J2956q202m191j0217L954
9881A3192O559q346j5029j1538J003p513L388J4015p928k406J1410L515J5823
9868A6145k1253j9954J1859j0908k3811m573K6219L120m169j67M1826r834k4630
9855b0130l50P543L3131Q863j3j5227J2707r051j5018J7378M766m925p188J7238
9841B9724J9408m979q982m364J5886n457m3082j1213K4633O680j368j2921M148
9828H113J2578j6485j6042l611J585J1147J3767n522J3249n540J2004j2786O532
9815A8989N061k094n727j4644j8743j4386o915J0653J3739J3198K7359M711j8114
$$ plain form
9802 13087 -2844 29595 34612 17634 3221 -8546 11806 -6375 -4980 14189 15000 3934 540
9789 540 -19101 -29105 -23573 -19451 -14174 7895 20019 26754 10313 2043 -247 -5069 -16804 -29365
9775 -29365 -26140 -10177 6684 5927 2899 15001 8512 -454 7928 14651 17725 17805 19644 25098 14314
9760 14314 5878 17399 23270 3331 3650 4696 22966 4123 -5809 22206 18228 -9366 -1336
9747 -1336 14008 3033 -12313 -12959 -25281 -12623 -2647 -1760 -12488 -20550 -30731 -33447 -28013 -52786
9733 -52786 -36909 -9242 -25211 -33852 -14894 -7199 18176 17644 20349 41362 37010 17156 24248
9720 24248 44133 29566 -2071 -10113 -3174 -9764 -20518 -9081 14304 4278 -33726 -19340
9708 -19340 -11740 -16368 -27820 -30805 -11497 -13683 7341 24832 -4663 -21655 -27093 -25983 -15150
$$ packed form
9802A3087j5931L2439N017j6978j4413j1767K0352j8181J395J9169Q11j1066l394
9789E40j9641j0004N532M122N277K2069J2124O735j6441q270k290m822j1735j2561
9775b9365L225J5963J6861p57l028J2102o489q966Q382O723L074Q0J839N454j0784
9760A4314q436J1521N871j9939L19J046J8270j8843r932K8015l978k7594Q030
9747a336J5344j0975j5346o46j2322J2658R976Q87j0728q062j0181k716N434k4773
9733e2786J5877K7667j5969q641J8958P695K5375n32K705K1013m352j9854P092
9720B4248J9885j4567l1637q042O939o590j0754J1437K3385j0026l8004J4386
9708a9340P600m628j1452k985J9308k186K1024J7491k9495j6992n438J110J0833
$$ plain form
9695 -15150 7666 -3371 6705 11429 11022 -1676 -6565 14971 28738 38762 39793 36807 -6939
9682 -6939 -13457 -12459 272 13477 12690 912 1593 5216 3652 -3593 4032 7892 7778 -1809 9561
9667 9561 -9046 -6564 10023 14592 2103 -12027 1511 10007 14387 -4164 10341 22640 22235
9654 22235 12643 31525 29585 13976 -10773 342 6906 -4993 -18932 -10181 4037 24626 8421
9641 8421 1587 -5856 -19393 -13271 2963 3428 4219 20605 33493 27608 20442 13565 15174 13482
9627 13482 13057 882 -2925 1660 5002 24785 39114 46160 48794 36727 21883 13227 -7046
9614 -7046 3216 3585 -27670 -38992 -24701 -7063 11841 7096 -17606 -24648 -12306 -45050 -44337
9601 -44337 -28089 -19953 -32373 -41624 -34680 -27031 -36188 -33455 -35669 -25150 -4488 -16615 -19278
$$ packed form
9695a5150K2816j1037J0076M724m07j2698m889K1536J3767J0024J031k986m3746
9682f939o518R98J2731J3205p87j1778O81L623j564p245P625L860j14r587J1370
9667I561j8607K482J6587M569j2489j4130J3538Q496M380j8551J4505J2299m05
9654B2235r592J8882j940j5609k4749J1115O564j1899j3939Q751J4218K0589j6205
9641H421o834p443j3537O122J6234M65P91J6386J2888n885p166o877J609j692
9627A3482m25j2175l807M585L342J9783J4329P046K634j2067j4844q656k0273
9614g046J0262L69l1255j1322J4291J7638J8904m745k4702p042J2342l2744P13
9601d4337J6248Q136j2420r251O944P649r157K733k214J0519K0662j2127k663
$$ plain form
9588 -19278 -8559 13043 21442 34585 19085 -633 7394 -16457 -42652 -46765 -22449 -1898
9576 -1898 616 -5701 -22363 -31429 -43761 -52046 -37849 -9876 4599 12419 7501 -20144 -50233
9563 -50233 -61199 -35308 -1402 767 -6717 -18348 -17537 4256 -16617 -43480 -30280 20367 29422
9550 29422 2860 -359 -14144 -14659 7244 17632 25216 30836 28898 12485 -894 -12515 -5228
9537 -5228 4856 5704 -1357 3290 5708 9882 21715 18457 6481 -198 -32398 -33784 -31342 -22038
9523 -22038 2383 22206 21708 27633 33838 44808 51713 40438 39988 32519 19267 35391 26379 1999
9509 1999 -4139 -11902 -24458 -32141 -17990 10086 15745 11649 24296 42128 46823 24579 19252
9496 19252 2278 2046 3555 15641 -442 -18304 -17774 -9897 -6222 14289 46660 40185 9704
$$ packed form
9588a9278J0719K1602Q399J3143j5500j9718Q027k3851k6195m113K4316K0551
9576a898K514o317j6662r066j2332q285J4197K7973J4475P820m918k7645l0089
9563e0233j0966K5891L3906K169p484j1631Q11K1793k0873k6863J3200N0647R055
9550B9422k6562l219j3785n15K1903J0388P584N620j938j6413j3379j1621P287
9537e228J0084Q48p061M647K418M174J1833l258j1976o679l2200j386K442R304
9523b2038K4421J9823m98N925O205J0970O905j1275m50p469j3252J6124r012k4380
9509A999o138p763j2556p683J4151K8076N659m096J2647J7832M695k2244n327
9496A9252j6974k32J509J2086j6083j7862N30P877L675K0511L2371o475l0481
$$ plain form
9483 9704 -17606 12184 31022 29717 29475 29960 32681 43025 36249 32189 11158 2042 14575 30760
9469 30760 21447 20594 5230 -8369 8138 14325 -20377 -20529 13799 28163 28513 23227 36692 19419
9455 19419 26397 25761 22795 -6146 -10188 -16856 -29029 -36762 -31333 -6827 12730 12723 654 -1474
9441 -1474 -23728 -28078 -7979 28529 43276 38957 18934 15382 38035 62243 43982 30482 29812
9428 29812 22407 23413 40510 33055 18730 11003 10238 29723 21598 3020 10861 24521 21166 1480
9414 1480 -27941 4870 27986 23365 12703 -1684 17212 17275 11563 -302 -4222 4054 6278 28825
9400 28825 26394 7082 -2402 1831 17072 16062 1382 10025 24776 26997 49351 59959 38361
9387 38361 43758 38258 44813 52414 52210 54492 61533 55135 41475 22810 24304 42089 43188 41147
$$ packed form
9483I704k7310K9790J8838j305k42M85K721J0344o776m060k1031r116J2533J6185
9469C0760r313q53j5364j3599J6507O187l4702j52L4328J4364L50n286J3465j7273
9455A9419O978o36k966k8941m042o668j2173p733N429K4506J9557pj2069k128
9441a474k2254m350K0099L6508J4747m319k0023l552K2653K4208j8261j3500o70
9428B9812p405J006J7097p455j4325p727p65J9485q125j8578P841J3660l355j9686
9414A480k9421L2811K3116m621j0662j4387J8896O3n712j1865l920Q276K224K2547
9400B8825k431j9312r484M233J5241j010j4680Q643J4751K221K2354J0608k1598
9387C8361N397n500O555P601k04K282P041o398j3660j8665J494J7785J099k041
$$ plain form
9373 41147 45346 50947 54730 34953 31499 32072 32512 36086 53756 63554 63558 83453 89974 64882 30726
9358 30726 22608 24346 28178 45912 56356 43582 43332 50198 44970 30593 19579 28923 27244 19217
9344 19217 9360 6812 41824 48164 29678 44561 58924 58212 58628 58448 81610 101149 82641 77394
9330 77394 90162 95052 82667 104288 128088 139844 144504 156012 155777 138457 136821 137151 146992
9317 146992 194226 221453 247550 288813 319428 347888 361309 398815 448544 566044 755883
9306 755883 1012054 1220448 1256041 1202110 1159068 1171154 1278290 1480930 1796523 2307603
9296 2307603 3120131 4359698 6232769 8695350 10990672 11579097 10117913 7757335 5599451
9287 5599451 4018570 2967364 2267602 1776570 1435878 1177355 994902 855495 753183
$$ packed form
9373D1147M199N601L783j9777l454N73M40L574J7670R798MJ9895O521k5092l4156
9358C0726q118J738L832J7734J0444j2774k50O866n228j4377j1014R344j679q027
9344A9217r857k548L5012O340j8486J4883J4363p12M16j80K3162J9539j8508n247
9330G7394J2768M890j2385K1621K3800J1756M660J1508k35j7320j636L30R841
9317A46992M7234K7227K6097M1263L0615K8460J3421L7506M9729J17500J89839
9306G55883K56171K08394L5593n3931m3042J2086J07136K02640L15593N11080
9296B307603Q12528J239567J873071K462581K295322N88425j461184k360578k157884
9287E599451j580881j051206o99762m91032l40692k58523j82453j39407j02312
$$ plain form
9278 753183 667955 631754 599064 542074 492217 456231 437254 406479 388117 373478 371182 396140
9266 396140 413792 441049 510002 681280 938517 1323370 1746836 1806488 1503292 1072170
9256 1072170 740320 529306 392765 302990 249491 223070 231555 232214 204894 180712 169002
9245 169002 153728 127784 130566 99776 91644 109163 97581 100377 86565 76486 86759 72374
9233 72374 79965 80033 79336 93074 90912 83171 76003 88322 70247 67670 70977 84560 118369 163642
9219 163642 230707 295919 403878 558742 755857 839837 716912 533955 380582 272226
9209 272226 191022 133335 109508 102585 98099 74012 68284 64503 47284 43865 45713 41006 25134
9196 25134 27146 26857 39578 57895 64733 77237 73800 65318 44405 8796 -7541 -3959 23449
$$ packed form
9278G53183q5228l6201l2690n6990m9857l5986j8977l0775j8362j4639k296K4958
9266C96140J7652K7257O8953J71278K57237L84853M23466N9652l03196m31122
9256A072170l31850k11014j36541q9775n3499k6421Q485O59k7320k4182j1710
9245A69002j5274k5944K782l0790q132J7519j1582K796j3812j0079J0273j4385
9233G2374P591O8o97J3738k162p741p168J2319j8075k577L307J3583L3809M5273
9219A63642O7065O5212J07959J54864J97115Q3980j22925j82957j53373j08356
9209B72226q1204n7687k3827o923m486k4087n728l781j7219l419J848m707j5872
9196B5134K012k89J2721J8317O838J2504l437q482k0913l5609j6337L582K7408
$$ plain form
9183 23449 35593 66824 70692 14329 -15858 -4864 8741 16676 17276 20396 57059 80867 74469
9170 74469 78060 47029 39191 53740 80032 94447 75845 61011 36962 43303 68189 80468
9158 80468 99596 92453 64853 55392 45769 45213 61315 87474 75562 59061 48851 26178 22136
9145 22136 34486 15229 3451 25352 62854 70851 61904 55889 43395 47411 35833 5950 1709
9132 1709 30507 58049 40798 31806 60517 86250 74629 65295 69573 76070 92824 96425 92217
9119 92217 104160 90973 89693 113007 127547 139823 163085 158800 139217 127739 120262 121425 107245
9106 107245 96652 111112 112484 101218 62926 54231 51968 47364 24706 42463 59200 60663 55096
9093 55096 40711 37696 40784 44458 70506 117124 132359 115069 122383 132796 131820 121454 112811
$$ packed form
9183B3449J2144L1231L868n6363l0187J0994J3605P935O00L120L6663K3808o398
9170G4469L591l1031p838J4549K6292J4415j8602j4834k4049O341K4886J2279
9158H0468J9128p143k7600r461r623n56J6102K6159j1912j6501j0210k2673m042
9145B2136J2350j9257j1778K1901L7502P997q947o015j2494M016j1578k9883m241
9132A709K8798K7542j7251q992K8711K5733j1621r334M278O497J6754L601m208
9119I2217J1943j3187j280K3314J4540J2276K3262m285j9583j1478p477J163j4180
9106A07245j0593J4460J372j1266l8292q695k263m604k2658J7757J6737J463n567
9093E5096j4385l015L088L674K6048M6618J5235j7290P314J0413r76j0366q643
$$ plain form
9080 112811 121648 118092 67294 43484 36677 47862 68659 97581 97190 100848 107754 101503 94912
9067 94912 115017 124902 116212 98397 66700 89989 118604 115495 96356 109242 117854 122435 124193
9054 124193 123584 113060 106662 86903 101177 105586 107113 100480 98621 96239 120940 146258 141543
9041 141543 158970 170643 172570 169501 146427 136354 145209 159639 161578 144124 140700 157723 147117
9028 147117 118614 96483 98205 120821 98772 98719 93710 94976 120230 120843 91737 109762 112757
9015 112757 111279 121034 141850 153643 164335 189357 194487 164936 159014 172462 162949 171720 172506
9002 172506 169328 159464 132599 141199 163826 195648 207164 241572 258334 251706 251580 275396 296488
8989 296488 327005 333665 324335 324369 323403 344190 343136 338757 300041 263318 255225 268665 291594 308504
$$ packed form
9080A12811Q837l556n0798k3810o807J1185K0797K8922l91L658O906o251o591
9067I4912K0105R885q690j7815l1697K3289K8615l109j9139J2886Q612M581J758
9054A24193o09j0524o398j9759J4274M409J527o633j859k382K4701K5318m715
9041A41543J7427J1673J927l069k3074j0073Q855J4430J939j7454l424J7023j0606
9028A47117k8503k2131J722K2616k2049n3n009J266K5254O13k9106J8025K995
9015A12757j478R755K0816J1793J0692K5022N130k9551n922J3448r513Q771P86
9002A72506l178r864k6865Q600K2627L1822J1516L4408J6762o628j26K3816K1092
8989B96488L0517O660r330L4r66K0787j054m379l8716l6723q093J3440K2929J6910
$$ plain form
8975 308504 307067 290945 288436 285082 285995 263938 278650 303771 314241 300522 318122 337021 339277
8962 339277 363472 365063 373489 397927 397935 384041 389428 413257 437178 466648 514265 580874 640902
8949 640902 655131 653913 636324 652193 677748 705487 740694 745624 790049 836461 896061 931263
8937 931263 947094 975650 1014541 1050872 1126791 1193319 1268260 1355742 1460910 1577659 1721135
8926 1721135 1901074 2104452 2332141 2602658 2969664 3402595 3951163 4677667 5453755 6193611
8916 6193611 6980429 8101753 9751666 12018207 15241519 20028693 27592075 40113172
8908 40113172 61147130 94943491 137604814 160477543 144333683 107720319 72647200
8901 72647200 48975717 34680506 25841902 20090608 16202158 13551945 11666015 10256553
$$ packed form
8975C08504j437j6122k509l354R13k2057J4712K5121J0470j3719J7600J8899K256
8962C39277K4195J591Q426K4438Qj3894N387K3829K3921K9470M7617O6609O0028
8949F40902J4229j218j7589J5869K5555K7739L5207M930M4425M6412N9600L5202
8937I31263J5831K8556L8891L6331P5919O6528P4941Q7482J05168J16749J43476
8926A721135J79939K03378K27689K70517L67006M32931N48568P26504P76088P39856
8916F193611P86818J121324J649913K266541L223312M787174P563382J2521097
8908D0113172K1033958L3796361M2661323K2872729j6143860l6613364l5073119
8901G2647200k3671483j4295211q838604n751294l888450k650213j885930j409462
$$ plain form
8893 10256553 9178713 8434441 7963386 7580313 7135438 6611178 6140111 5803365 5601092
8884 5601092 5477309 5431833 5489604 5635339 5880558 6174095 6565911 7081592 7795691 8803316
8874 8803316 10148824 11645093 13063593 14720015 17127592 20672660 25303425 31033802
8866 31033802 38957545 51598400 73140551 110688677 174883254 266717020 326336478
8859 326336478 299049370 223828831 148843772 98347243 68320797 49989289 38187106
8852 38187106 30272196 24811569 20925280 18014856 15837134 14310943 13345374 12576072
8844 12576072 11543418 10284630 9067352 8129305 7462349 6962202 6539757 6203780 5958151
8835 5958151 5831844 5762755 5775661 5877763 6061769 6397182 6867009 7411720 7984252 8603235
$$ packed form
8893A0256553j077840p44272m71055l83073m44875n24260m71067l36746k02273
8884E601092j23783m5476N7771J45735K45219K93537L91816N15681P14099J007625
8874H803316J345508J496269J418500J656422K407577L545068M630765N730377
8866C1033802P923743J2640855K1542151L7548126O4194577R1833766N9619458
8859C26336478k7287108p5220539p4985059n0496529l0026446j8331508j1802183
8852C8187106p914910n460627l886289k910424k177722j526191r65569p69302
8844A2576072j032654j258788j217278r38047o66956n00147m22445l35977k45629
8835E958151j26307o9089J2906J02102J84006L35413M69827N44711N72532O18983
$$ plain form
8825 8603235 9492202 10819461 12707500 15376682 19326862 25521396 35578988 52435246
8817 52435246 80228268 119900541 152406919 148362023 116350207 79601463 52594760
8810 52594760 36164432 26230286 19923579 15690614 12742849 10685961 9170216 8011928
8802 8011928 7171745 6604193 6211766 5710201 5050682 4358480 3840167 3435820 3107514 2835380
8792 2835380 2595876 2361691 2153398 1981649 1858859 1766961 1690821 1628562 1558613 1470812
8782 1470812 1385212 1298754 1219969 1153214 1121603 1076707 1025617 987957 968931 957151 973852
8771 973852 980718 928888 848210 797042 719144 667209 656987 651315 634385 591884 575456 562765
8759 562765 564591 559144 527202 503649 491406 485035 488857 480538 468280 496104 507671 491252 513284
$$ packed form
8825H603235Q88967J327259J888039K669182L950180O194534J0057592J6856258
8817E2435246K7793022L9672273L2506378m044896l2011816l6748744k7006703
8810E2594760j6430328r934146o306707m232965k947765k056888j515745j158288
8802H011928q40183n67552l92427n01565o59519o92202n18313m04347l28306k72134
8792B835380k39504k34185k08293j71749j22790r1898p6140o2259o9949q7801
8782A470812q5600q6458p8785o6755l1611m4896n1090l7660j9026j1780J6701
8771I73852O866n1830q0678n1168p7898n1935j0222n672j6930m2501j6428j2691
8759E62765J826n447l1942k3553j2243o371L822q319j2258K7824J1567j6419K2032
$$ plain form
8746 513284 525534 518522 486906 459270 459883 466022 453690 446207 459603 468240 441079 429451 414658
8733 414658 408574 375240 315354 320847 359846 357284 349371 365658 366193 335056 291574 267968 253956
8720 253956 254562 272787 290892 259574 221717 219719 207385 196577 176945 186686 205175 219740
8708 219740 213114 231008 263573 287571 303070 289328 265820 262550 240068 237949 245059 244859 257401
8695 257401 249649 235120 214493 206957 240990 267969 265781 246616 263933 255880 241255 240454 221661
8682 221661 211850 220623 239361 216379 176119 167246 158280 197707 209105 220313 214098 208393 208177
8669 208177 182250 162569 170623 187845 189410 202932 211438 234333 251156 272762 277850 248773
8657 248773 220233 197770 190759 183746 177285 194947 204815 200747 183937 185578 202363 231143 260470
$$ packed form
8746E13284J2250p012l1616k7636O13O139j2332p483J3396Q637k7161j1628j4793
8733D14658o084l3334n9886N493L8999k562p913J6287N35l1137m3482k3606j4012
8720B53956O06J8225J8105l1318l7857j998j2334j0808j9632R741J8489J4565
8708B19740o626J7894L2565K3998J5499j3742k3508l270k2482k119P110k00J2542
8695B57401p752j4529k0627p536L4033K6979k188j9165J7317q053j4625q01j8793
8682B21661r811Q773J8738k2982m0260q873q966L9427J1398J1208o215n705k16
8669B08177k5927j9681Q054J7222J565J3522Q506K2895J6823K1606N088k9077
8657B48773k8540k2463p011p013o461J7662R868m068j6810J641J6785K8780K9327
$$ plain form
8644 260470 253671 239622 208499 182793 183721 183347 183756 194305 204678 180413 153494 146261 157087
8631 157087 179916 186312 191436 217004 220840 225485 215255 191095 191781 209001 206697 241978 247342
8618 247342 228311 233117 242803 280179 308705 317816 303246 316785 354063 403943 435034 439715
8606 439715 408510 390139 385143 385813 382775 352776 341822 311558 311585 296070 293164 291949 282699 261351
8592 261351 236391 247484 278524 302020 309080 313336 288423 313249 321693 302571 306616 307429 271070
8579 271070 244305 208341 196611 203893 193031 174078 145882 142014 144837 153251 155068 147225 145819
8566 145819 131523 131853 126515 118242 117287 125669 128626 143597 130673 134065 134404 124315 105043 96957
8552 96957 79776 69496 72793 81255 83601 72956 67708 88552 91619 96079 114379 111024 101584
$$ packed form
8644B60470o799j4049l1123k5706R28l74M09J0549J0373k4265k6919p233J0826
8631A57087K2829O396N124K5568L836M645j0230k4160O86J7220k304L5281N364
8618B47342j9031M806R686L7376K8526R111j4570J3539L7278M9880L1091M681
8606D39715l1205j8371m996O70l038k9999j0954l0264K7j5515k906j215r250k1348
8592B61351k4960J1093L1040K3496P060M256k4913K4826Q444j9122M045Q13l6359
8579B71070k6765l5964j1730P282j0862j8953k8196l868K823Q414J817p843j406
8566A45819j4296L30n338q273r55Q382K957J4971j2924L392L39j0089j9272q086
8552I6957j7181j0280L297Q462K346j0645n248K0844L067M460J8300l355r440
$$ plain form
8539 101584 76680 79305 103534 83840 57032 54788 73058 103933 106697 114280 127743 120169 85997
8526 85997 63717 77405 85311 101521 130213 142025 136301 145733 142512 139982 123427 105337 127754
8513 127754 116667 106405 109942 122840 140576 148562 172135 179277 217787 293218 393652 553560
8501 553560 783138 898802 844320 686500 494209 377372 297032 250903 229164 212267 182677
8490 182677 162167 167309 142109 108231 109933 113260 120959 144561 156062 124859 101778 74525
8478 74525 88732 96545 88189 77788 81212 96830 114816 114465 89705 107830 135935 138424 129380
8465 129380 143004 168124 202173 194339 228391 304515 402088 567416 891242 1332839 1654102
8454 1654102 1588355 1266511 882522 622599 451078 339067 267214 239671 230453 197533 171268
$$ packed form
8539A01584k4904K625K4229j9694k6808k244J8270L0875K764P583J3463p574l4172
8526H5997k2280J3688P906J6210K8692J1812n724R432l221k530j6555j8090K2417
8513A27754j1087j0262L537J2898J7736P986K3573P142L8510P5431J00434J59908
8501E53560K29578J15664n4482j57820j92291j16837q0340m6129k1739j6897k9590
8490A82677k0510N142k5200l3878J702L327P699K3602J1501l1203k3081k7253
8478G4525J4207P813q356j0401L424J5618J7986l51k4760J8125K8105K489r044
8465A29380J3624K5120L4049p834L4052P6124R7573J65328L23826M41597L21263
8454A654102o5747l21844l83989k59923j71521j12011p1853k7543r218l2920k6265
$$ plain form
8443 171268 164803 155491 118657 83027 104171 107927 84405 72872 75547 71049 82557 98970 103935
8430 103935 112547 106515 108197 101258 88373 67300 61069 68356 79875 78994 80944 105088 117022
8417 117022 120534 127582 157489 232914 331183 481889 689206 838180 812040 640872 449941
8406 449941 325828 254387 206033 165720 135225 106910 73516 67537 85329 84790 71093 54735
8394 54735 46861 72517 81433 52512 41166 65491 69106 67989 55770 42448 56227 61388 69391
8381 69391 58293 24771 36041 43624 32767 21635 8010 18370 27196 32180 54473 45189 41810
8368 41810 36080 53484 64928 62526 27287 14831 29470 40732 45919 61486 34829 28547 -2022
8355 -2022 8340 22159 28139 19085 41011 50226 59353 47350 28124 17589 20871 16965 30836
$$ packed form
8443A71268o465r312l6834l5630K1144L756k3522j1533K675m498J1508J6413M965
8430A03935Q612o032J682o939j2885k1073o231P287J1519q81J950K4144J1934
8417A17022L512P048K9907P5425R8269J50706K07317J48974k6140j71168j90931
8406D49941j24113p1441m8354m0313l0495k8315l3394n979J7792n39j3697j6358
8394E4735p874K5656Q916k8921j1346K4325L615j117j2219j3322J3779N161Q003
8381F9391j1098l3522J1270P583j0857j1132j3625J0360Q826M984K2293r284l379
8368D1810n730J7404J1444k402l5239j2456J4639J1262N187J5567k6657o282l0569
8355b022J0362J3819N980r054K1926R215R127j2003j9226j0535L282l906J3871
$$ plain form
8342 30836 27292 32479 29118 22909 28538 31915 35914 15435 2535 2111 7596 5645 10278 27995
8328 27995 43277 49696 35626 27676 38023 69165 85004 67506 45132 30383 42952 45721
8316 45721 28888 7009 25646 36791 29247 21202 234 -7346 2434 9255 1729 5850 1039
8303 1039 17288 15063 15377 22272 15977 5933 -14081 -33178 -7968 12872 11093 8810 28551
8290 28551 43513 58100 51691 27224 9222 -13830 14641 35656 32893 -4655 -21158 -11381
8278 -11381 -10538 8750 13812 23482 18340 8315 -5383 4481 15627 29499 53177 41315 19727
8265 19727 8440 9500 26742 33696 26344 16081 4294 482 6317 12036 16104 24998 19643 -3145
8251 -3145 -11073 2162 18017 15058 19408 26772 25337 35713 63930 68013 24600 1777 -6353
$$ packed form
8342C0836l544N187l361o209N629L377L999k0479j2900m24N485j951M633J7717
8328B7995J5282O419j4070p950J0347L1142J5839j7498k2374j4749J2569K769
8316D5721j6833k1879J8637J1145p544q045k0968p580R780O821p526M121m811
8303A039J6249k225L14O895o295j0044k0014j9097K5210K0840j779k283J9741
8290B8551J4962J4587o409k4467j8002k3052K8471K1015k763l7548j6503R777
8278a1381Q43J9288N062R670n142j0025j3698R864J1146J3872K3678j1862k1588
8265A9727j1287J060J7242O954p352j0263j1787l812N835N719M068Q894n355k2788
8251c145p928J3235J5855k959M350P364j435J0376K8217M083m3413k2823q130
$$ plain form
8238 -6353 1567 3915 -14830 14052 39847 49561 47023 27968 23567 -5231 -20787 7208 45235
8225 45235 75398 70160 72548 73337 77038 84442 75352 43182 40498 59142 72582 63124 63110 36134
8211 36134 6224 -12854 -1799 21597 3616 5350 10955 9896 13991 12476 349 5075 -25662
8198 -25662 -11591 2078 18999 27351 26021 26769 26931 24341 26955 24555 43476 39422 -1511 2117
8184 2117 3753 999 -4927 20581 12855 5376 30972 79465 99393 96051 87775 83510 50944 50470
8170 50470 67627 72419 63730 46583 47393 59309 71674 85610 68631 50373 12143 -4980 20347
8157 20347 37614 22104 -16867 -23734 -1864 5219 7646 6915 53199 91874 89133 62949 29862
8144 29862 26917 31852 12170 5553 15113 5378 1586 11606 -2582 -16604 -881 21426 44396
$$ packed form
8238f353P920K348j8745K8882K5795R714k538j9055m401k8798j5556K7995L8027
8225D5235L0163n238K388P89L701P404r090l2170k684J8644J3440r458j4k6976
8211C6134k9910j9078J1055K3396j7981J734N605j059M095j515j2127M726l0737
8198b5662J4071J3669J6921Q352j330P48J62k590K614k400J8921m054m0933L628
8184B117J636k754n926K5508p726p479K5596M8493J9928l342q276m265l2566m74
8170E0470J7157M792q689j7147Q10J1916J2365J3936j6979j8258l8230j7123K5327
8157B0347J7267j5510l8971o867K1870P083K427p31M6284L8675k741k6184l3087
8144B9862k945M935j9682o617R560r735l792J0020j4188j4022J5723K2307K2970
$$ plain form
8131 44396 41106 47945 46398 38487 18174 11463 21014 17633 14287 28634 57795 56450 54502 71426
8117 71426 88881 70640 45111 57823 57731 50200 45703 71086 86634 104388 122392 105606 72584
8104 72584 65415 63466 54510 45469 28490 3718 -10278 -15709 -4902 -15479 -7625 -13306 5480
8091 5480 21656 -2463 -12815 -19142 -7114 691 7120 -2596 -2421 7196 6989 22176 6828 -27414
8077 -27414 -7142 12317 27590 21385 -10690 9080 21620 25157 10339 -6126 -9467 -6693 4328
8064 4328 -4505 -16164 -20386 -18867 -9521 -5783 -2578 33083 41617 68741 81913 77291 59167 49157
8050 49157 53039 41999 39204 69120 65175 73110 73240 83851 96235 99111 100643 95128 95507 98578
8036 98578 96537 87807 66726 82836 126363 135237 130229 153942 152309 160749 157450 143970 114811
$$ packed form
8131D4396l290O839j547p911k0313o711R551l381l346J4347K9161j345j948J6924
8117G1426J7455j8241k5529J2712r2p531m497K5383J5548J7754J8004j6786l3022
8104G2584p169j949q956r041j6979k4772j3996n431J0807j0577P854n681J8786
8091E480J6176k4119j0352o327J2028P805O429r716J75R617k07J5187j5348l4242
8077b7414K0272J9459J5273o205l2075J9770J2540L537j4818j6465l341K774J1021
8064D328q833j1659m222J519R346L738L205L5661Q534K7124J3172m622j8124j0010
8050D9157L882j1040k795K9916l945P935J30J0611J2384K876J532n515L79L071
8036I8578k041q730k1081J6110M3527Q874n008K3713j633Q440l299j3480k9159
$$ plain form
8023 114811 123080 127782 114073 94199 79485 66446 64534 70658 64888 89831 105436 88924 85054
8010 85054 73476 83579 80327 90880 111588 118067 118487 139251 175467 187682 256727 349573 420380
7997 420380 483137 489705 444027 376322 325484 259608 237227 216161 222202 236167 275434 336054
7985 336054 368818 387633 350511 276601 204428 153353 121831 73387 52428 56679 52648 52708 80626
7972 80626 81389 70218 60933 66092 70881 82214 98557 94209 107869 123829 131822 125955 128523 125591
7958 125591 140811 152164 187728 226977 248559 267461 266468 258726 236841 207991 196003 177511
7946 177511 174413 198276 231843 273409 285183 260960 207314 156590 122547 139178 132224 102047
7934 102047 98630 87613 82216 78527 73966 87318 96908 93867 94948 92890 63378 42641 60550
$$ packed form
8023A14811Q269M702j3709j9874j4714j3039j912O124n770K4943J5605j6512l870
8010H5054j1578J0103l252J0553K0708O479M20K0764L6216J2215O9045R2846P0807
7997D20380O2757O568m5678o7705n0838o5876k2381k1066O041J3965L9267O0620
7985C36054L2764J8815l7122p3910p2173n1075l1522m8444k0959M251m031O0K7918
7972H0626P63j1171r285N159M789J1333J6343m348J3660J5960P993n867K568k932
7958A25591J5220J1353L5564L9249K1582J8902r93p742k1885k8850j1988j8492
7946A77511l098K3863L3567M1566J1774k4223n3646n0724l4043J6631o954l0177
7934A02047l417j1017n397l689m561J3352R590l041J081k058k9512k0737J7909
$$ plain form
7921 60550 41471 63010 54236 51564 50419 67285 69935 56891 59052 68522 59014 81002 85315
7908 85315 76000 77629 67207 42875 35769 58684 58813 58598 63158 54240 33152 30396 14352 -5371
7894 -5371 2694 16979 45302 35864 17096 -2708 7350 13244 24136 24565 34074 19293 4484
7881 4484 6129 11976 12844 52563 65433 29713 -10281 -2783 33640 36909 33109 20612 11603 17752
7867 17752 39749 53449 41075 27781 43043 50996 84152 72554 14036 -13211 -14488 -13114
7855 -13114 -17276 1161 -9563 -27017 -25974 -6290 6182 -3962 -11270 -6866 18417 31694 20856
7842 20856 7648 -712 -384 -8478 -21738 -31369 -29648 -6283 8659 -15961 -2393 1336 14380
7829 14380 45907 39563 29848 40683 10501 6706 1060 -8711 -9218 -13946 8103 17165 13623 18194
$$ packed form
7921F0550j9079K1539q774k672j145J6866K650j3044K161R470r508K1988M313
7908H5315r315J629j0422k4332p106K2915J29k15M560q918k1088k756j6044j9723
7894e371Q065J4285K8323r438j8768j9804J0058N894J0892M29R509j4781j4809
7881D484J645N847Q68L9719J2870l5720l9994P498L6423L269l800j2497r009O149
7867A7752K1997J3700j2374j3294J5262P953L3156j1598n8518k7247j277J374
7855a3114m162J8437j0724j7454J043J9684J2472j0144p308M404K5283J3277j0838
7842B0856j3208q360L28q094j3260r631J721K3365J4942k4620J3568L729J3044
7829A4380L1527o344r715J0835l0182l795n646r771n07m728K2049R062l542M571
$$ plain form
7815 18194 10896 -4798 -13243 -3523 2087 -9548 -18105 -21872 -36241 -32903 -7230 21240 17296
7802 17296 11275 4861 3806 18232 28993 43012 34058 24816 18892 30044 15850 13964 14052 36894
7788 36894 48019 34700 27685 16335 616 -12253 5199 514 -3957 19423 19027 -22455 -29381
7775 -29381 -42581 -22229 -16510 -24353 -23955 3000 14406 3183 -28220 -37916 -22234 -20719 -13694
7762 -13694 -20586 -33018 -58849 -42346 2815 16368 15552 17824 2429 -7436 7876 26835 4413
7749 4413 -1077 -20813 -20417 -42469 -50725 -34474 -3751 13565 5137 -5892 18983 26795 7335
7736 7335 -8204 -17486 -30119 -27328 5391 3032 16283 32961 43451 29108 26833 38468 43022
7723 43022 42164 15642 1631 9924 9150 8400 7576 9018 -8483 -19436 -8748 -27435 -15829 5710
$$ packed form
7815A8194p298j5694q445R720N610j1635q557l767j4369L338K5673K8470l944
7802A7296o021o414j055J4426J0761J4019q954r242n924J1152j4194j886Q8K2842
7788C6894J1125j3319p015j1350j5719j2869J7452m685m471K3380l96m1482o926
7775b9381j3200K0352N719p843L98K6955J1406j1223l1403r696J5682J515P025
7762a3694o892j2432k5831J6503M5161J3553q16K272j5395r865J5312J8959k2422
7749D413n490j9736L96k2052q256J6251L0723J7316q428j1029K4875P812j9460
7736G335j5539r282j2633K791L2719k359J3251J6678J0490j4343k275J1635M554
7723D3022q58k6522j4011Q293p74p50q24J442j7501j0953J0688j8687J1606K1539
$$ plain form
7709 5710 25457 32583 28164 13666 10277 6316 16030 33139 51557 55372 39396 12828 -5658
7696 -5658 7021 22382 -410 7682 29997 20369 11646 3681 17054 566 -11663 -1311 23687
7683 23687 31662 28792 28247 9546 2319 -2563 723 22595 39168 29938 33587 24920 16866 14822
7669 14822 29296 36641 11443 -6901 -5822 -6857 -12545 1122 14035 3343 18609 24898 42263
7656 42263 44238 13836 5577 -8329 -15326 -27049 -37156 -26169 -7787 -39205 -51637 -17951
7644 -17951 -6023 14991 31585 40125 8051 -7593 8282 32037 28554 4778 -23429 673
7632 673 11376 5807 -13407 -7021 27313 22264 27751 37361 15881 558 -8395 -4329 42841 55900
7618 55900 12489 -1894 -2605 20524 5347 -40233 -53424 -49636 -41422 -27140 -20106 -7011 -3592
$$ packed form
7709E710J9747P126m419j4498l389l961R714J7109J8418L815j5976k6568j8486
7696e658J2679J5361k2792Q092K2315r628q723p965J3373j6488j2229J0352K4998
7683B3687P975k870n45j8701p227m882L286K1872J6573r230L649q667q054k044
7669A4822J4474P345k5198j8344J079j035n688J3667J2913j0692J5266O289J7365
7656D2263J975l0402q259j3906o997j1723j0107J0987J8382l1418j2432L3686
7644a7951J1928K1014J6594Q540l2074j5644J5875K3755l483k3776k8207K4102
7632F73J0703n569j9214O386L4334n049N487R610k1480j5323q953M066M7170J3059
7618E5900m3411j4383p11K3129j5177m5580j3191L788Q214J4282P034J3095L419
$$ plain form
7605 -3592 -2533 31206 35836 5576 6109 15549 28216 24800 15156 -358 -4895 -5693 -32265 -43980
7591 -43980 -29715 7652 27627 29828 893 -14065 -11529 -14964 6898 -379 -4248 -4990 8553
7578 8553 36572 34713 31025 3840 3690 -14206 -32945 -35521 -10768 18694 13570 19373 32678
7565 32678 29593 13557 -1731 6654 11728 -9129 -15397 12914 21435 854 -8935 -20112 -20219
7552 -20219 -26142 -32868 -878 -946 -21452 -22798 -22328 -681 6437 -7790 6764 31299 5869 5165
7538 5165 12711 5916 567 2121 -1164 26329 30852 33107 31913 37093 36028 7709 5646 -3291
7524 -3291 4073 1553 -2906 -13992 -1376 18493 13068 17292 31436 40278 37134 56139 54135 47465
7510 47465 33830 16400 24199 28292 8999 26956 22205 21165 5021 -10439 -28968 -33335 -35590
$$ packed form
7605c592J059L3739M630l0260N33R440J2667l416r644j5514m537p98k6572j1715
7591d3980J4265L7367J9975K201k8935j4958K536l435K1862p277l869p42J3543
7578H553K8019j859l688k7185j50j7896j8739k576K4753K9462n124N803J3305
7565C2678l085j6036j5288Q385N074k0857o268K8311Q521k0581r789j1177j07
7552b0219n923o726L1990o8k0506j346M70K1647P118j4227J4554K4535k5430p04
7538E165P546o795n349J554l285K7493M523K255j194N180j065k8319k063q937
7524c291P364k520m459j1086J2616J9869n425M224J4144Q842l144J9005k004o670
7510D7465j3635j7430P799M093j9293J7957m751j040j6144j5460j8529m367k255
$$ plain form
7497 -35590 -23208 -34442 -22183 -26215 -26970 -20584 -13127 7514 8711 17041 23160 13873 18524 20319
7483 20319 16951 40138 42582 28688 30325 9495 29554 44177 35501 6050 -25095 -27307 -3629
7470 -3629 11490 9000 -557 5248 2576 -32509 -55107 -43862 -35106 -43423 -26712 -30479 -32465 -35532
7456 -35532 -113 15941 19062 17454 4492 -16464 -15320 4539 1753 -20483 -1789 12740 -8172
7443 -8172 -6060 -16212 -13772 -7691 -21397 -28793 -14838 30666 34586 32803 103 -32272 -11162
7430 -11162 -10861 9294 -1615 -32918 -59132 -44562 -6020 10050 -3903 1939 22719 18642 12535
7417 12535 33970 22097 4838 9628 -5678 -25441 -10764 -9214 -13844 -7088 -6322 -18110 -9250
7404 -9250 8406 -2299 -9146 -16377 -46096 -45779 -18797 -766 -603 -37436 -60901 -48877 -23964
$$ packed form
7497c5590J2382j1234J2259m032p55O386P457K0641J197Q330O119r287M651J795
7483B0319l368K3187K444j3894J637k0830K0059J4623q676k9451l1145k212K3678
7470c629J5119k490r557N805k672l5085k2598J1245Q756q317J6711l767j986l067
7456c5532L5419J6054L121j608j2962k0956J144J9859k786k2236J8694J4529k0912
7443h172K112j0152K440O081j3706p396J3955M5504L920j783l2700l2375K1110
7430a1162L01K0155j0909l1303k6214J4570L8542J6070j3953N842K0780m077o107
7417A2535K1435j1873j7259M790j5306j9763J4677J550m630O756P66j1788Q860
7404i250J7656j0705o847p231k9719L17K6982J8031J63l6833k3465J2024K4913
$$ plain form
7391 -23964 228 -6935 -21277 -12806 -11339 -5687 15314 9273 -2123 -10192 -8668 8063 8565 12853
7377 12853 11405 -3046 -5108 -27691 -30589 -28608 -27617 -30710 -16860 1051 241 15437 29858 24383
7363 24383 24825 18794 30973 2436 -11190 -32617 -61028 -51305 -37507 -40164 -48839 -47332 -28259
7350 -28259 -14420 10519 9296 -5752 5411 -4996 -6642 -3758 12410 20357 -3589 -9578 -27190
7337 -27190 -40887 -46774 -24850 -2924 -5553 593 5978 -9890 8098 29522 24839 5155 -12763
7324 -12763 -11504 -18039 -6759 2959 -8248 -32962 -27320 -13229 -1546 -2805 7595 10537 5528
7311 5528 -15775 -30556 -50683 -41289 -35292 -19533 -3644 -26102 -49102 -30308 339 512 -13623
7298 -13623 -10745 -31745 -41539 -37299 -17371 -28769 -22999 8619 26572 35819 24713 8672 14555
$$ packed form
7391b3964K4192p163j4342Q471J467N652K1001o041j1396q069J524J6731N02M288
7377A2853j448j4451k062k2583k898J981R91l093J3850J7911q10J5196J4421n475
7363B4383M42o031J2179k8537j3626k1427k8411R723J3798k657q675J507J9073
7350b8259J3839K4939j223j5048J1163j0407j646K884J6168P947k3946n989j7612
7337b7190j3697n887K1924K1926k629O146N385j5868J7988K1424m683j9684j7918
7324a2763J259o535J1280R718j1207k4714N642J4091J1683j259J0400K942n009
7311E528k1303j4781k0127R394N997J5759J5889k2458k3000J8794L0647J73j4135
7298a3623K878k1000r794M240J9928j1398N770L1618J7953R247j1106j6041N883
$$ plain form
7285 14555 15237 -10468 -18932 -22383 -21582 -14998 -24570 -21943 6523 10366 8098 7107 9299 -9959 -6180
7270 -6180 -21257 -24969 -26163 -22315 8126 26964 7024 638 3625 -16499 -20049 1281 7613
7257 7613 12548 10005 8165 24782 4681 -13339 -16817 -2868 21903 21613 20831 8014 323 15297
7243 15297 13089 84 -17735 -20563 -30110 -45965 -32682 -5549 -6174 -3359 21262 14269 14184 8264
7229 8264 -2729 -6069 5853 31343 24116 22374 -7936 -19574 -1258 -2928 -7798 -9636 3466
7216 3466 25766 9588 15307 11126 373 23825 14837 7845 21400 7988 8214 18389 19593
7203 19593 20350 -144 -22717 -28548 -27484 4219 14454 11171 -25093 -39141 -20095 -8695 438
7190 438 47470 35918 -13714 -28902 -16581 -27196 -15504 11612 -7470 -21050 -6219 -20493
$$ packed form
7285A4555O82k5705q464l451Q01O584r572K627K8466L843k268r91K192j9258L779
7270f180j5077l712j194L848L0441J8838j9940o386K987k0124l550K1330O332
7257G613M935k543j840J6617k0101j8020l478J3949K4771k90p82j2817p691J4974
7243A5297k208j3005j7819k828r547j5855J3283K7133o25K815K4621o993q5n920
7229H264j0993l340J1922K5490p227j742l0310j1638J8316j670m870j838J3102
7216C466K2300j6178N719m181j0753K3452q988o992J3555j3412K26J0175J204
7203A9593P57k0494k2573n831J064L1703J0235l283l6264j4048J9046J1400R133
7190D38M7032j1552m9632j5188J2321j0615J1692K7116j9082j3580J4831j4274
$$ plain form
7178 -20493 -14838 -28923 -34105 -13527 -8689 -7859 -13029 -24972 -34181 -23366 4425 -6453 -20062
7165 -20062 -9970 3986 11269 -3748 -6429 -33157 -21868 -8181 -1077 9507 6708 -20 6044
7152 6044 6648 5360 1576 17898 50776 71271 71937 82188 73635 38485 22424 27884 41930 38477
7138 38477 -2026 -20030 4495 22954 29794 13426 -26359 -41124 -34895 -10683 22693 37542
7126 37542 35762 -7674 -39190 -34604 1649 22061 19083 14088 -8905 -35003 -26588 -23228 -16147
7113 -16147 -8842 5701 7486 -2527 -28403 -24452 -3462 -24695 -8451 -448 1606 -749 -27867
7100 -27867 -21449 -19234 -14477 -10127 -3605 -9624 -41374 -54261 -49351 -20983 -14781 -5399 3251 5004
7086 5004 19121 37676 34000 24362 5582 11158 -7682 -23996 -21854 -23065 -6677 -10595 -769
$$ packed form
7178b0493N655j4085n182K0578M838Q30n170j1943r209J0815K7791j0878j3609
7165b0062J0092J3956P283j5017k681k6728J1289J3687P104J0584k799o728O064
7152F044O04j288l784J6322L2878K0495O66J0251q553l5150j6061N460J4046l453
7138C8477m0503j8004K4525J8459O840j6368l9785j4765O229K4212L3376J4849
7126C7542j780m3436l1516M586L6253K0412k978m995k2993k6098Q415L360P081
7113a6147P305J4543J785j0013k5876L951K0990k1233J6244Q003K054k355k7118
7100b7867O418K215M757M350O522o019l1750j2887M910K8368O202R382Q650J753
7086E004J4117J8555l676r638j8780N576j8840j6314K142j211J6388l918R826
$$ plain form
7073 -769 1851 -495 11023 -15957 -12435 -566 8006 38116 22937 17762 9409 13547 22658 8139
7059 8139 9856 13402 20550 17641 1111 -6390 -18098 -36384 -25834 -23188 -17467 -5890 -5638 -9885
7045 -9885 -14883 -28285 -11044 1838 7655 5157 -2748 -4934 13647 37292 35111 7464 -17651
7032 -17651 -19384 -10967 6821 1362 -2967 17330 28455 31838 26317 15973 9561 12692 8320 20663
7018 20663 28903 6313 -3873 10237 21036 14113 4980 25288 32196 19970 19834 39822 47514
7005 47514 36100 18573 8185 15523 -3266 -15888 -31915 -49902 -33336 -8996 21105 4304
6993 4304 -10067 5473 2814 4151 8525 -39079 -42595 -4592 -11109 -20162 -11717 -14947 -6240 -6131
6979 -6131 9803 12000 10457 3949 -5919 -360 26269 29133 11153 15787 4135 -14050 -14714 5999
$$ packed form
7073g69K620k346J1518k6980L522J1869Q572L0110j5179n175q353M138R111j4519
7059H139J717L546P148k909j6530p501j1708j8286J0550K646N721J1577K52m247
7045i885m998j3402J7241J2882N817k498p905k186J8581K3645k181k7647k5115
7032a7651j733Q417J7788n459m329K0297J1125L383n521j0344o412L131m372J2343
7018B0663Q240k2590j0186J4110J0799o923r133K0308O908j2226j36J9988P692
7005D7514j1414j7527j0388P338j8789j2622j6027j7987J6566K4340L0101j6801
6993D304j4371J5540k659J337M374m7604l516L8003o517r053Q445l230Q707J09
6979f131J5934K197j543o508r868N559K6629K864j7980M634j1652j8185o64K0713
$$ plain form
6965 5999 12225 2800 -2330 -22021 -15776 -12268 -27969 -30717 -17648 -20647 -33259 -43219 -27161 -19078
6951 -19078 -19956 -14942 -771 -8 1582 -5284 24812 21022 19038 6580 -13901 -12320 -1578 2323
6937 2323 -698 15355 -464 -2874 12048 13287 23308 40097 10732 -32329 -36980 -34645 -14545
6924 -14545 -4948 -11749 -18968 -14251 -3990 -8876 2298 -3516 -10012 -7587 -8331 -17004 -14962 6102
6910 6102 34411 959 -16184 -11658 9472 40769 40171 22405 2939 5199 16599 10705 7309
6897 7309 5011 -3243 -25243 -36049 6265 24481 24293 27379 36232 42851 34222 7468 -24943 -37211
6883 -37211 -10633 13904 16952 -7692 -23123 1937 29915 39065 13090 24334 33353 22947
6871 22947 -7791 -21723 -20368 -12082 -7147 -14108 -3273 21856 22633 13352 27547 26059 39042
$$ packed form
6965E999O226r425n130j9691O245L508j5701k748J3069k999j2612r960J6058Q083
6951a9078q78N014J4171P63J590o866L0096l790j984j2458k0481J581J0742L901
6937B323l021J6053j5819k410J4922J239J0021J6789k9365m3061m651K335K0100
6924a4545R597o801p219M717J0261m886J1174n814o496K425p44q673K042K1064
6910F102K8309l3452j7143M526K1130L1297n98j7766j9466K260J1400n894l396
6897G309k298q254k2000j0806M2314J8216j88L086Q853O619q629k6754l2411j2268
6883c7211K6578K4537L048k4644j5431K5060K7978R150k5975J1244R019j0406
6871B2947l0738j3932J355Q286M935o961J0835K5129P77r281J4195j488J2983
$$ plain form
6858 39042 30328 16243 -12627 4265 13040 131 11258 20408 41232 32507 9783 -8431 -9726
6845 -9726 -4382 18344 29537 40924 37688 12011 6262 -364 -12571 -14324 -25793 -44581 -42470
6832 -42470 -31695 -33326 -16995 12450 13085 9698 5844 8372 -2195 -2210 -15770 -23950 -22307 -11108
6818 -11108 -3246 4040 13802 32175 4806 1367 11776 16824 17984 -19906 -33757 -29855 -27729
6805 -27729 -5708 2678 1501 -5835 1470 13742 7964 10845 21046 10349 1819 491 11811
6792 11811 13672 19400 3628 1983 7031 17752 9643 -1424 16106 18200 1450 -8889 -24335
6779 -24335 -9705 18809 17766 654 9987 277 -7774 -937 -1929 -351 -6715 -27132 -15750 -12456
6765 -12456 -18312 -12389 -10992 -32303 -16515 9017 9711 19085 -336 8802 22400 27041 18056 24596
$$ packed form
6858C9042q714j4085k8870J6892Q775j2909J1127R150K0824q725k2724j8214j295
6845i726N344K2726J1193J1387l236k5677n749o626j2207j753j1469j8788K111
6832d2470J0775j631J6331K9445O35l387l854K528j0567j5j3560q180J643J1199
6818a1108P862P286R762J8373k7369l439J0409N048J160l7890j3851L902K126
6805b7729K2021Q386j177p336P305J2272n778K881J0201j0697q530j328J1320
6792A1811J861N728j5772j645N048J0721q109j1067J7530K094j6750j0339j5446
6779b4335J4630K8514j043j7112R333r710q051O837r92J578o364k0417J1382L294
6765a2456n856N923J397k1311J5788K5532O94R374j9421R138J3598M641q985O540
$$ plain form
6751 24596 11964 -16912 -40545 -32358 -19004 2159 16244 32277 64851 73288 67685 32782
6739 32782 9123 8475 27153 12437 3082 20581 24706 -7855 -5455 2097 8887 39264 47783
6726 47783 43429 40831 37181 28663 38798 48105 40455 52277 64335 59849 72261 68578 40736
6713 40736 58349 32645 6309 353 -9464 -14284 -23217 -5675 17937 23218 33733 25638 19379
6700 19379 27648 40243 48224 36971 26300 40085 73725 78125 40552 17251 -4006 -32859
6688 -32859 -11398 17697 13292 -5783 -5747 -13697 4205 11238 28080 18082 17875 23526 5062 971
6674 971 394 22295 27875 38431 36849 20590 7545 1638 -33327 -1913 36757 55505 46436
6661 46436 37104 29246 23813 19448 4040 495 -3660 2615 26435 16666 -6422 4352 4413 -6756
$$ packed form
6751B4596j2632k8876k3633Q187J3354K1163J4085J6033L2574Q437n603l4903
6739C2782k3659o48J8678j4716r355J7499M125l2561K400P552O790L0377Q519
6726D7783m354k598l650q518J0135R307p650J1822J2058m486J2412l683k7842
6713D0736J7613k5704k6336n956r817m820q933J7542K3612N281J0515q095o259
6700A9379Q269J2595P981j1253j0671J3785L3640M400l7573k3301k1257k8853
6688c2859K1461K9095m405j9075L6p950J7902P033J6842r998k07N651j8464m091
6674I71n77K1901N580J0556j582j6259j3045n907l4965L1414L8670J8748r069
6661D6436r332p858n433m365j5408l545m155O275K3820r769k3088J0774O1j1169
$$ plain form
6647 -6756 1294 18800 31414 43465 48436 35215 40942 50621 56509 57679 23166 -5151 7338
6634 7338 12134 40828 57767 42388 31641 34821 22710 16926 22583 52697 103434 173176 270840
6621 270840 399963 413469 354107 276692 209952 193001 209661 236536 268438 310217 342038
6610 342038 400248 531747 693562 882187 1132013 1486718 2051946 3162803 5312121 9382998
6600 9382998 14181839 13771188 10023701 6042071 3583660 2380256 1766690 1400229 1116092
6591 1116092 899603 726774 609532 526465 443707 377412 312439 266773 229137 232834 305033
6580 305033 428908 525903 480289 370818 267797 189561 120431 82682 80598 111666 101127
6569 101127 89969 64020 41390 13667 23185 11284 25821 50567 53745 50803 29945 17318
$$ packed form
6647f756Q050J7506J2614J2051M971j3221N727R679N888J170l4513k8317J2489
6634G338M796K8694J6939j5379j0747L180j2111n784N657L0114N0737O9742R7664
6621B70840J29123J3506n9362p7415o6740j6951J6660K6875L1902M1779L1821
6610C42038N8210J31499J61815J88625K49826L54705N65228J110857K149318M070877
6600I382998M798841m10651l747487l981630k458411j203404o13566l66461k84137
6591A116092k16489j72829j17242q3067q2758o6295o4973m5666l7636L697P2199
6580C05033J23875R6995m5614j09471j03021p8236o9130l7749k084L1068j0539
6569A01127j1158k5949k2630k7723R518j1901J4537K4746L178k942k0858j2627
$$ plain form
6557 17318 21745 25001 16464 5930 -10018 -29059 -12639 2510 34147 36518 25129 18493 27789
6544 27789 20584 23738 20896 9307 17518 19104 11237 22113 38498 31747 32002 36515 18414 2047
6530 2047 2469 17943 36136 39198 47095 34995 -7260 1585 -4795 -10949 -19998 -23153 -6799 10276
6516 10276 25017 28473 18404 344 -706 2067 6529 -13231 -17392 25263 28441 737 -3642
6503 -3642 -17316 -12782 -18990 -16918 -13071 -11358 -14103 -12782 -2284 4031 -8810 -958 3958 36496
6489 36496 61113 53765 35173 5947 -11221 -28245 -14556 -15390 9066 8798 3993 3210 19569
6476 19569 15446 8736 14436 22748 15351 21528 7344 7624 21704 -4952 -18214 -16230 -342 -18213
6462 -18213 -32239 -18501 -5260 32421 27362 34784 28985 -4916 -9430 -8851 -10994 -10059 3397 14872
$$ packed form
6557A7318M427L256q537j0534j5948j9041J6420J5149L1637K371j1389o636R296
6544B7789p205L154k842j1589Q211J586p867J0876J6385o751K55M513j8101j6367
6530B047M22J5474J8193L062P897j2100m2255Q845o380o154r049l155J6354J7075
6516A0276J4741L456j0069j8060j050K773M462j9760m161M2655L178k7704m379
6503c642j3674M534o208K072L847J713k745J321J0498O315j2841P852M916L2538
6489C6496K4617p348j8592k9226j7168j7024J3689q34K4456k68m805p83J6359
6476A9569m123o710N700Q312p397O177j4184K80J4080k6656j3262J984J5888j7871
6462a8213j4026J3738J3241L7681n059P422n799l3901m514N79k143R35J3456J1475
$$ plain form
6448 14872 6137 14161 16689 3084 -16533 -19992 -46191 -42758 -34826 -27298 -9225 2437 18590
6435 18590 4562 -2607 1575 -4488 -26091 -12307 -2512 -13113 -20681 -23758 -27681 -14139 -21580
6422 -21580 -19005 218 12304 9068 -3085 -10237 625 32245 33413 27930 16799 10970 18371
6409 18371 28144 33171 31603 28953 -8452 -16342 -5160 -605 -17793 -15406 -11842 -4465 -3416 -5296
6395 -5296 629 10381 -13572 -26170 -10516 -14032 -42198 -29736 1048 25148 38059 5729 -7066
6382 -7066 -2048 -19857 -39718 -23417 6143 18911 28830 35641 29874 36959 42461 18253 -2126
6369 -2126 6967 17533 18101 1227 13936 31750 7161 -5677 -26826 -47765 -46099 -15276 20660
6356 20660 15688 13280 17150 -2038 -20071 -18952 -14448 -3756 -5633 -8824 2602 4216 2160 13773
$$ packed form
6448A4872q735Q024K528j3605j9617l459k6199L433P932P528J8073J1662J6153
6435A8590j4028p169M182o063k1603J3784R795j0601p568l077l923J3542p441
6422b1580K575J9223J2086l236j2153p152J0862L1620J168n483j1131n829P401
6409A8371R773N027j568k650l7405p890J1182M555j7188K387L564P377J049j880
6395e296N925R752k3953j2598J5654l516k8166J2462L0784K4100J2911l2330j2795
6382g066N018j7809j9861J6301K9560J2768R919O811n767P085N502k4208k0379
6369b126R093J0566N68j6874J2709J7814k4589j2838k1149k0939J666L0823L5936
6356B0660m972k408L870j9188j8033J119M504J0692j877l191J1426J614k056J1613
$$ plain form
6342 13773 21267 -4857 -12517 -16228 -33384 -18997 -31872 -23288 -14219 4197 13430 15955 7555
6329 7555 -744 -6645 -29356 -37253 -38330 -29644 -16052 -11176 -6871 11475 13336 4376 -9221 -8112
6315 -8112 -30537 -36455 -25719 2838 -10159 -26417 -23552 -14649 4563 -3520 4781 19730 32176
6302 32176 27089 25884 38769 25119 14329 -43 -5474 -2827 10226 28519 29279 23356 34566
6289 34566 58874 59521 32435 -9426 -11633 13420 26178 55721 61095 64385 43990 20183 17934
6276 17934 10423 -6712 -3320 15965 260 -22393 -28005 -19035 4927 19198 26468 19309 17127
6263 17127 1999 -2232 6322 33849 31738 15344 1087 -9287 -5967 -16447 -18389 -14968 -10583
6250 -10583 1254 7900 -11880 -22890 -45773 -33100 -7568 20391 22317 7768 -16991 -42661
$$ packed form
6342A3773P494k6124p660l711j7156J4387j2875Q584R069J8416R233K525q400
6329G555q299n901k2711p897j077Q686J3592M876M305J8346J861q960j3597J109
6315h112k2425n918J0736K8557j2997j6258K865Q903J9212q083Q301J4949J2446
6302C2176n087j205J2885j3650j0790j4372n431K647J3053J8293P60n923J1210
6289C4566K4308O47k7086m1861k207K5053J2758K9543N374L290k0395k3807k249
6276A7934p511j7135L392J9285j5705k2653n612Q970K3962J4271P270p159k182
6263A7127j5128m231Q554K7527k111j6394j4257j0374L320j0480j942L421M385
6250a0583J1837O646j9780j1010k2883J2673K5532K7959J926j4549k4759k5670
$$ plain form
6238 -42661 -28357 -16494 9594 -6517 -19987 -4432 17699 18796 -28507 -32838 -35772 -37232 -2905
6225 -2905 24064 31839 41684 54562 54550 43349 29952 -2722 -41517 -57157 -43936 -33671 -12884
6212 -12884 8207 -5334 -31688 -30190 13899 54724 52942 37553 25245 10910 26084 1393
6200 1393 -24622 -32647 -49949 -35433 -16130 -33249 -35024 -11601 27778 47578 25525 -9145
6188 -9145 -4883 14153 6047 578 -3266 19428 5299 12388 -6586 -6386 -380 -5150 16260 11474
6174 11474 14470 2515 -14984 7 12489 18797 10542 10927 3593 14782 11597 8780 -2831
6161 -2831 1923 15722 11523 3819 -6582 -17272 -19651 -26776 -17983 11182 15487 9199 372 1559
6147 1559 4855 -8531 2831 2698 -11122 5709 5632 14411 391 -6421 -10798 -1249 -25226 -30813
$$ packed form
6238d2661J4304J1863K6088j6111j3470J5555K2131J097m7303m331k934j460L4327
6225b905K6969P775R845J2878j2j1201j3397l2674l8795j5640J3221J0265K0787
6212a2884K1091j3541k6354J498M4089M0825j782j5389j2308j4335J5174k4691
6200A393k6015q025j7302J4516J9303j7119j775K3423L9379J9800k2053l4670
6188i145M262J9036q106n469l844K2694j4129P089j8974K00O006m770K1410m786
6174A1474K996j1955j7499J4991J2482O308q255L85p334J1189l185k817j1611
6161b831M754J3799m199p704j0401j0690k379p125Q793K9165M305o288q827J187
6147A559L296j3386J1362j33j3820J6831p7Q779j4020o812m377R549k3977n587
$$ plain form
6133 -30813 -47115 -51723 -38795 -14648 -5279 2296 -9027 -42795 -50741 -43082 -29688 -33496 -34674
6120 -34674 -24781 -2015 -5079 -41539 -59527 -30009 -3141 -11639 -19501 -8550 -17084 -2690 5660
6107 5660 -15036 12910 37577 20893 13377 -21279 -33051 -15420 -20005 -27576 -17422 -26902 -12819
6094 -12819 -7769 -31436 -42575 -35423 -4750 13838 31775 41993 34530 41935 29988 22613 -5002
6081 -5002 -8536 4199 19171 10381 655 -21869 -25032 -50541 -74815 -66026 -30510 -22798 -7398
6068 -7398 -18222 -32727 -3740 -29096 -30489 2640 28873 4550 -27554 -3453 14984 2513
6056 2513 -17445 -19154 -9488 21628 14457 3375 8278 15174 16663 1622 -1836 -21858 -21966 -5422
6042 -5422 2520 14348 22455 20858 15095 5630 -15745 -16834 -1661 5552 3264 -10849 -30693 -27850
$$ packed form
6133c0813j6302m608J2928K4147R369P575j1323l3768p946P659J3394l808j178
6120c4674R893K2766l064l6460j7988K9518K6868q498p862J0951q534J4394Q350
6107E660k0696K7946K4667j6684p516l4656j1772J7631m585p571J0154r480J4083
6094a2819N050k3667j1139P152L0673J8588J7937J0218p463P405j1947p375k7615
6081e002l534J2735J4972q790r726k2524l163k5509k4274Q789L5516P712J5400
6068g398j0824j4505K8987k5356j393L3129K6233k4323l2104K4101J8437j2471
6056B513j9958j709R666L1116p171j1082M903O896J489j5041l458k0022j08J6544
6042e422P942J1828Q107j597n763r465k1375j089J5173P213k288j4113j9844K843
$$ plain form
6028 -27850 -19955 -13861 -4723 -15729 -17250 -11384 12540 32183 14112 7201 290 -6646 4650
6015 4650 12696 9942 -466 523 5878 4794 15188 10475 -9282 14478 17652 16805 35489 40156
6001 40156 24782 24747 19980 -2176 -29486 -35909 -25882 -21312 -41924 -55166 -59331 -64531 -48413
5988 -48413 -21959 -16195 -19612 -11344 -31721 -40616 -30012 -19970 -10047 -24274 -25869 -3713 -1510
5975 -1510 -598 12957 3615 -1401 -4587 -186 1376 23157 21207 9537 15244 27511 25375 25272
5961 25272 -6312 3951 19917 11509 -2677 -15071 2217 7550 22169 28431 27434 21353 12245
5948 12245 27955 46261 29991 24079 11427 15765 15527 4117 -23443 -24758 -32304 -40486 -23146
5935 -23146 -19047 -17777 -11109 -464 2309 -25839 -18168 -23585 -2231 -9276 -9612 -29297 -68585 -42591
$$ packed form
6028b7850P895O094R138j1006j521N866K3924J9643j8071o911o911o936J1296
6015D650Q046k754j0408R89N355j084J0394m713j9757K3760L174q47J8684M667
6001D0156j5374l5m767k2156k7310o423J0027M570k0612j3242m165n200J6118
5988d8413K6454N764l417Q268k0377q895J0604J0042R923j4227j595K2156K203
5975a510R12J3555r342n016l186M401J562K1781j950j1670N707J2267k136j03
5961B5272l1584J0263J5966q408j4186j2394J7288N333J4619O262r97o081r108
5948A2245J5710J8306j6270n912j2652M338k38j1410k7560j315p546q182J7340
5935b3146M099J270O668J0645K773k8148P671n417K1354p045l36j9685l9288K5994
$$ plain form
5921 -42591 5932 27787 33958 12475 -3335 14965 35772 12246 346 -835 -18645 -24855
5909 -24855 -7931 -6642 -18764 9454 54684 48449 -9423 -17028 -13451 -16664 -27951 -48136 -56284
5896 -56284 -29267 7931 16800 -5967 -20800 -19546 7893 47605 42298 22395 22420 3711 -2096
5883 -2096 -16432 -25733 -4928 1446 -280 -6216 5345 -10 -10718 -27219 -28195 -5993 1978 8882
5869 8882 24520 8894 -14434 -16117 -36386 -37117 -36608 -31761 -13134 -15044 -17366 -322 -9619 -17333
5855 -17333 -22582 -19017 -31607 -28426 -42940 -49518 -20697 -24137 -15103 -12092 -3584 -15440 -21956 -21860
5841 -21860 -9165 -9362 -15871 -9234 8094 29588 2531 3896 31714 23987 11737 -3242 -35924
5828 -35924 -38027 -21092 -6798 5352 15558 461 -12934 -17198 -19784 -25338 -22468 -22351 -30987
$$ packed form
5921d2591M8523K1855O171k1483j5810J8300K0807k3526j1900j181j7810o210
5909b4855J6924J289j2122K8218M5230o235n7872p605L577l213j1287k0185q148
5896e6284K7017L7198Q869k2767j4833J254K7439L9712n307j9903K5j8709n807
5883b096j4336r301K0805O374j726n936J1561n355j0708j6501r76K2202P971O904
5869H882J5638j5626k3328j683k0269p31N09M847J8627j910k322J7044r297p714
5855a7333n249L565j2590L181j4514o578K8821l440R034L011Q508j1856o516R6
5841b1860J2695j97o509O637J7328K1494k7057J365K7818p727j2250j4979l2682
5828c5924k103J6935J4294J2150J0206j5097j3395m264k586n554K870J17q636
$$ plain form
5815 -30987 3949 12890 18724 23855 2655 -5751 -9286 -26359 -16767 20137 21614 28924 27328 20152
5801 20152 24935 13522 -435 -21677 -19413 17655 7129 -16357 -42445 -45620 -20406 15425
5789 15425 44703 43731 34123 40559 9494 -12851 6139 26092 24620 22785 9914 8231 -4372
5776 -4372 -16229 -22052 -1720 32106 42675 30251 8951 26243 46573 42522 27300 26188 34123
5763 34123 30395 19642 6790 16306 10369 3884 -3579 -12822 -11541 4357 3743 -3964 18115 46487
5749 46487 53556 47943 19623 -14554 -13297 -4081 5886 6231 -19306 -15526 4961 29134 18632
5736 18632 24803 41993 28872 -753 -11219 -5266 8552 1563 5195 7175 11695 12903 5665
5723 5665 -7239 -14196 8835 30796 24773 -6869 1656 16139 17450 8632 171 -11447 -21534
$$ packed form
5815c0987L4936Q941N834N131k1200q406l535j7073R592L6904J477P310j596p176
5801B0152M783j1413j3957k1242K264L7068j0526k3486k6088l175K5214L5831
5789A5425K9278r72r608O436l1065k2345J8990J9953j472j835j2871j683j2603
5776d372j1857n823K0332L3826J0569j2424k1300J7292K0330m051j5222j112P935
5763C4123l728j0753j2852R516n937o485p463r243J281J5898o14p707K2079K8372
5749D6487P069n613k8320l4177J257R216R967L45k5537L780K0487K4173j0502
5736A8632O171J7190j3121k9625j0466N953J3818o989L632J980M520J208p238
5723E665j2904o957K3031K1961o023l1642Q525J4483J311q818q461j1618j0087
$$ plain form
5710 -21534 -41976 -24275 2372 -2247 -16069 -42714 -31173 -28326 -49735 -55089 -34543 -23395
5698 -23395 -1857 12620 8440 -1027 -21741 -32071 -32561 -49047 -68979 -53386 -59499 -56907 -39292
5685 -39292 -35530 -38464 -9594 2045 6328 10793 -886 -5669 136 -5829 2861 3341 -10210 -20355
5671 -20355 -14090 -7433 -4667 -169 -5108 -8155 1910 -928 16853 40048 38662 36731 18226 6498
5657 6498 -10620 -11546 -7661 -11174 2101 -17126 -35748 -35584 -31461 -35378 -46797 -27693 -5361 13993
5643 13993 6328 8965 48509 42642 28670 16080 -7377 -21382 -7883 8674 1456 -10346 -24389
5630 -24389 -21704 -19234 -41759 -23778 5451 20679 10958 -1070 1571 -5484 -3950 -17552 -11415
5617 -11415 5091 2290 -8570 -32709 -15433 2058 30590 11700 4974 -1944 12077 -761
$$ packed form
5710b1534k0442J7701K6647m619j3822k6645J1541K847k1409n354K0546J1148
5698b3395K1538J4477m180r467k0714j0330m90j6486j9932J5593o113K592J7615
5685c9292L762k934K8870J1639M283M465j1679m783N805n965Q690M80j3551j0145
5671b0355O265O657K766M498m939l047J0065k838J7781K3195j386j931j8505j1728
5657F498j7118r26L885l513J3275j9227j8622J64M123l917j1419J9104K2332J9354
5643A3993p665K637L9544n867j3972j2590k3457j4005J3499J6557p218j1802j4043
5630b4389K685K470k2525J7981K9229J5228r721j2028K641p055J534j3602O137
5617a1415J6506k801j0860k4139J7276J7491K8532j8890o726o918J4021j2838
$$ plain form
5605 -761 -11735 5191 -7883 -27551 -15544 -10271 -15989 -21809 -29854 -48518 -57353 -32903 -10130
5592 -10130 3639 255 -6781 -11146 -4702 -27464 -32495 -16794 -15704 -10663 -16261 -13330 8439 -5045
5578 -5045 3863 4673 7110 24933 16302 14352 -17931 -25861 -37134 -36348 -48586 -35327 -26634 -15358
5564 -15358 -6037 -14169 -9942 -4886 3241 30104 31707 27392 41037 24569 16503 21491 -4186 -30216
5550 -30216 -36531 -25162 -15025 -22624 -36093 -25328 -19401 -11220 -4020 9359 -870 -6839 -13320
5537 -13320 -10151 4194 5558 -12290 -12822 -9346 5899 15016 -2740 -23204 -14275 -10562 -1155 13767
5523 13767 19549 19675 14969 7188 -16935 -10149 -15058 -28054 -20395 -31338 -48918 -42464 -5562 18280
5509 18280 19226 5310 3467 14424 -367 5004 24502 34202 -282 9478 -996 -11307 -10109
$$ packed form
5605g61j0974J6926j3074j9668J2007N273n718n820q045j8664q835K4450K2773
5592a0130J3769l384p036m365O444k2762n031J5701J090N041n598K931K1769j3484
5578e045Q908Q10K437J7823q631j950l2283p930j1273P86j2238J3259Q693J1276
5564a5358R321q132M227N056Q127K6863J603m315J3645j6468q066M988k5677k6030
5550c0216o315J1369J0137p599j3469J0765N927Q181P200J3379j0229n969o481
5537a3320L169J4345J364j7848n32L476J5245R117j7756k0464Q929L713R407J4922
5523A3767N782J26m706p781k4123O786m909j2996P659j0943j7580O454L6902K3842
5509A8280R46j3916j843J0957j4791N371J9498R700l4484R760j0474j0311J198
$$ plain form
5496 -10109 2487 13592 -20713 -26632 -26508 -40062 -47305 -25125 -26865 -16298 998 -417 -18803
5483 -18803 -36167 -14418 10268 19780 10254 2105 -230 3748 9212 15661 32869 18750 6069
5470 6069 3941 -24629 -33456 -46431 -58285 -39904 -16211 244 5843 1714 7177 12090 1439
5457 1439 -8153 -24083 -16183 -14529 -7183 1154 21656 3715 -1496 22952 16796 -747 -17772
5444 -17772 -14388 -14124 -20681 -921 -8131 -29652 -32823 -29580 -8220 -2641 5715 29721 19614 20306
5430 20306 26441 26718 9034 -5002 971 17049 28848 13893 -16947 -40295 -15920 4115 1495
5417 1495 6291 7129 632 -8716 -18188 -51937 -57763 -52316 -38767 -23133 -12137 -17064 -17669 -20039
5403 -20039 -23608 -38249 -49479 -48801 -41716 -41749 -13515 3086 1448 11700 8434 6144 11314 9901
$$ packed form
5496a0109J2596J1105l4305n919J24j3554p243K2180j740J0567J7296j415j8386
5483a8803j7364K1749K4686R512r526q149k335L978N464O449J7208j4119j2681
5470F069k128k8570q827j2975j1854J8381K3693J6455N599m129N463M913j0651
5457A439r592j5930P900J654P346Q337K0502j7941n211K4448o156j7543j7025
5444a7772L384K64o557J9760p210k1521l171L243K1360N579Q356K4006j0107O92
5430B0306O135K77j7684j4036N973J6078J1799j4955l0840k3348K4375K0035k620
5417A495M796Q38o497r348r472l3749n826N447J3549J5634J0996m927o05k370
5403b0039l569j4641j1230O78P085l3K8234J6601j638J0252l266k290N170j413
$$ plain form
5389 9901 16762 -1867 -7598 -5713 -2141 11821 4952 6055 330 -12104 -15384 -8198 -8189 2440 14161
5374 14161 8416 2003 -16994 -25788 -30689 -30136 -44072 -34713 -9960 -859 -16668 -25821 -29723 -15031
5360 -15031 -10537 -36529 -36394 -15009 -30930 -62782 -62587 -74630 -65130 -48686 -42388 -33229 -3380
5347 -3380 -13189 -1928 7364 1673 10657 -5494 -8475 25344 17162 20056 15893 9630 -477 -13600
5333 -13600 -16586 -13045 -151 -30301 -49097 -41628 -44779 -37436 -20457 -12308 -17265 -20804 -9598
5320 -9598 -7398 -13975 2860 19655 41986 43269 36181 19570 -952 -20500 -23005 -26419 -13896
5307 -13896 14481 2384 1699 -11747 20607 41042 26459 14526 29106 58297 59930 46142
5295 46142 31296 28865 5904 580 19601 37164 27130 9333 27895 26895 27009 8410 -5137
$$ packed form
5389I901O861j8629n731J885L572J3962o869J103n725j2434l280P186RJ0629J1721
5374A4161n745o413j8997q794m901N53j3936R359K4753R101j5809r153l902J4692
5360a5031M494k5992J35K1385j5921l1852J95j2043R500J6444O298R159K9849
5347c380r809J1261R292n691Q984j6151k981L3819q182K894m163o263j0107j3123
5333a3600k986L541J2894l0150j8796P469l151P343J6979Q149m957l539J1206
5320i598K200o577J6835J6795K2331J283p088j6611k0522j9548k505l414J2523
5307a3896K8377j2097o85j3446L2354K0435j4583j1933J4580K9191J633j3788
5295D6142j4846k431k2961n324J9021J7563j0034j7797J8562j000J14j8599j3547
$$ plain form
5282 -5137 -9452 -10178 -16190 -14641 -22683 5458 12189 -1545 -1709 -14350 -21515 -55058 -51475 -55960
5268 -55960 -26459 4428 -12322 -21244 -25253 -5653 -21536 -21610 -18218 -36771 -43687 -28736 -25055
5255 -25055 -6352 4250 2266 7858 -17489 -35867 -13879 13156 24080 16337 23565 11368 -12987
5242 -12987 -16107 5003 1845 -8318 -11726 17936 18211 10720 1649 -15432 -26121 -20407 -5409
5229 -5409 -904 17340 22762 25009 11826 18715 -5255 -24593 -14529 -5421 -15228 -29628 -26221
5216 -26221 -15370 -2194 -14145 -20722 -4580 480 -9021 1623 9915 7974 -19537 -27083 -7961
5203 -7961 -1101 5683 22883 25371 13334 17951 31965 53715 43995 36773 20352 1506 5284
5190 5284 4725 -1386 858 -30637 -22310 -7840 3698 -4417 -10790 -11184 -23096 -27939 -17642 14253
$$ packed form
5282e137m315p26o012J549q042K8141O731j3734j64j2641p165l3543L583m485
5268e5960K9501L0887j6750q922m009J9600j5883p4L392j8553o916J4951L681
5255b5055J8703J0602j984N592k5347j8378K1988K7035J0924p743P228j2197k4355
5242a2987l120K1110l158j0163l408K9662K75p491r071j7081j0689N714J4998
5229e409M505J8244N422K247j3183O889k3970j9338J0064R108r807j4400L407
5216b6221J0851J3176j1951o577J6142N060r501J0644Q292j941k7511p546J9122
5203g961O860O784J7200K488j2037M617J4014K1750r720p222j6421j8846L778
5190E284n59o111K244l1495Q327J4470J1538q115o373l94j1912m843J0297L1895
$$ plain form
5176 14253 52249 36117 32282 29645 10143 9319 -5346 -12461 -11901 8141 28269 17157 -16890
5163 -16890 -22858 -25022 -17672 -19774 -12162 4475 -5857 -21866 -33246 -41095 -41316 -34639 -10772 5471
5149 5471 5435 -875 -3085 -5604 -1367 -3090 -12328 -23866 10800 27350 48542 37430 16710 10243
5135 10243 -4497 -15802 -1919 4675 14544 -993 -2102 5011 -11596 -20558 -1510 34362 32443
5122 32443 24283 21507 -4405 -4012 -9791 -3681 -8992 -16830 -15418 -24448 -26637 -13447 -24656 -12186
5108 -12186 -19517 -41920 -37416 -25392 2242 -206 -5733 -780 -25754 -24270 -10703 -25736 -22642
5095 -22642 8307 -806 -9010 3241 4052 -11042 -29742 -24416 -19348 -25981 4085 8490 4743 -2817
5081 -2817 -32621 -25803 -35493 -42366 -53407 -46161 -31428 -18681 -773 -15674 -3842 2917 2716
$$ packed form
5176A4253L7996j6132l835k637j9502q24j4665p115N60K0042K0128j1112l4047
5163a6890n968k164P350k102P612J6637j0332j6009j1380p849k21O677K3867J6243
5149E471l6o310k210k519M237j723r238j1538L4666J6550K1192j1112k0720o467
5135A0243j4740j1305J3883O594R869j5537j109P113j6607q962J9048L5872j919
5122C2443q160k776k5912L93n779O110n311p838J412r030k189J3190j1209J2470
5108a2186p331k2403M504J2024K7634k448n527M953k4974J484J3567j5033L094
5095b2642L0949r113q204J2251Q11j5094j8700N326N068o633L0066M405l747p560
5081b817k9804O818r690o873j1041P246J4733J2747J7908j4901J1832O759k01
$$ plain form
5068 2716 16665 22084 22175 10389 22383 19927 4786 -11256 -9823 4082 1461 -6940 -16699 -35629
5054 -35629 -21997 -32533 -40330 -7040 3269 3467 8455 16377 -967 -17291 -51044 -74422 -89625
5041 -89625 -61894 -40789 -25050 -15248 -14145 -9015 -20614 -8377 14792 13097 -2825 -15243 -31168
5028 -31168 -34039 -49366 -51261 -50726 -32513 -9625 8511 1898 -8874 -23847 -8033 -6142 -17537
5015 -17537 -11091 -10011 3315 6963 -5749 -24571 -28355 -31888 -25151 -16850 13178 12969 -2033 5044
5001 5044 -619 -6096 -29470 -53178 -75364 -48371 -4783 12091 19041 8899 -4328 17246 45540
4988 45540 38259 30789 32774 36814 33694 23391 15053 17291 -1300 -10848 -4596 13081 4815 -12437
4974 -12437 -8591 1931 -24803 -23820 -12278 -3540 -20946 -30038 -5667 8041 5899 1949 -12352
$$ packed form
5068B716J3949N419R1j1786J1994k456j5141j6042J433J3905k621q401r759j8930
5054c5629J3632j0536p797L3290J0309J98M988P922j7344j6324l3753k3378j5203
5041h9625K7731K1105J5739R802J103N130j1599J2237K3169j695j5922j2418j5925
5028c1168k871j5327j895N35J8213K2888J8136o613j0772j4973J5814J891j1395
5015a7537O446J080J3326L648j2712j8822l784l533O737Q301L0028k09j5002P077
5001E044n663n477k3374k3708k2186K6993M3588J6874O950j0142j3227K1574K8294
4988D5540p281p470J985M040l120j0303q338K238j8591r548O252J7677q266j7252
4974a2437L846J0522k6734R83J1542Q738j7406r092K4371J3708k142l950j4301
$$ plain form
4961 -12352 -21246 -13205 -1728 -20408 -29410 -30587 -19160 -11547 -11786 -2298 -10684 -1434 21133 18421
4947 18421 16427 -4377 -13279 -5986 -7899 -18774 -23257 -14728 -5203 1697 -4972 -4935 -5890 7890 6519
4932 6519 -3557 -10469 -19306 -23996 2087 4100 -5399 -4555 -4801 -3698 3841 9620 17605 13771 -7525
4917 -7525 -5982 -5558 1818 -22683 -40652 -19381 2360 7472 18898 29528 23412 23432 5165 3110
4903 3110 21304 36277 14903 2674 5124 24412 14401 12445 14681 9165 -2301 -347 -10355
4890 -10355 -7069 11867 -760 5464 -453 799 11357 17502 4359 16619 19456 25191 20428
4877 20428 19148 10681 -2383 -5148 -2162 13274 22091 38543 24620 -6410 2951 14134 11625
4864 11625 14377 6671 8193 -12830 -23748 -21133 -21259 -23798 -34692 -36476 -33095 -37400 -34598 -32014
$$ packed form
4961a2352q894Q041J1477j8680r002j177J1427P613k39R488q386R250K2567k712
4947A8421j994k0804q902P293j913j0875m483Q529R525O900o669L7r55J3780j371
4932F519j0076o912q837m690K6083K013r499Q44k46J103P539N779P985l834k1296
4917g525J543M24P376k4501j7969K1271K1741N112J1426J0630o116K0j8267k055
4903C110J8194J4973k1374j2229K450J9288j0011j956K236n516j1466J954j0008
4890a0355L286J8936j2627O224n917J252J0558O145j3143J2260K837N735m763
4877B0428j280q467j3064k765K986J5436Q817J6452j3923l1030R361J1183k509
4864A1625K752p706J522k1023j0918K615j26k539j0894j784L381m305K802K584
$$ plain form
4850 -32014 -50120 -38291 2677 27516 24432 -618 -22774 -5244 39694 46041 40398 14360
4838 14360 -6607 -9263 3588 25227 17921 4370 -7308 -2463 6293 572 -8468 -11859 -2645
4825 -2645 -12883 -4363 -2121 -17645 -8379 -3941 16466 24135 44639 32744 18462 31135 546
4812 546 -30196 -37081 -29657 -19680 15930 20629 19483 -5850 22241 38683 17726 -5510 9273
4799 9273 25801 11673 9507 24646 37206 18511 12444 -5403 3790 30828 21096 6244 -8720
4786 -8720 -3189 -5771 -11992 -13670 -9966 -24328 -2892 -2759 6268 4430 -36089 -14356 18726 20723
4772 20723 25643 20322 6950 -4708 -9008 -9347 -5729 -11 -12192 -6468 -894 18033 30187 9213
4758 9213 6044 21278 13642 15938 14731 17525 2037 -7399 -4427 1436 11101 30475 16705 -26531
$$ packed form
4850c2014j8106J1829M0968K4839l084k5050k2156J7530M4938O347n643k6038
4838A4360k0967k656J2851K1639p306j3551j1678M845Q756n721r040l391R214
4825b645j0238Q520K242j5524R266M438K0407P669K0504j1895j4282J2673l0589
4812E46l0742o885P424R977L5610M699j146k5333K8091J6442k0957k3236J4783
4799I273J6528j4128k166J5139J2560j8695o067j7847R193K7038r732j4852j4964
4786h720N531k582o221j678L704j4362K1436J33R027j838m0519K1733L3082J997
4772B0723M920n321j3372j1658m300l39L618N718j2181N724N574J8927J2154k0974
4758I213l169J5234p636K296j207K794j5488r436K972N863R665J9374j3770m3236
$$ plain form
4744 -26531 -47388 -41791 -18107 -10760 51 2935 -9291 -24169 -29643 -32275 -27908 -35167 -22834
4731 -22834 -54865 -51513 -28593 -15036 -8158 12995 4419 -14220 -20719 4012 -7042 -11667 -23214
4718 -23214 -7250 39 -12513 -48571 -74400 -42945 9949 22542 34045 5105 -10736 3490
4706 3490 2846 -11667 -20598 -12169 -14286 -20754 -16153 -33206 -16807 -151 72 -22639 -28584 2
4692 2 15710 12896 -13750 -38548 -43396 -41915 -36267 -28736 -18347 -24054 -20481 -21684 -2239 -792
4678 -792 -3389 -1297 2037 -2115 30409 33455 10314 -10893 -15811 -22563 -34634 -31876 -28322 -7001
4664 -7001 14893 15582 11690 -6027 -25543 -33890 -33887 -11982 -18799 -32199 -25991 -11351 23307 37196
4650 37196 7323 7449 -7331 421 -2942 13092 35690 52025 33127 -2813 -34264 -53776 -47803
$$ packed form
4744b6531k0857N597K3684P347J0811K884j2226j4878n474k632M367p259J2333
4731b2834l2031L352K2920J3557O878K1153q576j8639o499K4731j1054m625j1547
4718b3214J5964P289j2552l6058k5829L1455N2894J2593J1503k8940j5841J4226
4706C490o44j4513q931Q429k117o468M601j7053J6399J6656K23k2711n945K8586
4692BJ5708k814k6646k4798m848J481N648P531J0389n707L573j203J9445J447
4678g92k597K092L334m152L2524L046k3141k1207m918o752j2071K758L554K1321
4664g001K1894O89l892j7717j9516q347LK1905o817j3400O208J4640L4658J3889
4650C7196k9873J26j4780P752l363J6034K2598J6335j8898l5940l1451j9512N973
$$ plain form
4637 -47803 -37055 -37198 -28594 -19033 6285 27408 25459 12629 29756 15917 18769 4126 -5631
4624 -5631 -19144 -46497 -41429 -18698 -27096 -38755 -18791 -22317 -31127 -26475 -31032 -23303 -33794
4611 -33794 -22860 -7389 5973 3611 6778 5930 -4423 -18541 -13595 -18910 -13706 -7523 -394 7724
4597 7724 23077 18025 25076 42446 30848 33139 33988 35831 30222 7339 7422 9663 -15359 -6326
4583 -6326 -24697 -38563 -37217 -33890 -21850 1341 21664 40053 41635 -854 -7579 828 -4848
4570 -4848 13326 28230 44115 37481 26107 32288 48711 25462 15530 27127 14770 -8641 -12430
4557 -12430 1945 -3060 626 10229 18072 14037 22 -19481 -34318 -19518 1836 5306 20493
4544 20493 40393 33985 31955 22950 34012 37608 2366 -8509 -19666 -3956 -9751 -22076 -2963
$$ packed form
4637d7803J0748j43Q604R561K5318K1123j949j2830J7127j3839K852j4643r757
4624e631j3513k7353N068K2731q398j1659J9964l526q810M652m557P729j0491
4611c3794J0934J5471J3362k362L167q48j0353j4118M946n315N204O183P129Q118
4597G724J5353n052P051J7370j1598K291Q49J843n609k2883Q3K241k5022R033
4583f326j8371j3866J346L327J2040K3191K0323J8389J582m2489o725Q407n676
4570d848J8174J4904J5885o634j1374O181J6423k3249r932J1597j2357k3411l789
4557a2430J4375n005L686R603P843m035j4015j9503j4837J4800K1354L470J5187
4544B0493J9900o408k030r005J1062L596l5242j0875j1157J5710n795j2325J9113
$$ plain form
4531 -2963 10028 1824 13158 11588 10447 7000 -8449 -9502 11030 19064 28758 7394 9258 -7413
4517 -7413 -16697 -4009 -9951 -11743 24238 33080 18358 41297 29111 29369 28984 11768 -2479 -15841
4503 -15841 -22236 -19869 -29105 -41068 -14556 1074 5040 -7255 -18830 -31384 -16817 8112 11553
4490 11553 11092 9891 12570 32239 26117 -2639 2636 7978 -2023 -9679 -15750 -22954 -11237 10276
4476 10276 3705 -6774 -13357 12285 30635 34319 42254 29991 37340 43198 10147 14358 28781
4463 28781 40698 23249 -21401 -52682 -31855 1366 23486 19752 -16 -15796 -6087 30297
4451 30297 32463 19923 22441 -879 7771 6721 -15508 -19205 -18244 10421 9362 -4139 9767
4438 9767 28587 8921 -10537 -6360 -12446 -17505 -3716 9580 -2624 -7126 -26115 -48426 -53983
$$ packed form
4531b963J2991q204J1334j570j141l447j5449j053K0532Q034R694k1364J864j6671
4517g413r284J2688n942j792L5981Q842j4722K2939j2186K58l85j7216j4247j3362
4503a5841o395K367r236j1963K6512J5630L966j2295j1575j2554J4567K4929L441
4490A1553m61j201K679J9669o122k8756N275N342j0001p656o071p204J1717K1513
4476A0276o571j0479o583K5642J8350L684P935j2263P349N858l3051M211J4423
4463B8781J1917j7449m4650l1281K0827L3221K2120l734j9768j5780R709L6384
4451C0297K166j2540K518k3320Q650j050k2229l697R61K8665j059j3501J3906
4438I767J8820j9666j9458M177o086n059J3789J3296j2204m502j8989k2311n557
$$ plain form
4425 -53983 -72261 -83210 -44853 -2821 1015 -15206 -22355 -19378 2125 19312 31238 27625 10866
4412 10866 34607 55933 38921 5554 17917 36779 46074 23268 -971 -17276 -20669 20741
4400 20741 42829 13756 18804 13609 11533 27776 11346 -9603 -20652 -50842 -55248 -22069 1110
4387 1110 4366 5301 -4536 -151 2171 5173 8881 29345 23511 -9878 -5151 20635 33109 31692
4373 31692 26235 17274 12982 16341 5400 -15130 -15294 624 12096 21099 35907 31983 2859
4360 2859 -20539 -26484 1962 41850 38215 40592 51438 58446 55741 55381 48017 3894 -13561 -15278
4346 -15278 -31511 -45277 -29281 -1277 21002 13788 20838 5539 -16821 -21170 -12915 -25396 -13852
4333 -13852 -5042 -5056 -9614 9049 39642 43584 49742 44804 31789 14766 -34255 -44115 -19540 -2556
$$ packed form
4425e3983j8278j0949L8357M2032L836j6221p149K977K1503J7187J1926l613j6759
4412A0866K3741K1326j7012l3367J2363J8862R295k2806k4239j6305l393M1410
4400B0741K2088k9073N048n195k076J6243j6430k0949j1049l0190m406L3179K3179
4387A110L256R35r837M385K322L002L708K0464n834l3389M727K5786J2474j417
4373C1692n457q961m292L359j0941k0530j64J5918J1472R003J4808l924k9124
4360B859k3398n945K8446L9888l635K377J0846P008k705l60p364m4123j7455j717
4346a5278j6233j3766J5996K8004K2279p214P050j5299k2360m349Q255j2481J1544
4333a3852Q810j4m558J8663L0593L942O158m938j3015j7023m9021r860K4575J6984
$$ plain form
4319 -2556 1451 -3585 -2680 6700 33647 28203 16288 6603 24743 29573 30148 30657 34580 38576 63317
4304 63317 62013 38736 24909 19587 12704 -22980 -34982 -5926 3511 -350 -5169 -3423 1168
4291 1168 20272 10825 -1788 -6387 -2647 -16044 -26523 -16545 -13747 -12681 -5501 3554 447 2579
4277 2579 -18170 -33215 -766 10929 31464 42313 50328 35769 31218 3758 -22962 -30755 -9694
4264 -9694 -9224 -21829 -31061 -20569 -7647 -12766 -10109 9850 49670 70346 38663 7497 -11391
4251 -11391 12560 29173 38417 39739 37366 11699 38185 31359 -916 -13540 -15185 4433 -8935
4238 -8935 17841 10583 24051 8144 -13214 6533 27506 18193 2785 13441 19016 37791 32677
4225 32677 9893 9782 29962 44720 40047 40115 30777 23165 14476 5375 27902 22358 2965 -1093
$$ packed form
4319b556M007n036R05R380K6947n444j1915r685J8140M830N75N09L923L996K4741
4304F3317j304k3277j3827n322o883l5684j2002K9056R437l861m819J746M591
4291A168J9104r447j2613m599L740j3397j0479R978K798J066P180R055l107K132
4277B579k0749j5045L2449J1695K0535J0849Q015j4559m551k7460k6720p793K1061
4264i694M70j2605r232J0492J2922n119K657J9959L9820K0676l1683l1166j8888
4251a1391K3951J6613R244J322k373k5667K6486o826l2275j2624j645J9618j3368
4238h935K6776p258J3468j5907k1358J9747K0973r313j5408J0656N575J8775n114
4225C2677k2784j11K0180J4758m673O8r338p612q689r101K2527n544j9393m058
$$ plain form
4211 -1093 -293 -12374 -7812 11980 16528 16077 10924 26265 31902 -21310 -33430 -14666 -11836 -17987
4197 -17987 -24261 -11729 17909 35067 28148 14175 7155 11450 14035 14507 30606 20346 -18471
4184 -18471 -44182 -54331 -27701 -18321 -27976 -23385 -18046 8002 20681 11789 12233 22244 27854
4171 27854 26199 -4081 -11340 -15927 -4943 9509 45606 58979 36518 18967 2390 -22480
4159 -22480 -42575 -57871 -21218 -12723 -8902 1186 12289 3231 -10687 -11772 -14255 -55423 -39349
4146 -39349 -3170 -6557 -5542 -5723 1254 -3554 -16432 -12459 722 3085 16585 55924 91346
4133 91346 46700 -12304 -39208 -53048 -18799 -9083 -37320 -43848 -30705 -39886 -42744 -15996 5737
4120 5737 2831 -5384 -15791 -30763 -36712 -56689 -30461 -24658 -53359 -55096 -23703 -526 18661
$$ packed form
4211a093Q00j2081M562J9792M548m51n153J5341N637n3212j2120J8764K830o151
4197a7987o274J2532K9638J7158o919j3973p020M295K585M72J6099j0260l8817
4184a8471k5711j0149K6630R380r655M591N339K6048J2679q892M44J0011N610
4171B7854j655l0280p259m587J0984J4452L6097J3373k2461j7551j6577k4870
4159b2480k0095j5296L6653Q495L821J0088J1103r058j3918j085k483m1168J6074
4146c9349L6179l387J015j81O977m808j2878L973J3181K363J3500L9339L5422
4133I1346m4646n9004k6904j3840L4249R716k8237o528J3143r181k858K6748K1733
4120E737k906q215j0407j4972n949j9977K6228N803k8701j737L1393K3177J9187
$$ plain form
4107 18661 27984 20439 22310 34044 29848 24343 15895 -10813 -23460 -19837 10195 11747 -9663
4094 -9663 -16229 -22191 1658 32751 46951 46403 8450 -12517 -22753 -40169 -46183 -30606 -32891
4081 -32891 -39154 -46359 -52387 -35140 5123 17322 5672 8520 13341 -3831 -14187 -11099 -16542
4068 -16542 -23010 -12183 -7333 -10715 -10531 -10680 -17813 848 18947 -15683 -19048 -26206 -19736 18478
4054 18478 20114 6494 -26002 -52116 -35162 -40649 -53902 -54925 -28079 13663 28613 31330 27491
4041 27491 34230 35626 25942 17416 14090 8760 -21729 -5919 -13602 -30179 1366 5678 -5 7635
4027 7635 13107 17034 23294 17775 -4306 -3858 -1644 10812 -10456 -9252 -1848 -15438 -17890 -14667
4013 -14667 -7814 -11544 6139 14434 -3011 -17990 -19668 -27027 -27729 -28060 -19882 -22058 -28037 -18008
$$ packed form
4107A8661R323p545J871J1734m196n505q448k6708j2647L623L0032J552k1410
4094i663o566n962K3849L1093J4200n48l7953k0967j0236j7416o014J5577k285
4081c2891o263p205o028J7247M0263J2199j1650K848M821j7172j0356L088n443
4068a6542o468J0827M850l382J84j49p133J8661J8099l4630l365p158O470L8214
4054A8478J636j3620l2496k6114J6954n487j3253j023K6846M1742J4950K717l839
4041B7491O739J396r684q526l326n330l0489J5810p683j6577L1545M312n683P640
4027G635N472L927O260n519k2081M48K214J2456k1268J204P404j3590k452L223
4013a4667O853l730J7683Q295j7445j4979j678p359p02l31Q178k176n979J0029
$$ plain form
3999 -18008 -1583 17402 44578 41559 25856 -3785 -26953 -9860 -8438 -17863 -41317 -24248
3987 -24248 -9668 -5258 7396 11328 4139 10757 19432 26842 33037 34164 23305 27765 33270 12653
3973 12653 -7740 -7260 -3939 -6109 -16090 -6441 7253 19644 33204 40084 31853 18515 3989
3960 3989 -20596 -16521 6203 -3564 -34748 -33454 -14967 -67 4736 -18754 -61263 -61804 -47345
3947 -47345 -34099 -23925 -19754 -50641 -28581 -9700 -5901 -10504 -28889 -41092 -31543 -22956 -17079
3934 -17079 12638 -6927 -30273 -13141 -14741 -14285 -18203 -3580 -11998 -14959 -19066 -21161 -26855 -25441
3920 -25441 529 3839 3043 -4850 2799 24425 32596 23341 15380 27621 26365 9869 3092 20038
3906 20038 20835 28150 14313 -22097 -26769 4357 4482 -268 19131 24077 -3491 -24383 -34255 9347
$$ packed form
3999a8008J6425J8985K7176l019j5703k9641k3168J7093J422r425k3454J7069
3987b4248J4580M410J2654L932p189O618Q675P410O195J127j0859M460N505k0617
3973A2653k0393M80L321k170r981R649J3694J2391J3560O880q231j3338j4526
3960C989k4585M075K2724r767l1184J294J8487J4900M803k3490m2509n41J4459
3947d7345J3246J0174M171l0887K2060J8881L799m603j8385j2203R549Q587N877
3934a7079K9717j9565k3346J7132j600M56l918J4623q418k961m107k095n694J414
3920b5441K5970L310p96p893P649K1626Q171r255p961J2241j256j6496o777J6946
3906B0038P97P315j3837l6410m672L1126J25m750J9399M946k7568k0892r872M3602
$$ plain form
3892 9347 13707 -2700 -19230 -41158 -31995 -12664 7937 -9385 -4909 16652 -3810 -31306 -24502
3879 -24502 -7980 -942 11262 12084 18655 6032 9102 16911 6128 -17375 -33183 -39865 -57778
3866 -57778 -48659 -27516 -1930 11295 27972 29094 43560 28508 10684 10648 9367 24576 10032
3853 10032 -28347 -13080 -226 -15073 -3235 8567 19194 46083 50139 23129 16159 12791
3841 12791 9593 -9745 -12408 -18810 5904 38131 41105 23167 21779 33602 382 -5858 4372
3828 4372 6506 -4998 -477 -7918 2289 9363 -3115 -10342 -24507 -37936 -5639 4382 9221
3815 9221 12942 2389 -14624 -9286 -21934 -37318 -33303 -32557 -33168 -30259 -23171 -17361 -9093 -4859
3801 -4859 4299 14316 17755 14388 22446 1570 -3802 -16198 -4461 -772 -5160 19713 32601
$$ packed form
3892I347M360j6407j6530k1928R163J9331K0601j7322M476K1561k0462k7496O804
3879b4502J6522P038J2204Q22O571j2623L070P809j0783k3503j5808o682j7913
3866e7778R119K1143K5586J3225J6677J122J4466j5052j7824l6j281J5209j4544
3853A0032l8379J5267J2854j4847J1838J1802J0627K6889M056k7010o970l368
3841A2791l198j9338k663o402K4714L2227K974j7938j388J1823l3220o240J0230
3828D372K134j1504M521p441J0207P074j2478p227j4165j3429L2297J0021M839
3815I221L721j0553j7013N338j2648j5384M015P46o11K909P088N810Q268M234
3801d859R158J0017L439l367Q058k0876n372j2396J1737L689m388K4873J2888
$$ plain form
3788 32601 13853 9221 12473 21258 18555 -415 -24968 -19221 -9057 -345 -9463 -12096 -1029
3775 -1029 10962 8416 19858 8065 18115 9713 6535 -5155 1211 9344 15103 30709 53028
3762 53028 54888 42968 17219 28918 22829 -20180 -30922 -44458 -36999 -42457 -39639 -33496 -28635
3749 -28635 -21463 6350 -12981 -16130 -22191 -20384 -24161 -27075 -22206 -11488 -19303 -22223 12758 29079
3735 29079 32390 23734 33329 49962 39899 12589 -2861 18883 -6094 -26219 -31641 -34006 -20904
3722 -20904 -4572 10701 5236 -9597 -15109 -28121 -12176 12874 -2571 9362 27232 28921
3710 28921 34895 37507 14362 22710 3049 8511 -5279 -20229 -28842 -29440 -12483 -2117 -12043
3697 -12043 1584 8874 14044 39255 27717 -19936 -14409 7692 21038 45350 36388 4549 125
$$ packed form
3788C2601j8748m632L252Q785k703j8970k4553N747J0164Q712r118k633J1067
3775a029J1991k546J1442j1793J0050q402l178j1690O366Q133N759J5606K2319
3762E3028J860j1920k5749J1699o089m3009j0742j3536P459n458K818O143M861
3749b8635P172K7813j9331l149o061J807l777k914M869J0718p815k920L4981J6321
3735B9079L311q656R595J6633j0063k7310j5450K1744k4977k0125n422k365J3102
3722b0904J6332J5273n465j4833n512j3012J5945K5050j5445J1933J7870J689
3710B8921N974K612k3145Q348j9661N462j3790j4950q613n98J6957J0366r926
3697a2043J3627P290N170K5211j1538m7653N527K2101J3346K4312q962l1839m424
$$ plain form
3684 125 15798 8394 13837 13798 19818 16770 8464 -8926 -9083 -11414 -7855 -12430 -27540 -24586 -18539
3669 -18539 -26166 -29224 -12312 -3638 -16209 8945 28494 23253 -12559 4691 37997 42994 28236
3656 28236 -2030 -513 24260 14416 6426 -6995 -10773 18940 30858 30151 15605 10739 9062
3643 9062 11232 1412 -3778 2016 -16745 4275 13859 8497 10325 13869 34664 62439 49061 23344
3629 23344 11108 6766 2013 -160 21264 -7156 -19689 -23343 -31378 -17078 -2994 5290 4095
3616 4095 18439 31781 16499 -17947 -24326 4697 652 -31329 -49011 -57381 -68187 -22316 2460
3603 2460 21199 26382 -13450 -35994 -21868 -12963 -38521 -54570 -51161 -40506 -37415 -45055 -46147
3590 -46147 -15920 19041 17470 -12109 -39441 -24063 -19051 4553 -5670 -12702 -24017 -26005 -13648
$$ packed form
3684A25J5673p404N443l9O020l048q306j7390j57k331L559m575j5110K954O047
3669a8539p627l058J6912Q674j2571K5154J9549n241l5812J7250L3306M997j4758
3656B8236l0266J517K4773r844p990j3421l778K9713J1918p07j4546m866j677
3643I062K170r820n190N794j8761K1020R584n362J828L544K0795K7775j3378k5717
3629B3344j2236m342m753k173K1424k8420j2533l654q035J4300J4084Q284j195
3616D095J4344J3342j5282l4446o379K9023m045l1981j7682q370j0806M5871K4776
3603B460J8739N183l9832k2544J4126Q905k5558j6049L409J0655L091p640j092
3590d6147L0227L4961j571k9579k7332J5378N012K3604j0223p032j1315j988J2357
$$ plain form
3577 -13648 -12640 -26115 -25616 -21342 3899 9248 -15608 -17514 -1927 19178 24066 15049 -20835
3564 -20835 -21792 -41554 -33796 -27482 -24091 -26338 -42846 -45165 -26062 -5073 7859 6017 -9136
3551 -9136 -13921 -21949 -17586 1580 9759 37062 13448 -8752 -23376 -7077 13019 38787 36306
3538 36306 41001 16509 -20125 -35925 -32178 -31112 -21740 -1570 11422 12849 15219 -13551 -34691
3525 -34691 -38459 -4632 10147 22417 16154 12016 21864 17905 8959 -557 7590 23666 35405
3512 35405 11519 1169 14220 21429 3797 -126 -1546 -8586 -25489 -22442 -11302 7970 17005
3499 17005 29348 39289 30744 7908 -3689 3557 8015 5635 15761 -3528 -25622 -15836 -11049
3486 -11049 2003 24481 23937 7162 -7918 -11287 3090 16023 16875 551 -836 19133 21444
$$ packed form
3577a3648J008j3475M99M274K5241N349k4856j906J5587K1105M888r017l5884
3564b0835r57j9762P758O314L391k247j6508k319J9103K0989J2932j842j5153
3551i136m785q028M363J9166Q179K7303k3614k2200j4624J6299K0096K5768k481
3538C6306M695k4492l6634j5800L747J066R372K0170J2992J427K370k8770k1140
3525c4691l768L3827J4779J2270o263m138R848l959q946r516Q147J6076J1739
3512C5405k3886j0350J3051P209j7632l923j420p040j6903L047J1140J9272R035
3499A7005J2343R941q545k2836j1597P246M458k380J0126j9289k2094R786M787
3486a1049J3052K2478n44j6775j5080l369J4377J2933Q52j6324j387J9969K311
$$ plain form
3473 21444 15942 24371 28493 16577 5065 6345 881 -17755 -23491 -13306 -6858 -6925 -16007 -4128
3459 -4128 -15054 -17843 -2470 -267 5296 -8828 8836 27054 12773 23421 15139 -1370 26132
3446 26132 20194 26832 12285 -24597 -50221 -42171 -38109 -20270 -5802 -19183 -37592 -34808 1889
3433 1889 -7277 -2782 16644 14540 12068 -3892 -16346 -5309 -31141 -15265 -23487 -37546 3002
3420 3002 24485 25641 -15164 -21319 5712 -4573 -30058 -25117 -18835 -571 -19668 -23304 -31440
3407 -31440 -55154 -32151 -12226 -14837 -28067 -20678 15864 37005 37493 32813 23730 27267 19437
3394 19437 24986 5342 -8156 -9157 -1488 485 -1074 -7231 204 473 9090 -6307 6725 1155
3380 1155 13460 12463 -4341 5157 9165 2197 -9082 -11908 -36231 -43828 -30087 -4250 -16220
$$ packed form
3473B1444n502Q429M122j1916j1512J280n464j8636n736J0185O448o7r082J1879
3459d128j0926k789J5373K203N563j4124J7664J8218j4281J0648q282j6509K7502
3446B6132n938O638j4547l6882k5624Q050M062J7839J4468j3381j8409K784L6697
3433A889r166M495J9426k104k472j5960j2454J1037k5832J5876q222j4059M0548
3420C002K1483J156m0805o155K7031j0285k5485M941O282J8264j9097l636q136
3407c1440k3714K3003J9925k611j3230P389L6542K1141M88m680r083L537p830
3394A9437N549j9644j3498j001P669J973j559o157P435K69Q617j5397J3032n570
3380A155J2305r97j6804R498M008o968j1279k826k4323p597J3741K5837j1970
$$ plain form
3367 -16220 -14959 -26862 -25783 -4403 -8085 -25867 -34062 -32808 -20313 -12925 -16873 -10246 -17376 -44156
3353 -44156 -23957 -4715 7582 6432 -2205 -21906 -27177 4452 6597 -3490 -4163 11558 16102
3340 16102 14879 26253 20594 -14076 -23761 -18384 -15702 -14846 -25161 -18795 -7096 3290 -2266 -9011
3326 -9011 -14200 1588 -11044 -18566 -17936 4364 24779 26209 47123 27120 18984 2924 -29688
3313 -29688 -32156 -24623 -37873 -53822 -63690 -50145 -45233 -28644 9776 6467 -885 -2156 -10428
3300 -10428 -16008 -16371 14878 21402 2981 -9441 -10045 18755 26795 16608 -16533 -34601 -18013
3287 -18013 -5270 994 3893 -21469 -25943 -24433 -30368 -29691 -22185 -6496 -11510 -8109 -2796 18398
3273 18398 36833 27918 22802 6466 -9202 -582 13469 -8935 -21332 -12929 -7066 5234 2577
$$ packed form
3367a6220J261j1903J079K1380l682j7782q195J254J2495P388l948O627p130k6780
3353d4156K0199J9242J2297j150q637j9701n271L1629K145j0087o73J5721M544
3340A6102j223J1374n659l4670r685N377K682Q56j0315O366J1699J0386n556o745
3326i011n189J5788j2632p522O30K2300K0415J430K0914k0003q136j6060l2612
3313b9688k468P533j3250j5949r868J3545M912J6589L8420l309p352j271q272
3300a0428n580l63L1249O524j8421j2422o04K8800Q040j0187l3141j8068J6588
3287a8013J2743O264K899k5362m474J510n935O77P506J5689n014L401N313K1194
3273A8398J8435q915n116j6336j5668Q620J4051k2404j2397Q403N863J2300k657
$$ plain form
3260 2577 -15770 -21255 -5383 -17142 -26131 -7902 3970 -13649 -24075 -18500 -8130 -22606 -21728
3247 -21728 -25062 -10708 -10608 -12044 -11682 -33981 -39249 -37764 -30716 -7156 -11207 -25750 -35071 -11762
3233 -11762 15725 27528 43628 -3712 -38567 -45659 -21973 15284 26566 8245 -11639 -40104
3221 -40104 -30519 -30933 -38692 -29623 -30181 -33042 -5679 16459 13728 -106 -8388 2866 -1696 1614
3207 1614 4834 21137 21146 10030 14649 22942 27251 24842 13701 20224 19785 2724 -2420 3493 -3257
3192 -3257 -8660 -20681 7741 37536 34527 18045 5655 4164 10830 46713 39269 -412 -14746
3179 -14746 5911 19688 16415 619 -12903 -25620 -35921 -50039 -36084 -18542 -21716 -9545
3167 -9545 -17130 -22863 -40682 -39316 -16145 -11669 -6120 -25985 7573 7078 22619 19363 -13972 208
$$ packed form
3260B577j8347n485J5872j1759q989J8229J1872j7619j0426N575J0370j4476Q78
3247b1728l334J4354J00j436L62k2299n268J485P048K3560m051j4543r321K3309
3233a1762K7487J1803J6100m7340l4855p092K3686L7257J1282j8321j9884k8465
3221d0104R585m14p759R069n58k861K7363K2138k731j3834q282J1254m562L310
3207A614L220J6303Rj1116M619Q293M309k409j1141O523m39j7061n144N913o750
3192c257n403j2021K8422K9795l009j6482j2390j491O666L5883p444l9681j4334
3179a4746K0657J3777l273j5796j3522j2717j0301j4118J3955J7542l174J2171
3167i545p585n733j7819J366K3171M476N549j9865L3558m95J5541l256l3335J4180
$$ plain form
3153 208 12591 -829 -15579 -26409 -13132 -29074 -17341 -26841 -27023 -20266 -17956 -19687 -15744 -3935
3139 -3935 4171 897 31656 22135 6278 -6979 -16210 442 28234 32106 18538 5652 -3479
3126 -3479 2511 -5792 -15899 -11101 32398 22406 10030 174 -3980 16385 29786 15164 16158 8646
3112 8646 2065 -527 27198 52099 63963 41771 54807 36822 25363 21592 11179 13257 -18579
3099 -18579 -14445 -14285 -13355 4748 10180 799 -19336 -9514 6514 -3438 -10486 412 15535 -219
3085 -219 -25865 -20380 -23279 -17238 11877 25524 -2272 -26850 -21454 -11225 -24099 -27179 -33125
3072 -33125 -49486 -24966 7374 8238 -13484 -30654 -17528 -17093 -2067 1390 3536 -2791 5699
3059 5699 7155 16166 -5877 -25004 -63594 -75273 -52491 -19197 -6284 580 5008 -18008 -11747
$$ packed form
3153B08J2383j3420j4750j0830J3277j5942J1733r500j82O757K310j731L943J1809
3139c935Q106l274L0759r521j5857j3257r231J6652K7792L872j3568j2886r131
3126c479N990q303j0107M798M3499r992j2376r856m154K0365J3401j4622R94p512
3112H646o581k592K7725K4901J1864k2192J3036j7985j1459l771j0413K078l1836
3099a8579M134J60R30J8103N432r381k0135R822J6028r952p048J0898J5123j5754
3085b19k5646N485k899O041K9115J3647k7796k4578N396J0229j2874l080n946
3072c3125j6361K4520L2340Q64k1722j7170J3126M35J5026L457K146o327Q490
3059E699J456R011k2043j9127l8590j1679K2782L3294J2913O864M428k3016O261
$$ plain form
3046 -11747 -12514 -10084 4025 25997 21433 11987 2029 22629 33369 20356 21830 6420 -6310
3033 -6310 -11178 9 17249 -7477 -28026 4259 34552 34706 19779 4904 -11060 -6861 -8734
3020 -8734 -17506 -14767 -473 -6743 -6444 9446 5713 -2994 11594 22453 17244 10036 666 12021
3006 12021 26799 37294 14486 29291 22430 17455 30522 21093 7950 -9064 -19687 7396
2994 7396 58405 42726 28864 22751 21270 14995 1320 7062 5699 11923 16498 3035 -2138 -3157
2980 -3157 14449 1090 -34741 -61133 -44056 -28965 -17104 -8664 -8944 16765 9406 -2214 27740
2967 27740 31260 -7167 -24790 -8888 13025 31048 19976 3121 -1342 -9520 -1143 -3504 -8773
2954 -8773 -14891 -9047 -7080 10047 2900 -4348 -304 -6075 -17491 -18116 8958 18169 25177 19917
$$ packed form
3046a1747p67K430J4109K1972m564r446r958K0600J0740j3013J474j5410j2730
3033f310m868J1187J7240k4726k0549L2285L0293J54j4927j4875j5964M199j873
3020h734q772K739J4294o270K99J5890l733q707J4588J0859n209p208r370J1355
3006A2021J4778J0495k2808J4805o861m975J3067r429j3143j7014j0623K7083
2994G396N1009j5679j3862o113j481o275j3675N742j363O224M575j3463n173j019
2980c157J7606j3359l5831k6392J7077J5091J1861Q440k80K5709p359j1620K9954
2967B7740L520l8427j7623J5902K1913J8023j1072j6855m463q178Q377k361n269
2954h773o118N844J967J7127p147p248M044n771j1416o25K7074R211P008n260
$$ plain form
2940 19917 5983 -21199 -25002 2969 9757 -2776 2419 9099 22062 5068 591 -2126 -15336
2927 -15336 -8777 12565 2233 -13163 10399 33988 34380 22395 21498 -891 2289 6079 15455
2914 15455 14914 -6630 -27993 -5810 -17498 -27385 -11219 -11645 425 27861 35446 27289 7649
2901 7649 13617 16327 17462 25916 33173 38517 37449 25104 26493 7882 -16011 10697 22524 32892
2887 32892 11443 17662 16578 1067 172 11355 23647 11700 11560 8602 4833 -22995 -38484
2874 -38484 -29533 -11211 -1939 4118 14476 35133 53889 57240 37012 20832 4494 -5421 -4160
2861 -4160 759 -7952 -16247 -6844 3640 -14172 1057 7862 6366 -10013 -30771 -31946 -23485 -34629
2847 -34629 -42404 -35704 -22277 -34445 -46823 -23227 2554 14342 -4258 -15332 -10489 -2836 4990
$$ packed form
2940A9917j3934k7182l803K7971O788j2533N195O680J2963j6994m477k717j3210
2927a5336O559K1342j0332j5396K3562K3589L92j1985q97k2389L180L790R376
2914A5455n41k1544k1363K2183j1688r887J6166m26J2070K7436P585q157j9640
2901G649N968K710J135Q454P257N344j068j2345J389j8611k3893K6708J1827J0368
2887C2892k1449O219j084j5511q95J1183J2292j1947j40k958l769k7828j5489
2874c8484Q951J8322R272O057J0358K0657J8756L351k0228j6180j6338r915J261
2861d160M919q711q295R403J0484j7812J5229O805j496j6379k0758j175Q461j1144
2847c4629p775O700J3427j2168j2378K3596K5781J1788j8600j1074M843P653P826
$$ plain form
2834 4990 19491 -485 -9433 -11239 -387 -16273 -16340 -18977 15784 6212 9173 22173 39016 31203
2820 31203 40460 27185 32805 29974 8282 -13123 -18397 -12501 -11294 -10004 -8729 -23007 -29136 -11714
2806 -11714 -8678 -30402 -30140 -12557 1847 10039 8668 18333 16272 25491 28132 18771 19404 27015
2792 27015 37429 20184 15013 447 -23732 -36175 -30924 -9984 10151 7577 2149 2146 1648 -11620
2778 -11620 -16949 -15466 -16829 10613 24072 15596 4969 -23956 6298 27695 12964 9158 8721
2765 8721 -711 -2752 -6591 -970 1800 21673 16191 13513 6631 4938 -13997 -31448 -34913 -23606
2751 -23606 -7881 17764 18126 -8810 -23436 -22225 -18427 -26619 3363 -15351 -22822 2975 -6540
2738 -6540 -19591 1062 19942 1306 -3011 -6897 3343 1156 -21333 -32406 -25816 -22779 -19469
$$ packed form
2834D990J4501j9976q948j806J0852j5886o7k637L4761r572K961J3000J6843p813
2820C1203R257j3275N620k831k1692k1405n274N896J207J290J275j4278o129J7422
2806a1714L036k1724K62J7583J4404Q192j371R665k061R219K641r361O33P611
2792B7015J0414j7245n171j4566k4179j2443N251K0940K0135k574n428lm98j3268
2778a1620n329J483j363K7442J3459q476j0627k8925L0254K1397j4731l806m37
2765H721r432k041l839N621K770J9873n482k678o882j693j8935j7451l465J1307
2751b3606J5725K5645L62k6936j4626J211L798q192K9982j8714p471K5797r515
2738f540j3051K0653J8880j8636m317l886J0240k187k2489j1073O590L037L310
$$ plain form
2725 -19469 -1059 -17902 -22699 -16757 -26138 -30625 -26899 -9955 1460 -15108 -23571 -21111 -11692
2712 -11692 3298 -14374 -23354 -9985 -18738 5443 24440 13361 -788 372 -5153 -4350 -781
2699 -781 6313 1606 -11313 -6526 -9126 6130 12233 -20911 -6391 24340 10182 1073 11198
2686 11198 10846 28214 5895 -16307 -28714 -11573 -3817 14162 38140 43298 37368 28798 25919
2673 25919 10891 -4521 5452 3941 4929 -25682 -45221 -50421 -47674 -41988 -44209 -57017 -66035 -40572
2659 -40572 -42852 -42020 -31500 -29218 -29250 -8003 24131 26042 42096 40144 14808 13293 11467 4475
2645 4475 -8736 -11744 -23896 -9017 17369 13276 4098 1422 6220 32459 30154 11231 19940
2632 19940 13088 -6242 -3472 5018 10630 8160 -7327 5906 31209 25216 22400 17272 22137 17338
$$ packed form
2725a9469J8410j6843m797N942r381m487L726J6944J1415j6568q463K460R419
2712a1692J4990j7672q980J3369q753K4181J8997j1079j4149J160n525Q03L569
2699g81P094m707j2919M787k600J5256O103l3144J4520L0731j4158r109J0125
2686A1198l52J7368k2319k2202j2407J7141P756J7979K3978N158n930q570k879
2673B5919j5028j5412R973j511R88l0611j9539n200K747N686k221j2808r018K5463
2659d0572k280Q32J0520K282l2K1247L2134J911J6054j952k5336j515j826o992
2645D475j3211l008j2152J4879K6386m093r178k676M798K6239k305j8923Q709
2632A9940o852j9330K770Q490N612k470j5487J3233K5303n993k816n128M865m799
$$ plain form
2618 17338 27047 31129 23880 9998 -10532 -13591 -5838 -33828 -43859 -42085 -46707 -37052 -34101 -37981
2604 -37981 -37325 -23649 -13536 -3992 -3067 27848 21760 -20720 -36340 -35309 -11936 7839 9623
$$ packed form
2618A7338R709M082p249j3882k0530l059P753k7990j0031J774m622R655K951l880
2604c7981O56J3676J0113R544R25L0915o088m2480j5620J031K3373J9775J784
$$ [...]
##END NTUPLES=NMR SPECTRUM
##END=
