##TITLE=Analysis number 319133
Compound Code cc 40004
Project Code adrs
Chemist Name 2y chem
##JCAMPDX= 6.0         $$ Bruker NMR JCAMP-DX V2.0
##DATA TYPE= NMR SPECTRUM
##DATA CLASS= NTUPLES
##ORIGIN= Bruker BioSpin GmbH
##OWNER= nmr
$$ XWIN-NMR		Version 3.5
$$ Wed May  3 12:32:24 2006 GMT Daylight Time (UT+1h)  MAYBRIDGE\nmr@NMR_250MHZ
##.OBSERVE FREQUENCY= 250.131544655141
##.OBSERVE NUCLEUS= ^1H
##.ACQUISITION MODE= SIMULTANEOUS (DQD)
##.ACQUISITION SCHEME= undefined
##.AVERAGES= 16
##.DIGITISER RES= 18
##SPECTROMETER/DATA SYSTEM= dpx250
##.PULSE SEQUENCE= zg30
##.SOLVENT NAME= CDCl3
##.SHIFT REFERENCE= (INTERNAL, CDCl3, 0, 16.4569)
##AUDIT TRAIL= $$ (NUMBER, WHEN, WHO, WHERE, WHAT)
$$ ##TITLE= Audit trail, XWIN-NMR		Version 3.5
$$ ##JCAMPDX= 5.01
$$ ##ORIGIN= Bruker BioSpin GmbH
$$ ##OWNER= nmr
$$ C:\u/data/dgb/nmr/ADRS/3670/pdata/1/auditp.txt
$$ ##AUDIT TRAIL=  $$ (NUMBER, WHEN, WHO, WHERE, WHAT)
(   1,<2006-05-03 12:31:51.20 +100>,<MAYBRIDGE\nmr>,<NMR_250MHZ>,
      <created by zg, POWCHK disabled, PULCHK disabled
       configuration hash MD5:
       84 BC 41 DB A1 6E 1D 46 DA 25 12 A5 C1 ED C5 3A
       data hash MD5: 64K
       69 C2 80 2A 0C B3 0E 88 51 41 99 E2 AB 5B 06 4C>)
(   2,<2006-05-03 12:32:10.49 +100>,<MAYBRIDGE\nmr>,<NMR_250MHZ>,
      <Start of raw data processing
       ef LB = 0.3 FT_mod = 6 PKNL = 1 SI = 32K 
       data hash MD5: 32K
       9A 37 C5 25 3F 20 FE C6 62 DD AB 50 88 8A 9D F6>)
(   3,<2006-05-03 12:32:12.93 +100>,<MAYBRIDGE\nmr>,<NMR_250MHZ>,
      <apk 
       data hash MD5: 32K
       63 6A 7D 16 D4 2A AB 67 2A 64 70 C0 74 05 98 6D>)
(   4,<2006-05-03 12:32:17.32 +100>,<MAYBRIDGE\nmr>,<NMR_250MHZ>,
      <abs ABSG = 5 
       data hash MD5: 32K
       1E 33 59 9C 95 BD A0 E8 FC 8A 9D EF 33 AA CD 97>)
$$ ##END=
$$ 
$$ hash MD5
$$ 54 F0 EC 80 30 2A 47 2A 1B 0E FC 8E 2F C6 A6 E7
##$RELAX= 
##$RELAX= 
##$RELAX= 
##$RELAX= 
##$RELAX= 
##$RELAX= 
##$RELAX= 
$$ Bruker specific parameters
$$ --------------------------
##$DU= <C:\u>
##$EXPNO= 3670
##$NAME= <ADRS>
##$PROCNO= 1
##$TYPE= <nmr>
##$USER= <dgb>
##$AMP= (0..31)
100 100 100 100 100 100 100 100 100 100 100 100 100 100 100 100 100 100 
100 100 100 100 100 100 100 100 100 100 100 100 100 100 
##$AQSEQ= 0
##$AQ_mod= 3
##$AUNM= <au_zg>
##$AUTOPOS= <25 >
##$BF1= 250.13
##$BF2= 250.13
##$BF3= 250.13
##$BF4= 250.13
##$BF5= 500.13
##$BF6= 500.13
##$BF7= 500.13
##$BF8= 500.13
##$BYTORDA= 1
##$CFDGTYP= 0
##$CFRGTYP= 5
##$CHEMSTR= <none>
##$CNST= (0..31)
1 1 145 1 1 1 1 1 1 1 1 1 1 1 1 1 1 1 1 1 1 1 1 1 1 1 1 1 1 1 1 1 
##$CPDPRG= <>
##$CPDPRG1= <>
##$CPDPRG2= <>
##$CPDPRG3= <>
##$CPDPRG4= <mlev>
##$CPDPRG5= <mlev>
##$CPDPRG6= <mlev>
##$CPDPRG7= <mlev>
##$CPDPRG8= <mlev>
##$CPDPRGB= <>
##$CPDPRGT= <>
##$D= (0..31)
0 1 0 0 0 0 0 0 0 0.06 0 0 0 0 0 0 0.0002 0 0 0 0 0 0 0 0 0 0 0 0 0 0 
0 
##$DATE= 1146655909
##$DBL= (0..7)
120 120 120 120 120 120 120 120 
##$DBP= (0..7)
150 150 150 150 150 150 150 150 
##$DBP07= 0
##$DBPNAM0= <>
##$DBPNAM1= <>
##$DBPNAM2= <>
$$ [...]
##$SUBNAM7= <"">
##$SUBNAM8= <"">
##$SUBNAM9= <"">
##$SW= 20.6930455092707
##$SWIBOX= (0..15)
0 0 3 0 0 0 0 0 0 0 0 0 0 0 0 0 
##$SW_h= 5175.983436853
##$TD= 65536
##$TD0= 1
##$TE= 295.16
##$TE2= 300
##$TE3= 300
##$TEG= 300
##$TL= (0..7)
0 120 120 120 120 120 120 120 
##$TP= (0..7)
150 150 150 150 150 150 150 150 
##$TP07= 0
##$TPNAME0= <>
##$TPNAME1= <>
##$TPNAME2= <>
##$TPNAME3= <>
##$TPNAME4= <>
##$TPNAME5= <>
##$TPNAME6= <>
##$TPNAME7= <>
##$TPOAL= (0..7)
0.5 0.5 0.5 0.5 0.5 0.5 0.5 0.5 
##$TPOFFS= (0..7)
0 0 0 0 0 0 0 0 
##$TUNHIN= 0
##$TUNHOUT= 0
##$TUNXOUT= 0
##$USERA1= <user>
##$USERA2= <user>
##$USERA3= <user>
##$USERA4= <user>
##$USERA5= <user>
##$V9= 5
##$VALIST= <valist>
##$VCLIST= <CCCCCCCCCCCCCCC>
##$VD= 0
##$VDLIST= <DDDDDDDDDDDDDDD>
##$VPLIST= <PPPPPPPPPPPPPPP>
##$VTLIST= <TTTTTTTTTTTTTTT>
##$WBST= 1024
##$WBSW= 4
##$XGAIN= (0..3)
0 0 0 0 
##$XL= 0
##$YL= 0
##$YMAX_a= 324952
##$YMIN_a= -461152
##$ZGOPTNS= <>
##$ZL1= 120
##$ZL2= 120
##$ZL3= 120
##$ZL4= 120
##$ABSF1= 16.4569
##$ABSF2= -4.236273
##$ABSG= 5
##$ABSL= 3
##$ALPHA= 0
##$AQORDER= 0
##$ASSFAC= 0
##$ASSFACI= 0
##$ASSFACX= 0
##$ASSWID= 0
##$AUNMP= <proc_1d>
##$AZFE= 0.1
##$AZFW= 0.1
##$BCFW= 0
##$BC_mod= 0
##$BYTORDP= 0
##$COROFFS= 0
##$CY= 12.5
##$DATMOD= 1
##$DC= 0
##$DFILT= <>
##$DTYPP= 0
##$F1P= 14.0000005364418
##$F2P= -0.99999901652339
##$FCOR= 0.5
##$FTSIZE= 32768
##$FT_mod= 6
##$GAMMA= 0
##$GB= 0
##$INTBC= 1
##$INTSCL= 1
##$ISEN= 128
##$LB= 0.3
##$LEV0= 0
##$LPBIN= 0
##$MAXI= 10000
##$MC2= 0
##$MEAN= 0
##$ME_mod= 0
##$MI= 0
##$NCOEF= 0
##$NC_proc= -5
##$NLEV= 6
##$NOISF1= 0
##$NOISF2= 0
##$NSP= 0
##$NTH_PI= 0
##$NZP= 0
##$OFFSET= 16.4569
##$PC= 1
##$PHC0= 169.7975
##$PHC1= 4.403008
##$PH_mod= 1
##$PKNL= yes
##$PPARMOD= 0
##$PSCAL= 4
##$PSIGN= 0
##$REVERSE= no
##$SF= 250.130016283339
##$SI= 32768
##$SIGF1= 0
##$SIGF2= 0
##$SINO= 400
##$SIOLD= 32768
##$SREGLST= <1H.CDCl3>
##$SSB= 0
##$STSI= 32768
##$STSR= 0
##$SW_p= 5175.98343685301
##$SYMM= 0
##$S_DEV= 0
##$TDeff= 65536
##$TDoff= 0
##$TI= <Analysis number 999999
Compound Code 99
Book Reference 9
Project Code 9>
##$TILT= no
##$TM1= 0
##$TM2= 0
##$TOPLEV= 0
##$USERP1= <user>
##$USERP2= <user>
##$USERP3= <user>
##$USERP4= <user>
##$USERP5= <user>
##$WDW= 1
##$XDIM= 32768
##$YMAX_p= 482994874
##$YMIN_p= -496901
$$ End of Bruker specific parameters
$$ ---------------------------------
##NTUPLES= NMR SPECTRUM
##VAR_NAME=  FREQUENCY,     SPECTRUM/REAL,   SPECTRUM/IMAG
##SYMBOL=    X,             R,               I
##VAR_TYPE=  INDEPENDENT,   DEPENDENT,       DEPENDENT
##VAR_FORM=  AFFN,          ASDF,            ASDF
##VAR_DIM=   32768,         32768,           32768
##UNITS=     HZ,            ARBITRARY UNITS, ARBITRARY UNITS
##FACTOR=    0.157963299565203, 1,           1
##FIRST=     4116.36457566294, 0,            0
##LAST=      -1059.61886119007, 0,           0
##MIN=       -1059.61886119007, -496901,     0
##MAX=       4116.36457566294, 482994874,    0
$$ Real data points
##PAGE= N=1
##DATA TABLE= (X++(R..R)), XYDATA
$$ [...]
27956C16701Q2127r6210p8638n1511j45563q9774q8577l9326Q2750M41j8065K7678
27944i7967N4062J3534K5303r131J4989k8611J4418j02795j25040n1216Q225J31013
27932a53216K4942K0118l64O1767J2182l9520l7344Q965K5756L939N5104j02839
27920a20510R314Q1623N3225N5173n6086j45997k0827J48242R6570J2604M7408
27909A60739p3693j38615k8669o8711P6572o5649K7776P7459L0376Q0053q60j8603
27897E8175n9113N0270q9275M7144K1508r7992n6862j983p8944j4595L2942J31542
27885e7183Q5974P8453M8056q7719N618k4035P2871M2297l5016n1204p6036P5350
27873G7426r834o4370R7436j3239N8n2433J7476J41625K088n0314L4566P0842
$$ y = [316701, 398828, 302618, 223980, 172469, 26906, -62868, -151445, -190771, -108021, -107580, -125645, -97967, -43905, -30371, -5068, -14199, 790, -27821, -13403, -116198, -241238, -292454, -284229, -153216, -128274, -108156, -108520, -46753, -34571, -74091, -111435, -102470, -76714, -72775, -17671, -120510, -111196, -29573, 23652, 78825, 22739, -123258, -144085, 4157, 100727, 113331, 160739, 87046, -51569, -80238, -148949, -72377, -138026, -110250, -32791, -2415, 77638, 76778, 58175, -938, 49332, -39943, 7201, 28709, -69283, -126145, -128128, -207072, -221667, -188725, -57183, 28791, 107244, 155300, 67581, 73199, 49164, 122035, 164332, 129316, 78112, 2076, 77426, 67592, 3222, 100658, 87419, 87477, 35044, 52520, 194145, 196233, 145919, 180485, 251327]
27861B51327Q5283j55512k23455J4468Q7479l1685K1389j24996j68345n2253n3904
27850c50204R8344Q1133J05865R8200L5059N0422j3352M9221J1705q7409k943
27839G6041r7965k8426k9794L9779K6218l1688J4487L3774o6238n01n7185l6115
27827a57613j7991J8925K3608O1254J23073Q6257O180o7757k3783r043m2105L3882
27815C4887K5245p6619j08734M3207K45932R6372p7743j68594j21819J5383J50255
27804E7772P1051k7305j069q7494j57290j43648J96980J44850o0581k1442J28277
27793A00101Q0154L6617L872m6400o2391o1332L5825P2858q9044q5388k1519P6988
27781D0341P594j7120j17591O9539N8300k0387m5704O8963p7962Q9100M0133Q717
$$ y = [251327, 336610, 181098, -42357, -27889, 59590, 27905, 49294, -75702, -244047, -296300, -350204, -251860, -170727, -64862, 33338, 68397, 118819, 105467, 154688, 166393, 78984, 76041, -21924, -50350, -80144, -40365, -14147, -45835, -31348, 2426, -63812, -64313, -121498, -157613, -175604, -156679, -133071, -71817, 51256, 137513, 143693, 75936, 52153, 43110, 1005, 34887, 60132, -16487, -125221, -82014, 163918, 260290, 182547, 13953, -107866, -92483, 57772, 128823, 101518, 100449, 12955, -144335, -287983, -91003, 53847, -6734, -28176, 100101, 180255, 216872, 220744, 174344, 111953, 50621, 86446, 159304, 70260, -15128, -36647, 40341, 47935, 30815, -86776, -17237, 41063, 20676, -25028, 43935, -34027, 55073, 95206, 103923]
27769A03923M0120j54391j56562o7907m3644O4388Q1102R0905L8486l2126M6903
27758A1197J2801J49213n1148j51635l5668o1062k7819K7113L5980n1671j9250
27747a61949J40418N8710j26690j22337p28J11421J35416J33207O1061n6705j1186
27736A60638q1306q0219K945R35l7147q345L0839L3054O9991o8338k9862K7864
27724B1049K1639R3600n6738r9382q3066Q2492m3419M941N8714n0839M8647M5727
27712D3365j8892l7933K3971J6296N1225j9483N4928p481Q2362J04592l6404K826
27700B59372M0286Q477j04483m2724n6667j33695N2420J51052k2638Q1688J3208
27689B46296n1345p6303l4122j24331Q889P3855l3340j69276K8329O6261r3294
$$ y = [103923, 144043, -10348, -166910, -234817, -278461, -214073, -132971, -42066, -3580, -35706, 11197, 23998, 173211, 122063, -29572, -65240, -126302, -154121, -127008, -91028, -142699, -161949, -21531, 37179, -89511, -211848, -212576, -101155, 34261, 167468, 228529, 171824, 160638, 79332, -887, 2058, 2993, -34154, -42499, -11660, 21394, 91385, 23047, -6815, 21049, 42688, 136288, 79550, -19832, -102898, -20406, -63825, -58884, -170, -51009, -2362, 43365, 24473, -13460, 10511, 26807, 78032, 58549, 113477, 105996, 188358, 292950, 256546, 259372, 299658, 308135, 203652, 160928, 104261, -29434, 22986, 174038, 151400, 233088, 246296, 194951, 118648, 84526, -39805, -30916, 42939, 9599, -159677, -131348, -65087, -158381]
27678a58381r5866O1840J99752J01089r576j10607j05530j1752K1899L9090J2827
27667e5215m0498J1770O5148M5916k8651J9990j6988M4412j3128m4943p1299j12995
27655a96481J62234J22166p5146K8107O1780p3732o3924o2400k578N4038N3105
27644G169O9244J54772j9159o6736L8858M598j02987q5469p5568J38960J63657
27633B27339K6961n9546K3679o4327K8944l5097n7600j07680L024K6533p240p1683
27621f6693L3734O8712J40292O671k20305j8668p0727q2032r7478k8169N0182
27610b84481J22895Q7694k3962Q1320N2990j05237o3062K4039l7594p4306Q903
27599b10801J69197J24899k3914R0316J08499P0008q2143k34248k03185l2100
$$ y = [-158381, -254247, -192407, 7345, 108434, 98858, -11749, -117279, -129031, -107132, -68042, -55215, -95713, -83943, -18795, 27121, -1530, 18460, 1472, 45884, 32756, -12187, -83486, -196481, -34247, 87919, 12773, 40880, 102660, 28928, -34996, -97396, -99974, -45936, 7169, 76413, 231185, 212026, 145290, 184148, 188746, 85759, 290, -75278, 63682, 227339, 254300, 194754, 218433, 154106, 183050, 147953, 90353, -17327, -14303, 12230, 4990, -66693, -32959, 35753, 176045, 182716, -37589, -56257, -126984, -209016, -306494, -334663, -284481, -161586, -73892, -97854, -16534, 36456, -68781, -131843, -107804, -145398, -219704, -210801, -41604, 83295, 59381, 149697, 258196, 328204, 246061, 11813, -191372, -223472]
27589b23472M9353J27001J5250o6194k1729N0825N7806Q0189l4615r2028N6907
27578g07l6418r8218j1229J6768P5330J38200M6996q6873m8707N1854p76j35468
27566h9248p4956m794R9088J53071j5848r1228k8618p0895N1923J42818k915J3641
27554H2039m8343M8094K6123j3908j36451N117j6236J0665K0560n0505r5199o5800
27542b33844J06818J9222o7779j07636K9611P2138k08K9665P1935m6214o5050
27531a91342J86459J3178N5518n5148j57338M3371P6130Q5795R902j50233P5534
27520h174M2328J6156r7595N7563J3906j3964j0030O8214N2971m5266j76572l9606
27508a40069J49340O4980j14879j11214o2400Q6553J10577L9970q0057k081R9263
$$ y = [-223472, -174119, -47118, -31868, -98062, -119791, -68966, -11160, 69029, 34414, -57614, -707, -37125, -135343, -146572, -129804, -54474, 83726, 130722, 43849, -4858, 46996, 46220, -89248, -164204, -168998, -69910, 83161, 67313, -23915, -52533, -123428, -71505, 71313, 68398, 82039, 33696, 81790, 107913, 94005, -42446, -37329, -53565, -42900, -22340, -72845, -168044, -233844, -127026, -107804, -175583, -283219, -253608, -181470, -181678, -152013, -80078, -126292, -191342, -4883, 8295, 63813, 8665, -148673, -105302, -29172, 56623, 66525, -83708, -8174, 34154, 50310, -47285, 10278, 24184, 10220, 190, 68404, 121375, 76109, -100463, -140069, 9271, 74251, -40628, -151842, -214242, -127689, -17112, 22858, -57199, -59280, 39983]
27497C9983N1658M278j13679R776J7167l6609P7800K7232L5192K3797j40079j89271
27485a92755K7212M1631L3930L7100j53668L3975K04785N7020M0985L410j89528
27474e5903n363J71082N1127l8712L4474J29700j729l4208n9681r2191j68425
27463f9829K1062J91549J3291r5703m8534l1628P2706M4514l0130q8681j40665
27452a62048l2247L5390J88790O1349j5934j5538k4398m4699l3110O0163J22955
27441A40673l4448j34525j17886j5620n3212L0527R1496L0616m0712P3223Q123
27430b1745q3155J03771J57411J15647j16089n5086q7495j03526l4614Q2946n293
27419d7228o0759p944j54339j34389J15808R3499J39079J63759k1050j3548K12955
$$ y = [39983, 91641, 95919, -17760, -7984, 9183, -27426, 50374, 77606, 112798, 136595, -3484, -192755, -165543, -123912, -89982, -52882, -206550, -172575, 32210, 89230, 130215, 133625, -55903, -61266, 109816, 160943, 122231, 156705, 286405, 284676, 250468, 190787, 98596, -69829, -48767, 142782, 156073, 60370, 11836, -19792, 52914, 97428, 67298, -21383, -162048, -194295, -158905, 29885, 91234, 75300, 59762, 35364, -9335, -42445, 17718, 140673, 106225, -28300, -146186, -161806, -215018, -184491, -92995, -62379, -103091, -29868, -21745, -104900, -1129, 156282, 271929, 155840, 100754, 13259, -90267, -124881, -41935, -47228, -107987, -115931, -270270, -404659, -288851, -195352, -56273, 107486, 86436, 72888, 285843]
27408B85843j3834r4639K935n8216j20654o6481l210k3190J9713N6381O6711k8017
27396B3342L4654N1341q4108o7939k5125l188J139m5727K617O171m6309j12028
27384b65160q433L1454N0053J687J87099J41374O1100L1106j19709j71558j02250
27373a63237K1965K0396j50650J8118J77476M6913J4q2419j06336N6781J58686
27362b293L6200P1722q0929j91366l7647J12651P0557r1124P401L3660k3019j38941
27350b33128p3919J69295J52216R6668l5119l7642k5570N2060K6688P9011m0649
27339A29911q0813m3891J2959M1454J495q182M8435j56680O3888N3709j7930n6305
27327a1950l3203o2269J21169Q9765k6277j09484k2862P4538j8346M6303K3381
$$ y = [285843, 272009, 177370, 180305, 122089, 1435, -65046, -68256, -91446, -71733, -15352, 51359, 23342, 57996, 109337, 25229, -42710, -67835, -71023, -69884, -115611, -112994, -106823, -153132, -265160, -273593, -242139, -192086, -190399, -3300, 138074, 199174, 230280, 110571, -60987, -163237, -141272, -120876, -271526, -253408, -75932, -29019, -29005, -111424, -217760, -160979, -2293, 33907, 105629, 24700, -166666, -204313, -91662, -21105, -112229, -104828, -71168, -94187, -233128, -307047, -137752, 14464, 111132, 76013, 38371, 12801, 64861, 91549, 170560, 129911, 49098, 5207, 18166, 59620, 61115, 52933, 101368, -55312, 8576, 62285, 44355, -11950, -45153, -107422, 13747, 103512, 77235, -32249, -55111, 19427, 1081, 47384, 70765]
27316G0765n4008K0907R2852L7683P0008R158r7909j26519q4571r3741r875J08988
27304e6262M3497k7510j3132m5360m3059r4944o5439J33027J43577K3993l0292
27293c1904r3772j325R3918J16978K6358j6276o8625k0497m596o590N1766K9315
27281G4750O0547o4526p7698j2791k0522p193J150j16215J4408k9645q653N7855
27269a28533m6134K426O468R3627j9904L4251L0422J0334r7793m8428J4507M5193
27257a03564O0344J3199p2457k7815k6254J08172J1337q472q7166o6155N6912
27246a41919L9497l1234N1341J68107M7729n1811J8735M6190r818K8572m0393
27235A24996O0731N9243o7037r1912j25007R8255J58203J0634p9515j12762m8668
$$ y = [70765, 16757, 37664, 130516, 168199, 238207, 247365, 149456, 22937, -61634, -155375, -165250, -56262, -12765, -40275, -53407, -98767, -141826, -236770, -302209, -169182, -25605, -1612, -31904, -125676, -127001, -33083, 83895, 110253, 93977, 25352, 4855, 259, -6331, 45435, 74750, 135297, 70771, -6927, -19718, -40240, -47433, -46283, -162498, -148090, -177735, -186388, -128533, -174667, -172241, -165773, -72146, -92050, -57799, -27377, -17043, -114836, -163264, -148757, -103564, -43220, -30021, -102478, -130293, -156547, -48375, -37038, -45510, -132676, -198831, -141919, -102422, -133656, -82315, 85792, 133521, 81710, 100445, 146635, 136817, 165389, 124996, 185727, 244970, 177933, 86021, -38986, 59269, 217472, 228106, 148591, 35829, -12839]
27224a2839Q7624J173M4299n0193j19606P1685N4551j833n9133o2748j6315M0468
27212b2867J06924r4881k6039N3635K1446l3662Q8173l2233q1598l2946J13246
27201E9198P9113j31999j44707r8429K9120R8148M5188J63717l3150j85707p1194
27190a90702O2934P8915J09024M3270L2371l6401n380j2132m5046j46714l3647
27179a43508J0880K5383K9648k5341J21149j1569q6532q4383J7075Q5149L1228
27168c0821M2726J73809N6496j22091k18576j0131M1654J01790N2061n9264N0323
27157G7976M1368p2017j5247k8946m1122m5975O563J44163J20743l6859j24228
27146B6419j3605J21759J6914q9472j35739m0330l9351l4118K5518l9943m1299
$$ y = [-12839, 74785, 75958, 120257, 70064, -49542, 22143, 76694, 74861, 15728, -47020, -63335, -22867, 84057, -10824, -36863, 16772, 38218, 4556, 92729, 60496, -21102, -54048, 59198, 138311, 6312, -138395, -236824, -207704, -109556, -64368, 99349, 66199, -119508, -190702, -127768, -48853, 60171, 103441, 135812, 99411, 94031, 81899, 36853, -109861, -143508, -132628, -107245, -77597, -102938, 18211, 6642, -79890, -164273, -147198, -62049, -30821, 11905, 185714, 242210, 120119, -98457, -108588, -66934, 34856, 86917, 27653, 77976, 119344, 47327, 32080, 3134, -37988, -83963, -77400, 66763, 187506, 150647, 26419, 12814, 134573, 151487, 62015, -73724, -114054, -153405, -187523, -162005, -201948, -243247]
27135b43247J69040R9602J0542P7606O1932r5258r6756p9737O9035J07185n7145
27124B2799j28422k0487Q1937n562J2069j5257j0476k7853j3986m5074J23596
27113b6716J6365l2385j02588K5656O1178j6428M2458M8400K3384J22075j18020
27102D3379m4926j4057p3358j2436J03916Q3636j66746n9463P3971q175O6664
27091g595L6832N5454j07118j0742L8890p5286k3408M4323n9324p2889o7551l6785
27079b85199J11717J18205k2263j1919O1979N9989r7211j37395l8801J5902J22432
27068a02564J63822J10566r9689j39943m4240N9821P8782K3384K7753l9613Q2620
27057A20699J0245j37850k8831J4536J7349J6140L271r0113j2430q8045J0353
$$ y = [-243247, -74207, 25395, 35937, 113543, 175475, 80217, -16539, -96276, -27241, 79944, 22799, -105623, -126110, -44173, -49735, -37666, -52923, -63399, -91252, -105238, -150312, -26716, -10351, -42736, -145324, -119668, -58490, -74918, -32460, 15940, 39324, 161399, 43379, -1547, -15604, -88962, -101398, 2518, 86154, -80592, -140055, -66084, -74259, -7595, 29237, 84691, -22427, -33169, 5721, -69565, -92973, -48650, -107974, -180863, -248414, -285199, -173482, -55277, -77540, -89459, -27480, 32509, -64702, -202097, -240898, -224996, -102564, 61258, 171824, 72135, -67808, -112048, -52227, 26555, 49939, 77692, 38079, 120699, 130944, -6906, -35737, -21201, -3852, 12288, 15559, -74554, -86984, -175029, -164676]
27046a64676Q4768l5702K7951J28390K910k1151k6533J7068N3318K9189j69991
27035g4459n170P1609P1823P1249j08737k566o614K6403l3347J35255P7100Q0623
27023C03169q7067j00396j13291j47880n3296k4044J00672J72323p5460r4404
27013a19674K2409j44770L3765J36714L8761m0828o6039j01274j0173Q3874N6067
27002a11168M8298N9870j17576K6284P7259O6926j06030J04128Q6144p7957m1274
26991A4904L7665o060j1466Q0752r6547L4547J49512k7361l990P069o6859j13660
26979a494K7056L9242n273n7561j06275n0426r3859Q6323k4046J1091J65416O5859
26967E6053o8894k3506q907Q731k5740K57M7983J562j21598Q3118K7045K3135
$$ y = [-164676, -79908, -115610, -87659, 40731, 43641, 22490, -4043, 13025, 66343, 95532, -74459, -79629, -8020, 63803, 135052, 26315, 23749, 17135, 43538, 10191, 145446, 222546, 303169, 216102, 115706, 2415, -145465, -198761, -222805, -122133, 50190, -25270, -119674, -97265, -242035, -208270, -71556, -32795, -73623, -139662, -240936, -251109, -167235, -111168, -62870, -3000, -120576, -94292, -17033, 49893, -56137, 47991, 134135, 56178, 14904, 52569, 46509, 35043, 115795, 19248, 53795, 203307, 175946, 171956, 179025, 112166, -1494, 25562, 64804, 59531, 1970, -104305, -154731, -248590, -162267, -186313, -175222, -9806, 56053, -12841, -36347, -45254, -36523, -62263, -62006, -14023, -12461, -134059, -50941, -23896, -761]
26955g61Q6188Q3349l0121l8099q1521l6926j07149J0847J17158Q3283M9445q3735
26943E1958m8259J26770r4107k45268j26627N0520n216N022R9711L5882l53M8207
26931a01760n1492j09395j7385P2627N4016n3960N9037J00957n5091j25111J34641
26920i2916k3351R338j4705R651O2504O2574J7618l3225j396n074Q3452k8945
26908D5525l7948m7562P7037N7564J6633k7072J7560n3812q3196j41500J5884
26897a60887o4609J4644p2670p863K22935J27845N023j72208o0529P8183Q2192
26886g944Q1540l1298j03861o3418P0128J55193N3307j5971l1863p7582K8334
26875E6565O0055k16181k5699J54427J24420j50330j30216N7610K05012J50094
$$ y = [-761, 85427, 168776, 138655, 100556, 19035, -17891, -125040, -114193, 2965, 86248, 135693, 51958, 3699, 130469, 36362, -208906, -335533, -285013, -290229, -285207, -185496, -149614, -149967, -101760, -153252, -262647, -280032, -207405, -153389, -207349, -148312, -47355, -102446, -227557, -92916, -116267, -106929, -121634, -111983, -49479, 13095, 30713, -2512, -3908, -8982, 74470, 45525, 7577, -39985, 37052, 94616, 111249, 84177, 101737, 47925, -35271, -176771, -160887, -225496, -210852, -283522, -291385, -68450, 59395, 64418, -107790, -168319, -90136, -7944, 73596, 42298, -61563, -124981, -54853, 100340, 153647, 137676, 105813, 28231, 56565, 116620, -99561, -125260, 29167, 153587, 3257, -126959, -69349, 135663, 285757]
26865B85757p9769j37051o8932J3368n4234R0940o922l4667J46283K6344r9674
26854H1443M1823J62493o0251j81457j07230n4651M7407J94691K25618J5705j53215
26843B12376m6324k5016o3975J18961q1142o8257m1745N2673J0942j49456l0648
26832a11611J09109J03803R0305q2885o9739j35770p0196J01588P5112P015j18320
26821a01589j77145p328P2493O3536J86975O0206k09070M5387M9164M2782N0837
26810G6248l075L3707R625j07276j00439k4866j7343L1090J13828l562P7598M2730
26798A28265r1136j41772J59654M1128l910P0516q729K6809q7999j11963m1530
26787f0667l3355J3795J6733k6849o0648L0955N0963P6640L6853j81312m5512
$$ y = [285757, 205988, 68937, 5, 13373, -40861, 50079, 43157, 8490, 154773, 181117, 81443, 123266, 285759, 225508, 44051, -63179, -117830, -70423, 124268, 349886, 365591, 212376, 166052, 141036, 77061, 196022, 114880, 46623, 4878, 57551, 68493, -80963, -111611, -2502, 101301, 191606, 108721, 38982, -96788, -166984, -65396, 9716, 16731, -101589, -278734, -286062, -213569, -150033, 36942, 97148, -111922, -66535, -17371, 25411, 76248, 73173, 106880, 116505, 9229, -91210, -116076, -133419, -102329, 11499, 7937, 85535, 128265, 37129, -104643, 55011, 96139, 92229, 162745, 154016, 180825, 92826, -19137, -60667, -94022, -80227, -63494, -90343, -150991, -120036, -69073, 7567, 44420, -136892, -182404]
26776a82404P6708p52o7047J30158R4049M2793O2186m9764m8645N7282j31278
26765a6714j33099p2732J6751J90857j9987J2558k0314m6249q2012m1487M5344
26754a67084J82249Q6031K5284j53858o9547M6594L120L5214M6360P5146m7410
26743F2099m0184j50747J3095P4018l3820j54953J1880K01240j1689Q492o7517
26732h8086l8114N0539J32300J43877J1480r7909m6462J0594k1604l4092n1457
26721b8934L7404M3663L7422O6797R4775m0850j5677n532j0042q4695j86739j71256
26709b63664L9147P3962Q7345P3591j11267j3445P1183J91826J7503K8603m0487
26698A54297m8928j60611n7069O320k3139o0762m9591J09307L300K6184L4708
$$ y = [-182404, -105696, -106448, -173495, -43337, 50712, 93505, 155691, 105927, 57282, 114564, -16714, -149813, -222545, -205794, -14937, -34924, -22366, -42680, -88929, -170941, -212428, -167084, 15165, 101196, 126480, -27378, -96925, -50331, -47211, -11997, 34363, 109509, 62099, 21915, -128832, -115737, -41719, -75539, -230492, -218612, -17372, -29061, -20569, -88086, -126200, -75661, 56639, 200516, 211996, 114087, 67625, 78219, 56615, 22523, -28934, 8470, 52133, 89555, 156352, 251127, 210277, 194600, 189068, 179026, 94331, -92408, -263664, -224517, -150555, -63210, 10381, -100886, -114331, -43148, 148678, 166181, 194784, 154297, 105369, -55242, -112311, -105991, -129130, -189892, -239483, -130176, -126876, -100692, -65984]
26687f5984M7893J07917P7893P4525M794n3544m5685o6238n5746l0208O9986k2947
26675D2656k3113J74097L5393n5215k16549j87121p4376N9134R2213J7156o8822
26664b04547j21537J8765Q3420O585P5012R1601N2549m8163K8675O9235N5727
26653A07322n8549q2718j8264k2228m5907L0296P6034M0666O8932j7900j29429
26642e1745l319J87555p237r9332q2568J6353q4551j47226P7491R5560k2781J70549
26630D8749J22102J0186r2489j42790j02755Q1967P4415M3595J1409p9152n2856
26619g7619P0391J4413m8137j5966K1376r6081l5644O8256K13062Q5788J8459
26608B18298j30338p0836P1074J6610j59631m3266J12515K2792J074M1875j19640
$$ y = [-65984, -18091, 89826, 167719, 242244, 247038, 193494, 147809, 81571, 25825, -4383, 65603, 42656, 19543, 193640, 229033, 173818, -42731, -229852, -304228, -245094, -152881, -135725, -204547, -326084, -307319, -223899, -217314, -142302, -50701, 1848, -46315, -17640, 51595, 107322, 48773, -33945, -52209, -74437, -120344, -90048, -14014, 26652, 95584, 77684, -51745, -55064, 132491, 125254, 25922, -56646, -40293, -124844, -272070, -194579, -99019, -121800, 48749, 170851, 181037, 88548, -54242, -156997, -75030, -615, 42980, 54389, -24763, -77619, -7228, 7185, -40952, -56918, -35542, -131623, -167267, -99011, 114051, 199839, 218298, 87960, 17124, 88198, 104808, -54823, -98089, 14426, 37218, 38292, 80167, -39473]
26597c9473p7925P1723J09792j37436p3726O1206J02334j21325j40370N7498O4832
26586a22870M0404j06389P9032K0855q4902J29989J15601p7881j41264j3243L255
26575a57413J4294k0444K1978r0643J5603J71794M9455p2156P054L1298M7354
26564A8174j03814J5900J8039O7822J00477K633j33146n5835l185N9501R60k4960
26552c7434Q9101J17581j8445j40311n7354O965K0833j01072N686j7693j272O257
26540a27158R5524J16005J1204j9379J50051P9871j28336o3304j14753m1009J18325
26529G7041J0629m4900N2424M1056J0267j26124j21348P8464J29588R1418m7401
26518A51114p8307p6830j01495O6117J31697k236l9223j9546o2460l4136j6199
$$ y = [-39473, -117398, -45675, 64117, -73319, -147045, -85839, 16495, -104830, -245200, -187702, -122870, -82466, -188855, -109823, -88968, -173870, -43881, 71720, -6161, -147425, -160668, -157413, -143119, -163563, -141585, -232228, -216625, -44831, 4624, -67532, -60478, -29180, 18174, -85640, -69740, -51701, 16121, 116598, 119231, -13915, -69750, -72935, -13434, -12474, -37434, 51667, 169248, 150803, 10492, -46862, -39897, -19064, -120136, -114450, -132143, -133415, -127158, -31634, 84371, 95575, 76196, 226247, 306118, 177782, 114478, -275, -41284, 77041, 87670, 42770, 95194, 136250, 146517, 20393, -100955, -22491, 107097, 198515, 151114, 72807, -4023, -105518, -39401, 92296, 90060, 50837, 31291, -31169, -65305, -81504]
26507h1504O0392j1969r1159K7984J2291r2010j9680j6716N5673P1263M831k7651
26495a08255R684Q2710O2050k4625r8334J24421j8068N204M5724J14633n0065
26484A45079j36220k2810N2916N3449K1501M6031k5818j35264j78261o4178j7814
26473b61389O4166N5160k3236j408O8935L256Q1860R5764m3073K3186P0017J3491
26461A46729o7195j31911Q9j4910m2075J28471L6560Q5738O594j4508m7961k92
26449H5329j56042l2877R78Q0191p796p8032q1302J18781J12156o2774p7126P53
26437i7761J6114m8029J26311p2963q8848J2873L2086L4642N0012Q2100R2055
26426A38592j3279j7148k5575l5042j4932Q561m0959p3860l3981j9483q1026P5010
$$ y = [-81504, -21112, -33081, -124240, -96256, -83965, -175975, -195655, -212371, -156698, -85435, -80604, -108255, -98571, -15861, 46189, 21564, -76770, 47651, 29583, 34787, 80511, 195144, 145079, 8859, -13951, 38965, 92414, 113915, 159946, 134128, -1136, -179397, -243575, -261389, -197223, -142063, -165299, -166707, -97772, -94516, -12656, 83108, 40035, 63221, 133238, 146729, 79534, -52377, -52288, -67198, -109273, 19198, 55758, 141496, 148090, 133582, 85621, 85329, -70713, -103590, -102612, -22421, -30217, -108249, -189551, -70770, 41386, -21388, -98514, -97761, -81647, -129676, -3365, -76328, -165176, -152303, -120217, -85575, -35563, 46537, 138592, 125313, 108165, 82590, 47548, 32616, 41177, 218, -73642, -107623, -127106, -208132, -133122]
26414a33122J93456K62j5703l7126J4942k1700j1667j00640l0044o1928K5309
26403a77961K6680M5749O585J203q8497N4204N2582r76l5178J23188J14083K3863
26391A45525l6394J0376J6972J28232o8107j87069n4394K6012M3515J1098R1807
26380A27573J17950k2552m2831q9703r8126j8650K7066P5382K6646o823k0560
26369G5372O6501M0258m3017l1329q9305J6369J17762P306k5819n9989l0214J8423
26357F2318o3724J8104J56500m4631n7972r6322j33264o2363J57292J40118p4304
26346A752l7947N9552J6254k4571k8041k6739J78854l146m5099r1469j2357j13308
26334a26265j60850P255l9773L5053K1846Q5028J13806k1107l4219p1932m4057
$$ y = [-133122, 60334, 60596, 44893, 7767, 22709, 1009, -10658, -111298, -141342, -203270, -177961, -151281, -105532, -98947, -97744, -186241, -132037, -79455, -80431, -115609, 7579, 121662, 145525, 109131, 119507, 136479, 264711, 196604, 9535, -44859, -18847, 24668, 35766, 127573, 245523, 222971, 180140, 90437, -7689, -26339, 727, 76109, 102755, 95932, 75372, 141873, 182131, 139114, 107785, 18480, 34849, 152611, 159917, 134098, 74109, 43895, 62318, -1406, 16698, 173198, 128567, 70595, -25727, -158991, -221354, -64062, 76056, 1752, -36195, 23357, 39611, 15040, -13001, -39740, 139114, 135968, 90869, -600, -12957, -126265, -287115, -279860, -319633, -284580, -262734, -177706, -63900, -85007, -119226, -191158, -235215]
26323b35215L3841N3875J24982P6800O9963m7736q4416j01895k8409J09252J80106
26312A51148M9634j270j20242j09240o4263l1428L2521L7795k5495n5272O3419
26301g2693P0210R4239j31925J9610n2290o7046O4550K68115K0793q3437j3013
26290A17113j16989n2457l0150N9286R0350m3801m0313J6149l4682Q2280R6348
26279A43134K2624k7578k3104k16166p7292Q087P8019j55M3744M4864m3590j70131
26267b17544J22379J63319J8867p1390O9302M7385m904j26278p9849Q7815J41487
26256A50589L0476j10005m7493J54J1938l3400r1530L3516K00451j26338r8985
26245h0627P1308J08080r7610j34973o9581L6661J28235j7350P358K3867p2177
$$ y = [-235215, -201374, -147499, -22517, 54283, 124246, 76510, -7906, -109801, -138210, -28958, 151148, 200782, 199512, 79270, -29970, -94233, -125661, -93140, -55345, -80840, -136112, -72693, -2483, 91756, -40169, -20559, -72849, -139895, -75345, 192770, 213563, 130126, 117113, 124, -52333, -82483, -23197, 67153, 23352, -16961, -812, -35494, 46786, 143134, 165758, 138180, 115076, -101090, -178382, -170295, -92276, -92431, -48687, -3823, -47413, -217544, -95165, 68154, 87021, 15631, 84933, 132318, 127414, 1136, -78713, 9102, 150589, 181065, 71060, 23567, 23721, 35659, 2259, -89271, -55755, 144696, 18358, -80627, -9319, 98761, 1151, -133822, -203403, -166742, -38507, -55857, -48499, -24632, -96809]
26234i6809k8434M7513n4742M6165K4637P0040o378J18166J2658j18444L0239
26223D4611Q966j20820r6938k801J76724N3967m5600k725j5935O8067j4308m395
26211D8813j7789N965O8993o3646j24029j4904M0642j09358J936J06539K0888
26200c5950r7440o847o6364K9684O8885o6927q8505n0624Q8294J01389J30875
26189F470Q6686J9065P249m9418j13242P769O5337K0752l1858N5560l8896j01011
26177f5537K4749k877Q1359J43449l975j23117p3499J18255K290k6247q9579l4177
26165d8906m683L0301P6501R0927n717O9271o0274o5996j08300K3469R4907L0480
26153A21980j20322k5117J26538J54784n353j20512N224j18953n0460r097J41868
$$ y = [-96809, -125243, -77730, -132472, -86307, -61670, 8370, 1992, 120158, 132816, 14372, 44611, 53577, -67243, -164181, -166982, 9742, 63709, 18109, 15384, -551, 67516, 53208, 48813, 31024, 36989, 105982, 42336, -81693, -96597, -55955, -165313, -163377, -56838, -35950, -133390, -140237, -206601, -176917, -108032, -174959, -263464, -314088, -225794, -124405, 6470, 93156, 112221, 119470, 70052, -43190, -35421, 29916, 50668, 18810, 74370, 35474, -65537, -40788, -43665, 37694, 181143, 177168, 54051, -19448, 98807, 101097, 74850, -14729, -48906, -53589, -23288, 53213, 144140, 138423, 207694, 147420, 81424, -26876, -3407, 91500, 121980, 1658, -23459, 103079, 257863, 252510, 131998, 137222, 18269, -32191, -41288, 100580]
26142A00580Q9498q5053L5326K9053q2088R5028R6111o7482q8143j85333j02192
26131a64695m3026J24575Q7221Q2361j6340j16790k00l8149j19966J13402J65844
26120G4237N735m5045M4889p129j40588L2745q807n5194l6610J06796J67222j7201
26108A21050j90525m807m5354M29J40570N0047j25976j00988o7810m2592Q8669
26097a77287M4709Q6097n2267M7631k379p9013j10484M3360P0236l1234p7320
26086b37951O4613O2431J1951J1683J60559J22284n0791Q2190O9056j64693j59878
26075b8546m2206j455K8252K2041J26395L148j66206n2643j990J2765P7243L5678
26063A2476J40145l0058j5424r1551j56247l8197Q043R6124Q6229R6490o9470
$$ y = [100580, 190078, 105025, 140351, 169404, 87316, 182344, 278455, 210973, 122830, -62503, -164695, -207721, -83146, 4075, 86436, 70096, -46694, -46894, -85043, -205009, -91607, 74237, 79972, 34927, 79816, 72687, -67901, -35156, -43963, -99157, -135767, -28971, 138251, 121050, -69475, -74282, -119636, -119207, 21363, 71410, -54566, -155554, -223364, -265956, -177287, -132578, -46481, -98748, -51117, -53496, -132509, -242993, -199633, -129397, -160631, -237951, -173338, -110907, -98956, -87273, 73286, 195570, 144779, 226969, 296025, 131332, -28546, -70752, -72207, -43955, -21914, 104481, 107629, -58577, -111220, -113210, -100445, -23202, 12476, 152621, 122563, 107139, 15588, -140659, -178856, -170813, -74689, 11540, 108030, 38560]
26052C8560K482M8853j42792p008k0291M851Q3531o058M779R4590k9402j25083
26040e2988m2J33242l8596r4602R1503M3139m7250j62394O478J33858N5808O1908
26028A30064k7640J4912j29214K160L745k4519p3727J0085J98178p5333j20240
26017i1529j89071J3822J71419L2376M1426M6024K3599j3944j36335n2662M3037
26006a11838J33661n9749J7277j34402j336Q8879M3547Q1861Q8224p2302j32989
25995e9167l1620P0054r285r1093q8456L2023o6165o4986J4207l1580K6923J44909
25983a54236M5122J8728J8204R4991R5774j45739j8328q659K2594R6911N0657
25972A16019j95383j29999p1746J2850J8775J8371J47927K0707l2663K4266M831
$$ y = [38560, 41042, 89895, -52897, -59905, -80196, -75345, 8186, 2128, 6907, 101497, 72095, -52988, -53030, 80212, 41616, -52986, 38517, 81656, 34406, -127988, -121510, 12348, 68156, 130064, 102424, 117336, -11878, -9718, -5973, -30492, -104219, -94134, 104044, 28711, -91529, -280600, -266778, -95359, -62983, -21557, 24467, 48066, 34122, -102213, -154875, -111838, 21823, -37926, -20649, -155051, -156387, -67508, -23961, 57900, 146124, 73822, -59167, -90787, -20733, -30018, -121111, -209567, -177544, -243709, -308695, -294488, -326068, -299145, -154236, -109114, -90386, -72182, 22809, 118583, -27156, -45484, -54143, -31549, 65362, 116019, -79364, -209363, -281109, -268259, -249484, -231113, -83186, -62479, -95142, -70876, -66045]
25961f6045r6969J6642M1104Q1500P7792n9833k0247l781k9366P1371J1379l8257
25949a4710l0042M763N5900k8872n1314m6526l9781j5291r573M9829M6122r0250
25937a69745J14692J64833P9166j19160P8058L4782o1985K2681J2847p8686k5645
25926E1838j4185m7392m8521N3933n8695r019J14626L9667j07779q1891n8174
25915a65592k7633J7131J33676J44093p8691O8052j02275p493o999l0499M8931
25904g299O3226M2114K8442K7851r5692j68711N5358Q9916M9237k4898J4089J9144
25892I2777M3807J69781l415j31961p7961L6349J07121O9063j5680k11488n8948
25881A9445J60916O6230k19449p1771m8330l5734N7716L5041k8794n166K9756
$$ y = [-66045, -163014, -146372, -105268, -23768, 54024, -5809, -26056, -29837, -59203, 12168, 23547, -14710, -44752, -39989, 15911, -12961, -64275, -110801, -150582, -165873, -175446, -125617, -79495, -169745, -55053, 109780, 188946, 69786, 147844, 182626, 120641, 143322, 156169, 77483, 51838, 37653, -9739, -58260, -4327, -63022, -72041, 42585, 82252, -25527, -107418, -165592, -193225, -176094, -42418, 101675, 22984, 91036, -11239, -18732, -25731, -56230, -7299, 55927, 98041, 126483, 154334, 58642, -110069, -54711, 35205, 84442, 59544, 73633, 92777, 136584, 306365, 302950, 170989, 93028, 129377, 236498, 305561, 289881, 78393, 19445, 180361, 246591, 27142, -44629, -92959, -128693, -70977, -35936, -64730, -69896, -40140]
25870d0140k3825k1771K9416J51010p1864j10851j08307J25359K7089J5893K5750
25859b241j81475J803Q5709L9554k4505j00908J9704R9717Q7479O9857O8636n157
25847A58173p5428n2166n2683R6198k3059k6945O0163m9271j74411o2417J04706
25836i7140J1579n8089k8291K1303K33724J04144m326j96243K3690P6514r0613
25825c748j8970p7255J05813J33325K1596k20154j81357K5362J89187M3565j9272
25814a908j3205q5324m4141j04385l7977L9262j73416p5807J04068K55644Q4491
25803e2698p0798J9607o8355K1726J70060J17152r9113o698M6554k8838R7171
25792A45770P265j7621j41669o0368j01660J8377J9461J37475m6811L5439J12864
$$ y = [-40140, -63965, -85736, -56320, 94690, 22826, -88025, -196332, -70973, -43884, -27991, -2241, -183716, -181913, -96204, -56650, -81155, -182063, -162359, -62642, 24837, 94694, 163330, 158173, 82745, 30579, -22104, 74094, 51035, 24090, 84253, 34982, -139429, -201846, -97140, -85561, -143650, -171941, -150638, 83086, 187230, 182904, -13339, 10351, 86865, -3748, -22718, -99973, 5840, 139165, 160761, -59393, -240750, -215388, -26201, 17364, -1908, -15113, -100437, -144578, -248963, -286940, -247678, -421094, -496901, -392833, -137189, -52698, -123496, -103889, -172244, -150518, 19542, 136694, 37581, 30883, 77437, 48599, 145770, 153035, 135414, -6255, -66623, -168283, -149906, -130445, 7030, -39781, -4342, 108522]
25781A08522J16384j07970p8618m1400l7533m0922R1945R495l4805r2824l2079
25770a39805N612L8724J0285Q597j6124p0119M0110J53735J82352j18544j50310
25759e5487Q4770J1704n5546J6695n192o7120M7560K7307P5665o4806j45564k4333
25747a54347J08915J01415j486p0170P6469Q969Q4845j7031j33709L414K2187
25736B9471m0016j7017p2686l628Q4047J3306Q4260N7658j5315N2671P8002k4192
25724B26561j41317k8261J1373n3005l7403M9103R0404p0617o2405m227N8538
25713C8744l668j5020J2424O8494N2847L925Q587J2371K9100j32934J5950N1817
25701A42637j18871j21054K6605O388n0325j8056p9360P2342R0458M6391K8637
$$ y = [108522, 224906, 116936, 38318, -3082, -40615, -81537, 10408, 19903, -14902, -107726, -139805, -134193, -95469, -85184, -76587, -92711, -162830, -122720, 31015, 213367, 94823, -55487, 29283, 40987, -14559, 2136, -3056, -70176, -22616, 4691, 80356, 15550, -130014, -154347, -45432, 55983, 54497, -15673, 60796, 69765, 154610, 137579, 3870, 7284, 29471, -10545, -27562, -100248, -103876, -19829, -6523, 77737, 135395, 120080, 172751, 250753, 226561, 85244, 56983, 68356, 15351, -22052, 27051, 117455, 46838, -15567, -19794, 38744, 35076, 20056, 32480, 100974, 153821, 157746, 166333, 178704, 207804, 74870, 90820, 142637, 23766, -97288, -70683, -64295, -114620, -132676, -212036, -139694, -49236, -2845, 25792]
25690B5792p9058j6347O8906O1452j02089r3330R6744L0486j7168r1116l8786
25679a54514L6796J2636o34J24215l5813q3242p7064K2886N1716m907l01J22066
25667A3840o3276j482Q9763N319l6954p1440r5148k5340l4955J41390R5051J14220
25655A30988R9054l1997j31699l9192K9321o9539n7015m7255N7136Q9048p2311
25644d3461N663J27065Q0204j57222j21225K3103R9404Q0049K055r4268K4767
25633B6134N094J7924m8506R2562j9535n9646R6315L7355O1073m6056j10378k8762
25621B3574j9452j02973p2482J11583J57338J8687R864J813P520o2135m2140M3283
25609G4480q827j17772o2200J7117j6695M5095J27175m118m4070n2057K4800J19986
$$ y = [25792, -53266, -69613, -707, 60745, -41344, -134674, -37930, -7444, -24612, -115728, -154514, -117718, -105082, -105716, 18499, -17314, -100556, -177620, -154734, -103018, -107925, -108226, 13840, -49436, -50918, 38845, 44164, 7210, -64230, -159378, -184718, -219673, -78283, 16768, 130988, 230042, 198045, 66346, 27154, 56475, -13064, -70079, -117334, -60198, 28850, -43461, -37798, 89267, 169471, 12249, -108976, -85873, 13531, 93580, 95635, 1367, 26134, 31228, 49152, 646, 93208, 73673, 14027, 110342, 147697, 208770, 162714, 52336, 23574, 4122, -98851, -171333, -59750, 97588, 116275, 126139, 127952, 135472, 73337, 31197, 74480, 65653, -52119, -114319, -97202, -113897, -68802, 58373, 54255, 10185, -41872, -17072, 102914]
25597A02914j08054j72346k5446J00384P1388K3749K6742l4644M3830M9282l8217
25586C9582j14230O341K6578J07235l4418r8958k5180n060K1607K2228K8395Q604
25574a7276J84761k1261r6418l3630p5571N1227K04691m7228n4647Q551R1369
25563A94568P5555n2787n1541m6327R26j58284Q17J37625J63943l5175j14348
25552A14972m124m107r766j03876J2403O732k2550k2023J9552l3999p1101Q9501
25540b8386Q6358m282n7085o6169n8707J12675J47330P4155P1948k9294j65258
25529H3285j94411L1854Q868L0464R5827j80039j17682K3292q919p69J81867n5941
25517a02304k9203L3211l0423J6884o5297M6428Q2998M4640Q8696m475n4181j1276
$$ y = [102914, -5140, -177486, -202932, -102548, -31160, -7411, 19331, -15313, 28517, 77799, 39582, -74648, -68307, -41729, 65506, 31088, -67870, -93050, -98110, -76503, -54275, -25880, -17276, 167485, 146224, 49806, 16176, -59395, -8168, 196523, 149295, 94648, 103199, 194568, 270123, 217336, 165795, 119468, 120394, -37890, -37073, 100552, 264495, 229320, 114972, 110848, 106741, 96975, -6901, 5502, 12234, -10316, -32339, -12787, -46786, -117887, -28386, 57972, 53690, -3395, -69564, -128271, -15596, 131734, 205889, 277837, 248543, 83285, -111126, -79272, -70404, -39940, 55887, -124152, -241834, -218542, -227461, -228230, -46363, -102304, -131507, -98296, -128719, -111835, -177132, -130704, -47706, -3066, 85630, 81155, 26974, 15698]
25505A5698O1982M0994N6648m2013r3510k2127M410L5165p6023j68960l3916P2899
25493a48753J06497K1698l4629J07623J00545J9088K6539r0640j47977o9889L4527
25482g5371J31256Q3406M3413p1442N4969O8008j02239l7395J15029n9761r4262
25471E5611J21103q0733k52149p7746J21352R1829J0694j20440K6016P4004L0421
25460c8o2970L3310J97368k9590r2557m6173M4874J32224m6976l791L6187j45792
25448A6076M6730O8070J2822M379k7369k8870L0581O7889o9478Q1861o1517r8982
25436D2192m2898k4461q4910j59896K0363J9922o2146k0327M3680k0029K4755
25425b63755J24216J18175J9955L0157q0748m7690M9465r4774M1378K3996q717
$$ y = [15698, 77680, 118674, 175322, 133309, 39799, 17672, 22082, 57247, -18776, -187736, -221652, -148753, -42256, -20558, -55187, 52436, 152981, 172069, 198608, 107968, -40009, -109898, -75371, 55885, 139291, 182704, 111262, 166231, 234239, 132000, 94605, 209634, 149873, 55611, 176714, 95981, -156168, -233914, -112562, -20733, -10039, -130479, -104463, -30459, -38, -63008, -29698, 167670, 138080, 45523, -650, 44224, 176448, 129472, 125681, 161868, 16076, 62806, 130876, 143698, 148077, 120708, 91838, 122419, 190308, 120830, 202691, 141174, 42192, -706, -25167, -110077, -269973, -249610, -229688, -291834, -312161, -268481, -288510, -263755, -139539, -21364, -1409, 28748, -52000, -99690, -50225, -144999, -103621, -79625, -88342]
25414h8342R6342Q6859j43912k5014n0069M216L5995m6834l0633j9223M0364O4414
25402g5837K6826m2083O9802j7468o0031K4572k8235j6457q6528L2156N8684p8120
25390a92719n2839N7665j9357j3281N5502m6525K446J02039O6743O9435J7822
25379D6931l3190p7360J6835J3521M8676K409j31788J1793R7384M3615o0863o8551
25367i0588o0022N750J49109N6690q2377p9234K8873M5608Q3260q7124j67625
25356a97680j3502Q4094J32930Q6854n0135p0523j0623m1524J48723p3112j17437
25345a21935M4533L1448o9803n5361K7877j9805J52824J51880N7258j13575n1054
25334C4287o5468J2922k2249n4071K1792J8856r5223Q0658k295K8562m5657j7927
$$ y = [-88342, 8000, 94859, -49053, -74067, -124136, -119920, -83925, -130759, -161392, -180615, -140251, -75837, -49011, -91094, -21292, -38760, -98791, -74219, -102454, -118911, -205439, -173283, -114599, -192719, -245558, -187893, -207250, -220531, -165029, -211554, -209108, -107069, -40326, 29109, 46931, 13741, -63619, -46784, -33263, 15413, 17822, -113966, -102173, -4789, 38826, -22037, -90588, -150610, -144860, 4249, 60939, -21438, -100672, -71799, -26191, 57069, -30055, -197680, -211182, -127088, 5842, 92696, 42561, -27962, -38585, -80109, 68614, -4498, -121935, -77402, -45954, -115757, -171118, -143241, -163046, -10222, 141658, 198916, 85341, 34287, -31181, -18259, -40508, -94579, -72787, -53931, -149154, -68496, -70791, -42229, -87886, -105813]
25322a05813j1531k9114k9124K7933L4969P6696O5103o3405j09308N2358N3504
25311c7732n417J9597j11513k5259J54871M7542j07987K9523m7800j06033L0119
25300a60089J57208R1155l0529j03512P5153N8384l6459j39546L190M0841o1380
25289a05584R5356R2440j59442j16943M7562L7413l04N222N543K5129J09675J01064
25277A37131O4263q0892k0940N0175J03664l2909k8219p9951n4688j47307j20389
25266b10062R2271N1758K20462J49275l6183n2509r4217j0126j13113L0074Q8485
25255A16115l7186j4821r7655j07264L3124P7971m0335J00664k6304p5775k23698
25244b95164k0527J69241N3333k5816n846j47767k7895o3178J13752J37417R5207
$$ y = [-105813, -117344, -146458, -175582, -147649, -112680, -35984, 29119, -34286, -143594, -91236, -37732, -43149, -23552, -135065, -160324, -5453, 42089, -65898, -36375, -84175, -190208, -160089, -2881, 88274, 57745, -45767, 29386, 87770, 51311, -88235, -85045, -44204, -105584, -10228, 82212, -77230, -194173, -146611, -109198, -109502, -104280, -98737, -73608, 36067, 137131, 201394, 120502, 99562, 149737, 253401, 220492, 192273, 112322, 57634, -89673, -210062, -117791, -66033, 154429, 303704, 267521, 215012, 120795, 110669, -2444, 27630, 116115, 78929, 64108, -33547, -140811, -107687, -29716, -70051, 30613, 4309, -71466, -295164, -315691, -146450, -93117, -118933, -124779, -272546, -300441, -363619, -249867, -112450, -17243]
25233a7243n0135R2718Q4446j23833p3291j10679N8325Q9884K3888k0646l3868
25222h0434M2095k3501m8763R7522q8445l0431J45315M3980p5990L082o7109j2529
25210i5208k5422J3484L7497q3380j33772j1447M2450J37202J41805N3598j75340
25199i8533l6893L828J05071J3562j1437m6593m9655J5749j8702L9012L4075R6099
25187D5583j59643p6782n2781P6939j5410N1175R9331j2363M5412O7829J09655
25176A78945j7499p3990P536J2055r3237m1028n9109N0620J12131K0017m4911
25165E1530n7266o1123m8485R1683R3959P2492p6412j14453L28J09602O1635P25
25153A24215o0238O643o5300M80k9142J8108J39651K8459k07791p3466n3419N0955
$$ y = [-17243, -67378, 25340, 109786, -14047, -87338, -198017, -139692, -49808, -25920, -46566, -80434, -38339, -61840, -110603, -13081, -101526, -131957, 13358, 57338, -18652, -15570, -82679, -95208, -120630, -107146, -69649, -153029, -286801, -298248, -255798, -118596, 23209, 76807, -98533, -135426, -131598, -26527, -12965, -24402, -70995, -120650, -104901, -123603, -84591, -50516, 45583, -114060, -190842, -243623, -166684, -182094, -130919, -31588, -43951, 1461, 69290, 178945, 161446, 87456, 94992, 107047, 13810, -27218, -86327, -35707, 76424, 96441, 51530, -5736, -66859, -115344, -23661, 70298, 142790, 66378, -48075, -47747, 61855, 123490, 124215, 63977, 70620, 5320, 5800, -23342, -5234, 134417, 162876, -44915, -118381, -171800, -120845]
25141a20845O4137O9148j68545j0782P5601o885J5476R0600Q7392l1947j31362
25130f8012M2194R5321j16882p8346m8076N0093Q7513M1150J7317o009o7657N9251
25118G857l5172j4451j17071R9252N5160J48451M9908k9322r185j2101m4384J3581
25106A12523L6905n9114n5060L5093J9658O4990J06828l1095r2215P1338q3313
25095A26538j08190Q8908r583P830p8711o0390k0980R9031J59904q0519j30385
25084f547j20598p8120J13046J4742j8704L5415n646L5277q8491R0714l2955j3854
25072g5721N2363O4982l907K029N9566j3522n8064K9669P565j06266J4329k9218
25060e6195n44L6513o9525L9580m63o0761P973O1190J1043N2566J45666j7102
$$ y = [-120845, -56708, 12440, -156105, -166887, -91286, -98171, -82695, 7905, 95297, 63350, -68012, -25818, 69503, -47379, -125725, -173801, -123708, -36195, 4955, 22272, 16263, -51394, 7857, -27315, -41766, -158837, -59585, -4425, 144026, 193934, 164612, 155427, 143326, 98942, 112523, 149428, 90314, 35254, 70347, 90005, 154995, 261823, 230728, 138513, 209851, 126538, 18348, 107256, 97673, 105503, 26792, -33598, -54578, 44453, 204357, 123838, -6547, -127145, -205265, -92219, -77477, -96181, -60766, -66412, -31135, -119626, -28912, -61867, -75721, -23358, 41624, 37717, 39746, 99312, 85790, 27726, 57395, 64960, -41306, -26977, -56195, -56739, -20226, -89751, -50171, -50634, -111395, -103422, -42232, -31189, 21377, 167043, 149941]
25048A49941m8839m9107m9560L4860r0486o5154J03721R217M2270J2012J4265
25037F3140r6375n6321J09554K7075n4422M9515N5883M6303k8614j9409J8676
25026A15005J2033J12445n978j46239j05368J6489N3996J3161m6167J0128n1276
25015b1771l9070J7119Q5013n4984L3530j20137q5811N8972J10881J37562M8559
25004A69863j25304p9133j08153o1659Q9258M5788J5585M2604N2996K06255n6163
24993A91937j61308j66824K9840O0758k5370M5439M3193Q2004m994l3638N5391
24982A16428o1296k8248k5102k3737N6437k1718q6500K2632L5746n1696k8206
24971i5260p1893K1974J40574N8779j95880p3896O3396R4998M1406J4928q1394
$$ y = [149941, 101102, 51995, 2435, 37295, -53191, -118345, -14624, -5407, 36863, 48875, 63140, -33235, -89556, 19998, 47073, -7349, 42166, 98049, 144352, 115738, 96329, 115005, 127038, 239483, 233505, 87266, -18102, -1613, 52383, 65544, 19377, 29505, -21771, -60841, -43722, 41291, -13693, 19837, -100300, -186111, -127139, -16258, 121304, 169863, 44559, -34574, -142727, -204386, -115128, -69340, -53755, -11151, 41845, 248100, 191937, 30629, -136195, -106355, -45597, -70967, -25528, 17665, 99669, 94675, 61037, 116428, 55132, 26884, 1782, -21955, 34482, 12764, -73736, -51104, -15358, -67054, -95260, -167153, -145179, -4605, 54174, -141706, -215602, -152206, -57208, -15802, -874, -82268]
24960h2268N5172M3433O4080Q9831L7077K3551q6804K1286l7926q6870N5057j1257
24948H4362j53362o8038N9865Q8877K6636J24788k4454j11389L524q7665j6359
24937g3215J35489P4980n8085n7221J9332r3121j13729k6521J39010N7522o6905
24926f2464K08408P5845l2619m4990j53844j22530k7733J54128K8170l8205j3286
24915b9120P6352O0300J4727J43086J2287j80547m1176J4671m4764l7664P8662
24904F6814r742l4766l7380m6485o4231J0289q462k3858n5034N4605q1072p2290
24892c01612J07937J77993J33442N1337j4179K2553j56528K4765M0693K148L5970
24881A24519p1799J02022q4072l9129j5337r6956k2752j7966L3022R1726J8294
$$ y = [-82268, -27096, 16337, 80417, 170248, 207325, 230876, 144072, 165358, 127432, 40562, 95619, 84362, -69000, -137038, -77173, 11704, 38340, 163128, 138674, 27285, 30809, -56856, -73215, 62274, 137254, 79169, 21948, 41280, -51841, -165570, -192091, -53081, 4441, -62464, 145944, 221789, 189170, 144180, -9664, -132194, -159927, -5799, 22371, -15834, -29120, 47232, 107532, 122259, 265345, 277632, 97085, 55909, 70580, 25816, -11848, 66814, 57072, 22306, -15074, -61559, -125790, -115501, -123963, -147821, -202855, -148250, -229322, -301612, -193675, -15682, 117760, 169097, 154918, 177471, 20943, 45708, 86401, 88549, 124519, 52720, 154742, 70670, 31541, 16204, -80752, -103504, -121470, -88448, 3278, 21572]
24870B1572j16605j71240N7637P6918J241L6862M3766J06050J95417N5698j34575
24859A72741j78933o7208l248J7886N701M6336P0717K7710Q480M2231l6298P0474
24847A76589o2495k22285l1461M3734P8231L1221K3495r0930J1165n3493m2079
24836a38308P9431N216K52625K4561r026o6930j08262J1799K5106p0001o1352
24825e5141o5399l2694n7570J03591N1573P4317O7654o6062r2773l1452O873J8721
24813g8362j9437Q0366p1871k932l603j6270M1695R156P0598J9735k2205M7717
24801E4587j03701j19942K9293J16715l3278L9855J51651K1623r3824l4152l8688
24790i861J18190J02219r373j01181n6552P2073Q3656k6719j71739o8950l1428
$$ y = [21572, -95033, -266273, -208636, -131718, -130477, -93615, -49849, 56201, 251618, 307316, 172741, -6192, -73400, -76648, -58762, -53061, -6725, 63992, 91702, 100182, 142413, 106115, 176589, 114094, -108191, -139652, -95918, -17687, 13534, 37029, -53901, -42736, -96229, -138308, -58877, -53661, 198964, 223525, 214499, 147569, 39307, 51106, 76212, 6211, -55141, -120540, -153234, -210804, -107213, -55640, 18677, 86331, 20269, -72504, -103956, -97083, -78362, -97799, -17433, -89304, -92236, -95839, -112109, -70414, -61258, 9340, 29075, 6870, 54587, -49114, -169056, -139763, -23048, -56326, -16471, 135180, 156803, 62979, 28827, -9861, 108329, 210548, 201175, 99994, 43442, 115515, 199171, 172452, 713, -68237, -99665]
24779i9665M3088q7908j23409q7208P1273L644Q1204M5139K7782M5705O0929P2028
24767E2602j3948M5725K9256P0793Q0944o9768q4613p2590l7456o7087k6045q035
24755a00222j657R9865J02127k6304l4086r0865k2690P3371J7524J59440J5241
24744A91744j13906n2812q6439j63026n0696J84137N7951j7629l8021j46299K0824
24733b14172J26244L759r8625L5223J45708p0958P8329J21814K5968q1039m5761
24722B6490p3399o4849O1947L693k8449R042R684J9415q6009o466j5953M5143
24710i9711P8220J01569o740j92485j2813O8884J3718J7068K01176O4573k2600
24699B10859j40756j24467o8474J6466P244k0833K9172J2107j16835M8688L8106
$$ y = [-99665, -56577, -144485, -267894, -355102, -283829, -280185, -198981, -153842, -126060, -80355, -19426, 52602, 38654, 84379, 113635, 184428, 265372, 195604, 110991, 38401, 945, -66142, -92187, -100222, -101879, -2014, 100113, 73809, 39723, -51142, -73832, -461, 17063, 176503, 191744, 77838, 25026, -61413, -224439, -275135, -90998, -33047, -50676, -88697, -234996, -214172, -87928, -84169, -182794, -147571, -1863, -72821, 5508, 127322, 153290, 72251, 26490, -46909, -111758, -49811, -46118, -74567, -65525, -55841, -36426, -122435, -128901, -144854, -99711, -21491, 80078, 73338, -119147, -131960, -63076, -49358, -32290, 168886, 233459, 210859, 70103, -54364, -122838, -106372, -99128, -119961, -90789, -78682, -195517, -146829, -108723]
24688a08723R8361o3241K1035M3717q3998J1031J02407Q1923r6778j00658m4699
24677a39623j4286q230j8029P7536J26963N516q1900j6786L1544o1401P2964J08387
24665H2655K1936j37645K318P4921n4287l3063J78676N7709m6164n0224q7921
24654H911J0049j37923m0212O050J4688L2712K2857o6843J19906J28333j8919
24643G9609J91n2502p918L5803o3383M8605M3986L1737K7553k1596j6363J430
24631A07152J287j15727p175Q5244n532j020R5444p2594j90687Q4480k9242l4614
24619h2984L6674j8533J37312J18913q39r8823p1874m9081M6288J33644N3500
24608B04197n6611q2236r699N0715j4820L3561l2650j07753R0966J19309l0811
$$ y = [-108723, -10362, -73603, -52568, -8851, -92849, -81818, 20589, 102512, 5734, -94924, -139623, -153909, -162139, -180168, -102632, 24331, 29847, -52053, -68839, -37295, -98696, -25732, 82655, 104591, -33054, -30736, 44185, -10102, -43165, 135511, 193220, 147056, 96832, 8911, 18960, -118963, -159175, -153125, -138437, -105725, -82868, -149711, -29805, 98528, 79609, 79800, 27298, 19380, 55183, -8200, 40405, 84391, 116128, 143681, 122085, 105722, 107152, 108439, -7288, -14463, 70781, 65249, 64229, 159673, 87079, -103608, -19128, -48370, -82984, -46310, -64843, 72469, 191382, 190543, 91720, 19846, -29235, 17053, 150697, 204197, 147586, 65350, 55651, 106366, 91546, 125107, 92457, -15296, 75670, 194979, 164168]
24597A64168k41589l2200Q6438o0293j04711J5395K2719r593M9972J53910L1758
24586G5974q9101P2006L3301J5049O7046K5528j5093r7076Q4510j2636j02571
24575E6937m5059N4300Q1553J2398n2152p9904O5590m7242m8379j0711R2971J55525
24563B35827J10879j76356j04656j1339r3788l0263j63088J4156J85544l4180
24553f7264j9656J8672P977Q8248L8539r7066j36463m533O6921J367K473M2799
24541e7986K8443M2323P6646m8936l3247J46908k3767o1378j51773j20483r9223
24530c02473L9768M7826J13433J49359K4580k4816m371l0316j38470p657N1918
24519h1219n293m8687L4153N4898K5763L3282j8880m0503K8591M6444m1352j2684
$$ y = [164168, -77421, -109621, -23183, -83476, -188187, -172792, -150073, -159666, -109694, 44216, 75974, -13127, 58879, 92180, 107229, 174275, 199803, 184710, 87634, 172144, 159508, 56937, 11878, 66178, 147731, 160129, 107977, 28073, 93663, 46421, -1958, -12669, 80302, 235827, 346706, 170350, 65694, 54355, -39433, -69696, -232784, -218628, -33084, -67264, -86920, -68248, -60271, 27977, 66516, -30550, -167013, -171546, -104625, -103258, -100785, -57986, -29543, 12780, 89426, 40490, 7243, 154151, 130384, 69006, -82767, -203250, -302473, -262705, -214879, -101446, 47913, 72493, 47677, 43306, 12990, -125480, -133137, -81219, -86512, -135199, -101046, -46148, -20385, 12897, -5983, -46486, -17895, 28549, -12803, -25487]
24507b5487J87045j25397p9091m4375l6994M3619k4218M7506m5184j5187n4531
24496a72294p2180j4001J56019J80348N9382R395M6596p0135j13424k09253j61342
24485c60889J30189K56776J97930j10596j4177n7494p3505j55745k7221J05787
24475a08945K27947N2537k11438r0919l5997n5100R6092K7145r960j2442l1055
24464a52135q626L9555J21927J8582L916o929N401l1120J5022o0428P0136O0173
24452G5474m4423M7327N0850l7532m6495j88349j32424M4268P3262P404R3830
24441e6808K0860k8608o6461j6409j0183l5528L0307Q3266P638R0897Q4653n9259
24429D4365p8093o6834L0710j6555o4378N7865J24290l8401K7436o8981n0288
$$ y = [-25487, 161558, 36161, -42930, -87305, -124299, -80680, -104898, -57392, -102576, -117763, -172294, -244474, -258475, -102456, 77892, 137274, 146669, 193265, 123130, 9706, -199547, -360889, -230700, 26076, 224006, 113410, 99233, 41739, -31766, -187511, -214732, -108945, 119002, 171539, -39899, -130818, -166815, -221915, -125823, -98678, -108638, -121080, -152135, -160761, -121206, 721, 19303, 23219, 16290, 21691, -9429, 5593, -54835, 15301, 75474, 31051, 78378, 129228, 91696, 45201, -143148, -275572, -231304, -158042, -150638, -56808, -35948, -64556, -131017, -147426, -157609, -193137, -162830, -79564, -71926, 18971, 103624, 44365, -33728, -100562, -69852, -86407, -150785, -92920, 31370, -7031, 20405, -48576, -98864]
24418i8864r8054O3908l6629o583J79200K9880m9269P2716M2538o7712j23043
24407i1912j53986n1277J99036J09829J7172J10353n5225j64547j11757J4793
24397a77521J26682M9782j19523R4727J10402m008l5453K22j4008L9399J17003
24386A87704j4519k7908L3390K7882r6444q3454n4798K4076J68266M7680j15279
24375I6596j83502j19477M3038l2469K4362J01479p7776N0511J22866M2044j00620
24364c2948k2137P8963k0817r2225j10201r380J17544J29096M0790J21020n3533
24353A46172j0364j7180j30260l9798q293l1488m083M7342M9231j0342j04504
24342a13567N3725l6738k2539M6432k5642O7593l5210M0069O4422M0421j52291
$$ y = [-98864, -196918, -133010, -169639, -176222, 2978, 32858, -16411, 56305, 98843, 31131, -91912, -245898, -297175, -98139, 11690, 28862, 139215, 83990, -80557, -192314, -177521, -50839, -1057, -120580, -25853, 84549, 80541, 45088, 45310, 31302, 70701, 187704, 173185, 145277, 178667, 206549, 110105, 26651, -28147, -4071, 164195, 211875, 96596, -86906, -206383, -163345, -195814, -171452, -69973, -147749, -97238, 25628, 67672, -32948, -55085, 23878, 3061, -89164, -199365, -208745, -91201, 37895, 78685, 199705, 146172, 135808, 118628, -11632, -51430, -59723, -91211, -95294, -47952, 1279, -9063, -113567, -59842, -96580, -119119, -72687, -98329, -30736, -65946, -25877, 38545, 78966, -73325]
24331g3325R9124N8870l3460O686q4251j1708N5018k6713Q3076J43977j47640
24320F9654o6649N223R5114m7685n0335N8848r7946m9860M9118j7958O2123Q9298
24308I8945O9338N6539M5682J2722k7505q6760n2177o2190n2701l3735j4385l2380
24296g8607m2608J31470P8022M223O1835j39379m8761j6171m0119N4170M6853
24285A0928o1010l7651J11223R5032j01835m0999O9834J037J8090M710K0465m2590
24273D7234q641j17685P3492k5197j16752J52114O5885k8710k7439k4526M105
24262f120Q6025J32888l7267m0958J6460j39492l4958l6382K8744N4229o1452
24251c8283J390R4161P8775q468j9532L849L1610l3056l9716n6349m1950m407
$$ y = [-73325, 25799, 84669, 51209, 57895, -26356, -38064, 16954, -9759, 73317, 217294, 69654, 3005, 8228, 103342, 55657, 5322, 64170, -33776, -83636, -34518, -52476, 9647, 98945, 168283, 224822, 270504, 283226, 255721, 168961, 116784, 54594, 1893, -31842, -46227, -78607, -121215, 10255, 88277, 92500, 154335, 14956, -33805, -49976, -90095, -35925, 10928, -50082, -87733, 23490, 118522, 16687, -24312, 45522, 46559, 64649, 69359, 89824, 47234, 38593, -79092, -5600, -30797, -147549, 4565, 70450, 41740, 14301, -10225, -6120, 79905, 212793, 175526, 134568, 151028, 11536, -23422, -59804, -31060, 23169, -38283, -36893, 57268, 136043, 127575, 108043, 111892, 143502, 110446, 70730, 14381, -27569, -31976]
24239c1976K0596O2889J5215k4307l5954M709N4530q9782o3475j058J048O7115
24227b0450q024n8803j2990m9057O3016J22195l4596K7584k8071n3958M4040k0997
24215c0111l2486j0911L2840j9926j23681O1233M8208k9037o9391l0243J26032
24204g7473J04175k801O0496K2683o678k28854j48094p7739L7417P0471j6745
24193b63142q7664P4029J01857K3220m339N6374M390N4837K1115p8569j27370
24182b25262m3840k140N3604J49049R5904q522o6188j1457M8490J22194M8915
24171A60747o4805m0378j12661o249L1815n6511J02293J78447l1136j31196j6895
24160A3471j27325n0801L1707N9125l7413n1441j08476J60398N0514l689J0756
$$ y = [-31976, -11380, 51509, 66724, 42417, 6463, 11172, 65702, -24080, -87555, -88613, -87565, -20450, -28474, -87277, -100267, -149324, -86308, 35887, 1291, 28875, 804, -53154, -9114, -30111, -62597, -73508, -40668, -60594, -184275, -123042, -74834, -103871, -173262, -203505, -77473, 26702, 23901, 84397, 107080, 100402, -128452, -276546, -354285, -316868, -246397, -263142, -350806, -276777, -174920, -151700, -156039, -99665, -95275, -40438, -19323, -97892, -225262, -269102, -271242, -217638, -68589, 27315, 18793, -47395, -58852, -10362, 111832, 160747, 95942, 55564, -57097, -63346, -31531, -88042, 14251, 192698, 161562, 30366, 13471, -113854, -164655, -132948, -73823, -111236, -162677, -271153, -110755, -60241, -63930, -53174]
24149e3174l4214k7289J01777L2885n3736O4448J1390j12311l26P2240p0359n1549
24137a20218J27499J15657j05794k6359n5984p9050R3374M3150k9071p9285Q0398
24126c5683n1404j5556l2964n6277J39956Q4944l0179L529j1279Q7135o5965j92059
24114a75802L8942J09807n7924M0963J06069k1643L7673K1752j49727j31427P2533
24103a08784J75371m5447m5090K3664M3678R9870L6792j94214n6808Q0918L4252
24092D4202j01279p7641l1708O4938N7552M7691k0376O0281m2762j08234k8208
24081a35544j2009P5757K8011N7980j4886p4821M6494M2164O0588L0784m3290
24070F1228j25174K1817K3726J522O303n2842n5282p8312O2678M4190O8551Q6375
$$ y = [-53174, -87388, -114677, -12900, 19985, -33751, 30697, 42087, -70224, -70550, 1690, -68669, -120218, 7281, 122938, 17144, -9215, -65199, -144249, -50875, -7725, -36796, -116081, -35683, -87087, -102643, -135607, -191884, -51928, 33016, 2837, 6366, -4913, 82222, 16257, -175802, -136860, -27053, -84977, -44014, 62055, 40412, 78085, 99837, -49890, -181317, -108784, 66587, 21140, -23950, -286, 43392, 143262, 180054, -14160, -70968, 9950, 44202, -57077, -134718, -166426, -101488, -43936, 3755, -16621, 43660, 898, -107336, -135544, -147553, -71796, -43785, 14195, -691, -75512, -29018, 13146, 73734, 104518, 61228, -63946, -42129, -18403, -16881, -10578, -63420, -118702, -197014, -134336, -90146, -21595, 64780]
24058F4780M6546n5427p9350j74076j07621m3788j7386K4301K05376J05391m1583
24047g2837R1177J39329m0861o2340J5567J8386N8922O8478n7377M8775J9586
24036B26805m346j01706j28427O0116k7049n2142p7364R8524l4550o6105o9605
24025a75849O0959L3931l9674r0327Q1793J31551J57831j51817R4719Q4292j08515
24014G8894j68858r7596M1755J63016J92323k8845j48348o8979n3571N1528Q8073
24003D9392N8246L2787J45632m1809q6325k3848p8909m5266n5177J12556J18320
23992A85599P1617j36502m2506k7327k2004K2755O7571l5120j5692k8623k9206
23981A0562k1060j04657m3196O5581N5019J69273J42709L3453r2761q2351P2974
$$ y = [64780, 111326, 55899, -23451, -197527, -305148, -348936, -366322, -342021, -136645, -31254, -72837, 18340, 157669, 116808, 54468, 70035, 88421, 147343, 215821, 158444, 207219, 226805, 222459, 120753, -7674, 52442, 25393, -26749, -104113, -5589, -40139, -106244, -175849, -114890, -80959, -120633, -210960, -129167, 2384, 160215, 8398, 103117, 187409, 78894, -89964, -187560, -145805, 17211, 209534, 180689, 32341, -36638, -90209, -38681, 49392, 107638, 140425, 286057, 244248, 157923, 134075, 55166, 9900, -45277, 67279, 185599, 257216, 120714, 78208, 50881, 28877, 51632, 119203, 84083, 68391, 39768, 10562, -10498, -115155, -158351, -92770, -37751, 131522, 274231, 307684, 214923, 132572, 205546]
23970B05546O1131q6051o9934J02521r916o3774O6089O0265j04631j33160n2157
23959b4071L6319R0992l7858o4452J2492l330r7615l2338J60808N3073M1707J1141
23947A46868M4229k4293q7762r2294r2200M1831Q4214K9554n0299K913L51r339
23935f227j23482M7086P1155k2877M858J35208J5995K3645R9350M3493m0933k9272
23923B17999j03356j48061n4325k0378J2948K4153k041O5044K2053l7378r433
23912c2775q1351j00514R4927M8968J09475q6907j15762m6018P3675j5719r1080
23901b43081M1500P5100M3849O4297P4446J16180m2002m087o0511l213R7283L0208
23889A89969o4492o714L0644l835p1429k8760K9709J2929j82325p9475j7580L5979
$$ y = [205546, 266677, 180626, 110692, 213213, 203297, 139523, 205612, 265877, 161246, 28086, -24071, 12248, 103240, 65382, 930, 13422, 10092, -87523, -119861, 40947, 94020, 135727, 146868, 191097, 166804, 79042, -13252, -105452, -63621, 20593, 50147, -152, 2761, 3112, -6227, -129709, -82623, -11468, -34345, -29487, 105721, 121716, 145361, 244711, 288204, 247271, 217999, 114643, -33418, -87743, -108121, -95173, -71020, -73061, -8017, 14036, -23342, -32775, -114126, -214640, -119713, -70745, 38730, -48177, -163939, -209957, -136282, -152001, -243081, -201581, -126481, -82632, -18335, 56111, 172291, 130289, 126202, 65691, 62478, 159761, 189969, 125477, 118763, 149407, 145572, 74143, 45383, 75092, 88021, -94304, -173779, -191359, -155380]
23877a55380N6343M9246J48967N445n7443P9011l8280r0569O2003Q8457j12141
23866C5659r256M3516P7436o1109o3578o5093p3318J3231J5315P8684P4506m663
23854F1330J2628n0485j14745p8014M2535M2906K583q6794O7009K11382p5605
23843C4730q1758n5702o4327K0031Q8430q1517M1767P7787P298n877L1295m0325
23831b8168j5086N0016P9701m2552p2838J8863p50N489J5868j15189p8247P0050
23819a12843L4109P9433J41322r4542j11744J4380J77327M7382k9838M7488J21756
23808C14230m9487k45212j33094K8964k7990l9140O2873M7122P6754P6672Q5863
23797A97555k5534q5060k9869j4077k1522l1159M8349q6766j26111O6805j4218
$$ y = [-155380, -99037, -49791, 99176, 104621, 47178, 126189, 87909, -2660, 59343, 147800, 35659, 26403, 69919, 147355, 86246, 22668, -42425, -115743, -102512, -87197, -8513, 65993, 61330, 73958, 23473, -91272, -169286, -126751, -83845, -81262, -168056, -101047, 110335, 34730, -47028, -102730, -167057, -147026, -58596, -140113, -98346, -20559, -13261, -19138, 12157, -28168, -43254, 6762, 86463, 43911, -28927, -10064, -10814, -5325, 10543, -104646, -182893, -112843, -78734, 699, 142021, 47479, -64265, -49885, 127442, 174824, 144986, 192474, 314230, 264743, 19531, -113563, -84599, -112589, -151729, -88856, -41734, 35020, 111692, 197555, 172021, 86961, 57092, 43015, 21493, -9666, 38683, -48083, -174194, -107389, -121607]
23786a21607L40K4928K7850L0780O4994m3951n31K2648n566L607N5653J73227
23774B32372K338j17681K0420l5318j55348l3637k3522J02291O3650q6180P6004
23763D5389n5202L9008J11020P0656J9742j08791r4636n8972j6833J13207j5124
23752D9464n7332K9388J51369j06010j85538l2531l9099L5841R8367J4538m7782
23741h9325l2428k1482l7801O4810N2065M8975R636M1877J7232m0182m7755J5005
23729a9373l264n9740O3847Q5604l0517q4666M8700R5903q0990q8066j01613N6353
23717a17822K4487R2307p548j2934J66653J34196L6111j51949Q543J8397n5699
23706A34742m981K0344M8290m0636J7257m4424k8648Q1566j549j15327q2700k6362
$$ y = [-121607, -121267, -96339, -68489, -37709, 27285, -16666, -17197, 5451, -115, 3492, 59145, 232372, 234710, 117029, 137449, 102131, -53217, -86854, -110376, -8085, 55565, -30615, 45389, -9813, 29195, 140215, 210871, 230613, 121822, 27186, -31786, -48619, 64588, 49464, -7868, 21520, 172889, 66879, -118659, -151190, -190289, -154448, -56081, -41543, -89325, -121753, -143235, -181036, -116226, -64161, -15186, -5550, 36327, 53559, 13377, -34378, -19373, -22637, -82377, -18530, 67074, 36557, -48109, 591, 96494, 15504, -72562, -174175, -117822, -93335, -1028, -8576, -21510, 145143, 279339, 315450, 163501, 172044, 190441, 134742, 129761, 150105, 198395, 157759, 175016, 130592, 101944, 183510, 181961, 66634, -16066, -42428]
23694d2428k8594N0485K9368M3970O6626j14190m8231K5804q091j14954l4909
23683a75144Q6827O9009J864j5122M5060K1728J15368j48922k16324R411J68212
23672c8033J83395J4316n9407r9674k18n8148j1419M8405L2385p8061N5819P0946
23660F0306l5904j24571Q9169Q8344k04731l4937L0682K4770N5457j5752o403
23649g3570j80658l3828J35877j366J33587m9863p6121N7638K7365r888L8439
23638c2388j4446o283J35106P9121j586J6171Q9575o3879r7457N0727l6492j10777
23626G392j42258M2143K3127K9582J1258J01803R9006J0797M5415l8356n5712
23615A34197j42751k3321R1628M3766K3986K902K7579K6859q6547j52778o5083
$$ y = [-42428, -71022, -20537, 8831, 52801, 119427, 5237, -42994, -17190, -25281, -140235, -175144, -88317, -19308, -17444, -32566, 12494, 34222, 149590, 668, -215656, -206245, -38033, 145362, 159678, 100271, 597, 379, -57769, -69188, -20783, 11602, -66459, -10640, 60306, 24402, -100169, -11000, 77344, -127387, -162324, -131642, -106872, -51415, -67167, -73570, -254228, -288056, -152179, -153545, -19958, -69821, -145942, -88304, -60939, -70827, -32388, -46834, -53117, 81989, 161110, 159524, 175695, 265270, 201391, 103934, 154661, 118169, 7392, -134866, -92723, -69596, -40014, -28756, 73047, 172053, 182850, 228265, 189909, 134197, -8554, -31875, 59753, 103519, 127505, 130407, 157986, 184845, 98298, -54480, -119563]
23604a19563J22144K13252L9326j9230k5270Q891o5800r3754n3317P665R5608
23593A09952P4425j15123o6220Q8259N5002p8776p5678j6989j7325Q7051M4879
23582H9457o1816M2452k3534l5376p3315j3580M9736k5440O1035j127m6106k2993
23570f0607m6812k2022k166L0312O6882O0238j8605K4898J11118j20201l2088
23559i053J46764J4351j6690N9899m0469k19482j46316q8009O8262J49875L5264
23548d5604m8764o4454P5727M5645J7050j25872j21667K5488J23467m4663P0404
23537i3243K35566j2211j10125l4455n6127n0614M1267R8580J14733L9747j11474
23526F1644j24306p2975J3540M8969k4287P0189J50842L3008r6214j35516P8914
$$ y = [-119563, 2581, 215833, 255159, 235929, 210659, 219550, 153750, 59996, 6679, 14344, 109952, 184377, 69254, 3034, 91293, 146295, 67519, -8159, -25148, -42473, 44578, 89457, 27641, 70093, 46559, 11183, -62132, -75712, -25976, -51416, 9619, 8492, -37614, -60607, -107419, -129441, -131607, -101295, -34413, 25825, 7220, 32118, 143236, 23035, -9053, 137711, 152062, 135372, 195271, 154802, -64680, -210996, -299005, -230743, -80868, -45604, -94368, -158822, -83095, -37450, -20400, -146272, -267939, -242451, -118984, -163647, -93243, 142323, 130112, 19987, -14468, -70595, -121209, -79942, 18638, 133371, 173118, 61644, -62662, -135637, -122097, -73128, -97415, -27226, 123616, 156624, 60410, -75106, 3808]
23515C808Q9834L8261P8202j40159p4861l5513K3896M9669P1437k0734q0725P142
23503A0257M0971J1438k9531l4226r033m3400l5693r4611J0919Q1299p2865R7468
23491f7007J2435k159Q9472L3670O756m7655k6754M6966J5902j47070l269J64672
23479G5959L1891r9615L9061L8708q1990L3910P2092K5455K8370q9327j80972
23468a06458k6279J22194J49700j5827q858k2963n7767j07488L015J14469l7825
23457E913j28703j13258m292K2851k5091J75354J02762J6211L251j26598j56107
23446b27707m3743J35406L7035m5825j8237k7590P2109O5546P5479n7064p3660
23435a08251J4444o1951J65428R1203q2814k1730m1256K5612l534Q7318m1285
$$ y = [3808, 93642, 131903, 210105, 69946, -4915, -40428, -16532, 33137, 104574, 83840, 3115, 10257, 51228, 62666, 33135, -1091, -10124, -53524, -89217, -183828, -172909, -91610, -164475, -67007, -54572, -56731, 32741, 66411, 73167, 25512, -1242, 45724, 61626, -85444, -88713, 75959, 107850, 8235, 47296, 86004, 4014, 37924, 110016, 135471, 163841, 74514, -106458, -132737, -10543, 139157, 123330, 114472, 91509, 33742, -73746, -70731, 43738, 5913, -122790, -236048, -240340, -217489, -242580, -67226, 35536, 51747, 54998, -71600, -227707, -271450, -136044, -99009, -144834, -163071, -190661, -118552, -53006, 22473, -34591, -108251, -93807, -155758, 9670, 100873, 18059, -3671, -44927, -19315, -22849, 64469, 23184]
23424B3184q396J11051P1344L2230j11077q4755j29858J29316J00060j5647n1914
23413F5538j6634l8561J22604J22963K946j14084m9438J8092o1560P3957o7205
23402E8618j00961r5567j2277m5462O6040M5032j2683J03653L63p2704j68824
23391b34772o1812K8708J10901L6951J09873N4655J5975N6343l9349l979K8469
23380A01963O239m7214j49529K6071J63678J71226M5617K845J2707r1916m2533
23369A99154n3770k3039j17380R489J72971M0264o2085j76502L6282J7325j75932
23358a33223j5767P760Q9810R3645j04544k7016J56114M6891N104J46o3066q7034
23346c1180K5197l3203J0495M8867J29761m7273l5640q5585l1604m862o3238n171
$$ y = [23184, 14788, 125839, 197183, 229413, 118336, 33581, -96277, 33039, 133099, 117452, 65538, 48904, 10343, 132947, 255910, 258856, 144772, 95334, 113426, 51866, 125823, 58618, -42343, -137910, -150187, -195649, -129609, -84577, -97260, 6393, 6756, -65948, -234772, -296584, -267876, -156975, -120024, -10151, 44504, 60479, 116822, 77473, 73494, 101963, 108202, 60988, -88541, -62470, 101208, 272434, 318051, 320896, 333603, 241687, 199154, 145384, 122345, 4965, 14454, 187425, 227689, 165604, -10898, 25384, 42709, -133223, -148990, -141230, -51420, 42225, -62319, -89335, 66779, 113670, 118774, 118920, 55854, -31180, -5983, -39186, -28691, 20176, 149937, 102664, 67024, -18561, -50165, -55027, -118265, -123436]
23334a23436p4170q524J68898P838k679L4000j47867p3393l4270J21465J32746
23323F08J0310k0704K5822j4905L8964p4698p3789j837n4417K7733J90530N3383
23311A07000k3998o817K067l6464m3892K5508o8134J5996M7356M8726M9437K4230
23299A41015q4387j47126m818J4110n9817j5153J22334L4054Q742j26553J5662
23288a01937J2389J0087J48671N7596K9996r5500j22306K4680J10189J36150m9731
23277A60284j00911K6621o3940o3482K7820p0092M3506J17385J8496R5695J03162
23266B94544J3371j21892r4271m655J1799K1841J02367M2900Q2664j3943m5959
23255B88766j42986q6818M0904k6735L0409M0365p8265r922N5590Q6987K0035
$$ y = [-123436, -197606, -206130, -37232, -29394, -32073, 1927, -145940, -219333, -253603, -132138, 608, 10918, -9786, 16036, 1131, 40095, -34603, -108392, -110229, -164646, -136913, 53617, 107000, 83002, 76185, 78252, 41788, -2104, 23404, -44730, -28734, 18622, 67348, 116785, 141015, 56628, -90498, -95316, -81206, -141023, -156176, -33842, 212, 8954, -117599, -101937, -89548, -79461, 69210, 126806, 156802, 61302, -61004, -36324, 73865, 210015, 160284, 59373, 85994, 22054, -41428, -13608, -83700, -40194, 77191, 95687, 191382, 294544, 307915, 186023, 91752, 87097, 98896, 120737, 223104, 266004, 348668, 334725, 288766, 145780, 58962, 99866, 73131, 103540, 143905, 65640, 55718, 111308, 198295, 218330]
23244B18330j02101K1162J18471p0013j32230j43269Q779R7395O2590J9344K7043
23233A25501K0633o4871j4032O8391J0192p9930J2430J04619j07413j52766O3190
23222a4056R5565J3166j86151m428J1619j08540M5858J3000L4376O4990j6858
23211e1459r8710l8350J25354k2122m8445j45464M1153J62394Q2093k2016J3316
23200b256l0800K7313n6232j24964l7714J26913J87388l6949l1566J7412l8964
23189d19P824O4364K9921m0756k1944j05570K9165N8156J7119O4630m4220J531
23177E9801j3186j6125j99251j00857L3443J18013J28357J18853J9134l0208J9361
23166A37335J32253k8043r3032r3395K898N9963J8751r7953M7944m5834p2089
$$ y = [218330, 116229, 137391, 255862, 185849, 53619, -89650, -80871, 16524, 79114, 98458, 125501, 146134, 81263, 67231, 135622, 145814, 65884, 78314, 182933, 75520, -77246, -14056, 81509, 94675, -91476, -95904, -84285, -192825, -146967, -133967, -99591, -34601, -51459, -150169, -188519, -63165, -85287, -133732, -279196, -238043, -75649, 6444, -15572, -2256, -33056, -5743, -61975, -186939, -224653, -97740, 89648, 52699, 21133, 38545, -419, 7405, 71769, 101690, 60934, 38990, -66580, -37415, 20741, 37860, 102490, 58270, 59801, 46615, 30490, -168761, -269618, -236175, -118162, 10195, 129048, 148182, 117974, 137335, 269588, 241545, 148513, 55118, 58016, 117979, 136730, 38777, 86721, 40887, -31202]
23155c1202j21180L2929J6217L242O7090J56263Q2302M2461K1030l7806p4226
23144A57120O4312j6480j02950j45155l9300O3277J17549K6437R8574M7679l3306
23133B37757n708K9170n6201M9845Q7538k37136q8539M9690l350J9148O1471q8215
23121E5470m7858J26632J19534M8588K07641L17712L66108M47223M71217L29984
23111B442251K14137l5145k25979l77155m75164l39291k07224j89720k44833j61995
23101C99882n8131M9258O6912M1293m3181j83337l8883J27607R5069j4639j21226
23090C20624J6954o0821r0414N0478J43846n2132J3861M3698q6313j69554j31139
23079i12p872L3982L7752L9594m0507n9453O7139P8431r1378K1312J01058l9733
$$ y = [-31202, -152382, -119453, -103236, -99994, -32904, 123359, 205661, 248122, 269152, 231346, 157120, 221432, 204952, 102002, -43153, -82453, -19176, 98373, 124810, 223384, 271063, 237757, 232049, 261219, 205018, 254863, 342401, 105265, 16726, 66416, 63066, 82214, 143685, 55470, 7612, 134244, 253778, 302366, 510007, 827719, 1193827, 1641050, 2112267, 2442251, 2656388, 2621243, 2395264, 2018109, 1542945, 1203654, 996430, 806710, 561877, 399882, 341751, 391009, 457921, 499214, 456033, 272696, 233813, 361420, 456489, 441850, 320624, 337578, 276757, 186343, 236821, 380667, 328535, 342396, 386094, 299781, 130227, -912, -8784, 25198, 62950, 102544, 62037, 2584, 69723, 148154, 56776, 78088, 179146, 139413]
23067A39413j25770K1859m0905N7637J2489k452k8286r4479O9434Q2841N6634
23056A48415L4293J05021m6393r5996J6091l0108O0210O4483q847m3449J19446
23045C23166M4586J1248j17193j07799j19777j9593J27224J97040N9953o704k9181
23034C62970j74702j01359k0542L6688j709Q7851K0911P4538o1352m5796n5961
23023A21537j13038m7262j8716O586l278O7596P4860N3790N2641j83005o3264
23012e1553J54430o1726j28363J0899J01497n8692O7489Q9482L8056r060M5580
23001A98039n3165L3113j1066j08464n3660R9286n4439q8044N136p401m0720p3558
22989a54943l1210O4375P7382Q879j3295J11297j02955p2854n3157J308M6336
$$ y = [139413, 13643, 35502, -5403, 52234, 64723, 62271, 33985, -60494, 8940, 91781, 148415, 182708, 287729, 241336, 145340, 161431, 131323, 191533, 256016, 247169, 203720, 323166, 367752, 379000, 261807, 154008, 34231, 14638, 141862, 338902, 398855, 392151, 362970, 188268, 86909, 66367, 103055, 101346, 189197, 210108, 284646, 223294, 177498, 121537, 8499, -38763, -57479, -50893, -54171, 13425, 88285, 142075, 194716, 11711, -51553, 102877, 41151, -87212, -76313, 25184, -33508, 33981, 123463, 161519, 152459, 198039, 144874, 177987, 166921, 58457, 4797, 104083, 49644, -38400, -33264, -40665, -81385, -154943, -186153, -121778, -44396, -35517, -48812, 62485, -40470, -113324, -166481, -165173, -118837]
22978a18837J09177K7138o9522p5202j5710J31984N1611K0355N2684l5355m9647
22967B8676n0690O5095M8636k0329l1898L7350j5272m3540k3338m4365K9034Q7963
22955F7322L5235n0325O5579J8137O672J13743K7316j3655k2716r4231o9224l548
22943H0305q6147n6821J29632K0783J7856l249m3827J18442K2565j22867j11663
22932c4991R973Q3179p0082O2290K37j1443l2004J883K7869o9845N8292P5089
22920A00447m4437q475N4493j2487J00465l1230m6071O0206n2984j85232N650
22909e9655L6184J555j3589L8905P7061Q7020m0734M221m8761l7688L292k2249
22897B5562m5162m2289n924K4189N4262O3246q4500j9837O5910k0069J03567j10295
$$ y = [-118837, -9660, 17478, -52044, -127246, -142956, -10972, 40639, 60994, 113678, 78323, 28676, -22014, 43081, 91717, 71388, 39490, 76840, 61568, 18028, -5310, -49675, -20641, 67322, 102557, 52232, 117811, 135948, 142620, 256363, 283679, 270024, 247308, 153077, 83853, 80305, -5842, -62663, 66969, 87752, 105608, 102359, 58532, 176974, 199539, 76672, -34991, -25018, 58161, -11921, 50369, 50606, 39163, 7159, 9042, 36911, -32934, 25358, 100447, 56010, 47535, 102028, 89541, 190006, 158776, 112705, 172911, 119927, -65305, -59655, -23471, -21916, -35505, 3400, 80461, 167481, 126747, 130968, 82207, 44519, 47811, 25562, -19600, -61889, -67813, -43624, 10638, 73884, -10616, -30453, 35457, 15388, 118955, 8660]
22885H660j49754k3599L2334J53751L9205j22631p7385M0276K0230N7653R7590
22874G6330K2617o7410J0692p032k3982j3438m3693R9351k4680n2181k1055r186
22862e3667K7489j0335J82596J67792m4607j31515o7268N1576L4195j85723N3056
22851B3589J22127j17867m1919j4328Q2640j1778M5084N2351m4975J333Q5407
22840A81664O6845j7121j59423n7690J09890N6813K9060j9813l4010M8091P2982
22829B77288J6042n0947m3507J7504J1482P8985j5116J35424j1351m406R801j04462
22817C16737p5767j04547l0945J89567K21928J590j25353p1719O5228j51509j83169
22806E2041m7566m506Q8755J80106k9238n7594r7998k7979n2764J04842K864n6103
$$ y = [8660, -141094, -164693, -132359, 21392, 60597, -62034, -139419, -99143, -78913, -21260, 76330, 98947, 31537, 42229, 35197, 11215, -2223, -45916, 53435, 28755, -23426, -44481, -53667, -26178, -36513, 146083, 313875, 269268, 137753, 70485, 122061, 156256, -29467, 23589, 145716, 27849, -14070, -28398, 54242, 42464, 87548, 139899, 94924, 96257, 181664, 248509, 231388, 71965, 14275, 124165, 180978, 210038, 190225, 156215, 204306, 277288, 293330, 242383, 198876, 216380, 227862, 306847, 291731, 427155, 415804, 411398, 421199, 316737, 240970, 136423, 105478, 295045, 516973, 518563, 393210, 321491, 386719, 235210, 52041, 4475, -31, 88724, 268830, 239592, 181998, 84000, 56021, 3257, 108099, 110963, 54860]
22794E4860M2960N9796M0991Q7785k68n5823N4182m048j56888J1195M5858o4702
22782A15898j21132L3264r2176o7365L5719J9257K5179J6257P061O2208R8826
22771A32996M8901P8915m4943l9093j3574p5264m242n5397l983L8601j08015N5968
22759A0870N9623j6955k9268q570q5333q9589P5012J20723J30623l5210o9255
22748F2671R9685R8895o7337n1467j0052k7433J46985R3698l8262m285r4975K3539
22736B31662Q5606R7641l0755j19277k7033j0421L4159k0022J579K2270k8186
22725B37223j8726O1938r5974o1059n3198P9900Q9637J17461o4227o3012m3660
22714A86303k5850R7157J13051J1001L7163j360j29655q5042M9879M9417l8003
$$ y = [54860, 97820, 157616, 198607, 286392, 286124, 230301, 284483, 280435, 123547, 134742, 180600, 115898, -5234, 28030, -64146, -131511, -95792, -76535, -51356, -35099, -28038, 34170, 132996, 181897, 260812, 215869, 176776, 163202, 87938, 83696, 28299, 24316, 62917, -45098, 10870, 70493, 53538, 24270, 15700, -69633, -159222, -84210, 36513, 167136, 131926, 62671, 162356, 261251, 193914, 142447, 132395, 104962, 251947, 345645, 307383, 303098, 208123, 231662, 317268, 414909, 384154, 264877, 237844, 227423, 261582, 241560, 243139, 265409, 237223, 218497, 280435, 184461, 123402, 70204, 150104, 239741, 357202, 292975, 229963, 186303, 160453, 257610, 370661, 381662, 418825, 417465, 287810, 202768, 252647, 302064, 264061]
22703B64061q0795j04106m2124k2204K2067O5193l63P5185L8383R6465P1410M1364
22691D24536P9845m5509n3455K210K4104j04747k3670m797q418n8402M9089M5262
22679C26048O559J21369k6435J62k3569R280k6370K5949J25884O2668L5650P2292
22667G09487Q50n759j306j56788j28180J614O1400J55666m991K152k3327k1694
22655E89124k3820M7049J30010J32736k7775l1476J00930N8021Q7952K7230Q1287
22644A171268K04728K11842L10225M19899M73091M54676K48203k2972l87948l71121
22634B711891l83878m04710l37206j41535o779m5513l0231M3380J7892M263K4408
22623A451982O5736P653j20699n8546K7371K14360K2326J04402R8338j57072j00090
$$ y = [264061, 183266, 79160, 37036, 14832, 36899, 102092, 101729, 176914, 215297, 311762, 383172, 424536, 504381, 458872, 405417, 407627, 431731, 326984, 303314, 298517, 290099, 231697, 280786, 326048, 332607, 453976, 427541, 427703, 404134, 413414, 387044, 412993, 538877, 601545, 637195, 709487, 710337, 704578, 703272, 546484, 418304, 419918, 481318, 636984, 631993, 634145, 610818, 589124, 565304, 612353, 742363, 875099, 847324, 815848, 916778, 974799, 1062751, 1089981, 1171268, 1375996, 1587838, 1898063, 2317962, 2791053, 3245729, 3493932, 3470960, 3083012, 2711891, 2328013, 1923303, 1586097, 1444562, 1437783, 1392270, 1362039, 1405419, 1423311, 1427574, 1451982, 1517718, 1525371, 1404672, 1346126, 1373497, 1587857, 1610183, 1714585, 1812923, 1655851, 1555761]
22612A555761J01143J15092J8680r0490o5379J13995J42944N1606R6378n019J32397
22601B167108J17902J74826J68258n048J35386J09811J56713J41166K01753K48115
22591C615990K52306L94794L84038M01892L69325K97211L45418N30347O75794
22582G267115P76601Q88085J093823J340284J727911K354704L132702L908244
22574B2489469N108871O759847Q827652J1643208J6803233K6378659M1570091
22567A39581030O0124029P6790063Q5542837P1758339M2514919O683657m0265831
22560D42729043p0387961p6119286p3256489n7910075l7353455k3287560j5439571
22553H8974646j1032503q365321o404156n082265l827840l027448k595243k389078
$$ y = [1555761, 1656904, 1771996, 1790676, 1700186, 1634807, 1748802, 1891746, 1943352, 2039730, 2034711, 2167108, 2285010, 2459836, 2628094, 2623046, 2758432, 2868243, 3024956, 3166122, 3367875, 3615990, 3868296, 4263090, 4647128, 5049020, 5418345, 5715556, 6060974, 6591321, 7267115, 8043716, 8931801, 10025624, 11365908, 13093819, 15448523, 18581225, 22489469, 27598340, 34358187, 43185839, 54829047, 71632280, 98010939, 139581030, 199705059, 276495122, 362037959, 433796298, 476311217, 482994874, 442729043, 372341082, 296221796, 222965307, 165055232, 127701777, 104414217, 88974646, 77942143, 69576822, 63172666, 58090401, 54262561, 51235113, 48639870, 46250792]
22545D6250792k066157j975600j912069j594317j359943j264178j180992j001507
22537C3896029q17735r02972q80882p51411p22213p78027q46869q50536p60641
22528B6584743p15109n86432o56213p12168n21531n45813l57260m61970n30757
22519B1497490n86250p36925p75615o11699o38763o16951l83846l34093m20905
22510A6392443l70655l65904l88568m59415l94506j76448l78279k79655l51349
22501A3227664m24904l19109k26071j44187k13765k71271j81961j28631q4933
22492A1232832j77458m2626J20153J57965L00022K71825k8202j05512l29540n93784
22482A0805675o48798n84069n06146l77091k31987j61885r4383j11962k51061
$$ y = [46250792, 44184635, 42209035, 40296966, 38702649, 37342706, 36078528, 34897536, 33896029, 33078294, 32175322, 31294440, 30543029, 29820816, 29042789, 28195920, 27345384, 26584743, 25869634, 25283202, 24626989, 23914821, 23393290, 22847477, 22490217, 22028247, 21497490, 20911240, 20174315, 19398700, 18787001, 18148238, 17531287, 17147441, 16813348, 16392443, 16021788, 15655884, 15267316, 14807901, 14413395, 14236947, 13858668, 13579013, 13227664, 12802760, 12483651, 12257580, 12113393, 11899628, 11628357, 11446396, 11317765, 11232832, 11055374, 11012748, 11132901, 11290866, 11590888, 11862713, 11834511, 11728999, 11399459, 10805675, 10156877, 9572808, 9066662, 8689571, 8457584, 8295699, 8201316, 8089354, 7838293]
22473G838293j58860k76926k24693j85211j5942q3395j40306j73782j50480j5431
22463F413267j45158k35039l20602q9118l3242Q729j84319p8063j55561l3970
22453E146924r2810r6268p1773Q9845J66748k70678k31429k9652l9732r1087j18946
22442D361142r0816L9750J271J2051Q5777r7247j16895k8587q9868j08239K0423
22431C988762p6915p2319J5269q424p3506j46562k21642j7901J22553K2550L9117
22420C570982p4563j65880k53848j80936j11823m7518l6541o916j13515j12409
22410B467033J4793j6450p6464m5655m6135k2797o084m5382j29089j08507l9880
22399A945383L2288N0728J12678L4286j02671j03852j35514j11607j23997M2362
$$ y = [7838293, 7679433, 7402507, 7177814, 6992603, 6976661, 6893266, 6752960, 6579178, 6428698, 6413267, 6268109, 6033070, 5712468, 5623350, 5590108, 5598837, 5414518, 5336455, 5180894, 5146924, 5054114, 4957846, 4886073, 4975918, 5142666, 4871988, 4640559, 4610907, 4571175, 4480088, 4361142, 4270326, 4310076, 4311347, 4323398, 4409175, 4311928, 4195033, 4166446, 4076578, 3968339, 3988762, 3911847, 3839528, 3854797, 3846373, 3772867, 3626305, 3404663, 3386762, 3509315, 3531865, 3570982, 3496419, 3330539, 3076691, 2895755, 2783932, 2736414, 2699873, 2692957, 2579442, 2467033, 2481826, 2465376, 2388912, 2343257, 2297122, 2274325, 2268241, 2222859, 2093770, 1985263, 1945383, 1977671, 2028399, 2141077, 2175363, 2072692, 1968840, 1833326, 1721719, 1597722, 1640084]
22389A640084r108j85134q8888K8460o0005L9811O5672p4984O758N5975j9767
22378A398874k20480m3618J58184J46857M6901k688P1193l5641m2747n3980l0323
22367A392532J758k4221l2320k9710Q9270m1079l235q4274p3797n6274n131j8892
22355A114627o5506o0468p3298l4004j9082J26143p1605L6905J27861m16k8783
22344A052374n4008r4894j29782N099k5973J5489M0127N6823R132j25659q6925
22333F61803K2037J43420k7718q6930n692m5506N1801M2648j28289n4328K1861
22322E95107L0042j1879K2450j37563O8937L1433j1317j0492j01087m6361N9797
22311D89067K2411k924K7254O4347l3640m8919O0123L199m0734K1794M9366J33484
$$ y = [1640084, 1630976, 1445842, 1356954, 1385414, 1325409, 1365220, 1430892, 1355908, 1362666, 1418641, 1398874, 1178394, 1134776, 1292960, 1439817, 1486718, 1484030, 1555223, 1519582, 1476835, 1422855, 1392532, 1394290, 1370069, 1337749, 1308039, 1397309, 1356230, 1352995, 1268721, 1194924, 1138650, 1133519, 1114627, 1049121, 988653, 915355, 881351, 862269, 988412, 916807, 953712, 1081573, 1081157, 1052374, 998366, 903472, 773690, 778789, 752816, 768305, 808432, 865255, 874387, 748728, 661803, 683840, 827260, 799542, 712612, 706920, 661414, 713215, 755863, 627574, 573246, 595107, 625149, 613270, 635720, 498157, 567094, 598527, 587210, 576718, 475631, 429270, 489067, 511478, 508554, 535808, 600155, 566515, 517596, 577719, 580918, 540184, 561978, 611344, 744828]
22299G44828m9916k3879l3717m7174m5313k7760k2211O805m1418p2302L5748K233
22287D25924m2548N5167n9225k0238j33369n3656L8514l6385O1369J21927O159
22276C63639k0390P3349K804k6581l9392m1668K9040q449L7177m4642j36013j8432
22264A70442Q5o2672N8200K3154l1504k7104N1509J71670O851p9775k4727K3363
22252B79492n903j4788k1635j4496P2515j01146r3615L7415l6478R2157L9163
22241B32681j7477p6379r7898N1479M0178j1383l609k2894q8505k9411K3825J42948
22229A43555P0191J89122J1643j12333j54828o0452N044O5333p003M4284M6272
22218B40828j8378o1630l5121q115n9014M0682R5962K2616q0104K7227Q4716Q308
$$ y = [744828, 694912, 671033, 637316, 590142, 544829, 517069, 494858, 501663, 460245, 387943, 423691, 425924, 383376, 438543, 379318, 359080, 225711, 172055, 210569, 174184, 235553, 357480, 363639, 343249, 416598, 419402, 392821, 353429, 311761, 340801, 332352, 369529, 324887, 188874, 170442, 170527, 107855, 166055, 189209, 157705, 130601, 182110, 353780, 360631, 280856, 256129, 279492, 273589, 258801, 237166, 222670, 295185, 194039, 100424, 137839, 101361, 193518, 232681, 215204, 138825, 40927, 92406, 132584, 121201, 117592, 94698, 6193, -23218, 607, 143555, 213746, 402868, 414511, 302178, 147350, 86898, 91942, 157275, 150272, 194556, 240828, 222450, 160820, 125699, 117584, 58570, 99252, 195214, 217830, 137726, 164953, 249669, 257977]
22206B57977q9374l7532P9342J58399j70049j46000J92r3477n0018J3082K4422
22195e3036M5401J15346n6731p2612n0559J13267O9597M4603Q7082J1942q238
22184B46062R0614K48864J42920m5731l1716N8469j12790r7799p0248j1440J0068
22173D27273n4816M522q7521n2515L748M9600o6430O7044R5378P0814k19329j52786
22161H4982p7583j6341K7869p826n68J0333J21985L7070O3820p5117j66410L1657
22149C3871o7384m9857k4137O2945J19564R2837L724r0665J29838j9675j54773
22138C6288l4651j6744k4235Q4932L6548j256O4540l4638n6394R977M2685j8613
22126H8439o18j2173J7702N9077j051j49901J5205L0697J7933O86n223l862m5761
$$ y = [257977, 168603, 131071, 210413, 368812, 198763, 52763, 52955, -40522, -90540, -77458, -53036, -7635, 107711, 50980, -21632, -72191, 41076, 110673, 155276, 242358, 254300, 246062, 336676, 585540, 728460, 682729, 651013, 709482, 596692, 498893, 428645, 417205, 427273, 372457, 376979, 289458, 236943, 240691, 290291, 223861, 290905, 386283, 457097, 237768, 84982, 7399, -8942, 18927, 11101, 10533, 20866, 142851, 179921, 243741, 168624, 2214, 33871, -33513, -83370, -107507, -44562, 75002, 167839, 171563, 80898, 210736, 191061, 36288, 1637, -15107, -39342, 45590, 82138, 80882, 145422, 110784, 54390, 64367, 107052, 88439, 87821, 75648, 93350, 152427, 151376, 1475, 16680, 47377, 65310, 65996, 60773, 56911, 11150]
22113A1150R6003M8990o4344p887p224o995j12756j03374L5939J23180j42k7115
22101a4575M5759j28841L483q5082N4328J98455L4986q9858j1797j05769m6401
22090a45312n71q0009J35847J34347L2773o7756k0878M3719r232p7146r868R8005
22078C3919R3939R1968r607J4505M1220j27712k57858J3726K07928N6094j55006
22067C116k01178l8882J9520J58325J07187N7829J37730j09646o5265Q3348O2347
22056B14431k3731o9259j87495j36909r1956K1198K08424Q1739O5989j8827p3171
22045i567P7894K7488L0746J18239q5754o1774m7728m13J9900n87o9399J129L0219
22032C0393J8871k5760n7886K1636j2634L105l1769J5779J52562P6145m1165M3919
$$ y = [11150, 107153, 156143, 91799, 83912, 76688, 69693, -43063, -146437, -110498, 12682, 12540, -14575, 31184, -97657, -94174, -179256, -124928, 73527, 108513, 18655, 6858, -98911, -145312, -145883, -225892, -90045, 44302, 77075, 9319, -11559, 32160, 22928, -54218, -64086, 33919, 127858, 219826, 210219, 224724, 265944, 138232, -119626, -105900, 102028, 158122, 3116, -198062, -236944, -217424, -59099, 48088, 105917, 243647, 134001, 68736, 152084, 214431, 190700, 121441, -66054, -202963, -294919, -273721, -65297, 16442, 82431, 63604, -9567, 68327, 95815, 126561, 244800, 159046, 97272, 49544, 49131, 69031, 68444, -955, 174, 30393, 49264, 23504, -34382, -12746, -25380, -22275, -54044, -38265, 114297, 190442, 149277, 193196]
22020A93196Q04J20582O7374q9702r1385J32536R2924J47213O1333R4166R1016
22009H20057L38496M17178N09649J76070Q5815L3692k45890m29681m64737l31611
21999I09038r7842o4182k17162q3192k7313J5512l2184O267l3901r0055m3511
21988B41475m5195J5939r6005L6940j7155k1774K9953J38694k3637j30586J22816
21977B51465O2524q9022r9142N6810Q754o0303k6888j01403O0872j8223k1318
21966B4126Q2213l216J1598p6786k4362Q5377k946J8854p3027j5775J48558k9517
21954A45097j50119L9534O4955L7855L3981J1587j04957M0824N9264q0247P9634
21943A77408M3287k6669p5901k0697Q4772k6974j55596j63172l2024J44554k3303
$$ y = [193196, 194000, 314582, 381956, 292254, 200869, 333405, 426329, 573542, 634875, 729041, 820057, 1158553, 1575731, 2085380, 2261450, 2347265, 2380957, 2135067, 1705386, 1240649, 909038, 811196, 747014, 529852, 446660, 419347, 434859, 402675, 408942, 375041, 284986, 241475, 196280, 212219, 116214, 153154, 135999, 114225, 144178, 282872, 259235, 128649, 251465, 313989, 224967, 125825, 182635, 191389, 131086, 104198, 2795, 63667, 45444, 24126, 106339, 103123, 114721, 37935, 13573, 98950, 96004, 114858, 41831, 26056, 174614, 145097, -5022, 34512, 99467, 137322, 171303, 182890, 77933, 118757, 178021, 97774, 177408, 220695, 194026, 118125, 97428, 182200, 155226, -370, -163542, -195566, -51012, -74315]
21932g4315J4896o4537J21837J17064J18005l0560J7845O8065l0707p5551j8804
21921A63238j519j0575m3262p8587J0334j8464N3280j2479J05076M2910O1211
21910B71163l3177o3354j32891n7688n3374J14982Q0648J1994n2992o1793n208
21899A8310l936J2392o5184k6003N1797k9806J14687K4455P0665j37157j57157
21888a26937l2382J44054O3387q80L7488J1830n8476n5568K2363o6323n6293j927
21876a19664M4109N2165J23765q297j4020L8778j9234O9980l8385m7044J6054
21865I8207j19216J61419N0701m4316m2757r3425J551j8081j0327O1365K971r8897
21853e0805L3003Q9097J147m9753j1710M375l3277n2054n8346k7164K9473L5195
$$ y = [-74315, -59419, -123956, -2119, 114945, 232950, 202390, 220235, 288300, 257593, 182042, 163238, 161719, 151144, 107882, 29295, 39629, 21165, 74445, 61966, 167042, 209952, 271163, 237986, 174632, 41741, -15947, -69321, 45661, 126309, 138303, 85311, 23518, 18310, 14374, 26766, -38418, -64421, -12624, -42430, 72257, 96712, 167377, 30220, -126937, -159319, -15265, 48122, 47242, 84730, 96560, 38084, -17484, 4879, -61444, -117737, -119664, -75555, -23390, 100375, 92078, 78058, 116836, 97602, 167582, 129197, 82153, 98207, -21009, 140410, 191111, 146795, 104038, 10613, 12164, -5917, -16244, 45121, 48092, -50805, -17802, 71295, 72442, 22689, 10979, 15354, -17923, -69977, -128323, -155487, -126014, -90819]
21841i0819N3587R567K2744K8953O2373L290j25346q2508J30441l4351k4579K2594
21829b4054p9311R8505J5223k9946R9462L1810L7807l8788j8010l9630N4712P3295
21817A81075M9165J9151m9505m5891r0074j05908O612o9242o1727P156M5759J94193
21805H0764N5816q3433P4088l0783o9462R1475p7225m8300J06614p182k7540n4009
21793A0823j50884M8661o507J30504j6020p3926L5954N8911L2704m5991J40179
21782A64408L6431q8077j54857l235R0555J54122N2047r7291j16434j29345N5620
21771c6056J00906Q5587M2247O9669O3001n6422k23531k0645r185n758J00676
21760A10489m6074J8857K6999P28n9195j4303J6260n0553L4783O839n7561N5684
$$ y = [-90819, -37232, -27665, -4921, 24032, 86405, 89695, -35651, -118159, 12282, -22069, -46648, -24054, -103365, -4860, 10363, -19583, 79879, 111689, 149496, 110708, 92698, 53068, 107780, 181075, 230240, 249391, 199886, 153995, 63921, -41987, -35375, -104617, -166344, -159188, -113429, 80764, 136580, 53147, 127235, 96452, 26990, 118465, 41240, -7060, 99554, 92372, 64832, 10823, -140061, -91400, -97907, 32597, 16577, -57349, -21395, 37516, 70220, 24229, 164408, 200839, 112762, -42095, -45330, 45225, 199347, 251394, 154103, 37669, -91676, -36056, 64850, 150437, 192684, 262353, 325354, 268932, 45401, 24756, 15571, 9813, 110489, 64415, 83272, 110271, 110999, 51804, 37501, 53761, 3208, 37991, 44830, -12731, 42953]
21748D2953J38L0936P3376L7452l8216n0261j1935r6364m502J40073k4514j20310
21736b1174o6848p9069o374R8764R0263l9261m7061P3093J3671j18857J2533J34169
21724D3849j4194j1500l2838j59174n8020P7601P7894N7874M4005J23251K516
21713A51264o5062M4191m7716n6572M6505m9902k8876J14268J19540J8594K2024
21702B68258n5916p4062N6634j56140r386q0573o0429K3083J28742L3014n3577
21691A9648p7266j39966p9652j1908P7902J09412J32820n3985p8679J77564J39663
21680B15553L0063j08429j32759j20184Q8321n739p7781N6078M6903p8821l4534
21669a21329J33126o1124j05921q113j01478n7152M6380J32409N3455L9159O9258
$$ y = [42953, 43091, 74027, 147403, 184855, 146639, 96378, 84443, -11921, -16423, 123650, 99136, -21174, -88022, -167091, -173465, -74701, 15562, -23699, -70760, 2333, 16004, -102853, -90320, 43849, 29655, 18155, -14683, -173857, -231877, -154276, -76382, -18508, 25497, 148748, 151264, 86202, 130393, 82677, 26105, 72610, 22708, -6168, 108100, 227640, 246234, 268258, 212342, 138280, 194914, 38774, 29388, -51185, -111614, -88531, 40211, 73225, 19648, -57618, -197584, -277236, -289144, -211242, -101830, 30990, -22995, -101674, 75890, 215553, 245616, 137187, 4428, -115756, -27435, -33174, -110955, -54877, -7974, -86795, -121329, 11797, -49327, -155248, -163361, -264839, -321991, -275611, -143202, -89747, -50588, 18670]
21658A8670Q6120m8493j03579Q6123M5344r2153o4097N7965P5511m4081j6436
21647H94J2222l7040l4710J05168K1329P0887p9434j21900Q7652J98087P4987
21636B98142n0344j4964p2172p6545L1339P0873K186r6400p7525m5453K0370n1728
21624f2221J12432j39796r0575j6767Q7346J80831L9645N5239K5522o0142K0230
21613A51744Q6341k9834p8756j43003m2322N1680M4575J51351P0558r0928L7891
21602B09297L8646l1348n8475n6962k0540m9261K6029j7916q455N366K9805K8670
21590I4856M604R3126P7835L4021J3019j68757k09983l4871l0232O7001J0965
21579d8416O445J27841Q2913J2231K1287n281r0940n0705Q447m5405j00158Q1393
$$ y = [18670, 104790, 56297, -47282, 38841, 84185, -7968, -72065, -14100, 61411, 17330, 894, 13116, -23924, -58634, 46534, 67863, 138750, 59316, -62584, 25068, 223155, 298142, 247798, 232834, 160662, 84117, 115456, 186329, 188515, 92115, 14590, -30863, -10493, -62221, 50211, -89585, -180160, -196927, -109581, 71250, 110895, 166134, 191656, 131514, 151744, 238085, 208251, 129495, -13508, -55830, -4150, 40425, 191776, 262334, 171406, 209297, 247943, 216595, 158120, 101158, 80618, 31357, 57386, 39470, 31015, 36381, 66186, 94856, 99460, 192586, 270421, 304442, 317461, 148704, -61279, -96150, -126382, -59381, -48416, -41971, 85870, 168783, 181014, 202301, 197020, 106080, 55375, 63822, 18417, -81741, -348]
21567c48N3585N0602o0795j04222N5763L896n6831K5567M7998k8492R0634m0897
21555C6460o84N7776O1217N7338j79615r9853Q902K1366p8632r7303K7933Q4883
21543a00212J53906M3136o3545k347j02672Q7918l0274o5564N1630n065l248L4708
21531a629o913j4529j4439N6573K4275J9654p9864M6583n8904k7863J37948J79214
21519B60106m9957j52667M5476J25971k05903j56190N192O9072R1224O9789p3841
21508B8272l2945P1682J29937L1036P1886j46320k60320N5589J47827R3067j44919
21497D4792o9295J01187l5302p8968j14021j33384K2236J91299k9778n9868J11764
21486d9338Q9115J43095j5692o4176n9190M1430r7499j21939j21147R688J59288
$$ y = [-348, 53237, 103839, 43044, -61178, -5415, -1519, -58350, -32783, 15215, -13277, 77357, 36460, 35776, 93552, 154769, 212107, 32492, -67361, -58459, -37093, -115725, -213028, -185095, -100212, 53694, 96830, 33285, 30938, -71734, 16184, -14090, -79654, -28024, -33089, -36337, -1629, -8542, -23071, -37510, 19063, 43338, 62992, -16872, 29711, -29193, -57056, 80892, 260106, 210149, 57482, 102958, 228929, 23026, -133164, -127972, -58900, 32324, 102113, 28272, -4673, 67009, 196946, 227982, 299868, 153548, -106772, -51183, 96644, 189711, 44792, -24503, 76684, 41382, -37586, -151607, -284991, -262755, -71456, -101234, -161102, -49338, 39777, 182872, 167180, 103004, 43814, 85244, -12255, -134194, -255341, -245653, -86365]
21475h6365J10925q5405q4161Q4835k0151j1860P7345L7188l3225K0640J11541
21464A21307M7345m3593o7882M1993k7073K2167n0002K5312Q6204M826q6233N4387
21452A28758j52715n2901J31266K2514K195j78690J2638L9729L7170J16400O4846
21441A71210M1881m173j72064J4255M8132j69955J6466j1521p5077K3715O2840
21430e4291P9206p6452o727N0208N4435j0406J9219N9059r6756m3563k3641J00188
21418E0479p009L4050J96291P0687j24808j03447L7954J19738Q9336j9034j74271
21407A69966k37539R255Q5171K723j07638p4428M9751J48094P0556k7911K64N5487
21395A43751j13723o7016l0850j2874O3732Q1552p8673N9246J3098N4075o9097
$$ y = [-86365, 24560, -60845, -145006, -60171, -80322, -92182, -14837, 22351, -10874, 9766, 121307, 168652, 125059, 57177, 99170, 72097, 94264, 44262, 69574, 155778, 160604, 74371, 128758, -23957, -76858, 54408, 76922, 79117, -99573, -86935, -47206, -10036, 106364, 171210, 213091, 208918, 36854, 51109, 99241, -70714, -54248, -65769, -140846, -117131, -54291, 24915, -51537, -58264, -8056, 46379, 35973, 55192, 114251, 17495, -26068, -49709, 50479, 43470, 77520, 273811, 344498, 219690, 116243, 154197, 273935, 363271, 344237, 169966, -67573, -58318, 26853, 29576, -78062, -152490, -102739, 45355, 115911, 88000, 88264, 143751, 30028, -36988, -67838, -80712, -16980, 64572, -14101, 45145, 58243, 112318, 43221]
21384D3221P51o6868M68K6872J67677K3377j3640l679m3433n6994K1653q463M7563
21371A38505m6070l6343jJ34518k3573L7542k1018p7077j7298K2148J8654O8897
21359A98884j33190p6411p4404P2789m1636O2521n684j8520J26663P1283M867
21348A87162m4606q5150j9417J07407n0567l9214M9932n0702l2239q463j05524
21337i1381M7753P9241J22714K5839N4528J46298P116j67064o6637J24879L0397
21326C13683j26433L4595K3981j07359j33540l6313k9240m226J62719M1496j07076
21315C2287J6428M5536L501j00181k7451J16678k2009N1100r426o1317l3055J8751
21303C0842J25989M2891q9949j0721k6407j464J8314L6239j0536j18916j6311
$$ y = [43221, 43972, -22896, -22428, 4444, 172121, 195498, 181858, 178179, 134746, 77752, 99405, 90942, 138505, 92435, 56092, 56091, 190609, 167036, 204578, 183560, 106483, 89185, 111333, 129987, 198884, 65694, -10717, -85121, -12332, -53968, 8553, 2869, -15651, 111012, 182295, 187162, 142556, 57406, 37989, 145396, 94829, 55615, 105547, 54845, 22606, 14143, -91381, -43628, 35613, 158327, 184166, 238694, 384992, 392108, 225044, 158407, 283286, 313683, 187250, 221845, 245826, 138467, 4927, -31386, -60626, -64852, 97867, 139363, 32287, 48715, 94251, 97752, -2429, -29880, 86798, 64789, 115889, 106463, 45146, 12091, 30842, 156831, 199722, 109773, 99052, 72645, 71181, 89495, 125734, 115198, -3718, -20029]
21292b0029L2548N3903L3738q0982J02574K6031l1970k4737k8641l199Q2227J22519
21280B63982l7882j58567q0117Q4608m7438N5761j405Q5300J18578M5865k9100
21269B99585J12858J22703N0371J9577Q2620K04779k0175l2819J15088l2549J35481
21258A057519K4408n6025Q5738o070q5600j25402j5253J8420L5736o4437O1723
21247I30757J24780j5942J09049k873q5755l3719O4317M775j81629k81247j39122
21236D93391j03759j21435J7941R7431j7934N3732L1085j18626j39881p9994q9880
21225B2071J14329O6257j9843j9805M2914O2099p0712l771k7198O1067P4427l57
21213C01478q3894j45800j3255J18235J54381r7217j37340N7712j04174L8525
$$ y = [-20029, 12519, 66422, 100160, 19178, 121752, 147783, 115813, 91076, 62435, 59236, 141463, 263982, 226100, 67533, -12584, 72024, 24586, 80347, 78942, 164242, 282820, 328685, 299585, 412443, 535146, 585517, 605094, 687714, 892493, 872318, 839499, 954587, 922038, 1057519, 1081927, 1025902, 1111640, 1105570, 1019970, 894568, 879315, 897735, 933471, 869034, 930757, 1055537, 1039595, 1148644, 1145771, 1060016, 1026297, 1090614, 1095389, 913760, 632513, 493391, 389632, 268197, 286138, 383569, 365635, 419367, 450452, 331826, 191945, 111951, 22071, 136400, 202657, 182814, 163009, 205923, 268022, 197310, 193539, 166341, 227408, 301835, 301478, 217584, 71784, 58529, 176764, 331145, 233928, 96588, 154300, 50126, 88651]
21203H8651L7192K7904M2383M4138K0345j378j7327o6922l0604J9031j4318j07609
21191D1486J3194r127O3073j5731P2355l639M1494l8910j10389L0705R6305J7966
21179A98782o3817j2492P0126l1258j06873k4354k737N126k191j5177M2074J23055
21167A80264L5733j48905j95312p924J2997M0277J00130J01876J14638J03181
21157C36955L5597N2549n6417j38463n6779l0858J3514j07052k08n013j9895k6359
21145b429J9890J3476O8142m967M3721o832l4376N7753J9067l4493N566M7720
21133A92238j9321p2547l3806R5935M7360J40149P7171k4656o719o9195k7871
21122B98738k0006l6171r1615m181R607L0129o1110j2254K7225O8647O5891R0253
$$ y = [88651, 125843, 153747, 196130, 240268, 260613, 259235, 241908, 174986, 144382, 163413, 149095, 41486, 54680, 45553, 108626, 92895, 165250, 161611, 203105, 164195, 53806, 84511, 180816, 198782, 134965, 122473, 192599, 161341, 54468, 30114, 27377, 32503, 30312, 15135, 57209, 180264, 215997, 67092, -128220, -136144, -123147, -82870, 17260, 119136, 233774, 336955, 372552, 425101, 368684, 230221, 173442, 142584, 156098, 49046, 48838, 43825, 23930, -2429, 17461, 30937, 99079, 94112, 137833, 131001, 96625, 154378, 173445, 138952, 144518, 192238, 172917, 100370, 66564, 162499, 209859, 350008, 427179, 402523, 395804, 326609, 298738, 278732, 242561, 150946, 146765, 156372, 186501, 125391, 113137, 140362, 209009, 274900, 365153]
21110C65153j6695p7874r5796o4551J31884P6770J6537m0898j46702r7319R0116
21099A40625J14559q9962p6523R0514j1642o974L9419l3890j10598Q392L7329
21088A01249j4177m7592j14375j383J46285J56916J7236j33384o6391J9035J3124
21077G6543K8569m1079Q1430J27560N5053J37496r7246j94381j58733L3798J6186
21066F5196k755O3796L9472J2518k00170j33328J9868L1613P8356q8698K0625
21055i3507L9207L0097R3874n3273o3341Q7871M1118n874J7783m3785K7534M3493
21043A21197Q2359n415j22273r4456K4945m7620R0238R9340J1634O5916m4931
21032A80934j106j740m1928p1693J8437N7568L5922R0185O3429j45349p8534N1024
$$ y = [365153, 348458, 270584, 174788, 110237, 242121, 318891, 335428, 294530, 147828, 50509, 140625, 255184, 165222, 88699, 179213, 167571, 160597, 200016, 166126, 55528, 63920, 101249, 87072, 39480, -74895, -76278, 70007, 226923, 244159, 110775, 44384, 63419, 76543, 105112, 64033, 145463, 273023, 328076, 465572, 368326, 173945, 15212, 49010, 65196, 62441, 126237, 165709, 178227, -21943, -155271, -135403, -103790, -25434, -114132, -93507, -54300, -24203, 69671, 16398, -46943, 40928, 82046, 76172, 93955, 50170, 77704, 121197, 203556, 198141, 75868, -18588, 6357, -41263, 48975, 148315, 159949, 225865, 180934, 179828, 178088, 136160, 64467, 82904, 140472, 176394, 266579, 330008, 184659, 106125, 157149]
21020A57149J18458k4828K1281J9828k3169j2155j5747o7150R577N8219k7708
21009B13755l2235k8865j8715R510J00606J19564R9264j25258j43557j4925J46853
20998C25997k7333j20424p6711n875l2591J36793L009j07697p2859P1795K8995
20987A23099l9097k87M072L4849O4367M695L5329j05091m348O1063P1218P7381
20975C27250j22879l0071J01226m0601j04612j9137j15809R6099R6039m231j44900
20964C8374n8844K61078J61913k5625K223o9667j66375j5615P5836J08610P0186
20953C82094O8152j4819j12562m6385J27j3095R2380J59357N0873j5349l215K2915
20941E70473j30640r183p1439l2029J0773N2496J38354J4963j11796m3263q1234
$$ y = [157149, 275607, 250779, 272060, 291888, 268719, 256564, 240817, 173667, 183244, 241463, 213755, 181520, 152655, 133940, 143450, 244056, 363620, 462884, 337626, 194069, 179144, 325997, 298664, 178240, 101529, 95654, 63063, 199856, 202865, 95168, 22309, 94104, 123099, 84002, 83715, 87787, 122636, 187003, 191698, 227027, 121936, 117588, 178651, 249869, 327250, 204371, 174300, 275526, 234925, 130313, 111176, -4633, 91466, 187505, 183274, 38374, -20470, 240608, 402521, 376896, 379119, 309452, 143077, 127462, 203298, 311908, 382094, 450246, 435427, 322865, 276480, 276607, 263512, 355892, 515249, 566122, 550773, 547558, 570473, 439833, 430650, 359211, 327182, 337955, 390451, 528805, 543768, 431972, 388709, 307475]
20930C07475j36457j412K6366Q5268Q1324R7544L5517q444p81p0204L9441K3554
20918D79191p896l5747J9002N2647k6552j1973J7311M1002R6617J22404N9466
20907H05472N7352K0424M8435j35288j1083o1790J270J14126J15887M3728J45482
20896A144015j0276j31526p1224j70986o7985q37r5040p7514j9933L4256k1795
20885E11155K1251n0862k0526Q0267O7114m339J08740J91342J81525K4430l9152
20874A070945k2300j39421q2994J09398o039M1335K00729K02453K1790o7435k9853
20863A298608j27760k47133j69834m7518k1605M1739J12325m0061k31547q2117
20853D85097J27868J44082j18555j46618K2298p452L267n5564M7440J16306j8381
$$ y = [307475, 171018, 169606, 195972, 281240, 362564, 460108, 495625, 487181, 486400, 416196, 455637, 479191, 471295, 435548, 454550, 507197, 480645, 468672, 485983, 526985, 623602, 746006, 805472, 862824, 883248, 931683, 796395, 785312, 723522, 724792, 838918, 954805, 998533, 1144015, 1133739, 1002213, 930989, 760003, 692018, 691181, 596141, 518627, 498694, 532950, 511155, 532406, 481544, 461018, 541285, 608399, 604060, 712800, 904142, 1085667, 1110097, 1070945, 1048645, 909224, 826230, 935628, 929589, 970924, 1171653, 1374106, 1395896, 1328461, 1298608, 1170848, 923715, 753881, 706363, 684758, 726497, 838822, 798761, 567214, 485097, 612965, 757047, 638492, 491874, 514172, 506720, 509987, 454423, 501863, 618169, 599788]
20842E99788l9986P4309p747j4721N7688m9445q8935P519J2927K50306L9165q3428
20830G57440J15452r0101j46983j3022M9484m135K4669J0486q1978j64583l4678
20819D22051P2598L5023j01817J62891J14952N7471K3386M2167J27030J6592j14475
20808H57869K1934j65348N9734R218j09760O4049M8844p8125m4715N1006J15563
20797H30269L9574o4412k9258P4920O3106L6885O459k3043r4964J48461J04199
20786A092196O0826N0828N2677n9112j73912l5284O0320n8022J3615M9968M9057
20775A103157n1765N3047J4088N0604L859J46086l4477j53497j9575P6907r0235
20764A098199K800P5343M8988K0189Q738K0846m6557p5072R560L0704P6398J41045
$$ y = [599788, 559802, 634111, 626364, 611643, 669331, 619886, 530951, 538470, 551397, 801703, 840868, 757440, 872892, 782791, 635808, 622786, 672270, 668135, 692804, 703290, 621312, 456729, 422051, 494649, 529672, 427855, 590746, 705698, 763169, 786555, 828722, 955752, 972344, 857869, 879803, 714455, 774189, 783407, 673647, 737696, 786540, 708415, 663700, 714706, 830269, 869843, 805431, 776173, 851093, 914199, 951084, 957543, 934500, 839536, 987997, 1092196, 1153022, 1203850, 1256527, 1197415, 1023503, 988219, 1048539, 990517, 1004132, 1054100, 1103157, 1051392, 1104439, 1118527, 1169131, 1172990, 1319076, 1284599, 1131102, 1111527, 1188434, 1098199, 1100999, 1176342, 1225330, 1245519, 1254257, 1275103, 1228546, 1153474, 1163034, 1193738, 1270136, 1411181]
20752A411181K41044K65802K2398P8q4993n7932k6365J85895J66893J4196L5392
20741B173589J80137K06246J81229K22131J96581K65441K87623J51031J97447
20732D061455J59383J00333J57806J61827J86321K46552K77722L18279M39187
20723F108865N86226O07889O25635P87569P05348O39359O90678O64067P18151
20714A2133787J050079J349516J714962K286877K948725M007586N709709Q153009
20706C9354250J2102590J7956677K4467118K7541616K4424533J4645807L037472
20699A63530063j680909K461162P380053M691177o457668j8378376k2162356j5666871
20691A13716275m934141N924216J6029732K2401405K1976315J3833540J316821
$$ y = [1411181, 1652225, 1918027, 1940425, 1940503, 1855510, 1797578, 1771213, 1957108, 2124001, 2138197, 2173589, 2353726, 2559972, 2741201, 2963332, 3159913, 3425354, 3712977, 3864008, 4061455, 4220838, 4321171, 4478977, 4640804, 4827125, 5073677, 5351399, 5669678, 6108865, 6695091, 7302980, 7928615, 8716184, 9421532, 10060891, 10751569, 11415636, 12133787, 13183866, 14533382, 16248344, 18535221, 21483946, 25491532, 31201241, 39354250, 51456840, 69413517, 93880635, 121422251, 145846784, 160492591, 163530063, 161849154, 164310316, 171690369, 176381546, 169923878, 151545502, 129383146, 113716275, 108782134, 114706350, 130736082, 153137487, 175113802, 188947342, 190264163]
20684A90264163n977158l352020K666172K495276p577692k0909641k8170536k5641651
20676A03796913j8542779j2592521q650345o148507m767525l733473l073036k578183
20668D3710544k300338j749834j292172j163551j185485j075577j173715j314392
20660C2455480j128156j117731j184424j043140r40349o94670p25187p27404n43776
20651B4350643n88067o98375o90528n29266l79243m01045n22146o73154p40619
20642A9128200o34235o21333l92322m91983m93472m05079l86905m05933m02957
20633A4893981l02072k58909k75319k60350r2462n316O0655j41098j73314j43556
20623A3302240k16554j80109j79739j60792l47694l69103l29197l46310k65397
$$ y = [190264163, 184287005, 180934985, 183601157, 186096433, 178518741, 157609100, 129438564, 103796913, 85254134, 72661613, 64011268, 57862761, 53095236, 49361763, 46288727, 43710544, 41410206, 39660372, 38368200, 37204649, 36019164, 34943587, 33769872, 32455480, 31327324, 30209593, 29025169, 27982029, 27041680, 26347010, 25621823, 24894419, 24350643, 23762576, 23064201, 22373673, 21844407, 21465164, 21064119, 20541973, 19868819, 19128200, 18493965, 17872632, 17480310, 16988327, 16494855, 16089776, 15702871, 15296938, 14893981, 14591909, 14333000, 14057681, 13797331, 13704869, 13699553, 13760208, 13619110, 13445796, 13302240, 13085686, 12905577, 12725838, 12565046, 12217352, 11848249, 11519052, 11172742, 10907345]
20614A0907345j86105q597J24090L8411r4208j06545j68601k80304j38306k03706
20604I883474k70954k86558n18689l79679l14979j72592j14257j05062k32438
20595G488266j76551j89356O0571r6272k00131j17998j95426j11288r0966j60201
20585F210648k51056j30224M8284n9833q5450o6631r6266n9589j34560r0330r9890
20574E185103M8646j6160j49129j87923j6765p0815j20456j49706o0217o1762
20564D400816j22996p8360o4294j508j66128j54384K6597o9967j48233P3666N1253
20553C746462j21367j46240q7137R7707n2587p5325r8108n8611j3853m2601j23813
20542C024527j30148k16414o3053M4934M0722j41482j787j5250p9690n991J390
$$ y = [10907345, 10721240, 10712643, 10836733, 10875144, 10780936, 10674391, 10505790, 10225486, 10087180, 9883474, 9612520, 9325962, 8807273, 8427594, 8112615, 7940023, 7825766, 7720704, 7488266, 7311715, 7122359, 7182930, 7086658, 6886527, 6768529, 6573103, 6461815, 6370849, 6210648, 5959592, 5829368, 5877652, 5817819, 5732369, 5665738, 5569472, 5509883, 5375323, 5284993, 5185103, 5233749, 5217589, 5068460, 4880537, 4863772, 4792957, 4672501, 4522795, 4462578, 4400816, 4277820, 4199460, 4135166, 4133658, 3967530, 3813146, 3839743, 3769776, 3621543, 3695209, 3746462, 3625095, 3478855, 3391718, 3489425, 3436838, 3361513, 3263405, 3204794, 3190941, 3148340, 3024527, 2894379, 2677965, 2614912, 2659846, 2700568, 2559086, 2557299, 2542049, 2462359, 2456368, 2457758]
20531B457758n6569q8945j27419j2638R9598l6691N230j21990j24613j06444J4061
20520A901338j6832N7613Q0374j7824p9955o5937m4062N6070m0794p0321N2074
20509A811744q3274J55445J25476P898O621Q423j6630Q5785l2896p3859r1495
20498A903238j54680o2782K4031l7520K2285P147J892r520N3102o3394J19387
20487A803186l2k4866J390l3981n6834k0192J629L6402p3410o323o4887k0924
20475A541158o0205j9544J41926J04730m2655k02464k8867j8097o0020O0163L371
20464A419496M7755K7539l748p1318j76653K7996j7816J00988R7304j4373n398
20453A431772l206M9932K600n7172l5529q4740n3715J84743j7875r1603k3101
$$ y = [2457758, 2401189, 2312244, 2184825, 2172187, 2271785, 2235094, 2240324, 2118334, 1993721, 1887277, 1901338, 1884506, 1942119, 2022493, 2004669, 1924714, 1858777, 1814715, 1870785, 1829991, 1759670, 1811744, 1728470, 1883915, 2009391, 2017289, 2023910, 2032333, 2015703, 2101488, 2068592, 1994733, 1903238, 1748558, 1685776, 1709807, 1672287, 1694572, 1701719, 1703611, 1694091, 1747193, 1683799, 1803186, 1803154, 1778288, 1779678, 1745697, 1688863, 1668671, 1670300, 1706702, 1633292, 1626969, 1562082, 1541158, 1480953, 1461409, 1603335, 1708065, 1665410, 1462946, 1434079, 1415982, 1355962, 1416125, 1419496, 1467251, 1494790, 1491042, 1419724, 1243071, 1271067, 1253251, 1354239, 1451543, 1437170, 1431772, 1428566, 1478498, 1481098, 1423926, 1388397, 1303657, 1249942, 1434685, 1416810, 1325207, 1302106]
20442A302106n5970M1400r345K4405L7178m4581q2010j08213j54015Q7399P8390
20431A116744J33638K06189k6559j33570J9631J31531n0995m9368L0050J3323
20421A390614J6765J65773R6277l8824j06286j75743p6773m0518R8840m0419m8580
20410A241126j0455K2572J3382P3163l3159k7588J2716O751J11980M3515o5482
20399A388521q7520L7096J85869L0710K3925Q2384M3212l7843o4215L1459P8627
20388A712225N7011N7921P3224j22660k0381J89482J46229J60784K72707K42686
20378B769228J05106J02800N2798J92878J35395J25749Q0995l6714K7431L95044
20368C950710K77321L44322M03723L54017K58375J54885J70374J20187R1965J78244
$$ y = [1302106, 1246136, 1287536, 1278191, 1302596, 1339774, 1295193, 1213183, 1104970, 950955, 1038354, 1116744, 1250382, 1456571, 1430012, 1296442, 1316073, 1447604, 1396609, 1347241, 1377291, 1390614, 1407379, 1573152, 1669429, 1630605, 1524319, 1348576, 1271803, 1231285, 1330125, 1289706, 1241126, 1230671, 1253243, 1266625, 1339788, 1306629, 1279041, 1291757, 1298508, 1410488, 1454003, 1388521, 1301001, 1338097, 1523966, 1554676, 1578601, 1660985, 1704197, 1666354, 1602139, 1633598, 1712225, 1769236, 1827157, 1900381, 1777721, 1757340, 1946822, 2093051, 2253835, 2526542, 2769228, 2874334, 2977134, 3029932, 3222810, 3358205, 3483954, 3564949, 3528235, 3555666, 3950710, 4228031, 4572353, 4976076, 5330093, 5588468, 5743353, 5913727, 6033914, 6125879, 6304123]
20358F304123M59272M34355N29574P61995Q29126R12726J346277J810688K099543
20349A5487679K767924L834830N614581Q276647J2671628J8200951K2815566K2708415
20341A12378221J5726683J965176j2009955j8260127j4803552o972852J268240
20334G9291834R381814J6683345J9928585J6184247L873603j2139991k2985756
20327A10217681k3238885j7043025j1108118p106149m566942k853033j724873
20320D2576656o85955K43493J438961L147822N482098R144079J4455815K0468506
20312I6271475K3825899K1125122J0644700n366132j7757355j9695127j3168804
20305I5879778m554883L955495J2121505J8190545J8732504J1537610l128885
$$ y = [6304123, 6763395, 7197750, 7727324, 8489319, 9318445, 10231171, 11577448, 13388136, 15487679, 18255603, 22090433, 27705014, 35981661, 48653289, 66854240, 89669806, 112378221, 128104904, 130070080, 118060125, 99799998, 84996446, 78023594, 79291834, 88673648, 105356993, 125285578, 141469825, 145343428, 133203437, 110217681, 86978796, 69935771, 58827653, 51721504, 47154562, 44301529, 42576656, 41890701, 42134194, 43573155, 46720977, 52203075, 61347154, 75802969, 96271475, 120097374, 141222496, 151867196, 146501064, 128743709, 109048582, 95879778, 91324895, 95280390, 107401895, 125592440, 144324944, 155862554, 152733669]
20298A52733669j8221966k5182318k2235155j6021557j0752219p364098n386346
20291D7570010m029347l148477k598443k236524j912045j469867j114540r90994
20283C0069773j009330r67326r89742p90698q69395p66009n45018n62779n66786
20274B3002690m18165n93775p15273o43117p43025m68039m54515n84276m69066
20265A7913439l82948l90978m56216n96130m11909l93520n80651l21783l11331
20256A4067973m16704l72003k86367l33436l43673l54850l67206k20465r8941
20247A1274328j47326k97192j27654j16057k31311k30953l45559l03646l31309
20238I143321j65913j57129j57001r2530p2201r2075k5956p9287n9319k77719
$$ y = [152733669, 134511703, 109329385, 87094230, 71072673, 60320454, 52956356, 47570010, 43540663, 40392186, 37793743, 35557219, 33645174, 32175307, 31060767, 30069773, 29060443, 28093117, 27103375, 26312677, 25443282, 24677273, 24132255, 23569476, 23002690, 22584525, 21990750, 21275477, 20632360, 19889335, 19421296, 18966781, 18382505, 17913439, 17530491, 17139513, 16683297, 16087167, 15675258, 15281738, 14701087, 14379304, 14067973, 13651269, 13279266, 12992899, 12659463, 12315790, 11960940, 11593734, 11373269, 11274328, 11127002, 10829810, 10702156, 10586099, 10354788, 10123835, 9778276, 9474630, 9143321, 8977408, 8820279, 8663278, 8570748, 8498547, 8406472, 8380516, 8301229, 8241910, 7964191]
20228G964191j84619j58835p0950j12501l4911r7220j44685j14627j02666j73013
20218F770164k17509j26505n3527K20483j03063j83440l9516p4047r1689j15498
20208E985853l2021k26168j97705j48270j1632M7355l9906k17377j38781r9119
20198D922229j09320l6559r718o2806p9680k58263j39213o4786k5898o770q1367
20187D047849q099J18645r159L9733q606l3855j83021l03038j95076j21283j40589
20176C203501J33038M8675j4895q7289K261j04731r8991j27432j8010l801J4040
20165B946366j23811j86106j0620N7713j20312j46203j21469p9318K7668O9170
20155B313078p927j05945J1189K9482l4428p0845j04881j16417l1531l805k8394
$$ y = [7964191, 7779572, 7620737, 7549787, 7437286, 7402375, 7305155, 7160470, 7045843, 6943177, 6770164, 6552655, 6426150, 6372623, 6593106, 6490043, 6306603, 6267087, 6193040, 6101351, 5985853, 5953832, 5727664, 5529959, 5381689, 5370057, 5417412, 5377506, 5160129, 5021348, 4922229, 4812909, 4776350, 4766632, 4703826, 4624146, 4365883, 4226670, 4161884, 4135986, 4129216, 4047849, 4039750, 4158395, 4149236, 4188969, 4180363, 4146508, 3963487, 3660449, 3465373, 3344090, 3203501, 3336539, 3385214, 3370319, 3283030, 3285291, 3180560, 3081569, 2954137, 2936127, 2932326, 2946366, 2822555, 2636449, 2625829, 2683542, 2563230, 2417027, 2295558, 2216240, 2243908, 2313078, 2305151, 2199206, 2210395, 2239877, 2205449, 2134604, 2029723, 1913306, 1881775, 1877970, 1849576]
20144A849576O8245N5552L4698J4441m7410L4113j08248k4672J69106J53620J11644
20133B310665N2952P6250K1552p3397K4589l4015j59124j01513l1082o1321k8352
20122A997204N3376L6616J56278J03651p3238q5602n5467j2054M1360L4849L2563
20111B229536j47932k18368j85009j81015o2319N7158k2232L4528r1905j23187
20101A289255j5800J28265m7209O2713J01576j67586j81106j24721L3559Q8452
20091A167398m6913P8922K0253j54073l4771l0578k5232r8788J709O7924L3405
20080I79256L0452o391o9610k2358J20347j2981l02282m6813L3689k567R3458
20069G94200p7338k6115R050j4661n0215k7616L495N4120K4912m6597j01661L0479
$$ y = [1849576, 1917821, 1973373, 2008071, 2022512, 1975102, 2009215, 1900967, 1876295, 2045401, 2199021, 2310665, 2363617, 2439867, 2461419, 2388022, 2412611, 2378596, 2219472, 2117959, 2086877, 2025556, 1997204, 2050580, 2087196, 2243474, 2347125, 2273887, 2188285, 2132818, 2120764, 2162124, 2196973, 2229536, 2081604, 1863236, 1678227, 1497212, 1434893, 1492051, 1469819, 1504347, 1412442, 1289255, 1273455, 1401720, 1354511, 1417224, 1518800, 1351214, 1170108, 1045387, 1078946, 1167398, 1120485, 1199407, 1219660, 1065587, 1030816, 1000238, 975006, 876218, 877927, 945851, 979256, 1009708, 1003317, 933707, 911349, 1031696, 1018715, 716433, 669620, 703309, 700742, 794200, 716862, 690747, 699797, 685136, 634921, 607305, 610800, 664920, 689832, 643235, 541574, 572053]
20057E72053j6752k8435L5970J02773o0249J2110Q9354q851o1066p5053r2014
20046D69840K8806N1901m0518l1917P5520n112L2675k2693M4490j3606o7305o5674
20034D56407N2505P8776K2996R6757k5710j67556m036o4914o1883J4476o168P5127
20022D66777J47965n4493j48349J1730k0683m7595j5727q7950K9653R3994N6442
20011D31764J7665r2253L4737O4922Q868l3673o707J8099m3741l5638J2819L1280
19999D08142J11801P7357j9396j4106n3475k6392o243l0769k9813o1786l2853
19988C22467K1315J9187j64793o0326j6236j70209l735J60592O4161J6508j0039
19977A78892L5821L5711o6658l8988j35J5529K3351M6926n9565J3389k5468Q7593
$$ y = [572053, 555301, 526866, 562836, 665609, 605360, 617470, 706824, 697973, 636907, 561854, 469840, 498646, 550547, 510029, 478112, 553632, 548520, 581195, 558502, 602992, 589386, 522081, 456407, 508912, 587688, 610684, 707441, 681731, 514175, 510139, 445225, 383342, 397818, 391650, 466777, 614742, 560249, 411900, 423630, 402947, 355352, 339625, 251675, 281328, 375322, 431764, 449429, 357176, 391913, 456835, 465703, 432030, 425323, 443422, 399681, 364043, 376862, 408142, 519943, 597300, 577904, 563798, 510323, 483931, 477688, 446919, 417106, 355320, 322467, 343782, 362969, 198176, 137850, 121614, -48595, -52330, 108262, 172423, 188931, 178892, 214713, 250424, 183766, 144778, 144643, 160172, 183523, 230449, 170884, 184273, 158805, 246398]
19965B46398L5318j32071j33944L7758K8095j0994K8604K9378o783O5972R6443
19954B84174O3143j98891k9048M4835Q8330O4038m9699j9418J50633k2308o7165
19943C08624J7890N3327j489j01887q3885k0909n5297J73494J47972l8701N2919
19932D52058k2038n8295p9297l0850Q3240o1994q3963q393l0753O7539J4755p7290
19920A64719n568Q0104k5391K0589K7268j62162j3419J80096Q6555l3685r334
19909C09772q9536j05866L593j314k0611p8318J9609J47901J26207Q9245m6414
19898C54268k888k3729m8036n9563j54300l3593K23295R5524k6894j02313j09028
19887A12743J9817N1352K3119O5032l467j1997j1348o1109j00989K3436Q5417
$$ y = [246398, 281716, 149645, 15701, 53459, 81554, 70560, 99164, 128542, 121759, 187731, 284174, 347317, 148426, 119378, 164213, 252543, 316581, 266882, 247464, 398097, 375789, 308624, 326514, 379841, 378352, 276465, 192580, 171671, 116374, 289868, 437840, 399139, 452058, 430020, 371725, 292428, 261578, 344818, 282824, 198861, 190468, 159715, 227254, 242009, 164719, 159151, 239255, 213864, 234453, 261721, 99559, 86140, 266236, 352791, 319106, 309772, 220236, 114370, 117963, 116649, 96038, 17720, 37329, 185230, 311437, 400682, 354268, 351380, 327651, 279615, 220052, 65752, 32159, 255454, 350978, 324084, 221771, 112743, 132560, 183912, 207031, 272063, 268596, 256599, 245251, 184142, 83153, 106589, 192006]
19876A92006R8169p6596N7702J37745P4393j01470o3464K021q7149k3788R1219
19865C00788R5556j09297j0682P7488p0934j48806j00728l456P218N92J85097
19854B22836J5147O8375M8950L8809q7019j19670o8296K06006J02251n3690J5831
19843C89530Q871o8795k9195l5943P388j81132k2685O3211R290K2672j9015K3344
19831A67541M6089m738J6486m826K3461l763M1181J05414J0949P1519P5454K8806
19819E73573M7381m4023j70513Q025J77983R9216K02711K01806K22616J94720
19809A513495L6752j42745k36724k22817r0255p769J58828j2000Q0194K70970
19799A347929K69365P8015q662j24454p8876J0896l9360q3538n0808j51396j17486
$$ y = [192006, 290175, 213579, 271281, 409026, 483419, 381949, 318485, 320506, 233357, 209569, 300788, 396344, 287047, 276365, 353853, 282919, 134113, 33385, 29929, 37147, 37739, 222836, 237983, 306358, 355308, 394117, 307098, 187428, 119132, 325138, 427389, 373699, 389530, 398401, 329606, 300411, 264468, 271856, 90724, 68039, 131250, 140540, 163212, 144197, 167541, 213630, 208892, 225378, 220552, 244013, 240250, 281431, 386845, 397794, 469313, 544767, 573573, 620954, 576931, 406418, 414443, 592426, 691642, 894353, 1096159, 1318775, 1513495, 1550247, 1407502, 1170778, 947961, 857706, 849937, 1008765, 996765, 1076959, 1347929, 1617294, 1695309, 1686647, 1562193, 1483317, 1494213, 1454853, 1371315, 1320507, 1169111, 1051625]
19788A051625j51582j12633q7267l6354J2416q7081j1695J72350Q0110l6630j1070
19777G82189O0407p4761q5370k8787Q6685J17551J01497K19876O5184N7958P4706
19766A377135p8793k9127j3397L2964L2510l0136M6586L19528L50596J94163J07743
19755B309772J12864L4288q2309k30237k35539j21591l1877j84747j82785N6955
19745A444794J98221K11007O3531j86732j20427l551O9824j2609K1594j01829
19735A583823k47052l0534j24450J35544J18056o440L1423K0393o8572j51247
19725A260944q5124l0555o5440j56665L4451o7020q8268o4180n9323P6184j4993
19714G40011m6323l2762R406k6866J12773L5034J20425k3163j17245m6358R9809
$$ y = [1051625, 900043, 787410, 700143, 663789, 676205, 589124, 577429, 749779, 829889, 793259, 782189, 842596, 767835, 682465, 653678, 740363, 857914, 959411, 1179287, 1244471, 1302429, 1377135, 1298342, 1269215, 1255818, 1288782, 1321292, 1291156, 1337742, 1657270, 2007866, 2202029, 2309772, 2422636, 2456924, 2374615, 2144378, 1908839, 1787248, 1755371, 1570624, 1387839, 1444794, 1643015, 1854022, 1917553, 1730821, 1610394, 1606843, 1676667, 1664058, 1685652, 1583823, 1336771, 1306237, 1181787, 1317331, 1435387, 1428947, 1460370, 1480763, 1412191, 1260944, 1175820, 1145265, 1079825, 923160, 957611, 890591, 802323, 738143, 678820, 755004, 740011, 693688, 660926, 670332, 643466, 756239, 791273, 911698, 888535, 771290, 724932, 824741]
19703H24741J51990Q9546l9052j25938j66849M7466N7009J18551J11670N4832
19693A123966Q6663M2467J9151j42658j50062K6714m1986l7784J3931Q2323N9330
19682A082055o9005l4615K356J9129m7899R0803P334j47441o27o6416P9466r7305
19670H17835j01320P4907J11214P7275n1865j12823K27237P2066n7700k39035
19660H17791k07376k4606J2443J66817J75535M7254J07110J04487l3427j15711
19650A050317j29899p0628M5936Q5975J68467M3774n3977l7138J09145J27396
19640A339368J69487N1406Q6944J04749k1854j34951m1914L2225l8670K925P5251
19629A624966P7940J19541J40447j21505k10638j52469m8079j73699k18856p3501
$$ y = [824741, 976731, 1066277, 1027225, 901287, 734438, 781904, 838913, 957464, 1069134, 1123966, 1210629, 1253096, 1272247, 1129589, 979527, 1006241, 964255, 926471, 940402, 1022725, 1082055, 1013050, 978435, 980791, 999920, 952021, 1042824, 1050158, 902717, 902090, 835674, 915140, 817835, 716515, 791422, 902636, 979911, 928046, 815223, 1042460, 1114526, 1056826, 817791, 610415, 585809, 598252, 765069, 940604, 987858, 1094968, 1199455, 1166028, 1050317, 920418, 849790, 895726, 981701, 1150168, 1193942, 1139965, 1102827, 1211972, 1339368, 1508855, 1560261, 1647205, 1751954, 1730100, 1595149, 1553235, 1585460, 1546790, 1549715, 1624966, 1702906, 1822447, 1962894, 1841389, 1630751, 1478282, 1430203, 1256504, 1037648, 964147]
19619I64147O185L1106O8115r6517j13697L3993N0787J9448K6046k2234n3528
19608I13851J07132J1918k1158R7210Q6405k0331R52j04410k0678J98315J64634
19597A413840j1839p1871j4191l1365q748p5670M6054N6999l7553q1270L3038
19586A217424l536j45034K3286q357R5274N3156J02714j1746j11609m6321j38103
19575A027148j71839k5239K0794k9126K0421j1865O5257L5884r647R8185n269
19564A014704j46404q0016l2086M7476m9006L4595M2767K4342o4611j9855r9237
19553F72669L2758l373Q5064J03527M5629k3102l1210q3725m2414J0636P617Q670
19541G82746n0124p3013J67229P552l2280k2512m7103O731K8671J34585M1029
$$ y = [964147, 970332, 1001438, 1069553, 973036, 859339, 893332, 944119, 963567, 989613, 967379, 913851, 1020983, 1032901, 1011743, 1108953, 1195358, 1175027, 1175979, 1071569, 1050891, 1249206, 1413840, 1402001, 1330130, 1315939, 1284574, 1275826, 1200156, 1246210, 1303209, 1265656, 1184386, 1217424, 1213888, 1068854, 1092140, 1083783, 1179057, 1232213, 1334927, 1323181, 1211572, 1165251, 1027148, 855309, 830070, 850864, 821738, 842159, 830294, 895551, 931435, 921788, 1019973, 1014704, 868300, 788284, 756198, 803674, 754668, 789263, 832030, 856372, 791761, 771906, 672669, 705427, 702054, 787118, 890645, 936274, 913172, 881962, 798237, 755823, 766459, 774076, 782746, 732622, 659609, 826838, 834390, 802110, 779598, 732495, 739226, 767897, 902482, 943511]
19530I43511j66076J1540J00900j6582j28021j87835J20942J56735j5025r3942
19520G26147m3476q9545K2581L4887l0872l2204O946J19797J30417M9377K2437
19509I16492n1311m4612J3810J01160r44p4297N153L0899l0290o6550m3048r701
19497G46761j4380m77j76045j53590r6568J37809R980l8715Q7393Q7030k8048
19486E61150m4574N4195l6642K3278J37717M1928L211P8050K67L8207j3836l4967
19474H07984j5022k4901J10421J20020l0785j48735r5809q2868O562J8806P9622
19463G45295M0655J3850J5021j69883j7483N7053J11708J1396j57201k5239k3134
19452F02038q942Q2206R1207j731j03991j45072J38617J23878P8629k0360J7672
$$ y = [943511, 777435, 788975, 889875, 873293, 745272, 557437, 678379, 835114, 820089, 726147, 682671, 593126, 615707, 650594, 619722, 587518, 594464, 714261, 844678, 894055, 916492, 865181, 820569, 834379, 935539, 934595, 860298, 865451, 896350, 866060, 799510, 756462, 746761, 732381, 731904, 555859, 402269, 305701, 443510, 453490, 414775, 502168, 589198, 561150, 516576, 570771, 534129, 557407, 695124, 737052, 740263, 818313, 818580, 856787, 842951, 807984, 792962, 768061, 878482, 998502, 967717, 818982, 723173, 640305, 646867, 665673, 745295, 785950, 799800, 814821, 644938, 627455, 684508, 796216, 807612, 650411, 625172, 602038, 593096, 675302, 766509, 764778, 660787, 515715, 654332, 778210, 856839, 836479, 854151]
19441H54151P3362Q0823p6255j72799J1371J14059M9078P3891M5998J7065K34806
19430A305550K48888k6600m3265R937J3945L414o5005J20035J31188P7890Q6373
19419A862350J16879j0317q1739l3119p5837q1026j80113j5415j53J2206N0099
19408A563815Q2415J6406k0146n3699K820l8345q3418o7461P79o226K0482J30755
19396A548177P1190J36043n147j48849j20076Q3359J8689j06715K2898J18554
19386A618123J34721J73108J89370R3339J40746n5930o5240P6168J42831K61396
19376B708632K94693L12357J18072R4753j428j77854j45182n8635n8779N3439
19366C140068J87854J36086J08970O5141L8188j23368j62073k55754q4498l3395
$$ y = [854151, 927513, 1008336, 932081, 759282, 770653, 884712, 933790, 1007681, 1053679, 1070744, 1305550, 1554438, 1527838, 1484573, 1494510, 1508455, 1511869, 1446864, 1566899, 1698087, 1775977, 1862350, 1979229, 1968912, 1887173, 1854054, 1778217, 1697191, 1517078, 1501663, 1501510, 1513716, 1563815, 1646230, 1662636, 1642490, 1588791, 1591611, 1553266, 1469848, 1402387, 1403166, 1396940, 1417422, 1548177, 1619367, 1755410, 1750263, 1601414, 1481338, 1564697, 1583386, 1476671, 1499569, 1618123, 1752844, 1925952, 2115322, 2208661, 2349407, 2293477, 2228237, 2304405, 2447236, 2708632, 3003325, 3315682, 3433754, 3528507, 3527079, 3349225, 3204043, 3145408, 3086629, 3140068, 3327922, 3464008, 3572978, 3638119, 3676307, 3552939, 3390866, 3135112, 3050614, 3017219]
19356C017219L802m9084l2236k6263P6527O3654l8499N8625k9947m9021P7752
19345C072529O1923P9097L863J83796j529l7669K07810N7210q391K6514J58242
19334C803395J89100J97149N0745P1689J98759J76397J57263K93163K73740M19967
19324E831367O01154O77180P12615P80039O28584L19082M00996N74605Q69420
19315A1395042J006279J302919J900213K592813L768700N176630P294826Q252600
19307D2690022P143832L539644j172544k335111J028186O237742J3015881K3803470
19299I3951122M0385246N7974820O1208080M8502963J7997174k0768520l0305120
19292B68945765k3184466k7969743l9520258l4638208j9265399n191221N061406
$$ y = [3017219, 3021021, 2971937, 2939701, 2913438, 2989965, 3053619, 3015120, 3073745, 3043798, 2994777, 3072529, 3134452, 3213549, 3217412, 3401208, 3399679, 3362010, 3569820, 3627030, 3618639, 3645153, 3803395, 3992495, 4189644, 4240389, 4312078, 4510837, 4687234, 4844497, 5137660, 5411400, 5831367, 6432521, 7109701, 7822316, 8602355, 9230939, 9550021, 9951017, 10525622, 11395042, 12401321, 13704240, 15604453, 18197266, 21965966, 27142596, 34437422, 42690022, 49833854, 53373498, 52200954, 49865843, 50894029, 57131771, 70147652, 93951122, 134336368, 192311188, 253519268, 302022231, 320019405, 299250885, 268945765, 245761299, 217791556, 178271298, 143633090, 124367691, 119176470, 124237876]
19285A24237876R760484P680205r90283j4248181k1294028j8274641j2684060
19278G4187372q436859n944459m297484l192966k146920j434225p29300m12280
19270D7592879l02135k32046l90489m09205n25542l83418Q8529Q19454J835151
19261D8093178L296254N466742Q706390J3564546J9404551K2533160J9107497
19254A40172318R373441n292573j4035887r949908N20919J3445826K9420003M5794995
19246B09449134N6303804O1355615N7566051L8258647J6748784j2018584o3508348
19239C64155103q8561333o7766216m0987561k3615138j3178647n231485p9902
19232A24734821P77175k197471q868664j4044384j2246555q420190n861025m699094
$$ y = [124237876, 133998360, 141678565, 140688282, 126440101, 105146073, 86871432, 74187372, 65750513, 59806054, 55508570, 52315604, 50168684, 48734459, 48005159, 47592879, 47290744, 47058698, 46668209, 46259004, 45733462, 45350044, 45438573, 46258027, 48093178, 51389432, 56856174, 65562564, 79127110, 98531661, 121064821, 140172318, 149545759, 144253186, 130217299, 120267391, 120788310, 134234136, 163654139, 209449134, 265752938, 327108553, 384674604, 422933251, 439682035, 427663451, 364155103, 275593770, 207827554, 166839993, 143224855, 130046208, 124814723, 124734821, 125511996, 123314525, 114445861, 100401477, 88154922, 79734732, 73873707, 69174613]
19224F9174613m103007l414993k587705k027801j611072j388411j224793j288140
19216E1528691j326301j624826j811832j624393j221485j003559r14891n84882
19208D1416522k91441j97341k23549j2027J40546O64674J627017K826794N105025
19199E1056220Q828994J3711632J5350312J1268286L263746j1339452j5782427
19192G6357311j0285860m519126Q7878M957078J0915526J5676627J4634016J0483477
19184A18306927Q61960n449089K69674K784322j88640j1379218j8286415j3636142
19176G3283379p419630k511077K362862P711365J2250070J1915094O950170l442704
19168A01099529j6736477j6357026j0762793o900105m530669k992334k060474
$$ y = [69174613, 65071606, 61656613, 59068908, 57041107, 55430035, 54041624, 52816831, 51528691, 50202390, 48577564, 46765732, 45141339, 43919854, 42916295, 42001404, 41416522, 41125081, 40927740, 40704191, 40692164, 40832710, 41497384, 43124401, 45951195, 51056220, 59885214, 73596846, 88947158, 100215444, 103479190, 92139738, 76357311, 66071451, 61552325, 61640203, 66597281, 77512807, 93189434, 107823450, 118306927, 119168887, 113719798, 113989472, 116773794, 116585154, 105205936, 86919521, 73283379, 65863749, 63352672, 65715534, 73426899, 85676969, 97592063, 104542233, 101099529, 84363052, 68006026, 57243233, 50343128, 45812459, 42820125, 40759651]
19161D0759651j488567j101402p81044m50961k90664j58217Q6656L74591Q13495
19152C7763538J700413K835435M911618Q885293J4323959J7962810J4774386P303666
19144A10461118q143553j8468044j3913215o788584j333734M023735J0348248
19137G6185971J6311579J7065646J3173908N055170m853047p29337L623049J688019
19129A27520958q648443k1076664j8072730j0426284m042954J078332O589492
19122G2921707J2457237J4390406R350940m121j5648584j9981835j4101298q860445
19114E0524007n572596l621400k738910k236597j751137j342490j196801j205558
19106C0858518j070906q28560p92901p64480n29983p45517o64257p45358p41268
$$ y = [40759651, 39271084, 38169682, 37388638, 36937677, 36647013, 36488796, 36575452, 36950043, 37763538, 39463951, 42299386, 47211004, 56096297, 70420256, 88383066, 103157452, 110461118, 102317565, 83849521, 69936306, 63147722, 61813988, 65837723, 76185971, 92497550, 109563196, 122737104, 127792274, 122939227, 122209890, 125832939, 127520958, 118872515, 97795851, 79723121, 69296837, 65253883, 66332215, 72921707, 85378944, 99769350, 109120290, 109116169, 93467585, 73485750, 59384452, 50524007, 44951411, 41330011, 38591101, 36354504, 34603367, 33260877, 32064076, 30858518, 29787612, 28959052, 28166151, 27401671, 26871688, 26126171, 25461914, 24716556, 23975288]
19097B3975288o39213o15736n38529m71637n41888q00262p26840m81442m24562
19088A8735179l23807k79428l05073n02055l59119k54905l19751k77773k22295
19079A5890973l83543m42266m26573l00181j25601j86419k16440j88510j69667
19070A3451773j76058l23994k99259j67312k03182k74446k76641l24009k33275
19061A1173597p2336k42117j76582r052K1989n9941k55834k21360j16749j38034
19051I903581p0079Q2877j18204j35215j89696k75233k07287k07910k37129j53493
19041H392212q5967j43585o9840r5000q1764m1470j71358j69970j88453j58800
19031G186005k14557l03620j04818m6419K6213J0942j0068p6469j68225j07706
$$ y = [23975288, 23336075, 22720339, 22181810, 21710173, 21168285, 20368023, 19641183, 19159741, 18735179, 18411372, 18131944, 17826871, 17324816, 16965697, 16710792, 16391041, 16113268, 15890973, 15507430, 15065164, 14638591, 14338410, 14212809, 14026390, 13809950, 13621440, 13451773, 13275715, 12951721, 12652462, 12485150, 12281968, 12007522, 11730881, 11406872, 11173597, 11101261, 10859144, 10682562, 10673510, 10695499, 10635558, 10379724, 10158364, 10041615, 9903581, 9833502, 9916379, 9798175, 9662960, 9473264, 9198031, 8990744, 8782834, 8545705, 8392212, 8306245, 8162660, 8092820, 7997820, 7916056, 7874586, 7703228, 7533258, 7344805, 7186005, 6971448, 6667828, 6563010, 6516591, 6542804, 6553746, 6543678, 6467209, 6298984, 6191278]
19021F191278m1301K8919k5698l8190p135j30359j45025k6382k4004o7585K7059
19010E741577J22028n0209j30673j17092p8334j41184r8632o6714r5409J69847
19000E255205k3987j19017j47523p4061L7649J22957J6626j95951k4196J78269
18990E025971J30482j611J20654O7966R4047R0772J46320J92076M39866M39325
18980F745868N89796Q14741Q76995N23473l5962j11297n08211o56648n57668n54287
18970G126800l74345k61693k68942K0577J90162J07627j0136j08973k04113k55245
18960E961719j30160p8786Q314o6106m4907L2478m9954J29278O1109Q7826j550
18949E909261L6757K74805J62145J35082L43513L32980L72591L79549M11222N10197
$$ y = [6191278, 6149977, 6178896, 6153198, 6115008, 6107873, 5977514, 5832489, 5806107, 5782103, 5714518, 5741577, 5863605, 5813396, 5682723, 5565631, 5487297, 5346113, 5247481, 5180767, 5085358, 5255205, 5231218, 5112201, 4964678, 4890617, 4928266, 5051223, 5067849, 4871898, 4847702, 5025971, 5156453, 5154842, 5275496, 5343462, 5437509, 5528281, 5674601, 5866677, 6306543, 6745868, 7335664, 8150405, 9027400, 9550873, 9514911, 9403614, 8895403, 8238755, 7681087, 7126800, 6752455, 6490762, 6221820, 6242397, 6432559, 6540186, 6530050, 6421077, 6216964, 5961719, 5831559, 5752773, 5761087, 5694981, 5650074, 5682552, 5632598, 5761876, 5822985, 5910811, 5909261, 5946018, 6220823, 6382968, 6518050, 6861563, 7194543, 7567134, 7946683, 8357905, 8868102]
18939H868102M85570P02816P23367Q67590P38671Q42528Q11129Q45589J098155
18930A5983517J343525J562560K122171K897561L941350N858074Q100079R813815
18922E1622652R976601Q703938M793015K667556K527730L797602J1204526K4244765
18914A19538385M1132250N6246523O3102298O2401469L8499516J0292782q208468
18907C83004755l8944816n3707259m5202316m0256447l4158758j9923635o171669
18900A44639855K621301N874061M157674l626652j0725436j5206725j8463598
18893A09270480j6523558j1928495q078434n580291l921894k913558k258070j833050
18885E6233130j516519j232174j077218q67033n72684m40280j60835K01161M35411
$$ y = [8868102, 9353672, 10056488, 10779855, 11647445, 12386116, 13228644, 14039773, 14885362, 15983517, 17327042, 18889602, 21011773, 23909334, 27850684, 33708758, 41808837, 51622652, 61599253, 70303191, 75096206, 77763762, 80291492, 84089094, 95293620, 119538385, 160670635, 216917158, 280019456, 342420925, 380920441, 391213223, 383004755, 344059939, 290352680, 245150364, 204893917, 170735159, 150811524, 144639855, 147261156, 153135217, 157292891, 153666239, 142940803, 127734078, 109270480, 92746922, 80818427, 72739993, 67159702, 63237808, 60324250, 58066180, 56233130, 54716611, 53484437, 52407219, 51540186, 50967502, 50527222, 50366387, 50567548, 51002959]
18876E1002959J026050K220280M372526P381141J1405350J4526656J5498550J3898034
18868A21331546P423819R91213j883133k930534L279601J4601042K4130032L1900671
18860A98844257L5896756L3107069K9502737J9382619k468138k6865476l3647133
18853B53752691m3908606m6179854l2534099j9247466j0181623m511520k049823
18846I5139700j335305l012555n259340o167360p330488p081431n280393l908406
18838E5764422l036481k340054j909167j652600j720632j643312j371702j258688
18830D0831786j335838j296820j213699j026134q61016r37578r00426p88858p31839
18821C1739578p77201p63421q47189o87355p07433o40101l83274k46683m3477
$$ y = [51002959, 52029009, 54249289, 58621815, 66002956, 77408306, 91934962, 107433512, 121331546, 128755365, 129746578, 127863445, 124932911, 128212512, 142813554, 166943586, 198844257, 234741013, 267848082, 297350819, 316733438, 314265300, 287399824, 253752691, 209844085, 163664231, 131130132, 111882666, 101701043, 97189523, 95139700, 93804395, 90791840, 85532500, 79365140, 72034652, 64953221, 59672828, 55764422, 52727941, 50387887, 48478720, 46826120, 45105488, 43462176, 42090474, 40831786, 39495948, 38199128, 36985429, 35959295, 35098279, 34160701, 33260275, 32471417, 31739578, 30962377, 30198956, 29351767, 28664412, 27956979, 27316878, 26933604, 26686921, 26643444]
18812B6643444k65133m32096n07904o85434p61943n82437l55766j59929J18027
18803B3010829J76826j14968k62806p75328q90207o91425p59565p14181m83043
18794A8496132l72031k04627o927k23193m94666m98711n45199m79069j62064j28913
18784A5380732o6756l5047l5995o5321j77295j59815k31633j90114k63627j27440
18774A4027689n1150J23775L9296j74055k09244k15669k65285k90915r1057O2455
18764A2955840L23435M02840M97402L96396K77538k42462r71113j041933p00967
18755A1896976n12934k59948J30692M45247M95046M56463J27347n15935r34369
18746A1328585q90997o26130n78948m28314p8939j09340k21294N248K08181K63871
$$ y = [26643444, 26378311, 25946215, 25438311, 24752877, 23990934, 23408497, 23052731, 22892802, 23010829, 23187655, 23072687, 22809881, 22034553, 21144346, 20452921, 19693356, 18979175, 18496132, 18124101, 17919474, 17912547, 17689354, 17194688, 16695977, 16150778, 15671709, 15509645, 15380732, 15313976, 15278929, 15242934, 15177613, 15000318, 14840503, 14608870, 14418756, 14155129, 14027689, 13976539, 14100314, 14139610, 13965555, 13756311, 13540642, 13275357, 12984442, 12893385, 12955840, 13279275, 13682115, 14179517, 14575913, 14853451, 14610989, 13639876, 12597943, 11896976, 11384042, 11124094, 11254786, 11700033, 12195079, 12651542, 12778889, 12262954, 11328585, 10437588, 9811458, 9232510, 8804196, 8725257, 8615917, 8394623, 8399871, 8608052, 8871923]
18736H871923L99545L15114L3870j55142k76277j09974J42949K93658N75098M72914
18726A0563678J74904q4659n02469p38341o05645n45861k52213j45222j5318l2963
18716G815891R2267L7936l76211m53631l81794m45800l06523j21042p1626k50675
18706E538792k17052k3608m9911j5171J51273K85790J5896l3960m0087j68680
18696E443282j22697l1405j44061o0958O5705K35774L67453K56541M49414N35385
18686F994433O97650P50335N41183k32557q02374r50163n86406l22346K6950M18682
18676F535387O77672Q33622N37305J28539m89130q76675r85970o29196l41905
18667E389649l63123k56524L4752j98528k25256j40063k42137j53745j66597l3762
$$ y = [8871923, 9271468, 9586582, 9620452, 9465310, 9189033, 9079059, 9222008, 9515666, 10090764, 10563678, 10738582, 10653923, 10151454, 9413113, 8807468, 8261607, 8009394, 7864172, 7848854, 7815891, 7908158, 7946094, 7569883, 7116252, 6734458, 6288658, 5982135, 5861093, 5789467, 5538792, 5321740, 5298132, 5248221, 5233050, 5384323, 5670113, 5686009, 5652049, 5611962, 5443282, 5320585, 5289180, 5145119, 5084161, 5149866, 5385640, 5753093, 6009634, 6459048, 6994433, 7692083, 8442418, 8983601, 8751044, 7948670, 6998507, 6412101, 6089755, 6116705, 6535387, 7213059, 8046681, 8583986, 8712525, 8223395, 7346720, 6360750, 5731554, 5389649, 5026526, 4770002, 4804754, 4606226, 4380970, 4240907, 3998770, 3845025, 3678428, 3644666]
18657C644666N5374j1015J9689p9174j17949j64567p1450m1633O5227q1521k95939
18646B921708j74984o9304P9851Q5224J19851R5527J50232J8031o3J35512k3445
18635C338140q3564J01062j0524k5515L4993r1027k42261k29918O0889J36462
18625B988737P3048O3181N2155L3791j04027o1280O523m9559j0206j54854J9212
18614B856721M2553M554l2506R3757R3031L1523O8855n7759o0036K9155N3888
18603C123736J30R3093P6090j92032k45824O2912J07493k6083r1132P7816K7823
18592C014022k2132o0856m5880n4514P2441K05127J62852j5652J74K5370n4723
18581C226229j21330q9274j9699l9303j021j3197o4533j26023j14139k3357o8307
$$ y = [3644666, 3700040, 3689025, 3708714, 3629540, 3511591, 3347024, 3275574, 3233941, 3299168, 3217647, 2921708, 2746724, 2677420, 2757271, 2842495, 2962346, 3057873, 3208105, 3226136, 3226073, 3361585, 3338140, 3254576, 3355638, 3345114, 3319599, 3354592, 3263565, 3021304, 2791386, 2852275, 2988737, 3061785, 3124966, 3177121, 3210912, 3106885, 3045605, 3052128, 3002569, 2992363, 2837509, 2856721, 2899274, 2903828, 2871322, 2965079, 3058110, 3089633, 3158488, 3100729, 3040693, 3069848, 3123736, 3123866, 3216959, 3293049, 3101017, 2855193, 2918105, 3025598, 2999515, 2908383, 2986199, 3014022, 2991890, 2931034, 2885154, 2830640, 2903081, 3108208, 3271060, 3255408, 3255582, 3280952, 3226229, 3104899, 3015625, 2995926, 2956623, 2955602, 2942405, 2877872, 2751849, 2637710, 2614353, 2546046]
18570B546046l2101l6934K2666J36031J32476J09072m5152L3700L7919O2596J10315
18559C076634K78395N06603L21762K57305p9149j36800k97072k15289k45023j23972
18549C343394J46960K43255L35344K47622N0770r4574j59891l38392k64392j29461
18539C380635j39114k20638j87779k5704K3249N2956M5446J5758J55620K91098
18529C391527J59904j20417l81854r8233J94593J72971J14103K04352L38135n2866
18519C922215k39304k51519j76761k06892J76174M57254M80688O53381M32030
18510E247266J13168j31104m93826n17287m56007r7147J42485M43285N98582M37332
18500E286747K82090k14880n86436o62832l89171r7002l0915N7339j04156L4759
$$ y = [2546046, 2513945, 2477011, 2499677, 2635708, 2768184, 2877256, 2832104, 2865804, 2903723, 2966319, 3076634, 3355029, 3861632, 4183394, 4440699, 4361550, 4224750, 3927678, 3712389, 3467366, 3343394, 3490354, 3733609, 4068953, 4316575, 4367345, 4272771, 4112880, 3774488, 3510096, 3380635, 3241521, 3020883, 2833104, 2807400, 2830649, 2883605, 2929051, 2944809, 3100429, 3391527, 3551431, 3431014, 3049160, 2950927, 3145520, 3318491, 3432594, 3636946, 3975081, 3922215, 3682911, 3431392, 3254631, 3047739, 3223913, 3681167, 4161855, 4815236, 5247266, 5360434, 5229330, 4735504, 4218217, 3762210, 3665063, 3807548, 4250833, 4849415, 5286747, 5568837, 5353957, 4767521, 4104689, 3715518, 3618516, 3587601, 3644940, 3540784, 3575543]
18490C575543k6106k9567n3544j42731p7600k06642j35881Q229L4627j4612k8166
18479B903550R9433J68594R5823R9449J19908Q7369N8268J27244K89459J92577
18469D241674M13942L13502K53725J91278L94378L46152L91185J07794l86131
18460F267499p32250m83124j45573N4103K89477L89956K11059K9894q1495R1070
18450E890616L35669L44646L5029k33953J01901L98324L10193j37835o10276p85212
18440E649102n62888k77522L8707Q9967M2972q1817j70567k55143j32517M7421
18430D387715K19028L34762M02443L76072J33200n2863k18499k86849o6014K81434
18420E510429O73950P01557Q67448N22012K35346J66844J29593l9440n435J24096
$$ y = [3575543, 3549437, 3519870, 3466326, 3323595, 3245995, 3039353, 2903472, 2911701, 2946328, 2931716, 2903550, 3002983, 3171577, 3267400, 3366849, 3486757, 3574126, 3632394, 3759638, 4049097, 4241674, 4655616, 4969118, 5222843, 5414121, 5808499, 6154651, 6545836, 6653630, 6267499, 5535249, 5052125, 4906552, 4960655, 5250132, 5640088, 5851147, 5881041, 5799546, 5890616, 6226285, 6570931, 6605960, 6372007, 6473908, 6872232, 7182425, 7044590, 6434314, 5649102, 5086214, 4808692, 4847399, 4937366, 4980338, 4898521, 4727954, 4472811, 4340294, 4387715, 4606743, 4941505, 5343948, 5720020, 5853220, 5800357, 5581858, 5295009, 5228995, 5510429, 6184379, 6885936, 7753384, 8275396, 8510742, 8677586, 8807179, 8767739, 8762304, 8886400]
18410H886400K63220L46439N74101N14810L92336M76293O71069R76578J210171
18401A4311417J584784K350260L289675M467026O901704J0805419J6262915J9439264
18393G9412464J5849512Q937528m817957p895805K012074P125383M239348m943119
18385I9919428j9846624k0040410j3229320q124208n131991l434809k339668j657703
18377B6114695j090216p79124l73183o2982K20780K90868M69231Q98349J597208
18368B7285626K865947M727088P726093J2367223J7601218J8269883J3409104
18361A04252182M296200p702288m262020M964311O351988J867429j0744232k0509847
18353G8513723j6379094j0014154n871950l233564j212709R00919L447767O839506
$$ y = [8886400, 9149620, 9496059, 10070160, 10584970, 10977306, 11453599, 12124668, 13101246, 14311417, 15896201, 18246461, 21536136, 26003162, 32904866, 43710285, 59973200, 79412464, 95261976, 104199504, 99381547, 91485742, 93497816, 100623199, 104862547, 99919428, 80072804, 60032394, 46803074, 38678866, 33546875, 30112066, 27772398, 26114695, 25024479, 24245355, 23872172, 23809190, 24029970, 24320838, 24790069, 25688418, 27285626, 30151573, 34878661, 42604754, 54971977, 72573195, 90843078, 104252182, 108548382, 100846094, 96584074, 101548385, 107900373, 109767802, 99023570, 78513723, 62134629, 52120475, 46248525, 43014961, 41802252, 42703171, 46150938, 52990444]
18345E2990444J1958252J6215186J4683054R812284q18022q206632j234589N470540
18337A00870517M348391j927542j5512904j9451929j3788947q675350n469566
18330D0392670l675090k668615j967113j393530j225116q87388n56105k95647
18322B7724066K5500L53288N66843J081494J870116L121038N614912R231220J3983450
18313F3571927J6267348J2939569O747244n437083o513691K071850N611204K882059
18305I8140427o183887j8507514j7338009j1072415o740954m265724l121578k466138
18297B8444208j770070j412982j256335j126153r41525p47117n91688p01934p68703
18288A9127701o19484n61780n64615m19384m70908m40165m39433m77793l65837
$$ y = [52990444, 64948696, 81163882, 95846936, 105659220, 104841198, 96634566, 95399977, 100870517, 105218908, 103291366, 87778462, 68326533, 54537586, 45862236, 40392670, 36717580, 34048965, 32081852, 30688322, 29463206, 28575818, 28019713, 27724066, 27749566, 28102854, 28669697, 29751191, 31621307, 34742345, 40357257, 49588477, 63571927, 79839275, 92778844, 99526088, 94089005, 87575314, 89647164, 95258368, 98140427, 91956540, 73449026, 56111017, 45038602, 38297648, 34031924, 30910346, 28444208, 26674138, 25261156, 24004821, 22878668, 21937143, 21190026, 20598338, 19896404, 19127701, 18508217, 17946437, 17381822, 16962438, 16491530, 16051365, 15611932, 15134139, 14768302]
18279A4768302m30419l56251l10763l80060l02609k72592j95959j78160l75815
18270A1965674l64947l80698k20112p9424j51141k51919k39498o6353j43667k50838
18260I817077k32169k61968k12061k57670j64820k23571k39039j33858j67882
18251G924039j49602k3490j71760k83535r6245p7405j13486j32829k03619j69350
18241F502718m7015o5306k48676j80238j04681n9579m5928o8604r6490k4183K8458
18230E590476L1722k86899j89850j28645p2082k5286n5949O4381r1765k35008
18220D601095j1646L6951J0484J5206j39586n3555m3534L4855j0286j10099j77483
18209D152402k33951M1573J36094j9716j28368j80608j62848j33374J1660o0262
$$ y = [14768302, 14337883, 13981632, 13670869, 13290809, 12988200, 12715608, 12519649, 12341489, 11965674, 11600727, 11220029, 10999917, 10920493, 10769352, 10517433, 10277935, 10211582, 10067915, 9817077, 9584908, 9322940, 9110879, 8853209, 8688389, 8464818, 8225779, 8091921, 7924039, 7774437, 7750947, 7579187, 7295652, 7199407, 7122002, 7008516, 6875687, 6672068, 6502718, 6455703, 6390397, 6141721, 5961483, 5856802, 5797223, 5751295, 5682691, 5586201, 5562018, 5590476, 5622198, 5335299, 5145449, 5016804, 4944722, 4919436, 4863487, 4927868, 4836103, 4601095, 4589449, 4626400, 4636884, 4652090, 4512504, 4458949, 4415415, 4450270, 4439984, 4329885, 4152402, 3918451, 3960024, 4096118, 4076402, 3948034, 3767426, 3604578, 3471204, 3482864, 3422602]
18199C422602n9575P3627J3405q6783J9754o5051n6331j78158j89563M2212N2859
18188B988998O3925r4018m4645l4287j06769j20260J0125J08708M3750j40560
18178B674967j634j34511p9134j48143j64312m2672M8870N1138k8463q1080P514
18167B102540L4350m9514q5260Q568L1276k4104p4612l7277p6267j2722J866O6859
18155A885703J06020J7644j16517q5935m5956k0030q2114k8049J17259k4576P551
18144A731000J61706j6727j32807n5741m9851k302J104J36236j0708R0933K6594
18133A879437k3035J3985P430K01930J69695P0945p2148k6162p5433r333O9657
18122B206968K03748L55001K85516M51180N75476L47292N73762Q11734R53321
$$ y = [3422602, 3363027, 3436654, 3450059, 3363276, 3383030, 3317979, 3261648, 3083490, 2893927, 2936139, 2988998, 3052923, 2958905, 2914260, 2879973, 2773204, 2652944, 2663069, 2771777, 2815527, 2674967, 2673333, 2538822, 2459688, 2311545, 2147233, 2104561, 2153431, 2204569, 2176106, 2095026, 2102540, 2136890, 2087376, 2002116, 2010684, 2041960, 2017856, 1943244, 1905967, 1829700, 1816978, 1818844, 1885703, 1991723, 2009367, 1892850, 1806915, 1760959, 1740929, 1658815, 1630766, 1748025, 1723449, 1731000, 1892706, 1875979, 1743172, 1687431, 1637580, 1635278, 1636382, 1772618, 1761910, 1852843, 1879437, 1856402, 1870387, 1877817, 2079747, 2249442, 2320387, 2248239, 2222077, 2146644, 2137311, 2206968, 2410716, 2765717, 3051233, 3502413, 4077889, 4425181, 4998943, 5810677, 6763998]
18113F763998J336621J926121L038616N046524Q882571J6277175K7585106L1816336
18105A02673068K0985714Q227306l1601552l6833487k1496924j1588153o553151
18098B3812821m053761k755587j893524j445564j158099r23321o52177m53946
18090A0476842l38085n45033m96637k65258l01834m41861m39901l36838k94175
18081G017220k84199j35121j53376l29648k16138j56869j57320j86426j66882
18072E231241j30381j17386j11946j75677j13514p4545o3497n5875J1309j19041
18062D280688k09687j05153j40610j19573J1522r9398j09420k5740l3908r3286
18052C355435p8670j6939j47397j62491o4411J783O786o9636j4749r824j84549
$$ y = [6763998, 8100619, 10026740, 13065356, 18111880, 26994451, 43271626, 70856732, 102673068, 123658782, 131886088, 100284536, 63451049, 41954125, 30365972, 23812821, 19759060, 17003473, 15109949, 13664385, 12506286, 11582965, 10930788, 10476842, 10138757, 9593724, 9097087, 8831829, 8529995, 8088134, 7648233, 7311395, 7017220, 6733021, 6597900, 6444524, 6114876, 5898738, 5741869, 5584549, 5398123, 5231241, 5100860, 4983474, 4871528, 4695851, 4582337, 4507792, 4444295, 4388420, 4399729, 4280688, 4071001, 3965848, 3825238, 3705665, 3717187, 3617789, 3508369, 3482629, 3448721, 3355435, 3276765, 3259826, 3112429, 2949938, 2885527, 2887310, 2894096, 2824460, 2809711, 2799887, 2615338]
18041B615338j51947L6582k9293K8880m6996o3827k7410p9275j81578p2058k8738
18030A999678j0553N4240J3939n4916k0730p6111r8963J0052n9604k2979L5775
18019A769828p7623J1880j06465j14711j47764j82356M5388J23113R9886p7451
18009A343725k4874o598N3462l4311k4231m7666r6365j32663j14529N781Q4550
17998A006281n1523K11K2483K5706M5319K2254j28227j12283j5620m0335P6270
17987H50536P3430j9265k6200m8614j38615r898n653L9526Q4796n6912K7157J07269
17975H77557o2306l9019J8167r7206p6542N3611O4113r0357o0209n8521M684N7843
17963E91815J70732O8806r11l6339r9808j00283k5244O6509k8844j54633n7584
$$ y = [2615338, 2463391, 2499973, 2470680, 2499560, 2452564, 2388737, 2361327, 2282052, 2100474, 2028416, 1999678, 1989125, 2043365, 2057304, 2002388, 1981658, 1905547, 1806584, 1816636, 1757032, 1734053, 1769828, 1692205, 1704085, 1597620, 1482909, 1335145, 1152789, 1198177, 1321290, 1421176, 1343725, 1318851, 1312253, 1365715, 1331404, 1307173, 1259507, 1163142, 1030479, 915950, 921731, 1006281, 954758, 954969, 977452, 1003158, 1048477, 1070731, 942504, 830221, 814601, 774266, 850536, 923966, 904701, 878501, 829887, 691272, 681374, 675721, 715247, 800043, 743131, 770288, 877557, 815251, 776232, 794399, 697193, 620651, 674262, 738375, 648018, 587809, 529288, 533972, 591815, 762547, 831353, 830442, 794103, 694295, 594012, 568768, 635277, 606433, 451800, 394216]
17952C94216k5593O4389R952p4553o6046K1743n6178M0113Q7925P9389P3832j49990
17940C99199r9541j1747J26712N2963R5663J8132r9975R7372M4999l8963j40408
17929D44406K2036q625j09810J05294q3296j78990J74389J64121n9373j30031
17919C40121j22900r0351L836J11240m3851k2901n3379L1608Q6823Q492l8004
17908B10734J49440J25393K5196j7610m3748j35163q2873n1007Q0198k4201q5634
17897A50725Q7609j2501K4101N9803M2818m7689j01385o6288Q4903O8097M4475
17886C34668K3136O2371L1657J4441n3490j75436l1725N4110n8782J6172P2494
17875B89616p5345q3230M2369K29019K17633P627N8505K5982j93197k7207M5201
$$ y = [394216, 368623, 433012, 442964, 368411, 302365, 324108, 267930, 308043, 395968, 475357, 549189, 399199, 299658, 287911, 414623, 467586, 563249, 581381, 481406, 578778, 623777, 584814, 444406, 466442, 457817, 348007, 453301, 370005, 191015, 365404, 529525, 470152, 340121, 217221, 126870, 130706, 241946, 198095, 175194, 121815, 153423, 240246, 248738, 210734, 360174, 485567, 510763, 493153, 449405, 314242, 231369, 180362, 260560, 236359, 150725, 238334, 225833, 249934, 309737, 352555, 304866, 203481, 137193, 222096, 290193, 334668, 357804, 420175, 451832, 466273, 412783, 237347, 205622, 259732, 200950, 217122, 289616, 214271, 131041, 173410, 402429, 620062, 627689, 686194, 712176, 518979, 491772, 536973]
17864E36973m7726p1658j01264q1963k6760J8576J20350q460j04677j59915p3310
17853A66J13349R6127l9249n704l0126o0672o3574R5365J47041j100k3565R6843
17841C24901R5876K3553J15853K5925m1990M5863L2263j2261j21906k17090j08886
17830A62101k8701j41294q7970J4921M4508J01669J43441J36311J32727J45592
17820F23305k3169o2617j270j59197j3249k2753q7552j29933n5511m005j1104
17809E2945m1398n3736K1722L4978l2780p8942K5279M6544J17297k8407q4190
17798b0688M0596K9490Q9573K30312P1065q8487j19132M0163J6138M1957N2584
17787C83571l3287r6017p5999J6812J79550M6404o5436m4240N1192j11218q6258
$$ y = [536973, 489247, 417589, 316325, 234362, 207602, 226178, 346528, 338068, 233391, 73476, 166, 113515, 209642, 170393, 164689, 134563, 73891, 10317, 105682, 252723, 251623, 228058, 324901, 420777, 444330, 560183, 586108, 544118, 589981, 622244, 609983, 488077, 270987, 162101, 133400, -7894, -95864, -80943, -36435, 65234, 208675, 344986, 477713, 623305, 600136, 537519, 536249, 377052, 363803, 341050, 253498, 123565, 68054, 64049, 52945, 11547, -42189, -20467, 14511, -18269, -97211, -71932, -25388, 91909, 63502, -20688, 19908, 49398, 138971, 369283, 440348, 351861, 232729, 272892, 289030, 330987, 383571, 350284, 254267, 178268, 195080, 374630, 421034, 355598, 311358, 362550, 251332, 165074]
17776A65074r3229j27707j7709J96301O3317p7235K6307K9512n8206j9567N0864
17765A37722k1567l1915m6173R1854L8057o8762q1064k0020R8338P1273o8811
17754I8932k9043m5474j06874J24785m6412m8570o6320j1231J42893n9506k2712
17743f9532L1931o0193J795R282J6123Q7456j1779M5573m5802r4226j2127J09205
17731G706P0427j2857r4112l8271L2784Q662J49839O4234j1450j5844o7362J4538
17719A08294J48277J6417L0428q0839j19442o8468J5481J48215J64367J00914
17709D63644K8892K779j35895j49845m1464M1232o4532k527m4439l0629J7117
17698H4333k315K0522r9817l9415o4706J09939R6678M7612M176j44839q8556j4514
$$ y = [165074, 71845, -55862, -73571, 122730, 186047, 108812, 135119, 164631, 106425, 86858, 137722, 116155, 84240, 38067, 129921, 167978, 99216, 18152, -1868, 96470, 167743, 98932, 69889, 24415, -82459, 42326, -4086, -52656, -118976, -130207, 12686, -46820, -69532, -37601, -97794, -95999, -86717, -70594, 16862, 5083, 50656, 4854, -89372, -101499, 7706, 78133, 65276, -28836, -67107, -34323, -25661, 124178, 188412, 176962, 161118, 93756, 108294, 256571, 272988, 303416, 222577, 103135, 34667, 50148, 198363, 362730, 463644, 492536, 495315, 359420, 209575, 168111, 209343, 144811, 142284, 97845, 67216, 84333, 82018, 102540, 2723, -36692, -101398, 8541, 105219, 152831, 157007, 12168, -76388, -90902]
17686i0902J21309J89045J5050k37447j18906r6051N2702N0605L7212Q2068J4077
17675A8762m9904R5824K1616p1245k117J18176R1052o7192j7806L3935Q2555k334
17663B51322l8211L7735O0195l2246n9194R3645K20863J28452J7229j35488j44622
17652C99680r7265j36843o8540J4604p5139J208o9173P709J4106K5383l5654k3337
17640d3261k8697K6210J14012Q9101j0108j10516j2139l0110j00948P5573J31492
17629A00609j28508q7611N4288J6526j0846k8219M1669J00041R9265l5336L041
$$ y = [-90902, 30407, 219452, 234502, -2945, -121851, -217902, -165200, -114595, -77383, 4685, 18762, -31142, 64682, 86298, 15053, 12936, 131112, 222164, 154972, 137166, 171101, 253656, 251322, 213111, 250846, 311041, 278795, 219601, 313246, 534109, 662561, 679790, 544302, 399680, 302415, 165572, 97032, 111636, 36497, 37705, -31468, -23759, -9653, 15730, -19924, -43261, -71958, -45748, 68264, 157365, 147257, 36741, 24602, -5508, -106456, -30883, 100609, -27899, -115510, -61222, -44696, -55542, -83761, -42092, 57949, 157214, 121878, 124919]
$$ [...]
##END NTUPLES=NMR SPECTRUM
##END=
