##TITLE=Analysis number 325699
Compound Code cc 40224
Book Reference 518/39
Project Code adrs
Chemist Name colinb
##JCAMPDX= 6.0         $$ Bruker NMR JCAMP-DX V2.0
##DATA TYPE= NMR SPECTRUM
##DATA CLASS= NTUPLES
##ORIGIN= Bruker BioSpin GmbH
##OWNER= nmr
$$ XWIN-NMR		Version 3.5
$$ Wed Jan 10 12:21:40 2007 GMT Standard Time (UT+0h)  MAYBRIDGE\nmr@NMR_250MHZ
##.OBSERVE FREQUENCY= 250.131544655141
##.OBSERVE NUCLEUS= ^1H
##.ACQUISITION MODE= SIMULTANEOUS (DQD)
##.ACQUISITION SCHEME= undefined
##.AVERAGES= 16
##.DIGITISER RES= 18
##SPECTROMETER/DATA SYSTEM= dpx250
##.PULSE SEQUENCE= zg30
##.SOLVENT NAME= CDCl3
##.SHIFT REFERENCE= (INTERNAL, CDCl3, 0, 16.4453)
##AUDIT TRAIL= $$ (NUMBER, WHEN, WHO, WHERE, WHAT)
$$ ##TITLE= Audit trail, XWIN-NMR		Version 3.5
$$ ##JCAMPDX= 5.01
$$ ##ORIGIN= Bruker BioSpin GmbH
$$ ##OWNER= nmr
$$ C:\u/data/dgb/nmr/ADRS/820/pdata/1/auditp.txt
$$ ##AUDIT TRAIL=  $$ (NUMBER, WHEN, WHO, WHERE, WHAT)
(   1,<2007-01-10 12:21:10.31 +000>,<MAYBRIDGE\nmr>,<NMR_250MHZ>,
      <created by zg, POWCHK disabled, PULCHK disabled
       configuration hash MD5:
       49 4B E0 1D 92 C2 6B 37 9F E6 65 BC 52 41 86 1D
       data hash MD5: 64K
       E9 95 DE E6 E9 5C 26 D3 0E 7D 80 3F 0A AA E5 2C>)
(   2,<2007-01-10 12:21:29.54 +000>,<MAYBRIDGE\nmr>,<NMR_250MHZ>,
      <Start of raw data processing
       ef LB = 0.3 FT_mod = 6 PKNL = 1 SI = 32K 
       data hash MD5: 32K
       D2 06 11 1D 47 1B 03 D8 AD 70 35 EA F5 08 78 42>)
(   3,<2007-01-10 12:21:31.34 +000>,<MAYBRIDGE\nmr>,<NMR_250MHZ>,
      <apk 
       data hash MD5: 32K
       14 ED 9F 26 B9 C1 F2 65 7F 96 BD 5F 05 D3 E3 91>)
(   4,<2007-01-10 12:21:32.01 +000>,<MAYBRIDGE\nmr>,<NMR_250MHZ>,
      <abs ABSG = 5 
       data hash MD5: 32K
       55 86 E5 5D 28 A8 25 B2 BE EF 91 79 AD 43 E4 3A>)
$$ ##END=
$$ 
$$ hash MD5
$$ DF 07 25 07 43 7D AC 25 17 01 AE 59 51 7D 81 BA
##$RELAX= 
##$RELAX= 
##$RELAX= 
##$RELAX= 
##$RELAX= 
##$RELAX= 
##$RELAX= 
$$ Bruker specific parameters
$$ --------------------------
##$DU= <C:\u>
##$EXPNO= 820
##$NAME= <ADRS>
##$PROCNO= 1
##$TYPE= <nmr>
##$USER= <dgb>
##$AMP= (0..31)
100 100 100 100 100 100 100 100 100 100 100 100 100 100 100 100 100 100 
100 100 100 100 100 100 100 100 100 100 100 100 100 100 
##$AQSEQ= 0
##$AQ_mod= 3
##$AUNM= <au_zg>
##$AUTOPOS= <23 >
##$BF1= 250.13
##$BF2= 250.13
##$BF3= 250.13
##$BF4= 250.13
##$BF5= 500.13
##$BF6= 500.13
##$BF7= 500.13
##$BF8= 500.13
##$BYTORDA= 1
##$CFDGTYP= 0
##$CFRGTYP= 5
##$CHEMSTR= <none>
##$CNST= (0..31)
1 1 145 1 1 1 1 1 1 1 1 1 1 1 1 1 1 1 1 1 1 1 1 1 1 1 1 1 1 1 1 1 
##$CPDPRG= <>
##$CPDPRG1= <>
##$CPDPRG2= <>
##$CPDPRG3= <>
##$CPDPRG4= <mlev>
##$CPDPRG5= <mlev>
##$CPDPRG6= <mlev>
##$CPDPRG7= <mlev>
##$CPDPRG8= <mlev>
##$CPDPRGB= <>
##$CPDPRGT= <>
##$D= (0..31)
0 1 0 0 0 0 0 0 0 0.06 0 0 0 0 0 0 0.0002 0 0 0 0 0 0 0 0 0 0 0 0 0 0 
0 
##$DATE= 1168431668
##$DBL= (0..7)
120 120 120 120 120 120 120 120 
##$DBP= (0..7)
150 150 150 150 150 150 150 150 
##$DBP07= 0
##$DBPNAM0= <>
##$DBPNAM1= <>
$$ [...]
##$SUBNAM7= <"">
##$SUBNAM8= <"">
##$SUBNAM9= <"">
##$SW= 20.6930455092707
##$SWIBOX= (0..15)
0 0 3 0 0 0 0 0 0 0 0 0 0 0 0 0 
##$SW_h= 5175.983436853
##$TD= 65536
##$TD0= 1
##$TE= 294.16
##$TE2= 300
##$TE3= 300
##$TEG= 300
##$TL= (0..7)
0 120 120 120 120 120 120 120 
##$TP= (0..7)
150 150 150 150 150 150 150 150 
##$TP07= 0
##$TPNAME0= <>
##$TPNAME1= <>
##$TPNAME2= <>
##$TPNAME3= <>
##$TPNAME4= <>
##$TPNAME5= <>
##$TPNAME6= <>
##$TPNAME7= <>
##$TPOAL= (0..7)
0.5 0.5 0.5 0.5 0.5 0.5 0.5 0.5 
##$TPOFFS= (0..7)
0 0 0 0 0 0 0 0 
##$TUNHIN= 0
##$TUNHOUT= 0
##$TUNXOUT= 0
##$USERA1= <user>
##$USERA2= <user>
##$USERA3= <user>
##$USERA4= <user>
##$USERA5= <user>
##$V9= 5
##$VALIST= <valist>
##$VCLIST= <CCCCCCCCCCCCCCC>
##$VD= 0
##$VDLIST= <DDDDDDDDDDDDDDD>
##$VPLIST= <PPPPPPPPPPPPPPP>
##$VTLIST= <TTTTTTTTTTTTTTT>
##$WBST= 1024
##$WBSW= 4
##$XGAIN= (0..3)
0 0 0 0 
##$XL= 0
##$YL= 0
##$YMAX_a= 417795
##$YMIN_a= -511273
##$ZGOPTNS= <>
##$ZL1= 120
##$ZL2= 120
##$ZL3= 120
##$ZL4= 120
##$ABSF1= 16.44528
##$ABSF2= -4.247892
##$ABSG= 5
##$ABSL= 3
##$ALPHA= 0
##$AQORDER= 0
##$ASSFAC= 0
##$ASSFACI= 0
##$ASSFACX= 0
##$ASSWID= 0
##$AUNMP= <proc_1d>
##$AZFE= 0.1
##$AZFW= 0.1
##$BCFW= 0
##$BC_mod= 0
##$BYTORDP= 0
##$COROFFS= 0
##$CY= 12.5
##$DATMOD= 1
##$DC= 0
##$DFILT= <>
##$DTYPP= 0
##$F1P= 14.0000005364418
##$F2P= -0.99999901652339
##$FCOR= 0.5
##$FTSIZE= 32768
##$FT_mod= 6
##$GAMMA= 0
##$GB= 0
##$INTBC= 1
##$INTSCL= 1
##$ISEN= 128
##$LB= 0.3
##$LEV0= 0
##$LPBIN= 0
##$MAXI= 10000
##$MC2= 0
##$MEAN= 0
##$ME_mod= 0
##$MI= 0
##$NCOEF= 0
##$NC_proc= -3
##$NLEV= 6
##$NOISF1= 0
##$NOISF2= 0
##$NSP= 0
##$NTH_PI= 0
##$NZP= 0
##$OFFSET= 16.44528
##$PC= 1
##$PHC0= 229.7428
##$PHC1= 5.4285
##$PH_mod= 1
##$PKNL= yes
##$PPARMOD= 0
##$PSCAL= 4
##$PSIGN= 0
##$REVERSE= no
##$SF= 250.130019188294
##$SI= 32768
##$SIGF1= 0
##$SIGF2= 0
##$SINO= 400
##$SIOLD= 32768
##$SREGLST= <1H.CDCl3>
##$SSB= 0
##$STSI= 32768
##$STSR= 0
##$SW_p= 5175.98343685301
##$SYMM= 0
##$S_DEV= 0
##$TDeff= 65536
##$TDoff= 0
##$TI= <Analysis number 999999
Compound Code 99
Book Reference 9
Project Code 9>
##$TILT= no
##$TM1= 0
##$TM2= 0
##$TOPLEV= 0
##$USERP1= <user>
##$USERP2= <user>
##$USERP3= <user>
##$USERP4= <user>
##$USERP5= <user>
##$WDW= 1
##$XDIM= 32768
##$YMAX_p= 339908446
##$YMIN_p= -155193
$$ End of Bruker specific parameters
$$ ---------------------------------
##NTUPLES= NMR SPECTRUM
##VAR_NAME=  FREQUENCY,     SPECTRUM/REAL,   SPECTRUM/IMAG
##SYMBOL=    X,             R,               I
##VAR_TYPE=  INDEPENDENT,   DEPENDENT,       DEPENDENT
##VAR_FORM=  AFFN,          ASDF,            ASDF
##VAR_DIM=   32768,         32768,           32768
##UNITS=     HZ,            ARBITRARY UNITS, ARBITRARY UNITS
##FACTOR=    0.157963299565203, 1,           1
##FIRST=     4113.45822073494, 0,            0
##LAST=      -1062.52521611807, 0,           0
##MIN=       -1062.52521611807, -155193,     0
##MAX=       4113.45822073494, 339908446,    0
$$ Real data points
##PAGE= N=1
##DATA TABLE= (X++(R..R)), XYDATA
$$ [...]
19690A95727J7628J3347k902k03M1239Q2594J41465J12395j5929j42417j25354
19679C17590q1168n5006k8960l4174k479J1358J4222j8210j2026j8355o29L4389
19667A26552P2742N6276Q9879J21933J17693N4792r3631j82987j00716p4116o2895
19656A25522l7900j5890k5356j901J2611j6564j2377K7354L0270p63j6321O517
19644G5202l8027k4062l240K1424J0846j3803K3243J1144P90K0761O294j3880
19632G6692K0299k3793l3683N599o965q244K7757R783l4593j2674m655J3917j3129
19619A6311o591J2448j1909j8797O748l610k506L0980K9937J4589j4134j0483
19607D2983n426K2930p626k9383k86k1505j9805M151o618R427J7125r837l85J149
$$ plain form
19690 195727 213355 226702 223800 223597 264836 347430 488895 601290 585361 442944 317590
19679 317590 236422 181416 152456 118282 115803 127161 141383 123173 111147 92792 92163 126552
19667 126552 199294 255570 345449 467382 585075 639867 546236 363249 262533 188417 125522
19656 125522 87622 71732 46376 44475 57086 40522 28145 55499 85769 85006 68685 75202
19644 75202 37175 13113 9873 31297 42143 28340 51583 62727 63517 84278 90572 76692
19632 76692 96991 73198 39515 45114 38149 29905 57662 67445 32852 20178 15523 29440 16311
19619 16311 9720 22168 10259 -8538 -1790 -5400 -7906 23074 53011 67600 53466 42983
19607 42983 37557 60487 52861 23478 23192 1687 -18118 -13967 -20585 -11158 5967 -3870 -4255 -3106
19593c106J8967J7822L279j2264k0685k1877j2751J6626K623K08L571J9833l415
19580H831l2274J4645J5883j8826N547J6816J3678l475k0353j0905q658L6226
19568A7135J7514J2908j6248k7823j994k0092j7416J020L810J5558K8987p630
19556E729k5454L3971j2282q185K571J7373N740j8352L669r723j4663K8165n350
19543C209j2316M6574M3346K6413p288K9859P178Q814M068k1525l6012k7997l0816
19530C3507Q197J1423J6495J0179N50J1108J7261J841j7629k560R160j4482k6901
19517E8149J0425j3402o499n461l6631q832L8884j7398K4333k6378P567J6888
19505D1645L824j780J4556Q483J680J4833n450M0116L3163J9719K2396j6786j6805
$$ plain form
19593 -3106 15861 33683 36962 24698 4013 -17864 -30615 -13989 -11366 -11158 -7587 12246 8831
19580 8831 -23443 -8798 7085 -11741 -6194 10622 24300 20825 472 -10433 -19091 17135
19568 17135 34649 47557 31309 3486 1492 -18600 -36016 -34996 -31186 -15628 13359 5729
19556 5729 -19725 14246 1964 -6221 -3650 13723 19463 1111 4780 -4943 -19606 8559 3209
19543 3209 -9107 37467 80813 107226 99938 129797 136975 145789 149857 128332 92320 64323 33507
19530 33507 41704 53127 69622 79801 80351 91459 108720 110561 92932 90372 99532 85050 58149
19517 58149 68574 55172 48673 43212 6581 -2251 36633 19235 43568 17190 24757 41645
19505 41645 45469 43689 58245 66728 68408 83241 77791 117907 151070 170789 193185 176399 159594
19492A59594p507J154Q053K0550L5831J6096K9148M0582M2150R11n5372o0917
19480B30273j4708j0988l1795j9489K335j9834j4738o632L0019j1853j8927k1511
19468I2152k2391Q946j963K2820M458o76o472k6967k8806p975J8036L1099J2937
19455I5198K3303j1636j9047Q313O188J0174Q747K520l4923j0942J3646K5611
19443A17152J5327j5792j2843P111j487k1647j7759j4300j9380j3242J5033K0040
19431E8213L2834K3539J909k3039j9365j9720k1146k7430j6992Q774P450J0627
19419A5654K6868K7772j6324m0166J6436j3530k069p147J726j2707k2306K280
19407b3513P588r150k5737J9083K1537N371L5420M9118k669J5109N641k8265j8117
$$ plain form
19492 159594 152087 153241 161294 181844 217675 233771 262919 303501 345651 346562 291190 230273
19480 230273 215565 204577 172782 153293 155628 135794 121056 114424 144443 132590 113663 92152
19468 92152 69761 78707 76744 99564 104022 103346 96874 69907 41101 33126 51162 82261 95198
19455 95198 118501 106865 87818 96131 102319 112493 121240 123760 88837 77895 91541 117152
19443 117152 132479 116687 103844 110955 109468 87821 70062 55762 36382 23140 38173 58213
19431 58213 91047 114586 116495 93456 74091 54371 33225 5795 -11197 -2423 5027 15654
19419 15654 42522 70294 53970 13804 30240 16710 14641 7494 9220 -3487 -25793 -23513
19407 -23513 -15925 -25075 -50812 -31729 -10192 -4821 30599 79717 77048 92157 97798 69533 51416
19394E1416l6118q443L3174K4950k917l4107n170r526j2962L990r732L7641P9147
19381A11343N4761K0918R384O6883M4586J0914j6864J2733O625o207q774k3840
19369B82462k4343j3549J0831k205K950j8746l4084r934L609M270L983l7576k5076
19356A42592J4513J914K3433L0716o923P931J1676j7551l7095M53j256m650K3206
19343A88959L9972O898o552J9045j4490K5120K3422K4687J8515k0410J2012K0915
19331C38093j1225M89K5906L2624q459j7247M0425N7916M6865M3109R158l194
19319E54460k9894m0p211j0396j2231n345M808j5297r801l1453k3878l940K0600
19306D30382O181K4818k850n1783R845K1301k057M8385R191J0255J7235L3398
$$ plain form
19394 51416 15298 6855 40029 64979 62062 27955 22785 13259 297 4287 -5445 32196 111343
19381 111343 166104 187022 196406 263289 307875 318789 301925 314658 321283 315076 306302 282462
19369 282462 258119 244570 255401 253196 256146 237400 203316 193382 196991 201261 205244 167668 142592
19356 142592 157105 159019 182452 213168 206245 214176 225852 208301 171206 171659 170403 165753 188959
19343 188959 228931 235829 229277 248322 233832 258952 282374 307061 325576 305166 317178 338093
19331 338093 326868 327357 353263 385887 377428 360181 400606 458522 505387 548496 557654 554460
19319 554460 524566 524526 517315 506919 494688 489343 494151 478854 469053 437600 413722 409782 430382
19306 430382 436563 461381 458531 406748 416593 437894 435837 484222 493413 503668 520903 554301
19294E54301O6146L0054J9241N419M5875O8979O5720M9417N4363L9031J7653N2524
19282A068723J20633J02711J14115J69831K59602K83937K45988J95513J11451
19273B672504R1759J88073K54539L01977M23490P80947J339232K089099K953660
19264A1095280L369993K889627J244354r68329j857580j529182j90197J639334
19256A5693300L817838P245220J2954862K1072452K7134913K6501990J7414974
19249A31835549J28680j0234200j4595224j7224249j8690116j6737523j2858621
19242D1624296o833417j080221L310569N402039M345943j43455n916822q584738
19234C2124194q390984o307770l993904k516432j663732j116388o81692l72496
$$ plain form
19294 554301 620447 650501 669742 675161 721036 790015 855735 905152 959515 998546 1016199 1068723
19282 1068723 1189356 1292067 1406182 1576013 1835615 2119552 2365540 2561053 2672504
19273 2672504 2764263 2952336 3206875 3508852 3932342 4713289 6052521 8141620 11095280
19264 11095280 14465273 17354900 18599254 17630925 15773345 14244163 14053966 15693300
19256 15693300 19511138 26756358 39711220 60783672 87918585 114420575 131835549
19249 131835549 131964229 121730029 107134805 89910556 71220440 54482917 41624296
19242 41624296 34790879 33710658 37021227 42423266 46769209 46625754 40708932 32124194
19234 32124194 23733210 17425440 13431536 10915104 9251372 8134984 7453292 7080796
19226G080796j09631L5091R6661P5504n352p5893j56305q7139J21041M17724Q58295
19215H250792J494232K470793L966632O275197Q662827R149513O766383J016912
19207D8053281m546744o227139m600152l45434N233021J1940952J8345916K2382420
19199I0236121K4130199K0995800J5367194N688020j2578985k8190907l1241940
19192H4405502k7157004j7825688j0046155n551434k775597n53105J194920J889435
19184B3580874J093052j309507l539039m247992l856002k769917j767238j105789
19176F078442p06189m95604l92460l15839k30804k22693l08788l41920l61937
19167B702208l36703k57701k38932j95502r6598n7752o0517n1133l6717p6947
$$ plain form
19226 7080796 6971165 7006256 7102917 7178421 7173069 7097176 6940871 6853732 6974773 7392497 8250792
19215 8250792 9745024 12215817 16182449 22457646 31120473 40269986 47036369 48053281
19207 48053281 43506537 37279398 32679246 32333812 37566833 49507785 67853701 90236121
19199 90236121 114366320 135362120 150729314 156417334 143838349 115647442 84405502
19192 84405502 57248498 39422810 29376655 23825221 21049624 20496519 21691439 23580874
19184 23580874 24673926 23364419 19825380 15577388 11721386 8951469 7184231 6078442
19176 6078442 5372253 4876649 4484189 4168350 3937546 3714853 3406065 3064145 2702208
19167 2702208 2365505 2107804 1868872 1673370 1576772 1519020 1458503 1407370 1370653 1293706
19157A293706p4334p2437r9662o7049l209k2656j6575K4563L8890P5784R8718
19146A175739J35931J41204J79543J14336M0946m41j41616j77453j37133j36673
19136A194383q2990n4985n2315j3141M1690O1004J11549J62108J53459M1220L8101
19125A600083J62002K27870J83453J14258L9582l4877j15939p0340L2110N3509
19115B191711O2734R9927J58732K01309K92828M04564N49624O34542O51570O54045
19105E901586R42933J339534J907795K823460M298620O666369J0703913J7311522
19097E1895732K5903675K8209915Q615611k0872775k8620319k0560331j2452874
19090C2118634p527470m752646l117237k039885j224579n55656N7451P47343J661005
$$ plain form
19157 1293706 1219372 1146935 1047273 980224 977015 954359 937784 962347 1001237 1077021 1175739
19146 1175739 1311670 1452874 1632417 1746753 1787699 1787258 1645642 1468189 1331056 1194383
19136 1194383 1111393 1056408 1004093 990952 1032642 1093646 1205195 1367303 1520762 1561982 1600083
19125 1600083 1762085 1989955 2173408 2287666 2327248 2292371 2176432 2106092 2138202 2191711
19115 2191711 2254445 2354372 2513104 2714413 3007241 3411805 3961429 4595971 5247541 5901586
19105 5901586 6844519 8184053 10091848 12915308 17213928 23880297 34584210 51895732
19097 51895732 77799407 106009322 114624933 93752158 65131839 44571508 32118634
19090 32118634 24591164 19838518 16721281 14681396 13456817 12901161 12958612 13705955 15366960
19081A5366960K896410M819413P817875J2802889K0593632K8932084K5157513
19074A18386776k611464k8290415k8452032j8820745j1380455p113557m761174
19067A6956934l417460k532283j873995j391506j082580p72504n52366m92708
19059D841532m56352l73457l85750l52764l24645k86134j92564r3147k0695P7306
19049B433330K9771o7225j51694j12442k2962l2601j63968k02805r1978n9584
19039A557842j49384j88782j14075p8366m4631p890K467L0804M5168J18375J68649
19028A340177Q2006q3957j13849l9777M8999l9231j32368j46464j22553j21890
19018F71093o0893m0436n0609l5052j861k155l5698O641r868o085j7263n2259
$$ plain form
19081 15366960 18263370 23082783 30900658 43703547 64297179 93229263 118386776
19074 118386776 115775312 87484897 59032865 40212120 28831665 21718108 16956934
19067 16956934 13539474 11007191 9133196 7741690 6659110 5886606 5334240 4841532
19059 4841532 4385180 4011723 3625973 3273209 2948564 2662430 2469866 2376719 2356024 2433330
19049 2433330 2463101 2395876 2244182 2131740 2108778 2076177 1912209 1709404 1617426 1557842
19039 1557842 1408458 1219676 1105601 1027235 982604 974714 977181 1007985 1053153 1171528 1340177
19028 1340177 1422183 1338226 1224377 1184600 1233599 1194368 1062000 915536 792983 671093
19018 671093 610200 569764 519155 484103 482242 480087 444389 451030 441162 435077 417814 365555
19006C65555k1172J4132J1683j2491l9646J6098P007k2757k2826m4813Q565J0844
18994B70179j1820M072J0055r380q113k7315L1289M357k5339j424R983J2083K2751
18981B81378j1337R089O4157J08397P6180N7865J7015l2916o5036m5164k7619
18970D32009n1465j7275k952Q817N0034M4239M6230M4805O7211j3505k1859k6799
18958E59490k9947l8398j5268j9474m8805q3947n3775n1853m7164l234R412m70
18946A76567j1517l2806J3785L5692J8782L0015N134N204j0090n484J285o257
18934B20310K0522M095O209p495m394P452J6009J5049n477J5557K5665P1322L2163
18921D16987L5684K5668k0513J4550j8276J9908j8642l4215n0764m9433k183J916
$$ plain form
19006 365555 344383 358515 370198 357707 318061 334159 341166 318409 295583 250770 259335 270179
18994 270179 258359 262431 272486 263106 254993 227678 258967 263324 237985 236561 246544 258627 281378
18981 281378 270041 279130 343287 451684 527864 585729 602744 569828 504792 459628 432009
18970 432009 380544 363269 360317 369134 419168 463407 509637 554442 621653 608148 586289 559490
18958 559490 529543 491145 475877 456403 407598 323651 269876 218023 170859 167625 177037 176567
18946 176567 165050 132244 146029 181721 200503 230518 235652 240856 230766 225282 226567 220310
18934 220310 240832 244927 251136 243641 239247 246699 262708 277757 272280 287837 313502 384824 416987
18921 416987 452671 478339 457826 472376 454100 474008 455366 421151 370387 320954 318771 320687
18909C20687J1246J3087j8243l3468j3149j4974l5791j7883K731L304J5020k9827
18897B02740m0024k5841o4177o450p855o087n479M4560N2561K2181K7822K4344
18885B18295J2447l596m5670l4348K860L488j235L032k2092M636R392j0482r333
18872A27394k827j6619k0035j173L973Q371o09K1941j3818n173K2817j6284J1178
18859A19136M422J8873J8897L5097P4969J07653K03803K25976R9105j49716k32878
18848E25337j79795r3405l2436m1568l2098k8283j0796J1253M5107k948k9755
18837A30613K7919L6162K9985N4568J14918J90896J79019J6833j86894j73766
18827D20253j08634n1591m3444j4897l1890k6529J8832Q20j0028m721r665j6124
$$ plain form
18909 320687 331933 345020 326777 293309 280160 265186 229395 211512 214243 217547 232567 202740
18897 202740 162716 136875 72698 66248 58393 52306 46827 91387 143948 166129 193951 218295
18885 218295 230742 227146 181476 147128 149988 153476 152241 155273 133181 137817 147209 136727 127394
18872 127394 124567 107948 87913 86740 90713 99084 98475 120416 106598 101425 124242 107958 119136
18859 119136 123558 142431 161328 196425 271394 379047 582850 808826 907931 758215 525337
18848 525337 345542 252137 219701 178133 146035 117752 106956 118209 163316 160368 130613
18837 130613 158532 194694 224679 279247 394165 585061 764080 780913 594019 420253
18827 420253 311619 260028 216584 201687 169797 143268 162100 162920 152892 148171 138506 122382
18815A22382N090k3552k6207j1774n106K3258k0354k2083O751L429l337j2431
18803C6066M490N480j1339j5154j6005N401K1309K1498N606J4203q60l010m5621
18790B2064n1652p188J7189K7519M8964M5160j077L70k4000j3035m485j8763j9137
18777B1929N555K5347L3752O462n548J3495L3297J3624M1702P4261J10058Q8514
18765D62448q0170j15778n2975m3736P273K230j1164r260Q802J1284o003M126
18753A77077m908k3216j0475J9950J1657K4632N7289M8572L1257M785j3095J0953
18741C34478J8602N8452L0452p640j6448J1363P080O1757L6656k5868l2392n9737
18729D16755r8163q6545o5555n973J4818L7876l750j0732o711K9602J1173k1877
$$ plain form
18815 122382 127472 103920 77713 65939 60833 84091 63737 41654 48405 51834 48497 36066
18803 36066 40556 46036 34697 19543 3538 8939 30248 51746 57352 71555 70695 67685 22064
18790 22064 -29588 -36776 -19587 7932 56896 102056 100979 101349 77349 64314 59829 41066 21929
18777 21929 27484 52831 86583 93045 87497 100992 134289 147913 189615 263876 373934 462448
18765 462448 382278 266500 213525 169789 177062 179292 168128 158868 167670 178954 172951 177077
18753 177077 172169 148953 138478 158428 170085 194717 252006 300578 331835 336620 323525 334478
18741 334478 353080 411532 441984 434344 417896 429259 436339 498096 534752 508884 476492 416755
18729 416755 318592 232047 166492 160519 175337 213213 209463 198731 192020 221622 232795 210918
18717B10918k0333J9972K834j8393j8576J0208l843n960K1210O507j9295J841
18705A87090k4981J226K6368L0123L4362L5266O3848O3094L7948M6957K8821j1836
18693E18286K9709L8711J4184k3487q7927q4024j08160o0189j3343L7577O0201
18682C21538N3371P6928Q8747J36947Q7620m2493p2082j08643j14823p7669m1846
18671C07595m9433l2052k4261j9580N316p124l534Q304j8123N328J9637k6234
18659A65839k6621k9941j9089m3514n837K3706L441M4336Q046j5430L863K9563
18647A38362P534K863j7296m182j1921J59K3933K3587N776L5235K7374k8532l5134
18634A67758n12j533p704k0971k802R679J709l0799J4058K1036J9005J1630k8002
$$ plain form
18717 210918 190585 210557 213391 194998 176422 186630 182787 176827 198037 204544 185249 187090
18705 187090 162109 163335 189703 219826 254188 289454 353302 416396 454344 501301 530122 518286
18693 518286 547995 586706 600890 577403 489476 405452 297292 237103 223760 261337 321538
18682 321538 374909 451837 540584 677531 765151 722658 650576 541933 427110 349441 307595
18671 307595 258162 226110 201849 182269 187585 180461 176927 185231 167108 172436 192073 165839
18659 165839 139218 109277 90188 46674 40837 64543 67984 112320 120366 104936 108799 138362
18647 138362 145896 148759 131463 127281 115360 115519 139452 163039 168815 204050 231424 202892 167758
18634 167758 167246 165713 158009 137038 134236 143915 145624 114825 128883 149919 168924 180554 152552
18621A52552j1463l210j2849o040k2774k6324K0396l3756q819L8262L0749K491
18609A19215l348L9833j69M698j08k3222J5089J693l0815k2274K6957M4162L7509
18596B09220J4596j006O3047K6862r368J5883K6604N2714O206k495L6424K3975
18584D62662M162j3134l2237l9066o6214l9885l1985k0983j3932p005J15J0121
18572B12619j5872r976N130k3755n4325m4064j0527K8398P2244L4626K015L3180
18560B29693N235o317J991j3183m993l2621J5069j6711J6318K1798q183L9564
18548B47660N1l5105j8653K5459N9081R4221P3353K7571J6037J8295K870j816
18536E09024M175K846J1153n29k192k5451m023r272l766J7847J0395k001l2744
$$ plain form
18621 152552 141089 137879 125030 118990 96216 69892 90288 56532 47713 85975 116724 119215
18609 119215 115867 155700 155531 160229 160121 136899 151988 153681 122866 100592 127549 171711 209220
18596 209220 223816 222810 285857 312719 303351 319234 345838 398552 404758 402263 438687 462662
18584 462662 466824 453690 421453 382387 316173 276288 244303 223320 209388 202383 202498 212619
18572 212619 196747 186771 191901 168146 113821 69757 59230 87628 159872 194498 196513 229693
18560 229693 234928 228611 230602 217419 212426 179805 194874 178163 194481 216279 208096 247660
18548 247660 247711 212606 193953 219412 278493 372714 446067 473638 489675 507970 510840 509024
18536 509024 513199 516045 527198 526669 524477 499026 495003 485731 481965 499812 510207 508206 475462
18523D75462K6153J7360q088J9235L1684P585P63K0061M749r790O6328L3012j1030
18510F73484M5158P5972M4845P4552J19902J09037J31381J80527J71544J45293
18500A771695J2980m8675L623R3210J08877J26285K05134K35539K46896K69123
18490C024687J49300K19644L45848M09404N66955Q68644J381678K187143K931841
18481A2085144K496955K001843K715974J430672j106856n30200O18405J075123
18473B0787060L252827P654588J4198670K0001796J7404198J6671421K5926386
18466A25896946J3775296j1084180n633044l565290k1529835k2561144j2811884
18459F2486865j0195808p629436k603195m43132N14641K441283j69061n526867
$$ plain form
18523 475462 501615 518975 510887 530122 561806 569391 570154 590215 594964 585174 651502 684514 673484
18510 673484 718642 794614 839459 914011 1033913 1142950 1274331 1454858 1626402 1771695
18500 1771695 1784675 1736000 1739623 1832833 1941710 2067995 2273129 2508668 2755564 3024687
18490 3024687 3173987 3393631 3739479 4148883 4715838 5584482 6966160 9153303 12085144
18481 12085144 14582099 16583942 19299916 20730588 19623732 19093532 19711937 20787060
18473 20787060 24039887 31694475 45893145 65894941 83299139 99970560 125896946
18466 125896946 139672242 128588062 122955018 119389728 97859893 75298749 62486865
18459 62486865 52291057 44661621 42058426 41615294 42129935 44571218 44402157 38875290
18451C8875290n435675m735820o003816n480721l711809k409908j546593r83823
18443H567125n84897l11281j97329j47861j02236p8864j04784j07631j651K93343
18433G223934O18870J105091J897409L113116M786302N693421M630647M550519
18425C3619309N267633J125034k566321p21547J012738K911176O768066Q468885
18417E5884973J2301084K0765552J6292172J500115O014456R017585j3564962
18410A08210975k2366563j3136100j4494411j7150440j1743103o278125k952582
18403B0089651j115717o93841j52597N76857j034212k489168j796218j838367
18395A1546388k374265k017075j291004q34070n93352m58746l73835k46631j79977
$$ plain form
18451 38875290 33439615 28703795 22699979 17219258 13507449 11097541 9550948 8567125
18443 8567125 7982228 7670947 7473618 7325757 7223521 7144657 7039873 6932242 6930591 7223934
18433 7223934 7842804 8947895 10845304 13958420 18744722 24438143 29068790 33619309
18425 33619309 38886942 40011976 37445655 36724108 37736846 40648022 47416088 55884973
18417 55884973 68186057 88951609 105243781 106743896 112758352 121775937 108210975
18410 108210975 85844412 72708312 58213901 41063461 29320358 23042233 20089651
18403 20089651 18973934 18280093 18127496 18704353 17670141 15180973 13384755 11546388
18395 11546388 9172123 7155048 5864044 5029974 4436622 3977876 3604041 3357410 3177433
18386C177433k68266k36601k04631k37704k22866j55091j04285p0521r5012r4675
18376A487781j18674j25562j5335m1082p4383j13010p1215p2756o0490l0863j0819
18365G53592p1643n4152J637L1695J4177l086j3368l658j5801k8143o3034m3698
18353E04518k0505o241k9502n0476m4189j1849l620j5650k7781k8525n3669m6247
18341A66264N595L7309L9058R07L7395K5829K6411k0432j6036l718N580p836L2894
18328C29220L0465J1614R081l3210K4762J7555j9529k2116J841j0123k0112J3107
18316C32555Q840P655J2191j3668j6225K4104K8431J992K3337Q282l602j6370
18304C97522M609r176K3314J5358K3403q07j204O246k0142J539L6315J2413K0739
$$ plain form
18386 3177433 2909167 2672566 2467935 2230231 2007365 1852274 1747989 1677468 1582456 1487781
18376 1487781 1369107 1243545 1228210 1187128 1112745 999735 928520 855764 795274 764411 753592
18365 753592 681949 627797 629434 661129 675306 672220 658852 655194 639393 611250 548216 504518
18353 504518 484013 477772 448270 397794 353605 341756 338136 322486 294705 266180 212511 166264
18341 166264 171859 209168 248226 249133 286528 312357 338768 318336 302300 298582 304162 296326 329220
18328 329220 359685 371299 380380 347170 371932 389487 369958 347842 349683 339560 319448 332555
18316 332555 341395 349050 361241 347573 331348 355452 383883 385875 409212 417494 413892 397522
18304 397522 402131 392955 416269 431627 455030 454223 453019 459265 439123 440662 476977 489390 510129
18291E10129K4040J6172K3415O3599P6499K3455J8801L1251N8306O9487O3350
18280I78504J19588K17091L64889M52566M57676J98040m3339j57766j88025K8099
18270B427323K12446K93567L99509M76399N97496Q55051J254024J901118L021466
18261A1438399M808419Q192057J5009212K8413781M7530483M2889605j4868436
18254A43413520n2213470l7485316j9196033j0007895n693370l613676k456525
18247A2747235j642222j010306m71131Q3897P71249J651411K969270N093479R221503
18238B9414385J7428592L2705047M8439325K6342139l3229387m9053053k9398609
18231D2648439j4745078p871461m768300l213775k362075j858572j440871j100242
$$ plain form
18291 510129 534169 550341 573756 637355 713854 737309 756110 787361 845667 915154 978504
18280 978504 1098092 1315183 1680072 2132638 2590314 2788354 2745015 2587249 2399224 2427323
18270 2427323 2639769 2933336 3332845 3809244 4406740 5261791 6515815 8416933 11438399
18261 11438399 16246818 24438875 39448087 67861868 115392351 158281956 143413520
18254 143413520 91200050 53714734 34518701 24510806 18817436 15203760 12747235
18247 12747235 11105013 10094707 9623576 9707473 10478722 12130133 15099403 20192882 29414385
18238 29414385 46842977 79548024 127987349 154329488 121100101 72047048 42648439
18231 42648439 27903361 20031900 15263600 12049825 9687750 7829178 6388307 5288065
18223E288065p91049n63849m52832l24838k76804k12040r3057O8158K31154Q7685
18213B960593k34963m84231m15600k36679j24963m6414p086q1942j99454j67954
18203I61307r3688q7190o2380o2056k5402l6952l5928l2800n1172o8693l7978
18192C67068j06j7884j3970k153K1141l7842N133K5385j6493p070j5749J6365
18180C23825j5199m4706k1078J1057L8894J2122Q217j8554l5163r774J3314p23
18168B62232K1890M730m4988k6064N779M1303N8518M2025K0421j4056k361k0180
18156C49249K6784L0808M4022O1482N8245k81l9587m2516k4793k2713j5682j9596
18144D05422o026j2448O775J9477K5050k8350l0171k9412l3670J3708J6301O1020
$$ plain form
18223 5288065 4497016 3933167 3480335 3155497 2878693 2666653 2573596 2641754 2872908 2960593
18213 2960593 2725630 2241399 1825799 1589120 1464157 1417743 1410657 1328715 1129261 961307
18203 961307 867619 780429 718049 655993 630591 593639 557711 524911 473739 405046 367068
18192 367068 366962 349078 335108 332955 354096 316254 321387 346772 330279 323209 307460 323825
18180 323825 308626 263920 242842 253899 292793 304915 313132 294578 259415 249641 262955 262232
18168 262232 284122 288852 243864 217800 223579 264882 323400 365425 385846 371790 369429 349249
18156 349249 376033 406841 450863 512345 570590 570309 530722 488206 463413 440700 425018 405422
18144 405422 399396 386948 393723 413200 438250 409900 379729 350317 316647 330355 346656 407676
18132D07676J5059j1658N1077M4631K5008J0653L8193N5475N0513R5464J47411
18121I29502J72168J75063K04349K56246L41544M99720P60863J262077K006773
18112F608305L453965O533066J3057096K3349277J8198879j7466072k4269579
18105B9464937j2268133n811609l111084j927939j260527r29419o54685m79219
18097C022322l95412l32173k80371k86745k53608k13561j73719j03581q1591j37129
18087G64432n9131o0539l9198M604k6817m38L3805K3805k8770m2073l6408q6394
18075D46878m4941m5527k4278N010L2117K5352K9906L6600K7860M8755J38075
18064F75807K24413J79217J03762J4140q2095p5025p7086n3615o4190p4252q6327
$$ plain form
18132 407676 422735 411077 462154 506785 531793 542446 580639 636114 686627 782091 929502
18121 929502 1101670 1276733 1481082 1737328 2078872 2578592 3339455 4601532 6608305
18112 6608305 10062270 16595336 29652432 53001709 71200588 53734516 29464937
18105 29464937 17196804 11385195 8274111 6346172 5085645 4156226 3501541 3022322
18097 3022322 2626910 2294737 2014366 1727621 1474013 1260452 1086733 983152 901561 764432
18087 764432 705301 644762 605564 610168 583351 582913 616718 640523 611753 569680 533272 446878
18075 446878 401937 356410 332132 337142 369259 394611 424517 461117 488977 537732 675807
18064 675807 900220 1079437 1183199 1197339 1115244 1040219 963133 909518 845328 771076 684749
18053F84749o7555n0944o8046m5665m0769m6098q2189n6218l0084k6028j0427
18042A60726N00J4104k2868M665J6161j894n175j4637q374J2015l5318k6194J2032
18029A05743j1900J0222Q067q24k3304J8353Q454p47N886r262j3453J6017M6653
18016A59905q639N373o39n007J5534K0643p361L2426O3320N0181K4477O5314J06346
18003E21873J06606J00963R4543J23907J40149O5005N8109J30523J27379K0120
17993A489177j9508K500L2375k0207q4425j01174r8794n1248j13537j88176j35719
17982G11264n0410l4289q8353p0828m6075j3194k6477p537R323k6432O564n007
17970C58549Q645L0440O3940O1996J8789J8379M9224J7353J1588M0898K3228M5409
$$ plain form
18053 684749 617194 566250 498204 452539 411770 365672 283483 227265 197181 171153 160726
18042 160726 161226 175330 152462 157127 173288 171394 166219 151582 143208 155223 119905 93711 105743
18029 105743 93843 104065 112132 111308 88004 106357 114811 114064 119950 110688 97235 113252 159905
18016 159905 151266 156639 156000 150993 166527 187170 179809 212235 275555 325736 350213 415527 521873
18003 521873 628479 729442 823985 947892 1088041 1153046 1211155 1341678 1469057 1489177
17993 1489177 1469669 1472169 1504544 1484337 1399912 1298738 1199944 1148696 1035159 846983 711264
17982 711264 660854 626565 538212 467384 421309 408115 381638 374101 383424 356992 363556 358549
17970 358549 367194 397634 461574 523570 542359 560738 609962 627315 638903 679801 703029 748438
17958G48438J00217Q5057K0304P0457L1840M447O1114J3305m9267m9848l8555
17947I97509l14K352n1187m2203k4515N5445J3614p1610j03419m0809k5192q4222
17935F25449j51213r3983n6543o6120m0985l3991J0301j0799N959R419J1729j0332
17923A98891K7391J7639k256K0195K9716J3649k671N0318N5033K3179M531M2003
17911D77618M2449k2261k0760j7900m4252m1340n0091k9799j5404J3913N9682
17900C51855N9151N9298L3580M2206J3185l5320n7803o6226k3390q8484o8957
17889B19095j3189k5279k7735l083q678j7364J675k0430l5850j7383o294j4016
17877C1469K4326K6855J6775j3456j6159M852L6180K7804l6431j4553K683j0434
$$ plain form
17958 748438 848655 933712 954016 1024473 1056313 1060760 1121874 1135179 1085912 1036064 997509
17947 997509 997195 999547 948360 906157 881642 937087 950701 879091 775672 734863 709671 625449
17935 625449 474236 380253 323710 257590 216605 182614 192915 182116 188075 197494 209223 198891
17923 198891 226282 243921 241665 261860 291576 305225 302554 352872 407905 431084 435615 477618
17911 477618 520067 497806 477046 459146 414894 373554 323463 293664 278260 292173 351855
17900 351855 411006 470304 503884 546090 559275 523955 466152 399926 376536 288052 219095
17889 219095 205906 180627 152892 149809 141131 123767 125442 105012 69162 51779 45485 31469
17877 31469 55795 82650 99425 85969 69810 74662 110842 138646 102215 87662 90345 79911
17865G9911q199j0448R187J4239M927J7158K7335R928q716K0157J6040J3747K5212
17852B10478M690k9254O219k0375j9646k4375o62l336l1262j4328L333j4827l1129
17839C5526j6626l900J1454K1855J7017r455J4147P988k6289O287k1793j325R814
17826D4700j3756k3064k339J2102k04j0593K2860J2834j1773L0486j9876l4027
17814G350p587r10J0687j8164k946L0215N489K5308k057k4193O784k28l3914O423
17800B257L6115J5173j5691k0853p007K8836L2415J1267r347k5107k1154J0398
17788C7302n944j9173k8508j1210L9438K1273m038P704M9347j8894o0545M376
17776A1128K3254L7182N620k1772k098j8651r606N360K8819L182l9285J594l5889
$$ plain form
17865 79911 71712 61264 70451 84690 89617 106775 134110 144038 135322 155479 171519 185266 210478
17852 210478 215168 185914 192133 171758 152112 127737 127075 123739 92477 78149 81482 66655 35526
17839 35526 18900 15000 26454 48309 65326 55871 70018 78006 51717 58004 36211 34886 44700
17826 44700 30944 7880 5541 17643 17439 6846 29706 42540 30767 61253 41377 7350
17814 7350 -237 -1147 9540 -8624 -11570 18645 24134 49442 47385 23192 29976 29748 -4166 2257
17800 2257 38372 53545 37854 17001 9994 38830 71245 82512 73165 48058 26904 37302
17788 37302 31358 12185 -16323 -27533 11905 33178 29140 36844 86191 67297 6752 11128
17776 11128 34382 71564 77184 55412 53314 34663 25057 30417 59236 62418 23133 24727 -11162
17763a1162j2072J3683J5450p469K027J1629r994K6791q785O272K993Q601K525
17750D0489k0780p208k401j5934j9533L5681j7043n142n542O720J2697p142J0849
17737E711J7470k4553n571J931K6917J3892m433K2069J69q812j9039o844J3763
17724C2670l879j7420j0217O717J479j6523l226j3474p617K3030j5285Q568J9576
17711D399P176J3993m755k4573j8452N67J2756k524J8838J3452j5275j5096Q446
17698a048M3092K1658k0526l5281J8249j1530j9992J3127n539p368K1287P881
17686B4010P197J5320k7l692o007J7076K0218j0893r774J0096j338j8872j8355
17673B4959j2293j1377k1643J8117J472j248K9742m592J3017p275L1250Q110m077
$$ plain form
17763 -11162 -23234 -9551 5899 -1570 457 12086 2092 28883 20098 26370 29363 37964 40489
17750 40489 19709 12501 10100 -5834 -25367 10314 -6729 -11871 -17413 -10693 2004 -5138 5711
17737 5711 23181 -1372 -6943 -5012 21905 35797 31364 53433 53602 44790 25751 18907 32670
17724 32670 28791 11371 1154 7871 9350 -7173 -10399 -23873 -31490 -8460 -23745 -15177 4399
17711 4399 11575 25568 20813 -3760 -22212 -21645 -8889 -11413 7425 20877 5602 -9494 -1048
17698 -1048 42044 63702 43176 7895 26144 14614 -5378 7749 2210 -5158 16129 24010
17686 24010 31207 46527 46500 42808 36801 53877 74095 63202 53428 63524 62186 43314 24959
17673 24959 12666 1289 -20354 -2237 -765 -2013 27729 23137 36154 28879 60129 68239 64162
17660F4162o670J1444L0869K2299L5077J28249J97623K22821J29710j27985k29345
17649D78254j68667j02622n6635k1185Q507j3757k4405j6338J6835J1968n428
17638A06527j0379R556J6034P5092J48154K13876K45882L1442k30752k48878j28275
17627B28279l3828m7519n4567p175q10k4523m4580l0271K4893o479j2262j6274
17615b5116P151L0648J8601K1271J1485j2741n154k345M844M588j7216j5148j5753
17602E115L1264L1747j2282K79J024n8277j0833J1918J3756O156J048J0653K6240
17589E7808K0110k793l6408l4124J9112J8650r754j4525k0177N177N362q238K4807
17576B5007J646l91J9037K3946L7152n791l3162m6113R419p711r254j5367K8269
$$ plain form
17660 64162 57492 68936 99805 122104 157181 285430 483053 705874 835584 707599 478254
17649 478254 309587 206965 150330 129145 137652 123895 99490 83152 99987 111955 106527
17638 106527 96148 105704 121738 196830 344984 558860 804742 836184 605432 356554 228279
17627 228279 194451 146932 92365 85190 84380 59857 15277 -14994 9899 3420 -8842 -25116
17615 -25116 -17965 12683 31284 52555 64040 51299 46145 43800 48644 53232 36016 20868 5115
17602 5115 36379 68126 55844 56123 57147 -1130 -11963 -45 13711 19867 20915 31568 57808
17589 57808 77918 75125 38717 4593 23705 42355 32601 18076 -2101 3076 8438 200 25007
17576 25007 26653 26262 45299 69245 106397 100606 67444 21331 30750 23039 13785 -1582 26687
17563B6687K2849p015j9344m2191R390K3133J2011K940j9943K414R821l566J7595
17550C4781J3993l688o534p261M669Q041j162l9326O217J4030K5233J7586l3278
17537C3301k4007Q113M7565R78k8526k7642k6546J1200K8435k024o821R028J2665
17524C5719J8203o423k2198j4566j2398K1148L8442P13l906q367j8699q422j5282
17511C964l0324j9441K6140J034Q820K3253K2629L1122j7028k0040L668J586j7271
17498A8112k1652o229O745M136m031j4330j589J4521J2249K2845L8688r849k3863
17485C5753j0539j3096J1935j3001R999p627M318j6619k5612q154R882K1117K1662
17472B0018R591K7299k141r350K68n177k2741k5089K7336k355k229q336j6128
$$ plain form
17563 26687 49536 42521 23177 -19014 -9624 13509 25520 28460 8517 10931 20752 17186 34781
17550 34781 48774 45086 38552 31291 35960 44001 42839 3513 9730 23760 48993 66579 33301
17537 33301 9294 17407 64972 65950 37424 9782 -16764 -5564 22871 20847 14026 23054 35719
17524 35719 53922 47499 25301 10735 -1663 19485 57927 58640 54734 46367 27668 19246 3964
17511 3964 -26360 -45801 -19661 -18627 -9807 13446 36075 67197 50169 30129 33797 35383 18112
17498 18112 -3540 -9769 -3024 1112 -2919 -17249 -18838 -4317 7932 30777 69465 59616 35753
17485 35753 25214 12118 24053 11052 21051 13424 17742 1123 -24489 -32643 -22761 -1644 20018
17472 20018 29609 56908 54767 45417 45685 40508 17767 -7322 20014 17659 15430 7094 -9034
17459i034l9925R24J2595K5499L5990J6326q826k4990j3622K5160J0296k5415
17447D978k7373M6420N5913N7751J39386J46732k6884j63368j24779l3094J5334
17436I1016j2677l9600l1016m994J673p98j3592K3314L3811K0399j6610n6373
17424e447m2069j168r127n026j3088K6864L2458K9581K1090J6613l6510o5281
17412e1110O093K9661j1335k3355j5951J5411K9940j0960M5573P792j9323j7904
17400a5468M712K0279N721K986o835O517L9937j5806k6K823l4909k0663J2602
17387A870J0573J929Q879J7900k2931q621k7740P774J1722P720k3781r902K4237
17374c71k70K9159J7190l3520j9360n09k2396m882M4763J8987K081r551l2036
$$ plain form
17459 -9034 -48959 -48035 -35440 -9941 26049 42375 33549 8559 -5063 20097 30393 4978
17447 4978 -22395 24025 79938 137689 277075 423807 396923 233555 108776 75682 91016
17436 91016 78339 38739 7723 2729 4402 3604 -9988 13326 47137 67536 50926 -5447
17424 -5447 -47516 -48684 -57811 -62837 -75925 -49061 -16603 12978 34068 50681 14171 -51110
17412 -51110 -45017 -15356 -26691 -50046 -65997 -50586 -20646 -31606 13967 21759 2436 -15468
17400 -15468 -10756 9523 15244 18230 11395 17912 57849 42043 42017 44840 9931 -10732 1870
17387 1870 12443 14372 23251 41151 18220 9599 -18141 -10367 1355 9075 -14706 -24608 -371
17374 -371 -641 28518 45708 12188 -7172 -7681 -30077 -34959 9804 28791 30872 21321 -10715
17361a0715L428N0417J5482j3519l0842l5528n200l9170M919J2774J9995p741
17349c5700K1781L0905O393j1240K076j2710N27M0236j791j141J849n211j4130
17336B1844k1079m17k4824K655k5341j2177J0728L3401L9798K46M491j7676k7833
17323a6184R725L5846L0083m764l77j3187R264j4954j1245j7729j3242J4541O044
17310A3821J1244r733j2900k4615k3647J2175M336K657j2j9755l883K8330K2454
17297D72J2006j7015m412j4749j83k4677J6536M8843L1868j6618l0016m031M848
17284B872R486k717M981j169r94M906m680J6505M045o751k9282j3617O356l859
17270a3918J7073r096l547k2048k1667K9152N4243j2647j6204K1846N533j6196
$$ plain form
17361 -10715 -7287 43130 58612 45093 14251 -21277 -26477 -65647 -60728 -47954 -27959 -35700
17349 -35700 -13919 16986 23379 12139 14215 1505 2032 42268 40477 39336 41185 35974 21844
17336 21844 765 348 -24476 -21821 -47162 -59339 -48611 -15210 24588 24834 29325 11649 -16184
17323 -16184 -6459 29387 59470 54706 54329 41142 50406 35452 24207 6478 -6764 7777 13821
17310 13821 25065 15332 2432 -22183 -45830 -33655 -29319 -26662 -26674 -46429 -50312 -21982 472
17297 472 12478 -4537 -8949 -23698 -23881 -48558 -32022 16821 48689 32071 2055 -1976 2872
17284 2872 12358 9641 14622 13453 12459 17365 12685 29190 33235 26484 -2798 -16415 -10059 -13918
17270 -13918 3155 -5941 -9488 -31536 -53203 -24051 30192 17545 1341 23187 28720 12524
17258A2524n406j4559J6755K798m8442k4508K6918J3420Q061n28j6127l9839k3721
17245i2654K2224O8891J322j6653J4782k534J2808r687R609j2978o534k4934k7319
17232f3657N277n107J6575O993k0051K9199K5345L700N840k102O04j0866O210
17219b040J6171m586l0195R889k15p516j2979o246n48K5263L1312l885j3126j8849
17205a7550J3979K5186r663k2745q366K3027J6140J100n510j242R0j406k2644
17192i604l48J2375k3270M525J731K3379O960O352P799p565k1254O302J4455J756
17178B3593k1109R841J6500j1510k5045k1375p681K2173J7882k5595k5637j901
17166d9864J1294j9038r261L3627N1755M452j5686m304P157k4601j4277K1037
$$ plain form
17258 12524 7118 -7441 9314 12112 -36330 -60838 -33920 -20500 -12439 -12967 -29094 -68933 -92654
17245 -92654 -70430 -1539 -217 -16870 -2088 -4622 8186 -1501 8108 -4870 -11404 -36338 -63657
17232 -63657 -58380 -63487 -46912 -39919 -59970 -30771 -5426 -1726 4114 2012 2616 -8250 -2040
17219 -2040 14131 9545 -20650 -10761 -10976 -18492 -31471 -37717 -38265 -13002 18310 14425 1299 -17550
17205 -17550 -3571 21615 11952 -10793 -19159 3868 20008 21108 15598 14356 14446 13040 -9604
17192 -9604 -9952 2423 -20847 -16322 -14591 8788 15748 22100 29899 22334 1080 7382 21837 23593
17178 23593 2484 12325 28825 17315 -7730 -29105 -36786 -14613 3269 -22326 -47963 -49864
17166 -49864 -38570 -57608 -66869 -33242 18513 22965 7279 2975 10132 -14469 -28746 -7709
17154g709L6403K3010J8614k839k3601j2875k4503L726k9343m1381J3519O0980
17142A4001J713k0165J583j882K4334r502j4535J9318K0975p510k6788j3067K149
17129i376O264J9378n18l4520l2249k2772J0524M3434J9791r303j9729K1604K5633
17116A8161J1115K186J2421n145p543p024M644J1710o0108k8352j8490J9441L0988
17103a5996J3544j978j2016p577R679L777k5965M693O213j276R702j565L823O091
17089h851o695k1532k8818L90L0657K7812k0435l4642q576j7538O3713N1253p35
17076B6003J7690j8440q233K009L3870N0954k4668j4815j8937q378N943k0008
17064B2990q930k0592k8371q143L0026K2040j3057m171P882N326J2581n9k7493
$$ plain form
17154 -7709 28694 51704 70318 67479 43878 31003 6500 10226 -19117 -60498 -46979 14001
17142 14001 15714 -4451 -2868 -4750 19584 10082 -4453 14865 35840 28330 1542 -11525 -9376
17129 -9376 -3112 16266 15748 -18772 -51021 -73793 -63269 -19835 -44 -9347 -29076 -7472 18161
17116 18161 29276 31462 43883 38738 31195 24171 28815 40525 -19583 -47935 -66425 -46984 -15996
17103 -15996 -2452 -4430 -16446 -24023 -14344 -10567 -36532 -31839 -25626 -26902 -17200 -18765 -14942 -8851
17089 -8851 -15546 -37078 -65896 -65506 -34849 -7037 -27472 -62114 -70690 -88228 -24515 26738 26003
17076 26003 43693 25253 17020 19029 52899 103853 79185 64370 45433 37055 42998 22990
17064 22990 14060 -6532 -34903 -43046 -13020 9020 -4037 -8208 -326 5000 17581 17522 -9971
17051i971k146o359o721K4366L5341j9481l0574k9658l792J6347K2070K0063N274
17038A4759p699j8816j0848r23M740o050J2777n631j390q759L379J4280P607k289
17024d863j249k0147K3445K11l451J7464K857N492L71n965Q835k6306j4116Q153
17010i269m040k247j9337Q23k026r863O824K8632L2530Q218k932o329Q483L6733
16996F6200M056k5344j6883m389J735P205k8606k2094P578L157L7942J1469n0
16983D1976k0616l1390j1924J5328K1275m404J8078K2559j4609n0385k9643L948
16971c9807J8331J0949R491k617L502P908m8881r87J4842j5402j4263j190L3912
16958b4212J4048J6444K5586j4535j0747j7880j6186r434K0532j208P586m389
$$ plain form
17051 -9971 -12117 -18476 -25197 -831 34510 15029 -15545 -45203 -48995 -32648 -10578 9485 14759
17038 14759 7060 -11756 -22604 -23527 -18787 -24837 -12060 -17691 -19081 -27840 -24461 -10181 -2574 -4863
17024 -4863 -6112 -26259 -2814 -2603 -6054 11410 14267 19759 20130 14165 23000 -3306 -17422 -9269
17010 -9269 -13309 -15556 -34893 -34070 -36096 -45959 -39135 -10503 22027 30245 27313 20984 29467 66200
16996 66200 70256 44912 28029 23640 25375 32580 3974 -18120 -10542 -7385 30557 42026 41976
16983 41976 21360 -10030 -21954 -6626 14649 10245 28323 50882 36273 -14112 -43755 -39807
16971 -39807 -21476 -10527 -1036 -3653 -151 7757 -41124 -42111 -27269 -42671 -56934 -58124 -24212
16958 -24212 -10164 6280 31866 17331 6584 -11296 -27482 -36916 -16384 -17592 -10006 -14395
16946a4395J9251R151J1404p16j1354l08j2241l4456j1465L614R00l034o389q846
16932e8884j1079L2521J2248l418p59r531j8063J0111L6001J3524K0313K8709
16920E1693r845k7662j785J2045m148M851j842j1719k0935r639j3120j1092k856
16907d6054p278L5903K0331K1017m193l844j6040n803j1604J2519M9414o44k8350
16894A5374p609K6715j7122J9771k149n378l9650M757N0R083K7872Q319k9619
16881A0414P75N72Q976J4772K8925l7013m0394R871l653l3085o934J4523o021
16868c8272P963J9465M695O728K34K496N069K728J861o559p136q431J7736j919
16854F658N73K3921k935k1098o909P007J5186J5723j9363j8701O040J6465j0418
$$ plain form
16946 -14395 4856 14007 25411 24695 13341 13033 792 -33664 -45129 -41515 -40615 -43649 -50038 -58884
16932 -58884 -69963 -37442 -25194 -28612 -29371 -38902 -56965 -46854 -10853 2671 22984 51693
16920 51693 41848 14186 12401 24446 20298 25149 23307 11588 -9347 -18986 -32106 -43198 -46054
16907 -46054 -53332 -17429 2902 23919 19726 15882 -158 -5961 -17565 -5046 44368 43724 15374
16894 15374 7765 34480 17358 37129 34980 29602 -10048 -5291 -5241 3842 31714 40033 10414
16881 10414 11189 11761 20737 35509 64434 27421 -12973 -3102 -6755 -39840 -46774 -32251 -38272
16868 -38272 -30309 -10844 -6149 579 813 3309 8378 11106 12967 6408 -728 -9159 8577 6658
16854 6658 7231 31152 28217 7119 210 7217 22403 38126 18763 62 6102 22567 12149
16841A2149q499N1443k0276j9528j6863J2242o605K7017l112k3329k6139m0312
16829f1812P774K4781K2013K9997n604j4244k439m532m1944R221J4936K3381L1638
16816C3166j2813r617o2k2696j7151J8602J3367n421m2068K854K7993J2L2977
16803A9143j914k6437n529j108L261M242j5661M2057L2859L096O64j6345k0113
16790A8215j8486J2390k9190J2279K2453J5141r402l4832R431J3500J1481J0512
16778C3492N287o011n814N945l0884k0489J4595j8133j0701K7046o034j0581j4504
16765c6786K750R431o244k9928j2410K7784O2371K5928M309k185k1022n52L0684
16752E4130j5997k8620l1546j1442Q691J7909K1029O640m190j5834j2270j2459
$$ plain form
16841 12149 3650 55093 34817 15289 -1574 10668 4063 31080 27968 4639 -21500 -61812
16829 -61812 -54038 -29257 -7244 22753 17149 2905 466 -4066 -46010 -36789 -21853 1528 33166
16816 33166 20353 10736 10674 -12022 -29173 -10571 2796 -2625 -44693 -41839 -13846 -13834 19143
16803 19143 17229 -9208 -14737 -15845 -12584 -8342 -24003 18054 50913 54009 54673 38328 18215
16790 18215 -271 12119 -17071 -4792 17661 32802 23400 -11432 -2001 11499 22980 33492
16778 33492 38779 32768 26954 32899 2015 -18474 -3879 -22012 -32713 -5667 -11701 -22282 -36786
16765 -36786 -34036 -24605 -30849 -60777 -73187 -45403 16968 42896 47205 45020 23998 23446 54130
16752 54130 38133 9513 -22033 -33475 -24784 -6875 14154 20794 16604 770 -11500 -23959
16740b3959K3365l116j2509r154k1123K7460K6363J3042q289l850K1825J9600
16728D9655J2361j6666l3319j7628k3517L564o757k1039k0515J9699K6779J057
16716b6326J3383o962M893J754L215J351J4706P671r908l021j414k4454q988K063
16702c2037r924P542k224J3947K6246l278j8624j5678j3198o853J0765K4602J623
16689a7091o50P757K5435q645K0857j4604l6484n84K5885l0041P496q261J3185
16676a5745j1520J0031K7586K6274K1070K6324j0147j3210K777j6428L060o4593
16664a4521l6442J9988K222K990P633K5156N913l6857l0416m500n623J2157J8391
16651c3909L401k236P732L6988j5108j4496J434P794J4329j8196o970N170J3203
$$ plain form
16740 -23959 -594 -3710 -16219 -25373 -46496 -19036 7327 20369 12080 8230 30055 49655
16728 49655 62016 45350 12031 -5597 -29114 -25550 -32307 -53346 -73861 -54162 -27383 -26326
16716 -26326 -12943 -19905 -15012 -13258 -10043 -8692 6014 13685 3777 756 -658 -25112 -34100 -32037
16702 -32037 -41961 -34419 -36643 -22696 3550 272 -18352 -34030 -47228 -54081 -43316 -18714 -17091
16689 -17091 -17741 -9984 15451 6806 27663 13059 -23425 -24009 1876 -28165 -20669 -28930 -15745
16676 -15745 -27265 -17234 10352 36626 57696 84020 73873 60663 63440 47012 50072 -14521
16664 -14521 -50963 -30975 -28753 -25763 -18130 7026 12939 -23918 -54334 -58834 -64457 -52300 -33909
16651 -33909 -30508 -32744 -25012 11976 -3132 -17628 -16194 -8400 5929 -12267 -19237 -14067 -864
16638h64J1694k0948j6990K4956J5104J5348J681m2604m521K5623K0981M682k0996
16625A3146J9225j7901l5499J2823K860j9329K0650J5761k3500k7777M0737M9902
16613E1098l3463k6186m025J2215R351K9286j5223o1794j302J8469K4942j3368
16601a0000J644O288J23K2666o022j8895k1803k425J8708J8247O571j3709j334
16588E9M275o287r182O018k130L860K010j9535M441j1543j9532J8501j5316K2121
16574b2240M1222K5718m777k7444j9784l6056J4435K0991j286P231P884Q217J1591
16561B5702R896J5234R5l4822o312j9686j9699p715J4749J4538j2423k7220J587
16548d6076L5409O847j0169O838L4825r69O187L5182l455p631n231j9762m0409
$$ plain form
16638 -864 10830 -10118 -27108 -2152 12952 28300 29981 -12623 -17144 8479 29460 34142 13146
16625 13146 32371 14470 -21029 -8206 -5346 -24675 -4025 11736 -11764 -39541 1196 51098
16613 51098 17635 -8551 -12576 -361 8990 38276 23053 -38741 -40043 -21574 3368 -10000
16601 -10000 -8356 -2068 -1945 20721 14699 -4196 -25999 -28424 -9716 8531 15102 1393 59
16588 59 4334 -1953 -11135 -5117 -7247 -3387 -1377 -20912 -16471 -28014 -47546 -29045 -44361 -22240
16574 -22240 18982 44700 39923 12479 -7305 -43361 -28926 -7935 -9221 -1990 5894 14111 25702
16561 25702 35598 50832 50927 16105 9793 -9893 -29592 -37307 -22558 -8020 -20443 -47663 -46076
16548 -46076 -10667 -3820 -13989 -7151 27674 26705 32892 68074 64619 56988 51757 31995 -8414
16535h414J3489J0123m549n98l845P089k6687j4916L2470L1570n275k0734j3407
16522c684N581k1073K3332K3530n478j4976p432J2689o266R495J0969J6758k1170
16509B2275j1588p390j1768L0358L232j4101k675P46k4747O294N941l943O983
16496c83N16k4225K2678K0079j3539j8611p350R581M200j650M822l3916R408M3730
16482A5340k176k1136P511M16J2232J5786j7072j4364J2737l422R675L225K429
16469B1181j7773k1950j2033N6133M800j6332o012j2800j3042k0957o706K1014
16457b4477Q917l0320J2757J15p071k15o545j65J0350Q320L882O000J2204k2249
16443b8497J5039N59O56p588m836J4694n6m893J7939M054J1233j2893L4301K0611
$$ plain form
16535 -8414 5075 15198 10649 10051 6206 13295 -13392 -28308 4162 35732 30457 9723 -3684
16522 -3684 1897 -19176 4156 27686 22208 7232 -200 12489 6223 15718 26687 43445 22275
16509 22275 10687 3297 -8471 21887 25119 11018 8343 9089 -15658 -9364 -3423 -7366 -383
16496 -383 133 -24092 -1414 18665 5126 -13485 -20835 -11254 -7054 -8704 -3882 -37798 -28390 15340
16482 15340 13164 -7972 -461 -45 12187 27973 10901 -3463 9274 5852 15527 18752 21181
16469 21181 3408 -18542 -30575 25558 30358 14026 8014 -4786 -17828 -38785 -45491 -24477
16457 -24477 -15560 -45880 -33123 -33008 -40079 -40294 -46839 -47004 -36654 -28334 -24452 -18452 -6248 -28497
16443 -28497 -13458 -12899 -12243 -19831 -24667 -9973 -10029 -14922 3017 7071 18304 5411 39712 60323
16429F0323j3540j8502j3021K5134j3293k2797k100M201K339Q808j8105K864K1050
16416B3361k6145o673j927j1410J6665R114K1420K7223j4636j64k2877m546r609
16403b04j0715J7930k3684r758L2153j4079j6287R323M091j788j8371J2012J7094
16390b283j0292O465Q954M076K8863N136k2486j3648k9697k9091R987K8924K0688
16377E596Q803k752j1432k0428l96P363l4629J2462K4680J463k4956K5982M4730
16364C6486o885N192j3238l1209n512J1145K2397K0412m360l037L573j2694j9064
16351C206k72J611J6434J2555k5163k4921k3063K471J0779K8411J3662j032J6209
16338C0887p228k0251j8985P760K4903l862j7004P395p329l5195k2700K7606L374
$$ plain form
16429 60323 46783 28281 15260 40394 27101 4304 2204 6405 8744 17552 -553 2311 23361
16416 23361 -2784 -9457 -11384 -22794 -6129 2985 24405 51628 36992 36828 13951 9405 -204
16403 -204 -10919 7011 -16673 -26431 5722 -8357 -24644 -15321 -11230 -13018 -31389 -19377 -2283
16390 -2283 -12575 -6110 2844 6920 35783 40919 18433 4785 -24912 -54003 -44016 -15092 5596
16377 5596 14399 11647 215 -20213 -20609 -13246 -47875 -35413 -10733 -9270 -34226 -8244 36486
16364 36486 29601 34793 21555 -9654 -15166 -4021 18376 38788 34428 31391 34964 22270 3206
16351 3206 2934 4545 20979 33534 8371 -16550 -39613 -37142 -26363 2048 15710 14678 30887
16338 30887 23659 3408 -15577 -7817 17086 13224 -3780 3615 -3714 -38909 -61609 -34003 -30629
16325c0629J6506j53R620L334L106j4726J6266j3582n525J8544M768o212l1370
16312c0053j8023L349K1615j3876J3797K2751J4675L1737j1648l2600k7023J6022
16300i277J4381m1361q497K8083J3255l0234Q300K9907J4747n740K6821J1824
16288E2209j6789j9334j1733L2191J9586K0979k9138k0988r385l1491l389P589
16276i693L984J2544j8633j0602J8885L9249N677j1382j4656K2322n196J6297
16264D8796K4484N554j5298l0317j5133l167r131k378j602M49J1009m86j9742
16251f962k2491R528K8467j5087J3642j0055J0614J4556l3127k6883l661J0798
16239c0661J1548J4910Q609K102K1243j526j8874j2669p116K38N7138o107k7713
$$ plain form
16325 -30629 -14123 -14276 -4656 -1322 1784 -12942 3324 -10258 -15783 2761 7529 1317 -30053
16312 -30053 -48076 -44727 -23112 -36988 -23191 -440 14235 45972 34324 1724 -25299 -9277
16300 -9277 5104 -36257 -44754 -16671 -3416 -33650 -25350 4557 19304 13564 40385 52209
16288 52209 35420 16086 4353 36544 56130 77109 47971 26983 17598 -13893 -17282 -9693
16276 -9693 -5709 6835 -11798 -22400 -3515 35734 41411 30029 15373 37695 32499 48796
16264 48796 73280 78834 63536 33219 18086 14919 5788 3410 1808 2257 13266 12780 -6962
16251 -6962 -29453 -19925 8542 -6545 7097 -2958 7656 22212 -10915 -37798 -41459 -30661
16239 -30661 -19113 -4203 4406 6508 27751 26225 7351 -5318 -12434 -12196 44942 38835 11122
16226A1122j1473j8550J9136K8751K1999k5686j2329m727k8210R852M077r198
16214a5236J7967J4518k51j1230N54j074k110j854M886J7503j2241J2522j0404
16201A3550p05N550K103q457j6993O588K1835k6979Q679L412K556Q000Q798k875
16187B5062k0061j6604K9309n959m8888j0207K2258J2492L1467k3478K503q509
16175a0615J2214K1109O76j2514k2730l476j8780J7025L0062k779L73J1209J214
16162B2988k770j3505J2558R969j4815L72p681j7937l0314K5781K5121j7928j7509
16149b5670o5m934P897R402J5799P787J0103L329r138K385k3876j4251K5274L2404
16135C6446k5724p58r467m5158M2083l069j5216J318K1975L7986k48n575n714
$$ plain form
16226 11122 -351 -18901 235 28986 50985 25299 12970 8243 -19967 -10115 -6038 -15236
16214 -15236 2731 17249 16998 5768 6322 5248 3138 1284 6170 23673 11432 23954 13550
16201 13550 12845 18395 20498 12041 -4952 1636 23471 -3508 5171 8583 11139 19139 27937 25062
16187 25062 5001 -11603 17706 11747 -37141 -47348 -25090 -12598 18869 -4609 -2106 -10615
16175 -10615 1599 22708 23384 10870 -11860 -15336 -34116 -17091 12971 10192 10565 21774 22988
16162 22988 20218 6713 19271 29240 14425 14797 7116 -10821 -41135 -15354 9767 -8161 -25670
16149 -25670 -25735 -30669 -22772 -13370 2429 10216 20319 23648 14510 16895 -6981 -21232 4042 36446
16135 36446 10722 9964 497 -44661 -2578 -5647 -20863 -19545 2430 40416 40168 34593 28879
16122B8879l1981k0304k2747R4J1221K8402J6362j6989J2443K0532O071k9065
16110B918O723m71j3883j7604O390K0705j434o602j78J8207j6516k5239L6840
16097I856J410k3671P563k389J1187J8801j3205L207L088j0723k0097q261Q478
16084a4756o577o085j6497m010J5228R765j1559l381J4672K8362k0664J406K1655
16071G559J8218k1378j0632m341K819k2392J3033L3039K2196O827K12n092j8840
16058B1228k8848j641J4451n714J3313J7592j4398r526P608j1761j1975r324j7849
16045c6844L563O732K3155P015p392k8741l8124J5553K0831O568L1230K4560j6293
16032A1813k0923L1276J5418k8229j8459j584j0857m5565r274j012j69O253J8457
$$ plain form
16122 28879 -3102 -23406 -46153 -46059 -34838 -6436 9926 -7063 5380 25912 31983 2918
16110 2918 9641 9170 -4713 -22317 -15927 4778 3344 -3258 -3436 14771 -1745 -26984 9856
16097 9856 11266 -12405 -4842 -7231 3956 22757 9552 12759 15847 5124 -14973 -23234 -14756
16084 -14756 -21333 -27418 -43915 -47925 -32697 -22932 -34491 -37872 -23200 5162 -15502 -14096 7559
16071 7559 25777 4399 -6233 -10574 -7755 -30147 -17114 15925 38121 44948 45160 40068 21228
16058 21228 -7620 -9261 5190 -524 12789 30381 15983 6457 14065 2304 -9671 -18995 -36844
16045 -36844 -33281 -26549 -3394 3621 -3771 -32512 -70636 -55083 -34252 -27684 3546 28106 11813
16032 11813 -9110 22166 37584 9355 -9104 -10688 -21545 -67110 -76384 -77396 -77565 -71312 -52855
16019e2855L90Q531M4193n381l6139L3181O2785L696l3556o775k5410K7617q927
16006A1350m784k1325r2l419l815P581l198K6676r099j2429n34j6993R185K2491
15992A595k1839Q490J0980j257l79Q38M473j1429j5666j3575L714M3313L5665
15979D4923m055j0486k6202p922J3331k1395j8797m46K715L0042j3320K824k962
15966a1750Q030L265K232N050m057L2263o302j2098j4063M923m416j154J706K021
15952E650K8033k4096l9133K0896K6720j2122j8913J1880j4622k5647j191J6596
15940b5949L3388L0756J321j8493m685j0351k5014k3663L3993L4690K2543j0278
15928C8258n3912j7510J1683K0313J0142J3766j5722r684k3630j9582l548K0408
$$ plain form
16019 -52855 -52465 -43934 259 -5122 -41261 -8080 54705 58401 24845 18070 -7340 20277 11350
16006 11350 6566 -14759 -14851 -18270 -22085 -14504 -17702 8974 -125 -12554 -13088 -30081 -20896 1595
15992 1595 -20244 -11754 -774 -2031 -2410 -1572 2901 -8528 -24194 -37769 -34055 9258 44923
15979 44923 40868 30382 4180 -3742 9589 -11806 -30603 -31049 -28334 1708 -11612 -8788 -11750
15966 -11750 -3720 -455 1777 6827 2770 35033 28731 16633 2570 7493 3077 1923 3629 5650
15952 5650 33683 9587 -29546 -8650 18070 5948 -12965 -1085 -15707 -41354 -42545 -25949
15940 -25949 7439 38195 39516 21023 16338 5987 -19027 -42690 -8697 25993 48536 38258
15928 38258 -15654 -33164 -21481 -1168 8974 22740 7018 -2666 -26296 -45878 -49426 -29018
15916b9018K1959K2664M558j7652r128N446n659m6625j7862M4996L6360j2956
15904b917l9983k7324K200L0193K5674J0450Q591l469L245J2194O556k1570M881
15891H721J2915o098k251R778J517q991n706M742j4015l216j013j5139J4988J5989
15877A2221j2855j0555J9530n70m988L746k6308m21L4847J0355J0405k00k4613
15864A0594m6322j3905r979J0013K4050j1461J9548M4252O771j182k0900j5794
15852d315K2697M229k5610j9261J3452N195n908Q477K5577N518o491k0896k9689
15839b7025L829K6175p980K2491J8660j7253j5978J5685k2596j2745K0030J5400
15827A8693o806k4760j8826j8896J0953N982O346P971j0098j744O880o30l775
$$ plain form
15916 -29018 -7059 15605 20163 2511 -6617 -1171 -6830 -53455 -71317 -26321 10039 -2917
15904 -2917 -42900 -70224 -68024 -37831 -12157 -1707 6884 3415 6660 18854 25410 3840 8721
15891 8721 21636 15538 13287 23065 24582 15591 9885 14627 612 -2604 -3617 -18756 -3768 12221
15877 12221 -634 -11189 8341 7771 2783 6529 -19779 -20200 14647 25002 35407 35207 10594
15864 10594 -35728 -49633 -59612 -49599 -25549 -37010 -17462 26790 33561 32379 11479 -4315
15852 -4315 18382 22611 -2999 -22260 -8808 -3613 -9521 -1044 24533 30051 23560 2664 -27025
15839 -27025 -23196 2979 -5001 17490 36150 18897 2919 18604 -3992 -16737 3293 18693
15827 18693 11887 -12873 -31699 -50595 -39642 -33660 -27314 -19343 -29441 -31185 -24305 -24935 -28710
15814b8710Q489j6244J1834K155m924K2837L6392j4992k7541K684K9185J9150
15802D0315o767j4213j3320L0420k068k0148n431P265j3993j1857J0204J9947
15790B0354r065q909J3555k0039k7443o448J3818K1845J4248O519L1709M515k5761
15777B8898l836J0249j012P710k6853r716p875m205K89j100p343J4982L4348l84
15763C4152k7495J6974N002J980K94K640o274m0218P595J5200P943l2669N872
15750i004K1765J3612j4267k4767o495k101r442j2642p356O868J4823J2432J5325
15737a249J5185K816M3365K5297J7418n785l6507J582L785k275k2398k599k704
15724C5931j2684l2478r360Q002J8756o632k9104j1458L0701K3649J8411p398
$$ plain form
15814 -28710 -20221 -36465 -24631 -22476 -27400 -4563 31829 16837 -10704 -8020 21165 40315
15802 40315 33548 19335 6015 36435 34367 14219 8788 16053 2060 -9797 407 20354
15790 20354 11289 2380 15935 -4104 -31547 -37995 -24177 -2332 11916 18435 50144 54659 28898
15777 28898 25062 35311 34299 42009 15156 5440 -2435 -6640 -6351 -7451 -14794 188 34536 34152
15763 34152 6657 23631 28633 30613 30907 33547 27273 -12945 -5350 9850 17793 -14876 -9004
15750 -9004 12761 26373 12106 -12661 -19156 -21257 -30699 -43341 -50697 -43829 -29006 -16574 -1249
15737 -1249 13936 16752 60117 85414 102832 97047 60540 62122 65907 63632 41234 38635 35931
15724 35931 23247 -9231 -18591 -10589 8167 1535 -27569 -39027 -8326 15323 33734 26336
15712B6336j4626m657L530n796R595J6544J194N576K938k4882J655R757j7402
15699I762k8202j4483J7714K4393L6333K5958j0136l9409k217M743O446p329J367
15686B4940j7027K806M717o165n713k4358j4167J3913K5086m168p672r719K4106
15673F579K6834l238j7368n2596l782r213J2423M3750K0205k8163k8358K3220
15661i707J1031P676j443j2264R21p593j5392L3798K8952j0433l0824J7571K1088
15648C3381k1452j9537L682L8943J3203l1705j9847J2793J7711j1981k8035j6260
15636b9104J1254M803r359j4327K6628R931K996j7472j2593M4396K849k0127j3232
15623a3357K1044k3166q730K3764J8485o571j1688j2785J4198J7434k7367J2592
$$ plain form
15712 26336 11710 7053 10583 4787 14382 30926 32120 37696 40634 15752 17407 27164 9762
15699 9762 -18440 -32923 -15209 9184 45517 71475 61339 21930 19713 24456 30902 23573 24940
15686 24940 7913 10719 15436 9271 3558 -20800 -34967 -21054 4032 -136 -7808 -17527 6579
15673 6579 33413 30175 12807 -39789 -43571 -52784 -40361 3389 23594 -4569 -32927 -9707
15661 -9707 1324 9000 7557 -4707 -3786 -11379 -26771 7027 35979 25546 -5278 12293 33381
15648 33381 11929 -7608 -3926 35017 48220 16515 -3332 9461 27172 15191 -12844 -29104
15636 -29104 -17850 -13047 -22406 -36733 -10105 -174 2822 -14650 -27243 17153 20002 -125 -13357
15623 -13357 7687 -15479 -24209 -445 18040 11469 -219 -13004 1194 18628 -8739 3853
15611C853j49m157j8342J8111J3856l0867j0686K9050J4449q095j5943n87l731
15598a3238K1550K0151k9926j086j1050j9797n338j2066R130K6115J2668K3149
15586B0262L1j4395l5317k1252k055K8514K2772j7466j758Q233K8982q658l7971
15573c0078j1123J1536J5588O379L9147K0782J1816o587j3133j9830K0022p159
15561C7360Q106M651M151j8195j9319p205J4602P018j1244k2309J1209r509j2147
15548a2831N251K7509K2251j925K99o242q197l6810m561Q3p147o998l1964O001
15534e5281J9551q515K3404K3799j303J158K3227K9164o12k4396m0283k1667j8944
15521e0698L1930L8817J7736K931j4132j2127j0365K0225j2558l3645K3008J9011
$$ plain form
15611 3853 3704 -453 -18795 -684 13172 -17695 -28381 669 15118 7023 -8920 -9507 -13238
15598 -13238 8312 28463 -1463 -2549 -13599 -33396 -38734 -50800 -41670 -15555 -2887 20262
15586 20262 20293 5898 -29419 -50671 -52726 -24212 -1440 -18906 -20664 -12431 16551 7893 -30078
15573 -30078 -41201 -29665 -14077 -7698 31449 52231 64047 57460 44327 24497 44519 37360
15561 37360 45466 50117 54268 36073 16754 9549 24151 31169 19925 -2384 8825 -684 -12831
15548 -12831 -7580 19929 42180 40255 40554 34312 26115 -10695 -15256 -15173 -22320 -29318 -61282 -55281
15534 -55281 -35730 -44245 -20841 2958 1655 2813 26040 55204 54592 30196 -10087 -31754 -50698
15521 -50698 -18768 20049 37785 40716 26584 14457 4092 24317 11759 -21886 1122 20133
15509B0133j8521j7567j9199J6424M9866j4400k7311j3001Q263N666j6046J4704
15497a0989l577j5893r43K655r928J2417j9450j8456P83J4548K1976L2216q357
15484b998J309K8757J3225m076l027l0707k1520q707K2215K1210J2333J6630l1223
15471A3421l3823m929m144J1520r501K9265N5999k1448k8282L343m829j6930J1637
15458A299n282q904J3358L3612m008m9941j9282K2733J0797k759k4844J8421J6630
15445A830l7835j1808l839q786j3686J0145J9627J9934o66J2352j2836K5766j1096
15432a0898j156L3636J148R485l0735j5175K7971p964n872P458l6056J606J2394
15419a4158k0259J1125P673J6707L4651K9047r811j1402j2555k4999l1685N131
$$ plain form
15509 20133 1612 -15955 -35154 -18730 31136 16736 -10575 -23576 -15313 -9647 -25693 -10989
15497 -10989 -14566 -30459 -31402 -28747 -38675 -26258 -45708 -64164 -63381 -48833 -26857 5359 -2998
15484 -2998 -1689 27068 40293 36217 33190 2483 -19037 -27744 -5529 15681 28014 44644 13421
15471 13421 -20402 -25331 -29475 -17955 -27456 1809 57808 36360 8078 11421 6592 -10338 1299
15458 1299 -3983 -12887 471 34083 30075 -19866 -39148 -16415 -5618 -8377 -33221 -14800 1830
15445 1830 -36005 -47813 -51652 -60438 -74124 -63979 -44352 -24418 -25084 -12732 -25568 198 -10898
15432 -10898 -12054 21582 22730 32215 1480 -13695 14276 6312 440 7898 -28158 -26552 -14158
15419 -14158 -34417 -23292 -15619 1088 35739 64786 54975 43573 31018 6019 -25666 -20535
15407b0535J2226J3588j8009J8331K0111j6441N942P686l3013k5712J9632K3682
15395G488O445j2904k2599J2118J5340J7623k3375j1715N988j7686K0856k10k1801
15382b4432K2748J5037J806j8175q070M988j4823M757p857K363j4744l842m638
15369d4882J0113J7829K7704J9174n749n580j5097j211n000J9862K0135k4996
15357A2302k8126J6713J2245J6043j6728l624R259J924k233j5994Q974k2336k1829
15344c3410j8574Q72L0049K0209J6716J1371j4635j2815j652j8920P309J2150
15332a330m708j2203J9304J935k1494J9913J0821m518p709k0486k260J4033r784
15319a8486j7717P685K322Q536J8101n749j4598j38L81o632P162n945J909J6965
$$ plain form
15407 -20535 -8309 5279 -12730 5601 25712 9271 15213 22899 -10114 -35826 -16194 7488
15395 7488 13933 1029 -21570 -9452 5888 23511 136 -11579 -5591 -23277 -2421 -2631 -24432
15382 -24432 -1684 13353 15159 -3016 -11086 -6098 -20921 -16164 -24021 -21658 -36402 -40244 -44882
15369 -44882 -34769 -16940 10764 29938 24189 18609 3512 2301 -2699 17163 37298 12302
15357 12302 -15824 889 13134 29177 12449 8825 18084 20008 17775 1781 10755 -11581 -33410
15344 -33410 -51984 -51112 -21063 -854 15862 27233 12598 -217 -1869 -20789 -13480 -1330
15332 -1330 -6038 -18241 1063 2998 -18496 1417 12238 7720 11 -20475 -22735 -8702 -18486
15319 -18486 -36203 -28518 -26196 -17660 441 -5308 -19906 -20044 -19663 -26295 -19133 -25078 -23169 -6204
15305f204j5656k7020M2956K6378j6635N432n830J666j1075m195J1899J6695l573
15292A4838l9892l0473k1818O629R914M6074J7668n797j8921j4935J7231J7172
15280b310K3373K2398j3111l9019l5005j5238J7993j1885J149L0411N687M535
15268a1022P761P457J6159j5618o518k1562N62K0376k3677j3619r503K4010K9749
15255D555J0318J2004r681P685K9619J4414K9751k1399l3301j8240k2790J6477
15243A9412P85j4811M419J1415K6388J2017k0715k1552k6790j730L3051k0891
15231I98J1338K2118k520j8190r26M864J7098r427k9004L914K0992P457L213J835
15217C3760j8343j1480J129K2477O166q216j2814J937N80K43j4893k138J4097
$$ plain form
15305 -6204 -21860 -48880 -5924 20454 3819 9251 3421 5087 -5988 -10183 1716 18411 14838
15292 14838 -25054 -55527 -77345 -70716 -60802 -14728 2940 -2857 -21778 -36713 -19482 -2310
15280 -2310 21063 43461 30350 -8669 -43674 -58912 -40919 -52804 -51655 -21244 -15557 -11022
15268 -11022 -3261 4196 20355 4737 -1781 -23343 -22781 -2405 -26082 -39701 -49204 -25194 4555
15255 4555 14873 26877 17196 24881 54500 68914 98665 77266 43965 25725 2935 19412
15243 19412 20197 5386 9805 21220 47608 59625 38910 17358 -9432 -11162 21889 998
15231 998 12336 34454 31934 13744 12818 17682 34780 25353 -3651 263 21255 28712 31925 33760
15217 33760 15417 3937 5066 27543 33709 25493 12679 14616 15196 15439 546 -1592 12505
15204A2505J7578K3630m570m7619k4780L963J6418N284N413l91j1046L296l344
15191c663o964Q149J3237k5999k4731J4825J2064m622j2957j56l2433j563K2284
15178d2529K1568O674k971n154r072l131k6910K6822K8562K712Q692l0207o484
15165c1428j4031l601K4355K6299J5997J0328J1034j6263R21K846j0597m909j0881
15152G0p76L0021K8217j0169l5371q985j1958M027J0107j7054j9121J5896K3655
15139H559K4381j0406j0328k3135j9029k4550L641L1180M662k021K2813J3282
15127A9049K2672l8489m2681J0527K243l507j1006R361j60M114J8527K3355k0979
15114f974J2482l003j8656o301j9946L0846j3136J5040K5349M172J3003J3268
$$ plain form
15204 12505 30083 53713 49143 1524 -23256 -19293 -2875 2409 7822 7431 -3615 -319 -3663
15191 -3663 -10627 -2478 10759 -15240 -39971 -25146 -13082 -17704 -30661 -30817 -63250 -64813 -42529
15178 -42529 -20961 -14287 -17258 -22412 -31484 -34615 -61525 -34703 -6141 -3429 5263 -24944 -31428
15165 -31428 -45459 -49060 -24705 1594 17591 27919 38953 22690 23611 26457 15860 10951 70
15152 70 -706 29315 57532 47363 11992 3007 -8951 -4924 5183 -11871 -30992 -15096 8559
15139 8559 32940 22534 12206 -10929 -29958 -54508 -50867 -19687 -15025 -17046 5767 19049
15127 19049 41721 3232 -39449 -28922 -26679 -30186 -41192 -31831 -31991 -27877 -9350 14005 -6974
15114 -6974 5508 2505 -16151 -22452 -42398 -11552 -24688 -9648 15701 19873 32876 46144
15102D6144J0033k1420k0405m046l542j3236j9456l2336M3526K2473N934L995
15090A7664j662J3975n575k2517J7075o67l4677K3291K6342J2960J2352p873r377
15077D1311j1171m062m676j6200M763M45m186J4920N104k0177p587j1511L5645
15064B2618M685j5409m0209j035m737l3054J3866K2599L5042K9836j105q389j5
15051B4693m1092lq868m2812J9227O0203K7878J720j4100N49K6308j0178R429
15038E2954j2768O983k564P106R751m3378j2883J4039j5039j7452j23R082p790
15025a2082Q008P512j8014j9250L9161N6856l3098n4278q856J8331j7481l772
15013c6963J6670K3936L3630K2711j3368l2816q567r380J7674J626J4227K908
$$ plain form
15102 46144 56177 34757 14352 10306 6764 -6472 -25928 -58264 -14738 7735 13669 17664
15090 17664 16002 29977 24402 1885 18960 18293 -16384 6907 33249 46209 58561 50688 41311
15077 41311 30140 26078 21402 5202 9965 10410 6224 21144 26248 6071 -1516 -13027 22618
15064 22618 27303 11894 -28315 -29350 -34087 -67141 -53275 -30676 4366 34202 33097 24708 24693
15051 24693 -16399 -16402 -25270 -68082 -48855 11348 39226 40946 26846 27395 53703 43525 52954
15038 52954 40186 47169 44605 51711 61462 18084 5201 19240 4201 -13251 -13374 -4292 -12082
15025 -12082 -4074 3438 -14576 -33826 5335 62191 29093 -25185 -34041 -15710 -33191 -36963
15013 -36963 -20293 3643 37273 59984 46616 13800 5233 -4147 13527 15153 29380 32288
15001C2288k5459P262o940j3302N52J4515k1581j2335Q573j9590m166O751K1720
14988a1712K3939O063j7645q998O602M2360J6836l2909j2125R67o948k26P599
14975A3803K5086J3343q451l3718l5428k6761n080M676M670M6471K5968K7473
14963E2052k2470M126K6387j1568l4992j6213N02j2827k201K3790k355M664K1669
14950C0564L434k5109r944n637k4180p427J9568J0050J2233q073M116N243n416
14937e78n900j6490K655j3055r83J2382J1176K465J3544J0624k3187k2196n978
14924c5521L5331K2137k6618J873J3328O302K3207j731J0867J3361n1202j0514
14912H20P273j5281P341j2438O476J4093N79k4033j1640j018J1221K3045K3889
$$ plain form
15001 32288 6829 14091 7151 -6151 -5599 8916 -12665 -25000 -16427 -36017 -40183 -33432 -11712
14988 -11712 12227 18290 645 -8353 -1751 40609 57445 24536 12411 13378 6430 6204 13803
14975 13803 38889 52232 43781 10063 -25365 -52126 -57206 -52530 -47860 -1389 24579 52052
14963 52052 29582 33708 60095 48527 13535 -2678 -2176 -15003 -17204 6586 4231 8895 30564
14950 30564 33998 8889 -1055 -6692 -30872 -38299 -18731 -8681 3552 -4521 -405 4838 -578
14937 -578 -6478 -22968 -20313 -33368 -34351 -21969 -10793 -8328 5216 15840 -7347 -29543 -35521
14924 -35521 -190 21947 -4671 -2798 10530 16832 40039 38308 49175 62536 11334 820
14912 820 8093 -7188 153 -12285 -5809 8284 8863 -15170 -26810 -27828 -16607 6438 30327
14899C0327J1233j5293j517K354Q757J6784n19K197k4200j480M058N023J8789
14886E6513k617k3565q449N83j7082j9305j3602l7604K3402N0646K3430k1884
14874A0466k3035J6568J220j3615J2147K7467K9119m725k7229j1353J9654j6271
14862B0413j9171l1671L139K3495o430l550q690n573K3383L976n200l044p361
14849a6284j2619N002K862J0808j2930k7067N713K0136J4035k6988j9842K2666
14837c4508M5918P028K7092r464n3707o030j2474J9773O612R515o322l726k2898
14824c3191q988k4379n761J0386K5259J9588k1487R676j739J0671L2555n417j4874
14811g701K0591K298j0241K0365K4221k1423m6014M578K9226J2197j3691M3723
$$ plain form
14899 30327 41560 26267 24750 27104 35861 52645 52126 54323 30123 28643 32701 37724 56513
14886 56513 53896 30331 21882 22465 5383 -13922 -27524 -65128 -41726 8920 32350 10466
14874 10466 -12569 3999 5219 -8396 3751 31218 60337 55612 28383 17030 36684 20413
14862 20413 1242 -30429 -27290 -3795 -10225 -13775 -22465 -28038 -4655 -679 -5879 -8923 -16284
14849 -16284 -28903 -23901 -21039 -10231 -23161 -50228 -44515 -24379 -10344 -37332 -57174 -34508
14837 -34508 11410 18438 45530 36066 -17641 -23671 -36145 -16372 -9760 -245 -6567 -10293 -33191
14824 -33191 -42179 -66558 -72319 -61933 -36674 -17086 -38573 -28897 -30636 -19965 12590 7173 -7701
14811 -7701 12890 15188 4947 25312 49533 28110 -17904 -13326 15900 28097 14406 58129
14799E8129N268p815j43Q150M385P839n4090m8970j0870L2086L8911k071n436
14786B5373j6336l686k942p228k81J9829J2400L527J752k7679l273n306j8470
14773b2320R956J2016K3004J6292J1617o92K7856J0633l8362k6915J4010j2665
14761B4430J5105k7573O494j0911k340P850r690k618q966J294q033K1457L6637
14748D3136L4523j5961l6539j0828n757J586K198J2892n188k3330n966o853P23
14735a5364J5069M0708J8313l106K747j1744j0264j3307K0017n410k2090j639
14723A3930o276L98q270J4457j5390k4671J927J3296J7924J3532Q543P809j5414
14710B1795L747M55Q13j8758K722l142j4535p300L773J1418n363K0086J0551j4859
$$ plain form
14799 58129 63397 55582 55439 63589 67974 75813 21723 -27247 -38117 -6031 32880 30809 25373
14786 25373 9037 5351 2409 -4819 -5100 14729 27129 30656 32408 4729 1456 -3850 -22320
14773 -22320 -12364 -348 22656 38948 50565 49873 77729 88362 50000 23085 37095 24430
14761 24430 39535 11962 18456 7545 5205 13055 3365 747 -8219 -6925 -14958 6499 43136
14748 43136 77659 61698 25159 14331 8574 10160 12358 25250 20062 -3268 -9234 -16087 -15364
14735 -15364 -295 40413 58726 55620 58367 46623 36359 23052 43069 37659 15569 13930
14723 13930 7654 8052 -218 14239 -1151 -25822 -23895 -10599 7325 20857 29400 37209 21795
14710 21795 25542 25997 26810 8052 10774 7632 -6903 -14203 -10430 988 -4375 15711 26262 11403
14696A1403j6666r730L366l92R565O329K684J0500N081r81j9583j0810J5561J7681
14682B4008k3158J2727m65L9489m432m5683l0110K4511J2856q621K746K5884K9966
14669E9718K6562j654n923k6116k4670o091k1401k1066M1170J0941k420p608j2745
14656H697M579j7186L1871L027k823J0366m8447n4747j7787K8020K1770n402L8009
14643e3J3733R818k673k589R642N413L153k1830j7397R956j1452q189J0582R688
14629G802k1305J8522r073k4097o63Q043o673m679J926J7806J2065R966o537o3236
14615f0133q660K9020J3545N8098j7198l9236j0561m143N877J7283K2559Q709
14603A5160J1241j0349j7902j8418L267N0754J7477q344l451O376n853j9461k8882
$$ plain form
14696 11403 -5263 -14993 -11627 -12019 -2454 3875 6559 17059 22140 21159 1576 -9234 6327 24008
14682 24008 850 13577 13112 52601 48169 2486 -27624 -3113 9743 1122 3868 29752 59718
14669 59718 86280 84626 78703 52587 27917 21826 425 -20641 20529 31470 29050 21442 8697
14656 8697 13276 -3910 27961 30988 28165 38531 -9916 -64663 -82450 -54430 -32660 -38062 -53
14643 -53 13680 23498 20825 18236 27878 33291 36444 14614 -2783 7173 -4279 -12468 -1886 7802
14629 7802 -13503 5019 -4054 -28151 -28814 -20771 -27444 -32123 -30197 -12391 -326 9640 3103 -60133
14615 -60133 -68793 -39773 -26228 31870 14672 -24564 -35125 -39268 -33391 -16108 6451 15160
14603 15160 26401 16052 -1850 -20268 -17001 33753 51230 42886 39435 45811 39958 20497 -8385
14590h385k6445j0337J4308M2379J9039j9611J7546Q259j5686j2528k942K5629
14578C1226J7593j7503j2955j6223m288J2706O67L284k8401K6839r053r860J2560
14565F592L965R407p806j4954l5746L681K6596J2531J1406M626j3708M8404J3908
14552F8902J189j0217k7992J3376O207p588J3052M14j3926j9248l9290J7625P416
14539I920K91L201j3607j388j4234r880J3048Q341K0410K4622j5070j302J1843
14526C6195L0868P894k9477o025m2462j594J7191R623j1427j0162r410k3785K3684
14513h887J3645K3012K5463O277k4707j4793J0533O920k277j2924J3303q645Q325
14500C5245k2223k6786M682K7730m946K652j5526l0516K6474J7133n10o988J7763
$$ plain form
14590 -8385 -34830 -45167 -30859 11520 30559 10948 28494 36753 21067 8539 5597 31226
14578 31226 48819 31316 18361 2138 -2150 10556 11223 14507 -13894 12945 3892 -5968 6592
14565 6592 10557 19964 12158 -2796 -38542 -34861 -8265 4266 15672 20298 6590 54994 68902
14552 68902 70091 59874 31882 45258 51465 43877 56929 57343 43417 24169 -15121 2504 9920
14539 9920 10211 13412 -195 -1583 -15817 -25697 -12649 -4308 16102 40724 25654 24352 36195
14526 36195 67063 74957 45480 39455 -3007 -4601 12590 22213 10786 624 -8786 -32571 -8887
14513 -8887 4758 27770 53233 59510 34803 20010 30543 37463 35186 22262 35565 26920 35245
14500 35245 13022 -13764 -9082 18648 13702 16354 828 -29688 -3214 13919 13409 6421 24184
14487B4184k046k1405k5910k399r841L7335J9775J863R482N73q062l68Q074o447
14473B4808K6734K7658k7082O015N509l3296J0263J4704m938k3471j1201n550
14461A0153J3425l103l2217j8227L1929J9105N455k3184j1880L0652J4701N628
14449D2437k360j8174j3167j931r063j6143K2500J9602k6512J26L3044K7980R313
14436F7652n869O582L163k9490l7676m640L3487J9714q990J5935k1203R292K9085
14423G7042J3605Q82j4286p501r506L5746M3590K1931l7267j3139J5881M9146
14411A76124M4292J7957J2883O7535J73706K62650K85457K71433K37071J92278
14401A741386Q8303m6161j85067k55220k57818k58733k17103j72754j19291j07191
$$ plain form
14487 24184 22138 733 -25177 -27576 -37417 -82 19693 21556 31038 31611 23549 23181 31255 24808
14473 24808 51542 79200 52118 58133 63642 30346 40609 55313 50375 26904 15703 10153
14461 10153 23578 20475 -11742 -29969 1960 21065 26520 3336 -8544 22108 36809 42437
14449 42437 40077 21903 8736 6805 -2258 -18401 4099 23701 -2811 -2685 30359 58339 67652
14436 67652 61783 68365 71528 42038 4362 -278 33209 52923 43933 59868 38665 47957 77042
14423 77042 90647 91529 77243 69742 60236 95982 139572 161503 124236 111097 126978 176124
14411 176124 220416 238373 251256 318791 492497 755147 1040604 1312037 1549108 1741386
14401 1741386 1829689 1783528 1598461 1343241 1085423 826690 609587 436833 317542 210351
14391B10351j8506k542k8200n3784n7225k8633m585J3736J0619k2651O10R401
14379B8591j3613o587J2477N42N929K2741J1891j603J5680k3k3897n388L0115
14366G6855k0604r185l616k2539J4601K6900N632l3961n955P944O133k2697n679
14353A3829Q64k372k688J6482k0556j6934R579L6938L9178j9107l0702j593r870
14340A3048k157n198j3230K8623Q196L879J331R107K5180j8183j9963J4413Q954
14327E4000O22J696j3588l6895j5071Q687J2090k769p948R657m177j213j080N161
14313I172J4253Q780j817l2755J1500K4135J9279j5046J5462M706n897O811k7122
14300C1461p47J7247j3732j5212l0466j8721K4082K2458j0879J5355K7954K5804
$$ plain form
14391 210351 191845 189303 161103 107319 50094 21461 16876 30612 41231 18580 19190 28591
14379 28591 14978 8391 20868 21410 27339 50080 61971 60368 76048 76025 52128 46740 76855
14366 76855 56251 47066 43450 20911 35512 62412 68044 34083 28128 36072 42205 19508 13829
14353 13829 14693 12321 9633 26115 5559 -11375 -1796 35142 74320 55213 24511 22918 13048
14340 13048 10891 5693 -7537 21086 29282 33161 34492 43599 68779 50596 30633 45046 54000
14327 54000 54622 56318 42730 5835 -9236 -549 11541 8772 824 10481 6304 5091 4011 9172
14313 9172 23425 32205 30388 -2367 9133 33268 52547 37501 52963 57669 51772 58583 31461
14300 31461 30714 47961 34229 19017 -11449 -30170 -6088 16370 5491 20846 48800 74604
14288G4604j2978L847J4016m2153k0651k3349K733n280P401L317q558K7521k1274
14275h04m014M471L1468L0850j1202m1152j1442R384o498j3073J2531J3190J6302
14262C0011n60j2216j3331k314K6152m722l2455j5016L388o290J8998Q834l206
14249b727j7186j887O172Q798j1019j4274J1373n592k3729l7394j1416p164O857
14236i9188l22K4314L1170N1941M1420K7156J2593J4504k1384m6951Q049M388
14224D7690k377J26P339M809P298K3909K2283L647j7423k2339k0457k2903p529
14211B4073J3463J017O255J3543R430L302j0547k3361K0476l0962R440N24L5340
14198G1993r842j4713l8213P059M8717O188J6017J369p596r716R54K5551K5406
$$ plain form
14288 74604 61626 65473 79489 37336 16685 -6664 -3931 -9211 -1810 1507 -7051 20470 -804
14275 -804 -4818 -347 31121 61971 50769 9617 -1825 7559 1061 -12012 519 13709 30011
14262 30011 29451 17235 3904 1590 27742 23020 -9435 -24451 -21063 -27353 -8355 479 -2727
14249 -2727 -19913 -21800 -15628 -6830 -17849 -32123 -20750 -26342 -50071 -87465 -98881 -106045 -99188
14236 -99188 -99510 -75196 -44026 7915 49335 76491 89084 103588 82204 35253 43302 47690
14224 47690 45313 45439 52778 57587 64885 88794 111077 114724 97301 74962 54505 31602 24073
14211 24073 37536 38553 44808 58351 67781 71083 60536 37175 57651 26689 36129 36653 71993
14198 71993 62151 47438 9225 16284 65001 71189 87206 88575 80979 71263 72217 97768 123174
14185A23174J7323K3076L599k4566j287j588p084K7624J3051J9713K1552n24j7549
14172A96514j8865n348J1795N157l8565l5479o150l852j7458o019p627J8613K0166
14159A12882r270l7693k5848P384J0348K3981J8911K416L8769K0977j2656J7396
14147A67597j3085o78L4019o097m045K9465M7697k8950j2199J7944N7131M0035
14135C28834o285q0350k6994K7146K8062J7878K732k7862j3108q695j1297l1653
14123A98408j3101k9674l0974J2960j8371k3558k6186k4655l709J7408K637L451
14111F4636J1477K1161m831R049O542Q716J4251j2490k4362k614J8881j2429N062
14098A03049j8128k3344j7368k768k6513j6232K557L0110L0761r426j2853k5063
$$ plain form
14185 123174 140497 163573 167172 142606 141319 139731 132647 160271 173322 193035 214587 214063 196514
14172 196514 177649 172301 184096 189253 150688 115209 109059 105207 87749 81730 74103 92716 112882
14159 112882 103612 65919 40071 47455 57803 81784 100695 103111 141880 162857 150201 167597
14147 167597 154512 153834 187853 181756 177711 207176 254873 225923 213724 231668 288799 328834
14135 328834 322549 242199 215205 242351 270413 288291 291023 263161 250053 241358 230061 198408
14123 198408 185307 155633 124659 137619 119248 95690 69504 44849 41140 58548 61185 64636
14111 64636 76113 97274 92443 101492 108034 116750 131001 118511 94149 91535 110416 97987 103049
14098 103049 84921 61577 44209 41441 14928 -1304 1253 31363 62124 52698 39845 14782
14086A4782j6071O205K3194K38k6541j2866K7282m2119j8837K2608L2152M9598
14074E9625O1030j4902k7096K097J8488j2027m163j289k60K7455J4918k6176q370
14061H9330J3505K7719L3613M9808O2473O4831M4901P0968M7729L2137N3548K6771
14049F17333k5608m7998l1572j8852m1100m6725p658m1097m4674j9897N567j1810
14037B85909r742j4351o968k4901j7825J4960J1097M01J4512J0080N059q263J9399
14024B79367j950j6418k4294M002J8529k3140K2134K3724j0768k2796J6886N356
14012B70632l843K1109L2669J7835J603L1215k380j8478K990K8601L8977j6495
14000D04435J697J4327J0448M8191N6230J5835J1018q023j5960j3526j3046K2661
$$ plain form
14086 14782 -1289 4916 28110 28348 1807 -11059 16223 -25896 -44733 -22125 10027 59625
14074 59625 120655 105753 78657 80754 99242 87215 83052 81763 81503 108958 123876 97700 89330
14061 89330 102835 130554 164167 213975 276448 341279 386180 457148 504877 537014 590562 617333
14049 617333 591725 543727 512155 493303 452203 405478 397820 356723 312049 292152 297719 285909
14037 285909 276167 261816 254848 229947 212122 227082 238179 238580 253092 263172 268231 259968 279367
14024 279367 277417 260999 236705 240707 259236 236096 258230 281954 271186 248390 265276 270632
14012 270632 266789 287898 320567 338402 340005 371220 368840 350362 353352 381953 420930 404435
14000 404435 406132 420459 430907 479098 535328 551163 562181 554158 538198 524672 511626 534287
13988E34287M729p257L8753L5925L5929L3476O629o875L814M2753N6912N2149
13976H31224M9573N0414M2942O374Q853L8575R3520P5490Q5990Q0394M0713M5175
13964A449237P8595J15938J18476J33494J49542J52603J45998J59231J57515J37848
13954B798477J30659J41168J93340K66324L43822M33621N98872Q28722J041969
13945F776974J263214J443400J506367J586413J553739J534474J727790K167832
13937A9560203L084031M799664P878193J3356975K2756584L5392602M5499676
13930A52327928N2730397N4367159M4018357K9204868P259737k0321297l6751970
13923B82835179m9209843n3535948m7102470l9510816k8071170j7144619j0495190
$$ plain form
13988 534287 539016 531759 570512 606437 642366 675842 682471 675596 679410 722163 779075 831224
13976 831224 880797 931211 974153 980527 989380 1027955 1121475 1196965 1282955 1363349 1404062 1449237
13964 1449237 1527832 1643770 1762246 1895740 2045282 2197885 2343883 2503114 2660629 2798477
13954 2798477 2929136 3070304 3263644 3529968 3873790 4307411 4906283 5735005 6776974
13945 6776974 8040188 9483588 10989955 12576368 14130107 15664581 17392371 19560203
13937 19560203 22644234 27443898 35322091 48679066 71435650 106828252 152327928
13930 152327928 205058325 259425484 303443841 332648709 339908446 319587149 282835179
13923 282835179 233625336 180089388 132986918 93476102 65404932 48260313 37765123
13916C7765123o746738m584262l187055k358349k039088j806624j828843j827999
13908A3386165j753490j650842j490441j236928r61179p65739o11432m96074m26313
13899C993727l77033l23153k79061k61023k25623k19068j75065j79615j51582
13890A802504j33394j24203j04136j05937q4289q4606p2610l9878o0144k8628
13880I64679l777n2192o1346k0811o716o456k9027k7289k2146l4730o548l1673
13868F61968l9894l4869m0171m7084k6451k0366j0383k6964l3305j1062L772j1259
13856C63932j1234q819l4321j6442O57j01j0984k4611L801j390j3915J7076N5297
13843C18946J2386l7532l1070n459J656k5370n7333L162L946R638K8762M627n303
$$ plain form
13916 37765123 31018385 26434123 23247068 20888719 18849631 17043007 15214164 13386165
13908 13386165 11632675 9981833 8491392 7254464 6293285 5527546 4916114 4420040 3993727
13899 3993727 3616694 3293541 3014480 2753457 2527834 2308766 2133701 1954086 1802504
13890 1802504 1669110 1544907 1440771 1334834 1250545 1165939 1093329 1053451 993307 964679
13880 964679 960902 908710 847364 826553 819837 813381 784354 757065 734919 700189 693641 661968
13868 661968 622074 587205 547034 499950 473499 453133 442750 415786 382481 371419 375191 363932
13856 363932 352698 343879 309558 293116 293773 293672 282688 258077 261878 260488 246573 263649 318946
13843 318946 331332 293800 262730 257271 258927 233557 176224 179386 183332 192970 221732 226359 221056
13830B21056k7128k039R648j2957r386j2445j9145j3040k9953K4545K7252P857
13818A64265j4794j5924j294J3305k7396k7945j4654j7995m6743q014r286m0132
13806d6607m9823l2279j9046p438K1314M2809N5950K0155M0913L1192M9010M9676
13794A55826K1988J2187J9537J8014k598l011m764Q846J0681n3406m1820l018
13782A38462j170j7347J7709M253J839j3044L7777K1707j593j3079N55N588P489
13769A89146Q332j4494Q512j2391k5277o094J8682J5355n141q224m6175j5314
13757A06917j246l802J0737P556J0102j1006L861P633j2667j0921l0196k8227
13745D8741K0902K2941j516j153Q224M096j9116P643j869j5364P967N3301K0891
$$ plain form
13830 221056 193928 191889 201537 188580 179194 166749 147604 134564 104611 129156 156408 164265
13818 164265 149471 133547 132253 145558 118162 90217 75563 57568 10825 2811 -6475 -46607
13806 -46607 -96430 -128709 -147755 -155193 -133879 -91070 -35120 -14965 25948 57140 106150 155826
13794 155826 177814 190001 209538 227552 224954 221943 217179 226025 236706 183300 141480 138462
13782 138462 137292 119945 137654 141907 143746 130702 168479 190186 188593 175514 176069 181657 189146
13769 189146 197478 182984 191496 179105 153828 147734 166416 181771 176630 168406 122231 106917
13757 106917 105671 101869 112606 120162 130264 119258 123119 130752 118085 107164 76968 48741
13745 48741 69643 92584 91068 89915 98139 102235 83119 90762 88893 73529 81496 134797 155688
13732A55688l418m8865m9005j7922N249J1135J3194o895k8818K1084j3524Q408
13720D6311J9724j2439j4676J8927j0618J1151R156r098o39K0542k1508l1965
13708B4868K2669J2868J42l055J0197L0282Q353k0332l863J2545j3621n397j8803
13695E6853k3188j3364j163J7429K3669P011k492j8373p556K788K9244O032k3723
13682E3167k5484j5188J6912J8796k194Q059J1662J7888j8284p118L7069j3159
13670H2126M373j6735J4996K2845j9448k7308J62m361O225J5707K5983m87j3312
13657I0766l5966q770L905r167k3140j9239J106q737m397L2738k809j9001N475
13644B764j628r437J4501k0208j8582J7969P868p840J0360j0220k7521J7006J0551
$$ plain form
13732 155688 152270 103405 54400 36478 41727 52862 66056 59161 30343 51427 37903 46311
13720 46311 66035 53596 38920 57847 47229 58380 67536 58438 57799 78341 56833 24868
13708 24868 47537 60405 60547 57492 67689 97971 106324 85992 82129 94674 81053 75656 56853
13695 56853 33665 20301 19138 36567 60236 67247 64755 46382 38826 41614 70858 76890 53167
13682 53167 27683 12495 29407 48203 46009 54068 65730 83618 65334 58216 95285 82126
13670 82126 86499 69764 84760 107605 88157 60849 61011 56650 62875 78582 104565 104078 90766
13657 90766 54800 46030 49935 40768 17628 -1611 -505 -9242 -13639 19099 16290 -2711 2764
13644 2764 1136 -8301 6200 -14008 -32590 -14621 -6753 -14593 -4233 -14453 -41974 -24968 -14417
13631a4417K0934q264k5650K352J9644k0666l7640j7399q511K8658N750L6014
13619a9195N2433K2202M5718N3721J2304j981m744l2566m6960k5710J1271n444
13607F1049m007N059J1770j3315j8853j7094j3325O674M852N540n226l842K2651
13594D1933J7910J8671K1902j4444l0588o557L93j5504k4521P546K3078K428j0010
13581C2237m305j9362k490L697J9318j706J5332J3300j2392K317k4282k5338O044
13568B370K2075L2045N573O354r909k6262J8584p189J5817N286k3077n850J8630
13555E4447L8252k23l303J5197p109n7062j4814j3727p058J4081j8768q844R963
13542A032P167o312j4519r748J6323j612N671L39k0683L4186J9043j0406n017
$$ plain form
13631 -14417 6517 -1747 -27397 -25045 -5401 -26067 -63707 -81106 -89617 -60959 -55209 -19195
13619 -19195 33238 55440 101158 154879 167183 165202 160458 127892 80932 55222 66493 61049
13607 61049 57042 62101 73871 60556 41703 24609 11284 17958 22810 28350 23124 19282 41933
13594 41933 59843 78514 100416 85972 55384 48827 49220 33716 9195 16741 39819 42247 32237
13581 32237 27932 8570 6080 9777 29095 27389 42721 56021 43629 45946 21664 -3674 2370
13568 2370 24445 56490 62063 68417 58508 32246 50830 43641 59458 64744 41667 35817 54447
13555 54447 92699 92476 89173 104370 97261 40199 25385 11658 4600 18681 -87 -8931 1032
13542 1032 8199 1887 -12632 -22380 -6057 -7669 -1998 -1659 -22342 11844 30887 20481 15464
13529A5464O181K3119J9527k480j5660J7421q052k6317k5933j0108p478J3366
13517i50K9366j0666q728l87M3941J967N147k2063j1832o681o806n66J0520r106
13503A3156k3875L050L025L5877K0898l8457k7278K5521J2315j6576j0028M500
13491B128j1224J9658J567J4142K9491r957j9337M3537M4869k2858k8310j592
13479F2114l1829l4082O162K7741K4661P695J213j6175O274J6481l411p197J22
13466E9769k9703J2704K2976L8528o476l6231R641J4611K483j854L0625K3709
13454A40782L1789K6344Q6265J50546J84428K67523K97156K61848K04681J21118
13444A772480N054j33972k30217k84176k53881j69077j83055j43757p4295p6893
$$ plain form
13529 15464 21645 44764 64291 61811 46151 63572 55520 29203 3270 -6838 -14316 -950
13517 -950 28416 17750 9022 8635 52576 54543 59690 37627 25795 19114 12308 11742 22262 13156
13503 13156 -10719 -7669 -4644 31233 52131 13674 -13604 11917 24232 7656 -2372 2128
13491 2128 -9096 10562 12129 26271 55762 45805 26468 70005 114874 92016 63706 62114
13479 62114 30285 -3797 2365 30106 54767 62462 63675 47500 53774 70255 66844 59647 59769
13466 59769 30066 42770 65746 104274 97798 61567 71208 85819 88302 86448 117073 140782
13454 140782 172571 198915 285180 435726 620154 887677 1184833 1446681 1651362 1772480
13444 1772480 1777534 1643562 1413345 1129169 875288 706211 523156 379399 305104 228211
13434B28211k7933l1463k3999l1111q315K801J9103J5592q218m4490m384L0690
13422A16484k9718j6708O587k9037j2497K4370K2428m087m3094k9701J787j1316
13410d502k8679O937L4507L481n735o45k0864l77N216o353j3989K4007O258K2739
13396B2001l9381L484k458j4738j5679J9211M4380R562j370M112q014j1801j4202
13383d893L579j9696j5435j4423N1493N5566j0612k6991J3192r462l9717o768
13371b4167O178J1056j8681J6100K7606j8695j880K8790k776j5922L596N49k047
13358I707l66l181j2266N196O142J213m14l2890n183n574J0120L1548L582l4349
13344b6715k4184o961J6658K3503m041J6209L5270j5967k6524Q3l25K2393l399
$$ plain form
13434 228211 200278 168815 144816 113705 105390 108191 127294 142886 134668 90178 85794 116484
13422 116484 86766 70058 76645 47608 35111 59481 81909 77822 34728 5027 6814 -4502
13410 -4502 -33181 -26244 8263 11744 6009 5364 -15500 -15877 -10661 -17014 -31003 -6996 -738 22001
13396 22001 -17380 -13896 -16354 -31092 -46771 -27560 16820 26382 25012 29124 21110 9309 -4893
13383 -4893 -1314 -21010 -36445 -50868 625 56191 45579 18588 31780 22318 -17399 -24167
13371 -24167 -17989 -6933 -25614 -9514 18092 -603 -2483 26307 23531 7609 11205 11754 9707
13358 9707 9341 6160 -6106 -910 5232 6445 6031 -26859 -32042 -37616 -27496 4052 7634 -26715
13344 -26715 -50899 -57860 -41202 -17699 -21740 -5531 29739 13772 -12752 -12669 -12994 9399 6000
13331F000r589k5615k2127k893M653L2979K8882P716o13K5899k1184r771n546
13318H791M200K1116k0840k0210o565N016K447J1810M0966o675m2836J3L4507
13305C1740R209j8586L856q396P67J2512J2624N532k3399J0607j1007Q988J6573
13292E1020M979r921J331n4490j0500M735R580N989j5275K2082J4214P090j4734
13279A6100J6434j9235k0881j3235P43j1734p8j0170m204J1442K8115N631j7741
13266a8813J5180N0117m570l4261l3424j8993j6192N1629n508J5381K237o211
13254c428L23O404J042P473j3780q455J1827O585j456j5190J6952K0258N4j5174
13240A3435R386K4657O009q407k138N810q716k7587J197L4958k793O983j2801
$$ plain form
13331 6000 -3589 -29204 -51331 -54224 -49571 -16592 12290 20006 19393 45292 24108 14337 8791
13318 8791 12991 34107 13267 -6943 -13508 -8492 -6045 5765 46731 40056 -2780 -2767 31740
13305 31740 40949 22363 26219 17823 18590 31102 43726 49258 25859 36466 25459 34447 51020
13292 51020 55999 46078 47409 -7081 -17581 -12846 -3266 2723 -12552 9530 23744 30834 16100
13279 16100 32534 13299 -7582 -20817 -20074 -31808 -31886 -42056 -46260 -34818 -6703 -1072 -18813
13266 -18813 -3633 46484 41914 7653 -25771 -44764 -60956 -9327 -14835 546 2783 -3428
13254 -3428 -3105 3299 4341 11814 -1966 -10421 1406 7991 6535 -8655 8297 28555 28609 13435
13240 13435 22821 47478 53487 45080 42942 48752 40036 12449 13646 48604 45811 52794 39993
13227C9993m8566j7219q13j0680J8191J8305m881k8190M264J7571j1040K0312
13215b753m252k0048K7949L2411l058j6401j5691l539m558K8157n342J2847L1422
13202E7144m1786j0195P422K3085m256j58M527k4971R362j5320m64j8369P559
13189f420K48J3946p198m625K4529K358j1064J6178n68k1439j4592J2427j9803
13176a6023K0754J0965L237l503j5968J824K6684J0789l2220j2393J9684J1840
13164B5670M218k0747m707J7681o904K199j5951j5783R557J8126J2266o73j3854
13151A1098j4078J329j2956j4052K7137J8996N5278R700j7571p703j2286j9272
13139B5620k461O579k400J8052n142P607j5354k245k1542j3246M2677K3744m2464
$$ plain form
13227 39993 -8573 -25792 -26605 -37285 -19094 -789 -5670 -33860 -29596 -12025 -23065 -2753
13215 -2753 -7005 -27053 896 33307 30249 13848 -1843 -5382 -9940 18217 12875 25722 57144
13202 57144 15358 5163 12585 35670 31414 31256 35783 10812 20174 4854 4390 -13979 -6420
13189 -6420 -6172 7774 576 -4049 20480 22838 11774 27952 27384 5945 -8647 3780 -16023
13176 -16023 4731 15696 18933 15430 -538 1286 27970 38759 6539 -5854 13830 25670
13164 25670 29888 9141 4434 22115 15211 17410 1459 -14324 -4767 13359 25625 24952 11098
13151 11098 -2980 -1651 -14607 -28659 -1522 17474 72752 82452 64881 57178 44892 25620
13139 25620 23159 29738 27338 45390 40248 47855 32501 30256 8714 -4532 38145 61889 19425
13126A9425K026k6838j5585J2440K888N749j622J5054J861J0543o099m647j0760
13113D435o331j1062j1524J3752K1138o116L603R647J1368o356j1571n809J5257
13100B0431k6131k5627K132L2358J6867j898R29n810j1952o78K5032k89j4997
13087A0367j7552k1875L3788j974k1907m240n965O514k3046K2742L9471J634J8251
13074C6208l468l0169k9730J7056M4969l323J9118j4574j3812J2458k6943l598
13062D192J7030K0896m8740l3430o323J9667J5812J2934J1920l929j580m770n937
13049b258k9981q964J5617Q283N70m203j35j019J1250L01q964j7485p843R533
13035c5298j7365m723J4439M4984L3806j0038r752k742k2053k3532L1128J5879
$$ plain form
13126 19425 21451 -5387 -20972 -8532 -5644 105 -1517 13537 15398 25941 19842 15195 4435
13113 4435 -1896 -12958 -24482 -10730 10408 4292 7895 17542 28910 22554 10983 5174 20431
13100 20431 -5700 -31327 -29195 3163 20030 18132 19061 13251 1299 621 25653 25364 10367
13087 10367 -7185 -29060 4728 2754 -19153 -23393 -29358 -22844 -45890 -23148 16323 17957 36208
13074 36208 32740 2571 -27159 -10103 34866 31543 50661 36087 22275 34733 7790 4192
13062 4192 21222 42118 -6622 -40052 -46375 -26708 -10896 2038 13958 10029 8449 3679 -2258
13049 -2258 -32239 -41203 -25586 -17303 -16733 -20936 -21071 -22090 -10840 -10539 -19503 -36988 -44831 -35298
13035 -35298 -52663 -57386 -42947 2037 35843 25805 16053 13311 -8742 -32274 -1146 14733
13023A4733j5703K1770K4499k2493j8146M2794l471k2301j5757k2629J4341L8615
13011C6252L4314N022j7482l1269m1345j7186K723j1214M2829K3929j2488k4214
12999a0129k6325O549Q486J6959K2441J5607l2478k6992K753J2000K6286O108
12987B1265J6547K778J0715J7097J4744J3202n667l3354j6873k4595j1933J2528
12975A6454J6223J1805r990k8667M364R36M059L3071k913l2750p662J5637J288
12962B1855K1086M939j2587j7803m25J4075q140j9003J3124J7977Q208j8749j9739
12949D818o707K4544K1086q125j4685N145k3588q451o733j5289J8678K8044j2666
12936F071L4710N456k0149J1048K017k2870j5289K2197j1853k8275K3780K2589
$$ plain form
13023 14733 -970 20800 45299 22806 4660 47454 43983 21682 5925 -16704 -2363 36252
13011 36252 70566 75588 58106 26837 -14508 -31694 -28971 -40185 2644 26573 14085 -10129
12999 -10129 -36454 -29905 -21419 -4460 17981 33588 1110 -25882 -23129 -11129 15157 21265
12987 21265 37812 40590 51305 68402 83146 96348 90681 57327 40454 15859 3926 16454
12975 16454 32677 44482 34492 5825 10189 11125 15184 48255 45342 12592 4930 20567 21855
12962 21855 42941 47880 35293 17490 17065 31140 23000 3997 17121 35098 43306 24557 4818
12949 4818 -1889 22655 43741 35616 20931 26076 2488 -5963 -12696 -27985 -9307 18737 6071
12936 6071 40781 46237 26088 37136 39153 16283 994 23191 11338 -16937 6843 29432
12924B9432J5180L445K196N430K840R58k752J914J5168q945N383J8255p193j2162
12910F9149j716M823j2807j7846L785O793k430r502j1107j1937j1255N898J5732
12897B7580k7962r338K1963K930n331k519k324K3262J0773j572n061r151q204
12884A5046k5632l3784m5424M321K2284J3394j4000K6774P467m2109K131L9097
12872c0435J3518j3168n418J0716K4343J7405R508K205l3889l9621K6680J3810
12860d346J5323P399J2870j3391M707k6304k2633N2L4078j0321j0165K891j123
12847a0963J7793j6536q990K2773J341j8250Q198N5400L4941k555j2967l9704
12835C0481j7058Q122k1701j0785J459K5607r630j8226R233J0524q48j224k664
$$ plain form
12924 29432 44612 48057 50253 55683 58523 59481 56729 58643 73811 64866 70249 88504 81311 69149
12910 69149 67433 72256 59449 41603 45388 52181 49751 40249 29142 17205 5950 11848 27580
12897 27580 -382 -9720 12243 15173 9842 7323 4999 28261 39034 37462 32401 23250 15046
12884 15046 -10586 -44370 -89794 -85473 -63189 -49795 -63795 -37021 -29554 -71663 -69532 -30435
12872 -30435 -16917 -30085 -35503 -24787 -444 16961 26469 28674 -5215 -44836 -18156 -4346
12860 -4346 10977 18376 31246 17855 22562 -3742 -26375 -26323 7755 -2566 -12731 -9840 -10963
12847 -10963 6830 -9706 -18696 4077 5418 -12832 -4634 50766 85707 83152 70185 30481
12835 30481 13423 21545 -156 -10941 -9482 16125 6495 -11731 -2498 8026 7178 5954 3290
12822C290M918N889M0830J8870k3767j4574k0697q986q465O434J3082K3226N33
12809D0583k4239l1309j055M5615l159j1625j0098L7295k8737j2885o79O322j7315
12796a1286J7196p266J574m841l5311M010R461K5498J9913j9269K7299L5094k5620
12783C6452j5351K5049p224J598j2183l1178k8170J5524O315j8569M5815Q220
12771B6298k0060l860j2355N517J6735p445J1294j3954l1387k679k765j9305J758
12758e2208K2043N3357R371q546j9129r121j517n238Q965q372k4039m03K0167
12745a4670L789j1850j419k715p729j8947J1192L9209Q060q592o554J3012J4081
12732A6867J5554k0515j3925j0287R173J9683j9437l429K5739J9365j8802j6913
$$ plain form
12822 3290 8208 14097 54927 73797 50030 35456 14759 5773 -2692 3742 16824 40050 40583
12809 40583 16344 -14965 -16020 29595 26436 14811 4713 42008 13271 386 -293 6029 -11286
12796 -11286 5910 -1356 218 -4623 -39934 -35924 -26463 -965 18948 -321 26978 62072 36452
12783 36452 21101 46150 38926 40524 28341 -2837 -31007 -15483 -9168 -27737 18078 26298
12771 26298 6238 2378 -9977 -4460 12275 4830 16124 2170 -29217 -31896 -34661 -53966 -52208
12758 -52208 -30165 23192 32563 24017 4888 -4233 -5750 -10988 -2023 -10395 -34434 -34837 -14670
12745 -14670 -10881 -22731 -24150 -26865 -34594 -53541 -42349 -3140 4920 -3672 -10226 2786 16867
12732 16867 32421 11906 -2019 -12306 -3133 16550 -2887 -6316 19423 38788 19986 3073
12720C073R738j1572N900P121j948P223j1485j0626J3263K3791j0000k9770l6212
12707d1504q685J8393K0558J9959J198j7425j7341J0950N819K254p922o066k2446
12694d2258M771Q322J0986K1529K5520K5928j1988J2633j3425m4492j9538J0756
12682a1256n7k2750j7912k1525J7095K5412l732j1586K2701j4819P190J3021J51
12669a8067K2676N341l6591j9244K7994K6867K467n082P75K4969N405P493m4222
12656G81J661J8518J4999m003J3726M554k6872j4513q186L1072J5751k1948p493
12643A8047J536O288Q487J1858j673j7185Q625k5404k7595Q828R547q55O179O329
12629A3012l5025j55J7146k477l0713k0397J4298j4896J1151M0261L2887j2550
$$ plain form
12720 3073 12811 1239 7139 14260 12312 19535 8050 -2576 10687 34478 24478 -5292 -41504
12707 -41504 -50189 -31796 -11238 8721 9919 -7506 -24847 -13897 -8078 -5824 -13746 -19812 -42258
12694 -42258 -37487 -29165 -18179 3350 28870 54798 42810 55443 42018 -2474 -22012 -11256
12682 -11256 -11313 -34063 -51975 -73500 -56405 -30993 -34725 -46311 -23610 -38429 -31239 -18218 -18067
12669 -18067 4609 9950 -26641 -45885 -17891 8976 11443 6361 7136 32105 37510 45003 781
12656 781 2442 20960 35959 31956 45682 50236 23364 8851 665 31737 47488 25540 18047
12643 18047 19583 25871 34358 46216 44543 27358 35983 10579 -17016 -8188 1359 504 6683 13012
12629 13012 -22013 -22168 -5022 -7499 -38212 -58609 -44311 -59207 -48056 -7795 25092 12542
12617A2542k8473L025J6905q456O558J5428K074L00P393j1858N464P158j0468
12604A7592k2003k21n40j6234J2988K6891J4162K795o011J284k5973k3798j476
12591b0544K4143J1469M86k253n774J653L9480R076m4407k7957j3791k9168j6477
12578g4064K6169P725P178j249k348N908M981K0666M5331J1840L013o862k5534
12565B2754L030k9798l6070J814K6955k5271k558J9864J976J3904M730N248p157
12552e79K8762O16j3480j5326r040Q417j1248k2233o39J2552J541K5416k546K703
12538D916q878P686j6239r689K9710J8657J3654j3247j3181l0222l6684K46K4591
12525b8680K2702N207J1473n672o467M293P215l5059j0538O411K8021j3705O268
$$ plain form
12617 12542 -15931 -12906 3999 -4457 2101 17529 19603 19903 27296 15438 20902 28060 17592
12604 17592 -4411 -4632 -5172 -21406 -8418 18473 32635 35430 29419 30703 4730 -19068 -20544
12591 -20544 3599 15068 15554 13301 7527 9180 48660 57736 13329 -14628 -28419 -57587 -74064
12578 -74064 -47895 -40170 -32992 -34241 -36589 -30681 -25700 -5034 40297 52137 55150 48288 22754
12565 22754 25784 -4014 -40084 -38270 -11315 -36586 -39144 -19280 -17304 -3400 1330 6578 -579
12552 -579 28183 28799 15319 -7 -9047 -630 -11878 -34111 -34750 -22198 -20657 4759 2213 4916
12538 4916 -3962 3724 -12515 -22204 7506 26163 39817 26570 13389 -16833 -53517 -53271 -28680
12525 -28680 -5978 -771 10702 5030 -1437 2856 10071 -24988 -35526 -29115 -1094 -14799 -8531
12512h531K5539P847j5143k2349l555J9914j1176j6680N082J3410K6333l054o470
12499A1167L960K5107P883k2060j7814j4614K03M3045l949l2137l2573k7457M709
12486e4530K5526P111j590K3156J2886K392K0538j879k733M245j5566k6314J6728
12473I970J8668m004q843j2601l2609J379k0166J5561J4181J3277M6557M6368
12461H7738j3632m8188j1304J9448K9820N3k9424k4007m553J6332j4800l8732
12449c1249K3484K6716J0668k8291J3633q860j9519j2376l2706J4163L20J0076
12437c3941K5961J3605j7300k4601j0395K0546J0557j401K5226j8127J8729N342
12425A4201q571j9753k0813m457P498N470n11J2700j1066P23K3540P873N044J0609
$$ plain form
12512 -8531 17008 24855 9712 -12637 -16192 3722 -7454 -24134 -19052 -5642 20691 17637 11167
12499 11167 15127 40234 48117 26057 8243 -6371 -6168 36877 32928 791 -31782 -59239 -54530
12486 -54530 -29004 -21893 -23483 -327 12559 14951 35489 33610 30877 35122 19556 -6758 9970
12473 9970 28638 24634 15791 3190 -29419 -28040 -48206 -32645 -18464 -5187 41370 87738
12461 87738 74106 25918 14614 34062 63882 63935 34511 10504 5951 22283 7483 -31249
12449 -31249 -7765 18951 29619 1328 14961 6101 -13418 -25794 -58500 -44337 -44017 -33941
12437 -33941 -7980 5625 -11675 -36276 -46671 -26125 -15568 -16969 8257 -9870 8859 14201
12425 14201 5630 -14123 -34936 -39393 -31895 -26425 -26936 -14236 -25302 -24579 -1039 6834 11878 22487
12411B2487j8709m6427O447L7242j4056j4097l17K3529J2287k3842m925K8346
12399G965J402j326K0053p333k0179j1358j1084M65J2255L7137K861j4651j6434
12386b27j0097N517j1035j0816N048K4481K7137j4033M404m834l929L5417R12
12373D7945n5475k0584J8547j2321p556M197O399M0470J4008J2649j3287k8181
12361F811J888j2666j982K4359j2827r576L3157r72k5474k4444m951N260K3512
12348B095P236P15J6792j8390m1171J961R706j283L7231M334k128m790K1792K390
12334C6490n73m5693k5106q887J6841K6298L3877k1924p378Q001J9765p684j6822
12321G205m458K9670j8757l7858l4998J0723J4563J9437m176R219K4868j8977
$$ plain form
12411 22487 3778 -42649 -36202 1040 -13016 -27113 -27430 -3901 8386 -15456 -20381 7965
12399 7965 9367 8041 28094 20761 582 -10776 -21860 -21395 -9140 27997 30858 16207 -227
12386 -227 -10324 -4807 -15842 -26658 -21610 2871 30008 15975 20379 15545 11616 47033 47945
12373 47945 -7530 -28114 -9567 -21888 -29444 -25247 -18848 21622 35630 48279 34992 6811
12361 6811 8699 -3967 -5949 18410 5583 -3993 29164 28192 2718 -21726 -26677 -21417 2095
12348 2095 9331 10046 26838 8448 -32723 -30762 -21056 -22339 14892 19226 17098 12308 34100 36490
12334 36490 35917 -9776 -34882 -43769 -26928 -630 33247 11323 3945 11946 31711 24027 7205
12321 7205 2747 32417 13660 -24198 -59196 -48473 -33910 -14473 -18649 -9430 15438 -3539
12309c539l1644J3076K7439l2216j0230J0505j7089R662P894j916M916R887K1855
12296H600n30l6473j2343K3727p149j713l6519j622J1942K8108L2234J8247K2255
12283D8764K509k1247l6869l1352K1165O0389R752k3499m0626o347O391k8384
12271c9354m0143o47L9125L5079J5911M6480J8055k8764m1341n487j0197M601
12259f682j3356r725M224l892j4078j1210o84K2553M2931r495k2795m6412J3579
12246e5042L6037M7037j1930p945J2080r554O837L0130k7004k5532J5108J8571
12234B8793J2876l445p337j3739k1121R231J7822J3208m740j8144j6066j3318
12222a5980J043J779j3267P802K4200K5488q228k7750J3039L9121K5311j062j1023
$$ plain form
12309 -3539 -35183 -22107 5332 -26884 -37114 -26609 -43698 -34036 -26142 -28058 -23142 -13255 8600
12296 8600 8070 -28403 -40746 -17019 -24168 -25881 -62400 -64022 -52080 -23972 8262 26509 48764
12283 48764 51273 30026 -6843 -38195 -17030 43359 53111 29612 -11014 -17361 -10970 -39354
12271 -39354 -79497 -80144 -41019 -5940 9971 56451 74506 45742 4401 -1086 -11283 -6682
12259 -6682 -20038 -29763 -25539 -29431 -43509 -54719 -55403 -32850 10081 586 -22209 -68621 -55042
12246 -55042 -19005 28032 16102 8157 20237 10683 17520 47650 20646 -4886 10222 28793
12234 28793 41669 38224 30887 17148 -3973 5258 23080 36288 31548 13404 -2662 -15980
12222 -15980 -14937 -13158 -26425 -18623 5577 31065 22837 -4913 8126 47247 72558 71496 60473
12209F0473k2412p107k2084k965J0807K3755J4459n4429m0601j0650k3222O867
12197f7109M602J7322L3007r622k6249J3561K3705N362J6108J240L732j493j0981
12184C185P335L536j2828j1846O941L05L9716j615l7940l2090K9120P472j0577
12171i286k1220R904m094k3135r742J6511K9217l4241q06O108O859j0627N131
12158c9421J754J8690K1300l138j747j3060J3984L8515O41N934j9413q794J2880
12145B8125j1149j8978J1677P431p083j9509j9694q121K2665L2535K9879j7575
12133C0203m6098j0963K3995L3l1183p170k1901j4087M2231K5831M836j2452Q696
12120h029J2408n982p839k7508j8490r931J3755n808L3111M4968Q827r838K0053
$$ plain form
12209 60473 38061 30954 8870 5905 16712 40467 54926 497 -40104 -50754 -73976 -67109
12197 -67109 -62507 -45185 -12178 -21800 -48049 -34488 -10783 -5421 10687 11927 15659 14166 3185
12184 3185 10520 14056 1228 -10618 -3677 -3372 36344 34729 -3211 -35301 -6181 1291 -9286
12171 -9286 -30506 -20602 -24696 -47831 -57573 -41062 -11845 -46086 -46892 -40784 -33925 -44552 -39421
12158 -39421 -37667 -18977 2323 -815 -2562 -15622 -1638 36877 37518 43452 24039 15245 28125
12145 28125 16976 -2002 9675 17106 10023 -9486 -29180 -37301 -14636 17899 47778 30203
12133 30203 -15895 -26858 -2863 -2830 -34013 -41183 -63084 -77171 -34940 -9109 -4273 -16725 -8029
12120 -8029 4379 -1603 -9442 -36950 -55440 -65371 -51616 -57424 -24313 20655 29482 19644 39697
12107C9697k2028k4130n1465p697L2264O353L207J3252o830P94K4157K6J2852
12094B0452K3476n931k4414m1465J198p705k4547J9657M1762L0962p039P257k6497
12081G166j0519L485L0115J6010j4297k4870q793k4901q634k984J6585J0743K5590
12068A4696j7684l0469J113N600P22Q782K3609j2086j9535L95M572n63L2507p825
12054C834K7014J0779l9289l3998J8942K9989K054j8690j9464k5514K568P017
12042c4758J0183K3547l305K7669K9041K175k8658l5613j5537j6140j5763q150
12030f5309N295M243J3381J0466j1187N933J0724K1232J7257j381J4019K5j6905
12017G793K2328O054k9603k0310o60J5736J9213r440j2827Q028P187J6531k1163
$$ plain form
12107 39697 17669 -6461 -57926 -65623 -33359 -27006 -23799 -10547 -17377 -16583 7574 7600 20452
12094 20452 43928 37997 13583 -27882 -26684 -34389 -58936 -39279 2483 33445 26406 33663 7166
12081 7166 -3353 132 30247 46257 31960 7090 -1703 -26604 -35238 -38222 -21637 -10894 14696
12068 14696 -2988 -33457 -32344 -26744 -26022 -17240 6369 -5717 -25252 -24857 -20285 -20848 11659 3834
12054 3834 30848 41627 2338 -31660 -12718 17271 19325 635 -18829 -44343 -41775 -34758
12042 -34758 -24575 -1028 -4333 23336 52377 54552 25894 -9719 -25256 -41396 -57159 -65309
12030 -65309 -60014 -55771 -42390 -31924 -43111 -37178 -26454 -5222 12035 10654 24673 24698 7793
12017 7793 30121 36175 6572 -13738 -14398 1338 20551 11111 -1716 6312 13499 30030 8867
12004H867j1433K6051K224j1391j4039j3364J3927m286j5233R10l4305K8317K0112
11991c643L0001j3371k2533n487J4871l7022r068L6720l883N102o509L1786M478
11978B1442l9678r585L1876J1023j9455m506n009l1998j3807K0771K0463N000
11966a3463n458o740k594k1615Q957K4938N638j1254M611j9426O871K6686o452
11953i301O855P451J0731K1813k1137l6284q826j9044L789J1822R556j0236Q461
11940b4350L2912p930J647J5417k1730l6393O275K7818N68J48K7238L2j5829l1840
11926b6017r892K1794k5275j6565j1057M638P901k1973k70L8496L0598j4121o891
11913b8634J1779L5848N366k5795k5719K02J9568K9896j921M248m6891l4332K9752
$$ plain form
12004 8867 -2566 23485 25709 14318 279 -13085 842 -3444 -18677 -17767 -52072 -23755 -3643
11991 -3643 26358 12987 -9546 -15033 -162 -37184 -46252 -9532 -13415 -8313 -14822 16964 21442
11978 21442 -18236 -27821 4055 15078 -4377 -8883 -13892 -45890 -59697 -38926 -18463 -13463
11966 -13463 -18921 -25661 -28255 -49870 -40913 -15975 -10337 -21591 -16980 -36406 -29535 -2849 -9301
11953 -9301 -2446 5005 15736 37549 16412 -19872 -28698 -47742 -43953 -32131 -22575 -32811 -24350
11940 -24350 8562 632 2279 17696 -4034 -40427 -34152 -6334 -5766 -5618 21620 21652 5823 -26017
11926 -26017 -35909 -14115 -39390 -55955 -67012 -62374 -54473 -76446 -76716 -38220 -7622 -21743 -28634
11913 -28634 -16855 18993 24359 -1436 -27155 -26953 -7385 22511 20590 24838 -22053 -56385 -26633
11900b6633J8987K5892p991l3644P436K1545K338k2204P654n836m05J883k6160
11887c7138J0034J589N652K3167J0420m794k532J493p362J083R267N873l810j7287
11873d345p170M8140N583Q83j0454k0746j2212R185j0955j0233l6490K9711K1406
11860B303j5570K5757L8736J5201p411j7071l0321J116J1632m9675j1939J4206
11848b3036P069p514k0825p914Q147n942J6209J2185N216j281j2161N425J0928
11835a3494j8029K2515J5479j2059M963j0272N159L1673l6305n2149J2389K0522
11823b9608p294R5q482o938J9538J5579j510J232j4022L3140K5874j0357m1766
11810b4519j3773j4689Q940K0060o729j4459l0991j192O769J3955J9931p607K0
$$ plain form
11900 -26633 -7646 18246 10255 -23389 -15953 5592 7930 -14274 -6620 -12456 -12861 -10978 -37138
11887 -37138 -27104 -25515 -19863 3304 13724 8930 6398 7891 529 1612 10879 16752 12942 -4345
11873 -4345 -11515 36625 42208 43091 32637 11891 -321 8864 -2091 -12324 -48814 -19103 2303
11860 2303 -13267 12490 51226 66427 59016 41945 11624 12740 24372 -25303 -37242 -23036
11848 -23036 -15967 -23481 -44306 -52220 -44073 -50015 -33806 -21621 -16405 -17686 -29847 -24422 -13494
11835 -13494 -31523 -9008 6471 -5588 -625 -10897 -5738 25935 -10370 -62519 -50130 -29608
11823 -29608 -36902 -36807 -45289 -52227 -32689 -17110 -18620 -17388 -31410 1730 27604 17247 -24519
11810 -24519 -38292 -52981 -44041 -23981 -30710 -45169 -76160 -77352 -70583 -56628 -36697 -44304 -44284
11797d4284k849J6869j6505o595K7070L6023M127k1062k2848J8065K3612M2965
11785E4588r719n5198k3605J9641K3995J0058J5944m2343k8921p429J1293p564
11773c9260J7108J5047j4619o909J431J2872j6769r303j1386M5816P442l774O143
11760C839k3740l4754j4588L484K363J0183R430N159K5239J9593j70J6155k5368
11747c175l0471K4843M9852l2140l7310k4278P968L3803j7413j5710O162p85J3941
11734b4713k1417j0620K4226J6614M362o277p194P495M238r319j9288k2342l882
11721f8117K859J8009M1774M8016o408k7151m823J0120q518j2496l1850J1550
11709b7035J298K775n197k6345J747J0085Q339P325j2935L073o396R75J6475J0684
$$ plain form
11797 -44284 -47133 -30264 -46769 -53364 -26294 9729 13856 -7206 -30054 -11989 11623 54588
11785 54588 44869 -10329 -33934 -14293 9702 19760 35704 -6639 -35560 -42989 -31696 -39260
11773 -39260 -22152 -7105 -21724 -28633 -27202 -14330 -31099 -40402 -51788 -5972 1470 -2304 3839
11760 3839 -19901 -54655 -69243 -65759 -63396 -53213 -43783 -38624 -13385 6208 6038 22193 -3175
11747 -3175 -33646 -8803 41049 8909 -28401 -52679 -44711 -10908 -28321 -44031 -37869 -38654 -24713
11734 -24713 -46130 -56750 -32524 -15910 -11548 -17825 -25019 -17524 -13286 -22605 -41893 -64235 -68117
11721 -68117 -65258 -47249 -5475 42541 36133 8982 4159 14279 5761 -6735 -38585 -27035
11709 -27035 -25737 -22962 -28159 -54504 -52757 -42672 -34333 -27008 -39943 -36870 -43266 -42291 -25816 -15132
11695a5132N606j9386j0237l270k2378J0068L0621P819K5261J5762j0710j030
11683A2994q5m76j4236r386p59m830P565M1908J4758l6137o493L426r437j0318
11669a1506k6913J4072K5608J3820r119j2547M115l398j6767j050p79K28K996
11656b1240J0910O416L785k359p872j8425l814Q261J5437K3129j0921l217j148
11643a058J8771M4007j204l1193l3237k2398k5100q783k597P665L4438J2675L2455
11630B4441k2854j6001K6936P222j7743k380k3369k2116n889j0891R105L0747
11618b2792K878j6916N711k0149J3509K5713N071p580J6580J2259J8074o6818
11606c4460k4282K7481K6754j6620P045J2386J5249j2479j4966J3222n546o349
$$ plain form
11695 -15132 -9526 -28912 -39149 -42419 -64797 -54729 -24108 -16289 8972 24734 14024 12994
11683 12994 12909 12433 -1803 -11189 -11948 -16778 -9213 32695 47453 11316 4823 8249 -1188 -11506
11669 -11506 -38419 -24347 1261 15081 5962 -6585 -2470 -5868 -22635 -23685 -24464 -24236 -21240
11656 -21240 -10330 -3914 -129 -2488 -10360 -28785 -32599 -24338 -8901 14228 3307 90 -1058
11643 -1058 17713 61720 60516 29323 -3914 -26312 -51412 -60195 -62792 -55127 -20689 -8014 24441
11630 24441 1587 -14414 12522 19744 2001 -379 -23748 -45864 -51753 -62644 -53539 -22792
11618 -22792 -19914 -36830 -31119 -51268 -37759 -12046 -6975 -14555 2025 14284 32358 -34460
11606 -34460 -58742 -31261 -4507 -21127 -14082 -1696 13553 1074 -13892 -670 -6216 -12565
11594a2565L8316j5183l0784L643L8M129J2807j0626k0754j0696K84R47N469K8456
11580f519J2861M147K9858K856j0950l6545n0260J1819L959j4705R940J7249J8464
11567g826J8421L900r742k0300k0855j9562n298R306k831M153K5491J5302k8923
11554c8764J7109K5038J3088k173j4967j6758K2079K6529k742j855j8872k1491
11542a3779r236P087Q610J0840l434l0884r550J2796K4844Q037k1306k0952k0334
11529e7261R913m130P92L1181K7449r701k2874k1048r315L4687K4559O041l1396
11516b1103q45R450K684n8297j5351J6643J7052N5240K3031O969k7973N895K8651
11503D2046k3321R305L127J0136j3467k8367q90n857L411M533l352k5031k158
$$ plain form
11594 -12565 25751 10568 -20216 -16573 -16535 -12406 401 -10225 -30979 -41675 -41391 -40444 -34975 -6519
11580 -6519 6342 10489 40347 43203 32253 -4292 -54552 -42733 -38774 -53479 -43539 -26290 -7826
11567 -7826 10595 14495 4753 -15547 -36402 -55964 -61262 -51956 -54787 -50634 -25143 -9841 -38764
11554 -38764 -21655 3383 16471 14298 -669 -17427 4652 31181 28439 26584 7712 -13779
11542 -13779 -23015 -15928 -7318 3522 88 -30796 -40346 -27550 -2706 5331 -15975 -36927 -57261
11529 -57261 -47348 -51478 -50686 -19505 7944 -1757 -24631 -45679 -54994 -20307 4252 10293 -21103
11516 -21103 -21948 -12498 -9814 -68111 -83462 -66819 -49767 5473 28504 35473 7500 13395 42046
11503 42046 18725 28030 31157 41293 27826 -541 -1431 -7288 -3877 656 -2696 -27727 -29885
11490b9885n356k2199K693J5684J6658L0810k335p950r699M418k897K951J1042
11477C935l0078R556n975k5714J1739n925K2813J8137n85n691J579K3237K815
11464A9843k3187m0663o813K6118J161l1682O952J9158n114m2203K3720L7140
11452a5570R24L821j8058q068o876m707j2040K8826J9122M839J4529n423k5692
11439b4373p19J4268J4840J9945k9167j8669L241J4828N697M7j4645j0303j9110
11426d4120L988m790j6585K8090K9910K0044L105j7019K315J1032n61p93o208
11413H408n043K527J3139m1733J3949L3552J2860o955k7851j4978J1871K705m989
11400b538J416j4901J7743k0909J5868K8504j6251J5290n348l0317j3620J0507
$$ plain form
11490 -29885 -35241 -57440 -54747 -39063 -22405 8405 6070 -1880 -11579 -7161 -10058 -7107 3935
11477 3935 -26143 -16587 -22562 -48276 -36537 -42462 -19649 -1512 -2097 -7788 -6209 17028 19843
11464 19843 -3344 -44007 -50820 -24702 -23541 -55223 -48271 -29113 -34227 -76430 -52710 -15570
11452 -15570 -14646 -10825 -28883 -36951 -43827 -48534 -60574 -31748 -12626 -7787 6742 1319 -24373
11439 -24373 -25092 -10824 4016 23961 -5206 -23875 -20634 -5806 -109 -62 -14707 -25010 -44120
11426 -44120 -40132 -44922 -61507 -33417 -3507 16537 19642 2623 4938 15970 15409 14616 8408
11413 8408 3365 5892 19031 -22702 -8753 24799 37659 30704 2853 -12125 -254 2451 -2538
11400 -2538 -1122 -16023 1720 -19189 -3321 25183 8932 24222 18874 -11443 -25063 -14556
11388a4556k8608M401r947N2468M5989j740k8319l5445j3564l183L1999J1725
11376A1220l4419k6764J7151J5639j3053K1513J782k8753n14R056Q833k918j9086
11363d0313K285K5420L3123R947k3563K316K2547j0549k0145n919J7167J0076
11351B2392K369O918l1160K3586J9901m515k7039N171N471k1059j150J5835K342
11338A9062j1402j0195j0642J2163l5347n0440J5601K714J8128M8601J2015j6349
11326f091l190k5223j5953j2422m056J7953L4478L0766l314l041k6797k0352J5655
11313b1587N441K7665J4023R463j0994j0819J583j871l432j5739j2152o519J520
11300b3418K9926p682P961r018j8756n403N215l240j926Q018K1814r955n883M42
$$ plain form
11388 -14556 -43164 -38763 -48710 3758 49747 48007 19688 -15757 -29321 -32504 -505 11220
11376 11220 -23199 -49963 -32812 -17173 -30226 -8713 -6931 -35684 -36198 -27142 -18309 -21227 -40313
11363 -40313 -38028 -12608 20515 30462 6899 9215 31762 21213 1068 -4851 12316 22392
11351 22392 24761 31679 519 24105 44006 39491 12452 17623 23094 2035 885 16720 19062
11338 19062 7660 -2535 -13177 -1014 -36361 -86801 -71200 -68486 -50358 -1757 10258 -6091
11326 -6091 -9281 -34504 -50457 -62879 -66935 -48982 -14504 16262 12948 9907 -16890 -37242 -21587
11313 -21587 -16146 11519 25542 35005 24011 13192 14775 12904 9472 -6267 -18419 -24938 -23418
11300 -23418 6508 -1174 6787 -2231 -20987 -26390 -21175 -24415 -26341 -18323 3491 -6464 -12347 -11905
11286a1905p232k6596L5365J5960Q197n329j6086K740k1048j8995l2742K762M4498
11273c0411M5296M5431O835l1662l8524J5021M089q083J8674J4929M070k0047
11261B5618j6049l7242k5004M430P564o588l350O016J1082j4741k2668Q276L8748
11248b3908M5900k086p918k1850j6228N305P893M0748r945o846j6941J2832r587
11235b631r979P710J3433k199k2725j0292m560K8636K4619k924o759k976l4377
11222b5024j961R534l0112l9297J038L0556L2635J5240j0078j626q388J03J5318
11209a2062J0224p14k4820j9819L1117P778J6918m915J4186K59j9933k065K1184
11196A7338r12K8941J1026j4486j5955o915m112j6700r064l585R093K909l160
$$ plain form
11286 -11905 -19137 -45733 -10368 5592 13789 8460 -7626 -4886 -25934 -44929 -77671 -74909 -30411
11273 -30411 14885 60316 67151 35489 -3035 11986 16075 7992 26666 41595 45665 25618
11261 25618 9569 -27673 -52677 -48247 -40683 -47271 -50621 -44605 -33523 -48264 -70932 -62656 -23908
11248 -23908 21992 19906 11988 -9862 -26090 -20785 -12892 27856 17911 11065 -5876 6956 -2631
11235 -2631 -12610 -4900 8533 6334 -16391 -26683 -31243 -2607 22012 19088 12329 9353 -25024
11222 -25024 -26985 -17451 -47563 -86860 -85822 -55266 -22631 -7391 -17469 -19095 -27483 -27380 -12062
11209 -12062 -1838 -2552 -27372 -47191 -16074 -8296 8622 3707 17893 18152 -1781 -3846 17338
11196 17338 16426 45367 56393 41907 25952 19037 14925 -1775 -10839 -14424 -5331 -2422 -5582
11183e582O153j016j1115k2664j8987Q225p770q163O87J5695J5679J8567j6234
11170b6525r521N659M0422j8175k1305j1622J3256L4696n539k6338n963j1385
11158d2340j1704j5406J6989Q737k159J09j8100J4833N667j6856K3608K7563j6019
11145b5078L954N019K407P994k0589N002O701n308n40l139l5134K0696J7243J4595
11131f177K4792l979J2321J4852p477k966j9084M932o591K1476Q946l3976k4740
11118a7671n110J6227J5650J4191L608q495k3725l3453J2680L2812K0445l179
11106B3980j0010k1655p004L364J8055l611n116k4559J6809R425k0893l6181N620
11093e1776M1124L1840j2050l4739j6383K0417Q718P225J911M986j537M025k2974
$$ plain form
11183 -5582 571 -445 -11560 -34224 -53211 -44986 -52756 -60919 -60232 -44537 -28858 -10291 -26525
11170 -26525 -36046 -30387 10035 -8140 -29445 -41067 -27811 6885 1346 -24992 -30955 -42340
11158 -42340 -54044 -69450 -52461 -43724 -45883 -45774 -63874 -49041 -43374 -60230 -36622 -9059 -25078
11145 -25078 -21124 -16105 -13698 -5704 -26293 -21291 -14590 -19898 -20438 -23577 -58711 -38015 -20772 -6177
11131 -6177 18615 14636 26957 41809 34332 31366 12282 17214 10623 32099 41045 7069 -17671
11118 -17671 -22781 -6554 9096 23287 26895 18400 -5325 -38778 -26098 6714 27159 23980
11106 23980 13970 -7685 -14689 -11325 6730 3119 -1997 -26556 -9747 -322 -21215 -57396 -51776
11093 -51776 -10652 21188 9138 -25601 -41984 -21567 -12849 -5624 -3713 1273 -264 3761 -19213
11080a9213M25p771j7184J8169K5736k432N961J5784J295Q623k0250j4973K501
11067c329r306Q909J1206l4681j1966K1126O980k1213j6095J8801R951K5793J7814
11054B3990l613R892l4032N671O989j9428p216K9010j091j0383o479J1676K6977
11041C1963j5253j9224j6928M461K2451J7113m129O500j2883P293L2229K90m5304
11028H579j9139n986L265j120N860j1964k9871j180N682P934J2019P336n97J2172
11014g010J5350j557l002O749j2116k5114J255Q510O293j3148K0621j195j6845
11001b1209N017K3432j7083J7679Q383j5892o94J9439N835p323n696k3211j8206
10988b9529L914J8089L2801k8053p156m969j6292K1360n827p795K5870K3169k5691
$$ plain form
11080 -19213 -18788 -26559 -43743 -25574 162 -2270 3691 19475 20770 29393 9143 -5830 -3329
11067 -3329 -12635 -3726 7480 -27201 -39167 -18041 -11061 -32274 -48369 -29568 -19617 6176 23990
11054 23990 20377 30269 -3763 1908 8897 -10531 -17747 11263 10172 -211 -6690 4986 31963
11041 31963 16710 -2514 -19442 -14981 7470 24583 20454 26954 14071 21364 53593 53883 8579
11028 8579 -10560 -16546 -13281 -14401 -8541 -20505 -50376 -51556 -45874 -37940 -25921 -18585 -19182 -7010
11014 -7010 8340 6783 3781 10530 -1586 -26700 -25445 -16935 -10642 -23790 -3169 -4364 -21209
11001 -21209 -16192 7240 -9843 7836 16219 327 -367 19072 24907 17584 11888 -11323 -29529
10988 -29529 -25615 -7526 25275 -2778 -9934 -14903 -31195 -9835 -15662 -23457 2413 25582 -109
10975a09o634k221k05K3898k8812l3950j4428J1158J0649L4339j489m369J449
10962a0724L755R948O004l790k2954j0230K2837q735k3976j5053J3429L4688K166
10949b635j7586r032J3571J942P992Q459n888j0379K9964k086j5116J2266J4419
10936B5891q482l4840j7842j5690J9209M7037K8992k2743k9449j5076j6274J2260
10924b7007j8634K0665K9060k3789j2036N585K0053K7746r8k1169J2045j1400
10912A021k2701J668L943j1073K2125j244J511R610k8702j5337L3386R79j6770
10899b1584o372j7678K007J3965J5392J5272M844J7641l6564l4943L9721r37l237
10886a2473L7375K7204J807l3396l2102k1526j1031j1118J4510J701J0189J181
$$ plain form
10975 -109 -6743 -8964 -9169 14729 -14083 -48033 -62461 -51303 -40654 -6315 -7804 -12173 -10724
10962 -10724 -6969 2979 8983 5193 -17761 -27991 -5154 -13889 -37865 -52918 -39489 -4801 -2635
10949 -2635 -20221 -29253 -15682 -13740 -5748 2711 -3177 -13556 16408 14322 -794 11472 25891
10936 25891 17409 -17431 -35273 -50963 -31754 15283 44275 21532 -7917 -22993 -39267 -27007
10924 -27007 -45641 -24976 4084 -19705 -31741 -26156 -6103 21643 21545 376 12421 1021
10912 1021 -21680 -20012 -16069 -27142 -5017 -6261 -4750 4860 -23842 -39179 -5793 -4814 -21584
10899 -21584 -27956 -45634 -43627 -29662 -14270 1002 5846 23487 -13077 -48020 -8299 -9236 -12473
10886 -12473 24902 52106 53913 20517 -11585 -33111 -44142 -55260 -40750 -39049 -28860 -27679
10874b7679q777k301l5846J1366J2352M4381O03j351M847k1120P256L1089n398
10861I422m164k1274k4861J453J7195R326J8897j5374j1538o681J0918K1552J8102
10848B2973m203k4243L899j1717p203P407j720K3152M289P354k2604l889N1q042
10834a4496l2404J9588R654K888Q894J2112j5483m7076R377K7504N274K0981O009
10821A2822K9230J5862k5474j8657L270L90j1234j9690l5548j7914N420K2862
10809c8661L186J5726J6879j2659M112l536J2639k1388o615J8785O59J0584k0461
10796b0750k1392J3470K1500O982l5666J7798L9278q275P641Q542J1500l888l2445
10783D295p974J7741Q092j8778j0619j0645j1301j2546j8828L4909J1560k174
$$ plain form
10874 -27679 -36456 -38757 -74603 -63237 -50885 -6504 -5901 -7252 -2405 -23525 -16269 14820 9422
10861 9422 5258 -16016 -40877 -39424 -22229 -12903 5994 -9380 -20918 -27599 -16681 4871 22973
10848 22973 18770 -5473 -1574 -13291 -20494 -13087 -14807 8345 12634 19988 -2616 -6505 -6454 -14496
10834 -14496 -46900 -27312 -17658 -14770 -5876 6236 -9247 -56323 -46946 -19442 -14168 6813 12822
10821 12822 42052 57914 32440 13783 17053 17443 6209 -13481 -49029 -66943 -61523 -38661
10809 -38661 -35475 -19749 -2870 -15529 -11417 -14953 -2314 -23702 -30317 -11532 -10873 -289 -20750
10796 -20750 -42142 -28672 -7172 -190 -35856 -18058 21220 12945 20586 29128 40628 36740 4295
10783 4295 -3679 14062 22154 3376 -7243 -17888 -29189 -41735 -60563 -25654 -14094 -16268
10771a6268K3810n113m3918L340J4843j0926N460l869K6932K1751O047j8153k4219
10758b0283n360P228L3876J7298j562N959k2602j232K3412Q613k1338k5671L296
10745A634k778j2864l0810J3553N836J3402K1741k944k0583N340K4466J6150k5548
10732F595K0579j3524k3219p532J14K9145j3652K9344K1425k6658k0581L3534
10720C5570J6979k6795l8291J4900K5280O898r436j957r038q559J7074k0318j2059
10707i752k8122k2965j1726L5363J1280K2419L2845k0142k4999J4562J7947k137
10695A4573k9931j8830k4008L4973Q151j4664j2359K3823J6395j6480k2048R786
10683c0619N092k7548j118K475Q534J998j3351j0039J5447J0365K0838Q731j1177
$$ plain form
10771 -16268 7542 2429 -41489 -38149 -23306 -34232 -28772 -32641 -5709 16042 22089 3936 -20283
10758 -20283 -25643 -18415 15461 32759 31197 37156 14554 13322 36734 45347 24009 -1662 1634
10745 1634 -1144 -14008 -44818 -31265 -25429 -12027 9714 6770 -13813 -8473 15993 32143 6595
10732 6595 27174 13650 -9569 -17101 -16987 12158 -1494 27850 49275 22617 2036 35570
10720 35570 52549 25754 -12537 2363 27643 34541 25105 23148 14110 5551 22625 2307 -9752
10707 -9752 -37874 -60839 -72565 -37202 -25922 -3503 29342 9200 -15799 -1237 16710 14573
10695 14573 -15358 -34188 -58196 -23223 -15072 -29736 -42095 -18272 -1877 -18357 -40405 -30619
10683 -30619 -25527 -53075 -54193 -51718 -43184 -41186 -54537 -64576 -49129 -38764 -17926 -9195 -20372
10670b0372k450P937k9601k70p239J7027K2647O184K9291j946k0446j1178j5152
10657b5568K4514J2293l4809j1979J2369J5898K6905l739k2347l1202J6351K8179
10645F865J8886Q192O171k0037k8450O964j1179J301r924j2966P831P964N75P00
10631a7107k7732p734n325J8386J0332j4558j7810K3609K1497L964k634n252j5411
10618c5775L4837K3622l1745j2753K6569p712k4530j8708K0216J9232J9008K1408
10606C3669j8846j6389m1229Q050K2874R23k836l4767J7041Q115o06J3987J1998
10593A984K213R215R663l334q430r349O054p70N039j2395m7312m938J3453j5497
10579e4404P101L6084k3597r727J0699L2703K0145j0113j6280j1142j5802N692
$$ plain form
10670 -20372 -22822 -14885 -44486 -44756 -51995 -34968 -12321 -6137 23154 21208 762 -10416 -25568
10657 -25568 -1054 11239 -23570 -35549 -23180 -7282 19623 15884 -6463 -37665 -21314 6865
10645 6865 25751 33943 40114 20077 -8373 -1409 -12588 -11287 -21211 -34177 -26346 -18382 -17807 -17107
10631 -17107 -44839 -52573 -57898 -39512 -29180 -43738 -61548 -37939 -16442 -12478 -15112 -20364 -35775
10618 -35775 -938 22684 -9061 -21814 4755 -2957 -27487 -46195 -25979 -6747 12261 33669
10606 33669 14823 -1566 -42795 -34745 -11871 -10948 -13784 -48551 -31510 -23395 -24001 -10014 1984
10593 1984 4197 13412 23075 19741 11311 1962 8016 7246 12285 -110 -47422 -52360 -38907 -54404
10579 -54404 -47303 -11219 -34816 -44543 -33844 -1141 19004 8891 -7389 -18531 -34333 -28641
10567b8641K328l18N3916N703J7389o302m0569r855O383N729o767K0638j882k1281
10553c529m1862k7075K8002L3085j5760R611J6562O467j2766j7023K4699L4317
10541C4728Q748k7566l2496k6436J2437K046n2696k2962K6586K7322J5083K645
10529c2561N351M888o688J200N28J5187j1800l4349L689K3916L0634k8394k812
10516c1211L691j3982n08l583L901J517K7053P05Q394P297j904l0780k4768J3425
10502d0753P454J7973P678K2921P442J3546r89q381l405k7453k0468j9017q917
10489e2369M2330K6688r575r459N360N952r603k6213K782j2022L0509J5j6303
10476b1908l045j1501n087M0146L0741J4664j6838j533Q988p11j4383k0591j9298
$$ plain form
10567 -28641 -26313 -26631 27285 32988 50377 44075 3506 -6349 34 5763 -1004 19634 17752 -3529
10553 -3529 -45391 -72466 -44464 -11379 -27139 -17528 -966 5501 -7265 -24288 411 34728
10541 34728 43476 15910 -16586 -43022 -30585 -28539 -81235 -104197 -77611 -50289 -35206 -32561
10529 -32561 -27210 -22322 -29010 -27810 -27282 -12095 -23895 -58244 -54555 -30639 -5 -28399 -31211
10516 -31211 -27520 -41502 -42010 -45593 -41692 -40175 -13122 -12417 -4023 3274 1370 -29410 -54178 -40753
10502 -40753 -33299 -15326 -7648 15273 22715 36261 35272 26891 23486 -3967 -24435 -43452 -52369
10489 -52369 -10039 16649 7074 -2385 2975 8927 -676 -26889 -24107 -36129 -5620 -5605 -21908
10476 -21908 -24953 -36454 -41541 -1395 29346 44010 27172 25639 34627 33916 19533 -1058 -20356
10463b0356o116O00O290n504k8287J7747L8998r665l0017J6741N530k9607k3732
10450f7378l11Q487L6703r115p706Q679J5082L469j661L4150j9677n5198j6810
10437g1286j2458J3553L9054L1028L1909K3516k826j4719k3282k7281j2626J0350
10425a5068L6853j0702k4303j7483q793k9513k4472J5819M0663K8414j2654j6411
10413c7650j773L0179L045j5036K8596k0138J3048J2839m50N798j0790m8307M37
10400d0202M3430K2913j9796o593k2663k1110K280K659J3913J2711j8295n0L3514
10387B711j194j1126j6202J9240N481k380j3692o69N426o636r732J9437K1886
10374A2550J5546K5718j6090k1436k8838J6500L7659J4904k2185l3728L8447L3204
$$ plain form
10463 -20356 -26472 -25872 -19582 -25086 -53373 -35626 3372 -6293 -36310 -19569 -14039 -43646 -67378
10450 -67378 -67689 -59202 -22499 -31614 -39320 -30641 -15559 -12090 -13751 20399 722 -54476 -71286
10437 -71286 -83744 -70191 -31137 -109 31800 55316 52490 37771 14489 -12792 -25418 -15068
10425 -15068 21785 11083 -13220 -30703 -39496 -69009 -93481 -77662 -36999 -8585 -21239 -37650
10413 -37650 -39423 -9244 -6199 -21235 7361 -12777 271 13110 12660 18458 7668 -40639 -40202
10400 -40202 3228 26141 6345 -248 -22911 -44021 -41741 -39082 -25169 -12458 -30753 -30803 2711
10387 2711 1517 -9609 -25811 -6571 -1090 -3470 -17162 -17831 -12405 -19041 -28773 -9336 12550
10374 12550 28096 53814 37724 16288 -12550 3950 41609 56513 34328 600 39047 72251
10362G2251K9313o131L353J2400P575J1872M105N0372J8447J6736J9050M3385
10350B82728K4372Q3729J67298K75175L68241M44059M77583N35392N13860M41412
10340C613849K40528O5628q7605j22052l04649m78780n53640n07079m08341l39918
10330A117941k82586k40989j54924o8787o2070n5097k3283k4036j7540k1097k2219
10319A45313k3770r710J8058k8008j7213K4368J2339j3841l0462l7528j2493J406
10307B8459J9487J3571k8507k8184k7503J3196R652L3352M064k3514j02M6794
10295F0765L0833J1988k8050K873J7461J8030N740l140M17L2266J9309J7056j1954
10282A73594l0543k0454R86p640k5762n780M901k5341j7228L345J706o447M330
$$ plain form
10362 72251 101564 95433 98786 111186 118761 130633 134738 185110 203557 220293 239343 282728
10350 282728 307100 390829 558127 833302 1201543 1645602 2123185 2658577 3172437 3613849
10340 3613849 3854377 3920005 3832400 3710348 3405699 2926919 2373279 1866200 1457859 1117941
10330 1117941 835355 594366 439442 370655 308585 253488 230205 206169 188629 167532 145313
10319 145313 121543 111833 129891 101883 84670 109038 121377 107536 77074 39546 27053 28459
10307 28459 47946 61517 33010 4826 -22677 -9481 171 33523 37587 14073 13971 60765
10295 60765 91598 103586 75536 78409 95870 113900 119640 116500 116917 149183 168492 185548 173594
10282 173594 143051 122597 123583 115943 90181 84401 89302 63961 46733 50078 51784 45337 49667
10269D9667P61l1974j0869P099k4535K888k4206o703K2582M5091K0259j2452K363
10256C9971j0926l3927n4774l0215R432L8434K978P363N260p630L05o29j470o887
10242d2715O730K5121Q386J41J5234K6617o042k2429j2297J0861n588j709l1009
10229b8699K626J2680P891K8755J6597J7477k1977J5013q560l1760J4211O857
10217C1111k8943J3614j3161k1741R761j3185n196J1916K0177M110J7161K3914
10205D9538n022k8263k3248m011J972J1865K7006K8332j1477k7656k2601O360
10193B795J0910q949k2698J4106p17L9708Q066k3051l6347l0984K2044k541J9513
10180h145J7400J296L5950j2295j1699j3379k211j679k4311p423k677R327K9643
$$ plain form
10269 49667 50428 18454 7585 14684 -9851 -6963 -31169 -37872 -15290 29801 50060 37608 39971
10256 39971 29045 -4882 -59656 -89871 -80439 -42005 -39027 -31664 -26404 -34034 -33729 -34358 -35828 -42715
10242 -42715 -35985 -10864 -2478 -2337 12897 39514 33472 11043 -1254 9607 4019 2310 -28699
10229 -28699 -26073 -13393 -5502 23253 39850 57327 35350 50363 41803 10043 24254 31111
10217 31111 2168 15782 2621 -19120 -9359 -22544 -27740 -15824 4353 8463 25624 49538
10205 49538 44516 16253 -6995 -11006 -9034 2831 29837 58169 46692 19036 -3565 2795
10193 2795 13705 4756 -17942 -3836 -4553 35155 43221 20170 -16177 -47161 -25117 -27658 -8145
10180 -8145 9255 10551 46501 34206 22507 9128 6917 5238 -19073 -26496 -29173 -19846 9797
10167I797M0406K8384K712n284J1349q324k5304k404J2157K400m4695l4920l161
10154a6887J5361J4132j7717J2687K5909K7719k0917j5480J4081k0990j7923k41
10142b66J2382K1386m90K3431q157k1912k1023j5208P690K2905j8092j2132j1826
10129b1312n431J6829K7840k8475n61q664R617K4528j4407p922J6952K943m36
10116A1501P28K1697K3291k5292q345r168l3587j8039P256J6450K4798N520j681
10103A5129r219J0212M251J4781j23j1404k4299n745r770J1285R672Q5N674l3637
10089b3108n260p374k5557j3558n510K1353J4611J6682K7766J6488J6678O18k2352
10076A1477j0052Q975k5384j4192J5569M4941N542K6416K8047l5928J312P1280
$$ plain form
10167 9797 50203 78587 81299 76015 87364 79040 53736 51332 63489 65889 21194 -13726 -16887
10154 -16887 -1526 12606 -5111 7576 33485 61204 40287 24807 38888 17898 -25 -266
10142 -266 12116 33502 33012 56443 48286 26374 5351 -9857 -2167 20738 2646 -9486 -21312
10129 -21312 -26743 -9914 17926 -10549 -11110 -19774 -10157 14371 -36 -7958 8994 11937 11501
10116 11501 12229 33926 57217 31925 23580 14412 -19175 -37214 -29958 -13508 11290 16810 15129
10103 15129 5910 16122 20373 35154 35031 23627 -672 -6417 -16187 -4902 4770 4855 10529 -23108
10089 -23108 -28368 -35742 -61299 -74857 -80367 -59014 -44403 -27721 45 16533 33211 33829 11477
10076 11477 1425 10400 -14984 -29176 -13607 31334 36876 63292 91339 55411 56723 128003
10064A28003L9018k5460j1705K8833J4459K7808j194L0770l283N9921J08890J51410
10052E47470K10258L65029O11380J128675K307322M185988K932698l710521m149957
10043D428342j917906q59471m51553k88655k26909j44261j10585q5254o4080l7050
10033B42618o313l7511k5476k3870j6355O184M329m3469k6814j104k2909k5564
10021B3746k6230J6805n826J0945N369k802j3523l861p381j2571J7569j2448k1910
10008c2118J1055O716K7579j8578j3869K1228q32J7027K1115n843L0882p098n589
9995E1675l1267k3786R331l643k4437n73J7066L3689K9125q937l6804m5441p563
9982d1565J8824k091j263M877K7985J0178J4881J0242k0105p484j5146p511k8586
$$ plain form
10064 128003 167021 141561 129856 158689 173148 200956 199762 230532 227249 287170 396060 547470
10052 547470 757728 1122757 1734137 2862812 5170134 9356122 12288820 8578299 4428342
10043 4428342 2510436 1650965 1199412 910757 683848 539587 429002 343748 279668 242618
10033 242618 236305 198794 173318 149448 133093 139277 143606 100137 73323 72219 49310 23746
10021 23746 -2484 14321 8495 19440 24809 22007 8484 4623 -2758 -15329 2240 -10208 -32118
10008 -32118 -21063 -14347 13232 -5346 -19215 2013 1181 18208 39323 33480 64362 57264 51675
9995 51675 20408 -3378 5953 2310 -22127 -22700 -5634 28055 57180 48243 11439 -34002 -41565
9982 -41565 -22741 -24832 -26095 -21218 6767 16945 31826 42068 21963 14479 -667 -8178 -36764
9969c6764J6212K1110J4220j2569j8497j4398L3937J5036J4355j280j1523k623
9957A7216j8227q017p232Q874l0376q528J1590K3330l39N152J7180o60J0623K1784
9943D2370l4696l8261M0299L6225J0044j9935k2117k6987J2055J6484K2232J8333
9931E6046k906j8865J5937O309j7546j5401M531L681j3796j5139p018j0046K5656
9918A1443k0749k748K2860l942q89J6345j1220M565k0159j1693O505K7926J04
9905A8348l1392j195J4938M509K2656J152M830j4558R201j762J9224J3977j1662
9892D8266k2077p129J0383M020k3574j8989J9949o818q360R113K8241m546n0534
9879b2055r390K5998L0429o916n987k369J6263K1837r571j1187j194J5267R814
$$ plain form
9969 -36764 -20552 558 14778 2209 -16288 -30686 3251 18287 32642 31362 19839 17216
9957 17216 -1011 -9028 -16260 -7386 -37762 -46290 -34700 -11370 -11709 -6557 10623 9963 20586 42370
9943 42370 7674 -30587 9712 45937 55981 36046 13929 -13058 -1003 15481 37713 56046
9931 56046 53140 34275 50212 56521 38975 23574 28105 31786 17990 2851 -4167 -14213 11443
9918 11443 -9306 -12054 10806 6864 5975 22320 11100 15665 -4494 -16187 -9682 18244 18348
9905 18348 -13044 -14239 699 5208 27864 29016 33846 19288 28489 26727 45951 59928 48266
9892 48266 26189 19060 29443 33463 9889 -9100 10849 4031 -4329 4784 33025 28479 -22055
9879 -22055 -31445 -5447 24982 18066 12079 9710 25973 47810 38239 27052 25858 41125 50939
9866E0939j6783k0984J5332N649J2667J5374k896L345j4828N021j70q599j4650
9853B9417j3601p940J0195K5258q176j9668l7692R65K4334J9184j5153J6536Q217
9840C1876O365J9797j2002j6490k1570k2703J563K3094N939K2390r852R125J745
9827C9277j0785k1759k793k6665q720P561m473K4778K2988r906k5233o713K5389
9814B946o388k4109l9K1731l586J1959L024L080P594j1087q79j055o254J4687
9800A1624Q981n86k1274M799j3713k4600L3705M500j2794l781J2326P430k4393
9787a7776l14j7500o926P886J3266j8349k2211J8772J6132n94J8307O641R249
9774F583k4593j3086j5665J4996J4388J6072k1316q240J6514j7748K0408J5563
$$ plain form
9866 50939 34156 13172 28504 34153 46820 62194 59298 62643 47815 52836 52666 44067 29417
9853 29417 15816 7876 18071 43329 35153 15485 -22207 -21242 3092 22276 7123 23659 31876
9840 31876 38241 58038 46036 29546 7976 -14727 -13164 9930 15869 38259 28407 37532 39277
9827 39277 28492 6733 3940 -22725 -31445 -23884 -28357 -3579 19409 9503 -15730 -22443 2946
9814 2946 -3442 -27551 -27590 -5859 -9445 2514 5538 8618 16212 5125 4246 3191 -3063 11624
9800 11624 20605 20019 -1255 3544 -10169 -34769 -1064 3436 -9358 -13139 -813 6617 -17776
9787 -17776 -18090 -35590 -42516 -34630 -21364 -39713 -61924 -43152 -27020 -27614 -9307 -2666 6583
9774 6583 -18010 -31096 -46761 -31765 -17377 -1305 -22621 -30861 -14347 -32095 -11687 3876
9762C876o622q805j6323j0147K7200p863J6031K8196m424r802l5934m9964J6798
9749e7783l286J6628J2947K1371L3218K6845j2411j1132O329L4507j0923k4383
9737C1927l4576j918J4920J9495J284j3871K292J2691j8226J0236J0600m4967
9725a0113j9197N606R678q148M989J9057K4064j1281Q942N98j5121k5476K0840
9712D438P283k2723M42L262o361q431j805J2981q434m920k0842k8111M1607K3483
9698h131n028K588J378k3200r828J4221J8058N0061J2997k2350o427l99k6747
9685b807j7565J0304J2002O866m003j4754j1049K472M2209j3724k357K6873l1807
9672B660l7925k3364p581J5935K1637r501L7821L7916m5918k1707J2708J0617
$$ plain form
9762 3876 -2746 -11551 -27874 -38021 -10821 -18684 -2653 25543 21119 11317 -24617 -74581 -57783
9749 -57783 -61069 -44441 -31494 -10123 23095 49940 37529 26397 32726 67233 56310 31927
9737 31927 -2649 -4567 10353 29848 31132 17261 19553 32244 14018 24254 34854 -10113
9725 -10113 -29310 -23704 -14026 -22174 -17185 1872 25936 14655 23597 24195 9074 -16402 4438
9712 4438 11721 -11002 -10560 -7298 -13659 -22090 -23895 -10914 -19348 -24268 -45110 -73221 -31614 -8131
9698 -8131 -13159 -10571 -9193 -32393 -42221 -28000 -9942 40119 53116 30766 24339 23940 -2807
9685 -2807 -20372 -10068 1934 8800 4797 -9957 -21006 -18534 23675 9951 7594 34467 2660
9672 2660 -35265 -58629 -66210 -50275 -28638 -38139 -318 37598 -8320 -30027 -17319 -6702
9660f702k2243J1375Q329k2392L6365R869k3382L5763p1k2314K544q641O984k624
9646B860j0414J0479Q831J2578j8770K385L8547k3392k3269R482k7557k5317j3372
9633e6929J1265J2047J911j3307Q793J409P109J912n753k4746J7455J5298j5452
9620c8988J5687J1842o038j0409L644N3233j3502O37j4550l375K3904L231L106
9607B8422N953k2281n548P307j0152M845r61J2p385j8687N178J6572K1702o559
9593A8418l0773k3532j9964o98L1192M3131k0229l7985k7534K5365q756J3639
9581c7726M2529j0446l4246J7773L5148P277r026J4900R742j8464j9020Q311K9624
9568C6376L951l3526m48L756M172M458J1543m848l769j598j2513j1846l0035k0187
$$ plain form
9660 -6702 -28945 -17570 -9241 -31633 4732 14601 -8781 26982 26911 4597 7141 -1500 5484 2860
9646 2860 -7554 2925 11756 24334 5564 7949 46496 23104 -165 9317 -18240 -43557 -56929
9633 -56929 -45664 -33617 -31706 -45013 -36220 -34811 -27702 -25790 -31543 -56289 -38834 -23536 -38988
9620 -38988 -23301 -11459 -17497 -27906 -24262 28971 15469 16106 1556 -1819 22085 25316 28422
9607 28422 34375 12094 6546 13853 3701 8546 7585 7597 212 -18475 -13297 3275 24977 18418
9593 18418 -12355 -35887 -55851 -56549 -25357 17774 -2455 -40440 -67974 -42609 -51365 -37726
9581 -37726 4803 -5643 -39889 -22116 13032 20309 11283 26183 35925 17461 -1559 6752 36376
9568 36376 40327 6801 6353 10109 14281 18739 30282 25434 21665 20067 7554 -4292 -34327 -54514
9554e4514P241k5772j3060K1230J8184L133L8003n134l9519n942J0359J7120k190
9541c0861j4525j3834L4078Q77q801J4757p579J179K1778P856J1079j2078J2907
9528A6833P103p62q1j326J345j979M886M1482q56k4919j8680J3020K1695n153
9514E2608j1552j0738k3873k399J0229Q782r715K682n420l3818p267L3508J5492
9501A8519k0046k51N59Q208J0796K068j9479l1147p46K6707J2367J7421L685j0913
9487A7748Q525l503r572j4142J564J1701k2028K8293J707k0280o255Q519o743
9474d466r981j6052l722J1950K8411J5901J0498q066k6698J3461J6438R560j2762
9461B4472k0225p429K5853j1338Q74j2080K2825J1311j3717j5014o65l0728k541
$$ plain form
9554 -54514 -47273 -73045 -86105 -64875 -46691 -43558 -5555 -10689 -50208 -56150 -45791 -28671 -30861
9541 -30861 -45386 -59220 -25142 -24265 -33066 -18309 -25888 -24709 -2931 4925 16004 3926 16833
9528 16833 23936 23174 23093 21767 23112 21133 26019 67501 66645 41726 23046 36066 57761 52608
9514 52608 41056 30318 6445 4046 14275 23057 13342 16024 10604 -23214 -30481 3027 18519
9501 18519 -1527 -1778 -1219 6989 17785 19853 374 -30773 -31519 -4812 7555 24976 28661 17748
9487 17748 26273 22770 13198 -944 620 12321 -9707 18586 20293 13 -6242 2277 -4466
9474 -4466 -14447 -30499 -34221 -22271 6140 22041 32539 24473 -2225 11236 27674 37234 24472
9461 24472 4247 -3182 22671 11333 12207 127 22952 34263 20546 5532 4867 -25861 -28402
9448b8402j2936q927K0827J6319K1893Q490l786M559K532K958j7638m514m217
9435b842K5768p832k3080l733N536M1339L5794k2307k2935J1689k1951j1849n11
9422C086P138o431j9047P767Q908K1322P111k2319l265O900J7202J2342r315j7078
9408A4321K227j92J4561n243k7103j0019J8765K614j1294R181L3390j2821N467
9395C3854J3593M321K2040J4286q047J3789J565j098j3646j299j6098P849O954
9382G8063l3574l2441K6447K1626j794j4105j0024L866L8059p646l8876j4301
9370A5300K3929J8084j2831j1584j7110p216M1383L180O014L945o221j9365J2755
9357E0263j32J5789J341k9638j860J9737q193j8444j5233J7244J3228J3783K0963
$$ plain form
9448 -28402 -41338 -50265 -29438 -13119 8774 17264 13478 18037 20569 23527 5889 1375 -2842
9435 -2842 22926 15094 -7986 -11719 -6183 35156 70950 48643 25708 37397 15446 3597 3086
9422 3086 10224 3793 -15254 -7487 1421 22743 29854 7535 4270 11170 28372 40714 31399 14321
9408 14321 16548 16356 30917 25674 -1429 -11448 7317 9931 -1363 7818 41208 28387 33854
9395 33854 47447 51768 73808 88094 80047 93836 95401 94303 80657 79358 63260 71109 78063
9382 78063 44489 12048 38495 60121 58327 44222 34198 38064 76123 68477 29601 15300
9370 15300 39229 57313 44482 32898 15788 8572 49955 53135 59149 63094 56873 37508 50263
9357 50263 50131 65920 67261 37623 35763 55500 47307 28863 13630 30874 44102 57885 78848
9344G8848J4060L123K252K394m114J1352k704J1554J2529J2944J773k0700k4752
9331I8559J2593J9361K0269N791Q325J6340o605q375M24k1288p200J189K7189
9318A66572l513m225J3012J0643L4686J0056Q488L0563J5453M539J9699J7013
9306C22986L1647M301J6027L8976J8403L6867N4721O9181J8860K5120J6716K6888
9294F80693M0275Q1518J09989J24465J06378O6707Q0702J25686J23251J08250
9284A647914J28138J96838K05254K29327K39707K43907K29519K15366J67478J14680
9274C618128Q0131J9898l8162r8664j74983k01702k30440k36076k18883k13713
9264B305534j94052j63038j39706j68865j30679j32928j31056j08987j08214j11278
$$ plain form
9344 78848 92908 96031 98283 100677 96563 107915 105211 116765 129294 142238 144011 123311 98559
9331 98559 111152 130513 150782 156573 164898 181238 174633 166258 166682 145394 138194 139383 166572
9318 166572 163059 158834 171846 182489 217175 227231 235719 266282 281735 286274 305973 322986
9306 322986 354633 358934 374961 413937 432340 469207 523928 593109 611969 637089 653805 680693
9294 680693 720968 802486 912475 1036940 1143318 1210025 1290727 1416413 1539664 1647914
9284 1647914 1776052 1972890 2178144 2407471 2647178 2891085 3120604 3335970 3503448 3618128
9274 3618128 3698259 3718157 3679995 3581331 3406348 3204646 2974206 2738130 2519247 2305534
9264 2305534 2111482 1948444 1808738 1639873 1509194 1376266 1245210 1136223 1028009 916731
9254I16731m7257m6550k5884m5429m1100o4273n9981m1950m8238l1570k9169k1764
9242D13566l1971p219k4969k4717Q927l0960k2915k914J4441k0282p4251j6913
9230A79823L491j6258j5029J8012J5684o630M482j9642k2892j5267J3169L468
9218A42411j3373l115K0998l645j4510k0009j8626l2668J3253R416k443k0281
9206E7408K2503J7516j0614j9733j3095m053L754r273J0394J1048o699k2730L1970
9193F8396J3512p518O151J0325R887k8433k2185k672k5104o798J1399P88K3659
9180E1407K3407k0820k4439M57J6402J3803m994k9162l370k269p865n454J2791
9167A9894j0068j9237j8185O350K4524L3713j774J3978M112n210N98k3379q718
$$ plain form
9254 916731 869474 822924 797040 751611 710511 646238 586257 544307 496069 464499 435330 413566
9242 413566 381595 374376 349407 324690 333617 302657 279742 276828 291269 270987 196736 179823
9230 179823 183314 167056 152027 170039 185723 179093 183575 163933 141041 125774 138943 142411
9218 142411 129038 125923 146921 143276 128766 108757 90131 57463 70716 80132 77689 57408
9206 57408 79911 97427 86813 67080 53985 49932 53686 44413 54807 65855 59156 36426 68396
9193 68396 81908 74390 80541 90866 100753 72320 50135 47463 22359 15561 26960 27748 51407
9180 51407 74814 53994 29555 30012 46414 60217 55223 26061 22691 20422 12557 7103 19894
9167 19894 9826 -9411 -27596 -21246 3278 36991 35217 49195 53307 48097 48695 25316 16598
9154A6598j0635K0723K4947q800P232k4671K618K5726j0668k0984k0526J6647
9142A8207J2237k1278J0503p042K600j6568L092l635l4525n529K8102K7506L5353
9129D9023L5986k0215l553j3467j0380j9961l4592k0253j1141L1688M1339M096
9117B8570j8238n728r37j7911N938k160R866J8536J3330K2629k8868m4828j3028
9104c2829J2235K1603J8293j3349j858L181J5131J963j7651l8518j6877j112J6601
9091c3187K7480j724j4433K468K6696Q024j529R916J9052R578k7474J3906J7916
9078E6689l386M301m672J4000j2392J3433p476l7233q601L7664M042K5943k1478
9065F0834m6709K862J2820J5608K285j1304L1127Q446l845Q774k0322m4849n598
$$ plain form
9154 16598 5963 26686 51633 42833 50065 25394 28012 53738 43070 22086 1560 18207
9142 18207 30444 9166 19669 12627 15227 -1341 1751 -1884 -36409 -41938 -13836 13670 49023
9129 49023 85009 64794 61241 47774 37394 17433 -17159 -37412 -48553 -16865 24474 28570
9117 28570 10332 4604 3667 -14244 -8306 -10466 -600 17936 31266 53895 25027 -19801 -32829
9104 -32829 -20594 1009 19302 5953 4095 7276 22407 24370 6719 -31799 -48676 -49788 -33187
9091 -33187 -5707 -7431 -21864 -19396 7300 15324 13795 23711 42763 52341 24867 38773 56689
9078 56689 53303 57604 52932 66932 54540 67973 60497 23264 14663 52327 56369 82312 60834
9065 60834 14125 16987 29807 45415 47700 36396 67523 75969 72124 80898 60576 15727 10129
9052A0129j3819P944J5156J8790Q290k9009k6161K461l33p803j0868K6431K6176
9039B7384m992O131Q583l3642k2287J5663L602R625P409K3662j797m2300j8277
9026b1236j1912J8559j4475L128J6379J7347m563k1542P752J2991K5215O157k0463
9013A3337N378L096L556K221j1396J0802m0179j5621L0942k921L194J7035k1002
9000a558j3132J1620K7238j1117l4524l737J3015L1208k802j7430j3818j7091
8988c2128k497J9330J1454q227J0645j6050k166m980J8700K7917P753j8456l448
8975G847j785j3762K8640J5284l6137r639P624l1508m510M4706K9598m417m062
8962B7879J2451J5249j32p576N040o171N65j0216j8707r701k0o717N2461k694
$$ plain form
9052 10129 -3690 4254 19410 38200 46490 17481 -8680 -6219 -6552 -14355 -25223 1208 27384
9039 27384 22392 28523 37106 3464 -18823 -3160 442 10067 17476 41138 39341 -2959 -21236
9026 -21236 -33148 -14589 -29064 -25936 -9557 7790 3227 -18315 -10563 2428 27643 33800 13337
9013 13337 18715 21811 25367 27588 16192 26994 -13185 -28806 2136 -785 2409 19444 -1558
9000 -1558 -14690 -3070 24168 13051 -21473 -25210 -12195 19013 16211 -1219 -15037 -32128
8988 -32128 -34625 -15295 -3841 -12068 -1423 -17473 -19639 -24619 -5919 21998 29751 11295 7847
8975 7847 6062 -7700 20940 36224 87 -9552 -1928 -33436 -37946 6760 36358 31941 27879
8962 27879 40330 55579 55447 47871 52911 46740 47305 37089 18382 8681 8661 1944 54405 51711
8948E1711l5439K4666K2448j7992M563k8157l4340j3813k513P783K9283q836k2642
8935b3278J184J0499K123L4897L15r511O577K4647j586L412K345L929K1486j9206
8921E7833n548J4360J444J0431k1013k8206j5450j0729k7752J365m023k68M573
8908b2983K9313L1590l598j6879k894J8580n2833k6701L1479J5099j4172p66K4968
8895A0203P123j4168o999M034J7715j3623p800M533M825l5870l0179J8527J1934
8882b9745j7802J0262L1287K2286k0530j3698j6665j9787J7163J7973r17j1296
8870c1469l106L0235p762O655J4849O134J855l1503k3954N001K1748l941j1134
8857b6392J3358O755n538K523j257r857n637J7612O215q445j2663L973j0717m860
$$ plain form
8948 51711 16272 40938 63386 45394 49957 21800 -12540 -26353 -28866 -21083 8200 -636 -23278
8935 -23278 -22094 -11595 -9472 25425 25740 16229 22806 47453 45867 49279 51624 55553 77039 57833
8921 57833 52285 66645 68089 78520 57507 29301 13851 3122 -24630 -23265 -27288 -27556 -22983
8908 -22983 6330 37920 34322 17443 14549 33129 -19704 -46405 -14926 173 -13999 -14765 10203
8895 10203 17326 3158 -3841 193 17908 4285 -3515 1018 5843 -30027 -60206 -41679 -29745
8882 -29745 -47547 -37285 -5998 16288 -4242 -17940 -34605 -54392 -37229 -19256 -20173 -31469
8870 -31469 -34575 -4340 -12102 -5447 9402 15536 17391 -14112 -38066 -33065 -11317 -15258 -26392
8857 -26392 -13034 -6279 -11817 -9294 -10551 -20408 -26045 -8433 -2218 -10663 -23326 -19353 -30070 -34930
8843c4930J940J5516j1184P0806J0586l3903M421O631O166k2452k7502N604K2457
8830A4156l7219l6754J7068L68L099n514K6273M5024N710l7080l862K6904j2033
8817F140J0896O008j9526K475L7320M3367J7690r780j9661k5647l5141j227Q081
8804B0995j6017j2563k3100J5281K7313q865R471K5104J5377k2573k2800k3484
8792a5861P156J0563j5540J5607M2893m771K1761j8005l5869j0157K2636N5571
8780G5984j0521l5520k917R075J7193Q177J6113j0788l7987j8429j0699o326j2982
8767a9627K365o111L312M1939l385l6948J9342j0000Q095J269j5583j4327k6856
8754e6515L214K3728K4399L046r254k296J7861K265K5697J8202J2112k5969l6864
$$ plain form
8843 -34930 -32990 -17474 -28658 42148 52734 18831 23252 29883 36049 13597 -13905 -8301 14156
8830 14156 -23063 -59817 -42749 -42381 -39282 -44796 -18523 26501 32211 -4869 -8731 18173 6140
8817 6140 17036 23044 3518 5993 43313 86680 104370 94590 74929 49282 14141 12914 20995
8804 20995 4978 -7585 -30685 -15404 11909 3044 12515 37619 52996 30423 7623 -15861
8792 -15861 -8705 1858 -13682 1925 44818 40047 61808 43803 7934 -2223 20413 75984
8780 75984 65463 29943 27026 36101 53294 61471 77584 66796 28809 10380 -319 -6645 -19627
8767 -19627 -17262 -23373 -20061 21878 18493 -18455 887 -9113 -1018 251 -15332 -29659 -56515
8754 -56515 -53301 -29573 -5174 -2128 -11382 -13678 4183 6448 32145 50347 62459 36490 -374
8741c74o370K534K4950j7008l3898R053Q943k1358l386K4098m406J939P981P540
8727B38p883k3405N566O919j0164n304J7121P625J7314l245p966J2119n272J9770
8713B3433p257j6168J979P731j0834k0920M146J9830j0354j1846M8370L4533j5168
8700D7475m5089j3546J4131L493M247J1635K2768N141l356o021O547j0565j7539
8687A9321M3805P132k2700j0603j65M2731J4491k2177j5707J1457J5128n34N465
8674H7644j5985j0511J1223N694j3794j6462l2110l904M882K0147L602J5887L863
8661F0176j053J9737j0182l5066j4138J8728m831N685K3391n830J6930J0427l7707
8648D6267k741L831J2588K6420K5476r521l8069N703M1308J1251j6242j3604k4797
$$ plain form
8741 -374 -6744 -4210 20740 3732 -30166 -21113 -12170 -33528 -36914 -12816 -17222 -15283 -7302 238
8727 238 -7645 -31050 -25484 -18565 -28729 -34033 -16912 -9287 8027 4782 -3184 8935 3663 23433
8713 23433 16176 8 1987 9718 -1116 -22036 -17890 1940 -8414 -20260 28110 62643 47475
8700 47475 2386 -11160 2971 6464 10711 22346 45114 50255 46899 40878 47425 36860 19321
8687 19321 63126 70258 47558 36955 36790 79521 94012 71835 56128 67585 82713 82179 87644
8674 87644 71659 61148 72371 78065 64271 47809 15699 11795 16677 36824 40426 56313 60176
8661 60176 59123 78860 68678 33612 19474 38202 33371 39056 62447 56617 73547 83974 46267
8648 46267 43526 47357 59945 86365 111841 102320 64251 69954 111262 122513 106271 92667 67870
8635F7870L962J2344k4240Q381M6664j7748J1960O326j732n024J646l1496j6024
8622F2889o869J1018n477j1633L3164L9216M4990L3860K8342L0414J470J8336
8610B79720K2085m082Q580L5712L6043L3961J8132J9326R399l4521J1659J6542
8598D52556J8894N494j1909j2363l3223m0661l1321k6970m2305k1046l673l7371
8586B16102k6263j2584m004l4449j6342P971j2833Q404j336q706j0697K329J6834
8573A24426n884l0483j9541P33l0754N0201J9673l5321j5705n455K9622r620n482
8560F6410r965J5250j324m775J8260Q086j9895o988l5416k800j3149M620n858
8547A2456Q372p833K3098J3593O119l78L940J1224J5110J0589j9823l4197M986
$$ plain form
8635 67870 71832 84176 59936 68317 114981 97233 109193 115519 113787 108763 110409 78913 62889
8622 62889 56020 67038 61561 49928 83092 122308 167298 201158 229500 259914 261384 279720
8610 279720 301805 297723 306303 342015 378058 412019 430151 449477 458876 424355 436014 452556
8598 452556 471450 476944 465035 452672 419449 378788 347467 320497 278192 257146 253473 216102
8586 216102 189839 177255 173251 138802 122460 130431 117598 126002 124666 115960 105263 107592 124426
8573 124426 118542 88059 68518 69251 38497 88698 108371 73050 57345 51890 81512 71892 66410
8560 66410 56445 71695 70371 65596 83856 91942 72047 65059 29643 26843 13694 18314 12456
8547 12456 20828 12995 36093 49686 55805 55427 59367 70591 85701 96290 76467 42270 47256
8534D7256P126K1131l767l959J7287P871j5569k5726J0857R659L1479J6161l2632
8521H7174j6254j2607j8790J964L0324n6m4904j2594p160J4384K1641Q990J5474
8508F7586p782k4842J372J8285n306J0770K435K612L366J4790j3162j0030P371
8495F7465J0830k5089k3009L921J3021j621R75k939o402l401J032K4505l123k7023
8481B9142l2558j4420K1326j4344j4922j8915l2554K3473L9134J9997M266J2218
8469B1843J2684J9232J7499j224l210j297p988n860k0440K126J3739j8208J0895
8456C9791j7219j4027J38l330k073k4937J3011L1148j1644j160j0047k1449J6746
8443e052L1194J4012L4052p771k0566k1567m973j1215K1691O27k4695j436j4972
$$ plain form
8534 47256 54382 75513 71746 67787 85074 92945 77376 51650 62507 72166 103645 119806 87174
8521 87174 70920 58313 39523 41487 71811 71755 26851 14257 7097 21481 43122 52112 67586
8508 67586 59804 34962 36334 54619 49313 60083 62518 65130 68496 83286 70124 60094 67465
8495 67465 78295 53206 30197 34118 47139 45518 46493 43554 37152 33751 34783 59288 56165 29142
8481 29142 -3416 -17836 3490 -10854 -25776 -44691 -77245 -53772 -14638 5359 9625 21843
8469 21843 34527 53759 71258 70034 66824 65527 57539 51679 31239 33365 47104 28896 39791
8456 39791 22572 8545 8683 5353 3280 -21657 -8646 22502 10858 9698 -349 -21798 -5052
8443 -5052 26142 40154 74206 66435 45869 24302 19329 8114 29805 30432 5737 4301 -10671
8430a0671q784L3085M4744L3011j0985j4431O634N532k1812k7430J30j0518j420
8417A7085K8065K5600L285k3337j3703R509l0138l4478l2415j4212R412N2501
8405b826J7380l1564M119J6511J9356n279k551m870k5520k2340J5277K5674J4421
8392A7788k0343j618J1497K9084j201J2191N879k9452j3814J0504J3781o682k2289
8379E325l83Q693O85L4591K0947l784k2680j6979O042J3465r03J1766q856k905
8365D5024K2739m113l2834k499j3282N252J9792l447k8694J2387j383q832j7771
8352g661m963R136O662J5146K463l163J8392n247q421R087O633j3234J0615J3768
8338D9213j7682k5924J4036j2690k2854J0459L4092Q895j7186J7394K5629K1104
$$ plain form
8430 -10671 -19455 13630 58374 91385 80400 65969 72603 78135 56323 28893 29023 18505 17085
8417 17085 45150 70750 74035 50698 36995 46504 16366 -18112 -50527 -64739 -55327 -2826
8405 -2826 14554 -17010 -12891 3620 22976 17697 15146 10276 -15244 -37584 -22307 3367 17788
8392 17788 -2555 -4173 7324 36408 35207 47398 53277 23825 10011 20515 34296 27614 5325
8379 5325 4942 13635 14320 48911 69858 66074 43394 26415 32457 45922 45019 56785 47929 45024
8365 45024 67763 63650 30816 28317 15035 20287 40079 36632 7938 20325 18942 10110 -7661
8352 -7661 -12624 -3488 3174 18320 20783 17620 36012 30765 22344 31431 38064 24830 35445 49213
8338 49213 31531 5607 19643 6953 -15901 -5442 28650 37545 20359 37753 63382 84486
8326H4486M82l7838j6819k5821k7606J7275K5988j4567j3761M095N226j616n844
8313f320R952L4940J2149J5355k6169n311r955l7335k4848K144J3235J1282P337
8300c544l193l7344J3921K9425k6241K5333L1969L608j0552j1087J772M169n633
8287A2603q303l4267J1970j1317j4024K1455K7493K8290l2536o74O226K987j071
8274H832K327J1725l484k260K0322M226j2026q194k788J1369o322r617j9242K2195
8260A7063j1047J8755J732j350Q018k238k0066j1122j0149j0874J5611J8332L7599
8247E0264k9388l3780m786j247J3513L5664J1547O412j1485l0641j1714R238j7146
8234a3549N955L947j9415j8009K6704M2160j309j9438J6557p810J3768J2293k4511
$$ plain form
8326 84486 84968 47130 30311 4490 -23116 -5841 20147 5580 -8181 -4086 1140 -476 -6320
8313 -6320 3632 38572 50721 66076 39907 34596 24641 -12694 -37542 -35398 -22163 -10881 -3544
8300 -3544 -6737 -44081 -30160 -735 -26976 -1643 30326 33934 23382 12295 14067 18236 12603
8287 12603 4300 -29967 -17997 -29314 -43338 -21883 5610 33900 1364 690 6916 9903 8832
8274 8832 11159 22884 19400 17140 37462 41688 29662 21468 18680 30049 23727 14110 -5132 17063
8260 17063 6016 24771 26503 25153 33171 30933 10867 -255 -10404 -21278 -5667 12665 50264
8247 50264 20876 -12904 -17690 -18937 -5424 30240 41787 48199 36714 6073 -5641 3597 -13549
8234 -13549 -7594 -3647 -23062 -41071 -14367 27793 26484 7046 23603 15793 29561 41854 17343
8221A7343j5802J6028N209J3154k9168j0552j1263m310K3057m12J582N124k384
8208G606j9111M3128J1239n821j6238l1869j740M0784P348J3629P789M054j1346
8195D9452j8951j2109J395k1801Q871J2879J4697j7207k1618N771j3533J197J1088
8182A31K601p403J066P612j5592n015K4942k6142J9152J2418K8606Q631l1135
8169A9872P364o577l3322j9378J6263J147R842J099j1524J3221j2060N265q837
8156a7625k4173Q773O871K925m35j151K0871K3524J2313Q3k0979J3267J3938k0914
8142A7288J8545m973M282m952J4591p295l2238M046k431M583J7908J6749l204
8129D2899k0746K938l1095K4135J5074Q184L08l4669K233N350L057j3151j7064
$$ plain form
8221 17343 1541 17569 22778 35932 6764 -3788 -15051 -19361 3696 3284 4866 9990 7606
8208 7606 -11505 31623 42862 37041 20803 -11066 -12806 27978 35326 48955 56744 60798 49452
8195 49452 30501 18392 19787 -2014 6857 19736 34433 17226 -4392 1379 -12154 -10957 131
8182 131 2732 -4671 -3605 4007 -11585 -16600 8342 -17800 1352 13770 42376 51007 19872
8169 19872 27236 20659 -12663 -32041 -15778 -14631 -4789 -3690 -15214 -1993 -14053 -8788 -17625
8156 -17625 -41798 -33025 -26154 -23229 -23664 -24815 -3944 19580 31893 31976 10997 24264 38202 17288
8142 17288 35833 30860 35142 30190 44781 37486 5248 9294 6863 11446 29354 46103 42899
8129 42899 22153 25091 -6004 18131 33205 41389 41697 7028 9261 14611 17668 4517 -12547
8116a2547L801K8023J9883J4265j2687l5768m909j8305p994K5212m289q963J6830
8103B552j9991j675M3488r119k967K7067P57O092j3842p217J9723k0932L25j7210
8089G051K689N749k1789q617J0161J6498K8802o186k0208k460k4586j8193L0646
8076d43j9907j5393O772O651K5974J068K6890J8373n799k2389k516J7122j2007
8063B4396k0389j2733J1410o202k1819j9603J8737K1168K9036J8581P568j7920
8051C2230n634K1276n749o323M432J3654k2005l6225O466j9968J5031K9956J1021
8038C8162j3401j75N518K7500P357J0877R418j4126k2632m162L5882j7782j9538
8025D2898p971k3330M339l7499j1342L5557m597P283K5700M4697q908j4821J831
$$ plain form
8116 -12547 -8746 19277 39160 53425 40738 4970 61 -18244 -26238 -1026 -5315 -14278 2552
8103 2552 -17439 -19114 24374 15255 12288 39355 40112 46204 32362 25145 44868 23936 24261 7051
8089 7051 9740 15489 -6300 -14917 -4756 11742 40544 34358 14150 11690 -12896 -31089 -443
8076 -443 -20350 -35743 -28971 -22320 3654 4722 31612 49985 44186 21797 19281 36403 24396
8063 24396 4007 -8726 2684 -3518 -25337 -44940 -26203 -5035 24001 42582 50150 32230
8051 32230 26596 47872 42123 35800 40232 53886 31881 -4344 2122 -17846 -2815 27141 38162
8038 38162 24761 24586 30104 57604 64961 75838 85256 71130 48498 44336 80218 62436 42898
8025 42898 34927 11597 15936 -21563 -32905 2652 -1945 5338 31038 75735 66827 52006 53837
8012E3837J2410M5462P455r863p584P526M196J1424j0867j4711K1095q223l955
7999A08202O746k3491q496n528k1043P346j3857J5722j9121k9722r73r825k3158
7986a7198J4852L4273J964J2900K6423K2825R204k1889k8565O70j3191n950J0995
7973D7313j6438m021J414J8540O6693M3033k0145k2295k5382J6878K6077k127
7961A29540J568K6671j788k4392j6118j960L5577N84j8133j8337K4709k3312k2858
7948I1751k081j6561k3960k2691j051N078L2371L804j5752j4637j3486K3209j0999
7935C4995K6850p926K669P593k1958p94j5178R517K3321p485R610J1654j2398
7922F0470L826o953J3017k1660j4486J1339n059j3488l085P048J9135j6844j9682
$$ plain form
8012 53837 66247 111709 119164 109301 101717 109243 113439 124863 113996 99285 120380 112157 108202
7999 108202 114948 91457 82961 77433 56390 63736 49879 65601 46480 16758 15785 5960 -17198
7986 -17198 -2346 31927 33891 46791 73214 96039 105243 83354 54789 55459 42268 36318 47313
7973 47313 30875 26854 28268 46808 113501 156534 136389 114094 88712 105590 131667 129540
7961 129540 131108 157779 155991 131599 115481 113521 149098 149682 131549 113212 137921 114609 91751
7948 91751 89670 73109 49149 26458 25407 30485 62856 66660 50908 36271 22785 45994 34995
7935 34995 61845 53919 56588 64181 42223 41429 26251 35768 59089 51604 61214 72868 60470
7922 60470 64296 57343 70360 48700 34214 45553 40494 27006 23921 30969 50104 33260 13578
7909A3578L398J9070J729J3629J3753k4036J419j0538k6413m431K6645J953J2045
7896D1801L692k5033O052L312j7995o072K353m396R730J4450r67o322k1809N243
7882D039R130J3634K8888R130j288k8171k8017m7657J0250M9079M852L381J7411
7869D4661k3883l01K7979k2748j1915J2594k0687l8613J3119J2432K0330R628
7857B2596l4834k7228l2712J0899J9418K7931j2733j5317M371K5570M025j2687
7845b0701L0054J6496Q322p213k0897j831K689m108k3826K21J6126j1229j0875
7832b6772J3494J3610L2558L363M795l175l4040k3652J5146j1007k706J0306k089
7819a0169m908l0188j5974J8133L8230L6654j199k5998j6637j2384p167J4452
$$ plain form
7909 13578 16976 36046 37775 51404 65157 41121 42540 32002 5589 1158 27803 29756 41801
7896 41801 45493 20460 26512 29824 11829 5757 8110 3714 13444 27894 26927 20605 -1204 4039
7882 4039 13169 26803 55691 64821 63533 35362 7345 -40312 -30062 19017 23869 27250 44661
7869 44661 20778 20477 48456 25708 13793 26387 5700 -32913 -19794 -7362 12968 22596
7857 22596 -12238 -39466 -72178 -61279 -41861 -13930 -26663 -41980 -37609 -12039 -8014 -20701
7845 -20701 9353 25849 34171 26958 6061 4230 6919 2811 -21015 -20794 -4668 -15897 -26772
7832 -26772 -13278 332 32890 36253 41048 37873 3833 -19819 -4673 -15680 -18386 -8080 -10169
7819 -10169 -15077 -45265 -61239 -43106 -4876 31778 30579 4581 -12056 -24440 -31607 -17155
$$ [...]
##END NTUPLES=NMR SPECTRUM
##END=
