##TITLE=Analysis number 324497
Compound Code cc 47451
Book Reference 483/66/8
Project Code adrs
Chemist Name mattw
##JCAMPDX= 6.0         $$ Bruker NMR JCAMP-DX V2.0
##DATA TYPE= NMR SPECTRUM
##DATA CLASS= NTUPLES
##ORIGIN= Bruker BioSpin GmbH
##OWNER= nmr
$$ XWIN-NMR		Version 3.5
$$ Thu Nov 23 13:08:43 2006 GMT Standard Time (UT+0h)  MAYBRIDGE\nmr@NMR_250MHZ
##.OBSERVE FREQUENCY= 250.131544655141
##.OBSERVE NUCLEUS= ^1H
##.ACQUISITION MODE= SIMULTANEOUS (DQD)
##.ACQUISITION SCHEME= undefined
##.AVERAGES= 16
##.DIGITISER RES= 18
##SPECTROMETER/DATA SYSTEM= dpx250
##.PULSE SEQUENCE= zg30
##.SOLVENT NAME= D2O
##.SHIFT REFERENCE= (INTERNAL, D2O, 0, 16.522)
##AUDIT TRAIL= $$ (NUMBER, WHEN, WHO, WHERE, WHAT)
$$ ##TITLE= Audit trail, XWIN-NMR		Version 3.5
$$ ##JCAMPDX= 5.01
$$ ##ORIGIN= Bruker BioSpin GmbH
$$ ##OWNER= nmr
$$ C:\u/data/dgb/nmr/ADRS/920/pdata/1/auditp.txt
$$ ##AUDIT TRAIL=  $$ (NUMBER, WHEN, WHO, WHERE, WHAT)
(   1,<2006-11-23 13:07:58.31 +000>,<MAYBRIDGE\nmr>,<NMR_250MHZ>,
      <created by zg, POWCHK disabled, PULCHK disabled
       configuration hash MD5:
       49 4B E0 1D 92 C2 6B 37 9F E6 65 BC 52 41 86 1D
       data hash MD5: 64K
       26 14 B4 86 0C 23 73 24 AC E8 33 F5 DF E2 3A 96>)
(   2,<2006-11-23 13:08:16.85 +000>,<MAYBRIDGE\nmr>,<NMR_250MHZ>,
      <Start of raw data processing
       ef LB = 0.3 FT_mod = 6 PKNL = 1 SI = 32K 
       data hash MD5: 32K
       93 ED 15 D2 20 B1 EB 37 39 BB 2D E7 D3 90 69 4E>)
(   3,<2006-11-23 13:08:19.01 +000>,<MAYBRIDGE\nmr>,<NMR_250MHZ>,
      <apk 
       data hash MD5: 32K
       0F DE 69 F7 6A ED 2E 4F EB 7B 3B D5 C1 64 C7 E3>)
(   4,<2006-11-23 13:08:19.74 +000>,<MAYBRIDGE\nmr>,<NMR_250MHZ>,
      <abs ABSG = 5 
       data hash MD5: 32K
       94 C5 0F F3 01 60 42 F3 5D 19 79 63 FF C4 33 57>)
$$ ##END=
$$ 
$$ hash MD5
$$ 00 DB 8B D2 84 9A B6 7B DF E6 2F 7F A9 79 FE F8
##$RELAX= 
##$RELAX= 
##$RELAX= 
##$RELAX= 
##$RELAX= 
##$RELAX= 
##$RELAX= 
$$ Bruker specific parameters
$$ --------------------------
##$DU= <C:\u>
##$EXPNO= 920
##$NAME= <ADRS>
##$PROCNO= 1
##$TYPE= <nmr>
##$USER= <dgb>
##$AMP= (0..31)
100 100 100 100 100 100 100 100 100 100 100 100 100 100 100 100 100 100 
100 100 100 100 100 100 100 100 100 100 100 100 100 100 
##$AQSEQ= 0
##$AQ_mod= 3
##$AUNM= <au_zg>
##$AUTOPOS= <2 >
##$BF1= 250.13
##$BF2= 250.13
##$BF3= 250.13
##$BF4= 250.13
##$BF5= 500.13
##$BF6= 500.13
##$BF7= 500.13
##$BF8= 500.13
##$BYTORDA= 1
##$CFDGTYP= 0
##$CFRGTYP= 5
##$CHEMSTR= <none>
##$CNST= (0..31)
1 1 145 1 1 1 1 1 1 1 1 1 1 1 1 1 1 1 1 1 1 1 1 1 1 1 1 1 1 1 1 1 
##$CPDPRG= <>
##$CPDPRG1= <>
##$CPDPRG2= <>
##$CPDPRG3= <>
##$CPDPRG4= <mlev>
##$CPDPRG5= <mlev>
##$CPDPRG6= <mlev>
##$CPDPRG7= <mlev>
##$CPDPRG8= <mlev>
##$CPDPRGB= <>
##$CPDPRGT= <>
##$D= (0..31)
0 1 0 0 0 0 0 0 0 0.06 0 0 0 0 0 0 0.0002 0 0 0 0 0 0 0 0 0 0 0 0 0 0 
0 
##$DATE= 1164287276
##$DBL= (0..7)
120 120 120 120 120 120 120 120 
##$DBP= (0..7)
150 150 150 150 150 150 150 150 
##$DBP07= 0
##$DBPNAM0= <>
##$DBPNAM1= <>
$$ [...]
##$SUBNAM6= <"">
##$SUBNAM7= <"">
##$SUBNAM8= <"">
##$SUBNAM9= <"">
##$SW= 20.6930455092707
##$SWIBOX= (0..15)
0 0 3 0 0 0 0 0 0 0 0 0 0 0 0 0 
##$SW_h= 5175.983436853
##$TD= 65536
##$TD0= 1
##$TE= 683.16
##$TE2= 300
##$TE3= 300
##$TEG= 300
##$TL= (0..7)
0 120 120 120 120 120 120 120 
##$TP= (0..7)
150 150 150 150 150 150 150 150 
##$TP07= 0
##$TPNAME0= <>
##$TPNAME1= <>
##$TPNAME2= <>
##$TPNAME3= <>
##$TPNAME4= <>
##$TPNAME5= <>
##$TPNAME6= <>
##$TPNAME7= <>
##$TPOAL= (0..7)
0.5 0.5 0.5 0.5 0.5 0.5 0.5 0.5 
##$TPOFFS= (0..7)
0 0 0 0 0 0 0 0 
##$TUNHIN= 0
##$TUNHOUT= 0
##$TUNXOUT= 0
##$USERA1= <user>
##$USERA2= <user>
##$USERA3= <user>
##$USERA4= <user>
##$USERA5= <user>
##$V9= 5
##$VALIST= <valist>
##$VCLIST= <CCCCCCCCCCCCCCC>
##$VD= 0
##$VDLIST= <DDDDDDDDDDDDDDD>
##$VPLIST= <PPPPPPPPPPPPPPP>
##$VTLIST= <TTTTTTTTTTTTTTT>
##$WBST= 1024
##$WBSW= 4
##$XGAIN= (0..3)
0 0 0 0 
##$XL= 0
##$YL= 0
##$YMAX_a= 356938
##$YMIN_a= -384992
##$ZGOPTNS= <>
##$ZL1= 120
##$ZL2= 120
##$ZL3= 120
##$ZL4= 120
##$ABSF1= 16.522
##$ABSF2= -4.171173
##$ABSG= 5
##$ABSL= 3
##$ALPHA= 0
##$AQORDER= 0
##$ASSFAC= 0
##$ASSFACI= 0
##$ASSFACX= 0
##$ASSWID= 0
##$AUNMP= <proc_1d>
##$AZFE= 0.1
##$AZFW= 0.1
##$BCFW= 0
##$BC_mod= 0
##$BYTORDP= 0
##$COROFFS= 0
##$CY= 12.5
##$DATMOD= 1
##$DC= 0
##$DFILT= <>
##$DTYPP= 0
##$F1P= 14.0000005364418
##$F2P= -0.99999901652339
##$FCOR= 0.5
##$FTSIZE= 32768
##$FT_mod= 6
##$GAMMA= 0
##$GB= 0
##$INTBC= 1
##$INTSCL= 1
##$ISEN= 128
##$LB= 0.3
##$LEV0= 0
##$LPBIN= 0
##$MAXI= 10000
##$MC2= 0
##$MEAN= 0
##$ME_mod= 0
##$MI= 0
##$NCOEF= 0
##$NC_proc= -3
##$NLEV= 6
##$NOISF1= 0
##$NOISF2= 0
##$NSP= 0
##$NTH_PI= 0
##$NZP= 0
##$OFFSET= 16.522
##$PC= 1
##$PHC0= -59.44764
##$PHC1= 13.75035
##$PH_mod= 1
##$PKNL= yes
##$PPARMOD= 0
##$PSCAL= 4
##$PSIGN= 0
##$REVERSE= no
##$SF= 250.13
##$SI= 32768
##$SIGF1= 0
##$SIGF2= 0
##$SINO= 400
##$SIOLD= 32768
##$SREGLST= <1H.D2O>
##$SSB= 0
##$STSI= 32768
##$STSR= 0
##$SW_p= 5175.98343685301
##$SYMM= 0
##$S_DEV= 0
##$TDeff= 65536
##$TDoff= 0
##$TI= <Analysis number 999999
Compound Code 99
Book Reference 9
Project Code 9>
##$TILT= no
##$TM1= 0
##$TM2= 0
##$TOPLEV= 0
##$USERP1= <user>
##$USERP2= <user>
##$USERP3= <user>
##$USERP4= <user>
##$USERP5= <user>
##$WDW= 1
##$XDIM= 32768
##$YMAX_p= 582527602
##$YMIN_p= -63789
$$ End of Bruker specific parameters
$$ ---------------------------------
##NTUPLES= NMR SPECTRUM
##VAR_NAME=  FREQUENCY,     SPECTRUM/REAL,   SPECTRUM/IMAG
##SYMBOL=    X,             R,               I
##VAR_TYPE=  INDEPENDENT,   DEPENDENT,       DEPENDENT
##VAR_FORM=  AFFN,          ASDF,            ASDF
##VAR_DIM=   32768,         32768,           32768
##UNITS=     HZ,            ARBITRARY UNITS, ARBITRARY UNITS
##FACTOR=    0.157963299565203, 1,           1
##FIRST=     4132.6476996994, 0,             0
##LAST=      -1043.33573715361, 0,           0
##MIN=       -1043.33573715361, -63789,      0
##MAX=       4132.6476996994, 582527602,     0
$$ Real data points
##PAGE= N=1
##DATA TABLE= (X++(R..R)), XYDATA
$$ [...]
24910 23490 18857 12989 16928 14070 -1558 -8654 -15111 -14564 -14076 4798 14736 9720 7846 -616
24896 -616 2928 -1904 -3363 -3072 -15342 -14479 -10640 -21297 -24397 -5903 1981 -7564 -20820 -14249
24882 -14249 -415 10516 7622 8810 13194 8664 10127 2662 665 1644 7280 13593 2316 -12538
24868 -12538 -18713 -10333 -5283 5538 5748 643 -10847 -19817 -21314 -15123 -2817 9924 2384 -7855
24854 -7855 -19140 -32098 -26760 -21711 -4472 -445 -8345 -20227 -14680 -1005 -1976 9811 19104
24841 19104 23807 7780 6797 7398 60 3841 18910 13237 8572 7766 8571 7701 1373 594 -530
24826 -530 10538 173 -10108 -1122 4243 12615 3533 -15869 -13238 -16042 -23655 -23949 -7557 12386
24812 12386 18653 20395 3743 -6657 342 -4925 -4297 1430 -3472 -10883 -1408 11430 10932 -17612
24798 -17612 -16098 -13409 -20672 -13873 233 -10112 -6577 -5506 -11526 -7615 900 8416 1824 -9322
24784 -9322 1763 -13018 -21435 -31619 -15546 9996 10086 14467 7169 1036 -67 -4249 -1803 313
24770 313 -8929 5973 11200 -700 -14703 -15425 -15579 -3218 3014 4362 -10833 -17730 -7808 216
24756 216 6432 2367 -9575 -13268 -4596 2257 -7184 -2912 -2241 -5200 8325 4224 8915 6001 -17
24741 -17 -10750 -10408 -6068 -2003 8197 -743 4073 19285 7929 2061 -14607 -20812 -15907 1044
24727 1044 6162 5443 4891 -1066 -4296 -9761 -1173 14894 11374 -2712 -5136 7714 -6059 -7530
24713 -7530 -3682 194 13890 21575 19602 2251 -341 -930 -7867 -3223 3814 605 -1328 1798
24699 1798 5510 6044 5335 16053 28097 13033 3846 7059 -6864 -11284 -951 6896 6380 5650
24685 5650 856 -3755 56 5918 -3978 -15395 -21427 -15992 -5925 -7134 -2651 10273 2641 -3913
24671 -3913 -821 -10694 -22900 -26689 -24779 -19988 -12350 -14491 -13284 8136 7300 6563 13702 7330 2023
24656 2023 -11135 -14725 -7220 6705 5233 11347 18053 11206 406 -7307 2441 4493 -3032 5575
24642 5575 582 1531 -4563 -19024 -24661 -11837 -6940 -2753 250 6686 -13058 -12787 -580 -3448
24628 -3448 -4417 -2705 -6996 -8461 -1179 -3777 -12184 -12952 1153 -1087 5327 6402 10178 9067 7783
24613 7783 -374 887 6082 -8645 -29971 -37496 -27572 -8844 1042 4116 -2521 7733 -8775
24600 -8775 -19639 -18412 -16450 -2543 7622 7401 -1808 -1942 4056 9706 13692 20019 23051 30812
24586 30812 23304 12427 18983 18182 11414 15986 -16 250 2067 17229 23675 25333 15150 -5338
24572 -5338 -15404 -9059 -6236 -6562 -10679 -564 -8741 -17824 -6463 -308 171 859 -10012 2217
24558 2217 -2724 -12755 -13008 -17065 -16400 -19826 -15932 31 3254 12448 14373 6075 -8194 -19398
24544 -19398 -20817 -15804 -2701 -818 -7374 -14533 -27147 -31662 -20248 -19303 -9504 -3031 -10828 -5236
24530 -5236 -4628 -8391 6082 16726 19692 24780 28059 6758 -2012 8688 10101 -3664 -5884 2722
24516 2722 6208 2337 7157 -3693 -17689 -15272 -5538 -13163 -18040 -18712 -9496 2015 11054 10033
24502 10033 -19175 -34182 -22358 -6186 -7466 -13066 -8215 7235 -10294 -24810 -8885 -5925
24490 -5925 -21355 -24365 -19634 -18878 -11608 -8794 -6058 -3669 -1115 -1497 7705 895 -7316 -1443 -2042
24475 -2042 -8711 -5283 14493 4328 3483 10124 14439 12493 8890 24503 25304 13080 10215 -3701
24461 -3701 -6190 -6398 -18127 -13092 8275 12758 5497 -14250 -24421 -23541 -13076 410 -7254 -15626
24447 -15626 -6454 1168 -690 -3901 -6532 4476 19407 20584 11057 213 11796 24183 21403
24434 21403 19516 10827 15213 8728 10628 11072 21684 26368 19866 13388 8123 8200 9404 6175 3357
24419 3357 1423 1312 15932 20103 4675 7823 15660 6794 750 -14761 -20938 -16996 -18183 -18228 4171
24404 4171 11104 6089 110 -5716 -20156 -27309 -24110 -20598 -3283 -8053 -6468 -11695 -9206 -13601
24390 -13601 -7215 5380 10019 6909 8965 322 -10544 -6059 -522 -1079 -3861 1458 11805 13050
24376 13050 5435 -984 -995 8797 8488 3302 12525 26299 3986 -14598 -6440 3608 6772 3930
24362 3930 3279 2270 5650 895 -10057 -18289 -21843 -21901 -23048 -10373 -5685 856 -2802 -5263 -14445
24347 -14445 -26196 -31422 -22709 -14524 -4190 6702 4581 8905 2193 2120 4077 2478 2604 1144
24333 1144 -2595 -5903 -5954 6886 1425 -110 12911 6732 7726 -280 -15872 -27838 -22229 -17604
24319 -17604 -20284 -37240 -25009 -14276 -19527 -22084 -21557 -20402 -9858 -12533 -4698 -10922 -5206 -12353
24305 -12353 -13469 -8234 -3887 -5223 7582 19647 24768 22600 20213 12575 7172 -4001 -15498
24292 -15498 -24259 -25041 -27131 -32304 -31303 -37661 -41401 -21458 3898 19423 18518 15148 7988 10604
24278 10604 15316 12814 -1987 5159 -2766 -1472 3663 5211 -2057 -11342 -16836 -15801 -17020 -11481
24264 -11481 -7936 -9656 -16266 -22103 -21628 -7903 -4482 -5110 3561 4585 -6274 -7693 -14748 -24767
24250 -24767 -21843 -13489 -496 7689 5327 1032 6531 6891 5771 6881 2066 8921 130 1381
24236 1381 10437 8742 -5037 -9327 -16295 -16140 -9706 -8067 -15466 -22130 -21955 -16694 733 7658 -3667
24221 -3667 -17245 -19994 -14462 -9932 -9520 -7868 -557 19293 8381 -717 -6386 2442 9935 8283
24207 8283 21136 25465 15409 11464 21538 20421 17147 4838 -9370 -5706 -3738 -1921 -6542
24194 -6542 65 18454 15017 8505 2163 -13979 -15824 -13292 -7104 -9086 1648 19938 23127 16405
24180 16405 3173 -11734 -13894 -2914 4970 9434 7265 -6043 6582 4914 4429 14580 10551
24167 10551 768 399 -520 7354 11542 21900 11372 13463 10848 14257 17448 23862 12317 -18
24153 -18 4948 12228 1416 1645 11340 3386 -2767 -7756 -2547 18222 9661 4326 10169 14863 15395
24138 15395 19254 14524 8428 8110 -2866 -12701 -11998 -19576 -22155 -20811 -11905 -10106 -1649 6519 13625
24123 13625 7498 -356 -791 -5693 -1614 585 -1965 -15603 -13318 -14611 -12519 -20812 -11184 11725
24109 11725 22452 28661 23653 16998 -3770 8184 21158 8492 -4265 -6236 -8556 13 -9621
24096 -9621 -24524 -25451 -19949 -18948 -27848 -35590 -28517 -15139 -14779 -7808 10758 4298 1611 10698
24082 10698 15995 22703 25909 17324 11320 9907 9899 2004 -15858 -23162 -24638 -30157 -35220 -23368 -10407
24067 -10407 6693 -5839 -15168 -19206 -7852 10897 18222 10949 12056 -1742 4941 11764 -176
24054 -176 -123 -2348 -5316 -5776 -15198 -11933 -14271 -13544 -6222 -5647 -1299 -2532 -1851 -7422 -3956 -2586
24038 -2586 -25208 -12495 2521 29 -1740 3723 -12534 -16031 -429 -7914 -10977 -10247 -7465 -2968
24024 -2968 3142 -10642 -4212 4867 59 -6285 -13820 -12297 -7267 -3442 135 -6197 -7130 -13258 -12926
24009 -12926 -5711 -1704 4020 -10571 -13224 -4259 -4725 -1372 -4723 -12774 1194 14256 14954 9437
23995 9437 21339 20274 14752 2167 -1878 -1039 -2837 -3791 -5536 -3546 8376 5433 214 10695
23981 10695 10950 3669 4194 3565 -13278 -18465 -14022 -10189 -9486 6982 13824 11914 5762 -635 -16317
23966 -16317 -21148 -36517 -24667 -11205 -3019 11982 25202 23363 21831 16034 6510 -3164 -2608
23953 -2608 -2322 -204 -5565 -18068 -31440 -25810 -2986 -9046 -16072 -11131 2335 1781 3954 -7443
23939 -7443 -7695 108 6269 5351 -2413 -23063 -30905 -26626 -7389 9086 -8190 -5961 -5441 -11935
23925 -11935 -15865 -20062 -27278 -28800 -29383 -33950 -27416 -25433 -24179 -19704 -17502 -10796 -5440 -1881 -5446
23910 -5446 -629 -5870 -9122 -8637 -3277 -752 -3340 -1082 521 5132 7274 -217 -11473 -14694 1485
23895 1485 6192 9144 2434 -14704 -10627 -625 2249 17932 17789 22113 27285 8776 -8859 -13516
23881 -13516 -15461 -18768 -11733 -6012 3675 -2660 -3842 -8859 -11918 -10682 -6055 -5982 -9921 4630 19391
23866 19391 18765 12059 13589 10887 -1728 -3999 -3455 -9122 -7115 -2836 -10692 -3643 10588 25537
23852 25537 40730 40957 31788 20969 21213 8690 922 -6396 -2636 -1781 -9075 -13663 -19476 -9879
23838 -9879 -3899 -2065 11026 13771 9250 20625 15914 7758 17 1282 23767 34507 34889 14160
23824 14160 -3654 -2834 2339 7444 9804 10446 -10574 -10600 -17615 -15433 -18550 -4424 6502 6329 -234
23809 -234 -22589 -29302 -24039 -8962 5916 -2118 -11283 -13232 -15514 3226 10893 5033 10050 12047
23795 12047 5949 -4579 -8023 5567 15272 13958 15923 23512 38222 31480 25769 20510 3591
23782 3591 2237 4751 2149 -15025 -19696 -13935 -8116 -12657 -10774 -8711 -17352 -34177 -20913 -8556
23768 -8556 -4834 -8331 -16229 -10369 -5195 -7598 -6778 -7873 -3505 4729 10105 17285 17889 11676 5156
23753 5156 21 2592 -2076 -16946 -9310 7571 12283 16508 6489 6793 1675 -2193 -399 20511
23739 20511 14743 5955 16948 1238 -13410 -22482 -19450 -575 1894 -3845 853 -7989 -14497
23726 -14497 -22105 -29036 -17431 -21423 -15820 -7426 8983 11051 8971 11899 10371 7063 7712 10729
23712 10729 11353 7282 -995 -1430 -1578 -7958 -6652 7059 24398 26122 11971 -3608 -2022 -1654
23698 -1654 -2997 15143 17459 14805 11215 7762 -4753 7830 18726 18908 22047 21704 5439 -5432
23684 -5432 -2776 -4731 -3896 2749 -8678 -12851 6214 8349 4618 -8474 -31338 -25027 -16930 -14043
23670 -14043 -15686 -10066 7280 10671 -6429 -26757 -31908 -27492 -13348 3457 1757 -4974 6910
23657 6910 -185 -3869 -2502 -1673 -5592 -529 11146 9232 3674 6233 -2774 -1750 1496 1468 1299
23642 1299 4234 1732 -4407 8142 6020 8057 182 -9463 -1374 -2074 -11480 -29079 -13798 -5315
23628 -5315 -6826 -9567 -14074 -15937 -22063 -35368 -31331 -17722 -6002 2707 2186 -2242 -10276 -16164
23614 -16164 -6253 -1631 -3592 -14547 -12316 -3748 4127 4839 -4390 -5746 -8082 -13655 -19190 -12555
23600 -12555 -5565 1422 -4418 4482 21873 17701 707 -98 4379 14232 26139 17635 5625 3748
23586 3748 3085 -9510 -31940 -33516 -33070 -20734 -19248 -12399 -8812 -16420 -13717 -9549 -3203 4480
23572 4480 5322 6964 3712 1492 -6838 -11549 -10985 -20529 -18327 -7930 -7049 -14485 -17978 -4450 -463
23557 -463 -3017 11031 12034 16811 24838 17949 1541 -8816 -18802 -11651 -11711 -6425 -12999 -24480
23543 -24480 -26873 -26243 -21993 -19092 -32055 -29885 -20399 -13431 -18042 -14577 -8491 -7603 -352 -7898 -18495
23528 -18495 -1831 -436 4994 11338 15948 9208 5034 8848 6385 11290 4475 -1556 -2844 -8593
23514 -8593 -857 10530 9094 4749 10757 21400 22164 11085 10670 12814 347 1304 16053 2014
23500 2014 -10339 -12090 -16374 -5490 4151 17856 7066 5340 8817 18333 17212 21413 22220 24655
23486 24655 37095 32528 29116 28437 15631 3801 -7291 -1255 3714 6684 10785 4410 -4503 -8312
23472 -8312 1150 8713 6159 -2078 9118 13210 -195 15348 18050 11005 -2239 -5701 6214
23459 6214 384 -2817 -12571 -5848 6625 10415 1170 -985 289 -15207 -11607 -10741 -22223 -18923
23445 -18923 -17180 -11879 -9101 -5420 -15387 -8828 -5929 668 -2547 -18033 -21909 -22846 -5511 -8910
23431 -8910 -9421 -1226 -3599 -7943 -7566 -2254 6429 9913 8780 4001 15865 21263 7068 -1237 332
23416 332 6139 2295 445 -7157 -8735 -7975 1209 -1569 -5405 -2589 -68 5765 -5147 -18593 -22140
23401 -22140 -33995 -24319 -18424 -28131 -28651 -16332 -13445 -23123 -18555 -10469 -1212 21631 16057 7521
23387 7521 10376 6313 8401 11910 3709 -212 279 7998 3662 7116 12989 3682 -7704 -7193 3850
23372 3850 4425 -1668 -14840 -14738 -8078 -744 -724 -12620 -9821 6638 -1901 3234 10053 4599 -1863
23357 -1863 -6844 -16661 -25087 -23422 -8965 -7096 -2317 -413 11485 -2472 -13602 -8934 -18585 -19784
23343 -19784 -20933 -16080 -11745 -16704 -4863 -8190 -13149 -19203 -10863 -6875 -6674 3430 3420 -7270
23329 -7270 -2974 8245 8864 25873 37683 15200 8661 22046 21011 21468 26947 25138 25379 11429
23315 11429 7991 8884 11018 16411 18613 18171 21290 15712 -7782 -14228 -18406 -18343 -17781 -22839 -24839
23300 -24839 -22317 -22455 -16031 -4723 469 5118 2640 3017 -9793 -19942 -13061 -429 -1637 -2892
23286 -2892 -6224 -6242 -6429 3333 8321 10970 16974 10636 -5706 -10667 -4528 3942 12567 -2701 -18099
23271 -18099 -14713 -11756 -2648 10702 9223 -275 5534 -4398 9326 6363 -6243 -13618 -11066 -11977
23257 -11977 -7601 -28900 -37076 -29618 -17660 -5501 -1170 -14509 -9314 -4231 -14559 -6470 9213
23244 9213 377 1922 7512 15810 12287 -131 7336 9730 -1631 6464 8199 5268 496 -3737
23230 -3737 -1489 -6068 -15460 -12023 -10876 -16999 -11003 -10695 -3946 2218 11089 17601 26357 19539 21640
23215 21640 23184 15874 -3625 -7872 1531 2443 -1757 5790 11228 -1839 -24351 -30023 -23267 -248
23201 -248 4270 5223 2117 2024 7534 7256 12992 17384 3538 7012 3308 3195 7704 307 11930 9850
23185 9850 9746 12996 8503 6354 7945 1252 890 7343 16281 24101 15334 13502 8851 2640 -8242
23170 -8242 -10323 -6539 750 3269 8757 14134 5121 438 -11077 -9912 -11638 -6805 561 -2971
23156 -2971 2464 9484 15508 14351 3317 -44 15894 7753 -9071 -7293 -1673 -3720 -1454 2704
23142 2704 4282 -6463 -494 5298 1677 2078 8259 2328 1966 9622 3372 -3357 -4739 7227 16089
23127 16089 18743 20375 24388 6629 -13887 -16297 -10292 -11145 -11789 -29427 -25799 -10910 -7715 -7256
23113 -7256 -2537 2444 -8664 -17407 -4638 -7065 -1357 8708 5855 1625 -14969 -18395 -16030 -9173
23099 -9173 -1971 10782 14651 14420 16071 656 -22796 -22786 -9765 9508 23420 21808 6673 -6790
23085 -6790 -4819 13116 9095 -7891 -16317 -8932 813 5501 2935 -269 2215 -6121 -11213 -3679
23071 -3679 543 -128 4092 4086 81 7492 2776 -4222 2259 -2600 -6460 -4787 -6287 -9770 -3661 -526
23055 -526 6403 -3077 -13737 1623 4405 2015 2296 2236 -15929 -23582 -14902 -1699 13202 12311 -15231
23040 -15231 -18519 -7689 -10007 -17723 -25832 -12530 -13673 -12408 -11497 -1456 2028 -1293 -14952 -18977
23026 -18977 -15636 -3366 -8200 -7496 3587 -691 -8189 -3771 -6700 -6830 -3018 -3341 6240 23577
23012 23577 33376 21920 24677 30997 15731 6266 1979 -3913 -5232 87 17750 28633 14640
22999 14640 4191 4828 6662 15284 3196 -12679 -9772 4805 11604 3765 12421 8779 -1720
22986 -1720 9793 10367 8864 16727 18832 17688 25939 25353 17930 28670 38039 27556 23615 10139
22972 10139 -768 5868 16789 11706 1773 -4712 -17566 -21192 -15994 -5781 14920 7329 4155
22959 4155 14133 9799 -5070 -11736 -8661 11162 1907 -13438 -15286 -11431 -8614 891 2898 15614
22945 15614 22410 18289 15144 9639 15429 6515 4506 17056 14175 3328 -3179 -8673 -15748 -19694
22931 -19694 -7118 -1187 -1907 8846 22497 18966 9301 -8726 -13281 -8327 -10415 -8408 -3590 -7495
22917 -7495 -3580 811 -7006 -2655 5969 1805 11139 10036 3548 -2173 -2438 1378 6973 8224 7091
22902 7091 6687 3387 8049 4336 -8647 -14926 -8909 2244 -10147 -27865 -18600 -19112 -2944 10134
22888 10134 7088 -617 -6772 -3808 6114 13129 13433 10548 5426 3063 7076 3700 7281 11229 11841
22873 11841 1968 -5249 -756 -4511 -8448 -15921 -12658 -8680 -8744 -24368 -29817 -19617 -16248 -19426
22859 -19426 -24944 -34578 -24440 -19424 -14148 -15266 -10181 -11714 -9959 -8918 -16946 -14831 -9299 -206
22845 -206 10312 -2628 -17224 -10893 -1867 5324 3605 -2043 -8253 -14738 -13306 -10437 -11127 -10265 -4148
22830 -4148 -6087 2525 6478 -10623 -12482 -8717 -3981 3827 -6228 -11044 5633 19598 -487
22817 -487 -23408 -14233 -2780 -6765 50 -3733 -8092 -14353 -15800 -5865 -9388 -7033 -3639 -7852
22803 -7852 -21462 -21712 -19545 -17517 -13728 -13127 -23340 -30331 -34087 -18467 -8893 -22112 -21763 -11535
22789 -11535 -18331 -17236 -16360 -15859 -3877 3637 -10186 -7781 4298 8765 17231 18975 17309 23793
22775 23793 29582 36791 22685 12415 9481 11953 7371 9827 5332 -4740 -19591 -29625 -18069
22762 -18069 -3264 -3943 -8753 -9001 -7042 8143 9123 -5082 -7837 -7215 4952 8839 488 141 6627
22747 6627 -6642 -10406 -1751 -3345 3362 7128 -8401 -14091 -3779 2475 -5729 -4778 -14115 -15543
22733 -15543 -19282 -15178 -1627 3867 -942 -4137 -5466 4579 9177 -3486 -4914 10466 14401
22720 14401 8683 5006 8088 -5166 -1606 -7178 -16382 -4007 2549 -3671 207 -2835 -7035 8397
22706 8397 6451 2413 2059 -64 -14084 -16977 -19962 -22808 -13597 -3805 10416 12102 9823 10030 -1011
22691 -1011 -4614 -3198 -4097 -3553 -10086 2377 -7739 -17509 -22350 -22621 -2732 -2633 6747 21354 30085
22676 30085 27601 17254 21544 19616 24769 19354 10777 5191 269 4060 4732 -2311 -12088 1866
22662 1866 3433 -4551 -5198 -13566 -14721 -11186 -9335 -4219 -16487 -9211 -18454 -27764 -22194 -10089
22648 -10089 602 -2941 -8125 -10880 2370 5679 -594 6857 11925 14088 9635 5824 -4664 -3009
22634 -3009 -7124 -2341 6450 7702 6614 8335 1849 -16448 -24718 -20378 -19077 -17990 -1365 -3338
22620 -3338 -7542 1056 -1522 -5586 -14132 -10339 -4726 -8029 741 -3935 1112 6137 3345 -6522 -3738
22605 -3738 1465 -3118 737 852 -927 16023 23344 8254 13250 6768 4840 3010 620 -14537
22591 -14537 -21626 -19257 -13167 -6534 -9589 -1260 13189 8324 7362 -6251 -27954 -27032 -14062 -12576
22577 -12576 -16086 -19299 -3375 7733 7832 24732 19695 11936 812 -7189 -16022 -1302 2747 485
22563 485 -1295 -82 2824 -1049 7000 -4971 -15670 -12865 -7173 -6039 1183 -309 1731 11941
22549 11941 8033 13419 9253 -2094 -7640 -667 -4518 -8494 -2268 -4201 -5974 -11790 -9326 3859
22535 3859 11813 25595 26143 -1015 1803 155 4618 5534 7505 -9083 -2911 9150 14369 14024
22521 14024 -1884 -4775 4025 23684 23247 11316 -4127 -15159 -16088 -13082 -6331 -12226 -9193 -5282
22507 -5282 -10672 -16440 -7923 -8953 -8509 -3506 7119 -1370 -21803 -32788 -28806 -30813 -23967 -12295
22493 -12295 -16227 -5504 226 -123 -12523 -19624 -18796 -25862 -17842 -9369 -8860 -9689 -8366 -3029 7120
22478 7120 12625 17418 29762 34885 31168 4570 -7479 -14493 -1280 9147 13478 19611 14042
22465 14042 -3434 -7583 -2231 9295 18967 14198 8201 18501 17743 10560 7138 989 -12932 -15700
22451 -15700 -11510 -3416 -16390 -15390 -6100 -2909 -3045 -8783 -16229 -12116 -9511 8353 5463 -9966
22437 -9966 -12484 8127 8383 8912 5858 7593 14369 12145 12870 9634 2727 8973 20964 31945 29259
22422 29259 10726 290 -12625 -24951 -21290 -10041 -6207 -7463 -5864 -8014 -6516 5289 12452
22409 12452 6705 7261 2505 -1099 5923 -3255 -14841 -618 13708 1619 -172 -760 -14435 -13267
22395 -13267 -11948 -16949 -2093 -1164 -1550 -10728 -11870 -12017 -12951 140 19969 12435 -4849 -22984
22381 -22984 -21893 -10210 -1043 1892 -11185 -15413 -17107 -18650 -24920 -2272 -2167 1890 11128 9039
22367 9039 3428 -342 3458 12520 18661 12789 1592 -2851 985 10960 5004 9381 -4399 -20231
22353 -20231 -17814 -13167 -1013 10279 3355 1669 21015 28423 9282 5028 7305 3021 -496
22340 -496 -3287 -6104 -7765 -8925 -10542 -19472 -21145 -3411 11546 8704 -1503 -16049 -14882 -3955
22326 -3955 -2113 -2202 -10749 -8599 -7164 5486 24318 20902 7805 4466 889 9479 -426 1865
22312 1865 5816 8806 3826 4575 3571 7294 1880 -7912 384 4835 -3223 -192 -1449 -5987 -6622
22297 -6622 4533 14483 11361 -4697 -8747 -3306 3291 7184 18176 16242 8566 -2021 -8444 -5593
22283 -5593 -96 12946 17543 20956 23905 9299 -6357 -11375 -9246 -11745 -7700 -3344 11815 21509
22269 21509 10966 -13436 -23089 -14261 -17823 -23910 -18113 -26082 -28617 -19037 -13568 -507 3098 5198
22255 5198 -2157 -11594 4767 19494 14577 8679 -2356 -1761 -11684 -12736 -12372 -21827 -27339 -20692
22241 -20692 -19832 -9248 -2531 -4825 -1670 -1521 7626 -641 -12009 2894 7403 9017 10809 15509
22227 15509 2251 -7842 3545 8597 12093 20291 5954 7457 7183 316 -388 6232 18947 15867
22213 15867 -7451 -20944 -3590 -1182 957 5915 -3948 -5594 -12932 -1185 654 -8025 7720
22200 7720 19516 13508 19529 23515 6640 -11308 -9135 -17591 -27593 -34658 -26254 -27884 -29352 -25920
22186 -25920 -23161 -14839 -12254 -21525 -22075 -26765 -19227 -11981 -8315 -1395 4434 3845 -3564 -10262 -5005
22171 -5005 -4095 5447 15695 18433 2887 -11158 -7555 -3201 -17576 -16790 -16086 -14355 -10996 -8933
22157 -8933 -14955 -2471 3784 16542 2762 -2240 -13559 -13288 -18539 -11259 -3820 -9490 -5938 -1414
22143 -1414 -1903 -7596 -15917 -20828 -12891 -5908 -735 7743 20468 28223 10385 7516 -536 -4062
22129 -4062 6823 153 3085 21935 22352 315 4266 19117 21946 -3450 -13655 -5698 928
22116 928 -1538 7705 17361 9689 7649 9681 -1751 -12257 -6845 -3308 -2217 -3567 3051 -119
22102 -119 -4830 -4937 9789 5431 6480 8332 1673 -4828 -1799 5874 7249 -272 -8900 14904 8303
22087 8303 -11535 -8341 7310 1233 347 8323 12689 5617 19328 27951 31363 31028 23638 28067
22073 28067 21453 4922 -4607 3495 2241 5126 2119 2061 12774 10305 6028 13167 10796 16875
22059 16875 11071 7821 1050 -2076 4243 14592 13586 10937 2036 3570 7804 16149 16999 18934
22045 18934 13472 -1441 -9577 -4745 -6528 -11011 -2867 -6368 -15010 -7185 -6169 -7328 -3590 4979
22031 4979 17309 24668 18951 10865 6349 17856 12113 2877 1019 19997 28080 15094 3551
22018 3551 -3655 -8627 -5724 14802 32508 29106 13234 12148 13927 2414 -1810 2405 8689 4777
22004 4777 12691 15283 19660 13093 11444 2129 -12734 -20769 -3658 2290 4032 13164 789 -13838
21990 -13838 -12842 -2753 -4024 -21162 -18928 -25179 -17437 -6075 9143 7194 -5076 -24695 -22466
21977 -22466 -1144 2774 -8301 1479 8380 1867 -5043 -6144 -4688 -6526 -393 3755 3504 8196
21963 8196 10312 9860 -5988 -8332 -10220 -6901 -16119 -24168 -25318 -19497 -14280 -13662 2329 3379 4147
21948 4147 6193 8121 -1725 344 1186 -4163 4227 6852 9009 -1245 -3241 9076 24764 16743
21934 16743 15658 21136 17333 6989 -9846 -19387 -10579 -3182 15803 17821 17441 13205 3484 -4960
21920 -4960 -12566 -18314 -24306 -21659 -20832 -15672 -6982 -7910 2166 13110 7163 -7788 -1922 440
21906 440 -844 5661 6495 693 -4588 -9022 -9189 -3064 -6370 -2769 5551 -6685 -11488 -390 1580
21891 1580 4632 -6332 -4480 -8978 -6291 2080 3631 6173 10772 16376 15253 -5991 -12122 -7856
21877 -7856 -13161 -16896 -7862 -7175 -1268 2437 -9664 -12771 -8388 -13346 -14254 -24574 -42404 -33018
21863 -33018 -17801 -31780 -33392 -22997 -16946 -19551 -5170 -93 -7865 -924 6227 -12585 -21254
21850 -21254 -23257 -23086 -16317 -5789 -4371 3979 7964 19403 24452 13531 -3964 -17335 -27720
21837 -27720 -16157 -1804 -1435 -7135 6095 3503 -8454 -12504 -1408 375 -3101 -3991 -2867 8251
21823 8251 19663 22305 9235 -5348 -10671 -13982 -17009 -24078 -22285 2105 -3303 1369 9771 9026
21809 9026 2946 -1088 -12480 -12455 4136 6675 11841 12264 12939 13126 6970 6603 6903 21498 18548 11385
21793 11385 9720 5465 10377 6283 4418 11248 7188 -1161 -6278 -11695 629 6488 -3740 -10663
21779 -10663 4154 -2831 -9916 4180 4586 -3739 -13193 -19665 -31292 -22149 -7952 -2539 12583
21766 12583 24041 10602 18631 17175 7591 11554 13526 5803 8611 3563 -1721 4001 -8521 -12356
21752 -12356 -7147 1163 1765 -3304 831 9412 -2973 -17285 -7249 -3163 -16075 -32696 -28508
21739 -28508 -22042 -21508 -10434 -6903 -9490 -5951 3657 9725 5181 5224 -1110 1621 4313 22861 17606
21724 17606 12683 4449 -2492 -14125 -11748 -6372 -6703 2103 -421 -579 -2546 -8087 -4944 -8169 -13579
21709 -13579 -18827 -11781 -6703 875 -773 455 -330 7356 -4703 -13569 -7473 -5263 -6082 -3342 -12102
21694 -12102 -9401 6363 14206 10015 6090 -18163 -24899 -4821 20842 19264 3139 -10861 -16688
21681 -16688 -19388 -23635 -7326 2686 -1249 -8936 -9444 -7090 -14558 197 5703 5011 14017 22808
21667 22808 31916 33392 11005 -12729 -18297 -20101 -10127 99 2508 10877 14448 10328 790 -4927
21653 -4927 -10755 -11221 -3177 -2595 6980 -1435 9738 7331 12172 16677 11740 811 1375 235 1486
21638 1486 -1506 -11506 -9634 -13016 -16494 -17871 -21612 -20173 -19602 -22732 -14097 -1569 8592 6485
21624 6485 -3934 -8769 10448 13489 5460 -1087 5099 -375 -1190 2860 -458 5122 22205 11860
21610 11860 11923 2967 988 3684 -1715 -472 13249 20529 26873 20895 7715 1889 8229 21320
21596 21320 21337 13192 -5338 592 9231 -483 -17337 -12750 -9292 1149 13431 -1462 -6081 -2049
21582 -2049 7601 1708 -284 -2711 -17679 -21192 -13844 -4450 -3200 -9608 -16331 -11713 -7318 -12480
21568 -12480 -8506 -1439 9167 731 -459 348 2367 3826 10199 9541 7497 13214 22057 14750 -1562
21553 -1562 8147 10388 -8000 -14295 -864 -6729 -19549 -23364 -26312 -10197 13237 4578 -7031
21540 -7031 4886 2714 870 -3336 -1558 3284 6804 12122 7691 5429 -11428 -11866 -3795 -3195 -1565
21525 -1565 3489 -11268 -1865 10137 15781 5485 -5923 -12210 -10766 -4226 -8958 355 5686 -6130
21511 -6130 -26578 -32501 -17099 -21074 -19381 -19292 -23938 -15082 5305 7013 5292 15965 19701 18491
21497 18491 10147 3848 1099 5522 1076 -1744 7890 12638 8841 -815 -11512 -14773 688 7085
21483 7085 7332 -1395 -13737 -27978 -23283 -14398 -25700 -17770 -10487 -10934 -13250 -19098 -37699 -44202
21469 -44202 -27816 -14077 536 -1552 -8295 -14140 -6345 -1184 -3361 11658 20493 5351 777
21456 777 -2835 -3825 -6471 -7258 -6077 -24919 -22374 -12463 -13040 -14637 -26205 -25558 -17971 -11271 11436
21441 11436 13929 6876 -6803 -18119 -13357 -294 11532 13334 1733 -2460 12728 15286 -2263
21428 -2263 -15041 -16345 -17085 -13598 2174 4040 -8247 -11663 -12588 -17743 -19901 -12569 -4723 7966
21414 7966 5067 -138 4204 9738 13599 1969 789 -11237 -11064 -7232 3259 3411 1419 -2816
21400 -2816 -9815 -4019 525 1135 1918 -5160 12886 13070 4629 -7945 945 5354 367 -909 4114
21385 4114 16772 4848 -6132 9292 22156 25542 18599 4067 -2650 -3260 2156 1002 6220
21372 6220 16735 12388 686 -7793 -2923 10860 8120 -6857 -10386 -22282 -32605 -17891 -9298
21359 -9298 -11005 -16517 -11338 -10066 -12231 -5680 8227 12160 10685 12464 17005 24743 23343 17127
21345 17127 2943 -12723 -14129 -15795 -17216 -8056 11020 10327 7017 3186 -3552 -6293 4163 7038
21331 7038 8200 6712 -9714 -12893 -9920 -6448 -20308 -24500 -10296 -6364 -11614 -19090 -19200 -19911
21317 -19911 -6286 -2962 7836 13353 4644 7093 2427 -6498 -22402 -28692 -20102 -10401 1955
21304 1955 11037 10609 5775 -2080 7474 21593 24571 13284 16248 12320 -1023 -15159 -17664 -17064
21290 -17064 -12163 -17751 -19501 4215 18204 10205 7728 4331 -2454 -11650 -17048 -25123 -37419 -36248
21276 -36248 -16828 -1115 -10091 -8916 -7109 2666 15809 16005 -7274 -17444 -17180 -9880 -12790 -13852
21262 -13852 -13923 -20676 -21032 -15409 -6719 4088 343 4681 12902 -866 -10709 -14621 -15534 2885 7556
21247 7556 -8234 -21647 -23205 -9882 -7535 -5944 862 -4542 7466 531 -5020 -15813 -10199
21234 -10199 -4793 -6201 -6654 10393 1920 -3871 6325 11161 18962 25917 15012 3026 4744 2652
21220 2652 4378 8266 -7219 -9678 -3656 -4613 -7992 -5684 1677 5115 8860 8047 21 749 15274
21205 15274 15557 3639 -2556 54 -2047 -6636 -17853 -22042 -21439 -10034 -5009 1509 7719 6729
21191 6729 3562 1207 -1481 -15853 -19703 -10190 -5440 -15508 -26075 -5847 10294 5398 4289
21178 4289 -7337 -8020 -2185 -491 2910 -11327 -12939 5185 11772 3615 -7017 -15865 -7569 -3928
21164 -3928 -1105 -226 5776 5886 -7238 -11737 -5461 -22026 -27689 -16996 -4101 5448 -489 2131
21150 2131 -812 -1201 -2442 5343 11590 10590 15460 12680 11397 4913 10736 12424 8909 12193 15334
21135 15334 20232 6319 7561 21676 17471 3408 3712 3958 695 -9010 -1300 10160 -3880 -3150
21121 -3150 3703 4310 -3403 10743 -2772 -15861 -7412 -9068 -14209 -4420 -8318 -9349 -535 13918
21107 13918 18826 12986 7666 11819 29616 28113 24947 22866 25460 15954 9171 3818 -5067 -5742
21093 -5742 3506 8224 13416 12807 16576 -4665 -5636 7736 25866 20753 9543 16281 29556 26332
21079 26332 881 -5806 1436 1340 8120 23739 30499 35473 23453 9760 9613 14278 16713 6252
21065 6252 -271 -12496 -11371 -4317 -9033 -12799 3013 -558 -5638 -7132 -1480 2773 8768 12115
21051 12115 6046 -3792 3387 4211 -1310 -2399 -4900 -9931 -7258 16444 19076 3260 -9036 -19311
21037 -19311 -22427 -28370 -20497 -6681 -9892 -17294 -32325 -26826 -13357 -7951 -784 -14311 -15821
21024 -15821 -18714 -11422 2656 1117 -2476 -10780 -24488 -24391 -9801 -508 -105 1183 298 -1658 -6303
21009 -6303 -10200 -16752 -26693 -25774 -13386 -9792 -17410 -16024 -3249 1195 -4117 -12870 -15222 -23436
20995 -23436 -30593 -33645 -38717 -32598 -12507 -11226 -4776 49 -20955 -21035 -10983 -3790 -1582 7423
20981 7423 -717 7253 15231 4491 -1351 5760 16777 9019 13253 16539 15532 -5780 -13793 744
20967 744 7542 1290 1040 -5779 -1754 10087 19448 10249 -1266 -1339 -16711 -22175 -31185 -31425 -29276
20952 -29276 -27197 -15855 -14537 -7140 5813 2846 10137 18270 11819 5008 -11941 -11928 2895 1402
20938 1402 -9038 -11426 -9482 -3321 -1750 1354 5108 1987 -6120 -3328 5231 -5658 -6519 -484
20924 -484 -7002 -921 11755 1369 -11681 -16190 -10857 6193 15818 19801 17990 4742 -6433
20911 -6433 8722 78 -5208 7473 19472 12291 1836 -3701 2147 5767 -4288 -6318 -7581
20898 -7581 -11937 1392 10178 13324 17366 8924 9431 16541 12572 8633 6494 130 -2560 -18696
20884 -18696 -23989 -22077 -23537 -22444 -31169 -36269 -26602 -8794 889 5410 -3622 -5552 -8159 -4160
20870 -4160 1017 1797 1228 -6836 -9465 -8395 -13615 -15905 -26081 -28276 -12169 -2394 436 10698
20856 10698 8639 10523 11359 8067 8960 7362 -2191 -6345 -20432 -27379 -23439 -13248 4857 13708
20842 13708 2215 -2071 613 12832 1256 -2474 2871 -104 -9001 -20759 -4829 2364 -4117
20829 -4117 -1463 2018 6667 15049 5076 7529 9215 567 10405 19087 377 860 2878 2069 3388
20814 3388 6336 4683 6800 295 -843 -6537 -5462 -12385 -18104 -18512 -6654 2682 8978 10952 4669
20799 4669 -7536 8455 13246 17161 11316 7859 2395 -3290 -12149 -13524 -14277 -16692 -16720 3583 18923
20784 18923 20856 6613 -10648 -18910 -22347 -11197 4619 8097 -6033 -15747 -18284 -8342 -1898
20771 -1898 -11 -3547 -7510 4967 -2358 -7735 -15540 -19395 -6793 1804 -1685 -312 12243 11937
20757 11937 1190 4773 14145 16586 24284 14217 10694 1312 -6256 6965 20164 6519 -5463
20744 -5463 -9042 -13092 -19739 -25839 -8951 -1993 5123 5164 -872 -7837 -21959 -31133 -19213 -1231
20730 -1231 3819 10031 -5773 -15821 1080 25238 34637 35964 23296 22169 13504 11830 8304
20717 8304 3949 -482 -5025 -6096 -10217 -9589 -9333 6718 13386 20017 17773 11117 18743 24877 23626
20702 23626 32765 33721 13910 5113 8923 11609 10480 193 -12877 -7577 -3687 4371 4689 98
20688 98 3191 9659 19148 29125 23995 11119 3286 -1177 -4678 5375 1708 -5742 818 -158 -2163
20673 -2163 -15796 -27044 -8705 -7347 -7462 4395 3275 6195 7110 12918 27466 13790 -620
20660 -620 -13626 -11685 -5578 -2656 7221 23998 15897 -1887 4112 2929 -9637 -13794 -19881 -13394
20646 -13394 -2737 -12391 -17577 -11773 -18459 -36658 -24393 -24799 -22332 -7669 -1500 -3689 262 5344
20632 5344 13773 15760 9903 -2673 -2666 8422 13211 25657 16136 2659 9606 22177 14860 13246
20618 13246 25581 10129 3556 21339 8874 3189 1928 1189 -2784 1617 4439 8781 17246 23256
20604 23256 23139 27359 -768 -9424 -3820 -7779 -13601 -7873 -6896 -16771 -19717 -24780 -26035 -23122 -3539
20589 -3539 733 330 -18611 -20694 -11985 -5368 8714 17684 13210 -7185 -9501 -9478 -11354 -1663 -1234
20574 -1234 -4522 385 11293 11647 13998 21996 10187 -12905 -23307 -18465 -10878 150 3361 8315
20560 8315 7653 14998 25138 5607 -19347 -17501 -5585 6658 5540 1107 5228 15018 12839 13191
20546 13191 13270 12239 3304 -10157 -4550 -17236 -22674 -30663 -30573 -20016 -15575 -19713 -22683 -29634 -32755
20531 -32755 -13185 -3489 -2087 -1608 4504 10677 5503 957 10641 21276 8432 -8139 261 -9678
20517 -9678 -22934 -20624 -15241 -9517 -15041 -24290 -32243 -14360 5643 6954 -1911 -2234 5389 -6280
20503 -6280 -10283 -2204 -3080 -3029 8869 18609 10536 7955 -3085 -20264 -9050 9875 8498 -12475
20489 -12475 -8825 -10089 -3336 1845 -3298 -16348 -15874 -1394 9199 2025 7631 4785 -605 10722
20475 10722 3005 -7326 -9014 230 -5833 -6678 2705 13001 22918 16926 -1525 -22598 -18863 -9395
20461 -9395 -5676 5707 11773 20363 24434 17991 17707 12460 5481 -1872 4125 10597 7239 2132 4728
20446 4728 -689 -7417 -5744 2353 4818 3087 -1461 7361 10102 5521 15315 2146 -10113 -2627
20432 -2627 429 17644 43928 46021 19517 -5573 -7666 -1330 -6945 -13858 -17825 -8001 -2781 -5914
20418 -5914 -11477 -4171 153 11308 4522 -3065 -6793 -7591 -10447 -14005 -11429 -12764 -1022 355
20404 355 3942 13283 3862 5954 5916 1286 -3796 -6771 6898 15023 10329 -560 1080 7825 -14269
20389 -14269 -21515 -13147 -3870 -8913 6195 23208 25688 30801 29731 16158 4129 -1596 11638
20376 11638 10853 5444 5136 12182 23152 18597 5333 12948 31546 42529 43898 36100 11458 9426
20362 9426 17906 17341 21295 19324 3441 -712 3106 11713 17185 16048 15732 9910 9578 6063 4909
20347 4909 4255 -7721 -12890 -7406 17587 20926 8973 -1730 -96 -6528 -14595 7868 1308 -10420
20333 -10420 -18011 -6603 -2483 -578 -1136 10021 17416 17882 6639 -16292 -30950 -22796 -2380
20320 -2380 3204 11139 29866 32258 -4432 -3402 3740 -8268 -13825 -5987 10513 11115 -1579 71
20306 71 -12272 -15790 -14471 -14818 -23477 -24263 -13016 868 2326 4241 6081 -2133 -11311 -2299 -238
20291 -238 -732 2962 -750 -3558 6666 -2368 -10551 -2990 7707 6652 2240 -3413 -1920 -8455 830
20276 830 -13313 -9809 4693 805 -8682 -14265 -20851 -7459 -9601 -9789 -2021 -4604 -9529 -8085
20262 -8085 -12629 6910 12109 12092 17685 16377 18184 9611 -2373 4538 24306 37851 29135 4795
20248 4795 -11860 -17809 -21912 -24583 -7058 -7613 -21129 -7850 -535 5056 21865 21152 11049 16692
20234 16692 13503 -834 1202 9931 10296 824 -20355 -29606 -35526 -31934 -14997 -10900 -16993 -7259
20220 -7259 5187 1452 3059 -891 1838 6806 -599 -67 -11327 -302 10658 10317 5808 7441
20206 7441 13626 10927 8125 2240 3526 5579 7121 9227 10757 -8900 -19295 -13174 -14014 -3191
20192 -3191 19574 20996 24850 13493 -3371 -3975 1721 8183 21734 21572 17368 14988 6514 -8740
20178 -8740 -12668 -18807 -14534 -3664 -7434 -5573 15983 34754 45556 31002 26695 25427 18447
20165 18447 17327 4033 -6035 5670 12760 8851 7920 2784 6626 12416 24453 21610 19626 8293
20151 8293 7983 15385 12786 17157 13721 12101 10906 16156 14297 12800 9808 -15162 -7750 -6109 -2449
20136 -2449 3098 10653 8614 -12888 -13386 4765 7266 9795 11464 11017 28574 30728 35446 30107
20122 30107 25887 18139 10743 2257 -3169 2170 8979 20112 13907 -7651 -5727 19258 14528 2496
20108 2496 3622 17529 1731 4902 -198 -3109 11789 24519 14851 5937 7440 8591 3645 -7294
20094 -7294 6632 13286 4544 3459 10921 10508 4168 6030 7653 8409 12502 -3213 445 14252
20080 14252 27574 51403 52880 28040 19468 17574 5983 -8652 -5268 4791 -6562 -7869 8388
20067 8388 15822 16123 5251 5335 -6181 -10734 -2262 11669 22345 17759 15579 6264 -6737 733
20053 733 12471 -271 -19685 -23665 -14245 -25365 -16741 -7910 -5346 -3880 -14050 -13735 -12709 -11296
20039 -11296 -6255 -5164 14037 26787 29095 20163 3220 -4511 4422 15604 25371 16832 2619
20026 2619 -5576 -17806 -17080 -14643 -11866 -4515 7423 12452 16593 11895 -4482 -10448 2107 17531
20012 17531 19306 13321 3981 11603 9396 1811 5063 2100 12723 10192 6519 -2618 -5829 -3276
19998 -3276 -1158 -2005 2006 8413 7813 7728 3928 761 3348 8427 9654 1624 2624 2952 -439 -15766
19982 -15766 -21563 -20324 -31689 -31093 -27387 -19563 2069 1833 -902 3666 -19596 -31032 -29256 -12739
19968 -12739 -9647 -17790 -29177 -35770 -27377 -20766 -24989 -22475 -19457 -4648 5847 1809 -11401
19955 -11401 -22379 -17555 -1849 -12284 -24009 -25186 -15652 -22695 -25416 -20417 -20523 -6287 304
19942 304 -5652 -13415 -1810 1507 -6714 -46 -409 -7281 -115 -8003 -2135 -17438 -23420 -16402 -15178
19927 -15178 -12849 -24170 -27573 -22256 -14816 -15878 -22893 -8724 14892 24482 8145 -1762 15087
19914 15087 29905 33455 26540 17044 14742 5853 -596 -8825 -3140 3441 1823 729 4745 -740
19900 -740 -5262 613 -671 -10279 -9739 3403 -1789 -6184 -24649 -40329 -40103 -28427 -16882 -5714
19886 -5714 3329 1287 1116 7667 2958 -158 6429 4018 -7227 -13163 -18019 -26185 -19271 -10139 -636
19871 -636 8959 16586 14882 -960 -3959 -7429 -9768 -4267 5360 -666 4998 12410 -206 -10939
19857 -10939 -15044 -9200 7978 3460 -1182 1417 4703 15264 12947 18113 15033 4888 4491 -6854
19843 -6854 -14930 -23566 -23682 -21913 -25356 -13598 -11483 -3565 3048 -7743 97 5761 4728 2366
19829 2366 -8833 -4589 2274 15253 5367 -5238 2937 7041 1028 856 2761 2956 2263 10696 13235
19814 13235 12889 5746 3948 9140 12102 11616 15779 11943 5323 419 -6033 11177 15957 6745 6269
19799 6269 14579 4621 -10088 -11419 -9015 -3879 1689 -5969 -11359 -6776 -13438 -7842 2633 9000
19785 9000 9410 21122 36115 25623 25324 14057 8885 -10629 -8605 110 4844 4122 -2774 -5175
19771 -5175 827 9898 7153 7523 13221 14344 12041 1409 13558 23408 24322 9883 -8487 -10504
19757 -10504 -11293 -4009 2145 -1094 -3597 10175 11450 7144 8046 -2630 -3934 5487 19960 10577
19743 10577 16687 29763 38012 31214 10212 13854 18413 33796 15878 838 -1084 -4390 -4918
19730 -4918 -8331 -10536 -2616 -10133 -6961 -3369 -1830 4135 2393 -3600 -8085 103 7866 -6416
19716 -6416 -14131 -9837 12281 13446 13958 12644 -1273 2225 9455 10933 8059 -1258 7135 16133
19702 16133 10404 4302 -1735 2955 7469 7364 338 1706 -3249 13611 25656 13606 -2852 1803
19688 1803 1794 4613 959 -3653 -6707 -4539 -4367 -13385 577 15029 23629 15377 4402 -12173 -17582
19673 -17582 -26539 -11672 14333 14626 6741 -47 11487 18291 8436 -1178 -7906 -17087 -948 8870
19659 8870 -1390 -3532 -10906 -14608 -6613 -1446 -11511 -18257 -6984 2950 8303 3915 3774 13299
19645 13299 8021 1680 5011 8266 -4199 -15188 -15406 -5363 1642 7631 16379 16641 9479 805
19631 805 -3214 -2936 -6146 -3008 2651 1471 -10595 -11122 -8367 -10863 -5828 700 -8552 -10984 -11428
19616 -11428 -8108 -1122 6006 15126 29349 32290 16346 179 908 -3168 -6427 6038 19140
19603 19140 27263 25455 11416 11563 14880 15862 9324 5161 14528 4493 -7920 -11065 -13591 -1181
19589 -1181 6262 13331 17639 18346 3163 -12922 -12300 -8749 -1189 -12491 -15304 -17584 -7057 14551
19575 14551 19522 24536 11965 5767 5667 14106 12860 -160 -14279 -6254 6035 -1012 -7011 -1735
19561 -1735 5866 6467 11033 8853 1337 2695 9394 2629 -2423 -4367 -15314 -22615 -7096 5793
19547 5793 9052 11905 -6026 -14985 -3101 4767 1607 8841 14380 5789 13061 14672 7247 1604
19533 1604 -2672 108 -5404 -7682 -955 -3125 -3630 -9015 -19337 -11011 -16235 -14705 -11874 -2629 1807
19518 1807 17783 31424 29469 34127 28308 27904 32930 16088 8377 100 3403 16019 3339 -15953
19504 -15953 -15468 -5212 -3184 307 852 -12366 -11897 -1593 2571 4095 4057 2795 -4254 -6658 -195
19489 -195 -16451 -17727 -10333 -4494 -4422 -14811 -14158 -7041 -1769 649 12650 10872 1081 -14053 -13110
19474 -13110 -15089 -13427 -18071 -17180 -334 -12098 -11436 -7178 7761 6018 -822 2532 2299 -4600
19460 -4600 -2564 1432 17796 22248 3606 4052 5668 -2116 -14736 -26854 -16755 4068 3042
19447 3042 74 6060 3540 68 -679 13450 13887 -4020 -15810 -16912 -13701 -13731 -20485 -3589 5004
19432 5004 -1204 340 -9759 -6537 1391 7278 18654 4073 -4041 -13065 -18960 -11829 -3246 -10391
19418 -10391 -10818 -5639 -7730 -8018 -5883 5250 4472 167 5629 6131 -8453 -13379 -24042 -32242 -33856
19403 -33856 -23222 -17436 -12463 -14354 -9470 6700 24179 22261 13500 12299 -5227 -13983 -11838
19390 -11838 -2346 3152 -8521 -3149 2072 9716 25527 18074 3553 5257 526 2112 3383 3430
19376 3430 10856 16608 26879 23084 11449 917 -4768 -3873 -8694 -4852 5429 5398 12514 17406
19362 17406 29143 31246 24391 16238 17354 12177 8054 13369 10475 9216 6690 14438 13837 20190
19348 20190 20488 11488 -3604 2421 25868 14794 17774 8522 1130 2919 -1626 -16781 -12294 2170
19334 2170 3899 3214 -1701 -7768 143 9612 3119 12100 16178 33884 30177 -1143 8441 15860
19320 15860 14577 22755 9909 13183 24384 18516 26956 25891 13760 195 6269 6909 1101 300
19306 300 -14297 -15820 -2072 7715 21239 18348 9313 5921 5347 -4600 -7095 10765 9977 -9512
19292 -9512 -3516 8048 11422 10538 17421 21526 16493 3227 8970 11504 13943 -376 487 9198
19278 9198 -2159 -1442 -172 5205 9588 8862 12318 12965 17639 26710 24821 22156 25574 22900 14933
19263 14933 11605 15044 11241 5009 -7398 3047 13668 14115 23041 31746 19189 10423 8330 13163
19249 13163 9956 4184 2554 -7577 5536 4462 -4906 3174 -1209 -6594 -1769 12520 25298
19236 25298 25517 18877 16918 7864 -603 -7560 3058 2064 -4861 9408 12247 8615 17790 11043
19222 11043 371 -11540 -20100 -14603 -11776 -5971 -9148 -10894 -8214 7573 31271 16760 12372
19209 12372 11122 9869 19006 24947 17346 9672 10318 2154 6971 15056 13020 3563 3859 12453 22602
19194 22602 29554 26991 15193 9674 -187 1183 -2820 -487 17 8729 18543 13715 9544 13276
19180 13276 835 -2124 6416 6599 13703 6669 -260 725 11019 20136 20446 8986 12529 8982
19166 8982 2525 -2378 -4035 -6904 812 10517 12127 7032 -332 -3028 -9104 -6640 -3017 -4685 -4329
19151 -4329 -9523 -7484 193 3589 8603 2508 -1212 -11605 -2386 4758 10741 36116 37284 14100
19137 14100 7373 1742 -11034 -15673 -16534 -10017 4691 16400 12264 14435 6163 18719 21422 11610
19123 11610 1255 -6426 3535 15867 112 -14084 -20417 -22369 -15489 -12447 -7233 -5858 -12152
19110 -12152 -18837 -22496 -23210 -21472 -13822 -12410 -740 -849 -5787 -5816 4974 17235 18630 11365 17693
19095 17693 17066 20819 14409 12998 25669 32336 26393 25436 24300 11506 12459 11755 4870 -8605 -2182
19080 -2182 6915 10940 13960 11705 18848 23233 23275 31135 30902 31448 18204 16459 9778 3562 5868
19065 5868 6363 4308 3598 -5649 -4920 9627 -2922 -17421 -11177 1171 6462 8432 -5753 3988
19051 3988 4704 12260 23027 19395 9564 -5403 -6957 -3159 3071 8125 -883 181 10660 4265
19037 4265 -2501 9837 5296 2587 -13886 -11195 -12271 -13963 -13693 -2806 10809 14516 17498 17507 26278
19022 26278 21142 27801 22294 9947 3794 8823 12878 6636 7992 8238 -8085 -9179 8503 12760
19008 12760 9790 4648 12430 21674 24912 25308 6573 -1918 3569 -12908 -21218 -8442 1854 -1184
18994 -1184 6788 17282 30364 24863 20507 15856 10769 12133 10833 18675 33081 29945 15113 9993
18980 9993 21509 23580 17172 6837 -2833 14234 23417 27677 29087 25392 16289 6127 -2154 1281
18966 1281 1731 4328 13761 27326 23659 15903 9952 5834 -8783 -11201 -5757 -1683 -344 3079
18952 3079 9134 19542 22632 15829 7526 12984 5 -6097 2813 443 -7923 -15728 -18393 11757
18938 11757 24305 16257 10393 7696 14169 19649 33738 30633 38633 39747 23417 1731 -7801
18925 -7801 -8404 -10495 -8668 5499 9624 4477 15743 19492 29683 18562 22296 32525 31696 23755
18911 23755 12569 9763 7819 14617 20780 14744 10078 5809 6699 5145 6317 1614 7137 6647 813
18896 813 -3628 -9401 -13317 -10840 3233 1331 -4449 2510 25244 22822 25278 24900 28801 32960 34972
18881 34972 29696 15775 23761 39724 25049 8015 9568 17460 9123 11299 9775 5073 1362
18868 1362 14193 16495 20574 19792 12388 7759 18803 22916 22207 27004 41332 31938 12815 5095
18854 5095 -6705 6184 21297 27319 29521 28176 19152 6996 6259 8561 -7019 -6016 7324
18841 7324 24733 31084 20055 22753 34016 19248 4224 12120 21541 36017 51547 43017 22876
18828 22876 33050 46296 38678 27958 17780 15781 9066 9947 14843 25804 25532 13221 20012
18815 20012 28949 26831 26333 31946 25013 29704 18201 3576 11039 22825 24083 14589 14330 21455
18801 21455 27357 36731 34206 41530 30902 34962 39279 20363 14541 21853 25369 10212 7622 14809
18787 14809 9640 20356 22192 30106 25114 19109 21966 26622 17503 13655 26664 30902 24364 19595
18773 19595 11245 13347 9288 -8715 1312 6038 -1014 3360 4787 10286 34170 25882 13447
18760 13447 14945 15804 34759 29452 23176 18217 21881 33046 35097 35044 25892 23789 16018 -704
18746 -704 4359 15257 13471 16433 8805 2455 7037 13308 27027 26741 3609 -8449 -13918 -15073
18732 -15073 3309 12736 14492 23182 20150 12729 10871 11894 27123 43093 31697 19222 27328
18719 27328 36348 38377 20981 12806 18801 17219 12221 12129 21119 17758 6237 7906 16387 28261
18705 28261 32809 19442 6212 7873 -503 -20402 -11470 4465 16646 14622 9177 12887 22816
18692 22816 19184 9806 8009 14548 13827 19261 14066 2943 146 3137 8021 8047 15152 23681 35809
18677 35809 21258 14374 11658 6378 9523 11067 21438 25723 39385 35496 21246 22985 30730
18664 30730 30038 28792 31297 16388 5697 3465 11874 14446 8388 23678 34629 25938 15433
18651 15433 28023 36775 35833 21256 20109 20762 27792 30509 23804 35011 37884 24577 28723 40884
18637 40884 48249 38501 19362 21426 35943 36756 36272 34783 42913 51394 38735 43001 54981 54457
18623 54457 45733 49976 46894 40833 48988 49417 43904 48469 49091 53727 51182 53549 43417 51991 61689
18608 61689 73971 79230 64120 56936 66620 62371 48527 55272 63251 65207 58931 68112 88306
18595 88306 105983 115149 117427 114737 115775 123501 109677 109135 102106 104807 97805 84311 87275 84407
18581 84407 79967 76602 80894 81029 66002 74362 90299 100226 81067 75957 84151 89220 83342 87404
18567 87404 87701 77671 76404 83849 78609 72335 75083 79138 74438 79204 81988 79440 86851 84609
18553 84609 98239 97911 80211 74146 78404 92408 102250 102533 95801 99844 98518 106703 104497 100902
18539 100902 98441 96338 88114 81253 83362 72862 68900 75817 81230 91571 86357 85222 80800 69818
18525 69818 56229 71637 80730 70295 70789 62201 44895 41214 36495 40199 44278 51034 46988 44865
18511 44865 45915 47201 42357 38959 46677 60013 67286 60407 55790 42383 45802 58167 55220 47274
18497 47274 46353 25733 24128 26293 36736 40754 48889 57753 52517 47780 29010 33321 39581 36823
18483 36823 47436 50700 64268 53152 53227 60986 60003 55713 44529 42667 43109 43778 49696 59888
18469 59888 61034 53761 44992 36048 54504 56794 51430 37309 37596 53412 59575 65148 57479 60710
18455 60710 65111 60077 45123 42197 37526 32520 24535 33297 50269 40378 38931 39273 17801 25546
18441 25546 40606 45208 56528 65533 52657 52010 52381 42459 49344 50874 37064 38496 37834 27988
18427 27988 14473 30756 38764 51653 46890 39281 50188 69141 70447 61388 49081 46611 51371
18414 51371 41965 46038 59933 63408 62929 57702 51003 49464 52138 55561 54039 47648 49215 48787 54721
18399 54721 54222 52258 46288 40887 38812 48783 39852 37322 35174 41862 43217 53647 60875 51993
18385 51993 43079 28950 40074 44951 32089 38133 48110 46580 48964 46213 53643 55891 56505 57039
18371 57039 46318 46339 54587 56421 59287 63814 57204 54742 57242 66628 77354 64064 64979 92061
18357 92061 89330 80176 78817 76786 75713 68229 55196 53399 67503 75168 74912 88754 84229 63702
18343 63702 52411 64585 64377 45792 51390 64802 54339 55627 59581 47611 38941 51117 74343
18330 74343 82168 82119 85204 98525 112443 108094 98355 104637 108786 104418 92651 81552 84905 87414
18316 87414 103478 105010 101066 90880 94079 101224 112073 116364 111092 103050 94175 89641 88165 79821
18302 79821 92202 96300 101861 103741 81777 67986 64990 74025 81058 88760 95750 93931 103851 104262
18288 104262 99302 103188 90914 89789 91529 92092 90122 89648 88247 99292 106071 106728 108523 114434
18274 114434 107933 105284 95712 92063 91063 95627 101811 110419 105912 102053 101708 103002 109356 121680
18260 121680 118587 114824 112590 109036 105279 115511 122881 125548 121769 124505 133185 127204 123501 116756
18246 116756 101134 89501 90545 92170 91767 107284 117504 118167 120920 125232 156108 162572 154287
18233 154287 154792 149161 151798 160709 155922 151567 138068 144809 157338 159514 157220 155733 155348 171450
18219 171450 166693 165370 160179 169982 181219 190039 185876 186654 181519 184660 202342 190749 184024 183959
18205 183959 192011 185631 187192 194360 186443 192697 205760 213024 219221 228352 227070 232421 250333 258876
18191 258876 260438 247882 249739 248733 251017 257121 258150 258843 270601 280064 288901 300800 317104
18178 317104 330958 325009 319771 318860 318100 323871 330623 352780 377419 384729 379056 377092 370048 391200
18164 391200 387571 396336 422530 438202 455095 476060 498196 503628 503071 512069 524500 540483 548816
18151 548816 549076 561662 586739 612732 627772 650679 688086 721481 759627 800764 837324 879296
18139 879296 924367 973472 1030166 1102831 1179121 1245223 1319142 1392380 1460856 1527444 1603973
18128 1603973 1665677 1712631 1749850 1779114 1816762 1867579 1939088 2054909 2188195 2354819 2574959
18117 2574959 2842848 3177501 3586098 4074963 4654982 5267566 5885966 6506093 7130413
18108 7130413 7725636 8202229 8571635 8874488 9094098 9185507 9214945 9243662 9253006 9249320 9286190
18097 9286190 9456368 9732717 9999097 10106023 10033353 9891705 9741060 9606410 9583285 9755853
18087 9755853 10132659 10664473 11323466 12123867 13069605 14185815 15376662 16492928 17370664
18078 17370664 17982474 18450362 18748093 18784958 18490916 17977990 17415514 16890228 16385694
18069 16385694 15951514 15728922 15766869 15883707 15816001 15440542 14864279 14282206 13860061 13745351
18059 13745351 13950855 14391757 14936566 15460429 15934995 16377481 16779871 16993159 16797794
18050 16797794 16079328 14953818 13638056 12341890 11222713 10418392 10013153 9975627 10227412
18041 10227412 10684301 11276017 11988412 12735502 13384536 13858786 14130547 14228606 14043866
18032 14043866 13463101 12583589 11585181 10626430 9711723 8815625 7990303 7268898 6688217
18023 6688217 6261795 5986216 5863533 5844453 5911772 6025781 6202999 6440893 6678476 6876149
18013 6876149 6993935 7011354 6964442 6892308 6790418 6603511 6319900 5940442 5490012 5027231
18003 5027231 4567328 4118658 3696555 3318324 3004249 2745843 2528901 2359243 2224137
17994 2224137 2126155 2074417 2038920 2007098 1975480 1948885 1943294 1961832 2008459 2058809 2109634
17983 2109634 2162462 2199117 2227985 2255976 2300585 2358014 2381398 2365768 2309464 2226600 2104293
17972 2104293 1973214 1860346 1774121 1666007 1545255 1447112 1361393 1288169 1236238 1208257
17962 1208257 1185391 1164638 1165222 1174896 1184354 1199433 1217173 1209438 1173220 1113318 1040945 982344
17950 982344 938806 898695 875591 862097 850572 843077 868937 894601 924646 963098 982592 990696
17938 990696 997123 1004035 992588 950967 890584 804383 715776 625574 562197 502340 441306 388653
17926 388653 355879 328033 305754 303921 300477 286952 265352 256864 257454 249466 231555 210187 213378
17913 213378 224358 238314 239223 222154 208357 199371 189837 189501 188721 194867 171606 153127 141731
17900 141731 139189 137375 130894 124634 112576 101003 96328 104226 106606 108612 102115 86271 91477
17887 91477 98930 103164 95906 87189 83355 80152 69496 66197 70509 74674 64511 46681 34029
17874 34029 44614 44168 40257 31115 25147 27929 37681 38214 36244 45337 39717 34148 40961 42821 47579
17859 47579 58475 64827 66507 62580 61806 58135 46367 29007 14394 19168 18124 17265 33265 45149
17845 45149 44328 37736 36372 29056 27948 23007 15556 11834 10943 16759 27061 29184 25197 18542 25983
17830 25983 32650 19834 16515 5320 -2814 4754 22462 34797 34061 17552 5327 34 -2320
17817 -2320 11164 19448 24947 34809 28044 14134 14145 13492 11421 9344 15090 17333 6311 12479 13654
17802 13654 1875 -13903 -15356 -2497 1276 204 -10612 -17800 -14779 -16414 -19180 -18311 -20596 -18153
17788 -18153 -11025 1499 11649 15541 8968 8993 14811 17911 5733 -2604 -8251 -2314 14808 32365
17774 32365 24566 20202 4471 -14637 -14947 -6879 -5704 -10238 -13778 -12445 -4808 -20953 -20409 -23610
17760 -23610 -16944 -7725 -5072 -17034 -10241 -2566 -5026 -9717 -13221 -9824 -4352 -12683 -29653 -24511
17746 -24511 -14728 -16142 -15211 -10744 4409 5491 587 -5574 -17883 -20756 -20360 -21498 -12748 4160
17732 4160 -3698 -23944 -26215 -34993 -42123 -42543 -32817 -33789 -37340 -22030 -17109 -21752 -29459 -30714 -29332
17717 -29332 -31556 -36001 -30979 -26095 -23338 -21786 -34147 -38189 -26413 -18267 -20729 -24996 -21843 -19923
17703 -19923 -21395 -16507 -19492 -23045 -27396 -31124 -24441 -22855 -28806 -30141 -37895 -30741 -25840 -22450
17689 -22450 -26856 -31536 -22342 -4613 -1656 -6408 -24464 -42945 -42496 -47766 -33905 -21818 -29039
17676 -29039 -25094 -22242 -29871 -21999 -20018 -23218 -23578 -24416 -19638 -7563 -3552 -11544 -14784 -9777 -5433
17661 -5433 3024 2983 525 -3188 -10345 -14627 -5139 -8710 -11232 -8926 -19743 -21421 -20404 -28033 -32958
17646 -32958 -31670 -22309 -9657 945 -2659 -11588 1247 2008 1247 -6616 -1244 3046 8581 14734
17632 14734 12813 1110 -9190 4618 17452 10104 8299 -725 8298 28488 28990 17432 22629
17619 22629 25269 13406 19485 29279 31067 32678 43796 54983 61998 57918 59851 45255 35346
17606 35346 27088 22540 16823 18458 27052 37724 37956 30419 32119 41993 41734 27423 9605 1194
17592 1194 20263 25409 21909 28171 36383 31149 13527 22020 45935 47901 42063 38020 26185 34020
17578 34020 41584 38493 60087 63454 52283 52710 68819 61903 50982 65134 66790 66577 68353 62562
17564 62562 59310 62975 68733 74983 71070 53088 43071 39794 27939 25690 18163 20652 29071 19397
17550 19397 8939 18518 35951 41549 29374 25607 9441 -3358 3809 23280 32325 29847 18114
17537 18114 25737 27580 26278 36508 53626 55015 39583 35245 29218 27565 23198 8772 7827 32600
17523 32600 36877 27893 21051 16702 14607 27673 27453 19000 20784 18561 17770 19601 32355 36539
17509 36539 37550 33463 28616 35587 52105 45761 40236 26755 19808 13194 686 3587 21495
17496 21495 18285 835 1183 -2978 -7089 -1265 5869 -2034 -10501 -15613 -14177 -3620 12965 19151
17482 19151 6535 7964 6387 4708 243 -1706 2015 7900 13439 10108 8528 9086 752 8484
17468 8484 21443 14447 -1312 3899 9728 20906 26180 28517 25381 8167 4485 -1027 -12402
17455 -12402 -10625 -19318 -20450 -20579 -18851 -9071 -34 2879 296 -25676 -19947 -6796 2217 1897
17441 1897 -15511 -14969 -12460 -5828 609 -604 -7107 -1348 11039 15140 -4859 -13924 -16237 -23821
17427 -23821 -17273 -19385 -24596 -15282 -14116 -11356 -15382 -15521 -23704 -22900 -9891 -9016 -11702 -19025 -21614
17412 -21614 -21029 -15010 -23275 -15272 -4610 -7079 -7092 -3200 -5470 -11348 -1465 2721 -8982 -6126 -1640
17397 -1640 -10620 -13897 -6358 -526 -9371 -9515 -17573 -30602 -13948 -1202 -8024 -12788 -13745 -5548
17383 -5548 -1702 -8344 -9723 -631 -3885 -2059 8449 -1180 -10697 -3329 -846 -3530 -2242 3018
17369 3018 -6714 -20040 -27756 -19677 -13009 -20688 -27168 -30528 -34585 -35205 -34552 -35343 -24031 -22483 -25272
17354 -25272 -32540 -24465 -21621 -21374 -12883 -3243 -18281 -21312 -33350 -35500 -15629 -18775 -36040 -26286
17340 -26286 -18161 -1687 802 8011 18371 12358 10689 17365 8595 190 -1891 -5073 -16216 -14738
17326 -14738 -15751 -12291 -10390 -2131 4746 7867 765 -12366 -27590 -33130 -36942 -27796 -14947 -4655
17312 -4655 -20397 -23816 -20787 -32253 -32963 -30576 -37317 -31195 -22719 -14293 -4866 10773 12037 -1702
17298 -1702 -2830 3780 5671 2011 -2659 7805 12220 996 -27623 -46181 -40341 -26406 -28266
17285 -28266 -34992 -17245 15678 17069 6585 -2154 -5960 -15121 -19117 -12865 -20730 -26152 -24420 -30910
17271 -30910 -27613 -15951 -33871 -46015 -40829 -36389 -37696 -32882 -33373 -34994 -26171 -27217 -35701 -39722
17257 -39722 -34879 -26268 -25031 -30990 -13134 10033 11056 -775 -11566 -3797 -687 -6192 2059
17244 2059 989 7475 20393 12486 -6997 -22147 -12375 -11029 -6671 -1699 4732 3569 -12225 -15319
17230 -15319 -4047 -7180 -6770 -4837 -134 -2882 -2637 -12906 -17044 -15955 -7536 1532 23782 18649
17216 18649 -1369 -7218 -13393 -15059 -15311 -15104 -4837 416 -5747 -3975 -5080 2677 9897 1795
17202 1795 -2525 3051 5664 -257 9576 20705 8507 -14506 -12303 -6450 -12780 -5698 -3867 -20430
17188 -20430 -26226 -26186 -27750 -16656 -8159 -17778 -29045 -37525 -45371 -38057 -27916 -33709 -30507 -18458
17174 -18458 -6591 -7622 -4236 4781 -1733 -23996 -21980 -11533 -4233 -10209 -18048 -20676 -17945 -22220
17160 -22220 -31280 -17210 -11170 -11917 -17571 -23978 -29297 -30444 -34531 -30284 -17884 -12690 -10636 -6596
17146 -6596 7605 13568 11449 6900 10022 12433 11263 10423 3497 61 -5664 -14490 -11634 -9632 -11378
17131 -11378 -9024 -16192 -14946 -7318 -6183 642 7842 14370 9761 -5498 -29941 -31345 -26774 -32831
17117 -32831 -30994 -15914 -3109 -8554 -25152 -38991 -40199 -34711 -36270 -27046 -26577 -25181 -15965 -11059
17103 -11059 -10666 -12624 -22079 -23824 -9775 -9077 -10048 -8003 -10416 -25040 -28943 -26357 -30767 -9629
17089 -9629 -10682 -19342 -20970 -18874 -5040 -7889 -14807 -11339 -9212 -17657 -23056 -16541 -782 4518
17075 4518 -1796 -471 -4500 -10960 -19226 -22165 -33659 -35880 -35651 -27635 -36971 -36843 -20415 -12120 -15851
17060 -15851 -19366 -16655 -25229 -18658 -15436 -14823 -9493 -4207 -985 2052 4438 5120 -752 -9312 -13003
17045 -13003 -6567 8657 4614 -5435 -22397 -27325 -16549 -9930 -748 5364 19242 23429 18124
17032 18124 3404 -4654 4831 2611 2620 4096 3420 -8352 -15310 -10328 -3077 -8094 -4921 -2931 -4491
17017 -4491 -5650 -10716 -21671 -10535 -8506 -10309 -11744 -24308 -34789 -36816 -24440 -11823 -7041
17004 -7041 -12301 -14867 -24344 -17610 -9585 -4401 -4208 -19433 -19102 -10689 -6598 7739 7137 6695 9419
16989 9419 3447 -10818 -24394 -32022 -26146 -18532 -10645 -7878 -14408 -10880 -11025 -609 2561 2442
16975 2442 -13090 -20665 -21073 -7951 589 7612 -1505 -7178 -29650 -48077 -30673 -28271 -26049 -32029
16961 -32029 -29427 -10925 4577 -2403 -13072 -12980 -24297 -18156 -19821 -32528 -36126 -32117 -23628 -20266
16947 -20266 -15020 -25997 -35313 -44235 -29307 -19165 -15578 -21233 -19778 -19690 -13793 2053 10840 4625
16933 4625 -637 -958 -2527 -7054 753 1800 -5868 -14690 -20745 -20397 -16278 -20584 -14419 -4015 -8981
16918 -8981 -17652 -28061 -23082 -15830 -10170 -14532 -25637 -20672 -19154 -11550 -1824 -15890 -25703 -26444
16904 -26444 -11058 843 7573 -11328 -17652 -9713 -24796 -26909 -20172 -11979 -4806 3880 10356
16891 10356 -6005 -15171 -11518 -8055 -9847 -9266 -13069 -21644 -25940 -27475 -19473 -9296 -9092 -12240
16877 -12240 -10645 -9903 -13245 -6695 -4000 -8184 -4628 5140 2551 -4678 5149 1517 5653 -5532
16863 -5532 -1084 -3985 -8384 -9183 -13807 -4629 -5725 -6633 7615 6083 -9582 -16694 -13470 621
16849 621 -813 298 -8820 -8420 -5090 -11564 -5040 -8879 -4631 -2433 -4830 -14442 -10508 -9063 3278
16834 3278 10925 -5270 -21874 -35146 -26666 -9358 5188 18893 18060 31185 21541 -3123 -20307
16821 -20307 -14562 -3892 14285 13871 11092 3067 -3054 -26 -4020 -3863 -9195 -3744 -10739 -17393
16807 -17393 -20266 -2553 990 -8050 -10127 -6285 -4981 -2374 -4725 -6866 -6565 -1977 8821 5325
16793 5325 1735 1912 116 -5075 -5518 -8663 -10099 -14491 -6715 7520 -1458 -247 628 1431 1962 1678
16777 1678 483 -4901 -6022 -3296 -4038 7738 8904 5320 4510 -5250 -2841 -3895 -7778 -9949 -3425
16762 -3425 -8932 -19498 -9652 -19146 -24692 980 17654 16186 17842 15353 -170 -10394 -23648
16749 -23648 -27978 -36120 -33428 -27428 -28547 -11631 14073 23573 18853 24164 15300 992 -9299
16736 -9299 -16787 -11653 -11314 -9657 -1706 -15714 -16513 -19664 -27988 -13470 -9962 -25232 -20229 -16320
16722 -16320 -14828 -5979 -3810 -5366 847 -19057 -6443 22371 12405 -4468 -15495 -8537 -6097
16709 -6097 -4360 -21228 -21939 -7227 -7178 -5757 -8727 3689 5636 -7377 -438 -2213 2755 3048 -50
16694 -50 -17331 -26123 -22675 -25465 -21903 -20445 -23430 -18860 -15912 -11598 -12677 -15184 -10398 -9794 8349
16679 8349 10758 -8616 -26885 -15567 -5534 -10725 1793 8788 17505 7763 8198 8268 8843 -352
16665 -352 -15198 -14207 934 2824 2741 -570 -6647 -4973 -8812 -21397 -17534 -12972 -19635 -14548 -12057
16650 -12057 -7113 9864 20362 13019 -1072 -9442 -5125 -11505 -12501 587 8666 2237 19 -2885
16636 -2885 -4997 -17143 -28804 -9174 115 3862 2131 -4003 -20844 -10484 -16582 -28114 -26472
16623 -26472 -19173 -20645 -26218 -21085 -6383 5163 10266 8971 6088 48 -14553 -26896 -21830
16610 -21830 -9322 2826 10000 7549 -4572 -9542 -10581 -3279 6877 9531 19506 16769 9074
16597 9074 18580 2273 -7754 -6857 -3759 -3833 -3491 -2864 480 -2504 -11707 -15898 -2392 15577 13089
16582 13089 -4705 -15754 -13605 -8602 979 -2212 -6354 -13366 -19969 -19164 -12669 -10909 -20067 -17380
16568 -17380 -3805 -9941 -20350 -25411 -20618 -20127 -16363 -14171 -20310 -14835 -3434 1143 -2771 -14221
16554 -14221 -12992 -11232 -14460 -20439 -8365 14605 10074 17339 24082 19994 22527 32672 18813
16541 18813 3516 -16593 -21783 -12705 4211 17292 5871 -5172 -807 -3840 -4223 -20424 -6016
16528 -6016 6520 287 -2168 -10626 -22241 -19150 -9792 -2895 -12995 -14256 -2073 14595 17818
16515 17818 14363 6549 433 -9935 -9989 -15918 -13654 -5836 -8327 -2467 13710 9826 2224 -15786
16501 -15786 -26619 -29646 -20556 -5999 3228 13338 20202 -340 -20132 -25553 -14747 -17781 -18498
16488 -18498 -22007 -11179 1942 2030 3875 798 3345 6283 -743 -3216 -3732 -5903 -13039 -1697
16474 -1697 12378 16173 3586 1115 9019 17397 19107 5153 -5997 -11248 -5185 -4590 3933 7653
16460 7653 -9721 -18673 -26454 -32585 -9085 2405 -4866 -16084 -19898 -23290 -9358 -7189 -1691
16447 -1691 -4414 1482 15406 22051 20624 11013 1830 200 2714 -12216 -6901 7094 14549 -217
16433 -217 -7278 3763 10 -18343 -4893 8561 6687 -302 -16392 -20707 -10622 -20039 -17940
16420 -17940 -2721 -1439 -10711 -9496 -7193 -13338 -18509 -22083 -14042 -3459 -4706 -1853 -11918 -16246
16406 -16246 -2784 9930 6075 3064 7881 7515 4946 -6329 -5722 -1501 590 5341 369 -3876
16392 -3876 -19687 -21636 -17729 -21227 -26920 -40293 -41398 -24768 -5229 -1096 7983 17366 22488 21499
16378 21499 7443 6871 8808 12785 26981 13410 15009 3992 -4362 -8992 -24041 -21962 -21120 -15537
16364 -15537 -10847 -169 3641 6348 -185 -8384 -19141 -8780 -7827 -15864 -18105 -24082 -19545 -17203
16350 -17203 -19664 -18758 -6087 -5424 -12470 -15922 -13334 -7451 -1562 -10694 -8302 4029 9029 -2635
16336 -2635 -11799 -23067 -15883 -5145 -3958 -21844 -27320 -13323 -9480 -8894 8146 10752 8676 -7422
16322 -7422 -8973 -3008 10397 5152 6118 730 -18860 -29165 -25211 -17214 -18956 -21612 -27310 -16906
16308 -16906 -8182 -933 -1000 -2922 -2390 -600 -8919 -3975 13456 11017 5305 13702 24304 12704
16294 12704 11150 24483 17525 5043 -5556 -13594 -6643 -4911 -13628 -10054 -12723 -25333 -38416
16281 -38416 -30837 -22939 -5181 -1813 8410 -7524 -19710 -12896 -12489 -8586 -8376 -2960 -6468 -3209
16267 -3209 -3002 -17310 -22187 -19182 -10738 -8074 -26344 -20180 -8654 -11817 -5885 -6851 -4236 -7427
16253 -7427 -7949 -11673 -16204 -7708 2975 -8926 -16458 -1984 -3697 -12882 -8846 -4611 -14437 -11530
16239 -11530 -11616 -20854 -22207 -25439 -23522 -14780 12747 25676 32292 14080 7745 6492 12391 8515
16225 8515 -1969 -12365 -6142 4373 -5083 -25080 -27694 -6487 -2640 -10803 -10952 -15906 -25413 -27823
16211 -27823 -29384 -22025 -6779 -7274 8628 7132 -10621 -270 4509 24 -4838 -11617 11119
16198 11119 17550 5805 1783 2902 -4261 -15705 -16747 -19245 -3277 -4377 -3260 -1020 8435 6476
16184 6476 4045 3556 3580 4926 -141 -10475 -12298 -15548 -17966 -19508 -30504 -31046 -17713 -8441 -3696
16169 -3696 1031 -3691 -9015 994 5857 15139 11064 930 1440 11375 5010 -14646 -10237 -15612
16155 -15612 -16563 -17021 -30556 -35235 -33611 -25133 -14535 -12457 -15011 -14944 -4761 6769 5786 -1575 -4294
16140 -4294 -4759 -13921 -5037 576 3075 12513 -1052 -4858 -6583 -19746 -23610 -24449 -34863 -20521
16126 -20521 -15896 -7521 -6275 -1219 5784 11579 10945 22036 11607 -7639 -19065 -12862 -6004 -12222
16112 -12222 -10978 -10485 -8510 -5106 -3126 4068 9184 7855 3057 307 4477 12076 12125 6745 14130
16097 14130 10079 17805 28626 20552 20501 5391 249 10650 6361 -794 3342 4284 751 11565
16083 11565 10816 1838 -2406 273 266 -5899 -10749 -4269 7976 17254 15594 10958 -1263 -13978 -19322
16068 -19322 -15756 -2303 10223 10992 14231 -1727 -16618 -6731 5052 4270 -10840 -10757 -2059 -6156
16054 -6156 -4099 -893 9450 6601 1787 -1748 -6887 -5283 -752 2408 7712 8557 5731 6018 13858
16039 13858 20533 27301 5927 -6518 2767 953 5906 9260 14579 9682 180 -2688 7499 14795
16025 14795 4896 6562 -5996 -17329 -15547 -3392 1774 10458 20739 9368 6303 10203 8371
16012 8371 8543 5988 -2788 5480 20444 12806 4310 16622 22650 16154 15136 8889 -4719 -8196
15998 -8196 5745 4755 -903 2152 14188 18090 2426 -11798 -10511 -9651 -23328 -5898 10447
15985 10447 12298 12028 7430 23879 14545 849 10445 4414 4779 9790 -2407 -10221 -4464 -23235
15971 -23235 -28115 -21728 -16061 -20348 -30525 -18430 3883 -1584 1243 3375 2332 1488 12360 19568
15957 19568 11260 8903 23334 27698 20469 -2219 -22557 -16302 -13406 -8500 -3230 6715 12706 13973
15943 13973 9873 -200 -11665 -5762 4673 9992 -2847 -19416 -24717 -17396 -1953 3053 228
15930 228 -3701 -3041 292 -7715 -19810 -19055 -2140 -14468 -20489 -16999 -17090 9249 22209 14996 -3965
15915 -3965 -16027 -12327 -11444 -6453 13358 -5375 -27965 -31252 -13489 4555 13420 11330 7518
15902 7518 -1608 -10846 -17165 -16384 -7264 -477 14288 23578 14238 16424 21662 26282 26775 8173 1196
15887 1196 3836 9999 4884 -1967 10614 17957 16094 2286 859 -4859 -18355 -16260 -3398 6187
15873 6187 8483 4948 -6963 -20291 -25171 -18821 -324 -5778 -11985 -2834 980 -8331 -9366 -6151
15859 -6151 -7009 -5859 -9587 567 -1829 -12740 -16691 -14624 -16902 -2824 -6511 1529 5034 -12871
15845 -12871 -23451 -21625 -20470 -5769 -6028 -16265 -20486 -24761 -17606 -9745 -4532 -5775 5484 7320
15831 7320 18236 22031 19181 21293 27256 13436 5920 -8747 -14900 -13382 -12142 2056 1277 -579
15817 -579 7312 8230 6907 -1616 -3225 -2133 1536 -12953 -20187 -17045 -14585 -22283 -27316 -15979 -5627
15802 -5627 -9804 -25241 -32464 -27069 -13795 -8486 -19334 -15368 -11871 -8891 -15845 -15850 -2531 5656
15788 5656 2431 144 -11265 -9607 -4301 -14213 -7652 -14969 -11153 1924 14775 17394 14424 8876
15774 8876 1800 -16985 -21027 -12750 -15967 -12392 -16348 -17584 -8246 12162 11772 10096 1777 -9525
15760 -9525 -9502 7020 12353 15535 20600 10964 6332 574 -12419 -8675 -1407 1358 5509 9713 20867
15745 20867 30265 32444 17697 7649 -5597 -7462 682 4815 2267 -7109 -16624 -26002 -18659 -13286
15731 -13286 2315 11010 5505 3985 18514 22344 18315 5711 -4364 3050 10013 13468 21149
15718 21149 27106 34170 32451 21228 15842 14250 19120 18730 5673 -20637 -23767 -22525 -20815 -12672
15704 -12672 -10505 -4104 -10900 -7328 -10393 -9037 -2202 3603 9876 7349 4670 -13896 -16799 -3687
15690 -3687 -361 -7399 -9598 6551 -4410 -15971 -11683 -2595 8503 14054 -1398 9026 28647
15677 28647 24157 6238 507 5830 7387 15046 29648 17697 -7590 -22078 -21596 -20572 -14057
15664 -14057 -7298 -2269 2667 1077 -7484 455 15908 22202 19407 25519 34449 35612 18614 -6818
15650 -6818 -12196 4582 17744 16337 5281 -2361 -800 10602 18392 24582 30083 12588 -14809
15637 -14809 -17798 -1688 4969 6075 -4666 -7226 -5475 863 -4433 -3087 -9189 -19005 -23900 -21285
15623 -21285 -2751 11015 17314 26569 25457 19653 19910 15005 11436 11430 5328 -4225 -1476 2023 -6374
15608 -6374 -10588 -7438 278 5338 2038 -10210 -17147 -35300 -41264 -31172 -4760 2145 -6636 -15305
15594 -15305 -5255 15136 35228 41842 44195 27024 19174 3194 5450 10678 12465 16941 10814
15581 10814 6265 10535 21214 27206 26618 21066 16709 23394 28203 15684 4926 1057 6857 8105
15567 8105 1944 8102 7824 9069 17155 21644 28864 11530 6350 3058 7740 5744 7049 4877 12141
15552 12141 10793 8298 -4267 -17560 -16940 -10634 5243 11222 4577 15986 12427 4576 -7311
15539 -7311 -8480 -5159 -259 17272 27959 21835 19166 18182 21826 31063 32032 19147 13453 14683
15525 14683 18019 16170 9589 543 638 -8778 -1640 7456 18091 21024 13725 20396 16903 3575
15511 3575 2394 1307 11824 20194 21666 10948 -1988 -3755 -7522 -14508 -4294 655 661 2406
15497 2406 3432 2453 -1923 -283 -412 -56 869 6885 14227 10011 7141 15746 22887 25373 13633
15482 13633 22079 39197 39741 45401 40407 11424 12809 14701 3567 -15728 476 26315 32003
15469 32003 34879 30661 11592 10664 19125 19033 24017 22366 17464 16602 27536 32125 24778 25222 28419
15454 28419 37759 39044 34526 30651 31426 36463 36074 29143 27042 19569 18548 13365 10175 18954 18806
15439 18806 14588 24205 40137 28487 24072 21404 14556 -1415 -2617 12293 22814 29300 24458
15426 24458 16089 16348 16529 23844 30293 31252 20515 2705 -10625 -8876 -4213 6186 5900 2584
15412 2584 3623 9018 3772 11047 9550 -5424 -1274 1778 1566 7422 15829 12252 1937 -8376
15398 -8376 -17234 -22786 -7875 4646 4200 4433 4239 4803 18868 21074 16406 13794 5747 -9149 -12211
15383 -12211 -9966 -7133 1939 -3892 -8384 -17558 -2903 1209 12034 24644 34715 35065 42654 38891
15369 38891 11452 -8569 311 8662 10012 20105 25777 28951 25234 11940 2788 3171 6947 11022
15355 11022 6121 21867 27282 21878 24845 16012 12499 23670 19022 8588 -2295 -100 -2428
15342 -2428 -2282 451 5317 10454 17267 30916 20573 -2155 -7147 2860 10131 8119 -11049 -11293
15328 -11293 4629 5470 3320 237 2062 -6382 -7581 -4667 200 4504 6060 13150 22432 27448
15314 27448 41494 39942 30627 20713 7494 5878 16939 15216 12848 3121 3648 4067 12983 8991
15300 8991 8236 24347 42810 35962 17046 10068 6480 11595 12819 1855 -1799 11565 14444 13466
15286 13466 4253 -1182 2106 -727 1561 16021 27043 32538 20720 3450 -2819 766 13532
15273 13532 12425 2845 -2326 -16557 -10515 -6124 9214 19783 28845 28355 8644 7200 8136 16147
15259 16147 30351 29064 12183 16577 12252 3936 -595 -5167 5586 1326 -2764 4727 22860
15246 22860 26932 19437 8077 11242 26210 40751 56550 45971 35624 24316 23157 16616 3072
15233 3072 12391 31131 20339 5393 3720 6366 12021 14077 19703 37856 49622 49262 30621
15220 30621 15009 22240 18810 15595 20802 22781 16846 9136 11164 18715 23117 18003 16792 10721
15206 10721 -1054 4365 12621 4442 -26 8764 7574 4380 4776 10319 14473 31336 33100 27427
15192 27427 25721 17181 6144 623 458 1740 8184 18438 7812 2334 10745 9184 3689 9216
15178 9216 12170 21809 26843 25215 22636 19524 21225 17478 26842 25069 26348 26061 24527 23315 25862
15163 25862 15407 2815 10459 30938 34914 16290 16960 38017 46476 30893 11013 12219 10591
15150 10591 1360 6262 -33 1057 15374 22830 21984 13598 -1767 -8781 13004 19160 13448 6188
15136 6188 1029 -2864 3108 -1256 5138 22600 24247 13413 22570 24623 19067 7948 10663 13746
15122 13746 12516 21009 23058 21766 29641 30812 29744 21565 4242 5607 12364 20512 21871 24866
15108 24866 14682 11678 13277 20070 17795 23669 29392 18107 13949 12619 23658 28246 25134 20899
15094 20899 -913 -3383 -1875 7615 28050 30668 21899 27266 38814 32766 27561 25131 23095 38515
15080 38515 42303 29608 8724 14774 18905 13723 12283 32090 33000 27584 18868 24402 27182 23377
15066 23377 24497 35058 26303 19767 11481 9356 21916 18668 15671 30950 47139 52673 43460
15053 43460 40860 40581 30700 32066 22187 14843 4424 3949 20582 27281 23794 16013 12785 19838
15039 19838 28255 29641 43021 44745 40939 30410 23609 19993 21321 20863 23259 30450 26067 24541
15025 24541 19517 26007 33866 45471 39306 26113 27855 33215 28933 27898 38292 37500 43453 45527
15011 45527 30822 26965 26115 33544 41002 31748 28418 33273 25922 7504 -447 5164 6655 9043
14997 9043 21154 24721 13415 17266 26445 26082 18766 11092 6962 17482 20511 27060 33496 37931
14983 37931 38031 24582 13878 12258 12973 5426 -4665 -2869 4566 20042 30796 40961 38325
14970 38325 16218 1982 -7000 -14019 2056 24888 21212 14976 15251 12717 14481 28069 27940 26018
14956 26018 16842 12215 16117 22953 25353 31068 31776 20357 15755 13557 21164 27215 31101 32318
14942 32318 29343 30458 46820 55516 44177 37478 31839 24915 36317 37323 31393 29628 41641
14929 41641 45710 37423 35087 22571 28671 34590 22196 15654 19872 18734 19549 25525 40648 27069
14915 27069 22712 21149 29170 32050 18265 9295 17758 25907 19635 18777 33884 39032 31482 19563
14901 19563 19488 26825 35249 27468 19646 20863 30219 38168 40397 48122 37927 23491 23165 34421
14887 34421 42057 51414 53021 41965 31977 26998 27789 19344 16570 23700 25672 20340 26757 42864
14873 42864 43970 43963 44475 47035 46444 31191 21221 20618 27355 34068 33042 36967 37659 44647 56350 49463
14857 49463 38593 31494 25540 32445 37811 40771 42440 35030 27918 25179 33784 31082 19341 23307
14843 23307 41559 43403 35029 30531 18028 11031 11954 14130 14398 24883 37141 26639 27483 42866
14829 42866 42920 42874 43739 25860 34728 39154 31395 36797 37269 39503 42901 43184 32176 34527 33548 32617
14813 32617 16931 16504 25053 23231 21980 10414 15087 24248 17254 22948 29473 24597 43623 53510
14799 53510 39515 31726 33342 39809 57803 54166 43273 33620 30895 26049 13309 5983 14355
14786 14355 14901 17369 33971 54838 53290 41873 31498 20334 18536 19995 13167 14937 28321
14773 28321 30546 27215 41615 41520 48756 42982 36225 25990 36240 36145 31870 47076 59734 48772
14759 48772 42867 42788 33287 34236 26677 26944 37817 36822 34661 28597 11322 17455 41551 45171 33888
14744 33888 37933 54385 60047 39885 43450 50684 56118 42406 36204 50440 47210 46074 38391
14731 38391 45398 53237 57639 51719 48275 41660 36841 37177 32855 34160 31107 31849 41853 50990 57850
14716 57850 49324 40275 39980 46160 44110 55353 53099 67104 72166 72037 65631 51184 45619 60039
14702 60039 59914 52851 53737 54671 48952 48168 50067 44398 34223 38724 39439 44973 47201 41195 35263
14687 35263 41702 51888 57246 54182 54774 56502 59797 61925 60039 76961 67719 62066 58117 63673
14673 63673 66174 79892 70557 51748 44108 53746 60861 75144 75425 69934 73245 83618 87649 79865
14659 79865 75651 63251 68306 74552 55689 48065 49659 51709 40906 43273 52322 56505 41404
14646 41404 28893 29109 57703 63373 42655 34228 23919 25366 53678 64516 54471 44778 56491
14633 56491 56949 43880 39396 43652 50625 40871 32951 47352 43338 27336 23782 20872 27578 37720
14619 37720 51850 61371 74549 71439 61622 60465 51800 43138 50865 60594 76186 78590 61300
14606 61300 63008 64767 60878 56601 70180 60785 53851 63138 75771 70347 67852 63834 55655 56092
14592 56092 52634 54666 51824 61810 66956 54946 57322 46546 37446 40946 43499 54884 58675 69634
14578 69634 79855 78499 50290 51383 55952 62558 70549 56312 52263 57015 60802 65997 66996 55049
14564 55049 65493 66531 62137 66300 76483 60856 47635 49689 52569 53073 43720 41488 38008 45693
14550 45693 66753 66463 59369 63655 69882 73495 77403 76037 69416 64930 61285 68989 74402 69921
14536 69921 65825 64287 66772 67887 77863 84256 80868 78900 95306 102274 91251 82089 86552 109109
14522 109109 105401 101372 99861 109260 113640 121787 121146 121034 104457 107333 93805 92173 99156 90998
14508 90998 83025 71360 61943 64763 69851 67304 56484 56983 80221 92946 85518 85129 82034 85508
14494 85508 73610 72474 69051 68662 54784 37430 17935 1928 -16529 -18875 -20552 -32510 -55849
14481 -55849 -63789 -55157 -33139 -27329 3800 28313 47774 58924 69715 75690 78260 87579 88812
14468 88812 90690 90007 73712 75386 72916 72596 79586 85171 81585 72318 54683 65017 74663 76667
14454 76667 85174 85241 91295 96707 100137 99929 90379 94682 91859 85122 91707 101821 111213 106767 107052
14439 107052 96243 73713 72416 79100 84669 82498 75106 71648 76428 85557 80573 70871 73069 87649
14425 87649 101862 109933 108013 93273 100398 111417 109128 105844 105136 123546 131320 119050 112807
14412 112807 113900 116888 102818 87284 94854 94937 102030 105189 121538 129984 123031 124740 140223 145300
14398 145300 151773 156750 152348 144848 118776 112337 127090 122694 123548 119183 122512 134190 134643 116452
14384 116452 103674 111026 122215 127746 118695 127962 142933 141288 131080 124630 131972 138467 148763
14371 148763 162684 172493 165684 149492 149297 145352 136598 129944 138536 152232 162532 163694 166700
14358 166700 171754 165945 173080 185999 191834 192245 188756 196474 204923 198548 199841 212029 212303 205873
14344 205873 190366 185108 183073 187683 201795 208886 223014 237314 257721 276298 280843 273640 267941
14331 267941 256998 254490 252912 231996 198066 166317 141177 117503 66446 29432 12263 7552
14319 7552 13013 19199 29212 48960 70330 88608 104265 115547 121976 143124 167934 156157
14307 156157 136453 140390 136549 133588 136909 144160 162662 169202 182496 186500 170552 158545 177562
14294 177562 194440 207494 209664 211123 212905 215326 217009 233383 244277 248629 261128 291294 320447
14281 320447 334226 359700 412915 455540 511610 476188 379120 402965 447015 582202 713337
14270 713337 773922 822271 770777 663912 596323 547012 482683 421759 367138 343734 344986
14259 344986 334933 320226 297821 295935 306430 300185 287773 287315 291125 285562 287980 278484 271968
14246 271968 261640 245999 225609 226091 238506 246193 252316 257884 284535 303265 328520 344708
14234 344708 350870 353790 341371 312397 292537 298331 296679 290196 273253 271950 273679 267509 266658
14221 266658 263353 253538 234222 229958 234281 242406 229766 229470 236983 240989 227635 223322 246541
14208 246541 259362 293341 335521 377828 408299 453788 503690 530385 553049 586367 585825 580581
14196 580581 592391 580217 567143 550404 546514 556940 532218 509533 502079 505564 501509 483525
14184 483525 485667 490672 498630 512565 527374 559122 581869 602037 625600 620575 591425 591695 599673
14171 599673 589920 576517 588131 603734 621300 624536 623646 645682 670540 682265 692222 691324 705612
14158 705612 725534 735582 752815 789254 842187 876942 892841 875224 916334 1043434 1082517
14147 1082517 1156803 1325219 1532846 1635086 1741998 1822738 1711079 1553954 1454304 1379415
14137 1379415 1315716 1273163 1261218 1255915 1257942 1259906 1237002 1233615 1245689 1261677 1283014 1295999
14125 1295999 1302263 1320542 1341993 1362624 1392585 1430269 1458779 1490020 1516401 1537614 1540588 1544921
14113 1544921 1558590 1590806 1625017 1665493 1712467 1767193 1815370 1865916 1918544 1951039 1989894
14102 1989894 2025276 2065513 2097691 2150443 2192485 2223287 2272763 2319644 2373390 2431266 2493481
14091 2493481 2563221 2633107 2718620 2815378 2900686 2980590 3063272 3160095 3279435 3396722 3531700
14080 3531700 3689431 3835259 4003957 4194775 4407700 4632713 4855482 5079163 5294383
14071 5294383 5517010 5727418 5911271 6091013 6270420 6470507 6685253 6897229 7140213
14062 7140213 7427297 7743057 8067993 8409568 8789179 9201176 9644691 10119957 10650502
14053 10650502 11234536 11863468 12534162 13245774 14038651 14901971 15823884 16856368 18006207
14044 18006207 19252795 20624307 22187090 23991194 26089695 28598249 31590923 35010502
14036 35010502 38777485 42978530 47730092 53263746 59992363 68256038 78845232 93366830
14028 93366830 114411741 146094409 194408108 261493676 339044490 400861290 420395617
14021 420395617 441473924 509556047 582158575 582527602 523531025 446727758 374786351
14014 374786351 298494952 223521285 167853851 130305038 104613818 86334223 72956023
14007 72956023 62923438 55203017 49113826 44225745 40229822 36928387 34178226 31864896
13999 31864896 29890246 28181438 26688935 25341942 24120458 23029288 22047586 21163182
13991 21163182 20353916 19596591 18899119 18224915 17542824 16855324 16214251 15586759 14959376
13982 14959376 14361474 13778332 13206840 12622695 12056591 11506644 11016696 10547011 10099537
13973 10099537 9682441 9315582 8994769 8687462 8397837 8115788 7859388 7643459 7449767
13964 7449767 7286272 7147405 7023336 6916809 6815296 6700589 6574114 6442118 6299794
13955 6299794 6130017 5953074 5779955 5599172 5432237 5286243 5146543 5018312 4905949
13946 4905949 4782698 4656534 4539671 4431359 4314931 4191753 4067282 3952959 3853794 3745532
13936 3745532 3649984 3577468 3502326 3410880 3317923 3246264 3182865 3122999 3059691 2990889 2921911
13925 2921911 2847680 2762536 2697968 2631944 2559020 2492849 2442191 2394892 2366479 2326550 2289669
13914 2289669 2273414 2251702 2215007 2169851 2119818 2071416 2020998 1989472 1957503 1906441 1849853
13903 1849853 1815957 1797185 1750349 1641914 1547421 1514236 1494844 1531506 1604774 1668478 1699749
13892 1699749 1681109 1629724 1622916 1629205 1598751 1555203 1516883 1463725 1412733 1375379 1319854 1280588
13880 1280588 1259690 1230250 1209394 1189947 1160566 1133609 1105310 1082615 1056508 1044137 1035308
13869 1035308 1016903 985872 939569 879877 865977 874010 857577 839417 840415 821046 801766 802509
13857 802509 804712 775939 748365 743976 735443 711111 677865 658519 621592 595887 573596 537550
13845 537550 504539 472589 462452 453398 451188 444463 449594 458135 455605 440154 456193 502433 554915
13832 554915 581085 597202 612388 629115 621092 607242 595498 586725 585575 578749 559653 527947
13820 527947 518794 513430 498564 491490 479833 470420 448653 424431 409788 397940 373567 363495
13808 363495 366561 359213 345787 344738 341997 352769 358328 359566 345834 327619 334205 348571 352984
13795 352984 358121 351723 339356 324398 305001 301669 284794 285324 267131 257520 251860 249553 234405
13782 234405 223386 207702 194463 187981 186734 195114 201600 202148 196176 182613 180573 210485 253092
13769 253092 297798 342257 369017 344208 293764 266869 252026 250039 234191 215743 207911 192672
13757 192672 182464 184506 186257 193808 203967 193077 187071 171247 166854 174214 180652 163977 162549
13744 162549 176889 179561 184930 169102 163688 156902 157348 161356 159809 164617 164582 170721 163763 150755
13730 150755 148338 142128 152254 160439 168235 171150 182324 199335 218810 238067 234270 219804 221903
13717 221903 227849 210489 166029 131579 113020 92469 69051 21701 -20157 -33955 -36042 -37453
13705 -37453 -35020 -38927 -32159 -6057 5857 12177 17649 19869 16814 20277 6993 1377 15607
13692 15607 17250 2220 3400 -1726 -278 4500 -106 6821 16725 17949 21452 27779 44302 55728
13678 55728 43645 53819 57646 47701 41093 21634 20997 19102 793 161 -6253 -19025 -11155 -4820
13664 -4820 6840 18502 16032 15277 15166 19744 31017 35986 28152 27293 23375 18725 21761 15068 17247
13649 17247 29070 22125 17903 12248 637 -417 1652 -6446 -6056 5012 17847 10312 7068 13016
13635 13016 13723 20675 8663 -6723 -386 4384 17005 15574 6631 -4619 -1487 -3583 -3625 -18375
13621 -18375 -12742 1401 5777 8514 12556 17799 22652 15994 23774 27581 25446 22570 21192 12711
13607 12711 15493 19853 17613 8906 -218 -2290 5507 4546 -10054 -15194 -11785 861 6721 9634
13593 9634 16887 11514 -1735 -8551 -4835 9900 13409 11321 6391 3213 4357 4290 12331 9957 12338
13578 12338 10121 7581 22815 28386 44378 39748 34050 31562 26446 13801 9803 -1156 -10471
13565 -10471 14014 41873 41386 43862 53545 57150 52061 77200 101572 112665 97284 82390 75328
13552 75328 67271 50093 49386 52927 37492 16667 9983 13532 15358 2543 17163 16615 9298 7804
13538 7804 2968 -9064 -10620 -121 7303 6447 1220 -10948 -18757 -26967 -15788 -13588 -18816 -14450
13524 -14450 -17400 -14327 -16133 -15359 -19060 -25494 -10542 -8080 -7747 -5553 -20195 -35566 -28190 -9975
13510 -9975 -8895 -12181 -15756 -4381 4 3874 -9378 -4886 2677 4961 1284 -11990 -8018 -16329
13496 -16329 -13123 -14960 -6628 -3305 -5083 -4471 3184 19321 10521 8246 -2405 -18124 -8761 -2690
13482 -2690 -8512 -14519 -4901 1409 3551 10077 12484 11138 18992 12334 9903 8247 -7525 -18347
13468 -18347 -18838 -7376 2697 10937 1052 -4995 8168 -3526 -5083 5817 15990 11436 10125
13455 10125 13221 15653 5888 -1628 2829 20814 21051 24032 37389 29602 27333 27311 23681 16290 4931
13440 4931 7183 -5205 -16518 -3848 -51 9675 11808 14624 6288 -13101 -20195 -17791 -7664
13427 -7664 -3033 -803 -4711 -18452 -12843 -4668 -16636 -27385 -23558 -27995 -9951 16861 24419
13414 24419 6753 -920 4451 -3824 -16411 -23371 -11243 -5067 1831 6490 14335 15100 17481 19270
13400 19270 5674 2963 -2085 -14275 -15411 -3579 6972 10573 5121 7879 6230 3763 6818
13387 6818 8583 6586 -14851 -33954 -42711 -45940 -51621 -58746 -46749 -53383 -47348 -37988 -38632 -33110
13373 -33110 -23679 -19800 -11770 -14142 -26530 -25815 -27875 -24317 -9971 -2595 -24028 -29178 -24677 -25210
13359 -25210 -25240 -17782 -7089 -5408 -15574 -13973 -11165 -3659 -1028 -714 -830 -916 -3079 -10579 -7036
13344 -7036 -3594 -12474 -6231 -8529 -23630 -15600 -8655 -1504 2075 -4127 -12155 -10352 -3046 2759
13330 2759 -537 -1788 21685 29677 11020 4590 6833 3984 3187 -96 -3546 -16380 -24644 -35416
13316 -35416 -32506 -24108 -12371 -11052 -9913 -16132 -13697 -5989 -1395 -2149 -8585 -19003 -13906 -5659
13302 -5659 5083 15801 15565 -4089 -9838 -4805 -1153 -808 -8288 467 1048 -5152 -10924 -16024 -8705
13287 -8705 2025 -1521 -18096 -18389 -9512 -12682 -20378 -23587 -12086 -13632 -27060 -20928 -11923 -14108
13273 -14108 10399 18848 11981 9261 1583 4050 8098 -3004 -6083 -6821 -14354 -12649 -11535 -9408
13259 -9408 4501 9384 -4147 -6672 -12339 -7664 -4788 -11249 -20638 -39803 -35998 -24904 -20543 -14451
13245 -14451 -15224 -17649 -888 2220 -7060 -14148 -16007 -4615 -592 -12417 -13742 -17515 -18386 -16081
13231 -16081 -21094 -25008 -14026 -12807 -17115 -17342 -14332 733 -680 -9950 -13929 -9596 -6756 -18358
13217 -18358 -25053 -9398 -9146 -6674 -10982 -13265 -4140 -10593 -18499 -22535 -24918 -15472 -10277 -3699
13203 -3699 1594 -7402 -12254 -17751 -8415 7039 6563 -3188 -1280 -1855 7019 4996 -1146 -5102 -1281
13188 -1281 -2153 -9490 -14716 -14308 -11001 -10455 -16308 -28261 -28368 -7442 -4909 -7389 -9989 -5788 -19384
13173 -19384 -23365 -20875 -7481 -8427 -7001 -7380 -13149 -4822 8057 9500 958 4647 -9592 -21389
13159 -21389 -22088 -20823 -29409 -39141 -22134 -9810 -10926 -10117 516 12089 1656 -14921 -3492
13146 -3492 2200 3914 -6177 -18456 -17529 5781 7517 9082 -1111 -16819 -15577 1166 7084
13133 7084 -12705 -23178 -15585 -7849 -9488 -16994 -10484 -12238 -1303 7727 16996 -4378 -21449
13120 -21449 -25490 -19435 -15024 -1058 12191 9163 11675 20395 16908 -702 -5341 -5403 -8348 -14801
13106 -14801 -17360 -12554 -5645 11207 19816 727 -2927 9484 6090 -8792 -17215 -17541 -10636 -13562
13092 -13562 -19035 -19727 -11475 -20095 -44264 -48875 -35715 -27934 -30608 -29213 -25151 -7624 -683 -4088
13078 -4088 -210 -629 2745 6559 -3586 -3586 -4482 -20829 -16512 -11975 -5438 6128 6629 -2231 -11626
13063 -11626 -13320 6704 13719 18637 1206 -8698 -12648 -9476 -1381 12872 12268 11979 11895 -5666
13049 -5666 -18432 -29960 -25739 -12491 -652 8452 6555 -359 6113 -404 -8819 -14520 -16005 -14726
13035 -14726 -25053 -36852 -40376 -28719 -11550 -3354 -7734 -3421 -1656 644 2962 -975 10570
13022 10570 15666 22594 20618 11897 6908 -1729 81 -162 2231 7169 5463 9413 1668 2273 -1688
13007 -1688 -17490 -12875 -2164 2398 5304 -8726 -18734 -7159 -6605 -21741 -21428 -18502 -7988
12994 -7988 -1462 1843 -9518 -12855 -3759 -727 -4272 -9994 -6017 -4440 -4890 -8858 -9515 -9430 -4688
12979 -4688 -11641 -14898 -11894 -14121 -5868 -1310 -3884 -9012 -10210 -902 6673 1115 -11199 -11986 -10052
12964 -10052 2891 12670 24250 11171 -4880 18393 31861 28311 19141 12953 4443 -15074 -24067
12951 -24067 -15674 3503 3582 2938 956 -581 -9944 -20610 -11704 -12292 -16021 -12015 -20486 -31456 -21654
12936 -21654 -12323 -12081 -6938 -11282 -19216 -18646 -12075 -8133 6256 17069 21248 7797 -2887 -15830
12922 -15830 -30486 -29668 -25235 -17690 -12592 -7315 3704 9038 8139 6571 248 3739 11647 1316
12908 1316 -9975 -10905 2797 10778 19457 16641 14338 22107 3066 -11779 864 -1033 -12479
12895 -12479 -9070 -5458 -21114 -20351 -11044 332 -5734 1510 13756 14612 3797 3832 1513 1183 7695
12880 7695 9820 1153 -3180 -3377 1083 3614 7187 -1301 -10032 -23016 -32375 -36610 -22494 -18597
12866 -18597 -7131 -27621 -34191 -14969 -22676 -28391 -26782 -17436 -11815 -9215 -12665 -2676 4287 755
12852 755 -10185 -14418 1510 9240 -102 -5502 -8336 -5215 9036 13628 10625 5785 3639 -1181
12838 -1181 -9124 -20416 -37625 -39741 -31535 -9947 -6480 -5487 -3679 -11253 -1547 2867 5543 8419
12824 8419 -14951 -21542 -14831 -10811 -3881 9617 8445 12168 4449 -5803 3352 14787 15623 20993
12810 20993 15407 11420 30394 34580 29664 19200 15160 21575 31598 33579 27529 26290 14245
12797 14245 4760 5091 17234 21640 7287 12396 4678 4033 2846 2228 6129 13928 8194 -5950
12783 -5950 -2852 -1173 15450 24374 25011 21087 17712 25990 38124 47387 35769 31349 35129 37788
12769 37788 48411 52952 33407 20881 17247 19373 18067 11896 8626 25720 40330 43339 43970
12756 43970 39809 43276 45366 64391 81006 108034 117266 128707 129097 131381 139413 128541 118792
12743 118792 113532 103884 89153 75686 80236 90609 80070 62561 49894 47590 56328 58873 64274
12730 64274 51549 31908 10068 11975 26474 26922 20356 28547 41993 32721 23668 12381 7290
12717 7290 9870 17448 15693 18528 16500 6745 11573 17922 5609 3721 -2368 -6623 -7967 -6361
12703 -6361 14085 17117 12908 15088 20289 28756 23606 8544 7671 10543 16078 11279 -3511 1309
12689 1309 17855 18251 11382 21700 29558 23198 14412 15082 15247 9767 14589 -2959 -6008 -9127 -16301
12674 -16301 -25432 -6722 -4124 -3944 -2678 -188 11436 11193 6569 14143 9836 -7026 -5077 759
12660 759 12562 15618 18839 26556 19975 4967 7021 -2917 2346 15770 20138 14852 21447 19922
12646 19922 17233 14378 10277 16284 14819 4723 12621 10487 24485 33618 39247 28575 15327
12633 15327 12908 -2173 -7772 4273 11775 50 6138 14215 11352 5039 -5467 -6933 -9041
12620 -9041 -6126 -1583 12319 10489 4307 -5256 6389 28047 26279 6597 -3902 -8014 -6934
12607 -6934 536 4821 9559 2013 14685 29946 18681 15020 21187 22677 20146 25627 34544 40588
12593 40588 44561 34917 29496 29249 48810 44147 33508 23344 24464 32126 30337 34822 39680 41011
12579 41011 39369 43192 35096 32808 40090 45073 46550 42245 41034 45103 42582 44302 47787 42105
12565 42105 40524 42604 48457 46303 52159 58202 51352 50151 42402 36627 27026 17737 23234 26896
12551 26896 26083 24421 18031 10040 15868 19599 16113 12414 17425 21943 26762 34856 36744 43362 51842
12536 51842 56465 56986 43011 30409 11978 25334 31842 36094 31821 19250 31830 34341 27495
12523 27495 30147 42937 38845 29017 10991 14553 29120 21889 7978 6006 9623 15773 7485
12510 7485 10403 26270 28170 29668 52999 51891 56062 47577 38593 34867 44444 53798 56803 53827
12496 53827 58756 66789 65588 61169 55569 49754 46588 41149 41060 46712 35556 31574 33566 44194
12482 44194 49414 57369 60626 61453 67954 70211 62999 67301 61297 46201 55947 66987 63507 41722
12468 41722 40995 40409 47282 59021 74790 75977 79952 69668 80211 103018 117413 114660 100554
12455 100554 90385 89098 93469 83567 86549 92044 89627 96904 113975 123060 124694 123378 129087 133650
12441 133650 127929 138820 156190 151463 122448 109586 113557 110245 108106 118637 127576 133714 148445
12428 148445 165346 163458 150265 151621 149609 152690 138154 140359 144837 164447 162976 157054 152220
12415 152220 151246 154714 149304 158250 157327 150923 156621 175325 181353 191174 204565 211578 226351 240287
12401 240287 234588 226556 223238 237993 243684 243846 252313 270137 279640 270741 297795 310675 327602
12388 327602 344744 356469 373147 370676 380545 390020 411572 432067 450592 459654 470228 488874
12376 488874 509405 529422 548538 579387 602927 623971 644400 665135 694062 719365 754052
12365 754052 787990 813667 851543 886095 918466 952664 992133 1047729 1108466 1165617 1225719
12354 1225719 1296491 1368908 1460145 1544383 1628905 1726683 1836082 1968173 2112408 2259995
12344 2259995 2430003 2633924 2858869 3116432 3411556 3738247 4093209 4494964 4956827
12335 4956827 5461021 6027701 6689331 7463020 8369042 9452833 10776990 12365949 14232081
12326 14232081 16378205 18701177 21063513 23336357 25407505 27153533 28467619 29213331
12318 29213331 29230393 28415560 26868820 24737699 22256176 19663437 17159013 14884934
12310 14884934 12921928 11280787 9908455 8759315 7827142 7063449 6411694 5853442 5361898
12301 5361898 4923461 4543029 4201814 3886378 3606131 3360697 3147830 2942091 2747781
12292 2747781 2605837 2471153 2337357 2208491 2095254 1985487 1896253 1827093 1754445 1678935
12282 1678935 1622414 1545173 1467827 1406934 1351307 1303630 1257297 1203686 1160482 1103735 1046999
12271 1046999 1017111 995074 960434 900737 867338 854893 841850 826416 796847 772600 759813
12260 759813 742325 717259 695875 674501 644816 622815 618164 611322 599801 586217 567558 542463
12248 542463 531387 521528 525551 510279 483860 467190 454498 444426 432561 427096 424550 429819
12236 429819 417356 398077 375908 368622 352298 344725 349243 349463 345288 347710 348370 340796 314163
12223 314163 297417 291131 285413 280267 297574 300326 276427 269846 281337 271411 250667 242922 241005
12210 241005 249854 240984 231874 228653 215887 208215 216730 214837 204867 200632 200521 195191 181493 178618
12196 178618 187872 183599 179723 175158 165897 162921 153742 150063 159492 158636 147880 147637 136710 128716
12182 128716 126124 128800 131383 133555 127902 121552 129026 133116 127631 117279 117873 114570 113297 107039
12168 107039 106032 109870 100417 92292 93988 108272 99475 89730 97394 93744 97483 100738 102794 96454
12154 96454 94929 104766 102644 93103 97078 97980 98288 92159 81325 76004 73712 64307 54029 64597
12140 64597 73402 73860 65728 58451 64470 77180 85043 85827 82366 83259 86038 96504 98785 90442 92715
12125 92715 91192 80669 77905 75399 71520 68582 70304 77647 79344 76664 68114 72554 92689 97158
12111 97158 92257 100000 93501 97441 95118 89900 92656 98805 91980 82450 79413 74572 78208 73384
12097 73384 70476 70534 73553 74627 71358 79823 96674 109217 109020 96059 103595 105127 100689 110987
12083 110987 140006 160548 192532 223877 246657 266118 277764 305562 335103 352633 352653 320163
12071 320163 282561 248579 211370 182510 158422 134647 133998 130466 116175 110654 114828 125053
12059 125053 124495 129027 123388 113944 106622 98227 92670 80207 64496 76578 106909 122033 137040
12046 137040 145034 146979 154619 159066 192010 204189 217574 243307 299112 373542 476590 587632
12034 587632 682490 751918 809380 869100 946752 1001559 984192 893660 770574 646146 547307
12023 547307 465751 386641 314715 268081 241209 205476 185697 169325 164857 148743 120834 110084
12011 110084 112806 119854 101553 97582 108188 117656 117206 130185 145735 154261 153951 164328 164910 175976
11997 175976 185016 204997 231845 265965 316280 385971 488458 585511 676241 738160 794898
11986 794898 888163 961342 992146 946238 857343 743174 620361 490270 378150 306069 271694
11975 271694 229248 194377 175351 164146 149312 127195 120853 111695 106150 95360 92924 90709
11963 90709 87337 95876 88922 91400 101831 106323 98930 99192 100165 102625 98590 104089 116922 135261
11949 135261 156071 163693 191757 219617 263819 306361 317933 318031 341074 374017 381679 349175
11937 349175 322217 299609 258814 220913 182219 153300 140073 120296 104342 103548 81707 79249
11925 79249 68629 69354 67155 82882 96872 83145 69338 68581 74209 82599 80808 74541 59056
11912 59056 57328 59154 69879 81885 83588 80943 73438 74580 73928 77060 72373 75741 88302 96696
11898 96696 97711 102818 126137 135898 126430 134511 140368 162004 170883 178476 178288 167812 154488 147608
11884 147608 145290 147579 152008 147485 136588 121917 121600 108786 98888 83110 70935 75447 79036
11871 79036 81038 76154 78621 80280 69057 69265 67287 68075 61893 57325 63241 57693 55873 70541
11857 70541 75347 67586 63708 55439 48391 43586 36801 37965 40280 41035 44920 41249 41000 44184 37325
11842 37325 26314 35647 28297 15769 25493 37960 32134 42562 67151 69978 61867 51529 42228
11829 42228 37716 33829 47752 53936 40471 30646 28356 23124 31955 34311 31933 34403 35105 38896
11815 38896 39742 34489 33887 29154 32449 29516 30681 37628 29140 14495 10210 8964 11585 17902 19458
11800 19458 31684 33853 27844 20968 18829 11998 24636 29671 31552 31739 30190 42908 54815 42626
11786 42626 48619 52016 52973 46331 50222 37700 28756 35847 44219 59969 66613 49370 21156 15266
11772 15266 27235 38982 49990 55762 53710 51617 59782 54014 55346 55588 34390 33880 44383 46704
11758 46704 52128 54742 43235 33271 30245 48372 60416 65452 71051 76823 76529 71503 63139 65214
11744 65214 58297 48283 42076 50748 67133 58448 53442 39890 28711 34352 47410 58798 68563
11731 68563 67010 61573 56285 40748 30022 33008 36900 39237 41417 46177 48577 68910 81546
11718 81546 84855 88161 78954 65182 64518 76010 84794 89435 91223 95848 91449 88101 97641 99283
11704 99283 88775 88380 94683 100461 102081 98645 86008 87805 108445 118893 127019 143329 146006
11691 146006 142220 146869 147489 139695 139049 153904 168437 188452 206799 225899 257254 278960 308362
11678 308362 347971 387534 421507 474384 543784 648315 788182 997376 1300825 1733334
11668 1733334 2264593 2752922 3081433 3251603 3538473 3976864 4318959 4252886 3856048 3311762
11658 3311762 2721609 2142314 1641296 1244598 972885 795700 678619 571565 495554 442404
11648 442404 399018 367049 346013 322601 312687 290502 270706 252205 252907 235058 215133 208659
11636 208659 193327 200675 191804 184251 176571 173509 168693 156954 148616 154086 166131 160409 144551
11623 144551 138075 128729 122801 126743 135332 128638 115422 115498 113672 111387 115168 115234 104847 90185
11609 90185 79591 87440 111756 128448 133988 131991 126047 104141 101853 95979 92075 82834 91365
11596 91365 107430 108898 110549 113793 112384 98893 91979 109047 111003 114079 117890 99632 90168
11583 90168 83156 83162 94355 123821 121655 97835 96466 96827 100095 101070 91705 94473 92370 80342 89549
11568 89549 102003 105195 102260 86358 74271 80489 98108 94125 86646 83589 92538 92187 78831
11555 78831 74543 75941 72864 66780 87272 102570 105557 93341 94230 90729 79034 79940 79063 79265
11541 79265 85345 90715 100782 103238 98958 106909 111331 105612 98750 95127 95141 91100 86352 79197 74556
11526 74556 88367 95280 99202 91793 88345 89364 97523 92466 83637 77960 83738 91542 104311 106041
11512 106041 85219 70551 60762 77016 81040 65150 50443 47714 45333 50030 59645 72540 87875
11499 87875 96541 95577 86155 82313 73586 67907 72572 59563 52759 67523 69371 57792 59472 67871
11485 67871 69126 86732 91943 90540 89788 87515 89083 95642 88318 90959 88022 87208 93644 102948 109603
11470 109603 92175 78722 87887 84487 72071 61936 56648 68199 74733 86561 86563 90012 87449
11457 87449 86099 63399 53906 61819 77149 86495 94574 105257 102032 103720 100235 96761 99460 93059
11443 93059 97333 105368 102299 94041 83730 87481 91305 108665 102890 103412 112007 109886 107461 111871
11429 111871 108985 103317 87618 81360 83235 81881 80098 88128 106570 125021 124191 116232 110853 98616
11415 98616 99986 97947 96796 101602 103695 110028 105160 113231 117855 114735 105231 108131 109359 103463
11401 103463 101986 101120 88902 87634 99634 113348 122002 108064 105174 101353 91272 102002 108657
11388 108657 109561 114674 115671 118763 109391 99444 106583 117396 117029 110686 122370 124813 125288 121750 101035
11373 101035 109955 131418 114188 108896 117644 119633 110180 107648 92415 82812 87456 110484 109222
11360 109222 109000 92210 88034 89409 116494 132440 126579 125307 122955 124274 128842 123902 117810 133367
11346 133367 123715 117113 124053 117600 110611 106442 113964 115959 117255 127212 147979 145632 141446 131732
11332 131732 130821 132679 128322 116245 119944 127606 134924 140495 152058 142861 129382 130150 130757 122913
11318 122913 132614 141501 137650 148252 160358 151680 136403 141361 147469 138987 140215 151596 154367
11305 154367 163851 170010 166253 164571 145981 129226 132350 131347 130446 128210 126758 134109 130104 127166
11291 127166 120813 126397 131751 132598 134287 151040 159324 153467 149516 146451 141812 147727 149415 147052
11277 147052 149223 151598 151142 156989 160893 160244 177136 194068 186627 164847 163116 171869 181668 188625
11263 188625 181488 174187 167684 150294 142708 155474 170331 173442 170177 159838 163013 172189 168420
11250 168420 162622 170266 185190 178585 170174 172139 181913 188342 194550 187839 198013 207409 202291 197498
11236 197498 186378 178907 187423 193793 197776 192520 176470 168797 189540 198512 203236 201755 198741
11223 198741 195735 192204 194261 197954 199316 200545 194645 200062 196883 189549 188548 203387 205134 212126
11209 212126 222865 241713 247729 254739 232216 209707 211697 214319 214389 216192 236498 241214 230624
11196 230624 216793 218295 222650 214790 218215 221528 208308 208143 211569 211833 222808 220140 216270 217840
11182 217840 227645 236843 248394 252105 266526 271322 261541 253867 254293 263277 265124 268750 249718 242997
11168 242997 253752 265030 258339 250674 263216 265873 254190 239172 245871 243862 243103 266923 276688
11155 276688 271851 279156 265705 254356 251791 256349 253699 254654 252567 253562 266443 272142 270661 276930
11141 276930 274910 281083 281214 271832 272463 295860 302943 302200 286444 273273 286658 287906 289830 284523
11127 284523 281761 299749 300363 308782 312033 306086 298334 293440 298456 307010 297992 294628 296811 308848
11113 308848 308745 299770 298319 312096 310020 321617 314161 310335 334005 361198 364362 364065 364926 357388
11099 357388 342136 334724 327272 337530 342452 337545 332650 337288 334992 349359 349591 346005 349090 350744
11085 350744 337603 358613 367928 350174 356950 365641 377752 387315 376146 353776 351545 368592
11073 368592 378466 380823 391739 397971 396309 392175 382871 377025 382156 392827 399188 395917 388974 378953
11059 378953 381636 386174 389909 386718 387206 396404 405842 403528 416087 422071 421414 432212 437963 423620
11045 423620 404873 391410 399495 419823 426951 438799 447119 431742 418393 420515 419631 421834 434172
11032 434172 437855 430837 442401 437858 432756 446297 447040 445520 450735 457046 468892 472999 460689
11019 460689 458263 465499 476310 480927 464495 471140 482373 484002 486935 490123 493217 507720 506520
11006 506520 492175 473738 476570 497189 508894 504066 497481 492684 510370 515166 506040 504894 515736
10993 515736 525935 527478 541171 545253 549486 554993 555804 542296 520796 514354 521804 531409 547190
10980 547190 561882 561874 548772 553710 570674 576470 567193 563894 580513 583679 584542 582951 585703 589112
10966 589112 591406 599785 606932 612959 625778 622686 619262 611796 592964 606941 622996 640013 640385
10953 640385 648280 652312 648688 659667 674599 667762 672023 653797 652750 655460 654051 667442 674851
10940 674851 664984 671914 680878 678063 685985 680387 682469 695537 696022 688570 691892 699416 705054 690970
10926 690970 702653 721130 730537 734742 724612 724886 727433 733153 731485 741094 750381 759216 761769 762843
10912 762843 759931 772447 783752 777652 789655 783147 771962 770583 778704 781281 796236 805766 811477
10899 811477 811394 807730 800159 808197 812894 830149 838305 850497 864932 866161 855325 845714 852706 845466
10885 845466 856003 872485 877497 871388 879429 884802 890000 899599 904352 897674 892050 879009 893636
10872 893636 910242 909203 911238 920741 931967 934813 931916 948819 945887 943264 945009 949085 953105
10859 953105 954403 966236 982200 984743 989976 986303 997209 1000119 1000805 1005304 1012359 1024305 1027018
10846 1027018 1026309 1032106 1035287 1044457 1040505 1033917 1043346 1057585 1070500 1072323 1080981 1072773 1068765 1081219
10832 1081219 1071190 1072518 1081145 1086752 1087159 1075814 1078493 1090632 1095034 1104724 1116744 1121134 1119048
10819 1119048 1128550 1142511 1147394 1163541 1169697 1171854 1177003 1177301 1183805 1194688 1204539 1217065 1207444
10806 1207444 1203790 1211777 1228934 1245728 1259355 1247901 1240003 1242516 1248145 1253051 1260911 1259800 1257574
10793 1257574 1270241 1292824 1292464 1293368 1296985 1300006 1304818 1303966 1323738 1335508 1349989 1339911 1326251
10780 1326251 1328774 1332727 1336866 1335457 1344023 1344836 1361585 1382288 1383984 1379502 1393712 1402274 1401150
10767 1401150 1403198 1405782 1415408 1422998 1422899 1425620 1425219 1428060 1435324 1445470 1449026 1465647 1483067 1489843
10753 1489843 1493788 1499145 1499311 1497490 1499806 1495217 1516514 1527178 1532515 1529919 1538836 1549022 1548338 1540152
10739 1540152 1542096 1550467 1557954 1570389 1577605 1580009 1591400 1591857 1608229 1622747 1631233 1641052 1653088
10726 1653088 1653530 1634452 1628138 1621465 1625580 1636688 1641809 1645518 1646389 1665118 1685853 1685525 1692577 1707110
10712 1707110 1708997 1708978 1720428 1724901 1731164 1725116 1723349 1737882 1754491 1772412 1770367 1779531 1789642
10699 1789642 1791063 1789359 1806877 1815992 1817174 1806866 1807347 1822018 1825610 1835451 1846687 1862729 1871209
10686 1871209 1864521 1866641 1879725 1879788 1878576 1893906 1905062 1907832 1905738 1929256 1934034 1942733 1962377
10673 1962377 1960317 1957588 1957396 1964438 1961344 1967502 1985678 1993024 1991761 1995523 1985129 1983952 2002137
10660 2002137 2015153 2025535 2024943 2024832 2033578 2048427 2052894 2045430 2056091 2064948 2067017 2057657 2050817
10647 2050817 2057897 2063733 2079148 2094350 2113494 2118661 2114065 2117982 2114428 2115992 2117611 2137869 2145598
10634 2145598 2150295 2149921 2163500 2171215 2179003 2180303 2190745 2200652 2192504 2200741 2208560 2211391 2210956 2227741
10620 2227741 2230547 2240031 2241217 2237931 2243318 2253208 2263858 2261995 2255441 2263498 2273276 2289685 2292370
10607 2292370 2288261 2286626 2300469 2308028 2310909 2314192 2322104 2339011 2349151 2354048 2350885 2335546 2330170
10594 2330170 2330260 2341856 2367814 2388587 2395292 2396992 2395512 2395046 2383983 2381578 2386212 2392351 2397997 2408103
10580 2408103 2415324 2417637 2415729 2424351 2425734 2429632 2423843 2435691 2451032 2440346 2452695 2460879 2475963
10567 2475963 2483238 2485644 2480443 2469098 2488884 2496103 2503653 2506282 2493978 2503345 2509170 2508404 2527764
10554 2527764 2548403 2555461 2552624 2551588 2555403 2557983 2556809 2550042 2554567 2557332 2568428 2579480 2574424
10541 2574424 2581229 2586875 2590883 2593518 2595626 2614112 2604860 2597520 2610884 2615724 2615432 2610409 2617331 2623990
10527 2623990 2627799 2635989 2640454 2636497 2631529 2633342 2645169 2644956 2629705 2630501 2635073 2648248 2666559
10514 2666559 2668679 2663949 2673180 2669367 2671778 2682659 2694587 2707046 2709277 2699083 2698313 2694916 2697425
10501 2697425 2706210 2703511 2709472 2708318 2696989 2702645 2718535 2718746 2711470 2715445 2726620 2710950 2704603
10488 2704603 2692790 2700385 2719073 2732364 2744730 2740238 2732171 2740595 2743865 2746587 2743009 2748947 2754046
10475 2754046 2762601 2770094 2765771 2768483 2775168 2766082 2760075 2762529 2756937 2760127 2770387 2770796 2758422 2757742
10461 2757742 2761421 2766946 2775604 2783673 2790199 2791929 2800477 2800535 2801454 2803450 2804589 2804196 2795062 2797843 2793563
10446 2793563 2805029 2806089 2795923 2793451 2800083 2799044 2787875 2797481 2807785 2806200 2811156 2806890 2811410
10433 2811410 2825668 2826791 2836499 2847227 2844139 2826201 2828074 2832204 2838850 2837559 2826823 2829370 2843832
10420 2843832 2839892 2835754 2839403 2844906 2845974 2853080 2873422 2879531 2866573 2857004 2838120 2838519 2843734
10407 2843734 2841322 2845630 2838974 2846521 2849759 2845233 2851287 2853132 2848073 2847925 2855847 2858201 2856663 2853984
10393 2853984 2858382 2864133 2860023 2862338 2870629 2864071 2856662 2870972 2877272 2874319 2871586 2869706 2875310 2888735
10379 2888735 2899026 2887724 2882014 2864106 2860281 2865428 2867364 2870581 2872927 2865025 2852350 2855254 2865082
10366 2865082 2862138 2870025 2888549 2901993 2894406 2884284 2872736 2863421 2864857 2867777 2879697 2869208
10354 2869208 2875608 2881538 2879940 2883618 2892496 2892995 2906239 2916459 2907682 2912972 2914547 2912759 2908655 2917207
10340 2917207 2911991 2896809 2892702 2886884 2884534 2895018 2890979 2882845 2882982 2895198 2888261 2886388 2889147
10327 2889147 2880657 2896026 2904266 2901155 2898055 2897093 2901014 2904848 2899522 2897272 2900261 2901619 2900826 2909698
10313 2909698 2919458 2923772 2913044 2909504 2897826 2897014 2897754 2899842 2897761 2892671 2903195 2913563 2922423
10300 2922423 2930811 2927662 2945583 2941997 2935928 2928752 2938877 2966130 2962472 2965402 2960357 2973953 2973320
10287 2973320 2974924 2975753 2991374 3011826 3040256 3060725 3077178 3083476 3090432 3092756 3092846 3096062 3092834
10274 3092834 3089860 3072124 3056201 3034898 3005742 3002224 3017523 3000440 2980239 2974659 2969277 2957391
10262 2957391 2952878 2941224 2937585 2943977 2933702 2916866 2906556 2904729 2912481 2904550 2907735 2908204 2908854
10249 2908854 2903866 2904781 2911765 2906422 2904174 2908026 2902492 2893524 2883360 2899946 2910692 2898503 2894004
10236 2894004 2905308 2910940 2907816 2913742 2907518 2911459 2929096 2939430 2945377 2936205 2924775 2922541 2910070
10223 2910070 2899378 2898895 2901597 2902290 2897590 2897963 2905039 2912813 2897114 2902199 2907441 2901604 2898273 2902979
10209 2902979 2905398 2908352 2907438 2903219 2901959 2893488 2893060 2879389 2873543 2892502 2899714 2895785 2893602 2878098
10195 2878098 2878875 2887772 2877470 2867235 2872616 2882595 2887983 2878757 2864055 2854253 2870246 2880617 2872300
10182 2872300 2870087 2877467 2882573 2889485 2890777 2876831 2873408 2868319 2866237 2874877 2881186 2888560 2893139 2888053
10168 2888053 2884435 2899443 2893518 2881183 2874271 2876851 2866687 2873907 2873865 2867946 2851450 2849692 2848355
10155 2848355 2848950 2837331 2828416 2821764 2831465 2835211 2814769 2818859 2832062 2838205 2847661 2845019 2827357
10142 2827357 2821354 2807587 2806529 2807676 2828046 2833480 2818223 2797630 2798054 2793393 2785127 2791661 2793443
10129 2793443 2808891 2809965 2798477 2810622 2817850 2808018 2799337 2800345 2806512 2802955 2788465 2789285 2798171
10116 2798171 2804025 2805064 2805563 2820226 2815124 2812391 2801716 2796832 2808970 2814215 2812199 2809288 2813154
10103 2813154 2813462 2803087 2806290 2799323 2811802 2810366 2798198 2790633 2773791 2766378 2754707 2742628 2742703
10090 2742703 2742869 2745879 2732061 2726875 2729152 2710695 2689897 2690624 2706161 2710856 2704693 2708281 2718234
10077 2718234 2728616 2728320 2708108 2698760 2690231 2679636 2671258 2679875 2695927 2704739 2697936 2687213 2686140
10064 2686140 2687829 2693327 2675586 2647823 2644801 2651848 2657842 2659227 2650124 2642776 2652806 2651482 2647699
10051 2647699 2645586 2630106 2615330 2608040 2601925 2586563 2587264 2589130 2591964 2574641 2571098 2579430 2571647
10038 2571647 2575805 2581144 2588931 2600049 2584808 2565181 2554194 2557007 2567881 2574756 2564193 2546158
10026 2546158 2534055 2537506 2521918 2524313 2519301 2519928 2521679 2519930 2506838 2496049 2486875 2500776 2514516
10013 2514516 2514705 2511516 2500775 2495714 2487994 2479573 2475972 2477771 2470352 2463867 2475405 2482281 2469151
10000 2469151 2466555 2457278 2450511 2454081 2455102 2441216 2420522 2407173 2409272 2418974 2433850 2420758 2432681
9987 2432681 2426890 2420436 2421943 2424015 2427828 2428870 2448367 2463175 2466136 2449527 2446226 2449115 2433326
9974 2433326 2420259 2410051 2412572 2396796 2375896 2360278 2345999 2338599 2355453 2352719 2356015 2348127
9962 2348127 2338069 2330906 2314255 2312190 2317748 2337444 2345230 2341425 2333961 2318120 2315950 2312779 2315223
9949 2315223 2310748 2301830 2301414 2298479 2301582 2312926 2326215 2333285 2329064 2321309 2314856 2333506 2334006 2328323
9935 2328323 2340824 2339531 2321689 2336329 2343346 2347580 2348066 2349206 2357125 2362246 2363346 2351472 2363588
9922 2363588 2378633 2395876 2412282 2426176 2435663 2446481 2452605 2468525 2492860 2511321 2532654 2559726
9910 2559726 2585468 2601349 2615911 2645928 2684276 2720332 2751585 2790110 2830695 2859837 2894211
9899 2894211 2936644 2968008 3014666 3067941 3130492 3195044 3257748 3334580 3408580 3498247 3593081
9888 3593081 3682883 3795675 3918605 4061124 4214813 4393199 4573313 4781494 5014815 5284446
9878 5284446 5582002 5906702 6251937 6668595 7145077 7666833 8267949 8953344 9738462 10649049
9868 10649049 11750505 13028155 14580988 16501385 18858318 21706239 25074325 28823999
9860 28823999 32760411 36594426 40077907 43083230 45535548 47212971 47785981 46931779
9852 46931779 44664074 41281976 37240303 32942724 28756046 24971415 21697204 18938562
9844 18938562 16664842 14821157 13315068 12059610 11000398 10114305 9371949 8745621 8185097
9835 8185097 7689727 7246156 6850168 6499799 6184771 5899373 5643433 5408206 5214282 5046656
9825 5046656 4866803 4699936 4553211 4410241 4288232 4174176 4079103 3992616 3895660 3834628
9815 3834628 3807325 3780632 3752799 3725197 3705933 3662849 3619250 3580130 3536977 3454693 3355765
9804 3355765 3241902 3118410 3008799 2904129 2808245 2727417 2651013 2594043 2537877 2472667 2427328
9793 2427328 2395586 2371886 2327900 2275941 2232266 2222065 2196417 2141097 2104944 2079761 2072250 2052398
9781 2052398 2034416 2007962 1973507 1947769 1910873 1895293 1878726 1863888 1861324 1842234 1831926 1830489
9769 1830489 1833590 1851816 1866978 1883653 1916746 1929423 1947616 1970431 1967364 1962199 1934115 1897190
9757 1897190 1834114 1769560 1705726 1667346 1626120 1582262 1543661 1519199 1497076 1467444 1438057
9746 1438057 1429798 1417596 1401354 1387440 1388721 1381082 1361602 1349150 1332907 1312466 1302185 1291386
9734 1291386 1276300 1262654 1250015 1245024 1243131 1259277 1258640 1246571 1239279 1223166 1209077 1206421 1195586
9721 1195586 1194416 1184321 1176216 1170941 1153567 1135229 1123865 1119735 1111871 1104151 1099226 1087801 1069381
9708 1069381 1073396 1076423 1065260 1059886 1046958 1031228 1028620 1022078 1003621 990414 977074 968382 963068
9695 963068 960525 955804 959851 953902 941266 954326 935403 911609 909995 910810 897687 876422 880835
9682 880835 886334 884178 887033 889943 886602 890744 882583 855929 838862 834006 852694 864886 864732 866668
9668 866668 858012 851814 862700 863533 865255 857343 838952 821391 810092 807404 804823 780165 772107
9655 772107 777743 775347 779715 787530 783058 770566 763030 757373 753240 743435 747443 745343 751283 741485
9641 741485 728932 718529 711414 715630 696092 687881 678758 682409 690624 679429 685404 689054 676595
9628 676595 667778 677023 680921 679067 671706 665878 664881 667981 670732 665913 645947 651246 665751 646935
9614 646935 641915 624185 618148 612131 614269 617181 613710 611533 606482 603096 597866 596761 617039 609610
9600 609610 600645 592373 593716 600344 594133 592486 587243 580955 581065 593267 592506 585072 585803 580584 575264
9585 575264 562858 550364 547035 548892 542179 538539 525615 521205 528628 530472 534107 532970 521916
9572 521916 515817 523427 522808 525353 523369 534163 527864 507388 494510 507384 517165 512529 500503
9559 500503 506985 515933 512835 501440 504925 488247 481075 471646 463910 454091 466465 474309 465481 450445
9545 450445 455717 454435 454872 461203 454836 434277 439596 426016 429351 427224 433337 440305 457163 464264
9531 464264 450211 444225 448041 448761 446531 441725 434793 436992 450409 436724 418714 417684 408558 401479
9517 401479 406349 411891 403373 395912 384637 392213 387913 405035 402757 396496 397709 399159 408619 398357
9503 398357 384340 383638 397054 410315 406266 401729 397461 396212 396838 391910 379170 394693 399081 391629
9489 391629 386399 388827 380023 357913 349629 349624 354547 343776 336693 339495 351340 353738 354084 352368 362554
9474 362554 365571 366125 369578 356821 338775 326835 335836 336124 338931 347081 346443 347507 331469 321903
9460 321903 333738 347126 343571 323529 316755 312077 313198 325491 333177 345164 352162 323916 306398
9447 306398 313325 324509 333943 325968 327965 340416 351277 358211 355999 365038 372588 378127 398362
9434 398362 413507 420668 445116 475132 492310 495784 494211 496626 511365 519758 520771 513601 488877
9421 488877 469895 460591 464986 451010 434952 423163 423129 403031 394173 403911 398224 411208 401833
9408 401833 393985 390923 384608 400042 416299 420588 419277 421959 437381 473249 534506 606954 714795
9395 714795 865745 1035346 1193529 1304347 1359407 1455602 1595128 1704530 1668289 1531883
9385 1531883 1369671 1166603 963216 802891 675300 578245 510525 463563 428950 411557
9375 411557 404690 383904 365201 359155 353880 336859 336751 326726 323925 314250 312576 300085 282427
9362 282427 281838 283036 268885 253908 255765 257360 262106 264914 258099 248118 242388 238607 243194 237679
9348 237679 239192 243384 241217 243290 250499 240968 238240 241270 229897 224611 226516 232132 213181 204190
9334 204190 215884 207718 210295 220091 220283 223098 236198 239445 245009 234008 216687 194501 205545
9321 205545 208834 196456 194097 204155 212665 208358 198654 201651 211650 200599 190657 189242 189367 194143
9307 194143 201771 213446 210902 217994 208620 193968 178552 176014 175421 166988 166936 174158 183029 182421 178964
9292 178964 179703 180182 174073 170219 174132 174561 181086 171664 177457 184062 179450 173700 176168 185392 196051
9277 196051 199199 171541 156209 150769 168235 178713 177254 174491 165641 160561 160156 164892 161385 153797
9263 153797 179181 195097 190585 179643 179967 166909 154176 154009 154403 168944 190739 192270 183708
9250 183708 174588 165657 156640 149055 142835 140745 141852 150358 148056 136187 133354 136548 126708 119451
9236 119451 127514 134969 143194 149071 145930 141661 152371 153143 145837 132661 134926 151084 163064 162946
9222 162946 169784 166614 159382 150369 130267 132809 131740 143780 139798 134397 124218 120246 128490 117292
9208 117292 101461 100177 106581 113636 115497 117561 109481 98762 124257 139938 136159 138305 146136
9195 146136 146338 134578 132317 122700 110463 119801 132978 138100 144122 148248 131957 121111 110019
9182 110019 125769 126558 116520 112233 113694 113978 113303 127312 123061 115193 126597 126563 120609 122095 136568
9167 136568 140090 143556 138155 132708 137305 141191 137888 139583 134973 131420 145453 147111 133883 121015
9153 121015 101975 88723 93560 107572 118980 133144 140565 124639 127042 129932 138225 127625 119263
9140 119263 109293 108529 115576 116478 110937 109769 102638 94277 95963 102118 115243 113238 107691 106693 96168
9125 96168 91511 90781 93499 91050 105320 122353 123801 100231 93190 112353 115085 106348 101385 99609
9111 99609 105261 110781 112532 104421 105160 102561 100171 93148 91568 94020 87709 91169 90017 96075 100120
9096 100120 104661 103484 108584 111090 105691 98607 102484 114243 104698 93469 95454 92794 87258 90520
9082 90520 99991 116261 119610 116618 117860 121686 119635 112282 106266 96941 95772 101997 95719 86839
9068 86839 90343 91790 90178 85819 84356 75192 78226 72205 63951 79734 88134 83748 94046 101760
9054 101760 99162 82318 73425 61203 61477 67761 73325 67728 73924 73559 59243 67199 69450 71715
9040 71715 68890 64478 76854 91893 106990 118128 102357 80000 65680 63812 63282 58980 74789
9027 74789 89054 83349 74422 82674 89584 85973 88280 103322 89699 79721 76522 69129 64688 77992
9013 77992 79407 62740 68279 78028 81866 74222 77593 80644 85078 85780 67755 65653 75337 72764
8999 72764 76833 71607 71333 75764 67460 61280 67941 59630 57271 68766 87213 89113 82933 76021
8985 76021 59189 58729 65057 68250 66900 73700 80320 82507 81792 77148 81824 95179 93950 88802 73850
8970 73850 77706 94097 95845 88612 83458 64753 68446 71810 65568 55121 54961 44586 43356 55356
8956 55356 56396 64061 65400 67820 72132 45310 34989 42037 42714 44096 52446 51887 46514 56475 59081
8941 59081 64154 64895 51124 54063 51889 61514 63483 65830 64811 52867 48529 42257 41636 45943 39893
8926 39893 51185 51281 50744 44181 59209 71622 72887 69755 70270 69642 64325 48642 58239 64705 63593
8911 63593 63898 66138 62398 68207 64446 54496 51186 53974 49691 49118 62988 69801 68169 66092 60624
8896 60624 52943 60344 66901 62126 52852 54851 47946 45643 44263 43198 62454 77504 76080 67077
8882 67077 83079 88636 78298 70346 80769 95813 89578 91208 99506 111668 119033 124604 133054
8869 133054 136197 140938 137487 126211 113911 111856 110176 107831 110321 96598 81007 73167 76150
8856 76150 70541 70169 71990 62183 62674 64813 61581 73591 71993 79225 83149 82144 82708 77601 74423
8841 74423 87247 72747 69520 84322 95107 109460 116420 122023 139188 150067 159664 196459 222329
8828 222329 239486 257630 263364 271351 264315 257096 240327 234923 227210 208953 209443 201517 192373 192580
8814 192580 189412 183228 185158 184153 163493 162956 162992 148594 144898 145222 136902 119660 96820 99629
8800 99629 105996 98801 90947 100872 118597 128794 127102 140879 161486 169081 181971 186881 195159
8787 195159 211786 231226 257850 302103 326106 333620 343988 352247 350757 360448 365546 352300 345394
8774 345394 343044 323000 312007 312808 307351 294924 272103 249768 238712 230609 219165 221969 212172
8761 212172 194218 176940 169343 165305 163473 156475 145187 125007 118975 120121 115467 121650 111008
8748 111008 95794 80917 80868 109775 120095 116980 123992 133554 140003 164010 178610 196009 221127
8735 221127 257481 286436 307224 313306 325082 317750 302966 301503 296608 285729 273494 251812
8723 251812 248801 245814 219806 199744 174462 164556 157997 164286 168579 154717 151937 146547 139355
8710 139355 126389 98255 71112 60562 57821 57665 73385 84197 85902 83593 87636 97504 101791
8697 101791 109785 94197 81923 89267 94219 92448 86242 93388 107158 116356 117960 125217 142554
8684 142554 145743 160744 174969 184859 171031 157298 132366 122059 102813 88214 75548 66482
8672 66482 70640 65077 66716 55869 57270 58537 57347 51277 51573 70949 77402 68098 61680 63197
8658 63197 56217 53847 58345 63552 73050 76981 77297 73539 61257 63441 44737 25345 19611 28577
8644 28577 37138 34257 22441 20007 39381 46289 55162 59391 61828 58035 60262 60528 51316 40190
8630 40190 31774 21411 18607 22983 40514 54112 56154 51555 56531 52738 38630 22937 16977
8617 16977 20130 25172 27841 37515 53672 54924 46917 35197 32621 44273 47796 48535 33524 32145
8603 32145 43407 50034 36747 34564 40217 45442 54031 63636 55520 48086 47137 42669 34749 41308
8589 41308 38419 42276 41945 47554 41130 33664 28773 29668 38708 36512 35236 32467 36524 46660 52545
8574 52545 50292 53155 55181 38487 24967 25772 27375 32904 25607 22365 17896 26427 36493 28795
8560 28795 30577 32767 41541 41336 37138 42455 44693 46085 28219 18928 37813 41444 26313 22662
8546 22662 30312 33255 41756 44453 27784 22944 20695 21739 48574 57415 58453 67633 88521 83479
8532 83479 79047 78561 80925 74874 71452 71519 80600 73551 62525 47973 39400 33214 41516 37789 30583
8517 30583 42350 42198 28754 29153 34398 40230 31700 33870 40562 47203 53394 47190 52291 56074 57451
8502 57451 59690 46107 51017 55277 51678 64512 86758 90311 103110 121950 138002 149632 159248
8489 159248 163309 164946 179397 202735 226648 222801 213937 201103 184723 174488 170848 154912 126687
8476 126687 109206 96781 94951 101134 107793 100736 96732 91533 89766 107101 101060 104326 84652
8463 84652 67482 63786 59729 75820 82905 82477 85849 103939 109145 126304 131763 131377 155107 174823
8449 174823 190651 190490 200042 213942 221401 233364 251596 257996 255790 263245 297024 307418 296700
8436 296700 288597 285468 293186 287469 264045 245652 242238 226585 206841 182489 160042 152462 135889
8423 135889 115587 104019 102516 100329 100576 109235 105708 88611 90826 83872 91615 102772 112903
8410 112903 130067 134413 143998 146651 151532 166786 193240 203806 218711 232642 240753 244664 247439
8397 247439 231296 235699 256238 261064 269157 270910 284087 291892 297869 312563 302814 285432 269245
8384 269245 261729 249094 239429 218436 184926 158597 139741 125369 107807 95815 99895 100870 95422
8371 95422 84561 84207 79628 77699 76186 71401 75414 91783 86228 79583 80476 87670 77201 83835
8357 83835 100140 105830 107162 101472 97911 109047 123492 135393 137397 140133 154553 173460 174799
8344 174799 177019 187916 205826 206225 192190 180789 167459 155571 140027 119360 103270 92315
8332 92315 86188 75164 57763 49229 47401 44675 39733 49735 64501 74452 66460 48558 53268
8319 53268 56541 41565 40845 44942 39442 43238 52908 58191 48938 39677 49150 61515 65316 73894
8305 73894 84642 90490 99988 103528 116695 126983 119001 103609 106298 120042 113114 104767 106925
8292 106925 119211 116822 119650 126671 148659 162046 197308 243413 300850 383428 480866 585648
8280 585648 673772 741998 804908 881251 957088 994690 952955 860830 745094 608923 483734
8269 483734 393363 324762 278466 236844 211677 203985 196301 183145 174234 163829 145454 144339
8257 144339 143261 150928 151039 158244 164382 160010 162092 171625 173397 179480 189316 218702 247644 255172
8243 255172 286684 336657 382674 452359 563399 720532 930084 1154145 1339920 1451685
8233 1451685 1548884 1714190 1872924 1918107 1819387 1626383 1380928 1125977 892863 710622
8223 710622 577044 475016 416041 361044 317078 290242 269281 253208 233176 219972 216205
8212 216205 204015 189069 173598 168587 173308 177263 183433 183535 171677 174230 177784 193126 202154
8199 202154 207976 206607 225703 248599 283916 339230 416658 511489 613914 690188 747153 801683
8187 801683 883475 953692 967014 919409 817017 697557 565797 455428 373314 302139 245286
8176 245286 204010 174412 151215 147135 149113 133839 118058 121806 118078 96717 82237 72274 60403
8163 60403 77802 89332 88286 77189 72533 73716 73669 68791 59381 63098 65282 60932 51165 45605
8149 45605 48262 57507 65142 65221 63903 57423 56285 59940 69903 71754 47496 35210 47556 50208
8135 50208 54380 53849 50843 51282 65256 68441 64711 62727 49023 41091 33277 22415 28016 32420
8121 32420 25676 20294 21778 26727 24407 20225 16021 25321 32669 22928 17364 15789 15538 17546 23930
8106 23930 30067 32606 38773 35504 38056 48941 52113 36515 23167 15418 16347 26740 25186 31092
8092 31092 21308 11009 15093 22157 26445 26249 20521 29666 26772 26959 30309 23216 32169 35838 23912
8077 23912 24737 38590 37308 46723 50540 51947 40429 22493 19182 23144 16158 9579 23816 33173
8063 33173 17454 8822 26423 42849 24834 24279 20890 20069 24210 21942 16694 6707 9320 19487
8049 19487 21687 13116 16803 11940 7345 18751 27833 27348 39216 44194 44623 34941 22434 21457 14977
8034 14977 17029 25733 41964 40153 34620 31519 33338 33830 19479 10951 18186 16787 13743 14020 16183
8019 16183 6569 10140 6329 1942 8253 14810 31718 28216 33518 29904 30699 23141 23672 36277 42548
8004 42548 32107 14833 -1657 6422 22390 31476 20258 12586 4897 9168 5725 12096 24475
7991 24475 30380 34507 29619 24367 24137 28438 44341 34602 21860 24278 20924 16052 37954 34562
7977 34562 25005 27823 22920 30616 21978 8007 3473 8263 8855 18419 21333 21156 19724 16944 37555
7962 37555 55942 38894 24350 17116 941 -10325 -9668 -3593 10583 10579 10410 14015 14972 19334 24127
7947 24127 18987 13327 16195 13802 20248 19547 25652 33795 24261 7772 2620 7290 9037 4998 9170
7932 9170 16991 28739 43593 40568 22820 27267 27310 11486 6551 10175 9692 6644 -5939 -12145
7918 -12145 -11160 -2366 -3303 -3921 -4687 3265 1833 -1368 16599 20250 6832 4763 15217 13898 6672
7903 6672 -10075 -14796 5689 14515 21359 19663 2374 3450 16275 9841 5767 12975 18236 14696
7889 14696 10964 11193 10849 26375 22373 4657 14667 13252 23217 31262 16591 13293 20248 17664
7875 17664 33603 42763 32088 28640 39032 37656 26829 15240 1987 4882 1882 4112 12444
7862 12444 9525 19370 17984 23393 21830 28080 22362 5578 4425 5496 11997 14308 24359 23028
7848 23028 24446 27626 30120 32140 32136 20286 25425 26922 21280 20437 4440 19544 41844 54884
7834 54884 65566 64699 55524 49797 53847 60899 71525 95094 105135 96519 79158 68218 69493
7821 69493 91510 113205 137196 170871 219918 264662 289888 342393 408245 467627 524041 556682
7809 556682 578377 600789 592579 560289 523460 473901 416973 362824 314229 253070 211807 183945
7797 183945 155349 139024 134577 137065 135587 125586 117886 114512 115451 115799 107702 105333 101674 111646
7783 111646 124988 126951 125696 130842 152932 163461 162116 174652 174528 201897 235134 263821 301342
7770 301342 354341 435027 542704 648815 741462 826126 923569 1014602 1061137 1075868 1054842
7759 1054842 980567 872414 750363 633403 523666 431572 343836 281447 243671 205014 182008
7748 182008 160104 136008 144673 149604 153661 143618 127217 122403 116893 111647 104294 97877 107401
7735 107401 107898 111902 116897 111517 121441 135276 134785 142351 161737 174598 191120 214753 243163
7722 243163 279501 316633 362554 387781 399101 421991 439089 438839 426731 410421 379417 345336
7710 345336 319511 286387 234013 191273 166632 149393 126034 105324 88402 79229 67906 53673
7698 53673 45960 42181 46475 65037 71705 54083 36657 55106 59197 48228 46427 53151 60829
7685 60829 60264 29382 11274 20006 20267 35405 32841 22859 20572 22271 26519 24646 22695 15536
7671 15536 26657 42647 41366 25848 24682 24883 24808 29424 38776 39859 27362 13325 9680 3764
7657 3764 8048 13701 21060 17677 24955 25692 12690 6108 6323 -5978 -2070 10416 8253 2943 852
7642 852 16150 24461 25033 37131 36326 31131 32055 34685 25289 22066 18174 11024 7512 14908 20815
7627 20815 25115 22830 12244 3358 -11721 -23353 -16436 3539 3409 17076 27879 15239 8791
7614 8791 18098 15180 10792 16549 25109 21658 25317 19789 15332 22875 22248 19373 26342 35811 33567
7599 33567 18305 17620 3958 4263 14434 14894 23837 14037 8826 15952 13384 10993 21017 25944
7585 25944 27398 10981 -1487 2186 16512 30127 26648 24202 23355 28456 30465 21360 26190 25622
7571 25622 18789 380 -4626 13916 29827 25980 20524 17016 18025 25644 19579 18760 19791 19641
7557 19641 -4556 -6619 -7290 -6070 -21596 -21168 -9250 10004 6976 -5244 2866 9459 2803 -9680
7543 -9680 4305 15524 11911 20671 34046 31127 22089 16636 23985 24105 12988 28989 43474 37952
7529 37952 26389 19324 19381 832 -5891 16542 18993 16258 11427 13978 11628 3291 -1020 1026
7515 1026 -3555 6186 22571 29111 24318 14958 11009 13624 12810 928 8900 18426 17718 16117 8920
7500 8920 5987 -4034 -4506 -4472 724 8271 16467 25102 24452 15394 7094 -3099 -11030 -20371 -21190 -24689
7484 -24689 -25682 -24445 -15301 -5588 8162 20091 13503 17831 27876 29789 17093 6748 1116 -10369
7470 -10369 -11612 -19199 -18395 -17796 -8531 3047 3314 -1973 -8772 -17809 -8186 47 -1083 2130 1669
7455 1669 -9940 -10040 -5135 -8226 -3608 -7149 -11556 -3770 -3334 -2686 -2103 -1466 10020 18939 24144 21071
7439 21071 17551 24849 22075 12849 3449 13813 25532 26498 28473 25248 18740 10700 -2200 2677
7425 2677 11260 9317 19239 21687 9132 4892 6969 9546 4293 -2027 -1864 6085 14826 15218 19960
7410 19960 6669 -2771 -5265 -301 -710 482 148 -12002 -9253 9929 -637 -3294 2957 -2369
7396 -2369 -291 6355 -4094 -5332 -6433 -6985 -646 15471 18538 23243 11977 2126 8154 9110 2697
7381 2697 712 -1568 -1718 8504 18767 29247 24422 38408 40492 48320 36925 21081 10533
7368 10533 8304 14781 16688 17480 10601 -1159 -1480 2426 12428 10534 17005 11918 15238 22757 17925
7353 17925 8817 5258 7263 -5228 -7423 4371 14658 9840 14621 5138 7553 13979 12707 9295
7339 9295 -5886 -17616 -11998 -7569 -17554 -7136 -1456 -541 -2076 -1676 -891 3797 31385 24313 18858
7324 18858 15414 7936 5038 -2482 -864 -4196 -9133 -2862 8708 2255 4495 5738 18313 22489
7310 22489 12668 5888 3911 2215 12154 16086 12896 10551 10901 3063 9019 11534 10612 7126 15850
7295 15850 25714 22159 1654 -3681 9505 19261 13137 4954 -6668 -6557 -10653 -9073 -12313 -5342
7281 -5342 5455 13325 19115 17011 22462 14920 29436 38579 28537 19718 9189 10241 28178 21848
7267 21848 11808 4231 -10622 -11535 -5657 12526 15710 15742 17544 11818 8814 15587 10399 8191 -605
7252 -605 -10545 -4763 -1495 7864 14205 12843 7817 15262 11830 14330 3923 2335 4954 16639 25174
7237 25174 31459 33662 26616 -1788 -9831 -9344 -1670 10770 547 -13275 -12747 -12048 463 2343
7223 2343 2229 8564 -1966 534 7564 11209 2579 3348 -8032 -9253 -7640 -3782 -7338 -14315 -13439
7208 -13439 2935 11143 21877 21521 21038 21667 23846 21525 28755 27448 20869 29017 18387 4641
7194 4641 852 13149 22044 38019 27870 24393 22305 17165 13608 8212 13410 20630 38494 31038
7180 31038 22792 22851 18738 10306 17264 7026 3102 9724 18694 30174 25303 22382 15996 23679 20069
7165 20069 11429 -1377 -5858 -9527 -7198 3023 21442 30293 31176 24851 26556 28108 26609 27433
7151 27433 21920 9063 13397 18573 19758 16484 17789 18746 18778 13110 2474 -13920 -20396 -20332 -11513
7136 -11513 12528 16982 19620 12537 18771 20150 2745 -14319 -20864 -10979 454 13518 12981 17209
7122 17209 4393 -3395 1612 -119 478 11251 24889 27722 23877 19446 13142 15206 12081 19145
7108 19145 18954 33659 43018 21096 3278 5789 6549 -6874 -7948 -3823 -2078 6472 10012 5110
7094 5110 4939 -1691 -6734 7355 21989 29434 30008 20988 18984 21759 26656 31060 29703 19498 4596
7079 4596 -3680 -9174 -7397 -8434 2484 -1541 45 7362 4597 10890 20619 10905 -5143 -7739
7065 -7739 2607 12382 11157 4530 -322 16952 11586 2482 472 -7176 -939 1417 10365 9614 16273
7050 16273 12514 -431 -7892 -15244 -14426 -14284 -16525 -12474 -3730 9129 23040 24245 25332 34195
7036 34195 14359 -7107 -15890 -15477 -8393 -10607 -15488 -20913 -14337 -1398 -459 -5830 -6413 13940
7022 13940 13972 4771 -1535 -8251 -6229 2280 5466 6209 7787 98 -7415 -2680 8729 -8151 -12412
7007 -12412 -16004 -15589 -12113 -18765 -12573 3737 10197 -7676 -9733 -215 9292 24822 24990 23435
6993 23435 13619 5545 17213 25061 14987 7613 9428 13745 19531 23074 20590 9390 4857 3553
6979 3553 -3050 -6549 -105 24 1852 16347 4971 17883 27480 23859 5222 4884 7688 6049
6965 6049 2707 -1950 -6769 -7169 3396 -1780 -16371 -11747 -12640 -4973 965 -5337 -18476 -22010 -14601
6950 -14601 2863 15124 17604 9449 8631 7866 13890 12291 11900 8709 7198 10315 16165 23213 14988
6935 14988 8202 1500 11715 10172 3141 -5785 -11537 -6841 -942 13736 12539 -3281 -3544 8034
6921 8034 20754 16770 8085 6729 9805 14119 6849 -1759 -7322 -23766 -31533 -27489 -22578 -15281
6907 -15281 -17126 -15104 -11720 -892 -5958 -947 4498 -7009 -11808 600 8203 12118 6049 -7215
6893 -7215 -7862 -8276 513 -1447 3942 887 593 8918 12291 14606 -6229 -6235 3520 -1978 553 -1752
6877 -1752 7820 6952 7857 4887 535 488 4814 7453 2853 6252 1889 -3062 -2542 8286 8501 14795
6861 14795 3936 -4555 2443 1936 4828 4665 7218 15582 5911 -10206 -932 8990 -1934 -7809
6847 -7809 4633 14958 19285 15828 9682 5988 -755 6961 18937 13516 7910 6343 -2158 -6317
6833 -6317 -6297 -3576 1662 4066 -4867 -12502 -3002 -3526 -6706 -7233 -304 12583 12517 7025 4646 -11573
6817 -11573 -27160 -23638 -14374 -5813 2858 6045 3709 4537 4668 -997 -2695 -6401 3904 -7418
6803 -7418 -13155 -5463 -3534 3271 5384 13636 4833 7193 5978 865 -3875 -273 5965 1333 1682
6788 1682 4737 7317 11269 8463 2402 -5564 -9328 -8766 5086 10728 21362 26263 13238 -7351
6774 -7351 -10803 -6538 5625 6887 1941 2861 11763 7793 -5310 -3454 -8065 -10247 1482 2655
6760 2655 4958 10618 8698 -186 -296 -5164 154 11763 16502 8605 5608 -781 10259 17457 4090
6745 4090 -8330 -767 -2451 -1796 3137 14197 25513 40034 32914 34012 26924 32657 34065 15392
6731 15392 11843 10336 7492 1833 -395 1460 3942 1272 -2570 -10678 -3598 16093 37105 21215
6717 21215 9522 1330 10130 29713 29926 10115 10326 15553 17773 7770 1769 1379 -4108 -17793
6703 -17793 -7960 -1627 6277 10044 -4379 -10023 3706 -3912 -11513 -3045 1658 3418 -4056 1082
6689 1082 7750 3566 1538 4351 -6137 -5887 -4378 -8478 -11707 2113 3003 -2875 1255 -914 -20560
6674 -20560 -32761 -14968 -7053 -20891 -18103 7490 17647 2739 8307 10054 6588 10017 18085
6661 18085 12347 11597 12191 11228 841 -5176 4532 11917 17865 11282 3278 -4946 -3606 1232 -5530
6646 -5530 -420 14971 11401 6810 -8762 -12107 -7713 -2871 -305 5389 8350 1705 2573 12937
6632 12937 18779 5805 -10351 811 2014 842 -1375 4929 5685 -3929 7467 5569 9587 12692
6618 12692 7827 3425 14627 37413 35993 24533 13236 9407 -6706 -12304 -18395 -15303 -13738
6605 -13738 1666 12677 1803 -12157 -11301 -2012 12682 18915 14221 13134 16812 10999 -4144
6592 -4144 106 -45 -11915 -20463 -25548 -16381 -14770 323 -1828 -560 -4133 6901 11433 10371
6578 10371 7770 19266 12172 5273 6411 2787 2680 10496 19728 18711 2480 5469 5143 -6044
6564 -6044 -17085 -17847 -9558 -3773 4294 18134 34679 31199 11908 2905 10976 3472 -13318 -12939
6550 -12939 6160 11044 14866 902 5927 22982 25111 11158 15628 18176 6768 -9351 -5230
6537 -5230 6222 6277 3262 -9022 -1307 17858 22106 18730 18812 20939 7009 5185 5626 745 -16
6522 -16 1284 798 -10472 -16028 -9358 209 9642 10995 -7773 -10076 9800 13837 10925 12143 5001
6507 5001 -15531 -26290 -10300 -5424 -6331 -8576 -4625 -7774 -996 5093 -2618 -8499 -13322 -9865
6493 -9865 -5265 -4946 -4380 -9686 -8522 4114 665 -8990 -10544 3655 16790 5299 -2257 -1606 -11711
6478 -11711 -29170 -34215 -32826 -25774 -10158 -10100 -12124 -2966 1803 -12217 -21857 16626 20552 5984
6464 5984 -4467 -5183 -9492 -14236 -15197 -12997 -8594 9376 16648 15192 13467 -1969 6408 9350 8753
6449 8753 -1110 -11880 -13271 -8708 -5488 6252 -1185 -850 3323 1823 -429 -490 -1247 -2941 8478
6434 8478 6883 -8700 -13084 -15735 -7152 -16747 -21275 -15184 -7862 -10179 -15626 -10746 -7248 -11292 -9043
6419 -9043 -6419 -15371 116 1846 5398 -6918 -8571 9705 12350 -3872 -10841 69 6477 -598
6405 -598 802 10665 8050 14815 29091 18738 11780 5855 1125 1362 5438 1789 1598 369 -3594
6390 -3594 1500 1594 1878 -4014 -15999 -18387 -17158 -14099 -6246 -6915 -3895 3820 -9044 -11204 -18232
6375 -18232 -10876 -10744 -17806 -28461 -32477 -17589 3100 22407 21332 21308 18115 882 -2343 -5284
6361 -5284 -13191 -13893 -2267 688 2220 15174 16614 17322 16258 3186 7347 13316 10240 16335 9126
6346 9126 3796 761 933 -1128 -424 10886 5585 12434 15181 16196 17572 19244 19602 9156 3088
6331 3088 -15448 -9764 8928 16881 17525 12707 6166 -1851 -11609 -4476 -10707 858 19240 19215 14304
6316 14304 20738 8712 2290 2998 -6171 -5897 -26030 -33377 -26877 -4581 -243 5045 -2007 -5474
6302 -5474 1124 14616 25146 31031 21705 5089 11830 10224 6159 16532 25950 19620 10414 10261
6288 10261 1033 -4765 -11538 -18917 -16218 -3918 325 4546 7929 9491 9632 -399 -7426 -2757
6274 -2757 1938 7680 -4859 -4330 -4231 -1975 1275 3158 67 -9972 -12812 -11021 -19447 -11994 -5343
6259 -5343 12081 17311 11360 7239 5938 1504 -8105 -6679 -16770 -28653 -22056 -15973 -966 4461
6245 4461 217 -2735 2932 15339 25387 27111 11121 -2663 -11917 -12642 -10707 6409 4166 5487
6231 5487 1093 2175 -211 -9407 -6389 1146 7360 7568 1603 -9322 -6501 6976 5920 -351 -9043
6216 -9043 -3815 -8655 -13738 -18993 -1882 17139 24434 31313 26486 15900 20438 17199 13390 10877
6202 10877 6133 -2611 2810 -1910 -14273 -24485 -20880 -8931 8016 5452 -276 -670 -12197 -7102
6188 -7102 9079 9591 13460 8603 5274 1793 -3088 -4683 604 5143 5942 -7004 -8454 -11556 -12373
6173 -12373 -16239 -22796 -13055 -12523 -10550 -19726 -28711 -20741 -10815 -16139 -16671 -14773 -21692 -16605 -12780
6158 -12780 -8276 -11683 -10555 7430 21115 20564 13723 4934 13309 7349 2446 5628 -8349 -9479
6144 -9479 -8506 7965 10612 4083 11010 2462 62 4376 7963 7542 3957 2922 -4081 5476 11714
6129 11714 11334 17177 16914 20332 15503 6114 -9809 -1627 -4819 -2561 -1305 -8677 -16028 716 5241
6114 5241 1458 9202 2631 -14360 -22251 -20350 -16665 -11291 -9487 -7504 -14147 -10047 -7580 1515 7848
6099 7848 1607 -15382 -19953 -15105 1549 15903 9534 9569 17648 16534 5241 10483 5190 -7607
6085 -7607 -17257 -18652 -24829 -24295 -13510 -7458 -6651 -10221 -5445 349 -2 8982 8966 2106 16434 10829
6069 10829 7513 2969 -4818 -5003 7939 19270 13043 1635 -2713 -3068 -3656 -7549 -7461 -9560 -2412
6054 -2412 4956 -8775 -19293 -10205 -81 -7921 -7882 -7544 -10401 -1688 17975 17396 8584 -4174 1581
6039 1581 -770 -5676 -389 5952 10091 -5263 -6897 -4914 -2207 -3201 -4774 -4444 8658 -1264 -17732
6024 -17732 -14185 -6280 -1980 -4528 -5190 2125 7823 15468 21050 9612 -13247 -12185 2155 7480
6010 7480 -911 -375 371 5974 -663 -3415 10231 10807 7417 -8853 -7370 3641 3298 4701 9256
5995 9256 6405 -1397 -2943 -8610 -9934 -3771 5259 3087 -1297 -6151 -7844 -8180 -5243 2269 4722
5980 4722 5960 -919 -1086 -10592 -13802 -158 -7755 5382 7986 6963 3958 20616 19044 1430
5966 1430 -483 -14908 -25293 -17483 -6232 4356 14020 25685 28319 14451 7576 9133 14035
5953 14035 4531 -9570 -13194 -16402 -6575 5101 7472 -7877 -3025 4425 -5904 -5104 13589 12412
5939 12412 15412 5367 -8131 -5273 870 476 9223 -683 -8235 -455 -9344 -24150 -32922 -19009
5925 -19009 -26556 -33939 -23026 -11949 -2539 5872 22056 12717 -5315 -2576 6579 -17898 -5216
5912 -5216 15434 8426 6715 25424 13090 4190 5571 3039 8310 16182 16863 15200 9796 1844
5898 1844 9952 15129 21952 23683 7368 -2072 12595 17554 6304 -4689 -3261 -7400 -8646 -4102
5884 -4102 5472 5446 9452 19719 13460 2139 8795 3491 -1690 -12539 -17670 -24187 -36622 -21644
5870 -21644 -9679 -1576 9490 21941 19337 6594 -4977 -4721 -7439 -611 -146 6355 1827 334
5856 334 896 -5719 -11111 3065 16151 10419 939 -794 8726 11530 11942 12497 12997 -1956 -3228
5841 -3228 -6105 -4511 1804 142 932 -11632 -3380 -1776 -1211 5127 2105 -2708 -1744 -9166 -7426
5826 -7426 -6885 -17389 -24172 -12652 -2523 -6875 -14707 -7715 -2963 -8195 -18560 -18613 -11341 -6777 -22212
5811 -22212 -18705 -17047 -20001 -25404 -19252 -2999 14933 5430 2303 1483 -10161 -22788 -14119 -7266
5797 -7266 -6461 -5287 12506 6858 -608 955 -11491 -25564 -17880 7379 34041 40707 37419 36072
5783 36072 26108 26765 21826 4040 -10526 -9310 -7490 865 8858 -3058 5354 -3256 -16830 -10623
5769 -10623 -20047 -16861 -129 13083 6595 -5289 -19644 -15966 -10166 -6597 -9434 -9641 -1884 12904
5755 12904 9324 8519 1217 -2138 -7085 -15249 -29582 -27179 -27068 -16250 -12524 -6036 -4717 206 -11570
5740 -11570 -2235 5060 8240 8912 4443 681 -486 5279 8747 3559 -2285 -7087 -11031 -16808 -19625
5725 -19625 -15340 -13888 -6728 5150 8077 7505 3796 -1954 -2201 3853 2686 -11547 -25187 -11586
5711 -11586 -5830 -1019 -468 4288 12085 14034 3455 -3198 638 -7447 -4328 2946 394 8474 19509
5696 19509 22162 13377 2868 260 -2423 5162 13620 -3502 -9579 -15072 -14748 -17804 -19587 -11043
5682 -11043 441 12336 -806 -5115 2413 -895 917 26021 28469 14099 7633 141 -4415
5669 -4415 -18385 -22281 -26657 -28227 -18551 -690 -5991 -20886 -6065 8066 15895 13500 26161
5656 26161 27725 32428 26949 4691 4370 366 989 -2655 -3791 267 -8406 -7748 -1737 -6798 875
5641 875 2608 3652 2911 -5331 -12640 -14005 -13954 -17381 -3307 4166 1588 -18711 -19837 3532 2466
5626 2466 -14839 -15084 -11067 -11110 -4752 285 8285 271 6489 7705 4080 9224 15902 3980 -279
5611 -279 2079 -1870 7438 9725 7849 4247 11473 16455 11948 7162 2981 3777 1755 -16986 -4086
5596 -4086 9887 8310 14559 14402 3754 7574 13025 2899 -5623 2583 2681 2453 -6464 -12280 -14720
5581 -14720 -12616 -11301 -658 -3011 2435 -885 8039 5139 -5391 -19464 -22697 -14304 -5949 38
5567 38 7966 8169 9786 8531 10742 11601 3929 1412 8759 16368 16044 7909 948 -3948 -3857 1384 12420
5550 12420 8105 4798 -2994 -5220 -7760 -13087 -3646 15108 11410 -2520 -4351 2943 6697 2329
5536 2329 -12852 -22738 -25851 -20470 -11281 -9760 -13080 -10778 -11951 -23313 -27938 -23407 -19610 -15004
5522 -15004 7458 16935 1611 -13107 -5683 -5226 -3584 -2937 7873 -752 -2433 7706 7363 -6057
5508 -6057 -14973 -16829 -11794 -1734 10712 12555 5206 8829 28880 15361 5056 11598 12734 6060
5494 6060 13664 5328 420 -9538 99 6442 -7268 -15481 364 -1022 -2953 -4786 -23472 -25778
5480 -25778 -7342 3273 -6305 -13261 -5179 -6571 -10932 -12472 3394 8999 1157 -19798 -14306 -6657
5466 -6657 -7618 -2204 2638 7172 644 -4874 -7877 722 -4851 -11869 -21265 -16932 -14053 -10829 -10857 4281
5450 4281 6861 -7207 -15049 -5732 -3359 -11836 -14080 -15786 -21593 -17266 -18449 -19698 -11261 9103
5436 9103 6725 15259 16526 19412 13675 11396 10876 17853 11677 2940 7125 12538 13599 9964 4603
5421 4603 -5625 -2129 7061 10277 -1146 -10210 -3773 -9873 -5408 9867 21094 11045 -376
5408 -376 -1172 7109 14204 20964 19210 10088 6996 7311 7642 12729 3800 -5689 832 1137 10385 14581
5392 14581 13237 11970 5448 -22737 -35518 -27533 -26004 -14461 2562 17164 6519 4740 5154
5379 5154 1173 6959 11407 19193 14513 14119 16961 14476 7224 8346 13629 15656 563 -8958 -7105
5364 -7105 -1588 3905 3163 425 7261 1461 11887 15965 18407 20057 7455 9818 23729 25152
5350 25152 23813 27228 21544 15760 16391 9977 9305 6195 8739 1887 9540 18655 12996 20238 3473
5335 3473 -535 4746 -5951 -12248 -1135 790 -3694 4344 16498 17640 -6977 -10567 -3392 -1368
5321 -1368 8055 6322 7956 2802 10014 5082 -12540 -10056 -1702 573 -2205 -1358 -4909 10427 4156
5306 4156 -6225 -4656 -1500 -5086 -1683 -3142 -3961 -39 -3755 -4640 -16072 -20909 -13167 -2800 2927
5291 2927 6751 2175 1310 -7313 -18035 -11047 -6535 -14790 3502 10028 -11444 -17457 -17588 -20959 -14454
5276 -14454 -4244 3139 10582 2711 -16264 -17849 -9918 -129 -11000 3661 4658 6907 -4650 -14085
5262 -14085 -5505 -784 8738 10545 -5476 -6337 -10279 -9361 4235 10912 4606 8949 15076 5941 -2957
5247 -2957 -1740 -13505 -26211 -29750 -21074 -9537 -1697 -4691 2135 6787 8062 -10369 -31863 -22591
5233 -22591 -25757 -27518 -29724 -24650 -18646 -11395 -6878 -16521 -22283 -8479 -3663 -5352 -3393 -4886
5219 -4886 -133 5898 4192 18641 14484 743 -5561 -8238 -2008 4724 9429 15254 23085 10292
5205 10292 -2747 -14237 -20828 -25334 -32152 -25065 -20339 -23441 -28080 -12675 -6539 20719 24880 12842
5191 12842 18837 13891 -5155 -3570 -4438 -19622 -21127 -8651 -4079 3062 -7944 -16107 -5703 1863
5177 1863 -248 3939 -7957 -22790 -19755 -8286 -4478 -1084 13415 6259 -1571 -15292 -19278 -16117
5163 -16117 -17065 -2077 10944 816 -10997 -11909 -11120 -2034 3135 4889 -1159 -2613 15282 -1769
5149 -1769 -9561 6134 11130 2249 -19768 -21766 -17591 -9827 -1201 2241 1392 -535 -9733 -15851 -17682
5134 -17682 -19714 -27399 -13196 -6436 -343 1895 17969 26714 8547 1172 4859 -11291 -10650 -6353
5120 -6353 -5792 -7734 -23419 -9378 13025 20968 23737 20927 17103 422 -11225 -19337 -1249 9229
5106 9229 6445 4377 12564 20784 23059 22501 15590 3946 -4850 -4749 -118 -5648 -4496 -11325 -1458
5091 -1458 -3534 -17697 -18731 -21780 -14892 -17880 -6057 -1298 -14783 -11664 -8851 -2559 5626 -1445
5077 -1445 3110 19170 12124 -3114 3700 5997 11440 18835 12824 8686 5696 3662 1927 7199
5063 7199 19536 15805 1352 536 20 1328 16870 20601 7493 2664 4008 106 -10057 -17093
5049 -17093 -10685 3913 9900 12371 12548 5440 1108 7470 2344 6195 14485 1407 8439 5490
5035 5490 169 2113 -3055 -3523 -9586 5472 18741 34146 33902 24406 5705 -3289 -6404 -9120
5021 -9120 2126 6138 2059 5184 6316 15936 19477 16858 20871 15248 5500 5245 -2255 -9252 -3326
5006 -3326 14530 23742 5791 -2174 378 5953 4573 8951 2177 2110 -1192 -8026 -19387 -17150 -21868
4991 -21868 -32294 -30801 -24543 -9899 4971 -2740 -2100 -3455 496 -8099 -5549 813 -4110 -5476
4977 -5476 -2811 -2356 117 9840 5591 3896 10665 24215 34830 32965 16885 3404 -825 -1008
4963 -1008 5678 -2348 -2135 7485 23817 35845 28807 19132 16051 7781 -823 -11927 -15883 -16956
4949 -16956 -21467 -35105 -21387 -19254 -25763 -22322 -2328 -5867 -8271 865 5324 1983 -4360 -11819
4935 -11819 -8758 -7627 -8144 -9332 -2074 7961 -4747 -21703 -18532 -8092 3975 17285 30184
4922 30184 18467 481 778 11006 9551 11788 8602 22639 35408 29940 19509 14857 16667
4909 16667 19832 10485 -11823 -18362 -9538 -2282 2195 9541 6771 7288 -4695 -12821 -17917 -21364
4895 -21364 -19629 -15829 -23253 -29748 -28386 -11706 11602 12952 1503 -2815 -17428 -17620 -1235 6578
4881 6578 13379 5252 1699 -1355 5338 7521 18220 29737 15552 -6530 -8580 -6295 -3618 -3956
4867 -3956 -4898 -6527 -18848 -12175 5967 6467 10375 1552 -4643 3747 398 -4238 8739 23586
4853 23586 5755 760 2664 7571 10008 7762 8011 12350 16750 18591 9947 -2818 2328 7390
4839 7390 -4913 -2793 5741 -7228 -15261 -20863 -29310 -14028 -1723 -7540 -7779 -3414 -3397 -17101
4825 -17101 -25034 -22103 -27120 -20597 -926 9840 19958 24350 6857 -5502 -3165 7129 11234
4812 11234 3302 -2499 4097 -12849 -22001 -22515 -20329 -13048 -21785 -18966 2756 7832 451 -6244
4798 -6244 -8254 -15575 -3601 -3680 -11238 -23421 -27146 -28047 -20454 -7592 3892 5549 2997 -17828
4784 -17828 -30723 -31087 -20971 -4505 -4364 -11392 -7098 -4014 -8035 615 5859 6579 -16930 -25087
4770 -25087 -4259 -961 -5533 -9686 -1379 9436 21725 23757 9525 15619 19408 10800 -887
4757 -887 -22403 -26508 -28682 -36611 -39452 -25431 -3351 2344 -828 14638 8492 2678 -3380 2197
4743 2197 -6198 -15801 -14210 1039 8804 4152 -1539 7090 14038 14113 17122 22880 20167 11892 1436
4728 1436 3581 7262 -1700 -2513 7162 10775 4125 137 7293 12 -14868 -11235 9028 10180 5960
4713 5960 431 5443 10317 4677 -3166 -13645 -17108 -9726 -3358 -1371 3987 8047 -3556 -11426
4699 -11426 3564 4034 278 -7297 -18603 -17638 -10965 1031 2256 182 42 11 -13834 -13182 -162
4684 -162 -2463 -11183 -21141 -20143 -15083 -1224 -9331 -18210 -18639 -23540 -23679 -26201 -28936 -28312 -32729 -44339
4668 -44339 -55392 -39681 -30137 -29310 -36292 -29079 -20283 -4554 9526 4803 -3648 -13557 -21206 -12951
4654 -12951 -1825 1854 14021 21695 10853 3427 -9802 -5710 -6547 -2126 6806 11167 5816 11542
4640 11542 13125 -1469 -13252 -3368 -6315 -16706 -17638 -18819 -14580 -13756 -20359 -5815 -5462 -13311
4626 -13311 -24840 -29070 -25630 -16943 -5791 -1811 -1789 -5202 -2865 -1097 5796 13703 270 -10322
4612 -10322 -15400 -11891 -11685 -29359 -26889 -13053 -13505 -4683 5260 1734 5893 22172 13410 13588 17830
4597 17830 11584 11860 9544 17412 18208 14949 18883 10023 -5208 4828 10566 16754 11000 3748 -3533
4582 -3533 -567 3100 -7056 -5706 -12450 -11829 -3752 1937 1416 -723 -21099 -27187 -25175 -15366 3124
4567 3124 -6638 -25430 -35694 -33414 -17613 -17019 -12693 -19447 -10053 -926 3496 2369 3868 11615
4553 11615 11035 6072 -7537 -12471 3584 -2029 -6102 -17662 -23270 -22963 -3269 6830 3780 2441
4539 2441 -4558 -13168 -18612 -19041 -24033 -16983 -16226 -12686 -5809 -6065 -13477 -9655 -22014 -13736 -18048
4524 -18048 -29094 -23739 -4933 8327 1175 1673 7770 16715 21024 21517 23170 21940 9503 3682
4510 3682 580 -2745 -8220 -10122 -3988 -6477 841 4310 9617 9320 3777 740 1520 -1947 -9077
4495 -9077 2097 14746 7762 7799 1714 -11912 -18937 -12989 -7945 12467 19145 2579 -17967 -21773
4481 -21773 -14600 -12314 5700 23863 18843 20943 7433 11149 26275 22973 5022 -3090 -24591
4468 -24591 -32010 -26881 -25950 -15089 -4741 -2597 -4703 1992 2554 -3585 -1480 -12729 -14545 -14853 -22200
4453 -22200 -27002 -21823 -12809 -5202 -2659 -16710 -12847 -172 318 -10398 -7704 -10991 -15859 -15562
4439 -15562 -19628 -11278 -3373 -3818 -504 -3842 -14792 -16154 1217 4208 9385 -1889 7529 17509
4425 17509 16261 16593 22200 19771 967 -4456 774 -5806 -8184 -17580 -28623 -28752 -40111 -44076
4411 -44076 -35883 -21726 -6219 -16334 -30323 -44758 -38029 -23800 -26340 -29016 -16409 10995 16961
4398 16961 16510 165 -12516 -2046 7166 17119 7753 -7392 -15807 6149 7761 7561 4567 8813
4384 8813 4749 -1204 2643 4375 13796 24215 26590 16413 14425 1635 -16286 -18274 -16579 -1497
4370 -1497 -1046 -14336 -13198 -4200 -19515 -13898 4126 3747 8321 6190 8096 6139 7777 -2920
4356 -2920 -13280 -10738 -10153 -8609 -6403 -4188 1494 6693 -1607 8581 16723 19121 3360 -22724
4342 -22724 -23316 -17464 -1944 -899 -4024 -5845 -7237 -4962 1655 7693 15491 5700 12001 6807 853
4327 853 -11703 -4816 8540 15806 15598 34633 35125 34938 24128 12883 13555 4684 3446 13332 19674
4312 19674 23180 21340 13849 6463 5949 -5595 -2195 -5002 -818 8010 -6488 -8691 -13033 -16180
4298 -16180 -10508 -19021 -24544 -18925 -7555 -3725 -2132 -10635 -21568 -10107 -6135 -10638 -9976 2562
4284 2562 -4101 -589 7777 6389 -1269 2667 8388 17697 16696 -744 -12910 -20180 -11536 -15426
4270 -15426 -24633 -15514 -10683 -17476 -26229 -24002 -8024 15032 12018 6401 5278 13632 10145 -2096
4256 -2096 -19951 -13431 -671 6883 -5468 -446 -183 8783 4514 -687 -6857 -19447 -16487 -20565
4242 -20565 -12543 -29380 -27707 -12825 -2317 -11685 -9504 -10541 -9631 -2148 837 -2492 -10610 -18699
4228 -18699 -23696 -21388 -18549 -10742 -340 -13532 -19050 -18360 -21653 -24861 -11007 -14321 -28150 -26658
4214 -26658 -2895 -13476 -24524 -11473 -1632 -2416 8970 16129 17465 10518 5810 4492 -4885 3520
4200 3520 3339 11815 14499 7427 17954 19370 248 -14605 -15372 -13727 -13821 -25164 -20018 -19424 -15072
4185 -15072 -18735 -20030 -9844 -9367 5096 22557 22956 8808 -1089 4954 -5018 -21433 -31969 -22107
4171 -22107 -11078 -15014 -21027 -11651 2800 2369 4950 6766 -480 -2838 7515 16076 6763 1826
4157 1826 -2070 -17284 -29411 -29799 -12560 -8534 -6721 -5949 -3695 -7197 -12526 -8320 -12614 -16586 -18775
4142 -18775 -16015 -13528 -16932 -21609 -33130 -35833 -38897 -24767 -18877 -14740 -13997 -6225 -21307 -37782
4128 -37782 -32477 -13970 2461 8031 13729 11542 -9076 -13337 -3485 -322 -2535 3408 6534 -1065
4114 -1065 -4916 -17902 -25153 479 8798 12384 24034 12827 -8942 1144 18063 13924 10779
4101 10779 1695 -8730 -5143 -5633 -15851 -24472 -25646 -25906 -15522 -39 12934 20507 19904 14757
4087 14757 19630 18102 13270 10254 12917 13850 19486 13903 18543 17073 21108 21853 11997 -5981 -17046
4072 -17046 -19066 -16456 -779 9617 4737 7291 4841 -13374 -11300 -516 -12595 -20430 -17678
4059 -17678 -19474 -18644 -14665 -13716 -12824 -6880 -12846 -15150 -15908 -8241 -1702 7352 23147 22891 14732 21868
4043 21868 15456 12750 4103 10259 25187 21490 23616 7127 829 5916 8556 3721 -3407 -12471
4029 -12471 -10935 4868 11060 7446 -7236 -21133 -26306 -26761 -15651 -6483 -32903 -37587 -29262 -16908
4015 -16908 -5572 -6761 2462 11137 11405 2892 4941 4528 13579 11561 8213 1587 3181 -3191 -15632
4000 -15632 -5573 -4181 -12476 -17461 -18002 -14490 -10227 1914 -4798 -9404 -5877 -6185 5483 -2557
3986 -2557 -3877 -9939 -8667 5463 16225 16724 8679 -699 4987 10985 12725 8125 17198 -2433
3972 -2433 -1908 7261 8020 8494 3411 -5853 -4542 2712 13677 15967 24767 38643 37715 17406 4246
3957 4246 -8243 -19144 -23343 -16154 -194 8982 -609 -13728 -21168 -23523 -25956 -42997 -35340 -33353
3943 -33353 -23191 -6475 5450 3134 5983 3209 7513 12016 17875 10790 15051 18435 36 2428
3929 2428 6364 -2698 363 12811 9781 7869 7212 2431 -8904 -16824 -20670 -12599 -11965 -16537 3634
3914 3634 17594 20647 15973 -4801 -5084 -6480 963 6003 15543 12203 1888 -11137 -15449 -14042
3900 -14042 -14546 -15746 -10553 2025 -5218 -10270 -11879 -9306 -678 -11342 -23540 -21552 -3979 10454
3886 10454 16977 17016 10453 -4154 -15166 -12141 -259 9005 -2286 -13742 -10016 -9912 -12723 -12128
3872 -12128 -883 16122 20813 11317 9673 3628 3645 13691 5881 27 5381 9335 10133 10788 -1521
3857 -1521 -3559 -1416 3198 7272 -2592 5793 -1008 -23699 -25543 -22189 -14321 -6341 10157 855
3843 855 -5564 -2590 11207 8538 -5305 -25155 -24075 -903 6616 3531 6723 15952 16097 278
3829 278 -13351 -14816 -8236 -3340 -9119 -5718 -5369 -6419 -6854 -14696 -30828 -31334 -28327 -34907 -18864
3814 -18864 -3888 -402 -6517 -13949 -13326 -10696 4697 9918 579 3456 592 5640 4305 -403
3800 -403 -6156 -19550 -18787 -20495 -23659 -17934 -9878 -5959 -8917 -4472 -10451 -13987 -24415 -28081 -18246
3785 -18246 -4898 -6889 -2388 -6290 4296 15428 2204 29 4525 10529 16605 19425 3577
3772 3577 -5803 -13446 -2307 -11822 -21940 -11908 -2355 3430 -9479 958 5551 5662 6404 -1574
3758 -1574 3708 5326 -5050 -11959 -801 -15666 -29030 -33214 -31684 -19642 -15569 -9581 -6301 1155
3744 1155 10690 11240 -11265 -11634 -16061 -15243 -1054 -4247 -885 -5511 -8611 -5455 12033 20428 13055
3729 13055 9611 -2420 -2791 1888 -11267 -3353 -414 -4496 -12981 -15095 -8191 -3566 -6813 -2240
3715 -2240 6734 3461 -2600 5156 9068 -5927 -5569 97 3460 2240 -1622 -572 30 6314 12160
3700 12160 22335 9670 6883 16528 21607 18260 9648 -7468 -21822 -13668 -9067 2276 7253
3687 7253 4849 15466 13832 5018 -5943 -5967 4921 9033 13551 26622 12506 2606 11330 13235
3673 13235 3365 -2019 5547 6419 -4343 -8350 -13526 -9917 -5628 -6923 -1634 442 -4248 6186
3659 6186 743 -21147 -33935 -33688 -28688 -20556 -11069 -14933 -25934 -20750 -14047 -7884 -8909 -1846
3645 -1846 10434 7950 2453 3430 10835 17276 12772 14693 -4105 -7211 -1735 5684 1347 -933 17550
3630 17550 6044 -5533 -7584 9405 5583 -6466 -12597 -13102 785 23487 13841 -3278 -8907
3617 -8907 -1716 2078 -11519 -7076 -15535 -16024 -7918 -3628 -4998 -1363 3653 -16521 -31876 -29530
3603 -29530 -24859 -31846 -23175 -9765 -22801 -31741 -20364 -7318 3457 -11876 -30394 -16051 -16742
3590 -16742 -8785 -3268 -581 -12642 -29810 -30054 -11573 619 5367 4725 2568 -1656 -4883 -2402
3576 -2402 12144 4496 -1769 -2527 -8792 -14062 -5499 -2966 -4299 6307 10362 5899 -15396 -19848
3562 -19848 -20290 -23352 -17749 -12371 -1267 -15021 -23648 -19866 -7649 2049 7540 3583 3009 565
3548 565 -1911 -4801 -8124 -17044 -6378 993 -12276 -22108 -17478 -9779 -8022 -11159 -2391 15580
3534 15580 11035 6251 13197 11545 4417 7272 -9419 -23877 -36849 -36158 -27506 -26772 -36681 -31381
3520 -31381 -20660 -5762 7345 17242 13672 2962 -4213 9973 814 -7511 -6711 -622 -11190
3507 -11190 -22804 -22634 -32174 -37506 -31219 -26813 -8340 7221 2222 -14810 -29448 -26674 -13009
3494 -13009 -16732 -8856 -5839 -3014 -4147 -1959 -9743 -10158 -7783 -3035 3012 8233 12803 8291 1226
3479 1226 10724 8223 -2072 9956 15301 15772 15557 14613 8609 3778 -4257 -2856 8364 -2248 -3497
3464 -3497 758 -5162 -11709 -18144 -15266 5937 12935 -8570 -17244 -15862 -10870 -5017 -15731 -18097
3450 -18097 -14958 -9848 -13460 -21740 -18513 -4061 -3454 -2681 -19537 -21785 -8945 -10676 -11342 -4279 -9933
3435 -9933 -1783 -2907 -1032 5411 11222 8627 2707 -1928 760 -1833 -1462 -9447 -7512 -10626 -12865
3420 -12865 -13962 2834 28216 31832 20969 16009 17242 12803 13022 21330 25828 26732 24822 12168
3406 12168 -262 -8561 -4296 -7536 219 7338 10662 -1160 -8290 -12549 -17421 -16376 -10287 -13475
3392 -13475 2891 7629 4021 -9426 -14503 -6722 -7171 -2656 7014 10029 1515 -4417 8526 11949
3378 11949 5415 3568 1970 9056 8113 4018 8160 9012 1510 4579 -3421 6078 9409 6587 -3870
3363 -3870 -6564 3289 11783 23808 21539 7057 -6099 -1518 499 9046 2493 7380 15346 6212
3349 6212 18183 15622 13493 11389 6275 10550 11143 6146 -4681 -5362 -116 -2521 -432 -3674 -8266
3334 -8266 -6862 403 3889 -4324 -9936 -10125 -8374 -13465 -4396 -3869 -1754 9476 15394 4528 -11001
3319 -11001 -7974 4731 10944 17137 3311 -11227 -5677 -560 6770 -4241 -12939 -10411 -10792 -3402
3305 -3402 -2936 9504 10125 -11336 -17209 -3055 3325 8206 613 -6891 -2656 4362 14747 10980
3291 10980 3984 -3899 -5195 6583 9886 9165 5324 -9433 -10260 -6030 -3191 -1711 3652 13590 9753
$$ [...]
##END NTUPLES=NMR SPECTRUM
##END=
