##TITLE=Analysis number 325751
Compound Code cc 52209
Book Reference 467/108/3
Project Code adrs
Chemist Name benw
##JCAMPDX= 6.0         $$ Bruker NMR JCAMP-DX V2.0
##DATA TYPE= NMR SPECTRUM
##DATA CLASS= NTUPLES
##ORIGIN= Bruker BioSpin GmbH
##OWNER= nmr
$$ XWIN-NMR		Version 3.5
$$ Thu Jan 11 13:07:04 2007 GMT Standard Time (UT+0h)  MAYBRIDGE\nmr@NMR_250MHZ
##.OBSERVE FREQUENCY= 250.131544655141
##.OBSERVE NUCLEUS= ^1H
##.ACQUISITION MODE= SIMULTANEOUS (DQD)
##.ACQUISITION SCHEME= undefined
##.AVERAGES= 16
##.DIGITISER RES= 18
##SPECTROMETER/DATA SYSTEM= dpx250
##.PULSE SEQUENCE= zg30
##.SOLVENT NAME= CDCl3
##.SHIFT REFERENCE= (INTERNAL, CDCl3, 0, 16.5194)
##AUDIT TRAIL= $$ (NUMBER, WHEN, WHO, WHERE, WHAT)
$$ ##TITLE= Audit trail, XWIN-NMR		Version 3.5
$$ ##JCAMPDX= 5.01
$$ ##ORIGIN= Bruker BioSpin GmbH
$$ ##OWNER= nmr
$$ C:\u/data/dgb/nmr/ADRS/940/pdata/1/auditp.txt
$$ ##AUDIT TRAIL=  $$ (NUMBER, WHEN, WHO, WHERE, WHAT)
(   1,<2007-01-11 13:06:44.20 +000>,<MAYBRIDGE\nmr>,<NMR_250MHZ>,
      <created by zg, POWCHK disabled, PULCHK disabled
       configuration hash MD5:
       49 4B E0 1D 92 C2 6B 37 9F E6 65 BC 52 41 86 1D
       data hash MD5: 64K
       F3 76 FA C4 5F 19 74 56 DA 98 30 5A 2F A7 24 B3>)
(   2,<2007-01-11 13:06:55.74 +000>,<MAYBRIDGE\nmr>,<NMR_250MHZ>,
      <Start of raw data processing
       ef LB = 0.3 FT_mod = 6 PKNL = 1 SI = 32K 
       data hash MD5: 32K
       9E FE 39 E7 E7 4E 50 4C D4 3D 1C 23 BC 79 55 F6>)
(   3,<2007-01-11 13:06:57.43 +000>,<MAYBRIDGE\nmr>,<NMR_250MHZ>,
      <apk 
       data hash MD5: 32K
       12 8B 1B 88 5F 15 3A 6E 99 17 90 62 29 14 A7 95>)
(   4,<2007-01-11 13:06:58.12 +000>,<MAYBRIDGE\nmr>,<NMR_250MHZ>,
      <abs ABSG = 5 
       data hash MD5: 32K
       07 21 2D 3C 1D 85 75 F1 7D 1E 3F 5D C5 27 7A AE>)
$$ ##END=
$$ 
$$ hash MD5
$$ BC 7D 46 63 D9 2D 17 FE 8C 9A 0E FB 0B 5B 7E 16
##$RELAX= 
##$RELAX= 
##$RELAX= 
##$RELAX= 
##$RELAX= 
##$RELAX= 
##$RELAX= 
$$ Bruker specific parameters
$$ --------------------------
##$DU= <C:\u>
##$EXPNO= 940
##$NAME= <ADRS>
##$PROCNO= 1
##$TYPE= <nmr>
##$USER= <dgb>
##$AMP= (0..31)
100 100 100 100 100 100 100 100 100 100 100 100 100 100 100 100 100 100 
100 100 100 100 100 100 100 100 100 100 100 100 100 100 
##$AQSEQ= 0
##$AQ_mod= 3
##$AUNM= <au_zg>
##$AUTOPOS= <10 >
##$BF1= 250.13
##$BF2= 250.13
##$BF3= 250.13
##$BF4= 250.13
##$BF5= 500.13
##$BF6= 500.13
##$BF7= 500.13
##$BF8= 500.13
##$BYTORDA= 1
##$CFDGTYP= 0
##$CFRGTYP= 5
##$CHEMSTR= <none>
##$CNST= (0..31)
1 1 145 1 1 1 1 1 1 1 1 1 1 1 1 1 1 1 1 1 1 1 1 1 1 1 1 1 1 1 1 1 
##$CPDPRG= <>
##$CPDPRG1= <>
##$CPDPRG2= <>
##$CPDPRG3= <>
##$CPDPRG4= <mlev>
##$CPDPRG5= <mlev>
##$CPDPRG6= <mlev>
##$CPDPRG7= <mlev>
##$CPDPRG8= <mlev>
##$CPDPRGB= <>
##$CPDPRGT= <>
##$D= (0..31)
0 1 0 0 0 0 0 0 0 0.06 0 0 0 0 0 0 0.0002 0 0 0 0 0 0 0 0 0 0 0 0 0 0 
0 
##$DATE= 1168520803
##$DBL= (0..7)
120 120 120 120 120 120 120 120 
##$DBP= (0..7)
150 150 150 150 150 150 150 150 
##$DBP07= 0
##$DBPNAM0= <>
##$DBPNAM1= <>
$$ [...]
##$SUBNAM7= <"">
##$SUBNAM8= <"">
##$SUBNAM9= <"">
##$SW= 20.6930455092707
##$SWIBOX= (0..15)
0 0 3 0 0 0 0 0 0 0 0 0 0 0 0 0 
##$SW_h= 5175.983436853
##$TD= 65536
##$TD0= 1
##$TE= 294.16
##$TE2= 300
##$TE3= 300
##$TEG= 300
##$TL= (0..7)
0 120 120 120 120 120 120 120 
##$TP= (0..7)
150 150 150 150 150 150 150 150 
##$TP07= 0
##$TPNAME0= <>
##$TPNAME1= <>
##$TPNAME2= <>
##$TPNAME3= <>
##$TPNAME4= <>
##$TPNAME5= <>
##$TPNAME6= <>
##$TPNAME7= <>
##$TPOAL= (0..7)
0.5 0.5 0.5 0.5 0.5 0.5 0.5 0.5 
##$TPOFFS= (0..7)
0 0 0 0 0 0 0 0 
##$TUNHIN= 0
##$TUNHOUT= 0
##$TUNXOUT= 0
##$USERA1= <user>
##$USERA2= <user>
##$USERA3= <user>
##$USERA4= <user>
##$USERA5= <user>
##$V9= 5
##$VALIST= <valist>
##$VCLIST= <CCCCCCCCCCCCCCC>
##$VD= 0
##$VDLIST= <DDDDDDDDDDDDDDD>
##$VPLIST= <PPPPPPPPPPPPPPP>
##$VTLIST= <TTTTTTTTTTTTTTT>
##$WBST= 1024
##$WBSW= 4
##$XGAIN= (0..3)
0 0 0 0 
##$XL= 0
##$YL= 0
##$YMAX_a= 317429
##$YMIN_a= -450449
##$ZGOPTNS= <>
##$ZL1= 120
##$ZL2= 120
##$ZL3= 120
##$ZL4= 120
##$ABSF1= 16.51938
##$ABSF2= -4.173792
##$ABSG= 5
##$ABSL= 3
##$ALPHA= 0
##$AQORDER= 0
##$ASSFAC= 0
##$ASSFACI= 0
##$ASSFACX= 0
##$ASSWID= 0
##$AUNMP= <proc_1d>
##$AZFE= 0.1
##$AZFW= 0.1
##$BCFW= 0
##$BC_mod= 0
##$BYTORDP= 0
##$COROFFS= 0
##$CY= 12.5
##$DATMOD= 1
##$DC= 0
##$DFILT= <>
##$DTYPP= 0
##$F1P= 14.0000005364418
##$F2P= -0.99999901652339
##$FCOR= 0.5
##$FTSIZE= 32768
##$FT_mod= 6
##$GAMMA= 0
##$GB= 0
##$INTBC= 1
##$INTSCL= 1
##$ISEN= 128
##$LB= 0.3
##$LEV0= 0
##$LPBIN= 0
##$MAXI= 10000
##$MC2= 0
##$MEAN= 0
##$ME_mod= 0
##$MI= 0
##$NCOEF= 0
##$NC_proc= -5
##$NLEV= 6
##$NOISF1= 0
##$NOISF2= 0
##$NSP= 0
##$NTH_PI= 0
##$NZP= 0
##$OFFSET= 16.51938
##$PC= 1
##$PHC0= 227.8298
##$PHC1= 7.598207
##$PH_mod= 1
##$PKNL= yes
##$PPARMOD= 0
##$PSCAL= 4
##$PSIGN= 0
##$REVERSE= no
##$SF= 250.130000654705
##$SI= 32768
##$SIGF1= 0
##$SIGF2= 0
##$SINO= 400
##$SIOLD= 32768
##$SREGLST= <1H.CDCl3>
##$SSB= 0
##$STSI= 32768
##$STSR= 0
##$SW_p= 5175.98343685301
##$SYMM= 0
##$S_DEV= 0
##$TDeff= 65536
##$TDoff= 0
##$TI= <Analysis number 999999
Compound Code 99
Book Reference 9
Project Code 9>
##$TILT= no
##$TM1= 0
##$TM2= 0
##$TOPLEV= 0
##$USERP1= <user>
##$USERP2= <user>
##$USERP3= <user>
##$USERP4= <user>
##$USERP5= <user>
##$WDW= 1
##$XDIM= 32768
##$YMAX_p= 282071765
##$YMIN_p= -417446
$$ End of Bruker specific parameters
$$ ---------------------------------
##NTUPLES= NMR SPECTRUM
##VAR_NAME=  FREQUENCY,     SPECTRUM/REAL,   SPECTRUM/IMAG
##SYMBOL=    X,             R,               I
##VAR_TYPE=  INDEPENDENT,   DEPENDENT,       DEPENDENT
##VAR_FORM=  AFFN,          ASDF,            ASDF
##VAR_DIM=   32768,         32768,           32768
##UNITS=     HZ,            ARBITRARY UNITS, ARBITRARY UNITS
##FACTOR=    0.157963299565203, 1,           1
##FIRST=     4131.99267265385, 0,            0
##LAST=      -1043.99076419916, 0,           0
##MIN=       -1043.99076419916, -417446,     0
##MAX=       4131.99267265385, 282071765,    0
$$ Real data points
##PAGE= N=1
##DATA TABLE= (X++(R..R)), XYDATA
$$ [...]
23546 -74888 -10753 6136 -55228 -141623 -109112 -43994 77947 144173 10389 -114254 -234304
23535 -234304 -206793 -171051 -126664 -33629 54514 -64811 -142014 -60487 -12708 -36964 -54336
23524 -54336 -68282 -19511 -41172 -36877 12623 -44584 -72483 -83504 -138183 -158385 -60907 -58354
23512 -58354 -65756 -87991 -51354 -80747 -167596 -116319 -618 20067 68974 55709 54149 75695
23500 75695 157596 199230 113731 39348 39862 75198 -54076 -67487 41102 -699 31307 78739
23488 78739 36362 -20041 -17378 12057 33054 68947 -6088 -84929 -21228 76497 61396 45108
23476 45108 -205 -34105 4960 114371 146172 37133 49817 60136 28611 -129501 -161805
23465 -161805 -120674 -20971 13300 -16111 -53631 -19903 52447 6768 -38182 -60516 -88906
23454 -88906 -88627 -70185 -29419 -104403 -196273 -258988 -162472 -93608 -109092 -145647 -155081 -64599
23442 -64599 5368 42074 -49692 -66829 -81196 -59007 81964 168605 116282 93987 -2391
23431 -2391 8145 55595 34984 93632 11430 -28097 -74102 -114654 -61226 2079 29047 -22157
23419 -22157 -3881 63925 43782 140465 212088 209632 151106 30710 6355 -27448 -68926 -37737
23407 -37737 -117286 -41021 65537 -37681 -107965 -9463 -74778 -101046 16007 -25146 -58085
23396 -58085 -23790 -39870 -25831 29646 40996 34361 36334 99245 136646 127828 87057 92473
23384 92473 92566 29648 82048 86379 19362 25147 -37999 -96275 -87629 -107422 -141986 -205722 -163301
23371 -163301 -80014 19600 40088 22664 30994 -51405 22897 50819 57333 9560 -121954 -181064
23359 -181064 -120435 -63671 6568 146878 190218 166889 116200 17117 -60573 -8158 65366
23348 65366 19425 12127 75407 70604 82404 81296 156763 146953 95494 56030 117408 61145
23336 61145 35044 -35215 34414 110768 -19888 -81311 42990 -2645 -32688 110017 162378
23325 162378 230261 207137 209885 134096 63638 52465 226221 168235 61488 185839 428646
23314 428646 642981 896402 833708 730746 698818 778057 829967 711157 470768 239191
23304 239191 97696 151041 181688 240243 204991 182951 84575 20316 -50745 -100775 -64813
23293 -64813 7333 51090 97281 84664 -24212 27876 41401 33149 36852 -76862 -63590 -13877
23281 -13877 30251 48120 29209 -18499 -11232 28697 17977 -60118 -3294 89867 207346 237022
23269 237022 162440 149779 165287 170419 86412 97711 118576 -6901 -65549 17341 -22449
23258 -22449 -80449 -31625 -48234 -103255 -102645 -104570 -72902 20453 92229 120370 80299 104588
23246 104588 91605 40204 21497 119854 109604 52376 49128 16699 66543 86269 -17051
23235 -17051 -6606 8853 -71086 -104236 -99570 -126467 -154354 -142690 -146244 -149954 -53625 -51561
23223 -51561 -119959 -215444 -262929 -183964 -153640 -218757 -90252 21316 31471 -16673 -44499
23212 -44499 -129579 -104504 -25353 -26021 -65913 -186656 -245202 -189687 -47925 40559 16426 -42025
23200 -42025 -45658 1310 15750 -92597 -185527 -135903 -76793 -13286 50328 25875 -92267
23189 -92267 -111411 -137251 -81508 -86245 -66302 -77935 44033 34099 -29162 -126070 -76435 -54629
23177 -54629 88077 108130 10128 -64751 -89160 -98284 -115380 -40170 3635 -19654 -64553 -74786
23165 -74786 -160090 -193161 -223382 -159238 -101303 42810 107162 -26919 -196934 -69302 -10497
23154 -10497 10959 41801 -2562 -47516 11788 151351 96786 63063 36917 -66238 -138420
23143 -138420 -118959 -65295 -66609 -123756 -60361 -72802 -216248 -286176 -259281 -174573 -102534
23132 -102534 44945 102639 107403 142416 116844 143157 207595 229426 115507 -6829 -39574
23121 -39574 -94888 -45508 -13762 -21292 -56611 26456 16073 49063 140746 87017 3106 43486
23109 43486 28354 -32563 -75156 -97551 -16792 11889 13040 -23447 -68225 -65707 -104543 -48491
23097 -48491 12821 25326 57479 107600 207443 226201 142834 125035 100822 -36822 -151526
23086 -151526 -156580 -98829 -40200 -102972 -133341 -30674 -31715 30713 152096 138276 60782
23075 60782 140371 163461 56629 101086 148854 74372 -15632 -89587 -110022 -123393 -195662
23064 -195662 -43315 -33683 -140540 -216102 -168391 -144125 -68195 38749 93948 97222 31721
23053 31721 39823 122893 86452 98804 172860 155351 90413 78961 169856 133233 88591 -25419
23041 -25419 -120787 -196747 -242861 -166894 -51118 -89799 -56424 57208 79824 65654 65750 55938
23029 55938 89844 140319 185430 167395 128117 79707 -5856 -42304 -23115 35847 68829 40593
23017 40593 23176 47381 3514 35354 59977 68711 83817 14356 -12942 46827 -7405 -4350
23005 -4350 50744 64898 74854 119448 196827 168802 116551 -41965 -102731 -171261 -158257 -134963
22993 -134963 -171052 -162047 -19767 90633 -56356 -68844 -37044 36975 83411 72323 56118
22982 56118 33054 34882 -4422 -131256 -187955 -42198 26945 55000 129426 151091 67333
22971 67333 73165 71284 -4812 -4583 -19843 -9477 -115468 -112725 -77690 -81746 -56422 -39488 -99071
22958 -99071 -57656 -14001 -18245 115129 95804 210818 262941 134781 16492 31382 13419
22947 13419 -78480 -79365 -107725 -27302 54429 134477 115234 84160 163530 168135 176460 114689
22935 114689 54943 30335 62583 91118 11512 -61724 -44892 -43983 -35360 -75639 -106009 -160129
22923 -160129 -180817 -123094 -29278 -138223 -131765 -39969 -21978 -122378 -165637 -62892 13233
22912 13233 -32943 -25045 -62366 -15838 10693 -23763 -60852 -102939 -24246 -56320 12173 88133
22900 88133 62610 29536 104323 91142 -10927 -47881 -65845 -72679 -13945 -62868 -50945 32271
22888 32271 180572 364611 308968 224789 261154 163895 -3628 -109192 -77571 -61013 -215151
22877 -215151 -272112 -244656 -94297 -75524 -211928 -138510 -10876 19044 85491 89106 36224
22866 36224 49596 58299 68189 35344 -4590 -77227 -30724 -17475 -35410 -95896 -132843 156
22854 156 81709 100232 26227 55494 49540 101233 84822 90117 17294 -93513 -136108 -88062
22842 -88062 -160325 -71133 26794 20724 43859 64292 -14051 -39362 -114939 -125874 -231733 -192213
22830 -192213 -191015 -193866 -182765 -114151 -112260 -109594 31935 48570 20671 28036 83215 147477
22818 147477 107344 30555 -15418 -126665 -60297 -38225 28765 127098 201391 153808 34653
22807 34653 -85942 -154076 -166646 -102176 -66408 -122347 -33252 157269 129289 40038 -18804
22796 -18804 61998 59571 93442 146656 127942 152811 191552 216921 206945 118020 30039 33616
22784 33616 75921 31992 -50469 -24291 81318 133271 127145 108278 22154 -16904 77512 188401
22772 188401 222745 171496 76924 38373 -22207 -13940 -60099 -17311 105037 161652 174005
22761 174005 135250 -22979 -85947 -90960 -50930 -28483 -56743 -18127 15701 15232 -70563 19297
22749 19297 35524 80189 177519 200643 150249 90502 75140 162941 67894 20643 103034 6562
22737 6562 -94020 -199300 -38709 57522 47211 70466 40209 114131 211395 143915 82971
22726 82971 108255 55982 71181 30079 -27464 -30909 33911 50281 6966 31076 -65388 2000
22714 2000 -21168 -68188 -29443 108005 89057 218491 267375 162717 134879 76439 68474
22703 68474 14238 21088 24960 18434 -33023 -79327 -15970 -44348 -64643 28028 43767 -32347
22691 -32347 99283 125128 210188 300173 184639 33969 -91647 -137337 -107764 24197 23025
22680 23025 109164 71360 69038 -5415 -43743 -38231 33630 42751 -61475 -63146 -7609 -6159
22668 -6159 -7215 -40588 -85366 -120539 -121585 -37702 61039 113281 35974 35275 -77150 -91127
22656 -91127 -56351 -44080 -23824 44493 2249 1300 -39658 -48713 68548 127258 108638 159719
22644 159719 270173 354192 256222 82523 19371 -36260 -70268 -104896 -147037 2210 -22482
22633 -22482 -96875 -150676 -113596 -74899 -103397 -116084 -137850 -199203 -105578 -9491 62677 11287
22621 11287 -25928 -54304 19252 1694 -18345 -21072 -157914 -239661 -161023 -58884 35784
22610 35784 90668 137990 29903 -66096 -173667 -111385 -83066 -52137 19194 188329 258927
22599 258927 165639 15358 -8086 50119 -2512 109277 91328 2404 936 36260 2256
22588 2256 57515 43275 121205 322799 213132 155559 162358 89870 18210 45689 -11515 6704
22576 6704 -15192 16761 -3298 -99225 -153640 -153853 -181921 -105335 31974 -210 30543 -4200
22564 -4200 -13691 9286 69187 57308 -121191 -153862 -108850 -102885 -134168 -70041 -92594 -57247
22552 -57247 9658 37691 75404 73610 -30200 -78841 -80365 11433 44327 20783 -76601 -22051
22540 -22051 73299 36316 -19187 -44658 -62543 -116515 -79503 -96240 -151267 -53062 13183 43895
22528 43895 113855 73318 90779 73836 45404 53034 69740 52208 19497 153453 147516 93026
22516 93026 91777 70851 65452 32849 -4367 56075 17908 51026 263214 299845 206095 73250
22504 73250 48136 20502 15408 102568 140063 135879 91323 -100320 -134242 -181002 -62997 -56373
22492 -56373 -67774 -16704 98968 211650 144377 58134 -37551 -65595 88082 166891 209923
22481 209923 142525 16433 -11586 -45371 -10984 37336 111303 124343 54420 137773 162583
22470 162583 39183 -51150 -7990 11631 -93668 -199758 -216513 -150827 -111489 -64824 -34419
22459 -34419 -2554 -49975 42849 102976 -4514 64709 57421 -70297 -13102 22276 84894
22448 84894 156334 57227 -129955 -265867 -184672 -74013 51547 106356 122405 43049 -46399
22437 -46399 -30101 1041 25338 96468 244238 253783 160305 20188 -11024 -34017 -45780
22426 -45780 -25513 -89395 -144543 -177568 -160186 -30067 -623 48476 99194 85136 114972
22415 114972 107549 9964 -8898 -4217 102579 186032 69379 -51132 -64045 -83840 6255
22404 6255 5560 -69624 -57589 -96012 -4931 -1799 -105337 -147004 -106002 -92188 -71227 -46820
22392 -46820 -51774 -108658 -180657 -239469 -210316 -67159 24704 10632 109587 116994 -26009 -106480
22380 -106480 -88533 -127601 -124125 -126999 -151549 -178305 -149675 -135844 -102643 -142331 -247143 -242270
22368 -242270 -99788 53994 16790 -41888 -40436 -24849 61290 149488 86830 49158 -56396
22357 -56396 -28006 35011 54390 59871 -66337 -120147 -175313 -78587 -28511 -23908 66725 121210
22345 121210 216501 215666 216343 156510 73316 102178 156589 137548 41880 86951 30482 17218
22333 17218 42619 -35529 -63196 74516 122367 134884 105661 88788 -11859 -67554 -42976
22322 -42976 22351 37103 8197 88472 166707 218338 225179 245735 161055 22425 78100 8168
22310 8168 8458 -17056 65507 186716 233140 234615 187610 187627 287056 329978 106407 -38711
22298 -38711 -1882 -15537 -56487 -59132 -59308 -78904 -14639 53078 118826 137547 190341 56389
22286 56389 -69903 -80451 38040 70948 35030 90174 234261 243740 107477 169060 139967
22275 139967 65341 37830 72549 234707 309252 325621 166792 40546 56704 2252 -38751
22264 -38751 70881 63398 23696 60107 95448 141293 163621 82434 51934 172744 239813
22253 239813 247261 210998 84539 41593 20481 -13573 57201 61845 46852 76136 98215 53825
22241 53825 -50934 -164042 -190611 -152961 -167624 -169532 -108048 -86789 -30191 35821 34452 69518
22229 69518 23802 -70062 -62066 -4267 -3546 70677 72441 20947 -1162 -79505 -128238 -58
22217 -58 -21478 -109729 -19861 -28690 -73874 -47136 -58646 -136625 -82900 -45925 -41390 -55018 -377
22204 -377 -59001 -74935 48646 42276 -21785 -11431 18735 9821 -35688 -93108 -32057 -27261
22192 -27261 -50303 -30042 9398 -7028 -84531 -32647 29095 -35504 -11258 -9301 39980 -2527
22180 -2527 -59362 63752 102649 158847 205751 156854 39612 -72168 -54777 -44331 -72060
22169 -72060 -107980 -216601 -209664 -172020 -77852 10632 -67979 -77169 -85061 53888 133861 225009
22157 225009 208587 145599 161878 91694 14328 9898 27844 -135180 -162027 -99553 -82128
22146 -82128 -110892 -185045 -204460 -102146 -73900 -59852 -19943 -59800 -74409 -110241 -129292
22135 -129292 -92288 6355 32944 20721 89773 117079 8373 46777 23138 81274 163027
22124 163027 163071 80837 18989 -152909 -295907 -299212 -225224 -101513 -36299 -35893 -72459 41530
22112 41530 19411 12862 101045 68315 100521 92132 21830 -727 64155 138698 232512 223227
22100 223227 121584 -33679 -134583 -132254 -31074 18563 37599 -54244 -77466 25027 106934
22089 106934 112485 104283 122087 88667 -6051 -23262 24053 7813 -32261 -66880 -137479 -126580
22077 -126580 -137106 -90723 195358 312173 289471 237247 101715 137463 128383 -11682 -17175
22066 -17175 -109416 -16864 59264 36728 1992 46403 112232 208661 258558 270988 252245 153145
22054 153145 -18235 -72809 -58321 -103246 -86181 -60495 -96446 -51773 -99613 -17920 -13543
22043 -13543 -49264 -177413 -304852 -237697 -112874 -105353 -57225 -127495 -172791 -94866 -42560
22032 -42560 -29277 -89195 -124742 -785 64582 50056 46166 -31066 -34742 -52441 -110259 -99322
22020 -99322 -83839 -22137 -56087 -82151 -2128 -1409 -40290 40164 -3327 -43942 -45215 -86582
22008 -86582 -57829 -59870 -8945 -48336 -184766 -215177 -91027 -34541 -30864 -17969 -25845 14476
21996 14476 -11673 -27436 -59639 -62734 -110427 -104899 -94946 -80005 -82579 -164051 -166637 -181938 -102974
21983 -102974 -43392 -95425 -167844 -107103 -27067 -39506 -83389 -25262 87205 99128 34445
21972 34445 35625 90992 228289 285139 151251 95456 155957 126619 17945 -98957 -49473
21961 -49473 11751 2951 -64543 -21933 -5270 -9474 25632 79442 65589 86504 34622 40843
21949 40843 136593 203867 208491 199211 179804 167118 11683 -97232 -203001 -227288 -139390
21938 -139390 -76211 -69811 -137272 -99841 40466 -14446 -133219 -175421 -71649 -35674 -1536
21927 -1536 -36468 -42228 -70787 -72236 -28452 -74379 -4715 -63340 -46632 -67841 -166710 -63459
21915 -63459 88474 173171 90925 67476 79913 -4484 -17287 -17067 27521 125156 32419 -7727
21903 -7727 41965 85688 58763 -32569 -77104 -116579 -176183 -115354 -173675 -158035 -103905 -10347
21891 -10347 7861 26589 37287 24521 6255 77329 57854 25530 26440 -82946 -104335 -174935
21879 -174935 -204132 -267611 -241909 -117314 -109225 -98109 -13372 46112 99161 124951 126971 177499
21867 177499 113195 47010 23860 23133 -4409 -69761 -42404 28381 75863 81892 47109 -34474
21855 -34474 56814 70523 16783 47363 126987 208269 182191 74550 -10731 -37110 -8732
21844 -8732 69242 46205 -35328 -39328 -28763 -94042 -43063 -117985 -275086 -161780 -30017
21833 -30017 -80496 -44826 98236 96637 72183 90287 89495 13592 -9904 -131545 -145538 -104565
21821 -104565 -135652 -132658 -143432 -141649 -130417 -220615 -156173 -99688 14948 8145 -31615 -38882
21809 -38882 -11440 -6203 -23991 -52878 -81206 -88127 -104244 -130966 -82170 -113108 -84185 -183951
21797 -183951 -227772 -110411 -138889 -150243 -78400 -79540 514 95262 45598 -56964 -108333
21786 -108333 -86673 -39741 -14010 81210 124421 15060 -43196 -91002 -56254 7805 14442
21775 14442 31706 16799 1341 99407 110567 96566 83715 21173 31861 41276 -27931 -31127
21763 -31127 -43275 -46654 51224 82620 33025 54186 117951 -10346 -137826 -174124 -247890
21752 -247890 -183206 -151330 -131890 -141116 -116359 -63721 -7327 2458 57764 59785 19787 36065
21740 36065 -8236 -86306 13073 41309 -12415 52570 75696 -21224 -37432 38119 946 -110709
21728 -110709 -136028 -61886 -83640 -100159 -188397 -167284 -162806 -55541 161742 66726 -79541
21717 -79541 27440 58679 76275 18121 -19347 30281 7260 -15878 -51116 -15025 -16281 8675
21705 8675 80188 44783 -459 31491 -16724 29800 73840 70087 42441 -36679 -103665 -166979
21693 -166979 -182983 -207138 -178984 -169115 -92965 -50497 -16724 -100396 -185135 -270431 -275083 -127746
21681 -127746 -117306 -169246 -158036 -103673 -72775 -79592 -124839 -11849 56496 101955 27285
21670 27285 45282 26558 -72775 -44681 914 21386 131452 72001 -1778 27931 28728 -44621
21658 -44621 -62050 -121191 -76319 6827 46950 -19497 -140800 -156242 -172589 -89942 -101646
21647 -101646 -95487 23283 82773 28798 14925 14302 -64856 -84456 9019 58729 25072 47653
21635 47653 48879 -35316 -84962 -34965 -205630 -309106 -253442 -156082 -79325 -69429 6530 55831
21623 55831 69981 122635 81909 -102377 -28363 45935 25157 16198 -73957 -65659 -108183 -96096
21611 -96096 -55221 47602 104502 115929 45909 63569 -3455 -98898 -88034 14726 11434
21600 11434 17286 43613 -15047 -29894 148953 313731 326932 255075 222435 192277 168449
21589 168449 93151 -71700 -168821 -138466 -84491 -95777 -84807 15206 166059 226395 62635
21578 62635 -138361 -144056 10299 118285 62117 51353 -18330 -144527 -190770 -106257 88851
21567 88851 260135 249321 140168 53856 -47432 32006 -13480 -39847 -52883 -48234 -11116
21556 -11116 67475 84 -22231 95270 117414 74704 -113535 -114028 -113029 -36278 -58664 -18854
21544 -18854 32166 -3112 2705 -12923 -83825 34168 67055 -21566 -7264 43428 44455 -61613
21532 -61613 -107443 -120505 -129497 -240196 -265651 -256621 -214106 -200137 -162107 -55676 31106 17083
21520 17083 102367 20729 -50067 -21959 86443 101010 26402 -31952 19965 -74697 -200271
21509 -200271 -224955 -215186 -222963 -246554 -274080 -146348 -58446 -13534 -7395 -96022 -65747 -41984
21497 -41984 -77597 -109073 -74561 -58174 -68794 -187265 -182268 -180658 -104043 -89308 -137679 -84467
21485 -84467 -105543 -78385 -102556 -192852 -240918 -74532 -69056 24679 12165 -24266 -45597 -4406
21473 -4406 10535 58267 123299 106281 36152 61726 -55151 3754 -65975 -89961 -37840 -8517
21461 -8517 -26811 -23482 -94214 -118046 -67196 -69577 -50292 -23188 14415 5149 -28014 -149679
21449 -149679 -209725 -123803 -76239 -101157 -105088 -103293 -75957 -19486 -42258 -11277 -13659 -48163
21437 -48163 -107314 -152822 -160620 -104743 31446 -42002 -91643 -74920 -106756 -110598 -32403 57357
21425 57357 79083 94490 -47752 -158339 -87777 5197 24839 -74845 -125333 -94787 -125821
21414 -125821 -72116 -21708 -78200 -60028 77692 99808 73059 53572 42937 -40736 -37114
21403 -37114 -44945 -67133 -64016 15023 -13070 -52833 17933 70086 37330 30848 16056 -127228
21391 -127228 -236328 -155851 -157492 -162928 -91173 31126 -33223 22909 39430 151635 34047
21380 34047 -88274 -51428 -33790 -79673 -102166 -37156 -11218 -78535 -67322 -146249 -134055
21369 -134055 -50335 -104313 -180718 -175284 -147813 -128181 9601 104488 131105 43866 -26759
21358 -26759 -2996 137304 162919 42102 14543 13788 -13906 -56197 -115421 -99073 -41707 48529
21346 48529 55440 58091 79363 7273 -65779 -96173 -58862 10780 46446 -6212 -67244 -124936
21334 -124936 -115683 -55992 -56548 -124421 -136781 -70217 -13967 -11350 23709 89591 141441 88435
21322 88435 10838 -14837 -69360 -24818 -91336 -180346 -127032 -19236 39616 43149 3129 -4067
21310 -4067 44493 157146 156974 49485 24264 72813 76323 24076 41052 123219 97282 36515
21298 36515 -7024 24083 106691 129430 16224 -19656 128161 174112 146205 59554 -87221
21287 -87221 -112184 -15134 -56371 -27746 -42288 -33100 -36551 75537 25028 -62574 -167550 -87150
21275 -87150 -91317 -100503 -92145 4517 113596 151932 114364 49670 47001 -60094 -74561 -146286
21263 -146286 -165410 -35698 50651 -56628 -109708 -195211 -141556 -3809 -47725 -21798 -40251
21252 -40251 -19869 32784 -70917 -97185 -64455 -122201 -123318 12161 28123 19353 45653 21919
21240 21919 -11945 -38862 -113407 -108439 -28306 17288 35134 55753 156226 49834 -57681
21229 -57681 -13625 88730 -12074 50982 25045 -35770 260 112078 116100 129916 234389
21218 234389 258369 105266 110418 147223 32845 -73561 -72571 -57508 -135785 -161741 -212801
21207 -212801 -167477 -20113 26804 8642 40100 99874 98591 69754 150263 72440 7427
21196 7427 -11812 -50267 2243 71135 13420 -15375 -105426 -136160 7399 -55558 -137226 -102906
21184 -102906 -87281 -106394 -32190 -7133 -86732 -77620 -125331 -243469 -215379 -218692 -103493
21173 -103493 -1271 -63238 -101565 -37093 -120071 -98126 -112008 -70889 -127503 -40934 68022
21162 68022 128926 80109 -69487 -155755 -63500 92407 207556 209302 155698 211093 117453
21151 117453 72293 143392 140054 85000 36901 88857 95901 56609 83579 126163 81413 83909
21139 83909 34255 47033 86871 154255 40890 -101103 -149375 -132110 -155814 -152082 -110660
21128 -110660 -37472 -35629 1652 -37993 -88748 -118694 -116857 -44239 14365 102557 95615 95094
21116 95094 85521 51944 -65264 -41624 5241 63537 -32021 -133937 -49987 58629 80785
21105 80785 57344 1869 -41778 24433 -4986 -113458 -72131 -12411 -922 -20085 25659
21094 25659 119053 220111 150617 76453 64989 -16382 -59118 -40975 -90031 -169990 -173455 -79427
21082 -79427 11781 31321 71779 37705 114393 275255 261364 119266 -65888 -70443 72748
21071 72748 82372 4311 -3244 4812 -62684 -132346 -121504 -129210 -78596 -15288 8206 30882
21059 30882 -47699 -80343 -95709 -259831 -215462 -96195 -62263 -38863 7298 6599 -27077 -159958
21047 -159958 -133304 17046 54507 -69776 -174906 -215979 -142959 -111883 -94092 -190086 -83326
21036 -83326 -36439 -22776 -80747 -115193 -199774 -159687 -154520 -90790 -47984 -62108 -84704 -52728
21024 -52728 116299 289604 228515 87646 15855 -50082 -44994 -70015 -37835 77899 180143
21013 180143 196618 239735 223857 37444 -17194 -42237 -59376 26092 53511 -64001 -153886
21002 -153886 -51057 -18772 57683 64966 56646 142686 78322 26849 15806 91928 6725 87068
20990 87068 79271 1913 23571 -46163 -61624 -27010 -73224 -102977 -122250 -126266 -171051 -147495
20978 -147495 -35597 31974 91228 88618 122647 79243 10975 54685 11753 -108975 -99367
20967 -99367 -64510 19250 73074 54281 23337 105596 183536 112795 118161 52567 -8552 98252
20955 98252 98675 102602 111239 65564 48099 -31526 14970 50472 53672 -57158 -114037 -127700
20943 -127700 -178169 -267202 -242525 -104946 -125278 -156005 -117858 -138634 -89158 -100272 -158200
20932 -158200 -91230 -65045 -53530 -72331 -49600 56663 18657 -69405 42357 135860 169317
20921 169317 99833 25251 30923 31960 3825 73919 18178 -87261 -108314 -117151 -90101 84167
20909 84167 119828 79385 87259 82895 40750 35832 36135 -62539 -52603 -15490 -15569 14316 -44028
20896 -44028 -91695 -128916 -134370 -34381 -13541 -131814 -182025 -127233 -52873 6228 100000 130520
20884 130520 43516 -44099 -26139 131808 165171 100578 72703 141297 40437 -73099 -74900
20873 -74900 -57762 -94710 -11313 8274 -33968 69260 144049 139682 -45001 -115291 -49731
20862 -49731 -50092 45923 20766 -53149 -8806 10254 -29126 -48311 -36254 -41214 16808 110857
20850 110857 56045 23997 39835 -62901 21140 104564 91587 120033 87532 29699 92914
20839 92914 101368 88910 51702 -10269 69581 110279 6065 8824 61220 63442 623 -51514
20827 -51514 -64484 -70951 8826 17718 -1305 -7059 -55808 -94970 -110030 -90924 -94796 -129693
20815 -129693 -38940 -33525 -21862 -36013 -63454 -73386 32356 20617 -6199 -48960 -42883 -105765
20803 -105765 -161261 -100341 -112598 -50325 11161 -69940 -185699 -190631 -120887 -86505 -37265
20792 -37265 9164 -11271 -55228 -69388 -50016 -30188 -27354 32009 -44462 19026 63596 90682
20780 90682 106240 74201 87198 -40129 -39417 -10891 28855 109369 194891 69868 -101541
20769 -101541 -65801 -68178 -116337 -106697 -128243 -88992 -34044 62666 83084 30833 98764 127846
20757 127846 118510 36588 58212 154494 56883 -76175 -101998 -100229 -87017 -17164 448 88595
20745 88595 47813 -79809 -171171 -81301 -103671 -41276 33521 99647 125412 66577 18477
20734 18477 -78637 -56115 -106124 -28096 -19594 108639 250276 114412 91308 96965 78413
20723 78413 106574 172665 252227 269487 209016 118054 104490 -11138 -130911 -263136 -175396
20712 -175396 -34881 9680 -184437 -273538 -183664 -99725 -52219 -98084 -161721 -140138 -150915
20701 -150915 -46989 -38575 -23078 -29172 68944 96525 24093 -16483 -97372 -134408 -202576 -194246
20689 -194246 -97968 35919 -11139 -63755 -80583 -112128 -63155 -62514 -95586 -72635 80095
20678 80095 204161 121366 161715 128371 108338 26263 -26302 -28475 -42890 -83509 -49989 -118296
20666 -118296 -211619 -228639 -92296 -108477 -226811 -174829 -108993 -23304 -137132 -228055 -91555
20655 -91555 -17800 -55727 -45489 31338 28391 -108692 -252689 -145713 -56476 -142611 -82609
20644 -82609 -10720 -27147 -118533 -175169 -205112 -185314 -163395 -167816 -186745 -118447 -53863 -49016
20632 -49016 -27217 58277 35531 -58992 -150206 -116060 -89002 -59791 12619 26168 -12569 -64074
20620 -64074 -42231 -67164 -32690 87659 129289 57567 -2632 28376 28359 93093 27752 -62763
20608 -62763 -68797 -65787 35734 181726 192067 127134 140768 166528 155834 194830 172353 84668
20596 84668 89879 157859 184798 125512 -9861 -16743 14045 49105 62963 -23576 -136132 -113789
20584 -113789 -136824 -114841 -153730 -118061 -100811 -202072 -322657 -411864 -308941 -160023 -8656
20573 -8656 66135 61708 40518 23012 -24552 -60622 -80915 -51146 -11403 47193 -28273 -103990
20561 -103990 -65121 -41657 -99960 -173607 -224790 -203455 -77156 -9451 23201 16163 -110109
20550 -110109 -114766 -34936 -24722 -147179 -241345 -177256 -114252 -39712 10934 -100037 -102936
20539 -102936 -28811 -57490 -134543 -97829 -40578 10244 -42530 -62459 -85948 -114042 -168107
20528 -168107 -46891 37401 60507 -36630 -110583 -88578 -142722 -118608 -68747 -100447 -158827
20517 -158827 -140522 -2510 -11221 -98551 -102409 -59404 -24003 12053 7515 2215 1288 -54735
20505 -54735 -53806 -23473 13692 -2436 -121970 -166286 -44489 64516 18856 18188 29401 -79134
20493 -79134 -72183 -32109 44908 220057 309266 193544 109094 229436 98044 -137458 -201942
20482 -201942 -108834 10847 63438 36951 -36052 -131644 -86485 18898 -72096 -161225 -156593
20471 -156593 -186857 -105936 -66996 -26466 -16268 -74146 -134159 -145586 -13779 100304 533
20460 533 -90987 -71440 -50163 41803 43145 28191 114883 197204 216127 190410 111758 -16489
20448 -16489 -55107 24949 103277 236331 303077 204943 107512 58716 2132 12609 27999
20437 27999 -79172 -82449 -83882 -3183 42049 49120 -22639 35884 133719 1577 31384 85751
20425 85751 80310 43014 32703 83687 54043 66490 99909 90864 -3364 19381 83954 138135
20413 138135 217189 111759 65048 84677 76074 -22606 -120701 -93843 -2029 -64166 -35921
20402 -35921 -16069 -97593 -174606 -114443 -54793 -69123 -160167 -132437 -77304 -84485 -11063 -42892
20390 -42892 -81343 -18661 -5496 -39250 -69281 -198781 -131745 -57640 -42813 -33481 -92963 -158042
20378 -158042 -155378 -147062 -53097 37132 108507 81107 50552 42436 29350 24897 73254 107022
20366 107022 122293 162153 185217 117557 12601 -173098 -214384 -213638 -170317 -34959 51077
20355 51077 -12913 -36439 -1583 -43894 24759 41843 29633 -16004 -12505 53316 43384 66289
20343 66289 65577 7431 -21792 -10414 -32470 -51600 -122929 -70466 -79959 -87939 -78413 -163227 -188363
20330 -188363 -141728 -249144 -258555 -233934 -179593 -89548 -10784 43637 37063 23674 -2402 54147
20318 54147 -31364 -121557 -84359 -6820 29355 64679 -78002 -215161 -236150 -202188 -100645
20307 -100645 -36208 -2053 -77395 -24953 -14470 -84797 -99279 2867 11352 17519 -54838 -80322
20295 -80322 -81035 -143728 -142174 -87551 -107254 -180197 -185151 -231783 -150449 6086 67677 45043
20283 45043 -104726 -198743 -236333 -283430 -330571 -163805 -30397 -29764 -8917 -60667 -114688
20272 -114688 -223864 -223855 -94693 -163700 -203079 -273299 -182506 -5042 66890 72988 45316 1194
20260 1194 -60918 -82299 116962 134740 -11468 -76225 27918 174039 42573 9402 -7347
20249 -7347 -48938 -29580 -7088 114377 28382 -61543 -52969 12190 -5094 18466 -56382 -29238
20237 -29238 5990 110579 142128 57566 47872 -57263 -62900 -113093 -68475 -121354 -67632 -42368
20225 -42368 10277 4587 -61561 -127522 -172923 -144900 -37046 -4934 13788 10634 3982 -29925
20213 -29925 80988 81063 8613 70506 22430 -47253 1270 44987 67257 -1182 -12026 45346
20201 45346 103094 69070 9215 74812 123609 100719 92514 63194 -93848 -134164 -20217
20190 -20217 -41634 8040 -22016 -58452 -28922 1667 -1246 126167 107245 35560 60931 79497
20178 79497 6185 -1043 -31926 -81113 -91758 -133718 -152617 -65903 50897 163706 211149
20167 211149 117519 -17728 -23203 -106817 -191614 -204246 -126122 -9876 247453 309017 246739
20156 246739 229657 282328 238626 97260 -37636 -3274 90610 83070 59749 26151 43796
20145 43796 77374 111560 106974 117128 90452 -6828 -137524 -198748 -104058 -72862 -60237 19554
20133 19554 70424 97977 121392 84935 7032 -21530 -39627 -40473 -129167 -120221 -154140 -188372
20121 -188372 -225937 -181729 -216780 -156229 -95033 -39065 -114096 -81139 -95720 -98968 -70226 -10241
20109 -10241 -14767 -42991 -1249 -46972 -71573 -15032 50101 29604 -48764 -45538 -31722 -18071
20097 -18071 49750 17036 -2373 9786 -47033 -177475 -175203 -120166 6729 2109 40115 23467
20085 23467 33678 75579 84945 28076 53485 113299 64809 58430 48555 -18844 1240 -98391
20073 -98391 -110837 -8881 12518 -45861 6717 50538 -61975 -115449 -185772 -141658 43416
20062 43416 217248 254884 204669 150774 35775 20765 133255 52677 -98633 -195639 -257974
20051 -257974 -214031 -175735 -141207 13867 41604 -68209 -117103 -135361 -139110 -102256 -50623
20040 -50623 -61487 -24478 60972 107773 133274 56666 -41628 -86889 -42542 8044 52244 74803
20028 74803 98730 106244 68150 56419 29738 -23084 -44861 18695 -111222 -244055 -163725
20017 -163725 -12716 88396 20577 2218 66489 12910 -37806 -72377 -100660 -137892 -74271
20006 -74271 -13571 63935 87023 253 -10513 -55997 30683 27854 -17375 30317 13424 98095
19994 98095 116833 59877 108 18856 -64421 -99952 -71340 -16150 -14282 -106957 -130816 -48986
19982 -48986 27439 38451 -44131 -109272 -101673 -70115 13077 6298 -56650 -110335 -209185 -171123
19970 -171123 -119932 16352 76326 55751 79572 187895 117062 -34247 -128996 -118247 -189555
19959 -189555 -19923 35454 -39849 -123673 -68307 -127830 -184107 -80733 -84876 -81264 -17618
19948 -17618 -1596 64588 4685 21708 6899 -5480 2617 25442 -77323 -93973 -65005 -78822
19936 -78822 -19374 -18300 17463 19996 -77750 52784 147781 129676 118031 149316 199379 101572
19924 101572 32287 41440 86789 11337 57700 71621 110250 198933 157044 28800 45028
19913 45028 66544 97985 33469 -153649 -152562 -192377 -142811 -214929 -250055 -231096 -205002 -96904
19901 -96904 -173645 -246759 -188477 -164846 -196743 -182940 -41850 58604 89920 26511 -97016
19890 -97016 -194629 -154394 -142989 -74716 -14466 34727 -13451 -7770 -49400 -14798 -99633 -150310
19878 -150310 -169694 -54659 -49806 -129681 -139790 -201620 -103982 70794 139909 126830 54143
19867 54143 -41163 -9437 86169 175939 49441 28654 8662 39770 24465 -20000 37776
19856 37776 42387 -63662 -62827 -32736 -53934 -41504 2119 -37083 -58058 1803 -3905 -23572
19844 -23572 -13366 4112 -93005 -83857 -6724 -104621 -156371 -180893 -52339 72779 30488
19833 30488 -96451 -229760 -229658 -69283 -39575 814 -76608 -90296 53459 86518 16214
19822 16214 22675 -37868 -51820 -106461 -88982 -28456 86967 -39298 -17740 29167 32099 87453
19810 87453 94211 -7021 4222 89447 57066 -9390 -87479 -86255 -94460 -167272 -194481 -143711
19798 -143711 -4959 -35900 2195 41066 59239 -32202 -110982 -167479 4634 56008 84540
19787 84540 45037 45556 -58879 -16736 85962 102220 66859 29197 -16826 -5940 -23440 -77719
19775 -77719 -93754 -132972 -159207 -64934 37288 -36531 -136594 -162637 -201686 -105410 27281
19764 27281 60602 -3999 -88760 -98665 -77276 -115066 -51938 -47973 -67806 -139702 -169915 -224420
19752 -224420 -68838 78788 171206 110581 -126523 -235861 -154094 -180531 -202817 -176051 -47720
19741 -47720 -25085 -40532 14064 -53332 -132939 -125073 -71040 -20042 -44892 36237 35798 6892
19729 6892 -42670 59626 91215 66670 44532 -43514 -25197 42308 35933 64460 22798 19279
19717 19279 -31140 -178152 -289695 -181007 -115763 -34344 8922 -120053 -203552 -232427 -133614
19706 -133614 -86012 -102467 -102483 -25958 96437 -24925 -103133 -100913 -116799 -76037 -88257 -161259
19694 -161259 -164664 -114681 -51014 -88405 -153458 -60528 -24957 -1396 -21483 -144346 -290283
19683 -290283 -169453 -62523 -21499 -78916 -25435 68475 57227 -59567 -89177 59670 104401
19672 104401 90533 9766 50262 34209 -1382 -43165 -25039 -30324 17198 -24179 -4708 43052
19660 43052 -3689 12634 17275 -14712 -164589 -210370 -122578 16072 2932 -49558 -107855
19649 -107855 -62667 64893 75248 -20873 -160414 -145915 -117482 -50937 19484 17603 -34636
19638 -34636 92596 92018 62469 33757 38064 97974 27235 3594 -2017 -60779 -134536 -117225
19626 -117225 -83094 -38795 -26012 -38856 -106170 -81881 -126788 -189755 -196072 -209344 -99276
19615 -99276 50676 114993 115962 -6645 -45158 10771 36078 20911 12931 -52264 -29087 -18918
19603 -18918 509 79361 147262 71117 -147614 -137619 -88786 -45478 -38456 29445 103920 64057
19591 64057 91826 33976 -25649 -64682 -128899 -158621 -105330 -144054 -221832 -212974 -124348 -30788
19579 -30788 -101478 -99889 -109599 -62233 58813 111541 -47027 -167946 -188102 -190540 -81671
19568 -81671 -8118 5828 9402 -77887 -125198 -139311 -61776 8896 38003 -59519 -86115 -99077
19556 -99077 -178939 -222433 -115716 -54197 -175864 -227213 -143226 -22267 7358 46551 -104056
19545 -104056 -229600 -194471 -122660 -95720 -63829 -102926 -189751 -108669 6838 -36067 -58731
19534 -58731 33248 88951 126588 200261 204381 186469 52753 -62943 32420 8149 -3649
19523 -3649 98681 63099 -27210 -131744 -87414 12698 18557 -17496 -57511 -53951 20932 60758
19511 60758 48604 31016 -30911 -217750 -260268 -200555 -183559 -113650 -22459 -23566 -20287 -30246
19499 -30246 -73260 -73115 16859 16078 -47261 -214398 -345137 -381614 -278846 -220872 -123467 -10133
19487 -10133 -41298 -131094 -126347 -77394 -66039 -130384 -65119 19525 25345 82139 88529 -54215
19475 -54215 -59013 -16161 43256 46702 21864 84351 89201 -61584 -165479 -222158 -176810 -23246
19463 -23246 5838 -69054 -107521 -93802 55069 118881 65142 -35366 19444 72892 55960
19452 55960 38488 -86362 -40662 -10974 9804 26437 -116769 -193660 -119735 -42927 -220984
19441 -220984 -210891 -82899 -211279 -233413 -108279 -25943 -87704 -112470 -96117 -166150 -338103
19430 -338103 -305793 -163734 -77044 -54119 -105168 -16520 12585 -58308 -10006 -93293 -144379
19419 -144379 -111321 -98209 -148170 -183344 -112240 -89198 -104943 -61556 -29624 -95199 -118806
19408 -118806 -130383 -157220 -59189 -6470 -30289 -125586 -13801 79899 37254 53122 28153
19397 28153 -63472 1406 163713 89187 26681 133910 226642 312929 246404 152426 47656
19386 47656 -574 45633 83450 121703 165314 185410 247351 208353 143176 127619 90668 55530
19374 55530 -38916 -81495 -43137 13756 54553 -83872 -159109 -137080 -80806 -81508 -133607 -136867
19362 -136867 -58329 24730 56820 47703 68779 101584 128767 202405 83163 -66040 -220769
19351 -220769 -104757 -41341 -22333 -1837 -161630 -246773 -257025 -204527 -105150 -49227 -43536
19340 -43536 -105424 7158 1185 98662 41789 -96000 -112946 -94693 -76839 -18831 -54363
19329 -54363 -48385 -64334 -39295 89924 144410 67244 81262 200618 140627 13785 -81171
19318 -81171 -1252 -43173 -141775 -142452 -48430 -30941 -63197 -84111 -98107 -45369 -105032 -149347
19306 -149347 -142089 -47885 39418 -43475 -78659 -102063 -86647 -178443 -117188 -5064 -25113
19295 -25113 -95871 -150499 -176798 -115703 -101848 -186479 -128422 -66536 -63018 -194477 -182847 -139219
19283 -139219 -94533 -50185 -120629 -124974 1535 -27698 -6460 89814 66670 23098 -48383
19272 -48383 -2885 164110 175814 120609 47369 96236 91311 48692 -45003 -118335 -9872
19261 -9872 19772 11703 -136762 -182193 -156686 -78330 -89944 -35993 -15093 -44227 -25659 -52235
19249 -52235 -79132 -65810 -187181 -147848 -162893 -215039 -291391 -194663 -204624 -163629 7094
19238 7094 39658 123357 124283 -41382 -761 123436 130925 65174 25039 -30423 -24631 50994
19226 50994 35589 84221 169865 174958 139318 53561 -16768 -8694 20075 -2001 -142079 -88849
19214 -88849 -26052 12602 115045 164206 108640 184471 177817 133592 156117 140581 114440 47538
19202 47538 -32177 -43382 -17726 -18071 18891 -944 -41350 -28864 -42989 -99270 -153236 -107665
19190 -107665 -73014 -206365 -288275 -196645 -205599 -239609 -202032 -139279 -136792 -202133 -178423 -20175
19178 -20175 14507 -62486 -59752 -59030 -93729 -55431 -74897 -146794 -52776 5658 -13645 -13615 -84924
19165 -84924 -71456 62900 57473 5946 -52816 -33431 25088 77727 92713 134538 79863 146475
19153 146475 206075 170045 15504 -27873 4427 -47683 95094 127018 57405 17955 -1929
19142 -1929 54167 116995 178552 126983 96939 49910 72292 118497 61861 65511 125868 191186
19130 191186 104401 -80097 -109828 -98659 -47535 -43854 -128811 -92338 -49632 -94023 -71456
19119 -71456 -119508 -61720 -69106 -74427 -93707 -181039 -254073 -237834 -74032 26905 974 19858
19107 19858 100247 82727 41955 76155 79517 14257 46926 49914 127813 37815 -17264 -36031
19095 -36031 -24896 56130 81760 55109 33387 14724 -4546 -25622 74861 41389 111550
19084 111550 74032 143941 258120 375632 449774 477831 371710 273695 105092 35007 79358
19073 79358 139703 197079 276192 177392 260334 353803 280234 227596 201294 138253 69334 26269
19061 26269 4668 -21489 100264 155686 110562 13363 -14598 12519 55338 21842 -111362
19050 -111362 -68134 19603 -37609 -154001 -197288 41246 129855 120242 23800 -14380 105304
19039 105304 122072 119605 125983 124312 76397 138599 250524 238273 250197 341953 279233 254953
19027 254953 253687 198279 155647 96559 114070 141431 175701 209200 329602 346533 305214
19016 305214 175913 45898 155152 179640 56493 16133 -19013 -2076 28681 -92429
19006 -92429 -97945 -104004 -62685 -131134 -264430 -269188 -173066 -138987 -123717 -82363 -82163 -115072
18994 -115072 -103109 -47866 1883 -35217 -84429 -67916 -17053 -11835 -32752 -23581 -13528 20915
18982 20915 -74112 -87905 12451 154127 268247 240593 264499 339007 150898 -46472 -4648
18971 -4648 116712 112576 -67221 51523 90366 3680 -9288 -97591 -133957 -41306 -4857
18960 -4857 24052 123572 47038 30166 -33621 -19019 -15410 31355 -20675 -24582 59523 70607
18948 70607 25024 24772 -43695 -78387 -34562 84993 134472 118028 62363 -10002 -148956 -155097
18936 -155097 -119988 -26890 10047 1211 28796 51817 170595 278700 236981 67670 -66932
18925 -66932 7136 113691 130741 44861 -91501 -105281 -46398 17551 -116954 -243188 -225660
18914 -225660 -152694 -24201 -41498 -145099 -205483 -103886 -92230 -168572 -219538 -146702 -119132
18903 -119132 -126949 -93939 -34866 15676 93836 31789 -50256 -43586 29553 92531 -26111 -103488
18891 -103488 -50742 16923 26717 -13171 -9979 46855 61842 37062 -25043 -56932 -24759 101963
18879 101963 68270 -49611 -123586 -83722 -31143 -58166 -105973 22303 142661 108418 153026
18868 153026 27995 -70417 -150485 -172734 -178918 -111065 -93164 -73466 -110531 -257093 -291217
18857 -291217 -174505 -22349 64551 -39211 -71352 -16085 85083 54887 -79094 -168903
18847 -168903 -142834 -125441 -211195 -318797 -205660 -172470 -150981 -125621 -125671 -87169 -125976 -36895
18835 -36895 43548 21821 36711 -45764 -56572 -67843 -61055 3575 81603 -30244 -5179 -129342
18823 -129342 -202756 -170295 -47327 -46123 -62827 -108420 -24633 6334 -49364 -66993 23709
18812 23709 41502 27919 -3510 71494 83516 39617 -34314 -69097 -54005 -30878 23931 63232
18800 63232 46794 -22165 -43818 -1106 -37132 -13671 -29027 -46718 -43450 -62821 -43392 41602
18788 41602 21661 -635 -32393 -150791 -200523 -238390 -178627 -131205 -66478 -55088 15568
18777 15568 26043 -44545 -4340 48505 173134 132582 74245 161315 246584 690797 1134668
18766 1134668 1314423 973109 484547 170587 49068 43133 30063 36464 -29946 -89033 -72146
18755 -72146 -59978 -15900 60028 21369 45855 -23265 -67695 -137836 -248906 -162659 -82448
18744 -82448 -1201 32600 -27921 -42952 -78637 -107123 -75489 -7227 51483 56589 79230 70507
18732 70507 83271 74375 57108 -158289 -198392 -101093 -104689 -17689 27489 -70732 -124587 -124688
18720 -124688 -30414 153778 209721 258152 454178 562603 497303 399937 338593 393163 485184
18709 485184 456261 413763 450253 559185 681641 704138 639961 598743 506575 370682 273188
18698 273188 149219 -6361 -5307 -5725 38977 90407 108426 39603 18650 44373 -20022 -65173
18686 -65173 -22021 134032 105114 107415 13801 -10594 -20908 45602 177766 75133 38941
18675 38941 14944 89279 142334 234010 300573 365763 355799 327651 390649 344279 424955 453674
18663 453674 360466 384577 384964 460225 553905 593239 641741 678411 585982 558844 552656 452724
18651 452724 330704 236331 330623 427250 386909 271279 183261 193699 105267 128007 94287
18640 94287 -1793 44325 129713 155366 141624 109863 16434 -64743 32929 30727 102150 22299
18628 22299 101229 139208 134411 150367 112143 155978 40166 -16656 32678 -59354 -19566 -26314
18616 -26314 60906 127221 49110 -41828 -139926 -126579 -3425 134771 216093 215155 238217 180455
18604 180455 230562 375673 441405 486587 560212 569113 601989 566187 516969 499543 509003 503141
18592 503141 536826 545524 497576 560066 581928 546714 602663 597553 502656 507885 538968 552788
18580 552788 445223 414555 282108 225243 268043 202479 142283 170012 258529 190293 210406
18569 210406 168080 203361 219960 162208 -48168 -174685 -126173 -42361 130527 266295 212774
18558 212774 76234 49231 80328 93714 -55052 -30776 275574 424379 492441 476952 464377
18547 464377 456042 402372 471144 571768 429353 453386 392835 399096 384800 399041 413240
18536 413240 386199 321768 260908 195229 262732 234934 278300 282596 263805 133962 35107
18525 35107 41180 142413 90401 -5849 -335 5152 -4632 -9616 -23662 6268 132302 194263
18513 194263 210494 189882 154490 158864 147977 122462 193929 280700 396989 400169 297398
18502 297398 251249 185198 117848 -40028 -56249 -60966 -9737 90102 166407 202310 217851
18491 217851 224167 236731 253417 74876 -2938 19807 23065 34527 -26610 -51947 110771
18480 110771 205379 252870 257062 215205 280582 235534 232411 163828 158071 200731 216856 137168
18468 137168 93985 26813 34986 65542 63398 207716 206852 149796 91553 30908 38688 21174
18456 21174 103011 178472 138896 84962 39366 148911 187731 153173 52312 86113 76539
18445 76539 88408 127962 170092 229003 195379 179868 148445 102648 159340 241916 230799 181245
18433 181245 151653 123071 101717 41105 93911 170783 338039 326333 282516 160358 107986
18422 107986 138922 98611 63535 78299 164839 128934 107693 191245 232572 280193 173711
18411 173711 74739 142033 189583 282163 303473 356837 368765 217760 160757 91662 33675
18400 33675 -107072 -165566 -15217 30806 22309 43347 69566 120040 156789 148018 97817 119499
18388 119499 200604 167742 214325 240477 255903 266147 199135 82081 -56499 33175 213792
18377 213792 236684 330125 241469 45561 -2061 34483 132745 215310 214281 138083 45262
18366 45262 -15696 95797 158519 184920 221210 122828 180706 177585 156500 121786 190888 235264
18354 235264 228804 123480 53566 61398 -31200 -125379 -30985 37836 121902 62974 43986 43650
18342 43650 85260 5336 16761 20709 12095 15062 -27414 -7122 53781 46128 -57084 -5895
18330 -5895 92557 -13478 33339 265082 296970 298065 380326 296168 118243 188438 252191
18319 252191 272314 340042 366891 372873 329850 320479 360355 356455 309853 309103 249363 96485
18307 96485 77187 102825 150447 131753 225985 380094 393166 253691 52289 130242 249042
18296 249042 316256 393297 392261 447491 491621 433033 255444 171268 238431 321611 397731
18285 397731 425394 494759 427425 486984 566931 466195 528503 623873 519407 460758 457289
18274 457289 479206 340445 353993 501647 575412 523170 423510 374186 389323 503466 580059
18263 580059 513147 484514 477017 481137 569132 660211 798507 936274 992548 1101482 1195298
18252 1195298 1252496 1440662 1578090 1702380 1890119 2048679 2116489 2168722 2273051 2347704
18242 2347704 2462798 2501659 2643959 2916388 3270089 3574901 3891444 4187653 4507075 4953595
18232 4953595 5327097 5947398 6986645 8568188 11198794 15361018 21631265 29984223
18224 29984223 38584644 47229641 57481901 67259405 72636397 74529614 75592548 72376740
18216 72376740 66976896 65036641 67278746 70028165 72294526 78075925 87155751 93259871
18208 93259871 92578518 90223714 84439829 72909830 60630875 50398216 40329477 30246440
18200 30246440 22770221 17918185 14831903 12736013 11343082 10508890 9992626 9661240
18192 9661240 9433812 9201264 9052959 9039919 9082605 9200019 9394449 9882826 10763604 12133728
18182 12133728 14289572 17844342 23477102 31600220 41185809 50662771 61445797 73766524
18174 73766524 82798508 86044159 88412885 88965151 83694562 78723005 79165860 82917132
18166 82917132 85679399 89721573 98920683 109398602 112934638 110506444 107512908 98109279
18158 98109279 83076798 69185579 57984107 46697883 37126571 32120315 31582920 35091636
18150 35091636 41943474 49604354 56412290 60553107 57396432 49831067 41811001 33972039
18142 33972039 28561201 26655369 28217084 32679884 38646587 43996346 48053271 47651292
18134 47651292 41923821 35093388 27919759 21490827 17120016 14412865 12574780 11350268
18126 11350268 10610806 10335856 10145790 9803491 9467541 9379261 9628116 10315182 11428396
18117 11428396 13077674 15301621 18430593 22986363 30310483 42824637 66526086 112120443
18109 112120443 188899863 258235108 217492170 130725824 85135433 69174502 68003618
18102 68003618 74622255 84159519 95275902 103808524 106109441 105396119 102869046 97028146
18094 97028146 86864422 77403758 71149302 68456041 69817514 74397995 80651164 84164019
18086 84164019 84474545 83264651 79421752 70053282 57691828 46204463 35364259 26519473
18078 26519473 20642309 16787333 14178665 12272844 10720344 9603317 8805470 8270202
18070 8270202 7978749 7628470 7330084 7072062 6903371 6896536 6755834 6682508 6763204 6894230
18060 6894230 7170976 7518962 8115832 9052581 10523890 12779534 16253951 21862356 30718355
18051 30718355 42981198 56454781 68276593 76992087 76323596 67173870 56554494 45511376
18043 45511376 36917979 33032184 33971105 39355641 47556331 55668425 62478070 64420760
18035 64420760 57914955 48016742 37262885 26886079 19322048 14449727 11272773 9087641
18027 9087641 7492457 6342430 5492498 4988347 4440552 3930501 3565528 3235659 3014885
18018 3014885 2769693 2460668 2282600 2192425 1920931 1828478 1815091 1811610 1762192 1775078 1812716
18007 1812716 1790319 1654196 1590399 1529396 1343692 1125942 1145641 1178648 1061819 1053084 1032549
17996 1032549 1075068 1144326 1160294 1022919 950546 991107 944757 931781 992126 962052 870839
17985 870839 812943 872148 936822 1005694 998778 977311 926479 890224 821391 651271 480349
17974 480349 509108 558699 632391 668146 593731 509091 509870 556057 521516 605660 574050 533669
17962 533669 579254 556970 429238 362935 384603 431721 467667 495973 440347 414884 417412
17951 417412 363400 325501 290264 294693 426254 491661 330061 132195 59345 161988 325230
17940 325230 448071 390639 255668 213772 273676 377833 425432 398992 328252 326427 341366
17929 341366 408570 304602 233911 310258 349756 430051 526561 662214 637563 564540 513675
17918 513675 455866 509092 522185 395160 378291 387413 331875 252763 242034 316837 293430
17907 293430 293305 257277 201775 220337 191790 181005 201179 179593 278050 369692 310787 151973
17895 151973 62931 128831 149596 220790 219857 265946 249568 309733 295976 322781 300167 241362
17883 241362 186442 167784 155810 187245 183723 125654 199357 300954 241302 208601 220648
17872 220648 193752 153034 236341 247225 196254 162028 207599 226964 266804 346759 260109
17861 260109 263582 222500 222464 278932 280527 56433 16380 75347 75591 148156 148986 110892 7052
17848 7052 -5368 50714 137064 137506 151537 138201 130824 187834 201249 136386 113124 24595
17836 24595 72670 56395 29523 59664 59541 117277 64749 169534 201296 165762 206913 192794
17824 192794 130596 177509 345688 408770 408986 283082 210264 246492 192702 151169 182425
17813 182425 106770 203931 361634 291354 280557 278436 216696 269483 244030 174544 76055
17802 76055 45538 49254 43652 47891 104007 98803 168940 286342 255386 233864 260210 356179
17790 356179 250285 169197 140836 104723 134533 201124 204520 287113 314649 313239 332225 407573
17778 407573 286810 289216 280244 160743 187878 183295 234520 336177 283566 325038 354587
17767 354587 164500 37210 117181 295611 336209 341386 267063 209157 313270 385452 321203
17756 321203 176738 144245 126006 7736 124993 346838 402593 414877 381274 407868 393895
17745 393895 437162 454457 459429 376578 348242 398831 468865 629447 670166 535455 432097
17734 432097 375555 368090 345056 369009 433780 501838 445713 456988 481404 613907 696427
17723 696427 739053 799100 839614 916830 868341 730367 730027 778935 709695 742037 792449 826438
17711 826438 881563 979150 948518 901960 1017604 1013016 996375 909377 858025 918824 1026652
17700 1026652 995750 1073625 1218197 1423350 1599749 1643461 1622621 1691822 1852751 2038983
17690 2038983 2042309 1959880 2050105 2149055 2250634 2471468 2799555 3005933 3268274 3652565
17680 3652565 4011980 4623003 5487299 6547812 7717488 9426316 12005668 16098092 22564116
17671 22564116 32656062 47107335 63409276 76561663 80478052 75218218 68963263
17664 68963263 68019511 75048460 85621959 92200757 87129301 71198092 52428845 36480054
17656 36480054 25988261 19571841 15647860 12990547 10985702 9637874 8783282 8049890
17648 8049890 7679600 7421357 7201458 7050613 6772012 6477348 6305590 6249358 6337617 6480256
17638 6480256 6740729 6929997 7130007 7278696 7276235 7323109 7927992 8986446 10363564 12276887
17628 12276887 15161620 19343922 26016147 36645372 53134585 75881162 101057915
17621 101057915 121283665 128538449 122482045 113307908 111718186 121627874 137104666 146208556
17613 146208556 137763704 113371221 84073020 58797375 41390231 30728427 23934990
17606 23934990 19400724 16225583 13997166 12589266 11335921 10109162 9084388 8406493
17598 8406493 8040048 7740574 7403367 7027182 6710683 6544164 6601113 6576833 6710038 6775858
17588 6775858 6728312 6696432 6830810 7040637 7347149 7858973 8718905 10064765 12009726
17579 12009726 14880714 19358940 26225256 36585209 48623281 58627988 62289584 58679698
17571 58679698 53648378 52014658 56313031 63960400 69937025 69030835 60862645 51497758
17563 51497758 45442569 45451728 52103272 63959773 79583299 96775572 112309110 125315972
17555 125315972 134274998 139007280 140647512 140413695 137607122 132673204 126714850 118630534
17547 118630534 107456561 93792012 78836005 63321577 49204300 37761423 29141573
17540 29141573 23191698 18971637 15956661 13897259 12344226 11183979 10270887 9441180
17532 9441180 8779664 8312961 7842422 7375396 6962517 6590348 6612026 6605107 6470754 6437568
17522 6437568 6496634 6418810 6491044 6746109 7052691 7384231 8106576 8968962 10245706 12109795
17512 12109795 14904840 19192243 25659911 35096709 47457726 62017535 76946665 90324410
17504 90324410 101605920 109699078 114160257 115933857 115880755 113041490 108916528 103858434
17496 103858434 96812736 87065029 75235921 62248137 48784401 36892631 27559084
17489 27559084 20938248 16576505 13579523 11473610 9837143 8550018 7600042 6882070
17481 6882070 6135693 5536192 5092813 4663368 4087992 3661188 3400665 3210362 3071476
17472 3071476 2833648 2613725 2325301 2250934 2107769 1922994 1694961 1541441 1445989 1384703
17462 1384703 1279002 1105189 1102687 1119247 1028363 953188 922426 864876 855883 929787 1023434
17451 1023434 869008 896998 1005222 980261 1100502 1170660 1168745 1169324 1268457 1716265 1741560
17440 1741560 1316026 1072772 857967 744798 634486 605764 662433 690534 607117 659739
17430 659739 582767 593772 648028 701170 789141 701057 642665 663802 724040 766124 735899
17419 735899 612965 634455 476315 373932 268328 253301 235588 153427 71558 158950 308195
17408 308195 434192 588037 517314 456085 520246 555863 503779 495100 480936 422545 291926
17397 291926 176569 195321 273449 194205 115966 154628 221647 258514 307750 328058 315525
17386 315525 298204 302031 272567 202825 136980 119224 237395 347199 299784 248493 315875
17375 315875 465381 551559 435342 453007 541311 547269 490421 370985 196888 195575 184616
17364 184616 197268 239286 319143 343376 386242 385990 295168 299971 232082 119709 123762 141088
17352 141088 155110 190936 181710 219742 234074 196458 162097 126807 109812 51355 -10146 -13620
17340 -13620 -32106 -42530 -52376 -115863 -83119 125042 183989 161797 242399 302841 236713 234976
17328 234976 197101 142507 246089 260382 104981 38195 25016 151971 174932 68216 136708
17317 136708 236978 158868 82690 52799 -52858 -36551 -63671 -55853 -13844 42795 51337
17306 51337 -26804 -113040 -201447 -136630 -24219 -49302 -87711 -99784 -24981 40931 166104
17295 166104 177919 120295 126689 193158 235410 174079 131481 109445 151574 243765 391315
17284 391315 349061 215413 275447 245108 211155 131650 134899 116425 60831 43669 63457
17273 63457 52673 175308 253644 270797 180131 93845 50817 -20785 -40662 -59100 -22538
17262 -22538 91312 232019 211350 152375 92686 104047 131853 52134 -4064 -38121 -11109
17251 -11109 57341 125662 173456 233934 151181 143673 88765 -16727 -101130 -87732 -5861 -19370
17239 -19370 25042 86335 40728 -72719 -88008 -66810 -119810 -89518 -69666 -124689 -56496
17228 -56496 -43604 -51371 -91366 -145722 -156207 -163606 -135097 -17571 19314 79847 86177 154401
17216 154401 153195 51423 62512 71727 11817 84517 15488 48814 57928 8853 16535 -49579
17204 -49579 -123144 -109704 -53702 23772 37285 -26860 42642 134438 113918 133505 76990 12378
17192 12378 -34864 -11055 -36089 -43759 -161847 -99422 -16615 -87841 -47390 -110313 -108105 -22899
17180 -22899 59399 166174 223108 170656 185181 137088 153906 131612 140991 200966 292507 260461
17168 260461 92604 -52360 65776 211303 161759 160722 117218 47992 133643 259609 289557
17157 289557 378898 403950 447396 445633 487235 358946 256900 361085 355894 320469 257588
17146 257588 234815 135528 41559 127108 -15118 -149263 -208305 -74954 -32830 -85878 -120833
17135 -120833 -40965 -8016 -14169 25385 85732 66617 54367 106187 136645 190441 204971 178395
17123 178395 146406 108718 89467 150490 102399 111321 77913 43684 52312 115216 124052 145745
17111 145745 324434 499826 657601 703261 674449 651179 636339 670993 921164 1015372 1036247
17100 1036247 907404 661784 551774 282166 146090 47584 69341 97592 74721 86835
17090 86835 66789 48471 90670 141202 216479 190277 161023 151015 173843 264766 298947 242139
17078 242139 97020 3487 73779 219683 213149 23399 -18719 -25222 19758 66514 123744
17067 123744 91999 150592 293875 327407 322502 463722 527631 557971 574412 696532 840902
17056 840902 916297 988740 951311 818015 822776 848745 887205 786064 717959 689521 534647
17045 534647 420866 326368 280103 233952 83627 86446 104653 125098 104234 70954 34383
17034 34383 33535 86215 201773 88907 29473 45935 15065 67609 35979 52494 111642 64362
17022 64362 29450 40681 85188 113956 114427 46478 77109 186604 257484 296179 227961 213812
17010 213812 269513 350084 500274 558649 492781 477995 496077 582711 514936 455961 519076
16999 519076 512436 603604 542428 461923 451955 493453 441150 232022 208206 239938 248225 186251
16987 186251 114351 145801 57541 -75621 -74585 -104616 -106047 -84311 39211 54820 10861
16976 10861 -43548 -112595 -59677 35438 -19732 -130514 -222441 -161977 -95298 -74932 -46920
16965 -46920 -100600 -176381 -70301 -11565 69390 151036 158638 142742 9578 22418 154339
16954 154339 216261 160877 116721 1322 -77885 -122327 -61213 -13667 -166653 -270337 -265096
16943 -265096 -100276 -26383 -87380 -75259 -152817 -93048 17463 128752 5638 -54262 -103027
16932 -103027 -116121 -70784 -148923 -105706 -19619 38819 -49654 -19686 -7243 48322 159164
16921 159164 128940 86604 127175 73393 -61307 -123222 -32520 54403 77767 70339 117120
16910 117120 77869 -19421 -23259 -22754 8780 78797 100568 66332 -21896 -46802 55021 10047
16898 10047 56319 25684 74958 103662 8259 -3112 -16607 75459 63416 -6482 129249
16887 129249 135271 22840 29120 -22129 -119663 -107678 -21202 42761 -32902 -66361 -120647 -175568
16875 -175568 -155587 52232 193534 134680 121900 32153 -54555 -157729 -169799 -99142 -46595
16864 -46595 -37026 8189 -98168 -86287 10514 3356 -109771 -159730 -156266 -101105 -73232 81109
16852 81109 47032 -28330 37413 -17230 -70829 -70482 -65442 28769 -45729 -102282 -78067 -20320
16840 -20320 -67763 -47784 -70794 -30490 31918 14850 24030 29602 105272 76857 -19759 -8618
16828 -8618 58970 12242 -84838 -36850 58589 129620 78331 25127 -6655 -22878 -130931 -160446
16816 -160446 -179527 -127168 -93054 -54900 25355 -160259 -236474 -63582 -22689 -87296 -64309
16805 -64309 66471 -50399 -195614 -96496 -69613 3025 38310 17866 -4426 -44859 -67922
16794 -67922 34248 80251 191602 213381 67243 -29899 -58383 -106277 -155223 -150186 -98545
16783 -98545 -135287 -49382 9479 -47244 -142136 -143842 -118270 -137228 -142378 -48561 24485 -67241
16771 -67241 -10422 -32816 7969 75742 14963 -32496 -2749 -87187 -159226 -188740 -55624
16760 -55624 128881 40626 -34925 -94268 -101632 -78853 -13345 -55960 9208 -24853 -1407 -7101
16748 -7101 -59595 -184830 -176649 -57734 -22202 -82782 -133943 -40402 -55718 -92050 -122235 -175721
16736 -175721 -134780 -79558 -211975 -296592 -197546 -53811 -1026 -133748 -143082 -34141 -47440
16725 -47440 -101995 -125034 -22711 -79904 -152941 -220420 -139177 -11065 33096 -77546 -168435
16714 -168435 -192138 -173556 -156552 -122034 -27478 -34411 -130880 -190624 -140551 -118604 -106281 -7467
16702 -7467 93931 42594 152974 87438 1725 -30456 -27700 -121796 -153507 -193999 -210317 -150886
16690 -150886 -33125 63881 143373 57295 71490 75617 118251 83445 33867 88341 72266
16679 72266 61989 -72456 -128187 -84034 -97277 -167040 -73921 -42473 -14845 47788 -5754
16668 -5754 -19950 23698 37134 74743 31690 12105 57690 137481 116459 38768 7034 -29824
16656 -29824 -29287 -24826 8486 34950 -89525 -93588 -92601 -162764 -246849 -271378 -257166 -175619 -208958
16643 -208958 -257971 -189443 -7814 15979 9035 33564 154260 67307 70687 133397 146968
16632 146968 -7806 -65105 -58180 -57673 -176835 -185057 -126529 36821 19871 -49495 -41218 38007
16620 38007 -50991 -95660 -73839 -60306 -9045 56668 45693 16542 70069 20926 -48713 -153714
16608 -153714 -218120 -160501 -175242 -106697 -27122 118865 82637 235 72768 132097 82345
16597 82345 128647 154367 -18950 35618 67862 -106215 -194373 -190585 -18889 19647 44203
16586 44203 -39141 -56781 -92331 -145618 -9589 54532 -30754 -94237 -67946 -99551 -135790
16575 -135790 -32993 75329 227771 256920 127686 -58688 -121904 -124233 -170642 -261454 -252812
16564 -252812 -175080 -84389 -122064 -194891 -180540 -132067 -107842 -98704 -65741 -31513 68620
16553 68620 101522 62892 -71305 -220312 -309825 -176296 -67490 59847 105125 97455 104570
16542 104570 222451 174203 78730 -14961 146510 155338 136982 -22912 -85284 -89052 -49235
16531 -49235 13143 38748 -37888 -133346 -93838 -60667 -61142 -87421 -42108 -3297 13260 -42308
16519 -42308 -9285 44211 28194 99446 100023 90599 117007 233351 177419 14324 -55557 -24339
16507 -24339 21110 61403 97296 72819 173949 187527 181797 144032 20728 10845 62391 -8595
16495 -8595 -70762 -90930 -46812 -57207 -43276 -64041 42726 114348 -31416 -88589 -73985
16484 -73985 -169522 -237439 -241302 -275303 -258914 -243496 -326988 -223365 -81755 -12551 43224
16473 43224 -101899 -191000 -163517 -220862 -161549 -148046 -106264 -109972 -7425 -3288 -18811 -55610
16461 -55610 117223 227163 87458 5442 35289 58863 73220 -42327 -134140 -215081 -113121
16450 -113121 -88920 -99349 -96590 -110841 -149854 -162954 1312 88266 78952 54199 76699 93179
16438 93179 128699 56794 43783 -113297 -183579 -72492 100600 71750 32098 -25092 -140072
16427 -140072 -131610 -42721 -27 48790 44974 78673 115012 54358 20207 43646 147580 72678
16415 72678 6519 57430 88367 -55536 -165052 -204841 -198703 -157225 -39028 2247 -44419
16404 -44419 -53519 -67593 -27230 -61375 -106310 -65680 -1839 -47278 -127469 25327 74559 -21184
16392 -21184 28884 61059 -22774 19969 91317 126602 101940 42920 -91680 -109931 -123346
16381 -123346 -103215 -61716 -952 -60894 -125372 -154490 -68872 9984 -36962 -96317 20948
16370 20948 -7415 -143929 -123845 -127298 -124339 -111126 -92412 -120204 -129567 -75972 -24361 19741
16358 19741 8996 -100386 -23945 42603 13567 -38984 -106044 -245779 -201906 -59621 -26387
16347 -26387 -134756 -191383 -145664 -119339 -119927 -58680 16980 -65968 -194626 -207111 -111713 -61934
16335 -61934 -52279 -83394 -119237 -115752 -201213 -202521 -162041 -175029 -145898 -209757 -113376 61515
16323 61515 -17838 -15611 155019 260140 127328 6876 -27203 7273 -40714 -98608 -147605
16312 -147605 -105425 -33668 83608 -7419 -85598 -112290 -204561 -248108 -153895 -88990 -54990
16301 -54990 2745 -16866 -127345 -67695 47744 6021 -95096 -132042 -103401 -77720 -57141
16290 -57141 -102295 -132259 -33815 -35877 -84847 -135577 -91258 -24930 41636 110316 113973 60715
16278 60715 91415 125385 149107 90598 114199 159860 217643 64113 -35763 -58544 31928
16267 31928 86905 135020 146079 159482 105505 90883 4832 -43914 -81013 -187461 -200660
16256 -200660 -140785 -35672 -36046 -33729 -11772 -175213 -121979 -23026 29222 40970 -31160 -171887
16244 -171887 -232881 -146911 -41068 -36 -49342 -25082 7261 -67344 -78836 4796 11554
16233 11554 -10294 -104557 -115409 -182988 -206605 -237465 -279773 -400406 -417446 -339853 -200798
16222 -200798 -105716 -169981 -114437 -100014 -80743 -66505 -24003 -59952 -100459 -33366 74731
16211 74731 -18327 -102844 -180722 -224106 -165996 -156053 -217150 -203996 -188424 -208998 -147401 -174074
16199 -174074 -162527 -69892 52437 -73014 -81131 -56837 -85223 -52096 -38938 21316 -12266
16188 -12266 8622 -64812 -239795 -173817 -82850 -91686 -58674 -183799 -118771 -61748 -29790
16177 -29790 -54189 -48897 -52663 -91904 -90127 -179035 -248919 -263352 -223242 -217469 -208461 -199407 -199274
16164 -199274 -144743 -112657 -31558 33414 4387 5373 -130307 -175632 -72536 -37634 -54409
16153 -54409 -76417 -131518 -149865 -197667 -286008 -217985 -55434 107369 120526 51840 56062
16142 56062 85725 95010 31678 -22348 19234 46445 28761 -4137 -11048 -881 37582 -27706
16130 -27706 -162505 -284841 -215152 -91585 2294 -48165 -158030 -130168 -49130 51106 93534
16119 93534 35394 -37525 -81981 -74157 -14269 -56132 -80795 -100407 -137975 -60862 -67820 -147365
16107 -147365 -122202 -153532 -144935 -117525 -193737 -257134 -178237 -158788 -322638 -300344 -148130
16096 -148130 -57425 -1477 -79905 -76286 44097 109964 64832 -10337 -22504 21879 80143
16085 80143 1945 -58356 22977 126567 138107 164388 108175 106607 26844 -153229 -63355
16074 -63355 36818 -23114 -82740 -135947 -99314 -86473 -81028 -130860 -222789 -222805 -191642 -85734
16062 -85734 -55557 -45434 -59564 -97605 -50229 46521 57709 61530 92143 77565 -34013 -88862
16050 -88862 -54710 -90573 -120578 -183332 -235671 -202664 -20597 -15346 -152313 -165987 -86186
16039 -86186 -26277 -59041 -19883 47051 48706 16442 -88531 -75467 -118759 -45413 -61076 -126753
16027 -126753 -118738 -173459 -132509 29781 83575 56324 48954 70638 38486 21094 96002 68774
16015 68774 14369 -74163 -159894 -138875 -104504 -61629 74110 127426 37864 30779 -75862
16004 -75862 -30887 -8607 -107895 -50050 35323 -5672 -82487 -64734 -171227 -125041 -68652
15993 -68652 -117171 -219578 -121182 -90150 -140529 -228022 -85815 5887 51656 -44513 -23106
15982 -23106 33639 14592 -3307 3996 57880 84779 42544 6711 -2463 -52397 -238638 -201970
15970 -201970 -155765 -139634 -188825 -129227 -73500 -64148 -54847 -76831 -134993 -101531 -120670 -151598
15958 -151598 -164322 -32834 -17100 -123924 -49287 -168875 -323348 -303866 -223872 -103457
15948 -103457 -145150 -232928 -158700 -97013 -117435 -48020 10629 -27258 -130546 -74293 -20671
15937 -20671 -90593 -88337 7199 -70600 -76631 60464 161843 -30832 -96688 -29741 31842
15926 31842 -64557 -101271 -84342 -59206 -71451 6194 35118 -6646 -28110 17789 124896
15915 124896 72302 60085 110034 15770 -58725 -67175 -162879 -124465 -63572 -23756 -55913 -132547
15903 -132547 -145734 -66329 -19696 12425 -7564 47870 94152 72765 -61153 78727 132040
15892 132040 58237 33378 -18132 -37204 -76191 -107461 -105268 32508 38991 -4591 -82095 -52078
15880 -52078 28308 34355 -28585 2647 -33576 -98870 -65302 -11824 23788 143966 96026 115395
15868 115395 139883 26090 -34336 -103563 -73410 37165 35509 -22721 15607 -11624 45219
15857 45219 119337 87823 68135 65154 -13379 -73450 -53947 -38532 -54674 12721 -20831 -28267
15845 -28267 -125183 -98097 54821 101012 62702 -8321 -69763 -102439 -165186 -221206 -189907
15834 -189907 -172195 -191888 -123464 -113501 -73078 22156 -26005 -170779 -167168 -121788 -51573 -93570
15822 -93570 -78262 -47862 4558 61678 76131 61902 66129 119739 119367 44543 103946 97139
15810 97139 15228 8568 94990 150947 94730 90669 -70988 -50281 -29522 -55107 -104604 -122076
15798 -122076 -180203 -122353 -12757 -67754 -213234 -126564 39787 139739 164388 41463 30241
15787 30241 9910 -27401 -20328 -47692 96015 119493 10771 59823 4485 32355 42384
15776 42384 40201 -10312 -73369 -78258 -37857 -84557 -13183 -87859 -149725 -101966 -171075 -150323
15764 -150323 -27712 88337 27148 -97978 -91447 -33948 37417 40838 10099 -19524 128912
15753 128912 249634 190898 249423 220255 179661 254533 162900 108407 104161 82584 35019
15742 35019 -48625 -102073 -162793 -117574 -85018 -34201 -10074 -77960 -63432 -22398 28923 104626
15730 104626 138336 51384 43539 97297 87409 51035 20385 -86286 -155914 -197261 -165793 -82090
15718 -82090 -30046 -33639 -69934 79752 48857 28304 76455 111101 -43242 22790 41844
15707 41844 -42176 -111250 -44154 -20646 -62007 -47039 12272 100699 23635 -27195 -38968 3677
15695 3677 -4265 36407 -79091 -89420 -48247 37788 127184 103641 37757 85554 26774 -21834
15683 -21834 -43176 77578 66663 29212 20686 88033 73847 -2930 -39987 -138484 -157377 -140146
15671 -140146 3295 30627 57033 87917 67875 82788 36292 -39015 -143352 -85351 -63756
15660 -63756 -34122 71520 86602 20622 -109922 -160535 -146923 -52965 56757 52202 -93146
15649 -93146 -156821 -92000 -117675 -152607 -75347 -100092 -97257 -88577 -89469 -69823 -77792 20470 117995
15636 117995 141044 122403 153688 175201 25155 -18662 -22412 -5701 -69923 -98133 -43215
15625 -43215 -35338 -13603 5616 14159 -39597 -54271 -13051 30655 -32471 -157523 -250183 -162012
15613 -162012 -57066 16346 -27466 -85892 -137326 -4995 -27630 -14772 -12734 -80696 -156824
15602 -156824 -68929 5084 -75214 -93987 -141158 -135609 -126032 -84460 -20706 63949 43745 -8624
15590 -8624 -91308 -60803 -91680 -107763 -84574 -93397 -113516 -129440 -103510 -56282 -71694 -25810
15578 -25810 -57331 -101361 -71364 -43402 26625 31278 -31967 -98073 -155258 -87993 39479 -15869
15566 -15869 -37721 -103901 -235166 -191715 -88113 -131928 -124520 -115382 -175838 -170001 -135336 -155607
15554 -155607 -117537 -19191 26062 67417 61539 33519 -58855 -83968 -95542 -115067 -66025 31529
15542 31529 108045 132025 142409 161429 70731 73388 102733 100437 -65986 -56997 -76324 -41679
15530 -41679 -66011 -138031 -12945 84684 117476 91956 67599 -74777 -78463 52144 129197
15519 129197 190293 211361 191645 159081 79029 34926 70670 -4194 51723 78277 25699
15508 25699 -41193 -74592 -62134 50690 126531 66788 -23241 -118193 -101080 -20363 -53215
15497 -53215 -78184 37136 60425 25967 -105950 -220714 -233967 -230282 -124658 -75740 -129680
15486 -129680 -67096 44626 102770 -35693 -34059 35276 33750 34448 80316 16467 -109998 -81637
15474 -81637 -18253 118901 93912 35311 -8443 -83863 -16970 66308 60412 8207 29069 29437
15462 29437 -56153 -16897 37008 -46190 4459 18436 -73177 -10346 129827 121118 132365 216507
15450 216507 198612 102117 130607 85460 23318 30126 -22928 -16625 -50984 -67449 -48662 24335
15438 24335 -33111 -34836 23348 136875 179901 113246 85571 32859 -38845 -148559 -240256
15427 -240256 -191449 -104507 32569 120878 56842 -31094 39794 96969 -10377 -75938 -8062
15416 -8062 59566 -18407 -30993 -160013 -215553 -116311 -112497 19550 -8217 47055 53679 39613
15404 39613 2509 -35345 -73332 -31753 -127949 -108225 -121950 -43986 126340 68973 -103091
15393 -103091 -80759 -82335 7178 22545 55583 91790 130846 94340 99011 74423 34630 117331
15381 117331 39157 -3093 -20769 -86144 -75439 38920 80965 -68101 -247812 -197381 -66072
15370 -66072 -34661 -8250 -42149 -95714 -72380 -12182 -50380 1132 84055 188867 74815
15359 74815 -97927 -122078 -119560 2732 65185 -39042 -136722 -95222 -35747 -10432 -12432
15348 -12432 62743 82297 48903 23076 -19392 19614 52694 77610 39714 39449 31348 -39142
15336 -39142 -96741 -37777 72890 187562 229759 113043 13947 -133607 -67672 43662 -1637
15325 -1637 -33437 42044 -46123 328 41177 -32598 -42792 -42133 -728 11412 -96847 -70847
15313 -70847 -59504 -57287 -138938 -100939 -22071 -110734 -56876 -9841 -55047 -120142 -147937 -82975
15301 -82975 119295 198012 89494 -38341 -31335 -10717 111751 204899 173375 142163 145383
15290 145383 94271 36616 68457 76397 105659 148337 12528 -40322 -14644 -64747 -106937
15279 -106937 -84920 -26708 28320 84913 -30929 -7088 6111 41921 68865 -115158 -176589
15268 -176589 -203945 -221139 -212080 -144350 -73887 -34175 5293 -6669 -4267 -10909 -164041 -150754
15256 -150754 -152299 -124257 -141697 -155761 -22671 47776 38644 -25821 -31000 -81368 -12959 28036
15244 28036 -12881 -46826 -58035 30806 -19791 -66373 -106653 16132 47420 39984 -85392
15233 -85392 -180604 -139181 -70875 -107893 -86658 -44198 -49127 -6667 -42123 -155856 -114130 -6299
15221 -6299 91237 35292 -72652 -51226 19915 159195 174219 105292 77801 82620 44561 17741
15209 17741 40411 -9889 -54259 -56894 -10305 -5412 -59332 -68187 60611 148909 75130 64410
15197 64410 50752 -37549 -66245 -84928 -141809 -165828 -59142 -34295 15125 17119 -18131 65602
15185 65602 30286 7620 -5104 -94247 -86452 -65304 -118303 -68665 40557 154131 124095
15174 124095 198806 234651 201806 103977 113415 72397 -45280 -28142 4990 -5192 42155
15163 42155 -19196 -98573 -23054 -76525 -111341 -41258 88080 105711 -24310 -57044 -29875
15152 -29875 -76723 -50102 -55122 -21616 166330 153779 65814 133667 108437 68404 64034 30587
15140 30587 13307 35564 35224 48429 1002 -35809 28554 19920 -36607 -22489 -70890 -112393
15128 -112393 -55415 -131810 -181192 -171645 -25428 100758 125867 41394 19257 3238 54859
15117 54859 21160 51149 152733 174958 108165 -110881 -295706 -159252 -77825 41208 70870
15106 70870 35552 102766 123502 82233 22899 -129264 -98561 -51308 -119569 -228414 -250800
15095 -250800 -130447 -28249 125868 53135 105863 91627 118168 152189 127338 24916 8947
15084 8947 79294 75957 53904 85452 146047 104700 48338 48691 50697 103237 99852 90874 55733
15071 55733 72959 73455 -70605 -100346 -126883 -94305 47540 91399 -46988 -82957 -32004
15060 -32004 -29099 18718 128583 200094 88756 86392 107510 89979 37016 62813 100817 66591
15048 66591 -22263 -34405 -56382 -63327 -116505 -16924 28863 -48136 -53536 -73696 -31633 108615
15036 108615 173438 123429 39370 47027 98005 97195 28578 24408 14580 105781 69161 18305
15024 18305 -47871 -69567 -80276 13079 21669 58688 108614 164848 176799 201287 72000 45664
15012 45664 122047 78957 127843 139796 176499 155063 119020 270819 481088 865222 1373487
15001 1373487 2005485 1987843 1264553 729412 339186 94559 -17154 -50717 18203 85341
14991 85341 55087 89272 182518 126584 2555 -32614 -103799 -127919 -8272 84852 10953
14980 10953 -152244 -51497 -41171 -130043 -7037 -2148 33677 16153 -39976 98892 75734
14969 75734 -3289 8616 -39677 -38876 -66621 -39617 -83678 -65214 -63588 -112610 -107253 -28475
14957 -28475 -39769 -116631 -80127 34687 -36331 -211139 -214464 -141320 -83859 -69760 -65055 -13144
14945 -13144 80932 82659 86479 91937 7217 -58748 -100413 -14369 -9280 -6376 -32551 -98003 -125152
14932 -125152 -73944 22611 17026 40596 -45221 -82457 -40013 -98545 -79310 10072 37181 67879
14920 67879 66287 103426 165581 120914 63594 1967 -23505 -106724 -111571 -75330 -59853 -94462
14908 -94462 -120976 -107917 -89187 -55572 -40931 -59328 -29104 -16043 -995 43661 31123 -8377
14896 -8377 -85259 -148184 -86954 -17538 -24401 -54913 -42475 -106734 -8191 184719 156753 72374
14884 72374 -43816 25185 49349 80866 152688 167130 154193 200734 230281 145445 65874
14873 65874 7497 38117 24020 -86975 -192685 -227723 -128061 -98095 -118183 -109876 20311
14862 20311 36163 -34319 -86064 -123149 15273 65880 53992 39823 65698 89981 50760
14851 50760 2739 21257 1110 28941 41660 42169 54754 64539 133033 169484 126243 28068
14839 28068 102429 133492 75808 -92 -28021 -60535 -54574 -185574 -263626 -237864 -162829 -125932
14827 -125932 -95881 -110228 -181084 -189064 -172623 -160477 -112607 -91321 -121012 -18045 29654
14816 29654 -44712 13633 43677 56015 120586 191141 103861 -59267 -173962 -227301 -169919
14805 -169919 -38163 2918 -116877 -185809 -192127 -193404 -140580 -142711 -210012 -183857 -122176 -14648
14793 -14648 -129219 -134708 -151352 -111350 -162754 -156453 -180363 -105840 -84110 -69234 -66199 -75800
14781 -75800 -133053 -128529 -107857 -73632 50579 134625 124135 95397 66059 -36655 3167
14770 3167 42929 18911 10257 48362 27564 -6347 -51613 7209 11765 -29719 -9737 7665
14758 7665 50195 40289 -93068 -169497 -60898 140102 266030 183992 28994 62042 78021
14747 78021 107520 155751 79250 -4284 83912 79941 70301 52393 46946 93766 69609 31300
14735 31300 -24510 -59625 -275873 -251536 -118072 48531 110134 15777 29071 18433 -47070
14724 -47070 -81945 70650 97818 -10600 19936 103427 154417 92890 38917 75401 91127
14713 91127 91419 170528 36815 15031 36472 -103802 -138215 -13842 48397 104311 69588
14702 69588 54539 -1154 -26096 -132746 -121595 -109224 -106963 -93801 -107076 -74649 -17277 13845
14690 13845 -22170 -5472 -26450 -92413 -133294 -80766 3289 70777 75146 144370 125177 49285
14678 49285 -90607 -186315 -238884 -143951 -111610 -125457 -101833 -115059 -49681 57758 54504
14667 54504 16109 13304 59154 49458 -45708 -128582 -162718 -115774 -100655 -86903 -30367 21127
14655 21127 41605 88720 34791 -22495 -59652 -88326 -76157 -91704 -53749 22103 81799 109672
14643 109672 26499 -57902 -136254 -85316 13844 29811 20508 -48028 -7808 -70861 -256156
14632 -256156 -263187 -303788 -254772 -123611 -57159 -96264 -143104 -89299 17601 27466 83600
14621 83600 97046 143669 86672 8298 -91449 -115442 -72238 -42183 20042 17091 -29273 4549
14609 4549 -43065 -30487 33616 -27240 -59527 -42529 65899 6189 -27775 -3969 55042 24031
14597 24031 -119547 -18946 -18049 40132 42679 39836 -48014 -114834 -133559 -169844 -175115 -184384
14585 -184384 -136098 -103680 5715 17448 30588 -55706 13183 36666 8580 73808 98682
14574 98682 147728 151724 42748 7030 96756 101983 82898 137976 257025 550291 941021
14563 941021 1201106 1462557 1480643 1265357 1019722 822089 657305 583048 538722 550395
14553 550395 599559 756836 995238 1214989 1443097 1498020 1516455 1572909 1622561 1537897 1377594
14542 1377594 1261124 1017658 771012 533136 453431 448490 490556 460212 331297 266824
14532 266824 278730 307371 353484 412486 394934 284046 316770 356717 340198 255761 181795
14521 181795 287137 407969 395499 347028 361371 293517 305199 439119 458369 532453 665314
14510 665314 882142 1211234 1421163 1528538 1585339 1545223 1455127 1336696 1183623 1104482
14500 1104482 1058510 882309 621954 432172 407136 412664 384419 274672 184350 136357 182818
14489 182818 189127 202995 114340 4834 -46819 -43381 -37319 50642 100289 70041 -57674 -49665
14477 -49665 51720 71345 51232 -5699 48366 157785 222217 146928 84917 -36210 -139208
14466 -139208 -240003 -232254 -173397 -109025 -84803 -3840 55178 96672 26722 -461 33390
14455 33390 26968 87369 57658 18447 36593 63823 -62650 64472 135085 161699 197581
14444 197581 193934 110725 95555 67913 72911 105176 111192 130189 124002 192003 181469 156895
14432 156895 158987 103649 48931 84378 100959 117530 40330 107386 149078 21197 -18860
14421 -18860 -80461 -36316 -87062 -111709 -101126 107084 208498 230175 206986 247310 290702
14410 290702 182486 160898 211077 202446 139335 65393 104754 152911 87617 61070 104260
14399 104260 74145 13276 -18794 -425 -81392 -79971 -41967 -1809 114578 65628 84939
14388 84939 149026 67775 169994 247913 430094 530024 417803 252049 184554 160314 166173
14377 166173 288184 368016 332419 231142 115221 173973 167062 191908 212908 125956 76184
14366 76184 69597 148374 170893 154541 252750 304366 298007 284265 203698 222041 267162 195124
14354 195124 102900 283289 384452 360930 328824 284679 257385 191908 224233 142860 247773
14343 247773 356960 273281 265435 312507 223871 216136 288484 348417 494903 458379 483957
14332 483957 356564 237293 274165 255304 348384 367542 175272 155631 217538 320675 267100
14321 267100 240487 260004 282953 387854 309839 261699 362298 549545 682154 641223 700851
14310 700851 740355 633133 545153 550189 553026 493239 390530 397096 367201 184759 50617
14299 50617 70516 227970 282937 168252 73765 58519 107675 116075 58736 98613 216552
14288 216552 299040 279290 348571 398686 465034 541804 545275 468195 363798 313006 306898 218975
14276 218975 150009 175426 252981 309493 179885 121223 165995 178414 61368 24707 111752
14265 111752 241362 228670 176821 243514 274976 235848 210064 178778 155125 112797 185626
14254 185626 215320 47177 -76456 36054 135276 116688 75414 167020 133824 69698 63182
14243 63182 168139 196695 200115 226297 192777 110174 33578 48666 74077 114744 214032 164677
14231 164677 99482 83839 58495 -9952 18623 6505 36654 32907 -67551 57622 106580
14220 106580 44003 139064 80359 245041 364012 403903 300717 244974 157756 124346 182067
14209 182067 289315 308551 286259 266486 228078 196641 153565 283168 390118 393473 491699
14198 491699 509180 399319 307401 285110 241261 207742 160785 167888 152241 98576 120787
14187 120787 187159 166163 126856 137836 145843 171655 196116 226774 211915 307784 378294 451494
14175 451494 433463 541607 639254 774894 745723 679316 713198 669758 629087 631881 739031
14164 739031 785190 823084 803082 722479 702793 740080 658605 651534 723240 824853 900123
14153 900123 858593 926303 950747 969675 1051294 1114157 1077945 1149962 1278082 1330862 1321020
14142 1321020 1367057 1535277 1681161 1835845 1939463 2040094 2098451 2119991 2140293 2142091
14132 2142091 2269180 2422140 2651295 2912373 3089994 3319245 3432850 3621975 3864862
14123 3864862 4136921 4405721 4788185 5174175 5748396 6378446 7028310 7795479 8813542
14114 8813542 9993202 11441726 13158982 15270817 17646846 20410173 23726589 27991989
14106 27991989 33442833 40394170 49580104 62240620 79632022 102713446 131435082
14099 131435082 164275269 198583349 230434881 255861628 271727688 275836441 268049582
14092 268049582 249642483 223253102 192493941 161585779 133524279 110333625 92421044
14085 92421044 79005809 68957080 61272696 55290089 50516628 46622197 43374007 40732410
14077 40732410 38507075 36794191 35591225 34882282 34797176 35351814 36385571 37913107 39949124
14068 39949124 42615566 46065600 50418113 56125423 63530668 73624605 87051932 105007294
14060 105007294 128310005 156877179 188889107 221276110 250062952 271364522 282071765
14053 282071765 280600372 267182583 243440198 212610017 178397824 144753040 115037572
14046 115037572 91102105 72964931 59605421 49694663 42267251 36383937 31527247
14039 31527247 27505889 23857153 20657467 18106052 15905366 14041443 12418123 11023235
14031 11023235 9955631 9074405 8346479 7639188 6975352 6422878 5950994 5561371 5227183
14022 5227183 4944071 4730697 4454226 4097812 3888266 3593568 3356953 3068234 2889261
14013 2889261 2819090 2681799 2533138 2455520 2370323 2264874 2159795 2212623 2302074 2345896
14003 2345896 2332745 2333957 2214803 2199351 1982459 1888968 1838228 1827662 1893913 1857515 1752157
13992 1752157 1624270 1564458 1633123 1565238 1481330 1508501 1537836 1447915 1361531 1356503 1331112
13981 1331112 1559851 1792135 1833291 1891302 1902474 1926952 1873004 1903586 2035102 2111434 2037697
13970 2037697 2023054 2294399 2560477 2813301 3126005 3567068 4188410 4974264 6040987
13961 6040987 7502099 9330350 11359001 13571168 15794921 17559991 18681572 19067091
13953 19067091 18983357 18110613 16514735 14564718 12684021 10955836 9444041 8386792
13945 8386792 7656960 7202265 7144877 7239535 7601149 8342828 9438860 11214705 13741255
13936 13741255 16991230 20941981 25180297 29650880 33933554 36923105 38311684 38303226
13928 38303226 37051117 34338517 30489685 26398265 22466363 18915676 16016242 13864860
13920 13864860 12522132 11810664 11606273 11712352 12361748 13682958 15715438 18816687 23177961
13911 23177961 28624709 34887708 41561014 48340715 54032692 57392154 58367569 57256549
13903 57256549 53849443 48206604 41699640 35416753 29675076 24564244 20665950 18140396
13895 18140396 16744323 15959102 15780376 16206889 17460212 19724216 23322959 28412996
13887 28412996 35038939 43079528 51697304 60592495 68853437 74513872 76838308 76380064
13879 76380064 73204428 66782767 58272670 49624492 41475964 34003593 27697777 23080966
13871 23080966 19984918 18002227 16734700 16261848 16457725 17358972 19085227 21946658
13863 21946658 26222640 31649371 37888921 44353034 50907039 56198018 58933938 59384790
13855 59384790 57875796 54070274 47972411 41073605 34490225 28474558 23321846 19248262
13847 19248262 16230066 14197733 12776985 11970040 11826859 12182849 12923691 14424305 16802389
13838 16802389 20137887 24090281 28309234 32639869 36765297 39401133 40235884 39846164
13830 39846164 38035477 34451671 29783815 25281002 21094157 17163616 13878882 11560270
13822 11560270 9955616 8716244 8105352 7753446 7604883 7593737 8017260 8932259 10214613
13813 10214613 11850797 13691039 15682377 17668413 19203273 19982093 19944223 19211431 17962209
13804 17962209 15956383 13683879 11405780 9266296 7403925 5892537 4905938 4221701
13796 4221701 3639047 3129712 2591005 2194169 2021969 1875064 1690213 1504974 1317939
13787 1317939 1171600 1096883 1030918 1112393 1008135 950554 941163 960376 849244 792226 741607
13776 741607 736198 729627 643381 509663 474229 587928 654715 632796 583313 695665 750071
13765 750071 779235 681359 596025 513743 496660 475350 594179 599702 490916 308650 329472
13754 329472 317620 368888 312081 252939 336668 348266 443962 566642 618484 617799 534768 470637
13742 470637 450436 483661 416172 305696 393789 466088 403305 319651 383932 379572 416106
13731 416106 517258 458341 404385 377622 353828 326743 234394 117215 207841 294184 300194
13720 300194 398752 378582 361337 486828 550619 464506 414723 414241 415941 347373 266956 219506
13708 219506 261850 314026 361678 395209 334514 322508 393639 356239 247932 254815 262879 212902
13696 212902 193307 285262 323642 392049 347677 325206 276334 187356 200978 168402 91281
13685 91281 50496 128193 132536 133860 191224 165286 136567 99455 30366 93346 125981 185907
13673 185907 258801 298746 314145 243495 232809 249556 184184 124298 213478 359375 419549
13662 419549 368236 348414 426077 363262 199745 121718 121112 14669 80140 210438 297973
13651 297973 403446 451848 368125 356461 340140 345176 382251 439637 586264 721243 812594
13640 812594 992463 1132075 1310264 1327678 1315242 1472341 1482342 1343646 1204687 1007182
13630 1007182 896554 768301 570089 524827 432969 399284 422268 357533 311136 228406 234054
13619 234054 313938 393667 480031 440459 405139 323165 319037 321825 245174 144949 182334 170654
13607 170654 304487 400063 491639 563617 706047 735519 794991 1022478 1201544 1326944
13597 1326944 1564567 1676723 1623825 1480264 1354082 1146561 998693 915605 726591 652567
13587 652567 623633 546862 425574 249808 164329 178792 229168 143568 66070 86615 84638
13576 84638 126146 181414 177850 210207 292602 285177 261945 248664 321716 338061 290096 236631
13564 236631 275396 237510 206552 158352 176335 2629 -20334 81302 81878 81866 3329 -20405
13552 -20405 19481 93379 135276 194501 318904 352846 331905 226482 80789 91000 86542
13541 86542 68109 100406 224076 259196 285723 155503 88411 67167 45969 154274 167422
13530 167422 210257 229556 222998 153632 51900 63690 80408 -15690 14438 102814 6253
13519 6253 107564 148012 97905 233049 165126 65504 79798 -23051 -170764 -131265 32819
13508 32819 85843 101172 61879 -49402 43058 147928 160804 191170 195388 166220 135024
13497 135024 41373 35386 108555 138981 111236 78917 171690 220864 237578 63627 -68982
13486 -68982 -47030 48723 107092 34411 39499 -15341 -15221 50356 31889 29211 -49690 7372
13474 7372 78150 93411 137754 154479 134973 205631 239450 255714 233731 239755 95677 144675
13462 144675 177391 200974 238670 203770 195458 185925 194857 153024 233594 216911 297461 303366
13450 303366 302891 370045 492779 492184 476368 439643 290503 274490 309487 189416 93557 174785
13438 174785 208344 229577 292174 297832 325896 333124 338569 415804 417896 392426 449658 508127
13426 508127 494402 497780 488789 618399 694405 708370 729298 661005 620967 588000 602938 638270
13414 638270 607827 439412 397235 396552 386909 344311 258886 356758 337360 376768 469309 429125
13402 429125 468085 638259 698188 679714 606240 562502 517946 520153 565863 739051 779243
13391 779243 647761 516672 378927 352772 413778 349086 338046 341995 200450 275195 287100
13380 287100 226348 277192 254417 158941 141873 218182 224355 206082 225763 341533 481620
13369 481620 663466 679611 618477 535636 537612 668100 688864 601843 494270 471739 482678
13358 482678 366470 442490 529654 592927 720678 706413 694460 649290 490057 471344 564488
13347 564488 490618 272753 322368 438376 358803 345966 427464 445113 381430 276267 145671
13336 145671 120340 258695 285540 283506 324717 390234 467599 470662 486594 437240 405854 499911
13324 499911 560589 549520 448239 353396 203588 138477 261126 367697 471305 408108
13314 408108 419072 452560 487317 571361 618928 563692 438742 364843 298248 232874 155310
13303 155310 133033 189976 235536 251655 127886 50463 151292 334635 528196 500028 422517
13292 422517 475631 516449 446949 407785 454108 406538 343642 368968 456169 378175 252545
13281 252545 78748 19586 40366 139041 185833 168550 134788 190723 105558 11776 -6732
13270 -6732 -19797 -35491 2793 184836 277163 213134 236010 218013 226372 265171 211554 194961
13258 194961 76574 6860 70165 -172 49696 70570 137826 101179 53862 152811 152857 32915
13246 32915 -43906 -101763 -27289 84892 24004 37643 118236 209299 186450 85159 156886
13235 156886 267162 310820 237171 98046 154555 154500 226291 309610 289260 189243 164301
13224 164301 187141 122853 137377 182123 236750 73108 -50916 96638 119101 129789 52697
13213 52697 134616 160388 156239 113193 41582 131322 108820 -31475 -23174 80532 151535 229440
13201 229440 210586 172105 167310 79661 43135 54329 160567 134138 72121 5351 -3043 38105
13189 38105 140627 147608 119231 27174 4633 48509 12784 71860 59028 151868 184129 163312
13177 163312 63309 -45277 -57695 68282 101218 -63194 -72496 73579 77680 59830 -33974
13166 -33974 12082 205313 225057 201029 151002 127247 149225 79086 35218 65842 74409 -11203
13154 -11203 15911 56749 101423 40684 -80785 -64613 62093 186234 175083 130207 121475
13143 121475 166856 164301 175104 180049 167830 145454 209538 195527 213690 188763 221304 270978
13131 270978 105436 -102 -11306 102205 166774 173812 59813 11145 8901 86538 187669
13120 187669 209017 174038 70319 -46466 -102312 -129220 -176911 -112093 -105098 -58594 81531
13109 81531 240101 320772 289376 229144 324440 385337 248569 78315 6370 -63650 15992
13098 15992 130361 162739 177695 60404 69727 60356 76383 8652 68735 175365 176576 95935
13086 95935 76158 69055 58218 84082 133447 92023 39758 -7535 48459 66345 19596 37485
13074 37485 21770 41830 136352 149024 169505 148792 176295 167423 224274 219821 206773 226318
13062 226318 143570 145101 147771 241115 213488 112379 86546 74617 122671 158210 120039 148173
13050 148173 279485 237629 240997 246091 341679 373215 401575 404673 308557 300033 285630 198355
13038 198355 186831 204695 259708 348908 415737 431908 386924 337109 284033 267146 219709
13027 219709 164456 238760 344705 384423 502599 561103 498212 493263 482044 383161 413311
13016 413311 410924 463931 475628 436317 473854 443652 416864 500596 640027 699415 789067
13005 789067 912296 1034218 1054811 1052695 1142854 1333637 1470140 1733261 1973617 2160576
12995 2160576 2405461 2543308 2624886 2859701 3059201 3135822 3358599 3699271 4143251 4810992
12985 4810992 5588238 6564520 7873753 9527374 11642475 14246241 17805427 22599902
12977 22599902 29025106 36903150 45200077 52069313 57293881 61263754 63034388 61398391
12969 61398391 57096274 51610086 45928063 39616057 33067428 27330324 22869390 19703599
12961 19703599 17796319 16818098 16767250 17333392 18704989 20943843 24441374 29212343 35656075
12952 35656075 43564818 52120281 59716566 65441501 69838661 72643030 71985414 68115452
12944 68115452 63071255 57744302 52275672 47245135 43987097 43191314 44680526 47975076
12936 47975076 52327175 57118235 61462261 64299753 65340540 65352665 64132443 60877282
12928 60877282 56147777 51071252 45714747 40052571 34405058 29545941 26068600 23828966
12920 23828966 22641716 22508924 23477284 25373501 28183839 32488763 37892282 43789843
12912 43789843 49790963 56057456 62363698 67836783 71947279 75342324 78572542 81104407
12904 81104407 82685449 83804306 85063431 86565878 88329641 89706877 89625829 87954405
12896 87954405 85322668 81261271 75196008 67572073 59765382 52282536 45083804 38764827
12888 38764827 33693021 29968614 27699094 26721827 27078362 28816706 31998927 36971507
12880 36971507 43567051 50955207 58195721 65030030 71682811 77570807 81662004 83268021
12872 83268021 83137399 81823484 78175424 72270989 65971552 60747988 57305700 56429715
12864 56429715 58688228 63767226 70406113 77382056 83919398 89755886 93835338 94208181
12856 94208181 90699583 84776695 76916883 67019595 56445676 46923117 39421993 33854609
12848 33854609 29482859 26413879 24597783 23704276 23927391 25268742 27916264 32108187
12840 32108187 38158687 45906318 54457361 62831184 70636710 77648400 82972104 85176056
12832 85176056 83039691 77766502 70586051 61255047 50502611 40334123 32152006 26240904
12824 26240904 21836062 18463549 15730449 13435399 11491904 9890169 8428090 7337523
12816 7337523 6643859 6093387 5635406 5104164 4700721 4412170 4124036 3903902 3723280
12807 3723280 3449976 3169403 2921008 2700325 2554530 2394849 2208837 2157501 2108722 2087123
12797 2087123 2074210 2014896 1976348 1981955 1849515 1802956 1699285 1686233 1557865 1449799 1390615
12786 1390615 1373790 1359975 1253098 1224718 1267346 1226807 1193874 1264509 1324802 1444364 1561863
12775 1561863 1690272 1745495 1712353 1776731 1738213 1598960 1419442 1310989 1195351 1106887
12765 1106887 1009448 885883 842220 831151 846904 669933 672546 742489 702672 795440 798685
12754 798685 787155 814784 935695 938112 858119 850649 850613 832564 944158 1006521 882158 912827
12742 912827 895142 796511 720951 712031 701419 652917 702408 721231 684414 621332 593648 591564
12730 591564 739051 819235 667901 687185 725863 724415 823988 917900 945767 965215 959163
12719 959163 895250 817316 748051 652071 725351 812842 698235 638465 691726 725874 732053
12708 732053 731132 667764 552631 595356 661370 752762 742589 682116 749679 701325 729890 703270
12696 703270 565011 519583 531747 509594 543441 593639 567540 468052 413370 418369 491564
12685 491564 508051 497345 543354 449905 394547 378380 356524 308840 220104 201067 184525
12674 184525 182319 186782 177176 137793 196751 220214 116419 102177 258317 395778 390462 489761
12662 489761 445995 456292 427784 423571 521899 470135 425736 384415 258349 317181 302967
12651 302967 214862 267828 277564 238789 266701 213604 223651 292837 373541 365375 396894 397261
12639 397261 314578 354399 381137 311643 232719 82282 152019 211833 210068 213536 192332 308489
12627 308489 312185 180432 147108 152100 138124 26279 95224 218329 211632 176530 301332
12616 301332 375907 300513 217581 287981 371700 478266 504145 427744 436432 382226 314361
12605 314361 384241 486952 513949 346610 359955 416166 401454 453935 461685 444051 484380
12594 484380 723669 812479 825045 791795 733567 810668 981526 1390795 1872290 2448532
12584 2448532 3001862 2838666 2294795 1855282 1806162 1985560 1968435 1702201 1467755 1344125
12574 1344125 1226591 1098983 1192208 1332574 1593214 1801432 1773346 1551760 1360485 1280956
12564 1280956 1348373 1542458 1599350 1629452 1824648 2179904 2345891 2280974 2116309 1983132
12554 1983132 1820247 1791497 1930392 2134166 2253943 2401429 2532735 2864666 3150049 3594919
12544 3594919 4412621 5713131 6934530 6763714 5514579 4327875 3655225 3501347 3272511
12535 3272511 2960042 2699155 2543178 2411807 2181562 2055856 2169393 2363469 2546269
12526 2546269 2549344 2427644 2169083 2043527 1950614 1827337 1735453 1604783 1553001 1608840
12516 1608840 1652386 1702507 1633410 1529144 1445515 1454460 1538120 1622502 1720693 1886143 2160825
12505 2160825 2296693 2236154 2060817 2132497 2482328 3027508 2978910 2353037 1710375 1219086
12495 1219086 1093326 952614 943386 882760 943289 989012 935982 912632 836368 818481 709889
12484 709889 684358 778747 758760 743112 739339 740890 678536 488682 579490 695766 753235
12473 753235 770303 825915 788211 773005 797596 826348 751952 755218 874679 867433 792980 752333
12461 752333 806857 745506 665059 616479 505045 456366 530860 628588 599535 554321 633212
12450 633212 722195 865072 949689 1135919 1236888 1264534 1279094 1216975 1293263 1372816 1425064
12439 1425064 1583279 1643988 1660170 1677121 1644452 1628471 1559482 1613049 1783209 1815749 1941092
12428 1941092 2083966 2219844 2339133 2338626 2416411 2537165 2643052 2927640 3368234 3957367
12418 3957367 4471709 4959492 5535582 6344157 7190431 8348574 9651693 11305785 13498342
12409 13498342 16244536 19774620 24754471 31487695 40433291 51987637 65874058 80481248
12401 80481248 93117249 100435890 99365886 89311608 74059699 58733829 46477103
12394 46477103 37694586 31835596 27929316 25680258 24715685 25030780 26529093 29446318
12386 29446318 33995867 40208127 48226770 58178168 70086290 83135054 94335536 100491250
12378 100491250 99936056 92872189 80742289 66446301 52665630 41411295 33024595
12371 33024595 26958824 22690947 19788912 17819903 16601842 15852104 15394886 15176743
12363 15176743 15105809 15299218 15834704 16887258 18659712 21295425 25042283 30491197 37600654
12354 37600654 46841433 58571563 72322899 86673434 98750930 104153850 100939109
12347 100939109 91635713 79714823 67335068 55897439 46275174 38993604 34205661
12340 34205661 31589322 30555788 31167171 33472936 37664940 44391482 54104432 67309334
12332 67309334 83871320 103307021 124223714 144290251 160108117 167153382 162304535
12325 162304535 147323022 127683817 107743509 89128974 72695194 59044794 48510468
12318 48510468 40688469 35187100 31565213 29202106 28217653 28701437 30643118 34270139
12310 34270139 40174053 48216736 57597403 67156097 75469173 80662779 80174892 73574018
12302 73574018 63575303 52881610 43137482 35087390 28551430 23656001 20137798 17633661
12294 17633661 15724245 14402738 13409328 12789010 12365413 12019924 11920391 11945739 12268497
12285 12268497 13262357 14877578 17275679 20908068 26359345 34111191 44358087 56380722
12277 56380722 68093759 76668803 80316589 78835207 72458966 62684191 52615353 44017877
12269 44017877 36921951 30974380 26159919 22699879 20546727 19566847 19696225 20718685
12261 20718685 22793808 26505252 32412047 41228100 53166591 66918867 78760213 84242529
12253 84242529 81762704 73408332 61984726 50034842 39552754 31179042 24936872 20336075
12245 20336075 16988047 14345801 12323605 10757842 9360918 8185359 7244903 6400802
12237 6400802 5679962 5067175 4559146 4142141 3669489 3352818 3068580 2788231 2614333
12228 2614333 2461021 2257446 2091396 1942772 1923408 1898215 1783932 1818182 1734017 1685689
12218 1685689 1590790 1450838 1416289 1452303 1434413 1449558 1352159 1267598 1186789 1144749 1093497
12207 1093497 953701 894388 975879 1021623 933146 964503 988234 936636 909283 965961 957449
12196 957449 1019745 1050089 960545 836028 651041 701843 768795 687318 593477 550156 503421
12185 503421 513520 577188 714109 796307 747253 810580 796793 849985 834553 718878 679222
12174 679222 753282 713476 617355 537705 534776 506373 474776 446884 455699 464813 512857 530244
12162 530244 554461 474806 429496 448322 468633 423168 346584 255446 296203 234649 192942
12151 192942 155252 230001 302022 202829 342037 423448 438434 446247 469660 541728 570377
12140 570377 523905 521120 509668 461687 378816 409462 387386 375080 322879 402985 471590 343184
12128 343184 390541 449622 436003 412671 396277 325240 283148 245329 237467 258540 316125 282179
12116 282179 317500 263337 284450 363748 445806 450101 338561 248614 155957 110827 124696
12105 124696 155887 93804 57404 56026 172903 210704 278662 389019 359376 284259 302320
12094 302320 244285 191307 154876 72930 51425 155162 255493 293301 193342 185285 153306
12083 153306 54211 174332 250327 289189 367932 306249 152681 148571 210805 175333 211795
12072 211795 252800 321195 307336 260423 273183 283125 197384 238708 263265 235967 164921 214241
12060 214241 357875 354702 305525 226655 271227 265026 193437 148967 201308 258079 262447 249037
12048 249037 223213 68630 27504 87706 156898 128466 111936 177026 224379 193110 241554
12037 241554 338590 326147 259836 233478 240993 319420 363885 315863 172798 141348 227328
12026 227328 136306 62135 -8028 135027 254782 231649 129835 72805 136890 170279 215901
12015 215901 187069 127606 95928 158583 241162 198724 110233 77054 145071 183010 182284 143012
12003 143012 134101 147864 213226 239250 179801 77017 140169 212152 199874 149930 129809
11992 129809 126994 92007 207814 316366 275011 273309 222419 126932 136794 157350 226584 230837
11980 230837 176985 133366 169486 139414 140525 216239 236537 269254 170328 125940 103638 92345
11968 92345 166349 132275 37886 -36496 45532 218354 260752 152918 182940 355328 333223
11957 333223 248913 222787 214291 301378 369566 362839 446125 635729 717368 742076 641773
11946 641773 718821 792936 739312 522320 330471 184163 73023 204571 150428 110270
11936 110270 167633 269114 423019 434693 331358 340473 495695 478326 476078 523493 605545
11925 605545 559550 398654 274202 440129 520317 258184 105283 197209 254696 187959
11915 187959 125557 46675 -6605 -27780 41874 115278 71916 33899 101178 47762 50005 112524
11903 112524 219120 241392 296149 405307 404154 389684 425478 407957 485275 513978 416651
11892 416651 364118 324285 264821 211845 238460 474859 462087 342074 342073 404199 378418 251032
11880 251032 273036 367233 514720 713879 969527 1051553 943057 845916 812529 653943
11870 653943 518801 426138 326479 269879 299037 264396 234267 227334 254099 252961 243391 240000
11858 240000 308168 253860 232021 281106 362402 400448 426353 397781 389140 208576 194809
11847 194809 138221 96672 196054 108609 46398 22664 -31017 72618 169864 149015 126519
11836 126519 126810 34661 82129 117322 125461 74526 3285 66579 145164 190033 262565 346970
11824 346970 480670 535972 507135 497187 425835 379289 371747 192686 132458 88689 62317
11813 62317 53061 158925 165936 207507 332579 236307 264702 224297 286542 393999 458818
11802 458818 516127 514017 491291 506114 368791 207475 151748 208421 174964 117221 160537
11791 160537 85973 -60726 -101659 -47627 101236 97774 59315 97361 -30226 -55445 -18003
11780 -18003 -52493 -45665 -10353 -9807 1481 29897 -8710 -49467 -148831 -71877 58716 -41298
11768 -41298 -103837 -86918 -46961 -86249 -90870 -94126 -150113 6736 162104 164219 139722 104613
11756 104613 115531 48751 11814 10101 -80911 -196467 -189315 -197920 -206826 -96863 5201 -27351
11744 -27351 29466 40775 -39873 -89719 -55420 62118 167174 220513 158997 170890 188598
11733 188598 118083 193576 262546 148791 -24724 -154665 -218315 -68662 -34446 -86948 -102638
11722 -102638 -71087 -82857 -109824 -68161 -36770 70255 119248 6097 -58780 -86364 -170695
11711 -170695 -212476 -21622 13683 -75854 -56427 -17000 52035 98084 95249 52169 31227
11700 31227 73173 98861 117174 60132 -19061 -49672 41229 127540 4410 -78495 -51253
11689 -51253 -16882 -56617 -6323 8749 78193 92963 137035 119831 97963 89067 64231 35241
11677 35241 -94970 -28705 52805 -37624 -12712 37911 49321 54439 189929 165282 17875
11666 17875 -101803 -42953 -57440 -45510 27515 141264 50922 -50366 -21329 -59079 -20461
11655 -20461 -45862 -113949 -3423 -19076 -33217 -1850 24757 33490 57159 24697 59441 50053
11643 50053 -32965 -102814 -60253 17681 4448 -28859 -122436 -117156 -176114 -147864 -74247 495
11631 495 129321 77613 -52499 -111478 -107437 -112517 5545 74095 56727 39401 31359 17192
11619 17192 48170 14912 24391 81219 -15434 -6454 -22349 45774 -14693 -8214 32271 12287
11607 12287 7939 -110581 -190297 -136783 -227662 -197830 -114097 -32294 67700 14613 -48240 -140575
11595 -140575 -56052 34750 75625 43639 -64423 -20622 9748 80612 70029 79280 131471
11584 131471 112976 87361 91879 88208 54554 -36928 -94767 -49717 52518 110160 113800 115388
11572 115388 108089 45653 -66576 -89595 78430 106331 110843 69496 117329 35040 -7622
11561 -7622 11263 -30328 17399 116435 201534 137507 75728 62907 24697 -106609 -132647 -22451
11549 -22451 -41788 -49620 -98795 -225733 -248717 -186119 -81304 -30650 -39987 -112376 -118758 -113143
11537 -113143 -40726 -59048 -48476 -65773 -114552 -173431 -136436 -145398 -110479 2953 66975
11526 66975 43686 -4542 99059 55426 7446 44373 6924 -20581 -59934 -91943 -176177
11515 -176177 -170950 -66197 -24800 -12486 131741 160168 42211 -13930 -110095 -68880 -4306
11504 -4306 -92455 -141719 -83858 -21191 46874 76020 -11219 -90813 -138226 -139922 -110819 -18476
11492 -18476 -101244 -256277 -340278 -252067 -61970 13481 77787 16702 18181 -62675 -92640
11481 -92640 -19240 23598 -52969 -28605 47159 115716 70464 -2549 -72925 -15503 40333 -19528
11469 -19528 -29717 48465 113156 84677 98420 15005 -113695 -3469 31236 -13467 -18404
11458 -18404 -52434 -40084 -17987 18050 -75474 -48929 13197 3445 56364 31091 -7804 -65061
11446 -65061 -166736 -169759 -268224 -266124 -290663 -196673 -134986 -48793 -149167 -139399 -6160 175538
11434 175538 213781 14645 -89721 -74939 -163330 -154233 -35315 -37884 -147921 -126546 -139006
11423 -139006 -180632 -160976 -195122 -127852 3502 63550 61741 55207 24274 36936 91608 9368
11411 9368 -51917 -79059 -66881 -45690 76943 72505 7712 52979 43291 5591 -61601 -88422
11399 -88422 -84460 -66719 -63898 -18778 83650 57484 -99897 -145149 -37036 -16120 60010
11388 60010 -53730 -39010 62262 138517 82239 -12810 -63363 68895 123957 57489 -71252
11377 -71252 -179790 -236318 -165878 -86250 83277 86282 6273 -108819 -96362 9890 9077
11366 9077 -33 -10611 -13585 -98116 -174814 -70094 -14185 2130 25820 114668 134645 20448
11354 20448 45136 26508 2167 42398 64690 118818 141258 94982 60606 -2866 -72301 -84672
11342 -84672 -140793 -105976 -115927 -40578 -35852 -154237 -177057 -234013 -258082 4279 103900 118503
11330 118503 29553 -80875 -139028 -210013 -163957 -99473 -119329 -111120 34819 104536 160095
11319 160095 113521 34816 8042 41080 -109622 -118784 -3777 -46924 -38574 52826 21039
11308 21039 73273 52268 -4520 -644 -54814 -150113 -157904 -158557 -186032 -61666 16228 63003
11296 63003 26917 -10427 -50896 -79073 -20656 -49878 -152720 -126650 10060 66225 32838
11285 32838 -42714 -142138 -218469 -227549 -214578 -81731 -23041 47127 78823 -88901 -135094
11274 -135094 -119251 32230 73855 16756 -31894 38225 15365 -72685 -112297 -111901 -107923 -4126
11262 -4126 -93949 -106090 -67262 11584 15087 -28005 -11006 -7228 -64231 36495 137180 109459
11250 109459 -27106 -170700 -141693 -79283 -82394 -42634 -96255 -198613 -284275 -273208 -218917
11239 -218917 -215677 -181523 -154167 -110338 -64329 -58208 -48480 -9919 -12495 -55142 -79738 -17253
11227 -17253 23109 136831 100956 -37867 -131566 -179526 -140245 -61039 87991 95507 4389
11216 4389 -87052 -140771 -89486 8283 41908 4915 -27569 62563 69154 77788 30352 68522
11204 68522 49542 13780 42664 71110 115871 113816 32391 -57701 -91564 -54361 -33613 -11058
11192 -11058 53417 108110 122283 54496 -18106 82321 145377 82312 24387 41831 53038
11181 53038 -8664 51876 54385 102480 137511 147035 37920 -56548 -89587 -48645 37633 5927
11169 5927 12725 60149 -77345 -185785 -123130 -21361 -2429 102582 106650 46468 76827
11158 76827 137779 239101 265326 106728 -7787 19829 69873 29033 -32039 -32589 -28266 -132384
11146 -132384 -152923 -90992 -109038 -81305 -82958 -106086 -159240 -225348 -145147 -86209 -6187 -28868
11134 -28868 -90009 8741 -8577 -55753 -84277 -103830 -112911 -39437 -22954 -63650 59311 156587
11122 156587 101021 3327 -84227 -41788 -39310 -75934 18728 39240 -45710 68835 127906
11111 127906 204695 33408 -164801 -210582 -126055 -54547 -99624 -116398 -3816 -86180 -198777
11100 -198777 -226350 -214354 -142369 -85458 -39951 2878 72737 -39759 -28568 -110726 -141033
11089 -141033 -119037 -32980 -24124 -32970 -46477 -96262 -35768 68692 121743 55969 40946 126631
11077 126631 140407 3712 -98154 -32871 103626 164468 122312 53699 -14221 -65547 -65289
11066 -65289 -38820 -26310 -67369 -160204 -206456 -228491 -195692 -118121 -126327 -86638 -97735 1616
11054 1616 112049 128734 139221 84956 -13048 -58728 -71250 -22896 97268 36268 -10200
11043 -10200 -37853 -156873 -140725 -66897 -8443 -57407 -109644 -85834 -90570 -88639 5139 -85265
11031 -85265 -71210 -9838 -15307 29268 54527 139901 63079 68788 66425 46947 -34227 -146439
11019 -146439 -47367 -46261 -141813 -190162 -138970 -141004 -191989 -113923 -77315 -99470 -120962 -73329
11007 -73329 -87917 -128574 -193657 -169988 -197637 -212699 -136657 -75982 -53256 -17710 -41842 -99612
10995 -99612 -39374 23232 34136 13276 29360 174040 214215 38300 39386 175779 121789
10984 121789 -28356 -43322 -76480 -142794 -179772 -108528 -80165 -140235 -129299 -177174 -154853
10973 -154853 -159069 -10028 100600 62485 59479 19156 -29797 -66957 -20195 20388 12919 -124963
10961 -124963 -260127 -204644 -88504 -71758 -51416 -48825 -19308 -24601 -36609 -85420 -10129
10950 -10129 20812 3833 -14269 -57184 -761 148660 96390 38601 -29178 -142887 -198371
10939 -198371 -62729 12238 -25474 -41398 13089 -98240 -186340 -214577 -152491 26120 -12904
10928 -12904 2812 104284 95966 -5059 -99638 -132778 -143292 -239152 -142670 -148829 -132797 -84276
10916 -84276 8413 105966 156059 170260 121241 103322 51901 -10365 -74641 -86453 -40301 31831
10904 31831 -41802 -107673 -71499 -45176 18552 -36410 -164406 -200553 -133096 -199050 -246089
10893 -246089 -258686 -168373 -205646 -211235 -200026 -137988 -95820 -51218 -48438 -65272 32008 -29430
10881 -29430 -165799 -196107 -212817 -236413 -239499 -92773 99679 86954 93449 66509 54440
10870 54440 -56520 -57419 3447 90003 125728 95399 -119446 -110132 -97604 -96426 -72361 -107021
10858 -107021 -35731 21641 55165 -42316 -80049 -73258 -84179 25878 -14272 -63590 24553
10847 24553 69537 75785 72988 45653 -5598 -19395 -52950 -52582 -1629 10452 64763 85279
10835 85279 46314 34900 13227 35722 -82378 -110407 -99468 -72428 -117372 -62276 49310
10824 49310 -47531 -79972 -65628 -97230 -157006 -191270 -110908 -91911 -52996 -72157 7075 -63459
10812 -63459 -80712 -95945 -98812 -87070 -73589 -54674 -9369 40563 44554 48765 -68821 -102058
10800 -102058 -125277 -89506 -10000 -79849 -9196 95532 109002 20423 91126 60776 -67346
10789 -67346 -95735 11907 106186 46829 75466 37946 40101 116568 104630 46695 45804 73700
10777 73700 14833 -39292 38797 78597 78644 95685 63144 94730 43907 -75870 -53043 -57230
10765 -57230 17256 -16915 -6687 86818 70111 118555 88273 -68431 -221003 -280722 -297844
10754 -297844 -271420 -227444 -107929 -134830 -287287 -208770 -81315 90236 114472 26281 57673
10743 57673 144129 261247 288721 247036 166878 129007 178312 100040 46465 30504 81026
10732 81026 71572 29138 -52533 -56716 -80179 -127750 -75843 -84646 -76844 -21286 -31363 67634
10720 67634 80729 -63706 22208 15565 17186 -36510 29057 -12244 -158477 -214466 -154929 -95306
10708 -95306 -2981 -12152 -34479 -84083 -83924 -61541 -73752 -77893 -185026 -247276 -155147 -109039
10696 -109039 -192034 -147258 -20375 117280 110780 -9177 25855 59801 24269 -52515 -55518
10685 -55518 -108642 -156363 -50435 131053 62985 -21375 67735 155264 223093 210451 231496
10674 231496 280695 340389 315932 321805 226297 105234 53627 -36206 12746 9719 -112287
10663 -112287 -144411 -125990 -124216 -106506 -97233 -132325 -30824 48028 44245 64760 122405 15142
10651 15142 -79835 -104200 -113009 -93494 86811 70392 29137 -123256 -213054 -238166 -100887
10640 -100887 103567 169197 14422 -16855 70752 86585 67084 2612 -51559 -89906 -157241
10629 -157241 -23392 48625 -5539 -91507 -116187 -129057 -153729 -164549 -19716 32980 -34366
10618 -34366 -19970 70552 53363 -11162 -77269 -143384 -61301 70553 96352 18788 23083 41360
10606 41360 60303 -5299 -685 73011 40326 74783 94372 49982 3640 50097 61040 73690
10594 73690 25375 14025 -47793 -131699 -214876 -164737 -60938 65879 -16880 -105853 -159893
10583 -159893 4897 115198 147564 86406 103465 189810 122898 23335 76728 82242 -13540
10572 -13540 56039 -35291 -102471 -70490 -13005 -48228 -92779 -36647 27448 48440 -23849 -159702
10560 -159702 -173701 -44642 13610 -7448 -144987 -231790 -119036 -9569 49430 -79496
10550 -79496 -106871 -51633 889 38604 151090 125553 40785 -19580 -42457 118616 140207
10539 140207 187600 199105 144263 -42316 -217719 -179518 -100525 -161892 -82785 42592 143514
10528 143514 71609 56998 90 -60832 -169830 -178715 -65751 -98861 -100864 1882 94030
10517 94030 62502 99478 40143 -7323 64440 83305 125594 96887 114374 213 -49934
10506 -49934 -77760 -137052 -26076 -56880 -134817 -160999 -18156 19341 88727 144083 186941
10495 186941 116704 -20010 -126754 -127649 10538 107524 96283 -11846 -100815 -175926 -89497
10484 -89497 -136343 -77338 -12413 -39702 -65249 -131573 -185616 -184723 -154065 -253640 -214189 -130392
10472 -130392 -60517 -77045 -117711 -57525 82336 103577 60278 33766 8916 -42497 -156836
10461 -156836 -173284 -202026 -138920 -143001 -153349 -125281 -73325 -55297 -11617 -104226 -89143 25503
10449 25503 73527 64235 140550 180298 179224 40746 -52029 -28293 -34594 -13897 -20478 980
10437 980 -75843 -52407 27379 96801 199403 217457 169270 87867 83862 106340 21625 22106
10425 22106 7839 15017 19483 62356 67302 46782 -16269 -15409 51456 99824 36946 137473
10413 137473 247599 212770 82829 82394 66713 -78412 -89844 -9151 108430 174846 191939
10402 191939 153147 223309 289126 418196 531471 478834 399725 253445 207702 165398 238927
10391 238927 320450 312222 410368 451535 500979 401451 333953 416871 362332 331098 366798 480513
10379 480513 502231 530423 567488 609189 628492 556431 603398 687328 812084 880658 957225
10368 957225 996888 1077005 1087308 1118178 1126515 1122297 1250496 1343677 1250874 1429347 1557487
10357 1557487 1616826 1722261 1954898 2132319 2259611 2569458 2959380 3336919 3691022 4029299
10347 4029299 4372961 4903671 5578596 6505008 7582512 9021322 10983004 13218910 16083997
10338 16083997 19841619 24814586 31270967 39937109 50678171 62586287 73231081 78911027
10330 78911027 77178483 69340406 59016802 49097919 40699565 33942903 28763137 24773422
10322 24773422 21613523 19164414 17127558 15575428 14512720 13517594 12730628 12184374
10314 12184374 11551061 11130125 11008162 10979812 11025202 11297009 11598737 11926276 12556740 13430091
10304 13430091 14606290 16129321 18064366 20423722 23537830 27592982 32890954 40018382
10296 40018382 49665303 62952865 81291678 105693915 135741381 165520652 182428369
10289 182428369 176262213 151051396 120530086 93974754 73619066 58786891 47939596
10282 47939596 39860593 33889646 29428360 25742509 22804572 20420278 18310785 16602068
10274 16602068 15137409 13982978 13122705 12443572 11917541 11520549 11234019 11159980 11119730
10265 11119730 11228615 11546785 12108764 12825384 13766334 15038398 16565884 18604889 21214768
10256 21214768 24577445 28971521 34713769 42051577 51120067 61350506 70782493 76348445
10248 76348445 75098151 67116018 56012964 45141912 36133587 29134944 23691957 19547617
10240 19547617 16363896 13889056 11944280 10481764 9206099 7987482 7082209 6221199
10232 6221199 5554059 4912858 4505781 4200672 3872247 3683332 3416957 3203571 3053274
10223 3053274 2889374 2741926 2577231 2411212 2250678 2295099 2383518 2514701 2750895 3304529
10213 3304529 3769080 3815066 3869278 4227735 4552652 4206960 3645377 3326882 3124362 2866008
10203 2866008 2386153 1811927 1530771 1401806 1237614 1228967 1207408 1175231 1162147 1189767
10193 1189767 1156905 1036578 988644 863918 832001 799587 821136 728821 531239 422595
10183 422595 338047 434029 565027 624179 542396 481986 483205 485975 433482 323497 373392
10172 373392 587056 626537 626911 636234 649414 642692 687046 764044 781801 798469 824139 777893
10160 777893 716578 721145 705780 537780 390672 291195 270908 383510 407160 440439 399019
10149 399019 420867 332460 414439 444723 419390 268349 157378 161147 240292 194902 291556
10138 291556 328924 300041 321567 287415 142446 212616 204382 164894 187833 310715 337126
10127 337126 273292 238395 226109 231323 308228 329362 313765 403006 423689 310909 238592
10116 238592 185403 244521 332321 386982 472965 511361 436972 328685 173030 162424 271315
10105 271315 253109 237068 147343 175072 273981 324932 343329 234139 206482 254838 439613
10094 439613 426688 261494 278323 254837 214157 269800 299719 323298 298850 236640 151798
10083 151798 161968 221981 314544 372146 339672 236279 170703 87595 31416 69759 131972
10072 131972 143399 167205 273456 277945 163572 164953 193210 228320 287409 202660 241775
10061 241775 259703 209898 192236 212612 96967 49515 53347 119679 92020 209449 234542
10050 234542 286328 226738 48931 2553 130176 290549 264110 211383 225794 146154 146181
10039 146181 165514 220104 285767 327467 227728 214384 111670 63862 216319 215468 169480
10028 169480 174691 255367 385802 337995 275569 237750 278701 256180 260899 216006 188969 244760
10016 244760 347397 364248 325019 344975 289749 354295 421470 502817 524981 597876 611056
10005 611056 716104 823273 832607 811632 885844 899178 915111 857775 901812 947417 882679
9994 882679 749465 752854 762998 903948 1112598 1208062 1288418 1455883 1552696 1719638 1968758
9983 1968758 2306882 2634610 3061278 3505033 4091884 5099888 6438481 7899216 9627100
9974 9627100 11712572 14223125 16821970 18852955 20002347 20452254 20615708 20737520 21116294
9965 21116294 22271669 24101097 25757146 26346555 25166210 22568069 19562534 17222956
9957 17222956 15789583 15446493 16168800 17687002 20179718 23702762 27851991 32068668
9949 32068668 35785503 39065482 41424560 42431305 42084173 41635306 42418439 44506519 47208555
9940 47208555 49493270 50272709 49072790 46157490 42413257 39033688 36949141 36330189
9932 36330189 36433046 36313832 35779491 35758305 37013963 39575468 42554009 45046663 46910216
9923 46910216 48046900 47880985 45620166 42180535 39754791 39110551 39837077 40860431 41064317
9914 41064317 40372792 39573577 39323367 39935009 41405475 43199055 44498439 44843685 44036897
9905 44036897 42772109 42085987 42513371 43916446 45478997 46263419 46181479 45091622 42333827
9896 42333827 37983796 33387179 29935755 28208284 28595445 31111923 35536596 41367930
9888 41367930 47913500 53459438 56482994 56446417 54572458 52894775 52102470 52009316 52636882
9879 52636882 54170253 56556799 58760150 58987639 56299237 50992947 44715604 39232986
9871 39232986 35701347 34678022 36223930 40094912 45951599 53241473 60353167 65505527
9863 65505527 67890693 68367695 67658410 66107309 64394230 64216283 65706742 68041076 69915505
9854 69915505 70114797 68802519 66719001 64537491 63040556 62475425 62544371 62478876 61768977
9845 61768977 60517393 60156825 61892561 65882908 70500889 73212655 73135051 71219738 68629854
9836 68629854 65243561 61163418 57468275 55611800 55726533 56512030 56721936 56474309 57140665
9827 57140665 59804248 64307882 69535184 73814191 75535216 74429762 71246278 67608882
9819 67608882 65052417 63959664 64246971 64590485 63450993 60610262 56331410 50938783
9811 50938783 44599169 38034773 32502409 28375048 25708406 24564446 25107828 27292134
9803 27292134 30934127 35111339 38386503 39597288 38493684 35994928 33491878 32072822
9795 32072822 31813998 32032573 32091936 31502723 29827173 26853288 23182446 19522201 16292895
9786 16292895 13469219 11050973 9082903 7666606 6752811 5946401 5248390 4754664 4320000
9777 4320000 3904814 3584552 3370103 3257483 2977653 2638115 2360049 2062104 2007592 1961168
9767 1961168 1870706 1811096 1633438 1464941 1465278 1516863 1457866 1397820 1459951 1511817 1437286
9756 1437286 1377324 1353641 1297791 1307892 1271911 1280790 1275915 1246747 1377771 1348900 1338216 1288130
9744 1288130 1172225 1058330 938874 914130 873671 918643 944322 863505 907677 871154 864246
9733 864246 785756 761162 793534 803387 841556 886431 904785 879041 725512 709350 673010 655790
9721 655790 619694 671903 686584 590404 628702 758057 792331 796927 783764 779012 655275 560807
9709 560807 584772 566350 562103 525254 480076 429411 432294 521049 563899 583388 638834 686156
9697 686156 655567 605500 612345 650386 679283 644416 607135 625459 668675 611795 612215 620628
9685 620628 547311 556568 543619 565402 640833 612747 521493 484797 405204 363949 377451 449439
9673 449439 489564 527986 563655 545668 553538 599054 645952 668656 668476 621088 711881 787387
9661 787387 678778 781687 692612 719164 744996 808345 852252 782220 675485 670094 671200
9650 671200 694572 701247 772132 864440 833104 789057 806696 901235 867642 821137 860277 896655
9638 896655 858492 882919 1011601 1115353 1109456 1169237 1252249 1378736 1288364 1196568 1132973
9627 1132973 1222218 1213657 1232294 1258990 1352519 1578715 1813029 1951676 2159890 2349793 2380821
9616 2380821 2589135 2978223 3298141 3541319 3918719 4525714 5374315 6248666 7386475
9607 7386475 8871782 10493430 12460237 15175329 19104292 24499108 31693579 39989528
9599 39989528 47337122 51367179 51673386 49723232 46026268 40297575 33648881 27522346
9591 27522346 22853801 19462643 17171210 15845904 15357742 15477104 15488152 15363647 15748842
9582 15748842 17135297 19127767 21900552 25454565 30114699 35772196 41478953 45917725
9574 45917725 48274664 48692757 48229415 47197653 44737064 40492661 35485842 30637029
9566 30637029 26454057 22943892 20287318 18642878 17795964 17664460 18072126 19159654 20830025
9557 20830025 23182737 26395823 30672936 36608083 45011249 55837581 68067942 79674798
9549 79674798 88153870 93455517 96610099 96593445 91998915 83723299 73235762 61389483
9541 61389483 50479799 42051317 36310780 32384969 29535719 27800684 27263674 28099772
9533 28099772 30064041 33208498 37737370 44101784 52512605 62628324 73213304 81802742
9525 81802742 86843833 88964096 90627751 92543976 92301522 88416286 81742925 74330850
9517 74330850 67775881 62839975 59345486 56453477 52960206 48862244 45099818 42474619
9509 42474619 40767243 38894725 36687251 34859937 34312242 35259031 37665317 41140736
9501 41140736 45264521 49111908 53076116 56925302 59685806 60057595 58126313 55412322
9493 55412322 52795695 51238682 50854115 50855652 50324317 48117523 44534560 40840038 37526254
9484 37526254 34598156 32355480 31109546 31291280 33094923 36333664 40330496 43924853
9476 43924853 46220402 47933427 50411682 53729287 56578210 57992041 58287259 58459647
9468 58459647 59259729 61361585 64374674 66883237 67540177 65925380 63378754 61281099
9460 61281099 58884645 54470461 48177291 41068395 34463902 29008707 25039836 22264013
9452 22264013 20257425 18867588 18206496 18277872 19183445 20835605 23176497 26717544 31830766
9443 31830766 38400130 45632311 52839493 58607912 61193487 60601879 58338267 54885213
9435 54885213 49035571 41361908 33595081 27150486 22426450 19111466 16743902 14774963
9427 14774963 13345441 12356624 11589316 11120898 10952284 11405555 12479857 14223550 16700341
9418 16700341 19717051 23239451 26543619 28941685 30122530 30704843 31003917 30542169 28723437
9409 28723437 25741814 22186023 18701350 15703699 13238295 11458461 10208998 9187002
9401 9187002 8514969 8333974 8383680 8728519 9497397 10735185 12416132 14881599 18321090
9392 18321090 22410234 26450827 29477626 31262102 32014977 31337511 28502028 23784634
9384 23784634 18719207 14563594 11736480 9932488 8571898 7351317 6284574 5476215
9376 5476215 4758782 4127564 3720765 3318851 2970896 2737996 2391237 2236442 2156883 2021045
9366 2021045 1864038 1762355 1720454 1671801 1626337 1497072 1447914 1464789 1366337 1226248 1019199
9355 1019199 937915 1049225 1132191 1124913 1161273 1137418 1099100 1057560 1001102 951584 880944
9344 880944 963703 1038536 1068286 1028569 1008964 987371 947693 973319 990288 915129 798768
9333 798768 720629 873645 915629 921660 866360 855041 823945 729984 588711 632776 605713
9322 605713 520239 441828 493028 535984 664144 607578 728147 818705 811318 792159 741119
9311 741119 786805 790002 752000 814251 857483 865725 783502 635906 665518 671182 658511 683076
9299 683076 713056 568125 555289 514816 600789 560163 485686 495264 638715 651259 675850
9288 675850 726249 743775 627935 526694 577203 625725 605684 648369 658659 768741 733354
9277 733354 698609 697507 727220 693146 721985 762563 735765 742872 719534 628251 611213 617803
9265 617803 599710 605753 692044 773945 772968 744616 752735 707935 683174 793123 885880 804414
9253 804414 676626 646449 627712 677770 773061 746637 672628 716139 705466 757034 729650
9242 729650 694291 780593 888309 947873 931041 896807 916765 818361 795380 867889 1000289
9231 1000289 1093112 1087290 1028975 1003620 1088342 1283861 1407507 1478130 1521825 1744222 1890650
9220 1890650 1924240 1998531 2146616 2207173 2271422 2377914 2623647 2982343 3316919 3627170
9210 3627170 4026110 4501585 5163135 5816699 6534062 7548924 8777344 10346988 12501343
9201 12501343 15423783 19183573 24318088 30998647 39802186 50601644 61875881 70279863
9193 70279863 71747914 65478100 54737568 43820732 34659001 27586714 22258718 18468493
9185 18468493 15557672 13105164 11157461 9623997 8356062 7370220 6510665 5724090 5061940
9176 5061940 4495815 4089242 3763250 3440986 3110696 2868763 2616326 2447740 2346004 2238084
9166 2238084 2057605 1991981 1984782 1882367 1785553 1720355 1560110 1372081 1421738 1385387 1311874
9155 1311874 1162799 1085881 1037588 1020934 1069913 1046906 942599 894920 841853 839535 914936
9144 914936 936185 976284 1026355 1065150 1063314 1016915 1046461 1098005 1127029 1101511 1117263 1033627
9132 1033627 1083189 1115924 1056953 943576 821444 720949 640534 630626 649429 533637 498184
9121 498184 523377 534323 545002 567539 595675 672867 723143 799080 712071 680915 806551
9110 806551 861320 947573 923184 878534 820179 769722 700035 635471 643035 615696 643981 692331
9098 692331 607897 526493 579562 644781 595372 490151 433479 394555 439272 291078 363675
9087 363675 528279 534470 507231 461190 590411 586103 480551 514370 552268 456638 461990 571280
9075 571280 696210 631185 468031 375693 405052 432513 444948 422821 509073 598598 624099
9064 624099 581509 579024 634174 658423 608439 600538 612024 605363 549049 481519 505879 550561
9052 550561 435984 427493 579193 584890 628252 672888 557266 511862 429579 289025 238562
9041 238562 191250 87222 65803 236766 327081 298465 369960 421529 396949 348947 397885
9030 397885 482140 608430 703281 646475 604089 625189 599179 532507 524698 546902 448804 443175
9018 443175 313284 215673 319632 342008 315071 245466 185145 198478 171011 196480 179802
9007 179802 262713 397733 407895 354157 249315 312426 281154 224707 260538 315745 320213
8996 320213 332690 425544 365292 324014 263891 267166 372668 441718 285271 209471 191963
8985 191963 173359 133820 157897 113274 54064 47216 99035 209436 238077 331412 381193 334945
8973 334945 335145 285911 156048 166867 177060 115499 131140 122026 181772 278799 343152 345033
8961 345033 270225 133983 65962 142112 189260 265665 245008 127040 94056 137957 165774
8950 165774 162846 199968 264301 193512 169590 147106 146459 223114 163107 223217 247816 190230
8938 190230 237111 267786 247443 186792 187082 226045 310159 210290 118097 77555 98991 136672
8926 136672 195559 158863 114692 127956 188935 301911 374953 320445 315770 305020 346425 343376
8914 343376 294765 263282 224694 256764 253031 219099 190332 244826 278490 370491 452620 578478
8902 578478 581922 575922 533323 513674 556796 573732 422989 510915 677261 776868 938452
8891 938452 1065324 1133295 1302811 1463310 1617155 1852086 2258422 2865767 3807028 5314523
8881 5314523 7701344 11762041 18048606 25905207 30045802 25576962 17441187 11204614
8873 11204614 7549004 5471475 4240138 3450371 2911847 2429585 2136649 2014787 1844069
8864 1844069 1654978 1486886 1346831 1167627 1055847 1004189 870116 692255 681555 669703
8854 669703 624981 564117 561004 396221 344430 320375 425528 477638 358394 329219 411833
8843 411833 466633 460726 515221 384990 291866 304602 346650 273925 208221 223280 209319 354423
8831 354423 420711 315978 295178 301776 391060 404871 318899 274818 260071 190224 209572 213879
8819 213879 288472 275268 172792 119205 186348 174139 96704 55621 -19521 3394 7748 -21818
8807 -21818 28786 158621 193890 131357 171462 306729 284261 245489 193195 118064 81096
8796 81096 125360 157930 186741 169061 139320 107427 37962 -215 21186 -21399 -52036 -38459
8784 -38459 -77515 -119697 26657 222736 194537 69044 70796 166942 263084 337723 367808
8773 367808 279400 182991 196644 146988 183188 282687 296300 249684 132597 82035 95421
8762 95421 161312 192072 213063 230113 222226 185472 247861 230377 195675 139597 146324 76763
8750 76763 -3883 -27769 99861 236903 149157 97867 114329 109473 149174 182759 80434
8739 80434 17919 210366 285309 277296 246110 201441 163903 249399 301470 323406 418997 406576
8727 406576 238605 117995 136223 261614 327248 209241 133393 184033 134726 172476 241024
8716 241024 160743 55858 90801 121970 40073 -52895 -109318 -139365 -87723 247 87448
8705 87448 115126 157510 86211 110460 111793 129713 180833 189018 149795 64726 119993 241143
8693 241143 255154 274551 366780 394114 471759 459516 432363 506466 525462 623161 710034 733351
8681 733351 538122 432481 404432 192416 174555 222722 181919 203734 335353 379313 404985
8670 404985 422395 315747 306781 288180 237144 268982 190531 150393 102970 146778 144744 36446
8658 36446 -30128 -76792 -27752 -12080 47363 34552 11987 57995 55343 1039 -11863 39299
8646 39299 77724 118117 178355 178806 186201 158692 152615 167497 199651 205119 247603 262473 186071
8633 186071 86374 67421 136753 175254 73046 22189 -76388 -131961 -115738 -88610 44254
8622 44254 162885 204080 231230 101828 158251 222735 200119 277311 230411 88539 104199
8611 104199 188476 130963 185996 168359 195082 208194 223999 353570 466248 467631 468743 396322
8599 396322 426351 459508 541420 502973 499736 517533 530614 405898 349897 308140 276888 293609
8587 293609 333656 337863 212174 213156 277716 369061 339285 271186 287069 195525 99399 -43383
8575 -43383 -102215 -34655 20682 103178 110753 141261 105538 140202 114503 165510 141250 81960
8563 81960 50633 97479 30531 -79109 -69457 -6298 13724 -35136 -145383 -165186 -181052 -174697
8551 -174697 -132510 -139791 -105204 -31551 -34503 -146053 -56066 -38562 -71903 -60994 -128304 -105835
8539 -105835 33944 176852 113835 116575 190432 202772 160300 109150 126613 177448 163688
8528 163688 55300 48883 45969 53376 126078 212240 112453 48259 101827 48600 -30309 18480
8516 18480 117290 95264 59428 50562 98956 179149 147043 63438 117632 112556 73184 42311
8504 42311 -41266 -10088 90332 76266 174508 157158 116512 92076 86206 138703 102233 34674
8492 34674 42914 25544 -22108 -45069 -50669 113343 82344 13765 201432 318323 230770 163152
8480 163152 176907 215983 290019 312877 242528 122627 108091 190431 77424 -8693 125163
8469 125163 185123 199293 139411 48528 80171 60123 97711 42615 51064 87176 122312 116318
8457 116318 66697 -34594 -29600 37284 1463 -96218 67097 187201 107405 -6579 4664
8446 4664 72904 91767 105106 183195 91446 7655 -17251 -26258 -42783 30325 48640 76959
8434 76959 126507 185996 74752 -55260 -146176 -122239 -6612 55422 81777 103678 113911
8423 113911 25878 12546 77372 112991 163448 156027 146763 102705 46241 55773 27104 -33377
8411 -33377 -147807 -210519 -210934 -84118 77452 113076 65123 -15442 -26815 83508 132292
8400 132292 77166 85968 84894 39665 56331 96808 128330 55921 43345 73030 -42968 -110168
8388 -110168 -35308 -1740 25416 -56939 -86620 -14267 -1831 57734 130981 1832 -84096
8377 -84096 -21098 -14768 -8700 -17284 -124183 -72325 357 51822 113867 100278 -4934 11623
8365 11623 15060 48318 112460 147415 109385 -49191 1122 91332 112429 110064 -35784 -189591
8353 -189591 -212796 -120236 83958 151880 77370 71133 -59219 -20387 48402 -5867 -99684
8342 -99684 -93011 9044 155085 182623 179017 212901 159406 117501 88671 136521 133913 33611
8330 33611 -32478 18233 8769 -69172 -86657 -37670 -36443 -8443 4766 6423 -34109 31330
8318 31330 13650 18532 45370 -2234 7461 -16258 78257 113199 74630 92566 41097 -49777
8306 -49777 -9410 -7530 5125 -55812 -143692 -101889 62161 29746 -43570 -63054 -2694 -46836
8294 -46836 -65735 10497 54993 95983 138744 196939 136021 -26469 59741 112498 95359 49018
8282 49018 51923 47355 151959 201916 193804 157312 58611 115436 69208 -11297 -133039 -121437
8270 -121437 -197122 -129254 13557 95124 86426 30017 72181 16527 9417 18638 32126 34517
8258 34517 76276 96591 81154 116574 150616 112091 97514 303794 278977 195704 110595 23887
8246 23887 -72258 6258 161024 200551 81635 15913 -51693 -22397 120504 186666 114778
8235 114778 46952 92008 185739 261760 246248 177477 113869 -29690 -67847 5283 -37034
8224 -37034 35883 155584 128430 204981 183286 143944 57772 -36772 -35729 -97407 -5737 62635
8212 62635 156919 115653 39619 -10382 -13578 -17402 75204 82730 119178 66237 22405 -91963
8200 -91963 -99015 -77487 -25640 -1418 -4814 40441 86543 86241 39609 -32409 -85881 -120838 1783
8187 1783 69084 150400 140116 152231 79763 76430 1882 -44410 91745 46816 -7634 -38426
8175 -38426 56902 222302 326716 365505 286851 98997 -501 41521 14479 -79551 -103886
8164 -103886 -88385 -147398 -134776 12643 99618 115422 170578 167463 156660 157151 43825 33596
8152 33596 2100 53634 137342 125927 29404 37768 135664 61722 -3203 30083 -22712 -133117
8140 -133117 -122571 -43647 15049 67153 63033 67880 169278 213613 178090 245936 251509 189598
8128 189598 84747 -7984 114655 128489 180160 359012 378241 304465 354491 281162 188387
8117 188387 177282 137810 74281 26020 168740 292683 218750 192729 152312 152536 27815
8106 27815 63651 110874 100629 -12017 94 150371 183649 136312 182900 101428 190637
8095 190637 337892 367052 323025 202083 77651 100754 189242 277127 321047 201790 142383
8084 142383 126548 -33512 -18102 -34029 -72278 -99959 35619 16197 42440 105920 61680
8073 61680 79440 166391 102341 39029 -39045 -40297 1259 -29403 -36189 -49846 -12564 41266
8061 41266 44840 62876 71738 -75379 -177973 -76057 65606 78849 30442 -40577 -68635
8050 -68635 -82777 -124003 -43659 11293 42001 34962 83848 26098 6496 37067 8281 35733
8038 35733 68546 -12913 -92698 -178429 -265916 -168683 19442 93601 22399 -38677 -49597 -32143
8026 -32143 -18460 40791 171859 133638 32627 44811 164887 83319 -5867 54307 40673
8015 40673 50365 37547 64523 108960 38086 -90753 -131060 -101815 -42076 -8255 89954 72295
8003 72295 126453 137758 237060 264743 115732 83716 112519 55477 90686 77852 152908 171500
7991 171500 35417 5008 18771 55959 -29338 -91093 -61081 -48390 -27082 10261 107789
7980 107789 137211 195948 222959 226249 170106 228128 259018 220298 90762 47815 63071 156668
7968 156668 153959 133209 311979 213490 116633 136530 132051 173109 189266 73223 113504 179537
7956 179537 295922 194193 12731 9345 -365 -74169 -15176 8212 109535 176912 232229
7945 232229 226313 116114 96633 130443 108211 13378 25845 111145 103999 82064 59852 160579
7933 160579 297668 288566 197165 -4609 5145 81973 113421 217826 260706 191018 91181
7922 91181 -8691 -43866 -44096 91719 261948 284778 134082 82818 1998 -64672 2459 -33046
7910 -33046 -127494 -131425 -68584 -25107 34935 125734 280304 341276 246633 319529 417461 315251
7898 315251 238934 237090 138349 66533 56507 17558 72387 72132 -1858 -43653 -34788 30656
7886 30656 91528 79723 88882 102725 67346 28539 70192 103561 130182 174810 176455 149816
7874 149816 61911 -1990 -137790 -175572 -190423 -50070 13073 -25392 110 -27888 -116528
7863 -116528 -144927 -105885 16935 1640 -52100 -58883 -160187 -104107 -21093 66835 115604
7852 115604 158544 84075 47109 51568 24402 104513 152386 96409 75983 4759 -96548 -141927
7840 -141927 -10444 27830 60087 78249 22446 58874 88777 112110 19114 -2298 -45614
7829 -45614 -55367 -46141 -64381 -10717 -14495 -134732 -122019 -120974 22543 84697 108754 54223
7817 54223 76707 138117 70635 -45977 -174562 -148915 -92508 -103239 -73953 48357 66227
7806 66227 21280 35899 134180 130727 124883 94268 94555 63626 4320 -66434 -74358 -82010 -93181
7793 -93181 44039 149983 92049 26685 57711 -9960 -108193 -121942 -61479 -62412 -42529 -6913
7781 -6913 90155 -711 -45614 -31286 32277 637 20236 19033 19434 107826 40700 43431 51593
7768 51593 -15523 4159 108762 99415 -64436 263 58835 9625 36101 96482 87221 73925
7756 73925 25576 63752 78254 107408 181432 134007 68071 116356 113794 -16750 -108505 -232556
7744 -232556 -206885 -96678 -121054 -49176 -94872 -90527 -37446 -63260 -216225 -245794 -194499
7733 -194499 -107956 -46709 -105306 -94484 -106881 -23620 -5107 84458 53900 88041 131785 151431
7721 151431 117300 119794 86910 50064 -84 46928 4116 -121821 -126570 -108841 -31727 -20754
7709 -20754 32851 158803 263721 267165 137682 53879 81304 77177 77472 40264 30907 33879
7697 33879 14072 9426 10829 30295 138116 119843 -35986 -67988 6901 -19057 -74437 -83468
7685 -83468 -22453 -66540 -129516 -71946 -11195 -12093 -98775 -42117 63568 -4256 -79451 -171506
7673 -171506 -209622 -71304 -41679 -36851 34965 71212 15937 36894 59547 56941 61438 116025
7661 116025 114425 16670 14878 50151 120648 94018 64245 66792 -18139 -82805 -4986 -5586 -40340
7648 -40340 -8616 -22675 11230 23171 3216 46785 30136 72862 133484 43651 -26344 -104029
7636 -104029 -176012 -31852 206546 108239 13537 -106329 -54767 -34798 -94019 -6143 53440
7625 53440 -113920 -226544 -176354 -101648 13031 15062 -39241 -76365 -115488 -95378 14946
7614 14946 113060 193782 167957 241793 206605 53538 -18209 -2392 21021 100645 124515 174223
7602 174223 164197 52491 -80987 -159377 -189822 -119823 -595 -28442 63372 180108 221360
7591 221360 222528 126567 60888 147949 227631 172898 -5862 -159059 -45330 76088 36841
7580 36841 -90504 -64571 -76143 -8742 59839 51824 -61487 -83681 -111596 -167135 -180866 -68159
7568 -68159 40141 8675 68990 48341 64065 67769 -2017 -112194 -114958 -37671 94581 182944
7556 182944 243200 144570 114425 15534 -7879 -23601 -61637 -59462 -108689 -225930 -143182 -109858
7544 -109858 -9732 -9720 12850 77133 103595 -4430 -35342 2310 -83342 -159663 -149379 -164564
7532 -164564 -140239 -77388 39180 14919 62025 48544 60255 -12950 -29407 61722 205544
7521 205544 135437 -33347 -69151 -128515 -163355 -157067 -200536 -259593 -129531 57054 81238
7510 81238 89270 47654 82774 175082 154393 122835 69295 7932 2292 47536 41951 64325
7498 64325 53959 -11657 -68781 4038 62394 70331 99084 92300 32672 29280 81810 89174 102529
7485 102529 87816 113915 92551 -14447 2290 63821 -69525 -29774 111550 62412 2854
7474 2854 -18251 19056 66464 78203 108251 176900 188446 177362 120149 10121 39871 126385
7462 126385 140060 147446 85710 48140 8057 15521 -8775 78412 98478 36568 -178 -84449
7450 -84449 -61853 -31283 3928 93819 72962 169641 201926 197523 51707 -55648 -83075 36379
7438 36379 151723 96822 147558 169618 186408 152629 143449 190442 189761 126374 117646 101703
7426 101703 98232 109882 129150 157442 63931 -29689 49147 34377 48514 -715 65141 2288
7414 2288 -29221 -2063 108689 170654 102486 -76321 -100293 -37105 70465 133636 86174
7403 86174 127360 119366 107971 87351 5675 -25934 -53462 -74618 -52474 4903 -27724 -116283
7391 -116283 -87436 20127 24173 -49782 -23137 -13939 -32365 -116523 -142764 -22322 109635
7380 109635 138909 160732 70020 51696 17419 -66935 -85841 5388 51641 23661 -10186 -13471
7368 -13471 -12444 -87124 -83442 -90728 -75779 -2418 -20981 -69860 -123319 -62125 23278 -71361
7356 -71361 -163265 -136557 -31619 81734 160191 197148 96713 112972 140618 72868 94945
7345 94945 105728 62527 13374 134213 45893 -22360 -320 -41929 -122253 -103238 -41348 -139648
7333 -139648 -88104 33721 53014 -136799 -197610 -210939 -114582 -133697 -39952 37913 5478
7322 5478 -8097 -87894 27411 50802 -32611 -43294 -72798 -51535 -90817 -64866 26704 82195
7310 82195 72729 70170 32495 -93383 -75100 -130782 -236277 -222474 -196497 -233903 -319049 -209099
7298 -209099 -154827 -128826 -90642 744 71433 27114 34911 48925 9105 4851 5203 -33418
7286 -33418 -39812 -92696 -70830 22511 115215 114503 74935 91700 65136 127522 178656 160354
7274 160354 101569 23319 -18706 -51647 -28823 -89538 -182463 -241044 -204708 -104124 -35036
7263 -35036 -19917 -101304 -93643 -122208 -96470 -94721 -51305 -16091 -127071 -78553 83346 190026
7251 190026 136184 -61716 -34863 20636 54082 159342 154050 129798 52034 60144 41306 9454
7239 9454 -43898 49129 146249 70696 -25463 -133015 -244182 -145043 -78551 -140858 -147134 -99202
7227 -99202 -81914 -94179 -72600 11606 -40044 -126011 -143140 -119766 -169973 -87048 -989 -10475
7215 -10475 -72896 -126839 -178919 -98516 18824 678 -109139 -182732 -106096 21603 100642
7204 100642 24128 -84362 -66537 -60929 -25064 -75704 -27215 -14224 -100494 -91105 -46137 15766
7192 15766 67430 47884 21962 -18612 -84232 -125479 -80655 -176254 -119835 -87553 -74982 -5534
7180 -5534 19421 -9842 -60259 -26318 36196 24969 25726 45889 103241 154080 176889 180978 61110
7167 61110 -47258 -4111 -9918 -118892 -51018 -54194 -88002 -95630 -106621 -173195 -137264 -190025
7155 -190025 -235939 -312342 -221272 -89347 -10641 27062 -132336 -242626 -109462 -15294 -17432
7144 -17432 29724 -9712 -86671 -97652 -105068 -21336 73473 106328 120924 166279 182636 116904
7132 116904 46094 -14122 3050 -8179 -35790 -60459 -24014 -56645 -4026 102454 192320
7121 192320 311139 106231 -100157 -27907 -35420 -89219 -101918 -126074 -27413 84592 121836
7110 121836 25839 -41062 -129257 -131249 -156518 -239706 -154406 -94324 -85586 -152643 -129445 -91139
7098 -91139 -125916 -36990 6236 -48151 7560 67371 103955 90733 -54004 -61139 -128979 -77166
7086 -77166 -73793 -42559 -86667 -174095 -126847 -76995 12734 114364 161453 92876 149025 226345
7074 226345 173953 59241 17854 -27665 -26415 -78603 -98608 -80471 54542 193836 174497
7063 174497 37463 -142419 -161019 -57885 -51720 -28330 45813 -490 -80572 -55360 20401
7052 20401 24687 -53001 -62905 -92318 -71926 -116223 -111270 -15058 -5006 -59753 -116706 -127088
7040 -127088 -160108 -105806 3302 78583 92363 15107 51422 39008 -119898 -152463 -114374
7029 -114374 -103543 -23491 27732 2739 -36713 -36456 1715 29412 126446 39845 46605 78308
7017 78308 40165 111735 158283 163327 55329 -41395 -128871 -100158 -128929 -181276 -130755 -19720
7005 -19720 -51327 -118167 -129342 -84257 -104053 -25422 4382 58739 56873 -14730 -15908 -43232
6993 -43232 -51108 -123530 -235315 -190757 -132174 -187141 -67345 -8435 17624 38392 184107
6982 184107 179068 68675 87199 3156 -51920 -102849 -96047 -55958 31922 92444 25449 -107547
6970 -107547 -74365 67097 103506 18995 -97189 -151889 -113138 -38861 -48934 -7292 83291
6959 83291 107987 -98196 -111029 -10615 -22461 -59072 -29018 -22947 -11341 -28989 90779
6948 90779 128127 120117 119819 60701 51745 21776 56060 108390 174587 28391 -78285 -35493
6936 -35493 94938 140887 26391 17665 -58310 -18486 55764 148277 206797 164944 152832 156907
6924 156907 185503 306945 231456 96533 110443 224577 193579 95857 78812 39466 -19117
6913 -19117 18922 78878 26396 -143016 -178122 -72885 71815 169223 79804 -59626 -220106
6902 -220106 -253121 -22142 130639 92159 -9790 -5929 31193 8048 26139 -37033 -56061
6891 -56061 12203 115055 240501 135592 55693 -21755 -12283 52852 62869 27387 -14900
6880 -14900 4938 92296 30547 81488 67353 -200818 -217535 -84468 22015 20867 87045
6869 87045 139338 87948 94492 116797 54612 -36663 15495 51042 90874 -55144 -102268 -80178
6857 -80178 50447 61409 12950 17531 -44197 -84844 -14472 -60953 -126957 -115277 -51437 -104874
6845 -104874 -9557 -1485 -30830 14403 4698 -113950 -67228 -35599 13210 76404 99784 71532
6833 71532 96580 134765 110094 35466 26966 -25421 -115586 -135707 -175909 -129091 -77700 -111320
6821 -111320 -52259 -81867 -61851 -30387 60944 23750 -8829 -54772 -33239 101143 37738
6810 37738 -75543 -64522 -68508 -88483 -65005 -45539 -108996 -101009 -11972 -25097 -4190 20238
6798 20238 -24906 -119974 -191557 -156583 -36296 9862 15968 15841 95224 134021 149647 129803
6786 129803 135149 151341 108064 -16381 12192 -6153 -35337 89979 67518 13915 60111
6775 60111 64533 56766 34458 112386 102469 99756 -20845 -36775 -92723 -89494 -108088 -187964 -100856
6762 -100856 -87458 -32662 -14049 2371 140530 103351 73528 127779 130180 7946 -7871
6751 -7871 20192 70474 44315 58030 -23440 -14190 -133823 -176050 17783 64364 100 -63377
6739 -63377 -132558 -65985 -38651 -17805 -40964 -27609 -5292 -93469 -108266 107839 145011 -67565
6727 -67565 -105183 -94370 34327 73782 136518 141447 159700 126773 132544 74437 25860 -2218
6715 -2218 102743 72267 62371 17209 83187 125729 103734 97494 -5720 -44865 -22353 -24831
6703 -24831 20126 99976 -10913 7729 -15224 11364 71524 57685 24507 66687 35080 14887
6691 14887 53228 43352 85014 42803 74597 -19173 -95511 -34591 130994 184758 92163 81430
6679 81430 123157 112441 76916 -29483 -114218 35018 81787 -39203 31642 114183 15381
6668 15381 20822 19980 -2090 -68428 -3034 55826 145699 197319 101277 -104204 -118610 -86581
6656 -86581 -168194 -103638 -30521 -56389 1658 32879 77222 72783 94054 82729 44502 -39106
6644 -39106 -91818 -94151 -158887 -128085 -1983 -71401 -151069 -99441 -95906 -135807 -150369 -180872
6632 -180872 -146728 -60778 -159470 -202469 -85613 51307 30110 45663 43348 -25966 -81932
6621 -81932 1614 107000 101969 102611 128908 85181 60980 108669 238851 467754 762529 1374580
6609 1374580 1523194 1001741 554549 339720 121461 61365 33999 -919 45375 61502
6599 61502 81619 97283 68179 60582 -10928 21377 162927 99798 19028 -82920 -112130 -211051
6587 -211051 -335255 -328318 -236868 -68829 -5060 -104568 -172864 -170021 -79833 454 68431 121722
6575 121722 57098 48669 100221 83273 -103586 -198603 1485 69756 -14310 87476 144321
6564 144321 10890 -123610 -53663 73840 13919 -24317 36473 96604 119643 9314 -27990
6553 -27990 -49391 -35210 -20593 -49339 -44309 -13213 82191 97586 138030 120873 -26298 -53122
6541 -53122 42438 -2132 -29621 87839 78314 74418 103135 30776 7915 -41733 -16051 1985
6529 1985 -66452 -148878 -151765 -116182 -67389 -17387 36203 35892 -4369 -10080 38420 -24506 -74168
6516 -74168 -148476 -226737 -219595 -87195 -61938 -43841 -14306 34248 53000 85415 44388 -16131
6504 -16131 -89910 -52395 22028 19475 59022 15024 -911 36352 91218 11834 31972 24797
6492 24797 -3863 22249 13560 -76223 -48591 -54459 -77318 -65715 -155058 -88920 -65222 -123448
6480 -123448 -124041 -97122 -125391 -50284 3124 92715 130733 72189 62895 119442 154777 154024 62421
6467 62421 100475 61889 -56951 -94421 -59824 9330 91992 67290 -77620 -103809 -89202
6456 -89202 -93042 2927 108909 90999 -25688 69463 33186 -93532 -81406 14835 67524
6445 67524 106921 80829 5758 -77697 -149063 -36544 -87542 -90899 -36582 -53550 -164019 -167222
6433 -167222 -125349 -13717 109821 240177 69998 -56674 -55790 -81664 -93559 -150278 -116751
6422 -116751 -49434 31197 58834 59496 16619 -31562 -84075 -116529 -61313 -59609 -28670 3248
6410 3248 -13744 33192 22434 -32633 -49555 -6907 12790 -49259 -93825 -136982 -133546 -132260
6398 -132260 -137592 -119195 6092 166177 194891 98286 29646 72672 45560 15502 -28707
6387 -28707 39378 54069 128535 190870 246680 228403 96946 38245 114391 164057 134562 -56441
6375 -56441 -80854 -95618 -141388 -172849 -153296 -189492 -159282 -160384 -184059 -168655 -41600 90028
6363 90028 156076 60001 4226 80978 18599 -5898 -98037 -128472 -117073 -163873 -142462 -155599
6351 -155599 -231843 -152834 -40632 -41062 -199320 -226233 -285712 -147276 -60777 -75095 -96286
6340 -96286 -81533 22895 -3169 -62390 -49647 19718 56451 31847 86508 115045 28714 142977
6328 142977 192062 136175 180749 32739 -33400 -64606 -149245 -126269 -35499 -28482 -105056 -97563
6316 -97563 -78051 -82255 3382 49831 -18436 -25621 36004 61376 7098 -68838 -106355 27511
6304 27511 -20179 -112789 -48591 -4477 -8671 -15258 10320 15542 -19061 -15680 -16307 -35779 -17166
6291 -17166 -41135 14214 -65256 -81384 -143305 -141779 20120 58113 49783 -36471 -83296 -30534
6279 -30534 -20235 -87657 -100652 -61592 -40575 -30512 -20325 40358 93871 130660 44840 -68609
6267 -68609 -153509 -182993 -230232 -150047 -46375 -124260 -289460 -213151 -189826 -213369 -151922
6256 -151922 -51822 -12034 -30523 -50446 -9690 -49491 -47138 24431 -15509 7305 80457 67557
6244 67557 -632 -40316 40051 62070 -23504 -82047 -127968 -152503 -92205 9485 25052 179247
6232 179247 187625 46113 50132 60445 70963 34026 -38518 -15555 4106 -55777 -137886 -160657
6220 -160657 -119979 -94763 -183613 -229839 -226365 -85079 -63860 -17940 -39985 -86399 -27063 -61704
6208 -61704 151143 163735 128567 24300 -130316 -238540 -248841 -80710 -56172 -69638 -66975
6197 -66975 -91032 -127758 -125151 -141620 -127429 -75527 -148330 -189474 -114582 -41431 39297 47799
6185 47799 -22716 -107461 -126282 -46843 -85407 -28839 -13093 -93919 -80763 -163202 -142038 -154013
6173 -154013 -196415 -63013 48226 13013 83301 52293 36413 78733 -5305 -177877 -220892
6162 -220892 -81363 31407 83065 123071 35912 -26418 -62036 -52672 4023 -44194 -46282 -101507
6150 -101507 -167538 -131222 -138557 -106240 88635 127594 127600 58116 2184 -164741 -190897 -130582
6138 -130582 -72455 75915 123689 179964 20877 -73827 -57730 -63483 -63228 -77745 -138996 -159165
6126 -159165 -97881 -53662 -71581 -96612 -257540 -247809 -156935 -254767 -232525 -101136 -103786 -87487
6114 -87487 -1757 -7589 -103645 -145231 -73373 74595 52037 28082 103062 61815 -20841 -55891
6102 -55891 -76522 -99465 -59017 -47636 -29499 -80881 -110028 -165335 -200677 -107289 -115112 -21671
6090 -21671 9017 -16052 -27254 49509 107333 11390 -132718 -263941 -210417 -204241 -196248 -66198
6078 -66198 21856 -30477 -38820 -62773 -24006 -21221 -32214 71915 110638 97500 67943 19660
6066 19660 39507 124169 97084 -60392 -38066 -70629 -92547 -158023 -35705 -26451 -122921 -196815
6054 -196815 -239617 -131091 26149 42141 -20343 -207050 -310423 -222212 -92139 -99165 -178554
6043 -178554 -192782 -188108 -159574 -69526 -22677 -11596 37783 32926 25132 -51459 -71841 -76710
6031 -76710 -51035 -28555 -18543 27543 40605 41039 -43652 -74115 -90221 -34304 -22163 -25040
6019 -25040 -104284 -153414 -274353 -326291 -240445 -165121 -73180 14777 -59256 -23907 -57080 -95427
6007 -95427 -20458 11758 27435 -38 -41107 -64796 -120940 -322692 -373714 -111076 38243
5996 38243 7248 -14855 16783 -104549 -169269 -115330 -100607 -153837 -105279 -99976 -57304 -22633
5984 -22633 -41131 -63617 -38265 -134460 -49706 -24518 38100 47188 91324 97622 156655 157449 30569
5971 30569 -25133 -22907 -30805 -199360 -228198 -116327 -43641 34794 59408 51712 46034 84475
5959 84475 103621 45275 -121843 -179538 -83740 48134 62770 6923 -52295 -13606 -30162
5948 -30162 -148329 -181154 -237623 -182133 -145562 -152832 -122999 -62524 -31665 -31744 51152 30382
5936 30382 -15844 69820 58251 43804 -7760 -59346 -128013 -64344 -43185 -42788 10767 -641
5924 -641 20208 -73754 -226283 -85346 28069 32499 18828 -62185 -99496 1585 -70641 -1191
5912 -1191 75247 58234 134769 243663 188157 97571 162248 128506 8310 87160 101174 29716
5900 29716 -69253 -42849 54151 -547 -46497 -96787 -126709 -131560 -40306 -54781 -209617 -207640
5888 -207640 -31566 -20380 51489 149527 170640 121062 13405 14941 79017 83819 19196 123412
5876 123412 140752 124345 146854 142744 54148 -89048 -150558 -98577 -62440 -96988 -117349 -98452
5864 -98452 -89392 -114299 -28539 99363 103883 43926 30933 53886 -46946 -87720 72524 114413
5852 114413 6456 46116 8575 -8140 47992 29522 59103 118334 113134 55430 -33246 -44617
5840 -44617 -53307 -18027 14154 -41928 -97051 -14737 44387 -26394 -143398 -193792 -118872 -48363
5828 -48363 6956 -25445 -52298 -49464 -46032 -23712 14591 64684 67298 -44170 -29567 -28967 26593
5815 26593 103894 24985 18577 -54897 -174358 -30139 20854 -38120 -63154 -27796 -7833 -27543
5803 -27543 15161 -77896 -14600 -22391 -63114 -43086 -204215 -220881 -164383 -109697 -106357 -66397
5791 -66397 119 6977 -61865 -193423 -192204 -215000 -234258 -227643 -315382 -289937 -211506 -153521
5779 -153521 -117629 -43119 -5894 11757 6132 13187 82598 104725 162307 139337 -43010 -47179
5767 -47179 151887 124139 38449 36353 -65651 -134341 -49835 -10139 17791 -44829 -123351 -136145
5755 -136145 -108004 -109064 -52444 -15647 27169 -57682 -188805 -81882 7384 10463 71908 181625
5743 181625 60032 -34114 79934 54063 54046 92856 -18577 -23541 -63960 -155975 -124095 -127442
5731 -127442 -83506 -41659 40001 99991 15272 -45620 1962 -15055 16544 -5796 43378 156989
5719 156989 70758 56458 12682 -60473 -52641 36357 119581 119933 80269 136331 195076 266245
5707 266245 248992 161018 38401 50031 14088 87807 116680 176584 185517 131169 -13312
5696 -13312 -21294 -22435 -52586 -128204 -234470 -232341 -162402 -114983 -49708 -22605 -67779 -176297
5684 -176297 -242915 -202744 -134727 -30869 -23771 -30008 48313 206087 252905 210857 92033
5673 92033 96365 114930 39024 11721 -87366 -72210 -118059 -23521 -63461 -188118 -70207 9183
5661 9183 -1671 89306 65335 62466 195114 133709 58364 47826 31146 14494 37816 56149
5649 56149 -13917 -78618 -102277 -248738 -245754 -165229 -165265 -179903 -167550 -76757 -130102 -246003
5637 -246003 -178751 -116756 -149486 -94679 1446 75027 116460 148754 174952 87535 -28426
5626 -28426 -101612 -91181 -84192 -127186 -181703 -75797 74752 25189 -85680 -106606 -89818
5615 -89818 -70348 -73047 -17247 40449 73565 120858 -65009 -194236 -122198 -59258 -63522 -52803
5603 -52803 -95875 -18847 42023 24436 68012 603 54910 114513 59396 -7315 31510 28213
5591 28213 -25348 14110 76405 58473 -23012 -43016 -39401 -5422 -77951 -99288 -152328 -183697
5579 -183697 -179032 -118144 -80215 848 33224 125469 141648 149526 108799 101231 144105 131993
5567 131993 54966 6036 7983 -20305 -126762 -238330 -289888 -235673 -114950 -56185 -50723
5556 -50723 -124565 -176105 -17087 -19211 -104580 -17444 138675 189631 168159 85375 27682 -103620
5544 -103620 -85712 -2600 -3163 -93088 -187028 -186139 -104837 -116609 10400 55196 -89918 -165285
5532 -165285 -46869 19515 -3262 33117 28482 28042 72025 65440 3125 -18528 -30336 468
5520 468 -54708 -45753 28748 12719 -65412 -44385 -68379 -30768 35679 65005 11920 25643
5508 25643 95801 205398 212433 174139 126604 133907 152456 25242 9200 67605 16520 -20368
5496 -20368 59329 -18672 -98028 -85267 -142811 -210094 -189871 -97209 -96956 -59488 -51362 -146647
5484 -146647 -51849 -35054 -27254 -129767 -179440 -79846 -71400 -101677 -28010 -9325 -86522 -99603
5472 -99603 -48099 9901 -23378 -48226 -38448 -106131 -80225 -84675 -23503 -19439 22707 67959
5460 67959 20703 -26998 -60418 -46259 31821 80773 -26226 -80694 -143359 -226632 -159889 -9210
5448 -9210 -19816 -212208 -199337 -122954 -92225 -9598 109707 132913 44177 -79845 -169077
5437 -169077 -144580 -43875 -3357 -220842 -260634 -3765 1759 -92093 -50090 20917 73820
5426 73820 58498 5576 54967 50705 -54133 -129010 -91078 140414 301807 190859 110134
5415 110134 102963 89525 30388 155062 112307 144660 139110 144922 64589 -61186 -115430 -60359
5403 -60359 -6378 -84547 -16140 99029 60003 -7766 -49924 -84138 27846 40402 -53135
5392 -53135 -28795 -31015 -62615 -43610 28053 -11270 -33932 -17129 -20963 -39490 33907 76366
5380 76366 51135 41053 22079 4661 -100842 -122712 -140462 7558 45175 34632 109429
5369 109429 149682 112489 96498 113494 59330 29335 -45661 -109344 -17470 2175 66314 156484
5357 156484 245795 193094 136160 116243 37171 -37622 -24312 -89222 -157868 -91638 14744
5346 14744 96954 113311 114822 80807 -44861 -211041 -250818 -206319 -215957 -147544 -217392 -211465
5334 -211465 -64438 869 19637 86739 74782 11557 -7015 -58762 -73881 -878 53451
5323 53451 182572 207554 45457 -11310 -30543 -15730 27180 -27177 -39506 64098 79716
5312 79716 14101 4576 20585 67961 73879 -28009 -72646 -51690 -19431 -52724 -26775 -4826
5300 -4826 17405 13198 61131 26096 33431 27937 -46045 855 -93798 -185828 -138484 -134131 -90730
5287 -90730 -8968 52986 57014 50705 -35871 -40982 80125 122396 56131 -58670 -32675 36250
5275 36250 48412 80767 -28554 26483 76628 75032 -40844 -115121 -79710 -24509 87100
5264 87100 91415 112889 93042 -63871 -42232 83055 -25803 -129812 -216023 -198952 -103559
5253 -103559 -101448 -78315 -121929 -115765 -12912 75667 52761 -105384 -79354 -43421 -16082 -55876
5241 -55876 -121236 -62114 -123918 -143174 -86583 -39793 24114 44043 -74932 43339 91835
5230 91835 28209 21419 -22101 36774 92292 73387 -53493 -103002 -64421 -30181 -8424 72997
5218 72997 121528 43298 -65978 -42696 87680 118633 115014 147508 159481 161154 92783 3851
5206 3851 -96631 -145054 -171934 -262372 -241854 -211746 -155268 -44135 -48707 -59331 -59231 -70523
5194 -70523 -23122 14991 47276 42548 17408 22675 86001 64937 26 -47571 -128405 -105402
5182 -105402 -94366 -119389 -81797 -5128 7617 2502 -29012 -177575 -220927 -232985 -158938 -17332
5170 -17332 -100658 -151517 -143178 -245032 -338411 -342239 -238259 -157747 -216344 -276448 -191637 -31579
5158 -31579 53238 67836 92106 60274 94090 12115 -103603 -13289 20175 -70780 -13665 6061
5146 6061 10658 77355 11505 -164047 -154576 -60186 -15137 -8645 -26121 -89910 -248327 -249270 -236396
5133 -236396 -142487 -107812 -263728 -204464 -127321 -100502 -103279 -36058 9755 12009 -108304 -116330
5121 -116330 -159883 -256962 -187599 -119051 -74086 -125437 -173611 -152672 -94433 -13548 24706 12018
5109 12018 145819 133729 125695 -16397 -59168 -13989 -35756 61504 183996 178850 146390 62990
5097 62990 -25946 -37108 -187458 -291061 -172658 -74359 48677 87594 28399 -23436 -19635
5086 -19635 -77394 -117590 -136556 -83263 -140156 -251179 -254096 -79346 3974 -79213 -156615 -75580
5074 -75580 46465 111813 4408 -35425 -55007 -130464 -92697 50295 -26690 -56103 -101057
5063 -101057 -62687 -24775 -33214 -24688 -37562 -87303 -88244 -45661 -20120 39334 76524 -41809
5051 -41809 -198551 -238073 -172547 -238692 -247414 -80132 -102538 -189039 -136336 -29465 105180
5040 105180 134077 103955 120238 110075 67481 75832 -6627 -145492 -195723 -199395 -147163 -125745
5028 -125745 -155524 -110321 -47458 56274 36219 -106418 -9577 118018 191785 143177 45639
5017 45639 -5225 -21660 -57381 -9646 -56888 -82019 -104632 -87525 -66212 -40392 13590 63849
5005 63849 15172 17867 70552 35396 -17748 -67881 44613 74365 77654 121924 50409 42892
4993 42892 63195 57784 59228 59121 136693 84454 -7368 -91779 -114746 -96855 -135272 -178280 -71973
4980 -71973 -27341 -21524 -35436 10184 -99678 -141176 -53149 -37735 -67095 -63972 -20728 13001
4968 13001 120880 105475 135070 36528 -70978 -121277 -151032 -121416 -90849 -46879 39720
4957 39720 -60781 -176151 -62805 5622 33160 68476 57696 20651 90686 74982 89554
4946 89554 169090 153004 204063 171534 120207 79705 53324 13744 47825 63258 132995 160052
4934 160052 150736 174204 175291 156116 153314 106460 3110 -32404 -1802 -33398 -104995 -76604
4922 -76604 51768 46805 54954 90884 90436 7611 -64218 -121788 -108548 -83932 26949 127901
4910 127901 55565 -21139 -145265 -93137 14582 139722 115277 -129 -71221 -83195 -168771
4899 -168771 -186320 -127102 -109987 47496 62081 67166 -35021 -166865 -95469 -189332 -176890
4888 -176890 -130111 -88819 25297 36027 -28096 -13562 35604 40020 -10081 -37671 95020
4877 95020 116574 47013 -19762 565 3458 -24831 -129411 -142859 -154868 -175384 -90385 76036
4865 76036 190157 133716 62684 55529 34991 76583 133561 96623 127143 52510 -8106 44075
4853 44075 84162 100605 86977 118280 63572 6927 -33168 -103002 -116969 -227790 -269702 -204866
4841 -204866 -187405 -112254 -93964 -132414 -99877 -81786 -52031 -87458 -61408 -63427 -46840 -89911
4829 -89911 -119340 -64380 29290 40522 85408 27037 -61810 -28845 -105454 -70887 77524 57292
4817 57292 -828 35168 223037 263262 210063 107828 76040 29240 -40491 -130492 -57091
4806 -57091 44443 94720 8862 -89712 27784 127063 51256 -7167 -14325 39955 30377 156757
$$ [...]
##END NTUPLES=NMR SPECTRUM
##END=
