##TITLE=Analysis number 327069
Compound Code sb 01097
Book Reference 1
Project Code adrs
Chemist Name stores
##JCAMPDX= 6.0         $$ Bruker NMR JCAMP-DX V2.0
##DATA TYPE= NMR SPECTRUM
##DATA CLASS= NTUPLES
##ORIGIN= Bruker BioSpin GmbH
##OWNER= nmr
$$ XWIN-NMR		Version 3.5
$$ Wed Mar  7 14:23:09 2007 GMT Standard Time (UT+0h)  MAYBRIDGE\nmr@NMR_250MHZ
##.OBSERVE FREQUENCY= 250.131544655141
##.OBSERVE NUCLEUS= ^1H
##.ACQUISITION MODE= SIMULTANEOUS (DQD)
##.ACQUISITION SCHEME= undefined
##.AVERAGES= 16
##.DIGITISER RES= 18
##SPECTROMETER/DATA SYSTEM= dpx250
##.PULSE SEQUENCE= zg30
##.SOLVENT NAME= CDCl3
##.SHIFT REFERENCE= (INTERNAL, CDCl3, 0, 16.522)
##AUDIT TRAIL= $$ (NUMBER, WHEN, WHO, WHERE, WHAT)
$$ ##TITLE= Audit trail, XWIN-NMR		Version 3.5
$$ ##JCAMPDX= 5.01
$$ ##ORIGIN= Bruker BioSpin GmbH
$$ ##OWNER= nmr
$$ C:\u/data/dgb/nmr/ADRS/520/pdata/1/auditp.txt
$$ ##AUDIT TRAIL=  $$ (NUMBER, WHEN, WHO, WHERE, WHAT)
(   1,<2007-03-07 14:22:47.44 +000>,<MAYBRIDGE\nmr>,<NMR_250MHZ>,
      <created by zg, POWCHK disabled, PULCHK disabled
       configuration hash MD5:
       49 4B E0 1D 92 C2 6B 37 9F E6 65 BC 52 41 86 1D
       data hash MD5: 64K
       85 D3 9E A9 2C F8 8B 9F 07 BB 8C 01 61 4C 43 B7>)
(   2,<2007-03-07 14:22:59.57 +000>,<MAYBRIDGE\nmr>,<NMR_250MHZ>,
      <Start of raw data processing
       ef LB = 0.3 FT_mod = 6 PKNL = 1 SI = 32K 
       data hash MD5: 32K
       FF A8 86 66 53 98 F3 7A 6B 9F AF BE 1E 37 C0 66>)
(   3,<2007-03-07 14:23:01.30 +000>,<MAYBRIDGE\nmr>,<NMR_250MHZ>,
      <apk 
       data hash MD5: 32K
       45 B7 92 E3 F3 28 8B 91 5C DD 9F 01 F4 11 19 1D>)
(   4,<2007-03-07 14:23:02.21 +000>,<MAYBRIDGE\nmr>,<NMR_250MHZ>,
      <abs ABSG = 5 
       data hash MD5: 32K
       A7 AF 34 08 6E 74 DA 9A 84 F2 E4 77 27 09 1E B9>)
$$ ##END=
$$ 
$$ hash MD5
$$ 4D F8 B1 AF AE 77 5C 93 AB 1F CD E7 42 BE 49 B4
##$RELAX= 
##$RELAX= 
##$RELAX= 
##$RELAX= 
##$RELAX= 
##$RELAX= 
##$RELAX= 
$$ Bruker specific parameters
$$ --------------------------
##$DU= <C:\u>
##$EXPNO= 520
##$NAME= <ADRS>
##$PROCNO= 1
##$TYPE= <nmr>
##$USER= <dgb>
##$AMP= (0..31)
100 100 100 100 100 100 100 100 100 100 100 100 100 100 100 100 100 100 
100 100 100 100 100 100 100 100 100 100 100 100 100 100 
##$AQSEQ= 0
##$AQ_mod= 3
##$AUNM= <au_zg>
##$AUTOPOS= <37 >
##$BF1= 250.13
##$BF2= 250.13
##$BF3= 250.13
##$BF4= 250.13
##$BF5= 500.13
##$BF6= 500.13
##$BF7= 500.13
##$BF8= 500.13
##$BYTORDA= 1
##$CFDGTYP= 0
##$CFRGTYP= 5
##$CHEMSTR= <none>
##$CNST= (0..31)
1 1 145 1 1 1 1 1 1 1 1 1 1 1 1 1 1 1 1 1 1 1 1 1 1 1 1 1 1 1 1 1 
##$CPDPRG= <>
##$CPDPRG1= <>
##$CPDPRG2= <>
##$CPDPRG3= <>
##$CPDPRG4= <mlev>
##$CPDPRG5= <mlev>
##$CPDPRG6= <mlev>
##$CPDPRG7= <mlev>
##$CPDPRG8= <mlev>
##$CPDPRGB= <>
##$CPDPRGT= <>
##$D= (0..31)
0 1 0 0 0 0 0 0 0 0.06 0 0 0 0 0 0 0.0002 0 0 0 0 0 0 0 0 0 0 0 0 0 0 
0 
##$DATE= 1173277365
##$DBL= (0..7)
120 120 120 120 120 120 120 120 
##$DBP= (0..7)
150 150 150 150 150 150 150 150 
##$DBP07= 0
##$DBPNAM0= <>
##$DBPNAM1= <>
$$ [...]
##$SUBNAM6= <"">
##$SUBNAM7= <"">
##$SUBNAM8= <"">
##$SUBNAM9= <"">
##$SW= 20.6930455092707
##$SWIBOX= (0..15)
0 0 3 0 0 0 0 0 0 0 0 0 0 0 0 0 
##$SW_h= 5175.983436853
##$TD= 65536
##$TD0= 1
##$TE= 683.16
##$TE2= 300
##$TE3= 300
##$TEG= 300
##$TL= (0..7)
0 120 120 120 120 120 120 120 
##$TP= (0..7)
150 150 150 150 150 150 150 150 
##$TP07= 0
##$TPNAME0= <>
##$TPNAME1= <>
##$TPNAME2= <>
##$TPNAME3= <>
##$TPNAME4= <>
##$TPNAME5= <>
##$TPNAME6= <>
##$TPNAME7= <>
##$TPOAL= (0..7)
0.5 0.5 0.5 0.5 0.5 0.5 0.5 0.5 
##$TPOFFS= (0..7)
0 0 0 0 0 0 0 0 
##$TUNHIN= 0
##$TUNHOUT= 0
##$TUNXOUT= 0
##$USERA1= <user>
##$USERA2= <user>
##$USERA3= <user>
##$USERA4= <user>
##$USERA5= <user>
##$V9= 5
##$VALIST= <valist>
##$VCLIST= <CCCCCCCCCCCCCCC>
##$VD= 0
##$VDLIST= <DDDDDDDDDDDDDDD>
##$VPLIST= <PPPPPPPPPPPPPPP>
##$VTLIST= <TTTTTTTTTTTTTTT>
##$WBST= 1024
##$WBSW= 4
##$XGAIN= (0..3)
0 0 0 0 
##$XL= 0
##$YL= 0
##$YMAX_a= 459103
##$YMIN_a= -634680
##$ZGOPTNS= <>
##$ZL1= 120
##$ZL2= 120
##$ZL3= 120
##$ZL4= 120
##$ABSF1= 16.522
##$ABSF2= -4.171173
##$ABSG= 5
##$ABSL= 3
##$ALPHA= 0
##$AQORDER= 0
##$ASSFAC= 0
##$ASSFACI= 0
##$ASSFACX= 0
##$ASSWID= 0
##$AUNMP= <proc_1d>
##$AZFE= 0.1
##$AZFW= 0.1
##$BCFW= 0
##$BC_mod= 0
##$BYTORDP= 0
##$COROFFS= 0
##$CY= 12.5
##$DATMOD= 1
##$DC= 0
##$DFILT= <>
##$DTYPP= 0
##$F1P= 14.0000005364418
##$F2P= -0.99999901652339
##$FCOR= 0.5
##$FTSIZE= 32768
##$FT_mod= 6
##$GAMMA= 0
##$GB= 0
##$INTBC= 1
##$INTSCL= 1
##$ISEN= 128
##$LB= 0.3
##$LEV0= 0
##$LPBIN= 0
##$MAXI= 10000
##$MC2= 0
##$MEAN= 0
##$ME_mod= 0
##$MI= 0
##$NCOEF= 0
##$NC_proc= -3
##$NLEV= 6
##$NOISF1= 0
##$NOISF2= 0
##$NSP= 0
##$NTH_PI= 0
##$NZP= 0
##$OFFSET= 16.522
##$PC= 1
##$PHC0= 230.971
##$PHC1= 7.168225
##$PH_mod= 1
##$PKNL= yes
##$PPARMOD= 0
##$PSCAL= 4
##$PSIGN= 0
##$REVERSE= no
##$SF= 250.13
##$SI= 32768
##$SIGF1= 0
##$SIGF2= 0
##$SINO= 400
##$SIOLD= 32768
##$SREGLST= <1H.CDCl3>
##$SSB= 0
##$STSI= 32768
##$STSR= 0
##$SW_p= 5175.98343685301
##$SYMM= 0
##$S_DEV= 0
##$TDeff= 65536
##$TDoff= 0
##$TI= <Analysis number 999999
Compound Code 99
Book Reference 9
Project Code 9>
##$TILT= no
##$TM1= 0
##$TM2= 0
##$TOPLEV= 0
##$USERP1= <user>
##$USERP2= <user>
##$USERP3= <user>
##$USERP4= <user>
##$USERP5= <user>
##$WDW= 1
##$XDIM= 32768
##$YMAX_p= 354858198
##$YMIN_p= -77676
$$ End of Bruker specific parameters
$$ ---------------------------------
##NTUPLES= NMR SPECTRUM
##VAR_NAME=  FREQUENCY,     SPECTRUM/REAL,   SPECTRUM/IMAG
##SYMBOL=    X,             R,               I
##VAR_TYPE=  INDEPENDENT,   DEPENDENT,       DEPENDENT
##VAR_FORM=  AFFN,          ASDF,            ASDF
##VAR_DIM=   32768,         32768,           32768
##UNITS=     HZ,            ARBITRARY UNITS, ARBITRARY UNITS
##FACTOR=    0.157963299565203, 1,           1
##FIRST=     4132.6476996994, 0,             0
##LAST=      -1043.33573715361, 0,           0
##MIN=       -1043.33573715361, -77676,      0
##MAX=       4132.6476996994, 354858198,     0
$$ Real data points
##PAGE= N=1
##DATA TABLE= (X++(R..R)), XYDATA
$$ [...]
$$ plain form
20307 12057 6730 -6619 -7295 203 -4388 16558 34655 19831 7871 18062 15884 9252 -18888
20294 -18888 -13588 -9987 -5920 6205 8557 13959 18012 19053 7078 10619 17766 16453 2208 -13322
20280 -13322 -8336 -4051 -11763 -33786 -36196 -28897 -26520 -15794 -12339 -24162 -28500 -29151 -30006 -26075
20266 -26075 -26680 -21663 -25004 -31565 -33455 -11872 12073 8532 2821 9062 -407 -6065 -13920 -14855
20252 -14855 -6187 -9275 -14465 -13576 -2462 6969 25213 23369 29573 38415 54559 33533 -9910
20239 -9910 -24150 -13786 -2490 -7256 -6924 -11315 -14617 -14737 -12361 -14921 -2273 10246 -7235 -10479
20225 -10479 -1007 12516 15806 610 -5171 2546 -294 3935 1946 4356 527 -324 413 -20301
20211 -20301 -26350 -35952 -41897 -32454 -22181 -8918 -13229 -14876 2211 1509 -15826 -2733 6682
$$ packed form
20307A2057n327j3349o76P498m591K0946J8097j4824j1960J0191k178o632k8140
20294a8888N300L601M067J2125K352N402M053J041j1975L541P147j313j4245j5530
20280a3322M986M285p712k2023k410P299K377J0726L455j1823m338o51q55L931
20266b6075o05N017l341o561j890K1583K3945l541n711O241r469n658p855r35
20252a4855Q668l088n190Q89J1114R431J8244j844O204Q842J6144k1026m3443
20239i910j4240J0364J1296m766L32m391l302j20K376k560J2648J2519j7481l244
20225a0479R472J3523L290j5196n781P717k840M229j989K410l829q51P37k0714
20211b0301o049r602n945R443J0273J3263m311j647J7087p02j7335J3093R415
$$ plain form
20198 6682 11948 5512 -4008 -9598 -17306 -21092 -18153 -27291 -18317 -5858 -4388 -10030 853 18633
20184 18633 17438 -7901 -23000 -23047 -14220 -16993 -9525 -32854 -44999 -30300 -29334 -19334 -4076
20171 -4076 -11428 -6021 2084 -2320 -5081 -7929 -9920 -5355 -11040 -2422 1305 6615 -2232 302 16137
20156 16137 22296 4125 -4361 -18644 -19242 -1776 -11191 -27713 -26946 -25192 -17171 -42196 -50236 -20034
20142 -20034 14346 17862 -18194 -10841 -24382 -34406 -32281 4346 16146 12696 1654 1467 -2122
20129 -2122 -6501 -10328 -413 12746 15861 9067 -213 2705 34730 27313 -11189 -31858 -13495
20116 -13495 18837 21563 1108 -17951 -20066 -1772 7941 4436 2421 18086 19605 10185 8334
20103 8334 15458 9006 14779 21118 14661 8041 21357 -1273 -14385 -19287 -17350 -14836 -6002 7190
$$ packed form
20198F682N266o436r520n590p708l786K939r138Q974J2459J470n642J0883J7780
20184A8633j195k5339j5099m7Q827k773P468k3329j2145J4699R66J0000J5258
20171d076p352N407Q105m404k761k848j991M565n685Q618L727N310q847K534J5835
20156A6137O159j8171q486j4283n98J7466r415j6522P67J754Q021k5025q040L0202
20142b0034L4380L516l6056P353j3541j0024K125L6627J1800l450j1042j87l589
20129b122m379l827R915J3159L115o794r280K918L2025p417l8502k0669J8363
20116a3495L2332K726k0455j9059k115J8294R713l505k015J5665J519r420j851
20103H334P124o452N773O339o457o620J3316k2630j3112m902J937K514Q834J3192
$$ plain form
20089 7190 5997 -8956 -1842 3925 18094 -684 -14185 -10905 -28983 -32560 -17783 -18865 -27603
20076 -27603 -21572 -23058 -26736 -35325 -10929 -558 899 -7244 -20256 -12996 6148 18558 23151
20063 23151 16221 11726 2715 -6703 -21827 -35146 -25789 4895 17396 38003 33055 20526 11598
20050 11598 1760 -799 14464 29778 18556 22569 7554 -1725 -9929 -1854 7809 -12036 -13242
20037 -13242 -4704 22123 42385 18340 20241 9721 9571 8798 9254 12971 11837 976 110 -7141
20023 -7141 -1257 17605 4719 -11990 -35584 -22955 -28015 -36491 -20228 111 -3192 -4605 -4118
20010 -4118 -4774 -16404 -23716 -12134 -8414 -11693 1583 -15126 -29408 -45989 -23514 -4098 15021
19997 15021 -1689 -20818 1758 8257 11623 7110 -9785 -4677 4447 17750 17287 17193 11562 27277
$$ packed form
20089G190j193j4953P114N767J4169j8778j3501L280j8078l577J4777j082q738
20076b7603O031j486l678q589K4396J0371J457q143j3012P260J9144J2410M593
20063B3151o930m495r011r418j5124j3319R357L0684J2501K0607m948j2529q928
20050A1598r838k559J5263J5314j1222M013j5015r279q204Q075R663j9845j206
20037a3242Q538K6827K0262k4045J901j0520j50p73M56L717j134j0861q66p251
20023g141N884J8862j2886j6709k3594J2629n060q476J6263K0339l303j413M87
20010d118o56j1630p312J1582L720l279J3276j6709j4282j6581K2475J9416J9119
19997A5021j6710j9129K2576O499L366m513j6895N108R124J3303m63r4n631J5715
$$ plain form
19983 27277 21632 15201 20531 13827 -6037 -16535 -12320 -4513 16709 17638 21608 2206 -5125 -10180
19969 -10180 2764 13845 14716 -5249 -22691 -6052 -7033 6069 17980 9725 1751 6702 -4428
19956 -4428 -8446 -15477 -674 10156 -5550 -6697 3905 1244 13369 21260 31580 32381 6927
19943 6927 -1629 6003 14169 20499 17254 17591 16810 26399 12589 -6032 -7006 -5705 -23967 -18022 -30847
19928 -30847 -25751 -24911 -20874 -23722 -27366 -34992 -42442 -34144 -18976 -16165 -28821 -18180 1108 3230
19914 3230 5898 6736 4288 8109 9712 -1511 -8452 -14677 -20769 -23920 -26976 -14833 2347 9390
19900 9390 17083 -1302 -15041 -453 7481 -2402 -3814 5925 8850 17075 25608 20444 15916 17760
19886 17760 11693 5299 5496 1371 -2596 -6499 -29000 -39001 -16469 -5221 -11193 -265 -14113
$$ packed form
19983B7277n645o431N330o704j9864j0498M215P807K1222R29L970j9402p331n055
19969a0180J2944J1081Q71j9965j7442J6639r81J3102J1911q255p974M951j1130
19956d428m018p031J4803J0830j5706j147J0602k661J2125P891J0320Q01k5454
19943F927q556P632Q166O330l245L37p81R589j3810j8621r74J301j8262N945j2825
19928c0847N096Q40M037k848l644p626p450Q298J5168K811j2656J0641J9288K122
19914C230K668Q38k448L821J603j1223o941o225o092l151l056J2143J7180P043
19900I390P693j8385j3739J4588P934r883j412R739K925Q225Q533n164m528J844
19886A7760o067o394J97m125l967l903k2501j0001K2532J1248n972J0928j3848
$$ plain form
19873 -14113 -31034 -43878 -38027 -30373 -19353 3340 16470 16350 8285 451 9076 16219 24454
19860 24454 15402 4747 5166 12554 21848 15864 15509 -10625 -17949 4057 21587 13063 11047 3631
19846 3631 9991 6974 -2459 15001 32809 24651 16835 21476 29019 17941 1075 -1166 -21048
19833 -21048 -36060 -20394 -20281 -13908 9683 34435 20575 7701 7523 -1678 -8 19132 3854
19820 3854 4004 18948 44049 37939 34759 22455 25259 34496 23573 20282 35475 28180 18228 11457
19806 11457 35282 43575 29943 21210 18176 24685 28253 24761 25066 3334 16434 38114 33439
19793 33439 36581 36045 25106 14671 -9549 -1342 9623 -150 15465 18918 -292 2185 -4544
19780 -4544 -1106 15401 7453 -5977 -10297 -8116 -18790 -20652 -8239 5591 -1489 17308 19276
$$ packed form
19873a4113j6921j2844N851P654J1020K2693J3130j20q065p834Q625P143Q235
19860B4454r052j0655M19P388R294n984l55k6134p324K2006J7530q524k016p416
19846C631O360l017r433J7460J7808q158p816M641P543j1078j6866k241j9882
19833b1048j5012J5666J13O373K3591K4752j3860j2874j78r201J670J9140j5278
19820C854J50J4944K5101o110l180j2304K804R237j0923l291J5193p295r952o771
19806A1457K3825Q293j3632q733l034O509L568l492L05k1732J3100K1680m675
19793C3439L142n36j0939j0435k4220Q207J0965r773J5615L453j9210K477o729
19780d544L438J6507p948j3430m320K181j0674j862J2413J3830p080J8797J968
$$ plain form
19767 19276 1407 -6836 -4038 -5215 -4238 16943 11204 1949 20794 25765 13709 9381 16609 1009
19753 1009 -360 -14355 -34044 -42818 -27678 -17501 -7443 4902 21603 11943 5833 13600 20906
19740 20906 3577 -1386 -323 3424 10812 9323 12819 12670 11850 1793 -9363 -15511 -23313 -19999
19726 -19999 -66 4172 7429 20017 10274 6007 10163 345 5757 18959 17741 20601 17485 24355
19712 24355 15053 -1345 -4976 -8392 -4747 -10407 -22684 -15999 3692 9293 9534 20161 26038 31716
19698 31716 32504 20045 -1405 -9794 19761 41089 26041 7301 1343 9989 18302 7846 -3703
19685 -3703 227 4949 -5843 -4238 -29686 -28116 -20764 -12605 9268 -2263 -10659 -5002 -4591 2123
19671 2123 23155 34969 27863 9617 -6935 -13317 596 -1030 1541 5603 4541 10117 -4553
$$ packed form
19767A9276j7869q243K798j177R77K1181n739r255J8845M971j2056m328P228j5600
19753A009j369j3995j9689q774J5140J0177J0058J2345J6701r660o110P767P306
19740B0906j7329m963J063L747P388j489L496j49q20j0057j1156o148p802L314
19726a9999J9933M238L257J2588r743m267M156r818N412J3202j218K860l116O870
19712B4355r302j6398l631l416L645n660j2277O685J9691N601K41J0627N877N678
19698C1716P88j2459k1450q389K9555K1328j5048j8740n958Q646Q313j0456j1549
19685c703L930M722j0792J605k5448J570P352Q159K1873j1531q396N657M11O714
19671B123K1032J1814p106j8246j6552o382J3913j626K571M062j062N576j4670
$$ plain form
19658 -4553 2438 8450 12448 363 9186 11341 8972 -6355 -7160 -7340 12019 14847 26802 28914
19644 28914 9543 -9484 3245 5222 11593 7449 -6662 14064 24057 28409 20485 4359 2608
19631 2608 4011 10439 -4394 -20545 -19872 -12014 -18284 -18017 -25263 -17574 5436 -1957 -13699 -31837
19617 -31837 -19757 1997 -1460 3250 5652 3461 9995 -7375 -12569 -12765 -13826 -17054 -12572 2825
19603 2825 17442 14410 -11675 -20155 -8588 -794 4272 -3344 -13609 -19382 -9918 -6306 9930
19590 9930 7141 7 9007 11661 17828 23411 22809 17345 2123 -4973 10810 -2813 -18841 -5750
19576 -5750 8722 33687 41283 23591 3084 -11255 1320 4816 3632 -780 -11907 1124 13501
19563 13501 29508 19248 16381 22240 14988 9563 871 2004 5325 -17919 -30695 -33867 -19706
$$ packed form
19658d553O991O012L998j2085Q823K155k369j5327q05j80J9359K828J1955K112
19644B8914j9371j9027J2729J977O371m144j4111K0726R993M352p924j6126j751
19631B608J403O428j4833j6151O73P858o270K67p246P689K3010p393j1742j8138
19617c1837J2080K1754l457M710K402k191O534j7370n194j96j061l228M482J5397
19603B825J4617l032k6085q480J1567P794N066p616j0265n773R464L612J6236
19590I930k789p134R000K654O167N583o02n464j5222p096J5783j3623j6028J3091
19576e750J4472K4965P596j7692k0507j4339J2575L496j184m412j1127J3031J2377
19563A3501J6007j0260k867N859p252n425q692J133L321k3244j2776l172J4161
$$ plain form
19550 -19706 -10378 -6576 -2757 -1434 -5159 -6658 3167 705 -10380 -15531 -18761 -1795 7679 -5853
19536 -5853 -22300 -20470 -12255 -9558 -10818 -26278 -9302 -67 9101 10679 2289 4506 5915 -1401
19522 -1401 1223 -3171 12633 19910 14097 17537 27631 24282 3228 -12064 -29405 -22436 7105
19509 7105 16502 4987 -2359 -7537 -24214 -24818 -5507 1683 2316 5575 13276 17104 21977 19191
19495 19191 -1761 -22931 -25075 -7647 3233 -4709 -6293 -9394 -19032 -32348 -23972 -15730 -7834
19482 -7834 -5645 -1187 4404 3784 8138 5338 6501 14923 -7056 -24058 -27878 -13469 -9431 -20731
19468 -20731 -25582 -8584 7475 2592 -596 21553 21966 15248 11101 5466 9248 13036 3737 3892
19454 3892 2825 -12942 -18598 -24074 -12484 1430 9426 11451 -772 370 19363 16264 10204
$$ packed form
19550a9706R328L802L819J323l725j499R825k462j1085n151l230J6966R474j3532
19536e853j6447J830Q215K697j260j5460J6976R235R168J578q390K217J409p316
19522a401K624m394J5804P277n813L440J0094l349k1054j5292j7341O969K9541
19509G105R397j1515p346n178j6677o04J9311P190O33L259P701L828M873k786
19495A9191k0952k1170k144J7428J0880p942j584l101r638j3316Q376Q242P896
19482g834K189M458N591o20M354k800J163Q422k1979j7002l820J4409M038j1300
19468b0731m851J6998J6059m883l188K2149M13o718m147n635L782L788r299J55
19454C892j067j5767n656n476J1590J3914P996K025j2223J142J8993l099o060
$$ plain form
19441 10204 15227 11453 6567 -13026 4373 5097 10752 17692 24715 36238 15302 -10843 -32730
19428 -32730 -37229 -17051 9920 7652 4720 -6049 -17607 -17197 11601 17761 12962 17114 16560 6259
19414 6259 -5031 -7324 8312 5550 9321 10071 -5608 -19099 -22801 -12587 3711 3241 5190 4753
19400 4753 564 4395 12577 11522 13533 19460 15591 4421 -1555 -2816 2640 21139 22797 16319
19386 16319 8767 -23478 -22775 -16839 -11511 5198 4643 -6551 -17404 -19305 -20804 -25135 -23905 -20737
19372 -20737 -24251 -31416 -22054 -21671 -12494 997 6091 -4994 -17138 -4106 5776 8310 16590 27627
19358 27627 12043 20392 24156 21240 19045 -3710 -11057 5178 9332 -6679 -20226 -17181 -30812
19345 -30812 -15907 9319 14182 6078 7012 -10081 -9718 -15202 -8276 3504 16291 22725 15818 -10862
$$ packed form
19441A0204N023l774m886j9593J7399P24N655O940P023J1523k0936k6145k1887
19428c2730m499K0178K6971k268k932j0769j1558M10K8798O160m799M152n54j0301
19414F259j1290k293J5636k762L771P50j5679j3491l702J0214J6298m70J949m37
19400D753m189L831Q182j055K011N927l869j1170n976j261N456J8499J658o478
19386A6319p552l2245P03N936N328J6709n55j1194j0853j901j499m331J230L168
19372b0737l514p165R362L83R177J3491N094j1085j2144J3032R882K534Q280J1037
19358B7627j5584Q349L764k916k195k2755p347J6235M154j6011j3547L045j3631
19345c0812J4905K5226M863q104R34j7093L63n484O926J1780J2787O434o907k6680
$$ plain form
19331 -10862 -13548 -1906 -7116 -8283 -9556 1204 20649 12949 12731 704 -10450 10730 14064
19318 14064 17791 20531 22380 18148 11056 20897 15081 21437 30467 12852 -4217 -457 -7492 13315
19304 13315 26234 14637 -3503 11153 21087 19879 27609 22040 12143 5264 506 -8402 -9786
19291 -9786 3481 21149 26952 32569 25154 14626 2589 1815 -1720 -8669 7743 -3912 1766
19278 1766 24200 28273 22673 9358 -4638 107 -8397 -7751 16871 42693 17252 -13721 -7706
19265 -7706 467 12888 14600 9914 10165 24687 35947 22259 3859 -18911 -13153 2736 4075
19252 4075 -13600 -1975 19873 15013 15671 15585 16768 7709 4995 13501 6633 10659 21774 19122
19238 19122 17699 18794 17704 -487 -16728 -22307 -23500 -13114 369 9775 9142 9488 5875 -14134
$$ packed form
19331a0862k686J1642n210j167j273J0760J9445p700k18j2027j1154K1180L334
19318A4064L727K740J849m232p092R841n816O356R030j7615j7069L760p035K0807
19304A3315J2919j1597j8140J4656R934j208P730n569r897o879m758q908j384
19291i786J3267J7668N803N617p415j0528j2037p74l535o949J6412j1655N678
19278A766K2434M073n600j3315j3996M745q504O46K4622K5822k5441l0973O015
19265g706Q173J2421J712m686K51J4522J1260j3688j8400k2770N758J5889J339
19252D075j7675J1625K1848m860O58q6J183r059k714Q506o868M026J1115k652
19238A9122j423J095j090j8191j6241n579j193J0386J3483R406o33L46l613k0009
$$ plain form
19224 -14134 -9616 3596 -8704 -10212 -2322 18195 33766 34859 26795 16995 17823 42420 17801
19211 17801 12138 21254 17048 11384 4235 20746 29584 28007 34339 28853 23491 13078 10406 5420
19197 5420 -1301 -2093 2587 2108 -7034 -29083 -23409 -2633 14464 30090 3010 -21313 -18226 1281
19183 1281 13258 18130 -2706 -24408 -26652 -15730 5052 -3630 -6567 -812 17290 25821 16952
19170 16952 4196 -6530 -1281 4543 4211 -10546 -907 -3349 12321 9406 -5409 -4535 -6631 -1545
19156 -1545 16858 47335 60898 63299 75005 46079 24778 2021 -13558 -4919 -1956 -7932 -9577
19143 -9577 -25573 -14563 -8029 -9825 -15816 -17730 -34884 -32107 -28321 -31028 -40816 -37184 -20812 -15438
19129 -15438 -12439 5611 14361 20773 26702 13683 -3317 -16873 -17319 -15248 -178 7502 13926
$$ packed form
19224a4134M518J3212j2300j508P890K0517J5571J093q064r800Q28K4597k4619
19211A7801n663R116m206n664p149J6511Q838j577O332n486n362j0413k672m986
19197E420o721p92M680m79r142k2049N674K0776J7097J5626k7080k4323L087J9507
19183A281J1977M872k0836k1702k244J0922K0782q682k937N755J8102Q531q869
19170A6952j2756j0726N249N824l32j4757R639k442J5670k915j4815Q74k096N086
19156a545J8403L0477J3563K401J1706k8926k1301k2757j5579Q639K963n976j645
19143i577j5996J1010O534j796n991j914j7154K777L786k707r788L632J6372N374
19129a5438K999J8050Q750O412N929j3019j7000j3556m46K071J5070P680O424
$$ plain form
19116 13926 11247 25540 22513 2979 -2856 2818 -9786 -4473 2325 10598 9293 3697 3647 14127
19102 14127 8778 -4098 7521 8528 15235 -8883 -15720 -17132 -1883 10844 20512 6062 12881
19089 12881 27897 30455 35617 21908 30362 24348 36203 38898 38422 33062 35399 42134 36157 11214
19075 11214 -20321 -30603 -25246 -3119 -13883 -14434 -11664 9439 6733 -3990 -21436 -19853 -5406
19062 -5406 2133 19842 23221 17166 -7647 5400 19205 5517 4628 -7981 -17284 -41178 -37601
19049 -37601 -18194 3054 20172 33936 48545 40418 30193 17125 23424 27233 25006 13124
19037 13124 33933 53460 58963 42321 31323 34205 35969 35580 20296 14722 7311 -7756 -224
19024 -224 252 -9054 -13146 -584 10385 -1360 -3096 1538 10584 26292 25524 15635 8871 -7828
$$ packed form
19116A3926k679J4293l027j9534n835N674j2604N313O798Q273j305n596n0J0480
19102A4127n349j2876J1619J007O707k4118o837j412J5249J2727R668j4450O819
19089A2881J5016K558N162j3709Q454o014J1855K695m76n360K337O735n977k4943
19075A1214l1535j0282N357K2127j0764n51K770K1103k706j0723j7446J583J4447
19062e406P539J7709L379o055k4813J3047J3805j3688q89j2609r303k3894L577
19049c7601J9407K1248J7118J3764J4609q127j0225j3068O299L809k227j1882
19037A3124K0809J9527N503j6642j0998K882J764l89j5284n574p411j5067P532
19024b24M76r306m092J2562J0969j1745j736M634R046J5708p68r889o764j6699
$$ plain form
19010 -7828 1008 9986 10538 11709 15012 15354 8796 758 7708 -6742 -16770 -10634 3737 30473
18996 30473 23576 12677 5712 18207 22592 20397 14580 11691 23125 32774 26598 17094 9983 17702
18982 17702 13361 23832 39465 32780 30951 38661 22599 22176 25242 30171 45646 51344 33909
18969 33909 21352 25107 13774 26987 50209 44044 24139 10302 5828 2015 4373 17741 16583
18956 16583 1521 13667 16577 -4627 -26968 -28869 -27542 -20780 -4147 10631 21844 41062
18944 41062 46931 28255 27263 23582 13558 12161 24190 33049 11061 -3605 84 9745 -669
18931 -669 855 10018 10778 3479 -9108 4291 8559 15084 18193 18326 9124 7811 3539 -1176 -17195
18916 -17195 -17728 -15295 -25948 -37508 -19420 -11842 -2759 13604 10617 -5429 -5314 23902 32632
$$ packed form
19010g828Q836Q978N52J171L303L42o558q038O950j4450j0028O136J4371K6736
18996C0473o897j0899o965J2495M385k195n817k889J1434R649o176r504p111P719
18982A7702m341J0471J5633o685j829P710j6062m23L066M929J5475N698j7435
18969C3909j2557L755j1333J3213K3222o165j9905j3837m474l813K358J3368j158
18956A6583j5062J2146K910k1204k2341j901J327O762J6633J4778J1213J9218
18944D1062N869j8676r92l681j0024j397J2029Q859k1988j4666L689R661j0414
18931f69J524R163P60p299j2587J3399M268O525L109J33r202j313m272m715j6019
18916a7195n33K433j0653j1560J8088P578R083J6363k987j6046J15K9216Q730
$$ plain form
18903 32632 15718 -6246 -19828 -3248 4558 2751 24992 30833 29288 31197 8468 -108 13112
18890 13112 13096 8691 -5681 -5977 3556 -1865 12439 28558 37802 29706 36422 37366 31222 10387
18876 10387 5070 -5436 6874 14273 2736 -9515 -18264 -13094 -3807 5800 25748 40486 42370
18863 42370 33445 36044 26937 17803 13018 -2496 -12726 585 6127 8600 8209 5059 19289 33719
18849 33719 25357 19658 19597 14624 7317 15260 20079 20168 18542 -3491 6857 13238 20000 18976 19933
18834 19933 23359 33279 13517 10138 22380 34410 24239 9763 13533 26143 45587 45518 10350
18821 10350 -8754 9731 33779 29466 30761 22594 21149 14524 8277 13569 11631 5806 13279 16382
18807 16382 16869 23051 38157 42205 31186 20428 20506 33227 24632 6587 -5 -360 2604 12098
$$ packed form
18903C2632j6914k1964j3582J6580P806j807K2241N841j545J909k2729q576J3220
18890A3112j6m405j4372k96R533n421J4304J6119R244q096O716R44o144k0835
18876A0387n317j0506J2310P399j1537j2251q749N170R287R607J9948J4738J884
18863D2370q925K599r107r134m785j5514j0230J3311N542K473l91l150J4230J4430
18849C3719q362n699o1m973p307P943M819Q9j626k2033J0348O381O762j024R57
18834A9933L426R920j9762l379J2242J2030j0171j4476L770J2610J9444o9l5168
18821A0350j9104J8485K4048m313J295q167j445o625o247N292j938n825P473L103
18807A6382M87O182J5106M048j1019j0758P8J2721q595j8045o592l55K964R494
$$ plain form
18793 12098 13971 15564 8334 12331 7091 14049 24548 24688 17614 17091 26472 14486 4093 8360
18779 8360 17811 24570 38145 35952 38001 52776 48677 24584 22165 51655 89356 146583 208432
18766 208432 273754 252579 169780 112343 70394 45590 44497 43639 50240 36667 17938 18178 30955
18753 30955 31599 39238 31155 47739 45447 40215 63945 78320 71868 61689 69232 62688 47078
18740 47078 46255 38433 39889 36948 25862 18034 25880 19606 12317 10457 6610 6235 34599 38971
18726 38971 20394 -3028 -7889 324 -991 3925 19780 20324 27360 20769 -6918 -11432 -14095 -9087
18712 -9087 1196 12876 31865 25527 12511 18751 19213 26988 44825 30966 17382 19939 31244
18699 31244 25997 17310 16666 4709 1355 11982 23459 29916 13863 13338 15407 29224 25285 17562
$$ packed form
18793A2098J873J593p230L997n240O958J0499J40p074n23R381j1986j0393M267
18779H360R451O759J3575k193K049J4775m099k4093k419K9490L7701N7227O1849
18766B08432O5322k1175q2799n7437m1949k4804j093q58O601j3573j8729K40J2777
18753C0955O44P639q083J6584k292n232K3730J4375o452j0179P543o544j5610
18740D7078q23p822J456k941j1086p828P846o274p289j860l847l75K8364M372
18726C8971j8577k3422m861Q213j315M916J5855N44P036o591k7687m514k663N008
18712i087J0283J1680J8989o338j3016O240M62P775J7837j3859j3584K557J1305
18699C1244n247q687o44j1957l354J0627J1477O457j6053n25K069J3817l939p723
$$ plain form
18685 17562 22117 16973 39307 50349 43062 36923 26948 43008 50692 55468 60626 44603 21697
18672 21697 20928 34121 35822 34793 27076 9370 1202 4127 15718 4696 12226 14520 17588 42058
18658 42058 44670 34763 20099 7628 7264 23915 32011 29429 41392 50370 43899 35931 38811 31325
18644 31325 21556 37422 46349 31591 25584 36528 39796 44084 38867 43777 40393 26216 11645
18631 11645 13426 26870 8807 16508 25674 20287 38950 46544 38801 42154 40563 30167 25173
18618 25173 21868 34410 44430 50572 35460 24089 12114 29012 28930 20205 22832 23190 24250 27454
18604 27454 17393 33605 41133 49058 45185 43728 34223 35964 18028 12183 3511 29048 27576
18591 27576 28451 9353 14306 25845 13535 11002 25645 37702 34375 26189 12217 18258 13716
$$ packed form
18685A7562M555n144K2334J1042p287o139r975J6060P684M776N158j6023k2906
18672B1697p69J3193J701j029p717j7706q168K925J1591j1022P530K294L068K4470
18658D2058K612r907j4664j2471l64J6651Q096k582J1963Q978o471p968K880p486
18644C1325r769J5866Q927j4758o007J0944L268M288n217M910l384j4177j4571
18631A1645J781J3444j8063P701R166n387J8663P594p743L353j591j0396m994
18618B5173l305J2542J0020O142j5112j1371j1975J6898q2q725K627L58J060L204
18604B7454j0061J6212P528P925l873j457r505J741j7936n845q672K5537j472
18591B7576Q75j9098M953J1539j2310k533J4643J2057l327q186j3972O041m542
$$ plain form
18578 13716 8208 17705 34500 40738 43233 53762 52797 49024 61472 61155 41819 19080 7701
18565 7701 5770 24597 37545 24781 18018 4100 7476 15880 11749 2108 -2688 8919 34615
18552 34615 64433 57629 44804 22718 27201 19702 17324 24337 28727 28410 27042 40083 35691 35057
18538 35057 30974 37818 40210 23082 22523 35891 45977 30805 33263 43200 32604 17369 2985
18525 2985 -9132 -22813 -24198 -7079 18509 31771 37035 41176 42829 46246 46479 38571 32840 22477
18511 22477 36199 47864 41826 23732 32447 52511 36884 9952 20222 30783 30471 35655 39563
18498 39563 18071 10510 17815 51061 54575 40892 17974 32289 42692 56124 53595 42674
18486 42674 43426 38263 27845 10434 4478 -3954 -2143 17432 32422 34586 30399 21233 43716
$$ packed form
18578A3716n508R497J6795O238K495J0529r65l773J2448l17j9336k2739j1379
18565G701j931J8827J2948j2764o763j3918L376Q404m131r641m796J1607K5696
18552C4615K9818o804j2825k2086M483p499k378P013M390l17j368J3041m392o34
18538C5057m083O844K392j7128n59J3368J0086j5172K458R937j0596j5235j4384
18525B985j2117j3681j385J7119K5588J3262N264M141J653L417K33p908n731j0363
18511B2477J3722J1665o038j8094Q715K0064j5627k6932J0270J0561l12N184L908
18498C9563k1492p561P305L3246L514j3683k2918J4315J0403J3432k529j0921
18486D2674P52n163j0418j7411n956q432J811J9575J4990K164m187r166K2483
$$ plain form
18473 43716 60899 58466 49764 22007 20111 18341 19388 40504 38958 28120 3493 13858 44341
18460 44341 57823 74404 62993 28591 15371 724 7216 11458 18464 30258 50216 41750
18448 41750 41505 46671 42856 35425 40559 47744 55368 37414 38006 25737 10841 3750 7766 37086
18434 37086 52656 63070 61512 61645 79525 74008 51732 30994 33133 29522 13718 16499 24729
18421 24729 35047 40708 57111 52825 64871 83601 70724 61390 77142 88580 87861 80787 79274
18408 79274 67978 65590 59666 56909 62216 54259 58027 58794 49671 27113 50015 52283 47551 51421
18394 51421 51774 37540 31249 52326 65500 63664 43997 42482 55006 64340 61108 38763 34602
18381 34602 44462 49701 67936 75607 74538 66172 59752 72873 65420 61019 71714 74289 68158 63027
$$ packed form
18473D3716J7183k433q702k7757j896j770J047K1116j546j0838k4627J0365L0483
18460D4341J3482J6581j1411l4402j3220j4647O492M242P006J1794J9958q466
18448D1750k45N166l815p431N134P185P624j7954N92j2269j4896p091M016K9320
18434C7086J5570J0414j558J33J7880n517k2276k0738K139l611j5804K781Q230
18421B4729J0318N661J6403m286J2046J8730j2877r334J5752J1438p19p074j513
18408G9274j1296k388n924k757N307p957L768P67r123k2558K2902K268m732L870
18394E1421L53j4234o291K1077J3174j836j9667j515J2524R334l232k2345m161
18381C4602R860N239J8235P671j069q366o420J3121p453m401J0695K575o131n131
$$ plain form
18367 63027 58418 47820 52663 51854 52292 63115 73166 88840 94754 86210 73876 64662 72856 62844
18353 62844 61447 53831 51214 56334 78261 81663 74998 83337 76793 54787 53468 60920 48794 68881
18339 68881 69542 75880 87750 77969 76068 68829 85260 95625 86323 72985 65205 73204 76924 77922
18325 77922 69214 71033 68236 70140 68704 70105 72520 77915 83853 82359 66001 70593 67660 48051
18311 48051 45391 64648 59434 70268 81568 81627 59526 59449 67259 62330 56542 45146 49919 51164
18297 51164 51655 52429 52946 51633 71161 82514 80431 76858 74703 80577 87800 99944 100978 107883
18283 107883 121251 136581 150721 170320 218836 319630 458789 613958 691719 645740 546232
18272 546232 425656 321472 244050 187514 137189 111207 105930 95001 85270 98253 102681 101701
$$ packed form
18367F3027m609j0598M843q09M38J0823J0051J5674N914q544j2334r214Q194j0012
18353F2844j397p616k617N120K1927L402o665Q339o544k2006j319P452j2126K0087
18339F8881O61O338J1870r781j901p239J6431J0365r302j3338p780P999L720R98
18325G7922q708J819k797J904j436J401K415N395N938j494j6358M592k933j9609
18311D8051k660J9257n214J0834J1300N9k2101p7P810m929n788j1396M773J245
18297E1164M91P74N17j313J9528J1353k083l573k155N874P223J2144J034O905
18283A07883J3368J5330J4140J9599M8516J00794J39159J55169P7761m5979r9508
18272E46232j20576j04184p7422n6536n0325k5982n277j0929r731J2983M428r80
$$ plain form
18260 101701 95044 100929 107802 106944 107373 112856 115654 115165 96041 93239 103020 101394 110600 112158 102077
18245 102077 104078 106956 110601 115771 111076 149035 154585 156545 163288 202189 250754 261368 253655
18232 253655 235040 202292 214658 228879 261139 309658 364139 453397 594448 787491 1113409
18221 1113409 1553815 1988128 2184303 2053755 1671315 1226678 893029 680241 530172
18212 530172 430338 376313 350192 352290 385115 462246 615830 820219 1008720 1060158 921632
18201 921632 665237 460847 354574 269718 232793 201632 163992 166016 182085 177634 166679
18190 166679 165888 153699 139000 139906 157000 160425 179950 190311 176854 178585 187715 178673 173579
18177 173579 184832 203841 208011 210083 221587 252109 266235 294841 312487 367578 478843 608158
$$ packed form
18260A01701o657N885O873q58M29N483K798m89j9124k802R781j626R206J558j0081
18245A02077K001K878L645N170m695L7959N550J960O743L8901M8565J0614p713
18232B53655j8615l2748J2366J4221L2260M8519N4481Q9258J41051J93043L25918
18221A113409M40406M34313J96175j30548l82440m44637l33649k12788j50069
18212E30172r9834n4025k6121K098L2825P7131J53584K04389J88501N1438j38526
18201I21632k56395k04390j06273q4856l6925l1161l7640K024J6069m451j0955
18190A66679p91j2189j4699R06J7094L425J9525J0361j3457J731R130r042n094
18177A73579J1253J9009M170K072J1504L0522J4126K8606J7646N5091J11265J29315
$$ plain form
18165 608158 755868 849361 842752 749205 581143 437375 348923 312626 275503 218625 176439
18154 176439 172591 185715 192087 205461 224513 240106 220806 214224 213701 231728 236400 237637 233087
18141 233087 243830 279533 301333 307599 317942 309899 316818 333777 351107 364708 378979 403173
18129 403173 419925 424564 432594 488563 586986 663603 720274 792616 901599 1073981 1259063
18118 1259063 1474596 1776116 2135854 2653132 3414002 4594306 6624091 10356030 17322991
18109 17322991 29603956 44361626 45978731 31984066 18700569 11431384 7637199
18102 7637199 5443269 4032398 3060033 2383587 1904942 1554770 1303710 1138967 1021949
18093 1021949 905041 795695 714563 664801 624582 574952 529610 497352 456309 421875 398552
$$ packed form
18165F08158J47710R3493o609r3547j68062j43768q8452l6297l7123n6878m2186
18154A76439l848J3124O372J3374J9052J5593j9300o582n23J8027M672J237m550
18141B33087J0743L5703K1800O266J0343q043O919J6959J7330J3601J4271K4194
18129D03173J6752M639Q030N5969R8423P6617N6671P2342J08983J72382J85082
18118A259063K15533L01520L59738N17278P60870J180304K029785L731939O966961
18109A7322991J2280965J4757670J617105j3994665j3283497p269185l794185
18102G637199k193930j410871r72365o76446m78645l50172k51060j64743j17018
18093A021949j16908j09346q1132m9762m0219m9630m5342l2258m1043l4434k3323
$$ plain form
18082 398552 386857 377243 366975 336312 316349 311145 315546 317998 329516 344056 374364 423640
18070 423640 497246 586224 723078 846888 877966 800466 671035 572327 513875 471248 449381
18059 449381 460536 497582 555887 629017 711534 790662 803355 760460 745752 766710 811225
18048 811225 863689 875308 816203 707654 574321 487934 428555 387660 385909 389502 371956
18037 371956 384624 408499 405504 416347 478169 574196 686332 768617 810084 770928 664767
18026 664767 558308 467203 405711 385298 364337 336887 334335 339015 334729 346786 371588 412730
18014 412730 506850 623919 763988 900024 953084 913679 802795 664192 548115 473080
18004 473080 442497 441574 452414 491405 520488 508689 448791 380612 333192 304868 260175 231465
$$ packed form
18082C98552j1695r614j0268l0663j9963n204M401K452J1518J4540L0308M9276
18070D23640P3606Q8978J36854J23810L1078p7500j29431r8708n8452m2627k1867
18059D49381J1155L7046N8305P3130Q2517P9128J2693m2895j4708K0958M4515
18048H11225N2464J1619n9105j08549j33333q6387n9379m0895j751L593j7546
18037C71956J2668K3875k995J0843O1822R6027J12136Q2285M1467l9156j06161
18026F64767j06459r1105o1492k0413k0961k7450k552M680m286J2057K4802M1142
18014D12730R4120J17069J40069J36036N3060l9405j10884j38603j16077p5035
18004D73080l0583r23J0840L8991K9083j1799n9898o8179m7420k8324m4693k8710
$$ plain form
17992 231465 223630 203171 204955 207944 206239 211572 203498 200279 222639 238737 240250 249408 298585
17979 298585 326452 312793 300138 314600 365009 438366 528305 558660 501984 406245 339526
17968 339526 302955 267660 241091 237975 257286 275247 291374 324375 369908 454371 570306
17957 570306 675276 694497 632206 526243 428198 365623 328736 317522 294583 273693 251964
17946 251964 227400 213984 222595 227889 234433 236767 227846 220235 223277 215208 209262 206916 191567
17933 191567 188636 184669 185752 205352 205351 210820 233463 237236 240758 245973 261813 293072 348030 408840
17919 408840 493689 611242 688972 657441 575073 498113 434221 384546 357978 347550 330957
17908 330957 328126 354546 367324 402099 482794 593631 741492 805901 758625 653732 537305
$$ packed form
17992B31465p835k0459J784K989j705N333q074l219K2360J6098J513R158M9177
17979B98585K7867j3659j2655J4462N0409P3357Q9939L0355n6676r5739o6719
17968C39526l6571l5295k6569l116J9311J7961J6127L3001M5533Q4463J15935
17957E70306J04970J9221o2291j05963r8045o2575l6887j1214k2939k0890k1729
17946B51964k4564j3416Q611N294O544K334q921p611L042q069n946k346j5349
17933A91567k931l967J083J9600jN469K2643L773L522N215J5840L1259N4958O0810
17919D08840Q4849J17553P7730l1531q2368p6960o3892m9675k6568j0428j6593
17908C30957k831K6420J2778L4775Q0695J10837J47861O4409m7276j04893j16427
$$ plain form
17897 537305 462328 414646 375002 335248 297336 269631 259509 266652 276873 331339 396588 444469
17885 444469 490559 496950 470621 426893 381829 320107 272411 271450 279561 269774 252183 255902 253976
17872 253976 245444 255865 275123 291552 296504 298439 307529 310172 310107 298530 283213 286260 297370
17859 297370 327206 364756 395799 389698 389406 380512 369553 366223 361027 345771 329406 319736 326633
17846 326633 335441 358833 367560 366738 362615 404057 417236 404320 400689 413272 419580 422520 477066
17833 477066 535277 620136 734323 843839 905247 915861 873848 816696 745675 688341 664662
17822 664662 636462 620551 616009 604331 594477 591465 615408 623713 648373 669862 658410 638206
17810 638206 648979 657859 660836 672126 707840 755616 790270 835554 894238 956667 1000004 1011832
$$ packed form
17897E37305p4977m7682l9644l9754l7912k7705j0122P143J0221N4466O5249M7881
17885D44469M6090O391k6329m3728m5064o1722m7696r61Q111r787j7591L719j926
17872B53976q532J0421J9258J6429M952J935R090K643o5j1577j5317L047J1110
17859B97370K9836L7550L1043o101k92q894j0959l330n196j5256j6365r670O897
17846C26633Q808K3392Q727q22m123M1442J3179j2916l631J2583O308K940N4546
17833D77066N8211Q4859J14187J09516O1408J0614m2013n7152p1021n7334k3679
17822F64662k8200j5911m542j1678r854l012K3943Q305K4660K1489j1452k0204
17810F38206J0773Q880K977J1290L5714M7776L4654M5284N8684O2429M3337J1828
$$ plain form
17798 1011832 1046856 1110044 1198368 1333897 1498486 1661694 1737384 1715065 1665585 1631811 1666341
17787 1666341 1748420 1901218 2060201 2162768 2203271 2200840 2197528 2230565 2322693 2510457 2831779
17776 2831779 3252929 3681351 4078140 4397639 4694841 5100395 5668782 6470447 7572358
17767 7572358 9065698 11177756 14224725 18775461 25881234 37249648 55088146 79670649
17759 79670649 103855291 115409237 108709738 87120120 62107486 43004988 30664826
17752 30664826 22718068 17393671 13728445 11178253 9357285 8064030 7129586 6464692
17744 6464692 5987089 5654889 5497414 5499567 5616804 5753147 5835738 5829564 5722909 5638644
17734 5638644 5638009 5758996 5994199 6351152 6743229 6937456 6797804 6513267 6288303 6264141
$$ packed form
17798A011832L5024O3188Q8324J35529J64589J63208P5690k2319m9480l3774L4530
17787A666341Q2079J52798J58983J02567M0503k431l312L3037R2128J87764L21322
17776B831779M21150M28422L96789L19499K97202M05554N68387Q01665J101911
17767G572358J493340K112058L046969M550736P105773J1368414J7838498K4582503
17759G9670649K4184642J1553946o699499k1589618k5012634j9102498j2340162
17752C0664826p946758n324397l665226k550192j820968j293255r34444o64894
17744F464692m77603l32200j57475K153J17237J36343Q2591o174j06655q4265
17734E638644o35J20987K35203L56953L92077J94227j39652k84537k24964k4162
$$ plain form
17724 6264141 6402416 6678557 7127024 7829892 8773174 9715615 10376802 10762062 11240033
17715 11240033 12096581 13483340 15499342 18303276 22223341 27851106 36198088 49010732
17707 49010732 69165383 100256945 143141397 190070651 226726665 237725929 217249064
17700 217249064 175497305 128462201 90070818 64084356 47162393 35763766 27843338
17693 27843338 22262345 18246465 15349359 13246278 11716866 10633069 9962810 9642535
17685 9642535 9550397 9547415 9440546 9151806 8687121 8207086 7868940 7689021 7513904 7190766
17675 7190766 6794162 6419126 6089209 5793003 5606579 5595281 5683998 5784857 5851137 5865308
17665 5865308 5929312 6104429 6355270 6617182 6898661 7349036 8081272 9109033 10471569
$$ packed form
17724F264141J38275K76141M48467P02868R43282R42441O61187L85260M77971
17715A1240033Q56548J386759K016002K803934L920065N627765Q346982J2812644
17707D9010732K0154651L1091562M2884452M6929254L6656014J0999264k0476865
17700B17249064m1751759m7035104l8391383k5986462j6921963j1398627p920428
17693B7843338n580993m015880k897106k103081j529412j083797o70259l20275
17685I642535r2138k982j06869k88740m64685m80035l38146j79919j75117l23138
17675G190766l96604l75036l29917k96206j86424j1298Q8717J00859O6280J4171
17665E865308O4004J75117K50841K61912K81479M50375P32236J027761J362536
$$ plain form
17656 10471569 12278041 14743284 18266261 23555753 31745775 44742570 65171238 94070617
17648 94070617 124726744 142521386 138481933 114392085 82839578 57054377 39950230
17641 39950230 29006523 21781985 16858531 13407495 10931929 9091816 7694284 6636691
17633 6636691 5868575 5331593 4957456 4734056 4588013 4373021 4075377 3724587 3442308
17624 3442308 3273071 3240234 3276821 3252274 3124256 2907568 2682184 2484439 2388894 2378999
17614 2378999 2427819 2453826 2406177 2267780 2064249 1883756 1743345 1637512 1560471 1516820
17604 1516820 1487237 1472574 1469770 1455542 1461136 1453452 1448975 1431788 1438542 1459820 1524416 1643020
17592 1643020 1827683 2039064 2165897 2139714 1982569 1831657 1752329 1743324 1736265 1753077 1792709
$$ packed form
17656A0471569J806472K465243L522977N289492Q190022J2996795K0428668K8899379
17648I4070617L0656127J7794642m039453k4089848l1552507k5785201j7104147
17641C9950230j0943707p224538m923454l451036k475566j840113j397532j057593
17633F636691p68116n36982l74137k23400j46043k14992k97644l50790k82279
17624C442308j69237l2837L6587k4547j28018k16688k25384j97745r5545r895
17614B378999M8820K6007m7649j38397k03531j80493j40411j05833p7041m3651
17604A516820k9583j4663k804j4228N594p684m477j7187O754K1278O4596J18604
17592A643020J84663K11381J26833k6183j57145j50912p9328r005p059J6812L9632
$$ plain form
17581 1792709 1866333 1946126 2041432 2155097 2318231 2504286 2707310 2890067 3018775 3120635
17571 3120635 3234031 3390308 3614883 3926807 4290126 4677279 5110510 5616723 6209311
17562 6209311 6894417 7713935 8682042 9896405 11431333 13385770 15929401 19407423 24534780
17553 24534780 32537534 45149793 63893855 87408815 107906706 116300694 109489273
17546 109489273 90487343 68673429 51635792 40360354 33229961 28774037 26123228
17539 26123228 24817353 24742625 25908042 28568900 33281174 41107408 53695487 72861900
17531 72861900 98054895 122000279 133546928 127840496 107469474 81835928 60674350
17524 60674350 46397877 37328217 31580057 28019418 26152942 25848796 27209315 30534237
$$ packed form
17581A792709P3624P9793R5306J13665J63134J86055K03024J82757J28708J01860
17571C120635J13396J56277K24575L11924L63319L87153M33231N06213N92588
17562F209311O85106Q19518R68107J214363J534928J954437K543631L478022N127357
17553B4534780Q002754J2612259J8744062K3514960K0497891Q393988o811421
17546A09489273j9001930k1813914j7037637j1275438p130393m455924k650809
17539B6123228j305875p4728J165417K660858M712274P826234J2588079J9166413
17531G2861900K5192995K3945384J1546649n706432k0371022k5633546k1161578
17524F0674350j4276473r069660n748160l560639j866476l04146J360519L324922
$$ plain form
17516 30534237 36591270 46731305 62579694 84289124 106464874 119294491 117440410
17509 117440410 101568241 79021709 59188597 45408338 36603115 31072144 27647874
17502 27647874 25683816 24921750 25346295 27148788 30796852 37132959 47601810 64014847
17494 64014847 87131886 112392227 128767671 128542275 112053239 86345946 62191015
17487 62191015 44731485 33161944 25432035 20063441 16191861 13374902 11361479 9912986
17479 9912986 8878081 8095702 7484177 7006282 6564596 6156908 5708889 5195246 4650233
17470 4650233 4160560 3808408 3593134 3452103 3317687 3126796 2844252 2543077 2274816
17461 2274816 2084323 1944223 1827217 1722850 1651263 1568048 1467556 1400519 1348672 1269358
$$ packed form
17516C0534237O057033J0140035J5848389K1709430K2175750J2829617j854081
17509A17440410j5872169k2546532j9833112j3780259q805223n530971l424270
17502B7647874j964058p62066M24545J802493L648064O336107J0468851J6413037
17494F4014847K3117039K5260341J6375444k25396j6489036k5707293k4154931
17487F2191015j7459530j1569541p729909n368594l871580k816959k013423j448493
17479I912986j034905p82379o11525m77895m41686m07688m48019n13643n45013
17470D650233m89673l52152k15274j41031j34416j90891k82544l01175k68261
17461B274816j90493j40100j17006j04367p1587q3215j00492o7037n1847p9314
$$ plain form
17451 1269358 1201334 1151952 1127585 1125167 1104435 1093549 1096182 1096178 1126651 1152851 1148823 1078126 966074
17438 966074 888464 830228 790591 762017 723119 689443 677177 652886 631728 610703 597933
17427 597933 591081 576323 559392 545734 530639 517042 510122 518166 524464 544433 534950 522382
17415 522382 522966 521348 521028 501224 474601 453041 445185 419193 383460 362869 363733 371737 395387
17402 395387 402587 422925 420216 397230 384103 381050 393576 388101 382382 402191 398978 413542 426710
17389 426710 418591 397358 361379 328282 308568 313950 327631 341269 362677 380811 371317 367450
17377 367450 394839 431688 480649 507115 512459 498553 478777 440241 417509 436791 449867 457950
17365 457950 464465 452849 455114 462971 465569 477912 462892 457742 493146 528726 559109 582742
$$ packed form
17451A269358o8024m9382k4367k418k0732j0886K633mL0473K6200m028p0697j12052
17438I66074p7610n8236l9637k8574l8898l3676j2266k4291k1158k1025j2770
17427E97933o852j4758j6931j3658j5095j3597o920Q044O298J9969r483j2568
17415E22382N84j618l20j9804k6623k1560p856k5992l5733k0591Q64Q004K3650
17402C95387P200K0338k709k2986j3127l053J2526n475n719J9809l213J4564J3168
17389D26710q119k1233l5979l3097j9714N382J3681J3638K1408J8134r494l867
17377C67450K7389L6849M8961K6466N344j3906j9776l8536k2732J9282J3076Q083
17365D57950O515j1616K265P857K598J2343j5020n150L5404L5580L0383K3633
$$ plain form
17353 582742 600244 614502 601590 578370 544190 521035 505242 494987 465647 421016 410663
17342 410663 411011 414420 409743 411122 417720 420141 427872 457506 483061 525549 541276 532139 508582
17329 508582 522396 521656 513193 506414 497296 514258 558682 597434 604254 632867 661281 662686 654022
17316 654022 634913 605616 603972 608784 608587 621681 645911 661479 658391 647206 636142 669377
17304 669377 704320 735727 745354 762824 777398 820726 865727 904164 915936 931811 936175 942339
17292 942339 951968 969054 992961 1016590 1044382 1089626 1147398 1236243 1350393 1450311 1517179
17281 1517179 1527647 1507985 1511669 1539943 1578724 1632402 1671972 1719852 1779724 1833626 1906896
17270 1906896 2056660 2219645 2426216 2691003 2996000 3290249 3578596 3880735 4204540
$$ packed form
17353E82742J7502J4258j2912k3220l4180k3155j5793j0255k9340m4631j0353
17342D10663L48L409m677J379O598K421P731K9634K5555M2488J5727r137k3557
17329E08582J3814p40q463o779r118J6962M4424L8752O820K8613K8414J405q664
17316F54022j9109k9297j644M812j97J3094K4230J5568l088j1185j1064L3235
17304F69377L4943L1407R627J7470J4574M3328M5001L8437J1772J5875M364O164
17292I42339R629J7086K3907K3629K7792M5244N7772Q8845J14150R9918O6868
17281A517179J0468j9662L684K8274L8781N3678L9570M7880N9872N3902P3270
17270A906896J49764J62985K06571K64787L04997K94249K88347L02139L23805
$$ plain form
17261 4204540 4616078 5181421 5864457 6644848 7608497 8862566 10524709 12847161 16251308
17252 16251308 21432794 29533937 41921129 58568579 74206127 78126775 67246308
17245 67246308 51204234 38208169 29621013 24170720 20688585 18517559 17369736 17022434
17237 17022434 17383313 18446452 20325766 23406687 28300109 35888690 47455561 63833270
17229 63833270 82487968 95575055 98843746 99698312 103525527 102592025 88959578 68665201
17221 68665201 51116124 38978494 31065369 25895087 22532586 20515931 19570842 19477711
17213 19477711 19863140 20618218 22079234 24904601 29931167 38201078 50495849 65103544
17205 65103544 74546962 70720084 57102344 43277554 33373272 27135538 23480064 21702257
$$ packed form
17261D204540M11538N65343O83036P80391R63649J254069J662143K322452L404147
17252A6251308N181486Q101143J2387192J6647450J5637548L920648j0880467
17245F7246308j6042074j2996065q587156n450293l482135k171026j147823l47302
17237A7022434L60879J063139J879314L080921M893422P588581J1566871J6377709
17229F3833270J8654698J3087087L268691Q54566L827215r33502j3632447k0294377
17221F8665201j7549077j2137630p913125n170282l362501k016655r45089r3131
17213A9477711L85429P55078J461016K825367N026566Q269911J2294771J4607695
17205F5103544R443418l826878j3617740j3824790r904282o237734l655474j777807
$$ plain form
17197 21702257 21581641 23268769 27274527 34441187 45510277 58857176 67404267 63712910
17189 63712910 51241251 38724176 29795309 23988915 20259258 17873469 16472369 15781510
17181 15781510 15619155 15967747 16926656 18715861 21719351 26525910 34055942 45375778
17173 45375778 60232591 74162996 80440998 80523323 81970329 84042081 78250640 63566752
17165 63566752 47717597 35717047 27759155 22578746 19143708 16807257 15256310 14400428
17157 14400428 14164700 14414326 15215135 16897499 19931735 25038568 33101142 44097526
17149 44097526 54432404 56484027 47746037 35252227 25166236 18427108 13996575 10954595
17141 10954595 8818175 7335115 6334653 5638161 5070663 4560017 4164602 3880898 3625019
$$ packed form
17197B1702257j20616J687128M005758P166660J1069090J3346899Q547091l691357
17189F3712910j2471659j2517075q928867n806394l729657k385789j401100o90859
17181A5781510j62355L48592R58909J789205L003490M806559P530032J1319836
17173D5375778J4856813J3930405O278002Q2325J447006K071752n791441j4683888
17165F3566752j5849155j2000550p957892n180409l435038k336451j550947q55882
17157A4400428k35728K49626Q00809J682364L034236N106833Q062574J0996384
17149D4097526J0334878K051623q737990j2493810j0085991o739128m430533l041980
17141A0954595k136420j483060j000462o96492n67498n10646l95415k83704k55879
$$ plain form
17132 3625019 3345216 2989760 2645234 2362265 2109931 1883543 1723706 1602784 1486785
17123 1486785 1379479 1297355 1229057 1163786 1122515 1104580 1071112 1072062 1112661 1121052 1059071 976374
17111 976374 911582 870807 833673 763874 706065 673416 627345 587410 549881 509156 476112
17100 476112 437754 409457 397616 398132 393762 403994 393968 377914 372266 378682 387555 384203 365567
17087 365567 329609 298845 294621 308124 322684 312679 292677 284830 265877 242585 238750 230140
17075 230140 238611 262939 286384 294370 302330 312552 299183 313487 337787 340997 349790 327681
17063 327681 322625 326729 358303 395382 396984 377630 332054 301490 301643 279003 268966 263679 258261
17050 258261 261382 288042 298742 278837 250006 211711 203586 218544 244198 258642 267594 253529
$$ packed form
17132C625019k79803l55456l44526k82969k52334k26388j59837j20922j15999
17123A486785j07306q2124o8298o5271m1271j7935l3468R50M0599Q391o1981q2697
17111I76374o4792m0775l7134o9799n7809l2649m6071l9935l7529m0725l3044
17100D76112l8358k8297j1841N16m370J0232j0026j6054n648O416Q873l352j8636
17087C65567l5958l0764m224J3503J4560j0005k0002p847j8953k3292l835q610
17075B30140Q471K4328K3445P986P960J0222j3369J4304K4300L210Q793k2109
17063C27681n056M104L1574L7079J602j9354m5576l0564J53k2640j0037n287n418
17050B58261L121K6660J0700j9905k8831l8295q125J4958K5654J4444Q952j4065
$$ plain form
17038 253529 237316 254973 231873 207329 208026 215290 260032 278818 277667 312225 370429 465006
17026 465006 578199 691020 777267 776781 696497 561916 440727 370063 338311 319447 322171
17015 322171 322140 344516 370850 397327 404977 415151 432695 486765 579105 683077 785475 850242
17003 850242 806815 682829 548589 465803 413103 382820 363743 349888 359995 380815 397993
16992 397993 415439 436498 496763 598018 743805 861330 907858 853515 699641 541537
16982 541537 433169 378268 328514 292614 265502 237781 234595 251668 246358 252796 287288 335978
16970 335978 403482 516350 600893 643787 618576 538384 418835 307530 224681 174294 155237
16959 155237 123695 114342 100950 84431 73672 67590 62286 55800 54760 68141 61172 52854 64564
$$ packed form
17038B53529j6213J7657k3100k4544O97P264M4742J8786j151L4558N8204R4577
17026D65006J13193J12821Q6247m86q0284j34581j21189p0664l1752j8864K724
17015C22171l1K2376K6334K6477P650J0174J7544N4070R2340J03972J02398O4767
17003H50242m3427j23986j34240q2786n2700l0283j9077j3855J0107K0820J7178
16992C97993J7446K1059O0265J01255J45787J17525M6528n4343j53874j58104
16982E41537j08368n4901m9754l5900k7112k7721l186J7073n310O438L4492M8690
16970C35978O7504J12868Q4543M2894k5211q0192j19549j11305q2849n0387j9057
16959A55237l1542r353j3392j6519j0759o082n304o486j040J3381o969q318J1710
$$ plain form
16946 64564 80440 73110 44077 30721 33774 50197 51407 65320 78712 82886 79855 69717 57897
16933 57897 56868 55293 28898 16157 19268 18825 38664 55835 44257 27168 33890 42369 37987
16920 37987 38917 34579 36241 36991 39403 38817 42971 35628 39931 35095 13546 21601 31687 43360
16906 43360 43161 49944 61755 75025 59644 68547 54897 23854 12502 18266 27748 12433 5827
16893 5827 10659 24028 41088 25450 1968 -4649 19826 31361 19243 19814 15421 15923 42768
16880 42768 47372 34700 33207 7864 -9725 -7370 -2898 12221 5370 -4893 2521 13790 641
16867 641 13666 15239 8255 -3190 1249 -6687 -2643 11810 28922 25460 19474 25408 15565 7890
16853 7890 30388 18665 2183 1187 -1248 -7534 -2353 6319 5483 -10586 -20332 4454 -7031 -31536
$$ packed form
16946F4564J5876p330k9033j3356L053J6423J210J3913J3392M174l031j0138j1820
16933E7897j029j575k6395j2741L111m43J9839J7171j1578j7089O722Q479m382
16920C7987R30m338J662P50K412n86M154p343M303m836k1549Q055J0086J1673
16906D3360j99O783J1811J3270j5381Q903j3650l1043j1352N764R482j5315o606
16893E827M832J3369J7060j5638k3482o617K4475J1535j2118N71m393N02K6845
16880D2768M604j2672j493k5343j7589K355M472J5119o851j0263P414J1269j3149
16867F41J3025J573o984j1445M439p936M044J4453J7112l462n986N934r843p675
16853G890K2498j1723j6482r96k435o286N181Q672q36j6069r746K4786j1485k4505
$$ plain form
16839 -31536 -28761 -10690 -6461 -3549 23646 44369 66265 65248 59998 49336 39283 25400 18852
16826 18852 14211 12554 -4509 -6435 -599 15348 -895 -8565 -11845 7503 34452 11617 -12359
16813 -12359 -15085 -1167 6616 23246 27653 19851 -1934 -24028 -13737 1184 -2552 6781 -9896
16800 -9896 -10397 8499 25249 17102 -426 -14923 -10968 -4211 -9512 -14208 -7167 10431 -2507
16787 -2507 -20710 -6367 18520 15857 396 -7409 -10180 -2348 11123 6435 3086 -4447 -15820
16774 -15820 -10969 4434 17988 23316 11731 -6367 -6305 12919 35748 32539 12676 15188 1930
16761 1930 9982 17580 8385 -12183 -17900 3000 6407 4633 278 6780 2604 6540 12743 13137
16747 13137 20625 35538 43958 34836 44286 45647 34917 27628 39857 80469 100389 115585 153562
$$ packed form
16839c1536K775J8071M229K912K7195K0723K1896j017n250j0662j0053j3883o548
16826A8852m641j657j7063j926N836J5947j6243p670l280J9348K6949k2835k3976
16813a2359k726J3918P783J6630M407p802k1785k2094J0291J4921l736R333j6677
16800i896n01J8896J6750q147j7528j4497L955O757n301m696P041J7598j2938
16787b507j8203J4343K4887k663j5461p805k771P832J3471m688l349p533j1373
16774a5820M851J5403J3554N328j1585j8098O2J9224K2829l209j9863K512j3258
16761A930Q052P598r195k0568n717K0900L407j774m355O502m176L936O203L94
16747A3137P488J4913Q420r122R450J361j0730p289J2229M0612J9920J5196L7977
$$ plain form
16734 153562 204290 267195 345517 368930 326907 257363 182254 136712 126027 120459 109016 95905
16722 95905 79418 76729 76705 97438 129165 135637 168569 245445 339738 420736 472741 497147 505011
16709 505011 519587 503166 409588 305294 227198 184103 152123 130005 105585 76858 54464
16698 54464 58103 68813 88709 105573 137282 162536 190325 261206 346041 382946 332840 265453
16686 265453 208999 172118 137996 125647 107062 107706 130521 147277 189569 230696 303450 367850
16674 367850 354162 288989 215914 158049 125534 99161 84304 72915 62669 58685 52503 59032
16662 59032 98967 132317 172687 212080 268715 333716 399508 445264 450445 468849 486681 455922
16650 455922 364446 274339 216764 180720 123304 91655 83977 86293 86137 73444 83727 109785
$$ packed form
16734A53562N0728O2905P8322K3413m2023o9544p5109m5542j0685n568j1443j3111
16722I5905j6487k689k4K0733L1727O472L2932P6876R4293Q0998N2005K4406P864
16709E05011J4576j6421r3578j04294p8096m3095l1980k2118k4420k8727k2394
16698E4464L639J0710J9896J6864L1709K5254K7789P0881Q4835L6905n0106o7387
16686B65453n6454l6881l4122j2349j8585O44K2815J6756M2292M1127P2754O4400
16674C67850j3688o5173p3075n7865l2515k6373j4857j1389j0246l984o182O529
16662E9032L9935L3350M0370L9393N6635O5001O5792M5756N181J8404J7832l0759
16650D55922r1476r0107n7575l6044n7416l1649p678K316j56j2693J0283K6058
$$ plain form
16638 109785 122740 128883 168098 220851 266410 308332 316125 257696 169708 113062 85919 59896
16626 59896 31543 19491 5423 -1834 -7769 -25718 -16296 -4396 1627 -8713 6696 4034 -15081
16613 -15081 -41529 -39309 -16334 685 15518 31787 23461 11055 5322 2690 -9034 -9430 -15929
16600 -15929 -22991 -18357 -25497 -30582 -12481 -5814 -12939 -22395 -26907 -8357 8743 16975 19643 6265
16586 6265 -12522 -20043 -15538 5021 24014 3243 -20378 210 26 4487 20096 13343 -842
16573 -842 -14277 -13507 -22174 -27521 -33252 -30613 -19960 275 14568 22680 19587 8964 8696 -15249
16559 -15249 -28694 -31864 -32356 -34526 -32598 -34248 -41931 -36347 -16571 -23452 -11259 -1848 -7952 3015
16545 3015 -7428 -6745 -17665 -4408 -1766 -19944 -43126 -34623 -28452 -31955 -13821 -6485 -1756
$$ packed form
16638A09785J2955O143L9215N2753M5559M1922P793n8429q7988n6646k7143k6023
16626E9896k8353j2052j4068p257n935j7949R422J1900O023j0340J5409k662j9115
16613a5081k6448K220K2975J7019J4833J6269q326j2406n733k632j1724l96o499
16600a5929p062M634p140n085J8101O667p125r456m512J8550J7100Q232K668j3378
16586F265j8787p521M505K0559J8993k0771k3621K0588j84M461J5609o753j4185
16573h42j3435P70q667n347n731K639J0653K0235J4293Q112l093j0623k68k3945
16559a5249j3445l170m92k170J928j650p683N584J9776o881J2193R411o104J0967
16545C015j0443O83j0920J3257K642j8178k3182Q503O171l503J8134P336M729
$$ plain form
16532 -1756 -21067 -22989 -15370 -25332 -32804 -19771 -23018 -19277 -6800 7041 20665 32239 32605
16519 32605 37570 35326 6622 -22404 -7292 1616 6028 -4241 -14041 -14395 7690 695 -63 2361
16505 2361 13012 28046 32437 19231 1365 -495 544 18070 30959 17288 2638 -12094
16493 -12094 -21699 -18945 -24777 -21131 -18033 -26090 -27718 -13876 4441 8857 -16254 -31195 -34707
16480 -34707 -24896 -10422 13770 3274 -24421 -26882 -33840 -27419 -24715 -25270 -19489 -1757 12001
16467 12001 -8738 -15774 -22072 -33530 -24193 -16754 -27020 -37321 -18342 -20872 -27508 -20716 -21810
16454 -21810 -12620 9964 2420 -23195 -20681 -17981 -19563 -9994 -15184 -28660 -37743 -35172 -35106 -23739
16440 -23739 -30765 -8126 10100 -1367 -5151 -14112 -25894 -22884 -25039 -40351 -57537 -48718 -30729
$$ packed form
16532a756j9311j922P619r962p472J3033l247L741J2477J3841J3624J1574L66
16519C2605M965k244k8704k9026J5112Q908M412j0269r800l54K2085o995p58K424
16505B361J0651J5034M391j3206j7866j860J039J7526J2889j3671j4650j4732
16493a2094r605K754n832L646L098q057j628J3842J8317M416k5111j4941l512
16480c4707R811J4474K4192j0496k7695k461o958O421K704n55N781J7732J3758
16467A2001k0739p036o298j1458R337P439j0266j0301J8979k530o636O792j094
16454b1810R190K2584p544k5615K514K700j582R569n190j3476r083K571O6J1367
16440b3739p026K2639J8226j1467l784q961j1782L010k155j5312j7186Q819J7989
$$ plain form
16427 -30729 -17856 -11938 -4775 6034 8414 10515 5133 1860 -7323 -14236 3493 -1817 4951 9192
16413 9192 8893 2120 4050 587 -21970 -24033 -15593 -15225 -23670 -27698 -21114 -41446 -50780 -58962 -38965
16398 -38965 -10926 1311 -17158 -31814 -19724 -7661 -1825 -4865 -17801 -24778 -26041 -22627 -14738
16385 -14738 -24115 -24299 -16240 -20914 -25404 -18014 -6050 -19629 -32917 -43717 -47936 -49934 -28000
16372 -28000 -27935 -33903 -30335 -5005 9012 -7226 -2630 10865 4870 -23825 -32124 -7296 6
16359 6 -14435 -19901 -33088 -48100 -44875 -37209 -36988 -31854 -9329 -14965 -24041 -27254 -19744 -23408 -33723
16344 -33723 -17577 12781 10576 20427 24880 -10034 -12244 -8432 -8844 -17273 -17701 -19675 -31132 -21537
16330 -21537 -14613 -2735 601 6042 11135 23392 12019 14952 8173 342 3895 14016 -2051
$$ packed form
16427c0729J2873N918P163J0809K380K101n382l273r183o913J7729n310O768M241
16413I192k99o773J930l463k2557k063Q440L68q445m028O584k0332r334q182J9997
16398c8965K8039J2237j8469j4656J2090J2063N836l040j2936o977j263L414P889
16385a4738r377j84Q059m674m490P390J1964j3579j3288j0800m219j998K1934
16372b8000O5n968L568K5330J4017j6238M596J3495n995k8695q299K4828P302
16359Fj4441n466j3187j5012L225P666K21N134K2525n636r076l213P510l664j0315
16344c3723J6146L0358k205R851M453l4914k210L812m12q429m28j974j1457R595
16330b1537O924J1878L336N441N093J2257j1373K933o779p831L553J0121j6067
$$ plain form
16317 -2051 -8724 -13709 -24822 -23940 -11378 6029 13814 19617 8353 537 15180 17172 8304 15523
16303 15523 2152 -12281 -24602 -19417 -25544 -11339 -8116 -13950 6146 10764 12006 -1222 -11372
16290 -11372 -6535 -3300 10208 3199 -7841 -19333 -17236 675 11049 -16946 -47285 -26603
16278 -26603 -15401 -8978 -17001 -21051 -26516 -15203 -4015 12546 5127 7097 18709 27943 24274
16265 24274 17894 12349 4418 3275 25375 39240 36358 29611 18150 -12230 -20787 -13448 -22386
16252 -22386 -39381 -33084 -8700 -4960 -8327 -19265 -7669 -3684 -8933 -19528 -10782 -14579 -13410
16239 -13410 -10654 -8024 -18568 -33844 -29359 -27219 -30826 -28010 -27256 -20533 -23021 -29943 -28768 -37519
16225 -37519 -10060 22316 8269 9766 13710 -17984 -47128 -22419 -14658 -24734 -21342 -8215
$$ packed form
16317b051o673m985j1113Q82J2562J7407P785N803j1264p816J4643J992q868P219
16303A5523j3371j4433j2321N185o127J4205L223n834K0096M618J242j3228j0150
16290a1372M837L235J3508p009j1040j1492K097J7911J0374k7995l0339K0682
16278b6603J1202O423q023m050n465J1313J1188J6561p419J970J1612R234l669
16265B4274o380n545p931j143K2100J3865k882o747j1461l0380q557P339q938
16252b2386j6995O297K4384L740l367j0938J1596L985n249j0595Q746l797J169
16239a3410K756K630j0544j5276M485K140l607K816P54O723k488o922J175q751
16225c7519K7459L2376j4047J497L944l1694k9144K4709P761j0076L392J3127
$$ plain form
16213 -8215 6228 21655 27680 18966 29923 18800 2499 -2429 8435 16845 3871 -24871 -49084
16200 -49084 -30358 -40737 -32624 -16544 -2939 1730 541 -31032 -20832 -18865 -16950 -16097 -33134
16187 -33134 -22147 -14175 -7664 -6865 -6227 -1073 12324 8713 11146 9690 2381 -12067 -15878 1293
16173 1293 17404 20336 1477 -6937 -7486 -16451 -25263 -13600 7992 17173 6673 8309 10270 261
16159 261 -18837 -28098 -16867 -2484 3069 21754 -175 -9455 -21154 -26385 -28936 -35451 -37076
16146 -37076 -26095 -2586 322 4149 5932 -11596 -29258 -29875 -4386 -2918 -9089 -1996 10436
16133 10436 16689 1902 -7644 103 -17474 -21436 -7810 9192 4342 -3792 -1319 -11326 -14969
16120 -14969 -3991 -5974 -13111 -12966 -17258 -36230 -29297 -29265 -19400 -17516 -3658 -6934 -867 10302
$$ packed form
16213h215J4443J5427O025q714J0957j1123j6301m928J0864Q410j2974k8742k4213
16200d9084J8726j0379Q113J6080J3605M669j189l1573J0200J967J915Q53j7037
16187c3134J0987P972O511P99O38N154J3397l611K433j456p309j4448l811J7171
16173A293J6111K932j8859q414n49q965q812J1663K1592R181j0500J636J961j0009
16159B61j9098r261J1231J4383N553J8685k1929r280j1699n231k551o515j625
16146c7076J0981K3509K908L827J783j7528j7662o17K5489J468o171P093J2432
16133A0436O253j4787r546P747j7577l962J3626J7002m850q134K473j0007l643
16120a4969J0978j983p137J45m292j8972O933L2R865J884J3858l276O067J1169
$$ plain form
16106 10302 12380 20718 17463 -8671 3664 113 -1874 3403 -2467 -20090 -31893 -23252 -18580
16093 -18580 -10902 -13323 -26720 -22888 -5424 9432 6151 8433 20293 8262 9386 25381 44200
16080 44200 52204 41171 36232 27489 24975 19628 20914 5897 9979 -3993 8863 18380 28828
16067 28828 11549 4431 700 -7883 -112 14941 6298 -13334 -1787 13623 14580 5370 -15473
16054 -15473 -35304 -33198 -7359 -3107 -5007 -16052 -34033 -31835 -37002 -28264 -2489 4357 20083
16041 20083 15136 15152 6746 -6341 -17906 -12693 -19401 -26782 -36461 -34018 -18451 4406 11318 20292
16027 20292 11338 3734 1051 -5568 400 -1229 -921 21512 17534 6820 508 2053 -343 -12552
16013 -12552 6289 14409 13256 6223 5184 -6747 -8807 -5724 -9819 -14333 -10118 8301 -13162
$$ packed form
16106A0302K078Q338l255k6134J2335l551j987N277n870j7623j1803Q641M672
16093a8580P678k421j3397L832J7464J4856l281K282J1860j2031J124J5995J8819
16080D4200Q004j1033m939q743k514n347J286j5017M082j3972J2856R517J0448
16067B8828j7279p118l731q583P771J5053q643j9632J1547J5410R57r210k0843
16054a5473j9831K106K5839M252j900j1045j7981K198n167Q738K5775O846J5726
16041B0083m947J6q406j3087j1565N213o708p381r679K443J5567K2857O912Q974
16027B0292q954p604k683o619N968j629L08K2433l978j0714o312J545k396j2209
16013a2552J8841Q120j153p033j039j1931k060L083m095m514M215J8419k1463
$$ plain form
16000 -13162 -17426 -14124 -17888 -11900 -10706 -17086 -15158 -14181 -5269 8984 5746 27497 25999 3391
15986 3391 -3367 -2507 -11713 -869 -11282 -20821 -10388 4777 19793 13614 -625 -4516 -5561
15973 -5561 -3923 -17184 -8848 2989 19636 5020 -9989 -22462 -18254 -15847 -6749 -1380 -2564
15960 -2564 5649 1065 -16908 -5854 15407 19170 16893 -6843 -16682 -9373 9066 14664 4998
15947 4998 7933 4426 8704 8101 10241 2809 4766 9608 1181 -803 4798 646 -4683 -16204 -17901
15932 -17901 -12976 -12957 -8154 -9259 -1760 7638 -9440 -25375 -26147 -14013 2985 8812 10483 6168
15918 6168 1084 406 -5556 6929 22391 21896 28425 38889 24930 28053 31490 36383 7034 -12084
15904 -12084 -1724 2046 -10599 -21983 -18934 -5259 -6917 -7625 -7477 719 11232 1567 -18831
$$ packed form
16000a3162m264L302l764N988J194o380J928R77Q912J4253l238K1751j498k2608
15986C391o758Q60r206J0844j0413r539J0433J5165J5016o179j4239l891j045
15973e561J638j3261Q336J1837J6647j4616j5009j2473M208K407R098N369j184
15960b564Q213m584j7973J1054K1261L763k277k3736r839P309J8439N598r666
15947D998K935l507M278o03K140p432J957M842q427j984N601m152n329j1521j697
15932a7901M925J9M803j105P499R398j7078j5935p72J2134J6998N827J671m315
15918F168n084o78n962J2485J5462m95O529J0464j3959L123L437M893k9349j9118
15904a2084J0360L770j2645j1384L049J3675j658p08J48Q196J0513r665k0398
$$ plain form
15891 -18831 -38680 -24635 277 -6819 3612 7287 3890 3028 -12002 -10368 -13615 -27309 -17834
15878 -17834 -6304 4707 -5309 -2757 8396 21207 28950 23815 7379 544 7317 24747 38910
15865 38910 34904 10134 6655 4838 2528 2429 11864 2679 -12429 -11302 -15064 -15987 -21460 -17754 -8817
15850 -8817 -11512 -18634 -25232 -39707 -33850 -22055 -5878 10311 15895 15457 11909 844 11203
15837 11203 401 8214 16718 17170 10708 8151 -14962 -28605 -36229 -18720 -1757 -1056 5727 14976
15823 14976 -3042 -8349 -6142 6440 -594 -9370 -6269 -6192 -11008 -15622 -4755 11067 -4169 -305
15809 -305 8472 -11000 -22452 -28194 -9365 9585 12105 -9550 -7588 11208 4833 -66 -195 2900
15795 2900 -9221 -20697 -15871 -4484 12647 32490 17798 -6225 -17645 -19626 -1435 -1
$$ packed form
15891a8831j9849J4045K4912p096J0431L675l397q62j5030J634l247j3694R475
15878a7834J1530J1011j0016K552J1153J2811P743n135j6436o835O773J7430J4163
15865C8910m006k4770l479j817k310r9R435r185j5108J127l762r23n473L706Q937
15850h817k695p122o598j4475N857J1795J6177J6189N584m38l548j1065J0359
15837A1203j0802P813Q504M52o462k557k3113j3643p624J7509J6963P01O783R249
15823A4976j8018n307K207J2582p034q776L101P7m816m614J0867J5822j5236L864
15809c05Q777j9472j1452n742J8829J8950K520k1655J962J8796o375m899j29L095
15795B900j2121j1476M826J1387J7131J9843j4692k4023j1420j981J8191J434
$$ plain form
15783 -1 -14875 -22068 -19447 -16612 -12137 -6221 -26534 -26034 -22059 -8969 2571 5540 -1844 -22120
15769 -22120 3354 -3313 -9583 3389 669 -8802 1577 -13819 -16159 -9937 115 -17901 -6825
15756 -6825 6193 10417 6377 18767 37540 22846 11244 -10459 5601 22228 19629 12680 7232
15743 7232 242 12922 27542 7666 5902 17320 25940 15958 3989 -5767 -13779 -3264 836
15730 836 -2604 -8480 -20762 -1789 45933 53944 21074 7344 -12861 -8735 5838 1834 -23966
15717 -23966 -35145 -33498 -30589 -32970 -29607 -29868 -28489 -34350 -35824 -23391 -21739 -21073 -9811 13711
15703 13711 36688 46580 29157 15620 36195 27908 10290 21833 14301 8614 9505 13168 2173
15690 2173 -6143 -14630 -15039 -7087 11701 6623 -6979 -17924 -18696 3747 2916 -12010 -16537 -20240
$$ packed form
15783aj4874p193K621K835M475N916k0313N00L975J3090J1540K969p384k0276
15769b2120K5474o667o270J2972k720r471J0379j5396k340O222J0052j8016J1076
15756f825J3018M224m040J2390J8773j4694j1602k1703J6060J6627k599o949n448
15743G232o990J2680J4620j9876j764J1418Q620r982j1969r756q012J0515M100
15730H36l440n876j2282J8973M7722Q011l2870j3730k0205M126J4573m004k5800
15717b3966j1179J647K909k381L363k61J379n861j474J2433J652O66J1262K3522
15703A3711K2977R892j7423j3537K0575q287j7618J1543p532n687Q91L663j0995
15690B173q316q487m09P952J8788n078j3602j0945p72K2443q31j4926m527l703
$$ plain form
15676 -20240 -22854 -15220 -2745 25404 29617 21010 16357 27325 25722 3923 -2887 -12956 -11425
15663 -11425 -6932 -8325 -9955 -9767 -2949 -13174 -1989 -8989 -18518 -7417 -10956 -2946 -1731 -8140
15649 -8140 -5885 4173 13035 16095 16814 21409 30097 33853 28916 18363 16482 12960 7307 9511
15635 9511 15604 25016 29197 16586 13260 18460 200 -19179 -9066 24946 34065 14134 6493
15622 6493 23347 12416 6719 -733 9627 13140 16293 22014 19010 11959 29795 1229 -21465
15609 -21465 -7561 328 3132 11088 -11713 -24832 -7445 20509 19124 12406 14385 -956 -10350
15596 -10350 -14431 -10462 -18346 -15239 -5669 -29905 -33329 -31247 -22467 -7804 -908 10352 16506 10861
15582 10861 21215 43867 44905 23665 1147 -8574 -6193 1669 1824 17395 42985 40165 28106
$$ packed form
15676b0240k614P634J2475K8149M213q607m653J0968j603k1799o810j0069J531
15663a1425M493j393j630J88O818j0225J1185p000r529J1101l539Q010J215o409
15649h140K255J0058Q862L060P19M595Q688L756m937j0553j881l522n653K204
15635I511O093R412M181j2611l326N200j8260j9379J0113L4012R119j9931p641
15622F493J6854j0931n697p452J0360L513L153N721l004p051J7836k8566k2694
15609b1465J3904P889K804P956k2801j3119J7387K7954j385o718J979j5341r394
15596a0350m081L969p884L107R570k4236l424K082Q780J4663O896J1260O154n645
15582A0861J0354K2652J038k1240k2518r721K381P862J55J5571K5590k820j2059
$$ plain form
15569 28106 19210 4969 1341 20833 22249 9000 8241 3299 -6955 -12525 4390 22441 19332
15556 19332 10935 16700 14066 14077 5139 -2533 -9344 -5480 10997 21378 18180 18602 8110 -10816
15542 -10816 -25603 -25119 -9184 -5249 18550 20814 1878 4665 16015 156 -16130 -28258 -21715
15529 -21715 -4068 -2423 -6269 3838 -11513 -19935 -4750 3170 20865 18802 12630 1285 11257
15516 11257 2549 20056 20874 -6767 570 10269 7950 11967 8955 6407 4326 -804 6658 14289
15502 14289 27146 27669 11332 6254 -20439 -6269 13111 7866 21184 25078 35275 23913 27939
15489 27939 29316 25925 -1732 -9149 -4299 7160 10961 6678 5601 9656 5014 -27238 -22133 -18326
15475 -18326 -22797 -15627 -30611 -35208 -18392 2846 15363 17396 23980 34679 31430 5376 4647
$$ packed form
15569B8106q896j4241l628J9492J416j3249p59m942j0254n570J6915J8051l109
15556A9332q397N765k634J1q938p672o811L864J6477J0381l198M22j0492j8926
15542a0816j4787M84J5935L935K3799K264j8936K787J1350j5859j6286j2128O543
15529b1715J7647J645l846J0107j5351q422J5185P920J7695k063o172j1345R972
15516A1257q708J7507Q18k7641P337R699k319M017l012k548k081n130P462P631
15502A4289J2857N23j6337n078k6693J4170J9380n245J3318L894J0197j1362M026
15489B7939J377l391k7657p417M850J1459L801m283j077M055m642l2252N105L807
15475a8326m471P170j4984m597J6816K1238J2517K033O584J0699l249k6054p29
$$ plain form
15462 4647 15950 28817 11651 -594 1359 7687 6008 -11628 -14424 -566 12446 6814 -4126
15449 -4126 -9622 14182 24609 33033 29870 18274 14288 14120 26620 43528 56073 61213 62858
15436 62858 59285 71655 99200 118876 132964 148835 179702 185444 205493 238660 281693 320087
15424 320087 357208 396301 481601 552073 607709 644686 665263 653119 624258 554275 493906
15413 493906 448245 378835 306949 261655 230221 197815 166526 154889 142725 128319 102268
15402 102268 68508 28998 19596 31487 58780 77925 88940 64086 62127 58828 55387 51671
15390 51671 39272 32334 39779 38668 47208 35748 38520 43874 26720 25331 27800 31676 22205 27263
15376 27263 31766 43615 50808 28902 21016 28560 36489 27898 28996 29179 35605 17168 21555 51914
$$ packed form
15462D647J1303J2867j7166j2245J953O328j679j7636k796J3858J3012n632j0940
15449d126n496K3804J0427Q424l163j1596l986j68J2500J6908J2545N140J645
15436F2858l573J2370K7545J9676J4088J5871L0867N742K0049L3167M3033L8394
15424C20087L7121L9093Q5300P0472N5636L6977K0577j2144k8861o9983o0369
15413D93906m5661o9410p1886m5294l1434l2406l1289j1637j2164j4406k6051
15402A02268l3760l9510r402J1891K7293J9145J1015k4854j959l299l441l716
15390E1671j2399o938P445j111Q540j1460K772N354j7154j389K469L876r471N058
15376B7263M503J1849P193k1906p886P544P929q591J098J83O426j8437M387L0359
$$ plain form
15362 51914 63900 46575 16467 912 4527 9565 15859 15350 7979 17095 31639 36270 16264
15349 16264 16313 13744 -2523 3070 19234 19689 17723 13241 997 -9954 -4829 -12667 -15893 -23536
15335 -23536 -11443 -6166 13229 18653 8967 -6190 -16489 -11901 -878 23714 38315 31884 24567
15322 24567 32138 53517 44122 33637 25669 1673 -6591 18776 23741 30940 40397 40306 30863 26132
15308 26132 38251 47339 39185 4935 1833 12471 8799 9674 13760 17020 11534 9167 -1422 -1277
15294 -1277 914 -7314 -11621 -12559 -10292 -19413 -21443 -160 12889 11582 5884 4875 -3292 1319
15280 1319 -4024 -2349 11415 14871 19577 23371 10186 8353 23509 17991 9202 4319 22028 22845
15266 22845 25542 30105 30075 21452 34032 32627 27293 12710 8976 6761 4763 -2701 10636 22162
$$ packed form
15362E1914J1986j7325l0108j5555L615N038O294n09p371R116J4544M631k0006
15349A6264M9k569j6267N593J6164M55j966m482j2244j0951N125p838l226p643
15335b3536J2093N277J9395N424r686j5157j0299M588J1023K4592J4601o431p317
15322B4567P571K1379r395j0485p968k3996q264K5367M965P199R457r1r443m731
15308B6132J2119R088q154l4250l102J0638l672Q75M086L260n486k367j0589J45
15294a277K191q228m307r38K267r121k030K1283J3049j307n698j009q167M611
15280A319n343J675J3764L456M706L794j3185j833J5156n518q789m883J7709Q17
15266B2845K697M563l0q623J2580j405n334j4583l734k215j998p464J3337J1526
$$ plain form
15252 22162 23311 -3036 -18850 -13939 196 4381 10626 13165 5804 2522 24987 32928 21763
15239 21763 17867 31204 23849 21388 15675 9899 -1898 -3199 1075 1558 2717 -10181 -4728 -5663
15225 -5663 11884 748 -6741 5438 12012 26753 23663 6941 15460 10105 4705 15260 -1555
15212 -1555 -9755 -12228 -2072 23822 33108 31714 44375 25827 11863 6736 -9613 -12240 16491
15199 16491 21185 11882 25090 18543 10208 1921 12565 26590 18503 16700 20457 12030 20528 20908
15185 20908 22049 8983 6786 3276 3639 28227 37162 28596 31855 36990 39290 42641 41547 45449
15171 45449 41027 17293 19694 21605 29838 44982 45234 29599 14094 15134 3482 4290 -7498
15158 -7498 -10785 5885 9958 20298 18743 18994 31901 38167 23991 -2630 -5714 1219 -2003 8367
$$ packed form
15252B2162J149k6347j5814M911J4135M185O245K539p361l282K2465P941j1165
15239B1763l896J3337p355k461n713n776j1797j301M274M83J159j2898N453r35
15225e663J7547j1136p489J2179O574J4741l090j6722Q519n355n400J0555j6815
15212a555q200k473J0156K5894R286j394J2661j8548j3964n127j6349k627K8731
15199A6491M694r303J3208o547q335q287J0644J4025q087j803L757q427Q498L80
15185B0908J141j3066k197l510L63K4588Q935q566L259N135K300L351j094L902
15171D5449m422k3734K401J911Q233J5144K52j5635j5505J040j1652Q08j1788
15158g498l287J6670M073J0340j555K51J2907O266j4176k6621l084O933l222J0370
$$ plain form
15144 8367 16617 25920 10402 -3396 5662 4778 -19161 -31083 -23578 -28550 -13027 8793 25992
15131 25992 18669 21919 19011 21028 27939 21557 8969 10732 22526 42258 47237 30029 25182
15118 25182 18213 -11349 -15577 367 23276 28230 -219 5279 19708 26928 27396 26787 18778 24658
15104 24658 38207 60835 65062 27459 6325 21073 44641 47583 26495 46013 42224 35776
15092 35776 34179 24932 15447 -5428 5319 -10930 -16883 -9844 6256 8292 12349 10630 14064
15079 14064 21447 41128 48673 56636 59259 36786 20961 24634 39248 35970 37465 36326 25497
15066 25497 11082 7327 14182 31588 41289 55323 59174 54046 45039 33779 27107 24387 30891
15053 30891 30555 22109 16156 16822 21460 18736 22080 8558 31560 34232 4722 -4010 8855 11479
$$ packed form
15144H367Q250R303j5518j3798R058q84k3939j1922P505m972J5523K1820J7199
15131B5992p323L250k908K017O911o382j2588J763J1794J9732M979j7208m847
15118B5182o969k9562m228J5944K2909M954k8449N498J4429P220M68o09q009N880
15104B4658J3549K2628M227l7603k1134J4748K3568K942k1088J9518l789o448
15092C5776j597r247r485k0875J0747j6249n953P039J6100K036M057j719L434
15079A4064P383J9681P545P963K623k2473j5825L673J4614l278J495j139j0829
15066B5497j4415l755O855J7406R701J4034L851n128r007j1260o672k720O504
15053C0891l36q446n953O66M638k724L344j3522K3002K672k9510q732J2865K624
$$ plain form
15039 11479 4617 15774 9561 -2234 16313 29174 13845 16255 46873 45449 28981 27971 27834
15026 27834 31443 22127 7282 9941 13048 19148 28601 42380 47419 57383 51593 46091 41356 24996
15012 24996 19812 43332 35027 21119 18783 4605 29358 43902 26188 12261 -100 3085
15000 3085 18961 39289 67787 51642 48739 45029 63620 76338 60407 47896 44194 29565
14988 29565 4230 7408 8466 27864 22451 40025 57754 77719 63666 46945 33234 23688
14976 23688 36830 38208 40309 33739 37092 32824 28610 29533 39443 37922 31913 34453 40707 29861
14962 29861 4346 6516 27838 50246 56710 51668 53885 60437 51259 22313 -8328 -6839 -4538
14949 -4538 -4676 14588 30149 55652 65641 77792 53996 52421 46871 54686 51373 53666 52308 63876
$$ packed form
15039A1479o862J1157o213j1795J8547J2861j5329K410L0618j424j6468j010j37
15026B7834L609r316j4845K659L107O100R453J3779N039R964n790n502m735j6360
15012B4996n184K3520q305j3908k336j4178K4753J4544j7714j3927j2361L185
15000C085J5876K0328K8498j6145k903l710J8591J2718j5931j2511l702j4629
14988B9565k5335L178J058J9398n413J7574J7729J9965j4053j6721j3711r546
14976B3688J3142J378K101o570L353m268m214R23R910j521o009K540O254j0846
14962B9861k5515K170K1322K2408O464n042K217O552r178k8946l0641J489K301
14949d538j38J9264J5561K5503R989J2151k3796j575n550P815l313K293j358J1568
$$ plain form
14935 63876 49265 45027 53883 44571 53135 62306 63891 49475 40881 37911 25338 26007 340 -6855
14921 -6855 7885 26535 55620 77183 77033 68070 78835 104661 94273 80367 76687 87608 95937
14908 95937 64279 43351 32233 19063 27202 37421 39873 45881 52418 64597 72607 59393 50477
14895 50477 62540 54370 51162 58051 63312 42578 16852 22431 22605 42029 42829 37566 22307 29628
14881 29628 24793 26003 30833 39749 53198 47465 45422 60847 77318 78464 54526 45066 58976
14868 58976 61940 64793 59938 41441 38001 36029 45890 42045 30301 38091 58114 84599 99345
14855 99345 85570 68451 38192 47136 48342 38254 25284 25972 51305 58253 49019 44730 43057
14842 43057 44889 48538 70025 72464 71793 62950 36544 27046 32089 48451 69641 81500 62305
$$ packed form
14935F3876j4611m238Q856r312Q564R171J585j4416q594k970j2573O69k5667p195
14921f855J4740J8650K9085K1563j50q963J0765K5826j0388j3906l680J0921Q329
14908I5937l1658k0928j1118j3170Q139J0219K452O008O537J2179Q010j3214q916
14895E0477J2063q170l208O889N261k0734k5726N579J74J9424Q00n263j5259P321
14881B9628m835J210M830Q916J3449n733k043J5425J6471J146k3938r460J3910
14868E8976K964K853m855j8497l440j972R861l845j1744P790K0023K6485J4746
14855I9345j3775j7119l0259Q944J206j0088j2970O88K5333O948r234m289j673
14842D3057J832L649K1487K439o71q843k6406r498N043J6362K1190J1859j9195
$$ plain form
14829 62305 53675 65952 56770 54537 65197 65863 55301 46124 39771 51138 47024 36971 41548
14816 41548 54080 57870 61272 61989 57580 58320 49908 43607 56515 76032 85159 88876 70769 54820
14802 54820 52530 66341 80850 87775 85450 96136 110105 109894 87865 82204 86195 79025 71543
14789 71543 60675 76177 68655 63632 67405 72378 87367 82898 66377 71272 76794 77022 96595
14776 96595 114227 105272 101432 106864 110203 106500 92921 78569 70089 57426 35276 43386 66412
14763 66412 73869 80968 93219 123131 128600 128083 133860 149497 143367 145020 146886 143440 134297 126849
14749 126849 140220 161147 184180 178953 177609 181914 190807 207307 221928 240309 242397 254216
14737 254216 285105 316778 315567 321455 316431 322556 341997 350344 334367 326989 308287 307554 313121
$$ packed form
14829F2305q630J2277r182k233J0660O66j0562r177o353J1367m114j0053M577
14816D1548J2532L790L402P17m409P40q412o301J2908J9517R127L717j8107j5949
14802E4820k290J3811J4509O925k325J0686J3969k11k2029n661L991p170p482
14789G1543j0868J5502p522n023L773M973J4989m469j6521M895N522K28J9573
14776I6595J7632q955l840N432L339l703j3579j4352q480j2663k2150Q110K3026
14763F6412P457P099J2251K9912N469n17N777J5637o130J653J866l446r143p448
14749A26849J3371K0927K3033n227j344M305Q893J6500J4621J8381K088J1819
14737B54216L0889L1673j211N888n024O125J9441Q347j5977p378j8702p33N567
$$ plain form
14724 313121 306758 297608 284756 282326 261438 236970 229477 218911 213771 196183 195526 194962 178007
14711 178007 186995 209824 211994 232023 225621 211683 198783 189827 173295 173047 189544 180518 177636
14698 177636 165767 183402 212175 222493 235021 268465 297075 312817 344244 377615 414501
14687 414501 443882 440941 390309 336877 315785 328796 287918 259401 266167 259742 246129 234843
14675 234843 220756 202165 197793 188542 185921 176706 164555 151804 141990 127234 143544 162454
14663 162454 157535 139097 132665 136937 132235 159842 196353 208403 186285 169980 170614 186597 194221
14650 194221 198712 203962 186433 196012 193655 176100 173020 172289 156841 155647 160042 183364 188764
14637 188764 183495 191105 187928 202478 215325 207546 194304 203009 200335 183960 184503 189718 185986
$$ packed form
14724C13121o363r150j2852k430k0888k4468p493j0566n140j7588o57n64j6955
14711A78007Q988K2829K170K0029o402j3938j2900q956j6532k48J6497r026k882
14698A77636j1869J7635K8773J0318J2528L3444K8610J5742L1427L3371L6886
14687D14501K9381k941n0632n3432k1092J3011m0878k8517O766o425j3613j1286
14675B34843j4087j8591m372r251k621r215j2151j2751r814j4756J6310J8910
14663A62454m919j8438o432M272m702K7607L6511J2050k2118j6305O34J5983P624
14650A94221M491N250j7529R579k357j7555l080p31j5448j194M395K3322N400
14637A88764n269P610l177J4550J2847p779j3242Q705k674j6375N43N215l732
$$ plain form
14624 185986 188473 195520 196601 187142 187475 191265 221989 256980 266865 250637 240091 206909 203074
14611 203074 204620 208126 204356 214507 199338 203647 228076 231151 211701 196033 209909 218666 215218
14598 215218 233497 234897 212121 205795 221511 230136 254866 291580 320035 340755 364733 385590
14586 385590 390492 379119 368889 362508 351334 339634 326168 344543 364202 360634 369075 380273
14574 380273 379364 373909 385806 425471 447644 448199 482359 525541 582865 663492 773768 891786
14562 891786 981576 1041062 1052697 1002377 920905 847643 798136 757977 726202 703623 661591
14551 661591 624724 606322 590639 597193 603784 612241 615177 613950 627041 631578 623731 629345 638156
14538 638156 639629 639250 645943 635586 633388 633085 639271 644452 639976 648977 673082 680053 676325 686459
$$ packed form
14624A85986K487P047J081r459L33L790L0724L4991R885j6228j0546l3182l835
14611B03074J546L506l770J0151j5169M309K4429L075j9450j5668J3876Q757l448
14598B15218J8279J400k2776o326J5716Q625K4730L6714K8455K0720K3978K0857
14586C85590M902j1373j0230o381j1174j1700j3466J8375J9659l568Q441J1198
14574C80273r09n455J1897L9665K2173N55L4160M3182N7324Q0627J10276J18018
14562H91786Q9790N9486J1635n0320q1472p3262m9507m0159l1775k2579m2032
14551F61591l6867j8402j5683O554O591Q457K936j227J3091M537p847N614Q811
14538F38156J473l79O693j0357k198l03O186N181m476R001K4105O971l728J0134
$$ plain form
14524 686459 695308 727705 758847 772912 785054 792629 817107 851960 882721 900947 944006 980033
14512 980033 998801 1017580 1050073 1095167 1147261 1172668 1204245 1272914 1328838 1358170 1384246
14501 1384246 1421693 1459319 1512632 1574036 1641595 1689811 1709189 1738835 1796102 1876427 1948208
14490 1948208 1988428 2006407 2016799 2060331 2123359 2191270 2287628 2382486 2463108 2568759 2694378
14479 2694378 2821163 2975772 3129495 3293579 3459225 3634767 3840282 4068568 4302749
14470 4302749 4541839 4803462 5103651 5448623 5828906 6226006 6636707 7074565 7524987
14461 7524987 8032838 8592256 9244641 10029006 10937701 11955774 13134320 14526747 16154812
14452 16154812 18065099 20298760 22896298 25919840 29506297 33823559 39044287 45466973
$$ packed form
14524F86459Q849L2397L1142J4065J2142P575K4478L4853L0761J8226M3059L6027
14512I80033J8768J8779L2493M5094N2094K5407L1577O8669N5924K9332K6076
14501A384246L7447L7626N3313O1404O7559M8216J9378K9646N7267Q0325P1781
14490A948208M0220J7979J0392M3532O3028O7911R6358R4858Q0622J05651J25619
14479B694378J26785J54609J53723J64084J65646J75542K05515K28286K34181
14470D302749K39090K61623L00189L44972L80283L97100M10701M37858M50422
14461G524987N07851N59418O52385P84365R08695J018073J178546J392427J628065
14452A6154812J910287K233661K597538L023542L586457M317262N220728O422686
$$ plain form
14444 45466973 53461266 63616089 76756603 94052895 117089274 147782703 187835104
14437 187835104 237125940 290656955 335668166 354858198 339062202 296298367 243969800
14430 243969800 195321612 155430588 124406463 100656674 82479221 68473666 57608539
14423 57608539 49058646 42255781 36771290 32316778 28591464 25462203 22800726 20501226
14415 20501226 18509062 16741637 15167921 13767476 12545405 11471442 10513036 9653669
14407 9653669 8857785 8156253 7507901 6907619 6447124 6070344 5710008 5382410 5080982
14398 5080982 4802770 4548796 4299701 4074926 3874239 3683988 3481831 3336773 3215483
14389 3215483 3110923 2998446 2866745 2742635 2623868 2520189 2417026 2323550 2252213 2168611
$$ packed form
14444D5466973P994293J0154823J3140514J7296292K3036379L0693429M0052401
14437A87835104M9290836N3531015M5011211J9190032j5795996m2763835n2328567
14430B43969800m8648188l9891024l1024125k3749789j8177453j4005555j0865127
14423E7608539q549893o802865n484491m454512l725314l129261k661477k299500
14415B0501226j992164j767425j573716j400445j222071j073963r58406q59367
14407I653669p95884p01532o48352o00282m60495l76780l60336l27598l01428
14398E080982k78212k53974k49095k24775k00687j90251k02157j45058j21290
14389C215483j04560j12477j31701j24110j18767j03679j03163r3476p1337q3602
$$ plain form
14379 2168611 2051117 1951212 1850653 1751584 1647489 1542863 1473760 1434740 1418304 1381522
14369 1381522 1339175 1284487 1233391 1198797 1192597 1193164 1157725 1112930 1089848 1082506 1055650 1041007
14357 1041007 1025450 1009263 1006406 977764 951200 938454 939110 919872 907335 881324 835070 797529
14345 797529 781117 772043 757244 735329 721737 715209 717637 717365 704252 696382 663620 623192 596360
14332 596360 566447 544993 527873 519219 513512 499379 490548 492304 483836 473240 457513 427681
14320 427681 419064 424855 425992 438370 439506 418047 368141 326204 272435 248642 223684 181251
14308 181251 170054 179073 214810 250243 292706 313988 316496 329993 330645 310293 291740 303084
14296 303084 290617 280318 284211 282509 295624 288320 292012 288781 287338 262337 234853 211314 186792
$$ packed form
14379B168611j17494r9905j00559r9069j04095j04626o9103l9020j6436l6782
14369A381522m2347n4688n1096l4594o200N67l5439m4795k3082p342k6856j4643
14357A041007j5557j6187k857k8642k6564j2746O56j9238j2537k6011m6254l7541
14345G97529j6412r074j4799k1915j3592o528K428k72j3113p870l2762m0428k6832
14332E96360k9913k1454j7120q654n707j4133q831J756q468j0596j5727k9832
14320D27681q617N791J137J2378J136k1459m9906m1937n3769k3793k4958m2433
14308A81251j1197R019L5737L5433M2463K1282K508J3497O52k0352j8553J1344
14296C03084j2467j0299L893j702J3115p304L692l231j443k5001k7484k3539k4522
$$ plain form
14283 186792 183302 170324 156708 163423 167661 207891 255998 268404 282976 290654 290611 299618 289734
14270 289734 279624 260114 260989 267300 270136 254945 253634 270842 283729 293070 259170 237613 221652
14257 221652 219373 201859 191041 196403 195188 183707 180365 201902 211176 231741 225652 234515 252415
14244 252415 238380 202484 192910 200515 161352 128234 128182 146159 169383 175229 171229 171331 178383
14231 178383 154327 140098 125952 108006 115069 116603 111771 111701 130231 130054 137640 147458 140289 136181
14217 136181 113406 107185 114292 125879 114943 108187 108536 102854 108196 104735 128275 136704 135414
14204 135414 129582 104873 93737 113497 117217 109311 109998 109037 107098 101911 95969 72377 65339 72138
14190 72138 93150 100255 109867 127735 132471 131138 132423 108241 109914 107314 113830 115328 112587 104580
$$ packed form
14283A86792l490j2978j3616O715M238M0230M8107J2406J4572P678m3R007r884
14270B89734j0110j9510Q75O311K836j5191j311J7208J2887R341l3900k1557j5961
14257B21652k279j7514j0818N362j215j1481l342K1537R274K0565o089Q863J7900
14244B52415j4035l5896r574P605l9163l3118n2J7977K3224N846m000J02P052
14231A78383k4056j4229j4146j7946P063J534m832p0J8530j77P586R818p169m108
14217A36181k2775o221P107J1587j0936o756L49n682N342l461K3540Q429j290
14204A35414n832k4709j1136J9760L720p906O87r61j939n187n942k3592p038O799
14190G2138K1012P105R612J7868M736j333J285k4182J673k600O516J498k741q007
$$ plain form
14176 104580 79764 78303 85724 84314 75584 59235 59305 64199 50194 38036 36118 49229 60077
14163 60077 63334 80206 95607 111515 122747 90718 86699 100875 100019 90094 79931 85144 99043
14150 99043 103976 113503 110461 112704 120891 109642 105003 128659 113077 85913 72644 47707 44661
14137 44661 42272 43432 56039 64726 68793 67227 60063 72734 82747 78939 56841 42300 40245
14124 40245 50407 48618 42194 34314 30112 36051 59231 59324 64866 53439 55747 60173 71703 86485
14110 86485 97115 88911 89315 93430 77484 86379 88991 88759 76276 62552 67089 68887 60694 76179
14096 76179 67307 47994 51501 33363 42261 48177 54618 55734 48683 38920 45070 45679 51994 44276
14082 44276 38455 31475 26751 38368 45774 45784 54194 57309 50836 47244 33784 49823 45037 32977
$$ packed form
14176A04580k4816j461P421j410q730j6349P0M894j4005j2158j918J3111J0848
14163F0077L257J6872J5401J5908J1232l2029m019J4176q56r925j0163N213J3899
14150I9043M933R527l042K243Q187j1249m639K3656j5582k7164j3269k4937l046
14137D4661k389J160J2607Q687M067j566p164J2671J0013l808k2098j4541k055
14124D0245J0162j789o424p880m202N939K3180R3N542j1427K308M426J1530J4782
14110H6485J0630q204M04M115j5946Q895K612k32j2483j3724M537J798q193J5485
14096G6179q872j9313L507j8138Q898N916O441J116p051r763O150O09O315p718
14082D4276n821o980m724J1617P406J0Q410L115o473l592j3460J6039m786j2060
$$ plain form
14068 32977 41666 33766 38360 44791 39366 40661 45798 36971 30192 48806 63181 76305 92837
14055 92837 87226 72505 52724 54378 36865 23304 10626 17535 21384 16640 21395 36309 36911
14042 36911 37865 20924 4441 -11524 -4332 19555 33549 23010 21435 30204 33589 44792 35838
14029 35838 9625 30194 54764 50070 40946 34694 34109 32034 20201 16652 17447 10905 13604 19106
14015 19106 5699 8425 11931 -3852 -8254 7924 45334 55982 43353 47457 56784 43621 44782
14002 44782 36969 23504 2498 -19104 -38262 -23851 -12850 -24120 254 5257 7205 14144
13990 14144 17285 23180 22998 26231 19769 13901 5853 17029 23092 14958 34182 54318 46193 35297
13976 35297 15014 21315 35278 25233 17435 14385 12022 5620 15347 42095 48543 26550 21341
$$ packed form
14068C2977Q689p900M594O431n425J295N137q827o779J8614J4375J3124J6532
14055I2837n611j4721j9781J654j7513j3561j2678O909L849m744M755J4914O02
14042C6911R54j6941j6483j5965P192K3887J3994j0539j575Q769L385J1203q954
14029C5838k6213K0569K4570m694r124o252n85k075j1833l549P95o542K699N502
14015A9106j3407K726L506j5783m402J6178L7410J0648j2629M104R327j3163J161
14002D4782p813j3465k1006k1602j9158J4411J1001j1270K4374N003J948O939
13990A4144L141N895j82L233o462n868q048J1176O063q134J9224K0136q125j0896
13976C5297k0283O301J3963j0045p798l050k363o402R727K6748O448k1993n209
$$ plain form
13963 21341 20157 26360 29199 36507 36817 17774 2840 8471 3826 -3439 -5904 13154 23563 26004
13949 26004 23213 3092 -1340 2055 17397 14110 28283 42019 36782 19384 19486 31371 37005
13936 37005 54062 67031 55745 40466 31983 25339 26436 22010 14743 7192 31927 77878 100219
13923 100219 73717 56710 36544 27019 24031 13996 24303 25804 27851 44157 47553 39621 28440
13910 28440 19017 23545 18727 -1472 -4622 -388 10333 4605 -3295 -3822 6092 72 -14477 -11739
13896 -11739 -15633 -12016 -20215 -17448 -1855 34462 39538 40028 29064 13151 13682 6056 -8088 6723
13882 6723 26105 30382 33257 40781 28986 31982 58896 55205 33239 19853 15564 11186 401
13869 401 17818 17533 19686 8335 8418 5446 -2746 12083 5543 7603 32041 12591 -6068 -4783
$$ packed form
13963B1341j184O203K839P308L10j9043j4934N631m645p265k465J9058J0409K441
13949B6004k791k0121m432L395J5342l287J4173J3736n237j7398J02J1885N634
13936C7005J7057J2969j1286j5279q483o644J097m426p267p551K4735M5951K2341
13923A00219k6502j7007k0166r525k988j0035J0307J501K047J6306L396p932j1181
13910B8440r423M528m818k0199l150M234J0721n728p900n27R914o020j4549K738
13896a1739l894L617q199K767J5593L6317N076M90j0964j5913N31p626j4144J4811
13882F723J9382M277K875P524j1795K996K6914l691k1966j3386m289m378j0785
13869D01J7417k85K153j1351Q3k972q192J4829o540K060K4438j9450j8659J285
$$ plain form
13855 -4783 -4217 -17565 -11921 -2465 9590 25442 13262 3411 8493 26922 27407 19580 -15998 -22469
13841 -22469 -18703 -11710 -13949 -10206 -15762 -13029 -12006 -17708 -5826 15084 13773 16074 24694 39021
13827 39021 40157 14660 10727 11744 -4022 -13217 -23634 -6725 5829 -1156 -10469 -8509 -28995
13814 -28995 -31477 -13628 -12284 -17987 3525 14277 -13629 -25195 -23405 -21481 -20231 -17402 26391
13801 26391 51721 39775 26580 17481 -2082 -2446 -4010 -3658 -7050 -21111 -10254 -2952 7960
13788 7960 12556 -1611 -4567 4366 12701 22646 30526 21452 -4274 -6356 -887 18328 29143 20373
13774 20373 15640 -8235 -21306 -10448 -4837 -4413 1034 20006 14595 -480 2539 8081 31818
13761 31818 30225 22975 34203 36890 31447 38471 24563 21194 32360 15684 2780 -21486 -28829
$$ packed form
13855d783N66j3348N644R456J2055J5852j2180r851N082J8429M85p827l5578o471
13841b2469L766O993k239L743n556K733J023n702J1882K0910j311K301Q620J4327
13827C9021J136k5497l933J017j5766r195j0417J6909J2554o985r313J960k0486
13814b8995k482J7849J344n703K1512J0752k7906j1566J790J924J250K829M3793
13801B6391K5330j1946j3195r099j9563l64j564L52l392j4061J0857P302J0912
13788G960M596j4167k956Q933Q335R945P880r074k5726k082N469J9215J0815q770
13774B0373m733k3875j3071J0858N611M24N447J8972n411j5075L019N542K3737
13761C1818j593p250J1228K687n443P024j3908l369J1166j6676j2904k4266p343
$$ plain form
13748 -28829 -8067 4973 11201 7616 19237 30061 12757 -1132 -27128 -15751 -6665 9545
13736 9545 -16337 -36481 -39794 -24871 -20075 -27797 -24545 -11519 7137 2907 2944 32536 44146
13723 44146 19297 14704 16701 8713 -9541 -8602 -4316 -1453 6791 11117 27720 32137 31274 25585
13709 25585 7900 -4227 7627 6560 4412 2041 24083 35107 35280 27294 29876 32485 33751
13696 33751 22293 6640 8485 -4309 -2175 12139 23249 37128 46370 37938 10460 569 1675
13683 1675 7392 -11919 -15564 -11112 -5439 -2284 -15149 -24602 -10216 13411 17942 35299 43254
13670 43254 32817 6036 3502 -2367 -6598 -15802 -13291 -2350 -1971 -7069 -5569 -1383 -10545 -2114
13656 -2114 1764 27990 45766 59649 52325 47346 43066 17443 4226 9092 14575 17038 14277
$$ packed form
13748b8829K0762J3040O228l585J1621J0824j7304j3889k5996J1377R086J6210
13736I545k5882k0144l313J4923M796p722L252J3026J8656m230L7K9592J1610
13723D4146k4849m593J997p988j8254R39M286K863Q244M326J6603M417q63n689
13709B5585j7685j2127J1854j067k148k371K2042J1024J73p986K582K609J266
13696C3751j1458j5653J845j2794K134J4314J1110J3879R242q432k7478r891J106
13683A675N717j9311l645M452N673L155j2865r453J4386K3627M531J7357P955
13670D3254j0437k6781k534n869m231r204K511J0941L79n098J500M186r162Q431
13656b114L878K6226J7776J3883p324m979m280k5623j3217M866N483K463k761
$$ plain form
13643 14277 18643 20401 22595 30159 28906 18235 6475 -1734 -8699 4702 27539 34454 30143
13630 30143 26872 20713 34488 35127 18460 15953 22484 11124 5069 15853 4638 -6472 5104
13617 5104 22774 42884 52559 31989 5833 -13329 -7357 91 7923 14425 -1602 -18746 -6696
13604 -6696 -6378 -7931 -8335 -22795 -40968 -31835 -19928 -28861 -32974 -24919 -27340 -12338 -15058 -37139
13590 -37139 -33615 -3798 -3879 -13357 -1612 47 -4795 -5444 2185 4199 -9492 -12255 -22063 -25596
13576 -25596 -8152 -10826 -18935 -20425 -8336 -7326 -297 34312 44892 34717 21927 12464 13773
13563 13773 25719 8952 -6225 -7519 -7234 -4944 3197 -4777 -31982 -50864 -47541 -44754 -31589
13550 -31589 -31297 -32336 -36170 -20117 -8674 -2619 -11384 -16757 -41 11362 17698 17859 -50 -13631
$$ packed form
13643A4277M366J758K194P564j253j0671j1760q209o965J3401K2837O915m311
13630C0143l271o159J3775O39j6667k507O531j1360o055J0784j1215j1110J1576
13617E104J7670K0110R675k0570k6156j9162N972P448P832O502j6027j7144J2050
13604f696L18j553m04j4460j8173R133J1907q933m113Q055k421J5002k720k2081
13590c7139L524K9817q1r478J1745J659m842o49P629K014j3691k763r808l533
13576b5596J7444k674q109j490J2089J010P029L4609J0580j0175j2790r463J309
13563A3773J1946j6767j5177j294K85K290Q141p974k7205j8882L323K787J3165
13550c1589K92j039l834J6053J1443O055q765n373J6716J1403O336J61j7909j3581
$$ plain form
13536 -13631 -20245 546 28122 58283 16342 -11287 8912 21951 19479 8420 -17817 -26695
13524 -26695 -28632 -31253 -35158 -29362 -15697 -7165 2333 5830 18059 14863 -1770 5564 17953
13511 17953 19964 19022 13215 9059 6711 18203 23618 13476 494 4798 -8026 -11828 -10310 -10422
13497 -10422 -6361 2223 -3363 3886 4996 13537 6456 -1299 -15254 -24091 -19852 -15926 -3673 -4412
13483 -4412 -4197 11199 28848 24556 26215 17394 25325 32290 24720 262 -31886 -39042 -19983 -3320
13469 -3320 18414 16953 669 -4640 12667 15555 6536 -12763 -10930 -3780 -15489 5429 9571
13456 9571 10614 7910 14780 6537 -5440 -3188 -11170 -22986 -21483 -11556 8540 41950 33446 11214
13442 11214 -10361 -10254 3505 -1405 5422 30941 32342 34715 44093 21235 -5286 1516 969 -23505
$$ packed form
13536a3631o614K0791K7576L0161m1941k7629K0199J3039k472j1059k6237q878
13524b6695j937k621l905N796J3665Q532R498L497J2229l196j6633P334J2389
13511A7953K011r42n807m156k348J1492N415j0142j2982M304j2824l802J518j12
13497a0422M061Q584n586P249J110Q541p081p755j3955q837M239L926J2253p39
13483d412K15J5396J7649m292J659q821P931O965p570k4458l2148p156J9059J6663
13469c320K1734j461j6284n309J7307K888r019j9299J833P150j1709K0918M142
13456I571J043k704O870q243j1977K252p982j1816J503R927K0096L3410q504k2232
13442A1214k1575J07J3759m910O827K5519J401K373R378k2858k6521O802n47k4474
$$ plain form
13428 -23505 -43949 -29028 -33232 -34814 -35457 -28027 -20500 -10968 4018 5030 11155 30833 21539 24328
13414 24328 23051 4222 -6291 -6870 8214 12330 7062 7511 6320 19375 16687 -3048 -6316 -3064
13400 -3064 8656 22890 20603 19436 22563 8314 -18571 -16027 -14223 -3182 22258 10502 -2002
13387 -2002 -4731 -10820 6719 21379 -5932 -36571 -49110 -7431 15712 1359 -2928 -6714 -22722
13374 -22722 -39312 -41273 -38318 -39948 -3217 8691 -757 -18555 -20918 -16886 -12171 -27581 -24889
13361 -24889 -10986 -25034 -34847 -6904 -528 21033 13089 -20650 -38910 -30861 -22549 -8781 6076
13348 6076 -7696 -19727 -22807 -15555 -16162 -5134 19630 26287 21866 11727 9960 17605 19449 4146
13334 4146 -6474 -29276 -12085 2995 6589 -7747 -5694 -10950 -1277 -8294 -8968 2141 5492
$$ packed form
13428b3505k0444J4921m204j582o43P430P527R532J4986J012O125J9678r294K789
13414B4328j277j8829j0513n79J5084M116n268M49j191J3055k688j9735l268L252
13400c064J1720J4234k287j167L127j4249k6885K544J804J1041K5440j1756j2504
13387b002k729o089J7539J4660k7311l0639j2539M1679K3143j4353m287l786j6008
13374b2722j6590j961K955j630L6731J1908r448j7798k363M032M715j5410K692
13361b4889J3903j4048r813K7943O376K1561p944l3739j8260Q049Q312J3768J4857
13348F076j3772j2031l080P252o07J1028K4764O657m421j0139j767P645J844j5303
13334D146j0620k2802J7191J5080L594j4336K053n256R673p017o74J1109L351
$$ plain form
13321 5492 12808 7079 8497 16856 13612 -607 130 -5585 -2629 3693 12605 9399 6495 789 -3360
13306 -3360 5752 830 -15485 -17850 -11271 -4761 -10258 -19318 -32064 -38524 -35128 -33899 -28796 -31232
13292 -31232 -18418 409 18303 21361 25613 30612 25660 -6803 -27816 -23028 -21423 -5113 1387
13279 1387 -5601 -7451 11021 11135 4148 1688 20689 10806 -2956 5624 15901 -4449 -3834 9137
13265 9137 14286 14000 14986 17330 19941 7816 15260 31247 17141 -4568 -19138 -29246 996
13252 996 -2207 -12447 -25320 -15888 -1328 -8579 -17154 -5337 9159 7097 -1181 -4910 12758
13239 12758 -5281 3577 19868 10806 8305 11948 25726 28562 21365 10329 21048 24071 15078
13226 15078 8166 -3079 6770 8165 -935 4959 2149 -3584 -16197 -16180 -21820 -7932 -232 -10371
$$ packed form
13321E492P316n729J418Q359l244j4219P37n715K956O322Q912l206k904n706m149
13306c360R112m922j6315k365O579O510n497r060j2746o460L396J229N103k436
13292c1232J2814J8827J7894L058M252M999m952l2463k1013M788J605J6310O500
13279A387o988j850J8472J14o987k460J9001r883j3762Q580J0277k0350O15J2971
13265I137N149k86R86K344K611j2125P444J5987j4106k1709j4570j0108L0242
13252I96l203j0240j2873R432J4560p251q575J1817J4496k062q278l729J7668
13239A2758j8039Q858J6291r062k501L643J3778K836p197j1036J0719L023q993
13226A5078o912j1245R849J395r100N894k810n733j2613J7n640J3888P700j0139
$$ plain form
13212 -10371 -8897 5567 21555 13489 8275 5235 3341 -2550 -12710 10310 -2954 -8018 11515
13199 11515 29423 19909 -11977 -12617 -9093 11597 13213 -5076 12577 11474 -3459 -14586 -15270
13186 -15270 -26912 -17724 -17216 -6674 -10950 -23728 -9937 11446 15569 10431 500 476 -20447 -21330
13172 -21330 -3643 9099 11709 3958 -3143 22648 18220 24932 25843 20403 13822 13778 11315 861
13158 861 5502 12999 3876 -1045 -3794 18284 29300 20399 35126 26471 2749 -1578 10786 13036
13144 13036 772 -21606 -40903 -23991 -7642 -10495 -4556 17392 31989 24768 7205 -11146
13132 -11146 -8010 -7282 -7992 3877 -5917 -16502 -8768 -12723 -14126 5699 -7754 -18604 -18380 1339
13118 1339 12488 -2423 2281 5667 25754 34529 27568 22869 9623 -5725 -13213 -19484 -9213
$$ packed form
13212a0371J474J4464J5988q066n214l040j894n891j0160K3020j3264n064J9533
13199A1515J7908r514l1886o40L524K0690J616j8289J7653j103j4933j1127o84
13186a5270j1642R188N08J0542m276j2778J3791K1383M123n138r931k4k0923q83
13172b1330J7687J2742K610p751p101K5791m428O712R11n440o581m4k463j0454
13158H61M641P497r123m921k749K2078J1016q901J4727q655k3722m327J2364K250
13144A3036j2264k2378j9297J6912J6349k853N939K1948J4597p221j7563j8351
13132a1146L136P28p10J1869r794j0585P734l955j403J9825j3453j0850K24J9719
13118A339J1149j4911M704L386K0087Q775o961m699j3246j5348p488o271J0271
$$ plain form
13105 -9213 550 4824 13417 13002 14822 19874 17122 29435 37669 40995 42442 40942 27026 34370
13091 34370 34293 25293 4383 9525 18397 21971 11791 5640 9785 15021 13161 13926 36516 54930
13077 54930 23702 10445 -7651 2520 -9173 -30541 -27947 -25409 -26059 -33012 -18873 -17551 -7930
13064 -7930 3658 7011 2414 21922 21301 27900 21953 11224 3331 -10946 -2176 3414 -1101 4622
13050 4622 -5191 8708 13000 9270 23100 26488 23839 35015 33695 28967 22841 16058 5279 -8014
13036 -8014 -4622 -12482 -15951 -10070 -7056 -3891 -27676 -23726 -23010 -22373 -26197 -19823 -19669 -6652 -6209
13021 -6209 -11127 -7719 -3658 -1816 970 2433 10082 20826 23140 20162 7469 8175 11462 16517
13007 16517 18212 15100 20253 25483 10073 17792 17359 14491 18058 19290 27256 24837 5186 -1915
$$ packed form
13105i213R763M274Q593m15J820N052k752J2313Q234L326J447j500j3916P344
13091C4370p7r000k0910N142Q872L574j0180o151M145N236j860P65K2590J8414
13077E4930l1228j3257j8096J0171j1693k1368K594K538o50o953J4139J322R621
13064g930J1588L353m597J9508o21O599n947j0729p893j4277Q770N590m515N723
13050D622r813J3899M292l730J3830L388k649J1176j320m728o126o783j0779j3293
13036h014L392p860l469N881L014L165k3785L950P16O37l824O374J54J3017M43
13021f209m918L408M061J842K786J463P649J0744K314k978j2693P06L287N055
13007A6517J695l112N153N230j5410P719m33k868L567J232P966k419j9651p101
$$ plain form
12993 -1915 -6489 -13536 -8248 -9006 -2405 -3051 -2656 -7181 14050 13449 19032 24293 24945 9135 -22167
12978 -22167 -17805 -11183 -12500 -858 10349 18820 16537 -10195 -8950 3392 2811 -10630 -25104
12965 -25104 -26923 -27951 -6198 -7438 5737 18759 8610 11154 11346 9385 1304 -5457 -10882 -9993
12951 -9993 -5686 8645 10457 7876 2080 5487 6983 8334 18281 16865 12518 12615 11683 3025 -9702
12936 -9702 3880 1926 -18682 -13740 -5888 -374 8102 6144 -4157 -13731 -17588 -17914 -10448 -837
12922 -837 -6456 -9447 -11423 -28796 -9891 9076 10776 649 -5623 -2511 -9616 -9738 1203 -897
12908 -897 -25607 -43254 -35074 -13724 -21754 -39506 -49731 -29172 2666 -8395 -11264 -2210 568
12895 568 -13291 553 -10665 3139 7952 -2688 2776 16268 8499 14906 -4245 -7349 4334
$$ packed form
12993a915m574p047N288p58O601o46L95m525K1231o01N583N261O52j5810l1302
12978b2167M362O622j317J1642J1207Q471k283k6732J245J2342n81j3441j4474
12965b5104j819j028K1753j240J3175J3022j0149K544J92j961q081o761n425Q89
12951i993M307J4331J812k581n796L407J496J351R947j416m347R7r32q658j2727
12936i702J3582j954k0608M942P852N514Q476j958j0301r574l857l26P466R611
12922h37n619k991j976j7373J8905J8967J700j0127o272L112p105j22J0941k100
12908h97k4710j7647Q180K1350q030j7752j0225K0559L1838j1061k869R054K778
12895E68j3859J3844j1218J3804M813j0640N464J3492p769O407j9151l104J1683
$$ plain form
12882 4334 12968 9124 10880 9602 7797 3359 7145 14888 9928 -6595 -14626 -18687 -26160 -34888
12868 -34888 -50101 -46094 -22187 -16944 -24192 -7395 1970 9366 9525 -16574 -9667 -12457 -16378 -3807
12854 -3807 17455 16018 11345 1540 -8709 9729 26049 3331 -2901 -8720 -12458 -8957 -3071
12841 -3071 993 9654 10737 -11432 -1718 -1057 -8870 5299 21766 18008 -8614 -30796 -36992 -22696
12827 -22696 -4990 -5772 -9024 -20301 -25266 -15120 14613 12476 7131 20811 15712 -2488 -24248
12814 -24248 -12688 -8304 -12705 2185 18272 -1218 -20568 -29125 -13090 -7566 -9352 2833 2258
12801 2258 14710 23348 19953 15976 4168 -12878 -5320 -11992 -20252 -25670 -29172 431 26013
12788 26013 27507 19327 5164 5854 3404 -353 -1117 -3767 -2761 -8303 -5297 1872 -2280 3762 5131
$$ packed form
12882D334Q634l844J756j278j805m438L786P743m960j6523q031m061p473q728
12868c4888j5213M007K3907N243p248J6797R365P396J59k6099O907k790l921J2571
12854c807K1262j437m673r805j0249J8438J6320k2718o232n819l738L501N886
12841c071M064Q661J083k2169R714O61p813J4169J6467l758k6622k2182o196J4296
12827b2696J7706p82l252j1277m965J0146K9733k137n345J3680n099j8200k1760
12814b4248J1560M384m401J4890J6087j9490j9350q557J6035N524j786J2185n75
12801B258J2452Q638l395l977j1808j7046P558o672q260n418l502K9603K5582
12788B6013J494q180j4163O90k450l757p64k650J006n542L006P169m152O042J369
$$ plain form
12773 5131 3493 13294 11354 4379 11008 21120 34050 45582 45742 39481 13537 -11861 -14182 -19970
12759 -19970 -10432 12848 17352 5661 14766 6371 14581 21502 13164 2499 7969 1096 -1816 1662
12745 1662 10086 22968 25197 32216 39780 31888 10579 16049 18734 12161 7318 -11086 940 10381
12731 10381 9993 17454 10423 -14121 -14213 -16443 -22759 -19530 -16200 -26261 -18411 -12737 -11141 -24669
12717 -24669 -32997 -30620 -17182 -1561 -1682 4333 11225 -2264 -13105 -28122 -24622 -15353 -2888
12704 -2888 4393 7228 19458 14548 6109 8220 14013 -2812 -8052 -10726 -10818 -5024 -8512 -4996 -3534
12689 -3534 -12015 4002 761 2220 11385 10487 16403 15692 -6666 -17475 -4512 6750 4678 19521
12675 19521 33358 35572 23067 -4298 207 2146 -7682 -23979 -13793 -11596 -16357 -2484 18763
$$ packed form
12773E131j638R801j940o975O629J0112J2930J1532J60o261k5944k5398k321n788
12759a9970R538K3280M504j1691R105q395Q210O921q338j0665N470o873k912L478
12745A662Q424J2882K229P019P564p892k1309N470K685o573m843j8404J2026R441
12731A0381l88P461p031k4544r2k230o316L229L330j0061P850N674J596j3528
12717b4669q328K377J3438J5621j21O015O892j3489j0841j5017L500R269J2465
12704b888P281K835J2230m910q439K111N793j6825n240k674r2N794l488L516J462
12689c534q481J6017l241J459R165q98N916p11k2358j0809J2963J1262k072J4843
12675A9521J3837K214j2505k7365M505J939r828j6297J0186K197m761J3873K1247
$$ plain form
12662 18763 785 -3914 -3693 -13277 -18078 -21320 -28781 -40055 -44390 -15126 35447 43470 51461 61957
12648 61957 103136 157444 212697 334270 445127 435639 318701 195507 111104 83052 70428
12637 70428 46789 37415 23105 11464 4905 11044 22715 40469 39793 38999 38056 22821 29818 30956
12623 30956 14825 4791 10982 32920 32684 34343 32730 22445 23855 14485 2570 10294 29769
12610 29769 38756 17734 -8707 -4518 2691 7446 -7274 -24017 -31925 -31002 -28323 -29822 -23668 -10544
12596 -10544 10399 22314 45870 34287 38250 33393 11005 -1107 8725 31028 31156 9301 -1269
12583 -1269 5852 19901 14476 5904 7113 19666 1150 -4854 10753 20523 3805 -11845 -24647
12570 -24647 -29336 -27453 -32765 -53030 -46088 -24971 -19410 -26410 -25360 -21590 -16014 -6251 19865 16636
$$ packed form
12662A8763j7978m699K21r584m801l242p461j1274m335K9264N0573Q023P991J0496
12648F1957M1179N4308N5253J21573J10857r488j16938j23194q4403k8052j2624
12637G0428k3639r374j4310j1641o559O139J1671J7754o76p94r43j5235O997J138
12623C0956j6131j0034O191K1938k36J659j613j0285J410r370j1915P724J9475
12610B9769Q987k1022k6441M189P209M755j4720j6743p908R23K679j499O154J3124
12596a0544K0943J1915K3556j1583L963m857k2388j2112R832K2303J28k1855j0570
12583a269P121J4049n425q572J209J2553j8516o004J5607R770j6718j5650j2802
12570b4647m689J883n312k0265O942K1117N561p000J050L770N576R763K6116l229
$$ plain form
12556 16636 10360 -3627 -2991 -242 -14594 -27049 -18190 -1083 10061 21397 15471 11484 16927
12543 16927 6903 -13155 -5267 12644 5416 -11984 2097 19224 28473 35412 31779 21937 20971
12530 20971 4458 16657 29907 34210 45999 37061 30857 28776 29264 19194 17856 23997 25791
12517 25791 19778 20781 38097 28914 19821 2174 -8269 -1202 -5038 -30697 -33808 -33144 -20462
12504 -20462 -16234 -29797 -34905 -12012 68 -8052 -6061 -9162 -18862 -13608 -9259 -2976 -4885 -12503
12490 -12503 -15569 -6382 -5756 -16884 -19490 -13883 -1827 530 -2908 -2972 -3322 -24488 -41024 -28616
12476 -28616 -16731 499 13135 1541 1313 -4328 -8525 -976 -7164 -17648 -15829 -7715 -20926
12463 -20926 -6806 -19887 -36699 -38926 -25146 -32067 -39951 -38465 -25874 -15632 11752 11927 -13452
$$ packed form
12556A6636o276j3987O36K749j4352j2455Q859J7107J1144J1336n926l987N443
12543A6927j0024k0058P888J7911p228j7400J4081J7127R249O939l633r842r66
12530B0971j6513J2199J3250M303J1789q938o204k081M88j0070j338O141J794
12517B5791o013J003J7316r183r093j7647j0443P067l836k5659l111O64J2682
12504b0462M228j3563n108K2893J2080q120J991l101r700N254M349O283j909p618
12490a2503l066R187O26j1128k606N607J2056K357l438o4l50k1166j6536J2408
12476b8616J1885J7230J2636j1594k28n641m197P549o188j0484J819Q114j3211
12463b0926J4120j3081j6812k227J3780o921p884J486J2591J0242K7384J75k5379
$$ plain form
12450 -13452 -4808 2455 -17029 -19769 -13868 -21504 -23334 -8372 1884 -1135 -10644 -11332 -4734 12860
12436 12860 -1404 -14302 -4202 -160 -2105 -9291 -9138 3799 -6248 -10555 -15246 -30214 -28196
12423 -28196 -14374 -7740 6830 13664 1511 -18918 -10379 3450 15910 5885 10393 7686 1914
12410 1914 12732 25442 15302 27824 16605 -7189 6309 9248 6126 14436 21515 -3802 -12360
12397 -12360 -20220 -22393 4568 9186 3051 10125 11691 8045 827 12896 12819 -5489 10719 15017
12383 15017 11085 7547 -7514 -32355 -40942 -45565 -26468 -11706 -2424 -16833 -14884 -19874 -15317
12370 -15317 -16649 -16278 -16048 -25403 -3164 -9450 -9092 -8086 -23252 -28682 -15756 -5951 16312 24088
12356 24088 18389 11662 -1312 5870 9682 -9116 -14597 6881 27705 15540 35243 32211 14878
$$ packed form
12450a3452Q644P263j9484k740N901p636j830J4962J0256l019r509o88O598J7594
12436A2860j4264j2898J0100M042j945p186J53J2937j0047m307m691j4968K018
12423b8196J3822O634J4570O834j2153k0429Q539J3829J2460j0025M508k707n772
12410A914J0818J2710j0140J2522j1219k3794J3498K939l122Q310P079k5317q558
12397a2360p860k173K6961M618o135P074J566l646p218J2069p7j8308J6208M298
12383A5017l932l538j5061k4841q587m623J9097J4762R282j4409J949m990M557
12370a5317j332L71K30r355K2239o286L58J006j5166n430J2926R805K2263P776
12356B4088n699o727j2974P182L812j8798n481K1478K0824j2165J9703l032j7333
$$ plain form
12343 14878 -3465 4172 -6911 10361 17218 13241 9908 1428 -2608 4750 11499 23141 4057
12330 4057 -8711 -1455 -2441 999 -3972 -2853 -554 4189 -3071 202 4630 -2823 -649 -11547
12316 -11547 -5181 -6147 -6928 4484 -21 -11403 -42772 -34667 -12454 -21320 -16922 -21395 -40159 -23451
12302 -23451 4380 -8393 -22657 -10400 -5789 -4062 -6333 -22303 -32271 -15622 -6156 -10159 -19054
12289 -19054 -28256 -35815 -46369 -61414 -54239 -37798 -16328 1320 7611 2828 -12904 11853 24463
12276 24463 -10657 -21409 -22952 1357 22763 22460 31925 34881 40758 31078 16149 17991 6585
12263 6585 11146 29214 31234 22181 22525 9582 -3087 -13401 -8956 -13211 -28353 -35014 -36981 -24894
12249 -24894 -4909 5700 5102 -6543 -35431 -40931 -30793 -21610 -12391 -9051 -6483 -16188 -31247
$$ packed form
12343A4878j8343P637j1083J7272O857l977l333q480m036P358O749J1642j9084
12330D057j2768P256r86L440m971J119K299M743p260L273M428p453K174j0898
12316a1547O366r66p81J1412m505j1382l1369Q105K2213q866M398m473j8764J6708
12302b3451K7831j2773j4264J2257M611J727k271j5970r968J6649R466m003q895
12289a9054r202p559j0554j5045P175J6441K1470J7648O291m783j5732K4757J2610
12276B4463l5120j0752j543K4309K1406l03R465K956N877r680j4929J842j1406
12263F585M561J8068K020r053L44j2943j2669j0314M445m255j5142o661j967J2087
12249b4894J9985J0609n98j1645k8888n500J0138R183R219L340K568r705j5059
$$ plain form
12236 -31247 -41879 -40113 -26280 -14532 -8896 -11479 -12744 -15361 -219 -5907 7040 3093 9257
12223 9257 -1470 -29261 -40230 -23775 -13716 2699 13667 5049 -3123 8521 17551 31098
12211 31098 35203 24609 20567 4376 6861 -6775 -6029 -14786 -17606 -14713 -8877 4849 2169 -17188
12197 -17188 -26883 -34015 -51354 -34406 -15054 6849 -4249 -11195 -12016 -22062 -12730 -10348 -10528
12184 -10528 -7144 -12065 -18857 -15032 -5967 -6598 308 -9939 -17371 -21745 -11837 -10639 -18836 -39958
12170 -39958 -31145 -12098 -17878 -10852 -8311 -25775 -24168 -13586 -30385 -48431 -28673 -13981 -17761
12157 -17761 -12952 -14408 -32360 -35788 -2211 21069 9705 503 -6584 -21874 -31886 -24948 -13338
12144 -13338 -827 9793 3819 -20976 -26018 -11738 -8538 -12232 -20390 -20685 -2511 769 -17463
$$ packed form
12236c1247j0632J766J3833J1748N636k583j265k617J5142n688J2947l947O164
12223I257j0727k7791j0969J6455J0059J6415J0968q618q172J1644R030J3547
12211C1098M105j0594m042j6191K485j3636P46q757k820K893N836J3726k680j9357
12197a7188r695p132j7339J6948J9352K1903j1098o946q21j0046R332K382j80
12184a0528L384m921o792L825R065o31O906j0247p432m374R908J198q197k1122
12170c9958Q813J9047n780P026K541j7464J607J0582j6799j8046J9758J4692l780
12157a7761M809j456j7952l428L3577K3280j1364r202p087j5290j0012O938J1610
12144a3338J2511J0620n974k4795n042J4280L200l694q158k95J8174L280j8232
$$ plain form
12131 -17463 -19866 -5140 -673 8842 5751 -4608 8261 34 -5952 -656 -14644 -18016 -2344
12118 -2344 -809 -4866 -23962 -32214 -24724 -5850 21735 29339 12535 16213 2067 -18083 -22472
12105 -22472 -6751 -359 -17051 -19159 -9118 265 12909 13682 -1709 1077 8786 7554 -2249
12092 -2249 -18838 -27232 -7534 -7997 -9279 5553 20600 13224 6893 -7602 -15834 -7629 -6727 -12789
12078 -12789 -13254 -8936 10472 18681 5743 -21224 -24580 -10139 -11588 -1447 9828 14152 17872
12065 17872 18326 9750 20340 27414 14290 14678 15499 6687 5664 7441 -10342 -15413 -21483 -9828
12051 -9828 -5819 -13212 -1969 5091 1472 -356 -2545 -11381 -16511 -28591 -16185 -20420 -37862 -37404
12037 -37404 -34754 -26491 -6663 -4216 -11848 -11461 -10695 4996 3683 -14595 -12369 6717 -5474 -10275
$$ packed form
12131a7463k403J4726M467R515l091j0359J2869q227n986N296j3988l372J5672
12118b344J535m057j9096q252P490J8874K7585P604j6804L678j4146k0150m389
12105b2472J5721O392j6692k108J0041R383J2644P73j5391K786P709j232r803
12092b249j6589q394J9698m63j282J4832J5047p376o331j4495q232Q205R02o062
12078a2789m65M318J9408Q209j2938k6967l356J4441j449J0141J1275M324L720
12065A7872M54q576J0590P074j3124L88Q21q812j023J777j7783n071o070J1655
12051i828M009p393J1243P060l619j828k189q836n130j2080J2406m235j7442M58
12037c7404K650Q263J9828K447p632L87P66J5691j313j8278K226J9086j2191m801
$$ plain form
12023 -10275 -27258 -14522 -13334 -15895 -14362 -17444 -8780 -2512 19799 13508 -4622 -13843 -10932
12010 -10932 -17401 -383 22695 36635 34298 32328 11442 -6281 1082 6384 2284 6110 -7487
11997 -7487 6238 15447 8592 -8051 -32044 -30077 -5585 2178 -12078 -15704 -5812 1126 11513
11984 11513 16011 11111 51 -2671 -11647 -15397 -6742 -230 -9739 -24457 -26611 -34475 -37817 -12561
11970 -12561 -10003 -18346 -6100 -10057 -18260 -24212 -22883 -22833 -21488 -28566 -36402 -43626 -22689 -7884
11956 -7884 -19193 -24628 -11972 6204 4417 2266 -1658 -1704 -15195 -8414 3633 9605 -2070 -12127
11942 -12127 -10077 -2335 3281 -2346 -27083 -18311 -4469 948 2548 9479 6257 7452 -259 -775
11928 -775 -1542 -14620 8212 23117 -10944 -19963 -9808 -9520 -15628 -14642 -18904 -23739 -18403 -11558
$$ packed form
12023a0275j6983J2736J188k561J533l082Q664O268K2311o291j8130r221K911
12010a0932o469J7018K3078J3940k337j970k0886j7723P363N302m100L826j3597
11997g487J3725R209o855j6643k3993J967K4492P763j4256l626R892O938J0387
11984A1513M498m900j1060k722q976l750Q655O512r509j4718k154p864l342K5256
11970a2561K558q343J2246l957q203n952J329N0J345p078p836p224K0937J4805
11956g884j1309n435J2656J8176j787k151l924m6j3491O781J2047N972j1675j0057
11942a2127K050P742N616n627k4737Q772J3842N417J600O931l222J195p711n16
11928g75p67j3078K2832J4905l4061r019J0155K88o108R86m262m835N336O845
$$ plain form
11914 -11558 -6556 976 -5910 -1080 -3111 -744 17656 21106 14824 -2882 668 6552 12996 9210
11900 9210 -8788 5838 18872 -571 -4493 4760 5118 127 4621 6086 2741 -4473 -27729 -16183
11886 -16183 5109 3597 2264 16413 15213 5386 -18823 -18715 -9068 304 -19015 -23815 -18829 -23718
11872 -23718 -11243 9019 17873 -4788 -17919 -11904 -6713 4652 12086 12225 1104 -2987 -3780
11859 -3780 -22300 -22967 -20547 -27714 -27637 -35800 -35514 -36111 -40737 -29338 -11639 -8228 18855 36065 27797
11844 27797 19713 8275 13950 11260 -10895 -12300 3389 5679 14576 8815 -9405 -5377 -18961
11831 -18961 -22938 -14776 -3682 -7921 3275 7456 -11375 -26791 -15806 -12849 -11802 -9289 195
11818 195 7797 6978 -5301 2676 4567 -11102 -11098 -3061 4241 6120 -20852 -10613 18495 28359 26221
$$ packed form
11914a1558N002P532o886M830k031K367J8400L450o282j7706L550N884O444l786
11900I210j7998J4626J3034j9443l922R253L58m991M494J465l345p214k3256J1546
11886a6183K1292j512j333J4149j200r827k4209J08R647R372j9319m800M986m889
11872b3718J2475K0262Q854k2661j3131O015N191J1365P434J39j1121m091p93
11859c780j8520o67K420p167P7q163K86n97m626J1399J7699L411K7083J7210q268
11844B7797q084j1438N675k690k2155j405J5689K290Q897n761j8220M028j3584
11831a8961l977Q162J1094m239J1196M181j8831j5416J0985K957J047K513R484
11818A95P602q19j2279P977J891j5669MQ037P302J879k6972J0239K9108R864k138
$$ plain form
11803 26221 28126 23758 40729 40006 25290 36958 32139 29144 21673 -4324 -18890 -14839 1736
11790 1736 3372 12241 24110 19064 -12088 -19325 8976 16314 18221 10659 4263 2170 -9151 -13939
11776 -13939 -34278 -35080 -24839 -23237 -23746 -19936 -23595 -29835 -19044 -4946 -3356 -7162 8257 11394
11762 11394 3687 -5734 -22326 -34786 -40337 -36391 -33584 -33258 -23045 -8323 -20291 -6076 -13217
11749 -13217 -23875 -19088 -14374 -12920 -7197 -4158 -18043 -27649 -34032 -37919 -25680 -18649 -28756
11736 -28756 -28991 -17749 -11251 3178 -507 -6762 -10781 -2773 -2630 -1903 7379 18740 18989 27591 38564
11721 38564 28276 2409 -3476 17842 31179 25896 9296 3622 -2046 10239 -8602 -14730 -9547
11708 -9547 6125 9795 964 -1034 -1247 387 -2004 -15065 -7676 2056 4439 2472 3773 15885
$$ packed form
11803B6221J905m368J6971p23j4716J1668m819k995p471k5997j4566M051J6575
11790A736J636Q869J1869n046l1152p237K8301P338J907p562o396k093j1321m788
11776a3939k0339q02J0241J602n09L810l659o240J0791J4098J590l806J5419L137
11762A1394p707r421j6592j2460n551L946K807L26J0213J4722j1968J4215p141
11749a3217j0658M787M714J454N723L039j3885r606o383l887J2239P031j0107
11736b8756k35J1242O498J4429l685o255m019Q008J43P27R282J1361K49Q602J0973
11721C8564j0288k5867n885K1318J3337n283j6600n674n668J2285j8841o128N183
11708i547J5672L670q831j998k13J634k391j3061P389R732K383j967J301J2112
$$ plain form
11694 15885 14122 24987 21484 -4644 2849 6920 -1201 4788 26835 29868 26838 27937 7127
11681 7127 -12257 -21262 -17537 2533 5639 11545 10935 -15037 -11284 -8998 2575 -6716 -5883 8777
11667 8777 -6524 -18230 -9233 -5475 -11363 -17605 -31655 -39542 -45229 -54124 -41097 -47713 -26421
11654 -26421 -21050 -17603 -8128 -3106 -21216 -32566 -17581 -17331 -1550 13135 26269 31741 25303
11641 25303 -4567 -31933 -21343 -24151 -12874 -8102 27278 31335 21697 10771 -11632 -16812 -15202
11628 -15202 6922 32170 34692 34425 36048 18564 15129 30199 23923 4315 -6443 -10911 12684
11615 12684 27086 27497 7210 5704 5418 9315 -4721 -11861 -8443 -6492 -12583 -9176 -3227 9471
11601 9471 7440 20535 19960 13641 -10602 -23042 -33730 -36538 -18474 -10098 -13695 -5548 11655
$$ packed form
11694A5885j763J0865l503k6128P493M071q121N989K2047L033l030J099k0810
11681G127j9384r005L725K0070L106N906o10k5972L753K286J1573r291Q33J4660
11667H777j5301j1706Q997L758n888o242j4050p887n687q895J3027o616K1292
11654b6421N371L447R475N022j8110j1350J4985K50J5781J4685J3134N472o438
11641B5303k9870k7366J0590k808J1277M772L5380M057r638j0926k2403n180J610
11628a5202K2124K5248K522k67J623j7484l435J5070o276j9608j0758m468K3595
11615A2684J4402M11k0287j506k86L897j4036p140L418J951o091L407N949J2698
11601I471k031J3095n75o319k4243j2440j0688k808J8064Q376l597Q147J7203
$$ plain form
11588 11655 21828 34162 19480 13603 22744 14412 1014 -5556 -7134 -6374 -1877 -1477 2000 -6273
11574 -6273 7377 18097 18198 21167 9379 -3211 -5466 -19010 -49566 -47256 -39807 -33956 -20247
11561 -20247 -1174 1313 -8475 -7628 -13605 -10125 16401 22771 9231 17655 8750 2970 3145 3510
11547 3510 6121 16467 20354 38082 27258 2880 955 -5082 -559 11867 26476 12671 2174
11534 2174 4590 -2941 -9246 -26457 -35118 -17713 502 -9426 -22185 -25877 -20827 -18533 -19150 -7362
11520 -7362 5053 6523 -3932 -16152 -3566 10730 16679 14580 -21860 -32021 -43503 -35466 -23025
11507 -23025 -18449 -6818 3379 19231 -4470 -8692 -4338 -9652 -9402 -5045 13822 25187 11139
11494 11139 -5643 -14312 -28491 -18185 2575 2953 1612 11726 18541 18811 26083 31014 34835 19393
$$ packed form
11588A1655J0173J2334j4682n877R141q332j3398o570j578P60M497M00L477q273
11574f273J3650J0720J01K969j1788j2590k255j3544l0556K310P449N851J3709
11561b0247J9073K487r788Q47n977L480K6526O370j3540Q424q905n780J75L65
11547C510K611J0346L887J7728j0824k4378j925o037M523J2426J4609j3805j0497
11534B174K416p531o305j7211q661J7405J8215r928j2759l692N050K294o17J1788
11520g362J2415J470j0455j2220J2586J4296N949k099l6440j0161j1482Q037J2441
11507b3025M576J1631J0197J5852k3701m222M354n314K50M357J8867J1365j4048
11494A1139j6782q669j4179J0306K0760L78j341J0114O815K70P272M931L821j5442
$$ plain form
11480 19393 -1166 -11209 -16739 -8487 7432 13613 16913 -7026 -16916 -23598 -23729 -20241 -3782
11467 -3782 -7096 -8071 -19214 -27485 -13776 -5639 -33041 -25113 -12907 -5515 2586 3447 -414 -3200
11453 -3200 11617 20744 26976 24383 14212 6600 -4975 -23556 -20596 -11809 9096 15357 2920
11440 2920 -15488 -21525 -26556 -39697 -11555 8516 17456 8638 -36199 -34338 -25422 -36218 -27056
11427 -27056 -20561 -8482 -6619 -5695 6523 3526 -6271 -11153 -1838 19043 28539 10688 -14098
11414 -14098 -38667 -25013 11229 49951 62011 61136 48750 49935 33966 9621 3370 353 9300
11401 9300 7663 -4634 -28480 -42143 -34655 -35769 -52624 -39340 1107 -272 11203 19260 19783
11388 19783 23175 35824 26633 21980 16494 11040 8874 8743 18035 15904 14390 -5252 -7210 -708
$$ packed form
11480A9393k0559j0043n530Q252J5919O181L300k3939r890o682j31L488J6459
11467c782l314r75j1143q271J3709Q137k7402P928J2206P392Q101Q61l861k786
11453c200J4817R127O232k593j0171p612j1575j8581K960Q787K0905O261j2437
11440B920j8408o037n031j3141K8142K0071Q940q818m4837J861Q916j0796R162
11427b7056O495J2079J863R24J2218k997r797m882R315K0881R496j7851k4786
11414a4098k4569J3654L6242L8722J2060q75j2386J185j5969k4345o251l017Q947
11401I300j637j2297k3846j3663P488j114j6855J3284M0447j379J1475Q057N23
11388A9783L392J2649r191m653n486n454k166j31R292k131j514j9642j958O502
$$ plain form
11374 -708 15851 12691 -7842 748 29620 37836 25114 10022 22278 14136 10834 18840 4446
11361 4446 -7351 8336 4944 3937 11640 34093 43450 12994 2185 7405 -308 3409 12383
11348 12383 23731 15578 -4871 -14122 -12554 -1858 16353 27363 872 -6109 3724 5179 487
11335 487 5793 6090 2350 -2193 8672 16503 2012 -10146 -21010 -12277 3797 10444 1618 8860
11321 8860 7129 4826 -10811 -23819 -23840 -10629 -2702 -469 5272 11375 8628 14413 11909 15462
11307 15462 14272 16014 8750 13259 13817 28288 15620 -17377 -16201 -185 -13734 -3705 15175
11294 15175 13861 3789 10129 -12787 -22196 -26020 -16773 -14505 -21696 -28607 -33502 -34845 -6190 -1277
11280 -1277 -16233 -18427 -6625 -14854 -18837 4175 -1158 -5004 -10403 -11745 -22196 -23970 -15781 -34927
$$ packed form
11374g08J6559l160k0533Q590K8872Q216j2722j5092J2256q142l302Q006j4394
11361D446j1797J5687l392j007P703K2453R357l0456j0809N220p713L717Q974
11348A2383J1348q153k0449r251J568J0696J8211J1010k6491o981R833J455m692
11335D87N306K97l740m543J0865P831j4491j2158j0864Q733J6074O647q826P242
11321H860j731k303j5637j3008k1J3211P927K233N741O103k747N785k504L553
11307A5462j190J742p264M509N58J4471j2668l2997J176J6016j3549J0029J8880
11294A5175j314j0072O340k2916r409l824R247K268p191o911m895j343K8655M913
11280a277j4956k194J1802q229l983K3012n333l846n399j342j0451j774Q189j9146
$$ plain form
11266 -34927 -34389 -21276 -19113 -6793 13573 5317 -11015 -11158 856 26002 31544 30928 27060 16961
11252 16961 -589 -15313 -11092 -2426 -12198 -8703 -3484 -9317 -6172 1926 14971 972 3485
11239 3485 -5821 -6647 6984 2562 -4149 -7986 -9603 -18378 -17884 -15524 -9991 -8172 -1769 7503 14574
11224 14574 14185 -1481 -36438 -29945 -15754 -2562 -23063 -23423 -17055 -17555 -20549 -42947 -45422 -52502
11210 -52502 -29868 -9469 -4181 8743 7176 -7534 -18972 -20311 -13501 -6628 -1654 -19900 -30541
11197 -30541 -37116 -39685 -35089 5654 18789 -431 -29842 -28153 -28340 -23061 -25429 -26806 -37257
11184 -37257 -40287 -35531 -16510 -14775 -11858 -15299 -27551 -27398 -16170 -1434 -991 -9972 -23606 -6825
11170 -6825 19178 48930 49539 38053 13753 14315 12167 -11120 -20327 -1796 17956 29833 37669
$$ packed form
11266c4927N38J3113K163J2320K0366q256j6332j43J2014K5146N542o16l868j0099
11252A6961j7550j4724M221Q666r772L495N219n833L145Q098J3045j3999K513
11239C485r306q26J3631m422o711l837j617q775M94K360N533J819O403R272P071
11224A4574l89j5666l4957O493J4191J3192k0501l60O368n00k994k2398k475p080
11210e2502K2634K0399N288J2924j567j4710j1438j339O810O873M974j8246j0641
11197c0541o575k569M596M0743J3135j9220k9411J689j87N279k368j377j0451
11184c7257l030M756J9021J735K917l441j2252J53J1228J4736M43q981j3634J6781
11170f825K6003K9752O09j1486k4300N62k148k3287r207J8531J9752J1877P836
$$ plain form
11157 37669 31097 27892 31091 27661 9567 8682 5376 7359 9713 -3385 -19822 -38658 -8057
11144 -8057 6182 -6092 -13274 -24275 -26507 -36913 -31465 -23140 -21655 -11543 10407 14366 -390
11131 -390 -8634 -6259 1679 -1166 -8640 -5549 -26751 -20701 -10207 11318 4397 -3141 -8593 -29118
11117 -29118 -23526 -4066 7754 20602 5716 3727 685 16081 14714 -18041 -22551 -27578 -18083
11104 -18083 -3373 -2543 1427 10850 11391 -7642 -11421 -21248 -9302 -66 13569 1985 -17130
11091 -17130 -11844 -17828 -28076 -45661 -54266 -37078 -25328 -19148 -14525 -14536 1399 3531 -5763 -2376
11077 -2376 -373 -24699 -62664 -70887 -43405 -7622 4539 15324 15240 -3070 1220 3292 6298
11064 6298 16174 27696 14294 21380 29065 21361 9400 -10422 -42954 -59284 -45276 -32110 -21181
$$ packed form
11157C7669o572l205L199l430j8094q85l306J983K354j3098j6437j8836L0601
11144h057J4239j2274p182j1001k232j0406N448Q325J485J0112K1950L959j4756
11131c90q244K375P938k845p474L091k1202O050J0494K1525o921p538n452k0525
11117b9118N592J9460J1820J2848j4886j989l042J5396j367l2755m510n027R495
11104a8083J4710Q30L970R423N41j9033l779r827J1946R236J3635j1584j9115
11091a7130N286n984j0248j7585q605J7188J1750O180M623j1J5935K132r294L387
11077b376K003k4326l7965q223K7482L5783J2161J0785q4j8310M290K072L006
11064F298R876J1522j3402P086P685p704j1961j9822l2532j6330J4008J3166J0929
$$ plain form
11051 -21181 -13543 -20517 -19694 -11976 10751 12003 13758 25369 29629 25219 24952 21273 15587 7700
11037 7700 16902 27207 32062 33821 26008 23549 21692 8388 -24195 -30509 -25020 -10621 -2557 4087
11023 4087 6868 8402 -5859 -20077 -19976 -168 12044 23046 36549 23088 18303 30192 4945
11010 4945 4826 11234 -1681 -10625 -5592 -2610 3088 13948 -1187 -976 -4949 -13777 -10637 -8449
10996 -8449 -5083 16466 18376 17622 25153 43541 30627 10146 -512 -19592 -20383 -30009 -31655 -4009
10982 -4009 -12785 -32177 -27018 -14098 -2580 -3156 -5160 -18666 -37167 -34756 -21313 -11280 -25978
10969 -25978 -45186 -17107 5167 13735 24321 23278 7880 -6022 -2399 -17827 -10744 -8044 -2509
10956 -2509 -18729 -23632 -7758 -34630 -57698 -35533 -27210 -15495 -14071 -6215 -10713 1541 11667
$$ packed form
11051b1181P638o974Q23P718K2727J252J755J1611M260m410k67l679n686p887
11037G700R202J0305M855J759p813k459j857j3304l2583o314N489J4399Q064O644
11023D087K781J534j4261j4218J01J9808J2212J1002J3503j3461m785J1889k5247
11010D945j19O408j2915q944N033K982N698J0860j5135K11l973q828L140K188
10996h449L366K1549J910p54P531J8388j2914k0481j0658j9080p91r626j646K7646
10982d009q776j9392N159J2920J1518n76k004j3506j8501K411J3443J0033j4698
10969b5978j9208K8079K2274Q568J0586j043j5398j3902L623j5428P083K700N535
10956b509j6220m903J5874k6872k3068K2165Q323J1715J424P856m498J2254J0126
$$ plain form
10943 11667 -3018 584 688 8950 -1758 -2283 -8504 -8073 -2534 -13712 -24044 -18975 -10394 -32152
10929 -32152 -36229 -14725 -12969 12649 26597 11286 5971 12633 4209 -4785 -8990 -17181 -8613
10916 -8613 -9018 -31151 -38040 -15332 -9646 -2924 -1847 -9113 -24531 -18821 -7690 -17372 -7114 -1116
10902 -1116 -9872 23676 20369 3717 -2438 -3877 -388 27029 29371 12052 9188 7891 3478 12418
10888 12418 6613 10557 13745 -8044 -13633 -2778 18911 11432 -8872 -14482 -16298 -11345 2026
10875 2026 13134 12872 20534 3987 -17620 -22674 -11982 -13511 -34009 -35827 -20471 854 8910
10862 8910 7354 -11209 -26181 -19976 -21373 -12688 2244 -10508 -4600 2509 -2508 -3474 -10504 6746
10848 6746 14476 4142 -12947 -13067 3158 -2723 -3424 -2470 -4182 9854 11645 -3345 -3258 2878 9305
$$ packed form
10943A1667j4685L602J04Q262j0708n25o221M31N539j1178j0332N069Q581k1758
10929c2152m077K1504J756K5618J3948j5311n315O662q424q994m205q191Q568
10916h613m05k2133o889K2708N686O722J077p266j5418N710J1131r682J0258N998
10902a116q756L3548l307j6652o155j439L489K7417K342j7319k864j297m413Q940
10888A2418n805L944L188k1789n589J0855K1689p479k0304n610j816M953J3371
10875B026J1108k62P662j6547k1607n054J0692j529k0498j818J5356K1325Q056
10862H910j556j8563j4972O205j397Q685J4932j2752N908P109n017r66p030J7250
10848F746P730j0334j7089j20J6225n881p01R54j712J4036J791j4990Q7O136O427
$$ plain form
10833 9305 8668 19856 19376 8746 -1991 -15736 -14279 -23248 -18456 10218 19021 25463 31829 26148
10819 26148 17408 9006 -1535 -8203 -8279 -4182 8354 -3943 -5291 -915 5318 3889 10127 16164
10805 16164 26978 34798 11291 -5366 -26876 -31208 -35328 -20833 -9985 -18517 -11278 -9584 9531
10792 9531 26498 20261 14451 3760 3754 9434 3299 -9336 -10380 -13648 -1083 13879 1157 3326
10778 3326 20720 31969 28048 -2364 -17687 -8355 4271 -5712 -21103 -23114 -16474 -5223 2369
10765 2369 -8664 -10750 2859 6412 6313 -8000 -17334 -4638 6719 3951 -10351 -21985 -8291
10752 -8291 12008 4790 5699 25247 15617 -7804 -24554 -20853 -23882 -7404 10092 4284 -936
10739 -936 3280 3089 9623 8591 12769 3167 -9672 470 66 11382 1882 7116 5934 3060 -8349
$$ packed form
10833I305o37J1188m80j0630j0737j3745J457q969M792K8674Q803O442O366n681
10819B6148q740q402j0541o668p6M097J2536j2297j348M376O233j429O238O037
10805A6164J0814P820k3507j6657k1510m332m120J4495J0848q532P239J694J9115
10792I531J6967o237n810j0691oN680o135j2635j044l268J2565J4962j2722K169
10778C326J7394J1249l921l0412j5323R332J2626r983j5391k011O640J1251P592
10765B369j1033k086J3609L553r9j4313r334J2696J1357k768j4302j1634J3694
10752h291K0299p218R09J9548r630k3421j6750L701l029J6478J7496n808n220
10739i36M216j91O534j032M178r602j2839J0142m04J1316r500N234j182k874j1409
$$ plain form
10724 -8349 -14229 -9211 -26598 -28201 -12630 -8333 -6761 -3949 -16991 -41535 -37420 -25929 -25096 -20859
10710 -20859 -1658 17459 26534 17707 1044 1902 1137 -1438 3910 3304 9723 9846 2623 2397 -1953
10695 -1953 -252 10809 3610 -5024 -8714 2602 -5541 -12261 -2330 -15641 -20472 -14399 -19290 -15761
10681 -15761 -9793 -16461 1463 -539 -13677 -13055 -6681 -16262 -23352 -20757 -25674 -34819 -21131 -3544
10667 -3544 -10956 -20755 -9889 -6481 -11908 -22565 -18690 -18226 -21539 -17980 -22667 -32496 -46701 -18524
10653 -18524 -10762 -23189 -37630 -39779 -29042 -28602 -20589 2112 7099 -5285 3573 20432 27139
10640 27139 27416 9339 4117 3936 -2368 495 -31657 -44412 -50334 -44922 -33115 -19062 -7621
10627 -7621 -10514 12898 27802 35203 33537 45140 27104 5118 -3575 -6079 5584 -13064 -23888
$$ packed form
10724h349n880N018j7387j603J5571M297J572K812j3042k4544M115J1491Q33M237
10710b0859J9201J9117R075q827j6663Q58p65k575N348o06O419J23p223k26m350
10695a953J701J1061p199q634l690J1316q143o720R931j3311m831O073m891L529
10681a5761N968o668J7924k002j3138O22O374r581p090K595m917r145J3688J7587
10667c544p412r799J0866L408n427j0657L875M64l313L559m687r829j4205K8177
10653a8524P762j2427j4441k149J0737M40Q013K2701M987j2384Q858J6859O707
10640B7139K77j8077n222j81o304K863l2152j2755n922N412J1807J4053J1441
10627g621k893K3412J4904P401j666J1603j8036k1986q693k504J1663j8648j0824
$$ plain form
10614 -23888 -22636 -14147 842 1680 4366 3103 -5908 -15497 -4941 8829 17973 10866 -217 -3376
10600 -3376 -20577 -22326 -11409 -11886 -13386 -25242 -25645 -5728 -3595 -18160 -9993 10565 24186
10587 24186 16815 10077 15058 13502 26614 25870 9151 -3505 -14990 -15699 18108 35732 29697
10574 29697 25140 9323 3700 4118 -2557 -6876 11325 10942 -18503 -26630 -35099 -30912 -19237 -15962
10560 -15962 -4785 16545 17461 19663 25143 20495 4529 2967 -9236 -20082 -19957 -25327 -12109
10547 -12109 5121 6008 -6221 8132 24224 13846 -7198 -9388 -877 -3371 -2960 7242 -12830
10534 -12830 -17883 -19421 -23942 -18834 -14119 -11290 -22797 -50880 -35653 -8265 2345 8290 8404
10521 8404 31667 37868 25115 5219 -9887 2797 14307 16304 7222 -1496 8090 27703 31494
$$ packed form
10614b3888J252Q489J4989Q38K686j263r011r589J0556J3770R144p107j1083l159
10600c376j7201j749J0917m77j500j1856m03J9917K133j4565Q167K0558J3621
10587B4186p371o738M981j556J3112p44j6719j2656j1485p09L3807J7624o035
10574B9697m557j5817n623M18o675m319J8201l83k9445q127q469M187J1675L275
10560a5962J1177K1330R16K202N480m648j5966j562j2203j0846J25n370J3218
10547a2109J7230Q87j2229J4353J6092j0378k1044k190Q511k494M11J0202k0072
10534a2830n053j538m521N108M715K829j1507k8083J5227K7388J0610N945J14
10521H404K3263O201j2753j9896j5106J2684J1510J997r082q718R586J9613L791
$$ plain form
10508 31494 6969 -16100 -13880 -23397 -30279 -15781 399 -5209 -6974 -15540 -1754 16043 40568
10495 40568 51559 25438 4484 168 -1736 -2358 18532 23286 12857 18999 11555 24341 29880
10482 29880 20735 16326 12146 -2205 -56 17676 18308 30902 43306 24902 16675 6106 7172
10469 7172 13384 19671 10878 -5135 -7724 -11255 2082 -4347 -18182 -28394 -19062 -8678 915
10456 915 12434 9013 -7149 -14131 -5187 -2273 -1026 2567 5605 10730 10674 -6246 -12750 -6360 -14680
10441 -14680 -39131 -25372 6695 22197 33445 28181 12929 9528 1709 9102 -5036 -14127 -26377
10428 -26377 -43008 -35940 -17128 -15058 -8958 -2333 4613 -15940 -35399 -42263 -26444 -16220 -4851
10415 -4851 4101 -10491 -5974 7877 11907 18030 7076 7148 20024 7783 -2187 5171 23030 9766
$$ packed form
10508C1494k4525k3069K220r517o882J4498J6180n608j765q566J3786J7797K4525
10495D0568J0991k6121k0954m316j904o22K0890M754j0429O142p444J2786N539
10482B9880r145m409m180j4351K149J7732O32J2594J2404j8404q227j0569J066
10469G172O212O287q793j6013k589l531J3337o429j3835j0212R332J0384R593
10456I15J1519l421j6162o982Q944K914J247L593L038N125n6j6920o504O390q320
10441a4680k4451J3759L2067J5502J1248n264j5252l401p819P393j4138r091j2250
10428b6377j6631P068J8812K070O100O625O946k0553j9459o864J5819J0224J1369
10415d851Q952j4592M517J3851M030O123j0954P2J2876j2241r970P358J7859j3264
$$ plain form
10401 9766 14089 18536 25983 22784 12565 -1280 21243 28804 3220 -1748 2990 -1803 -12070
10388 -12070 -7723 -1502 -3868 15776 25893 20869 15132 13447 -1888 14879 22172 29675 51794
10375 51794 59004 45094 25672 18352 12740 7799 6365 26285 32294 8583 -4 -4803 -12307
10362 -12307 4149 20403 22892 28087 38874 31890 6807 7816 7656 15374 17504 12777 24766
10349 24766 16204 7875 18482 21033 11280 3000 -794 -67 -1552 -4801 2537 14584 8429 9370
10335 9370 24113 39700 41060 34256 20723 17449 4675 -9365 -14774 2804 10311 -990 -6270
10322 -6270 -11151 -2671 -4859 -14169 -23857 -18028 -9945 -1149 -5501 -16040 -10591 -7570 8394 24794
10308 24794 12243 18284 40362 42160 24628 27785 32924 30170 26875 24609 27708 21653 30141 3706
$$ packed form
10401I766M323M447P447l199j0219j3845K2523P561k5584m968M738m793j0267
10388a2070M347O221k366J9644J0117n024n737j685j5335J6767P293P503K2119
10375E1794P210j3910j9422p320n612m941j434J9920O009k3711q587m799p504
10362a2307J6456J6254K489N195J0787o984k5083J009j60P718K130m727J1989
10349B4766q562q329J0607K551r753q280l794P27j485l249P338J2047o155R41
10335I370J4743J5587J360o804j3533l274j2774j4040n409J7578P507j1301n280
10322f270m881Q480k188r310r688N829Q083Q796m352j0539N449L021J5964J6400
10308B4794j2551O041K2078J798j7532L157N139k754l295k266L099o055Q488k6435
$$ plain form
10294 3706 509 1973 -12657 127 4215 -12311 -12874 6348 9461 1890 -8837 6081 16407
10281 16407 29121 39358 34927 23095 24038 13520 19743 22969 32687 52169 55669 55494 69719
10268 69719 56008 38092 29572 25144 26301 34945 37720 49033 53418 37090 29554 17833 9404
10255 9404 16589 8707 5405 17580 33207 45565 42384 39850 41127 39987 42640 32830 25010 32424
10241 32424 42789 45208 48137 43052 43156 47194 33150 33156 26175 24560 33477 37738 61460 77021
10227 77021 59281 57921 47068 42813 46550 35172 32474 34500 55965 63549 72213 88593 89460
10214 89460 85187 87349 90075 76438 67987 63669 58193 68534 101151 134108 120861 104541 88031
10201 88031 98875 107281 106944 86714 73699 47785 44684 70691 98698 104949 116147 137378 152385
$$ packed form
10294C706l197J464j4630J2784M088j6526n63J9222L113p571j0727J4918J0326
10281A6407J2714J0237m431j1832R43j0518O223L226R718J9482L500j75J4225
10268F9719j3711j7916q520m428J157Q644K775J1313M385j6328p536j1721q429
10255I404P185p882l302J2175J5627J2358l181k534J277j140K653r810p820P414
10241C2424J0365K419K929n085J04M038j4044Oo981j615Q917M261K3722J5561
10227G7021j7740j360j0853m255L737j1378k698K026K1465P584Q664J6380Q67
10214H9460m273K162K726j3637q451m318n476J0341L2617L2957j3247j6320j6510
10201H8031J0844Q406l37k0230j3015k5914l101K6007K8007O251J1198K1231J5007
$$ plain form
10188 152385 163101 170818 190679 211962 251151 236109 189310 171022 162473 156736 137651 156274
10176 156274 186500 204415 221108 218387 210321 208483 219855 213587 205462 220866 248546 235647
10164 235647 235720 241600 265413 265463 261902 270828 310352 325440 339808 367204 376728 395408 422364
10151 422364 448618 466328 479722 513812 561079 585845 607417 627799 652167 699135 759475
10140 759475 805011 858000 937531 984170 1025204 1105466 1213019 1326221 1463952 1608912 1742110
10129 1742110 1880333 2026581 2209610 2440316 2688238 2945126 3228913 3533682 3866108
10120 3866108 4214219 4556695 4873679 5173587 5425551 5607488 5703625 5724669 5640422 5487702
10110 5487702 5282511 4998875 4678386 4332846 4003351 3684596 3384825 3087002 2801388
$$ packed form
10188A52385J0716P717J9861K1283L9189j5042m6799j8288q549n737j9085J8623
10176A56274L0226J7915J6693k721q066j838J1372o268q125J5404K7680j2899
10164B35647P3N880K3813N0l561Q926L9524J5088J4368K7396R524J8680K6956
10151D22364K6254J7710J3394L4090M7267K4766K1572K0382K4368M6968O0340
10140G59475M5536N2989P9531M6639M1034Q0262J07553J13202J37731J44960J33198
10129A742110J38223J46248J83029K30706K47922K56888K83787L04769L32426
10120C866108L48111L42476L16984K99908K51964J81937R6137K1044q4247j52720
10110E487702k05191k83636l20489l45540l29495l18755k99771k97823k85614
$$ plain form
10101 2801388 2548345 2327327 2122853 1950276 1807002 1676431 1539269 1434330 1336084 1230379
10091 1230379 1142340 1059387 975572 913239 857903 804552 762221 706470 652468 633461 611041
10080 611041 590763 564978 520979 481317 471190 444788 404214 390053 393581 384854 365342 358896
10068 358896 333411 325276 303297 274805 247968 228885 220144 231280 235039 208661 191809 200589
10056 200589 192612 186269 194400 189689 187489 177395 156499 133363 151382 183211 184563 173930 168649
10043 168649 152145 138677 130235 125451 131449 131854 140721 126211 110616 113667 113879 109675 121286
10030 121286 122221 96716 97030 126032 122178 121630 125275 115975 109274 83711 65101 65245 70142 67431
10016 67431 74894 94102 74901 57842 65215 69351 65601 67955 54207 33257 46315 45900 36829
$$ packed form
10101B801388k53043k21018k04474j72577j43274j30571j37162j04939r8246j05705
10091A230379q8039q2953q3815o2333n5336n3351m2331n5751n4002j9007k2420
10080F11041k0278k5785m3999l9662j0127k6402m0574j4161L528q727j9512o446
10068C58896k5485q135k1979k8492k6837j9083q741J1136L759k6378j6852Q780
10056B00589p977o343Q131m711k200j0094k0896k3136J8019L1829J352j0633n281
10043A68649j6504j3468q442m784N998M05Q867j4510j5595L051K12m204J1611
10030A21286R35k5505L14K9002l854n48L645r300o701k5563j8610J44M897k711
10016F7431P463J9208j9201j7059P373M136l750K354j3748k0950J3058m15r071
$$ plain form
10003 36829 42397 38411 42502 41032 29535 32982 36417 50593 75774 72050 66858 44522 30094
9990 30094 34869 49302 28908 23181 28102 39958 36674 26898 21542 25841 33501 53208 61755 61239
9976 61239 44237 23951 17469 27009 16962 21678 35450 34364 24147 4751 7179 20956 28797
9963 28797 38947 41334 49635 39869 34270 52141 50583 28776 27580 33587 32169 47412 39689 25885
9949 25885 30257 34869 41522 53100 49850 35209 22407 23610 38390 46111 38617 19640 15987
9936 15987 9942 15744 33772 50908 52483 27289 -2711 -8402 23058 26690 30450 23734 23570 25248
9922 25248 25894 30399 39564 35753 20558 16300 34614 50791 38220 24586 20748 24914 22471 10806
9908 10806 4040 -7433 -16717 -17075 -7553 10738 9500 16997 33567 34310 29085 9702 4319 13725
$$ packed form
10003C6829N568l986M091j470j1497L447L435J4176K5181l724n192k2336j4428
9990C0094M775J4433k0394n727M921J1856l284r776n356M299P660J9707Q547n16
9976F1239j7002k0286o482R540j0047M716J3772j086j0217j9396K428J3777P841
9963B8797J0150K387Q301r766n599J7871j558k1807j196O007j418J5243p723j3804
9949B5885M372M612O653J1578l250j4641j2802J203J4780P721p494j8977l653
9936A5987o045N802J8028J7136J575k5194l0000n691L1460L632L760o716j64J678
9922B5248O46M505R165l811j5195m258J8314J6177j2571j3634l838M166k443j1665
9908A0806o766j1473r284l58R522J8291j238P497J6570P43n225j9383n383R406
$$ plain form
9894 13725 26189 32364 31545 19566 10656 -8382 4933 11263 4065 7169 17837 -6886 -19199
9881 -19199 -11593 -4557 -406 23691 26781 -784 -3203 1857 13715 29152 20847 3194 1751
9868 1751 10074 19850 34055 41528 33018 35583 3612 -8855 4115 -7591 -20624 -16470 -6176
9855 -6176 -15462 -24534 3598 -158 -672 5066 10886 3100 -2072 11534 33033 26409 -8465 -30173
9841 -30173 -58467 -60684 -47047 -28053 -11611 -10050 -12491 100 435 -5831 9778 11355 5065
9828 5065 10094 7638 5980 2337 -12012 -10242 7132 4653 10207 9096 12788 26202 38024 25353
9814 25353 -5835 -16204 -20355 -11330 -3447 5011 24911 33352 27997 23243 13590 5208 -4841 2335
9800 2335 12788 3182 10059 11066 -562 5278 1769 19907 30741 -4860 -29261 -21389 -17932
$$ packed form
9894A3725J2464O175q19j1979q910j9038J3315O330p198L104J0668k4723j2313
9881a9199P606P036M151K4097L090k7565k419N060J1858J5437q305j7653j443
9868A751Q323R776J4205P473q510K565l1971j2467J2970j1706j3033M154J0294
9855f176r286r072K8132l756n14N738N820p786n172J3606K1499o624l4874k1708
9841c0173k8294k217J3637J8994J6442J561k441J2591L35o266J5609J577o290
9828E065N029k456j658l643j4349J770J7374k479N554j111L692J3414J1822j2671
9814B5353l1188j0369m151R025P883Q458J9900Q441n355m754r653q382j0049P176
9800B335J0453r606O877J007j1628N840l509J8138J0834l5601k4401P872L457
$$ plain form
9787 -17932 -12787 -5651 15255 40651 34874 8564 -3161 -12718 -31119 -11421 3314 -13852 -1498
9774 -1498 25681 11627 -17111 -14257 4133 15513 10050 29044 40036 -2961 -40631 -27298
9762 -27298 -16924 -29423 -25106 -16349 -6997 4292 -5121 -29778 -41668 -33362 -15833 -5758 -455
9749 -455 -13687 -9597 -11152 -8293 -27962 -28870 -13632 6238 -13190 -16808 -15867 -22635 -27152 -36287
9735 -36287 -20262 -20126 -13513 -19243 -12115 -16472 -3600 -3748 -10383 15446 17731 32542 22920 8800
9721 8800 15373 42144 37132 41213 35135 10089 -7034 4110 23136 7521 -6617 -5376 -10822
9708 -10822 -4365 -13394 -34516 -59850 -38689 -7119 7086 -7043 -4618 13062 11270 11874 26184
9695 26184 21470 15894 5362 4702 8039 21730 33891 38078 25039 9360 -10953 -11263 6994
$$ packed form
9787a7932N145P136K0906K5396n777k6310j1725r557j8401J9698J4735j7166J2354
9774a498K7179j4054k8738K854J8390J1380n463J8994J0992m2997l7670J3333
9762b7298J0374j2499M317Q757R352J1289r413k4657j1890Q306J7529J0075N303
9749d55j3232M090j555K859j9669r08J5238J9870j9428l618R41o768m517r135
9735c6287J6025J36O613n730P128m357J2872j48o635K5829K285J4811r622j4120
9721H800O573K6771n012M081o078k5046j7123J1144J9026j5615j4138J241n446
9708a0822O457r029k1122k5334K1161L1570J4205j4129K425J7680j792O04J4310
9695B6184m714n576j0532o60L337J3691J2161M187j3039j5679k0313l10J8257
$$ plain form
9682 6994 17468 24707 20031 3210 9328 21487 40547 20309 4868 6282 -6887 -14481 -7668
9669 -7668 9642 2951 -8458 -10965 -5928 -1676 -856 -9104 3548 -7678 -25570 -23748 -26463 -35395
9655 -35395 -31032 -36680 -25137 -19898 -10664 -14850 -17258 -35235 -44485 -24183 -7138 12467 41760
9642 41760 27336 6129 9491 -429 -5774 -12773 -4416 -4752 9940 23847 -5495 -9445 7763
9629 7763 12398 -1612 10120 21246 4539 -18173 -17233 -11942 -10503 -30833 -35078 -20771 -9966
9616 -9966 -4834 -5876 -14572 -2013 -5070 -24218 -13038 4530 7092 13923 22424 25653 14260 14179
9602 14179 5481 27956 42956 49910 27691 27180 25675 16988 23499 12790 7913 -9674 -34180
9589 -34180 -23537 -13084 -17955 -13163 -9625 -9718 1556 15526 8369 -4805 13678 23285 22215 11236
$$ packed form
9682F994J0474P239m676j6821O118J2159J9060k0238j5441J414j3169p594O813
9669g668J7310o691j1409k507N037M252Q20q248J2652j1226j7892J822k715q932
9655c5395M363n648J1543N239R234m186k408j7977r250K0302J7045J9605K9293
9642D1760j4424k1207L362r920n345o999Q357l36J4692J3907k9342l950J7208
9629G763M635j4010J1732J1126j6707k2712R40N291J439k0330m245J4307J0805
9616i966N132j042q696J2559l057j9148J1180J7568K562O831Q501L229j1393q1
9602A4179q698K2475J5000O954k2219n11j505q687O511j0709m877j7587k4506
9589c4180J0643J0453m871M792L538r3J1274J3970p157j3174J8483R607j070j0979
$$ plain form
9575 11236 4998 5957 19738 20737 14003 10560 9162 10598 10148 849 2948 22016 28339 7293 -16160
9560 -16160 -11591 -21707 -21549 -1260 3537 1388 -1214 16318 22877 18857 17376 12547 12202 2581
9546 2581 -23376 -40825 -29494 -7793 5919 9774 9738 -3473 -11368 -12329 -16715 -25410 -20720 -17463
9532 -17463 -11787 -30512 -21294 -4142 9145 12473 18455 -3126 -22869 -15258 6375 13581 -3066
9519 -3066 -11223 -1662 14023 3851 -1287 -2575 -6529 -17492 -14613 -19298 -33583 -28913 -16099 -16050
9505 -16050 -10434 -11252 -32430 -38965 -30998 -39269 -23959 9459 16506 17287 10281 -10802 -20944 -19863
9491 -19863 -13399 -33766 -33714 -29848 -28970 -47953 -42098 -41596 -37500 -16347 9381 8588 4581 -1473 -1351
9476 -1351 2446 -5823 -4677 2428 -1847 9284 7714 -11677 -24302 -12534 -2018 -7365 -22693
$$ packed form
9575A1236o238R59J3781R99o734l443j398J436m50r299K099J9068O323k1046k3453
9560a6160M569j0116J58K0289M797k149k602J7532O559m020j481m829l45r621
9546B581k5957j7449J1331K1701J3712L855l6j3211p895r61m386q695M690L257
9532a7463N676j8725R218J7152J3287L328N982k1581j9743P611K1633P206j6647
9519c066q157R561J5685j0172n138j288l954j0963K879m685j4285M670J2814M9
9505a6050N616q18k1178o535P967q271J5310L3418P047P81p006k1083j0142J081
9491a9863O464k0367N2L866Q78j8983N855N02M096K1153K5728p93m007o054J22
9476a351L797q269J146P105m275J1131j570j9391j2625J1768J0516n347j5328
$$ plain form
9463 -22693 -18891 -5560 -5090 -5227 -2948 -21183 -23636 -27627 -37142 -34088 -25280 -35220 -22250 -6835
9449 -6835 431 14802 699 -8456 -5128 12266 19745 11290 -10572 -124 -12404 -8018 -1439
9436 -1439 -5787 -8728 -796 -390 -16780 -21762 -28129 -9386 2137 -5712 -13985 5501 5788 -14015
9422 -14015 -14603 1488 23445 22688 26044 13588 12985 10114 17654 25093 27703 25416 16351 11775 -8716
9407 -8716 -37334 -19195 -2805 -11001 -31350 -23540 -12212 -5371 -8036 -168 11292 -15676 -32402
9394 -32402 -11997 7326 2152 -7224 -24370 -26542 -26149 -31062 -29723 -28130 -18143 -20162 -24352 -31458
9380 -31458 -29194 -17254 -15393 12052 4681 -13322 5945 11243 5999 -8362 -24277 -22447 -16066
9367 -16066 -23057 -27821 -21721 -680 -567 3700 16512 14265 -2576 9018 22100 9809 2709
$$ packed form
9463b2693L802J3331M70j37K279j8235k453l991r515L054Q808r940J2970J5415
9449f835P266J4371j4103r155L328J7394P479q455k1862J0448j2280M386O579
9436a439m348k941P932M06j6390m982o367J8743J1523p849q273J9486K87j9803
9422a4015n88J6091K1957p57L356j2456o03k871P540P439K610k287r065m576k0491
9407h716k8618J8139J6390q196k0349P810J1328O841k665P868J1460k6968j6726
9394c2402K0405J9323n174r376j7146k172L93m913J339J593R987k019m190p106
9380c1458K264J1940J861K7445p371j8003J9267N298n244j4361j5915J830O381
9367a6066o991m764O100K1041J13M267J2812k247j6841J1594J3082j2291p100
$$ plain form
9354 2709 -2299 -7284 -4541 5622 20854 35278 35225 28567 7195 -8165 -30467 -19569 -3462
9341 -3462 -16805 -20241 11152 27349 15976 23700 37208 29389 16171 15291 25663 27632 26478
9328 26478 22933 15794 13909 -9656 -10487 -32068 -30941 -25958 -32312 -40229 -45092 -44654 -35918 -10696
9314 -10696 -232 -6584 7691 19702 23702 32430 29944 9659 10783 3249 436 183 -11996 3994
9300 3994 28876 36797 25546 25655 19000 5989 3891 6961 8002 15381 7731 -1511 -5650 11465
9286 11465 25303 25832 13425 -13771 -3478 17779 16243 12251 -8865 -17591 -26477 -17368 -8540
9273 -8540 10699 20169 11010 2997 -4915 -3612 341 -13845 -20005 -24364 -24371 -35797 -20825 -6666
9259 -6666 6302 591 -4270 -2545 -5395 21498 23817 11817 677 8666 15128 -16764 -33285
$$ packed form
9354B709n008m985K743J0163J5232J4424n3o658k1372j5360k2302J0898J6107
9341c462j3343l436L1393J6197j1373P724J3508p819j3218q80J0372J969j154
9328B6478l545p139j885k3565q31k1581J127M983o354p917m863M38Q736K5222
9314a0696J0464o352J4275J2011M000Q728k486k0285J124p534k813k53j2179J5990
9300C994K4882P921j1251J09o655j3011k098L070J041P379p650r242m139J7115
9286A1465J3838N29j2407k7196J0293K1257j536l992k1116q726q886R109Q828
9273h540J9239R470r159q013p912J303L953j4186o160m359pj1426J4972J4159
9259f666J2968n711m861J725k850K6893K319j2000j1140P989O462l1892j6521
$$ plain form
9246 -33285 -36167 -32106 -13726 17810 6687 -4519 -10540 -5739 254 10908 12860 13639 19414 14490
9232 14490 6161 4754 2640 -9109 -24342 -15629 -4406 24638 37547 26801 18162 13958 9142
9219 9142 4348 7597 9216 12111 -2378 1503 2852 -5650 -868 11696 28000 52418 31743 -2077
9205 -2077 -23118 -24870 -13802 3122 30327 33977 32681 5096 -1021 2182 144 1518 -3370 -1272
9191 -1272 5089 3765 18541 34943 32185 24135 20494 37597 27288 21162 30713 35639 46419 70035
9177 70035 49994 33787 34575 36753 41099 33546 26500 30240 31107 35259 46958 42195 35350 33430
9163 33430 6621 3951 26331 19677 4548 15248 14279 -6008 -17283 -17735 -8220 -2737 11356
9150 11356 26608 12806 11623 27796 13715 14044 23617 24365 25836 18342 20171 6240 -1243 -7994
$$ packed form
9246c3285k882M061J8380L1536j1123j1206o021M801N993J0654J952P79N775m924
9232A4490q329j407k114j1749j5233Q713J1223K9044J2909j0746q639m204m816
9219I142m794L249J619K895j4489L881J349q502M782J2564J6304K4418k0675l3820
9205b077k1041j752J1068J6924K7205L650j296k7585o117L203k038J374m888K098
9191a272O361j324J4776J6402k758q050l641J7103j0309o126R551M926J0780K3616
9177G0035k0041j6207P88K178M346p553p046L740Q67M152J1699m763o845j920
9163C3430k6809k670K2380o654j5129J0700r69k0287j1275m52R515N483J4093
9150A1356J5252j3802j183J6173j4081L29R573P48J471p494J829j3931p483o751
$$ plain form
9136 -7994 -18599 -33359 -22425 -14598 -4758 14909 9348 10710 11110 17062 24287 16844 11602 18816
9122 18816 1935 13982 24055 21098 25774 17991 12798 17991 10562 21746 7984 -2906 6283
9109 6283 -1616 -6538 4338 -5296 -6204 4395 19905 28226 39895 40611 40393 30224 20217 2871
9095 2871 19127 14157 15093 3869 12446 18476 595 -2024 5889 8094 8244 9328 4165 -23571
9081 -23571 -19650 -2881 -6059 -20890 -15668 -9465 -10334 -14784 -11306 -16196 1263 9820 -607 -17030
9067 -17030 -15366 -17596 -11800 -4412 11684 31866 22532 30005 53360 43544 41790 41779 39154 33849
9053 33849 32054 23231 18116 3403 4988 2256 2226 5870 -215 -18542 -4195 -9258 -9507 6287
9039 6287 14190 1362 71 -5708 -4227 10682 15444 15477 8838 12257 11687 5367 -476 4434 12477
$$ packed form
9136g994j0605j4760J0934P827R840J9667n561J362M00N952P225p443n242P214
9122A8816j6881J2047J0073k957M676p783n193N193p429J1184j3762j0890R189
9109F283p899m922J0876r634r08J0599J5510Q321J1669P16k18j0169j0007j7346
9095B871J6256m970R36j1224Q577O030j7881k619P913K205J50J084n163k7736
9081b3571L921J6769l178j4831N222O203q69m450L478m890J7459Q557j0427j6423
9067a7030J664k230N796P388J6096K0182r334P473K3355r816j754j1k625n305
9053C3849j795q823n115j4713J585k732l0L644o085j8327J4347n063k49J5794
9039F287P903j2828j291n779J481J4909M762L3o639L419n70o320n843M910Q043
$$ plain form
9024 12477 12209 15501 23667 39520 58246 44710 33621 19401 2516 9817 11574 13176 19437
9011 19437 6439 -7878 -18855 -10151 -5095 -5786 96 -8446 5567 30073 21261 -13016 -27323
8998 -27323 -14250 16294 5806 4236 3666 12717 18961 32929 33259 21637 7858 -11485 -16259
8985 -16259 7593 23762 18142 15151 16512 10454 -3713 -5221 12864 20474 18949 29072 38985
8972 38985 35822 32155 17676 17570 3440 -1827 20604 34910 33277 18209 6692 -5820 -4696
8959 -4696 1274 -7691 -12131 -5703 6828 18214 13691 -7944 -924 -2042 -16755 -27244 -34331 -21512
8945 -21512 4861 20783 20882 6627 -13959 -16799 -2185 13064 11763 -7180 -16980 -14389 -21393
8932 -21393 -13938 7309 20556 17067 8307 1017 18312 11355 10301 1018 -79 13929 26860
$$ packed form
9024A2477k68L292Q166J5853J8726j3536j1089j4220j6885P301J757J602O261
9011A9437j2998j4317j0977Q704N056o91N882q542J4013K4506q812l4277j4307
8998b7323J3073L0544j0488j570n70R051O244J3968L30j1622j3779j9343m774
8985a6259K3852J6169n620k991J361o058j4167j508J8085P610j525J0123R913
8972C8985l163l667j4479j06j4130n267K2431J4306j633j5068j1517j2512J124
8959d696N970q965m440O428J2531J1386m523k1635P020j118j4713j0489p087J2819
8945b1512K6373J5922R9j4255k0586k840J4614J5249j301j8943r800K591p004
8932b1393P455K1247J3247l489q760p290J7295o957j054r283j097J4008J2931
$$ plain form
8919 26860 37443 37209 34098 35823 12581 -15023 -15081 -12562 -19853 -17654 -4256 7518 2181 -13050
8905 -13050 4979 7858 -2937 216 34503 29479 -12320 -34974 -24272 -3608 -918 -2849 -4205
8892 -4205 -4650 -1261 18532 13710 11465 341 -7922 -1796 9632 14221 7241 5207 -9882 -13697
8878 -13697 -10246 -2032 1326 -14378 -44241 -30216 -18810 -17940 -13825 -8010 103 11201 37828
8865 37828 16202 -1827 10267 21194 22259 3908 12558 8067 -17902 -19256 -18198 -17195 -5710
8852 -5710 -2076 5050 7015 6952 11522 4410 4164 -4104 -13310 -11890 7753 20050 -3835 -11758 -5735
8837 -5735 -6666 9317 19358 21986 18641 12138 20783 30598 29296 14810 7115 7528 -503 4769 258
8822 258 -794 3729 24648 48220 45048 20938 10447 18072 19947 10719 10473 7593 -17048 -36074
$$ packed form
8919B6860J0583k34l111J725k3242k7604n8K519p291K199J3398J1774n337j5231
8905a3050J8029K879j0795L153L4287n024m1799k2654J0702K0664K690j931j356
8892d205m45L389J9793m822k245j1124q263O126J1428M589o980k034j5089l815
8878a3697L451Q214L358j5704k9863J4025J1406Q70M115N815Q113J1098K6627
8865C7828k1626j8029J2094J0927J065j8351Q650m491k5969j354J058J003J1485
8852e710L634P126J965o3M570p112k46q268r206J420J9643J2297k3885p923O023
8837e735r31J5983J0041K628l345o503Q645R815j302j4486p695M13q031N272m511
8822B58j052M523K0919K3572l172k4110j0491P625J875r228k46k880k4641j9026
$$ plain form
8808 -36074 -27736 -17559 4315 1596 -14179 -33998 -33356 -16358 2414 -16349 -10560 -4344 2459
8795 2459 3204 4490 9891 6119 2846 4711 13588 12657 21236 44202 43780 39047 22884 26437 34689
8780 34689 38351 30619 11325 -574 9450 26306 19616 10121 26545 33991 13040 3756 -573
8767 -573 -519 3070 -10207 -8286 -7653 -4760 -27514 -28731 -19481 -17265 -10807 -17446 -15892 -13895 -11689
8752 -11689 -11934 -19170 -18265 -12832 -11717 17447 21254 17724 30673 42919 14542 12179 7342 -320
8738 -320 84 5448 18505 19957 19075 35586 51936 30043 5810 -14799 -22044 -22116 -15069 -4667
8724 -4667 -8726 -4643 6814 9184 -3586 -8268 -117 -14409 -16893 4433 13882 38601 30465 30003
8710 30003 30088 22398 4126 3612 -1253 6534 11417 7478 -670 5238 -1019 -1996 1267 -6509 -18540
$$ packed form
8808c6074Q338J0177K1874k719j5775j9819O42J6998J8772j8763N789O216O803
8795B459P45J286N401l772l273J865Q877r31Q579K2966m22m733j6163L553Q252
8780C4689L662p732j9294j1899J0024J6856o690r495J6424P446k0951r284m329
8767e73N4L589j3277J921O33K893k2754j217R250K216O458o639J554J997K206
8752a1689k45p236R05N433J115K9164L807l530J2949J2246k8377k363m837p662
8738c20M04N364J3057J452q82J6511J6350k1893k4233k0609p245p2P047J0402
8724d667m059M083J1457K370j2770m682Q151j4292k484K1326R449K4719q136m62
8710C0003Q5p690j8272n14m865P787M883l939q148N908o257r77L263p776j2031
$$ plain form
8695 -18540 16 -10292 -15083 -18995 -22820 -6081 3464 8447 -7186 -7834 -17550 -1211 10148
8682 10148 23469 17861 3609 5248 -3092 -10974 -8604 -15964 -29150 -26313 -25365 -8214 -6541 -2918
8668 -2918 -7520 -24591 -5835 18501 25815 13593 8106 17489 18127 11331 1304 -15378 -21720 -5903
8654 -5903 15583 18882 5416 11986 13039 12322 23520 31382 34814 23764 9745 9402 8969 8792 20916
8639 20916 34013 38570 32563 12039 -1094 -12888 1414 17731 23805 28581 25434 21644 17362
8626 17362 7546 8125 21093 15154 2226 -4226 2026 15592 15432 18772 19276 3258 -13595 -15569
8612 -15569 -9157 4184 23126 26427 16283 6937 15368 30604 42633 26053 12940 5439 18995
8599 18995 15556 15935 -5126 -1357 10908 5445 5921 20320 11993 2832 6071 4986 8494 12570
$$ packed form
8695a8540J8556j0308m791l912l825J6739R545M983j5633o48r716J6339J1359
8682A0148J3321n608j4252J639q340p882K370p360j3186K837R48J7151J673L623
8668b918m602j7071J8756K4336P314j2222n487R383O38o796j0027j6682o342J5817
8654e903K1486L299j3466O570J053p17J1198P862L432j1050j4019l43m33j77J2124
8639B0916J3097M557o007k0524j3133j1794J4302J6317O074M776l147l790m282
8626A7362r816N79J2968n939j2928o452O252J3566j60L340N04j6018j6853j974
8612a5569O412J3341J8942L301j0144r346Q431J5236J2029j6580j3113p501J3556
8599A8995l439L79k1061L769J2265n463M76J4399q327r161L239j085L508M076
$$ plain form
8585 12570 10590 6093 15148 11452 24412 13978 7497 29284 26808 12076 10571 10228 1554 6890
8571 6890 9958 874 -5757 -377 4262 2759 4342 25539 5270 6556 -8390 -145 16351 11271
8557 11271 3662 6963 12522 16508 11459 19070 37601 28492 9522 13396 18698 21318 12772 11755
8543 11755 -1389 3194 3556 8424 4139 21263 25620 7157 3487 5637 -1729 -9391 -26829 -32750
8529 -32750 -35965 -34132 -33142 -21610 -17293 3064 20529 25578 16530 3979 -1525 18083 4012
8516 4012 -15141 -13217 -15063 -29950 -22220 -15243 1819 12057 20132 19723 11161 -2530 -15170 -1762
8502 -1762 -779 11006 9737 2927 7293 21267 26559 12416 6902 -17056 -23670 -24556 -3911 17465
8488 17465 25475 29711 34798 20835 14792 6745 -7936 -21160 -15321 -4945 5753 11034 29489
$$ packed form
8585A2570j980m497R055l696J2960j0434o481K1787k476j4732j505l43q674N336
8571F890L068r084o631N380M639j503J583K1197k0269J286j4946Q245J6496n080
8557A1271p609L301N559L986n049P611J8531r109j8970L874N302K620q546j017
8543A1755j3144M583L62M868m285J7124M357j8463l670K150p366p662j7438n921
8529c2750l215J833R90J1532M317K0357J7465N049r048j2551n504J9608j4071
8516D012j9153J924j846j4887P730O977J7062J0238Q075m09q562j3691j2640J3408
8502a762R83J1785j269o810M366J3974N292j4143n514k3958o614q86K0645K1376
8488A7465Q010M236N087j3963o043q047j4681j3224N839J0376J0698N281J8455
$$ plain form
8475 29489 12746 -1880 21404 33798 27480 -6731 -6969 828 -2829 -13205 6104 7235 7301 9260
8461 9260 8956 24582 4697 -24789 2903 32967 32554 11775 8290 1466 18688 25935 6726
8448 6726 1300 -9595 1908 7587 5226 -290 888 -17866 -35686 -26785 -33889 -25761 -20916 -32138
8434 -32138 -26515 -20264 2546 8713 7760 8604 -7559 -25279 3875 12432 11349 6298 -4070 -3132
8420 -3132 -12017 -19340 -22962 -1745 24573 2279 4815 9322 3574 6353 22612 21379 3305 -35697
8406 -35697 -41357 -29741 -24961 -12323 2715 -4324 -2440 16 3017 -8671 -38065 -36251 -18672
8393 -18672 -9565 -24170 -21855 1550 10969 5334 -4072 -4193 -9823 -12234 -8801 -14266 -19882 -19943 -9535
8378 -9535 -14505 -14589 -17675 -15150 -29296 -29983 -7868 5001 1179 -22929 -23998 494 16049 22244
$$ packed form
8475B9489j6743j4626K3284J2394o318l4211k38P797l657j0376J9309J131O6J959
8461I260l04J5626j9885k9486K7692L0064m13k0779l485o824J7222P247j9209
8448F726n426j0895J1503N679k361n516J178j8754j7820Q901p104Q128M845j1222
8434c2138N623O251K2810O167r53Q44j6163j7720K9154Q557j083n051j0368R38
8420c132q885p323l622K1217K6318k2294K536M507n748K779J6259j233j8074l9002
8406c5697n660J1616M780J2638J5038p039J884K456L001j1688k9394J814J7579
8393a8672R107j4605K315K3405R419n635r406j21n630k411L433n465n616o1J0408
8378i535m970q4l086K525j4146o87K2115J2869l822k4108j069K4492J5555O195
$$ plain form
8364 22244 14843 16862 10599 13658 22215 15231 -1084 -5509 6263 -2664 -25561 -28889 -36633 -36686
8350 -36686 -9248 -5216 4793 4624 3343 -8585 -4321 -7615 -13599 12516 13820 1824 18276
8337 18276 32004 37946 35144 50584 58448 46038 37604 31122 29494 16064 -17735 -29136 -10849
8324 -10849 8485 6806 1648 -7747 -13435 -7315 4841 19960 21456 19435 12248 17837 26414 23639
8310 23639 15344 22277 26070 13638 -2430 -17289 -32111 -23194 -4515 -4586 2299 13670 26051
8297 26051 12938 -13840 -18670 978 4866 5031 7260 11926 10880 4238 6018 2873 13224 5258
8283 5258 -1026 -3504 -1160 12784 25026 8441 -2826 -7973 -11860 -29499 -34941 -28539 -6413
8270 -6413 -13089 2532 5054 525 -2532 -1670 -6314 -11657 -12017 -16986 -11803 -1259 13728 2903
$$ packed form
8364B2244p401K019o263L059Q557o984j6315m425J1772q927k2897l328p744n3
8350c6686K7438M032J0009j69j281j1928M264l294n984K6115J304j1996J6452
8337A8276J3728N942k802J5440P864j2410q434o482j628j3430l3799j1401J8287
8324a0849J9334j679n158r395n688O120J2156J5119J496k021p187N589Q577k775
8310B3639q295O933L793j2432j6068j4859j4822Q917J8679p1O885J1371J2381
8297B6051j3113k6778m830J9648L888J65K229M666j046o642J780l145J0351p966
8283E258o284k478K344J3944J2242j6585j1267n147l887j7639n442O402K2126
8270f413o676J5621K522m529l057Q62m644n343l60m969N183J0544J4987j0825
$$ plain form
8256 2903 3896 13756 -3548 -5212 16212 22203 23033 4794 3164 -4486 -24376 -20631 -24307 -35621
8242 -35621 -32550 -11416 774 6981 4260 -16266 -22480 -28032 -17079 -20223 -35201 -28858 -35146
8229 -35146 -33579 -32220 -33521 -19769 -1678 14635 27786 45063 36683 32312 16825 2232 19835
8216 19835 28130 35265 21506 1456 -19934 -12268 6331 20622 25626 22547 16731 3299 -8201
8203 -8201 -4050 -7850 -7996 -1423 -6335 -14366 -21996 -35777 -21504 -26751 -33669 -24439 4532 13595
8189 13595 5214 4893 -3467 -7466 -6512 -2821 -807 9574 -349 -4307 -8179 -1277 -6969 -18116 -17834
8174 -17834 -8088 4149 -3037 -7479 -4936 -2339 10723 1794 -7983 -7402 10791 1475 -5275 -1549
8160 -1549 15467 23899 25493 23122 33898 26186 7585 -2917 -13334 -8648 -1461 286 17529
$$ packed form
8256B903R93R860j7304j664K1424N991Q30j8239j630p650j9890L745l676j1314
8242c5621L071K1134J2190O207k721k0526o214n552J0953l144j4978O343o288
8229c5146J567J359j301J3752J8091J6313J3151J7277q380m371j5487j4593J7603
8216A9835Q295P135j3759k0050k1390P666J8599J4291N004l079n816j3432j1500
8203h201M151l800j46O573m912q031p630j3781J4273n247o918R230K8971R063
8189A3595q381l21q360l999R54L691K014J0381r923l958l872O902n692j1147K82
8174a7834R746J2237p186m442K543K597J3062q929r777N81J8193r316o750L726
8160a549J7016Q432J594k371J0776p712j8601j0502j0417M686P187J747J7243
$$ plain form
8147 17529 17997 13222 2158 -12623 12868 14705 -16610 -10627 4978 8576 5475 10985 24621
8134 24621 30735 26459 11695 23949 56167 69344 45260 12250 -17440 -22719 -14018 -18361 -28258
8121 -28258 -15163 -12665 -3522 12044 25293 21979 15173 20510 26194 25044 16741 19401 6981 3968
8107 3968 -1610 -2297 -313 5896 21193 36324 17868 6274 5604 -6772 -11112 11075 28719 14924
8093 14924 19707 30311 28950 28439 19670 30781 31239 27079 -195 -22157 -24116 -9700 9656 -1298
8079 -1298 -24011 -17434 -13449 -15912 -12040 -4132 4197 -9141 4986 15095 -2698 -6881 -13059 -7085
$$ packed form
8147A7529M68m775j1064j4781K5491J837l1315N983J5605L598l101N510J3636
8134B4621O114m276j4764J2254L2218J3177k4084l3010k9690n279Q701m343r897
8121b8258J3095K498R143J5566J3249l314o806N337N684j150q303K660j2420l013
8107C968n578o87J984O209J5297J5131j8456j1594o70j2376m340K2187J7644j3795
8093A4924M783J0604j361n11q769J1111M58m160k7274k1962j959J4416J9356j0954
8079a298k2713O577L985k463L872P908Q329j3338J4127J0109j7793m183o178N974
$$ [...]
##END NTUPLES=NMR SPECTRUM
##END=
