##TITLE=Analysis number 327007
Compound Code sb 01109
Book Reference 4
Project Code adrs
Chemist Name stores
##JCAMPDX= 6.0         $$ Bruker NMR JCAMP-DX V2.0
##DATA TYPE= NMR SPECTRUM
##DATA CLASS= NTUPLES
##ORIGIN= Bruker BioSpin GmbH
##OWNER= nmr
$$ XWIN-NMR		Version 3.5
$$ Wed Mar  7 13:52:01 2007 GMT Standard Time (UT+0h)  MAYBRIDGE\nmr@NMR_250MHZ
##.OBSERVE FREQUENCY= 250.131544655141
##.OBSERVE NUCLEUS= ^1H
##.ACQUISITION MODE= SIMULTANEOUS (DQD)
##.ACQUISITION SCHEME= undefined
##.AVERAGES= 16
##.DIGITISER RES= 18
##SPECTROMETER/DATA SYSTEM= dpx250
##.PULSE SEQUENCE= zg30
##.SOLVENT NAME= CDCl3
##.SHIFT REFERENCE= (INTERNAL, CDCl3, 0, 16.522)
##AUDIT TRAIL= $$ (NUMBER, WHEN, WHO, WHERE, WHAT)
$$ ##TITLE= Audit trail, XWIN-NMR		Version 3.5
$$ ##JCAMPDX= 5.01
$$ ##ORIGIN= Bruker BioSpin GmbH
$$ ##OWNER= nmr
$$ C:\u/data/dgb/nmr/ADRS/500/pdata/1/auditp.txt
$$ ##AUDIT TRAIL=  $$ (NUMBER, WHEN, WHO, WHERE, WHAT)
(   1,<2007-03-07 13:51:38.55 +000>,<MAYBRIDGE\nmr>,<NMR_250MHZ>,
      <created by zg, POWCHK disabled, PULCHK disabled
       configuration hash MD5:
       49 4B E0 1D 92 C2 6B 37 9F E6 65 BC 52 41 86 1D
       data hash MD5: 64K
       BD B6 CA 28 8E 3D A9 64 E9 6A 79 18 55 8C 01 DF>)
(   2,<2007-03-07 13:51:52.83 +000>,<MAYBRIDGE\nmr>,<NMR_250MHZ>,
      <Start of raw data processing
       ef LB = 0.3 FT_mod = 6 PKNL = 1 SI = 32K 
       data hash MD5: 32K
       6B 33 82 EF 0A A1 CD CC 8C 6B 46 08 27 4D A6 0F>)
(   3,<2007-03-07 13:51:54.49 +000>,<MAYBRIDGE\nmr>,<NMR_250MHZ>,
      <apk 
       data hash MD5: 32K
       62 E5 28 82 32 D0 84 03 67 38 7F 1C 71 E3 18 8C>)
(   4,<2007-03-07 13:51:55.17 +000>,<MAYBRIDGE\nmr>,<NMR_250MHZ>,
      <abs ABSG = 5 
       data hash MD5: 32K
       4B 95 EE 51 D3 6C FF E1 DD 97 25 2F A3 8D 72 C4>)
$$ ##END=
$$ 
$$ hash MD5
$$ FF 9B E5 F6 FA 07 F2 54 EB 29 FE B3 0F 8B 2B 15
##$RELAX= 
##$RELAX= 
##$RELAX= 
##$RELAX= 
##$RELAX= 
##$RELAX= 
##$RELAX= 
$$ Bruker specific parameters
$$ --------------------------
##$DU= <C:\u>
##$EXPNO= 500
##$NAME= <ADRS>
##$PROCNO= 1
##$TYPE= <nmr>
##$USER= <dgb>
##$AMP= (0..31)
100 100 100 100 100 100 100 100 100 100 100 100 100 100 100 100 100 100 
100 100 100 100 100 100 100 100 100 100 100 100 100 100 
##$AQSEQ= 0
##$AQ_mod= 3
##$AUNM= <au_zg>
##$AUTOPOS= <33 >
##$BF1= 250.13
##$BF2= 250.13
##$BF3= 250.13
##$BF4= 250.13
##$BF5= 500.13
##$BF6= 500.13
##$BF7= 500.13
##$BF8= 500.13
##$BYTORDA= 1
##$CFDGTYP= 0
##$CFRGTYP= 5
##$CHEMSTR= <none>
##$CNST= (0..31)
1 1 145 1 1 1 1 1 1 1 1 1 1 1 1 1 1 1 1 1 1 1 1 1 1 1 1 1 1 1 1 1 
##$CPDPRG= <>
##$CPDPRG1= <>
##$CPDPRG2= <>
##$CPDPRG3= <>
##$CPDPRG4= <mlev>
##$CPDPRG5= <mlev>
##$CPDPRG6= <mlev>
##$CPDPRG7= <mlev>
##$CPDPRG8= <mlev>
##$CPDPRGB= <>
##$CPDPRGT= <>
##$D= (0..31)
0 1 0 0 0 0 0 0 0 0.06 0 0 0 0 0 0 0.0002 0 0 0 0 0 0 0 0 0 0 0 0 0 0 
0 
##$DATE= 1173275497
##$DBL= (0..7)
120 120 120 120 120 120 120 120 
##$DBP= (0..7)
150 150 150 150 150 150 150 150 
##$DBP07= 0
##$DBPNAM0= <>
##$DBPNAM1= <>
$$ [...]
##$SUBNAM7= <"">
##$SUBNAM8= <"">
##$SUBNAM9= <"">
##$SW= 20.6930455092707
##$SWIBOX= (0..15)
0 0 3 0 0 0 0 0 0 0 0 0 0 0 0 0 
##$SW_h= 5175.983436853
##$TD= 65536
##$TD0= 1
##$TE= 683.16
##$TE2= 300
##$TE3= 300
##$TEG= 300
##$TL= (0..7)
0 120 120 120 120 120 120 120 
##$TP= (0..7)
150 150 150 150 150 150 150 150 
##$TP07= 0
##$TPNAME0= <>
##$TPNAME1= <>
##$TPNAME2= <>
##$TPNAME3= <>
##$TPNAME4= <>
##$TPNAME5= <>
##$TPNAME6= <>
##$TPNAME7= <>
##$TPOAL= (0..7)
0.5 0.5 0.5 0.5 0.5 0.5 0.5 0.5 
##$TPOFFS= (0..7)
0 0 0 0 0 0 0 0 
##$TUNHIN= 0
##$TUNHOUT= 0
##$TUNXOUT= 0
##$USERA1= <user>
##$USERA2= <user>
##$USERA3= <user>
##$USERA4= <user>
##$USERA5= <user>
##$V9= 5
##$VALIST= <valist>
##$VCLIST= <CCCCCCCCCCCCCCC>
##$VD= 0
##$VDLIST= <DDDDDDDDDDDDDDD>
##$VPLIST= <PPPPPPPPPPPPPPP>
##$VTLIST= <TTTTTTTTTTTTTTT>
##$WBST= 1024
##$WBSW= 4
##$XGAIN= (0..3)
0 0 0 0 
##$XL= 0
##$YL= 0
##$YMAX_a= 366177
##$YMIN_a= -428152
##$ZGOPTNS= <>
##$ZL1= 120
##$ZL2= 120
##$ZL3= 120
##$ZL4= 120
##$ABSF1= 16.522
##$ABSF2= -4.171173
##$ABSG= 5
##$ABSL= 3
##$ALPHA= 0
##$AQORDER= 0
##$ASSFAC= 0
##$ASSFACI= 0
##$ASSFACX= 0
##$ASSWID= 0
##$AUNMP= <proc_1d>
##$AZFE= 0.1
##$AZFW= 0.1
##$BCFW= 0
##$BC_mod= 0
##$BYTORDP= 0
##$COROFFS= 0
##$CY= 12.5
##$DATMOD= 1
##$DC= 0
##$DFILT= <>
##$DTYPP= 0
##$F1P= 14.0000005364418
##$F2P= -0.99999901652339
##$FCOR= 0.5
##$FTSIZE= 32768
##$FT_mod= 6
##$GAMMA= 0
##$GB= 0
##$INTBC= 1
##$INTSCL= 1
##$ISEN= 128
##$LB= 0.3
##$LEV0= 0
##$LPBIN= 0
##$MAXI= 10000
##$MC2= 0
##$MEAN= 0
##$ME_mod= 0
##$MI= 0
##$NCOEF= 0
##$NC_proc= -4
##$NLEV= 6
##$NOISF1= 0
##$NOISF2= 0
##$NSP= 0
##$NTH_PI= 0
##$NZP= 0
##$OFFSET= 16.522
##$PC= 1
##$PHC0= 236.3237
##$PHC1= -1.880434
##$PH_mod= 1
##$PKNL= yes
##$PPARMOD= 0
##$PSCAL= 4
##$PSIGN= 0
##$REVERSE= no
##$SF= 250.13
##$SI= 32768
##$SIGF1= 0
##$SIGF2= 0
##$SINO= 400
##$SIOLD= 32768
##$SREGLST= <1H.CDCl3>
##$SSB= 0
##$STSI= 32768
##$STSR= 0
##$SW_p= 5175.98343685301
##$SYMM= 0
##$S_DEV= 0
##$TDeff= 65536
##$TDoff= 0
##$TI= <Analysis number 999999
Compound Code 99
Book Reference 9
Project Code 9>
##$TILT= no
##$TM1= 0
##$TM2= 0
##$TOPLEV= 0
##$USERP1= <user>
##$USERP2= <user>
##$USERP3= <user>
##$USERP4= <user>
##$USERP5= <user>
##$WDW= 1
##$XDIM= 32768
##$YMAX_p= 499198820
##$YMIN_p= -113123
$$ End of Bruker specific parameters
$$ ---------------------------------
##NTUPLES= NMR SPECTRUM
##VAR_NAME=  FREQUENCY,     SPECTRUM/REAL,   SPECTRUM/IMAG
##SYMBOL=    X,             R,               I
##VAR_TYPE=  INDEPENDENT,   DEPENDENT,       DEPENDENT
##VAR_FORM=  AFFN,          ASDF,            ASDF
##VAR_DIM=   32768,         32768,           32768
##UNITS=     HZ,            ARBITRARY UNITS, ARBITRARY UNITS
##FACTOR=    0.157963299565203, 1,           1
##FIRST=     4132.6476996994, 0,             0
##LAST=      -1043.33573715361, 0,           0
##MIN=       -1043.33573715361, -113123,     0
##MAX=       4132.6476996994, 499198820,     0
$$ Real data points
##PAGE= N=1
##DATA TABLE= (X++(R..R)), XYDATA
$$ [...]
18219E7028j3721K2754M685k549q507K409j0360k3706M376J9533q420K903R619
18206E6044j0173K6028K8802L534k9286r45L151m498n398l5565J7558O1582M369
18193A15203l4144m3320j313J9044K3374Q512j716P325m170k6948j393q929j9187
18180C2338k0735J0407K5523J8524O282P355J38k4844r037J6435Q401J3300L7888
18167A21975n165j6151J8223L9509j623k8828K136J2806K5568P984k456J0017
18155A83995J3415M688j557m36j76K1485L4554L6965J5744Q131j180K4924L4097
18142C74649L3529K6938J8772J2073N6357O1150L9784M2614P8458M8789N9827
18131H52940N1112R1029J02797N9541R2085J40354J67936J71031J90027K42276
$$ y = [57028, 43307, 66061, 70746, 68197, 59690, 62099, 51739, 28033, 32409, 51942, 43522, 46425, 56044, 45871, 71899, 100701, 104235, 74949, 74004, 77155, 72657, 67259, 31694, 49252, 110834, 115203, 81059, 37739, 36426, 55470, 78844, 87356, 85640, 92965, 88795, 61847, 60454, 51525, 32338, 11603, 22010, 47533, 66057, 72339, 79694, 79832, 54988, 45951, 62386, 70787, 84087, 121975, 116810, 100659, 118882, 158391, 156768, 127940, 130076, 142882, 168450, 176434, 173978, 183995, 197410, 202098, 200541, 200105, 199929, 221414, 255968, 292933, 308677, 316808, 315628, 340552, 374649, 408178, 435116, 453888, 465961, 522318, 583468, 623252, 665866, 744324, 793113, 852940, 904052, 995081, 1097878, 1157419, 1249504, 1389858, 1557794, 1728825, 1918852, 2161128]
18121B161128K88169L34916M00399N01226O70496Q39289J080294J415894J932581
18112I624392K723281L866273N276287N288756K445414j678142m386989m429019
18104A8730253l281118k376890j863566j468361j207936q98620o33474m94105
18096F506183m39554m36923m46143m63274m73579m33651l54180l30999l00507
18087B827373k66699k35737j89284j66404j52781j08449q4225j16010p2594n0599
18077A384591n3859p838k6174p2152p5447p6531n6299m5614q6060o2627o7987
18066G54003j8725l3723l5673j6719q637l2887l8480k8981l5654m6272m6076J9989
18054D32165J8115k1851k8141j9806n1039l1535l0412K3462K1046J0579L864l1932
$$ y = [2161128, 2449297, 2784213, 3184612, 3685838, 4356334, 5195623, 6275917, 7691811, 9624392, 12347673, 16213946, 21490233, 26778989, 29224403, 27546261, 23159272, 18730253, 15449135, 13072245, 11208679, 9740318, 8532382, 7633762, 7000288, 6506183, 6066629, 5629706, 5183563, 4720289, 4246710, 3813059, 3458879, 3127880, 2827373, 2560674, 2324937, 2135653, 1969249, 1816468, 1708019, 1623794, 1507784, 1435190, 1384591, 1330732, 1322894, 1296720, 1224568, 1149121, 1072590, 1016291, 970677, 884617, 821990, 754003, 735278, 701555, 665882, 649163, 640526, 607639, 569159, 540178, 504524, 458252, 412176, 432165, 450280, 428429, 400288, 380482, 329443, 297908, 267496, 290958, 312004, 322583, 326447, 294515]
18042B94515m1950j3521R869k9748j979l1175K261J3489r202j7909r83l5306n432
18029A32929J3045P992K995j194N34l238l894J2862K1954J826l0062J087k5982
18016A30854k910J3831j5319j877R0k5357k2841m367J5596o165k831M242j0775
18003G2171K4376p87n666l855j0208O381N763K8130L0060J5973J2926k221J035
17990A74078J3628j1227j9864j1895K51N855k159k9996j2964N229K0631J3486
17978A45053j8849n489J8321J5535K062k2643n1205k2826M181Q924Q81r880n284
17965E8781j0724P949N894m938j0226j0735N551L0936Q093J102O806k0236N756
17952G4009j2207k0349M239K3686J1682l2814J2118K5458J7065k2218O89J1035
$$ y = [294515, 252565, 239044, 248913, 219165, 217186, 186011, 188272, 201761, 192559, 174650, 173667, 138361, 132929, 145974, 153966, 156961, 155767, 156301, 153063, 149169, 162031, 183985, 185811, 155749, 156836, 130854, 127944, 141775, 126456, 124579, 124669, 99312, 76471, 72104, 87700, 81535, 78704, 82946, 72171, 96547, 95760, 90094, 86239, 76031, 82412, 88175, 116305, 146365, 162338, 175264, 173043, 174078, 187706, 176479, 156615, 144720, 144971, 150826, 148667, 118671, 105707, 110936, 131567, 145053, 126204, 120715, 139036, 154571, 156633, 133990, 82785, 59959, 64140, 73064, 73945, 64065, 58781, 48057, 56006, 61900, 56962, 46736, 36001, 41552, 72488, 80581, 81683, 88489, 68253, 74009, 61802, 41453, 45692, 69378, 81060, 48246, 60364, 85822, 102887, 80669, 81358, 92393]
17940I2393J611J211r675r02J4107k4235m422K7139Q323K603p750l482O62R018
17926A06601q98n544k2323m6207k1843K9405L0279j6438R356k2651l2742J92L580
17913A0767K6338K7528j8049p591K1701K903j3920j6851l3791j7287K3060K8108
17901C2916J8014J9362n416j20J2506k5412l3957L227K2074M276j936p868J8687
17888E6353j5425N48P136k8014j142p309r287R340j3365j1452K8510q457k0836
17875a3400p355j3177J5412k849P886L1272J2463k293r429K6997J3983j4979L726
17862D8257K955o130k0418k7789M8206M6010j9227k2760K646J8929o071n921L6564
17849I5251j977m94P06j4963p632q114k6227j1359j730j974k512P338L648J567
$$ y = [92393, 94004, 95215, 85540, 84638, 98745, 74510, 70088, 97227, 105550, 108153, 100403, 96921, 97583, 106601, 105703, 100159, 77836, 31629, 9786, 39191, 69470, 53032, 62388, 39737, 6995, 7187, 10767, 37105, 64633, 46584, 38993, 60694, 63597, 49677, 32826, -965, -18252, 4808, 32916, 50930, 70292, 64876, 64756, 77262, 51850, 17893, 21120, 43194, 47470, 45534, 37666, 56353, 40928, 41476, 48612, 20598, 19456, 12147, 2860, 12200, -1165, -12617, 15893, 7436, -13400, -20755, -33932, -18520, -21369, -13483, 17789, 30252, 27959, 18530, 45527, 59510, 44531, 48257, 51212, 45082, 24664, -3125, 45081, 91091, 71864, 49104, 51750, 70679, 64608, 58687, 95251, 93274, 92780, 93486, 78523, 70891, 62777, 36550, 25191, 23461, 21487, 18975, 26313, 29961, 31528]
17835C1528K296j2555r354J0150P664K2362K4184K012m061k961m61l0870q13J6396
17821E5517J344R52j6472l304l891K8899J4374m565k5032P720J6406m002k0185
17808D7761l14o28L6999J7303R582L796K765J75K6429k0731m6697l0191L4555
17795H0804j6019l1200J1786k176k7420N109L2789O014j6069K872J0519q27L709
17782E9891j1172j62J1354J6271J338j522N683J407J5024K7232K3560j586j7274
17769A30044j821J3178q449q398j0532k8216j3215l03J2885M248K9421K2762L7638
17756A79242N299k4557k9556k0853l054J0346J4979O502j0869L429K7444Q870
17744A67222Q582j4565l7117j4661l0922l2203J5584N360L4558K4357J9190j0251
$$ y = [31528, 33824, 21269, 11915, 22065, 29729, 52091, 76275, 78287, 74226, 71265, 70804, 39934, 39121, 55517, 56861, 57813, 41341, 38037, 34146, 63045, 77419, 72854, 47822, 55542, 71948, 67946, 47761, 47447, 46819, 83818, 101121, 110703, 114499, 117264, 117439, 143868, 123137, 76440, 46249, 80804, 64785, 33585, 45371, 43195, 15775, 20884, 53673, 59687, 43618, 46490, 57009, 56182, 59891, 48719, 48557, 59911, 76182, 77520, 75998, 81681, 83088, 98112, 125344, 148904, 147318, 130044, 128223, 141401, 132952, 124554, 114022, 85806, 72591, 72288, 85173, 89421, 118842, 141604, 179242, 184541, 159984, 130428, 109575, 106521, 116867, 131846, 138348, 127479, 130908, 158352, 167222, 175804, 161239, 124122, 109461, 78539, 46336, 61920, 67280, 101838, 126195, 145385, 135134]
17732A35134k9109k4235k5123J1180J7615R256j0599K176J1257J0043K405p395
17720A02605P933J6578J0499K894N838n470K707j0503j3434N136j190J8538K61
17707A42392K659m942K2553J5592j3216j3442L986O855j8629O747n760m893k0014
17694A19888j0258K0766l103l9725l318J2531q865l312j8385M882l683N693r937
17681F3174j1351K510J6521p181j6643o448M1305J8121k0970r703K7165J308j3048
17668H4760K3294M287r681j169k503K0238L6127L7354J0706L9748P5086N9232
17656C77479L4360M305l9935m0079k4258n5112o826j6997l3713j6662R273l8172
17644A53663k4632j8902O506j0037n684L36j3592l5492k3454j152o172K3176J350
$$ y = [135134, 106025, 81790, 56667, 67847, 85462, 94718, 84119, 86295, 97552, 107595, 110000, 102605, 110538, 127116, 137615, 140509, 146347, 140877, 143584, 133081, 119647, 124783, 123593, 142131, 142392, 145051, 140109, 162662, 178254, 165038, 151596, 155582, 162437, 143808, 150555, 144795, 139902, 119888, 109630, 130396, 127293, 87568, 84250, 96781, 87916, 84604, 66219, 71101, 67418, 73111, 63174, 51823, 54333, 70854, 63673, 47030, 40582, 81887, 100008, 79038, 69335, 96500, 97808, 84760, 108054, 112341, 102660, 101491, 98988, 119226, 155353, 192707, 203413, 243161, 318247, 377479, 411839, 416144, 376209, 336130, 311872, 256760, 249934, 232937, 199224, 182562, 191835, 153663, 129031, 110129, 116635, 106598, 100914, 101250, 87658, 52166, 28712, 27560, 21388, 44564, 45914]
17631D5914l426K4753M338K3378Q232m3559j9912k776J6316P886n623M601j8731
17618D1391k6089J0680J8094J4900K1255K0604J4135K2152J3192Q121L8097N2675
17606B49207N6579M7257P9394N9497k2177m6848n0453n7600l9664k2274l0900
17595B22018m0798j6404j1923q130k8597j1228M539k9529l0563n924K0979J4115
17583G8555k3600k8852o569R824J7787j9914J0452P942P005j9438j3261K8857
17571D8788J7357K798r141k0044j3344j8226L160J2204L3382K5672j967K2685
17559A03324O5564J1986O66k9516J6373K0525k3768j6143O387r685P874L6209
17547A89796J5681l466M832Q234p633l7583l6542k5883J2075J2830o543K75j5969
$$ y = [45914, 42488, 67241, 71579, 94957, 103189, 59630, 39718, 36942, 53258, 61144, 55521, 60122, 41391, 15302, 25982, 44076, 58976, 80231, 100835, 114970, 137122, 150314, 158435, 196532, 249207, 305786, 353043, 432437, 491934, 469757, 422909, 372456, 314856, 275192, 252918, 222018, 181220, 164816, 152893, 144763, 116166, 104938, 109477, 79948, 49385, 43461, 64440, 78555, 54955, 26103, 19534, 29358, 47145, 27231, 37683, 45625, 52630, 33192, 19931, 48788, 66145, 68943, 59802, 39758, 26414, 8188, 11348, 23552, 56934, 82606, 80639, 103324, 168888, 180874, 181540, 152024, 168397, 188922, 165154, 149011, 155398, 145713, 153587, 189796, 205477, 202011, 206843, 215077, 207444, 169861, 133319, 107436, 119511, 132341, 125798, 126073, 110104]
17534A10104j4299j7555j8152j8299j5928J8565k23j8750K5585j4587l4192O320
17522H589K8769J5398j7339Q105j6514R888K4603J6553J2643K170j2857R100J4013
17509A03121J6046J1364K6581J8228K238j1897j1741l1524O443J748L561K0144
17497A54312N4638L0557N978J7486J5599m021k5015m2487J0500K0872L282k2439
17485B19262o4962p6173j9573K23o033K8037N940J8856o985J5490M269n731j6896
17472I5724k5125j7597l186J1339r363K8324P728j7521j3302j561l2782J9576
17460D2254J0834J5650j4216p942k0691p997J5316q983J543p384M31O492Q38L4673
17446F0818M4797K0501K8493K0482L3837J8916j858k09J5346J6754j6347l1845
$$ y = [110104, 95805, 78250, 60098, 41799, 25871, 44436, 44213, 25463, 51048, 36461, 2269, 8589, 37358, 52756, 35417, 43522, 27008, 36896, 61499, 78052, 90695, 92865, 80008, 89108, 103121, 119167, 130531, 157112, 175340, 177578, 165681, 153940, 122416, 128859, 130607, 134168, 154312, 208950, 239507, 245485, 262971, 278570, 274549, 249534, 207047, 217547, 238419, 241701, 219262, 154300, 78127, 58554, 58777, 52744, 80781, 86721, 105577, 98592, 114082, 118351, 112620, 95724, 70599, 53002, 49816, 61155, 51792, 80116, 87844, 70323, 57021, 55460, 22678, 42254, 53088, 68738, 54522, 46580, 25889, 17892, 33208, 24225, 25768, 18384, 18815, 25307, 26145, 60818, 105615, 126116, 154609, 175091, 208928, 227844, 225986, 225777, 241123, 257877, 241530, 209685]
17434B09685k8665k0835J04r826n787J4806k3141j8316j2931j4292j0857n977
17422G3968j7892J0530R00N48J7346K9413j4390k7924j054Q92j0867K4693J7266
17409A03429N658J1062j5264j7766j0651K495j4026j9440P705L8655o177k5503
17397F0177j5232o918K7555J5280j3642r144Q581n742k9004k3507J6611K2060
17385D7075J6638J3454n784l5022l427L5462Q1J084L5955q520j057Q201K598o234
17371A00504j6527L888q528r968P465J1424L2305K2267k6216r07J832l0381j3573
17358G3585K0839Q24q116q455J9272K8406R428l465J0231L1245m633j4885L952
17345A58228K4320J4556N256K9621J6531K9053L1689M1380M8000K5010J9057L8216
$$ y = [209685, 181020, 160185, 160289, 150463, 144676, 159482, 136341, 118025, 105094, 90802, 79945, 73968, 56076, 66606, 67506, 68054, 85400, 114813, 100423, 72499, 71445, 72337, 61470, 86163, 103429, 109087, 120149, 104885, 87119, 76468, 78963, 64937, 45497, 53202, 91857, 85680, 60177, 44945, 38027, 65582, 80862, 67220, 58076, 66657, 60915, 31911, 8404, 25015, 47075, 63713, 77167, 71383, 36361, 32934, 68396, 68477, 69561, 105516, 96996, 95939, 104140, 106738, 100504, 83977, 87865, 79337, 69369, 76834, 88258, 120563, 142830, 116614, 115707, 117539, 87158, 73585, 94424, 95248, 87132, 78677, 97949, 126355, 135783, 132318, 142549, 173794, 169161, 154276, 158228, 182548, 197104, 202360, 231981, 248512, 277565, 309254, 350634, 398634, 423644, 442701, 480917]
17333D80917M805K5740J0073k1922m3729l2746k6216l2562j0467L2975O9160O0764
17321E16792M4784K7806K3419O159J3216j4994l5078m5358j66m8694k5867j3598
17309D48421J6749K08k7287m3969k9033k678j3216m155J7771j244J7489l4l0685
17296C48337J8996K1902k21j2412m3786m613J167l0742j0913J1622J436O386r478
17283B97681j9311k532J6106j7757q649m886j0126L262J1579k1607J9876K0838
17271B84474l690j6539K6863J4403K6325K8245q387k2936j2364Q54j0290j4704
17259B92254J6004K3833L0644M3392J8710M244m712r964j237q044k3696j1101
17247C70327K8094L2553N6315L7658q63q527n743J8628N616J892Q175O773K0119
$$ y = [480917, 485722, 511462, 521535, 499613, 455884, 423138, 396922, 364360, 353893, 386868, 456028, 516792, 561576, 589382, 612801, 618960, 632176, 617182, 582104, 536746, 536580, 487886, 462019, 448421, 465170, 465378, 438091, 394122, 365089, 362411, 349195, 345040, 362811, 361567, 379056, 379022, 348337, 367333, 389235, 389014, 376602, 332816, 328203, 329370, 298628, 287715, 299337, 300773, 307159, 297681, 278370, 275838, 291944, 274187, 265538, 260652, 250526, 253788, 265367, 243760, 263636, 284474, 280784, 264245, 291108, 305511, 331836, 360081, 351694, 328758, 316394, 317248, 306958, 292254, 308258, 332091, 362735, 406127, 424837, 429081, 424369, 414405, 413168, 405124, 381428, 370327, 398421, 430974, 487289, 524947, 524084, 515557, 509814, 528442, 534058, 535950, 544125, 550898, 571017]
17234E71017M128J0716J6955J5499L5709J4842l1372K5567M0413K5926J6896K7924
17222G74220K9952K5698K9352M4999M2598L1285O247L8305Q0704N9433M5838M7545
17210A256176M0901L0700M3849P9955J03091J16859J25001J37623J49440J72902
17200B256497J58917J54127J26619R8525P3177M2582K4498Q1088J14652J29262
17190C259944J39506J57171J90308K28574K16818K69426L56673L69527M14829
17181E602776N01067O30551P47372Q74920J062666J301640J612318K109302K651210
17172A7093822L410690M467036N894214P844386R861425J0428762Q012597K701749
17164F9714681l415461p527222q662686p578136n956347m720101l758741l001688
$$ y = [571017, 575145, 585861, 602816, 618315, 654024, 668866, 637494, 663061, 703474, 729400, 746296, 774220, 804172, 829870, 859222, 904221, 946819, 978104, 984351, 1022656, 1103360, 1162793, 1208631, 1256176, 1297077, 1327777, 1371626, 1451581, 1554672, 1671531, 1796532, 1934155, 2083595, 2256497, 2415414, 2569541, 2696160, 2794685, 2867862, 2910444, 2934942, 3016030, 3130682, 3259944, 3399450, 3556621, 3746929, 3975503, 4192321, 4461747, 4818420, 5187947, 5602776, 6103843, 6734394, 7481766, 8356686, 9419352, 10720992, 12333310, 14442612, 17093822, 20504512, 24971548, 30865762, 38710148, 48571573, 59000335, 67012932, 69714681, 66299220, 58771998, 50109312, 42531176, 36574829, 31854728, 28095987, 25094299]
17156B5094299k363322j760517j353064j190254j136211j169467j175520j134018
17148A3811926j009451q48563p25421o40841o00381n11683m19977l68253l10936
17139H376420k58361j69764o8377j3288N0501O8812P6830Q8005J23034K14045
17129H487857L18009M37526N98015P60958R20893J124642J407834J780394K272840
17120A8108968K964881L820656M985196O641062Q950340J1585561J2878632J0785705
17112H0721001M942573k704702q557025j0769992r919274p916094o230815n015260
17104C4550412m035347l195327k488507k005615j751183j630701j635136j632839
17096A6175757j555307j431203j278965j155548r77335q44232p29585n86017n10154
$$ y = [25094299, 22730977, 20970460, 19617396, 18427142, 17290931, 16121464, 14945944, 13811926, 12802475, 11953912, 11228491, 10587650, 9987269, 9475586, 9055609, 8687356, 8376420, 8118059, 7948295, 7879918, 7866630, 7917131, 7985943, 8062773, 8150778, 8273812, 8487857, 8805866, 9243392, 9841407, 10602365, 11523258, 12647900, 14055734, 15836128, 18108968, 21073849, 24894505, 29879701, 36520763, 45471103, 57056664, 69935296, 80721001, 85663574, 82958872, 74401847, 63631855, 53712581, 45796487, 39565672, 34550412, 30515065, 27319738, 24831231, 22825616, 21074433, 19443732, 17808596, 16175757, 14620450, 13189247, 11910282, 10754734, 9777399, 8933167, 8203582, 7617565, 7107411]
17087G107411m43256l70608l04588k45886k16970j99840k09554k45646k34161
17078D636902k48764k47016k49025k35603j75398j58846j36749j45888j42167
17069B897446j55887j43097j10942j00552r0328r5986q6437r1837r4875p0090
17059A857415m5114p8205p5381l0169k2090l2589n9390n1118l9642k9162k5124
17048A369431q060k3323J736o3370l2604j6606l9864l806L943j5637j2621j4374
17036A144845l4385l2780l1172m877O207l0852n1804Q026J3221j0241m4607p0352
17024H61229l1810K4315J4710P295K3383j260k6242Q247K9144L945l2428j5136
17012H65392j9728k6516j9684k1686J0547K1711Q179J5405K8638J0913M436j4562
$$ y = [7107411, 6664155, 6293547, 5988959, 5743073, 5526103, 5326263, 5116709, 4871063, 4636902, 4388138, 4141122, 3892097, 3656494, 3481096, 3322250, 3185501, 3039613, 2897446, 2741559, 2598462, 2487520, 2386968, 2296640, 2200654, 2114217, 2022380, 1927505, 1857415, 1812301, 1734096, 1658715, 1628546, 1606456, 1573867, 1514477, 1463359, 1423717, 1394555, 1369431, 1361371, 1338048, 1339784, 1276414, 1243810, 1227204, 1187340, 1183534, 1187477, 1171840, 1159219, 1144845, 1110460, 1077680, 1046508, 1041631, 1047838, 1016986, 965182, 973208, 986429, 976188, 931581, 861229, 829419, 853734, 868444, 875739, 899122, 897862, 871620, 879867, 909011, 912956, 880528, 865392, 845664, 819148, 799464, 777778, 788325, 810036, 818215, 833620, 862258, 873171, 877607, 863045]
17000H63045J503J1551L7173n574k2470j6920M000j032l3263k8830j9548k5841
16988G63794Q641K6640L7707K2154L245k3160k6054j1196J6948R919q692p791
16976H12155j4601J4176J6841o626r626O302L4145K3389L3746J0502K7634M8519
16964I96556K9765J8362K388P289k7158k8385k5048k7542m580J0526L5509L9928
16952A027610N2722K8961P967Q67L852J8922J3408K368n4151o4434k7586k7827
16940I82679l5727k2433J4335K8175R449L0864q934k8908R089J8611k143o784
16928I88273N717K4236o835j9900R455q525K2404L7772M6452O0636J0765N511
16916A175961M0854L7819M0538L3277O2997L4151K9043L6590M2588k632j2392
$$ y = [863045, 864548, 876099, 913272, 907698, 885228, 868308, 872308, 871276, 838013, 809183, 789635, 763794, 772435, 799075, 836782, 858936, 862181, 839021, 812967, 801771, 818719, 828638, 819946, 812155, 797554, 811730, 828571, 821945, 812319, 818621, 852766, 876155, 909901, 920403, 948037, 996556, 1026321, 1044683, 1047071, 1054360, 1027202, 998817, 973769, 946227, 941647, 952173, 987682, 1027610, 1080332, 1109293, 1117260, 1118127, 1121979, 1140901, 1154309, 1156677, 1102526, 1038092, 1010506, 982679, 946952, 924519, 938854, 967029, 976478, 1007342, 998408, 969500, 978589, 997200, 995057, 988273, 993990, 1018226, 1011391, 991491, 1000946, 992421, 1014825, 1052597, 1099049, 1159685, 1170450, 1175961, 1216815, 1254634, 1295172, 1328449, 1391446, 1425597, 1454640, 1491230, 1533818, 1531186, 1518794]
16905A518794k3510j9744j1471O181J3539j0259J7017K2225K3563M8164L2263
16894A616762J5166K2504N1388L8853J9154J8190M0607N0317N8437N8234R4490
16883B084102O1244O6685Q2168O6318P2743R9441J20236R4627R0482R8702J31334
16872C068082J90716J88775J94045K41659K78853K74673L14773L21024L85819
16863E458419M48085M86198N00550N36093O46263P41723Q23148R39098J147790
16854A1727367J380657J672949K133645K737867L541384M663938O042262P564815
16846D1464884Q639928Q649524P115856L995953J52681l261226n299551n784440
16838E5673609n085131l740764k229641p33009P38274K343011M145890O114273
$$ y = [1518794, 1495284, 1475540, 1464069, 1470250, 1483789, 1473530, 1490547, 1512772, 1536335, 1584499, 1616762, 1631928, 1654432, 1705820, 1744673, 1763827, 1782017, 1822624, 1872941, 1931378, 1989612, 2084102, 2145346, 2212031, 2294199, 2360517, 2433260, 2532701, 2652937, 2747564, 2838046, 2936748, 3068082, 3258798, 3447573, 3641618, 3883277, 4162130, 4436803, 4751576, 5072600, 5458419, 5906504, 6392702, 6893252, 7429345, 8075608, 8817331, 9640479, 10579577, 11727367, 13108024, 14780973, 16914618, 19652485, 23193869, 27857807, 33900069, 41464884, 50104812, 58754336, 65870192, 69866145, 70018826, 66757600, 61458049, 55673609, 50588478, 46847714, 44618073, 43885064, 44623338, 46966349, 51112239, 57226512]
16830E7226512P934034Q865364Q154824N348824R92699l715346p421890r239646
16822F8145375r307155q217252o793486n412339m275142l363748k675483k197505
16814B5903265j948905j750208j650354j623110j585250j478365j343910j254163
16806A3269000j123566j021418r35304p92151o86194o17091n64926n08582m36485
16797F583283l85004l06755l09466l26599k59395k31605k56396j92832j50940
16788D164291j52393j52802j17029j23178j14102j19912r5485j18645j03478j18424
16778B948843j17423j12486o6973l8152j4624q3245j03185m7115l5050n9823m6950
16767B223817l6011j8579l0598l0391n3885j3352m1874k4201j3037l0414k3023
$$ y = [57226512, 65160546, 74025910, 82180734, 87529558, 88522257, 84806911, 77385021, 68145375, 58838220, 50620968, 43827482, 38415143, 34140001, 30776253, 28100770, 25903265, 23954360, 22204152, 20553798, 18930688, 17345438, 15867073, 14523163, 13269000, 12145434, 11124016, 10188712, 9396561, 8710367, 8093276, 7528350, 7019768, 6583283, 6198279, 5891524, 5582058, 5255459, 4996064, 4764459, 4508063, 4315231, 4164291, 4011898, 3859096, 3742067, 3618889, 3504787, 3384875, 3289390, 3170745, 3067267, 2948843, 2831420, 2718934, 2651961, 2613809, 2599185, 2515940, 2412755, 2365640, 2330590, 2270767, 2223817, 2187806, 2169227, 2138629, 2108238, 2054353, 2041001, 1999127, 1974926, 1961889, 1931475, 1908452]
16756A908452k995J7288k0263l5248l01L8964m050l2896J0896J5891j892R042
16744A902888Q291J7999L481K0579L9130L8541L0455N1891P6231N9074M8521R6982
16732B394063J00330P7471R5911J24924J27261J24013J32408J39087J48364J72502
16722C636334K33528K34446K71510K64780K82331L32078L78612M11351N20305
16713F565275O61402Q01953R79096J223600J461584J870257K388645L065240M065067
16704B3082119N476286O973443P540688N894943K036790k319964n039158n502644
16696C8142503m631239l461763k456164j623168q20804J5505Q12128J595408K547782
16687C0120188L704378M724846M729264K824370n35744l718068n253821n136076
$$ y = [1908452, 1905457, 1922745, 1902482, 1867234, 1866933, 1905897, 1901847, 1868951, 1879847, 1895738, 1893846, 1902888, 1911179, 1929178, 1932659, 1953238, 1992368, 2030909, 2061364, 2113255, 2189486, 2248560, 2297081, 2394063, 2494393, 2571864, 2667775, 2792699, 2919960, 3043973, 3176381, 3315468, 3463832, 3636334, 3869862, 4104308, 4375818, 4640598, 4922929, 5255007, 5633619, 6044970, 6565275, 7226677, 8028630, 9007726, 10231326, 11692910, 13563167, 15951812, 19017052, 23082119, 28558405, 35531848, 43072536, 48967479, 51004269, 48684305, 43645147, 38142503, 33511264, 30049501, 27593337, 25970169, 25149365, 25164870, 25976998, 27572406, 30120188, 33824566, 38549412, 43278676, 46103046, 45567302, 41849234, 36595413, 31459337]
16679C1459337m220393l329708k615891k058629j568768j227959r87929q92129
16671A4557931p83175p23229o78672o22897n48113m15285l23199k34391j62779
16662A0066191n8563O7280J75002L15658M93449P05397R53309J218925J616645
16653A5553293K140814K867783L923138N118495N789288M955894K234994j303285
16645D1280414l870497m614914m041966l070223k171399j499732q36179j96629
16637B0978875M22928J097972J883750K825524L715059L956567K786882J58310
16629C7825867k646871m309897m488291l780297k946548k364916j894866j490038
16621A3904143j195898r69676q24398p73052p44069p18539o98349o55287n84047
$$ y = [31459337, 27238944, 23909236, 21293345, 19234716, 17665948, 16437989, 15450060, 14557931, 13774756, 13051527, 12372855, 11749958, 11201845, 10786560, 10463361, 10228970, 10066191, 10007628, 10074908, 10249910, 10565568, 11059017, 11764414, 12717723, 13936648, 15553293, 17694107, 20561890, 24485028, 29603523, 35392811, 40348705, 42583699, 41280414, 37409917, 32795003, 28753037, 25682814, 23511415, 22011683, 21175504, 20978875, 21401803, 22499775, 24383525, 27209049, 30924108, 34880675, 37667557, 37825867, 35178996, 30869099, 26380808, 22600511, 19653963, 17289047, 15394181, 13904143, 12708245, 11738569, 10914171, 10141119, 9397050, 8678511, 7980162, 7324875, 6740828]
16612F740828n66858n02562l98643l44053l24362k85754k15986j89112k02869
16603C710629k12987j93403j96438j67013j40143j30093q7470j00600j22046j14603
16593B245833j10495q2461p2139q9089m1900o3877q1585k5436n2808o9995j8660
16582A537388m702m6459m3946l7133m6314n6094m1569Q974J974k9819m0648n4193
16570A147459k0353j2511l0757m712k578l393o4082l1028k295r62l0573k8715
16558I15500m2394N027K6065k8767m7751q955j9922j5372m269J748k3496P274
16546G64688j6473j6091l9799M544J4138M550R70j8689M963n105q571m1892l1867
16533F15366j3607K1330J5897m12l602k7799j2706k44K4617M289j9758q121p376
$$ y = [6740828, 6173970, 5671408, 5272765, 4928712, 4604350, 4318596, 4102610, 3913498, 3710629, 3497642, 3304239, 3107801, 2940788, 2800645, 2670552, 2583082, 2482482, 2360436, 2245833, 2135338, 2052877, 1980738, 1891649, 1849749, 1785872, 1704287, 1678851, 1626043, 1556048, 1537388, 1532686, 1486227, 1442281, 1405148, 1358834, 1302740, 1261171, 1270145, 1272119, 1242300, 1201652, 1147459, 1127106, 1114595, 1083838, 1079126, 1076548, 1073155, 1009073, 978045, 975750, 974788, 944215, 915500, 873106, 878133, 904198, 875431, 827680, 818725, 798803, 783431, 779162, 780910, 757414, 764688, 748215, 732124, 692325, 696869, 711007, 715557, 716527, 697838, 702801, 697696, 689125, 647233, 615366, 601759, 623089, 638986, 638574, 634972, 607173, 594467, 594223, 618840, 623129, 603371, 595250, 587874]
16520E87874J9508N130k1822j7439j435r978Q975K9009l0614o711k020k9411j6464
16507E14602Q831m112q131q1P026k1801j5241q539j6675j7511J2204J1453l1072
16494D30953j6105j0738j150k8094k4430p530K8708K4845m404L6993K941j31Q242
16481D40100j5706l8835j2770J4539j0545l9930l89k3172O26K6292q921j8010
16469C13279L314O160p883l0093J3947K7902K3402P033J8139J2614l979k4325
16457C59510o273j6074m611o12J2765k9089k3594j3420m2849j8080L6740O626
16445B61039j4287n602L0626L3492K0029K199m568j4144P705N005k0253k577p640
16432B91024j03l166k092j9279j5502J8298K7329P160k1636j1752J0618j6173
$$ y = [587874, 607382, 612512, 590690, 573251, 571816, 561838, 570813, 599822, 569208, 562497, 560477, 531066, 514602, 523433, 519321, 511190, 511109, 518135, 496334, 481093, 472554, 455879, 438368, 450572, 462025, 430953, 414848, 404110, 402960, 374866, 350436, 342906, 371614, 396459, 392055, 429048, 431989, 431858, 440100, 424394, 385559, 372789, 387328, 376783, 336853, 336464, 313292, 313918, 340210, 331289, 313279, 316593, 322753, 314870, 284777, 298724, 326626, 350028, 357061, 375200, 387814, 383835, 359510, 353237, 337163, 332552, 331940, 344705, 315616, 292022, 278602, 235753, 217673, 254413, 261039, 246752, 241150, 271776, 305268, 325297, 327496, 322928, 308784, 316489, 321494, 301241, 298664, 291024, 290921, 287755, 285663, 266384, 250882, 269180, 296509, 303669, 282033, 270281, 280899, 264726]
16420B64726m6159r95P723j990k6121j4903j380J4224K0268p095P812P53q203
16407B08660Q506m86k7311l375J4775L684J0530P358J974N12k709k7883P169J3310
16393B14714l731k642j8730k3834j2082J3457L3918j796j9748l345L7494n197
16381B08478P15l762l3824K2815L8105J5445l548R340j5578m9109j6093k2982
16369A50002L69K7480K5104r87K0408K1228J4697j1871O175J206K3264O150j0964
16356B72261M870J7939n011j7434J4978K8818N4332Q6579P9213M4737O484j2770
16344E74996j0639j8360j0053l0877m4527m2043k3086r897J1673K7844K3847J0232
16332D59110M8381L1714J6597M9851K6129k9508n5844p3214n1840m8643k0663
$$ y = [264726, 218567, 217572, 225295, 223305, 197184, 182281, 180901, 195125, 215393, 208298, 216110, 216863, 208660, 217166, 216680, 189369, 185994, 200769, 204453, 214983, 222341, 224315, 224827, 222118, 194235, 201404, 214714, 210983, 208341, 189611, 165777, 153695, 167152, 201070, 199274, 179526, 176181, 213675, 208478, 209193, 205431, 171607, 194422, 232527, 247972, 244424, 253764, 238186, 189077, 172984, 150002, 150371, 177851, 202955, 201968, 222376, 243604, 258301, 246430, 252605, 253811, 277075, 283225, 272261, 277131, 295070, 290059, 272625, 287603, 316421, 370753, 457332, 536545, 581282, 587766, 574996, 564357, 545997, 535944, 505067, 460540, 418497, 395411, 385514, 397187, 425031, 448878, 459110, 507491, 539205, 555802, 605653, 631782, 602274, 546430, 473216, 421376, 372733, 352070]
16321C52070L756r87k0888j319k0190l9860r608j6613j7077l7386j1137m231J0144
16308A86674o649O475K6575O314o521K4471k729k4837j7460k4789j8738J3717
16296A62503L2385j7797j1704J2928J8806k1865j6507J1119j2517k211p509k719
16284A44912R600J2112k3749j4938J9014K6604P309j6800j2869K5205K1675k635
16272A95440j1279o708n358r307k6226K20J2928j1111j932j2564n445r6l879j4339
16258A00344P80Q173K5297K765K7172N994m029L318K1621J620l7249m925m903
16245A45978q724P744m039k1013k4322j0661r43p212J2147J8478J9420K14k6135
16232A00932J191j3424J2120J7469K3194l035k0788k7571O758K1804o256k3860
$$ y = [352070, 355826, 354839, 333951, 332632, 312442, 272582, 262974, 246361, 229284, 191898, 180761, 176530, 186674, 180025, 186500, 213075, 219389, 212868, 237339, 234610, 209773, 192313, 167524, 148786, 162503, 194888, 177091, 165387, 178315, 197121, 175256, 158749, 169868, 157351, 155140, 147631, 144912, 154512, 166624, 142875, 127937, 146951, 173555, 180864, 164064, 151195, 176400, 198075, 195440, 184161, 177453, 172095, 162788, 136562, 136782, 149710, 138599, 136667, 124103, 118658, 118562, 114683, 100344, 101124, 109297, 134594, 137359, 164531, 170525, 166496, 169814, 191435, 193055, 155806, 150881, 145978, 137254, 144998, 140959, 119946, 95624, 84963, 84020, 76808, 88955, 107433, 126853, 127067, 100932, 102123, 88699, 100819, 118288, 141482, 138447, 117659, 90088, 96846, 118650, 112394, 88534]
16220H8534j3101K4507K9011n042m0071K8026M6026R516k0446k3181N830K9346
16208A58955P198l515Q216O103J5092K6457J1233K3291M9971N3347M3665M2215
16196D42228L3418M4743P698k2176o7670p2829m1029m540j9050K1829n940m580
16184C12102k2358j357k3059J2357N3456L6011L760k282k8432j8927k9461j1453
16172B80357k6763k0330J2620j9799m1310J7755K3535K736N093j3584l4281k404
16160A83625j0711l7023j3221L3113J8598k4083j3287K601N295l439L1954K1386
16148A94808R469L650N596O328K5850K4636L7504K6257K5982o564j113J2767n532
16135C59638r257P148J9268K2281M6101P799l044k613j7473p841J8639j4783r958
$$ y = [88534, 75433, 99940, 128951, 123909, 83838, 111864, 157890, 167406, 146960, 123779, 129609, 158955, 166153, 162638, 170854, 176957, 192049, 218506, 229739, 253030, 303001, 356348, 400013, 442228, 475646, 520389, 528087, 505911, 438241, 365412, 324383, 319843, 300793, 322622, 316682, 312102, 289744, 288387, 265328, 277685, 331141, 367152, 370912, 368630, 340198, 321271, 291810, 280357, 253594, 233264, 245884, 226085, 184775, 202530, 226065, 228801, 233894, 220310, 186029, 183625, 172914, 135891, 122670, 155783, 174381, 150298, 137011, 139612, 144907, 141468, 173422, 194808, 204277, 207927, 213523, 219851, 245701, 270337, 307841, 334098, 360080, 353516, 352403, 365170, 359638, 350381, 357529, 376797, 399078, 445179, 452978, 449934, 447321, 429848, 422007, 440646, 425863, 415905]
16122D15905m5040m4772l7570k7006j9477k7404j2008j2511p020K927k6109m2211
16110A17704k0671L0684L5799J8899K3598j5720j0921k2689J9313j4801k2587
16099A38608N507k4377j0115l4915j2422J1195r123L5058K0264K6897L014O078
16087A55669m482j1313k7535k3391p237p374p079j988P83N41J5345K8155o680
16074A03414j9116j0565K368p524N689K9650L1393k402j1839k6776j0623O535
16062I0204L152J2374J0486r134k6577K434L463o259j836K8535J5788Q514k7600
16049A03544q433K347k0097j7716j669K2516L0878j515j0727j0193k0335m990
16037F3610q763L3741n767p992R967j7981O373O595r182J3566r531M73J709J8512
$$ y = [415905, 370865, 326093, 288523, 261517, 242040, 214636, 202628, 190117, 183097, 186024, 159915, 117704, 97033, 127717, 163516, 182415, 206013, 190293, 179372, 156683, 175996, 161195, 138608, 144115, 119738, 109623, 74708, 62286, 73481, 64358, 99416, 119680, 146577, 149591, 155669, 151187, 139874, 112339, 88948, 81711, 74337, 67258, 65270, 66053, 66594, 81939, 110094, 103414, 84298, 73733, 76101, 68577, 74266, 103916, 135309, 132907, 121068, 94292, 83669, 90204, 93356, 105730, 116216, 107082, 80505, 82939, 86402, 80143, 78307, 106842, 122630, 131144, 103544, 95111, 97458, 77361, 59645, 57976, 80492, 111370, 109855, 99128, 88935, 68600, 63610, 54847, 88588, 82821, 74829, 84796, 66815, 73188, 79783, 70601, 84167, 74636, 75109, 76818, 95330]
16023I5330j987l0568r273q985j4363n99J1158l653P129M000j578P98N05K1372
16009F9286L4436q421j4014r087k4775k986N367k5073K2101P2280j140J0016J610
15996A29600j7977k3675m142J1116Q910k4256j0878j1925K196R188P826o26k1360
15983E3997J0870R008N859j9231j3032o14J7409K8144o678L617l033k1924K4739
15970H9131j67l1314j0887N233J114P57J3269l134j8649J0101O597k6671m01j937
15956C3042p847J3185n126j1004n028M9796O120K4216J309k0732j6155J4470j5528
15943F0718R225M065J950n517k6474j6213J5715J1267K9072J9691k9180k4035
15931E0284n127J4823Q259p88J6040j9322j0279l634k0051k0239K7390p786k1229
$$ y = [95330, 93343, 62775, 53502, 44517, 30154, 29555, 40713, 37060, 44189, 48189, 46611, 47409, 47914, 69286, 103722, 95301, 81287, 72200, 47425, 44439, 49806, 24733, 46834, 119114, 117974, 127990, 129600, 111623, 87948, 83806, 94922, 103832, 79576, 68698, 56773, 58969, 68157, 75983, 75357, 53997, 64867, 73875, 79734, 60503, 47471, 46857, 64266, 92410, 85732, 89349, 86316, 64392, 89131, 88964, 57650, 46763, 51996, 53110, 53867, 67136, 64002, 45353, 55454, 62051, 35380, 34979, 33042, 25195, 38380, 33254, 22250, 17222, 67018, 73138, 97354, 98663, 77931, 61776, 76246, 60718, 69943, 74008, 75958, 70441, 43967, 27754, 43469, 54736, 83808, 103499, 74319, 50284, 45157, 59980, 68239, 67451, 83491, 64169, 53890, 50256, 30205, 9966, 37356, 29570, 8341]
15918H341m988l165L837M7661Q442k0820J1066k026o01L0924l318k1334j1994
15905D2025L509j9422n285k3039j65K0337J7840J8086j8379j9150l786J408J8284
15892C2263L122J7681j2949l803L8346N097j2248j4940j9888j9800K1993j5170
15880A9704J8912L3430q127p732P328R261R53k8876j246k638Q587j5590j8048
15867A5918J7263J2142j7707j0043P56j527K2527K5942m205j3288j1608j6368
15855A9802K1351K6723J7396j3710k5027J6025j123l5596L026R029o296j004k050
15842B8546K308l310k2850J4458K3184k2622o999R613J3772R548l2154k0719J8626
15829A1401n908J8721L2074j6426l2835k826R522R571o947l2337K864O409j4276
$$ y = [8341, 3353, 188, 4025, 51686, 60128, 39308, 50374, 48348, 47747, 78671, 75353, 54019, 42025, 45534, 26112, 20827, -2212, -2377, 17960, 35800, 53886, 35507, 16357, 12571, 13979, 32263, 35385, 53066, 40117, 36314, 74660, 79757, 67509, 52569, 32681, 12881, 34874, 19704, 38616, 72046, 63919, 56187, 63515, 72776, 73729, 44853, 43607, 40969, 49556, 33966, 15918, 33181, 45323, 27616, 17573, 18329, 16802, 39329, 65271, 61066, 47778, 36170, 19802, 41153, 67876, 85272, 71562, 46535, 62560, 61437, 25841, 28867, 37896, 31600, 30596, 28546, 30854, 27544, 4694, 19152, 42336, 19714, 12715, 22328, 36100, 45648, 13494, -7225, 11401, 5493, 24214, 56288, 39862, 7027, 4201, 13723, 23294, 16347, -15990, -13126, -6717, -20993]
15816b0993K5372L1619K4734j0846k833j9603J6321L7234k112k3886j4124L3423
15804G4306J3105j4786k0956M945k841J2719J4645r746k609j3304M86q460J2960
15791F0464K7701K997j1634j5174L9868Q850n4291j1038j4375r999J1670j086
15779C3953l920q639R60j7504L505p206J6382P908j8529K0729J4237R436J434
15766E2746M301J944J227K3097n171r911L472o674r19j1715O833j1770j9599J375
15752B9236O956J3058J6866k5688j1925k3432l378P404J2591p710j0983J0589
15740A3584K7688k1456j0954P738K8804M105k7951j7542J550N456J568R542k0194
15727A938j8660K1079K4848L946k5130K5697K4356l0165k5327k0996K46J2288
$$ y = [-20993, 4379, 35998, 60732, 49886, 47053, 27450, 43771, 81005, 78893, 55007, 40883, 74306, 87411, 72625, 51669, 56614, 53773, 66492, 81137, 71391, 68782, 55478, 55964, 47504, 60464, 88165, 91162, 79528, 64354, 104222, 113072, 58781, 47743, 33368, 23369, 35039, 33953, 30033, 21394, 22354, 4850, 8355, 1149, 17531, 25439, 6910, 27639, 41876, 51312, 52746, 57047, 58991, 60218, 83315, 78144, 68233, 71705, 65031, 64112, 52397, 59230, 47460, 27861, 29236, 36192, 49250, 66116, 40428, 28503, 5071, 1693, 9097, 21688, 13978, 2995, 13584, 41272, 19816, 8862, 16600, 45404, 49509, 21558, 4016, 5566, 11022, 12590, 22132, 1938, -16722, 4357, 29205, 33151, 8021, 33718, 58074, 27909, 2582, -18414, -18168, -5880]
15715e880q805J578J0310J6038J9897R283r120N003j4188K0405N724j1468o151
15702C2626j4959k4941J3674O068K4036l6991k4674L907J2691L8043N174j94j0868
15689B3592j116J4049j3763m2548O855J3920J2406r180j5430J1041J4676J1544
15677B6046k951L1866J876j2248j5448Q025Q882j5866k3875J7009k5192J578L669
15664C371P305P770j0544K175K6636r549K2032n999j733l513p167k1292j8831
15651i339J7661J5687J5493J6923j5176r602m0128q209M512J9817J0951k906k7782
15638a2098P226l038r414K0502j90J0590j1176j6415J4484o943o96j3319M065
15625a6422N8305L2803k5958O384j2442L187O346j7167k5185R621J6452R371p506
$$ y = [-5880, -14685, -13107, -2797, 13241, 33138, 42421, 33301, 38304, 24116, 44521, 50245, 38777, 32626, 17667, -7274, 6400, 12468, 36504, -487, -25161, -21254, -8563, 29480, 34654, 34460, 23592, 22476, 36525, 22762, -19786, -12931, 989, 13395, 4215, -11215, -174, 14502, 26046, 23095, 54961, 56837, 44589, 29141, 37166, 46048, 30182, 6307, 23316, -1876, -298, 3371, 10676, 18446, 7902, 10077, 36713, 27164, 49196, 43197, 41464, 37951, 30784, 9492, -9339, 8322, 24009, 39502, 56425, 41249, 31647, -8481, -16690, -12178, 7639, 18590, 15684, -12098, -4872, -7910, -17324, 3178, 2988, 13578, 2402, -14013, 471, -6472, -7168, -20487, -16422, 41883, 74686, 48728, 55112, 42670, 45857, 52203, 35036, 9851, 19472, 35924, 45295, 37789]
15612C7789m583R312p99m417r546M215J3351Q559l0983O365M404m239J0384r582
15598C0230K4700O236k2589k1976j9676m804K0052K9781o418N335l007j6278j14
15585B1472j0250N438J0668L428n82J5937K530k5153j2611O7l439k8929J4186
15572g238J224r822O961K2695r450k476N035j0423o629K1376j0159J5125m676
15559A1543r699J2089K6406j5733o303K3745k2489j2470K2447J2871n545J3201
15547E0063j0971j2790n532K3012k377l1910Q672J029j3210j7784J3893l5941
15535c3846k6629L3114K8946P257j2884k6428K7538J9250l6k150L0354O834j8965
15522C2355J8495J6459l5873j7963J021j1245J23L5815j2245j18Q469j240K4518
$$ y = [37789, 33206, 42518, 41719, 37302, 27756, 31971, 45322, 53881, 22898, 29263, 33667, 29428, 39812, 30230, 54930, 61166, 38577, 16601, -3075, -7879, 12173, 41954, 35536, 40871, 37864, 21586, 21472, 11222, 16660, 27328, 30756, 30174, 46111, 48641, 23488, 10877, 10944, 7505, -21424, -7238, -6014, -15836, -8875, 13820, 4370, 1894, 6929, -3494, -10123, 11253, 1094, 16219, 11543, 1844, 13933, 40339, 24606, 18303, 42048, 19559, 7089, 29536, 42407, 36862, 50063, 39092, 26302, 20770, 43782, 41405, 9495, 18167, 19196, 5986, -11798, 2095, -33846, -60475, -27361, 1585, 8842, -4042, -30470, -2932, 16318, 16282, 14132, 44486, 51320, 32355, 50850, 67309, 31436, 13473, 14494, 3249, 3372, 39187, 26942, 26824, 35293, 34053, 58571]
15509E8571J7883j3665k0289M193J2515k0294j3686L6236J4514l4203J6827r709
15497D8893k7879j9628k1026O736K2670P60p149l499Q502J9828M503j1268r053
15484A2390J6471N344J6911J0640j6097o56n771l8359n919J6281J1110j0846K233
15471A3732K5134O276l8090m667J3854J6828j577m034P889J3410o218l1190J1267
15458B2614k3636k2320L0625K2567l9971J3514k4116J6010K1349k5789o344k647
15446a8144p405Q468J4603N579j8652r818P299K5722R159j4739k0984J4739l421
15433g594J9622M106k7007M905R550p991j4432L1749p292l7215j1556K305l213
15420d4063n955K7059J3036p832J0379L08J6724j76L732J9109K1093M680j599
$$ y = [58571, 76454, 62789, 42500, 46693, 59208, 38914, 25228, 61464, 75978, 41775, 58602, 48893, 21014, 1386, -19640, -12904, 9766, 10526, 3377, -122, 8380, 28208, 32711, 21443, 12390, 28861, 34205, 51116, 61756, 45659, 45003, 39232, 873, -5046, 11235, 22345, 11499, 13732, 38866, 45142, 7052, 2385, 16239, 33067, 31490, 27456, 35345, 48755, 42537, 11347, 22614, -1022, -23342, 7283, 29850, -10121, 3393, -20723, -4713, 16636, -9153, -15497, -18144, -25549, -17081, -2478, 3101, -15551, -25369, -18070, 7652, 16811, 2072, -18912, -4173, -7594, 12028, 16134, -10873, -5968, 3582, -4409, -18841, 12908, 5616, -31599, -43155, -40850, -44063, -50018, -22959, -9923, -17755, -7376, -7068, 9656, 9480, 13212, 32321, 53414, 58094, 56495]
15407E6495l2758k1387m302K9229J4252k252q666q12P156m968j8803O177j123
15394A8238k8253P826J4318r28K4817j3294j8391n901J4321l757m4521n982j9874
15381f1381Q704J2927J5364R572K7543R380K3939J2301m040m712k9268k1776R240
15368G793n152o990J1839P359K4479n525l1669j0038P171p918r743L799K5627
15355A1032k0364j7524J4174M826J5311O992J2263J2467q527j2394J0958j1521
15343A7693k9142O114L154l959O692K1668K8984n226l323K2390L353k2233o553
15330C9612j8300j7343J0136k2205m094J6138J4465J0345l5078l171J2928k4829
15318b1396k758J6482K931L866j2843l2584K0583L6795j9578r063L908J2599J5596
$$ y = [56495, 23737, 2350, -1952, 27277, 41529, 39277, 30611, 29799, 36955, 31987, 13184, 19361, 18238, -10015, -2189, 12129, 11201, 36018, 22724, 4333, -1568, 12753, 8996, -35525, -41507, -61381, -52677, -39750, -24386, -14814, 12729, 22109, 46048, 58349, 54309, 49597, 20329, -1447, 7793, 2641, -4349, 7490, 14849, 39328, 33803, 2134, -7904, -733, -8651, -18394, -14595, 11032, -9332, -26856, -12682, -7856, 7455, 14447, 26710, 39177, 30650, 18256, 29214, 17693, -11449, -5335, -2181, -6140, 552, 22220, 51204, 45978, 42655, 65045, 68398, 46165, 39612, 21312, 3969, 14105, -8100, -12194, 3944, 18409, 28754, -6324, -9495, 3433, -21396, -24154, -7672, -4741, -875, -13718, -46302, -25719, 11076, -8502, -17565, -13657, -1058, 14538]
15305A4538J7662j4361r719p300j1792j4533J5130K8442J9156q582N18J6300k9161
15292A6298l614M699k1344M164j6655j4469K2522K4442K1369l2107k8800L6935
15280A3440L4453q258k0171l499j4614k6630J1830Q625R014O451M472O999J3080
15267C5192L941l6441l3774j0277j0373P548J9011K8058J1974J181o742q220j3629
15254a2551j469k893k1175p164K185J3560K2213J5837k22k2014J3366K7933J9317
15241D6923k897l1926k1129k4289k1963L4744M1808J4119k1271N819P919r442
15229A8415k1107p791k714k907R275J0180l695j5423q568J7035J3519j6835Q020
15216b596j7570P695K1605O717k4015r776J8737j0348j6671J2880K3103P799q356
$$ y = [14538, 32200, 17839, 8120, 820, -10972, -25505, -10375, 18067, 37223, 28641, 29159, 45459, 16298, 12684, 17383, -3961, 203, -16452, -30921, -8399, 16043, 37412, 5305, -23495, 13440, 47893, 39635, 19464, 15965, 1351, -25279, -13449, -4824, 4190, 10641, 15113, 22112, 35192, 39133, 2692, -31082, -41359, -51732, -44184, -25173, 2885, 14859, 16040, 9298, 1078, -12551, -14020, -16913, -38088, -45252, -43067, -29507, -7294, 8543, 8321, -13693, -327, 27606, 46923, 44026, 12100, -9029, -33318, -55281, -20537, 21271, 35390, 14119, 19938, 27857, 18415, -2692, -10483, -13197, -16104, -6829, 3351, -344, -15767, -24335, -7300, 6219, -10616, -2596, -20166, -12471, 9134, 15851, -8164, -17940, 797, -9551, -26222, -13342, 9761, 17560, 9204]
15203I204j2826K3643k0278l0943J5234K8659J0109j9166n368j769j620k147j2208
15190a9476L9859J5435K160k7195j4890J7195k475n887J8151n14j0384k120O733
15177A6592j585K281k633j5596j8910R647k105P841M934J9663j638k5821p215
15164a4545R979m688j087j4400K3246l229L04K813J527J8724n25k8517r575J0060
15150i913J6762N125J158j4677k8653J4604M1861N106j0158K0126j321J0929n167
15137D5782j2407k0139P285K5236j3953k2505N454k916K0142N136M762K397m259
15124D0015l8504j8529O51K1015K0877j964j2049k7728J265K8043M355l1287K3865
15111A0025J172l5266J4048J1364l7288j8008J0302J7223K3030K4107L399j5755
$$ y = [9204, -3622, 20021, -257, -31200, -15966, 12693, 22802, 3636, -1732, -3501, -5121, -7268, -19476, 20383, 35818, 37978, 10783, -4107, 13088, 10613, 4726, 22877, 22363, 11979, 9859, 16592, 15007, 17288, 14655, -941, -19851, -10204, -12309, -4468, 466, 20129, 18491, -7330, -14545, -4566, -9254, -10341, -24741, -1495, -4724, -4420, -1607, -80, 18644, 18119, -10398, -19973, -9913, 6849, 11974, 13132, -1545, -30198, -15594, 26267, 31373, 21215, 41341, 40020, 50949, 45782, 33375, 13236, 20521, 45757, 31804, 9299, 14753, 11837, 31979, 37115, 41877, 44274, 40015, 1511, -17018, -16367, 4648, 25525, 23561, 11512, -16216, -14951, 13092, 17447, -13840, 10025, 11197, -24069, -10021, 1343, -35945, -53953, -43651, -26428, -3398, 20709, 24108, 8353]
15099H353M0788K3182k2045l4176O318n633q02p910j4354J9865J2923J1825n641
15086C2693m6879k9798L0810K2541J4921o941j5678P136J4157K2503q471j8332
15074A8662L716J22J952j2914j0635L08m934J2559K758N795k9004k0122J1596
15061b0141J7124n778o469M006J0452N965j2735k5333L511j023P848j8615L5590
15048e598J6326L0642J1983m8344k1195J6275k848L438K2872K095j8989m48P943
15035A4152j6681q037Q282K5954J2117J1889l6786j3919L1112n256k6729j7619
15023b1521J3436M306L633J3036L232k4366o417L805k953J7474J6721j0572j5302
15010e488l222J6162K631k5792J9145m034J3983p955k9973k349K070r178K2897
$$ y = [8353, 49141, 72323, 50278, 16102, 22420, 16787, 15985, 8075, -6279, 13586, 26509, 38334, 32693, -14186, -43984, -13174, 9367, 24288, 17347, 1669, 8805, 22962, 45465, 36994, 18662, 22378, 22500, 24452, 11538, 903, 1211, -3723, 8836, 11594, 17389, -11615, -31737, -20141, -3017, -8795, -15264, -11258, -806, 5159, -7576, -32909, -29398, -30421, -22573, -41188, -5598, 10728, 41370, 53353, 5009, -16186, 89, -2759, 679, 23551, 25646, 6657, 6209, 14152, -2529, -10566, -2284, 23670, 35787, 47676, 10890, -3029, 28083, 22827, -3902, -21521, -8085, -3779, -146, 12890, 16122, -8244, -14661, -10856, -13809, 3665, 20386, 9814, -5488, -8710, 7452, 10083, -15709, 3436, -598, 13385, 5430, -24543, -26892, -24822, -34000, -11103]
14997a1103P732O247r428o273o178J7446N413J184J11N341M4519K791k7634k902
14983B7266l2991o458K324K4052J6931j6093j4513J0107Q892j7889K4155K9039
14971E4822m014j2686k6387J5326k750J2251k37J546j6670j4592N710k880N545
14958A4984j7835q845r001P819l592j6028k9069Q978J9043q98j3330M5236J3649
14945A1111l1489j01L3812N085l516k1740m504j2802J8250P218K0214j103l9286
14932a8851l31K2261o470j4509J9190R12O56J2232L8261J3041l8242k7125j2840
14919a1815m695J494J5160O785j4408K5443K2035K197p223k065j4882q159k6299
14906a6432j9680P487K5623L5n342j4502m378L3458P109k7676l362J1889l978
$$ y = [-11103, -3371, 2876, -6552, -12825, -19003, -1557, 3856, 5040, 5151, 10492, 55011, 57802, 30168, 27266, -5725, -12183, -9859, 14193, 31124, 15031, 518, 10625, 19517, 1628, 25783, 54822, 50808, 38122, 11735, 27061, 24311, 36562, 36325, 37871, 21201, 6609, 12319, 9439, 14984, -2851, -11696, -20697, -12878, -16470, -32498, -61567, -52589, -33546, -34444, -47774, -2538, 11111, -20378, -20479, 13333, 18418, 14902, -6838, -11342, -24144, -5894, 1324, 21538, 20435, -18851, -19182, 3079, -3391, -17900, 1290, 2202, 2858, 15090, 53351, 66392, 28150, 1025, -11815, -16510, -15016, 144, 6929, -7479, 17964, 39999, 42196, 34973, 32908, 18026, 9867, -16432, -36112, -28625, -3002, -2967, -8309, -22811, -27189, 6269, 13378, -14298, -17660, -5771, -9749]
14893i749k4323j5910J7719K8651M160k9311q550o81l457J0805K4221J2038j2249
14880f636k896l571j482n068K6419k2502O0K8783O698J8227J5970j2962j1447
14867B9593l958p297J2835j3092j7460q187L874K7401j9075j5109k2825J3276
14855b0024J6599M21N878j401K450j4263L522j3898J893J5718p185P892K054j7071
14841a7415N786M804j4589K752K8650p405p829o775j2984M634K337J6064K5597
14828B3627m973k6978r495r480q634L881K3203L2566N496J2819l4067n927N775
14815G813J1739J831N787k5777N14N867k7509q885K2200R748r773j6783j7647
14802d0875J1204K6598J456j5834o471j5451K5573J4398k3201J3702L211p40J3617
$$ y = [-9749, -34072, -49982, -32263, -3612, 548, -28763, -37313, -37994, -41451, -30646, -6425, 5613, -6636, -9532, -13103, -14585, -19653, 6766, -15736, -15676, 13107, 19805, 38032, 54002, 41040, 29593, 25635, 18338, 31173, 18081, 621, -7566, -3692, 23709, 4634, -10475, -33300, -20024, -3425, -3004, 2874, 1473, 3923, -10340, -6818, -20716, -18823, -3105, -10290, -2398, -344, -17415, -11629, -6825, -21414, -18662, 9988, 2583, -5246, -12021, -25005, -20371, -18034, -1970, 23627, 18654, -8324, -17819, -27299, -35933, -32052, -8849, 23717, 29213, 42032, 7965, 2038, 7813, 19552, 21383, 27170, 1393, 1907, 7774, -19735, -28620, -6420, 3328, -6445, -23228, -40875, -29671, -3073, -1617, -17451, -23922, -39373, -13800, 598, -22603, -8901, -5690, -6430, 7187]
14789G187o821Q434j4315J375j1168M530J2042l477k37J8383k5522j6864K2195
14776d258J5299O808r911O793N977k5318J010K225J8913j5409r139R922J7875
14763B0787j7633J5288o771j4143L49J0069j3709k5635O82K1429J6529J8151N160
14750C0553p772j2335j2309o871Q724j7575n334Q278K8386O474j3668p019j1246
14737a1714L659Q402j5647k1447K1890J2154O921m195q443k6811k348J2635K3412
14724a532K0734j6043l1865M855J4518J3174M266n330j9585j0310j1037R312M578
14711b4265l338k4792K3407K9811J611j3220M006k610l173O82j0988j3500R526
14698b6843K5354r398J6475N204j3313k000J861p705J707k1411j9346j8161K4748
$$ y = [7187, 366, 8800, -5515, -4140, -15308, -10778, 1264, -2213, -2450, 15933, -9589, -26453, -4258, 11041, 17849, 7938, 14731, 20708, -4610, -3600, -1375, 17538, 2129, -7010, 2912, 20787, 3154, 18442, 11671, -2472, -2123, 7946, -5763, -31398, -30716, -9287, 7242, 25393, 30553, 22781, 10446, -1863, -8734, -10, -17585, -22919, -14641, 13745, 20219, 6551, -468, -11714, -8055, 347, -15300, -36747, -14857, -2703, 4218, 23, -8420, -35231, -37579, -24944, -1532, 19202, 3159, -28706, -23851, -9333, 3841, 8107, 2777, -16808, -27118, -38155, -28843, -24265, -27603, -52395, -28988, 823, 2434, -10786, -6780, -9390, -12563, -11881, -22869, -36369, -26843, -1489, -10887, 5588, 10792, -2521, -4521, -2660, -10365, -8658, -30069, -49415, -67576, -42828]
14685d2828K1605J2220q918r053j0302j4699J4055K2284J1595o085r302k0923
14673d0351n804m14p241J8209K2077J3869J4786J5180l5219k9498o417J4600K2663
14660c560J3357l215j4779m356k8735Q890K2645N393q05K6509L0199M003m1508
14647A4038j7142k504M081q461p250L546R910J0763K549P105q725k5690K008j3418
14633b9190K811M1662K4726k1149m544P832k0504l1042m887j7167P006J8568J4880
14620a0998j0674J8772J6035j6394L9165j2246l9974k481O656Q961k2440l6892
14608f2510q200K6520R182p643M380P495K067N38l579p546J1427P577K7952K2934
14594C0594p846m1584k0925O152J6930K7658J2038j8715l2893P228K7186K2184
$$ y = [-42828, -21223, -9003, -17921, -26974, -37276, -51975, -37920, -15636, -4041, -10126, -19428, -40351, -46155, -46569, -53810, -35601, -13524, 345, 15131, 30311, -4908, -34406, -40823, -26223, -3560, 9797, 6582, -8197, -12553, -41288, -32398, -9753, -4360, -5165, 21344, 51543, 55546, 14038, -3104, -5608, -1527, -9988, -17238, -13692, -3782, 6981, 9530, 16635, 7910, -17780, -15772, -29190, -26379, 15283, 40009, 18860, 14316, 22148, 1644, -29398, -34285, -51452, -44446, -25878, -10998, -21672, -2900, 13135, -3259, 35906, 23660, -16314, -18795, -12139, -3178, -25618, -62510, -70710, -44190, -35008, -42651, -38271, -30776, -28709, -28171, -31750, -39296, -27869, -20292, 7660, 30594, 22748, -18836, -39761, -33609, -16679, 10979, 23017, 4302, -28591, -21363, 5823, 28007]
14582B8007J2033K6111j0732k9618j2244j1622r90Q699Q166j9648m8267J4045
14570c6060R962K008Q237Q451L248j1396m165P019M435R916J927k7797j5026K7160
14556a2081K2022k6389l3418K0368J3272N227R802n336j059N716j0898J406K3606
14543A2238O663j3893Q825K6546p35j5700k9831j256l663p194K512K365J2913
14530b10n851p244l5077J8764M8217j2331J5059K7282J0196Q119m1212j4285M162
14517A5589l629K073k9863k3703J5686J169q354J3134J0797K8041p778j1308K275
14504D129P823J8963j1192r892J3379o365k6579J002j9388j0679j3698o536L2013
14491b7020K5075O151j818l2234k6396O512J7743J7613J447Q774j559l200r736
$$ y = [28007, 40040, 66151, 55419, 25801, 13557, 1935, 945, 9644, 17810, -1838, -50105, -36060, -26098, -24090, -15853, -7402, -4154, -15550, -19715, -12696, -8261, 1655, 3582, -24215, -39241, -12081, 9941, -16448, -49866, -29498, -16226, -10999, -1197, -6533, -7592, -1876, -12774, -11368, 12238, 18901, 5008, 13833, 40379, 39644, 23944, -5887, -7143, -10806, -18000, -15488, -13123, -210, -6061, -13305, -48382, -29618, 18599, 6268, 21327, 48609, 58805, 66924, 25712, 11427, 15589, 11960, 14033, -15830, -39533, -23847, -22678, -31032, -17898, -7101, 20940, 13162, 1854, 4129, 11952, 30915, 19723, 9831, 23210, 16845, -9734, -8732, -28120, -38799, -52497, -59033, -27020, -1945, 4206, 2388, -29846, -56242, -49730, -31987, -14374, -12927, -4153, -5712, -8912, -18648]
14478a8648j6952n465K2649Q256K6439j9768j2358O65j051K7589K769j5827j4415
14465a6117j5471M341J7200P195j356j6992q391j0937k314J4794o661J4614j0894
14452c0989j7202k813n826k260K1228L5170k172P058o081J3336l236j2880k6408
14439c3075j8860M476R6K7199K803J6067J1930K456k4516j899K0321l675o681
14426c358J428l7290M881O177K1378N136N924k1587k7072P765L6630K9851j4743
14413A5120l7979o178k139K5017J2407o092J3664j6435k505j5595Q021J7127K550
14400F983J0616n383r296O377j4544K3003J606Q020J8071j262k945P885N528l136
14386E1523k0152k3483j266k6343j7176K6865R272P504K0987K2451q464k0045
$$ y = [-18648, -35600, -41065, -18416, -10160, 16279, -3489, -15847, -15182, -16233, 11356, 14125, -1702, -16117, -31588, -27247, -10047, -2852, -4208, -21200, -29591, -40528, -42842, -28048, -34709, -20095, -30989, -48191, -51004, -56830, -59090, -37862, -2692, -4864, 2194, -3887, 9449, 6213, -6667, -33075, -51935, -47459, -47363, -20164, -17361, -1294, 10636, 13092, -11424, -13323, 6998, 3323, -3358, -1930, -39220, -34339, -28162, -6784, -1648, 4276, -17311, -44383, -36618, 12, 29863, 15120, -22859, -29037, -31176, -6159, 6248, 156, 13820, -2615, -5120, -20715, -12694, 4433, 6983, 17599, 12216, 2920, 9297, -5247, 17756, 19362, 27382, 45453, 44191, 41246, 49131, 54659, 51523, 31371, 7888, 6622, -19721, -36897, -10032, -760, 6744, 27731, 50182, 41718, 21673]
14374B1673l3982j398J9884Q574J5930L403o244q151m572k0087p708P268J0770
14361E360J0343m522n949l1478l1044o381L3989M2413P470l6239n449K9741K2277
14348C0531k3169R751o168L000K3565P912J557k3052r949O485J9402r089l8634
14335g858j9374P949K2575q152K5464j78j4847J1187K5699j9529l1826k3831l286
14322c6007o90O230J6462M144J1285P534J2402J015J19J7030J6183j4736l9431
14309A540l6248p226J2589R637J5530O057l048r719J0328L000J3142K664j5170
14296C076L245j9196k0986J2673J6172j4710J0597n125J1878M467p29J644J2729
14283A5735j6427K2591r45l1519l952J1549j0106k725J0743K3340n969Q410K4265
$$ y = [21673, -12309, -13707, 6177, 14751, 30681, 34084, 27840, 19689, 15117, -4970, -12678, -5410, 5360, 15703, 11181, 5232, -26246, -57290, -63671, -29682, 12731, 20201, -16038, -21487, 8254, 30531, 7362, 17113, 10945, 13945, 37510, 45422, 46979, 23927, 13978, 20463, 39865, 30776, -7858, -27232, -19283, 3292, -4860, 20604, 20426, 5579, 16766, 42465, 22936, -8890, -32721, -36007, -36697, -30467, -14005, -9861, 1424, 8958, 21360, 22375, 22494, 39524, 55707, 40971, 1540, -34708, -41934, -29345, -19708, -4178, 1879, -1169, -10888, -560, 2440, 15582, 18246, 3076, 6321, -12875, -33861, -21188, -5016, -19726, -9129, -14254, -2376, 2091, 1362, 3006, 15735, -692, 21899, 20954, -10565, -14517, -2968, -13074, -15799, -5056, 18284, 12315, 20725, 44990]
14270D4990N129j1121q342n274k7061j6865k281j0004l073k277k2643N255K1929
14257c1638J5878K5282j5947j273Q581Q079J3705L4742l6865k1471k0129o575
14245b7631K0833O348N720j0004j3267l925k2497M223K0304Q311k960O590L017
14232d938k8420K869Q754j1225R8J9205K863k1991o296J4528J7357K533k500q342
14218a5505k2004L86J9325N52K0696P594j8846M631J9842j1227j1834J1472j8732
14205a3650l0139M8117J1311o066Q342o684O4j3947k1830k5834O813L7558L975
14192a970k6817j6764L5344j0515Q314N098r178j4496p064K5496L0879O005j0484
14179A3848Q944J2412K1649Q274j2677k5484j1112o248o367l694Q783J7299k2714
$$ y = [44990, 50119, 38998, 30656, 25382, -1679, -18544, -20825, -30829, -33902, -36179, -58822, -53567, -31638, -15760, 9522, -6425, -7698, 883, 8962, 22667, 57409, 20544, -927, -21056, -27631, -6798, -450, 5270, -4734, -18001, -21926, -44423, -40200, -19896, -11585, -14545, -7955, -4938, -33358, -30489, -21735, -32960, -32862, -13657, -10794, -32785, -39081, -24553, -7196, -4663, -7163, -15505, -37509, -37123, -17798, -17246, 3450, 11044, -7802, -3171, 16671, 5444, -6390, 5082, -13650, -43789, 4328, 15639, 9573, 17915, 11231, 11295, -2652, -24482, -50316, -43503, -5945, -1970, -28787, -45551, -10207, -20722, -12408, -7310, -16488, -30984, -38048, -12552, 18327, 24332, 13848, 22792, 35204, 56853, 65127, 52450, 26966, 15854, 9606, 3239, -455, 8328, 25627, 2913]
14166B913j4000L5804J3068l4073r939M486J5700J5803j143j4259n925o862k133
14153e60J3772K0213K51j2617j1060j2878K5901O847P842L619k860q546J0152
14140D0076J5697j2218j361n789j3377O505k85L642j2976j780p79Q687R599P155
14126D2796j2795j8578j1987r357r517K9101K5399O658k7097r424R481J2130J4934
14113D1744J608l17n0466k3116K5920N513j9126l02J4742K0026J3467n088m622
14100A9983J6013J1415k3725l2107l363R392l850M153L4056J3737p249j1057J0106
14087C7504k9507k9767k9125O189J4917J7746K4250J3189j0892j8860P866Q140
14075A1650K245k617p767k4245M261j1183j128L2115j5692j0530J7942L899L490
$$ y = [2913, -11087, 24717, 37785, 3712, -6227, -1741, 13959, 29762, 28619, 14360, 8435, 1573, -560, 13212, 33425, 33676, 21059, 9999, -2879, 23022, 29869, 37711, 41330, 38470, 29924, 40076, 55773, 43555, 42194, 36405, 23028, 29533, 29248, 32890, 19914, 18134, 17355, 26042, 35641, 42796, 30001, 11423, -564, -9921, -19438, 9663, 35062, 41720, 14623, 5199, 14680, 26810, 41744, 43352, 43035, -7431, -30547, -4627, 886, -18240, -18542, -3800, 16226, 29693, 24605, 19983, 35996, 47411, 23686, -8421, -11784, -2392, -6242, -2089, 31967, 45704, 38455, 27398, 37504, 7997, -21770, -50895, -44706, -29789, -12043, 12207, 25396, 14504, -4356, 3510, 11650, 13895, 11278, 3511, -20734, -16473, -27656, -28784, 3331, -12361, -22891, -4949, -1050, 2440]
14062B440J5494Q103j4720o201K0769k3953Q706J1014K0205J240l8497k3720K617
14049a6503J8768R887j2856k9087o850J8212m890j0645K2511P34m811J2625J9653
14036A6748j2032n784L6919J2217Q751k0581j7541r455j7017j4455J9777J8037
14024A5584k612O574J1511O990J559k4154j15J599k95M23Q027k059j4973J494
14010I553J1875L7975j0845o2614P349J3468j1739K6K6279Q366j6292K5024J5528
13997E3953k3878o600k899J0294L127j9350j695J3945K3151J2648K843j7014l0398
13984A8127K4755R94j1939k2265Q757J5196j985K291k5230k7246N619L2781l841
13971A6014j8126J3406K8867k0072K23K7227J745j4714Q523J3666J1618p33k1401
$$ y = [2440, 17934, 26037, 11317, 5116, 25885, 1932, 10638, 21652, 41857, 43097, 4600, -19120, -16503, 2265, 12152, -704, -29791, -36641, -18429, -23319, -33964, -11453, -10719, -15530, -2905, 16748, 4716, -1068, 35851, 48068, 56819, 36238, 18697, 9242, -7775, -22230, -2453, 15584, 12972, 19546, 31057, 38047, 39606, 15452, 15337, 16936, 16641, 17064, 25091, 23032, 8059, 9553, 21428, 59403, 48558, -14056, -6707, 6761, -4978, -4952, 21327, 29693, 13401, 38425, 53953, 30075, 23475, 20576, 30870, 33997, 14647, 12952, 26897, 50048, 62696, 65539, 48525, 18127, 42882, 43876, 31937, 9672, 18429, 33625, 31640, 33931, 8701, -18545, -12926, 19855, 16014, -2112, 11294, 40161, 20089, 20312, 47539, 49284, 34570, 43093, 56759, 68377, 67644, 46243]
13958D6243q642j0479j6575l348r944q273K4943L1612m517K237p074k2368q110
13945E705J5045J1856j3983m3529k850K0878j705J7474J6989k593O258k6592j8869
13932a5916n166N034R878j0257m700N847J1894Q531j4394O684K2882K0443k6000
13919A4760j8386j1142J32K1242r33l341l064q171J0262j2807J3363P192k1869
13906a2762K0282n386o870J4376J2891J0295j4242k026O819k2261l281K4891L984
13893B6710q880l5582r092O59P175K0680K1348j4313k3236K2624J7670p680k0121
13880b038Q727L3621J0133k987J4k4137j8189q055k7716J7256Q888j4824O034
13867a3273K1288N199o215o941K6981K611l9689l0288J7617K1875m61k943K059
$$ y = [46243, 37601, 27122, 10547, 7199, -2745, -11018, 13925, 45537, 41020, 43257, 36183, 13815, 5705, 20750, 32606, 18623, -24906, -27756, -6878, -8583, 8891, 25880, 23287, 29545, 2953, -15916, -21082, -16048, -6170, -16427, -21127, -15280, -3386, 5145, -9249, -2565, 20317, 40760, 14760, -3626, -14768, -14636, 6606, 5673, 2332, -732, -8903, 1359, -11448, 1915, 9107, -12762, 7520, 2134, -4736, 9640, 22531, 32826, 18584, 16558, 23377, 1116, -2165, 22726, 26710, 17830, -17752, -26844, -26185, -19010, 1670, 23018, 8705, -14531, 8093, 25763, 18083, -2038, 6689, 40310, 50443, 47456, 47470, 23333, 5144, -2911, -30627, -13371, -4483, -19307, -13273, 8015, 13214, 6999, 58, 27039, 29650, -10039, -40327, -22710, -835, -1296, -4239, -2180]
13854b180k2771l696Q241K0065K0000n925k0015J7372J796J1079M307p748L064
13841B3589q876p268J1814J0639J0008J2918l3017k0055K8055j4856k0208J0561
13829C304q363J3182J5900N200k260M414j6675Q048K8313o281R370K3819m752
13816G3219P69L1012j7774l0857k2806J1939R667q905n625l7710k809N533n550
13803A03J4397L3621Q532j3179m993k1535N434j3509J8765L935k7790k0713M1861
13790B4929K7224n58j1307l1909j5685J2121J3604l247L403M989l558o350J9363
13777C3019M84Q727j5284j980K660l7379p772K0074K1369o358k9447K3781k6792
13764a4898k059j589J1280R180P38K291j218K983L7661J8514J2428j5512k4897
$$ y = [-2180, -24951, -28647, -20406, -341, 19659, 13734, -6281, 11091, 12887, 23966, 28273, 20525, 23589, 14713, 7445, 19259, 29898, 39906, 52824, 19807, -248, 27807, 12951, -7257, 3304, -5059, 8123, 24023, 29223, 26963, 31377, 14702, 22750, 51063, 44782, 54152, 77971, 73219, 73988, 105000, 87226, 56369, 33563, 45502, 55169, 46264, 40639, 2929, 120, 5653, 103, 14500, 48121, 56653, 43474, 38481, 16946, 22380, 8871, 27636, 31571, 3781, -16932, 24929, 52153, 51595, 40288, 8379, -7306, 4815, 18419, 15172, 18575, 23564, 20006, 13656, 33019, 33503, 42230, 26946, 24966, 27626, -9753, -17525, 2549, 23918, 17560, -11887, 11894, -14898, -16957, -18546, -7266, 1914, 2652, 4943, 3725, 6708, 44369, 62883, 75311, 59799, 34902]
13751C4902j4009o461k1833J2453J6348K2034J5043o311l5424k6296p670J2609
13739d615L5702J8143l206j5246j4386j6813r920N19J962N023L1596J3869L224
13726D5852j8993O410j8465K4700k1887j732K4433k556j7867p742J259O177p979
13713A1610O457j222n103r178J801R264j3056M176J2907J2370M630L581n746o372
13699B6119q745k456k8581l179m873M4103K1887n233J5606j0198j4893k3889K894
13686H562K4355Q290J695p985K3689L920K468M305j4656J788K8440k0300n5792
13673H779o637J7536K7496K7331N956k026J8160k705m4604k5165M851j4039J4568
13660B9501J7724j940O469m65l365J5754j8290m1493k1927K2987J4677R971k772
$$ y = [34902, 20893, 14432, -7401, 5052, 21400, 43434, 58477, 52166, 16742, -9554, -17224, -4615, 31087, 49230, 46024, 30778, 16392, -421, -10341, -9822, -7860, -2837, 28759, 42628, 45852, 26859, 33269, 14804, 39504, 17617, 15885, 40318, 37762, 19895, 12153, 13412, 19589, 11610, 18067, 16845, 11742, 2564, 4365, 13629, 573, 4749, 17656, 30026, 34656, 38237, 32491, 26119, 17374, 14918, -13663, -16842, -21715, 22388, 44275, 39042, 54648, 44450, 29557, 5668, 8562, 32917, 41207, 42902, 34917, 58606, 62526, 64994, 69299, 54643, 56431, 84871, 64571, 8779, 2142, 19678, 47174, 74505, 80461, 78435, 96595, 93890, 49286, 24121, 28972, 14933, 29501, 47225, 45285, 51754, 51289, 47924, 63678, 45388, 3895, -18032, 4955, 19632, 29603, 26831]
13647B6831p385K6051K0237L958m8625j1786M812J6144J2413N389q031j2720J7143
13634D4431Q421R136j2652o109L685L550L56n762K521M1609j3479n430k412q283
13620E9582K1936J4099k2449j9975n13p697J1797j9670M199j5352j9084K6321
13608C3194N767j6755k947J2155M974j4820Q624J0912K501m689j3193j2668k0967
13595g912O64l038j957n837N693r215J922M0280K6229j7454j4175K8690Q220N127
13581E7237J843j1036j1031j2778n757J9459p007J8003J73N568p549r330K564
13568D0359r648j1160j8856j3284M93l532j0236K8513K4788k0552p515J9942J7054
13555C6366L2441K1785k38p705j4432P457P504K2022k1827j3856q340j2805L413
$$ y = [26831, 19446, 45497, 65734, 69692, 21067, 9281, 14093, 30237, 42650, 48039, 40008, 27288, 44431, 52852, 61988, 49336, 43227, 46912, 50462, 50818, 45056, 47577, 89186, 75707, 70277, 67865, 59582, 81518, 95617, 73168, 53193, 52680, 44983, 56780, 37110, 41309, 25957, 6873, 33194, 38961, 22206, 19259, 31414, 36388, 21568, 30192, 41104, 43605, 38916, 25723, 13055, -7912, -7248, -10286, -12243, -18080, -12387, -21602, -19680, 20600, 46829, 29375, 15200, 43890, 52110, 57237, 59080, 48044, 37013, 24235, 18478, 37937, 30930, 48933, 49106, 54674, 47125, 37795, 40359, 30711, 19551, 695, -12589, -12096, -15628, -25864, 2649, 27437, 6885, -630, 19312, 36366, 68807, 90592, 90354, 82649, 68217, 75674, 83178, 105200, 83373, 69517, 61177, 48372, 51785]
13542E1785k2751j0984K0783K3879p886j5203j9577J0715R249n993P026L0730
13530G1773J2059k4008m1598N285K5576J2141l1474J7319J2531n622k6852Q400
13518C5530K7796L0923j1985l1186l4457j7525j4535J9925J5883L1990K2429j7476
13506E7312m171k235m316k8954m039J3155L2158M967k0516r027k7846J307J8222
13493B6017K909J3960L3612J7693j8773p131j5283j0173K0728L1294j1137k5006
13481E8710j0457n054m214K453L3981O19j1625j1431L738L0308M581k1833q148
13468F1628o069K8072o651J455J6441N405M952j5254k6043J6731J6587j1650j5746
13455F9858k0118l4935k1287K7424K0424q417j1625p977Q858L3382K2643Q110
$$ y = [51785, 29034, 18050, 38833, 62712, 54826, 39623, 20046, 30761, 40010, 34017, 41043, 71773, 83832, 59824, 18226, 23511, 49087, 61228, 29754, 47073, 59604, 53982, 27130, 35530, 63326, 94249, 82264, 51078, 16621, -904, -15439, 4486, 20369, 52359, 74788, 57312, 53141, 50906, 46590, 17636, 13597, 26752, 58910, 63877, 43361, 34334, 6488, 7795, 26017, 28926, 42886, 76498, 94191, 75418, 68287, 53004, 42831, 63559, 94853, 83716, 58710, 48253, 43199, 38985, 41438, 75419, 76038, 64413, 52982, 56720, 87028, 91609, 69776, 61628, 55559, 83631, 76980, 78435, 94876, 100281, 105233, 89979, 63936, 80667, 97254, 85604, 69858, 49740, 14805, -6482, 20942, 41366, 32949, 21324, 13347, 22205, 55587, 78230, 86340]
13443H6340m017o945j0176K989r762L1627r225l0826r315L6122o775n554J2734
13430G7217K9938j7105k1949j141J1875P216j3309Q073K0536q709k2982k8949
13418D0711R769p99J4908K1473j8229k5487M652K7970R97N388K5839q573j1498
13405H7121o75Q263L424J0662j629j5700j3942m670k1666q815J1984P337J4763
13392G6457J9577J1759k3107p677K882J6987K0952K7955l348k4560j7942J0552
13380A10487J6636l6554k5513N398R489J4677R200R720N240j4351k8038j3507
13368F2884m1J6239K583P224k951j4303j2987K5284K0338j0906l135J6852k0557
13355H6524k3688L362L190j884M043q39K3430r932r677n110L2794J660j5329m
$$ y = [86340, 82323, 75378, 65202, 68191, 58429, 90056, 80831, 50005, 40690, 76812, 70037, 64483, 77217, 107155, 90050, 68101, 66960, 78835, 86051, 72742, 80815, 101351, 92642, 69660, 40711, 50480, 49681, 64589, 86062, 67833, 42346, 46998, 74968, 75965, 81353, 107192, 98619, 87121, 86446, 94709, 98133, 108795, 107166, 91466, 77524, 72854, 51188, 42373, 54357, 61694, 76457, 96034, 107793, 84686, 77009, 79891, 96878, 117830, 145785, 142437, 117877, 99935, 110487, 127123, 90569, 65056, 70454, 79943, 94620, 103820, 113540, 118780, 104429, 76391, 62884, 62843, 79082, 81665, 88889, 85938, 71635, 58648, 83932, 104270, 93364, 90229, 107081, 86524, 62836, 66198, 69388, 67504, 71547, 70708, 94138, 84206, 74529, 69419, 102213, 103873, 88544, 88540]
13341H8540n435K0274J2151J2627l916q743j0348Q38o859j1036J6667r573q808
13328H6379K7125J9419k6075k3718j9860j5798J7081K1979J2934p357n358J111
13316H7862k792N170J4779L654J6709k4946j5323J3311O013m0J9502q842P351
13303A22408l305R267j589J2470O576j3568q169j5334o899o042K042Q730j5702
13290I0885Q465J6561L1105j9279p097n885J548L711L3633k413j2480q68J0170
13277A48056J3671K2148K5849k3139j8821j8950k0514K1909J7205J6181j3480
13266A70115m943O319l514N32J48J9835Q171j6168K832J2190k3169m374L4223
13253B02197K1759K362l408k9827j5318q360k245r135N008K1262l015R440K8588
$$ y = [88540, 83105, 103379, 115530, 128157, 124241, 115498, 105150, 105988, 99129, 88093, 104760, 95187, 86379, 113504, 132923, 106848, 83130, 63270, 47472, 64553, 86532, 99466, 92109, 86751, 87862, 85070, 90240, 105019, 108673, 125382, 100436, 85113, 98424, 104437, 104397, 123899, 115057, 122408, 119103, 128370, 126781, 139251, 145827, 132259, 124090, 108756, 101857, 95815, 97857, 106587, 90885, 99350, 115911, 147016, 127737, 120640, 114755, 116303, 120014, 153647, 151234, 138754, 137886, 148056, 161727, 183875, 209724, 186585, 167764, 148814, 128300, 150209, 167414, 183595, 170115, 165172, 171491, 167977, 168509, 168657, 188492, 196663, 180495, 183327, 195517, 172348, 167974, 202197, 223956, 226318, 222910, 193083, 177765, 169405, 167160, 158025, 163033, 184295, 181280, 190720, 219308]
13240B19308n949r642J7541R5l8632J7786o48q268n840Q782P984J0445k4977k2947
13226A65038q744J6310J6969m231J1149K7926K7186J4947J092O436J5535l999
13214B85614o055K0284J7312J09k2862n226K5254L311j7072j6219M7445m126k8921
13201B98848J3447j979L704L3973P448j4990j0656m072k3405j5520j962L0106
13189C14942N7513j6936j4081n515k1602L3011M0112J1182j2691m3194j0810K8065
13177C59996O352M4181J3943k7166k0301R107K2210j0144j5687N659r100J8133
13165C97183q507L9453J4198K6318k1049m9870j6109r664K5627o933k4136K237
13153C68748K2348M681J9165J6126p009j2962J8012L0272L9182L1260L131J7474
$$ y = [219308, 213359, 203717, 221258, 221353, 182721, 200507, 199859, 191591, 185751, 194533, 202517, 212962, 187985, 165038, 156294, 172604, 189573, 185342, 196491, 224417, 251603, 266550, 267642, 274078, 289613, 285614, 279559, 299843, 317155, 317264, 294402, 289176, 314430, 317741, 300669, 284450, 331895, 327769, 298848, 312295, 310316, 314020, 347993, 355441, 340451, 329795, 325723, 302318, 286798, 284836, 314942, 372455, 355519, 341438, 335923, 314321, 347332, 387444, 398626, 385935, 342741, 331931, 359996, 366348, 410529, 424472, 397306, 377005, 386112, 408322, 398178, 382491, 388150, 379050, 397183, 388676, 428129, 442327, 468645, 447596, 397726, 381617, 371953, 397580, 390647, 366511, 368748, 391096, 395777, 414942, 431068, 424059, 411097, 429109, 459381, 498563, 529823, 532954, 550428]
13141E50428L9385N8097P818L4111Q2711O8073O8368J15263J41110J79991L10470
13130A655825L57048L93284L18959J22966j16835k68074l07919l35789k49977
13121A569488j82666j34820o5304q7751p9331n6452n8036n4918l8494m9440m2184
13110G20092l9253l7318m3041k2322J2837n3569k7196J0784l391k6237l6857l9927
13098D14602J7667p055r28J2585o979k5247M592Q888k5946l5860P373J2068J1708
13085C87468R319p830j7753P555J3681J3869L760M561p010L25J8649P158k0279
13072D13473j0110k1492k3049K4300M2210p440J3827j8915L626j1893O192Q06
13060D11535L848N514J9765K5320M820n145J760l193l0784j647J636J4222Q699
$$ y = [550428, 589813, 647910, 655728, 689839, 772550, 840623, 908991, 1024254, 1165364, 1345355, 1655825, 2012873, 2406157, 2725116, 2848082, 2731247, 2463173, 2155254, 1819465, 1569488, 1386822, 1252002, 1186698, 1098947, 1019616, 963164, 905128, 850210, 811716, 762276, 720092, 680839, 643521, 600480, 578158, 590995, 537426, 510230, 521014, 517623, 491386, 454529, 414602, 432269, 425214, 424286, 436871, 429892, 404645, 409237, 418125, 392179, 356319, 363692, 375760, 387468, 396787, 388957, 371204, 378759, 392440, 406309, 410069, 414630, 407620, 407945, 426594, 433752, 413473, 403363, 381871, 358822, 383122, 425332, 417892, 431719, 412804, 416430, 404537, 410729, 411535, 415383, 420897, 440662, 465982, 470802, 465657, 467417, 464224, 433440, 431793, 433429, 447651, 456350]
13047D56350L569n989J1257Q856k0337j1287l0181L4481L5791J4797J7415M564
13035E19286J9728j05k0594m7249J0561M9388N3651o680R390J544K150K6204L791
13022F21065Q838L9606L8906P082L5740J0022L9372P9530R4589J02139J29459
13011A206348J80370K40532L19230L79502M19893K98796J0748k45093l57884l21003
13001B131439k71194k07212j44904j23242q1077o4427o5432n1045q818o1925o5674
12990I86489k7325l6769p3154p9513n9469j6285k4990k3725r557L092j9063l4186
12978E85545o222j5814j0042J7406j3073r206J884L0277K8999j4630j2144k5213
12966E57767q417l223J736L139l753k2157k5833J6112L2681K7516K8476M7740
$$ y = [456350, 459919, 453930, 465187, 474043, 453706, 442419, 412238, 446719, 482510, 497307, 514722, 519286, 539014, 538909, 518315, 471066, 481627, 531015, 584666, 577986, 587376, 588920, 591070, 617274, 621065, 629903, 669509, 708415, 715497, 751237, 761259, 800631, 880161, 974750, 1076889, 1206348, 1386718, 1627250, 1946480, 2325982, 2745875, 3044671, 3055419, 2810326, 2452442, 2131439, 1860245, 1653033, 1508129, 1384887, 1303810, 1239383, 1173951, 1122906, 1114088, 1052163, 986489, 959164, 922395, 849241, 769728, 710259, 693974, 668984, 645259, 635702, 638794, 619731, 585545, 579323, 563509, 553467, 570873, 557800, 548594, 550478, 580755, 609754, 595124, 582980, 557767, 549350, 546127, 547863, 551002, 547249, 525092, 499259, 515371, 548052, 575568, 604044, 651784]
12954F51784r624j1005p573M4759J4680n20K4672M0237J3170J5975J8728K3175
12942H18458L3522O8799M0060J1980l916P964n3643l1738P794k5639p6755r6762
12930G00124M442J04376J42974J01303l1167q1868m4340k4247j8865j8527n0479
12919G83726l9726j7090j1179j0495J7749j7257K803j5625m2647k6089N360J6305
12907F45835K0001R579J701j6480m609j3886k0227q203K8162K0840p621j850m345
12894F48897L5248J5164q7j5846k2770K3522K2895K0939k6310J10R514k197j5607
12881F93472k765J1925K5299J0870K4983j3338O884K049K139k4021p032j1847
12869G18618m0555k0993j2615j9787J240M8731O3605N4044M4341K7041K5278J1945
$$ y = [651784, 642160, 631155, 623582, 668341, 683021, 682501, 707173, 747410, 760580, 776555, 795283, 818458, 851980, 920779, 960839, 972819, 968903, 976867, 923224, 891486, 899280, 873641, 796886, 700124, 704566, 808942, 951916, 1053219, 1022052, 940184, 895844, 871597, 852732, 834205, 783726, 744000, 726910, 715731, 705236, 722985, 705728, 708531, 692906, 650259, 624170, 629530, 645835, 665836, 675415, 677116, 660636, 656027, 642141, 621914, 613711, 641873, 662713, 655092, 653242, 648897, 684145, 699309, 699222, 683376, 660606, 684128, 707023, 727962, 701652, 701762, 711276, 709079, 693472, 690707, 702632, 727931, 738801, 763784, 750446, 757330, 759379, 761518, 737497, 730465, 718618, 678063, 657070, 644455, 624668, 625908, 674639, 738244, 792288, 836629, 863670, 888948, 900893]
12857I00893K3814K3200l1163k0599l595j3957k1722j3738m23K7410K2932M0184
12845I33236M1244L4380L317q336M999k2199j4938q53L7358P2776L8223L1566
12833A150773N4829N7831N1803K2073k656k779k0174J1981j5369K6061K9836J4186
12821A378395K9926J5229j3477O035K5288j832J6971J6186l8572o1080J8744J56232
12809A548045K30596J39569k7069K464R018l650J8834K1109k125j3196k3306o5055
12797A835234o1034J023J2206M0960K8276K4610J8867j792j055L2607K7516L5952
12785A993370N0976K9489j7651J3164N6478M7836K4879M1144N5591L0615J5144
12774B341035R495K557J6677O7940O6470N3544K7894M2693M0529M9163Q9466O4710
$$ y = [900893, 924707, 947907, 916744, 896145, 892550, 878593, 856871, 843133, 842710, 870120, 893052, 933236, 974480, 1008860, 1012177, 1003841, 1008840, 986641, 971703, 970850, 1008208, 1080984, 1119207, 1150773, 1205602, 1263433, 1315236, 1337309, 1334653, 1331874, 1311700, 1323681, 1308312, 1334373, 1364209, 1378395, 1408321, 1423550, 1410073, 1416108, 1441396, 1439564, 1456535, 1472721, 1434149, 1373069, 1391813, 1548045, 1778641, 1918210, 1891141, 1893605, 1902623, 1898973, 1917807, 1938916, 1936791, 1923595, 1900289, 1835234, 1774200, 1775223, 1787429, 1828389, 1856665, 1881275, 1900142, 1898350, 1897295, 1929902, 1957418, 1993370, 2044346, 2073835, 2056184, 2069348, 2125826, 2173662, 2198541, 2239685, 2295276, 2325891, 2341035, 2350530, 2353087, 2369764, 2437704, 2504174, 2557718, 2585612, 2628305, 2668834, 2717997, 2807463, 2872173]
12762B872173L4915L1132M5661O4410O2474N1973L8849M5219L6841N5705L8496
12751C377848N4493N4784N4415N1163P6706P8756Q6639Q2574J12985J45670J61731
12740D337764J95637J88259J93239K16165J67851J33679J16062J09570J20827
12731E779053Q9266J51624J70023K09733K22691K62243K98718L18111L99238N16782
12721H417482N42851M38864K98003J59786J01257J58359K62761L39837L57094
12712A1076294L44737L85182M70808M90340M78087N48121O17587O82481Q25285
12703A5918922R01545R72718J086451J220501J427969J632246J802307J990474
12695B6953133K219947K514182K909653L405718M003640M642918N311864N975582
$$ y = [2872173, 2907088, 2938220, 2983881, 3048291, 3110765, 3162738, 3201587, 3246806, 3283647, 3339352, 3377848, 3432341, 3487125, 3541540, 3592703, 3669409, 3748165, 3834804, 3917378, 4030363, 4176033, 4337764, 4533401, 4721660, 4914899, 5131064, 5298915, 5432594, 5548656, 5658226, 5779053, 5868319, 6019943, 6189966, 6399699, 6622390, 6884633, 7183351, 7501462, 7900700, 8417482, 8960333, 9399197, 9697200, 9856986, 9958243, 10116602, 10379363, 10719200, 11076294, 11421031, 11806213, 12277021, 12767361, 13245448, 13793569, 14411156, 15093637, 15918922, 16820467, 17793185, 18879636, 20100137, 21528106, 23160352, 24962659, 26953133, 29173080, 31687262, 34596915, 38002633, 42006273, 46649191, 51961055, 57936637]
12687E7936637O829478Q082257R985389J2747084J6410265K1234970K7696346
12680A60922426L6929086N0176112O5873788P4074708O1991953K7547428j7253124
12673D60262377n1093170o2972449n6671535m4082289l3999150k6779669k1028442
12666A63635673j6191429j2258179r683755q561545q525042r010181r437596r382811
12658H0585135q704640p645847o565016n587467m741153m040247l411967k992360
12650C6896438k649403k354495k081232j860830j683112j533433j452563j326772
12642B1954598j174063j054107r35637q51712p56309o30667n61572m83148m33269
12633A5074114m21966l70938l59394l54075l02726k67004k56024k93261l32224
$$ y = [57936637, 64766115, 72848372, 82833761, 95580845, 111991110, 133226080, 160922426, 197851512, 248027624, 313901412, 387976120, 449968073, 477515501, 460262377, 409169207, 346196758, 289525223, 245442934, 211443784, 184664115, 163635673, 147444244, 135186065, 125502310, 116940765, 108415723, 99405542, 89967946, 80585135, 71880495, 64234648, 57669632, 52082165, 47341012, 43300765, 39888798, 36896438, 34247035, 31892540, 29811308, 27950478, 26267366, 24733933, 23281370, 21954598, 20780535, 19726428, 18790791, 17939079, 17182770, 16552103, 15990531, 15507383, 15074114, 14652148, 14281210, 13921816, 13567741, 13265015, 12998011, 12741987, 12448726, 12116502]
12624A2116502l33116k82399k68323k75017k49447j84074j61489j48492j05244
12615A0108901q6472o9356q9548o9880k7608o0749n674M4986O2227L8470L6902
12604I882199L9439L8131J10395J46244J58865K20140K40441L02565L89225M26376
12594A1954020M29921L95505M02615L77759L45843L60845M20659M86735O03930
12585A5777832O96799Q35618R25029J045124J174168J317360J493570J693107
12577B4958607J868821K058432K331202K751881L374034M094287M742537N162371
12569E1342172N511950O100321P280897R283674J2084286J5642806K0226299K6295960
12561A53768365L5207411M8509747O6508551Q2017122P6264912L6922712j9770176
$$ y = [12116502, 11783386, 11500987, 11232664, 10957647, 10708200, 10524126, 10362637, 10214145, 10108901, 10022429, 9953073, 9863525, 9793645, 9766037, 9705288, 9699614, 9744600, 9806827, 9845297, 9882199, 9921638, 9959769, 10070164, 10216408, 10375273, 10595413, 10835854, 11138419, 11527644, 11954020, 12383941, 12779446, 13182061, 13559820, 13905663, 14266508, 14687167, 15173902, 15777832, 16474631, 17310249, 18235278, 19280402, 20454570, 21771930, 23265500, 24958607, 26827428, 28885860, 31217062, 33968943, 37342977, 41437264, 46179801, 51342172, 56854122, 62954443, 70235340, 79519014, 91603300, 107246106, 127472405, 153768365, 188975776, 237485523, 303994074, 386011196, 462276108, 499198820, 479428644]
12554D79428644o1393479p0889672n9022879m4501377l4238360k7398583k1943172
12547A60041122j6785903j2389466r666423q467919q255250q651579r187905r185462
12539G7451215q463337p440447o432528n490049m657439l946800l355273k951915
12531C4713427k626873k351232k075643j820252j677375j506523j398418j309923
12523A9947188j148973j036671r26368q19516p91063p35768o46678n69704m87052
12514A2785395m69230m85130m71360m32651m38248m18824l93174l72676l50352
12505H953750l09139k76992k69617k95933l17875k59706k87814k63320k17147
12496F456207j94776j69826j55191j48957j30139j06274q8143o2652n4305o1680
$$ y = [479428644, 418035165, 347145493, 288122614, 243621237, 209382877, 181984294, 160041122, 143255219, 130865753, 121199330, 112731411, 104476161, 95824582, 86636677, 77451215, 68987878, 61547431, 55114903, 49624854, 44967415, 41020615, 37665342, 34713427, 32086554, 29735322, 27659679, 25839427, 24162052, 22655529, 21257111, 19947188, 18798215, 17761544, 16835176, 16015660, 15224597, 14488829, 13842151, 13272447, 12785395, 12316165, 11831035, 11359675, 10927024, 10488776, 10069952, 9676778, 9304102, 8953750, 8644611, 8367619, 8098002, 7802069, 7484194, 7224488, 6936674, 6673354, 6456207, 6261431, 6091605, 5936414, 5787457, 5657318, 5551044, 5462901, 5400249, 5345944, 5284264]
12486E284264q5907p7938r7335j29643r6723n9273j14095r9270j16274r8782o2031
12475D246993n3143o6348q8177p6770o1873p1565o9514o3057m6936j5415k7369
12464C606826n4120o4387l8892m1773j6692l6731n2876l2221m6263p2802l9825
12453C110244k2164m5066o1487k5659k0820J3857R151j8749o6690l3789L736J607
12441B844171J2911Q595J0589K3606L206m040L309m709l8741j9690O2576J71777
12429C073560J15263J0240j01429j09626j07577q0083k7718k0331j7653j7224
12419B717422l2090m7900m3823k7844q299j3340o615k0962j5374j0169j8542j6874
12407B455590k6723l1661k0220j7571k4990n1099n5507j1624J756K0592L6281
$$ y = [5284264, 5198357, 5120419, 5023084, 4893441, 4796718, 4737445, 4623350, 4524080, 4407806, 4309024, 4246993, 4193850, 4127502, 4039325, 3962555, 3900682, 3829117, 3759603, 3696546, 3649610, 3634195, 3606826, 3552706, 3488319, 3449427, 3407654, 3390962, 3354231, 3301355, 3269134, 3222871, 3150069, 3110244, 3088080, 3043014, 2981527, 2955868, 2935048, 2948905, 2958056, 2939307, 2872617, 2838828, 2842564, 2844171, 2857082, 2865677, 2876266, 2899872, 2903078, 2899038, 2902347, 2897638, 2858897, 2839207, 2901783, 3073560, 3188823, 3199063, 3097634, 2988008, 2880431, 2800348, 2772630, 2752299, 2734646, 2717422, 2685332, 2637432, 2593609, 2565765, 2557466, 2544126, 2537511, 2516549, 2501175, 2491006, 2472464, 2455590, 2428867, 2397206, 2376986, 2359415, 2334425, 2283326, 2227819, 2216195, 2217951, 2238543, 2274824]
12396B274824O2441L0735K5499J0344k4930j6229O280J2829K3239J2243K9451
12385B446726J5760j8555m1243P838K157r656l4524j6621o211K3935J4330K761
12373B386697L4028L1578K4798J0887L2609K4527M4869O4760L8905L1369l5891
12362B689136J0319k517j4885j5806J003K4124q144j865Q015M4182J6921R11N67
12349B751961J8063N700l471N506q854K645J8662K1734J0560L328K6134L3188
12337B885156J0857K9201N6253K2345J3122J4602K8977K0875N997Q946K0706J555
12325C118592L2801L1045k2086O130M2696K2052K4482O7507L4621K2845M9973
12314C430658L3783P3771O6367O0981N5822M1729L2426L6234M6780M0883K3384
$$ y = [2274824, 2337265, 2368000, 2393499, 2403843, 2378913, 2362684, 2368964, 2381793, 2405032, 2417275, 2446726, 2462486, 2443931, 2402688, 2410526, 2412683, 2403027, 2368503, 2351882, 2345671, 2369606, 2383936, 2386697, 2420725, 2452303, 2477101, 2487988, 2520597, 2545124, 2589993, 2654753, 2693658, 2725027, 2689136, 2699455, 2696938, 2682053, 2666247, 2667250, 2691374, 2683230, 2681365, 2689380, 2733562, 2750483, 2751394, 2751961, 2770024, 2775724, 2772253, 2777759, 2768905, 2771550, 2790212, 2811946, 2822506, 2825834, 2851968, 2885156, 2896013, 2925214, 2981467, 3003812, 3016934, 3031536, 3060513, 3081388, 3087385, 3096331, 3117037, 3118592, 3151393, 3182438, 3160352, 3166482, 3209178, 3231230, 3255712, 3323219, 3357840, 3380685, 3430658, 3464441, 3538212, 3604579, 3665560, 3721382, 3763111, 3795537, 3831771, 3878551, 3919434, 3942818]
12303C942818O8460N2501N7967O8037L8263M2092N2079M9193L1401K0936M7679
12292D471426O5173O0259N2411P9888J04942O0514N6015N9158P9095J11234O3862
12281E263977L0250O3018R3546P5839P5800J06494R0836P0363J06925J17357J31294
12270F225699J00094J18367J04335R5971J19683J31366J30802J27614J13505J51501
12260G418937J72269J34470J36436J55993J49461J50060J72616J49894J86889
12251H827025K08725J77334J85742J99380J89077K10161K13851J98910K37899
12242A0648104K34402K31398K34789K43851K80340L19564L31993L33404L16169
12233A3174014L22058L55639L59038L81663L84972L98160M06757M47719M90277
$$ y = [3942818, 4011278, 4063779, 4121746, 4189783, 4228046, 4270138, 4322217, 4371410, 4402811, 4423747, 4471426, 4536599, 4596858, 4649269, 4729157, 4834099, 4894613, 4950628, 5009786, 5088881, 5200115, 5263977, 5294227, 5357245, 5450791, 5526630, 5602430, 5708924, 5799760, 5870123, 5977048, 6094405, 6225699, 6325793, 6444160, 6548495, 6644466, 6764149, 6895515, 7026317, 7153931, 7267436, 7418937, 7591206, 7725676, 7862112, 8018105, 8167566, 8317626, 8490242, 8640136, 8827025, 9035750, 9213084, 9398826, 9598206, 9787283, 9997444, 10211295, 10410205, 10648104, 10882506, 11113904, 11348693, 11592544, 11872884, 12192448, 12524441, 12857845, 13174014, 13496072, 13851711, 14210749, 14592412, 14977384, 15375544, 15782301, 16230020, 16720297]
12224A6720297N32561N46233O01232O40057O99768Q12453R14862Q94471Q41879
12215B3203813O84905M83086L35359L06957L76371M59722N16531N74949O49544
12206B7591237P10333P39855P26581P35498P81161Q05695P87828Q13669Q59169
12197C4551026Q45490Q71301Q74260Q54699Q39083Q42283Q24459Q38680P97903
12188D2139184P68910P06045O77517O74011O55637N57897M92029M31355L76152
12179D7478737L18817K17460J46136R4770J9009p0587j36058k33794k83161l53561
12169D7197768m22068m84315n09421n50351o14303o86876p47946p60801p44730
12160D1676957p92754q12412q43500q51321q45708q61819q59093q55398q40640
$$ y = [16720297, 17252858, 17799091, 18400323, 19040380, 19740148, 20552601, 21467463, 22361934, 23203813, 23888718, 24371804, 24707163, 25014120, 25390491, 25850213, 26366744, 26941693, 27591237, 28301570, 29041425, 29768006, 30503504, 31284665, 32090360, 32878188, 33691857, 34551026, 35396516, 36267817, 37142077, 37996776, 38835859, 39678142, 40502601, 41341281, 42139184, 42908094, 43614139, 44291656, 44965667, 45621304, 46179201, 46671230, 47102585, 47478737, 47797554, 48015014, 48161150, 48255920, 48274929, 48204342, 48068284, 47834490, 47551329, 47197768, 46775700, 46291385, 45781964, 45231613, 44617310, 43930434, 43182488, 42421687, 41676957, 40884203, 40071791, 39228291, 38376970, 37531262, 36669443, 35810350, 34954952, 34114312]
12151C4114312q50241q58746q33352q12463p99688p53844p59645p61921p27296
12142B6957116o81902o84882o75684o58292o45947o23555o16274o06636n92118
12133B1171826n57094n32117n41987m99367m63914m75597m85249m69158m37178
12124A6710165l85246l83459l75137l74717l41142l27705l40516k97290k89520
12115A3595433k88078k63302k44744k29348k37506k63691k44341k28733k35502
12106A1360188j41994r3648o9441M0307J39055J83394K15978Q3557k10267m99323
12096A1007806n52276n00340m29365l47625l14635k60532k40292k16994k10277
12087G935470k02162k48248k27808j48831j45130j58951j32598j47377j39599
$$ y = [34114312, 33264071, 32405325, 31571973, 30759510, 29959822, 29205978, 28446333, 27684412, 26957116, 26275214, 25590332, 24914648, 24256356, 23610409, 22986854, 22370580, 21763944, 21171826, 20614732, 20082615, 19540628, 19041261, 18577347, 18101750, 17616501, 17147343, 16710165, 16324919, 15941460, 15566323, 15191606, 14850464, 14522759, 14182243, 13884953, 13595433, 13307355, 13044053, 12799309, 12569961, 12332455, 12068764, 11824423, 11595690, 11360188, 11218194, 11124546, 11055105, 11095412, 11234467, 11417861, 11633839, 11717396, 11507129, 11007806, 10455530, 9955190, 9525825, 9178200, 8863565, 8603033, 8362741, 8145747, 7935470, 7733308, 7485060, 7257252, 7108421, 6963291, 6804340, 6671742, 6524365, 6384766]
12078F384766j68016j46716j09263j01726r7153q6356r9553r7974j21801j30700
12068E225508q1010n1508p7121o3972o7176p9988q6530p6906o6211o1794o5792
12057D447500q8316j01277o0605n2875n0632p2236m4358o5542n2032n0019l0310
12046C779298l3245o9102p1929m3809n2480o2571o0467n7802k5797n9523m4501
12035C198072j3749m5181n5666l9826k8855n5980m1535k2625m1565l3233l5758
12024B784099m7339m7641q302o382l5093j9392m2100k8802l3269l9015o5073m5083
12012B366608j7086k0429l7422l8888L331R632l1212n7011k8192j7002k467l7536
12000B092326k8682k2576o150K538m5522l5565j4798Q478m7710l0949j3091P378
$$ y = [6384766, 6216750, 6070034, 5960771, 5859045, 5761892, 5675536, 5575983, 5478009, 5356208, 5225508, 5144498, 5092990, 5015869, 4951897, 4884721, 4804733, 4718203, 4641297, 4575086, 4513292, 4447500, 4359184, 4257907, 4197302, 4144427, 4093795, 4021559, 3977201, 3911659, 3859627, 3809608, 3779298, 3746053, 3676951, 3605022, 3561213, 3508733, 3446162, 3385695, 3327893, 3302096, 3242573, 3198072, 3184323, 3139142, 3083476, 3043650, 3014795, 2958815, 2917280, 2894655, 2853090, 2819857, 2784099, 2736760, 2689119, 2680817, 2674435, 2639342, 2619950, 2577850, 2549048, 2515779, 2476764, 2411691, 2366608, 2349522, 2329093, 2291671, 2252783, 2256114, 2265746, 2234534, 2177523, 2149331, 2132329, 2129862, 2092326, 2063644, 2041068, 2034918, 2037456, 1991934, 1956369, 1941571, 1950049, 1902339, 1871390, 1858299, 1865677]
11988A865677k5235k4204k4911m690m800j5751m8468l2631j9187j9226L1729j084
11976A677219k9633j6174l2706k3115q953r707m746q994p631j2158k0867l3313
11964A469222k3757j644k5147k1053l679j046J7219l1813k1230O483k8303m9300
11952A285952L698K390q625p651j0563k5772J0092J1663j0171m00k0632k2653
11940A207328k1089n252j5831o287l3061j3706J5032k2331k115R270q028J0775
11928A114705j9978l6958k1652l839m962j7978P290K531Q682J0299n2490j7276
11916I68374L713j1834J7852J9662l4109m2523l1673j7466L3731L878j7248J1118
11904I03475l859m5685L479K4026n617K1332P98j9471k0615o06R528J2729N626
$$ y = [1865677, 1840442, 1816238, 1791327, 1786637, 1781837, 1766086, 1717618, 1684987, 1665800, 1646574, 1678303, 1677219, 1647586, 1631412, 1598706, 1575591, 1566638, 1556931, 1552185, 1543191, 1535560, 1523402, 1502535, 1469222, 1445465, 1443821, 1418674, 1397621, 1393942, 1392896, 1410115, 1378302, 1357072, 1363555, 1335252, 1285952, 1289650, 1292040, 1283415, 1275764, 1265201, 1239429, 1249521, 1261184, 1251013, 1250613, 1229981, 1207328, 1186239, 1180987, 1165156, 1158869, 1125808, 1112102, 1127134, 1104803, 1102688, 1111958, 1103930, 1114705, 1094727, 1057769, 1036117, 1032278, 1027316, 1009338, 1016628, 1019159, 1027841, 1038140, 985650, 968374, 972087, 960253, 978105, 997767, 963658, 921135, 889462, 871996, 905727, 909605, 892357, 903475, 899616, 853931, 857410, 881436, 875819, 897151, 897949, 878478, 857863, 857257, 866785, 879514, 885140]
11891H85140j9608l2812j6944o718K56k0592L476j6996k9518L434K6668l029M52
11878G73209J9439k5219n1849m838M711J8587J8931j9471q769k2784j1178m3158
11866F47611O087L5929K2177l804k9616l9249j7526O341M528j2867J48K9688j1225
11853F38222j4623o191J3444j1975l8079n571k162O774R229P615k3161j9172l811
11840E50539K8996J705J2326L1335j3782l2428j1539K0533J6390k8535j1663j1835
11828E52042R823q668m638J097p770j7092J9589k6773m988q018j1722j0J9654
11815E12526j4698j2274j838k0643j2481J6889l121k930L81L023O246j8424k34
11802D52422j5857J511o480J9417N529j8133j6628J6007N496l659O49J7199J802
$$ y = [885140, 865532, 832720, 815776, 809058, 809314, 788722, 792198, 775202, 745684, 749118, 775786, 772757, 773209, 792648, 767429, 715580, 710742, 715453, 734040, 752971, 733500, 724731, 701947, 690769, 647611, 653698, 689627, 711804, 708000, 678384, 639135, 621609, 627950, 632478, 619611, 619759, 649447, 638222, 623599, 617408, 630852, 618877, 580798, 575227, 573065, 579839, 589068, 596683, 573522, 554350, 550539, 579535, 581240, 593566, 624901, 611119, 578691, 567152, 587685, 604075, 575540, 563877, 552042, 561865, 553197, 548559, 549656, 541886, 524794, 544383, 517610, 512622, 504604, 492882, 492872, 512526, 497828, 485554, 483716, 463073, 450592, 467481, 464360, 461430, 461811, 464834, 471080, 452656, 452422, 436565, 438076, 431596, 451013, 456542, 438409, 421781, 437788, 443284, 439625, 440274, 457473, 459275]
11789D59275o551o047J891J2103Q032j1495j8661Q872k2397j1756M3449L695j5129
11776D45281k7057J2249m436l4350j7531K0591J8229O670j8118N901K2976Q600
11764D39005k6392j3141J13j2297j0964L7393J6910l2612k0084J131l7398k1013
11752C20651P834J2104k625L9914O849k1186j7979J0235J0000j8765p751j6973
11740C22308k6477k0541J9260J2846R994K4137j1969J244J9808j0357p782q306
11728C24165O370j338o982J2940K5076p501m4553L325L722K577M236P539k9366
11715C00210l0330n378L2371P988j3493K0319K484m292l2352j4910L1669L713
11703B97999l0568L483J1958k5271p382N402m454J8509J0071J219j4263K8608
$$ y = [459275, 452724, 446677, 448568, 460671, 468703, 457208, 438547, 447419, 425022, 413266, 456715, 460410, 445281, 418224, 430473, 426037, 391687, 374156, 394747, 412976, 419646, 401528, 407429, 430405, 439005, 412613, 399472, 399585, 387288, 376324, 413717, 430627, 398015, 377931, 379062, 341664, 320651, 328485, 340589, 337964, 377878, 384727, 363541, 345562, 355797, 365797, 347032, 339281, 322308, 295831, 275290, 294550, 307396, 317390, 341527, 329558, 330802, 350610, 340253, 332471, 324165, 330535, 329197, 322215, 335155, 360231, 352730, 308177, 311502, 315224, 317801, 322037, 329576, 300210, 269880, 264502, 296873, 304861, 291368, 311687, 314171, 309879, 277527, 262617, 294286, 297999, 267431, 270914, 282872, 257601, 250219, 255621, 251167, 269676, 279747, 280966, 266703, 295311]
11691B95311K842k8624o757j7360j4303j0111L703J3605Q99r715J5600p774j5465
11678B21851J3481r610n634r076j3839j5712k3943J4351L1139K2841P118k774
11666B30193J4888P666P929j6608m387O240o855K428r265m654j3132L0984K6932
11653B72359j3892P419R05k9755k5958M511k4210j2536J1461J4219R553L096N806
11640B22978J9261m331k6939J926K2102R311m8808l3092L440m851l470J3657M3654
11627B14838J3851k58k8263r989J0457j1029j0502m0831R808L3360j3453O961
11615A74950K0619J2348K8363j7253j5825l4607P40J6091J1651J0141L3908k1324
11603B19802o011J0981M147k1765J5476Q456k0701p695n190o026k0983j8798j6836
$$ y = [295311, 298153, 269529, 262772, 245412, 231109, 220998, 224701, 238306, 239205, 229490, 245090, 237316, 221851, 235332, 225722, 220088, 211012, 197173, 181461, 157518, 171869, 203008, 225849, 232967, 230193, 245081, 252747, 260676, 244068, 239681, 245921, 239066, 241494, 232229, 227575, 214443, 245427, 272359, 258467, 265886, 266791, 237036, 211078, 215589, 191379, 178843, 190304, 204523, 214076, 217172, 222978, 242239, 237908, 210969, 212895, 234997, 244308, 195500, 162408, 165848, 160997, 157527, 171184, 214838, 228689, 228431, 200168, 190179, 200636, 189607, 179105, 138274, 148082, 181442, 167989, 174950, 195569, 207917, 236280, 219027, 203202, 168595, 169335, 185426, 197077, 207218, 241126, 219802, 213791, 224772, 228919, 207154, 222630, 231086, 210385, 202690, 197500, 191474, 170491, 151693, 134857]
11590A34857J6307l389J4945K3142l053j4462m004j370K1173P550N751r082o454
11577A81911M143K6102o38k8141O681Q333K627M208N445o979j2334j9578j3967
11564A57813q527l3653j0220J4846P793K2907q297n294J0163O065m529L472R082
11551A61621q309k7292Q206j7159k2212K1787K2624j5578o354P403k7631M086
11539A01192J9541J2143K1715J5247m667R501k7381q141J5861m0318j4000K8230
11527A28923J0090J2040J4081K57j1081q264j5746J0236R873m222j705K7501J5695
11514A87678o086k5075J2873j0712p234k8997k7322N476L933J9656p23r038k1077
11501I3352N662L9368M984k06k7547j2397N213J2762J6725k4443k1789m555j254
$$ y = [134857, 151164, 147775, 162720, 185862, 182809, 168347, 164343, 162973, 184146, 191696, 197447, 188365, 181911, 186054, 212156, 211518, 183377, 190058, 198391, 201018, 205226, 210671, 203692, 191358, 171780, 157813, 149286, 115633, 105413, 120259, 128052, 150959, 142662, 137368, 147531, 153596, 149067, 152539, 161621, 153312, 126020, 134226, 117067, 94855, 116642, 139266, 123688, 117334, 124737, 97106, 101192, 120733, 132876, 154591, 169838, 165171, 174672, 147291, 139150, 155011, 114693, 100693, 128923, 139013, 151053, 165134, 165391, 154310, 146046, 130300, 140536, 150409, 146187, 144482, 171983, 187678, 181592, 156517, 169390, 158678, 151444, 122447, 95125, 100601, 104534, 124190, 123467, 114429, 93352, 99014, 138382, 143366, 143160, 115613, 103216, 108429, 121191, 137916, 113473, 91684, 87129, 85875]
11488H5875R514J6372J2408Q480j3464q708P250J6549J1030k0953k8684j7552
11476G8117K6340J8510J6659J2167p986l356m2944O283K5085J538k021j7967j4850
11463I5575o381P919j4886J7210L9686j6590r660K7248r1j7930m1066l5355J1683
11450E7362J7816K6607L4549J0934k3284j0495q898j2467N999M467j6406p644
11438G8540J0699L015m81j397J7707P542k4270j439L0527l2379m0044K2341l66
11425F9995J9098K242k5206M260K2346J2220j1937l6418o650K117O084j575K1867
11412G8443j6961R218K7943j269n962O383K4263j2014k3240K0691J6771k0997
11400A03269n335j2300l1574N559l696K3637N0872L864r364k3680l3703m880Q93
$$ y = [85875, 95389, 111761, 124169, 132649, 119185, 110477, 117727, 134276, 145306, 124353, 95669, 78117, 104457, 122967, 139626, 151793, 143807, 140451, 97507, 103790, 128875, 130413, 128392, 110425, 95575, 89194, 97113, 82227, 99437, 139123, 122533, 112873, 140121, 140030, 122100, 81034, 45679, 57362, 75178, 101785, 136334, 147268, 123984, 113489, 104591, 92124, 98123, 102590, 86184, 78540, 89239, 92254, 91773, 90376, 108083, 115625, 91355, 89916, 120443, 88064, 48020, 70361, 69995, 89093, 91335, 66129, 70389, 92735, 104955, 93018, 56600, 49950, 52067, 58151, 56576, 78443, 61482, 70700, 98643, 97374, 91412, 97795, 122058, 110044, 86804, 107495, 124266, 103269, 97934, 85634, 54060, 59619, 55923, 79560, 130432, 134296, 124932, 101252, 67549, 62669, 63562]
11387F3562m750o245J834j0687L820L283L704N175J0787J2789j481Q532q407J2641
11373I4557J12j0761o770j479r370l098n083L9835K035j4813m0438J812L110J0798
11359F0447J2998m0297j9757K0803J1571J1345j5045K7884J0996o253M48k1747
11347E3393Q395N155o803r619j781K8469N068l616J461n717j8558k5054o001M983
11333B9775P724K519J2097J0770O172m193L00O998q754l886m608l3782Q469K0296
11319D9897J9353p187P039j433R5j5305k7254j8615j1492K6953K8434J423J539
11306E3447J8534Q514r689k1975O434r829k4122M846J9467J6907p490m130J3622
11293F4536J543k61k3244m4214l740L6132K3275k2708K556m719l5573J7577Q181
$$ y = [63562, 58812, 52567, 54401, 43714, 47534, 50817, 54521, 59696, 70483, 83272, 81791, 90323, 81916, 94557, 94669, 83908, 77138, 75659, 66289, 63191, 58108, 97943, 99978, 85165, 44727, 46539, 49649, 60447, 73445, 33148, 13391, 34194, 45765, 57110, 42065, 69949, 80945, 74692, 75140, 53393, 61788, 66943, 60140, 50521, 48740, 77209, 82277, 78661, 80122, 74405, 55847, 30793, 24792, 29775, 37499, 40018, 52115, 62885, 69057, 64864, 65164, 72162, 63408, 59522, 54914, 21132, 29601, 49897, 69250, 62063, 69102, 67669, 67764, 52459, 25205, 6590, -4902, 22051, 50485, 51908, 53447, 71981, 80495, 70806, 48831, 55265, 45436, 21314, 26160, 45627, 62534, 55044, 50914, 64536, 66079, 65818, 42574, -1640, -5380, 30752, 54027, 31319, 33875, 29156, -6417, 11160, 19341]
11280A9341j0638J0944J4544Q581O40Q651j7630K9038K6658r892k2584j641j5619
11267D0393k9251O003J3306J158O264j2549q223k0494J0335L4802J9706j0495
11255E0955r27l033o296j300j9298J0485J6460j555k2807j1089J3221L9379K1863
11242H6058j8209N389j5665l702R232n82j6091K766J4653j2448l041Q117n180
11229E1297k1162J2775J1287J5331J3215j3551o83j3657j9339m418J3575O927
11217E1597K18o426j5484J0243Q568m206n536J2337K735R572n240J0796J4756
11204H3930k8461Q707k2229l0751J4409J2105K7924J7493l368N480j3034k6125
11192D6080k2479j3622J2999j9771p083N7003K2106R119m260m9098K2835K3174
$$ y = [19341, 8703, 19647, 34191, 42772, 43412, 52063, 34433, 63471, 90129, 80237, 57653, 56012, 40393, 11142, 17145, 30451, 31609, 37873, 25324, 17101, -3393, 6942, 41744, 61450, 50955, 50028, 46995, 40699, 39399, 20101, 30586, 47046, 45491, 22684, 11595, 24816, 64195, 86058, 67849, 73238, 57573, 53871, 63103, 62521, 46430, 49196, 63849, 51401, 48360, 56477, 51297, 30135, 42910, 54197, 69528, 82743, 69192, 68509, 54852, 35513, 31095, 44670, 51597, 51815, 45389, 29905, 40148, 48716, 44510, 38974, 51311, 54046, 63618, 58378, 69174, 83930, 55469, 64176, 41947, 11196, 25605, 37710, 65634, 83127, 79759, 85239, 72205, 46080, 23601, 9979, 22978, 3207, -3876, 53127, 75233, 84352, 80092, 30994, 53829, 77003]
11180G7003Q98k0277j272j0000o394o448r096p858L1964j026N474r10J3549j0426
11166E5181r591j4557j4829J8368J9613M896j8417q624m106J1023l826K235j2868
11153B4498r013l079L44J4045l5701K3855J7611n061Q360R886J9723J9642J3912
11140I9022r736j9842j3637k1537j8674K238L1558R954K2800K5656m811M818j5786
11127I2023p836o459j0547K1063K0299O954q286O87j7136N2086L5954l8494k5903
11114A14405K766N096M100K8227K0246R39K3593R028N4302Q6919Q0069O4408Q4294
11101E78392J01008J12106J33239J99469J98308J37429L6408n3439j08867j73829
11091A160224j50614j32622j02607r3925p5055n5548l9370l1368n3153l8743m1150
$$ y = [77003, 77901, 57624, 56352, 46352, 39958, 33510, 24414, 16556, 48520, 47494, 52968, 52058, 65607, 55181, 45590, 31033, 16204, 34572, 54185, 59081, 40664, 32040, 27934, 38957, 35131, 37366, 24498, 15485, 12406, 12750, 26795, -8906, 14949, 32560, 27499, 35859, 45745, 65468, 85110, 99022, 89286, 69444, 55807, 34270, 15596, 17834, 49392, 59346, 82146, 107802, 102991, 107809, 92023, 84187, 77728, 67181, 88244, 108543, 115497, 107211, 107898, 90762, 142848, 178802, 140308, 114405, 117171, 122267, 126367, 154594, 174840, 175779, 199372, 208400, 262702, 349621, 429690, 494098, 578392, 679400, 791506, 924745, 1124214, 1322522, 1459951, 1496359, 1442920, 1334053, 1160224, 1009610, 876988, 774381, 680456, 605401, 549853, 510483, 479115, 425962, 387219, 346069]
11080C46069o1608l5559l206o154k1746j5210m3697k5610J207M41l5684m533J3599
11067A08309j8639k2729o322M19P512P36k6665j0554o577m497J6332R273k7013
11054A9585J3314M6636K327k3404k2066l5461Q264o322J0344M8281L4127P296
11042A02921q640q402m263j8505k9922k3288J0536p212L536R245K7111K3055O972
11029H3144Q994O268k8949j0901J329m434k4988k8986n788K429l165Q499K6346
11016B9798J0794M296o859J5268j4408k0358J5346k6829k4120j0931J5738J9243
11004F978J8525N349j8973j4105K8165P698k2942l943J1075Q245m728q482R345
10991B2207P188p942j7531K932J2564o337q832K1062K3615P178N171k2516r688
$$ y = [346069, 284461, 248902, 245696, 239542, 217796, 202586, 158889, 133279, 134486, 134927, 99243, 94710, 108309, 89670, 66941, 60619, 61038, 68550, 69286, 42621, 32067, 25490, 20993, 37325, 46598, 19585, 32899, 79535, 81862, 58458, 36392, 931, 9195, 2873, 13217, 61498, 95625, 102921, 94281, 85879, 81616, 63111, 33189, 9901, 20437, 13225, 16761, 26006, 53117, 76172, 83144, 92138, 98406, 69457, 58556, 59885, 55451, 30463, 1477, -4311, -1882, -5047, 3452, 29798, 40592, 44888, 38029, 53297, 38889, 18531, 33877, 7048, -17072, -28003, -12265, 6978, 25503, 30852, 11879, -2226, 25939, 33637, 10695, 6752, 17827, 26072, 21344, 12862, 22207, 29395, 21453, 3922, 6854, 19418, 13081, 4249, 25311, 48926, 56104, 61275, 38759, 29071]
10978B9071j3860m133K7104j5724j00J414j349o34Q848K2174j0616l4618l4913
10965b7336r902Q51K2789J9177L6495j4377o880l0903p968L489J4031m186L915
10952h05M620J2501R309j561k9170l786K5236p309k5468k3706J0503J9313L5219
10939B4896q471k7495j7052K2628M442N423J1854j2731o871J1814m486K6277K1739
10926E1967o898J2206j4605j1594j1276N716J9390n026j1493M940N871P286j676
10913D4808l8753j2250k049l621Q070p263p452J3058L986J5604P889K219k1433
10900B813K557N785k386j4117j3129K440j2866j2345K1520L6034q163L031J1517
10887B2691k4163J1662L051L870J957J6567nj2839j2538j6126j6008j161N000
$$ y = [29071, 15211, 11078, 38182, 22458, 22358, 23772, 22423, 21789, 30637, 52811, 42195, 7577, -27336, -37238, -36387, -13598, 5579, 42074, 27697, 20817, -10086, -18054, -14565, -534, -4720, -805, 3815, 16316, 25625, 24064, -5106, -8892, 16344, 9035, -16433, -40139, -29636, -10323, 24896, 16425, -11070, -28122, -5494, -1052, 4371, 16225, 3494, -3377, 8437, 3951, 30228, 51967, 45069, 57275, 42670, 31076, 19800, 25516, 44906, 39880, 28387, 33327, 39198, 46484, 44808, 6055, -6195, -8244, -11865, -3795, -11058, -18510, -5452, -1466, 14138, 22027, 24246, 2813, 5370, 11155, 8769, -5348, -18477, -16037, -28903, -41248, -19728, 16306, 8143, 11174, 22691, -1472, 10190, 13241, 17111, 19068, 35635, 35630, 22791, 10253, -5873, -21881, -23042, -18042]
10874a8042L4817K4185q409O795k225k4144k1441L75r738k1937P412Q721J0672
10861a2959J7165q604r171m136j3819K5221J5520j7301J2415K5952K2715r618
10849D3380l6483r424J3802K1252k019J3581k773J6867k713j917j8609k4521J0724
10836B1147j2307q257K8420k5937k9625J6455K7847O787n079j3078j3775k2848
10824c0250N870P246k8915l874L5902L9179m398M565p545k1063K299J1060M491
10811A4567M488k1153l2687j027K7144J4275l855P367l58K5065J5732J5412k6216
10798C8754q09l566o177J1487M552j1325j9593K3031j6139j6176k1790k3208L1924
10785i035L4718M306q817j3271q988p340j7003j112J9323L0558p827j4162o759
$$ y = [-18042, 16775, 40960, 32551, 39346, 37121, 12977, -8464, -8089, -17827, -39764, -32352, -23631, -12959, 4206, -4398, -13569, -17705, -31524, -6303, 9217, -8084, 4331, 30283, 52998, 43380, 6897, -2527, 11275, 32527, 30508, 44089, 41316, 58183, 55470, 53553, 34944, 10423, 21147, 8840, 583, 29003, 3066, -26559, -10104, 17743, 24530, 19451, 6373, -7402, -30250, -24380, -17134, -46049, -49923, -14021, 25158, 20760, 25325, 17780, -3283, -984, 10076, 14567, 19055, -2098, -34785, -35812, -8668, 5607, 1752, 9119, 8761, 33826, 49558, 64970, 38754, 37945, 34379, 28202, 39689, 44241, 32916, 13323, 36354, 20215, 4039, -17751, -40959, -9035, 25683, 29989, 21172, 7901, -1087, -8427, -25430, -26542, -7219, 23339, 15512, 1350, -5409]
10772e409Q140k065k89l514j1205j943J6636K6160M239l810L3027q858m4073j9479
10758a2443n826j2200M907K718l049k416J740r198M800L0725K5135l625j5799
10745E469M772Q197Q233p400k2357K715K2531K87r983j3058j4479m178J9109J3655
10731A3513n04k573j0782J3759k9260m221J6225J4756M387N415k5182Q298J2928
10718A6759L1250K6878j0618Q781p745j1347k8655k4975M073R704l3040m4475
10706f3410M0947L1740m608j0404m973R003L877K7907M692Q998N556j7237q98
10693C1190q593R902l1391j5972K8372j1668j0290J1005J5964J7002r64m691k1116
10680H750m0483K0605N2913j236l8298k2423M383L2K5369Q391K71J0504L0777
$$ y = [-5409, 2731, 666, 377, -3137, -14342, -16285, 351, 26511, 30750, 26940, 59967, 51109, 7036, -12443, -18269, -30469, -25562, -22844, -25893, -28309, -26569, -35767, -30967, -242, 24893, 21268, 5469, 10241, 18438, 26671, 19271, -3086, -371, 22160, 22447, 12464, -594, -15073, -19251, -142, 13513, 13009, 10436, -346, 13413, -15847, -20068, -3843, 10913, 15300, 20715, -4467, 3831, 16759, 48009, 74887, 64269, 73050, 65305, 53958, 25303, 328, 4401, 14105, -18935, -63410, -22463, 9277, 4669, -5735, -10708, -1705, 2172, 30079, 34771, 43769, 49325, 32088, 31190, 22597, 32499, 1108, -14864, 13508, 1840, -8450, 2555, 18519, 35521, 34557, 29866, 8750, -31733, -11128, 41785, 40549, 2251, -20172, -15789, -15757, 9612, 18003, 18274, 28778, 59555]
10667E9555j6929j1419J2169J8865M758R087n08j7019j5091k028k5640k1103J065
10654d238J7877j4875j8635J4289j601J4580m089p438R993K3266K4276l938k0912
10641B8555k0507M617K8479r914R748R577k732j5318P118J148k2914J1324K6863
10628E6044l6429j5607N326k263O826p682m615r096K25N252J8131k3677j2168
10615a9733L903n561K6364j8522L136J2946M855N594n955Q662k641j5719j170
10602c841j9704J3382n973j1094K4561J2619J3795R213K09N207m0392k1304r227
10589c2549j0401K2017K0458r7J5818L41r457r588o038j4741R75K6822l350j4497
10575a4287R566j1753R935m09O828K381J1798K4940l9553j9217K0078j8661j8838
$$ y = [59555, 42626, 31207, 43376, 62241, 66999, 76086, 75578, 58559, 43468, 41440, 15800, -5303, -4238, 13639, -1236, -19871, -5582, -7183, 7397, 3308, -4130, 5863, 29129, 53405, 49467, 28555, 8048, 12665, 41144, 31230, 40978, 50555, 47823, 32505, 39623, 40771, 17857, 29181, 56044, 19615, 4008, 9334, 7071, 13897, 6215, 1600, -7496, -7271, -2019, 16112, -7565, -19733, -15830, -21391, 4973, -13549, -10413, 2533, 7388, 12982, 7027, 15689, 13048, -2671, -3841, -23545, -10163, -16136, -27230, -2669, 9950, 23745, 32958, 33167, 38374, -2018, -23322, -32549, -42950, -20933, -475, -572, 15246, 15587, 6130, -3458, -9496, -24237, -23262, 3560, 210, -14287, -4721, -16474, -6539, -6948, -120, 2261, 14059, 38999, -554, -19771, 307, -18354, -37192]
10562c7192l759L3524L5078k9646k7471K4424m203k8538k111P7759J4449k7581
10550B4733k1483J3J3510m396J822o99r212K3965L771k1974J935Q251J1538k1255
10536A0519j7311p668J3625K1248K0470j1288Q6j9530K2542J0102j2579j0298
10524A9918r057K0522j4155j5871n256K698N137K7077M0393j6456m9789m3239
10512c8078p389K4414Q610j432q487K9585J4662K2251r895l6010j9753L218P209
10499a1095N850k010J3548p465N875L1996J4212j7682j6451J0546k9745p041o302
10486a5764m603K7570M4201q151j5703m105k6519o963K1775J3027n455k4169j5615
10473b0474J490r40J8182q24j1439J1170P059J4457p49q870l6010P267K7408N431
$$ y = [-37192, -40951, -7427, 27651, -1995, -29466, -5042, -9245, -37783, -39894, 37865, 52314, 24733, 3250, 3263, 16773, 12377, 14199, 13500, 4288, 28253, 32024, 10050, 11985, 20236, 31774, 10519, -6792, -14460, -835, 20413, 40883, 29595, 29681, 10151, 32693, 42795, 30216, 19918, 10861, 31383, 17228, 1357, -3899, -1201, 3936, 31013, 71406, 54950, 5161, -38078, -45467, -21053, -12443, -13875, -22362, 7223, 21885, 44136, 34241, -1769, -21522, -18304, -11095, -5245, -7255, 6293, -1172, 4703, 36699, 50911, 33229, 16778, 27324, -2421, -9462, -15764, -20367, 7203, 51404, 43253, 27550, 23445, -3074, -10037, 11738, 24765, 19310, -4859, -20474, -18984, -19924, -1742, -2566, -14005, -2835, 4224, 18681, 17932, 9062, -26948, -19681, 7727, 13158]
10459A3158m333J4483k5097j1112N848K0521J6801Q743j8228j5957K548k9117
10447b1742j7050K4518K6195l511K552j6251j5192J06K2354J8822O877l656j8167
10434E855l467K5409k093l991k8903k4055j4414K2344J5452j377j7258q457j876
10421c6831J6060J4519m423k1532j3875o655K1203O314k16l944l278J1262j40
10408b1536l96J8744K8903L275k0719J8265r360k624L059p928k6215o977J5166
10395h343K222M653j9764k5519k5793p65j626J8509n135J8433J3050J3373L1484
10382A4779L194J2330J0752k3204n538k8595j0172j1396j4579m631N240K1226
10370c0594L1286K1922M563Q242k7398j4658q854p405L0108j6417o990K1475k7950
$$ y = [13158, 8825, 23308, -1789, -12901, -7053, 13468, 30269, 39012, 20784, 4827, 7375, -21742, -38792, -14274, 11921, 8410, 10962, -5289, -20481, -20375, 1979, 20801, 27678, 24022, 5855, 2388, 27797, 25704, 21713, -7190, -31245, -45659, -23315, -7863, -9240, -26498, -34955, -36831, -20771, -6252, -10675, -32207, -46082, -52737, -31534, -25220, -25436, -29380, -32658, -21396, -21536, -21932, -3188, 25715, 28990, 8271, 26536, 17176, 14552, 17611, 9683, -16532, -23509, -8343, -6121, -1468, -21232, -46751, -72544, -73309, -74935, -56426, -61561, -43128, -30078, -16705, 14779, 17973, 30303, 41055, 17851, 12313, -16282, -26454, -37850, -52429, -57060, -51820, -30594, 692, 22614, 27177, 35419, 8021, -6637, -15491, -22896, 7212, -9205, -16195, 5280, -22670]
10357b2670J109l805j1295R362M844J294M1343j7450o024J4641j8524J0923K0503
10344B4251k036j6862m422l4016R216r793K920p534k80p671K0301P301r713J3011
10330a5327J4885j394m241J883j156k270L195J9856K5132K4143O020j9662k2894
10317B8170k5301R418J1249J1096J3083l5966o2681R037L8190L5013R761K4295
10305F5364o639j0771P264j8688l2826m911o494O270K2567K3682r117j4269o273
10292A5159j0370j9513J5218k66j1614L399J0643N764M2679j2094k1543k2174
10280d712l49J3389L4610k5649k780l2421J8094J6320p209J3074j1853o420P485
10267A1579m353o274k1732J8737L2043q711J2853J4046j7788j8628J9395j4736
$$ y = [-22670, -21561, -25366, -36661, -27299, -22455, -21161, 20182, 2732, -3292, 11349, -7175, 3748, 24251, 22215, 5353, 931, -33085, -23869, -33662, -30742, -38276, -38556, -46227, -25926, -18625, -28338, -15327, -442, -1836, -6077, -4194, -5350, -7620, -4425, 15431, 40563, 64706, 70726, 51064, 28170, 2869, 12287, 23536, 34632, 47715, 11749, -50932, -41895, -3705, 31308, 41069, 65364, 58725, 47954, 55218, 36530, 3704, -1207, -7701, -1431, 21136, 44818, 35701, 21432, 15159, 4789, -14724, 494, 228, -11386, -7987, 2656, 8420, 51099, 39005, 17462, -4712, -5061, 8328, 42938, 17289, 14509, -17912, 182, 16502, 9293, 22367, 10514, 4094, 11579, 7226, 952, -20780, -2043, 30000, 21289, 34142, 48188, 30400, 11772, 31167, 16431]
10255A6431R98l133o66M639p484M746k4106l6147K1212p690J400N468L824K0741
10241B33K1232j7796M978k181p335k34Q113N790K5616Q332k6128n3490J479M809
10227b6582K6141J7109l3042J4258J5578N10j9460k3547J3456K4854p965j088
10215B22N852j2831J6529J5946j1067m251J1565k399q148l4553R285M0705M265
10202C1120l8169j1848J0663J8016L3891k1010j4641J2807J6059j4715j7432r922
10190e181k189q308o284p480k1894O967K1581k50p874J9454k0145k6848J602K8712
10176b8137J3451j1838k379K0265n813J3193K1207k012j4335j9542j1477R506
10164a7911J2931j5535K328Q814l693N618P595L7251r96j5687m089L3079k0560
$$ y = [16431, 17429, 14296, 13630, 18269, 10785, 15531, -8575, -44722, -23510, -31200, -29800, -24332, -20508, 233, 21465, 3669, 8647, 6466, -869, -1103, 7010, 12800, 38416, 46748, 20620, -32870, -31391, -26582, -441, 16668, -16374, -2116, 13462, 13972, -5488, -29035, -15579, 9275, 1310, 222, 6074, -6757, 9772, 25718, 14651, 10400, 21965, 19566, 11418, -23135, -13850, 26855, 31120, -7049, -18897, -8234, 9782, 43673, 22663, 8022, 20829, 36888, 22173, 4741, -5181, -7370, -15678, -21962, -29442, -51336, -44369, -22788, -23038, -30912, -11458, -31603, -58451, -56849, -28137, -14686, -26524, -28903, -8638, -14451, -1258, 19949, 17937, 3602, -15940, -27417, -17911, -4980, -20515, -18187, -9373, -13066, -7448, 147, 37398, 36402, 20715, 16626, 49705, 29145]
10151B9145l8174l757K3006m023L068R846j7959L98Q700j1699L350j094O897J1498
10137A9202N003J4277r694j3054J1478l420l467K918O960j1702j4301m425P11
10124D86l258K8414L4701k9798l9891K97P284q270J0464j0646J256J0083P83R719
10110A1624q22j1638J003K2701m367k77J6218k2465Q297j7051n46k1395k9050
10097d7768k9803K0022J6145K0389K4904J6571j2374j8078R46k4690M530j0591
10085c9797k130o42K0723J8107r308J9296N502k8472J3555m927j7708N122J7528
10072c151R564r653j4800L2662J1342J9233K4468P405N979M516R475R86J5027
10059A13053Q467K8697K5549j402j7756r115k8968k9603j4542l9227J7479q583
$$ y = [29145, -9029, -12786, 10220, 6197, 9265, 19111, 1152, 1550, 10250, -1449, 1901, 807, 7704, 19202, 24205, 38482, 28788, 15734, 27212, 23792, 20325, 23243, 30203, 18501, 4200, -225, 486, -2772, 25642, 60343, 30545, -9346, -9049, -1765, -10035, 429, -10217, -8961, 1122, 1905, 11624, 10802, -836, 167, 22868, 18501, 18224, 34442, 11977, 20274, 3223, 2677, -18718, -47768, -77571, -57549, -41404, -21015, 3889, 20460, 8086, -9992, -9046, -33736, -29206, -39797, -41927, -42569, -21846, -3739, -13047, 6249, 11751, -16721, -3166, -8093, -25801, -20679, -3151, 6413, -3240, -18040, 14622, 25964, 45197, 69665, 77070, 83049, 87565, 97040, 98026, 113053, 121520, 150217, 175766, 174364, 156608, 147493, 118525, 88922, 74380, 35153, 52632, 44049]
10047D4049k2959m914J5787J301j455L278k1565j2131j4075J151K3495K438J9734
10034C4134M120k5617P332K4802K263k8080r019K2467J8087l6577k5687P629j0122
10021a4268m515J1110J1297n342k429L8004n181r876j1683j1351N321N113q3J3841
10007A9958j1845k0201J449N532L2328R39p678J0844J5267o808o217j4545l4376
9994a5353k79J4678l4540J0539J472m019J5114r869k245k373R340J2506j2433
9981a7462K0071N976m3955k2938k859O767K0390K0800K9293j4133j1849J2526
9969B627K539k3909l2848k0586o778L3187K3457k255P830J1026J1178J8919j8399
9956E988Q856O633k0367P956K6920J399m850Q485p269n048M078J0946J953k0740
$$ y = [44049, 21090, 16176, 31963, 33264, 31809, 35087, 13522, 1391, -12684, -11533, 11962, 14400, 34134, 38254, 12637, 19969, 44771, 47034, 18954, 9935, 32402, 50489, 13912, -11775, -4146, -14268, -18783, -7673, 3624, -1718, -4147, 33857, 28676, 18800, 7117, -4234, 1087, 6200, 6117, 19958, 8113, -12088, -10639, -5107, 27221, 28160, 20482, 31326, 46593, 39785, 33568, 19023, -15353, -15632, -954, -35494, -24955, -23483, -27502, -12388, -22257, -24502, -26875, -17535, -5029, -17462, 2609, 8585, -35370, -58308, -61167, -54400, -34010, -13210, 16083, 1950, -9899, 2627, 5166, -18743, -51591, -72177, -78955, -45768, -22311, -24566, -16736, -5710, 5468, 24387, 5988, 14844, 21477, 1110, 9066, 35986, 37385, 32535, 41020, 33751, 28703, 32781, 43727, 45680, 24940]
9942B4940j1916M748K840m0385j4730K64J8680N053k1557l686J1969L1965r755
9929a570k1823k69O648n972J004L0848J4251j3518j5916N651R668K3317J0251
9916D2570k0086n644k7087K055L514j260r666J4893q877l0731K092K1129J0747
9903f351n486j3056j2949j2948P169P814J3672K0677l972j4227O507k0300N468
9890b7982l268j4663j3052O141L1594j0666k6985O982K0948M0290p238J0490M1337
9877E3928K2242K203k1313j4398m597r671n385O236L826j2480K5677J9415j2681
9864E3002k7110M399l749k4392M824J9698j6301M741J4233p380O165J7563j2744
9851C2949k4285j0447K130J3631l843j098J788J6816L6101k0336k0001j1926L2741
$$ y = [24940, 13024, 17772, 20612, -19773, -34503, -34239, -15559, -10506, -32063, -35749, -23780, 8185, -1570, -23393, -23662, -17014, -22986, -21982, 8866, 23117, 9599, -6317, -666, 9002, 32319, 42570, 22484, 16840, -10247, -8192, -4678, -5938, -15604, -711, -9588, -40319, -38227, -17098, -6351, -11837, -24893, -37842, -50790, -43621, -35807, -22135, -1458, -5430, -19657, -13150, -33450, -27982, -31250, -45913, -58965, -52824, -21230, -31896, -58881, -51899, -30951, 9339, 2101, 12591, 53928, 76170, 78373, 57060, 42662, 38065, 28394, 23009, 29245, 33071, 20591, 46268, 65683, 53002, 25892, 30291, 26542, 2150, 6974, 26672, 10371, 15112, 29345, 21965, 28130, 45693, 32949, 8664, -1783, 347, 13978, 10135, 9037, 10825, 27641, 63742, 43406, 23405, 11479, 44220]
9838D4220K6853k6788j5153k4061l6016p745L5384M0739K0591p207l1202k4480
9826d865J4852M68P019Q066n48J036j1761O997p710j0217J2135J1255M753k097
9812B9383j9687P724n52j0319k4224K7429j02j2858m307J4863N042j7837k1108
9799b6553p59l860J5963L7962j0636l0314L0199j5895J5275M525j1235k929o765
9786e022O412J2284j3742k1147P637L077K5023J1975K1707R349k0484l0335k3093
9773a6359P159L2070N909N90j6864P268J1456L66j8303k3237l0154Q903L6537
9760E341J7012O459J691r716j6137k1073J9369Q776k0970M107j4940J1738K6861
9747A8518O128j6377j2901L635J7578K5568Q717r03k1462M321K053k7056K5488
$$ y = [44220, 71073, 44285, 29132, 5071, -30945, -38690, -3306, 37433, 58024, 50817, 19615, -4865, 9987, 10455, 17474, 25540, 24992, 26028, 14267, 21264, 13554, 3337, 15472, 26727, 31480, 29383, 9696, 17420, 16868, 6549, -17675, 9754, 9652, -3206, -7513, 7350, 12392, -5445, -26553, -27312, -31172, -15209, 22753, 12117, -18197, 12002, -3893, 11382, 15907, 4672, 1743, -5022, 1390, 13674, -68, -21215, -13578, -10501, 14522, 26497, 48204, 57553, 37069, 6734, -16359, -9200, 22870, 28779, 29369, 12505, 19773, 31229, 31595, 13292, -9945, -40099, -31196, 5341, 22353, 28812, 30503, 20787, 4650, -16423, 2946, 11722, -9248, -5141, -20081, -8343, 18518, 24646, 8269, -4632, -997, 16581, 42149, 50866, 49963, 28501, 32822, 34875, 7819, 33307]
9734C3307K6064O92n507K775K3528j9950l8054l0460K500J4780P240q35J462r391
9720H151J6929J377J9818J2311J621p995k6591J4767n142p716j4581J1215J7684
9707D1848l373L507j0485k1411L042J3665K3601k315j4998j0069Q802o953k7039
9694b178o402J3109l00p482K1273r28k2928k3470J4657M7937j8548p738N505J4818
9680B7325O61J6941M4627m736j8948j5590m979k54J6856n716o408m658Q871j3370
9666D0622k5600J4836l518k070k1273k2725J203J9168J6703J2949j3417J1278
9654B8156M054j3529j0990M925Q588m699K0638L17l426N396L545K0077j2112k2830
9640B8110j4452K7121P003j2163M368j0968k578Q449k462K6014K2545j6529k562
$$ y = [33307, 59371, 60063, 54556, 57331, 80859, 60909, 22855, -7605, -5105, 9675, 16915, 16080, 17542, 8151, 25080, 26457, 46275, 58586, 60207, 52212, 25621, 40388, 35246, 27530, 12949, 24164, 41848, 38475, 41982, 31497, 10086, 13128, 26793, 50394, 48079, 33081, 23012, 31814, 24861, -2178, -8580, 4529, 4229, -3253, 18020, 17092, -5836, -29306, -14649, 33288, 14740, 7002, 12507, 27325, 27986, 44927, 89554, 84818, 65870, 50280, 45301, 45047, 61903, 56187, 49779, 45121, 53992, 40622, 15022, 29858, 26340, 24270, 2997, -19728, -18525, 643, 17346, 30295, 16878, 28156, 32210, 18681, 7691, 12616, 21204, 16505, 37143, 37460, 34034, 39430, 42975, 63052, 50940, 28110, 13658, 40779, 47782, 35619, 39987, 29019, 26441, 34890, 32428, 58442, 80987, 64458, 61896]
9627F1896O560p208l083J162k759j7859r37K644Q547j5790j3357n534J822J1533
9613B7637K1374L812r206K2807Q329j1319j0075J4141J193j273O303J0815J2112
9600I6650j4808l5242K350k5732K1021J2216P185J4022n341j5553p200j220J9124
9587F7472R029j0320j9420k0390p086k99j0029J698J1552M6879J7016k5773J2331
9574G2660l262k143R609k2951j0855L560n479J9007J4917m553j6341j3601J1579
9561E2147N795k418j901Q539K1392j7407J307k922l440l284q802j1077m808M893
9547C8014L2619J6013j3228j4600l408K647p284L884Q283R171L000J5619K1822
9534A12552K275k0385k3447J6978R338r019r972n323L865K3648j9363k1733j9160
$$ y = [61896, 68456, 61248, 58165, 59327, 56568, 38709, 37772, 40416, 48963, 33173, 19816, 14282, 16104, 27637, 49011, 52823, 43617, 66424, 74753, 63434, 53359, 67500, 68693, 67420, 73723, 84538, 96650, 81842, 46600, 48950, 23218, 44239, 56455, 63640, 77662, 72321, 56768, 49568, 48348, 67472, 76501, 66181, 46761, 26371, 19285, 18986, 8957, 10655, 22207, 69086, 86102, 60329, 72660, 69398, 67255, 76864, 53913, 43058, 46618, 41139, 60146, 75063, 70510, 54169, 40568, 52147, 57942, 55524, 53623, 62162, 83554, 66147, 67454, 64532, 61092, 57808, 49006, 37929, 33121, 38014, 70633, 86646, 73418, 58818, 55410, 58057, 50773, 54657, 62940, 72111, 75111, 90730, 112552, 114827, 94442, 70995, 87973, 97311, 88292, 78320, 72997, 76862, 100510, 81147, 59414, 40254]
9521D0254K6996N3839l824k2858N15k590m348K6125J1296j5383k6922N020j5373
9508G2747j4271R86j58J1130p686Q154K3479L0924j69p329j7898J0762l459k1063
9494H6149K0087J567m4292j753K2251J7679m030j7803N794O500J3184L93Q399
9481A14125K1466J4632k487p619j6672J0409K9888J5031j0301j8226k7928J0782
9469A33100R689K7239J5195k4277k1042l763j0702K771j82O607j4303o364o293
9456A07675p220K2159n707J9301N3404j0609q646n93O539k6285p523L2312J9365
9443A94172l5597k1192K3352K9276K2445J5726r605l2706k2175j2911J512j5064
9431A37233q533q660Q660K2170J4766j801N991J2878j940M75K0722L7094K7932
$$ y = [40254, 67250, 121089, 117265, 94407, 94922, 92332, 87984, 114109, 125405, 110022, 83100, 88120, 72747, 58476, 59462, 59304, 70434, 62748, 70902, 94381, 125305, 125136, 117807, 99909, 110671, 107212, 86149, 106236, 107803, 63511, 61758, 84009, 101688, 97658, 79855, 85649, 92149, 105333, 105726, 114125, 135591, 150223, 147736, 140117, 123445, 133854, 163742, 178773, 168472, 150246, 122318, 133100, 142789, 170028, 185223, 160946, 139904, 136141, 125439, 128210, 128028, 134635, 120332, 113968, 107675, 100455, 122614, 116907, 136208, 189612, 179003, 170357, 169764, 176303, 150018, 142495, 174807, 194172, 158575, 137383, 160735, 190011, 212456, 228182, 218577, 185871, 163696, 150785, 152297, 137233, 128700, 120040, 128700, 150870, 165636, 163835, 169826, 182704, 180764, 181239, 201961, 239055, 266987]
9418B66987p075k4572k1607J6074M1676k4642j2424j5384j5024j8021n302J8740
9406A99426K1086l896k4645M1896K3777k7068r861J8893J0803l3676M91L3403
9394B50629J0620J415O395Q795m391O676K8597o452n7213o166K4899K1321N075
9381B90200Q35M652P61J2161j6553j8024j550R792J4901l7947q890J7686J4433
9368B82457J5620N151K0939j9276k9203k8595J0741O191k868N892K3019J7496
9356C07564j0853j0215J5819K9325J5952M356l379j3594j4181J8004j560k163
9344C35075j3260l850J9004M32l1787J5343L7066K0885K4894m99k0772l1314l662
9331C47555l813N528j294J3463J6195j4145J197J5691J4031j5357k5408J650O252
$$ y = [266987, 259912, 235340, 213733, 229807, 271483, 246841, 234417, 219033, 204009, 185988, 180686, 199426, 220512, 216616, 191971, 233867, 257644, 230576, 220715, 239608, 250411, 216735, 217226, 250629, 261249, 262664, 269059, 277854, 273463, 280139, 308736, 302284, 245071, 238905, 263804, 285125, 290200, 291035, 295687, 296448, 308609, 292056, 274032, 272482, 282274, 297175, 259228, 250338, 268024, 282457, 298077, 303228, 324167, 304891, 275688, 247093, 257834, 264025, 261157, 267049, 290068, 307564, 296711, 286496, 302315, 331640, 347592, 351948, 348569, 334975, 320794, 338798, 337238, 335075, 321815, 317965, 336969, 337401, 305614, 320957, 358023, 378908, 403802, 403303, 382531, 351217, 347555, 343742, 349270, 347976, 361439, 377634, 363489, 364686, 380377, 394408, 379051, 353643, 355293, 361545]
9318C61545P846M481j0301q011Q400L963M857J2886R699Q458R543j5171j807j2080
9304C84308J1980J216p821q812j3940k142K6380M51Q775m365J8188K5874O728
9291D46820o935m5336j3566J1498N625o319j8410o158J7323J2627k0792j5241
9279C61136j1363M938m07J4318J5068j2551j4329N373j025K5789R780j9658j6288
9266C60781j339j9639o972M601J2416j398K6552r299j8528K468k968o627l211
9253C36837j4480K094k1088o974J9105J0396M830j3301m810k8042j5246M463J7161
9240B90945k6228J5773R705l3657r875L4985R906j1942k250J5600m831k984j0307
9227B74840M040o085p991j7137r896J467K126L1499q539j2143J1749M969m733
$$ y = [361545, 369391, 373872, 363571, 355560, 363960, 367923, 372780, 385666, 395365, 403823, 413366, 398195, 396388, 384308, 396288, 397504, 389683, 380871, 366931, 364789, 391169, 391620, 400395, 396030, 414218, 440092, 446820, 439885, 394549, 380983, 392481, 398106, 391787, 373377, 367219, 384542, 397169, 376377, 361136, 349773, 354711, 354304, 368622, 383690, 371139, 356810, 362183, 361158, 386947, 396727, 377069, 360781, 359442, 339803, 332831, 337432, 349848, 348450, 375002, 365703, 347175, 349643, 346675, 340048, 336837, 322357, 324451, 303363, 296389, 315494, 325890, 330720, 317419, 312609, 284567, 269321, 273784, 290945, 264717, 280490, 290195, 256538, 246663, 281648, 291554, 279612, 277362, 292962, 288131, 285147, 274840, 278880, 272795, 264804, 247667, 237771, 239238, 241364, 272863, 264324, 252181, 263930, 268899, 264166]
9214B64166k3721m1492P07L6925K0944o827k2056j0483l588J818j8906n592K3272
9201B15167J3820j2578P743K4066k889P76j2274j6201K3496l062j9250j9762n466
9188A93586k279J4649M550R989N437j4057l552n583J0505j3711k074M173j7155
9175A84478J3956r520O769q478J757j1688k0523j062K825J333N038j8493r447
9162A36945j2597K757J285N256j1420K2050K6256J2151J0132R567k4639k1784
9150A55959K8398k9904j7106J9370o381k590j1334j3053K2051J4108o855m7846
9138A04817p201j141j726K1892o261k5339k4925J0380n14J9602K0287j3659l083
9125I3129J6403K3671m150k4888o858J6465K5672J1692q018j8994j6725J0433
$$ y = [264166, 240445, 198953, 199660, 236585, 257529, 250702, 228646, 218163, 214575, 216393, 197487, 191895, 215167, 228987, 216409, 224152, 248218, 245329, 246105, 233831, 217630, 241126, 238064, 218814, 199052, 193586, 191307, 205956, 210506, 220495, 225932, 211875, 208323, 202740, 213245, 199534, 197460, 201633, 184478, 198434, 188914, 195683, 187205, 188962, 177274, 156751, 155689, 158514, 159847, 164885, 146392, 136945, 124348, 127105, 128390, 133646, 122226, 144276, 170532, 182683, 192815, 202382, 177743, 155959, 184357, 154453, 137347, 156717, 150336, 147746, 136412, 123359, 145410, 159518, 152663, 104817, 97616, 96475, 94749, 116641, 110380, 85041, 60116, 70496, 69982, 89584, 109871, 96212, 93129, 109532, 133203, 129053, 104165, 97307, 113772, 139444, 151136, 143118, 124124, 107399, 117832]
9113A17832J5377K255j8989l9191l781K393M757K3472K2916M613j8821k6314J4029
9100A00548J7556j0886j6067k2159N014J3267K6238N08k3698r451J7500L2243
9088A30613m467l773j6128l5725j2882r632L7513O777j2174O725l076J1274K179
9075I7224l5482l4667P073J664o217q359K3648M5978J714J4346J4478j0278j6154
9062I4968R276k089j1861k7994j196K4510K2791j1683J2991j9817l0930k0480
9050C8486K304J9758j195J1557n93l6554M912J9749nn296l075n546l64K9186J2192
9035H5516K277Q034R550j3277K2007j7766k6596J289P050J0120J1315j0533j5676
9022G3310k9201j2727K2648N631m092r3j2634j993j041k946J2498J9527j7425
$$ y = [117832, 133209, 135464, 116475, 77284, 73503, 75896, 80653, 104125, 127041, 131654, 112833, 86519, 100548, 118104, 107218, 91151, 68992, 74006, 87273, 113511, 114019, 90321, 80870, 98370, 130613, 126146, 122373, 106245, 70520, 57638, 48006, 85519, 92296, 80122, 86847, 83771, 95045, 97224, 61742, 27075, 34148, 35812, 29595, 21236, 44884, 90862, 92576, 106922, 121400, 111122, 94968, 104244, 102155, 90294, 62300, 61104, 85614, 108405, 96722, 109713, 89896, 58966, 38486, 40790, 60548, 59353, 70910, 70317, 33763, 38675, 58424, 58419, 53123, 50048, 44502, 44138, 73324, 85516, 87793, 95827, 105377, 92100, 114107, 96341, 69745, 71034, 78084, 88204, 99519, 88986, 73310, 44109, 31382, 54030, 59661, 55569, 55476, 42842, 40849, 39808, 36862, 49360, 68887, 51462]
9009E1462J273q996Q532j9819j8699j1429J5025K4251J924k1982j382O295r39
8996B5516p798L586r189K4289J8451J7570j070J6656K160L352k9706j6592J913
8983D9138M309M937p576J6007L682N151j8514j3019J8206J3889j2715n7562k5368
8970a9435J4471L6134L0203j7837j8544K442K1812K293J4140R057O813k7974l0724
8957B2851P702M9898J6252k6975j7454j1917K0979J664k7169j3059j2680J2452
8945B2544J9206j276j5522o736P065P242P107j5641M99M978K629l017q30J2205
8931D0453L149j0238m278n536j5705L817j2088j6442P568J0545K4536K6727j7176
8918C5332J5517K4982J7973J523n387k3529q953k160l5139j0007K9499j7406j844
$$ y = [51462, 52735, 43739, 52271, 32452, 13753, 2324, 17349, 41600, 43524, 21542, 20160, 26455, 25516, 17718, 21304, 12115, 36404, 54855, 72425, 71355, 88011, 90171, 93523, 63817, 47225, 49138, 53447, 58384, 50808, 66815, 70497, 75648, 57134, 44115, 62321, 76210, 63495, 5933, -19435, -4964, 31170, 61373, 43536, 24992, 27434, 49246, 51539, 65679, 74736, 81549, 53575, 22851, 30553, 80451, 96703, 69728, 52274, 40357, 61336, 63000, 35831, 22772, 10092, 22544, 41750, 40474, 24952, 18216, 25281, 32523, 39630, 23989, 24488, 29466, 32095, 29078, 28248, 40453, 43602, 33364, 29086, 23550, 7845, 11662, -426, -16868, -9300, 1245, 25781, 52508, 35332, 50849, 75831, 93804, 95327, 89940, 66411, 57458, 55298, 20159, 10152, 39651, 22245, 20401]
8905B0401J0258j1664P908P141P059J6113r966r839P235l769K2591j5424k2503
8892B5541k5333j216j6215J8687J4002j8219j5729K7587L0744q836l6517L2818
8880B7314Q092j0549m003Q177K2803K2215J1165O459j6653j4972k1698j0554J7645
8867D5441J3908l2521l994K0557J0590j1114J8265J0081l687p366p858l050j3879
8854C5373o958M364J0310j0618j3202M2681q968m280k431j3074l739j2936K3957
8841D0479J5802K1788o39j7335k3905j3068R591K929L4652J5521l4890j9448j9533
8828A1944j5450k580Q187K1635K3799l44Q925K5657L5090J2952K1297J5521j4523
8815A52110j3792k9610M457j6455k4160p574J0843L353j110j052j8018K995n914
$$ y = [20401, 30659, 18995, 26903, 34044, 41103, 57216, 47250, 37411, 44646, 40877, 63468, 48044, 25541, 208, -1008, -17223, 1464, 15466, -2753, -18482, 9105, 39849, 31013, -5504, 27314, 35406, 24857, 20854, 29031, 51834, 74049, 85214, 91673, 75020, 60048, 38350, 27796, 45441, 59349, 26828, 22834, 43391, 53981, 42867, 61132, 71213, 67526, 60160, 52302, 49252, 35373, 28415, 32779, 43089, 32471, 19269, 61950, 52982, 48702, 46271, 33197, 29458, 16522, 40479, 56281, 78069, 77430, 60095, 36190, 23122, 32713, 35642, 70294, 85815, 50925, 31477, 11944, -3506, -6086, 2101, 23736, 47535, 47191, 56116, 81773, 116863, 129815, 151112, 166633, 152110, 138318, 108708, 113165, 96710, 72550, 64976, 75819, 79172, 78062, 77010, 58992, 61987, 56073]
8802E6073K1444j1411j2879J9630q859j1319O424l0085M766L2J273k304J7442
8789E0227M285j5347J5948m65J4604R065J3242j5389l1004o228K3509L917j607
8776F4757q219K812l519J5160K6897K2704J1831j004p195n428k7985k955j327
8763H6529J1684Q270K2050j0836l018j7176R379J1392p063l5363j2391J5114j5911
8750F2660j0255j4293R403J5002J3151K6908P426m069k7655l665n530J7747J8971
8737A05801R957k930j8925j4271p007p934J413J5912n104J4778j5863j3719J0606
8724G2714q675K2894p273K563L4009m242m119k4217J0502o600N718K5875K1544
8711A40693j2009k5015k5587l317J1261o492J8731p281J9632J551k7950J2195
$$ y = [56073, 77517, 66106, 53227, 72857, 63998, 52679, 59103, 29018, 33784, 33816, 35089, 32785, 50227, 54512, 39165, 55113, 54648, 69252, 78317, 91559, 76170, 45166, 38938, 62447, 66364, 64757, 56538, 59350, 55831, 70991, 97888, 120592, 132423, 131419, 124224, 118796, 90811, 87856, 86529, 98213, 106483, 128533, 117697, 114679, 97503, 106882, 118274, 111211, 75848, 63457, 78571, 62660, 52405, 38112, 47515, 62517, 75668, 102576, 110002, 105933, 78278, 74613, 69083, 86830, 105801, 115758, 112828, 93903, 79632, 72625, 64691, 66104, 82016, 76912, 91690, 75827, 62108, 72714, 64039, 86933, 79660, 82223, 116232, 111990, 107871, 83654, 94156, 87556, 93274, 119149, 140693, 128684, 103669, 78082, 74765, 86026, 79534, 98265, 90984, 110616, 112167, 84217, 96412]
8699I6412N821j7278j535M271J335L1826P82j2683j628K7091J8714r390j0327
8686A33411k545j1536j8949M384K4300J5081o144j7616K093K2811j3546k902k772
8673A26070J258K7965R622j7918j6349r413L2073M2853K3018j4418m9214m0294
8661A15253Q011J6863j7519o163Q363Q285J8948J5629k413n200J2936P229j081
8648A79141j854j1289k2116J9810L0852o652j9545p814n946J2566J7430K0602
8636B05185L9357M103N052n619r754q617L4222J1405k1322j7172J8961K0755J3783
8623B90339L3217K156Q179l4218K5324Q880J0134J8047J5632K9067J2457J7552
8611D36766K0997J5936M2782mk7967K4224K4689j2447k2510o478j4925k1172j5601
$$ y = [96412, 102233, 84955, 83420, 87691, 89026, 120852, 121634, 108951, 107323, 134414, 153128, 143738, 133411, 130866, 119330, 100381, 104765, 129065, 144146, 138002, 120386, 122479, 145290, 131744, 128842, 126070, 127328, 155293, 164915, 146997, 130648, 121235, 153308, 196161, 219179, 204761, 155547, 115253, 123264, 140127, 122608, 116445, 124808, 133093, 152041, 167670, 165257, 160057, 172993, 180222, 179141, 177287, 165998, 143882, 163692, 194544, 187892, 168347, 160533, 154587, 167153, 184583, 205185, 244542, 248645, 253697, 248078, 238324, 229707, 263929, 275334, 254012, 236840, 255801, 276556, 290339, 323556, 325712, 333891, 299673, 324997, 333877, 344011, 362058, 377690, 406757, 419214, 436766, 457763, 473699, 516481, 516477, 488510, 512734, 537423, 524976, 502466, 495988, 481063, 459891, 444290]
8598D44290o0621k0680J199j1218k9467l1399j2527j3910j7010J1651J9379j0292
8586B69395j7801l9787k185j5174M981o501k3200m627J0684P80J3861J1776j4347
8573A87855l723O484R092k8547j8939K3799L03J138k9262k9203n588q140j9533
8560H5736n336p844R604O559K2068N2335R471m8713r219p059j249N947p342K6209
8546A31167J9573j2839k3830j2041R090j16k4769o935L2727O379k084J2652K6820
8533A55794J335j3486j5949k3815M836j2263k2599p53K7163n875j1451n880j6936
8520F0121j6537K386K2580J5723l758n711j2800l871K672j6649l5543j4389P818
8507B042J2699J4145M838J7009K5297m663j3867K7877J5068k0064k1317P582K5483
$$ y = [444290, 383669, 362989, 364188, 352970, 323503, 292104, 279577, 265667, 248657, 260308, 279687, 269395, 251594, 211807, 209622, 194448, 199429, 192928, 169728, 165101, 175785, 176565, 190426, 202202, 187855, 184132, 190616, 199708, 171161, 152222, 176021, 176324, 177462, 148200, 118997, 113409, 105269, 85736, 80400, 72556, 82160, 88719, 110787, 163122, 172593, 123880, 114661, 107602, 106353, 112300, 104958, 131167, 150740, 137901, 114071, 102030, 111120, 111004, 86235, 79300, 112027, 118406, 116322, 128974, 155794, 157129, 143643, 127694, 103879, 108715, 96452, 73853, 73100, 100263, 94388, 82937, 77057, 60121, 43584, 45970, 68550, 84273, 80515, 74804, 62004, 58133, 60805, 44156, 8613, -5776, 2042, 14741, 28886, 33724, 50733, 76030, 71367, 57500, 85377, 100445, 80381, 59064, 66646, 92129]
8494I2129K1086l5172n302j3446L819k1945J3530J8708O375J539k5404k2816o035
8481B7066Q131P593j3220j4755j929j1508j4445K1141J8413J9561j0510k478J4388
8468D7448J2819m006j4008J2119m691j4238j9513k6663q556M3085J1036j9085
8456A5747m514J3103P584K462j0981k9055O57Q042J7171J1942R291p232N911l312
8442C6816m475K1094k3494q664L3119Q339k9870K753L866r752r692k337R318K4950
8428E1971K078k7022M034K3454k3935L735J1820K654j5013p535k1515J4280K1966
8415D0972J4351J537j4515O021L980q83Q167r945l4076j6072O0001M3242o829
8402I5951l6781j6594o888q128j2383K22j4470p385J1155K2734J1188L594M634
$$ y = [92129, 113215, 78043, 72741, 59295, 63114, 41169, 54699, 73407, 79782, 81321, 55917, 33101, 27066, 35197, 42790, 29570, 14815, 12886, 1378, -13067, 8074, 26487, 46048, 35538, 33060, 47448, 60267, 56261, 42253, 54372, 49681, 35443, 15930, -10733, -19289, 23796, 34832, 15747, 11233, 24336, 31920, 34382, 23401, -5654, -4997, 3045, 20216, 32158, 41449, 34217, 40128, 36816, 32341, 53435, 29941, 21277, 54396, 62735, 32865, 35618, 39484, 29732, 20040, 17703, 27021, 51971, 54049, 27027, 31061, 54515, 30580, 34315, 46135, 48789, 33776, 26241, 4726, 19006, 40972, 55323, 56860, 42345, 48366, 52346, 51463, 59630, 49685, 15609, -463, 59538, 102780, 95951, 59170, 42576, 35688, 27560, 15177, 15399, 929, -6456, 4699, 27433, 38621, 42215, 46849]
8389D6849N301q371j0728q112k258m242p500l366J8027N108k1141J2659k5774
8376c548k3509N627N06o87K055N495j0884J0993J0942O37L58O273n426j6710J6902
8361i76K2464j0306k186K7427J1107l4976k2893q334l106P966L7269k5804p68
8348c116K6704Q327j0756R064k047p725j2421k6969k830J1015k061K9477K7345
8335D4007J954L440j7685j5190L54P556p193J0194J954J3563m273j2833K0710
8322D6558n606k962R699J1506j0855l9060j8951M33N644J9511J6856N828J5632
8309E4233J4958j2386k0411j6082p836J2674K3041R359k7733j8313k5881L3095
8297A8718J5856j3249l155k6110J0607J3244K0901o447j4091j4588J4512J633
$$ y = [46849, 52150, 43779, 33051, 24939, 22681, 18439, 10939, 7573, 25600, 30708, 9567, 22226, -3548, -27057, -21430, -20924, -21611, -19556, -14061, -24945, -13952, -3010, -2373, -2015, 4258, -1168, -17878, -976, 21488, 11182, 8996, 36423, 47530, 12554, -10339, -18673, -21779, -13813, 23456, -2348, -3116, 23588, 31915, 21159, 30223, 28176, 20451, 8030, -18939, -21769, -10754, -12815, 16662, 44007, 45961, 49401, 31716, 16526, 16880, 24436, 17243, 27437, 29391, 42954, 38681, 25848, 46558, 40952, 37990, 47689, 59195, 48340, 9280, -9671, -9238, -3594, 15917, 32773, 38601, 54233, 69191, 56805, 36394, 20312, 12476, 25150, 48191, 57550, 29817, 11504, -14377, 18718, 34574, 21325, 18170, -7940, 2667, 15911, 36812, 30365, 16274, 1686, 16198, 17831]
8285A7831j2234K1437K4045n0929l8921L728N0602J3197k0426j2460O464r389
8273g055l814K0745L514Q502K876r122k0247m261l425L1557O140Q906L664j4446
8259B3534l0941j2224J9542O769r000J8498J6554K1635n0j3923n401j2920L361
8246B5434j2269j0114O672n386o615K636L955M613K851P451q479j9371q364k133
8232a9119J8810M2499L0204r2k3362j3533m27J6636J0983m631k0920j1627j9737
8219E684j899J6170R385L7096J3263n637o479p656j3974J3998l0435j5963K841
8206A6394p287j3302Q486L6732J9147O216k2618k0146J758J8333j2729p173k2001
8193A810l13k884l4195L2622J7393q79j7712L219K7556J1952j2994j3117J1195
$$ y = [17831, 5597, 27034, 51079, 150, -38771, -35043, 15559, 28756, 8330, -4130, 2334, -7055, -10869, 9876, 13390, 21892, 24768, 15646, -4601, -8862, -12287, 19270, 25410, 34316, 37980, 23534, -7407, -19631, -89, 6680, -2320, 16178, 32732, 54367, 54317, 40394, 34993, 22073, 25434, 13165, 3051, 9723, 4337, -2278, 358, 4313, 8926, 11777, 19228, 10749, -8622, -16986, -19119, -309, 42190, 72394, 72302, 48940, 35407, 34980, 51616, 62599, 57968, 37048, 25421, 5684, 3785, 19955, 29340, 66436, 79699, 74062, 67583, 59927, 45953, 59951, 29516, 13553, 16394, 9107, -4195, 4291, 41023, 60170, 66386, 43768, 23622, 25380, 43713, 30984, 23811, 1810, 1497, -1387, -35582, -2960, 14433, 13554, -4158, -939, 26617, 38569, 25575, 12458, 23653]
8180B3653N451o115P462m229k053K543m351Q625O955k0743k4453L4457K0439r605
8166C8036j5233J935m125j1574M423M1280j8339J395P712j4348J2794p422k1800
8153A4734N354j307K0479j623k1501j8152K5600M144J5765J4795J2767l7320j8459
8140A5276K974j721N976N612M1845j0543j0363J4387P164k6604Q936M208j5515
8127D1632k8030j5044k088J8099k362K774J6707K2735M916o408j2154N226p295
8114C8708k2212O053l334P701q760j2710r742K574M2384P858K2084M088k3598
8101E1094j5760j336Q110N750o024L538J0348j2682J1734J4133o262j5091L845
8088E1397O224l224k7066L695r667k4391J0111J160N73R608J2266J0814M570j594
$$ y = [23653, 29104, 22989, 30451, 26222, 24169, 26712, 22361, 30986, 37941, 17198, -7255, 27202, 47641, 38036, 22803, 24738, 20613, 9039, 13462, 54742, 36403, 37798, 45510, 31162, 43956, 36534, 14734, 20088, 18781, 39260, 37637, 16136, -2016, 23584, 27728, 43493, 58288, 71055, 33735, 15276, 18250, 16529, 22505, 28117, 69962, 59419, 49056, 63443, 70607, 44003, 52939, 57147, 41632, 13602, -1442, -3530, 14569, 12207, 14981, 31688, 54423, 59339, 52931, 40777, 46003, 38708, 16496, 22549, 19215, 26916, 18156, 5446, -4296, -1722, 40662, 48520, 70604, 74692, 51094, 35334, 33998, 42108, 47858, 41834, 45372, 55720, 43038, 54772, 68905, 62643, 47552, 51397, 57621, 54397, 27331, 31026, 21359, -3032, 7079, 8239, 8812, 18420, 30686, 41500, 46070, 44476]
8074D4476k908j2458J195J5418n449J3100L288o293L922J288r581J0557K1448
8061G8003M118P427J4638j8105O337k3067k6664J9263J711J2637j3897j9975J2739
8048E5165L5101J9405K8855n876o569M805j3172j5070l366N411N28m061J2772
8035A13928J340m368m5249j4635J0775L7360K1758j6303m535P96K9959K3310j818
8022A52318l3299J7821L8782j2918n169j5866p988J1882J2218R539J1374J3747
8010A92441O785j1984o710l6238k1517J398N469J4993K4386j6620l7203j3470
7998A01730K0389K8285L1329m985m791j3455j712l6924k5966K4691K6582k0255
7986A24918P213k3775O874J3665J0630j6098j5614L1819J4317K8793M3598K7028
$$ y = [44476, 41568, 29110, 30305, 45723, 40274, 53374, 56662, 50369, 54291, 55579, 45998, 56555, 78003, 82121, 89548, 104186, 86081, 92418, 69351, 42687, 61950, 63661, 76298, 62401, 42426, 55165, 90266, 109671, 138526, 132650, 126081, 130886, 117714, 102644, 99278, 104689, 105217, 101156, 113928, 115268, 110900, 65651, 51016, 61791, 99151, 120909, 104606, 100071, 100867, 130826, 154136, 152318, 119019, 136840, 175622, 162704, 157535, 141669, 133681, 145563, 157781, 167320, 178694, 192441, 199226, 187242, 180532, 144294, 122777, 124175, 129644, 144637, 169023, 152403, 115200, 101730, 122119, 150404, 181733, 176748, 171957, 158502, 156790, 119866, 93900, 118591, 145173, 124918, 132131, 108356, 115230, 128895, 139525, 123427, 107813, 139632, 153949, 182742, 226340, 253368]
7974B53368k2400j2645J209K0276J7097j2968j4543P875J428k1451k4283K780
7962A95743n655p007L477j1344j2404k9421m178L050n487K7392K8942n129j1599
7949A66380j4977j0282o960k5263o994m904O200k45k947p175o804Q656k392Q101
7935A00394J6873J2828Q338L655l0012k1519R972n02P871J3554M040j753J0633
7922A34372L4267j83m2565k1756k85j4345j0332N023k32r183j6806j3976j798
7909D2201n35J346J2720p208Q751j8965j1160J807l0968j7268j8376K6520Q139
7896b996n254L251K2993N505p824K1102K5879j1041N170n893j2786j9425j8217
7883D64J4116R438j8924o995N013K0362K7655j1864R262j666j2221q033Q46J8327
$$ y = [253368, 230968, 218323, 219532, 239808, 256905, 243937, 229394, 237269, 238697, 217246, 192963, 195743, 190088, 183081, 186558, 175214, 162810, 133389, 129211, 132261, 126774, 154166, 183108, 177979, 166380, 151403, 141121, 134161, 108898, 101904, 97000, 103200, 102955, 100008, 92833, 86029, 94685, 92293, 100394, 117267, 130095, 138433, 142088, 112076, 90557, 100529, 100027, 107898, 121452, 125492, 123739, 134372, 168639, 168456, 125891, 104135, 103850, 89505, 79173, 84196, 83964, 74781, 57975, 43999, 42201, 41666, 43012, 55732, 48524, 57275, 38310, 27150, 28957, -2011, -19279, -37655, -11135, -2996, -8250, -4999, 17994, 23499, 15675, 36777, 62656, 51615, 56785, 50892, 38106, 18681, 464, 14580, 24018, 5094, -1901, 3112, 23474, 51129, 39265, 48527, 46861, 34640, 26607, 27453, 45780]
7869D5780j3750K547j359K176R646j2815j7985J3906P405j2723k6146J275K9821
7856B7778K6680N942m303r162J5635j3061j7248J6357j907P600j814r361q005
7843C5131M870j174k1330k0654j9073j963M688m341m101O133m697k1789J8769
7830b9531L2392k0197r503l693l011K8140K8251J0082r922k6849j1826l435j5444
7817c4546j1491K7219L8020Q766k4347p240j5898R843j6967j1861l692r058j3845
7804f5097J9276J6567K2390O52j3871j34J0084J7631J8885R168k5423k9893j8524
7791c8289J2920J8430L1187J8344j0265j9927p510O99r506j902k3165K5834J1032
7778G882M32o164l0523j1762M833L2609j0651J2797J3842j8420j332j4465J2940
$$ y = [45780, 32030, 34577, 33218, 35394, 45040, 32225, 14240, 28146, 35551, 22828, -3318, -2043, 27778, 54458, 60400, 56097, 46935, 62570, 49509, 32261, 48618, 46711, 54311, 52497, 43136, 35131, 40001, 38827, 17497, -3157, -22230, -24193, -19505, -23846, -27947, -21814, -26511, -48300, -29531, 2861, -17336, -26839, -30532, -33543, -5403, 22848, 32930, 23008, -3841, -15667, -19102, -34546, -46037, -18818, 19202, 27968, 3621, -3619, -19517, -9674, -26641, -38502, -42194, -51252, -65097, -45821, -29254, -6864, -6212, -20083, -20217, -10133, 7498, 26383, 35551, 10128, -19765, -38289, -25369, -6939, 24248, 42592, 32327, 12400, 4890, 5589, -3917, -5819, -28984, -3150, 7882, 8314, 2150, -28373, -40135, -35302, -2693, -13344, -547, 13295, -5125, -6457, -20922, -7982]
7765g982R525o938J8949l008o407j9080k3223L0173q770l7423j8991K2401L1966
7752a8808K4103j831q335k5361j8926r107J3372K8841n46j6912N088J1531r733
7739b6624R330K7448J3113j6493q895j9550P423j238J5136P260j8271l1288L985
7726c8664M674k1167p065o8J1274K6089p139o824M173K5168L2226j2568Q238l4031
7712a5684k6733M878k8647m607K6962L2783K4537P78M028Q70n526r370m06J4166
7698A8029J763j3914j4105k239R376k952j6619m449n837J9491K6046P610m1836
7685a9636r580K0486K9373j2849k6897k6214J4608M38M520K420K059j0139K241
7672b9170r942j756l0133j5196Q766K500J4235M4085J616N271o018k0846j9885
$$ y = [-7982, 1543, -5395, 13554, 10546, 4139, -14941, -38164, -7991, -16761, -54184, -73175, -50774, -18808, 5295, 3464, -4871, -30232, -49158, -58265, -44893, -16052, -16598, -33510, -28422, -16891, -26624, -17294, 10154, 23267, 6774, -2121, -21671, -14248, -15486, -350, 6910, -11361, -42649, -38664, -33990, -55157, -62222, -62290, -51016, -24927, -32066, -38890, -34717, -9549, 22677, 10109, 18347, -15684, -42417, -37539, -66186, -70793, -43831, -11048, 13489, 14267, 18295, 19165, 13639, 4269, 3863, 18029, 19792, 5878, -8227, -10466, -1090, -4042, -20661, -25110, -30947, -11456, 14590, 22200, -19636, -29216, -8730, 20643, 7794, -19103, -45317, -30709, -30271, -25751, -23331, -21272, -31411, -29170, -39112, -40868, -71001, -86197, -77431, -74931, -60696, -16611, -14995, -9724, -15742, -36588, -56473]
7659e6473n268K3698J0911N354R641Q921j7779L148N371k8976q45R102J6136R799
7645g260n152j8984P55J561M737J7160n1265k7072M964J5820J0986L9642K2113
7632H005n874k0284j7346n042M368R468J1814M173j1968j6559p677J579K1500
7619b3843J8561j372r880j5310J9445J4767l2131R504l527Q935M0314R111j1696
7606B2878K3042m665l6987k4811k1670j3912m968j1914k297L3052N769j2231L21
7593d8393k997J9751J6042k5789r551K4936L3774K827j3830K3942k1180k7467
7581b7935q235r228L455J9752M5566k995j1130j851j2806j6349l766o059K584
7568b8997J9320J3341k5969k203Q388M205J7458k3784k6812m201K0529K5967o083
$$ y = [-56473, -61741, -38043, -27132, -21778, -12137, -3216, -20995, -17847, -12476, -41452, -42297, -33195, -17059, -7260, -12412, -31396, -30641, -29080, -24343, -7183, -58448, -85520, -80556, -64736, -53750, -14108, 8005, 2131, -18153, -35499, -40541, -36173, -26705, -14891, -10718, -22686, -39245, -46922, -45343, -23843, -5282, -6654, -16534, -31844, -12399, 2368, -29763, -20259, -23786, -14851, 25463, 34574, 22878, 45920, 41255, 4268, -20543, -42213, -56125, -61093, -73007, -75304, -42252, -36483, -48714, -48393, -51390, -31639, -15597, -41386, -50937, -26001, 7773, 10600, -3230, 20712, -468, -27935, -36170, -45398, -41943, -22191, 23375, 20380, 9250, 7399, -5407, -21756, -25522, -31581, -28997, -9677, 3664, -22305, -24508, -16120, -11915, 5543, -18241, -45053, -49254, -28725, -2758, -8841]
7555h841k1706j278J2809Q571n770j5583p668r091J7851J6469O470J5100K0476
7542B7809o156K97J1704J6364o316k5478k9172K51J6907P304k5505k3257K0326
7529a4922J7804R717O903o074j8848r463M137p355j1728m510J6581J7103q997
7516i652p4K154j6116J9218j0818k1004k8553l4130J0864L2141J7437J6762J5462
7503f309j801l904j6355p632k0286K6p440o407J0379p200P457J2618k0401m718
7489g1973R178J1696P216L8047P633k497l890k5141K3265K4280J604k0171j7229
7476a7982j4749m278R256k13k237J7299j9523l0108j8577K7065r668K974K7753
7463c2988k2498o112J5610L75J1179P882K0187p608n964r752j9091k7858P092
$$ y = [-8841, -30547, -31825, -19016, -10445, -16215, -31798, -39466, -48557, -30706, -14237, -7767, 7333, 27809, 21653, 21950, 33654, 50018, 43702, 18224, -10948, -10697, 6210, 13514, -11991, -35248, -14922, 2882, 12599, 19502, 13428, -5420, -14883, -10746, -18101, -29829, -34339, -17758, -655, -9652, -9726, -7572, -23688, -4470, -15288, -36292, -64845, -98975, -88111, -55970, -38533, -21771, -6309, -8110, -12014, -28369, -36001, -56287, -56261, -63701, -70108, -59729, -66929, -59472, -46854, -67255, -71973, -62795, -51099, -43883, -5836, 1797, -700, -4590, -29731, -6466, 17814, 19418, -753, -17982, -32731, -37009, -27753, -27966, -30203, -12904, -32427, -62535, -81112, -54047, -63715, -60741, -32988, -55486, -61598, -45988, -45613, -34434, -26552, -6365, -13973, -19937, -29689, -48780, -76638, -69546]
7450f9546K9439j9981o429p162K1826M381P356K820j4551n887k4581R224K4184
7437d8907J1699K815j912L1667j0246l0894n480O500O324Q094J1634k3270J2958
7424b9018q638l84j6778j1264J5621R473K2417P564l2332P725K3013o369j6133
7411c5103J3667l494j9787o252J648N53J6502J9522j9109j3087J8414r656k9440
7398f5622J9790J5653J3215q494m291R705l5837k1384K3679M322K4355j114P41
7385b5282N31J2062O853m7959J30L8608K4196K1171N83j3586j3020j9756j9392
7372c4861q078o939J8893J3279J7563L0970J1181l5015l7413j8544m239J9870
7360c3333Q606m258J0596l225j4543j2290j1720j3643K1950K4591J2602L039j0448
$$ y = [-69546, -40107, -60088, -66517, -73679, -51853, -47472, -40116, -37296, -51847, -57734, -82315, -73091, -48907, -37208, -34393, -36305, -4638, -14884, -45778, -51258, -44758, -38434, -30340, -18706, -41976, -29018, -37656, -38040, -54818, -66082, -50461, -40988, -18571, -11007, -43339, -35614, -12601, -18970, -35103, -21436, -24930, -44717, -50969, -49321, -48768, -32266, -12744, -31853, -44940, -26526, -36182, -65622, -45832, -30179, -16964, -25458, -29749, -20044, -55881, -77265, -53586, -49264, -24909, -26023, -25282, -24751, -12689, -5836, -53795, -53665, -15057, 9139, 30310, 30893, 17307, 4287, -15469, -34861, -42939, -49878, -30985, -17706, -143, 30827, 42008, 6993, -30420, -48964, -53203, -33333, -24727, -28985, -18389, -21614, -36157, -48447, -60167, -73810, -51860, -27269, -14667, -11628, -22076]
7347b2076j8546j9638l921q43K5427J6083k147q35k1773K2261J3612q911k1228
7334d2535L4712K493j1762k0438J227J6219k1946l1739q378M1363M9088P325k2256
7321f627j1604m041j8185j7114K0648J9728R264K6592J231k4939k1719J5223o344
7308a7887r027l176j3924K1093J9594K457j0368K697k5705L338K1467k2034J8490
7295a2985j2697N99K0802Q137j1373j1201O339n457l0318M838J4809J0215l5390
7282e3682K183n628l7951l914J8625P041K5667p92M664J2700P364j1499l068l293
7268d1583J7641K4971j4196q298J4341o937j5564j5211J7214K8855J8425j2054
7256G604l062O045N71J7695r238j6888l3057l2643N500J5872Q239j027J4415K460
$$ y = [-22076, -40622, -60260, -64181, -65024, -39597, -23514, -25661, -26496, -48269, -26008, -12396, -21307, -42535, -7823, -5330, -17092, -37530, -36303, -20084, -42030, -73769, -82147, -40784, 8304, 15629, -6627, -18231, -22272, -40457, -57571, -36923, -17195, -7931, 18661, 19892, -5047, -26766, -11543, -17887, -26914, -30090, -44014, -22921, -3327, -870, -11238, -8541, -34246, -30908, -9441, -31475, -12985, -25682, -25083, -4281, 3856, -7517, -18718, -12379, -17836, -48154, -43316, -28507, -18292, -53682, -51499, -57127, -95078, -98992, -80367, -73326, -47659, -48451, -43787, -31087, -23723, -35222, -38290, -41583, -23942, 1029, -13167, -21465, -7124, -14061, -29625, -44836, -27622, 1233, 19658, 7604, 4542, 10587, 11158, 28853, 19615, 2727, -30330, -62973, -57473, -41601, -33362, -34389, -19974, -17514]
7242a7514j0374j8038l012J0084j4863j8777O366J6525n777N410J197l144K626
7229d9291K1186l192K4582K8983k0718q795m273l314j6916m4715K8797M2092O007
7216D33k2475p478k6298P704L1317l494j7719n695M283n147l211k0437K4397L2083
7202a1737k7184N105k4415r490O726k899J2204n933j3919K6338N5865J0374m5773
7189b4738J5817K1612k9932J458L3158l0948m3070j6653M352J0102r28R818K583
7176d7369L8580Q853p87k3386j1290q423J8054J0672k7850q768N584J0660j0490
7163d5960p341j2373o866O1594J3798l1182j5327J9337q320k9714k0082K3256
7151e9180L1610K850m777j9934l1068j0606K2335J1305k351l202p363j1488q578
$$ y = [-17514, -27888, -45926, -48938, -38854, -53717, -72494, -66128, -49603, -55380, -49970, -48773, -51917, -49291, -28105, -31297, -6715, 22268, 1550, -7245, -11518, -14832, -31748, -76463, -47666, -5574, 433, -22042, -29520, -55818, -48114, -16797, -20291, -38010, -43705, -39422, -44569, -47780, -68217, -43820, -11737, -38921, -33816, -58231, -67721, -60995, -63894, -51690, -57623, -71542, -45204, 10661, 21035, -24738, -8921, 12691, -17241, -15783, 17375, -13573, -56643, -73296, -68944, -58842, -59770, -49952, -47369, -8789, 64, -723, -24109, -35399, -43822, -25768, -15096, -42946, -51714, -46130, -35470, -45960, -53301, -65674, -72540, -10946, 2852, -28330, -43657, -24320, -32640, -62354, -82436, -59180, -27570, -24720, -29497, -49431, -80499, -91105, -68770, -57465, -59816, -63018, -70381, -81869, -90447]
7138i0447K7017L4565Q893Q61j1457k8864j5472m652K8604J5628L498p750J5341
7125b4235p198J5965J0745k6768q453R317r118j8481K5191O320j413K8157q746
7112h717k3419m863m071K132k384Q314J4911j0763k2514j6054K6950J0984P924
7099b1570p777k0726k2551m108L4087K8199j9167j7751J7276M82j324q531k2354
7086f5815P257M783J1148J6640J7465j0961P559k6288j645K319K5019n534J4866
7073c187Q026q317M358q52R553j4943m9422n013J0055j565o319Q599o541j4158
7059f9726j3900K5996O569k8174j9424L9912K0520j3796j6302j5202J6249M4150
7047b3128Q158N301j1614K715L279J5484j0019k3615l8683j0884o022J7118K7412
$$ y = [-90447, -63430, -28865, -19972, -19111, -30568, -59432, -74904, -79556, -50952, -35324, -31826, -39576, -24235, -31433, -15468, -4723, -31491, -39944, -30627, -39745, -58226, -33035, -26715, -28128, 29, -8717, -32136, -36999, -41070, -38938, -41322, -33008, -18097, -28860, -51374, -67428, -40478, -29494, -21570, -29347, -50073, -72624, -76732, -42645, -14446, -33613, -51364, -34088, -33606, -34930, -43461, -65815, -58558, -53775, -42627, -25987, -8522, -19483, -11924, -38212, -39857, -37538, -12519, -18053, -3187, 4839, -3478, 880, 28, 9581, -5362, -54784, -59797, -49742, -51307, -57626, -49027, -55568, -69726, -83626, -57630, -51061, -79235, -98659, -58747, -38227, -52023, -68325, -83527, -67278, -23128, -14970, -9669, -21283, -18568, -15289, 195, -9824, -33439, -72122, -83006, -89028, -71910, -44498]
7034d4498k3105K8689R630Q2M709J6197K1685M31l0308l3616J5984M4801K3830
7021C4511K280k4903p578J0458j2038j1702j1535K3097m80J516k3661k0382J6469
7008b3948k205k6145j1758M013k6206J8241K7575K7459p735n083Q629j2829J59
6995b9833j0575k3700k2373J7551J4693p57J863j0118M875L0453K5563n40Q17
6982b081j4646J8337K0194l965N6p729j7259p663L9384O63j0030l8355K430j3771
6968c4435j8748k8479j1833K3321K4923J7526L342Q329k5947l5319J3432K6295
6956c7593J5443J1513J1292M440J2432l6302J6908k1177j5161l6865J2761L2461
6944b9848Q863j6859j8438m031R24r023K204K6961L2779K7164n469j4124J269
$$ y = [-44498, -67603, -38914, -29284, -29202, -24493, -8296, 13389, 13820, -16488, -50104, -34120, 10681, 34511, 36791, 11888, 4310, 14768, 2730, -8972, -20507, 2590, 2110, 3626, -20035, -40417, -23948, -26153, -52298, -64056, -60043, -86249, -68008, -40433, -12974, -20709, -25792, -17163, -29992, -29833, -40408, -64108, -86481, -68930, -54237, -54994, -53131, -63249, -58374, -27921, -2358, -2898, -2081, -16727, 1610, 21804, 17839, 17895, 10166, -7093, -14756, 24628, 25291, 15261, -23094, -20664, -34435, -53183, -81662, -93495, -70174, -45251, -27725, -24383, -16054, -42001, -77320, -63888, -37593, -22150, -10637, 655, 5095, 17527, -18775, -1867, -23044, -38205, -75070, -62309, -29848, -20985, -37844, -56282, -60313, -59389, -68412, -66208, -39247, -6468, 20696, 15227, 1103, 2372]
6931B372j4172J835J940N237q31k5017k574K7282P865j6109K858l3838l0074P841
6917f5385J1048R404K1315K3527l3243M287N422k0555J5603M743j6515K5028o516
6904b1837L650m861K021J9693j2722l0379r741M512K2329J0053J1755L599n294
6891g222j9251m071L493j352j4228L944L92j7521J9791L8505J3453R104r63k2547
6877A527j7067J5205J2081P565m192J6484J1490l187j3756l6043Q405L0502p729
6864B1285l0740K954q640J1012j807j2667o044K2986N22k47o786j72j3790j9849
6850d1983K384j5329P244J8542J0893j7800m335K3205K1266J0389O859O923p152
6837B1106M204p976L561o394j269k3549j7311N741L831K3757K8845R898J067m772
$$ y = [2372, -11800, -9965, -8025, -2788, -3619, -28636, -31210, -3928, 3937, -12172, -9314, -43152, -73226, -65385, -54337, -44933, -23618, -91, -33334, -29047, -23625, -44180, -28577, -23834, -40349, -15321, -21837, -18187, -23048, -21027, -1334, -14056, -44435, -54176, -49664, -27335, -17282, -5527, -1928, -7222, -26473, -30544, -27051, -28403, -42631, -38687, -38295, -55816, -36025, 2480, 15933, 25037, 24074, 1527, -15540, -335, 11746, 19311, 15119, 31603, 43093, 39906, 26150, -9893, -1488, 29014, 21285, -9455, -6501, -15141, -4129, -5936, -18603, -24647, -1661, -1139, -1386, -8172, -8344, -22134, -41983, -39599, -54928, -47684, -29142, -18249, -36049, -40384, -17179, 4087, 14476, 21335, 28258, 21106, 25310, 17334, 20895, 14501, 13232, -10317, -27628, -21887, -18056, 5701, 34546, 44444, 45511, 40739]
6823D0739k7776n975n368J0994K1001O603l6035j5894J6724K9847j4118j5136
6811E606j6407k5903r365K5525P911J5188L4281K7801J2036j7349m4146k6763
6799a1585R688K7420j6508k5858J551j3161j5741K9412j1414k657p626k3502J372
6786e8609J276J082J1202L008J7736o638r744K2651J1804l1948K0640j854J0045
6773i349k4428N456K0726O921j4464l6099m1888J0888K8096K0013J9304J8722
6761C898k1496L064q814R837J4780k2705K183k840l5288q960j286K0385n19K2248
6747b5513n602r116o717k375o118J5155Q924k039Q72j1733M470p533j1171P632
6733e0864J4723Q763K690j2775q174J931j5557O617K0602O599K6444J6965o540
$$ y = [40739, 12963, 6988, 1620, 12614, 33615, 40218, 4183, -11711, 5013, 34860, 20742, 5606, -10801, -36704, -46069, -20544, -12633, 2555, 36836, 64637, 76673, 59324, 15178, -11585, -1897, 25523, 9015, -16843, -15292, -28453, -44194, -14782, -26196, -28853, -36479, -59981, -58609, -57333, -56251, -45049, -42041, -24305, -30943, -40687, -18036, -6232, -38180, -17540, -19394, -9349, -33777, -28321, -7595, -674, -15138, -51237, -93125, -82237, -54141, -34128, -14824, 3898, -17598, -14534, -23348, -13511, 1269, -21436, -19253, -22093, -57381, -66341, -67627, -47242, -47761, -25513, -31115, -40231, -46948, -49323, -55441, -40286, -31362, -33401, -32529, -44262, -39792, -47325, -58496, -50864, -36141, -27378, -24688, -37463, -45637, -43706, -59263, -52646, -32044, -25445, 999, 17964, 11424]
6720A1424k1711L048j2224j9544Q911L9849M476k8257j1253q812Q493k5177j6125
6707f6902O034J3139L4630R660j1985J084K4321J3794P778j1749j1201O33m572
6694D664n785p572M833P107K5134j6782k9381J150k864K1518p32k856k4168O210
6680a9524J6057m0672K4102K3955j3921J1821J6809j367n582k4095l025j0462
6668b5904J7146l7l0885j1841q365J5826O616k1977J3148P256q424O351n607j6203
6654f2900p805R136L425K758M805J498J0219O657m250R270J4331K8408j149l0918
6640a6515k2136j1312K5004l75J765L599k6777J5582j7476p051J048N922m985
6627e3707j930K730N795L7499J9258o011q862Q274k4291J1001O052j5141J2419
$$ y = [11424, -10287, -7239, -19463, -39007, -30096, 9753, 14229, -14028, -25281, -34093, -25600, -50777, -66902, -60868, -47729, -13099, -3439, -15424, -14340, 9981, 23775, 31553, 19804, 8603, 9236, 4664, -1121, -8693, -3860, 3247, 28381, 11599, -17782, -16632, -19496, 2022, 1290, -1566, -25734, -19524, -3467, -44139, -20037, 3918, -10003, 1818, 18627, 17260, 11678, -12417, -15442, -25904, -8758, -8795, -39680, -51521, -59886, -44060, -37444, -59421, -46273, -39017, -47441, -41090, -46697, -62900, -70705, -61569, -58144, -55386, -50581, -49083, -38864, -32207, -36457, -27187, -12856, 15552, 14403, -16515, -38651, -49963, -24959, -25334, -23569, -19970, -46747, -31165, -48641, -55692, -54644, -48722, -53707, -55637, -52907, -47112, -9613, 9645, 3634, -5228, 3046, -21245, -10244, -4192, -19333, -6914]
6614f914P114o110k5271J0158K0632l520j6571j2580M611J3739K020k2712o096
$$ y = [-6914, 200, -5910, -31181, -21023, -391, -3911, -20482, -33062, -28451, -14712, -12692, -35404, -41500]
$$ [...]
##END NTUPLES=NMR SPECTRUM
##END=
