##TITLE=Analysis number 327068
Compound Code sb 01119
Project Code adrs
Chemist Name stores
##JCAMPDX= 6.0         $$ Bruker NMR JCAMP-DX V2.0
##DATA TYPE= NMR SPECTRUM
##DATA CLASS= NTUPLES
##ORIGIN= Bruker BioSpin GmbH
##OWNER= nmr
$$ XWIN-NMR		Version 3.5
$$ Wed Mar  7 13:59:49 2007 GMT Standard Time (UT+0h)  MAYBRIDGE\nmr@NMR_250MHZ
##.OBSERVE FREQUENCY= 250.131544655141
##.OBSERVE NUCLEUS= ^1H
##.ACQUISITION MODE= SIMULTANEOUS (DQD)
##.ACQUISITION SCHEME= undefined
##.AVERAGES= 16
##.DIGITISER RES= 18
##SPECTROMETER/DATA SYSTEM= dpx250
##.PULSE SEQUENCE= zg30
##.SOLVENT NAME= CDCl3
##.SHIFT REFERENCE= (INTERNAL, CDCl3, 0, 16.4419)
##AUDIT TRAIL= $$ (NUMBER, WHEN, WHO, WHERE, WHAT)
$$ ##TITLE= Audit trail, XWIN-NMR		Version 3.5
$$ ##JCAMPDX= 5.01
$$ ##ORIGIN= Bruker BioSpin GmbH
$$ ##OWNER= nmr
$$ C:\u/data/dgb/nmr/ADRS/510/pdata/1/auditp.txt
$$ ##AUDIT TRAIL=  $$ (NUMBER, WHEN, WHO, WHERE, WHAT)
(   1,<2007-03-07 13:59:30.19 +000>,<MAYBRIDGE\nmr>,<NMR_250MHZ>,
      <created by zg, POWCHK disabled, PULCHK disabled
       configuration hash MD5:
       49 4B E0 1D 92 C2 6B 37 9F E6 65 BC 52 41 86 1D
       data hash MD5: 64K
       F7 BE 60 9D 34 EF 5A 80 65 CC F5 35 48 DD 44 DC>)
(   2,<2007-03-07 13:59:41.05 +000>,<MAYBRIDGE\nmr>,<NMR_250MHZ>,
      <Start of raw data processing
       ef LB = 0.3 FT_mod = 6 PKNL = 1 SI = 32K 
       data hash MD5: 32K
       C6 BD F6 82 5B 3D EB 8B F5 F1 65 12 AD 9B 20 81>)
(   3,<2007-03-07 13:59:42.77 +000>,<MAYBRIDGE\nmr>,<NMR_250MHZ>,
      <apk 
       data hash MD5: 32K
       7D B4 1C B8 83 F2 2D A9 EC CA EE 75 3F 38 6D 54>)
(   4,<2007-03-07 13:59:43.47 +000>,<MAYBRIDGE\nmr>,<NMR_250MHZ>,
      <abs ABSG = 5 
       data hash MD5: 32K
       08 5C D6 E2 2D 88 45 60 2D FB 12 11 48 76 1A C8>)
$$ ##END=
$$ 
$$ hash MD5
$$ DB F7 F5 83 51 7A 73 4B 89 EB FD 74 E1 4F 39 B6
##$RELAX= 
##$RELAX= 
##$RELAX= 
##$RELAX= 
##$RELAX= 
##$RELAX= 
##$RELAX= 
$$ Bruker specific parameters
$$ --------------------------
##$DU= <C:\u>
##$EXPNO= 510
##$NAME= <ADRS>
##$PROCNO= 1
##$TYPE= <nmr>
##$USER= <dgb>
##$AMP= (0..31)
100 100 100 100 100 100 100 100 100 100 100 100 100 100 100 100 100 100 
100 100 100 100 100 100 100 100 100 100 100 100 100 100 
##$AQSEQ= 0
##$AQ_mod= 3
##$AUNM= <au_zg>
##$AUTOPOS= <34 >
##$BF1= 250.13
##$BF2= 250.13
##$BF3= 250.13
##$BF4= 250.13
##$BF5= 500.13
##$BF6= 500.13
##$BF7= 500.13
##$BF8= 500.13
##$BYTORDA= 1
##$CFDGTYP= 0
##$CFRGTYP= 5
##$CHEMSTR= <none>
##$CNST= (0..31)
1 1 145 1 1 1 1 1 1 1 1 1 1 1 1 1 1 1 1 1 1 1 1 1 1 1 1 1 1 1 1 1 
##$CPDPRG= <>
##$CPDPRG1= <>
##$CPDPRG2= <>
##$CPDPRG3= <>
##$CPDPRG4= <mlev>
##$CPDPRG5= <mlev>
##$CPDPRG6= <mlev>
##$CPDPRG7= <mlev>
##$CPDPRG8= <mlev>
##$CPDPRGB= <>
##$CPDPRGT= <>
##$D= (0..31)
0 1 0 0 0 0 0 0 0 0.06 0 0 0 0 0 0 0.0002 0 0 0 0 0 0 0 0 0 0 0 0 0 0 
0 
##$DATE= 1173275969
##$DBL= (0..7)
120 120 120 120 120 120 120 120 
##$DBP= (0..7)
150 150 150 150 150 150 150 150 
##$DBP07= 0
##$DBPNAM0= <>
##$DBPNAM1= <>
##$DBPNAM2= <>
$$ [...]
##$SUBNAM7= <"">
##$SUBNAM8= <"">
##$SUBNAM9= <"">
##$SW= 20.6930455092707
##$SWIBOX= (0..15)
0 0 3 0 0 0 0 0 0 0 0 0 0 0 0 0 
##$SW_h= 5175.983436853
##$TD= 65536
##$TD0= 1
##$TE= 683.16
##$TE2= 300
##$TE3= 300
##$TEG= 300
##$TL= (0..7)
0 120 120 120 120 120 120 120 
##$TP= (0..7)
150 150 150 150 150 150 150 150 
##$TP07= 0
##$TPNAME0= <>
##$TPNAME1= <>
##$TPNAME2= <>
##$TPNAME3= <>
##$TPNAME4= <>
##$TPNAME5= <>
##$TPNAME6= <>
##$TPNAME7= <>
##$TPOAL= (0..7)
0.5 0.5 0.5 0.5 0.5 0.5 0.5 0.5 
##$TPOFFS= (0..7)
0 0 0 0 0 0 0 0 
##$TUNHIN= 0
##$TUNHOUT= 0
##$TUNXOUT= 0
##$USERA1= <user>
##$USERA2= <user>
##$USERA3= <user>
##$USERA4= <user>
##$USERA5= <user>
##$V9= 5
##$VALIST= <valist>
##$VCLIST= <CCCCCCCCCCCCCCC>
##$VD= 0
##$VDLIST= <DDDDDDDDDDDDDDD>
##$VPLIST= <PPPPPPPPPPPPPPP>
##$VTLIST= <TTTTTTTTTTTTTTT>
##$WBST= 1024
##$WBSW= 4
##$XGAIN= (0..3)
0 0 0 0 
##$XL= 0
##$YL= 0
##$YMAX_a= 494859
##$YMIN_a= -630008
##$ZGOPTNS= <>
##$ZL1= 120
##$ZL2= 120
##$ZL3= 120
##$ZL4= 120
##$ABSF1= 16.44193
##$ABSF2= -4.251242
##$ABSG= 5
##$ABSL= 3
##$ALPHA= 0
##$AQORDER= 0
##$ASSFAC= 0
##$ASSFACI= 0
##$ASSFACX= 0
##$ASSWID= 0
##$AUNMP= <proc_1d>
##$AZFE= 0.1
##$AZFW= 0.1
##$BCFW= 0
##$BC_mod= 0
##$BYTORDP= 0
##$COROFFS= 0
##$CY= 12.5
##$DATMOD= 1
##$DC= 0
##$DFILT= <>
##$DTYPP= 0
##$F1P= 14.0000005364418
##$F2P= -0.99999901652339
##$FCOR= 0.5
##$FTSIZE= 32768
##$FT_mod= 6
##$GAMMA= 0
##$GB= 0
##$INTBC= 1
##$INTSCL= 1
##$ISEN= 128
##$LB= 0.3
##$LEV0= 0
##$LPBIN= 0
##$MAXI= 10000
##$MC2= 0
##$MEAN= 0
##$ME_mod= 0
##$MI= 0
##$NCOEF= 0
##$NC_proc= -3
##$NLEV= 6
##$NOISF1= 0
##$NOISF2= 0
##$NSP= 0
##$NTH_PI= 0
##$NZP= 0
##$OFFSET= 16.44193
##$PC= 1
##$PHC0= 230.658
##$PHC1= 7.746978
##$PH_mod= 1
##$PKNL= yes
##$PPARMOD= 0
##$PSCAL= 4
##$PSIGN= 0
##$REVERSE= no
##$SF= 250.130020026523
##$SI= 32768
##$SIGF1= 0
##$SIGF2= 0
##$SINO= 400
##$SIOLD= 32768
##$SREGLST= <1H.CDCl3>
##$SSB= 0
##$STSI= 32768
##$STSR= 0
##$SW_p= 5175.98343685301
##$SYMM= 0
##$S_DEV= 0
##$TDeff= 65536
##$TDoff= 0
##$TI= <Analysis number 999999
Compound Code 99
Book Reference 9
Project Code 9>
##$TILT= no
##$TM1= 0
##$TM2= 0
##$TOPLEV= 0
##$USERP1= <user>
##$USERP2= <user>
##$USERP3= <user>
##$USERP4= <user>
##$USERP5= <user>
##$WDW= 1
##$XDIM= 32768
##$YMAX_p= 390057284
##$YMIN_p= -88753
$$ End of Bruker specific parameters
$$ ---------------------------------
##NTUPLES= NMR SPECTRUM
##VAR_NAME=  FREQUENCY,     SPECTRUM/REAL,   SPECTRUM/IMAG
##SYMBOL=    X,             R,               I
##VAR_TYPE=  INDEPENDENT,   DEPENDENT,       DEPENDENT
##VAR_FORM=  AFFN,          ASDF,            ASDF
##VAR_DIM=   32768,         32768,           32768
##UNITS=     HZ,            ARBITRARY UNITS, ARBITRARY UNITS
##FACTOR=    0.157963299565203, 1,           1
##FIRST=     4112.62047299342, 0,            0
##LAST=      -1063.36296385959, 0,           0
##MIN=       -1063.36296385959, -88753,      0
##MAX=       4112.62047299342, 390057284,    0
$$ Real data points
##PAGE= N=1
##DATA TABLE= (X++(R..R)), XYDATA
$$ [...]
24186A2043j3636l4745o063J2017J4852K55K611j5627K689K934r356j3480Q561
24173c6945K8424K822J915J6593P92r257k080n311r183J9875K2968L6754l3178
24160C4189r953M167l5535j5279O77p006j2118J7468J1855K6860J4290j0892j672
24147A7051m370l765n761J1244J0692j0629q234r899N420J7165N380l199j1360
24134I735l2658K450L8292j782k1937K1181J5208N378Q37m373K915j8123k1757
24121d634m53K3688J3422q386O925l834j5371j0322K516J351q839l72L281n179
24107f207J5613j6264q457J3177j8486M631q24n216j1589j8562p705J0948K7961
24094b0980J4210Q697L0596P811o118l1074l888k012k7297k478K0990k483r511
$$ y = [12043, -1593, -36338, -42401, -30384, -15532, -15277, -12666, -28293, -25604, -22670, -32026, -45506, -36945, -8521, -5699, -3784, 12809, 13601, 4344, 2264, -3047, -12230, 7645, 30613, 67367, 34189, 24236, 28403, -7132, -22411, -21734, -28740, -40858, -23390, -11535, 15325, 29615, 18723, 17051, 12681, 8916, 3155, 14399, 25091, 14462, 6228, -3671, 1749, 18914, 24294, 21095, 9735, -22923, -20473, 17819, 16037, -5900, 15281, 30489, 35867, 36704, 32331, 35246, 17123, -4634, -5087, 18601, 32023, 23637, 30562, 26728, 11357, 1035, 3551, 4902, -3937, -4309, -1028, -6207, 9406, -6858, -15315, -2138, -20624, -15993, -16817, -22033, -33622, -52184, -59889, -48941, -20980, -6770, 1927, 32523, 40334, 34216, 3142, -746, -2758, -30055, -32533, -11543, -14026, -23537]
24081b3537k724n141l483L872J5822j780N450J1550k1260J5181J0316q189K781
24068a142R245o275q279O557N719k4289j3875J0991j4454j117J0079j0929Q86
24055c6883o902n40Q842R748P875j796j6294n682J5948J0798j0875k926R198J769
24041a7720j1645J4495K1154p29r176p537p902J4211K40l8013q697J3366K1044
24028a6909R550n033k0643M337J8367K2369l52j4434J0145Q084l5234r307K8453
24015f07K3288o302l8438k6400N918P393j151J2180K7392l060k8700K596K2271
24002c620K7853Q069j7138k3160m5559j1930L3407K1133P331J6704M970m010j9243
23989e193j2225l799J5522n92j9918k710J3484l707k947R898l565M973K645M951
$$ y = [-23537, -26261, -31402, -34885, -31013, -15191, -16971, -11521, 29, -21231, -6050, 4266, -3923, -1142, 8103, 1828, -6451, 106, 5825, -18464, -32339, -21348, -35802, -36919, -26840, -37769, -36883, -43785, -44325, -35483, -25735, -17860, -19656, -35950, -41632, -25684, -14886, -25761, -28687, -19489, -17720, -29365, -14870, 6284, 5555, -3621, -11158, -19060, -4849, -4609, -42622, -51319, -37953, -16909, -7359, -12392, -33035, -28698, -10331, 12038, 11686, -2748, 7397, 15481, -19753, -29060, -607, 22681, 16379, -22059, -48459, -42541, -35148, -36299, -24119, 3273, 213, -28487, -25891, -3620, 24233, 32302, 15164, -7996, -53555, -65485, -32078, -10945, -3614, 13090, 18060, 14050, -5193, -17418, -21217, -5695, -6287, -26205, -28915, -15431, -19138, -22085, -12187, -15752, -10779, -8134, -3183]
23975c183j4106j864j0629k362N158L1398Q863k2551l629P451n220O155J9051
23962A4532P199j4281J914J6573j1816j5913j414K202q725J3805K4588J564k3245
23949F983k2793J3980m247K7086N993p991o243j3723q118Q70O156k798J1075N608
23935A1838m242j174K9600j4701p58O590j25q417k7145k556K0595J6535j4467
23922A1573j7877l200j0598L410J7337r941Q58k6205l006M504K7436k645n143
23909a3497L625j4908j5308K592Q784L8652K7638k737k678K186n291q287k914
23896A7857r203J1475K7961j832j9480P965O822J6721l570j4686k8641k8879Q617
23883h873j344M065j7498o783L324J342L9604k426j3746r051p73K438J1849j2359
$$ y = [-3183, -17289, -19153, -29782, -32144, -26986, 4412, 13275, -9276, -12905, -5454, -10674, -4519, 14532, 21731, 7450, 9364, 25937, 14121, -1792, -3206, -1004, -9729, 4076, 28664, 30228, 6983, -15810, -1830, -6077, 21009, 27002, 19011, 12768, -955, -9073, -8203, -2047, -4845, 6230, 11838, 7596, 6422, 36022, 21321, 20563, 27153, 27028, 18611, -8534, -11090, 9505, 26040, 11573, -6304, -9504, -20102, -16692, 645, -9296, -8438, -34643, -37649, -33145, -5709, -8354, -13497, -9872, -24780, -40088, -37496, -28712, 9940, 37578, 34841, 32163, 34349, 29058, 20771, 17857, 8654, 20129, 48090, 46258, 26778, 34743, 41565, 58286, 54716, 40030, 11389, -17490, -8873, -10217, -6152, -23650, -30433, -27109, -25767, 13837, 11411, -2335, -11386, -12159, -9721, 2128, -10231]
23869a0231j4920j9909P872K1319J6342p869K671J645k4755J1148J7169J7969
23857A8451O938p319r892l936Q911q048l8510j3462K6628j368j8759J7569L2118
23844I321o04j2472k6217l097Q746J4999r47J2660R220l538K700r303K284Q384
23830A2136l5654j1298J8782J3042L613K0653q765l1357l2244K8741L4184R967
23818B1800j8385k2113K188O019O791N480J6046r009J6447r497l5876j3523K9303
23805d329K5152j3966j1606K756k983r921k518K12J0673J1035j5179K7811N291
23792B2428j3944j4861j760J755q00j6320J651N821j6007j511K0045J0209J5215
23779A1921j2357l666J184q417j2308n418J7387j453j9513N992L0050k456k8410
$$ y = [-10231, -25151, -45060, -37188, -15869, 473, -7396, -4725, -3080, -27835, -16687, 482, 18451, 25389, 18070, 8178, 4242, 13153, 5105, -33405, -46867, -20239, -21607, -40366, -22797, 9321, 8717, -3755, -29972, -33069, -24323, -9324, -10271, 2389, 11609, 8071, 10771, 1468, 3752, 12136, -23518, -34816, -16034, -2992, 621, 21274, 12509, -18848, -51092, -22351, 11833, 21800, 3415, -18698, -16510, -10491, -3700, 1780, 17826, 8817, 25264, 15767, -20109, -33632, -4329, 20823, 6857, -4749, -1993, -4976, -14897, -17415, -17203, -6530, 4505, -10674, 17137, 22428, 8484, -6377, -8137, -6382, -7182, -23502, -21851, -16030, -32037, -33548, -13503, -3294, 11921, -436, -4102, -2918, -11335, -23643, -29061, -11674, -13127, -32640, -26648, 3402, 946, -27464]
23766b7464R706L270K0413j886k2902j6710L2388K1349j3252M053K138k0469L642
23753e724J0457J5549K7031L822m409Q98k4847j1299J7965J7457J24M766j438
23740E0352j1933J3282Q340k6600n62j5039O434r642k66j1225j8301k4601l974
23727d3735K2958j289M914m798P977K4099p753o741J8967j601j0253J737j0560
23714f078j2022j8067j8634R396J3868J3731K7923K1396m744j542K120J473r403
23701A9417q537j7654p8J5790K0727L012j2637l8519j2838J6621K5589l881P316
23688A4328m899o453L367J1615K990n126m970j7604J7842k824k0802N76n305j7835
23674c5100m738j3043P410J3085K2825K6243j270j7361r110O959J8435N018O906
$$ y = [-27464, -17758, -14488, 5925, 4039, -18863, -35573, -3185, 18164, 4912, 8965, 11103, -9366, -5724, 4733, 20282, 47313, 51135, 46726, 47624, 22777, 11478, 29443, 46900, 47024, 51790, 50352, 38419, 51701, 60041, 33441, 32879, 17840, 24274, 14632, 14366, 3141, -15160, -39761, -43735, -20777, -22066, -17152, -21950, -13973, 10126, 2373, -4368, 14599, 12998, 2745, 4482, -6078, -18100, -36167, -54801, -45405, -31537, -17806, 10117, 31513, 26769, 25227, 27347, 28820, 19417, 10880, -6774, -6852, 8938, 29665, 32677, 20040, -18479, -31317, -14696, 10893, 7012, 14328, 9429, 2976, 6343, 17958, 20948, 15822, 10852, -6752, 11090, 8266, -12536, -11960, -17265, -35100, -39838, -52881, -45471, -32386, -9561, 16682, 15412, -1949, -11059, -4100, 14335, 19353, 26259]
23661B6259j3583k0663k0342k9787R785K3366J8514k750n491P775k776J4735K2916
23648B7958Q984j8643k4266j1919Q098K483m44M101p43L012M386P177j5642N684
23634B26j3660Q383J2927l832J6185J3975p980o793j0151j4951l159m975l8085
23621e1890m755J6353K5579j758M327q43P332J2453J818J2833N422R654j8736
23608A7789L222Q701K7555R59j6192k787O712j7599l5453j5032q70N550L1563
23595A4118J2467j5180q230j2292M074J5989m907J3710O354j2034p210j1235r163
23582a3539K398P269M192J515j1709l080j0334K7562k9849k7125J4346K1834m611
23569b1131j5157J3720J6197J3120j15l320j7710j0237J4723m100J653j3701j4370
$$ y = [26259, 12676, -7987, -28329, -58116, -48331, -24965, -6451, -9201, -14692, -6917, -9693, 5042, 27958, 36942, 18299, -5967, -17886, -9788, -7305, -7749, -3648, -4391, -1379, 3007, 10184, -5458, 226, -13434, -5051, 7876, 4044, 20229, 34204, 26224, 19431, 9280, -5671, -8830, -13805, -51890, -56645, -40292, -14713, -16471, -12144, -12987, -5655, 6798, 8616, 21449, 26871, 36525, 17789, 21011, 29712, 57267, 58226, 42034, 39247, 45959, 28360, -7093, -22125, -22995, -17445, 14118, 26585, 11405, 3175, -9117, -5043, 10946, 6039, 19749, 26103, 14069, 6859, -4376, -13539, -11141, -3872, 320, 1835, -9874, -12954, -23288, 4274, -25575, -52700, -38354, -16520, -21131, -36288, -22568, -6371, 6749, 6634, 3314, -14396, -24633, -9910, -14010, -12357, -26058, -40428]
23556d0428j225L9914J7546j3832j7557M098l312n562j7637P731J9662J201j1873
23543b1274R267K0852J5264k602J5294j1786j3411j6762r836K874L331K1524J0202
23530B2937j453j0077k7326J3367K9640J0704n184R155J3835m082l0408l4117
23518a3009L94j0111K345j728m956P927O762k2329k1142K6403J2762J7661n24
23505D55n107j3688j4896R169J3004r9j0545K262j2238n912L6829L753o26j4520
23491a2159k6794J7174J0869k4167l843K7306M0362m342j5894j9674J0405L682
23479B925J585j1838O081j2029L264J0012q312r693L736J1797j3702o889O180
23466a6883n833k2063J4616L8213k2961k1182R429K209K256M260n777k413l415
$$ y = [-40428, -41653, -1739, 15807, 1975, -15582, -11484, -14796, -20358, -37995, -30264, -10602, -9401, -21274, -12007, 8845, 24109, 21507, 36801, 25015, 11604, -5158, -14994, -12120, -8789, 12735, 22937, 21484, 11407, -15919, -2552, 27088, 37792, 32608, 41763, 55598, 51516, 21108, -13009, -12615, -22726, -20381, -22109, -27065, -19138, -12376, -34705, -55847, -29444, -16682, 979, 455, -4652, -18340, -33236, -24067, -11063, -11162, -21707, -19445, -31683, -37595, -766, 2987, 2361, -12159, -38953, -21779, -10910, -35077, -38920, -11614, 28748, 24406, 8512, -11162, -757, 2925, 4510, -7328, -1247, -13276, -10012, 0, -8312, -18005, -14269, -2472, -16174, -23063, -16883, -22716, -44779, -30163, 8050, -14911, -36093, -26664, -24455, -22199, -17939, -23716, -26129, -29544]
23453b9544J2348J0738K0225J9633k0370j8406k8560K740j473J1366J8586L12
23441b405j1637N513L2574j0586J2722r26j6031L301J945p697o262R974J4844
23428B5329j7128k2554O818J1886r787j9686m1747j2331O573J4995L7372p834
23416b8094J267N337M8J3978J5356K2200P91m406j6578n52P888o578J1330k3735
23402a748k1408J4866O670r325K929k4081l354K9193J0381k7320q776J1301N830
23389a4842N665J6557J5795j2921j5265J9839K0594j4704q635K2924K208o321
23377C0894l9061K82K2517K0251j9263O810Q702q133k1220J121L48j5319M248
23364g823N647m547j0144M894R540j3391l072k731p597j1892N512K2525J2581
$$ y = [-29544, -17196, -6458, 13767, 33400, 13030, -5376, -33936, -31196, -32669, -21303, -2717, -2405, -14042, -8529, 24045, 13459, 26181, 25255, 9224, 12525, 14470, 6773, 511, 10485, 25329, 8201, -14353, -7535, 4351, -5436, -25122, -66869, -79200, -72627, -57632, -20260, -28094, -26827, -21490, -21442, -7464, 7892, 30092, 30883, 26477, 9899, 9347, 17235, 10657, 21987, -1748, -23156, -8290, -1620, -10945, -8016, -32097, -35451, -6258, 4123, -23197, -31973, -20672, -14842, -9177, 7380, 23175, 10254, -5011, 14828, 35422, 20718, 12083, 35007, 37215, 30894, -8167, -7885, 14632, 34883, 15620, 22430, 31132, 22999, 1779, 2900, 3248, -12071, -7823, -2176, -6723, -16867, -11973, -2433, -15824, -18896, -21627, -29224, -41116, -35604, -13079, -498]
23351d98K6394P645j2261R888j0335j3951l7172m449N488J3984J6691O767K2313
23338C0504R021r577j6618o216j8680P742J0368Q609j2672m751j2242j4435L75
23325b8572L3994J2568J7968J4844J0283k0419j6766J0592q236J4217q175l9552
23313g254q602R212l775K3942R737l0489J91k025l8839o212K5369J8308r616j3808
23299c3861L029r630n503Q414K8258J7754O582j3207j4826j352K864J083q152
23286a8547P858l738L6157q602l6766J1190J4172r354q523j0522K9224J9948P297
23273B9794j0050k515r977J3201k108j3386l918k3329j1053K4110J4735O339L551
23260A5394K717o208j287k3625k6292L8638K2789j1235j7025k3538P55M388J4168
$$ y = [-498, 25896, 33541, 21280, 31168, 20833, 6882, -30290, -34739, -29251, -15267, 1424, 8191, 30504, 39525, 29948, 13330, 7114, -11566, -3824, 6544, 15153, 2481, -2270, -14512, -28947, -28572, 5422, 17990, 35958, 50802, 61085, 40666, 23900, 34492, 26256, 40473, 32298, -7254, -15856, -6644, -10419, 13523, 23260, -7229, -7038, -9063, -47902, -54114, -28745, -10437, -20053, -33861, -30832, -40462, -45965, -37551, -9293, 8461, 15043, 1836, -12990, -14342, -11478, -10395, -18547, -10689, -14427, 21730, 13128, -23638, -12448, 1724, -7630, -16153, -26675, 2549, 22497, 29794, 19744, 17229, 7252, 20453, 18345, 4959, 1041, -22288, -33341, -9231, 5504, 11843, 15394, 18111, 11903, 10616, -13009, -39301, -663, 22126, 10891, -6134, -29672, -28917, -24529, -10361]
23247a0361k82j4425J413j1511K3085L215J116K893l005J1096Q889q620J8708
23234B2211J6919J7202k4980l3810J2838n831K421j8027j5358J1112J4140j3176
23222a4339n127N984o553K544J4267J9477k8041j573J3294K4958M992j3579l1925
23209a5621j8717n54J5023j0150M529L0429J4830j4600J82J5881q505K1258r375
23196B4610k845j4076j4558O150J2381k086m406J251j527n833o393k0561K1599
23183f294L1614m021l4172l2975R202N556J8505K4725j1500M948K6470n153l9898
23170a2993K30K5372M506k2233j1573K99j2456o489O26K0569k2273j078K2527
23157a4966k692q434Q867M757J0933K261K938R382q401k896p542o727r577j0577
$$ y = [-10361, -10643, -25068, -23655, -35166, -12081, -8866, -7750, -4857, -7862, 3234, 12123, 3503, 22211, 39130, 56332, 31352, -2458, 10380, 4549, 6970, -11057, -26415, -15303, -1163, -14339, -19466, -13482, -20035, -17491, -3224, 16253, -11788, -13361, -67, 24891, 29883, 16304, -15621, -34338, -34892, -19869, -30019, -25490, 4939, 19769, 5169, 5351, 21232, 12727, 33985, 24610, 21765, 7689, -6869, -719, 11662, 9576, 5170, 6421, 4894, -939, -7332, -27893, -6294, 25320, 21299, -12873, -45848, -36646, -31090, -12585, 12140, 640, 5588, 32058, 26905, -12993, -12763, 12609, 17115, -5118, -16691, -16392, -28848, -35337, -34711, -14142, -36415, -37493, -14966, -17658, -26092, -17225, -12468, -1535, 726, 3664, 13046, 4645, 1749, -5793, -12520, -22097, -32674]
23143c2674N353q125J3092L0736J2971j1967k9803K160J2004L53j0707J1934q43
23130e516n280J7984o744m834j2119m936K0754J5511J92m951J837o393P635j3
23116A3127j2277j3928M706P829m780l0118J8717J5452j3233j1375k640K0865
23104g655r68M313J1720O64j0200j4511R34R909K069j0487P709K9467p27l4776
23090a2539l3388m782K9507K8557M521M033l492J0729k3400l156n675k4496q265
23077d1846L2864K4734n861j5741J1181r918l0605l3R588Q328r645P325J4613
23064e016J2538p615j8315J0745K0547M372J3171q037J6343o968r583R137j5643
23051A5676N30K6193k489j6833k5725J7655K2132j6758j4916k606J1515k924j0457
$$ y = [-32674, -27321, -35446, -22354, 8382, 21353, 9386, -20417, -18257, -6253, -5900, -16607, -4673, -5516, -10796, 7188, 444, -4390, -16509, -21445, -691, 14820, 15012, 10061, 11898, 5505, 13140, 13127, 850, -13078, -8372, -543, -5323, -35441, -16724, -1272, -14505, -25880, -28520, -7655, -8623, -4310, 7410, 8074, -2126, -16637, -15703, -5794, -3725, -14212, -6503, 22964, 22237, -12539, -45927, -50709, -21202, 7355, 11876, 15909, 12417, 23146, -254, -3410, -9085, -33581, -41846, -8982, 15752, 9891, -5850, 5331, -4587, -35192, -35225, -25637, -17309, -26954, -19629, -5016, 7522, -93, -18408, -7663, 12884, 17256, 30427, 22390, 38733, 31765, 22182, 31319, 15676, 16206, 42399, 39910, 23077, -2648, 15007, 37139, 20381, 5465, 2859, 14374, 11450, 993]
23038I93k2513P416K7763k198n046j7878K9724j069j9333j0454k0543j342J1038
23025b3442L6420o96j468J2358J1809j1287k3828p343l334p814j4657k27j68j629
23011c5306K8011J3820J5334l876l7282j1909n581Q204R801k344n1n858J9218
22998g819l824r613j3855J4930l055j4792J9711L0356N500p179R699L5348L037
22985E8444k9955q750M663p46K946q017j1421k2230o143p425K7372P204Q41p139
22971c56j1719j724k2689J8510j092K8206k837j8665j2139q019K1194Nk3483q314
22957d3122r289q057J9322r994j3231J3620L3764L1004M014j0924k5064k0443
22945c8400k606q534J7702J1760K2949P197L380N598J0744j2233k5426J7016J2267
$$ y = [993, -21520, -14104, 13659, 11461, 6415, -11463, 18261, 17192, -2141, -12595, -33138, -34480, -23442, 12978, 12282, 10814, 23172, 34981, 23694, -134, -7477, -10811, -18625, -33282, -33509, -33677, -35306, -7295, 6525, 21859, 17983, -19299, -31208, -36789, -28585, -18784, -21128, -21179, -27037, -7819, -11643, -21256, -35111, -20181, -23236, -38028, -18317, 12039, 17539, 10360, 20059, 55407, 58444, 28489, 19739, 24402, 23656, 26602, 18585, 7164, -15066, -21209, -28634, -1262, 5942, 6783, -356, -12075, -13799, -36488, -17978, -19070, 9136, 6299, -12366, -24505, -32524, -11330, -11325, -34808, -43122, -52411, -60468, -41146, -51140, -64371, -50751, -16987, 14017, 18031, 7107, -17957, -38400, -41006, -49540, -31838, -20078, 2871, 10068, 13448, 19046, 29790, 17557, -7869, 9147, 21414]
22932B1414k3250j1024Q395K947O675Q199j2134k6484o193J2262J3226O732j3305
22919a2540j528m903O175N665M606J4954r006l543m225l260J2484J6253l667q164
22905I301j1615j33J9181J400j1570j1808k0252O295K7200q78J1099K3170J6475
22892E7865k6838r940j3120l55k9004l997J4267m013j7129k0094M408L5404J6736
22879D190j4496l246j3565Q531M149P87j087M762K1833Q237Q803j5509l1554J82
22865a7983K3073p907n372J5468M604n789O352j8365j3904R659q751L1945J2014
22852B5044p47R154j7232k4210P50j7995l7179K0917L3345L517M997j1746k207
22839a3592k336l109J9464Q795J9125R524j3678r978k0778j4890J5526m628q139
$$ y = [21414, -1836, -12860, -4465, -1518, 5157, 13356, 1222, -25262, -31455, -19193, -5967, 765, -12540, -14068, -18971, -12796, -7131, -2525, 12429, 3423, -120, -4345, -7605, 4879, 21132, 17465, 9301, -2314, -2447, 16734, 18134, 6564, -5244, -25496, -19201, 7999, 7121, 18220, 41390, 57865, 31027, 21087, 7967, 7612, -21392, -25389, -11122, -15135, -32264, -52358, -47950, -12546, 4190, -10306, -13552, -27117, -18586, -14437, -13650, -14737, -9975, 11858, 20095, 28898, 13389, -18165, -17983, 5090, -2817, -8189, 7279, 11883, 6094, 12446, -5919, -19823, -10164, -18915, 13030, 25044, 24297, 33451, 16219, -7991, -7241, -25236, -62415, -41498, -8153, -4636, 361, -11385, -13592, -15928, -19037, 427, 9222, 28347, 37871, 24193, 14215, -6563, -21453, -5927, -10555, -18694]
22826a8694Q18J7959J6757k8199k4728J626K3270n310l9684M981K6336Q748J923
22813a4197J93r844j1657n940K0530J4081M47M375j4133L392K06j2823K4218J0619
22799I467N945R854K698j8837l3977o239P011R824Q391M658k8007r419p087P071
22785c8647K7282N792k1758j9640R248M204K0426K5522r764L278j6787o247L708
22772a3383J0533P105r201m950m564P779J618L59r513k6781L237J3906O828p03
22758a7730o241j9086J7997K4329K4320J674k8236p349j2473p16J3789O126J8931
22745A5335K4770k4660j7526k947n45j0400K1K213m322n936l090r404k363J3427
22731b5427Q59O610j04j3317R051L2278J3479O037k5621n408J2771j626p807j2863
$$ y = [-18694, -17876, 83, 16840, -11359, -36087, -34461, -11191, -16501, -56185, -51204, -24868, -16120, -14197, -14004, -23848, -35505, -41445, -20915, -6834, -6387, -2012, -16145, -12753, -12547, -25370, -1152, 9467, 15412, 25266, 27964, 9127, -24850, -31089, -24078, -14254, -5863, -1205, -29212, -38631, -45718, -38647, -11365, -5573, -27331, -46971, -37723, -33519, -13093, 12429, 2665, 5943, -10844, -17091, -13383, -2850, 4255, -4946, -9896, -14460, -6681, -5063, -4704, -14217, -40998, -37761, -23855, -17027, -17730, -23971, -43057, -25060, -731, 23589, 25263, -2973, -10322, -22795, -23511, -9722, -3596, 15335, 40105, 15445, -2081, -5028, -5573, -15973, -15952, -13739, -18061, -23997, -27087, -36491, -38854, -25427, -24568, -17958, -18062, -31379, -22328, 9950, 23429, 29466, 3845, -1563, 11208, 9582, 1775, -11088]
22717a1088J5642K5781j0441k2184M335J4428J1241r454K765j7678l1822R216
22705a9259L0389J3168j5495j2657J9377N101j3113J1962J7835j5257j5062j7865
22693a0876k895j0676l756O975K167J3188j5525j177J7614k676j3156r412o997
22680c7202P776J7760O828J8684j5087J167j6547j7795J8522J037j6503l667K12
22667c4815J6129O138q08q696K3910K0393l321k3697j833k4109j5230k248P085
22654d1102K9752J1433J8181Q093j7307k1990J432J9848K160J6371L690k8418
22642B143k3278j4126J1757J9512j0902j3926K3506J7109J3587k252k649j9927
22630E54K186J6768J0167l931q689r156k6328l1011L3253L4961N732j3981o64
$$ y = [-11088, 4554, 30335, 19894, -2290, 2045, 16473, 27714, 18260, 21025, 3347, -28475, -19259, 11130, 24298, 8803, -3854, 15523, 20624, 7511, 19473, 37308, 22051, 6989, -10876, -13771, -24447, -28203, -21228, -19061, -5873, -21398, -22575, -4961, -7637, -20793, -30205, -37202, -29426, -11666, -4838, 13846, -1241, -74, -16621, -34416, -15894, -14857, -31360, -35027, -34815, -18686, -12548, -13356, -22052, 1858, 22251, 18930, -4767, -6600, -30709, -45939, -48187, -41102, -11350, 83, 18264, 26357, 9050, -12940, -11508, 8340, 10500, 26871, 30561, 2143, -21135, -35261, -23504, -3992, -14894, -28820, -5314, 11795, 25382, 23130, 20481, 554, 2740, 19508, 29675, 25744, 17055, 7899, -18429, -49440, -16187, 18774, 24506, 10525, 9861]
22617I861j6371J5550Q489P854J8301j7962l3074j8160J8129K576n845J2193J0659
22604A2200n150m937r882j3751m467J0668m651O081R002o178k0073j797L508M234
22590b5193O152J4761l31k1952r126J1866J1983K276j5904N428J0581J0618R747
22577A0906o655j0354J9365O186j6887K027J0458l770k8307l715m233N53K2695
22564a731N223j9498l1997L027P431J2669m781J2606N673n631L277J3051J0686
22551A0005n341j9918L368M4813R265k4707l761j259j9552p574o02K9897J5024
22538B9658j44j1669q077J8261J052k1086r212K104m22o251j2850j1149K476k937
22524c0246P362p409l969J9661K5093N082j5551l922j7614j1191L0098P127j2979
$$ y = [9861, -6510, 9040, 17529, 25383, 43684, 25722, -7352, -25512, -7383, -4807, -10652, 1541, 12200, 7050, 2113, -7769, -21520, -25987, -15319, -19970, -13889, -4887, -11065, -31138, -32935, -29427, -25193, -19041, -4280, -4611, -26563, -35689, -23823, -11840, -9564, -25468, -20040, -9459, 1159, 10906, 4251, -6103, 13262, 19448, 2561, 4588, 15046, 11276, -17031, -20746, -24979, -24426, -1731, 3492, -16006, -48003, -44976, -37545, -24876, -29657, -17051, -11378, -17009, -13732, -681, 10005, 4664, -15254, -11886, 32927, 42192, 17485, 13724, 12465, -7087, -14661, -15263, 14634, 29658, 29514, 17845, 9768, 28029, 29081, 7995, -1217, 887, 465, -5786, -18636, -29785, -27309, -30246, -22884, -30293, -34262, -14601, 10492, 15574, 23, -3899, -21513, -32704, -2606, 4521, -8458]
22511h458o130L1959J9263l570r87l0864j47J9484j6962l0991n130J1917j9005
22498c9621J2341M577O869O646M570n843n390J283o881k5269K3644K4095j9350
22485a8329R492J0625p019k1532J195r051J3747K1057o766R340k33N209K094j2085
22471b256r459L2424J5439m0507j6175K0305J3732k072p798j134j465Q475p898
22458A611M540q111o659Q189M890j5984M302j348M747J7074J0800l0429j5863
22445b2241N564J6772N059M245k4342k3816K1780L50j7344J4009J2036l909j460
22432a3297M160j9752j3482j6884J3014J8029L5969K0139j236n172K832o513n550
22419A2257j5878j4584R274R098l1128k9357n305J2440Q044l997J7081R136R003
$$ y = [-8458, -14588, 17371, 36634, 33064, 32077, 1213, 1066, 20550, 3588, -27403, -32533, -20616, -39621, -27280, -22703, -15834, -9188, -4618, -10461, -15851, -14568, -21449, -46718, -23074, 1021, -18329, -8837, 1788, -5231, -26763, -25568, -34619, -20872, 185, -6581, 2759, 2526, 7735, 9829, -2256, -11715, 20709, 36148, -4359, -20534, -229, 13503, 11431, 3633, 2499, 1034, 9509, 1611, 6151, -1960, -8619, -430, 4460, -11524, -7222, -8570, -3823, 13251, 24051, -6378, -22241, -16677, 95, 5154, 9399, -14943, -38759, -16979, -16629, -33973, -19964, -7928, -11837, -13297, -9137, -28889, -42371, -59255, -46241, -28212, 7757, 27896, 26660, 21488, 24320, 17807, 12257, -3621, -18205, -8931, 167, -30961, -60318, -65623, -53183, -45139, -49136, -32055, -22919, -13916]
22406a3916p689m56q425k1675M784k608O205K2110j615J1730j32O07L293K538
22392e249J8796K4794k4662j5384r02p208l022J0700j4673J2119K4685K196j0449
22379A1741Q402j0817o849P549j1231o901N313R400J3768j5528l2200J3370L3480
22366A9497O084r843j9533Q73j8607J0026L5884L691l1847j8986j1733j7756J655
22353e0595K7500Q422j789N831K478O136K0532j1140m092k216R101j0698j6505
22340a7035j9698J2213k51q422j8002j659K671R932J8872L7538J7863j7348r312
22327G362o874M115p067L950J0876J4623l295R578k3814l1110J4827L7210J8800
22314D9181j4779k3264j2226O20j1994J4639J1193Q961j1627j4532j0172R883
$$ y = [-13916, -21605, -22061, -30486, -52161, -47377, -49985, -43780, -21670, -23285, -11555, -11687, -11080, -7787, -5249, 13547, 38341, 13679, -1705, -2607, -9815, -12837, -2137, -16810, -4691, 19994, 22190, 11741, 20143, 9326, 2477, 10026, -1205, -8106, -2793, 6607, 20375, 4847, -27353, -13983, 19497, 25581, 15738, -3795, -2922, -21529, -11503, 24381, 28072, -3775, -22761, -34494, -52250, -50595, -23095, -14673, -16462, -10631, -8153, -2017, 18515, 7375, 3283, 1067, 10168, -530, -17035, -36733, -24520, -24771, -33193, -51195, -52854, -50183, -40251, -21379, 16159, 34022, 16674, 7362, 488, 4603, -2464, 1486, 12362, 26985, 23690, 33268, 9454, -21656, -6829, 30381, 49181, 34402, 11138, -1088, -468, -12462, 2177, 13370, 22331, 10704, -3828, -14000, -4117]
22302d117k1380k2469J7943K903j7723K6448L9706M620m3644k944J2605k819q001
22289a8872N109n139l487p189K0087L8985k250M538l7352j6129m230K5237o045
22276f737j4568n913Q675J8339L3102j3456k9553o351J6315K214n86P06j2676
22263a0489r662p426O438J0420j0675L78P077j5759k6751R977l376K6796J8955
22250d097L4041p948l6630J5852K182n177J3445m329n239K1647l933k2262k6248
22237b8696k5950R609P297R049O908J8657N668j093j2017m489j5143J9526L3641
22224B2967K3012J2582k6440O025k808j2430j6477K168r917J6159p077j0905J0714
22211G573J2180N624r721M389n702n940o903n363j5612j1544J2061P904J1420
$$ y = [-4117, -25497, -47966, -30023, -27120, -44843, -18395, 21311, 25931, -17713, -20657, -8052, -10871, -18872, -13763, -18902, -22389, -29578, -9491, 29494, 27244, 31782, -5570, -21699, -25929, -692, -6737, -21305, -27218, -18543, -204, 32898, 19442, -10111, -16462, -147, 2067, 1481, 2187, -10489, -20151, -27577, -21139, -10719, -21394, -21016, -13939, -29698, -56449, -46472, -49848, -23052, -4097, 29944, 21996, -14634, 1218, 3400, -1777, 11668, 7339, 2100, 23747, 19814, -2448, -28696, -54646, -45037, -37740, -28691, -21783, -3126, 2542, 1449, -10568, -15057, -30200, -10674, 22967, 45979, 58561, 32121, 38146, 35338, 22908, 6431, 8599, -1318, 14841, 7764, -3141, 7573, 19753, 25377, 15656, 20045, 14343, 8403, 1500, -3863, -19475, -31019, -18958, -11054, 366]
22198C66j3526j6589K369J1175J1909j2791R466j0964m750o44L903l622l145J1109
22184a5734K2589K1043K3977k9654k5475J581o263j6281L08K2334K8176P475Q981
22171D3057p847k4983m552M529K1862J467j6863j6390r119O952k6994k488Q997
22158b2372R953J0801J6368R488j1317k5445K2326J3031j1670J1349M419J8620
22146D5551k4531m5434P858J1843J0164j1698k2359k619M310P633n532k9392J4778
22133c9428J8857J033j5924o023P365K6689L159M236j08j9001j9382R614K8965
22120E2j1889j1882J0780m110Q892O438J0544j6425j1160l469O855O680l755k1317
22106c3766l522M72J6294L7266J1999p938j6125j6824j7236K8255J9616l1153
$$ y = [366, -13160, -29749, -27380, -16205, -4296, -17087, -7621, -18585, -23335, -23979, -20076, -23698, -26843, -15734, 6855, 27898, 51875, 22221, -3254, -1673, -7936, -24217, -23909, -1575, 26601, 34076, 43057, 35210, 10227, 5675, 10204, 32066, 33533, 16670, 280, -8839, -1887, -28881, -31369, -22372, -12419, -1618, 14750, 24238, 12921, -12524, 9802, 22833, 11163, 22512, 26931, 45551, 21020, -24414, -16556, -4713, 5451, -6247, -28606, -31225, -26915, -19282, -24814, -54206, -39428, -20571, -19538, -35462, -41485, -34120, -7431, -4272, -36, -144, -19145, -38527, -28913, 52, -11837, -23719, -12939, -17049, -8157, -1719, 8825, -7600, -18760, -22229, -15374, -8694, -12449, -33766, -37288, -36816, -20522, 16744, 28743, 20805, 4680, -12144, -29380, -1125, 18491, -12662]
22094a2662k3327K0949j3344J3237m457O666R220J1129j4178j2206N726J297K2607
22081A0657J0033q298j6009j8197J0509Q588M189N749J6136K1525j3585l9313
22069h016j78r073J928Q202p729j0411J0338N575K319j303L877j0615k1713q64
22055c7663K2719J6072J1429J481r068n260j2931j4603N810n647l205J1635M506
22042a4725Q340K4585k1100J0710J754j6841j3286m965K1889l64j5672j9533J667
22029c7541J7337p392M861L3527k2765P942K0123R90j020q620n44k868r022r819
22015a4811o690n579k2651J7671L184J2483K8487J6614n252j4898J256Q771j5606
22002B979Q331j1670o892J1129j01k5428j130O105L0361J5538j5823j6422j0012
$$ y = [-12662, -35989, -15040, -28384, -15147, -19604, -12938, -3718, 7411, -6767, -18973, -13247, -11950, 10657, 20690, 12392, -3617, -21814, -11305, -2717, 1472, 7221, 23357, 44882, 31297, -8016, -8194, -17267, -15339, -7137, -14866, -25277, -14939, -9364, -7045, -8348, -4471, -15086, -36799, -37663, -14944, 1128, 12557, 14038, 4970, -290, -13221, -27824, -22014, -27661, -30866, -19231, -14725, -6385, 18200, -2900, 7810, 9564, -7277, -20563, -25528, -3639, -4003, -19675, -39208, -37541, -20204, -27596, -22735, 10792, -11973, -4031, 16092, 17082, 16062, 7442, 6898, 4030, -4992, -14811, -21501, -27080, -49731, -32060, -28876, -16393, 12094, 28708, 23456, 8558, 9814, 18585, 2979, 11310, -360, -7252, 3877, 3776, -21652, -22782, -16677, 13684, 29222, 13399, -3023, -13035]
21989a3035Q099J3610K0978l980l1650j2375R016J1939P172o592r439J3173N557
21976A2473L38p168p736j2284l293j609K2897J5551m489o595p319J7858o486j9936
21962g798j2321J590R757J4220O382p108j2611O28j7785R206o473J7158n60l302
21948i017j651Q694O236K257k1772j1577K9040M171k0082K238J5364o202j7245
21935a9546j011l626K837J3905P429j1209m217j1508m807r795o731j1975k3164
21922h3418L3708K7996J1253Q088J4916M378q24r935J550o704j7340j7114J4085
21909a9361Q324j739N09L022K0913K1490K6353j9444R44j1565o519N460O567j358
21895C3596j9863j1282k1367p947K4354m992n499l680k8088M07L3569K0180k0106
$$ y = [-13035, -4936, 8674, 29652, 25672, -5978, -18353, -9337, 2602, 9774, 3182, -6257, 6916, 12473, 12811, 5643, -2093, -14377, -17670, -19279, 3618, 19169, 14680, 8085, 766, 18624, 12138, -7798, -20119, -18529, -8772, 5448, 11830, 4722, -7889, -7261, -25046, -15840, -22313, -5155, -5715, -9017, -10668, -1974, 4262, 6519, -15253, -26830, 2210, 6381, -13701, -11463, 3901, -2301, -19546, -20557, -24183, -21346, -7441, -12, -11221, -15438, -26946, -31753, -41548, -48279, -60254, -83418, -49710, -21714, -10461, -2373, 12543, 16921, 16097, 6162, 7712, 1008, -16332, -33446, -19361, -11037, -12776, -12267, -9245, 11668, 33158, 59511, 40067, 41011, 29446, 22927, 28387, 34954, 33596, 13733, 2451, -18916, -26863, -2509, -7501, -13000, -16680, -44768, -44361, -10792, 9388, -10718]
21882a0718j8483J9833J3197j837j4468K454l195J8802j6723j2372k1274k4172
21870f8956J5508J9202J2724j1317m32P287k1343J0436O79J1446J7990P185q802
21857h393j3515P018J911q537M017K4131q577l0543m569Q408J0019j450P93j2332
21843c1619J4922J9723M613M257N880o682j2870p298J4351J623j0411j2602j1593
21830b7706K7485J8600p145j2444J1838O034O223Q651j6220j4858j3566J8809
21818E701J0668m692o617j2899j554r114j007o11q139P076P843k175K091J5276
21804A847N039n422p241k2257j9539K6136M3377K1184k0042J0443p054j9073j9661
21791a2263k93J2959R360o561j0459J0788l121O638j483R882K3952j3022P896
$$ y = [-10718, -29201, -9368, 3829, 1992, -12476, -10022, -13217, 5585, -11138, -23510, -44784, -68956, -53448, -34246, -21522, -32839, -33271, -25984, -47327, -36891, -36212, -24766, -6776, 409, -8393, -21908, -14890, -12979, -21516, -17499, 6632, -1945, -32488, -37057, -28649, -18630, -20080, -19287, -31619, -16697, 3026, 7639, 11896, 17776, 11094, -1776, -9074, 5277, 6900, -3511, -16113, -27706, -221, 18379, 11234, -1210, 10628, 16662, 22885, 31536, 15316, 458, -13108, 5701, 16369, 11677, 5060, -7839, -9393, -18507, -19514, -20125, -28264, -21188, -13345, -15520, -13429, 1847, 6886, 1464, -5777, -28034, -47573, -21437, 21940, 43124, 23082, 33525, 26471, 7398, -12263, -12556, 403, 9763, 3202, -7257, 3531, 410, 7048, 5565, 15447, 39399, 26377, 34273]
21778C4273R452p628j9060J532j5266M2l059k9418M796J5507P166J2265P838o724
21764A1716J021k2738k3884j881J8633M66k0339L279K8760J8927o267l2133l2435
21751e6875J0855J0685K4132M498j0274j0923l438k3012J760K2875K868j289J787
21738b6351J2837L126j7358L319L061K716p848J5018K0871l424j4841K571J8930
21725A2627K3805j7341j3938L54j6162j5631J6157M4414N827l2845r335l57p856
21712a0281k9464k1510J387p129J7139K4962L006O70l692k9180K037K2599P456
21699b2000k426j341l91J2168k3490l708j4704j4183M8823L3539M391n25L590
21686A9743l960k671j7605j9899m160J4935K4155J3526j047j5464k965J576J2997
$$ y = [34273, 43725, 36097, 17037, 18569, 3303, 3345, 286, -29132, -24336, -8829, -1663, 10602, 18440, 11716, 12737, -10001, -33885, -35766, -17133, -16667, -37006, -33727, -4967, 13960, 7693, -24440, -56875, -46020, -35335, -11203, -6705, -16979, -27902, -31340, -54352, -52592, -29717, -26849, -28138, -26351, -13514, -10388, -27746, -24427, -21366, -18650, -26498, -11480, 9391, 5967, -8874, -6303, 12627, 36432, 19091, 5153, 5507, -10655, -26286, -10129, 34285, 40112, 7267, -2068, -2425, -10281, -39745, -61255, -59868, -66997, -49858, -24896, -21890, -21220, -24912, -54092, -52055, -29456, -22000, -24426, -25767, -26158, -13990, -37480, -41188, -55892, -70075, -21252, 12287, 16678, 16153, 19743, 15783, 13112, -4493, -24392, -28552, -13617, 10538, 24064, 23017, 7553, 4588, 6164, 19161]
21673A9161j6476q930k3325L903O325J673K358J3182K3905o692k664n716r014
21660b310K3498j9383j0016m210k6045J2114P059J1814J7201L09k5838l896N545
21647a4158l0806j6011L3983J8500l842j2053q421K407J9220Q419r54M447o361
21634e630j8869p795J1839K8633M368k0409J5300N422j3446p737Q521Q560J6402
21621B5159J8756k194j7856n872k1955j2055j876n998K6172R585M59J8962R828
21608D1115l3274J1644J3325j8048l0095R997K1627k7283j3779K1632J7192j6352
21596b299L116k315j5848k466k294L769k3123l673K1678Q340k1386J3024J3933
21583i544K140K2529R892o465j0984j0272j1797J0573J6648N879J0274M730j423
$$ y = [19161, 2685, -6245, -29570, -25667, -19342, -17669, -15311, -2129, 21776, 15084, 12420, 6704, -2310, 21188, 1805, -8211, -12421, -38466, -26352, -19293, -7479, 9722, 10031, -15807, -19703, -14158, -44964, -60975, -26992, -8492, -12334, -24387, -32808, -30401, -11181, -2762, -3716, 731, -5630, -24499, -32294, -20455, 8178, 12546, -7863, 7437, 12859, -587, -8324, 197, 8757, 25159, 43915, 41721, 23865, 17993, -3962, -16017, -17893, -23891, 2281, 11866, 12325, 31287, 41115, 7841, 19485, 32810, 14762, -15333, -5336, 16291, -10992, -24771, -3139, 14053, -2299, 817, -1498, -17346, -19812, -22106, -18337, -41460, -45133, -23455, -15115, -36501, -23477, -9544, -7404, 15125, 25017, 18552, 7568, -2704, -14501, -3928, 12720, 18599, 28873, 33603, 32180]
21570C2180l747P177J5413j4862l0070J74K850K61J1914J7425K3226j6742m9348
21557d149k5325K2940K8885K7709j1715k2091m470l0957l003K6069j0979j5598
21545b2684N307m762L1134J7576R081j5742j7602n891j566R272L478j3876k906
21532i181N100k083J0588k809q492Q541k548o019j3476P060l370r802j1253K0808
21518a6936n900m355J1957j8486r059j417J8741R256P055N500L7Q116J8558J4973
21504C8040O900k5871l0053L241N076J0921K6486K365q379j4661q202J0997L867
21491B0727k9522j430k471j2737K047J4778J9630j975n869l0412j9509J9116J5060
21478a2567J4050Q813J50l875l342p032k0982l208J1371j4288j0880k8586J4574
$$ y = [32180, 28433, 35610, 51023, 36161, 6091, 6265, 9115, 9376, 21290, 38715, 61941, 45199, -4149, -29474, -6534, 22351, 50060, 38345, 16254, 11784, -19173, -22176, 3893, -7086, -22684, -17377, -22139, 8995, 26571, 35652, 19910, 2308, -3583, -5149, 4123, 7601, -6275, -9181, -4081, -6164, 4424, 1615, -6877, 1664, -884, -6903, -20379, -13319, -16689, -26491, -37744, -16936, -22836, -27191, -15234, -33720, -42779, -44196, -25455, -16199, -9144, -3644, -3607, 4509, 23067, 38040, 44940, 19069, -10984, -7743, -2667, 8254, 34740, 37105, 28726, 14065, 5863, 16860, 20727, -8795, -10225, -12696, -25433, -23386, -8608, 11022, 9047, 3178, -27234, -46743, -27627, -12567, 1483, 10296, 10446, 6571, 3229, -3803, -24785, -27993, -16622, -30910, -41790, -70376, -55802]
21465e5802N1361Q609l1199J3344L3918N150k6661K575J6717P449j4274j9445
21453h258m365j3410J4782L8986J4964N212j8619l0213K986K1664j5852j2514
21441d637J0518K5206q046P914J552l313j6694k8653O187j1630l728K0002K439
21428b883r072o563p016j9859L150N874M127Q592K6808P417j1940k066p846n436
21414a6713o61K6722K5424k6863p794J947J4473J1053J415k8031j0783J6014K6105
21401C2308m365m539J8089K0505n748j3294l7467l6991k10J4137K7075L2705q557
21388C3648l7527k1553l120K9084K3093k3977o958K592M02J3495J7033Q515l96
21375C4331o584J6645k596l7580l3224K041J4528L0285J4972n990r218r578j1228
$$ y = [-55802, -4441, 4168, -27031, -13687, 20231, 25381, -1280, 1295, 18012, 25461, 11187, -8258, -12623, -26033, -11251, 27735, 42699, 47911, 29292, -921, 2065, 23729, 7877, -4637, 5881, 31087, 23041, 30955, 32507, 29194, 12500, -16153, -9966, -21596, -25324, -5322, -2883, -11955, -18518, -25534, -45393, -42243, -36369, -32242, -23650, 3158, 10575, -1365, -3431, -11277, -16713, -17374, 9348, 34772, 7909, 115, 2062, 16535, 27588, 29003, 972, -9811, 6203, 32308, 27943, 23404, 41493, 61998, 56250, 42956, 5489, -31502, -31712, -17575, 9500, 42205, 33648, -3879, -25432, -28552, 532, 23625, -352, -7310, -4718, -4316, 9179, 26212, 34727, 34331, 27747, 44392, 41796, 4216, -29008, -26967, -12439, 17846, 32818, 26828, 17610, 8032, -3196]
21362c196j1134K3115J8487o051o163k169L509L302J2466J4885J2432k5777k3326
21349A0380j4586K514O411r211j1817J5240K3082K0671J0194n386j3245n755K0864
21336D9356K422j2752j3454k9230k485J7829R141m520K260K568l632l2518Q850
21323f165K515j2019j3623Q21j0063j2563K9605M493K892J118J7159j2615n240
21310a3685n073j5826P350K8272k212R085K590J1245o097k4550q888J4466j3136
21297a6459K2509J9849O445j8557j9103j1162N529j5512o877P761J5095N035l247
21284h694j1110k527r980K9105q998J5087J6652Q065r065k169k3566k9004R68
21271c5236R246K105J6092O970m051K778o916L4438J6515j9957n86M027k8256
$$ y = [-3196, -14330, 8785, 27272, 21221, 15058, 12889, 16398, 19700, 32166, 47051, 59483, 33706, 10380, -4206, -1692, 4719, -4492, -16309, -1069, 22013, 42684, 52878, 47492, 34247, 28492, 49356, 51778, 39026, 25572, -3658, -6143, 11686, 20827, 16307, 18567, 21135, 17503, -15015, -6165, -3650, -15669, -29292, -28471, -38534, -51097, -21492, -16999, -14107, -12989, 4170, -8445, -13685, -18758, -34584, -27234, 1038, -1174, 7911, 10501, 21746, 15649, -8901, -17789, -3323, -16459, 6050, 25899, 32344, 13787, -5316, -16478, -10949, -26461, -33338, -25577, -10482, -5447, -8694, -19804, -22331, -32311, -3206, -12204, 2883, 19535, 27600, 18535, 16366, -7200, -36204, -35236, -25990, -23885, -7793, -823, -4874, -2096, -9012, 25426, 41941, 21984, 21398, 25425, -2831]
21258b831K4873N4130j3185j2072j6605j4943J3375l732k9404j4304J0701J3716
21246I719K9713J1617l443k2569l4881j2018R543P46l527j2957j0766M163J965
21233c2695k956J0393J2799k0026K349K991K127j038O418J1200j515r834N546
21220a4241K9390m998j5048K170J8902j1674l1990J2749K0312n005J4050Q16l261
21207A2172p274k4899k3881l681K2214J4466k168j1632P467j523J970M435N779
21194f555O112Q932o329m8279m933J5074K7869J3242m086L614Q195p686p872j0423
21180a3125O301K7425K1218L744K270j5044k9452k2563J5101K7138L492m050O284
21167B8739k3141j5976r10O327J436R952J7479J0301j6940k0994R868l458n774
$$ y = [-2831, 22042, 76172, 62987, 50915, 34310, 19367, 32742, 29010, -394, -14698, -3997, 9719, 39432, 51049, 47606, 25037, -9844, -21862, -12319, -11573, -15100, -28057, -38823, -34660, -32695, -35651, -25258, -12459, -32485, -30136, -27145, -25018, -26056, -19638, -8438, -9953, -19787, -14241, 15149, 10151, -4897, -2727, 16175, 4501, -27489, -14740, 5572, 567, 14617, 15433, 12172, 4898, -20001, -43882, -47563, -25349, -10883, -13051, -24683, -17216, -18739, -16769, -12334, -6555, -443, 8489, 2160, -46119, -51052, -35978, -8109, 5133, 1047, 4661, 12856, 5170, -2702, -13125, -6824, 20601, 41819, 45563, 47833, 32789, 3337, -19226, -4125, 23013, 26505, 22455, 28739, 5598, -10378, -11288, -4961, -3525, 6427, 23906, 34207, 17267, -3727, 6141, 2683, -3091]
21154c091J1924n963j0922m907K888r930l224L302P157r322q175K9480l789m364
21140h936J6603k3772m993r060M503O28Q481J2626J9149j1496j0739j5965j1217
21127c4188l223L337J2609P317J3583j0213N05p256J8497M578j1351j2225o157
21114b4187L761O999M547R846k707J1143l158q102j2046Q173J0803Q788R046j6252
21100F654j4732j1944m061K6453J6054j2312j0733j7353M994J878j07J3687j171
21087b693k3282N789j4303n739J4408M6406L5899j4047o421l552Q878k7388o859
21074G096J9765j705Q744n732r533J0701J8521n542j0420j4819j6749j1934o250
21061a7857Q738J0905j4396k6734k3505P673N359K3643K868J5254j858J26L666
$$ y = [-3091, 8833, 2870, -8052, -12959, -10071, -20001, -23225, -19923, -12766, -22088, -30263, -783, -4572, -8936, 7667, -16105, -21098, -30158, -25655, -25027, -16546, -3920, 15229, 3733, -7006, -22971, -34188, -37411, -34074, -21465, -14148, -565, -10778, -10273, -17529, 968, 5546, -5805, -18030, -24187, -20426, -13427, -8880, 966, -1741, 9402, 6244, -1858, -13904, -5731, 5072, 13860, 22906, 6654, -8078, -20022, -24083, 2370, 18424, 6112, -4621, -21974, -16980, -15102, -15209, -1522, -2693, -25975, -20186, -34489, -40228, -25820, 20586, 56485, 42438, 36017, 32465, 41343, 13955, 7096, 26861, 25156, 33900, 28168, 18635, 29336, 47857, 42315, 31895, 17076, 327, -11607, -17857, -9119, 1786, -12610, -39344, -62849, -55176, -49817, -26174, -23306, -8052, -9910, -9784, -6118]
21048f118O600j7501J3012J9527K8995p830n252J4889J2052l633j1453r402r370
21035B4516M453j279n829n426r329m590L0658Q203l1351k2812r419Q324j6745
21022c0626j3856J2563j577K1877J7642J2494j2045K3202R962q945J908R129n889
21009C5839O11J07j4445p479J6415J8347j2324j1937o411M39j9255k0720j292
20996b2105n545o16j7006K7896K6006k0092r054N51K3283j7950l406r44r943R922
20982a9003k37J761k266k1771j873j517J1392K8501J1685K853K7427P649k0438
20969B4163q796J76M236k1573k1634J0264K913j5961Q245J6589r164j4327Q372
20956a6497J3182L7014O655k4299k5161j1635J2440O046q02j3974j2745J5584
$$ y = [-6118, 482, -17019, -4007, 15520, 44515, 36685, 31433, 46322, 58374, 54741, 43288, 33886, 24516, 28969, 27690, 21861, 16435, 7106, 2516, 33174, 41377, 10026, -12786, -22205, -13881, -30626, -44482, -31919, -33496, -11619, 6023, 18517, 6472, 29674, 39636, 30691, 32599, 41728, 35839, 36450, 36557, 22112, 14633, 31048, 49395, 37071, 25134, 18723, 19162, -93, -20813, -22105, -27650, -28266, -45272, -17376, 8630, -11462, -20516, -19965, 3318, -14632, -18038, -18982, -28925, -19003, -19240, -17479, -19745, -41516, -43389, -44906, -33514, -5013, 6672, 9525, 36952, 44601, 24163, 15367, 15543, 19779, -1794, -23428, -13164, -10251, -26212, -17967, -1378, -10542, -24869, -16497, -3315, 33699, 40354, 16055, -9106, -20741, -8301, -2255, -3057, -17031, -29776, -14192]
20944a4192N7089K658k9723m0221j1598j400k332J0677J4765K4212n80L647K4924
20931C7926k631r737n339m319j4323j2981J1801l347k6662P878R862j651M68j2306
20917b5361J4342J3871k3738p919K2482J753L633J493j5674n075J8448K6676q304
20904A6627k4835J9677o320K5771J2801p411r958j7864N326l140r851q4j1525
20891a0786j6819N815K6579K0064K0571r825m0142k2334q203l364k509L815L236
20878c3902J3072J7811q062m004j3623J5301J8052j3945n642p689m0J2893R304
20865d74j660J7702J4801j6706o890K7884M237j9130j7040r068P12K3355r250
20852H473l5399L3919K8393k1605k8276J8105Q861k9210r963O074K1674L391k9107
$$ y = [-14192, 42897, 45555, 15832, -24389, -35987, -37387, -39719, -29042, -14277, 9935, 9355, 13002, 37926, 35295, 25558, 20219, 15900, 1577, -11404, 397, -2950, -29612, -21734, -11872, -13523, -13055, -25361, -11019, 2852, -20886, -28805, -6323, -4570, -937, 556, -15118, -20193, -1745, 24931, 16627, -8208, 11469, 5149, 30920, 43721, 36310, 26352, 8488, 13814, 10674, 823, 739, -10786, -27605, -21790, 4789, 24853, 45424, 35599, -4543, -26877, -35080, -38444, -40953, -37138, -33902, -20830, -3019, -11081, -15085, -28708, -13407, 4645, -9300, -14942, -22631, -22671, -9778, -474, -2134, 15568, 30369, 13663, 6773, 34657, 38894, 19764, 2724, -6344, -5632, 17723, 8473, -26926, 6993, 35386, 13781, -14495, 3610, 12471, -16739, -26702, -20628, 1046, 4437, -24670]
20839b4670l556K8806R504K3383J9724j0761j7181j6212q138j6945J2307J3601
20827I862o43R552R645k1204Q406K4726j9748l6851k926O992K3457r709n09K0481
20813B1531J0533L601j0785j5568j1165l3083j5810J4992M151L38N02K9543J1360
20800A0140K361j7119L750J9000j5218m587J6922j0743r314r363r921j509K6216
20787F15l099j3247L8368J8679k675j3638r142j0516k362K7651K0498J617l6525
20774A6224l3184P537j032J0220R088J448j4474m306K9992j515j6785l9655j938
20761c8380K7711M872r765O26j431o389Q825p943K856n392Q880K7208P270m3213
20747b4265j1866J2075j607q556O561P330n895J2528J8491j0410o435J0236j0040
$$ y = [-24670, -28226, 580, 10084, 33467, 53191, 42430, 25249, 9037, 899, -16046, -3739, 9862, 9219, 18771, 28416, 7212, 15618, 40344, 20596, -16255, -19181, -12189, 11268, 1559, 1050, 21531, 32064, 35665, 24880, 9312, -1853, -34936, -50746, -35754, -31603, -31265, -30763, -1220, 10140, 12501, -4618, -868, 18132, 2914, -1673, 15249, 4506, -4808, -14171, -24092, -25601, 615, -2484, -15731, 22637, 41316, 38641, 25003, 15861, 5345, 2983, 30634, 51132, 52749, 16224, -16960, -9423, -10455, -235, 8853, 10301, -4173, -8479, 21513, 19998, 3213, -36442, -38380, -10669, -5797, -15562, -14936, -16367, -22756, -13931, -21874, -19018, -24410, -15530, 11678, 18948, -24265, -36131, -24056, -25663, -34219, -27658, -20328, -26223, -13695, 4796, -5614, -12049, -1813, -11853]
20734a1853q695j3142m87l903J4200J1821r650R30L752o516L28J2829K307k2036
20720c0115J3906k0468L021K2699J4586o636l653K413N824J6230J6353l523j2223
20707A8414n18l038q32k8565o021J2527K2604o126j0458j1904J313J9271O188
20694A2855K787q424j1755L931j7383J207J8426o445J3678N252j2857q130N402
20681a456J2908K2686J6385L1021J9251j1938m0778l6649j9189o318m783L694
20669a5166K379J9530K196o790M919O905J0402k1551q108K0485r257J9099J558
20656B6601j9507k896j566n291q809M746J6862l182O013n833o246j0102R043J5330
20642A5163J5528p791k6000J0913Q503j7663j737J4228O4O081j2804j4275Q317
$$ y = [-11853, -20548, -33690, -34177, -38080, -23880, -12059, -21709, -20779, -17027, -23543, -23215, -10386, -8079, -30115, -16209, -36677, -33656, -10957, 3629, -3007, -6660, -4247, 1577, 17807, 34160, 30637, 18414, 17896, 14858, 14026, -14539, -20560, -8033, 14571, 8445, -2013, -13917, -12604, 6667, 12855, 15642, 7218, -4537, -606, -17989, -16782, 1644, -4801, 8877, 14129, 1272, -6858, -1456, 11452, 34138, 50523, 81544, 100795, 88857, 48079, 11430, -7759, -14077, -18860, -15166, -12787, 6743, 8939, 2149, 7068, 13973, 24375, 2824, -5284, 15201, 5944, 25043, 26601, 7094, 4198, 2632, -2659, -11468, -6722, 10140, 6958, 12971, 7138, 892, -9210, -167, 15163, 30691, 22900, -3100, 7813, 16316, -1347, -3084, 11144, 11208, 17289, 4485, -9790, -1473]
20629a473q067J5058P262J707L524j6768k7347k3655M822J1341J7701m609j2415
20616c2919q354O086J1434N150K999l108L1610K8280p016j8324K81K3854J35k2214
20602A7894k2517l4242J2770J4854o794J0809m726m009J4239R790J3906Q101k8705
20589A370k9248J8869L5132O02j4060R696k2642m53Q40J1918m426k6470L741J8167
20575C036J895J2329K8687k0281j7846q589o274j5329p472M517M9442K2509r118
20562C7506k933J6885n20l0207J5866j4124n095Q379j5529k6643j0201r162n442
20549d1220J7780k491P64L477N236r956P075M797j0401J7822J6095j3278k3193
20536b7493O643K0457q081J7522J0443p176k6606j8391L91k4870j770k29Q816
$$ y = [-1473, -9540, 5518, 12780, 14487, 18011, 1243, -26104, -49759, -44937, -33596, -15895, -20504, -32919, -41273, -35187, -23753, -18603, -15604, -18712, 12898, 41178, 34162, 15838, 16119, 39973, 40108, 17894, -4623, -38865, -26095, -11241, -18035, -7226, -11952, -15961, -1722, 8068, 21974, 30075, 1370, -27878, -9009, 26123, 26725, 12665, 22361, -281, -734, 106, 12024, 7598, -18872, -15131, 3036, 4931, 17260, 45947, 25666, 7820, -769, -7043, -22372, -29844, -25327, 24115, 46624, 37506, 34573, 51458, 50938, 20731, 36597, 22473, 17378, 25757, 10228, -16415, -26616, -35778, -41220, -23440, -25931, -25167, -21690, -16454, -26410, -19335, -14538, -24939, -7117, 8978, -4300, -27493, -20850, -393, -8474, 9048, 19491, 12315, -14291, -32682, -32291, -57161, -58931, -59160, -50344]
20523e0344K0j729J5897J9321R62j1756J1450J1106r973L823p414p754M817J4020
20509g554J3025j1313k669J4760K45q966j9293J2251L103J227K0730J0847n495
20496B0898J0976J1230j9730k5282N492P718R004N889k2553J5737r581k890oj2566
20482e664P218R544M347m669p096j582k0899N633J5399Q485j758r396Q067K7761
20468C5390J2725k6297l5839j7413J7242R611N563j8778m727N967P169q78O916
20455c349m226O568j3008j61L398J7733K2004J3421q74j3572j5605r700J5255
20442A7884J1023k6484q117o298M292R190j4443j123j106j0850J7037O911j08
20429b192q979j1837R250J79j3532o035M522P605L303j1607J9479J7399J1675
$$ y = [-50344, -50324, -52053, -36156, -16835, -15873, -27629, -16179, -5073, -15046, -11223, -18637, -26391, -21574, -7554, 5471, -5842, -8511, 6249, 6494, -2472, -21765, -9514, -6411, -5184, 15546, 26393, 20898, 31874, 43104, 23374, -1908, 3584, 11302, 20306, 26195, 3642, 19379, 9798, 6908, 6902, -5664, 1554, 11098, 15445, 10776, 3680, 2098, -18801, -13168, 2231, 10716, 8958, -438, 7629, 35390, 48115, 21818, -14021, -31434, -14192, -4581, 982, -17796, -22523, -16556, -9387, -10265, -3349, -7575, -1007, -14015, -14176, -10778, 6955, 28959, 42380, 41506, 27934, 12329, 2629, 17884, 28907, 2423, -5694, -11992, -7700, 1490, -12953, -14076, -15182, -26032, -8995, -2084, -2192, -11171, -23008, -13758, -13579, -27111, -33146, -28624, -21019, -17716, -29323, -9844, 7555, 19230]
20416A9230K389k2982N880K83M632J9120N53J0292J0084j7703j6269k515n453
20403G541j5311Kj6286k4958R490m938O843K8643J9499K9395q221j8384j759r697
20389A859j3272l102M7061J6569j4717k4670l7578J200J8191R338q549N32q08
20376g946J4292R723K643q128j8405O956j0236j6462j0128N116M622J5497k8539
20363d0995j7769o825K0016Q173K4898J9793n784r907k952l977J2373n819k2453
20350c1228J8614J455j6261r033M029K6725J7932M97j6706n287j1765L837m134
20337b1325k977J1997N67J2767J8098n989m225P364j8635j5035j01J9575J3711
20324A5792R18l974N30n727l2259J167J8384K170R753l29j4653L0512J2251k430
$$ y = [19230, 21619, -1363, 4517, 4800, 9432, 28552, 29105, 39397, 49481, 31778, 15509, 12994, 7541, -7770, -7768, -24054, -49012, -39522, -44460, -37617, -8974, 10525, 39920, 31699, 13315, 11556, 1859, -11413, -14515, 32546, 49115, 34398, 9728, -27850, -26650, -8459, 879, -7670, -7138, -7946, 6346, 16069, 18712, 10584, -7821, -865, -11101, -27563, -37691, -32575, -27953, -12456, -40995, -58764, -65589, -45573, -37400, -12502, 7291, 1507, -8400, -11352, -15329, -2956, -8775, -31228, -12614, -11159, -27420, -36453, -32424, -5699, 12233, 12730, -3976, -9263, -21028, -17191, -21325, -24302, -12305, -11738, 1029, 19127, 13138, 8913, 16277, -2358, -17393, -17494, 2081, 15792, 16710, 12736, 13266, 7539, -24720, -23553, -5169, -2999, 6754, 6425, -8228, 22284, 34535, 32105]
20310C2105J620J222r140k7543J9111m277p102K0017L356j6547o865J5198M789
20297B5944j314P338j2703M776k523l569k5921m479J7523q907l407J4252l197
20284C813j9314k3079r3p578L4271K9806M494r441j2141J557K7488k7078l0356
20271b7651Q188L833N775J6384J8078o49m691P572q810M175Q114k3152k1158J2404
20257a588J7708J579n069K749J1207L849K0049l453M644k6363j9267j379K4464
20244B9130j5751J738Q236R35J765K781l342J2027L555j7570l4658L465J3798
20231F109k445o133k4200l753K0694Q998M19J44k310J3007o00j210r160L983J6399
20216A9942n063P841J7187m133j3879j3732Q463q051N006k609J5652n845k9966
$$ y = [32105, 33725, 34947, 25807, -1736, 17375, 13098, 5996, 26013, 29369, 12822, 5957, 21155, 25944, 24630, 31968, 19265, 24041, 21518, 17949, -7972, -12451, 5072, -3835, -7242, 7010, 3813, -15501, -38580, -38673, -46251, -11980, 17826, 22320, 12879, 738, 2295, 29783, 2705, -27651, -19463, -15630, -9855, 6529, 24607, 23958, 19267, 26839, 18029, 22204, 30318, 7166, -13992, -1588, 16120, 17699, 12630, 15379, 26586, 30435, 50484, 47031, 51675, 25312, 6045, 4666, 29130, 13379, 15117, 23353, 24288, 26053, 28834, 25492, 37519, 41074, 23504, -11154, -7689, 6109, 3664, -2469, -26669, -30422, -9728, -730, -311, -167, -2477, 10530, 9930, 8720, -440, 3543, 19942, 14879, 22720, 39907, 35774, 21895, 8163, 16626, 8575, 13581, 10972, 26624, 20779, -9187]
20203i187j1678K6718J0600M30l42p587o494l057J2503j2873l0710k0953J4869
20190c7761K0607L545l449J3437M812r020R809N850K4220J422M131r477J3643
20177D1769K081m878j1734j0597l1460j2653J2225q2J9190L1311k101n539r215
20164A8317k8324O268K5847k7801q985M420O536L0208N316r614K162N232l2133
20151b551l0288j0504Q318J6911J2295o627J458K0816J120j6556k870K4607K8841
20138D4970k86r644j6604j1873J2225j7947n931M1099K5032L120j8748k8872k501
20125A4040k2110N048o183J6464J0394p333j0283P155o801o862m422j5548m672
20112c1113L8999K3410J1215q202O216j4175K951J1985o048j2765j8060k3174
$$ y = [-9187, -20865, 5853, 16453, 16883, 16541, 8954, 2460, -597, 11906, -967, -31677, -52630, -37761, -17154, -13609, -17058, -3621, 1191, -7829, 1980, 7830, 32050, 33472, 37603, 28126, 41769, 43850, 38972, 27238, 16641, -14819, -27472, -15247, -15329, 3861, 35172, 33071, 27532, 18317, -10007, -3739, 22108, -5693, -14678, -10258, -3722, 26486, 31802, 22188, 24350, 29582, -2551, -32839, -43343, -35025, -18114, -5819, -12446, -10988, 9828, 10948, -5608, -8478, 16129, 44970, 44684, 35040, 18436, 6563, 18788, 841, -5090, 36009, 61041, 64161, 45413, 16541, 14040, -8070, -3022, -9205, 7259, 17653, 10320, 37, 7192, 391, -6471, -10893, -26441, -31113, 7886, 31296, 42511, 34309, 40525, 26350, 29301, 41286, 35238, 22473, 4413, -18761]
20100a8761k866Q391K0991L116L763J8174L6247M863k5254l4118j0408J4367k0614
20087b109j2038j4707p131J7309K8633J0001l0893j145J4583M53O319j1118k629
20074d472K7624K3290j59j2939j5485o242j013j3586m455M140Q983r880K0884
20061A6690K3065p63m677k7008j4145J1237M86J6476j5774J216K0197n228k6996
20048e224j613J8946L188K073k7180j7J4392L1651k5825j459r633j7458N669K1614
20034I124J1270m49N86J0783o259R47J4706m804k4162l9393J8831J6769q708r63
20020a722J5721N806Q749j1472j6854q880l798O642J6462L090j020j1656L377
20007D445K575J3766J457R9j7213j4438J6723M96M710j465j505j0489P582j2983
$$ y = [-18761, -21627, -13236, 7755, 10871, 14634, 32808, 69055, 73918, 48664, 14546, 4138, 18505, -2109, -14147, -28854, -35985, -18676, 9957, 19958, -10935, -12080, 2503, 2956, 9275, -1843, -4472, 23152, 46442, 46283, 33344, 17859, 11617, 10604, -2982, -7437, -3297, 5686, -4194, 16690, 39755, 38992, 34315, 7307, -6838, 4399, 4885, 21361, 5587, 6803, 27000, 21772, -5224, -6837, 12109, 15297, 17370, -9810, -9827, 4565, 36216, 10391, 8932, -701, -18159, -12490, 9124, 20394, 19945, 20531, 31314, 25055, 26002, 40708, 35904, 11742, -27651, -8820, 7949, -759, -1722, 13999, 19805, 28554, 17082, 228, -8652, -12450, -5808, 10654, 13744, 12724, 1068, 4445, 7020, 20786, 22243, 22342, 5129, -9309, 7414, 7910, 12620, 11155, 9650, -839, 6743, -6240]
19993f240j9548j5517K9945K3556M033q162P742J0334J995r964K04j9394M686
19980C670O235J3292K125k7457K329j8596J760O091J1126J5259N105j2325K1489
19967C0103L4J423j3051K554j0334O727l5N541P82m163r748j7414n984L900J6292
19952F627j254q613N37k9446J487J3476J768J5815J371J8683m823N391k390l802
19938A4827m428r289L231m4k265R675M763K233J2348K053l6133l5627O941J1246
19924b0469J8403N864J107J9207j5232O120M939J1960L983k0434j4658K902Q03
19911D495m636j2277k768K0060K1382k702j6435l405K6007K4256j5289k0789j4321
19898C578N990J1021N115p779j9968r44j145R327R509o323K717O968K7397O503
$$ y = [-6240, -25788, -41305, -11360, 12196, 16229, 8067, 15809, 26143, 28138, 18174, 18378, -1016, 3670, 9905, 23197, 25322, -2135, 194, -18402, -16642, -10551, 575, 15834, 20939, 8614, 30103, 30137, 31560, 18509, 21063, 10729, 17456, 17421, 22962, 23744, 19581, 9833, -7581, -13565, -9665, 6627, 5373, -3240, -2703, -32149, -30662, -17186, -15418, 397, 1768, 20451, 15628, 21019, 18629, 14827, 10399, 1110, 4341, 4297, 2032, 11707, 16470, 18703, 31051, 33104, -3029, -38656, -31715, -20469, -2066, 3798, 4905, 24112, 8880, 15000, 19939, 31899, 35882, 15448, 790, 3692, 4495, -141, -12418, -15186, 4874, 26256, 23554, 7119, 3714, 29721, 53977, 38688, 17899, 3578, 9568, 20589, 25704, 17925, -2043, -2987, -4132, 5195, 14704, 8381, 11098, 18066, 45463, 51966]
19884E1966j7656k4358j3717J1478P585Q496l0210J0204K1164L6489j8749j4263
19872B8429q214P105l1161k2635K453n543r848K4426L2803J5029k650l648J3338
19859C9884k900L440J7706j1784n023k3891k2492Q48K6069J1702J8794j2930k3832
19846A5591Q454q313n55J7938R050J4117j749m096j6099J2681m940J2756O730
19833F1565j5331j2956J5503J95j2340j1696j8449R814L3606j8303l0188J5065
19821A6485J5228J1906k1325L846L5182m150j9534K166L068j1891J1319M821N818
19808E2939L261k1383k2032m991r973q0L6369K550j9458j4551m979K888j0586
19795a0026n603M445m399Q227Q492K139L279J0619J2548l459j263K3100M286k0519
$$ y = [51966, 34310, 9952, -3765, 7713, 15298, 23794, -6416, 3788, 24952, 61441, 42692, 28429, 20215, 27320, -3841, -26476, -24023, -29566, -39414, -14988, 17815, 32844, 30194, 26546, 39884, 36984, 40424, 58130, 46346, 41323, 17432, -5060, -4212, 21857, 33559, 52353, 39423, 15591, 24045, 15732, 15177, 33115, 42165, 56282, 54533, 50437, 34338, 47019, 42079, 54835, 61565, 46234, 33278, 48781, 48976, 36636, 24940, 6491, 16305, 49911, 31608, 1420, 16485, 31713, 43619, 22294, 26140, 61322, 57172, 37638, 39804, 42872, 30981, 42300, 47121, 52939, 56200, 34817, 12785, 7794, -2179, -2259, 34110, 36660, 17202, 2651, -2328, 560, -10026, -15629, -11184, -15583, -7356, 1136, 3275, 6554, 17173, 29721, 26262, 24999, 48099, 52385, 31866]
19781C1866k1836m023J0630J3474q357k2026j4951k0862K4548J0815n702P245
19769H21J1747J3085J2280O771j8866q983M958N376k3113M93O911q167J237l6125
19755c1575K3269K0115j9765o574j2530J660J7031J332j2360R027J5593j5931
19743a0708j558j9888q618L3700K4521o158j4887j4383K6593K2910j2089n34O22
19730A9523J3627q323Q771j0492l4964J464K577R660K226N369m220J0580j6997
19717a199j4640N772P26P356q706J080J2328J4846O995l0421k2655L2442J5368
19704A9292K0645K0404K144p170r926j0150k2654j4690K1739L47k0465N699J3374
19691A8589J026P497L821K4180j844k3530L619P295k4706m94J3191J640m699r033
$$ y = [31866, 10030, 6007, 16637, 30111, 21754, -272, -15223, -36085, -11537, -722, -6424, 821, 12568, 25653, 37933, 44704, 25838, 16855, 21813, 27189, 4076, 4569, 11480, 3313, 4550, -31575, -8306, 11809, -7956, -14530, -27060, -25400, -8369, -7037, -19397, -10370, 5223, -10708, -12266, -32154, -40772, -7072, 17449, 11291, -3596, -17979, 8614, 31524, 19435, 18901, 19523, 33150, 24827, 33598, 23106, -11858, -10394, -7817, 1843, 4069, 9438, 5218, 15798, -1199, -15839, -10067, -9341, -1985, -10691, -9611, 2717, 17563, 24558, -5863, -28518, 3924, 19292, 39937, 60341, 62485, 55315, 45389, 35239, 12585, -2105, 19634, 19981, -484, 5215, 18589, 19615, 27112, 30933, 55113, 53269, 29739, 33358, 40653, 15947, 15453, 28644, 30284, 25585, 16552]
19677A6552J6157J3971k046R11J0399J647r549j1835J863l706p928L234j2849
19664A6821K071l568k741k1305q496J1112M257K9411P80j2011O581L022K335J034
19650B9303J1106J1978m181r926m299J4795q449k4035Q485Q018j1901M370K2546
19637D7810l219k2044n227M964P243O446R94j8089J2152K259l0995N247J6232
19624B3773N807J1936Q626j0054k9338j926K3940J7350n352j6218j7349L514J8585
19611C3294n864j2170m247o076n944J4873N902K1476O397O450j5960j0034j2206
19598A5891n534J1663J2479J9735J0931R181j2120m209J1613m960l677J1240k6122
19585D6111l3405j5096j6806L4777K2934n695k6482n764J0110J8578l0944j1706
$$ y = [16552, 32709, 46680, 44634, 45545, 55944, 57591, 48042, 36207, 38070, 34364, 26436, 29670, 16821, 18892, 15324, 12583, -8722, -17218, -6106, -1849, 27562, 28342, 16331, 22912, 25934, 28269, 29303, 40409, 52387, 48206, 38280, 33981, 48776, 40327, 16292, 24777, 32795, 20894, 25264, 47810, 44591, 22547, 17320, 22284, 29527, 35973, 36967, 18878, 31030, 33289, 2294, 7541, 23773, 29580, 41516, 50142, 40088, 10750, 8824, 32764, 50114, 44762, 28544, 11195, 14709, 33294, 27430, 15260, 11013, 4937, -1007, 13866, 19768, 41244, 47641, 54091, 38131, 28097, 15891, 10357, 22020, 34499, 54234, 65165, 74346, 62226, 58017, 69630, 64670, 60993, 72233, 46111, 12706, -2390, -19196, 15581, 38515, 32820, 6338, 574, 10684, 29262, -1682, -13388]
19573a3388K0930K308M998J5467P639p594J7516O136j7727o262j1288k2880M218
19560G3P606J9773M256J2308K126K6283J0543k7781l1151J2422q947j6792j4881
19547d162M870J1040N230j15j6888K1309M1938l476j9497k6186p100L066J4826
19534B4855R782j1845l4362q125J1934O3356L6292l798j8414j8668l4277j8607
19522a877R283K1997j3614m266o265L057l720Q501R485J1131j4503n984m047r620
19508d42j726J6118J6729l020q366M648P221J6076J0442k3494k5934m713o765
19495c226q117k5889N285K6237M7889M017k2102k39N094k193k3728L655M228K792
19481A3703l429J8426j764q66J6424M2943R841j8882j2510p530q389j002O136
$$ y = [-13388, 7542, 9850, 14848, 30315, 37954, 30360, 47876, 54012, 36285, 30023, 18735, -4145, 73, 7679, 27452, 31708, 44016, 46142, 72425, 82968, 55187, 24036, 36458, 27511, 10719, -4162, 708, 11748, 16978, 16863, -25, 21284, 63222, 59746, 40249, 14063, 6963, 10029, 24855, 34637, 22792, -11570, -19695, -7761, 55595, 91887, 88089, 69675, 51007, 16730, -1877, 7406, 29403, 15789, 11523, 5258, 8315, 4595, 13096, 22581, 33712, 19209, 13225, 9178, -442, -2168, 13950, 30679, 27659, 19293, 23941, 31162, 47238, 57680, 34186, 8252, 3539, -3226, -11343, -37232, -31947, -5710, 42179, 46196, 24094, 23855, 28949, 26756, 3028, 6683, 10911, 13703, 10274, 28700, 26936, 26070, 42494, 85437, 95278, 76396, 63886, 56356, 47967, 46965, 53101]
19468E3101J0537n690J0029J4934Q675k7660k9528k0128j2187p194K3878l942
19456A4825o259J1196K6899K6628R834P577r140k6990j436L363K544j3800J1819
19443E7060J4787p157J274j938l2239j4078J2863J7923J6601L593j4681m172k2057
19430B7779M507q894j3441j0339J505L0731K6894J1200j5057n870o216J0754q009
19417D5544l436K1707N229L201m829O453K478r087J1304O396m8506k2850L871
19404A7475J9390r35l575Q531k329m185m898J1163J1688M053m0009n887K1387
19391C1869j0357J2714R504k1470J1652J5005j35l8036j8987J7197K2269J7875
19379D9100M706P89q737o51m919J35J4588n953j5854r431N942J93p342J7179l2956
$$ y = [53101, 63638, 57948, 67977, 82911, 91586, 63926, 34398, 14270, 2083, -5111, 18767, 14825, 8566, 19762, 46661, 73289, 83123, 90700, 81560, 54570, 53134, 56497, 59041, 45241, 57060, 71847, 64690, 65964, 64026, 31787, 17709, 30572, 48495, 65096, 68689, 54008, 49836, 27779, 32286, 23392, 9951, -388, 1117, 31848, 58742, 69942, 54885, 49015, 42799, 53553, 45544, 42108, 63815, 69044, 72245, 67416, 73869, 76347, 67260, 78564, 84960, 36454, 13604, 17475, 36865, 35930, 32355, 40886, 38557, 34372, 29474, 40637, 52325, 56378, 16369, 10482, 31869, 21512, 34226, 43730, 22260, 33912, 48917, 48782, 10746, -8241, 8956, 31225, 49100, 53806, 54595, 45858, 45207, 40288, 40423, 55011, 49058, 33204, 23773, 29715, 29908, 22566, 39745, 6789]
19364F789j5981j1594O76r894J0317K8638Q585j6645K725m93k51M560j384Q570
19350A4618J7863J2038k3933j0558J6754J2004o893J8921J6591O002l196o932
19338F3279j658j553o246K962Q610J0956j849j4431k1793J1120q35k3314k8040
19325b792r753K0785R789l452k497j7953n407J8499K5857J915K2449j8370m000
19312C5070k0790m805J6913q050o029j7793J9102J3594j1257n837k8966M493M0488
19299B6133K1773oL834K6967j3402l4034j4803J5348M564j6194m3J2300J5125
19286D7562j7803j635Q086R313K682k2143l572N368O914L3676R980j6919P92k821
19272E9480J380J286k2471k1420O389R829J5984J6466j6034j0446j1599m091j0325
$$ y = [6789, -9192, -20786, -20110, -30004, -19687, 8951, 17536, 891, 3616, 3123, 2872, 7432, 6048, 14618, 32481, 44519, 20586, 10028, 26782, 38786, 31893, 50814, 67405, 73407, 70211, 63279, 61621, 60068, 53822, 56784, 65394, 76350, 74501, 60070, 38277, 49397, 48562, 25248, -2792, -12545, 8240, 18029, 14577, 12080, -5873, -11280, 7219, 33076, 34991, 57440, 39070, 35070, 14280, 9475, 26388, 18338, 12309, -5484, 13618, 27212, 15955, 10118, -18848, -14355, 26133, 47906, 47900, 51734, 78701, 65299, 31265, 16462, 31810, 36374, 20180, 20137, 32437, 47562, 29759, 28124, 36210, 45523, 48205, 26062, 22490, 27858, 34772, 68448, 78428, 61509, 62301, 59480, 60860, 62146, 39675, 18255, 24644, 34473, 50457, 66923, 50889, 40443, 28844, 24753, 14428]
19259A4428J5406p966j1096K4160R768N273K093k3869p529o893K7633k0617k4636
19246c845J4869j4057m610J7219j4238J3050K8699k3296r642M255J8425k57j3818
19233A2754j2719K8189J2969q486K675k050k701K412J3376j3110p156n448K5653
19220D6358J8443J9865K2958m49j5209m1962k7141J6898J2562j4000p210K1241
19208E2354j489n776L119J381J9029n017m049k0743p405R639K1600J796p811J2318
19194F8946K679k4799k4399J0699J1760M851l083q431M119J1550K1901k087r725
19181F3981j1080R637M105j5197j1788k997K020M93J2532L278j6216p816J1L202
19167C4165J632M340O229j9183K6512p936j0179r73O788j2309K679P305q576o50
$$ y = [14428, 29834, 21868, 10772, 34932, 44700, 49973, 52066, 28197, 20668, 13775, 41408, 20791, -3845, 11024, -3033, -7643, 9576, -4662, 8388, 37087, 13791, 4149, 8404, 26829, 26572, 12754, 35, 28224, 41193, 32707, 35382, 33332, 30631, 33043, 46419, 33309, 26153, 20705, 46358, 64801, 84666, 107624, 107175, 91966, 50004, 22863, 39761, 52323, 38323, 31113, 52354, 50865, 45089, 48208, 49589, 68618, 63601, 59552, 38809, 31404, 41043, 62643, 64439, 56628, 68946, 71625, 46826, 22427, 33126, 44886, 49737, 46654, 38223, 42342, 53892, 75793, 73706, 63981, 52901, 62538, 66643, 51446, 39658, 36661, 38681, 39174, 51706, 54984, 38768, 30952, 30963, 34165, 35797, 40137, 46366, 27183, 53695, 45759, 35580, 34607, 41395, 29086, 31765, 39070, 30494, 29844]
19153B9844J2853j4856J3053K0732n985O137j037k8800k40J6143j7629J4408j1757
19140C2866J648Q648P965J5079r905j4463j3481q902J4914j8481O458J6589J8477
19127E7412L37j4004l2769J3716J1270j030J6123l50N341j2606m900K103O098
19114D6741k4454J0349R889N623j85n593M255q687K4798J22j3555J2549M063M495
19100G0410j881N424j1796j780q262j8555l966J1468K2980K586k813J0048J3020
19087H6883j5070q007p937M687Q374J2808l5327l2205J1719L8897j2459k0122
19075C2241J559M920L0096O039Q595O395j380o130n066J247p492k278p384p013
19061E4349L3219L0476p621k5660Q985J8929R92J6056J3360n552k9035j5299k5251
$$ y = [29844, 42697, 27841, 40894, 61626, 55641, 61778, 60741, 31941, 31701, 47844, 30215, 44623, 32866, 34514, 43162, 51127, 66206, 56301, 41838, 28357, 19455, 34369, 15888, 22346, 38935, 57412, 57749, 43745, 10976, 24692, 35962, 34932, 51055, 50705, 56046, 43440, 38540, 40643, 46741, 22287, 32636, 42525, 48148, 47963, 42370, 46625, 37938, 62736, 62858, 49303, 61852, 65915, 70410, 68529, 73953, 62157, 60377, 52115, 33560, 29594, 41062, 64042, 66628, 63815, 73863, 86883, 71813, 63806, 55869, 60556, 68930, 81738, 46411, 14206, 25925, 64822, 52363, 32241, 33800, 38720, 68816, 74855, 83450, 89845, 88465, 82335, 77269, 78516, 71024, 68746, 61362, 54349, 87568, 118044, 110423, 84763, 93748, 112677, 113669, 129725, 143085, 137533, 108498, 93199, 67948]
19048F7948l7507o753L6272K6774R136O497M710L247L915j666M096j1479l90m336
19034A00464q722J113o398j0593k168J5117r729J289O451l2744k659J9044J2627
19021H3092K1074R354j5382m225k4190k2481J2272J0660j2921k810K7130J7336
19009I8909R182q539k0594j0332j6164l338J7144J1581j946L623j064r646j0815
18996E8001K262J560j8729R861J4340J2050J5001N903m174o508l526K4883K5027
18983A35951K6352J4444j0383M0478L1421r618K3875M6457O769K4788L6124K4397
18971C91055M1640N6858O7936N9587L8291M7499N1260M2951N0771P4334O0975
18960I83157R683k3822K6467O6886L2257k4939j9380j3616k6356m9839n1209o7072
$$ y = [67948, 30441, 23688, 59960, 86734, 95870, 102367, 107077, 110324, 114239, 112573, 116669, 105190, 104800, 100464, 91742, 92855, 86457, 75864, 73696, 88813, 79084, 80373, 86824, 54080, 51421, 70465, 83092, 104166, 113520, 98138, 93913, 69723, 47242, 59514, 70174, 57253, 54443, 81573, 98909, 108091, 99552, 78958, 68626, 52462, 49124, 66268, 77849, 75903, 79526, 78462, 68816, 58001, 60263, 61823, 43094, 52955, 67295, 79345, 94346, 100249, 96075, 89567, 86041, 110924, 135951, 162303, 176747, 166364, 206842, 238263, 228645, 252520, 298977, 305746, 330534, 366658, 391055, 432695, 489553, 557489, 617076, 655367, 702866, 754126, 797077, 847848, 922182, 983157, 992840, 969018, 995485, 1062371, 1094628, 1069689, 1050309, 1036693, 1010337, 960498, 909289, 842217]
18948H42217j8867m2436n1961q5596p4667m8486l0420l6778m4712l0666k6616
18937C51012m7840m2479k7187k7547j3794l7743J2538K5369k7703j1102j294j9566
18925A32664k811J3750n466l349k320j6679j1003P363J5065o007n923J1207Q165
18912A34656j1294j6473j0468l651q783Q636J9900K1192J0758n851j9301L827
18900A23148K782J8202j1918j8346j5322p169O173l196p308r55m802k72K072p35
18886H2354j5659J1295L0164o064j9807r613N278r411m203K5764K0076J3336l029
18873A20481J6228q544j0475j3644j0149l1912K35J2422P808l777l165r145k5116
18860D1247J164J9043L4634J3615O3J1481J0276j0873j0145l378j6200n875L178
$$ y = [842217, 823350, 780914, 728953, 643357, 568690, 520204, 489784, 453006, 408294, 377628, 351012, 303172, 260693, 233506, 205959, 192165, 154422, 166960, 192329, 164626, 153524, 152230, 132664, 129853, 143603, 138137, 134788, 132468, 115789, 104786, 112149, 127214, 121207, 115284, 126491, 134656, 123362, 106889, 96421, 92770, 83987, 92623, 112523, 133715, 144473, 138622, 119321, 123148, 125930, 144132, 132214, 113868, 98546, 91377, 97550, 94354, 87046, 86091, 81289, 81017, 83089, 82354, 66695, 77990, 108154, 102090, 82283, 72670, 77948, 68537, 64334, 90098, 110174, 123510, 120481, 136709, 128165, 117690, 104046, 93897, 61985, 62220, 74642, 82450, 78673, 75508, 66363, 41247, 42411, 61454, 96088, 109703, 109766, 121247, 131523, 120650, 110505, 107127, 90927, 85052, 88230]
18847H8230J5882J3458j4177j1332j3288K4232K5119N525Q046j5007j3026L737
18835A17399M288J4361k41k0983m156J393N631N804R273O831m928l056O602R100
18821A47318O233O841Q790j0580J0969p407j9646j177J7762L650l62J022K857
18808A66270m076R116n941k2736j9645j2141r617M035j4189j5057J1192K4444
18796A11655O46M969N616K837j4275j8222N519J474J5405K3382Q403n743J5951
18783A57617J7299N227J7774k5029j1045N522p056R378J9358J6210q56k3882J7917
18770A98434M4168K3878P6418R4745R7526l8161j30129o9544k8090j3261k4579
18759B31405j581j6808j4483l39k402k0730J2596J7597O099k0477q339j7395o721
$$ y = [88230, 104112, 117570, 103393, 92061, 78773, 103005, 128124, 133649, 141695, 126688, 113662, 117399, 121687, 136048, 135807, 114824, 110668, 112061, 117692, 123496, 132769, 139600, 134672, 131616, 138218, 147318, 153551, 160392, 169182, 158602, 169571, 162164, 142518, 141341, 159103, 162753, 162391, 163413, 166270, 162194, 171310, 165369, 142633, 122988, 110847, 101230, 105265, 91076, 76019, 87211, 111655, 112301, 117270, 122886, 125723, 111448, 93226, 98745, 100219, 115624, 139006, 147409, 141666, 157617, 174916, 180143, 197917, 172888, 161843, 167365, 160309, 169687, 189045, 205255, 204399, 180517, 198434, 242602, 266480, 342898, 437643, 535169, 497008, 366879, 297335, 269245, 255984, 231405, 229824, 213016, 198533, 198194, 195792, 175062, 187658, 205255, 211354, 190877, 182538, 165143, 158422]
18746A58422k836k3687j4197J2135J8000J6342q912k5896R457J4601N222k036
18734A56615j0986j3219Q687J2761l111k1969k3956P990J1025p230J6373L2240
18722A65220N710k401K710o378j5557Q027K8887q601j172M769P664J9561k0017
18709A88422n861K9015J6591K3843J7610j344q549M355j866j2112J3991j5500
18697B48595o031k37j2883J7615K0502K3312P995k6306O362L691K6678J5053K8404
18684C52750K34m278K016l0153l0688j6063J2495L1324J7522o478J60l1649j1239
18671B85953K103J6058J1469j5467K16l147J3336k68J5028J1311L3335L5938M5922
18658D51787O3262P5512N4597O4567P9593R4098R7411Q3804Q1630N1374N3712
$$ y = [158422, 155586, 131899, 117702, 129837, 147837, 164179, 155267, 129371, 138828, 153429, 158651, 156615, 145629, 132410, 141097, 153858, 150747, 128778, 104822, 112812, 123837, 116607, 132980, 165220, 170930, 168529, 171239, 164861, 149304, 157331, 186218, 177617, 176445, 181214, 188878, 208439, 188422, 182561, 211576, 228167, 252010, 269620, 268276, 259727, 264082, 262216, 250104, 264095, 248595, 242564, 242327, 229444, 247059, 267561, 290873, 298868, 272562, 278924, 282615, 309293, 324346, 352750, 352984, 348706, 350722, 320569, 289881, 273818, 286313, 317637, 335159, 328681, 328841, 297192, 285953, 288056, 304114, 315583, 300116, 300332, 297185, 310521, 310253, 325281, 336592, 369927, 405865, 451787, 515049, 590561, 645158, 709725, 789318, 883416, 980827, 1064631, 1146261, 1197635, 1251347]
18647A251347N1036Q2150O7513N5903L6086L3600N6791N9293M2073J4885L8242
18636A788919K1669j1790k9287m8102n9936n9563k7693k7016n6504k6593n0093
18625A414011r0404o1409m2274o9866j05862p9820q7885j07200r2983q1115r4402
18614E00791p7125m5207n4375l0911M450k5390k2177L7259N0823L0042r751j8199
18602C40230n617m89j869j1710j9364j5543K0078J7235q30r063j3002p248K618
18589B95426l004j0912J8782o723j7442j6241k0779k1442j253J303m565n02Q421
18576B21069N693P236r376Q185k758M65M940k334k2192j5611J5272J9984R917
18563B40490Q289K0562J4746J3597l649l522Q975J7872O748M9067J210N79K2881
$$ y = [1251347, 1302383, 1384533, 1452046, 1507949, 1544035, 1577635, 1634426, 1693719, 1735792, 1750677, 1788919, 1810588, 1798798, 1769511, 1721409, 1661473, 1601910, 1574217, 1547201, 1490697, 1464104, 1414011, 1323607, 1262198, 1219924, 1150058, 1044196, 964376, 876491, 769291, 676308, 595193, 500791, 423666, 378459, 324084, 293173, 297623, 272233, 250056, 287315, 338138, 368180, 358429, 340230, 334613, 334124, 332255, 320545, 301181, 285638, 305716, 322951, 322121, 313058, 300056, 292808, 295426, 292422, 281510, 300292, 293569, 276127, 259886, 239107, 217665, 216412, 217715, 213150, 212648, 221069, 226762, 233998, 224622, 232807, 230049, 230514, 235454, 233120, 210928, 195317, 210589, 230573, 240490, 248779, 269341, 284087, 297684, 294035, 290513, 299488, 317360, 324108, 373175, 374385, 374964, 397845]
18550C97845K9915R258J8578J5525n593Q206N458K4483P325q493L686j301k3209
18537D81683j3960j7551k255L866j0288R813J0987j5040J4101K4069o902j2944
18525D65579r846l1101l942J2159Q439J0178j9312j0789M176K1565K0924O573
18513D74603K5212J1712K1038K4597J6942P3j2348K4479J300Q67K74K8705N0635
18500F68089J6375J1210K5073L4377J3845K7551L3518K8823K0917L7363K9837
18489I46978L8806J6308K0958L2993L4047K4087Q873K3446K9370M0316J5589M5217
18477A276988O6467P9516N4401O3460J31632J38502J27168J28349J60232J90772
18467B417487K03843K04199K48177L46481L43063L35135L82140M43225N24158
$$ y = [397845, 427760, 437018, 455596, 471121, 465528, 473734, 479192, 503675, 511000, 502507, 506193, 504892, 481683, 467723, 450172, 447917, 451783, 441495, 451308, 462295, 447255, 461356, 485425, 478523, 465579, 455733, 424632, 420690, 432849, 441288, 451466, 432154, 421365, 425541, 447106, 468030, 474603, 499815, 511527, 532565, 557162, 574104, 574177, 561829, 586308, 587608, 588475, 588749, 617454, 668089, 684464, 695674, 720747, 755124, 768969, 796520, 830038, 858861, 879778, 917141, 946978, 985784, 1002092, 1023050, 1056043, 1090090, 1114177, 1123050, 1146496, 1175866, 1216182, 1231771, 1276988, 1343455, 1422971, 1477372, 1540832, 1672464, 1810966, 1938134, 2066483, 2226715, 2417487, 2621330, 2825529, 3073706, 3420187, 3763250, 4098385, 4480525, 4923750, 5447908]
18458E447908N89957O63957Q17914J041744J357740J688660J988509K300763K855605
18449A8752757L871936M899001N166310M893680N779058Q030104R418278P925771
18441F8736895N915904P793734J1687086J2267854P425746M186696P845038J2744543
18433A38603496J1124995K775788q50864M462585R101625M447761n877340p638605
18425A56149441j304150J698055m335897j2247091j1293579n609159m090785q950700
18417A10016135j3185767j0905496p032936o601389r282665j0097624p872323
18410D5037935n854676n453578n703229n082569l901490k963618k439937k073969
18402A1564869j716268j336221j000556q01987p19046o38287n28602m15970l89730
$$ y = [5447908, 6037865, 6701822, 7519736, 8561480, 9919220, 11607880, 13596389, 15897152, 18752757, 22624693, 27523694, 32690004, 37583684, 43362742, 51392846, 60811124, 68736895, 74652799, 82446533, 94133619, 106401473, 113827219, 118013915, 125858953, 138603496, 149728491, 152504279, 151653415, 156116000, 165217625, 169665386, 163788046, 156149441, 154845291, 156543346, 152207449, 139960358, 128666779, 123057620, 118966835, 110016135, 96830368, 85924872, 78891936, 72290547, 63007882, 52910258, 45037935, 39183259, 33729681, 28026452, 22943883, 19042393, 16078775, 13638838, 11564869, 9848601, 8512380, 7511824, 6709837, 5990791, 5352504, 4823902, 4407932, 4018202]
18393D018202l66805l20198k57201k09546j76783j54128j13388r1225r6004j11817
18383B121107q2919q1042q0234p7909o7173n2458m3524o3650n4626o2045n3770
18372A401757o8784n1301m8557o2012p4895n0692k0994m3071p8952n1920R271
18361H59850j1743j5567j4967k9197l6530k5863k88j1289j1276o839q373q818
18349F79100K116r446K587l3037k3699J4332J794j0543k2213j1593J5508k7748
18337E77158l4646j2114K2867k798j4331M085J9554J2986l959j7119k02q159j9255
18324E24067j0696l0909j6006n066N417J8247j014j9905l1106J423K992O13K6721
18311D64778L026j8884j2885L6004K6859K460j4552o621K1773L5006L1688K9213
$$ y = [4018202, 3651397, 3331199, 3073998, 2864452, 2687669, 2533541, 2420153, 2328928, 2232924, 2121107, 2038188, 1957146, 1876912, 1799003, 1731830, 1679372, 1635848, 1572198, 1517572, 1455527, 1401757, 1332973, 1281672, 1233115, 1171103, 1096208, 1045516, 1024522, 981451, 902499, 850579, 859850, 848107, 832540, 817573, 788376, 751846, 725983, 725695, 714406, 703130, 696291, 687918, 679100, 681216, 671770, 674357, 641320, 617621, 631953, 633747, 623204, 600991, 589398, 604906, 577158, 542512, 530398, 553265, 550467, 536136, 540221, 559775, 572761, 568802, 551683, 551481, 543322, 524067, 513371, 482462, 466456, 461390, 466807, 485054, 484040, 464135, 433029, 434452, 437444, 438057, 464778, 467804, 448920, 436035, 472039, 498898, 501358, 486806, 480185, 501958, 536964, 568652, 597865]
18299E97865J6497K9832K4825J6567M679J3025M770J9296P750p171q68j7804j6360
18286F92903J367j6114k5872k9136k1969k5651k4698m3413m1735n0733j6183l5958
18274C62808j2589L852l7949n1054l4594k0398j1436o159J4719J9617k854P278
18262B31241O965L5745K9589L2722L9083L2739K7927L3719J2249K7260L2248J6316
18250E57803O660K1689Q078K6566L4907K8234q832J0503o445k0404m675J7692
18238F71776K7k4549J7489O803k2343N844L0223j245k0363l729k0245m766K0525
18225F55447L952k413n26j4120K631J9103L4905L5856r612p899j0503n896J83
18212G01108J6272J2480K7990J8815J7271J9940K2332L6257J4399K0627J5315
$$ y = [597865, 614362, 644194, 669019, 685586, 690265, 703290, 708060, 727356, 735106, 727935, 727067, 709263, 692903, 694270, 678156, 652284, 623148, 601179, 575528, 550830, 507417, 465682, 414949, 398766, 362808, 350219, 354071, 316122, 265068, 230474, 210076, 198640, 192481, 207200, 226817, 223963, 231241, 238206, 273951, 303540, 336262, 375345, 408084, 436011, 469730, 481979, 509239, 541487, 557803, 564463, 586152, 594230, 620796, 655703, 683937, 675105, 685608, 679163, 658759, 654084, 671776, 671803, 647254, 664743, 671546, 649203, 655047, 685270, 684025, 663662, 659933, 639688, 634922, 655447, 659399, 656986, 656460, 642340, 644971, 664074, 698979, 734835, 725223, 717324, 706821, 700925, 701108, 717380, 729860, 757850, 776665, 793936, 813876, 836208, 872465, 886864, 907491, 922806]
18201I22806J6056J6508J9431j3561P886N5173M0351M6750L6065P5667K6509K2245
18189A271886L6746N4814L2970M9149N5994L6076P4646Q2356L0469M7282O9668
18178A842056N3974N8228R6752Q3750P5938Q9170J06625J06900J30319J32349
18168B776061J48000J90424K00713K14333K43221K78755L12623L81491L99695
18159E145316M93026N30483O13514O75722P64081P89775Q56151R98285J059519
18150A1925872J114385J234570J448430J691411K024359K462518L047793L942157
18142B8891495N265212P167058R662124J2614991J6123060K1068940K6360777
18135A27153657K8572621K9785020L5377538L8179276K9703789K3808322K8165376
$$ y = [922806, 938862, 955370, 974801, 961240, 969126, 1024299, 1064650, 1111400, 1147465, 1223132, 1249641, 1271886, 1308632, 1363446, 1396416, 1445565, 1501559, 1537635, 1612281, 1694637, 1725106, 1772388, 1842056, 1896030, 1954258, 2051010, 2134760, 2210698, 2299868, 2406493, 2513393, 2643712, 2776061, 2924061, 3114485, 3315198, 3529531, 3772752, 4051507, 4364130, 4745621, 5145316, 5638342, 6168825, 6782339, 7458061, 8222142, 9011917, 9868068, 10866353, 11925872, 13040257, 14274827, 15723257, 17414668, 19439027, 21901545, 24949338, 28891495, 34156707, 41323765, 50985889, 63600880, 79723940, 100792880, 127153657, 155726278, 185511298, 220888836, 259068112, 288771901, 312580223, 340745599]
18128C40745599K4119241Q664679N517668Q560322K449775k778969j969283p853257
18120C77455775j1388269q562683j5339426k8072877k6866202k3977843l1395351
18113B31853124l5099801k8260304k1803459j6306253o169012N48146j4223016
18106A10539425l1222808k3052498j3316630q327890n787115m308772l264521
18099B1259191k591969k199807j839204j545780j363892j201207j031010q74226
18091H612096q11658p32400o00031n50785m64208m07126l58477l01262k45550
18082D140599k19533j88015j57500j70141j45786j36614j26996j11497j35184
18073B749333j25099q5732r2630j12291r7234q2057r6963j00400o4697o1534r2231
$$ y = [340745599, 364864840, 373529519, 379047187, 387607509, 390057284, 387278315, 385309032, 377455775, 366067506, 357504823, 342165397, 314092520, 287226318, 263248475, 231853124, 196753323, 168493019, 146689560, 130383307, 124214295, 124762441, 110539425, 79316617, 56264119, 42947489, 34619599, 28832484, 24523712, 21259191, 18667222, 16467415, 14628211, 13082431, 11718539, 10517332, 9486322, 8612096, 7800438, 7068038, 6468007, 5917222, 5453014, 5045888, 4687411, 4386149, 4140599, 3921066, 3733051, 3575551, 3405410, 3259624, 3123010, 2996014, 2884517, 2749333, 2624234, 2538502, 2445872, 2333581, 2236347, 2154290, 2057327, 1956927, 1892230, 1830696, 1738465]
18062A738465p5460p1663o4514m3985n4017p1580m6600k8701l2882l3146k5046
18051A190871j4113n2658m5318l5404l3175j3809p184k3518l1115k9949l0500
18040H74128j3572j2362k7945j7735o065k0550k647m401k6132k9135l2270j7760
18028F63554j3426l29j3478o841l7577j3953j6177r3Q080N05j7927J8915m448
18015E66805r934R548m876n370l176r284K913N357o958k266K6415L9532M2454
18002F51160K9403J3409R169O490R269o022R666j3536k3805o167l4522m652J3833
17989F53695k278j9306r100j320l5841k3142J8326J7578j1576j3635k5107k2751
17977E25543j4596k6082k1989r121o4777m7913k7970k6106j9073k7776l8086j7526
$$ y = [1738465, 1663005, 1591342, 1526828, 1482843, 1428826, 1357246, 1310646, 1281945, 1249063, 1215917, 1190871, 1176758, 1124100, 1078782, 1043378, 1010203, 996394, 989210, 965692, 934577, 904628, 874128, 860556, 848194, 820249, 802514, 796449, 775899, 773252, 768851, 742719, 713584, 681314, 663554, 650128, 649799, 636321, 629480, 591903, 577950, 561773, 561680, 569760, 570265, 552338, 571253, 566805, 556871, 566419, 561543, 556173, 552997, 543713, 546626, 551983, 545025, 542759, 569174, 608706, 651160, 680563, 693972, 703141, 709631, 718900, 712878, 722544, 709008, 685203, 679036, 644514, 639862, 653695, 651417, 632111, 623011, 621691, 585850, 562708, 581034, 598612, 587036, 573401, 548294, 525543, 510947, 484865, 462876, 453755, 388978, 341065, 313095, 286989, 267916, 240140, 202054, 184528]
17965A84528l9470k6017l3660j5339p147j5138L263M962L397k559k474n810K1128
17952F9664K6367j3025j4148P267J1329L4701K9571m326J0293J5668l651J3174
17940A82884J5865j983k86j9140L432j1414k952j1264p146p394j9162j6525J0963
17927A15878j0433l2967j4293R395q788N442q99k059O416K7057J8845M509J8674
17914A36777L6433K7527K2233K6259M4704N1616L5700L4137N8382Q7316O0535
17903F21619J7185K3791M5493P5406N4961o809k9276K3695M3854J6751j4613m2914
17891H29143j1419j26l8356o0772o3751k5339p743o8744o1203k7696l8286m1208
17879C84500l9816n0880n1963L773k3439k1550l9402k3954j959K952l1952q345
$$ y = [184528, 145058, 119041, 85381, 70042, 62895, 47757, 51020, 55982, 59379, 56820, 54346, 48536, 69664, 96031, 83006, 68858, 76125, 87454, 122155, 151726, 147400, 157693, 173361, 169710, 182884, 198749, 196766, 196480, 177340, 180772, 169358, 166406, 155142, 147996, 140602, 121440, 104915, 115878, 105445, 72478, 58185, 67580, 58792, 64234, 63335, 61276, 67692, 94749, 113594, 118103, 136777, 173210, 200737, 222970, 249229, 293933, 345549, 381249, 415386, 473768, 561084, 621619, 638804, 662595, 708088, 783494, 838455, 831646, 802370, 826065, 869919, 886670, 872057, 829143, 817724, 817598, 779242, 718470, 654719, 629380, 621637, 552893, 491690, 463994, 425708, 384500, 344684, 293804, 241841, 245614, 222175, 200625, 161223, 137269, 135310, 138262, 106310, 97965]
17867I7965k7700l814K878q765Q189L907j7546l9081j7013l689R497j923j140
17854A765j5793j7963J9422K5786J7400P997j0479l9620n806J7698N391m723J6468
17841A7543L1405m861o551Q537p544j8345k877K4408J7156K7714J9230j7806j3625
17828G4384K64K3302J9230k9142j5357K913r970n207J2471J0452J6021k107o333
17815I0921j3628q108k0255k2121K6811j323M779L0035l696k1351j1418q059m489
17802C8098Q498j1446N959l838k3262Q196J0217j4050j4542M665m83p692L038
17789C358K120J2712O890p081J0125j2428q169L690R102j6806n581j2548j36K9894
17775A5142J7613l001j5777J0890Q180J7928J3450m057m9239l2073K550P406q664
$$ y = [97965, 70265, 66451, 69329, 60564, 68753, 72660, 55114, 16033, -980, -4669, 4828, 2905, 1765, -14028, -31991, -12569, 13217, 30617, 38614, 28135, -11485, -17291, 407, 5798, 1075, 17543, 48948, 44087, 37536, 46073, 38529, 20184, 17307, 41715, 58871, 86585, 105815, 88009, 74384, 74648, 97950, 117180, 88038, 72681, 75594, 65624, 60417, 72888, 83340, 99361, 97254, 90921, 77293, 69185, 48930, 26809, 53620, 52297, 57076, 87111, 83415, 62064, 50646, 42587, 38098, 46596, 35150, 41109, 37271, 14009, 22205, 32422, 18372, 3830, 8495, 8012, 320, 3358, 5478, 18190, 25080, 17999, 28124, 15696, 7527, 11217, 20319, 3513, -2068, -14616, -14752, 15142, 32755, 29754, 13977, 24867, 33047, 50975, 64425, 60368, 11129, -20944, -18394, -10988, -19652]
17762a9652j3008j2822K3824L5542K5183J9492k5245m1860k1203j0261K2599J9558
17750B147L0211n292m941n840m736R824r352J6975j795k1387R46R85j766n773
17736B06j6576j5669R778J0504J9383J4090l2652j4005K5754j015l366p947J138
17723a0377J9766k172K2072J1683j7447p44k1907j8144r933p006J0164l475j1292
17710c8812j0300l417J6543J0843J837o752j7557n249K1558K2411m438Q781M961
17697D09o440O716k4296k2627Q778J3929K3211J2789m596P688Q561J0759m93j8047
17683A6341L014K3937p4q232j5862O176R781p273j7970l610J2080j0207k4768
17670a6667j1430P314l404M626J1339O439j9791P998L5109l0487L061J2582m495
$$ y = [-19652, -32660, -45482, -21658, 13884, 39067, 58559, 33314, -8546, -29749, -40010, -17411, 2147, 32358, 27066, 22125, 16285, 11549, 21373, 12021, 28996, 27201, 5814, 6760, 7745, 5979, 206, -16370, -32039, -22261, -11757, 7626, 21716, -10936, -24941, 813, -202, -3568, -11515, -10377, 9389, 7217, 29289, 40972, 23525, 22781, 874, -17270, -27203, -34209, -24045, -27520, -38812, -49112, -52529, -35986, -25143, -23306, -30058, -47615, -52864, -31306, -8895, -13333, -4552, 409, -6031, 685, -23611, -46238, -37460, -23531, -320, 12469, 7873, 15561, 24122, 34881, 34388, 16341, 19355, 43292, 43218, 34986, 19124, 25300, 35081, 27808, 9838, 6228, 18308, 8101, -16667, -28097, -20783, -24187, -19561, -8222, -1783, -21574, -13576, 21533, -8954, -5893, 6689, 2194]
17657B194o764j876J2886m442J625L243l738R086K0528k4915k5289k2052N63L2619
17643f332N860P855k2856R262Q117R642J6979K9610N752N301K9516K6824L7137
17630A62667K7820J1520M4029L3413N2674N0469O8760R0738J18875J22385P7486
17619H60836O3583R3700P0656N1334K9390N0345K8681N7587N6354L0518L1757
17608A424741M1935M1846L8415J4791j0561j4365n0072o0339o8797o7434m4840
17597A245320m7892m5364o6673l4587j7842o4929q5131p3303n3157r2808r6970
17586E66664o5726n9409m8684n2765o7369m0785j9178q040j3502l2590k7520k8078
17574A03018j6859k742j935k1613J3540M1529j4124l2896j4304j1168k5604j0132
$$ y = [2194, -4570, -6446, 6440, 1998, 3623, 6866, 3128, 12214, 32742, 7827, -17462, -39514, -38951, -6332, -472, 7383, -15473, -6211, 1906, 11548, 28527, 58137, 63889, 69190, 98706, 125530, 162667, 190487, 202007, 246036, 279449, 332123, 382592, 451352, 542090, 660965, 783350, 860836, 924419, 1018119, 1088775, 1140109, 1169499, 1219844, 1248525, 1306112, 1362466, 1392984, 1424741, 1466676, 1508522, 1546937, 1561728, 1551167, 1536802, 1486730, 1426391, 1357594, 1290160, 1245320, 1197428, 1152064, 1085391, 1050804, 1032962, 968033, 882902, 809599, 756442, 663634, 566664, 500938, 441529, 392845, 340080, 272711, 231926, 212748, 204708, 191206, 158616, 131096, 103018, 86159, 83417, 81482, 59869, 73409, 114938, 100814, 67918, 53614, 42446, 16842, 6710]
17562F710j1263k1316J2257k17p746J6419k280r602L230K2812L139j1868L1328
17549C1603M74j0358l46p681o13o450J2309m391r989J0226K7372M964R768R049
17535F5937j0104j5240l31J8669q066k1621n08J4530J9863M778j5971j4239j2516
17522B5181M744j8962j6640r569R375N08j1276M110j0290o703J7804O952K0919
17509A6153J2751j7010r390r767n666M207K3587n636j2012j9583m455J9553K389
17496d879m761j1128n720K4242P788j2139N163j2097k1745J5328J2173j5237J2706
17483a0306j1779m151p047l176K901k1906L618j466j4994k0066L2008K5581j004
17470c1787r497Q380q537l378J1393J528J0504q257k3527j9285Q081R775K6626
$$ y = [6710, -4553, -25869, -13612, -13829, -21575, -5156, -7436, -17038, -13808, 9004, 12143, 275, 31603, 32077, 21719, 21373, 13692, 13079, 6629, 18938, 14547, 4558, 14784, 42156, 47120, 56888, 65937, 55833, 40593, 40262, 58931, 50865, 29244, 28736, 43266, 63129, 67907, 51936, 37697, 25181, 29925, 10963, -5677, -15246, -5871, -5363, -16639, -12529, -22819, -29522, -11718, -4766, 16153, 28904, 11894, 2504, -7263, -12929, -8722, 14865, 9229, -2783, -22366, -26821, -7268, -4879, -9640, -20768, -26488, -2246, 5542, -6597, -1434, -13531, -35276, -19948, -7775, -23012, -10306, -22085, -26236, -33283, -36459, -33558, -55464, -51846, -53312, -68306, -88372, -56364, -30783, -31787, -41284, -32904, -41441, -44819, -33426, -31898, -21394, -29651, -53178, -72463, -64382, -54607, -27981]
17457b7981K6436j9530l035J1747N121M866j7630j734J729J1938K5207K1495L024
17444D1653L3381O6230N7243Q535n7036n5759l9794k3471l3198j2975O348p243
17432a6086k3140q075J6826K1569K3397P759k8335k0949k1898r898q305J7165
17420d9970r020M0J6004K2680L1688j7727k2751N020O744K614N774J4484J3057
17407A8637j7407j1423k2774p861R251n854R229q820q208r932o305l350Q122N965
17393e0730m086J747j3808Q937m166O722J0520l191J8341O621R569J1718K31j2237
17379a3812j2471j8730K237J0711m511l3568q380M1634J6261j6087j549P705K5634
17366d926k609K380J2900j9913K717m987j7659J5356r840k6211K036j2480J1668
$$ y = [-27981, -1545, -21075, -24110, -12363, -7242, -2376, -20006, -21740, -20011, -8073, 17134, 38629, 41653, 75034, 141264, 198507, 207042, 150006, 94247, 54453, 30982, -2216, -15191, -8843, -16086, -39226, -47301, -30475, -8906, 14491, 22250, -6085, -27034, -48932, -58830, -67135, -49970, -58990, -58950, -42946, -20266, 11422, -6305, -29056, -24036, -17292, -14678, -8904, 5580, 18637, 1230, -10193, -32967, -40828, -31577, -37431, -28202, -37022, -45230, -55162, -61467, -64817, -56695, -50730, -54816, -53069, -66877, -57940, -62106, -55384, -44864, -48055, -29714, -23093, -13524, -1806, -1575, -13812, -26283, -45013, -42776, -32065, -36576, -70144, -78524, -36890, -20629, -36716, -38265, -30560, -4926, -7535, -5155, 7745, -12168, -9451, -14438, -32097, -16741, -26581, -52792, -50756, -63236, -51568]
17353e1568J2097j0119Q209Q405k4117j1314L3237K2349q032j3270J2714m237
17341b5646k0859P425K7612Q427j514l6159O702J1240K3748j1114j9895n095j715
17328c6843N177R638k964m896J525j4314j264P089o489K644P571J8604J2739j9912
17314b1695r442q578P025J9237n262k0574p658Q310J3720N058k1273N339o039
17301d1832j9096o773K0628M1657J3498j1759j3072p830q20r930n674m867n72
17288d6442L95J6451J4242J4688j6775L702J1568k8825j6222J348M518J1955J5454
17275a3943O996q08j2317J4988K9819j0884j7191R10J1824J648m586k8853q186
17262c0583N17M685O247J364r423l536R777j6195M018J0931k1443o771R769J3003
$$ y = [-51568, -39471, -49590, -41381, -32976, -57093, -68407, -35170, -12821, -20853, -34123, -21409, -25646, -46505, -39080, -11468, -3041, -4555, -40714, -34012, -22772, 976, -10138, -30033, -35128, -36843, -31666, -22028, -24992, -29888, -28363, -42677, -43941, -36852, -43341, -40697, -33126, -14522, -1783, -21695, -31137, -39715, -32690, -13453, -18715, -39289, -46947, -38637, -24917, -19859, -41132, -35793, -41832, -60928, -67701, -47073, -5416, 8082, -3677, -16749, -24579, -25399, -35329, -41003, -45870, -46442, -46047, -29596, -15354, -666, -17441, -13739, -2171, -30996, -47218, -45870, -41352, -29397, -13943, -6947, -7755, -20072, -5084, 24735, 13851, -3340, -2430, 9394, 11042, 6456, -22397, -30583, -30066, -25381, -19134, -17770, -27193, -30729, -20952, -37147, -33129, -22198, -43641, -50412, -40643, -27640]
17248b7640n919M196Q112j660p083n967J460Q56j4317j9222j743j9826J589J5881
17234g1283O18N989M906J4062J9947J6837j2771k2494L89L5213J0167r460J428
17221f452J455r983q967j6486P998J4565j1955q979M82J0766p950j5321M186R758
17207c6883J7800N159j8850j136K9348k416k4015L556K1432r932M232r921r549
17194c1175j5732q766o596j1966p218M4745J1001o94p721j2028J8770J3370J1866
17181b144k2127r316K6521J1777j4286k2460m800m724K1306J4819r039k763R227
17168h009o220P310j1220j2399Q754m447J557j2152j487N24Q769J1561L330J740
17154a2389J0430m703l1523o907O460j753M408K0303J4995K729J1132m104m9508
$$ y = [-27640, -33559, -29363, -21251, -22911, -29994, -35961, -34501, -33645, -47962, -67184, -68927, -88753, -87164, -71283, -70665, -64676, -59770, -45708, -25761, -8924, -21695, -44189, -43800, -8587, 1580, -7880, -6452, -4997, -14980, -23947, -40433, -32435, -17870, -29825, -38804, -38322, -27556, -35506, -50827, -46641, -36883, -19083, -13924, -32774, -33910, -4562, -6978, -30993, -27437, -6005, -15937, -11705, -21626, -31175, -46907, -55673, -62269, -74235, -81453, -36708, -25707, -26401, -34122, -46150, -27380, -14010, -2144, -24271, -33587, -7066, 4711, -9575, -32035, -36835, -41559, -20253, -5434, -14473, -17236, -8009, -14229, -6919, -18139, -30538, -21784, -26231, -24674, -36826, -38313, -37789, -29020, -17459, -14129, -12389, -1959, -6662, -38185, -45092, -38632, -40385, -35977, -15674, -679, 2050, 13182, 9078, -40430]
17141d0430j8829P596P921n885J4164j659k113J9120J0603j8486J2387k606j514
17128a9731J5412m008j3556j519P514k879J2601m683r560m745P892J0345k3663
17115c0580k6227Q786K2850j4076J070J7676k6813J9607J8122Q257p53k240J7473
17102A3152j280j7607l801j0843J5489J5227l1400k213J7678n416j1637Q67l545
17089b5329M144J2410j5168l448q1j4505p107K369k826k554j025N174K6069P330
17075a4547l6800O198K6217J8219q759j6651j7596m783k445Q392K583J3473J2134
17062a4365j3755j387N461J1846r879j9231o933J801J6397J8694J5462J4026j4584
17049C553k0466j1602O22q102M703J9487J747J560j0159K660O659j108o068N459
$$ y = [-40430, -59259, -51663, -43742, -49627, -35463, -37122, -39235, -20115, -9512, -27998, -15611, -18217, -19731, -4319, -8327, -21883, -23402, -15888, -18767, -6166, -10849, -20409, -25154, -17262, -6917, -30580, -56807, -48021, -25171, -39247, -38177, -20501, -47314, -27707, -9585, -1328, -2081, -4321, 13152, 11872, -5735, -9536, -20379, -4890, 10337, -21063, -23276, -5598, -11014, -22651, -21784, -25329, -21185, -8775, -23943, -27391, -27472, -41977, -49084, -46715, -49541, -52095, -53120, -47946, -21877, -14547, -51347, -45149, -18932, -713, -9472, -26123, -43719, -48502, -50947, -42555, -39972, -26499, -14365, -28120, -29507, -24046, -12200, -22079, -41310, -48243, -46442, -30045, -11351, 4111, 18137, 3553, -16913, -28515, -27893, -35995, -31292, -11805, -10058, -8498, -18657, -15997, -9338, -10446, -16514, -11055]
17035a1055K1236J734j2858j4108j085k1860J590L71K62K6131j4992L931L2686
17022A1983K022j0168k2292k1938r156j7453j4614J3871J0533p1j5372r3J6508
17009e6240L4488J0083j2299m465J1926m038j7401J4711J4600j2928k2466k4578
16997f8607L884J8453l866K6084J5480l81q51j3753k1439m794J9645j4499k3516
16984f8160R949J8863J6076p712j2721J4883M363L064m296K522nM466K0300Q139
16970I731q098k0902m956O78L54J00n086K0307K2825k037l2054n886k293j3776
16956d1093R158N350k6518j1547J2157K2146J2831k9496p52L0973J8740j3916
16944a1967j0461J587m450k8106p53J4674n041K0652J1438K5030K2675j4027k7598
$$ y = [-11055, 10181, 11915, -943, -15051, -16136, -37996, -36406, -36035, -35773, -9642, -24634, -20703, 11983, 14005, 3837, -18455, -40393, -49549, -67002, -81616, -67745, -57212, -57283, -72655, -72748, -56240, -21752, -11669, -23968, -28433, -16507, -20545, -37946, -23235, -8635, -21563, -44029, -68607, -64723, -46270, -50136, -24052, -8572, -8953, -9804, -23557, -44996, -49790, -30145, -44644, -68160, -58211, -39348, -23272, -30984, -43705, -28822, -24459, -21395, -25691, -23169, -23174, -18708, 1592, 9731, 1633, -19269, -24225, -23547, -23193, -23093, -28179, -7872, 14953, 12916, -19138, -25024, -27317, -41093, -31935, -26585, -53103, -64650, -52493, -30347, -17516, -47012, -47764, -16791, 1949, -11967, -22428, -20841, -25291, -53397, -54150, -39476, -44517, -23865, -12427, 12603, 35278, 21251, -6347]
16931f347r425K879J5337j1720j2100j6320K1185J1252R288O686j2715q239R081
16918a158J4719J8569l253J989j3548j4813k951k4608J5884q522q572j870J7106
16905a1028l4296k6671J3885J2301J4232J5920J1469l562L626K059O476J8957
16893B3368r371k2787k8241K090J6512R889K3807K526k3126j4163l926l337o053
16880c2812L848j499j1064n264J1066J8067J206q189P540J6614K5791O219k676
16867B8847j4054r329K874k1586l739L722K509k1494j7058j3322J0195L8605K935
16854a0895j2288m549J7550R976n085J6441o302k5259q069q656K2536K5682n981
16841E101m2621l53p765J545k63P107K375J4374k148K797L823K741j5351Q429
$$ y = [-6347, -15772, -12893, 2444, -9276, -21376, -37696, -16511, -5259, 4029, 10715, -2000, -10239, -1158, 13561, 32130, 28877, 30866, 17318, 2505, -446, -25054, -9170, -17692, -26264, -28134, -11028, -45324, -71995, -58110, -45809, -31577, -15657, -4188, -7750, -4124, -2065, 4411, 23368, 13997, -8790, -37031, -34941, -18429, -8540, 15267, 17793, -5333, -19496, -23422, -26759, -32812, -28964, -30463, -41527, -46791, -35725, -17658, -16452, -24641, -17101, -487, 25304, 31523, 28847, 14793, 5464, 8338, -13248, -16987, -13265, -10756, -32250, -49308, -62630, -52435, -13830, -10895, -23183, -27732, -10182, -206, -5291, 11150, 4848, -20411, -28480, -37136, -14600, 11082, 5101, -37520, -37873, -45638, -44093, -44356, -37249, -34874, -20500, -22648, -19851, -16028, -13287, -28638, -20209]
16827b0209p1j0269r581R81j4597L659r423J9959L7346l057m1850K3710R820j0084
16813b3666M707K0753K652l552R335p788L233l800o913k111m231j483J3643R490
16799A0269k450p650l2566J6977J108P5P332Q499J2876P717P829J0143m850k1830
16785A3479m0827k8245j5929K4948k65p209Q622r182p241R861M406J6159J9486
16772a1937P011o963j5342n188P441K5923J8017k322k2113k6322j7335J5049J8024
16759a6057j3739J090j4019p457L851J4232N678J6849J1861j1926J394J9078J4090
16746B4925J1834r285q52j0256r57L324k1953j0873M473j2114j8155J2413M5642
16733A8166L8367k0748j8822J072m091j4565l9022j2013K4336k657J207J3498
$$ y = [-20209, -20280, -30549, -40130, -39149, -53746, -50087, -59510, -39551, -2205, -5262, -47112, -23402, -13582, -23666, -18959, 1794, 4446, 894, 10229, 2441, 5674, 1874, -5039, -7150, -11381, -12864, 779, 10269, 7819, 169, -32397, -15420, -14312, -14237, -6905, 1594, 14470, 22187, 30016, 40159, 35309, 13479, -27348, -55593, -71522, -46574, -46839, -54048, -45426, -54608, -61849, -51988, -47582, -31423, -11937, -4926, -11889, -27231, -32419, -24978, 945, 18962, 16640, -5473, -31795, -49130, -34081, -16057, -29796, -28706, -42725, -50182, -46331, -32099, -26421, -9572, 2289, -9637, -8243, 10835, 24925, 36759, 27474, 26622, 16366, 15409, 18733, -3220, -14093, -9620, -21734, -39889, -27476, 18166, 56533, 35785, 16963, 18035, 13944, -621, -39643, -51656, -27320, -29977, -28770, -15272]
16721a5272J2768J3721J4790j3311k4124j148n392k1476j877J594O738L018l819
16708c3790K1848L592j7143J248q23P290J6809J4892j9166k4574l1955J6714j3443
16695e8501J8583J7618p404l202L633j0233o816n351M675K391L71q186J8339J6440
16681a7643K0517j6966q221M582N831j2030p771L251L267L721K4962q262M439
16668c23J950j2714k854K870K5056j0351j8328q566n473m977K3196J2934K7260
16655B9680j298P661o556J4879R817k1960k205J0790k009k9618j7137j4860j7333
16642d0149J0865K4577j3632P020J6356k0439q935k7169N836K8990K0156j814
16630A662J7798K476l8164r366m710k712Q587L0320K9783j3147k2253j1240L784
$$ y = [-15272, -2504, 11217, 26007, 12696, -11428, -12576, -17968, -39444, -41321, -39727, -32989, -29971, -33790, -11942, -8350, -25493, -24245, -25068, -17778, -969, 13923, -5243, -29817, -61772, -45058, -58501, -39918, -22300, -29704, -32906, -29273, -39506, -46322, -51673, -46998, -44607, -44236, -52422, -34083, -17643, 2874, -14092, -22313, -17731, -11900, -23930, -31701, -28450, -25183, -21462, 3500, -4762, -323, 1627, -11087, -13941, -11071, 13985, 3634, -14694, -23260, -28733, -33710, -10514, 2420, 29680, 28382, 36043, 29487, 44366, 54183, 32223, 30018, 40808, 38799, 9181, -7956, -22816, -40149, -29284, -4707, -18339, -11319, 5037, -15402, -24337, -51506, -45670, -16680, 3476, 1662, 19460, 21936, -16228, -25594, -30304, -33016, -24429, 5891, 35674, 22527, 274, -10966, -7182]
16617g182P280k0221N761N160j5478L1927J1668j8213j4003q104M366m482j9395
16604d0916k2520J4039J5552O723P804O408N302J6476k85K89K4992n3k6334j2941
16590e464Q617J097q579P12n359k042J5416J7226J3239j2961j922P51J4078J5499
16576E0308j1213l9101q854n997k334j8426Q827J27n645R177R652J039R876K2125
16562A9561k517j5005j6334k8505l335L6654K7180r981j0789m556k4789j686l781
16549c7883l7250j1940K7204P595O493k140j014K9692Q070j2116O825l340O605
16536a3199J1227m674j722k3517q492K2189K6225j451j9734j6331Q066K442k751
16523b1722j357J0629Q737p087j7395L6413K254P514m672J618r226l1557m858
$$ y = [-7182, 98, -20123, -14362, -9202, -24680, 7247, 18915, 702, -13301, -21405, -17039, -21521, -40916, -63436, -49397, -33845, -27122, -19318, -12910, -7608, 8868, 8583, 8872, 33864, 33811, 7477, -5464, 3153, 4250, -4329, -3617, -8976, -11018, 4398, 21624, 34863, 21902, 19980, 20731, 34809, 50308, 39095, -6, -8860, -14857, -17191, -35617, -26790, -26663, -32308, -23131, -13479, -12440, -2564, 19561, 17044, 2039, -14295, -42800, -46135, -9481, 17699, 7718, -3071, -7627, -32416, -34102, -37883, -75133, -87073, -59869, -52274, -45781, -47921, -48935, -19243, -11173, -23289, -16464, -19804, -13199, -1972, -6646, -8368, -31885, -40377, -18188, 8037, 6586, -13148, -29479, -21413, -18971, -21722, -23079, -12450, -3713, -10800, -28195, 8218, 10472, 17986, 13314, 14932, 5706, -25851, -30709]
16510c0709P582K520J491l0863j0857L6706K7921K2J957m858k4864r20J8460p562
16496a3974l040j7159q628J8309J9110K5458J2883j9308l6826r870K1272N00j926
16483a3199K0310K4399o887r242p9j2094o794j2339m898J2464N517o582l477J878
16469a1023K4426o126j224k7734l4292Q862n317p406j3489L4099K9752J7428j6611
16456h655l521j9815k1169N240R887J9867J0052p522m037J0433J4421J4763J3498
16443C3442j3243j3455n620r374k1312L090O592o578K4976Q632p146K9503J9861
16430D9368j557m917j0978j7692j4284l846J5129J1823m256j072j888l0576K2107
16417G361J3244k0652j2577p298K638J1363J0171K5983O014r966k376j898j7946
$$ y = [-30709, -23127, -20607, -19116, -49979, -60836, -24130, 3791, 3813, 5770, 912, -23952, -24872, -6412, -13974, -17014, -34173, -42801, -24492, -5382, 20076, 32959, 13651, -23175, -33045, -11773, -11273, -13199, 7111, 31510, 24623, 15381, 15302, 3208, -3586, -15925, -20823, -8359, -2842, -9424, -12901, -11023, 13403, 7277, 6053, -21681, -55973, -47111, -52428, -59834, -73323, -39224, -9472, 7956, -8655, -12176, -31991, -53160, -47920, -38033, -18166, -8114, -15636, -19673, -9240, 5181, 19944, 33442, 20199, 6744, 1124, -8250, -29562, -26472, -19880, -26458, -1482, 7150, 4, 29507, 49368, 47811, 42894, 31916, 14224, -60, -3906, 11223, 23046, 18790, 17718, 15830, -14746, 7361, 20605, -47, -12624, -19922, -17284, -5921, 4250, 30233, 36247, 26281, 23905, 22007, 4061]
16404D061j8736J0763K736K1728P388J130o77j6236k1294p872j0888n23J4924
16391a3496j4432k8924J3909K3022J112J1882p994o194j3320j856P848J6397q645
16378b0691j2693m120J1488J789J3983J1084J7552P799r580P194j840o569J1243
16365B6639p996p471J0657J1215r247l9337k0042J5304K2756r907O71J4999J2666
16352B0907j0045j9136O589J9913j1429j3148j3130k050m682k304J2980L2345
16340A6810l360r690K171j2896j075n128K872m512l3525j9955L6941J8377k3489
16327c6459p642Q546K644K14L924O649K1242p58K204J8622K758k7634q228O8q160
16312b2010K5508j0940L660J910N17k2303k0102K9684K3864k611N051Q529O263
$$ y = [4061, -14675, -3912, -1176, 20552, 27940, 29070, 28393, 12157, -9137, -17009, -27897, -28420, -13496, -27928, -56852, -42943, -19921, -18809, -6927, -14921, -21115, -34435, -36291, -28443, -12046, -20691, -33384, -37504, -26016, -24227, -10244, 840, 18392, 26191, 16611, 23805, 21965, 15396, 26639, 18643, 11172, 21829, 33044, 23797, -15540, -35582, -20278, 2478, -7429, -6758, 8241, 20907, 10862, -8274, -1685, 18228, 6799, -6349, -19479, -21529, -26211, -28515, -15535, 16810, 13450, 3760, 5931, -6965, -8040, -13168, -10296, -14808, -48333, -68288, -31347, -12970, -36459, -44101, -35555, -32911, -32697, -28773, -22124, -882, -1640, 564, 19186, 21944, -5690, -13918, -13850, -22010, 3498, -7442, -3782, -1872, -1355, -23658, -43760, -14076, 9788, 7177, 12228, 20757, 27020]
16299B7020j1986O148L076r380L914P916K18k0269J9183J7806l1807k7654j3519
16286b9334M215J5504j1342r833L516P739j675j3144P945J8155K0663J2671o468
16273A8612j448K401j3357j7614k7354l319K0981K2219j621k2156k5889J4297
16261c4248K3678K0161J8623M013m840n124j5918j6383R989J8135o857l4604j8345
16248d1720O855J1844J9410j868L289O55q193J5801P542Q185J009k6914j0352
16235a4457K5411Q504K484k2168J339j496j4283p576j2570L46M171J6420M061
16222i814n522k087r535j3610J4430J8207k5418j775L0389m801p491K2861K1463
16209B7297j490k5090j2385J5477M639j3218m187K804J2038N833j0725q477k247
$$ y = [27020, 15034, 21182, 24258, 14878, 18792, 26708, 26926, 6657, 25840, 43646, 11839, -15815, -29334, -25119, -9615, -20957, -30790, -27274, -19535, -21210, -34354, -26409, -8254, 12409, 25080, 18612, 17164, 19565, 6208, -11406, -38760, -42079, -21098, 1121, -500, -22656, -48545, -34248, -10570, 9591, 28214, 32227, 27387, 22263, 6345, -10038, -49, 18086, 11229, -23375, -41720, -34865, -23021, -3611, -5479, -2190, -1535, -9728, 6073, 13615, 21800, 22809, -4105, -14457, 10954, 19458, 21942, -226, 1113, -383, -14666, -22242, -34812, -34466, -30295, -13875, -9814, -15336, -17423, -26958, -40568, -26138, -7931, -33349, -35124, -4735, -9536, -17027, 5834, 27297, 25807, 717, -11668, 3809, 8448, -4770, -8957, -6153, 5885, 11718, 993, -7484, -9731]
16196i731j8342O995L300M902J0755k722R540l334j6761N412o851k3925j2139
16183e2901j101M2043J5842k3497N09N240j4933J0452J3213Q026k893P260q576
16170a316L509K2377K004n450K088J871k72j5805j1978o955j2766J49L0707m236
16156C927k2185Q574J1335J4233m454m503o413R254Q380o028m261L419K2014J697
16142C4989j5274k889k7841j2172J2388L3730L1q929j3765q145k127M500L2530
16129B7026l218l0994Q921P315j0083j14N015K272q554r830k386N987J0162M458
16115E977o858l6077j6545P150M1782L6784m447o000m085j8182K3710L1992o553
16102D8648j7908j7571k3519r651L19L943m462J2239J5803j1944J3411l00j3401
$$ y = [-9731, -28073, -21078, -17778, -12876, -2121, -4843, 4697, 1363, -15398, -9986, -16837, -40762, -52901, -54002, -11959, 3883, -19614, -19105, -13865, -28798, -18346, -5133, 2893, 0, 7260, -1316, 2193, 24570, 26574, 21124, 23212, 25083, 24811, 9006, -2972, -9927, -22693, -22544, 8163, 3927, -18258, -9684, 1651, 15884, 11430, 6927, 514, 9768, 18148, 12120, 7859, 11278, 33292, 34989, 19715, 16826, -11015, -23187, -10799, 22931, 22962, 14033, 268, -7877, -10004, -5504, 27026, 23808, -7186, 1735, 9050, -1033, -1147, 3868, 6140, -2414, -12244, -14630, -8643, 1519, 5977, -881, -36958, -53503, -46353, -4571, 32213, 27766, 21766, 17681, -501, 23209, 55201, 48648, 30740, 13169, -10350, -20001, -19682, -15739, -20201, -7962, 7841, -4103, 9308, 9008, -4393]
16089d393n495R180J612K734j3250L989K0334M144k2936j2070K903O042K6321
16076A9115J7936K380J680j6086j3604J1674o61j8705j5428N805J9282j3835l65
16063h12N008j9266r456J3903N778n810P030J1535J1626p959L298J222o884n984
16049C229j2306J1907K19j8092k4951J8415J6002l053n494R527j567Q646P892
16036A0374J600k1967k0316O648J7928J2827l076k3166R769J2170o392n313j1505
16023b0419o893O658K6058L832J0765m449k351P268k706j8197j252K555J0544
16010A1413o078K2940J1714k675J295L605J0448k939o975q740j1347q33Q475p826
15996B2477J464k0158q105o077R541Q258l679K8073l001k0283R535n962k3354
$$ y = [-4393, -9888, -708, 904, 3638, -9612, -5623, 14711, 18855, -4081, -16151, -13248, -7206, 19115, 37051, 39431, 41111, 25025, 11421, 23095, 22434, 3729, -11699, -5894, 13388, -447, -812, 4196, -15070, -24526, -10623, -4845, -10655, -3625, 7910, 19536, 11577, 14875, 16097, 9213, 3229, -9077, 2830, 3049, -15043, -39994, -21579, -5577, -8630, -14124, -4597, -6164, 2482, 10374, 11974, -9993, -30309, -23661, -5733, 7094, 4018, -19148, -9379, 2791, -3601, -8914, -20419, -27312, -20654, 5404, 9236, 20001, 15552, 13201, 20469, 17763, -434, -1686, 869, 11413, 5335, 28275, 39989, 37314, 38609, 42214, 52662, 49723, 42748, 34008, 22661, 21828, 30303, 22477, 23941, 3783, -4322, -10399, -858, 7400, 3721, 31794, 28793, 8510, 18045, 12083, -11271]
15983a1271m476J0914O841K0673Q211j2377K2671n41J923q851q387j3656m514
15970G160m245j1720L0403J0052j9754q552J3671k841k1237J0193m372r725L866
15957g101L280J3032q092j844q070J3954n464r834l4071M565J0699O567P802K3454
15943H877p355q237q656J935j0802P479o73j8504J960R635J6235J2998J0688R597
15929B5177J7619Q05J0235J186j3321J910K419m0060j6454J5677J8233j4606o18
15916H202K2544r41L369l429M78m57O043j4174j1161j4522P715M65j0302m912
15902a1082o793L7410O363k0405k594O006R665O111l15j5173R276J2398l897O65
15888B7635M056r715M823j0264R3J1868j528p25Q57n84k82j2526k8971K457J7769
$$ y = [-11271, -15747, -4833, 2008, 22681, 30892, 18515, 41186, 40645, 42568, 33717, 25330, 11674, 7160, 2915, -8805, 21598, 31650, 11896, 3344, 17015, 14174, -7063, 3130, -1242, -10967, -7101, -3821, 9211, 1119, -725, -8795, 5159, -305, -10139, -44210, -39645, -28946, -22379, -14577, 8877, 1522, -6715, -15371, -13436, -24238, -16759, -17432, -35936, -33976, -24341, -8106, 4892, 15580, 25177, 42796, 43601, 53836, 55022, 41701, 43611, 46030, 5970, -10484, 5193, 23426, 8820, 8202, 30746, 29805, 33174, 29745, 30223, 29766, 35809, 21635, 10474, -4048, 3667, 4132, -6170, -11082, -17875, 19535, 25898, 5493, 2899, 8905, 18570, 24681, 24366, 9193, 18469, 30867, 26970, 27635, 31691, 21976, 26799, 16535, 16628, 28496, 26968, 26243, 27100, 26516, 26234, 13708, -15263, -12806, 4963]
15873D963L2251n194Q713J5794r758j1897Q239j3301j136J3195q900N317J856
15860D0142j2731J612K3821J3822M19O531j2754j9316K305j0583J1310j4614j832
15847B8132k9132Q116q815o855J2459M358J5332K508j7421r797N741K852L519
15834A0997L256L502q548k2143p192M954P786R024Q401J4198p663j3312J5610
15821A8870Q555R484m668q052J1115j0756l223j964M999J1342J3505K0219M251
15808G3677k9276n647L006J7533j3226j1159K932M3k0429p684O182J7129M065
15795C7146j333J7344l185j9151L26Q841J0889J1002j6069j087K2405l749M682
15782F8061R606j9690j8566o560j3304j030J4724J1609k933j1564j1649J2459
$$ y = [4963, 37214, 32020, 40733, 56527, 46769, 34872, 43111, 29810, 28674, 41869, 32969, 38286, 40142, 27411, 29023, 52844, 66666, 67085, 73616, 60862, 41546, 43851, 33268, 44578, 29964, 28132, -1000, 7116, -1699, -8554, 3905, 8263, 23595, 26103, 8682, -1115, 4626, 7478, 10997, 14253, 17755, 9207, -12936, -20128, -15174, -7388, 1636, 10037, 24235, 16572, 3260, 18870, 27425, 36909, 32241, 24189, 35304, 24548, 21325, 19361, 24360, 35702, 49207, 69426, 73677, 44401, 38754, 41760, 59293, 46067, 34908, 37840, 37883, 17454, 9770, 15952, 33081, 37146, 35813, 53157, 49972, 30821, 31147, 39988, 50877, 61879, 45810, 44723, 67128, 63379, 68061, 77667, 57977, 39411, 32851, 19547, 18517, 33241, 44850, 41917, 30353, 18704, 31163]
15770C1163N150k0830l982k852J4551J4786J2692J4339O09j0199j2067Q985j6263
15757C6082k2655j6497k632L3416q231j1247J1504M794J1295L189j4284l782j3956
15744F996r367L3581J2757o320K2972L159p091j1170k169q82J8280m85K379M495
15730F7135k4751k2057Q126K327K974m569n142o064K42J0052L6908J3958j5378
15717F3761j2483L505j503J8424K081p57r662k2434Q812J1887k779k0885j7391
15704B0576j2948J0624L6678J5506m319J1806P054l3781k9141R448K2666j7511
15692C6658q371k919K5772J9489l062k1906J450O826p399m309K8966P498k9423
15679D9270j5222j2085N494j3797K7817J2251M31k7275j6645J223J3572J5113
$$ y = [31163, 36313, 15483, 11501, 8649, 23200, 37986, 50678, 65017, 65626, 55427, 43360, 52345, 36082, 13427, -3070, -5702, 27714, 19483, 8236, 19740, 24534, 35829, 39018, 24734, 20952, 6996, -2371, 31210, 43967, 37647, 60619, 63778, 56687, 45517, 43348, 42466, 60746, 60261, 62640, 67135, 42384, 20327, 28453, 30780, 33754, 29185, 24043, 17979, 18221, 28273, 65181, 79139, 63761, 51278, 54783, 53280, 71704, 73785, 73028, 63366, 40932, 49744, 61631, 58852, 37967, 20576, 7628, 18252, 54930, 70436, 66117, 77923, 84977, 51196, 22055, 31503, 54169, 36658, 28287, 25368, 51140, 70629, 67567, 45661, 47111, 53937, 46538, 42229, 71195, 78693, 49270, 34048, 21963, 27457, 13660, 41477, 53728, 54159, 26884, 10239, 11462, 25034, 40147]
15667D0147R905j0881N577m533P253k577J8749q43l1053M672J0257M500P967p314
15653E1826j1744K231k2538K980J9194j5772k0983k510K9455K8916O81o73Q531
15640F9594P888q062j5393N562J5599R632j6596l8952P613L2975K4509j6518j9810
15627E8041r034n629R683K9213J1143r160k2383j3443K1102o730o996p490o902
15614D1415j15Q383K2261j3585k70N07r897l577P244J0719J013J2344j2816k8386
15600C5240j1153J8426K3519m417j3912j0260K106k5605j0030P578J843j552R220
15587B1003J6103j4239j118K4293J8106O553j1926r9j2723p674n794o336R223
15574C5372K4559R469l991J4440R94K426j1581j4401p54J8656J2751J9228j5081
$$ y = [40147, 50052, 39171, 44748, 40215, 47468, 44891, 63640, 62797, 31744, 36416, 46673, 51173, 59140, 51826, 40082, 42313, 19775, 22755, 41949, 26177, 5194, 2684, 32139, 61055, 61736, 61063, 69594, 77482, 69420, 54027, 59589, 75188, 84820, 68224, 29272, 36885, 69860, 94369, 77851, 58041, 49007, 43378, 53061, 82274, 93417, 84257, 61874, 48431, 69533, 62803, 55807, 48317, 41415, 41300, 49683, 71944, 58359, 58089, 58596, 48699, 45122, 52366, 63085, 64098, 76442, 63626, 35240, 24087, 42513, 66032, 61615, 47703, 37443, 39549, 13944, 3914, 11492, 13335, 11783, 21003, 37106, 22867, 21749, 46042, 64148, 70701, 58775, 58676, 45953, 38279, 32485, 26149, 35372, 59931, 69400, 65409, 79849, 80843, 83269, 71688, 57287, 56533, 75189, 87940, 107168, 92087]
15561I2087k7632l897O549j604K3725J9364J4928o733N415J0059P4j1177j783
15548A19375O103l9186k5213q720P726J5691q38j833L305J176K0949n164k7787
15535F5584p578l791K4713J4933J698J7644j5690j8688o481m5765j92K6671j0359
15522D2699o043q338L4221K9000K7967J1296J2178L097j4171k399P718k721R26
15509A35430r059L564P839R940j4459j0038j9027n272J915J0276J6903K230O766
15496A37008J4848r25K7484n121o557j6730j5278M487J0224J1937J7810J0673
15484A89860K37p372p234m039k3522J5030K2292r455m599l274J3018M8105K0533
15471B49580p628R165J3378n17L2167N8014O090j4759k6436k8926k6867l5853
$$ y = [92087, 64455, 60558, 67107, 65503, 89228, 108592, 123520, 116787, 122202, 132261, 132335, 121158, 119375, 125478, 86292, 61079, 52359, 60085, 75776, 74938, 73105, 76410, 77586, 98535, 93371, 65584, 58006, 54215, 78928, 93861, 95559, 113203, 97513, 78825, 72344, 26579, 26387, 53058, 42699, 36656, 28318, 62539, 91539, 119506, 130802, 142980, 146077, 131906, 129507, 137225, 134504, 135430, 126371, 129935, 137774, 147714, 133255, 123217, 104190, 98918, 100833, 111109, 128012, 130242, 137008, 151856, 150931, 178415, 173294, 166737, 150007, 134729, 139216, 149440, 161377, 179187, 189860, 190097, 182725, 175491, 171452, 147930, 162960, 185252, 175797, 171198, 167924, 180942, 229047, 249580, 241952, 251117, 264495, 263978, 296145, 354159, 360249, 345490, 319054, 290128, 263261, 227408]
15459B27408l4813k3011R762K7856J5087j1543l0367K468J8590j6489j4276O092
15447A76764L5801q191q485R31j6669o254K4117M2128P71m2996k197K7914j2773
15434B10861j8034J0884r652l5553J7131K1092j367Q815K1517P188j721O640j2384
15421B25417K781q751M102o139j2523K2439J4206P174k4144j9587J2409N0484
15409B67868L4545J4424k8150k4278l1240m5037N617R837J278l0039j0409m391
15397A60025L2631O361j2533J8006Q014Q725L5392K5765P032l835j5499q464K3650
15384B85270K6854Q150J3655K246r002N95J1832K4992K1949L2405J4715r140o888
15371D17633J6663J1993M165l6946n0778k5749p876j0437k6370l824o001J0288
$$ y = [227408, 192595, 169584, 179346, 207202, 222289, 210746, 180379, 182847, 201437, 184948, 170672, 176764, 212565, 204374, 195889, 196820, 180151, 173897, 198014, 240142, 240913, 197917, 195720, 223634, 210861, 192827, 203711, 194059, 158506, 175637, 196729, 195362, 204177, 225694, 232882, 231161, 237801, 225417, 228198, 219447, 223549, 217410, 204887, 227326, 241532, 248706, 224562, 204975, 217384, 267868, 302413, 316837, 288687, 264409, 233169, 188132, 193749, 203586, 204864, 174825, 164416, 160025, 192656, 199017, 186484, 204490, 212504, 221229, 256621, 282386, 289418, 285583, 270084, 261620, 285270, 312124, 320274, 333929, 336175, 327173, 327768, 339600, 364592, 386541, 418946, 433661, 424521, 417633, 434296, 446289, 450454, 413508, 362730, 336981, 329105, 318668, 292298, 288474, 282473, 292761]
15359B92761q644k0466J1512L2830P430n828K0780N776P655J6215J2719o992j1394
15346C54354K3252L4247L1275L1508K8981P317J0891R049J8363J9652L2710N000
15334F06599j8608K545j2399j4492J2662J4167J9172Q952Q540J3604J567K1309
15322F63618J4301k470J3381J1006m410J4939K6264J7973j5675Q76K3132J3962
15310G76897K6385L8728K0334R226J2857l426p945J7351J8304J5864L0333L3593
15298I88501K2245L7623J8067O406K0998K4924P932Q841m408L4204M3417M8327
15286A257077O8741N6116M0121N4823M7290O0159N3015M2212L9408J6751K2051
15275A757764M2622O7327P5092O1848N9825P7967P9746Q7308P3949N2515N3916
$$ y = [292761, 284117, 263651, 275163, 307993, 315423, 309595, 330375, 336151, 343806, 360021, 372740, 365748, 354354, 377606, 411853, 443128, 474636, 503617, 510934, 521825, 530874, 549237, 568889, 601599, 606599, 587991, 590536, 578137, 563645, 576307, 590474, 609646, 618598, 627138, 640742, 642309, 663618, 677919, 675449, 688830, 699836, 695426, 710365, 736629, 754602, 738927, 739803, 762935, 776897, 803282, 842010, 862344, 871570, 884427, 881001, 873056, 890407, 908711, 924575, 954908, 988501, 1010746, 1048369, 1066436, 1072842, 1093840, 1118764, 1126696, 1135537, 1131129, 1165333, 1208750, 1257077, 1325818, 1381934, 1422055, 1476878, 1524168, 1584327, 1637342, 1679554, 1718962, 1735713, 1757764, 1800386, 1867713, 1942805, 2004653, 2064478, 2142445, 2222191, 2309499, 2383448, 2435963, 2489879]
15264B489879R4672J33440J27109J18342J13345J45177J26678J27939J31338J70965
15254C778884J75412J99924K37890K54221K82309K92993L09122L27852L49884
15245F208491L70838M05672M41011M66471N33845N79948O23970O93745P85022
15236A1109013Q79564R47941J081806J188563J319539J499452J765169K054937
15228B1845984K396136K809497L298275L904736M667469N628022O851638Q458347
15220E9860104J0515185J3192553J6520651K0602947K5270873K9976789L3201341
15213B09140443L2365175K4763545R816698q667970k4079318l2061151l2940938
15206A78336484k9732194k5090439k0486052j6534973j3312367j0729262q734478
$$ y = [2489879, 2584551, 2717991, 2845100, 2963442, 3076787, 3221964, 3348642, 3476581, 3607919, 3778884, 3954296, 4154220, 4392110, 4646331, 4928640, 5221633, 5530755, 5858607, 6208491, 6579329, 6985001, 7426012, 7892483, 8426328, 9006276, 9630246, 10323991, 11109013, 11988577, 12936518, 14018324, 15206887, 16526426, 18025878, 19791047, 21845984, 24242120, 27051617, 30349892, 34254628, 38922097, 44550119, 51401757, 59860104, 70375289, 83567842, 100088493, 120691440, 145962313, 175939102, 209140443, 241505618, 266269163, 276085861, 267417891, 243338573, 211277422, 178336484, 148604290, 123513851, 103027799, 86492826, 73180459, 62451197, 53716719]
15199E3716719p145017n903663m909018m135646l441062k933296k526155k172807
15191B0550055j917659j674062j469767j312986j132391r71483q77137p95676
15183A0398894p03144o14761n44219n13345n00079m24602l91337l61863l43120
15174F002424l25778k72744k33918k07429k03455j87425k03764j81100j56073
15165D030738j51014j53936j47972j40923j40581j18726j10352j07719j28513
15156B831002j22719j20619j11161r3467p9250n6672p3016o1712n9204o6002o1483
15145A925697l2062m7011o2819m4546o0715o7732k3714j3219l6241m8908m2661
15134A446069r093l5855k0311j6089n8056n3903k7721l7205m1377m2411k7563
$$ y = [53716719, 46571702, 40668039, 35759021, 31623375, 28182313, 25249017, 22722862, 20550055, 18632396, 16958334, 15488567, 14175581, 13043190, 12071707, 11194570, 10398894, 9695750, 9080989, 8536770, 8023425, 7523346, 7098744, 6707407, 6345544, 6002424, 5676646, 5403902, 5169984, 4962555, 4759100, 4571675, 4367911, 4186811, 4030738, 3879724, 3725788, 3577816, 3436893, 3296312, 3177586, 3067234, 2959515, 2831002, 2708283, 2587664, 2476503, 2383036, 2303786, 2247114, 2174098, 2112386, 2053182, 1987180, 1925697, 1893635, 1846624, 1783805, 1739259, 1678544, 1610812, 1587098, 1573879, 1537638, 1488730, 1446069, 1436976, 1401121, 1380810, 1364721, 1306665, 1252762, 1225041, 1187836, 1146459, 1104048, 1076485]
15123A076485j3658m203l2423l2708l3141k5728r193J1337l1859l2733k0951K148
15111H53373k3499k3536j9393j4382l9946K587O862O511j4854k023l719l4287
15099F93694m1473J476o591j0804k381J9532N054j4493O881N592J460J9753M0517
15086G18217K7132M152j0770L054l3149k7453p435j9213j7631j913n4114j4048
15074E66829j91Q504J0044K937k6969k98k7662k5622K4308N334j2615k051j803
15061E20745l2579j1785k2161j6294j8951l3911n3195k7890l5591l7740j6511
15050B14137R312k093k8708k3208J4147L6825P145M510J3511J4488P631Q678K0389
15037B96764K3081j3290K429j7151k765j4633j9725p058K1324M121k068J8924
$$ y = [1076485, 1062827, 1058624, 1026201, 993493, 960352, 934624, 925431, 936768, 904909, 872176, 851225, 853373, 829874, 806338, 786945, 772563, 732617, 735204, 742066, 748577, 733723, 731700, 727981, 693694, 652221, 653697, 647106, 636302, 633921, 653453, 658507, 644014, 650895, 656487, 657947, 677700, 718217, 745349, 749501, 738731, 741785, 708636, 681183, 673748, 654535, 636904, 634991, 580877, 566829, 566638, 575142, 585186, 588123, 561154, 560856, 533194, 507572, 531880, 537214, 524599, 522548, 520745, 488166, 476381, 454220, 437926, 418975, 385064, 331869, 303979, 268388, 230648, 214137, 223449, 221356, 192648, 169440, 183587, 220412, 227557, 232067, 245578, 260066, 267697, 276375, 296764, 319845, 306555, 308984, 291833, 289068, 274435, 254710, 247652, 268976, 273097, 271029, 289953]
15025B89953J0690m986j069O864p466j4290j1006j2120j6291k3307j2051o940
15013A97981l0627N773k65P465P863k670k2747n748N795j352Q370j3304N805J3838
14999A76177J0822k4015K098J565m539j0367j1459j3829k400J0821N25K41O331
14986A41971J1325O446J3248J042N359j8272k0830k5911l737J8473K5928j2675
14974A42367J0154k7216k1992J5561O8K192j1304P174Q526J6537N790l3744k2370
14961I1743K0575j8931K0864L3769j4259j0089M777K1895J2131k1911l8045m496
14949I8023K0050k749j9061O391J172q715m476l674J2090k4931k1641L0453J2413
14936I5345k9007K127K5499J4544R081P669k741j3266n865J2532J6363p177j0608
$$ y = [289953, 300643, 295657, 294588, 301452, 293986, 279696, 268690, 256570, 240279, 216972, 204921, 197981, 167354, 173127, 172862, 180327, 188190, 185520, 162773, 157025, 162820, 161468, 169838, 156534, 162339, 176177, 186999, 162984, 165082, 166647, 162108, 151741, 140282, 126453, 124053, 134874, 135399, 135640, 141971, 153296, 159742, 172990, 174032, 179391, 161119, 140289, 114378, 110641, 129114, 155042, 142367, 152521, 125305, 103313, 118874, 118942, 121134, 109830, 117004, 125530, 142067, 147857, 114113, 91743, 112318, 93387, 114251, 148020, 133761, 123672, 128449, 150344, 162475, 140564, 102519, 98023, 118073, 115324, 96263, 102654, 103826, 95111, 90635, 86961, 99051, 74120, 52479, 82932, 95345, 66338, 68465, 93964, 108508, 117589, 125258, 122517, 109251, 103386, 115918, 132281, 125104, 114496]
14923A14496n347k0375M093N51J0208k0013k4563M387J9647J1946l426k1678k391
14910F7535J140K259j7153j6964m76K31L3122L3204K8691k1188o426k354k4669
14897G6952j6146K8632L2791L685k2698j8674l8308k9562J7628J6721K8768J2379
14885I2168m428j2862j1549j2219j1616J4417K4709p952k0158K6972Q220k3835
14873F1867q804j1080p120P612l812j066n04L251K0149N139k1565j6657L68r622
14859A8156j0011R979J6302J0983J2558j5395q308K947J5196o01j9216o413J6538
14846D2715L6803l2803j4065k3823l378M3497K089j213n29k4713L513Q823J213
14833C8129O46P128n2p855q651j8299j6991J1989K5796J3883K078M098K522j7017
$$ y = [114496, 109149, 88774, 92867, 93418, 103626, 83613, 59050, 63437, 83084, 95030, 91604, 69926, 67535, 68675, 70934, 53781, 36817, 36341, 36572, 69694, 102898, 131589, 110401, 103975, 101621, 76952, 60806, 89438, 122229, 125914, 103216, 84542, 46234, 16672, 34300, 51021, 79789, 92168, 87740, 74878, 63329, 51110, 39494, 53911, 78620, 70668, 50510, 77482, 85702, 61867, 53063, 41983, 34863, 42475, 38663, 37597, 37093, 40344, 60493, 65632, 44067, 27410, 27778, 18156, 8145, 18124, 34426, 45409, 57967, 42572, 34264, 37211, 52407, 51806, 32590, 26177, 42715, 79518, 46715, 32650, 8827, 5449, 48946, 51035, 49822, 49293, 24580, 28093, 36916, 38129, 38775, 45903, 45851, 37996, 29345, 11046, -5945, 6044, 31840, 45723, 47801, 51899, 54421, 37404]
14819C7404L177K1234P643j8406q892L2757L668L979k9178j9250R720K3036k2147
14806D4745k8869r270k226K1565M0833J3256Q341k2369j5711P552j4618k175P878
14793D8932M97j6628j3292m544P927J2866J185q188l656K8929J6044P738k0923
14780E6887l5502O572P383L106Q467L444j7805j6064Q799l722l402J3427K0038
14767E1628j1600k5652k9127R182o849O774O85O81n15L129J0777L1254R547j7461
14753C2453j989j324R407n585k8074J7472J429M518k24k3126K3492L4763j2259
14740E0953k0995r479k111J3839J6771P558k8713j7881J2789l797j138L0608j5852
14727C2552k3783R653K127K273J3905j6971k6830K1149P035M545M784n843r58
$$ y = [37404, 40581, 61815, 69458, 51052, 42160, 74917, 78585, 82564, 53386, 34136, 43856, 66892, 44745, 15876, 6606, 4380, 25945, 66778, 80034, 88375, 66006, 50295, 57847, 43229, 41054, 48932, 49429, 32801, 19509, 14965, 22892, 35758, 36943, 28755, 25099, 54028, 70072, 77810, 56887, 21385, 27957, 35340, 38446, 46913, 50357, 32552, 16488, 25287, 21565, 18163, 31590, 51628, 40028, 14376, -14751, -5569, -12418, -5644, -4959, -4278, -4793, -1664, 9113, 40367, 49914, 32453, 30464, 29140, 38547, 32962, 4888, 22360, 23789, 28307, 28083, 4957, 28449, 63212, 50953, 29958, 20479, 18368, 32207, 48978, 56536, 27823, 9942, 22731, 18934, 17796, 48404, 32552, 8769, 18422, 20549, 22822, 36727, 19756, -7074, 14075, 21110, 25655, 30439, 24596, 23638]
14714B3638J803L768j3197m118j2984R578r29k7908J1882J1295m658P708J3955
14701A9833J963K1704J8145j6375R361O933P906j5862k0696j1512r252L2961P337
14688E2446r618j1812r171j3106l1195q780K0797J5974N014J4785J0936j1094
14676B5176o8J1169o262K905j1893l2j50J926n399J4168lj6078n83J6803J7059
14661D8738L534j0989n304k1882K389K618j160j2379l57P252m721k3754l944K5364
14647E405J8194k018R713J8743K084P11n903k6057j6587R48o749k1262j2029J2645
14633b2162J5427P701R053j6827o728J3585K4902o129K067j2794j0075J4115n365
14620F770k512J7770N638o328j3485n385L658J5024l3209k2127L2722K5833J413
$$ y = [23638, 25441, 29209, 16012, 11894, -1090, 8488, 7559, -20349, -8467, 2828, -1830, 5878, 19833, 21796, 43500, 61645, 45270, 54631, 61564, 69470, 53608, 32912, 21400, 12148, 45109, 52446, 42828, 31016, 21845, 8739, -22456, -31236, -10439, 5535, 10549, 25334, 36270, 25176, 25108, 36277, 30015, 32920, 21027, 20995, 20845, 22771, 17372, 31540, 31537, 15459, 14876, 31679, 48738, 52272, 41283, 35979, 14097, 16486, 19104, 17944, 5565, 5208, 12460, 7739, -16015, -19959, 5405, 23599, 21581, 31294, 50037, 52121, 52832, 46929, 20872, 4285, 5233, -1516, -22778, -34807, -22162, -6735, 966, 10019, -6808, -13536, 49, 24951, 18822, 20889, 8095, -1980, 12135, 6770, 4258, 22028, 27666, 21338, 7853, 2468, 6126, 21150, -12059, -34186, -1464, 24369, 25782]
14607B5782p854L582J9124m413j8634P710M903M062p48J076Q376l4367l231q192
14593b824n107K1873J6784j7053k4305K9237N779j3550o801K1759K0011j0404
14581C5399k0308k0603o174N8j2782n38J6855M496O789P527l278j1706j2684J0586
14567f363M588q482J3964L5065J376j5866j7812J1016L1283j1020r508j9730j0441
14554a930K1651r58j9090q969J0769j0186J2260O001j0304r191j3844k260J3763
14541a2288J982J0505j5786j5145Q613K2043Q927r495k2430N644J9117J6324j3633
14528D378K0725K5652q765L003j2263j6864j147kj3712q917J3767q780L426L097
14514C598J0915J7573O267J518k0517k2515l0129n1K1399K1354K1795N562j2991
$$ y = [25782, 17928, 21510, 40634, 36221, 17587, 25297, 30200, 34262, 33514, 34590, 42966, 8599, 5368, -2824, -7931, 13942, 30726, 13673, -10632, 18605, 24384, 10834, 4033, 25792, 45803, 35399, 15091, -5512, -11686, -11628, -24410, -24948, -8093, -3597, 3192, 10719, 7441, -4265, -16949, -6363, -1775, -10257, 3707, 38772, 40148, 24282, 6470, 17486, 48769, 37749, 28241, 8511, -1930, 19721, 18763, -327, -9296, 1473, -8713, 3547, 9548, -756, -9947, -23791, -26051, -12288, -10306, 199, -15587, -30732, -22119, -76, 8851, -644, -23074, -17430, 1687, 18011, 4378, 25103, 50755, 41990, 44993, 32730, 15866, 14719, 14717, 1005, -7912, 5855, -2925, 501, 3598, 14513, 32086, 38353, 39871, 19354, -3161, -33290, -33341, -11942, 9412, 31207, 36769, 23778]
14501B3778o473L140j398l103j9642p77j0537K970J3702J5327k732j7661o328
14488i734N815J2273M947J1107R901J2471k2861m511K0633j5351j3968j6416j9436
14475b5130r806r537P886j1288k78R649K2531K0230j2118j1744k452M982r775
14462b6850j5438j5826K0318J8440K0748J9127M642L64k0773p08P751k422o184
14449C189j9521P009l66K7449R902m003Q231l1151r045L386o341M805J4934J3748
14435B2226M751j7048j8027J2251J2681N693q051M854O291r68j1714j6610k8495
14422c2166q479k536J8406P074J9374j4157l5782j4587r271o290Q943M5619L462
14409b0390J4367K6358K669k4751K831r241j2864J4530K2709J5228l932r460k3158
$$ y = [23778, 17305, 20445, 19047, 15944, -3698, -4475, -15012, -12042, 1660, 16987, 14255, -3406, -9734, -3919, 8354, 13301, 24408, 34309, 46780, 23919, 19408, 40041, 24690, 10722, -5694, -25130, -34936, -44473, -36587, -47875, -48153, -38504, -15973, 4257, -7861, -19605, -22057, -17075, -26850, -42288, -58114, -37796, -19356, 1392, 20519, 25161, 25525, 4752, 4044, 11795, 9373, 3189, -16332, -9323, -9689, 17760, 27662, 23659, 31890, 739, -8306, -4920, -11261, -6456, 8478, 22226, 26977, 9929, -8098, 4153, 16834, 22527, 14476, 19330, 25621, 24653, 12939, -3671, -32166, -40645, -43181, -24775, -17701, 1673, -12484, -48266, -62853, -72124, -78414, -69471, -23852, -20390, -6023, 20335, 23004, -1747, 1084, -8157, -21021, -6491, 16218, 31446, 27514, 18054, -5104]
14396e104j0396r77R026J7500R087J2168l593j1128P815K272k4905l281p312J5172
14382F344j362J6256J4281N335r852j2955J2385r450M193o95j0495j5893k77k840
14368e025R887J1466K351k1039O105J9644J3339j9869j953K4644j3972j5534m02
14355I642J1758n786j3741K0232l922k4710K586J2165l417P247m867J2603m627
14342A5163j0214O474R962j1058k1848m69N696m162J667J0640N080k587Q04j5040
14328i892J1193J3334K836q552k086R971Q459j544m73p732j4345j4845P686n500
14314a1490j6775J0842j762J492j9672j0045K2315J6002J3041J6404J7604j5006
14302B2950k1717j0025n536J6674J0201j926R532p651J746N560k955L057J9183
$$ y = [-5104, -15500, -16477, -7451, 10049, 19136, 31304, 27711, 16583, 24398, 26670, 1765, -1516, -8828, 6344, 4982, 21238, 35519, 40854, 31002, 18047, 30432, 20982, 25175, 24480, 13985, -1908, -2185, -5025, 4862, 16328, 18679, -2360, 3745, 23389, 36728, 16859, 14906, 39550, 25578, 10044, 9642, 21400, 15614, 1873, 22105, 18183, -6527, -3941, 8224, 4807, 12054, 7187, 19790, 15163, 4949, 11423, 21385, 10327, -11521, -11990, -6294, -10456, -8789, 1851, 6931, 4344, 5148, -9892, 1301, 14635, 17471, 8919, 6833, 16804, 25263, 23719, 23246, 15514, 1169, -13676, -5990, -11490, -28265, -17423, -19185, -17693, -37365, -47410, -25095, -9093, 3948, 20352, 37956, 22950, 1233, -8792, -14328, 2346, 12547, 10621, 20153, 12502, 14248, 19808, 16853, 19910, 39093]
14289C9093p945n945j264j6056m2598j7457J5454K053R211L8052J926O905J1167
14276C2596j8299j5243k33m929K087L685J1321K3910O003l0484k655j9035l331
14263a4607m108J4334L327n779r412o290K966K9566K4230j0193j728R016m634
14250B6688K387N933J8373l425l4163j5262j4486k0191K1749r211J0939k672P495
14237e846J7032K7156J5559n371j4809J0059k2390r186j2343j9637j0870J0518
14225b0128N635j0065l301L4939L0339r259l3431n171M22j1908M405L0096J7444
14212C0017k788l2424j6744m627N63J2473j1491k43m005K9297r06O126k1385j9057
14198c5194j839J3266J9511j351j0978p030l182j2366M458m212J2671L2190P792
$$ y = [39093, 31148, 25203, 23939, 7883, -34715, -52172, -36718, -34665, -25454, 12598, 14524, 21429, 32596, 14297, -946, -1179, -6108, -4021, -336, 10985, 34895, 40898, 10414, 7759, -11276, -14607, -18715, -4381, -1054, -6833, -16245, -22535, -19569, 9997, 34227, 24034, 22306, 31322, 26688, 29075, 35008, 53381, 49956, 15793, 531, -13955, -34146, -12397, -21608, -10669, -13341, -5846, 11186, 38342, 53901, 48530, 33721, 43780, 21390, 12204, -139, -19776, -30646, -20128, -14493, -24558, -27859, 7080, 37419, 28160, -5271, -10442, -10020, -21928, -17523, 12573, 30017, 27229, -5195, -21939, -26566, -26003, -13530, -25021, -25264, -29269, 28, -878, 5248, -16137, -35194, -37033, -23767, -4256, -5607, -16585, -23615, -26797, -39163, -34705, -38917, -26246, 5944, 13736]
14185A3736j8986j2627J3170J2457N029k084r299J8371k3481j7526O975J6029
14173A764o937Q418J917K1870J3385k029J9629j5551p762N666l4063p371M974
14160C910L7102J1907J7761j2221j4033q045j492P401j6045O201p553j5827M279
14147A3345K0861q142l818n99p020l3496j8771J3039K23R662N805m184N419P478
14133a98n645j108k213j6314J0610L760r387O912o91K3216J6387m935k3694j8627
14119b1927L97N551K597j849J8457q096J2268j485K81k932Q551j4590j4698k5922
14105d3397j5012J5970L3655K6567o951k8996J1097K1053r103m066j9149J2117
14093f215o449m0665m043J7327J1801J7342J6765J5377j1857j1150K0467K626
$$ y = [13736, -5250, -17877, -4707, 7750, 12779, 10695, 1396, 19767, -3714, -21240, -14265, 1764, -5173, 3245, 5162, 27032, 40417, 38388, 58017, 42466, 34704, 40370, 6307, -1064, 3910, 41012, 52919, 70680, 58459, 44426, 36381, 34889, 42290, 26245, 32446, 24893, 9066, 13345, 34206, 26064, 22246, 21647, 14627, -18869, -37640, -24601, -24378, -14716, -8911, -13095, -7676, -198, -5843, -6951, -9164, -25478, -14868, -11108, -20495, -13583, -14274, 8942, 25329, 20394, -3300, -21927, -21530, -15979, -13382, -15231, 3226, -4870, 7398, 5913, 6194, 3262, 11813, -2777, -17475, -43397, -58409, -42439, -8784, 17783, 10832, -18164, -7067, 13986, 4883, 817, -18332, -6215, -12664, -53329, -57372, -40045, -28244, -10902, 5863, 21240, 9383, -1767, 18700, 21326]
14081B1326l7646q326L0428N7383K8719k4420l1906l6119J068J4472o114k4519
14069a5654N94J8617N699j2995j4446j485M951j1548M990O919J7064J7126j1496
14056H336P166l547p39j7428j4093K8611J9681J9627J6790J6986k1803m0311j9491
14043b15j3268P606Q828L2257l013k0202o955j3488m043K3866K1107j1757j1721
14030I002j9546j9852J7370L2274k3732K073P543L501k3193j0495O244R877Q622
14017c12J4022J579j657L073j3191L922J0304Q30m087q019J6006J757k8865k3426
14003b8064J3354r679J9494K5016K5430J4124l6647j0770N579J4160r118j2828
13991A0051J8378j2725l0542k1243J2084K0513M025P221J8527K38j2243l232p527
$$ y = [21326, -16320, -24646, 5782, 63165, 91884, 67464, 35558, -561, 507, 14979, 8865, -15654, -15060, 3557, 9256, -3739, -18185, -19670, -14719, -26267, -21277, -14358, 2706, 19832, 8336, 15502, 11955, 11216, -6212, -20305, 8306, 27987, 47614, 64404, 81390, 59587, 19276, -215, -13483, -5877, 2951, 35208, 32195, 11993, 5038, -8450, -12493, 11373, 32480, 20723, 9002, -10544, -30396, -13026, 19248, -4484, -2411, 5132, 8633, -14560, -25055, -18811, -8934, -312, 13710, 15289, 13632, 16705, 3514, 7436, 17740, 18570, 14483, 6464, 22470, 24227, -4638, -28064, -14710, -24389, -4895, 20121, 45551, 59675, 23028, 12258, 17837, 31997, 22879, 10051, 28429, 15704, -14838, -36081, -23997, -3484, 541, 7762, 26289, 26527, 14284, 11052, 3525]
13978C525r959k0437R822n443J2795P922k3005j1284L3853K8358o517m299J6578
13965C1909Q389m294K555J5916j1257k7977j7731m088k1153P816K7941J3572m962
13952A6636k2774j1035J860P617J8411j6384j1049K5774M141M713q581L261p889
13939D701l3687j0323J0001Q127K5687k98M601K644j9432j0563Q18N968j3185
13926b4941r07L987j7259Q756r380j2169O279M282j0238n874L169P983Q836J0951
13912b6525m134o953q84J4092J280J2781J1903j8366o404p310m713J481J1840
13899b1912K2276r802j1424N416M084M721J5200j0972j5138k0459o147K1825K3331
13886I99j433j633L914J3177n870j1590K656k470q385m873n476P751m430m431
$$ y = [3525, -6434, -26871, -17049, -22492, -9697, -1775, -24780, -36064, -2211, 26147, 19630, 15331, 31909, 40298, 36004, 38559, 54475, 43218, 15241, -2490, -6578, -27731, -19915, 8026, 21598, 16636, -6138, -17173, -15313, -7696, 10715, -5669, -16718, 9056, 13197, 17910, 9329, 12590, 4701, -28986, -39309, -29308, -21181, 4506, 4208, 8809, 11453, -7979, -18542, -17724, -11756, -24941, -25848, -21861, -39120, -30364, -39744, -51913, -45634, -41352, -51590, -57464, -54295, -46312, -37476, -26525, -30659, -37612, -38496, -24404, -23124, -10343, 1560, -16806, -23210, -30520, -35233, -33752, -21912, 364, -9438, -20862, -15446, -11362, -6641, 8559, -2413, -17551, -38010, -44157, -22332, 999, -434, -2067, 1847, 15024, 9154, -2436, 220, -2250, -10635, -15508, -20984, -13233, -17663, -22094]
13872b2094k8837J2250K4726O54q356K4283M2069j22k7736R071J7875K743j0090
13859C6436j5089l7475r305M872m165J5591L654J543P102j5988j2333P113L4089
13846A6045J4097j7460j2085j3518j3397O058k050J3307O324q089k2599l052J2791
13833b3628o225l069q324J9909K2377N030M986k336J856j9257r403j134j4765
13820c3983j559K4828O117K73K3143O897J3768n962k3630q701l091j1015J0881
13807b034K8946P516Q629n493j9355j8746P341K4513m589j5034l1212l4291M436
13794d9373K4705K8652J7320j5936J1673J0091O221p017j5389q763J1164q592
13782D756j543J6056L57q117m246Q494j3678j4967J1009q411J2176J5610j1066
$$ y = [-22094, -50931, -38681, -13955, -13301, -21657, 2626, 44695, 44573, 16837, 25908, 43783, 46526, 36436, 21347, -16128, -25433, -20561, -24726, -9135, -5481, -3938, 3164, -12824, -25157, -18044, 16045, 30142, 12682, 597, -12921, -26318, -20260, -22310, -9003, -2679, -10768, -33367, -36419, -23628, -29853, -32922, -41246, -21337, 1040, 6070, 11056, 8720, 10576, -8681, -18084, -19218, -33983, -35542, -10714, -4597, -4324, 18819, 25716, 39484, 33522, 9892, 1191, -1900, -12915, -2034, 26912, 34428, 43057, 37564, 18209, -537, 6804, 31317, 26728, 11694, -19518, -53809, -49373, -24668, 3984, 21304, 5368, 17041, 27132, 33353, 26336, 10947, 2184, 13348, 4756, 3213, 19269, 19626, 11509, 7263, 15757, 2079, -12888, -1879, -10290, 1886, 17496, 6430]
13769F430j0037J3141q744J0047J3770j8080l517K301k5359j7647J617L9468K9791
13756C3181M831k9338j3223n383K311J3416J8569L0387j9496l2198k7122J966
13744b2099J0495j9129n944L0011r762k0357K814r881K545O40J0109M3508j842
13731A1108k7186r381k109R493n748J6970K4634m592k5029n045K7064J5670n626
13718B0223m320o717p780j5540j3182R49K0270j0708O236r06j6212O753J2738
13705h196J3903K95N607J2558L237j5280j5951j3039O653q867k0421N107Q067
13692b6327K8683K7477J3525q249j5854k8558j4695K0996l446j5972J9120J9711
13680A6411p120R951o848l777J294k2882j5407R594P791Q708M350p196L404J1955
$$ y = [6430, -3607, 9534, 790, 10837, 24607, 6527, 3010, 5311, -20048, -37695, -36078, 3390, 33181, 38012, 8674, -4549, -9932, -7621, 5795, 24364, 54751, 35255, 3057, -24065, -22099, -11604, -30733, -36677, -6666, -16428, -36785, -33971, -43852, -41307, -40667, -30558, 12950, 11108, -16078, -25459, -27568, -18075, -23823, -6853, 17781, 13189, -11840, -16885, 10179, 25849, 20223, 15903, 9186, 1406, -14134, -27316, -26367, -6097, -16805, -10569, -11475, -27687, -20934, -8196, 5707, 6002, 11609, 24167, 27404, 12124, -3827, -16866, -10213, -19080, -39501, -34394, -26327, 2356, 29833, 43358, 35109, 19255, -9303, -23998, -3002, -6448, -22420, -3300, 16411, 9291, 19242, 12394, 8617, 9911, -12971, -28378, -18784, -10993, -2285, 2065, -5131, -1727, 10228]
13666A0228m683P7J1528o313R733J1179J2255k543j9406j1988j2140N379j673
13653A633j2464o384R191N827J3154o275j7481j3714O858K7046M827j7932m543
13640a0257J5638J6781j0073o02q926j9183O56K6007J0012k7505n385j8164J1060
13627a9941K4664J1201J7927Q077j2528p903j984j978k1735p428K1784r287J5759
13614A6628J6793n44k057q943m3151j7538J3230K9372M476k53J1796K6507j9777
13601B6539j2943j4571j2572l236r143r986l560j2580N696L6903K0094q008m857
13588b224J8886k0970n859k1979q846J7092L1430k722j0987k0223k3825O972J3966
13575b9289K2273K2013o777K973j2746j9879Q870J090j5614K5869J6863m518K672
$$ y = [10228, 5545, 5622, 17150, 10837, 20570, 31749, 44004, 41461, 22055, 10067, -2073, 3306, 1633, -10831, -17215, -8024, -2197, 10957, 4682, -12799, -26513, -19655, 7391, 12218, -5714, -10257, 5381, 22162, 12089, 11487, 2561, -16622, -15966, 10041, 20053, -7452, -12837, -31001, -19941, 4723, 15924, 33851, 41928, 29400, 21497, 19513, 17535, -4200, -11628, 10156, 869, 16628, 33421, 32877, 30820, 21877, -21274, -38812, -25582, 3790, 8266, 8013, 19809, 46316, 26539, 13596, -975, -13547, -16783, -25926, -35912, -39472, -52052, -46356, -9453, 10641, 2633, -2224, 16662, -4308, -10167, -32146, -40992, -23900, 7530, 4808, -6179, -26402, -50227, -43255, -29289, -7016, 14997, 8220, 11193, -1553, -21432, -12562, -11472, -27086, -1217, 15646, 11128, 13800]
13562A3800j5288n939Q363M014j1298k7809J4061J6006J2732P707n616q070j2149
13549i486N732o320j196J8855K0526M989j5470j1671j7492j3463J2874N069Q16
13536f237M070j8009p853J5679K7473J5904J2862m395j5058K865k1836j1146J5580
13523I899R629j1070Q52j4903j6544l333L1063p000j2426K9850N375J5064J1042
13510D7498j832k5158j9533J3314K1408K929L822j3749j3251o145j5902j3222
13498a9821J868K2782L332L574R085R723p032j3623k1475N399m485l537J2068
13485b142O239J1341j1636n79m2K8869k586j0417J3906K229k5692j9952o597N323
13471a1736J7568P369k52j1410m926r107r28P098J3378j518j696J2145L682k2006
$$ y = [13800, -1488, -7427, 936, 4950, -6348, -34157, -20096, -4090, 8642, 16349, 10733, 2663, -9486, -3754, -10074, -11270, 7585, 28111, 33100, 17630, 5959, -11533, -24996, -12122, -7053, -6237, -2167, -20176, -28029, -12350, 15123, 31027, 43889, 39494, 24436, 27301, 5465, -5681, 9899, 19528, 8458, 9310, -5593, -22137, -25470, 5593, -1407, -13833, 16017, 21392, 36456, 47498, 45666, 20508, 975, 14289, 35697, 38626, 42448, 28699, 15448, 9303, -6599, -19821, -17953, 4829, 8161, 11735, 20820, 30543, 23511, 9888, -11587, -6188, -10673, -14210, -2142, 4097, 15438, 3802, 3223, 3181, 32050, 29464, 19047, 32953, 35182, 9490, -10462, -17059, -11736, 5832, 13201, 12949, 1539, -3387, -12494, -13422, -6324, 7054, 5536, 3840, 15985, 19667, -2339]
13457b339j134N783J130k217j5641P578J5056o00k1098k453n300q806j1448N708
13443c5781J9446l104o662n00L2638J747L559j1243R774P194N699p418l07k3461
13429h419j1198K6230L5813o560p905J0983k0957l217J3082k123p797j2448M31
13416E915j5998j2968L611L314j0012J3760P101Q426O791k0518m918J7019P758
13403I281J0305J6420n609J0978j6382l2074r99O902R517J3478l167j234J3573
13390C0989J0183K675j0736l340q151l202k281J0368q7l899p969m690k309r700
13376b149j064M498J8J0435j9978J6214J6100k7607J048p148m902J0246l510j0367
13362a8166p47j560j514k1945n413J6925J5591L3018J0983j9328j1210j9440l1883
$$ y = [-2339, -3473, 2310, 3440, 1223, -14418, -6840, 8216, 7616, -13482, -15935, -21235, -30041, -41489, -35781, -16335, -19439, -26101, -26601, 6037, 7784, 11343, 100, 9874, 17068, 22767, 15349, 15042, -8419, -19617, 6613, 42426, 35866, 27961, 38944, 17987, 14770, 27852, 25729, 17932, 5484, 5915, -10083, -23051, -19440, -16126, -26138, -12378, -5277, 3149, 9940, -10578, -15496, 1523, 9281, 19586, 36006, 30397, 41375, 24993, -7081, -8080, -1178, 8339, 21817, 18650, 17416, 30989, 41172, 43847, 33111, 29771, 21620, 18418, 16137, 26505, 26418, 22519, 14550, 9860, 7551, -2149, -3213, 1285, 1303, 11738, -8240, 7974, 24074, -3533, -2485, -9633, -14535, -4289, -7799, -18166, -18913, -20473, -21987, -43932, -49345, -32420, -16829, 16189, 27172, 7844, -3366, -22806, -54689]
13349e4689K1744N627J6170J2193j2930k529J8039l560j1901K531j0995j9074
13337c9374j4094K7946m872p591K0140P364m219m005K754p147O96j3086J4673
13324b0815L5576K7580K525l558k1521l3336j1718j7427j8285K5835K7572K663
13312d909l1993j9359L5211J1198M785Q273p226k878j15K0134J045J349l412J4179
13298B6282q112O535p029L090j7981j2891J0666L687Q86j3561k645j2883K5678
13285A722K4852N230m612l0430k2246L2107Q351j8245J004J2534k27j8267j694
13272i921j9179J729K3656J6710j2474j444J3067j196j1075j221J8261Q641k6945
13259a391k8029k1653K5756K7470m99K667M000l429J211J5073J0602j6245N32
$$ y = [-54689, -32945, -27318, -11148, 1045, -11885, -14414, 3625, 65, -11836, -9305, -20300, -39374, -53468, -25522, -30394, -37985, -17845, -10481, -14700, -18705, -15951, -23098, -22402, -35488, -20815, 14761, 42341, 44866, 41308, 19787, -13549, -25267, -42694, -60979, -35144, -7572, -4909, -36902, -56261, -21050, -9852, -5067, 3206, -4020, -6898, -7013, 13121, 14166, 15515, 12103, 26282, 18170, 24705, 17676, 20766, 2785, -10106, 560, 4247, 5133, -8428, -11073, -23956, 1722, 26574, 31804, 27192, -3238, -25484, 6623, 14974, -3271, -2267, 10267, 10040, -8227, -9921, -29100, -27371, -3715, 12995, 521, -923, 12144, 10948, -127, -1348, 16913, 25554, -1391, -29420, -51073, -25317, 2153, 1654, 4321, 8321, 4892, 6103, 21176, 31778, 15533, 16065]
13246A6065M693l3201q225L2783j2893k6453J3012Q561J2626J1831o778j7853
13234e832K067k202p946k3296j1722K8590L2746L051J5014j9861l7042J2651P719
13221f063k1234r657J0669K2721j152j7585j8191k1155j2205J4773K0380K3973
13209a4726o219k5599j2079J8139K0257j1047j4283P787J6301R63M589N77Q653
13196f687J1420K3812J3430J2241l452k7086j9437J6550m380j3395j2145j4176
13184b3305j2460Q64Q000J8760J2072n726n858J5440j6927j3121j9285j5639J4441
13171d2744K7685P561j23k0188K0917J9284Q551k2336p542R878J1734j3350o225
13158f898J324J0701J5184J3975j4971Q477L575j3795o08M88l765j6885j6846
$$ y = [16065, 20758, -12443, -20668, 12115, -778, -27231, -14219, -5658, 6968, 18799, 12021, -5832, -3765, -5967, -13913, -37209, -48931, -20341, 12405, 15456, 30470, 10609, -26433, -13782, -6063, -27297, -36954, -26285, -3564, -4716, -22301, -40492, -61647, -73852, -59079, -38699, -14726, -20945, -46544, -58623, -40484, -20227, -31274, -45557, -37770, -21469, -20506, -15917, -15340, -6687, 4733, 28545, 41975, 54216, 50764, 23678, 4241, 20791, 16411, 3016, -9129, -23305, -35765, -34901, -26901, -8141, 3931, -1795, -7653, 7787, -9140, -22261, -41546, -57185, -42744, -15059, -7498, -7621, -27809, -6892, 12392, 20943, -1393, -8935, 943, 12677, -673, -6898, -5574, 5127, 20311, 34286, 19315, 27792, 31367, 17572, 16964, 17452, 13687, -3198, -20044]
13145b0044J9910K948j3219Q897J2170M446j7964q146J5515m450l820j857m095
13132i709P070j6597k6849P908J1725k94K160K216q660O126R920L0857M186l9744
13118a9685k997J2629P265k1433k3942j5004J1470K4211R018j8002r986L053r291
13105e2694k9K5430J4717J4904p290j1548N464p546J150Q10p936p538o289J2821
13091b5574K0593p000j8010J4543K7917J0352q783J4183p111l0710M545m837l099
13078a2991j2051k5497J3480K0905J8373j3642m129K3289R298j2088M648J213
13066A0808K4085j3910j6879r155r329m910J4725p972k684j0108L330n916j3417
13053d1332J4308K1999r0O646J0342r609k264J1798J7113q004j1301j3911p063
$$ y = [-20044, -134, 2814, -10405, -1508, 10662, 15108, -2856, -11002, 4513, 63, -3757, -5614, -9709, -2639, -19236, -46085, -38177, -26452, -26746, -24586, -22370, -31030, -24904, -14984, 15873, 20059, -19685, -22682, -10053, -2788, -24221, -48163, -63167, -51697, -27486, -18468, -36470, -46456, -43403, -52694, -52723, -27293, -12576, 2328, -4962, -16510, -11046, -18592, -17442, -16632, -24568, -32106, -38395, -25574, -4981, -11981, -29991, -15448, 12469, 22821, 14038, 28221, 21110, -9600, -5055, -9892, -12991, -25042, -50539, -37059, -16154, 2219, -11423, -15552, 7737, 17035, 4947, 9595, 10808, 34893, 20983, 4104, -5051, -14380, -19290, -4565, -12537, -15221, -25329, -21999, -27915, -41332, -27024, -5025, -5115, 1531, 11873, 2264, 0, 11798, 28911, 20907, 9606, -4305, -11368]
13040a1368l264l9844r560K717K1743J6893l447J247r50M253J3358J323k900j0573
13026b0372L572J2240K1369l457o893q829J797J2576r572M253L847j1546Q510
13013G495N840j2095k4892j3936K1712K6662j015M087j5630j8302q816L837K8128
13000C075L8578j4477l9693j5975j024j1278p362K1283p135r727R561N405K6497
12987b272J6725j9447j5652p428k68K7249J8652J5234j9729N828K467n800j0717
12974D842J3638O949k907j5070q664l236k7944j9916K151J6989L6546j2239o363
12961a5224J011J584K2733J824Q603j9997j4579p976L72L761K3299k208k016J3329
12947A4516k308l1628r647N64J3839K1277j80n479K3267N054J6008K6561j0711
$$ y = [-11368, -14632, -54476, -64036, -61319, -39576, -22683, -26130, -24883, -25833, -21580, -8222, -6899, -9799, -20372, -16800, -4560, 16809, 13352, 6459, -2370, -573, 12003, 2431, 6684, 10531, -1015, 7495, 13335, 1240, -23652, -37588, -15876, 10786, 9771, 13858, -1772, -20074, -28890, -25053, 3075, 41653, 27176, -12517, -28492, -29516, -40794, -48156, -26873, -34008, -43735, -34174, -28769, -2272, 14453, -4994, -20646, -28074, -28342, -1093, 17559, 32793, 13064, 18892, 21359, 15559, 4842, 18480, 25429, 22522, 7452, -1212, -4448, -32392, -52308, -50157, -33168, 3378, -8861, -15224, -14213, -12629, 10104, 11928, 20531, 534, -14045, -22021, -21649, -17888, 5411, 3203, 1187, 14516, 12208, -19420, -29067, -28503, -14664, 6613, 6433, 954, 24221, 29275, 45283, 71844, 61133]
12934F1133j4730j966j4619n281q028M809Q553J3668K1779n371n42k4344k1469
12921A3592q586j1108J1603K0044J0185M441p485j4652j8719N656K160n329N800
12908G602k536O933P375k2639M666M193K0870O008j3414M008J0276J4305j3914
12895C3733k6909j1035r573j9729o417J1590n426l2293K2745J8361J5694J2074
12883B815Q282J8664q685k2056N401J717M865P21n968j2759P61n463p099p908
12869b6712J9230J201J7233J5290q279j2077K2R989J1996O951j6101L4742o629
12856D6856M38j082o176q992j3045r333j5593j7474K5738J8744q607p480O163
12843A0157P985n000K868N907R42L920j5975j2272J2374K5344M172j2593k9404
$$ y = [61133, 46403, 44437, 29818, 24537, 16509, 21318, 29871, 43539, 65318, 59947, 59405, 35061, 13592, 5006, -6102, 5501, 25545, 35730, 40171, 32686, 18034, -685, 4971, 7131, 1802, 7602, 5066, 11999, 19374, -3265, 1401, 5594, 26464, 32472, 19058, 23066, 33342, 47647, 33733, 6824, -4211, -13784, -33513, -39930, -28340, -33766, -66059, -43314, -24953, -9259, 2815, 11097, 29761, 21076, -980, 4421, 6138, 11003, 11724, 5756, -7003, -6242, -11705, -18804, -26712, -7482, -6281, 10952, 26242, 17963, 5886, 5908, 15897, 27893, 34844, 18743, 53485, 46856, 47294, 46212, 40036, 31044, 17999, 8666, -6927, -24401, 1337, 20081, 11474, 3994, 10157, 18142, 13142, 16010, 21917, 22859, 26779, 10804, -1468, 10906, 36250, 40422, 27829, -1575]
12830a575k1377q799n153Q900J3872J5354L171O429K0441J2788k1121r191o56
12817A3083j3111J785J383l816O327J5691J7897O244o240j1184j6996o543K074
12804F594n82J7390N127L20J422m449k834l2901p095j5272R958R916M126P949
12790c31K350j0692j532r527M156L5537L288l790j9156j6490M776J6441K7070
12777C2100k256J1376J0631r636j7998J018l655K5872K7056k1833n1441k6034
12765b4800K0750J9751K9442j416k9033l6149j5951K4034P160N841J2895r638
12753B886j3873L934J6051J1203O634k1314m953R443j8615j973R144M734P431
12740A0732Q199K1443m995m3506l408J8016J3784J204j7427k1169J877P865j2328
$$ y = [-1575, -22952, -31751, -36904, -28004, -14132, 1222, 4393, 10822, 31263, 44051, 22930, 13739, 13083, -28, 1757, 3140, -676, 5651, 21342, 39239, 45483, 39243, 28059, 11063, 4520, 6594, 6012, 23402, 28529, 28849, 30271, 25822, 22988, -9913, -17008, -32280, -22322, -12406, -8280, -331, 2019, -8673, -10205, -19732, -15576, 19961, 23249, 19459, 303, -16187, -11411, 5030, 32100, 29844, 41220, 51851, 42215, 24217, 25235, 21580, 47452, 74508, 52675, 1234, -24800, -4050, 15701, 45143, 43727, 14694, -21455, -37406, -13372, -6212, -371, 12524, 2886, -10987, -7053, 8998, 20201, 26835, 5521, 568, 10011, -8604, -10577, -1433, 3301, 10732, 18931, 40374, 35379, -8127, -11535, 6481, 20265, 21469, 4042, -17127, -15250, -7385, -19713]
12727a9713L390K0384q82J6804K511J2531K8683j0542l2744k895K1342Q903j3832
12714C3940j3507j0599J8695j3235q657L071P618r290j4846L221J7369j0670M271
12701G381j8919j9143j7206m038P055K9151M2859J9931k5387l926P690M510m272
12688B5686k3824j1868j1041k499n31J701J1677J2977K5039K8148k4519j3959
12676A6987k675k30L545j993P946K349n349o145M050K102Q443M830j8144j9970
12662d254j1434J8034j6297o112Q740J4856l763J1889j1099p774k0296J742J2611
12649a3157K259o81j1971m883J9270J6984j6160p707m205K0043J6506m071O226
12636A8453l90j2811j4442K743N763O67k059j295M4P898m438j5141J0954K408
$$ y = [-19713, -16323, 4061, 3179, 19983, 22494, 35025, 63708, 53166, 20422, 17527, 38869, 47772, 33940, 20433, 9834, 28529, 15294, 6637, 9708, 17326, 8036, -6810, -3589, 13780, 3110, 7381, -11538, -30681, -47887, -51925, -44870, -15719, 27140, 47071, 21684, 17758, 25448, 29958, 25686, 1862, -10006, -21047, -23546, -24077, -22376, -10699, 2278, 27317, 55465, 30946, 16987, 14312, 14082, 17627, 15634, 23580, 25929, 20580, 14435, 18485, 20587, 29030, 33860, 15716, -4254, -15688, 2346, -13951, -20063, -11323, 3533, -230, 11659, 560, -7214, -27510, -25768, -13157, -10898, -11579, -23550, -28433, -9163, 7821, -8339, -16046, -20251, -208, 16298, 12227, 18453, 18063, 5252, -9190, -6447, -684, -17, -2076, -3371, -3327, 4571, 133, -15008, -4054, -1646]
12622a646J3072r016Q422J1547j7857O735J6502K5993M619j3843q180m712r604
12609B2032j2060k2963j3248J4318j502k2989L337p662j168N69J8976J5487m493
12596a1366o841L443J5299J2173M091m165j7141o708J1754j2429j2297J954K0933
12583a300J2162p496k0392M922L515l514n009O712J2313J7505K1171m84n000j3287
12569B1818j4947j1275J1748K2655j1170L387o440k6582K340n540K4813J6287
12557B7094n081n40J5671O220j2805K1031j0565j3744J4825j6082l0812j0078
12545a4866O406j0008K3149k298m2985O899J0673n638K3767J8710J5992K2928
12533E2729J8481k516k9405j8237m0805j6797J0554J6180K8494j3103j7938N346
$$ y = [-1646, 11426, 2410, 10832, 22379, 4522, 11257, 27759, 53752, 58371, 44528, 36348, 31636, 22032, 9972, -12991, -26239, -11921, -13423, -36412, -33075, -40737, -41905, -41336, -22360, -6873, -11366, -18207, -14764, 535, 12708, 16799, 12634, -4507, -11215, 539, -11890, -24187, -22233, -1300, 10862, 3366, -17026, -12104, -8589, -12103, -17112, -10400, 1913, 19418, 40589, 40105, 35105, 21818, 6871, -4404, 7344, 29999, 18829, 22216, 15776, -10806, -8466, -14006, 10807, 27094, 22013, 21473, 37144, 43364, 30559, 51590, 41025, 27281, 42106, 26024, -4788, -14866, -8460, -18468, 4681, 2383, -40602, -33703, -23030, -28668, -4901, 13809, 29801, 52729, 71210, 68694, 39289, 21052, -19753, -36550, -25996, -9816, 18678, 5575, -12363, -7017]
12521g017j8747J328M3653L941L725J2419n960J5594M434j5877q718O934N093
12508D0802L3376L3655J8511k120N4047J07813J65187K68556K91656K10159j02714
12497A118928l34905k77170j85972r4747o2997j6824k7546l0338l3988j0131r241
12486C5069K2216K7526O239k1759j3023j266N892J1464n319k048L6060j2197L82
12473H9236O11k457P630J0943J7034M802J9541J2145K935L3529O4654N5755R1300
12460D07658J33701J80714L16456N57601Q25827R35483N16934n57577j067650
12451B249147p98940m66583k81879j72769j09207p2267n8357o2166l8107k3082
12441A65790k3669m934j093k8835m038N801k592J536O034q159J753k5447k2262
$$ y = [-7017, -25764, -24436, 19217, 23158, 26883, 39302, 33342, 48936, 53370, 37493, 28775, 35709, 40802, 74178, 107833, 126344, 124224, 178271, 286084, 451271, 719827, 1011483, 1221642, 1118928, 784023, 506853, 320881, 226134, 163137, 146313, 118767, 88429, 54441, 44310, 35069, 57285, 84811, 91050, 69291, 56268, 55002, 60894, 72358, 67039, 64991, 101051, 88854, 89236, 89847, 87390, 95020, 105963, 122997, 127799, 147340, 159485, 162420, 195949, 260603, 316358, 407658, 541359, 722073, 1038529, 1596130, 2421957, 3357440, 3874374, 3316797, 2249147, 1450207, 983624, 701745, 528976, 419769, 347502, 289145, 226979, 188872, 165790, 142121, 137187, 136094, 107259, 103221, 109022, 106430, 107966, 114000, 105841, 107594, 82147, 59885]
12428E9885Q32P782J4235J6595J3018J4109L4681N8573L3221L4648M5420N1066
12416C84065O4511J40338K43652L84109O32616R08199R34368K58864q39816j101495
12406B009411p16923m14462k55577j77567p7229n6942m1479n3210l5530j3295
12396A67197j5907l2994j9103k0874q271J1778P013j0513J0943K95j1087j9720
12384E8757k8449o007L5919O917j1212J4396l70R328N746K4774P760J517J9387
12371A38463O7351J00996J04304J57601K31736K96768K30126m7106l02079l09234
12361F68926k02066j27169q8693n4253n5231l0618l986j0595k3503j5011k1639
12350C6162p609r043Q307J6734J6062J1114M902k6740k9516M821J0209k7655j4147
$$ y = [59885, 60717, 68499, 82734, 99329, 112347, 126456, 161137, 219710, 252931, 287579, 332999, 384065, 448576, 588914, 832566, 1216675, 1849291, 2757490, 3691858, 3950722, 3110906, 2009411, 1292488, 878026, 622449, 444882, 367653, 310711, 269232, 216022, 180492, 167197, 151290, 118296, 99193, 78319, 70048, 81826, 88839, 78326, 89269, 89564, 78477, 58757, 30308, 24301, 60220, 67137, 55925, 70321, 69951, 79279, 85025, 109799, 117559, 119076, 138463, 205814, 306810, 411114, 568715, 800451, 1097219, 1327345, 1280239, 978160, 668926, 466860, 339691, 250998, 196745, 141514, 110896, 106910, 96315, 72812, 57801, 36162, 28553, 19510, 27817, 44551, 60613, 71727, 76629, 49889, 20373, 25194, 35403, 7748, -6399]
12337f399P267M601j53J5784K5106K810k8380l3806j6408K4420R538j706R439
12324A2113j6931j1458J2249l506r938J6389J5340J4319j4174k1827J0539o896
12312c781L9o388q164k781n927N07J1399J874q324j8014n171K4183L1209K092
12298A2753l155j0552r7M993L4771O491k2868j1059j2652k5369j5932K4363K035
12285a6278j2223p528p297P22K5868Q410K1772J4301l678j1191L499J97L951j1813
12271H712N911J7736L368l6457k5098N046J9915N49j608J2057J4359k7750J0489
12258G229L3201j0979j5087j5270o024n860Q84K1282Q033J8955O576J794O006
12245E0740j60n235l7602l3428Q624p234j9087Q858j5129l85J7557P283j07J7665
$$ y = [-6399, 868, 5469, 5316, 21100, 46206, 49016, 20636, -13170, -29578, -5158, 4380, 2674, 12113, -4818, -16276, -4027, -7533, -17471, -1082, 14258, 28577, 14403, -7424, 3115, -3781, -3742, -10130, -18294, -21075, -27002, -26495, -15096, -13222, -21546, -39560, -44731, -20548, 10661, 12753, 9598, -954, -1051, 3942, 38713, 45204, 22336, 11277, -1375, -26744, -42676, -18313, -16278, -28501, -36029, -43326, -42604, -16736, -8326, 13446, 27747, 24069, 12878, 16377, 16574, 20525, 8712, 14623, 32359, 35727, -730, -25828, -20782, -867, -318, -1926, 10131, 24490, -3260, 7229, 40430, 29451, 14364, -906, -6930, -12790, -11906, 9376, 17409, 36364, 42940, 44734, 50740, 50580, 45345, 7743, -25685, -17061, -24295, -43382, -34524, -49653, -50038, -32481, -25198, -25305, -7640]
12231g640M846j0931J5457L6020K6784O17k7581l1564j4825k3010R821L1596J6536
12218B6126K2613J3898l9291j2103p099j2774r241r397P519p028M246J0804J0706
12205a021R079J6059n274r424J0638Q595j2100k3044m5859r189L657J6026K6255
12192a5602P179O800J8065J8297j716j8698j1965M885P684k7688j0201R203J8754
12179D997j417o333k2717K720P028J1192J0647j4318k0226j6309r146q854o905
12166f9641K5195K0910J6346J4139J218N917M580j3123j6738r613K303j6788J7276
12153a8019J2232k627p884R898j2806n921J1925j0542R97K9017O901k604P640
12140A8207M252j5572j4517J7910k041N407k413J6381M491p479N751j4193k9802
$$ y = [-7640, -2794, -13725, 1732, 37752, 64536, 65153, 37572, 6008, -8817, -31827, -22006, 9590, 26126, 48739, 62637, 23346, 11243, 4144, -8630, -17871, -27268, -19749, -26777, -22531, -11727, -1021, 8058, 24117, 18843, 9419, 20057, 28652, 16552, -6492, -52351, -61540, -57883, -41857, -15602, -8423, -1623, 16442, 34739, 33023, 14325, 2360, 7245, 14929, -12759, -22960, -13757, 4997, 3580, -2753, -25470, -22750, -15722, -4530, 6117, -8201, -28427, -44736, -53882, -62736, -69641, -44446, -23536, -7190, 6949, 8167, 14084, 18664, 5541, -11197, -20810, -18507, -35295, -18019, -5787, -8414, -16298, -6400, -19206, -25127, -13202, -23744, -22747, 6270, 13171, 10567, 18207, 22459, 6887, -7630, 10280, 8239, 13646, 11233, 27614, 32105, 24626, 30377, 16184, -13618]
12127a3618o192l527l027J6974O627p911J324J8102J726j5127P734j9075r404
12114b5394J1067o632J2892j064J7058l245k5854J048K6013n389l688n9q752l552
12100a5551j7356n163L1374k705N395n307j2514K402J5948j968j4662j7295l395
12087d0797R401K9600J6294N027k1876L941J280l3742J828R36L953k524J8521
$$ y = [-13618, -19810, -23337, -26364, -9390, -2763, -10674, -9350, 8752, 10478, -4649, 3085, -15990, -25394, -14327, -20959, -8067, -9131, 7927, 4682, -21172, -20124, 5889, 500, -3188, -3247, -11999, -15551, -32907, -38070, -6696, -9401, -4006, -9313, -21827, -19425, -3477, -5445, -20107, -37402, -40797, -31396, -1796, 14498, 19525, -2351, 1590, 2870, -30872, -29044, -28108, -24155, -26679, -8158]
$$ [...]
##END NTUPLES=NMR SPECTRUM
##END=
