##TITLE=Analysis number 327962
Compound Code sb 01123
Book Reference a
Project Code adrs
Chemist Name stores
##JCAMPDX= 6.0         $$ Bruker NMR JCAMP-DX V2.0
##DATA TYPE= NMR SPECTRUM
##DATA CLASS= NTUPLES
##ORIGIN= Bruker BioSpin GmbH
##OWNER= nmr
$$ XWIN-NMR		Version 3.5
$$ Mon Apr 23 11:12:43 2007 GMT Daylight Time (UT+1h)  MAYBRIDGE\nmr@NMR_250MHZ
##.OBSERVE FREQUENCY= 250.131544655141
##.OBSERVE NUCLEUS= ^1H
##.ACQUISITION MODE= SIMULTANEOUS (DQD)
##.ACQUISITION SCHEME= undefined
##.AVERAGES= 16
##.DIGITISER RES= 18
##SPECTROMETER/DATA SYSTEM= dpx250
##.PULSE SEQUENCE= zg30
##.SOLVENT NAME= CDCl3
##.SHIFT REFERENCE= (INTERNAL, CDCl3, 0, 16.522)
##AUDIT TRAIL= $$ (NUMBER, WHEN, WHO, WHERE, WHAT)
$$ ##TITLE= Audit trail, XWIN-NMR		Version 3.5
$$ ##JCAMPDX= 5.01
$$ ##ORIGIN= Bruker BioSpin GmbH
$$ ##OWNER= nmr
$$ C:\u/data/dgb/nmr/ADRS/1840/pdata/1/auditp.txt
$$ ##AUDIT TRAIL=  $$ (NUMBER, WHEN, WHO, WHERE, WHAT)
(   1,<2007-04-23 11:12:21.39 +100>,<MAYBRIDGE\nmr>,<NMR_250MHZ>,
      <created by zg, POWCHK disabled, PULCHK disabled
       configuration hash MD5:
       49 4B E0 1D 92 C2 6B 37 9F E6 65 BC 52 41 86 1D
       data hash MD5: 64K
       F9 B3 71 B7 E2 86 15 FB A6 F3 FD 5F A7 3D 8F FC>)
(   2,<2007-04-23 11:12:33.76 +100>,<MAYBRIDGE\nmr>,<NMR_250MHZ>,
      <Start of raw data processing
       ef LB = 0.3 FT_mod = 6 PKNL = 1 SI = 32K 
       data hash MD5: 32K
       C1 6C 9D 0B 72 61 5F 02 DB 3B 3C 19 EF 7A 0D D8>)
(   3,<2007-04-23 11:12:35.45 +100>,<MAYBRIDGE\nmr>,<NMR_250MHZ>,
      <apk 
       data hash MD5: 32K
       2C BA DD CC AA 3A 3D 28 45 BF 13 BA D0 BA 97 D8>)
(   4,<2007-04-23 11:12:36.17 +100>,<MAYBRIDGE\nmr>,<NMR_250MHZ>,
      <abs ABSG = 5 
       data hash MD5: 32K
       7D E1 44 3B 8E 29 9E 7F 3E EA E5 74 86 B7 22 29>)
$$ ##END=
$$ 
$$ hash MD5
$$ 01 03 8D CC DD 37 4F 6E CF 55 5B DD 4B 27 B0 3C
##$RELAX= 
##$RELAX= 
##$RELAX= 
##$RELAX= 
##$RELAX= 
##$RELAX= 
##$RELAX= 
$$ Bruker specific parameters
$$ --------------------------
##$DU= <C:\u>
##$EXPNO= 1840
##$NAME= <ADRS>
##$PROCNO= 1
##$TYPE= <nmr>
##$USER= <dgb>
##$AMP= (0..31)
100 100 100 100 100 100 100 100 100 100 100 100 100 100 100 100 100 100 
100 100 100 100 100 100 100 100 100 100 100 100 100 100 
##$AQSEQ= 0
##$AQ_mod= 3
##$AUNM= <au_zg>
##$AUTOPOS= <13 >
##$BF1= 250.13
##$BF2= 250.13
##$BF3= 250.13
##$BF4= 250.13
##$BF5= 500.13
##$BF6= 500.13
##$BF7= 500.13
##$BF8= 500.13
##$BYTORDA= 1
##$CFDGTYP= 0
##$CFRGTYP= 5
##$CHEMSTR= <none>
##$CNST= (0..31)
1 1 145 1 1 1 1 1 1 1 1 1 1 1 1 1 1 1 1 1 1 1 1 1 1 1 1 1 1 1 1 1 
##$CPDPRG= <>
##$CPDPRG1= <>
##$CPDPRG2= <>
##$CPDPRG3= <>
##$CPDPRG4= <mlev>
##$CPDPRG5= <mlev>
##$CPDPRG6= <mlev>
##$CPDPRG7= <mlev>
##$CPDPRG8= <mlev>
##$CPDPRGB= <>
##$CPDPRGT= <>
##$D= (0..31)
0 1 0 0 0 0 0 0 0 0.06 0 0 0 0 0 0 0.0002 0 0 0 0 0 0 0 0 0 0 0 0 0 0 
0 
##$DATE= 1177323140
##$DBL= (0..7)
120 120 120 120 120 120 120 120 
##$DBP= (0..7)
150 150 150 150 150 150 150 150 
##$DBP07= 0
##$DBPNAM0= <>
##$DBPNAM1= <>
$$ [...]
##$SUBNAM7= <"">
##$SUBNAM8= <"">
##$SUBNAM9= <"">
##$SW= 20.6930455092707
##$SWIBOX= (0..15)
0 0 3 0 0 0 0 0 0 0 0 0 0 0 0 0 
##$SW_h= 5175.983436853
##$TD= 65536
##$TD0= 1
##$TE= 683.16
##$TE2= 300
##$TE3= 300
##$TEG= 300
##$TL= (0..7)
0 120 120 120 120 120 120 120 
##$TP= (0..7)
150 150 150 150 150 150 150 150 
##$TP07= 0
##$TPNAME0= <>
##$TPNAME1= <>
##$TPNAME2= <>
##$TPNAME3= <>
##$TPNAME4= <>
##$TPNAME5= <>
##$TPNAME6= <>
##$TPNAME7= <>
##$TPOAL= (0..7)
0.5 0.5 0.5 0.5 0.5 0.5 0.5 0.5 
##$TPOFFS= (0..7)
0 0 0 0 0 0 0 0 
##$TUNHIN= 0
##$TUNHOUT= 0
##$TUNXOUT= 0
##$USERA1= <user>
##$USERA2= <user>
##$USERA3= <user>
##$USERA4= <user>
##$USERA5= <user>
##$V9= 5
##$VALIST= <valist>
##$VCLIST= <CCCCCCCCCCCCCCC>
##$VD= 0
##$VDLIST= <DDDDDDDDDDDDDDD>
##$VPLIST= <PPPPPPPPPPPPPPP>
##$VTLIST= <TTTTTTTTTTTTTTT>
##$WBST= 1024
##$WBSW= 4
##$XGAIN= (0..3)
0 0 0 0 
##$XL= 0
##$YL= 0
##$YMAX_a= 531878
##$YMIN_a= -592968
##$ZGOPTNS= <>
##$ZL1= 120
##$ZL2= 120
##$ZL3= 120
##$ZL4= 120
##$ABSF1= 16.522
##$ABSF2= -4.171173
##$ABSG= 5
##$ABSL= 3
##$ALPHA= 0
##$AQORDER= 0
##$ASSFAC= 0
##$ASSFACI= 0
##$ASSFACX= 0
##$ASSWID= 0
##$AUNMP= <proc_1d>
##$AZFE= 0.1
##$AZFW= 0.1
##$BCFW= 0
##$BC_mod= 0
##$BYTORDP= 0
##$COROFFS= 0
##$CY= 12.5
##$DATMOD= 1
##$DC= 0
##$DFILT= <>
##$DTYPP= 0
##$F1P= 14.0000005364418
##$F2P= -0.99999901652339
##$FCOR= 0.5
##$FTSIZE= 32768
##$FT_mod= 6
##$GAMMA= 0
##$GB= 0
##$INTBC= 1
##$INTSCL= 1
##$ISEN= 128
##$LB= 0.3
##$LEV0= 0
##$LPBIN= 0
##$MAXI= 10000
##$MC2= 0
##$MEAN= 0
##$ME_mod= 0
##$MI= 0
##$NCOEF= 0
##$NC_proc= -2
##$NLEV= 6
##$NOISF1= 0
##$NOISF2= 0
##$NSP= 0
##$NTH_PI= 0
##$NZP= 0
##$OFFSET= 16.522
##$PC= 1
##$PHC0= 228.3132
##$PHC1= 8.162303
##$PH_mod= 1
##$PKNL= yes
##$PPARMOD= 0
##$PSCAL= 4
##$PSIGN= 0
##$REVERSE= no
##$SF= 250.13
##$SI= 32768
##$SIGF1= 0
##$SIGF2= 0
##$SINO= 400
##$SIOLD= 32768
##$SREGLST= <1H.CDCl3>
##$SSB= 0
##$STSI= 32768
##$STSR= 0
##$SW_p= 5175.98343685301
##$SYMM= 0
##$S_DEV= 0
##$TDeff= 65536
##$TDoff= 0
##$TI= <Analysis number 999999
Compound Code 99
Book Reference 9
Project Code 9>
##$TILT= no
##$TM1= 0
##$TM2= 0
##$TOPLEV= 0
##$USERP1= <user>
##$USERP2= <user>
##$USERP3= <user>
##$USERP4= <user>
##$USERP5= <user>
##$WDW= 1
##$XDIM= 32768
##$YMAX_p= 485064202
##$YMIN_p= -91617
$$ End of Bruker specific parameters
$$ ---------------------------------
##NTUPLES= NMR SPECTRUM
##VAR_NAME=  FREQUENCY,     SPECTRUM/REAL,   SPECTRUM/IMAG
##SYMBOL=    X,             R,               I
##VAR_TYPE=  INDEPENDENT,   DEPENDENT,       DEPENDENT
##VAR_FORM=  AFFN,          ASDF,            ASDF
##VAR_DIM=   32768,         32768,           32768
##UNITS=     HZ,            ARBITRARY UNITS, ARBITRARY UNITS
##FACTOR=    0.157963299565203, 1,           1
##FIRST=     4132.6476996994, 0,             0
##LAST=      -1043.33573715361, 0,           0
##MIN=       -1043.33573715361, -91617,      0
##MAX=       4132.6476996994, 485064202,     0
$$ Real data points
##PAGE= N=1
##DATA TABLE= (X++(R..R)), XYDATA
$$ [...]
19216B046o668j7m937K036J1988P001N70o657k590L659n65q560n633J974K783
19201c570M658r56j730L067j413j632o64k271R69K829K37o44l344J081k212l927
19185i522J91O799M603n27p113l028M629Q172M105k399k312k669k31J065M839
19170F602M167p796j727q22q0j535j85o61P984k302n997R5M585K19o665K260J0236
19153H378L410o362j1000l315O193j507K667M394N342m708p211K081O186k14o974
19138b640o04r8k612N277M282m454l690j691L0l45O828q070M100J490J43n52j101
19121c707k775M226M439J389J443j802L186J990J450j675p38j925q369j815Pj521
19105f197l944O827k125r85P342J864q35p806l257m40O925J0422M892k685n880
$$ plain form
19216 2046 -4622 -4639 -9576 -7540 4448 11449 12019 5362 2772 6431 5866 -2694 -8327 -6353 -3570
19201 -3570 1088 132 -1598 1469 56 -1576 -2240 -4511 -3542 -713 -476 -1120 -4464 -3383 -5595 -9522
19185 -9522 -9331 -2532 2071 1544 -5569 -8597 -3968 4204 8309 5910 3598 929 698 1763 6602
19170 6602 10769 2973 1246 424 344 -1191 -1376 -2037 5947 3645 -2352 -2257 2328 2547 -4118 -1858 8378
19153 8378 11788 5426 -5574 -8889 -2696 -4203 -1536 2858 8200 3492 -3719 -1638 4548 4334 -2640
19138 -2640 -3244 -3342 -5954 -677 3605 -849 -4539 -6230 -6200 -6545 283 -7787 -3687 -2197 -2054 -2606 -3707
19121 -3707 -6482 -2256 2183 3572 5015 3213 6399 8389 9839 8164 7426 5501 -2868 -4683 -4676 -6197
19105 -6197 -10141 -3314 -5439 -6424 918 2782 1947 -5859 -9116 -9556 -2631 7791 12683 9998 4118
19090D118J882k572K144J402J680k277j0488k210N50L77K221k86K430P894K853
19075I718M82L14m698J005M907R6m786m062j588M06k199q215M791O072N004m53
19059F794L011o664m394q753K960R698L893j683L745m1J948O767k252q852k875
19044C302K539K718l137p240J96P673j192M660L821J63k083P84m221p494j238
19029g49M484J120J879j081n816M201J976j044p029j66L129O67O089k041o912
19014a293m920O389J3151j601k349q93k127k874K083n10r740p425O89J3501R463
18999A1544n27r808q46j0K772M180K822K848m584j103L872K602K852J991k427
18984A6178o861n941j660M710j337k772j864k64K116N174k823o76M081j124k095
$$ plain form
19090 4118 6000 3428 5572 6974 8654 6377 -4111 -6321 -5771 -5394 -3173 -3459 -1029 6865 9718
19075 9718 10200 10514 5816 6821 11728 11824 7038 2976 1388 1794 -405 -8620 -3829 2243 7247 6794
19059 6794 9805 3141 -1253 -10006 -7046 2652 6545 4862 8607 8566 10514 17281 15029 6177 3302
19044 3302 5841 8559 5422 -1818 -1622 6051 4859 9519 13340 13503 11420 12204 7983 489 -749
19029 -749 3735 4855 6734 5653 -163 4038 6014 4970 -2059 -2225 904 1571 7660 5619 -1293
19014 -1293 -6213 176 13327 11726 9377 8484 6357 3483 5566 5056 -4684 -12109 -11420 2081 11544
18999 11544 11017 1209 363 353 3125 7305 10127 12975 8391 7288 11160 13762 16614 18605 16178
18984 16178 9317 3376 1716 6426 5089 2317 453 189 2305 7479 4656 3980 8061 6937 4842
18969D842m316j752P276J106J112J573N63K675j133J755K587k254J32k593p803
18954C770L82N077n227k572j359K173q45o096o477o74N020L844j87n91Q456l217
18938A477j682N091q30m414k533J712K251R9M830n64k340j068N782J892n831j206
18922B666J189J975L119m274o676l210j80p77L053m33J309jJ661j900Q637J474
18906G632q944m222N884K908l719o271K407Q723K21o720P182M98m601j48M535
18891E365L291n640k577K853J735M953N90K701K394l726m160k364O3K634l058
18876E054j3j376n337q64N727l10k609j166j354L376K555o062K553N433n681p665
18860g739J957J2749P346L482r4o508l021o724m039M581n18l233P302l37K561
$$ plain form
18969 4842 526 -1226 6050 7156 8268 9841 10404 13079 11946 13701 16288 14034 14166 11573 3770
18954 3770 4152 9229 4002 1430 71 2244 1399 -4697 -11174 -11848 -6828 -2984 -3171 -3762 4694 1477
18938 1477 -205 4886 4056 -358 -2891 -1179 1072 1171 6001 5437 3097 2029 7811 9703 3872 2666
18922 2666 3855 5830 8949 4675 -2001 -5211 -5391 -6168 -3115 -3548 -2239 -2240 -579 -2479 6158 7632
18906 7632 -1312 -5534 350 3258 -461 -6732 -4325 4398 4619 -2101 5081 5579 978 830 5365
18891 5365 8656 3016 439 3292 5027 9980 10570 13271 15665 11939 7779 5415 5478 8112 5054
18876 5054 5041 3665 -1672 -2536 3191 2881 272 -894 -2248 1128 3683 -2379 174 5607 -74 -7739
18860 -7739 -5782 6967 14313 17795 17701 11193 8172 1448 -2591 1990 1472 -1761 5541 5204 7765
18845G765J497J12J256j915k199J650j005j096J217J675K639J362k920Q31N887
18830A6756j565o569l333K665L882q7M69O61j899N46k846K177M130k919r470o23
18814A975O65P57Q63K666J251l54M78l528k204J307N410N386l228n063J571L330
18798A1282p32k740j842m149o017j707K013o18J979L606k477r96lj630j832L696
18782b167j912N272L569j429j6j493k726K489K697L054n6J878N709O751J7708
18767C9328K3211K0211p397j6592k0101j7286p379k517j383o722Q37K226k537
18754C899j678k950N07N395K736q25J217K571l613j2463m466P087J040K300J92
18739I49o904J229P239N99M218L43k38l56P693m927q324N836N873n533n412M195
$$ plain form
18845 7765 9262 9374 10630 8715 6516 8166 7161 6065 7282 8957 11596 12958 10038 10869 16756
18830 16756 15191 8622 5289 7954 11836 11749 12218 12879 10980 11526 8680 10857 14987 12068 2598 1975
18814 1975 2640 3397 4260 6926 8177 7823 8301 4773 2569 3876 9286 14672 11444 6381 7952 11282
18798 11282 10550 7810 5968 1819 -4198 -5905 -3892 -4510 -2531 1075 -1402 -2398 -2401 -4031 -5863 -2167
18782 -2167 -4079 1193 4762 3333 3317 1824 -902 1587 4284 7338 7282 9160 14869 21620 39328
18767 39328 62539 82750 75353 58761 38660 21374 13995 11478 10095 3373 4210 6436 3899
18754 3899 2221 -729 -222 5173 7909 7084 8301 10872 7259 -5204 -9670 -2583 -1543 757 949
18739 949 -5955 -4726 2513 3112 7330 7673 7435 7079 14772 9845 1521 7357 13230 7697 2285 6480
18723F480Jm18O850P334O23m815n690m906o856l975j855K192N555L24M495J061
18707F400k945j644K937k581K988O866n103M190O62j912m754q445n309J341L679
18692c630R243M909j052j628M903m55j135l769m206j966o21J681K106K935J828
18677I143o831M998P923j601n027q16K083J139K529o033k420J202N380N324O11
18662A7604j660o425P96k234n4J554L81l050n012j961Q016L213M66N466q072q719
18646C09p082k730R78N677L537m59j0525k508J817R22L481N519q24L479l2o678
18630e119j114M548P014K111j676J782j078P49j157N87m50O46P14M731j069j752
18614I467l20k83k853K722J029N72K921k402m400k384J434p40K066p593J59M526
$$ plain form
18723 6480 6481 6063 12913 20247 20870 16055 10365 5459 -1397 -5372 -7227 -5035 520 844 5339 6400
18707 6400 3455 1811 4748 2167 5155 12021 6918 11108 11770 9858 5104 -3341 -8650 -7309 -3630
18692 -3630 5613 10522 9470 7842 12745 12290 11155 7386 3180 1214 593 2274 4380 7315 9143
18677 9143 2312 7310 15233 13632 8605 7789 9872 11011 13540 7507 5087 6289 11669 16993 17604
18662 17604 15944 9519 10315 8081 8027 9581 9962 6912 1900 -61 7955 11168 11634 17100 9028 309
18646 309 -6773 -9503 -8525 -2848 689 230 -10295 -12803 -10986 -10064 -6583 -1064 -1888 1591 1559 -5119
18630 -5119 -6233 -1685 5329 7440 5764 7546 6468 7217 6060 6647 6197 6843 7557 12288 11219 9467
18614 9467 9147 8864 6011 8733 9762 10334 13255 10853 6453 4069 5503 4763 6829 -764 -605 3921
18598C921l14L522n18j783j371n10m738L755J462l950K508N770L444l48n361J802
18582G291N174k528l009L238m70k438m840j431N597O70p836l494m501j892O851
18567c618O463J893k114p256K552L372M730L624R68j440M646k606m683n80K157
18552H108K624q46o74K940j002J059k022j693k322k624M532L299m578L596O119
18537A6516J205k096k751J08o108k681J334L467J467J593p440k240l361J970P388
18522H371m427J247N581j757l536j683Q274j742n390J426K771P797K789j219j795
18507A6707k580J32P51m74p537q386K818K592P907M277n031m089n415K922k233
18492B361n419L655Q334N010l002K802l887r19r81k821m777Q42Q299j058L68R78
$$ plain form
18598 3921 3607 7129 6611 4828 3457 2947 -1791 1964 3426 -524 1984 7754 11198 10850 5489 7291
18582 7291 12465 9937 6928 10166 9696 7258 2418 987 6584 7254 -582 -4076 -8577 -10469 -3618
18567 -3618 2845 4738 2624 -4632 -2080 1292 6022 9646 10614 9174 13820 11214 6531 5951 8108
18552 8108 10732 9886 9212 12152 11150 12209 10187 8494 6172 3548 8080 11379 6801 10397 16516
18537 16516 17721 15625 12874 12982 6874 4193 5527 8994 10461 12054 4614 2374 -987 983 8371
18522 8371 3944 5191 10772 9015 5479 3796 12070 10328 4938 6364 9135 16932 19721 18502 16707
18507 16707 14127 14259 15010 14536 6999 -1387 1431 4023 11930 16207 11176 7087 1672 4594 2361
18492 2361 -3058 597 8931 13941 10939 13741 9854 8935 7954 5133 356 1198 9497 8439 8807 9785
18476I785m412m921O940m57k655k68m185N64L356J838N551O724o45n728r48L95
18460A0934L285K565j637n436K417P536L648p91j1417p467Q60j422L377M889n255
18445F086p274J855M601r81k375o468J624p60j33N895K555J0647N253r568r784
18430A173K7O636N680J772l129m551J520l784J443M819P016p005l621L498p46
18415A0748l46R024p04j681n88M948l203O76n54o471M47L840k493n933M206M586
18399A6502k683k41q05O84m198k220K014L557J025j451M403K331k610J171m696
18384A2783m527m624L25N973O015l023m284J565L509J447J998J029o745q42k18
18369A0381K590M789L198P84L455l801p239n64P44K554n618r899J750L681J3094
$$ plain form
18476 9785 5373 452 7392 6935 4280 4012 -173 391 3747 5585 11136 17860 17215 11487 10539 10934
18460 10934 14219 16784 15147 9711 12128 19664 23312 22521 11104 3637 4497 3075 6452 11341 6086
18445 6086 -1188 667 5268 4287 1912 -4556 -2932 -3692 -3825 2070 4625 15272 20525 10957 1173
18430 1173 1200 7836 13516 15288 12159 7608 9128 5344 6787 11606 18622 11617 7996 11494 10748
18415 10748 10402 19426 18722 17041 16453 21401 18198 18874 18320 11849 12296 16136 13643 7710 11916 16502
18399 16502 13819 13578 12773 13457 9259 7039 9053 12610 13635 12184 16587 18918 16308 17479 12783
18384 12783 8256 3632 3957 9930 15945 12922 8638 10203 13712 15159 17157 18186 11441 10599 10381
18369 10381 12971 17760 20958 21742 25197 21396 14157 13593 14337 16891 11273 1374 3124 6805 19899
18354A9899L923m68m229j314m037m992j274K319J582M767K026l366m217J64n97
18339A0186m26P989M043n603l600L28K263M95o7l816l306L198n123r207j979M543
18323h2Q352j136J543nk853k77M329m05M331K873k972L630J914l566K660n141
18307A3195K530k193k852K371J423Q39j698n176l268M532N542k497j978P158l529
18292A4399l395Q69m300R961K858j2431m101J902l626O46Q026O563N44J367k984
18277A6298j498N037M25r84k999k443k072M93Q265l785j390J367m752k43M810
18262A6529O69K63p428j431n71K21J938k284K393M546K669o225R416P374k084
18247B5995k122P58K099q782n982n052N331N249n351L559N026K42l80p489l14
$$ plain form
18354 19899 23822 23354 19125 17811 13774 8782 7508 9827 11409 16176 18202 14836 10619 10783 10186
18339 10186 9760 17749 21792 16189 12589 12917 15180 15675 15608 11792 8486 11684 6561 -2646 -4625 -82
18323 -82 8270 7134 8677 8672 5819 5542 9871 9466 13797 16670 13698 17328 19242 15676 18336 13195
18307 13195 15725 13532 10680 13051 14474 15313 13615 8439 5171 9703 15245 12748 10770 17928 14399
18292 14399 11004 11873 7573 17534 20392 7961 3860 5762 2136 2782 10808 17371 17915 19282 16298
18277 16298 14800 19837 20262 19278 16279 13836 11764 12257 20522 16737 15347 16714 11962 11719 16529
18262 16529 17198 17461 10033 8602 8031 8252 10190 7906 10299 14845 17514 11289 20705 28079 25995
18247 25995 23873 24631 26730 17948 11966 6914 12245 17494 12143 15702 20728 20970 20590 13101 12787
18232A2787R093n82k585p115j505k223J748J581L67N738K544m93M767M256nj0347
18216A8026l061N836o31p948m366L545N855L315K4n378l545J588M118K154N57
18201B0089k447j489L145l524J045j241N107P823k332J861n764k71K739L406l861
18186B4286R94K314Q38K42j16m863j074J084k542J498l367j917J074l464K000
18171A6987J138l153M494P127m038Q10j217K129N489M366L604o171J693n066k38
18156B7954k293L368K863O02k094j0191P143J2254N372N610O372j533o988n270
18142D3169M801J991P048J4488N049n112K788R695Q751L362L362L825N612J3782
18128A22611J3862J6238Q113M916J8210K6959K8910K6575L4958M8367O9994Q7436
$$ plain form
18232 12787 21880 21298 18713 11598 10093 7870 9618 11199 11566 17304 19848 19355 24122 28378 28373 18026
18216 18026 14965 20801 20170 12222 7856 11401 17256 20571 20595 15217 11672 13260 17378 19532 20089
18201 20089 17642 16153 19298 15774 16819 15578 20685 28508 26176 28037 22273 22002 24741 28147 24286
18186 24286 25280 27594 28432 28674 28558 23695 22621 23705 21163 22661 19294 17377 18451 14987 16987
18171 16987 18125 14972 19466 26593 22555 23365 22148 24277 29766 34132 37736 31565 33258 28192 27954
18156 27954 25661 29029 31892 32494 30400 20209 27352 39606 44978 50588 56960 55427 48439 43169
18142 43169 47970 49961 57009 71497 76546 71434 74222 83917 92668 96030 99392 103217 108829 122611
18128 122611 136473 152711 160824 165740 183950 210909 239819 266394 301352 349719 419713 507149
18116E07149J25208J71945K45105L75034O20719J073622J894614L480796N001029
18107A3495221R02733k239653l767531l459002j885483j023419o05131l78421
18099A039314k41046j73352j20914q1618n7088m5412m6733m0709k5261k6869k4538
18088A55774j2284k0549j2139n396R79p838r346n780j0170m795k984n091l933
18075E6448p28l389j46j295k575k072q562n266p155n71O010R585o15K039j192
18060D0516k579J81j723L222k097m607J052K954J072K007o910q189p269k52M278
18045B1656L642Q946p089p298K293N28p311P24M933O026l151n088Q5M752M486
18030B8134p026K223K189n217J701M69m54j600J1739L001n673o437M047K964l916
$$ plain form
18116 507149 632357 804302 1049407 1424441 2045160 3118782 5013396 8494192 13495221
18107 13495221 14397954 12158301 8390770 4931768 3046285 2022866 1417735 1039314
18099 1039314 798268 624916 504002 422384 365296 319884 273151 232442 207181 180312 155774
18088 155774 143490 122941 110802 105406 106385 98547 89201 83421 73251 68456 65472 60381 56448
18075 56448 55720 52331 52185 50890 48315 46243 37681 32415 25260 24689 30699 40284 39669 41708 40516
18060 40516 37937 38118 36395 39617 37520 32913 33965 36919 37991 39998 33088 24899 17630 17378 21656
18045 21656 25298 34244 27155 19857 22150 22678 15367 16091 21024 27050 23899 18811 18896 23648 28134
18030 28134 21108 23331 25520 20303 22004 22473 22019 20419 32158 35159 29486 23049 27096 30060 26144
18015B6144R30J840J599P851L774n345k859l278N99K926P11O57N283L807M909
18000D9548l548J433l152l552r69m155l983m124k095m390k603O391O149J890l238
17985B9602o375j230k218Q20K505J677J43j838P132K938m112m995j720o51L65
17970B2043Q796r94k609m781J384j057J84M049L237K53o098l994J594m183N030
17955B2854J095N231M616L815q9l93k604m834L045P954p555L959M269J346L569
17940D6278j0329l23P802j641n350r718K781K482L783O258P43M975O470m364n795
17925D4052M081R032J5826J7062J5577K6325M9854O1736L9525J0008j8707l9050
17913B35321m5026l5849k2911j2244j8753j3341o268p782N42J3956J7034L3566
$$ plain form
18015 26144 27074 28914 30513 38364 42138 36793 33934 30656 31255 34181 34892 35549 40832 44639 49548
18000 49548 46000 47433 44281 40729 39760 35605 31622 27498 25403 21013 18410 24801 30950 32840 29602
17985 29602 23227 21997 19779 20599 23104 24781 24924 23086 30218 33156 29044 24049 22329 21678 22043
17970 22043 30839 29845 27236 22455 23839 22782 22966 27015 30252 30505 24407 20413 22007 17824 22854
17955 22854 23949 29180 33796 37611 37522 37129 34525 29691 32736 40690 33135 37094 41363 42709 46278
17940 46278 35949 35626 43428 41787 36437 26719 29500 31982 35765 42023 42766 47741 54211 49847 44052
17925 44052 48133 57165 72991 90053 105630 131955 181809 243545 283070 293078 274371 235321
17913 235321 190295 154446 131535 119291 100538 87197 80929 73147 73689 87645 104679 138245
17901A38245N0052N3106L4359j638j6413k1041j0852k531o752J598J6247J9308
17889B53688r265l0088l3637k7545j4129q359J310K0682K9996N4057M9373J0731
17877B96814o990j3679j6890k1345K570J9206N6292M9157r65l1497n9425m7134
17865B26114j7153N47K0567L0224J2930J1961P863L1472M3923L1300J0150k7402
17853C82496m0413l1402l7442l0522j326K0896M0516J7415j5881l3956l9359j8753
17841B12269P787L2012N5062M5312J4941j1692q938o273o770k3571l5901l6713
17829B37525l3765j8740j0968o253R515L614L589R002J8979K4282P850p711o081
17816B30838Q485L1443N2494J5235m0299n3187m3457j8504O540K9672K5062M010
$$ plain form
17901 138245 188297 241403 275762 274124 257711 236670 225818 223287 216535 218133 234380 253688
17889 253688 244423 214335 180698 153153 139024 130665 131975 152657 182653 236710 286083 296814
17877 296814 289824 276145 259255 237910 240480 259686 315978 365135 364170 332673 273248 226114
17865 226114 208961 209508 230075 260299 273229 285190 293053 324525 368448 399748 409898 382496
17853 382496 342083 310681 273239 242717 241391 262287 302803 320218 304337 270381 231022 212269
17841 212269 220056 252068 307130 352442 367383 355691 346753 340480 333710 310139 274238 237525
17829 237525 203760 185020 174052 167799 177314 180928 184517 193519 212498 236780 244630 236919 230838
17816 230838 239323 270766 323260 338495 298196 245009 201552 183048 189588 219260 244322 248332
17804B48332L64J0355L3824K3124l6499n0142o5497m2412j9926j3613j8560j0910
17792E8440r73j292R38m236k101L72k458q53r67O185m07K595P016l535q185J391
17776E1930k25J8J87m5N091L069R92n702m086N468l538l743l957l399m791n37
17760C6732k541k411j787L212N053j392k419j061M454o470K502L881r40J15n204
17745C1724l535P030M11k427K392R973J611J184J610J517J145l673q549o57M724
17730D4480k163K305j386K522M316k838o610o028l271l01N205P528O799K480l747
17715D9291o549r003K243Q853N346J803J358l221L340n149p302k166M985L07l826
17700D0310L215L88o471J741K374Q622O456L604M824n831p560m324J834k076j402
$$ plain form
17804 248332 248696 259051 292875 315999 279500 229358 163861 121449 101523 87910 69350 58440
17792 58440 57467 56175 57113 52877 50776 51148 48690 47837 46870 53055 52648 55243 62259 58724 50539 51930
17776 51930 51705 51723 51910 51865 56956 60025 61017 55315 51229 56697 53159 49416 45459 42060 37269 36732
17760 36732 34191 31780 29993 33205 38258 36866 34447 33386 37840 31370 33872 37753 36813 36928 31724
17745 31724 28189 35219 35630 33203 35595 45568 47179 48363 49973 51490 52635 48962 40413 39756 44480
17730 44480 42317 44622 43236 45758 50074 47236 40626 34598 31327 31026 36231 43759 50558 53038 49291
17715 49291 42742 33739 35982 44835 50181 51984 53342 50121 53461 48312 41010 38844 43829 44136 40310
17700 40310 43525 43913 37442 39183 41557 50179 56635 60239 65063 59232 51672 47348 49182 47106 45704
17685D5704L352K483N910L073l898N882L122l295N133k987m664K573m219q012
17671E0157J221J1302J0101N660J0167O569L760j382j411R516Q98l667M137M537
17657A11565J081n653k04N639N864l634k071o814j0103n900m865j117m6M234j346
17642H6630N11M935L534N834J217l058M79M579P031K864N190O779J3077J2534
17628A52136J1000O250j793j169m576J5217N672j456J0102P238K369j747p283
17615A91960j1138P072Q395O485J55o963o784j071O893P645O030r97m803j3037
17601A89842j7051j9987j1022L237J136l203p468K336J673n457j0287k986J633
17588A22396O741o93j002j2781j8407r610K469L601J168k707l20L506j032j110
$$ plain form
17685 45704 49056 51539 57449 60522 56624 62506 65628 62333 67466 64479 59815 62388 58169 50157
17671 50157 51378 62680 72781 78441 88608 95177 98937 97555 96144 105660 106558 102891 107028 111565
17657 111565 112646 106993 106789 112428 118292 114658 112587 105773 95670 89770 84905 83788 83742 87976 86630
17642 86630 87141 92076 95610 101444 102661 99603 100082 104661 111692 114556 119746 126525 139602 152136
17628 152136 163136 169386 167593 166424 161848 177065 182737 181281 191383 198621 200990 199243 191960
17615 191960 180822 187894 196289 202774 202929 195966 189182 188111 195004 202649 208679 207682 202879 189842
17601 189842 172791 152804 141782 145019 146155 142952 135484 137820 139493 134036 123749 120763 122396
17588 122396 129137 128444 127442 114661 96254 86644 89113 92714 93882 91175 90855 94361 93329 92219
17574I2219N546J1876P239l372k35L289O075L643M895j923n650J644j239j897
17560A22110l560j2228j7067j5128j2632p389k743n332N331P793l665q617O593
17547E3466J3215J2273J3707J1054J0235J2165O993L763J400R708O916Q574R78
17534A64447K665M396R03l527M373o039l356j342J082j66l520K300p884j0058
17520A44274j4866j2633l531o220j84O664R106J1046L64m068p757o616j025n6
17506A14498N594J8422J2365P850n285r133p711k169Q502J8427J6320K3694L3706
17493B35080L4742L2222L9565N2399N1274K4843J0421l985j3842J2121K0279J9251
17481E14370J8999K443j3129l4766l2720k0599r886j8689l095O846L59l26j540
$$ plain form
17574 92219 97765 109641 116880 113508 113273 116562 122637 126280 131175 129252 123602 125246 124007 122110
17560 122110 118550 106322 89255 74127 61495 54106 51363 46031 51362 59155 55490 46873 53466
17547 53466 66681 78954 92661 103715 113950 126115 133108 136871 138271 147979 154895 163469 164447
17534 164447 167112 171508 172411 168884 173257 167218 163862 162520 163602 163436 159916 162216 154332 144274
17520 144274 129408 116775 113244 107024 106840 113504 122610 133656 134020 129952 122195 115579 114554 114498
17506 114498 120092 138514 150879 158729 153444 144311 136600 134431 142933 161360 177680 201374 235080
17493 235080 269822 302044 341609 394008 445282 470125 480546 476561 462719 474840 495119 514370
17481 514370 533369 535812 522683 487917 455197 434598 424712 406023 402928 409774 410133 409807 408267
17468D08267L870J345j3902o09L413K416k75L011M626P030M905J0772J3754R990
17454D58613J2891Q428M567J2769J7546K5303M0302O0120P4660O9184O1418M7840
17442H93641M1206K9573k461j0127j0915J7951N4677Q9182J31074J86291K61879
17431A681971M12041O94495J084709J514977J673081O21495n27346q72644n32458
17422E750321M52872J353684J143649J56574j09071L13318N22474o11418j482562
17413G489841j797459j406282q15122m78393k89342j58750n1159M1404J19752
17404B654490J59453K06916K94069M89151Q30943J361095K003501K041742Q03940
17395A0845300p21668j549997j526061r53067l86487J4344L79656Q82641J555640
$$ plain form
17468 408267 412137 413482 399580 398971 402384 404800 404525 407536 412162 419192 424097 434869 448623 458613
17454 458613 471504 479932 484499 497268 514814 540117 580419 640539 715199 784383 845801 893641
17442 893641 934847 964420 961959 951832 940917 958868 1013545 1102727 1233801 1420092 1681971
17431 1681971 2094012 2788507 3873216 5388193 7061274 7682769 7155423 6282779 5750321
17422 5750321 6203193 7556877 8700526 8857100 8748029 9061347 9583821 8972403 7489841
17413 7489841 5692382 4286100 3470978 2992585 2703243 2544493 2493334 2534738 2654490
17404 2654490 2813943 3020859 3314928 3804079 4635022 5996117 7999618 10041360 10845300
17395 10845300 10123632 8573635 7047574 6094507 5708020 5722364 6102020 6984661 8540301
17386H540301J871504P88134m32487j107498j190133p41891l21908n142K62392
17377G663272N26049Q10772J123438J385706J709556K024541K411812L145829
17369B0800975M429675O588608J0205577J5676373K3412026L7148446N2757389
17362A71019069M9833516K9656393Q009431k1240141l1517353k3979449j993540
17355A79787926K6199676L1828054K0306295L433456l6143177n0526092n1887143
17348A22998995l9193378k3157122j4704623j0381574p577551n482907l731709
17341A8770131k603610j985045j707651j573406j382737j093388p70228m25130
17333G228936k8347L74306P37023J191468J394269K24941j143574j741663j670973
$$ plain form
17386 8540301 10411805 11199939 10767452 9659954 8469821 7727930 7406022 7400880 7663272
17377 7663272 8189321 9000093 10123531 11509237 13218793 15243334 17655146 20800975
17369 20800975 25230650 31819258 42024835 57701208 81113234 118261680 171019069
17362 171019069 220852585 250508978 258518409 237278268 205760915 181781466 179787926
17355 179787926 205987602 237815656 258121951 261555407 225412230 174886138 122998995
17348 122998995 83805617 60648495 45943872 35562298 27984747 22501840 18770131
17341 18770131 16166521 14181476 12473825 10900419 9517682 8424294 7654066 7228936
17333 7228936 7200589 7574895 8311918 9503386 10897655 11122596 9979022 8237359 6566386
17324F566386j022501m62028q043M26223R31299J696834K292776Q82862j070141
17315A0233667k013468k164881j471886q77728n32820l26239j86535q3294l5819
17306B540997j4414K8946J18640K92566N01357P63111J308228K200582J812023
17297I552036J6444m32690j73839N08568n86271j171895j350463o29513M90790
17288F223167J323560M73365p06935j551044j655500j191964p39750m41743k76911
17279A456245j93871j43618j12470o4883l1870l5527l9945l2529l0571m8562m7548
17268F74851n0592m4562l8548k5540k3857l0671k5870k5892k1034p717m879j818
17256C73871o293r373j2782k0027k2050j7534j4680j1149o334l137m373N181o33
$$ plain form
17324 6566386 5543885 5081857 5073814 5500037 6431336 8128170 10420946 11303808 10233667
17315 10233667 8220199 6055318 4583432 3705704 3172884 2846645 2660110 2576816 2540997
17306 2540997 2526583 2555529 2674169 2966735 3468092 4231203 5539431 7740013 9552036
17297 9552036 9568480 9135790 8961951 9470519 8884248 7712353 6361890 5732377 6223167
17288 6223167 7546727 8020092 7313157 5762113 4106613 2914649 2174899 1733156 1456245
17279 1456245 1262374 1118756 1006286 941403 909533 874006 834061 801532 770961 722399 674851
17268 674851 624259 579697 541149 515609 491752 461081 435211 409319 388285 380568 375689 373871
17256 373871 367578 358205 345423 325396 303346 285812 271132 259983 253649 250512 246139 251320 250687
17243B50687L052J1588J5842J1957K0369L5334J9955l0836m5555n7197l1666K739
17231B06269J6997K6868K0604n402k1839k8203j8304K790J3435L4906K5957J5997
17219B90075N880j424K824L313M591K827o920q402j3485j1741m737O166o207j0776
17205B51984r255j1090q791j0907p118m590M023O522J189r762j3696j5306j6806
17192A56397r498j4420q901j1587j2376o688j799m549j4023p33K433j210k501
17179G0545K47j595K694L358N117J4054K0453J0974L184M729j36J0721J0298J0854
17165A65497L468m468n393m651l288o687o922m813R1r519j2233p934L922K844
17151A09914q933r077j707N847k607j0275q317k370o463k683k4O511J290k209
$$ plain form
17243 250687 253739 265327 281169 293126 313495 348829 368784 337948 292393 235196 203530 206269
17231 206269 223266 250134 270738 265336 243497 215294 196990 199780 213215 248121 274078 290075
17219 290075 295955 294531 297355 300668 305259 308086 301166 292764 279279 267538 262801 268967 262760 251984
17205 251984 242729 231639 222848 211941 204823 200233 204256 210778 211967 202205 188509 173203 156397
17192 156397 146899 132479 123578 111991 99615 92927 91128 86579 72556 71823 74256 73046 70545
17179 70545 70792 69197 71891 75249 80366 94420 114873 125847 129031 133760 133624 144345 154643 165497
17165 165497 168965 164497 159104 154453 151165 144478 137556 132743 132834 123315 111082 103148 107070 109914
17151 109914 100981 91904 90197 96044 93437 83162 74845 72475 66012 63329 63305 69816 71106 68897
17137F8897o799j179m74O348Q316J1022M513K176j914k654j0249q472q671j0272
17123E0588j732l719j0900j0444r930r21m143k14M55l731J940J308N856Q129J2391
17108C4933L001l024m721k664M787O237n351K489M993L458M601P69J526j915O568
17093E5687L993l569o53J960j786K425l778j1883j0856L197R509O91J949n069
17079D1817j2811l436M121O374P42n293l355o46j284J771O616J91o102p998j125
17064A9582p104r884q067l668m008j86j087K423L238J243N997k830J93J1967N372
17049A3181k842q379n662k838M326L223N267Q302L296K234j25l916l174m893o36
17034G364M44L729K759l696l238J637P684J0223K28L035K178L79k517n225N956
$$ plain form
17137 68897 62098 60919 60445 66793 75109 86131 90644 92820 90906 88252 78003 69531 60860 50588
17123 50588 48856 45137 34237 23793 13863 12942 8799 8585 9040 5309 7249 8557 14413 22542 34933
17108 34933 37934 34910 30189 27525 32312 38549 33198 35687 40680 44138 48739 49508 51034 49119 55687
17093 55687 59680 56111 55458 57418 55632 58057 54279 42396 31540 34737 44246 44937 46886 41817
17079 41817 29006 25570 29691 36065 36807 31514 28159 27513 26229 28000 34616 34807 28705 20707 19582
17064 19582 12478 2594 -5473 -9141 -13149 -13335 -14422 -11999 -8761 -7518 -1521 -4351 -4158 7809 13181
17049 13181 10339 1960 -3702 -6540 -2214 1009 6276 14578 17874 20108 19983 16067 12893 8000 7364
17034 7364 7808 11537 14296 10600 7362 8999 16683 26906 27134 30169 32347 32726 30209 24984 30940
17019C0940N243K131p543m435l348q650p312K616N494L321P783K774o389l409
17005A9216k9J320L685M309j46k612j019K62l541l798J856J232o89l496O11N101
16989B2262k483L32r156l084k147L12M674k21n843N094N183M147K97m818n871
16974H678L517M816l368k020R219M31q573k659J1123J3253j594k443n116k258
16960B3006m074o064o257J658N115J593J1206J1384n091q090j138o755K14K220
16946A8927J027n359j0403j510M504M1P23N987O689k468l067k588m170o01J047
16931H779o990m328p84N415J777N42P359K750k93M349L585J0077K997n47k492
16916C2196m526j522J0324R300P397N339J7713L1119L5422M7843N7519L4725n839
$$ plain form
17019 30940 36183 38314 30771 26336 22988 14338 7026 9642 15136 18457 26240 29014 22625 19216
17005 19216 19187 20507 24192 28501 28355 25743 24724 24986 21445 17647 19503 20735 20046 16550 17161 22262
16989 22262 19779 20111 10955 7871 5724 6036 10710 10489 4646 9740 14923 19070 19367 14549 8678
16974 8678 12195 17011 13643 11623 20842 21273 12700 10041 21164 34417 32823 30380 25264 23006
16960 23006 18932 12868 6611 8269 13384 14977 26183 37567 32476 24386 23248 16493 16707 18927
16946 18927 19954 14595 4192 2682 7186 7227 7950 13937 20626 18158 15091 12503 8333 7732 8779
16931 8779 1789 -2539 -3323 2092 3869 4411 11770 14520 14227 18576 22161 32238 35235 34688 32196
16916 32196 27670 26148 36472 45772 53169 58508 76221 107340 142762 190605 248124 282849 277010
16903B77010k8235k5156j5635j5204k0579k7252j6924M279L6842N4837K6187j9078
16891B31092m7665k9596m885K141K581j1262k0349j9988j9859m128R558J2834
16879A00474K3417L8626L9322L9192K9416K2633L8756K4841j7518k9158l7975
16868B72026k5581l706K3734L3661M868k9102m3588l8407j3174Q126L5119L9131
16856B63107K6285K9840R82l7416m0821l6840k1370l65J3004Q356L140N839q261
16843B05480k1732j7419j5614q71K6704N1778N8216K3978l021k9176l5536l5327
16831B07460k7889l900J7072L0318K14k3878k7216k1854p697P295L1725L6704
16819B18354J0004j7994j9608j6284j6615j1391Q895L6299L7087j1212l3108m4960
$$ plain form
16903 277010 248775 223619 207984 192780 172201 144949 128025 132304 169146 223983 250170 231092
16891 231092 183427 153831 148946 151087 153668 142406 122057 102069 82210 78082 87640 100474
16879 100474 123891 162517 201839 241031 270447 293080 331836 356677 339159 310001 272026
16868 272026 246445 242739 266473 300134 305002 275900 232312 193905 180731 188857 223976 263107
16856 263107 289392 319232 320214 282798 241977 205137 183767 183402 196406 204762 207902 213741 205480
16843 205480 183748 166329 150715 149844 176548 228326 286542 310520 307499 278323 242787 207460
16831 207460 179571 175671 192743 223061 223275 199397 172181 150327 142630 149925 181650 218354
16819 218354 228358 210364 190756 174472 157857 146466 155361 191660 228747 217535 184427 139467
16807A39467m1146k3354j1490r088o907k393J391O154J2465J9369L3924M6999
16795A65391N8936M3466O585l0503n3174n7014m8960l2610k1061j2405j129J242
16783A8764m795p731K348l923k269J431N140j514n465L752j760j105o105m25j261
16768d918J774M59J31K9N767l495Q99N322J005m283L735L176j1775j291k395l240
16752i100K823Q593M861k53q13l179p099n345J190P44R711P858r20j524l793m761
16736a007j369k055Q36L666k703n843m844M977N698L514n362n949M329Q90J425
16721c797M653l033P445M309O514k082n612r090q996m641M200J569m300k779K909
16706a2731J264N327K013l887L856O317J02l623m053m186p44N40K151L460q04
$$ plain form
16807 139467 98321 74967 63477 54389 47482 45089 46480 52634 65099 84468 118392 165391
16795 165391 224327 267793 274378 243875 190701 133687 84727 52117 31056 18651 17522 18764
16783 18764 13969 6238 8586 4663 2394 3825 8965 7451 1986 5738 3978 2873 -3232 -3657 -4918
16768 -4918 -3144 -2685 -2554 -2525 3242 -253 646 5968 6973 2690 6425 9601 -2174 -3465 -5860 -9100
16752 -9100 -6277 2316 7177 6924 6111 2932 -4167 -9512 -8322 -7578 2133 9991 9071 7547 3754 -1007
16736 -1007 -2376 -4431 -3595 71 -2632 -8475 -13319 -8342 -2644 870 -4492 -10441 -6112 -5222 -3797
16721 -3797 856 -2177 5268 9577 16091 14009 8397 -693 -9689 -14330 -10130 -8561 -12861 -15640 -12731
16706 -12731 -11467 -6140 -4127 -8014 -4158 2159 2261 -1362 -5415 -9601 -10345 -9805 -7654 -4194 -4998
16691d998J89n546m762j820Q781Q644M340l54q228l452k701q961j663P12K261
16676a7558M401J1339N835l625l931k750k730J856J339m413o140k433R828L158
16662e824L307k505o55l089j248J117L704J066K383L363q278j438m915J258Q619
16647c135J152k329j940J399K602P858j067p967p625j573J632Q805O583k600q009
16632f214l515K453K903M774K649m419j647l550K932M661l476p944K049J1569
16618C225l305k532l052j265K180P71L024K415N42N653o373r936k831O14P144
16603c726j785L442L470q06m48n737m148N556j506J252k352o59N952O096N051
16588I652m585q78M587l57l861p483q07j819J509L145K659L997j262o501l120
$$ plain form
16691 -4998 -4809 -10355 -15117 -16937 -8156 488 4828 4474 -3754 -7206 -9907 -18868 -20531 -19819 -17558
16676 -17558 -13157 -1818 4017 392 -3539 -6289 -9019 -7163 -5824 -10237 -16377 -18810 -8982 -5824
16662 -5824 -2517 -5022 -5677 -8766 -10014 -8897 -5193 -4127 -1744 1619 -6659 -8097 -13012 -11754 -3135
16647 -3135 -1983 -4312 -6252 -4853 -2251 5607 4540 -3427 -11052 -12625 -10993 -2188 4395 1795 -6214
16632 -6214 -9729 -7276 -4373 401 3050 -1369 -3016 -6566 -3634 1027 -2449 -10393 -8344 3225
16618 3225 -80 -2612 -5664 -6929 -4749 -3978 -954 1461 2003 7656 1283 -8653 -11484 -10870 -3726
16603 -3726 -5511 -2069 1401 595 147 -5590 -9738 -4182 -5688 -4436 -6788 -7447 -1495 4601 9652
16588 9652 5067 4189 8776 8419 4558 -2925 -3732 -5551 -4042 -897 1762 5759 4497 -2004 -5124
16573e124J523L414L40L783R81m415j484k216j0491m537J852N950M073J0273k547
16558A375n578l81k041n855n756M224l286J851M284L463L619J503n683o841N87
16543a4515N183p00n600k697O328P866M478J610l308K793M500k355l564m177J156
16528c002o624m037m392M798P419m624m850K158J086k611P78K673J177j10k871
16513a3032J589J912L584j755J995P478K9l549j983n741p455q15o53K235R325
16498f836l773P501R855L763o316o622l068o66J077n082J476k421n825L92L203
16483a3342L8j015J084M171j70r59j321Q23j902L780M386L295o96P2k208k251
16467f215o076m162m05R848R918P333K343j760K120o668j1948l244p92J356N410
$$ plain form
16573 -5124 -3601 -187 153 3936 4917 502 -982 -3198 -13689 -18226 -16374 -10424 -6351 3922 1375
16558 1375 -4203 -4584 -6625 -12480 -18236 -14012 -17298 -15447 -11163 -7700 -4081 -2578 -8261 -15102 -14515
16543 -14515 -9332 -10032 -15632 -18329 -12001 -4135 343 1953 -1355 1438 5938 3583 19 -4158 -3002
16528 -3002 -9626 -13663 -18055 -13257 -5838 -10462 -15312 -13154 -12068 -14679 -13901 -11228 -10051 -10161 -13032
16513 -13032 -11443 -9531 -5947 -7702 -5707 1771 1800 -1749 -3732 -9473 -16928 -17743 -18396 -16161 -6836
16498 -6836 -10609 -3108 6747 10510 4194 -2428 -5496 -6162 -5085 -10167 -8691 -11112 -16937 -16545 -13342
16483 -13342 -13304 -14319 -13235 -9064 -9234 -10193 -11514 -10691 -12593 -8813 -4427 -1132 -1828 -1756 -3964 -6215
16467 -6215 -12291 -16453 -16858 -7010 2908 10241 12584 10824 12944 6276 -5672 -8916 -9708 -8352 -2942
16452b942l776k687j01J32k220K076K625k970J236M030P043l955p065N43O216
16437a815j260m207O66K749L044Q38L75l979r84n31o91p184J159k228J45j002
16421a4905J0082L95m542N163O296k183l580o433j35K523P769M317o0r585n363
16406a0241j896P8k020j455O978O454M377k739N133k521q578p060m974L226O053
16391i185J489r81l08m70p40l001R38M879R871o69m784l117k973J847L771j959
16375e392k238n767J335M920j804k003l273K69J949J2354k593p875m527Q362k896
16360i179m307L753J547L831Km675j124m043l043P636O226R45l781M893L298k572
16344e93k822l927M16r68O47J279n684p051J63P661J2284O536l943k904o257l249
$$ plain form
16452 -2942 -6718 -9405 -9506 -9374 -11594 -9518 -6893 -9863 -8627 -4597 2446 -1509 -8574 -8031 -1815
16437 -1815 -3075 -7282 -6616 -3867 -823 15 390 -3589 -4573 -5104 -5795 -12979 -11820 -14048 -13903 -14905
16421 -14905 -4823 -4428 -8970 -3807 2489 306 -3274 -9707 -9842 -7319 450 4767 4707 -4878 -10241
16406 -10241 -12137 -12059 -14079 -15534 -8556 -2102 2275 -464 4669 2148 -6430 -13490 -18464 -15238 -9185
16391 -9185 -7696 -8677 -8985 -9455 -10195 -13196 -12258 -7379 2492 1823 -2961 -6078 -9051 -7204 -3433 -5392
16375 -5392 -7630 -13397 -12062 -7142 -8946 -10949 -14222 -13953 -12004 350 -2243 -10118 -14645 -6283 -9179
16360 -9179 -13486 -9733 -8186 -4355 -4353 -9028 -10152 -14195 -17238 -9602 -3376 -2431 -6212 -1319 1979 -593
16344 -593 -3415 -7342 -6926 -7894 -7247 -5968 -11652 -18703 -18540 -10879 1405 7941 3998 1094 -5163 -8412
16328h412k34L258M139j98J695K783l794r092k342R119P156l11J132n096n414
16313e611n526l852j687K232Q269M316q55K772m05j604M448k628m693K278M64
16298b082n09l089o338n369K682M435M070L563J854L618k869J504Q554M52q915
16283A561l818L30l514o13J1908r12r412M064M21M075L084P4r483r563j218J794
16267a1222K041Q95K015l359M348N435N498N51m30n337p170j016m60P288R34J812
16251A823q033j191O399Q582M150l808o559n231k508m4o7p02k017j191o357K900
16235a3854Q188M438J627j45k349q868p953k995O929J1929N51P097M529k241k780
16220D103l479o986n245M314L83K255L674M33l909o175k453k161K465Q167J843
$$ plain form
16328 -8412 -8646 -5388 -1249 -1447 248 3031 -763 -9855 -12197 -3078 4078 3767 4899 -197 -5611
16313 -5611 -11137 -14989 -16676 -14444 -6175 -1859 -2714 58 -347 -1951 2497 -131 -4824 -2546 -2082
16298 -2082 -2591 -5680 -12018 -17387 -14705 -10270 -6200 -2637 -783 2835 -34 1470 10024 10476 1561
16283 1561 -2257 -1927 -5441 -6054 5854 4942 -4470 -406 15 4090 7174 7248 -2235 -11798 -13016 -11222
16267 -11222 -9181 -8286 -6271 -9630 -5282 153 5651 6202 5772 435 -6735 -7751 -8211 -923 11 1823
16251 1823 -6210 -7401 -1002 7580 11730 7922 1363 -3868 -6376 -6420 -6487 -7189 -9206 -10397 -16754 -13854
16235 -13854 -5666 -1228 399 254 -2095 -10963 -18916 -21911 -14982 -3053 -2502 4595 9124 6883 4103
16220 4103 624 -6362 -11607 -7293 -6910 -4655 -981 -548 -4457 -10632 -13085 -15246 -12781 -4614 -2771
16205b771l573n141M810L889m096o050L508N797K540p258l186K820j398J836j41
16190h414K840r55k646M136N539n299K557j146o569j24L538l93l985K317J879
16175f725N957J897J702M345l376n006p09P28j378L549k448l960J889pj28J681
16159a989K187m390q503J777K814L400k812l683K98J355j827p65j125N759K869
16144d635j701l90j0n070j584O850K461j0L42L311Q26k796o857O488M452m555
16128b878o259k599j581P192J517l57R13j825P896L515M147j611l414p504n235
16113h083J700j246n821m83Q8P61O067m12P235O615J216m140M786M640n065j845
16097F013l133m548m797k651j086K995P191M377q698j946P740J983M81N055m4
$$ plain form
16205 -2771 -6344 -11485 -6675 -2786 -6882 -12932 -9424 -3627 -1087 -8345 -11531 -8711 -10109 -8273 -8414
16190 -8414 -5574 -6529 -9175 -5039 500 -4799 -2242 -3388 -9957 -10081 -6543 -6936 -10921 -8604 -6725
16175 -6725 -768 1129 2831 7176 3800 -1206 -1915 -1187 -2565 984 -1464 -5424 -3535 -3542 -3670 -1989
16159 -1989 198 -4192 -12695 -10918 -8104 -4704 -7516 -11199 -10901 -9546 -11373 -12138 -13263 -7504 -4635
16144 -4635 -6336 -6726 -6736 -11806 -13390 -6540 -4079 -4089 -3747 -436 390 -2406 -9263 -2775 1677 -2878
16128 -2878 -9137 -11736 -13317 -6125 -4608 -4965 -4052 -5877 2019 5534 9681 8070 4656 -2848 -8083
16113 -8083 -6383 -7629 -13450 -13933 -13845 -13084 -7017 -7429 -194 6421 7637 3497 8283 12923 7858 6013
16097 6013 2880 -1668 -6465 -9116 -10202 -7207 -16 4361 -4337 -6283 1457 3440 3921 8976 8932
16082H932q13n033n749Q66L093J654k93n882l202K495n351R199N22n411j268M884
16066a357J0022L337l043m976n14j047K07k890n645m669o75j296R269K869L771
16051C363J442n308j073M267P545M053l102j0075k764l557O653N581L217m150
16037F092j395K001J638l856p763l212j650k13O37k242M529R583l783r609l119
16022a2362k113n148O35P980L783j620J183K675l071k694K540o37L432J214m67
16007d670L66k50K170l134n034R16k942K024Q730O13Q193L86j0685n879Q18L493
15991d885P82L453N098K658k098q094p252J963Q539j70j742k304p953r0m90O41
15975a1944L843K294L717l930o19J251M80l042J603O779L234l057n961k733J977
$$ plain form
16082 8932 8119 3086 -2663 -1797 1296 2950 2657 -3225 -6427 -3932 -9283 -84 438 -4973 -6241 -1357
16066 -1357 8665 12002 8959 3983 3469 2422 2629 -261 -5906 -10575 -11250 -12546 -3277 -408 3363
16051 3363 4805 -503 -1576 2691 10236 14289 11187 1112 -1652 -5209 1444 7025 10242 6092
16037 6092 4697 6698 8336 4480 -3283 -6495 -8145 -8358 -7721 -9963 -5434 4149 366 -9243 -12362
16022 -12362 -14475 -19623 -18988 -11008 -7225 -8845 -7662 -4987 -8058 -10752 -8212 -8849 -5417 -4203 -4670
16007 -4670 -4304 -4554 -2384 -5518 -10552 -9636 -12578 -10554 -1824 -1211 6982 7368 -3317 -9196 -8378 -4885
15991 -4885 -4103 -650 4448 7106 5008 -3086 -10338 -8375 164 -6 -1748 -4052 -12005 -12095 -12585 -11944
15975 -11944 -8101 -5807 -2090 -6020 -6639 -5388 -4908 -7950 -6347 432 3666 609 -5352 -8085 -6108
15960f108N04J27m151l64J684l856K229P757j943o590n553L811P932N766J089
15945B334j662n547K36N856n667o281L45R485N835l55j375j851J856Q299l727
15930G781k294l876k967j351L450m499J11Q609O223q870n958j0759j696R266M681
15915b149L077L991j374k804m69m434n608M286k61k369K62K843O718J0544k90
15900A1963m239j673m812k901j823J113Q2J695l042o573K894J0345n273n045P27
15885f562r89k968K301P577L569q92j077L5n104o109L847M019K577J138r095L57
15869g376j130L858l394m642n54K251J229k287M381J611m329K008L043l395n802
15854a4528J298N087l552L594P660k881m76J669L426k303L710Q2K311M373l309
$$ plain form
15960 -6108 -5604 -5477 -9628 -9992 -8308 -12164 -9935 -2178 -4121 -10711 -16264 -12453 -4521 1245 2334
15945 2334 672 -4875 -4639 1217 -4450 -10731 -10386 -901 4934 4579 3204 1353 3209 11508 7781
15930 7781 5487 1611 -1356 -2707 743 -3756 -3645 4964 11187 2317 -3641 -14400 -16096 -6830 -2149
15915 -2149 928 4919 3545 741 272 -4162 -9770 -5484 -5745 -8114 -7852 -5009 1709 12253 11963
15900 11963 7724 6051 1239 -1662 -3485 -2372 -2290 -595 -3637 -10210 -7316 3029 -2244 -7289 -6562
15885 -6562 -7551 -10519 -8218 -641 2928 2036 959 994 -4110 -10219 -6372 -2353 224 1362 -7733 -7376
15869 -7376 -8506 -4648 -8042 -12684 -13238 -10987 -9758 -12045 -7664 -6053 -10382 -8374 -5331 -8726 -14528
15854 -14528 -13230 -8143 -11695 -8101 -441 -3322 -3798 -2129 1297 -1006 2704 2786 5097 9470 6161
15839F161k398p474l954L027L216L05o697j356k489q34J811N163o83J880m295
15824h617o713o096R95l554Q316M249K43K362l649K950M448M604j423k530r25
15809e340P16O789l960J868J416l2q901k306k161N578J490m516m486R41M022J387
15793g495L029k892l928L891L959J574o82N03j236l21L143q87K818k607p452j954
15777a0537L783P241O032q984Q7K008m834O761N031O90k267m345k576j22n682
15762g714k160M861K94l162J219K871O406K142o286p766j476J447J37P158J793
15747b36q031J301q524m825M221L887L871M438K658K240J174l459k746K703Q359
15732G031m562p55K32J889j553j475l617O381L991m811j3583l851m763P264M848
$$ plain form
15839 6161 3763 -3711 -7665 -4638 -1422 -1117 -7814 -9170 -11659 -12493 -10682 -5519 -6202 -4322 -8617
15824 -8617 -15330 -21426 -20431 -23985 -15669 -11420 -11177 -8815 -12464 -9514 -5066 -462 -1885 -4415 -5340
15809 -5340 -4624 2165 -1795 73 1489 1457 -7444 -9750 -11911 -6333 -4843 -9359 -13845 -12904 -8882 -7495
15793 -7495 -4466 -7358 -11286 -7395 -3436 -1862 -2544 -2041 -3277 -3598 -455 -1342 1476 -1131 -8583 -10537
15777 -10537 -6754 487 6519 -2465 -2378 -370 -5204 1557 6588 7278 5011 666 -1910 -2032 -7714
15762 -7714 -9874 -5013 -4719 -7881 -6662 -3791 2615 4757 -1529 -9295 -10771 -9324 -9187 -2029 -236
15747 -236 -8267 -6966 -15490 -20315 -16094 -12207 -8336 -3898 -1240 1000 2174 -1285 -4031 -1328 7031
15732 7031 2469 1714 1946 3835 2282 807 -2810 3571 7562 2751 -10832 -14683 -19446 -12182 -7334
15717g334Q818k888j3322j463N143N18Q220M16r145K687k284P255Q630m662o202
15702e613j55J94k229n31N35J159J450R82m020K318P88O39j956J82K87j790J473
15685f287K724L992L82n194n063P30J712P458M851n22j546k792n242m571j356
15670a0724j946R19n58J391Q70k483m815j378M390R148K170r71Q303L412j591
15655F137l636q242p982m641L406j783K076M727Q248O072j190L658o383j0887
15641a0420n36L341R68l685Q28M942J0017J788p919o304K294L238M374o03N791
15626H114l190J73l5m099K105l925o940n848j192j206O703O098P32m237J367N14
15610d866P45l49k125o771K466l938m973M052L863L98M699l993r21N450l308m488
$$ plain form
15717 -7334 1484 -1404 -14726 -16189 -11046 -10528 -2308 -1892 -11037 -8350 -10634 -3379 5251 589 -5613
15702 -5613 -5768 -5574 -7803 -8334 -7799 -6640 -5190 -4208 -8228 -5910 -5122 -4483 -6439 -6257 -5970 -7760 -6287
15685 -6287 -3563 429 811 -4383 -9446 -8716 -7004 454 5305 4783 3237 445 -4797 -9368 -10724
15670 -10724 -12670 -11751 -12309 -10918 -10048 -12531 -17346 -18724 -14334 -5186 -3016 -3987 4316 7728 6137
15655 6137 2501 -5741 -13723 -18364 -14958 -16741 -14665 -9938 -1690 4382 3192 6850 467 -10420
15641 -10420 -10956 -7615 -6647 -10332 -9504 -4562 5455 7243 -676 -6980 -4686 -1448 2926 2323 8114
15626 8114 4924 5097 5062 963 3068 -857 -7797 -13645 -14837 -16043 -9340 -3242 -2510 -6747 -5380 -4866
15610 -4866 -4121 -4470 -6595 -13366 -10900 -14838 -19811 -15759 -11896 -11498 -6799 -10792 -11713 -6263 -9571 -14059
15594a4059J911o48l14k513j551J506Q765j856J08J026K546p82k874r22O179J07
15578c371q57l497K262j195j650j241M51L956j113q242K597N875R48K427P154
15563D504L552q068m528P18K428Q964q073k049L668k351k553j64o4R413Q535q405
15547E527o900K511M308j440L091L439Q63q811o263j063j329m175Q2K706O785
15532f69m167M947L733L032M63o079o48O085L963o33j668K755n867l629j411n003
15516d796l114p345K696Q887N678K34L384m399j459m106K743P54K31m711N092
15501b31O279p42n681n574J222j479K902J979j290l77K559K481m159k491K059
15486b543k090M673k285j27p57l101M399l35N769L493k942q902n804o53k805k420
$$ plain form
15594 -14059 -12148 -12796 -13110 -15623 -17174 -15668 -6903 -8759 -8651 -7625 -5079 -5861 -8735 -9657 -3478 -3371
15578 -3371 -4228 -7725 -5463 -6658 -8308 -9549 -9098 -5142 -6255 -14497 -11900 -6025 -5077 -2650 4504
15563 4504 8056 -12 -4540 -3822 -1394 7570 -503 -2552 1116 -1235 -3788 -3952 -4016 5397 13932 5527
15547 5527 -1373 1138 5446 4006 7097 10536 11399 2588 -3675 -4738 -6067 -10242 -10160 -7454 -669
15532 -669 -4836 111 3844 6876 7339 1260 612 6697 10660 10027 8359 11114 5247 1618 207 -4796
15516 -4796 -7910 -15255 -12559 -3672 2006 2240 5624 1225 -234 -4340 -1597 -843 -612 -5323 -231
15501 -231 6048 5306 -375 -5949 -4727 -6206 -3304 -1325 -2615 -2992 -433 2048 -2111 -4602 -2543
15486 -2543 -4633 40 -2245 -2372 -3129 -6230 -1831 -2166 3603 7096 4154 -4748 -10552 -11205 -14010 -16430
15470a6430L993N265K380L380L633l939l152k017M051L838o41N9l217O12M702
15455B517J134k59j3773K012K29m393R3M897K188M983K551J280k682m469J735
15440a957N578l462l580l429n96J099L579q72J8R06J953P910K063k742j196n674
15424d02M76n592k821K789J891o508K100Q780l272k737N365M771J087L60K790
15409I077N563n215l480J0393K872k268p684p601j1876l928J947M744K482LM377
15394e94J525l492J010P57j504p48k628n717L378O308n733o48J50O344O158J364
15378E930p750k110k970K404M018j905n866o438L382R342k843q929O990J0224
15364C479O36m910k191L375k359m324L575R179J747j305k17P30L257n268l45n197
$$ plain form
15470 -16430 -12437 -7172 -4792 -1412 2221 -1718 -4870 -6887 -2836 1002 361 420 -2797 -2185 2517
15455 2517 3651 3392 -10381 -8369 -8140 -12533 -12440 -7543 -5355 -372 2179 3459 777 -3692 -1957
15440 -1957 3621 159 -3421 -6850 -7446 -6347 -2768 -3640 -3622 -2716 -763 7147 9210 6468 5272 -402
15424 -402 74 -5518 -8339 -5550 -3659 -10167 -8067 713 -2559 -5296 69 4840 5927 6287 9077
15409 9077 14640 9425 5945 16338 19210 16942 9258 1657 -10219 -14147 -12200 -7456 -4974 -4971 -594
15394 -594 931 -2561 -1551 -794 -2298 -3046 -5674 -11391 -8013 -1705 -7438 -8086 -7936 -1592 4566 5930
15378 5930 -1820 -3930 -6900 -4496 -478 -2383 -8249 -14687 -11305 -1963 -4806 -13735 -6745 3479
15364 3479 4115 -795 -2986 389 -1970 -6294 -2719 6460 8207 6902 6685 7415 10672 5404 5059 -138
15348a38q646j543L488J2630J904j791j3799M819N888k920L222p97n918J061R464
15333F924j596m090l5N291J2631N362q310p180o341K972J414j239J061J845J038
15318I747m418m728N91M606N104N055k617l547k461k403j390l300m834k323O10
15303f308K601M631l269l283p20k726j883O354R485J452j147R46k043K794J464
15288H348n474j154J139J283K074N584J333l002L652n14l243k644L932J037K674
15273A5025p482L413O867m991q175m81J375K988Q9K124m044l958l089L005j562
15258A104K084l028p049L739J0054O93L344m130p076N38m264m38o027R26P642
15243a888J4721Q409p055k535l189K915M014o082q055J455L555K643k970k116
$$ plain form
15348 -138 -8784 -10327 -6839 5791 7695 5904 -7895 -3076 2812 -108 3114 2317 -3601 -2540 6924
15333 6924 5328 1238 1203 6494 19125 24487 16177 8997 2656 5628 7042 5803 6864 8709 9747
15318 9747 5329 601 1192 5798 10902 15957 13340 9793 7332 4929 3539 239 -4595 -6918 -6308
15303 -6308 -3707 924 -2345 -5628 -6348 -9074 -10957 -4603 4882 6334 5187 6133 4090 6884 8348
15288 8348 2874 1720 2859 4142 6216 11800 13133 10131 13783 13269 10026 7382 11314 12351 15025
15273 15025 7543 10956 17823 12832 4657 4176 5551 8539 8628 10752 6708 2750 -339 2666 1104
15258 1104 3188 160 -6889 -3150 6904 7597 10941 6811 -265 273 -3991 -4429 -10456 -9530 -1888
15243 -1888 12833 21242 14187 11652 8463 11378 15392 9310 1255 2710 6265 8908 5938 3822
15229C822m082m793q86L899O659K853q041o330K355N919l430M008J0557K230m988
15214I752m447K416l695R59o46L468j88m582K730l075J946J411L429N45j045p311
15198A667l982J991k684M621n327n3k22j552N300K454l849k300n463K460O530
15183d09j099n873N225O011j84k168O767q91K676l702m394k504M973n607m644
15168e823K712M335j843j839J653Q06M7M9p715j886L675M178p85O32K299k011
15152a516L97M163O062J660M001Q56k789m524m374n242K592N856K485m943p103
15137b419k116L767Q877N831j823n528m920o093J1029M022J595l094K406J153
15123A2687p81L564n809K551m296l984M966J890o58j868k725j631k608q85J178
$$ plain form
15229 3822 -260 -5053 -5939 -2040 4619 7472 -569 -6899 -4544 1375 -2055 1953 12510 14740 9752
15214 9752 5305 7721 4026 4985 4339 7807 7619 3037 5767 2692 4638 6049 9478 10023 8978 1667
15198 1667 -2315 -324 -3008 1613 -3714 -3767 -3989 -5541 -241 2213 -1636 -3936 -9399 -6939 -409
15183 -409 -1508 -7381 -2156 3855 3671 1503 8270 7379 10055 6353 1959 -545 4428 -1179 -5823
15168 -5823 -3111 1224 -619 -2458 -805 1 48 97 -7618 -9504 -5829 -1651 -2436 -1804 495 -1516
15152 -1516 -1119 3044 9106 10766 14767 15623 12834 8310 3936 -1306 1286 7142 9627 4684 -2419
15137 -2419 -4535 -768 8109 13940 12117 6589 1669 -4424 6605 10627 12222 9128 11534 12687
15123 12687 11906 15470 9661 12212 7916 3932 8898 10788 10130 8262 5537 3906 1298 413 1591
15108A591K294L973L325r9n552l989L066m994l557J321M411n69j602k308L17K893
15092E21L456M301M95r01O837l999k595J516k145m364m92k183L247K325j214O210
15076A1015N625k03j144J401M146L246j631p937o957k181l023j0194o999N900
15062h936K769K705l211L536J423R59j161M197N308n487m617L507j631k460pm212
15046g318n052j520P814J0099K887j09J234n909K440N747K052n100n744j416K667
15031B772O215k087j710J399O606M699r176j046j0420o834M572P043J688j638
15017B083L564K016m705J714n65o10o584m834l196o5J614r83J515o82O632l9J241
15000a884L527K362m266K800j335L425M889k058n43J362n154L930k61K723m02
$$ plain form
15108 1591 3885 7858 11183 11084 5532 1543 4609 -385 -3942 -2621 1790 1221 -381 -2689 -2372 521
15092 521 3977 8278 8773 7872 14709 10710 8115 9631 7486 3122 2630 447 3694 6019 4805 11015
15076 11015 16640 16437 15293 16694 20840 24086 22455 14518 7561 5380 2357 -7837 -14836 -8936
15062 -8936 -6167 -3462 -6673 -3137 -1714 -755 -1916 2281 7589 2102 -2515 992 -639 -3099 -3106 -7318
15046 -7318 -12370 -13890 -6076 4023 6910 6801 8035 2126 4566 10313 12365 7265 1521 105 2772
15031 2772 8987 6900 5190 6589 13195 17894 8718 7672 -2748 -9582 -5010 2033 3721 2083
15017 2083 5647 7663 2958 4672 4107 3497 -3087 -7921 -11117 -11182 -9568 -10551 -9036 -9718 -3086 -3125 -1884
15000 -1884 1643 4005 -261 2539 1204 4629 9518 7460 6917 8279 3125 7055 6794 9517 9115
14985I115K174j823l573j330K186n62n37O13Q20J798p66L666m399m541l602l706
14969d467P651R76k561O46k23O283N01k163k42K377n140o238J429j410n91l068
14953f240Q64Q664R400N490o482r342p336L138J78r8k978L744Q510m74j958q054
14937b974r73Q639R456l043k114M403k996k709n14M478N47n736P062L222o609
14922A0139o025o248q259L75P688N381K590J188Q340J0489O827M520j898J914
14908C7021n799o186p066q434n472L879j189m964J653j568L612M142o170p234
14894c775N947R433L030o852P45R784l541o495K925P444J465Q68O6O87L964J967
14878B7662J0059J0134N610j76j046n659k66o413l002o53J734K371k503L290k31
$$ plain form
14985 9115 11289 9466 5893 4563 6749 6187 5650 6263 7083 8881 8115 11781 7382 2841 -761 -4467
14969 -4467 3184 4160 1599 2245 2022 8305 8806 6643 6401 8778 3638 -2600 -1171 -2581 -3172 -6240
14953 -6240 -5376 3288 12688 18178 11696 2354 -4982 -1844 -1666 -1764 -4742 -998 7512 7038 5080 -2974
14937 -2974 -3947 4692 14148 11105 8991 13394 10398 7689 7175 11653 12200 6464 13526 16748 10139
14922 10139 4114 -2134 -10393 -10018 -2330 3051 5641 6829 15169 25658 32485 37005 35107 37021
14908 37021 31222 25036 17970 9536 4064 7943 6754 1790 3443 1875 5487 9629 3459 -3775
14894 -3775 2172 11605 14635 7783 8528 18312 14771 8276 11201 18645 20110 20978 21044 21731 25695 27662
14878 27662 37721 47855 53465 53289 52243 46584 46318 39905 36903 36250 37984 40355 37852 41142 40911
14863D0911l647K342L937L761k294o534R49L126N488n387q390O89r29k119j912
14848B9991q80Q70M288J609J449l110q512n227M081O27j732J904K559m508q440
14833A4969L080O97n819m618K302K673O083k742l175P437K771j127k780J0678
14819C0429M349m658m72K52j207k637n122O884K063M67k563q647j6345j1902n85
14804i694j0066L640N096N654K83K399L767R446J105J522N907q44k267l003K884
14789A5829M875K328n73M522O723R208M430p719j867L68n205l512M017j191m149
14774B8084J202j017l425p065o70R64k301j900M986K218J539k655M128P132m14
14759C0806K014L292m302j741k824M415M112L23J810o005r218k645j255j607O633
$$ plain form
14863 40911 37264 39606 43543 47304 45010 38476 39425 42551 48039 42652 34262 34951 34022 31903 29991
14848 29991 29111 29981 34269 35878 37327 34217 25705 20478 24559 25186 23454 25358 27917 23409 14969
14833 14969 18049 18746 12927 8309 10611 13284 19367 16625 13450 20887 23658 22531 19751 30429
14819 30429 34778 30120 29648 29900 28693 26056 20934 27818 29881 30348 27785 19138 2793 -9109 -9694
14804 -9694 -19760 -16120 -11024 -5370 -5087 -2688 1079 10525 11630 13152 19059 18215 15948 12945 15829
14789 15829 20704 23032 22459 26981 33704 42912 47342 39623 37756 38124 32919 29407 33424 32233 28084
14774 28084 29286 28269 24844 17779 17109 18073 15772 13872 18858 21076 22615 19960 24088 31220 30806
14759 30806 32820 36112 31810 30069 27245 31660 35772 36095 37905 31900 22682 20037 18782 17175 23808
14744B3808J5013J3284J2689J8413L0127K5609K3949J6163n50n460j0935j9684
14732A42426k2939k2515n188o329r032J279k271N479J793l558M717L696m41J0572
14718I7689L233m76m620p130L722N91J351j970O91N545o531p028n961q51Q560
14703H6815N616R668L988M546L433K61p06L092P14Q65J266J781L808P759k500
14688A30406l612k146Q245N784j063n457l440O846O414N100L425Q294k594j523
14674A54679k326O265J1550Q38J416Q063J1626J2279P254L511J3892J4248K5042
14661B68337J6253J7642J1027J4938M585J1215K4295L5728K7012K4884K6080K7250
14649E09246L4680L7213K9581K3659K7374J6036J4549L6486N9446N8805O5606
$$ plain form
14744 23808 38821 52105 64794 83207 113334 138943 162892 179055 178505 173045 162110 142426
14732 142426 119487 96972 91784 85455 76423 77702 75431 80910 82703 79145 83862 87558 87117 97689
14718 97689 100922 100446 95826 88696 92418 93009 94360 92390 93081 98626 92095 85067 79106 78255 86815
14703 86815 92431 102099 106087 110633 114066 114327 113621 116713 117427 118292 119558 121339 125147 132906 130406
14688 130406 126794 124648 132893 138677 137614 132157 128717 135563 141977 147077 150502 158796 156202 154679
14674 154679 152353 158618 170168 171006 172422 180485 192111 204390 211644 215155 229047 243295 268337
14661 268337 284590 302232 313259 328197 332782 343997 368292 404020 431032 455916 481996 509246
14649 509246 543926 581139 610720 634379 661753 677789 692338 728824 788270 847075 912681
14638I12681P9078Q2316R1252Q8904R3384J02680J22402J48311J83102K13693
14628B117803K41045K66444L04535L40450L99438M81451N87000P42997R70099
14619F451262J261106J647274K212172L079185M390643O459225R793904J5031951
14611E0326722K2675532L1009052K7979335M077671j7225116k8016110k6994138
14604F3832948j9210715j2556780q293551n621114l899962k778686k031375j528176
14596G912589j189532r66279p92244o58175n41290m52005l80006l13476k54157
14587B365425k09929j85309j79215j66268j47232j27019j12302q1587o6065o2879
14577A027620n9695o3248n8037n9248n0169n8847n8009m1426l2651l1331j7508
$$ plain form
14638 912681 991759 1074075 1165327 1254231 1347615 1450295 1572697 1721008 1904110 2117803
14628 2117803 2358848 2625292 2929827 3270277 3669715 4151166 4738166 5481163 6451262
14619 6451262 7712368 9359642 11571814 14650999 19041642 25500867 35294771 50326722
14611 50326722 73002254 104011306 131990641 136068312 118843196 90827086 63832948
14604 63832948 44622233 32065453 23771902 18150788 14250826 11472140 9440765 7912589
14596 7912589 6723057 5756778 4964534 4306359 3765069 3313064 2933058 2619582 2365425
14587 2365425 2155496 1970187 1790972 1624704 1477472 1350453 1238151 1156564 1090499 1027620
14577 1027620 967925 904677 846640 787392 737223 678376 620367 578941 546290 514959 497451
14566D97451r260j6692j9761p663p327j1624j3161j7347j6734j0861o768j1652
14554C48601o825n186q288j2650j0747r336l680q137m510o971q698j3616j0149
14541B39808j1417o944j2840o205m757M935p25q681p376q604m89j1727q913j2052
14527A44013r020m653L375m329q366p129n263m750l887Q769J433q072N705N577
14513A13403m819j1264k772m207m373k391j624P98j075k189n108k047k731p833
14499F1768p79P76j232P629J3124N292M1o026k117P825N761n46j567m807o572
14484G8570p379k4287k6947j5433K138J8795K1130K9441K9887J4508J557o574
14472A15406o502n525j743o904j3499l714K26o866L936r30j809j842k777p083
$$ plain form
14566 497451 488191 471499 451738 444075 436748 425124 411963 394616 377882 367021 360253 348601
14554 348601 341776 336590 328302 315652 304905 295569 291889 283752 279242 272271 263573 249957 239808
14541 239808 228391 221447 208607 202402 197645 202580 201855 193174 185798 177194 176705 164978 156065 144013
14527 144013 134993 130340 133715 129386 121020 113891 108628 103878 99991 108760 110193 102121 107826 113403
14513 113403 108584 97320 94548 90341 85968 83577 81953 82751 81676 79487 74379 72332 69601 61768
14499 61768 60989 61765 60533 68162 81286 86578 86619 80593 78476 86301 92062 91516 89949 85142 78570
14484 78570 71191 46904 19957 4524 6662 25457 46587 76028 105915 120423 121980 115406
14472 115406 108904 103379 101636 94732 81233 77519 77745 70879 74815 73885 72076 70234 67457 60374
14458F0374l253n726O65R530J902j114l297K642l057J281O887m750o416k494J403
14443E4577m642j1092k335l89o37J011l962n909n786J638L410P484L401P890O891
14428E1550M33m627m252K55K154O64P251K224M302P818N136o42O980o86n149l475
14412F9936l787q902l050m139j0475r063n16J774j338M35n153K384K327o779p576
14397A6078R357P489k725j1080N046M274l486j2786j981Q364M869o006l052P781
14383B2142N47k299M729K553K099p22Q65n877R95m027q250m857R080L649N603
14368B6230o659j1420m991l310l325J215L880K457j397M288N257j176m187J566
14354H428M825k736L193M441K266J42k931m908J3322K957j157m315q75L140K082
$$ plain form
14458 60374 57121 51395 52060 61590 63492 62378 59081 61723 58666 59947 66834 62084 55668 53174 54577
14443 54577 49935 38843 36508 36119 35482 36493 32531 26622 20836 22474 25884 33368 36769 44659 51550
14428 51550 51983 47356 43104 43359 45513 46177 53428 55652 59954 67772 72908 72266 79246 78560 73411 69936
14412 69936 66149 57247 54197 50058 39583 30520 30004 31778 30440 30875 25722 28106 30433 23654 16078
14397 16078 25435 32924 30199 19119 24165 28439 24953 12167 10186 18550 23419 17413 14361 22142
14383 22142 22689 20390 25119 27672 29771 29049 29914 24037 25032 21005 12755 7898 16978 20627 26230
14368 26230 19571 8151 3160 -150 -3475 -2260 1620 4077 2680 6968 12225 11049 6862 8428
14354 8428 13253 10517 13710 18151 20417 20559 17628 12720 26042 28999 27842 23527 22652 25792 27874
14339B7874P27m085q729p393m415L63L991J11j30N141K523l328K52K955n410q303
14323B144J330M262p58j719L733J691N110J1793J987p543n910k578j694n521m178
14308B149p361n233P55M040M662K606m548L903O411N781O319J262k476o848m754
14293F668N136n854p517o987L294M486O673L178j921L096N04k02M293j133m76
14278A3238l389q949K227R000p65n666k140J181L178L233j995L910O261j206L458
14263B1576o85o218n471l586k618M925L806q160k122K769j441r09j31J753M663
14248H151L629j3M09N096K031n254p746j378L210P851J247o730l037j090l342
14233C034k681o103o69N767P065M389p401K513l190Q76p25j250R98r05K464J186
$$ plain form
14339 27874 28601 24516 15787 8394 3979 4342 8333 8444 8314 13455 15978 12650 12902 15857 10447 2144
14323 2144 3474 7736 6978 5259 8992 10683 15793 27586 29573 22030 16120 13542 11848 6327 2149
14308 2149 -5212 -10445 -9690 -5650 -988 1618 -2930 973 7384 13165 19484 20746 18270 11422 6668
14293 6668 11804 5950 -1567 -8554 -5260 -774 5899 9077 7156 10252 10756 10554 14847 13714 13238
14278 13238 9849 900 3127 12127 11362 5696 3556 4737 7915 11148 9153 13063 19324 18118 21576
14263 21576 20891 14673 9202 5616 2998 7923 11729 3569 1447 4216 2775 1866 1735 3488 8151
14248 8151 11780 11767 12176 17272 19303 14049 6303 4925 8135 15986 17233 10503 7466 6376 3034
14233 3034 353 -5750 -6419 -652 6413 10802 3401 5914 2724 3600 2875 1625 2623 1718 4182 5368
14217E368j169r75L063N470J38j480J671N615q76p71n382l404J902K628k357N80
14201A0021M057j729o751J531K162L777J930l752k255l944r95n86j30J536K400
14186G272L101J980n606q35J301P76k33p27k517K985L519L387N626Q287O782K4
14170C5122n83L10q371M031J0923K105j080q946o916k023L997L709m74k735N121
14155C4190p725n060l602o347q06k021n446o911m087j493P412K595L152n48p40
14140B563M003K51l515l517L613L840k536q60o487p32K9k506L578M233m552n920
14124h515J927j531L400K331p264k688Q34N037M624L212l915q051M82k18l639
14109a3974r23L586P957k341J501l099k756Q557N586K648j305n286m453N718N951
$$ plain form
14217 5368 4199 3224 6287 11757 11895 10415 12086 17701 16825 16054 10672 7268 9170 11798 9441 10021
14201 10021 14078 12349 5598 7129 9291 13068 14998 11246 8991 5047 4052 3466 3336 4872 7272
14186 7272 10373 12353 6747 5912 7213 7989 7756 7029 4512 7497 11016 14403 20029 28316 35098 35122
14170 35122 34539 34849 26478 30509 41432 43537 42457 33511 26595 24572 28569 32278 31804 29069 34190
14155 34190 26465 21405 17803 11456 10650 8629 3183 -3728 -7815 -9308 -1896 699 3851 3303 2563
14140 2563 6566 6817 3302 -215 3398 7238 4702 3842 -2645 -3377 -3348 -5854 -2276 1957 -2595 -8515
14124 -8515 -6588 -8119 -4719 -2388 -9652 -12340 -11506 -6469 -1845 1367 -2548 -10599 -10117 -10335 -13974
14109 -13974 -14897 -11311 -3354 -5695 -4194 -7293 -10049 -1492 4094 6742 5437 151 -4302 1416 7367
14094G367j564Q35k594k275P823l806j1381L00P416m096n11N445m88k017m053
14079c599Q56K796j560o580r95K609K503j447L61P259J937j881m12k528L694M43
14063C456k028M0k791k055L529j333k200k4J979k278M623P143J305k10p12m458
14047C986K685K932O676J632l162m324K938N850k890k596l137M812m31q28n747
14032H396l412K130k729r524P0M437P853K813r23k843k274L18L24l637K89k369
14016a081N926O679M6m673J670j485q198l301R28l28K179M265K268K091P98J57
14000G941J048l714J193L347J883o001q08m552j673N443L557l289j881J349m02
13985C441k29N988p72j52j829j904J493k820o952j95o822N677J0935P291j422
$$ plain form
14094 7367 5803 6638 4044 1769 9592 5786 -5595 -5295 2121 -1975 -2486 2959 2471 454 -3599
14079 -3599 -2743 53 -1507 -8087 -9082 -6473 -3970 -5417 -5056 2203 4140 2259 1847 -681 3013 3456
14063 3456 1428 1468 -1323 -3378 151 -1182 -3382 -3406 -1427 -3705 918 8061 9366 9156 8444 3986
14047 3986 6671 9603 16279 17911 14749 10425 13363 19213 16323 13727 10590 15402 14971 14143 8396
14032 8396 4984 7114 4385 -5139 -5069 -632 7221 10034 9111 6268 3994 4312 4636 999 1288 -1081
14016 -1081 4845 11524 11570 6897 8567 7082 -1116 -4417 -3489 -3817 -1638 2627 4895 6986 7784 7941
14000 7941 8989 5275 6468 9815 11698 5697 4889 337 -1336 4107 7664 4375 2494 3843 3441
13985 3441 3212 9200 8428 8276 6447 4543 6036 3216 -3736 -3931 -10753 -5076 5859 13150 11728
13970A1728J234J676n394k202r09k641o313p910R103O709l758q001K054N950M034
13955E360J562l611l196K012J167J375l825J096O210J280k930l156j0532M534
13941b654N189K991j793r603J619O181P70J114l924q222l105j374J1802P551j838
13926D704l751j068k270K072l061q09K457K486J019m019P108N416m811m090N35
13911A918K401p575l540L57j735M492N360n429M627L23k098M344K427J359l176
13896D055k402M661k87J386j519j0555l105K392m401k537K199Q902J1418Q028
13882A8235l790r183m988m394K359N966J23M636N00o036J461J402k606k878O613
13867G420n984p763N79J2271L115o201N004K144l626J580R218p069m558r462n20
$$ plain form
13970 11728 12962 14638 9244 7042 6133 3492 -2821 -10731 -1628 5081 1323 -6678 -4624 1326 5360
13955 5360 6922 3311 115 2127 3294 4669 844 1940 8150 9430 6500 3344 -7188 -2654
13941 -2654 2535 5526 3733 -5870 -4251 1930 2700 3814 -110 -8332 -11437 -12811 -1009 6542 4704
13926 4704 953 -115 -2385 -313 -3374 -4183 -1726 760 1779 -2240 4868 10284 5473 1383 1918
13911 1918 4319 -3256 -6796 -6439 -8174 -3682 1678 -3751 876 1199 -899 3445 5872 7231 4055
13896 4055 1653 6314 6027 7413 5894 -4661 -7766 -5374 -9775 -12312 -10113 -1211 10207 18235
13882 18235 14445 5262 274 -4120 -1761 4205 4328 8964 9464 3428 4889 6291 3685 807 7420
13867 7420 1436 -6327 -5748 6523 9638 3437 8441 10585 6959 8539 17757 10688 6130 -3332 -3852
13852c852N554l501Q0N600N75k488m698J244L792J967K373l034q46j013j535M079
13836D297Q00Q545l128o531m311L416N826L466l319m636l810P43j509j732r43
13821b826j421nQ306R518j839j838r36k053m650m357l504J491J748k17P19L937
13805B073M478p31k653p144m180J753Q307K750j25j0699m387R419M303k032K350
13790C482J412j942j585N826j99j1721M390k273L834k396n893Q040R722l554m841
13775B302p514l520j905R498P458k24q436k451O189J097l1L218P86j209k075j247
13759A936N597n42k77m244m944J505n302R5o34O040K830l755o35k795p94N868
13743e1L780R830J631n966m613m354q242M5l64k654J545P632N925R238J483r057
$$ plain form
13852 -3852 1702 -1799 -1719 3881 4456 1968 -2730 -1486 2306 4273 6646 3612 2766 1753 218 4297
13836 4297 5097 13642 10514 3983 -328 3088 8914 12380 9061 4425 615 1358 -151 -1883 -2826
13821 -2826 -4247 -4252 4054 13572 11733 9895 8959 6906 2256 -2101 -5605 -4114 -2366 -2583 -1864 2073
13805 2073 6551 5820 3167 -3977 -8157 -6404 1903 4653 4528 -6171 -10558 -1139 3164 1132 3482
13790 3482 4894 2952 1367 7193 6994 -4727 -337 -2610 1224 -1172 -7065 975 10697 7143 2302
13775 2302 -5212 -8732 -10637 -1139 6319 6095 -2341 -4792 1397 2494 2463 5681 6467 5258 3183 1936
13759 1936 7533 6991 6714 2470 -2474 -969 -6271 -6176 -6810 -770 2060 -1695 -2330 -5125 -5919 -51
13743 -51 3729 13559 15190 9224 4611 257 -7985 -7940 -8304 -10958 -9413 -1781 4144 13382 14865 5808
13727E808o855O23k32n663P09L898J377K471l08k600L162L442J923M534O407o250
13711A2446n901L288Q34l826o417m521m134r3R049N644j000o343J063j459l878
13696e248R94m92j797q83K357L450k018K773l45M305l047j711j32p620j767j454
13680a2635J630O237O300J475P19K173o833m495N042K605O063O811k540k58o070
13665F224K452L235n359n545k10j605j098M47M907L635j011L230L70l530l537
13650B605j614K006p22o52l560L687M483O027j12l359J105P00n565P540J832k002
13634A2399k418r20j58J837o450R7k115l204L069L049M271n510j699J403N848
13619I499M85P032j216q185o476m030J709M402p152M117Q791n953p552m116O656
$$ plain form
13727 5808 -1047 -424 -656 -6319 -5610 -1712 -335 2136 1828 -772 2390 5832 7755 12289 18696 12446
13711 12446 6545 9833 10667 6841 424 -4097 -8231 -8324 725 6369 5369 -974 89 -1370 -5248
13696 -5248 -4254 -4746 -6543 -7426 -5069 -1619 -3637 -864 -1209 3096 49 -1662 -1794 -9414 -11181 -12635
13680 -12635 -11005 -4768 1532 3007 3726 5899 -934 -5429 -387 2218 8281 15092 12552 12294 6224
13665 6224 8676 11911 6552 1007 797 -808 -1906 -1459 3448 7083 6072 9302 9672 6142 2605
13650 2605 991 2997 2275 1623 -1937 1750 6233 12260 12148 8789 9894 10594 5029 12569 14401 12399
13634 12399 9981 9061 8903 10740 4290 4387 2272 -932 2137 5186 9457 3947 2248 3651 9499
13619 9499 9984 17016 15800 7615 1139 -2891 -1182 3220 -3932 185 8976 3023 -4529 -8645 -1989
13604a989N053o544j480M644L549M137l076m253m502j89Q87O391J0591J370q887
13589E702r59L801l189n634j102K137K496j840J86j121K708j320m790k303O72
13574d556L165M959J468Q408l889j2807L049K191m397Q80M682L865L668K98j353
13559I631l786j2311l034M697r45q33N104P718j0473o019N33Q86K338L161l56
13544c689Q004M469o375j568K155R78k723m07L374k392O472N819k592j834k425
13529G266o44m272q58K937k06l494J377R863l83j201m710n578m703M111L257J141
13513C903j955Q293N201o253p343r61on143n936J778N577J0035K769K49j338J078
13497I948k150k732J980J408P8p575n001N48L000N09q386m958M720Q516L548k16
$$ plain form
13604 -1989 3064 -3480 -4960 -316 3233 7370 4294 41 -4461 -4650 -3763 2628 13219 14589 5702
13589 5702 4743 8544 5355 -279 -1381 756 3252 1412 1598 477 3185 1865 -2925 -5228 -4556
13574 -4556 -1391 3568 5036 13444 9555 -3252 -203 1988 -2409 -1529 3153 7018 10686 10984 9631
13559 9631 5845 -6466 -9500 -4803 -5748 -6581 -1477 6241 -4232 -10251 -9718 -8832 -6494 -3333 -3689
13544 -3689 4315 8784 2409 841 2996 3974 1251 844 4218 1826 8298 14117 11525 9691 7266
13529 7266 6622 2350 1492 4429 4223 729 2106 11969 11586 10385 5675 97 -4606 -495 2762 3903
13513 3903 1948 10241 15442 9189 1846 885 879 -4264 -10200 -8422 -2845 7190 9959 10208 8870 9948
13497 9948 7798 5066 7046 8454 8532 957 -4044 -3496 -496 13 -8373 -13331 -8611 -95 3453 3237
13481C237o355j3o83l411O15J540M363l763k883L097M177P52K606J826L884j762
13465G227l506n065J572L903L667N2K939J104j170K501L606p59k916l958p690
13450A507J004J403r72j663j019N93J0288j972O083m314j937k080n477J762n664
13435b458L36J912L140o25q002k182M970P796O81p389l235M209M013O685J2654
13420B2505M946o028o242j0868l495R35n579l132L589P694M784J173J86m924M43
13405E987K335k140o09n418r28M94O29K185j567j72R62K517J298L978J040n413
13389E178k696q63r70L017j729K254K897L090N90O63k001k295K669l845o174n805
13373f020O711O077l64m300k077N927L070K509M189J905l152n867o793l571O333
$$ plain form
13481 3237 -3118 -3131 -3814 -7225 -6610 -5070 -707 -4470 -7353 -4256 -79 673 3279 5105 8989 7227
13465 7227 3721 -1344 228 4131 7798 7850 10789 11893 10723 13224 16830 16071 13155 9197 1507
13450 1507 2511 3914 2942 1279 260 853 11141 9169 15252 10938 9001 6921 1444 3206 -2458
13435 -2458 -2122 -210 2930 2305 -5697 -7879 -2909 4887 5568 -1821 -5056 -847 3166 9851 22505
13420 22505 27451 21423 15181 4313 818 1753 -3826 -6958 -3369 4325 9109 10282 10468 5544 5987
13405 5987 8322 6182 5573 155 -773 -279 350 2535 968 796 1758 4275 5573 9551 10591 5178
13389 5178 2482 1619 649 3666 1937 4191 7088 10178 10768 11431 9430 7135 9804 5959 -215 -6020
13373 -6020 691 6768 6404 2104 27 5954 9024 11533 15722 17627 14475 8608 1815 -1756 4577
13358D577L897M703q16M005K456j266J233o269l445M539m646m845j082L200Q06
13343G047l352k142m606K458R53k748J987m43j855L151n277m604N755J372n296
13328g600J211K984K571L835m563q382K409Q826P232k183j089P338m288J888j939
13313H250l170K053K095J354m024k016m285L948M767j249k307p361j961k122Q510
13298B482N812m359M008q88n759k625l347O228P807j717m693K554Q114m673m922
13283D022n684J852R664Q04l36n569j462J643N125N61p393jL266m582N835L001
13267A0746n99j440J800l753n504q22K632K595J036j784k65n316K758L016l582
13252A518P12k811Q910n032L501M913j298K589L543N78O359J92o327M88n62m824
$$ plain form
13358 4577 8474 13177 12361 16366 18822 17556 18789 12520 9075 13614 8968 4123 3041 6241 7047
13343 7047 3695 1553 -3053 -595 358 -2390 -403 -846 -2701 450 -4827 -9431 -3676 -2304 -7600
13328 -7600 -6389 -3405 -834 3001 -1562 -9944 -7535 1291 8523 6340 5251 12589 8301 10189 8250
13313 8250 5080 7133 9228 10582 6558 4542 257 4205 8972 7723 5416 -1945 -3906 -6028 2482
13298 2482 8294 3935 7943 7055 1296 -1329 -4676 1552 9359 7642 2949 5503 13617 8944 4022
13283 4022 -1662 190 9854 10658 10322 4753 3291 4934 10059 10620 3227 3226 6492 1910 7745 10746
13267 10746 10147 8707 10507 6754 1250 428 3060 5655 6691 4907 4642 -674 2084 5100 1518
13252 1518 2230 -581 8329 3297 6798 11711 10413 13002 16545 17123 23482 23674 17347 17835 17273 12449
13236A2449p548j936n888k641O128O542N729j819n581n309J111M244K341l511
13222D311J991O594N369k491K918n075p121M96K397J485j718Q1O227Q78J54l108
13206A3388l432J940k712j322L362j0n91k889k242p388J922l884J5J241M673m176
13190b105K927m411N43O318P894J976p310l393K012m965k264M272L020n421l159
13175d066J635j403k058M716N575J321K576J749J435l403K974J0946J663n408
13161A8252j244L38n413K324l26p69q04J88q469l444J852L95R84j454L051O504
13145A1965O448m978p765j014j053M506N529O081M849m464j874m200k65k739K774
13130A3800K269N738J254K054M011J92M392J0552r62k309p021r314m07r930l018
$$ plain form
13236 12449 4901 2965 -2923 -5564 564 7106 12835 11016 5435 126 1237 5481 7822 4311
13222 4311 6302 12896 18265 15774 18692 13617 6496 6992 9389 10874 9156 9237 15464 16342 16496 13388
13206 13388 9956 11896 9184 7862 11224 11214 10623 7734 5492 -1896 26 -3858 -3843 -2602 2071 -2105
13190 -2105 822 -3589 -3046 3272 11166 13142 5832 2439 4451 -514 -2778 1494 4514 -907 -4066
13175 -4066 -2431 -3834 -5892 -1176 4399 5720 8296 10045 11480 8077 11051 21997 23660 18252
13161 18252 17008 17346 11933 14257 13931 13162 12358 12546 4077 633 2485 2880 3864 2410 5461 11965
13145 11965 18413 13435 5670 4656 3603 8109 13638 19719 24568 20104 18230 14030 13765 11026 13800
13130 13800 16069 21807 23061 25115 29126 29318 33710 44262 43300 40991 33970 24656 24249 14319 11301
13115A1301J808l627l32P671j201l762L486P264Q15n073N648P809m63k413j801
13100B7130l657n111p548P80L718L800k339M238r29P62o956M24o24J364m081R117
13084B0088j957l435L274P6k013k184j303l870j503M548L300l123P945O275M617
13069C0735n682j940l064Q546l264j150M829N788M918o676l472K159L849J667
13055C7243M482N565K906R506J1800P876O486R624K7399K3824J9693J7527M539
13042A88470l468k576J7601M8986R9821J62475K76571M64321P22442O28584j7516
13031B585711m63931o54031n39454l22869j90280j18365q0218n7404l6800j7079
13021A05280p764k301k057n168p863j0882j0942K754L877N72p726j3021j0738
$$ plain form
13115 11301 13109 9482 9150 16821 15620 11858 15344 22608 23423 18350 23998 31807 31344 28931 27130
13100 27130 23473 18362 10814 11594 15312 19112 16773 21011 20082 20844 13888 14312 13688 15052 10971 20088
13084 20088 18131 14696 17970 18046 16033 13849 12546 8676 7173 11721 15021 11898 19843 26118 30735
13069 30735 25053 23113 20049 28595 25331 24181 29010 34798 39716 33040 29568 31727 35576 37243
13055 37243 41725 47290 50196 59702 71502 79378 85864 95488 122887 146711 166404 183931 188470
13042 188470 185002 182426 200027 249013 348834 511309 787880 1252201 1974643 2603227 2585711
13031 2585711 2121780 1467749 928295 605426 415146 296781 216563 159159 122359 105280
13021 105280 97516 95215 93158 87990 80127 69245 58303 61057 64934 65506 57780 44759 34021
13008C4021l787n786j832p891r8R469P222n98J107j478k296m990j068m387l545
12993A4063n934j727L874R926N695J796L602L135q945j0855q449p840o430J794
12979f295J730K231P003o22J293O372L995O966K299j0864j0034l322K511Q232
12965A1495J0356P11m742M249k123l498N201M872l696k25J003m366m132k566n25
12950A2014M393J964n833j5325k489L814o12L49q41N265L764m318J01L432l146
12935B532J13M660p112m135R66L323m545p621M413M100l099Q289J2268j301K660
12920A5511L114k016O2j472r511K800K234J066n67o630j1126l701Q329O951K704
12905G748Q555O758O37P968P380M145j219o569r059j0344j4618j8715o727L573
$$ plain form
13008 34021 30234 24448 22616 14725 14627 24096 31318 30720 31827 30349 28053 23063 21995 17608 14063
12993 14063 8129 6402 10276 20202 25897 27693 31295 34430 25485 14630 6181 -1659 -8089 -6295
12979 -6295 -4565 -2334 4669 4047 5340 11712 15707 22673 24972 14108 4074 752 3263 11495
12965 11495 21851 22562 17820 22069 19946 16448 21649 26521 22825 22600 23603 19237 15105 12539 12014
12950 12014 16407 18371 12538 -2787 -5276 -1462 -2074 -1725 -2566 2699 6463 2145 2246 5678 2532
12935 2532 2645 7305 193 -3942 -2976 347 -4198 -11819 -7406 -3306 -6405 1884 14152 12851 15511
12920 15511 18625 16609 16671 15199 5688 8488 10722 11788 11221 4591 -6535 -10236 -1907 5044 7748
12905 7748 16303 23061 23698 31666 39046 43191 41972 35403 26344 16000 1382 -17333 -24060 -20487
12891b0487Q954J0458K2451J7335J6211K2274J4792K218j1697j3849p734j1369
12879D9557r382j0200o877j464L550J43j411l87O208M096J720L0m444j00j032
12864C0007J902R462J0175M7P09O335Q133L726P929O657J0J3798J6694K3118L4646
12849A73348J7809q740k6682j7981j4521k0358j9045O367P244J0538R123O064
12837A23166o178P084J0330J1342N43m982q81m886p582p535p410m273r424j0118
12823H9196o658j1456n253l195p70L660k769l836q090j6324j3967J467L145K842
12809B7992R762M633M975k001o439j03O13P153J223j297J002m102R6k372Q14P35
12793D2684J652J0443J4171P068k762n598m138N703J1874p491j7090j0805j9787
$$ plain form
12891 -20487 -11533 -1075 21376 38711 54922 77196 91988 94206 82509 68660 60926 49557
12879 49557 40175 29975 23098 21634 25184 25327 23916 23529 29737 33833 35553 35583 31139 31039 30007
12864 30007 31909 41371 51546 51593 52302 58637 66770 70496 78425 85082 85092 98890 115584 138702 173348
12849 173348 191157 182417 155735 137754 123233 102875 83830 90197 97441 107979 117102 123166
12837 123166 116988 124072 134402 145744 146287 141305 140424 135538 127956 120421 113011 108738 99314 89196
12823 89196 82538 71082 65829 62634 61864 65524 62755 58919 50829 34505 20538 22005 25150 27992
12809 27992 37754 42387 47362 45361 38922 38819 39432 46585 47808 46511 47513 43411 43507 41135 41949 42684
12793 42684 44336 54779 68950 76018 73256 67658 63520 69223 81097 73606 56516 45711 25924
12780B5924k1784j5524l2502l1350j6381P311J8919K3463P597J0062J5756J6649
12768H140K3996J9630L785j1093q531N541J0996J1591J0321J0030J2208J25j362
12755I5377j739m511j966p138j2175j5516j5148o243k12n821o42Q33k93k538o000
12740A6268L08l553l167j2856J0750L3284K0552O236k207q261j5708j1028K041
12727C2659R271J6895R675K40q277r971j6764j3321J3217L8786M4099J5810M5430
12714A77749Q5969R4296J12978Q1319M0098j5607p3996q4297q1139o9546l0143
12703B37681k2743k5804p174m317O982O968j948M222M664R821J7750J4894l447
12690B37549j3617r289q278L09k607m972k727m682o359O892n089r174j233J5228
$$ plain form
12780 25924 4140 -11384 -43886 -75236 -91617 -84306 -65387 -41924 -34327 -24265 -8509 8140
12768 8140 32136 51766 55551 44458 35927 41468 52464 64055 74376 84406 96614 96739 95377
12755 95377 93638 89127 87161 80023 67848 52332 37184 30941 30729 24908 24266 25099 24806 22268 16268
12740 16268 16576 13023 9856 -3000 7750 41034 61586 67822 65615 57354 41646 30618 32659
12727 32659 41930 58825 68500 68740 60463 50492 33728 20407 33624 72410 116509 132319 177749
12714 177749 263718 358014 470992 552311 592409 576802 502806 418509 337370 267824 237681
12703 237681 214938 189134 181960 177643 184625 191593 189645 193867 198531 208352 226102 240996 237549
12690 237549 223932 214643 206365 206674 204067 199095 196368 191686 185327 192219 187130 177956 176723 191951
12676A91951K6773J6908J0908J5100M731m401n533J3354J6539O390k585J001R488
12663C00624L141l443j2131k775q844p467k388J1477J1374J9786K8951K8120K6534
12650C92959J7403K569q743j9940J322Q581J1611J6473J3633J6452J4199J5462
12638D81981K8807M8732O4976M7742L1905K2493K7185M0168P7584J10450J02079
12627A084102O2793K8797K7415M5312P0223P5567O7166M9096L2322L1088L0057
12616A603938P2891J25105J41212J32221J71142K20022K29561K39065K23569K02814
12606C361540K21259K99138M20482N37898N86349O53776P91993R72434J243965
12597I088834J675254K091181J797200J628427K040962K920891M459833O615524
$$ plain form
12676 191951 218724 235632 246540 261640 266371 261970 256437 269791 286330 292720 290135 291136 300624
12663 300624 303765 300322 288191 285416 276572 269105 266717 278194 289568 309354 338305 366425 392959
12650 392959 410362 412931 404188 384248 385570 394151 405762 422235 435868 452320 466519 481981
12638 481981 510788 559520 624496 672238 704143 726636 753821 793989 871573 982023 1084102
12627 1084102 1146895 1175692 1203107 1248419 1318642 1394209 1461375 1510471 1542793 1573881 1603938
12616 1603938 1676829 1801934 1943146 2075367 2246509 2466531 2696092 2935157 3158726 3361540
12606 3361540 3582799 3881937 4302419 4840317 5426666 6080442 6872435 7844869 9088834
12597 9088834 10764088 12855269 14652469 16280896 18321858 21242749 25702582 32318106
12589C2318106R781560J4848040K3803661L9620782O6553897J09441005J36087007
12582D32454058N2610144m9015019j00023605j14199721p9233627m6446791k8073187
12575F8072252j7844054j1751033p932669n425604l611557k307585j661406j913511
12567A5624833k167725k181262j893540j386875j001240p59007n94964m78119
12559E162101m10069m24940m16523l54530k91707k20264j60791j49675j48496
12550B585106j36389j25271j30362j28894j56393j72219j32015q8669p3369n6933
12540A384592m7878m3200l4359l5169k5156q354k2623l4812n0462o8458n9936
12529I54185k6217R83N660o015j8294k7045k0523j2767k1055j9058j2505m241
$$ plain form
12589 32318106 42099666 56947706 80751367 120372149 186926046 296367051 432454058
12582 432454058 485064202 436049183 336025578 221825857 142592230 96145439 68072252
12575 68072252 50228198 38477165 30544496 25118892 21507335 19199750 17538344 15624833
12567 15624833 13457108 11275846 9382306 7995431 6994191 6235184 5640220 5162101
12559 5162101 4752032 4327092 3910569 3556039 3264332 3044068 2883277 2733602 2585106
12550 2585106 2448717 2323446 2193084 2064190 1907797 1735578 1603563 1514894 1441525 1384592
12540 1384592 1336714 1293514 1259155 1223986 1198830 1190476 1167853 1133041 1082579 1014121 954185
12529 954185 927968 928951 934611 928596 910302 883257 862734 849967 828912 809854 797349 793108
12517G93108j2195k5562m6544m7578m5733k6915p326Q505k552r299j4796k0753
12505E42360l0055k8902l0439k1422j9839k2755j8432j1693k358J825m733j5579
12493C37978q400j3744j3160q155K793R643N873J424L545o342j2874j2847j0025
12480B75709r159q505r041n528o811j3370j5166j0019n451N860L693L439P50J650
12466B08051R667J4242J7939J7902J8671J2854l036k4410l7765n8059q5958o2096
12454B8002l8063K3908Q9079J07090J04264N5547J5512M570J1460J6946k449k8346
12442C87520n5160n0386l2617j1608m066L474k813l659j0296k1256r636j885J628
12429A89240R818J3765J5017P219o020j3725p231l855p041j5359q147q8n183k840
$$ plain form
12517 793108 780913 755351 708807 661229 615496 588581 581255 589760 587208 577909 563113 542360
12505 542360 512305 483403 452964 431542 411703 388948 370516 358823 356465 358290 353557 337978
12493 337978 329578 315834 302674 294519 297312 306955 312828 314252 317797 311455 298581 285734 275709
12480 275709 266550 258045 249004 243476 236665 223295 208129 198110 192659 198519 202212 205651 206401 208051
12466 208051 217718 231960 249899 267801 286472 299326 296290 271880 234115 176056 90098 28002
12454 28002 -10061 13847 102926 210016 314280 369827 385339 389909 401369 418315 415866 387520
12442 387520 332360 281974 249357 237749 233683 237157 234344 230685 220389 199133 189497 187612 189240
12429 189240 199058 212823 227840 235059 229039 215314 208083 204228 197187 181828 173681 173593 168410 165570
12415A65570j7058j7508j0690j5575j2104n254r755j1650j537N209J7339J6718
12403A03705J7118J899K41L5j1080q895j853J8599J9423O183J5983J8241O872
12390A86471N431K1560J5854q063k4640k7111k5484k4573j4574j0505p084l685
12378H3597o997o411j784n336j458l761j065N738O028L155P796J210j315p741
12364G1656j467k845K007J037N287K059m191n332M739q34j040P896M19K20j0860
12349F8751r257r679n991L10k374L243o24p986l45J321N093M8n838L864M634O263
12333E1433Q000l016m521m76O11l748o26p27J473j251k959P199J5738K718K470
12318G2318O50k257k715O63M211N071J013j889l478r636j1483r769Q78N99m191
$$ plain form
12415 165570 148512 131004 120314 104739 92635 87381 77626 65976 64439 69648 86987 103705
12403 103705 120823 122722 122963 122998 111918 103023 101170 119769 139192 145375 161358 179599 186471
12390 186471 191902 213462 229316 221253 196613 169502 144018 119445 104871 94366 87282 83597
12378 83597 76600 70189 68405 63069 61611 57850 56785 62523 68551 71706 79502 80712 79397 71656
12364 71656 70189 67344 69351 70388 75675 77734 73543 68211 72950 72116 71076 78972 79391 79611 68751
12349 68751 59494 49815 43824 44134 41760 45003 44379 36393 36048 37369 42462 42510 36672 40536 45170 51433
12333 51433 59433 56417 51896 51420 52031 48283 47657 46930 48403 47152 44193 51392 67130 69848 72318
12318 72318 72968 70711 67996 68659 72870 77941 78954 77065 73587 63951 52468 42699 43577 44176 39985
12303C9985j982M452P465M032r36q57N50O38j1502q02P081J589j212L038l974
12288D7565n531k472j677q985j6476j3069n461p359n529L927J1534J2265K676
12275A1408J1072J9603J0044Q414N847l591j0766j2915j4132j0261k218m026j449
12262G030P26J0454P837P304R670O139L473M064N026L205J204n424q795p247j138
12247D3528J392l665l253J610n317k843M587Q629J981K811N128o6p142k900P48
12232D5228N14p032n497M923n213p84O89J542Q690L667k247j371M578j962j0055
12217C5670p06m213l239j052k096Q63N297R811n216r086m011J314N368N782j620
12202C2866J862m780k447n410j738l2N230J884k162J446m632k548O91Q954M955
$$ plain form
12303 39985 38003 42455 49920 53952 53016 52159 52709 53347 41845 41043 48124 49713 48501 51539 47565
12288 47565 42034 39562 37885 28900 12424 -645 -6106 -13465 -18994 -15067 -3533 8732 11408
12275 11408 22480 42083 52127 60541 66388 62797 52031 39116 24984 14723 12505 8479 7030
12262 7030 7756 18210 26047 33351 43021 49160 52633 56697 61723 64928 66132 60708 51913 44666 43528
12247 43528 44920 41255 38002 39612 34295 31452 36039 44668 46649 49460 54588 54522 47380 44480 45228
12232 45228 45742 38710 33213 38136 32923 32139 32828 34370 43060 46727 44480 43109 47687 45725 35670
12217 35670 34964 30751 27512 26460 24364 25227 30524 40335 35119 26033 22022 23336 28704 34486 32866
12202 32866 34728 29948 27501 22091 20353 20321 25551 27435 25273 26719 22087 19539 20230 29184 34139
12187C4139N948Q265J333L052n048j2123m715o301q197L51P449N233K265l892
12173B7759n842O618K442O114K314k484j1671q604p100m827O708M712R904J0607
12159C6650o001k953P886Q64r490j4662l564K382Q169Q002Q430K951K29O956O735
12144E2584R151L077q51P112J3523M196Q601L206n59Q264J2189K0270L5925N4567
12130B31255P4521J16186J95178L34236N48756P56276M18400k24303n79009o67475
12120A204021m60947k61784j47843r0415n6504l5709k5873k1444j5572M796J025
12109I3751j7209j6873r393o558l291j506K393l007q61k49p259J498M126M875
12095D0437j456j312l81q854j019l49k748m489j458N887j694P84J248q24K406
$$ plain form
12187 34139 40087 48352 49685 52737 47689 35566 30851 24550 16353 16704 24153 29386 31651 27759
12173 27759 21917 28535 30977 37091 39405 36921 25250 16646 9546 4719 11427 16139 26043 36650
12159 36650 30649 27696 35582 36446 26956 12294 8730 11112 19281 27283 35713 38664 38893 45849 52584
12144 52584 61735 64812 63961 71073 84596 88792 97393 100599 100040 108304 120493 140763 176688 231255
12130 231255 305776 421962 617140 951376 1500132 2256408 2674808 2450505 1871496 1204021
12120 1204021 743074 481290 333447 243032 186528 150819 124946 103502 87930 92726 93751
12109 93751 76542 59669 50276 43718 40427 38921 41314 38307 37446 37197 29938 31436 35562 40437
12095 40437 38981 37669 37288 28434 27415 27066 24318 19829 18371 24258 22564 23348 24596 23772 26178
12080B6178n988k593j485J150J010j417m662m41L281R684n100o871J795j118k831
12065A0592o060p67N903j860J230k865J613k735n382J2252K808l853m23O028K633
12050A9114j1785m532L457M866k226l674K747o89p7Q079P80k439J215P8j1399
12035C515n31N313j601k350L094J428l140n495P489M127l356Q02J729P558J0963
12020B9545p620q303j342l381k597m42J936k809k344J6N471j684k85J042L536
12005A0739M096K268r32p651K19M408r01J538j067q477j745O207Q516l47j167
11990A5704k018L818L883R29j910k661J423o87k570j333q89K835O457k713j0802
11975I466j05N42o95L125P1J374K804r99l310j076K862P027n400m369k149J851
$$ plain form
12080 26178 20190 17597 16112 17262 18272 16855 12193 11752 15033 24717 19617 12746 14541 13423 10592
12065 10592 4532 3765 9668 7808 9038 6173 7786 5051 -331 11921 14729 10876 10453 16481 19114
12050 19114 7329 2797 6254 11120 8894 5220 7967 7278 7201 15280 16060 13621 14836 14914 3515
12035 3515 2984 8297 6696 4346 7440 8868 5728 233 7722 11849 8493 9295 11024 18582 29545
12020 29545 21925 13622 12280 8899 6302 5860 7796 4987 2643 2659 8130 6446 6161 7203 10739
12005 10739 14835 17103 16171 8520 8739 13147 12246 13784 12717 4240 2495 8702 17218 16871 15704
11990 15704 13686 17504 21387 22316 20406 17745 19168 18481 15911 14578 13689 16524 22981 20268 9466
11975 9466 9361 9903 9208 12333 12404 13778 16582 15583 12273 11197 14059 21086 15686 11317 9168 11019
11959A1019j327k873j372L023L868r65j4952j683N322LK07N620K204O059J92k328
11943A2017J132q25j127k889N7j712k740j352r14l703L292M487L727O085Q851
11928B4386k360M04l978p576o408k758L817j614L924M186P697p069m769k565J159
11913F476j415P99k738l685o0K124K360N55j810K883J0552L446l70m331J83j2558
11897B411q074L275m823J765R953K092J472N931L956j980n797m382L519L464M70
11882A3252n422k15M717L2r13j699K38K315N205L37m88q381l297k465k455K062
11866B823K478J502r93J159k508p048K239J998l940N27K458K383O723L741m13
11851A3129k79M454j685M562n825n530l839P52L018j997J446L529L510J337j320
$$ plain form
11959 11019 9692 6819 5447 8470 12338 11373 -3579 -5262 60 63 270 5890 8094 14153 14345 12017
11943 12017 13149 12324 11197 8308 8365 6653 3913 2561 1647 -2056 1236 5723 9450 15535 24386
11928 24386 22026 22430 18452 10876 4468 1710 5527 3913 7837 12023 19720 12651 7882 5317 6476
11913 6476 5061 5860 3122 -563 -623 1501 3861 4416 2606 5489 16041 19487 19117 14786 14969 2411
11897 2411 -5663 -2388 -7211 -5446 4507 6599 8071 14002 17958 15978 10181 5799 9318 12782 13252
11882 13252 7830 7615 12332 12364 11451 9752 9990 12305 17510 17847 17359 8978 5681 3216 761 2823
11866 2823 5301 6803 5810 6969 4461 -2587 -348 1650 -2290 -1763 695 3078 9801 13542 13129
11851 13129 12850 17304 15619 20181 14356 8826 4987 5739 8757 6760 8206 11735 15245 16582 15262
11836A5262l8m763l60n318K859R003M065q147o200k814K573L049n57k406j614
11821D594N163K647m119k819k288M005k889n426L502j626m151L189N896j850k657
11806A171j594N220k072l668K333L886k746l56j62R58L398L483j486R25K9k75
11790I044Q45J073m380J265O5k851q355N651J772J713L086L511N424K224o705
11775A3382j638m624l839L19K188K014l67j797k341K134J548P868k448p985j457
11760B957R263O90p929j205m712J620K816k826J905O503o25L762k316k650P34
11745G987m388N489k75J243j214K727o841KJ066K026M378L754N388k591j3901
11730D850r612P922N680K090o458n771R831l126r612J715P49M220P681J513K185
$$ plain form
11836 15262 15224 10461 10101 4783 7642 16645 20710 12563 6363 3549 6122 9171 8614 6208 4594
11821 4594 9757 12404 8285 5466 3178 7183 4294 -1132 2370 744 -3407 -218 5678 3828 1171
11806 1171 -423 4797 2725 -943 1390 5276 2530 2174 2012 2970 6368 9851 8365 9290 9319 9044
11790 9044 9889 10962 6582 7847 7912 5061 -3294 2357 4129 5842 8928 12439 17863 20087 13382
11775 13382 11744 7120 3281 3600 5788 7802 7435 5638 3297 5431 6979 14847 12399 4414 2957
11760 2957 12220 12910 4981 3776 -936 684 3500 674 2579 9082 8457 12219 9903 7253 7987
11745 7987 3599 9088 8813 10056 8842 11569 4728 4730 5796 7822 12200 15954 21342 18751 4850
11730 4850 -4762 3160 8840 10930 4472 -1299 8532 5406 -4206 -2491 -1742 2478 10159 11672 13857
11715A3857k702k448m677R33L069j23K12o779m024N462R460j633m901m512p425
11700f231j48J307J75K680k7j323O071L002Q631K418n558m075l221Q98O039J072
11684A1710j186n05n963l899K538L36J878N823N248M541L255l802p636k632j330
11669H376n812n364m186k937q77L965O85J420Q067P660J720J768m44n299k442
11654F300k895M335j065M105J955L732l70l661k237l07L001j037m300l577l268
11639G11l155P86L510k705N048N582l181l999M219J396P5m204p716k370R22K038
11623c043l333K12N850L824N160m119m258m980k10r5P635M370l369m091k957j591
11607d995Q580O412k885m049k250L757K051l879L080K288n422k760J927j135l750
$$ plain form
11715 13857 11155 8707 4030 4963 8032 7909 8121 1342 -2682 2780 12240 10607 5706 1194 -6231
11700 -6231 -6379 -5072 -4897 -2217 -2244 -3567 2504 5506 14137 16555 10997 6922 3701 4599 10638 11710
11684 11710 10524 10019 4056 157 2695 3031 4909 10732 15980 20521 23776 19974 12338 9706 8376
11669 8376 2564 -2800 -6986 -9923 -10800 -6835 -6150 -4730 3337 10997 12717 14485 14041 8742 6300
11654 6300 3405 7740 6675 10780 12735 16467 16097 12436 10199 9892 12893 11856 7556 3979 711
11639 711 -2444 -1658 1852 -853 4195 9777 6596 2597 6816 8212 8287 4083 -3633 -6003 -5081 -3043
11623 -3043 -6376 -6164 -314 3510 8670 4551 293 -4687 -4897 -4992 2643 7013 3644 -447 -3404 -4995
11607 -4995 3585 9997 7112 3063 813 4570 6621 2742 5822 8110 2688 -72 1855 720 -3030
11592c030p69J993M94M254l193K012P777M261n031k276m946o13q822J890k421
11577h420l695n69N865J057l69J2976N638l111J154r365r036J659Q271j454k505
11562a904q76k679K325P286K843j016k420o100P673Q17m838j015L355j5J196M377
11546I009M72J94m197r98k589o198l962L950m647M264l214L569J618l218o405
11531a2352P928M091l542p466O855J657P39R929J964m014n653m277K698J0539
11517I096K767j2914q499J0247P611J603j838k530J69O781m482j193R70K112m146
11502E754l513J89j26L41k895J17K365L635m241m93q716L040O393r52m71J284
11486A711K98R254m279p293K568M374N453o41m837j634m307J702J1151J397l853
$$ plain form
11592 -3030 -3799 -1806 -1312 2942 -251 1761 9538 13799 8768 6492 1546 933 -7889 -5999 -8420
11577 -8420 -12115 -12684 -6819 -5762 -6131 6845 12483 9372 10526 1161 -7875 -6216 2055 601 -1904
11562 -1904 -2780 -5459 -3134 4152 6995 5979 3559 -2541 5132 5949 1111 96 3451 3436 4632 9009
11546 9009 9481 9675 5478 4480 1891 -4307 -8269 -4319 -8966 -4702 -7916 -4347 -2729 -5947 -12352
11531 -12352 -4424 -333 -3875 -11341 -4486 -2829 -2090 7839 9803 5789 136 -4141 -1443 9096
11517 9096 11863 -1051 -9550 697 8308 9911 8073 5543 5712 12493 8011 6818 7788 9900 5754
11502 5754 2241 2430 2304 2645 -250 -133 2232 5867 1626 1133 -7583 -4543 1850 898 427 1711
11486 1711 2009 11263 6984 -309 2259 6633 12086 11445 6608 4974 667 2369 13520 14917 11064
11471A1064k46L6k299m059n01j84K590N127o93p651l32K021r535j94L241o500
11455h115l146J045N087M428k133P77L125L366q52n408j276k302K667J0051O999
11440A4313n418k103r50l967j0089P814M377q734k318O439l219J543K319M63k811
11425b341J691j804P165m25n847m792N880J882l736N18p23l039l642J60J3104
11410D051K074j291m660k192N250M101O615M465M154j613n708q357j1359m01J877
11395b994K441l636j090m20J679K091o240l054J78K380L23L033R95M884M892k048
11379C414n390p708L141M249K17q24M821n77j556P865r37n358l944K102O256L425
11363I196p400q777k024j142L207K351N521K057r12k088k488k730K051Q803j395
$$ plain form
11471 11064 10818 10854 8555 4496 3995 3811 6401 11528 10835 3184 2852 4873 -4662 -4856 -1615 -8115
11455 -8115 -11261 -10216 -5129 -701 -2834 -2057 1068 4434 3582 -1826 -3102 -5404 -2737 7314 14313
11440 14313 8895 6792 5842 1875 -8214 -400 3977 -4757 -7075 -636 -3855 -2312 7 470 -2341
11425 -2341 -650 -2454 4711 4286 -1561 -6353 -473 1409 -2327 -1809 -2532 -5571 -9213 -9053 4051
11410 4051 6125 4834 174 -2018 3232 7333 13948 18413 22567 20954 15246 6889 -4470 -4871 -2994
11395 -2994 -553 -4189 -5279 -5699 -4020 -1929 -8169 -11223 -11045 -8665 -8342 -5309 -4314 570 5462 3414
11379 3414 -1976 -9684 -6543 -2294 -2077 -2901 1920 1343 -213 7652 6715 1357 -2587 -485 5771 9196
11363 9196 1796 -6981 -9005 -10147 -6940 -4589 932 2989 2077 -11 -2499 -5229 -3178 5625 4230
11348D230q2j595k386l011N466N006P60P35p401n765l614j51J0507m801l184L26
11332d960K515k16M407J376o08l054p24j670M101L994K020j558n28k48p989k002
11316e144N085l85o09K920K416j030k374j138K886L693M50J076L055k107p107
11301A687k568M765p969m623K860m14R496q56n421L205P331l6p574l661M829L065
11285D116n513Mo608j697L465L489m50m833J408L400L858j774k498O60L792M696
11269E515k421J383J187m247m092K165J340O359J029m588q633m660k041K991O078
11254b635N273j450p374J670j521K68K197O055M851M230M026j638l403L159n004
11239H704q377n415K36j47K28N447o473R38m289N466J205P990j544k241N11J844
$$ plain form
11348 4230 4148 2553 167 -2844 2622 7628 8388 9123 1722 -4043 -7657 -7808 2699 -2102 -5286 -4960
11332 -4960 -2445 -2661 1746 3122 2514 -540 -1264 -2934 1167 5161 7181 5623 5095 4847 -3142 -5144
11316 -5144 -59 -444 -1053 1867 4283 3253 879 -259 2627 6320 6770 7846 10901 8794 1687
11301 1687 -881 3884 -4085 -8708 -5848 -6262 3234 2378 -3043 162 7493 7457 -117 -3778 1051 4116
11285 4116 -1397 -1393 -8001 -9698 -6233 -2744 -3194 -8027 -6619 -3219 639 -1135 -3633 -2973 819 5515
11269 5515 3094 4477 5664 1417 -2675 -510 830 7189 8218 3630 -5003 -9663 -11704 -8713 -2635
11254 -2635 2638 1188 -6186 -4516 -6037 -5769 -3572 2483 7334 11564 15590 13952 10549 13708 8704
11239 8704 327 -5088 -4852 -4999 -4771 676 -5797 -4859 -9148 -3682 -2477 5513 3969 1728 2239 4083
11223D083j799l394k060p35O682k744l680o36L157M487k093J922L014j380p691
11208b867k631L034P705L966l814j365j05K435L996j275p88L010j798K377R96
11193A2876p19K730j0913q254j037J507K722O48n4m299n884L295n18O194P544
11178E838J198k350K590M858l034l638j983l432m066m92j804r95N379L26l215
11163d820N550L934l035o516j28l919Q86N134o9l7K731l204l49J499M227j20Q03
11146B567J269p000k391L597N72k214j643j43N62P19k578R262L401J635M494j1245
11130H64p340M0N400Q963l334K484l669o476k361o404L474k16k453M104J2288
11115E364O9m068q571m824K650M284m437P068R273k200l34o01o026r006M672J2553
$$ plain form
11223 4083 2284 -1110 -3170 -3905 2777 33 -3647 -4283 -1126 3361 1268 3190 6204 4824 -2867
11208 -2867 -5498 -2464 5241 9207 5393 4028 3923 6358 10354 9079 8291 11301 9503 11880 12876
11193 12876 12157 14887 3974 -4280 -5317 -3810 -1088 -440 -494 -4793 -10677 -7382 -7900 -1706 5838
11178 5838 7036 4686 7276 12134 9100 5462 3479 47 -4019 -4511 -6315 -7310 -1931 -1605 -4820
11163 -4820 730 4664 1629 -4887 -5015 -8934 -8048 -2914 -2983 -3020 -289 -3493 -3842 -2343 1884 1764 2567
11146 2567 3836 -3164 -5555 -1958 -1386 -3600 -5243 -5386 -4824 -4105 -6683 2579 5980 7615 12109 864
11130 864 -6476 -6436 -1036 7927 4593 7077 3408 -3068 -5429 -11833 -8359 -8575 -11028 -6924 5364
11115 5364 5433 1365 -7206 -12030 -9380 -5096 -9533 -2465 6808 4608 4274 3673 -2353 -11359 -6687 5866
11099E866Q04J03n376K80m764l157k927K401N575j113l141N528M33N349K876j389
11083G348m780r217J87O737J08K102Q89L016l029l818L307k863p51Q32N576j050
11067D594o712R223Q567K885l866N80n359r440N16L820M519L094j928l319J341
11052H515j285r04o376R81K478L700J329L24o431q091l184L062N713k419m319
11037f907j103m01P44R63M339P400j905m929J803J894n458j378J942K8L131n052
11021d889l910m593m790N552Q506j079j446J066K894P936O96l015j0557l588j081
11006a2298J781L329J257o943J668K637K856P256Q997j9o473M34P030k321n681
10991C510O117K867K141q262o746J234j544K085k638k859L792j302K849l651q541
$$ plain form
11099 5866 6670 6773 1397 1677 -3087 -6244 -9171 -6770 -1195 -2308 -5449 79 512 5861 8737 7348
11083 7348 2568 -6649 -6462 275 383 2485 3374 6390 3361 -457 2850 -13 -764 68 5644 4594
11067 4594 -2118 7105 15672 18557 14691 15271 9912 472 988 4808 9327 12421 10493 7174 8515
11052 8515 7230 6326 -50 931 3409 7109 8438 8762 2331 -5760 -8944 -5882 -169 -2588 -6907
11037 -6907 -8010 -8411 -7667 -6704 -2365 5035 3130 -1799 4 1898 -3560 -4938 -2996 -2968 163 -4889
11021 -4889 -8799 -13392 -18182 -12630 -4124 -5203 -6649 -5583 -2689 5247 5943 2928 -7629 -11217 -12298
11006 -12298 -10517 -7188 -5931 -12874 -11206 -8569 -5713 1543 10540 10521 4048 4482 11512 9191 3510
10991 3510 9627 12494 14635 6373 -373 861 -683 1402 -1236 -4095 -303 -1605 1244 -2407 -10948
10976a0948o00L790K839K182N053J951m219r60k808J222O122k405j706o459j698
10961h644M794L268O006K164k204M510L480o68j732l668J330K658K823j581o497
10946F039J782j945K95J166P96M189l145q391k248K830N860L726p46L572L29j017
10930A3092j420r036l953j719k86l612p425J089P155L137K594N78l885l136P213
10915C86K108k186l478M276k206M86j403p54K317Q34p90N734o61n036k325J714
10899i84N382k050o743m144k264J244M997P21l824l547K012K172K585k750J493
10884e700M593J122O238k059L32J104k024k624o977o164k43P307K278K569N329
10869E081j768k163j373K209M304j103q175p115j864o65k008L096R927K498o313
$$ plain form
10976 -10948 -11548 -7758 -4919 -2737 2316 4267 48 -912 -3720 -2498 3624 1219 -487 -6946 -8644
10961 -8644 -3850 -582 5424 7588 5384 9894 13374 12706 10974 7306 8636 11294 14117 12536 6039
10946 6039 7821 5876 6171 7337 8133 12322 9177 786 -1462 1368 7228 10954 10208 13780 14109 13092
10930 13092 11672 2636 -1317 -3036 -3322 -6934 -14359 -13270 -6115 -2978 -384 194 -3691 -6827 386
10915 386 2494 308 -3170 1106 -1100 -614 -2017 -2771 -454 380 -410 5324 4663 -373 -2698 -984
10899 -984 4398 2348 -4395 -8539 -10803 -9559 -4562 -3841 -7665 -11212 -9200 -7028 -4443 -7193 -5700
10884 -5700 -1107 15 6253 4194 4526 5630 3606 982 -5995 -12159 -12402 -5095 -2817 -248 5081
10869 5081 3313 1150 -223 1986 6290 5187 -2988 -10103 -11967 -12632 -14640 -11544 -1617 881 -5432
10854e432k344m45O886K970N642J223L696m818l732K099j182J999k797l946M362
10839D181N34j1290q003k572K218M403M999L228k973O559L926J856o27K859J587
10824A0885N33P6R62l602m488J104j209m655P797K517K458o239m948O464M751
10809A2406q387p594K583k948q4l65j7l59L218K416P847r12m763j043N019N260
10793A2277l79l568k890l432L067J697n108k416O706K890k455K04l524K299j807
10778C561m726k819K591k18p65o557J171L203O210J168k519N248P071K48q660
10763D207n189k970j941l863k082M663K026J997J625K698o052n791K742M756P34
10748b440K046K701J936M289K122l566R70K945m504J205J827J222K672l500l220
$$ plain form
10854 -5432 -7776 -8221 -1335 1635 7277 8500 12196 7378 3646 5745 4563 6562 3765 -181 4181
10839 4181 4715 -6575 -14578 -17150 -14932 -10529 -5530 -2302 -5275 1284 5210 7066 6439 9298 10885
10824 10885 11418 11494 12456 8854 4366 5470 4261 -394 7403 9920 12378 6139 1191 7655 12406
10809 12406 4019 -3575 -992 -3940 -4024 -4389 -4406 -4765 -1547 869 8716 7804 3041 1998 7017 12277
10793 12277 11898 8330 5440 2008 5075 6772 1664 -752 5954 8844 6389 6593 3069 5368 3561
10778 3561 -1165 -3984 -1393 -1611 -2376 -8933 -7762 -4559 1651 2819 300 5548 12619 12867 4207
10763 4207 -982 -3952 -5893 -9756 -11838 -7175 -5149 -3152 -1527 1171 -4881 -10672 -7930 -3174 -2440
10748 -2440 -394 2307 4243 8532 10654 7088 8058 11003 6499 7704 9531 10753 13425 9925 6705
10733F705o411N11k211N36O52K562L195N93q28p720n47K559L418J008J837k876
10717B983K5j616n513R45K385O275Q02l915j21o456k879L275N829M703N068j6
10701A1774p523o877q86m064j354P056L072l47j577K793n52L599R05j593l568
10686H58L754M100j143k136o393M60K57K623K741M932k511p057p616L968L822
10671F59L605J401j748m37K65P69j984j028K67K386J735k361j812J836K76l971
10655a42k636N908O842o124q560j415R452J443j3p723N74j355K600K959j857N173
10639E126P7K59k165N19N39K517j367q094J650Q164K364o126l615p31j5623k567
10623a9073n63O447O539P564P781n11q687n40J281k54j919K304k066j134L703
$$ plain form
10733 6705 294 805 -1406 -870 -218 2344 5539 6132 5304 -2416 -2963 -404 3014 4022 5859 2983
10717 2983 3008 1392 -4121 -3176 -791 5484 6286 2371 2250 -4206 -7085 -3810 2019 6722 11790 11774
10701 11774 4251 -2626 -3512 -7576 -8930 -1874 1198 851 -726 2067 1515 5114 6019 4426 858
10686 858 4612 8712 7569 5433 -960 -500 -243 2380 5121 10053 7542 485 -7131 -3163 659
10671 659 4264 5665 3917 3480 3745 4514 2530 1502 1769 4155 5890 3529 1717 3553 3829 -142
10655 -142 -2778 3130 9972 3848 -4712 -6127 3325 4768 4755 -2968 -2394 -3749 -1149 1810 -47 5126
10639 5126 5203 5462 3297 3816 4355 6872 5505 -2589 -939 7225 9589 3463 -152 -883 -16506 -19073
10623 -19073 -19636 -13189 -6650 914 8695 8184 -503 -1043 238 -16 -1935 369 -1697 -2831 872
10608H72N778j519n656l273J240K203N156M105N27n756M313j045J915o323k965
10593d28Q447n67p902j03l6Q78j941k611k157l084L999o537j413P863J0238k631
10577B015n080M283k71R86l90l964k433J627L382N384L543m024r602j207N737
10562a4L185k135r062m576O420J7673J0673o813j1673p668R07j176j56O975l881
10547a321k948N847L434J843J338k45j1018J800L167k110L980j439J229J573k205
10532B925K649K554n224L160k066n322M564o13J424q105L82K997p67p404M87M553
10516c806l344l752J089K132R385N767j604K818L150p075j884P94J844m08l876
10501A230r08J663K232n659m637J094m219N480Q224j314J452O073k84m795L62
$$ plain form
10608 872 6650 5131 -525 -3798 -2558 -355 4801 8906 9433 3677 7990 6945 8860 2537 -428
10593 -428 8019 7452 -450 -553 -589 289 -1652 -4263 -6420 -9504 -5505 -12042 -13455 -5592 4646 2015
10577 2015 -3065 1218 947 1933 1543 -2421 -4854 -3227 155 5539 9082 5058 -4544 -5751 -14
10562 -14 3171 1036 -8026 -12602 -6182 11491 22164 15351 3678 -3990 -3083 -4259 -4415 2560 -1321
10547 -1321 -4269 1578 5012 6855 8193 7948 -3070 -1270 1897 -213 3767 2328 3557 5130 2925
10532 2925 5574 8128 2904 6064 3998 -1324 3240 2627 4051 -4054 -3672 -675 -1442 -8846 -8359 -3806
10516 -3806 -7150 -10902 -9813 -7681 1704 7471 5867 8685 11835 4760 2876 3670 5514 5106 1230
10501 1230 322 1985 4217 -1442 -6079 -4985 -9204 -3724 4500 3186 4638 10711 10427 5632 5994
10486E994L535N49o046o307J256K891O703M53j93l284m21r849M6K432K752N681
10470F192l673m285L26j613l206N05J563l577M723K821m853J655L955K361l052
10455a58L052q00k421K72l307L9L532j873J981n698k053n38J791K538n07N281
10439A131M940L469M965l308p499L679N190O23p961N19j128K411L136l515j976
10424D676l881j254k782J069p403k837J871M888K518k46L302L990K903k478k349
10409A987l766L422P93L83O446M196q467k868O491J151l505N480L166o363j910
10394F636P274K661o667o160o78k150n462l500K36K637l68K610L475l38m13j449
10378a656K256k499J607J396J356k205P64J921o338o762k978j536J359O141K485
$$ plain form
10486 5994 9529 10078 4032 -2275 -1019 1872 8575 9028 8835 5551 5130 -4719 -4673 -2241 511 6192
10470 6192 2519 -1766 -1440 -3053 -6259 -5754 -4191 -7768 -3045 -224 -5077 -3422 533 2894 -158
10455 -158 2894 2094 -327 -55 -3362 -3323 209 -1664 317 -5381 -7434 -7972 -6181 -3643 -4150 1131
10439 1131 6071 9540 14505 11197 3698 7377 12567 13190 5229 5748 4620 7031 10167 6652 4676
10424 4676 795 -459 -3241 -2172 -9575 -12412 -10541 -5653 -3135 -3381 -79 3911 6814 4336 1987
10409 1987 -1779 1643 2436 2819 9265 13461 4994 2126 8617 9768 6263 11743 14909 8546 6636
10394 6636 13910 16571 9904 3744 3066 916 -4546 -8046 -7810 -5173 -5541 -2931 544 206 -207 -1656
10378 -1656 600 -1899 -292 1104 2460 255 1019 2940 -3398 -10160 -13138 -14674 -13315 -7174 -4689
10363d689j977L131O384l749o023J025J1187N429n47l806m430M644L574m207j082
10348D864n670p794K302Q082K620N061N32k916l128K355J356J107K986o745m028
10333I84M297K921l241m907q68J293r15M148m273N46n006j220r09L197L550L433
10317C030l36j792k002j773j658L87l931M684M88r73M117L893o272l250P864N918
10301H394j684l085K094K128o0K176n059J079k871o418J699M239J159k826o641
10286e676J668K859j99l29J543k230J403M347M824O788j384l939l484O28M962
10271A1781O030k468k3n404o359k177k447j634j358j4M906P57M442N764j70j65
10255A1461l971n754k658p3J380j204N928O922o74m39p225l273J860M461j686
$$ plain form
10363 -4689 -6666 -3535 2849 -900 -6923 -5898 5289 10718 10171 6365 1935 6579 10153 5946 4864
10348 4864 -806 -8600 -6298 1784 4404 9465 9997 7081 3953 6308 7664 8771 11757 5012 984
10333 984 5281 8202 4961 54 -814 479 -436 3712 -561 -15 -5021 -6241 -7150 -3953 -403 3030
10317 3030 2694 902 -1100 -2873 -4531 -4144 -8075 -3391 -2903 -3876 241 4134 -2138 -5388 2476 8394
10301 8394 6710 3625 5719 7847 7787 9963 4904 5983 3112 -3306 -1607 2632 3791 965 -5676
10286 -5676 -4008 -1149 -1348 -1677 -134 -2364 -961 3386 8210 14998 13614 9675 6191 6819 11781
10271 11781 17811 15343 15320 9916 3557 1380 -1067 -2701 -4059 -4073 833 1590 6032 11796 11626 11461
10255 11461 7490 1736 -922 -995 385 -819 5109 12031 11357 10918 3693 420 2280 6741 5055
10240E055J06j67O627m851j011l081p872O50P041M334L237n82q814K496K130l018
10224B280o925o20n260j416N905L847p83K882k204J99Q826P42m611j037k90r55
10208E80j193m169J450M478j176o6p668j238L636P163M287J527p419n35L874l775
10192b44l15P29N168J548j0169j6J002n1J019R765l276k344M83j233L059k928
10176B197J52m196K563O276N85L368O797L833j486L17r28k789K159N137J5218
10161C9203K5403L8502L6548L0777K6380J8337K1589J4485j2624k2154k3612k5198
10149A67636l3617l6008k4633j4948j3150j5677l447k69l204l446m074m41J939
10136A6661L909K094m572m301m885j910O542j79n192m522o040k494j910j270P029
$$ plain form
10240 5055 5161 4994 11621 6770 5759 2678 -5194 -4544 2497 6831 10068 9486 672 3168 5298 2280
10224 2280 -4645 -5265 -10525 -11941 -6036 -2189 -2972 -90 -2294 -2095 6731 7473 2862 1825 1535 580
10208 580 -613 -4782 -3332 1146 -30 -96 -7764 -9002 -5366 1797 6084 7611 192 -343 3531 -244
10192 -244 -559 170 5338 6886 -3283 -3299 -2297 -2348 -1329 8436 5160 2816 3299 2066 5125 2197
10176 2197 2349 -1847 716 6992 7577 10945 17742 21575 20089 20406 19478 16689 18848 23985 39203
10161 39203 64606 103108 139656 170433 196813 215150 236739 251224 238600 216446 192834 167636
10149 167636 134019 98011 73378 58430 45280 29603 26156 25887 22683 19237 15163 14722 16661
10136 16661 20570 22664 18092 13791 8906 6996 13538 13359 8167 3645 -2395 -4889 -6799 -8069 -1040
10121a040J1654n58K823m541p319k740J77O21M452N898p94J644l85K156N269J603
10105A8920o494p956p665m47l424J541O245O229k058J605K406L141L737K587k056
10090A6311r01J377q58m920k981o823M058L529M832P344K481l462N334k800L693
10075B6214R687J1167J3068J6733J9668M907j226K257n795j2617j3674q041j1774
10062E0574j3178j0415n184j241O37O90m15j995k220o288p483M960l421p628n438
10047h045Q860J1037N57j43l260N015k729n83R93J116K334P00n298O45R39m841
10031G297K646M308M023j155o359k856Q181R55r220l154k956l69O986m413k323
10016A591j104n86Q595L377J305M754j277j358m486j349Q19R22k250K002K384
$$ plain form
10121 -1040 10614 10056 12879 8338 1019 -1721 -1544 -923 3529 9427 8633 10277 9892 12048 17317 18920
10105 18920 12426 4470 -3195 -3642 -7066 -5525 720 6949 4891 6496 8902 12043 15780 18367 16311
10090 16311 15410 16787 15929 11009 8028 1205 5263 8792 13624 20968 23449 19987 25321 22521 26214
10075 26214 35901 47068 60136 76869 96537 101444 100218 102475 96680 84063 70389 62348 50574
10062 50574 37396 26981 21797 20556 21193 21883 21468 19473 17253 10965 3482 8442 5021 -2607 -8045
10047 -8045 815 11852 12409 12266 9006 14021 11292 10709 11702 12818 15152 15852 10554 11199 12138 7297
10031 7297 9943 14251 18274 17119 10760 7904 16085 17040 7820 4666 1710 1341 8327 3914 1591
10016 1591 487 -99 8496 11873 13178 17932 16655 15297 10811 9462 10281 11203 8953 10955 13339
10001A3339k049k74l101l172n977J251j623j046o038P814K587J46l254k356L678
9986g5L53M535k789m865M567P400K019n363j524j968J0004J926k740L918R29l760
9970A2567o450m312k980J870L492m12k228R21L988k536k802Q360l397J680K527
9955A0288p95q33l581P303Q58r60p707l781N222k105j031j328L321j358l318P941
9939H136Q249k057o150K295J081n598J209L211m707n747R546K227N090J766n726
9924A2825l408j66P17K932l233p19P348K645k00J713o571l676m510j660M114L551
9908A1702k371r656L161J890N141j630N919O01k220o361P945L464K757L475n425
9893A8392m420O69j0425K368n163L399N508q94j174N047O758m498q234K822M563
$$ plain form
10001 13339 11290 11016 7915 4743 -1234 17 -1606 -2652 -8690 -876 1711 1857 -1397 -3753 -75
9986 -75 278 4813 2024 -2841 1726 9126 11145 5782 4258 2290 12294 14220 11480 15398 16327 12567
9970 12567 6117 1805 -1175 695 4187 3775 1547 2468 6456 3920 1118 9478 6081 7761 10288
9955 10288 9493 8660 5079 12382 13240 12280 4573 792 6014 3909 2878 1550 4871 3513 195 8136
9939 8136 16385 14328 8178 10473 11554 5956 7165 10376 5669 -78 9468 11695 16785 18551 12825
9924 12825 9417 9251 9968 12900 9667 8948 16296 18941 18741 20454 13883 10207 5697 4037 8151 11702
9908 11702 9331 -325 2836 4726 9867 8237 14156 14757 12537 6176 14121 17585 20342 23817 18392
9893 18392 13972 14641 4216 6584 1421 4820 10328 9434 8260 13307 20065 15567 7333 10155 14718
9878A4718J237L917J161l351m503k699K015j128p69k756KK090O005R814m270r542
9862A1941k312Q86o70N833j662M04j402M79j289j428p56R41M827p19K62r16q193
9845F226N015J913m126J43Q262R045m327K815M523n267r970q61J3563P273j989
9830C2238m208P27p322J979P804l833p12N722p452q868o597K788N162M454K590
9815B4472o280k566j280N770Q077J145q10o7K898N659k524k139k09O323M781L142
9799D6392L103Q51M497K573n055k230L444K295n476J355N044K785k413k252K259
9784E7172J0891P296P651R389k749N72M88j105L765L308Q067O703q90K100O505
9769A19163Q347M344P272J0299O418L392O124N775M682J4120J6052R516K0260
$$ plain form
9878 14718 15955 19872 21033 17682 13179 10480 12495 11367 10598 7842 7844 9934 15939 25753 21483 11941
9862 11941 9629 10515 9845 15678 14016 14420 13018 13497 12208 10780 10024 10965 15792 15073 15335 14419 6226
9845 6226 11241 13154 9028 9171 17433 26478 22151 24966 29489 24222 14252 13391 26954 34227 32238
9830 32238 28030 28757 21435 23414 31218 27385 26673 32395 24943 16075 9478 12266 17428 21882 24472
9815 24472 18192 15626 14346 20116 28193 29338 28528 28461 31359 37018 34494 32355 32146 38469 43250 46392
9799 46392 49495 50346 54843 57416 52361 50131 53575 55870 50394 51749 56793 59578 57165 54913 57172
9784 57172 68063 75359 83010 92399 89650 90222 90710 89605 93370 96678 104745 111448 110558 112658 119163
9769 119163 127510 131854 139126 149425 155843 159235 165359 171134 175816 189936 205988 215504 235764
9756B35764J8120J5923J7560K0179K0111K4446K6573K7487L4515N2119M3224M8538
9744E84559N7352O1616O0376O7097P7996Q8179R0837R8447J01713J04201J04321
9733A496694Q7912P8593O7241L4183m589l6774n3010p1730q8302r5302j00496
9722A314420r6782r4953r2182r0121p8334p0906o3822n7225n8310n3865m6455
9711E11465m6216m0145l1730j9876l0959l4096k0626j1881j1717j5276j9518j5553
9699B13872j2384j3059j2625l056J003o170j2781r035n428q575n943n655r711
9686A10453j2047O63M36n072k305m748j286m837j656o804j596j878p323q577n615
9671D7808n881P227N096k33k612Q30j026p258J872l206m300N147Q30l310m584
$$ plain form
9756 235764 253884 269807 287367 307546 327657 352103 378676 406163 440678 492797 536021 584559
9744 584559 641911 703527 763903 831000 908996 997175 1088012 1186459 1288172 1392373 1496694
9733 1496694 1584606 1663199 1730440 1764623 1760034 1723260 1670250 1598520 1510218 1414916 1314420
9722 1314420 1217638 1122685 1030503 940382 862048 791142 727320 670095 611785 557920 511465
9711 511465 465249 425104 393374 373498 342539 308443 287817 275936 264219 248943 229425 213872
9699 213872 201488 188429 175804 172748 173751 167581 154800 145765 140337 131762 125819 120164 110453
9686 110453 98406 99069 99505 94433 92128 87380 86094 81257 79601 72797 71201 69323 62000 53423 47808
9671 47808 41927 49154 54250 54017 51405 52235 51209 43951 45823 42617 38317 43464 44294 40984 36400
9656C6400P04L986k724K285l407m441m934K000M033k94P1L713j832q377J660N254
9640C4097o234k533P38J682k204n049L172j397m158m66k889P358Q968L088j1408
9625B2765K83p37M013k260j139R69p06j750n152k908l927j582L997M550K978k855
9609A6539n227K581m193J234K034J773o939l734L888L258P653m869o053m639R81
9594D287k726q41M526Q980k27j387o237L77N942M030K579k692n71k974m854K908
9578A1120J234j917O590K37l320l602m410P454M245M061q988n311m40j927P62
9563E788k900J1723J2887j964p277p217m301m413K343M068o864m015J660J821
9549A339M136j468q84j756M65P42l64O082o34R94q65l826J821K704K496p724m706
$$ plain form
9656 36400 37104 41090 38366 40651 37244 32803 27869 29869 33902 33608 33679 37392 35560 27183 28843 34097
9640 34097 27863 25330 26068 27750 25546 20497 23669 22272 18114 17648 14759 22117 31085 34173 22765
9625 22765 23048 22311 26324 24064 22925 23894 23188 21438 16286 13378 9451 7869 11866 16416 19394 16539
9609 16539 11312 13893 9700 10934 12968 14741 7802 4068 7956 11214 18867 13998 7945 3306 4287
9594 4287 1561 720 5246 14226 13999 12612 6375 6752 12694 16724 19303 16611 16040 13066 8212 11120
9578 11120 12354 10437 17027 17264 13944 10342 5932 13386 17631 21692 12704 7393 6953 5026 5788
9563 5788 2888 14611 27498 25534 18257 11040 6739 2326 4669 8737 1873 -2142 -482 1339
9549 1339 5475 4007 3123 1367 1832 2574 2210 8292 7658 8652 7787 3961 5782 8486 10982 3258 -1448
9532a448k285m776J264K622L350K701l329L154j068K618J432J813p648j870M459
9517I89M234k786J968M14l97q47M060m785j784r09j396M007M593k606o387n686
9501g318K584l385K381N442m256J015j619M153O264k881l107K585M592J151Q28
9486H429j140r336n448J475L687q02P725J82Q68P631N687k644j922r377q268J624
9470a629L063p20k81L505m739l128Q363N059q606m004M155K536L019K51m726m124
9454b006n395l583N883N62o448K712O052M381L365k147l988K106L299m748j884
9439a839K263J167K346K223k55j494k40k957j821N715M267o017q71j928J0017
9424A0576L161l850o067j85M742o398N207N352J971K69n768j1390m960q294O157
$$ plain form
9532 -1448 -3733 -8509 -7245 -4623 -1273 1428 -1901 1253 185 2803 4235 6048 -1600 -3470 989
9517 989 5223 2437 4405 4819 4422 3575 7635 2850 1066 157 -1239 2768 7361 4755 -1632 -7318
9501 -7318 -4734 -8119 -5738 -296 -4552 -3537 -5156 -1003 5261 2380 -727 1858 6450 7601 8429
9486 8429 7289 -2047 -7495 -6020 -2333 -3135 4590 4772 5640 13271 18958 16314 14392 5015 -3253 -1629
9470 -1629 1434 714 433 3938 -801 -3929 4434 9493 887 -3117 1038 3574 6593 6844 2118 -2006
9454 -2006 -7401 -10984 -5101 -4539 -10987 -8275 -2223 2158 5523 3376 -612 1494 4793 45 -1839
9439 -1839 424 1591 3937 6160 5905 4411 4171 1214 -607 5108 9375 3358 2487 559 10576
9424 10576 13737 9887 3820 3635 8377 1979 7186 12538 14509 14778 9010 -2380 -7340 -15634 -9477
9409i477Q554j643m491m390Q504N156m36o829m315J773J0630M616k308m48J947
9394F843k23l041m668J500l647k005K187J388j170j080n355L652K57k19k728K829
9378e480J435N068P611n74M054P95M978j317m815l082m837L270N041N91m264m790
9362C684p946K284M882P267L989p143K91P55P97l074j361k180k860p55j335J976
9346g29P55M86j138M582P297L444J44l391j685m121k684J654Q35m787n559P97
9330d100R306M753L587l494m69m324L334O434j057k084j1054j7308k957M969M638
9315i826l101O17N016P136k18L22m538N201J245l369O59n49k724O204J058p449
9299d316l209N347M687K636n066n762n727K509M809R285p448N32j282J372M767
$$ plain form
9409 -9477 -923 -2566 -7057 -11447 -2943 2213 1777 -5052 -9367 -7594 3036 7652 5344 4896 6843
9394 6843 6620 3579 -1089 411 -3236 -5241 -3054 -1666 -2836 -3916 -9271 -5619 -5362 -5581 -8309 -5480
9378 -5480 -4045 1023 8634 8060 12114 12909 17887 16570 11755 8673 3836 7106 12147 12738 8474 3684
9362 3684 -4262 -1978 2904 10171 14160 7017 7308 8063 8860 5786 4425 2245 -615 -1370 -2705 -729
9346 -729 26 512 -626 3956 11253 14697 14841 11450 9765 5644 2960 4614 5449 662 -4897 -4100
9330 -4100 5206 9959 13546 10052 9583 5259 8593 15027 13970 11886 832 -16476 -19433 -14464 -9826
9315 -9826 -12927 -12310 -7294 -158 -376 -54 -4592 609 1854 -1515 -856 -1405 -4129 2075 3133 -4316
9299 -4316 -7525 -2178 2509 5145 79 -5683 -11410 -8901 -4092 5193 -2255 -1723 -3005 -1633 3134
9284C134N512k058n401L726m670l154n99N72l220J694J901j348k683l168M212
9269e550j261l272k293P594N335j088L093j061L100J967M098k418k665k911n229
9254b561l14k269m551R41K543J780n107P70K256Q344M936j1077l879l896J950
9239a0134R4p1L307M750N647K810L474M346k466m721o365m87M040R94k503m572
9223a857K92M448K096J054m480m933K339J368p586L47J6611M487m877o263l093
9208d7J1473k668o705m105K587o17o310L871M612K804n107r023l242M5M146J2442
9192D156Q1p86L604J780k654j0402m200O11j953L562m209k887J166L783K255M619
9176a474k087k088j505j643J457r24m707n898M279J1347K148M175K173K492o595
$$ plain form
9284 3134 8646 6588 1187 4913 243 -2911 -3510 -2938 -6158 -4464 -2563 -3911 -6594 -9762 -5550
9269 -5550 -6811 -10083 -12376 -4782 553 -535 2558 1497 4597 6564 10662 8244 5579 2668 -2561
9254 -2561 -2875 -5144 -9695 -8754 -6211 -4431 -9538 -8768 -6512 1832 6768 -4309 -8188 -12084 -10134
9239 -10134 -10040 -10111 -6804 -2054 3593 6403 9877 14223 11757 7036 671 184 4224 5218 2715 -1857
9223 -1857 -1565 2883 4979 6033 1553 -3380 -1041 327 -7259 -6912 9699 14186 9309 3046 -47
9208 -47 11426 8758 2053 -2052 535 -82 -6392 -2521 2091 4895 -212 -9235 -12477 -12432 -8286 4156
9192 4156 4237 3451 7055 8835 6181 -4221 -8421 -7810 -9763 -6201 -10410 -13297 -12131 -8348 -6093 -1474
9176 -1474 -3561 -5649 -7154 -8797 -7340 -8264 -12971 -18869 -14590 -3243 -1095 3080 5253 7745 1150
9161A150l307l7L463M352k317o131j393n466K443J0868L766n826n501J600j081
9146c417J534M909j734J506K655p274m043O747o06j435m318p5K615L070M85k917
9130b298j392L337m2o86R06l800M270J005l659j742L530L205p653m538J771L407
9114d379L184K004k286j59P19P295J934m023n359k113J872l176K548R064K29l805
9098C549p03N41M283o511M028M105n25l068o214K155J898m497m848L382Q614M670
9082A0859n249J87k034J474L518j352J252l202l321j780M92Q60M43j437l932M769
9066A547L827J98K078n452l988K411j004j177n559j681M704m599N152j664K943
9051b264M297m57p45K221o79K875j154L472K548l563j58j043J042N585Q0m281
$$ plain form
9161 1150 -2157 -2194 1269 5621 3304 -2827 -4220 -9686 -7243 3625 7391 1565 -3936 -2336 -3417
9146 -3417 -1883 3026 1292 2798 5453 -1821 -5864 883 277 -1158 -5476 -5551 -2936 134 619 -2298
9130 -2298 -3690 -353 -395 -1081 -175 -3975 295 1300 -2359 -4101 -571 2634 -5019 -9557 -7786 -4379
9114 -4379 -1195 809 -1477 -1636 -917 6378 8312 4289 -1070 -3183 -1311 -4487 -1939 7125 7354 3549
9098 3549 2846 3387 7670 1159 5187 9292 8767 5699 -515 1640 3538 -959 -5807 -2425 6189 10859
9082 10859 5610 5797 3763 5237 8755 7403 8655 5453 2132 352 844 1704 2147 710 -3222 1547
9066 1547 5374 5572 7650 2198 -1790 621 -383 -1560 -7119 -8800 -4096 -8695 -3543 -5207 -2264
9051 -2264 2033 1576 831 3052 2373 5248 4094 7566 10114 6551 6393 5350 6392 11977 12057 7776
9035G776k829K54l104L63o904l539J726J28J469O51o88L571k316N619K754q58
9019D073j341J445J578p763n786P97L58l748O947K757M520M559m337M247n405
9004B901q749O33M921p98o780m576J053M634M242j071l809J324J0326n15l625
8989A11r54J807j076k671L444N052n205J698l99k107l29O35K534k591J608L718
8973E275o229j694k320Q09N144J760J892j883J741N428o590q148j673l15R2J018
8957e693L647l313J696o92l22N093O208j460J757m22j740L64K373k686p02m045
8941F3K138O525P370n286m480J941j0121n357L552J151R85L870R84j135J714N789
8925I703k067j0346k486m043Q603O566L065j649k03o4K59N90m934M801k878r3
$$ plain form
9035 7776 4947 5201 2097 2460 -4444 -7983 -6257 -6129 -4660 -4009 -4697 -1126 -3442 2177 4931 4073
9019 4073 2732 4177 5755 -2008 -7794 -6997 -6639 -10387 -3440 -683 3837 8396 4059 8306 2901
9004 2901 -5848 -5215 -294 -1092 -7872 -12448 -11395 -6761 -2519 -3590 -7399 -6075 4251 3736 111
8989 111 -843 964 -112 -2783 661 5713 508 2206 1807 -300 -629 6 2540 -51 1557 5275
8973 5275 -954 -2648 -4968 -4159 985 2745 4637 2754 4495 9923 3333 -4815 -6488 -6803 -6711 -5693
8957 -5693 -2046 -5359 -3663 -4355 -4677 416 6624 5164 6921 6499 4759 5123 7496 4810 4108 63
8941 63 2201 8726 16096 10810 6330 8271 -1850 -7207 -3655 -2504 -1519 2351 3335 2200 3914 9703
8925 9703 7636 -2710 -5196 -9239 -636 5930 8995 7346 7143 7079 7338 7928 2994 7795 4917 4824
8909D824k386o200O40q65M184L14j116L717K250j419r452r338K584O754N938K417
8893B846l021m972k657K023l578m295L111Q160M108j791o534Q92M354p59j813
8878c926o032L768Q635L513k284o025m52k943q87M269J762L313L49o054n979j604
8862a0577l616N098j403M502j402M034O15K595O16N762L707m013m046o742n560
8847a0430J297L625k237O261o55m899m239M162L782K985K178l489m322j419J12
8832g288J083k64L025M348j91P04J185l556r4J891m457p159O235K415l986P06
8816e403K080j90N527j49l299m624k520O147K875k306J318j169q354k504P960
8801d611L483J831M055P215q353p864j670K955Q682Q105L415k933N97m283j2083
$$ plain form
8909 4824 2438 -3762 -3122 -3987 197 511 -605 3112 5362 3943 -5509 -14847 -12263 -5509 429 2846
8893 2846 -175 -5147 -7804 -5781 -9359 -13654 -10543 -2383 1725 -66 -6600 -5708 -1354 -2113 -3926
8878 -3926 -9958 -6190 2445 5958 3674 -2351 -2803 -5746 -6633 -2364 -602 2711 3060 -2994 -8973 -10577
8862 -10577 -14193 -9095 -10498 -5996 -7398 -3364 -2749 -154 462 6224 9931 5918 1872 -4870 -10430
8847 -10430 -9133 -5508 -7745 -1484 -2139 -7038 -11277 -7115 -3333 -348 1830 -1659 -5981 -7400 -7288
8832 -7288 -6205 -6469 -3444 904 713 1417 2602 -954 -1048 843 -3614 -10773 -4538 -2123 -6109 -5403
8816 -5403 -3323 -3513 2014 1865 -1434 -6058 -8578 -2431 444 -1862 -544 -1713 -10067 -12571 -4611
8801 -4611 -1128 703 4758 11973 3620 -4244 -5914 -2959 5723 13828 17243 14310 14907 10624 -1459
8786a459m108l83j926M865J883p877l298R252J767k355l147M502j925K51j957
8771e915l773K543k233N184k207j675K279k65l83M716M765K94K168l500n470N016
8755A544L646j0203J297N376L124p486p768K827P367K092N830j285l385J2114
8741A5090K581p522o980j0540m284Q498P775j735L614K635o582k594N634M59L600
8726I649n549m351k792o752M115R762J892o837l649j691M836K895J615l456n648
8711e961K306J807q82J505K673J253k103j086M314J802j518r76r096m270l373
8696a3605M065P369L631K684m808o405k120M922M622p791K440Q519R50o67K743
8681F549m012o534k146M149O678M798o970m642j511K662L488k910l394l652J928
$$ plain form
8786 -1459 -5567 -5950 -7876 -3011 -1128 -9005 -12303 -3051 -1284 -3639 -6786 -2284 -4209 -3958 -5915
8771 -5915 -9688 -7145 -9378 -4194 -6401 -8076 -5797 -6062 -6445 -1729 3036 3330 5498 1998 -3472 1544
8755 1544 5190 -5013 -3716 1660 4784 -2702 -10470 -7643 -276 1816 7646 6361 2976 15090
8741 15090 17671 10149 3169 -7371 -11655 -3157 4618 2883 6497 9132 2550 -44 5590 6049 9649
8726 9649 4100 -251 -3043 -9795 -5680 4082 5974 -863 -4512 -6203 -1367 1528 3143 -313 -5961
8711 -5961 -3655 -1848 -2730 -1225 1448 2701 598 -488 3826 5628 4110 3134 -5962 -10232 -13605
8696 -13605 -9540 -2171 1460 4144 -664 -7069 -9189 -4267 355 -7436 -4996 3523 4473 3806 6549
8681 6549 2537 -3997 -6143 -1994 4684 9482 2512 -2130 -3641 -979 2509 -401 -3795 -7447 -5519
8666e519J651l793J54M283M835q61m267K018M657l727m565o542M932O200K141
8651A597J1479Q542l238p696n509l124N546L063p59r55k46r22M770K579m992n500
8635D635O22J173k511J440L606q796j1246M436J2011J167m989r72N587L979L512
8620A3654J68n26J495l159n398j750L625n952m874J456L886O5k515K239J567n618
8604a637L41J81L772R70M664K487m527k523k88j039l684j685J833L917r69l985
8588b172p868J309M018J0045L322m718j697k714J552M323k355J620p633q137J723
8573i382O989J966n90K070l329R68O714R45n68J324j805L85M384j082p83p202
8557A004p842N350L819l105o82j296j109k43N167o298k263j536j040j397N628
$$ plain form
8666 -5519 -3868 -7661 -7507 -3224 1611 750 -3517 -1499 3158 -569 -5134 -11676 -6744 -544 1597
8651 1597 13076 21618 18380 10684 5175 2051 7597 10660 9901 8946 8700 7778 12548 15127 10135 4635
8635 4635 5257 6430 3919 5359 8965 169 -11077 -6641 5370 6537 1548 576 6163 10142 13654
8620 13654 13822 13296 14791 11632 6234 4484 8109 2157 -2717 -1261 2625 2690 175 2414 3981 -1637
8604 -1637 -1296 -1115 2657 3627 8291 10778 6251 3728 3440 2401 -1283 -2968 -1135 2782 1813 -2172
8588 -2172 -10040 -8731 -4713 5332 8654 3936 2239 -475 1077 5400 3045 4665 -2968 -11105 -9382
8573 -9382 -2393 -427 -1017 1053 -2276 -1308 5406 6351 5783 7107 5302 5687 10071 8989 8206 1004
8557 1004 -6838 -1488 2331 -774 -1456 -2752 -3861 -4104 1063 -5235 -7498 -9034 -10074 -11471 -5843
8542e843L441K519J3639q67o674l069m252q255K181O637J922m296o329O987M158
8527A899k012l402J947r52l51j448j890L441M911J25K064j147q392J543j43M907
8511A100J037n734j909n783l12J008j559J113L157J716L308J443O025m863n55
8496h08K669o836l169J714P283Q516m249l726k695N450j627n411l526r08M632
8481b691Q33J382k811j107k186j819k941N936N02j729M621k86L21p38p00n618
8465i031j69O87K093J219j041K427J932J067r42r23l180p437L400J0838J655m817
8449b222k657m04R75O769L17o822J072P81k813M725Q815L133l637l819m209p423
8433g419n672N311j655k286K039m62m508K193l90N016O999j48l355k274k407l15
$$ plain form
8542 -5843 -2402 117 13756 12889 6215 3146 -1106 -9361 -7180 -543 1379 -2917 -9246 -2259 1899
8527 1899 -113 -3515 -1568 -2520 -2871 -4319 -6209 -2768 2143 2268 4332 3185 -5207 -3664 -3807 1100
8511 1100 2137 -3597 -5506 -11289 -11601 -10593 -12152 -11039 -7882 -6166 -2858 -1415 4610 -253 -808
8496 -808 1861 -4975 -8144 -6430 853 9369 5120 1394 -1301 4149 2522 -2889 -6415 -7323 -2691
8481 -2691 -1858 -476 -3287 -4394 -6580 -8399 -11340 -5404 -4902 -6631 -2010 -2296 -1975 -2713 -3413 -9031
8465 -9031 -9200 -8513 -6420 -5201 -6242 -3815 -1883 -816 -1758 -2681 -5861 -13298 -9898 940 2595 -2222
8449 -2222 -4879 -5283 -4308 2461 2778 -4044 -2972 -2191 -5004 -279 8536 11669 8032 4213 4 -7419
8433 -7419 -13091 -7780 -9435 -11721 -9682 -10144 -14652 -12459 -12849 -7833 -834 -982 -4337 -6611 -9018 -9333
8417i333q66k989J176j313O535L157J526J400M175l62l113N32K226N526k393o720
8401h36k854o604P21L132N412O371P009J912o329o940m313k999J625N583O939
8386G829K611k942P302L167l200q914r258J551L496R3n638M696M870n73q564k310
8370e784P161J496o821Q81P069k901Q50l033m074j280K919j910j948L636r93L549
8354a183M882M824l163k057L043k000K020q22j222n433l556M856O848p06k553
8339C778K918k703l524P459P25m071j735q32O19M457p41J956O09k762k243k537
8323A373O074L959n242M649l075m889j784j68l880K41M408K41P6m883L488J797
8307B385K439j584o433o731l71M393J3644M217L90k645n427j897K845L338K50
$$ plain form
8417 -9333 -10199 -13188 -12012 -13325 -6790 -3633 -2107 -707 3468 3106 -7 525 2751 8277 5884 -836
8401 -836 -3690 -10294 -9573 -6441 -1029 5342 12351 14263 7934 994 -3319 -6318 -4693 890 7829
8386 7829 10440 7498 14800 17967 14767 5853 -3405 -1854 1642 1735 -3903 793 5663 5090 -3474 -5784
8370 -5784 1377 2873 -3948 -3067 4002 1101 1951 -1082 -5156 -6436 -3517 -5427 -7375 -3739 -4732 -1183
8354 -1183 3699 8523 5360 3303 6346 4346 6366 5544 4322 -1111 -4667 189 7037 6331 3778
8339 3778 6696 3993 469 7928 8653 4582 2847 2015 2634 7091 6350 8306 8915 6153 3910 1373
8323 1373 7447 11406 6164 10813 7738 2849 1065 897 -2983 -2742 1666 1907 1983 -2900 588 2385
8307 2385 4824 3240 -3193 -9924 -10295 -5902 7742 11959 12349 9704 4277 2380 5225 8563 8813
8292H813m732k052M044m315n846K045j273M494j013q702K66K695M581J574l479
8277b900J455l617l610M493K84j220R476J515k691k67L309Q313N399L662o96p470
8261A5435k548q656j1242J40q58n77M698j656n89L292P328K562r618m900j022
8246h211j416P78R490M188r0j710j454N810k596r35r67o33k522j0460k04M159
8230f773M448J284k770n789l88P006L305J270l63n300k267K521M829m428r00P134
8214B819l035J05j022p24L049J322j207l59k850N569k078p468M648K433J771K941
8198E914n0L720n157l742O015q33R80m555l386n843j008m063O092M443k179j193
8182d845p306j53l15J731j524J06K560M638K958K810k876m567n48K614m376l261
$$ plain form
8292 8813 4081 2029 6073 1758 -4088 -2043 -3316 1178 165 -8537 -8271 -5576 -995 579 -2900
8277 -2900 -1445 -5062 -8672 -4179 -3895 -5115 4361 5876 3185 2918 6227 14540 19939 23601 22905 15435
8261 15435 12887 4231 -7011 -6871 -7729 -8306 -3608 -5264 -5853 -2561 4767 7329 -2289 -7189 -8211
8246 -8211 -9627 -8849 641 4829 4739 3029 1575 7385 4789 3854 2887 2254 -268 -10728 -10932 -6773
8230 -6773 -2325 -1041 -3811 -9600 -9988 -2982 323 1593 1230 -4070 -6337 -3816 1013 -3415 -4315 2819
8214 2819 -216 -111 -1133 -1857 1192 2514 1307 948 -1902 3667 1589 -5879 -1231 1202 2973 5914
8198 5914 5864 9584 4427 685 6700 5867 6847 2292 -1094 -6937 -7945 -12008 -5916 -1473 -3652 -4845
8182 -4845 -12151 -12304 -12619 -10888 -12412 -12306 -9746 -5108 -2150 660 -2216 -6783 -7331 -4717 -9093 -12354
8166a2354L835L359m151m739M478M940K576J944J327k853k485K784l204k010m507
8151a1060l740L203P746j0828q95k703j762N998J0320j54l205L672J928m692j864
8136h036L54n590K925K204K20K258j624j064M814m841n51M646l631j12J385K767
8120c876j503n097O427r19L341L575L708j6n421l107m130O758Q80n880M187K489
8104A416k386n69J25m841J60l058j616O690J142m494k984K236L248J544L771n45
8088a61n2j062J893K82m120p84k772R03k274m10Q205L437l5P732k831L223K695
8071A3869n592m062r357k76J652J646J065J61J425N48J90J186l813K090L259r60
8055C031Q126j268j1588L769k208j451K600o0l039n298L814l39L311N609r40r81
$$ plain form
8166 -12354 -8519 -5160 -9311 -14050 -9572 -4632 -2056 -112 1215 -1638 -4123 -1339 -4543 -6553 -11060
8151 -11060 -14800 -11597 -3851 -14679 -15574 -18277 -20039 -14041 -3721 -3875 -7080 -3408 -1480 -6172 -8036
8136 -8036 -7682 -13272 -10347 -8143 -7923 -5665 -7289 -8353 -3539 -8380 -8931 -4285 -7916 -8028 -6643 -3876
8120 -3876 -5379 -10476 -4049 -4968 -1627 1948 5656 5640 219 -2888 -7018 -260 620 -5260 -1073 1416
8104 1416 -970 -1539 -1414 -6255 -6095 -9153 -10769 -4079 -2937 -7431 -10415 -8179 -4931 -3387 384 -161
8088 -161 -213 -1275 618 900 -3220 -4004 -6776 -5873 -8147 -8557 -352 3085 3050 10782 7951 11174 13869
8071 13869 8277 4215 -5142 -5418 -3766 -2120 -1055 -894 531 1079 1269 2455 -1358 732 3991 3031
8055 3031 11157 9889 -1699 2070 -138 -1589 1011 951 -2088 -7386 -3572 -3911 -600 5009 4069 3088
8039C088J751RM89M21j0223q583K613M473M340M212P852Q35J723n004j0544k838
8023e386P157K652Q94k484J70l734n560O02L301k339M190L778N140l872k922j261
8007C26k527m955L184J970J371J863L891k235j0340m714P125Q44P611L513k381
7992D546p368K671Q037K088o467m850m527l180j629L144J545L183l497K594K979
7977g31k53L591k158o728R85L473J260j717j14L519R037N517k593j4069k743K079
7961a645M370j929m247j570L580M952k959J586j211M213rM727K189p306j263m623
7945a145K616K365p20J244j863K058L209K623R04O15n863j775%k027l932O80R113
7928H102K396j885n817k103m007O837o54K639O097N28M541J954p573o065j128
$$ plain form
8039 3088 4839 4848 5337 5758 -4465 -13048 -10435 -5962 -1622 2590 10442 11277 13000 7996 -2548 -5386
8023 -5386 1771 4423 5317 2833 3003 -731 -6291 -5689 -2388 -4727 -537 3241 8381 4509 1587 326
8007 326 -2201 -7156 -3972 -2002 -631 1232 5123 2888 -7452 -12166 -5041 -4197 3414 6927 4546
7992 4546 -2822 -151 7886 9974 3507 -1343 -5870 -9050 -10679 -7535 -5990 -2807 -6304 -3710 -731
7977 -731 -984 2607 449 -6279 -5294 -1821 -561 -2278 -2392 1127 10164 15681 13088 -981 -3724 -1645
7961 -1645 2725 796 -3451 -5021 -1441 3511 552 2138 927 5140 5131 9858 12047 4741 3478 -1145
7945 -1145 1471 3836 3116 4360 2497 4555 7764 10387 11291 11906 6043 4268 4268 2241 -1691 -1011 8102
7928 8102 10498 8613 2796 693 -3314 3523 2869 5508 11605 12133 16674 18628 11055 4990 3862
7913C862L614k68m468l076L57N636K144k614r907R94J171k802Q190K409K068q01
7897F509l248o23k173P486L866k429o55j17K482J324l426n452j318M582K503l159
7881F152j453l875J599j045J056O833o171j0961Q304P489M758k264l010p932q73
7866a393q135L75M03J308Q850N033k05l917K532N690o703l465l502j178j731m055
7850a0093K897K219P860Q953k752K613k626m719J212J983k99j0946j132L151k41
7835a920O62l958K849J13k053k443L029M618Q951q6j298o660o73L759p527p109
7819i746N327k379m118q343O077K3767J5860J2246o449j5898j6629p599K57J0063
7805B436P672J3846j506j2995j5557k714J878P110o706p560M475m5Q237M613K533
$$ plain form
7913 3862 7476 7208 2740 -336 21 5657 7801 5187 -4720 -3726 -2555 -5357 2833 5242 7310 6509
7897 6509 3261 2638 465 7951 11817 9388 8733 8616 11098 12422 8996 3544 2226 6808 9311 6152
7881 6152 4699 824 2423 1378 2434 9267 3096 -7865 439 7928 12686 10422 7412 -520 -1393
7866 -1393 -9528 -9153 -8750 -7442 1408 6441 6236 2319 4851 10541 3838 373 -3129 -4307 -6038 -10093
7850 -10093 -7196 -4977 2883 11836 9084 11697 9071 4352 5564 7547 7248 -3698 -4830 -1679 -1920
7835 -1920 -1258 -5216 -2367 -2254 -4307 -6750 -3721 897 9848 9762 8464 1804 1131 4890 -2637 -9746
7819 -9746 -4419 -6798 -10916 -19259 -13182 10585 26445 38691 32242 16344 -285 -7884 -7627 2436
7805 2436 10108 23954 22448 9453 -6104 -8818 -6940 170 -6536 -14096 -9621 -9666 -1429 3184 5717
7790E717J130m409J140P197k399l68m853r565O416K096m651L653M299k050J075
7775D428P239R78o519j1031o522P544N743K644P388J450m61o333n671l96j914
7760a433j0742L770P583K685k378Q44m453k255Q77J535J653j189m029L595M556
7745F19J360J621Q76k812J87J371K283k584p210j223L633j061N73l99Q86J478
7729d02L331l446p19L312j178J74k974J081k818M34m71J217K548L922l303l978
7713c270m258P28N246M649L542L66m55m009r524l544J547j716m52M922N749K29
7697b50K219k318j005M793m177j338k046J613j337m865m226K418K297L267L214
7682a741L097M248K946L120k411m829p480L68q32K634L734K012J150l112l239
$$ plain form
7790 5717 6847 2438 3578 10775 8376 8008 3155 -6410 6 2102 -2549 1104 5403 3353 4428
7775 4428 11667 12645 6126 -4905 -11427 -3883 1860 4504 11892 13342 12881 6548 877 481 -1433
7760 -1433 -12175 -8405 -822 1863 -515 329 -4124 -6379 -5502 -3967 -2314 -3503 -7532 -3937 619
7745 619 1979 3600 4476 1664 1851 3222 5505 2921 -4289 -5512 -1879 -2940 -2367 -2766 -1880 -402
7729 -402 2929 -517 -1236 2076 898 1072 -1902 -821 -3639 -3205 -3676 -2459 89 4011 708 -3270
7713 -3270 -7528 -6800 -1554 3095 6637 7003 6548 2539 -6985 -10529 -8982 -10698 -11150 -6228 -479 -250
7697 -250 1969 -349 -1354 3439 -738 -2076 -4122 -2509 -3846 -8711 -12937 -10519 -8222 -4955 -1741
7682 -1741 1356 5604 8550 11670 9259 4430 -3050 -2682 -3514 -880 2854 4866 6016 2904 -335
7667c35n64J32p58k800K801Q012L547m035p047K770n4l675J289n97l456J366M619
7650A215o21j816k934N55J430pL278l913p232m50J2795N414m159j779K684J576
7634F036n221L523P888N333j4410j1249j484Q858K840J0053N75k311j550k463
7620F418J17J909j11m758j243j037N936L817k807L592P12j2092o673Jj561J688
7604f092q02J789L882R82L763r235k413M931J0641K09j3301K369N587J36O510
7589H956j81n19j848p227j229J448m934n792k380O192K504k87J912L626M657l791
7573A107k449J405K545J132k231q080j001P61N568N991J680l829k413M70p75j527
7557a646O054m593j070j696p1l814j597m40j626L312P058O031l727j862j679l321
$$ plain form
7667 -335 -899 -767 -1525 -4325 -1524 6488 10035 6000 -1047 1723 1669 -2006 -717 -1314 -4770 -3404 1215
7650 1215 594 -1222 -4156 -3601 -2171 -2178 1100 -2813 -10045 -10495 2300 7714 3555 1776 4460 6036
7634 6036 815 4338 12226 17559 3149 -8100 -9584 -726 2114 12167 12742 10431 8881 6418
7620 6418 6535 8444 8333 3575 2332 1295 7231 11048 8241 11833 12545 453 -6220 -6219 -7780 -6092
7604 -6092 -6894 -5105 -1223 -241 3522 -5713 -8126 -3195 7446 7655 -5646 -3277 2310 2446 8956
7589 8956 8775 8256 6408 -819 -2048 -600 -5534 -11326 -13706 -7514 -5010 -5297 -3385 241 4898 1107
7573 1107 -1342 63 2608 3740 1509 -6571 -7572 -6811 -1243 4748 6428 2599 186 656 -119 -1646
7557 -1646 4408 -185 -1255 -2951 -3022 -6836 -8433 -8873 -10499 -7187 -129 5902 2175 313 -1366 -4687
7541d687L812j876M504N977j12l524K273k904m306n447p497Q374j35J560j541
7526e529M947N25M273Q41k926q90N76k605L104N916L62p44p99n882j4745R22J790
7509a0864j704q92O159N15J799J726K204K889l876o396j805O135K672L269L815
7494E646K195l60m341m336p89N293l894n632P9K039J1204P75k678q71J40J213
7478E683P405o808q856p31j724j671k45L239R31l153n171m092l18J2296M014J454
7462B253o116n764o937K119q21P045J0699K411K842j738K37Q14j249n12L162p65
7446G680j861k671l826L505P715J012m846p601p152O7L359r87k865m400K217P365
7430c289p4N82Q16j063M759p833p898P623N904j216L339k792o555q1l329J279
$$ plain form
7541 -4687 -875 -2751 1753 7730 7618 4094 6367 3463 -843 -6290 -13787 -5413 -5548 -3988 -5529
7526 -5529 -582 -57 4216 5057 2131 1241 1817 -788 2316 8232 8594 7850 7051 1169 -13576 -12654 -10864
7509 -10864 -12568 -13460 -7301 -6786 -4987 -3261 -1057 1832 -2044 -8440 -10245 -4110 -1438 1831 5646
7494 5646 7841 7481 3140 -1196 -1985 3308 -586 -6218 -6139 -4100 7104 7879 5201 4330 4470 5683
7478 5683 13088 6280 -2576 -3307 -5031 -6702 -6947 -3708 -2777 -5930 -11101 -15193 -15511 -3215 799 2253
7462 2253 -3863 -9627 -16564 -14445 -15266 -8221 2478 4889 7731 5993 6230 7044 5795 5283 8445 7680
7446 7680 5819 3148 -678 2827 10542 11554 6708 -893 -8045 -7978 -4619 -5606 -8471 -12871 -10654 -3289
7430 -3289 -3363 -2781 -1965 -3028 1731 -6102 -14000 -6377 -473 -1689 1650 -1142 -7697 -7778 -11107 -9828
7414i828P478p79k441M053m99k128K09J40n572q163L957M868L458K234n358m692
7398a3063l90Q802K708L195K889j1003o161l25L483M857m833L77M693M089K039
7383A357j672l62j662o405L77O539j600q038o002J952O216M256J51j508p87p12
7367g900k668M029L092M483K236q70j399o40j945k069K81O571J47J93L631Q621
7351A5793O25l688m304K370k524K125l370k08p50o337o059j739N151M438p74K989
7335C738N33L823K344k955K80k565l594n431j427J62j045J920J949K260n435l829
7319i272N883j990n002J291N403L205j255L514M53L13m705k569j712j902O565
7304a780K151l166J493J845o93l071o391L275j6j688L811o61O74j414j945j909
$$ plain form
7414 -9828 -2350 -3129 -5570 -1517 -2016 -4144 -3935 -3795 -9367 -17530 -13573 -8705 -5247 -3013 -8371 -13063
7398 -13063 -13453 -4651 -1943 1252 4141 -6862 -13023 -13348 -9865 -5008 -9841 -9464 -4771 -682 1357
7383 1357 -315 -677 -2339 -8744 -8367 -1828 -3428 -11466 -17468 -15516 -9300 -5044 -4893 -6401 -7188 -7900
7367 -7900 -10568 -6539 -3447 1036 3272 2402 1003 363 -1582 -3651 -3370 3201 3348 3541 7172 15793
7351 15793 16418 12730 8426 10796 8272 10397 7027 6819 6069 -268 -6327 -8066 -2915 1523 749 3738
7335 3738 4271 8094 10438 7483 7763 5198 1604 -3827 -5254 -5092 -6137 -4217 -2268 -8 -5443 -9272
7319 -9272 -3389 -5379 -10381 -9090 -3687 -482 -1737 1777 2230 2543 -2162 -4731 -6443 -8345 -1780
7304 -1780 371 -2795 -1302 543 -150 -3221 -9612 -6337 -6353 -8041 -4230 -4891 -4217 -5631 -7576 -9485
7288i485Q538R638L19j715j844n700l604j370m582p27l738O369J278m515M915
7273f223Q079P06m398r206j013J806J826M003P25o668q60M336M153k189L119M972
7257C168p072l755O536M66K382o97n206R64j304r37j519L267j459l867K169j88
7241g052n67J527K998J469K097L209N713j219p970m914n68P310n145L5L273K356
7225B552L010J526k978p26K532O364N021k627j225n931m131l057k155O391M369
7210H935L603k042p85n481m118J998K228L194l505l986L936j21K52K433k976p68
7194B797j767J1j304o9m22j083l322O69M613P549L279k130k912j0443j0818M251
7178a1101K138Q478P110k600j899o448k356J606k715l83K377j59J915j013J608
$$ plain form
7288 -9485 -947 8691 9010 7295 5451 -249 -3853 -5223 -9805 -10532 -14270 -7901 -6623 -11138 -6223
7273 -6223 1856 2562 -1836 -11042 -12055 -10249 -8423 -4420 -3695 -10363 -11223 -6887 -2734 -4923 -1804 3168
7257 3168 -3904 -7659 -1123 -657 1725 1028 -4178 -3214 -4518 -5455 -6974 -3707 -5166 -9033 -6864 -7052
7241 -7052 -7619 -6092 -3094 -1625 472 3681 9394 8175 205 -4709 -5277 2033 -3112 -3077 196 2552
7225 2552 5562 7088 4110 3384 5916 12280 17301 14674 13449 7518 3387 330 -1825 4566 8935
7210 8935 12538 10496 9711 4230 112 2110 4338 7532 4027 41 3977 3856 4108 6541 3565 2797
7194 2797 1030 1041 -263 -332 -754 -1837 -5159 -4490 123 7672 10951 8821 5909 -4534 -15352 -11101
7178 -11101 -8963 -485 6625 4025 2126 -4322 -6678 -5072 -7787 -8170 -5793 -5952 -4037 -5050 -3442
7163c442K92m043J474J500m193K337K092m402j464N276O443k01L20L41L749j064
7147E015o414m102l111R865N654O05l117O695M542n742p258k905L693k883l301
7132b764k146k671p35J188Q70K827k508l913P048k357l850j75n90O20Q58m395
7116a2693k396N802Q169P865N285J184r90p230j488l055l772j799K657l104j602
7101g167J660m029L639L65M629J985m835j438P61m213n367m081L385N033N862
7086c811N559q931P99M302K311R644q58o162l256l667m691m073Q347M598o6k401
7070b356n881l861O089p84K812K024j392J011j086p464j633M550J0817J1050K69
7055A4165J066l34o441m068J188K023k539j1132n808R74M33k770K378L805Q395
$$ plain form
7163 -3442 -3150 -7193 -5719 -4219 -8412 -6075 -3983 -8385 -9849 -4573 1870 1669 1989 2330 6079 5015
7147 5015 -1399 -5501 -8612 1253 6907 7512 4395 11090 15632 9890 2632 -273 3420 537 -2764
7132 -2764 -4910 -7581 -8316 -7128 -6258 -3431 -5939 -9852 -2804 -5161 -9011 -9186 -9776 -9156 -8298 -12693
7116 -12693 -15089 -9287 -1118 6747 12032 13216 12226 4996 3508 453 -3319 -5118 -2461 -5565 -7167
7101 -7167 -5507 -9536 -5897 -5532 -903 1082 -3753 -5191 -4430 -8643 -14010 -18091 -14706 -9673 -3811
7086 -3811 1748 -7183 -6384 -2082 229 9873 9015 2853 -403 -4070 -8761 -12834 -4487 111 45 -2356
7070 -2356 -8237 -12098 -6009 -6793 -3981 -1957 -3349 -2338 -3424 -10888 -12521 -7971 2846 13896 14165
7055 14165 15231 14897 8456 4388 5576 7599 5060 -6072 -11880 -10906 -10473 -13243 -10865 -7060 1335
7040A335N794N626q523j2367k300M003Q511N600l022k595M708k35j158n349J019
7025A047k168j359K84n383l156k382l933l485m8J667K774P458K108l11j91M095
7009b983P059L880P143r06M145k757j5461n024n836R068P127p994K171K383l018
6994a003n252J427M015n181L236R628p81j62L15n647k565k386L008N103j903l683
6978a831l112l083J207N903j252k161m25N938P03r363M26O277L395M071m486m864
6962b657M26J061J854k538j071o81N053n422K04M539m519p667K420L779N389n79
6946d09m039J562M213M942o547o869K328M563M353K32l710j576n117m611L635
6931g050M809N422N105J043N33j647q772n428J491P266L64K7j055k894q9k830
$$ plain form
7040 1335 7129 12755 4232 -8135 -10435 -6432 2079 7679 4657 2062 6770 6535 5377 28 1047
7025 1047 -1121 -2480 -2196 -7579 -10735 -13117 -17050 -20535 -20583 -18916 -16142 -8684 -6576 -6887 -7078 -2983
7009 -2983 4076 7956 15099 14193 18338 15581 120 -4904 -10740 -1672 5455 -2539 -368 2015 -1003
6994 -1003 -6255 -4828 -813 -5994 -2758 6870 6089 5927 6242 595 -1970 -4356 -1348 3755 1852 -1831
6978 -1831 -4943 -8026 -6819 -916 -2168 -4329 -4754 1184 1887 -7476 -7050 -773 2622 6693 2207 -2657
6962 -2657 -2231 -1170 684 -1854 -2925 -3606 1447 -3975 -3771 768 -3751 -11418 -8998 -5219 170 -409
6946 -409 -4448 -2886 1327 6269 -278 -7147 -4819 -256 4097 4329 619 -957 -6074 -10685 -7050
6931 -7050 -2241 3181 8286 9329 9862 8215 -557 -5985 -4494 2772 3136 3163 2108 -786 -875 -3705
6915c705j972L094O89l799k843O915K574M031M881o81m835j077n787l912j348
6900g775J253L618L49n931n751n148l418P405L624O934K246L811o306k245n671
6885a3005M553M855l634L468N339Q13L736M161j053M104J313o316j1484k8l998
6870g176R47L692m297N752P334L179L28J477l092j400n563l929L719Q3K269M068
6854G391j499o48n272o902Q60N314P236J554N3L894m277K898k107J026l381n490
6838F50J609mJ930J63J029j437q521k893J1649L110Q3j1705l822n3K256L411O736
6821D191J500l199j801J554J121L326n407o020Q01K105m338j133J069j009l14
6806g554l627l084P01L941M675O39K705N103K328K725J469r421p213O5K936J1406
$$ plain form
6915 -3705 -5677 -2583 -1894 -5693 -8536 -1621 953 4984 9865 9184 4349 3272 -2515 -6427 -7775
6900 -7775 -6522 -2904 -2555 -8486 -14237 -19385 -22803 -15398 -11774 -4840 -2594 1217 -5089 -7334 -13005
6885 -13005 -8452 -3597 -7231 -3763 1576 2389 6125 10286 9233 13337 14650 8334 -3150 -3178 -7176
6870 -7176 -6229 -2537 -6834 -1082 6252 9431 9759 11236 8144 6744 1181 -2748 971 1054 3323 7391
6854 7391 5892 5244 -28 -6930 -6070 -756 6480 8034 8087 11981 7704 10602 8495 9521 6140 650
6838 650 2259 2255 4185 4348 5377 3940 -4581 -7474 4175 7285 7368 -4337 -8159 -8212 -5956 -2545 4191
6821 4191 5691 2492 691 2245 3366 6692 1285 -4735 -3934 -1829 -6167 -7300 -6231 -7240 -7554
6806 -7554 -11181 -14265 -13564 -9623 -4948 -4309 -1604 3499 5827 8552 10021 600 -6613 -6548 -3612 7794
6790G794N23j1723M41K601j392n635m630j772R33P260Q264M964r08j229j617K57
6774D131j423J876M331K834o466j816l842k146L971O567j843l706m392j843N24
6759c243L467L819n473K643n08J632K272p88p47O676J207l411O11K033N241k10
6743A5221j998m639k688o104j270j870M010k023j118M556J158l069o005l28n581
6728a1748k675P540J077J011P6M449J401R30J070l943l773k777n938M701J429
6713g170O204N827j258p904J315K654m436n942p050L504M639N057M530n54L43
6698b41l193o898O146L138j349K723M131k086p485p669k348j255O350N650R2K46
6682d048P38j50M360m018n412j932O380P580K64o007q31J356J180j118K519N055
$$ plain form
6790 7794 8317 -3406 -2965 -364 -1756 -7391 -12021 -13793 -12860 -5600 2664 7628 6720 5491 3874 4131
6774 4131 2708 4584 8915 11749 5283 3467 -375 -2521 1450 8017 6174 2468 -1924 -3767 -3243
6759 -3243 224 4043 -1430 1213 705 2337 4609 3821 3074 9750 10957 7546 8157 10190 15431 15221
6743 15221 13223 8584 5896 -208 -1478 -3348 662 -1361 -2479 2077 3235 166 -5839 -6167 -11748
6728 -11748 -14423 -6883 -5806 -4795 -4719 -270 1131 2061 3131 -812 -4585 -7362 -13300 -8599 -7170
6713 -7170 -966 4861 3603 -4301 -2986 -332 -4768 -10710 -17760 -14256 -9617 -4560 -30 -584 -241
6698 -241 -3434 -10332 -4186 -1048 -2397 326 4457 2371 -5114 -12783 -15131 -16386 -10036 -4386 -4294 -4048
6682 -4048 -3310 -3460 900 -3118 -8530 -10462 -4082 3498 3762 -2245 -3076 -1720 -540 -1658 861 5916
6666E916n808o371j588q61l618j367J709K236K26J891P329R275k061p688k973
6651c753N542M085m333o203j065M45p75j625O453J1481o370n504j411Q29q53l656
6635f713Q88N31r7Q00J146O487L158k533j178j511j177k305k461J165j424N464
6619B40M309r941m719K919N46L277L615L321L15j609N473k288l506m467j009j019
6603d543K070j036l750J0349O676q489l867N44j857l855k123N293M063R243J923
6588A0641M332k75p348N68k930m900n274m537P647J146J85J60l661o364P635q00
6572c775k4L496L553m569J1512N616j783r173j1049j04m8M087J0285j116K124
6557I032j233l775n179J164o3j133K561M362O34p4N94j814k572l43k947k295p273
$$ plain form
6666 5916 108 -6263 -7851 -8712 -12330 -13697 -11988 -9752 -9526 -7635 -306 8969 6908 -780 -3753
6651 -3753 1789 5874 1541 -4662 -5727 -5282 -6057 -7682 -1229 10252 3882 -1622 -3033 -2204 -3057 -6713
6635 -6713 -5825 -5294 -5391 -4591 -3445 3042 6200 3667 2489 978 -199 -2504 -4965 -3800 -5224 240
6619 240 4549 -5392 -10111 -7192 -6646 -3369 246 3567 3882 2273 7746 5458 1952 -2515 -3524 -4543
6603 -4543 -2473 -3509 -7259 3090 9766 1277 -2590 -2046 -3903 -7758 -9881 -4588 -525 8718 10641
6588 10641 14973 14698 7350 7918 4988 88 -5186 -9723 -2076 -930 -745 -585 -4246 -10610 -2975 -3775
6572 -3775 -3799 -303 3250 -1319 10193 15809 14026 4853 -6196 -6300 -6348 -2261 8024 6908 9032
6557 9032 7799 4024 -1155 9 -54 -1187 1374 5736 6370 6296 6890 5076 2504 2161 -786 -3081 -10354
6540a0354J388l177k716n03J791L17l6n97p747M570R836n282m345l3K681O49O27
6523a2931N656K951L652L957l417l478l705K273l992J116N956o917J861P388P849
6508H219Q7m980k950j96n739n772L558L677M456k814J77k832n005m127k44O677
6492g808M000K784M412n082k625j451P053J272j540k312j97l76j007j617O575
6477B081M905j597o984k510n378J701N701L885J785o467k750J468K936J155j532
6462a601K467J040o072l548L110L899R529n594n484j146j027N00j165k018o578
6447a3688J621Q133n08J640P030k123k180m328l810K272J867o85K636L651L140
6432D668P44J064m765l480k264J885k865J573K318k286j706o174m400j229P846
$$ plain form
6540 -10354 -8966 -12143 -14859 -15362 -13571 -13254 -13290 -13887 -21634 -17064 -7228 -12510 -16855 -16888 -14207 -13558 -12931
6523 -12931 -7275 -4324 -672 3285 -132 -3610 -7315 -5042 -9034 -7918 -1962 -8879 -7018 370 8219
6508 8219 8306 3326 376 180 -5559 -11331 -7773 -4096 360 -2454 -2277 -5109 -10114 -14241 -14485 -7808
6492 -7808 -3808 -1024 3388 -1694 -4319 -5770 1283 2555 1015 -1297 -1494 -1870 -2877 -4494 2081
6477 2081 6986 5389 -1595 -4105 -9483 -7782 -2081 1804 3589 -2878 -5628 -4160 -1224 -69 -1601
6462 -1601 866 1906 -4166 -7714 -4604 -705 8824 3230 -2254 -3400 -4427 -3927 -5092 -7110 -13688
6447 -13688 -12067 -3934 -4442 -2802 4228 2105 -75 -4403 -8213 -5941 -4074 -4759 -2123 1528 4668
6432 4668 5412 6476 1711 -1769 -4033 -2148 -5013 -3440 -1122 -3408 -5114 -11288 -15688 -16917 -9071
6417i071P830L482P51o777n623J601n297K582L796M896j165P14J0168N67o447
6402B007j630j133l731M61R86j86p578j819K943L972l31k92P278n577m339J447
6386g522L238L270l647J2041L547r859K251J978l830r03O668J947n312O6M425
6371H358q97o38m42j836J087K095q267o132k568j729N174n578m3J256n376j458
6355a6994P686O82K67p6L555L21m712N322L631K946k101j260M977K167j293j721
6339C397l653O444k144n596P447K167n514q84J675M294m715n010j137K88n033
6324g974m128l225L614N709J1093K49O78k339q856M78J110r38j05K966K364J47
6308H43j987j364k088k94m320j139M561L818J264O85j935q785r953P302N206Q87
$$ plain form
6417 -9071 -1241 2241 2992 -3785 -9408 -7807 -13104 -10522 -6726 -1830 -2995 -2281 7887 8454 2007
6402 2007 377 -756 -4487 -4026 -3040 -3226 -10804 -12623 -9680 -5708 -6039 -6331 947 -4630 -8969 -7522
6386 -7522 -4284 -1014 -4661 7380 10927 1068 3319 5297 1467 564 7232 9179 3867 3933 8358
6371 8358 7461 6823 6381 4545 5632 7727 -540 -6672 -9240 -10969 -5795 -11373 -11416 -10160 -15536 -16994
6355 -16994 -9308 -8626 -8359 -8435 -4880 -4559 -9271 -3949 -318 2628 527 -733 4244 6411 5118 3397
6339 3397 -256 6188 4044 -1552 5895 8062 2548 1664 3339 7633 2918 -2092 -3229 -2941 -7974
6324 -7974 -12102 -15327 -11713 -6004 5089 5338 6016 3677 -5179 -4701 -3591 -4529 -4634 -1668 696 843
6308 843 -1144 -2508 -4596 -4890 -9210 -10349 -5788 -1970 -706 -21 -1956 -10741 -20694 -13392 -8186 -7299
6292g299Q085L580l098j0185O842N479K428M09q522o178M264O217J067p030j958
6277e899j105M927j662l685p65K657L340o383j422K428M853l282j762J761n118
6262a1117J407M889k215P320L419J862l676k656p988j316O148p361p091P044j123
6247a2454R860N020q523m944k698M972N205j328J116k430o308Q065L406j378O762
6232D343O042n169o849l416o45K1J186j979j725P749N263l334O04P492o359p469
6216d245O606J50j257j693k020P131P853l084k021k165o086J282L419L588k722
6201D736L49K4k606K035j70j479m593k755J331k60J963r23L759r00q29k978r21
6184d217M756l159j150O077O453O047L680l940j3410m861l352l966P53K776M724
$$ plain form
6292 -7299 786 4366 1268 -8917 -2075 3404 5832 6241 -2281 -8459 -4195 2022 3089 -3941 -5899
6277 -5899 -7004 -2077 -3739 -7424 -8189 -5532 -2192 -8575 -9997 -7569 -2716 -5998 -7760 -5999 -11117
6262 -11117 -9710 -4821 -7036 284 3703 5565 1889 -767 -8755 -10071 -3923 -11284 -18375 -11331 -12454
6247 -12454 -2594 2426 -6097 -11041 -13739 -8767 -3562 -4890 -3774 -6204 -12512 -4447 -1041 -2419 4343
6232 4343 10385 5216 -1633 -5049 -5694 -5673 -4487 -6466 -8191 -442 4821 1487 2091 9583 3224 -4245
6216 -4245 2361 2511 1254 -439 -2459 4672 12525 9441 7420 5255 -831 451 3870 7458 4736
6201 4736 5085 5109 2503 4538 4368 2889 -1704 -4459 -3128 -3388 -1425 -2348 1411 511 -318 -3296 -4217
6184 -4217 539 -2620 -3770 2307 8760 14807 18487 14547 1137 -3724 -7076 -11042 -10289 -7513 -2789
6169b789J29k557l482M930K422N41k148k874P0R69N697K598k333Q125N345p735
6153F908p21m755o350k179m859j128K063n772KK012Q414P867Q846k517k646j3585
6137h400N48K009q09l91P271J469M317K39r550k023k491j769K153L963q44q518
6121a2826O006J0722l58l189N93m063r746l622N598k629N07J03K347P571O193
6106C207L575l2J067l971k157P440j619j788n966L240M272N18l523J349L225J470
6090A0307K59j275j1924j319j854n785q76j099O793Q701K390r66L491k829l566
6075D48k759k82m453r92P669P242n331l596N867M747q325L111M67m592J614K838
6059C673k659j309n222m203j2114M336L700l039j349N406Q799J920n512j846N557
$$ plain form
6169 -2789 -2660 -5217 -8699 -3769 -1347 -806 -2954 -5828 -5758 -4789 908 3506 1173 9298 14643 6908
6153 6908 6187 1432 -4918 -7097 -11956 -13084 -11021 -16793 -16791 -14779 -6365 1502 10348 7831 5185 -8400
6137 -8400 -7852 -5843 -6652 -7043 228 1697 6014 6253 -3297 -5320 -7811 -9580 -7427 -3464 -4308 -12826
6121 -12826 -6820 3902 3544 355 948 -3115 -12861 -16483 -10885 -13514 -13007 -12904 -10557 -2986 3207
6106 3207 6782 6750 7817 3846 1689 9129 7510 5722 -244 2996 7268 7786 4263 5612 8837 10307
6090 10307 10566 9291 -2633 -3952 -5806 -11591 -12467 -13566 -6773 1928 4318 3352 6843 4014 448
6075 448 -2311 -2593 -7046 -8038 -369 6873 1542 -2054 3813 8560 235 3346 3813 -779 835 3673
6059 3673 1014 -295 -5517 -9720 -21834 -17498 -13798 -16837 -18186 -12780 -3981 -2061 -7573 -9419 -3862
6044c862j690M603K302o411l533L504J084p128j248L838L59L283l23J646j701
6029e277J091N244k882m495L648L621o301O69M054J774k090j805J1998K317p083
6014D483j290k542L643J017m707j402K030j968L546J196m737j857k75r58K474
5999a347L759N081K749k99l172o136r92J908J5K245L992L894l628n608N62K773
5983E796M740m809j483j239K230k155O44P96R9l213k849J629L190m51k397L306
5967C834J48l997o407k156J337M367L942N490L919q268j077O92k03k711j237J2
5951b315k957r52J051M199j812m151J452O440K707q379M977N652l255m964K323
5936A6j834p539J607N527M198l535j305L487l905j79l692m064O869J367K73K342
$$ plain form
6044 -3862 -5552 -949 1353 -5058 -8591 -5087 -4003 -11131 -12379 -8541 -8182 -4899 -5222 -3576 -5277
6029 -5277 -4186 1058 -1824 -6319 -2671 950 -5351 -4682 -628 1146 -944 -2749 9249 11566 4483
6014 4483 3193 651 4294 5311 604 -798 1232 -736 2810 4006 -731 -2588 -2863 -3821 -1347
5999 -1347 2412 7493 10242 9943 6771 635 -357 1551 1566 3811 7803 11697 8069 2461 3023 5796
5983 5796 10536 5727 4244 3005 5235 3080 3724 4520 4619 1406 -1443 186 3376 2925 528 3834
5967 3834 3982 -15 -6422 -8578 -7241 -2874 1068 6558 10477 2209 1132 1824 1621 -1090 -2327 -2315
5951 -2315 -5272 -6224 -5173 -974 -2786 -6937 -5485 955 3662 -4717 260 5912 2657 -2307 16
5936 16 -1818 -9357 -7750 -2223 1975 -1560 -2865 622 -3283 -3462 -7154 -11218 -4349 -2982 -2709 -367
5920c67M755q06O202M266K61m814l640p224n222j908M787L65n432O593P628l514
5904A930l010L458K205j2680q079j520R311O802j293N780L132l832k99k304m862
5889e261l530M955Q987J824l719M206L316r946p059k786M085L547p8n82M408j538
5873H29k73l451k798n391l856L209M828m021n05N8l185M383L199O237K621J850
5857C734j054K210r726L719L266j779L754N321j861l918O01j825K323m532m070
5842c837J531R39k550p228j402J645Q574J657n61J316O392n143n147o113J837
5827h090J273p98M020P623M010n035o66l044L185J810r73M34J172K179k797j0105
5811e802n099m906J350R871N89p26L896M10p350M78k448J1125L460k775o050P357
$$ plain form
5920 -367 4388 3582 9784 14050 14311 9497 5857 -1367 -6589 -8497 -3710 -3345 -8777 -2184 5444 1930
5904 1930 -1080 2378 4583 -8097 -16176 -17696 -8385 -1583 -2876 2904 6036 2204 1905 -399 -5261
5889 -5261 -8791 -3836 5151 6975 3256 7462 10778 832 -6227 -9013 -4928 -1381 -1459 -2041 2367 829
5873 829 556 -2895 -5693 -11084 -14940 -11731 -6903 -10924 -11429 -11371 -14556 -10173 -6974 -737 1884 3734
5857 3734 2680 4890 -4836 -1117 2149 370 4124 9445 7584 3666 4267 2442 4765 233 -3837
5842 -3837 -2306 -1367 -3917 -11145 -12547 -10902 -2328 -671 -1232 84 6476 1333 -3814 -9927 -8090
5827 -8090 -6817 -7615 -3595 4028 8038 3003 2337 -707 2478 4288 3315 3749 4921 7100 4303 -5802
5811 -5802 -10901 -15807 -14457 -4586 -3997 -4723 -827 -417 -7767 -7289 -9737 1388 4848 2073 -3977 3380
5795C380M409l536m558M842M685m845n854J282m686L726r83J107N144J1119M863
5780B0095q111j0368l589j686k217J958K637K585M292n23n713m652O342M312M87
5765E849Q00J200J107J365n889m605K271q234l022P247j82p884J57O245L960R56
5749A341j182L663k210p320J191m71P857M463r80J676p9o48o270n566p150n77
5733a2262J1449N822j251K13L124j644o469k188k211l086p71K404M762N103m590
5718a595J697N70j090M138N36o179n287k06L266O411K502m950j45l629q53Q45
5702c969Q521J386r85K40K041l831p854k033K346k38L14k49M251P179p393l002
5686c276K564k420k673J787l355k641K532J813K220m44n98m653K077j342o91M522
$$ plain form
5795 3380 7789 4253 -305 4537 9222 4377 -1477 -195 -4881 -1155 -2138 -1031 4113 15232 20095
5780 20095 11984 1616 -1973 -3659 -5876 -3918 -1281 1304 5596 5073 -640 -5292 1050 5362 5849
5765 5849 6649 7849 8956 10321 4432 -173 2098 -6136 -9158 -1911 -2093 -9977 -9820 -3575 385 1341
5749 1341 159 3822 1612 -5708 -4517 -4988 2869 7332 6352 8028 7949 7301 1031 -4535 -11685 -12262
5733 -12262 -813 5009 3758 3971 7095 5451 -1018 -3206 -5417 -8503 -9274 -6870 -2108 2995 -1595
5718 -1595 102 672 -418 3720 4256 -1923 -7210 -7416 -4150 2261 4763 -187 -332 -3961 -4814 -3969
5702 -3969 4552 5938 4953 5193 7234 3403 -4451 -6484 -4138 -4376 -4062 -4311 -60 7119 -274 -3276
5686 -3276 -712 -3132 -5805 -4018 -7373 -10014 -7482 -5669 -3449 -3893 -4491 -9144 -7067 -8409 -9100 -4578
5670d578k757m882q4N089M250k357K674P444N934j390k065j597j477n053k39L190
5654B102l082m054m953j91K810Q147J134M652K122j657k466K295M540k616L20
5639I103J21m119k711J634o175p612J650R15P83m271l394K711j198r621N772R622
5623f790L767j505O408M279l363m39M643M46n672K368O40l763O016R748m829n723
5607F231k282J825n136J018r2n301L984J371p605k773L562N202O261J957o920
5592A302j379j383j032r256M098J049j03k719O974J116M40k712N636j85l801m293
5576f248J031K803n02l198J668L601M851Q89j229l351J340k187j915l405l247
5561i099L299Q14l417J849L450M660L6K185j357L495k274J144j751M028m141j070
$$ plain form
5670 -4578 -7335 -12217 -12301 -7212 -2962 -5319 -2645 4799 10733 9343 7278 5681 4204 -849 -1088 2102
5654 2102 -980 -5034 -9987 -10178 -7368 779 1913 6565 8687 7030 4564 6859 11399 8783 9103
5639 9103 9224 5105 2394 4028 -2147 -9759 -8109 -7194 -6411 -10682 -14076 -11365 -12563 -22184 -16412 -6790
5623 -6790 -3023 -4528 1880 6159 2796 2357 7000 7446 1774 4142 4782 1019 7035 16783 11954 6231
5607 6231 3949 5774 638 1656 1564 -3737 247 1618 -5987 -8760 -5198 4 6265 8222 1302
5592 1302 -77 -1460 -2492 -11748 -7650 -6601 -6704 -9423 -2449 -1333 -893 -3605 2031 1846 -1955 -6248
5576 -6248 -5217 -2414 -2916 -6114 -4446 -845 4006 4895 3666 315 1655 -532 -2447 -5852 -9099
5561 -9099 -5800 -4986 -8403 -6554 -3104 1556 1592 3777 2420 5915 3641 4785 3034 7062 2921 1851
5545A851J970J127m885J818J366Q11M134J582n637n292r4O999l82J916q062l710
5529d488N50R78Q74k344R860J735l360J253j233q45l226M330K461k321o090k134
5513d000M290L351j638o140l069K199l550l477j114P761O001J774o30n396l074
$$ plain form
5545 1851 3821 4948 63 1881 3247 4058 8192 9774 4137 -1155 -1249 5750 5368 7284 -778 -4488
5529 -4488 -3938 -2960 -2086 -4430 5430 7165 3805 5058 3825 2980 -246 4084 6545 4224 -1866 -4000
5513 -4000 290 3641 2003 -4137 -7206 -5007 -8557 -12034 -13148 -5387 614 2388 1758 -3638 -6712
$$ [...]
##END NTUPLES=NMR SPECTRUM
##END=
