##TITLE=Analysis number 327603
Compound Code sb 01142
Project Code adrs
Chemist Name stores
##JCAMPDX= 6.0         $$ Bruker NMR JCAMP-DX V2.0
##DATA TYPE= NMR SPECTRUM
##DATA CLASS= NTUPLES
##ORIGIN= Bruker BioSpin GmbH
##OWNER= nmr
$$ XWIN-NMR		Version 3.5
$$ Tue Mar 27 15:57:39 2007 GMT Daylight Time (UT+1h)  MAYBRIDGE\nmr@NMR_250MHZ
##.OBSERVE FREQUENCY= 250.131544655141
##.OBSERVE NUCLEUS= ^1H
##.ACQUISITION MODE= SIMULTANEOUS (DQD)
##.ACQUISITION SCHEME= undefined
##.AVERAGES= 16
##.DIGITISER RES= 18
##SPECTROMETER/DATA SYSTEM= dpx250
##.PULSE SEQUENCE= zg30
##.SOLVENT NAME= CDCl3
##.SHIFT REFERENCE= (INTERNAL, CDCl3, 0, 16.522)
##AUDIT TRAIL= $$ (NUMBER, WHEN, WHO, WHERE, WHAT)
$$ ##TITLE= Audit trail, XWIN-NMR		Version 3.5
$$ ##JCAMPDX= 5.01
$$ ##ORIGIN= Bruker BioSpin GmbH
$$ ##OWNER= nmr
$$ C:\u/data/dgb/nmr/ADRS/2320/pdata/1/auditp.txt
$$ ##AUDIT TRAIL=  $$ (NUMBER, WHEN, WHO, WHERE, WHAT)
(   1,<2007-03-27 15:57:14.77 +100>,<MAYBRIDGE\nmr>,<NMR_250MHZ>,
      <created by zg, POWCHK disabled, PULCHK disabled
       configuration hash MD5:
       49 4B E0 1D 92 C2 6B 37 9F E6 65 BC 52 41 86 1D
       data hash MD5: 64K
       16 09 28 FB 25 2C 66 1A AD CA 84 D5 45 A9 CE 6A>)
(   2,<2007-03-27 15:57:28.66 +100>,<MAYBRIDGE\nmr>,<NMR_250MHZ>,
      <Start of raw data processing
       ef LB = 0.3 FT_mod = 6 PKNL = 1 SI = 32K 
       data hash MD5: 32K
       38 FD 9D C4 2F A1 D4 31 F1 3E 33 86 7D 85 51 74>)
(   3,<2007-03-27 15:57:31.21 +100>,<MAYBRIDGE\nmr>,<NMR_250MHZ>,
      <apk 
       data hash MD5: 32K
       80 39 DB 36 19 DC CF 86 0C DA 2D 13 03 85 37 28>)
(   4,<2007-03-27 15:57:32.11 +100>,<MAYBRIDGE\nmr>,<NMR_250MHZ>,
      <abs ABSG = 5 
       data hash MD5: 32K
       97 3A C0 3A 07 7C 7E 35 B4 69 EF FB 48 AD 79 F3>)
$$ ##END=
$$ 
$$ hash MD5
$$ 98 27 B8 D8 E8 49 01 2C 38 C8 89 D4 08 1B F2 3B
##$RELAX= 
##$RELAX= 
##$RELAX= 
##$RELAX= 
##$RELAX= 
##$RELAX= 
##$RELAX= 
$$ Bruker specific parameters
$$ --------------------------
##$DU= <C:\u>
##$EXPNO= 2320
##$NAME= <ADRS>
##$PROCNO= 1
##$TYPE= <nmr>
##$USER= <dgb>
##$AMP= (0..31)
100 100 100 100 100 100 100 100 100 100 100 100 100 100 100 100 100 100 
100 100 100 100 100 100 100 100 100 100 100 100 100 100 
##$AQSEQ= 0
##$AQ_mod= 3
##$AUNM= <au_zg>
##$AUTOPOS= <53 >
##$BF1= 250.13
##$BF2= 250.13
##$BF3= 250.13
##$BF4= 250.13
##$BF5= 500.13
##$BF6= 500.13
##$BF7= 500.13
##$BF8= 500.13
##$BYTORDA= 1
##$CFDGTYP= 0
##$CFRGTYP= 5
##$CHEMSTR= <none>
##$CNST= (0..31)
1 1 145 1 1 1 1 1 1 1 1 1 1 1 1 1 1 1 1 1 1 1 1 1 1 1 1 1 1 1 1 1 
##$CPDPRG= <>
##$CPDPRG1= <>
##$CPDPRG2= <>
##$CPDPRG3= <>
##$CPDPRG4= <mlev>
##$CPDPRG5= <mlev>
##$CPDPRG6= <mlev>
##$CPDPRG7= <mlev>
##$CPDPRG8= <mlev>
##$CPDPRGB= <>
##$CPDPRGT= <>
##$D= (0..31)
0 1 0 0 0 0 0 0 0 0.06 0 0 0 0 0 0 0.0002 0 0 0 0 0 0 0 0 0 0 0 0 0 0 
0 
##$DATE= 1175007433
##$DBL= (0..7)
120 120 120 120 120 120 120 120 
##$DBP= (0..7)
150 150 150 150 150 150 150 150 
##$DBP07= 0
##$DBPNAM0= <>
##$DBPNAM1= <>
##$DBPNAM2= <>
$$ [...]
##$SUBNAM7= <"">
##$SUBNAM8= <"">
##$SUBNAM9= <"">
##$SW= 20.6930455092707
##$SWIBOX= (0..15)
0 0 3 0 0 0 0 0 0 0 0 0 0 0 0 0 
##$SW_h= 5175.983436853
##$TD= 65536
##$TD0= 1
##$TE= 683.16
##$TE2= 300
##$TE3= 300
##$TEG= 300
##$TL= (0..7)
0 120 120 120 120 120 120 120 
##$TP= (0..7)
150 150 150 150 150 150 150 150 
##$TP07= 0
##$TPNAME0= <>
##$TPNAME1= <>
##$TPNAME2= <>
##$TPNAME3= <>
##$TPNAME4= <>
##$TPNAME5= <>
##$TPNAME6= <>
##$TPNAME7= <>
##$TPOAL= (0..7)
0.5 0.5 0.5 0.5 0.5 0.5 0.5 0.5 
##$TPOFFS= (0..7)
0 0 0 0 0 0 0 0 
##$TUNHIN= 0
##$TUNHOUT= 0
##$TUNXOUT= 0
##$USERA1= <user>
##$USERA2= <user>
##$USERA3= <user>
##$USERA4= <user>
##$USERA5= <user>
##$V9= 5
##$VALIST= <valist>
##$VCLIST= <CCCCCCCCCCCCCCC>
##$VD= 0
##$VDLIST= <DDDDDDDDDDDDDDD>
##$VPLIST= <PPPPPPPPPPPPPPP>
##$VTLIST= <TTTTTTTTTTTTTTT>
##$WBST= 1024
##$WBSW= 4
##$XGAIN= (0..3)
0 0 0 0 
##$XL= 0
##$YL= 0
##$YMAX_a= 538164
##$YMIN_a= -549366
##$ZGOPTNS= <>
##$ZL1= 120
##$ZL2= 120
##$ZL3= 120
##$ZL4= 120
##$ABSF1= 16.522
##$ABSF2= -4.171173
##$ABSG= 5
##$ABSL= 3
##$ALPHA= 0
##$AQORDER= 0
##$ASSFAC= 0
##$ASSFACI= 0
##$ASSFACX= 0
##$ASSWID= 0
##$AUNMP= <proc_1d>
##$AZFE= 0.1
##$AZFW= 0.1
##$BCFW= 0
##$BC_mod= 0
##$BYTORDP= 0
##$COROFFS= 0
##$CY= 12.5
##$DATMOD= 1
##$DC= 0
##$DFILT= <>
##$DTYPP= 0
##$F1P= 14.0000005364418
##$F2P= -0.99999901652339
##$FCOR= 0.5
##$FTSIZE= 32768
##$FT_mod= 6
##$GAMMA= 0
##$GB= 0
##$INTBC= 1
##$INTSCL= 1
##$ISEN= 128
##$LB= 0.3
##$LEV0= 0
##$LPBIN= 0
##$MAXI= 10000
##$MC2= 0
##$MEAN= 0
##$ME_mod= 0
##$MI= 0
##$NCOEF= 0
##$NC_proc= -4
##$NLEV= 6
##$NOISF1= 0
##$NOISF2= 0
##$NSP= 0
##$NTH_PI= 0
##$NZP= 0
##$OFFSET= 16.522
##$PC= 1
##$PHC0= 228.5017
##$PHC1= 6.714676
##$PH_mod= 1
##$PKNL= yes
##$PPARMOD= 0
##$PSCAL= 4
##$PSIGN= 0
##$REVERSE= no
##$SF= 250.13
##$SI= 32768
##$SIGF1= 0
##$SIGF2= 0
##$SINO= 400
##$SIOLD= 32768
##$SREGLST= <1H.CDCl3>
##$SSB= 0
##$STSI= 32768
##$STSR= 0
##$SW_p= 5175.98343685301
##$SYMM= 0
##$S_DEV= 0
##$TDeff= 65536
##$TDoff= 0
##$TI= <Analysis number 999999
Compound Code 99
Book Reference 9
Project Code 9>
##$TILT= no
##$TM1= 0
##$TM2= 0
##$TOPLEV= 0
##$USERP1= <user>
##$USERP2= <user>
##$USERP3= <user>
##$USERP4= <user>
##$USERP5= <user>
##$WDW= 1
##$XDIM= 32768
##$YMAX_p= 331577618
##$YMIN_p= -383019
$$ End of Bruker specific parameters
$$ ---------------------------------
##NTUPLES= NMR SPECTRUM
##VAR_NAME=  FREQUENCY,     SPECTRUM/REAL,   SPECTRUM/IMAG
##SYMBOL=    X,             R,               I
##VAR_TYPE=  INDEPENDENT,   DEPENDENT,       DEPENDENT
##VAR_FORM=  AFFN,          ASDF,            ASDF
##VAR_DIM=   32768,         32768,           32768
##UNITS=     HZ,            ARBITRARY UNITS, ARBITRARY UNITS
##FACTOR=    0.157963299565203, 1,           1
##FIRST=     4132.6476996994, 0,             0
##LAST=      -1043.33573715361, 0,           0
##MIN=       -1043.33573715361, -383019,     0
##MAX=       4132.6476996994, 331577618,     0
$$ Real data points
##PAGE= N=1
##DATA TABLE= (X++(R..R)), XYDATA
$$ [...]
20299 65925 97533 121068 128016 107171 59106 14683 -23726 -17215 -28455 -36594 -7493 -25430
20287 -25430 -11605 -33315 -67938 -54050 -59844 -60581 -20730 4013 44175 68318 45639 -4155
20275 -4155 12201 65261 106906 103745 101558 46651 20718 10586 35629 12222 55517 77470
20263 77470 65999 54473 31837 16312 -3219 17032 57755 86474 157360 137671 133132 133373
20251 133373 59998 -3624 -28654 -62794 -54989 -7542 46953 36393 -19806 -61675 -47912 20322
20239 20322 40817 60789 74439 71233 34735 -8613 -20504 -4758 6577 -3671 -20221 41656
20227 41656 72026 37999 54685 135046 129010 58332 4387 -25588 -50857 31100 17636 -42927
20215 -42927 -9852 11328 -12219 -32379 -47883 -51434 -60930 -30750 -19757 -8471 -12662 -35033
20203 -35033 -36387 -12794 -23814 -2424 65710 77882 46464 22297 34792 29878 48276 40632
20191 40632 40285 70446 88817 100994 72119 58029 62613 40693 24133 13946 7754 25528
20179 25528 4938 -36689 -71909 -47247 -45314 -22685 -14943 1764 36079 60301 66432 11308
20167 11308 9828 41000 5473 -43117 7656 9760 60876 99655 104706 103193 71061 -14638
20155 -14638 -45963 -7354 20084 70665 15991 -23622 -24234 -18663 -4077 -39233 -29723 -14784
20143 -14784 47374 79912 102008 68632 27749 21082 39954 10137 -49563 -48236 -10457 11794
20131 11794 77590 52121 30300 35507 70493 88431 59873 57012 75723 73057 52394 82992
20119 82992 78626 67315 57341 125085 166972 134415 100377 104778 121964 122636 87397 19132 37265
20106 37265 74983 61359 70648 54730 72074 85581 71776 67415 77597 28036 8963 19891
20094 19891 18970 40126 48939 71071 102640 56606 5617 -58366 -59098 -32226 -45369 -26043 14442
20081 14442 55724 37540 64984 67563 92964 59200 30871 6930 24047 29954 29780 46643
20069 46643 49746 65010 64580 68311 64486 60295 102476 51218 46157 88675 82921 23094 22757 21146
20055 21146 -44753 -81024 -70294 -388 72539 166917 169630 101647 79577 34730 -32683 -93347
20043 -93347 -42599 33735 78796 75677 48639 26601 35479 64860 25691 19052 82711 111180
20031 111180 91124 47994 42203 72680 71168 82231 34031 30480 30271 6218 34828 56579
20019 56579 23573 25820 82441 105438 70699 74266 96672 76499 26296 89046 138732 151587
20007 151587 94807 77631 78019 87100 57425 4087 21846 63010 83602 54310 25256 39906
19995 39906 68945 100023 81209 49510 21762 16870 27034 8154 1480 39338 31708 -45629
19983 -45629 2599 31636 100708 79055 -4403 -42436 -10466 61956 110924 158976 132343 102693
19971 102693 94617 101913 45308 37327 45910 31867 55284 78987 71937 23691 -2126 -19050
19959 -19050 33681 18228 23321 49173 75476 81969 114932 149818 149932 122884 134981 112369
19947 112369 121551 168001 174370 169151 175077 101826 56760 67414 58612 35501 18016 37058
19935 37058 56334 52863 49810 55585 58439 31602 33771 43799 41988 -31646 -19849 17707 39836
19922 39836 54057 59805 105964 103507 72111 113019 145059 119856 85543 92494 36763 13037
19910 13037 7920 2188 -2120 33980 73750 63472 40523 27300 41186 23351 24318 34397 30635
19897 30635 61349 102870 65583 14660 -13950 -30479 -7171 -4357 -4519 35326 17239 3819
19885 3819 46388 81786 85252 157948 163731 130285 125554 96957 10111 -893 26533 84308
19873 84308 99488 103171 100788 45411 147304 197502 119127 9808 7935 36014 34316 54141
19861 54141 132460 129069 88162 77558 62520 121334 98063 70579 26330 17609 60475 79873
19849 79873 56031 38349 -29496 -71634 -56790 -49960 -38706 -27144 -9435 -16350 -2997 42610
19837 42610 63680 32240 16823 23617 80702 82096 81428 70148 71211 29779 -49399 -28261 2464
19824 2464 9429 -28725 -39391 22186 16919 34934 4263 43430 95648 52210 20517 20669 -25858
19811 -25858 25113 48650 43180 43423 45313 67785 60319 111970 123220 110518 91821 98187 148029
19798 148029 108780 93482 100611 89529 83055 67746 40148 -465 -557 26315 57509 37611
19786 37611 23068 22585 27051 60624 122156 149030 178699 127407 101066 25802 -23309 -48240
19774 -48240 -1885 24179 9763 8038 48420 20948 4165 -4750 -7242 80151 56230 45670
19762 45670 42578 63717 98307 83752 58828 40843 18790 4317 61351 93764 74594 41973
19750 41973 33441 80997 114312 79953 74749 63805 22326 44102 51961 63615 60653 51190 63646
19737 63646 63821 36850 41949 87797 99308 88065 90167 78096 46743 39289 55598 107875 88928
19724 88928 46951 33259 14602 -5536 -36655 -666 51935 13107 -21173 -28946 -92544 -89168
19712 -89168 -29690 73425 78992 70212 126807 115527 49202 31056 80930 104532 98163 75362
19700 75362 50852 63595 61080 82959 79390 92407 133130 87266 55712 40080 65117 51918
19688 51918 28771 25032 66814 54928 77370 131102 134285 74790 105141 127480 128603 110652
19676 110652 119938 77868 41414 4969 12834 51102 97852 112257 58783 18200 8603 15628
19664 15628 -6093 -18155 19257 28209 29952 13372 -16382 33510 76649 79444 68235 81948
19652 81948 112567 58170 26788 -14228 -12192 -22414 -45526 -41402 3720 18480 13972 12071
19640 12071 29109 16485 50262 70312 28822 -26490 30778 51752 55255 25689 45459 68131
19628 68131 104986 100293 135403 128616 141722 137464 96569 69867 61449 63664 61769 53268 7802
19615 7802 18601 60033 38257 101976 155011 133128 93538 20256 13907 -6947 -4948 13551
19603 13551 41780 30305 43782 51121 112230 151130 175794 162408 102563 30253 17672 54205
19591 54205 78650 103133 60650 76756 140127 183732 241145 233976 133497 93391 136064 142905
19579 142905 148481 105581 123024 104635 129652 89147 37864 29744 93560 128261 118574 123992
19567 123992 107819 130807 149261 135458 150802 153289 154491 174244 134252 142186 179500 132321
19555 132321 111241 93207 96189 112722 126237 124711 94989 45333 23953 62782 66826 36217
19543 36217 32769 57626 41386 4626 43871 42372 30688 77675 130525 82422 47263 42587
19531 42587 23908 28770 110759 113865 49599 18446 67787 83636 63338 71655 80462 95844
19519 95844 117220 93245 37193 65127 85709 109637 121953 122564 108607 104306 136227 153594
19507 153594 141869 84017 57926 100934 38740 6268 -11548 63877 88368 85354 111041 108479
19495 108479 119951 82796 58429 55503 75180 119628 147629 153088 139393 105641 103695 124991
19483 124991 112524 83208 38307 63961 93796 95206 136156 144324 155879 209565 226715 220766
19471 220766 227483 230025 209932 181076 185747 173434 171233 159767 146214 172930 179874 125668
19459 125668 85640 82082 93834 107722 145514 125477 107749 93070 112538 157157 183242 198343
19447 198343 200040 167939 174625 182647 227714 239234 202701 253495 266027 258911 277056 243666
19435 243666 244058 260608 265358 271685 219215 229709 315892 418465 476796 495761 512756 486875
19423 486875 485841 514410 486135 437457 404421 364073 371794 393742 443098 407990 379881 403230
19411 403230 429891 369537 346900 307901 320017 287175 270719 255834 264693 233439 203902 183488
19399 183488 198403 244988 262976 288485 279948 235785 284762 314000 338321 340392 330890 322590
19387 322590 352371 376191 418728 503090 529550 537750 483387 533706 560923 537953 525881 481529
19375 481529 468516 482750 488925 456914 388421 392923 415114 391212 377824 378335 376090 337051
19363 337051 316759 356298 290906 255490 171590 130860 127634 61441 100362 189280 209060 186204
19351 186204 177311 151764 135816 160890 194890 242091 270943 273886 236507 175621 179564 199500
19339 199500 209316 191649 164154 138001 153712 156532 203145 227148 202766 211008 233858 237769
19327 237769 259035 236301 263577 278919 274082 274594 322483 398695 409456 378675 384273 391600
19315 391600 452950 574039 596127 560482 519697 424423 324923 274473 254237 263252 349973
19304 349973 423405 445118 447968 490124 544554 511187 488924 419470 379089 328936 316207 357038
19292 357038 375818 364318 301165 248644 191325 166439 202787 233338 254929 246132 228065 228503
19280 228503 225299 231348 259358 239113 228203 241191 283142 323042 300731 348447 357161 340715
19268 340715 345349 327946 309412 397056 433724 450310 452197 454743 490808 504120 532592 565191
19256 565191 569019 554023 595239 576119 538819 576855 619212 595272 531661 502238 447089 365550
19244 365550 360477 349337 270537 255672 281800 303351 235400 207335 281161 271133 269015 244182
19232 244182 123419 73175 51606 45332 31223 55239 40666 61475 69826 68589 90627 64675
19220 64675 34045 70843 161004 148130 70889 53638 92060 114169 119901 155942 173637 198270
19208 198270 191775 143986 93857 103241 103236 136841 157215 191846 139864 110727 122330 126533 155413
19195 155413 158204 129226 106697 122710 158911 207589 249761 241326 245259 185374 195066 203264
19183 203264 147058 90691 94662 99762 85692 70375 103735 159686 167652 92217 78144 131224
19171 131224 122430 105755 107237 144189 191042 166772 139190 172438 239481 270262 273356 308626
19159 308626 288604 280290 290927 337639 320500 293076 327722 381419 402363 337531 282714 271520
19147 271520 312171 324261 298012 313002 352234 314028 292345 299863 356482 400909 362040 327358
19135 327358 338471 333879 332072 357214 362062 343868 314137 320035 287009 227069 263130 306271
19123 306271 284628 315387 334340 329457 292075 259392 235500 233551 274734 274061 266736 264396 277384
19110 277384 250647 224964 247718 246817 232075 221625 224305 211745 246531 264827 250275 309095
19098 309095 408015 429468 420675 439045 416649 409697 388168 381912 401202 363432 346214 347515
19086 347515 388817 380592 355535 358127 353360 335500 292570 293602 311044 344112 381364 423340
19074 423340 425980 398264 382654 369801 405894 425828 417781 442382 490781 506263 519344 526451
19062 526451 482446 462531 444249 393975 387053 438641 428826 405085 399515 441129 451272 426950
19050 426950 401148 425592 411822 460076 501666 497739 530840 493214 489439 493279 507983 519766
19038 519766 466995 431197 464701 410325 352775 377939 413756 441221 486695 505789 543143
19027 543143 589220 594306 639095 616871 541074 522596 499805 478699 512513 540199 561914 627370
19015 627370 646014 654960 667737 683210 728802 689183 583021 578015 635121 690939 729081 729018
19003 729018 728895 731124 722379 768883 811515 807078 762169 810156 840344 799752 786335 861866
18991 861866 906136 968367 1062015 1089729 1067078 1062596 1099129 1129280 1158462 1224189 1278974 1380809
18979 1380809 1401871 1415704 1505611 1624797 1724676 1812413 1964168 2141383 2321924 2436552
18969 2436552 2531144 2655245 2816595 2993471 3158227 3417309 3730317 3964605 4163062 4419864
18959 4419864 4779138 5089447 5373977 5691881 6018170 6366555 6774754 7201724 7674765
18950 7674765 8114451 8566233 9122302 9685603 10172765 10717568 11276943 11902200 12630845
18941 12630845 13507141 14526568 15608884 16662438 17869776 19252501 20815913 22431160
18933 22431160 23612987 24392944 25703580 27851633 30627379 34153936 38400904 43019022
18925 43019022 47670897 53066192 60117165 68534068 75723041 76261919 71867256 70428156
18917 70428156 71822159 73627072 76087798 77959077 77773393 75607055 66995020 55274673
18909 55274673 48903945 46352040 43640057 40417600 38897288 39339989 40188135 38335423
18901 38335423 32553316 26373450 22483928 20495751 19547544 19231755 19284804 19550438 20125043
18892 20125043 21011968 22170339 23587930 25274618 27129674 29073704 31197856 33794015
18884 33794015 36895102 40070317 42023317 42014009 42179028 44270621 48061058 53014145 59090507
18875 59090507 66464173 74554125 81651178 87163651 93056716 100308441 104565215 97175203
18867 97175203 78507551 64501968 58739534 57371672 58184660 61240004 66192805 71114124
18859 71114124 70560206 60339154 48045305 37047334 26589614 18554247 13781632 11111663
18851 11111663 9488146 8403424 7630472 7128870 6780483 6546675 6350970 6250495 6163536
18842 6163536 6007988 5966091 6024301 6134449 6261779 6360367 6552744 6781317 6952493 7081312
18832 7081312 7272931 7500231 7826728 8280444 8751168 9222996 9719783 10214269 10701188
18823 10701188 11292628 11827959 12261710 12755663 13256565 13956687 14796743 15699169 16846224
18814 16846224 18160686 19734302 21598526 23553407 25714595 28244650 31250360 34232568
18806 34232568 35734182 36294748 38190606 41696579 46608161 52944183 60731150 68614444
18798 68614444 75795459 84742066 96972993 110437774 118681911 108590768 89836804
18791 89836804 78636865 67189231 51783812 41439131 36864289 35108173 34692903 35466813
18783 35466813 37418167 39300216 38103952 31785291 24476047 19584982 16895254 15503820
18775 15503820 14875040 14714726 14878945 15153867 15489159 15987484 16534573 17205823 17932669
18766 17932669 18546188 19256123 20201845 21458568 22949634 24649369 26776202 29411823
18758 29411823 32723642 36392086 40099005 44133997 49074306 55038800 60934786 63351268
18750 63351268 61232818 59938156 62342053 67652595 74093866 82250206 92802299 103622663
18742 103622663 113510279 117836062 115019742 113096996 100592847 69589805 43850977
18735 43850977 30222329 23303788 19585465 17699809 16713829 16063085 15900035 16322467
18727 16322467 17006405 16806198 13960586 9902360 7122022 5561549 4600463 3998538 3600956
18718 3600956 3321800 3151531 3025265 2908452 2832141 2781502 2628487 2480101 2289945 2024357
18708 2024357 1789212 1637692 1599803 1573287 1557914 1505656 1491335 1484640 1508577 1530579 1488220
18697 1488220 1449763 1424102 1418844 1471795 1436271 1420805 1442243 1486976 1513892 1541985 1560659
18686 1560659 1553233 1549370 1560702 1562847 1577530 1639810 1662141 1713366 1743356 1838145 1924951 2017433
18674 2017433 2087886 2104755 2137457 2215481 2321672 2448619 2577745 2698701 2906977 3079448
18664 3079448 3259594 3488190 3749634 4043515 4492714 4996883 5491294 6042238 6679343
18655 6679343 7277769 7928344 8819410 10035805 11235454 11713598 11201597 10893060 11120065
18646 11120065 11616815 12396263 13556858 15061574 16375598 15787205 13030445 10845021
18638 10845021 9836235 9476548 9485452 9833947 10459417 10954059 10386762 8644183 7314035
18629 7314035 6728425 6559005 6644344 6782514 7016531 7321726 7658381 8137353 8695393 9242094
18619 9242094 9927958 10719161 11560458 12373683 13230930 14436066 15862031 16928516 16649996
18610 16649996 15488442 14946380 15293782 16353346 17960192 20067029 22620221 25627156
18602 25627156 29032387 32550425 36141015 40218523 44871696 48601900 49233153 45816648
18594 45816648 40308004 35717566 31534061 25293590 19363760 15887975 14220337 13541202
18586 13541202 13398143 13502108 13709920 14164852 15033715 16075102 16277462 14376327 11764541
18577 11764541 10201616 9493425 9233209 9241068 9377785 9599089 9938051 10466895 11256177
18568 11256177 12268057 13527483 14969172 16697893 18632671 20593992 22432717 24641136
18560 24641136 27736314 31372169 33814233 32477399 29513691 28528105 29164214 30340870
18552 30340870 32260461 35409819 39341414 41722569 37957821 29265087 22621944 19303165
18544 19303165 17754575 17125663 17280581 18056210 18835378 17878171 13965754 9907464 7354172
18535 7354172 5998252 5267431 4782024 4437346 4150841 3906011 3687413 3530699 3494227
18526 3494227 3504142 3429788 3396961 3388708 3451492 3596986 3770806 3931899 3996309 4049350 4120561
18515 4120561 4164700 4313323 4438992 4622162 4795611 4986051 5226166 5402677 5603725 5918651
18505 5918651 6241721 6576643 6946659 7281503 7632992 7988857 8420817 8874202 9360189
18496 9360189 9831815 10309610 10808491 11375160 11938270 12607458 13487878 14480060 15623034
18487 15623034 16888456 18385135 20093519 22005640 24161237 26912046 30187292 33857885
18479 33857885 37239155 39671115 42404082 46097035 50625771 56415929 63724361 71253391
18471 71253391 75205501 73159729 70762043 71927456 74428437 72354429 63077807 52013619
18463 52013619 42756087 37115419 34534383 34030603 34750761 35354590 33476949 28652766
18455 28652766 24227723 21581583 20278397 19816914 19877482 20139796 20535412 21094128 21862501
18446 21862501 22833835 24004436 25293035 26626226 28072972 29798737 31939009 34577597
18438 34577597 37783820 41422450 45619054 50357661 55726581 61433845 67534177 74853736
18430 74853736 83303401 91307445 96948135 97039527 94714140 95842711 100718677 107964861
18422 107964861 117151869 127092641 135443200 140976085 142212898 138033702 133741503 131707365
18414 131707365 128154648 122767312 116269129 109215951 99590169 89031461 79064145 68945959
18406 68945959 59565295 52401218 47877763 45749585 45000811 44383098 42825579 40210474
18398 40210474 36841686 33110094 30053001 28048460 27125742 27111005 27841293 29050070 30494406
18389 30494406 32020305 33717985 35803616 38443640 41458229 43899387 44973667 46285786
18381 46285786 49148284 53268189 57947234 63219649 69765596 77544523 85285658 89186053
18373 89186053 87175062 83543149 81656950 81496351 83726820 88710962 95916232 104021006
18365 104021006 110477759 116036009 121729499 124566201 123326484 116595016 103031097 86849932
18357 86849932 68904269 51687266 38676685 29738736 24259768 21180437 19534674 18672042
18349 18672042 18218140 17813296 17003829 15409880 13454134 11109806 8877504 7125957
18341 7125957 5898418 5126879 4540825 4019430 3613678 3312051 3028563 2769066 2498312
18332 2498312 2288794 2083343 1920344 1829243 1728893 1592747 1497985 1444370 1314134 1239615
18322 1239615 1215607 1154974 1095553 1055623 1031024 1023575 1019771 1030208 1068957 1014897 968836 957963
18310 957963 919876 933581 915751 900860 887206 842401 822483 831083 809177 828093 829960 859987
18298 859987 802154 766133 786443 795637 800654 760324 763630 830286 853778 940222 953326 943502
18286 943502 917562 919723 839330 753346 710097 678087 757568 862664 806878 778925 793142
18275 793142 809469 783889 826295 785241 689175 590515 520018 470387 440366 448305 471274 512977
18263 512977 514886 562636 646830 649216 620511 604818 613728 654698 685309 665300 615571 590278
18251 590278 628671 620325 644186 654675 705381 736761 778909 772707 770345 799431 859988 873162
18239 873162 834852 848161 939983 985233 969126 916704 877734 925262 966631 933690 857280
18228 857280 800136 745827 708366 720347 733775 767787 818186 822854 782463 808751 884565 888373
18216 888373 883404 802747 677215 600270 529807 477679 482481 495711 473315 413022 401533 451625
18204 451625 423974 402786 458354 429779 402985 426807 446200 465532 433382 482368 514114
18193 514114 540371 581394 552078 553431 570211 589208 577355 600026 620856 689592 712766 712633
18181 712633 681911 750334 785170 811194 802306 780414 818647 893002 979039 1069188 1117295 1170855
18169 1170855 1219303 1259758 1280776 1344450 1436274 1553263 1609819 1694133 1769790 1849509 1966506
18158 1966506 2093337 2167849 2287508 2407719 2541284 2707491 2873055 3047923 3262321 3431376
18148 3431376 3629210 3836530 4100613 4388551 4748784 5011370 5248882 5552448 5877633
18139 5877633 6268742 6698359 7107315 7498315 7915881 8371510 8849251 9404820 9863952
18130 9863952 10315746 10865985 11449266 12100681 12820374 13598653 14509304 15534851 16738505
18121 16738505 18080430 19487243 20842437 22395573 24203277 26389151 29392191 33031041
18113 33031041 37065468 41638290 47018694 53753834 59770859 64577910 71190002 81367134
18105 81367134 93922994 100721557 83555720 63277141 54741652 53093579 54733124 57881520
18097 57881520 61833214 67166234 73528888 79604185 85245037 91579081 98695905 103749809
18089 103749809 103079976 99822640 99146572 97579355 91516942 81799189 74152036 68383618
18081 68383618 61078251 53766395 48384444 45075954 42446631 39203721 35534935 32954620
18073 32954620 31554387 30062258 27350548 24461920 22575643 21427499 20505693 19696349
18065 19696349 19236031 19176842 19570222 20231209 21082961 22192350 23560931 25204698 27108150
18056 27108150 29342551 31944578 34681782 37329931 40162212 43523064 47264346 50521124
18048 50521124 52752917 55326239 59324533 63803155 67150140 69943135 74031584 78730611
18040 78730611 81988298 82679063 83398480 85827213 86091317 80839945 74509615 71571347
18032 71571347 69853334 64590496 57653429 53626972 52168138 51700390 51869696 52872171
18024 52872171 53111375 52601450 53620912 56725219 61999216 69127842 77570180 85495418
18016 85495418 93200003 103646003 117290369 131421367 137360257 121909912 101358759
18009 101358759 87433332 70264429 53263929 43735485 39552105 37777003 37153447 37854732
18001 37854732 39671586 41346723 39953108 33193759 25279420 20024679 17158650 15589933
17993 15589933 14800024 14517132 14472233 14568233 14769565 14946567 15225773 15608590 16039778 16556711
17983 16556711 17261084 18145739 19227162 20681860 22384394 24349557 26738338 29630415
17975 29630415 32919108 36261615 39909136 44371806 49937773 55502281 57887591 56135185
17967 56135185 55181400 57528590 62016409 67545700 75227798 84856259 94067502 100812959
17959 100812959 100430878 97901965 96878373 82830272 55172501 35132490 24699969
17952 24699969 19250868 16160946 14588875 13802508 13213634 13006242 13302985 13835883 13746462
17943 13746462 11575683 8307453 6075180 4898642 4221071 3781322 3417145 3108210 2900531
17934 2900531 2693738 2496204 2211612 1976884 1747697 1575568 1528474 1459182 1383366 1339160
17924 1339160 1293573 1272012 1297018 1294500 1260493 1248933 1272339 1300419 1262330 1174833 1087023
17913 1087023 1068529 1101298 1083524 1096268 1109566 1008589 988955 943281 904723 980365 1005596
17902 1005596 1004169 953131 935534 894076 867877 852786 823863 787817 743452 747411 734928 810148
17890 810148 860731 825312 799895 816506 774667 684454 605336 558819 557468 578797 551807 483145
17878 483145 446421 452993 508497 523402 549331 519382 484776 458236 478801 477482 457434 409010
17866 409010 391114 409326 418523 396646 371344 335562 282962 292799 383693 437903 508666 506527
17854 506527 497639 497734 466826 372915 320174 298615 370116 405514 399919 377509 380631 372145 302709
17841 302709 286998 314516 309551 297805 274503 288451 300642 245541 247163 293307 293236 268589
17829 268589 241042 184174 116483 43059 -21722 28395 52410 67784 22967 52175 113526
17818 113526 108514 71541 105678 96052 64814 43776 48399 56212 -5044 -20784 -74424 -85078
17806 -85078 -29270 56938 91585 88130 133985 156691 174883 184678 223048 239844 201183 164545
17794 164545 92580 31258 36718 31551 64577 69657 64635 116494 78764 46204 20208 7865
17782 7865 64934 102260 131099 204882 218720 165287 177685 190567 147500 79423 60437 39220
17770 39220 70110 39098 39069 -3212 -2367 -21398 -10203 1881 5792 18869 31965 25136 51204
17757 51204 49199 33357 9967 -14868 4785 -5198 15439 -7559 -18316 -22163 8566 -25805
17745 -25805 3943 60242 70617 31883 47918 60078 17850 19208 15977 79195 105083 101747
17733 101747 111752 62304 81242 69865 97360 128665 125134 99873 62935 55221 25477 20723
17721 20723 58764 21812 -661 23711 57436 65424 121600 135653 99472 151154 136933 106390
17709 106390 72376 73509 121058 210165 230445 222555 195578 134185 62936 19213 -47510 -37155
17697 -37155 -19429 29994 46586 275 -406 13991 62204 52460 2535 -48934 -91530 -31009
17685 -31009 34020 7827 36243 61320 61546 -19544 -65242 -79892 -91178 -100364 -93627 -58491
17673 -58491 -13840 -8984 13630 24034 56036 45117 46188 19952 689 16357 393 -28126
17661 -28126 11255 81908 152945 149395 145877 129989 98390 113668 174378 139733 90778 21037
17649 21037 48997 58725 7363 6804 -15919 -17244 -58477 -95221 -128376 -145408 -93932 -41821
17637 -41821 -60652 -69144 -85866 -118647 -107025 -104444 -89352 -65324 -86476 -122449 -140129 -69284
17625 -69284 -33968 -57429 -21285 21879 17496 -60608 -51275 18108 45529 35299 18211 68994
17613 68994 39391 -33791 -59507 -45127 23596 48085 74999 82053 116634 119662 80578 78465
17601 78465 100894 170849 197174 160118 157043 186421 206757 235315 270172 303909 286934 283156
17589 283156 279754 301353 370525 332893 313771 364270 352132 349497 336523 340747 295914 260057
17577 260057 237451 225380 223070 243305 276362 265216 229057 194525 87612 55513 113118
17566 113118 202545 184274 150527 129598 111293 107492 151655 172296 152956 92099 99002 138338
17554 138338 123943 145129 203787 249857 253911 233749 248333 293372 284833 301911 303483 345818
17542 345818 365175 370078 363084 341103 361816 418271 418455 350989 285061 293906 294748 250681 242779
17529 242779 213072 200548 197937 228188 243550 199838 179225 196561 196484 163367 124508 74439
17517 74439 51430 88458 67839 34242 18141 -18193 19998 95817 148458 143699 156049 126225
17505 126225 121955 143258 187715 231653 190047 206526 278825 322020 333490 325008 337182 356359
17493 356359 357157 306362 264706 257165 254440 274864 292539 303465 355585 295123 167142 122627
17481 122627 175541 139500 111673 89069 55004 39424 27817 -8500 33960 96901 106666 95226
17469 95226 118376 78630 67240 60779 80269 130577 99236 108241 150774 157414 116380 80922
17457 80922 110396 147912 157379 170592 235371 333488 382342 432946 453646 464609 488478 523885
17445 523885 529622 519302 524751 494817 457250 431620 460361 459910 450501 351483 276960 309892
17433 309892 301149 329457 364787 305302 213882 156451 101676 71679 58250 29761 12048 -27298
17421 -27298 -35114 -273 16670 -61151 -44598 -34704 -25354 -20626 -76498 -87294 -84006 -72198 -67316
17408 -67316 -32254 -175 6232 -30617 -8661 14245 -49635 -82865 -71963 -108616 -95301 -87747
17396 -87747 -39372 -39658 -53247 -32680 15112 40248 22870 -44852 -92367 -137414 -86399 -79341
17384 -79341 -89500 -15800 17597 944 7786 -2531 -42497 -23320 1194 4227 43489 -6351
17372 -6351 -54084 -13348 -12949 -74471 -81645 -59264 -22234 4197 12892 7765 41544 48430 -22413
17359 -22413 -34268 -6623 -2129 -25202 -29828 21167 27726 46125 23325 -19408 -52019 -31733
17347 -31733 -27935 -20928 -67166 -91300 -86312 -58587 -23065 -16723 7299 -14774 9949 4570 -42161
17334 -42161 -69362 -62230 -101115 -94462 -108155 -102638 -59585 -32676 22022 83122 99502 44965
17322 44965 27451 35430 -29175 -65492 -45779 -52705 -80432 -133189 -106604 -42890 41727 24657
17310 24657 -25987 -47629 -38210 19823 41610 -3395 -62785 -101993 -88826 -62304 -55311 -81670
17298 -81670 -84036 -87100 -64541 -37540 -56154 -31385 -52406 -19171 -23622 21410 53795 30406
17286 30406 5771 -7287 48254 53947 60769 31882 41093 55192 68311 43661 26523 38163
17274 38163 -42649 -106675 -71320 -34541 -4415 -27182 -77547 -67650 -102554 -102143 -51209 -23693
17262 -23693 -29522 -48711 -43035 -35601 -18580 -22965 -39593 -14156 25643 24475 69 -22818 -51784
17249 -51784 -63195 -45044 -98061 -82280 -78958 -155905 -169084 -177801 -128846 -130972 -148797 -104464
17237 -104464 -110667 -110007 -53921 -19401 5558 -54886 -103801 -129701 -172889 -130251 -65768 -41426
17225 -41426 -63615 -65007 -65694 -69502 -47534 -30222 -78013 -38455 2059 14833 -31498 -72952
17213 -72952 -34853 -39784 -37883 -28238 -37380 -39219 -4424 27652 754 -6431 -36629 -21474 -62366
17200 -62366 -93545 -83632 -26769 -1865 -3691 -32046 -16764 7480 -19184 -24154 -9206 -3847
17188 -3847 -38038 -16382 21536 37329 -10204 -21361 -1881 -22104 -24173 13048 -118 -41537
17176 -41537 -58722 -78908 -97204 -51560 -46007 -112107 -109387 -67358 -13264 17132 -11998 -16275
17164 -16275 -24400 -40476 -36342 8364 -8328 -31022 -26172 -37868 -11598 -5074 45657 27008
17152 27008 -54258 -85391 -55247 -10879 -46818 -63154 -54581 -5563 -75386 -68522 -29613 -24691
17140 -24691 -33949 -69978 -84435 -31865 -17788 -10765 -9424 -5342 27492 -22949 -69151 -81506
17128 -81506 -109415 -59035 12744 5832 -268 4619 47351 38323 35058 -39792 -29642 -18748 -27223
17115 -27223 -50264 -35680 -59613 -97312 -119985 -65100 -39346 -42077 9792 18253 3842 21904
17103 21904 3010 -43167 -72966 -37574 21017 37429 3778 -50594 -40054 -57306 -82491 -76425
17091 -76425 -89320 -37995 11298 -16707 -39194 -52553 -26229 -11223 -11187 -31030 -50510 -39456
17079 -39456 -48416 -74718 -88785 -84535 -58833 -21763 -37861 -37496 -38303 -34328 5243 24728 -22473
17066 -22473 -91112 -71235 -44760 -16265 10591 47971 33856 22338 6682 -45980 -60659 -68280
17054 -68280 -110314 -103847 -105187 -66546 -55850 -70321 -20286 -12681 -1688 3103 -45309 -64592
17042 -64592 -104570 -125966 -73428 -24077 38504 82413 33803 10146 -29585 -47219 -75141 -6108
17030 -6108 -21701 -43685 4217 74734 45829 -9392 -45214 -76343 -112850 -65438 -89057 -105416
17018 -105416 -56206 -17822 -13703 39484 74179 35390 -15187 5828 19507 5266 -16220 -47108
17006 -47108 -31013 -43106 -87977 -73065 -26609 -20806 -7856 -16804 -51001 -67596 -73766 -41092
16994 -41092 -36286 -72366 -90809 -39789 -22977 -17481 -7638 -5990 -40788 -65013 -59390 -72564 -101760
16981 -101760 -107540 -93086 -53064 -17817 -4268 45380 82676 21393 -42681 -93262 -96012 -57081
16969 -57081 -61718 -82611 -49527 7204 -17284 -60496 -41460 9939 12078 3623 -44654 -82476
16957 -82476 -65516 -52522 -57942 -119342 -110271 -28506 13885 -27833 -21542 30413 73260 65440
16945 65440 34249 -4131 15045 16502 -7558 11622 -10143 -14557 -909 -20518 -78408 -114488
16933 -114488 -101039 -55639 -39819 -43054 11550 6529 -25025 -26889 -66435 -67122 -106169 -88828
16921 -88828 -86127 -37730 1163 1606 33305 56626 19581 -34684 -41349 3846 -3564 -10909 -26385
16908 -26385 12122 -66401 -63760 -29423 -1084 1133 -57862 -81265 -69025 -51162 -48796 -13874
16896 -13874 4963 14023 -4516 -21771 -65278 -25700 42696 52715 58935 45007 -9290 -16758
16884 -16758 20537 6227 25968 7935 2086 -5213 -16473 -96537 -85304 -29397 -19133 -61776
16872 -61776 -106944 -80947 -13326 517 -23346 -53212 -13344 -15216 -30330 -51652 -38399 -93180
16860 -93180 -151162 -145951 -82875 -86030 -88637 -48188 -19630 15646 -15910 11072 38300 3768
16848 3768 -12047 5099 17521 46309 42401 21105 -40779 -9473 40501 47831 -10287 -32784
16836 -32784 -35387 -54793 -86100 -86784 -81408 -48954 -23144 5682 -52510 -61420 -12461 17662 45369
16823 45369 88940 67081 72374 20838 -24331 -44357 -47601 -66477 -108149 -74745 -48690 -45069
16811 -45069 -27780 -38925 -112866 -104397 -82152 -20447 4997 19056 -3323 -29949 -66404 -65259
16799 -65259 -72681 -81640 -66337 -45488 2026 -38821 -102031 -80277 -41539 -30795 -59787 -15641
16787 -15641 -19687 -20976 -23327 -31985 -25476 -89370 -115719 -100422 -64782 -86680 -86780 -82161 -60215
16774 -60215 -49960 -47601 -2014 44598 48932 -15624 -40067 -44943 -61555 -64781 -87539 -107534
16762 -107534 -67539 -26551 -54832 -51518 -67975 -64101 -42621 -45930 -53956 -70961 -66959 -46687
16750 -46687 -71324 -61154 -71198 -57158 -34737 -12841 20756 41447 -37908 -75450 -59837 -33538
16738 -33538 -28694 -71012 -114511 -95092 -106911 -101705 -49903 -4437 3586 -52082 -60415 -30192
16726 -30192 -5313 -22963 -24769 6046 -6313 -14350 -26833 -50376 -69229 -93109 -102704 -86641
16714 -86641 -98992 -128509 -102310 -70713 -64198 -101357 -55377 -15753 -36457 -61201 -16754 12443
16702 12443 -3498 -31408 -32500 -11814 -2047 2078 53662 14104 -6642 -14745 -29100 5272
16690 5272 45962 73765 58301 -14282 32849 75542 53258 38466 8332 -11905 -28689 26969
16678 26969 69244 84394 91317 39982 35503 40805 42268 23628 29813 62650 60314 10655 -4749
16665 -4749 -14477 -73513 -148784 -158119 -123485 -60983 -71546 -136375 -158133 -108490 -24889 53759
16653 53759 32038 26857 65470 67622 -1569 17498 20285 -5609 58579 33352 -48158 -105409
16641 -105409 -115092 -78820 -80554 -27063 43386 90337 92260 81466 52196 23448 -14029 -13255
16629 -13255 6503 85 -13197 -3976 2865 -3308 8881 -1984 52638 22397 -29767 10372
16617 10372 56421 40016 15922 -18399 -24862 -29984 -15089 4829 -55890 -81681 -95745 -23296
16605 -23296 26358 -36059 -38223 4822 31175 1448 -20862 -47465 -44864 -47210 -69746 -111300
16593 -111300 -116701 -87588 -87409 -56880 -17190 33459 8557 -8010 -31409 -50626 -95582 -95489 -51831
16580 -51831 -35730 -44913 -51566 -47549 -90267 -121856 -90972 -85935 -64591 -36812 2551 -8494
16568 -8494 -17590 -40163 -25290 -37302 -18743 12879 30976 -23271 -48934 -55189 -87006 -88562
16556 -88562 -84108 -30330 11336 18783 -39034 -63302 -95117 -98181 -112895 -126167 -124212 -60859
16544 -60859 -17165 59240 79967 66538 31461 3860 -15932 -44150 -52767 -33697 -58821 -81636
16532 -81636 -6563 29688 -2867 -37813 -30258 -38894 -10924 -889 10415 25505 49037 48476
16520 48476 6379 18404 -28536 -85851 -139829 -156928 -121488 -55229 -12309 12965 66037 13412
16508 13412 -24275 -16901 24944 41586 17607 13086 746 31738 25978 12376 154 -22786
16496 -22786 -18141 -28391 -51295 -41299 -28063 -5642 -15359 -7969 -35633 -89272 -97422 -61283 -1948
16483 -1948 8880 -72607 -31611 -12080 -70775 -96755 -115304 -91844 -63901 -124934 -129206 -125862
16471 -125862 -135197 -125337 -123455 -133035 -143559 -109097 -66506 -51580 -35581 41066 17718 17593 436
16458 436 -71532 -31506 35638 43711 62309 59173 17460 -17445 58918 39565 -20200 -53853
16446 -53853 -49203 -13616 -32229 -59817 -54412 -42566 -68027 -2945 -11060 -34244 -62410 -117959
16434 -117959 -112187 -84263 -74969 -80620 -91408 -64627 -24482 -64615 -110655 -97334 -62539 -22982
16422 -22982 -7719 -25706 -53436 -42252 -93227 -104178 -79777 -62507 -51675 -86148 -81228 -52260
16410 -52260 -85741 -139321 -129507 -130480 -134615 -109006 -93096 -73826 -41973 291 8771 -24670 -26631
16397 -26631 -57370 -67247 -115247 -76790 -67133 -64731 -90975 -60702 -43144 -54019 -20385 18994
16385 18994 62595 9275 1341 13040 895 3102 24531 22007 1465 35376 -30869 -27160
16373 -27160 -14888 -38983 -29256 25174 76628 13428 -15128 5831 7147 -3923 1111 9316
16361 9316 3045 -19813 20803 52527 27898 29562 62518 65742 70368 47681 26819 -11544 -12481
16348 -12481 -54636 -60343 -24867 12 11718 32537 -19111 1407 30620 6880 291 25031
16336 25031 29672 33544 45481 38633 17172 2493 -13434 -48047 -80100 -60522 -23024 20017
16324 20017 3403 -7797 -732 53483 70453 17200 -19985 22239 44565 26450 21383 42378
16312 42378 47406 46584 59693 13722 -16378 -39911 -72792 -29093 -30839 -31074 -8056 66975 66039
16299 66039 58554 33730 71065 69121 34628 -18403 -46306 -46874 -18592 -12413 5663 -3599 9682
16286 9682 -26183 -31882 -21323 3801 32163 15351 46029 57593 15424 -13750 -41568 -63001
16274 -63001 -25718 39098 69011 93504 -9971 -83132 -76051 -70167 -42473 20201 33258 68909
16262 68909 26113 -31469 -102868 -101834 -52993 -39564 -34765 -58801 -78574 -74495 -87595 -65181
16250 -65181 -95018 -56941 5022 34716 88029 47191 -32416 -57789 -60274 -66026 4937 33165
16238 33165 56588 39143 77832 71019 27982 12789 -6409 16357 -1060 -29589 -42352 -69827
16226 -69827 -59765 -53634 -73057 -92941 -50332 -62615 -81583 -41098 3126 15661 6102 9177
16214 9177 62770 30397 67897 70839 83126 75868 117224 100212 85863 45679 2312 46549
16202 46549 97314 36948 33762 56661 45553 -13721 -33812 -23598 -7558 -10928 -9872 -13313
16190 -13313 11808 2326 -38553 2958 11912 10454 -55447 -38388 -11721 14983 25826 -2127
16178 -2127 11445 -11131 -33410 15631 -29787 -54915 -66072 -103848 -34599 -10030 -28837 -52913
16166 -52913 -22067 -5517 -26630 -47213 -22263 26862 23221 8467 1662 2763 -333 -15586
16154 -15586 -21680 -22470 -8034 -6276 -37754 -44942 -46461 -54248 -38619 -34496 -48470 -48827 -26762 -2119
16140 -2119 29625 54955 1262 -65768 -14496 -8734 -44359 -1197 40837 52894 79561 98094
16128 98094 105979 86262 69097 49483 26465 -30368 -37347 -57389 -6692 32207 -8870 -3544
16116 -3544 7629 30633 -6924 -58423 -54445 -23826 -967 6198 -28027 -60779 -63524 -20659
16104 -20659 33146 37900 824 467 -5512 -2765 -5658 -19694 -53090 -28324 16882 8493 4943
16091 4943 16774 55317 79401 -10594 -57098 -15457 -9604 33676 48393 51205 20536 -16309
16079 -16309 28076 66715 76894 47333 -1180 -26439 -63134 -44221 15014 -15897 -51216 3
16067 3 6461 -49965 -84166 -71369 -98525 -94300 -44225 -27597 -9123 20696 41606 57245 -551
16054 -551 -29700 29942 46965 6203 -47164 -49377 -24122 24441 43391 53834 21881 33682
16042 33682 44396 7328 -1984 -9040 -65335 -96759 -60015 -22084 -52161 -62069 -36130 31401
16030 31401 65331 50649 19844 -16632 -8560 2532 -36424 -43723 -4716 7272 -21128 -6614
16018 -6614 -8023 -23631 -58861 -59805 -61012 -46755 -124506 -163686 -125747 -59865 -48160 7475 52000
16005 52000 69173 102328 123856 155818 171535 85962 -21959 -71723 -54325 -27270 -31083 -20747
15993 -20747 -1364 51158 74275 126751 124378 103321 54585 2416 -6810 -10268 -21562 -21768 -20338
15980 -20338 -25118 -12777 35261 60507 28405 -5025 -14106 9521 10887 -39031 -19550 36504
15968 36504 30379 -49380 -17727 -68172 -76962 -59987 -73138 -28873 18846 17303 -22392 -36895
15956 -36895 -17979 7102 -20752 -32481 -11599 -3815 -9165 -63688 -55630 4583 12781 -66575
15944 -66575 -100322 -71056 -19482 -22736 -59918 -92607 -60614 -49688 -31415 -47845 -32978 -5666
15932 -5666 -7638 21541 9850 -50387 -109983 -136952 -130902 -82146 -58184 26843 57500 -13035
15920 -13035 -52548 -11001 6143 -40563 -37623 14905 39001 69241 83339 78108 57492 15245
15908 15245 15487 29689 28073 49806 97272 105693 85795 64350 13175 44748 87380 35121
15896 35121 -14915 40775 60997 54059 68552 74106 45853 -10973 3832 22449 -8424 19522
15884 19522 53817 5898 -59583 -42654 -15965 13094 31988 69182 57662 57840 59784 70727
15872 70727 67674 35998 -9341 -53621 -70191 -65104 13506 63908 85430 23380 -51790 -61548
15860 -61548 -67068 -89657 -48281 -2079 -59486 -34220 -6354 -12032 -49696 -61655 -41344 -28910
15848 -28910 5279 15348 -3725 -7394 -8812 7300 55670 10140 -26772 -445 25575 19307
15836 19307 20424 -13483 12292 46156 -23229 -41418 -93487 -74594 2660 7503 -28496 -20969
15824 -20969 -34205 -51620 -25107 1751 -4547 -37240 -43571 -16156 37159 124747 88494 20095
15812 20095 2907 -62279 -72409 -93592 -59574 -31888 -57043 -81227 -32273 21678 12999 -10101
15800 -10101 19009 45383 76257 21738 -5714 -14457 -17804 -14539 12335 -51886 -88979 -75009
15788 -75009 -71885 -63694 -49005 -23096 14284 76952 50378 14030 13829 -28999 -77350 -69846 -68424
15775 -68424 -22521 -13411 10338 34421 18722 3990 44294 -15899 -43244 -37957 -19084 19691
15763 19691 17128 -24664 -3717 -20096 -15200 -35564 1286 35998 -24264 -14022 53226 42673
15751 42673 13434 5640 17245 -23853 -24654 30812 78529 59068 60099 70773 78644 58233 18536
15738 18536 22634 4313 -5244 -14632 -3965 9787 52833 9038 4397 12534 17726 17008 -14404
15725 -14404 -20931 -10087 -6773 -53571 -35582 22431 -21529 -57256 -51995 -50079 -35136 14937
15713 14937 14910 -32823 -71731 -48087 -11881 -47353 -27995 -14082 -39233 -4533 -24126 -67595
15701 -67595 -90288 -108494 -93479 -76760 -62965 -52695 -1692 17747 8913 16919 24121 2725
15689 2725 -12172 -17634 -35000 -46910 -26713 -47307 20388 81024 88871 57056 37434 60830
15677 60830 76734 64091 42855 82806 82009 19608 -12792 55045 49096 12229 -52058 -68762
15665 -68762 -49374 12103 62928 90114 73181 71756 84117 90391 93978 99017 78987 94490
15653 94490 101648 73630 2660 -61621 -79228 -96615 -40105 2765 26983 49112 47278 31741
15641 31741 20267 605 -74936 -64934 7417 -5381 -3405 9635 29843 35294 13568 -12444
15629 -12444 -8986 29661 6045 29608 84318 93599 61873 9080 1963 25641 78873 47424
15617 47424 -3515 -10182 2005 13023 54418 111007 93049 26570 12559 -27354 -18019 -36468
15605 -36468 -29457 -59529 -38355 27206 1758 -65697 -71632 -2402 31510 -45892 -72911 -19335
15593 -19335 4022 -7579 -3557 53180 55428 31557 54260 14391 63370 101781 58539 91912
15581 91912 73987 15578 -62110 -66966 -1993 15191 -27035 -25823 -25313 17811 61121 16989
15569 16989 -8472 -43377 -62159 -13987 52905 39250 55216 89217 54633 -2687 12439 -15004
15557 -15004 -38332 5519 39437 -12614 -25539 -64021 -62363 -32585 12148 13312 -46855 -89967
15545 -89967 -59514 -2523 982 -44093 -53427 -35163 1408 -9049 -5114 26278 42795 15964
15533 15964 17780 64668 42642 -15565 -14431 -51960 -57067 7275 58134 86622 71331 11219
15521 11219 2383 53206 35104 17679 -2441 32213 102238 87534 60709 47919 48060 -8720
15509 -8720 -50812 -64881 -42483 12150 -11866 -10511 -11864 -44858 -34291 -25166 -28630 -13194 1518
15496 1518 49009 31205 22166 58020 12694 -19398 -36026 -44511 -13309 21737 67753 122878
15484 122878 105513 71258 72774 80947 95684 92954 49970 15559 -11081 -38490 -57888 -100368
15472 -100368 -113685 -103239 -86905 -30734 -72880 -47998 -1358 45403 45675 38500 39357 -24299
15460 -24299 -15152 45058 88355 81335 66731 53297 13556 11349 -69254 -60954 -20313 -50039
15448 -50039 -19306 -24600 -41319 -18060 10116 37883 31741 -5590 -40817 -9158 225 -32715
15436 -32715 -4066 25261 1352 -27104 -28628 -21817 -14109 -55011 -57194 -28864 9407 9559 -7689
15423 -7689 -39680 -13465 9678 59802 73504 62763 8919 -28139 -46810 -87337 -59092 -88268
15411 -88268 -80985 -28018 -15202 -8165 66516 47777 -2214 -21366 -113881 -98913 -50174 -55422
15399 -55422 -67101 -124822 -132648 -96200 -53272 -96120 -110319 -18499 25154 4320 -4778 -14352
15387 -14352 -44692 -26651 -18940 -24941 -63529 -30374 -6705 -19937 -62035 -62163 -54921 -28857 -21417
15374 -21417 19545 42144 50524 85136 17159 -49476 -51190 -45495 -29016 -1522 -8835 -31423
15362 -31423 -7911 365 -12152 7953 56256 40012 -40504 -58850 -52578 -54532 -33380 3801
15350 3801 102171 121364 104577 85375 75798 62957 48453 23405 75803 64102 30065 27479
15338 27479 61803 23935 -5412 -3330 23734 13172 -58081 -92686 -5775 -6675 -22138 -25909
15326 -25909 -10529 29233 52788 2590 -49544 -61861 -18111 -1519 -5620 16712 24406 -24134
15314 -24134 -31168 -26708 -45540 -9324 32647 -13905 -43035 -43123 5610 77532 67638 10821 46565
15301 46565 37412 79663 109395 27268 6180 54679 65375 7301 21340 1015 28240 14989
15289 14989 -33984 -89663 -24381 8505 32490 43175 76480 90128 63167 24927 58506 33760
15277 33760 28231 70773 62211 5666 -47717 -16598 8467 -5358 10641 18695 29243 72651
15265 72651 39825 34703 7833 -21211 -13319 -26962 -29264 -60695 -63132 -49088 -25435 -23520 -41042
15252 -41042 -57377 -24239 -53126 -72744 -12195 16540 -42302 -64407 -29345 15328 -13343 18458
15240 18458 39725 37325 21884 31513 3603 -14210 -48687 -62996 -82867 -85015 -24781 10447
15228 10447 -18288 2474 50379 64204 6289 -76769 -106138 -108297 -102941 -79003 -51728 -48174
15216 -48174 -75139 -54841 -57336 -89071 -68560 -60247 -58126 -61406 1392 -6119 -50688 -33861 -53584
15203 -53584 -61011 -17980 42866 40917 45023 51775 -3186 -77010 -57872 -42372 -39348 11264 14278
15190 14278 3170 5194 38238 60638 -4709 -10537 -7991 -57817 -89556 -72108 -24121 25967
15178 25967 -1985 22368 -34436 -59706 -69074 -39727 16628 9807 -3492 11335 42730 8293
15166 8293 -33295 -16636 -20174 -50855 -44636 -32068 -35108 -55030 -51713 -49294 13646 96241 91858
15153 91858 60119 -882 -24833 -75217 -72082 2025 45999 51263 61372 18575 -33958 -20746
15141 -20746 55702 80882 85940 62458 53177 56289 -12863 -21876 11092 -25868 -83814 -73893 -61043
15128 -61043 -29508 -6552 -29254 -13916 25062 58308 30252 -22548 -39630 -96242 -112386 -42432
15116 -42432 -33427 3376 70300 90836 113372 111544 79283 52664 26800 25553 -18317 -24921
15104 -24921 -3648 -15083 -49771 -13077 27137 9019 8604 -8460 -39054 -54760 -74266 -25025
15092 -25025 12136 -4172 -13977 -3667 29592 72959 33373 -3328 -45381 -31771 -25577 -27079
15080 -27079 -27594 646 -32591 -2898 28807 37232 55624 9690 -12832 27291 20001 8522
15068 8522 33708 61567 75615 21440 27597 84245 90260 118020 91035 44860 33719 49391
15056 49391 37174 15671 -4140 49275 124112 128885 104305 83494 78025 73117 39310 27025
15044 27025 42818 70171 67750 26370 -17806 -23943 -14156 37537 96073 102066 117276 101387
15032 101387 105503 85490 19780 23782 56217 46735 -15770 -33268 -11123 22029 -733 -1847
15020 -1847 1214 -11114 -19516 23588 43029 31774 17054 12818 11417 -33488 -62595 -43310 -12161
15007 -12161 -3928 -13751 -58758 65 54718 20238 -18885 -49334 -81922 -53966 -39548 -59424
14995 -59424 -87058 -68966 -46763 53470 91232 85509 30118 -16812 -7991 40739 58768 14486
14983 14486 -22789 -49423 15160 46316 22505 25128 32084 -31835 -42919 -41719 -38851 -32029 -5792
14970 -5792 -5876 67692 94742 97110 54134 19979 26661 39668 14505 -17459 12179 17052 -5729
14957 -5729 -77765 -109045 -46631 -13445 -29050 -25105 -20858 -13116 -1899 11342 32738 73079
14945 73079 59382 -36955 -35453 -19336 -50659 -39111 -3340 -46279 -77272 -50767 -64191 -91258
14933 -91258 -82217 -32435 -23777 -31828 -13262 26573 101134 65724 39219 36846 -20297 -28894 19417
14920 19417 35245 -16076 -19710 -39156 -54 -321 -14979 -48128 -46246 -28210 -27132 -43602 -118789
14907 -118789 -164038 -109454 -101298 -112997 -28480 13852 459 37001 -1995 -35478 -34694 -42651
14895 -42651 -25282 -33358 -60058 -106096 -71472 -58549 -60252 -65456 -72175 -33526 33103 101747
14883 101747 82483 76489 42145 -50050 -39827 29187 7101 28723 51826 50568 37225 1450
14871 1450 69145 53786 21320 24120 26744 36511 63059 58205 3776 -6254 -2149 11317 32404
14858 32404 42827 43041 109427 121150 126471 78619 -16256 -69207 -33120 3272 15266 11289
14846 11289 4490 1396 -41529 22066 15343 -29279 -42489 -73654 -41695 53029 101564 60008
14834 60008 13737 -33598 -19719 20754 20517 8766 3485 -700 -28276 -51608 -77251 -82354 8076
14821 8076 10518 -34174 -61221 -82552 -75497 -23130 7741 84450 82469 33209 18559 -71186
14809 -71186 -76548 -82700 -61298 -35917 -2958 2640 -19213 -27647 -43062 42063 130503 83347
14797 83347 65532 71478 36373 74960 101702 61671 22466 43324 22031 -39289 -55807 -72384
14785 -72384 -131584 -95612 -59336 10950 3417 -31510 -3788 33593 51606 15629 3002 27795
14773 27795 90489 133879 97144 102841 64148 34963 53050 46894 50937 32545 52154 61991
14761 61991 51202 -5171 19253 4691 19219 15596 3831 8077 15118 -4847 -42311 -62599
14749 -62599 -4062 12477 16136 20855 -1048 2290 -44866 -50831 -39633 -59257 -82760 -46401
14737 -46401 -15292 15062 42293 -4497 2221 52185 57124 22797 54746 22774 -16152 -25578
14725 -25578 13699 30494 36540 43241 81241 60127 37180 63184 51579 22969 -9238 -50111
14713 -50111 -12883 32799 66832 30478 1861 -28647 -29351 -23433 -21406 3371 4076 5952 -55619
14700 -55619 -92922 -73877 -44815 18128 75381 66915 9097 31651 80878 63340 -1326 -55074
14688 -55074 -72905 -66522 -9572 33463 18762 5440 11407 37427 26265 12117 -1696 -17394
14676 -17394 875 1694 -15479 -46907 -40769 -33439 -41672 -16797 -30958 13028 82797 138404 146915
14663 146915 107177 95267 86430 18033 -48217 -21776 54243 45661 38689 80911 77662 88758
14651 88758 104613 99118 47363 67016 65674 26852 40804 101043 93190 82630 88981 88519 86349
14638 86349 45445 33404 28285 7056 7319 -21702 27681 27335 26160 51112 37721 64876 41385
14625 41385 79345 91595 68021 41645 6790 -9997 -34732 -21337 -1053 7829 20065 17224
14613 17224 -50239 -67241 -51137 -66134 -40461 -39151 -53046 -47800 -13469 36700 36795 -9695 -19150
14600 -19150 -28856 -3967 25063 7388 -54894 -50031 -29390 -39421 -20419 12845 25763 38196
14588 38196 45440 56008 71235 35971 39577 70042 115294 144770 113179 50529 62811 38483
14576 38483 53838 68389 23218 -9554 -667 10072 -12509 -22549 42851 102762 97310 75809
14564 75809 46224 35517 50326 95372 63830 67973 77359 93653 40044 37622 26450 46678
14552 46678 2570 -9600 20280 45941 20758 -113 -15673 -74611 -66511 -56281 -11059 21253
14540 21253 26521 -4441 -29846 -5348 -44839 -101498 -14949 28877 -15087 -4444 -40727 -19985
14528 -19985 3512 6967 39937 78596 90391 66319 56371 -1432 -16744 -3334 3201 -19229
14516 -19229 -59308 -46914 40396 63065 19678 -31568 -55004 -25267 -21752 -14528 -25266 -35583
14504 -35583 18588 34408 17825 53455 66668 50903 28013 -31114 -80140 -62612 -64980 -56930
14492 -56930 -20530 2441 28873 24554 31168 48827 67407 57824 58835 43461 37821 24793 -55838
14479 -55838 -125428 -105973 -38158 -17513 -9943 19725 28374 -21207 -13316 -22332 -5079 18839
14467 18839 51821 29184 64502 74423 64805 57674 -8737 23605 69383 84929 55297 409
14455 409 -19676 -7716 -50561 -59608 -73088 -116582 -97444 -56088 -10472 -11603 5455 37503
14443 37503 46695 47542 50392 31574 -950 18765 48801 58766 76437 23168 -36557 -22831 -4914
14430 -4914 -1760 22850 1539 -9505 -18359 10903 16458 34550 25203 44100 43811 -5514 -7269
14417 -7269 44027 35415 -31409 -33667 11167 40207 56877 26213 11045 -7539 -28954 -38683
14405 -38683 -17932 -46894 -48985 -42380 -22468 -38449 -48659 -18677 -11575 -14841 -20058 -28211 -21946
14392 -21946 -1567 12836 -59820 -121040 -107783 -107721 -81270 -55378 -34790 -4893 43454 77677
14380 77677 88894 65888 68588 38014 -63576 -83758 -46662 -70128 -45704 2370 32359 -2901
14368 -2901 -28596 -17175 -19137 502 -17112 -35453 6223 59160 81230 108458 86418 64361
14356 64361 55554 28009 67400 33627 12020 22020 -8094 -45915 -27967 29922 58694 32442
14344 32442 40438 70578 22031 7338 58389 71122 51090 68918 29973 -44204 -51261 14501
14332 14501 47307 34511 32077 10765 33205 -27317 -66033 -26538 38730 44064 40364 -15105
14320 -15105 5817 272 -1839 -16867 23969 50874 14035 -24544 27367 54550 116174 78241
14308 78241 52537 8457 -22170 -11981 -31121 -101269 -95948 -20193 -3749 7872 -11483 14053
14296 14053 41066 19079 13786 41414 -6665 -28802 -6605 8598 31270 21360 14109 38539
14284 38539 64436 76892 83489 72801 18540 -8432 -9213 14893 -3895 14348 -22976 -90822
14272 -90822 -124741 -119781 -122046 -118263 -82191 -86681 -106537 -90312 -55015 -37457 2594 7863 4376
14259 4376 -12883 32448 48376 44024 40070 5018 21303 70036 78178 38757 4999 34833
14247 34833 37913 -3861 13221 20397 -24434 -19544 -15800 26901 40748 49832 72373 53999 32702
14234 32702 47716 72839 25969 -24664 -5673 13179 43399 62896 33436 565 11847 8810
14222 8810 14198 23575 15146 -36933 -77936 -43998 10756 13273 -13489 10343 -27669 -36971 -19011
14209 -19011 -24236 25964 59838 28584 37099 65733 64912 23064 -61034 -42702 -50146 -9400 21792
14196 21792 15766 34699 54192 56758 48580 6779 -9389 11264 -7318 28927 -22614 -37755
14184 -37755 337 49648 64600 76048 35769 21942 59861 64490 27649 8272 -14784 -23628
14172 -23628 -23036 -28657 15502 -13118 -61389 -31212 23145 40908 -9980 -57922 -50764 -29513
14160 -29513 -26857 -98 4245 -29530 -23279 -20924 -29630 10201 -35068 -95698 -86430 -47815 -18012
14147 -18012 40228 52563 60456 65596 43580 36794 5861 3043 53227 65453 55873 58840 54063
14134 54063 -16384 -52089 -65069 -71295 -39240 12142 12655 -37894 -9691 54005 15883 -10397
14122 -10397 -27474 -45381 -62863 -43486 -42577 -14007 34873 19238 -19652 16388 35647 12058
14110 12058 -16782 -51382 -98326 -48151 -65505 -70834 -74934 -49890 -45240 -24078 -34395 -44246
14098 -44246 1581 -12085 -6884 -14845 -35621 -67794 -102580 -60166 -7627 -559 51642 74189
14086 74189 35302 48347 76183 73715 13081 -29645 -37245 -16640 28620 50041 30357 16522
14074 16522 -37858 -129889 -93337 -50441 -74742 -74539 -45155 1038 -4878 -15739 -12478 37487
14062 37487 62307 82440 131186 75304 -27059 -14014 10730 27789 36731 10220 42283 36062
14050 36062 -146 4198 10266 5996 -74109 -68625 -28468 -11480 8350 49782 29582 -2486
14038 -2486 -14300 -22828 -24757 -28494 -48813 -49259 26672 76102 80283 87992 77491 54875 51888
14025 51888 58087 79167 82986 42728 4621 9582 6479 15918 3986 -8666 -21074 -2538 -16274
14012 -16274 -24418 27257 44622 45303 37094 9862 57464 97376 60446 44710 36134 35782 9266
13999 9266 -4132 30991 50439 37111 27926 34390 55588 24279 -22174 -217 43052 70310
13987 70310 72884 -6753 -3362 41624 34151 -8837 -20259 -2248 -21063 -4768 35319 39505
13975 39505 28217 -12398 -38148 461 35511 71421 60386 8430 -5587 -25337 -43898 -57241
13963 -57241 -70605 -60176 -9880 24097 86488 121279 72327 94803 97999 109374 93566 68493
13951 68493 34278 23424 15531 38695 65165 72619 72915 36002 13574 70779 66010 38459 86442
13938 86442 105403 49289 2246 34801 57153 71630 81400 42101 71321 76735 56529 35724
13926 35724 48974 97521 81244 60758 -2108 -46451 -53915 -33884 16766 28001 17478 -4187
13914 -4187 -47585 -45084 -41540 -14857 -79851 -62255 -41548 -54908 -64266 -34333 -14372 -3766
13902 -3766 -8120 -51268 -45217 -29130 6834 74665 62003 76834 67147 35178 32775 26342 48639
13889 48639 80240 53669 3849 -37307 -68885 -56506 -18390 39733 132205 135595 86755 1711
13877 1711 2339 1125 -60033 -82167 -84012 -59166 -31475 34344 16828 36712 -15233 -20360 868
13864 868 14439 19791 41727 89471 56411 1486 6812 -13874 -16537 21626 1780 21014 40169
13851 40169 70931 80175 42198 2290 -21513 -53433 -34174 -9351 16227 1141 -20711 29201
13839 29201 9834 62716 70811 32483 22099 17273 22408 3691 -56936 -57892 -61373 -59354 -39900
13826 -39900 -51459 -52789 -26286 -52774 -87862 -131212 -88962 -79031 -105853 -42616 -16144 -37110
13814 -37110 -67748 -73335 -18723 -15343 -31356 -6573 7658 -62334 -100389 -65463 3197 16308
13802 16308 26215 47559 83682 107874 124289 93915 49320 58144 67814 77098 50190 47322 29042
13789 29042 -6499 53373 13772 -11891 -12618 -24695 -16115 -13480 -33697 8407 54319 42630
13777 42630 26773 31342 51285 46083 56378 39748 28321 2647 -33224 -61471 -32680 12411
13765 12411 42539 70201 65830 31158 44117 28944 43224 41276 39977 15375 -58725 -33937
13753 -33937 40207 50120 37956 9351 16800 -30479 -51680 -51381 -31135 -28492 -48761 -67531 -45215
13740 -45215 -12213 24057 55851 10820 -20023 -9386 44199 40927 44339 65398 83355 86226
13728 86226 73569 -1152 -35796 -44094 -13016 -24126 18589 89090 78816 57657 44369 45061
13716 45061 67462 71118 47591 -18582 -80527 -4406 59290 98461 92559 77532 105136 48042
13704 48042 -22576 -86043 -82496 -41550 -17814 -41356 -42307 -59563 -34676 -7154 -32163 -61271
13692 -61271 -41218 15175 30649 35283 6386 8313 32403 18147 -43886 -62049 -111977 -105613
13680 -105613 -67055 5858 70344 44983 -20304 -29526 -20257 26847 42629 27084 -5737 -16189
13668 -16189 7102 43898 52966 41669 34635 48045 101842 24107 -48766 14665 71362 24713
13656 24713 -25339 -42997 -35961 13091 42466 79054 102587 106032 80617 51058 16543 16647
13644 16647 -1965 -1257 50764 75428 21890 -2416 26201 2371 -25505 8283 2904 35804
13632 35804 25418 24851 -15680 -7070 -59434 -18038 5163 -17442 -28366 24874 -10977 -44482
13620 -44482 -49715 -45814 -28377 -55314 -42105 -5011 23051 3004 3799 34060 26427 21636 -4542
13607 -4542 47051 95997 79157 56614 17683 11581 -10971 -40393 -75098 -57511 -27732 -7173
13595 -7173 11070 33814 55515 82061 57967 44678 4179 15772 56451 78058 76229 84003
13583 84003 88052 26899 -28600 -77290 -59735 -7745 -6184 -37976 -27266 4088 -53914 -93229
13571 -93229 -58220 19447 31565 60694 79173 64163 40632 59810 67926 30479 -1374 10560
13559 10560 -1531 32982 -13513 -5683 12952 -4388 20525 2329 34057 -9017 -68517 -50696
13547 -50696 -3718 44717 63975 55603 68962 86575 73597 79731 142744 152162 118800 97583
13535 97583 -12708 -59964 -76925 -24563 21479 48306 48597 44052 12187 -22390 -30872 -12481
13523 -12481 3952 -13684 -23485 -29507 11625 41592 17623 -24517 -12765 34731 177 -24069
13511 -24069 238 62618 52747 13094 -19465 -81303 -57323 -29376 27827 50622 7291 -3300
13499 -3300 12468 52836 28242 26953 30425 8432 -61874 -68030 -59503 -99049 -86377 -110207 -75385
13486 -75385 -30174 -9003 -49686 -23448 15552 1793 -34333 -24377 5987 -27142 -9471 -27885
13474 -27885 -18690 -19092 -80837 -60291 -16331 -7654 -6262 -17912 16092 11450 -15100 -28525 -25454
13461 -25454 -22725 -29749 -20579 19088 34279 16194 34939 48806 50429 45441 -15604 -4772 6778
13448 6778 11460 -628 -16641 -20329 -49068 -96304 -71605 -14398 9258 23025 5737 -364
13436 -364 25948 14672 16411 44023 95924 146758 95236 2296 -5117 -10616 -14095 -17179 -27873
13423 -27873 -23229 -38118 -561 67165 66772 103083 137187 55440 -303 63891 81696 47246
13411 47246 54516 17259 -35673 -24125 -8394 1177 15419 11227 -20905 -55128 11813 18379
13399 18379 946 -4547 -19454 2106 9220 -6012 -30654 -77142 -79622 -60621 -5968 35515
13387 35515 65767 63785 62295 62102 87177 85245 115228 169255 141837 83679 85205 87944 83855
13374 83855 82401 85633 64584 17239 -30794 -27217 -37924 -76609 -75409 -17350 70056 52634
13362 52634 23367 -4986 -20853 -41687 -46636 -9927 -6290 34027 54051 47978 39888 59813
13350 59813 70414 85879 92111 71849 6472 -21813 18888 41449 48636 44535 45416 22035 17764
13337 17764 38177 56256 53346 83711 47650 -4025 -51340 -54049 -19070 -41630 -46264 -52799
13325 -52799 -46842 3872 67107 54743 76222 100509 55145 46257 4120 -3687 -14292 5324
13313 5324 39560 55576 73374 22857 5424 35233 -3326 -6708 -37319 -9688 29982 39902
13301 39902 2048 4700 47479 65133 82303 4460 -33206 -35585 -38873 -8464 2229 32338
13289 32338 43097 42972 45839 55645 41959 3321 4276 623 54282 103237 88331 18227 14295
13276 14295 54421 53080 10649 -18580 25221 31584 84479 81906 33990 -25804 -25883 28615 38796
13263 38796 52495 56029 28111 3039 -18185 -25176 -19968 -7576 -35455 -92611 -124792 -95962
13251 -95962 -841 842 43076 42687 -17220 -7449 9603 8571 2967 22437 47721 49856 10681
13238 10681 53937 66634 108374 87713 75420 79092 78681 52797 97277 44194 -24222 5704
13226 5704 38486 56153 4488 -38704 -37562 20927 56088 55644 61786 73072 63623 41520 72075
13213 72075 70781 42446 31445 -58820 -112861 -82240 -73294 -44634 20852 31190 774 2251
13201 2251 9502 -6378 2815 67025 28794 -12602 -885 29650 52110 67582 42283 -17476
13189 -17476 -46061 -44990 12736 10806 -35890 -56275 -74471 -25524 -34636 -51210 -40178 -15315
13177 -15315 28202 22575 16191 7137 13600 48871 53778 -1221 -11946 39932 32768 -1308 599
13164 599 9224 -6058 28004 33720 62607 91931 97831 71985 2834 -1653 -34807 -99573 -59674
13151 -59674 -7200 21914 61425 79568 15871 -49961 -85204 -100755 -91004 -67949 -20651 -24347
13139 -24347 -25256 -16743 38020 59507 31020 -27535 -52669 -41231 -68737 -102231 -68529 -46481
13127 -46481 -32107 20626 -21432 -5549 31222 -20976 -61932 -51420 -34245 -27773 -39888 -79991
13115 -79991 -104514 -69799 -7619 26588 46691 15893 -11184 4282 20045 9699 -10641 26846
13103 26846 -2062 -2608 -1356 14467 17127 46859 80897 59247 51441 22177 -741 -15771 -9074
13090 -9074 22478 51199 58774 -12657 -58266 -58852 -2088 58820 38406 25303 34960 -20900 -85353
13077 -85353 -69128 -31660 -6138 5085 -5142 -26435 -45436 36235 46334 69786 69276 14854
13065 14854 -3683 18936 -31498 -43937 -18100 48628 48240 46855 38322 46523 60804 74885 103818
13052 103818 83310 57837 22135 -6112 -52912 -32918 -30896 -3552 23804 29183 -2069 8266
13040 8266 -5936 10443 8106 -5641 -52501 -46669 -5888 1218 -512 -32976 13881 56000 46349
13027 46349 47618 33991 7538 37827 17858 29835 23281 -52204 -79140 -24518 36953 -8449
13015 -8449 -66961 -63728 -77925 -77301 1959 69023 44885 58598 1487 -14227 -41827 -55607
13003 -55607 -14396 19263 38196 -28813 -79559 -79485 -40239 -30357 -76510 -78988 -42679 -47426 -53388
12990 -53388 8053 12483 9544 -15091 -74952 -50960 9457 27388 19874 -10797 -10525 -3365 27467
12977 27467 63078 11754 -37345 -3124 18025 -12631 -47622 -12339 25355 8124 -31153 5027
12965 5027 8771 -42255 -60763 -27435 30550 77608 98251 89394 84362 60039 15683 19279 13151
12952 13151 29087 23106 28356 25903 19398 -42844 -39330 -6748 -4341 -75431 -89352 -107960 -136492
12939 -136492 -91229 -40837 49972 63495 83380 66775 23249 14090 -28862 -10366 30388 10628
12927 10628 2861 4586 53463 59307 54610 56946 -19601 -78423 -78403 -23142 23467 101595 157019
12914 157019 110091 81188 19767 12035 59345 55154 19351 -13092 -48947 -13369 22456 42897
12902 42897 44268 35076 13894 -45573 -17074 41637 59014 67896 41270 28031 32557 17527
12890 17527 16285 36076 37982 72097 97942 74387 96543 128422 126554 106434 72906 21757
12878 21757 -57619 -64479 -36007 -32357 -4642 20491 -18426 -49816 -32343 -22856 -29801 -581
12866 -581 58130 112802 116410 109146 73616 26139 37140 52219 -7070 12486 52288 47004 60800
12853 60800 34609 50896 55235 36373 4000 -39724 -46805 -28389 -35584 -59776 -87096 -35419
12841 -35419 33552 -11471 -59342 1568 33325 14117 -56027 -45561 -23516 24395 24428 -13968
12829 -13968 23904 15026 -31452 -25684 48233 67687 36941 28763 71591 48277 38054 68649
12817 68649 82229 8722 -64758 -42572 -34636 16523 18057 6016 -48608 -64967 -125016 -137413
12805 -137413 -61118 -38088 7966 33596 4285 -70240 -51003 -11040 -55650 -45113 21028
12794 21028 5971 35225 44428 10138 -33448 -38324 31102 20143 33015 26277 22156 -20327
12782 -20327 -87622 -78787 -61541 -41260 31340 49798 86241 104188 60113 32249 10061 16225
12770 16225 -46948 -85204 -77681 -66437 -36063 -68216 -94800 -78145 -77687 -71671 -30684 -12006
12758 -12006 -45968 445 28473 18110 9611 -3137 -10385 -37506 -45015 -10938 35611 40478
12746 40478 -5003 -36143 -71321 -59352 -15476 -73241 -74480 -40899 -67122 -41405 8521 45411
12734 45411 28782 2148 -11496 17332 -4670 -2451 52661 36094 30976 25876 44739 55949
12722 55949 24280 17594 -1360 20313 -36106 -19336 11369 30719 10862 15407 31997 -5641
12710 -5641 -12314 5203 18834 -16928 -55087 -67973 -46920 -3578 1077 -11840 -9953 -36008
12698 -36008 -10967 15332 3870 -52529 -24829 -2044 42380 98936 100132 98431 70413 67227
12686 67227 54744 22336 67155 66552 87460 55640 57229 49151 -1062 -24368 -33091 -7704 -10371
12673 -10371 -29512 842 20409 25206 52284 11638 -48261 -10492 11061 27645 33082 61189
12661 61189 57870 68521 38934 -2771 31735 66065 42693 37212 5998 -50270 -69468 -67189
12649 -67189 -68044 -67345 -43411 -9696 34860 2778 -67137 -54483 -55492 -123557 -75292 -29269 -21587
12636 -21587 -6534 29243 26155 13564 44316 68259 100963 120617 113270 98025 54626 46791
12624 46791 42554 13484 30019 41466 40769 48105 17320 -13443 29668 70512 58237 86757
12612 86757 47131 26025 4380 -41226 -69801 3232 2129 -13553 -52743 -48431 -26306 -33442
12600 -33442 -21423 21816 -16738 6873 21066 -18769 -59737 -48660 -20521 -19817 1645 4934
12588 4934 39931 45155 27014 43497 -3025 -41731 -80977 -35300 23566 20332 -2929 -26461
12576 -26461 743 25232 33859 62441 89798 93233 66470 36193 22204 -48425 -59132 -50180
12564 -50180 -13797 -31945 -72545 -37478 46758 40001 52486 19128 -3829 -23922 -3817 4401
12552 4401 -41615 -51836 -56115 -5459 38663 23820 2549 57584 53217 45550 76471 62338
12540 62338 41460 35485 10909 77931 74180 57532 754 13299 20044 -52448 -36720 -50810
12528 -50810 -43576 7728 26706 23323 44666 61902 28144 -609 11968 55521 7707 -3746
12516 -3746 -50843 -54139 -61644 -23210 6833 -205 64543 65083 21127 17816 -8360 34283 130921
12503 130921 123993 58716 -3594 23337 68800 68199 1424 17624 -7319 -7856 -10012 13685 28994
12490 28994 14602 31756 -18847 10794 68163 56020 -35882 18065 38511 44653 17003 -25449
12478 -25449 -729 34764 19443 -508 -30818 -13646 -2982 -31479 2772 18147 -6998 -12447
12466 -12447 48206 34235 -21556 -14345 7566 8610 21482 -11124 -24838 -3323 5918 -24476
12454 -24476 -3811 25173 38745 53146 9435 52708 98955 68392 7073 -5317 21297 43269
12442 43269 9183 -41678 -16300 66245 69229 28617 29236 61681 95938 116431 54282 43169
12430 43169 30498 23466 37826 56611 57465 60528 59300 49009 18673 7733 -42218 -10561 22263
12417 22263 -14936 -55650 -45649 -45423 -85829 -78264 -37008 -29831 -11770 15112 8636 -21729 6356
12404 6356 -8043 -17652 2533 50026 23080 23855 43038 45216 59595 54923 1621 8833 -32718
12391 -32718 -29224 -5895 -11644 -18340 -43597 -56594 -58541 -110261 -66629 -4148 53999 79380
12379 79380 52410 39377 30449 12015 77056 83076 87248 104279 129651 122745 102558 42239
12367 42239 53830 21390 -20981 30901 62504 83659 57757 38061 48512 49556 -1909 14587
12355 14587 29395 1068 35613 66696 24845 -40697 -9684 17846 74294 40036 -26684 -92091
12343 -92091 -67876 -38009 -38896 -87509 -40370 -70964 -71053 -53796 -6871 -1795 35339 79033 82944
12330 82944 50092 9811 16690 45360 70617 107088 94521 41117 53033 101595 50664 32435
12318 32435 56479 35309 14856 15735 27290 40149 -2656 -30281 -12885 -57343 -105072 -86168
12306 -86168 -32680 -14641 -38241 -58819 -40072 -100356 -154214 -107630 -68064 -51206 -47497 -3181
12294 -3181 -8957 -253 -33373 -71124 -101959 -100180 -72412 -57326 10125 36564 -12245 -23513
12282 -23513 -1181 32430 8767 2110 15628 27050 31585 -18544 -74856 -57343 -43114 -3353
12270 -3353 -47764 -48767 11031 100181 99948 94768 48470 -31398 -10403 37676 6701 -48383 -78944
12257 -78944 -46756 -17642 8392 81444 121842 110558 109318 50022 -14074 -44613 -43887 -30193
12245 -30193 1074 -54798 -44804 -13699 -19386 -20476 8535 -4085 -32122 -13042 12614 34254
12233 34254 62446 -38334 -134540 -135219 -32180 74 -52421 -33839 48623 50132 46575 35705
12221 35705 3493 11483 29238 30018 69325 66515 67858 52761 2847 -6651 -36282 -4766 2952
12208 2952 -20230 -65855 -60730 -50627 -32206 57562 32310 -19876 -69229 -80986 -44976 -102353
12196 -102353 -100904 -58135 11673 68695 52857 30994 44016 21335 10577 16697 25052 79852
12184 79852 45902 -19996 -71473 -36375 55784 116995 58547 21937 20064 30683 30103 35634
12172 35634 57557 61243 9953 560 36742 5166 46067 24973 -304 -12878 -958 65837
12160 65837 51712 38745 28267 -33548 -57329 26141 77513 58696 22351 38954 51929 38427
12148 38427 9080 -35399 13527 47247 24258 38858 25772 27090 52879 81186 99201 87023
12136 87023 59435 29628 19316 61263 60162 41477 -1873 -1518 21371 25745 6879 21386
12124 21386 -2706 -42237 -57061 -50532 -77246 -81336 -2676 82389 117105 105477 91326 88574
12112 88574 79956 48436 -3514 -28006 -16363 -35254 -8701 -4439 -23253 -45237 -82618 -95694
12100 -95694 -62137 -14549 3968 4914 -9182 -29222 24087 53143 10261 4798 35614 45305
12088 45305 35731 15552 31793 55752 28228 45524 22490 -32109 -31016 -27157 -53270 -36279
12076 -36279 -18808 -24727 -4195 37522 9520 -50827 -76893 -26443 -38190 -59828 -78573 -73641
12064 -73641 -109957 -100198 -101409 -52909 -16369 -26594 -8565 -1067 30341 51126 19499 17457
12052 17457 26941 -8880 -41089 58501 26261 -27000 -17547 -7073 6422 14891 45686 84071
12040 84071 35837 44554 10181 -25129 -15587 -8401 -17881 -49495 -38069 8146 21819 -12802
12028 -12802 6947 56346 90214 67350 47489 77429 83989 42938 12076 1146 16354 17346
12016 17346 16760 -21134 -4476 55883 27099 9984 -7730 5977 38271 30745 -30364 -37441
12004 -37441 -20984 66201 84646 -735 -32775 -73289 -144471 -116206 -3490 33627 23644 11400
11992 11400 3517 -10390 8848 36716 22919 -15349 -35985 -72820 -55475 -42818 -29205 -68613
11980 -68613 -42533 -34527 -73993 -105690 -69499 -57920 -15625 37451 71006 69508 43512 66799
11968 66799 89826 70766 77295 8972 9232 3599 -48625 -52315 -18070 75287 83525 73596 33565
11955 33565 -29463 -6328 60332 68616 19868 -17294 -37286 -26781 2133 9349 53643 83169
11943 83169 -1042 -36323 -27158 -42252 -15520 57531 61867 53605 35478 -8003 -40093 22421
11931 22421 72987 66011 57817 64233 12372 -1429 9538 -11303 -6708 51692 46118 72424 65678
11918 65678 -2852 -10066 56381 103199 121333 129595 59794 3132 13095 -13870 -3700 -20814
11906 -20814 -32984 23100 65701 67837 -6324 -60189 -59485 -60224 -28844 -40531 -102472 -104080 -58009
11893 -58009 -62069 -84352 -85662 -94830 -54166 1729 28479 59379 82531 62962 70370 47010
11881 47010 16831 11327 1457 40367 4531 -43328 -45345 -17144 7926 19104 44551 16703
11869 16703 2749 -25762 -11508 40899 76871 72059 23555 37473 -3993 -44525 -46512 -64991
11857 -64991 -75673 -94316 -60077 -38975 -68714 -94215 -58145 -43676 -63443 -99160 -97799 -64255
11845 -64255 -32358 -18793 -28955 -18804 5490 -27691 12268 54598 44427 -29546 -68081 -30831
11833 -30831 30743 44307 12995 -13650 -19556 -32556 -3832 39832 33294 -1255 -76622 -28818
11821 -28818 42146 61205 38575 -12996 3022 -9927 -22659 -3450 -35676 -37208 -24279 -5977
11809 -5977 -21958 -32478 18955 -24481 -88347 -50562 -53815 -68161 -78521 -75206 -38803 15544
11797 15544 11900 37993 10201 -86 51693 92800 72161 82151 92954 50059 3723 -28872
11785 -28872 -24625 -40101 -34546 -29801 -18050 23071 11886 14689 23233 13912 -24921 -116847 -85612
11772 -85612 -35894 -51347 -21390 3597 -54906 -102 69912 130331 120982 104634 101759 94356
11760 94356 110140 104472 49827 23668 15744 29765 -22600 -30374 -696 15229 -4122 27435
11748 27435 20782 -23491 -32558 -2813 28791 24878 49256 92577 111156 134093 123490 63295
11736 63295 72561 63096 110327 56391 16960 26184 43006 44100 34942 11289 26306 45255 -21964
11723 -21964 -22533 -38416 -51311 -13438 24877 31327 54371 41565 20708 -63268 -11000 2591
11711 2591 -18517 -16615 -39919 -47804 -660 -18112 11062 6391 -25076 -70305 -74115 -31803 16328
11698 16328 -23973 -27452 -41142 8338 -27363 -13068 -17027 -33106 -19707 24651 50086 45495
11686 45495 4464 -23577 -17185 -40435 -9186 -16946 10177 20852 59649 58485 35222 12989
11674 12989 -16993 -5158 23370 24901 -2531 -80019 -127423 -73870 -21151 23132 6662 -18864
11662 -18864 31363 101701 71775 41313 17980 -17508 -11166 -19164 -60964 -50263 -25343 -2899
11650 -2899 5819 5169 17384 35094 67934 53796 56503 53559 13003 -48840 -63052 -89170 -82847
11637 -82847 -41410 -32124 -51529 -77804 -112336 -108681 -125573 -139381 -77000 -18756 -7850 -2128
11625 -2128 35467 32061 10345 -9199 -66621 -92449 -82566 -51505 -54807 -24595 -33252 -32930 -28246
11612 -28246 -70169 -111209 -104794 -89712 -54315 -23166 -47450 -31351 1765 -39146 -93051 -118312
11600 -118312 -73202 -42547 -8710 43548 48813 19604 -29681 -15894 -60765 -26075 3364 -2855
11588 -2855 -50192 -32048 11262 14761 38582 39708 6649 30637 27736 12950 61476 90196
11576 90196 86757 36155 49595 39855 -46435 -103240 -108503 -101139 -50489 51984 60269 24507
11564 24507 29531 59720 61516 32168 21478 7151 -11150 28607 49848 63065 37297 3058
11552 3058 -27479 -34239 -49711 -24299 -3893 -20706 -53623 -16008 31405 39565 33111 27630 26601
11539 26601 17679 -35556 63 13811 -12727 -19185 -28201 -30274 -11601 -24380 1755 -1043 -39930
11526 -39930 -58716 -17204 16925 54987 48542 18436 -30539 -63850 -44985 -39206 -12175 17079
11514 17079 25645 20014 23621 6379 -77 61692 72280 41758 -14945 -67906 -47022 -9745
11502 -9745 -25054 4872 -8042 -74521 -52890 -13701 18268 37726 14381 22369 7877 -30738
11490 -30738 30995 24339 -11250 -33319 -9119 29622 51000 76647 88077 95948 51124 61195
11478 61195 55493 85066 8504 6294 22158 31935 50694 48048 -10969 -34605 12707 100270
11466 100270 153905 79156 76780 130555 171202 146255 108324 133573 84328 41039 40880 14017
11454 14017 -10102 3807 30263 56339 32158 3774 71 -12956 -1379 -15099 -3212 20680
11442 20680 -18989 -61165 -88034 -45007 20364 88698 121266 52372 32188 29290 77617 82096
11430 82096 79936 136110 146508 80488 285 -18451 -45206 -65475 -14094 -6989 -18670 34122
11418 34122 47869 -15415 -47074 10002 39212 11736 51436 45701 14681 12050 -14946 -29613
11406 -29613 -50658 -44223 -29022 -58290 -81281 -27103 18558 -26027 -32172 -35486 -19538 -40614
11394 -40614 -112493 -128127 -61756 -51315 -14449 25164 13164 34422 37656 27918 16455 -30674
11382 -30674 -44936 -20087 20290 72391 109709 85592 52364 70774 117578 145664 140764 62036
11370 62036 10194 21134 35684 55366 22743 17104 21148 -7204 -38318 -20428 12162 -8952
11358 -8952 -53714 -72947 -62383 -32766 31386 27425 -18052 -16120 -36764 -64417 -66274 16470
11346 16470 56863 22213 22633 540 24917 6512 -66684 -36723 26809 41554 24552 20599
11334 20599 4050 -11303 24505 -21822 -40240 -50611 -44418 -56543 -18374 18314 15773 44681
11322 44681 31349 -22979 -36521 -31963 -5270 1743 44819 99762 91054 47562 32724 6393
11310 6393 -9475 -40392 -52847 -30790 -33898 27086 25221 -17002 -90779 -71887 -100682 -118924
11298 -118924 -58802 15784 42754 72096 50132 1177 38932 75878 71045 23432 10617 -21682
11286 -21682 -39069 -46843 -15554 19242 72036 115673 83452 56718 76389 79089 61880 55636
11274 55636 20848 -16601 -36452 -51136 -14458 5555 -56404 -49631 -9749 1229 -6064 -23322
11262 -23322 -47741 -38233 -11504 -12597 39478 55227 19000 23924 25931 -20419 -30542 11641
11250 11641 66346 48868 -41320 -87423 -71894 -17276 2614 4078 39283 49592 47611 50118
11238 50118 37487 13184 -8166 6988 -60659 -18961 51607 65210 67013 33788 28997 9117
11226 9117 22620 12369 -60279 -75996 -74339 -39147 -3878 18136 7738 6150 84675 107994
11214 107994 51193 1455 -13153 -95548 -86945 -42732 -79556 -91374 -43364 -32619 -58317 8722
11202 8722 49675 40233 -39296 -123219 -62291 -6202 -22577 -46148 -36844 1974 41400 54550
11190 54550 99864 26035 -19311 -1091 63485 68745 74534 40591 12771 5944 16830 -7043
11178 -7043 -9428 -46951 -76583 -41046 -48874 -2352 -9139 -42771 -49284 -43277 -41729 -18280 28371
11165 28371 45524 90874 95924 -3294 -82753 -61363 -45359 -56444 -15374 -4714 -55350 -49077
11153 -49077 -2294 -7538 -90520 -128015 -57889 5075 27305 27354 12734 -791 -2105 -10730 47909
11140 47909 25463 -35885 -74725 -26026 43866 47125 28753 55350 -10512 -52940 -63261 -56123
11128 -56123 -96665 -76361 -46050 -83957 -138005 -148327 -97897 -40772 -13909 -18172 26746 56399
11116 56399 24537 -41667 -62600 -19261 29010 5676 25076 43662 54643 61208 66844 45127
11104 45127 50579 60284 47143 -4656 -44320 -66134 -76336 -59797 12977 32122 65183 105687
11092 105687 57573 -4202 -19323 22091 41186 41546 9072 -11261 -12393 -32511 -14098 -25198
11080 -25198 -43751 -24773 5858 -14327 -31649 1123 79536 78372 38228 77025 107451 42843
11068 42843 -12551 -61230 -51110 -23022 -2852 60083 14469 9914 25626 -13262 -82160 -21001
11056 -21001 4105 -45788 -56605 -9349 -12267 10171 -7653 -17644 -18397 -7385 -21627 -64668
11044 -64668 -34122 11052 42055 903 -51409 -53353 -53106 5741 56638 80479 87984 56731
11032 56731 -47544 -88906 -36924 2027 9682 19929 -31331 -64169 -35383 14008 -20258 -43511
11020 -43511 -11983 -2989 16110 26672 62105 35694 28746 -1657 -37041 -10311 51610 94686
11008 94686 83909 67222 59854 32948 32461 42774 2939 -10911 -19302 -5462 30664 39593 72526
10995 72526 41582 22629 24492 32319 68872 69290 42682 -28220 -52231 164 16070 9394 -16504
10982 -16504 -62648 -71370 -65470 -81523 -35298 26002 27670 37206 66470 51940 9512 -2383
10970 -2383 -6932 -14944 -16240 -10653 11213 56031 33114 -26025 -23844 37743 79184 112012 46930
10957 46930 12954 45825 68681 53912 33905 -40277 -71107 -3766 6261 -21886 -7128 3104
10945 3104 11833 -6021 -117 70001 103560 43436 19090 -5354 25648 6660 -29888 13180
10933 13180 103077 117121 99049 95028 54066 -2740 11666 19913 8199 50531 83731 70091
10921 70091 51799 30701 21737 15343 -1935 19927 81422 92925 84205 106113 94768 65055
10909 65055 74880 91475 61085 61516 59778 85693 -6522 -68785 -50576 -23084 -28772 -90254 -131380
10896 -131380 -122878 -68195 -54359 -96989 -67801 -19765 53691 105332 138893 137392 117688 58245
10884 58245 11268 43529 51862 73597 -4273 5730 1530 1708 39831 51628 74250 83148 80949
10871 80949 48511 65773 79005 90280 155549 195902 139078 89158 84826 67411 86284 141343
10859 141343 120914 37170 59584 96476 128359 114229 126808 164463 153021 102146 113332
10848 113332 203269 181684 190333 190211 148087 132743 106703 91707 104018 123349 167957 217517
10836 217517 233441 267125 223385 198843 188743 190692 230712 245702 296543 290401 300494 301952
10824 301952 286363 330016 381831 366897 362445 449358 533862 571326 642761 752332 882093
10813 882093 988645 1132604 1277371 1396138 1531345 1676605 1757654 1753741 1738825 1724610
10803 1724610 1696552 1582423 1393408 1166401 952937 785211 652760 511924 372897 274409
10793 274409 221815 224143 201492 166630 183406 238630 284434 237755 181368 169457 188897 183981
10781 183981 156783 137399 113323 50700 4344 -21482 -550 -37062 -45255 -9911 65067 114017
10769 114017 76269 77482 83697 109567 89131 97165 104549 50707 8308 4272 35213 70128
10757 70128 81520 59833 45600 54711 78378 70855 100060 50601 49687 71538 33364 6186
10745 6186 -17287 -10215 68455 84230 76047 54495 8958 22317 20717 7144 26800 48691
10733 48691 7232 13615 1946 3854 -8560 -52661 -92991 -124270 -153055 -177206 -223164 -228476
10721 -228476 -283791 -346478 -326392 -333673 -363600 -383019 -349247 -356990 -312650 -294846 -310781 -280049
10709 -280049 -289268 -207275 -117747 -70211 -87259 -60345 -23734 -26721 9839 31608 29373 -9291
10697 -9291 -23748 24036 18425 16377 33745 62668 78555 52311 43036 70603 102781 108524 107398
10684 107398 112500 169242 210734 199193 199576 202567 177805 234531 272756 233530 250917 232440
10672 232440 195382 221995 223290 270777 274287 193331 192684 209566 179304 161496 115777 105751
10660 105751 130164 134469 91839 84135 76684 17740 32222 54109 19425 31525 85752 84187
10648 84187 100246 114541 104484 99286 74144 53466 85845 80203 57009 109479 109095 112495 172743
10635 172743 216950 237648 281373 272579 227656 186377 140502 156836 53985 33213 59697
10624 59697 66110 52662 110473 139763 121451 98609 118738 171933 159435 143933 222004 250375
10612 250375 234041 216995 197339 162304 175684 103638 62732 94433 103722 118051 158377 204821
10600 204821 215760 234849 218249 192087 168123 251815 293003 247463 156558 102273 114712
10589 114712 185049 246125 241965 204673 227138 251525 283081 326687 316963 264224 288788 296247
10577 296247 338282 321835 325587 351202 323487 316941 367409 406674 365283 321759 335549 354521
10565 354521 392432 355876 345361 349669 376565 396826 374787 358275 364488 394165 365538 383205
10553 383205 386906 395344 395907 390794 444271 505514 499322 448084 479438 549002 549300 496166 470340
10540 470340 492044 490511 501807 492685 480303 462240 432978 369278 331882 315974 342839 318832
10528 318832 319825 314644 334435 350146 315378 306748 319529 271147 264407 288893 271641 306671
10516 306671 313566 287362 343841 383470 408595 408463 380422 369945 362572 393227 454155 508607
10504 508607 505813 540047 518472 566183 627971 597877 583827 619190 648743 680000 735737 737204
10492 737204 750332 758478 843458 975142 1075512 1147185 1217604 1254159 1297407 1344675 1411075
10481 1411075 1481474 1610503 1658672 1741917 1852360 2024388 2186194 2311729 2447023 2637559
10471 2637559 2813479 3037267 3325867 3574387 3819249 4050252 4298394 4567507 4916380
10462 4916380 5336659 5737342 6185566 6713900 7245589 7769551 8334394 8950295 9596486
10453 9596486 10319293 11088023 11883966 12681334 13544720 14416600 15299851 16258968 17222541
10444 17222541 18295569 19409377 20591214 21866381 23177387 24494095 25847572 27276872
10436 27276872 28772541 30327599 31854629 33505389 35314945 37251812 39412165 41841324
10428 41841324 44540433 47533613 50998929 54885801 59345725 64477208 70440480 77414942
10420 77414942 85667564 95523545 107254274 121420345 138002727 157198637 179145442
10413 179145442 204315717 232467292 261416669 287399353 308817289 323326482 331414784
10406 331414784 331577618 321752964 301826085 270083571 234781313 196965081 161803220
10399 161803220 128529504 98454418 72954614 52956684 39919453 31835305 26527539
10392 26527539 22798333 20148554 18122455 16376236 14862455 13504759 12224139 11021987
10384 11021987 9878118 8825114 7860840 6938207 6144555 5414504 4842684 4365642 4025224
10375 4025224 3714077 3405323 3229825 3042690 2868430 2740531 2608645 2482669 2382268
10366 2382268 2272808 2233859 2179491 2130558 2061915 1963796 1885838 1808128 1706848 1660966 1624359
10355 1624359 1569056 1527417 1448994 1424112 1410356 1343443 1230355 1172040 1181323 1180404 1172509 1117907
10343 1117907 1071994 991535 893596 853228 841491 854398 881526 862596 829685 822074 839223
10332 839223 823625 783491 758293 744182 729119 717265 686319 683282 725346 747871 713834 736207
10320 736207 775272 778337 815097 809846 779270 745412 683997 648642 645341 606615 547562 544831
10308 544831 542614 521062 535247 529219 522647 528818 504839 482676 495780 429214 359007 392334
10296 392334 424767 434465 464591 378773 380386 392383 382318 343630 314831 347556 363158 394257
10284 394257 398839 385184 367402 336009 303086 256245 215148 167753 145621 137386 117885 97715
10272 97715 22863 10607 31408 35234 65348 61784 64012 138150 161919 175405 153995 143651
10260 143651 95185 94382 78701 78771 77843 26420 -5616 -67126 -56758 -55045 -48887 -42118 54194
10247 54194 125124 122563 73249 84353 90502 89501 94451 146088 159842 126026 64506 108662
10235 108662 149618 161368 157200 86241 15934 16585 43836 79014 95824 109081 71071 63994
10223 63994 112146 144018 80420 33253 10476 -17905 13994 43773 41346 66848 57231 77494
10211 77494 99538 71004 59873 80147 113153 116102 95575 113095 143333 129248 102660 55055
10199 55055 37687 -13914 3918 36690 59281 74196 42098 25598 -24885 -67568 -104481 -94464
10187 -94464 -69960 -46918 -17372 -3794 38582 9607 43620 65957 114048 194383 175516 161096
10175 161096 167129 150504 166286 137238 129051 103914 108446 103175 129648 159924 139906 125018
10163 125018 110588 112103 76420 35543 3034 1341 4894 36497 56802 48923 69607 39810
10151 39810 32266 70639 59216 68611 140874 94016 91239 91385 23963 2026 45330 70336 61386
10138 61386 47443 54956 68677 100689 92779 80183 60750 -5520 -10380 42475 75295 70425
10126 70425 13858 -16439 -16194 -7771 -1626 23242 73663 119441 77758 89142 88516 100718 93379
10113 93379 149156 212556 201350 195941 204706 262713 279570 292578 360725 392596 404361 412213
10101 412213 455240 542870 577935 525093 490547 490615 425346 372846 337521 293672 282465 210580
10089 210580 124063 79334 58213 17565 13291 4693 -33555 -26216 -3740 50056 77998 92999
10077 92999 165960 172863 94781 60777 73225 18039 -3368 12248 16727 14453 14580 30182 82991
10064 82991 87753 61761 24424 36384 58184 64008 10201 -37584 -25176 26376 62663 24117
10052 24117 -35494 -2217 73184 86864 87312 109798 122632 119453 81132 84296 123509 163051
10040 163051 162058 121776 91104 76692 119175 104264 126469 206933 235488 145232 121516 138364
10028 138364 172029 191463 209388 254715 229390 213167 262909 315331 337896 363738 391955
10017 391955 462014 509995 526847 602556 666611 761526 860192 1009262 1130331 1258187 1417449
10006 1417449 1564531 1679210 1770198 1808870 1805328 1709520 1569249 1389900 1269121 1040094
9996 1040094 869888 724791 526838 372160 278102 215354 183455 179924 172327 138198 111198
9985 111198 92244 76871 54831 50308 -20514 -37389 17363 -31842 -56241 -37629 -73033 -82475
9973 -82475 -69388 -63494 -45305 -39697 -30723 -26546 -61441 -73911 -28272 -19249 -5368 21581 46540
9960 46540 23412 -24016 -32111 3280 45197 74423 89474 46605 -24008 -69964 -73827 11046
9948 11046 34114 25673 20347 16214 -53674 -89324 -30577 -18816 809 -17008 -19184 -49798 -59595
9935 -59595 -60046 -18383 -9265 -43034 6846 -10922 -19076 -72448 -42951 28778 6499 -13078 -55804
9922 -55804 -95391 -52996 2131 35050 20196 25800 115562 113741 63836 24769 21178 16824 3705
9909 3705 -34290 -29832 14448 62845 65777 98658 104942 101786 69910 78815 9835 4119 16329
9896 16329 -5110 -4366 44624 85779 41323 -20999 -64192 -54120 2410 -6710 8167 49391
9884 49391 -12031 -13522 -28508 -40022 -62959 -18821 15692 -8298 -73870 -71133 -58960 -54125
9872 -54125 -50019 17975 71614 40434 27748 11785 -3746 -29974 -7133 -4183 17146 84342
9860 84342 95905 77807 41438 4393 -13835 37053 67083 90419 111953 124013 105905 67601
9848 67601 -15971 -38186 -2061 5629 -57426 -110341 -43683 1881 25405 24991 2833 7134 11894
9835 11894 -16554 4075 42548 63173 78151 79842 59706 39924 29082 29681 10283 -2451
9823 -2451 -34134 -29486 7398 -55184 -32132 49046 44481 -35233 8800 39607 -19171 -42669
9811 -42669 2351 618 30962 8771 -62142 -59416 15722 -29350 -51787 -54167 -45496 -34981 788
9798 788 -25362 -26413 -34520 -26401 -36355 -24373 -27165 -48098 -58067 -29981 1886 6417 -7662 -5434
9784 -5434 14394 28858 40777 -14442 -5584 9664 54934 38728 11565 1939 51247 62209
9772 62209 21234 43078 21916 -28127 -27651 -26282 -14013 -5384 -3189 34642 34183 -11373 -28873
9759 -28873 1313 38350 72711 90805 65325 26601 -59991 -76582 -13348 10818 -48923 -40557
9747 -40557 -7230 -10281 -16445 -31801 -18071 366 5622 3603 79 -52612 -61501 -34700 -32798
9734 -32798 -20744 1570 -1881 -8679 16715 -50284 -93495 -90264 -61900 -68200 -34602 11929 3001
9721 3001 -54105 -63314 -22295 24859 67116 81207 70298 26928 -7832 -4027 6575 -8216
9709 -8216 -15209 -1078 -21018 -47491 -51605 -34165 -31265 -15521 663 27970 62697 97655 54949
9696 54949 33280 28360 17602 -38143 -33328 -44975 -50804 -50493 -12106 -50694 -53018 9502 48773
9683 48773 65309 48386 27813 8584 17201 -19193 -46340 703 44074 -10871 -28672 -57482
9671 -57482 -34463 44872 34388 -48234 -68089 -53251 -38175 21714 40137 51057 89873 37995
9659 37995 -8072 -20473 16299 19795 20274 81246 134261 117481 25760 -20383 -54968 -59061 -21734
9646 -21734 -21814 -12345 19284 65833 93944 60673 63029 56552 25926 -10968 10068 -45280 -83033
9633 -83033 -59209 -33216 -22595 10233 44339 69424 59074 31179 22781 54453 -1152 -29739
9621 -29739 -8150 -32419 -63516 -57981 -34472 -13306 -24963 -13597 -55515 -63740 -31106 -56126
9609 -56126 -56189 -6332 -9325 -35019 -75978 -64546 -31656 -9581 -43509 -58701 -44638 -17199 10809
9596 10809 42228 61571 37018 78489 122982 84634 54748 91121 35112 8105 -13678 -1076
9584 -1076 45963 64236 23297 35997 -24271 -70222 -82460 -58368 -50314 -28126 -3491 -40613
9572 -40613 -96694 -123716 -107514 -115012 -117692 -12137 62595 46193 64331 -12483 4236 41991
9560 41991 74155 35972 8919 15773 28285 15766 70389 102296 88001 10399 -18368 -15238
9548 -15238 -21848 -39222 -7857 42720 133958 153041 92571 -48823 -132727 -110491 -67784 -48226
9536 -48226 -68348 -18698 42299 78278 47593 22075 2640 -40530 -73429 -84630 -42396 -42179
9524 -42179 -25424 -7946 -34500 -19570 1868 387 25324 3447 -42042 -8902 47779 44620
9512 44620 12207 63156 88245 42354 -6683 -799 -5084 -31477 -21971 19159 66137 67206 52535
9499 52535 35594 13683 12066 45373 43387 -19570 -37764 -328 31446 53973 7215 -20409
9487 -20409 -46030 -72630 -82350 -31567 -48762 -58809 -58407 -55912 -9943 -3762 -9051 -931 -49629
9474 -49629 -75460 -51617 -35949 -21173 -36865 -80365 -79884 -54714 4851 -2004 -33441 -512
9462 -512 41512 37294 46628 24394 2278 13806 37237 52361 28312 14537 14243 44972 51389
9449 51389 80170 24168 -34290 -90536 -39072 -7642 -5181 12851 27507 14837 -15785 -44195
9437 -44195 -34795 -24647 -17574 31022 58271 48132 -20596 -21023 -64937 -107875 -82441 -33757 803
9424 803 13432 11240 33952 44232 84112 95705 27606 -55003 -48207 -37958 -22273 -48351 -35415
9411 -35415 8342 38017 29623 -2348 -60802 -74239 -66076 -118686 -144500 -109600 -82908 -57610
9399 -57610 -16149 -14650 -42645 -26150 -32978 -1970 29696 17348 6642 -217 -33535 -37612 -58447
9386 -58447 -47566 -50671 -59444 1294 38600 -18243 -31268 2584 12738 34067 31858 -2595
9374 -2595 -11889 10476 17169 36374 46057 70053 8931 -53898 -40926 1308 -42113 -75736 -87032
9361 -87032 -58713 -15644 -2077 6138 30076 16058 50397 -3776 -35583 -36351 -57568 -46877
9349 -46877 -43776 -21608 -15308 -12367 5113 -5029 -6422 -22820 -98186 -102995 -35428 10060 -6595
9336 -6595 -124193 -165605 -126338 -108664 -102812 -40461 3408 21021 35027 15681 2083 -289
9324 -289 -18284 -36012 -67196 -50676 -38083 18538 78283 91226 90550 53971 31954 55713 93975
9311 93975 25670 -26184 -45452 -80537 -102864 -52101 -40717 -31787 -26019 -55017 -89645 -78219
9299 -78219 -82625 -100174 -111771 -83863 -47544 -47004 -9139 23451 -25102 -71562 -90950 -46681
9287 -46681 -33671 -34437 -5878 86106 96840 32869 19340 55981 55406 61694 20176 -48503 -85048
9274 -85048 -50349 -18893 -64975 -71523 -78392 -72982 -54273 -14400 57272 94672 45432 -12704
9262 -12704 -30656 -99742 -106009 -55428 -51480 -46532 -60932 -18586 15235 -5752 -16770 5849
9250 5849 6171 -39527 -38609 18541 64124 15627 -9342 3275 8210 -26111 -10141 -42522 -69821
9237 -69821 -42282 31341 88669 59738 36905 16418 -36751 -29718 41066 -3425 -44346 -34754
9225 -34754 -35166 -33310 -71591 -85133 -42882 -3356 -11153 -54683 -24864 23745 98529 97370 76416
9212 76416 87346 71003 53179 29650 24344 32730 43048 26741 -10369 63990 132367 113443
9200 113443 76812 57424 39824 37720 108840 160181 109578 84802 55872 36922 97855 141967
9188 141967 86350 51902 59622 47775 17154 11178 -4122 69441 106868 68027 56850 51620
9176 51620 40377 79069 110127 131671 148590 193039 238876 264112 322915 379662 349050 362806
9164 362806 430075 420717 426192 415759 480026 493001 528436 583998 630715 655837 718602 805678
9152 805678 864534 904674 936102 974490 1049497 1153552 1197906 1226596 1223182 1279824 1357377 1400365
9140 1400365 1442858 1506685 1577283 1623843 1717832 1791245 1915073 2126547 2307718 2551019 2820971
9129 2820971 3169033 3564266 4055430 4615328 5348377 6222011 7285915 8454829 9951226
9120 9951226 11547320 12798825 14012336 15924119 18538865 20503475 17948640 11379870
9112 11379870 6637021 4189599 2880234 2081487 1596619 1331336 1161025 1004174 830971
9103 830971 674941 565582 425327 328208 256544 242942 264636 269819 241036 258466 249980
9092 249980 229771 199256 201212 206705 195816 220105 201701 213901 218306 220278 195225 166161
9080 166161 123212 132728 110040 80902 166159 165299 94110 59688 42707 58871 91159 27092
9068 27092 41585 67449 78150 65971 56920 66436 68609 31366 20254 12216 -3279 5035 -24513
9055 -24513 -28890 -3109 -33365 -22706 -26633 -86088 -79147 -8529 -9813 -69976 -49088 -28485 -19687
9042 -19687 11937 40239 86494 59891 -18945 -22465 22534 46986 18399 12883 -1352 -25817
9030 -25817 -23769 -484 51823 63220 72393 71379 -2139 -25778 31737 80134 50554 56310 74918
9017 74918 48606 70488 67073 56343 15355 -11243 -3251 -7817 -17224 -2902 -38204 35482 106524
9004 106524 118912 97006 100742 78498 77014 -8206 -7862 17335 483 -2037 15281 45703 64783
8991 64783 3065 -47454 -31321 -23 2278 -11333 9794 40168 4051 -51299 -59211 -277
8979 -277 17588 -24270 -45203 20571 98116 128695 158370 98929 31397 -29170 -43842 3776
8967 3776 26652 56880 93827 63549 19138 -30789 -25970 -7772 -67010 -88488 -75330 13306
8955 13306 52958 35219 -7505 -9434 -36394 -69510 -101536 -38982 427 2319 57341 106657
8943 106657 111440 52223 -31226 -61727 -29525 -30925 -42242 -36668 -19219 -45658 -52818 -67649
8931 -67649 -21079 14002 47690 15800 -47174 -67347 -29122 46430 62399 64348 -4945 -50713
8919 -50713 -56776 -65111 -26009 -22588 11593 31760 28470 20732 55347 48927 59708 45831 -10150
8906 -10150 3901 9363 15309 45429 88817 126053 91958 -36694 -20075 62235 74807 46655
8894 46655 88933 115378 59460 25930 -4588 -72291 -107284 -86036 -81593 -61578 -138498 -200553
8882 -200553 -143476 -84167 -18411 50171 52473 33507 18713 -43648 -98559 -104239 -76924 -48897
8870 -48897 -54497 -33722 -32461 -15810 -32544 -79209 -50598 15708 -37374 -64053 -102094 -104682
8858 -104682 -57360 20117 18941 -38331 -17008 27542 18243 30941 25574 60128 86200 34689
8846 34689 15506 34902 -5154 28191 23853 20728 45464 44560 24226 28638 26957 76229 91031
8833 91031 40003 16390 42136 34917 9148 -827 23838 6894 14723 15975 5759 -15585 37099
8820 37099 25989 9722 33315 10550 5100 -18472 -34458 -40580 -70953 -34746 -20510 -29199
8808 -29199 -5989 -2198 4678 49018 46059 28785 14299 -11865 -45734 -37086 -25629 -18161 -48198
8795 -48198 -71066 -61113 -64206 -66611 4243 21350 -7713 -49284 -50263 -41110 -34671 -72196 -69522
8782 -69522 -44614 -27679 -22783 21311 54497 32805 2992 -25340 -114996 -159489 -123604 -82182
8770 -82182 -63803 -32334 44824 89733 63013 93485 115402 73554 60627 22484 -6862 -19097
8758 -19097 5386 40905 35735 55773 61021 53696 25791 6424 -54327 -92070 -84751 -27199 -13358
8745 -13358 -50075 -62489 -12733 32257 41962 24715 -17876 2420 45498 38850 36265 45405 -28891
8732 -28891 -92761 -51714 -15868 -3011 6515 24542 42863 43630 19247 -11076 -22671 -51462
8720 -51462 -69829 -75149 -62010 -45751 -62487 -99760 -105248 -113403 -117547 -59040 -46201 -46936 -47546
8707 -47546 -48632 -22741 -27890 -62990 -51756 -5557 18667 -13081 -6285 21190 28715 11827 -32023
8694 -32023 -37319 -55026 -49703 -62553 -27191 -16272 20100 59575 41877 35989 74870 89139
8682 89139 85428 61177 12752 -18834 15768 34718 29196 37463 37444 44345 3981 -18276 -14618
8669 -14618 -32092 -43222 -63950 -87208 -79362 -42392 8538 21993 63725 12910 -17157 -20790
8657 -20790 -64926 -56504 -13667 -12518 -38154 6283 -33544 -366 306 -35392 -19749 -9223 -4583
8644 -4583 3851 66365 90251 51641 -6978 -14082 -33497 -26835 22709 72655 78237 13203 -47871
8631 -47871 -16082 -6871 11434 118369 143147 81051 58304 42865 105435 129518 126408 99925
8619 99925 51662 32070 95964 98101 84733 89693 131232 112496 105122 125866 132923 90291 29534
8606 29534 65055 69825 38999 27577 7884 -41862 -30360 40968 70462 60647 61792 44514
8594 44514 -57975 -94151 -28074 47839 59663 22390 59514 89993 87688 130987 159016 135701
8582 135701 146230 157314 181857 145239 129606 96466 60935 36858 44234 80866 108052 87968
8570 87968 46130 37685 22617 7881 29408 -21085 -26489 22774 79638 75664 45832 -19173
8558 -19173 -24074 -2646 15500 81744 83389 31584 -1991 28499 39320 70124 99431 116849
8546 116849 133102 88392 77522 63869 59937 123503 159705 134381 132987 145127 157652 169328
8534 169328 144251 128444 132474 91168 77808 78206 72663 109853 148762 118402 52579 36096
8522 36096 38668 47720 -11447 -2627 48960 68667 85216 110365 134798 61861 25275 25852 44778
8509 44778 66637 79554 84874 26827 14088 9717 -39451 -39989 -23157 -17693 12816 54906 38903
8496 38903 7491 22412 -23141 -24489 -10982 -12304 15127 56838 22781 16047 11475 -11290 -46343
8483 -46343 -73370 -61726 -16714 626 -24893 -45848 -47977 -11472 20082 45112 48217 47327 11097
8470 11097 -9398 -14560 -3448 -18905 12784 11344 -13951 -38349 -68948 -74984 -78070 -38209 8613
8457 8613 28682 15017 -31171 -63111 -27466 -12517 12880 36592 40180 5038 17179 10704
8445 10704 -19687 -10193 -19976 8271 104903 127647 100515 84269 52613 21531 1340 36445
8433 36445 64454 69638 61192 74936 45715 22560 8196 6973 -68 35186 66853 83987 76239
8420 76239 54135 89071 78279 12881 -65497 -48131 31122 92998 46733 51250 91994 88404
8408 88404 46179 -22664 -28887 10803 31023 13201 -28554 14034 62144 81508 85126 24373
8396 24373 -33053 -50623 -83736 -5682 10646 98 12512 -29178 -55758 -39574 8972 8549
8384 8549 33696 9012 -24911 -18519 23594 52455 34254 -30189 -6982 12638 12823 11689 8068
8371 8068 18176 -8952 -30937 -69917 -33441 30131 44342 -13671 -45107 -18972 15775 62528
8359 62528 37468 -2037 -8062 8676 42519 73134 42124 54838 46270 48584 39584 20519 -5378
8346 -5378 -6017 -19481 -30610 -6916 -19560 -25513 22684 14937 21824 57313 102760 19441 -24836
8333 -24836 -24134 -54675 -73199 -110568 -120619 -49683 -7076 4648 -8686 -19161 23883 48779
8321 48779 25341 20684 46284 21935 14644 4560 -10934 13715 10620 36483 77193 66754
8309 66754 -4546 -36278 -87531 -52168 -29379 -56712 -58448 -13928 -49491 -62730 -34252 -38178
8297 -38178 -37701 -50435 -49584 -94784 -79631 -47328 4872 15334 -42993 -64905 -18598 21941 -16784
8284 -16784 -24226 -22374 -24469 -32450 -82738 -75351 -77446 -45023 -22467 -1701 62655 71689 25856
8271 25856 3467 -22395 -40878 -41527 -14502 -14054 -69759 -76135 -25697 -15951 -30905 -56785 -109812
8258 -109812 -107450 -78352 -72719 -78811 -82316 -40476 -37910 -40342 -41563 -76302 -74199 -19792 -32641
8245 -32641 -44126 6806 -14021 -76052 -64878 16352 -2489 40445 58416 59608 66270 10029
8233 10029 11416 18881 45505 72141 629 154 41693 63896 25213 -15704 -8553 -3836 -12569
8220 -12569 -13286 -26869 -91088 -113357 -119265 -89219 -70861 -39398 -18990 -41386 -42944 -49554 -42932
8207 -42932 -27859 -12994 32456 73189 72345 3924 -50682 -74976 -76012 -41421 -11570 6873
8195 6873 13769 -11998 -16231 -4496 -5715 -39186 -27001 12334 43625 23665 2326 -32185 20523
8182 20523 10102 -27122 -67250 -51793 27955 69715 78724 99337 88729 67122 12348 23810
8170 23810 60646 42495 77820 93417 40546 62738 87124 104280 62906 46470 31704 35617
8158 35617 -2572 -4242 -3322 27009 57812 28388 -3595 -4380 -21207 -25725 -50691 -38460 -22559
8145 -22559 -52425 -18572 -2084 12639 -4176 -74544 -58110 -11197 30897 23742 -1352 -23464
8133 -23464 6811 26250 -14535 -31805 -23962 -31102 13323 11825 -26498 -27513 -10789 -60923 -65867
8120 -65867 -26558 -18804 -50514 -38158 -11736 -34690 -55382 -13149 -12896 -32047 -26254 3938 17630
8107 17630 -33281 -38848 -42849 -6950 -11259 4761 -9131 -44755 -62737 -62050 -64215 -57289 -2287
8094 -2287 -929 -32422 -60407 -37845 -17367 19480 31238 30499 71679 43274 41630 83997 67416
8081 67416 68390 75303 30190 18387 -28173 -36976 -22702 2131 2120 -321 53280 87328 65286
8068 65286 34585 29114 58042 25847 -52393 -39389 -22733 11873 -827 -42908 -113613 -96964
8056 -96964 -47679 -38797 26254 -29164 -53696 3238 64020 87888 64582 57128 111868 91823
8044 91823 64922 25732 -16291 -56446 -89516 -78567 -99967 -96825 -53774 -45687 -37889 -30725 -38160
8031 -38160 -17736 -14524 30110 60737 82368 62125 15725 -56230 -96389 -83742 -44635 10106
8019 10106 7768 -20261 -5374 -26290 -27595 15589 47813 61881 29767 -7218 13925 30615
8007 30615 29048 -10919 -11451 21829 40756 -18357 -30252 -33994 -51709 -72076 -46577 -592 43310
7994 43310 72087 79106 80598 75865 27350 -24397 -1036 7692 35799 64272 41004 16572 -29945
7981 -29945 -80757 -25258 50197 31817 50324 92832 94961 58730 39469 46867 53505 31838
7969 31838 43581 9705 -65390 -99281 13775 62197 44669 52963 42382 10633 -9242 -1268
7957 -1268 51746 47689 6522 -2402 5644 -24163 8313 4451 1669 28764 85524 141767 93284
7944 93284 84667 99177 77698 107382 81913 41526 11992 41811 5770 -15176 -6529 -26850
7932 -26850 -26361 -26956 -10663 8486 16639 9430 9084 14935 38616 76321 103942 78184 90339 113350
7918 113350 84585 86634 123226 88555 -614 -42715 -3174 14745 -13120 16874 87493 69066
7906 69066 7983 -10809 31134 -30024 -62054 -37591 -41629 -33043 -18868 21669 41944 69633
7894 69633 29323 36240 32612 37655 16579 8049 3538 -38889 -21078 31470 53375 41749 34746
7881 34746 285 -9721 19293 -3161 -33931 -53502 -61594 -49859 -3486 23548 48572 34550
7869 34550 29357 72443 103893 117377 106866 37818 12689 39642 23405 31572 37392 86293
7857 86293 82090 50730 33532 7173 44748 101281 188061 159006 121526 84478 31676 -7508
7845 -7508 -34349 -42970 -21872 15317 63850 3754 -27432 -44015 -29210 -69603 -59364 -8925
7833 -8925 10533 23564 11495 -7295 -16906 -42622 4875 24123 1539 -25277 -46056 -19979
7821 -19979 24584 45744 32463 10924 -23039 2556 13305 39800 101312 138897 106323 29999
7809 29999 33427 31634 12591 -6227 10673 -34075 -45674 -44732 -43169 -35774 -57541 -122779 -102133
7796 -102133 -58319 -3542 5594 -23564 -52350 -96641 -68834 -12281 -13811 -40689 -36677 15216
7784 15216 26773 36749 59766 74873 39484 -39855 -67696 -46260 175 44407 30881 104421
7772 104421 139052 90113 73931 39212 15026 32116 -4340 -14293 -33281 -24081 29772 19870
7760 19870 -74830 -131941 -105968 -79494 -48824 -76877 -56853 -83699 -62861 -78202 -59100 -71753
7748 -71753 -7974 25710 -11804 485 -915 -9377 -28634 -9705 -12489 -49176 -30745 -19662
7736 -19662 -34841 -45690 -67421 -73687 3659 33730 -1136 -31612 -38799 -33738 -11864 37734
7724 37734 56686 43780 55623 28361 43934 74404 59899 99390 86495 45777 63226 72534
7712 72534 45221 -12420 -37045 -41633 5196 47377 -10706 -26330 1430 -14706 -31383 -40002
7700 -40002 -67635 -68374 -70980 -4887 4963 -3353 -2717 5540 489 -39645 -46918 -37648 -66459 -42214
7686 -42214 -54825 -52780 -49790 -48279 -6169 -11697 -96112 -109484 -31924 -20214 -42204 -14177 58176
7673 58176 63504 81103 105955 42857 13362 -26463 -24880 26309 39434 12131 7516 58261
7661 58261 51365 -36662 -77034 -25604 -76870 -96749 -50845 -47747 -82212 -96263 -61068 -15019
7649 -15019 3232 18122 -16190 -55681 -57094 -66715 -31040 1254 -18829 -34617 -7759 -9416
7637 -9416 -42372 -97002 -99447 -85603 -42344 -53135 8213 33016 1580 -54853 -78855 -26269
7625 -26269 -9104 -32879 -49601 -24004 -18356 4667 44160 52462 4838 -10817 17043 29356
7613 29356 28258 10134 6400 -3658 -5784 -29971 -92517 -104092 -65251 -54453 -102417 -61724
7601 -61724 -32383 31131 45820 24145 13217 -13778 -9694 20711 228 -65633 -55863 7580
7589 7580 297 -34530 -25975 -57191 -84423 -70061 -25324 20923 23543 3171 -11138 -63720 -54202
7576 -54202 -39140 -47182 14962 1382 -27750 -28169 -42947 -22530 -8200 -43800 -84293 -42451
7564 -42451 -2646 -12217 2163 -1599 -37410 -8397 -27141 -32816 16923 30905 -35111 -62969
7552 -62969 -63285 -11046 -25906 -37367 969 18300 6342 -29536 -29798 35042 44750 6015 -22315
7539 -22315 -17169 897 61793 40459 -6287 -61108 -107140 -109474 -75751 -113873 -87581 -26319
7527 -26319 -44265 -21396 -8461 -3938 -3372 -18869 -63468 -71860 -74765 -65117 -8133 24063 10996
7514 10996 -18322 -26232 -32231 -26860 -33439 -34196 -49408 -9944 -15401 -51211 -26514 -14885 -33089
7501 -33089 -45062 -22294 -38030 -20225 28387 42150 -34462 -6894 -8600 -18986 -20727 -32677
7489 -32677 -38941 -43199 -5611 29481 21738 -23262 14228 32416 64425 27374 43068 46556 -14786
7476 -14786 -64980 -77967 -75068 -48684 -19360 -15490 44323 55775 34952 35917 15268 -2097 -31763
7463 -31763 -42931 -40401 7589 -11859 -23347 -25559 15831 -28506 -18775 -41485 -91689 -63059
7451 -63059 -13736 1527 2481 12675 -7101 14961 -30151 -63786 -25727 -1659 20657 4552
7439 4552 21941 7891 30261 35724 12890 -12392 3784 71888 100770 90442 12691 -17580
7427 -17580 12565 37596 58 29468 18904 27529 -28990 -38618 1648 53801 124203 104561
7415 104561 28756 22112 30169 27382 8630 -29756 -35664 -57185 -73635 -27821 -77645 -153867
7403 -153867 -144961 -121467 -121151 -108384 -66840 -43066 -54938 -29497 -7042 -25537 -12628 -22513
7391 -22513 22495 37802 36204 21414 14780 -13166 -22344 -29785 -30349 -56990 -62166 -10494 13102
7378 13102 -23546 6118 -7347 -11419 -12012 47184 20487 -39496 -38103 -60546 -13239 13406 18810
7365 18810 37115 47009 7913 -27318 -8962 -17784 -12552 5718 11197 1844 13895 -24565 -38156
7352 -38156 -58727 -46934 1831 23084 10407 -11774 12712 26723 -7889 -11950 -43833 -66518
7340 -66518 -81882 -31124 -46415 17232 62985 49113 34959 26102 35912 -9365 -45546 -38638
7328 -38638 -26210 -53410 -50837 -38027 -36845 -14157 33942 87434 110195 69462 68705 117725 76724
7315 76724 5992 35594 41314 22693 -24572 -50115 -1343 -23105 -25618 10925 31073 35684
7303 35684 21961 -22647 -45655 -42037 -58089 -50690 -58195 -43653 -60033 -11403 20843 45288
7291 45288 45789 -3442 -71536 -47975 13900 28292 -15880 -32952 -1832 29539 40723 8359
7279 8359 -41184 -58044 5199 -1475 76791 75127 70062 55495 113214 145952 92292 -16888
7267 -16888 -24473 4917 26088 23466 -12694 -4633 -2786 -12292 16089 -1583 2291 -38710 -86152
7254 -86152 -66049 -17951 -20432 -60940 -62416 -46246 3146 38633 17851 23988 58990 46545
7242 46545 -4704 -7307 77015 80890 71870 91682 79390 34574 8452 -37461 -29758 -65382 -107548
7229 -107548 -55799 -34967 -39552 -35278 -53735 -43785 -9217 6012 38745 86688 119897 50705
7217 50705 -3093 9446 -6089 -40300 -76433 -68230 -31015 -14801 -31252 -11961 16660 9823
7205 9823 54465 10695 -48784 -39087 -25561 6546 43570 -32672 -73430 -80533 -74017 -96673 -94396
7192 -94396 -41722 -59104 -20246 12530 34559 17816 -9729 -4274 31007 8484 -353 -12952
7180 -12952 -27829 13903 30190 -1174 -23447 -48552 -30815 -9573 14627 46262 53286 23611
7168 23611 15802 46596 38379 12849 12513 30230 56739 42836 35121 -14512 -39194 77 43313
7155 43313 40928 29340 79549 51060 -13267 -282 -27670 -31602 -46835 -35540 17019 71204
7143 71204 83725 55053 17870 -58538 -106900 -73708 65 45325 6077 76496 87475 89440
7131 89440 106732 114230 103469 53080 68181 109923 93962 100767 137530 145761 166465 110979
7119 110979 37639 27168 30347 1694 -1337 7674 38829 72180 102981 82949 57872 78106
7107 78106 114515 89789 50385 72957 67125 12525 -13260 39628 85534 87159 55407 65946
7095 65946 37654 -3541 -9613 15279 53243 14512 38977 71471 19114 -27392 -35589 -24789
7083 -24789 -27925 2171 -20880 -9796 608 -48979 -46102 -33580 19090 82780 112485 64210
7071 64210 57081 59358 60049 76416 26927 32005 54504 13109 -516 13219 27732 15200 -10650
7058 -10650 -46538 -60718 -28487 24005 43437 40399 11639 13622 12650 -36796 -62949 -32411 -11968
7045 -11968 28346 33929 -11616 -54838 -37437 -33521 -35267 -16028 23546 43888 40423 112028 54601
7032 54601 4189 41692 45240 383 8397 22650 48503 67019 88854 72051 56260 25273
7020 25273 16219 15863 25899 67088 68924 41217 -15962 -27909 -38623 -40218 -52606 -13825 1483
7007 1483 -46804 -68075 -19565 -40695 -54444 -25069 -613 39921 132306 160604 114571 79871
6995 79871 63229 70470 56343 49529 -21731 -62681 -83932 -121332 -152796 -148538 -110386 -45965
6983 -45965 -35345 -47756 -41721 -23730 -21425 11841 29293 12601 -29550 -59397 -48765 -35897
6971 -35897 -59846 -20809 5874 1077 34917 50968 29205 3755 -10311 -27281 4613 7169
6959 7169 -17985 -35441 -18941 21150 17339 -393 26306 88294 100935 45739 -17120 -5862
6947 -5862 41455 48037 62581 55252 46480 35148 65320 71644 71171 29613 9439 1467 44446
6934 44446 4637 7896 19422 -45295 -66200 -427 38845 67994 62906 62410 67643 -22585 19475
6921 19475 55468 39336 -18277 -29267 -57835 -72947 -23696 -24807 -82279 -68875 -42110 -63844
6909 -63844 -75491 -87627 -38211 13895 7346 -1076 15276 -18912 -3461 17894 -14568 -14652 2062
6896 2062 -2440 -19546 -57936 -80754 -13181 34548 12418 -22787 -58675 -62058 -53732 -43877 6498
6883 6498 44323 50062 53053 61902 153733 167251 112776 30073 17985 64969 68725 101475 129042
6870 129042 76395 29431 -24386 -28771 -36038 -23655 52551 64092 36268 8518 -26169 -27615
6858 -27615 4318 48044 98325 87522 69864 65423 20691 -19359 15514 44237 44470 73032
6846 73032 24582 -1428 -27082 -9398 28876 -31190 -82841 -88541 -47240 10319 57276 92015
6834 92015 118132 41442 -20852 -50720 -20973 24140 39004 4195 -10126 43554 9685 -15996
6822 -15996 31891 44309 41097 21437 19299 30201 88973 97725 58265 35734 59988 86215
6810 86215 32737 -28983 6835 31974 89059 106238 61882 39466 7589 4397 46013 53118
6798 53118 59315 -13425 -67603 -47183 -23482 476 -1594 16182 48894 38012 -40313 -48239
6786 -48239 -55192 -46784 41820 64627 26615 84902 99999 19155 124 -9816 19822 30131
6774 30131 8713 -39059 -72460 -56560 -50688 -43483 -65241 -80298 -100750 -58490 -26196 -28059
6762 -28059 -19288 -28462 -1697 8556 -15781 -65357 -75405 -16926 8451 56067 19832 19513 59749
6749 59749 75929 16675 -75611 -89288 -12922 36522 50632 53540 30281 -59218 -79615 -86080
6737 -86080 -95709 -99359 -56006 -5928 -16067 -51219 15410 3856 -17922 -11700 8222 7001 -42936
6724 -42936 -34932 21525 71351 78738 28294 -37715 -53250 -9110 -9155 -6689 -17951 -46104 -35027
6711 -35027 -6888 -48288 -72462 -73182 -20685 -1703 -6655 -24390 -15731 -7633 -48612 -69492 -44342
6698 -44342 -27940 23062 48600 23267 26529 69864 34966 -48578 -74012 -41751 -20758 -37229
6686 -37229 -38161 -74724 -76394 -56537 -26359 -1708 -893 316 -26958 -16997 9047 26535 18502
6673 18502 -30618 -52336 -13079 -4454 -18663 55288 65560 19766 30300 -13283 -82011 -77372
6661 -77372 -95627 -93609 -34773 -22482 -222 2162 -2278 14400 10811 42765 25199 -3861 -26027
6648 -26027 -12543 321 17192 9880 -3144 22025 -29080 -54730 -24226 -20426 -14209 11392
6636 11392 22952 -62670 -79294 -24572 -6415 9096 14997 -26628 -66460 -54102 -25713 -18015
6624 -18015 -43935 -47433 -32687 -7751 14906 62706 -22196 -25727 17378 9077 9199 -22028 -13467
6611 -13467 33511 50190 18721 40365 78594 69984 28083 24710 58577 29938 -8369 -86666
6599 -86666 -72809 -53724 -2286 82640 50654 60001 24186 -8757 -1161 44994 90489 73148
6587 73148 79214 57239 105051 182812 157341 97332 103264 60251 -3637 -38606 -28517 -34051
6575 -34051 -31903 -6594 22598 68003 67292 24090 -33294 -53330 -69796 -66795 -26213 -18173 -30865
6562 -30865 -24252 -16225 -28530 12609 40396 21525 31999 57328 18252 -28921 10675 -5938
6550 -5938 28358 57536 -16383 -73090 -27079 22585 59278 33755 -3959 14976 910 31372
6538 31372 -2869 -46652 -6045 67592 67382 38105 3412 -13278 -22174 -35635 -41722 -46052 -20098
6525 -20098 5255 14598 -4128 -11404 -33147 -35475 -70738 -80357 -40243 -50909 -9854 27393 48944
6512 48944 7787 6068 22233 54745 45327 599 5531 -39956 -70918 -71451 -19275 -6935 2042
6499 2042 15690 11423 -35999 -52657 -105299 -126648 -164226 -97312 12285 54483 59657 56547
6487 56547 29110 16080 42940 45524 63163 19870 -29491 -11009 -24663 29337 41504 15442
6475 15442 30226 18131 -27047 35811 89149 110554 67496 -10156 -21019 -8419 -49502 -69509
6463 -69509 -45935 -106932 -159623 -141131 -105659 -51962 885 -526 -22217 -51098 -16271 6582
6451 6582 14618 -20647 -100970 -133399 -115321 -105116 -117918 -100602 -38919 10577 -36102 -42899
6439 -42899 -15208 22979 -21253 -81398 -101975 -52624 6669 37955 26388 26805 -15347 -27701
6427 -27701 -22218 -28325 -20491 -29192 -31691 3662 20382 29008 22347 21493 -964 -40520 -56054 14056
6413 14056 62320 92082 87623 24725 -15152 13495 -10952 -48758 -37886 -58258 -62031 -43164
6401 -43164 -13557 -6784 22502 19751 -22942 -34970 -32651 -46308 -43733 -43684 -42475 12929 28712
6388 28712 53541 42051 21655 -6243 -54521 -99919 -100718 -94843 -94804 -60887 -66037 -21478 27110
6375 27110 63667 6817 -14967 -7599 -5510 -33029 -30876 -9810 6878 48417 7950 -5025
6363 -5025 -17903 -30147 -50686 -12587 12238 11882 -37760 -28475 44476 65981 72218 79092 10107
6350 10107 -22013 -33274 -21316 7674 37207 54412 -2443 -47 51003 94386 97259 82293
6338 82293 106526 85697 5568 -23391 -2405 -13398 -4055 34797 48687 985 -41313 -38529
6326 -38529 -54517 -49848 -23451 4239 -12561 -51286 -71628 -33239 -6378 11912 7022 43967
6314 43967 42712 16514 -22944 -29009 -55964 -52263 8379 20085 36983 55328 22045 46159
6302 46159 55839 5632 14599 63862 54875 21159 -5755 -15505 -22892 -42239 -103675 -68180 -3324
6289 -3324 10382 28833 72393 59771 -7643 -67488 -59542 -50169 -45108 -51968 -80627 -39541 5324
6276 5324 19506 43143 10707 -9032 -2561 14134 -35222 -77285 -46767 -43021 -6426 -20653
6264 -20653 13538 35686 29057 27834 55775 11284 -43426 -60620 -59160 -8597 23239 30893 23992
6251 23992 10992 -847 20355 -36100 -44298 -24900 -25088 -39873 -47556 -73074 -93132 -122451 -93937
6238 -93937 -92384 -63632 -31833 -50035 -41354 -10506 -35407 -75974 -65573 -85017 -70088 -55129
6226 -55129 -49581 -13248 -9816 77 -24710 -39589 3314 46366 17072 5209 31142 82340
6214 82340 47384 -17661 -90681 -53142 -3124 36200 33766 10485 9277 -3473 -51778 -127837
6202 -127837 -138633 -111741 -83794 -53026 -63407 -72430 -75782 -68736 -83703 -112018 -116493 -49988
6190 -49988 -30343 -61138 -35689 -19962 -31970 -4709 19696 12199 -12281 -1243 -46778 -83173
6178 -83173 -74242 -74007 -68240 -57091 -53857 -42041 -51728 -61375 -32348 -44939 -23802 3316 -22613
6165 -22613 -39416 -87534 4111 33269 11284 4959 43707 19076 12978 36610 7310 -102953
6153 -102953 -73390 -71805 -24301 52089 52698 65658 60168 -32119 -69857 -49860 -7993 -19144
6141 -19144 7372 29374 24375 27679 -8699 -48532 -108281 -62377 22239 22256 10334 -8203 1109
6128 1109 -96 -39340 -80054 -122057 -127972 -117561 -63929 -16328 -33172 -63384 -66097 -40355 -12744
6115 -12744 36370 62558 15320 24930 42271 17386 17054 37416 59461 62762 115737 110430 65079
6102 65079 49730 42135 35942 39195 89133 78864 35897 -11145 -4216 -6154 -5261 8423 26897
6089 26897 -9645 -7830 -14321 -24275 -24761 28858 -11218 -65957 -43824 1091 7485 -43667 -46610
6076 -46610 877 19470 -32310 -56944 -43004 -12693 -42747 -36569 7012 18116 20711 -10245
6064 -10245 -49134 -19203 46245 29170 30222 -2911 -18335 -57947 -10001 22963 6832 -22996
6052 -22996 -7157 -9923 44761 63777 5590 -8143 -18178 -5184 10129 -17487 27169 52008
6040 52008 -35457 -67907 -54587 -92485 -81702 -60555 -69312 -72508 -21019 -28168 -74850 -92357
6028 -92357 -113387 -76408 -12801 36090 22505 46578 46512 15100 -493 -4485 21645 62694 63479
6015 63479 99619 78706 1260 -22738 10121 54752 4422 -5645 -30247 11949 45223 69265
6003 69265 41191 2517 -65149 -89955 -94493 -73547 -53118 -37590 -42793 -69537 -74493 -96124
5991 -96124 -91618 -16075 -10783 -46889 -35921 16901 -12835 -59780 -77280 -78755 -31707 -45446
5979 -45446 -64903 -75355 -64193 -48327 -79295 -103384 -100046 -68185 -41614 -2368 -15303 -35865
5967 -35865 -45179 -64637 -97991 -102415 -81266 -12826 -17371 -43239 -25180 -21366 -4232 21239 30553
5954 30553 26833 36542 21388 39123 -13900 -67443 -70254 -31510 -15722 -22438 -15867 4838 -11722
5941 -11722 -45935 -56460 -8743 3184 -36947 -69339 -47535 -13961 -25149 -77498 -67421 -18020
5929 -18020 17364 16861 5509 8935 60164 73321 40476 17409 -57923 -62732 -72182 -37973 5717
5916 5717 57580 39395 61820 62433 18790 34421 14443 -33976 -3249 38618 75855 65434
5904 65434 13915 -33814 -21266 26301 29044 14439 21468 -11442 -53600 -64832 -56267 -28797
5892 -28797 -43285 -80834 -80658 -69061 -89979 -59240 -73449 -53355 -49883 -29243 -26716 -73778 -131717
5879 -131717 -105054 -128904 -110966 -95027 -99267 -46326 -13567 -10510 -30852 -8351 -13191 -23568
5867 -23568 -34342 -47387 -47288 -27388 -65200 -98970 -90412 -81165 18407 37129 43135 81162 42399
5854 42399 81702 76700 54328 26303 -29648 -22300 28160 68972 51645 44899 39596 -32359 -28798
5841 -28798 -40043 -51583 -64199 -33309 28617 14684 -13615 24090 -23708 -5070 4087 2650
5829 2650 -48627 -64876 -4764 66458 60054 38523 58449 69858 27769 -27379 -66251 -34537
5817 -34537 -29469 -26307 -11411 -8963 -31388 -66127 6101 63416 10665 -16988 10184 30607
5805 30607 7631 11158 51021 57030 93063 84311 47654 -10073 -28617 12509 28156 4864
5793 4864 38421 50401 76380 35817 31654 -23765 -47994 -44181 -32280 -9292 708 32587
5781 32587 27935 11448 21561 12636 57845 85705 92536 115819 114347 85485 91883 46299 31234
5768 31234 4619 8399 10202 31123 50659 19704 37558 84615 91814 101748 84060 53960 43416
5755 43416 -6714 -33067 -20371 -5803 45165 102272 76987 53078 13890 -10862 -7835 31156
5743 31156 15230 -21827 -6620 -10224 31311 13903 -61934 -56124 -23915 -24174 572 -34961 -41032
5730 -41032 -25522 11836 41544 53654 10521 20170 24711 45827 59269 50460 48571 38991 28897
5717 28897 -14870 -67437 -58684 -44745 -73254 -45426 -86091 -78422 -47039 -44673 -35974 -13578 -47471
5704 -47471 -11674 -30736 -35935 15318 23537 10783 -17940 10755 16006 79034 68034 -6679
5692 -6679 -46428 -56106 -26176 -46622 -10564 36908 41655 -9758 13114 14954 2000 25984 10366
5679 10366 3930 26525 1979 -72026 -65653 -51964 -59605 -44394 -29984 -54905 -81284 -67655
5667 -67655 -9953 5596 30867 34662 -14142 -29368 -74384 -65396 -24615 11447 -31260 -97244
5655 -97244 -23404 24576 7409 6148 13125 30167 459 -41060 -27406 -8375 -39634 -77264
5643 -77264 -83954 -78106 -48426 -60075 -68874 -35531 -19545 -35864 -49947 -24310 4657 37076
5631 37076 63715 43047 22101 45348 60541 79710 112997 121794 84782 29514 -35567 -34564
5619 -34564 -1659 10443 27723 50222 4019 -60254 -49658 -25504 8691 36647 22514 -23715
5607 -23715 -9154 -47292 -49806 -7736 -35991 -61820 637 2520 11994 -17267 -33891 4743
5595 4743 -22856 -32789 -3639 -41364 -79567 -51378 -51802 -18169 11346 -14105 6278 -10503 -20023
5582 -20023 -19945 -7101 41355 35480 1113 -6373 345 -23133 -5149 6843 8704 -40565 -40237 -18133
5568 -18133 -35421 -53544 -42086 -34924 10115 18238 1988 -1369 666 -2383 14869 11689 16265
5555 16265 69478 40708 33933 8100 -23656 -4356 -7280 3911 -14556 -6220 -13184 -43870 -70291
5542 -70291 -33354 -26632 -49670 -34352 9698 37993 20606 32307 115330 65162 27098 49571
5530 49571 45076 40360 -7918 19994 47834 57359 50008 -10600 -48576 -83238 -103220 -84360 -43227
5517 -43227 -31181 -19004 -23050 -30578 617 -13057 10289 -50150 -102828 -120460 -101748 -85312
5505 -85312 -49278 -26959 7424 -2662 -46002 -49752 28377 66262 61513 108345 124373 126503
5493 126503 139677 132237 54143 17225 39911 36521 53439 44310 50756 66707 29879 -5693
5481 -5693 16461 19359 10087 -8262 -493 25594 76048 61084 12807 -742 -26813 -99179 -113575
5468 -113575 -116520 -101892 -54663 -6363 25176 -18433 -4478 -26674 -1605 -10157 -37458 15996
5456 15996 22292 -11336 8163 14792 -1086 -2323 32465 14870 -48370 -54901 12781 19739 28011
5443 28011 6814 15583 11785 55546 56781 30011 8016 -51193 -58212 -81364 -82225 -2477 54614
5430 54614 67673 45296 30354 -45620 -76924 -22157 28491 13772 -17702 -52498 -54488 -58494
5418 -58494 -31257 5965 -15781 -46381 -131158 -117405 -46602 -36516 -52963 -35886 -32425 -18366
5406 -18366 15696 -6194 8821 31934 11421 -8735 -58833 -80599 -72867 -45282 -59233 -97581
5394 -97581 -84983 -90166 -134562 -138648 -98935 -17115 -44265 -62649 -55497 -64175 -48657 -45931 -36962
5381 -36962 -57856 -80934 -98535 -92302 -56530 -89780 -110468 -26844 -35073 -18349 -34882 -16851
5369 -16851 -224 27998 -12404 -39911 -25308 11750 45268 70054 106389 90422 49462 -2424
5357 -2424 -4275 12672 -7899 -7942 -13992 -12905 18346 18264 5147 13588 27699 -20794 -47136 -41006
5343 -41006 -43031 -63360 -86807 -37719 -741 -22861 -201 32595 68327 46674 5141 218
5331 218 -22037 -37948 -42937 -33994 33340 37639 15964 22609 9605 12267 -44066 -75984 -25947
5318 -25947 -41365 -42436 -8848 4958 -27986 -45534 -16495 -2002 -24746 -42374 -50878 -50119 -67433
5305 -67433 -58849 -40439 -22160 -18975 -51478 -51675 -49974 -48038 -38670 -8450 -13304 -10640 52 -8792
5291 -8792 13293 -37907 -35414 -34500 -25796 -73482 -54148 -35355 7805 63350 30322 18889 -4293
5278 -4293 -41070 14792 81158 60763 -4405 -16304 8806 60900 96026 89776 47347 15032
5266 15032 -6024 -21775 -29297 -14781 -14830 -54931 -38500 -30158 -78228 -78729 -51365 -18900 24946
5253 24946 74196 50236 -3876 -68071 -42117 -5951 -15519 -17927 -5319 22590 66176 65259 64313
5240 64313 105427 132201 151098 114490 72481 1504 -53437 -48976 -30914 -2290 13656 -2713
5228 -2713 24477 66253 72951 16535 -4802 18694 59078 50174 20969 65720 83586 73737 76825
5215 76825 36122 -31685 -55814 -29873 29599 1730 -59489 -93035 -54438 -31083 -52417 -53574
5203 -53574 -29709 -37392 -6250 -62694 -31804 -16012 -15640 50985 52788 5446 2709 27288 85143
5190 85143 60377 56659 59129 92908 69426 22346 269 22106 -5379 -3876 -10498 -16946 -89547
5177 -89547 -108081 -74428 -70227 -71882 -59805 -45181 -19172 59008 42534 42829 50411 15932 -22187
5164 -22187 -163 5711 27941 50812 46848 -20322 -75278 -66764 -4736 -18773 22236 48314
5152 48314 61389 52518 6403 -21502 13721 30590 69530 86438 29391 -32999 -64171 7441
5140 7441 31923 53522 54669 12097 17668 14595 27792 55167 78354 43297 14294 -4674 -9683
5127 -9683 -31864 -35672 -11406 -9387 -18930 44078 73549 10562 -48738 -34352 -8491 6305 3087
5114 3087 24799 30953 35724 106921 82169 22782 10103 55003 109192 143206 63537 -12914
5102 -12914 -54714 -78322 -5215 28854 49946 66130 65828 25307 18835 -24108 -81334 -79097 -24974
5089 -24974 5751 25476 40588 -20185 -17906 -19270 35593 37448 111069 144218 107552 70691
5077 70691 56006 22403 42638 44737 17146 -11029 -20134 7308 -16329 -98870 -69826 -28005
5065 -28005 14429 19764 -8695 15266 -28442 -43939 52881 94013 87660 119204 122664 182895
5053 182895 164370 134912 88560 42981 21004 61062 65624 12226 28931 40154 4962 16067
5041 16067 37930 17572 -4543 -59494 -31879 43725 12032 3421 22808 52683 41790 17638
5029 17638 18652 -42415 -98379 -96577 -19478 7929 29388 -19672 -18549 -15434 -46336 -20951 -76975
5016 -76975 -83770 -2220 -1697 -74611 -83567 31098 63238 46285 62855 89834 41276 -28401
5004 -28401 -16251 -29581 -28652 -51432 -49699 -14598 7344 3297 -29814 -66286 -83906 -104067 -109103
4991 -109103 -65556 -75065 -79549 -93148 -87590 -20540 -12187 -21592 -52590 -84013 -53732 -83752 -58322
4978 -58322 -35621 28257 11962 -46392 -66490 -8296 -4987 18458 25076 32208 31124 51098 31101
4965 31101 20806 1850 30062 70614 31792 -18582 -71558 -73124 -29386 -30962 -46996 -26602
4953 -26602 -14387 -10850 -83737 -79809 -68875 -95195 -105024 -87868 -17030 8138 40906 64073
4941 64073 51436 10908 -19761 19696 10676 15207 100250 73948 30678 29560 59865 98388
4929 98388 91464 -12180 -72860 -52347 1666 1988 45698 55625 51519 42931 -679 -31286 28184
4916 28184 71936 42361 66402 79657 49992 8275 10605 22994 39935 28860 -17710 -57564
4904 -57564 -67577 -73979 -70973 -2169 15425 -8219 -83775 -34177 10294 17579 39065 59031
4892 59031 21766 4955 509 23834 18137 18097 -803 -55957 -38778 -16293 23031 54506 47111
4879 47111 -5641 -34498 3500 -15719 -42494 -73571 -49802 -10433 -27321 -29601 -50494 -48531
4867 -48531 -77401 -121408 -66666 -49806 -37156 -364 -29158 -44092 -21751 -42438 -33464 17332
4855 17332 35601 43516 128472 131389 -518 -40560 -8965 -36242 -4835 35891 21744 17650
4843 17650 -20328 -33806 4068 15663 33238 96014 78260 75171 14195 9840 15379 -17037
4831 -17037 -39603 -38431 -27581 10230 13592 -34296 -69082 -84365 -20319 9990 29676 41949
4819 41949 65985 35782 29579 25251 26791 39744 26329 15665 28723 39077 66849 17470
4807 17470 -47078 19097 22248 -56944 -55967 -3737 31989 44633 79093 119997 120744 143980 74887
4794 74887 -3184 -806 29776 -9717 -14594 -47351 -51596 -1270 4828 68404 101553 87544 58335
4781 58335 33781 21408 75106 69710 131505 159593 127557 144269 118988 100869 37209 -28006
4769 -28006 18119 99645 158649 149662 86275 30972 -2658 20947 -22911 -9730 52242 54727
4757 54727 3006 -956 13079 -3174 15838 31630 -5395 -99771 -130516 -92577 -14000 61464
4745 61464 62540 92383 55474 -6734 6660 -652 41560 76368 85506 66357 59190 10861 -31118
4732 -31118 -59166 -47815 -15381 19163 13301 13457 15822 14613 -11903 -14410 -6962 -80 25696
4719 25696 7888 -2988 4082 -1621 -10384 -59089 -60050 -7337 34265 41178 27958 7872 -51269
4706 -51269 -65849 -73782 -70526 -66181 -84072 -75375 -11441 20958 -7661 -28510 -6432 8392 855
4693 855 16064 12411 44250 79504 51937 19723 32408 97003 80719 49257 -90 -37344
4681 -37344 13172 -16336 -31531 -3336 11179 8423 24829 -9116 8133 46865 34018 55488
4669 55488 43413 14625 30879 69086 66904 74126 93276 79233 49465 45181 49502 49926 36161
4656 36161 4623 -15472 19743 56426 3242 4252 1747 53994 49218 15962 43800 78994
4644 78994 61589 1224 -51296 -77646 -31730 -11900 -12006 8799 -32713 -58531 -45557 -44783 -14555
4631 -14555 20798 28204 61913 18171 33903 72371 34135 21140 27049 -9747 11729 7674
4619 7674 4221 16583 974 -32003 -21648 11105 38781 62669 31492 24156 26007 -28619 -26771
4606 -26771 32066 -37680 -103215 -76599 -41301 -31869 -64021 -82974 -71603 -46959 -43592 -44629
4594 -44629 -54991 -45716 53640 17191 -76654 -74033 -72316 -76931 -43049 -29314 -6376 -1372 -46883
4581 -46883 -91783 -65704 511 2569 -36805 -56748 -64024 -56704 -31661 11310 29035 -15462
4569 -15462 -8604 12538 49338 34158 28356 31939 3379 -32508 -53862 -50852 -57208 -79085 -65169
4556 -65169 -52906 -29940 -15141 -31127 -59400 17428 60712 60785 31852 47083 30141 1940
4544 1940 -26450 -42722 -9807 -14177 -8943 -14193 -41967 -12792 18678 48002 1471 -58511 -47833
4531 -47833 -54402 -65819 -52001 -47136 22241 18449 -481 -31244 -38573 -9946 -32291 -42040 -37351
4518 -37351 -41703 -59279 -36729 -28022 -32486 -1506 -7178 -19985 -17946 13919 7506 11912 26481
4505 26481 11088 22888 50009 71859 59286 11939 23332 34588 -35750 -8198 -3782 -37200
4493 -37200 -18508 10029 54519 48875 46897 19797 8045 25609 27930 3645 -54706 -98517
4481 -98517 -90338 -108137 -115527 -52299 -37443 -19683 -277 -1540 -13141 -43635 -85686 -87516 -66981
4468 -66981 -94322 -115680 -126605 -152111 -104145 -79973 -45439 -6650 -8943 -43374 -103709 -83017
4456 -83017 -8805 9551 19211 14169 -10345 -29038 -12989 52443 42900 68287 55650 -1217
4444 -1217 -4567 -38016 -97069 -58701 11140 91914 106746 37902 1489 -27946 -33438 161
4432 161 21689 42201 16921 -27336 -72336 -64695 -39494 -25466 9478 48038 48842 6105 -15189
4419 -15189 -8276 -5806 -29960 -50405 -68167 -21839 -37114 -6651 24527 32991 18493 19188 -20823
4406 -20823 -40424 4109 62092 48553 28923 17813 42967 59445 82231 64313 64207 68743
4394 68743 78898 53089 -20206 -55601 -40879 -22210 11086 16609 24159 40786 517 -27783
4382 -27783 -46661 -42648 5311 58897 55402 8129 -12996 -44327 -49069 3582 24527 3300
4370 3300 -16554 -13139 -29202 -34926 -44849 -18902 7112 -37257 -51148 -73080 -65492 -43365 -62918
4357 -62918 -53950 -33021 -27921 -840 30782 20578 -32497 -38604 -47554 -57297 -27114 -15544 -28741
4344 -28741 -9458 72519 108216 123452 107736 58396 28505 -22801 -25905 12756 32793 76240
4332 76240 119597 104123 53075 69396 20046 10673 -19591 -40968 17869 57047 6411 8370
4320 8370 -4257 26610 -7418 -49024 -51332 -73264 -52662 -50578 -58738 -48091 -44545 -47751 -11531
4307 -11531 19196 -39302 -18159 20560 54380 38514 10312 30845 32601 -40684 -52898 -23118
4295 -23118 -22604 -20564 19984 42231 42782 7661 45928 91265 122030 92460 57187 24309 -37361
4282 -37361 -28686 59007 96326 82400 4982 38123 88543 91593 39774 -937 -62579 -128907
4270 -128907 -132731 -83313 -11907 -12846 -35612 -28098 -19801 -12956 -59825 -116716 -57120 -37045 -35118
4257 -35118 -52822 -48606 -27674 7991 15854 53637 87501 77539 82748 52838 38897 31863 23479
4244 23479 48305 44230 23808 34616 78265 66491 48433 -4246 -31916 -66465 -63645 -17705
4232 -17705 -17405 -88817 -101947 -93487 -57692 -97501 -112880 -86142 -39281 -12830 13955 30805
4220 30805 23811 -19653 -54174 -77036 -114760 -113568 -66204 -51318 16209 25182 44866 -1574
4208 -1574 -41354 -86961 -70300 -15766 28532 16281 -22083 -86418 -119427 -110461 -39452 -32026
4196 -32026 -26906 -12017 4816 35828 24635 9705 1094 18397 6581 -55168 -56494 -100591
4184 -100591 -144464 -76392 -16217 -2830 -21108 -24359 -27465 -28271 -27307 -18343 39913 44595 29842
4171 29842 -13086 31517 59034 14711 -31644 -36249 -88304 -91924 -11672 -3672 3682 34386 6501
4158 6501 12753 49243 22821 -40230 -350 32879 19687 -7454 -22358 -3061 -34551 -13665
4146 -13665 35009 25021 27804 26636 42224 48050 19328 -25084 -48190 -30614 5009 -988 -24906
4133 -24906 -60078 -31005 -572 29779 41092 15427 13236 26482 3290 -33509 -21703 35449
4121 35449 44250 -34488 -25512 -6945 -49421 -59310 -41026 -22169 -3502 -5590 632 7152 -43169
4108 -43169 -40802 -53560 -78757 -66314 -15662 12849 28457 38843 4716 -36419 -61919 -97087
4096 -97087 -133587 -120450 -113868 -141000 -110947 -93076 204 -17664 -85989 -77266 -26192 -39506
4084 -39506 -79112 -126147 -124564 -54701 -46662 -64154 -77018 -26036 8423 59568 39598 9136
4072 9136 1576 -20090 -24640 25370 61666 105173 95047 98537 93821 44490 -30883 -28780 -26929
4059 -26929 -61259 -22080 -14160 52431 45645 21925 -27370 -71849 -56570 -46051 240 15522
4047 15522 40490 44509 40346 39095 65011 71077 59654 55735 51853 20039 16712 -25350 -8589
4034 -8589 39649 10335 -31033 -64083 -68009 -50326 -47932 -59740 -67333 -24269 -11274 -29664 -24545
4021 -24545 -3100 20796 14850 -25127 -28394 -187 57509 -2473 -42044 -20498 2331 4524
4009 4524 15749 -23762 -53524 -26603 8553 37859 102101 111701 89822 59923 64222 12982
3997 12982 -53943 -21114 -34640 -12169 16647 -22356 -14045 23268 49184 33781 40424 1322
3985 1322 -70015 -18237 34994 9161 5082 -30842 -45815 -13710 15119 56629 86676 32302
3973 32302 -15526 -29454 -73788 -110261 -71417 -32937 -26749 -25839 -2126 47141 11686 -36391
3961 -36391 -137 -458 -24194 2955 25353 -12982 -61887 -22936 3322 27040 38343 12693
3949 12693 400 -3191 43701 59417 10492 2481 16184 -6002 -42782 -24744 15433 64362
3937 64362 65760 66091 58037 47607 23192 25499 1101 30897 97703 125047 63343 -48441 -76036
3924 -76036 -28765 -33815 -34366 -80207 -32428 73628 81473 46463 22081 13845 46550 71101 81831
3911 81831 37192 -87939 -155816 -150675 -135828 -66341 -100461 -94442 -64295 -37697 -54039 -55366
3899 -55366 -57366 -33697 -29587 -7401 15752 -817 14058 79317 39032 53080 86075 55990
3887 55990 -5779 5738 -13246 9940 16783 16616 34885 74202 95409 93647 59882 51684 19242
3874 19242 -22733 -68340 -97930 -77055 -15717 15940 -3446 60875 13899 -64996 -114641 -93578
3862 -93578 -36921 33103 78873 52887 -3851 -57437 -67870 -4657 -9264 -19211 -16149 -23558 30481
3849 30481 60774 50195 14619 25335 6812 2441 4807 37865 50260 79292 99575 83312
3837 83312 66046 106470 87721 12626 2458 -10096 -54025 -74023 -66107 -9280 63561 30118
3825 30118 45234 22801 -19961 27498 54554 36321 -4071 -3583 12171 21113 78713 130119
3813 130119 100830 8381 -68274 -58885 -8266 36621 85021 63295 -7856 -39864 -24908 -23746
3801 -23746 -4896 14644 48229 55744 -25683 -33671 -47787 -58870 -39981 -73514 -62174 -32279
3789 -32279 -24375 -21715 -32594 8347 -5765 -19578 -26235 -18344 11068 -18679 -48019 -78757 15821
3776 15821 33656 40883 15148 3205 -4091 -21396 -37917 21125 43699 19088 67464 57748
3764 57748 4079 -24206 -19335 43876 48725 13894 -10210 -50704 -64010 -65188 -9663 18796
3752 18796 32932 44941 65564 75383 61429 25355 -21931 -36031 13271 -5255 -36151 -48088
3740 -48088 -43741 -28134 -56426 -94052 -53545 -1134 -18161 -27107 -16568 -31414 -872 -6697
3728 -6697 -12379 -43111 -17612 45127 42007 8094 -50667 -66172 -62916 146 42612 9256 -8869
3715 -8869 -51284 -54806 -12956 51750 48433 69046 104549 68181 33983 23060 18121 52232 39841
3702 39841 33500 62093 36848 36467 25244 50874 67486 58579 62530 72103 79204 785 -47187
3689 -47187 -23651 -31622 -32134 -21118 -20537 -41250 -13141 24097 31327 -21118 -24300 -16285 -2817
3676 -2817 13395 -36796 -59921 -45098 -43042 13471 -5487 -37808 -46638 -4524 14367 -54370
3664 -54370 -119591 -95946 -66949 -13211 12580 27442 49090 24159 -5215 -12254 -20283 -28550
3652 -28550 4584 16736 -9373 -3573 -46422 -81803 -69209 -97338 -92410 -76297 -62601 -84125
3640 -84125 -15961 7111 -36531 -83597 -120021 -100282 -112493 -165113 -185275 -100446 -34594 20813
3628 20813 35275 -8002 -14208 9152 21179 12284 49048 22615 2803 -43637 -120630 -115401
3616 -115401 -38407 -7113 45142 67498 2433 35686 38978 53128 56611 87316 131444 120741
3604 120741 69346 17958 -23410 3635 30680 46016 28445 25768 78174 139760 57638 -40611
3592 -40611 -16072 9450 27336 -9709 -16698 47518 57252 56974 31113 -22655 -45349 -94464 -101028
3579 -101028 -62075 -64570 -77990 512 80387 26376 7112 4577 9790 30748 7771 43018
3567 43018 58726 54913 38101 38829 24229 15391 -17372 48375 15813 -17031 -9014 -16006 22142
3554 22142 45036 36060 34788 62863 84284 89325 57832 13470 -28229 -38296 -41539 -58029 -75081
3541 -75081 -100766 -118745 -66790 -52955 -65029 -64640 -40820 8108 8547 -25549 -71156 -87971 -52564
3528 -52564 38958 78405 19770 -25445 -8778 -19587 -87103 -31053 -21072 -32420 -30057 -25892
3516 -25892 -19823 -9515 -384 -22635 -20014 15019 -469 -23755 -62435 -66163 -41857 -16988 15918
3503 15918 22429 48282 20287 -16024 -54676 20361 52893 58227 51966 7829 -60832 -47877
3491 -47877 -27023 -28041 -38484 -76634 -31540 -8400 29697 51900 22976 -22323 -6473 11175
3479 11175 -7668 32308 47565 46921 42322 10128 27569 46104 49261 39789 -10733 -6958 54733
3466 54733 53546 55506 76871 100162 60604 -7094 -15051 -38275 -23925 15677 53094 62878 27176
3453 27176 -18538 5662 13823 22049 52544 98486 137495 163222 77331 -23123 -71666 -121285
3441 -121285 -93593 -27944 -44301 -49933 -41553 -34877 -9799 -4197 -18923 -42626 -53010 -16354
3429 -16354 8014 15133 8605 -10013 -33580 -84276 -56107 -15808 -34214 -30937 -23456 25773 69311
3416 69311 84406 72675 14152 -7348 3100 75359 96279 18343 -24063 -21982 57817 125256
3404 125256 106152 63899 25362 35353 22709 16533 52494 63547 47029 -2120 -39230 -7479
3392 -7479 -21138 -4730 -26666 -27610 12576 89094 48440 36796 72676 92126 41446 28215
3380 28215 65031 41042 49245 14382 5251 11659 37876 68605 49841 65621 56141 4941 -55591
3367 -55591 -72112 -2684 43413 -14749 -4450 11686 47417 34776 -2682 -16389 6273 56243
3355 56243 90997 65947 31392 27200 21686 -15027 -40722 -23257 3999 49123 31398 16105
3343 16105 -6401 31201 35504 22597 46325 29714 35060 29654 -27577 -20441 52750 61199 110094
3330 110094 111106 79525 61503 31585 26237 15306 25209 11475 51054 22002 -17474 -67757
3318 -67757 -74996 -34393 -64891 -6625 42683 59556 19490 22208 41987 78757 59468 73248
3306 73248 44638 33199 18042 15041 18156 6717 -7479 -40253 -33270 -58497 -68882 -71195 -81176
3293 -81176 -50850 -36727 -33887 -14527 24915 17672 50953 58103 67995 67376 31067 39688 19493
3280 19493 -3211 -56000 -90781 -30214 36750 13095 35090 56620 14939 -17473 17542 9987
3268 9987 -27623 -41653 -19529 -37387 -29097 -51288 -74535 -24660 -7102 -25723 22759 12430
3256 12430 5247 29307 18359 8592 26871 9550 926 12879 7881 -16818 -7690 -39341 -66649
3243 -66649 -74591 -84407 -44323 -8846 16931 40949 42332 43503 61862 47549 63480 74825 99063
3230 99063 66431 75975 120351 66855 38629 22928 -433 31319 33674 28073 14675 -14087
3218 -14087 -45868 -52649 25314 40496 430 32855 50922 65087 84537 47374 15992 34519
3206 34519 30258 15952 -25212 -12298 -31415 -49946 -18110 -9186 19396 45705 24868 1653
3194 1653 -5043 2341 -32633 -13165 -9137 -8377 20275 7717 -71356 -87790 -49724 -34513 29893
3181 29893 40837 21755 -11478 -18180 -24664 -19537 -8850 -63660 -63813 -15095 27995 -617 23629
3168 23629 27046 -63710 -110117 -100581 -48493 -963 7540 -24476 -3872 46754 27457 -18377
3156 -18377 -47926 9166 -18307 13274 -30191 -42689 -23824 3870 44819 62742 68130 67682
3144 67682 90587 107694 115796 70001 29811 -14659 -42750 -1979 -21972 -7365 7934 -184
3132 -184 -22000 -50909 -76043 -58117 -11196 -28052 -10879 -19896 -9292 10859 -55696 -106998
3120 -106998 -110845 -91718 -83281 -117572 -140410 -172448 -115220 -37220 23833 65447 30544 27757
3108 27757 35810 2705 -179 -15367 -32517 -37727 -26336 -6104 -9962 27004 55328 55175 5505
3095 5505 15714 -23353 -35149 13207 -37874 -84461 -84026 -45620 -1659 -21363 -50023 579
3083 579 38933 16438 -22755 -1625 -9998 -2747 33308 14762 63059 30414 23200 13252 -36701
3070 -36701 -39341 -9610 -29396 -36680 -36909 -37444 -23004 -3995 -30768 -21540 30365 -8217 -40695
3057 -40695 -44060 -3262 -14498 -37208 10840 31281 18719 31856 21258 34150 51710 30518
3045 30518 -41420 -25283 -17230 -32298 -4372 -6484 11427 38343 53424 37036 18724 70549
3033 70549 61000 37578 -20215 -61289 -4120 10021 -47377 -69047 -40837 -12165 4882 20375
3021 20375 -7094 -4740 -8684 -17628 -28351 -2503 30661 37995 10282 14202 29074 48406 73644
3008 73644 78032 80119 28217 2852 10829 12647 11857 -18810 -77223 -75249 -52841 -66760 -109163
2995 -109163 -109531 -52270 -73730 -73084 -60079 -42200 -61486 -50158 -5660 16634 11058 21749 32262
2982 32262 23324 25303 -23926 -16785 52417 53744 5106 29442 81211 71301 -18564 -49265 -12563
2969 -12563 50393 91957 44708 11695 33564 -18841 -53471 -58072 -31594 -10040 6958 -7337
2957 -7337 975 19262 56810 -6251 15069 35499 -32707 -68025 -79585 -19562 31635 14101
2945 14101 4832 -18791 -42274 -24241 -24636 -12276 -48 7394 32414 69516 19170 -36411 -9003
2932 -9003 60402 108770 81385 17776 -3920 2556 11770 -19870 -11885 -5588 67723 91858 128506
2919 128506 69862 25403 10099 -36215 5798 82306 73471 52999 1619 13408 51753 68121
2907 68121 52834 51493 12297 8085 14838 -13081 -31480 -23348 7193 20209 1581 -9682 -39087
2894 -39087 -35014 -14291 23909 45922 41190 4292 500 -32457 -16243 -35204 -54169 -61706 -50698
2881 -50698 -101633 -134858 -75601 -34689 16487 56634 -8972 -21416 19371 38048 29691 -27466
2869 -27466 7029 17140 -20121 -34838 -37874 -8413 -17023 -11305 18953 -12473 -18188 12592 53964
2856 53964 38595 50916 19524 28553 19154 49932 44609 32719 40820 77956 107938 116931 68808
2843 68808 32203 43093 11554 20372 3250 -33315 -76238 -34676 19106 -1962 -9962 -11673
2831 -11673 736 -19461 -11197 15615 46501 66504 23609 23646 57145 44808 40487 -10844 -36225
2818 -36225 -10352 22120 30699 61676 43586 62163 74705 58807 2599 -22798 -53051 -19818
2806 -19818 26619 35659 18035 61143 97271 41321 -4110 25794 44349 77512 90966 12763
2794 12763 3053 -18850 -20761 -33792 -36731 -39760 -10816 -23919 -23222 -1284 7814 -739 -28673
2781 -28673 -76221 -122999 -117288 -107162 -62141 -15938 -47012 -85137 -33909 -62181 -114566 -91653
2769 -91653 -86459 -145988 -137704 -50148 -22812 -64809 -65925 -85184 -50340 -26035 19303 61350
2757 61350 79007 65151 44982 -10931 -35415 -47535 -63077 -89171 -72339 -40248 -36489 -77367
2745 -77367 -78780 -112573 -82863 -29600 -33701 -50228 -11734 35470 29855 18318 48634 40447 38280
2732 38280 46122 35315 13179 7913 8689 16288 56016 53373 77792 97480 68634 46672 9444
2719 9444 -21243 -4599 37366 19058 12901 19336 -18304 -27489 6328 36547 49527 11400 -23147
2706 -23147 -10042 36544 19628 -33926 -42974 -16867 -20396 -35745 -61833 -86484 -54410 -62707
2694 -62707 -53647 -24357 -19299 -14425 -28948 -8733 7620 26523 46185 40579 51628 -7832 -13768
2681 -13768 -4517 -34904 -12420 -5190 18192 2124 -10499 -34189 6163 -5217 -8963 -22780
2669 -22780 -24546 -82943 -89994 -82913 -107550 -130383 -107928 -69834 -49907 -50402 -32559 18294 -7158
2656 -7158 -56444 -51407 -28941 -9819 22676 25228 14976 56246 75096 16880 12370 -15052 -39629
2643 -39629 -36823 50045 62560 65682 60307 74676 85955 71376 49537 43987 64824 71508 71371
2630 71371 70804 77330 77436 86894 93185 43521 2218 -81383 -48777 36005 66214 99959 126385
2617 126385 84096 44216 66857 96589 129446 83911 33241 38371 45217 32716 1540 -28810
2605 -28810 -13040 -33326 -38293 -34991 -33949 -45469 -34838 -41838 -23680 -2061 46470 29606 15409
2592 15409 27629 6726 -13167 -69436 -74074 -55528 35735 72577 71719 27784 -29178 -32997 -58468
2579 -58468 -81237 -39275 -1770 -20606 -49051 -36137 -43683 8113 -16824 -28742 -39300 -57715
2567 -57715 -40147 -19857 -1163 14199 -5407 -22099 -32792 -28730 33910 41362 -12000 -45090
2555 -45090 12825 41450 -3188 -4195 16981 23374 7575 -5367 -23864 -61331 -68812 -70813 -57648
2542 -57648 -39224 -42660 -59968 -45721 -8462 -44082 -57231 -38811 -8716 7033 -58818 -89504
2530 -89504 -29192 -41888 -75223 -45001 -71193 -58027 -7621 2960 -38953 -47035 -310 37489
2518 37489 44639 16415 10406 -6320 -17238 9147 -7699 -47619 -81570 -91377 -44285 -26417
2506 -26417 -12493 -37626 -72467 -56389 -23717 3348 -30964 -14019 29343 49102 45465 42448
2494 42448 27103 -7424 -30457 -52295 -41229 -35883 12200 -10323 -7983 48780 35492 64337
2482 64337 71469 52246 43777 4811 -11893 -29283 -38669 -65237 -38681 14259 23028 9516 10671
2469 10671 20902 56921 16282 1606 9594 -64921 -81579 -64998 -122411 -94994 -7928 13631
2457 13631 34970 37153 16034 1471 -8477 -12953 -42410 -10883 -10159 -1062 6200 -42320 862
2444 862 16724 -14484 -37827 -110202 -80800 3553 3080 490 28649 64916 46618 5659 -19502
2431 -19502 14488 16664 -12066 -31171 10023 -30157 -75670 -143603 -180302 -116929 -91451 -132509
2419 -132509 -81122 7523 14822 -23553 -49848 -85509 -147068 -142058 -96437 -60687 -70331 -67605
2407 -67605 -16373 -27502 -36876 -44538 -79996 -95387 -58410 31393 52554 26778 -12239 -30275
2395 -30275 -39560 -66104 -55064 1172 32002 14329 -16684 -5329 -13216 -12381 -13720 -4107 57444
2382 57444 69254 47195 55906 21706 -57501 -53829 -4741 33077 24511 13664 2294 -19382
2370 -19382 64 -18318 -51731 5273 42175 14281 -44283 -46158 -73890 -74504 -31706 -9752
2358 -9752 2724 24733 30796 41173 81689 118384 108723 90521 69478 23253 -2913 -707 -58790
2345 -58790 -52244 -20246 -19473 -54085 -77597 -88094 -14055 30773 13973 38829 49633 21735
2333 21735 7475 -1391 36516 45938 74214 88493 94171 60811 66806 96412 73152 54525 34420
2320 34420 30167 62243 78001 62298 8080 -10623 -38331 -75841 -94192 -109444 -48442 9415
2308 9415 -5248 -52213 -63710 -76522 -117112 -129974 -83604 -44743 -20423 -60096 -83001 -106782
2296 -106782 -98263 -37062 -27411 -6903 37755 32801 63852 64119 28505 1795 -1500 39981 -3333
2283 -3333 -38603 -28012 -32774 -11719 -42592 -41284 -62846 -60117 -38941 -36366 -6796 -3716 -43499
2270 -43499 -48056 27981 -294 -67367 -43281 39891 103034 85179 5682 7757 -6543 -32513
2258 -32513 -26691 15841 41550 58498 69245 52248 15862 -17323 -23244 16038 68986 100060
2246 100060 73558 60513 30707 2945 -21027 -7635 -3739 -26474 -11969 -5293 13517 30978
2234 30978 28581 9795 43782 43412 44676 86118 35177 -15999 -11141 8163 -26017 -7371 -28292
2221 -28292 -43049 -21319 -19502 -48819 -44972 -20693 -2232 28740 10167 -16607 -37282 -43485
2209 -43485 -10170 4137 18472 14860 47246 112467 107821 47650 -3749 -2369 31876 27136 -19406
2196 -19406 -16639 -20793 -52021 -51769 -38950 -33802 -83841 -79001 -76495 -88561 -35090 -29718 -44831
2183 -44831 -27783 1980 -18333 -3228 3976 -3234 -16632 49 28027 39889 -7479 -56641
2171 -56641 -38057 -1306 83362 72636 40281 45421 92279 54954 69041 60808 66891 109555
2159 109555 74371 60486 57168 63650 33898 -4686 -25857 -14511 -41929 -68747 -58508 -14110
2147 -14110 57255 79645 58530 -14199 -54522 -51039 -43200 -14363 -26898 -28343 -22273 -49125 -45094
2134 -45094 -25962 -39892 -43635 5105 -35988 -75934 -103654 -57971 -5450 -1192 48723 8632
2122 8632 -7869 15502 32070 21275 -8367 -79788 -108329 -40427 -27520 -54470 -68983 -7315
2110 -7315 71240 80790 53347 40580 10123 -24539 -3401 33071 48583 35148 -21779 -14852
2098 -14852 17543 -26848 -46061 26057 40954 -12297 -19585 -27579 1134 -37075 -39313 -69069
2086 -69069 -48538 33213 36967 62046 84252 41651 10189 -4791 37864 56337 42787 -701
2074 -701 10069 -565 -19282 -43971 -18660 61345 68808 67692 73717 24119 -45454 -115978 -101899
2061 -101899 -80079 -31176 -47804 -21494 38855 31812 -7372 -51256 -20133 28189 15653 -2164
2049 -2164 21622 86670 170136 170688 120467 65857 49037 34695 -7973 14436 50990 69349
2037 69349 10465 -22451 -41575 -45450 -42179 1454 11874 7272 30814 31310 9770 16682 44642
2024 44642 22354 -14066 -40680 -48861 -52429 -35033 -52168 -38892 -10192 16088 24118 -40333
2012 -40333 -62183 -18724 -4880 -38972 -29231 -34989 -74326 -132867 -155848 -79911 -20840 -70431
2000 -70431 -57996 -56920 -21722 -25186 -12903 -23999 -31732 -4572 -9111 -5796 -519 -59944 -29704
1987 -29704 6766 12906 1726 -42377 -68336 -37471 45229 55978 18428 9971 10632 25254 38305
1974 38305 41131 31698 53449 81234 87437 63859 -22133 405 16240 21746 42641 53929 41009
1961 41009 76354 87728 68678 53500 7274 21685 34791 -4095 34880 45933 55133 43706
1949 43706 13152 7552 42817 21171 -404 2454 67444 122278 114526 101456 62944 -7706
1937 -7706 -29175 -69118 -82780 -42267 6753 14056 -5424 23224 12213 -40082 -95537 -91943
1925 -91943 -36102 -34853 -3608 22906 44357 16349 28459 -23885 -59366 -24158 15869 25764
1913 25764 35922 9618 53215 87344 56316 60758 55949 27344 -15907 -18381 -29930 -7579
1901 -7579 39225 27635 57588 135621 136702 115945 116117 110798 44730 36735 40059 62839 81491
1888 81491 72178 36631 8313 3080 21832 78112 63262 60099 78920 58113 -30174 -41280
1876 -41280 -103204 -68930 -9802 30084 25584 57318 72288 72432 37245 67817 34089 65716
1864 65716 85021 64469 113489 88461 56462 33463 32717 62343 29057 41206 12902 -2539
1852 -2539 1234 -8431 -31903 -60924 -35880 8945 57317 64178 79543 20297 18599 79430 71288
1839 71288 27105 -3900 5537 15208 49297 62050 71246 17093 40438 -1992 -53186 -51785 -27125
1826 -27125 2131 -37860 -20931 12392 -8165 -15938 5978 -18608 -4695 29651 97638 89422
1814 89422 97262 91326 59358 55303 53720 45397 34051 -10172 -46439 -27019 -27935 -883 -6309
1801 -6309 22511 72374 51104 13682 2269 5280 -6146 -18517 7518 -4318 -703 27523
1789 27523 18151 55156 46141 20563 -42440 -92268 -37906 -21783 -5072 -24294 -42241 -37754
1777 -37754 -51016 -11744 4095 -2255 19060 -2408 8702 45574 -1750 -2001 -11369 -29622 -8062
1764 -8062 -5424 68776 100597 66244 55305 46027 12233 -12168 2207 -2576 18904 97917 106801
1751 106801 52741 23970 10408 -17326 -6963 33630 17167 -42380 -18877 30208 63120 70795
1739 70795 67211 23864 -16024 -52679 -60773 -57471 -131859 -70120 -9724 -11720 -49057 -64988 -138780
1726 -138780 -129274 -83745 -25407 -4255 -44275 -20867 -11014 6521 3529 29201 54420 99564
1714 99564 75150 61336 89358 99063 95989 77666 3643 -16504 28870 79174 79938 81562 11742
1701 11742 -63872 -58048 -73998 -41145 863 36002 71731 38001 -16339 -12207 26715 28098
1689 28098 5300 -7012 6195 30340 1413 -11987 -23282 -11378 -52622 -25569 16688 54874
1677 54874 89120 62600 75016 69190 65767 39316 4017 10153 11155 14445 3285 -32484 19555
1664 19555 24241 -8721 15476 40577 17342 47119 16435 -11159 11421 34167 65704 34895
1652 34895 -23229 -14449 2850 -23309 -38428 4727 12033 -18661 -7922 -33094 -84150 -73744
1640 -73744 -39346 -56941 -114866 -79676 -48011 5234 34345 9571 27468 53255 32187 11134
1628 11134 16704 29829 56025 36798 65607 89330 66838 52173 63079 70061 27001 41450
1616 41450 64061 63510 34860 50994 50251 8095 -41989 -28196 -50333 -62377 -56724 -47123 -65635
1603 -65635 -46443 34043 55687 4861 -8927 31164 78774 113243 113361 88914 70718 52417
1591 52417 66558 37783 69447 50870 9295 -3397 1810 15043 -13486 -79371 -83044 -25710
1579 -25710 -27842 -40155 -2118 10385 -6206 30221 46937 7985 41409 37454 -32635 -44964
1567 -44964 2706 1440 24655 64571 32870 25888 17627 9095 35611 53202 21122 -893 35708
1554 35708 68153 46500 36015 -2080 31270 64599 78336 105789 103630 145265 114867 13482
1542 13482 -30841 -22237 9538 -43469 -85019 -103918 -64010 -75091 -67289 -90688 -84655 -28038
1530 -28038 55128 102779 109908 55946 24800 28790 35754 -8985 -49024 20917 98260 92756 94911
1517 94911 98476 95528 54745 44594 51203 30720 -28791 -78255 -64089 -57054 -51392 -41477 13824
1504 13824 59186 60042 58165 54815 24219 -13048 -87619 -20196 39533 30935 42684 52552 22964
1491 22964 31162 3101 -32392 -43546 21269 61031 86787 94706 32761 31744 52985 64582
1479 64582 37180 5347 8965 46605 77396 84989 47415 19854 509 18321 29591 -14126
1467 -14126 -43170 22840 70268 30761 -4890 14444 -12527 -10484 43403 27912 35112 16564
1455 16564 -52468 -84508 -74593 -71404 -55222 -15030 28514 -495 -35982 -13692 -10303 -2403 -41847
1442 -41847 -13383 -21452 -37392 24026 64918 66827 -7952 25516 16988 -1240 -64955 -44490
1430 -44490 -1670 29767 60023 77617 109796 66634 79772 110138 80580 23852 -21367 -9130
1418 -9130 -45138 -65342 -56897 -53269 -35724 5047 18915 19072 -25765 -43944 -77712 -76643 -60399
1405 -60399 -51527 7705 70271 89202 35016 24433 7751 -8883 -42990 2898 64950 43371
1393 43371 44122 50994 45196 46618 61866 85871 51944 8930 22923 43918 15751 -20132 -68099
1380 -68099 -49785 -14198 -3858 -2815 -7357 -6158 -6404 -29605 -37276 -23480 -6919 10855 -32097
1367 -32097 -42888 -34901 810 48798 34352 -12851 -39675 -23407 -6783 10764 -9796 1562
1355 1562 -9038 -12523 -35821 2738 8249 -459 47325 61529 43362 82350 71525 12564 -23947
1342 -23947 -46978 -48443 -34921 -65455 -31463 9715 8828 16212 9837 -14133 -2668 20490 -8200
1329 -8200 -56483 -38007 -41894 -40492 -3005 4066 -35428 -31003 4718 40446 41936 56827 40201
1316 40201 6876 -15842 -5960 -1888 24352 10873 -26954 2624 -27776 -20818 -49424 -84076
1304 -84076 -28746 56535 67727 95911 99344 38699 -11382 7671 8970 18095 -7408 -16851 -32736
1291 -32736 -50307 -54294 -65891 -23341 -55293 -27317 7913 4090 -62367 -65502 -32000 -39328 -24485
1278 -24485 57092 66831 27385 1792 -9946 -35764 -70840 -82215 -39926 -30138 3329 46504
1266 46504 37040 69295 67161 63004 70986 89105 31388 34364 53550 13730 972 10230 25354
1253 25354 9194 21175 21657 1220 64383 77433 39656 27991 26232 16578 10182 -30521 -69130
1240 -69130 -55425 -27237 -45472 -4054 -2347 -29873 -14429 24599 10694 7421 -42839 -34562
1228 -34562 -41971 -58711 -41721 3572 22588 -4196 559 12165 -35067 -27818 -66091 -126547
1216 -126547 -111489 -98460 -125457 -94166 -70605 -80079 -65312 -36858 -18887 -10345 4169 -10436
1204 -10436 -5036 2967 -2127 -11075 -46024 -48877 -67095 -6165 -22845 -19172 -41518 -60714 -77582
1191 -77582 -10388 -1337 -2222 22512 29358 8635 9224 45618 57590 72873 111842 98900 111830
1178 111830 94240 13933 -20680 -4726 844 40759 79480 54228 21183 -21910 -18592 -58584
1166 -58584 -66189 -39823 -27537 -20820 -66275 -64258 -55395 -96389 -133712 -109198 -95031 -26750 36854
1153 36854 107191 133195 59697 3702 15511 -9488 -5266 35578 53074 75785 42443 10524
1141 10524 8782 2858 -5220 -1576 -16119 -80770 -82031 -27885 31114 52740 78966 67597 8301
1128 8301 -41509 -33713 -12071 -19734 19253 2382 -42603 -100323 -50694 -31153 -36324 18143 13771
1115 13771 -1950 -1704 -6063 38264 92893 121847 132715 92465 60689 87905 99716 91916 89539
1102 89539 49245 8527 31572 13509 14373 3495 -8303 27343 9238 -9792 45011 10524
1090 10524 -53458 -50671 22961 96228 63266 19374 20750 71160 68140 57230 58369 72852 75548
1077 75548 34238 25008 -19693 -17415 -16405 -38600 -108908 -53709 1572 -25688 -42335 -60586
1065 -60586 -66008 -76501 -110074 -32574 -7933 -4555 21167 78559 64701 -14971 -60689 -37490
1053 -37490 -21960 -43324 -26847 -3199 -37741 -41354 -60850 -26563 -81322 -74648 -85558 -67190
1041 -67190 -61307 -47111 -23311 -5534 9429 7695 -10210 13061 -7499 -9490 -19462 -35445 -31766
1028 -31766 8974 36929 25447 23109 40790 40171 -3128 -21186 14671 41877 5821 -16051
1016 -16051 -2617 -32058 -75176 -78392 -57303 -48397 -40732 18869 52824 55063 51748 32796 42711
1003 42711 21705 -4894 51765 29965 -47690 -34997 -48701 -28215 -31073 -2169 10506 -22733
991 -22733 -67016 -29336 15481 20734 -58081 -114921 -99763 -92427 -72415 -34796 -18593 31490
979 31490 36190 16424 -19029 -894 10378 73714 82720 80296 75089 7248 -45965 -58197 -61476
966 -61476 -9001 22987 60575 -23971 -29818 7864 35744 15622 16252 5545 -6527 39586 66604
953 66604 34662 30196 26343 27776 3678 -53333 -32237 -25479 -39397 -48780 -54030 -45778 -76798
940 -76798 -70395 -31493 -24631 -47810 -72164 -107361 -117811 -88326 -95385 -30727 -9714 -78587 -116609
927 -116609 -73491 -47990 -77799 -52096 -454 32017 -25006 -25212 -10132 4009 40340 29766
915 29766 -52132 -107098 -68115 -55354 -81289 -81417 -62281 34254 68849 26873 21100 30208 -27786
902 -27786 -63020 -57115 -88837 -98475 -91623 -54352 -10596 34272 44151 1603 20435 -39301 -50301
889 -50301 -32288 -34788 -22363 -21117 7771 56673 46652 34043 31819 3578 -27045 -35320 40269
876 40269 53319 24457 22898 29595 37820 18378 23515 59125 66630 26386 21647 47499 11722
863 11722 4405 -28935 -20347 -2242 -37765 -37152 24268 42133 17071 -49820 -77233 -34706 -15186
850 -15186 10245 25577 17184 28326 -36914 -46550 -13203 15674 20380 12847 4159 -21461 -31195
837 -31195 -3927 21789 -16502 -29133 22040 -14334 394 6014 13008 25298 28065 2515 -44810
824 -44810 -35098 -41623 -2385 25926 -5254 12436 -22528 10041 -9889 -43505 -13575 26409
812 26409 11789 -22695 -41581 -45053 -53558 -23365 42585 41983 -5674 -29829 -29110 -5837 22017
799 22017 6374 -57868 -33427 -40068 12599 20242 -25878 -27475 -37632 -60197 -36938 -22330 -57685
786 -57685 -67111 -65380 -8000 37843 21877 58690 55362 34502 -3630 -86 20944 20544 38991
773 38991 33711 56480 65297 28546 19804 8420 -20089 10473 6918 -37674 -121552 -86388 -38599
760 -38599 -44308 -15324 -9729 -28791 -43761 -77915 -55729 -939 32503 55593 64072 83265 106700
747 106700 79639 21117 -24788 -39645 -12992 -4727 -13392 -16915 57902 29636 -5622 -67511
735 -67511 -58914 -23291 -5280 -17333 -7999 -33120 -81454 -74437 -44607 -45752 -81605 -65221 -7796
722 -7796 219 -37914 -20723 -21654 -69072 -59818 -34416 -14766 -19822 -16113 17287 22052 43199 57433
708 57433 26502 1377 35040 36479 18657 34924 28541 27501 56608 33181 -20401 -27128 5269
695 5269 28356 46634 42030 34037 42820 -26841 -35477 -2834 -5304 -47514 -68453 -67027 -67499 -55403
681 -55403 -38174 -15702 4063 4936 -34077 -131070 -117783 -76894 -46730 -76137 -58943 -44830
669 -44830 -76008 -62507 -62139 -47985 -45185 -27392 -1621 -7291 -33816 -29321 4399 13586 27280
656 27280 43743 43772 -9934 5207 -3170 -39774 15247 44050 8969 -45645 -39117 -34045 -13516
643 -13516 6052 -2820 25920 454 -50064 -52112 -68653 -58695 -51213 -16605 20555 32482 28323
630 28323 -3475 -47040 -53501 -18285 20277 5243 -13201 32551 13000 -46138 -56313 -33470
618 -33470 -39724 20813 89374 95256 18037 45775 58326 -6454 -17026 -54665 -79751 -54630
606 -54630 -42887 -65312 -52601 -37017 -21891 -5438 -12943 3783 -40201 -34791 -61582 -52244 -3837
593 -3837 5616 -4696 12820 35072 -19665 -27994 -17417 -21601 -72800 -117966 -76185 28640 34309
580 34309 -24205 -43051 -3410 14120 23440 35675 51145 32530 18917 39915 77339 75834
568 75834 38021 -26550 -15332 41972 59732 27653 20054 -15118 -56675 -108417 -121261 -79288
556 -79288 -64241 -65798 -50999 -10707 9134 -492 -23414 -49132 -60666 -52430 -32810 -44735 -39167
543 -39167 -44279 -43332 -11158 -18183 -34725 -35318 -5747 -42955 -82081 -129262 -108778 -83750 -33374
530 -33374 -42240 -59309 -20271 8264 15832 7441 11027 20214 33327 418 -9192 -28366 -23557
517 -23557 -57223 -91411 -23222 -8432 21697 55309 46710 -4397 -23620 6550 -5034 3028
505 3028 5110 -7854 3272 2912 -17458 6003 13833 41683 72234 40393 1512 17217 41978
492 41978 80139 77488 -8557 -45975 -59923 -43351 -4415 -23291 -16218 26353 36397 23868
480 23868 31637 8218 43465 34698 26343 -2512 -3664 -42161 -2994 68221 104038 68875 -11324
467 -11324 8592 3036 -8174 46679 10018 -16127 38601 28963 10468 -9996 -56150 -64599 -45304
454 -45304 -66461 -103330 -101263 -92458 -71406 -47225 -7104 -30159 -20758 -34643 -46217 -53899 -59582
441 -59582 -85556 -88958 -59941 -10211 32991 -9599 -33991 -12244 -4691 -15681 -9495 -29275 -64821
428 -64821 -62174 -30338 -13682 -5198 -36050 -26520 -43958 -10542 24154 1247 -50613 -73186 -76665
415 -76665 -61711 -61841 -49920 -40851 -57211 -88173 -84517 -63374 9788 20314 -37460 -79008 -76818
402 -76818 -91365 -72187 -65522 -58835 -42635 12345 21299 16878 45307 50887 -8797 -5271 4923
389 4923 -13011 -63653 -51061 -14707 -1639 3990 33008 51899 34731 44563 24092 -1606 -20385
376 -20385 -7246 43773 92851 80930 32028 -19489 10881 28788 36491 23390 -24954 -77052
364 -77052 -32542 -55752 -44848 -41302 -99417 -109231 -47289 -34824 -30927 -31415 -49710 -43171 -33427
351 -33427 -58225 -96704 -95846 -73886 -120711 -110963 -107786 -76957 -45336 -73041 -118603 -144931 -159124
338 -159124 -121367 -68324 -57371 -62975 -92929 -35210 -7509 -662 57746 94939 25292 -30484
326 -30484 9375 1383 -7836 21289 17154 13780 11678 -2331 7992 -2249 -15852 -27596 -17657
313 -17657 -28136 -39974 -45060 -59473 -43326 -31457 -55338 -66038 -43730 -43998 -34941 -14596 2305
300 2305 40609 81073 70750 41991 44650 17334 5865 29207 -5286 -41129 -25417 -13940
288 -13940 -7042 18944 27788 21055 -6994 -48176 -54744 19107 39251 5361 -10666 -19944 12675
275 12675 3130 -10856 -50159 -58566 -1888 -1561 -54642 -61731 -40057 22934 44447 37321 71443
262 71443 69150 21312 -20954 -37216 -8912 -72672 -102880 -75182 -57453 -21310 21268 30987
250 30987 -27343 -24187 -4502 -7149 -38563 -111143 -145363 -104849 -87394 -111334 -68521 -26506
238 -26506 -36754 -42807 -47533 -20859 10796 -3271 -42724 -63326 -37589 30869 75357 56772
226 56772 74156 51460 20334 6091 -2475 -10395 -72331 -79280 -66761 -59488 -48723 -25708 3437
213 3437 34538 26355 24510 44289 7121 15255 -7781 -32515 -27041 -19446 -27249 -41430 -23171
200 -23171 -27689 -34147 -25177 8406 15786 1768 -13524 -40300 -50489 -51456 -67060 -98690 -104951
187 -104951 -104047 -113235 -112586 -72673 -22955 -14423 -66610 -91002 -78979 -112661 -83161 -22283 -34783
174 -34783 -20294 -5827 -34438 -53577 -33969 7946 41047 658 -24855 -33790 -12616 -7050
162 -7050 -11653 11392 3658 -12618 14744 -11647 -20140 -21948 -35182 -34121 -1867 41356 42516
149 42516 -4305 -6943 -53782 -32155 -70586 -115524 -90966 -43682 -15480 -17637 16609 50248
137 50248 20412 -19080 -54031 -38406 -23644 -3328 4716 -245 -6761 -27989 -14243 -44429 -74748
124 -74748 -96212 -69947 -68481 -102894 -108314 -88404 -77504 -81393 -63227 -72115 -34416 -5354 4255
111 4255 41712 18494 -86 -11128 -44803 -41132 -61079 -33837 -34265 -66848 -64173 -32653 -49045
98 -49045 -30601 -7418 -11317 -45546 -56421 -42825 -9827 4405 12186 16616 1350 -25317 -9652
85 -9652 18684 16937 -5828 -10362 17450 56942 35299 7643 -1062 -17993 -26365 -55562 -67048
72 -67048 -57309 -50106 -64613 -58564 -20731 19437 -22440 -35272 -50069 -26002 -29724 -42475 -29328
59 -29328 4249 -14248 -31323 -22000 -42776 -22146 -15514 -14532 -32080 -54321 -44711 -47637 -45936 -49500
45 -49500 -34365 -21892 -27940 -16733 -6114 -25509 -8676 -1111 -4673 7568 10960 -9006 -23093
32 -23093 -37462 -54908 -61135 -48793 -35797 -35202 -36458 -78472 -98756 -48355 -31021 -53445 -12636
19 -12636 -16527 -30666 -60242 -92406 -90615 -48676 -4053 -13957 -34365 -29254 -11846 1592 -23765
6 -23765 -30893 -18515 -16682 345 -24579 -47865
0 -47865
$$ Imaginary data points
##PAGE= N=2
##DATA TABLE= (X++(I..I)), XYDATA
32767 290101 325205 321953 260646 254032 253809 245634 260584 303094 293536 281878 287642 288297 299389
32754 299389 320400 332970 338457 354846 349331 355247 328192 320047 336528 330960 312122 287496
32742 287496 276098 267448 301433 349453 349834 344237 333557 329375 274483 288579 329906 318568
32730 318568 351648 400398 406940 380521 371226 341452 312906 294019 344794 394540 351275 305150
32718 305150 311504 295610 297475 335835 338993 360111 383496 405497 395189 368112 374583 359929
$$ [...]
##END NTUPLES=NMR SPECTRUM
##END=
