##TITLE=Analysis number a016872301
Compound Code sb 01274
Book Reference a016872301
Project Code qc-fl flro3
Chemist Name jom
##JCAMPDX= 6.0         $$ Bruker NMR JCAMP-DX V2.0
##DATA TYPE= NMR SPECTRUM
##DATA CLASS= NTUPLES
##ORIGIN= Bruker BioSpin GmbH
##OWNER= nmr
$$ XWIN-NMR		Version 3.5
$$ Thu Apr 12 09:08:54 2007 GMT Daylight Time (UT+1h)  MAYBRIDGE\nmr@NMR_250MHZ
##.OBSERVE FREQUENCY= 250.131544655141
##.OBSERVE NUCLEUS= ^1H
##.ACQUISITION MODE= SIMULTANEOUS (DQD)
##.ACQUISITION SCHEME= undefined
##.AVERAGES= 16
##.DIGITISER RES= 18
##SPECTROMETER/DATA SYSTEM= dpx250
##.PULSE SEQUENCE= zg30
##.SOLVENT NAME= DMSO
##.SHIFT REFERENCE= (INTERNAL, DMSO, 0, 16.522)
##AUDIT TRAIL= $$ (NUMBER, WHEN, WHO, WHERE, WHAT)
$$ ##TITLE= Audit trail, XWIN-NMR		Version 3.5
$$ ##JCAMPDX= 5.01
$$ ##ORIGIN= Bruker BioSpin GmbH
$$ ##OWNER= nmr
$$ C:\u/data/dgb/nmr/ADRS/1110/pdata/1/auditp.txt
$$ ##AUDIT TRAIL=  $$ (NUMBER, WHEN, WHO, WHERE, WHAT)
(   1,<2007-04-12 09:08:35.60 +100>,<MAYBRIDGE\nmr>,<NMR_250MHZ>,
      <created by zg, POWCHK disabled, PULCHK disabled
       configuration hash MD5:
       49 4B E0 1D 92 C2 6B 37 9F E6 65 BC 52 41 86 1D
       data hash MD5: 64K
       EB F8 C8 E9 F0 1A F5 98 C1 9F E8 86 F8 0F FE 34>)
(   2,<2007-04-12 09:08:46.84 +100>,<MAYBRIDGE\nmr>,<NMR_250MHZ>,
      <Start of raw data processing
       ef LB = 0.3 FT_mod = 6 PKNL = 1 SI = 32K 
       data hash MD5: 32K
       89 1D 71 20 8C 15 60 07 1B 81 89 66 7B CB 79 BA>)
(   3,<2007-04-12 09:08:48.51 +100>,<MAYBRIDGE\nmr>,<NMR_250MHZ>,
      <apk 
       data hash MD5: 32K
       94 C8 01 F8 FF FE C4 B6 0A 05 E7 BC 2C F2 12 16>)
(   4,<2007-04-12 09:08:49.20 +100>,<MAYBRIDGE\nmr>,<NMR_250MHZ>,
      <abs ABSG = 5 
       data hash MD5: 32K
       BA 3B 10 01 02 5F 03 D4 D4 C5 A2 BC 31 98 24 53>)
$$ ##END=
$$ 
$$ hash MD5
$$ FA 1E A1 F4 5F EE 56 BC 45 24 C5 1B 47 54 7A 67
##$RELAX= 
##$RELAX= 
##$RELAX= 
##$RELAX= 
##$RELAX= 
##$RELAX= 
##$RELAX= 
$$ Bruker specific parameters
$$ --------------------------
##$DU= <C:\u>
##$EXPNO= 1110
##$NAME= <ADRS>
##$PROCNO= 1
##$TYPE= <nmr>
##$USER= <dgb>
##$AMP= (0..31)
100 100 100 100 100 100 100 100 100 100 100 100 100 100 100 100 100 100 
100 100 100 100 100 100 100 100 100 100 100 100 100 100 
##$AQSEQ= 0
##$AQ_mod= 3
##$AUNM= <au_zg>
##$AUTOPOS= <50 >
##$BF1= 250.13
##$BF2= 250.13
##$BF3= 250.13
##$BF4= 250.13
##$BF5= 500.13
##$BF6= 500.13
##$BF7= 500.13
##$BF8= 500.13
##$BYTORDA= 1
##$CFDGTYP= 0
##$CFRGTYP= 5
##$CHEMSTR= <none>
##$CNST= (0..31)
1 1 145 1 1 1 1 1 1 1 1 1 1 1 1 1 1 1 1 1 1 1 1 1 1 1 1 1 1 1 1 1 
##$CPDPRG= <>
##$CPDPRG1= <>
##$CPDPRG2= <>
##$CPDPRG3= <>
##$CPDPRG4= <mlev>
##$CPDPRG5= <mlev>
##$CPDPRG6= <mlev>
##$CPDPRG7= <mlev>
##$CPDPRG8= <mlev>
##$CPDPRGB= <>
##$CPDPRGT= <>
##$D= (0..31)
0 1 0 0 0 0 0 0 0 0.06 0 0 0 0 0 0 0.0002 0 0 0 0 0 0 0 0 0 0 0 0 0 0 
0 
##$DATE= 1176365314
##$DBL= (0..7)
120 120 120 120 120 120 120 120 
##$DBP= (0..7)
150 150 150 150 150 150 150 150 
##$DBP07= 0
##$DBPNAM0= <>
$$ [...]
##$SUBNAM7= <"">
##$SUBNAM8= <"">
##$SUBNAM9= <"">
##$SW= 20.6930455092707
##$SWIBOX= (0..15)
0 0 3 0 0 0 0 0 0 0 0 0 0 0 0 0 
##$SW_h= 5175.983436853
##$TD= 65536
##$TD0= 1
##$TE= 683.16
##$TE2= 300
##$TE3= 300
##$TEG= 300
##$TL= (0..7)
0 120 120 120 120 120 120 120 
##$TP= (0..7)
150 150 150 150 150 150 150 150 
##$TP07= 0
##$TPNAME0= <>
##$TPNAME1= <>
##$TPNAME2= <>
##$TPNAME3= <>
##$TPNAME4= <>
##$TPNAME5= <>
##$TPNAME6= <>
##$TPNAME7= <>
##$TPOAL= (0..7)
0.5 0.5 0.5 0.5 0.5 0.5 0.5 0.5 
##$TPOFFS= (0..7)
0 0 0 0 0 0 0 0 
##$TUNHIN= 0
##$TUNHOUT= 0
##$TUNXOUT= 0
##$USERA1= <user>
##$USERA2= <user>
##$USERA3= <user>
##$USERA4= <user>
##$USERA5= <user>
##$V9= 5
##$VALIST= <valist>
##$VCLIST= <CCCCCCCCCCCCCCC>
##$VD= 0
##$VDLIST= <DDDDDDDDDDDDDDD>
##$VPLIST= <PPPPPPPPPPPPPPP>
##$VTLIST= <TTTTTTTTTTTTTTT>
##$WBST= 1024
##$WBSW= 4
##$XGAIN= (0..3)
0 0 0 0 
##$XL= 0
##$YL= 0
##$YMAX_a= 208959
##$YMIN_a= -288491
##$ZGOPTNS= <>
##$ZL1= 120
##$ZL2= 120
##$ZL3= 120
##$ZL4= 120
##$ABSF1= 16.522
##$ABSF2= -4.171173
##$ABSG= 5
##$ABSL= 3
##$ALPHA= 0
##$AQORDER= 0
##$ASSFAC= 0
##$ASSFACI= 0
##$ASSFACX= 0
##$ASSWID= 0
##$AUNMP= <proc_1d>
##$AZFE= 0.1
##$AZFW= 0.1
##$BCFW= 0
##$BC_mod= 0
##$BYTORDP= 0
##$COROFFS= 0
##$CY= 12.5
##$DATMOD= 1
##$DC= 0
##$DFILT= <>
##$DTYPP= 0
##$F1P= 14.0000005364418
##$F2P= -0.99999901652339
##$FCOR= 0.5
##$FTSIZE= 32768
##$FT_mod= 6
##$GAMMA= 0
##$GB= 0
##$INTBC= 1
##$INTSCL= 1
##$ISEN= 128
##$LB= 0.3
##$LEV0= 0
##$LPBIN= 0
##$MAXI= 10000
##$MC2= 0
##$MEAN= 0
##$ME_mod= 0
##$MI= 0
##$NCOEF= 0
##$NC_proc= -4
##$NLEV= 6
##$NOISF1= 0
##$NOISF2= 0
##$NSP= 0
##$NTH_PI= 0
##$NZP= 0
##$OFFSET= 16.522
##$PC= 1
##$PHC0= 223.3893
##$PHC1= 8.475289
##$PH_mod= 1
##$PKNL= yes
##$PPARMOD= 0
##$PSCAL= 4
##$PSIGN= 0
##$REVERSE= no
##$SF= 250.13
##$SI= 32768
##$SIGF1= 0
##$SIGF2= 0
##$SINO= 400
##$SIOLD= 32768
##$SREGLST= <1H.DMSO>
##$SSB= 0
##$STSI= 32768
##$STSR= 0
##$SW_p= 5175.98343685301
##$SYMM= 0
##$S_DEV= 0
##$TDeff= 65536
##$TDoff= 0
##$TI= <Analysis number 999999
Compound Code 99
Book Reference 9
Project Code 9>
##$TILT= no
##$TM1= 0
##$TM2= 0
##$TOPLEV= 0
##$USERP1= <user>
##$USERP2= <user>
##$USERP3= <user>
##$USERP4= <user>
##$USERP5= <user>
##$WDW= 1
##$XDIM= 32768
##$YMAX_p= 600482845
##$YMIN_p= -339081
$$ End of Bruker specific parameters
$$ ---------------------------------
##NTUPLES= NMR SPECTRUM
##VAR_NAME=  FREQUENCY,     SPECTRUM/REAL,   SPECTRUM/IMAG
##SYMBOL=    X,             R,               I
##VAR_TYPE=  INDEPENDENT,   DEPENDENT,       DEPENDENT
##VAR_FORM=  AFFN,          ASDF,            ASDF
##VAR_DIM=   32768,         32768,           32768
##UNITS=     HZ,            ARBITRARY UNITS, ARBITRARY UNITS
##FACTOR=    0.157963299565203, 1,           1
##FIRST=     4132.6476996994, 0,             0
##LAST=      -1043.33573715361, 0,           0
##MIN=       -1043.33573715361, -339081,     0
##MAX=       4132.6476996994, 600482845,     0
$$ Real data points
##PAGE= N=1
##DATA TABLE= (X++(R..R)), XYDATA
$$ [...]
23211A452054n7832j468J8575N697j8242M6008q628l5865l6213n3981m1929K0210
23199A288386r2401q2160n5546j4479K5232M6551k2901l4529L388J3604j8482
23188A056663J6099j509k0590M6010r2116p1980p1476N3056J4326j03434p4231
23177G50818L0211J1328k6466L0921L3668j6373r7505L0735M3143L7723J07760
23166I35963O1288n115J6921p2664j52930K1478K1376P0355j03025m6814n098
23155G41735J8268J1708n5914L478J5190q829k0120n1304L9531P0231P3697j07081
23143G30590j00246J930N3336l6736k1891L6393q0399J7332R4899j5336K236n2112
23131F29996m5594Q3107J04067R283m8381j4371k0952j8160l4423N7618Q3042
$$ plain form
23211 1452054 1394222 1392754 1411329 1417026 1398784 1444792 1436164 1400299 1364086 1310105 1268176 1288386
23199 1288386 1195985 1113825 1058279 1043800 1069032 1115583 1092682 1058153 1061541 1075145 1056663
23188 1056663 1072762 1071253 1050663 1096673 1004557 932577 861101 914157 928483 825049 750818
23177 750818 781029 792357 765891 796812 830480 814107 716602 747337 790480 828203 935963
23166 935963 997251 992136 1009057 936393 783463 804941 826317 896672 793647 746833 741735
23155 741735 760003 771711 715797 719275 734465 725636 705516 654212 693743 763974 837671 730590
23143 730590 630344 632274 685610 648874 626983 663376 582977 600309 695208 679872 682108 629996
23131 629996 584402 667509 771576 780859 732478 718107 697155 678995 644572 702190 785232
23120G85232r1634j47020q954N2333J7762o3874M4681K7429r2398n2390q2485
23109C88682R249P0783J4105J5631K2457j393J8300L4199j1771m8287n3557J6521
23097D74919O1717n4696Q920Q463j8650L027r288N8058j781L3540n76q74j428
23084E61351m2965n3641n6116o132R396N5827N6923o1866J1510N5191n3174M9563
23072E25867r001m6896j23382L152J11343L0696o0489n7886K2138j0015P2694
23061D58221K5377k421k3530M425N86P304j5428j7006K578K4664K3659P828m9211
23048D47046q6323p0873n8033Q1664J7330k1229r350J3963M0439k2666m0821J9515
23036C10662R9211Q2954k6405j03391m4595j2533k9472L8743N1234K5155o3480
$$ plain form
23120 785232 693598 546578 537624 589957 607719 543845 588526 615955 523557 471167 388682
23109 388682 397931 468714 482819 498450 520907 519514 537814 572013 560242 511955 458398 474919
23097 474919 536636 481940 490860 499323 480673 483700 474412 532470 530689 564229 563653 562779 561351
23084 561351 518386 464745 408629 402497 411893 467720 524643 462777 474287 529478 476304 525867
23072 525867 516866 469970 346588 349740 461083 491779 431290 373404 395542 385527 458221
23061 458221 483598 481177 457647 462072 462658 469962 454534 437528 440106 464770 488429 496257 447046
23048 447046 360723 289850 231817 313481 330811 309582 300232 314195 354634 331968 291147 310662
23036 310662 409873 492827 466422 363031 318436 305903 276431 315174 366408 391563 328083
23025C28083l3066n6201L4342N8991j01413n4708O2080K3124R4863M2424j12771
23014B85748q4521m108P8851L7386j57253m4606P1938J16098Q102p937n4671N0366
23002B95393J03819j1503j0684k6779j2178l9570l7721j4407o8709M834l0440
22991A52055M006O5935K6533J7521R026j9998m319M0905l783j13968m6057N37
22979A28393K4233k971k7396K2499Q3460j4653m8222l1120l4454M6913J4448p925
22967A53205O3267k3465m2054j5899N072k6032M9907K7195k8826k2160l5805Q4892
22955A89297R674o4130k4531j975k9845L79j2952K0059m35O5216P6632L6479l1816
22942B32052k543O3956k7059o1752j13219j7089j9804Q324L9969M0165j5895l5133
$$ plain form
23025 328083 295017 238816 273158 332149 230736 176028 238108 261232 356095 398519 285748
23014 285748 201227 197119 275970 313356 156103 111497 183435 299533 307635 299698 245027 295393
23002 295393 399212 387709 377025 350246 338068 298498 260777 246370 177661 182495 152055
22991 152055 156061 221996 248529 266050 275076 255078 250759 291664 287881 173913 127856 128393
22979 128393 152626 149655 122259 144758 228218 213565 165343 134223 99769 146682 161130 153205
22967 153205 216472 193007 150953 135054 140126 114094 164001 191196 162370 140210 104405 189297
22955 189297 198971 134841 110310 108335 78490 78869 65917 85976 85541 150757 227389 263868 232052
22942 232052 229509 293465 266406 204654 91435 74346 54542 62866 102835 143000 127105 91972
22930I1972q5664j0583M550j598O9679M8540l4600L1944Q6577j41j16481J6092
22918A00287J12328k7111r2310r499p796l2640N0390P6233J8216m7359l594l6480
22906A00665J4577K581j6185K0887k4311j2648j8619J6401J3908k0525o267P597
22894G8061J9411O6504k699P6130J4616M67m0007k7522k1082q9809q1380l2240
22882c9550N24O6042J5583M9528J32p0197J6088J0909j2990K3336j3425Q4961
22870A30941N5539M6363p0682j05358m875l8369l3859m6569P1892J06988J4018
22859A26029m1406Q0509J2744n068L4778q9281l0927K7374m9248o5182N4456n4124
22847F54m7041Q9181R6872L8845m6809L4888R022k4407K6768J5443m5366q628
$$ plain form
22930 91972 6308 -4275 275 -1323 68356 116896 82296 114240 200817 200676 84195 100287
22918 100287 212615 185504 93194 83695 75899 43259 93649 169882 188098 140739 137145 100665
22906 100665 115242 117823 101638 122525 98214 85566 66947 83348 97256 76731 70464 78061
22894 78061 97472 163976 161277 237407 252023 252490 212483 184961 163879 74070 -7310 -39550
22882 -39550 -39026 27016 42599 92127 92259 22062 38150 49059 36069 59405 45980 130941
22870 130941 186480 232843 162161 56803 51928 13559 -20300 -66869 5023 112011 126029
22859 126029 84623 165132 177876 172808 207586 118305 87378 114752 65504 322 54778 654
22847 654 -46387 42794 139666 178511 131702 166590 175612 151205 177973 193416 148050 139422
22835A39422j1305n8837Q2075m642o5372j38406k8235Q9170J13820M1981L7950
22824A97621m4578q2983j6298J9815M9187R5380L6148p8428p0039n5644j3613
22813C6568K0157k4011m4959l5745R3221J25128M3498J1614J7313k7750l2591
22802A82443K6600Q232j2461r5447o2641P8231M2692m9177o9167O2030n5149L0846
22790H7032M7651m6116k2121M5612p6885n8138L6833J07194O2161m084k3676j2796
22778A42667n0252n375L9418k6268J9443n4192q5007n2238l1723K4143M5211M2794
22766H621Q118R6194J2901M176L413K1731k289k7573q9436k4392O52r992K1383
22753B3507K3411o866j3974j5324P6902J491l7152m7414K4838m8285j9994p632
$$ plain form
22835 139422 128117 69280 151355 146713 81341 -57065 -85300 3870 117690 159671 197621
22824 197621 153043 70060 53762 73577 122764 218144 254292 175864 105825 50181 36568
22813 36568 56725 32714 -12245 -47990 45231 170359 213857 225471 242784 215034 182443
22802 182443 209043 217275 204814 109367 46726 124957 167649 118472 49305 111335 56186 87032
22790 87032 134683 88567 66446 112058 35173 -22965 13868 121062 183223 179139 155463 142667
22778 142667 92415 87040 126458 100190 119633 65441 -19566 -71804 -103527 -79384 -34173 8621
22766 8621 16739 112933 125834 130010 133423 155154 152865 125292 35856 11464 12116 2124 23507
22753 23507 46918 40052 26078 10754 87656 89147 51995 4581 29419 -18866 -38860 -46492
22741d6492P4578P167N4042J5019M8768N514m5540p6509J7408K1339M3340L2106
22729A50740o1385j3901n6668K8182k7688K9985L574M6685k8111o3805j5963k143
22717a0498k4962N651M4395P4821N0628j9789l7334p4929l7303N795O086K6062
22705H623J29044P1418q7363r2560n624K3483M775o5729K4589L0535r558j2519
22693A9114m1157R2088P2377l5429r166o7747r1448K2889N7541p1462M2172k0546
22681c0774M7807M8626N0743n5373n9710M8364J9214r403J3527m8388M3319M7456
22669A15408n2981J2538n7289K162P5106J2102R813o252p8579j1571J35750J07466
22657B63673q3350q0392m0307r746P7992n191j19776L4553L433L9358n3451q9378
$$ plain form
22741 -46492 28086 35253 89295 104314 153082 158596 113056 36547 53955 75294 118634 150740
22729 150740 89355 75454 18786 46968 19280 49265 52839 99524 71413 7608 -8355 -10498
22717 -10498 -35460 -29809 14586 89407 140035 120246 82912 7983 -29320 -23525 -17439 8623
22705 8623 137667 209085 121722 29162 23538 47021 51796 -13933 10656 41191 31633 19114
22693 19114 -22043 70045 142422 106993 97827 30080 -61368 -38479 19062 -52400 -10228 -30774
22681 -30774 17033 65659 116402 61029 1319 49683 68897 59494 73021 24633 67952 115408
22669 115408 62427 74965 17676 19838 94944 107046 116859 110607 32028 20457 156207 263673
22657 263673 180323 99931 59624 49878 127870 122679 2903 37456 40889 80247 26796 -62582
22645f2582N1350O2639l2824j3106j2469P1725R227K8684n3203m8979o5200O3913
22633h25n2548J9344N7842P292N7159M3759j1933l8077N5371J7089j0910o8074
22621G5489j50106q8014N7230O8111m9252j6005O7748J6562m6580j464K5810O5371
22609B4900N1121k0619n0700r5136m9087j588j8338k0784N9653N1732L9680N003
22597b4163o9738k419L1818j5229n9556Q1028Q9524K1971m7021P3418N5548j2348
22585A22833j31551m180J5850k6185M4868j9908l835M3920l5995P0125N4325l2037
22573I8230K9033L8028r3482l5781j4628r0697P0536J2510r657l2062m5341j818
22561g5129R8574M2664J4256J8374L4876o449l9614m4147m2940p4093n5623j106
$$ plain form
22645 -62582 -11232 51407 18583 5477 -6992 64733 73960 102644 49441 462 -64738 -825
22633 -825 -53373 -34029 23813 31105 88264 132023 120090 82013 137384 154473 143563 75489
22621 75489 -74617 -162631 -105401 -37290 -86542 -102547 -34799 -18237 -64817 -66281 -40471 24900
22609 24900 76021 55402 4702 -90434 -139521 -141109 -159447 -180231 -120578 -68846 -29166 -24163
22597 -24163 -93901 -96320 -64502 -79731 -139287 -58259 31265 53236 6215 79633 135181 122833
22585 122833 -8718 -12898 2952 -23233 21635 1727 -2108 41812 5817 75942 130267 98230
22573 98230 127263 165291 71809 36028 21400 -69297 1239 13749 4092 -27970 -73311 -75129
22561 -75129 23445 66109 80365 98739 133615 127166 87552 43405 465 -73628 -129251 -130357
22549a30357K9695N2760P7785j3366j08307J3394J054r064J2505J7814l7286n2123
22537a45496J5196J44o643J5931Q4499N8412k7448J3019M6142j5321N4557k7055
22525F5937j43951r3496J5773Q207K9147L0566R488J20578N2688m0938k4492M9058
22513G8565o0566r7822K6186K2682J2535M6754L9826o3264l1420Q119M7879o5244
22501c5770j3128J2723O3569o26M7414p6477j712M7598k1535r3442o3208L9677
22489i4917k5940r8488K4503J30509n9623q7597L0884K2073l5524O4056J7179
22478a12885K6121o204j1035N7816M9178L3208L4097Q22q5059m5591o005P8028
22466A2491k2514m6345m1962k4311N4068P156k1303n226l4685M9584O5808k4996
$$ plain form
22549 -130357 -100662 -47902 29883 16517 -91790 -78396 -77342 -86406 -73901 -56087 -93373 -145496
22537 -145496 -130300 -130156 -136799 -120868 -36369 22043 -5405 7614 53756 38435 92992 65937
22525 65937 -78014 -171510 -155737 -147530 -118383 -87817 -78329 42249 94937 53999 29507 78565
22513 78565 17999 -79823 -53637 -30955 -18420 28334 68160 4896 -26524 -18405 29474 -35770
22501 -35770 -48898 -36175 27394 26768 74182 -2295 -4007 43591 22056 -71386 -134594 -94917
22489 -94917 -120857 -219345 -194842 -64333 -123956 -211553 -180669 -158596 -194120 -130064 -112885
22478 -112885 -86764 -92968 -104003 -46187 2991 36199 70296 71118 -13941 -59532 -65537 12491
22466 12491 -10023 -56368 -98330 -122641 -68573 -61417 -82720 -87946 -122631 -73047 -7239 -32235
22454c2235q545l6982K3025m5012j4650m0582L5732j6562K1499N7335Q0182N8858
22442H2063O9140k565n5175l802Q860p9084r2380o5212K1235J14219j2627j1141
22430b6469K0935J0697J3060r0975K1172Q3808m5160K9729J0110l2907q9398m377
22418i9775P7504O4720q307M1616O5062m2552l3512l8998o6336n777m596J09224
22406E8273k3099r1052j457J947L1536J4815P6431M3900n2748o0692J2158k1811
22394a1799N6671j1393j6517k8035L3948J3507R458m3528J8919o5811r4873K9804
22382a09649J4940O520M3558P9964J1930m2006l6604N6491j5820k8934P1929K7631
22370G9950J3018M1259k6533j08467n2742Q2625L2877p7036q431l5149L9063M6707
$$ plain form
22454 -32235 -40780 -77762 -54737 -99749 -114399 -154981 -119249 -135811 -114312 -56977 23205 82063
22442 82063 151203 148638 93463 89661 98521 19437 -72943 -138155 -116920 -2701 -15328 -26469
22430 -26469 -5534 5163 18223 -72752 -51580 32228 -12932 16797 26907 -6000 -95398 -99775
22418 -99775 -22271 42449 34142 75758 140820 98268 64756 25758 -40578 -46355 -50951 58273
22406 58273 35174 -55878 -57335 -55388 -23852 -9037 67394 111294 58546 -2146 10012 -11799
22394 -11799 44872 33479 16962 -11073 22875 36382 45840 2312 21231 -44580 -139453 -109649
22382 -109649 -94709 -88189 -44631 35333 47263 5257 -31347 25144 9324 -19610 52319 79950
22370 79950 92968 134227 107694 -773 -53515 29110 61987 -15049 -23480 -58629 -19566 27141
22358B7141L6554L2708o426j2884n3269o4931N5836j1558j0808J06529M7995p4895
22346G1992p2331N4103M6194J9375K5297j13827l8396J5015J7289M2709O573n6402
22334A7591K6382O7373j30875o0010J0341L7552R81N596M6578M3325K0627J05067
22322A90528L4137k2588j12609n3355j8968J5152L4546L5844o355j18552l5001
22311e7221p2379k102J28423j5968k6344J0170N2247j1933o0655K1140m4560K5572
22299e3610O5064L0388O6704K9260j7271q672p2794p4046r677l5200P6794J899
22287a161P6280J14614N6731n1943j28648j8577N7987O064j21890N3925K8774
22276G2156J7072l1517n1531J6931J4890j8713J2709P8524l2141j06481N2123
$$ plain form
22358 27141 63695 96403 89977 77093 23824 -41107 14729 3171 -7637 98892 146887 71992
22346 71992 -339 53764 99958 119333 144630 30803 -7593 7422 24711 67420 73993 17591
22334 17591 43973 111346 -19529 -79539 -69198 -31646 -30665 -25069 21509 64834 85461 190528
22322 190528 224665 202077 89468 36113 17145 32297 66843 102687 96332 -22220 -57221
22311 -57221 -129600 -131702 -3279 -19247 -45591 -35421 16826 4893 -55762 -34622 -79182 -53610
22299 -53610 11454 41842 108546 137806 120535 111863 39069 -34977 -44654 -79854 -3060 -1161
22287 -1161 75119 189733 246464 194521 65873 47296 105283 111347 -10543 43382 72156
22276 72156 89228 57711 6180 23111 38001 19288 31997 110521 78380 -28101 24022
22265B4022K2078L2610m0951j08723o1354j3364J6708J8636K8350k1947J4397
22254h9538j764l2743L0481Q2086k5106k3098k9599K6207K2739n819J3093j9109
22242e2170J0078R1684k0471m4237n878N4078R269o1979r501n684O8258K743o387
22229B9803l5943l9047L078K4730m0907n7700l9179N1121J3885R235l8740k2870
22217a42534J7809j205M9169L2807P2644K5951k7329L1275R866o119r8634p2129
22205a08429Q0226K1316L6846J6928j6570m7662p9109K0344K5080J0995j9807
22194e9842l5773J12647k4189J6784J7250j1983l1775O6571N1084l5685o0874
22183D215o0988N0988J0439l4218N501Q1796N7671j2671r0484j5976J6050N7035
$$ plain form
22265 24022 46100 78710 37759 -70964 -132318 -145682 -128974 -110338 -81988 -103935 -89538
22254 -89538 -91302 -124045 -93564 -11478 -36584 -59682 -89281 -63074 -40335 -46154 -33061 -52170
22242 -52170 -42092 49592 29121 -15116 -20994 33084 42353 -19626 -29127 -34811 33447 36190 29803
22229 29803 -6140 -45187 -42109 -17379 -58286 -115986 -155165 -104044 -90159 -80924 -119664 -142534
22217 -142534 -124725 -125930 -76761 -43954 28690 54641 27312 58587 68453 62334 -36300 -108429
22205 -108429 -28203 -6887 29959 46887 30317 -17345 -96454 -76110 -51030 -40035 -59842
22194 -59842 -95615 17032 -7157 9627 26877 14894 -16881 49690 100774 65089 4215
22183 4215 -56773 -5785 4654 -29564 -24063 57733 115404 102733 12249 -3727 12323 69358
22171F9358K1773K8220n7507L0052k6006m3025O4264K6652K484k8127j1295N5406
22159A32249L8300q9231p6523m0483N5918J9326l0183q5191J737N8566N8449l200
22147C9734j24983J8667P0962k7555J0948j1862L4940l6125o0438o522K7554O9284
22135D604L3181o5997m8270k9424l0037m9768J21201J26964P773q2988j6430n4702
22123h3893P77Q5533L4022m3749N9101m0522r7608L0452P5680O891k5096L8060
22111C9648L2019L2939M1391L8437k2920n7266p2445p8233k679l0714N9511R0098
22099F9786n1775P0918N2137L5709p9408m9221q5780L7865J4207l5308j7193J2527
22087b5536L9748k6153k25J4578l5939O913J2836M7078L1561O069p451J5327m8289
$$ plain form
22171 69358 91131 119351 61844 91896 65890 22865 87129 113781 116265 88138 76843 132249
22159 132249 170549 81318 4795 -35688 20230 39556 9373 -75818 -74081 -15515 42934 39734
22147 39734 -85249 -66582 4380 -23175 -12227 -24089 10851 -25274 -85712 -92234 -64680 4604
22135 4604 37785 -28212 -76482 -105906 -135943 -185711 -64510 62454 70227 -12761 -29191 -83893
22123 -83893 -83116 2417 36439 -7310 51791 11269 -86339 -55887 19793 26684 1588 39648
22111 39648 71667 104606 145997 184434 161514 104248 31803 -46430 -49109 -79823 -20312 69786
22099 69786 18011 88929 141066 176775 97367 48146 -37634 231 14438 -20870 -38063 -25536
22087 -25536 14212 -11941 -12166 2412 -33527 -26614 -13778 33300 64861 70930 63479 78806 30517
22074C0517k7493j5635M3705k7171j25406j6281J12m019J36628J06051N6813L9180
22062A97001L889p5470j16179n5124l838k001K9949K0021J3753J7643j0755j16790
22050i7901O2063J0827O761K8965o3892J9613q549j9397J02008O1859o4779k0431
22038A7147n3597J230j03984j9861P4664J10767q0545l1196J6125J03191N7266
22027I1207o3882l5586J4136O0719k0063m7843J522M452R359Q1011l416k9980
22015F1636j4575J3153J8500O0128q9870j25433n5088q531N6644J8205n3348k57
22003a18836N2297Q0206l1860m3102J9553R5398L8205k360p202p2847k0685k5123
21991c6356L9968k4422L2567K081l1269k803K3482J0303R2684m7869L3483k1254
$$ plain form
22074 30517 3024 -12611 31094 3923 -121483 -137764 -137652 -141671 -5043 101008 157821 197001
22062 197001 200890 125420 9241 -45883 -49721 -51722 -21773 -1752 12001 29644 18889 -97901
22050 -97901 -35838 -25011 -18250 10715 -53177 -33564 -42113 -61510 40498 102357 37578 17147
22038 17147 -36450 -35220 -139204 -159065 -84401 26366 -54179 -85375 -69250 33941 91207
22027 91207 27325 -8261 5875 66594 46531 -1312 210 4662 14021 95032 91616 61636
22015 61636 47061 60214 78714 138842 48972 -76461 -131549 -140080 -83436 -65231 -118579 -118836
22003 -118836 -66539 13667 -18193 -61295 -41742 53656 91861 89501 82299 9452 -11233 -36356
21991 -36356 3612 -20810 11757 13838 -17431 -20234 3248 13551 106235 58366 91849 70595
21979G0595m0852K4435M4606K2690j04134l0447j4211L9461M3989N9147R5617
21968B10896q5424j24481q3963o7927O1580N5558N4200r99p3342p0474R284P7812
21956c7280J1369k2537L3384O4156N6830l1277l1967p916p466N5734n4496J128
21944B9662R4751q7425j2389M254k8955j24429m8313Q0859K7098n0688R296M0607
21932f5672K6557q859K4875J4781n2049j51315M607R1868L5310J30692J283r3226
21920d1148M9234l4987m6373J7354O1882n989L5617j3192p5756l6788k8644N7814
21908f0976l8051K5936O9790k6915r185p066L5599M8786q737l1106r500o2412
21896g3837J6664Q7542l8400k6919r3225M5393N7123L8121J2200k6860O9359L0734
$$ plain form
21979 70595 29743 54178 98784 121474 17340 -13107 -27318 12143 56132 115279 210896
21968 210896 125472 991 -82972 -150899 -89319 -33761 20439 19440 -53902 -124376 -115092 -37280
21956 -37280 -25911 -48448 -15064 49092 105922 74645 42678 34762 27296 83030 28534 29662
21944 29662 124413 36988 24599 28853 -102 -124531 -172844 -91985 -64887 -115575 -106279 -65672
21932 -65672 -39115 -47974 -23099 -8318 -60367 -211682 -207075 -115207 -79897 50795 52078 -41148
21920 -41148 8086 -26901 -73274 -55920 5962 -27 35590 22398 -53358 -90146 -118790 -60976
21908 -60976 -99027 -73091 -3301 -30216 -39401 -46467 -10868 37918 29181 -1925 -11425 -73837
21896 -73837 -57173 30369 -8031 -34950 -128175 -82782 -25659 12462 24662 -2198 67161 97895
21884I7895j4724J6447j880k8895j4661p5360k6658P2977O6800l5482j10352n6370
21872a10263O0103Q554M9040L2730l8731R544K1782M8183N9958M4957L1284j17896
21860I9245q4485l4125o8463J7214M1235J4740k8042j2227J01115K0727r982k4726
21848C2226J4890m7691m1494O6426J4969q1003l2409k6264L8887n027M2340n235
21836b9385K050j4076l014M7933N3505M2912o9372o1020M200j058N7981j5906
21824A4750q0897M0499J10597J7655n4082j12689o9281K2066K2109M4337L7743
21813g193N2297J1402k5916K6045j6584l6754p9837k2646P9201J18796k3680q2633
21801g502j4670m552O063l266q321j8673j9603n8437P6669N6076m8778o657r331
$$ plain form
21884 97895 83171 99618 97738 68843 54182 -21178 -47836 25141 91941 56459 -53893 -110263
21872 -110263 -50160 -41606 7434 40164 1433 10977 32759 80942 140900 185857 217141 99245
21860 99245 14760 -19365 -87828 -70614 -29379 -14639 -42681 -54908 46207 66934 56952 32226
21848 32226 47116 -575 -42069 24357 39326 -41677 -74086 -100350 -61463 -66490 -24150 -29385
21836 -29385 -27335 -41411 -44425 3508 57013 99925 30553 -30467 -26267 -27325 30656 14750
21824 14750 -66147 -25648 84949 102604 48522 -64167 -133448 -111382 -89273 -44936 -7193
21813 -7193 45104 56506 30590 56635 40051 3297 -76540 -99186 -19985 98811 75131 -7502
21801 -7502 -22172 -26724 -20661 -23927 -32248 -50921 -70524 -128961 -52292 3784 -44994 -51651 -60982
21788f0982o12L9519P358n4015n3994j3831P5323Q5340J0731O0928n9760o1434
21776b5429J7632K1971k5191l3715l1277J412R8973R2098j2876l4965p1134o988
21764i489J03357j3485p6572j610m0591m1485Q1082Q8070L935m420p896p8230
21752B666o0319L4572N5347K5852n5951m2980J8286L8738l0755J7467j1997r7326
21740a06400m0768L7251O1351Q3415K0919o6051L309Q325M6131K7398N3521M7102
21728A75503p210j40463l8196m271o0050m2920P4755J9018N7550k3562O215L2893
21716D9262p0649m9075q6880N1367J9622p621N3472n4007L0305J2655L2605n5896
21704g4840K177l7443J5303j4428J1136L2149M4052J13598M0351q9216r9729m8016
$$ plain form
21788 -60982 -61594 -22075 -14717 -68732 -122726 -136557 -61234 24106 34837 95765 36005 -25429
21776 -25429 -7797 14174 -11017 -44732 -76009 -74597 24376 116474 103598 68633 -2501 -9489
21764 -9489 93868 80383 3811 2201 -38390 -79875 1207 89277 93212 88792 80896 2666
21752 2666 -57653 -23081 32266 58118 2167 -40813 -22527 16211 -14544 2923 -9074 -106400
21740 -106400 -147168 -109917 -48566 34849 55768 -10283 -6974 1351 47482 74880 128401 175503
21728 175503 168293 27830 -10366 -14637 -74687 -117607 -42852 -23834 33716 10154 16369 49262
21716 49262 -21387 -70462 -157342 -105975 -86353 -93974 -40502 -94509 -64204 -51549 -18944 -74840
21704 -74840 -72663 -110106 -94803 -109231 -98095 -65946 -21894 91704 132055 42839 -56890 -104906
21692a04906k7053q09M6606N4875J1547j2393p5685O6673P0669n1220m5736q162
21680g5594O7052L7643l253l9846j0842n0858J040L7640l2175n2272j6903l0343
21668a68711k9598P5233L5120M2588J44521J9790m3128M156l5132p8301r5937
21657a29399m2505J548R2488M6452K0939J1630j9584j6364m3983j03178l497Q8334
21645i7119L6781l2427J858R342M4144P106o2107n093Q0652L1207o356k9367J2892
21632h487l2496K7611M0114K6310n4928L1613j4987j26982L083m258L755L1467
21620g8185Q5148J1148j3921m2452R196O6256M1044p7124j03058p9644O482N2595
21608a22515J17806m0561n0350N1454K168N5671N157L9668N2465M39n0881j5256
$$ plain form
21692 -104906 -131959 -132768 -86162 -31287 -19740 -32133 -107818 -41145 29524 -21696 -67432 -75594
21680 -75594 -8542 29101 25848 -13998 -24840 -75698 -74658 -37018 -69193 -121465 -138368 -168711
21668 -168711 -198309 -123076 -87956 -45368 99153 118943 75815 79971 44839 -33462 -129399
21657 -129399 -171904 -170356 -77868 -31416 -10477 1153 -18431 -34795 -78778 -181956 -185453 -97119
21645 -97119 -60338 -92765 -90907 -81565 -37421 -30315 -92422 -97515 -16863 14344 7988 -21379 -8487
21632 -8487 -40983 -13372 26742 53052 -1876 29737 14750 -112232 -109149 -113407 -109652 -78185
21620 -78185 6963 18111 4190 -38262 -29066 37190 78234 1110 -101948 -181592 -175110 -122515
21608 -122515 -4709 -45270 -95620 -44166 -41998 13673 18830 58498 110963 111402 60521 45265
21596D5265k2200K938J08892P1002q2765n8633n4117j48407K7534M4081L0863
21585c5547K5831L8027n4543k8906J3138n8632k4271J08652R81l9563p9941k640
21573a37414L4482R5910M6165o8647L929P4456q369n8822p3836p6465o2944J0837
21561b20718Q2282N8311L6092n7019K386M3061l2824l1260k2981j5046O0739R7219
21549B42l4735n8048M3805M5808m2425p8457M7897M0994K1956j8839k2788P3302
21537A8712R1742j6897j55306m4887j00103N666J13062q433L6559J2934Q6575
21526C9624j072q6930J4183P8262n0921m1655K4351J18910O2819m2303O977K1279
21514A43524J15J9910k1444j33566j50293M9234O0394M6042Q4017J7145p7295
$$ plain form
21596 45265 23065 26003 134895 205897 123132 64499 10382 -138025 -110491 -66410 -35547
21585 -35547 -9716 28311 -26232 -55138 -42000 -100632 -124903 -16251 -15270 -54833 -134774 -137414
21573 -137414 -102932 -7022 39143 -29504 -25575 48881 40512 -18310 -92146 -168611 -231555 -220718
21561 -220718 -138436 -80125 -44033 -101052 -98666 -55605 -88429 -119689 -142670 -157716 -96977 242
21549 242 -34493 -92541 -48736 -2928 -45353 -123810 -75913 -34919 -12963 -31802 -54590 18712
21537 18712 110454 93557 -61749 -106636 -206739 -201073 -88011 -96444 -59885 -46951 39624
21526 39624 38552 -48378 -34195 44067 -6854 -48509 -24158 94752 157571 115268 122245 143524
21514 143524 143639 163549 142105 8539 -141754 -92520 -32126 13916 97933 115078 37783
21503C7783L9239O3863r7383k5250J3337k4309K2006o5101K0384J06631J7665
21492A08865p4045k6190K1779k9325q70q679j3175K3481m1403J12142n6038k16887
21480b00345k4559J07612J16195J37777N6584j2689j10407p7636j6128k7400O5782
21469A4786J44470q4840j42927m0976J5190n8740j4538M2855L9561K0621j0523
21458g5061L638k05J5579P1217M4124j9645L1814l6902n9491M518k5187q5907
21446a31508J4030M7219M5788l8456L5669P3911J12801N0708k2933n7484N261
21435A35006n8560J4397o2235J3938R7204K431K9302m791l6944j9654J0510j00530
21423B0074r1571k2883L7725K8386l030J10077P2736K0673j08728l9477P198j5879
$$ plain form
21503 37783 77022 140885 43502 18252 31589 7280 29286 -35815 -15431 91200 108865
21492 108865 34820 8630 30409 1084 214 -8465 -21640 1841 -39562 72580 16542 -200345
21480 -200345 -224904 -117292 -1097 136680 193264 180575 70168 -7468 -23596 -50996 14786
21469 14786 159256 74416 -68511 -109487 -94297 -153037 -167575 -124720 -85159 -64538 -75061
21458 -75061 -71423 -71628 -56049 15168 59292 39647 71461 34559 -24932 -20414 -45601 -131508
21446 -131508 -117478 -70259 -24471 -62927 -27258 46653 159454 210162 187229 129745 135006
21435 135006 76446 90843 28608 42546 139750 142181 171483 166692 129748 110094 120604 20074
21423 20074 -71497 -94380 -56655 -28269 -31299 78778 151514 172187 63459 23982 31180 15301
21411A5301j9826K6117K4050l6180k7143K3262N2242k1654L1930O3057o2984j05351
21399c7179m4759K3806o9459n311L6078n5633K616R4485J08476K2199j24035r6095
21387a44811K368R194N4007l37j7010J02001M8004k5687n5907L3652k9660j909
21375b6095q501R198J848n2060o3872k8084J4068J7840P2669L0976K8624j1509
21363a4898M5192J8346N1413j9077n7533q8684r4257J4323J7457L8417K335j9020
21351a05986R889M2142K3400n3391L100m5637Q0469L1438m1288J1590L9572M7602
21339D2900N8081J7989j0548r6439j35445P0718Q7846N6154R681m2122k1691J6284
21327E3408j1264n9901m0996N409j5678m1119K2961l5189K691L0821q844L0438
$$ plain form
21411 15301 -4525 21592 45642 9462 -17681 5581 57823 36169 68099 131156 68172 -37179
21399 -37179 -81938 -58132 -127591 -132902 -96824 -152457 -149841 -55356 53120 75319 -48716 -144811
21387 -144811 -142443 -133249 -79242 -79579 -96589 5412 53416 27729 -28178 5474 -24186 -26095
21375 -26095 -34596 -25398 -23550 -75610 -139482 -167566 -153498 -135658 -62989 -32013 -3389 -14898
21363 -14898 30294 48640 100053 80976 23443 -65241 -159498 -145175 -127718 -89301 -86966 -105986
21351 -105986 -96097 -53955 -30555 -83946 -80846 -126483 -46014 -14576 -55864 -44274 -4702 42900
21339 42900 100981 118970 108422 11983 -123462 -52744 35102 91256 100937 58815 37124 53408
21327 53408 42144 -17757 -58753 -53344 -69022 -110141 -87180 -122369 -119678 -88857 -97701 -67263
21315f7263M0306j9604n5109L9897j1513m9296l7782K9577O4337O3411R3859Q8645
21303A79465J0153j07522n6883q053K8982l3712N9851q8712r7062K1509M3931
21292d8053k9076P1264k5592j37794P596K3516L4460J23586K4758k3360J8483
21281C9788p7445L2261Q8436j1855L1621m0650l6709r008L7205m6233l6278n0398
21269g9265J359M6617M1541L8311k4424o3270n0981L9116m9130n7126k4439O8410
21257a13281L1023R6094K7120p7504j8910m586n4176j0525J9045J4027j3433m7843
21245a52949q821O3194M8940q926l7292N4054J4198j1930K780o524k9448O355
21233f6369O6070l5485j11978Q6587M0679m1106L1260L8549k1699n2501N904K9648
$$ plain form
21315 -67263 -26957 -46561 -101670 -61773 -73286 -122582 -160364 -130787 -66450 -3039 90820 179465
21303 179465 189618 82096 25213 17160 46142 12430 72281 -16431 -113493 -91984 -48053
21292 -48053 -77129 -5865 -31457 -169251 -161655 -138139 -103679 19907 44665 21305 39788
21281 39788 -37657 -5396 83040 71185 102806 62156 25447 16439 53644 7411 -28867 -79265
21269 -79265 -77906 -31289 10252 48563 24139 -39131 -90112 -50996 -100126 -157252 -181691 -113281
21257 -113281 -82258 13836 40956 -36548 -55458 -60044 -114220 -124745 -105700 -91673 -105106 -152949
21245 -152949 -161770 -98576 -49636 -58562 -95854 -41800 -27602 -39532 -36752 -43276 -72724 -66369
21233 -66369 -299 -35784 -147762 -61175 -20496 -61602 -30342 8207 -13492 -65993 -60089 -30441
21221c0441M7767O4186j0854k382j08895R346N4997L833n3171p3763K0058O4463
21209a4856O0438K3536O2825l4381r7936o9845k1822l5003j887N7461J4321L5937
21197b1212P6072n2619j10410Q1727O4011m057m7486l9315k6925L7624m7966p8529
21185a69085O25M8118P2830J6652L1163K9180k0227J853Q3990J0033n1840p815
21173D5477k3745K1839J8044j71k5241Q977N130k1028M9442q886j0758L0211r7177
21160g886O979P5134p5790l379K2330L0012n7471m1305l741K9323q502J8645j13349
21147a29000m5884N550N3747R4789p3500n829P6468O5513L0399k1625n098k4619
21135B0911K9712K3592n1167n6551J426O9033J0597k4793n3889m0820m782N6431
$$ plain form
21221 -30441 17326 81512 70658 68276 -40619 -31273 23724 27557 -25614 -99377 -79319 -14856
21209 -14856 45582 69118 131943 97562 -374 -70219 -92041 -127044 -128931 -71470 -57149 -21212
21197 -21212 54860 2241 -108169 -26442 37569 33512 -13974 -53289 -80214 -42590 -90556 -169085
21185 -169085 -168460 -120342 -47512 -30860 303 29483 9256 11109 95099 105132 53292 45477
21173 45477 21732 43571 61615 61444 36203 45180 50310 29282 78724 69838 59080 89291 -7886
21160 -7886 -907 74227 -1563 -4942 17388 47400 -10071 -51376 -55117 -25794 -34296 -15651 -129000
21147 -129000 -174884 -169334 -115587 -20798 -94298 -100127 -23659 41854 72253 50628 45530 20911
21135 20911 50623 74215 23048 -33503 -32077 36956 47553 22760 -31129 -71949 -76731 -20300
21123b0300m2369n0130O6493N2531J6180M2090J4703N5306m1615q5137r7737k5845
21111a15830Q3670J4944J3879O8736n3157l8068L2131O1892L6951r630p4074j7953
21099C491L8114K3833k1101m1860K4006k5907M1646J8375k3101j3855o0223p02
21087c7284L5472L4383p3764j8828K4643k4506j4771q9110K9115P9931q317k6257
21075h9293j4241L3520K0261J10497L3103m5293n8959j6202J7322O7395Q0972
21064A39082p9183l0008m3216p1028K6909Q7735j8255o0216m0941L1371L5786
21053b1964l365J3812K6097o5005K1722M8342J3264j5060q3493j7482j8307J4094
21041h7345L1578n7191K8216L1001J1493O5688q467l4779K2214O3706k5738m8818
$$ plain form
21123 -20300 -62669 -112799 -46306 6225 22405 64495 79198 134504 92889 7752 -89985 -115830
21111 -115830 -32160 -17216 -3337 65399 12242 -25826 6305 68197 105148 95518 21444 3491
21099 3491 41605 65438 44337 2477 26483 576 42222 60597 37496 23641 -36582 -37284
21087 -37284 -1812 32571 -41193 -60021 -35378 -59884 -74655 -163765 -134650 -54719 -63036 -89293
21075 -89293 -103534 -70014 -49753 60744 93847 48554 -10405 -26607 -9285 58110 139082
21064 139082 59899 29891 -13325 -84353 -57444 30291 12036 -48180 -89121 -57750 -21964
21053 -21964 -25329 -11517 14580 -50425 -28703 19639 32903 17843 -65650 -83132 -101439 -87345
21041 -87345 -55767 -112958 -84742 -53741 -42248 23440 14973 -19806 2408 66114 40376 -8442
21029h442J1220j2547N189k1392K8818Q719o3528P747K4508l9444L950N4995j4620
21016a4827n2384r8775K9364J05367J9375r4090l4923J47627M1354n0722n6146
21005e8780k6181M8944L2739n4547J1033K3081P8483K7267j09544n5256n9962
20994a42723P2151J16160O0512k3064p9483O5190L6029p1067k7628J9236M2555
20983F7868n9674m0506P7519k8212j5360N319k8246j4088m928j6617J1136M2752
20971c037O4331o0325q1588m8727L5905r807K8754P3427J6041q85r4L4879j6674
20958C2200J7038N8015K3294m6633K1508m2664o8116O501l1670K5361k386k0148
20946b7700n6895J6294J3311J800J9863j3904Q167K6449N3652m64j7723N137R1382
$$ plain form
21029 -8442 2778 -9769 -4580 -25972 2846 11565 -51963 -44216 -19708 -59152 -55202 -207 -14827
21016 -14827 -67211 -165986 -136622 -31255 -11880 -105970 -140893 6734 48088 -2634 -58780
21005 -58780 -84961 -36017 -3278 -57825 -46792 -23711 54772 82039 -27505 -82761 -142723
20994 -142723 -70572 45588 106100 83036 3553 68743 104772 33705 6077 25313 67868
20983 67868 8194 -32312 45207 16995 1635 6954 -21292 -35380 -40308 -56925 -45789 -3037
20971 -3037 61294 969 -80619 -129346 -93441 -103248 -74494 -1067 14974 14089 13995 48874 32200
20958 32200 49238 107253 130547 83914 105422 62758 -5358 1143 -30527 -5166 -7552 -27700
20946 -27700 -84595 -68301 -54990 -53190 -33327 -47231 -39064 -12615 41037 40573 22850 27987 119369
20933A19369n3040q5055k8030N5044J4803m3356o184K599o2206l0941k3843K8572
20921a12268R8774j4619j9368l8081j8555K958J37962M9105p1113L4833n5503
20910e875q5905j6087Q1605M1014q6810j11284j1949Q7842J9930K4594K3840L2280
20898f805K8365L0983p2404l9244j0435M0352L2163K4002m5239l9079K801l2608
20886h7148j0713O3378j657o001j8152m896k2926R902O7539P7021p2190j27856
20874a33699n5635P1492Q8598o6188R348o1925m1155N7965k0822k4558L7060j2677
20862a52196K0764J9664K0075j4299k4563J3265Q0612M0071L6126J6989k5168
20851C1340l2764l5979L5198K1136L065m2896l979m3570J3393j6448J42927K1749
$$ plain form
20933 119369 66329 -18726 -46756 8288 23091 -20265 -26449 -23850 -86056 -116997 -140840 -112268
20921 -112268 -13494 -28113 -47481 -85562 -104117 -101159 36803 85908 14795 49628 -5875
20910 -5875 -91780 -107867 -26262 14752 -72058 -183342 -195291 -107449 -87519 -62925 -39085 -6805
20898 -6805 21560 52543 -19861 -59105 -69540 -29188 2975 26977 -18262 -57341 -54540 -87148
20886 -87148 -97861 -34483 -36140 -42141 -60293 -65189 -88115 -78213 -10674 66347 -5843 -133699
20874 -133699 -189334 -117842 -29244 -95432 -86084 -148009 -189164 -131199 -152021 -176579 -139519 -152196
20862 -152196 -131432 -111768 -91693 -105992 -130555 -117290 -36678 3393 39519 56508 31340
20851 31340 -1424 -37403 -2205 18931 21996 -20900 -24879 -68449 -55056 -71504 71423 93172
20839I3172l0410j4972M1724L6165k8298q3639o7018r328j6169K6153L8269K0836
20827F485j3115o4734j23768K0396O3529O5051M2648N1831L7634Q17m5247M504
20815D6031j044k3191n3649j0121j4141J07379j0528n4482p3339k0004l728k0916
20803a31733K0292J084j8136j7076M2541N3629Q8918M0956j28939j18272K8142
20792a38594P2596k2888m5162N9147L1558J1435J5951m0389M8115p4907l7965
20781a21103N5668J3117N1608k7298r3806L9639Q9190n3817o0882J8528M6123
20770d3033m8171l4588M9296J6394l9548J6695J12519j1046O6169n0662q6216
20759e2191j3621K7768M9194j3385L8562L1721j2669m4448N2583j5295j23666
$$ plain form
20839 93172 62762 47790 89514 125679 97381 13742 -53276 -62604 -78773 -52620 -14351 6485
20827 6485 -6630 -71364 -195132 -174736 -111207 -46156 -3508 48323 85957 86774 41527 46031
20815 46031 44987 21796 -31853 -41974 -56115 51264 40736 -13746 -87085 -107089 -110817 -131733
20803 -131733 -111441 -110357 -128493 -145569 -103028 -49399 39519 80475 -48464 -166736 -138594
20792 -138594 -65998 -88886 -134048 -74901 -43343 -31908 -15957 -56346 -8231 -83138 -121103
20781 -121103 -65435 -52318 -710 -28008 -121814 -82175 7015 -46802 -107684 -89156 -43033
20770 -43033 -91204 -125792 -76496 -60102 -99650 -82955 29564 18518 84687 34025 -52191
20759 -52191 -65812 -38044 11150 -2235 36327 68048 55379 10931 63514 48219 -75447
20748g5447M7153Q3111n1655n7578O8115K6456r0380q2262N204J9794n6368Q0908
20736h2949J44818N522q2027j0205l37k3717m4644o0242l3129q928L0406M4507
20724a20925Q1842o037O6398J49068P7924n0984m4313j14400o5214k1358K2678
20713b5321K7942O0012J441m8856n2938J7795K2058p2057N9737j0474j7716M085
20701c4292J3755Q1158L4227o787m3312o116k7514j8063J5624m4017j4548L8092
20689a1793K7010K2082M4396p4261j33093n9971N466R7604J30310L378m5848P0648
20677G5928l4231r0695N1207j7240o9112j8319O9392N1367l6418j7807m5039N032
20665g5935K2850M9818l3543J8304J38238P4672l1037o5858p1954r9105K9659
$$ plain form
20748 -75447 -28294 54817 3162 -54416 13699 40155 -50225 -132487 -127283 -107489 -163857 -82949
20736 -82949 61869 67391 -14636 -24841 -25178 -48895 -93539 -153781 -186910 -195838 -165432 -120925
20724 -120925 -39083 -45120 21278 170346 248270 197286 152973 38573 -26641 -47999 -25321
20713 -25321 2621 62633 64074 15218 -37720 -19925 2133 -69924 -10187 -20661 -38377 -34292
20701 -34292 -20537 60621 94848 88061 44749 38633 11119 -6944 8680 -35337 -49885 -11793
20689 -11793 15217 37299 81695 7434 -125659 -185630 -180164 -82560 47750 51128 5280 75928
20677 75928 41697 -48998 2209 -15031 -84143 -102462 -33070 18297 -18121 -35928 -80967 -75935
20665 -75935 -53085 -3267 -36810 -18506 119732 194404 163367 97509 25555 -73550 -43891
20654d3891J5230J697J1995k0010K7100J40425M0519o5886j30678Q1914Q892m2349
20642B4958J2002J09531J5626l4950j58055J4730j3457N0918O323o0712m8914
20631h2000N3421M7082j6600M1075j0068K2700N5507k9621J8324p9698o4211N1734
20619G645Q7752J5909R9o6912l0765l0175N7484K9183o0584M7174m6527p7383
20607f7100l1030l2889L6691P7613j0002N0135j5529o3921m4200K5870J26521
20596E2159P8079k2945o474l098p4133m1573N932N3537K1637j8038J17673l0325
20584A32431r9924j2755j8400K953M3754k7610n7548j6107n758L7720L5264M6612
20572F0632m2265K3893L1020k5034J3548l2634n2584J9090M566j8036L397J7961
$$ plain form
20654 -43891 -28661 -26964 -14969 -34979 -7879 132546 173065 107179 -23499 58415 67307 24958
20642 24958 36960 146491 162117 127167 -30888 -16158 -29615 21303 27626 -33086 -82000
20631 -82000 -28579 18503 1903 42978 32910 55610 111117 81496 99820 20122 -44089 7645
20619 7645 95397 111306 111405 44493 13728 -16447 41037 70220 9636 56810 10283 -67100
20607 -67100 -98130 -131019 -94328 -16715 -26717 23418 7889 -56032 -100232 -74362 52159
20596 52159 130238 107293 100819 97721 23588 -17985 -12053 41484 63121 45083 162756 132431
20584 132431 32507 19752 1352 4305 48059 20449 -37099 -53206 -58964 -21244 14020 60632
20572 60632 18367 42260 73280 48246 61794 29160 -23424 -4334 232 -17804 -14407 3554
20560C554J9798K302l1218j3533l5398k9369q291L0768m1731M8046Q93J3692L0279
20547a0208j7103J3179K1750J01996R496o0777k7769j0263m7053k7487r273M6300
20535a7212J41Q367O2609k8509L6130k5108j3691l5829p7532p6773j7032M4663
20523a39776M3020P9538j5854j2965K2962O7750J3893O9412M463k9248m9622k4053
20511B9520j03581r5236l3373M9465M4084K5501N6851M7174n441k0351l4058m5280
20499h4725M1375K7852K0463O3683L4439j9000K8427q1880p3417L6003N9612K4703
20487G7535m8449K6954N5088o6342r8690N1918N7242l9871m0812j04782m2334
20476a72543M1759l414J08050N2593k2023O1222l7498j0837p5385n1527J04431
$$ plain form
20560 3554 23352 25654 -5564 -19097 -54495 -83864 -92155 -61387 -103118 -55072 -54179 -40487 -10208
20547 -10208 -27311 -14132 7618 109614 119110 58333 30564 20301 -26752 -54239 -63512 -17212
20535 -17212 -17071 -8704 53905 25396 61526 36418 22727 -13102 -90634 -167407 -184439 -139776
20523 -139776 -96756 -17218 -33072 -46037 -23075 44675 58568 127980 132443 103195 53573 29520
20511 29520 -74061 -169297 -202670 -153205 -109121 -83620 -26769 20405 14964 -5387 -39445 -84725
20499 -84725 -43350 -15498 4965 68648 103087 84087 112514 30634 -42783 -6780 52832 77535
20487 77535 29086 56040 111128 44786 -53904 -1986 55256 15385 -25427 -130209 -172543
20476 -172543 -130784 -134198 -26148 26445 4422 65644 28146 17309 -58076 -109603 -5172
20465e172l7727n2182O2682P9953j9906p8904j70771k2387J02280M1239N0599
20454e0296Q7851o0961o197J6639R899J3582L7115k159j542q0486j0988M0965
20442f578k7392o9825k393j6578Q0634N1030j24740l658o123N1386J17324m5603
20430b516R942k8544k226L7959M4882l7339J029O8726j783L6681N6148n477n1390
20417A26092j8300k8885n7714m9905p2863K8635N7328M7101L6643m8895l7236
20406a7999N6586M8840n3732K0681K9762l7661L070j1843n2489j08666k7987O4463
20394h6975K2212K0853L815J5407J6816L2113k0906O4204q593n9191k1262n167
20382b6674k241m0188o3335O586J7345r801O8820L4104l429m97p6947n8096L4999
$$ plain form
20465 -5172 -42899 -95081 -32399 47554 27648 -51256 -222027 -244414 -142134 -100895 -50296
20454 -50296 37555 -23406 -29603 -12964 -3065 10517 47632 45473 43931 -36555 -47543 -6578
20442 -6578 -33970 -103795 -106188 -122766 -42132 8898 -115842 -119500 -125623 -74237 43087 -2516
20430 -2516 7426 -21118 -23344 14615 59497 22158 23187 91913 90130 126811 182959 177482 126092
20417 126092 107792 78907 21193 -28712 -101575 -72940 -15612 31489 68132 19237 -17999
20406 -17999 38587 87427 33695 54376 84138 46477 49547 37704 -14785 -123451 -151438 -86975
20394 -86975 -64763 -43910 -40095 -24688 -7872 24241 3335 67539 58946 -245 -21507 -26674
20382 -26674 -28915 -69103 -132438 -125852 -108507 -118308 -49488 -15384 -18813 -19310 -96257 -154353 -119354
20369a19354P6051M8471J9228k3753l9923J6796P00O3760L1056P423o0581m9005
20357b9131n3341J8518O6396o3143k508Q0801k1271M372L1349j6312j5471m4606
20345d4347j1989j5960l3472n3017L4495N749l3422k4530O1978Q8769P0049L4908
20333G9211k7314j0939k3665J3970j9744o5940m3257J3558N8538Q0459p0336n6793
20321g2252p117J00600m5874J3878m6324O482R2903L0618j5618k0483o9051n0954
20309h3192l9K5527k6334J6507N6099L8144n1128j4614K2342j26891j7936K5705
20297a35810P5625J01289j5294j20692m7188l9470Q0235k6565Q849Q9391O6786
20286C7156O7137m7171j4841m8843O780l3023n2379q445J00457M9216m825K0522
$$ plain form
20369 -119354 -43303 5168 24396 643 -39280 -22484 -21784 41976 73032 80455 19874 -29131
20357 -29131 -82472 -63954 2442 -60701 -63209 17592 -3679 693 32042 15730 259 -44347
20345 -44347 -56336 -72296 -105768 -158785 -124290 -118541 -151963 -176493 -114515 -25746 44303 79211
20333 79211 51897 40958 17293 31263 11519 -54421 -97678 -84120 -25582 54877 -15459 -72252
20321 -72252 -79369 21231 -24643 -10765 -57089 -50607 42296 72914 57296 36813 -32238 -83192
20309 -83192 -83231 -57704 -84038 -67531 -11432 26712 -24416 -39030 -16688 -143579 -161515 -135810
20297 -135810 -60185 41104 25810 -94882 -142070 -181540 -101305 -127870 -119021 -29630 37156
20286 37156 104293 57122 42281 -6562 218 -32805 -85184 -93629 6828 56044 51219 71741
20274G1741Q4268K3269q6992n3020n8004l1659J2191n6864n1890N4439J8954k0109
20262i3676n203K7487N1338J14085K7846o7699m6232m7481K1088N3042r1691l8554
20250i5650M2839J07396k3203k6593k5563L0191m4716j10802j02922O4880J14062
20239g0081j526J7061J2831M1765O1328J1202o4827l0421M7040j2573L623j4024
20227A398o4271p04K4058N1704J0976n4140n2687q1629K5322O3638j0735l1607
20215a18677Q2194K9299n5304l4247J6961K0422o8488J5213m5748n4971J2317
20204b01029J07574J10366r376p4928j585K6389j4494K7348M2378n0598o7824
20193a05779J16668P7715m1148o1950M9933Q1365N1915p4166j54759r5122R6764
$$ plain form
20274 71741 156009 179278 92286 39266 -18738 -50397 -38206 -95070 -146960 -92521 -73567 -93676
20262 -93676 -98879 -71392 -20054 94031 121877 54178 7946 -39535 -18447 34595 -57096 -95650
20250 -95650 -52811 54585 31382 4789 -20774 9417 -35299 -146101 -249023 -184143 -70081
20239 -70081 -71607 -54546 -41715 50 61378 72580 7753 -22668 24372 11799 15422 1398
20227 1398 -62873 -63577 -39519 12185 23161 -30979 -83666 -165295 -139973 -76335 -87070 -118677
20215 -118677 -36483 -7184 -62488 -96735 -79774 -59352 -127840 -112627 -158375 -213346 -201029
20204 -201029 -93455 16911 7535 -67393 -68978 -42589 -57083 -29735 12643 -37955 -105779
20193 -105779 10889 88604 47456 -14494 35439 116804 168719 94553 -60206 -155328 -58564
20182e8564N3480p2o313J8684K3633O7008j2930M43N562O811j0206k7261j08283
20169d8008j7618O348N2627j3621m9473k9452l4166L4340M8046j1440O0298M6454
20157D4335r858p621n4728N9367p8510m3711K6730J5842N7364P9093J29360j7371
20145B00292j49154p4802m964K1811M6748J1325L0015l296r3445m3652K0482p515
20133d6155j1750k0048N4749K0447J4312j6293k3993Q1531Q9323r769k8192p7653
20121B6509j09682r0943O1835M6715N5604M6821P6948J348m7809p5433P106L0085
20109B9104m801K9058k0941l5581l0599o5864J04828M7071o3588m7149K0712L810
20097c3940L2848O1671j9023k8729M4752K7970q1357n9559J5127l9163O9188k6802
$$ plain form
20182 -58564 -5084 -5156 -11469 7215 30848 97856 84926 85369 90931 97742 87536 60275 -48008
20169 -48008 -65626 -59278 -6651 -20272 -69745 -99197 -133363 -99023 -50977 -62417 -2119 44335
20157 44335 34477 26856 -27872 31495 -47015 -90726 -63996 -48154 9210 88303 217663 200292
20145 200292 51138 -23664 -28628 -6817 39931 51256 81271 77975 -15470 -59122 -38640 -46155
20133 -46155 -57905 -77953 -23204 -2757 11555 -4738 -28731 52800 142123 132354 104162 26509
20121 26509 -83173 -174116 -112281 -65566 -9962 36859 113807 115155 67346 -8087 -981 29104
20109 29104 24303 53361 32420 -3161 -33760 -99624 5204 52275 -11313 -58462 -37750 -33940
20097 -33940 -1092 60579 41556 12827 57579 85549 4192 -55367 -40240 -79403 -10215 -37017
20085c7017j3753M5755J5347m575n8431l8537n8089q801M6964L3500n3357q0267
20073b11261J8843N1886p272J3553Q7406K2956l0472o646M0873k1177K9537m4867
20061e6641p2602j8719J09602O6164o5655L2056M5314M06P7457o194n7821j1113
20049D2254m8256m6228N2862P2155j4456r2876L8674N319m6022J0506O256p572
20037b7384k5464n8749k2578M9408N6617P2742l0082n8717M414o8525n5337L769
20025a59886o2411M2224J24504j6675l7945J27173o729M1188m0244l1274J8756
20014a319q2256M3570R623k4655Q0894K6734P928p1372j3711P2052n9838N653
20002f697K9894O1388j0646k1982j17751N4423M947m9059n2338p128o0052j9141
$$ plain form
20085 -37017 -50770 -5015 10332 5757 -52674 -91211 -149300 -158101 -111137 -77637 -130994 -211261
20073 -211261 -192418 -140532 -147804 -134251 -46845 -23889 -54361 -61007 -20134 -41311 -11774 -56641
20061 -56641 -129243 -147962 -38360 27804 -37851 -5795 39519 39925 117382 111188 53367 42254
20049 42254 -6002 -52230 632 72787 58331 -34545 4129 9448 -36574 -26068 -19812 -27384
20037 -27384 -52848 -111597 -134175 -84767 -28150 44592 14510 -44207 -39793 -108318 -163655 -159886
20025 -159886 -222297 -180073 -55569 -72244 -110189 16984 10255 51443 11199 -20075 -1319
20014 -1319 -83575 -40005 -30382 -55037 25857 52591 60519 -10853 -24564 47488 -12350 -6697
20002 -6697 23197 84585 73939 51957 -65794 -11371 -6424 -55483 -107821 -114949 -175001 -194142
19990a94142l3285J13178P8397j4226k7668j6999r103R4531Q1764j3437o1094
19979b084m6110J2094L8732O548k3871J3399M2056l8624m2305K1271l2775L3572
19967a8097M443K2776K730q334q425m3648j0998N3972j0660r057L5107Q5163L9684
19954A34656J2413l0632p9770j00586o1493k6548P4247L0020k4972J0518j6621
19943g8768j7775M2423j9466K6030k527Q238K3483k5487J2643L838j6739o692
19931e0799J00694N632p4151p8381j0078K9319m9550q667M3285L0112L9819j2113
19919c4878q2256K0938j011p549M419J8828j4799k3442k4473K4840K1144o405
19907a04644j11165k3862M3289M2797M5107r653r161k3276r959k0401q995J00436
$$ plain form
19990 -194142 -227427 -114249 -35852 -50078 -77746 -94745 -103848 -9317 72447 59010 -2084
19979 -2084 -48194 -36100 2632 9180 -14691 -1292 40764 2140 -40165 -18894 -51669 -18097
19967 -18097 -13654 9122 11852 3518 -4907 -48555 -59553 -5581 -16241 -25298 9809 94972 134656
19954 134656 147069 116437 36667 -63919 -125412 -151960 -77713 -47693 -72665 -62147 -78768
19943 -78768 -96543 -54120 -73586 -47556 -50083 -41845 -18362 -43849 -31206 -27368 -44107 -50799
19931 -50799 49895 55527 -18624 -97005 -107083 -77764 -127314 -135981 -92696 -62584 -22765 -34878
19919 -34878 -117134 -96196 -97207 -104756 -100337 -81509 -96308 -119750 -144223 -119383 -98239 -104644
19907 -104644 -215809 -239671 -196382 -153585 -108478 -118131 -127292 -150568 -160527 -180928 -189923 -89487
19895h9487L0102n848N9554R0560k3144q0353k0410n3924n9706j1743j0847Q0963
19883i4283P3254P5227K3167j24L1444J235n0689O72j8519J9435m2791o4776L5252
19870a1496K0267n4125l1881j4063k0492l2936j809R83j1738n406k7107J09131
19858h0672Q9913N2618M0372J4813q5173m0931L3288o2781j9845K8806P4620m812
19846D0216J5281q0090J1674J0129k666m9422p572P641P3320p3306n2401p12k8758
19833a36666N9757R1369K0187K7232o5146n7261J3121O521l2864o5866P0367Q5694
19821A6445k7528P971m9835N6353Q2302P0889p0892j41981o6117N8106N4807p6585
19809h6065L5570j425k7515M4611N0071l7477j50601r5552L5568R0650J03935
$$ plain form
19895 -89487 -59385 -65233 -5679 84881 61737 -18616 -39026 -92950 -152656 -164399 -175246 -94283
19883 -94283 -21029 54198 77365 77241 108685 109920 59231 59903 41384 60819 18028 -46748 -11496
19870 -11496 8771 -45354 -77235 -91298 -111790 -144726 -146535 -145552 -157290 -162696 -189803 -80672
19858 -80672 9241 61859 102231 117044 31871 -9060 24228 -38553 -58398 -29592 45028 40216
19846 40216 55497 -24593 -12919 -2790 -5456 -54878 -62450 -54809 18511 -54795 -107196 -107908 -136666
19833 -136666 -76909 14460 34647 61879 -3267 -60528 -47407 -40886 -73750 -139616 -69249 16445
19821 16445 -11083 -3112 -52947 3406 85708 156597 85705 -56276 -122393 -64287 -9480 -86065
19809 -86065 -50495 -51920 -79435 -34824 15247 -22230 -172831 -268383 -232815 -142165 -38230
19798c8230K1167O9381N7072Q2605K1463J1112r2283j56906m0871R3862O5975
19787I4347n4282k3724k8917N3805L9037l9892k6379n5811N5001p977Q1440K0242
19775A06890p4655N0668J9655o4031L3166L5528o5129p292M4145j5312k1250o7769
19763b5386m64P6430O5171m9871r875K6321o5553l3692o7500q4966K3795Q0584
19751f5006N4769L007j34260K3334j2867P1858N5623j13847j44375P6734N2104
19740a32926J4700N5293l4540j9105K176O8668R3526K6344l9552o813j09759p534
19728h9522K0501N9317m757N4199N825n4080k2490M3105j0403L429R3573l016
19716I5681l3099m877n7179O924K4725r2443j7452J10800K6393p5134j02089O8292
$$ plain form
19798 -38230 -17063 52318 109390 191995 213458 224570 132287 -24619 -65490 28372 94347
19787 94347 40065 16341 -12576 41229 80266 40374 13995 -41816 13185 5208 86648 106890
19775 106890 32235 82903 102558 38527 71693 107221 42092 34800 78945 63633 42383 -25386
19763 -25386 -25850 50580 115751 65880 56005 82326 16773 -16919 -84419 -169385 -145590 -65006
19751 -65006 -10237 -7230 -141490 -118156 -131023 -59165 -3542 -117389 -261764 -185030 -132926
19740 -132926 -118226 -62933 -97473 -116578 -114402 -45734 47792 74136 34584 27771 -81988 -89522
19728 -89522 -69021 -9704 -14461 39738 45563 -8517 -31007 12098 1695 5124 98697 95681
19716 95681 62582 57705 526 7450 32175 -60268 -77720 33080 59473 -15661 -117750 -49458
19704d9458J0780j7059j50k9397N43O9330J50760j5313K6063o5713o1537N4718
19692G3567L7146j27875Q047J3270K1499k6682L9198M2721k23N0360n2750l4740
19680D3538n2972J1243m131k670m7716k363L9082Q9992N6945J8673M3532q4022
19668A09131l5805m570j9613j1785p4796j9716K6604n5390k2749n341l4024m6600
19656a94654L234O9787n226J0325J01415l630q8092M6607J14800m4390K9326M665
19644D4167j01966L449m6581N245q812L606K7919J6407M0038k6949n368L6151
19632a2694N4373J3987m3049n2296m3006j5962J0505M7816l0207l3273Q6199N5852
19620C8245n9505p6996P6539L8236k7732k1641o167M4188R9257k669k8437K0833
$$ plain form
19704 -49458 -38678 -55737 -55887 -85284 -84741 -15411 135349 120036 146099 80386 18849 73567
19692 73567 110713 -17162 -9115 4155 25654 -1028 38170 80891 80668 131028 78278 43538
19680 43538 -9434 1809 -2322 -4992 -52708 -55071 -15989 74003 130948 149621 193153 109131
19668 109131 73326 68756 49143 37358 -37438 -57154 -30550 -85940 -108689 -114030 -148054 -194654
19656 -194654 -191420 -121633 -126859 -116534 -15119 -18749 -106841 -60234 54566 10176 39502 44167
19644 44167 -57799 -54350 -100931 -95686 -104498 -100892 -72973 -56566 -16528 -43477 -48845 -12694
19632 -12694 41679 55666 12617 -39679 -82685 -98647 -88142 -40326 -70533 -103806 -17607 38245
19620 38245 -21260 -98256 -21717 16519 -11213 -32854 -39021 5167 104424 101755 73318 94151
19608I4151l8509p3758l2081O8147L6027o3447k7815P1498P0955n1751J7903m2953
19596B8367q7383j38433l039K2395J32789O5148M9448J5616j08273r2198n281
19585a20844l2438M5562J9693j5984m7684j104j0608O494l8909O0102N5438l6882
19573a17164l8586M0525N2599O9949L0472p720j13656n846P9653N6304m0456L5395
19561D1469M916l9207P253Q581p270K3918O7165K4924l1538j12101j03440O2877
19549e2453Q5538L4967j00629O1487K2626m0482o3889O1868l8476q8231R0535
19538b7139K2710n7928J111M2866n5239N0001N3463m0222q1333l4972k078j2515
19526a41275q2082K8658J01524j5830o4096K0702K5671K5809K2318M0877M5721
$$ plain form
19608 94151 55642 -18116 -50197 17950 53977 -9470 -37285 34213 105168 53417 71320 28367
19596 28367 -59016 -197449 -200488 -178093 -45304 19844 69292 84908 -23365 -115563 -120844
19585 -120844 -153282 -107720 -88027 -104011 -151695 -152799 -163407 -156913 -195822 -135720 -80282 -117164
19573 -117164 -155750 -115225 -62626 7323 37795 30075 -83581 -89427 -9774 46530 6074 41469
19561 41469 46385 7178 14431 23012 15742 39660 106825 131749 100211 -11890 -115330 -52453
19549 -52453 33085 68052 -32577 28910 51536 11054 -52835 9033 -29443 -117674 -27139
19538 -27139 -4429 -62357 -61246 -18380 -73619 -23618 29845 -10377 -91710 -126682 -128760 -141275
19526 -141275 -223357 -194699 -93175 -109005 -173101 -152399 -126728 -100919 -78601 -37724 7997
19515G997j7799j4900K2082L8610j2507m20N250M7519J2882l2195n3341M8752
19503E1930L3986J7190K1099Q014l6830n6003L843N5031M0516R080p8720n740
19491F3396O531J711j9463K0523k1526l6704p2599M226L5089P2348k4816k8714
19479Bj5286l4461O4526R953r857j9791l9513k6400J15067J1446n5182q8950J3496
19466g4950Q0522K2882j5412k1787o1754j4135M1003K1678J8233q2418j4969L2918
19454f8189R534N7523J0197J580j3861p9167J5261Q2987J1018M2093L4443L491
19442A06910k0527o4001k6695n7168R0560O5661M2841k7605L6202K4823J0980
19431A81981j04756l5720o136n7071L5735M7552J5471P5259m9446l0877k7351
$$ plain form
19515 7997 -9802 -24702 -2620 35990 23483 23063 28313 75832 88714 56519 3178 51930
19503 51930 85916 103106 124205 132219 95389 39386 43229 98260 138776 147856 69136 63396
19491 63396 69927 71638 52175 72698 51172 14468 -58131 -53905 -18816 53532 28716 2
19479 2 -15284 -49745 14781 24734 14877 -4914 -44427 -70827 44240 55686 504 -88446 -74950
19466 -74950 5572 28454 13042 -8745 -70499 -84634 -43631 -21953 -3720 -86138 -101107 -68189
19454 -68189 -58655 -1132 9065 10645 -3216 -82383 -67122 15865 26883 68976 103419 106910
19442 106910 86383 22382 -4313 -61481 29079 94740 137581 109976 146178 171001 181981
19431 181981 77225 41505 35369 -21702 14033 61585 77056 152315 102869 71992 44641
19420D4641m2124L0798k9909K5878R134N4257O4517k0428j03701m2022n1240O8173
19408G974Q5280L3512m7562q7082m1705j9287n719J7767n390J1697P0632K8290
19396D8407L8459k7756M757n4198l9911k7729M0405K0288n5275K6263N775l3503
19384e4018L1642L0951N7667k0146k8885M5382N67l0281P396l2003J5525J5141
19372C8938J5001q7270k9924R468N7272M4421j6513R859o7833J7534L9109L8327
19360F8389j05597l861O2803M2929P1752q154k6823K8391L0217L7562J4172n4803
19348A56977k7944l6793m8486L944N1414K5231o1668j47295J8123J27889j9506
19337D1886o5065J0193K0366M3687j6669l6297K4405o487K1899j4271k0795j03212
$$ plain form
19420 44641 2517 33315 3406 29284 38418 92675 157192 136764 33063 -8959 -60199 7974
19408 7974 93254 126766 79204 -7878 -49583 -68870 -74589 -56822 -62212 -50515 20117 48407
19396 48407 86866 59110 63867 9669 -30242 -57971 -17566 2722 -52553 -26290 -20515 -54018
19384 -54018 -22376 8575 66242 46096 17211 62593 63160 32879 40275 8272 23797 38938
19372 38938 53939 -33331 -63255 -53787 3485 47906 31393 41252 -26581 -9047 30062 68389
19360 68389 -37208 -41069 21734 64663 136415 128261 101438 129829 160046 197608 211780 156977
19348 156977 129033 92240 43754 47698 99112 124343 62675 -84620 -66497 61392 41886
19337 41886 -23179 -12986 7380 51067 34398 -1899 22506 16019 37918 23647 2852 -100360
19325a00360L3203J6650n0103q7437N3487n281R974J9864p801j0122j7773M6267
19313i9432m206l6278K0010N7468J5611j6755K5824K9852N0306L625j40879k9823
19301a24677N0903L6387N375M858O4921J11003k2393k1696J4937q4447k7761o2757
19289e5347L4050K0880l8169K2412k461l9895O0937Q1725n2683k6684k2625m0642
19277e8502k0354j8628L4106J13750N9863k2536q3344m0634j464Q2504m3863l7700
19265c6802M7399L0627K563m8685N4840k2337o8804o6609J9388l2739L9655J00994
19253A9490j3611L8767q1982m4499R9878l9504n5610k9919k1629N7075K247J01269
19241C1972N4650L1828J25891n9083j43065j6417r930j9017p0188J4651K7888
$$ plain form
19325 -100360 -67157 -50507 -100610 -188047 -134560 -139841 -129867 -110003 -117804 -127926 -145699 -99432
19313 -99432 -103638 -139916 -119906 -62438 -46827 -63582 -37758 -7906 42400 46025 -94854 -124677
19301 -124677 -73774 -37387 -32012 -27154 37767 148770 126377 104681 119618 35171 7410 -55347
19289 -55347 -21297 -417 -38586 -16174 -18635 -58530 2407 84132 31449 4765 -17860 -58502
19277 -58502 -78856 -97484 -63378 50372 110235 87699 4355 -36279 -37743 44761 898 -36802
19265 -36802 10597 41224 43787 -4898 49942 27605 -41199 -107808 -88420 -121159 -81504 19490
19253 19490 5879 44646 -37336 -81835 18043 -21461 -77071 -106990 -128619 -71544 -69297 31972
19241 31972 86622 118450 244341 185258 42193 25776 15846 -3171 -73359 -58708 -30820
19230c0820m1549p3402n9669o4957J3845Q0847j7454j605J9695R802k7736L0102
19218a62901J02442M6470q9793m7127O7963N3921m534p8115L2673J4577K2768
19207d1656N667k6526j4030K1974P6163K8570N53k3640m5179p2993q4763Q1514
19195i4346J00922J3934m2273p9394l4039Q2648Q9668M648o0023L5288J29382
19184A46415j8797l0480N9218r3806p5356J4711k9051J6500N9657n9399j5177
19173b5565n5254j3421J0493k4925L7635L8137r793k6182m8102N1222J1952J9178
19161c4625o1428J7455L2361R033m7595O6938J0790n4948l394Q619q3126m5907
19149a85827R1209J41512M1054K4242k9341L63m6395j9079l8363j6793l8889N8067
$$ plain form
19230 -30820 -72369 -145771 -205440 -270397 -256552 -175705 -193159 -194764 -175069 -165267 -193003 -162901
19218 -162901 -60459 -13989 -103782 -150909 -82946 -29025 -33559 -111674 -79001 -64424 -41656
19207 -41656 -35989 -62515 -76545 -54571 21592 50162 50715 27075 -18104 -91097 -175860 -94346
19195 -94346 6576 20510 -21763 -101157 -135196 -52548 37120 41768 -18255 17033 146415
19184 146415 127618 97138 156356 62550 -12806 1905 -27146 -10646 49011 -10388 -25565
19173 -25565 -80819 -94240 -83747 -108672 -71037 -32900 -42693 -68875 -116977 -65755 -53803 -34625
19161 -34625 -96053 -78598 -46237 -37204 -84799 -17861 -7071 -62019 -65413 -56794 -139920 -185827
19149 -185827 -94618 46894 87948 112190 82849 83212 36817 17738 -20625 -37418 -76307 -18240
19137a8240P6922l8713p3539n059J8415K237N9784j8351M955K5180n1024j64863
19125a82296l8547p393J07285M8466o7439R7797R7469p1340k8294k2726m0880
19114a07898Q6131J9713k2940m2838j3150k7345j6522O1984J07245M54m2343m0292
19102c7801Q0994N6025r771l8821o1049L5685O8654l7678o1425J9376k9667R645
19090e833j2784n3707L1996N2026k7596K9307J0301m2584l3342J0620j1336K4339
19078b8593P1379j1749N421l5283l5440K0960J6662k9845J3483l6801K880j3815
19066f0741L5851K1053l0689K0464J5352M7924L4607m3393o1691n691m5426m926
19054g7306O027P0775N0230J8201N2169k2059O754m9582n3433L8374J0685J2886
$$ plain form
19137 -18240 58682 19969 -53570 -58629 -40214 -37977 21807 3456 8411 33591 -17433 -182296
19125 -182296 -220843 -228236 -120951 -72485 -139924 -42127 55342 -15998 -44292 -67018 -107898
19114 -107898 -21767 -2054 -24994 -67832 -80982 -108327 -124849 -62865 44380 44834 2491 -37801
19102 -37801 43193 99218 89447 50626 -10423 25262 93916 56238 -5187 14189 -15478 -5833
19090 -5833 -18617 -72324 -40328 11698 -15898 13409 23710 -18874 -52216 -41596 -52932 -28593
19078 -28593 42786 31037 36458 1175 -34265 -13305 3357 -26488 -13005 -49806 -46926 -60741
19066 -60741 -24890 -3837 -34526 -14062 1290 49214 83821 40428 -21263 -26954 -72380 -77306
19054 -77306 -71279 -504 49726 67927 120096 98037 104791 55209 1776 40150 50835 63721
19042F3721L7942R915l4825l3288J9703N988m0863K7918L9057j3569q2873J8204
19030A7030m720k6731K6460R659p0422k8733J9308p519j9138K276J21467P3822
19018A12759r7943j28470j3664k2837J5075O8962L614K870k6999P3864P0528p6525
19006a8766j0440l0400m7217K4689J2761M4845N9782n8667m2855l0875J3278k9149
18994a13014o0244J04592j0293m7829J9407k0325N4338L4761J46622o0809j38973
18983i1767o2581K7286J5886N7729Q2634M6088M9239O2852o2195r8644m5317l3963
18971e2753L0921L8574L0684K2383o3796j39504P80O177n2467O3804K5322J4311
18959g5564N3744O5511K61k0843O912o4649K6004N4724J3937n1561M2238N9675
$$ plain form
19042 63721 101663 111578 76753 43465 63168 69156 28293 56211 95268 81699 -1174 17030
19030 17030 12310 -14421 12039 21698 -48724 -77457 -58149 -65668 -84806 -82530 38937 112759
19018 112759 14816 -113654 -127318 -150155 -135080 -66118 -62504 -59634 -86633 -12769 57759 -18766
19006 -18766 -29206 -59606 -106823 -82134 -69373 -24528 35254 -23413 -66268 -97143 -83865 -113014
18994 -113014 -173258 -68666 -78959 -126788 -107381 -127706 -73368 -38607 108015 47206 -91767
18983 -91767 -154348 -127062 -111176 -53447 29187 75275 124514 187366 125171 26527 -18790 -52753
18971 -52753 -21832 16742 47426 69809 6013 -133491 -132711 -126534 -179001 -115197 -89875 -75564
18959 -75564 -21820 43691 43952 23109 30021 -34628 -8624 46100 60037 8476 50714 110389
18947A10389l5063K6620m5601l7523l7343p9489l0692M5222j3466L9874K5892
18936c1180K5696Q10P5601L2090M7126k6280n9393O454l391p7588J4439L1474
18924C5858o1001j19238N8034J12197J2533j3751j05693N0850j0732N291M0346
18913D694k4939J3061l3207m4863N8835L9109L6186n7302j2776l4558M3074J3483
18901G97M7313P9025n9734p7900j9396N4903m3711k7714j8618l100o6791M8684
18889h6242R7427P8452k848M997q775j02890j67049L7510J64181O582p0181N248
18877d3588R617N5180q924K2405K1464j4474N5668j4289o3821k3419q4275L241
18865h5215R3481r878o6468r0321R3825Q1052K8170P313m426m0373L4513J2745
$$ plain form
18947 110389 75326 101946 56345 18822 -18521 -98010 -128702 -83480 -96946 -57072 -31180
18936 -31180 -5484 -4674 70927 103017 150143 123863 64470 70924 67533 -10055 4384 35858
18924 35858 -25143 -144381 -86347 25850 38383 24632 -81061 -30211 -40943 -35652 4694
18913 4694 -20245 -7184 -40391 -85254 -26419 12690 48876 -8426 -21202 -55760 -12686 797
18901 797 48110 127135 67401 -10499 -29895 25008 -18703 -46417 -65035 -68135 -134926 -86242
18889 -86242 11185 89637 86789 91786 83011 -19879 -186928 -149418 14763 21345 -48836 -43588
18877 -43588 -33971 21209 12285 34690 56154 41680 97348 83059 19238 -4181 -88456 -85215
18865 -85215 8266 -1612 -68080 -158401 -64576 16476 44646 51959 47533 7160 41673 54418
18853E4418p3327N888k8851J9281O0042l553p8812q0032l3124J9497K130N0540
18841h5903N3562p1390J21668J3382j34960J7716J04195R372n2559l5170m7594
18830a07681L7560L0920M620j9756O249J2413L6729m2383n1855J46590Q5260n3157
18818H5509J5074n816m2655j16485n9675L6242P7050l0363Q782Q0806L4321m3011
18806C9779n9677j5502M3911l6633o357Q0866n0654q8985j5890O3484N9328L4250
18794D7920M7548j39807l6191P3351J2713o876p0430M6086Q8072m9671k0540M0096
18782C2271r8572o6121O5273J05709j1186m3997m2178n4965K1005L8250P285k8446
18770g5672K6187J179l0452L2315N2598K8190o0186k4730K7801k0314K3880R5122
$$ plain form
18853 54418 -18909 -13021 -41872 -22591 37451 33898 -44914 -124946 -158070 -138573 -136443 -85903
18841 -85903 -32341 -103731 17937 31319 -103641 -85925 18270 27642 -24917 -60087 -107681
18830 -107681 -70121 -39201 -34581 -54337 -48088 -35675 1054 -41329 -93184 53406 138666 85509
18818 85509 100583 94767 52112 -64373 -124048 -87806 -10756 -41119 -32337 48469 82790 39779
18806 39779 -19898 -35400 8511 -28122 -34479 46387 -4267 -93252 -109142 -45658 13670 47920
18794 47920 95468 -44339 -80530 -7179 5534 -1342 -71772 -25686 62386 12715 -7825 32271
18782 32271 -66301 -132422 -67149 38560 27374 -16623 -58801 -113766 -92761 -54511 -47226 -75672
18770 -75672 -49485 -48306 -78758 -46443 6155 34345 -25841 -50571 -22770 -43084 -19204 75918
18758G5918J5923J786K0913N6754M2597j14793j06030r2577k7074j5953j9124
18747a61660M1163R320k224m4224L7357L4660M6017m3641j081l7230L2027Q3521
18735e995N3686K2651Q515p960n2016N4873k4495q9581l6139n0171P5938N7668
18723F974P2519P596j29469o9765l0156n3307K2494Q607R8364Q4428L1676o9535
18711a9574j07146n0381L0709M1345l242j1596L907J779L5066j2772N6157O301
18699b9447m0112k7351N8900K1596m0882R1499K2290k3459L6118N4823O591l2439
18687I8127r899n8803r7183l482k5073N5540K3507k1174J3807L021K4063j5992
18675a3541r366k5034K696J7704J3427P596N175m0784K0192j02029k1386M1690
$$ plain form
18758 75918 91841 93627 114540 171294 213891 99098 -6932 -99509 -126583 -142536 -161660
18747 -161660 -120497 -111177 -113401 -157625 -120268 -85608 -39591 -83232 -84313 -121543 -89516 -5995
18735 -5995 47691 70342 78857 70897 18881 73754 49259 -40322 -76461 -126632 -50694 6974
18723 6974 79493 87089 -42380 -112145 -142301 -195608 -173114 -164507 -66143 18285 49961 -19574
18711 -19574 -126720 -177101 -146392 -105047 -108289 -119885 -115978 -114199 -79133 -91905 -35748 -29447
18699 -29447 -69559 -96910 -38010 -16414 -57296 34203 56493 33034 69152 123975 130566 98127
18687 98127 88228 29425 -67758 -71240 -96313 -40773 -17266 -38440 -24633 -21612 2451 -13541
18675 -13541 -22907 -47941 -45245 -27541 -14114 -6518 -1343 -42127 -21935 -123964 -145350 -103660
18663a03660Q9025K0757N839n6683L888J4715P065N7440K6841L8346q86j28965
18651b6278r2839L4417M1188P7001m1183k1363J2291n9443l3131K5542P1151N9005
18639D6358J0044j2498J2396j0634Q5530J1585k7418q7878m6672p9240K9531M4686
18627b4210J9619J623k1097j32187j660R1356J5263n0471L869K264J9264O1903
18615a4464n4886m7071L1022L0899O8530N1004l7669j27407j49439J1909J05553
18604a32019J2495Q054Q9707j2820O515O4306J6310N3932M3761k6258n7991q1986
18592a5994M8073K1372j19465k2369J8296L8695O1440N6301j2425j29553J534
18581e4095P7780L3242p402J0216m4270O342p6404L374J7891K089M9395L0486
$$ plain form
18663 -103660 -14635 6122 11961 -44722 -40834 -26119 -19054 38386 65227 103573 102687 -26278
18651 -26278 -119117 -84700 -43512 33489 -7694 -29057 -16766 -76209 -109340 -83798 -12647 46358
18639 46358 56402 43904 56300 45666 131196 142781 115363 27485 -19187 -98427 -68896 -24210
18627 -24210 -4591 -2968 -24065 -156252 -157912 -66556 -51293 -101764 -97895 -95631 -76367 -14464
18615 -14464 -69350 -116421 -85399 -54500 14030 65034 27365 -100042 -249481 -237572 -132019
18604 -132019 -119524 -111470 -21763 -34583 -28068 36238 52548 106480 150241 123983 65992 -15994
18592 -15994 32079 53451 -66014 -88383 -70087 -31392 30048 86349 73924 -55629 -54095
18581 -54095 23685 56927 49525 59741 15471 21813 -54591 -51217 -33326 -31237 18158 48644
18569D8644N3M5678o2575q5003m2686P2145k3819k4275m7715l4362o447M8030
18557a12332q573K2037L6625K7369K1277m1684J885l7824j1003m9803L0452Q4142
18545c7432K5427J8135J5209j950M318k7689l2084M9711l912o5192p1788Q1037
18533d6210N4006o4068l1860L835n0069L5827P7277N811k3301j4202J01042J7975
18521F6063n7154j13893J7598J3815K0166k1334K0279K4856k4613O8325k834m0723
18509b9449N3829J14110j7231r6352K7245j4673n5596L8144n1128o161L8135r9535
18497i8662k0245K1855N7541M0068N8916J3656j03899K7556L610L8941q4400J2614
18485c2449P3761L3727J8197j3531n8580j1685n6695M1525J1123L448j7186o3613
$$ plain form
18569 48644 48697 94375 31800 -53203 -95889 -23744 -47563 -71838 -119553 -153915 -160362 -112332
18557 -112332 -120905 -98868 -62243 -34874 -13597 -55281 -53396 -91220 -102223 -152026 -121574 -37432
18545 -37432 -12005 6130 21339 19389 23707 -3982 -36066 13645 9733 -55459 -127247 -46210
18533 -46210 7796 -56272 -88132 -84297 -134366 -98539 -21262 -15451 -38752 -52954 48088 66063
18521 66063 8909 -104984 -87386 -73571 -53405 -74739 -54460 -29604 -54217 14108 11274 -29449
18509 -29449 24380 138490 121259 24907 52152 37479 -18117 20027 -31101 -37262 873 -98662
18497 -98662 -118907 -97052 -39511 557 59473 73129 -30770 -3214 396 39337 -45063 -32449
18485 -32449 41312 75039 93236 79705 21125 9440 -47255 -5730 5393 8841 -8345 -71958
18473g1958O5933L9214k9505r2394l6347R602K6031m6503l476O1762Q5939P7372
18461H5670Q5792L4349m5512o0959o0289n8557m686k1134K4455m495o6278n1012
18449a42656N211N7746K7517J8147l509O2123K9277N7886N3788O1000m7948j35977
18437D2605l3173j4848p3257L020M1652M5300J2385j9211m8014j6977j9356R1348
18425A1474R56p650l1841J2625q8693l7380L9027L4436M2659J06370L818O872
18413I2673o747n8795k1545Q8137n2477l7849j31530o4424J32202O848n535q3541
18401a42583M375K5935m174M9184O9665k0289q7420l4607J7596K8152j4623M1455
18389f7334M6034j075k8129k8784j04231l2712L3828J02324q3757q83Q9042J14876
$$ plain form
18473 -71958 -6025 33189 3684 -88710 -125057 -115455 -89424 -135927 -139403 -77641 8298 85670
18461 85670 171462 205811 160299 99340 39051 -19506 -24192 -45326 -20871 -25366 -91644 -142656
18449 -142656 -137445 -79699 -52182 -34035 -37544 24579 53856 111742 165530 226530 178582 42605
18437 42605 9432 -5416 -78673 -75653 -34001 11299 23684 4473 -43541 -60518 -79874 11474
18425 11474 12430 4780 -27061 -14436 -103129 -140509 -101482 -67046 -24387 81983 85801 92673
18413 92673 85926 27131 5586 93723 41246 3397 -128133 -192557 -60355 -53507 -59042 -142583
18401 -142583 -138208 -112273 -116447 -67263 2402 -17887 -105307 -139914 -122318 -94166 -108789 -67334
18389 -67334 -21300 -22375 -50504 -79288 -183519 -216231 -182403 -80079 -163836 -164719 -75677 39199
18377C9199n1925r8740k3165N6514M9293K4823J8504J8918K8087N4335q123n3763
18365E3957n1376p1806J12947N1732j1420p1268j26181N5328R9011J0438k5651
18354B5711n0555K3061k1678R508K2727P3718k2265l8755l0323K857K6655J1450
18342C2111K4656M9334N3895n6634k455o8594j42570l0283N7296Q8098O966J5857
18330B7677k30k7897j2502O5439l0286k518M3240j8060K5525l5666r2103r221
18318f6602J2444J18897L2098K4259m9166l6958j1086j22261m1661L4901P3630
18307c1505m0586j0613J9897j2565L7749M2254l1766k5476k748J5764N6663P4559
18295I1627l0666p7076l3249L546J3438K6636o831k2288r8121n2897Q819Q3151
$$ plain form
18377 39199 -12726 -111466 -134631 -78117 -28824 -4001 14503 33421 61508 115843 107720 53957
18365 53957 2581 -69225 43722 95454 84034 12766 -113415 -58087 40924 51362 25711
18354 25711 -24844 -1783 -23461 -13953 8774 82492 60227 21472 -8851 -5994 20661 32111
18342 32111 56767 106101 159996 103362 100907 32313 -110257 -140540 -83244 4854 11820 27677
18330 27677 27447 -450 -12952 52487 22201 19683 62923 44863 70388 34722 -57381 -66602
18318 -66602 -54158 64739 96837 121096 71930 34972 23886 -98375 -140036 -105135 -31505
18307 -31505 -72091 -82704 -62807 -75372 -37623 4631 -27135 -52611 -55359 -39595 17068 91627
18295 91627 60961 -16115 -49364 -45818 -32380 -5744 -12575 -34863 -132984 -185881 -177062 -93911
18283i3911j8621J9867J5298o0083k9175O5212N8964J1564L7526J3928L2006k4345
18271B8230j6505k6675P8824P289l399j2856K2392J0405P9497n4660m4299J8157
18259H6400p294n9093m1749k7781n994L9264O9055j8330o5023R606j1612j6018
18247d8569L3142O9407K203O5193M2460m8606n9938n4059M6954L8501L7577K373
18235A26638l0755p3233p5011J6326K7736m8805k6474K3349N161M5556J4300m2750
18223c7962L8547M689o924R4863n011l402M2077p503J9214r6307j17146L4599
18211d0266r999L8048J3092n0227J02234J2771j14923q8960Q7891J13178n1416
18200A1423L260j1406q869M7060k6219P4663J31p4345M641l4396j9090j8315O9306
$$ plain form
18283 -93911 -112532 -92665 -77367 -137450 -166625 -101413 -42449 -30885 6641 20569 52575 28230
18271 28230 11725 -14950 63874 71163 67764 54908 77300 87705 167202 112542 68243 86400
18259 86400 79106 20013 -21736 -49517 -55511 -16247 52808 34478 -30545 -20939 -32551 -48569
18247 -48569 -15427 53980 56183 121376 163836 115230 55292 1233 48187 86688 124265 126638
18235 126638 95883 22650 -52361 -36035 -8299 -57104 -83578 -60229 -55068 -9512 4788 -37962
18223 -37962 585 5274 -1650 93213 88202 84800 126877 119374 138588 42281 -74865 -40266
18211 -40266 -50265 -12217 875 -49352 52882 65653 -49270 -138230 -50339 62839 11423
18200 11423 14683 3277 -5592 41468 15249 89912 90043 15698 20339 -14057 -33147 -51462 17844
18187A7844P3362R989m3700N6102q819j32735n5437J43139k5272j09922N1011
18176b4438p057Q6332p517l5593M2377R2380L4183n3192k8437j6207k9136o3201
18164i506M6382M4890k0668M2565L9780J7646n2245k3821n887p0866p7209K1657
18152d7282J2175J731p8934J192l601O879O0515M4088l0780N3492l297o448P5753
18139H5483J7177k0112n7128L25J1874j9839L5481O5884P8867j8292n2265m9487
18127G7968m3874R1166M3815m407M1144P344n5572Q922M1750P5387J751K0430
18115C05824N2094N0668K6529L8005n1900m4750O9808m6113j31142n8416k3627
18104A86980P7964J10199M8925l9634R5377L1962N3188l5984l2716m6772m4699
$$ plain form
18187 17844 91206 101195 57495 113597 104778 -27957 -83394 59745 34473 -75449 -24438
18176 -24438 -31495 54837 47320 11727 54104 146484 180667 127475 99038 82831 53695 -9506
18164 -9506 36876 81766 61098 103663 143443 161089 108844 85023 79136 8270 -68939 -47282
18152 -47282 -35107 -33376 -112310 -111118 -114719 -107840 -47325 -3237 -34017 19475 16178 9730 85483
18139 85483 102660 82548 25420 25745 37619 17780 53261 119145 198012 179720 127455 77968
18127 77968 34094 125260 169075 164668 205812 213156 157584 166506 208256 283643 285394 305824
18115 305824 357918 408586 435115 473120 421220 376470 446278 400165 269023 210607 186980
18104 186980 264944 375143 424068 384434 479811 511773 564961 528977 496261 449489 404790
18093D04790j10621K4920J2276O1434l5309K3533N2696j7867p5481j7332Q6563
18082D09602L1776q7385K0367J06595R0152K2000K7427n9841q1806j1576j738
18071D65573N437l647q267L2733j6201k3053j537m653l1266L4012L938m5470m2716
18058C64883n5680J08101P5479M196N2386m7907n5679n3824q5364L1738p0452
18047B67877j6728O6n1255r0440o3314l388M1206Q5998N7950l606m5171l2944
18035A46251j9563P468n1532J12338J01540K67R1351l8833m5789j38483l8872
18024A26143O1585j461M1275M0659L1421N0621M344l3944r1024l7793j5851p8559
18012I7416N80J8770N2457p4118o9259k8725n5095K1575Q0019N1593Q4577k1801
$$ plain form
18093 404790 294169 319089 331365 392799 357490 381023 433719 415852 340371 323039 409602
18082 409602 441378 353993 374360 480955 571107 593107 620534 560693 478887 467311 465573
18071 465573 471010 467363 459096 491829 475628 452575 451038 446385 415119 449131 453069 407599 364883
18058 364883 309203 417304 492783 496979 549365 501458 445779 391955 306591 338329 267877
18047 267877 251149 251215 199960 109520 46206 42818 84024 170022 227972 224366 179195 146251
18035 146251 126688 134156 82624 194962 296502 296769 388120 349287 303498 165015 126143
18024 126143 187728 186267 227542 268201 299622 350243 354587 320643 229619 191826 175975 97416
18012 97416 97996 116766 169223 95105 25846 -2879 -57974 -36399 43620 95213 179790 157989
18000A57989m1248m6985q939l7481L122J7065P8332K4651P091n2868q589j2972
17988G9168j0553J4899L3276P632o0568M4958K8475n3250n1968L1020N2149n2279
17976F2959j1829L5673Q2331M5300q9622n1905j4340M5951m1202N6428j2054J5632
17964A23322k1029j0353R6851P2574k2702j23342r6212N5946O7754j16064q3564
17953e6819P095O4017m9760n7957J6534n0812J31342K5333m2053q8794k2107J1682
17941a12299M6413L7150k6458N3706j6917j3404j2063m931K2478l1665J8003k5793
17929f5780n7044m4377M0420R6336J25563N5194J5728j24016l6373l3540N902
17918b1987K2769j0875J565N3841N0167p9175J5675K1478J5837k0860o9509L816
$$ plain form
18000 157989 116741 69756 60817 23336 26458 43523 121855 146506 153597 100729 92140 79168
17988 79168 68615 83514 116790 124422 63854 108812 137287 84037 32069 63089 115238 62959
17976 62959 51130 86803 169134 214434 124812 72907 58567 104518 63316 119744 107690 123322
17964 123322 102293 91940 188791 261365 238663 115321 19109 75055 142809 26745 -56819
17953 -56819 -49724 14293 -35467 -93424 -76890 -127702 3640 28973 -13080 -101874 -123981 -112299
17941 -112299 -65886 -28736 -55194 -1488 -18405 -31809 -43872 -48803 -26325 -57990 -39987 -65780
17929 -65780 -122824 -167201 -126781 -30445 95118 150312 166040 42024 5651 -27889 -21987
17918 -21987 782 -10093 -8528 45313 95480 16305 31980 53458 69295 48435 -21074 -17258
17906a7258p163n4479L5309o2233n1584L836j2191n5385l3391J3700Q3884K6807
17894a30148l7657j5316R4686p1384q9691P1712K1908p1979o0687J4239Q806L8532
17882b26979R4589J36209K04749J52975J06409n6066j08590n145j5005p9296J4442
17871B18292M3072l1087o3079N0610J25290K1272l7020q5931n1514J7624N3601
17860B61130O042k555j9419J6163R9273M5112o3201J9077l9962L0367M6021K5832
17848D23880j5402r350K1150L5702p0128r2397m4337L3073N8126P3417r7862m3225
17836B72647K1556K4737J36567L1908N182n7950r7790j7731O895L3135K259Q177
17824C69592J8040M505K8670j5254r8480r154K1662m1388l9763l0701p732r899
$$ plain form
17906 -17258 -24421 -78900 -43591 -105824 -157408 -153572 -165763 -221148 -254539 -240839 -156955 -130148
17894 -130148 -167805 -183121 -88435 -159819 -249510 -177798 -155890 -227869 -288556 -274317 -265511 -226979
17882 -226979 -132390 3819 208568 361543 467952 411886 303296 298151 283146 203850 218292
17871 218292 261364 230277 167198 217808 343098 364370 327350 241419 189905 207529 261130
17860 261130 267172 264617 245198 261361 360634 405746 342545 361622 321660 352027 398048 423880
17848 423880 408478 399128 420278 455980 385852 293455 249118 282191 340317 413734 315872 272647
17836 272647 294203 318940 455507 487415 492597 434647 336857 319126 326021 359156 361415 369592
17824 369592 387632 392137 420807 405553 307073 297919 319581 278193 238430 207729 199997 190098
17812A90098K0811j1608N2360O6463m9835q8302l8193Q326K4047J15695K3810
17801C13672r4336j0173j8440Q7454M0110o1328m2059L148P3835n1392L8756L2209
17789C11456j8013K4658L0894p7203K86N0896j2831n3968k6838K26K867O4069
17777B96499O373j03883q0278q6454p2178M4504P6996O351k8873P8371O6457J7673
17765B21558j8884q440N1927L6112l7599l3668n7254j4548J2073K9043o303N8495
17753B32512m2736o1136n4341k484O2026l1247k2530O4093J11828P010R031Q6313
17741C58339Q8226k8727n2952o0132k8339q6627k3846R2344Q4731J16445j2378
17730D47084k419k497N2545N102j7275J8805J23096N0325K4983R5099J17620M3459
$$ plain form
17812 190098 210909 199301 251661 318124 268289 179987 141794 150120 174167 289862 313672
17801 313672 219336 209163 190723 278177 318287 256959 214900 218048 291883 240491 279247 311456
17789 311456 293443 318101 348995 271792 272078 322974 310143 256175 229337 229563 232430 296499
17777 296499 302872 198989 118711 32257 -39921 4583 81579 87930 59057 137428 203885 221558
17765 221558 202674 194234 246161 282273 244674 211006 153752 139204 151277 180320 174017 232512
17753 232512 189776 128640 74299 71815 133841 102594 80064 144157 255985 262995 272026 358339
17741 358339 446565 417838 364886 304754 276415 189788 165942 258286 343017 459462 447084
17730 447084 444665 442168 494713 499815 482540 501345 624441 674766 699749 794848 912468 955927
17718I55927J46732P0215P6189M9699R2627P738M694j0444j13609r532M7945l4834
17706A283347l1626l0466N70n4798k3883p234O208n8210o6425J3914R0379K3818
17694A145594n565m3246q4088r0359q6996m7960l6973o5388l9778N0227q8643
17683F06825p7940L2634R0421p3114M365Q6292J0775N932m9861q0004j9200J4192
17671E51317j4580K4772m099L7654M469J993o1594O9657J12393K1224j9852J4488
17659G37842j471l2076Q4102p9994r5681L2478Q8187K0755L6925j3068K3269J08463
17647I09731Q3903J0860J1996K5463J04057O5423Q324M1126q0216Q988K03284
17636A392939J28479J81037J0758M6951J29040J23350O5536P2434K3394O1083
$$ plain form
17718 955927 1102659 1172874 1249063 1298762 1391389 1399127 1403821 1393377 1279768 1270236 1318181 1283347
17706 1283347 1251721 1221255 1221825 1167027 1143144 1135910 1142118 1083908 1017483 1031397 1121776 1145594
17694 1145594 1140029 1096783 1012695 922336 835340 787380 750407 685019 645241 695468 606825
17683 606825 528885 561519 651940 578826 583191 669483 680258 686190 636329 556325 537125 551317
17671 551317 536737 561509 557410 595064 599533 601526 539932 609589 721982 743206 723354 737842
17659 737842 736371 704295 788397 708403 612722 645200 733387 754142 791067 777999 801268 909731
17647 909731 993634 1004494 1016490 1041953 1146010 1211433 1219757 1260883 1180667 1189655 1392939
17636 1392939 1521418 1702455 1713213 1760164 1889204 2012554 2078090 2150524 2173918 2235001
17626B235001R7066N613R453R8924P8986O1860J2517j4915M0440R2348K07367
17615B924660K13883J97101J62819L28249L01182K45171K29706L50293L71233
17606E324297N66596N86182O97784P98292Q34942J009214J105607R83550R72388
17597A2878852R53070J074260J333539J526292J763650K209246K801308L267969
17589B7808186L768551M416757N031515N760004O554859P671347R571363J2983012
17581H3565594J8515261K6477388L8526724N6701513Q1188716J05346179J11525017
17574E21846392P6208324K428129q3846667j25578877j08762038p7104773m7508856
17567A57681634k7874547j6708175j0529149p298517n714476n361632n387139
$$ plain form
17626 2235001 2332067 2337680 2347133 2446057 2525043 2586903 2599420 2584505 2624945 2717293 2924660
17615 2924660 3138543 3335644 3498463 3826712 4127894 4373065 4602771 4953064 5324297
17606 5324297 5890893 6477075 7174859 7973151 8808093 9817307 10922914 11906464 12878852
17597 12878852 13831922 14906182 16239721 17766013 19529663 21738909 24540217 27808186
17589 27808186 31576737 35993494 41025009 46785013 53339872 61011219 70582582 83565594
17581 83565594 102080855 128558243 167084967 223786480 304975196 410321375 521846392
17574 521846392 598054716 600482845 516636178 391057301 282295263 205190490 157681634
17567 157681634 129807087 113098912 102569763 95271246 89556770 84195138 78807999
17560G8807999n444510n372371n050343m677114m262942l632133l157393k847909
17552D4363284k411329k249109k047282j830317j736294j648714j598281j592498
17544B9249460j597363j603664j419019j176207j146600j027303r01720p84750
17536A9592834n35678n44545n77008o32288n72319m36301l67742k84644j85979
17527A5456330k53005k62021k84203k50534j72805j96402j80978j94956j87959
17518A3473467j80462j69561n6767j07493j91825k29612j24192r7011j40125k43944
17508A1932475j60679j69241q4294o8682n7276j32837j04430l2875l8485m4770
17498A1038906m1838L2181P8336Q9844N0388j5216P5605J14742J63463R7669L3646
$$ plain form
17560 78807999 73363489 67991118 62940775 58263661 54000719 50368586 47211193 44363284
17552 44363284 41951955 39702846 37655564 35825247 34088953 32440239 30841958 29249460
17544 29249460 27652097 26048433 24629414 23453207 22306607 21279304 20377584 19592834
17536 19592834 19057156 18512611 17935603 17303315 16730996 16294695 15926953 15642309 15456330
17527 15456330 15203325 14941304 14657101 14406567 14233762 14037360 13856382 13661426 13473467
17518 13473467 13293005 13123444 13066677 12959184 12767359 12537747 12413555 12316544 12176419 11932475
17508 11932475 11771796 11602555 11518261 11449579 11392303 11259466 11155036 11122161 11083676 11038906
17498 11038906 10997068 11029249 11107585 11197429 11247817 11232601 11308206 11422948 11586411 11684080 11717726
17487A1717726n1333j09653k63462k27839k53806m30222l80865k90280k91904
17478I418362k83854l05803k47675k32293k22557j38445j54043j21085r3153j04727
17468G514727k01517k13996j80608j37324q8387n0672k3092j21188j16487j98264
17458F183192j61076j05148j2843L898n6094n9967N508L2790o1525q9511q7558
17447E591666j20324j72011j52612j05892j43064j45558j86503k62090k42143
17438D061469j53946j71003l11062k29065j35663k04933j63731j15200j44048
17429B432818j27876r8235j13022p6901j23724j21168j71781j61139q0443j0615
17419A347914M82j11065j29500j00235j16012p2156m6048l0520m6338q6892l5638
$$ plain form
17487 11717726 11666393 11556740 11293278 11065439 10811633 10381411 10000546 9710266 9418362
17478 9418362 9134508 8828705 8581030 8348737 8126180 7987735 7833692 7712607 7619454 7514727
17468 7514727 7313210 7099214 6918606 6781282 6692895 6642223 6619131 6497943 6381456 6183192
17458 6183192 6022116 5916968 5904125 5908023 5851929 5791962 5797470 5830260 5768735 5679224 5591666
17447 5591666 5471342 5299331 5146719 5040827 4897763 4752205 4565702 4303612 4061469
17438 4061469 3907523 3736520 3425458 3196393 3060730 2855797 2692066 2576866 2432818
17429 2432818 2304942 2206707 2093685 2016784 1893060 1771892 1600111 1438972 1358529 1347914
17419 1347914 1348396 1237331 1107831 1007596 891584 819428 773380 742860 696522 609630 573992
17408E73992J3134J6094P081l329p31l4479k9968L544m6995l8750q204r9264n3328
17395B98797K6168m477m3611J0075L9715K5796o6934n7713l0259m342k8656j3646
17383A50913j1396Q7075J30645k8277N5475N8229L4484J1441J6300o0180J7048
17372D61757N3251r387k3680m7502L3284P4542L0024l6741n5510O4000J14612
17361F58650p1887l2347P168q1041M0755J651K9305N6569N8409p9333L3383O1919
17349F83201p060J460j733K1620J6293l0542k6037n6596K6500R40J1249L269L6963
17336F79527N4366O0884j9561o1133p4701p90N7393m3601j4962J8663M876o1646
17324E99315Q748M2099j05638j6237J5259K5243J47046K7732n2723j5520l9354
$$ plain form
17408 573992 587126 603220 610301 606972 606241 571762 541794 545338 498343 459593 451389 352125 298797
17395 298797 324965 320488 276877 286952 326667 352463 285529 227816 197557 193215 164559 150913
17383 150913 139517 226592 357237 328960 384435 442664 477148 488589 504889 444709 461757
17372 461757 515008 505621 481941 434439 467723 542265 572289 535548 480038 544038 658650
17361 658650 586763 554416 561584 480543 521298 522949 552254 608823 667232 587899 621282 683201
17349 683201 676141 677601 675868 697488 713781 683239 657202 600606 627106 628046 639295 642564 679527
17336 679527 733893 794777 775216 714083 639382 638592 695985 652384 637422 656085 660961 599315
17324 599315 608063 650162 544524 528287 543546 568789 715835 743567 690844 675324 635970
17313F35970j35379r6723n1245J3400R643L2761J5510L9502j3630p8719L6064
17302D07154M3844M7086n4014m9260K7101m0412l5126j27010m7463L8675K5715
17291B36290J0064n1139J7495J00831K0159L8035m2014o1196p2446p2008P2357
17280A96428M4598j36669o6745j3399K1328n9604k0506l9399n3122p8879n7789
17269b63758K267J09852P9151J86247K73852J77635Q254j12921j22062k5942p2179
17258B40396j37148J3392O3174L1532l2281m0059N5575k1149l9970M7434K3569
17247B04465P1941j4960K0041j3096m5909n5303L5669o8528K9919M7611m91O057
17235B17416l86j0428j6937o3342J8453L9060N4919j4649J0097N1551l1117j830
$$ plain form
17313 635970 500591 403868 352623 366023 375666 408427 423937 463439 449809 371090 407154
17302 407154 450998 498084 444070 394810 421911 381499 346373 219363 171900 210575 236290
17291 236290 246354 195215 212710 313541 333700 371735 329721 268525 196079 124071 196428
17280 196428 241026 104357 37612 24213 45541 -14063 -34569 -73968 -127090 -205969 -263758
17269 -263758 -261491 -151639 -72488 113759 387611 565246 573500 460579 338517 312575 240396
17258 240396 103248 116640 179814 211346 179065 139006 194581 173432 133462 180896 204465
17247 204465 276406 261446 281487 268391 222482 167179 202848 134320 164239 211850 211359 217416
17235 217416 217030 206602 189665 126323 144776 183836 238755 224106 234203 285754 254637 252807
17223B52807P3761j8689K7823j4881k8819L5938K2405L6869L4751p2188k3411
17212C26366n4794J0040p7202O6151k2624k4534K5363k8311Q2683P8507j09585
17201B72060r7617r706l5222j2587M414J08234M8146o0801J3759O9359k8127N0158
17189C22070j6873K3667R23o6351o5337j0424O7988K5130o0305L3999P6173L1465
17177C62125j3420j2106n6532l7144j7425J3218O9957O6401M387k1905j06531
17166B51025P2835R1414M9127j3849q2785K3905K4561k8363j2787o6103j7038
17155B91942j14552j1681J02526L1891J5115M3700m6321j8826L0219q5244j21084
17144A17685J9228M8031J3512l951l2545n747N3042n5801n2481O2257J12222L7445
$$ plain form
17223 252807 326568 307879 335702 320821 292002 327940 350345 387214 421965 349777 326366
17212 326366 271572 281612 204410 270561 247937 223403 248766 220455 303138 381645 272060
17201 272060 174443 164737 129515 116928 121342 229576 277722 216921 230680 300039 271912 322070
17189 322070 305197 328864 329787 263436 198099 187675 255663 280793 220488 254487 330660 362125
17177 362125 348705 336599 280067 242923 225498 238716 308673 375074 379461 357556 251025
17166 251025 323860 415274 464401 450552 367767 391672 416233 387870 375083 308980 291942
17155 291942 177390 165709 268235 300126 315241 358941 312620 293794 324013 238769 117685
17144 117685 136913 184944 198456 194505 161960 156213 209255 153454 100973 163230 275452 312897
17132C12897j45789n1408K7463O1703j1393J5139j5141k3925L0496K8333K2590
17121B50965k01R1467Q7115O4494k7792k1932K2053K8405k634J8283k1086j36024
17109C53113o1622q5460N8j2022m3803K0726N2159Q508M9514R1771M7832L0092
17097D50866k3584p0319o690j4003n2843j6424K8316n999M6109M1566n7464k974
17085C16557N2342O1258L8466P5581O2137k3405q6424K4173j4594k8044l3292
17074D44755L8389L3540k7192N0254M1913J1670N1520k2473n5782L7145L0078
17063F33817l1030o0992k2961M2512q1856n6858L6432l1656N952N7991P8798k6255
17051E43894p9598J9513l5823k9849k1476M5224O1272m0589r1071m9181J5196
$$ plain form
17132 312897 167108 115700 143163 204866 193473 208612 193471 169546 200042 228375 250965
17121 250965 250764 342231 429346 493840 466048 444116 466169 494574 491940 510223 489137 353113
17109 353113 291491 206031 206089 194067 150264 170990 223149 231657 281171 372942 420774 450866
17097 450866 427282 356963 350273 336270 283427 267003 295319 289320 335429 376995 319531 316557
17085 316557 368899 430157 468623 544204 606341 582936 496512 520685 506091 478047 444755
17074 444755 483144 516684 489492 539746 581659 593329 644849 622376 566594 603739 633817
17063 633817 602787 541795 518834 561346 479490 422632 459064 427408 433360 491351 570149 543894
17051 543894 464296 483809 447986 418137 396661 441885 503157 462568 371497 322316 337512
17040C37512m1522N0851N0284j679O6122N871N492O6884j9743p3749M3959j4230
17028D76052j7942q6359k6995O3713l6581k231J4668N0407m0405l4880n815K6163
17016C79795O8144O7334R939M1591k6672n5448q7988M3017j5400o7514q9121p426
17004B60251L1742K3400j7565L1188j7449r9367k8691k2185o7776m8318j0724
16993C4506J109L4918k2936q5799J0623P8758K6970O1821k74j0539k5882k8093
16981G5182N6744J00673j8241l8161j9869J3341L1588o5346j27647r007L5225
16970C4482J5991Q0731l536n5607K0806P3271J9513m1270k7550m1974O750q649
16958G2958J3206N569p825L1253K7935k4924q107M383J9396k222o9429J4967K8317
$$ plain form
17040 337512 295990 346841 397125 395446 461568 467439 472931 539815 520072 446323 490282 476052
17028 476052 458110 371751 344756 408469 371888 369657 384325 434732 394327 359447 353632 379795
17016 379795 447939 515273 525212 566803 540131 484683 396695 439712 424312 356798 267677 260251
17004 260251 291993 315393 297828 329016 311567 212200 183509 161324 93548 45230 34506
16993 34506 35615 70533 47597 -38202 -27579 51179 78149 139970 139696 129157 103275 75182
16981 75182 131926 232599 214358 176197 156328 169669 201257 135911 8264 -743 34482
16970 34482 50473 131204 127668 72061 92867 166138 185651 144381 116831 74857 81607 72958
16958 72958 86164 91733 83908 115161 143096 118172 110065 114448 133844 131622 62193 77160 105477
16945A05477P674N9246K0047l422j695N3067O956j03604r1061r3320m7299O9382
16933a8552M7513M9692P1600L6029J0182k8443j4777J9958k0862o0918j6946j9436
16921E5040j1630k5874L4427o1834o5071N0261R7436J6134J279P6195L6342m1294
16909A61411n8784l430q872j9538J1168M1230L3333J6727l4248p7080o6970M7260
16897D2207J0461o2464l8078M2168R8450j02843j19912R0816J16165m0159l3497
16886C314l8827K396K1241P950J9779L0728p2006o1885l7356K4366N2185P5917
16874B7802Q3440K8100K3582P3376j798J6763O528j9116o3742j63048m8300P6943
16862D0530N7481o9612j04045M586Q039q9553k871O6666M3834p995K6429K1590
$$ plain form
16945 105477 113151 172397 192444 189022 187327 240394 247350 143746 52685 -40635 -87934 -18552
16933 -18552 28961 78653 150253 186282 196464 168021 153244 173202 152340 91422 74476 55040
16921 55040 43410 17536 51963 -9871 -74942 -24681 72755 88889 90168 166363 202705 161411
16909 161411 102627 99197 90325 70787 81955 123185 156518 173245 138997 61917 -5053 42207
16897 42207 52668 -9796 -47874 -5706 92744 -10099 -130011 -39195 76970 36811 3314
16886 3314 -35513 -33117 -11876 -3926 15853 46581 -25425 -87310 -124666 -100300 -48115 27802
16874 27802 111242 139342 162924 236300 234502 251265 257793 238677 174935 11887 -36413 40530
16862 40530 98011 28399 -75646 -71060 -63021 -152574 -155445 -88779 -44945 -52940 -26511 -4921
16850d921o8802j2274L4958P9033Q3470K9139o602Q1675q929k7658l0831k6657
16838A21601n4907q6985N9931N172Q2295j0173Q55k1919k852K1162r6191p8307
16826f0318K9555K0379M1724k4604j3529l7081k597N7448M16K0758k3320N444
16814A4275Q0559p6364q3200J4162R806N369p941r214k5924M1592R4911Q3702
16802A41733l8342N416o6352n0048M5266M3121K693o4459L0566J5211l290K3898
16790H5413j8693o0525n3124R4127M6786m7354K8658r07k9231n8390m4173l8104
16778i5517K4538R061l9453J6722M341R8250N1229L524p9550M3918n9543o8592
16766i1072N6529p944J6723N468K834R019M3671O389N5814M0262o4244p7948O8146
$$ plain form
16850 -4921 -73723 -85997 -51039 27994 111464 140603 134001 215676 206747 179089 148258 121601
16838 121601 66694 -20291 39640 44812 127107 116934 117789 95870 93018 114180 17989 -60318
16826 -60318 -30763 -10384 31340 6736 -6793 -43874 -46471 10977 11393 32151 8831 14275
16814 14275 94834 18470 -64730 -50568 -40762 -35393 -43334 -52548 -78472 -36880 58031 141733
16802 141733 103391 108807 42455 -7593 37673 80794 83487 19028 49594 64805 61515 85413
16790 85413 66720 6195 -46929 47198 93984 46630 75288 74381 45150 -13240 -57413 -95517
16778 -95517 -70979 -61918 -101371 -84649 -80308 17942 69171 72695 -6855 37063 -22480 -91072
16766 -91072 -34543 -42487 -25764 -20296 -17462 -8443 35228 41617 97431 137693 73449 -4499 63647
16753F3647M6100k1440K8160J7784n2223M9465J683M0015q913j6436J2303l014
16741A57131o8158q8602j3974P2743L8941l2022q925l1454q0851M5870N5874q5016
16729c8443n5468m1149k465K7297k9457K3086N0406N4921l9397P6953Q8846k1703
16717I3427p2250j0626M6031m98r900n0523O5660M9792j13795l9451N5900Q595
16705B2362O142l9392j9180K3038O6046l0566m4513L5246L4389K3534j7992j9140
16693C9974j7147R739l619N9860M9312r166p3089L819J8466q180n6309n6592j10437
16680a53369o5182k1267P5786M7444L1043J00643N2901N1174o793k8482M931k5641
16668F3188l181j2949n3918l0644J7535Q9633Q0984p2512n3242l781Q1401k37
$$ plain form
16753 63647 109747 88307 116467 134251 82028 131493 133176 173191 164278 147842 160145 157131
16741 157131 88973 371 -13603 59140 98081 66059 57134 25680 -55171 -9301 46573 -38443
16729 -38443 -93911 -135060 -137525 -110228 -139685 -116599 -66193 -11272 -50669 26284 115130 93427
16717 93427 21177 10551 56582 56084 46184 -4339 61321 111113 -2682 -42133 13767 22362
16705 22362 28504 -10888 -30068 -7030 59016 28450 -16063 19183 53572 77106 59114 39974
16693 39974 22827 32566 28947 88807 138119 128953 55864 59683 78149 69969 13660 -42932 -153369
16680 -153369 -218551 -239818 -164032 -116588 -85545 15098 67999 119173 112380 83898 88829 63188
16668 63188 60007 47058 -6860 -37504 -19969 69664 150648 78136 24894 21113 102514 102277
16656A02277n1284m7612k9233k9299p903Q257j9190l96l4347j0799K2828J18817
16644B2116Q2323k4264n6187q9207k937K9042N7911l2828o3690k7112N9997k7005
16632g1841M4030O5575J76l8564p597m0540N2n180P2591R1861J8716l619K8545
16619A54205J8555k6762n5679p9399l3192j7981m1911K7754L69J38446M3393j5912
16607A11886q2793j05793j1789J1693j9112O9218L2211k0138p4294p221J10584
16596A4452l845L0463L4968O0381M7294P7258n3603p4633n9727m8473M3080j4799
16584E2816j0783l7215j30094n160L2644o5136l539J8127N1671q193K8570R4177
16572A7885N2804L4932K6789L0912p7647q3162m1859O4404k1766k5312n3033M8220
$$ plain form
16656 102277 50993 3381 -25852 -55151 -63054 -54797 -73987 -74383 -108730 -119529 -96701 22116
16644 22116 104439 80175 23988 -65219 -68156 -39114 18797 -14031 -77721 -104833 -44836 -71841
16632 -71841 -27811 37764 37940 -624 -8221 -48761 -48709 -53889 18702 110563 129279 125660 154205
16619 154205 172760 145998 90319 10920 -22272 -40253 -82164 -54410 -54041 84405 127798 111886
16607 111886 29093 -76700 -88489 -76796 -95908 -26690 5521 -14617 -88911 -96132 14452
16596 14452 10607 41070 76038 136419 183713 260971 207368 132735 73008 24535 67615 52816
16584 52816 42033 4818 -125276 -130436 -97792 -162928 -166467 -148340 -96669 -104862 -76292 17885
16572 17885 70689 105621 132410 163322 85675 2513 -39346 25058 3292 -22020 -75053 -26833
16560b6833j355J8209Q6964J06627l1036n4772l0261j1979k9434J00865Q2047
16549B09042P074p4500m3016k0460k224k9045m6306K2448L2324l0945k2261k0122
16537a7991k5839P1938L1000J0004J1329K8196q7157n6083j9025r0357M688R4662
16525d4635N8547K6891o1101P8229J7696n4130n1184J1808n887N7158l6057o2884
16513f5549o388R495K4356M709k5976M6378J38792m0204n8417j62q3237J196k5483
16500h0490M7178o9037r710Q1624M4996l6374n199J3039R522o0645k5238J10546
16488B0212P3409n4049o491m9761j06213J5443N0010J4063m5449j0597l7289j6664
16476a53376L5388K4442K5154L1728n7898o7154p991J1561M6929N998N1423P5201
$$ plain form
16560 -26833 -28188 -9979 76985 183612 152576 97804 67543 55564 26130 126995 209042
16549 209042 216116 141616 98600 78140 75916 46871 565 23013 55337 24392 2131 -17991
16537 -17991 -43830 28108 59108 69112 80441 108637 21480 -34603 -53628 -143985 -139297 -44635
16525 -44635 13912 40803 -20298 57931 75627 21497 -29687 -17879 -23766 33392 -2665 -65549
16513 -65549 -71937 -62442 -38086 -33377 -59353 -12975 125817 85613 27196 27034 -56203 -55007 -80490
16500 -80490 -33312 -102349 -112059 -30435 14561 -21813 -27012 -13973 -4451 -65096 -90334 20212
16488 20212 93621 39572 33081 -16680 -122893 -107450 -57440 -43377 -88826 -99423 -136712 -153376
16476 -153376 -117988 -93546 -68392 -36664 -94562 -161716 -169707 -158146 -111217 -105219 -53796 21405
16464B1405J5016R945n0203l2472l4879m430L7174m159n5529K7937R9459j5969
16452A3295J5119n2520m8119J5543j1549O8267P1702r7393l7536k6121p4102p4243
16440b37657m1279J05317L8103r124K1093j8971L2242k2214M4909R1468N0413
16429E4300M0216J07082o3742q3660o3020l7084o891n9474n3406R550j0417O2282
16417a04264Q8596j0487n5989j0043j6727p2722l3256J27802M2636J0567m218
16406c8105p9315N8373R5104P6378N4117m3887p8231n5619j4839k13M2699K3833
16394D0295M9089J167m8565L8688Q840m404M1656J6626k6305p8178m1376p6018
16382g8485p958K7967K8041R1087M016k4440n0593K7118r236j8026J5132p442
$$ plain form
16464 21405 36421 46366 -3837 -36309 -71188 -75618 -38444 -42603 -98132 -70195 29264 13295
16452 13295 28414 -24106 -72225 -56682 -68231 36 71738 -25655 -63191 -89312 -163414 -237657
16440 -237657 -278936 -173619 -135516 -144640 -123547 -142518 -110276 -132490 -87581 3887 54300
16429 54300 94516 201598 137856 54196 -8824 -45908 -52799 -112273 -165679 -156129 -166546 -104264
16417 -104264 -15668 -26155 -82144 -92187 -108914 -181636 -214892 -87090 -44454 -33887 -38105
16406 -38105 -117420 -59047 36057 112435 166552 122665 44434 -11185 -26024 -26237 16462 40295
16394 40295 89384 90551 41986 80674 89514 85110 126766 143392 117087 38909 -2467 -78485
16382 -78485 -86443 -58476 -30435 60652 64668 40228 -10365 16753 7517 -10509 4623 -2819
16370b819O028O3100O2884N7707r9433r1008m1289O9878J42002r2946K6379J4474
16358A14957r4613j2546L1544K9538o258q5569O459P9196m9393m0293M5718M3423
16346F2163l4480l6983j6255P788K9799n0687m4589R0712K9756N090k0788q5344
16334f3818n8999L5696n48R0736J04175P826m2934K1832p8841k5526o1981l2224
16322a04606O0658L4298K2292j1917L2113k4398m1135l066N0381K2611R938K1384
16310F8553K3847m1700n2540k4356m6535j35336P6754J47644l1765k3662O5974
16299B6878N7716n2723j39781m0421J1845O0771L1341J8113N294m848l3321J3360
16287d5776q0017p3104M8408Q8870J28525M8758o5356q4329J6138o890k8966j0286
$$ plain form
16370 -2819 3209 66309 129193 186900 87467 -3541 -44830 25048 167050 74104 100483 114957
16358 114957 20344 7798 39342 68880 62622 -22947 -16488 62708 13315 -26978 18740 62163
16346 62163 27683 -9300 -25555 -17767 12032 -38655 -83244 7468 37224 42314 21526 -63818
16334 -63818 -122817 -87121 -87669 3067 107242 115068 72134 93966 15125 -10401 -72382 -104606
16322 -104606 -43948 -9650 12642 725 32838 8440 -32695 -35761 14620 37231 47169 68553
16310 68553 92400 50700 -1840 -26196 -72731 -208067 -131313 16331 -15434 -39096 26878
16299 26878 84594 31871 -107910 -148331 -136486 -75715 -44374 -26261 -20967 -25815 -59136 -45776
16287 -45776 -125793 -198897 -150489 -61619 66906 115664 50308 -34021 -17883 -24773 -53739 -64025
16275f4025O2703M3562m138K5163j469l3475m8771n2412L8272j12374K0110N0366
16263g6488L2982J1776J13931L8871n7992j03652j812R2818Q4841l1952n5013
16252D8310O7355M5751o5337q2961l0490n4359m0546O4699k2780l326p289Q2205
16240A232k564R667J7481n784R748o3924l6549p1311P1177Q4169P3884J522P103
16227I5851j28943K2070l8529j7745J8785m949P6936n2133k1454L5754N3733k0633
16215A8743K2405Q044L0162M3007K7177k6075j7327o0377n2995q0790n259Q2879
16203a0406J10136K8519l0602p6575M439O9533K7795j19636K845K8506n7840m344
16191b7630j9501j17462j8211l2871K8548J36149O8635N1538K7989k3123l6178
$$ plain form
16275 -64025 -1322 42240 38102 63265 61796 28321 -20450 -72862 -34590 -146964 -126854 -76488
16263 -76488 -43506 -31730 82201 121072 63080 -40572 -42384 50434 135275 103323 48310
16252 48310 115665 161416 96079 13118 -17372 -71731 -112277 -47578 -70358 -73684 -80973 1232
16240 1232 -1332 8335 25816 20032 29780 -34144 -70693 -142004 -70827 13342 87226 88748 95851
16227 95851 -33092 -11022 -49551 -67296 -48511 -53460 23476 -28657 -50111 -14357 39376 18743
16215 18743 41148 49192 79354 122361 149538 123463 106136 45759 -7236 -88026 -93285 -10406
16203 -10406 99730 128249 97647 21072 25511 95044 122839 3203 6048 34554 -23286 -27630
16191 -27630 -47131 -164593 -182804 -215675 -187127 -50978 17657 69195 97184 74061 37883
16180C7883m5161r1538l4258J5818J28489R3770P5546p6376R307j6489r0396o8291
16168f1696k2624L8332p453K813m9274L8736N9813L0222m3176n0520p352j438
16156g3617j3933L6730O156m7010J34521Q646m746l9080o1019M9566J6066l868
16144H412K2124P4946j25498m5225P8666n0932n0365O9427m511K5995n3713o847
16132e7521k1420k8435J12491J3817m1931L34m5015m868J5010J4423P2008N4284
16120H3177n9517o9160q8344O4963J06588O648n6925k2137j05972M7028J4351
16109g9300J2441j6417j8049R2800J7947r4203M096M7170K0196N0448M394k5245
16097A6278N0425l9908l1908J4626L1305J0198k082l7278R804L9206l4178k944
$$ plain form
16180 37883 -7278 -98816 -133074 -117256 11233 105003 180549 104173 113480 96991 6595 -61696
16168 -61696 -84320 -45988 -53441 -50628 -99902 -61166 -1353 28869 -14307 -64827 -72179 -73617
16156 -73617 -87550 -50820 -44664 -91674 42847 51493 46747 7667 -53352 -3786 12280 8412
16144 8412 30536 105482 -20016 -65241 13425 -37507 -87872 -18445 -22956 3039 -50674 -57521
16132 -57521 -78941 -107376 5115 18932 -22999 -22665 -67680 -72548 -57538 -43115 28893 83177
16120 83177 23660 -45500 -133844 -68881 37707 44355 -12570 -34707 -140679 -93651 -79300
16109 -79300 -66859 -83276 -101325 -8525 9422 -84781 -80685 -33515 -13319 37129 41523 16278
16097 16278 66703 26795 -5113 9513 40818 51016 48934 11656 21460 60666 26488 23544
16085B3544M774l836K1998k3061o072m4386k6199M5091K1544l0334k4921N2025
16073A0167L7650j312n2478k32J7924q887M5396J6446j8216m957O2238J329M418
16060A09486p9230l2060O501l8375L4975N7529N5036n7884o5137M0274M0727r553
16048F2289j6919J273P1362R3153p2340q423J0400j45876j7486K7644J8143K7741
16036E0961K3153p5904q1145j8081n5728M3661J16584J44140P4870n9014l5552
16025A27945j14061o8822k0202m3295M6942O0236K9076j06721j0179J7168l9821
16014a21734j7117R5963P4722J0308j22232L9087J2820J5001j8437r303J0029
16003c0893l1528R066N5170m3365M5933M3460o705r7159l9148k7679k8754K3639
$$ plain form
16085 23544 28318 24482 46480 23419 17347 -27039 -53238 -8147 13397 -16937 -41858 10167
16073 10167 47817 46505 -5973 -6205 11719 2832 48228 64674 46458 41501 103739 105068 109486
16060 109486 30256 -1804 4697 -33678 1297 58826 113862 55978 -9159 31115 71842 62289
16048 62289 45370 46643 118005 211158 138818 130395 140795 -5081 -22567 5077 23220 50961
16036 50961 74114 -1790 -82935 -101016 -156744 -113083 3501 147641 222511 163497 127945
16025 127945 13884 -54938 -75140 -118435 -71493 -11257 17819 -88902 -99081 -81913 -121734
16014 -121734 -138851 -42888 31834 42142 -80090 -41003 -28183 -13182 -31619 -40922 -30893
16003 -30893 -62421 -53355 1815 -41550 4383 47843 41138 -56021 -95169 -122848 -151602 -127963
15991a27963l939L8763K7525M3506O2829M2072q3834M8030N7776J5992L240k3285
15979A00712l0912o8154L0115K2251m1306L4359O715j5842n1895L5078l4309J1799
15967a389K0131K3324k5037K3684P6710k800K7608p0737o8929K967M4774J8932
15955F9238j5074r1556j622K6683M7975O7120K9112j23412n6448J8340l3180j2035
15943g4859M8493K3286m2503N593N6467n734J5394m8990o2640N2822J540K6639
15931d492L0555P419r3770r7025j0970Q310Q1489P4206l8700l9287O0834J0858
15919a0573l8204K3209j1088n532J4410Q2650O7027o3804r5909K508K6902j1779
15907b0183p3180j57161k7806R3888Q0928J10109O4195n2379l5670P5490k953
$$ plain form
15991 -127963 -131902 -93139 -65614 -22108 40721 82793 -1041 46989 104765 120757 123997 100712
15979 100712 69800 1646 31761 54012 12706 47065 53780 37938 -13957 21121 -13188 -1389
15967 -1389 18742 42066 17029 40713 117423 114623 142231 71494 2565 5532 50306 69238
15955 69238 54164 -37392 -39014 -12331 35644 102764 131876 8464 -47984 -29644 -62824 -74859
15943 -74859 -26366 -3080 -45583 -39990 16477 10743 26137 -22853 -85493 -32671 -31131 -4492
15931 -4492 26063 33482 -60288 -157313 -168283 -159973 -78484 -4278 -42978 -82265 -21431 -10573
15919 -10573 -48777 -25568 -36656 -42188 -27778 54872 121899 58095 -37814 -35306 -8404 -20183
15907 -20183 -93363 -250524 -278330 -184442 -103514 6595 70790 18411 -17259 58231 55278
15896E5278L161l540m2454j1107P4658r345p6445M813O9667N8607L390K9580j03237
15883E3026r8044j5846N9784M4898j6275l0704r058l0211j5581L7175L3399n2585
15871d0022N0557j1928J2730l4899j08159L5120p4545K5581O6657l867r808M5265
15859d7318K3356j7667p797J8129l1065Q496L3506J2479n7517M0069M5984l3649
15847a2994r3980l902N4141p2967q765P1447R5998L9275n2507L3008L799l7222
15835A5331p8386J01954N4745o3951k2808p6395j03645m361Q5699M2371k1669
15824g1115M0581j2592k6245l9245n5740j5886L2478O7406K2646O4141R603L0091
15812D6123L6318J3170m9544p1695l1380K5590L2650n611M2670j5902k4164L7558
$$ plain form
15896 55278 58439 54899 12445 1338 75996 66651 -9794 -4981 64686 123293 126683 156263 53026
15883 53026 -45018 -60864 -1080 43818 27543 -3161 -12219 -42430 -58011 -20836 12563 -40022
15871 -40022 10535 -1393 11337 -23562 -131721 -96601 -171146 -145565 -78908 -82775 -92583 -47318
15859 -47318 -23962 -41629 -49426 -31297 -62362 -53866 -20360 -7881 -65398 -25329 20655 -12994
15847 -12994 -106974 -110876 -56735 -129702 -138467 -67020 28978 68253 15746 48754 52553 15331
15835 15331 -63055 38899 93644 29693 6885 -69510 -173155 -177516 -91817 -49446 -71115
15824 -71115 -30534 -43126 -69371 -108616 -164356 -180242 -147764 -80358 -57712 6429 16032 46123
15812 46123 82441 95611 46067 -25628 -57008 -31418 1232 -4379 38291 22389 -1775 35783
15800C5783P0507l4447j53484j07857P5451N6351K214O0734M952M5848O101M1752
15788A03905J3775r1302r8228l3036L9441N3909L3402N7198r9290o7079l9117
15777a26422N5062Q1477l4527p7834m1355M5159O0416J193n5458l6322Q187J24457
15765D033P9189k392o705Q0843N342r9092n7532L2430k7295m6968L5589N7436
15753E4878O9744N9891l6054j0165k760J361r2293l3221M5643p7399l179M3191
15741A9637j3653j4673k2423Q4802P4759K989q477o9060p0604M8901K5456j6036
15729D1618k7269m4813m8413J4951j4652J02139Q9414n2384K7993k3871O237M1118
15717A12068J8522p57m1378m7287K6269J068j10l8993l1322J6789n4070j5936
$$ plain form
15800 35783 106290 71843 -81641 -189498 -114047 -57696 -55482 5252 10204 56052 62153 103905
15788 103905 117680 26378 -71850 -104886 -65445 -11536 21866 79064 -20226 -87305 -126422
15777 -126422 -71360 10117 -24410 -102244 -143599 -98440 -38024 -36831 -92289 -128611 -120424 4033
15765 4033 83222 80830 74125 154968 160310 61218 3686 36116 8821 -38147 -2558 54878
15753 54878 124622 184513 148459 138294 135534 136895 44602 11381 57024 -20375 -23554 19637
15741 19637 5984 -8689 -31112 53690 128449 131438 122961 53901 -16703 32198 57654 41618
15729 41618 14349 -30464 -78877 -63926 -78578 23561 112975 60591 88584 64713 70950 112068
15717 112068 130590 129833 88455 41168 67437 68505 68395 29402 -1920 14869 -39201 -55137
15705e5137O8779R3043L1435n4386j7523L0306k1139l7416Q0325M1869j27216
15694C2940j58519l1765p3321L6403N5383J33157M6120l2399k8530k9573k6571
15683g6675j1480n5634l3318j3369O1862R213L8175N2200j3634o1219L1515J8242
15671e4122k934k0052k65L7213k0229J9933N5204O1969r144J3230q1794m3827
15659d4818J9441N778l5259J9987J3273p8710M8339J23366q9998j16049O0877
15648g3773k6781L1523j52j1093K3894P731J6514N5527j7263p211j8296m5214
15636f4594L9526J1326l4154j5272M9468p5016m4918o4457K1122j1115k0998L203
15624b05879Q4675M6585O414k8718k0260m2028n4750K5027J17354L0485K2862
$$ plain form
15705 -55137 13642 106685 138120 83734 66211 96517 75378 37962 118287 160156 32940
15694 32940 -125579 -157344 -230665 -194262 -138879 -5722 40398 7999 -20531 -50104 -76675
15683 -76675 -88155 -143789 -177107 -190476 -128614 -119401 -81226 -29026 -42660 -103879 -72364 -54122
15671 -54122 -57056 -77108 -77373 -40160 -60389 -40456 14748 76717 67573 80803 -991 -44818
15659 -44818 -25377 -19599 -54858 -34871 -21598 -100308 -51969 71397 -18601 -134650 -73773
15648 -73773 -100554 -69031 -69183 -80276 -56382 -48651 -32137 23390 6127 -1084 -19380 -64594
15636 -64594 -25068 -13742 -47896 -63168 -13700 -88716 -133634 -198091 -176969 -188084 -209082 -205879
15624 -205879 -121204 -74619 -68205 -96923 -117183 -159211 -213961 -188934 -71580 -41095 -18233
15613a8233l531j3386n5180J511J48283M9501l6692J2444o5417N890j4488o5771
15601e5069J008N603N2394q785Q984P7215k5367j07828O528N0568O0031J5572
15589H0854r0559k8616m7648L7475M3558l8789j601O3973n1304M7913J01305R433
15577A25994Q591q680r0845L6432P030l2452J6902o769m4847j9843L4780K2531
15565D8824J64j51029o845J26066K3339j3411Q965o9824p6858O2185M9025m8219
15553d7618O582M902J3546o1051n3451K6729k2419p683Q4737M9775n5411L6568
15541b4794J6765O1729p3448k8052k6141P9360J0626k6143N6543P001K0131M9089
15529A22666N5166K3857m2239m3350k2795j5826j6667p9977L027J04038K6072
$$ plain form
15613 -18233 -21764 -35150 -90330 -88819 59464 108965 72273 84717 19300 25190 10702 -55069
15601 -55069 -54061 -48458 3936 -4849 4135 81350 55983 -51845 -45317 5251 65282 80854
15589 80854 -9705 -38321 -85969 -48494 -4936 -43725 -45326 18647 -32657 15256 116561 125994
15577 125994 134585 125905 35060 71492 78522 46070 62972 56203 11356 -8487 26293 48824
15565 48824 48988 -102041 -108886 17180 40519 27108 36073 -33751 -110609 -48424 601 -47618
15553 -47618 -41036 -36134 -22588 -83639 -137090 -110361 -132780 -140463 -55726 -5951 -61362 -24794
15541 -24794 -8029 53700 -19748 -47800 -73941 5419 16045 -10098 46445 53446 73577 122666
15529 122666 177832 201689 159450 116100 93305 77479 60812 -19165 -16138 87900 113972
15518A13972k0551n8088j05700O806J12385o232k9816m4381J8609N3531O7485
15507A08020k4589r1362n4626J592J9672m0207k2528N9307N6581M3561m0839J8332
15495C2914P0059L0349l5930o41J4515q0450j4100o3309j18832l8882Q9486R2039
15483b2782O4367l6381q835L4257j7293M0857L4866n821j0882n8048L7391L3180
15471H4876J1017k2168l5684p4439n8743K6233N4332R7454l9232p1700o665K7812
15459f907L1037q2464p2946M8900r331N5526J4007L8495O3906N2588j9492n4212
15447E9107n8179l0428q8455q082k164L5052M9399O7666M1305o1239r7137M9920
15435d3235Q9148J0640J7744j7809j10803m2132K3822M7784K2815k6060K1460
$$ plain form
15518 113972 93421 35333 -70367 -63561 48824 42592 12776 -31605 -12996 40535 108020
15507 108020 83431 -7931 -62557 -60965 -41293 -81500 -104028 -44721 11860 55421 14582 32914
15495 32914 102973 133322 97392 96751 111266 30816 16716 -46593 -165425 -204307 -114821 -22782
15483 -22782 41585 5204 -3631 30626 13333 54190 89056 83235 72353 14305 51696 84876
15471 84876 95893 73725 38041 -36398 -95141 -68908 -14576 82878 43646 -28054 -34719 -6907
15459 -6907 24130 -58334 -131280 -82380 -91711 -36185 -22178 16317 80223 132811 113319 59107
15447 59107 928 -29500 -117955 -126037 -128201 -93149 -43750 23916 65221 3982 -93155 -43235
15435 -43235 45913 56553 74297 56488 -54315 -96447 -72625 -24841 -2026 -28086 -6626
15424f626O7577j8450j150k4733M7055N4584j2115o7581m2460l5936L4912L6430
15412C1507O3106p0615Q003J0035p249p4976J0601O0201K1195N1582n3796j05369
15400e5775L3325N5956m5746j7142K0601k1284K3545J0363n0880n6232q141K6050
15388h5360M5059j0330j6594n4276k7277O5183P3061L0372J0123K9495m5275j68233
15376a54052L0906P6747M2093m0265k3694L988n7800j2478L5553N7527L8157m9192
15364e2510o7138P6730K9432M3404K1804l454O2176m8362K3903j18194n4374O7616
15352a8967j2200n7308k4210M2741n1312K5118J0182J0278l5705K3911k427K1233
15340f8666K9044J1165m496K7623l5276L4481n631o4033m2444p1927J10305R4388
$$ plain form
15424 -6626 60951 42501 41351 16618 63673 118257 106142 38561 -3899 -39835 -4923 31507
15412 31507 94613 23998 32001 42036 34787 -40189 -29588 30613 51808 103390 49594 -55775
15400 -55775 -22450 33506 -12240 -29382 -8781 -30065 -6520 3843 -47037 -103269 -111410 -85360
15388 -85360 -40301 -50631 -67225 -121501 -148778 -83595 -10534 19838 29961 59456 14181 -154052
15376 -154052 -123146 -46399 -4306 -44571 -68265 -64277 -122077 -134555 -99002 -41475 -3318 -52510
15364 -52510 -119648 -42918 -13486 29918 51722 48268 110444 62082 85985 -32209 -86583 -18967
15352 -18967 -31167 -88475 -112685 -69944 -121256 -96138 -85956 -75678 -111383 -87472 -89899 -68666
15340 -68666 -39622 -28457 -32953 -5330 -40606 -6125 -11756 -75789 -118233 -190160 -79855 14533
15328A4533l5005q1791J9743n2242Q7562r934j1711l6762j0954O5126J2124j1687
15316e0998l1222O81M8705J093o0577J0978K7972j1367K5975j3242j7061O2834
15304f229K4759n9205J2398L3069O2771j1922r4619n4651k9952O8618O6284J9048
15292C0369N461j5466o3343m6145N7780r4067O0017R8488L0609l6926q3887L027
15280e4083O977J7933J01188L676l0345j02804l6561R6655O2690m6240j5861O8682
15268G1907M9626M4923P248r6335j2952L7631l936J03757n462o9236m7457k8647
15256E1067O712j5926j5958j09351o3663M3357O5517P4915m2830L7894N6830N547
15244I4111j2523l9759n0210O304M3622P8449P3591R731r1139m8672l3498k3497
$$ plain form
15328 14533 -20472 -102263 -82520 -134762 -47200 -57134 -68845 -105607 -116561 -51435 -39311 -50998
15316 -50998 -82220 -81539 -32834 -31741 -92318 -81340 -53368 -64735 -38760 -52002 -69063 -6229
15304 -6229 18530 -40675 -28277 4792 67563 55641 -38978 -93629 -123581 -54963 11321 30369
15292 30369 35830 20364 -42979 -89124 -31344 -125411 -65394 33094 63703 26777 -57110 -54083
15280 -54083 -47106 -29173 72015 75691 45346 -57458 -94019 2636 65326 19086 3225 71907
15268 71907 121533 166456 173704 77369 64417 102048 98112 201869 196407 127171 79714 51067
15256 51067 57779 41853 25895 -83456 -147119 -103762 -38245 36670 -6160 31734 88564 94111
15244 94111 81588 41829 -8381 -2077 41545 119994 193585 203316 112177 63505 30007 6510
15232F510q9329K4288J688K9890K2492l1285j5342M1792L0820l142l774K0881
15220C5489K9484l1540k7190J6598R2929j5319r916J3277M587M4552n7597k6312
15208F9042J4396J4156J0956q1552q9283j2876M2276O6225J09733l2751j30446
15197b0124m6715K6276j6021N7851m1479J1239l2924j1609M2210l7475k6981Q1543
15185a4209N6679K2349l0771l1978m2764l829K638l9905n1325N1125l6233J12816
15173e407K9658j5222K1938n2923n2456l7504Q505m4167R3381Q1940M5267J4411
15161H7421j12468J7168p0330j9130J21505P5922K9106o5215r6938J0245N2591
15150B9877L9141j12820m5645J27751P1493o4774o1028o5407p0097M358P9114
$$ plain form
15232 6510 -82819 -58531 -56843 -26953 -4461 -35746 -51088 -9296 21524 18382 14608 35489
15220 35489 64973 33433 6243 22841 115770 100451 90535 103812 108399 152951 95354 69042
15208 69042 83438 97594 108550 26998 -62285 -75161 -32885 33340 143073 110322 -20124
15197 -20124 -66839 -40563 -56584 1267 -40212 -28973 -61897 -73506 -31296 -68771 -95752 -14209
15185 -14209 42470 64819 34048 2070 -40694 -44523 -41885 -81790 -133115 -81990 -118223 -5407
15173 -5407 24251 9029 30967 -21956 -74412 -111916 -103411 -147578 -54197 27743 73010 87421
15161 87421 -25047 -7879 -78209 -97339 24166 100088 129194 63979 -32959 -22714 29877
15150 29877 69018 -43802 -89447 38304 109797 45023 -16005 -81412 -151509 -147151 -68037
15139f8037N4997k2656m9240L0145M953M031K4422o4427m9617K2361M9303N7811
15127e954k2149M0094Q1341q0980J6953J0255n3987L5391K767K7558l9744P6759
15115H8304n0235p5139j0804L6194l6490m5461K9443J21700o2924j02126J9912
15104h7626m3690l3214o6500M3374Q0247L9692P70O8824N306J1107M3869j6570
15092D5589m9755k7942l1263L053k1239j0350M0302j6321L6752L8647L5442m9875
15080f960R818Q028r4191M261N9945N9213m0361m5709l491K5524N5872n1707L7977
15067A8219j491q1033o8012M5333P9071Q7860L6978m2279p6956k0184O0835K465
15055D0806p7910k5057J4428n0455j3373N0846N4332M0571P254j6721m2524l8447
$$ plain form
15139 -68037 -13040 -35696 -84936 -54791 -49838 -45807 -21385 -85812 -135429 -113068 -63765 -5954
15127 -5954 -28103 11991 93332 12352 29305 39560 -14427 20964 23731 51289 11545 88304
15115 88304 38069 -37070 -47874 -11680 -48170 -93631 -64188 57512 -5412 -107538 -87626
15104 -87626 -131316 -164530 -231030 -187656 -107409 -67717 -66947 1877 7183 18290 62159 45589
15092 45589 -4166 -32108 -63371 -60318 -81557 -91907 -51605 -67926 -31174 7473 42915 -6960
15080 -6960 2858 10886 -83305 -79044 -19099 40114 -247 -45956 -49447 -23923 31949 -19758 18219
15067 18219 16728 -64305 -132317 -86984 -7913 79947 116925 74646 -2310 -22494 38341 40806
15055 40806 -37104 -62161 -47733 -98188 -111561 -60715 -6383 34188 41442 24721 -17803 -56250
15043e6250q0524K8592N8560k6246m6064j4715M0145N6039l0584L0895J31030
15032I0878P1422k6545j27811m5376O0803O1376q3469p4335R941R139n2320m2494
15020a48791j0075K3444O2724j5930q9724j1765M5183Q9254m39L7709m3597l6981
15008i8988O5548J3940l9823L1975k0021n2353k8468P5740M4443J2735k1354j23861
14996a40487m6128Q635N9337J29736M6510K3140L5346J7842j7304K4708j2382
14985A28953p7898K1802K816p6465r1815L6257J13728K931m4896k6746p1919m270
14973h7522R1979K4658o4268j5001M6087l5042k2751j5567O3417K8643M6897q701
14961E2829q523K7981L9762j5155q4029n1060l3871K4495j4102j884o0803O2998
$$ plain form
15043 -56250 -136774 -108182 -49622 -75868 -121932 -136647 -96502 -40463 -71047 -40152 90878
15032 90878 162300 135755 7944 -37432 23371 84747 1278 -73057 -63116 -53977 -106297 -148791
15020 -148791 -158866 -135422 -72698 -88628 -178352 -190117 -144934 -55680 -56119 -18410 -62007 -98988
15008 -98988 -33440 -19500 -59323 -27348 -47369 -99722 -128190 -52450 -8007 4728 -16626 -140487
14996 -140487 -186615 -177980 -118643 11093 57603 80743 116089 133931 116627 141335 128953
14985 128953 51055 72857 75673 -792 -92607 -56350 57378 60309 15413 -11333 -83252 -87522
14973 -87522 4457 29115 -35153 -50154 -4067 -39109 -61860 -77427 -14010 14633 61530 52829
14961 52829 44306 72287 112049 96894 12865 -38195 -72066 -47571 -61673 -63557 -124360 -61362
14949f1362j7029j9506k931m3779O4246J1006k9126N83O3553J18932j1157J1045
14937H4475j0172q4750m1352P6730n0446j8292K5793k6969r2741m667M9605L4823
14925e7963L5142n5416l3523L5006p1329j7413P160N1098m3284K8227Q5482M4148
14913G335p400L8836K0269k0503j37718k5018M6677O5392J2231l9196n003J7318
14901b6780N4985P094o531j3356p8265k7891k4689R1608J4101k949n615J4266
14889d022N1131k7296l4197Q4395n3085q0061k1363j1155j2228R4468L001l1142
14877d1554K7774n4214l9875o202K061J4045j5142L3861m400P2014L0051M6794
14865F5213m513q6064m259O0823j43n168n1312m484O4293M1975m1682L4739M849
$$ plain form
14949 -61362 -78391 -97897 -100828 -144607 -80361 -69355 -98481 -97898 -34345 84587 73430 84475
14937 84475 74303 -10447 -51799 24931 -25515 -43807 -18014 -44983 -137724 -142391 -92786 -57963
14925 -57963 -22821 -78237 -111760 -76754 -148083 -165496 -158336 -107238 -150522 -122295 -36813 7335
14913 7335 -65 38771 59040 38537 -99181 -124199 -77522 -12130 101 -39095 -44098 -26780
14901 -26780 28205 35299 28768 15412 -62853 -90744 -115433 -23825 -9724 -12673 -18288 -4022
14889 -4022 47109 19813 -14384 70011 16926 -63135 -84498 -95653 -107881 -13413 -10412 -41554
14877 -41554 -13780 -67994 -107869 -114071 -112010 -97965 -113107 -79246 -83646 -11632 18419 65213
14865 65213 60700 -25364 -29623 31200 31057 25889 -25423 -29907 34386 76361 34679 69418 74267
14852G4267M9666N364j9879j27854r2903J0444o904j0248L7382L7713K3839M8839
14840B9726j3397n3896n0936J841O6270M4329m1226M6639P692r1963o2555l4842
14828a52318M1017P4986R6841O3988M7889j0425j21027k8458R9523M289j58327
14817d2022O3946J21636j9782p3653l9210J2047P3861M1759m2012j2582K2550
14806A06538k9661J64l2652p1052M5211J6644m9256J7214J3417m2839M7640M4418
14794F5786j45063n0584J7620R7828L1131O4892J8361j5876O322L5848k4779o3149
14782C8337L2944l227p6937L1358J11493L3643o6190m7089r0347q8009J07243
14771a6781M8635q334M157j6117n4067m7841Q4144L6984L3964o317k1364K3528
$$ plain form
14852 74267 123933 129297 109418 -18436 -111339 -100895 -107799 -118047 -80665 -42952 -19113 29726
14840 29726 16329 -37567 -88503 -86662 -20392 23937 -17289 29350 37042 -54921 -117476 -152318
14828 -152318 -111301 -36315 60526 124514 172403 161978 40951 12493 112016 116305 -42022
14817 -42022 21924 143560 123778 50125 10915 22962 96823 138582 96570 83988 106538
14806 106538 76877 77041 44389 -26663 18548 35192 -14064 3150 16567 -26272 21368 65786
14794 65786 -79277 -129861 -112241 -14413 16718 81610 99971 84095 90417 126265 101486 38337
14782 38337 71281 68054 -8883 22475 133968 167611 101421 54332 -36015 -124024 -16781
14771 -16781 31854 23520 27677 11560 -42507 -90348 -6204 30780 64744 58427 37063 60591
14759F0591L5291q0014r1343o331J3100R016O967j0660O7635K3470o4970n6564
14747i3812L4811J3086J07345L3745K2101p1987J4608k1039M2466K1643r7778
14736E189l8059L6862L8689p8266J7025o204k0939J1068M2098j9763n6005O435
14724f1870j8309L6834Q956K9595P2650R258k8973l6343q3797k79J40538K0055
14712H8315o72k4759l9353k7921k8112l3559J3400J09248O2976r9957p3117O521
14700d6990M5830N5267k4922P037j1909p617j9982J04028J5920k5994M357L9808
14688A34833m1663n357j2799p748l5434m9639m9054J27540J9772O0017K6399l2443
14676A34424o8171o2634k0471J5450O3694J03350O86n2143j01259L3286N7832
$$ plain form
14759 60591 95882 15868 -75475 -81806 -68706 -59690 -52723 -63383 4252 27722 -37248 -93812
14747 -93812 -59001 -45915 61430 95175 117276 45289 59897 38858 81324 102967 5189
14736 5189 -32870 3992 42681 -35585 -18560 -24764 -45703 -34635 7463 -12300 -68305 -61870
14724 -61870 -80179 -43345 -34389 -4794 67856 77114 48141 11798 -71999 -72278 68260 88315
14712 88315 87643 62884 23531 -4390 -32502 -66061 -52661 56587 119563 19606 -53511 -46990
14700 -46990 -1160 54107 29185 36222 24313 16696 -3286 100742 116662 90668 95025 134833
14688 134833 93170 87813 75014 67266 31832 -17807 -66861 60679 80451 140468 166867 134424
14676 134424 66253 3619 -16852 -1402 62292 165642 166328 114185 12926 46212 104044
14665A04044k2282n2106m3669J6522Q374M4484p3164k0922O7464l719M1064J8196
14653H4286K0512k3604n2243l5683Q9040K0155l6268k5045M8145K162j3951j0995
14641F6511N202M6675k9121J5560o5801p3541j05627m8960k0294O0055N8920M9749
14629d0672M260k9251j2840P1583L5356j6911r3575Q985L305m4010J5884O3966
14617c3920N8165n7899o4228L0442l3551m5357J4798J8989L9590J9899O2561J850
14605A1339k3740j1499m2837m5107n736R5196K7406J9443r5131m0520P6966K0251
14593a3969L1290J4367N4700j5383K0880j01334p6775N6762O2691k408j4267m3406
14581b6852p4452j11850P1905J35453N2302N1534O6273m2369l3006j5321l3840
$$ plain form
14665 104044 81762 29656 -14013 2509 10883 55367 -17797 -38719 28745 25026 66090 84286
14653 84286 104798 81194 28951 -6732 82308 102463 66195 41150 89295 91457 77506 66511
14641 66511 71713 118388 89267 104827 39026 -34515 -140142 -189102 -209396 -149341 -90421 -40672
14629 -40672 -36412 -65663 -78503 -6920 28436 11525 -82050 -73065 -69760 -113770 -97886 -33920
14617 -33920 24245 -33654 -97882 -67440 -100991 -146348 -131550 -112561 -72971 -53072 9489 11339
14605 11339 -12401 -23900 -66737 -111844 -117580 -22384 5022 24465 -70666 -111186 -34220 -13969
14593 -13969 17321 31688 86388 71005 91885 -9449 -86224 -29462 33229 30821 16554 -26852
14581 -26852 -101304 -213154 -141249 -5796 46506 98040 164313 121944 88938 73617 39777
14570C9777Q9133R7884O632m9651m7850l2734k3292o7087Q175L112n4623m7281
14558g7805Q1807L9798o1094P3765Q781m8222N9914J29063P7095q0491j14473
14547H8138k917k90k5230l8497n3159p090k119l2798J5900O5827M370n5613n0587
14534i4065j8777J2586m4985n4173K7039k3494J01097P0000n2453M7094M4699
14523A4568M7377M0112K7825m1053M581M2036n2649j34805r8788N2903Q6632l737
14511a4998M6774j1527k6061q1558n3594N4750J8561O6180J3490j5290l7843m6145
14499h7261j8326l4946N8797J9884q760L0519j7908O1917l0049N8864q9041o7444
14487a23754k42J6295N2629k562L961K9540j8394M585k454N1683J04303k4575
$$ plain form
14570 39777 128910 226794 233426 183775 135925 103191 79899 12812 20987 24099 -30524 -77805
14558 -77805 4002 43800 -17294 56471 65252 17030 76944 206007 283102 202611 88138
14547 88138 85221 84931 59701 21204 -31955 -39045 -41164 -73962 -58062 7765 12135 -43478 -94065
14534 -94065 -112842 -100256 -145241 -199414 -172375 -195869 -94772 -24772 -77225 -30131 14568
14523 14568 61945 102057 129882 88829 93410 135446 82797 -52008 -150796 -97893 -11261 -14998
14511 -14998 31776 20249 -5812 -87370 -140964 -86214 -67653 -1473 12017 -3273 -41116 -87261
14499 -87261 -105587 -140533 -81736 -61852 -70612 -40093 -58001 3916 -26133 32731 -56310 -123754
14487 -123754 -123996 -107701 -55072 -57634 -53673 -24133 -42527 -37942 -40396 11287 115590 91015
14475I1015l4044k9226L1556j4370J103k3436k7983o8855J5130j8329K3593k5667
14463g9513j5421M97P2771m5144j3864k7J24348J09770r4627j8298r960K7303
14451E7835K4534o210k715p4008j9441q819k1376M4100R366J8991m6343n9977
14439h4063K6755J13024K6403r1610r996J588M5184K0435j0079R904N966j4678
14427C8833M908l9958K3712k161k5297k5020q497J70292R0163m3567q4447j40614
14415d1653o5591R6607O9429o1912o9631n400P5489p5775j70355M0950Q7937N0731
14403f9174j5341L0730P5380J6541k3697j13j0530m4599p51j9793m908l182J4758
14390e4679J5353L7305l5192J4759N1728q156J1764l470R495J7074J1749j20919
$$ plain form
14475 91015 56971 27745 59301 44931 46034 22598 -5385 -74240 -59110 -77439 -53846 -79513
14463 -79513 -94934 -94437 -21666 -66810 -80674 -80701 43647 153417 58790 40492 30532 57835
14451 57835 82369 76159 73444 -564 -20005 -28824 -50200 -6100 3266 22257 -24086 -84063
14439 -84063 -57308 55716 82119 -9491 -19487 -17899 27285 47720 37641 47545 53511 38833
14427 38833 43741 3783 27495 25334 37 -24983 -33480 136812 226975 183408 98961 -41653
14415 -41653 -107244 -10637 58792 -3120 -72751 -78151 -2662 -78437 -248792 -207842 -119905 -69174
14403 -69174 -84515 -53785 21595 38136 14439 14326 3796 -40803 -41554 -61347 -66255 -69437 -54679
14390 -54679 -39326 -2021 -37213 -22454 29274 21118 32882 29412 38907 55981 67730 -53189
14378e3189l3621N7066P7331q3965q08m7466n50m1955J103J43756L1356O051M6329
14365A01438n6142j3837j2929j4682P5669L3308j01537o0402N6573J8594p5036
14354d8983L565K0647L6814k0618o9402k9890m9729n648O9011k0538k059N6672
14342f0158J04526Q710m3545j41472o985M3026J9446Q4811K6678m4064m475j0058
14330b3560N7132m9554P127K9147r0245k7359M9052m9435m7437O8114O3640K6091
14318A2713n2329k8600j1883J1665K9105P0784N018N488k6110o5497l9095n6450
14306a45191n0298O7575O8588J6316k333R17K431L382k7533O7923j1917j0575
14294b0715l2537L018k9655L1542j7990p4272k232R627m9318K5731J06149J26878
$$ plain form
14378 -53189 -86810 -29744 47587 -36378 -37186 -84652 -85202 -127157 -126054 17702 49058 55109 101438
14365 101438 45296 31459 18530 3848 79517 112825 11288 -49114 7459 26053 -48983
14354 -48983 -45418 -24771 12043 -8575 -77977 -107867 -157596 -163244 -94233 -114771 -116830 -60158
14342 -60158 44368 53078 9533 -131939 -138924 -95898 -76452 8359 35037 -9027 -13502 -23560
14330 -23560 33572 -15982 -8855 20292 -69953 -97312 -48260 -97695 -145132 -77018 -13378 12713
14318 12713 -39616 -68216 -80099 -68434 -39329 31455 36473 41961 15851 -49646 -88741 -145191
14306 -145191 -195489 -127914 -59326 -43010 -45343 -44426 -41995 -38613 -66146 1777 -10140 -20715
14294 -20715 -53252 -50234 -79889 -48347 -66337 -140609 -142841 -133214 -182532 -156801 -50652 76226
14282G6226K8493n2487m8097J2731L1246o8187J64O7912r6650m9137M2190m4363
14270i9959q2173K3371L6213o922J0285L2008Q3975M8510K6561L9641j00202j37318
14258a26010k275K1547P5777N1225k1580j4166o3671k2791K2186P6548N7105M5103
14246I8998k2741l6995n8146l5482R4500K473J2651J3970p4841k2327J7115j9542
14234c0367K9827q4278m5184O5552L890L0373K1535L4678O7475O4566j1891n6020
14222I0156r2871k8852J1095M0323J0205k4679N4146R9220k5999n5200p4317q614
14210e387P7122P2714n2181p3921L457n0411l1880k5160P7138L4122M8924N254
14198G9791l0390o9546j15217l5134Q5995N5399l5340N0452M4313j00346j5758
$$ plain form
14282 76226 104719 52232 4135 16866 48112 -20075 -19911 48001 -48649 -97786 -55596 -99959
14270 -99959 -182132 -158761 -122548 -129470 -119185 -87177 -3202 45308 71869 111510 11308 -126010
14258 -126010 -128285 -106738 -30961 20264 -1316 -15482 -79153 -101944 -79758 -3210 53895 98998
14246 98998 76257 39262 -18884 -54366 40134 42607 55258 69228 -5613 -27940 -10825 -30367
14234 -30367 -540 -84818 -130002 -64450 -60560 -30187 -8652 26026 93501 158067 146176 90156
14222 90156 -2715 -31567 -20472 19851 30056 5377 59523 158743 132744 77544 3227 -5387
14210 -5387 71735 144449 92268 18347 21804 -28607 -60487 -85647 -8509 25613 74537 79791
14198 79791 49401 -20145 -135362 -170496 -84501 -29102 -64442 -13990 30323 -70023 -85781
14187h5781j7114k7940Q240K4091J01592K6195k3988J00752j4821m8614k5643
14176A6969N280j722j8938L3761N2152k0894L07q9414p3213o4735O552j7776l675
14163a75346k5943R0674P7256P8562L0533L7246M4791n0445r9128o5500J424j1112
14151f6988O3299P3163j5888n4236J5265l2459j7947O7440K5867m5466l5564J329
14139b2185l499n567L796k1639L0600N6455O5818N269k4123j4541L458j1894P4225
14126A36173l1036l4463R4417J22224r1845j48016m4669J6335k1516j076M3526
14115D0054k8648j05538m1211N3430K7316N1002O9355n9845m189m9663L39J6412
14103c1186k0323M1031K5416L6347O7831m9780k8670L4212J1529j2410n9477p326
$$ plain form
14187 -85781 -102895 -130835 -122595 -98504 3088 29283 5295 106047 91226 42612 16969
14176 16969 22249 20527 1589 35350 87502 66608 66915 -22499 -95712 -160447 -153895 -171671 -175346
14163 -175346 -201289 -110615 -33359 45203 75736 112982 157773 107328 8200 -57300 -55876 -66988
14151 -66988 -3689 69474 53586 -650 14615 -17844 -35791 31649 57516 12050 -23514 -22185
14139 -22185 -25684 -31251 -27455 -49094 -18494 37961 103779 109048 84925 70384 73842 61948 136173
14126 136173 105137 70674 165091 287315 195470 47454 2785 19120 -2396 -3472 40054
14115 40054 11406 -94132 -135343 -81913 -54597 -3595 65760 5915 1726 -47937 -47598 -31186
14103 -31186 -51509 -10478 14938 51285 119116 69336 40666 74878 86407 73997 14520 7194
14091G194Q991J5716L8544n5314j02253q204O6455L2841r4093n9104N0625Q3043
14079a5559K5531l0583M606k3388Q115K5605K3158l2954m576K0130J3637k7133
14067a3411N369j2126K2405j6086j09271l1988l8894R1331J27634L0007P085n3862
14055H193P750R0853p7599r7739K6127k9032M0642K6146q1810j21995R6465J33336
14043B1337O9790M8277j6872n0861k9594j8171P4721L9859M8397l4965r5910o2546
14031f538j7962M4416O2861O692p8282r3028K9616L3707m1645q6368J6009N2744
14019g7778P7214L9000l6039p7432J6082K3183n1230n1121k0415L9146r28J7245
14007a03073N3461L9151p7650n9933N9986K6521R1752m422n4881M056j5270P039
$$ plain form
14091 7194 16185 31901 70445 15131 -87122 -95326 -28871 3970 -90123 -149227 -98602 -15559
14079 -15559 9972 -20611 -16005 -39393 -31278 -5673 17485 -15469 -20045 85 13722 -13411
14067 -13411 -8042 -20168 2237 -13849 -123120 -155108 -194002 -102671 24963 54970 62055 8193
14055 8193 15943 106796 29197 -68542 -42415 -71447 -30805 -4659 -86469 -208464 -111999 21337
14043 21337 91127 139404 122532 71671 42077 23906 98627 138486 186883 151918 56008 -6538
14031 -6538 -24500 19916 82777 89469 11187 -81841 -52225 -18518 -60163 -146531 -130522 -77778
14019 -77778 -564 38436 2397 -75035 -58953 -35770 -87000 -138121 -158536 -119390 -120318 -103073
14007 -103073 -49612 -10461 -88111 -148044 -88058 -61537 30215 25793 -29088 -25032 -40302 -33263
13995c3263Q6565K1672N5817M1803p5541L0421n8878p7892n0299J5371N998l7331
13983g5557K0602N7718O4300L9334k8673p4534l6005M2989O9218n9833m5003L769
13971b1675l567M2581j1082o2426N718N2448J9353j1690k8424k9709Q480o2123
13959a02116o0460R0320R3661j6901p1385L4575Q928m2668J3209M9960N4396l17
13947E1202m601o0676J3484m5116o0681J7218L1986J00786J34124L0419m9263
13936A58882j00295n2384J9076l0880j2499p616k8419M4713N4161m0269q4144
13925g9674j2448P2357J7200J208m9926L3430L6662j7363o2628j4142n459K1225
13913e9558K8577k6795K3235L0982M5355K9344M3424N2424l4203o8670J2332O936
$$ plain form
13995 -33263 53302 74974 130791 172594 97053 127474 68596 -9296 -59595 -44224 -38226 -75557
13983 -75557 -54955 2763 67063 106397 77724 3190 -32815 10174 79392 19559 -25444 -21675
13971 -21675 -25242 17339 6257 -56169 -50451 1997 21350 9660 -18764 -48473 -39993 -102116
13959 -102116 -162576 -72256 21405 4504 -66881 -32306 -23378 -66046 -52837 -2877 51519 51202
13947 51202 46601 -14075 -591 -45707 -106388 -89170 -57184 43602 177726 208145 158882
13936 158882 58587 6203 25279 -5601 -18100 -25716 -54135 -9422 44739 4470 -79674
13925 -79674 -92122 -19765 -2565 -1357 -51283 -17853 18809 1446 -61182 -75324 -80783 -59558
13913 -59558 -30981 -57776 -34541 -3559 41796 71140 114564 166988 132785 64115 76447 83383
13901H3383j00793q7488J6456M6650m6544m3051J9040M7681O732J8293n1310M9297
13889d1654M343k2461M1773l8091k6860L0843R2102m029K7866o1156q3700j2473
13877i3497m371o6863K1998J50016n284n7227J9269P4118K2706J9209O880l8116
13865D8838p8447o8065j1524K816L5461P4437J3398m418p5258o6711O2332M6724
13853b0417L1151j8164m0617L6340N9984j2238k2476j2961L983n1293N8658R6712
13841A08662k219m1759K7376j4374m7913L9860k1185M3604J010l4297j1632R912
13829E7045o545j9151K2718O3037j1107j03153N5643L6431l1796K226K9343j6199
13817G8492j6843q3656k2788P1730K4339O1568m9837j29333o1501o307J10525
$$ plain form
13901 83383 -17410 -104898 -88442 -41792 -88336 -131387 -112347 -64666 -57934 -39641 -90951 -41654
13889 -41654 -37311 -59772 -17999 -56090 -82950 -52107 39995 35966 63832 2676 -81024 -93497
13877 -93497 -97868 -164731 -142733 7283 1999 -55228 -35959 38159 60865 80074 86954 48838
13865 48838 -29609 -97674 -109198 -106382 -70921 3516 16914 12496 -62762 -129473 -67141 -20417
13853 -20417 10734 -7430 -48047 -11707 48277 36039 13563 602 4585 -46708 11950 108662
13841 108662 106443 64684 92060 77686 29773 69633 48448 92052 93062 58765 47133 57045
13829 57045 50500 31349 54067 117104 105997 2844 58487 94918 63122 65348 94691 78492
13817 78492 61649 -22007 -44795 26935 51274 112842 63005 -66328 -127829 -134136 -23611
13806b3611J15523j23445p8049L0402M8612J11633N208N276m2582j3771l3464
13795A732o0851k2532L5244J26761J4713j33395K0773P6569O2792M923m9453r4171
13783a6895n0270J3729N914L8436J1725j3265P091N8524J7628j8383p3250m0856
13771e9872J3559K3991J17047K7080m3816L9938l4275p4586K5543J5177q4964
13760c5178q291K9224R0471K8439o3225l2362m6603j4903j5370K6051N4635m8171
13748c5283r949J11867L4987L5238l3618o6741n6925L217R1412L5416J9475j5693
13736A13403m5719p4835k9189k6758M0162Q239r8702M4918o791k1818K1900o6749
13724a41939K4063J13820m437N2776P7408p0540m7301m5062k7935K9254q087j1064
$$ plain form
13806 -23611 91912 -31533 -109582 -79180 -30568 81065 86273 91549 48967 35196 1732
13795 1732 -59119 -81651 -46407 80354 95067 -38328 -17555 59014 121806 126729 77276 -16895
13783 -16895 -67165 -53436 -47522 -9086 2639 -10626 -3535 54989 72617 54234 -19016 -59872
13771 -59872 -46313 -22322 94725 121805 77989 117927 83652 9066 34609 49786 -35178
13760 -35178 -43469 -14245 76226 104665 41440 9078 -37525 -52428 -67798 -41747 12888 -35283
13748 -35283 -45232 66635 101622 136860 103242 36501 -20424 -17207 74205 109621 129096 113403
13736 113403 67684 -7151 -36340 -63098 -22936 -14697 -113399 -68481 -75272 -97090 -75190 -141939
13724 -141939 -117876 -4056 -8493 44283 121691 51151 3850 -41212 -69147 -39893 -47980 -59044
13712e9044m8922k7840J9804M7227l4360J9142n55j7711K5558L2767N404m0393
13700g8923N7618M0177k3889m2650m6103n646N4584N9815L9593O483m7815k4909
13688a1665Q3213Q6650n732N316r5064k8809L3891j6994p3715j9261O7574Q509
13676C3913o454p4996l2247n6002j1679N3961L7475j4772P0929k050l5288k3020
13664f0230R1613M6756O2476k0463r3016k0274r080R0070m0658N560o4118k9172
13652d0536P0956N0526l492j5872m6422q5313n2160N1982k6899m3635O0902L9206
13640d0757n6231R8442J9178J0663M210j0993L0548l1605m7124K4715l6505J8679
13628a6780L6000K3423R8054j8613m8559L6226q4899r3494K2453J53204l6655
$$ plain form
13712 -59044 -107966 -135806 -116002 -68775 -103135 -83993 -84548 -102259 -76701 -43934 -38530 -78923
13700 -78923 -21305 18872 -5017 -47667 -93770 -99416 -44832 14983 54576 61059 13244 -11665
13688 -11665 71548 158198 152466 157782 62718 33909 67800 50806 -22909 -42170 25404 33913
13676 33913 27459 -47537 -79784 -135786 -147465 -93504 -56029 -70801 128 -1922 -37210 -60230
13664 -60230 31383 78139 140615 120152 27136 6862 -2218 87852 47194 52754 -11364 -40536
13652 -40536 30420 80946 77454 61582 15160 -70153 -122313 -70331 -97230 -140865 -79963 -40757
13640 -40757 -96988 1454 20632 31295 35505 24512 55060 23455 -23669 1046 -35459 -16780
13628 -16780 19220 42643 140697 122084 73525 109751 24852 -68642 -46189 107015 70360
13617G0360o7131L0599k1938k9643o8962n7467K3616J00843J47008J858m8575
13606H0568p5244m6258l3509N0248N5005j8506J8768L3964q45m2162r9059L5320
13594d1710j1353o599N0707l6474j0031O6835L9772k2800K1404m8530k1026M0062
13582B0257j0125Q228J5628j198o2487J01631K4881j18839o7087l362K6973J0456
13570e5044L4807j5112n1535k320J15921Q7187n7961L9445M0811j9946k6325o5548
13558B4380j72696L3496L4785Q231M0060j0526p7888q044Q9919M2431q606k8253
13546c2711l6813J9852N3376l2525k2347O6237k2524o5385N6941N838M9141M2761
13534H1841j212n5254r609O6425j9080o5296P675K0959n6120n7783L872O7194
$$ plain form
13617 70360 3229 33828 11890 -17753 -86715 -144182 -120566 -19723 127285 129143 80568
13606 80568 5324 -40934 -74443 -24195 30810 12304 31072 65036 64191 22029 -77030 -41710
13594 -41710 -53063 -59662 -8955 -45429 -55460 11375 51147 28347 49751 1221 -19805 20257
13582 20257 10132 18360 33988 32790 -29697 71934 96815 -22024 -89111 -92473 -65500 -55044
13570 -55044 -20237 -35349 -86884 -89204 26717 113904 55943 95388 136199 116253 89928 24380
13558 24380 -148316 -114820 -80035 -71804 -31744 -42270 -120158 -128202 -38283 4148 -4458 -32711
13546 -32711 -69524 -49672 3704 -28821 -51168 15069 -7455 -72840 -15899 -10061 39080 81841
13534 81841 80629 25375 15766 82191 63111 -2185 5490 26449 -29671 -87454 -83582 -16388
13522a6388O7682J0867n1105j8216L5428m4183J570J23564J7863j04988P0547
13511I2641O1060R391r9669m8449J1220o6161p0671P6213P6340P086l5323q5661
13499g1983J2574P2209M9729k0931j4009m6389L8802m3173J8117m048j3327K4767
13487B338k7242j5721m1107j5057R793J1119l032r115l9406j6580Q0566O7337
13475C893j783J8400O2466M7891p979j9727n4555q2724J7677P8766m0842q3596
13463f2113L9638L2625j5677k9434K7659k4721r2429J5299P6552M3995L6148l2856
13451A4686k0965K491j4705O6736Q1178L9131m4116j14744n6034M3762O5381O289
13439F9090M3562M1749j17957k0320J3316K4185P5012K1054m6276K0092N4628
$$ plain form
13522 -16388 51294 62161 11056 -7160 28268 -15915 -14345 109219 127082 22094 92641
13511 92641 153701 163092 63423 14974 26194 -39967 -110638 -34425 41915 49001 13678 -71983
13499 -71983 -59409 12800 62529 41598 27589 -18800 20002 -23171 -5054 -9102 -22429 2338
13487 2338 -24904 -40625 -81732 -96789 -86996 -75877 -78909 -88024 -127430 -144010 -63444 3893
13475 3893 2110 20510 82976 130867 122888 103161 48606 -34118 -16441 62325 21483 -62113
13463 -62113 -22475 10150 -5527 -34961 -7302 -32023 -124452 -109153 -32601 11394 47542 14686
13451 14686 -6279 -3788 -18493 48243 129421 168552 124436 9692 -46342 -2580 62801 69090
13439 69090 112652 154401 36444 16124 29440 53625 128637 149691 103415 123507 178135
13428A78135K6943p8616r8624j14107p5032N1274R4587K8067J9512k8071o704
13417b636j82Q2874K1900k0245P5535L1777p4998m8574L0494j58079Q757j2147
13405f5524L2531N7130N102p4797M849K0469J0708K8737n7173o3817k8948K1664
13393a09069N4453L5743R874Q7528L5849j40575o6929N5841o3375l4478K4292
13382a10846K2743L4100M5006l0405p3744k3551Q7444M3114R2687L7671r1499
13371C2720l3756j3012j4363N918J418K9794Q4450O2371p738K3487L5915k2124
13359A85080j04938q6954l3648P5160O2212M1250p890k6603p0919n5062L5591
13348A3279j6644j5743k786J7597n4862N5130M9150L8509l3600p2640m2066n4471
$$ plain form
13428 178135 205078 126462 27838 -86269 -161301 -110027 -15440 12627 32139 4068 -2636
13417 -2636 -2818 80056 101956 81711 157246 189023 114025 65451 95945 -62134 -53377 -65524
13405 -65524 -32993 24137 29239 -45558 -40709 -20240 -9532 19205 -37968 -101785 -130733 -109069
13393 -109069 -54616 -18873 -8999 78529 114378 -26197 -93126 -37285 -100660 -135138 -110846
13382 -110846 -88103 -54003 -8997 -39402 -113146 -136697 -49253 -6139 86548 124219 32720
13371 32720 -1036 -14048 -28411 -22493 -21075 8719 93169 155540 147802 171289 207204 185080
13359 185080 80142 -6812 -40460 34700 96912 138162 130272 103669 32750 -22312 13279
13348 13279 -3365 -19108 -21894 -4297 -59159 -4029 45121 83630 50030 -22610 -64676 -119147
13336a19147q4475M9764M1823N9381N4197m1241k169p3982J3566l5560M1068Q1012
13324a5763O5827N7966m0012n6259L5917K2439Q441r3957o3896K8149J02310M512
13312E5674q277k4700J5777L9048K9993J6163L3834j39676j21809O9142K3736
13301a1095K9792j8372m8126L1137k2663n460K6188j9764L1108Q1779r2894N0144
13289C1774K2957N4061m533K5395o9096p8192k3675O932J05163O2986k7527m3744
13277F2501K160L2139j914k3182n7913o1572j7100k2544J13872Q6247l923j8855
13265H9916m0339r4611P3898P52M8120j2530k7412O5927n0974q5725r887J6302
13253b6563O052L1261O5578N878o3969k1085o298L1729n0440k8116J32314J14447
$$ plain form
13336 -119147 -203622 -153858 -112035 -52654 1543 -39698 -41867 -115849 -102283 -137843 -96775 -15763
13324 -15763 50064 108030 68018 11759 47676 70115 78556 -15401 -79297 -51148 51162 55674
13312 55674 47397 22697 38474 77522 107515 123678 157512 17836 -103973 -34831 -11095
13301 -11095 18697 325 -47801 -16664 -39327 -44787 -18599 -38363 -7255 74524 -18370 31774
13289 31774 54731 108792 104259 129654 60558 -17634 -41309 -34377 70786 133772 106245 62501
13277 62501 64661 96800 94886 71704 13791 -47781 -64881 -87425 26447 112694 108771 89916
13265 89916 49577 -45034 28864 29616 77736 65206 37794 103721 52747 -32978 -42865 -26563
13253 -26563 -20511 10750 76328 82206 18237 -2848 -9146 22583 -27857 -55973 76341 190788
13241A90788p461p3248r9369j8889K9047j4323j4004K3373n9241l2190M0361O0281
13229B5125O4514N1034r212m0655K9148l5614l1970N9580j4314n2320q966K4517
13217F0867k201j1227L740r521j1106o1770M9981M4618K065j8384M7290o6928
13205B7424m2248M6962R0613K1635n2320q5352k7576R4782N2192o9559q1721j2561
13193c7729K8217N8634O0p0810m2658R5608J5296o1642o1253N1352Q6906J6565
13181G8546p2931q8925M1063P2774N9587m41p3746j4282J7256q8837J7766n47
13169e2717j4566l5704J3875j5170O1274O0371L7051R593P4479k2142l8160n0584
13157B7600r6688k5833Q7164P7840K9975j8291p8161N9211l8701J7524R12k3990
$$ plain form
13241 190788 183327 110079 10710 -8179 20868 6545 -7459 15914 -43327 -75517 -35156 25125
13229 25125 89639 140673 131461 90806 119954 84340 52370 111950 97636 45316 36350 60867
13217 60867 58666 47439 51179 41658 30552 -31218 18763 63381 65446 47062 94352 27424
13205 27424 -14824 32138 122751 144386 92066 6714 -20862 73920 126112 56553 -25168 -37729
13193 -37729 -9512 49122 49182 -21628 -64286 31322 46618 -15024 -76277 -24925 61981 78546
13181 78546 5615 -83310 -42247 30527 90114 89673 15927 1645 18901 -69936 -52170 -52717
13169 -52717 -67283 -102987 -89112 -104282 -43008 17363 54414 64007 138486 116344 78184 27600
13157 27600 -69088 -94921 -7757 70083 100058 81767 3606 62817 24116 41640 42552 18562
13145A8562m7399N8400L7183K617J1441q3877p1936N3375M2035j7132K7653L207
13133C4129n9727k8025N2434N1441l648J7570o251K7142r287k4286m9763n2252
13121e0523l4945K2428J6235j6683L9079K4505k6243n9306Q940N8182l8505k5941
13109h2777J9233q497L2395L9769l8334m6259Q6017R2522j1174n9951l7461k3416
13097c7933q7869n8212J10148J02804K081j160k3725m8936M534M0599m7343M1974
13085c038k8047k1165p0928J2183J00811J1293L8572K1105j0064p932l3082p6321
13073f6613L6973J9053n676o4794n2408k7192K1782M2119R0820R0708L5519q0000
13061D0291j04766k9411N1248M3629L2400n9107j01653l373L6312O929Q6889M1101
$$ plain form
13145 18562 -28837 29563 66746 69363 80804 -3073 -75009 -21634 20401 3269 30922 34129
13133 34129 -25598 -53623 -1189 50252 46604 64174 57923 85065 75778 51492 1729 -50523
13121 -50523 -85468 -63040 -46805 -63488 -24409 96 -26147 -85453 -76513 -18331 -56836 -82777
13109 -82777 -63544 -72041 -39646 123 -38211 -84470 1547 94069 82895 22944 -14517 -37933
13097 -37933 -125802 -184014 -73866 28938 31019 29859 6134 -42802 -38268 2331 -45012 -3038
13085 -3038 -31085 -52250 -123178 -110995 -10184 1109 39681 60786 50722 42790 9708 -66613
13073 -66613 -29640 -10587 -16263 -81057 -133465 -160657 -138875 -96756 -5936 84772 120291 40291
13061 40291 -64475 -93886 -42638 991 33391 -25716 -127369 -130742 -94430 -87501 -612 40489
13049D0489l7212K3920J6061n1832o1180n0721r644J7313O6839N5517j5308O2418
13037E6660m6157n2582J0447O5504Q1994R3406M880k7780q9878j21622J0741M4353
13025B9966J3809p9447J9404n0348r044p881J8217k9585q7071j7493K363M8283
13013a48827J7456j3192k1091n1531J1832R3581k4232j1547P2481j1331k8740
13002a15141J6144O4252N0713K8858L5546J08519O3202j5617j05717q2483j4439
12991C3837r9911l7759L5419K7376n5947M2416R2969Q0624J0954n7290n8223N203
12979A9668J895L4106l7276m1300N498K0461J1748M0840j9565j05624o455k5773
12967a01777o1986P2529O9498N3081O8618M528k2464O4701j3729j1289K5558L0993
$$ plain form
13049 40489 3277 27197 43258 -8574 -69754 -120475 -130119 -112806 -45967 9550 -5758 56660
13037 56660 10503 -42079 -31632 33872 115866 209272 214152 186372 96494 -25128 -14387 29966
13025 29966 43775 -35672 -16268 -66616 -75660 -83541 -65324 -94909 -181980 -199473 -197110 -148827
13013 -148827 -131371 -144563 -165654 -217185 -205353 -111772 -136004 -147551 -75070 -86401 -115141
13002 -115141 -98997 -34745 15968 44826 80372 188891 252093 236476 130759 48276 33837
12991 33837 -66074 -103833 -68414 -41038 -96985 -54569 38400 119024 129978 72688 14465 19668
12979 19668 21563 55669 18393 -22907 -17409 3052 14800 55640 36075 -69549 -76004 -101777
12967 -101777 -163763 -91234 -21736 31345 99963 104491 82027 146728 132999 121710 147268 178261
12955A78261k1659q3545n3983m2063O3769l3811l2447L443K5457m8350L7515M2546
12943C5133l6216J5163j2236l5159K8996O540m5390l6311P8723j0313J0036m5687
12931d6721N5505K6217k8418K5585J7136j19265j23522M5231j6527K7498O2285
12920g4996l1554M6385J15951P0348J5707m2834j02718p047O0330J5301r7974
12909c3101k1694Q5221L2615l2587J4014M3012m965j9939J5674j8751m696j6829
12897C7974j7311q6537j047M3501L9702M3151n6109J7284r764M7786M8586J14113
12885B21329K6391p0845p6355m6974Q4340M8734K6345j8132J9070m9239n6346
12874A08318j1639J3842o0661j5321j849j2157K1212N2175J176J0482l3585n0642
$$ plain form
12955 178261 156602 73057 19074 -22989 40780 6969 -25478 -22035 3422 -44928 -7413 35133
12943 35133 -1083 14080 1844 -33315 -4319 2221 -43169 -79480 -757 -11070 -1034 -46721
12931 -46721 8784 35001 6583 32168 49304 -69961 -193483 -148252 -164779 -137281 -74996
12920 -74996 -106550 -60165 55786 126134 141841 99007 -3711 -10758 49572 64873 -33101
12909 -33101 -54795 30426 63041 30454 44468 87480 82515 62576 78250 59499 54803 37974
12897 37974 20663 -65874 -66921 -23420 16282 59433 3324 20608 10844 58630 107216 221329
12885 221329 247720 176875 100520 53546 137886 186620 212965 194833 213903 164664 108318
12874 108318 96679 110521 49860 34539 32690 20533 41745 93920 95096 105578 71993 21351
12862B1351j1455P0115J2358o3302N5931O0105Q6393l4340j25458p9728l9966
12851d7996l430J18616m4379m698J9465o2977l2332K3334K2320K2912K9445P8870
12839A19150K3033q8919l0603J3673J8794m1744l2678K204L1148N1066j2535p2078
12827a9489j3291J0835m023M6450J2187k7041p3049o286Q3159L1256L6526j9764
12815E7470K3569L8943n4792L2428L2731r2925j10881K5428j0340n5249K7629
12804h5989O1412j3408J1134N0439l7886M7007k7864R9850P9052M3250K738N218
12792B34953L3m0198k7380k342p2546n5018p1814r5649q2615j0366M1063J10228
12780g1651J46500k8839L3811k0970r3004j4133J129N6302N7001m4797J478m5707
$$ plain form
12862 21351 9896 80011 92369 29067 84998 145103 231496 197156 71698 -8030 -47996
12851 -47996 -51426 67190 22811 18113 37578 -25399 -57731 -34397 -12077 10835 40280 119150
12839 119150 142183 53264 22661 36334 55128 13384 -19294 -17090 14058 65124 52589 -19489
12827 -19489 -32780 -21945 -25968 20482 32669 5628 -67421 -73707 9452 40708 77234 57470
12815 57470 81039 119982 65190 97618 130349 37424 -73457 -48029 -58369 -113618 -85989
12804 -85989 -24577 -37985 -26851 23588 -14298 32709 4845 104695 183747 226997 229735 234953
12792 234953 234986 194788 167408 165066 92520 37502 -34312 -129961 -212576 -222942 -181879 -71651
12780 -71651 74849 46010 79821 58851 -34153 -48286 -47157 9145 66146 21349 22827 -22880
12768b2880j0342N2673m7062l4917J05472J0568j2576M205k4667n410N1028M9192
12756A15284o3939m5932J9548l1129j064Q969j4985j3695j7671K9409L9774K2496
12744D7065J8301n9375m8766n0582k37K8263O3723j5446j6177n7932Q5591N6066
12732E0494O799m4337K7962n351j5654k0920l9494l6592K5654K6305k781P69N0902
12719B3756o6963p6748p4771N988L4170M8098Q7544K4377J640k3755L864K7313
12707A4513q1507l3428k0574J08581K4572p5281l3787K0755k5981j318P5804L7269
12695I618l9706o1538N2753P9764L0658q482l5292k4883l5848m5601j5276j1269
12683a05102L0306P9884J36100K3561l2095j5486j06080p2080P3559K5291n2654
$$ plain form
12768 -22880 -33222 19451 -27611 -62528 42944 53512 40936 45141 20474 15064 66092 115284
12756 115284 51345 5413 24961 -6168 -7232 1737 -13248 -26943 -44614 -15205 24569 47065
12744 47065 65366 5991 -42775 -93357 -93594 -65331 -1608 -17054 -33231 -91163 -5572 50494
12732 50494 57293 12956 40918 35567 19913 -1007 -40501 -77093 -51439 -25134 -27915 -27146 23756
12719 23756 -43207 -119955 -194726 -188738 -154568 -106470 -18926 5451 7091 -16664 -12800 14513
12707 14513 -66994 -100422 -120996 -12415 12157 -63124 -96911 -76156 -102137 -103455 -27651 9618
12695 9618 -30088 -91626 -38873 40891 71549 63067 27775 2892 -32956 -78557 -93833 -105102
12683 -105102 -74796 5088 141188 164749 132654 117168 11088 -60992 12567 37858 -14796
12672a4796m2225M5718N1461n3870l8327L4192O647n4869m5857M3141R5883P6114
12660A03212M9312p2232j41491O795l0653j6142M7589N9213O1904l1851l2129
12649C527Q2101p9287L6163o9466m4927J20925L3750o3331n0416K8200r419N0870
12637C8690L6325j02410j2927L4651K3968l8588J7764k7646l0349P0120M3135
12626E2733q685J0397j31117q6032n616P0821O4016q405J7908l3689o5128n196
12614a27993L9302M4427r057o8963J9652N6674L0086J2202J3984k0527k3208m0261
12602g3682j4804o7997k7683K1584M4804J8918P7637O5421J1037p5143j5352J5249
12590b0011K3774K0987m2214k1921Q9791L7215J8704J1640o8974l4648M0894M4472
$$ plain form
12672 -14796 -57021 -11303 40158 -13712 -52039 -17847 -11200 -66069 -111926 -68785 27098 103212
12660 103212 152524 80292 -61199 -54404 -85057 -101199 -53610 5603 67507 35656 3527
12649 3527 85628 6341 42504 -26962 -71889 49036 82786 19455 -30961 -2761 -12180 38690
12637 38690 75015 -27395 -40322 -5671 18297 -20291 -2527 -30173 -60522 9598 52733
12626 52733 44048 54445 -76672 -162704 -168320 -97499 -33483 -41888 -23980 -57669 -122797 -127993
12614 -127993 -88691 -44264 -53321 -122284 -102632 -45958 -15872 -3670 10314 -10213 -33421 -73682
12602 -73682 -88486 -156483 -184166 -162582 -117778 -98860 -21223 44198 55235 -19908 -35260 -20011
12590 -20011 3763 24750 -17464 -39385 50406 87621 106325 117965 48991 14343 55237 99709
12578I9709j5602J2941j00301J6112L606l4913k890m8777Q789J12619M1540l9658
12566E3175K8527L3869j2537j5838j00457m0720R4966n7894l3873J7694M3535
12555A0447L0791k1487q6301P316J56576M5422J8323k4078n698j6177M0438O889
12543A62461r3468K0309o9295j27140j8880j7606J9335j9998Q7941M7383K510
12532f448j997m2348L8623J3812n834l763K537k6110L1944N238m0475o5106n4605
12519a54532L8512l4922L4872J16286K4589m4005k3855o808M0472L3211j445j8077
12507D298j9139N4478K021j323m9520k2070j5186K2298R285j0997M0759k3887
12495h983n0225K8731R6766J7219j03127j5677Q0747n0921J7104r678L0946R3659
$$ plain form
12578 99709 84107 97048 -3253 12859 16465 -18448 -21338 -70115 -61326 51293 92833 53175
12566 53175 81702 115571 103034 87196 -13261 -53981 40985 -16909 -50782 -33088 10447
12555 10447 41238 19751 -66550 -59234 97342 142764 161087 137009 131311 115134 155572 162461
12543 162461 68993 89302 20007 -107133 -126013 -143619 -124284 -144282 -56341 -8958 -6448
12532 -6448 -8445 -50793 -12170 1642 -4192 -7955 -5418 -31528 416 5654 -34821 -99927 -154532
12519 -154532 -116020 -150942 -116070 216 24805 -19200 -43055 -49863 -9391 23820 22375 4298
12507 4298 -14841 39637 41658 40335 -9185 -31255 -46441 -24143 -14858 -25855 14904 -8983
12495 -8983 -59208 -30477 66289 83508 -19619 -35296 45451 -5470 11634 1956 32902 126561
12483A26561R2405m8791j0447n7171n3103J1198K5654n3406p4973K2692N3693
12472C4312j8042k2709j6456l5662k3482Q17O5424L0515m1447j2834P0579N9442
12460I0457k9487K1699N1987l5268p2663J9504M1347k2546j3530m6015M877k6586
12448a6224L093M1567J5907k3911J2960P2251k2055m7780o267M4606R062q2310
12436H99n7811J29970K4771K1663n4029k8501j7002J2061n4410l453j3381j5390
12424e4613p6988M8231J11502K0243L096J1534O2911N2328N9156n2168j22448
12413F2784l3051L8271l2473o3795P090j60N0505K5170m8733L5805K6109o2236
12401E286p0656M4191j6425k1349K1593K7296p518p7202j7115k179L3254Q4282
$$ plain form
12483 126561 218966 170175 159728 102557 49454 60652 86306 32900 -42073 -19381 34312
12472 34312 16270 -6439 -22895 -58557 -82039 -81222 -15798 14717 -26730 -39564 31015 90457
12460 90457 60970 82669 134656 99388 26725 46229 87576 65030 51500 5485 10362 -16224
12448 -16224 -13131 28436 44343 20432 33392 105643 83588 35808 29541 74147 83209 899
12436 899 -56912 73058 97829 119492 65463 36962 19960 32021 -22389 -25842 -39223 -54613
12424 -54613 -131601 -83370 28132 48375 51471 63005 125916 178244 237400 185232 62784
12413 62784 29733 68004 35531 -28264 -21174 -21334 29171 54341 5608 41413 67522 5286
12401 5286 -65370 -21179 -37604 -58953 -37360 -10064 -17582 -94784 -111899 -114078 -80824 3458
12389C458M2252r9824r7332p7104J16052J44294L9034n5967m1614l7190L696J3589
12377d6656L0684L2644j7853N055j202k7174L5077K381l6261l1110N6075m0824
12365c9164J9943k1539L9436N8884N6535k7359m5058o452j05666n166M9671Q1940
12353E6005j7115k3084l6945j04121J1856Q3900M6495P208K7752J4294N0478r7335
12341A9388k5039O4740J304r5675p6455J20363N8652M7701N3789N5629n5896q6585
12329H1916o019M291L7227P7464n123r4096K3131j6231J1332j5285q7810l0884
12317b0087m2646L2241l8954J8009J1285K4898M3070J8314m2065o7960P1033m6106
12305c8968L8693K323l7772m5684J7564J0552P8753m2263J2668o1622l5365L8832
$$ plain form
12389 3458 45710 -54114 -151446 -228550 -112498 31796 70830 14863 -26751 -63941 -60245 -46656
12377 -46656 -15972 16672 -1181 3874 2672 -24502 10575 12956 -23305 -54415 1660 -39164
12365 -39164 -19221 -40760 -1324 57560 114095 86736 41678 35226 -70440 -75606 -25935 56005
12353 56005 38890 15806 -21139 -125260 -113404 -29504 16991 24199 51951 66245 116723 19388
12341 19388 -5651 59089 60393 -35282 -111737 8626 67278 114979 168768 224397 168501 81916
12329 81916 75897 80188 117415 194879 189756 95660 118791 102560 113892 98607 10797 -20087
12317 -20087 -62733 -30492 -69446 -51437 -40152 -15254 27816 46130 4065 -63895 7138 -38968
12305 -38968 -275 2048 -35724 -81408 -63844 -53292 25461 -16802 -4134 -65756 -101121 -62289
12293f2289o4829l5160K7060P926k5489N7977L8174l1512j9916n7979O119J3967
12281a45951N6055o5884j03554J9337N9345m903J15183K9152L2830j0836j3511
12270c2737o7426j2676q450M1435Q8329Q0836p0136j64446m5184J36030K5055
12259b9370k5610k2236o328K8668M9810o5975n417N9138k6455l0455K1610k1290
12247g3910N6786o079m3076k9659J8474j04336r3945K6055J17751Q2873M9963
12236H97l1844r3642l853J8035M161K8369j5686j4341J5660p907K2451J6481N3033
12223h186O7908J02081J4278l5861p7706J1909O287O164Q5300N3222J5488M733
12211B45617k6741n3445J5027m3449p3069M0455n405r4565L576O2686r2404p267
$$ plain form
12293 -62289 -127118 -162278 -135218 -127292 -152781 -94804 -56630 -88142 -108058 -166037 -159918 -145951
12281 -145951 -89896 -155780 -259334 -239997 -180652 -185555 -70372 -41220 -8390 -19226 -32737
12270 -32737 -100163 -112839 -121289 -79854 8475 89311 19175 -145271 -190455 -54425 -29370
12259 -29370 -54980 -77216 -83544 -54876 -5066 -71041 -76458 -17320 -43775 -74230 -52620 -73910
12247 -73910 -17124 -23203 -66279 -95938 -77464 -181800 -275745 -249690 -131939 -49066 897
12236 897 -30947 -124589 -128442 -110407 -106246 -77877 -93563 -107904 -92244 -100151 -77700 -61219 -8186
12223 -8186 59722 161803 176081 140220 62514 74423 80710 86874 172174 225396 240884 245617
12211 245617 218876 165431 180458 137009 63940 104395 98990 4425 8001 70687 -21717 -28984
12199b8984J35306l0906j34883P6030P7133Q4895K8609j19425m2737K6508J14999
12188A86545R5561p0005k6375m3421n852P1820N2727p570n4616n9111l5096O4971
12176A69578K9922k6676l0162K492r6437j5358M4008P8137J6123j1311K281L1784
12164A94381N7064l7917O1737N6475o0758n2637j10508o3449M46M2811j8477n7075
12152A2093K5372K0496M5701M7103l621m1723J2853n1303O0391R0309j3603r0310
12140A13758L6142N9348l5622R82K9642j15608J4369j0816J4619l7469o348j5870
12128D7127K3029K8803M4153j25786m8821K1070L2036n311M1824M6782j2708J3540
12116A05738M8771p0358J6976k0636M1573l0259p0098j2944N2623k1013K82k0498
$$ plain form
12199 -28984 106322 75416 -59467 16563 93696 178591 207200 87775 45038 71546 186545
12188 186545 282106 212101 185726 142305 136453 208273 261000 253430 198814 139703 104607 169578
12176 169578 199500 172824 142662 145154 48717 33359 77367 155504 171627 160316 162597 194381
12164 194381 251445 213528 275265 331740 270982 218345 107837 44388 44834 87645 69168 12093
12152 12093 37465 57961 103662 150765 147144 105421 118274 66971 127362 217671 204068 113758
12140 113758 149900 209248 173626 174608 204250 88642 103011 92195 106814 69345 62997 47127
12128 47127 70156 98959 143112 17326 -31495 -10425 21611 16300 58124 104906 92198 105738
12116 105738 154509 84151 101127 80491 122064 91805 21707 8763 61386 40373 40655 20157
12104B0157M2468m6188J0003J9168K1919O37K5585J8792m5675K7401j2614n5808
12092B5845J4796M6011R2657P3225m6727p2196J7233J3056l3921J541m8774K8848
12080A11594J1087n5988n7106k2K7886J13182M4931L360O7952n9971J7984n4025
12068A70864J29525N6847O2216J47263Q8118r4403Q3273J57549j526K0960q2899
12057G37787k6218J9606j3680l8116J2914n7203l9027M4512R2135M0037Q6492
12046H59239k9401n8854p2334n8171l6424J07868M7034N9685J8250r5171m8111
12035F93610p4479o2952l9730m0079k0223l3317j00305n3196O0811k1423k3162
12024B85555j553N0309O419M931m0378l2515M3538M6139p4491m7416R7380N4220
$$ plain form
12104 20157 62625 16437 26440 45608 67527 68164 93749 112541 66866 94267 81653 25845
12092 25845 40641 86652 179309 252534 205807 133611 150844 163900 129979 131520 82746 111594
12080 111594 122681 66693 9587 9565 37451 150633 195564 198924 266876 206905 224889 170864
12068 170864 300389 357236 419452 566715 654833 560430 643703 801252 799726 820686 737787
12057 737787 711569 731175 717495 679379 692293 635090 596063 640575 732710 772747 859239
12046 859239 829838 770984 698650 640479 604055 711923 758957 818642 836892 741721 693610
12035 693610 619131 556179 516449 476370 456147 422830 322525 269329 330140 308717 285555
12024 285555 284002 334311 340730 345661 305283 272768 316306 362445 287954 240538 337918 392138
12012C92138K6078o3976M7256j9014n169L0829K3987N9560k8358q7851q3875k3178
12000B68427L2775j3688M3653J5557P8904J1237J2005J9213L0268N2630Q6556
11989F37537P212L3835L1261L1669M6834q3445J3579M2187k8547M9726J72297
11978I54145J07131J1119M6805J4799L2961O8546M312L4782K6356R7878O4596
11967A463430P7724R8587K6847J00340M5642Q8348J8877M846Q4744K23433K14536
11956B447354Q5361N0393J53275K53722K16120K30161K16391K27584L39070K94520
$$ plain form
12012 392138 418216 354240 401496 382482 377313 408142 432129 491689 463331 375480 291605 268427
12000 268427 301202 287514 331167 346724 425628 436865 448870 468083 498351 550981 637537
11989 637537 644749 678584 709845 741514 788348 704903 718482 760669 732122 781848 954145
11978 954145 1061276 1072395 1119200 1133999 1166960 1235506 1239818 1274600 1300956 1398834 1463430
11967 1463430 1541154 1639741 1666588 1766928 1812570 1900918 1919795 1924641 2009385 2232818 2447354
11956 2447354 2532715 2583108 2736383 2990105 3206225 3436386 3652777 3880361 4219431 4513951
$$ [...]
##END NTUPLES=NMR SPECTRUM
##END=
