##TITLE=Analysis number 327904
Compound Code sb 01283
Book Reference b
Project Code adrs
Chemist Name flurochem
##JCAMPDX= 6.0         $$ Bruker NMR JCAMP-DX V2.0
##DATA TYPE= NMR SPECTRUM
##DATA CLASS= NTUPLES
##ORIGIN= Bruker BioSpin GmbH
##OWNER= nmr
$$ XWIN-NMR		Version 3.5
$$ Tue Apr 17 09:14:51 2007 GMT Daylight Time (UT+1h)  MAYBRIDGE\nmr@NMR_250MHZ
##.OBSERVE FREQUENCY= 250.131544655141
##.OBSERVE NUCLEUS= ^1H
##.ACQUISITION MODE= SIMULTANEOUS (DQD)
##.ACQUISITION SCHEME= undefined
##.AVERAGES= 16
##.DIGITISER RES= 18
##SPECTROMETER/DATA SYSTEM= dpx250
##.PULSE SEQUENCE= zg30
##.SOLVENT NAME= CDCl3
##.SHIFT REFERENCE= (INTERNAL, CDCl3, 0, 16.522)
##AUDIT TRAIL= $$ (NUMBER, WHEN, WHO, WHERE, WHAT)
$$ ##TITLE= Audit trail, XWIN-NMR		Version 3.5
$$ ##JCAMPDX= 5.01
$$ ##ORIGIN= Bruker BioSpin GmbH
$$ ##OWNER= nmr
$$ C:\u/data/dgb/nmr/ADRS/1570/pdata/1/auditp.txt
$$ ##AUDIT TRAIL=  $$ (NUMBER, WHEN, WHO, WHERE, WHAT)
(   1,<2007-04-17 09:14:27.66 +100>,<MAYBRIDGE\nmr>,<NMR_250MHZ>,
      <created by zg, POWCHK disabled, PULCHK disabled
       configuration hash MD5:
       49 4B E0 1D 92 C2 6B 37 9F E6 65 BC 52 41 86 1D
       data hash MD5: 64K
       AB 73 A8 31 8F 5B D4 A5 A5 06 0A 04 2A E0 49 43>)
(   2,<2007-04-17 09:14:41.33 +100>,<MAYBRIDGE\nmr>,<NMR_250MHZ>,
      <Start of raw data processing
       ef LB = 0.3 FT_mod = 6 PKNL = 1 SI = 32K 
       data hash MD5: 32K
       A3 FB 90 29 FA 64 86 22 D7 2A 0B 93 DF 89 12 63>)
(   3,<2007-04-17 09:14:43.13 +100>,<MAYBRIDGE\nmr>,<NMR_250MHZ>,
      <apk 
       data hash MD5: 32K
       4E 75 2C 04 8D 5A 85 B7 4F FC 59 9F 4C BE 61 05>)
(   4,<2007-04-17 09:14:43.95 +100>,<MAYBRIDGE\nmr>,<NMR_250MHZ>,
      <abs ABSG = 5 
       data hash MD5: 32K
       F3 61 09 F3 8F 84 B4 BF 4E E3 F1 D7 5E 11 4F A7>)
$$ ##END=
$$ 
$$ hash MD5
$$ E6 92 1C 1C E7 31 87 6F 9C 37 1A 00 B0 0F B5 E2
##$RELAX= 
##$RELAX= 
##$RELAX= 
##$RELAX= 
##$RELAX= 
##$RELAX= 
##$RELAX= 
$$ Bruker specific parameters
$$ --------------------------
##$DU= <C:\u>
##$EXPNO= 1570
##$NAME= <ADRS>
##$PROCNO= 1
##$TYPE= <nmr>
##$USER= <dgb>
##$AMP= (0..31)
100 100 100 100 100 100 100 100 100 100 100 100 100 100 100 100 100 100 
100 100 100 100 100 100 100 100 100 100 100 100 100 100 
##$AQSEQ= 0
##$AQ_mod= 3
##$AUNM= <au_zg>
##$AUTOPOS= <5 >
##$BF1= 250.13
##$BF2= 250.13
##$BF3= 250.13
##$BF4= 250.13
##$BF5= 500.13
##$BF6= 500.13
##$BF7= 500.13
##$BF8= 500.13
##$BYTORDA= 1
##$CFDGTYP= 0
##$CFRGTYP= 5
##$CHEMSTR= <none>
##$CNST= (0..31)
1 1 145 1 1 1 1 1 1 1 1 1 1 1 1 1 1 1 1 1 1 1 1 1 1 1 1 1 1 1 1 1 
##$CPDPRG= <>
##$CPDPRG1= <>
##$CPDPRG2= <>
##$CPDPRG3= <>
##$CPDPRG4= <mlev>
##$CPDPRG5= <mlev>
##$CPDPRG6= <mlev>
##$CPDPRG7= <mlev>
##$CPDPRG8= <mlev>
##$CPDPRGB= <>
##$CPDPRGT= <>
##$D= (0..31)
0 1 0 0 0 0 0 0 0 0.06 0 0 0 0 0 0 0.0002 0 0 0 0 0 0 0 0 0 0 0 0 0 0 
0 
##$DATE= 1176797666
##$DBL= (0..7)
120 120 120 120 120 120 120 120 
##$DBP= (0..7)
150 150 150 150 150 150 150 150 
##$DBP07= 0
##$DBPNAM0= <>
##$DBPNAM1= <>
$$ [...]
##$SUBNAM7= <"">
##$SUBNAM8= <"">
##$SUBNAM9= <"">
##$SW= 20.6930455092707
##$SWIBOX= (0..15)
0 0 3 0 0 0 0 0 0 0 0 0 0 0 0 0 
##$SW_h= 5175.983436853
##$TD= 65536
##$TD0= 1
##$TE= 683.16
##$TE2= 300
##$TE3= 300
##$TEG= 300
##$TL= (0..7)
0 120 120 120 120 120 120 120 
##$TP= (0..7)
150 150 150 150 150 150 150 150 
##$TP07= 0
##$TPNAME0= <>
##$TPNAME1= <>
##$TPNAME2= <>
##$TPNAME3= <>
##$TPNAME4= <>
##$TPNAME5= <>
##$TPNAME6= <>
##$TPNAME7= <>
##$TPOAL= (0..7)
0.5 0.5 0.5 0.5 0.5 0.5 0.5 0.5 
##$TPOFFS= (0..7)
0 0 0 0 0 0 0 0 
##$TUNHIN= 0
##$TUNHOUT= 0
##$TUNXOUT= 0
##$USERA1= <user>
##$USERA2= <user>
##$USERA3= <user>
##$USERA4= <user>
##$USERA5= <user>
##$V9= 5
##$VALIST= <valist>
##$VCLIST= <CCCCCCCCCCCCCCC>
##$VD= 0
##$VDLIST= <DDDDDDDDDDDDDDD>
##$VPLIST= <PPPPPPPPPPPPPPP>
##$VTLIST= <TTTTTTTTTTTTTTT>
##$WBST= 1024
##$WBSW= 4
##$XGAIN= (0..3)
0 0 0 0 
##$XL= 0
##$YL= 0
##$YMAX_a= 542395
##$YMIN_a= -619539
##$ZGOPTNS= <>
##$ZL1= 120
##$ZL2= 120
##$ZL3= 120
##$ZL4= 120
##$ABSF1= 16.522
##$ABSF2= -4.171173
##$ABSG= 5
##$ABSL= 3
##$ALPHA= 0
##$AQORDER= 0
##$ASSFAC= 0
##$ASSFACI= 0
##$ASSFACX= 0
##$ASSWID= 0
##$AUNMP= <proc_1d>
##$AZFE= 0.1
##$AZFW= 0.1
##$BCFW= 0
##$BC_mod= 0
##$BYTORDP= 0
##$COROFFS= 0
##$CY= 12.5
##$DATMOD= 1
##$DC= 0
##$DFILT= <>
##$DTYPP= 0
##$F1P= 14.0000005364418
##$F2P= -0.99999901652339
##$FCOR= 0.5
##$FTSIZE= 32768
##$FT_mod= 6
##$GAMMA= 0
##$GB= 0
##$INTBC= 1
##$INTSCL= 1
##$ISEN= 128
##$LB= 0.3
##$LEV0= 0
##$LPBIN= 0
##$MAXI= 10000
##$MC2= 0
##$MEAN= 0
##$ME_mod= 0
##$MI= 0
##$NCOEF= 0
##$NC_proc= -4
##$NLEV= 6
##$NOISF1= 0
##$NOISF2= 0
##$NSP= 0
##$NTH_PI= 0
##$NZP= 0
##$OFFSET= 16.522
##$PC= 1
##$PHC0= 230.3017
##$PHC1= 5.041256
##$PH_mod= 1
##$PKNL= yes
##$PPARMOD= 0
##$PSCAL= 4
##$PSIGN= 0
##$REVERSE= no
##$SF= 250.13
##$SI= 32768
##$SIGF1= 0
##$SIGF2= 0
##$SINO= 400
##$SIOLD= 32768
##$SREGLST= <1H.CDCl3>
##$SSB= 0
##$STSI= 32768
##$STSR= 0
##$SW_p= 5175.98343685301
##$SYMM= 0
##$S_DEV= 0
##$TDeff= 65536
##$TDoff= 0
##$TI= <Analysis number 999999
Compound Code 99
Book Reference 9
Project Code 9>
##$TILT= no
##$TM1= 0
##$TM2= 0
##$TOPLEV= 0
##$USERP1= <user>
##$USERP2= <user>
##$USERP3= <user>
##$USERP4= <user>
##$USERP5= <user>
##$WDW= 1
##$XDIM= 32768
##$YMAX_p= 536456844
##$YMIN_p= -214823
$$ End of Bruker specific parameters
$$ ---------------------------------
##NTUPLES= NMR SPECTRUM
##VAR_NAME=  FREQUENCY,     SPECTRUM/REAL,   SPECTRUM/IMAG
##SYMBOL=    X,             R,               I
##VAR_TYPE=  INDEPENDENT,   DEPENDENT,       DEPENDENT
##VAR_FORM=  AFFN,          ASDF,            ASDF
##VAR_DIM=   32768,         32768,           32768
##UNITS=     HZ,            ARBITRARY UNITS, ARBITRARY UNITS
##FACTOR=    0.157963299565203, 1,           1
##FIRST=     4132.6476996994, 0,             0
##LAST=      -1043.33573715361, 0,           0
##MIN=       -1043.33573715361, -214823,     0
##MAX=       4132.6476996994, 536456844,     0
$$ Real data points
##PAGE= N=1
##DATA TABLE= (X++(R..R)), XYDATA
$$ [...]
23622a3024J6405N113J7765L0303n771R414n6148j577j2270k2057K548K2901j111
23609g509j6943J1479n1901P043J6815J4688L7528l0852l451L4417K1747J2223
23597D5284j4045j4337n3987O9486L7259m6506l8345K8623o2165q932J7344O975
23585c3346k596j1566J4690p483r716j7434Q827O9472l5420l9021K5647J7303
23573b0643J560L800j6421J4235l1401k8225P5652L2642Q581j9423k0652m1146
23561d1441j5569K1661O0019o276m2255O853O3791K423p682k322o0306J5473M0360
23548C4729K0654k9095r130J0315m3342P498l7460L971K9106k5180o0864Q877
23536h9921l8585J9033K5631L7394J4199K8479J1986l0709n4279J6416J0941k9712
$$ y = [-13024, 3381, 8494, 26259, 56562, 50791, 60205, 4057, 2480, -9790, -31847, -29299, -6398, -7509, -24452, -12973, -64874, -57831, -41016, -26328, 11200, -19652, -23103, 11314, 33061, 45284, 31239, 16902, -37085, 32401, 69660, 23154, -15191, 13432, -48733, -57665, -40321, -33346, -35942, -47508, -32818, -40301, -50017, -67451, -58624, 10848, -24572, -63593, -37946, -20643, -19083, -15283, -31704, -17469, -48870, -77095, -1443, 31199, 39780, 20357, -295, -41441, -57010, -35349, 24670, 18394, -23861, -17008, 46783, 49206, 41524, 39202, -21104, -5631, 34729, 55383, 26288, 17158, 27473, -15869, -8371, -45831, -41860, -12754, -37934, -98798, -89921, -128506, -109473, -83842, -46448, -32249, -3770, 8216, -22493, -76772, -60356, -49415, -79127]
23524g9127j8328O251N03j6611L8757m589K520M2296K0951j3926R429P075q396
23511a3195Q323R028m8225J4428M753l6547L134J5369J8675K1086k4199r573J7146
23498a9797K714J3636r158m2394P03J30718K1682l2934k6650l6542k5313J7521
23486e814R641l4543m3162R8733O6473l1184p1247j0208J5574M122k6404K5549
23474b470J7428M4480N727r398l7082k6814R686n8641j1346K3505r21n725N540
23461d6031K7487P5939j2396k7786j564K5289N711k137K6693k2433K2352K5637
23449I6761o732m9547j8008k0910j3991J0547j4347N3266M295l5379k504j6278
23437a2827k9251j6558j1840K0517K4452O6954J0834k2764p1773l0788j9588j134
$$ y = [-79127, -97455, -91204, -90701, -107312, -68555, -73144, -70624, -28328, -7377, -21303, -11874, -4799, -13195, -4872, 4156, -44069, -29641, -24888, -61435, -58301, -42932, -24257, -3171, -27370, -36943, -19797, -17083, -3447, -12605, -54999, -54296, 76422, 98104, 65170, 38520, 1978, -23335, -5814, 3827, -30716, -73878, 24855, 91328, 60144, -11103, -21311, -5737, -1615, -28019, -2470, 14958, 59438, 65165, 55767, 18685, -8129, 1557, -57084, -68430, -44925, -45846, -51571, -46031, -18544, 57395, 44999, 17213, 15649, 40938, 46649, 44512, 71205, 48772, 71124, 96761, 90029, 40482, 22474, 1564, -12427, -1880, -16227, 37039, 41334, 5955, 3451, -12827, -42078, -58636, -70476, -49959, -25507, 41447, 52281, 29517, -42256, -73044, -92632, -93766]
23425i3766K0438M0558m036q357K0143m698L9500j7275K0152J9685J5282K1967
23413F9593J6991j9336l5005K5846J3306M319m095Q069m5467j4165k3834l4875
23401c8653L522K8986M5348q643m3168P1383O105j5106l6390m1431l5046K1485
23389d1608j555L529o954j7404j4967J7393j7999J5733j6153k1K7133k8222m1209
23376a22304J1269P4501j2422j361J2982k4363K5065k0900k7148M291P474J5829
23364e7087J6249N3228K2015j1330l2191l360L1385N106j3234p329K5090r04o5903
23351c8265j7956M9094J4656n6170K4441J5131N9559k09k486K7704M025N1210
23339A30734o51n0214q3600J4844K363n3882l6978J3470J3064p325oL6229K1604
$$ y = [-93766, -73328, -32770, -36806, -45163, -25020, -29718, 9782, -7493, 12659, 32344, 47626, 69593, 86584, 67248, 32243, 58089, 71395, 75714, 71619, 79688, 34221, 20056, -3778, -38653, -35131, -6145, 39203, 30560, -12608, 58775, 64880, 49774, 13384, -28047, -63093, -41608, -43163, -39634, -46588, -63992, -78959, -61566, -79565, -63832, -79985, -80006, -52873, -81095, -122304, -111035, -36534, -48956, -50317, -37335, -61698, -36633, -57533, -84681, -80390, -72916, -57087, -40838, 12390, 34405, 23075, -9116, -12476, 18909, 24015, 10781, 3452, 28542, 27638, -38265, -56221, -7127, 7529, -48641, -24200, -9069, 50490, 50281, 47795, 75499, 79524, 130734, 130083, 79869, -3731, 11113, 13476, -40406, -77384, -63914, -50850, -58175, -58181, -21952, -348]
23326c48K7592J3626n4068j1328M9104m7748l7764r648O3936n726l0377R0J5068
23313b7591j9504k0614k3237P247L392L0075M6090K7238L1024p047r413N451k5331
23300A7780j2683L3993P666j4656n3965O835j8746K7297n4220j4349j809K7668
23288d9189M2990N7842P272k4859R083Q764m1583o751J7879L1169l7467N753K6821
23275D7724j5563l5491J9775n11L362L1268m4078k7043j423L550K0814K580o9821
23262f4857J9074J5212J3653J5050J5702J3495Q864J397k7965l9370J4063j5600
23250c1282l8467R255O1076K1484K1724J668J8873j4856m5580o325K7288m0963
23238a6105O466j4310l3705n62K7795L1503K0851n3662j4126l3993m1855O443
$$ y = [-348, 27244, 40870, -13198, -24526, 24578, -23170, -60934, -70582, -6646, -12372, -42749, -42659, -27591, -47095, -67709, -90946, -83699, -80307, -50232, -4142, 23096, 54120, 47073, 37660, 43111, 17780, 5097, 39090, 46756, 32100, -21865, -15030, -33776, -6479, -60699, -75048, -76857, -49189, -6199, 51643, 58915, 34056, 43139, 51903, 10320, 3569, 21448, 52617, 15150, 20903, 47724, 32161, -3330, 16445, 15934, 19296, 50564, 6486, -20557, -21980, -18430, 2384, 4964, -64857, -45783, -30571, -16918, -1868, 13834, 27329, 36193, 37590, 9625, -29745, -15682, -31282, -69749, -60494, 582, 22066, 43790, 45458, 64331, 49475, 3895, -2430, 24858, -16105, -9639, -23949, -57654, -58216, -30421, 1082, 21933, -31729, -45855, -79848, -121703, -115260]
23226a15260m365L9281L683L5365M4030q234j5520K4455q590J6718n5941m2063
23214h6441P4169M6371N7003j5023R240J8120k5112l4426m9479J213p274k7611
23202c9250j5668N474L3180K2050J9424K2253N0511k8121p0001k1090J4105L5135
23190B8002k903o1533j9379L7300j4445J2978J8769L3886k7039J2917J4117l3179
23178e09K390o2973o3481K0772K9223M1973k1031K7751p864l341J5135k0050J9432
23165b2573J0397J4676R981l3077P539q900k483l9213m064J4408M5379N2702k0321
23152B4451o8036l0313K2827L0019K6585m171k530L5049l8179k1802j5263O123
23140c5240K9331O430k9351j5780j4923K2497n026j3214r653j6944L4184L1633
$$ y = [-115260, -119625, -80344, -76661, -41296, 2734, -5500, -21020, 3435, -5155, 11563, -44378, -86441, -12272, 34099, 91102, 76079, 85319, 103439, 78327, 43901, -5578, -4365, -11639, -39250, -54918, -49444, -16264, 5786, 25210, 47463, 97974, 69853, -148, -21238, -7133, 28002, 25099, -36434, -55813, -18513, -32958, -19980, -1211, 32675, 5636, 18553, 32670, -509, 1881, -61092, -124573, -103801, -74578, -32605, -53636, -25885, -33749, -37090, -21955, -42005, -22573, -12176, 2500, 12481, -20596, -13057, -21957, -24440, -63653, -67717, -53309, -7930, 44772, 24451, -43585, -73898, -51071, -21052, 5533, 1362, -1168, 33881, -4298, -26100, -41363, -35240, -5909, 521, -28830, -44610, -59533, -37036, -42062, -55276, -64929, -81873, -47689, -16056]
23128a6056L166K7413L1915j9131r011M388M2045N733o3034j08965J8656Q3518
23116F37Q770o8774j0334P306K946L0833j4656q0851K6436L8238L033M3877R759
23103b780N3121j7532n9048j0841O9279J2040l5879K18k1318n620N4747q960J6669
23090D4096N9688l3419m4564M0189N5477K9511l188n8170n5728l1149l7321L113
23078c1465K6129O1921j9995p8376J9273K0437J5886p943K4671j6906k4513m1001
23066e1882K3877L0100K3049O048J3696K0897k3299n8258n4668n565J7845M5449
23054a2711L9178J1999m237j2082j75m8296k7348Q599p488k2810M5892M3438M6964
23041F0923m5729l4264l207l9126l4571n3971K5481O9791M7302K3416k6307k8001
$$ y = [-16056, -12890, 14523, 46438, 27307, 18296, 22684, 64729, 70462, 7428, -101537, -82881, 637, 9407, -59367, -69701, -62395, -59449, -28616, -43272, -124123, -97687, -59449, -56416, -12539, -2780, 50341, 32809, -26239, -37080, 32199, 44239, 8360, 8578, -12740, -18360, 36387, 27427, 44096, 103784, 70365, 25801, 65990, 121467, 150978, 147790, 89620, 33892, 2743, -34578, -31465, -5336, 56585, 36590, -41786, -22513, -2076, 13810, 5867, 30538, 13632, -10881, -51882, -28005, 2095, 25144, 31192, 44888, 65785, 42486, -15772, -70440, -76005, -58160, -12711, 26467, 38466, 34229, 22147, 21972, -26324, -53672, -45073, -52561, -75371, -29479, 13959, 60923, 15194, -19070, -22277, -61403, -95974, -149945, -124464, -54673, -7371, 16045, -10262, -38263]
23029c8263p391m1405K6629J1882n0764o946J0881O163J8846k168K5010K0200
23017b7326j816k1900K7073J8453k6731K0304k4385n6853L9135M4027N1092J1793
23005E2866o164j1327k7509n723j8075n8917K5376O5508K5250o398j3254l5607
22993a3974m280q232K7660k6296p83K2655m5240J3559K9368j2570m3132J0792
22981e0473K2622K6696M0378r073k2006m7454k691j2105K9084J8046K6691n8476
22969c8761j2332m5542K4547O0096K7789p117j1483J2172L234j9271q039M3576
22957B8869J5500J1793l4256j7590J0200J1442O938l4435Q480J6308K922M7259
22945G3430J251l8115k2961l5176l5392J6681m3760o259K113j1843N574N4750
$$ y = [-38263, -45654, -87059, -60430, -48548, -99312, -106258, -95377, -89214, -70368, -72536, -47526, -27326, -29142, -51042, -23969, -5516, -32247, -11943, -36328, -93181, -54046, -10019, 41073, 52866, 46702, 35375, 7866, 2143, -15932, -74849, -49473, 16035, 41285, 34887, 21633, -13974, -18254, -26486, 1174, -25122, -25905, -3250, -48490, -34931, -5563, -18133, -61265, -50473, -27851, -1155, 39223, 30150, 8144, -39310, -42001, -54106, -25022, -6976, 19715, -38761, -51093, -96635, -72088, -11992, 15797, 8680, -2803, 9369, 12603, -6668, -14707, 28869, 44369, 56162, 21906, 4316, 14516, 25958, 32896, -1539, 6941, 23249, 26171, 73430, 74681, 36566, 13605, -21571, -56963, -40282, -84042, -90301, -88188, -100031, -94457, -39707]
22933c9707L4210J009k3053O3512Q7346j29p0052l7456n0835m8054r200N5733
22921c6676L2368l3856k531K7886L7719O866l5674l0685L245l083j6095L7867
22909a2649J0087k1364j6904P0041J1481K6075j3079n5101K907l1510j2515l590
22897d6121P07l2583j4785L7929N2371k4585l6571r52o407o457j5091J3729K2101
22884e6715k6665L4648L2197o600O7600j8703j6575K2565j6591k6863k5263k5484
22872f2449L3077Q689o1107k6344J7203q340M478l349O282J6198m1893J959K4065
22859i1531N6839L2440O1710k3615q6579k5536k585K5590M0939n754J4772J7015
22847A3705L2959q718m0675l5290k5153R153M007n9996J5602J9662j8371M1117
$$ y = [-39707, -5497, -4488, -27541, 35971, 123317, 123188, 53136, 15680, -35155, -83209, -92409, -36676, -4308, -38164, -40695, -12809, 24910, 31776, -3898, -34583, -31338, -34421, -50516, -12649, -2562, -23926, -40830, 29211, 40692, 66767, 53688, -1413, 1494, -30016, -42531, -46121, -45414, -77997, -92782, -54853, -2482, -27067, -63638, -64590, -70997, -77454, -92545, -78816, -56715, -83380, -48732, -16535, -23135, 44465, 25762, 9187, 31752, 15161, -11702, -36965, -62449, -29372, -20683, -81790, -108134, -90931, -99271, -94793, -98142, -91860, -75662, -117555, -115596, -91531, -34692, -2252, 59458, 35843, -50736, -76272, -78857, -53267, -12328, -18082, -3310, 13705, 46664, 37946, -2729, -38019, -63172, -54019, -50012, -110008, -94406, -74744, -93115, -51998]
22835e1998N3134l255J9877j2506o1150N918J9061J4082j9467J4951J0137K369
22823h847L9492l5989k2376L4213N3793l0479k2289J6247j7426j0312m9926n8269
22811a12168n4M1827L9074k678m3782j3635K1406J9658N936j068j6578K8641N2247
22798A8826O1791M461l1923m1247L1129k8766K1258j9619k9525J5960L2328K2787
22786E7460L3376l376m6341j6179k6632j8934j7644K4691N0097j5798j8104M2614
22774D5230J0777m8227l9377O009J8955R086L7736L7117j8917k3997J8829m4209
22762I012l555m2920j2533L9115q709l2594J8649j9839j3053L8720j2936m2199
22750h2842K0939L3266P5108M3531q54L528J2774j9838r405J804o669L288Q249
$$ y = [-51998, 1136, -2119, 17758, 5252, -55898, -49980, -30919, -16837, -36304, -21353, -11216, -8847, 30645, -5344, -27720, 6493, 60286, 29807, 7518, 23765, 6339, -3973, -53899, -112168, -112222, -70395, -31321, -33999, -77781, -91416, -70010, -50352, -44416, -45484, -62062, -33421, 18826, 80617, 85078, 53155, 11908, 43037, 14271, 35529, 15910, -13615, 2345, 34673, 57460, 90836, 87460, 41119, 24940, -1692, -20626, -38270, -13579, 36518, 20720, 2616, 45230, 56007, 7780, -31597, -25588, -6633, 2453, 40189, 77306, 58389, 34392, 53221, 9012, 5457, -37463, -49996, -10881, -19590, -52184, -33535, -53374, -66427, -27707, -40643, -82842, -61903, -28637, 46471, 90002, 89148, 92676, 105450, 85612, 76207, 78011, 71342, 74630, 82879]
22737H2879o2023m2094k3861K7929j5930L3390L0546Q397j7625m7738l7280k7667
22725i1077P6697O9837o9457j4072M2679j9641p2866n780L4114M3209n473J3538
22713A708l987K9545j0132J1408n0619j4743L0688j2344J3243p74L620N0430j9559
22700B8484k6217O48K1070J8679J2982m8140o8604j6995K7215K2618Q293j6891
22688c6858k1669o515o636j4595J2609k1642N383M7183M1244J1467k3367K288
22676a1108k2477O255n1752k2307K3651M5583N3837Q3668j0506n6165j8884j9402
22664C93n863j7735n300j2878K4889j7531l0020N2465O26K923l1058o7625k3469
22651a30183L7859L9944M056K889K5228Q99j4491J6064k9665N6071L2385M289
$$ y = [82879, 20856, -21238, -45099, -17170, -33100, 290, 30836, 39233, 21608, -26130, -63410, -91077, -14380, 55457, -14000, -28072, 14607, -5034, -77900, -83680, -49566, -6357, -11830, 1708, -2279, 27266, 17134, 28542, -22077, -36820, -6132, -18476, -5233, -6007, -2387, 48043, 28484, 2267, 2915, 23985, 42664, 55646, 7506, -61098, -78093, -50878, -28260, -19967, -36858, -58527, -65042, -71678, -86273, -73664, -95306, -89923, -42740, -1496, 9971, -13396, -11108, -33585, -27330, -79082, -101389, -77738, -32155, 21682, 105350, 94844, 38679, 19795, 393, -5470, -23205, -28505, -41383, -16494, -34025, -64045, -11580, -10954, -8031, -39089, -106714, -130183, -92324, -52380, -48324, -45435, -20207, -19308, -33799, -17735, -47400, 8671, 41056, 45345]
22639D5345k0016M62J0030j1015j5180K2675N7902j3605j4K1975k5692n8849m0688
22626b6670J2124N265L1456L713m8127o132M9985J4405o7742L895M661K5326J0905
22613A3064n0990p1124L566L2879K6120M7820J3132k147K2979l4741j7285L8361
22601B1634l875k2551O3166N0084j5663j6107n0190m1412n0206o328K1869L8419
22589a1160K8088P834m2365m5380q054N0837K3610L966M036l472j5236K9775K5607
22576D8086M5730o4239q0062l6361L7221K7720O5096n3841m1542K3695r282O203
22564c1576M4615J3855q5535l0972J5109M646K6151K1578p1461m2154r043M0494
22552a04293P3555L3909J4444j8590j1323L7950K3948p2295k7896L3067O3976
$$ y = [45345, 25329, 25791, 35821, 24806, 9626, 32301, 90203, 76598, 76584, 98559, 72867, 14018, -26670, -14546, -9281, 22175, 25888, -22239, -28371, 21614, 36019, -31723, -27828, -23167, 2159, 13064, -37926, -109050, -105484, -72605, -46485, 1335, 14467, 12320, 35299, 558, -16727, 21634, 17759, -4792, 58374, 108458, 92795, 76688, 26498, -14914, -65120, -71448, -49579, -11160, 16928, 24762, -17603, -62983, -71037, -20200, 3410, 7376, 11412, 7940, -7296, 22479, 48086, 93816, 29577, -50485, -86846, -49625, -21905, 43191, -10650, -52192, -28497, -37779, -31576, 13039, 26894, -58641, -89613, -74504, -69858, -43707, -22129, -93590, -135744, -144787, -104293, -30738, 3171, 17615, -975, -12298, 25652, 49600, -22695, -50591, -17524, 46452]
22541D6452k9923n7060K2652K0464O2190q649k9313j47K0143J5117k1543j5731
22529B4652l7190M4495n932m7198l0635k4397K7192K3555l1969J0993M9444l1022
22517b8012n8670N2801L5830L0753O72K2099m5898J9383j594K9568K1753o5328
22505A3357j5019k0129j3830j918r764m6996L0966M6565j1151L8522L105k3674
22493i966m4153L5187L6324l87Q09j7846o3894j1586Q0693L4447M18l2313j4962
22480g229J6551N5789r379l3507K62l0497j4654k1680k2946M808j3034K3580K2052
22467b9884j7936L2703k231j9170L2275K1499N4511j2263N91j142m5155p4889
22455f1091L7390O7263J8873r6201j0954J0225P7228M1885l2395p9702k7355L8970
$$ y = [46452, 16529, -40531, -17879, 2585, 64775, 56126, 26813, 26666, 46809, 61926, 40383, 24652, -12538, 31957, 26025, -21173, -51808, -76205, -49013, -25458, -57427, -46434, 3010, -28012, -86682, -33881, 1949, 32702, 33374, 55473, 9575, 28958, 27364, 56932, 78685, 13357, -1662, -21791, -35621, -37539, -47303, -94299, -63333, -16768, -27919, 10603, 13708, -9966, -54119, -18932, 17392, 17005, 17814, -32, -63926, -75512, 5181, 39628, 40046, 7733, -7229, 9322, 65111, 55732, 22225, 22487, -8010, -22664, -44344, -67290, -62482, -75516, -51936, -29884, -47820, -15117, -17348, -36518, -4243, 17256, 71767, 59504, 60095, 58953, 13798, -61091, -23701, 43562, 62435, -33766, -44720, -34495, 42733, 84618, 52223, -27479, -54834, -15864]
22443a5864M7337K5188J9698j4277q3150N211J3368J6304N2983M5714l27j671
22431A10514J001P589o5785m1219p6647M8622K8013p1320n2786K8674O3772N8942
22419C9370l2261k8900L1203n5138K3149J9376j4609k3105J9370L3676k8464m7470
22407f3803N3261k3520j2133N7283K9425K637K1148m6084l4782M4353k532j8565
22395F688M0011N7089K2312o2409k8155n6636j6957K6069J6969k2787k2302m6304
22383h6412n741m4953N5513N8175M4677L6329p742l1175O15K2454m9933Q37Q10
22370f546M583L5372J0651k6079p699J8745k4410j0419M512k3195r4432m0692
22358a59609K2923M4797M8948M0734M1346n3445k2711J1535L551J1640l992j049
$$ y = [-15864, 31473, 56661, 76359, 62082, -21068, -15857, -2489, 13815, 66798, 112512, 112185, 110514, 111515, 119104, 53319, 12100, -64547, -15925, 12088, -59232, -112018, -83344, -19572, 39370, 7109, -21791, 9412, -45726, -22577, -3201, -17810, -40915, -21545, 12131, -16333, -63803, -10542, -34062, -46195, 11088, 40513, 43150, 64298, 18214, -16568, 27785, 25253, 6688, 46699, 103788, 126100, 63691, 35536, -21100, -38057, -11988, 4981, -17806, -40108, -86412, -92153, -137106, -81593, -23418, 21259, 57588, 49846, 18671, 19286, 41740, -8193, -7356, -6546, -1963, 33409, 44060, 17981, 10282, 29027, 4617, -5802, -1290, -24485, -118917, -159609, -136686, -91889, -42941, -2207, 39139, -14306, -37017, -25482, -21931, -10291, -14283, -15332]
22346a5332O4966m5352l8834J0804k0707P854o603m4234r849M3862O393k7817
22334g4849J9794L2265K794J9051K5228j2366K6229J5032j8492J490m2324q8871
22322i5019k1053l456Q824k419J0727J4087R187m556j4141j864q878M8813k0402
22309h0150k3246L1344M9597j8529l0335Q728k5708K0773K1578L1593L7874l3029
22297i510m4989M5133P047r527J9761l2169m3016K8386J5558j6981r240r128l3790
22284i2465Q035J7778K2417P6722L8601m2400n7254q526k125j4323M0532L937
22272i071m6646j9122P423J7957K7002K6348N9226j620m6010k0144N787J8494
22260A9624j608K6855K061o7307k8837J0996N2197K1862j2805J8848M2831K3806
$$ y = [-15332, 49634, 4282, -34552, -23748, -44455, -36601, -43204, -87438, -97287, -53425, -47032, -74849, -55055, -22790, -19996, -945, 24283, 11917, 38146, 53178, 34686, 36176, -6148, -95019, -116072, -119528, -110704, -113123, -102396, -88309, -79122, -83678, -97819, -99683, -108561, -59748, -80150, -103396, -72052, -22455, -40984, -71319, -62591, -88299, -67526, -45948, -14355, 23519, -9510, -54499, -9366, -2319, -11846, 7915, -24254, -67270, -38884, -23326, -40307, -49547, -58675, -92465, -84430, -66652, -44235, 32487, 71088, 28688, -28566, -37092, -39217, -53540, -13008, -9071, -55717, -74839, -67416, -49459, -22457, 3891, 63117, 61497, 15487, -4657, 1130, 19624, 18016, 44871, 46932, -20375, -49212, -38216, 13981, 35843, 23038, 41886, 84717, 108523]
22248A08523m3952n8731l6905j2599L997j24J0143M3581M6794R81k8232o158N1773
22235G9091K1638k4706j6254Q930Q246o0231n0991k482Q5443Q436l5278J006j9285
22222C563K153O139J4115L2187L4676k2579k6553m4425p3247K0635M9282J6111
22210A2057Q41J8752k9243L6257j2524O713j4904K614K6947k2459m2468k4865
22198d2282L6297L4746q082k5355M4543J7013J0786O483o6731j7286m2084L1754
22186b0198L1651P480k005L2917J6988o1355m5552J1166P810L5502l2871L5936
22174A7469L743l5743L8697j979q332q749n178j8974J8442N4236K3832m8990l3373
22161d899P29j0289k5417J125K2318j3473p349J8220l9798K761L3113M6922k1325
$$ y = [108523, 64571, 5840, -31065, -43664, -39667, -39791, -29648, 13933, 60727, 61708, 33476, 27318, 79091, 100729, 76023, 59769, 68699, 76945, 16714, -34277, -36759, 48684, 57120, 21842, 22848, 3563, 5716, 11855, 25970, 58157, 92833, 70254, 43701, -724, -73971, -53336, -4054, 12057, 12898, 31650, 2407, 38664, 26140, 32853, 17949, 20563, 47510, 25051, -17417, -42282, -5985, 28761, 20679, -4676, 39867, 56880, 67666, 74149, 7418, -9868, -51952, -20198, 11453, 18933, 16928, 49845, 66833, 5478, -40074, -28908, -21098, 14404, -18467, 17469, 21212, -14531, 24166, 22187, 13855, 5106, -72, -19046, -604, 53632, 77464, 28474, -4899, -4170, -14459, -39876, -38751, -16433, -29906, -37255, -19035, -58833, -56072, -22959, 23963, 2638]
22148B638m2670j2207J3730K6539K2630n9266l4484N1724M2163p94L938K3041
22136C6982l5620n3269j9963l1173J5148K8754K7552j1167L3114J9632l7086K596
22124b4500L1337l7901k2992N286L5967j9590j3808L1081J3716j2916N53K0843
22112G076K6168O734m1144j6041K0163j0944l5083M994k6800J9141k1685Q763
22100e8658j6289j3699K8398J5797L6388n4034k5418L6293j5694l4508J483K7470
22088g2471j29n289O755L3503K0731M1016K9772j4234q5262j5644N452K6423L3163
22075C786l9086k6729J3023O2323J6634N864p900O892L8202R927n7041m8982K7282
22062D195N0372J2470m0153l2648l7258K0276J3425k7700q27K0260O5867L8166
$$ y = [2638, -40032, -52239, -38509, -11970, 10660, -48606, -83090, -31366, 10797, 10003, 13941, 36982, 1362, -51907, -71870, -103043, -87895, -59141, -31589, -42756, -9642, 9990, -27096, -24500, 6837, -31064, -54056, -48770, -12803, -32393, -46201, -15120, -1404, -14320, -13767, 7076, 33244, 39978, -1166, -17207, 2956, -7988, -43071, -38077, -64877, -45736, -67421, -58658, -74947, -88646, -60248, -44451, -8063, -62097, -87515, -51222, -66916, -101424, -99941, -72471, -72600, -77889, -71134, -37631, -16900, 24116, 53888, 39654, -45608, -61252, -55800, -29377, 3786, -35300, -62029, -49006, 13317, 29951, 35815, 27915, 34807, 73009, 82936, 25895, -23087, 4195, 54567, 67037, 26884, -5764, -43022, -22746, -9321, -37021, -37848, -17588, 48279, 86445]
22050H6445k6263R004J7119j6059Jj138q6488j0098L742k9438K4427J8746L8640
22037B8640l5633j4078L5083L4612m0226l7427r047N875J6803m1128P069m5722
22025i5179l1934J8654M5722N1807M2928L5560L2170l4727o3637J5953L4191O894
22013E8402K5116o095J0860m4153p679K0201Q964k6399k9603q395k6486K3428
22001a839J5963r718l8620J6135L1572k1882l1960j8044j4781R433m5991k91M9292
21988f0731N5512k638K0593m208l0249j3665L4383O761k1589o326J4866j2378
21976a9669N9717L5125j8170k5051j960l6017m7041o5467k9525N4962M9310M016
21964c9770j9032L7821K8518j6043l5927n9717k246O6072O8272K1118q214Q626
$$ y = [86445, 60182, 69186, 86305, 70246, 70247, 69109, -17379, -27477, -23735, -53173, -28746, -10000, 28640, -6993, -21071, 14012, 48624, 8398, -29029, -38076, -32201, -15398, -56526, -49457, -95179, -127113, -108459, -62737, -10930, 31998, 67558, 99728, 65001, 1364, 17317, 51508, 58402, 83518, 77423, 88283, 44130, 36451, 56652, 65616, 39217, 9614, 1219, -25267, -1839, 14124, 4406, -34214, -18079, 13493, -8389, -40349, -58393, -73174, -63741, -109732, -110023, -60731, -5219, -7857, 12736, 8528, -21721, -35386, -1003, 5758, -15831, -22157, -7291, -19669, 40048, 75173, 57003, 31952, 29992, -6025, -53066, -118533, -148058, -93096, -43786, -39770, -58802, -20981, 7537, -8506, -44433, -104150, -106396, -40324, 27948, 49066, 40852, 49478]
21952D9478Q320n5370k9148J404m3122J8747K7528N193l416K0769q897p5429j5564
21939i9507L5684K6439K3364K8861N152o9806J557M0430J8961Q8537k6305m3129
21927C0238m9764l2790m68o7068j8110L2772O2656M9370p679j8828K1870J871
21915D070m3703l3500L665N8661L0699k8664J2974p54p5634m1251M0117M6973
21903b6347K985R307K3348M1972N4703J0795l6521o9613J2544j3103l1234k4317
21891d5481o592R926j9098K2917J550K5042J7697j9121l2659m0382l0644J0628
21879a06217K7107L8730n982l878n75k1680n5987K2935L2664Q590K3699N9561
21867A8967q48k1418j3474M6987K456j995l4221N0059K5688k1398j8174r53O0092
$$ y = [49478, 57798, 2428, -26720, -25316, -68438, -49691, -22163, -16970, -20386, 383, -8514, -83943, -99507, -63823, -37384, -14020, 14841, 19993, -49813, -48256, -7826, 11135, 99672, 73367, 30238, -19526, -52316, -52784, -119852, -137962, -105190, -42534, 6836, -843, -19671, 2199, 4070, -39633, -73133, -69468, -10807, 19892, -8772, 4202, 3448, -72186, -113437, -73320, -26347, -23362, -14055, 9293, 51265, 105968, 116763, 80242, 10629, 23173, 10070, -21164, -45481, -52073, -42147, -61245, -38328, -36778, -11736, 5961, -13160, -45819, -86201, -116845, -106217, -79110, -40380, -46362, -50240, -50815, -72495, -128482, -105547, -72883, -64293, -40594, 18967, 18119, -3299, -16773, 30214, 32670, 30675, -3546, 46513, 72201, 50803, 32629, 31676, 91768]
21854I1768l6042l6756N8879k9177k3088p7221M9956N4200k4477m2936j4826M1827
21842A2107M6983m4505o9889n8368J6597K1312k575J5958q465j9094j0172J8218
21830h1893N6379o8416K6353K4995j0710L4612N1083J7910Q368m0110n2937J1091
21818b3275L1559J6557m2947m669J7373j3771K0144k1954M3627m201j5047L743
21806G139j6794L6228q644j8970L1262o385n2294k124j1436P132n358j7374N653
21793e1965O381j3827J4858k1563r483j7880J1826L3637J0303o715n600l4743
21781h4771n9644k004N1429j2787N223j581L9389K6273q047J0546R249l2281J857
21768e7149N5596J8300J5174J4675K375l3636p8714k815M0450K032o127o59K1193
$$ y = [91768, 55726, 18970, 77849, 48672, 25584, -51637, -1681, 52519, 28042, -14894, -29720, 12107, 59090, 14585, -55304, -113672, -97075, -75763, -78338, -62380, -70845, -89939, -100111, -81893, -25514, -93930, -67577, -42582, -53292, -18680, 32403, 50313, 58681, 18571, -34366, -23275, 8284, 24841, -18106, -22775, -5402, -19173, 971, -20983, 22644, 18443, 3396, 7139, -9655, 26573, 17929, -1041, 30221, 23836, -28458, -30582, -42018, -34886, -40244, -57618, -51965, -45584, -59411, -44553, -66116, -75599, -93479, -81653, -48016, -37713, -44428, -50028, -84771, -144415, -146419, -94990, -107777, -102554, -104135, -64746, -38473, -46520, -35974, -26725, -59006, -57149, -1553, 16747, 31921, 46596, 48971, 15335, -63379, -66194, -25744, -23712, -29839, -30498, -9305]
21755i305M6956j7994L7681K6755p584q728l8434n4449k964O586M8165J5294l9840
21742B139M1506k48o791J7046J9952J4798m7955J2600K1710k5498o749j2905q2431
21729e2826m7088M8421j799j469Q913l7289M8174K9720M8753l4237j01636K059
21717i0304N3892O127J3043K0829P9037L635p1997k3158J0584K305J5306R233
21705B8532l3211m5068J1151L4160L3055J0914K8235Q944n0208m5209J0169l0430
21693c8966j5647R921k0282j8358P8096J8612n7226M2491O845l1336j8667K4899
21681a9618j6265k7251O570M1780p882K4230M8985k7347n146m1406n1871j1038
21669h6259J8043L069l5216M965j7280J1242J30329K8960j9446q3260j10890N733
$$ y = [-9305, 37651, 19657, 57338, 84093, 76509, 67781, 29347, -25102, -28066, -21480, 26685, 41979, 2139, 43645, 43397, 36606, 53652, 73604, 88402, 40447, 53047, 74757, 49259, 42510, 29605, -52826, -99914, -51493, -53292, -54761, -45848, -83137, -34963, -5243, 43510, 9273, -92363, -90304, -36412, -30285, -17242, 3587, 82624, 86259, 14262, -8896, 1688, 3993, 19299, 28532, -4679, -49747, -38596, -4436, 28619, 39533, 67768, 76712, 26504, -18705, -8536, -38966, -54613, -44692, -64974, -83332, -5236, 13376, -43850, -1359, 5486, -25850, -44517, -19618, -35883, -63134, -56564, -14784, -22666, 1564, 50549, 23202, 18056, -23350, -75221, -86259, -68216, -65147, -100363, -95398, -112678, -101436, 28893, 57853, 38407, -44853, -155743, -150010]
21657a50010Q0787R1116L5670p2877K9718L8935r656l9613l5171j4165k7660K2422
21645e0504M9071k0187l5900L5252K0978J9817J4286L7273j2250j9674m1276L7453
21633C4339l1481q269L5079L5870K2899p093j8912L6466n2483j8883K7736J4161
21621F9429k4150l25j8873o786j0544R67l094l0587j5574P669N7181O515k9296
21608B532J1789o3787k8832Q3468L283o1108j7442N8520k7043m1653M89o378k1250
21595a07412L4714r127J4398N4957P0458n898k7644j1975m1813P166L0695Q6528
21583I5047P518J4354J1289K57m0577j1460Q561Q483n1450m8045J5308J944J2466
21570B3695M8672k4983n4772K1701J5466j1807L5785l8225N889J7752k7203j5932
$$ y = [-150010, -69223, 21893, 57563, -15314, 14404, 53339, 43683, 4070, -31101, -45266, -72926, -50504, -1433, -21620, -57520, -22268, -1290, 18527, 32813, 70086, 57836, 38162, -3114, 34339, 2858, -5411, 29668, 65538, 88437, 81344, 62432, 98898, 46415, 27532, 55268, 69429, 45279, 44954, 26081, 19295, 8751, 9718, 6624, -23963, -39537, -31868, 25313, 31828, 2532, 14321, -49466, -78298, 5170, 8453, -52655, -70097, -11577, -38620, -80273, -79784, -86162, -107412, -72698, -81825, -67427, -12470, 57988, 52090, 24446, 12471, -29342, -22176, 8519, 95047, 102565, 116919, 128208, 128465, 87888, 76428, 84989, 93472, 42022, -6023, 9285, 11229, 23695, 72367, 47384, -7388, 14313, 29779, 17972, 53757, 15532, 21421, 39173, 11970, -3962]
21558c962J2744M5243l1674j3309q183m0643m8994L2712L6115k6057O365K9916
21546i727L943k3505Q156k0297K3354j1048l826L9637j3806m8628j7999R906j889
21533f5729M0345J8195m2417k7502j8976O777J3416J8298O915O6502Q540l0398
21521f034n976O732K1741J5334j1099l4257m6442j1567L8212N6062L8225n7288
21509C643M8110L1567p5427l0964P6053R190m3893j2698r309L4215J5531o0165
21497a4147l5944j7137M5376l508J4730m9191k9391j9915J7890K3038K8014L6717
21485c468J4625o8632K9427M8651K791k7781K5955J2347O2962l5290k5048K6780
21473F3319j9300m9919j6479m958M172K8371j5010J4631L259K1661M4718l5431
$$ y = [-3962, 8782, 54025, 22351, 9042, 859, -39784, -88778, -56066, -19951, -46008, -39643, -9727, -5784, -29289, -21133, -41430, -18076, -29124, -32950, 6687, -7119, -55747, -73746, -63840, -65729, -25384, -7189, -49606, -77108, -96084, -89307, -75891, -57593, -50678, 15824, 24364, -6034, -12010, -5278, 16463, 31797, 20698, -13559, -60001, -71568, -33356, 22706, 60931, 3643, 51753, 83320, 7893, -23071, 52982, 62172, 18279, 5581, -3728, 30487, 46018, -14147, -50091, -67228, -21852, -25360, -10630, -59821, -89212, -109127, -91237, -68199, -40185, -3468, 11157, -57475, -28048, 20603, 23394, -4387, 21568, 33915, 96877, 61587, 36539, 63319, 44019, -5900, -22379, -27337, -23165, 5206, -9804, 4827, 8086, 29747, 74465, 39034]
21461C9034k6325n4081J8727j1604n0136k7874J1221j2901J8678J9225K1531L0306
21449b4199N2756J0775J5307n9355l5104Q873o013k0648K4358K3849L0757O3327
21437H4683j038l4557m5240j437K8592P708L0025O046m968k9o6889m3811q968
21424d9883p8737K1009O4422r695l1118J7314K6272P33L1137L028o4021k065K6785
21411d4819j9967K2828J7903M1532j4674k39Q37j2709m0765k5762k1385L5563
21399f1657N1149O1798m8101m8998K0312K5733m158K150k4994j2835K2782n7327
21387g4146L7136L2676l903P472n176l0302Q229M0249K2482j3813m3092j6427
21375c8615q323n480L772N9810R73r9140J126K9468K0330q903k9532M1056L1488
$$ y = [39034, 12709, -41372, -22645, -34249, -84385, -112259, -101038, -113939, -95261, -76036, -54505, -24199, 28557, 39332, 54639, -4716, -39820, -30947, -36960, -57608, -33250, -9401, 21356, 84683, 83645, 49088, 3848, 2411, 31003, 38711, 68736, 74782, 69814, 69785, 2896, -40915, -49883, -128620, -107611, -43189, -52884, -84002, -66688, -40416, -39683, -8546, -5518, -69539, -71604, -44819, -64786, -41958, -24055, 17477, 2803, 2564, 3401, -9308, -50073, -75835, -97220, -61657, -10508, 51290, 3189, -45809, -25497, 236, -3922, -1772, -26766, -39601, -16819, -74146, -37010, -4334, -8237, -765, -5941, -36243, -28014, 12235, 34717, 20904, -22188, -38615, -46938, -52418, -48646, 11164, 12137, -87003, -85877, -56409, -36079, -44982, -74514, -33458, -1970]
21362a970J5148L4215P09k2271k9175j9745j143L7794K09K5415K8990j0396m9154
21349H626k1815m069K7750Q0630o5176o2347l791J4234L8748N6991m0175k8179
21337A427k4455O44N049L4790N9580J6310J0125l3039k9236l109j2318j5183j4749
21324d164N064m8631r144L1463M6798k2983Q992R991k8336K9844Q0486p2583j32408
21311a05611k2256O4681L2L2832l1192k1089L3399M4064q222J1433P3035J9103
21299I0209p3769o0917K588J1074K3171k839K3302J3148q755l5025o9049O8862
21287a8000j3423L1943J8412k563J8809j7854o1236j2844M3756N5051M401J2966
21275E9418k1585n8468O750j6253J7893m3826p546K4376J2801k384j121j972J1909
$$ y = [-1970, 13178, 47393, 48102, 25831, -3344, -23089, -24232, 13562, 13771, 39186, 68176, 57780, 8626, -13189, -17258, 10492, 91122, 25946, -36401, -40192, -25958, 12790, 69781, 29606, 1427, -23028, -22384, -17335, 17455, 77035, 93345, 103470, 70431, 41195, 38086, 25768, 10585, -4164, 900, -47731, -56875, -25412, 21386, -1597, 7395, 17386, -10950, 18894, 99380, 26797, -105611, -127867, -63186, -63154, -30322, -61514, -82603, -49204, -5140, -13362, -1929, 71106, 90209, 16440, -44477, -41889, -30815, -7644, -10483, 12819, 25967, 17212, -17813, -86862, -18000, -31423, 520, 18932, 16369, 35178, 17324, -43912, -56756, -13000, 42051, 46452, 59418, 37833, -20635, -13885, -30138, -12245, -56071, -63617, -39241, -26440, -28824, -29945, -31917, -20008]
21262b0008M2256P2475K4211o2065l6943p3038j7862O9838Q5031n8408p5935J2520
21250c7928M2552K095k8718J7744L4622m672r724K1875j9881o445N74O271K3487
21237D1852j24N556L2703o911L2927k8562k6208n1011m5676L596K5963P250M492
21224d153m1811N0355N6664r221k6532k0427J2067L6916K4421k8526j8091q878
21212B2784K9q404q385J1096R350J152K5096j4588j9936k0522L0750K376L0167
21199F0965K2849j7073k8058k1078m8740j6350K4858n552M3453N0425M8149M2706
21187A56554o7468L8669m9671n8394l2880l246n1103Q810N4870n3141k988M1211
21175a8777l157k988K16O8334L3879L1704j0526p1808n7771j5215L2380M4259
$$ y = [-20008, 22248, 94723, 118934, 56869, 19926, -53112, -70974, -1136, 83895, 25487, -50448, -37928, 4624, 6719, -21999, -4255, 30367, 25695, 15971, 37846, 17965, 11520, 12094, 18365, 41852, 41728, 47284, 79987, 73076, 106003, 77441, 51233, 222, -45454, -41858, -15895, -8645, -4153, -45964, 4391, 61055, 51834, 25302, 4875, 16942, 53858, 78279, 49753, 31662, 22784, 22813, 14409, 6024, 17120, 26470, 27622, 52718, 38130, 18194, -2328, 28422, 30798, 60965, 83814, 66741, 38683, 17605, -31135, -47485, -22627, -28179, 15274, 65699, 113848, 156554, 89086, 127755, 78084, 19690, -13190, -16436, -67539, -58729, -3859, -57000, -59988, -18777, -21934, -24922, -24706, 43628, 77507, 109211, 98685, 26877, -30894, -46109, -13729, 30530]
21163C0530k2614k1676j1412p23n5032l8449k512N043J8644k5447k522N8248L9509
21150b8413N902J0267Q802k5281l1588K8615K2852K7966N0852J0833n1421k7169
21138B217M0341l2287l4660K7655K1022q993q753K002k3992J7780M9672O436n133
21125E3307j5289j4264r283l5731q373P073M373k0224J5763q711j8471j53O8666
21112A8683K9972K2100J446n2225p4390m8621J57R239M6543j576J56o8673m1866
21099a59055L2168O1561P8794j150K0299j236Q121k4523m6797n7590j195N1713
21087c8890J7587j2704o16L2600L8460j3145J958K2439k6664N6L9879n255K5204
21074H0909l1534k7249K29o4814k2076K4850M4256r619O038k2896j6459k6849
$$ y = [30530, 7916, -13760, -25172, -25895, -80927, -119376, -121888, -116845, -98201, -123648, -126170, -67922, -28413, -22511, -12244, -3442, -28723, -60311, -31696, -8844, 19122, 69974, 80807, 29386, 2217, 42558, 10271, -24389, 3266, 24288, 15295, 6542, 8544, -15448, 2332, 52004, 58440, 53307, 38018, 23754, 14471, -21260, -29633, -22560, -18187, -38411, -22648, -31359, -49830, -49983, 18683, 48655, 70755, 72201, 19976, -54414, -103035, -102878, -93639, -47096, -48672, -48516, -117189, -159055, -126887, -65326, 13468, 12318, 32617, 31381, 39502, 14979, -31818, -89408, -90603, -38890, -21303, -34007, -34623, -2023, 36437, 23292, 25250, 47689, 21025, 21081, 60960, 55705, 80909, 49375, 22126, 22355, -42459, -64535, -39685, 4571, -5048, 990, -21906, -38365, -65214]
21062f5214J0053K5085o156K9519J2964L552L2808O201j7215j4002k507j5768
21050f80J4901J2700K3137l1592m735K5100n5261k4370L7905J1681o3314k2258
21038g6786K4317j385M7917N8606k5675M16J687J6046j5255l1685j5958J3966
21026c789M888r806q844N296j0897J338k4953m6790j2193Q2357K9444P371k7191
21013a3769j8431M9310j6987j8390K683k8270K8992j5214k0768j878L8079K8925
21001A4282O067K4291j5538Q961R0039p689n2074n8483k5965K5944P394r80Q857
20988B5106J4267m3128l9636l7591p121J656M4889l409P037j6330k133L7102O1138
20975D1847Q2316m686m2551l4645L0247n274j3818K4092n7677r3568J7110k1685
$$ y = [-65214, -55161, -30076, -36232, -6713, 6251, 9803, 42611, 48812, 31597, 17595, 15088, -680, 14221, 26921, 50058, 18466, 13731, 38831, -16430, -40800, -2895, 8786, -54528, -76786, -52469, -53854, -5937, 52669, 26994, 27410, 29097, 45143, 29888, -1797, -17755, -3789, 1099, -8707, -17551, -12255, -23152, -21814, -46767, -93557, -105750, -23393, 6051, 13422, -13769, -32200, 17110, 123, -18267, -15584, -43854, -14862, -30076, -50844, -52722, -14643, 14282, 20349, 44640, 29102, 38063, 128102, 120413, 68339, 9856, -16109, 9835, 17229, 16249, 25106, 39373, -3755, -43391, -80982, -88103, -86447, -41558, -44967, -37930, -54260, -56393, -19291, 41847, 124163, 119477, 76926, 42281, 72528, 67254, 53436, 77528, 19851, -73717, -56607, -78292]
20963g8292J1266K7382j0673N6606K3687m3869N2562L9960k4717k4684k7204k1687
20951a9663M3498K6332M881M2117R664J383n8537l3460K989k7891K8087L2414
20939E1814N8367L7472j4555k8039j741j9565o586j934k0814m8998k3459o65L072
20926a5631p698k0515K0471J8149l7068m2486N0192J2212J7784j5805k5203m7205
20914i2803k8017J916Q883k6862M5371L6335K0593j9601l534j1032n5629j4621
20902a39001N2350K8363K0081j272l0072J0716J7524J5333K5972j9304J4676J9390
20890A4756m9457k3907k0621N6373N9429k5689J04J4994k5081J7294L719l7438
20878a5524m6766K141O3233O3175N851r171k4573n3369j0896L7093j2627J832
$$ y = [-78292, -67026, -39644, -50317, 6289, 29976, -13893, 38669, 78629, 53912, 29228, 2024, -19663, 23835, 50167, 55048, 97165, 106829, 108212, 49675, 16215, 19204, -8687, 19400, 51814, 110181, 147653, 133098, 105059, 103318, 83753, 77167, 75233, 54419, 5421, -18038, -18703, -15631, -23329, -43844, -23373, -5224, -42292, -84778, -34586, -22374, -4590, -20395, -45598, -92803, -120820, -118904, -110021, -136883, -91512, -55177, -34584, -54185, -57719, -68751, -124380, -139001, -86651, -58288, -38207, -39479, -69551, -58835, -41311, -25978, -6, -19310, -4634, 14756, -34701, -58608, -79229, -22856, 36573, 10884, 10988, 25982, 901, 18195, 21914, -15524, -62290, -60149, 3084, 66259, 72110, 62939, 38366, -15003, -25899, 11194, -1433, 399]
20866C99J4636K1159l836l6619j1726K9673J1761p291k0010j2846J5476l5149
20854c4373k8110J1707M009k3516N1756J5679m1077J3239k9224J2691K4536P1122
20842D8439j701q3178n5059J2098P7879N4931l933j06389K880K8961l9331K6508
20830c7895Q6334K1565Q192l102n0942m5603J1079J886l4944n885M7850n6892
20818e8357O357L8408k1863l4259l354M5667k8734j4327O2293J9602l985L5328
20806D2776j6168j9201K7347j0414l6885J3308L7033j062J2293M9216l7139l4291
20794B6813j3743K3573j9371p4076m117L5566J4321M6597O620n5608j5755K6192
20782b988M3719M0340j5640l1279n6631J5523L5221k244m7066l5574k6859j069
$$ y = [399, 15035, 36194, 32358, -4261, -15987, 13686, 25447, 18156, -1854, -14700, 776, -34373, -62483, -50776, -46767, -70283, -18527, -2848, -43925, -30686, -59910, -47219, -22683, 48439, 46738, -36440, -91499, -79401, -1522, 53409, 49476, -56913, -54033, -25072, -64403, -37895, 48439, 70004, 78196, 75094, 24152, -21451, -10372, -8486, -43430, -49315, -1465, -58357, -52000, -13592, -35455, -69714, -73068, -27401, -56135, -70462, -8169, 11433, 7448, 42776, 26608, 7407, 34754, 24340, -12545, 763, 37796, 36734, 49027, 98243, 61104, 26813, 13070, 36643, 17272, -56804, -60921, -25355, -11034, 35563, 42183, -13425, -29180, -2988, 40731, 81071, 65431, 34152, -22479, -6956, 28265, 26021, -21045, -56619, -83478, -84547]
20770h4547P4582L6288j9620l4269j4539m233P0843N5420J322J645n145r1814
20758a4067J607N1420o1955j9599M086J5752o991q612L7197K0061L7528n4595
20746A832J7896O9816K4700q4601m9802K8382q805Q982q298j0111n3942M825O8151
20733I025K3258m1216n0654P085J1093n3233k2600J4779J0089N9416J9530j6697
20721c0125k6226Q905K6740j7266j9484J7834J4664j3163M077O520l1700P244
20709e1980O297j2574R568k1675l2839j9366k478L8238J2062K1065Q149K9399
20697a6134l206k6498M78J7726o1736m9663K3674J2466M4441L108P5772j1784
20685H644l7679J4902n4284o685k420j8255L705M1247L7516k8040J754k2624J1091
$$ y = [-84547, -9965, 26323, 6703, -27566, -42105, -46338, 24505, 79925, 81247, 82892, 77747, -14067, -12460, 38960, -22995, -42594, -38508, -22756, -29747, -38359, -1162, 18899, 56427, 1832, 19728, 89544, 114244, 29643, -20159, 8223, -582, 8400, 102, -10009, -63951, -59126, 9025, 32283, -8933, -59587, -52502, -41409, -94642, -117242, -102463, -92374, -32958, -13428, -30125, -56351, -47446, -20706, -37972, -57456, -39622, -24958, -38121, -34044, -27524, -59224, -51980, -45683, -58257, -48689, -70364, -103203, -122569, -125047, -86809, -74747, -53682, -45533, -16134, -19340, -45838, -45360, -27634, -89370, -139033, -115359, -102893, -58452, -55344, 20428, 8644, -29035, -14133, -68417, -75102, -77522, -95777, -92072, -50825, -13309, -41349, -39595, -62219, -51128]
20672e1128J2796N543l789n606k2241J8693J5881q697p172P992N3118M5404j559
20659E9235m1670n125l6054O490K665m2227K169L0377K5814m8199j7941M467K2663
20646c7336K836K2563M705o4099p393J3813J7429m0040N8735R8146P444k5613
20634E1190Q648K3019J8670m3029o6927L084P17m1738n5820K6995M6941J3894
20622a4356o226N4058K4889k5193j8602p4931o199N64J8600n892j73Q359L1204
20609a3898l4981N8297N2910l9850P164k7431k2449o898M8821L0899O242m9374
20597I452l6524j8614J4705k4526k6998N5393m30K8389o096L485j0592k5371L909
20584c3818K3607K3543l3046l2924j8610J9162L3188j320J2092Q495j0413N429
$$ y = [-51128, -38332, -32789, -36578, -42184, -64425, -45732, -29851, -38548, -45720, -37728, 15390, 60794, 59235, 17565, 12440, -23614, -17124, -14459, -56686, -54517, -24140, 1674, -46525, -64466, -59999, -37336, -34500, -11937, -7232, -71331, -78724, -64911, -47482, -87522, -28787, 69359, 76803, 51190, 59838, 82857, 101527, 58498, -8429, -5345, -4628, -46366, -102186, -75191, -28250, -14356, -20582, 33476, 58365, 33172, 14570, -60361, -66560, -65996, -47396, -53288, -53461, -45102, -13898, -48879, 9418, 62328, 22478, 29642, 2211, -20238, -27136, 21685, 52584, 58826, 9452, -27072, -45686, -30981, -55507, -82505, -27112, -27542, 847, -5249, -1764, -12356, -37727, -33818, -10211, 13332, -19714, -52638, -71248, -52086, -18898, -20218, -8126, 369, -10044, -4615]
20572d615N2457k6985m0040k3448P8816j4895n7792J0844J2033K4717K3679o3394
20560b8623j9247N2137J4343l5867q939L8435J3327o7396l1108l1943K2370P1598
20548a0913J372k5781l452N0293J16646K4676p5090r2686K5262L1560J7401j3586
20536D5702j5293K8900P286j8792M9592q725p6489j1082N3355m713n7983n5543
20524f3785n1671K2997N112J52N0015O2769K7807m6242J3222Q84k9835J981P008
20511D14o833L8553N902j4665k1457K7015K722L4567J646l9722L5329K4770j934
20498H6307l2590l6676L9434J6156n2499n16K9502L4251J9962M185j5672J1968
20486A03812m9094l1899j6372J1967J0406O6635k1743m2475N179n3112p0642J000
$$ y = [-4615, 47842, 20857, -19183, -42631, 36185, 21290, -36502, -25658, -13625, 11092, 34771, -28623, -47870, 4267, 18610, -17257, -26196, 12239, 25566, -41830, -72938, -104881, -82511, -10913, -9541, -35322, -38774, 11519, 128165, 152841, 77751, -14935, 10327, 41887, 59288, 45702, 30409, 59309, 66595, 47803, 97395, 88670, 12181, 1099, 54454, 49741, -8242, -63785, -115456, -92459, -87347, -87195, -37180, 25589, 53396, 7154, 20376, 21260, -8575, -6594, 414, -6419, 32134, 38036, 23371, 1914, 28929, 31651, 66218, 67864, 28142, 63471, 88241, 86307, 53717, 17041, 56475, 72631, 20132, 19616, 49118, 83369, 103331, 107516, 91844, 103812, 54718, 22819, 6447, 18414, 28820, 95455, 73712, 31237, 36416, -16696, -87338, -86338]
20474h6338M9665J2182J942k2079K3172k028P151M7518l167l7253j6064J375J2344
20461a1580N0182j494o6420m2024M3787k0826K9799K7166m1355m8833J4147M7606
20449a9845L3591K8702J4885k634l5114L8637M5298o0669n6579R258k3252j6948
20437d4670J0456M1309R904m6949K5655K7021r560n367Q914j1538j6552J1289
20425h8L2782N265K231m89K489l4850n9435j3066N5436N8342k7807l1567q791
20412a9548k9478p157K4611l219J0119K1606M8555J7851k6491l834l1722l5658
20400c4365k9349K7542P3675K3775p5033n0965M0526L4757L1440L3393M1278k8622
20388H8052n0491m7767l4691N736J1928J4869K066k4772J4319L0003m037k0359
$$ y = [-86338, -36673, -24491, -22549, -44628, -21456, -23484, -16333, 31185, 28018, -9235, -25299, -23924, -11580, 38602, 37108, -29312, -71336, -27549, -48375, -18576, 8590, -32765, -81598, -67451, -19845, 13746, 42448, 57333, 54699, 19585, 58222, 103520, 42851, -13728, -4470, -27722, -44670, -34214, 7095, 16999, -29950, -4295, 22726, 13166, 7799, 16713, 5175, -11377, -88, 32694, 37959, 40190, 39701, 42190, 7340, -52095, -65161, -9725, 48617, 20810, -10757, -19548, -49026, -56183, -31572, -34791, -24672, -3066, 45489, 63340, 36849, 33015, 1293, -34365, -63714, -36172, 37503, 61278, -13755, -64720, -24194, 10563, 42003, 75396, 116674, 88052, 37561, -10206, -44897, -39161, -27233, -12364, -10298, -35070, -20751, 9252, 5215, -15144]
20376a5144M4271L0390j758K880n4966K5255p066j5286k3988l1778M5678K2534
20364B1022j0452j3180k438K4455j6107o6998n2489M8876P9226k6247k4184J5347
20352b3169P2598L8617j616p3497l250K2335j6486M1226L2710L625l5688j7111
20340D0294n7807n834M241K4292N7071M3565J6284J2978n3422n4017m5952L7970
20328A9663K4930m7050p893l193p683j5022j9745j814L2270N2296M803L9711j6497
20315E4776j0600M5412P260k8055l0230J127p205m3950r328M2163k5368k0743
20303b4741M3679M511j3355k4073m234J9523l7108J9369m291j0504P2661K9908
20291G1345q4686M8760j2276o3175n821J7338o170L9594J3773l595P416M6021
$$ y = [-15144, 29127, 59517, 57759, 60639, 5673, 30928, 23862, 8576, -15412, -47190, -1512, 21022, 10570, -2610, -5048, 19407, 3300, -63698, -116187, -67311, 11915, -14332, -38516, -23169, 49429, 88046, 86430, 12933, 9683, 32018, 15532, 56758, 89468, 93093, 57405, 40294, -17513, -23347, -19106, 5186, 62257, 105822, 122106, 135084, 81662, 27645, -18307, 19663, 44593, -2457, -10350, -13543, -21226, -36248, -55993, -57807, -25537, 26759, 31562, 71273, 54776, 44176, 89588, 96848, 68793, 38563, 39690, 32485, -11465, -20793, 21370, -3998, -24741, 18938, 23449, 10094, -13979, -18213, 1310, -35798, -16429, -20720, -31224, 41437, 71345, -13341, 35419, 23143, -40032, -45853, -28515, -34685, 4909, 18682, 15087, 22503, 68524]
20279F8524j1511l8254k6420r264N9121K9083p1324k2133N2823O5518r921k7723
20267E8519n1509K297L8138J8610q282M76l0739j5887L8192j5305j4604M6776
20255F6682M6032k1701o4234J7739R533k2595j9752o53l542k894K008k7239L3125
20242A2509L6800M677K5958K4378k662o1930n0702m829Q717J9174L162p7473L5593
20229b6628N5962r74L6193q950k3304j4879K2495n1262j9539M1464O9264j6806
20217F3036k5595k3998J4484k8357J6118L4606J6852l1186p202o973K5300j9217
20205B7868l1502K9136l542L3021p0526q3433l8322N5439R0095p80K8379M8473
20193H4306k2798m5585J2616N0399L6956p9189n5837L8905K4049r345J6993L174
$$ y = [68524, 57013, 18759, -7661, -16925, 42196, 71279, -45, -22178, 30645, 96163, 86242, 58519, 7010, 9307, 47445, 66055, 57773, 58249, 27510, 11623, 49815, 34510, 19906, 66682, 112714, 91013, 26779, 44518, 54051, 31456, 11704, 11051, 7509, 4615, 6623, -20616, 12509, 49309, 53986, 79944, 104322, 101660, 39730, -10972, -15801, -7084, 12090, 15252, -62221, -26628, 29334, 28360, 64553, 55603, 32299, 17420, 39915, -11347, -30886, 10578, 79842, 63036, 37441, 13443, 27927, -430, 15688, 50294, 67146, 35960, 28758, 21785, 47085, 27868, -3634, 25502, 21960, 54981, -15545, -98978, -137300, -81861, 8234, 7454, 35833, 84306, 61508, 15923, 28539, 78938, 115894, 36705, -19132, 19773, 43822, 34477, 51470, 54644]
20181E4644K9994o705j2563J1784L1563K8241J179k2519l7790l6478k1873P162
20169B6639J0483k7046r859m3159j0591L563J25Q0170K2338l0747k1774R462J3709
20156B3313M2941k443L2195k4333l4620m3515o884O8115L5820j3176J5102m4765
20144D7750o5371k6105J5870P295M772J8780L7007q773q767K6719Q3323j177p4601
20131E6722n7503k71k9921Q022N9594J6484k2209j770k1132j2801K6665L666l0443
20118d897J5287L9704k2681j5230L9359M1154K252j2659k8603K0584L6487J6895
20106A27652k7549K784j6298n0494k3509M7329J0918k5614p429J8154k0986m0081
20094e123N6080K3530m4969j951k6297N793N0044k696q503n0995Q749Q489m2021
$$ y = [54644, 84638, 77933, 65370, 77154, 108717, 136958, 138137, 115618, 77828, 41350, 19477, 26639, 37122, 10076, 217, -42942, -53533, -49970, -49845, 30325, 52663, 21916, 142, 9604, 23313, 66254, 63811, 96006, 71673, 37053, -6462, -13346, 54769, 90589, 77413, 92515, 47750, -17621, -43726, -27856, -20561, -15789, 2991, 39998, 31225, 22458, 49177, 132500, 131323, 56722, -781, -1052, -30973, -22951, 36643, 53127, 30918, 29148, 8016, -4785, 21880, 25546, -4897, 10390, 50094, 27413, 12183, 51542, 92696, 94948, 82289, 53686, 74270, 110757, 127652, 100103, 102887, 86589, 36095, 12586, 59915, 70833, 45219, 37790, 55944, 34958, -5123, 50957, 74487, 29518, 27567, 1270, 7063, 57107, 54411, 45908, -5087, 3662, 12151, -29870]
20081b9870n668j4474J2000O3721L2176j2827p4007p8713k5811K4329L3076L1996
20069d4072k9277J4439J8134l216j1264k9916J8942R95N6287N0103p1733J7424
20057a3154J0390l3929n605L7471N2153m0391k7867K4724J5349j646j795o192
20045I508l4999Q20J415J8527L693k8016J8874J5432K1893k9474l1298l7581M0300
20032c0906L8850l8081k7243N9191P7474J8528k0797J7647O298m1786p831k7478
20020B3866J8536Q645l7212J6598L8776N1119O095m5584k2653j0651l779L6746
20008H0502o38k1193j0814R130P367k1280m3044k3239j2350k9271R4145L1767
19996F1082M4673l0377k6469J5215p203j2333r947l2769J9233K6490J5830k7094
$$ y = [-29870, -35538, -50012, -38012, 25709, 57885, 45058, -28949, -107662, -133473, -109144, -76068, -44072, -73349, -58910, -40776, -43992, -55256, -85172, -66230, -65235, -8948, 41155, -30578, -13154, -2764, -36693, -42298, -4827, 47326, 6935, -20932, 3792, 19141, 17495, 15700, 9508, -25491, -24671, -23256, -4729, -1036, -29052, -10178, 5254, 27147, -2327, -33625, -71206, -30906, 7944, -30137, -57380, 1811, 79285, 97813, 77016, 94663, 100961, 59175, 51344, 23866, 42402, 51047, 13835, 30433, 69209, 120328, 126423, 80839, 58186, 47535, 43756, 80502, 79864, 58671, 47857, 56987, 64354, 43074, 30, -23209, -35559, -64830, 29315, 61082, 105755, 75378, 48909, 64124, 56921, 44588, 34641, 1872, 21105, 47595, 63425, 36331]
19984C6331N564L6047M6822p7116l9095L4352k5733n1192k9158J2574k2359L4570
19972c8393K2651P838O416J7867R85k7335m996K4085L5527k1278n8870K7760Q1558
19959G3815J9034n3417j489l2254M0159K3587P771m9359k7733M781K6088J6409
19947D7392o910l6900J5289k0108n296M2636P6309K6549l0298o8539o737K2035
19935E5422j2330m560k343J5588k2565k2717P9848k8906o6687L061L5156R733
19923C8700K6028L1104m1572j2580J9744L2281l1877o2999o182k0490M4405O579
19911B3141k3423j9031J2374N3921J1926l2245J1531K5509j1762L7946k4063k8986
19899C6838J1170j8582o7675q224Q228J8589M2745K4222M543L7389j4355n9169
$$ y = [36331, 41895, 77942, 124764, 47648, 8553, 42905, 17172, -34020, -63178, -50604, -72963, -38393, -15742, -7904, -1488, 16379, 17364, -9971, -14967, 9118, 44645, 23367, -35503, -7743, 73815, 92849, 39432, 37943, 5689, 45848, 69435, 77206, 27847, 114, 4895, 30983, 47392, 40482, 3582, 18871, -1237, -6533, 36103, 112412, 138961, 108663, 40124, 33387, 55422, 43092, 38532, 36189, 51777, 29212, 6495, 86343, 57437, -9250, -6189, 28967, 38700, 64728, 95832, 54260, 41680, 61424, 93705, 61828, -1171, -7353, -27843, 16562, 23141, -282, -19313, -6939, 46982, 58908, 26663, 38194, 63703, 51941, 89887, 65824, 36838, 48008, 29426, -38249, -46473, -38245, -19656, 23089, 47311, 51854, 89243, 74888, 15719]
19887A5719K2061N2370l2348m0178j3621M7019L4324j1536Q567M373m7127M9236
19875H8859k7808J3963J2359p2745k6983J9746M7809K0172J4724J2168L6284J3300
19863A51848l1138j4092j0611p267R369m2782k6346K3299K1667L2801N0099M3270
19851B00117o8948m5173m4759l6095J7502K7867r567j139l3448L5404K1809q060
19839E5510j279j5504k5220k5855j1388l4623K0073K2642l858N0031J6803m8119
19827g87J6668N5681L5534j4274l0552R770j8570J320L4215m5754M1313J1068
19815I5632k2981K9286N913k9677m4212K7734K8326m6142J1024J3160K2243K3855
19803A14161J0743l8332n5435j7906p964j1581l0212J6422l847Q810N276k4119
$$ y = [15719, 37780, 90150, 57802, 17624, 4003, 51022, 85346, 73810, 82377, 86750, 39623, 88859, 61051, 75014, 87373, 14628, -12355, 7391, 55200, 75372, 90096, 102264, 138548, 151848, 120710, 106618, 96007, 88740, 98109, 55327, 28981, 52280, 73947, 106748, 156847, 200117, 131169, 85996, 41237, 5142, 22644, 50511, 40944, 39805, 6357, 41761, 63570, 55510, 54231, 38727, 13507, -12348, -23736, -58359, -38286, -15644, -19502, 30529, 47332, -787, 15881, 71562, 107096, 92822, 62270, 72040, 53470, 54790, 89005, 43251, 84564, 95632, 72651, 101937, 107850, 78173, 33961, 61695, 90021, 43879, 54903, 68063, 90306, 114161, 124904, 86572, 31137, 13231, 5267, -6314, -36526, -20104, -23951, -15141, -9865, -33984]
19791c3984j5416L9107K5136r677R052m369J952K0982j2077j1729J6909o178J0223
19778B9931j0489P826l3054j1687J705N4052K6592m805L439O155n1660j646p799
19765H560p513R228o373j0863K9885j7364k2271K4920q2411O969P5409j5639O48
19752f815L3399L2146j0103L2018j2486K149L3024n2249k0224j6074q014l078
19740C693j1966m1605q58K6082J1224P504M1073K9267l1352n7137q080R265K5425
19727B535M6392L0144n9130l4241l6040J4495M5076L0125k1476n4560N6242L2259
19715E1821k7457M542L286M974K4941J9713m3903K4028j7888j3978N284K7055
19703F2418M5517L1087Q665j9815l1090p2184m3540L7717L4618P9678K5504n1569
$$ y = [-33984, -49400, -10293, 14843, 5166, 14218, 9849, 11801, 32783, 20706, 8977, 25886, 19708, 29931, 19442, 27268, -5786, -17473, -15768, 38284, 64876, 60071, 63510, 69665, 18005, 16359, 8560, 1047, 10275, 3902, -6961, 22924, 5560, -16711, 8209, -74202, -67233, 8176, -7463, -6815, 26584, 58730, 48627, 80645, 68159, 70308, 103332, 51083, 30859, 14785, 6771, 3693, -8273, -49878, -50736, -24654, -13430, -5926, 35147, 64414, 33062, -24075, -32155, -22890, 2535, 48927, 79071, 19941, -14300, -50340, -35845, 9231, 39356, 17880, -36680, 19562, 51821, 24364, 28906, 32192, 37166, 62107, 81820, 37917, 61945, 44057, 30079, 35363, 62418, 107935, 139022, 147687, 127872, 96782, 24598, -18942, 18775, 53393, 133071, 158575, 107006]
19691A07006N712M1504L9281j7761p1224j4022k3409k0658K0373m4107k6626j1120
19679a5051m4232M416N8397M5359L1311O144k5224j6911m9171K6229J8375j5254
19667B4388J684k7857K1339K2570L7367j6631o4474n6674j1063L2023J7098o2934
19655h3164l937M3308Q9050L0201l9394l6243J3920k8436Q453J439O1488M9108
19643A05793n1442m9234n31P2901P2343k0154p5071R827m856l9743k5807p332
19631a3306J188M3093K6214L6732Q4754O7292p8777l9046o3434p2217J4932L7931
19619D5356L916n2560J5863K9822j1348K4340k87k7685J4096R908l9894r990M3497
19606D5034k4165j8479Q2324L7145L2905l7049l4089M0479j7376n4361o342K207
$$ y = [107006, 112718, 154222, 193503, 175742, 104518, 90496, 67087, 46429, 66802, 22695, -3931, -15051, -59283, -54867, 3530, 48889, 80200, 86344, 61120, 44209, -4962, 21267, 39642, 24388, 26072, -1785, 19554, 42124, 79491, 62860, -1614, -58288, -69351, -37328, -20230, -83164, -87101, -43793, 45257, 75458, 36064, -179, 13741, -14695, -6242, -4803, 56685, 105793, 54351, 5117, 4586, 77487, 149830, 129676, 54605, 64432, 59576, 19833, -5974, -13306, -12118, 30975, 57189, 93921, 178675, 245967, 167190, 128144, 64710, -7507, 7425, 45356, 49272, -3288, 12575, 42397, 31049, 55389, 55102, 27417, 41513, 51421, 11527, 1537, 45034, 20869, 2390, 84714, 121859, 154764, 117715, 83626, 124105, 106729, 52368, 46026, 48233]
19594D8233J8411K3394L650M818m7448m3943K0596k0656j3100O712K6297J9069
19582D6033M4409J1968m1298j3283M856M584l0250J9864L1672N4970K309L7173
19570A73007j7975n5420J3828j7933k7917l2344j6512O7784M3704j4870j5034
19559A00318j176l4686K5427N1500m4610J6337k2745k1764N352J0230Q794j2451
19547H0526k564N3763J0090L7033K9908J6136N0159R378P31p4998n7126n0999
19535A02037M0200R204l3368q5369j6978J5454j5898L631k648k3973k724J7690
19523G258J5125L9465l0965K077K4261Q5853J9472M973k8155k9259p6917L7775
19511G0963K5701M2896J428o6286m7518J2679j0366Q7235M0658l2029p794k4816
$$ y = [48233, 66644, 90038, 93688, 98506, 51058, 7115, 27711, 7055, -6045, 667, 26964, 46033, 90442, 102410, 61112, 47829, 52685, 57269, 27019, 46883, 78555, 133525, 135834, 173007, 155032, 99612, 113440, 95507, 67590, 35246, 18734, 86518, 130222, 115352, 100318, 99142, 64456, 89883, 141383, 96773, 113110, 90365, 68601, 73953, 84183, 92977, 80526, 77962, 131725, 141815, 178848, 208756, 224892, 275051, 284429, 285160, 210162, 153036, 102037, 142237, 151441, 118073, 32704, 15726, 31180, 15282, 18913, 16265, -7708, -10432, 7258, 22383, 61848, 30883, 32960, 57221, 143074, 162546, 167519, 139364, 110105, 33188, 70963, 96664, 139560, 140988, 74702, 27184, 39863, 29497, 116732, 157390, 125361, 117567, 92751]
19499I2751j8623j61j0225l1681r382K6354L2644k6136k5015J3065M1517K248
19487H7356q046L136J16677O4546k6916j15180J768J9990k1713m1883n4435L4106
19475E9406Q8520M2748m2305r63K5794J1836l9734k7377k596l1782m3270k0174
19463B0103K5985M1680K1842m351M1068j1494j05543o574l3088L0202O4137j4005
19451F9962M043l0271n053K3046m8333o0393N1789Q8489Q2971L3761j6439q3270
19439A10302j2939j2607p40K257j9313O698N2962J4248j0589n3536n9012K4300
19427D2031p605K903N1530N794m7330k4566M8967N8601L3782m4967j5365J8214
19415A21989l1456j3202m6463l1441M2985j2288J1999Q228J6643j432R93j7467
$$ y = [92751, 74128, 73967, 63742, 32061, 22679, 49033, 81677, 55541, 30526, 43591, 85108, 87356, 79310, 82446, 199123, 263669, 236753, 121573, 123341, 143331, 121618, 79735, 25300, 59406, 147926, 190674, 148369, 147406, 173200, 185036, 145302, 117925, 115329, 83547, 40277, 20103, 46088, 87768, 109610, 105259, 146327, 134833, 29290, 22716, -10372, 19830, 83967, 69962, 74005, 43734, 38681, 61727, 13394, -46999, 4790, 93279, 176250, 210011, 193572, 110302, 97363, 84756, 84016, 86273, 66960, 73658, 126620, 140868, 130279, 76743, 17731, 42031, 34426, 37329, 88859, 94653, 47323, 22757, 71724, 130325, 164107, 119140, 103775, 121989, 90533, 77331, 30868, -573, 42412, 30124, 42123, 50351, 66994, 65562, 66555, 49088]
19403D9088m383J7712K1014m881l128q489n933k8805M7955O423k5369L3249J552
19390I6005k1979N0927O0317K9167K5933k971l1208r6288l7397L1191J5903N109
19378A24709L2215n3670j8057M4274L4830O4836J846J2449j8756j8523o8159k6103
19366A11891P0563J8943j3573K0114K0517N2443M3213L567k1552M2061J21254
19355D69441J38902O4805n8317L0409N2699N9828R4492P9085l2627q0353l7962
19344G80402m0163K923O3504M9879O026O5215J05560P9006k2090K9319Q497j17760
19332A010318j73862r8184l6262N7005l5453k0072N8627P8947L4184L73l3057
19321H42564q749k1740k1742M2404Q1669N5109r313r8133j08581j622N8973M8788
$$ y = [49088, 44705, 62417, 83431, 78550, 75422, 66933, 61000, 32195, 80150, 86573, 61204, 94453, 96005, 74026, 124953, 185270, 214437, 240370, 237399, 206191, 109903, 72506, 103697, 119600, 124709, 156924, 103254, 85197, 129471, 164301, 229137, 230983, 243432, 224676, 206153, 137994, 111891, 182454, 201397, 187824, 207938, 228455, 280898, 324111, 327678, 306126, 348187, 469441, 608343, 673148, 614831, 645240, 697939, 757767, 852259, 931344, 898717, 818364, 780402, 740239, 743162, 806666, 856545, 862571, 927786, 1033346, 1112352, 1090262, 1119581, 1128078, 1010318, 836456, 738272, 702010, 759015, 723562, 703490, 762117, 841064, 875248, 875621, 842564, 833815, 812075, 790333, 832737, 914406, 969515, 960202, 862069, 753488, 751866, 810839, 859627]
19309H59627J00415J16040R7585R8458L5489J5431Q8026Q3147j10449k69120j46176
19298I68473n1015j4198K6247M0382J26911J50493J36081L9005p3534j07076q3738
19287A158031m984j5254p4114n0838q8359p7030j6202N3185L0007O7038P1704
19276A053184l5734j01174r7320o0538k7829K0647J18556N6123r7348r3948m4114
19265F90505j5780J2799R79J5877Q1864J43801J68632Q6391p2511j10848J3567
19254A015276j9393R859n7416j16024m0887m6689k2080J1442J31672J04198l6545
19243I33413j71702k43059j31958r5769o285O0097M8585o0407o8608j8564o7919
19232A77824m6701j3644j5059J5574n6089J440M8543K7736n1042o674M7833l0824
$$ y = [859627, 960042, 1076082, 1173667, 1272125, 1307614, 1323045, 1411071, 1494218, 1383769, 1114649, 968473, 917458, 903260, 929507, 969889, 1096800, 1247293, 1383374, 1422379, 1348845, 1241769, 1158031, 1153047, 1137793, 1063679, 1012841, 924482, 847452, 831250, 884435, 914442, 981480, 1053184, 1017450, 916276, 818956, 758418, 730589, 751236, 869792, 925915, 828567, 734619, 690505, 674725, 687524, 688503, 704380, 786244, 930045, 1098677, 1185068, 1112557, 1001709, 1015276, 995883, 1005742, 948326, 832302, 791415, 744726, 722646, 734088, 865760, 969958, 933413, 761711, 518652, 386694, 290925, 284640, 344737, 393322, 332915, 264307, 245743, 177824, 131123, 117479, 102420, 117994, 61905, 63345, 111888, 139624, 88582, 81908, 129741, 98917]
19220I8917q805K7819L4871J1252L097K6487j8096J8199k1485j0221L4092j6867
19208A79260j4245J6417k071p843J515J900p8903q987R7790K7249k7093l4161
19196A50828L4550P9468M9066L3405J9273j0285R51l8464n4868m9430j0850p662
19184A95982k1489L1642N2103j6786k0091j805m2585p566M5449K889j9537o649
19172A91557O8433J4581M998j3797J5728M490l0l1409L8184j6279k6938N6371
19160C05889K5976o7145m0454M0882N1162q526J7296J1011l2418M132L16n3019
19148B55102j6522L6277L6950L6885L951m9837j114l3840J9896M9847M630J6737
19136C58962l0068K818j4085j7213k7841O752J3215o0355M4651J5973N5882r391
$$ y = [98917, 90112, 117931, 152802, 164054, 167151, 193638, 175542, 193741, 172256, 162035, 196127, 179260, 165015, 181432, 179361, 171518, 173033, 174933, 96030, 87043, 184833, 212082, 184989, 150828, 185378, 264846, 313912, 347317, 366590, 356305, 357256, 318792, 263924, 214494, 203644, 195982, 174493, 206135, 258238, 241452, 221361, 219556, 176971, 169405, 214854, 217743, 198206, 191557, 259990, 274571, 279569, 265772, 281500, 285990, 285960, 254551, 292735, 276456, 249518, 305889, 331865, 264720, 224266, 265148, 316310, 307784, 325080, 336091, 303673, 307805, 308121, 255102, 238580, 274857, 311807, 348692, 352643, 302806, 301692, 267852, 287748, 337595, 342225, 358962, 328894, 331712, 317627, 300414, 272573, 279325, 292540, 232185, 276836, 292809, 348691, 339300]
19124C39300j3094m08J5531L756k0562m1426j8655R34m4797K4531N4264O8152
19112C67526K028m6794k0909J7615L6613J7080n1638o7944J1877L9260J9787P2382
19100C96883M0950K4195m931j935K5555l7831n5293L969L0274K2803k2955j9291
19088D02393k700J1747l224K4950K761m4334l7973J3184L02K4677j0534O473K8631
19075D16353N681k7497Q3074N0810l2338j6104m387N3479N0935L8609J5689m5730
19063E88574j06225K182j0816n3327n136J2658J495j1621L76J5211M1711M9924
19051E25006q748m9279k3111k3377N5135K3912n5402j7811J6845K7495n870K1133
19039D85928k493k4951K8941K4775M6404N1570M5789l5429m5820q5226l9987L1390
$$ y = [339300, 326206, 325798, 341329, 345085, 324523, 283097, 264442, 265376, 220579, 245110, 299374, 367526, 369554, 322760, 301851, 319466, 356079, 373159, 321521, 253577, 265454, 304714, 324501, 396883, 437833, 462028, 457097, 455162, 480717, 442886, 387593, 391562, 421836, 444639, 421684, 402393, 399693, 411440, 408216, 433166, 435927, 391593, 353620, 366804, 367106, 391783, 381249, 387722, 416353, 422034, 394537, 477611, 528421, 496083, 479979, 475592, 529071, 580006, 618615, 634304, 588574, 482349, 484531, 473715, 420388, 415252, 427910, 429405, 417784, 418160, 433371, 475082, 525006, 516258, 466979, 443868, 420491, 475626, 499538, 444136, 426325, 443170, 470665, 464795, 485928, 483435, 458484, 487425, 512200, 558604, 610174, 655963, 620534, 574714, 489488, 449501, 480891]
19027D80891j6002k3667l3568M3895O1227l576K0243m398m7703K968k5661l502
19015D51147N491P127M157J1979L831N6042P1619J4683l6051m4140l7661k2368
19003D85856K4602j645o172l0039m6019p387J2345L3172J5765l3287L0365J5873
18991D93429p908l75J1830M6110J00202L5264o2032k0733m0010j6267R3028L5572
18979F68110J8387K9121P2471l129q0072r5183j640r593j8063n4949j0059j1345
18967E04056O288L3025N4974Q6152j1827J060L5450N9152J7395k3348o0294J495
18955G03578K9485Q1485K1833k7740l7747J1975K6308M4311K5334R930J0762o0353
18943H39161o2423K1418M2027l062l5326l7892P749o2227L3998O3497O365q7304
$$ y = [480891, 464889, 441222, 407654, 451549, 512776, 509200, 529443, 525045, 477342, 480310, 454649, 451147, 456638, 463765, 467922, 479901, 483732, 539774, 611393, 626076, 590025, 545885, 508224, 485856, 510458, 508813, 502641, 472602, 426583, 419196, 431541, 464713, 480478, 447191, 477556, 493429, 485521, 485146, 496976, 543086, 643288, 678552, 616520, 595787, 555777, 539510, 632538, 668110, 686497, 715618, 788089, 784960, 704888, 609705, 608065, 598472, 580409, 525460, 515401, 504056, 510344, 543369, 598343, 684495, 672668, 673728, 709178, 768330, 785725, 762377, 702083, 703578, 733063, 814548, 836381, 808641, 770894, 782869, 809177, 853488, 878822, 888752, 899514, 839161, 776738, 798156, 840183, 837121, 801795, 763903, 771652, 709425, 743423, 806920, 813285, 725981]
18931G25981m7935N1217L5356M8991J7227q167N8443M1961J4896k948J055K6416
18919I62493j803O6434j1573n3479K0659M1809l4930L4603R124m707O5219N6293
18907A150142o264l04M3673P6460L0982j3784l4801n0178j8406l653J538N4323
18895A229728Q0014M6429p5547j3281L1206L2683Q0630K175o3130k9718P9580
18884A400769P3032M2122k7119l8702K3352N7055K4545m420J0250M3217J09592
18873A713693J09344J0972J1657J27164J35497J61544Q8918P4825K9855J7784
18863B481253M1941L3020O3190J29202J70879K00233K79728K42002K30050K94517
18853D166015L44662M53925N56554N95529M61838K78999L03690M52151L73831
$$ y = [725981, 678046, 729263, 764619, 813610, 830837, 822670, 881113, 923074, 937970, 935022, 936077, 962493, 960690, 1027124, 1015551, 962072, 982731, 1024540, 989610, 1024213, 1033337, 1028630, 1093849, 1150142, 1143878, 1143574, 1187247, 1263707, 1294689, 1280905, 1246104, 1195926, 1177520, 1173867, 1175405, 1229728, 1309742, 1356171, 1280624, 1267343, 1298549, 1331232, 1411862, 1414037, 1350907, 1321189, 1400769, 1473801, 1515923, 1488804, 1450102, 1473454, 1530509, 1555054, 1550634, 1560884, 1604101, 1713693, 1823037, 1834009, 1845666, 1972830, 2108327, 2269871, 2358789, 2433614, 2463469, 2481253, 2523194, 2556214, 2619404, 2748606, 2919485, 3119718, 3399446, 3641448, 3871498, 4166015, 4510677, 4964602, 5521156, 6116685, 6578523, 6857522, 7161212, 7613363, 7987194]
18844G987194L53007N84426R91521J405463J893924K444838K897382K874777K652024
18835B4084556L594813N234468N949983L440310j531925l005714m87503J604443
18827C8883431L016849M678067P236621J0650227J4805941J9498197K3642117
18820A22411450K2818530K0649740K8251249M2792560M6133359J8149403l6595625
18813B64610666n9361802m1737791k5263500k2875584k0951778j0533403j963116
18806H1923692J884437M161235P822909J2126933J1954831K354725j3465949j9970235
18798H8792578j6708902r646645l973456n56762K240325N186006Q728811J2822518
18790H6884473J7578553K2769243K4534158K1279601K4996817L8406338M9094504
$$ y = [7987194, 8340201, 8924627, 9916148, 11321611, 13215535, 15660373, 18557755, 21432532, 24084556, 27679369, 32913837, 38863820, 42304130, 40772205, 37766491, 37278988, 38883431, 41900280, 46578347, 53814968, 64465195, 79271136, 98769333, 122411450, 145229980, 165879720, 194130969, 236923529, 283056888, 301206291, 264610666, 205248864, 163511073, 138247573, 115371989, 94420211, 83886808, 81923692, 83808129, 87969364, 95792273, 107919206, 119874037, 122228762, 108762813, 88792578, 72083676, 62437031, 58463575, 57906813, 60147138, 65333144, 74061955, 86884473, 104463026, 127232269, 151766427, 173046028, 198042845, 236449183, 285543687]
18783B85543687L3368947j5451665n5750753m5198079k3263292j4480294j4444656
18776A50323895o957518M411774J3264305J7339166J4886559M297061n147983
18769A92417259o855913j1501321j1084102K15311J3867348K5777307K9199325
18762B32035214K1371828J5504838K1745173L0390077N374490n2240467q6777393
18755A87403760o2693943l4234031j8499752j0170775n071086j341351J525232
18748E6918054M099039O802351Q927218R938516J0569394J3106033J7072418J7250717
18740A44683740Q092701p301098j8987770j5213486l448002O323353J2827600
18733A26977038J9708569K8221330L3136497K6942686J7785036J8031454K8934477
$$ y = [285543687, 318912634, 303460969, 247710216, 202512137, 179248845, 164768551, 150323895, 143366377, 147778151, 161042456, 178381622, 193268181, 197565242, 192417259, 185561346, 174060025, 162975923, 163191234, 177058582, 202835889, 232035214, 253407042, 268911880, 290657053, 321047130, 326421620, 274181153, 187403760, 124709817, 90475786, 71976034, 61805259, 56734173, 55392822, 56918054, 61017093, 67819444, 76746662, 86685178, 97254572, 110360605, 127433023, 144683740, 152776441, 145475343, 126487573, 111274087, 107826085, 114149438, 126977038, 146685607, 174906937, 208043434, 234986120, 252771156, 270802610, 299737087]
18726B99737087J7878117l1285981q3002282p5507084m4155648k4493345j4103074
18719D5067790q297782m763508k578534j146264J34097Q42970O62789R85286K656039
18710C3562883M025924K237322l695519r240806p919602m733875k771105j736394
18702I728828j273987r08189o57415m08000j57873p7487j25454j51746k15431
18693E753246k20722k75530n63631o84316m96959k62652j68329j89552j85529
18684B706026j32848j06324j50464j33542j62213r9680k6062j9124k6560J5973
18674A865182k7872r7975r2074j10465m9098m1886j7206n0756o2527k3908m5542
18663A245873n0212n2475j9829l9037l6568l4868k181M0948J8629r811o8006n0246
$$ y = [299737087, 317615204, 286329223, 203326941, 127819857, 83664209, 59170864, 45067790, 36770008, 32006500, 29427966, 28281702, 28415799, 29258769, 29921558, 30906844, 33562883, 37588807, 39826129, 36130610, 26889804, 18970202, 14236327, 11465222, 9728828, 8454841, 7546652, 6889237, 6481237, 6323364, 6245877, 6120423, 5968677, 5753246, 5532524, 5256994, 4693363, 4009047, 3512088, 3249436, 3081107, 2891555, 2706026, 2573178, 2466854, 2316390, 2182848, 2020635, 1920955, 1894893, 1875769, 1849209, 1865182, 1837310, 1739335, 1647261, 1536796, 1487698, 1445812, 1428606, 1377850, 1315323, 1291415, 1245873, 1195661, 1143186, 1123357, 1084320, 1047752, 1012884, 1010703, 1051651, 1070280, 1060469, 992463, 942217]
18651I42217l4476l0855k6851M1323q424K4252m6352o2289q1746n6276M0631r664
18639F91490k4602n6077m5553p4909N117O8611O9567L6378N2615m320n7307j07405
18627E53605L846K0660m7167j1673m4796l3891K7549M0461N8430J7650P763j16
18615E92321m3377L867k3442j7597L886M1476l478j325o6521m8453m0404n4667
18603C42286K5242L7169q097l6310p270J0365p669q5977n2658K3766J0160L2387
18591B83394N1114N7008J7161j3509k2903N866K3129L5173j9947r695o4159k5762
18579C16870J4044p812O520K4849L0502L3248L5748L3166O4807K3810q9999k7601
18567D58152J74756O4880K2183J23590J38547J26461O2653J22971M2744p2286
$$ y = [942217, 907741, 876886, 850035, 891358, 882934, 907186, 860834, 798545, 716799, 660523, 701154, 691490, 666888, 610811, 565258, 490349, 495466, 564077, 633644, 670022, 722637, 718317, 661010, 553605, 557451, 578111, 530944, 519271, 474475, 440584, 468133, 508594, 567024, 584674, 592437, 592321, 548944, 552811, 529369, 511772, 515658, 557134, 553656, 552331, 485810, 437357, 396953, 342286, 367528, 404697, 396600, 360290, 353020, 363385, 355716, 269739, 217081, 240847, 251007, 283394, 334508, 391516, 408677, 395168, 372265, 378131, 401260, 436433, 416486, 406791, 342632, 316870, 330914, 323102, 329622, 354471, 384973, 418221, 453969, 487135, 551942, 575752, 485753, 458152, 632908, 697788, 719971, 843561, 982108, 1108569, 1171222, 1294193, 1336937, 1264651]
18557A264651k21824j52584q3718M747O518l1166L7777R0905O1898P2873O6981
18546A117058k8775k2133k8334K8243Q5443P3841j25307j84828q8053j7457O6088
18535H75786N0114k4380j24850j01975n5667k1309k9760l9582L3338P800j8336
18524E51179K5340j5498l2492q631L4624Q8479P177M5912J05037P2231R4467K8659
18512I96484R4048J11419R2955J29981J25896Q6963L7222m3852j35943r8736L7198
18501A433635J00111j3300n5011n2066j2670L9146M6256Q3361J20980J04304R2557
18490A887303O0850j15324k10530j95650j06736l543M9637m7933j02287j95748
18480A020039k45169j34703n2087n2573o8395p4705o8377m0414l0756N4712K76
$$ y = [1264651, 1042827, 890243, 806525, 811272, 817790, 786624, 824401, 915306, 977204, 1050077, 1117058, 1088283, 1066150, 1037816, 1066059, 1151502, 1225343, 1100036, 915208, 827155, 809698, 875786, 925900, 901520, 776670, 674695, 619028, 597719, 567959, 528377, 561715, 569515, 551179, 576519, 561021, 528529, 519898, 554522, 643001, 650178, 696090, 801127, 873358, 967825, 996484, 1090532, 1201951, 1294906, 1424887, 1550783, 1637746, 1674968, 1631116, 1495173, 1396437, 1433635, 1533746, 1520446, 1465435, 1413369, 1400699, 1439845, 1486101, 1569462, 1690442, 1794746, 1887303, 1948153, 1832829, 1622299, 1426649, 1319913, 1316370, 1366007, 1318074, 1215787, 1020039, 774870, 640167, 588080, 535507, 467112, 392407, 324030, 283616, 252860, 307572, 307848]
18469C07848o5292k1895K1474M5408J1006M5815N2914M7772L0651j7429p2787
18458C85485j5332q7q575O8163N0795j6732L0277P0249J12259J36130J03098K9547
18446I45277m0972j09924j07041j5380j4413P135q576K1689M246m3047l3528l0729
18434E74737P732O6829K7367n6415j00400r9877j15299l4329L5702L8535p3933
18423B70649o9597m3488o2214m5558l494J5142M9209N3663K3759K6907L3829K3925
18411B72732j8456o73j2527j5650n4874l6155K7955n8886k7019K2076q889N2701
18399A42335M6630r1232j2629K3250k8164n2352L3685l6935N2693P1853l0727
18388A18407r91N9334p083p391L2339j4240j9856K9992J2331j033n125M380K4708
$$ y = [307848, 242556, 220661, 242135, 287543, 298549, 344364, 397278, 445050, 475701, 458272, 385485, 370153, 370066, 361491, 429654, 480449, 463717, 493994, 564243, 676502, 812632, 915730, 945277, 904305, 794381, 687340, 671960, 657547, 664682, 656106, 677795, 682041, 638994, 605466, 574737, 582469, 649298, 676665, 620250, 519850, 419973, 304674, 270345, 306047, 344582, 270649, 201052, 157564, 95350, 49792, 46298, 61440, 110649, 164312, 188071, 214978, 248807, 272732, 254276, 253603, 241076, 225426, 170552, 134397, 162352, 103466, 76447, 98523, 89634, 142335, 188965, 97733, 85104, 108354, 80190, 27838, 61523, 24588, 77281, 149134, 118407, 117416, 176750, 169667, 162276, 194615, 180375, 160519, 190511, 202842, 201809, 196684, 201064, 225772]
18375B25772q5969M050P0751J8233j5083k0812j7258K4876M8600L8872j6115j0236
18363B65681J7637O1917J0437j2394p6141m2435p321J7124J5255p3607q4704k2469
18351F8980L1806K3298K8509k5834L592L3680P2989M931m5007K8589m501L423
18339B24455L8983K2076j0844j3318J6020J4692J4865J5757k5910N14L7411L4023
18327C68724l0237o8033l6665J8892L0090L9025q478l1635Q683N6181k2198k1733
18315C02616L2518L4887k9043J2907P1049K2889n8372m4773p388k6830M593O8181
18303C83234L3920O3220N9375J8059K7042J10307O4659J753M1617N4872P7218
18292I35276J32619Q2036m2765p4530m1229j8828O7374J24379J43763M9883m4893
$$ y = [225772, 139803, 143853, 214604, 232837, 217754, 196942, 179684, 204560, 253160, 292032, 275917, 265681, 283318, 345235, 355672, 343278, 267137, 224702, 217381, 234505, 249760, 176153, 91449, 68980, 100786, 124084, 152593, 126759, 130351, 164031, 237020, 241951, 196944, 225533, 221032, 224455, 263438, 285514, 274670, 261352, 277372, 292064, 306929, 322686, 296776, 297290, 334701, 368724, 338487, 270454, 233789, 252681, 282771, 321796, 313318, 281683, 290366, 346547, 324349, 302616, 335134, 370021, 340978, 353885, 424934, 447823, 389451, 344678, 337290, 310460, 315053, 383234, 417154, 480374, 539749, 557808, 584850, 695157, 759816, 761569, 803186, 858058, 935276, 1067895, 1149931, 1107166, 1032636, 991407, 972579, 1039953, 1164332, 1308095, 1357978, 1313085]
18281A313085p3918J1412M8097o26k1582r7617r4050j06615n4924r230J5798J3460
18269I43290Q707j0830K5021N7698l295J3170M112k5587Q0157J09398N4143j2215
18257A243769o9414o6762j9075M1507J00304J44378J23986L5376o3413n5977p300
18246A407379R5924L2676l4482J9383k398n659o8318N039O8597O3208Q2194J70289
18234A833832K29807M7388k98927l34345j88020l1159k2221K4439Q8573J30636
18224A480003J34430J17976O809L8616l1796j57106j33204m068P628n6631n0632
18213A352025n1877k4888L8879J32310r333l9939o0416J342K5272P5267J45654
18202A584296J07481m656j21366j99392j91984j9190l1506j5583L3664L3063Q0898
$$ y = [1313085, 1239167, 1250579, 1298676, 1298050, 1276468, 1178851, 1084801, 978186, 923262, 914032, 929830, 943290, 951997, 941167, 966188, 1023886, 1020591, 1033761, 1037873, 1012286, 1092443, 1201841, 1255984, 1243769, 1174355, 1107593, 1088518, 1130025, 1230329, 1374707, 1498693, 1534069, 1470656, 1414679, 1407379, 1503303, 1535979, 1501497, 1520880, 1518482, 1512823, 1444505, 1449544, 1518141, 1581349, 1663543, 1833832, 2063639, 2111027, 1812100, 1477755, 1289735, 1258576, 1236355, 1260794, 1349367, 1480003, 1614433, 1732409, 1739218, 1777834, 1746038, 1588932, 1455728, 1451660, 1459288, 1402657, 1352025, 1300148, 1275260, 1314139, 1446449, 1437116, 1397177, 1336761, 1338103, 1363375, 1438642, 1584296, 1691777, 1687121, 1565755, 1366363, 1174379, 1155189, 1123683, 1108100, 1141764, 1174827, 1255725]
18191A255725J11783K9043J1050N0785Q783j72019j77005k6289L991o4124j73227
18180H58496j30390p0025j5683j1179J4669M2577K4679K8766m290m4099K6386
18169G19907M8008O7880N8868P987J4643J1949L2863L7848J490k6347j1688P1921
18157A035329O8126o926m0166m4448P2480P8217P2592K9606m782l7787q9264J0440
18145A143417n145k3850k1491j831l97J9144K8975J2451L3006J25578P6351L4608
18133A420816O0080Q3038N3579N3818R9970J44437K21841K59907L48892O14685
18123C361063Q10790R44342J184156J216690J139255R70360J225528J769431K729959
18114A5351574L951433N412351P075723P594129M950543N138396J0415518J6313367
$$ y = [1255725, 1367508, 1396551, 1407601, 1458386, 1467169, 1295150, 1118145, 1091856, 1095847, 1031723, 858496, 728106, 658081, 642398, 631219, 645888, 688465, 713144, 741910, 737620, 693521, 719907, 767915, 835795, 894663, 902650, 917293, 929242, 962105, 999953, 1001443, 975096, 963408, 1035329, 1103455, 1096529, 1056363, 1011915, 1084395, 1162612, 1235204, 1264810, 1260028, 1222241, 1132977, 1143417, 1138272, 1114422, 1092931, 1091100, 1090703, 1109847, 1138822, 1151273, 1184279, 1309857, 1386208, 1420816, 1480896, 1563934, 1617513, 1671331, 1771301, 1915738, 2137579, 2397486, 2746378, 3361063, 4171853, 5116195, 6300351, 7517041, 8656296, 9626656, 10852184, 12621615, 15351574, 19303007, 24715358, 31791081, 39385210, 44335753, 49474149, 59889667, 76203034]
18106G6203034J2580506o691027k8901001k3128320j1601387n932035l280831
18099I248939j960258j303512r81642p06206l73039l10362l23719k81378j71295
18090B837528j76764j68001r0868n6055m3210l9766L6871M2306j0543l0249J2989
18079B314238J0473M5367K2902l6447K7885O5646Q0964J23330J27259J64480R4037
18068C040134Q3986Q8467J45031J91534K40488L34991M14564M80601N43794O90443
18058F254033P55458Q93077J044305J039149R65447Q21838R78876J550965K290622
18049A6593770K963552L391360L145222L298512M774558O912258P100474L158252
18041E1337958k606977l017739m25966J622169L662847O240576R639185J3945730
$$ y = [76203034, 88783540, 82092513, 53191512, 30063192, 18461805, 12529770, 9248939, 7288681, 5985169, 5003527, 4297321, 3924282, 3613920, 3290201, 3008823, 2837528, 2660764, 2492763, 2401895, 2345840, 2302630, 2262864, 2299735, 2342041, 2331498, 2301249, 2314238, 2324711, 2370078, 2392980, 2356533, 2384418, 2450064, 2531028, 2654358, 2781617, 2946097, 3040134, 3124120, 3212587, 3357618, 3549152, 3789640, 4124631, 4539195, 5019796, 5563590, 6254033, 7009491, 7902568, 8946873, 9986022, 10951469, 11773307, 12752183, 14303148, 16593770, 19557322, 22948682, 26093904, 29392416, 34166974, 41079232, 48179706, 51337958, 48730981, 45713242, 45287276, 46909445, 50572292, 56812868, 66452053, 80397783]
18033H0397783J9073171K4839807K8122015K4442809K4953574L8165125N3668372
18026B93662656M4703830l941628o3124741o5903304m1421446k9516841k8281881
18019A06176645j9607217q661526k297151M7831K480579O847432R894659N764546
18011A00645798p783545k1569779k0090922j2449636p225563l919898j928591
18004B5677864p88330k404N74477Q47582J352354K289956L366006L978302M000039
17995D1295846L682013L737428N347939Q550653J1198976J0419785O206772M673327
17987I5112739P201748R254794J3612835K0041878K4020576K0166016R856836
17980A99267422R280025K2057352L0324936L3566958M7634016P1245080P9687646
$$ y = [80397783, 99470954, 124310761, 152432776, 176875585, 201829159, 239994284, 293662656, 338366486, 334424858, 271300117, 205396813, 163975367, 134458526, 106176645, 86569428, 77907902, 75610751, 75658582, 78139161, 84986593, 94881252, 100645798, 92862253, 71292474, 51201552, 38751916, 31526353, 27606455, 25677864, 24889534, 24887130, 25461607, 26309189, 27661543, 29951499, 33317505, 37295807, 41295846, 44977859, 48715287, 54063226, 62613879, 73812855, 84232640, 90439412, 95112739, 102314487, 111569281, 125182116, 145223994, 169244570, 189410586, 199267422, 208547447, 230604799, 260929735, 294496693, 342130709, 413375789, 493063435]
17973D93063435M3393409k8933345n7208781k6356787j0690245m3332877q7546959
17966B82387850q2897022m7664183k4642449j2603920l272708M096401N367410
17959A20771379l199499j8011396k2142338j5230278r008623m269017n54486N68703
17951D8924445k034684o831008p479838m401864j827928l76119K22743J87608
17943B6383355j76812L3152Q43451J775386K810177M235959N855473P537007Q416061
17934E7713209Q033018R203100J3135791J6300270J2334844j015721j3071612
17927A02632899r387197N77030Q319708J3997285K0499225K6875350K7173223
17920A90687523J8451351J2682276J9527204K5949075K275943m6793429p5647120
$$ y = [493063435, 536456844, 507523499, 450314718, 423957931, 413267686, 369934809, 282387850, 199490828, 151826645, 127184196, 114580276, 111307568, 115403969, 120771379, 117571880, 99560484, 77418146, 62187868, 53179245, 48910228, 48355742, 48924445, 46889761, 40058753, 32578915, 28177051, 26349123, 25973004, 26195747, 26383355, 26206543, 26239695, 27083146, 28858532, 31668709, 35904668, 41760141, 49297148, 57713209, 65746227, 74949327, 88085118, 104385388, 116720232, 115704511, 102632899, 93245702, 93822732, 102142440, 116139725, 136638950, 163514300, 190687523, 209138874, 221821150, 241348354, 267297429, 269573372, 222779943, 147132823]
17913A47132823n4375375l0104145j6945527j0024069n978252l499212j888146
17906B4318097p56468N8860M76886M44308J024828K310027K941526R56005m080426
17897B7693643p611329n845411l338303j909295j323172q98192n88214m60282
17889E719445k11479j42758k75804o18197n21709m14658l22956k97338k64527
17880B650019j28730r7470r1987j05926r0533r5301p6336m6836j3427n7038q9297
17869A757138j26273p7325o9488l4716K7556m296m8688m992m1895n8479j5158
17858A303384m3468p5599m1337m8929k5701q5171r5908r1162M0522K0316p9890
17847G77057j8307R413K8076k6290n1887O7873m4467m4383k7097l0731l06L0984
$$ y = [147132823, 92757448, 62653303, 45707776, 35683707, 29705455, 26206243, 24318097, 23561629, 23620489, 24097375, 24541683, 25566511, 27876538, 30818064, 31774069, 27693643, 20082314, 14236903, 10898600, 8989305, 7666133, 6767941, 6179727, 5719445, 5507966, 5365208, 5089404, 4471207, 3949498, 3534840, 3211884, 2914546, 2650019, 2521289, 2423819, 2331832, 2225906, 2135373, 2040072, 1963736, 1916900, 1903473, 1846435, 1757138, 1630865, 1553540, 1484052, 1449336, 1476892, 1472596, 1423908, 1418916, 1377021, 1318542, 1303384, 1259916, 1184317, 1142980, 1094051, 1068350, 983179, 887271, 796109, 836631, 856947, 777057, 758750, 768163, 796239, 769949, 718062, 785935, 741468, 697085, 669988, 639257, 638951, 669935]
17835F69935m4202j1226M3242K5077l6040m9157J6530J564Q690j993m3632l6588
17823E42200r885O239M8369M8176m0761o594l9997r5224n9515M7215r193r7674
17811C33356j00143j1931P2256K8973k5061K3321K913j8989j5096j7542Q209k9153
17799B51113n1676L1680r866n9634p5149k2198L4127j901N2668K1677P48N2467
17787B24056q143M016j9051k5941L4658j2316J4002P7553L9791j6222l4560k6816
17775B51027K7164J6850J9275k181m834k2185p9765J3940M4322L3615l0523j4478
17763B52227k2540J0628M4698j36198r4197K2688r506j2638N1123l7147k943L8102
17751A04297K4215p0768o4018L1048P2286R426J1767n271J0258K511j9959n112
$$ y = [669935, 625733, 614507, 657749, 682826, 646786, 597629, 614159, 615723, 624413, 622420, 578788, 542200, 532315, 538554, 586923, 635099, 594338, 587744, 547747, 452523, 393008, 440223, 431030, 333356, 233213, 221282, 293538, 322511, 297450, 320771, 323684, 304695, 289599, 272057, 280266, 251113, 199437, 231117, 221251, 161617, 86468, 64270, 98397, 96496, 149164, 170841, 171589, 224056, 215913, 219929, 200878, 174937, 209595, 197279, 211281, 288834, 328625, 312403, 277843, 251027, 278191, 295041, 314316, 312135, 307301, 285116, 205351, 219291, 263613, 297228, 266705, 252227, 229687, 240315, 285013, 148815, 54618, 77306, 67800, 55162, 106285, 69138, 66195, 104297, 128512, 57744, -6274, 24774, 97060, 106486, 118253, 112982, 123240, 125751, 105792, 100680]
17739A00680n0064L218j5383K2946k0101j0356j3657m397Q0914K2285k5956k4265
17727F5864q950K5075L2495J3642m7688R846M4721n279R22k71N8352k3133j7582
17714A48014R724J1870o384k842K955k4004L20k981j5655L5198M2925j3524n4842
17701A30774j3010j3248k6388m664M3686n0265m0607L7684L8199m6997m0195J1598
17689B6567r740J301j6108k0867j1945J3016M9882L7509n8174o8279j4206j5776
17677h6820J4011j7594j1672J8338J2409j6813q423O9966k7365n6119N772M4155
17665f0155K8720k6933J2688R653L628M424Q6741R0247j4049q2512m7241K4168
17653B9379M9148j4526O2711M7100k2669L1493Q199K6244k2150n5106P576K3537
$$ y = [100680, 50616, 53834, 38451, 61397, 41296, 30940, 17283, 12886, 93800, 116085, 90129, 65864, 56914, 81989, 114484, 128126, 80438, 90284, 135005, 129726, 130648, 130377, 188729, 165596, 148014, 157738, 169608, 163224, 160382, 163337, 139333, 139653, 136672, 121017, 156215, 199140, 185616, 130774, 117764, 104516, 78128, 73464, 117150, 66885, 26278, 63962, 102161, 55164, 14969, 26567, 16827, 18128, 2020, -18847, -30792, -17776, 32106, 69615, 11441, -56838, -71044, -86820, -72809, -90403, -102075, -83737, -71328, -88141, -96564, -26598, -53963, -110082, -104310, -60155, -31435, -58368, -45680, -36027, -32399, -27975, 58766, 149013, 134964, 52452, 5211, 29379, 78527, 64001, 126712, 173812, 151143, 182636, 190835, 217079, 194929, 139823, 147399, 170936]
17641A70936Q2413O5634J04218J11952J64589J99380K00982K45406K07488N03
17631A553501l49613m29885l79316j97254n7797n669l4945P598m4878k706L7962
17620I6998k7544l4587k3882l4110K3661K4835L5659M398j9827K4071p998J5856
17608G7530O2027J28623N0703K6843J819k0713J5765L3448L7884P1440J08020
17597E93389J13362R0385J31269J93350K40119J67687j2892l59395m62670k81881
17587D12723j14623l6845p5962n7306l9413k8049p7458Q435J3730N3075M7039
17576A05346K0913l1270q7583m1521K2968Q0678N5096l8130l1847j3927k759k5437
17564A2527k3769O6009K4387j3152N426k4197L4615K0629L4435K7060M2636L844
$$ y = [170936, 253349, 318983, 423201, 535153, 699742, 899122, 1100104, 1345510, 1552998, 1553501, 1203888, 774003, 394687, 197433, 139636, 133967, 99022, 106620, 61742, 59036, 96998, 69454, 34867, 10985, -23125, 536, 25371, 61030, 65428, 45601, 69672, 61674, 77530, 139557, 268180, 318883, 345726, 347545, 326832, 342597, 376045, 413929, 485369, 593389, 706751, 797136, 928405, 1121755, 1361874, 1529561, 1516669, 1157274, 694604, 412723, 298100, 261255, 185293, 127987, 88574, 60525, -16933, -8498, 5232, 58307, 105346, 126259, 94989, 7406, -34115, -11147, 69531, 124627, 86497, 54650, 40723, 37964, 12527, -11242, 54767, 79154, 66002, 71428, 47231, 81846, 102475, 136910, 163970, 206606, 210450]
17552B10450L1190k4600m7106m9540J0110L140J734j3166q143k5371N135j810
17540I2023M5255N245k5422L5138j291J099l4138l4164n7802L6285L6145l2776
17528F5597m9926N222P1401j378K2793k9104J6113L2332L0061k1413O2836L746
17516B08280k5882j7625N9097M0623Q2194M7747p290J1557N9568J21659N2536
17505F32464J06528K05240J03383n6902j25924l4143j9426N1082M1801j5020p8329
17494H10754m3596l7439m8912l7110P8119Q0676N8726K5828l8533j88325j98406
17483D61782j47960m2670l4259j5314N724L964L3963M6456K1305Q6580K4223o9403
17471C74391p4043l7075K8007p295l3316J3898M0071N8584L60Q5455J19817K6742
$$ y = [210450, 241640, 217040, 169934, 120394, 130504, 133644, 135378, 122212, 114069, 88698, 93833, 92023, 137278, 142523, 117101, 152239, 150948, 152047, 117909, 83745, 25943, 62228, 98373, 65597, 15671, 20893, 92294, 90916, 113709, 84605, 100718, 133050, 163111, 141698, 204534, 208280, 182398, 164773, 223870, 264493, 346687, 394434, 387144, 398701, 458269, 579928, 632464, 738992, 944232, 1047615, 990713, 864789, 830646, 811220, 862302, 904103, 889083, 810754, 767158, 729719, 680807, 643697, 721816, 802492, 861218, 887046, 848513, 660188, 461782, 313822, 271152, 236893, 221579, 227303, 231267, 265230, 311686, 332991, 419571, 443794, 374391, 300348, 263273, 291280, 283985, 250669, 264567, 304638, 363222, 363582, 449037, 568854, 595596]
17459E95596j924O9278R9340J07646Q0555J29591K67356K76144J46126r0813j79090
17448A499805k4961J05694J27490K1076q3111j52689j22884j2395M8562N8840
17438A465427j1158j1026J8619l2706j7600j14845j72301j24908M4922O3672o7224
17427A040872j28903k00863j27772j22494q9660p477N42p9983j15618k4321R15
17416A45238r083j4757k4208q715M3729N6403j8552N765M4335O8027K4273n892
17404C06563l140Q2264J67778J56418O0246K8993m3339l0785k18P2678J00448
17393H97906K1355j41782j60211o3057q6816n6124l4059n182K4727K2149J9819
17382D38725J5217R3691O1485N6868Q2919J42251P7898n3915j32710j06042j38004
$$ y = [595596, 593672, 662950, 762290, 869936, 950491, 1080082, 1347438, 1623582, 1769708, 1678895, 1499805, 1474844, 1580538, 1708028, 1729104, 1645993, 1493304, 1370420, 1358025, 1406587, 1465427, 1454269, 1443243, 1461862, 1429156, 1411556, 1296711, 1124410, 999502, 1044424, 1108096, 1040872, 911969, 711106, 583334, 460840, 371180, 363703, 364245, 284262, 168644, 144323, 145238, 136155, 121398, 97190, 88475, 132204, 188607, 170055, 175820, 220155, 288182, 312455, 306563, 303423, 385687, 553465, 709883, 770129, 799122, 755783, 724998, 724780, 797458, 897906, 919261, 777479, 617268, 554211, 467395, 411271, 377212, 372030, 396757, 418906, 438725, 453942, 547633, 609118, 665986, 748905, 891156, 969054, 915139, 782429, 676387, 538383]
17371E38383j58927o1256j19863q6310n4750n594M6824K369m0760l5370o7736
17360d2990o1022K5743M3650O2008o085o0966J3827j9648j4132L7909O6020Q202
17348E2516R727J5704R6325j7793m5690P72m2451k8910J7857L075j8321J2299
17336E5110p557k8775r366k2080L2040p621L3766O016J6862m304n922j2080J2197
17323E8286n9424o525j7494L0033K0291O2856N4333n5018o2678k5480O1762K8161
17311H9103j0816o3207k0557J9372K9901k8919J9105k5842k7881J7050k8571K7528
17299c734M2751k0522m1196L9102R235L1042k0957K9360O5650l8704o7966q849
17287A5212j6646l7070l9836M9893L7209K6707M1003K5646m268p0323J578p291
$$ y = [538383, 379456, 318200, 198337, 112027, 57277, 51683, 98507, 100876, 60116, 24746, -42990, -104012, -78269, -34619, 27389, 21304, -39662, -25835, -45483, -59615, -21706, 44314, 52516, 62243, 77947, 174272, 156479, 110789, 111561, 69110, 40200, 58057, 61132, 42811, 55110, 47553, 18778, 9412, -12668, 19372, 11751, 45517, 51533, 68395, 64091, 58169, 46089, 58286, -1138, -7663, -25157, 4876, 25167, 88023, 142356, 87338, 24660, -820, 60942, 89103, 78287, 15080, -5477, 13895, 43796, 14877, 33982, 8140, -19741, -2691, -31262, -3734, 39017, 18495, -22701, 16401, 25636, 56678, 35721, 65081, 130731, 92027, 24061, 15212, -1434, -38504, -78340, -28447, 8762, 35469, 76472, 102118, 97850, 27527, 29105, 21814]
17275B1814l9885j9870L3508J39Q754j3138K6107K4314Q691o731l2091o40P519
17262A8491K9542o4327N388K0687m2897j9827N8867N9527l4231n0740k9511o4191
17250a13222j2640Q814M1020J1494M8642J2839j8094N5930M6774K6827Q680Q28
17238A17892K980n6334j2616l1798j8400o013k267L0509K7700P46l3149k2938
17226c688n4558Q379O430K1422M5986J0180l8082l7957M9117M8202L990m5548
17214A3873j4873N254L4904j5709L1950j3775l1341k9404K547J4118L9605j8598
17202A8551m4426J6809m6357l2886J4393J3451l5115o165L0022M1014J9784m8614
17190e9539k0273Q1493N2027m8720K9914P6842j764n0731n6188m9314j001K0880
$$ y = [21814, -18071, -37941, -4433, -4294, 4460, -8678, 17429, 41743, 50434, 43703, 11612, 10972, 18491, 48033, -16294, -10906, 9781, -33116, -52943, 5924, 65451, 31220, -19520, -49031, -113222, -125862, -117048, -76028, -64534, -15892, -3053, -21147, 34783, 81557, 108384, 117064, 117892, 120872, 64538, 51922, 20124, 1724, -4289, -6556, 23953, 51653, 52399, 19250, -3688, -58246, -49867, -43437, -22015, 23971, 34151, -3931, -41888, 7229, 55431, 59421, 13873, -1000, 4254, 39158, 23449, 55399, 41624, 10283, -19121, -16574, -2456, 37149, 18551, -25875, -9066, -55423, -88309, -73916, -60465, -95580, -101745, -71723, -30709, -10925, -59539, -79812, 1681, 53708, 4988, 34902, 111744, 109980, 59249, 3061, -46253, -47254, -26374]
17178b6374J6084j9668m037J3000K9833j7104J2695m059l0701k194j902k10R32
17165c3705N0762L1770J143m2560l1143J8751K5355o6097m2998k71j9359L9013
17153f9339K7766l8400o3652p670O7665j990r723J6909j1680j0381Q027P951J37
17140h4380R962l4790J3247L5019J3898J0444p432R991O3656k4095j6057k031
17128a2568L7382j972L0474k7003n2290j1917L4271K232K2600L3842J1391j8437
17116D8005k9407o7761J2014k4626J863l8630J5690M0645Q360j821l7284j8252
17104i1204J6767J06037K1044j0801j3265l0521o92m5526j0976k9579N3864j5015
17092d9867k8513L2306P1560K8700k1260l3799o0176j3280O0670P7397l726k0788
$$ y = [-26374, -10290, -29958, -33995, -20995, 8838, -8266, 4429, 370, -30331, -32525, -34427, -34637, -33705, 17057, 48827, 49970, 7410, -23733, -4982, 20373, -45724, -88722, -88993, -108352, -69339, -41573, -79973, -143625, -151295, -83630, -85620, -95343, -78434, -90114, -100495, -92468, -84517, -84380, -74418, -109208, -95961, -60942, -47044, -36600, -44032, -34041, 29615, 5520, -10537, -12568, 24814, 22842, 53316, 26313, -25977, -37894, -3623, -1391, 21209, 55051, 66442, 48005, 18598, -49163, -37149, -61775, -59912, -98542, -82852, -42207, -33847, -35668, -72952, -91204, -74437, 31600, 52644, 41843, 28578, -1943, -2635, -48161, -59137, -88716, -34852, -49867, -78380, -46074, 25486, 54186, 32926, -873, -61049, -74329, -13659, 63738, 60012, 39224]
17080C9224J975K5727J8893k8519k4658l3850J2453K152K5355o53p806j6479j3690
17067A24J6025n0260l2781k516N3537k419m3515j4665L8414J4138K2422L2947
17055C1451l1485j7285j9300J8481J2883L7012j5260l6158K0593N1043l3077n186
17043A3712k2819K0926n3534k5202j853j8991l8875M2752N5759P3962k5967p0454
17031e0584r54J0626O482p823n3403n3466O4277L5545J3759j9632l8130j0934
17019a04237r2j4432J9301k2163L3961N7278J343O092j5369J5378O5376j7985
17007B4451k1279J2674o820k4347N2693L6952j2840l1303k6765k0174J3825j9915
16995b2848n3926J5947j8645k3021l9243J8229P6516k2330p86J565Q96l3098k341
$$ y = [39224, 41199, 66926, 85819, 57300, 32642, -1208, 11245, 13397, 38752, 38099, 30293, 13814, 124, 16149, -34111, -66892, -69408, -15871, -18290, -61805, -76470, -38056, -23918, -1496, 31451, -34, -17319, -36619, -18138, -5255, 31757, 16497, -19661, 932, 51975, 18898, 13712, -9107, 11819, -41715, -66917, -68770, -87761, -126636, -83884, -28125, 45837, 19870, -50584, -51538, -40912, -34430, -42253, -95656, -149122, -84845, -49300, -35541, -55173, -93303, -104237, -104329, -118761, -99460, -121623, -87662, -30384, -29041, -22949, -38318, -22940, 42436, 24451, 3172, 15846, 9026, -15321, 37372, 74324, 61484, 30181, 3416, -16758, -2933, -22848, -76774, -60827, -79472, -102493, -141736, -123507, -46991, -69321, -70107, -68542, -67646, -100744, -103085]
16982a03085M7677P2387M4321l1783k8767k4726l4147j2090N9356P0219j572K8997
16970H6787k4702k5085n9237k8114o286J5336O173K1321j9353J1017m6872P1806
16958B791M8502l4470l0541m938j5350K7108O2958M5316p6412p1352j619K0720
16946b7287q342n6984J4597J1261J4100P501l6916j2388K2552O429J0750r505
16934f4232M2765M1142n336n536j2472K893l1464j7851q377K8434L6046l391o6057
16921f3436l4115K7822l4557Q017L0925K384O4347K4132l0301l3278m4873n787
16909h8720J6813K4781J9149J6192m4283j341J8717r737J5297L7091n512m9244
16897e0797J3618M5360K0796K0457l99J5066K3208l584k4664k9680k8118l5368
$$ y = [-103085, -55408, 16979, 61300, 29517, 750, -23976, -58123, -70213, -10857, 59362, 57790, 86787, 62085, 37000, -22237, -50351, -56637, -41301, -35128, -13807, -33160, -22143, -69015, 2791, 51293, 16823, -13718, -18656, -34006, -6898, 56060, 101376, 24964, -46388, -48007, -27287, -35629, -92613, -78016, -66755, -52655, -45154, -82070, -94458, -71906, -65477, -54727, -64232, -21467, 19675, 14339, 8803, -3669, -776, -32240, -50091, -58468, -30034, 6012, 2621, -63436, -97551, -69729, -104286, -96269, -65344, -62960, 1387, 25519, -4782, -38060, -82933, -88720, -71907, -47126, -27977, -11785, -56068, -57409, -38692, -48429, -33132, 3959, -1553, -50797, -37179, 8181, 28977, 49434, 49035, 64101, 87309, 83725, 59061, 29381, 1263, -34105]
16885c4105K4192L3417j6240Q4310L2830k8431m7596k4844m3499K0319J5415L7355
16873E3123O2575L158k2759l3505p918m0375k0062L236K0203J7255k3671N5267
16861F6527J7177k7708j25212J0512L8133J988k787L1076K1313N545K120l3296
16849E388j5976k2918l3300J9077N0694k0949K1514L795l0428p6499M3876L3828
16837b1898M94k0089l5577K6074J1461J2332L3257K3044j4427m896l5708O3620
16825C7687N1693L6764j2133o6823o0306J6140K265k079K099Q736k1951Q263L4489
16812C4844k1282j8331l894n1582j4193M611m233J0023K4818K1987m914j2155
16800c4301j6429J0351K1890k1348j3043j504Q053M730K3896j4827n9764L7728
$$ y = [-34105, -9913, 23504, 7264, 91574, 124404, 95973, 48377, 23533, -19966, 353, 15768, 53123, 115698, 118856, 96097, 62592, 54674, 14299, -5763, -2527, 17676, 34931, 11260, 66527, 83704, 55996, -69216, -58704, -20571, -18583, -21370, 9706, 31019, 36564, 38684, 5388, -10588, -33506, -66806, -47729, 2965, -17984, 3530, 7325, -23103, -99602, -55726, -21898, -21404, -41493, -77070, -50996, -39535, -27203, 6054, 29098, 14671, 9775, -25933, 37687, 89380, 126144, 114011, 47188, -13118, 3022, 5287, 3208, 5307, 14043, -7908, 355, 34844, 13562, -4769, -8663, -60245, -74438, -69827, -74060, -64037, -39219, -17232, -22146, -34301, -50730, -40379, -18489, -39837, -52880, -54384, -46331, -41601, -17705, -32532, -92296, -54568]
16788e4568R5134N766m1973m2988o8038l7629J3490N6926N2520j6073J1682K0217
16776e534k2234J1543K8996k3085o129j5844k1002m067J9653j2078j2167j1612
16764g3560L436P6271l491J9106p16l7956K197m389k4286L2251L8636Q228o1074
16751b5347l2192K6345J4347K290l4541j184N0494L7724J7156m2530m7703M8024
16739A2883O577o246l1939n5139r009M2742M6394k504R294J2096j4491J6828N0920
16726G8406L8502P38o5175p6165M077L1624L2514K0046K729J9400J6666m3820
16714E9542j8845N568R502l6928o339q441J272J5491J4892L251k1994K5478l2980
16701I469k5150L2681K9452k005j9970k1398L976J6074L2487M030n1032j304j0538
$$ y = [-54568, 40566, 46332, 4359, -38629, -106667, -144296, -130806, -73880, -21360, -37433, -25751, -5534, -27768, -16225, 12771, -10314, -16443, -32287, -53289, -57356, -37703, -49781, -61948, -73560, -70124, 6147, 2656, 21762, 21046, -16910, -14713, -19102, -43388, -11137, 27499, 35727, -25347, -57539, -31194, -16847, -14557, -49098, -50282, 212, 37936, 55092, 12562, -35141, 12883, 19460, 13214, -18725, -73864, -82873, -40131, 6263, 3759, 13053, 25149, 10658, 27486, 78406, 116908, 117646, 52471, -23694, -19617, 12007, 44521, 64567, 67296, 86696, 103362, 59542, 40697, 46265, 55767, 18839, 12500, 4059, 5331, 20822, 35714, 38965, 16971, 42449, 9469, -15681, 17000, 46452, 44447, 24477, 3079, 7055, 23129, 55616, 59646, 8614, 7310, -3228]
16688c228k2183J1425L3611k6518j6907n7470Q101L7302M188J1897L6046K2761
16676C9025k8473J4155M3281q027p1167q014j9099N6485M1491j4607k5077j1717
16664H256J406O5422J5212j555j8460m5772l0165M6543J24m7999l1442m629l6603
16651g9662j4865J9849n944O8128N7631N5880r695l9293j7719K2338K071l2458
16639B6261m886J4964J6357q2676k2878K1561l1971K2379J7827j4244P478k2492
16627e2320n4636K2386K8829J0766J0711K8585j896J9472L2372L539m880p3782
16615c0854o2585M3101L6983l8120j1650J7924o931N416K0463Q510J9908K2249
16603B4414L0376j3178l4926K0234m5155Q193k801l6692j3743l9515j131M124
$$ y = [-3228, -25411, -13986, 19625, -6893, -23800, -81270, -73169, -35867, -31679, -19782, 16264, 39025, 10552, 24707, 67988, 59961, -11206, -19220, -38319, 18166, 59657, 45050, 19973, 8256, 9662, 75084, 90296, 88741, 70281, 24509, -5656, 40887, 41011, -6988, -38430, -43059, -79662, -94527, -74678, -80622, -12494, 45137, 101017, 91322, 52029, 34310, 56648, 58719, 26261, 21375, 36339, 52696, -29980, -52858, -31297, -63268, -40889, -23062, -37306, -29828, -52320, -106956, -84570, -55741, -44975, -34264, -5679, -7575, 11897, 44269, 47808, 42928, -30854, -93439, -50338, -13355, -51475, -63125, -45201, -52132, -46716, -26253, -17743, 2165, 24414, 54790, 41612, 6686, 26920, -18235, -10042, -12843, -49535, -63278, -102793, -103924, -99800]
16591i9800j3059K771N5396k749K0276L9100O240J0704n7508l6782M587l618p5201
16578a49643K9686J16989J9393k9491k6133J0395l2188k4519k5069k2338J7681
16567a15237K4636K3703P2800r2r2918o048P2057K3985j3110l7388j3330l6276
16555i7218j0019M7400N8703O2567k4439o8762m1263K4949R181j1355j7322p050
16543g4628k0671M1563Q2277K7503n4376l7856o497k395j8441J1704M044J5078
16531c2695K1999Q124L3918L4892l1525o5938m1494N9401J7364L9550K760m2324
16519D032l4415m071K8863J0334j2298l1563j0959j476J8509j9546j2026M0639
16507b3977L9136R764K1752m7323k8262K1126j1254l1373K6866N9918K6711L9836
$$ y = [-99800, -112859, -110088, -54692, -57441, -37165, 1935, 8175, 18879, -38629, -75411, -70824, -74442, -149643, -119957, -2968, 16425, -13066, -39199, -28804, -60992, -85511, -110580, -132918, -115237, -90601, -66898, 5902, 5810, -87108, -93156, -21099, 2886, -10224, -47612, -60942, -97218, -107237, -59837, -1134, 61433, 36994, -31768, -73031, -48082, -38901, -50256, -67578, -74628, -95299, -53736, 28541, 56044, 1668, -36188, -42685, -45080, -63521, -51817, -47773, -32695, -10696, -2572, 31346, 66238, 34713, -31225, -72719, -13318, 4046, 43596, 46356, 4032, -30383, -34454, -5591, 4743, -7555, -39118, -50077, -51553, -33044, -52590, -64616, -23977, 15159, 24923, 46675, -648, -28910, -7784, -19038, -50411, -23545, 36373, 63084, 102920]
16495A02920j0259l6498n385M0717n9749K1164K2285k6608p5907J1400Q053J887
16483e980J8308m3021p9993M8975J0884J4340j7082j589k0186M3796K8289n8618
16471f1877L9994K307l547J9536Q838K9803K6467j4145m3967L4124q368o8799
16459c9634j7298O592R794o2608P035J5303L9620M401N4223k3514m45K3163J8785
16446C5417m6013K6043M4920K1688L0209M985m0725q3213m6691k696m8332j1118
16434a15526K7855L8410N7156L0441J6632l5634m3813P793j1765k9570K2943j5617
16422e0695K9779j6235o767L7627L2422n6380q5141l0208K8957p613J00765K5326
16410A837j8126j252L4707j8729J5893R311M298L258j2819m1628O86N88M3624
$$ y = [102920, 92661, 56163, 50778, 91495, 31746, 52910, 75195, 48587, -27320, -15920, -7867, -5980, 12328, -30693, -110686, -61711, -50827, -36487, -53569, -55158, -75344, -31548, -3259, -61877, -21883, -19576, -23123, -3587, 5251, 35054, 61521, 47376, 3409, 37533, 29165, -39634, -56932, -50340, -40546, -103154, -96119, -80816, -41196, -36795, 17428, -6086, -6531, 16632, 35417, -10596, 15447, 60367, 82055, 112264, 117249, 76524, -6689, -53380, -56076, -104408, -115526, -87671, -49261, 7895, 38336, 54968, 19334, -24479, -16686, -28451, -58021, -35078, -50695, -20916, -37151, -43918, -6291, 26131, -30249, -115390, -145598, -116641, -124254, -23489, 1837, -16289, -17541, 17166, -1563, 14330, 23641, 27939, 31197, 18378, -23250, -22564, -21976, 21648]
16397B1648l558k4157N0844P30m8401j1196n6276n3342N8853N6953k2068j6787
16385d6757M7123L07n755J8322K3468l4907m8093m0173O012K1801Q124j2783P364
16372e5947L0272j3953K7659K7020r09l8832j4655L5428K1447l1249k8321k8872
16360g0912K5341N1726P755j9516N5508J590j2611n9702l6090L9315J6181j5691
16348a7106k3709J4370O8432j3994j3153l4968L2146L1054k2638l8525n2253p13
16336g1057J8637K0279L7914j2633J6006k7736k9046j5600M1499k6589n982j9784
16324g4092r640o578O0217N0561n106l1758j4182k6257R543L7428J9310K9351
16312C8797j2912k8353K5510J2599n3868j6459J9850L9077j1076k1330j7397r023
$$ y = [21648, 18090, -6067, 44777, 45507, -2894, -14090, -70366, -123708, -64855, -7902, -29970, -46757, 366, 673, -5082, 13240, 36708, 1801, -46292, -86465, -80453, -58652, -50528, -63311, -55947, -25675, -39628, -11969, 15051, 14142, -24690, -39345, -3917, 17530, -13719, -42040, -70912, -45571, 6155, 13910, -5606, 49902, 51492, 38881, -20821, -56911, -17596, -1415, -17106, -40815, -26445, 41987, 27993, 14840, -20128, 12018, 43072, 20434, -18091, -70344, -71057, -52420, -32141, 5773, -6860, 9146, -18590, -47636, -63236, -21737, -48326, -54308, -74092, -83732, -90310, -30093, 20468, 15362, -16396, -30578, -56835, -47292, -9864, 9446, 38797, 25885, -2468, 23042, 35641, -18227, -34686, -14836, 24241, 13165, -8165, -25562, -34585]
16300c4585j2120J0872N9067P2835J5105k4501l0204l6671n8606L8498K4339M0119
16288F4148J6071k9729l7429j9555P862L1994l5614j5134O108l2521j436L0209
16276a5026j9366L5453L2534j2103m2643k4212r278N5972M9978M3063o364n8027
16264B9981l2733J615q928L4809O7489J4448k2177j4406m752r305j8236m9248
16252a1443o3215L3759N1243k0103N679L1070k2459r8127M337M8684N3103N304
16240A7832j5815K4591N1345m4684p2819o9583K7855N9499N3255P818N896k3135
16228B2055j6797K7314l9698K7336J2746K6113j2923L2523Q850j0697O419j6142
16216F7099L8547l735j7959n2568l0875k6006K9687n4250k3450K4503K1128o8656
$$ y = [-34585, -46705, -35833, 23234, 96069, 111174, 86673, 56469, 19798, -38808, -310, 24029, 64148, 80219, 50490, 13061, -6494, 1368, 33362, -2252, -17386, -11278, -43799, -45235, -15026, -34392, 1061, 33595, 21492, -21151, -45363, -54641, 1331, 51309, 94372, 88008, 29981, -2752, -1137, -10065, 24744, 92233, 106681, 84504, 70098, 65346, 56041, 37805, -11443, -74658, -40899, 10344, -9759, -4080, 26990, 4531, -93596, -89259, -40575, 12528, 17832, 2017, 26608, 77953, 33269, -39550, -109133, -81278, -21779, 31476, 39294, 45190, 22055, 5258, 32572, -7126, 20210, 32956, 59069, 46146, 78669, 87519, 76822, 83241, 67099, 105646, 101911, 83952, 31384, 509, -25497, 4190, -50060, -73510, -49007, -27879, -96535]
16204i6535j915O4297L679l9908j1992L2953K4680k7595k024j0933j802Q226K8910
16191b9959Q155l938J4948o100l018P574m0222J5841K3647J0685l4951K5483j7906
16178b9761k9446N9043m578q0296m2634k4050M8708L6229k5784L35N837j542q953
16165i6892O762M9592J7525k229o8146J9033M9386J0881j1754j3325J2388P489
16153a9290P390K2820L2424k3685J7629m2597n132l0771j1650k7714j5314M8627
16141d7263J7939J1086j3780R427k8661J8588k3787j6687l823R630L796J1490
16129e2045j0359l6280k5193Q480L6174Q947P4092L3856l5007l0405j0438J6059
16117b2119q070J3238l247L3669L6959K1216N1529l5403m6037o9862j6385M6690
$$ y = [-96535, -98450, -34153, -30474, -70382, -82374, -49421, -24741, -52336, -54360, -65293, -67095, -58869, -29959, -21804, -25742, -10794, -16894, -19912, -12338, -52560, -36719, -13072, -2387, -37338, -11855, -29761, -59207, -164, -4742, -85038, -127672, -151722, -103014, -66785, -92569, -92234, -86397, -87939, -96892, -90130, -40538, -23013, -25242, -93388, -74355, -24969, -14088, -25842, -39167, -26779, -19290, -11900, 10920, 43344, 19659, 37288, -5309, -10441, -41212, -52862, -80576, -95890, -47263, -29324, -18238, -32018, -22591, -51252, -32664, -56451, -73138, -76961, -67331, -63535, -52045, -62404, -98684, -123877, -115397, -79223, -70276, 3816, 37672, 2665, -27740, -38178, -22119, -30189, -16951, -20198, 13471, 50430, 71646, 123175, 87772, 41735, -28127, -44512, 2178]
16105B178j1858r337k1237l9989j7476N6058p137m4070j53k2759n0261L9288K4351
16092a02402M5197j183L5029K3271J867m277j3400K6407m226j2391L9277j8155
16080A5014l4315O5566k0126n1207j3057K9543P4371J9383l7864r3542o0860j7929
16068a25023M2847K637J2692k0782k0020M4222O3295N6762l1834o330m2684k0527
16056d4745L3472k1287o644R957J1799L9093m5795m2546J4818O2270j4110o0065
16044f3783o859P117N363l4783J1578J0138N463K9506L0024k3280j2301K4786
16032a7031Q175P0823L6553m9283j14019l6343L7245q268L0842L1322M0688o303
16020B4401K1328K5170L8451j7449k2925k2252k4834N0334J0561m2513r324l5714
$$ y = [2178, -9680, -19017, -40254, -80243, -97719, -41661, -48798, -92868, -93021, -115780, -166041, -126753, -102402, -57205, -58388, -23359, -88, 1779, -2498, -15898, 10509, 6283, -6108, 33169, 15014, -19301, 46265, 26139, -25068, -38125, -8582, 65789, 85172, 47308, -46234, -107094, -125023, -82176, -79539, -66847, -87629, -107649, -63427, -132, 56630, 24796, 18466, -24218, -44745, -11273, -32560, -39204, -29247, -17448, 21645, -24150, -66696, -51878, 10392, -3718, -63783, -70642, -63525, -58162, -92945, -81367, -71229, -65766, -36260, -6236, -29516, -41817, -17031, -8856, 61967, 98520, 49237, -64782, -101125, -63880, -72148, -41306, -9984, 30704, 24401, 45729, 70899, 109350, 91901, 68976, 46724, 21890, 72224, 82785, 40272, 30948, -4766]
16008d766l4425j4242L5968N9031M5535p3444k3009k5079k251L3447l7759j645
15996d2639r218O347l0234N985M0760O2785k015o7940n8263k2459O549j1913j7274
15983a39529O6281M5098m8686o458K2263K0550N8451n59j2270N3303M2250l8572
15971F2122J3092j2809j547R73q1963l4531L0512L4399J4883M3452J3052m551
15959G7084j9497q4135J6500K5923Q154j0088K2627j5436n3229j3678l259r271
15947e8305n594K880J8427P206P5978K2430p8423m8820k4046p969K5302J6319
15935e4615K4512P25L5139K1195k0827k572O198j8353J1119m7337K0112k66L998
15922b0972J1060K238J8273j9682j8830j0735Q67J0125k8956l9280k129M9726
$$ y = [-4766, -39191, -53433, -17465, 41566, 87101, 13657, -9352, -34431, -36682, -3235, -40994, -42639, -51857, -45510, -75744, -69759, -28999, 33786, 31771, -36169, -94432, -116891, -110342, -122255, -139529, -73248, -28150, -76836, -83294, -61031, -40481, 17970, 17411, 5141, 58444, 100694, 62122, 75214, 62405, 60858, 61831, -20132, -54663, -24151, 10248, 25131, 68583, 81635, 77084, 57587, -26548, -10048, 15875, 24029, 13941, 36568, 21132, -32097, -45775, -49034, -58305, -63899, -61019, -42592, -35386, 40592, 63022, -15401, -64221, -88267, -96236, -70934, -54615, -30103, -29378, 5761, 26956, 6129, 3557, 9755, -8598, 2521, -44816, -24704, -24970, -20972, -9912, -7674, 10599, -9083, -27913, -38648, -37781, -27656, -56612, -95892, -98021, -48295]
15910d8295M2340J2798J3804k8404p702L5728M402j8445K8505j0036k1395O22
15898C922j3245N5818Q402k0517K0356q1o3361J1634J5634j708N971K0367l019
15885D0173j3682l117J2867o3840k2353N6765J9735n3868l8882M5786R065j6510
15873b7861J8405m961j1423k2902L7957N8340o9737p2188J7598M5562K0958r954
15861b0206K1265L3372J7101j9092n0789J3295j7861k007J9706J5007O189J6758
15849C2738n1742k4171k7768O617M1406k5167q044N5973l4923n3403J8759K5517
15837d4208j0341L2365L2735o0612m4386N726J9473L9674j5916J6392K6082L9269
15825C6253N7293n1225l2824N128K311N8809J7238k2055r0398J218J8447j2133
$$ y = [-48295, -5955, 6843, 20647, -7757, -15459, 20269, 24671, 6226, 34731, 24695, 3300, 3922, -9323, 46495, 54897, 34380, 54736, 54655, -8706, 2928, 18562, 16854, 22825, 43192, 40173, 26491, 23374, 36241, -27599, -49952, 6813, 26548, -27320, -66202, -20416, -11351, -27861, -9456, -14417, -25840, -48742, -10785, 47555, -22182, -94370, -76772, -31210, -10252, -20206, 1059, 34431, 51532, 32440, -18349, -5054, -22915, -24922, -5216, 9791, 15980, 32738, -19004, -43175, -70943, -64326, -22920, -48087, -56131, -158, -35081, -88484, -69725, -44208, -54549, -22184, 10551, -50061, -94447, -88721, -69248, -29574, -45490, -29098, -3016, 36253, 93546, 42321, 9497, 14625, 16936, 75745, 92983, 70928, -19470, -18252, 195, -11938]
15813a1938l7103J6764K5597L7971K740P071l4886p5226P522J9147M1838O5009
15801F4506m4894K6950J8364J881L576m1539k6106J5125q931r475K0617k185k8861
15788a0972k3067k4695k3898M8960N2322N6703J4197p0434l2524k0968o039j7990
15776e8405Q340N0781k3855n8363K0641M3488K1520K1760J1854o1470k703J2095
15764a4317k5361K933L6526P0157K194q262n7603n1036m1940l7764J3228L5132
15752g6113O1549j7553p94J2619L7924o4363m6930o639L8015O4422O3157K280
15740F7574j0786m6196N6K4663k1538l4575O0069J5696L5929k299m9969r0660
15728e2036J0856L1429K1716J7006J6344J0373J5252o0483l4051K499K3073L5258
$$ y = [-11938, -49041, -32277, -6680, 31291, 34031, 41102, 6216, -69010, -61488, -42341, -503, 64506, 19612, 46562, 64926, 66807, 70383, 28844, 2738, 17863, 8932, -543, 20074, 17889, -10972, -34039, -58734, -82632, -33672, 18650, 75353, 89550, 19116, -13408, -34376, -40415, -58405, -50065, 716, -23139, -81502, -60861, -17373, 4147, 25907, 37761, -23709, -26412, -14317, -39678, -36745, -219, 69938, 72132, 63870, 6267, -44769, -86709, -124473, -111245, -76113, -14564, -32117, -32911, -20292, 17632, -46731, -93661, -100300, -62285, 2137, 65294, 67574, 56788, 10592, 10648, 35311, 13773, -20802, 39267, 54963, 90892, 88593, 38624, -52036, -41180, -9751, 11965, 28971, 45315, 55688, 70940, 10457, -23594, -21095, 1978, 37236]
15716C7236O742l0920K0865L9407m778k155m0792p3327n8114n611L4107N1072
15704b6268k2172K0458M4568J32l386k209k5472l7443j7883M5034l3815O4557
15692F101K4902K9191m3013m1634k7828N433j6877m5038N0440R5216J7122n4251
15680b36j0374k3439K3867p555L387m07J9044M8092l9649o6260r095K677m494
15667f4442j6552j4678P400k5948O561J3417k6059L8760N18m365J1993p586O545
15654g4436J8419L0636M5946K0653l194k6601k7426J3790j9157k2337j4453o501
15642f4661P3006J0147j9965o8872K7976M1460j1518L7038m0186j6299L8931M8413
15630E5470J245p9484L4658L8787j8401L4798P959J1646l1420J2197J648m0532
$$ y = [37236, 43978, 13058, 33923, 73330, 68552, 66397, 25605, -47722, -105836, -111447, -77340, -26268, -48440, -27982, 16586, 16718, 13332, 11123, -14349, -51792, -69675, -24641, -58456, 6101, 31003, 60194, 17181, -24453, -52281, -46848, -63725, -108763, -58323, 36893, 54015, -236, -10610, -34049, -10182, -17737, -14350, -14757, 4287, 52379, 12730, -53530, -62625, -59948, -64442, -80994, -95672, -88272, -114220, -107659, -94242, -120301, -81541, -81023, -85388, -73395, -80981, -74436, -56017, -25381, 20565, 41218, 38024, 11423, -16003, -2213, -21370, -43707, -58160, -64661, 8345, 18492, -1473, -70345, -42369, -909, -12427, 24611, -15575, -31874, 7057, 55470, 56715, -22769, 11889, 50676, 32275, 67073, 75032, 86678, 55258, 67455, 69103, 28571]
15618B8571m3985k346k5953k1282L3316M5084L7809l5727o1419k1075K203o424
15606g1228l7639l7851J5414O11N3156K4257j4604m6441L5895M9684J6598J5463
15594C315j097K3383J2145K1290n0067k8608J226J8886K0515k3059J2364Q685
15582A8978m9721m9757M4086K8144k6211L1207p343K5440Q2507L626n5911j1736
15570C3309q705k9514n7847k365Q188Q1263N4205m8752m4704l8729k5680J5726
15558f3605K0126K9561J5687R794M166k1089r555k8148k4727j6761j3887L5077
15546f3361J531K2227j0567k2675m3588q5011M3193P2613Q6163O2604M337q161
15534E9305k0278m2305m5884K0254L2396o291n7159l2700k1772K5614M3771O976
$$ y = [28571, -15414, -17760, -43713, -64995, -31679, 13405, 51214, 15487, -45932, -67007, -64804, -71228, -108867, -146718, -131304, -130693, -77537, -53280, -67884, -114325, -78430, -28746, -12148, 3315, 2218, 25601, 37746, 59036, 8969, -19639, -18413, 473, 20988, -2071, 10293, 18978, -30743, -80500, -36414, -8270, -34481, -3274, -10617, 14823, 97330, 100956, 45045, 33309, 24604, -4910, -62757, -65122, -56934, 24329, 78534, 29782, -14922, -53651, -79331, -63605, -43479, -13918, 1769, 11563, 15729, -5360, -14915, -43063, -67790, -84551, -98438, -63361, -61830, -39603, -50170, -72845, -116433, -201444, -158251, -85638, 525, 63129, 67466, 59305, 39027, -3278, -49162, -28908, 3488, -2803, -59962, -92662, -114434, -88820, -45049, -38073]
15522c8073j8006l1650L6666K5296O905l0432l884J0628L2179k5384o6820M8041
15510e4534Q4533J210N149j8306M75p104K8162P389l6284j4944L5281M9395J9975
15497A00397k305j3400O746k3478m1821j2073l565J7055r878j360m0052j338j4869
15484c9941p684j7068J036J6825l48J2796L2168K0734q35l7127L907K9276K0872
15471C4611l6858l9588J606M8453r740K7640M0003L8389j5666k3421L4530J687
15459A01646n7270J237M2520L9469j4552n9672P208k3403k329J0686n2236l713
15447a0409M9364L3501j5090K1158J8821p4141p1318P4577O5872j0571L05K9361
15435A11430k1741j2653m0529j3793N6360L4040r3881q2435j9532O3409L1985
$$ y = [-38073, -56079, -87729, -51063, -25767, -18862, -49294, -53178, -42550, -10371, -35755, -102575, -54534, 29999, 31209, 36358, 18052, 18527, 11423, 39585, 46974, 10690, -4254, 31027, 80422, 100397, 98092, 84692, 91438, 67960, 26139, 14066, 10501, 27556, 17678, 16318, -23734, -25072, -39941, -47625, -64693, -63657, -46832, -47180, -34384, -2216, 18518, 17683, -19444, -15537, 13739, 34611, -2247, -41835, -40229, 8224, -1516, 26124, 66127, 104516, 88850, 65429, 99959, 101646, 44376, 45613, 88133, 127602, 113050, 53378, 60586, 37183, 34854, 45540, -6696, -10409, 38955, 72456, 57366, 78524, 97345, 23204, -48114, 26463, 92335, 81764, 82069, 111430, 89689, 77036, 36507, 22714, 79074, 113114, 19233, -63202, -82734, -19325, 12660]
15424A2660J6209l3405K9829M5814L4181K0474p3149n0812P843p548l527l2326
15412c3757o9158O109J11818P9221K1162j4420j4592m6298J0141N7168o486k7677
15400G3231k8380p5L0661j0557K4751J3171l934Q496j3604o500L6497l5771o089
15387H1897l205L2252O2371m5282l2358J3479m8862K990J7086R744k8905l9039
15375B2168J4225K5256K7013l0306k5733o7810m0860N4874P0072J8142N179p4703
15363b483J8457N1165J0331J8567o038r351l3617J3910k8089j7396p492m866J7053
15350B0151M0760J7303k2437k4960L3510M161m5955O1582L5476k6380q664k9908
15338E4639l5995j5256O8686j80J576J3956j9410m5619l6957j6492L5381O629
$$ y = [12660, 28869, -4536, 25293, 71107, 105288, 125762, 52613, 1801, 9644, 2096, -1431, -33757, -102915, -96806, 15012, 94233, 115395, 100975, 86383, 40085, 50226, 107394, 100908, 73231, 44851, 44776, 75437, 64880, 89631, 102802, 98868, 107364, 93760, 87260, 123757, 87986, 81897, 78692, 110944, 173315, 128033, 95675, 109154, 60292, 63282, 80368, 90112, 61207, 22168, 36393, 61649, 88662, 58356, 32623, -35187, -76047, -21173, 48899, 67041, 72220, -2483, 15974, 67139, 77470, 96037, 89999, 80648, 47031, 60941, 32852, 15456, 7964, 3098, 20151, 60911, 78214, 55777, 30817, 64327, 68488, 22533, 84115, 119591, 93211, 84547, 54639, 18644, 3388, 72074, 71894, 73470, 87426, 68016, 22397, -14560, -31052, 4329, 10958]
15326A0958N8K7060J1217K8430P3727J9925p4352o4621J0099j0970p526J1733
15314C5738L448J4518L246k5942n4692j2339l3853m4985L4074K4196M9463K39
15302f889K3229o765r784L5580l3071J7874J6070l4209M563L1514l8954K0596
15290A9754r040m215L0170M8579J5222M81j1506l1136n733Q189l042p3653K0021
15277D091n784o6266m3138L7542P0846R4640K8302k8301m3791l4138n6053J1313
15265c0737K5969M53J8564L1810j6585J0960K1497j6224L0461J4049j0853M0485
15253A19849j8442j3440j490K349j2080n1056r0587M1883N6997l791l4664n6092
15241f0564J5692M3870K5146J1339n062l8509J0838l5115k3384l9873m968Q3376
$$ y = [10958, 11016, 38076, 49293, 77723, 151450, 171375, 97023, 32402, 42501, 31531, 24005, 35738, 39186, 53704, 56950, 31008, -23684, -36023, -69876, -114861, -80787, -56591, -7128, -6889, 16340, 9575, -209, 35371, 2300, 20174, 36244, 2035, 6598, 38112, -842, 19754, 10714, 6499, 36669, 85248, 100470, 100951, 89445, 58309, 52576, 60765, 57723, -15930, 4091, -1693, -67959, -111097, -73555, -2709, 91931, 120233, 91932, 48141, 14003, -42050, -30737, -4768, -4315, 14249, 46059, 29474, 40434, 61931, 45707, 76168, 90217, 79364, 119849, 101407, 87967, 86477, 88826, 76746, 25690, -64897, -23014, 33983, 30192, -4472, -60564, -44872, -1002, 24144, 35483, 30421, -8088, 2750, -32365, -55749, -95622, -100590, -17214]
15229a7214K8921n0885J1993J4185K2709o4077l1286q116J441K0608N2699n913
15217b4935K2109L7773m4421o619j5140M1539O793j0834j2040R412l274j3714
15205a3351J6067M7074J2232k48n7311o980N4861l1008l9734M4967K1124M6754
15193I4447J7278k9683p5588o7548M0978P5163j7308J8870l0308k4023l6957o042
15181d0721J6535l1298k8298R4672M3985Q93j6167l7712K8129J3062j050Q329
15169E0359l3901n3960m2549q805J7324K2345M7568l0246j8329K9094m900L2556
15157F556M6519J1779l0387J9578J3639l0449N590k596k222o8287l784K2022k9500
15144d1542l5435K09R567M7912k5913L9365J8438R264k739P915m2431L0418J01433
$$ y = [-17214, 11707, -39178, -27185, -13000, 9709, -54368, -85654, -93770, -92329, -71721, -19022, -24935, -2826, 34947, -9474, -16093, -31233, 10306, 17099, 6265, -5775, 3637, 363, -13351, 2716, 49790, 62022, 61774, 4463, -2517, 52344, 21336, -18398, 26569, 47693, 94447, 111725, 82042, 6454, -61094, -20116, 55047, 37739, 56609, 26301, 2278, -34679, -40721, -24186, -55484, -83782, 10890, 54875, 55768, 39601, 1889, 30018, 43080, 42030, 50359, 16458, -37502, -80051, -88856, -71532, -49187, -1619, -31865, -50194, -21100, -26000, 6556, 53075, 64854, 34467, 54045, 67684, 37235, 42825, 40229, 38007, -30280, -34064, -12042, -41542, -76977, -76768, -67201, -19289, -45202, -5837, 12601, 21865, 19126, 27041, -15390, 15028, 116461]
15131A16461m3613j19260L4109O3484J2184k8762J0954K1736o5351m4888L4927
15120h019J9711j1500m0583K3685N0033J0180J4420j1532o3526k5716J6393J4246
15108a2208j7271K9378J3483K7285j1743R073k4993j6051L1869L4706J5145q066
15096G0607j399p565J4136n0833m2455O414O6829j0960p620l2547O282j2849k417
15083d377M5923N2476k9654k5853R1147l6154r8441j794P0101J3443N1570n9048
15071F9339o1612n8279n2219M6072J5986k8083P0L1081K4679j0117J9619K341
15059a123N126j6034j2559J01225m0901l1079N2600j4443j22400l8680L9766K694
15047g5808k9674P370O7454R606l2412K6209J9538J4435J4584l4166m9898J142
$$ y = [116461, 72848, -46412, -12303, 51181, 63365, 34603, 45557, 67293, 1942, -42946, -8019, 11692, 192, -40391, -16706, 33327, 43507, 57927, 46395, -17131, -42847, -26454, -12208, -29479, -101, 13382, 40667, 28924, 37997, 13004, -3047, 28822, 63528, 78673, 70607, 69208, 61643, 75779, 24946, -17509, -11095, 55734, 44774, 37154, 4607, 10889, -1960, -4377, 41546, 94022, 64368, 38515, 129662, 93508, -4933, -6727, 63374, 76817, 128387, 69339, 7727, -50552, -102771, -56699, -40713, -68796, -68726, -37645, -12966, -23083, -3464, -1123, 4003, -12031, -24590, 76635, 35734, 4655, 57255, 42812, -79588, -118268, -78502, -75808, -105482, -98112, -30658, -21052, -53464, -27255, -7717, 6718, 21302, -12864, -62762, -61620]
15035f1620M5083m0373l5362O413M6296K4070K6358l4399J4737O4878k8286n404
15023B2391j5931J1682k8913o0237k1750N530J8091L3361Ll487M9716M7853j4331
15010D3978l0362k951j6569M35k8122k4024M423J5257N8144K2231n1205k4576
14998c3341L5534R908j8949j4192l9359j3365n0018M5291q324N153M1507r572
14986d9727j3114K2660K449Q946J7557J7250N595j0471J1437j3328L0329o6012
14974c6429j6853O3366R0032j3915m4441k1856j8720L6274n616o587K898J3688
14962D1841m012J3633n6021l022N0529P787j0875j1856k3980k6657q897m5588
14950g7118m4159R5739M4544O324l217n0620K0540J5464m9255n1541L5673R2665
$$ y = [-61620, -16537, -56910, -92272, -85859, -39563, -15493, 10865, -23534, -8797, 56081, 27795, 22391, 6460, 18142, -10771, -71008, -92758, -87228, -69137, -35776, -35773, -39260, 10456, 58309, 43978, 13616, 10665, -5904, -5469, -33591, -57615, -53192, -37935, 20209, 42440, -8765, -33341, 2193, 12101, -6848, -21040, -60399, -73764, -123782, -78491, -86815, -81662, -40155, -49727, -62841, -40181, -37732, -28786, -11229, 6021, 11616, 1145, 12582, -746, 29583, -36429, -53282, 10084, 100116, 86201, 41760, 19904, 1184, 37458, 31842, 25255, 28153, 41841, 37829, 51462, -4559, -7581, 42948, 50735, 39860, 28004, 4024, -22633, -31530, -77118, -121277, -25538, 19006, 25330, 22113, -28507, -7967, 7497, -41758, -93299, -57626, 35039]
14938C5039N7942j9870k3075K5089j2942p5192k3592K4402j5400j582r351Q358
14926c0174k8325N5397O9068p3532q9090K1864k0044o6629R1528N2594j2764k6276
14914e6383Q553K3065L5585N3503N434K0340N9879k4781p6453K1120k4326o9609
14902b4073m3250N2644L4376L6040j985l5165N1371P6680l5137n1152J5862L1948
14890A08159o369K6912p9175m8659j954M0134M6713j6949n93l575j8710k5665
14878B0269o7085L261N897k0520L916M8704K0841j059N967j9437k3284M4597K3012
14865D5079J9692k1615p9857j02194l852J05748Q1660M0205p6626j7912k9k9502
14853c9203O7689L1663m2140m472K0206r432M8736J1681k8447K2432J6942L6927
$$ y = [35039, 92981, 73111, 50036, 75125, 62183, -13009, -36601, -12199, -27599, -29181, -38532, -30174, -58499, -3102, 65966, -7566, -96656, -74792, -94836, -161465, -69937, -17343, -30107, -56383, -47830, -24765, 10820, 64323, 69757, 90097, 149976, 125195, 48742, 69862, 45536, -24073, -67323, -14679, 19697, 55737, 53752, 18587, 69958, 146638, 111501, 60349, 76211, 108159, 101790, 128702, 49527, 868, -1086, 39048, 85761, 68812, 68219, 64644, 45934, 20269, -46816, -43555, -37658, -58178, -54262, -5558, 15283, 14224, 20191, 754, -22530, 22067, 45079, 64771, 43156, -36701, -138895, -142747, -36999, 44661, 84866, 8240, -9672, -9701, -39203, 28486, 60149, 18009, 13537, 33743, 24311, 73047, 84728, 56281, 78713, 95655, 132582]
14841A32582K2271M2548M2282k6802k0531N0605j0208n5334J9108O374o8654n7446
14829G6795L0330P253J608J4587J9581P568m2753k2941n0549j3198j4570l8334
14817b4623j7966J6397M8089J9352j2844j4060m6672j1599O195M495M2927N5335
14805F5026j9025l767L768n3296o5104k0618j949N761K2787L5797O9854J6243
14793E5477Q727k0998l5875m174p794N2043J1988k2190l836k4173r185Q672q176
14780E06L1126j1166n665K1933J6016n969j8119l6128m5316J8476L7279l9286
14768c6313j9986M1162O061L5044m6340J0554L2180J4536J4785L0398K7660l4685
14756G5056o5844m2076m0419O783M4840J8367j360o5609n9086J429O7205Q1126
$$ y = [132582, 154853, 197401, 239683, 212881, 192350, 242955, 232747, 177413, 196521, 202895, 134241, 76795, 107125, 114378, 115986, 130573, 150154, 157722, 114969, 92028, 41479, 28281, 13711, -24623, -42589, -26192, 21897, 41249, 28405, 14345, -32327, -43926, -37731, -33236, 9691, 65026, 46001, 42234, 46002, -7294, -72398, -93016, -94965, -89204, -66417, -30620, 39234, 55477, 64204, 43206, 7331, 3157, -4637, 47406, 59394, 37204, 33368, 9195, 10, 8682, 506, 31632, 20466, 14801, 36734, 52750, 46781, 28662, -7466, -52782, -34306, 2973, -36313, -56299, -15137, -9076, 25968, -20372, -9818, 22362, 36898, 51683, 82081, 109741, 75056, 9212, -32864, -73283, -66500, -21660, -3293, -4653, -70262, -129348, -127919, -60714, 20412]
14744B0412J1117j0589J408J7008K4259n30j6792J1435K812o2440k2500L310N0021
14731B8931M4696j3818k6596J2195M345N6239L2902l0157j19646m2026J6589L0670
14719e676J2478j4092L301K9957L263n2397P850L2882m9140L7281P4008k3535
14707E6180p0508K1143O6452n4467L8339K7444M018k5580n8564p614j095L8512
14695C4260r696Q953Q224M2310J2598k3649m5782J5818K8104J0249l6726Q267
14683E2930K2418K7211q3304p5103L178n517K3532r804L6143M553L3232K1798
14671E1267j2864j0245J239l1522K63N5734L9241j8444q901k5278j364K0309k7928
14658C1507o5550n6423k4661M0909N0604N061L8570K1756j1016m5274K5295m378
$$ y = [20412, 31529, 20940, 22348, 39356, 63615, 63085, 46293, 57728, 60540, -1900, -24400, -21090, 28931, 73627, 59809, 33213, 45408, 49753, 105992, 138894, 108737, -10909, -52935, -36346, -5676, 6802, -7290, -3989, 25968, 29231, -23166, -15316, 17566, -31574, 5707, 79715, 56180, -14328, 6815, 73267, 18800, 57139, 84583, 88601, 63021, 4457, -3157, -4252, 34260, 24564, 33517, 41741, 84051, 96649, 73000, 27218, 43036, 71140, 81389, 44663, 52930, 75348, 102559, 19255, -55848, -52670, -58187, -34655, -44459, -8316, -3763, 29469, 51267, 38403, 28158, 29397, -2125, -1862, 53872, 93113, 74669, 65768, 40490, 39126, 59435, 31507, -34043, -90466, -115127, -74218, -23614, -18553, 20017, 41773, 30757, -14517, 10778, 6400]
14646F400K5135l0680O30Q830o9000L4380Q0496K490j725j1435N170M4j1188J2260
14632E1807j5446L430R731k0352L0666k8109j2898L7266k5929k2850l0006N666
14620a7024N471j8515j29q187N737M860K0803L4952j2823r373m4168m040k4206
14607f6642J3761N6742R020M7522K5470k2777j03004m030k1527L9952Q0231o984
14595D7734J1560O686m7264l5603j680L8675Q5785m2301m3550L9644N4263m6042
14583F7907m4329j4642L0865J6709M576n7827k0642K9071M6161q12J6301l5797
14571C7541L032J6568n4851m1204J6160J8255q37M0083j0383M3712o2814m5633
14559d0371N296K7384M5764l0735L7114N0520k1246J5139K0301J1503m7585J5592
$$ y = [6400, 31535, 855, 1485, 10315, -58685, -24305, 56191, 58681, 56956, 45521, 50691, 50735, 39547, 51807, 36361, 39791, 49522, 29170, 59836, 31727, 18829, 56095, 30166, 7316, -22690, -17024, -11553, -30068, -30197, -38384, -32647, -27787, -6984, 27968, 15145, 5772, -38396, -42436, -66642, -52881, 3861, 12881, 60403, 85873, 63096, -39908, -43938, -65465, -25513, 54718, 47734, 59294, 65980, 18716, -16887, -18567, 20108, 105893, 63592, 20042, 59686, 113949, 67907, 23578, 8936, 39801, 56510, 61086, 3259, -17383, 11688, 57849, 57037, 73338, 37541, 40573, 57141, 2290, -38914, -22754, -4499, -5336, 34747, 24364, 68076, 5262, -40371, -35075, -7691, 38073, 7338, 44452, 94972, 73726, 88865, 109166, 120669, 73084, 88676]
14547H8676j1552m6160r351R661n3211K4342k1596j7026k3392j6100N2171O0677
14535C7139p906o310K5067O766K0035L2434Q993j43649p0458L6094J8089J8446
14523b5260o841m2317J2395L2957L9284l7980m6560P2936J09878J4892m7056j09116
14511c2788l2831N5304J1179p63J8073q278k0983N4557j7345k7111j2454O834
14499f606J8460J066K1912Q894k4393P273n159l2505M657O8253j744j5077K0586
14486F5617k903n4100K8198N691k8220J3895M022k0071k4299p6542J1740M0404
14474c6568n3213o986M5017L6874L3489J2155l7230j4039j1479L7713J3791L353
14462B2877p1626k4701r25K3072M0827M542j0457M3368l54l1563L6024m7889K5038
$$ y = [88676, 77124, 30964, 21613, 31274, -21937, 2405, -19191, -36217, -59609, -75709, -23538, 37139, 29233, 22923, 47990, 54756, 74791, 107225, 116218, -27431, -97889, -61795, -43706, -25260, -32101, -74418, -62023, -29066, 10218, -27762, -74322, -1386, 108492, 123384, 76328, -32788, -65619, -10315, 864, 101, 18174, 9896, -11087, 43470, 26125, -986, -13440, -6606, 11854, 12920, 34832, 43726, 19333, 26606, 21447, -11058, -6401, 61852, 60108, 45031, 65617, 62714, 8614, 36812, 42503, 14283, 28178, 32200, 12129, -12170, -88712, -76972, -36568, -89781, -96767, -51750, -14876, 18613, 30768, -6462, -20501, -31980, 5733, 19524, 22877, -48749, -73450, -74375, -51303, -10476, -5934, -16391, 26977, 26623, -4940, 31084, -16805, 8233]
14449H233K7884p6806k2697L4379R660r905j0077J5887O1344L5191l8875j7897
14437A6321J5481O657j6941N624M139M11j2785M1917m1242m8122k5889J1808N9412
14424A6791K5628o2632j4126l2311j4604L4864L8037j7298m2640J2123n775J4755
14412d7188R0598M1610l9405j8359p26K8343m8139n6548m221O3239K7637l2239
14400D602m4080j7605J8659m4473j1803l1500M1953N7352k5030l4075O548l3733
14388a13185K6632O9337J2241L7571j7086k7370L0272M9647M130l6712K9146Q5049
14376A49672J1812m0048k9530m9630k113L6628l7887k6687L8575L0498M441l0249
14364E5482m1252l3957N223K0877K0859k5953L3669O9903J9029j0225j7115l1926
$$ y = [8233, 36117, -40689, -63386, -29007, -19347, -29252, -39329, -23442, 37902, 73093, 34218, 16321, 31802, 38459, 21518, 27142, 31281, 31692, 18907, 60824, 19582, -28540, -54429, -42621, 16791, 42419, -20213, -34339, -66650, -81254, -46390, -8353, -25651, -68291, -56168, -61943, -47188, 43410, 85020, 45615, 27256, 26530, 54873, 6734, -49814, -54035, 9204, 36841, 4602, -39478, -57083, -38424, -82897, -94700, -126200, -84247, -26895, -51925, -86000, -79452, -113185, -86553, -17216, -4975, 32596, 15510, -11860, 18412, 68059, 72189, 35477, 64623, 149672, 161484, 121436, 91906, 42276, 40163, 76791, 38904, 12217, 50792, 81290, 85731, 55482, 14230, -19727, -14504, 6373, 27232, 1279, 34948, 104851, 123880, 113655, 96540, 64614]
14352F4614n0169k1136J9513K4075J2589J11k7175P486j8087l1033K6358l630
14340C516k4233j944k2m2029k9818O029p306J9170M8168N7297O216j306j0963
14327B2775K9122o856l6803l7274k5858K4342K6550J6020J4191N6490r583k7585
14315D5531j364L8030J5398m1387J4651p441o4642J1006R558J5127j3538J6053
14303C6982j9548J5395J531k830l0974J0830K5944j0587k5191K6406j2968J9195
14291C4185q723p355k6965l0034l1889j7175j5521L3289P4706M2302N5263k3450
14279G8633o9635N692M01j1041l3186M2874M8446k2074l6664R595J5182k8147
14267G6K1915M397J9112j1282l9958k7173K8809J7204l4191M506l440N394k7634
$$ y = [64614, 14445, -6691, 12822, 36897, 49486, 49597, 22422, 29908, 11821, -19212, 7146, 3516, -20717, -22661, -22683, -64712, -94530, -88501, -95807, -76637, -28469, 28828, 35044, 33738, 22775, 51897, 45041, 8238, -29036, -54894, -30552, -4002, 12018, 26209, 82699, 73116, 45531, 44167, 82197, 97595, 56208, 70859, 63418, -1224, 9782, 19340, 34467, 20929, 36982, 17434, 32829, 34360, 31530, 556, 11386, 37330, 26743, 1552, 27958, 14990, 34185, 25462, 18107, -8858, -38892, -70781, -87956, -103477, -70188, 4518, 46820, 102083, 78633, 8998, 14690, 15091, 4050, -29136, 13738, 62184, 40110, 3446, 13041, 28223, 76, 21991, 26388, 45500, 34218, -5740, -32913, -4104, 13100, -21091, -16585, -20025, -14631, -42265]
14254d2265n6676N670N9892k5874l4017M1258P3358K0635j7931L0041k3286J468
14242C2273o0660k3166K9770L6029j4853L1604l1091l9789L7207L5239K4979o2528
14230d986k1759N47L7088L1198J7537n2113K8255L7126N011l3046k7809M5967
14218F3016J7720k5989j3009n9436n572J8034m2667m2777M0047J7099J5265M9892
14206C1623j7255j4156J9443K7429K9679J5805l0060k7025l901J699L5541L9838
14194A08660l3595n6924K1343l6302l4973K1449q952o93m625P943K3885P406r487
14181E135l2086K9841j7479j9251k4445j136L7376J6947J2703J9753k4850J5501
14169A8009P066j5747k6273K1733M5698K439j5620R803j721J1458J7177K9688
$$ y = [-42265, -98941, -93271, -33379, -59253, -93270, -52012, 21346, 41981, 24050, 54091, 30805, 32273, -28387, -51553, -21783, 14246, -607, 30997, -94, -39883, -2676, 32563, 57542, -4986, -26745, -26198, 10890, 42088, 59625, 7512, 35767, 72893, 77904, 44858, 17049, 63016, 80736, 54747, 41738, -17698, -23270, -5236, -47903, -90680, -50633, -33534, -18269, 31623, 14368, 212, 19655, 47084, 76763, 92568, 62508, 35483, 31582, 33281, 68822, 108660, 75065, 18141, 39484, 3182, -31791, -10342, -19294, -19987, -24612, -16669, 7216, 14622, 5135, -26951, 2890, -14589, -33840, -58285, -59421, -22045, -5098, 7605, 27358, 2508, 18009, 25075, 9328, -16945, 4788, 50486, 52925, 37305, 47108, 45387, 56845, 74022, 103710]
14157A03710L4687k3431J836k5760n2672m0148J5851J2193N616K9327k6912j2323
14145B1974o5302n8131L8749J4731m9829L5563L0647K071J08304N3727J5124l0523
14133A17105n8580j3747k1907n345M4373M6915r912n7431m4430n764M4450M0283
14121G6010k3917l1126j0330M3404L0814J0207l434j4875j8954m5837N8113k678
14109F7397l7336M126J4381m6195q2783K2494J7404j0877J4920J1236L5752L3448
14097D3967J2385L1543o1194q2713j302K8368M7480m410o187K4082m5587m7027
14085f0595Q9140P9571k3239j19960j112j8347L2379Q5233J7173j4692k4980m9835
14073i264J873Q1291j5689k2884l6611M0696L4321j1840p0205M1116K6518k2523
$$ y = [103710, 138397, 114966, 116802, 91042, 38370, -1778, 14073, 26266, 31882, 61209, 34297, 21974, -43328, -101459, -62710, -47979, -97808, -62245, -31598, -29527, 78777, 132504, 147628, 117105, 58525, 44778, 22871, 17526, 61899, 108814, 98902, 41471, -2959, -8723, 35727, 76010, 52093, 20967, 10637, 54041, 84855, 95062, 91628, 76753, 57799, 11962, 70075, 67397, 30061, 34187, 48568, 2373, -80410, -57916, -40512, -51389, -36469, -25233, 10519, 43967, 56352, 87895, 26701, -56012, -57314, -28946, 18534, 14124, 7937, 32019, -13568, -60595, 28545, 108116, 84877, -35083, -36195, -54542, -22163, 63070, 80243, 65551, 40571, -9264, -7391, 73900, 58211, 35327, -1284, 39412, 73733, 61893, -8312, 32804, 59322, 36799]
14061C6799n5742R668N639Q4965L8969J8690j4190n1034r5127r2943L330K1986
14049h8990J9980N0479j7J5976N6264j976o1906j9238k8559M8531L851N409N467
14036E271o4629J4485J9125M3952J0000j5273q898j96k52o350p708K8419J4113
14023C2059p1312j7174L1343K802m0064J4033N8221n771j0793j9799k340j6131
14011d4926M593n874K1813J5801q269l4306J6439l6215J6243L1221R535P771k527
13998h701j9787m8619N111M8976K0764N4144M8416m6481Q086J5759K2678j7264
13986H3082j8446l9189J852k5162m458J3413j9886M4080N1095p349l0622l6688
13974A1722R978M7937J0369j6297p63M9673O970k7479r1363l1872J19j6575K3285
$$ y = [36799, -18943, -9275, -3636, 81329, 120298, 138988, 124798, 73764, -21363, -114306, -110976, -88990, -69010, -18531, -18548, -2572, 53692, 51716, -10190, -29428, -57987, -9456, -5605, -196, 5271, -59358, -44873, -25748, 18204, 28204, 12931, 4033, 3837, 3585, -2765, -10473, 17946, 32059, -39253, -56427, -25084, -22282, -62346, -48313, 9908, 4137, -6656, -26455, -28795, -44926, -40333, -46207, -24394, -8593, -16862, -51168, -34729, -70944, -54701, -23480, -13945, -6174, -8701, -28488, -77107, -71996, -23020, -2256, 51888, 100304, 53823, 61909, 77668, 100346, 83082, 64636, 25447, 27299, 2137, -2321, 11092, -8794, 35286, 86381, 79032, 48410, 11722, 21700, 69637, 80006, 63709, 62946, 112619, 119589, 92110, 747, -31125, -31006, -47581, -24296]
13961b4296J1650M984k094k0873L0857L0284p728L6614J515p3489M2385M0599
13949G0408K6869l0793j8434J9116m2344j8505m6902O741L8523l5598j4398Q254
13937c7063M5563K3115J9323j3841m7291J7552K0813m9320K077k127k1954L7969
13925e184j922r009J0644m522L535K6596N7114L4274j4359q0844j6273N1994j2979
13912C9065l9446K3692J2760k1544P235L2016k8976n7431n322j4773k4066o734
13900h3524m530M147O4208M3911l8835p1606l4231M2723N0015N7267M7352j3830
13888F3067j0002k6476M4910M4444M1903K5001R227R238J0164o3511l4801k6962
13876H6202m8747L8715O603K5607l4670n9634J9687P7737K8491o6778k8491m100
$$ y = [-24296, -12646, -7662, -9756, -30629, 228, 30512, 22784, 59398, 60913, -12576, 29809, 70408, 97277, 66484, 48050, 67166, 24822, 6317, -40585, -33844, 4679, -30919, -45317, -37063, 8500, 31615, 50938, 37097, -10194, 7358, 28171, -21149, -19072, -21199, -43153, -5184, -7106, -16115, -5471, -9993, -6458, 20138, 77252, 111526, 97167, 16323, 50, 52044, 39065, -381, 23311, 36071, 14527, 21762, 53778, 24802, -32629, -37951, -52724, -76790, -83524, -88054, -83907, -19699, 24212, -14623, -86229, -120460, -77737, -27722, 29545, 76897, 63067, 53065, 26589, 71499, 115943, 157846, 182847, 192074, 201312, 211476, 147965, 113164, 86202, 37455, 76170, 82773, 108380, 73710, 14076, 33763, 111500, 139991, 73213, 44722, 40622]
13864D0622q069N867j5283k5484J3601O6918Q465l0853l4513q273M551N540J020
13851B4109o7814m4614J6248L0931L2167l1236J9818L7969L6161K0496l8672Q422
13839D3985J7468J5536m7390n1088j1455N6593L4934k8147l5300J4205K5474J4418
13827D9233J2260n686j8555k7039l4819l5969M4141O7195M9124k1190l2166m5676
13815H53m463p525l1610r168K278P944P3092M1067q902m6825j1863J5464l2127
13802a1785m2156m5124K5544M8984R251l7237m9193L3482L3967j2018L0200J1183
13790d902J2845M3254J3449m3762m2154q056l9569M1390M5741K830n779j5181
13778A06m5065k7344n205K158p126R471M1367K2134P5667O8563K0017n5323m0662
$$ y = [40622, 32553, 38420, 23137, -2347, 11254, 78172, 86637, 55784, 21271, 12998, 17549, 23089, 24109, -43705, -88319, -72071, -41140, -8973, -40209, -20391, 17578, 53739, 74235, 35563, 43985, 61453, 76989, 29599, -21489, -32944, 23649, 58583, 30436, -4864, 9341, 34815, 49233, 61493, 55807, 37252, 10213, -24606, -60575, -16434, 50761, 99885, 78695, 46529, 853, -3610, -11135, -42745, -51913, -49635, -41691, 31401, 72468, 63566, 16741, 4878, 20342, -11785, -53941, -99065, -73521, -24537, -15286, -52523, -101716, -68234, -34267, -46285, -16085, -4902, 7943, 51197, 64646, 20884, -21270, -29326, -68895, -27505, 18236, 21066, 15287, 106, -44959, -72303, -77508, -75350, -82476, -73005, -31638, -9504, 66163, 134726, 154743, 99420, 58758]
13765E8758L3115N5883J4641k7753m8050l5597J9870K5475o1113m3881j1500O020
13753a4132l0002j8900l2465j933j444R655P7146O28L2183J5155l050j5140N885
13740B3586l7844L3549M1570R390n3062k6957j6326J5310K599o67k3113L1853
13728a12K991j1919K6914P0677l5120q4405j1930K2642K6349M9222O7069L392
13716A25770k8178m6272r6326l4481K8222K6391k7823J2573k3606p514M1058K4587
13704e599k8997K9263N0258P40j3499j0748P881K0607o938j7231q821k773J7671
13691C1814k2998r904m3074j0084P7434J8977K5683j1551J4920j520l3463k3854
13679A2380k7689j4553K6548L2332j8954k9197K074K3980N3827K9185l5749k4827
$$ y = [58758, 91873, 147756, 162397, 134644, 86594, 50997, 70867, 96342, 35229, -8652, -20152, -14132, -44134, -63034, -95499, -97432, -98876, -89221, -12075, -11447, 20736, 35891, 32841, 17701, 23586, -14258, 19291, 60861, 70251, 17189, -9768, -26094, -10784, -8185, -8852, -31965, -112, 2879, -9040, 17874, 88551, 53431, -30974, -42904, -20262, 6087, 55309, 122378, 125770, 97592, 51320, -45006, -79487, -51265, -24874, -52697, -40124, -63730, -71244, -30186, -5599, -34596, -5333, 44925, 45665, 32166, 21418, 29299, 49906, 42968, 25737, 16916, 14143, 31814, 8816, -1088, -44162, -54246, 23188, 42165, 67848, 56297, 71217, 69697, 36234, 12380, -15309, -29862, -3314, 29018, 10064, -19133, -17059, 6921, 60748, 89933, 54184, 29357]
13667B9357J5643j6192N3418k0034q9862o3343N3671k472J655K430K7785k1192
13655b9136P0131L9397m2584o3885j9340N8393P331k8672m863K9568K7352j0598
13643C3094p902l2585n3876M0333J2119N3021K8508l325m6685k1057P679k605
13631F719P2333M4292j8738n6060L768K5381L3516J4016n0338k0529k5983K4229
13619E2606j0982k8948l2536k5276K3363n58J2256N3212J195O3M063K8630j0021
13606F7067j7111m3640j0502n7220J7682O7100J3092n4067k3728J5644k294l0347
13594e8324j0123n863K9333M1279n5350L4750M9656m3425K0772L2295k2666K3617
13582C5951P155P549K7052m9425m0466J1271K7417K2005O572k3714O5793q576
$$ y = [29357, 45000, 28808, 82226, 62192, -27670, -91013, -37342, -39814, -38159, -35729, -7944, -29136, 40995, 80392, 37808, -26077, -45417, 12976, 20307, -8365, -13228, 16340, 43692, 33094, 25192, -7393, -61269, -20936, -8817, 44204, 72712, 69387, 22702, 1645, 9324, 6719, 79052, 123344, 104606, 48546, 52314, 77695, 111211, 125227, 74889, 54360, 28377, 52606, 41624, 12676, -19860, -45136, -21773, -22331, -10075, 43137, 44332, 44395, 48458, 77088, 67067, 49956, 6316, -4186, -61406, -43724, 23376, 36468, -17599, -41327, -25683, -27977, -58324, -68447, -74310, -44977, -3698, -59048, -24298, 25358, -18067, 2705, 35000, 12334, 35951, 43106, 50655, 77707, 28282, -12184, -913, 26504, 48509, 55081, 31367, 97160, 88584]
13570H8584k1715l3699m0652j7834m8178l4605K3582q003P9423O8376l31k0584
13558C4364N110J6453l1376m5803r425M9873q12M804K8416L5773j3630q1250n0079
13545e7582k6987k6781M5954N9645J8485K466j1337K6647L1131R832J4272k9694
13533E6051J1043K4094j7244j7111j6216j1914j6080j9143k1091J4181K8578L701
13521A8849J5841j6464K191l1562J8029j809J5582O072l6629j8620p993k774J2257
13508b7030O2843L5987L1675J2855k8888K9002M9838l7549k5161l2069n8571K043
13496A4975K2979l8014o916K7269L7303j5259k0756K7232J5080j5428l0703o3692
13484d5930L1054N9988J3491q1861k5291M0283L5283L2101r872J2842K782j4535
$$ y = [88584, 66869, 33170, -7482, -25316, -73494, -108099, -84517, -92520, -13097, 55279, 54948, 34364, 39474, 55927, 24551, -21252, -30677, 19196, 18384, 23188, 51604, 87377, 73747, -7503, -57582, -84569, -111350, -65396, -5751, 12734, 15200, 3863, 30510, 61641, 71473, 85745, 56051, 67094, 91188, 73944, 56833, 40617, 28703, 12623, -6520, -27611, -13430, 15148, 18849, 34690, 18226, 20417, -11145, 6884, 5075, 20657, 26729, -9900, -28520, -36513, -39287, -27030, 35813, 71800, 103475, 116330, 87442, 116444, 166282, 128733, 103572, 71503, 12932, 14975, 37954, -60, -6976, 20293, 57596, 42337, 21581, 48813, 63893, 48465, 17762, -45930, -14876, 45112, 58603, -23258, -48549, -8266, 27017, 59118, 49246, 62088, 64870, 50335]
13472E0335m9698q423n1884R604M020O6660L6610N761m2168l6829n649J4471J1727
13459D537J872j7632O039O515J7210m1576o1661J6438k0646J6315O7193L1615
13447B6219j5546k2788K7047M466m8502k2808K3191J4515R51J1555l207K5947
13435B1040l3097l4075K0240K5820K7816K335j5699o5158j4859n565L8936M9206
13423A6940N4783k0184k2964Q6986m5602q6644m5592K7816L4529n148j413j9826
13411b6319k0326o125N6019J8876l5385Q258M1563o6242l0981l0697L197O8176
13399a9986N9459K7818l7984J2325L0947k0614l5933J5720L2488L4279m061m7987
13387D6471k1802Q7341O409l5588j6622K6708J1042j7133j9208K6554k7145M9427
$$ y = [50335, 637, -7786, -59670, -50066, -46046, 20614, 57224, 62985, 20817, -16012, -21661, -7190, 4537, 6409, -11223, -5184, 1331, 18541, -23035, -84696, -68258, -88904, -72589, -5396, 26219, 10673, -12115, 14932, 19398, -29104, -51912, -28721, -14206, -13255, -1700, -4907, 21040, -12057, -46132, -25892, -72, 27744, 30079, 14380, -50778, -65637, -71202, -32266, 16940, 71723, 51539, 28575, 115561, 69959, -16685, -62277, -34461, 68, -5080, -6493, -26319, -46645, -52770, 3249, 22125, -13260, -5002, 36561, -29681, -60662, -91359, -88162, -19986, 39473, 67291, 29307, 41632, 72579, 51965, 16032, 31752, 64240, 98519, 94458, 46471, 24669, 112010, 118419, 82831, 66209, 92917, 103959, 86826, 67618, 94172, 67027, 116454]
13375A16454l3522n6328Q652K3431L583n80m935k2717j2427m3015l9614j6601
13363g7619O1409M9673o343J2993J0532k6160m0071l8019Q2232N2645j1789l2968
13351C6515J7567r082m8168j3874k4480m9222Q491k3j1039L7768L8821j6395k5734
13338e8855J9036O3476k19k1920K7216K4658o873l4700k5363p3500L2359N9823
13326E138k736k8693j6983j7478k6635l4791k6557K7442K2813N6753N7771K8361
13314D4405N998n1945m1764Q8573N802j2197j6566K4317P271K3294J1750k4276
13302F4662K2731j5183j7621m48k749j1330Q501l9168r062J2159N9414M3614r57
13289A14563p1833q1058L2560M6649K5984j6853k4582l4859l2834K870J5583m8391
$$ y = [116454, 82932, 26604, 35256, 58687, 62270, 61690, 56755, 34038, 21611, -21404, -61018, -77619, -16210, 33463, 27120, 40113, 50645, 24485, -15586, -53605, 28627, 81272, 69483, 36515, 54082, 45000, -3168, -17042, -41522, -90744, -82253, -82276, -93315, -55547, -16726, -33121, -58855, -39819, 23657, 23438, 1518, 28734, 53392, 46519, 11819, -13544, -87044, -54685, 5138, 2402, -26291, -43274, -60752, -87387, -122178, -148735, -121293, -98480, -41727, 16044, 44405, 50403, -1542, -43306, 45267, 51069, 38872, 22306, 46623, 53894, 77188, 88938, 64662, 87393, 72210, 54589, 54141, 51392, 40062, 48563, 9395, 333, 12492, 71906, 115520, 114563, 42730, -38328, -5768, 40881, 66865, 50012, 25430, -9429, -42263, -39393, -23810, -72201]
13277g2201l2466N2518O4197O966o308j1080j3144o833l0207k5650L6772J7402
13265b0034J0103o8500j3516K5586M8363J5560J3806n031O748R776q049l591m2624
13252c1403N2775L7558l392m7963l0437m6344o6779J2560J3202L3112L5245N7769
13240A5903P919m8374m3613R7727M7909l8905k6608R925K1267j9183L8132N1047
13228A13146k6777l050j212l5554k5512m6135K1759O2023K7675N6617o4364n2174
13216B6442n9433L534L5768N0694j4396l5074n23N969l1239l8630J0912o918l8192
13203i1086J1986J2199J6130l964J148M297J3904j846l7160j5433J1466P681K3450
13190d7228P69J6627O9073j019p3436k4938k694j6388O8707P471l3575m6707L7967
$$ y = [-72201, -104667, -52149, 12048, 19014, 12706, 1626, -11518, -18351, -48558, -74208, -37436, -20034, -9931, -78431, -91947, -66361, -17998, -2438, 11368, 6337, 13085, 22861, 14812, 11221, -31403, 21372, 58930, 55538, 7575, -22862, -69206, -135985, -123425, -110223, -77111, -41866, 15903, 23822, -24552, -68165, 29562, 77471, 38566, 11958, 21883, 43150, 23967, 62099, 113146, 86369, 83319, 82107, 46553, 21041, -25094, -3335, 58688, 86363, 142980, 78616, 26442, -32991, -29457, 6311, 57005, 42609, 7535, 7012, 12981, -18258, -56888, -45976, -52894, -91086, -79100, -66901, -50771, -54735, -53587, -49290, -35386, -37232, -74392, -89825, -78359, -70678, -47228, -46459, -29832, 39241, 38222, -35214, -60152, -62846, -79234, -10527, -3056, -36631, -83338, -45371]
13177d5371P9389L1667K4556j9191o4489k3336J9221K0692L952M2673k2172o9603
13165b2012k3668N82R548O6681K3209j0746p3947n0099J8394J2386n055P94r011
13152f2944M8167R5281l7476o4329L0333O531k8100m9100n626N504L1840l0160
13140f0079j8003J3166P082k297L5942l0161n246J8399Q168j722M1890P3099k1513
13127E8725l0231M3910Q35l5437n596J8584j2139q3025M5046K1333j2325J4367
13115B4047p8499n9159K9591O7996K354J4273J7496j4040n6366l5324K6358K4163
13103c7110N5198o943l0274j4288J9904J3063l9439P986j0815o267K3056O40J8810
13090f479O435k6992O059k4581O341N8553K277J5187k0838K2741j0655j3442k37
$$ y = [-45371, 34018, 65685, 90241, 71050, 6561, -16775, 2446, 23138, 27090, 69763, 47591, -22012, -45680, -45098, -35550, 31131, 54340, 43594, -30353, -80452, -62058, -49672, -54727, -53933, -62944, -14777, 80504, 43028, -21301, 9032, 15563, -12537, -61637, -67263, -61759, -29919, -60079, -78082, -64916, -57834, -60131, -24189, -54350, -59596, -41197, -33029, -34751, 7139, 80238, 58725, 28494, 72404, 73239, 37802, 32206, 50790, 38651, -44374, 672, 22005, 9680, 24047, -54452, -113611, -84020, -16024, -13670, 603, 18099, 4059, -52307, -87631, -61273, -37110, 18088, 11145, -19129, -33417, -13513, -450, -39889, -31903, -42718, -48985, -25929, -25289, -6479, -44, -27036, -20977, -45558, -39217, 19336, 21613, 36800, 15962, 38703, 28048, 14606, 14369]
13077A4369j5922k1513J9654J9398k6089n7184j2440k1693k0322q722Q5532M2530
13065b402n6899k320K3057l7079L6774K5215M0700J5652l1602l4511j235l2508
13053e7158L303J9642M8773J0528J0343p755k0658k9990N7076M5464M625m6194
13041C7999l6613J7135k1895j3988j8082J2021j6989R101m1832L4384K8245M6551
13029C6037J5566m6596l5473k7102J1483N1371k9582N5581L7236l933j4705j6055
13017C3828J0754R127q396m7815J09k3324o092l4885o1618K494J6001K4368P701
13004g7748N3308j8790l3073P4886K2856L0928L8102n745p2134p6604l8485m2884
12992a45383M6334O5407P6139J939K2556k0706k3923k0979k1904K277J1980L6631
$$ y = [14369, -1553, -23066, -3412, 15986, -10103, -67287, -79727, -101420, -121742, -130464, -44932, -2402, -59301, -61621, -38564, -75643, -38869, -13654, 27046, 42698, 11096, -23415, -24650, -57158, -53855, -34213, 14560, 25088, 35431, 27676, 7018, -22972, 34104, 79568, 84193, 37999, 1386, 18521, -3374, -17362, -35444, -23423, -40412, -31311, -73143, -38759, -10514, 36037, 51603, 5007, -30466, -57568, -46085, 5286, -24296, 31285, 68521, 64588, 49883, 33828, 44582, 53709, 45313, -2502, -2393, -25717, -31809, -66694, -128312, -125818, -109817, -85449, -77748, -24440, -43230, -76303, -1417, 21439, 52367, 90469, 84724, 12590, -64014, -102499, -145383, -99049, -33642, 42497, 44436, 66992, 46286, 22363, 1384, -20520, -18243, -6263, 30368]
12980C0368R2722K3487n1550m3496l827k5281L0677L3612K0659l195o7385n9990
12968b3199J7210L0780J8942J7519k2587l9980J6825M1902K455k4409J9240R887
12956F4585m5324n0147K6207k4043K3215J3870l015K4523l953K3327j253m6084
12944A908j5586N4716O056j6486L1289J3147l4237k814J9438j2340k4602J3781
12932C4270L4297K3194K866o0873n6722K4692k5458L9252J1307j8259M0771j2149
12920C7188m5706j7278M5661N1347n4800J230J7232j9263k9290l3033P989K5372
12908a3351N4871k0420j2446l9432j5632L4040K2066j1464K0441j0452n0008K6757
12896a5030L9660k090l5780j1985O2402N5657o0520K39o1920k4577J0032n060
$$ y = [30368, 123090, 146577, 95027, 51531, 47704, 22423, 53100, 86712, 107371, 104176, 36791, -23199, -5989, 24791, 43733, 61252, 38665, -1315, 15510, 57412, 59867, 35458, 54698, 64585, 19261, -30886, -4679, -28722, -5507, 8363, 5348, 29871, 25918, 49245, 47992, 1908, -13678, 41038, 47094, 30608, 61897, 75044, 40807, 37993, 57431, 45091, 20489, 34270, 68567, 91761, 94627, 33754, -22968, 1724, -23734, 15518, 26825, 8566, 49337, 37188, -8518, -25796, 19865, 71212, 16412, 17642, 34874, 15611, -13679, -46712, -38723, -13351, 41520, 21100, 8654, -30778, -46410, -12370, 9696, -1768, 18673, 8221, -41787, -15030, 24630, 22540, -13240, -25225, 37177, 92834, 32314, 32553, -29367, -53944, -43912, -48972]
12884d8972P760L0750j9506J3960K0206o368k0588M8782k595p6443m5749L3081
12872f5682M1412M2897J8574j3432k8066L9646K9686n3161o268K471L6958J4760
12860E9795n527M2077M8223j8334k9552l1851L225K0629r561m2042j7700m5927
12848b6545k3356L4269L1438N065k6282j0157N5012n122r0773k5008Q428L4500
12836c8531k6146J1696R5628M0710M849j7394q002k7123K152l392l5025o3194
12824f3772M4307K7478j4404R899J895o241J2512j4955p0631n4662P3460R220
12812d5894L6519l3031l1799p940R950K9935k1767l5764M9899R1131m577L019
12800C9681o673R914k0381n1109k4014Q563l315O648M0746J0910m076k2663j4965
$$ y = [-48972, -41212, -10462, -29968, -16008, 4198, -2170, -22758, 26024, 23429, -53014, -98763, -65682, -24270, 18627, 37201, 23769, -4297, 35349, 65035, 11874, 5606, 8077, 45035, 59795, 54268, 96345, 144568, 126234, 96682, 64831, 68056, 88685, 79124, 37082, 19382, -26545, -49901, -15632, 15806, 20871, -5411, -15568, 39444, 34322, -56451, -81459, -73031, -38531, -64677, -52981, 42647, 83357, 88206, 70812, 62810, 35687, 37839, 34447, -578, -63772, -19465, 8013, -6391, 3508, 5403, -838, 11674, -3281, -73912, -128574, -55114, -45894, -9375, -42406, -74205, -82145, -72195, -42260, -64027, -99791, -49892, 41239, 36662, 39681, 33008, 42922, 22541, -28568, -52582, -44019, -47334, -40686, 60, 10970, 6894, -15769, -30734]
12787c0734m64M815n899j1026K1161m6107j3835l8103k7000M4584R408k0367k035
12774a15602M7759O8408Q6471L5957l0704l7982n9950K301J2409J2905j7534K0641
12762B5079R805o001M8234J339m758L45L99J1402K6784k6108q5976l0441L5245
12749E348P7651j85j6645j4168k0970J6864O0349Q6522Q930o1993m1176l7722
12737F2805q395L6170m3360k0944M1159j3819R044l9767j7237K7622l0293l6797
12725c3812p712J9715M9646M2447n9300j7771j443j0720K599J1322K6969l799
12713A8141l0732m2559j5276J252q930K4827K260L5063O0076k7830J6991M7541
12701H0824O113k3445N517k2584m8869k3112L454q097p263J1320J671m5886K4315
$$ y = [-30734, -31198, -26383, -32282, -43308, -22147, -68254, -82089, -120192, -147192, -102608, -93200, -113567, -115602, -67843, 565, 87036, 122993, 92289, 54307, -5643, -3342, 9067, 21972, 4438, 25079, 34884, 28883, 77117, 78456, 73698, 74043, 74442, 85844, 112628, 86520, 544, -29897, 5348, 82999, 82814, 66169, 52001, 31031, 47895, 108244, 194766, 203696, 141703, 100527, 62805, 54410, 90580, 47220, 26276, 67435, 53616, 62660, 22893, 5656, 33278, 2985, -33812, -41524, -21809, 27837, 70284, 10984, -6787, -8230, -18950, -16351, -5029, 21940, 18141, -12591, -55150, -70426, -69174, -78104, -53277, -51017, -15954, 44122, 16292, 33283, 80824, 86937, 63492, 69009, 46425, -2444, -25556, -22102, -30199, -37462, -26142, -24471, -70357, -46042]
12688d6042K7230K2028M4769k324k9639j311J0784l5930j393K8392N7839j9184
12676E5219k2147R137k7436k9274m662O5713J564J9377k6529j74j4680l3073K4523
12663A7558N057K7974l2602k4182k0917N0020L1340k7984k8080j8942J7311O0830
12651E7383J0692j7859k4812k450J338K735l3572k8833M7741r723J4619j9357
12639b098N125O4046K5607L5053m544r4842o0911j6128M363k3882K6135j8039
12627f0115L762l12l1157L9823J7878L0358J8964L3438K3063n682q020k1447J007
12614D1560J1523k923L3594J1158l0151l4358l925L3188l2872j6448j3672k6218
12602b9544k4270L0795P5680K8171l1837o3787m5737J3422l231j9491o372N1582
$$ y = [-46042, -18812, 3216, 47985, 45661, 16022, 14711, 25495, -10435, -11828, 16564, 74403, 55219, 33072, 42209, 14773, -14501, -19163, 46550, 48114, 67491, 40962, 40788, 26108, -6965, 17558, 22615, 50589, 17987, -6195, -27112, 22908, 54248, 26264, -1816, -20758, -3447, 57383, 68075, 50216, 25404, 22954, 24292, 27027, -6545, -35378, 12363, 2640, 17259, -2098, 3027, 67073, 92680, 127733, 123189, 28347, -32564, -48692, -44329, -68211, -42076, -60115, -56353, -56665, -87822, -47999, -30121, 237, 19201, 52639, 75702, 70020, 62000, 40553, 41560, 53083, 50160, 83754, 94912, 64761, 30403, 26478, 59666, 26794, 10346, -3326, -29544, -53814, -23019, 52661, 80832, 48995, -14792, -60529, -47107, -50338, -69829, -76201, -24619]
12590b4619L7460K643j3413J878K9424J5184J1654J6585j501j5004K0777k2333
12578E8735L713L7873M0275l2388p877n4201l0351l1517N4208N9141j7046l2161
12566D8404m4651J1989j3469o8647j8431j5100Q314K4315K2076J5185J2756n287
12554b2546L7683L3834K0082m6875j0410J7755O0138l25l3951j8557k4409j5067
12542b648m4111j9330M3486O3236K5438l7896j5208j4262k0078J9156N098M3249
12530D6130m96q3649R642N3507O3792J8895j7044m296j6173K4506j8283k5178
12518E1353m6380k5356M199K1675O9365M1420R089k9652J7337n0446R793j1518
12506F0879M12J587L5965k4339p1850k298K7291N531j3153j2038K741K8105L4151
$$ y = [-24619, 12841, 15484, 2071, 3949, 33373, 48557, 60211, 76796, 75295, 60291, 81068, 58735, 62448, 100321, 140596, 108208, 100331, 46130, 15779, -15738, 38470, 97611, 80565, 48404, 3753, 15742, 2273, -66374, -84805, -99905, -91591, -67276, -45200, -30015, -17259, -22546, 15137, 48971, 69053, 22178, 11768, 29523, 89661, 89336, 55385, 36828, 12419, -2648, -46759, -66089, -22603, 40633, 66071, 28175, 12967, -1295, -21373, -2217, 2881, 46130, 45634, -38015, -28373, 25134, 88926, 107821, 90777, 86481, 70308, 94814, 76531, 51353, 4973, -20383, -16184, 5491, 74856, 116276, 125365, 95713, 113050, 62604, 72397, 60879, 61291, 62878, 98843, 74504, 2654, 356, 27647, 33178, 20025, 7987, 10728, 38833, 72984]
12493G2984M1487j3312o0211r684L7260J4428j4852r177j1761J5849J1791J4718
12481H9520j5946j4142P8345j3420l8433k3063l1000L6108J9208k7950J9992L3973
12469A13192m5884K691N0987p3965l6317J4085K1786k947L3692K9165o7385o5655
12457b6555k7371r631K2618P1995j0192k4202K5251j1235l6207j623K2758J076
12445c318r018O380j6217m5070Q936N5999L5149L2239l4433n6778n66J8465j3461
12432b1693O28L2448R198o187j4150l8607k2336j6839k7508K9485Q8018j5194
12420b737k7023m0175M3199L7143J716k4791J0056n7272j8684M017P958M435j4990
12407g7148K6718j3517K2724k2262k1549K8283j3652J1842L6782l088o087J0779
$$ y = [72984, 114471, 101159, 40948, 31264, 68524, 82952, 68100, 58923, 47162, 63011, 74802, 89520, 73574, 59432, 137777, 124357, 85924, 62861, 31861, 67969, 87177, 59227, 79219, 113192, 67308, 69999, 120986, 47021, 10704, 24789, 46575, 43628, 77320, 106485, 39100, -26555, -53926, -63557, -40939, 31056, 20864, -3338, 21913, 10678, -25529, -27152, -4394, -3318, -12336, -5956, -22173, -67243, -58307, -2308, 32841, 65080, 30647, -26131, -26697, -8232, -21693, -21065, 11383, 20581, 14394, 244, -38363, -60699, -77538, -105046, -75561, 12457, -2737, -29760, -69935, -26736, 10407, 12123, -12668, -2612, -59884, -78568, -74551, -66593, -62158, -77148, -50430, -63947, -41223, -63485, -85034, -56751, -70403, -58561, -21779, -24867, -30954, -20175]
12395b0175j2313M0328m0743j509O3448M2324J9803m5176Q981J8166k8481l2678
12383A1975l0832N3746J9183K0444m1700l5397l6442K1602L4056K0879j182J6810
12371E3142K444n9197j2557J5082K0298l290o9531j01242K3888R2138J7306l0252
12359e1771M7664L0584m6966j5584k7019J6807j8654M987L6143l4626j4821M2396
12347c0860k012m5952l33R3722J6822n4153K4328M4180k9684l8507k4870j5312
12335f2631q984L4690L3046Q2873L0811k6271q453K4425j2034l6834k5627n544
12323A9467n4024j2097j4229k10M3236N8540j100j3575k4298l165j6088m7234
12311f4777J9916M47J0374j5651J7464J1780o776N4968l5854m081K6422k7680
$$ y = [-20175, -32488, 7840, -32903, -34412, 29036, 71360, 91163, 45987, 54968, 73134, 44653, 11975, -18857, 34889, 54072, 74516, 32816, -2581, -39023, -17421, 16635, 37514, 36332, 53142, 55586, -3611, -16168, -1086, 19212, 15922, -53609, -154851, -130963, -38825, -21519, -51771, -4107, 26477, -20489, -36073, -63092, -46285, -64939, -59952, -23809, -58435, -73256, -30860, -32872, -78824, -79157, 14565, 31387, -22766, 1562, 45742, 16058, -22449, -47319, -62631, -71615, -36925, -3879, 78994, 109805, 83534, 75081, 99506, 87472, 50638, 25011, 19467, -34557, -46654, -60883, -61093, -17857, 40683, 39583, 26008, 1710, -1455, -17543, -64777, -44861, -44414, -34040, -49691, -32227, -20447, -27223, 27745, -8109, -12190, 14232, -13448]
12299a3448m2203j7027J1480K3017M1037L5015L1204k3225m0480l041k22j7114
12287a5007n2805L095R0046M3171O8514k5264p3824r362k7014j7568j8665k0073
12275e4756L1955O4433R181n9741n4364r471M2239O5092J2636o756N0l8573j4874
12262a2949O9671L7628q219k0822p7981L7474J5241j6044n2711L0977K2024l5315
12250a1026l3467l883j7601J974l0331O4791K6142L2213j8849Q458o423J6503
12238B8501K4754k5680Q652L584R115o2857K7402k902k0276k8087m5444L9983
12226d3255R7495m42j0248r528j4144j3925k0221k0183l2478L0198M6314r071
12214E12o3910M5791J6551l1110l1581n6631K3106O6077q757M8285N8860J8541
$$ y = [-13448, -55651, -72678, -61198, -38181, 2856, 37871, 69075, 45850, 5370, 2329, 2107, -15007, -67812, -64717, 25329, 68500, 137014, 111750, 37926, 28564, 1550, -16018, -34683, -54756, -22801, 41632, 50813, -8928, -63292, -72763, -30524, 34568, 47204, 40448, 40498, 1925, -12949, 56722, 94350, 86131, 65309, -12672, 24802, 40043, 23999, -28712, 2265, 24289, -11026, -44493, -48376, -65977, -64003, -94334, -29543, -3401, 28812, 9963, 18421, 11998, 28501, 53255, 27575, 36227, 39811, 48926, -13931, 13471, 10569, -9707, -37794, -83238, -43255, 54240, 53798, 43550, 34022, 19878, 5953, -14268, -34451, -66929, -36731, 9583, 512, -63398, -17607, -1056, -32166, -63747, -120378, -97272, -31195, -39952, 8333, 67193, 85734]
12202H5734k174l7367j8982K5905l0072m3167K7421L7049N6148k9217q717k5950
12190C6611l891K4737J8018K4272j9679J1298j940o1547M5233J5500M8781K202
$$ y = [85734, 83560, 46193, 27211, 53116, 23044, -20123, 7298, 44347, 100495, 71278, 62561, 36611, 32720, 57457, 75475, 99747, 80068, 91366, 89426, 27879, 73112, 88612, 137393, 139595]
$$ [...]
##END NTUPLES=NMR SPECTRUM
##END=
