##TITLE=Analysis number 327356
Compound Code sb 01288
Book Reference 96652
Project Code adrs flro3
Chemist Name jom
##JCAMPDX= 6.0         $$ Bruker NMR JCAMP-DX V2.0
##DATA TYPE= NMR SPECTRUM
##DATA CLASS= NTUPLES
##ORIGIN= Bruker BioSpin GmbH
##OWNER= nmr
$$ XWIN-NMR		Version 3.5
$$ Thu Mar 22 12:16:25 2007 GMT Standard Time (UT+0h)  MAYBRIDGE\nmr@NMR_250MHZ
##.OBSERVE FREQUENCY= 250.131544655141
##.OBSERVE NUCLEUS= ^1H
##.ACQUISITION MODE= SIMULTANEOUS (DQD)
##.ACQUISITION SCHEME= undefined
##.AVERAGES= 16
##.DIGITISER RES= 18
##SPECTROMETER/DATA SYSTEM= dpx250
##.PULSE SEQUENCE= zg30
##.SOLVENT NAME= DMSO
##.SHIFT REFERENCE= (INTERNAL, DMSO, 0, 16.522)
##AUDIT TRAIL= $$ (NUMBER, WHEN, WHO, WHERE, WHAT)
$$ ##TITLE= Audit trail, XWIN-NMR		Version 3.5
$$ ##JCAMPDX= 5.01
$$ ##ORIGIN= Bruker BioSpin GmbH
$$ ##OWNER= nmr
$$ C:\u/data/dgb/nmr/ADRS/1640/pdata/1/auditp.txt
$$ ##AUDIT TRAIL=  $$ (NUMBER, WHEN, WHO, WHERE, WHAT)
(   1,<2007-03-22 12:16:04.86 +000>,<MAYBRIDGE\nmr>,<NMR_250MHZ>,
      <created by zg, POWCHK disabled, PULCHK disabled
       configuration hash MD5:
       49 4B E0 1D 92 C2 6B 37 9F E6 65 BC 52 41 86 1D
       data hash MD5: 64K
       BA C7 83 A9 32 FD 2B 33 99 ED 0C B3 FF 82 00 74>)
(   2,<2007-03-22 12:16:16.30 +000>,<MAYBRIDGE\nmr>,<NMR_250MHZ>,
      <Start of raw data processing
       ef LB = 0.3 FT_mod = 6 PKNL = 1 SI = 32K 
       data hash MD5: 32K
       19 9F BF 2F 80 10 09 59 A2 C4 7F D6 CE 35 BC 9F>)
(   3,<2007-03-22 12:16:17.96 +000>,<MAYBRIDGE\nmr>,<NMR_250MHZ>,
      <apk 
       data hash MD5: 32K
       63 F9 2A BC BE 56 CA A9 42 32 C2 3E 85 FC 25 30>)
(   4,<2007-03-22 12:16:18.71 +000>,<MAYBRIDGE\nmr>,<NMR_250MHZ>,
      <abs ABSG = 5 
       data hash MD5: 32K
       21 86 18 27 33 84 72 EE 26 55 BC 1F 9E E1 76 8A>)
$$ ##END=
$$ 
$$ hash MD5
$$ 73 ED 6D B1 0F 6B E3 54 6F B7 71 C2 03 A9 CB 7A
##$RELAX= 
##$RELAX= 
##$RELAX= 
##$RELAX= 
##$RELAX= 
##$RELAX= 
##$RELAX= 
$$ Bruker specific parameters
$$ --------------------------
##$DU= <C:\u>
##$EXPNO= 1640
##$NAME= <ADRS>
##$PROCNO= 1
##$TYPE= <nmr>
##$USER= <dgb>
##$AMP= (0..31)
100 100 100 100 100 100 100 100 100 100 100 100 100 100 100 100 100 100 
100 100 100 100 100 100 100 100 100 100 100 100 100 100 
##$AQSEQ= 0
##$AQ_mod= 3
##$AUNM= <au_zg>
##$AUTOPOS= <23 >
##$BF1= 250.13
##$BF2= 250.13
##$BF3= 250.13
##$BF4= 250.13
##$BF5= 500.13
##$BF6= 500.13
##$BF7= 500.13
##$BF8= 500.13
##$BYTORDA= 1
##$CFDGTYP= 0
##$CFRGTYP= 5
##$CHEMSTR= <none>
##$CNST= (0..31)
1 1 145 1 1 1 1 1 1 1 1 1 1 1 1 1 1 1 1 1 1 1 1 1 1 1 1 1 1 1 1 1 
##$CPDPRG= <>
##$CPDPRG1= <>
##$CPDPRG2= <>
##$CPDPRG3= <>
##$CPDPRG4= <mlev>
##$CPDPRG5= <mlev>
##$CPDPRG6= <mlev>
##$CPDPRG7= <mlev>
##$CPDPRG8= <mlev>
##$CPDPRGB= <>
##$CPDPRGT= <>
##$D= (0..31)
0 1 0 0 0 0 0 0 0 0.06 0 0 0 0 0 0 0.0002 0 0 0 0 0 0 0 0 0 0 0 0 0 0 
0 
##$DATE= 1174565763
##$DBL= (0..7)
120 120 120 120 120 120 120 120 
##$DBP= (0..7)
150 150 150 150 150 150 150 150 
##$DBP07= 0
##$DBPNAM0= <>
##$DBPNAM1= <>
$$ [...]
##$SUBNAM7= <"">
##$SUBNAM8= <"">
##$SUBNAM9= <"">
##$SW= 20.6930455092707
##$SWIBOX= (0..15)
0 0 3 0 0 0 0 0 0 0 0 0 0 0 0 0 
##$SW_h= 5175.983436853
##$TD= 65536
##$TD0= 1
##$TE= 683.16
##$TE2= 300
##$TE3= 300
##$TEG= 300
##$TL= (0..7)
0 120 120 120 120 120 120 120 
##$TP= (0..7)
150 150 150 150 150 150 150 150 
##$TP07= 0
##$TPNAME0= <>
##$TPNAME1= <>
##$TPNAME2= <>
##$TPNAME3= <>
##$TPNAME4= <>
##$TPNAME5= <>
##$TPNAME6= <>
##$TPNAME7= <>
##$TPOAL= (0..7)
0.5 0.5 0.5 0.5 0.5 0.5 0.5 0.5 
##$TPOFFS= (0..7)
0 0 0 0 0 0 0 0 
##$TUNHIN= 0
##$TUNHOUT= 0
##$TUNXOUT= 0
##$USERA1= <user>
##$USERA2= <user>
##$USERA3= <user>
##$USERA4= <user>
##$USERA5= <user>
##$V9= 5
##$VALIST= <valist>
##$VCLIST= <CCCCCCCCCCCCCCC>
##$VD= 0
##$VDLIST= <DDDDDDDDDDDDDDD>
##$VPLIST= <PPPPPPPPPPPPPPP>
##$VTLIST= <TTTTTTTTTTTTTTT>
##$WBST= 1024
##$WBSW= 4
##$XGAIN= (0..3)
0 0 0 0 
##$XL= 0
##$YL= 0
##$YMAX_a= 233255
##$YMIN_a= -233124
##$ZGOPTNS= <>
##$ZL1= 120
##$ZL2= 120
##$ZL3= 120
##$ZL4= 120
##$ABSF1= 16.522
##$ABSF2= -4.171173
##$ABSG= 5
##$ABSL= 3
##$ALPHA= 0
##$AQORDER= 0
##$ASSFAC= 0
##$ASSFACI= 0
##$ASSFACX= 0
##$ASSWID= 0
##$AUNMP= <proc_1d>
##$AZFE= 0.1
##$AZFW= 0.1
##$BCFW= 0
##$BC_mod= 0
##$BYTORDP= 0
##$COROFFS= 0
##$CY= 12.5
##$DATMOD= 1
##$DC= 0
##$DFILT= <>
##$DTYPP= 0
##$F1P= 14.0000005364418
##$F2P= -0.99999901652339
##$FCOR= 0.5
##$FTSIZE= 32768
##$FT_mod= 6
##$GAMMA= 0
##$GB= 0
##$INTBC= 1
##$INTSCL= 1
##$ISEN= 128
##$LB= 0.3
##$LEV0= 0
##$LPBIN= 0
##$MAXI= 10000
##$MC2= 0
##$MEAN= 0
##$ME_mod= 0
##$MI= 0
##$NCOEF= 0
##$NC_proc= -5
##$NLEV= 6
##$NOISF1= 0
##$NOISF2= 0
##$NSP= 0
##$NTH_PI= 0
##$NZP= 0
##$OFFSET= 16.522
##$PC= 1
##$PHC0= 226.2181
##$PHC1= 5.382984
##$PH_mod= 1
##$PKNL= yes
##$PPARMOD= 0
##$PSCAL= 4
##$PSIGN= 0
##$REVERSE= no
##$SF= 250.13
##$SI= 32768
##$SIGF1= 0
##$SIGF2= 0
##$SINO= 400
##$SIOLD= 32768
##$SREGLST= <1H.DMSO>
##$SSB= 0
##$STSI= 32768
##$STSR= 0
##$SW_p= 5175.98343685301
##$SYMM= 0
##$S_DEV= 0
##$TDeff= 65536
##$TDoff= 0
##$TI= <Analysis number 999999
Compound Code 99
Book Reference 9
Project Code 9>
##$TILT= no
##$TM1= 0
##$TM2= 0
##$TOPLEV= 0
##$USERP1= <user>
##$USERP2= <user>
##$USERP3= <user>
##$USERP4= <user>
##$USERP5= <user>
##$WDW= 1
##$XDIM= 32768
##$YMAX_p= 443314988
##$YMIN_p= -700028
$$ End of Bruker specific parameters
$$ ---------------------------------
##NTUPLES= NMR SPECTRUM
##VAR_NAME=  FREQUENCY,     SPECTRUM/REAL,   SPECTRUM/IMAG
##SYMBOL=    X,             R,               I
##VAR_TYPE=  INDEPENDENT,   DEPENDENT,       DEPENDENT
##VAR_FORM=  AFFN,          ASDF,            ASDF
##VAR_DIM=   32768,         32768,           32768
##UNITS=     HZ,            ARBITRARY UNITS, ARBITRARY UNITS
##FACTOR=    0.157963299565203, 1,           1
##FIRST=     4132.6476996994, 0,             0
##LAST=      -1043.33573715361, 0,           0
##MIN=       -1043.33573715361, -700028,     0
##MAX=       4132.6476996994, 443314988,     0
$$ Real data points
##PAGE= N=1
##DATA TABLE= (X++(R..R)), XYDATA
$$ [...]
15225e0313O9917j20286q4039k56972j15216J02899J95790J78112n643k3340M9651
15214e9440J240p5322j13010J9146m2046k8357J50542J96150Q5551q5563q3222
15203c4331m2581R34j4596j30726Q8133K69204p9568l0213L0383m9720k10495
15192b03576m8583K0446J03364J32278J0643k5853o224J32017J01619r6387J35186
15181B54930R3595j73652k82444l976O793O6119m9777K3440K2615n3807O6760
15170b9404o2277J31308J12143L5159o6107J02857J11249m2617l0688l4950j65880
15159F0793m8941L9404l6650j3192J15142J9328j95459n5939J88347R5183k06063
15148c8047l9965k3057n8049L7099P6199k41710P628J03371J38266r013n05P5366
$$ y = [-50313, 19604, -100682, -184721, -441693, -556909, -454010, -258220, -80108, -85751, -109091, -59440, -58200, -133522, -246532, -227386, -269432, -297789, -147247, 48903, 134454, 48891, -34331, -76912, -75978, -90574, -221300, -133167, 136037, 56469, 26256, 56639, 6919, -203576, -252159, -231713, -128349, 3929, 14572, -11281, -17505, 114512, 216131, 119744, 254930, 348525, 174873, -107571, -111547, -104754, -38635, -88412, -64972, -42357, -96164, -29404, -91681, 39627, 151770, 186929, 120822, 223679, 334928, 292311, 261623, 226673, 60793, 11852, 51256, 14606, 1414, 116556, 135884, -59575, -115514, 72833, 168016, -38047, -78012, -101069, -159118, -122019, -45820, -287530, -279902, -176531, -38265, -47278, -47783, 27583]
15136B7583p3071P7927J50242K2595O024n272j06585J3115p1960k9699K7953r0852
15124e2000J62J81977J09888j17572j48571K1611o5212j4995J36847j504n7815
15113g184j07514J3385J09340R8248p6654j4703p6054q4046j02793O7803P0268
15102a09904J5869k9164N2604M4698j19224k38709L1119p2942j5919k1439L6388
15091d26623J22642K69070J08633K6977L9723k75814q6088k9289R83m8987K23424
15080g5349J02749M5878J60077l9603j38390j39454P4958k9326L0007Q8562j10699
15069c0590p4618j01998Q8897O6290n558j67588P6632R0723k0914o6569R6376
15058d8917Q9844L2487l0078m0944L4553J5062N488p3829n6327R2354k0820K8488
$$ y = [27583, -45488, 32439, 182681, 205276, 211300, 206028, 99443, 112558, 40598, 10899, 38852, -52000, -51838, 130139, 240027, 122455, -26116, -4505, -69717, -84712, 52135, 50631, -7184, -114698, -101313, 8027, 106275, 29621, 14918, -61136, -145182, -247975, -180172, -109904, -94035, -123199, -70595, -25897, -145121, -383830, -352711, -425653, -441572, -463011, -426623, -303981, -34911, 73722, 100699, 140422, -135392, -221480, -250769, -249786, -298773, -75349, 27400, 73278, 233355, 193752, 55362, -84092, -9134, -38460, -8453, 80109, -30590, -105208, -207206, -118309, -52019, -57577, -225165, -148533, -57810, -78724, -145293, -48917, 40927, 73414, 43336, 2392, 36945, 52007, 57495, -16334, -72661, 19693, -1127, 27361]
15046B7361n2405k03277O3697l0365j13897J28100J51745J5892j65835j64991
15036c43975J9566L05131k6878O27n7392k7520J95055O4506j69043p0298m3712
15025a53933r9367O329L2324M9115O187K29706j9474j65691k6472j3906J01713
15014e3469p3897N7109J79275N365N3847J3053p9566l444r2320q1581M2292J3500
15002a9836j4152k3081m5810P5997K72558J36942J6503j02553j81670p3726o7052
14991b5880J13481N295R434p9465l7865J57657k01437N098J08663j68349j30816
14980b44184n7909R449J18095J0528J77909l5454p1679J9538k3763J46665k8421
14969B0774j40520l0255J54237J67016k2063j68044n7227J4737j44938M8331P4264
$$ y = [27361, -25044, -228321, -164624, -194989, -308886, -180786, -29041, -13149, -178984, -343975, -324409, -19278, -46156, -45529, -102921, -130441, 64614, 129120, -39923, -110221, -153933, -253300, -246971, -214647, -165532, -159345, 70361, 50887, -114804, -141276, -155182, -53469, -127366, -70257, 109018, 114383, 168230, 181283, 101717, 98273, 5953, -75628, -33336, -19836, -33988, -57069, -102879, -26882, 245676, 382618, 399121, 296568, 114898, 41172, -25880, 87601, 92896, 102330, 22865, -15000, 142657, -58780, -53682, 54981, -113368, -244184, -302093, -292644, -174549, -164021, 13888, -21566, -93245, -73707, -97470, 49195, 20774, -119746, -150001, 4236, 171252, 149189, -18855, -76082, -61345, -206283, -157952, -83688]
14958h3688p2583K60039Q0099m7805R5365k9178j8818j8049j47950k2700J5960
14947A0692o5721M9853M2327L8376q9545K3308J22893N8748n2790K2230K3139
14936A83510l5605L1778K0516j58986J0034L9969j98628J0036k6758q708M0980
14925i1862J40453J1137p6371p8339J32220J76867k12762m9678L1537l9800o4134
14914a20732k3067n4008O2275K8869l2738j45337m9333P1390L8677L6665l6035
14903b23374j04693J53129K78032p3908q3869l9405j9731N7520J8370j570q2601
14892a22100M408j25328L212J0143J20230p7999J43665N2564j3117p9899J53298
14881F9077J97101j17140j48983n2112n4872l5053p156J5753J06690j2211j12877
$$ y = [-83688, -156271, 103768, 183867, 136062, 231427, 202249, 183431, 165382, 17432, -5268, 10692, -55029, -5176, 37151, 75527, -14018, 9290, 132183, 190931, 138141, 160371, 183510, 147905, 179683, 200199, 41213, 51247, 91216, -107412, -97376, -124134, -132842, -91862, 48591, 59728, -16643, -94982, 37238, 214105, 1343, -48335, -16798, -56598, -120732, -143799, -197807, -135532, -106663, -139401, -284738, -334071, -262681, -224004, -187339, -223374, -328067, -174938, 103094, 29186, -54683, -94088, -113819, -56299, -37929, -39499, -122100, -117692, -243020, -239808, -229665, -109435, -187434, -43769, 8795, -4322, -84221, 69077, 266178, 149038, 55, -52057, -106929, -141982, -149138, -133385, -26695, -38906, -151783]
14870a51783l8953k2021L8109J0389J0706J54700O3387r3048j5891l714p2406
14859a20525k5712N7493J7067J35027J6373l1407N7410J32740j04062j04959P1311
14848A00756k5998j8796j11981j55939o1375M5093J78222J6000m4186j15120J5224
14837a78100J51677q3232n054R4951J0946j5943j61871J40732J93135j32785j25079
14826a10623n6777J5077J96127K844k307J34800J4098q019o9204n2188K5605j0202
14814G9231k8128j24674q7267M9479J54057k8894N8587j95027j54412J45255P9654
14803e2139K6062P3717k4968L1779Q842J20851L9617J04731k02861j93905L6060
14792c2214Q5179j58637j23189L1302J10892O6536Q3968J07594M0918J10458k13321
$$ y = [-151783, -190736, -212757, -174648, -164259, -153553, 1147, 64534, -28514, -44405, -48119, -120525, -146237, -88744, -71677, 63350, 79723, 48316, 105726, 238466, 134404, 29445, 100756, 74758, 55962, -56019, -211958, -273333, -228240, -50018, -34018, -78204, -193324, -178100, -26423, -109655, -114709, -19758, -8812, -24755, -186626, -45894, 147241, 14456, -110623, -167400, -152323, 43804, 46648, 44341, 179141, 193239, 185220, 116016, 63828, 89433, 79231, 51103, -73571, -160838, -111359, 42698, 13804, 72391, -122636, -277048, -131793, -52139, -26077, 47640, 22672, 54451, 63293, 184144, 223761, 328492, 125631, -68274, -32214, 52965, -105672, -228861, -197559, -86667, -20131, 63837, 171431, 212349, 322807, 109486]
14781A09486j06569j07844N8739O1236J6606J29110M6296j20645j11707K7231
14771A939m7426q9379l7805o7647L9578K40023J16023K22244k4331k50196k20371
14760a17348p6768J2152K546M8131N7262J2409J07875R7981j35981p2381p9889
14749a44011p7338K0472M6478p7655K54005J88734k8896L5300k4330J15413k0191
14738B87981o6201r4570j54694j42092n955O2400M5179k67m1542J6871m6008j17475
14726b56373K77464P9148j26687p3167n6737K0435J07714j09938j6609Q5308K0908
14715d8534r7480j44449J86978N4575r323j14863p4751P934o4086K872J17687
14704a83440j71613L7381J61105Q3035K50234J07813m1118m4170j7079J0673p3233
$$ y = [109486, 2917, -104927, -46188, 15048, 31654, 160764, 207060, 86415, -25292, 1939, -45487, -134866, -172671, -240318, -200740, 39283, 155306, 377550, 353219, 103023, -117348, -194116, -181964, -179418, -131287, -74025, -61616, 46259, 144240, 8259, -64122, -144011, -221349, -200877, -154399, -232054, 21951, 210685, 181789, 217089, 192759, 308172, 287981, 221780, 127210, -27484, -169576, -175531, -113131, -67952, -68219, -109761, -92890, -138898, -256373, 21091, 100239, -26448, -99615, -156352, -135917, -28203, -138141, -154750, -69442, -48534, -146014, -290463, -103485, -48910, -58233, -173096, -247847, -239913, -303999, -301127, -183440, -355053, -317672, -156567, -73532, 176702, 284515, 243397, 199227, 182148, 192821, 119588]
14693A19588k30444r3548L9510M9815q7454j0743J37610J15087j2991N200K7111
14682E8741j40578j21096R5274l7797k9522m2391m6093K35301R1284k937j2851
14671D7335o985j12165p7403J14840P6605J2147p8774o199K7602J71869J27242
14660B96114j76215j19749j54116P6800J5403p4705M8469j389l3067J78609r9444
14649d3290j11643o9770O7260J92531K83151m3470k64539r4112k272Q7696J15709
14638A17251k5874o7549o1942N7584l2586m6419N3158L3655q0207o0819m8161
14627a61909J42893J68992K693R8176j91099k66822o2673J73696j08855q2981
14617b87889p6737M7236J33663N0774j75736L7777P3556J22886J27227O0503j80065
$$ y = [119588, -110856, -204404, -164894, -115079, -202533, -213276, -75666, 39421, 26430, 31630, 58741, -81837, -202933, -107659, -145456, -174978, -217369, -263462, -28161, 63123, 60186, 47335, 40350, -71815, -149218, -34378, 42227, 54374, -24400, -30599, -2997, 168872, 296114, 119899, 150, -153966, -77166, -61763, -136468, -87999, -89388, -122455, 56154, -43290, -154933, -224703, -157443, 35088, 318239, 274769, 10230, -83882, -86154, 1542, 117251, 91377, 23828, -38114, 19470, -13116, -59535, -6377, 27278, -52929, -113748, -161909, -19016, 149976, 152669, 250845, 59746, -207076, -269749, -96053, -204908, -287889, -364626, -317390, -183727, -132953, -308689, -270912, -197356, -74470, 52757, 113260, -66805]
14606f6805j76075l1261J27524K10220L1270J28931k3635j45681j60399q9923
14596a95834k735J65513R1356M6148J13088L8028L355l4443r8746J55518m6491
14585B34757k23789r1915p1126M387J40570O359j0223P1480o9261o3701o1469
14574a33931M2808K3152o5774k24702j31953Q765J17244N5248R9519M3794m7888
14563b13718P1458O6101k6478j36544q2690J42011R4184p7762n0614J44784J88789
14552A19521p8729n2660k0800l7820m1038O8985k0391L5241k1114n1669J62432
14541F1958N8990J66745J21273N8409l111j18319k38021m1855Q3232j73223n491
14530b9413O2905L8994j41804l3636k6591Q8552O5000j57149l4479M8075M0289
$$ y = [-66805, -242880, -274141, -146617, 63603, 94873, 223804, 200169, 54488, -105911, -195834, -198569, -33056, 58300, 104448, 217536, 255564, 258919, 224476, 125730, 281248, 234757, 10968, -80947, -152073, -147686, -7116, -757, -10980, 60500, -8761, -72462, -133931, -91123, -67971, -133745, -358447, -490400, -481635, -364391, -309143, -209624, -165830, -213718, -142260, -76159, -102637, -239181, -321871, -179860, -85676, -163438, -214052, -69268, 119521, 40792, -11868, -32668, -70488, -111526, -42541, -62932, -27691, -48805, -100474, 61958, 120948, 287693, 408966, 467375, 464264, 345945, 107924, 66069, 149301, -23922, -29413, 33492, 72486, -69318, -102954, -129545, -40993, 24007, -133142, -167621, -119546, -79257]
14519g9257O5180O7580p5243j2827R9805n490k61988p2005K69950J8611n2658
14508c8342J47239J44879j42060j17755j6615o6102P7598K418J75086o071p0934
14497H9341L7167k2120j10129O8953q456k23680j812j0901r0430J36992J00678
14486c4397n1438Q8849j95122P305L2663p8338j6137r087P4977N5474M4187J45087
14474F4023q0768k28251q2919J36091J33906j07819o1350k6180L4409j3864q0992
14463c13714j25990P7186K272L5195L2278l8239j4195L00392Q8728k47262j47269
14452c50618L8436R7427L6425J30246l0346O4980J26024j00958j75483J33261
14442c0606K6596J18078r311n8763n8615K01564Q3905j17978j34284O8707j4985
$$ y = [-79257, -14077, 53503, -21740, -34567, 65238, 59748, -202240, -274245, -4295, 14316, -38342, 108897, 253776, 111716, -6039, -22654, -88756, -11158, -8740, 166346, 160275, 89341, 126508, 104388, -5741, 63212, 54756, -168924, -170736, -181637, -272067, -135075, -34397, -85835, 3014, -192108, -184803, -152140, -230478, -246615, -255702, -180725, -125251, -81064, 64023, -16745, -244996, -327915, -191824, -57918, -165737, -227087, -253267, -218858, -232722, -313714, -439704, -362518, -360246, -325051, -292773, -331012, -345207, -44815, 43913, -203349, -350618, -312182, -214755, -178330, -48084, -78430, -13450, 112574, 11616, -163867, -30606, -4010, 114068, 104757, 45994, -12621, 188943, 272848, 154870, 20586, 89293, 74308]
14431G4308J2568J3025j53363j4940J64584k4716j94654j34488J4924J1740J47871
14420h3141R1971j10205j47210N7101P3255j4261l5844O8042m1590O8637J06260
14409C3015J86135p2772J04815N4906k29584j03657q6428K7196Q688J3331L3073
14398c1282k3686L0385P5332N3879L331j94796j37586r0529J59873M6122J77772
14387F8815L0135R0196J16746n0804k53591j83636J8614M1787O072j32051j8400
14376b66117j1638J4014M5977J37963L9606N0164r2301j02893N0591q0910j03461
14365c19005J82499O6007J32221m0176p9566J48920O7245m930k6608r3622q0508
14354d7523p4111J18450P2682k4723J1630l3396M6155k6434p9222j31856O2824
$$ y = [74308, 86876, 99901, -53462, -68402, 96182, 71466, -123188, -257676, -242752, -231012, -83141, 8830, -101375, -248585, -191484, -118229, -132490, -168334, -100292, -141882, -73245, 33015, 219150, 146378, 251193, 306099, 76515, -27142, -113570, -86374, -77686, -64355, -31282, -54968, -24583, 50749, 104628, 107959, -86837, -224423, -314952, -155079, -108957, 68815, 98950, 189146, 305892, 255088, 1497, -182139, -163525, -121738, -115666, -247717, -266117, -277755, -263741, -217764, -79801, -40195, 9969, -82332, -185225, -134634, -215544, -319005, -136506, -70499, 61722, 21546, -58020, 90900, 158145, 153215, 126607, 32985, -47523, -121634, -3184, 69498, 44775, 56405, 23009, 69164, 42730, -36492, -168348, -105524]
14343a05524N9866Q8555J5224l0205k0909L5712j58131M1190N4300n0387K6863
14332d3446M2915o8709m6087p7334R8515j56852m5235N6042N8453K8040J55139
14321A441J83935J33580J46383j23653k64454M0809k6910q7746M8876J52917k4007
14310A81171k52848K6299N372L0735k218p5110k939j4902K0224R4124O4577n4506
14298A9979j12079J854J65326P5192k9510o7965j07258j61706l5132J26299k6279
14287a51279l7219J19202J53648q7568J7359R7398j473J70579R5450n7284p7952
14276B40861k9584Q1720J957j43229J3686k2397r7771j02893j76570j02915L7155
14265b99980Q222J71912K72873N8715k41906j68013m6320R4723R5757k3804J2877
$$ y = [-105524, -45658, 42897, 58121, 27916, 7007, 42719, -115412, -74222, -19922, -70309, -43446, -531, -69240, -115327, -192661, -94146, -250998, -296233, -240191, -181738, -153698, 1441, 185376, 318956, 465339, 341686, 77232, 118041, 91131, 3385, 52261, 205178, 181171, -71677, -45378, -40006, -9271, -11489, -86599, -89538, -104440, -84216, 9908, 74485, 19979, -92100, -90246, 75080, 150272, 120762, 52797, -54461, -216167, -251299, -125000, -151279, -188498, -69296, 84352, -3216, 14143, 111541, 110068, 280647, 376097, 318813, 240861, 211277, 292997, 294954, 151725, 165411, 143014, 45243, -57650, -234220, -337135, -299980, -291758, -119846, 153027, 211742, -30164, -198177, -244497, -149774, -54017, -77821, -64944]
14254f4944o0876j33337j81071m2096J94417J53846J00479j42736n7817N9425
14244a74710J89342J2939o7046o2965o8279N6880K99002K6649k48530J15913m8495
14233C0700k0549j39873j32536k9644J15868J18301k2853j26219L5158j2944j40671
14222c25262M3438K25526K2186r8345O7571J03002K54719k6430q6533j67551l946
14211H375J79764k737J12812O2620m8421j853J6629j38545j56214O4702k326j32712
14199c7906j31631O9274j75795L5693Q7836j00251j07698Q178R6689J02361Q6488
14188f6762j46068j33450N1623R3924K09206K4386k42627r1840L1246R9592k52739
14177d23509n6372J6686J99864J47817Q6476r1686K4291J44634p9008L2903O9446
$$ y = [-64944, -125820, -259157, -440228, -482324, -287907, -134061, -33582, -176318, -234135, -174710, 14632, 27571, -39475, -102440, -170719, -113839, 185163, 211812, -36718, 79195, 30700, 10151, -129722, -262258, -291902, -176034, -57733, -80586, -206805, -171647, -184591, -325262, -281824, -56298, -34112, -132457, -64886, 38116, 292835, 266405, 179872, 12321, 8375, 188139, 185402, 298214, 360834, 312413, 310560, 327189, 188644, 32430, 97132, 94806, -37906, -169537, -100263, -276058, -240365, -152529, -252780, -360478, -352300, -255611, -153250, -66762, -212830, -346280, -294657, -200733, 8473, 32859, -209768, -301608, -270362, -170770, -423509, -479881, -463195, -263331, -115514, -29038, -120724, -96433, 48201, -30807, 2096, 71542]
14166G1542l1626J36489j00704J7357l5271J17903K230j25431L745N3168j17443
14155h041j26955j89470P5683K29817J9695o6549n5847q6783r9404j4612M6344
14144b76122K19461K04809j18091j18983n574o9913J9107j6465N2812N2432P7552
14133B1025j87332l7922J45989J00083n0665L6129Q2732O5112m8621j0624o0470
14122E5436p2285q7188Q9847J24508l8956j44360r1635N4104Q2286p8836l226
14111a10305L8483q7628J71191R2160j97403j51910k9324J50235k1003p383M5382
14100a07505q100o7290m5566K09515J52399J6653L7121j38877K8449j1605J8248
14089H3442J31329j32320o067L4023P0918n3104q0329R429p6486L915k6160p3588
$$ y = [71542, 39916, 176405, 75701, 93058, 57787, 175690, 177920, 52489, 56234, 109402, -8041, -134996, -324466, -248783, -18966, 729, -65820, -121667, -208450, -307854, -322466, -276122, -56661, 148148, 30057, -88926, -94500, -164413, -145306, -161771, -108959, -56527, 21025, -166307, -204229, -58240, 41843, -8822, 27307, 110039, 175151, 126530, 115906, 55436, -16849, -104037, -14190, 110318, 71362, -72998, -164633, -110529, -28243, -107079, -110305, -71822, -159450, 11741, 103901, -93502, -245412, -274736, -124501, -145504, -152887, -107505, -115605, -182895, -228461, -18946, 133453, 150106, 187227, 48350, 76799, 65194, 83442, 214771, 82451, 76384, 110407, 181325, 128221, 47892, 57321, -19165, -15250, -41410, -114998]
14077a14998j00866j76784J09072J77705l4072N1038K26495J9327j49223m2616
14067c4922L5446k7630j39552j51979J36124J47427j61153j46511N7697M3401
14057b41652N6763J83473J5963M5954l4739M0715K0622N7528j95951j93828k5824
14046b70976K19987K22162J8399M6197n7353j23299l4820Q3300Q2710j9575M9389
14035B16121j18571j03621m1746j14011J11113L5748j47847k7876N981o4137O1078
14024a87768J65176K7554O1592K9419N2619R4551K8707r5442r3595o4808j15182
14013i7177j73303P6647J18069j9122J1503K2619m2888J6848N7152j09899J12302
14002b7249K2050j57840M3480J60972J09249Q3870j7001k35014q7582l351k0120
$$ y = [-114998, -215864, -392648, -283576, -105871, -139943, -88905, 137590, 156917, 7694, -34922, 524, -27106, -166658, -318637, -182513, -35086, -196239, -342750, -285053, -241652, -184889, -1416, 14547, 60501, 25762, 66477, 87099, 144627, -51324, -245152, -270976, -50989, 171173, 189572, 235769, 178416, 55117, 20297, 103597, 186307, 166732, 216121, 97550, -6071, -47817, -161828, -50715, -14967, -162814, -190690, -184709, -248846, -187768, -22592, 4962, 66554, 95973, 148592, 243143, 271850, 176408, 82813, 18005, -97177, -270480, -193833, -75764, -94886, -83383, -60764, -103652, -86804, -29652, -139551, -27249, -5199, -163039, -119559, 41413, 150662, 234532, 217531, -17483, -105065, -108416, -128536]
13991a28536J9135J09216l3834k8124J19715L9608O9100j02996k1990N9299j62281
13980f1688k9382j5509r2272R0521R3800j22186m4839q8922j65323M6037M3175
13969c46588K4469j13674K2422J31187J96588R1838R3623r2837L9892L0288J6661
13958I3869n5837j6184K09976j5815j54963l3783L5984j74310r540M6416n6673
13947a30860M2572N9073J21241j12035j06901j9044O1929J37464O6300Q3139M7229
13936B50107j6078j67469k25754M4491J78866p048j16141o5556P5148k8031J21398
13925D3933J86664P6373r0144K7823J11512k04062p6269m8306j74760J30790J02461
13914H6015J26046J22878m9188k3387l4755j12098j22592j4211M006j72915K2501
$$ y = [-128536, -109401, -185, -34019, -62143, 57572, 97180, 166280, 63284, 41294, 100593, -61688, -91070, -106579, -198851, -108330, -14530, -136716, -181555, -270477, -435800, -389763, -346588, -322119, -435793, -413371, -282184, -85596, 6242, 99865, 7028, 46920, 77208, 93869, 38032, 21848, 231824, 216009, 61046, 27263, 63247, -111063, -120603, -74187, -130860, -88288, -29215, 92026, -20009, -126910, -145954, -84025, 53439, 119739, 202878, 250107, 234029, 66560, -159194, -114703, 64163, 57115, -59026, -124582, -49434, -77465, 43933, 230597, 306970, 216826, 244649, 356161, 152099, 75830, 27524, -147236, -16446, 86015, 212061, 334939, 285751, 262364, 227609, 115511, -7081, -21292, -17286, -190201, -167700]
13903a67700l5445m2231N0775l7024P1621j7939J71051K7623n5927k7035j8577
13892h0808K15271L6791j75836l8984j58843O8972k5155j79891q9545J21585J59586
13881a46857P6958r3320J0938j17285Q1227K80177M8014k00388k20077K1973K741
13870b55899J9527J56052J33115O1649j17230m4522K8494j16398l5006J83931
13860A3713P1380m5692J0744L5229j26289n4194J08670r4043r8400P4431N859
13849i8592j86579K42948J05041j62347O2023R4907k6508M3377J18340N8854j6834
13838B34630N4870J13758j4011j67640j36890N92P870N2645o1903K0731j00937
13827C715J4155p9444K3465N5902L7045j00720N8555J05395j30126K1350k3020
$$ y = [-167700, -203145, -245376, -194601, -231625, -160004, -177943, -6892, 20731, -35196, -62231, -80808, 134463, 171254, -4582, -43566, -202409, -133437, -158592, -338483, -428028, -306443, -146857, -69899, -163219, -152281, -269566, -188339, 91838, 139852, -60536, -280613, -258640, -255899, -236372, -80320, 52795, 114444, -2786, -47308, -18814, -135212, -170218, 13713, 85093, 39401, 50145, 85374, -40915, -95109, 13561, -80482, -178882, -104451, -98592, -285171, -42223, 62818, -99529, -37506, 57401, 30893, 74270, 192610, 251464, 234630, 289500, 403258, 389247, 221607, 84717, 85309, 93179, 145824, 83921, 104652, 3715, 17870, -61574, -38109, 17793, 54838, -45882, 12673, 118068, -12058, 9292, -13728]
13816a3728J78364q3887j34937q1625k6179J54340J47269J10767j86702k08428
13806a44746p8883J14865k6123L8458o6136j5794J45692N3248n7670K268J07178
13795G2357J09229p563j9752m7767j04512R8916R5948J74445k8445j71981o1915
13784A08960J4409P1540l717q0046p6990m9833m954n9234J3724j6255j77823P3950
13772a86269J78173Q5662R3740M1226M8570k20322j97258l5037J58036J58705
13762A25226J64692r0008j74304l4411J12102j1910k3064J5730j64100j10797
13752a90844J38793Q7340m3924k5125Q0700j46000p70P2661M8014M6048j5186
13741E1707j2926M3214K02461L5889j12485r7437J7358N0941j30462P132J19344
$$ y = [-13728, 164636, 80749, -54188, -135813, -161992, -7652, 139617, 250384, 63682, -144746, -223629, -108764, -134887, -96429, -162565, -178359, -32667, 20581, -37089, -34821, 72357, 181586, 174023, 154271, 106504, 1992, 100908, 196856, 371301, 342856, 170875, 108960, 123369, 194909, 191192, 111146, 34156, -15677, -20631, -79865, -66141, -82396, -260219, -186269, -8096, 77566, 171306, 212532, 261102, 40780, -156478, -191515, -33479, 125226, 289918, 199910, 25606, -8805, 103297, 91387, 68323, 84053, -80047, -190844, -52051, 35289, -8635, -33760, 46940, -99060, -99830, -27169, 20845, 66893, 51707, 38781, 81995, 284456, 320345, 207860, 110423, 127781, 178722, 48260, 55392, 174736]
13730A74736q0369R8556j1828p7810M7367l0203l4966J73480J0650j31082p7422
13719F1109O01Q982M5422l9856j56709l8347J31016L0309j08215P1042J98437
13708B03791J57417K0104J1119j43077j75332n3487q4806M1710J34456J09795
13698B21690r1941R3223L7969p964j41194m434O5639l0910j75290j1967J3972
13687c1207P4745J98105k07450o7739J33336J37291j7361q4611j29230j3856j6702
13676b4679j29577l0669Q6130l2003J3094n8654M9286K43307Q0244j53295j41545
13665i8361j8254L2911K1350k2467l6238R9509J19295k0647o0540j87183j11567
13654b82192J90413L908j15124L8910K03483m849j61695O1818M9473l2841r5474
$$ y = [174736, 94367, 192923, 181095, 103285, 150652, 120449, 85483, 258963, 269613, 138531, 61109, 61710, 70692, 116114, 76258, -80451, -118798, 12218, 42527, -65688, 5354, 203791, 361208, 381312, 392431, 249354, 74022, 20535, -64271, -22561, 111895, 221690, 129749, 222972, 260941, 252977, 111783, 107349, 172988, 142078, -33212, -45179, -31207, 43538, 241643, 34193, -33546, 99790, 237081, 219720, 135109, 5879, -7977, -24679, -154256, -184925, -98795, -130798, -117704, -176358, -127072, 116235, 196479, 43184, -98361, -116615, -83704, -62354, -84821, -121059, -21550, 97745, 77098, 16558, -170625, -282192, -91779, -87871, -202995, -164085, 39398, 34549, -127146, -65328, -15855, -48696, -144170]
13643a44170q905R3935K02578Q057O5821K8999k73422k31793j15373J70264K23149
13632A9140L3130P9879J22302J03595j94172k73584L0763N6933J45814O2039l3359
13621A52480q5472o6881L5157j14835J54715J9155j06752M6834o1671k4236j23884
13610a75390j18967j41399P4314J73993m9228N6816L70216j13455k72573J23124
13600g2549o8335L091q9353j59844P5716K10258J50045K57480J29238j99967j68513
13589F7267K6232J62297J33685r2112j3472P7258O8345j21427p6043m4556j87133
13578C41n717K29570K8787N5719J08207q0342j14407k6519N4102K8105J39409
13567D17255o3440J564o9264r4157M2164L0970j7997J58013q2744l2779j81955
$$ y = [-144170, -153075, -59140, 143438, 151495, 217316, 246315, -27107, -258900, -374273, -204009, 19140, 52270, 132149, 254451, 358046, 163874, -109710, -78947, -22014, 123800, 185839, 152480, 67008, 127, 35284, -79551, 75164, 94319, -12433, 34401, -27270, -51506, -175390, -294357, -435756, -361442, -187449, -236677, -179861, 190355, 76900, -195673, -72549, -140884, -137793, -227146, -386990, -311274, -101016, 49029, 306509, 435747, 235780, 67267, 93499, 255796, 389481, 297369, 283897, 361155, 429500, 308073, 232030, 187474, 341, -5376, 224194, 252981, 308700, 416907, 336565, 222158, 195639, 249741, 277846, 417255, 353815, 355379, 286115, 191958, 234122, 265092, 247095, 405108, 322364, 289585, 107630]
13556A07630q5025K32559R3705j21101o5829q4388k1261p7825k9712M9481L6288
13545C4522j01508o0517l8282J87123K08505Q0039j5718k18168n8808M1412l9227
13534A9373Q6591K03697j7074q8760p1629j13457p0282J18338R1118j8o5208Q2820
13522A75509R122k5228r544o9300o3272p7035l1030j49023M4484K15210J15112
13511A35005J263q7983j73550l4175J81586k0929k45860j72244L8546R6922J93133
13500h8286K12912N3984m7447p7739J26449n1966L6933P0640l4932n1570n5810
13489I3168j08644k42653O4059K3842n3940J86690R1575J0666r1251L2042R2550
13478I8104p0301l1405o0918L8015K2671N9693k4674k62050m2762J72610N8393
$$ y = [107630, 22605, 255164, 348869, 227768, 161939, 77551, 56290, -21535, -51247, -1766, 34522, -66986, -127503, -165785, 21338, 229843, 309882, 294164, 75996, 17188, 58600, 19373, 105964, 309661, 292587, 203827, 132198, 18741, -51541, 66797, 157915, 157897, 92689, 175509, 184631, 159403, 149859, 80559, 17287, -59748, -90778, -239801, -195317, 19893, 135005, 136268, 48285, -125265, -159440, 22146, 1217, -244643, -416887, -378341, -281419, -88286, 124626, 178610, 131163, 53424, 179873, 127907, 164840, 235480, 200548, 148978, 93168, -15476, -258129, -194070, -170228, -224168, -37478, 54097, 64763, -26488, 5554, 98104, 27803, -3602, -64520, -26505, -3834, 55859, 31185, -230865, -273627, -101017, -42624]
13467d2624p5911R124o9807J4894J0627m2246J55522J33222m7423k29640n5670
13456b39932P5281J2324j7987j28099J11126P0697M8109j10996j59932O2023J73536
13445a03850J52426j525J600n2867l1827j584k200N1373j55991R225J10647J38760
13433A14187N6708j57190j74673m2422N6950q704M1491K24773Q1066L9081L0190
13422B61457k9309k23823n3454J5631L7512J50440n0916M5963j2151k13612m8903
13411a21165n2014m78J72049J01597n4187m0258P2677J36399l9103j05874q0405
13400a0762m1473J26395M8183k76538q2629p352N2775O6835J42686j2374O3388
13389F9134J04935n6372j12839j30093K4953j443q5248N4274J57299k0445k4611
$$ y = [-42624, -118535, -109411, -179218, -164324, -153697, -195943, -40421, 92801, 45378, -184262, -239932, -164651, -152327, -170314, -298413, -187287, -116590, -68481, -179477, -339409, -277386, -103850, 48576, 47051, 48651, -4216, -36043, -37627, -39827, 11546, -144445, -135220, -24573, 114187, 170895, 13705, -160968, -203390, -146440, -155144, -113653, 111120, 192186, 231267, 261457, 232148, 8325, -45129, -29498, 8014, 158454, 107538, 153501, 141350, -72262, -121165, -173179, -173657, -1608, 99989, 45802, 5544, 78221, 214620, 175517, 69643, -10762, -52235, 74160, 122343, -154195, -236824, -244176, -191401, -124566, 18120, 5746, 69134, 174069, 117697, 4858, -125235, -100282, -101725, -186973, -132699, 24600, 4155, -20456]
13378b0456L8791L1824K8968k01564m1317J52186K2883o8220M3264l8470j6247
13367f8358J74104J57998N6701l64626k0775m3092M7319J63143J23224J9723r8828
13356A46533o387p2351j06501R95K9990l7377L8851O5224n3606j30859n3741O2420
13344a16809n721l6332o3949M5624J40250O612o8757k21500l8072J76244K16578
13333C4168J49750Q8626o3430k97726j67608K08642L0324J42025J45380r4770
13323A75381r0305k33679J4770J52454J92042O5135j20248o3599j19556j45132
13313a72737o977L4523q5474N8262J59585p6716l9563J23142o461K61098J00596
13302C49278j60817j64808j6768O7935q5829j15266J44676Q7024m6187j8944P9611
$$ y = [-20456, 18335, 50159, 79127, -122437, -163754, -11568, 11315, -56905, -13641, -52111, -68358, 105746, 263744, 320445, -44181, -64956, -108048, -60729, 102414, 225638, 245361, 146533, 140146, 67795, -38706, -37711, -7721, -45098, -6247, 58977, 5371, -125488, -179229, -116809, -122530, -158862, -222811, -177187, -36937, -30325, -99082, -320582, -358654, -182410, 34168, 183918, 272544, 209114, -88612, -256220, -47578, -17254, 124771, 270151, 175381, 85076, -148603, -133833, 18621, 210663, 275798, 155550, 91951, -27605, -172737, -179714, -145191, -230665, -172403, -12818, -89534, -129097, -5955, -12416, 248682, 349278, 188461, 23653, 6885, 74820, -11009, -126275, 18401, 105425, 59238, 40294, 119905]
13291A19905P4069m9121m9312Q5602m6624n4157m2402o2166P6952K8871j49689
13280f8072P9163J74621m3002r0691Q6070J13566j01504o8351j28280J04246K40946
13269B98712j9083j21421P8262O4606j73335k1762J43231O5334J3379o5660o8604
13258A93659n8150j03924k4791r4317m5688K7472p93o196P0363O9418m8184j46892
13246a68023j17935J6612K14268J00690J05400J3590o227j69841J908j35056J6720
13235a27894J13228q8636R6714n3537o8535J89465O9496j7367q4454O0479J05520
13224A94479O3574q9577j73394J71043L4063r036L782j93865k36796K1839M9092
13213a64796K08286R560j57572Q798q4837M8510J55459J23037q4741m0792N5142
$$ y = [119905, 193974, 144853, 95541, 181143, 134519, 80362, 37960, -24206, 52746, 81617, -68072, 11091, 185712, 142710, 52019, 138089, 251655, 150151, 81800, -46480, 57766, 298712, 279629, 158208, 236470, 301076, 127741, 105979, 249210, 314544, 327923, 262263, 193659, 135509, 31585, 6794, -87523, -133211, -105739, -106532, -112728, -42365, 27053, -21131, -168023, -285958, -269346, -55078, 45612, 151012, 164602, 158375, -11466, -9558, -144614, -127894, -14666, -103302, -6588, -60125, -128660, 60805, 130301, 112934, 28480, 88959, 194479, 258053, 168476, -4918, 166125, 200188, 191152, 194934, 1069, -235727, -213888, -164796, 43490, 53050, -104522, -95724, -180561, -132051, 23408, 146445, 61704, 20912, 76054]
13202G6054R6099N222o1017o9371k32289k5260J23398m3895J43382p0584l4908
13191i3169j0617p9411P4150J32130m9310N8437J18896q7638o3239M3113J28968
13180A72310Q9972J4009j99454n7612j49660j03873N0367R4391N4535m3659q1418
13169a60092J6621J22213J60923j7265r8004m7150Q8868o5839p5679J73225Q7999
13158A85820l6819J2307r2130Q6531J431q3982Q768J5762L9177N2540q4019l281
13146A02105q623r7122q6071J51037J64491J03266J8573j20827j13671J7415P3170
13135B03743N7355J40552j31467r1342n0421r6187j67071J62942Q2666j2584o4774
13124C3412m3822k6825Q1666L9517j71987M026Q9520L2200j7306R0326O982j2568
$$ y = [76054, 172153, 177375, 116358, 46987, -185302, -210562, -87164, -131059, 12323, -58261, -93169, -103786, -183197, -109047, 23083, -26227, 32210, 151106, 63468, 229, 43342, 172310, 262282, 276291, 76837, 19225, -130435, -234308, -183941, -89550, -35015, -78674, -160092, -143471, -21258, 139665, 122400, 24396, -22754, 66114, 275, -75404, 97821, 185820, 149001, 161308, 69178, 155709, 157140, 73158, 81926, 97688, 136865, 189405, 105386, 102105, 93482, -3640, -89711, 61326, 225817, 329083, 347656, 226829, 113158, 130573, 203743, 261098, 401650, 270183, 178841, 128420, 32233, -134838, 28104, 110770, 98186, 33412, -10410, -37235, 44431, 83948, -88039, -84013, 5507, 37707, 20401, 110727, 117709, 105141]
13112A05141j6179P2508J14059j74996j2304J0666o6112K6024N1196J43479m7486
13101B05996j30848j71418J1033J21495j2382K1483O0182J6932j09645k79413
13091b66585M3876J65991o9516l6593m9224K22241J19247k89546j43062J15980
13081a87191N2508P7297j9904M3220P7337L2854Q9707K6576q4444q4061j01418
13070g7519j00618O7289r3572L3437J44155L5815k71572j81503J45617K04096
13060i4375O5890N6946O1729j26302Q293J61254N6388p7536j6246J18654j67263
13049D7432J0613n4748j04543J02703j8274J5370j4227P0697l1007p147R3433
13038A10302j37559p5781N7301M1843r5650O632J17880L4476K968R1147j66531
$$ y = [105141, 88962, 161470, 275529, 100533, 88229, 98895, 32783, 58807, 110003, 253482, 205996, 75148, -96270, -85237, 36258, 23876, 45359, 105541, 122473, 12828, -266585, -222709, -56718, -126234, -162827, -212051, 10190, 129437, -160109, -303171, -187191, -134683, -57386, -77290, -34070, 43267, 76121, 165828, 192404, 107960, 23899, -77519, -178137, -110848, -204420, -170983, -26828, 8987, -262585, -444088, -298471, -94375, -28485, 28461, 90190, -36112, -27819, 133435, 189823, 112287, 96041, 214695, 47432, 58045, 3297, -101246, 1457, -16817, -1447, -15674, 55023, 24016, 16869, 110302, -27257, -103038, -45737, -3894, -99544, -92912, 24968, 59444, 62412, 153559, -12972]
13027a2972J29634J32862l4104p1750M7145J2907J89708J720j10230n1041j05659
13016A28220n4005P0549J086p0116R1948L38k33640l0472J77805n8305k2876K1549
13004B2081q495K499j40569j08193Q3658R8536J71786k4205o9775P9325M6932
12993A53580r200j83285P8029K57059r0367k34062J05196J55226J03207J07233
12983D42616l82637k01332Q5498j0763p9797P8290m8228j881O7845N5532K9166
12972C4309n1939M8661J27783P0412N59j99259j7011M9835k3128M0521R847K6110
12960A16700j19512o8122r4848L4970j6733O1556l0502R0948p0837m3920l084
12949a43384Q9720K38943k2666J24073p0415j86456o6235K14758l7795r1268K4458
$$ y = [-12972, 116662, 249524, 215420, 143670, 190815, 203722, 393430, 395150, 284920, 233879, 128220, 74215, 144764, 145850, 75734, 167682, 168020, -65620, -96092, 81713, 23408, 532, 22081, 13586, 16085, -124484, -232677, -149019, -50483, 121303, 97098, 27323, 106648, 153580, 144380, -38905, 39124, 296183, 205816, -28246, 76950, 232176, 335383, 442616, 59979, -141353, -55855, -66618, -146415, -68125, -116353, -118234, -50389, 5143, 34309, -17630, 31031, 158814, 229226, 229785, 30526, 13515, 63350, 40222, 80743, 90590, 116700, -2812, -70934, -165782, -130812, -147545, -85989, -116491, -25543, -96380, -140300, -143384, -53664, 185279, 162613, 286686, 216271, 29815, -36420, 178338, 140543, 49275, 73733]
12938G3733R0328j58585m3277p0918o4875j7821J03603J07844P302J01539j06439
12927B2434k22099N2347j2417J3808M0345m4558o2351j7655K5251m168n3646R3673
12915a69036R9506J95073K15172l0629j58830l8330j55659j12111M6909K11158
12905A03223k2316Q3873n045q0221K801M5780L4355J9560o3249j33094j41255
12894a55588J88292J54268J4232j28079M8026M2359k08608j48178O1424j5381
12884a47233N582J41891n1701q01J23809l5821M729o6524J91794O103L9503q1012
12872A30319q6822n0656J4022J8058L2216o293P4206P63j27622K37922K00656
12861D36769j36295k24831m2072n9892P5123j27642n7777K46396J07677O7640
$$ y = [73733, 164061, 5476, -37801, -108719, -173594, -191415, -87812, 20032, 27334, 128873, 22434, -199665, -147318, -159735, -145927, -105582, -150140, -212491, -230146, -204895, -209063, -262709, -169036, -69530, 125543, 340715, 310086, 151256, 112926, -42733, -154844, -107935, 103223, 80907, 164780, 159735, 79514, 82315, 128095, 162450, 182010, 118761, -14333, -155588, 32704, 186972, 201204, 73125, 121151, 163510, -45098, -193276, -131852, -147233, -141651, 240, -51461, -52262, 71547, 35726, 40455, -26069, 165725, 171828, 211331, 130319, 43497, -7159, 6863, 24921, 57137, 50844, 125050, 125813, -1809, 236113, 436769, 300474, 75643, 33571, -26321, 48802, -78840, -136617, 109779, 217456, 285096]
12851B85096k2240j48739j01027l5583l860N519J4082J66087L0646j67344n1780
12840b9143p284P0296n0804N630j21415j16446K9908J03434L5196n8972N2281
12829h7319J10891j5681K0428R843j34695j7302M5276J14291M636J0136k16130
12818a55626m4419J51103K41919J25196j49382n0573m4492r820l2090l58J57411
12807A88869R5735L3985j93084j2011k5780Q942k1195k7561l7506J87520j93729
12796D185j88122j6046J8790J11639M2535J03112O7031j01843K6433J40348r8327
12785A09735n8609R2956J74457j3175j03556o2254l7245N7326n0130J2583j29671
12774g583j6733J29553J23869p6548j59924j28329j9189j154R6416j1908O4464
$$ y = [285096, 262856, 114117, 13090, -22493, -26353, -20834, -6752, 159335, 189981, 22637, -29143, -36427, 33869, -16935, -11305, -132720, -249166, -219258, -115824, -80628, -139600, -87319, 23572, 7891, 28319, 38162, -96533, -113835, -68559, 45732, 50368, 60504, -155626, -200045, -48942, 192977, 318173, 168791, 118218, 73726, 63906, 31816, 31458, 188869, 284604, 318589, 125505, 113494, 87714, 96656, 75461, 47900, 10394, 197914, 4185, -183937, -199983, -181193, -69554, -27019, 76093, 143124, 41281, 67714, 208062, 109735, 51126, 144082, 318539, 305364, 201808, 139554, 102309, 159635, 109505, 122088, -7583, -24316, 105237, 229106, 152558, -7366, -135695, -154884, -156038, -59622, -71530, -7066]
12763g066R4561O386j06004J95527J29373j10948M1422j85786q8854j00812n7456
12752a89657R8615J50230M3203K8040Q724O5585j17415n4138j5511R8953N8718
12741A75347j56218m4820m4644Q4854M5320j02263p3143K9737Q4855R8015O5148
12730A62188O9246j6988j05418N569n2062q5793Q4820L0355J98679n1167l2859
12719B06570P4779l5383j45498j30366l2477N8957J33871l1901k27939j7864k0313
12708a67564J67579J07400P5627m5587J4495j0788k05792M9540p2578k43334r7098
12697d28100P9360K24517J02330P8128P3894l4584J09906M4620Q3625j12183j41669
12686G9844N2345j50781j86001J26526J53745M5009k9247m1957j31773l5246K71761
$$ y = [-7066, 87495, 93881, -12123, 183404, 312777, 201829, 243251, 57465, -31389, -132201, -189657, -91042, 59188, 102391, 130431, 139155, 204740, 87325, 33187, 17676, 116629, 175347, 19129, -25691, -70335, 14519, 59839, -42424, -115567, -85830, -975, 97040, 162188, 231434, 214446, 109028, 114597, 62535, -23258, 61562, 91917, 290596, 239429, 206570, 281349, 245966, 100468, -29898, -62375, -3418, 130453, 98552, -129387, -147251, -167564, 15, 107415, 183042, 137455, 151950, 141162, -64630, -15090, -87668, -331002, -428100, -348740, -124223, -21893, 56235, 130129, 95545, 205451, 250071, 333696, 221513, 79844, 132189, -18592, -204593, -78067, 75678, 120687, 91440, 49483, -82290, -117536, 154225]
12675A54225J4016K2029o3341p8031j95564M7783K44590J27495j00209k21559
12665d8566J64573o4495k1364K9269P6857J5757j12256j23713K927Q544k0729
12654i3196R9642N2207k1601j06176j84672k75390o5430R7145J5084P0291J22660
12643b89436R6205L813j3399K7684j5849K022L8696J39570k1664J968J3564Q4541
12631F7715J28642o9045M9645L4395j44706p1914M3400j10605O1710J50705K50750
12620C90692j3474k40167n4088J0035p0332L5428j1787K3868k35O7698k8244o542
12608A02852K4513l7451k47597J01279J8023q4280L0407j4286O1847J43928R715
12597A08950R8982J02988m2300l9514q2464r9826j1779K06077J44791n9757k33022
$$ y = [154225, 168241, 190270, 126929, 48898, -146666, -98883, 145707, 273202, 172993, -48566, 116007, 51512, 30148, 59417, 136274, 152031, 39775, -83938, -81011, -72467, -93196, 6446, 58653, 37052, -69124, -253796, -529186, -594616, -497471, -482387, -412096, -289436, -193231, -189418, -202817, -175133, -190982, -188960, -150264, -10694, -32358, -30390, -16826, 67715, 196357, 127312, 176957, 211352, 66646, -5268, 38132, -72473, -10763, 139942, 390692, 377218, 137051, 82963, 92998, 22666, 58094, 46307, 70175, 69940, 137638, 109394, 102852, 127365, 89914, -157683, -56404, -38381, -122661, -92254, -106540, -44693, 99235, 108950, 207932, 310920, 268620, 229106, 146642, 46816, 35037, 241114, 385905, 326148, 93126]
12586I3126k15165o3416J13720J7939j04449j54222P740O8180K04775K28424j21673
12575G4979n1917l7526P5294L3186N3278N2956j16645O2810l5909j06753j71397
12564a67644R7567N882q7713R0926l5551L1942j7564k3917L3080l2961J04972
12553i81J91647n03Q355M6325l0822P0232j65422j81903Q0372N4530p1902q2328
12541h2400P7125m4059J02256N9981k0166r4870N7347n8159K3383J22482l6276
12530A06644j06618p0477k2184J3181J88880j2414L8359J38959Q5915o1873k23771
12519G4601j2940m6803P1163l587j9697O8970O0748J37408j569L8329j45483j07920
12507A13220o7186l3269m4160R5922O8086K42052J18941o8831j6245p0466K3618
$$ y = [93126, -122039, -185455, -71735, -53796, -158245, -312467, -304727, -236547, -31772, 196652, 74979, 23062, -14464, 60830, 94016, 147294, 200250, 83605, 146415, 110506, 3753, -167644, -70077, -64195, -151908, -60982, -96533, -64591, -82155, -106072, -72992, -105953, -981, 190666, 190163, 198518, 244843, 214021, 284253, 118831, -63072, 17300, 71830, -72, -82400, -5275, -49334, 52922, 112903, 92737, -2133, 55214, -2945, 20438, 142920, 106644, 26, -70451, -92635, -79454, 109426, 97012, 135371, 274330, 360245, 298372, 74601, 61661, 14858, 86021, 82434, 62737, 131707, 192455, 329863, 328294, 366623, 221140, 113220, 46034, 12765, -31395, 64527, 132613, 374665, 493606, 424775, 408530, 338064, 361682]
12496C61682q6012L4944j34992K3194m7957j2136P1582n9368j1207j04791j11163
12485g6224k0021Q1481J49186J3261K0089k09657r2314J56549J85269J62176j867
12474C67928n3104m7755M4525J9453j08297j12810j0505N7222q0549q4696j02833
12463a11421m0612L0155J42485N070P9764k2561j20174O9352L6633o5541J8327
12452B1477M2600n0604J04148j70604N5790K07206n2673m6496k3457r5462J10147
12441A02072J45066j22048j55110o3719L4526K04574K32987l4911n8450p6269
12431B08718o1889k5165R3238l3264j5130K3150R1124l892P4386R0987m9930n047
12419C87286M7493k29094j53482O1297p1201k03477J9056L5436M1951O6423O5401
$$ y = [361682, 275670, 310614, 175622, 198816, 150859, 138723, 210305, 150937, 139730, 34939, -76224, -96245, -14764, 134422, 147683, 167772, -41885, -134199, 22350, 207619, 369795, 367928, 314824, 267069, 311594, 331047, 222750, 109940, 99435, 156657, 76108, -8588, -111421, -152033, -121878, 20607, 25677, 105441, 82880, -37294, 32058, 68691, 3150, 21477, 64077, 13473, 117621, -52983, 2807, 210013, 157340, 110844, 87387, -8075, 102072, 247138, 125090, -30020, -93739, -59213, 145361, 378348, 343437, 284987, 208718, 146829, 121664, 214902, 181638, 166508, 189658, 280782, 276890, 351276, 442263, 392333, 387286, 434779, 205685, 52203, 113500, 42299, -161178, -142122, -106686, -64735, 1688, 67089]
12408F7089J55685p777r9102M45k7577M0578J0755k9232m2685k8899p6422L1550
12396e592O3505M7777R8536J5593R2714j4380k2467J06776j10711K5436J41820
12385D39007j01245j79199j07954j97826J01649n0086l4915J01848n2685o4503
12375a45909J3475O360m1782O3497Q183J85232J74565J72217j43276j02577J39425
12364C29410l3542m8612j0843r4849O1674J33909J1958n0960J36305k2077k51941
12353A60432r7793P8732J03545M8441j3879m6839j44294j25880M1832J16184J35116
12342B55597J24832k66167j24886K8773M3774j5228k8081Q9206K1462o3095o9024
12331b837m6645j07677m6705J66040R0255J21613m449M4284M8950j8170O139j4558
$$ y = [67089, 222774, 214997, 115895, 116340, 88763, 129341, 140096, 110864, 68179, 39280, -37142, -5592, 57913, 105690, 204226, 219819, 312533, 298153, 275686, 382462, 271751, 297187, 439007, 337762, 158563, 50609, -147217, -45568, -95654, -130569, -28721, -81406, -145909, -132434, -126074, -167856, -104359, -96176, 89056, 263621, 435838, 292562, 189985, 329410, 295868, 247256, 236413, 141564, 203238, 337147, 349105, 298145, 434450, 412373, 160432, 62639, 141371, 244916, 293357, 279478, 232639, 88345, -37535, 4297, 120481, 255597, 380429, 114262, -10624, 18149, 61923, 46695, 18614, 107820, 129282, 66187, -2837, -49482, -157159, -203864, -37824, 52431, 174044, 169595, 213879, 262829, 244659, 250798, 236240]
12319B36240j05401O0279L6178j00993n1746M0836n7412J40302M1130q9191j44414
12308E808o5146Q9257J77865o915k10005q2644J21727J2627q2432N5832L8388
12297E4362J56318J7865j70713P3239L0132j10991P5104M5429m7499q4893P6825
12286A15178J27044R3919m3297J7618R9811K0754j7510j69607M7501J74710j00388
12275C65733R068p8440o2522J48286L4717j23503K7794q142j66019M9325j13542
12264H2755j37345K9407J60497j7599K5164m28n837J14219J14865j76922j2533
12253A76243J22624J68211R883Q177q6780j7554k3951j29460p3909M3336J69479
12242C66299n4667N4743k5351J51734Q4842k05975j67702k09837J5858J65232
$$ y = [236240, 130839, 191118, 227296, 126303, 74557, 115393, 57981, 198283, 239413, 150222, 5808, -59338, 29919, 207784, 200869, -9136, -91780, 29947, 42574, -39858, 15974, 54362, 210680, 228545, 57832, 131071, 161203, 50212, 125316, 170745, 123246, 38353, 115178, 242222, 336141, 292844, 310462, 410273, 431027, 413517, 243910, 291411, 466121, 365733, 374801, 296361, 233839, 382125, 416842, 293339, 321133, 312991, 146972, 196297, 82755, -54590, -25183, 135314, 117715, 142879, 142451, 136614, 250833, 365698, 188776, 176243, 298867, 467078, 476961, 485138, 398358, 380804, 356853, 227393, 153484, 196820, 366299, 311632, 366375, 341024, 492758, 577600, 371625, 203923, -5914, 9944, 175176]
12232A75176J37887j1116n1051K53274j54514k02863J9383J08686O6711J94654
12222E36227k9911j71504J50185r12j32715j26066j32962J78143K93048r2128
12212D71405P479k4593J7337p616n3747p7410R7236J96171M7917j0091p0797N8189
12200F51480j95642q8158j3891n7725J72366J69078m5073N2366l423l7500m6612
12189E57266J06569j2325n3703p069J31979J05230N6529j11060M5130j6249j68505
12178F33792j29304j47635Q3353J06736k1811R361p659k06230j10882K75592J71811
12167F57124j1716k82171J4694J31074l7059q0377k4266j6931J30034j1839m4363
12156D24204J00726r6480r6212q5882J18400M6925L1227l5884P7557O4368L3594
$$ y = [175176, 313063, 301947, 250896, 504170, 349656, 146793, 166176, 274862, 341573, 536227, 506316, 334812, 484997, 484085, 351370, 225304, 92342, 270485, 563533, 471405, 478884, 454291, 471628, 464012, 410265, 332855, 430091, 626262, 674179, 664088, 593291, 651480, 455838, 367680, 353789, 296064, 468430, 637508, 592435, 644801, 641378, 603878, 557266, 663835, 651510, 597807, 590738, 722717, 827947, 884476, 773416, 818546, 802297, 633792, 504488, 356853, 440206, 546942, 525131, 534492, 526833, 320603, 209721, 485313, 657124, 645408, 363237, 377931, 509005, 471946, 391569, 367303, 350372, 480406, 468567, 424204, 524930, 428450, 332238, 246356, 364756, 411681, 442908, 407024, 484581, 548949, 582543]
12145E82543p3965j2762m8499J8933O1096j00037J11779O8711m0144q0781P8218
12134E65092K21429R5491k78311j01464J68698o8320p4529j16699n8752M0748
12124C93383n683o0357N0082J59186o9704k6250N0796P3977m5776Q236J5393N2260
12112E95543q6257J9637N4524R1876J99826o9603n0431O3409j0483j9565k7125
12101G61351J04995j26638j10640L6090l5495L8684Q6606K4601j4679Q2940K2048
12090H69863m7829J59253l0420J6961J54485L7161j73507j77725q4608P6086K36259
12079A035979J8601O1399L0890L968J7731L972l1894j7718J20609R7578p989r3534
12067A239592j03360K9869Q974L0464J20271K19583j6854p1671J08066J47948
$$ y = [582543, 508578, 495816, 447317, 466250, 527346, 427309, 539088, 607799, 567655, 486874, 565092, 786521, 882012, 603701, 502237, 670935, 602615, 528086, 411387, 352635, 393383, 387700, 327343, 377425, 536611, 466907, 440657, 491453, 565430, 519654, 527890, 543283, 595543, 509286, 528923, 583447, 675323, 875149, 805546, 755115, 818524, 808041, 788476, 761351, 866346, 739708, 629068, 665158, 629663, 668347, 754953, 779554, 764875, 847815, 869863, 822034, 981287, 950867, 967828, 1122313, 1159474, 985967, 808242, 723634, 799720, 1035979, 1054580, 1115979, 1146869, 1150837, 1168568, 1172540, 1140646, 1122928, 1243537, 1341115, 1333126, 1239592, 1136232, 1166101, 1175075, 1205539, 1325810, 1545393, 1528539, 1456868, 1564934, 1712882]
12057A712882j858N2877j48838k8994O4220r372n4116j5761J00321J8807K2627
12046A712795l6133Q7778P3379k45865r7551l3508j3030J29771K03834j1049J03984
12035A874405J35532j53952m0859J01740J65072N2429r6760p2975k0574L829J9357
12024A967244m385M9208J12940k39388j31686L8094J35892J68490J03650M5363
12014B245422o6832J35862M156N9457r733J25598R5304J71130J65648m3000r7100
12003B785912k02489R896L05607M2221K29729J81345m6476j22493K54061J61252
11993C598565j44397L4754Q9371K1108M9903J64766K28959J33749J10244J57220
11983D444242J91338K64106J68080R8715J63193j1685N0083J95641K30088J83385
$$ y = [1712882, 1711024, 1763901, 1615063, 1586069, 1650289, 1640917, 1586801, 1571040, 1671361, 1690168, 1712795, 1676662, 1764440, 1837819, 1591954, 1494403, 1460895, 1447865, 1577636, 1781470, 1770421, 1874405, 2009937, 1855985, 1815126, 1916866, 2081938, 2134367, 2037607, 1964632, 1944058, 1947887, 1967244, 1962859, 2012067, 2125007, 1885619, 1753933, 1792027, 1927919, 2096409, 2200059, 2245422, 2178590, 2314452, 2318608, 2378065, 2368332, 2493930, 2589234, 2760364, 2926012, 2883012, 2785912, 2583423, 2593319, 2898926, 2941147, 3170876, 3352221, 3305745, 3183252, 3437313, 3598565, 3454168, 3488922, 3578293, 3599401, 3649304, 3814070, 4043029, 4176778, 4287022, 4444242, 4635580, 4899686, 5067766, 5166481, 5329674, 5317989, 5368072, 5563713, 5793801, 5977186]
11973E977186J87087K10794L57240L45880J66246K39704K79075K57727L44448
11964H365387N10914K25613R3173L91243N75281O55902N84033M22261K99506N00613
11954A2623926O32516M92322O99584R40666Q11740Q53765R48201R50968J040112
11945A9993800J092255J239415J415663J532445J719536K006371K334179K516968
11937C3850632K715967K870431L238944L514710L904674M686806N189855N862429
11929F5834448O443732P413029Q408524R513911J0656740J2029007J3131745J4174465
11921A47605601J5135417J5290921J5022465J4032564J1639101Q153949M129362
11914B31009380n56589n227774r121527j2070088j3675822j4540465j4764288
$$ y = [5977186, 6164273, 6375067, 6732307, 7078187, 7244433, 7484137, 7763212, 8020939, 8365387, 8876301, 9101914, 9195087, 9586330, 10161611, 10817513, 11401546, 11823807, 12123313, 12623926, 13256442, 13748764, 14448348, 15389014, 16200754, 17054519, 18002720, 18953688, 19993800, 21086055, 22325470, 23741133, 25273578, 26993114, 28999485, 31333664, 33850632, 36566599, 39437030, 42675974, 46190684, 50095358, 54782164, 59972019, 65834448, 72278180, 79691209, 88099733, 97613644, 108270384, 120299391, 133431136, 147605601, 162741018, 178031939, 193054404, 207086968, 218726069, 226880018, 231009380, 230452791, 225225017, 216103490, 204033402, 190357580, 175817115, 161052827]
11907A61052827j4340419j3170495j2203103j1176711j0014211q647696p663254
11900H3836938o951299o171595n466180m796318m205659l762086l202781k755440
11892D6525580k567853k450553k370284j920540j588812j521277j416951j280094
11884C1409216j081085j151575j012239r65268j002441j051665q46132o98550
11876B3600261q31082j247093j023624r14021q19204p35520r14911r46277q59651
11867A5308878q90362o67663n42314n42711p80358o27920m35193n85513n28952
11858I707892l12919l80249l88460n09826l76880m43198l77525j85436k56396
11849F477003k33917l15381k13458j72493o8719j43192k96166k40829k33759j42166
$$ y = [161052827, 146712408, 133541913, 121338810, 110162099, 100147888, 91500192, 83836938, 76885639, 70714044, 65247864, 60451546, 56245887, 52483801, 49281020, 46525580, 43957727, 41507174, 39136890, 37216350, 35627538, 34106261, 32689310, 31409216, 30328131, 29176556, 28164317, 27199049, 26196608, 25144943, 24298811, 23600261, 22769179, 21522086, 20498462, 19584441, 18765237, 18029717, 17114806, 16168529, 15308878, 14418516, 13750853, 13208539, 12665828, 11885470, 11257550, 10822357, 10236844, 9707892, 9394973, 9014724, 8626264, 8116438, 7739558, 7296360, 6918835, 6733399, 6477003, 6243086, 5927705, 5714247, 5541754, 5473035, 5329843, 5033677, 4792848, 4559089, 4416923]
11839D416923j41039k8498k732J8182k61715j1914P4267j98561j86275k13834
11829C464804N9090p9613k14355p9304l450m1742l3692j54813l7114O3390k00812
11818B742389k09221r0792k7180M6435N3764l813k2007j16805k27375j41707m6113
11807A957575j6291l1202j01879o4816j20814N276K48639R3641j38276q6143k35293
11796A510417r8035l7370k8159J12886Q9106j23353j94075j60674Q0916J14391
11786A266050J33482o4051j69184P4660K4519j55448j00910r70K2106k20350k22067
11775E87837J0747J31547n3903n7912J29407M9692l040J7980j6711j25984J7638
11764F87298K0183m0112J36758R9416p2829k9361J5152L0055o6323n137n5878
$$ y = [4416923, 4275884, 4247386, 4244654, 4262836, 4001121, 3989207, 4063474, 3864913, 3678638, 3464804, 3523894, 3444281, 3229926, 3150622, 3147172, 3105430, 3071738, 2916925, 2879811, 2943201, 2742389, 2533168, 2442376, 2415196, 2461631, 2515395, 2511582, 2489575, 2372770, 2145395, 2003688, 1957575, 1941284, 1910082, 1808203, 1743387, 1622573, 1627849, 1876488, 1970129, 1831853, 1745710, 1510417, 1412382, 1375012, 1346853, 1459739, 1548845, 1425492, 1231417, 1070743, 1151659, 1266050, 1399532, 1335481, 1166297, 1240957, 1265476, 1110028, 1009118, 1008148, 1030254, 809904, 587837, 598584, 730131, 676228, 618316, 747723, 797415, 794375, 812355, 795644, 669660, 687298, 707481, 667369, 804127, 903543, 830714, 801353, 816505, 846560, 780237, 775100, 719222]
11753G19222r169j513K6077p8734J07280p3072j65914r5463o048k4343J9380q572
11741D09131K34313R2947j53362j57455j5935n8677j78445J56572J31103J4113
11731D74305J6989J71129m4129K0155N8132k62179j62893J58241p9946q9959j12089
11720A47756J25861J30674J08040l9647k28896k27273M4499L22027J27154m0649
11710D69546j59925n7205J82626J1742r5099J31207J30805P0090Q8078p7806L560
11699F97619K3318o4833q0700o2626P9199o4772k0793J27259p967p2748n418m2190
11687E05348k25517j73862o7635o8099L5115J41990J75385R6701P1394p1366O5353
11676D84807j17570n0843J07914k206k1821q3532n2056L211K45401p0525j81157
$$ y = [719222, 710053, 708540, 734617, 655883, 763163, 690091, 524177, 428714, 422666, 398323, 417703, 409131, 643444, 736391, 583029, 425574, 409639, 350962, 172517, 329089, 460192, 474305, 491294, 662423, 618294, 638449, 696581, 434402, 271509, 429750, 349804, 259845, 147756, 273617, 404291, 512331, 472684, 243788, 16515, 61014, 383041, 510195, 469546, 309621, 252416, 435042, 446784, 351685, 482892, 613697, 683787, 771865, 694059, 697619, 720937, 656104, 575404, 512778, 591977, 527205, 506412, 633671, 625704, 552956, 547538, 505348, 279831, 105969, 38334, -29765, 5350, 147340, 322725, 419426, 490820, 419454, 484807, 367237, 316394, 424308, 422102, 400281, 316749, 264693, 267904, 513305, 442780, 261623]
11665B61623n9780J56809Q9058j28714j37615k834M5465J98832K9873P8785n5848
11654D75654k2202j65555j62244J05861j7041O3583N6812J37919J06401K4163
11644F03351n0076j65094j09890R3007k0270K3000j96832n3608J6520j7209J11365
11633B34264J9481l0694M992k8822P7603J42880o940j93635M6018J44491P4726
11622D84364q10N7344J8130r9592K5803N058k84464j55850L7301R2446j1454Q101
11610A76377J2308J01757K66422p5632p9907p2947m6036j7046m7704R132o4346
11599A62378k2438L9435j53293k8185K13847J83297j31433n781L5893j48345q1542
11588F3833Q0419Q8685J04566r7600j23371n9121m5531J0714P791M0780J34916
$$ y = [261623, 201843, 358652, 447710, 318996, 181381, 178547, 224012, 422844, 452717, 531502, 475654, 453452, 287897, 125653, 231514, 214473, 278056, 334868, 472787, 579188, 603351, 553275, 388181, 278291, 371298, 351028, 374028, 177196, 123588, 140108, 122899, 234264, 253745, 223051, 228043, 199221, 276824, 419704, 412764, 219129, 265147, 409638, 484364, 483554, 540898, 559028, 459436, 485239, 490297, 205833, 49983, 87284, 179730, 168276, 176377, 188685, 290442, 556864, 481232, 401325, 328378, 282342, 265296, 217592, 226724, 162378, 139940, 179375, 26082, -2103, 211744, 395041, 263608, 257827, 293720, 145375, 63833, 144252, 232937, 337503, 239903, 116532, 57411, 11880, 22594, 30385, 71165, 206081]
11577B06081J39648N7151r0434j65006K0892J56085o8887j9039N8027L2213q0945
11566B45786j10484j61915n6265J30715N2859j82088O753k7861J9773K86663P9214
11555B83150K9068j38157j94535J48420J03588l3517r2393Q3643K1703j5124m6729
11544A49117j09975q067P355O6206M6514n8875p71N9206j26782J18712O4817j14909
11532I2548j80049J6980J57825m5767J61139n0919j16647n8426L0311J33643n1223
11521H9415J67083k4608O439j55038j05944O6205L0468Q41l6568J17259R3007
11510B48559o1833r2813M5931J26549J6458j90701j09274K5680j26022n5138J62782
11499i822K6151L3872o3647j3574J68726m5919m9328l1923J6483M7573j17198
$$ y = [206081, 345729, 402880, 312446, 147440, 168332, 324417, 255530, 236491, 294518, 326731, 245786, 135302, -26613, -82878, 47837, 100696, -81392, -74639, -102500, -82727, 203936, 283150, 312218, 174061, -20474, 127946, 231534, 198017, 105624, 189267, 210970, 195846, 149117, 39142, 31075, 38430, 104636, 151150, 92275, 91504, 150710, 23928, 142640, 207457, 92548, -87501, -70521, 87304, 41537, 202676, 151757, 35110, -23316, 6995, 140638, 89415, 256498, 231890, 238329, 83291, -22653, 43552, 74020, 74861, 38293, 155552, 248559, 186726, 93913, 139844, 266393, 282851, 92150, -17124, 8556, -117466, -172604, -9822, 16329, 50201, -13446, -27020, 141706, 95787, 46459, 14536, 31019, 78592, -38606]
11488c8606m6083p9115p1810K2635J28215L2508J63378K19316N7772l1671p5331
11477B81208j18864l6932K6461j09729m1327O7793J22181K4313r6121j41907J8361
11466d563J13968K9320k2228J72250J08840j47264p3517J14490k2819K7991J14544
11455D11012j8752p0240r2710j10533r8381J32466J31736M4534n0900j37474p6134
11444F4624m9419J38877M0845l2484k6724l4690q1654P8452J74051K7009J13929
11433D12816k4734r3634j83093j72349k2159R2109J21570L4004P8646J664R6393
11422C41233j95656k9706q4460m4990J00678K02420j14492m3943J9838K1076N7661
11411B29659J74103n3309j22235l3878L5174K1941j7987n3568P7536J2131p7624
$$ y = [-38606, -84689, -163804, -235614, -212979, -84764, -52256, 111122, 330438, 388210, 356539, 281208, 162344, 125412, 151873, 42144, 817, 68610, 190791, 215104, 118983, -22924, -4563, 109405, 138725, 116497, 288747, 397587, 250323, 176806, 291296, 268477, 296468, 411012, 392260, 322020, 229310, 118777, 20396, 152862, 284598, 329132, 278232, 140758, 64624, 15205, 154082, 194927, 162443, 135719, 101029, 19375, 97827, 271878, 298887, 412816, 388082, 294448, 111355, -60994, -83153, 8956, 130526, 164530, 243176, 244840, 341233, 145577, 115871, 31411, -13579, 87099, 289519, 175027, 131084, 150922, 171998, 229659, 403762, 350453, 228218, 194340, 229514, 251455, 233468, 179900, 257436, 269567, 191943]
11400A91943R4431J14280L4080j35706l46210r3318J44119Q7755o9939j32658
11390a11223L2449k6544L7136j1865k483N8680J43827p1822n5010N575n6890o8245
11378a26415q5635J15960O710p6582J3803Q7653l5440O387j9967J29521J49753
11367A65748m3827j6755k46640j3487J67769O5635n5237j28675m9325J10889K09524
11356A65619J10382L5275N6085N848p3828k97115O0468Q9114O8306k6678j41619
11345E1857j16632q4735m0344J06516J30828M2771N6984n2830K2504J0262p1139
11334E6042j6665o7350K2803j12047j9163M2590J44418Q9333K1482Q0273P9423
11323C21139K2284R057o6632k38814k47651M7677Q6085J08251J16154q4950J08969
$$ y = [191943, 286374, 400654, 434734, 299028, -47182, -140500, 3619, 91374, 21435, -111223, -78774, -105318, -68182, -80047, -82530, -23850, 119977, 48155, -6855, -1280, -58170, -126415, -212050, -96090, -89380, -165962, -152159, -64506, -99946, -93559, -113526, 15995, 165748, 121921, 105166, -141474, -154961, 12808, 78443, 23206, -105469, -154794, -43905, 165619, 276001, 311276, 367361, 373209, 299381, 2266, 62734, 151848, 220154, 193476, 51857, -64775, -149510, -189854, -83338, 47490, 90261, 147245, 94415, 116919, 127181, 56042, 39377, -27973, -5170, -117217, -136380, -93790, 50628, 139961, 161443, 241716, 321139, 343423, 352480, 285848, 47034, -200617, -152940, -66855, 41396, 157550, 72600, 181569]
11312A81569J4348O5062P7665K9978P5306n7900l33124j68044P5411P3818N0477
11301H4566J66734p4128j60792Q8918j9239Q768o8402k8095l983j59391q5528
11290b50572J32872P7002K31696K3120q2249o2233l3517J60227N2900Q3578j67938
11279A64886M4413j90178p2105p366J46751R5945P4671n3310j30048j13669J9509
11268b0501k9698J69129J17790j02995j77113q5569o849j44605J00996J96426
11258A7011J63556m5226J8948n1652L8112O8221N0406P6749r1489j22908n4090
11247F7638j5227J17685K2752j06719j82175J46427M3484j206Q6389k4874j7189
11236A36985j86190j00056J13537l11659j69173O4274L02457K32349L2919l7371
$$ y = [181569, 195917, 260979, 338644, 368622, 443928, 386028, 52904, -115140, -39729, 34089, 84566, 251300, 177172, 16380, 105298, 86059, 94827, 26425, -1670, -5653, -165044, -250572, -117700, -40698, 190998, 214118, 131869, 69636, 36119, 196346, 249246, 332824, 164886, 209299, 19121, -52984, -60350, 86401, 182346, 257017, 203707, 73659, -40010, -20501, -50199, 118930, 236720, 133725, -43388, -128957, -135806, -280411, -179415, 17011, 180567, 135341, 154289, 102637, 140749, 208970, 259376, 336125, 244636, 121728, 67638, 52411, 170096, 192848, 86129, -96046, 50381, 93865, 92659, 179048, 154174, 136985, -49205, -149261, -35724, -347383, -516556, -452282, -149825, 82524, 115443, 78072]
11226G8072R0011p1333k38005k1609J50495J618j29465p0861O1361N4090M7302
11215d8324J3140M9184K1422o537j30450J73897O4557J9038j10807j04776j49209
11204b08865J00160J49014o8530J11490L5322J09603O9228m7994j70325J6810
11194I5913Q1093q2576o8213O775K21811r5847p9491J60417p141o2366o7432R3581
11182A96524J47923p4307p3512j34643l2963J7041n5047O9138N5083L6600q902
11171A42935O6528m0663m6269Q5038N6580j59295j44447l7252M9878N4167K5743
11160E2943q9485j4876J45823n5531m1722m5059k07105O000K73035K94631j33033
11149A85621k4920J1793k20656l8515P0144q0148j16652R7171J51959N695o5285
$$ y = [78072, 168083, 96750, -141255, -162864, -12369, -10751, -140216, -211077, -149716, -95626, -48324, -35184, 14000, 35422, 28885, -101565, 72332, 136889, 155927, 45120, -59656, -208865, -108705, 40309, -28221, 83269, 118591, 228194, 297422, 249428, 79103, 95913, 177006, 94430, 26217, 32992, 254803, 158956, 79465, 239882, 232741, 170375, 102943, 196524, 344447, 270140, 196628, 61985, 29022, 46063, -8984, 60154, 115237, 151837, 142935, 209463, 168800, 122531, 207569, 264149, 104854, -39593, -76845, -26967, 27200, 52943, -36542, -51418, 94405, 38874, -2848, -47907, -255012, -249012, 24023, 318654, 185621, 160701, 172494, -48162, -86677, -16533, -96681, -213333, -116162, 35797, 41492, -23793]
11138b3793J30624L0244P74n554J04810o8948J642J4853o8622r271n7340K1572
11126G0991J98276m999j22032j45484O0906J38690K7961k28j55585n2299m6093
11115b9896k003p641J81868j43j10646r7283L0587J66132p0694M8308q1823n7656
11103c0890J21315O7548j41641M0391R1258k11660n2172J52899J91242R7652j7888
11092C08054k08442r0253O8715J61623L0699m1000j55334o3477M5958j15490K1874
11081c7073P2987r2038q7718K5934K14769J32653p8752K273K6258j26700k0972
11070C1621J10793j08450n4247Q5825q622K6953r4758Q3097J25580J0383o3249
11059A44926J11906J56299l7272l4090m0613j6359P7710L8422p5379j09066J01733
$$ y = [-23793, 106831, 137075, 137849, 132295, 237105, 168157, 169799, 184652, 116030, 106759, 49419, 70991, 269267, 264268, 142236, -3248, 57658, 196348, 224309, 224081, 68496, 16197, -29896, -31899, -39540, 142328, 142185, 31539, -65744, -35157, 130975, 60281, 108589, 26766, -30890, 90425, 157973, 16332, 56723, 147981, -63679, -115851, 37048, 228290, 325942, 308054, 99612, 9359, 78074, 239697, 270396, 229396, 74062, 10585, 56543, -58947, -37073, 35914, -56124, -143842, -117908, 96861, 229514, 150762, 153035, 179293, 52593, 31621, 142414, 33964, -20283, 65542, 56920, 83873, -10885, 72212, 197792, 208175, 144926, 256832, 413131, 375859, 341769, 301156, 284797, 362507, 400929, 325550, 216484, 318217]
11048C18217J37506Q5615k0417K08204K24748J70293j13182j37600j29099J41012
11038H85297J3743M9387J82941J59760J01306K11976J15545J25136k52308j48439
11028A444344R334n3207K7723J07972J81363J99360K70661L32211L4730j28166
11018B426325k67868k13478l04539k16434j41299n0133J14047J85681L35187K51651
11008B119140p316k54366l92858j96386j29395k19427k05075J13177l2820q5422
10998G09252R1398P7452j8228L4208j76787j02973k4434m7725o8885j70195J38084
10987D41167N0801j31074n8501J47771j39028j25767N7114Q743j38238N1387J64725
10976C29100j87779m9081p5807o1715N8782R4064L300M3055p1894L3515l8932
$$ y = [318217, 455723, 541338, 520921, 729125, 953873, 1124166, 1010984, 873384, 744285, 885297, 899040, 948427, 1131368, 1291128, 1392434, 1604410, 1719955, 1845091, 1592783, 1444344, 1453678, 1400471, 1428194, 1536166, 1717529, 1916889, 2187550, 2519761, 2554491, 2426325, 2158457, 1944979, 1640440, 1424006, 1282707, 1232574, 1346621, 1532302, 1867489, 2119140, 2111824, 1857458, 1464600, 1268214, 1138819, 919392, 714317, 827494, 794674, 709252, 800650, 878102, 859874, 894082, 717295, 614322, 589888, 542163, 473278, 303083, 441167, 491968, 360894, 302393, 450164, 311136, 185369, 242483, 251226, 112988, 164375, 329100, 141321, 92240, 16433, -45282, 13500, 107564, 110864, 153919, 82025, 115540, 76608]
10965G6608j11285r2561M303o5290j4889J34721J16993r4582j08851J56397R3966
10954I5530j19814o1455J48568J72398r7243j8877Q8511k18488r4878R10J57380
10943E2542J58790q5977M3287k7237k64050R035J52195O6102q6665P8608o1230
10932C5400m9188P4390l8774l7520j14684J59477M0423O1347M7924J15230J2829
10921C06854j36389q3238m3242J4130K84J61391J86165j12524k0818K8406Q2834
10910C83853m2491j62005o7211o456j53099l0612R0589k7998J27853k1206j74739
10899h3522O0570J39087P7535N2209O829J28903R4098j91989k09813j8498j30526
10888g5117j5272J93213m1043r591n8415j0417J23235Q6046K9243p518k6159j5438
$$ y = [76608, -34677, -127238, -122935, -188225, -203114, -68393, 48600, -45982, -154833, 1564, 95530, -24284, -85739, 62829, 235227, 137984, 119107, 207618, -10870, -105748, -104838, 52542, 211332, 125355, 168642, 141405, -122645, -113610, 38585, 104687, 18022, 96630, 35400, -13788, 60602, 21828, -15692, -130376, 29101, 69524, 130871, 178795, 294025, 306854, 170465, 87227, 43985, 58115, 58399, 219790, 405955, 293431, 272613, 301019, 383853, 341362, 179357, 112146, 105690, -47409, -78021, 12568, -15430, 112423, 91217, -83522, -22952, 116135, 193670, 245879, 252708, 381611, 475709, 283720, 73907, 55409, -75117, -90389, 102824, 61781, 52190, -6225, -16642, 106593, 192639, 221882, 214364, 188205, 172767]
10876A72767J38619j6587k0856k1186K24390M7117p0591j09527j16631K2285o2642
10865A87158j6840M5812j01612J3057l722O0294j21757j59043K27042J06201J0401
10854B46991J91114p3321j34071m2556N5269j2381n937m5903j18633J26581O2781
10843B49934J15848K05668J31783l3013k04264l2737l2147m1732j10043p8854
10833A70443P11p739l2725q4358L4870k9456P9086o0181P4226k52524j4326Q2079
10821c9894J13678J54979j9627o0308m1260N6545N6703N6756j17425j09746k9473
10810B0928L0226r840L8430J68016J47920J89164N6622j68974j10593j44579L0838
10799B48158J30519J5107J2646O7715J8343j65505J09881P9950O7307j7368k5596
$$ y = [172767, 311386, 294799, 273943, 252757, 477147, 524264, 453673, 344146, 227515, 249800, 187158, 170318, 216130, 114518, 127575, 123853, 184147, 62390, -96653, 130389, 236590, 246991, 438105, 364784, 230713, 188157, 243426, 231045, 225108, 179205, 60572, 187153, 249934, 365782, 571450, 703233, 670220, 465956, 433219, 401072, 359340, 249297, 170443, 171154, 163415, 130690, 46332, 81202, 51746, 130832, 70651, 144877, -107647, -121973, -39894, 73784, 228763, 209136, 148828, 107568, 164113, 220816, 277572, 160147, 50401, 20928, 51154, 41314, 79744, 247760, 395680, 584844, 641466, 472492, 361899, 217320, 248158, 378677, 393784, 406430, 474145, 492488, 326983, 436864, 516814, 584121, 566753, 541157]
10788E41157L4397p3633l8244M7101m5278q3178j06497O6115j1692M2427Q1304
10777D53979L5612K4629j15275p3404j47610j6803Q5700P7565M0381Q7838K30277
10766F82889Q6469j44897J63616p0829j98930j95518M6547J55569J02757J4807
10756F42480l1010j1946m4075L9049M6921Q460J02457O3741J43407Q5592L8748
10745A083824L4046M1132p9282l6559J69613J05101q6300K0493M3386J30343K23251
10734A649048N4897K265J8980r7855j73237J2194j39500k13307N6349K02812J95569
10723A568215J71920N3808P666P1368n0454j88827j97079j31510J9994J99548
10713A524649O0803p8791J13433m7642j27132q9584n8711P249j36054o9034N6584
$$ y = [541157, 575554, 501921, 463677, 510778, 465500, 382322, 275825, 341940, 330248, 372675, 453979, 489591, 514220, 398945, 325541, 177931, 161128, 246828, 324393, 364774, 452612, 682889, 769358, 624461, 788077, 717248, 518318, 322800, 369347, 524916, 627673, 642480, 611470, 599524, 555449, 594498, 641419, 649879, 752336, 816077, 959484, 1045076, 1083824, 1117870, 1159002, 1079720, 1043161, 1212774, 1317875, 1231575, 1252068, 1295454, 1425797, 1649048, 1703945, 1706210, 1725190, 1627335, 1454098, 1466292, 1326792, 1113485, 1169834, 1372646, 1568215, 1740135, 1793943, 1801609, 1872977, 1822523, 1633696, 1436617, 1305107, 1325101, 1524649, 1585452, 1506661, 1620094, 1572452, 1445320, 1355736, 1297025, 1304274, 1168220, 1099186, 1155770]
10702A155770J69454M2625p0532J25305O9109j58736j93558L7693r7503j2626
10692A067001N6878Q6541J27322r5616Q807q1258j5447K72159O4337m644Q7009
10681A573089r0666m4166J04107P0157O4034l3100j178K4904J0584j44557m7404
10670A485804N2338J27006J14834K0748q7373K91987J04950j42693J23474K6888
10660B117963k6414K90257q9619l8312J53321K20186Q1176P7288Q3105N2507l6103
10649B885355q8873J75383L96314L38594K36976K45272J71386P1018J37619K90347
10639D859391K68948K96282L35425N74374O53441P14238J028420J018615R42244
10630A0691378R08340R09035J063733J088078J378204J748800K533339L337512
$$ y = [1155770, 1325224, 1367849, 1297317, 1422622, 1491731, 1332995, 1139437, 1177130, 1079627, 1067001, 1123879, 1210420, 1337742, 1242126, 1250933, 1169675, 1154228, 1426387, 1490724, 1486080, 1573089, 1482423, 1438257, 1542364, 1612521, 1676555, 1643455, 1642277, 1667181, 1677765, 1533208, 1485804, 1538142, 1665148, 1779982, 1800730, 1713357, 2005344, 2110294, 1967601, 2091075, 2117963, 2091549, 2381806, 2292187, 2253875, 2407196, 2627382, 2708558, 2785846, 2868951, 2921458, 2885355, 2796482, 2971865, 3368179, 3706773, 3943749, 4189021, 4360407, 4431425, 4569044, 4859391, 5128339, 5424621, 5760046, 6334420, 6987861, 7702099, 8730519, 9749134, 10691378, 11599718, 12508753, 13572486, 14660564, 16038768, 17787568, 20320907, 23658419]
10622B3658419M428772N792696P949130J0867633J3928553J7774424K0932301
10615A05331928K0921057J5626458N800086l355418p387791n877974q75744N992965
10607A36175567J4136166K3705416L3944585M1872244M1166230K6148084n31673
10600C16616619k2982496k9972646k3587535j1649990J791284J5712992L0165128
10593B76093356M4001755N2913605M8097716K2208556j8230478m9237129n5605172
10586C20242209m5199873k9644374j4460156q41581J1926360K2416744K7639599
10579B92078928K2476773L425668k3613397m2409630m3862505l4577738k3314594
10572A50203505j3435509n507441P54611N366195O767523L427606m864763j5166000
$$ y = [23658419, 28087191, 33879887, 41829017, 52696650, 66625203, 84399627, 105331928, 126252985, 141879443, 147679529, 144324111, 136936320, 131058346, 130182602, 136175567, 150311733, 174017149, 207961734, 249833978, 291000208, 317148292, 316616619, 293634123, 263661477, 240073942, 228423952, 230215236, 245928228, 276093356, 320095111, 373008716, 421106432, 443314988, 425084510, 375847381, 320242209, 275042336, 245397962, 230937806, 230096225, 242022585, 264439329, 292078928, 314555701, 317981369, 294367972, 251958342, 208095837, 173518099, 150203505, 136767996, 131260555, 132015166, 137381361, 144148884, 147576490, 142711727, 127545727]
10564A27545727k1466213k1595637j8403082j4060128j0263642p515058n580861
10557B8661106m230825l574666k666937k004704j740639j345565j146884j133093
10549A0817793j149339j011745q18428o10634n64043l18727l79690m74624k81396
10540E209167k28563l75839m87689l26548l58260k90589M620P8701J00522j04036
10530C221486j67079j43010j2111j49960k61544r9289j01560k28398j50467p4113
10520A833955J13992l7283q512j96584m2809Q5705p0927M1001n3701q7450J33440
10509A710827o7891k36386j15024j09650m9237j78611o5610J80420J90298L35594
10499A594730n7743j48087j63279k05220l0292o4569r9651j9672P1409R7010K0935
$$ y = [127545727, 106079514, 84483877, 66080795, 52020667, 41757025, 34241967, 28661106, 24430281, 20855615, 18188678, 16183974, 14443335, 13097770, 11950886, 10817793, 9668454, 8656709, 7838281, 7227647, 6663604, 6344877, 5965187, 5490563, 5209167, 4980604, 4604765, 4117076, 3790528, 3432268, 3141679, 3146299, 3225000, 3325522, 3221486, 3054407, 2911397, 2899286, 2749326, 2487782, 2388493, 2286933, 2058535, 1908068, 1833955, 1947947, 1910664, 1902152, 1705568, 1662759, 1748464, 1677537, 1718538, 1664837, 1577387, 1710827, 1642936, 1406550, 1291526, 1181876, 1132639, 954028, 888418, 1068838, 1259136, 1594730, 1536987, 1388900, 1225621, 1020401, 990109, 925540, 825889, 806217, 877626, 974636, 995571]
10488I95571m0242J74802J04295j04480j82750j59495L9487N8986J61174q0782
10478I66566k79881m3853O3714P380L4509N4386J27348l8467J46408K65459J97784
10467A501353K14199N03017M43790J47330k17823l48678j52366k11656k99848
10458A579318l51481n8812j14850k51782j0471o5650p3844p2363n5272k20293
10448C04500j10138n1856o9546N7605J44273J39945j70839J9879k4008o2175L1653
10437B09293j648j72782q7394J4012O3005N5271R8603P1574K25120l3516M4052
10426D85590o5183k61038m9525K1582Q3356n1782N7880j4184m9997L9939J94464
10415C91102p6647R776l1772k7271l1445j6234r8244L2954L6214O073k08218k8603
$$ y = [995571, 955329, 1130131, 1234426, 1129946, 947196, 787701, 827188, 886174, 1047348, 966566, 686685, 642832, 706546, 713926, 748435, 802821, 930169, 891702, 1038110, 1303569, 1501353, 1715552, 2218569, 2662359, 2809689, 2591866, 2243188, 2090822, 1879166, 1579318, 1227837, 1169025, 1054175, 802393, 791922, 726272, 652428, 580065, 524793, 304500, 194362, 142506, 72960, 130565, 274838, 414783, 243944, 263823, 239815, 177640, 209293, 207645, 34863, -52531, -38519, 24486, 79757, 178360, 249934, 475054, 441538, 485590, 420407, 159369, 109844, 131426, 214782, 163000, 220880, 206696, 156699, 196638, 391102, 314455, 324231, 292459, 265188, 233743, 217509, 119265, 152219, 188433, 194506, -13712, -42315]
10403d2315R1076P4534m6421p1224P6417L0866p3905J9946m1123M4971K06287
10392B69109m8377n47J27351mN2504P3141K04960j75172L709J08945o9706j17896
10380D28017p5436k75126M7616K88963q8291j53674j15260N2823J23549J88462
10370D21643O2888J75902q7470j57225P1565j5926N3067J45077n7391J9509O3470
10359F95109N7815q8288q7954r9309j0530J18961J21744P258j79637j13750K460
10348D23879n9578J41267J7884L8147O7921R6929O7225K1924P4811j78801L612
10337G15220q8957j07205O8706J80652N1755k33838q1602K54238R2640p4705K590
10326G79494J26688J9467J47244J76305J16643K02777L60116K06966J62288K12306
$$ y = [-42315, 48761, 123295, 76874, 5650, 82067, 112933, 39028, 58974, 17851, 62822, 269109, 220732, 220185, 347536, 347532, 400036, 473177, 678137, 502965, 506674, 615619, 545913, 428017, 352581, 77455, 125071, 414034, 325743, 172069, 56809, 109632, 233181, 421643, 484531, 660433, 572963, 415738, 487303, 471377, 524444, 669521, 612130, 631639, 695109, 752924, 664636, 576682, 477373, 466843, 585804, 707548, 714806, 535169, 421419, 423879, 364301, 505568, 523452, 561599, 629520, 726449, 793674, 815598, 890409, 711608, 715220, 626263, 519058, 587764, 768416, 820171, 586333, 504731, 758969, 851609, 776904, 779494, 906182, 925649, 1072893, 1249198, 1365841, 1568618, 1928734, 2135700, 2297988, 2510294]
10316B510294m8251l35707k43552l81109k84998k01751k21010M484J04061r9115
10306H03346j10229k6420j56611L2540j2340j7478M3227o5482j46761L886n8597
10295B89081j8498o1824J48263O7166L046r7703O9488l1576j9702J61534L6709
10284E45984N2365M4962J30601j24988j53208j84086n008j01645l2385J61107
10274C33699N2093M1022O8983J06441j072k2180k9031j15076j09482j24752M727
10263B05372N1613Q7612j6162J2112J21352k3728M6932N3370m2228l5941P8817
10252E39121J47359k09478j08359P0680N0164m233O1993L7673n7785k64680N0152
10241C12607J27041J0899j82389n2904Q2762J17769j9541p3408N072O5946P1195
$$ y = [2510294, 2462043, 2126336, 1882784, 1501675, 1216677, 1014926, 793916, 798400, 902461, 803346, 693117, 666697, 510086, 542626, 530286, 512808, 556035, 490553, 343792, 347678, 289081, 270583, 208759, 357022, 424188, 427234, 329531, 399019, 367443, 347741, 509275, 545984, 598349, 643311, 773912, 648924, 495716, 311630, 306622, 204977, 172592, 333699, 385792, 426814, 495797, 602238, 601166, 578986, 549955, 434879, 325397, 200645, 205372, 256985, 344597, 328435, 340547, 461899, 438171, 485103, 538473, 496245, 460304, 539121, 686480, 477002, 368643, 439323, 489487, 485254, 547247, 584920, 527135, 262455, 312607, 439648, 450547, 268158, 215254, 298016, 415785, 396244, 322836, 327908, 393854, 465049]
10230D65049R7095J72209J50209K7549J65922Q3947P6611J04771K55656K93502
10220A892520R379M2996L69960L19305l4597k36902k94341k13810K3942J36407
10210B014859q6361o3407m2673k10835k96036N2498m9669j42327j03833K43995
10200A316211K5721l7324j23656N3038P199k0951j36628n034n5217r2310k0731
10189I10318M8659j28102K7589K32274P5034O1130R0129o2448j07431M04231K17402
10178A768785j20592j0251P4847j55664j64094O3730J5062K2856K17226L63687
10168B075592K44170J44192J55007R2154k6979q4245l66947j97225J77729O8746
10158B282194J09788K90218K08151J65022L46555J73179j7505k25113k72586m18320
$$ y = [465049, 562144, 734353, 884562, 912111, 1078033, 1161980, 1238591, 1343362, 1599018, 1892520, 1901899, 1944895, 2314855, 2634160, 2599563, 2362661, 2068320, 1854510, 1878452, 2014859, 1928498, 1865091, 1822418, 1611583, 1315547, 1368045, 1318376, 1176049, 1072216, 1316211, 1341932, 1304608, 1180952, 1233990, 1241189, 1220238, 1083610, 1078576, 1023359, 931049, 910318, 958977, 830875, 858464, 1090738, 1165772, 1226902, 1317031, 1254583, 1147152, 1551383, 1768785, 1648193, 1637942, 1712789, 1557125, 1393031, 1456761, 1471823, 1494679, 1711905, 2075592, 2319762, 2463954, 2618961, 2711115, 2684136, 2599891, 2232944, 2035719, 2213448, 2282194, 2391982, 2682200, 2890351, 3055373, 3401928, 3575107, 3557602, 3332489, 3059903, 2641583]
10148B641583j78118m7306l6424J21229J84835R6298J89323J27994j57808l30486
10138B611120k12332j75153l7367j7107J39900J85381j03585l3333J28068N8199
10128B543791J18135n0304j9566q6603q8013P6332J07177K06817M5974K7916J68496
10117C050152J34417j16847n4422Q7119K44650K52593o0966P3776L54919J68053
10107D133444J07197K53878K97737K10206K01648Q1305K01856J43103K75652M37542
10097F343568P11446P58742P69360O40142Q70850J105171J386047J518447J605076
10088A5708849J663379J958367K055996K226086K190206K461344K951358L520387
10080C4735972M225242N507553P619733J0537096J4773432K1047595K9986303
$$ y = [2641583, 2463465, 2416159, 2379735, 2500964, 2685799, 2782097, 2971420, 3099414, 2941606, 2611120, 2398788, 2223635, 2186268, 2169161, 2309061, 2494442, 2390857, 2357524, 2485592, 2543791, 2661926, 2611622, 2592056, 2505453, 2417440, 2493772, 2600949, 2807766, 2853740, 2881656, 3050152, 3184569, 3067722, 3013300, 3100419, 3345069, 3597662, 3536696, 3610472, 3965391, 4133444, 4240641, 4494519, 4792256, 5002462, 5204110, 5285415, 5487271, 5630374, 5906026, 6343568, 7055014, 7813756, 8583116, 9223258, 10094108, 11199279, 12585326, 14103773, 15708849, 17372228, 19330595, 21386591, 23612677, 25802883, 28264227, 31215585, 34735972, 38961214, 44468767, 52088500, 62625596, 77399028, 98446623, 128432926]
10073A28432926M2312168N6375317O6697970O4334090M3218816J5094254k921634
10066D13543907j2081226k6271147m5167964n9771473o2480530n1506458l7150801
10059A19114308k5705503j8055936j3200407r691736p240065n474192m128131
10052C5618338l286285k803461k487369k331188k336446k060111j780241j810199
10044A6723038j823434j396618j307166j122194r91287p01829o84646o38949o14348
10035G442567n70201l71838l31961l67106l94693l03450j62780l60862j75261
10026D404415q8963O9723j20832j78839q9358j60391k5349J09761j49590m09475
10016C361102j37548L0945j60951j51156K0254n6672o5016Q6572j3865p9865L8445
$$ y = [128432926, 170745094, 227120411, 293818381, 358152471, 401371287, 416465541, 413543907, 401462681, 375191534, 330023570, 270252097, 207771567, 156265109, 119114308, 93408805, 75352869, 62152462, 52460726, 45220661, 39746469, 35618338, 32332053, 29528592, 27041223, 24710035, 22373589, 20313478, 18533237, 16723038, 14899604, 13502986, 12195820, 11073626, 10082339, 9380510, 8695864, 8056915, 7442567, 6872366, 6500528, 6168567, 5801461, 5406768, 5103318, 4940538, 4579676, 4404415, 4315452, 4385175, 4264343, 4085504, 3996146, 3835755, 3810406, 3920167, 3770577, 3361102, 3223554, 3254499, 3093548, 2942392, 2962646, 2905974, 2840958, 2927530, 2913665, 2833800, 2872245]
10005B872245p5350k9864j09585m9893O3577P1506j45207p9988O131R3560Q8825
9994B705957L5462j83141N4678P9653Q939l0314r3324p5601M7219O3303J81082
9983B793913J75743J1025j15923O1950K7415J25857J23992k4390O640j43952K7259
9972C069529J34587R6387J86751J69520O6834J84643J26390j06901n1021L3914
9962C910633J80541K40902L52040J83513l1687M0001K30486L47327M09502K81152
9952F144410L89142K69718L33143O29624M95257L81731K95415M95135N86617N06944
9942A0527136R16123R32341Q98071J198541J436849J488947J672596K016919K368460
9933B3455983K476760K630702L096180L154048L818362M769591N897793P419206
$$ y = [2872245, 2796895, 2767031, 2657446, 2607553, 2671130, 2742636, 2597429, 2517441, 2523572, 2617132, 2705957, 2741419, 2558278, 2612956, 2692609, 2701548, 2671234, 2577910, 2502309, 2549528, 2612831, 2793913, 2969656, 2980681, 2864758, 2926708, 2954123, 3079980, 3203972, 3179582, 3186222, 3042270, 3069529, 3204116, 3300503, 3487254, 3656774, 3723608, 3908251, 4034641, 3927740, 3876719, 3910633, 4091174, 4332076, 4684116, 4867629, 4835942, 4875943, 5106429, 5453756, 5863258, 6144410, 6533552, 6803270, 7136413, 7766037, 8261294, 8643025, 8938440, 9433575, 10020192, 10527136, 11443259, 12375600, 13273671, 14472212, 15909061, 17398008, 19070604, 21087523, 23455983, 25932743, 28563445, 31659625, 34813673, 38632035, 43401626, 49299419, 56718625]
9925E6718625R431203J1993742J5381442J9893646K5753397L2798004M1039810
9918B13009869M8915292N2762401M7022998K7475928l315427l3586336n0668502
9911C01616223n2856829m6669478l7929579k9923968k3336300j8135488j4307914
9904G8456667j1255548r099870p607624o021205m890938m028077l210310k884441
9896B9458654k380975k156435j746105j632873j673991j756193j656876j183243
9888A5271963j225128j175996j043973q41843o78373o37273n60713m24796o87045
9879G996823l75855k47581k95278r8386j88431k45012l17993l95271k19130k51277
9869E362609k55389l35075k90015k839k98715M3147l0221j23239j63853k61787
$$ y = [56718625, 66149828, 78143570, 93525012, 113418658, 139172055, 171970059, 213009869, 261925161, 314687562, 361710560, 389186488, 385871061, 352284725, 301616223, 248759394, 202089916, 164160337, 134236369, 110900069, 92764581, 78456667, 67201119, 58101249, 50493625, 44472420, 39581482, 35553405, 32343095, 29458654, 27077679, 24921244, 23175139, 21542266, 19868275, 18112082, 16455206, 15271963, 14046835, 12870839, 11826866, 10985023, 10306650, 9669377, 9108664, 8683868, 7996823, 7620968, 7373387, 7078109, 6979723, 6791292, 6546280, 6228287, 5833016, 5613886, 5362609, 5107220, 4772145, 4482130, 4479291, 4180576, 4223723, 4193502, 4070263, 3906410, 3644623]
9859C644623j30692j48612k42949l18417k29007n3990O3338l2783M5937J11458
9849B708906R629j95264j47652l3866j57942L8130j11554j75276m1537n617j38052
9838A749905j37343O0168P2859o8466j06115M9323o9978M5827j19639l3403M419
9827A447557J13863M7304n3636j14334J8981O7196j68057k02182j57233P7314
9817A076773K7731N1210j20715j24057J12170N5660N4946J809r9677l1444J18254
9806A122660J19898n4365k5495k1510j19898j51279J7137O8230N3728j35665L3407
9795I06848K34332N523j26742j64538J49179j22898j43709j81370M3202j45943
9785D53884j02119J62559K9145j15555l1876q2903p1972k2091N8296k05796J42368
$$ y = [3644623, 3513931, 3365319, 3122370, 2803953, 2574946, 2520956, 2584294, 2551511, 2597448, 2708906, 2718535, 2523271, 2375619, 2341753, 2183811, 2221941, 2110387, 1935111, 1893574, 1887957, 1749905, 1612562, 1672730, 1745589, 1677123, 1571008, 1620331, 1550353, 1596180, 1476541, 1443138, 1447557, 1561420, 1608724, 1555088, 1440754, 1459735, 1526931, 1358874, 1156692, 999459, 1076773, 1104504, 1155714, 1034999, 910942, 1023112, 1078772, 1133718, 1135527, 1035850, 1004406, 1122660, 1242558, 1188193, 1162698, 1141188, 1021290, 870011, 887148, 955378, 1009106, 873441, 906848, 1141180, 1146703, 1019961, 855423, 1004602, 881704, 737995, 556625, 599827, 453884, 351765, 514324, 543469, 427914, 396038, 313135, 241163, 219072, 277368, 71572, 213940]
9774B13940K19946j41481j73321j45406j25230k8451L4850Q6557J15980J64695
9764B22079J16712k5385O3190rm1541j18415k3898Q3380r8376P6207p510K3095
9752B69529J817n9191J01768k5036m075K17093K02011q3390k27585P411k690l5091
9740C62571J00786K2419k9296k8600n9070m3052o6651m2297N3751M2426m044K36672
9728E45615O0578j95847M2243p5408n4468L7690J44218k8665j45342n6446n7095
9717B17073k5754l112q3516J34150L16680J36803k39803j25594k2505K8175o472
9706C26125K7998J21537p8476M425O4333l4820m1710j68871J04830J04238l4620
9695C94989n3876n5011m6166q4422l7157N7927O6287M6893j34855J12920K12475
$$ y = [213940, 433886, 292405, 119084, -26322, -151552, -180003, -145153, -58596, 57384, 222079, 338791, 313406, 376596, 376587, 335046, 216631, 192733, 276113, 177737, 253944, 246434, 269529, 271346, 212155, 313923, 288887, 284812, 501905, 703916, 620526, 392941, 400352, 397662, 362571, 463357, 485776, 456480, 427880, 368810, 325758, 259107, 216810, 270561, 312987, 308943, 545615, 606193, 410346, 452589, 377181, 322713, 360403, 504621, 475956, 330614, 274168, 217073, 191319, 188207, 104691, 238841, 555521, 692324, 452521, 326927, 304422, 332597, 326125, 354123, 475660, 397184, 401609, 465942, 431122, 389412, 220541, 325371, 429609, 394989, 341113, 286102, 239936, 155514, 118357, 176284, 242571, 289464, 154609, 267529, 480004]
9684D80004K9077J32516L0856k43229o1388J88314M5530o1491k0215J96754j6050
9673G00678M4110K46440K88389J95968L30004L97460J41143J4977M2971o1939
9663B340201j79956l36064l04928k71484l57737l27789K2233K00246j17675j87692
9653D79355J8792J55179p3631K8760j64933j24628J09506R767o934q0428j74805
9642A76000L114k8385r2452P9883P8539o6807J56134k6642N3700J85477j65490
9631C53071q8987k04904M7000K04413K1722p5076K8953K9949M0757p4129r1800
9620A90969r4897L22032N8031n7868k50884k4762K7789l3176N3812N181k25688
9609b9461l5009q9293J21443Q6761k4464R7346J45751K4692J7895p164p8627j91183
$$ y = [480004, 509081, 641597, 672453, 429224, 367836, 556150, 601680, 540189, 519974, 716728, 700678, 744788, 991228, 1279617, 1475585, 1805589, 2203049, 2344192, 2359169, 2402140, 2340201, 2160245, 1824181, 1519253, 1247769, 890032, 562243, 584476, 784722, 667047, 479355, 498147, 653326, 579695, 608455, 443522, 318894, 428400, 438167, 431233, 350805, 176000, 179114, 150729, 58277, 138160, 216699, 149892, 306026, 279384, 333084, 518561, 353071, 264084, 59180, 106180, 310593, 332315, 257239, 286192, 316141, 356898, 282769, 190969, 96072, 418104, 476135, 418267, 167383, 142621, 170410, 137234, 191046, 196227, -29461, -64470, -153763, -32320, 54441, 29977, 127323, 273074, 297766, 315661, 308497, 229870, 38687]
9597C8687j20418L603J90208K8842j34228j17202J13114J86947O0214Q8474R5652
9586D33893j53912m6425j40211j20876n3728K0539J96811M1564O7177N9921K2607
9575C27360K3552J69155m184P0292j6208Q0678m6611n8896Q3433Q8742p8656j16290
9563E22367j20758K14263J96847k07012J09501k5317q4160J24960N7171J07004
9553H94866J53502q3142l896K12920J26611J4430J5316j22826k17296l0215r706
9542I50564p2285j24126L8088j37792j92827l0926N3440J38472n576k0241m0117
9531E56674j10325r8953K4680N095O251P2769o7801o3739O7030J43251n0734r1059
9519C93139R4900K16690J64300j16982J50380N8496J15639L9181J82647L09015
$$ y = [38687, -81731, -78128, 112080, 140922, 6694, -110508, 2606, 189553, 249767, 338241, 433893, 279981, 233556, 93345, -27531, -81259, -60720, 136091, 177655, 244832, 304753, 327360, 350912, 520067, 515883, 586175, 569967, 650645, 604034, 545138, 628571, 717313, 638657, 522367, 401609, 615872, 812719, 605707, 715208, 689891, 605731, 730691, 787862, 894866, 1048368, 965226, 961330, 1174250, 1300861, 1315291, 1330607, 1207781, 990485, 960270, 950564, 878279, 754153, 792241, 654449, 461622, 430696, 484136, 622608, 617032, 596791, 556674, 446349, 347396, 372076, 377171, 383422, 456191, 388390, 324651, 391681, 534932, 484198, 393139, 488039, 704729, 869029, 752047, 902427, 960923, 1076562, 1115743, 1298390, 1607405]
9509A607405J96097K39774K41888l3730k62907k28539m34616k11088j30791k38505
9499G44988n3977p1401r9778J28292p5398J5793n8280p1176l9744j0830J0143
9488D18632l5813J10316j63385k08317N7177k8823K2250l2212J26872K28494j14136
9477C81055j41792J79410J08310j17717j02732k2249J18535J8344j43593q5213
9467A92358J07656Q753Q2197p9671K6141M5848j30953k33462p7183m5832Q3860
9456b0288m3703N4213O8447R2481N0466m7743J88566j17914k51775O4793R1938
9445A29481K4233J58489J7488j50646j5691k1659r5355Q1024K88725o569l3264
9434C76256m5299k03762j37076K53817J87815R3551r9811L2580k30421k59179
$$ y = [1607405, 1803502, 2043276, 2285164, 2251434, 1988527, 1759988, 1325372, 1114284, 983493, 744988, 691011, 619610, 519832, 648124, 572726, 588519, 530239, 459063, 419319, 408489, 418632, 382819, 493135, 329750, 121433, 178610, 149787, 172037, 139825, 266697, 495191, 381055, 239263, 418673, 526983, 409266, 306534, 284285, 402820, 421164, 277571, 192358, 300014, 308767, 390964, 311293, 337434, 383282, 252329, 18867, -58316, -104148, -20288, -63991, -9778, 58669, 151150, 201616, 153873, 342439, 224525, -27250, 37543, 129481, 153714, 312203, 329691, 179045, 163354, 141695, 46340, 127364, 416089, 409520, 376256, 330957, 127195, -9881, 243936, 431751, 525302, 425491, 458071, 227650, -31529]
9424c1529P8119O2407m2756J12010N3372K4951J34673j60009j51809J45614R8879
9413C23922N8942O8496l689q8630p2584j23669m866Q4707l4655r717q2346q5530
9401C0381o070L6733R176R9811J36696J09993l5524K7235O4314l2666P64p2892
9389C67951j5394o7348J80332J43889j22130k08734j28265K4776J06778Q727K981
9378B93563q8312n8931J23797K34452n3259j77713j05405o1458L0219R6334J83256
9367D16543K92k00396Q918P9983j35118r7035j6737J18923K9924j32464p4488
9356a655L9404l0030N7541K5790J19243j03491j24656k4542J07312J33635J14044
9345C12595O6320j43292j48561J3677J21550O1959j41059m6580O1636J68893M9129
$$ y = [-31529, 46590, 108997, 66241, 178251, 231623, 256574, 391247, 231238, 79429, 225043, 323922, 382864, 451360, 447671, 359041, 286457, 162788, 157922, 242629, 207974, 198257, 115911, 30381, 24311, 61044, 70220, 170031, 306727, 416720, 381196, 408431, 472745, 440079, 440843, 367951, 352557, 285209, 465541, 609430, 487300, 278566, 150301, 175077, 281855, 290582, 293563, 205251, 146320, 270117, 504569, 451310, 273597, 168192, 106734, 136953, 233287, 416543, 416835, 216439, 225357, 305340, 170222, 73187, 56450, 175373, 205297, 72833, -1655, 37749, 7719, 65260, 91050, 210293, 106802, -17854, -42396, 64916, 198551, 312595, 378915, 235623, 87062, 100739, 222289, 284248, 143189, 96609, 158245, 327138, 376267]
9334C76267j50568l0542M9641p8864L3543J31558k3445M376M9864L8356N2861
9323D53047M6665q937J20656r1600k22052o4646J35801J20979p3056k34487l62622
9312a80252O7387o9267J09350J09344k9143o3771J44249J6300O2559K04669J35283
9301E06708n1362j26568q7287j61717Q9358J05407J8770p8626k24258L6281L8730
9290F5436K8395K6550o870o2026M826R9116J05310l3984K1011j21666q6549Q2696
9278A22245m2360j20963q167J43794q3538O9603L2389r1119K0079N2433J91321
9267B85717J88248q4224j63625O7993J25375o130j66199j81266l9107k6484J8314
9256A8612l3217R5536J03863j70607k5977J4088l7637J01467J2722J08208M0131
$$ y = [376267, 225699, 195157, 244798, 165934, 199477, 331035, 307590, 311966, 361830, 400186, 453047, 499712, 490775, 611431, 519831, 297779, 233133, 368934, 489913, 416857, 182370, -180252, -112865, -182132, -72782, 36562, 7419, -56352, 87897, 104197, 166756, 371425, 506708, 455346, 328778, 241491, 79774, 169132, 274539, 293309, 214683, -9575, 26706, 65436, 93831, 120381, 113511, 51485, 56311, 155427, 260737, 226753, 247764, 126098, 39549, 122245, 79885, -41078, -49245, 94549, 11011, 80614, 113003, 21884, 41963, 94396, 285717, 473965, 389741, 226116, 294109, 419484, 413354, 247155, 65889, 26782, 298, 18612, -14605, 80931, 184794, 14187, -11790, 2298, -35339, 66128, 78850, 187058, 227189]
9245B27189o7736j07708J40583Q5329l0443j01996l751L5669k3384o062m2408
9234A05282k28135k9960J07831O7234J53645k6989M4426J8001n4185r4785q7045
9223b4680q1125k4067o050N4223M5071L6429Q874N4852J95703J55173j31176m1303
9211B41924J07891O7048k24077l03531j03715J08902l9597N5383K11016O3890
9201A85134q0495L9386o9761p0086R4954j53296j16816j48667L9060J21808j11234
9190b70013J11853J47500o1727Q142M8501n7593P341j03608M797J12178J04547
9179E1918q9292j12016k9094K31929N9215J04549m8184m1607j39305M3230j03057
9168g1714m0877K7417K9530J1225N5320K9367n3522q4847n9893j00346L914J62729
$$ y = [227189, 159453, 51745, 192328, 277657, 247214, 145218, 141467, 177136, 153752, 147690, 105282, -122853, -152813, -44982, 22252, 175897, 148908, 193334, 211335, 157150, 62365, -24680, -105805, -129872, -135922, -81699, -36628, -199, 8675, 63527, 259230, 414403, 283227, 241924, 349815, 416863, 192786, -110745, -214460, -105558, -145155, -89772, 121244, 185134, 104639, 144025, 74264, 4178, 99132, -54164, -170980, -319647, -280587, -158779, -270013, -158160, -10660, -72387, -64245, -15744, -73337, -65996, -169604, -164807, -52629, 51918, -37374, -149390, -178484, 53445, 112660, 217209, 169025, 127418, -11887, 31343, -71714, -112591, -85174, -55644, -44419, 10901, 40268, -13254, -98101, -157994, -258340, -254426, -91697]
9156i1697J53936O3988n0120J1552r27r4175k6019P0467J16931J27108l0642j72901
9144G7501q4518Q7376M6766p3244Q3604J21551j00368k5458J4038r4301J5202
9133F8149M8592r3897K9173Q5676j79245j91140J8429m5038K47870K72233L8610
9122B99412m2045l29843o4239Q0866L6283L1351o2159J6792N3417k2062m705k90098
9110b97030j13477o298J09957N4145L064K23438J89339q4292j06526j66605m8234
9099b42519P4788P8042J21939M7281l3504j05369M1648M1572j13326j46021j31558
9088c67027O0502Q5810j5254J20667J53420k02323M910J12865P2797o0258K1704
9077a2187j25386q1035j10479j01114r563J86126R2477l9031L5499P5276k9088
$$ y = [-91697, 62239, 126227, 76107, 87659, 86732, -7443, -33462, 37005, 153936, 281044, 250402, 77501, -7017, 80359, 127125, 53881, 137485, 259036, 158668, 133210, 147248, 52947, 68149, 116741, 22844, 52017, 137693, -41552, -232692, -214263, -259301, -11431, 260802, 299412, 257367, -72476, -136715, -55849, -19566, 11785, -50374, -33582, 19835, -2227, -6932, -297030, -410507, -416805, -306848, -252703, -249639, -26201, 163138, 78846, -27680, -194285, -242519, -167731, -89689, 32250, 79531, 46027, -59342, -17694, 23878, -89448, -235469, -367027, -306525, -220715, -235969, -115302, 38118, -164205, -159295, -46430, 26367, -33891, -12187, -137573, -218608, -329087, -430201, -439764, -253638, -161161, -200192, -164693, -89417, -118505]
9066a18505J46597M6919J18611J58k08460N6602r8066o3241M5909k44479O9361
9055b48594K35826L4323n1504q1038R8381K01271J2274l0523n4446M4868l6166
9044A24672r8022j41485J8889j30674l0074J88639J14131l4662p3235r0797j10140
9033b62758m5782J99984K04720M2198m9587o043q8126j48984l9804n0374O8971
9022a75585l4942M5308j5048N1879O1305J29155p5682j74414o8883J32667J19322
9011d918J54053M3422m3235o4341R2117M5589p4799R0337L6573j7280p7241j73463
8999F814j09540r1115Q2837q019L8288k3072l664J151Q6981N0944j0664n8912
8987c7971p1150j11116K36249M9195j94653j95080l9773J0459p4562K00030J63091
$$ y = [-118505, 28092, 75011, 193622, 193780, -14680, 41922, -56144, -119385, -73476, -317955, -248594, -12768, 21555, -29949, -110987, -12606, 188665, 200939, 170416, 115970, 160838, 124672, 26650, -114835, -95946, -226620, -256694, -68055, 46076, 11414, -61821, -152618, -262758, -308540, -108556, 96164, 138362, 88775, 82732, -5394, -154378, -194182, -244556, -175585, -210527, -165219, -180267, -128388, -67083, 62072, -13610, -188024, -256907, -124240, -4918, 149135, 192557, 149322, 84981, 177098, 222687, 147888, 238225, 274798, 257518, 180277, 6814, -102726, -193841, -111004, -119023, -80735, -103807, -107471, -106320, -19339, 31605, 20941, -37971, -109121, -220237, 16012, 65207, -129446, -324526, -364299, -353840, -428402, -228372, -65281]
8976f5281J66391J5733k06281k01777n8826L4185L345j10636j9971K8518K01321
8965b13279J95437J78109p971o4280J27430q5440j91888j22570j10126m7813J79968
8954a62423R9218O455j07517j2223q0326J66626J39600j28117j33138j4019J29170
8943i6694l3847j54347K6613M623J7905J11989k8292O7875M0312r4812j8457j05786
8931b62918J63360M0682j42218N8442Q8762r0770n6578K2141K31974K4404j96237
8920a18956p3676L243M319q8293L1204L8696Q9695M1251M3634Q1619J86134p9349
8908A59521J1135r1829j36101p5678O1657L4384n836k1430O4406O7945n0170J51881
8896A69885J13619k79792k60316r7229p285j36671L9425J55014K37052J60977
$$ y = [-65281, 101110, 116843, -89438, -291215, -350041, -315856, -312511, -423147, -443118, -414600, -213279, -17842, 160267, 152296, 88016, 215446, 130006, -61882, -184452, -294578, -342391, -162423, -63205, -56750, -164267, -176490, -256816, -90190, 49410, -78707, -211845, -225864, -96694, -130541, -284888, -258275, -253652, -235747, -123758, -152050, -84175, -43863, -138675, -157132, -262918, -99558, -58876, -201094, -142652, -53890, -144660, -201238, -179097, 52877, 77281, -118956, -192632, -189389, -185070, -273363, -242159, -203463, -113768, -72517, -28883, 52736, 238870, 159521, 170656, 78827, -57274, -132952, -71295, -36911, -42747, -64177, 229, 68174, 18004, 169885, 283504, 3712, -256604, -353833, -361118, -497789, -458364, -303350, -66298, 94679]
8886I4679k4841m5618j8409j36970o1809J9755O3328k244m0085N5930K3173k12165
8874b85276k6554K00037M6054j28140o4750J2515J27153o2736l2999J49229J61960
8863I6493r0807l1124q3330l453o068j50312k8699P7743K5078J03224J0076j01504
8851a82683Q6995P1285k8588N3885L1784M7751j2187j04185m7734n9410l0112
8840a73199K6481R7858p21j03893J16205L9734k2527M2580j03009j73530j66258
8829d20279J27231J93634L2598m8151n4874J10027l3370j34288J62568N9456j188
8818f636N2523l7985p4947j08169O3002L7488n4569p0393p4247J04697J3291k9027
8806a84972j3390K6420n2010K8107P374K34872j26060l9872L1880L2637j3866
$$ y = [94679, 69838, 24220, 5811, -131159, -192968, -173213, -109885, -112129, -152214, -96284, -73111, -285276, -311830, -111793, -65739, -193879, -258629, -246114, -118961, -181697, -214696, -65467, 96493, 5686, -25438, -108768, -112221, -118289, -268601, -297300, -219557, -194479, -91255, -81179, -182683, -95688, -24403, -52991, 894, 32678, 80429, 68242, -35943, -83677, -143087, -173199, -146718, -48860, -49581, -153474, -37269, 2465, -20062, 22518, -80491, -254021, -420279, -293048, -99414, -66816, -114967, -169841, -59814, -93184, -227472, -64904, -5448, -6636, 45887, 7902, -67045, -175214, -112212, -74724, -129293, -199686, -273933, -169236, -155945, -184972, -198362, -171942, -223952, -195845, -188471, 46401, -79659, -119531, -87651, -55014, -68880]
8795f8880m1002J7021J162j81447J32776J19837J15382p2284m3115Q2253N4283
8784A15986L7676P4855K9609J4614k87925j25693K7802O4671j0660n6256K1937
8773i3384J5888K1814m1925K9593m942J33323J06580k499j49229j60377P321K03020
8761F5183j3691j19335m1885J01940Q4590j2980m3770r3967J24998K4764L2726
8750A08573J42112M5203k8553n5677m3080m9744M0620N8991N5627p0252k41532
8739c7712j54937l4074P5225l5438P7802j8210O6727j90311O406K14248P4486
8728D4212K7941P4017P2270j50363J21773O3200j10790j15226n9514J78162J9904
8717A65586r5505o1612q7740j383O3655Q1151J71786j64005j03013K4926l0323
$$ y = [-68880, -109882, -92861, -91699, -273146, -140370, -20533, 94849, 22565, -20550, 61703, 115986, 153662, 228517, 258126, 272740, -15185, -140878, -113076, -48405, -59065, -115321, -93384, -77496, -55682, -97607, -68014, -72956, 60367, 166947, 164448, 15219, -145158, -137837, 65183, 51492, -67843, -109728, -7788, 76802, 63822, 20052, -73915, 51083, 75847, 108573, 250685, 295888, 267335, 211658, 168578, 118834, 159454, 218445, 274072, 203820, -37712, -192649, -226723, -151498, -186936, -109134, -127344, -60617, -250928, -244522, -30274, 44212, 72153, 146170, 218440, 68077, 189850, 253050, 142260, 27034, -32480, 145682, 165586, 70081, 8469, -79271, -80654, -16999, 64152, 235938, 71933, -31080, -6154, -36477]
8706c6477Q5984J47575o6015j10667j57377j50601j5055r5532P113K28924M0942
8695a21186K3296R0860r6040o7208J1800l0345M6835N6515o220K56304O319k81920
8683a10990k16439J5397J89287J56212r4162O0567Q4451K1679l706q6987K7032
8672D2341m112J81559m6746l8578K6766o3596m7750j8657N6329J73750J20843
8661C82149k73220k56119P9412J28755p7792j7812K2514k9746r0607j93882N583
8650c20765J95613M6228m045J2760l9224J50284j8679j06237L1198O9039J78033
8639A94205N6949k00522k4599O7125K1358M3605k6725l0062j06102m5716j6714
8628f7198m3612Q7565P4245J1096L1990n3055j35454J2579j03195O9728K8966
$$ y = [-36477, 49507, 197082, 131067, 20400, -136977, -287578, -302633, -398165, -391052, -162128, -121186, -97890, -7030, -103070, -170278, -158478, -188823, -141988, -85473, -91693, 164611, 170930, -110990, -327429, -312032, -122745, 33467, -60695, -128, 84323, 106002, 102296, 15309, 42341, 38229, 219788, 173042, 134464, 161230, 97634, 49884, 31227, 87556, 261306, 382149, 108929, -147190, -67778, 60977, -16815, -34627, -12113, -41859, -132466, -326348, -320765, -125152, -78924, -82969, -70209, -109433, 40851, 22172, -84065, -52867, 16172, 194205, 251154, 50632, 26033, 93158, 114516, 158121, 131396, 101334, -4768, -50484, -67198, -110810, -23245, 51000, 62096, 94086, 41031, -94423, -81844, -185039, -115311, -86345]
8617h6345J17201J19589R2735j40371o3404p0218L487j3352J59941R9831o5684
8606A53410J2786K2825K3569q9336k62447k9378J84766N4022N4617l622o6156
8595E5056Q4309Q1395R925J02043j5280m3968o1961o7773n3323k7036K0824Q660
8583I2871M3405N0644J6738J07712L577j49149m829j39703R2851L2893k1307m4611
8571H1092l0288l688J70292J00728J24666j9285j05733j79490j47296J8788l7194
8560b7408Q1243q5897O3781r8879L062J08254j34694q7003J01719k690n5117J96684
8548F3055J13773n8119J6392P0950q7680J3314m2303J7747q910k276L0726m1863
8536H4806J52912p7077j02792o8641m5327m2074j447J10874r420j15859j04671
$$ y = [-86345, 30856, 150445, 243180, 102809, 39405, -30813, -27326, -40678, 119263, 219094, 153410, 166196, 189021, 212590, 123254, -139193, -168571, 16195, 70217, 124834, 121212, 55056, 139365, 220760, 230685, 332728, 317448, 273480, 211519, 143746, 90423, 63387, 84211, 92871, 136276, 186920, 203658, 311370, 314947, 165798, 160969, 21266, 114117, 147010, 125703, 81092, 50804, 47116, 217408, 318136, 442802, 423517, 317784, 138294, -9002, 9786, -27408, 53835, -32062, 31719, -67160, -64098, 44156, -90538, -177541, -75822, -78512, -133629, 63055, 176828, 118709, 135101, 206051, 118371, 131685, 89382, 107129, 98219, 95943, 126669, 84806, 237718, 160641, 57849, -10792, -56119, -98193, -99640, 11234, 1814, -114045, -218716]
8525b18716M3173p8306P3438Q7782J0133O6860J58010J26262k08287j36057o4215
8514a39923j42935O4571k8107J41343J89325J81204k9397l04596J2661K1065j701
8503c6490j74423M9910J28766k0265j7723j2370J30l6946q06m1165L20576Q855
8491A68049l0831J27430P2432j44809l9905j03455m9013L2050j5663R809J83442
8480B09536j9225k43044k12359P1445J23865P5082L4206k8294r8865o2821N2145
8469i8329j56986k03741J55263J7008m9685Q4549K30863O3642j688K4673J828
8458F7397k2895m9201J58287J61168j71279N4603J37238J17981N3381k66317j90238
8447E0125j2279L4998l4312K4555p2777j04414P0629K0065J09566j85914r6400
$$ y = [-218716, -175543, -253849, -180411, -92629, -82496, -15636, 142374, 268636, 60349, -75708, -139923, -282858, -218287, -246394, -105051, 84274, 265478, 236081, -68515, -55854, -34789, -36490, -210913, -161003, -32237, -52502, -70225, -82595, -82465, -119411, -120217, -161382, 159194, 168049, 137218, 264648, 337080, 192271, 152366, 48911, -102, 31948, 16285, 26094, 209536, 190311, -52733, -265092, -193647, -69782, 5300, 39506, 11212, -87653, -150474, -98329, -255315, -459056, -303793, -286785, -336470, -251921, -21058, 42584, 40896, 65569, 67397, 44502, -4699, 153588, 314756, 143477, 198080, 335318, 453299, 506680, 240363, 50125, 37846, 72844, 38532, 63087, -9690, -114104, -43475, -23410, 86156, -99758, -196158]
8436a96158Q4631N3600J52067O2247o4249L206Q6443l9730j54044j00930O4059
8425d8858O9956j42564n4191J59390n1398j17894K12677N206J09402n5668j04292
8414a8234M0044Q036k2458m5147J6985R582L3177M330l4671m5535k3369L9838
8402c7422n8474O4800O3613o8092J3575M6638p8215o9875K44308P6671P831j49801
8390E5557o8033O1983R1732N3895O2778K9708j19350m8730j0946p7569r7836m973
8378g1784J3245Q478k3148J49901L9920m6627j48761j31045M8042L7276o0517
8367a85020R6480J41827M9570p3655q2960j92558m6001J08928k6910k15348P6893
8356c48754J59935J15723J22700m387n2502Q160J67036k5523j53421J66477j99298
$$ y = [-196158, -111527, -57927, 94140, 156387, 92138, 95344, 181787, 142057, -11987, -112917, -48858, 21098, -121466, -175657, -16267, -67665, -185559, 27118, 32324, 141726, 86058, -18234, 21810, 29846, 7388, -37759, -20774, -11192, 21985, 26315, -8356, -53891, -77260, -37422, -95896, -31096, 32517, -35575, -22000, 24638, -53577, -123452, 120856, 197527, 205358, 55557, -12476, 49507, 141239, 195134, 257912, 287620, 168270, 119540, 108594, 31025, -66811, -71784, -58539, -50061, -73209, 76692, 116612, 69985, -78776, -209821, -161779, -124503, -185020, -88540, 53287, 102857, 29202, -53758, -246316, -292317, -183389, -210299, -425647, -348754, -188819, -73096, 49604, 45217, -7285, 875, 167911, 142388, -11033, 155444, -43854]
8345d3854q5997n7549L4721k653K3586P0271J02929l0617l0052Q4643J71440j18970
8333A17898J11221J93721j50130k32551p7435Q1574K7450O492J0968O2456j04848
8322D6816r2636J6753p7961P6898l9639j13417M7711o7060j09511J7305J3809
8311b80932J39979P5062m3850M2278k0269n1565J02184q4682R9417Q2050L2857
8300I2529J36796p6720P26p1379j4090J34248R358J9820k26239R0580J8960l9238
8288G5351J9779K5896n7827L2428n4996l09724J49439J69197M1285k49877p6571
8277b35620J42135p2570j43971K5869J90174K3030l3911p3924l132k08042N4378
8266c35584O8719O1706K35861J25502j86440J0612p4966P8701p3611m9396J50453
$$ y = [-43854, -129851, -187400, -152679, -155332, -131746, -61475, 41454, 10837, -19215, 65428, 236868, 117898, 229119, 422840, 272710, 40159, -37276, 44298, 71748, 78240, 89208, 151664, 46816, -45820, -29067, -107028, -30130, -69769, -183186, -135475, -202535, -312046, -294741, -280932, -140953, -65891, -109741, -67463, -87732, -139297, -37113, -121795, -22378, 59672, 92529, 229325, 152605, 153331, 81952, 67862, 202110, 211468, 231288, 5049, 95629, 114589, 75351, 95130, 121026, 63199, 95627, 40631, -269093, -119654, 49543, 90828, -159049, -235620, -93485, -166055, -310026, -284157, -93983, -70953, -104864, -178788, -181920, -389962, -335584, -266865, -205159, 30702, 156204, -30236, -19624, -94590, -15889, -89500, -138896, 11557]
8255A1557N0209j29322m7068J15129R5975q745N5153k5430l1876R9862M5357K270
8243B33071p1080o4972k6722p6582K2323P7761K2771j52343j22470j00499k7866
8232b86608K60432J35932n6709l0419o3969J6370J6153J66853j21867k09364R5257
8221g7939k6738M0006J16616M2532q4145m3051K2970j45859j28509J44219J16945
8210b2953P0213J5437k6964j70505Q8734J0801j63943o7626J00394l0982L7233
8199a60161j27203P869J9734q0723Q723O3082R2089J09755j3931k2274Q0818Q936
8187a3286J05912p9159p8322r392J45760l7153m8116J12072J0946q8670r85j16271
8175i6664j95801Q6708M9225m1603r0244J38343P821k23076n161N3557P4249Q6046
$$ y = [11557, 61766, -67556, -114624, 505, 96480, 87735, 142888, 117458, 85582, 185444, 230801, 233071, 161991, 97019, 70297, -6285, 16038, 93799, 116570, -35773, -158243, -258742, -286608, -26176, 109756, 53047, 22628, -41341, -24971, -8818, 158035, 36168, -173196, -77939, -104677, -64671, 51945, 94477, 10332, -32719, -9749, -155608, -284117, -139898, -22953, 47260, 62697, 35733, -134772, -46038, -35237, -199180, -266806, -166412, -197394, -160161, -287364, -279495, -259761, -340484, -331761, -268679, -176590, -66835, -80766, -103040, -22222, -13286, 92626, 13467, -64855, -74247, 71513, 34360, -13756, 98316, 109262, 20592, 19607, -96664, -292465, -205757, -156532, -198135, -288379, -150036, -142215, -365291, -370452, -316895, -242646, -156600]
8163a56600j22670J5614P1689P8188L1112P4161k0713k04870J8250K1892Q1001
8152a12946r7594R9544R8431j32360o1092n8180J62408J14227m1541N6389Q2836
8141A10122j5933n5557l8619O695k37549r0297J95935P1989M5962J68034M0373
8130B01155K0347L036r1948j62056k3751k6153j7473J67619M0488N0356L8057
8119A99677l1923j45028q9403j1885m6042K01676J1750j15145q786N6914j00520
8108g8715j47354O5266J91554l1508k13909J89285L3688O6786p8161K2943M597
8097B4472j16866j15752J68699L7677j08306L0543M8179J8678K0550J27310k1805
8086A13379j71680R4009J814j71400m5809R6904Q4325O2335j0735j20372K6129
$$ y = [-156600, -279270, -263656, -191967, -113779, -82667, -8506, -29219, -234089, -215839, -193947, -112946, -210540, -110996, -12565, -144925, -206017, -264197, -101789, 12438, -29103, 27286, 110122, 94189, 38632, 13, 6708, -230841, -321138, -125203, -53214, -7252, 160782, 201155, 221502, 224538, 132590, -29466, -53217, -79370, -96843, 70776, 111264, 161620, 199677, 167754, 22726, -66677, -78562, -124604, 77072, 88822, -26323, -35109, 21805, -78715, -226069, -160803, 30751, -757, -214666, -25381, 8307, 75093, -3068, 19875, 24472, -92394, -208146, -39447, -1770, -110076, -79533, -31354, -12676, 7874, 135184, 113379, -58301, 35708, 37522, -133878, -179687, -82783, 1542, 63877, 53142, -67230, -41101]
8075d1101J46011k44084J4264N819M7171j089k9589M7P0741j15471k01934O6448
8063b82767J02837L4062J42503J25524n6662J1866j78928j1360J16577J27057
8053A30709j3148l8524K2172p393p7847j69796p6992r0830J1856J3770J06630
8042a89393q1429j87722J29376q2920O1673J12354J37849k4711n204J03401k2125
8031d8851J01920J9883J07186K1297j78327o5915j78996q082J60106k4344m0467
8020a34590j1250o2539O6816J37921J61863P6551p0378o8085J17980q63J25435
8009C38861j18591k57342L1323r6127l8479l9501l5545O6453N2614R8273N6453
7998E8392p6343r224R1786q227j31642j11058Q9365m6270k8672J84112P7337J5417
$$ y = [-41101, 104910, -139174, -124910, -119091, -71920, -73009, -102598, -102551, -31810, -147281, -349215, -282767, -179930, -145868, -3365, 122159, 65497, 77363, -101565, -112925, 3652, 130709, 117561, 79037, 101209, 93816, 15969, -153827, -230819, -321649, -309793, -296023, -189393, -270822, -458544, -329168, -412088, -350415, -238061, -100212, -124923, -130127, -26726, -48851, 53069, 72952, 180138, 201435, 23108, -42807, -221803, -229885, -69779, -94123, -134590, -145840, -208379, -141563, -3642, 158221, 234772, 164394, 96309, 214289, 213426, 338861, 220270, -37072, -5749, -101876, -140355, -179856, -215401, -148948, -96334, 1939, 58392, -17951, -27175, 64611, 56384, -75258, -186316, -96951, -143221, -171893, 12219, 89556, 104973]
7986A04973k7769l3362o5335j39823J6171O0048P7232M7986N0395J9807O1258
7975A71581k00027K0527O5981J8978k05252N9672q8520n3974J48973J57491j03443
7964h013q2079j14647n7848Q844J93763q442K220J23990J7342J2996j12721m5729
7952g0324n0633N9005n2008l8740M5493m5920O2299J28018j3194o1688P3966J2877
7940D9151m4609j5459j16425m7592J26330L5989p2722O3140Q3617J16387J0006
7929A87813n2584J08983O336l1647m6013l8077k1424q7468k16199j6616J38406
7918f8490J55064J00295L4678l7370Q960o802O5579K1222k80335j56118r3730
7907b57047j22335J02696J30725K5720l8443M230o8411J8337K29595J02362M1099
$$ y = [104973, 77204, 43842, -21493, -161316, -145145, -85097, -7865, 40121, 90516, 110323, 171581, -28446, -7919, 58062, 77040, -128212, -68540, -157060, -211034, -62061, 95430, -8013, -90092, -204739, -262587, -253743, -59980, -68422, -66202, 57788, 75130, 88126, -24595, -70324, -120957, -61952, -113960, -152700, -107207, -153127, -90828, 37190, 23996, -37692, 36274, 49151, 4542, -10917, -127342, -174934, -48604, -12615, -85337, -22197, 61420, 177807, 187813, 135229, 244212, 250548, 218901, 172888, 134811, 113387, 25919, -190280, -206896, -68490, 86574, 186869, 221547, 184177, 193137, 186335, 251914, 273136, -7199, -163317, -257047, -379382, -276686, -145961, -120241, -158684, -154454, -222865, -204528, 25067, 127429, 168528]
7896A68528J8361j93742j42647M0380N6277L1962j87665r8770K7259O1535K0450
7885a98072M7020M4512J06104m0318j03642J0851O8347j26262l8292K27411o9542
7874g1883j06277P3065j7883o820j33954j07394O2547j2201J8745J89488J91521
7863G8954K0525j24733R3181Q8834M642n2585n3988R6112k7348q1420k6412J2327
7851B8089j968j24275J20386J3234J4110m070k17915k1255J56132J72450j03824
7840C1094J7978p4037k2402J24194J83528L5180j1202q3738k5642k8108J01709
7829B48554j21460r1958M12m3080r9394M6478J07136k028j8176k7164l5501J56713
7817A20532R9111j78636j6968p7802l4242J14160J039r6826m5092O3568J46261
$$ y = [168528, 186889, -6853, -149500, -109120, -52843, -20881, -208546, -307316, -280057, -218522, -198072, -151052, -106540, -436, -40754, -144396, -133545, -65198, -191460, -229752, -2341, -71883, -178160, -105095, -122978, -129798, -263752, -371146, -308599, -320800, -302055, -112567, 78954, 99479, -25254, 67927, 156761, 161403, 108818, 54830, 150942, 123594, 42174, 15762, 28089, 26121, -98154, 22232, 35466, 49576, 45506, -172409, -193664, -37532, 134918, 31094, 49072, -24965, -47367, 76827, 260355, 295535, 284333, 200595, 174953, 146845, 248554, 127094, 35136, 35548, -7532, -106926, -60448, 46688, 44660, 26484, -680, -36181, 120532, 219643, 41007, 24039, -53763, -88005, 26155, 27194, -69632, -114724, -51156, 95105]
7806I5105r3945r3367K4391K2525N8917O9410O6151N2266J09015k1695m2971J28668
7794C74470J08532j04982k50172J12790R3548r66r0850j73198k4817K98209Q8176
7783D30740l03812j97025L5766P1674k8869P5752k3847k86704q3363J86068K7955
7772i5665j23779j1166J51012L00452Q067j83898j17526J21914K8585m0343J50626
7761A88279j79922n4508j1383J02518P1923j78836j1088J42725J47209j18498
7751I8419j23568k3614L0265J10080q5818k1034M8323q3680O8490K44186J12817
7740C74866J7935K2194n2600l3006P2428n7260p4732j61837j05361K1666j18514
7729i4221n1560M413Q857J60581l3523j17511m5690J01377O0215l1566p0239o1855
$$ y = [95105, 1160, -92207, -67816, -45291, 13626, 83036, 149187, 201453, 310468, 288773, 245802, 374470, 483002, 378020, 127848, 240638, 334186, 333220, 242370, 69172, 44355, 342564, 430740, 126928, -70097, -34331, 37343, 8474, 84226, 60379, -226325, -309688, -123620, -95665, -219444, -230610, -79598, 220854, 228921, 45023, -72503, 49411, 77996, 37653, 188279, 8357, -46151, -57534, 44984, 116907, -61929, -73017, 69708, 216917, 98419, -25149, -48763, -18498, 91582, 5764, -15270, 33053, -50627, 17863, 262049, 374866, 392801, 414995, 362395, 329389, 401817, 344557, 269825, 107988, 2627, 24293, -94221, -145781, -141368, -132511, 28070, -5453, -122964, -168654, -67277, -7062, -38628, -108867, -170722]
7717a70722J16387J01803n2531P9450j53238K2732n5715p441q0151J7538L64498
7706A82610P3435j11206k36090k7524q0388l9371J48223J08525o7038M479L5433
7695h912k51358r6047Q9184q4059P8661Q7535J11755m2528J3553J04389q6306
7684h4133j0439J29717O0380J0352j06876q7103L4295r81Q1108J34329k049r926
7672A48674p9490j18947J80582N9214j0956P7830k9542j0166j54255j79374M691
7661a11739M8138P650L6436J82481p0335j04777O8687p2959l2875Q79l3374k7128
7649a08916m4761M6443N8830j93224N0741J99939k1993M4794j0058K7501N8432
7638A07728q0203j5042J0233k04649k5549J18934R0354k4328j29025n7379O1214
$$ y = [-170722, -54335, 47468, -5063, 74387, -78851, -56119, -111834, -119275, -199426, -181888, 182610, 256045, 144839, -91251, -118775, -199163, -238534, -90311, 18214, -48824, -44345, -8912, -260270, -356317, -267133, -351192, -272531, -184996, -73241, -115769, -102216, 2173, -84133, -94572, 35145, 95525, 105877, -999, -88102, -53807, -54788, 26320, 160649, 158600, 148674, 69184, -49763, 130819, 190033, 179077, 256907, 227365, 217199, 62944, -116430, -111739, -63601, -55951, -19515, 162966, 92631, -12146, 56541, -16418, -49293, -48414, -81788, -108916, -153677, -107234, -48404, -241628, -190887, 9052, -12941, 31853, 21795, 49296, 107728, 27525, 12483, 22716, -181933, -207482, -88548, 1806, -22522, -151547, -208926, -147712]
7627a47712j00036j09103M815Q8825K905j29055k0500L7485J05270K9671M055
7616b33380o3276r4142k5845K1997J58365J95826J38141l2044j24995J48453N9273
7605A48373k5500M6001j80954k5377r7952o1708O0378j4308M0178N7111o9400
7594a23158m7888p6869J03256M9319J70548N4381m881L2004K9805k5175j20671
7583D0671j29722J0341N4473j07301o0503k6587o8024O3240L1901o5081j12987
7572c69579J19461Q4565l8949k2689J46250Q4783N0801r2069o6859K1346l0105
7561a13044j7462N0621o455O3542j00892m6368N2086n2980n4217j1667l1069J83320
7549h4585J05672R4097l9825j38386j53300j11139N2769K8433M8749o1424P5109
$$ y = [-147712, -247748, -356851, -352036, -263211, -260306, -389361, -409861, -372376, -267106, -237435, -233380, -296656, -390798, -416643, -394646, -236281, -40455, 97686, 65642, -59353, 89100, 148373, 122873, 168874, -12080, -37457, -135409, -197117, -136739, -151047, -110869, -53758, -123158, -171046, -247915, -144659, -95340, 75208, 129589, 124708, 156712, 186517, 161342, 40671, -89051, -78710, -24237, -131538, -192041, -218628, -286652, -223412, -191511, -256592, -369579, -250118, -165553, -204502, -227191, -80941, 3842, 54643, -37426, -104285, -82939, -113044, -130506, -79885, -86340, -22798, -123690, -170058, -117972, -170952, -225169, -236836, -267905, -84585, 21087, 115184, 75359, -63027, -216327, -327466, -274697, -246264, -197515, -258939, -183830]
7538a83830m438k8453O9607K49672L1634o282k1489K3557j08280M3494l8968j58093
7526a31869m4780K7001J09329P6591n8669J1942M098q3359j03359q8096J66849
7515a14322M5459K8913K0720k6590m6879l8407R1238J31543N0859j49116O3304
7504E6722q2187j84305J8377J6024n996M6434N8790L8002p1237j3554M3498j01394
7492a80826P7263J85091j03083j25013R7811J4067l5334j0560n1468L6795L891
7481i1366M1034N3201m9414N0506J52155k5331m3000P6878K00548n5720k48388
7470F1103n5181m3546n824J733k17024p8821J26419K66685L1065j16210j38116
7459a67717Q1317J73392l7188r4434R4565q985j4395O5898j11074r0316L433K52638
$$ y = [-183830, -188268, -216721, -147114, 102558, 134192, 127910, 106421, 129978, 21698, 65192, 26224, -131869, -176649, -149648, -40319, 36272, -22397, -10455, -6357, -89716, -193075, -281171, -114322, -68863, -39950, -19230, -45820, -92699, -131106, -39868, 91675, 142534, -6582, 56722, -25465, -209770, -191393, -175369, -181365, -134931, -76141, -38139, -109376, -122930, -79432, -180826, -103563, 81528, -21555, -146568, -48757, -34690, -70024, -80584, -132052, -95257, -91366, -50332, 2869, -46545, 3961, 156116, 130785, 87785, 164663, 365211, 309491, 61103, 5922, -37624, -43448, -41715, -258739, -337560, -211141, 55544, 86609, -29601, -167717, -86400, 86992, 49804, -44630, 49935, 40950, 26555, 92453, -18621, -108937, -105504, 147134]
7447A47134P3670j63562L2801l3698j44112j60008J58099Q6210j54482k2466N6672
7436a23742L7858K245m9105j81681Q3343J56298L3846j02161o1163J47525P5589
7425A8852n7891j15490L3741R8401l4466j24447j37032j10878o5731J28672J33947
7414b32322R5728m421n8800o1165J69801Q5968n5621J3680P2893J05075N7545
7403A88361o3566j64107k5164L2147N5387m5348p0228j07951J07224J07231J3540
7392B7526O139O1753K10073l0074k63264r2062j1251O7148k80552j45847l6840
7381d87251J16269R5268K04817r2907O9063M2962j17493J5103J15879k4809R1688
7370B8589J76416j19581j41273j01363p1506l4814N3592J8601l6770j2787r3125
$$ y = [147134, 220804, 57242, 90043, 56345, -87767, -247775, -89676, -3466, -157948, -180414, -123742, -85884, -83639, -132744, -314425, -231082, -74784, -40938, -143099, -204262, -56737, 18852, -39039, -154529, -120788, -22387, -56853, -181300, -318332, -429210, -494941, -366269, -232322, -136594, -141015, -199815, -260980, -91179, -5211, -60832, -47152, 25741, 130816, 188361, 124795, -39312, -64476, -32329, 23058, -22290, -92518, -200469, -93245, 13986, 27526, 33665, 95418, 305491, 275417, 12153, -79909, -91160, -24012, -304564, -450411, -487251, -370982, -275714, -70897, -163804, -94741, -51779, -169272, -154169, -38290, -63099, 28589, 205005, 85424, -55849, -157212, -228718, -263532, -209940, -191339, -228109, -240896, -334021]
7359c34021j1747M6982J6856Q9114J77765J22429n2800j89744o5866J8123m3428
7348b26337N6987N7195N1528K33822M5511K6239L6769o1831j24709K0777J18924
7337B34875r7727M5856n7216o6159n4062j04259J2066n9520J50320P9897Q9555
7326A73626j13556j29867j1015N8258k4817P5440J4942j4576K0009p5063o0181
7315h6800O0354J6897j58508n7708P4462N3756q3747j10348N1285J26952K9599
7304h3806q163p0124k0523o7997p1705R6824L7569j1236N6327O8725n4597r9616
7292b28322j16187j21692R4336N9110J36663J33318J18638K0433M875j7443n3918
7281B9811j52410P2708j07809n4647K03826J00165P7027p1495j8587r9223k51901
$$ y = [-334021, -345768, -298786, -281930, -192816, -15051, 107378, 54578, -135166, -201032, -182909, -226337, -169350, -112155, -60627, 173195, 218706, 244945, 281714, 219883, 95174, 115951, 234875, 137148, 183004, 125788, 59629, 5567, -98692, -86626, -146146, 4174, 84071, 173626, 60070, -69797, -80812, -22554, -47371, 28069, 43011, 28435, 48444, -26619, -86800, -26446, -9549, -168057, -225765, -151303, -97547, -181294, -291642, -240357, -113405, -83806, -91969, -162093, -182616, -250613, -322318, -225494, -187925, -199161, -142834, -74109, -128706, -228322, -344509, -466201, -371865, -312755, -176092, -42774, 75864, 96297, 101172, 83729, 29811, -122599, -49891, -157700, -212347, -8521, 91644, 168671, 97176, 78589, -20634, -272535]
7270b72535O6230J78512J50884j04271j66125J3197J59432J88919L1092m7233
7260A98102j26582l678J41892j31471j57500m8428M2827O761j66289q1231J83933
7249a41664Q7019M9338O2717J28665J01582j53651k5223O9680j30886j81761q9981
7238b24165P0844J06561K6288j7226J02595j67179j64692L3956J08766L4426M4350
7227d5476k7013j00447P6944J94295J41194q1176j34826n9095r1253P9923j5505
7216f2435K6351k6761n337k7006J6984n8654k3641J826N3875L4174j48334o4262
7204b83220M4291j5479J32580J26536j28436r3027M1443R5485r8124J16857k9154
7193i0248k8076K7481N9648j35155j70251J63801J9218l3172K9942R3063j69063
$$ y = [-272535, -206305, -27793, 123091, 18820, -147305, -134108, 25324, 214243, 245335, 198102, 71520, 67842, 209734, 78263, -79237, -127665, -84838, -78077, -244366, -325597, -141664, -54645, -5307, 57410, 186075, 287657, 134006, 108783, 178463, 47577, -134184, -224165, -153321, -46760, -20472, -37698, 64897, -102282, -266974, -233018, -124252, -89826, -45476, -72489, -172936, -95992, 98303, 239497, 158321, 23495, -35600, -126853, -46930, -62435, -36084, -62845, -68182, -95188, -78204, -136858, -160499, -158673, -104798, -70624, -218958, -283220, -238929, -254408, -121828, 4708, -123728, -216755, -175312, -79827, -177951, -61094, -90248, -118324, -90843, -31195, -166350, -336601, -172800, -153582, -186754, -156812, -63749, -232812]
7182b32812o9599L3377J19377K23415M1037p6381k41247n8290p6375J46007P8416
7171a13075J28339O0871j413k5302P2785o8715j5683l4859j9712j28871j5011
7160a60646N320J2020Q1472J873l5607k9865R0608O161j36452K4418j9304p8283
7148b38285M402K71528o6624j88690Q6543k3839m6860J5920j7461l8612P7330
7137a64648J19188r572J1774O2265q0896j73503K8258m1424j5603K2949L3061
7126b08151R975m9402m9970J34421j2892m3637K02141Q8479K9645q8016J7330
7115B9923Q8924j23884j99720p0033r7613N4868J79579M727M1973j688O1327m9573
7103h1190N2525j0764K6088L7210m5401p0887J74862p6079j04941k5015o0951
$$ y = [-232812, -302411, -269034, -149657, 73758, 114795, 38414, -202833, -261123, -337498, -191491, -113075, 15264, 76135, 74722, 49420, 122205, 53490, 37807, 2948, -16764, -145635, -160646, -155326, -143306, -61834, -59961, -95568, -125433, -34825, -28664, -165116, -140698, -160002, -238285, -233883, 37645, -28979, -217669, -131126, -154965, -201825, -185905, -203366, -241978, -164648, -45460, -55032, -43258, 19007, -61889, -235392, -207134, -248558, -264161, -241212, -208151, -198176, -247578, -297548, -163127, -176019, -219656, -17515, 70964, 100609, 12593, 29923, 118847, -5037, -204757, -274790, -372403, -317535, -137956, -133229, -91256, -92944, -31617, -81190, -28665, -39429, -13341, 23869, -21532, -92419, 82443, 6364, -98577, -123592, -184543]
7092a84543q794Q2537O6357J37973o9574j43595j35613j94802J64263J21043n3888
7081b18636j09954K6157l7117L7171O5280K1187R2739R6828K7190k2099r5704
7070a16958j14917Q3489k7963o0179L6738N0240N8629O634K2831o4481j22874
7059b48811J0793m7923m3439N6526J08108K1080q987M031l8108o1334l0145Q2519
7047a95690R1764k3967J59127J87187q716r3685k1298j14516j03300O7105j81484
7036b37473q2398J43955J90542R797P300j27333n0699j1384O8689J61650M8547
7025A21193l355j48866o7964o3971p4437J01082J79017K24315r431j02504q3046
7014G2033q7279j00696j32256j4464m528J07112J25540Q100j66310q0274p700
$$ y = [-184543, -193337, -110800, -44443, 93530, 23956, -119639, -255252, -450054, -285791, -164748, -218636, -328590, -302433, -339550, -302379, -237099, -215912, -123173, -26345, 845, -21254, -116958, -231875, -148386, -176349, -236528, -199790, -149550, -90921, -84287, -61456, -125937, -248811, -238018, -285941, -329380, -272854, -164746, -143666, -152653, -148622, -186730, -248064, -278209, -195690, -103926, -127893, 31234, 218421, 209705, 116020, 94722, -19794, -123094, -55989, -237473, -319871, -175916, 14626, 24423, 31723, -95610, -146309, -157693, -89004, 72646, 121193, 117838, -31028, -98992, -162963, -237400, -136318, 42699, 267014, 257583, 155079, 72033, -15246, -115942, -248198, -262662, -267190, -160078, -34538, -26438, -192748, -273022, -280722]
7003b80722j84131M4288K11904n3002N9222O0317J27105J09495L4809l4k56098
6992a26847P405R5748r772Q2961q7826J82002k1678O2772j9172j64183P9760J2770
6980I3940J015R7946p5821l5247m7614j16295K6182M3098R344j16745o1163m1753
6968b23113o75K9343Q2817j43026l6193J38566J72278O6342m1120r9577q0175
6957a34533L1972J15468L9988L4714R0317M931j06407K6581J2349j57965J68108
6946A25523J52357j77338Q4643l5141j2770J11867o9147j64728K2390q841j22493
6935i3678P2515j9645Q0282O6031p9984j51160J3208J86233J00502Q2408n6140
6924B00572k78765j68038l50l843O012J108L7670p5208L6932K41709L5466j07830
$$ y = [-280722, -464853, -420565, -208661, -261663, -202441, -142124, -15019, 94476, 129285, 129251, -126847, -119442, -23694, -33466, 49495, -38331, 143671, 121993, 184765, 165593, 1410, 81170, 93940, 94955, 192901, 117080, 81833, 34219, -82076, -55894, -12796, -3452, -120197, -181360, -223113, -223788, -194445, -111628, -254654, -290847, -152281, 19997, 86339, 45219, -54358, -134533, -102561, 12907, 52895, 87609, 177926, 182857, 76450, 103031, 115380, -42585, 125523, 277880, 100542, 185185, 150044, 137274, 249141, 179994, 15266, 37656, 28815, -93678, -21163, -40808, 39474, 105505, 25521, -125639, -112431, 73802, 174304, 256712, 200572, -78193, -246231, -246581, -250424, -244412, -243304, -205634, -280842, -243910, -2201, 33265, -74565]
6912g4565l5891m0605P6248M6148j6114p1520L7696q3355j08055M3761J37545
6901h8707P7499J66247q2827j35069J75541Q2564l3409j5487k80763j8272L8564
6890a14119m5591L4611J06950o7501r7284J13683J4553k35130M5415K14364M0736
6879A0687M1804j65446j30653q99k8620n3836R4732J25683P9174r7625O10K041
6867a22348p0672O8096J6456j40133k9996N1477J24070L7485o7000o3449M3907
6856a52107L4931L1745k6598n7933J88865K91359j45j03650q7096j71600j40363
6845a92592N7658p1675K4132J25559j9893K4057Q698m2411K2133r4180M4678J10170
6833c666j2998J13611K8911j11805j15361n396k5174k1652j9985j66506j0763
$$ y = [-74565, -110456, -151061, -74813, -28665, -44779, -116299, -78603, -161958, -270013, -226252, -88707, -11208, 155039, 72212, -62857, 112684, 195248, 161839, 146352, -134411, -152683, -114119, -159710, -125099, -18149, -85650, -182934, -69251, -54698, -289828, -244413, -30049, 10687, 52491, -112955, -243608, -244507, -273127, -326963, -232231, -106548, -27374, -124999, -124389, -122348, -193020, -124924, -108468, -248601, -278597, -227120, -103050, -65565, -132565, -196014, -152107, -117176, -85431, -112029, -169962, 18903, 310262, 310117, 206467, 119371, -52229, -192592, -134934, -206609, -182477, -56918, -76811, -52754, -44056, -86467, -64334, -158514, -113836, -3666, -16664, 96947, 125858, 14053, -101308, -106704, -131878, -153530, -173515, -340021, -350784]
6822c50784K01161J84633M570N5030M2278r1344O4076K4053j94423r7881J66896
6811H265M23J14825J77190j12925k54628j63323j04669J63383J73647O8402J38370
6800B08960j2230k96616J2660o3134r0347J9191K7328K67417J45747L1101j80555
6789F9522p5522Q0668J05416Q1358L9909m4555j23885r7697L6071j5823j50461
6778i4999r9688m9858Q3130J63162p5986q4677J26866P5543P6797j53639j74595
6767b07944q3689J66012K19234J19370m6269P7975j11874k38245J8189J73556
6757H6315K6229J31100r9120j06912p4183N2628K1617j44975N2559J20773Q2653
6746A48684O066J8101K8779m3077j0799r6076k52062j7571N1750l550J05981m7298
$$ y = [-350784, -149623, 35010, 39580, 94610, 136888, 45544, 109620, 133673, -60750, -158631, 8265, 8688, 123513, 300703, 187778, -66850, -230173, -334842, -171459, 2188, 70590, 208960, 196730, -99886, -87226, -150360, -240707, -221516, -194188, 73229, 218976, 250077, 69522, -6000, 74668, 180084, 261442, 301351, 256796, 132911, 35214, 71285, 55462, -94999, -194687, -244545, -161415, 1747, -74239, -158916, -32050, 43493, 120290, -33349, -207944, -291633, -125621, 93613, 212983, 166714, 244689, 132815, -105430, -87241, 86315, 112544, 243644, 144524, 37612, -36571, 16057, 37674, -107301, -54742, 66031, 148684, 154750, 172851, 201630, 158553, 147754, 51678, -200384, -217955, -166205, -169755, -63774, -111072]
6734a11072K7447k4506q0391r8787R270M4527K2431o3083j27096O7317J43060
6723a90883K54331q179j43226Q61M8632N8111j0609P4347R0179l1203l9000r5337
6711H024l190R43j23477j02460p044n1469J6058J11548K18952O6385k52125j24728
6699b42583N2523M5723j84475j76842p7607J51196J42687J27618J37690R1095
6689F7025j02064M1648N7655j64100j48008J5426J54101K81791J21508l0919J20778
6678D14841p8047n9446j18534j20131P2503L5149J46837R704q3700L0557j85822
6667F3911N126J67633j59170k40416k8132J33176P4104r6065J0668J48092o8831
6656A0096q0822j33811k52919J2934J48356O8713M1931j0225j76717N7423J86191
$$ y = [-111072, -83625, -108131, -188522, -287309, -278039, -233512, -211081, -274164, -401260, -333943, -190883, 63448, 55269, -87957, -87096, -38464, 19647, 9038, 83385, 173564, 142361, 103361, 8024, 4834, 5777, -117700, -220160, -227204, -278673, -262615, -151067, 67885, 134270, -117855, -242583, -190060, -144337, -328812, -505654, -583261, -432065, -289378, -161760, -24070, 67025, -35039, 6609, 64264, -99836, -247844, -232418, -78317, 203474, 324982, 294063, 414841, 336794, 277348, 158814, 38683, 111186, 146335, 293172, 302876, 219176, 249733, 63911, 69037, 236670, 77500, -162916, -191048, -57872, 16232, -79833, -69165, 78927, 10096, -70726, -204537, -457456, -444522, -296166, -227453, -185522, -195747, -372464, -315041, -128850]
6645a28850k6508n3814L2293K7392j7304L4723Q4806P8036P3602k989q7268k3119
6633i000P922j50436l6500k6001J36900K16550n2633j50277l0567J6949Q384J05998
6621C7289Q5496n0024j34403q7016j00001M6530J60809o4130p5606M3795o0697
6610a97958o4262J34242J22384j51514m3018J13151R4329k0524q92J09162P6714
6599A71814k5288j8657j16722n1526O6566L2838j11934q6961N5605J19903o6390
6588c0752O3999l8524n0982L4469N3112N2899K760o9394r7795P101Q1664K1673
6576C0230P4293N556L4411J20977k7157r7460j14428j2912K7784k2747J88111
6565B06658k7379r4050P743l5550j7203J9469Q0178K19098K0656j93755j70262
$$ y = [-128850, -155358, -209172, -176879, -149487, -166791, -132068, -47262, 30774, 104376, 101387, 14119, -9000, -1078, -151514, -188014, -214015, -77115, 139435, 86802, -63475, -94042, -77093, -68709, 37289, 122785, 72761, -61642, -148658, -248659, -202129, -41320, -105450, -181056, -137261, -197958, -262220, -127978, -5594, -157108, -200126, -86975, 7354, -13170, -14062, 95100, 171814, 146526, 127869, 11147, -40379, 26187, 59025, -52909, -139870, -84265, 35638, -30752, 33247, -5277, -56259, -21790, 31322, 84221, 86981, 17587, -80208, -73107, 8557, 30230, 104523, 110079, 144490, 265467, 238310, 140850, 26422, 13510, 41294, 18547, 206658, 179279, 85229, 92972, 57422, 40219, 59688, 139866, 358964, 379620, 185865, 15603]
6554A5603k37785K2309J24767J61820N4454k8124m2948j18354L845l9214o9504
6543a53131J40043M1570q3372K385n1002J65845O6098J04421n5323o4484p0963
6532D2087k34888J35710K4656k3949O8619j09103m4445r6703j32493M3299J52773
6521a74437j0844o8424M0186J63786q1535L4393Q5390q2280p699k4865P1819J60422
6509A05912l5173r7122L8159N66L3182p5395j87977r8408J16956K08181r901j08442
6497a09462Q1201k2198j39226n035J94250p726j22034k6956N2941o0506J35945
6486b8806j5626j39298o2883P0583J41723K27420j57998m5813Q657J54258J21796
6475B74013M4278m7842r0355m1731j09085K3107l7445j0751J22198J5971r5610
$$ y = [15603, -222182, -199873, -75106, 86714, 141168, 113044, 70096, -48258, -44413, -83627, -153131, -13088, 28482, -54890, -52505, -103507, 62338, 128436, 232857, 177534, 113050, 42087, -192801, -57091, -32435, -56384, 12235, -96868, -141313, -238016, -370509, -327210, -174437, -185281, -253705, -213519, -49733, -131268, -96875, -11485, -93765, -101464, -126329, -54510, 105912, 70739, -26383, 11776, 12342, 45524, -29871, -217848, -316256, -199300, 8881, -1020, -109462, -28261, -50459, -189685, -194720, -470, -8196, -130230, -157186, -104245, -164751, -28806, -44432, -183730, -246613, -176030, -34307, 193113, 35115, -10698, -2041, 152217, 274013, 318291, 270449, 180094, 138363, 29278, 52385, 14940, 4189, 126387, 142358, 46748]
6464D6748r7237J80360M977q3803n6678k1029J21635J2774p0582M0456r218l8130
6452C0273j27023m485Q9689O6641m5897N8938J57575J16896Q053n2285r5953j70762
6440C1660j2933j6293j4427J28004p668O6394O954o3370K1622L4587J65789k323
6428C37996j06320j63013q2916M7239Q0564m8793M7778k7367R8464J85322r2763
6417B76191r7271r2725R4137L2437o550k66686p7283J37900J82392n6894j50286
6406b4638r2842J2882K7045N7854M0371Q1678n2419j32277j59961p098J0234J16953
6394a22218P3857K7870J21474N5817k65095j49391l7682R7283K25322K6802l4217
6383A9822J14279J81753j23092p8043J1112j7668M7083j85657l5166j88959k8980
$$ y = [46748, -50489, 129871, 134848, 51045, -5633, -26662, 94973, 107747, 37165, 77621, 68403, 30273, -96750, -101235, -11546, 55095, 9198, 68136, 225711, 342607, 350660, 298375, 202422, 31660, 18727, 2434, -11993, 116011, 108343, 174737, 181691, 118321, 139943, 174530, 340319, 337996, 231676, 68663, -14253, 32986, 113550, 64757, 112535, 85168, 183632, 368954, 276191, 178920, 86195, 180332, 212769, 206219, -60467, -137750, 150, 182542, 125648, -24638, -117480, -104598, -77553, -19699, 20672, 102350, 49931, -82346, -242307, -249405, -239171, -122218, -48361, -20491, 100983, 156800, -108295, -257686, -295368, -198085, 27237, 54039, 19822, 134101, 315854, 192762, 114719, 125831, 108163, 155246, -30411, -65577, -254536, -283516]
6372b83516P9475J21732J37875j16518r6502J53895Q0201k28020p2048q821N6592
6361a75655K6193l7949P1956J40388J33417l2100M9862O0683N107p2691n8970
6350A10241j54823m5813J34283N5076Q2056M4616k5121n6500J6667j39358q5157
6339f3833j31489N9750J6897j09955m9271L7888j5151O4917P960n0692J4042K61000
6327D2063m7310l7956k7386L5917o7256j27437l2646o9750O7008j06281J3412
6316c57622K11194J94684L3818K2122q2315J26433K5636j77025j98902l9427k7976
6305b69380Q7328O7995M2714J3163N4104R0921N8150P6698q6093r5915k962n096
6293C1627K27507J8486r5550O7652r7009j19714j25911O8990J25933m8850L596
$$ y = [-283516, -204041, -82309, 55566, -60952, -157454, -3559, 76642, -151378, -223426, -232247, -175655, -149462, -187411, -115455, 24933, 158350, 126250, 176112, 236795, 241902, 169211, 110241, -44582, -90395, 43888, 98964, 181020, 225636, 200515, 144015, 160682, 21324, -63833, -195322, -135572, -118675, -228630, -277901, -240013, -255164, -190247, -182287, -232979, -218937, 42063, -5247, -43203, -70589, -34672, -101928, -229365, -262011, -331761, -264753, -371034, -357622, -146428, 48256, 82074, 104196, 21881, 148314, 173950, -3075, -201977, -241404, -269380, -182052, -114057, -71343, -58180, -4076, 86845, 144995, 221693, 135600, 39685, 36723, 31627, 259134, 277620, 182070, 249722, 152713, 32999, -92912, -23922, 102011, 53161, 56757]
6282E6757j7461j5532j29395l3369J8750L6994Q9994J3252K6410J3286j15562
6271e5876j01947K03367R8714l2693o0580j17977r3451j09736j00844L9291o1925
6260c93657r5227J21098J14768K17103R8020N3L8211L1021M8420j68375P8877
6249I0312J69839l5930k49331j72276O2799K54466J946J00711r291L3193o929
6238B39509n5039j74528m4764M3649M2568o7739o18O7879N8393J2051p015r7902
6226A6444l5209J59780O683j29974j9268L8903R181j36246L6677R4906L3060j51880
6214g6943j95873n256J30178J01385Q2367j00286j36864J34172O6145n5734j36213
6203a92922M4589r0652k4843K08716l746k3763J57063Q2351j79153J7998K2942
$$ y = [56757, 39296, 23764, -105631, -139000, -120250, -83256, 6738, 19990, 46400, 59686, -55876, -157823, 45544, 144258, 111565, 50985, -66992, -160443, -270179, -371023, -331732, -393657, -488884, -367786, -253018, -35915, 62105, 62158, 100369, 131390, 179810, 11435, 90312, 260151, 224221, -25110, -197386, -134587, 119879, 121825, 222536, 213245, 246438, 239509, 184470, 9942, -34822, 8827, 51395, -16344, -16962, 50917, 109310, 121361, 114346, 16444, -18765, 141015, 147698, 17724, -1544, 37359, 46540, -89706, -53029, 41877, 74937, -76943, -272816, -278072, -147894, -46509, 35858, -64428, -201292, -67120, -975, -56709, -192922, -148333, -238985, -263828, -55112, -58858, -82621, 74442, 156793, -22360, -4362, 18580]
6192A8580m575j7469J12549R7723p061j53453j8654O7786J02142q4051p0754j06928
6180f4165k7144n6598J69007P494j39137n0314n606o1931m5987K8033K17396J2575
6168a6377j92087M3805K06919j3681j42910q7939J76223K19079N6844p0581q7933
6157I1362j48029j68653P8526K32708J13320j01962k15174O0845K7831J61894
6147A32668j5972j9972n5088O362n5819j7328J44298K5865p2273j23031q0904
6136a31194l5200P8718J51784P9533q3285j34257o8532K3688J10726O6334n8020
6125B95r4991p9071J4828p4179J38495O8452J52424J10577k0779r5174j06892
6114A3985k7411J03093N75K2122P1981n8883M5229k22747K3279K80055N4745k1334
$$ y = [18580, 14005, -3464, 109085, 206808, 199747, 46294, 27640, 95426, 197568, 113517, 42763, -64165, -91309, -147907, 21100, 28594, -110543, -160857, -166463, -228394, -274381, -246348, -28952, -16377, -208464, -164659, 42260, 28579, -114331, -202270, -26047, 193032, 249876, 179295, 91362, -56667, -225320, -146794, 85914, 199234, 97272, -117902, -57057, -29226, 132668, 116696, 96724, 41636, 47998, -7821, -25149, 119149, 145014, 72741, -50290, -131194, -166394, -87676, 64108, 143641, 60356, -73901, -142433, -118745, -8019, 58315, 295, -94696, -173767, -158939, -233118, -94623, -26171, 126253, 236830, 216051, 120877, 13985, -13426, 89667, 90242, 112364, 184345, 125462, 170691, -52056, -28777, 251278, 306023, 284689]
6102B84689l24031k89452q530K8174J09854J79160O7160k465J01298o0579l6727
6091D8551j26107k10275J63621J42222K4051n6939N09J64171J17670m4577q2331
6080A40566J2470P8266j32073L7645J2666J20154r9753m1425j42734j57274P6780
6069i4712N8905j3343n3267j6984J13528J19694m3319m1021m2630M2550J11916
6058A41317q5941q9761q3447Q968o1372J60606Q9527j50812K5127K09042L0470
6047A93724r4542n1314r0219j4591j3076K1100M5252R9747J25946j81825l9703
6036D99J48656Q3704M7886O6517j08177k54928j29100L4162J14335j89946m9260
6025b35652l5838j2676M0994p7096N646n8718J31802l2813M0209J47598N9565
$$ y = [284689, -39342, -328794, -337324, -309150, -199296, -20136, 47024, 44559, 145857, 85278, 48551, -77556, -287831, -124210, 18012, 42063, -14876, -14367, 149804, 267474, 222897, 140566, 153036, 231302, 99229, 136874, 149540, 269694, 169941, 128516, -14218, -171492, -94712, -35807, -49150, -102417, -119401, -5873, 113821, 70502, 29481, -13149, 29401, 141317, 55376, -34385, -117832, -108864, -170236, -9630, 79897, -70915, -45788, 163254, 193724, 99182, 47868, -42351, -56942, -70018, -48918, -3666, 96081, 222027, 40202, 499, 149155, 232859, 280745, 347262, 239085, -15843, -144943, -110781, 3554, -186392, -235652, -271490, -284166, -243172, -320268, -314622, -373340, -241538, -274351, -234142, -86544, -26979]
6014b6979O0318j03020j34812N2933K94722J55338j30592k00509j84526N6142
6004a60985J55125M7822L9294j44762Q972o5007k5823J01939l9099o1100o1171
5993b04795p7986R4639j748p5132J15453n0476P1542n653N7869l910R5537o8368
5981e3028j9986J56027Q2349j82447k4225j13892l9337Q8099K9768K08668M7985
5970A79981k24347o8547P325K5491O4399O2589Q9062n1355p2179L7970J18047
5959A68436l3706p7121j36630j4953J0323P2574J87829J9478j47303l5257n3301
5948c9631j18764l6278J86422J40339n4907k20577o385j09513j49457l8321J70679
5937b76393K03632J10115j54988r9718r537K77786K24264j18406j29735k04548
$$ y = [-26979, 33339, -69681, -204493, -151560, 143162, 298500, 167908, -32601, -217127, -160985, -5860, 41962, 81256, -63506, -54534, -119541, -145364, -43425, -82524, -143624, -204795, -282781, -188142, -189890, -265022, -149569, -200045, -128503, -134156, -76287, -80197, 15340, -53028, -73014, 83013, 165362, -17085, -41310, -155202, -194539, -106440, -76672, 131996, 179981, -44366, -112913, -105588, -80097, -15698, 46891, 135953, 84598, 12419, 50389, 168436, 134730, 57609, -79021, -93974, -83651, -11077, 176752, 196230, 48927, 13670, -39631, -158395, -194673, -8251, 132088, 77181, -143396, -149781, -259294, -408751, -447072, -276393, -72761, 37354, -117634, -217352, -226889, 50897, 275161, 156755, 27020, -177528]
5927a77528j20455K3231m5678Q3501J82039R4633Q0281k20664O0903l0648j04060
5916a74445J35397J05842k43568j55565K17882K38673O3516r0859k14223N1689
5906f5661J39823L5957K2742r1757M6195j1027N9287J30299J36793j30981j25162
5895A46508j39700J15930J53487r4655k37454k33069K5596J82973J47487J11338
5885A78441J3481l00210j65463R9796J45463j7527n5498L6481P2091J92992k3845
5874A76202j02906J3587j00097l3643j6382q4456R7594M7741j84420o1185J89331
5863e8634J24689K9754n9763J9863p2085n7422q5739m5085j8770P0237L24175
5852A71220J10931m1215j10561L7263m4538j79708j42771K7182M8249J76217P0933
$$ y = [-177528, -297983, -274752, -320430, -236929, -54890, 39743, 120024, -100640, -39737, -70385, -174445, -39048, 66794, -176774, -332339, -114457, 124216, 187732, 96873, -117350, -65661, 74162, 110119, 132861, 41104, 87299, 76272, 135559, 265858, 402651, 271670, 146508, 6808, 122738, 276225, 181570, -55884, -288953, -263357, -80384, 67103, 178441, 191922, -108288, -273751, -173955, -28492, -46019, -101517, -65036, 7055, 200047, 176202, 73296, 86883, -13214, -46857, -63239, -147695, -50101, -2360, -186780, -247965, -58634, 66055, 95809, 36046, 55909, -16176, -73598, -159337, -204422, -223192, -152955, 171220, 282151, 240936, 130375, 167638, 123100, -56608, -199379, -172197, -123948, 52269, 123202]
5841A23202o2902m0396j02561r340m9785q3064l8440Q3756J19196k98M6150J02261
5829H7779q1118J2248N7042R002k03379j02160N1072j07588j73312L0199J74750
5818b45465J96260R9604q687j9615J48537J77391L9537j81135j13267j60495J05286
5807C7951q9860o2061R6111o9931r8421j24808O7122R5547N0945J5093Q4160K03527
5795B05375n5897p3142K31906J7687k45128l751N1727j52121Q285J70783r0715
5784F5009j52050k8988q3709J55565N4973j70284P5395k4208K3858j09182r0166
5773b83787K77958K1077j06220L3385k5089m044O3604m2895K5103j6731M3971
5762a3668O1269L8208j83998q9149J11184J53210l195r9633j83896J13574l0481
$$ y = [123202, 60300, 19904, -82657, -91997, -141782, -224846, -263286, -179530, -60334, -60632, -14482, 87779, 6661, 18909, 75951, 84953, -118426, -220586, -169514, -277102, -450414, -420215, -245465, -49205, 50399, 41712, 22097, 170634, 348025, 387562, 206427, 93160, -67335, 37951, -51909, -113970, -17859, -87790, -186211, -311019, -243897, -148350, -97405, -82312, 1848, 205375, 149478, 76336, 308242, 325929, 80801, 77050, 128777, -23344, -15059, 155724, 65009, -87041, -116029, -199738, -44173, 10800, -159484, -84089, -108297, -84439, -193621, -283787, -5829, 15248, -90972, -57587, -82676, -86720, -23116, -66011, -40908, -57639, -13668, 47601, 85809, -98189, -187338, -76154, 77056, 73861, -25772, -209668, -96094, -126575]
5751a26575j85477o148R4356J73657j10035L2022K29407K7768j01032K329j39672
5740a09400p5839J08703K26880m3016k534K04180o8156O739j59769l1466O402
5729F2724L196k06630j92771r7324Q5587J97983J79156P9616O2708r7055j6080
5718F1110r5775l4893J71386P7739J01875K4947k85174N126J14162p358P1739
5707B04884q6883j50103M3739N7854M7164j7853m4893m8918K8874j347J06812
5696A39330j5273j01473k666J67446L8832j05236j47571j70992P3820K81925J10266
5685B68408L8497M14l8027l394j35021r8682o3596k8375Q8203J71921P0056Q3346
5673C53750m4746j34989k26739o8038Q9453n3354p9568O7191l506J4201n9990
$$ y = [-126575, -312052, -318200, -223844, -50187, -160222, -128200, 101207, 128975, 27943, 30272, -109400, -185239, -76536, 150344, 107328, 104794, 308974, 240818, 247557, 87788, 56322, 62724, 65920, -140710, -333481, -430805, -345218, -147235, 31921, 111537, 174245, 77190, 61110, -34665, -69558, 101828, 179567, 281442, 306389, 21215, 26341, 140503, 133145, 204884, 118001, -32102, 11637, 69491, 116655, 98802, 53909, 4991, 33865, 32518, 139330, 124057, 22584, 19918, 187364, 226196, 120960, -26611, -197603, -123783, 158142, 268408, 306905, 307319, 269292, 265898, 130877, 32195, -31401, -59776, 28427, 200348, 270404, 353750, 309004, 174015, -52724, -120762, -31309, -84663, -164231, -97040, -100546, -86345, -146335]
5662a46335r6176l6240J17125P1460Q9521J6575j13633k4492p4055k8585K0968
5651b03867J1094Q2938J04642N8177j62653L7674J9498M8075j35943o5611k7053
5640b33029p6881j8102J57926R2384M72J44223m8331m2739l3872j20264j63614
5629c41827p33J80940Q7667m1860j01099J3699l5969P058J40710J68885Q2194
5618A59665L5156j25362n1398J01194n1475Q2764l4946n55J1540j30570M3557
5607C9570J03965q7600q3575k25099m7629Q9218r0879j44918J64684K26601K71864
5596B16202J79351j32600j33421k7757j84524l0860M3673k678J4949j79258r6338
5585c33261j1043K08249J71140j87132l3822O5152J1119J47794J40309M4779q0116
$$ y = [-146335, -242511, -278751, -161626, -90166, -645, 15930, -97703, -122195, -196250, -224835, -203867, -192773, -109835, -5193, 52984, -109669, -71995, -52497, -4422, -140365, -205976, -233029, -309910, -328012, -170086, -77702, -77230, 66993, 18662, -24077, -57949, -178213, -341827, -342560, -161620, -73953, -115813, -216912, -203213, -239182, -232124, -91414, 77471, 159665, 194821, 69459, 18061, 119255, 67780, 150544, 115598, 115043, 126583, -3987, 39570, 143535, 55935, -27640, -252739, -300368, -211150, -302029, -446947, -282263, -55662, 216202, 395553, 262953, 129532, 101775, -82749, -113609, -69936, -72614, -57665, -236923, -333261, -344304, -136055, 35085, -152047, -185869, -120717, -109598, 38196, 178505, 223284, 143168]
5574A43168j27569j1599j28859j02252J96835K15265j22299m6810n350N3272j3132
5563E0670L9908l0327q0916l1286J03086N7148p3312K6259k308j23198L6102k07583
5551b35757p0907M2072J19197J53525J43509K355j13791k13724R2691n1634N4486
5540g7978J41738P8466q6821j35196N4103P092q1916j75162r962J64532J95120
5529G4016R2633m2714m4108J06192K06637m027m9876l8724l9040k51411j70415
5518a60837j08470J17049Q6792R2480m2357L4297J54023q9338q0697O1350M8804
5507A13096k1258O9238J14230J48052K6783J7037j54552j94638O87P7122J09302
5496C05099j6294l2071k02517M1312J67525O6414j45475J0608j00886k6811j25831
$$ y = [143168, 15599, 4000, -124859, -227111, -30276, 184989, 62690, 15880, 10530, 63802, 50670, 90578, 60251, -20665, -51951, 51135, 108283, 34971, 61230, 58922, -64276, -28174, -235757, -306664, -264592, -145395, 8130, 151639, 153994, 40203, -173521, -80830, -132464, -77978, 63760, 142226, 55405, -79791, -25688, -18596, -100512, -275674, -285636, -121104, 74016, 166649, 123935, 79827, 186019, 392656, 388629, 338753, 300029, 260989, 9578, -160837, -269307, -152258, -65466, 27014, -15343, 18954, 172977, 83639, 2942, 64292, 113096, 91838, 161076, 275306, 423358, 450141, 467178, 312626, 117988, 118675, 195797, 305099, 288805, 256734, 54217, 95529, 263054, 329468, 183993, 194601, 93715, 66904, -58927]
5485e8927j3202N2160N1726J8734K8987k3353N4554K9698n6626o3562j12571J24191
5473C1809J23736p5911p0349k9402o1372n4223J54295J36823K0832j7555j67389
5462h706O7725l9923p8347M8440J22451J62624p0368j77250j03222L1592j17762
5451a62746n0831P9103J24372L31637J7874k72932j69934j56467J6309J80364
5441f3251R2018L3710o3553J9261l3849j67969N1128K49659o7025j38117l1331
5430a19319R4270J49132M4555p9669L8844N7267p7926l1311K39843k7470k59366
5419B8850k7051O5504o7548j72628n091J71347L4253Q4728j5084r318j1052j24048
5407d7138k37089P7541K33976M5611j29527j88259j46934k9412N3139j7618l9502
$$ y = [-58927, -72129, -19969, 31757, 50491, 79478, 56125, 110679, 140377, 83751, 20189, -92382, 31809, 155545, 79634, 9285, -20117, -81489, -135712, 18583, 155406, 176238, 158683, -8706, 59019, 19096, -59251, -10811, 111640, 274264, 203896, 26646, -76576, -44984, -162746, -213577, -134474, -10102, 321535, 339409, 66477, -103457, -259924, -243615, -63251, 28767, 62477, -1076, 18185, -15664, -183633, -132505, 117154, 50129, -87988, -119319, -25049, 124083, 168638, 88969, 127813, 185080, 107154, 75843, 315686, 288216, 28850, 1799, 67303, -245, -172873, -177964, -6617, 27636, 112364, 97280, 87962, 76910, -47138, -284227, -206686, 27290, 72901, -56626, -244885, -391819, -421231, -368092, -385710, -425212]
5396d25212J53809O5745K28226j0600R0250R4422j16303j40654k18951o1335Q0620
5385b59983m3723K47393J15220Q5329J18813r2211l6893L8390k73138p1269J96307
5374B4235J05647N6740J54603j4966L8588j24645j95659M8499j0563l8003j13428
5363f8952R5716Q7806j43591k77025P6223J16106J17402j03171j19125J8881K37761
5352C8031R6918j66952j3815J06756P6669R4511K111k38512j16003L4068n024
5341i1242m7736M9317P8190P2612j86038j9874J02022P3283L0679M0963J4367
5330A16543j52771j47296m092L0279P3920P5825N7206l904J5798j03702k27152
5319b69346K21210J70919p7711L1290m5257m1453K18886p9902l1993O4510l6659
$$ y = [-425212, -271403, -205658, 22568, 11968, 102218, 196640, 80337, -60317, -279268, -340603, -259983, -303706, -56313, 58907, 144236, 263049, 170838, 133945, 172335, -100803, -172072, 24235, 129882, 186622, 341225, 326259, 364847, 240202, 44543, 93042, 82479, 44476, -68952, 26764, 114570, -29021, -306046, -229823, -113717, 3685, -99486, -218611, -199730, 38031, 134949, -32003, -45818, 60938, 137607, 232118, 234229, -4283, -120286, -86218, -91242, -138978, -89661, -11471, 61141, -124897, -144771, -42749, 30534, 61213, 102176, 116543, -36228, -183524, -187616, -157337, -83417, -7592, 49614, 45710, 61508, -42194, -269346, -48136, 122783, 45072, 76362, 31105, -10348, 208538, 128636, 96643, 161153, 124494]
5308A24494j91173j36923P6100O1822J9548J77891l6872p1582o8671L765P4560
5297C2959N7914j6421M1166L6008j477n5306Q756j20579l589O0847j0735j43623
5285a14080l9773O0720J03114r7207j28431J29964M6600q539J55248n6694j66669
5274a15747J21846Q6306j18980r8126o4819r3473o2911J46275O1746K13068N4633
5263A29818j54892j92345q0663K68455J60749P4140K1864k13257J17903Q57k05895
5252g3266p9303J15076P253k39233j10265K42169J79519k2377j15210K2439k4673
5241i7871K3866k6515o6401R1798N5996j03002q817q983O8726Q9360l4429n40
5229a6812P6664K2259l575j66525l3216r258j55951j13791J14944J71596J31355
$$ y = [124494, -66679, -203602, -127502, -65680, -46132, 131759, 94887, 23305, -45366, -41601, 32959, 90873, 74452, 115618, 151626, 150149, 94843, 103599, -16980, -20569, 40278, 29543, -114080, -153853, -93133, 9981, -87226, -215657, -85693, -39093, -47632, 107616, 50922, -115747, 6099, 92405, -26575, -124701, -189520, -282993, -345904, -199629, -137883, 75185, 129818, -25074, -217419, -298082, -29627, 131122, 205262, 227126, 13869, 131772, 132629, -73266, -152569, -37493, -30240, -269473, -379738, -137569, 41950, 19573, -95637, -73198, -97871, -74005, -100520, -166921, -75123, -19127, -122129, -130946, -139929, -71203, 18157, -16272, -16812, 59852, 82111, 78536, -87989, -121205, -130463, -286414, -400205, -285261, -113665, 17690]
5218A7690M8552j01905k38758J41160K31443j29313o7361o0682K7152J11723L8644
5207A8345k81074J01774J59480O5696K0869j01730j36025j5718J14855J34362
5197H0834r4262k7304n254k5518J81583K769j51163n6303Q2975n7241j64332L4917
5185a98299J23453Q3390J1240n287p292J6765J04815j8309k2449m5703N712J5604
5173F3640r0j0491N4547Q6606K1455O2683k4722q4041l3309J21N8875q8163J16880
5160B23991N3774j3867j38668J7232L1763P3488o8146j51754j33664L2940M6646
5149b6265L8956j30317m7952r3524j02646j1968J80962K02186O5051q1269n5320
5138f2106K0654M6187M9654o3492M0132q1003L4875m6965j64508Q5874l2290L4097
$$ y = [17690, 66242, -35663, -274421, -133261, 98182, -31131, -98492, -159174, -132022, -20299, 18345, -262729, -160955, -1475, 64221, 85090, -16640, -152665, -168383, -53528, 80834, -13428, -40732, -45986, -71504, 110079, 112848, -38315, -94618, -11643, -68884, -233216, -198299, -74846, 8544, 19784, 14497, 7205, 23970, 128785, 110476, 88027, 42324, 48036, 63640, 63550, 53059, 107606, 194212, 215667, 278350, 253628, 169587, 136278, 136399, 195274, 107111, 223991, 277765, 263898, 125230, 142462, 174225, 247713, 179567, 27813, -105851, -72911, -26265, 12691, -117626, -165578, -259102, -361748, -373716, -192754, 9432, 74483, -6786, -62106, -41452, 4735, 54389, -9103, 31029, -49974, -15099, -62064, -226572, -140698, -172988, -138891]
5126a38891J35021L0326j14175n9923J35933J41587j20725j93894J71699P5559
5116F2517j23302o2726l2066K00694L5311j54140j53365J06995J37945K222n5276
5105c5191R4582J51552j07598k60634n6002l8679r457O8923J19450o4564k7242
5094a64860o9248P0068j4539n5647L6727k9796R7593O1102n8548j27135J39346
5083a14937Q5297j68909N6260J67902R9956L1872j4280J932k4856k3273k2253
5072G4711j61981N1745K22262p9161m4232r8281j35136R3182K4417j7528l4749
5061a04751J20051J9639o5947k0851P5087Q0251o8271n8010R1213R6329j13170
5050E1570j68896N2817j09486J19059J45516R591l5681n5174J17805j7656k18085
$$ y = [-138891, -3870, 26456, -87719, -147642, -11709, 129878, 9153, -184741, -13042, 62517, -60785, -123511, -155577, 45117, 80428, -73712, -227077, -120082, 17863, 20085, -35191, 59391, 210943, 103345, -157289, -213291, -251970, -261427, -192504, -73054, -137618, -164860, -234108, -164040, -178579, -234226, -197499, -227295, -129702, -68600, -127148, -254283, -114937, -29640, -198549, -142289, 25613, 125569, 157441, 143161, 145093, 120237, 96964, 74711, -87270, -35525, 186737, 107576, 63344, -34937, -170073, -76891, -52474, -70002, -104751, 15300, 34939, -31008, -51859, 23228, 103479, 35208, -22802, 68411, 164740, 51570, -117326, -64509, -173995, -54936, 90580, 100171, 64490, 9316, 127121, 109465, -108620]
5039a08620l311N1857J20428Q499J3238J77342N768k79795L079j16891n0340l230
5027a81976O9277K0813J40367j07145j68773l8354M1541R7076j23895R4865K08536
5016E2332j45950j03176Q7511J34359r6903n7269J8870M5750q8372k9827K2577
5005a60098J6014l9548J29567K1818j559J99913K6439k07381J0299r4973m8124
4994a47633P6632J07400m437O0186L979m0733K16892j69805j69007p5772j14217
4983b56515J08059J77258N4477O8517j58106o5486j3448l5283J6751J58438M8908
4972A03570p8327k02603J10892L68159O0064k55382j52416o7802o9491J53391
4962b9945J67879o9689j94405j68013N3670n0418J12343K05610O5584j23101Q8959
$$ y = [-108620, -111931, -60074, 60354, 68853, 82091, 259433, 265201, -14594, -11515, -128406, -178746, -181976, -112699, -91886, 48481, -58664, -227437, -265791, -224250, -127174, -251069, -156204, 52332, -93618, -196794, -109283, 25076, -71827, -129096, -110226, -64476, -152848, -182675, -160098, -144084, -183632, -54065, -32247, -33806, 166107, 192546, -14835, -4536, -99509, -147633, -71001, 36399, 31962, 92148, 96127, 55394, 272286, 102481, -66526, -142298, -256515, -148456, 28802, 83279, 151796, -6310, -71796, -85244, -120527, -103776, 54662, 103570, 25243, -177360, -66468, 301691, 361755, 106373, -46043, -113845, -183336, -29945, 137934, 68245, -126160, -294173, -240503, -290921, -178578, 27032, 92616, -30485, 58474]
4951E8474J19722J462n5464j46947j59877M595o247j5189Q5878O2329O3131q6848
4939g4981N733j4918j51421M7293J61993q3532N1772N5171R5820n2808r1605o3792
4927a15275K60145R6645j84820l7084J03235Q10j98822N3075M4260o6031j31967
4916a75829j11722q6259J28283k6961j6963Q8136O1790N7594p8684J19420J82840
4905A41645O6438M4507j61358j9134m8030j62860N4966k0038j13709J1475N6064
4894a50034P3982K3552j05975O9903K08066o0654j64284k8093L2150J03812M5517
4883D7942L0398N8674n8195p8480l8702P482N861j30525Q8198R1267L3565R4768
4871A52253N7575p6244j19778l405N48j7002K6000l0852j2318q3116J5520l7775
$$ y = [58474, 178196, 179658, 124194, -22753, -182630, -178035, -184282, -199471, -113593, -51264, 11867, -74981, -69248, -84166, -235587, -188294, -26301, -109833, -58061, -2890, 92930, 40122, -51483, -115275, 144870, 241515, 56695, 19611, 122846, 123656, -75166, -22091, 22169, -43862, -175829, -287551, -373810, -245527, -272488, -289451, -201315, -139525, -81931, -160615, -41195, 141645, 208083, 252590, 91232, 72098, 24068, -138792, -83826, -103864, -217573, -206098, -150034, -76052, -52500, -158475, -88572, 119494, 58840, -105444, -133537, -101387, 2425, 47942, 78340, 137014, 78819, 339, -38363, -30881, -25020, -155545, -67347, 23920, 57485, 152253, 209828, 133584, 13806, 10401, 10949, -6053, 19947, -10905, -23223, -106339, -90819, -128594]
4859a28594p605J27201p2518k2162J76641m74j6975r4328n6025O1323m8896m0518
4847a22930p4315o3507R7165J00749m4116m4488N7344K14160K0168n3171M5232
4836A32291Q8425p3190j87713P4526j18071K49033K55402k14179r7531J5211K7185
4825A51389l22564r8527K19741N9834o136N190O5593l0887q3578j71997n9895
4814b71837J16640R6352P2743P1575K5829r9223j22862R2653M14700K02977p9796
4803E19751j94354p20p1949k65332N9571O9489j11621n7580l8470j78849m7001
4792c17065J27786N9522J31169n2669j87072J67571P5895j44731n3321J19190
4782g3725L3608k364M2822l0155j241p2852l1559K2862Q3764J8839R6474J995
$$ y = [-128594, -136199, -8998, -81516, -103678, 72963, 72489, 55514, -38814, -94839, -33516, -82412, -122930, -197245, -260752, -163587, -62838, -106954, -151442, -94098, 120062, 140230, 87059, 132291, 220716, 147526, -40187, 34339, -83732, 165301, 420703, 206524, 108993, 124204, 151389, -171175, -269702, -49961, 9873, 3737, 8927, 74520, 43633, -39945, -211942, -271837, -155197, -58845, 13898, 85473, 111302, 12079, -110783, -18130, 396570, 599547, 519751, 325397, 324677, 252728, -12604, 46967, 116456, 4835, -52745, -91215, -270064, -317065, -189279, -129757, 1412, -51257, -238329, -70758, 5137, -139594, -192915, -73725, -40117, -42481, 341, -29814, -31055, -103907, -135466, -112604, -28840, -10001, 86473, 88468]
4770H8468p3398k64995K99p755R4623J70638j15097j52766p4921P1301J46393
4759a17210m9065Q4317O6058J07613m1313k2964m406l5039n4272j45617J69749
4748d2149J02273J3795m4845P242K2199L9455N7701m4565j41800j17819R330J05812
4736c3371r8943k9348J0003m8114N0423P3662P0965j56699J1804N8925Q8515J40727
$$ y = [88468, 15070, -249925, -249626, -257381, -162758, 7880, -107217, -259983, -334904, -263603, -117210, -166275, -81958, -15900, 91713, 50400, 27436, 23030, -12009, -66281, -211898, -42149, 60124, 73919, 29074, 36316, 58515, 97970, 155671, 111106, -30694, -148513, -139183, -33371, -132314, -161662, -151659, -199773, -149350, -75688, -4723, -161422, -149618, -90693, -2178, 138549]
$$ [...]
##END NTUPLES=NMR SPECTRUM
##END=
