##TITLE=Analysis number 327439
Compound Code sb 01480
Book Reference 199015
Project Code adrs flr03
Chemist Name jom
##JCAMPDX= 6.0         $$ Bruker NMR JCAMP-DX V2.0
##DATA TYPE= NMR SPECTRUM
##DATA CLASS= NTUPLES
##ORIGIN= Bruker BioSpin GmbH
##OWNER= nmr
$$ XWIN-NMR		Version 3.5
$$ Fri Mar 23 13:02:33 2007 GMT Standard Time (UT+0h)  MAYBRIDGE\nmr@NMR_250MHZ
##.OBSERVE FREQUENCY= 250.131544655141
##.OBSERVE NUCLEUS= ^1H
##.ACQUISITION MODE= SIMULTANEOUS (DQD)
##.ACQUISITION SCHEME= undefined
##.AVERAGES= 16
##.DIGITISER RES= 18
##SPECTROMETER/DATA SYSTEM= dpx250
##.PULSE SEQUENCE= zg30
##.SOLVENT NAME= DMSO
##.SHIFT REFERENCE= (INTERNAL, DMSO, 0, 16.522)
##AUDIT TRAIL= $$ (NUMBER, WHEN, WHO, WHERE, WHAT)
$$ ##TITLE= Audit trail, XWIN-NMR		Version 3.5
$$ ##JCAMPDX= 5.01
$$ ##ORIGIN= Bruker BioSpin GmbH
$$ ##OWNER= nmr
$$ C:\u/data/dgb/nmr/ADRS/1850/pdata/1/auditp.txt
$$ ##AUDIT TRAIL=  $$ (NUMBER, WHEN, WHO, WHERE, WHAT)
(   1,<2007-03-23 13:02:09.57 +000>,<MAYBRIDGE\nmr>,<NMR_250MHZ>,
      <created by zg, POWCHK disabled, PULCHK disabled
       configuration hash MD5:
       49 4B E0 1D 92 C2 6B 37 9F E6 65 BC 52 41 86 1D
       data hash MD5: 64K
       2B AA 0E 07 0D 8B 15 CC 96 02 F1 B9 E9 75 18 73>)
(   2,<2007-03-23 13:02:24.02 +000>,<MAYBRIDGE\nmr>,<NMR_250MHZ>,
      <Start of raw data processing
       ef LB = 0.3 FT_mod = 6 PKNL = 1 SI = 32K 
       data hash MD5: 32K
       F8 7D 03 83 3E E7 29 AC 26 43 7E EA EA 33 AF 11>)
(   3,<2007-03-23 13:02:25.64 +000>,<MAYBRIDGE\nmr>,<NMR_250MHZ>,
      <apk 
       data hash MD5: 32K
       F4 2F FE 4B 4C C9 A1 75 13 16 4D C9 1E 48 66 ED>)
(   4,<2007-03-23 13:02:26.35 +000>,<MAYBRIDGE\nmr>,<NMR_250MHZ>,
      <abs ABSG = 5 
       data hash MD5: 32K
       48 D4 7D F1 48 C9 5F 4D E6 71 9A C2 B3 29 28 CE>)
$$ ##END=
$$ 
$$ hash MD5
$$ 01 B9 FE 37 59 56 15 AA 57 E9 E5 A2 27 F5 70 98
##$RELAX= 
##$RELAX= 
##$RELAX= 
##$RELAX= 
##$RELAX= 
##$RELAX= 
##$RELAX= 
$$ Bruker specific parameters
$$ --------------------------
##$DU= <C:\u>
##$EXPNO= 1850
##$NAME= <ADRS>
##$PROCNO= 1
##$TYPE= <nmr>
##$USER= <dgb>
##$AMP= (0..31)
100 100 100 100 100 100 100 100 100 100 100 100 100 100 100 100 100 100 
100 100 100 100 100 100 100 100 100 100 100 100 100 100 
##$AQSEQ= 0
##$AQ_mod= 3
##$AUNM= <au_zg>
##$AUTOPOS= <37 >
##$BF1= 250.13
##$BF2= 250.13
##$BF3= 250.13
##$BF4= 250.13
##$BF5= 500.13
##$BF6= 500.13
##$BF7= 500.13
##$BF8= 500.13
##$BYTORDA= 1
##$CFDGTYP= 0
##$CFRGTYP= 5
##$CHEMSTR= <none>
##$CNST= (0..31)
1 1 145 1 1 1 1 1 1 1 1 1 1 1 1 1 1 1 1 1 1 1 1 1 1 1 1 1 1 1 1 1 
##$CPDPRG= <>
##$CPDPRG1= <>
##$CPDPRG2= <>
##$CPDPRG3= <>
##$CPDPRG4= <mlev>
##$CPDPRG5= <mlev>
##$CPDPRG6= <mlev>
##$CPDPRG7= <mlev>
##$CPDPRG8= <mlev>
##$CPDPRGB= <>
##$CPDPRGT= <>
##$D= (0..31)
0 1 0 0 0 0 0 0 0 0.06 0 0 0 0 0 0 0.0002 0 0 0 0 0 0 0 0 0 0 0 0 0 0 
0 
##$DATE= 1174654928
##$DBL= (0..7)
120 120 120 120 120 120 120 120 
##$DBP= (0..7)
150 150 150 150 150 150 150 150 
##$DBP07= 0
##$DBPNAM0= <>
##$DBPNAM1= <>
$$ [...]
##$SUBNAM7= <"">
##$SUBNAM8= <"">
##$SUBNAM9= <"">
##$SW= 20.6930455092707
##$SWIBOX= (0..15)
0 0 3 0 0 0 0 0 0 0 0 0 0 0 0 0 
##$SW_h= 5175.983436853
##$TD= 65536
##$TD0= 1
##$TE= 683.16
##$TE2= 300
##$TE3= 300
##$TEG= 300
##$TL= (0..7)
0 120 120 120 120 120 120 120 
##$TP= (0..7)
150 150 150 150 150 150 150 150 
##$TP07= 0
##$TPNAME0= <>
##$TPNAME1= <>
##$TPNAME2= <>
##$TPNAME3= <>
##$TPNAME4= <>
##$TPNAME5= <>
##$TPNAME6= <>
##$TPNAME7= <>
##$TPOAL= (0..7)
0.5 0.5 0.5 0.5 0.5 0.5 0.5 0.5 
##$TPOFFS= (0..7)
0 0 0 0 0 0 0 0 
##$TUNHIN= 0
##$TUNHOUT= 0
##$TUNXOUT= 0
##$USERA1= <user>
##$USERA2= <user>
##$USERA3= <user>
##$USERA4= <user>
##$USERA5= <user>
##$V9= 5
##$VALIST= <valist>
##$VCLIST= <CCCCCCCCCCCCCCC>
##$VD= 0
##$VDLIST= <DDDDDDDDDDDDDDD>
##$VPLIST= <PPPPPPPPPPPPPPP>
##$VTLIST= <TTTTTTTTTTTTTTT>
##$WBST= 1024
##$WBSW= 4
##$XGAIN= (0..3)
0 0 0 0 
##$XL= 0
##$YL= 0
##$YMAX_a= 465619
##$YMIN_a= -408161
##$ZGOPTNS= <>
##$ZL1= 120
##$ZL2= 120
##$ZL3= 120
##$ZL4= 120
##$ABSF1= 16.522
##$ABSF2= -4.171173
##$ABSG= 5
##$ABSL= 3
##$ALPHA= 0
##$AQORDER= 0
##$ASSFAC= 0
##$ASSFACI= 0
##$ASSFACX= 0
##$ASSWID= 0
##$AUNMP= <proc_1d>
##$AZFE= 0.1
##$AZFW= 0.1
##$BCFW= 0
##$BC_mod= 0
##$BYTORDP= 0
##$COROFFS= 0
##$CY= 12.5
##$DATMOD= 1
##$DC= 0
##$DFILT= <>
##$DTYPP= 0
##$F1P= 14.0000005364418
##$F2P= -0.99999901652339
##$FCOR= 0.5
##$FTSIZE= 32768
##$FT_mod= 6
##$GAMMA= 0
##$GB= 0
##$INTBC= 1
##$INTSCL= 1
##$ISEN= 128
##$LB= 0.3
##$LEV0= 0
##$LPBIN= 0
##$MAXI= 10000
##$MC2= 0
##$MEAN= 0
##$ME_mod= 0
##$MI= 0
##$NCOEF= 0
##$NC_proc= -4
##$NLEV= 6
##$NOISF1= 0
##$NOISF2= 0
##$NSP= 0
##$NTH_PI= 0
##$NZP= 0
##$OFFSET= 16.522
##$PC= 1
##$PHC0= 218.2893
##$PHC1= 5.466532
##$PH_mod= 1
##$PKNL= yes
##$PPARMOD= 0
##$PSCAL= 4
##$PSIGN= 0
##$REVERSE= no
##$SF= 250.13
##$SI= 32768
##$SIGF1= 0
##$SIGF2= 0
##$SINO= 400
##$SIOLD= 32768
##$SREGLST= <1H.DMSO>
##$SSB= 0
##$STSI= 32768
##$STSR= 0
##$SW_p= 5175.98343685301
##$SYMM= 0
##$S_DEV= 0
##$TDeff= 65536
##$TDoff= 0
##$TI= <Analysis number 999999
Compound Code 99
Book Reference 9
Project Code 9>
##$TILT= no
##$TM1= 0
##$TM2= 0
##$TOPLEV= 0
##$USERP1= <user>
##$USERP2= <user>
##$USERP3= <user>
##$USERP4= <user>
##$USERP5= <user>
##$WDW= 1
##$XDIM= 32768
##$YMAX_p= 516329186
##$YMIN_p= -149647
$$ End of Bruker specific parameters
$$ ---------------------------------
##NTUPLES= NMR SPECTRUM
##VAR_NAME=  FREQUENCY,     SPECTRUM/REAL,   SPECTRUM/IMAG
##SYMBOL=    X,             R,               I
##VAR_TYPE=  INDEPENDENT,   DEPENDENT,       DEPENDENT
##VAR_FORM=  AFFN,          ASDF,            ASDF
##VAR_DIM=   32768,         32768,           32768
##UNITS=     HZ,            ARBITRARY UNITS, ARBITRARY UNITS
##FACTOR=    0.157963299565203, 1,           1
##FIRST=     4132.6476996994, 0,             0
##LAST=      -1043.33573715361, 0,           0
##MIN=       -1043.33573715361, -149647,     0
##MAX=       4132.6476996994, 516329186,     0
$$ Real data points
##PAGE= N=1
##DATA TABLE= (X++(R..R)), XYDATA
$$ [...]
16659E2457j4909K2854L5287j3518n3915m274J9160j5763M4742J3430l3631j8086
$$ 52457 37548 60402 95689 82171 28256 23982 43142 27379 72121 85551 51920 33834
16647C3834K4678J0433k6680n210l649K2021l0597q117l286J4632O286K0374j9766
$$ 33834 58512 68945 42265 37055 33406 55427 24830 16713 13427 28059 34345 54719 34953
16634C4953R321j3744K165n115k5347l6231j7620r160L7426M1254L568P26j1058
$$ 34953 44274 30530 32695 27580 2233 -33998 -51618 -60778 -23352 17902 21470 22196 11138
16621A1138J2799k2363R600L246k4358L799K5229J8775m27l4809j1710J8776J0497
$$ 11138 23937 1574 11174 14420 -9938 -6139 19090 37865 37438 2629 -9081 9695 20192
16608B0192r216K322k1817j2175j8566M06R610N579J5614L022J1541k1086m340
$$ 20192 10976 13298 -8519 -20694 -39260 -38854 -29244 -23665 -8051 -5029 6512 -14574 -18914
16595a8914J8404Q04M2385j1788o272L7273J3456m137j7493J7510K7688k1268
$$ -18914 -510 294 42679 30891 24619 61892 75348 71211 53718 71228 98916 77648
16583G7648l9016k9920j1302l8598k5835l3654O1314P0559p101o412J5504K275
$$ 77648 38632 8712 -2590 -41188 -67023 -100677 -39363 31196 24095 17683 33187 35462
16571C5462j5797L1119o1326m1984J7345K4079j3831M0167J2431k7314Q181j5
$$ 35462 19665 50784 -10542 -52526 -35181 -11102 -24933 15234 27665 351 8532 8517
16559H517J6980p712j6840L582J9594l0520P96P625o915J4674L5718J8867j2555
$$ 8517 25497 17785 945 4527 24121 -6399 -5603 2022 -4893 9781 45499 64366 51811
16546E1811j0540J225k9343k0592n916j8425n110J7071k782n725J7036J7419J8274
$$ 51811 41271 42496 13153 -7439 -13355 -31780 -36890 -19819 -22601 -28326 -11290 6129 24403
16533B4403p209K755K7810P501j7508m4849l6026J0086J5537J6770j9519R94q726
$$ 24403 17194 19949 47759 55260 37752 -7097 -43123 -33037 -17500 -730 -20249 -19255 -27981
16520b7981j2431Q440M5120p96k0186n566Q409K5874J1566j1919L8190m485n8371
$$ -27981 -40412 -31972 13148 12352 -7834 -13400 -4991 20883 32449 20530 58720 54235 -4136
16507d136j4308M5095J0138j6487o480P368O393K1009K8258R209m688q429m2393
$$ -4136 -18444 26651 36789 20302 13822 21190 27583 48592 76850 86059 81371 72942 30549
16494C0549k7446J6966P537m0868J6825j2713j633J6062M1350k1153l3490k2249
$$ 30549 3103 20069 27606 -13262 3563 -9150 -10783 5279 46629 25476 -8014 -30263
16482c0263M737R813k8128J4573j107q99j5422K0488M5474K5573r196j5307J5492
$$ -30263 -25526 -15713 -43841 -29268 -30375 -31274 -46696 -26208 19266 44839 35643 20336 35828
16469C5828J1602N148Q437j8902k5302j842J9067J845L759m3397M319q690J9855
$$ 35828 47430 52578 61015 42113 16811 14969 34036 35881 39640 -3757 562 -8128 11727
16456A1727J0254N170k3477k8852l6344j1702K606n187m554M0258K0635o233j477
$$ 11727 21981 27151 3674 -25178 -61522 -73224 -70618 -75805 -80359 -40101 -19466 -25699 -27176
16443b7176P177k5084j1716J4208n882k9933K2732k311J3231J6236J6399K4203
$$ -27176 -19999 -45083 -56799 -42591 -48473 -78406 -55674 -57985 -44754 -28518 -12119 12084
16431A2084O468J3172j5650K7451j5524M786l353l2472j1291J3243J3983J0234
$$ 12084 18552 31724 16074 43525 28001 32787 29434 -3038 -14329 -1086 12897 23131
16419B3131k327k7667k8444J0821L4905L479j0933L058M5135M409l6685R946J7044
$$ 23131 20804 -6863 -35307 -24486 10419 13898 2965 6023 51158 55567 18882 28828 45872
16406D5872l6006j7901l893M0897N2123k9406l4152o459J3525K948m2313q94M0167
$$ 45872 9866 -8035 -11928 28969 81092 51686 17534 11075 24600 27548 -14765 -15659 24508
16393B4508K2677Q284k7994l3897n815L3683j1637k1945o217J9584J9758k6828
$$ 24508 47185 55469 27475 -6422 -12237 21446 9809 -12136 -18353 1231 20989 -5839
16381e839j8921J7455n53j7659r09N015M2834j2635k4617K494j7978m3593J2891
$$ -5839 -24760 -7305 -7858 -25517 -26426 -21411 21423 8788 -15829 -13335 -31313 -74906 -62015
16368f2015P5454K980J470J6137L4108M638J98j3265m0952J3812l530m852N875
$$ -62015 13439 16419 17889 34026 68134 72772 72970 59705 18753 32565 29035 24183 30058
16355C0058O352k4444M53J2661K4054j0260n2131k1061L0067K194j6893J3575
$$ 30058 36410 11966 12419 25080 49134 38874 -13257 -34318 -4251 -2057 -18950 -5375
16343e375K6490l484j0206O714K4573L5945J1853R084l9982l5235m1239n893J8702
$$ -5375 21115 17631 7425 14139 38712 74657 86510 95594 55612 20377 -20862 -26755 -8053
16330h053J2560k2292j3967k675L3195J9304J3859q198j4032j6399k8246l0466
$$ -8053 4507 -17785 -31752 -34427 -1232 18072 31931 23733 9701 -6698 -34944 -65410
16318f5410J0761O577P209J7641Q95K1793P216k0193k678L0824P176k1466O86
$$ -65410 -54649 -48072 -40863 -23222 -22327 -534 6682 -13511 -16189 14635 21811 345 1031
16305A031L985n955J4795J4149j5205L1747M9370j7412n5163l0703j8743J2045
$$ 1031 5016 -939 13856 28005 12800 44547 93917 76505 21342 -9361 -28104 -16059
16293a6059J6329O590j4086j5958k0032K408K9942M7255j0631n2333k4773J3998
$$ -16059 270 6860 -7226 -23184 -43216 -40808 -10866 36389 25758 -26575 -51348 -37350
16281c7350J7987K2338j3678M707J3708K5630j39j9758m113J4573q993k5754l032
$$ -37350 -19363 2975 -10703 -5996 7712 33342 33203 13445 9332 23905 14912 -10842 -13874
16268a3874j6080L175L6396K6715p465q033M000K1051P815k9199M178J0040r602
$$ -13874 -29954 -26779 9617 36332 28867 20834 24834 45885 53700 24501 28679 38719 29117
16255B9117j6474j8496j1943Q20O61J1584J0986k4327l9506J0672L0601j3489
$$ 29117 12643 -5853 -17796 -16976 -16315 -4731 6255 -18072 -57578 -46906 -16305 -29794
16243b9794k641j607j4173j4125K9059P787n09M8780L3010l8276j9280J7296L271
$$ -29794 -32435 -34042 -48215 -62340 -33281 -25494 -26003 22777 55787 17511 -1769 15527 18798
16230A8798j2255j7416J1667p752j1225l389O523L8899K1961k0326K5671J6349
$$ 18798 6543 -10873 794 -6958 -18183 -21572 -15049 23850 45811 25485 51156 67505
16218F7505l6065k9374k309R215j5816P398J5917j9761m343M0373J6001o421m321
$$ 67505 31440 2066 -243 8972 -6844 554 16471 -3290 -7633 32740 48741 42320 37999
16205C7999j9061l5906j305K1437N193J7757j8351J2352j2365o7195l8796K2920
$$ 37999 18938 -16968 -18273 3164 8357 26114 7763 20115 7750 -59445 -98241 -75321
16193g5321M0160r051L3461K9723N632k3919N087j2977k2291P456r974J6886J0408
$$ -75321 -35161 -44212 -10751 18972 24604 685 5772 -7205 -29496 -22040 -32014 -15128 -4720
16180d720J3730k0365n0719j274K5676Q55J2879K4496Q395L5453o378j7219j943
$$ -4720 9010 -11355 -62074 -63348 -37672 -36817 -23938 558 8953 44406 38028 20809 18866
16167A8866k6364k2429J0733n219m590Q375J1535J5860L8508k4996l7913m3502
$$ 18866 -7498 -29927 -19194 -24413 -29003 -20628 -9093 6767 45275 20279 -17634 -61136
16155f1136l3111j6028N536K4984K4062L9947L6243k1122O423J5646j9824l5743
$$ -61136 -94247 -110275 -104739 -79755 -55693 -15746 20497 -625 5798 21444 1620 -34123
16143c4123K3491M0704k3290k5315K1097j294l684l7542k2265L1760L1692J4533
$$ -34123 -10632 30072 6782 -18533 2564 1270 -2414 -39956 -62221 -30461 1231 15764
16131A5764m413K643k8389j8613M9769J3039l2574K6495J0092k8461o7828l0685
$$ 15764 11351 13994 -14395 -33008 16761 29800 -2774 23721 33813 5352 -62476 -93161
16119i3161m76M6511K0749n578n7990N587N1400M5201l1696L2844J4867j4488
$$ -93161 -93637 -47126 -26377 -31955 -89945 -84358 -32958 12243 -19453 13391 28258 13770
16107A3770Q85K1783J4553j0601l6410k0389m745J1062J7958l993J1087j5676
$$ 13770 14655 36438 50991 40390 3980 -16409 -21154 -10092 7866 3873 14960 -716
16095g16M2076l6007K7654K6650L4356j1250m0114j1982k3367P95K6652m7264
$$ -716 41360 5353 33007 59657 94013 82763 42649 30667 7300 8095 34747 -12517
16083a2517J6138O780k0232j3208L4076L1166J2144k0292j9916j9331k8481k3501
$$ -12517 3621 10401 -9831 -23039 11037 42203 54347 34055 14139 -5192 -33673 -57174
16071e7174q942J1111P989p427R283p732K3035L7428N6139L2463k5840m3980k8041
$$ -57174 -66116 -55005 -47016 -54443 -45160 -52892 -29857 7571 63710 96173 70333 26353 -1688
16058a688j3965n24j75J5821q906J4116K5065K0357m3280J9403j5237j3638k9023
$$ -1688 -15653 -16177 -16352 -531 -9437 4679 29744 50101 6821 26224 10987 -2651 -31674
16045c1674q99L9004k954l8042r077N791L4982K0073N422R294J2225J1475j2042
$$ -31674 -32573 6431 3477 -34565 -43642 -37851 -2869 17204 22626 31920 44145 55620 43578
16032D3578n100J5860k2233j6865l1396j7913j0422K0612L7990M058j62J3566
$$ 43578 38478 54338 32105 15240 -16156 -34069 -44491 -23879 14111 18169 18007 31573
16020C1573j3936k4551k0066J2951j9258l3699j9337M7461L2992N4950L7303q436
$$ 31573 17637 -6914 -26980 -14029 -33287 -66986 -86323 -38862 -5870 49080 86383 77947
16008G7947j8281j863k6754N809K4502k282l7447l9990J7661j8883K3434l727
$$ 77947 59666 57803 31049 36858 61360 59078 21631 -18359 -698 -19581 3853 126
15996A26K2988K924N6225L1785l0640o1339k6635K7953J3309q614K0639J1734
$$ 126 23114 26038 82263 114048 83408 22069 -4566 23387 36696 28082 48721 60455
15984F0455K0853k9257k3293m3276j2932J4794L8767K3668k6980o107l952j1442
$$ 60455 81308 52051 28758 -14518 -27450 -12656 26111 49779 22799 16692 12740 1298
15972A298m722J3154m993J1593j7948o722j8553L1318M400k8451j6950L1975K2529
$$ 1298 -3424 9730 4737 16330 -1618 -8340 -26893 4425 8825 -19626 -36576 -4601 17928
15959A7928j5790K2826l0354j6449Q574M5302K5628m5092l1281M11M0139k2719
$$ 17928 2138 24964 -5390 -21839 -13265 32037 57665 12573 -18708 -18297 21842 -877
15947h77q564N372j683J4820r559K7877M706j2295k0736M453J6488l6169M274
$$ -877 -9441 -4069 -5752 9068 -491 27386 32092 19797 -939 3514 20002 -16167 -11893
15934a1893J0116J5605L2650J6224p116p085O553r815p096j9580n886k6186j452
$$ -11893 -1777 13828 46478 62702 55586 48501 55054 45239 38143 18563 12677 -13509 -14961
15921a4961l1980j6799M8591K8193L4962K8276m8409o3774j5003r709R757M05
$$ -14961 -46941 -63740 -15149 13044 48006 76282 27873 -35901 -50904 -60613 -50856 -50451
15909e0451K8791J2257J7852k7497J1927L5285P21k7193J0693M222J4247j2304
$$ -50451 -21660 -9403 8449 -19048 -7121 28164 28885 1692 12385 16607 30854 18550
15897A8550j5171n844p741J7060J6064L691j7273l5580K0771K7626j2203o773
$$ 18550 3379 -2465 -10206 6854 22918 26609 9336 -26244 -5473 22153 9950 3177
15885C177j6486K574J914m1244Q686L1634J8824L1983r241r599j582q2318j3384
$$ 3177 -13309 -10735 -8821 -50065 -41379 -9745 9079 41062 31821 22222 20640 -61678 -75062
15872g5062Q357J3523j455O199L7757K672J6044K4561k264j4239L2620J1644N98
$$ -75062 -66705 -53182 -54637 -48438 -10681 -8009 8035 32596 30332 16093 48713 60357 60955
15859F0955m0639k521q504k0821L7770N388l5344M495l893J4433O619O249j3888
$$ 60955 20316 17795 9291 -11530 26240 31628 -3716 779 -3114 11319 17938 24187 10299
15846A0299r134J2948j4843R356k38K652n0475J2310J9276J2567K1113K9522L8710
$$ 10299 1165 14113 -730 8626 8388 11040 -39435 -27125 -7849 4718 25831 55353 94063
15833I4063m6637k8216K857q610k2944k0851L0231J0730l454R16J8755j1154l1218
$$ 94063 47426 19210 22067 13457 -9487 -30338 -107 10623 7169 8085 26840 15686 -15532
15820a5532q303K5792Q633j9900r325j2153L312l2297l0697J3622J9693J4941
$$ -15532 -23835 1957 10590 -9310 -18635 -30788 -27476 -59773 -90470 -76848 -57155 -42214
15808d2214m518J1323L5677L8549j2773k5028j2053J1457o618n534M968j0562
$$ -42214 -46732 -35409 268 38817 26044 1016 -11037 420 -6198 -11732 -6764 -17326
15796a7326j0040J3559O501L2916r668m4942l574o457j1420J5031K9544J9623
$$ -17326 -27366 -13807 -7306 25610 15942 -29000 -32574 -39031 -50451 -35420 -5876 13747
15784A3747J3660j8549j1356q321j7463M7540j3437q115j1643q06k6171j0174
$$ 13747 27407 8858 -2498 -10819 -28282 19258 5821 -2294 -13937 -14743 -40914 -51088
15772e1088l3150K3847J8412R880n532j2360J787M361k8323q503K9505M4832L8247
$$ -51088 -84238 -60391 -41979 -32099 -37631 -49991 -48204 -43843 -72166 -80669 -51164 -6332 31915
15759C1915M671k8618o517k2895J7645J6058J2525m6897K362L1163j1256j6613
$$ 31915 36586 7968 1451 -21444 -3799 12259 24784 -22113 -19751 11412 156 -16457
15747a6457j4454R688Q225Q716p60K713K8203L3699M966k5675m5143k954o776
$$ -16457 -30911 -21223 -12998 -4282 -5042 -2329 25874 59573 64539 38864 -6279 -9233 -16009
15734a6009M106l938l725l691K6319j0967k4068o319J4472K9898J3547l6548j1756
$$ -16009 -11903 -15841 -19566 -23257 3062 -7905 -31973 -38292 -23820 6078 19625 -16923 -28679
15721b8679J1883k0340j671j2040J220K2627K4290K5431J3852n317j630K2212
$$ -28679 -16796 -37136 -38807 -50847 -49627 -27000 -2710 22721 36573 31256 29626 51838
15709E1838J3771m0012l6115L836r802M6238L2945J857l4828m1325L4726K0487
$$ 51838 65609 25597 -10518 -6682 -16484 29754 62699 64556 29728 -11597 23129 43616
15697D3616K2645m8436m624K7375o099J4492l7176k1776J2543K2407j1432k6309
$$ 43616 66261 17825 13201 40576 34477 48969 11793 -9983 2560 24967 13535 -12774
15685a2774j6323J9521M5915K5591o569L503k097m3283j1545n139j7820k4465
$$ -12774 -29097 -9576 36339 61930 55361 58864 56767 13484 1939 -3200 -21020 -45485
15673d5485K8772L0140L614J104k1173K5593q406j7873J9076o642r169L4221o765
$$ -45485 -16713 13427 17041 18145 -3028 22565 14159 -3714 15362 8720 -449 33772 27007
15660B7007j8098r808j117M2494j9457k8934O96l103l0102N826L5197K4114l44
$$ 27007 8909 -899 -2016 40478 21021 -7913 -7217 -10320 -40422 -34596 601 24715 24371
15647B4371j6108j506L8924L4078j7934o8k4735j7395k7641r728j6544q961M979
$$ 24371 8263 6757 45681 79759 61825 61757 37022 19627 -8014 -17742 -34286 -43247 -38268
15634c8268M657k3127j133J1818o107K7941M4455n130o1724K7378m013n24J1021
$$ -38268 -33611 -56738 -57871 -46053 -52160 -24219 20236 15106 -46618 -19240 -23253 -23777 -12756
15621a2756m276L5438J7685n6719n144L5653J5854j0382k4044k4044O820K1755
$$ -12756 -17032 18406 36091 -20628 -25772 9881 25735 15353 -8691 -32735 -25915 -4160
15609d160L6586J9405p705l2365m4299k4591M641K1093J6005o762j5166L5929
$$ -4160 32426 51831 44126 11761 -32538 -57129 -52488 -31395 -15390 -22152 -37318 -1389
15597a389J1283k0781J3706L5703k3807O143J340j6256j5096K7687M0772L840
$$ -1389 9894 -10887 2819 38522 14715 20858 22198 5942 -9154 18533 59305 63145
15585F3145p385j4831l0183J9431n2347l0551K9630K3325q728k5475L4250K7908
$$ 63145 55760 40929 10746 30177 -22170 -52721 -23091 234 -8494 -33969 281 28189
15573B8189j7632k5483M097k6201K1335O828k3j7159K5921L2098O817j8092p243
$$ 28189 10557 -14926 -10829 -37030 -15695 -8867 -8890 -26049 -128 31970 38787 20695 13452
15560A3452j3007j965M205J1089J2154j7934L2792r707O684j5450k7939m45k2011
$$ 13452 445 -1520 2685 13774 25928 7994 40786 31079 37763 22313 -5626 -6071 -28082
15547b8082l2065L0201N819N678J8085J3593q849q256j8635J2417J4815o637k5912
$$ -28082 -60147 -29946 -24127 -18449 -364 13229 4380 -3876 -22511 -10094 4721 -1916 -27828
15534b7828j789L2278J3875k2027L5062M696J4315j0986j9159m1669Q462j368
$$ -27828 -29617 2661 16536 -5491 29571 34267 48582 37596 18437 -23232 -14770 -16138
15522a6138k3942o171M238R509Q658P823j2811k0900K7441M3232P168j8752j583
$$ -16138 -40080 -46251 -42013 -32504 -23846 -16023 -28834 -49734 -22293 20939 28107 9355 7772
15509G772L1541k6811J1284L70l0839L1479r46L1365j4287k4197n970K4469K5588
$$ 7772 39313 12502 23786 24156 -6683 24796 23850 55215 40928 16731 10761 35230 60818
15496F0818m2141k4913N0072k8240p878j3919Q757M823j621j141j7154q722N6816
$$ 60818 18677 -6236 43836 15596 7718 -6201 2556 7379 5758 4617 -12537 -21259 35557
15483C5557P5542K693j3649R819m3507m5263m8081m1504n878P453K1106J8111
$$ 35557 111099 113792 100143 109962 66455 21192 -26889 -68393 -74271 -66818 -45712 -27601
15471b7601O580K8412J1914j411k2872R169l349J4266n942m3364k2326Q711N729
$$ -27601 -21021 7391 19305 17894 -4978 4191 842 15108 9166 -34198 -56524 -47813 -42084
15458d2084K5641O0936j0035l0971l5806L9399k368k6141l7159J023M0091K2770
$$ -42084 -16443 44493 34458 3487 -32319 7080 4712 -21429 -58588 -57565 -17474 5296
15446E296j868j5067o396r899j5224Q652J022J6504J6078P832P191r214n96l707
$$ 5296 3428 -11639 -18035 -27934 -43158 -34506 -33484 -16980 -902 6930 14121 4907 4311 604
15432F04j3326k1976j5711J3149J3070l0860K0326O1764M4595j4411l4518l7793
$$ 604 -12722 -34698 -50409 -37260 -24190 -55050 -34724 27040 71635 57224 22706 -15087
15420a5087m345j4527J3388P694p531K8738j3415r975N519l5945n878L238q862
$$ -15087 -19432 -33959 -20571 -12877 -20408 8330 -5085 -15060 -9541 -45486 -51364 -48126 -56988
15407e6988J7186j1318j7772M1634K5596k9027k5450j6159Q433k4147r152K7642
$$ -56988 -39802 -51120 -68892 -27258 -1662 -30689 -56139 -72298 -63865 -88012 -97164 -69522
15395f9522O041L3679k6913L2866J4759J6435J2409j5120l6456J2318J5919j2946
$$ -69522 -63481 -29802 -56715 -23849 -9090 7345 19754 4634 -31822 -19504 -3585 -16531
15383a6531J0307K6729J3587j7819K0161j1817m8147k6436L877L1666L4857q811
$$ -16531 -6224 20505 34092 16273 36434 24617 -23530 -49966 -46089 -14423 20434 11623
15371A1623O540J1901J8170k0407k5474j6584Q541m9260j2144J9157Q049N278
$$ 11623 18163 30064 48234 27827 2353 -14231 -5690 -54950 -67094 -47937 -39888 -34610
15359c4610l4374j1676M4363K9539J5985o489m8264k0742J7711K4948K5297K4085
$$ -34610 -68984 -80660 -36297 -6758 9227 2738 -45526 -66268 -48557 -23609 1688 25773
15347B5773l568M427r028j6553p805j7289j7585j2980L3841L1654J1451J4350
$$ 25773 22205 26632 17604 1051 -6754 -24043 -41628 -54608 -20767 10887 22338 36688
15335C6688L279j0546j7401o600k9362k674k4134K282j799k6628L9589l930J0576
$$ 36688 39967 29421 12020 5420 -23942 -26616 -50750 -48468 -50267 -76895 -37306 -41236 -30660
15322c0660J6181k3103k675J4379L1125K5346Q83j4004j6665q708l5845Q891l390
$$ -30660 -14479 -37582 -40257 -25878 5247 30593 31476 17472 807 -7901 -43746 -34855 -38245
15309c8245l575N5536K4365l4942k5110K3062P633r699j6375L2920K6132l4911
$$ -38245 -41820 13716 38081 3139 -21971 1091 8724 -975 -17350 15570 41702 6791
15297F791m6719J6513J5994N0200L490m4782m8128J2134n37j066J6648J0081m946
$$ 6791 -39928 -23415 -7421 42779 46269 1487 -46641 -34507 -35044 -36110 -19462 -9381 -14327
15284a4327j5009R589R505j9267j9325j046J0279Q035K5860J7290j9886J410J2524
$$ -14327 -29336 -19747 -10242 -29509 -48834 -49880 -39601 -31566 -5706 11584 -8302 -6892 5632
15271E632L9860j913J0867K2016m026k0207j1592l4263l2186k853J2058o038j1299
$$ 5632 45492 43579 54446 76462 72436 52229 40637 6374 -25812 -28665 -16607 -22645 -33944
15258c3944j9661K0478N008k4736m750O941N9509N1655J5416q506o3386k6083
$$ -33944 -53605 -33127 -28119 -52855 -57605 -50664 8845 60500 75916 67410 4024 -22059
15246b2059Q606n005j0207J882l0383J4369J3287O367M7331J6609m4217j3812
$$ -22059 -13453 -18458 -28665 -26783 -57166 -42797 -29510 -23143 24188 40797 -3420 -17232
15234a7232j2538O426L5066J3720j3686j3471o090k597k3640J2320R352q962J0934
$$ -17232 -29770 -23344 11722 25442 11756 -1715 -7805 -10402 -34042 -21722 -12370 -21332 -10398
15221a0398k819K0628k2575j9660L563J0249m001k1447J8774P403j773J5198N694
$$ -10398 -13217 7411 -15164 -34824 -31261 -21012 -25013 -46460 -27686 -20283 -22056 -6858 -1164
15208a164J5913L829J1175M2673j1062R130l3607l4020l9776J7392j2152M7871
$$ -1164 14749 18578 29753 72426 61364 70494 36887 2867 -36909 -19517 -31669 16202
15196A6202m883j3368O42N97o051j7999j4442J2477j2806j8365o292L7177q041
$$ 16202 11319 -2049 -1407 -810 -6861 -24860 -39302 -26825 -39631 -57996 -64288 -27111 -35152
15183c5152R829N0818k3645J2081k7880L326K2300l7510j8624J0758O026R8J2438
$$ -35152 -25323 25495 1850 13931 -13949 -10623 11677 -25833 -44457 -33699 -27673 -27575 -15137
15170a5137K3623J8525L957j0790k8563l6044Q061M535O600J6322M1359M942k5509
$$ -15137 8486 27011 30968 20178 -8385 -44429 -36368 -31833 -25233 -8911 32448 37390 11881
15157A1881n6042O938J6794m320n307l218N4177J6745l1348m5950k7762N280J2891
$$ 11881 -44161 -37223 -20429 -24749 -30056 -33274 20903 37648 6300 -39650 -67412 -62132 -49241
15144d9241r140j5772l083m670j89J3977K7343K2344K3080Q737n135j331j4122
$$ -49241 -58381 -74153 -77236 -81906 -82095 -68118 -40775 -18431 4649 13386 8251 6920 -7202
15131g202J5432j7569J6615m212k5539k7003j1648j6813P043J8126K9191N256
$$ -7202 8230 -9339 7276 3064 -22475 -49478 -61126 -77939 -70896 -52770 -23579 -18323
15119a8323q404J5223L8415K7934n2736m9845n289K4354k3419j7377J3156P333
$$ -18323 -26727 -11504 26911 54845 2109 -47736 -53025 -28671 -52090 -69467 -56311 -48978
15107d8978P892K2614j0489J1667J0133M360k8114M046K1547j3934L211k3449
$$ -48978 -41086 -18472 -28961 -17294 -7161 -2801 -30915 -26869 -5322 -19256 -16045 -39494
15095c9494p440J8967N2141J1362m2985l7813R588L6595L2342m839q546k5657
$$ -39494 -46934 -27967 24174 35536 -7449 -45262 -35674 921 33263 28424 19878 -5779
15083e779k3064n1935L8594O6973j8116o2903J7444L1117l3447j239k360j2029
$$ -5779 -28843 -80778 -42184 24789 6673 -56230 -38786 -7669 -41116 -42355 -44715 -56744
15071e6744o115l1445j4795M0451L8897l1376J9255K8804J5060J6589K2067q480
$$ -56744 -62859 -94304 -109099 -68648 -29751 -61127 -41872 -13068 1992 18581 40648 32168
15059C2168J0601j7783j0848K3621k3674M1993J9182l634j1225l1486m7930j1743
$$ 32168 42769 24986 14138 37759 14085 56078 75260 71626 60401 28915 -19015 -30758
15047c0758L6725K2518l3174l0785J1281K8645Q631j3696N555P285J721J7757
$$ -30758 5967 28485 -4689 -35474 -24193 4452 13083 -613 4942 12227 13948 31705
15035C1705n703J6480K7098K1163N767l3207m1786m6740r919J6842J3058K2238
$$ 31705 26002 42482 69580 90743 96510 63303 21517 -25223 -35142 -18300 -5242 16996
15023A6996j9374k1177J8343J5478l18j2920P659K9724K2788j1239l0439j4244
$$ 16996 -2378 -23555 -5212 10266 9948 -2972 4687 34411 57199 45960 15521 1277
15011A277J1365j9116n814l4294Q041N0010J7606n0071j4976J8286j1102j2094
$$ 1277 12642 -6474 -12288 -46582 -38541 11469 29075 -20996 -35972 -17686 -28788 -40882
14999d0882j845J7835K5521J7159M1815j9973m3866k5951k3860R287J6709K4782
$$ -40882 -42727 -24892 629 17788 59603 39630 -4236 -30187 -54047 -44760 -28051 -3269
14987c269N9291j2780l2802o290J1556n7145j5563J47k555l7297K8720K0136K0416
$$ -3269 56022 43242 10440 4150 15706 -41439 -57002 -56855 -59410 -96707 -67987 -47851 -27435
14974b7435k54k3264L6039L9038r227k4060j8393k2472N587K1383N111o2372r238
$$ -27435 -27689 -50953 -14914 24124 14897 -9163 -27556 -50028 -44441 -23058 -17947 -80319 -89557
14961h9557Q318K0217O4774L5295J1604j8995J9839k1293M740l7429k0023r837
$$ -89557 -81239 -61022 3752 39047 50651 31656 51495 30202 34942 -2487 -22510 -32347
14949c2347L3857K2133l763K0451l4613l5745K461j3926M2424K2666m130o907
$$ -32347 1510 23643 19880 40331 5718 -30027 -27566 -41492 932 23598 19468 12561
14937A2561k9027J365j3918n2132j477M5006K4145j7074m769R666k251l419J4818
$$ 12561 -16466 -15101 -29019 -81151 -82628 -37622 -13477 -30551 -35320 -25654 -27905 -31324 -16506
14924a6506J6092r658M338n895K1167N086k6721o321J5034l0738K3486n200j8102
$$ -16506 -414 -10072 -5734 -11629 9538 14624 -12097 -18418 -3384 -34122 -10636 -15836 -33938
14911c3938j6344K8213L2365K6046L69l6858j167L2999J4903j6501J1535j0962
$$ -33938 -50282 -22069 10296 36342 36711 -147 -1314 31685 46588 30087 41622 30660
14899C0660J946M258K4435l9049l8136k8725l6721J1515K5473m93J8739M1838
$$ 30660 32606 36864 61299 22250 -15886 -44611 -81332 -69817 -44344 -44837 -26098 15740
14887A5740k7291l8710J7543Q809j2178P813L1021r504M798K0357k7393j612J2937
$$ 15740 -11551 -50261 -32718 -23909 -36087 -28274 2747 -6757 -1959 18398 -8995 -10607 2330
14874B330R600j5578Q961l0704L973q514r102j4229K6251K9787J615k6508l3340
$$ 2330 11930 -3648 5313 -25391 -21418 -29932 -39034 -53263 -27012 2775 4390 -22118 -55458
14861e5458K1191N1301j5704k7688K3375J5210K0473j6693j6325J6583P230j7103
$$ -55458 -34267 17034 1330 -26358 -2983 12227 32700 16007 -318 16265 23495 6392
14849F392j4965K1599L0771R934m4690m4907K6794J6215o315L9300K2729j5767
$$ 6392 -8573 13026 43797 53731 9041 -35866 -9072 7143 828 40128 62857 47090
14837D7090J132L792j4365j3250j6595j3097K281L439K8312K600j675n085j5988
$$ 47090 48222 52014 37649 24399 7804 -5293 -3012 427 28739 31339 29664 24579 8591
14824H591L3145l3151p7645n6032J5622L3400N3534M1219k2275r807P750J0219
$$ 8591 41736 8585 -69060 -125092 -109470 -76070 -22536 18683 -3592 -13399 -5649 4570
14812D570J0803O940P750j8932m0172M911K1995j0410l6146P557M3408O960q732
$$ 4570 15373 22313 30063 11131 -29041 -24130 -2135 -12545 -48691 -41134 2274 9234 502
14799E02j7009m8910p456J8013q907Q513M6067J9554R799m571r807J146Q067J1819
$$ 502 -16507 -65417 -72873 -54860 -63767 -55254 -9187 10367 20166 15595 5788 6934 15001 26820
14785B6820n047j9182j9407l8074J8485M5244J2635O820L248k0047J3294m8746
$$ 26820 21773 2591 -16816 -54890 -36405 8839 21474 28294 31542 11495 24789 -23957
14773b3957m6226K3766J8205K1911k0631o044o13j2404k9658P577K7624J8017
$$ -23957 -70183 -46417 -28212 -6301 -26932 -32976 -33589 -45993 -75651 -68074 -40450 -22433
14761b2433p717J4637q860J8236p034j7999j8140J4123J9262L987J5097Q883o458
$$ -22433 -30150 -15513 -24373 -6137 -13171 -31170 -49310 -35187 -15925 -11938 3159 12042 5584
14748E584Q554N697L835j3207Q555J082j3187o977j0626k1396j5394L9826L6068
$$ 5584 14138 19835 23670 10463 19018 20100 6913 -64 -10690 -32086 -47480 -7654 28414
14735B8414J1536L357l4418j7973j9863Q32L1318K4979j8307J2947J1765J3797
$$ 28414 39950 43307 8889 -9084 -28947 -28115 3203 28182 9875 22822 34587 48384
14723D8384m1323j0199Q161k2012k0979J4914J7192j7447m2367m118J6773j98
$$ 48384 7061 -3138 5023 -16989 -37968 -23054 -5862 -23309 -65676 -69794 -53021 -53219
14711e3219J6579L4068k9506j3528k0360j1478L3158R0m638K8008J3477k5867
$$ -53219 -36640 -2572 -32078 -45606 -65966 -77444 -44286 -44196 -48834 -20826 -7349 -33216
14699c3216L457K0889r250J7995O286k0023k1814j3597L1734j4755K935O1981
$$ -33216 -29759 -8870 -18120 -125 6161 -13862 -35676 -49273 -17539 -32294 -29359 32622
14687C2622K4635k5517r148N318j5484J7114k5199l9193J8337N2796k8799K3541
$$ 32622 57257 31740 22592 27910 12426 29540 4341 -34852 -16515 36281 7482 31023
14675C1023O2598J2103m9783j1755o860N251L860k6102k0039L3324N718J2673
$$ 31023 93621 105724 55941 44186 37326 42577 46437 20335 296 33620 39338 52011
14663E2011J596O125J5464r048l2540J639k1792k1826M316K2612K8667k9168k0747
$$ 52011 53607 59732 75196 66148 33608 35247 13455 -8371 -4055 18557 47224 18056 -2691
14650b691J1494N264J2737k7644k2357l7258k209nj1211M7668J234K6999J4184
$$ -2691 8803 14067 26804 -840 -23197 -60455 -62664 -62669 -73880 -26212 -24978 2021 16205
14637A6205M713l8738L4926L2461k665j6579J0529k0330k2527O154m061l3051
$$ 16205 20918 -17820 17106 49567 46902 30323 40852 20522 -2005 4149 88 -32963
14625c2963k5086k2803K7384J4582l5243M762j0319o5879m082L3367N138J0607
$$ -32963 -58049 -80852 -53468 -38886 -74129 -69367 -79686 -145565 -149647 -116280 -111142 -100535
14613a00535O1455M1881M0661l4721J3787J1602m6165k1310L365k515R051M418
$$ -100535 -39080 2801 43462 8741 22528 34130 -12035 -33345 -29980 -32495 -23444 -19026
14601a9026P193l994K435n812M8765j4616k6362L764J9698r930q771J7456k773
$$ -19026 -11833 -15827 -13392 -19204 29561 14945 -11417 -7653 12045 2115 -6656 10800 8027
14588H027j4466k4987k8134r50L3174J6215p441l305n4654j3234J8976J6818j0671
$$ 8027 -6439 -31426 -59560 -60510 -27336 -11121 -18562 -21867 -76521 -89755 -70779 -53961 -64632
14575f4632O739K6086L2509o002n6374r839J3621j0871O717J9311J4058J4357
$$ -64632 -57893 -31807 702 -5300 -61674 -71513 -57892 -68763 -62046 -42735 -28677 -14320
14563a4320L864j074J9862K5575k326k1371M2l3142j6376J7735R560N810K996
$$ -14320 -10456 -11530 8332 33907 31581 10210 10252 -22890 -39266 -21531 -11971 -6161 -3165
14550c165L64K1161j796m0541k1296J9595Q796q821k032k233L2577J0320k638
$$ -3165 -2801 18360 16564 -23977 -45273 -25678 -16882 -25703 -27735 -29968 2609 12929 10291
14537A0291J5660n888j0285l1195l3207j3814J8363j72k4380K5317K494K2465
$$ 10291 25951 20063 9778 -21417 -54624 -68438 -50075 -50247 -74627 -49310 -46816 -24351
14525b4351L0472l3987L35K6292R195J149k557n31m4456L242L7854K6249j7623
$$ -24351 6121 -27866 -27531 -1239 7956 9105 6548 6017 -38439 -35197 2657 28906 11283
14512A1283k37J4198j5168l2311K1024J6861k3002q328j1066O164J2228J0674
$$ 11283 11046 25244 10076 -22235 -1211 15650 -7352 -15680 -26746 -20582 -8354 2320
14500B320m725N141O220p543l4656j8987n443L6032L4943M115N862J0442N913
$$ 2320 -2405 2736 8956 1413 -33243 -52230 -57673 -21641 13302 17417 23279 33721 39634
14487C9634N390j2273l0585o448K4488M065J3700q793Q579J3771K9771j8319l3120
$$ 39634 45024 32751 2166 -4282 20206 24271 37971 29178 37757 51528 81299 62980 29860
14474B9860j6388J8944J242l1462n3325k5043l832K6424J1177J0352M5663k8713
$$ 29860 13472 32416 33658 2196 -51129 -76172 -80004 -53580 -42403 -32051 13612 -15101
14462a5101l662L3659M721m482J3307P427p379k0188R36M334j3066k5062o838
$$ -15101 -18763 14896 19617 15135 28442 35869 28490 8302 9238 13572 506 -24556 -31394
14449c1394L3239j1265J209L6480j8028J9364J1852l6184m564J0231K9425j6748
$$ -31394 1845 -9420 -8211 28269 10241 29605 41457 5273 709 10940 40365 23617
14437B3617k3752l0148J315L394J9774j043j8254j7079K6471k961j3037j2089
$$ 23617 -135 -30283 -28968 -25574 -5800 -6843 -25097 -42176 -15705 -18666 -31703 -43792
14425d3792Q748o439P090N8512R542j986q535m6319p724L1186J523k1600k9308
$$ -43792 -35044 -41483 -34393 24119 33661 31675 23140 -23179 -30903 283 1806 -19794 -49102
14412d9102j0413J9289P844j1293K7715R704J879K863K512lJ3467K6642j1791
$$ -49102 -59515 -40226 -32382 -43675 -15960 -6256 -4377 -1514 998 995 14462 41104 29313
14399B9313m1665j6761o299m874Q549J5679Q195J6924n3255k9065J2888K7606
$$ 29313 -12352 -29113 -35412 -40286 -31737 -16058 -7863 9061 -44194 -73259 -60371 -32765
14387c2765J0433J3468O729P391k5298l0949L897M039K3351j7725j9257L7000
$$ -32765 -22332 -8864 -2135 5256 -20042 -50991 -47094 -43055 -19704 -37429 -56686 -19686
14375a9686J3138k3020K3129O0491K462m5466n243K0400K2902R50l8509j4249
$$ -19686 -6548 -29568 -6439 54052 56514 11048 5805 26205 49107 50057 11548 -2701
14363b701K0103k817L1625L0123p1041l7626o382m284J4769K5545K4476O049L1798
$$ -2701 17402 14585 46210 76333 5292 -32334 -38716 -43000 -28231 -2686 21790 27839 59637
14350E9637n1961m0391l3850P106k381l6382K518L3099R07K8034K2445O180k6018
$$ 59637 7676 -32715 -66565 -59459 -61840 -98222 -95704 -62605 -61698 -33664 -11219 -5039 -31057
14337c1057L2012M1404j9292l2801K3572k930r565J3808K561j9068j5698K5324
$$ -31057 955 42359 23067 -9734 13838 10908 1343 15151 17712 -1356 -17054 8270
14325H270J1801j0440O179m477l063k160L5191j9124j4621q54l1953k1011O0017
$$ 8270 20071 9631 15810 11333 8270 6110 41301 22177 7556 6702 -25251 -46262 13755
14312A3755J3152O179j9970n8176j7997Q694K7701P087J7416n369J6675K0806
$$ 13755 26907 33086 13116 -45060 -63057 -54363 -26662 -19575 -2159 -7528 9147 29953
14300B9953k16p650k1090N835J1560n527J3681M915O159j4670L374l8761m8382
$$ 29953 29737 22087 997 6832 18392 12865 26546 31461 37620 22950 26324 -12437 -60819
14287f0819L8621M9069j5521j2132j0173j0591O830j743k119K8899K4821J2892
$$ -60819 -22198 26871 11350 -782 -10955 -21546 -14716 -16459 -18578 10321 35142 48034
14275D8034j6690k0805l025l5626n489L2449J0800k1721j2354j7077J5107R41
$$ 48034 31344 10539 7514 -28112 -33601 -1152 9648 -12073 -24427 -41504 -26397 -25456
14263b5456j365K6406L6560q908p75j2629k5275J0764J8986p044Q318L4818P869
$$ -25456 -26821 -415 36145 27237 26462 13833 -11442 -678 18308 11264 19582 54400 62269
14250F2269m902K0971l8821n7209j4816K287L6625N4889K837l5910n1231k5914
$$ 62269 57367 78338 39517 -17692 -32508 -30221 6404 61293 64130 28220 -23011 -48925
14238d8925l8922K6992M6785k7236J5648L7485K4294j7006j3140p846l2717n7172
$$ -48925 -87847 -60855 -14070 -41306 -25658 11827 36121 19115 5975 -1871 -34588 -91760
14226i1760O147K1118J9411O153M9836L292k2426n2494o314J3496L2404M308K2117
$$ -91760 -85613 -64495 -45084 -38931 10905 14197 -8229 -60723 -67037 -53541 -21137 -16829 5288
14213E288K5005j7027n3462J2717j267o016L0986j6769p211o841O884J8627L029
$$ 5288 30293 13266 -40196 -27479 -28746 -34762 -3776 -20545 -27756 -34597 -27713 -9086 -6057
14200f057Q717j0249J8155o41J5447J6467M682M050j6698k9589J9199K1528l0640
$$ -6057 2660 -7589 10566 9925 25372 41839 46521 50571 33873 4284 23483 45011 14371
14187A4371K2777K42k1713j6745R702L958R545p529l5364l022J5748N875L702
$$ 14371 37148 37390 15677 -1068 8634 12592 22137 14608 -20756 -23778 -8030 -2155 1547
14174A547k3819M4287p657m4477k3764K8955K8754P821J7027K0511n8667k7758
$$ 1547 -22272 22015 14358 -30119 -53883 -24928 3826 11647 28674 49185 -9482 -37240
14162c7240K0986P140J609J8414m797n072J4163L0674k05o0728P745J7100j0840
$$ -37240 -16254 -9114 -7505 10909 6112 1040 15203 45877 45672 -15056 -7311 9789 -1051
14149a051K286N929l52J6306q347j3615o2133J3624J1278M7790L9719n56M081
$$ -1051 1235 7164 6812 23118 14771 1156 -60977 -47353 -36075 11715 51434 50878 54959
14136E4959L4037l402k7337k4630n3286l0782M9595J7276J020p115Q896J0697
$$ 54959 88996 85594 58257 33627 -19659 -50441 -846 16430 17450 10335 19231 29928
14124B9928K281R569k2878l9406J9811J1911o693K3114k2560m9443K2654K2492
$$ 29928 32209 41778 18900 -20506 -695 11216 4523 27637 5077 -44366 -21712 780
14112G80j1520j0836k0502K6606K3914m367K1380k6193j1667k584J5256r02K2896
$$ 780 -10740 -21576 -42078 -15472 8442 4075 25455 -738 -12405 -14989 267 -635 22261
14099B2261n130m0175l8573P96L5467L8421J1340n003k6293L4425K2792k4117
$$ 22261 17131 -23044 -61617 -60821 -25354 13067 24407 19404 -6889 27536 50328 26211
14087B6211j1035j7817L3847K6767l1203j5336J0797j4712j367L836l962J4095
$$ 26211 15176 -2641 31206 57973 26770 11434 22231 7519 6152 9988 6026 20121
14075B0121N01k5498k590j2652J1837M604N596J397J8873l216j9901R520J3117
$$ 20121 20622 -4876 -7466 -20118 -8281 -3677 1919 3316 22189 18973 -928 8592 21709
14062B1709J1636L5945k8925m6147j1740p318m634P356M1078K741N330j5955j3494
$$ 21709 33345 69290 40365 -5782 -17522 -24840 -29474 -22118 18960 21701 27031 11076 -2418
14049b418m2655m2833M0458K3383k2061o119M0696K8422k874K1039j7736l1114
$$ -2418 -45073 -87906 -47448 -24065 -46126 -52245 -11549 16873 13999 35038 17302 -13812
14037a3812J2359M719l7465j1909L5972K7983K377o784j6206o410l0169O13J1228
$$ -13812 -1453 3266 -34199 -46108 -10136 17847 20224 13440 -2766 -9176 -39345 -38732 -27504
14024b7504j7317q354Q694j033j4795L0263M4134K4110K4509o75j4365l3908k2737
$$ -27504 -44821 -53175 -44481 -45514 -60309 -30046 14088 38198 62707 62032 47667 13759 -8978
14011h978R107l8576j7785j9164m354K8000P850J7273L3603N899K0866j7234r878
$$ -8978 129 -38447 -56232 -75396 -79750 -51750 -43900 -26627 6976 12875 33741 16507 6629
13998F629k8562K1593o455j9681J031k5547o630j7086M6307L0441k442P28q526
$$ 6629 -21933 -340 -6795 -26476 -25445 -50992 -57622 -74708 -28401 2040 -402 326 -8200
13985h200J4536k7863j0273L4753J8611n697k0688l7825L1345K1975k4957J8529
$$ -8200 6336 -21527 -31800 2953 21564 15867 -4821 -42646 -11301 10674 -14283 4246
13973D246j1409j0764m721K9054m622l7359M048J3268o250K4250K1029l2545k0646
$$ 4246 -7163 -17927 -22648 6406 1784 -35575 -31527 -18259 -24509 -259 20770 -11775 -32421
13960c2421J5125q954J044k3147M5595M1647m0331l232L5139K613j1349L145j7770
$$ -32421 -17296 -26250 -25206 -48353 -2758 38889 -1442 -4674 30465 33078 21729 24874 7104
13947G104l6199J4505N2277K3755k1362j6322J2935k7982j5109k1420j6651j9783
$$ 7104 -29095 -14590 37687 61442 40080 23758 36693 8711 -6398 -27818 -44469 -64252
13935f4252M120M7821L0209M1767j0632k7368k0070k220l0685l7413k712M4728
$$ -64252 -60132 -12311 17898 59665 49033 21665 1595 -625 -31310 -68723 -71435 -26707
13923b6707M9710j0764l1281k2767J9272J4816n1412M636J7422k3265K3018J3798
$$ -26707 23003 12239 -19042 -41809 -22537 -7721 -59133 -54497 -37075 -60340 -37322 -23524
13911b3524J9829L666q091r9J2688K8670J1294r211n3850j7259R970J6361l1958
$$ -23524 -3695 -29 -8120 -8219 4469 33139 44433 35222 -18628 -35887 -25917 -9556 -41514
13898d1514j1028K048L9751J2236m367j2478J1920J1410O182q36J2277J249j3490
$$ -41514 -52542 -50494 -10743 1493 -2874 -15352 -3432 7978 14160 13324 25601 26850 13360
13885A3360j4460l1332o575j725J5091L894o434k4321J1604K0460j1260J7101
$$ 13360 -1100 -32432 -39007 -40732 -25641 -21747 -28181 -52502 -40898 -20438 -31698 -14597
13873a4597J6945R492j2293m573K0728Q405n1357m4391L129j669K6929L807Q081
$$ -14597 2348 11840 -453 -5026 15702 24107 -27250 -71641 -68512 -70181 -43252 -39445 -31364
13860c1364N2230k546j8435J1348j3458j8828L1349J9717m7479k5562K7682L3120
$$ -31364 20866 18320 -115 11233 -2225 -21053 10296 30013 -17466 -43028 -15346 17774
13848A7774Q165n4989l3768K0138J3445K0665J9171P688o601k8771l1793J7624
$$ 17774 25939 -29050 -62818 -42680 -29235 -8570 10601 18289 11688 -17083 -48876 -31252
13836c1252K2561J5887L9685j4986n3133k971M889n577P476J1383P032l9152K533
$$ -31252 -8691 7196 46881 31895 -21238 -24209 -19320 -24897 -17421 -6038 994 -38158 -35625
13823c5625k2729O198p077K496J3012Q689j1211M149J2256K7792K0439k3371j2914
$$ -35625 -58354 -52156 -59233 -56737 -43725 -35036 -46247 -42098 -29842 -2050 18389 -4982 -17896
13810a7896J6591J6045n4026J8101J8834J3440j295j8224M880o316q553p123k5626
$$ -17896 -1305 14740 -39286 -21185 -2351 11089 9794 -8430 -3550 -9866 -18419 -25542 -51168
13797e1168l049o151L8309j2371j7360K2106N645N917j4065r982J9951L0437j170
$$ -51168 -54217 -60368 -22059 -34430 -51790 -29684 -24039 -18122 -32187 -42169 -22218 8219 7049
13784G049J6721N243m598j8181j4131J1919k949M164J7469l2019k3853J5744J3886
$$ 7049 23770 29013 24415 6234 -7897 4022 1073 5237 22706 -9313 -33166 -17422 -3536
13771c536O759k4222j2376j7707j2973J9214O2130L597j9978l199j814R968k623
$$ -3536 3223 -20999 -33375 -51082 -64055 -44841 17289 20886 908 -2291 -4105 5863 3240
13758C240p162j2484k0132k7494J6771p902j2420J4629O0121J2164K0178m3942
$$ 3240 -3922 -16406 -36538 -64032 -47261 -55163 -67583 -52954 7167 19331 39509 -4433
13746d433m6543n88l611K2797k1051j0872J4775J166Q707K3493j248L2879J9023
$$ -4433 -50976 -51564 -55175 -32378 -53429 -64301 -49526 -48360 -39653 -16160 -17408 15471 34494
13733C4494m2686J0935J44j0413j9011L1026K8951l1635r369N36P674o0203k3991
$$ 34494 -8192 2743 2887 -7526 -26537 4489 33440 1805 -7564 -7028 646 -59557 -83548
13720h3548L6178K2679j4164k1955j0188K2123P3588K4919j8940r976j7365k4316
$$ -83548 -47370 -24691 -38855 -60810 -70998 -48875 24713 49632 30692 20716 3351 -20965
13708b0965J1576j2393l1774O847p075J8289O578P979Q916j6744K907n140L0483
$$ -20965 -9389 -21782 -53556 -46709 -53784 -35495 -28917 -20938 -12022 -28766 -25859 -30999 -516
13695e16Q547l4257K1915K2985Q241l281q366n3459n1559j1287K4719J9551L3638
$$ -516 8031 -26226 -4311 18674 26915 23634 15268 -38191 -89750 -101037 -76318 -56767 -23129
13682b3129J3010j4048r185r441k0651L5589J1535L0328J7542k8736K710K1699
$$ -23129 -10119 -24167 -33352 -42793 -63444 -27855 -16320 14008 31550 2814 5524 27223
13670B7223N601n5069k4995k026k1099K542K4941Q565j948n438L0553L236J1525
$$ 27223 32824 -22245 -47240 -49266 -70365 -67823 -42882 -34317 -36265 -41703 -11150 -7914 3611
13657C611K4074j3001k4025j5032J6499N626K3080j3999k1861J0994J0404O786
$$ 3611 27685 14684 -9341 -24373 -7874 -2248 20832 6833 -15028 -4034 6370 13156
13645A3156k5678m760L6203L3337K3077K586l2155j8951l2907J6798P116j5196
$$ 13156 -12522 -17282 18921 52258 75335 77921 45766 26815 -6092 10706 17822 2626
13633B626J0542K2656n455j1530K452m052K845j4700j7345m469n639N88L3987
$$ 2626 13168 35824 30369 18839 21291 17239 20084 5384 -11961 -16430 -22069 -21481 12506
13620A2506R135n2342k3738K7526N868k8499n256N9006Q570k9417l0179L6621
$$ 12506 21641 -30701 -54439 -26913 -21045 -49544 -54800 4206 12776 -16641 -46820 -10199
13608a0199K1029k0207J3817j1795k8360L8624J3509j5940j4873n181l4946j4400
$$ -10199 10830 -9377 4440 -7355 -35715 2909 16418 478 -14395 -19576 -54522 -68922
13596f8922J814K2027k48l6613K3290M1981L0520K2837j4611k072q352l343o174
$$ -68922 -67108 -45081 -45329 -81942 -58652 -16671 13849 36686 22075 20003 11651 8308 2134
13583B134J2643l7800p797J324M1395K6919j2182j5950j8404k8743j1767k542
$$ 2134 14777 -23023 -30820 -29496 11899 38818 26636 10686 -7718 -36461 -48228 -50770
13571e0770J1688J6868p289j7674j1217K3185O621N6860Q086j454k2562j373m331
$$ -50770 -39082 -22214 -29503 -47177 -58394 -35209 -28588 28272 36358 34904 12342 10969 6638
13558F638J8565N2159k6836p4536k5204q364J3803J1820r337p74J5227r824J1681
$$ 6638 25203 77362 50526 -24010 -49214 -57578 -43775 -31955 -41292 -42066 -26839 -36663 -24982
13545b4982R517k7072R626P2856M591l3108J412L1230P102k6492j31J2610R330
$$ -24982 -15465 -42537 -32911 39945 44536 11428 12840 44070 51172 24680 24549 37159 46489
13532D6489l1411j7538n387K1827m3805k8053K7510R037j4918Q161J4163M612
$$ 46489 15078 -2460 -7847 13980 -29825 -57878 -30368 -21331 -36249 -28088 -13925 -9313
13520i313J8089p469m4072k9137j5217K1335J2490k27K2444J811K7494j718q040
$$ -9313 8776 1307 -42765 -71902 -87119 -65784 -53294 -53521 -31077 -29266 -1772 -3490 -11530
13507a1530k3885l6103J0599q120j0913N3658K9983l6410p503k8254J7716K1358
$$ -11530 -35415 -71518 -60919 -69039 -79952 -26294 3689 -32721 -40224 -68478 -50762 -29404
13495b9404P861j0077n0058K5616N7561l5299m2381o389M0171L4239j1739J0851
$$ -29404 -21543 -31620 -81678 -56062 1499 -33800 -76181 -82570 -42399 -8160 -19899 -9048
13483i048J3310Q33J1444K7324l8136l477n111r083K1314m2202j1953j717J368
$$ -9048 4262 5095 16539 43863 5727 2250 -2861 -11944 9370 -32832 -44785 -46502 -45134
13470d5134K1158L4956j905m3069k1627L4654J8514n4533j1860J9285j5411J4517
$$ -45134 -23976 10980 9075 -33994 -55621 -20967 -2453 -56986 -68846 -49561 -64972 -50455
13458e0455j5280K9485J6636J9479p690K057L0647j7395o2995k442O0933J8604
$$ -50455 -65735 -36250 -19614 -135 -7825 -5768 24879 7484 -55511 -57953 2980 21584
13446B1584R399Q289k0582J7622K8070L3875k1174m6604k4503m6277k0377L7312
$$ 21584 30983 39272 18690 36312 64382 98257 77083 30479 5976 -40301 -60678 -23366
13434b3366L0892J0186j873j412l3266p977N208J6900l4017l3039L8929Q516q
$$ -23366 7526 17712 15839 14427 -18839 -26816 -21608 -4708 -38725 -71764 -32835 -24319 -24327
13421b4327L822K0637N864J8527m525J3375m5083m2722K4054L4770j6375j798
$$ -24327 -20505 132 5996 24523 19998 33373 -11710 -54432 -30378 4392 -11983 -13781
13409a3781j3214J4640r321k7005M1735l636k0432j8350l9325j3245J448L8679
$$ -13781 -26995 -12355 -21676 -48681 -6946 -10582 -31014 -49364 -88689 -101934 -100486 -61807
13397f1807K9222L5469j3919J1021l1053j2177J3302m249J5483J6532J0935K2923
$$ -61807 -32585 2884 -11035 -14 -31067 -43244 -29942 -34191 -18708 -2176 8759 31682
13385C1682J0067P199j6673L054j4009J686K5003N759J6403k1993k5249j2942
$$ 31682 41749 48948 32275 35329 21320 23006 48009 53768 70171 48178 22929 9987
13373I987j0894L72q379P820K0207j9514m170K7705J2429j7298k9906j8583k794
$$ 9987 -907 -535 -8914 -1094 19113 -401 -4571 23134 35563 18265 -11641 -30224 -33018
13360c3018K2401l3694l9358L0321p772J3677j5447J0011N5468n785l4836m238
$$ -33018 -10617 -44311 -83669 -53348 -61120 -47443 -62890 -52879 2589 -3196 -38032 -42270
13348d2270J1148R697M257k8971K7181J1282k0058j1173L14K6638J4919L6768
$$ -42270 -31122 -21425 -17168 -46139 -18958 -7676 -27734 -38907 -38593 -11955 2964 39732
13336C9732p549m0665j0592p579j5365M002j7960K2143L5946J3487k4965p945
$$ 39732 32183 -8482 -19074 -26653 -42018 -38016 -55976 -33833 2113 15600 -9365 -17310
13324a7310J7384M28J4119p374j6714j6253N359O970q183k7800K9453K4719M313
$$ -17310 74 502 14621 7247 -9467 -25720 -20361 -13391 -21574 -49374 -19921 4798 9111
13311I111k6241l4007L1533J5047j2201J1165L5212L7669j993m6908k6338P139
$$ 9111 -17130 -51137 -19604 -4557 -16758 -5593 29619 67288 65295 18387 -7951 -812
13299h12K3486K4329j206j3636j6683k3174Q623k451L2780q358l025K2299o47
$$ -812 22674 47003 45797 32161 15478 -7696 927 -1524 31256 22898 19873 42172 41525
13286D1525n5769j5411L070m243l410L4020j4924P756N767L999J6992K2439O108
$$ 41525 -14244 -29655 -26585 -30828 -34238 -218 -15142 -7386 -1619 2380 19372 41811 47919
13273D7919l2604j8187N83J7329J8579j2385o4401m3889R953K9355M1759P810
$$ 47919 15315 -2872 -2289 15040 33619 21234 -43167 -87056 -77103 -47748 -5989 1821
13261A821j7785M853J5086L959J120J1633j4245R342j9219K6422n510k5702m5501
$$ 1821 -15964 -11111 3975 7934 9054 20687 6442 15784 -3435 22987 17477 -8225 -53726
13248e3726k4251M1429J1623J3779r25Q835J9793k5842J2010K2414J9102J5807
$$ -53726 -77977 -36548 -24925 -11146 -12071 -3236 16557 -9285 2725 25139 44241 60048
13236F0048l4009P614R12L6930M596j1191o621m2939k3229J1680k1022Q056L8502
$$ 60048 26039 33653 34565 71495 76091 64900 58279 15340 -7889 3791 -17231 -9175 29327
13223B9327L5948J0049j2133j6514j8492o0732k140j3133J0124M393J2301M1643
$$ 29327 65275 75324 63191 46677 28185 -32547 -34687 -47820 -37696 -33303 -21002 20641
13211B0641q178j5389J2572K1789J2755k5937l474m333K6598K150k2338m1670
$$ 20641 12463 -2926 9646 31435 44190 18253 14779 10446 37044 39194 16856 -24814
13199b4814j8658n563q219N5904j211r057J6195P370k1849R295M720k9203j3149
$$ -24814 -43472 -49035 -57254 -1350 -2561 -11618 4577 11947 -9902 -607 4113 -25090 -38239
13186c8239K5943J7031J6734K4288M1866k2412l2612k1728o915R695j2962q814
$$ -38239 -12296 4735 21469 45757 87623 65211 32599 10871 3956 13651 689 -8125
13174h125l963J7212J3418m7953K3833q421m0423O788K4495M9562K0780j3507
$$ -8125 -12088 5124 18542 -29411 -5578 -13999 -54422 -47634 -23139 26423 47203 33696
13162C3696J8764m884j1092j7764J0531Q134k8697m990k1661J6001J9081n29M62
$$ 33696 52460 47576 36484 18720 29251 37385 8688 3698 -17963 -1962 17119 16590 17052
13149A7052M0856l706k6321L7484J2748j8854q392J8335k521q108o6204k8121
$$ 17052 57908 54202 27881 65365 78113 59259 50867 69202 66681 58573 -7631 -35752
13137c5752K016J8527j7760j8807M6991r088K1288k063L0744k4190K4796J3398
$$ -35752 -33736 -15209 -32969 -51776 -4785 -13873 7415 5352 36096 11906 36702 50100
13125E0100O512O854m0338l7897k25K9550K527L221o626j43J5843K0496l93r599
$$ 50100 56612 63466 23128 -14769 -14994 14556 17083 20304 13678 13535 29378 49874 49481 39882
13111C9882m489k110O580J1563J7172o07n3009j1298N85J758j4492k6123J24J7317
$$ 39882 35393 33283 39863 51426 68598 67991 14982 3684 4269 6027 -8465 -34588 -34464 -17147
13097a7147P292K7885N123j0508j3516q241K2363Q049O486r81p877j1178K2225
$$ -17147 -9855 18030 23153 12645 -871 -9112 13251 21300 27786 26805 18928 7750 29975
13084B9975J6268Q640k4894q829K3391J7675l345M522J5640L083k5531k5249J0368
$$ 29975 46243 54883 29989 21160 44551 62226 58881 63403 79043 82126 56595 31346 41714
13071D1714j9563r547j3349j1306l3282j3733J3882L547L0106K9757k057l2433
$$ 41714 22151 12604 -745 -12051 -45333 -59066 -45184 -41637 -11531 18226 16169 -16264
13059a6264k963K2047N7400l3603m8049q3L2770k7540K973L0833k0705m1046r215
$$ -16264 -19227 2820 60220 26617 -21432 -21515 11255 -16285 -13312 17521 -3184 -44230 -53445
13046e3445J3490o02J433M6599L632k5747k3705q985j8330m0320J0899N238m205
$$ -53445 -39955 -40557 -39124 7475 11107 -14640 -38345 -47330 -65660 -105980 -95081 -89843 -94048
13033i4048K3516o41j2779L6295K2580n058j0749O158n001L121R365K5608K4923
$$ -94048 -70532 -71173 -83952 -47657 -25077 -30135 -40884 -34726 -39727 -36606 -27241 -1633 23290
13020B3290l8208J518R340K8442M222j202l3456m1234K2177j3932N0102J9017
$$ 23290 -14918 -13400 -4060 24382 28604 27402 -6054 -47288 -25111 -39043 11059 30076
13008C0076P94P601j6589j663j5165J1391M151n5990l4417l066O8J6168m316L9620
$$ 30076 30870 38471 21882 20219 5054 16445 20596 -35394 -69811 -72877 -72809 -56641 -60957 -21337
12994b1337L9703j7006m8882n6948K5654M1940r730J8191J5877P084N637J0244
$$ -21337 18366 1360 -47522 -104470 -78816 -36876 -46606 -28415 -12538 -5454 183 10427
12982A0427l1557j6075o968K2144J3412j310q445K8676M4344K3314m7001p8803
$$ 10427 -21130 -37205 -44173 -22029 -8617 -9927 -18372 10304 54648 77962 30961 -47842
12970d7842k503J1543j962o996J4356M615k6647L385J7417k6988j0097J1371L5340
$$ -47842 -50345 -38802 -40764 -47760 -33404 -28789 -55436 -52051 -34634 -61622 -71719 -60348 -25008
12957b5008Q001P160P64k6173k8168J2319K1569j7728p910P670M6692M3175N492
$$ -25008 -17007 -9847 -9083 -35256 -63424 -51105 -29536 -47264 -55174 -47504 -812 42363 47855
12944D7855k1388j9391M5411p568l9326j6132J7437J6170k9091m5543k5266L6846
$$ 47855 26467 7076 52487 44919 5593 -10539 6898 23068 -6023 -51566 -76832 -39986
12932c9986K3799J0788L3323o587k4004R401J3179j2607k1085j4531L9259K1610
$$ -39986 -16187 -5399 27924 21337 -2667 6734 19913 7306 -13779 -28310 10949 32559
12920C2559k4363l5621j1991r708J2596P233j1530J1222r252m6743L1698M5573
$$ 32559 8196 -27425 -39416 -49124 -36528 -29295 -40825 -29603 -38855 -85598 -53900 -8327
12908h327k4618j3854J0674j6015k288N7502L1777o247m1559M4730K2172l0838
$$ -8327 -32945 -46799 -36125 -52140 -54428 3074 34851 28604 -12955 31775 53947 23109
12896B3109o091j2821m7267K1420L4600J8689L0134j2654j2715j7580j5127M6287
$$ 23109 17018 4197 -43070 -21650 12950 31639 61773 49119 36404 18824 3697 49984
12884D9984l3857N043J0431m1030k5029K9068O0805Q297k723j2221o862j8857
$$ 49984 16127 21170 31601 -9429 -34458 -5390 55415 63712 60989 48768 41906 23049
12872B3049k1477n085Q211p694k1719N660N018j4344k1599P106L9577m1j9321
$$ 23049 1572 -3513 4698 -2996 -24715 -19055 -14037 -28381 -49980 -42874 -3297 -3338 -22659
12859b2659j1892M420k4581k51O0851M5274m82k3872j5260j3718K290O839r662
$$ -22659 -34551 -30131 -54712 -54963 5888 51162 50680 26808 11548 -2170 120 6959 -2703
12846b703j8871n365k657j4428K1960O208k450K8479J3725l7196j2560Q615o257
$$ -2703 -21574 -26939 -29596 -44024 -22064 -15856 -18306 10173 23898 -13298 -25858 -17243 -23500
12833b3500j5743l097K7299J0989K1901j4495l9724j0267K1151o032M0000O152
$$ -23500 -39243 -42340 -15041 -4052 17849 3354 -36370 -46637 -25486 -31518 8482 14634
12821A4634J0778j8778j8659J3894K2041l921K2715J3362n95k7339j7827Q86p788
$$ 14634 25412 6634 -12025 1869 23910 19989 42704 56066 55471 28132 10305 11191 3403
12808C403j7399K6531L2835j1997n0652k5875K9123R85m1537O464K6074k865J9676
$$ 3403 -13996 12535 45370 33373 -17279 -43154 -14031 -13046 -54583 -48119 -22045 -24910 -5234
12795e234L2806J3288j0029m129L28j250p361j7200j4718m3246R241K7059J1682
$$ -5234 27572 40860 30831 26702 27030 25780 18419 1219 -13499 -56745 -47504 -20445 -8763
12782h763j4621j4526m3245Q195J2102O5506J5502j6361J6651j4902r954M5282
$$ -8763 -23384 -37910 -81155 -72960 -60858 4648 20150 3789 20440 5538 -4416 40866
12770D0866J3916n3053r13L1129n193l3605k6995k7223n479K1844N482j4199m605
$$ 40866 54782 1729 816 31945 26752 -6853 -33848 -61071 -66550 -44706 -39224 -53423 -58028
12757e8028K2516K0642Q098J6543J3082j7912j6272p009Q665K1269K3876m5964
$$ -58028 -35512 -14870 -6772 9771 22853 4941 -11331 -18340 -9675 11594 35470 -10494
12745a0494N788J5052j8730j2508m345k6752J5825K4997J614J8719q899l0717
$$ -10494 -4706 10346 -8384 -20892 -25237 -51989 -36164 -11167 -9553 9166 267 -30450
12733c0450M645J5470r643L0176Q821k2208M437j3652l3002J011J3219K1090M164
$$ -30450 -25805 -10335 -19978 10198 19019 -3189 1248 -12404 -45406 -44395 -31176 -10086 -5922
12720e922R221o081K1167K8771l621l7658J936J8195j4213J6119P8036K6025o5988
$$ -5922 3299 -2782 18385 47156 43535 5877 7813 26008 11795 27914 105950 131975 65987
12707F5987l1954p717r191o72O153j9029j237K156O409M70L3328j8008r504k2688
$$ 65987 34033 26316 17125 16453 22606 3577 2340 4496 10905 11375 44703 26695 17191 -5497
12693e497m6051j867k7835K5465l0328l353J6084M1187N9405J4038l6503m707
$$ -5497 -51548 -53415 -81250 -55785 -86113 -89466 -73382 -32195 27210 41248 4745 38
12681C8J3984O830M0121Q869l783K5723j1861m2656n7677n8652M556P2396P761
$$ 38 14022 20852 60973 69842 66059 91782 79921 37265 -20412 -79064 -74508 -2112 5649
12668E649j7764j7336k9111K1596J8129K0640K25k4944j8055j9541K979M6797
$$ 5649 -12115 -29451 -58562 -36966 -18837 1803 2028 -22916 -40971 -60512 -57533 -10736
12656a0736O704n5528k1502K8133L8515l780L674n385j72J9619J3995j3288k9932
$$ -10736 -4032 -59560 -81062 -52929 -14414 -18194 -14520 -19905 -20077 -458 13537 249 -29683
12643b9683P846L6465P338j7281k8524r800J7351j48J2329n956j0362K1043J8169
$$ -29683 -21837 14628 21966 4685 -23839 -33639 -16288 -16436 -4107 -10063 -20425 618 18787
12630A8787l32K6981K9859j3374m1700J6014K134j7534j2592q06J4532r827P723
$$ 18787 18455 45436 75295 61921 20221 36235 38369 20835 8243 7437 21969 12142 19865
12617A9865k3555k5057m0161J6821K3820K1661j237j3158k779j2832M5344k8405
$$ 19865 -3690 -28747 -68908 -52087 -28267 -6606 -7843 -21001 -23780 -36612 8732 -19673
12605a9673R010J2601q57L7740J0620k0643j7778k0385j8446Q447K3305j2800
$$ -19673 -10663 1938 1081 38821 49441 28798 11020 -9365 -27811 -19364 3941 -8859
12593h859j5536l668N8646k4808p1838Q737Q132J5769K0558R428k271J4345l260
$$ -8859 -24395 -28063 30583 5775 -66063 -57326 -49194 -33425 -12867 -3439 -5710 8635 5375
12580E375L1613R975m5626k9385j9608P60J6902K0249J0344J4402k4780j2400
$$ 5375 36988 46963 1337 -28048 -47656 -46896 -29994 -9745 599 15001 -9779 -22179
12568b2179q740r117M355j3690J3708J7081r97K500k1988L042J8153J1584j1302
$$ -22179 -30919 -40036 -35681 -49371 -35663 -18582 -19579 -17079 -39067 -36025 -17872 -6288 -17590
12555a7590J0314k6385k21j5061P735K0328R108J8384K6566K1499k2640J2911
$$ -17590 -7276 -33661 -33882 -48943 -41208 -20880 -11772 6612 33178 54677 32037 44948
12543D4948q614O052j7498j9729l7315J6513j419J4150J285M928J8483k829J1171
$$ 44948 36334 42386 24888 5159 -32156 -15643 -17062 -2912 -1627 3301 21784 18955 30126
12530C0126q120J705n611l7413l4761L2559J7306r079k517L5475R140l3131j2398
$$ 30126 22006 23711 18100 -19313 -54074 -21515 -4209 -13288 -15805 19670 28810 -4321 -16719
12517a6719k6916K2763L2002j4250l8324P603l5032N494K4664K4387K1001K5347
$$ -16719 -43635 -20872 11130 -3120 -41444 -33841 -68873 -63379 -38715 -14328 6673 32020
12505C2020N991l4417L370L0989M662k0749j4488Q799K5119O482l7829J6381R540
$$ 32020 38011 3594 6964 37953 42615 21866 7378 16177 41296 47778 9949 26330 35870
12492C5870k1946L057k4769j4016j213O919L7903K3938j5400k3247k8407L7004
$$ 35870 13924 16981 -7788 -21804 -23017 -16098 21805 45743 30343 7096 -21311 15693
12480A5693K6792J0754J713n33k6317l5635j2562k6490r054K7884j1766j344J8039
$$ 15693 42485 53239 54952 54419 28102 -7533 -20095 -46585 -55639 -27755 -39521 -40865 -22826
12467b2826J0779J3315l5561R184J4277k9059J1253R972N848M9223J2622l8566
$$ -22826 -12047 1268 -34293 -25109 -10832 -39891 -28638 -18666 -12818 36405 49027 10461
12455A0461l5897K3873M1114k303p726j3746j8217k2556k0080J8732N0385J9666
$$ 10461 -25436 -1563 39551 37248 29522 15776 -2441 -24997 -45077 -26345 24040 43706
12443D3706L666j6100j6330o044K9769K938k6869j9759m154P245K9250p688n6148
$$ 43706 47372 31272 14942 8898 38667 41605 14736 -5023 -9177 -1932 27318 19630 -36518
12430c6518K1386L4092k2081j1185J881K6198L6566k3660j6095K460J2016N132
$$ -36518 -15132 18960 -3121 -14306 -12425 13773 50339 26679 10584 13044 25060 30192
12418C0192k0080k3842j5542L7588J4448l9383j0699K2362L698J2211J8762j3847
$$ 30192 10112 -13730 -29272 8316 22764 -16619 -27318 -4956 -1258 10953 29715 15868
12406A5868n704Q441J2000l8065j7945L9269M5j6708J7470J7884k8801l3406J2207
$$ 15868 10164 18605 30605 -7460 -25405 13864 13909 -2799 14671 32555 3754 -29652 -17445
12393a7445R356k5571N2477K8299J0192k7290l6383j43P568N404O870j4046l424
$$ -17445 -8089 -33660 18817 47116 57308 30018 -6365 -6508 1060 6464 13334 -712 -4136
12380d136n6j1Q932N70R156L2163l562n5827l442K0646J3703l6005k137J2486
$$ -4136 -4192 -4203 4729 5299 14455 46618 43056 -12771 -16213 4433 18136 -17869 -20006 -7520
12366g520l5797M213K8745k1922r968Q777j5972Q570m786K2763J6744k8376J1645
$$ -7520 -43317 -39104 -10359 -32281 -42249 -33472 -49444 -40874 -45660 -22897 -6153 -34529 -22884
12353b2884L0095J2356j3427P14J7211L174l583j6344m1174K9658L0870j7757
$$ -22884 7211 19567 6140 6854 24065 27239 23656 7312 -33862 -4204 26666 8909
12341H909l1505m5279K804l5380L3491P8678L9579k0105k0646m9943o017J0480
$$ 8909 -22596 -67875 -65071 -100451 -66960 11718 51297 31192 10546 -39397 -45414 -34934
12329c4934R501J8064K761L4287K9568k5468j4770r748p417l2030r582j9924k1854
$$ -34934 -25433 -7369 -4608 29679 59247 33779 19009 9261 1844 -30186 -39768 -59692 -81546
12316h1546J752N034J2956M4616Q164k3376N980O758L379M5322L8711J3332J5120
$$ -81546 -79794 -74760 -61804 -17188 -9024 -32400 -26420 -19662 -16283 29039 67750 81082 96202
12303I6202j0446m3636o4208J0578n301j0800K0690L8489N326n0483k0138k0764
$$ 96202 85756 42120 -22088 -11510 -16811 -27611 -6921 31568 36894 -13589 -33727 -54491
12291e4491K9L3195K8128K6271K9475o600j5791r585P546J3064J338j1484k7530
$$ -54491 -54462 -21267 6861 33132 62607 56007 40216 30631 38177 51241 52579 41095 13565
12278A3565l557q948j9385O237L4982K4858K308l4497j4558k8106k8350P728L1314
$$ 13565 10008 1060 -18325 -12088 22894 47752 50060 15563 1005 -27101 -55451 -47723 -16409
12265a6409j7354M615J9812J5119q359M7158P642n798J2166k028k118q224q874
$$ -16409 -33763 -29148 -9336 5783 -2576 44582 52224 46426 58592 56564 54446 46222 37348
12252C7348o057Q826K367j805P093j4983k4024j4459O124R321k0583m608Q127
$$ 37348 31291 40117 42484 40679 47772 32789 8765 -5694 430 9751 -10832 -15440 -7313
12239g313q683K2739L7739M532m2101l86K0357j6097J03L840K200M835m825r869
$$ -7313 -15996 6743 44482 49014 6913 6527 26884 10787 10890 14730 16930 21765 16940 7071
12225G071K0863R511K7082j9364l9649l9426R422L2837J1501J1281r35m4001m181
$$ 7071 27934 37445 64527 45163 5514 -33912 -24490 8347 19848 31129 30194 -13807 -17988
12212a7988K7935K8954O1283L3667j4456n3612r196n999K1891K4006L165J6925
$$ -17988 9947 38901 100184 133851 119395 65783 56587 50588 72479 96485 99650 116575
12200A16575L2872j7912p132k6570J7112L143j4005k5378Q653R73l4975p888J0549
$$ 116575 149447 131535 124403 97833 114945 118088 104083 78705 87358 88331 53356 45468 56017
12187E6017J0879P752m9757k5568J845l751j3536j8440K1867L0886M877q590M7201
$$ 56017 66896 74648 24891 -677 1168 -2583 -16119 -34559 -12692 18194 23071 14481 61682
12174F1682O929j2702j6803j3373j9557P800j3885L210J4301K3015j374k4312
$$ 61682 68611 55909 39106 25733 6176 13976 91 3301 17602 40617 39243 14931
12162A4931L2685o915l0289K2842Q35M063j2524m4138m8113k06N1327K0790p713
$$ 14931 47616 40701 10412 33254 34089 38152 25628 -18510 -66623 -66829 -15502 5288 -2425
12149b425j4030O331M5476L0726L6271J1371m3702o3726l7J8470q93M8400P13
$$ -2425 -16455 -10124 35352 66078 102349 113720 70018 6292 6255 24725 23832 72232 72945
12136G2945l0589R463L4062K1118k892k3606l1546j4380r35m2575k2629J0685
$$ 72945 42356 51819 85881 106999 104107 80501 48955 34575 33640 -8935 -31564 -20879
12124b0879N109M3739P06j9231J2878J5418l3303l7552N43K2833L1681Q960K98
$$ -20879 -15770 27969 28675 9444 22322 37740 4437 -33115 -32572 -9739 21942 30902 31200
12111C1200L1813J8131j3139j4967J3767j1359Q884R581l2553k7840k5842o326
$$ 31200 63013 81144 68005 53038 66805 55446 64330 73911 41358 13518 -12324 -18650
12099a8650k9299L5739J0813K7392j623J0373j7548N134K8048j3140L1995R654
$$ -18650 -47949 -12210 -1397 25995 24372 34745 17197 22331 50379 37239 69234 78888
12087G8888l0965J5540l0665p640L0414j6654q605j2505J35K4818J4657J3606
$$ 78888 47923 63463 32798 25158 55572 38918 30313 17808 17943 42761 57418 71024
12075G1024j1461p819J3963L530N700N080K0985J4731J6036J5505P215m697O01
$$ 71024 59563 51744 65707 69237 74937 80017 101002 115733 131769 147274 154489 149792 150393
12062A50393J7295k745k7050q924M64J7830J4119J3474J2231l2953n1236k6063
$$ 150393 167688 164943 137893 128969 129433 147263 161382 174856 187087 154134 102898 76835
12050G6835J125k0592K924k4568J4554M2706M3025J4655j2344k5606R588K6145
$$ 76835 77960 57368 60292 35724 50278 92984 136009 150664 138320 112714 122302 148447
12038A48447j7231j192j0323P156K3960P366k0952k9655J9013K4986O507k3893
$$ 148447 131216 130024 119701 126857 150817 158183 137231 107576 126589 151575 158082 134189
12026A34189J8861K2955p788n244k2678L0420K7270j7634l1531O931M8773O9943
$$ 134189 153050 176005 168217 162973 140295 170715 197985 180351 148820 155751 204524 274467
12014B74467M4401K4617l7585o7083Q138k8312l84Q0281k1159l8687J3585j2820
$$ 274467 318868 343485 305900 238817 246955 218643 218259 298540 277381 238694 252279 239459
12002B39459Q642L4637J9875j2999Q544P838j085J8951M0620K7489J9962L6735
$$ 239459 248101 282738 302613 289614 298158 305996 304911 323862 364482 391971 411933 448668
11990D48668Q617J4382j2922J8447K4557M6603L5845L5921J2001K8001M7953P342
$$ 448668 457285 471667 458745 477192 501749 548352 584197 620118 632119 660120 708073 715415
11978G15415K6272L2256L4090K2421J3796K3587M3017K8667N9782R2295R6521
$$ 715415 741687 773943 808033 830454 844250 867837 910854 939521 999303 1091598 1188119
11967A188119Q8066P4984M8666M8382P3202P3250R7209J20284J87220J63604J66875
$$ 1188119 1276185 1351169 1399835 1448217 1521419 1594669 1691878 1812162 1999382 2162986 2329861
11956B329861J17913J74544K51517K08840K71856L65899L70162L57464M09171
$$ 2329861 2447774 2622318 2873835 3082675 3354531 3720430 4090592 4448056 4857227
11947D857227M99979N98451P41425Q34854J026153J258297J556570J890096K379174
$$ 4857227 5357206 5955657 6697082 7531936 8558089 9816386 11372956 13263052 15642226
11938A5642226K987056L851015N009550O527367Q550886J1225730J4273275J6815392
$$ 15642226 18629282 22480297 27489847 34017214 42568100 53793830 68067105 84882497
11930H4882497J6858075J1038946q80668j2456704j7511421j6774350j3610981
$$ 84882497 101740572 112779518 111898850 99442146 81930725 65156375 51545394
11923E1545394j0390321p808364n904345m531764l565591k834259k300678j848495
$$ 51545394 41155073 33346709 27442364 22910600 19345009 16510750 14210072 12361577
11915A2361577j578593j288796j078200q90673p53815o26670n49217n19760m08942
$$ 12361577 10782984 9494188 8415988 7525315 6771500 6144830 5595613 5075853 4666911
11906D666911l45587k65165j88880j70994j64760j67439q8238n4196l3811k7945
$$ 4666911 4321324 4056159 3867279 3696285 3531525 3364086 3275848 3221652 3187841 3159896
11896C159896L513M7862j995N7953j3676n7978j26253j72691j85916j90112k00039
$$ 3159896 3163409 3211271 3209276 3267229 3253553 3195575 3069322 2896631 2710715 2520603 2320564
11885B320564j93066j60180j54411j82150j59947j27092q7711j03905p4387n9647
$$ 2320564 2127498 1967318 1812907 1630757 1470810 1343718 1256007 1152102 1077715 1018068
11875A018068l0400k9549p1919n5792l2043k7265l5783l5386j0133m8291k4046
$$ 1018068 987668 958119 886200 830408 798365 771100 735317 699931 689798 641507 617461
11864F17461j0473K2347r123l9184o3668m6181R347K9492K0682k3172m0334k7865
$$ 617461 606988 629335 620212 581028 517360 471179 480526 510018 530700 507528 467194 439329
11852D39329m5877j475K2847K062j6554k2056m6110j4908K4643M68k2163k8428
$$ 439329 393452 391977 414824 416886 400332 378276 332166 317258 341901 342369 320206 291778
11840B91778n383M1640j068n8780k9257r19Q16k1334R541L4798O800l9010J9675
$$ 291778 286395 328035 326967 268187 238930 238011 238827 217493 227034 261832 268632 229622 249297
11827B49297J3671o5309l0495M325K7563J4468j777j0398L687n8940n1235p994
$$ 249297 262968 197659 167164 171489 199052 213520 211743 201345 205032 146092 94857 86863
11815H6863N4716J6949j586J2483o237k8162m20P489K1574L058K447K8391J6293
$$ 86863 141579 158528 156942 169425 163188 135026 134606 142095 163669 166727 169174 197565 213858
11802B13858q587m6309j0473J3377J2906o620r00P6J297L7127k6293J2796J2339
$$ 213858 205271 158962 148489 161866 174772 168152 167252 167328 168625 205752 179459 192255 204594
11789B04594j85k495j492P181o088M943P655j0183l3362k1498j6158k204L064
$$ 204594 204409 201914 200422 207603 201515 206458 214113 203930 170568 149070 132912 130708 133772
11776A33772J2330j4840j5368J5292o885L7535K2587m0533n8612m2151K2945N0614
$$ 133772 146102 131262 115894 131186 124301 161836 184423 143890 85278 43127 66072 116686
11764A16686j4348q307o459k6334K8479k832P083L0908j9572j3212p64k210k4040
$$ 116686 102338 94031 87572 61238 89717 86885 93968 124876 105304 92092 91328 89118 65078
11751F5078J0579L18M678L336j2097J0346J4494K811l774K0375o741M023m5835
$$ 65078 75657 75975 80653 83989 71892 82238 96732 99543 95769 116144 109403 113426 67591
11738F7591n702o70l332l681k9105J7628M2512r124k632j128M0576j1445k3770
$$ 67591 61889 61219 57887 54206 25101 42729 85241 76117 73485 72357 112933 101488 77718
11725G7718k6425j3754n320J6808J3848N321l7168j6356N394K935K0209O562K4200
$$ 77718 51293 37539 32219 49027 62875 68196 31028 14672 20066 23001 43210 49772 73972
11712G3972M1017O150J6071j614m9314n392J194P261N542k6465j5204P540j0207
$$ 73972 114989 121139 137210 135596 86282 80890 82084 89345 94887 68422 53218 60758 50551
11699E0551O6092q244n301O507j4524n467j6420N493M062l2717m2365k3597K5129
$$ 50551 116643 108399 103098 109605 95081 89614 73194 78687 82749 50032 7667 -15930 9199
11686I199P415j1609N8942L5983o020k4858j3042j0151N823l77L0048L4596M3572
$$ 9199 16614 5005 63947 99930 93910 69052 56010 45859 51682 51305 81353 115949 159521
11673A59521K5010R906l6189q215J9506j3547J9351J73L0791K3758J9049M836
$$ 159521 184531 194437 158248 150033 169539 155992 175343 175516 206307 230065 249114 253950
11661B53950k58L7431k484n117r425K7561k6337k3587L1820j8799n448m318n2960
$$ 253950 253692 291123 288639 283522 274097 301658 275321 251734 283554 264755 259307 254989 202029
11648B02029k4096J2087N388L0165P988J5302J7906l07j6312k76J2748P357j7888
$$ 202029 177933 190020 195408 225573 233561 248863 266769 266462 250150 249874 262622 269979 252091
11635B52091n006q386q461k2828j0231p113j4201n796l2472n4618l6303K2065
$$ 252091 247085 238699 230238 207410 197179 190066 175865 170069 137597 82979 46676 68741
11623F8741K1105n0311j4471M934K1349J2001l318J0614M104l9056J5171J3902
$$ 68741 89846 39535 25064 29998 51347 63348 60030 70644 74748 35692 50863 64765
11611F4765n508j5715j3389K478p429K263L0620j4779k0410J7613K9672j2725
$$ 64765 59257 43542 30153 32631 25202 27465 58085 43306 22896 40509 70181 57456
11599E7456l2403J275J0797K2059J363m431J2871K4664l2663l9632P210L1384
$$ 57456 25053 26328 37125 59184 60547 56116 68987 93651 60988 21356 28566 59950
11587E9950K5325Q929O277n499k1544j2004L4821O156j9963j1705j9671J4384
$$ 59950 85275 94204 100481 94982 73438 61434 96255 102411 82448 70743 51072 65456
11575F5456K960L040k3654M55Q488j2522R956K2369J7869q437k4649J0295J6156
$$ 65456 68416 71456 47802 48257 56745 44223 54179 76548 94417 85980 61331 71626 87782
11562H7782l7423j9594L1385M142j8765l22Q791j3281p946J2872j4312L588J6735
$$ 87782 50359 30765 62150 66292 47527 47205 55996 42715 34769 47641 33329 36917 53652
11549E3652K910j780j1086p118L147J1452r395k1063n078r543Q589K2222l248
$$ 53652 56562 54782 43696 36578 39725 51177 41782 20719 15641 6098 14687 36909 33661
11536C3661J935p783P180l747j958J4669P952J81k3028m4486m226j2495k38r465
$$ 33661 35596 27813 34993 31246 29288 43957 51909 52090 29062 -15424 -19650 -32145 -32383 -41848
11522d1848M3753N6298L6268k2881j95J2506k1957k8701k3294j5384J7520M1184
$$ -41848 1905 58203 94471 71590 71395 83901 61944 33243 9949 -5435 12085 53269
11510E3269Q341K3962q27K0620j6669l9393m150n4J8936j6003K458j0893J780
$$ 53269 61610 85572 84745 105365 88696 49303 45153 45099 64035 48032 50490 39597 41377
11497D1377j1766q926k3743K5390J8116K5567l526k2320J388K899m935O461n4656
$$ 41377 29611 20685 -3058 22332 40448 66015 62489 40169 41557 44456 39521 45982 -8674
11484h674l3171L0753N103j9619J3077J0658n770j0180J9726M1187L2462R247
$$ -8674 -41845 -11092 -5989 -25608 -12531 -1873 -7643 -17823 1903 43090 75552 84799
11472H4799k2962k4469m3922J0478J4471j9545p045J434l053J4829J8339L8025
$$ 84799 61837 37368 -6554 3924 18395 -1150 -8195 -6761 -9814 5015 23354 61379
11460F1379l3532l7359J4604O104K6443P842N802P962k6746J6538L5554m6323
$$ 61379 27847 -9512 5092 11196 37639 45481 51283 59245 32499 49037 84591 38268
11448C8268n4651q045n443K17K2464L7614L0023J0803k1239n084j83K4817j8412
$$ 38268 -16383 -24428 -29871 -29654 -7190 30424 60447 71250 50011 44927 44744 69561 51149
11435E1149K3125J8544m8305j8091J5130K7421J4516J2836K5731m190j5506j4023
$$ 51149 74274 92818 44513 26422 41552 68973 83489 96325 122056 117866 102360 88337
11423H8337l7120l940J3884k1440L164j7882Q743l797J17n1575k1481K6555k8
$$ 88337 51217 47277 61161 39721 42885 25003 33746 29949 30066 -21509 -42990 -16435 -16463
11410a6463M4414N3701P251n003j9481l7629j8911j939k703J2418J7637M264n897
$$ -16463 27951 81652 88903 83900 64419 26790 7879 5940 3237 15655 33292 37556 31659
11397C1659J113q962M51o750J506J8037J7073m1757j871J8263K5262j6398J3660
$$ 31659 32772 23810 24261 17511 19017 37054 54127 12370 10499 28762 54024 37626 51286
11384E1286L3380M0773K3293j6915o4916l1365j5778j755o589J793j2876J4386
$$ 51286 84666 125439 148732 131817 66901 35536 19758 18003 11414 13207 331 14717
11372A4717J7414J1848p673J2797j1725m05l8728l1736l159L70M2042r943J7813
$$ 14717 32131 43979 36306 49103 37378 36973 -1755 -33491 -36650 -36280 5762 -4181 13632
11359A3632L2129l39j8839l3554N997K0651l3622O344J7243K3624J9476R394j4706
$$ 13632 45761 45422 26583 -6971 -974 19677 -13945 -7601 9642 33266 52742 62136 47430
11346D7430j3205j5596j2567O493j3991K3996K3784K1107k6490j8973K759K4166
$$ 47430 34225 18629 6062 12555 -1436 22560 46344 67451 40961 21988 24747 48913
11334D8913n694r44o103j9279Q013M3759J2705k9815Q236K1482m820m1728O434
$$ 48913 43219 42275 36172 16893 24906 68665 81370 51555 59791 81273 76453 34725 41159
11321D1159M1340k861M298k1227r314O255m2748l9066O0019M2111L7593R105r861
$$ 41159 82499 79638 83936 62709 53395 59650 16902 -22164 37855 79966 117559 126664 116803
11308A16803j890m2651k0657P301l168N951j0156N27O74k6531q351j0556J49P4765
$$ 116803 114913 72262 51605 58906 55738 61689 51533 52060 52734 26203 17852 7296 7445 82210
11294H2210j0840k8383J8394K4241j4389l2206j6659P879k530j3923M2176K9863
$$ 82210 71370 42987 61381 85622 71233 39027 22368 30247 27717 13794 55970 85833
11282H5833j3756j3433m7585J2168P433j314l9237l750M1349n586j2234l2061
$$ 85833 72077 58644 11059 23227 30660 29346 -9891 -13641 27708 22122 9888 -22173
11270b2173l1891N264M4977J3184J2388l633j2137K2146j042m511p103P261k4988
$$ -22173 -54064 -48800 -3823 9361 21749 18116 5979 28125 27083 22572 15469 22730 -2258
11257b258j2710M1393K2852j5848M8659J0376J04l2908k1737p263k5032j5413
$$ -2258 -14968 26425 49277 33429 82088 92464 92568 59660 37923 30660 5628 -9785
11245i785O906M496j4854j9769LK3026j0850k6815k401P9580O8612K7396j6031
$$ -9785 -2879 1617 -13237 -33006 -33003 -9977 -20827 -47642 -50043 29537 98149 125545 109514
11232A09514m3396j9395J7752l964j8188M2299Q553k2349j604L1688N4774l0341
$$ 109514 66118 46723 64475 60511 42323 84622 93175 70826 69222 100910 155684 125343
11220A25343k1252P933J5493J103m228j6268k2293J4263M210k4287M26J7570K8061
$$ 125343 104091 112024 127517 128620 124392 108124 85831 100094 104304 80017 80443 98013 126074
11207A26074l2357k3422j1425N53q1K3444J3709m744J965Q365r745k8275l070
$$ 126074 93717 70295 58870 59423 59342 82786 96495 91751 93716 102081 92336 64061 60991
11194F0991J8534R943j875l891M5221O614R790j5817m7073j0090k2769l2944O380
$$ 60991 79525 89468 87593 83702 128923 135537 145327 129510 82437 72347 49578 16634 23014
11181B3014J6834j401J4443m039J2163J6510R907K738j8570n554L1070k1143k5239
$$ 23014 39848 38447 52890 48851 61014 77524 87431 90169 71599 66045 97115 75972 50733
11168E0733J3698K0202J5553M0177Q131J7829K728n0283j3840M500J42J491n827
$$ 50733 64431 84633 100186 140363 148494 166323 169051 118768 104928 109428 109570 111061 105234
11155A05234O2718K6899J5878M2844M0700J0067M4025N266K4753L510J6771O5045
$$ 105234 167952 194851 210729 253573 294273 304340 348365 353631 378384 381894 398665 463710
11143D63710J25374J13559J04694J55669J73881K36647K44725K61141K71199K47671
$$ 463710 589084 702643 807337 963006 1136887 1373534 1618259 1879400 2150599 2398270
11133B398270K13909J45549N3408J2422p1801j90007k53282l13776k78289k45937
$$ 2398270 2612179 2757728 2811136 2823558 2751757 2561750 2308468 1994692 1716403 1470466
11123A470466j92095j79590k04819j17805j07436j03273m1458l6047n1123l3712
$$ 1470466 1278371 1098781 893962 776157 668721 565448 523990 487943 436820 403108
11113D03108l5384l0714j9575k8530j298n877l7672l2135K396K9825j1071k8208
$$ 403108 367724 337010 317435 288905 287607 281730 244058 211923 214319 244144 233073 204865
11101B04865j5627k1822k7994m7005Q535M725R823J554n208K6359l4480j7869
$$ 204865 189238 167416 139422 92417 100952 105677 115500 117054 111846 138205 103725 85856
11089H5856O5894J9049m9621k9141R470k5531K0236Q685N5404j5100k6745k8360
$$ 85856 151750 170799 121178 92037 101507 75976 96212 104897 160301 145201 118456 90096
11077I0096l257j3931p037M737L0441k269p0909J8112J598K235J758O871L0069
$$ 90096 86839 72908 65871 70608 101049 98780 27871 45983 47581 49816 51574 58445 88514
11064H8514K9797j2093M5962N0610j6451l2508l04J9887L3047Q996O298j450J3894
$$ 88514 118311 106218 152180 202790 186339 153831 153527 173414 206461 215457 221755 220305 234199
11051B34199k0657J3380Q030l3943K6099M6164M8458Q571j2510l73m121m5936
$$ 234199 213542 226922 234952 201009 227108 273272 321730 330301 317791 317418 313297 267361
11039B67361O7275N1609N238O654L6338L1440L5033M537j1575n28j1018m1704
$$ 267361 334636 386245 391483 398137 434475 465915 500948 505485 493910 493382 482364 440660
11027D40660K5018K2821j6245K8576K6880J8135M4928M1950L087m2687k9718K873
$$ 440660 465678 488499 472254 500830 527710 545845 590773 632723 635810 593123 563405 566278
11015E66278K2555M3504O4851L1101J4283N8519K4306M1542j4647m4682l5534
$$ 566278 588833 632337 697188 728289 742572 801091 825397 866939 852292 807610 772076
11004G72076o8182o2112n2599m1476K2799l8409m2802Q197l6534o7988o5859l8012
$$ 772076 703894 641782 589183 547707 570506 532097 489295 497492 460958 392970 327111 289099
10992B89099k8374k0106l117J0095K9435k5113q098J8366K4880j3581r337J511
$$ 289099 260725 240619 237502 247597 277032 251919 243821 262187 287067 273486 264149 265660
10980B65660N324q575l8399l3458k5431j3649K3466O1322N456L640J706q051k5154
$$ 265660 270984 262409 224010 190552 165121 151472 174938 236260 241716 245356 247062 239011 213857
10967B13857K0469J6193l213L459j9365Q773k8309l8719K5357K4066N109p988
$$ 213857 234326 250519 247306 250765 231400 240173 211864 173145 198502 222568 227677 219689
10955B19689K065J0749L6763M640K0370K6799o929j5735J7016J8036l6514k6770
$$ 219689 221754 232503 269266 273906 294276 321075 314146 298411 315427 333463 296949 270179
10943B70179M1919J9429n244K3669J5837m067j1717l8357k7507k063K5701j0078
$$ 270179 312098 331527 326283 349952 365789 361722 350005 311648 284141 282078 307779 297701
10931B97701l075M972O236j0183k3177j8165J2014L5529j2172J7088R314l4277
$$ 297701 294626 299598 305834 295651 272474 254309 266323 301852 289680 306768 316082 281805
10919B81805m8708O814j83L093j1162l2668J848j6564k405J5457L24m369k485
$$ 281805 233097 239911 239728 242821 231659 198991 200839 184275 181870 197327 197651 193282 190797
10906A90797n581K2434R099J0999M590j9929K1947J0649L3068O7197M6189Q88
$$ 190797 185216 207650 216749 227748 232338 212409 234356 245005 278073 345270 391459 392347
10894C92347q119M3048N1243N9049J5640p414p547J7995R726l6650O797J1397
$$ 392347 384228 427276 478519 537568 553208 545794 538247 556242 565968 529318 536115 547512
10882E47512J6303J2928k9936m3152N313R771j5808J5384M0809j769K3426Q1265
$$ 547512 563815 576743 546807 503655 508968 518739 502931 518315 559124 557355 580781 662046
10870F62046J4067R786P011j2446O972J2925j6127K4165k072n821K1827N9131
$$ 662046 676113 685899 692910 680464 687436 700361 684234 708399 706327 700506 722333 781464
10858G81464K1760J0642J165j3898k2024k5794k8782K1739L1080j9738l2515K6555
$$ 781464 803224 813866 815031 801133 779109 753315 724533 746272 777352 757614 725099 751654
10846G51654K0821K2756K135J0989k7721L1903K0655M584N6875O031o220q422
$$ 751654 772475 795231 797366 808355 780634 812537 833192 837776 894651 900682 894462 886040
10834H86040j0542k047M2561M2015K580j8096J7577M8260j449j2281J5156L7374
$$ 886040 875498 873451 916012 958027 960607 942511 960088 1008348 1006899 994618 1009774 1047148
10822A047148K4135K5307M9504K7086J8509K6353K1686N2344O8230L2081O3467
$$ 1047148 1071283 1096590 1146094 1173180 1191689 1218042 1239728 1292072 1360302 1392383 1455850
10811A455850R995N2035M3665O8226O1090N1549O5452L6823K7262N7230M6430
$$ 1455850 1465845 1517880 1561545 1629771 1690861 1742410 1807862 1844685 1871947 1929177 1975607
10800A975607K3623O6232M1652N0074P1517P0743M4641R3039O5374M8847R3404
$$ 1975607 1999230 2065462 2107114 2157188 2228705 2299448 2344089 2437128 2502502 2551349 2644753
10789B644753J28606J12528J25943P5259J29847J33118J43757J31898J00409J06005
$$ 2644753 2773359 2885887 3011830 3087089 3216936 3350054 3493811 3625709 3726118 3832123
10779C832123J85559J78466J70485J99174J92723K32220K48328K47298K73544
$$ 3832123 4017682 4196148 4366633 4565807 4758530 4990750 5239078 5486376 5759920
10770E759920L39259K94343K99257L67645M45692M97235N13539N46144N83569
$$ 5759920 6099179 6393522 6692779 7060424 7506116 8003351 8516890 9063034 9646603
10761I646603O51932O87449P95614R17069R90539J209527J392989J602742J862228
$$ 9646603 10298535 10985984 11781598 12698667 13689206 14898733 16291722 17894464 19756692
10752A9756692K148959K377610K695330L035298L338997L630343M076191M629939
$$ 19756692 21905651 24283261 26978591 30013889 33352886 36983229 41059420 45689359
10744D5689359N327424O335096P635177R485318J2088739J5528263K0237196K6472400
$$ 45689359 51016783 57351879 64987056 74472374 86561113 102089376 122326572 148798972
10736A48798972L4074090M2304634M9344226N3674905N4242352N0338218M1784889
$$ 148798972 182873062 225177696 274521922 328196827 382439179 432777397 474562286
10729D74562286K8872067J2894833m432814k0764067l4446064m4316838n0062013
$$ 474562286 503434353 516329186 511896372 491132305 456686241 412369403 362307390
10722C62307390n1799848n0050615m5535725l8805790l1194833k4177060j8552189
$$ 362307390 310507542 260456927 214921202 176115412 144920579 120743519 102191330
10715A02191330j4386618j1320415r054955p389149o203282n340035m637607m099255
$$ 102191330 87804712 76484297 67429342 60040193 53836911 48496876 43859269 39760014
10707C9760014l675128l331564l007172k708872k455703k203489j927612j695933
$$ 39760014 36084886 32753322 29746150 27037278 24581575 22378086 20450474 18754541
10699A8754541j485782j339027j209904j017371q96119q23006p39324o59148n65649
$$ 18754541 17268759 15929732 14719828 13702457 12806338 11983332 11244008 10584860 10019211
10690A0019211n56871m95442m00169l55056l77842l66310l16166l22177k78923
$$ 10019211 9462340 8966898 8566729 8211673 7833831 7467521 7151355 6829178 6550255
10681F550255k53373k43458k39858k38391k42905k36717j71770j47288j37398
$$ 6550255 6296882 6053424 5813566 5575175 5332270 5095553 4923783 4776495 4639097
10672D639097j00061j48570j38045j18075j16546r8029r0296r3786p3935q2541
$$ 4639097 4539036 4390466 4252421 4134346 4017800 3919771 3829475 3735689 3661754 3579213
10662C579213j12523p8771n2643m9021m3360l1118k5545m742j0221l1650n5201
$$ 3579213 3466690 3387919 3335276 3286255 3242895 3211777 3186232 3181490 3171269 3139619 3084418
10651C084418o2050o6003l2357l041Q163K2236L8335M5748N218L7792O9913J7637
$$ 3084418 3022368 2956365 2924008 2920967 2929130 2951366 2989701 3035449 3040667 3078459 3148372 3166009
10639C166009P1237P9427Q1886J15716J27377J55324K00375K30720K30663K68692
$$ 3166009 3237246 3316673 3398559 3514275 3641652 3796976 3997351 4228071 4458734 4727426
10629D727426K67974K99723M13771M33841N40634O75958Q41376J076909J327930
$$ 4727426 4995400 5295123 5708894 6142735 6683369 7359327 8200703 9277612 10605542
10620A0605542J668468K094420K544492L000492L334371L335265K829718J863800
$$ 10605542 12274010 14368430 16912922 19913414 23247785 26583050 29412768 31276568
10612C1276568Q71943K59845K16714O97863J573771K708822L913914N084805N940758
$$ 31276568 32148511 32408356 32625070 33322933 34896704 37605526 41519440 46604245 52545003
10603E2545003N818585M259121J673934q55280k283120k356014j316345K81409
$$ 52545003 58363588 62622709 64296643 63441363 61158243 58802229 57485884 57767293
10595E7767293K179806M137077N831114O636620N986145L328826p18508m468032
$$ 57767293 59947099 64084176 69915290 76551910 82538055 85866881 85148373 80680341
10587H0680341o444667o450726n210770l428423j443670L70176J765055K436898
$$ 80680341 74235674 67784948 62574178 59145755 57702085 58072261 59837316 62274214
10579F2274214J944813Q655k715944m981159n990164n739346m711139l438588
$$ 62274214 64219027 64227682 61511738 56530579 50540415 44801069 40089930 36651342
10571C6651342k214792j208350m74454j56692m52359j276802k274576l064862
$$ 36651342 34436550 33228200 32753746 32597054 32144695 30867893 28593317 25528455
10563B5528455l436867l301927k892600k403067j941534j544445j217367r92008
$$ 25528455 22091588 18789661 15897061 13493994 11552460 10008015 8790648 7798640
10555G798640q31377o44959n60254n29147m28600l62982l22942k41389k75373
$$ 7798640 6967263 6322304 5762050 5232903 4804303 4441321 4118379 3876990 3601617
10546C601617k76993j95757j34791j32108j58828j18726j07491j29116j07721
$$ 3601617 3324624 3128867 2994076 2861968 2703140 2584414 2476923 2347807 2240086
10537B240086q4800p5496r0620o7993r1411q7124m3224l8346k6066j02184p5859
$$ 2240086 2155286 2079790 1989170 1921177 1829766 1742642 1699418 1661072 1635006 1532822 1456963
10526A456963n5008m6645m6905l6440l7543j8200n4886q1735l1366K9994k5173
$$ 1456963 1401955 1355310 1308405 1271965 1234422 1216222 1161336 1079601 1048235 1078229 1053056
10515A053056n1673n3068n5275l3091k0700K683M8953k0532l9782j2927j2509
$$ 1053056 1001383 948315 893040 859949 839249 841932 890885 870353 830571 817644 805135
10504H05135k4597j0337j2902J6094L799k7387J0148Q427J5731r329l4900r617
$$ 805135 780538 770201 757299 773393 777192 749805 759953 768380 784111 774782 739882 730265
10492G30265l1108j5938M830j4536l7671j9710J7938l74R61K7204N517J536j4355
$$ 730265 699157 683219 688049 673513 635842 616132 634070 633696 634657 661861 667378 668914 654559
10479F54559j8036m0379k433j9649j3306O9908J7758K1447o410j412k4182m4530
$$ 654559 636523 596144 593711 574062 560756 630664 648422 669869 663459 662047 637865 593335
10467E93335j3173l239k1482p209K067L1595P779O164k8592l8899j1679J001l778
$$ 593335 580162 576923 555441 548232 550299 581894 589673 595837 567245 528346 516667 517668 513890
10454E13890l4937p02J0239K972k5410j0545j3766k4012k3607Q902P525j968Q772
$$ 513890 478953 478251 488490 491462 466052 455507 441741 417729 394122 403024 410549 408581 417353
10441D17353k103N240l363J0774k787K5601J9456j4965l4649k6643J2187m2837
$$ 417353 415250 420490 417127 427901 425114 450715 470171 455206 420557 393914 406101 363264
10429C63264j5807J6952n654l5504L608J0641J5899J8903L6351k5775m4013K7363
$$ 363264 347457 364409 358755 323251 326859 337500 353399 372302 408653 382878 338865 366228
10417C66228N2204J0896j2450M3877M4405M8808J8729K4594J0654M6958N4144
$$ 366228 418432 429328 416878 460755 505160 553968 572697 597291 607945 654903 709047
10406G09047j0772o230L010r238k9706l7862m3031M902l1810j2007J4763k3044
$$ 709047 698275 692045 695055 685817 656111 618249 575218 580120 548310 536303 551066 528022
10394E28022n4512l899M3506N6516L1969K7411N5047M0112J0164K5238N2846L2093
$$ 528022 473510 469611 513117 569633 601602 629013 684060 724172 734336 759574 812420 844513
10382H44513l837k5800l1196m6217n2912o3808l6739m0392l9450m0422o7764k9798
$$ 844513 840676 814876 783680 737463 684551 620743 584004 543612 504162 463740 395976 366178
10370C66178l4707l6044j0667Q370O693J8053j429j4426K707K0431K7794k0932
$$ 366178 331471 295427 284760 293130 299823 317876 316447 302021 304728 325159 352953 332021
10358C32021r421l9610j3637J0235j4801J0068k5542J4738M476O02K8666J2119
$$ 332021 322600 282990 269353 279588 264787 274855 249313 264051 268527 269129 297795 309914
10346C09914p292K0508N3441j8231l7693J7330L5176K0374L3193l101J6315M3931
$$ 309914 302622 323130 376571 358340 320647 337977 373153 393527 426720 423619 439934 483865
10334D83865O1506M8693O1547Q0656J03498J10747J10273J87186K59291K92554
$$ 483865 545371 594064 655611 736267 839765 950512 1060785 1247971 1507262 1799816
10324A799816L02766K66914K15916J75580Q0306J3066p1322j09278j76103k37035
$$ 1799816 2102582 2369496 2585412 2760992 2841298 2854364 2783042 2673764 2497661 2260626
10314B260626k56412k89204k61409k27380k02764j22176r4518j34855q0270l5381
$$ 2260626 2004214 1715010 1453601 1226221 1023457 901281 806763 671908 591638 556257
10304E56257l5145m8847o0094m2476O636j7884m3153n066n770J1583j8873k5327
$$ 556257 521112 472265 412171 369695 376331 358447 315294 310228 304458 316041 297168 271841
10292B71841k6455m4011j6774J7451J6333J707l0474l0639k6759j6429J6802K8186
$$ 271841 245386 201375 184601 202052 218385 220092 189618 158979 132220 115791 132593 160779
10280A60779K5999L7606p595j0369l140m9633k7965k4030r76J1913K821q116l2331
$$ 160779 186778 224384 216789 206420 203280 153647 125682 101652 100676 112589 115410 107294 74963
10267G4963R387O2321O853j5599q802J7332J9531O348k6056L7880j1644n1583
$$ 74963 84350 146671 153524 137925 129123 146455 165986 172334 146278 184158 172514 120931
10255A20931j2712J5115K0767k201l6276J2427j5957K283O004p235j1382K2508
$$ 120931 108219 123334 144101 141900 105624 118051 102094 104377 110381 103146 91764 114272
10243A14272J6497j1839k1734j0026O468j1922k0527N220K3267J2627j9581j1585
$$ 114272 130769 118930 97196 87170 93638 81716 61189 66409 89676 102303 82722 71137
10231G1137L9258o926o944j0762J2424M0554n601P954j7903j3877K9059J8448
$$ 71137 110395 103469 96525 85763 98187 138741 133140 141094 123191 109314 138373 156821
10219A56821k2688k5929L1814j2062j697N929K48J1252p806j5969k894j6200k4796
$$ 156821 134133 108204 140018 127956 126259 132188 132436 143688 135882 119913 117019 100819 76023
10206G6023k0999m402N2004J7837j7334j0724j7380O219Q38k6325J626K5102K0917
$$ 76023 55024 50622 102626 120463 103129 92405 75025 81244 82082 55757 57383 82485 103402
10193A03402R729l169l046j6337q409n76K6983L9244J8434k8826j2098j0658L0383
$$ 103402 113131 109962 106916 90579 82170 81594 108577 147821 166255 137429 125331 114673 145056
10180A45056N4467K6272m005L3576K546k377j7923J1154o253j120M7258K3187
$$ 145056 199523 225795 221790 255366 257912 255535 237612 248766 242513 241393 288651 311838
10168C11838J6734P1486L4184K0173K7799q668k2950k2175k4504k2902P324M3768
$$ 311838 328572 400058 434242 454415 482214 473546 450596 428421 403917 381015 388339 432107
10156D32107L2680K8135J7017k6722l0420k8363j067l281m6110j8884J7798J5338
$$ 432107 464787 492922 509939 483217 452797 424434 423367 420086 373976 355092 372890 388228
10144C88228o918N311J9766J6342j3431k2287m1055J3424l8308n8649j5486K1974
$$ 388228 381310 386621 406387 422729 409298 387011 345956 359380 321072 262423 246937 268911
10132B68911n162K1657q079o7208n4516j9664J5023L0819M876l6277l8129j6065
$$ 268911 263749 285406 277327 210119 155603 135939 150962 181781 186657 150380 112251 96186
10120I6186r039j6945J3167j8812j8023j3619L1357l6047k1735K4617J3892l2938
$$ 96186 87147 70202 83369 64557 46534 32915 64272 28225 6490 31107 44999 12061
10108A2061N708K472k9840M4342K0647r124J8137L206J1058m0372j2937K4058
$$ 12061 17769 20241 -9599 34743 55390 46266 64403 67609 78667 38295 25358 49416
10096D9416k057J2806P812M2621j9448l8985k2340K6616j5673J6694J4788j5694
$$ 49416 47359 60165 67977 110598 91150 52165 29825 56441 40768 57462 72250 56556
10084E6556K3999j715J4528K191o416k454l2293l5395k8105N9220L0580k3138
$$ 56556 80555 78840 93368 95559 89143 86689 54396 19001 -9104 50116 80696 57558
10072E7558J736K9567o409L914J1727k2978j9960k1560J7738K6662N0048L4210
$$ 57558 59294 88861 82452 86366 98093 75115 55155 33595 51333 77995 128043 162253
10060A62253m8236k6831k1416k8986k8633J6185k3885l3790j0996K9413M7079
$$ 162253 114017 87186 65770 36784 8151 24336 451 -33339 -44335 -14922 32157
10049C2157K6762O747K7820j7979j5543J7179r728j4721j1108J0507o675n448
$$ 32157 58919 65666 93486 75507 59964 77143 67415 52694 41586 52093 45418 39970
10037C9970J3235K9266m1376R206J2676q116K10n583r363M139R842j7739n82j2184
$$ 39970 53205 82471 41095 50301 62977 54861 55071 49488 40125 44264 54106 36367 35785 23601
10023B3601M8477N988j2026j2330l136J045k4669J0100J9691L786K8365j780n1572
$$ 23601 72078 78066 66040 53710 50574 51619 26950 37050 56741 60527 88892 87112 35540
10010C5540K097M544j1298o434J1462P5188J6689k560m0680l9510K6437k7349
$$ 35540 37637 42181 30883 24449 35911 111099 127788 125228 84548 45038 71475 44126
9998D4126m6146j2286R868J7895J2064j0055l530M153P380j9747j8704J9289L4658
$$ 44126 -2020 -14306 -4438 13457 25521 15466 11936 16089 23469 3722 -14982 4307 38965
9985C8965j3309p5611R617L3983M7937K3555J3678j2753j9994O805N047m84J9547
$$ 38965 25656 -49955 -40338 -6355 41582 65137 78815 66062 46068 52873 57920 57436 76983
9972G6983n017j5691L8305J2448m683k5222k5279J6289M4879k1757j4350j8470
$$ 76983 71966 56275 94580 107028 102345 77123 51844 68133 113012 91255 76905 58435
9960E8435l5125k7669O049r495J5272L3389J9788K1541l2547j173p007K1313o069
$$ 58435 23310 -4359 1690 -7805 7467 40856 60644 82185 49638 48465 41458 62771 56702
9947E6702j7063M151J6118n687N764M2335J2520j8887o9221J6830J4721O738j0895
$$ 56702 39639 43790 59908 54221 59985 102320 114840 95953 26732 43562 58283 65021 54126
9934E4126J0655M0999K8639p057l9578N223m039m4731j6856o62k2216J4098j0621
$$ 54126 64781 105780 134419 127362 87784 93007 88968 44237 27381 26719 4503 18601 7980
9921G980L8257j5961j5752J1288R169k5835k5441K0371K5753K7956l083k5796
$$ 7980 46237 30276 14524 25812 34981 9146 -16295 4076 29829 57785 54702 28906
9909B8906j4031k9437j6685p142L7100K1870j9147L570j6326J1088R830q740j2546
$$ 28906 14875 -14562 -31247 -38389 -1289 20581 1434 5004 -11322 -234 9596 856 -11690
9896a1690M909P059K9040J5056j7778p284j3857K5663j5284k6267k1223J5529
$$ -11690 -6781 278 29318 44374 26596 19312 5455 31118 15834 -10433 -31656 -16127
9884a6127M1470O688J4028P6657k0969k6725r084Q088k1388j5358o940k6315L060
$$ -16127 25343 32031 46059 122716 101747 75022 65938 74026 52638 37280 30340 4025 7085
9871G085J655K825j1961o864J9575N6300P386j1434j1601M077L7155j7459m5470
$$ 7085 8740 11565 -396 -7260 12315 68615 76001 64567 52966 57043 94198 76739 31269
9858C1269m1689O2179J0925l7005J5413O512j1103p104J3144j3297l3394J5608
$$ 31269 -10420 51759 62684 25679 41092 47604 36501 29397 42541 29244 -4150 11458
9846A1458N92L4055P775m201K2054n395l8690j2705r374J6701K9287l042l5120
$$ 11458 12050 46105 53880 49679 71733 66338 27648 14943 5569 22270 51557 48515 13395
9833A3395l4839j1913r168L8808K7828J4863k8171o966l3008L1939K3547j7139
$$ 13395 -21444 -33357 -42525 -3717 24111 38974 10803 3837 -29171 2768 26315 9176
9821I176j5455k7821J5671M8138M3849J2146m1392j7114r701K1364j742q925K668
$$ 9176 -6279 -34100 -18429 29709 73558 85704 44312 27198 17497 38861 37119 28194 30862
9808C0862K5217J5263j9766n527j7533L4364o504k2728J6366r251J7681j6880
$$ 30862 56079 71342 51576 46049 28516 62880 56376 33648 50014 40763 58444 41564
9796D1564j2905j0725N953l4862l5104L2762K6198K2777K9720j1345k4823j0001
$$ 41564 28659 17934 23887 -10975 -46079 -13317 12881 35658 65378 54033 29210 19209
9784A9209k3196J9334L1812J5058o343n5357k7791J2225J3396j3635o024m756
$$ 19209 -3987 15347 47159 62217 55874 517 -27274 -15049 -1653 -15288 -21312 -26068
9772b6068K8323L0804l0110J1951j8483r838l0051L726L6291L0999r803J7622
$$ -26068 2255 33059 2949 14900 -3583 -13421 -43472 -39746 -3455 27544 17741 35363
9760C5363j0713l6126r143K4962j466L808R671J7890j4033k6288J0688k8034j2330
$$ 35363 24650 -11476 -20619 4343 2877 6685 16356 34246 20213 -6075 4613 -23421 -35751
9747c5751J5216n363K9328J3120Q893j3066Q1k3892M0919M7810k6587P653o681
$$ -35751 -20535 -25898 3430 16550 25443 12377 12458 -11434 29485 77295 50708 58361 51680
9734E1680p923L0918Q821l6816m901k8519j605M8122O499k3378m020j750n523
$$ 51680 43757 74675 83496 46680 41779 13260 11655 59777 66276 42898 38878 37128 31605
9721C1605k1932m771J2592j1556j0932L2643J9767K2128K1002J2700k8675L554
$$ 31605 9673 4902 17494 5938 -4994 27649 47416 69544 90546 103246 74571 78125
9709G8125j5709l5026l926L1675j8973k7827l4655M78k1844p76J225K1828K8174
$$ 78125 62416 27390 23464 55139 36166 8339 -26316 -25838 -47682 -48458 -47233 -25405 2769
9696B769k30J96J268K2694O975j4637p43j6462K6529M796j7115K4318L799k6378
$$ 2769 2539 2735 4003 26697 33672 19035 18292 1830 28359 33155 16040 40358 44157 17779
9682A7779m0458M037L0137j3053l614j2383R859J2284k200K4802j4705J2379Q980
$$ 17779 -22679 -18642 11495 -1558 -5172 -17555 -7696 4588 2388 27190 12485 24864 33844
9669C3844k3932m4401J4962J7921J5438Q959q876k4195R660K0850m7526j3843
$$ 33844 9912 -34489 -19527 -1606 13832 22791 13915 -10280 -620 20230 -27296 -41139
9657d1139K2231J465j1877P014K1941Q950l75j0652N8565L5766l1230k6260Q335
$$ -41139 -18908 -17443 -29320 -22306 -365 8585 8210 -2442 56123 91889 60659 34399 42734
9644D2734j9928n291l9452l079l072J0630N1469N6206J64m6930j0958K9211L7969
$$ 42734 22806 17515 -21937 -25016 -28088 -17458 34011 90217 90381 43451 32493 61704 99673
9631I9673Q694p520j6584l8614l6836p229K2568P547K5141J0345j4297K6352k6209
$$ 99673 108367 100847 84263 45649 8813 1584 24152 31699 56840 67185 52888 79240 53031
9618E3031m177n628J1401K0600l1575k3525l1735R939p096p091J0807R997K2234
$$ 53031 48854 43226 54627 75227 43652 20127 -11608 -1669 -8765 -15856 -5049 4948 27182
9605B7182p084j7118j8084J6516j316j3103J0302K9602J6513k7209r370m132K5420
$$ 27182 20098 2980 -15104 1412 96 -13007 -2705 26897 43410 16201 6831 2699 28119
9592B8119K3634J5344J8134J861j1738r002l9663J0287Q354K8186K0518J9443
$$ 28119 51753 67097 85231 87092 75354 66352 26689 36976 45330 73516 94034 113477
9580A13477j7176K0811K59N3953L2356q202k7702j2447k3451J6177O124j4642
$$ 113477 96301 117112 117371 171324 203680 195478 167776 155329 131878 148055 154179 139537
9568A39537k1942j1894k0268j7408l745K331o679n0086r840L1857J4341L813q358
$$ 139537 117595 105701 85433 68025 64280 66611 59932 9846 6 31863 46204 50017 41659
9555D1659m4498L1614J5530q235j2663O606j4268p514K3100L711m168j6399j7321
$$ 41659 -2839 28775 44305 36070 23407 30013 15745 8231 31331 35042 30874 14475 -2846
9542b846k0347n5404K4310M5334M6355l280l7576m1968o22k159R690r114J644
$$ -2846 -23193 -78597 -54287 -8953 37402 34122 -3454 -45422 -46044 -48203 -38513 -47627 -45983
9529d5983l177P5839M5955M110k079k8876m2055m2662M090j1668J2901L2424L1602
$$ -45983 -49160 26679 72634 76744 74665 45789 3734 -38928 -34838 -46506 -33605 -1181 30421
9516C0421o206l0745L73j141N049J8118L9816r739J0654K100j8184L364j9117
$$ 30421 24215 -6530 -6157 -7298 -2249 15869 55685 45946 56600 58700 40516 43880 24763
9503B4763j2922N047O74Q66n178L3835L1444o3474n0559j6440k019M7809J1048
$$ 24763 11841 16888 17562 18428 13250 47085 78529 15055 -35504 -51944 -53963 -6154 4894
9490D894L2636J549K0641K8150M693k2841m2619J0816L610K568l4604j710o845
$$ 4894 37530 39079 59720 87870 92563 69722 27103 37919 41529 44097 9493 7783 938
9477I38J5898j0094n797K2847k6831k5147J7645k5594l9420j4177R117L8646L3552
$$ 938 16836 6742 945 23792 -3039 -28186 -10541 -36135 -75555 -89732 -80615 -41969 -8417
9464h417K8765j5392J2473j3570j5893l2M7071J1227k8953k7352K9044J8536m9479
$$ -8417 20348 4956 17429 3859 -12034 -12066 35005 46232 17279 -10073 18971 37507 -11972
9451a1972K2884L1581O872q469J1915k5517K306k0159k096J9620j7155J0261J0913
$$ -11972 10912 42493 49365 40896 52811 27294 29600 9441 7345 26965 9810 20071 30984
9438C0984k6231J9799l286j6627J2417O90J8251J3292m0233l2082j4233N2357
$$ 30984 4753 24552 21266 4639 17056 17746 35997 49289 9056 -23026 -37259 15098
9426A5098L2129J3137J4336n519n5889j5211K7287j1488L6127N2917j6017l2952
$$ 15098 47227 60364 74700 69181 13292 -1919 25368 13880 50007 102924 86907 53955
9414E3955p54l5391o6939k4801L7314K1685j5238J5993K5686J5449K4244k9501
$$ 53955 53201 17810 -49129 -73930 -36616 -14931 -30169 -14176 11510 26959 51203 21702
9402B1702m4884R65J225j5184o536K7534j4012J8860L8382j220j4916l6542K7943
$$ 21702 -23182 -22217 -20992 -36176 -42712 -15178 -29190 -10330 28052 26832 11916 -24626 3317
9389C317R281K317K141J3639k8211l5091N427j8895K6521J5644k958J7927k441
$$ 3317 12598 14915 17056 30695 2484 -32607 -27180 -46075 -19554 -3910 -6868 11059 8618
9376H618K2510K2066N872j4848J25l16m2050l3979K8849J8670j1484K5310j1592
$$ 8618 31128 53194 59066 44218 44343 44027 1977 -32002 -3153 15517 4033 29343 17751
9363A7751O455M042L943k5483l9560J7322K6369O471M446J7422k8692j0394L3734
$$ 17751 24206 28248 32191 6708 -32852 -15530 10839 17310 21756 39178 10486 92 33826
9350C3826K475L5351k177k078k7000l5427l0146J2263M7596M714Q109k0154j12
$$ 33826 36301 71652 69475 67397 40397 4970 -25176 -12913 34683 39397 47506 27352 27240
9337B7240l2541q350N656Q946J6964j1452l3138J6484K8351K7318Q754K3178k2947
$$ 27240 -5301 -13651 -7995 951 17915 6463 -26675 -10191 18160 45478 54232 77410 54463
9324E4463l7135N419k1250m829M702k8334k5687N552K2516J9160j3217j9049M909
$$ 54463 17328 22747 1497 -3332 1370 -26964 -52651 -47099 -24583 -5423 -18640 -37689 -32780
9311c2780r707j7223k231L7265L7274J6469R205k5030j3629k1760l451L7585O258
$$ -32780 -42487 -59710 -61941 -24676 12598 29067 38272 13242 -387 -22147 -25598 11987 18245
9298A8245j0862l2960l5552o407L5698K0341k6473j4250N7944J1603k0629M0267
$$ 18245 7383 -25577 -61129 -67536 -31838 -11497 -37970 -52220 5724 17327 -3302 36965
9286C6965M2945r409j4885m2622j5086J4597K4483K9701K7614j0136j1920l7365
$$ 36965 79910 70501 55616 12994 -2092 12505 36988 66689 94303 84167 72247 34882
9274C4882m3000k9268J3451J4200M1121J4677l2250k9310J3841N010Q737R524
$$ 34882 -8118 -37386 -23935 -9735 31386 46063 13813 -15497 -1656 3354 12091 21615
9262B1615K1715q698l3234J9588J255K1755J2064P15k3697m2627k8233K4330K6923
$$ 21615 43330 34632 1398 20986 22241 43996 56060 56775 33078 -9549 -37782 -13452 13471
9249A3471O107K4144L4253l815m7845l1140j9523J5545o155l0038k6460Q9788
$$ 13471 19578 43722 77975 74160 26315 -4825 -24348 -8803 -14958 -44996 -71456 18332
9237A8332R2649n253n0765j3574l2383k6118j489J6830L3976R512m334q378q855
$$ 18332 110981 105728 54963 41389 9006 -17112 -18601 -1771 32205 41717 37383 29005 20150
9224B0150m9353p036K9882L7155k0884k86k505k793j131J1336M115M712l4579
$$ 20150 -29203 -36239 -6357 30798 9914 9628 7123 4330 3199 14535 18650 23362 -11217
9211a1217k7938K8449K493K4188M0134j9762K342k2177q899L345j2994L5933P2
$$ -11217 -39155 -10706 -8213 15975 56109 36347 38689 16512 7613 10958 -2036 33897 33969
9198C3969o8687q864j7513K3306P371K95k8917M5089M2960o199j8041J5745M3414
$$ 33969 -34718 -43582 -61095 -37789 -30418 -30123 -59040 -13951 29009 22810 4769 20514 63928
9185F3928m392J117l3384J4220N098o630j099l3972q581L7321R791n0691l7827
$$ 63928 59536 60653 27269 41489 46587 39957 38858 4886 -3695 33626 43417 -7274 -45101
9172d5101J9934J0835j6341Q319K9846p043l324r477l8768J7676j2380N8497J9225
$$ -45101 -25167 -14332 -30673 -22354 7492 449 -2875 -12352 -51120 -33444 -45824 12673 31898
9159C1898j4484j3556k7691k4600J2795L429O4840p943n0683k6261J1733J0240
$$ 31898 17414 3858 -23833 -48433 -35638 -32209 32631 24688 -25995 -52256 -40523 -30283
9147c0283n3040L542M9321K9432L285m7814j3420L2166Q798k6265j67J8932J9369
$$ -30283 -83323 -79781 -30460 -1028 2257 -45557 -58977 -26811 -18013 -44278 -44445 -25513 -6144
9134f144j3618n549q41N039K2147N037K423K079L0154K6310j5938o2153Q698M6993
$$ -6144 -19762 -25311 -26152 -21113 1034 6071 8494 10573 40727 67037 51099 -11054 -2356 44637
9120D4637q558m634l2076j3755M8804K0612K2552j5664l7569K2766K8023J3659
$$ 44637 36079 31445 -631 -14386 34418 55030 77582 61918 24349 47115 75138 88797
9108H8797m0816l0833k3109l481M2877K0018p836J87J2500q586j7628J555N509
$$ 88797 47981 17148 -5961 -9442 33435 53453 45617 45804 58304 49718 32090 33645 39154
9095C9154j6056j3195L659n238m070J0967N273l5185l848J8849L4527J3719j9420
$$ 39154 23098 9903 13562 8324 4254 15221 20494 -14691 -18539 310 34837 48556 29136
9082B9136j1023j0975K0950K4346K2903Q115k8432l7013k1076j8606j5595J8421
$$ 29136 18113 7138 28088 52434 75337 83452 55020 18007 -3069 -21675 -37270 -18849
9070a8849K1761p183L4941K1427k5315l4055J4610K2330L0496l8453m2967J9515
$$ -18849 2912 -4271 30670 52097 26782 -7273 7337 29667 60163 21710 -21257 -1742
9058a742M626J4045O724N334K5297q440j1181M5289k2263n2340l6697J1189Q260
$$ -1742 2884 16929 23653 28987 54284 45844 34663 79952 57689 5349 -31348 -20159 -11899
9045a1899m0246r080K2064J5247J4779K0138R819k1985N141K1891J7106L8825
$$ -11899 -52145 -61225 -39161 -23914 -9135 11003 20822 -1163 3978 25869 42975 81800
9033H1800p246l9973k2593j8803m1571j1861o105M3746J8110o830q211l069j1959
$$ 81800 74554 34581 11988 -6815 -48386 -60247 -66352 -22606 -4496 -11326 -19537 -22606 -34565
9020c4565m446J2436Q782J9465j871l857l0303K3505M5200r051j869L1231O673
$$ -34565 -39011 -26575 -17793 1672 -199 -4056 -34359 -10854 34346 25295 23426 54657 61330
9007F1330k4769l3064k7621j9444L6934K5870m491Q915J3685j7474L558j6234
$$ 61330 36561 3497 -24124 -43568 -6634 19236 14745 23660 37345 19871 23429 7195
8995G195l7525J9749K6407o535m9015R912K6049j4999k3325k577J6988j1507J6793
$$ 7195 -30330 -10581 15826 9291 -39724 -29812 -3763 -18762 -42087 -44664 -27676 -39183 -22390
8982b2390j4447J075k6068j1491K4251J3288j1619L3030J8287q990K6423J8677
$$ -22390 -36837 -35762 -61830 -73321 -49070 -35782 -47401 -14371 3916 -5074 21349 40026
8970D0026m0018j8746K8984K4279K3211k584j1455J750k3878q391J0593L4190
$$ 40026 8 -18738 10246 34525 57736 55152 43697 45447 21569 13178 23771 57961
8958E7961n7811k1251M7043J3015m081L3654o841j7400O003K707j1375m239l4621
$$ 57961 150 -21101 25942 38957 34876 68530 61689 44289 50292 52999 41624 37385 2764
8945B764j4248M586J2799J3302m352k123O501l1136K145L3888L675k4698j2980
$$ 2764 -11484 -6898 5901 19203 14851 12728 19229 -11907 -9762 24126 27801 3103 -9877
8932i877J4923j3653J8805O364k7306q711J3845j4764K786J4232k63k3639k5593
$$ -9877 5046 -8607 10198 16562 -10744 -19455 -5610 -20374 -17588 -3356 -3619 -27258 -52851
8919e2851J8343J7021J9407r053M472N4K2899J268j8365o106j2135n398J5684
$$ -52851 -34508 -17487 1920 -7133 -2661 -2607 20292 21560 3195 -2911 -15046 -20444 -4760
8906d760m145k18j468K4546J3678m519k0747m9082Q144K7367m4743P183K9573
$$ -4760 -8905 -9123 -10591 13955 27633 23114 2367 -46715 -38571 -11204 -55947 -48764 -19191
8893a9191L5950L7941p027k6498K7732m949n805m2975P309J1552O784j2382k0546
$$ -19191 16759 54700 47673 21175 48907 43958 38153 -4822 2487 14039 20823 8441 -12105
8880a2105q793J0523J5914J4271j3562m570j2232N8N075J4002J6568k305n0601
$$ -12105 -20898 -10375 5539 19810 6248 1678 -10554 -10496 -5421 8581 25149 22844 -27757
8867b7757K707K6455M2718L872N720k0884j7607J4304n437j7352L3318q699m685
$$ -27757 -25050 1405 44123 47995 53715 32831 15224 29528 24091 6739 40057 31358 26673
8854B6673k6829J1824J9788m118l561J7410j1600k0895J1405j0969j213M225n469
$$ 26673 -156 11668 31456 27338 23777 41187 29587 8692 20097 9128 7915 12140 6671
8841F671R43J7411o594l3920l3151P219L9673L1814J4499k5315J2056K3105K6160
$$ 6671 7614 25025 18431 -15489 -48640 -41421 -1748 30066 44565 19250 31306 54411 80571
8828H0571l6542j4489j6298k0911M529R46k692j2548J988K3942J7957k8098j7838
$$ 80571 44029 29540 13242 -7669 -3140 -2194 -4886 -17434 -15446 8496 26453 -1645 -19483
8815a9483J3243J5340L6386p474k3141j4951o022m4254o277K9128J7854J3150
$$ -19483 -6240 9100 45486 38012 14871 -80 -6102 -50356 -56633 -27505 -9651 3499
8803C499k440O688J0263J8113k671K00L742l4882J2291L6892L2094j4316l7380
$$ 3499 1059 7747 18010 36123 33452 33652 37394 2512 14803 51695 83789 69473 32093
8790C2093k2455j5181K0429M304l6294J1987n979j9119o619J2411K4644J2787
$$ 32093 9638 -5543 14886 19190 -17104 -5117 -11096 -30215 -36834 -24423 221 13008
8778A3008m7139l6558K8815N2936j3345l4836M128j3310J7593M1220L75k9304
$$ 13008 -34131 -70689 -41874 11062 -2283 -37119 -32991 -46301 -28708 12512 12887 -16417
8766a6417p885K9796M4739k034q258p606l8752o1977M058K9742j5892J1741J9532
$$ -16417 -24302 5494 50233 48199 39941 32335 -6417 -68394 -64336 -34594 -50486 -38745 -19213
8753a9213J8708L842j9002k6040j0704K0111J1088o135K2867J8250k727r418k5910
$$ -19213 -505 3337 -15665 -41705 -52409 -32298 -21210 -27345 -4478 13772 11045 1627 -24283
8740b4283j843J0610l520L3763K0413N644j5102R873k4937p344K1311J9021l423
$$ -24283 -26126 -15516 -19036 14727 35140 40784 25682 35555 10618 3274 24585 43606 40183
8727D0183J2919l860k9823l0720K1599J871R728l5515j4314L2816r365m624l4834
$$ 40183 53102 49242 19419 -11301 10298 12169 21897 -13618 -27932 4884 -4481 -9105 -43939
8714d3939l1178L2981M5245N280O018L46P547j367m7946N2261K4252l185J3956
$$ -43939 -75117 -42136 3109 8389 14407 14753 22300 20933 -27013 25248 49500 46315 60271
8701F0271k2210J114K2466k1386n6185j8004J2616K2820K5379j6873l5890j1045
$$ 60271 38061 39175 61641 40255 -15930 -33934 -21318 1502 26881 10008 -25882 -36927
8689c6927J7922m323k06Q348L722M515M5945M0515M632q631l9000n442Q009k1620
$$ -36927 -19005 -23328 -23534 -15186 -11464 -6949 38996 79511 84143 75512 36512 31070 39079 17459
8675A7459j1843k366j4493j4084K5556N418K5541j5438l9684l499j5052m6447
$$ 17459 5616 3250 -11243 -25327 229 5647 31188 15750 -23934 -27433 -42485 -88932
8663h8932j1535M0603L2306L3777Q657M0176J7641j2995O288k8868j9856K2797
$$ -88932 -100467 -59864 -27558 6219 14876 55052 72693 59698 65986 37118 17262 40059
8651D0059j1700l1548M193L2220j3257k6115j1508M5918o390j3829p259r00r135
$$ 40059 28359 -3189 1004 33224 19967 -6148 -17656 28262 21872 8043 784 -116 -9251
8638i251j2443j781P063K5262K0752l908j1579j6009k4341k6937L855K1320O1839
$$ -9251 -21694 -23475 -16412 8850 29602 25694 14115 -1894 -26235 -53172 -49317 -27997 33842
8625C3842L586q364l3204k6571Q994M4357N770l1127n2324j3280K2708L4947L4982
$$ 33842 37428 29064 -4140 -30711 -21717 22640 28410 -2717 -55041 -68321 -45613 -10666 24316
8612B4316j1550K6089M84j6504j2790r65N2123j0336k803J9473m5373n048J4820
$$ 24316 12766 38855 39339 22835 10045 9080 61203 50867 48064 67537 22164 17116 31936
8599C1936p429K933n903MK8105K2197P301q122k0720K9857J4465r172m4628k2699
$$ 31936 24507 27440 21537 21541 49646 71843 79144 71022 50302 80159 94624 85452 40824 18125
8585A8125k5033j6380q628m982j9987P912j276J9991K8805j0166J71k2994K1675
$$ 18125 -6908 -23288 -31916 -36898 -56885 -48973 -50249 -30258 -1453 -11619 -11448 -34442 -12767
8572a2767K5986J4099j3650m5910k0615J4011L9209q298j1796p968j5700j3699
$$ -12767 13219 27318 13668 -32242 -52857 -38846 363 -7935 -19731 -27699 -43399 -57098
8560e7098N091J6447K2830K7355J1718j4291O320j5970K8879J5783p708O930j5646
$$ -57098 -52007 -35560 -12730 14625 26343 12052 18372 2402 31281 47064 39356 46286 30640
8547C0640j6491J2003q568k1066k299p360m2347K4635N3657j6588k5591m291J1192
$$ 30640 14149 26152 17584 -3482 -5781 -13141 -55488 -30853 22804 6216 -19375 -23666 -12474
8534a2474k0105J0006L5684j0264j0536R501o931K2176j890k3787k4338K9054
$$ -12474 -32579 -22573 13111 2847 -7689 1812 -5119 17057 15167 -8620 -32958 -3904
8522c904p081m7212j2094j993k395K132L2588j1381l6631L3143L3640M9327o467
$$ -3904 -10985 -58197 -70291 -72284 -74679 -72547 -39959 -51340 -87971 -54828 -21188 28139 21672
8509B1672L2629R69k0622j3968k0802j05M29p978L57n853J4122k0877j1102L3872
$$ 21672 54301 55270 34648 20680 -122 -227 202 -7776 -7419 -13272 850 -20027 -31129 2743
8495B743L0704q792J1499j0512j4283R683L677l92K1171l7737l2497J5788K6284
$$ 2743 33447 24655 36154 25642 11359 21042 24719 24327 45498 7761 -24736 -8948 17336
8482A7336q423m854J2160J2470l4350j7481J7165L6492M1021j8935j1118O631
$$ 17336 8913 4059 16219 28689 -5661 -23142 -5977 30515 71536 52601 41483 48114
8470D8114L3768j9078j9128j2011k1256j5336M949k4025k9478J2713J5761L678
$$ 48114 81882 62804 43676 31665 10409 -4927 22 -24003 -53481 -40768 -25007 -21329
8458b1329L5517M8244j6393oJ1259j1207k0654l1707k6069M221L14j9156J9818
$$ -21329 14188 62432 46039 46033 57292 46085 25431 -6276 -32345 -28124 -27810 -46966 -27148
8445b7148j5483k7660j9212K0525M7637J8248K3460Q474k3187m460R353J0345
$$ -27148 -42631 -70291 -89503 -68978 -21341 -3093 20367 28841 5654 1194 10547 20892
8433B0892J6508O57n0995k1345K0597M254N0q207M645q725J0366O323j5202p324
$$ 20892 37400 38057 -12938 -34283 -13686 -9432 -9382 -17589 -12944 -21669 -11303 -4980 -20182 -27506
8419b7506k0207l8597J8012M1593L6171P522j9871k2986L602o871L7020J2176
$$ -27506 -47713 -86310 -68298 -26705 9466 16988 -2883 -25869 -22267 -29138 7882 20058
8407B0058k0995k7716j0819j3574j9823L8552j4755M101K9204j6642k1917O6336
$$ 20058 -937 -28653 -39472 -53046 -72869 -34317 -49072 -44971 -15767 -32409 -54326 12010
8395A2010m728k7803r339N550J899k8828J6517K5213M753j1776k0596K2436K1758
$$ 12010 7282 -20521 -29860 -24310 -22411 -51239 -34722 -9509 -4756 -16532 -37128 -14692 7066
8382G066j4249J477p678k853K0357J5121J6129K5428l3251l7832N965K0488k3900
$$ 7066 -7183 -5706 -13384 -16237 4120 19241 35370 60798 27547 -10285 -4320 16168 -7732
8369g732l0159J7163m511j2338N6K4689M830j5813m0537m0743K1755L6562k7556
$$ -7732 -37891 -20728 -25239 -37577 -37521 -12832 -8002 -23815 -64352 -105095 -83340 -46778 -74334
8356g4334o605J2824L6888K4271M5297J4781j6748k7994J0950k968J1715k8153
$$ -74334 -80939 -68115 -31227 -6956 38341 53122 36374 8380 19330 16362 28077 -76
8344g6J1292k9956K1567K7954j573j7264o997r240J7468L6949K750J7897m5343
$$ -76 11216 -18740 2827 30781 29208 11944 4947 -4293 13175 50124 52874 70771 25428
8331B5428N47l5400l3741J5550L2961Q757k4726j9587J6028J7863K126P719N148
$$ 25428 25975 -9425 -43166 -27616 5345 14102 -10624 -30211 -14183 3680 5806 13525 18673
8318A8673j3824j217j5003j7831o968o7J6096j2074J5834K4767k8860o130J5681
$$ 18673 4849 3632 -11371 -29202 -36170 -36237 -20141 -32215 -16381 8386 -20474 -26604 -10923
8305a0923L2504K065o2277J3507M7199j957l5994n935j4637K1358K6871J0485
$$ -10923 21581 23646 -38631 -25124 22075 20118 -15876 -21811 -36448 -15090 11781 22266
8293B2266J167P948j1673j8024j4888k6362J6867J0267m6511L514M8249j1986
$$ 22266 23433 31381 19708 1684 -13204 -39566 -22699 -12432 -58943 -55429 -7180 -19166
8281a9166J4615K5711J8059l4051j1959K384j2071m754m646q327L0955J9770R653
$$ -19166 -4551 21160 39219 5168 -6791 -4407 -16478 -21232 -25878 -34205 -3250 16520 26173
8268B6173p879J5716k4270m6618k942K0479L9984J1821J9223L6482m1401m2650
$$ 26173 18294 34010 9740 -36878 -39820 -19341 20643 32464 51687 88169 46768 4118
8256D118n713l8028m2920L4215L6396K1770J462j0377j1966J3349j3769M014p107
$$ 4118 -1595 -39623 -82543 -48328 -11932 9838 11300 923 -11043 2306 -11463 -7449 -14556
8243a4556j6509m4195m569L5945K4738J6791M613J0392l6542N722M6538l952j1925
$$ -14556 -31065 -75260 -79829 -43884 -19146 -2355 2258 12650 -23892 -18170 28368 24416 12491
8230A2491l0358m328J0192J3995l4889k8554q171J7731n677j9014J8202L5991
$$ 12491 -17867 -22195 -12003 1992 -32897 -61451 -69622 -51891 -57568 -76582 -58380 -22389
8218b2389Q725j691M887l7161q947Q048J9985L680q184k997j5030l9660R859L9952
$$ -22389 -13664 -15355 -10468 -47629 -56576 -48528 -28543 -24863 -33047 -36044 -51074 -90734 -80875 -40923
8204d0923L9391J7379k238R049q47l1472K1070L3416Q181n5385k6359K0656j2103
$$ -40923 -1532 15847 13609 22658 21811 -9661 11409 44825 53006 -2379 -28738 -8082 -20185
8191b0185j1600j7328L3916K8025k9230j0869l1753l1287O534P1667K1007L9529
$$ -20185 -31785 -49113 -15197 12828 -16402 -27271 -59024 -90311 -83777 -12110 8897 48426
8179D8426j467l8970j3947M0036L4304J1471j4656n2130j2689k238l293m378q815
$$ 48426 46959 7989 -5958 34078 68382 79853 65197 13067 378 -1860 -5153 -9531 -18346
8166a8346J3171J5078o254l014j4605K3821K4152k0926k3533J5539J7816m453
$$ -18346 -5175 9903 3649 635 -13970 9851 34003 13077 -10456 5083 22899 18446
8154A8446k9954j1010K2954K2271m5769j8704J5655j2611N979P532J716j3137
$$ 18446 -11508 -22518 436 22707 -23062 -41766 -26111 -38722 -32743 -25211 -23495 -36632
8142c6632K807k9863k060l08J3477o15N6674Q023P386k2913j8447J0358K6806
$$ -36632 -33825 -63688 -65748 -66056 -52579 -53194 3480 11503 18889 -4024 -22471 -12113 14693
8129A4693j4028j4956R212J877l308j9370j4180J8860M551p592O764K0136K4231
$$ 14693 665 -14291 -5079 -3202 -6510 -25880 -40060 -21200 -16649 -24241 -17477 2659 26890
8116B6890k2833l1066K9348J5301J1182l0055l3253J0975J5800k1696j7772L2431
$$ 26890 4057 -27009 2339 17640 28822 -1233 -34486 -23511 -7711 -29407 -47179 -14748
8104a4748K4350r759k6900O7L6629K4702j961k3537k6245l2235l6730j1202K3111
$$ -14748 9602 -157 -27057 -26990 9639 34341 32380 8843 -17402 -49637 -86367 -97569 -74458
8091g4458N1701M5983K2390n879j4478j6987j8377n863K9498J1507n522j1026
$$ -74458 -22757 23226 45616 39737 25259 8272 -10105 -15968 13530 25037 19515 8489
8079H489j6164O41j5629j9239J7542K4300J4056N583k4373K7127j0441o022j2410
$$ 8489 -7675 -7034 -22663 -41902 -24360 -60 13996 19579 -4794 22333 11892 5870 -6540
8066f540L4640L0539o2780j6818M1647L2421j6611k6516k7566R946R740L4867
$$ -6540 28100 58639 -4141 -20959 20688 53109 36498 9982 -17584 -7638 2102 36969
8054C6969m233j0066k1416Q355O9321K1639m1860l2721k2510K101m3712J9582
$$ 36969 32736 22670 1254 9609 78930 100569 58709 25988 3478 5579 -38133 -18551
8042a8551L4908R553n882r508K1506K6188j0133n199m20l75J942r73R657j489
$$ -18551 16357 25910 20028 10520 32026 58214 48081 42882 42462 42087 44029 43056 52713 51224
8028E1224j6339l6292k4900o75K1093j1893K6569k8510k6054K7012N943m5210
$$ 51224 34885 -1407 -26307 -26982 -5889 -17782 8787 -19723 -45777 -18765 -12822 -58032
8016e8032N015K0120K6051P972P029k3010L649l6038j5211N2789K2015L0963j4794
$$ -58032 -53017 -32897 -6846 1126 8155 -14855 -11206 -47244 -62455 -9666 12349 43312 28518
8003B8518j8133k7474j967O024O857r069k4439k323m156j6100K242M9936j3483
$$ 28518 10385 -17089 -19056 -13032 -6175 -15244 -39683 -42006 -46162 -62262 -60020 -10084 -23567
7990b3567J982m2097K5579O1118L5909J2373k2443q334j6100k4927l1817k0673
$$ -23567 -21585 -63682 -38103 23015 58924 71297 48854 40520 24420 -507 -32324 -52997
7978e2997R352L5226L369q177n703P001L3577p532O048q87k1184n823K5806k2123
$$ -52997 -43645 -8419 -5050 -13227 -18930 -11929 21648 14116 20164 19277 -1907 -7730 18076 -4047
7964d047l7440L3331O376l8393p602J7559L4357K3903k6219o5553p500O4295K6334
$$ -4047 -41487 -8156 -1780 -40173 -47775 -30216 4141 28044 1825 -63728 -71228 -6933 19401
7951A9401l768K8476k1543J470j799o053j8385J5506J1555O429l5112l5334K1057
$$ 19401 15633 44109 22566 24036 22237 16184 -2201 13305 24860 31289 -3823 -39157 -18100
7938a8100M3574J1871n304j506j1250k4143l846L7901K5090j9098k0447L4014
$$ -18100 25474 37345 32041 30535 19285 -4858 -8704 29197 54287 35189 14742 48756
7926D8756j9897j9728M4588k2518r078l5020m4100J2407J2678l195J5282K3142
$$ 48756 28859 9131 53719 31201 22123 -12897 -56997 -44590 -31912 -35107 -19825 3317
7914C317k1l0785J4224M5350M449K4307k67J2118J1175k3630j41l592j4866l9869
$$ 3317 3296 -27489 -13265 32085 36534 60841 60574 72692 83867 60237 60096 56504 41638 1769
7900A769J7726k107k1653j7906k2391O142o264K4267K4732K9544j117l383l6254
$$ 1769 19495 17388 -4265 -22171 -44562 -38420 -44684 -20417 4315 33859 32742 29359 -6895
7887f895R361J981K0135o985o055k267J7845J0657j7508o1J577j1142p406k0830
$$ -6895 2466 4447 24582 17597 11542 9275 27120 37777 20269 20208 21785 10643 3237 -17593
7873a7593k7485R625P892k0087j4574L488n057J4037J3960J7807O865K1066L797
$$ -17593 -45078 -35453 -27561 -47648 -62222 -58734 -63791 -49754 -35794 -17987 -11122 9944 13741
7860A3741j6468P059J24K3583N553k4022k0541j9442R268J5693R499l7726k5057
$$ 13741 -2727 4332 4456 28039 33592 9570 -10971 -30413 -21145 -5452 4047 -33679 -58736
7847e8736j152K8938L2983j2160k8580m8395k8672K5270K9139K5277J279j9163
$$ -58736 -59888 -30950 2033 -10127 -38707 -87102 -115774 -90504 -61365 -36088 -34809 -53972
7835e3972M7855P497l1180j1948K3250J6096K0365J5635J7002r977q1882J6272
$$ -53972 -6117 1380 -29800 -41748 -18498 -2402 17963 33598 50600 40623 -41259 -24987
7823b4987J3256l250m354l7400m054L761J5408J1587O191j0275J2909J4959J8410
$$ -24987 -11731 -14981 -19335 -56735 -60789 -57028 -41620 -30033 -23842 -34117 -21208 -6249 12161
7810A2161L2093m4204p006K3102J2153K5538J1719o0235R299k4085M59K7119J0818
$$ 12161 44254 50 -6956 16146 28299 53837 65556 5321 14620 -9465 -9006 18113 28931
7797B8931j1189o975m4558j4577J1571L4989j1487k7897J645J2920j81N374l855
$$ 28931 17742 10767 -33791 -48368 -36797 -1808 -13295 -41192 -39547 -26627 -26808 -21434 -25289
7784b5289k6595K0142J0711L0010K460k1672k047M1611J1075n0756k1405j9706
$$ -25289 -51884 -31742 -21031 8979 11439 -10233 -12280 29331 40406 -10350 -31755 -51461
7772e1461L6895M5536J4215l8766o9722K694K8040L5584k8812L924N867J3606
$$ -51461 -14566 30970 45185 6419 -63303 -60609 -32569 3015 -25797 -21873 -16006 -2400
7760b400N9367L4921p8778l0123J9558j4882L7856K8897j5202k9711k4403k3927
$$ -2400 56967 91888 13110 -17013 2545 -12337 25519 54416 39214 9503 -14900 -38827
7748c8827q723m502K4206K1047n232R924N002p625K0183J3473K6295L5533j882
$$ -38827 -47550 -52052 -27846 -6799 -12031 -2107 2895 -4730 15453 28926 55221 90754 88872
7735H8872k8476l3070j6634p299k8366K6440j2102k854R159r650j3959j7648J9755
$$ 88872 60396 27326 10692 3393 -24973 1467 -10635 -13489 -4330 -13980 -27939 -45587 -25832
7722b5832p181k363N9330J4777l1944k1855R56p049m218j4084k363L2925J4601
$$ -25832 -33013 -35376 23954 38731 6787 -15068 -14112 -21161 -25379 -39463 -41826 -8901 5700
7709E700L8597O143n9312j3203L933k1r861j9006k918K9367L7134J3233j7714
$$ 5700 44297 50440 -8872 -22075 -18142 -18163 -28024 -47030 -49948 -20581 16553 29786 12072
7696A2072j9665P764J9218k4692J6065N0811q064m0364k2339j1862K2235K6456
$$ 12072 -7593 171 19389 -5303 10762 61573 53509 13145 -9194 -21056 1179 27635
7684B7635j4059J4621L3793l3632k2076N898M836k2919J56j0633r978J1340K1719
$$ 27635 13576 28197 61990 28358 6282 12180 17016 -5903 -5747 -16380 -26358 -15018 6701
7671F701L0715p396k7609q425L877l0209J6124R579j0510k0334J7954K9801J6292
$$ 6701 37416 30020 2411 -6014 -2137 -32346 -16222 -6643 -17153 -37487 -19533 10268 26560
7658B6560L3144L041K316l0344n1694j6913j6292K360k7284L744k517L6989L4987
$$ 26560 59704 62745 65061 34717 -16977 -33890 -50182 -47822 -75106 -71362 -73879 -36890 -1903
7645a903L1984k043k6728l3749J1088J5220p205O361k6637j6688k3940L5332J8869
$$ -1903 30081 28038 1310 -32439 -21351 -6131 -13336 -6975 -33612 -50300 -74240 -38908 -20039
7632b0039j9793k6367q232L9934M0526J2279k557j7025K5737J9378m3668k0087
$$ -20039 -39832 -66199 -74431 -34497 6029 18308 15751 -1274 24463 43841 173 -19914
7620a9914k9790m51L5833p555k5954j3197N806J7650L912o616Q11L4091L5218
$$ -19914 -49704 -50155 -14322 -21877 -47831 -61028 -55222 -37572 -33660 -40276 -39465 -5374 29844
7607B9844k0050K9895O364j6124j1748N535j7168J1708n19O138j9199j718J2048
$$ 29844 9794 39689 46053 29929 18181 23716 6548 18256 17737 23875 4676 2958 15006
7594A5006P979m8638p510N501J7222L1460j0157J5669J1946n9633l2704J1620
$$ 15006 22985 -25653 -33163 -27662 -10440 21020 10863 26532 38478 -21155 -53859 -42239
7582d2239p89M2796m5898j3342N087J8439K9779Q820J9026P345N019r965l5130
$$ -42239 -43028 -232 -46130 -59472 -54385 -35946 -6167 2653 21679 29024 34043 24078 -11052
7569a1052j2735k4048J3905K0090j4564J228j9591r939p938K7401L584j6010J2795
$$ -11052 -23787 -47835 -33930 -13840 -28404 -27176 -46767 -56706 -64644 -37243 -33659 -49669 -36874
7556c6874l211j8238L4140N0800J1295k3409k7583K4675K8063k1950o2264k2647
$$ -36874 -40085 -58323 -24183 26617 37912 14503 -13080 11595 39658 17708 -44556 -67203
7544f7203M3704K0309J1041k1227J8251o413l5695J5984q444J260k7573J9474
$$ -67203 -23499 -3190 7851 -13376 4875 -1538 -37233 -21249 -29693 -28433 -56006 -36532
7532c6532J5885R614L695l4186M1364J4911K6160J8430J9580n8528n7672q504
$$ -36532 -20647 -11033 -7338 -41524 -160 14751 40911 59341 78921 20393 -37279 -45783
7520d5783J8997R13K2727K527o724k340q830M706K9734J2867K8119p285Q436k1901
$$ -45783 -26786 -25873 -3146 -619 -7343 -9683 -18513 -13807 15927 28794 56913 49628 58064 36163
7506C6163q124l2137j1071r179J0349J6570J4304j2389k8588p650k2775j3849
$$ 36163 28039 -4098 -15169 -24348 -13999 2571 16875 4486 -24102 -31752 -54527 -68376
7494f8376J1982P974J6019l065l0170k4154L0075N4529J8826q802m5745l2360
$$ -68376 -56394 -48420 -32401 -35466 -65636 -89790 -59715 -5186 13640 4838 -40907 -73267
7482g3267l539J8112L243r191J1529J1036J5390j304J9615K0399J0762k9574n594
$$ -73267 -76806 -58694 -55451 -64642 -53113 -42077 -26687 -27991 -8376 12023 22785 -6789 -12383
7469a2383M4968L2321j7688m5348J0082m022J8457q137l0151J7648O61N1453m553
$$ -12383 32585 64906 47218 1870 11952 7930 26387 18250 -11901 5747 6408 57861 53308
7456E3308J1499p1460j0399J1216J5755R191j1052k5076m1547J282M3932k9077
$$ 53308 64807 -6653 -17052 -5836 9919 19110 8058 -17018 -58565 -57283 -13351 -42428
7444d2428k741J6245J9297L1372K3035l4325l6916L072l00J3585J4218r609L921
$$ -42428 -45169 -28924 -9627 21745 44780 10455 -26461 -23389 -23689 -10104 4114 -5495 -1574
7431a574k0654m083L8852J0480j7538N6K784m7094k6719j930J5885K2956J2435
$$ -1574 -22228 -26311 12541 23021 5483 5539 8323 -38771 -65490 -67420 -51535 -28579 -16144
7418a6144J7133K4962P998p360l1169l5804q898K7596K2515j0554J297K6853j4574
$$ -16144 989 25951 33949 26589 -4580 -40384 -49282 -21686 829 -9725 -8428 18425 3851
7405C851j8398J8431k689j3120J7178J3641k6125j1385q100j2974N0109K2088
$$ 3851 -14547 3884 1195 -11925 5253 18894 -7231 -18616 -26716 -39690 10419 32507
7393C2507K946J8947o105l2337p013n977r441P178K3780L0361j0660n6125j6747
$$ 32507 35453 54400 48295 15958 8945 2968 -6473 705 24485 54846 44186 -11939 -28686
7380b8686M773O493l1128k2300L619J7022J6703j0548k8835q538L1366O7731P537
$$ -28686 -23913 -17420 -48548 -70848 -67229 -50207 -33504 -44052 -72887 -81425 -50059 17672 25209
7367B5209l2608O40q802j3510k6771L111K0757q779k6703J3175L9105k0238n971
$$ 25209 -7399 -6759 -15561 -29071 -55842 -52731 -31974 -40753 -67456 -54281 -15176 -35414 -41385
7354d1385K0300J1514L8916l5817m8240L398N4095J2663k0578M3P672l3832k372
$$ -41385 -21085 -9571 29345 -6472 -54712 -51314 2781 15444 -5134 -5091 2581 -31251 -33623
7341c3623L0155j9613j6489k7466L4905L6794k2723l7112j6127J7178O1154M303
$$ -33623 -3468 -23081 -39570 -67036 -32131 4663 -18060 -55172 -71299 -54121 7033 11336
7329A1336p083K4759k7850m6463j1335M833J6266M212J5875J109K3983K8473K6165
$$ 11336 4253 29012 1162 -45301 -56636 -51803 -35537 -31325 -15450 -14341 9642 38115 64280
7316F4280l3074j0843L446k3392J0751j6592q64j7947L4459J2897n08l6299k7123
$$ 64280 31206 20363 23809 417 11168 -5424 -6288 -24235 10224 23121 22613 -13686 -40809
7303d0809j024n183J9970L4642j3197Q587n724L8699l2452k9970J6412J8391j0080
$$ -40809 -41833 -47016 -27046 7596 -5601 2986 -2738 35961 3509 -26461 -10049 8342 -1738
7290a738p127P817L2104L1727n737M784M881l2246J0244M2035K7319k3450n6300
$$ -1738 -8865 -1048 31056 62783 57046 61830 66711 34465 44709 86744 114063 90613 34313
7277C4313k3650j6742k3019k1374J1962P784O122K5049o364N119J8023j7964l9667
$$ 34313 10663 -6079 -29098 -50472 -38510 -30726 -24604 445 -5919 -800 17223 -741 -40408
7264d0408J8681L3940j983k381j5559J0737J369j609P405L376R055J0429J0532
$$ -40408 -21727 12213 10230 7849 -7710 3027 4396 2787 10192 13568 22623 33052 43584
7251D3584j5384j7200k083k9208j165J0437l140J7002K1384K2891k4879l8697
$$ 43584 28200 11000 8917 -20291 -21456 -11019 -14159 2843 24227 47118 22239 -16458
7239a6458j6471K2932k1577j2533j5495j2367M0565J5070J2707R766k638l931
$$ -16458 -32929 -9997 -31574 -44107 -59602 -71969 -31404 -16334 -3627 6139 3501 -430
7227d30M0700M4971m25n0498m4452k6992R099K6103J0543q400J4637j636J0415
$$ -430 40270 85241 84816 34318 -10134 -37126 -28027 -1924 8619 219 14856 13220 23635
7214B3635l1602n6446J1014M7680O795j2142k7624k3255M6805K7726O417L6405
$$ 23635 -7967 -64413 -53399 -5719 1076 -11066 -38690 -61945 -15140 12586 19003 55408
7202E5408k3282o2403j9359q534L5152k0033k4370N878q938R071L0210K9014L2163
$$ 55408 32126 -30277 -49636 -58170 -23018 -43051 -67421 -61543 -70481 -61410 -31200 -2186 29977
7189B9977j1507l1526p578k9875k6287L6433O469L154J4567J8104K3302k7000
$$ 29977 18470 -13056 -20634 -50509 -76796 -40363 -33894 -30740 -16173 1931 25233 -1767
7177a767k732M1846n014J7422r790j8447k4451J983L2006l272q490q915K1597
$$ -1767 -4499 37347 32333 49755 39965 21518 -2933 -950 31056 27784 19294 10379 31976
7164C1976J5100j0524Q52J0540k8398j1780j6399k0729L1921j6003l0702n388
$$ 31976 47076 36552 37404 47944 19546 7766 -8633 -29362 2559 -13444 -44146 -49534
7152d9534N63K2201L0080L2588j2571k1599R531j0792j6686K2604J4626p434K3406
$$ -49534 -48971 -26770 3310 35898 23327 1728 11259 467 -16219 6385 21011 13577 36983
7139C6983J1219m8611j4517K5242K141J9855l7657k7006j029K581o208j7426K8253
$$ 36983 48202 -409 -14926 10316 12457 32312 -5345 -32351 -33380 -30799 -37007 -54433 -26180
7126b6180N4451J6645K0902l2102m673j4802J337l636J2666k7193L802J9311L550
$$ -26180 28271 44916 65818 33716 29043 14241 15578 11942 24608 -2585 1217 20528 24078
7113B4078N89p518l6915j4096M7873L9506n2138k4972J1345m862J5483Q800j6066
$$ 24078 24667 17149 -19766 -33862 14011 53517 1379 -23593 -12248 -17110 -1627 7173 -8893
7100h893j1203K3269J7026j8699L3568O616m8J3798n0115k8107M208k6987j8234
$$ -8893 -20096 3173 20199 1500 35068 41684 41636 55434 5319 -22788 -18580 -45567 -63801
7087f3801J0576L7469L0942j6801j0633J1786K7898m1261j9550k5672Q19L5544
$$ -63801 -53225 -15756 15186 -1615 -12248 -462 27436 -13825 -33375 -59047 -58228 -22684
7075b2684L5900K5456k4383j5354J0551j8088k1111K1187J5394j582Q821j3145
$$ -22684 13216 38672 14289 -1065 9486 -8602 -29713 -8526 6868 5286 14107 962
7063I62l7443j0641J9234o850q399Q400K6493K3470l5035j3707L6237J2738k7955
$$ 962 -36481 -47122 -27888 -34738 -43137 -34737 -8244 15226 -19809 -33516 2721 15459 -12496
7050a2496R626Q958J1399J1796K7492j4658K3103n386K537K2146m1767J276K980
$$ -12496 -2870 6088 17487 29283 56775 42117 65220 59834 62371 84517 42750 44026 47006
7037D7006K2665k4163m4674j4410K1223N323k241j9507R139K7337L0650m2016
$$ 47006 69671 45508 834 -13576 7647 12970 10729 -8778 361 27698 58348 16332
7025A6332j7295L0389J610j0696l1325l6342J0257K0118j7486J2847K0924k1755
$$ 16332 -963 29426 31036 20340 -10985 -47327 -37070 -16952 -34438 -21591 -667 -22422
7013b2422k3424K625M1796R278o457J0981l4444n7042N431M0077r714J7900Q720
$$ -22422 -45846 -43221 -1425 7853 1396 12377 -22067 -79109 -73678 -33601 -43315 -25415 -16695
7000a6695K206K3784j606J0071K561K9383m7066L28J3445J865j2807j2373J0974
$$ -16695 -14489 9295 7689 17760 20321 49704 2638 2966 16411 18276 5469 -6904 4070
6987D070n852L0303J8154l0651k3845o737J2501K0581p984m3689k1504k768J5603
$$ 4070 -1782 28521 46675 16024 -7821 -14558 -2057 18524 10540 -33149 -54653 -57421 -41818
6974d1818j3014q445L0615K5025j3739q432J3312P847K7556L6458p796l6394K8459
$$ -41818 -54832 -63277 -32662 -7637 -21376 -29808 -16496 -8649 18907 55365 47569 11175 39634
6961C9634l23j9027N305M729l617j5632l1013R172K6151K6883J9366k1329L690
$$ 39634 39311 20284 25589 30318 26701 11069 -19944 -10772 15379 42262 61628 40299 43989
6948D3989j664n0233l7525m4170n783M0670L616l717j8627O470K9509K0574O809
$$ 43989 42325 -7908 -45433 -89603 -95386 -54716 -51100 -54817 -73444 -66974 -37465 -16891 -10082
6935a0082M2463K4039k4500l4910k9464j9544J7945M6566N217j1609K4540J1580
$$ -10082 32381 56420 31920 -2990 -32454 -51998 -34053 12513 17730 6121 30661 42241
6923D2241n813m1930N425J0385J5733n2l6333l2540K4537P760j2867J1235k8578
$$ 42241 36428 -5502 -77 10308 26041 25989 -10344 -42884 -18347 -10587 -23454 -12219 -40797
6910d0797p921k874l448M03K3468L1142K90P198j3603J730J7038j9135K260J3505
$$ -40797 -48718 -51592 -55040 -54637 -31169 -27 263 7461 -6142 -4412 12626 -6509 -4249 9256
6896I256j9457k4371j795K4620K3613k1520L1913j8144l7022j1269j2979K6021
$$ 9256 -10201 -34572 -36367 -11747 11866 -9654 22259 4115 -32907 -44176 -57155 -31134
6884c1134J7282K1114L1026J6440m5485m2559M045q636j8822J8556J4267J3270
$$ -31134 -13852 7262 38288 54728 9243 -33316 -29271 -37907 -56729 -38173 -23906 -10636
6872a0636q193p936j9970J8044M5051J8086j3689n2951n1946o818K8122J9188
$$ -10636 -18829 -26765 -46735 -28691 16360 34446 20757 -32194 -84140 -90958 -62836 -43648
6860d3648j083J7746K9181K6182j1505J0746l6813K587P153j889j4557m244o742
$$ -43648 -44731 -26985 2196 28378 16873 27619 -9194 -6607 546 -1343 -15900 -20144 -26886
6847b6886p192o074J0421J2104j8586j611M6416K9666p578k0007k4432k2832K0237
$$ -26886 -34078 -40152 -29731 -17627 -36213 -37824 8592 38258 30680 10673 -13759 -36591 -16354
6834a6354J0148j5914K0276k2815m9167J4996K5503L3134p10j6638L341k3792
$$ -16354 -6206 -22120 -1844 -24659 -73826 -58830 -33327 -193 -903 -17541 -14200 -37992
6822c7992P374K1646j5288J3641L8928M362k629j9757j9079J7982k3331n0545
$$ -37992 -30618 -8972 -24260 -10619 28309 32671 30042 10285 -8794 9188 -14143 -64688
6810f4688j7876L1183L9265K2875j9712l4356K0619K5240o867K8689J3988j6100
$$ -64688 -82564 -51381 -12116 10759 -8953 -43309 -22690 2550 -4317 24372 38360 22260
6798B2260j1152K9240j1961j3979j4179N072k664j1903m1489L00L7913J2560j5458
$$ 22260 11108 40348 28387 14408 229 5301 2637 -9266 -50755 -50455 -12542 18 -15440
6785a5440k0333L483K5243R644Q060L0644j184k0889l5796l0699j2332q508J0498
$$ -15440 -35773 -32290 -7047 2597 10657 41301 40117 19228 -16568 -47267 -59599 -68107 -57609
6772e7609K219J9079j6704n310K6831k0352J4747j1870k0889p193P020K1509N057
$$ -57609 -55390 -36311 -53015 -58325 -31494 -51846 -37099 -48969 -69858 -77051 -70031 -48522 -43465
6759d3465n714j6436k266M4781N1573K1018r001l0119j834Q78j8367j3607J6750
$$ -43465 -49179 -65615 -67881 -23100 28473 49491 40490 10371 8537 9415 -8952 -22559 -5809
6746e809J3462M570L6692K7362P177n0206o5282k0599M3393N1801j1425j6102
$$ -5809 7653 12223 48915 76277 83454 33248 -32034 -52633 -9240 42561 31136 15034
6734A5034J1791q083j3640j2257J6527O972j4680k3916L7559J656N782M0l888
$$ 15034 26825 18742 5102 -7155 9372 16344 1664 -22252 15307 16963 22745 22785 18897
6721A8897M7436J9233m6504j7466j5754L759l8607l3710K3615K7001J0608j5074
$$ 18897 66333 85566 39062 21596 5842 9601 -29006 -62716 -39101 -12100 -1492 -16566
6709a6566J2590O691k0732j9215N537J2317M570n782m045k2062j5062k37M1754
$$ -16566 -3976 2715 -18017 -37232 -31695 -19378 -14808 -20590 -24635 -46697 -61759 -61996 -20242
6696b0242q009l3910j9624K5014M7594O720k726m552k6098l3538K7079M5340M9804
$$ -20242 -28251 -62161 -81785 -56771 -9177 -2457 -5183 -9735 -35833 -69371 -42292 3048 52852
6683E2852k338n9547n3341L9494K8448k3802m288K8125J2508K999q345K572l138
$$ 52852 50514 -9033 -62374 -22880 5568 -18234 -22522 5603 18111 21110 12765 15337 12199
6670A2199K3563L03K7343J1530l7159k0248m186L4749J9241l7438j4396k6693
$$ 12199 35762 36065 63408 74938 37779 17531 13345 48094 67335 29897 15501 -11192
6658a1192K0840N727J8292l260r104o3496m4766J9779J9423J6080M1496J5752
$$ -11192 9648 15375 33667 30407 21303 -42193 -86959 -67180 -47757 -31677 9819 25571
6646B5571j4691J1780N483N880q12j6861n167P763Q774K4832m900j6599j4880
$$ 25571 10880 22660 28143 34023 33211 16350 11183 18946 27720 52552 47652 31053 16173
6633A6173Q469j3685Q687q081J7137n889R957r045q091j7269l530j9953q050r052
$$ 16173 24642 10957 19644 11563 28700 22811 32768 23723 15632 -1637 -5167 -25120 -33170 -42222
6619d2222J194M139J8834J3654J7670j9143q624K6254J8213J4466m5765m520J372
$$ -42222 -41028 -36889 -18055 -4401 13269 -5874 -14498 11756 29969 44435 -1330 -5850 -4478
6606d478P856l4621j735J2797l29m996J136M7559M514l2717Q58K1371l413P646
$$ -4478 3378 -31243 -32978 -20181 -20510 -25506 -24370 23189 27703 -5014 -4156 17215 13802 21448
6592B1448J4228J1746O390k4842j9394P381m2606l3940J5691J2371L6313J9951
$$ 21448 35676 47422 53812 28970 9576 16957 -25649 -59589 -43898 -31527 4786 24737
6580B4737j0965j3542r893J1879l997L176M6668l705n0110p577R660N424J9986
$$ 24737 13772 230 -9663 2216 -1781 1395 48063 44358 -5752 -13329 -3669 1755 21741
6567B1741o659j2906k9176L06K3666j3246k5741k4161K4704O8945K4990j9075
$$ 21741 15082 2176 -27000 -26694 -3028 -16274 -42015 -66176 -41472 27473 52463 33388
6555C3388j6409Q024J6468j757m5163l8626j9918p911K4548M4861J2262p066k568
$$ 33388 16979 25003 41471 39714 -5449 -44075 -63993 -71904 -47356 -2495 9767 2701 133
6542A33j0076J1820l2478l153j4327j3776K2909J4205j8454l759r18l117L5306
$$ 133 -9943 1877 -30601 -33754 -48081 -61857 -38948 -24743 -43197 -46956 -47874 -50991 -15685
6529a5685J8523m0649j5469K3123M7475m698j3191p790j1476q653J9546K5370
$$ -15685 2838 -37811 -53280 -30157 17318 12620 -571 -8361 -19837 -28490 -8944 16426
6517A6426K8014o57Q280l6937n5518j6308j2801P698P1910O7606k4226m5167m2393
$$ 16426 44440 43783 52063 15126 -40392 -56700 -69501 -61803 10107 77713 53487 8320 -34073
6504c4073k2600J9759o7112j4738M9159M3995K8784K0855J8951j3992k9104p422
$$ -34073 -56673 -36914 -104026 -118764 -69605 -25610 3174 24029 42980 28988 -116 -7538
6492g538N308m719J8180j145m672j2961M89K6676r706q353j1985j2803j2754k1623
$$ -7538 -2230 -6949 11231 10086 5414 -7547 -7058 19618 9912 1559 -10426 -23229 -35983 -57606
6478e7606J2030o173k6910r139J3801j9639k7616L314L6224L3700o444k9284r249
$$ -57606 -45576 -51749 -78659 -87798 -73997 -93636 -121252 -117938 -81714 -48014 -54458 -83742 -92991
6465i2991N0178J8456p607m083M8540p647j2781J3186M5213L3988k8170n8143
$$ -92991 -42813 -24357 -31964 -36047 12493 4846 -7935 5251 50464 84452 56282 -1861
6453a861k9888K532m2O388Q675K0734l733k0976J7597L7263m3314k1288K2324
$$ -1861 -31749 -29217 -29259 -22871 -14196 6538 2805 -18171 -574 36689 -6625 -27913 -5589
6440e589L6542k4215j75O341l0183Q451J074l1818l3618R851J8374o656p531L516
$$ -5589 30953 6738 6563 12904 -17279 -8828 -7754 -39572 -73190 -63339 -44965 -51621 -59152 -55636
6426e5636K9369R611r615K4006J5862K9594J3871j7260L344j4898m1659K823K0335
$$ -55636 -26267 -16656 -26271 -2265 13597 43191 57062 39802 43146 28248 -13411 -10588 9747
6413I747J7658j7490m7615m2051M6061M1869J1261j9978q788k232J218p105Q857
$$ 9747 27405 9915 -37700 -79751 -33690 8179 19440 -538 -9326 -11558 -10340 -17445 -8588
6400h588k3202L6673o488j9967m595K7605J4614j4723j9457J0648o501k6698K3250
$$ -8588 -31790 4883 -1605 -21572 -26167 1438 16052 1329 -18128 -7480 -13981 -40679 -17429
6387a7429K0749o337M1334n079m6398l1219J0443L5749j2623R378j9807M493J6093
$$ -17429 3320 -3017 38317 33238 -13160 -44379 -33936 1813 -10810 -1432 -21239 -16746 -653
6374f53m960M384j9064Q151j9864j4009K7127J7494P91j5508J447J5157l4243
$$ -653 -5613 -1229 -20293 -12142 -32006 -46015 -18888 -1394 -603 -16111 -14664 493 -33750
6361c3750l1281J86J7751K5005J1478k7276J6324J6391j5460j4825J9048J0184
$$ -33750 -65031 -64845 -47094 -22089 -10611 -37887 -21563 -5172 -20632 -35457 -16409 -6225
6349f225p748K4O236K5599o270q105n608j7625j640J0408J727j4820O756j4491
$$ -6225 -13973 -13949 -7713 17886 11616 3511 -2097 -19722 -21362 -10954 -9227 -24047 -17291 -31782
6335c1782J1213K4064J3562j9920k2821j7150j1523P373K8242R031J4584j9202
$$ -31782 -20569 3495 17057 -2863 -25684 -42834 -54357 -46984 -18742 -9711 4873 -14329
6323a4329l0262J1009M1806M1028k9967l1358O461K7860l817J3925N15j7008L599
$$ -14329 -44591 -33582 8224 49252 19285 -12073 -5612 22248 18431 32356 32871 15863 19462
6310A9462p721N164K6788j6829l6040L441Q959L7837J1675j5337k2408j3041N780
$$ 19462 11741 16905 43693 26864 -9176 -5735 3224 41061 52736 37399 14991 1950 7730
6297G730k0903j968j093k2391m763r055k0450J909j969L306J0237l6615R600L3066
$$ 7730 -13173 -15141 -16234 -38625 -43388 -52443 -72893 -70984 -72953 -69647 -59410 -96025 -86425 -53359
6283e3359K5226l351N235J3704j518M0349J2225j6967O682j4817N826P525l555
$$ -53359 -28133 -31484 -26249 -12545 -14063 26286 38511 21544 28226 13409 19235 26760 23205
6270B3205q4r353P501k6179m0656j7493k9406O686k051r514l559M6716J5150r4
$$ 23205 23121 13768 21269 -4910 -45566 -63059 -92465 -85779 -87830 -97344 -100903 -54187 -39037 -39131
6256c9131J7213M350k1224J2806L654K0274L379k1979q136N902N069j275P374
$$ -39131 -21918 -17568 -38792 -25986 -22332 -2058 1321 -20658 -28794 -22892 -17823 -19098 -11724
6243a1724K884p622J5312L229R136K421J3641l493K778j1814J5334j2335J780
$$ -11724 -8840 -16462 -1150 2079 11215 13636 27277 23784 26562 14748 30082 17747 19527
6230A9527j2249j5203N145M07j6231j841k336n514k9857K9883M4565j8217k5983
$$ 19527 7278 -7925 -2780 -2373 -18604 -20445 -22781 -28295 -58152 -28269 16296 -1921 -27904
6217b7904p10J9451M1445K148j2175r571j9428J797M540n405K171J655q21j1075
$$ -27904 -28614 -9163 32282 34430 22255 12684 -6744 -4947 -407 -5812 -3641 -1986 -2807 -13882
6203a3882K2289K3538j7851l7265k8929J3694r581J5825j2368P684J7446K1957
$$ -13882 8407 31945 14094 -23171 -52100 -38406 -47987 -32162 -44530 -36846 -19400 2557
6191B557M1446J1742l2464K1804N033k3779j5179l736M572P79j8730j12J1269
$$ 2557 44003 55745 23281 45085 50118 26339 11160 7424 11996 12775 -5955 -6067 5202
6178E202l6778R030M6941L0016R40k9206o6486k2550l803O779L1905L3904Q987
$$ 5202 -31576 -22546 24395 54411 55351 26145 -40341 -62891 -66694 -59915 -28010 5894 14881
6165A4881j5701j2799J7516j5469l9106K1344K4415L166m7740J1104N9830l1910
$$ 14881 -820 -13619 3897 -11572 -50678 -29334 -4919 -1753 -49493 -38389 21441 -10469
6153a0469l8557q210n969K6669K4851m2932o957J437M7896K0861k4529k9583Q953
$$ -10469 -49026 -57236 -63205 -36536 -11685 -54617 -61574 -60137 -12241 8620 -15909 -45492 -36539
6140c6539k957p250L2483J8374m057K7170k585p494m2797j0893l5678L504N9096
$$ -36539 -39496 -46746 -14263 4111 54 27224 24639 17145 -25652 -36545 -72223 -68719 -9623
6127i623Q836j6741l6624k644K3570M4346j833k4054j3689j3499l285L1763j3888
$$ -9623 -787 -17528 -54152 -56796 -33226 11120 9287 -14767 -28456 -41955 -45240 -13477 -27365
6114b7365k264j5154M7408L2362R317K107l2360j7116j6782k726J1564J2170M181
$$ -27365 -29629 -44783 2625 34987 44304 46411 14051 -3065 -19847 -22573 -11009 1161 5342
6101E342j318k2490j5678L4338J8074J2760j5652k4617j1561K6346J5970m725
$$ 5342 4024 -18466 -34144 194 18268 31028 15376 -9241 -20802 5544 21514 16789
6089A6789l9448L1961J3864m4826r772J8217J6104k8403j3176q190M2728J6662
$$ 16789 -22659 9302 23166 -21660 -31432 -13215 2889 -25514 -38690 -46880 -4152 12510
6077A2510j5282J5629l1178k0600J7737j871j5439N1666m480k9541J5736R16L2432
$$ 12510 -2772 12857 -18321 -38921 -21184 -23055 -38494 13172 8692 -20849 -5113 -4197 28235
6064B8235l3784m7633p577j0887K0034M2437J5328j5641j1654L0473Q549l2951
$$ 28235 -5549 -53182 -60759 -71646 -51612 -9175 6153 -9488 -21142 9331 17880 -15071
6052a5071j3002K084q314K7961J5582n017j7632K475k4793K1133J9735j0688l1065
$$ -15071 -28073 -25989 -34303 -6342 9240 4223 -13409 -10934 -35727 -14594 5141 -5547 -36612
6039c6612j2532q05L2140K761j1590K8185L3001k7780m5615Q992K2783J4091J829
$$ -36612 -49144 -49949 -17809 -15048 -26638 1547 34548 6768 -38847 -29855 -7072 7019 8848
6026H848k1637N684M3180J0415j1132k5482j7302j2570J574N399k8985j6319P160
$$ 8848 -12789 -7105 36075 46490 35358 9876 -7426 -19996 -18422 -13023 -42008 -58327 -51167
6013e1167j074P007L745J5908J3046Q555n908L947n104n274k1932m4002K0044
$$ -51167 -52241 -45234 -41489 -25581 -12535 -3980 -9888 -5941 -11045 -16319 -38251 -82253 -62209
6000f2209N9175j2661j6391k2464j1895L8974K8600K5891K610j8100L2251r39
$$ -62209 -3034 -15695 -32086 -54550 -66445 -27471 1129 27020 29630 11530 43781 42842
5988D2842n952K0796J3192j2253k2347p877j5648J753k446m0808o641P434O590
$$ 42842 36890 57686 70878 58625 36278 28401 12753 14506 12060 -28748 -35389 -27955 -21365
5975b1365K343q715J3629M7958M049J0818j3841l7942J1354j7293j9833J3889
$$ -21365 -19022 -27737 -14108 33850 37899 48717 34876 -3066 8288 -9005 -28838 -14949
5963a4949k425j3450N5557J1343k889J0545k2466l6888j4996J2743M9731M175
$$ -14949 -17374 -30824 24733 36076 33187 43732 21266 -15622 -30618 -17875 31856 36031
5951C6031k1666n3863K3922J0323n8583P913J5675M933K9893L3178l0721k4453
$$ 36031 14365 -39498 -15576 -5253 -63836 -55923 -40248 -35315 -5422 27756 -2965 -27418
5939b7418j646J007m458j2315k0405p597R590M6595L5556J3848l1612k1059M232
$$ -27418 -29064 -28057 -32515 -44830 -65235 -72832 -63242 -16647 18909 32757 1145 -19914 -15682
5926a5682N0283J269k5693J2620J036j0915k345j4627k6353p707J9706l674k6507
$$ -15682 34601 35870 10177 22797 23833 12918 10573 -4054 -30407 -38114 -18408 -22082 -48589
5913d8589k7536L9400M2238J0358J7693k7033o309p321j1147K2109R157k0138
$$ -48589 -76125 -36725 5513 15871 33564 6531 222 -7099 -18246 3863 13020 -7118
5901g118n59J2865J6886O830p180p23J233k7364K022Q850l0260m5031L4513P4934
$$ -7118 -7677 5188 22074 28904 21724 21001 22234 -5130 -3108 5742 -24518 -69549 -35036 39898
5887C9898J9824k1093J3761j6504R669m1237k5553j2949k832M0379N772j3325
$$ 39898 59722 38629 52390 35886 45555 4318 -21235 -34184 -37016 3363 9135 -4190
5875d190r030K0562K0618J2131m0699k2592M1563P312l1220j292K2373p299j2848
$$ -4190 -13220 7342 27960 40091 -608 -23200 18363 25675 -5545 -6837 15536 8237 -4611
5862d611K1073j6835j751k0125m3397j3406j7186J3875M0652L9061J6232l546
$$ -4611 16462 -373 -2124 -22249 -65646 -79052 -96238 -82363 -41711 -2650 13582 10036
5850A0036j3830J8581K1148j6065k8458K3840k06p527k0961j6449K3040L5520
$$ 10036 -3794 14787 35935 19870 -8588 15252 15046 7519 -13442 -29891 -6851 28669
5838B8669r47J87j1626j2737K6842Q728J6630q02l860m2421p319P115m101k1048
$$ 28669 27722 27909 16283 3546 30388 39116 55746 54944 51084 8663 1344 8459 4358 -16690
5824a6690k5039k1463J5467K1223k6085j6996K6479n422Q037J590K0963J9686
$$ -16690 -41729 -63192 -47725 -26502 -52587 -69583 -43104 -48526 -40489 -38899 -17936 1750
5812A750J6915k1736j7332q595J4368q593r897l52J9343J6658p834n79K30O980
$$ 1750 18665 -3071 -20403 -28998 -14630 -23223 -33120 -33472 -14129 2529 -5305 -5884 -5654 1326
5798A326R355j558j5475j0389k1818M754K2551j8534O735K9942o951k3817k5986
$$ 1326 10681 9123 -6352 -16741 -38559 -33805 -11254 -29788 -23053 6889 -62 -23879 -49865
5785d9865J3277K8194j9874P08k1004J9904J3256o882K591j1640K8398n279k1840
$$ -49865 -36588 -8394 -28268 -27560 -48564 -28660 -15404 -22286 -19695 -31335 -2937 -8216 -30056
5772c0056j3686J3767J6923K8414J530k6137l670J9129m214J2604R868p58k0620
$$ -30056 -43742 -29975 -13052 15362 16892 -9245 -12915 6214 2000 14604 24472 23714 3094
5759C094L959r301j9783j3840M269N670N669K1344J4698j8536n3978j9228j3509
$$ 3094 7053 -2248 -22031 -35871 -31602 -25932 -20263 1081 15779 -2757 -56735 -75963 -89472
5746h9472o464P6337K0511l6978m9512m032N6855K6p606NL667J2653l758R989
$$ -89472 -95936 -19599 912 -36066 -85578 -89610 -32755 -32729 -40335 -40330 -36663 -24010 -27768 -17779
5732a7779L8418M983m4150j1920L2997L6449q649m730K7896l3544l4294M292k6564
$$ -17779 20639 25622 -18528 -30448 2549 38998 30349 25619 53515 19971 -14323 -10031 -36595
5719c6595J4433L107K9620K7211J2140M265m5226k7087j9007K6215J0743R212
$$ -36595 -22162 -19055 10565 37776 49916 54181 8955 -18132 -37139 -10924 -181 9031
5707I031K134k0087j4837j9004K0252L5926l396k5409L698J1151L5109L605k2809
$$ 9031 11165 -8922 -23759 -42763 -22511 13415 10019 -15390 -11692 -541 34568 38173 15364
5694A5364l5364j5723J8678L0494k6981l9819J0152N2078L5099J5494k4603k7226
$$ 15364 -20000 -35723 -17045 13449 -13532 -53351 -43199 8879 43978 59472 34869 7643
5682G643j6751r231j1048l065l7790m667K6219J4192Q226M3491L1174N929J1377
$$ 7643 -9108 -18339 -29387 -32452 -70242 -74909 -48690 -34498 -26272 17219 48393 54322 65699
5669F5699k4760j4962k0486j3570R821L57k2923L06K824j9980l4582M2897K8513
$$ 65699 40939 25977 5491 -8079 1742 2099 -20824 -20518 -17694 -37674 -72256 -29359 -846
5656h46k5493m0439K1268L6493p962L333J2626m0157J5698J5104m690J0824L8760
$$ -846 -26339 -66778 -45510 -9017 -16979 -13646 -1020 -41177 -25479 -10375 -15065 -4241 34519
5643C4519j0754k7651j9904L1572P338L1938K109l0666J2470m8355j7674K0757
$$ 34519 23765 -3886 -23790 7782 15120 47058 49167 18501 30971 -17384 -35058 -14301
5631a4301k8959j4430J6637K6308J0781L3755k8702j0784K0477n789K1844J7103
$$ -14301 -43260 -57690 -41053 -14745 -3964 29791 1089 -9695 10782 4993 26837 43940
5619D3940l1836l1086j8075K2086J6771j6455p006K6383N869J9772J6519j1584
$$ 43940 12104 -18982 -37057 -14971 1800 -14655 -21661 4722 10591 30363 46882 35298
5607C5298l8198q142P176M7107K504k0930K0286O9026j2920k1233k4601K824j8844
$$ 35298 -2900 -11042 -3866 43241 45745 24815 45101 114127 101207 79974 55373 58197 39353
5594C9353j8409m4112J9685J6979j9076m4755n58P3502N4963K263l7340L908J6671
$$ 39353 20944 -23168 -3483 13496 -5580 -50335 -50893 22609 77572 79835 42495 46403 63074
5581F3074n7400m5498P479L922j3514M4659o277p640N537j47q634m2795m8444
$$ 63074 5674 -39824 -32345 -28423 -41937 2722 -3555 -11195 -5658 -5805 -14439 -57234 -105678
5568a05678J7758N2845M9475k667k0335j3755O096J7902o105m2051n129L7310
$$ -105678 -87920 -35075 14400 11733 -8602 -22357 -16261 1641 -4464 -46515 -51644 -14334
5556a4334J1322j0253p606j2098o6k0075K2205K0184m567n777J9076k76j7807
$$ -14334 -3012 -13265 -20871 -32969 -33035 -53110 -30905 -10721 -15288 -21065 -1989 -2265 -20072
5543b0072j0042J5910j2812O217K8482J8528K1897l7264n5708J3506L9854K1893
$$ -20072 -30114 -14204 -27016 -20799 7683 26211 48108 10844 -44864 -31358 8496 30389
5531C0389j0319q620J2671M916l2887l7481j3899N43K9911L7990k3876j3527K1489
$$ 30389 20070 11450 24121 29037 -3850 -41331 -55230 -54687 -24776 13214 -10662 -24189 -2700
5518b700J234L0178J7980k145j4721k0177j361k741l444l476J4947N172j6406
$$ -2700 -1466 28712 46692 44547 29826 9649 8288 5547 2103 -1373 13574 18746 2340
5505B340K982O720k0659j3548J277l4646j0914R76j8941K0834K3167L426j1029
$$ 2340 5322 12042 -8617 -22165 -20888 -55534 -66448 -65472 -84413 -63579 -40412 -36986 -48015
5492d8015r308M252L3734m113k361K3379O326O628p522K469J265j9880K7511P604
$$ -48015 -57323 -53071 -19337 -23450 -25811 -2432 3894 10522 3000 5469 6734 -13146 14365 21969
5478B1969J8533k6000l0282k0091J8970o269K3333j1176j0263j8532L7288k4460
$$ 21969 40502 14502 -15780 -35871 -16901 -23170 163 -11013 -21276 -39808 -2520 -26980
5466b6980j7065K1231J7747n010q392r390L8204q780k8633j3403k4290J2069L2614
$$ -26980 -44045 -22814 -5067 -10077 -18469 -27859 10345 1565 -27068 -40471 -64761 -52692 -20078
5453b0078N3555J4897j8994l9490O714L712j4612k0956N577K5055j3387k6617
$$ -20078 33477 48374 29380 -10110 -3396 316 -14296 -35252 -29675 -4620 -18007 -44624
5441d4624j0788J6615J9454J5076j1053r454J0503r536K1680L0207k5707j3891
$$ -44624 -55412 -38797 -19343 -4267 -15320 -24774 -14271 -23807 -2127 28080 2373 -11518
5429a1518K7481L1232k6576m5483o162K698J3522Q393K0569J5624P451n985M37
$$ -11518 15963 47195 20619 -24864 -31026 -28328 -14806 -6413 14156 29780 37231 31246 31683
5416C1683J8275Q403o810p993J4105k2947O791J0591l4912m4062r738Q271N162
$$ 31683 49958 58361 51551 43558 57663 34716 41507 52098 17186 -26876 -36614 -28343 -23181
5403b3181q927l6965l612k905k200k011N4207K3011k8381k8555J298N119N9791
$$ -23181 -32108 -69073 -72685 -75590 -77790 -79801 -25594 -2583 -30964 -59519 -58221 -53102 6689
5390F689R599m0217j343L4996O081J2873M0887m2123J153J3650l9592k0524j276
$$ 6689 16288 -23929 -25272 9724 15805 28678 69565 27442 28595 42245 2653 -17871 -19147
5377a9147k7856K2048K1224j7233p081L228J512J1727j728J9336J8272M1999k840
$$ -19147 -47003 -24955 -3731 -20964 -28045 -24817 -23305 -11578 -13306 6030 24302 66301 63461
5364F3461j5813J3496R319o5648n1821j4728L040L7896o370P76o272m333l2649
$$ 63461 47648 61144 70463 4815 -47006 -61734 -58694 -20798 -27168 -26392 -32664 -36997 -69646
5351f9646j0620K7277L2297j6609K0868k4175j899n373k9191K9179O2457P123
$$ -69646 -80266 -52989 -20692 -37301 -16433 -40608 -42507 -47880 -77071 -47892 14565 21688
5339B1688l9782j5244l6k9104J5108J4058K2241N5426J2663l1872k2567K681j5973
$$ 21688 -18094 -33338 -33374 -62478 -47370 -33312 -11071 44355 57018 25146 2579 5260 -10713
5326a0713r766J6278J0613j5387l9335O370J7612P863L424L5097K7393k0000k3707
$$ -10713 -20479 -4201 6412 -8975 -48310 -41940 -24328 -16465 -13041 22056 49449 29449 5742
5313E742l3905o219p139j5793K6793j0240k4864M1168L5664J3144k0354j3747
$$ 5742 -28163 -34382 -41521 -57314 -30521 -40761 -65625 -24457 11207 24351 3997 -9750
5301i750J2059J6472J0257k6880k1666M299J6710J1538K6605n4733l1988O474
$$ -9750 2309 18781 29038 2158 -19508 -15209 1501 13039 39644 -15089 -47077 -40603
5289d0603M629l977P233J1685K004L7901P1208n853j7544l8430P15J1264q199
$$ -40603 -35974 -39951 -32718 -21033 -19029 18872 90080 84227 66683 28253 28968 40232 32033
5276C2033j8517k4588k832J078L6847J240j6299O611j7479Q95j5489l6671L9869
$$ 32033 13516 -11072 -13904 -12826 24021 25261 8962 15573 -1906 -1011 -16500 -53171 -13302
5263a3302K7882r279l3003K843J3977J7646j96J0222M2384J636j7343l6332J1103
$$ -13302 14580 5301 -27702 -24859 -10882 6764 6568 16790 59174 60810 43467 7135 18238
5250A8238L0082K3912o972m4452j6919j8038J3152j3964j5634J2486K9636j2169
$$ 18238 48320 72232 65260 20808 3889 -14149 -997 -14961 -30595 -18109 11527 -642
5238f42J4890k6339P804j6862j3835k523k6975J6922K2463P055K5887l2109l337
$$ -642 14248 -12091 -4287 -21149 -34984 -37507 -64482 -47560 -25097 -18042 7845 -24264 -27601
5225b7601m414R395j272j1104J9218j1025K261J1651J29L6564J9700l9913m1560
$$ -27601 -32015 -22620 -23892 -34996 -15778 -26803 -24542 -12891 -12762 23802 43502 3589 -37971
5212c7971L2023L1864J6106K1131k496j0417l3782j4004K1223L574k2561Q724
$$ -37971 -5948 25916 42022 63153 60657 50240 16458 2454 23677 27251 4690 13414
5200A3414L4954J9171k0052k9293J2808j00K0270J3418j4061l3432k9556j7304
$$ 13414 48368 67539 47487 18194 31002 30902 51172 64590 50529 17097 -12459 -29763
5188b9763q749L280K0208O061m168K4681L2251Q523k6777k4894k7565J0055K1118
$$ -29763 -38512 -35232 -15024 -8963 -13131 11550 43801 52324 25547 653 -26912 -16857 4261
5175D261j7050L348j0509j3779j3720j0247K6891J2952o503Q307K956N37o432
$$ 4261 -12789 -9441 -19950 -33729 -47449 -57696 -30805 -17853 -24356 -16049 -13093 -12556 -18988
5162a8988k3225J0039P002K0643L502O619j6700j1156L388N3387l2281N721P554
$$ -18988 -42213 -32174 -25172 -4529 -1027 5592 -11108 -22264 -18876 34511 2230 7951 15505
5149A5505J1956m3512r923M1539L3170N021N251L889l7971j5268K2990R886n4124
$$ 15505 27461 -16051 -25974 15565 48735 53756 59007 62896 24925 9657 32647 42533 -11591
5136a1591K0097P10l1450n830L844Q037p911L161L0625K669N035l6232M184J102
$$ -11591 8506 9216 -22234 -28064 -24220 -16183 -24094 -20933 9692 12361 17396 -18836 -14652 -13550
5122a3550j5815K2965N3836j8167m5152K4256k379l1495q684k8203j6090r947
$$ -13550 -29365 -6400 47436 29269 -15883 8373 5994 -25501 -34185 -62388 -78478 -88425
5110h8425n779O278J0232R838J5562J3208R894L1263J138n823O479j9885p614
$$ -88425 -94204 -87926 -77694 -67856 -52294 -39086 -29192 2071 3209 -2614 3865 -16020 -23634
5097b3634L987l317j4690O841K4125K1796L8573l319l2824j5894m529n893K1178
$$ -23634 -19647 -22964 -37654 -30813 -6688 15108 53681 50362 17538 1644 -2885 -8778 12400
5084A2400j9371J0632j4051N127l1659J2995L6476k0029K5024L9425q086p911
$$ 12400 -6971 3661 -10390 -5263 -36922 -23927 12549 -7480 17544 56969 48883 40972
5072D0972J772k4932l185l3345j4939m019N713K0028M099K0707L0501j9315N614
$$ 40972 42744 17812 14627 -18718 -33657 -37676 -31963 -11935 -7836 12871 43372 24057 29671
5059B9671r749o293R785l1098N0917J9413l4671l0168k7240m062p0922l6069J4785
$$ 29671 19922 13629 23414 -7684 43233 62646 27975 -2193 -29433 -33495 -104417 -140486 -125701
5046a25701M4771M5989L977j1757k388k571M126L4320k8597m1942Q734K0637L2482
$$ -125701 -80930 -34941 -30964 -42721 -45109 -47680 -43554 -9234 -37831 -79773 -71039 -50402 -17920
5033a7920K477M3930K624j7216k8767r199O3718N812o031k7729j0879j3867j5870
$$ -17920 -15443 28487 31111 13895 -14872 -24071 39647 45459 39428 11699 820 -13047 -28917
5020b8917o028R137k0326J295J0380K7936K1546r033j5415N006l0086J7422O801
$$ -28917 -34945 -25808 -46134 -44839 -34459 -6523 15023 5990 -9425 -4419 -34505 -17083 -10282
5007a0282j8149K6679j004L8274L4836J5064k4187j4853j6421j0480m9067q390
$$ -10282 -28431 -1752 -2756 35518 70354 85418 61231 46378 29957 19477 -29590 -37980
4995c7980J9848Q099k5689j1004j1773r642j834J3415N237k0224k4840L9915M8222
$$ -37980 -18132 -10033 -35722 -46726 -58499 -68141 -69975 -56560 -51323 -71547 -96387 -56472 -8250
4982h250J0673j8322j0121j8986K6497K9866l7601O403K4961k5867j5443N0097
$$ -8250 2423 -15899 -26020 -45006 -18509 11357 -26244 -19841 5120 -20747 -36190 13907
4970A3907L4051j5713J7913q924J7887j9207l8188k0036m332Q385J1363k8245
$$ 13907 47958 32245 50158 41234 59121 39914 1726 -18310 -22642 -14257 -2894 -31139
4958c1139m237P243M7420K0395j5264k2192P073M222m7036p389j6912P940m036
$$ -31139 -35376 -28133 19287 39682 24418 2226 9299 13521 -33515 -40904 -57816 -49876 -53912
4945e3912l237J9082n721j098J5684M7474q668j4027l2863j1793J5686R709P394
$$ -53912 -57149 -38067 -43788 -44886 -29202 18272 9604 -4423 -37286 -49079 -33393 -23684 -16290
4932a6290j5242j0405j3432j729M7372j1883l1042K4038K7420J6616K4661k2550
$$ -16290 -31532 -41937 -55369 -57098 -9726 -21609 -52651 -28613 -1193 15423 40084 17534
4920A7534O926K1180j313J1680p432q702k1964j2733j4734K477q518k893K0232
$$ 17534 24460 45640 44327 56007 48575 39873 17909 5176 -9558 -7081 -15599 -18492 1740
4907A740L806J8146p926q611l0306k1138j5754l1539l2522p22K6466M5831K0172
$$ 1740 5546 23692 15766 7155 -23151 -44289 -60043 -91582 -124104 -124826 -98360 -52529 -32357
4894c2357j3021o887J6833L658j6208k2371J8802k596L4692M837m8840j0442M3405
$$ -32357 -45378 -52265 -35432 -31774 -47982 -70353 -51551 -54147 -19455 -14618 -63458 -73900 -30495
4881c0495M4954j4690k1646l3549K1320J4217j8500l689J9355K4N6480L4546k9984
$$ -30495 14459 -231 -21877 -55426 -34106 -19889 -38389 -42078 -22723 -22699 33781 68327 38343
4868C8343k4923J3058J0865k02L611k1240l502j8454j5121K2215n600j2507L009
$$ 38343 13420 26478 37343 37141 40752 19512 16010 -2444 -17565 4650 -950 -13457 -10448
4855a0448J6595j834m7372k5985K8572J8300L618M8982J8451l2389l9325m954
$$ -10448 6147 4313 -43059 -69044 -40472 -22172 -18554 30428 48879 16490 -22835 -27789
4843b7789L4960J46k7744J3830J8620K3041k8623k706L7981L0832O517n9207k1798
$$ -27789 7171 7317 -20427 -6597 12023 35064 6441 3735 41716 72548 79065 19858 -1940
4830a940J5608L053J7532J381k0648j480J1254n5398j6438j5203K4753L8389M5046
$$ -1940 13668 16721 34253 35634 14986 13506 24760 -30638 -47076 -62279 -37526 863 45909
4817D5909K9797M8084k8907q9394l2506J8557L869j2017M125K0137j0878J458
$$ 45909 75706 123790 94883 5489 -27017 -8460 -4591 -16608 -12483 7654 -3224 -1766
4805a766J4130k8721N584J676J96j457J8082o913k2898J3818m655L9491l137k5150
$$ -1766 12364 -16357 -10773 -9097 -8901 -10358 7724 811 -22087 -8269 -12924 26567 23430 -1720
4791a720J8777R764j6358j1533O982N039l5350k4245M0292K1214K7962j0300l1519
$$ -1720 17057 26821 10463 -1070 5912 10951 -24399 -48644 -8352 12862 40824 30524 -995
4778i95r201P428J2021R688r771m8593O227K9306K5217J5397P842J5264k0500
$$ -995 -10196 -2768 9253 18941 9170 -39423 -33196 -3890 21327 36724 44566 59830 39330
4765C9330k8701n233J7122N301P336J0904m3541K1686p911P097J9098K0840j5882
$$ 39330 10629 5396 22518 27819 35155 46059 2518 24204 16293 23390 42488 63328 47446
4752D7446l4021J074k1235k0654J6919L0899j0155j5498j620K8783l8297m9327
$$ 47446 13425 14499 -6736 -27390 -10471 20428 10273 -5225 -6845 21938 -16359 -65686
4740f5686M1986N1536J0751K40K89l768k2515j6395J9627M4535m0005k6245R290
$$ -65686 -23700 27836 38587 38827 39116 35348 12833 -3562 16065 60600 20595 -5650 3640
$$ [...]
##END NTUPLES=NMR SPECTRUM
##END=
