##TITLE=Analysis number 328056
Compound Code sb 01808
Book Reference b
Project Code adrs
Chemist Name melford
##JCAMPDX= 6.0         $$ Bruker NMR JCAMP-DX V2.0
##DATA TYPE= NMR SPECTRUM
##DATA CLASS= NTUPLES
##ORIGIN= Bruker BioSpin GmbH
##OWNER= nmr
$$ XWIN-NMR		Version 3.5
$$ Mon Apr 30 09:33:00 2007 GMT Daylight Time (UT+1h)  MAYBRIDGE\nmr@NMR_250MHZ
##.OBSERVE FREQUENCY= 250.131544655141
##.OBSERVE NUCLEUS= ^1H
##.ACQUISITION MODE= SIMULTANEOUS (DQD)
##.ACQUISITION SCHEME= undefined
##.AVERAGES= 16
##.DIGITISER RES= 18
##SPECTROMETER/DATA SYSTEM= dpx250
##.PULSE SEQUENCE= zg30
##.SOLVENT NAME= CDCl3
##.SHIFT REFERENCE= (INTERNAL, CDCl3, 0, 16.522)
##AUDIT TRAIL= $$ (NUMBER, WHEN, WHO, WHERE, WHAT)
$$ ##TITLE= Audit trail, XWIN-NMR		Version 3.5
$$ ##JCAMPDX= 5.01
$$ ##ORIGIN= Bruker BioSpin GmbH
$$ ##OWNER= nmr
$$ C:\u/data/dgb/nmr/ADRS/3310/pdata/1/auditp.txt
$$ ##AUDIT TRAIL=  $$ (NUMBER, WHEN, WHO, WHERE, WHAT)
(   1,<2007-04-30 09:32:32.73 +100>,<MAYBRIDGE\nmr>,<NMR_250MHZ>,
      <created by zg, POWCHK disabled, PULCHK disabled
       configuration hash MD5:
       76 6E 9A 78 1E 09 19 81 EC 84 63 8F B0 6A 59 2D
       data hash MD5: 64K
       59 03 CA A9 E3 D9 9B DC F6 29 03 C6 75 D8 1F A3>)
(   2,<2007-04-30 09:32:50.05 +100>,<MAYBRIDGE\nmr>,<NMR_250MHZ>,
      <Start of raw data processing
       ef LB = 0.3 FT_mod = 6 PKNL = 1 SI = 32K 
       data hash MD5: 32K
       D2 8E 5F 77 95 15 72 00 0F 8B 43 E9 CC 74 1F BB>)
(   3,<2007-04-30 09:32:52.33 +100>,<MAYBRIDGE\nmr>,<NMR_250MHZ>,
      <apk 
       data hash MD5: 32K
       92 D4 D9 71 E9 9A A7 CF C9 4A CB B5 20 51 DC B3>)
(   4,<2007-04-30 09:32:53.14 +100>,<MAYBRIDGE\nmr>,<NMR_250MHZ>,
      <abs ABSG = 5 
       data hash MD5: 32K
       9B FC 24 3A 46 A2 C0 21 00 FB FA 06 EA E6 FA EF>)
$$ ##END=
$$ 
$$ hash MD5
$$ 75 07 FC EC 1B F4 C3 8E D5 92 98 59 61 16 E1 7D
##$RELAX= 
##$RELAX= 
##$RELAX= 
##$RELAX= 
##$RELAX= 
##$RELAX= 
##$RELAX= 
$$ Bruker specific parameters
$$ --------------------------
##$DU= <C:\u>
##$EXPNO= 3310
##$NAME= <ADRS>
##$PROCNO= 1
##$TYPE= <nmr>
##$USER= <dgb>
##$AMP= (0..31)
100 100 100 100 100 100 100 100 100 100 100 100 100 100 100 100 100 100 
100 100 100 100 100 100 100 100 100 100 100 100 100 100 
##$AQSEQ= 0
##$AQ_mod= 3
##$AUNM= <au_zg>
##$AUTOPOS= <44 >
##$BF1= 250.13
##$BF2= 250.13
##$BF3= 250.13
##$BF4= 250.13
##$BF5= 500.13
##$BF6= 500.13
##$BF7= 500.13
##$BF8= 500.13
##$BYTORDA= 1
##$CFDGTYP= 0
##$CFRGTYP= 5
##$CHEMSTR= <none>
##$CNST= (0..31)
1 1 145 1 1 1 1 1 1 1 1 1 1 1 1 1 1 1 1 1 1 1 1 1 1 1 1 1 1 1 1 1 
##$CPDPRG= <>
##$CPDPRG1= <>
##$CPDPRG2= <>
##$CPDPRG3= <>
##$CPDPRG4= <mlev>
##$CPDPRG5= <mlev>
##$CPDPRG6= <mlev>
##$CPDPRG7= <mlev>
##$CPDPRG8= <mlev>
##$CPDPRGB= <>
##$CPDPRGT= <>
##$D= (0..31)
0 1 0 0 0 0 0 0 0 0.06 0 0 0 0 0 0 0.0002 0 0 0 0 0 0 0 0 0 0 0 0 0 0 
0 
##$DATE= 1177921950
##$DBL= (0..7)
120 120 120 120 120 120 120 120 
##$DBP= (0..7)
150 150 150 150 150 150 150 150 
##$DBP07= 0
##$DBPNAM0= <>
##$DBPNAM1= <>
$$ [...]
##$SUBNAM7= <"">
##$SUBNAM8= <"">
##$SUBNAM9= <"">
##$SW= 20.6930455092707
##$SWIBOX= (0..15)
0 0 3 0 0 0 0 0 0 0 0 0 0 0 0 0 
##$SW_h= 5175.983436853
##$TD= 65536
##$TD0= 1
##$TE= 683.16
##$TE2= 300
##$TE3= 300
##$TEG= 300
##$TL= (0..7)
0 120 120 120 120 120 120 120 
##$TP= (0..7)
150 150 150 150 150 150 150 150 
##$TP07= 0
##$TPNAME0= <>
##$TPNAME1= <>
##$TPNAME2= <>
##$TPNAME3= <>
##$TPNAME4= <>
##$TPNAME5= <>
##$TPNAME6= <>
##$TPNAME7= <>
##$TPOAL= (0..7)
0.5 0.5 0.5 0.5 0.5 0.5 0.5 0.5 
##$TPOFFS= (0..7)
0 0 0 0 0 0 0 0 
##$TUNHIN= 0
##$TUNHOUT= 0
##$TUNXOUT= 0
##$USERA1= <user>
##$USERA2= <user>
##$USERA3= <user>
##$USERA4= <user>
##$USERA5= <user>
##$V9= 5
##$VALIST= <valist>
##$VCLIST= <CCCCCCCCCCCCCCC>
##$VD= 0
##$VDLIST= <DDDDDDDDDDDDDDD>
##$VPLIST= <PPPPPPPPPPPPPPP>
##$VTLIST= <TTTTTTTTTTTTTTT>
##$WBST= 1024
##$WBSW= 4
##$XGAIN= (0..3)
0 0 0 0 
##$XL= 0
##$YL= 0
##$YMAX_a= 388064
##$YMIN_a= -381029
##$ZGOPTNS= <>
##$ZL1= 120
##$ZL2= 120
##$ZL3= 120
##$ZL4= 120
##$ABSF1= 16.522
##$ABSF2= -4.171173
##$ABSG= 5
##$ABSL= 3
##$ALPHA= 0
##$AQORDER= 0
##$ASSFAC= 0
##$ASSFACI= 0
##$ASSFACX= 0
##$ASSWID= 0
##$AUNMP= <proc_1d>
##$AZFE= 0.1
##$AZFW= 0.1
##$BCFW= 0
##$BC_mod= 0
##$BYTORDP= 0
##$COROFFS= 0
##$CY= 12.5
##$DATMOD= 1
##$DC= 0
##$DFILT= <>
##$DTYPP= 0
##$F1P= 14.0000005364418
##$F2P= -0.99999901652339
##$FCOR= 0.5
##$FTSIZE= 32768
##$FT_mod= 6
##$GAMMA= 0
##$GB= 0
##$INTBC= 1
##$INTSCL= 1
##$ISEN= 128
##$LB= 0.3
##$LEV0= 0
##$LPBIN= 0
##$MAXI= 10000
##$MC2= 0
##$MEAN= 0
##$ME_mod= 0
##$MI= 0
##$NCOEF= 0
##$NC_proc= -1
##$NLEV= 6
##$NOISF1= 0
##$NOISF2= 0
##$NSP= 0
##$NTH_PI= 0
##$NZP= 0
##$OFFSET= 16.522
##$PC= 1
##$PHC0= -56.91915
##$PHC1= 8.008369
##$PH_mod= 1
##$PKNL= yes
##$PPARMOD= 0
##$PSCAL= 4
##$PSIGN= 0
##$REVERSE= no
##$SF= 250.13
##$SI= 32768
##$SIGF1= 0
##$SIGF2= 0
##$SINO= 400
##$SIOLD= 32768
##$SREGLST= <1H.CDCl3>
##$SSB= 0
##$STSI= 32768
##$STSR= 0
##$SW_p= 5175.98343685301
##$SYMM= 0
##$S_DEV= 0
##$TDeff= 65536
##$TDoff= 0
##$TI= <Analysis number 999999
Compound Code 99
Book Reference 9
Project Code 9>
##$TILT= no
##$TM1= 0
##$TM2= 0
##$TOPLEV= 0
##$USERP1= <user>
##$USERP2= <user>
##$USERP3= <user>
##$USERP4= <user>
##$USERP5= <user>
##$WDW= 1
##$XDIM= 32768
##$YMAX_p= 326811490
##$YMIN_p= -43838
$$ End of Bruker specific parameters
$$ ---------------------------------
##NTUPLES= NMR SPECTRUM
##VAR_NAME=  FREQUENCY,     SPECTRUM/REAL,   SPECTRUM/IMAG
##SYMBOL=    X,             R,               I
##VAR_TYPE=  INDEPENDENT,   DEPENDENT,       DEPENDENT
##VAR_FORM=  AFFN,          ASDF,            ASDF
##VAR_DIM=   32768,         32768,           32768
##UNITS=     HZ,            ARBITRARY UNITS, ARBITRARY UNITS
##FACTOR=    0.157963299565203, 1,           1
##FIRST=     4132.6476996994, 0,             0
##LAST=      -1043.33573715361, 0,           0
##MIN=       -1043.33573715361, -43838,      0
##MAX=       4132.6476996994, 326811490,     0
$$ Real data points
##PAGE= N=1
##DATA TABLE= (X++(R..R)), XYDATA
$$ [...]
##PAGE= N=2
##DATA TABLE= (X++(I..I)), XYDATA
18928 185182 185700 189364 186044 181230 181061 182470 185908 185262 182045 184834 182659 182111 182930 181843 185903
18913 185903 185319 183105 181189 175926 176398 177359 181171 181091 185214 181611 175951 180272 186852 185052 183683
18898 183683 185775 186389 185760 190042 187911 186692 188097 186723 187438 187659 185210 185318 193971 187609 183798
18883 183798 187232 193333 195754 191360 191243 189227 186399 184908 188527 190499 195488 191716 186029 186726 187463
18868 187463 188613 188392 190691 190648 189359 190303 190611 192505 191359 190167 192652 198611 195962 189886 188711
18853 188711 185798 183553 183542 185569 191036 189427 189023 189739 194051 193270 189307 186994 183744 184307 187887 190835
18837 190835 189390 188112 187393 186293 185192 188334 192035 193292 190908 187993 185913 187611 191817 193454
18823 193454 190802 190283 194216 197342 199087 198365 196346 192541 194422 197643 197800 198222 197394 196236 190374
18808 190374 189292 193000 195431 193790 190509 187139 190316 194681 196357 197612 197111 197281 195916 197627 204111
18793 204111 207460 210991 206094 202008 200793 200848 198853 198347 196298 195792 196437 200794 204055 205322 204503 204265
18777 204265 201711 199609 206138 213880 216241 213235 214768 216869 224595 230465 225666 205302 172230 155978
18763 155978 160047 162285 164433 172604 175895 178322 179777 180304 179489 181706 185067 193222 198327 194737 193259
18748 193259 193257 195569 195460 194849 191518 192619 193808 194750 194746 199882 199787 198787 197819 194567 192650 197596 200321
18731 200321 197103 198609 199937 197112 195316 193394 192816 194056 189150 184822 183936 187758 189760 191059 193527
18716 193527 195139 197275 199604 196904 197795 195985 193164 193123 198110 200373 197904 196669 198876 196400 193238
18701 193238 191386 190925 199334 203657 202661 197331 199400 202931 203742 209426 212457 214024 214022 209314 208931 205906
18685 205906 204453 205393 201063 199410 204383 200067 197011 203210 205870 203447 201752 202871 204349 204132 201328
18670 201328 201744 206813 207516 208443 208124 203420 206767 207860 199319 200500 207216 210542 207441 203174 203339
18655 203339 206836 202175 195895 197887 206253 210708 209708 210969 212399 214545 216119 212616 211314 209160
18641 209160 207626 207127 206890 206097 203553 199546 200937 206042 203097 198555 198034 200635 204418 208163 210615
18626 210615 210900 212294 211290 210681 208551 202326 198811 206927 217945 221834 218652 217879 216961 216254 210769
18611 210769 213451 220512 219090 213507 210456 215781 211655 209263 211992 214584 210384 210042 212330 211032
18597 211032 208203 208358 208232 207679 209550 211306 211792 212728 211558 212216 213794 211995 210265 211136 212889 211804
18581 211804 213072 211948 209216 210892 211135 215645 218814 221004 219034 214223 214320 213356 220804 225268 227048
18566 227048 223239 220041 222437 219807 222332 226016 221137 221349 222847 219782 220506 222910 225137 224795 222182
18551 222182 225923 229798 229477 224634 224871 225470 223799 220440 219726 219041 219674 218724 219946 223376 221086 220993
18535 220993 226991 232056 230539 227851 227506 226205 223841 225108 232360 232736 228604 221948 220150 221700 229973
18520 229973 236910 232467 226450 222412 221663 225430 230956 230667 231368 229981 228482 226677 228171 231189 230294
18505 230294 230227 235170 237855 236119 236844 234483 231236 234933 231310 228471 231459 236262 236191 237487 233055
18490 233055 228421 226474 229734 232142 233683 235499 233956 232085 230556 229933 233290 235563 232918 233146 235332
18475 235332 239967 244897 246544 241846 231368 226941 230995 235991 237651 237845 239734 237763 235132 236580
18461 236580 236009 236560 234993 237758 242997 239975 242827 241643 242424 246817 247162 243443 246534 249862 249860 248485
18445 248485 245488 241135 239612 239721 243395 243746 239673 239598 241315 240103 238442 242433 244105 244955 242020
18430 242020 238306 241407 243268 239192 239166 243820 246735 245362 242587 246331 248672 251075 247118 247004 249967
18415 249967 252534 255291 259605 259340 253287 243753 242651 249352 253277 249450 247757 248544 249479 252276 255730
18400 255730 255596 254138 253807 254204 254718 252666 251462 254661 250136 250897 251522 248056 251486 250748 249744 253127
18384 253127 251621 253769 258619 261027 262309 258896 258807 250523 248393 253658 260569 262358 265949 262894 260912
18369 260912 259672 256936 258981 259834 261249 264834 267729 263851 259845 261889 263502 266428 269679 269878 269460
18354 269460 267745 269856 273465 270523 268995 269018 266651 268967 268624 268616 269529 267365 267143 270548 271522 271753 274326
18337 274326 274984 279690 281736 281701 281022 281452 275517 274356 278066 277912 278182 278126 277095 278960 281266 282826
18321 282826 280466 280437 285022 284490 285898 289378 286433 284352 288276 289384 289813 293942 290341 284503 284115
18306 284115 281728 280323 282186 289716 292482 294707 291670 292156 295002 290887 294211 301112 305145 308928
18292 308928 304611 307827 309357 307193 303440 300927 306545 307867 307586 309733 307090 304291 303231 303326 303013
18277 303013 305318 304953 308142 309968 310563 316832 319454 319447 319760 321969 320261 318805 319368 319696 316965 316395
18261 316395 320285 320207 325347 331172 332860 332455 336167 337503 332445 334534 335513 340017 340874 337878 334421
18246 334421 333983 337318 340433 344938 344809 342928 348512 354959 358485 361642 358357 356202 354377 355671 358093
18231 358093 356835 359667 360723 364576 364266 362137 363855 369663 371722 373133 376117 380337 381211 378863 377531
18216 377531 380223 380912 380292 380211 380552 384441 387236 390257 389367 393269 397516 398943 401975 407945 410947 410475
18200 410475 411552 417406 424017 427464 427297 429111 429338 429104 429580 430606 433438 440209 447610 454130 449464
18185 449464 450310 456739 464135 464533 469057 475373 475444 478641 482813 486412 491860 500954 508036 511912 509735
18170 509735 517137 522754 525777 532975 541698 547768 550464 552486 557759 567479 579361 588465 595473 601334
18156 601334 607661 616795 626963 633051 648853 663557 670582 676508 689847 709444 730945 745286
18144 745286 755743 766232 781900 798674 818397 839770 858837 881066 905227 931362 962148
18133 962148 990132 1019758 1052376 1087248 1126772 1170911 1223461 1283694 1348454 1419017 1498142
18122 1498142 1587516 1686449 1799798 1938042 2103648 2302338 2552389 2860818 3246680 3754740
18112 3754740 4393255 5131578 5832861 5910942 3819501 -1940066 -5881279 -5994290 -4995825
18103 -4995825 -4086067 -3391861 -2872410 -2471787 -2162132 -1921647 -1726066 -1566423 -1426371
18094 -1426371 -1308155 -1207679 -1120099 -1036068 -962094 -901053 -844225 -789941 -743734 -703446 -662871
18083 -662871 -627575 -593943 -564681 -543347 -512419 -482518 -463017 -443140 -424170 -404655 -385439
18072 -385439 -372175 -358300 -343879 -327586 -310869 -298563 -289296 -281723 -270979 -256447 -241785 -227243
18060 -227243 -215722 -204314 -196534 -192817 -187399 -183730 -181959 -174084 -168722 -163674 -152092 -139220 -130142
18047 -130142 -125959 -119476 -112645 -108195 -101434 -96241 -92629 -91666 -87596 -81861 -75707 -72311 -69504 -65262
18033 -65262 -63024 -64423 -62800 -55447 -54349 -50213 -46999 -46119 -42355 -35850 -31103 -25499 -21756 -22335 -18860
18018 -18860 -15789 -12375 -7913 -4283 -2716 1905 7212 5919 1049 -273 404 2891 5383 7752 8495
18003 8495 9775 14296 18042 21291 22520 19959 21507 30089 33694 34863 36689 37280 43148 44070 45329
17988 45329 48125 49231 49276 54366 53651 52260 54873 55493 56400 56566 58914 58721 58042 58062 60658 62452 61648
17971 61648 61236 64704 71247 68209 68898 73634 73828 73291 67962 61256 60083 67264 72931 77793 78806
17956 78806 76986 80528 83349 80938 79867 78711 79452 82814 86130 87271 90787 94329 91407 90044 91870
17941 91870 92947 92918 89175 93422 96600 94978 94103 94792 96312 97596 95558 98157 103302 103553 101517 98585
17925 98585 101884 102551 99213 98373 104322 105366 104849 103089 101947 101365 103773 102201 104325 104895 102050 105995
17909 105995 107207 105819 106030 109154 113138 117733 116149 120675 127985 130191 128474 131134 134210 130462
17895 130462 126911 123403 120766 122022 126036 126494 128922 134373 133142 130477 132584 132213 130195 123129 122336
17880 122336 125032 127452 131995 135900 133135 133853 135959 137909 138101 136065 133076 136336 135392 137728 140452
17865 140452 141203 140716 138372 134943 132424 134839 136447 137477 136749 140991 142902 139818 138333 139385 140983
17850 140983 138337 139998 140991 138340 139437 142865 147595 148823 146321 142444 145745 148893 150985 149119
17836 149119 146136 145803 145796 146283 146569 151726 151797 147270 147270 149692 152168 155474 161979 161219 153702 153514 155011
17819 155011 157911 160433 160742 159879 157388 157941 161551 161183 156953 154965 156763 154045 153854 157763 159924
17804 159924 161193 160366 164762 169659 167848 163631 164372 166042 161943 158702 159556 156674 157314 160465 162950
17789 162950 168596 165328 160383 164979 170374 169763 163697 159429 159615 161302 162288 164968 167040 166616 171853
17774 171853 168723 165441 160449 161944 166270 168007 171299 169147 164451 165103 168465 165858 163873 167351
17760 167351 169151 167560 167233 168637 166418 165977 171322 171950 172013 168855 168576 170451 171384 175206 173063 171197
17744 171197 171077 170676 169876 172905 172583 171109 170396 172012 172635 172495 178720 180128 180028 177825 173097 171320
17728 171320 170913 169174 170852 173374 173290 176760 178731 180832 179648 175757 178453 177832 174436 170710 174115
17713 174115 177078 176532 179486 180827 181782 183147 180449 182783 184174 185804 183481 180153 180621 183500 183557
17698 183557 186979 190975 189887 188455 190739 192912 191666 190274 182512 182323 187368 191346 192595 190665
17684 190665 188340 189419 186624 184923 184637 188132 191364 194310 199514 197298 192506 190486 195402 195235 193285
17669 193285 194827 197967 197294 196348 193841 191396 194475 199103 200947 200042 201887 203660 200698 197258 195590
17654 195590 194161 198533 199765 202562 203022 198180 195405 199014 196926 193296 191189 193206 196927 197832 199488
17639 199488 202066 201730 200071 199365 201134 202725 198696 196536 198490 196923 196891 194040 193123 196437 201927
17624 201927 205362 202246 199003 202477 199893 196005 198739 201074 198052 198602 206666 203603 199875 193706
17610 193706 198877 202831 201325 203252 203499 206721 208330 208681 208687 205751 205295 202931 206228 205871 202116 205399
17594 205399 210440 210589 210235 208999 203699 204761 204625 202336 200884 202824 202914 205120 204700 204060 205115 209110
17578 209110 208634 205839 200123 197727 203755 209139 211158 212352 210602 209106 203604 200142 200703 202753 208093
17563 208093 212920 213161 211804 211036 211907 213152 211397 213462 214633 214263 213124 218242 220489 213005 213648
17548 213648 217702 219431 218309 215466 209671 210400 211669 214756 215634 213145 213955 216044 215601 214343 219146
17533 219146 220903 218923 218322 218289 214020 214649 221823 223076 219483 216975 217693 218096 219490 226189 232032 230676
17517 230676 222752 224699 226837 226454 226133 226226 225189 225623 223714 230216 230187 223912 223264 223970 227322 232835
17501 232835 233898 235316 233860 232007 231073 229937 228580 223252 218795 218451 218754 222784 227333 229419 231436
17486 231436 227079 223715 226497 230771 233934 233690 224643 223882 226504 226944 228800 233932 231504 226953 228057
17471 228057 227223 225588 227279 233472 233252 234463 232478 236432 237255 236817 237342 236371 237040 238823 241336 241611
17455 241611 239454 239259 239173 239584 241667 246961 247935 250221 253204 255569 259857 266354 271697 266323 240825
17440 240825 211086 203905 211355 216052 219422 220601 224145 226426 226769 224837 225619 229250 232374 230800
17426 230800 233523 235842 235218 233838 240373 242719 238481 238951 235780 234298 234847 235796 236737 237128 238178 241521
17410 241521 241280 239363 241047 242698 243292 238596 234598 235407 238066 243408 245103 242892 244293 242676 244012
17395 244012 243132 243140 242191 244883 244341 245142 246039 241402 240973 242958 245758 243111 244413 247285 248237 246369 244728
17378 244728 240750 238836 248048 252225 245170 244079 242568 243850 242185 240997 245109 243702 241777 240059
17364 240059 239208 244613 248262 246972 247090 247340 247882 245349 243988 244526 246141 245519 244247 250480 254322 254898
17348 254898 257827 253245 250337 246435 243729 244097 247543 258369 262659 255962 250173 250003 251754 259578
17334 259578 257601 254308 249850 247985 250026 251722 250564 248854 251218 254617 259325 263033 267817 271227
17320 271227 268963 259349 254762 252737 251482 255075 254806 255520 257117 255187 255044 252148 250397 254812 258374
17305 258374 258744 255049 252756 252195 254988 257653 256307 256145 259249 262123 263482 264772 266733 266692 262264
17290 262264 258483 256570 258448 258022 264300 266409 265777 268216 266977 262758 260637 263402 265095 263480 266332
17275 266332 269346 267763 264752 266875 269368 268482 267889 263376 264904 269395 268264 265632 268539 270944 272447
17260 272447 269682 273414 270475 267983 270246 272171 270007 270198 270254 269577 265861 262614 265226 268540 268727
17245 268727 263976 266048 266069 266917 268950 270292 271830 269041 272052 274762 276247 280398 277184 273603 271730
17230 271730 271768 275524 280367 282383 279359 277628 280812 279764 279718 281127 282649 282539 282617 279979 281979 285228
17214 285228 283220 282243 281503 277875 278061 279774 284142 285451 289406 289921 286706 286793 285631 283707 281490 279955
17198 279955 276046 279623 280912 281973 281923 284016 291452 289490 281365 276821 275271 276893 282538 285643 288070
17183 288070 288151 285098 282879 283836 283678 282163 287163 290810 294460 292902 284818 279100 280191 285090 284629
17168 284629 284129 286105 288452 290596 290224 286160 288861 292553 287719 289558 293221 293861 295061 297370 290812
17153 290812 290306 292648 288620 281901 281096 283174 287047 294164 299608 299040 296959 291830 291968 290341 289922
17138 289922 289471 288579 290373 290695 292635 293882 294059 293590 289886 290092 293939 297874 302333 303779 301926 300376
17122 300376 297162 299723 300576 297581 300898 304688 304524 304985 302862 305905 305840 302216 303126 305898 302964 305264
17106 305264 308902 308892 306912 300978 302217 299738 300373 306082 306606 301800 305379 311517 309816 307697 305754
17091 305754 303649 299987 299921 297848 298577 301304 304078 305046 304016 303027 308366 310535 309697 307910 303179 297966
17075 297966 301836 304656 304090 305687 306557 308684 309658 309963 309645 312475 311570 309985 309216 308791 310823 314182
17059 314182 314006 315346 315855 318471 311258 309310 310839 310293 310319 312731 316813 315236 315892 319027 315498 317063
17043 317063 320834 325662 324422 320258 321947 324218 325302 326173 324860 323495 321956 325875 327160 323480
17029 323480 319774 317349 320957 325014 325233 321606 324110 332067 334452 327743 322975 319681 317681 317398 315476
17014 315476 316073 319090 323076 327496 321706 318682 319234 322108 322114 327926 327092 325804 324392 325564 327149 326622
16998 326622 322144 322287 323518 322711 325117 329078 335207 335233 329807 325889 327527 331170 334810 333366 333959
16983 333959 331439 336223 338691 342698 341700 337804 336929 333081 334278 339179 344316 338955 330854 330745 333243
16968 333243 336589 337313 340398 343504 347243 349699 349416 345619 343406 344392 343118 336930 338657 336725 338334
16953 338334 341153 339593 340022 342554 340454 338058 336057 339424 341481 344757 345763 345970 345308 348486 351230
16938 351230 351049 354698 358356 355255 351504 349914 343156 342667 347423 348866 349350 350870 355387 356623 354780
16923 354780 354594 353458 352128 349216 347071 349757 353781 350708 352266 352689 358077 359578 364353 367504 371869
16908 371869 371088 364020 358194 363028 360756 358080 362974 364766 362889 364114 369801 370820 368354 363874
16894 363874 365231 366989 364786 367660 368347 369230 366351 363305 360757 360123 358635 359115 370703 367924 364616
16879 364616 362788 363453 364935 367582 365717 368388 367886 366468 369006 368938 366831 368841 370711 369011 369523
16864 369523 367920 367214 364875 367671 367907 370008 369396 374277 374965 375618 373939 374651 376941 376366 382723 379765
16848 379765 378283 379307 381391 377121 378441 381216 380100 376061 380601 389692 390903 390367 387615 386447
16834 386447 386303 389758 383999 381543 380766 380809 382137 384934 387112 387253 392290 393158 392812 390018 392404 390952
16818 390952 388819 389436 389446 388964 390389 392864 393010 391672 392812 394846 396458 400878 402306 405408 403990
16803 403990 400957 398517 397836 394678 397150 404696 401944 395855 399418 402970 401609 400318 395712 394413
16789 394413 402978 407887 407997 406302 401677 404419 406334 406758 410710 405336 408086 412187 412930 409289 413456
16774 413456 417670 419522 419755 417206 416212 414607 412517 413025 414227 412966 415687 411999 412947 419228 421305
16759 421305 422966 423645 421132 420755 422313 423536 420164 419764 418946 420655 421224 421005 425039 427320 430444 429086
16743 429086 426156 424474 423461 427024 428340 426781 425908 429868 433757 433173 436161 437699 435687 437579 440598
16728 440598 442011 442475 439462 441363 441000 444565 450804 453894 457158 449396 439195 431217 427184 428094 433248
16713 433248 427802 424113 428613 429309 427103 426281 429954 436955 436888 433318 437372 446870 448315 447607 447307 449516
16697 449516 444820 443785 447331 447379 448513 453664 455034 451670 450237 450751 452367 454046 460249 462924 461081
16682 461081 458957 461977 459219 459704 462821 464829 464745 466578 466476 461225 458305 458902 465477 468329 469791
16667 469791 470186 469728 463075 464415 468754 468499 473480 475795 466505 468788 467177 466159 465781 466792 465636
16652 465636 470115 474544 477540 476369 475794 475324 480247 483636 480847 483207 483034 487913 494608 498971 496146
16637 496146 493164 491541 488854 482213 486326 494465 490154 486787 485880 483891 487820 496504 497838 497009 498240
16622 498240 501218 501885 503324 507310 507993 504790 512075 515490 511858 509490 507172 509317 515647 519168 519965
16607 519965 518984 517614 518480 519733 518594 516485 511899 511887 515619 519036 523094 527828 528241 528207 527636 530695
16591 530695 531969 531992 532376 533571 532584 533922 532410 533724 536198 541230 547497 552596 556585 558460 556377
16576 556377 557815 561066 560797 557152 553023 552798 557277 565652 572550 575228 574449 574934 577955 579831 579348
16561 579348 585584 590145 590769 591518 599002 603199 608728 612945 620064 625065 625417 631213 637728 646912 656107
16546 656107 671298 686702 707792 728282 750644 777176 803855 810484 780581 702286 588287
16535 588287 458116 352297 298403 287401 303927 330204 361269 392614 413261 427949 434977
16524 434977 442208 450115 461325 468700 476577 482215 493705 499847 508120 511971 514982 516856 516489 516592
16510 516592 519358 527343 529598 532306 537558 543109 547987 546371 547699 549997 552496 555454 559373 560789
16496 560789 561041 562228 566021 566991 569379 571553 570375 569942 575310 580316 581186 578555 576823 578803 579994
16481 579994 581668 580143 582524 589542 591538 589529 589109 587990 590820 592069 597159 602508 603073 602102 603383
16466 603383 603063 604715 604351 603315 606911 610702 614100 616318 619185 621833 624366 620585 619507 623433 623925
16451 623925 626015 628889 629576 631772 636117 638099 634401 633253 632497 636880 639320 639702 636713 634742 635303
16436 635303 641097 644963 643809 645022 641674 643745 651177 657763 657438 658295 663093 665017 663892 664794 663857
16421 663857 668195 668145 669875 669693 667707 672903 674653 678216 682195 684819 689030 689346 687450 684906 685332
16406 685332 685137 685497 687356 692826 701272 701277 694559 694933 703045 705923 703368 706035 711080 713503 710875 714378
16390 714378 721652 722302 725195 724996 726827 729067 730258 731311 733870 736364 737688 740590 738637 739499 742944
16375 742944 746121 748291 751049 749483 750661 754437 760609 762196 761474 761820 761157 760670 761473 766788 769644
16360 769644 772202 774707 778157 776043 778046 779194 784623 792974 794161 792056 794488 796771 797941 795757
16346 795757 795757 798099 795352 797818 797425 801065 808336 812862 816123 818607 819226 820186 823541 827203 833471 834159
16330 834159 833466 838154 841013 843247 846680 848457 850335 853557 854863 858585 866640 868346 868189 869550 872127
16315 872127 871761 872769 875729 881422 889303 894261 897276 902862 911072 913534 907650 900223 899273 901056 898968
16300 898968 898271 900173 908809 920654 925075 927343 930427 935355 943405 949281 948321 949414 951267 957438
16286 957438 958822 959835 960138 956662 959663 966429 974086 979299 983005 987801 991752 996790 999973 1005671
16272 1005671 1008156 1007629 1012271 1017282 1021577 1028227 1030524 1031886 1031042 1030411 1027731 1031180 1032607 1035249 1039665
16257 1039665 1037577 1040293 1046553 1056055 1058482 1061093 1062254 1064946 1069033 1070559 1068424 1070531 1076130 1080425
16243 1080425 1081222 1085348 1091267 1098690 1105161 1107468 1110386 1112025 1122400 1128541 1136504 1144789 1148409 1149440
16229 1149440 1152460 1157862 1165179 1173143 1179268 1187907 1198631 1205088 1205769 1207164 1211007 1218039 1223936 1228280
16215 1228280 1232507 1240281 1247646 1253958 1255449 1263777 1269879 1271978 1277394 1281032 1285868 1299439 1309235 1314396
16201 1314396 1320042 1325866 1335111 1339293 1342617 1348879 1355099 1358384 1364390 1366898 1370991 1379581 1388241 1395149
16187 1395149 1400206 1406467 1412524 1419526 1426745 1432943 1436056 1443200 1451612 1457204 1469102 1478767 1484031 1498185
16173 1498185 1507973 1515517 1523538 1536426 1546852 1555351 1555061 1562321 1577834 1591988 1599440 1603098 1613953
16160 1613953 1617621 1627533 1643404 1658518 1676288 1693056 1707971 1720822 1728457 1741834 1751919 1763971
16148 1763971 1774109 1779564 1788343 1802662 1819899 1833307 1844392 1856174 1866266 1873859 1887259 1911214
16136 1911214 1934725 1958671 1983325 2002825 2017490 2030189 2043056 2053138 2056489 2064275 2075510 2081507
16124 2081507 2086118 2096114 2100499 2108418 2110434 2115469 2124916 2143787 2166368 2192745 2218459 2242912 2260701
16111 2260701 2283069 2305586 2327226 2348983 2370216 2393123 2411578 2430506 2454905 2479763 2503520
16100 2503520 2528481 2557334 2580784 2604168 2632165 2660076 2686337 2713714 2737743 2768926 2800217
16089 2800217 2831302 2865945 2900063 2933706 2967599 2999937 3038684 3078512 3111879 3145786 3181860
16078 3181860 3219472 3264062 3308583 3355168 3401234 3451994 3495463 3538777 3591000 3643693 3696804
16067 3696804 3752145 3811506 3871995 3929128 3992146 4059960 4128247 4195654 4266975 4330279 4397958
16056 4397958 4473884 4553305 4639205 4734718 4839898 4945759 5053695 5161872 5264850 5373292
16046 5373292 5485434 5604086 5732440 5865725 6003196 6155221 6313748 6476151 6643642
16037 6643642 6822255 7009773 7211034 7428512 7664648 7919712 8190252 8478444 8778517
16028 8778517 9103269 9458831 9845147 10259953 10719759 11229536 11787583 12402845 13094826
16019 13094826 13873831 14753268 15743682 16860467 18111261 19516696 21117101 22985366
16011 22985366 25240871 28049638 31588411 35961097 41051576 46126344 49310107 47494777
16003 47494777 37690994 19307343 -4283578 -26909849 -42920529 -49859552 -49255613 -44588788
15995 -44588788 -38907828 -33769338 -29572848 -26223914 -23554552 -21438317 -19755618 -18403777
15987 -18403777 -17275296 -16284819 -15365510 -14490292 -13670972 -12920858 -12236252 -11618254 -11063305
15978 -11063305 -10561799 -10102472 -9684692 -9298271 -8944445 -8612125 -8300115 -8015641 -7755954
15969 -7755954 -7510219 -7278127 -7058832 -6847087 -6644180 -6450477 -6268805 -6104708 -5950215
15960 -5950215 -5797775 -5660325 -5527328 -5393122 -5260881 -5138516 -5025849 -4922558 -4823492 -4722318
15950 -4722318 -4630034 -4548046 -4467471 -4384584 -4299177 -4211546 -4125893 -4050486 -3982928 -3912700 -3845540
15939 -3845540 -3785953 -3722637 -3661707 -3601819 -3544235 -3488659 -3437788 -3387355 -3340405 -3293319 -3243471
15928 -3243471 -3194499 -3148998 -3108799 -3067358 -3026624 -2986750 -2944650 -2903218 -2866115 -2830444 -2799037
15917 -2799037 -2767228 -2736085 -2702946 -2671192 -2640992 -2610991 -2579271 -2551465 -2519655 -2486560 -2456830
15906 -2456830 -2423613 -2396129 -2367702 -2342895 -2324719 -2306201 -2281027 -2260256 -2234696 -2209869 -2188508
15895 -2188508 -2167899 -2145723 -2121077 -2098772 -2081132 -2063356 -2041408 -2026625 -2015180 -1994597 -1966295
15884 -1966295 -1936795 -1906581 -1872515 -1840518 -1814925 -1798502 -1787955 -1781088 -1774541 -1760501 -1743198 -1731556
15872 -1731556 -1719167 -1712639 -1710918 -1707415 -1703392 -1697310 -1687557 -1675002 -1659149 -1643179 -1628151 -1609598
15860 -1609598 -1590752 -1581221 -1575330 -1563385 -1548654 -1538354 -1523237 -1509524 -1498337 -1483506 -1470955 -1459498
15848 -1459498 -1448775 -1443904 -1446369 -1442737 -1435111 -1423728 -1414396 -1407788 -1397349 -1386720 -1374719 -1369951 -1363879
15835 -1363879 -1352213 -1339350 -1330956 -1322610 -1317622 -1310312 -1298565 -1286979 -1285516 -1278572 -1267064 -1260511 -1252325
15822 -1252325 -1245873 -1236005 -1231814 -1225378 -1214081 -1206157 -1192994 -1184520 -1179715 -1180629 -1171336 -1160644 -1154527
15809 -1154527 -1145207 -1135580 -1124320 -1110314 -1102116 -1095064 -1092935 -1085652 -1080563 -1080744 -1078836 -1074626 -1064086
15796 -1064086 -1059069 -1055851 -1044273 -1035695 -1029386 -1022368 -1020984 -1014380 -1006548 -1001602 -997274 -994658 -991018 -987067
15782 -987067 -975889 -972995 -972346 -966514 -962278 -956437 -949225 -944577 -941003 -937542 -933236 -930063 -923411 -916295
15768 -916295 -911599 -912074 -915800 -913389 -905849 -895834 -889938 -884665 -882881 -877680 -870060 -862665 -861514 -861289
15754 -861289 -859047 -855098 -852543 -849727 -846471 -842488 -837229 -833385 -832016 -827199 -820579 -814654 -811625 -807413
15740 -807413 -803894 -799519 -794818 -793304 -793839 -791948 -788438 -786854 -785339 -778932 -776234 -774530 -771491 -767847
15726 -767847 -762008 -762557 -757568 -751649 -748609 -744137 -739650 -738422 -740348 -738232 -729230 -720434 -719204 -719848 -716908
15711 -716908 -715825 -710845 -705041 -706352 -702607 -697768 -696230 -693794 -691226 -692924 -693563 -687546 -681532 -682801
15697 -682801 -676312 -665925 -655383 -651317 -654142 -657769 -660753 -659012 -656823 -656377 -656412 -647985 -639071 -633047
15683 -633047 -630613 -630724 -633742 -633666 -626793 -623011 -622406 -622170 -620212 -618505 -617649 -618453 -625461 -619729 -611076 -608852
15667 -608852 -602198 -602437 -604384 -603080 -597050 -588263 -588464 -586820 -581180 -577561 -578882 -576598 -570502 -573763 -572898
15652 -572898 -567978 -569815 -570576 -568667 -566216 -568606 -564759 -560615 -557687 -554875 -548716 -545372 -543505 -544101 -547698
15637 -547698 -549057 -546981 -541357 -533872 -527724 -525757 -524934 -524855 -521389 -520283 -521581 -517126 -512378 -507588 -507423
15622 -507423 -508537 -505063 -501676 -498884 -497421 -493139 -492579 -495681 -489920 -482758 -482955 -485990 -485434 -483004 -482283
15607 -482283 -479177 -478424 -478515 -475482 -474442 -478328 -482039 -480808 -474066 -472497 -475552 -472110 -468897 -466545 -465716
15592 -465716 -458106 -452870 -453920 -455659 -459125 -456609 -454665 -450679 -447226 -446428 -446061 -444534 -443530 -442074 -440463
15577 -440463 -436973 -434836 -435838 -432490 -430626 -430428 -434775 -437859 -435253 -429995 -423423 -424247 -421847 -420085 -418639
15562 -418639 -417958 -416811 -421920 -419314 -414673 -408934 -407416 -399866 -397131 -394050 -390980 -386296 -386801 -388760 -391482
15547 -391482 -393431 -389297 -391000 -390754 -390201 -383821 -378589 -384448 -382378 -379453 -376071 -376144 -375784 -372432 -368765
15532 -368765 -367616 -371359 -372135 -367871 -365551 -367231 -358942 -354656 -350973 -348725 -351706 -355820 -353598 -353045 -347636
15517 -347636 -346842 -349212 -342407 -340346 -338157 -338876 -340335 -346017 -350106 -347706 -341329 -341497 -339274 -331623 -332451
15502 -332451 -327570 -322294 -318729 -316201 -317751 -317539 -316044 -309825 -308125 -310486 -311031 -312199 -306507 -298512 -293725
15487 -293725 -292703 -289643 -284744 -282287 -278049 -274988 -268663 -269072 -263464 -263130 -255925 -248280 -239961 -230262 -222127
15472 -222127 -211150 -199524 -191211 -177069 -160191 -138382 -106320 -76263 -58185 -62491 -105750 -206100
15460 -206100 -337757 -456865 -541790 -577395 -576127 -548024 -520130 -493612 -470108 -454121 -445420
15449 -445420 -432011 -420079 -412498 -406274 -400105 -391599 -382737 -379250 -372060 -366445 -359207 -358484 -355512 -350774
15435 -350774 -352269 -349078 -344061 -338892 -337541 -333823 -332203 -328934 -325829 -322553 -323137 -323875 -323611 -325135 -322342
15420 -322342 -319326 -317186 -318500 -318711 -313801 -305939 -303274 -305104 -308213 -305137 -304771 -302723 -307132 -309280 -302035
15405 -302035 -300163 -300029 -296443 -294157 -290448 -290205 -292069 -297753 -293479 -287366 -286853 -287547 -282569 -280285 -280191 -277094
15389 -277094 -280772 -283739 -278528 -276720 -280661 -284340 -286518 -285157 -285158 -287600 -286443 -283493 -276740 -269938 -267640
15374 -267640 -267433 -265979 -264341 -265472 -263956 -265499 -260798 -258867 -260893 -264216 -259332 -262521 -256773 -257861
15360 -257861 -261903 -260819 -256902 -256854 -254939 -252894 -252685 -253351 -250645 -251870 -257834 -258147 -257274 -254778 -252399 -254951
15344 -254951 -253853 -246103 -244924 -244770 -244250 -242967 -242735 -241336 -239001 -237084 -236854 -240224 -241803 -241745 -236404 -233655
15328 -233655 -230493 -229000 -232650 -233615 -228733 -225084 -225863 -229834 -231940 -230943 -231028 -231913 -233478 -233737 -232217 -231856
15312 -231856 -230537 -228127 -227199 -226068 -226913 -226316 -224683 -221014 -218721 -219148 -220284 -221507 -224878 -225342 -224444 -225209
15296 -225209 -225460 -221837 -217064 -213684 -212814 -216096 -219220 -221162 -216867 -209938 -210365 -211649 -212348 -213450 -210711
15281 -210711 -207003 -206494 -208125 -211241 -213167 -213964 -211729 -207045 -203120 -200810 -203141 -204876 -206240 -204612 -202526
15266 -202526 -195702 -194889 -196870 -201569 -202574 -196778 -195755 -199499 -196869 -198916 -198949 -198834 -199462 -199289 -196583 -194384
15250 -194384 -193293 -191586 -195989 -198858 -197922 -193843 -191626 -192573 -190705 -184662 -186267 -191673 -197158 -200384 -195187
15235 -195187 -192503 -193197 -189413 -183775 -184079 -184859 -184749 -186577 -185511 -186551 -184601 -181348 -177173 -178632 -182069
15220 -182069 -180005 -176863 -177973 -176028 -175033 -171003 -174401 -174428 -172100 -177125 -176197 -169420 -169703 -170891 -168942
15205 -168942 -166006 -168495 -171268 -172529 -175611 -174024 -169293 -165389 -160130 -161343 -164459 -162700 -163160 -164109 -162508
15190 -162508 -164695 -164015 -159160 -158190 -158133 -160990 -165882 -165563 -163814 -165924 -166684 -169559 -168011 -161152 -159906 -160201
15174 -160201 -164783 -160310 -155487 -157561 -160161 -157606 -160806 -160223 -161090 -155563 -153330 -153720 -151423 -153652 -154954
15159 -154954 -152746 -150217 -149923 -149266 -153581 -156835 -155704 -150919 -147532 -144776 -150164 -154684 -153129 -151112 -155252
15144 -155252 -156739 -154111 -148808 -146470 -145466 -140982 -141535 -142037 -143164 -143270 -143690 -142755 -140006 -145677 -141928
15129 -141928 -137412 -138224 -139093 -145123 -147236 -144905 -140235 -139994 -139747 -137514 -134273 -132135 -131874 -133096 -135234
15114 -135234 -136544 -136132 -129666 -126946 -130600 -130527 -131561 -136675 -139512 -140144 -142050 -141311 -134683 -128814 -125107
15099 -125107 -126078 -126328 -130632 -134743 -131382 -128620 -126336 -127345 -126795 -126275 -126823 -127570 -123922 -123281 -124870 -123894
15083 -123894 -124354 -125568 -123151 -120662 -125501 -126935 -124276 -127973 -128962 -126734 -125877 -120821 -120306 -118959 -119766
15068 -119766 -123023 -126551 -125990 -128742 -128300 -125327 -125681 -121877 -119505 -123699 -123374 -126025 -129906 -126410 -126019
15053 -126019 -127140 -123880 -122797 -121687 -126125 -128442 -126670 -123601 -124116 -119422 -116028 -118454 -119062 -115809 -110691
15038 -110691 -112315 -111594 -108712 -109323 -109572 -108261 -109422 -106529 -101926 -104381 -105576 -101799 -104674 -102716 -105762
15023 -105762 -110461 -111996 -112713 -106412 -105958 -104669 -104190 -109859 -110413 -109544 -110343 -105384 -105444 -100874 -103856 -106001
15007 -106001 -105236 -103714 -103801 -107623 -100751 -96194 -97479 -100202 -104074 -103278 -105492 -100016 -93571 -94303 -93854 -91960
14991 -91960 -89407 -95692 -96003 -93698 -92035 -91572 -87442 -88840 -93425 -92754 -92162 -96242 -97738 -100782 -97307
14976 -97307 -95908 -93951 -87630 -85673 -92334 -96959 -94291 -90160 -89378 -93126 -93392 -91097 -91664 -93600 -92637
14961 -92637 -92551 -90290 -89326 -89724 -88156 -86248 -84174 -84436 -86718 -91850 -94060 -89169 -88014 -89099 -89682 -88064
14945 -88064 -86307 -85267 -84820 -82349 -82371 -78223 -77685 -79564 -74125 -75743 -79540 -78645 -77821 -82310 -82146 -80171
14929 -80171 -78575 -78462 -82871 -85757 -84250 -81925 -75223 -73174 -77453 -76263 -72542 -74731 -79235 -78337 -77937
14914 -77937 -77075 -76392 -78994 -80715 -77652 -76737 -77437 -78161 -78844 -76005 -73740 -71288 -76989 -77685 -74859 -70754
14898 -70754 -69978 -75038 -75027 -74894 -77887 -74766 -68853 -66438 -70226 -71412 -72343 -74386 -70403 -68534 -76143 -79853
14882 -79853 -75751 -71571 -73611 -75592 -71166 -66227 -64338 -60853 -62530 -65716 -70178 -74245 -77323 -68826
14868 -68826 -67266 -71169 -66681 -61331 -61763 -64327 -62391 -60465 -57876 -55647 -60310 -62627 -61830 -63582 -64046
14853 -64046 -62691 -67858 -67569 -60927 -53981 -55958 -59594 -67426 -70431 -69763 -68843 -73933 -78333 -76351 -65206
14838 -65206 -58752 -57636 -59861 -60791 -57414 -54650 -55938 -62113 -64376 -64828 -62027 -57936 -53311 -47285 -48251
14823 -48251 -54024 -56882 -54793 -55120 -57377 -56221 -51320 -52682 -52037 -50029 -55372 -58723 -58009 -54165 -53042
14808 -53042 -53758 -51593 -50905 -48353 -48825 -53682 -51013 -53963 -54643 -53185 -52883 -54173 -52332 -51346 -51110 -49889
14792 -49889 -45595 -47123 -50589 -52660 -51051 -45240 -41027 -44045 -45748 -42301 -44479 -49815 -51478 -49902
14778 -49902 -44655 -42536 -43248 -45597 -45771 -43368 -39634 -41131 -43332 -44729 -43855 -43381 -42466 -34966 -32207 -32756
14762 -32756 -40589 -45972 -42490 -39481 -40938 -45088 -47521 -43641 -41884 -42477 -41192 -36281 -37007 -39509 -39035
14747 -39035 -39884 -40171 -41949 -42735 -46269 -50957 -51010 -45866 -45424 -44889 -43345 -40060 -41698 -41078 -36078 -37871
14731 -37871 -37743 -32816 -30579 -36108 -39912 -39553 -38473 -42313 -45214 -43551 -39030 -36724 -35077 -34039 -30604
14716 -30604 -36094 -37756 -39713 -42223 -39640 -40628 -41674 -39703 -36972 -41502 -38934 -32535 -29080 -27979 -27309
14701 -27309 -28863 -29863 -25886 -26863 -26557 -24854 -23146 -25236 -26753 -27941 -30423 -33991 -32619 -29694 -28814
14686 -28814 -32219 -32832 -29338 -28191 -30827 -29872 -28694 -23579 -23611 -25679 -30622 -30678 -27966 -23610 -22752 -20865
14670 -20865 -19789 -20039 -21420 -23787 -27677 -26002 -22361 -20149 -22571 -24199 -18727 -19076 -26424 -24145 -23204
14655 -23204 -23314 -23929 -23274 -21361 -19234 -20712 -22023 -22383 -22841 -21482 -18145 -24351 -26007 -23117 -20909 -18026
14639 -18026 -17509 -19949 -22237 -19871 -19670 -24004 -26299 -20719 -17547 -18366 -21588 -21761 -19221 -19870 -23396 -21456
14623 -21456 -17562 -14472 -11516 -11772 -12891 -14933 -13505 -14940 -16390 -21524 -21350 -19204 -15977 -16644 -15371
14608 -15371 -13986 -18470 -23559 -20889 -16024 -14221 -11416 -5712 -5641 -8287 -13001 -19989 -17393 -12697 -14603
14593 -14603 -13312 -8089 -6559 -9854 -10220 -6439 -7510 -12926 -15627 -17162 -15176 -9627 -8854 -8937 -8654 -9609
14577 -9609 -8137 -7928 -8428 -13782 -16452 -18230 -17464 -12096 -9404 -11187 -5925 -2428 -4410 -5310 -47 1872
14561 1872 514 1803 -150 739 -1061 -5619 -6967 -5670 -5761 -8710 -11448 -8355 -6515 -2357 -3616
14546 -3616 -6835 -7200 -4698 1493 3787 5078 5073 1712 2732 2045 -2853 -1612 2925 2905 1365 -3516
14530 -3516 -8264 -7148 -4259 -609 -846 -961 -3907 -4046 -548 -2140 -2880 -3234 -2736 -539 -1436 -1403 316
14513 316 1094 2838 8657 9661 10736 2756 -1974 -180 -1146 -1370 1235 1603 5494 8491 4165 3478
14497 3478 4070 -720 -1375 4194 11279 6187 6513 8874 12403 9677 7533 9742 14109 12745 5575
14482 5575 2446 10467 10505 2892 3821 7512 7974 6413 8859 11941 13321 10026 9929 14872 18390 18033
14466 18033 16023 11540 10042 10950 7206 10853 13088 17292 15643 17101 14545 11426 12017 12145 14826
14451 14826 10774 8362 10418 6548 10472 11502 13329 15185 15297 13379 7720 2615 157 2337 11819
14436 11819 15254 12074 9444 11923 8675 4939 3888 6108 8870 10224 13921 11809 10399 14878
14422 14878 17040 16611 14540 16639 18734 15556 15827 16902 22633 20849 19329 14379 9540 9138 7839
14407 7839 12788 15463 16394 17010 15928 18184 22530 23648 22039 17197 15672 18686 19139 22028 23320
14392 23320 19325 18778 21799 21822 21228 22264 22682 21835 21384 19413 18942 20113 23231 24595 25424 27734 26658
14375 26658 24106 27177 29875 31468 29084 29530 29576 25535 19156 19011 17996 16322 16824 14389 11150 15475
14359 15475 18985 21689 21767 22940 23754 25180 26137 22049 21269 28095 26756 22848 22977 23928 24452 23246
14343 23246 17127 19300 17625 18059 20840 26107 30249 29081 29669 35034 37511 36658 37665 39925 35647
14328 35647 30782 30106 29860 28342 28904 27625 27058 31736 32825 34669 39203 38701 32361 32186 31502 32318
14312 32318 32633 35129 36128 36392 31809 33255 33730 35629 38757 38058 38247 36570 37335 38348 34967 37801
14296 37801 39038 38144 39771 38734 37678 29975 31724 35930 33917 36329 37488 36242 39818 40042 42256
14281 42256 44819 43981 42905 42211 43247 47847 46323 39908 34206 31863 25966 19223 20885 20210 21264
14266 21264 27247 29396 28324 30292 33006 35784 37795 41323 41758 37548 39912 36276 33180 34144 36359
14251 36359 35967 36908 38896 40778 39581 37281 41914 43657 43666 45455 40936 38756 37412 38565 40435 35254
14235 35254 34232 39186 46910 51122 45676 44824 45258 41728 38482 44017 45862 45964 44700 44163 46525
14220 46525 49052 46351 47216 46840 45875 43004 38765 39666 39458 39145 38240 36235 38941 39454 40367 41168 38421
14203 38421 34471 37079 41642 39576 42415 43601 48731 49249 48775 45627 44846 45248 44516 46906 45088 46921
14187 46921 50819 51179 54027 55675 54565 55153 58644 60179 58031 55817 55942 54904 56194 54209 48488
14172 48488 47126 46011 48268 50497 48184 45761 42867 45423 48831 53056 58662 56997 51584 48511
14158 48511 47997 45081 47900 52112 55263 50602 45840 48735 48987 48730 55224 55907 53566 58153 59784
14143 59784 56637 53983 51056 50195 52183 57801 60768 60351 63351 66489 65070 61088 57975 59528 58563
14128 58563 54959 56622 61644 60133 57128 54519 57061 55486 56043 55517 51280 51539 53315 55311 58467
14113 58467 56035 57105 58395 57051 60951 65449 63047 59359 56772 59481 59082 54877 58865 59017 61937
14098 61937 60006 52225 52176 55148 54597 58986 64833 66678 67929 66374 65247 65907 68538 68265 68150 64377
14082 64377 65704 67055 71204 73807 68600 64980 64282 61055 60105 57705 58271 61876 63841 66864 66550
14067 66550 63978 62062 61452 62116 59624 57554 60140 62113 62224 62358 65877 70273 70710 66621 65428 62227
14051 62227 60471 61700 62215 62615 63026 64772 66493 67466 69078 71879 71300 69209 68048 68054 70408 68641
14035 68641 70097 70931 69996 64245 66632 67999 63088 62079 62447 66487 63757 63883 64475 67837 68736 68095
14019 68095 68191 65140 61911 57974 63001 67431 69991 72641 71687 68577 70693 71983 70376 69792 71584
14004 71584 71946 70263 71542 72372 70466 73338 73532 72486 74122 77776 77779 72722 69530 74918 74069 73714
13988 73714 70367 66229 68300 71935 76363 78705 76500 75095 70463 71406 72326 72775 72378 71341 72211 76362
13972 76362 76922 76172 76646 76096 79048 78457 78867 79527 75152 74605 73083 71711 68642 67107 68402 72159
13956 72159 72378 69830 68099 73739 75867 77204 77653 77844 77853 78603 78282 77481 73625 73812 78832 85390 85741
13939 85741 87125 84791 80395 82074 83315 76862 76059 74648 76947 82705 86778 86611 82477 82035 81470
13924 81470 80173 79959 78345 79474 81989 79438 79486 79787 81687 85559 84042 80629 79681 80327 82727 81015
13908 81015 81413 77852 75632 74423 74701 78024 81868 83170 81518 81371 87063 88921 88200 82534 85375
13893 85375 86965 87111 87285 86676 85577 82138 82266 80364 81075 82860 85938 88647 89168 90124 92211 93169
13877 93169 91554 88650 85573 87765 90098 93787 92885 92798 92755 92692 87393 88057 95155 94407 89461 91362 96433
13860 96433 97929 98086 93593 92199 91273 90949 91822 95272 97116 98134 98087 92865 86960 83149 85271 89904
13844 89904 91654 93516 95672 97643 97172 96114 92913 93041 92768 91958 92134 95067 94192 94894 93081 89557
13828 89557 85264 91358 93734 93020 91309 91986 94552 91037 88732 88636 87777 93135 97032 94113 90252 88054
13812 88054 88259 89466 92872 92390 91518 94026 92820 97443 99351 99513 99312 97132 94813 97701 102435 104400
13796 104400 95451 89757 93609 97324 95081 97113 102582 105659 99746 95671 92891 90627 91283 90964 95647
13781 95647 99147 101257 100404 100985 104053 104907 107434 106343 105114 102257 101006 97978 103512 107903 102583
13766 102583 96438 96151 98608 95582 98571 102531 101017 100942 102020 102232 102222 101996 95026 95317 97770 100471
13750 100471 100756 99898 98339 100546 104329 109772 108862 104456 100367 102856 107384 108555 109488 112882 116596
13735 116596 111181 103967 95285 97437 104539 109075 110601 112281 112413 108936 104063 104994 109655 111320 113509
13720 113509 111709 108909 110568 111643 107228 109212 106165 102742 103618 102688 103618 106814 106164 103371 104140
13705 104140 109402 107910 105088 105713 108158 111699 111829 108571 106465 102026 102871 109674 110631 111074 108658
13690 108658 109144 105618 110249 114367 111206 109404 111556 117180 116729 118773 113097 113899 115958 115536 115566 114396
13674 114396 109422 108352 108219 109182 105562 105832 109467 110529 108512 110129 108824 104199 105700 108955 111060
13659 111060 111122 109929 115186 117401 117799 119568 117865 116870 118407 115155 111548 107594 113438 122470 121311
13644 121311 118087 115606 116549 114666 116047 120293 121669 119537 120406 119694 112287 116718 122885 119589 114307
13629 114307 111068 107526 108018 109598 115461 117439 116270 116956 122137 127031 123340 119089 120474 117836 116331
13614 116331 116051 117748 120897 122043 120330 121967 128561 130615 126052 122477 120031 119574 123998 123746 123971
13599 123971 124182 124147 126938 126488 122252 122951 127464 127882 123190 120304 123316 124099 127459 127000 124784 130325
13583 130325 135545 131614 124625 125532 126991 128400 127728 126523 127225 127838 127279 126955 126517 129531 130730 127546
13567 127546 122251 119674 126374 128314 126406 127494 125023 126157 127981 130927 133581 131976 130832 129542
13553 129542 125387 127217 129893 130138 133856 134916 131498 130330 132470 133626 133222 130148 125631 128610 136324
13538 136324 137336 135663 131130 131746 129248 132453 134615 131252 127243 126841 132449 136894 137223 136072 133920
13523 133920 133739 131850 131990 128708 130444 134194 136461 137489 139348 133133 128456 126671 128063 129076 129421
13508 129421 130974 135436 139592 137056 138063 137692 131737 129117 131118 136637 141346 139488 131568 127856
13494 127856 127254 128858 127786 132356 137128 134881 132112 128781 131678 136706 135930 132152 130987 130276 131300
13479 131300 135567 141752 143943 147614 145810 146887 141002 136922 138383 144098 142546 147952 148420 144453
13465 144453 145284 146915 145671 139025 139518 141835 141050 140183 140632 142534 140342 142419 142286 136912 139515 142920
13449 142920 147402 147781 144621 143634 145001 146700 144591 144517 147709 149175 146209 143815 146336 151581 153318
13434 153318 152398 150692 149278 145662 142843 139136 136714 136101 135003 140174 148783 151131 152436 151570 150039
13419 150039 149898 150071 151411 152005 155279 154334 154373 154702 152694 149101 144261 139152 142715 149557 152347 151896
13403 151896 147146 143493 141431 145443 148012 146730 145744 147162 149091 155345 155096 156983 159698 158695 156037
13388 156037 154079 157589 155181 150524 147562 149630 152126 147459 150299 149368 151077 147780 150823 153040
13374 153040 155081 159454 157864 150468 149114 149521 149011 147187 148354 152374 154108 151957 154347 159055 156772
13359 156772 159404 158286 153870 154111 156216 153125 151446 151099 147463 149055 147175 147584 155774 166189 162078
13344 162078 159167 159963 159992 159432 159871 158572 154365 153612 156955 160916 159422 161861 160293 157721 154234 152763
13328 152763 153010 153679 157894 163022 168950 165585 164116 163190 162638 161908 159013 163955 164997 165165 163998 161793
13312 161793 161252 163525 164735 167288 169039 167196 165143 163532 168633 172226 172926 174546 174178 171748 172440
13297 172440 170493 169757 170893 166508 164481 165719 168149 174787 176940 178889 176758 175858 172301 168919 172306
13282 172306 176774 171329 166605 163198 164039 169321 172036 176134 171394 166684 166565 173203 179386 177936 175331
13267 175331 170629 168391 170051 175827 177318 177157 175124 171276 169876 171473 172594 176885 178942 177140
13253 177140 176695 175103 172490 174766 180114 180201 180020 175137 167466 169169 174528 178358 178407 179568 178938 170959
13237 170959 170945 172469 173420 173515 172047 178272 179845 178914 175974 179676 183138 181602 179997 177241 177994 177922
13221 177922 177824 173975 176004 181949 183851 181736 182664 181849 181412 180717 178281 175630 176303 178130 177361 175052
13205 175052 179882 181816 177061 176143 180722 181453 184052 182452 178856 183434 186376 186006 184141 183758 185837
13190 185837 189690 189431 186609 187682 190391 186264 186553 184724 187090 186617 190740 195061 197454 194595 188527
13175 188527 188305 187580 186873 189976 190721 191331 192091 188340 185506 186755 187578 188764 185263 184001 184640 187213
13159 187213 189566 190127 189379 192467 189375 189865 193208 194387 194017 194390 196765 200163 199849 199240 194938 191439
13143 191439 193643 194864 197324 194887 194512 195855 196465 193972 191877 195078 194626 196923 194942 196488 200196
13128 200196 199517 198614 198410 201844 201389 198801 197088 202879 205926 204305 205269 202947 199704 204820 207671
13113 207671 203723 202158 202434 204843 206398 206348 201830 201289 200010 201783 204943 205191 205550 206795 205984 202252
13097 202252 204532 208809 213167 213945 207622 200897 202909 202814 207817 205431 207642 207246 207683 205145 204361 206410
13081 206410 208415 207870 205432 207726 207221 204109 209479 211640 215638 217153 211766 209313 207143 216072 220691
13066 220691 216572 217221 213243 214513 219743 219760 222257 221316 223353 218241 212692 216831 219877 214964 217251
13051 217251 220858 220112 225777 228122 219735 218274 217561 214836 218655 220017 222375 225416 227170 228898 228578
13036 228578 223340 221197 222965 222452 219734 218808 218707 218419 221067 224348 228358 222475 220645 224569 220412
13021 220412 222018 231718 233617 236824 236811 236272 240725 242401 239998 233811 228868 223508 227153 233796 237492
13006 237492 238127 237974 241043 246542 242702 241468 241549 238498 236133 239499 241806 245750 246220 243938 243071 244337
12990 244337 244293 244588 244533 244795 244530 245985 246914 244996 246580 249110 250334 251588 254810 252903 252402 254684
12974 254684 252455 248804 248308 246143 244341 253250 257631 256442 255189 253157 256465 258215 254532 253370
12960 253370 257468 264605 263594 257186 255252 256134 260081 267825 274421 271526 266502 263622 265877 269323
12946 269323 272365 273252 276480 272689 272279 272501 272981 269307 274018 278504 276985 277801 278144 277175 276220 275067
12930 275067 273111 276368 280206 280098 278461 281023 278175 281149 280843 280874 283496 284727 286083 288159 288139 289654
12914 289654 295742 298810 297114 296231 297415 300332 303990 307980 306502 305334 306158 298604 290609 283476 280823
12899 280823 279730 283263 283100 284647 289927 297262 300075 303934 306569 304608 304967 312050 312668 311751 314347
12884 314347 311451 317434 326038 325564 325301 329633 338359 334602 328678 327302 324065 321053 323460 329620 331221
12869 331221 329717 332555 338694 341144 341495 344965 347379 350256 351488 349888 349783 353790 354592 356447 355440
12854 355440 357746 359667 363224 367894 367063 368740 370863 373723 374622 373152 376945 382767 381303 386634 392934
12839 392934 399797 405602 409247 409776 412783 422048 425445 422991 422799 430683 437589 437946 444160 455021 464449
12824 464449 472667 473042 469830 466113 463216 467053 477796 485115 487632 486907 495337 508705 524981 541798
12810 541798 558942 576096 592772 611772 628713 634946 632187 638287 658766 689214 719132 733108
12798 733108 692036 545036 414209 383031 384026 371946 358610 357260 371141 394226 418659 444618
12786 444618 475220 509181 543139 556157 538944 504054 480042 488879 508883 516542 516194 526135
12774 526135 555985 586586 598077 566668 512028 483625 488407 524376 577505 632126 678192 708833
12762 708833 727261 743726 775129 821062 861142 881172 830240 572128 124130 -156313 -188582
12751 -188582 -141608 -88182 -54999 -38690 -32571 -8469 48106 120686 196998 269398 317756 318041
12739 318041 284559 256085 270311 313498 347314 352201 326803 284013 231156 163260 68119 -54007
12727 -54007 -175221 -263001 -315562 -346139 -356401 -354227 -338202 -307432 -276011 -254027 -238172 -219826
12715 -219826 -203364 -195076 -224603 -354994 -491159 -520136 -484379 -431761 -384565 -351842 -339082
12704 -339082 -335076 -322033 -302685 -281196 -261762 -244147 -223161 -202970 -182505 -167715 -158610 -154073
12692 -154073 -151921 -141396 -130882 -122168 -116406 -118186 -119357 -115573 -103385 -94678 -84929 -74872 -67211
12679 -67211 -63564 -61352 -59943 -56981 -49852 -45031 -43671 -38582 -32020 -28427 -26492 -18122 -10461 -4314
12665 -4314 61 3604 8074 11705 20969 22895 25518 29119 31331 28905 27897 29374 29783 34649 32331
12650 32331 34444 41471 47246 48280 52243 53320 54828 58939 59838 58734 57356 62914 63782 61324 61039
12635 61039 64483 66931 71919 74704 72313 75656 78344 79522 79007 82076 86191 82821 87050 89651 86286
12620 86286 86190 88763 91839 100288 100848 92578 86920 87404 90854 90084 94100 95813 101799 100458 98262 98780
12604 98780 103353 105088 106888 110282 108641 112658 109981 107907 106727 108453 105984 107871 111167 110358 107673
12589 107673 110980 117596 119673 118033 116136 119364 121988 124968 122487 120251 121731 121023 125101 129328
12575 129328 132435 135812 134925 132935 131034 129949 131718 135667 138361 138609 141771 146512 149591 152915 149629
12560 149629 145097 148206 150996 153521 151878 152803 152368 149516 152660 155632 153216 155057 153110 154860 153892
12545 153892 152655 158333 155440 152703 152000 150623 151339 152523 156457 156658 155962 159251 158842 156982 157047 158315
12529 158315 163452 165546 164432 161571 162174 157806 156365 162583 167343 168278 167924 164356 166502 170124 167407
12514 167407 162159 164040 168277 175726 176951 176749 172237 173305 173129 172170 172537 171656 170052 172421 175966
12499 175966 176680 177045 178376 179421 176556 173660 174523 175354 178371 180400 181954 182390 181946 182757 187183 189093
12483 189093 192733 192959 185677 182602 179828 179475 183858 181362 180906 181953 184448 185026 191962 193317 191949
12468 191949 190684 190507 189037 182433 186704 188790 185625 183041 185995 187233 184369 186894 192188 198024
12454 198024 203486 207848 207547 203996 201583 195715 195239 198175 199188 196978 196625 196878 199079 202328 201916
12439 201916 196857 194876 198347 200231 202467 208429 211848 210389 213772 212771 209782 205747 200493 200149
12425 200149 203986 206654 207646 207702 206015 204598 208954 208698 202781 202652 207420 210151 212489 213082 211977 211180
12409 211180 213311 212154 211726 206430 201732 204183 209891 212899 216000 222672 220336 219987 218822 221941 222202
12394 222202 219971 218095 212406 211446 213288 211873 211383 212928 213052 210054 212175 214268 212505 216567 218863
12379 218863 220161 217346 218553 216317 212833 212137 215327 217116 218888 224255 226939 224514 226540 227105 223142
12364 223142 220433 215087 216690 220910 226179 229942 231570 227083 222887 228773 234035 233248 230185 227870
12350 227870 228539 230474 232245 229794 228713 228628 229908 229007 225532 224090 226674 231097 231973 223627 219768
12335 219768 223195 231580 233110 233657 235751 235589 234420 232566 238006 238362 238155 237609 236473 238833 239052 234616
12319 234616 234363 241159 241338 238652 238908 238623 239815 237891 237493 239138 239102 235753 232386 236295 238292 242984
12303 242984 244229 242719 241262 237668 234223 235482 239261 242051 244770 241977 240725 244862 248146 249832
12289 249832 253534 252722 250325 253719 253223 246860 244033 239855 236707 236439 236332 240693 244881 245723 248587
12274 248587 246540 242945 241527 243201 246028 248177 248142 250655 252767 254162 251205 248084 250310 253613 252141
12259 252141 249240 244767 243657 249348 251831 251087 254744 258771 253220 251546 252886 249909 252031 256067
12245 256067 257563 263655 264900 262811 262927 260241 255654 252530 254757 259642 258032 253958 253605 253371 253876
12230 253876 251658 252927 253371 256143 256936 259037 261604 260388 257564 254905 254920 259865 266808 268996 263119
12215 263119 262333 262892 260733 260979 264502 264648 265080 265523 266339 271230 275122 275711 267737 266876 266038 261064 262303
12198 262303 262686 260436 260753 264071 265663 271622 275895 277936 273475 270736 269569 266784 267698 274513 274373
12183 274373 272757 272895 275220 274131 273310 275347 274240 266982 266870 271482 271989 270777 272598 272564 269501 267432
12167 267432 266099 266345 268206 273035 275685 276738 274141 272466 276728 277000 273392 276652 281114 282394 279733
12152 279733 279078 277254 277194 280364 277347 275419 277536 277701 277957 275844 277132 276036 274628 279045 276647
12137 276647 276725 281452 285296 284078 285117 285707 290284 291128 287359 283332 282257 282940 282673 286252 291528 292034
12121 292034 287565 287697 289700 289931 289779 290352 291435 291275 291861 294709 293752 291629 293013 292140 292709 290145
12105 290145 293890 299287 295139 290691 293266 296239 293986 294776 298293 296146 293870 296501 295811 298370 298502
12090 298502 296294 294455 294846 296224 299989 303967 303680 301225 299417 299745 299910 301408 301706 304975 306917
12075 306917 308040 308041 308766 307979 310861 307074 309600 311793 308820 303765 306798 310442 308733 303951 299819
12060 299819 299905 301210 304058 306171 306457 306356 307969 309383 306058 304782 308592 308206 304569 307262 311487
12045 311487 314149 315642 314151 307129 306287 310834 311477 307562 302388 306469 312644 312276 307949 305303 310208
12030 310208 315488 315973 316647 315334 312757 308863 306828 312979 317222 316831 315039 314916 317320 315130 318025
12015 318025 316956 317477 317239 315981 320289 321295 318532 320403 319491 320656 321062 323128 323528 317546 313118
12000 313118 314489 317001 320725 321159 317335 317540 317381 318202 319301 323506 331845 332084 327005 325229 328209
11985 328209 327304 330402 328980 325115 326757 328141 325336 325919 325741 329345 334892 331266 326912 327777 331415
11970 331415 333434 334434 337320 334343 333327 341026 342313 338284 333429 332596 334331 328884 328998 329469 330173
11955 330173 334660 337921 333533 333792 337557 336639 332701 331511 332114 336001 341114 344757 347710 347869 348441
11940 348441 348355 350652 350460 353238 353600 353964 361465 368342 372493 370371 363251 356590 351132 337199 323977
11925 323977 320678 321118 316982 311611 310971 311393 315806 321451 326219 322102 322121 324891 326551 327243 332441 334493
11909 334493 331341 334611 339320 339577 336732 334391 334597 333488 332016 336886 336311 338641 338778 343328 343529
11894 343529 343035 339431 341599 344478 344547 345107 348434 343817 341790 341939 344892 348642 349850 347546 346413
11879 346413 347272 351087 355465 359340 362219 358615 349877 346842 349255 350378 351311 351285 352171 351866 352004 353582
11863 353582 351052 354673 357076 354425 355400 354763 353510 353879 360359 362861 363347 363778 362496 365988 367369
11848 367369 364566 362142 362797 366124 370458 368009 367363 368010 366249 367119 369369 373132 373782 373155 367625 365866
11832 365866 364862 366781 366249 364274 369336 372154 368337 365230 362728 365111 362093 360950 367497 372499
11818 372499 371664 366117 365139 366631 373586 373917 371307 372016 371694 372312 377651 374892 371204 370969 370695 374261
11802 374261 375425 377347 377184 381760 379646 382557 389823 392334 390384 385351 376680 372515 372786 376186 376738
11787 376738 375014 378907 382045 383312 386458 390627 390968 387232 384472 383624 381416 380280 377401 377102 375340
11772 375340 374413 376474 378237 382900 390340 389490 385213 380368 382931 385441 386115 384279 384114 387147 389659
11757 389659 389206 393631 396166 395018 396481 397337 395202 394067 395944 396452 392499 391114 391781 396214 399979
11742 399979 401551 398326 393806 392844 394379 395983 392063 391874 397221 402519 402692 403919 408642 406311 403688
11727 403688 410152 408358 404089 404261 405973 404662 399474 400823 401389 400759 404497 406295 408002 407530 405233
11712 405233 402331 404359 406039 408735 407709 406686 404353 403520 403483 408670 408857 406638 405859 409363 411548
11697 411548 412293 412501 410068 408601 412366 423383 424671 419076 417850 422170 422704 420991 418723 416547 417762
11682 417762 418949 418443 419919 416697 412977 412598 418168 423101 429297 431258 428391 429442 431288 429341 427633
11667 427633 424771 422627 421991 425655 430175 433388 434312 429424 427370 432055 431774 428025 431717 431781 428488
11652 428488 432045 434192 430963 426312 427362 428362 428615 428677 429050 432895 437187 437419 439253 441389 438324
11637 438324 438103 439921 445677 450168 452063 446914 442172 438016 440439 440477 438551 438082 445910 447785 443289
11622 443289 438461 438986 436624 436386 436904 436735 441240 443007 440049 442508 443578 443875 442520 443105 445042 441865
11606 441865 439457 445338 444777 443263 443425 448415 448576 447712 446861 449172 454843 459506 462700 462994 460415 462863
11590 462863 460746 459647 458350 456242 456856 455486 455629 454426 457504 462415 460255 458288 458033 459011 458200
11575 458200 462055 460339 465863 465346 463600 461030 457099 457506 459916 465341 473354 474570 472094 469501 463658
11560 463658 466183 470104 469920 465996 467141 471178 470431 472281 471476 475299 478025 475356 473173 473056 470162
11545 470162 472783 475893 476026 476557 477129 477938 478629 474572 469900 468125 467506 468031 472292 478424 480078 481485
11529 481485 480300 478208 480699 484141 484696 487257 482882 481988 485962 483820 484353 488047 491382 493093 493493
11514 493493 491489 488870 488684 494423 495049 495095 496831 494768 492284 488754 488134 487596 485315 487329 486399 490709
11498 490709 493618 493951 496347 495307 493705 496067 493012 496598 499756 504102 505883 502346 499742 493510
11484 493510 491611 491314 493359 499405 504255 506538 506887 503821 505409 508339 508687 507109 509454 505509 505337
11469 505337 512408 513812 510373 509606 511570 512497 515360 519645 517282 513952 511817 510618 512541 509564 510935
11454 510935 518372 526189 530100 523610 518952 519934 520424 516522 519116 520145 523518 529679 529300 531773 529288
11439 529288 524809 525658 524222 528480 526996 525012 523751 521571 522525 528297 530747 531673 532329 530301 529866
11424 529866 530236 533401 534958 535116 536112 535153 537258 538015 541674 542144 540502 540118 538619 538632 539165 545708 541972
11407 541972 535970 532278 537354 544892 546752 549382 549101 547198 549057 553723 556476 553183 549526 551487
11393 551487 562002 564665 562108 563053 566493 564002 556989 551679 557945 565467 566545 562873 559033 563762
11379 563762 568923 561247 558565 562270 568852 568523 564026 563933 563648 568954 566460 562285 562429 566907 571496
11364 571496 577925 583170 579617 574529 575843 575975 577398 575078 574224 574051 573122 577294 580931 578528 578139
11349 578139 585362 588334 589330 587257 587522 588260 589240 590377 594916 594040 593330 591755 594654 595149 593393 592919
11333 592919 591945 597946 600018 598597 595341 594076 588032 585705 590292 596298 601504 602282 605822 607476 609527
11318 609527 613108 612305 606506 607155 611187 614677 616818 616384 624491 627978 624926 622249 623558 620421 622291
11303 622291 627956 632937 631051 629854 633345 632670 635430 637124 637134 643639 642910 636937 634379 638403 643774
11288 643774 642482 640687 641928 648736 652597 652324 649205 650551 654660 652894 651684 653193 660903 666157
11274 666157 668696 665440 666586 670654 671942 671103 676621 679729 680641 679858 680535 683986 689127 693558 696559
11259 696559 700927 704917 708021 712597 715018 713020 716138 723228 726626 732877 743189 751213 760354 765542
11245 765542 768327 774644 784933 789182 790152 799355 808954 820914 835092 849184 860429 875286 893254
11232 893254 916145 944245 980269 1019616 1065155 1102748 1127797 1135314 1117102 1072995 987236 871888
11220 871888 736263 568955 427591 315540 207372 148798 133011 139521 165497 202196 241791
11209 241791 279414 316476 347997 374974 392656 406583 418162 434017 446863 455417 466069 474816
11197 474816 485980 495020 497499 502653 510908 519342 528316 532084 533103 536800 538012 541657 549978 558321
11183 558321 563404 566841 573635 575258 572553 572102 575624 580107 590213 591369 590216 593724 597480 601055
11169 601055 604660 607027 608057 608789 606771 606282 610142 613508 614448 611714 610849 613026 619132 623686 626781
11154 626781 627803 626111 628669 630663 630166 631509 633110 636402 640045 640508 643131 646438 647185 645134 646252
11139 646252 646925 644831 644872 644235 645291 648067 652605 657856 661252 663383 661501 661859 664657 668222 673256
11124 673256 674148 672039 671961 675055 672245 669845 668210 672768 675017 674787 675069 674693 678685 679529 679798 683234
11108 683234 682677 682060 683868 684887 687502 690145 694512 693442 691626 692079 695984 704421 703171 702442 702221
11093 702221 702165 700035 700946 703238 706468 707980 712014 717582 712106 706115 711154 716876 716070 714842 715220
11078 715220 718772 725771 729512 733255 731758 732411 731947 730037 728950 727363 726306 726980 730115 731806 737208
11063 737208 744073 742079 742150 742564 741525 742433 742901 748978 751555 754089 754695 752629 753124 755061 755882 756666
11047 756666 758988 756691 757381 761401 763282 762758 762681 763040 764479 766496 766571 766505 767322 768269 769010 769456 771902
11030 771902 772055 769645 773319 774429 772967 773140 770806 768171 772927 779083 781419 787823 787641 788858 787489
11015 787489 789899 795318 795669 792746 795360 799102 802194 801019 796967 795877 793145 796568 804402 810132
11001 810132 812643 810599 811090 807213 805282 811981 811198 810304 809442 811472 815257 819056 818424 821968 823073
10986 823073 822218 824436 828486 831150 831085 828042 823811 824716 826902 828339 825479 826050 827311 829447 832472
10971 832472 837096 839183 845084 841403 841727 841978 841589 843745 843403 843622 847611 851261 847962 848922 850001 850139
10955 850139 853930 855716 861218 861955 861260 857076 859330 860906 862395 864738 866915 870374 874667 878543 875787
10940 875787 876380 877080 875844 879035 880539 879996 877563 878868 878552 882106 888360 891966 891567 894499 901684
10925 901684 901720 898467 896645 896651 902015 905208 906889 905135 904944 905824 908517 907920 910143 915844 918736 923911
10909 923911 923422 917997 914188 919887 921594 924936 927602 927953 926244 925474 924075 923296 928314 932503 934810
10894 934810 938531 941779 943403 943126 942829 938171 938247 941415 944918 947462 949812 953525 953209 952833 957013 964805
10878 964805 965580 963437 962330 967304 965859 967933 968301 967625 972266 972856 971940 975218 978226 981119 982705
10863 982705 981015 983018 988184 991981 990893 985201 987606 993313 998540 1000494 1000199 1005965 1010815 1009155
10849 1009155 1009585 1008752 1008381 1008805 1008165 1009890 1011153 1011194 1012125 1015128 1015317 1014861 1019945 1027449 1028402 1028097 1030097
10832 1030097 1034708 1038814 1040211 1040255 1042980 1049816 1048113 1046690 1046229 1047443 1047963 1051998 1051181 1053538 1057050
10817 1057050 1059600 1059877 1062593 1067067 1074855 1075695 1075613 1073291 1072157 1072485 1074659 1074860 1074983 1075096 1079816 1083883
10801 1083883 1083633 1083457 1086029 1089895 1094637 1097245 1100231 1103232 1100917 1097538 1100025 1101441 1104296 1112137
10787 1112137 1120191 1124352 1123623 1118673 1116791 1117652 1121028 1126250 1132451 1138368 1143567 1140703 1139569 1141013
10773 1141013 1139423 1138740 1140902 1144750 1143766 1145996 1151558 1155642 1162651 1167093 1163893 1165934 1170767 1168552
10759 1168552 1166557 1166458 1169278 1170298 1165557 1169996 1176167 1179256 1180663 1179875 1180898 1186091 1190497 1196625 1198940
10744 1198940 1199672 1201467 1204991 1205340 1211995 1216606 1217123 1222093 1224034 1226271 1228873 1235404 1239709 1240053 1241442
10729 1241442 1242480 1243876 1242924 1241425 1241596 1249909 1254404 1253952 1253051 1252846 1251796 1253739 1255614 1263595 1269914
10714 1269914 1275383 1273710 1271994 1277506 1283229 1285712 1285815 1281763 1285455 1295808 1301939 1303982 1302110 1305998
10700 1305998 1310466 1313341 1318086 1321419 1324886 1327176 1330561 1332337 1334261 1339125 1341743 1348433 1355820 1355429
10686 1355429 1349004 1351773 1352632 1349836 1345640 1344628 1345835 1350283 1356875 1360541 1362881 1366727 1364257 1368806
10672 1368806 1371864 1372317 1375251 1379686 1384278 1384151 1383330 1385264 1388577 1393720 1399246 1403371 1411866 1417874 1423499
10657 1423499 1428983 1431956 1436618 1437553 1440840 1440536 1440993 1440528 1442853 1449286 1456347 1459449 1462021 1470492 1473720
10642 1473720 1476817 1477345 1479929 1486596 1489273 1492298 1494828 1504037 1505579 1506734 1507932 1510773 1512540 1513659
10628 1513659 1516861 1518426 1525670 1535633 1543262 1546003 1543462 1544411 1547981 1553623 1553679 1553555 1558611 1562585 1567370
10613 1567370 1574724 1578735 1591213 1598897 1607256 1616050 1620111 1621728 1625611 1627561 1631894 1632191 1633824 1640950
10599 1640950 1645324 1649639 1652190 1659192 1673495 1686925 1692265 1698468 1705347 1703474 1699448 1696233 1697645
10586 1697645 1705600 1711645 1721949 1728254 1734797 1743562 1751321 1756714 1765402 1773214 1777983 1781289 1784897 1788888
10572 1788888 1800616 1812262 1817787 1828743 1842638 1855013 1868589 1871386 1873744 1879630 1880576 1878161 1875833
10559 1875833 1877995 1886768 1900617 1914588 1932100 1949347 1966520 1987908 2012257 2033031 2060764 2093802
10547 2093802 2133988 2177458 2222344 2277959 2347519 2439503 2551495 2679859 2797588 2813731 2540587
10536 2540587 1874573 1142635 778390 793370 947954 1098704 1214604 1303047 1375115 1434443
10526 1434443 1483285 1518539 1551187 1584116 1610129 1638032 1667694 1686368 1702605 1719010 1733047
10515 1733047 1746667 1765390 1778891 1792676 1801152 1812890 1826705 1838134 1847500 1858148 1869444 1882726
10503 1882726 1894757 1906487 1915525 1923781 1934850 1942123 1948565 1960222 1966910 1973041 1983290 1993174 1998400
10490 1998400 2007629 2011361 2018965 2028517 2037886 2044024 2057833 2067742 2071641 2079480 2088560 2096720 2104096 2114676
10476 2114676 2128073 2137857 2144144 2149425 2149142 2152524 2159646 2168288 2180365 2192569 2199193 2204381 2215378
10463 2215378 2233712 2246470 2258249 2263804 2278870 2295599 2306845 2323828 2338562 2344810 2344350 2348342
10451 2348342 2357638 2363162 2367908 2367907 2360802 2348690 2336515 2327364 2325629 2333595 2346753 2357845 2370472
10438 2370472 2383541 2399409 2403747 2394799 2379318 2368257 2368438 2388119 2408624 2427261 2449290 2468025
10426 2468025 2477344 2483103 2492732 2507150 2522107 2535146 2549880 2563783 2575401 2587428 2603153 2615191
10414 2615191 2624136 2638695 2650768 2663520 2685048 2700658 2710576 2722291 2736538 2750610 2762281 2775214
10402 2775214 2788839 2796465 2805003 2813922 2828022 2846064 2862747 2870665 2873007 2878473 2886363 2894690 2903598
10389 2903598 2910513 2910596 2909606 2915567 2927485 2945235 2959291 2971066 2975943 2984058 2996763 3007282 3022236
10376 3022236 3035398 3051306 3054002 3045583 3036519 3041879 3057303 3072348 3081625 3094064 3111489 3133309
10364 3133309 3161501 3185957 3207965 3229564 3250633 3265748 3280473 3301369 3325631 3341180 3355220
10353 3355220 3374542 3398695 3427893 3457598 3480656 3498709 3514973 3531011 3547305 3565829 3592894
10342 3592894 3623673 3646214 3668666 3687561 3703739 3721313 3741314 3761330 3777189 3789419 3807175
10331 3807175 3839507 3876015 3910521 3932924 3951835 3971508 3993416 4016405 4038275 4058510 4082372
10320 4082372 4108793 4132124 4166927 4204688 4236542 4264184 4285137 4308155 4339501 4381999 4422068
10309 4422068 4457160 4488947 4524768 4566195 4610360 4660983 4720234 4779738 4829359 4879230 4940108
10298 4940108 5006644 5077778 5152221 5230810 5320854 5427117 5544666 5673018 5817710 5986207
10288 5986207 6183649 6365196 6415936 6313496 6149313 5765808 5348261 5067012 4708168 4372154
10278 4372154 4047021 3717741 3534868 3463653 3519781 3697750 3899949 4074081 4221191 4357634
10268 4357634 4479704 4593422 4712820 4832667 4932961 5028270 5134656 5244081 5319979 5366506
10258 5366506 5400560 5424157 5454951 5499010 5561378 5632048 5668465 5676776 5684168 5707822 5754206 5815521
10246 5815521 5888389 5970119 6051943 6134237 6215111 6293312 6370591 6440799 6512949 6585840 6652360
10235 6652360 6716342 6787936 6860040 6941557 7023390 7102417 7187498 7280325 7370963 7456471 7538549
10224 7538549 7622098 7707985 7792138 7873389 7962917 8061408 8159034 8264568 8373215 8481826 8592180
10213 8592180 8701924 8813460 8927497 9041475 9161654 9278004 9394006 9525737 9671014
10204 9671014 9818269 9960671 10109957 10257532 10415883 10579463 10746151 10916275 11082682
10195 11082682 11252401 11425072 11606948 11805158 12017480 12228577 12434699 12647038 12860950
10186 12860950 13073943 13298906 13552777 13836913 14144019 14463111 14788823 15105827 15420641
10177 15420641 15748689 16093098 16451155 16827583 17226486 17644048 18091848 18576556 19083824
10168 19083824 19600267 20119544 20660843 21242775 21880650 22590535 23369440 24187421 25031175
10159 25031175 25913305 26877338 27947238 29124772 30401631 31784967 33299908 34946220
10151 34946220 36679978 38346195 39812066 41401810 43630827 46615224 50157153 54195570
10143 54195570 58797211 64028797 69937963 76845175 85557490 96937933 111601064 129834361
10135 129834361 150849598 170728108 177517347 145143185 50438749 -75106395 -164519743
10128 -164519743 -186242380 -168335622 -143204195 -121690820 -104798202 -91666436 -81539464
10121 -81539464 -73840769 -67811508 -62616650 -57848734 -53531018 -49707344 -46322014 -43320334
10113 -43320334 -40705433 -38570780 -37092664 -36098875 -35048968 -33676838 -32175275 -30749010
10105 -30749010 -29460156 -28297539 -27228511 -26221097 -25280596 -24433500 -23676234 -22971640 -22283712
10096 -22283712 -21600419 -20945773 -20332331 -19767092 -19248087 -18768052 -18312631 -17868930 -17439038
10087 -17439038 -17019673 -16617494 -16233610 -15868882 -15524343 -15207250 -14910840 -14636076 -14382399
10078 -14382399 -14132733 -13879607 -13615182 -13344513 -13077276 -12823261 -12594076 -12383812 -12181123
10069 -12181123 -11985190 -11789951 -11593600 -11402567 -11220444 -11046445 -10881212 -10728465 -10576907
10060 -10576907 -10422874 -10275596 -10132675 -9997470 -9865355 -9736139 -9602513 -9461304 -9319796
10051 -9319796 -9195671 -9082880 -8965131 -8845850 -8736746 -8631729 -8534047 -8434097 -8331116 -8229162
10041 -8229162 -8127827 -8021734 -7913155 -7813393 -7716748 -7619401 -7524106 -7431993 -7341690 -7252485 -7156371
10030 -7156371 -7057011 -6950967 -6839906 -6725114 -6604010 -6475159 -6330050 -6167853 -5983374 -5778592
10020 -5778592 -5563401 -5385174 -5405198 -5958448 -7112462 -7819613 -7800278 -7521197 -7223231 -6963446
10010 -6963446 -6743186 -6567645 -6467264 -6423216 -6387489 -6313399 -6193449 -6065795 -5978806 -5953528
10000 -5953528 -5943949 -5918304 -5882026 -5851413 -5817682 -5777366 -5734969 -5692124 -5648470 -5600007 -5545430
9989 -5545430 -5485947 -5430070 -5380782 -5333289 -5286833 -5241649 -5198773 -5153368 -5096321 -5039391 -4997608
9978 -4997608 -4973457 -4962554 -4951976 -4939483 -4925857 -4903909 -4870793 -4834305 -4792673 -4751615 -4719746
9967 -4719746 -4691548 -4655264 -4624534 -4596421 -4569488 -4540628 -4517081 -4488255 -4460584 -4437436 -4413488
9956 -4413488 -4393196 -4372223 -4348810 -4323590 -4298201 -4270095 -4244007 -4222624 -4191805 -4152700 -4121701
9945 -4121701 -4101123 -4083379 -4062045 -4035921 -4007162 -3989863 -3968925 -3937872 -3907382 -3880669 -3860226
9934 -3860226 -3839442 -3820118 -3799976 -3783549 -3768963 -3750267 -3720606 -3694971 -3675530 -3660532 -3647234
9923 -3647234 -3622653 -3598182 -3581280 -3566969 -3551083 -3535586 -3517402 -3503821 -3490082 -3469939 -3450534
9912 -3450534 -3428327 -3410910 -3401917 -3397612 -3391683 -3378861 -3359542 -3343869 -3329417 -3311495 -3298318 -3283650
9900 -3283650 -3271766 -3260533 -3250624 -3233497 -3221193 -3206519 -3186827 -3168010 -3148389 -3130989 -3114495 -3097550
9888 -3097550 -3087304 -3077724 -3066094 -3057225 -3049421 -3037698 -3023296 -3007909 -2993638 -2980251 -2972342 -2962765
9876 -2962765 -2956537 -2947161 -2935028 -2919341 -2902331 -2885001 -2874604 -2867691 -2856325 -2844777 -2836377 -2835442 -2831189
9863 -2831189 -2821306 -2806575 -2794779 -2783796 -2772777 -2756835 -2744996 -2735320 -2722405 -2706081 -2689215 -2673179
9851 -2673179 -2664396 -2657565 -2648950 -2643459 -2636693 -2621669 -2609154 -2603733 -2593999 -2585352 -2570662 -2561827 -2554488
9838 -2554488 -2545814 -2536208 -2527749 -2524076 -2517695 -2509005 -2506906 -2502875 -2496720 -2490531 -2476215 -2447569 -2408738
9825 -2408738 -2377978 -2368711 -2363916 -2362576 -2370487 -2376187 -2375342 -2364342 -2347081 -2330030 -2311820 -2295557 -2282785
9812 -2282785 -2277940 -2271031 -2257580 -2251356 -2248464 -2243085 -2234950 -2220518 -2210989 -2201010 -2189739 -2183173 -2179522
9799 -2179522 -2179991 -2173016 -2165973 -2161559 -2148512 -2138171 -2132826 -2119541 -2105027 -2100194 -2093343 -2085354 -2076201
9786 -2076201 -2061645 -2048432 -2041382 -2026712 -2008565 -1992724 -1981341 -1972771 -1966074 -1961454 -1959492 -1958782 -1960755
9773 -1960755 -1956907 -1948449 -1937902 -1931035 -1922484 -1913668 -1898027 -1879835 -1865352 -1857579 -1848805 -1839009 -1828476
9760 -1828476 -1810559 -1793830 -1778199 -1759754 -1746968 -1733807 -1715353 -1699189 -1684766 -1666469 -1651041
9749 -1651041 -1632781 -1608669 -1586234 -1564834 -1538708 -1511205 -1481423 -1455050 -1436387 -1428375 -1415026 -1391484
9737 -1391484 -1363070 -1322175 -1267275 -1210031 -1182258 -1250431 -1394468 -1471542 -1477413 -1458397 -1401593
9726 -1401593 -1301199 -1165742 -995510 -814018 -681205 -725080 -1141531 -1853349 -2415558 -2564007
9716 -2564007 -2468820 -2325176 -2203097 -2127297 -2096888 -2097439 -2095322 -2075457 -2048248 -2032957 -2009432 -1981092
9704 -1981092 -1951554 -1919062 -1895104 -1864282 -1826509 -1768787 -1700702 -1627732 -1539067 -1433748 -1332214
9693 -1332214 -1253638 -1211545 -1256746 -1493820 -1994259 -2466568 -2650294 -2636897 -2553654 -2454368 -2355041
9682 -2355041 -2270786 -2193092 -2124595 -2065591 -2019201 -1995205 -1990241 -1985006 -1960298 -1929167 -1912595 -1915101
9670 -1915101 -1924519 -1938903 -1966424 -2007971 -2058262 -2105315 -2126614 -2137700 -2153246 -2151823 -2123531 -2084693
9658 -2084693 -2041302 -1994854 -1949621 -1906413 -1867007 -1819483 -1776512 -1760654 -1774820 -1812702 -1874670
9647 -1874670 -1983669 -2136297 -2209161 -2183258 -2136153 -2095251 -2063028 -2041930 -2028191 -2025006 -2029455
9636 -2029455 -2027607 -2008591 -1980008 -1958533 -1940389 -1927350 -1909312 -1888744 -1875591 -1864756 -1850657 -1842807
9624 -1842807 -1838307 -1833485 -1826469 -1813915 -1800349 -1789014 -1782640 -1774676 -1760799 -1748516 -1742947 -1739951 -1736124
9611 -1736124 -1727787 -1721720 -1710076 -1701238 -1700978 -1702898 -1700828 -1696798 -1696890 -1703354 -1715766 -1716584 -1708744 -1703520 -1698485
9596 -1698485 -1691567 -1679137 -1667054 -1657852 -1653349 -1645977 -1632852 -1626555 -1628803 -1626472 -1622401 -1617785 -1610903
9583 -1610903 -1603248 -1599855 -1594449 -1584113 -1583711 -1584709 -1579774 -1575149 -1568897 -1563934 -1557123 -1552892 -1551510 -1555206
9569 -1555206 -1561828 -1565747 -1567816 -1571683 -1568285 -1561567 -1555833 -1552709 -1548609 -1542756 -1542012 -1538660 -1534570 -1524414
9555 -1524414 -1518049 -1517051 -1509593 -1507813 -1513970 -1511009 -1498928 -1494464 -1491314 -1484847 -1485166 -1479377 -1476893 -1476668 -1476222
9540 -1476222 -1469073 -1457789 -1455866 -1459380 -1456082 -1448427 -1442809 -1439860 -1438860 -1435606 -1431902 -1430930 -1430009 -1423087
9526 -1423087 -1419099 -1420271 -1420352 -1421662 -1417133 -1409618 -1404031 -1403720 -1401628 -1396837 -1391576 -1391557 -1391681 -1394486 -1390634 -1390538
9510 -1390538 -1389654 -1383760 -1379937 -1373958 -1370698 -1368597 -1368446 -1368855 -1361834 -1359941 -1356848 -1351107 -1353016 -1352455 -1351235
9495 -1351235 -1348607 -1345438 -1342483 -1340468 -1332119 -1328676 -1323301 -1322708 -1325718 -1318881 -1314022 -1310020 -1308175 -1307737 -1304994
9480 -1304994 -1305738 -1302237 -1298113 -1299794 -1300978 -1299685 -1296169 -1294649 -1294984 -1296245 -1290700 -1288159 -1290532 -1288805 -1285765
9465 -1285765 -1279808 -1276252 -1275413 -1266663 -1259102 -1264015 -1268595 -1264861 -1256760 -1257033 -1259300 -1254724 -1256247 -1254251 -1252156
9450 -1252156 -1251438 -1249852 -1241416 -1232133 -1226445 -1230456 -1232481 -1230749 -1232881 -1237993 -1241037 -1241534 -1239316 -1232409 -1234162
9435 -1234162 -1229922 -1226360 -1224638 -1221457 -1218308 -1216803 -1214347 -1209189 -1204454 -1197518 -1193792 -1197543 -1197900 -1197325 -1196615
9420 -1196615 -1195616 -1194474 -1192869 -1189144 -1189193 -1187749 -1185824 -1178366 -1172749 -1170521 -1171505 -1174384 -1178260 -1176513 -1171006
9405 -1171006 -1169086 -1169721 -1166385 -1163828 -1159746 -1154670 -1154102 -1154423 -1159165 -1162699 -1163308 -1164041 -1156567 -1147057 -1144598
9390 -1144598 -1144153 -1140422 -1133768 -1135552 -1137844 -1135457 -1125857 -1124299 -1124345 -1125485 -1123310 -1117025 -1120056 -1122863 -1121266
9375 -1121266 -1118849 -1112860 -1112444 -1110750 -1109955 -1113243 -1112033 -1107991 -1105293 -1105185 -1108394 -1108017 -1104562 -1105271 -1103144
9360 -1103144 -1100258 -1098227 -1097642 -1097000 -1094554 -1087524 -1082307 -1081978 -1079886 -1073384 -1074701 -1077205 -1078827 -1079126 -1075022
9345 -1075022 -1070117 -1072142 -1071706 -1067329 -1067852 -1067749 -1065305 -1061624 -1062313 -1062852 -1060106 -1060797 -1057241 -1048206 -1046675 -1048181
9329 -1048181 -1042979 -1043251 -1045175 -1045047 -1046659 -1047252 -1047636 -1045491 -1040440 -1035018 -1034720 -1030064 -1029691 -1031580 -1030322 -1026770
9313 -1026770 -1022885 -1018498 -1022468 -1028366 -1028162 -1023720 -1024026 -1026854 -1025026 -1022269 -1023488 -1021751 -1023056 -1018803 -1016676
9298 -1016676 -1018981 -1018978 -1013636 -1009373 -1005255 -1003579 -1004426 -1003323 -1000298 -998458 -996441 -998242 -996286 -997497 -997944
9283 -997944 -998602 -995659 -994645 -990336 -990861 -989509 -982789 -981457 -980829 -982402 -980931 -979624 -978824 -976391 -976309 -981507
9267 -981507 -984003 -981713 -975582 -972199 -970960 -971757 -967387 -968411 -970191 -966104 -960181 -958969 -956912 -957907 -960642
9252 -960642 -961835 -958780 -959560 -957939 -959041 -961894 -959080 -955537 -955566 -954533 -950504 -948462 -946637 -943301 -941794
9237 -941794 -941626 -943853 -943525 -944748 -941326 -934844 -933454 -936574 -935921 -934348 -931921 -929450 -925241 -926716 -929213
9222 -929213 -925744 -919866 -916041 -918260 -924491 -934019 -935678 -929985 -922818 -921585 -921644 -916074 -912290 -915228 -914791
9207 -914791 -910258 -903789 -906166 -908225 -910103 -912410 -913517 -908289 -904008 -904830 -901140 -903911 -903109 -899493 -900169
9192 -900169 -899177 -902700 -903349 -899299 -891595 -890236 -890038 -887627 -889694 -889825 -888115 -886754 -886412 -888953 -888924 -881807
9176 -881807 -880258 -877325 -879605 -879565 -872971 -877128 -879424 -879482 -877387 -874220 -874870 -876095 -875463 -875561 -876123 -875991 -873022
9159 -873022 -871133 -871369 -868221 -862635 -865508 -866706 -865501 -864972 -862144 -861172 -858061 -856283 -859338 -855841 -855718
9144 -855718 -854143 -853646 -858804 -860440 -854023 -846655 -846263 -850605 -852126 -850351 -849830 -848559 -846252 -844466 -848478
9129 -848478 -843541 -838382 -836739 -838019 -838286 -838350 -836540 -835448 -838171 -838552 -835817 -834838 -832689 -830580 -826198 -823939
9113 -823939 -824393 -826769 -826165 -825815 -822550 -826062 -828821 -822686 -817421 -816453 -815150 -815005 -815324 -810449 -814564 -815369
9097 -815369 -812440 -817063 -815509 -810901 -808027 -807922 -806649 -802863 -799095 -800667 -797280 -800227 -802473 -797915 -794740
9082 -794740 -794832 -795066 -791421 -793467 -792361 -790154 -788421 -785802 -788025 -789405 -786744 -781463 -781982 -786086 -782453
9067 -782453 -778344 -777941 -776762 -776589 -773386 -768785 -764973 -761017 -758486 -763084 -764196 -762846 -757861 -752757 -751585
9052 -751585 -744610 -738829 -736686 -731941 -725694 -719075 -711342 -701727 -691111 -676185 -665713 -661129 -665148 -698146
9038 -698146 -763921 -835556 -877150 -882520 -876367 -870589 -866653 -866821 -858401 -847450 -840726 -833519 -825648 -819190
9024 -819190 -817786 -816004 -815464 -813270 -807831 -805853 -803040 -801631 -798696 -793895 -787251 -784614 -785354 -781761 -779722
9009 -779722 -779353 -782657 -781850 -782460 -780487 -780072 -780910 -780687 -778035 -772798 -769135 -774652 -770821 -766058 -771255 -771585
8993 -771585 -767268 -759857 -759854 -763652 -764154 -763799 -760088 -755662 -757782 -760497 -760383 -755406 -752664 -748774 -751997 -757031
8977 -757031 -753755 -749596 -751446 -755339 -752278 -745676 -741092 -737744 -739550 -739952 -738321 -737718 -737335 -738883 -737286
8962 -737286 -735204 -736097 -736760 -738612 -742315 -741294 -734305 -725521 -727413 -732510 -731040 -726196 -726917 -728993 -726882
8947 -726882 -723060 -719880 -717273 -719120 -723562 -722933 -718963 -716751 -723353 -726620 -727862 -725357 -724061 -722559 -720142
8932 -720142 -717815 -715978 -719798 -722017 -720552 -716333 -713775 -710517 -710629 -710284 -708971 -709842 -711893 -711692 -708478
8917 -708478 -703023 -700709 -701113 -702912 -700835 -699193 -707044 -709107 -706007 -703441 -699255 -701792 -702695 -699374 -698227
8902 -698227 -701520 -699922 -698592 -696956 -697410 -694682 -693399 -695444 -694105 -694096 -691929 -690933 -696560 -697737 -696631 -699530
8886 -699530 -694041 -693914 -694423 -691731 -690759 -688690 -688396 -688657 -687841 -687659 -689337 -686005 -685219 -686015 -682817 -681385 -680599
8869 -680599 -681460 -680567 -678648 -678846 -681548 -686751 -688123 -686478 -685950 -682144 -678847 -676207 -676489 -679180 -676953 -677014
8853 -677014 -679805 -672868 -669778 -672228 -671507 -668456 -669876 -672070 -672509 -674120 -678024 -677454 -675328 -671277 -669238
8838 -669238 -665119 -661553 -664226 -665127 -667955 -668275 -667039 -664800 -661585 -662348 -656372 -655360 -655043 -656683 -657900
8823 -657900 -655305 -653747 -652565 -654878 -655663 -655320 -658747 -658034 -657769 -659265 -659353 -656125 -652749 -658435 -658614 -652563
8807 -652563 -652863 -650889 -647409 -647714 -648693 -646618 -647154 -646996 -649101 -651670 -651737 -649875 -647006 -646722 -647391 -645359 -647641
8790 -647641 -649076 -648126 -644547 -640375 -640818 -641869 -640905 -637803 -634952 -635630 -632953 -631608 -634016 -635351 -636948
8775 -636948 -639723 -643431 -644203 -641821 -642507 -642670 -639584 -636753 -637949 -641027 -639376 -635711 -634067 -633749 -631221
8760 -631221 -627118 -629620 -631497 -627650 -624179 -623694 -626795 -624583 -629924 -632093 -624339 -627368 -631435 -627598 -622957
8745 -622957 -624010 -628568 -626331 -623330 -618829 -619541 -619508 -616169 -615684 -613946 -615534 -613831 -612861 -612395 -614522 -617050
8729 -617050 -617774 -611106 -608710 -609914 -613907 -615329 -613975 -614257 -607687 -607176 -609561 -610236 -609277 -609705 -615261 -615440
8713 -615440 -610625 -610360 -611605 -611592 -613557 -609953 -605950 -605314 -604510 -604442 -606053 -608225 -604104 -597639 -599637 -601370
8697 -601370 -606552 -607464 -605746 -605064 -601878 -601512 -605005 -602134 -599367 -604750 -608713 -607997 -603298 -603705 -600372 -600773
8681 -600773 -600580 -598306 -594312 -591473 -594023 -594433 -594243 -595555 -592675 -589175 -593483 -592292 -592393 -591801 -592986 -592992
8665 -592992 -592302 -592520 -591924 -592551 -598245 -595796 -591102 -592206 -589782 -586111 -587715 -584329 -588326 -587022 -589583
8650 -589583 -588665 -593760 -589719 -585818 -580823 -581219 -578838 -580697 -577575 -575589 -582950 -591533 -588689 -586230 -587372
8635 -587372 -584662 -584238 -580523 -571913 -565034 -564922 -565982 -568585 -566488 -568302 -572444 -573362 -575104 -573621 -569800
8620 -569800 -571295 -564280 -566231 -567643 -569427 -571928 -567822 -566443 -566930 -568280 -570841 -572154 -569506 -565620 -563233
8605 -563233 -563229 -560433 -559655 -563223 -567217 -569350 -568481 -563765 -563841 -567889 -564202 -562458 -566173 -569728 -570369 -572766
8589 -572766 -572342 -572155 -571736 -569504 -569595 -567044 -564508 -565231 -567164 -563076 -558643 -558525 -561237 -567586 -571549 -571616 -570763
8572 -570763 -569743 -569362 -567143 -567791 -565566 -562445 -556170 -556308 -560693 -561211 -558292 -557927 -556901 -557331 -557131 -557621
8556 -557621 -563673 -561734 -562025 -564159 -566583 -564058 -562178 -556631 -554584 -551573 -545829 -544738 -545131 -546884 -547672
8541 -547672 -552067 -557065 -558643 -554222 -549201 -549019 -546104 -544465 -548273 -546555 -542584 -544643 -545558 -541148 -537690
8526 -537690 -540958 -545175 -548735 -551226 -545706 -544471 -549744 -549611 -540872 -538674 -540275 -542373 -542887 -537603 -538579
8511 -538579 -540404 -536468 -542642 -547203 -546244 -541914 -537221 -537509 -538346 -536926 -535112 -532819 -531678 -529765 -534153
8496 -534153 -536435 -539184 -538900 -539168 -542122 -541241 -540383 -542082 -541910 -542081 -541494 -537009 -531166 -529415 -529186 -528710 -529360
8479 -529360 -529554 -531244 -532658 -530818 -533780 -532720 -532370 -533657 -534025 -529944 -527833 -529614 -529371 -529515 -532365 -529841
8463 -529841 -523610 -523198 -529549 -531563 -532221 -532313 -529466 -526586 -528330 -530240 -527649 -525386 -521994 -523715 -522007
8448 -522007 -519452 -518648 -520356 -519657 -521885 -522059 -517176 -514373 -514351 -511475 -509899 -516461 -520308 -515872 -509418 -511467
8432 -511467 -512519 -515800 -514532 -511766 -512486 -513104 -514775 -519494 -523741 -520255 -515226 -513449 -518855 -518971 -516963
8417 -516963 -512347 -508766 -507930 -506694 -510075 -512235 -508905 -508833 -510943 -512971 -514106 -513328 -507572 -501964 -507153
8402 -507153 -513888 -510259 -510152 -511689 -516165 -518765 -516022 -512578 -506475 -504170 -501641 -503105 -504461 -508223 -507926
8387 -507926 -506141 -499486 -499657 -503710 -504052 -501986 -500122 -499876 -497555 -498086 -503339 -507244 -502886 -499399 -497321
8372 -497321 -495608 -500155 -506118 -504760 -502553 -501298 -500635 -494591 -497372 -498451 -497532 -494276 -496129 -496469 -495743
8357 -495743 -495452 -493009 -491797 -494837 -491761 -490118 -487438 -489587 -489077 -488662 -486264 -486047 -494896 -497962 -494204
8342 -494204 -493461 -496816 -496340 -496307 -493596 -491507 -493232 -495155 -495522 -493903 -490409 -487778 -489768 -491344 -488523 -486220
8326 -486220 -487631 -494107 -491477 -491491 -492751 -499041 -497643 -495974 -496310 -492313 -491896 -492634 -489924 -484148 -486661 -489808
8310 -489808 -486918 -486767 -483967 -484467 -485210 -486876 -486438 -484424 -483985 -485137 -487234 -485079 -480125 -481856 -484669 -486789
8294 -486789 -484563 -482611 -485507 -481528 -483006 -481663 -475680 -472617 -473860 -477498 -475987 -472185 -474958 -476332
8280 -476332 -474709 -479561 -483731 -481101 -477791 -477945 -475605 -474677 -473411 -476277 -473177 -472781 -474770 -473820 -474799 -476238
8264 -476238 -479588 -481456 -476199 -473692 -475237 -474282 -473400 -470208 -467824 -467098 -467288 -469322 -472451 -473193 -472170 -469846
8248 -469846 -465802 -466586 -467856 -463716 -460271 -460978 -467931 -472994 -472967 -473910 -469955 -469213 -468459 -467468 -468073 -466975 -463949
8231 -463949 -461989 -460306 -461707 -466859 -467069 -465114 -467964 -467865 -464080 -460176 -458771 -460766 -465959 -472361 -473139
8216 -473139 -468688 -461684 -464397 -465524 -464185 -462641 -460983 -459002 -455276 -454660 -456261 -459770 -462573 -460436 -457754
8201 -457754 -455848 -453838 -452316 -451911 -448360 -447202 -448009 -449693 -449618 -454781 -460128 -459546 -457349 -456601 -456384 -452836
8185 -452836 -452766 -453236 -454721 -454950 -451343 -452020 -452196 -454183 -454570 -450192 -450694 -452287 -451389 -448155 -445885 -445524 -446100
8168 -446100 -445886 -449589 -451300 -453097 -453192 -453801 -448952 -446501 -445198 -449584 -447177 -450110 -454008 -452012 -456252
8153 -456252 -458026 -456197 -455045 -448507 -448271 -446124 -446006 -447880 -451857 -457604 -457066 -452567 -448216 -448835 -450394
8138 -450394 -448992 -446924 -445022 -443831 -447951 -451039 -457146 -453288 -451046 -451160 -443758 -438029 -436948 -438159 -439730
8123 -439730 -440434 -440222 -439903 -437906 -435506 -436281 -438064 -441513 -436459 -437835 -443229 -442135 -440352 -445331 -446556
8108 -446556 -444923 -439757 -433627 -430880 -434142 -439147 -435674 -438129 -439345 -436638 -431635 -426672 -429299 -432561
8094 -432561 -437527 -438776 -440302 -439634 -436764 -434077 -433476 -434376 -429415 -424776 -423425 -428359 -434159 -433059 -431965
8079 -431965 -435591 -438810 -438100 -433305 -428226 -427305 -426733 -426917 -432524 -432463 -425379 -426917 -428672 -426018 -427142 -429974
8063 -429974 -433923 -434142 -433253 -432089 -432854 -428908 -422946 -423018 -427893 -429198 -426464 -425742 -424694 -425815 -430035 -430143
8047 -430143 -426311 -424016 -422143 -422266 -423342 -419875 -418756 -419056 -419697 -425586 -428621 -425830 -422979 -422855 -420071
8032 -420071 -418956 -423148 -425010 -424389 -423830 -425562 -430715 -431570 -429060 -420845 -419222 -417302 -418270 -419390 -414585
8017 -414585 -412401 -416640 -423663 -420159 -419170 -418035 -420362 -422459 -423442 -421963 -420782 -422180 -421697 -419009 -416114
8002 -416114 -415708 -413096 -412813 -414131 -417263 -420808 -422801 -423422 -425528 -426347 -422479 -419574 -422201 -422414 -421253 -421540
7986 -421540 -417759 -416646 -419111 -423306 -421947 -423057 -419683 -411190 -407928 -412533 -412996 -412901 -414715 -412002 -415583
7971 -415583 -414876 -414478 -416581 -417582 -417191 -412092 -411286 -412263 -409808 -412523 -419226 -419072 -415596 -412259 -411526 -418083
7955 -418083 -419904 -417385 -415802 -415937 -417724 -425668 -424459 -421690 -417509 -411298 -411001 -413776 -413563 -417493 -415063
7940 -415063 -410976 -411347 -417210 -420298 -414564 -407641 -406720 -409281 -412546 -418027 -419242 -421038 -420659 -416117 -412417
7925 -412417 -409717 -407841 -409636 -411457 -408161 -407072 -403888 -405800 -409142 -407493 -402176 -404076 -408651 -408918 -407008
7910 -407008 -404889 -402762 -404232 -404457 -402150 -406436 -410152 -410660 -407269 -406570 -410552 -416161 -419574 -415160 -411535
7895 -411535 -406263 -400951 -399287 -398478 -396754 -396242 -395096 -399516 -402663 -400723 -398513 -403216 -407316 -413086 -411538
7880 -411538 -408525 -407578 -406571 -404783 -406466 -411765 -411079 -405514 -402083 -402661 -399245 -396296 -397495 -398046 -399056
7865 -399056 -402487 -405105 -406916 -405078 -399773 -399601 -401867 -398841 -397676 -396071 -394266 -395531 -398201 -400835 -401519
7850 -401519 -402564 -401115 -397023 -397827 -402359 -402329 -401685 -401072 -398477 -398501 -402138 -401719 -396617 -399139 -400943 -399793
7834 -399793 -398388 -400533 -403108 -397154 -390101 -391724 -396922 -392923 -393218 -396055 -401668 -397884 -397692 -397823 -396924
7819 -396924 -393725 -392221 -390574 -386679 -387392 -387249 -388025 -388764 -390096 -388564 -389362 -387296 -386899 -386876 -391347 -401221
7803 -401221 -398304 -396257 -392745 -393173 -395663 -395057 -392933 -393622 -392155 -385578 -386990 -390160 -389121 -390033 -394168
7788 -394168 -390205 -387184 -388995 -393043 -391744 -387596 -386002 -383997 -383748 -382778 -382678 -384904 -384118 -380897 -380755 -381645
7772 -381645 -380881 -380788 -384555 -385277 -384720 -387910 -384908 -385309 -380184 -379612 -384936 -383638 -385407 -386960 -385301 -388943
7756 -388943 -391129 -390537 -390120 -384490 -377921 -378026 -380132 -380500 -378467 -382218 -385757 -386164 -387298 -385733 -384266 -381584
7740 -381584 -376758 -375116 -374292 -375156 -377383 -378806 -378821 -375253 -375997 -377710 -378159 -379346 -379091 -376650 -378699 -382368
7724 -382368 -386045 -387443 -385971 -381962 -371812 -367098 -370131 -374037 -374663 -373153 -376600 -378434 -376606 -374495
7710 -374495 -372796 -370583 -371531 -370701 -368283 -368435 -373290 -378263 -377792 -374030 -370741 -367114 -370346 -370934 -371463 -370613
7694 -370613 -371948 -373871 -375034 -375212 -369776 -366690 -368418 -370354 -371677 -377516 -378191 -375649 -373966 -373643 -371948
7679 -371948 -374859 -374188 -375110 -373045 -365783 -367123 -372310 -375238 -376257 -377723 -373835 -373747 -375450 -370831 -366525
7664 -366525 -369028 -372687 -376034 -374850 -375340 -372434 -376331 -379908 -374738 -372952 -370395 -370059 -371995 -371900 -370931 -370489
7648 -370489 -370438 -375695 -383253 -379946 -372361 -367881 -368080 -365642 -366156 -368581 -367500 -366378 -367575 -370622 -370460 -366947
7632 -366947 -362296 -365018 -367101 -369160 -364593 -362935 -360922 -362936 -364896 -363712 -367073 -366516 -368925 -366723 -363606
7617 -363606 -360162 -359567 -361390 -362252 -361579 -357897 -356071 -361283 -360965 -361609 -360527 -358189 -357474 -353916 -351975 -350653
7601 -350653 -355601 -356836 -353457 -357048 -356347 -358829 -355069 -353276 -353821 -358342 -364127 -364625 -362297 -362885 -365495
7586 -365495 -363296 -360277 -355343 -356207 -358283 -356412 -356047 -355561 -356030 -354337 -353598 -357833 -361096 -359115 -355757 -352892
7570 -352892 -352946 -353830 -351881 -348768 -353720 -356834 -354899 -355660 -354680 -354542 -353618 -353641 -349916 -352269 -359756 -356788 -353863
7553 -353863 -355308 -360653 -365238 -364292 -363660 -364327 -360120 -354296 -350109 -349169 -352743 -352141 -354589 -354000 -354061 -353037
7537 -353037 -357386 -358359 -358450 -356205 -353820 -351415 -348551 -349433 -350381 -355147 -357806 -358441 -359971 -357014 -353819 -347742
7521 -347742 -346120 -346196 -348726 -347318 -344635 -341674 -341713 -341009 -344872 -349232 -352638 -353193 -350642 -346964 -350626 -353562
7505 -353562 -353115 -351842 -352347 -353515 -351655 -351861 -346151 -344119 -346195 -351734 -351253 -352695 -352109 -351698 -349922 -347182
7489 -347182 -347123 -347754 -350819 -351786 -353735 -356956 -350835 -349121 -344435 -338299 -338219 -338369 -339444 -342293 -344968 -343224
7473 -343224 -346860 -344738 -338787 -339598 -340058 -341525 -343313 -341013 -340571 -342311 -344323 -340869 -340509 -347696 -350631
7458 -350631 -349538 -348321 -347776 -351516 -347752 -345768 -344199 -345456 -343925 -343695 -344894 -340034 -342604 -344356 -343118
7443 -343118 -338819 -339763 -346098 -349093 -344629 -344171 -344921 -344453 -342164 -340087 -338524 -335820 -333279 -334121 -340256 -342171
7427 -342171 -337001 -338368 -339026 -337379 -339944 -336779 -331340 -332042 -335412 -340015 -339162 -334729 -333335 -333542 -336488
7412 -336488 -343929 -347294 -343300 -332650 -325945 -324726 -323683 -327211 -334623 -336874 -329302 -324772 -324328 -326256
7398 -326256 -334089 -337648 -334844 -333673 -336847 -337324 -337288 -339377 -342295 -344263 -344270 -344257 -344621 -342924 -343166 -343043 -338761
7381 -338761 -339738 -342095 -338796 -334244 -334474 -332581 -335772 -340056 -338854 -335080 -334756 -334007 -333610 -332533 -330821 -332420
7365 -332420 -329298 -330128 -331872 -331948 -334011 -334391 -336481 -335499 -335563 -330236 -331712 -332370 -331800 -331219 -329724 -327753 -323070
7348 -323070 -324310 -324579 -326996 -329041 -332341 -334375 -328848 -327003 -323555 -321965 -324488 -331005 -337486 -334411 -332718
7333 -332718 -331796 -331058 -328450 -328983 -328976 -331162 -328994 -327315 -325270 -321839 -325579 -323839 -318146 -313759 -312225 -318647
7317 -318647 -324406 -324690 -323739 -320899 -316779 -317352 -323080 -323420 -326044 -330558 -337332 -332456 -327193 -330301 -331975
7302 -331975 -333073 -332020 -328139 -326116 -326852 -325840 -320414 -321319 -321915 -326009 -329222 -330349 -330861 -326888 -324216
7287 -324216 -327339 -325023 -323857 -327026 -321347 -316723 -319694 -318522 -321434 -321595 -320163 -319607 -318532 -322235 -321147
7272 -321147 -322810 -326535 -323008 -319736 -318635 -316561 -316076 -316591 -318081 -321991 -323303 -322386 -321122 -317929 -317923 -319876
7256 -319876 -323740 -323032 -321400 -320638 -319913 -323509 -323762 -319530 -317077 -318080 -320524 -318035 -318256 -320647 -318912 -315584
7240 -315584 -310613 -306128 -308239 -308641 -307458 -313967 -313527 -314254 -314005 -306513 -303192 -306968 -317449 -324177 -323808
7225 -323808 -319215 -314849 -313892 -314928 -315519 -310598 -310409 -310640 -313114 -320531 -320809 -315742 -311350 -311586 -308461 -307934
7209 -307934 -310353 -310650 -310502 -311066 -311304 -311545 -312745 -310435 -307400 -305135 -300735 -308282 -314885 -316696 -312878 -308731
7193 -308731 -313062 -316892 -316673 -317011 -315059 -312757 -310250 -309079 -313912 -312511 -309987 -308714 -315820 -316275 -311259
7178 -311259 -309034 -306569 -307932 -305139 -307665 -315618 -319749 -312781 -311612 -313278 -314784 -318533 -319695 -314853
7164 -314853 -311866 -310902 -307751 -304174 -302222 -300073 -301305 -313517 -322929 -320130 -320454 -321117 -318264 -316228 -314981
7149 -314981 -314963 -319887 -322010 -318628 -317145 -315834 -310733 -310132 -309267 -307272 -310278 -310392 -302417 -301799 -308165 -315139
7133 -315139 -316141 -313782 -311236 -307553 -310492 -312045 -315305 -312312 -307709 -308226 -312725 -314950 -312618 -311041 -307729
7118 -307729 -309644 -312291 -311266 -312696 -311690 -310903 -312315 -314851 -312860 -310645 -309503 -312847 -311871 -309125 -305812
7103 -305812 -305095 -308198 -302580 -299888 -304587 -306305 -305668 -306612 -307945 -309209 -309438 -309186 -306872 -308242 -307057 -303462
7087 -303462 -306566 -306899 -305701 -308615 -309365 -312247 -314623 -313164 -315456 -317155 -310895 -309303 -307587 -307212 -308675
7072 -308675 -310040 -312213 -312706 -309491 -305721 -301333 -298936 -298773 -298152 -297043 -292952 -301735 -303009 -303006 -301292 -299547
7056 -299547 -302619 -302880 -301514 -305490 -305086 -298691 -297873 -297456 -297716 -300228 -301502 -300658 -298413 -296500 -299001 -301335
7040 -301335 -303438 -301251 -299505 -297451 -295048 -295279 -295466 -300233 -302596 -300238 -301383 -304398 -307236 -302636 -302789
7025 -302789 -302606 -304394 -303919 -300335 -296975 -289828 -292848 -294957 -293373 -291195 -289559 -289189 -288398 -289480 -291169
7010 -291169 -292884 -291588 -291284 -287848 -290511 -292287 -293621 -302478 -304814 -303586 -303872 -303094 -298565 -295140 -295307
6995 -295307 -300889 -307098 -302697 -300204 -297527 -298459 -300794 -297676 -293709 -294759 -296139 -296962 -296567 -296074 -295456 -295278
6979 -295278 -296704 -297228 -299483 -297616 -294633 -290277 -285150 -288244 -293737 -295367 -293973 -294457 -290964 -286704 -285419
6964 -285419 -293475 -303391 -307449 -304897 -301396 -298395 -300266 -302367 -295648 -298169 -301364 -302420 -298431 -296392
6950 -296392 -297417 -303492 -303974 -301697 -299706 -297878 -294807 -292144 -296207 -300440 -299253 -294968 -294554 -296209 -298070
6935 -298070 -295883 -296291 -290398 -285428 -287246 -287218 -289166 -292362 -297991 -294430 -296658 -297135 -294472 -293097 -286558
6920 -286558 -287708 -294585 -297687 -298862 -301071 -297720 -296181 -295471 -289352 -286827 -286523 -289585 -292176 -291211 -288554
6905 -288554 -282628 -278406 -283327 -289811 -288197 -285174 -285221 -285437 -283960 -284968 -291953 -296515 -295479 -293754 -295441
6890 -295441 -296163 -293428 -293424 -291250 -285021 -285053 -285518 -290681 -293013 -293100 -290712 -288943 -288447 -292492 -296152 -297306 -298763
6873 -298763 -298434 -292114 -285960 -283032 -283086 -282982 -281796 -280569 -281844 -282543 -282712 -283532 -287191 -285723 -281478 -278738
6857 -278738 -284432 -287378 -291397 -294413 -291906 -283911 -282213 -281788 -282227 -280361 -278398 -274269 -274301 -276237 -284159
6842 -284159 -288960 -289972 -289363 -286741 -284715 -285424 -284841 -286396 -286685 -284684 -282974 -282361 -282088 -283664 -291226 -296527
6826 -296527 -294029 -285707 -282115 -285645 -290430 -288020 -286568 -289046 -290572 -288951 -289153 -284016 -282156 -283518 -281361
6811 -281361 -285330 -290169 -289718 -284480 -278909 -280463 -284617 -280679 -277836 -279207 -282601 -281112 -283880 -284512 -287595
6796 -287595 -291040 -291474 -289885 -285728 -278443 -278682 -282983 -286026 -286597 -285883 -280388 -279135 -281823 -281352 -280638 -276910
6780 -276910 -274941 -277278 -281106 -280067 -278685 -281301 -284946 -287924 -288381 -288639 -285835 -284928 -286828 -287771 -284075
6765 -284075 -280973 -277147 -272987 -269759 -271204 -269858 -271500 -274159 -282545 -281361 -272538 -274075 -275864 -277540
6751 -277540 -275080 -274296 -271824 -279589 -280003 -277437 -272045 -278218 -279639 -270849 -269306 -277251 -279857 -279248 -275616
6736 -275616 -275822 -280144 -279625 -279053 -279755 -279458 -276419 -276324 -280054 -276477 -274000 -270621 -274212 -277667 -274662 -275978
6720 -275978 -278586 -283578 -278747 -276610 -274669 -270879 -269045 -274640 -273824 -274997 -276657 -277151 -275850 -278785 -277962
6705 -277962 -273040 -270470 -272566 -274246 -272087 -271117 -272614 -273498 -275407 -274897 -270210 -273439 -274926 -271332 -272294
6690 -272294 -270995 -273921 -269553 -267531 -271331 -280843 -285550 -280749 -276475 -275485 -272671 -276274 -274759 -272783 -273067
6675 -273067 -273839 -272340 -270545 -267908 -269040 -272065 -275072 -276107 -274672 -273243 -274476 -270293 -272931 -271852 -269302
6660 -269302 -268850 -272859 -276793 -273883 -269974 -272729 -278190 -278586 -277290 -268893 -268994 -267334 -270288 -272563 -272153
6645 -272153 -270873 -274314 -274693 -271657 -273777 -271887 -273519 -277580 -275638 -274222 -272768 -275228 -274453 -275758 -276184
6630 -276184 -272926 -273902 -275382 -269514 -264794 -267040 -272272 -274868 -271401 -266918 -264948 -265612 -268872 -270474 -269827
6615 -269827 -266473 -265420 -267113 -269855 -272336 -268630 -268394 -268806 -268650 -269547 -272806 -270272 -267353 -271943 -270544
6600 -270544 -267048 -270022 -272644 -268480 -264262 -266336 -265293 -263406 -260893 -262498 -266674 -269092 -265531 -262509
6586 -262509 -262248 -261955 -265023 -264789 -264894 -264740 -265259 -265981 -268275 -274166 -274305 -271650 -271502 -269941 -270291 -270308 -270990 -271201
6568 -271201 -267735 -261783 -261793 -262356 -262639 -264498 -265260 -265555 -263342 -260766 -262517 -262486 -263950 -265068 -265790 -266585 -260557
6551 -260557 -259182 -260044 -260514 -260147 -258354 -261549 -262197 -256626 -255144 -256333 -262151 -263645 -261947 -261712 -261110 -262977
6535 -262977 -263808 -260566 -257305 -257124 -259139 -258316 -260804 -264303 -265263 -265301 -263967 -265181 -263567 -265510 -268307 -270626
6519 -270626 -266351 -263683 -263010 -261702 -260705 -259571 -262048 -266102 -264189 -259319 -257394 -258363 -256556 -258632 -264904
6504 -264904 -262097 -262359 -261678 -260268 -258967 -258957 -257872 -259342 -263199 -263985 -262620 -261528 -260093 -261066 -258422 -259493
6488 -259493 -260713 -261749 -264334 -262291 -261691 -261533 -258625 -259351 -257172 -256098 -259149 -258185 -255938 -258762 -259814
6473 -259814 -262507 -256867 -256246 -260908 -264105 -262456 -258569 -257236 -260056 -262260 -260727 -263417 -260501 -260011 -260638
6458 -260638 -258097 -254805 -257461 -257710 -254807 -256277 -260064 -262328 -265442 -268569 -268553 -262915 -259454 -259175 -258918 -259960
6442 -259960 -264518 -264493 -264354 -260318 -251798 -252000 -254156 -257655 -260830 -258900 -260268 -261410 -260206 -260222 -258410 -255118
6426 -255118 -252052 -250024 -253533 -261027 -261014 -259710 -258574 -253960 -254567 -256674 -260406 -259400 -256025 -259490 -258716
6411 -258716 -259480 -260816 -255756 -252556 -253438 -254782 -257863 -260900 -261089 -258269 -252334 -249798 -250859 -254651 -257362
6396 -257362 -259703 -259991 -258837 -253013 -247358 -248402 -254531 -255986 -259477 -254480 -259113 -262027 -255386 -252190 -253170
6381 -253170 -255522 -253001 -252706 -252008 -254509 -251576 -249817 -249364 -249820 -252920 -254741 -256678 -255609 -251574 -250247
6366 -250247 -246794 -246013 -245425 -251458 -248088 -248312 -252536 -256269 -258028 -257020 -249914 -249803 -254400 -251370 -248368
6351 -248368 -246265 -248954 -251554 -254170 -252576 -246759 -244188 -244583 -245679 -248335 -250391 -249711 -253682 -255648 -258704
6336 -258704 -257475 -251912 -247653 -244010 -245564 -247556 -242009 -242382 -240922 -240860 -244466 -251463 -251072 -250307 -243727 -243523
6320 -243523 -243263 -246544 -244805 -244629 -246415 -250723 -252277 -249689 -243757 -239327 -242864 -247158 -250112 -251057 -252646
6305 -252646 -254259 -254554 -255469 -257702 -258063 -260281 -258286 -256663 -252646 -249729 -247477 -245430 -245874 -246176 -247880 -246069
6289 -246069 -243949 -243180 -241409 -241164 -247661 -250886 -254497 -256019 -257163 -255801 -250800 -246065 -244479 -243866 -245825
6274 -245825 -248185 -246858 -249546 -252320 -254750 -253690 -251206 -246689 -241105 -240725 -245963 -248362 -249729 -246521 -241363
6259 -241363 -239487 -242615 -244949 -247573 -248228 -243946 -242511 -242064 -242766 -244463 -252167 -253351 -252125 -253885 -253743
6244 -253743 -248756 -250730 -250277 -250632 -250201 -250371 -254606 -256392 -252762 -244599 -241161 -245142 -247603 -251715 -250506
6229 -250506 -246289 -247391 -245509 -250048 -254878 -251997 -248380 -245222 -249986 -250476 -250506 -252831 -251480 -249006 -249545
6214 -249545 -243421 -242670 -243614 -244042 -243517 -242820 -244548 -243277 -241250 -237118 -233136 -237748 -241081 -241717 -239659 -234859
6198 -234859 -236459 -241399 -243550 -244873 -244652 -243857 -242123 -242718 -243395 -244212 -241398 -238240 -237490 -241032 -243155 -240296
6182 -240296 -243214 -244295 -244484 -246019 -243436 -240819 -242903 -244859 -240614 -239875 -240131 -239693 -240340 -243239 -245976 -245561
6166 -245561 -247721 -244104 -240143 -241100 -244936 -242082 -241935 -240628 -244046 -244804 -244050 -241862 -238223 -233129 -233737 -235859
6150 -235859 -237872 -242246 -240500 -241297 -246307 -243262 -236983 -235884 -234412 -234381 -236872 -235895 -234369 -237605 -237003 -231658
6134 -231658 -232796 -235981 -237545 -235891 -236855 -241518 -246379 -248399 -245476 -244047 -245190 -243381 -244580 -238663 -235988
6119 -235988 -233315 -235121 -232497 -230686 -229246 -230907 -232507 -232993 -231771 -237049 -238057 -234224 -237003 -242812 -239977
6104 -239977 -239696 -235039 -235747 -233715 -235806 -239034 -238749 -240718 -244797 -244268 -243506 -244637 -246766 -241283 -240334 -242027
6088 -242027 -243748 -245404 -244959 -244904 -244695 -244275 -247520 -245020 -239305 -236467 -235067 -234642 -235004 -237283 -237929 -238504 -237310
6071 -237310 -237866 -241940 -246814 -246778 -244537 -241554 -242019 -239585 -233899 -233823 -234092 -236764 -235928 -237526 -238566 -236872
6055 -236872 -234584 -230526 -227126 -225825 -228694 -229319 -231646 -236609 -239213 -238871 -237058 -238047 -236887 -234641 -236806
6040 -236806 -235314 -230893 -232863 -234746 -233712 -234944 -231357 -232650 -232957 -234801 -237549 -243568 -243258 -243599 -241740
6025 -241740 -234982 -231096 -230977 -233461 -236185 -238721 -239593 -241877 -239040 -240454 -242908 -240316 -233436 -228423 -230100
6010 -230100 -234770 -243019 -244194 -238868 -235609 -234264 -233898 -234213 -235788 -238703 -240868 -243513 -243556 -239037 -235094
5995 -235094 -238284 -239263 -240509 -239203 -238389 -238078 -237735 -234433 -232480 -229119 -229855 -232320 -237093 -237726 -233369 -227789
5979 -227789 -226541 -231940 -233671 -230520 -230767 -232162 -235017 -235711 -230562 -225440 -226468 -228379 -232528 -235185 -236231
5964 -236231 -234408 -233377 -233470 -232986 -233629 -231984 -232268 -235283 -231597 -227652 -225693 -222878 -223931 -230479 -231394 -227883
5948 -227883 -224320 -220793 -222276 -223135 -225268 -230609 -229395 -230883 -235840 -231679 -230661 -232462 -233201 -229690 -232904
5933 -232904 -236600 -236771 -231403 -225040 -218871 -218922 -220648 -224126 -227345 -229580 -232668 -234227 -233397 -227706 -224604
5918 -224604 -225653 -227710 -229681 -226503 -223165 -223219 -228035 -227081 -225757 -228041 -230198 -225941 -228208 -230739 -233422
5903 -233422 -236139 -235564 -232983 -229960 -233816 -236376 -234656 -229435 -230194 -228059 -227381 -227331 -229192 -230864 -233415 -235551
5887 -235551 -236702 -228470 -226948 -227177 -226588 -221007 -218832 -219622 -224632 -226491 -224218 -226881 -228893 -226125 -226086 -227978
5871 -227978 -225990 -226951 -229991 -235120 -234591 -230916 -228963 -223360 -219695 -223339 -229865 -229285 -225321 -224749 -224925 -227863
5855 -227863 -232399 -229014 -226571 -226185 -223729 -223939 -227767 -225015 -219746 -220529 -222834 -225308 -225989 -225113 -225392 -228701
5839 -228701 -229417 -229232 -225849 -224115 -223913 -230640 -238195 -240457 -236879 -235112 -232953 -230226 -233644 -231733 -226640
5824 -226640 -220733 -218838 -217399 -222811 -226456 -223908 -225464 -227841 -227714 -224416 -222824 -225286 -221586 -220913 -225512
5809 -225512 -224598 -220630 -220217 -224089 -223621 -221842 -220110 -223291 -223510 -227821 -221673 -217734 -219121 -221844 -222635 -221352
5793 -221352 -219660 -219500 -219482 -217638 -225925 -232581 -230769 -230060 -227741 -226704 -226294 -227492 -229532 -231435 -226971 -226132
5777 -226132 -222688 -220365 -221996 -224315 -222476 -222136 -222462 -225902 -227153 -223168 -219147 -219012 -221690 -222094 -222429 -223082
5761 -223082 -226776 -225194 -221221 -221784 -220214 -220730 -227159 -230350 -230561 -228277 -221818 -222326 -224374 -225003 -226180 -226398
5745 -226398 -226679 -225523 -224837 -223174 -220240 -220721 -218196 -220467 -216767 -214911 -214790 -216492 -220227 -216275 -215701 -221408
5729 -221408 -223925 -222402 -222557 -226190 -225515 -223555 -218854 -224904 -230111 -230316 -227884 -225143 -223733 -219915 -219153
5714 -219153 -219914 -221966 -228031 -223864 -222998 -225037 -224374 -225823 -225200 -225644 -227361 -229077 -228423 -228779 -219213 -212882
5698 -212882 -212678 -216781 -218985 -216284 -215028 -217095 -218529 -221784 -221212 -215909 -214512 -216844 -215310 -216376 -220738
5683 -220738 -218153 -218047 -214392 -211219 -210783 -213684 -221412 -220974 -216797 -216037 -218068 -225594 -225153 -224879 -222450 -219421
5667 -219421 -213763 -216133 -219712 -220217 -224242 -228676 -226449 -222834 -218192 -214903 -218819 -222143 -223703 -224274 -219623
5652 -219623 -219467 -216788 -215006 -216771 -216663 -212935 -211231 -213398 -216792 -215663 -210281 -209469 -213034 -216357 -219959
5637 -219959 -223077 -225948 -221315 -217882 -218580 -216591 -215992 -214652 -214711 -214440 -210782 -208181 -210485 -216545 -218503 -220757
5621 -220757 -224681 -226186 -221345 -218986 -219834 -218142 -214135 -218032 -218906 -221408 -219506 -218904 -221699 -220061 -215950
5606 -215950 -213264 -211875 -214994 -214087 -212352 -205436 -202976 -207865 -208583 -210016 -213916 -211496 -207492 -210622 -213248
5591 -213248 -214509 -215023 -212581 -214082 -218200 -216892 -214637 -211796 -210859 -210094 -212335 -215851 -218003 -213128 -210511
5576 -210511 -212512 -216039 -216670 -218041 -217725 -216826 -209930 -206856 -209449 -210026 -214705 -215167 -213578 -215327 -213112 -211247
5560 -211247 -212048 -212131 -216121 -217855 -215883 -214629 -213305 -217522 -215709 -213865 -217615 -213150 -212130 -212679 -212195 -210719
5544 -210719 -209585 -210926 -210059 -209464 -215006 -217006 -212560 -207212 -208826 -210847 -213941 -217085 -214663 -208983 -204238
5529 -204238 -203194 -210652 -215036 -210688 -209392 -211568 -211739 -210183 -212479 -214527 -217598 -215565 -213800 -217529 -215671
5514 -215671 -210780 -212164 -214017 -212860 -212854 -210535 -205895 -206049 -207984 -212706 -217728 -217935 -216304 -215877 -214810 -215713
5498 -215713 -217565 -216145 -215061 -211304 -207603 -211267 -210455 -211627 -216363 -216257 -217436 -219104 -219360 -215825 -215283
5483 -215283 -213404 -213634 -213651 -211688 -205877 -206351 -209538 -212065 -210401 -212413 -214351 -209595 -207856 -206386 -207724
5468 -207724 -210898 -213818 -210548 -206493 -204925 -204477 -202611 -204167 -203284 -203100 -207816 -212386 -211973 -208306 -210483
5453 -210483 -210468 -204994 -204991 -205287 -203852 -204275 -201822 -201472 -202132 -198542 -197230 -201031 -203528 -209086 -214302 -216916 -216272
5436 -216272 -214106 -214606 -213744 -208728 -206211 -206373 -209431 -212547 -208571 -209836 -210422 -210753 -206199 -204910 -206584 -208503
5420 -208503 -207413 -207737 -204692 -204788 -203649 -205027 -208075 -206263 -203807 -202339 -205554 -206483 -204150 -201555 -208869
5405 -208869 -210830 -210148 -209709 -207447 -207970 -210394 -208351 -205499 -205803 -202249 -198410 -200878 -206267 -212161 -214808
5390 -214808 -213593 -211706 -207044 -207494 -209475 -210637 -212740 -211424 -208998 -206749 -204787 -205752 -209870 -210917 -214731
5375 -214731 -212858 -209970 -209572 -206357 -200831 -203011 -208767 -207915 -207266 -209324 -212399 -217035 -210483 -208060 -206145
5360 -206145 -200956 -202921 -208541 -207490 -203137 -202562 -203798 -205409 -202624 -201765 -206584 -207309 -206005 -207627 -208482
5345 -208482 -206071 -208385 -206841 -207048 -208330 -208791 -208158 -205375 -204879 -203433 -204940 -208811 -209862 -213434 -214100 -211639
5329 -211639 -213467 -210016 -206914 -205399 -205397 -201198 -201466 -199772 -199195 -196368 -199129 -205842 -207411 -206321 -204886 -205615
5313 -205615 -208385 -209021 -208669 -210768 -209459 -210805 -213863 -213033 -206876 -203664 -206286 -204994 -200294 -199659 -205799
5298 -205799 -207031 -204729 -205650 -205870 -202712 -196711 -196870 -200060 -202481 -203939 -201319 -199186 -196431 -200883 -205406
5283 -205406 -202135 -200814 -201480 -202755 -206412 -205670 -202171 -202389 -204267 -210699 -208102 -210264 -211813 -212983 -211044
5268 -211044 -208368 -204254 -198801 -196688 -199190 -200535 -201209 -202618 -204332 -208521 -209813 -203951 -204837 -202848 -200910
5253 -200910 -199711 -203168 -206515 -204383 -202751 -200314 -199999 -203910 -205748 -203644 -201808 -203599 -204761 -204114 -204341
5238 -204341 -201286 -201239 -207829 -209244 -202198 -198555 -197171 -198862 -200568 -200121 -199552 -200139 -205190 -205978 -203848 -199705
5222 -199705 -195560 -195453 -198559 -197191 -202581 -203413 -194480 -196166 -204855 -204550 -204540 -200916 -198960 -198810 -198295 -198394 -201555
5205 -201555 -201578 -200606 -199548 -196929 -195117 -197406 -199031 -201743 -203947 -195146 -191716 -191074 -194288 -196258 -197804
5190 -197804 -199425 -195127 -195860 -200020 -203142 -197616 -193738 -197446 -199264 -200458 -203904 -204176 -200122 -195691 -191019
5175 -191019 -192220 -195936 -195576 -199240 -200034 -194098 -197936 -200029 -203292 -208796 -209834 -210457 -211243 -216749 -214626
5160 -214626 -206442 -203028 -205603 -211225 -206482 -202092 -204223 -201990 -199155 -197505 -199920 -197160 -192968 -193552 -192452
5145 -192452 -192972 -196435 -194192 -190509 -193897 -198786 -198656 -196413 -196377 -194849 -193593 -196404 -198519 -203488 -202515 -200646
5129 -200646 -197970 -198217 -197869 -200106 -200649 -195858 -194188 -193226 -193832 -193223 -198375 -201365 -198665 -201604 -204244 -197867
5113 -197867 -195183 -197920 -197662 -195865 -194805 -200667 -200552 -197315 -193882 -189523 -188607 -189564 -190656 -195349 -197770
5098 -197770 -199219 -203282 -200104 -198687 -195325 -192840 -192990 -196144 -194447 -191123 -188564 -186140 -189239 -187280 -191106
5083 -191106 -189653 -189031 -192439 -192801 -192100 -195026 -197240 -194209 -186489 -182538 -183653 -189048 -192025 -185569 -188153
5068 -188153 -195751 -198226 -197014 -193456 -189683 -188674 -189888 -191612 -194390 -198376 -195994 -192704 -188784 -186744
5054 -186744 -191892 -188822 -192392 -193686 -193024 -194776 -196067 -194517 -195484 -197469 -195344 -198412 -203375 -202449 -197902
5039 -197902 -199332 -197041 -196359 -191607 -190972 -196215 -198406 -197234 -193776 -191523 -195157 -195237 -195750 -198996 -198728 -199417
5023 -199417 -198295 -196588 -196119 -193102 -189251 -185245 -187598 -191379 -189879 -185972 -186490 -186290 -189853 -191770 -194232
5008 -194232 -192944 -192046 -193103 -192769 -192327 -192655 -196320 -196875 -198717 -199258 -196850 -194987 -195312 -191880 -190585 -192058
4992 -192058 -195712 -196515 -195592 -191083 -187772 -191696 -188480 -187870 -186939 -184985 -188581 -191874 -191589 -190476 -191197 -193433
4976 -193433 -192708 -189970 -187441 -185115 -189500 -195959 -198050 -198666 -196846 -197248 -198954 -198012 -197676 -195616 -192299 -195120
4960 -195120 -195214 -193571 -193361 -195710 -196200 -193518 -195145 -197539 -194293 -188984 -185005 -185790 -188928 -189903 -188689 -190244
4944 -190244 -194018 -192947 -187347 -187975 -191540 -195781 -197747 -192683 -190116 -190030 -195453 -198691 -192775 -187214 -187023
4929 -187023 -183209 -182050 -186411 -190862 -187751 -189391 -193612 -190955 -186972 -184726 -183778 -182263 -179255 -181353 -184133
4914 -184133 -186687 -188089 -189933 -189936 -186724 -188826 -191934 -191556 -191077 -194944 -194596 -192524 -195079 -197791 -195829 -191030
4898 -191030 -187254 -186556 -187079 -185291 -188730 -186686 -181172 -180426 -183073 -184815 -185243 -187946 -190937 -189293 -183900
4883 -183900 -181204 -185481 -186043 -188180 -189262 -190185 -192653 -191126 -193449 -195361 -191472 -186268 -186517 -191888 -192342
4868 -192342 -188381 -189241 -185839 -187910 -192798 -194336 -195498 -194852 -191841 -189249 -188528 -189423 -186085 -184983 -185958 -186871
4852 -186871 -193261 -187474 -181722 -179087 -183463 -185595 -187727 -187642 -189577 -192031 -189757 -189411 -194186 -193216 -190522
4837 -190522 -188983 -187708 -188748 -190643 -191017 -193766 -190470 -186457 -186456 -192854 -191337 -190326 -188814 -184166 -182391
4822 -182391 -181993 -183595 -187277 -189390 -188631 -189445 -190521 -192574 -192338 -196093 -193320 -191421 -187929 -187441 -186614 -188588
4806 -188588 -190754 -192766 -192161 -189200 -190189 -190129 -186089 -185633 -185828 -190697 -191543 -190200 -190677 -188519 -185017 -181969
4790 -181969 -183307 -182308 -185491 -187704 -186206 -186475 -183114 -178702 -179948 -183985 -187039 -187648 -188443 -189030 -188462 -187897
4774 -187897 -189303 -189228 -184697 -183414 -182215 -179868 -178790 -182007 -187159 -189941 -186318 -185629 -188641 -190532 -195099
4759 -195099 -196903 -192898 -188289 -185750 -179761 -177122 -176185 -176137 -177630 -180443 -182595 -184589 -186195 -184514 -183273
4744 -183273 -182453 -185850 -185692 -182835 -183428 -185796 -187682 -190255 -192094 -190234 -186753 -185291 -180249 -177304 -184308
4729 -184308 -186255 -188713 -186283 -186563 -183944 -183107 -182885 -185818 -190141 -189794 -190511 -193095 -192278 -186390 -181171 -177932
4713 -177932 -180282 -184430 -187408 -187013 -188219 -186931 -186388 -185551 -182353 -180863 -184279 -188691 -191769 -190834 -189018
4698 -189018 -191002 -192243 -192153 -191787 -188406 -187673 -188306 -184329 -183078 -178752 -172632 -175831 -180483 -179563 -179476 -181937
4682 -181937 -180318 -177283 -173492 -175243 -182811 -183026 -178931 -177350 -179396 -180398 -177378 -178224 -179547 -181970 -187191
4667 -187191 -190763 -191686 -190130 -188183 -187200 -187738 -187594 -185736 -187407 -184281 -184680 -181041 -178641 -177623 -180385 -183470
4651 -183470 -185639 -190297 -185796 -179558 -179335 -182591 -181180 -182070 -187221 -187715 -191369 -189214 -187256 -185321 -187069
4636 -187069 -185460 -182959 -179368 -178164 -177760 -176969 -179315 -178464 -177223 -177360 -181205 -179703 -176491 -171351 -172957
4621 -172957 -178318 -180844 -179758 -181316 -179659 -178629 -182114 -182072 -177817 -176985 -177049 -182596 -186305 -185617 -182948 -178392
4605 -178392 -174860 -174671 -178509 -177568 -174622 -177212 -174635 -175825 -178000 -174188 -178505 -182130 -181721 -179214 -175225
4590 -175225 -179321 -185448 -187234 -184703 -184321 -183016 -181971 -183618 -184039 -184225 -181229 -184220 -179260 -175015 -178021
4575 -178021 -175948 -173246 -176984 -177402 -177728 -178139 -180788 -184300 -189356 -190929 -189636 -185185 -181888 -184068 -184698
4560 -184698 -185557 -183204 -177455 -171810 -172706 -174385 -176011 -175264 -177621 -176343 -178400 -180579 -182179 -180531 -183471
4545 -183471 -185502 -188108 -189199 -185686 -180282 -178384 -181730 -176411 -178264 -180021 -180103 -180768 -181820 -180753 -182031
4530 -182031 -180864 -182201 -185562 -183065 -179912 -178763 -176289 -174697 -174874 -175496 -182818 -184470 -181026 -181361 -181739
4515 -181739 -183419 -182901 -179321 -172955 -173191 -172319 -176696 -179417 -181462 -178066 -177214 -177113 -176287 -175641 -175824 -173223
4499 -173223 -170627 -168556 -175673 -184763 -182682 -178787 -172564 -173185 -176111 -173800 -173022 -176076 -180495 -182367 -179426
4484 -179426 -178780 -178290 -176273 -181362 -178973 -176329 -176144 -178494 -177468 -175170 -173494 -176968 -176192 -178579 -178814 -178175
4468 -178175 -177352 -178078 -179496 -182164 -182739 -178768 -178648 -180683 -178797 -181959 -183377 -185175 -187897 -185577 -175123
4453 -175123 -171053 -167605 -167051 -174845 -180468 -184316 -185136 -178142 -178211 -177598 -175214 -171316 -173940 -179834 -180794 -178116
4437 -178116 -176018 -173145 -172775 -174039 -175443 -176901 -174583 -174049 -175380 -175939 -178881 -175381 -175163 -177404 -176238
4422 -176238 -177578 -180592 -181607 -179880 -180282 -181154 -175892 -169484 -166857 -169697 -176325 -175995 -177269 -177073 -175310
4407 -175310 -178697 -184944 -184334 -183920 -183342 -180372 -174410 -173921 -174035 -171429 -172530 -178386 -179599 -178367 -176290 -172476
4391 -172476 -172381 -171090 -173303 -172587 -176458 -177638 -178310 -179572 -173173 -170162 -171037 -172652 -175269 -172631 -168766 -169687
4375 -169687 -173207 -174282 -172941 -177270 -184679 -184457 -179861 -176259 -178250 -175592 -169312 -169074 -170026 -173549 -176324
4360 -176324 -175999 -173110 -173747 -178531 -177841 -175122 -174909 -174284 -177177 -176440 -176357 -176398 -175652 -176282 -175605 -173519 -176671 -181053
4342 -181053 -182031 -182716 -184500 -184139 -182637 -178629 -176184 -177670 -177434 -178446 -178917 -176752 -175662 -174406 -175895 -175229
4326 -175229 -178740 -177261 -174294 -173120 -175987 -179280 -182798 -179012 -172878 -170128 -172342 -177037 -174878 -178696
4312 -178696 -182925 -182803 -180559 -173938 -176629 -176315 -177784 -177493 -175674 -176743 -171882 -169182 -173191 -176320 -175427
4297 -175427 -172924 -169744 -168721 -168483 -168360 -172480 -172306 -171319 -170583 -173067 -179301 -179811 -179597 -177544 -173665 -173034
4281 -173034 -170536 -169475 -169138 -167304 -164634 -164692 -164901 -166559 -169103 -169070 -171622 -172459 -172014 -171913 -170670 -168516 -163781
4264 -163781 -164030 -165601 -164562 -170271 -178383 -179009 -183621 -186903 -182503 -178192 -173055 -172371 -169623 -167562 -169597
4249 -169597 -165732 -166908 -172304 -172933 -167332 -166334 -166833 -170832 -174519 -173013 -175912 -178114 -176177 -177823 -179015
4234 -179015 -174561 -172232 -171263 -167982 -166374 -168711 -170920 -171154 -176345 -177350 -175256 -174057 -171424 -166803 -169453
4219 -169453 -168470 -166246 -169752 -174146 -172907 -167771 -169620 -171990 -169444 -167886 -171050 -174327 -172899 -170146 -168573
4204 -168573 -168887 -169880 -171134 -176345 -175886 -173623 -175442 -171160 -167826 -164613 -167032 -170767 -168329 -168452 -169309 -166204
4188 -166204 -168168 -174698 -178487 -176308 -173060 -170956 -168309 -168163 -168537 -168938 -170112 -166251 -165251 -168434 -169882
4173 -169882 -166930 -167557 -169433 -168797 -169061 -167613 -166544 -167645 -172304 -174801 -172727 -171076 -169356 -170751 -171489
4158 -171489 -170182 -168502 -171256 -175928 -173199 -171878 -172828 -173954 -176883 -177272 -169914 -165811 -166058 -168671 -168483
4143 -168483 -170376 -170136 -170862 -171873 -172536 -172191 -170942 -171055 -173811 -172948 -171081 -168770 -166712 -167905 -165832 -160388
4127 -160388 -161606 -165046 -166291 -171266 -174142 -174856 -169688 -164656 -164412 -165238 -166157 -163200 -162943 -163546 -165517 -171771
4111 -171771 -171273 -168628 -167634 -169209 -168581 -166490 -166315 -167291 -168445 -170570 -169613 -169082 -167081 -164148 -159055 -161722
4095 -161722 -164840 -165921 -165740 -172890 -176988 -177575 -175303 -175427 -175383 -174775 -170950 -168659 -165169 -162092 -164232 -167719
4079 -167719 -166301 -169236 -170566 -166054 -166485 -169176 -172727 -174958 -174954 -173360 -168525 -170426 -172098 -175674 -169813
4064 -169813 -162496 -163329 -164188 -166622 -167397 -166708 -168025 -167911 -168528 -170865 -170948 -171461 -170103 -167770 -165036 -168296 -168934
4047 -168934 -168833 -167593 -165298 -161749 -162415 -165016 -168125 -175167 -174697 -169409 -171601 -174028 -167924 -166118 -166439
4032 -166439 -168527 -168973 -167088 -163237 -159947 -163987 -169548 -172779 -172745 -172013 -170909 -175445 -173122 -163413 -160778
4017 -160778 -164076 -162714 -168422 -169553 -171533 -170395 -171941 -173496 -173390 -172578 -170071 -169044 -165712 -163730 -161767
4002 -161767 -166751 -170250 -173892 -170669 -163439 -163731 -161382 -159339 -162296 -169904 -172687 -170535 -164382 -165242 -161835
3987 -161835 -158369 -159095 -162441 -164628 -167255 -165804 -167846 -174552 -170556 -165977 -164707 -166406 -169153 -165008 -163809
3972 -163809 -162082 -161564 -165725 -168966 -166637 -166539 -164804 -165766 -165172 -164193 -161533 -159680 -165644 -168835 -166666 -159951
3956 -159951 -159129 -163942 -167185 -165944 -165160 -167840 -164802 -165605 -164821 -163879 -164225 -163960 -159055 -156002 -158995 -160801
3940 -160801 -161219 -164168 -165682 -161879 -156562 -152861 -153253 -154230 -152381 -152793 -152564 -156137 -157080 -161213 -163165 -160084
3924 -160084 -162491 -162505 -161250 -164701 -166969 -162534 -163971 -164558 -162517 -159685 -159952 -165827 -166484 -163621 -167800 -171643
3908 -171643 -169569 -165973 -163920 -164018 -163148 -161468 -165748 -166939 -164214 -161297 -160957 -163724 -168208 -170061 -165780
3893 -165780 -170669 -172475 -167199 -163176 -163622 -168417 -168490 -163937 -161458 -162779 -167834 -168417 -168175 -165842 -163071 -161815
3877 -161815 -161165 -165756 -165539 -161129 -160641 -160411 -159429 -157507 -156896 -160797 -163054 -161026 -158072 -161024 -158696 -156237
3861 -156237 -160963 -163899 -163407 -162277 -161966 -161564 -162632 -167691 -171346 -167726 -166290 -164533 -160378 -152909 -152900 -156947
3845 -156947 -159621 -164382 -164387 -159862 -159314 -161019 -159444 -160963 -165114 -161176 -159737 -159032 -160460 -160079 -160999 -165969
3829 -165969 -171420 -169660 -170943 -169069 -163968 -167888 -171982 -166408 -163181 -161541 -162468 -162840 -167523 -168976 -166537
3814 -166537 -165450 -164831 -162473 -159243 -160341 -162021 -165864 -160721 -159729 -159915 -161196 -160228 -161878 -160677 -162313
3799 -162313 -161567 -158030 -157476 -159281 -158696 -163550 -163547 -161702 -160966 -161990 -162576 -160864 -160783 -162650 -159830 -156579 -157073
3782 -157073 -156747 -156066 -153781 -150500 -151557 -154827 -152828 -154246 -159891 -159928 -160419 -156140 -157109 -159718 -162073 -160405
3766 -160405 -158151 -150265 -150062 -159102 -159248 -157816 -162850 -165003 -161703 -164668 -166785 -167742 -164449 -162199 -165315
3751 -165315 -164215 -160213 -156989 -160255 -162350 -163784 -165674 -165401 -164515 -167568 -166231 -167437 -165795 -162817 -155697
3736 -155697 -153824 -155255 -157388 -159546 -161211 -161976 -160293 -155660 -155730 -158165 -156251 -157902 -161967 -162191 -162288 -158818
3720 -158818 -155696 -160113 -166733 -165114 -160879 -154970 -151883 -153276 -157463 -161342 -158661 -155582 -153829 -153053 -156526
3705 -156526 -158350 -160193 -159288 -161214 -162848 -161510 -153280 -151501 -154705 -153448 -150637 -151347 -153187 -161370 -166381
3690 -166381 -164871 -157254 -157665 -155338 -149125 -146914 -152348 -153443 -158819 -168749 -170489 -163868 -155297 -154541 -155881
3675 -155881 -150284 -153560 -156742 -159665 -167284 -170048 -167552 -163800 -160603 -160151 -159653 -162448 -159326 -160750 -159950
3660 -159950 -158407 -156336 -155715 -152376 -152765 -160036 -161547 -156009 -154986 -157842 -160420 -159455 -156241 -155234 -156178
3645 -156178 -155244 -151922 -151343 -150282 -153466 -155717 -157245 -152881 -149121 -148194 -151853 -157320 -159959 -157765 -156349
3630 -156349 -157834 -157923 -157813 -155618 -155752 -157508 -157364 -158374 -161876 -161478 -159844 -162348 -165024 -164438 -164759 -163896 -162424
3613 -162424 -160102 -159375 -156403 -155610 -153929 -153559 -148231 -146418 -146378 -146760 -148035 -151992 -152317 -155609 -155747 -159306
3597 -159306 -164018 -161538 -156897 -157303 -157856 -157353 -154541 -154393 -157155 -158866 -159305 -160697 -163922 -165223 -166568 -167896
3581 -167896 -168569 -166436 -163268 -164039 -165418 -163303 -160451 -160265 -157014 -160438 -162652 -160816 -159302 -156406 -152548
3566 -152548 -156967 -158816 -160214 -158228 -157301 -152892 -148826 -150206 -149258 -151242 -157521 -157156 -154625 -154176 -156948
3551 -156948 -160518 -159720 -159351 -160059 -161560 -159247 -154257 -148908 -150189 -148175 -150626 -153170 -154022 -154619 -155415 -159160
3535 -159160 -163501 -160419 -157121 -153615 -150746 -151607 -153098 -154886 -155441 -152305 -154881 -160360 -156302 -154691 -159046
3520 -159046 -158830 -154504 -155889 -156337 -158961 -156330 -154134 -155773 -160861 -162680 -162525 -158569 -157625 -159052 -156916
3505 -156916 -156212 -156849 -156273 -153554 -152728 -154140 -156361 -156162 -157432 -158959 -161512 -158201 -157378 -160437 -168210 -167519
3489 -167519 -160334 -157032 -156039 -154838 -154544 -155588 -158750 -162002 -159792 -157608 -159486 -153803 -149151 -150485 -158936
3474 -158936 -157323 -149093 -146246 -149979 -155914 -153961 -150644 -151528 -153763 -153107 -154423 -157264 -155404 -151460 -154231
3459 -154231 -155749 -155475 -157522 -157502 -158919 -157499 -153276 -153864 -155951 -157470 -154497 -154800 -152746 -151012 -152890 -156631
3443 -156631 -151468 -146160 -147905 -152343 -151452 -154857 -157208 -157200 -156185 -156860 -156804 -156600 -154516 -152701 -151982 -153902 -154425
3426 -154425 -158249 -152431 -146134 -145921 -144872 -145147 -147835 -152843 -156861 -157226 -158922 -155723 -154120 -155308 -158472
3411 -158472 -158141 -153119 -152539 -151816 -150267 -152563 -155008 -151886 -146988 -149628 -154081 -152490 -149672 -149570 -145444
3396 -145444 -141633 -146948 -144408 -142911 -149447 -154953 -154251 -153323 -152539 -152923 -152185 -152358 -150048 -147519 -150155 -152190
3380 -152190 -146375 -143145 -146710 -149951 -152244 -157289 -152118 -145831 -149364 -149655 -148448 -143916 -144782 -143664 -145374
3365 -145374 -145530 -146937 -150123 -150784 -148958 -147350 -150167 -150639 -152683 -155708 -157901 -159332 -164035 -158924 -153276
3350 -153276 -152756 -149552 -148428 -152131 -156074 -154522 -155712 -154923 -154682 -152865 -153943 -152478 -153978 -159344 -155772
3335 -155772 -153420 -152076 -153601 -154947 -155429 -156512 -154129 -152804 -154722 -156910 -157544 -156103 -155196 -159041 -158414
3320 -158414 -155487 -154717 -153759 -155248 -150949 -145695 -146857 -146706 -143864 -146314 -146787 -148036 -151565 -154777 -152292
3305 -152292 -146164 -143555 -144144 -151529 -154558 -151078 -153653 -155727 -153720 -155238 -155565 -153190 -156540 -159083 -152983
3290 -152983 -148351 -148114 -149621 -153837 -152532 -146620 -145903 -148703 -148295 -145907 -147791 -148508 -149094 -151399 -151957 -148557
3274 -148557 -145603 -146899 -148036 -147153 -152206 -151660 -150558 -150831 -154060 -154680 -151377 -151315 -154143 -150155 -143933 -147840
3258 -147840 -153219 -154133 -146721 -144140 -146464 -149372 -151047 -149486 -146442 -143069 -141219 -146968 -154877 -155128 -152978
3243 -152978 -149845 -145898 -150919 -155495 -156848 -160752 -161113 -155880 -157345 -155510 -155806 -154311 -153752 -150936 -147148
3228 -147148 -143995 -144978 -148594 -147713 -147054 -149569 -150018 -147312 -149347 -149147 -149814 -146979 -145831 -147309 -150352 -150751
3212 -150751 -145006 -140852 -142553 -148699 -152951 -151331 -150386 -149444 -150452 -148180 -147219 -145069 -146012 -151928 -155794
3197 -155794 -154072 -151044 -147250 -148974 -149567 -146824 -148026 -152447 -150284 -152679 -158591 -161428 -157237 -149392 -148961
3182 -148961 -155508 -159252 -151496 -143066 -139816 -139493 -142605 -139895 -145263 -145588 -142412 -145698 -149420 -146858 -143505
3167 -143505 -149135 -151890 -152320 -151074 -146032 -146565 -146934 -145553 -145887 -142556 -139007 -135548 -134463 -135836 -138302
3152 -138302 -137835 -142184 -148212 -148016 -147131 -147728 -146643 -148211 -150943 -150253 -149485 -150905 -155987 -157163 -156127 -150248
3136 -150248 -148437 -148867 -148949 -151150 -151102 -152360 -157301 -155408 -155860 -158404 -156262 -151751 -151323 -148141 -148553 -146185
3120 -146185 -147340 -153239 -152444 -146419 -145582 -146036 -145085 -147833 -147504 -146860 -147427 -148762 -149436 -150048 -150161 -152309 -152685
3103 -152685 -149101 -144157 -144850 -146783 -147652 -146490 -147450 -145781 -146901 -144071 -141793 -145344 -146258 -147081 -148276 -151248
3087 -151248 -151001 -147254 -146557 -151797 -155020 -152534 -151476 -145352 -143048 -141417 -141812 -143967 -147498 -147250 -147009 -146048
3071 -146048 -146028 -148775 -144539 -140543 -142348 -146412 -144925 -141768 -144081 -151804 -151510 -151844 -152123 -156540 -154617 -153980
3055 -153980 -154288 -152745 -152103 -151826 -143662 -138848 -140787 -140249 -145751 -149763 -150282 -148028 -143124 -139812 -142060 -144637
3039 -144637 -147390 -149037 -151175 -154728 -152429 -149483 -150328 -149246 -145724 -146129 -154018 -154303 -155471 -152900 -153645
3024 -153645 -157318 -155113 -152376 -152733 -147892 -141974 -144502 -146776 -146536 -145727 -144551 -145905 -146098 -144315 -143456 -146994
3008 -146994 -148314 -149810 -148292 -149987 -146883 -145695 -149676 -150189 -146246 -135901 -137283 -139523 -137336 -135625
2994 -135625 -139646 -143713 -139701 -139797 -142983 -146123 -147341 -152640 -155400 -152010 -151551 -148570 -146196 -142491 -145086
2979 -145086 -145030 -143812 -144412 -150252 -153106 -151894 -152745 -151580 -146154 -138937 -140007 -143160 -140712 -140883 -143459 -145911
2963 -145911 -145120 -146175 -149052 -148372 -149804 -152853 -154849 -154452 -151396 -149489 -142263 -143111 -142425 -144491 -144877 -147883
2947 -147883 -144376 -140371 -141368 -143607 -150941 -150544 -145375 -148119 -147698 -142214 -136472 -134424 -140286 -144156 -139291
2932 -139291 -140358 -144013 -145547 -144949 -143708 -147956 -149326 -145633 -143993 -148599 -145353 -141397 -146421 -149464 -149667
2917 -149667 -149016 -148715 -145178 -144553 -141603 -139330 -138980 -138399 -136275 -140190 -140117 -144022 -145498 -144974 -145097 -143404 -141199
2900 -141199 -139983 -145432 -141854 -141716 -146428 -146944 -147239 -147286 -145159 -145415 -148154 -143921 -139866 -137287 -138818 -140615
2884 -140615 -143738 -139831 -140064 -143276 -141887 -138460 -143306 -143273 -144731 -145385 -143576 -136308 -133933 -137659 -142456
2869 -142456 -145466 -146676 -144947 -143106 -144206 -143471 -140341 -139741 -138722 -143463 -145001 -141668 -138244 -140234 -136725
2854 -136725 -134135 -134124 -136130 -137071 -132977 -135648 -143400 -145037 -144560 -141045 -144319 -145521 -143924 -143470 -143785 -149520
2838 -149520 -148874 -147194 -151098 -148560 -142514 -136215 -133569 -135102 -137660 -140045 -140419 -139840 -145165 -147847 -152172
2823 -152172 -152006 -146521 -142948 -142528 -143211 -142639 -140206 -140789 -141155 -144038 -146199 -145499 -148571 -145080 -145319 -146678
2807 -146678 -143967 -139335 -137920 -141435 -141959 -136053 -132716 -130279 -129245 -130917 -133737 -136945 -136731 -137558 -138934
2792 -138934 -147127 -151975 -151633 -149792 -149208 -147737 -146630 -142919 -141478 -142697 -143266 -141904 -143560 -141398 -141279
2777 -141279 -144825 -142844 -140978 -140398 -140164 -140065 -138795 -137661 -134777 -138808 -137520 -135594 -136993 -141107 -142006 -137705
2761 -137705 -140835 -144366 -142690 -140603 -139036 -134048 -133476 -137749 -139811 -138876 -134951 -134482 -131938 -133455 -132917
2746 -132917 -135442 -139560 -139545 -135009 -135375 -138296 -139510 -141343 -137389 -136336 -138866 -139505 -141436 -141766 -141123 -137705
2730 -137705 -140047 -141727 -137945 -142719 -142869 -140154 -135141 -135819 -139337 -141993 -142674 -142291 -142573 -143666 -137992 -134625
2714 -134625 -135630 -138732 -139720 -136732 -140764 -139426 -136812 -137438 -138314 -141149 -145664 -148182 -147998 -142305 -133808
2699 -133808 -135728 -136952 -134693 -138546 -140972 -140393 -140808 -140932 -142367 -141312 -138447 -141591 -142516 -142321 -145968 -144616
2683 -144616 -141166 -137822 -139497 -141822 -143100 -145843 -145254 -143683 -144787 -146816 -146590 -145885 -142697 -143545 -145983
2668 -145983 -142679 -143435 -147870 -148168 -145670 -147098 -143538 -143113 -147697 -142737 -138693 -141126 -144798 -148956 -149016 -144203
2652 -144203 -141117 -144458 -147143 -142926 -139487 -139805 -142957 -146432 -144898 -142611 -147449 -151323 -150752 -148399 -149943
2637 -149943 -149826 -147354 -138422 -134181 -136746 -138653 -142268 -142102 -137779 -131985 -132993 -132019 -131629 -132629 -134887
2622 -134887 -137717 -139922 -137831 -135608 -135696 -135030 -134161 -137241 -139848 -135492 -133349 -134737 -138856 -138328 -140772 -140573
2606 -140573 -136047 -134087 -133990 -135329 -139169 -141829 -141137 -136992 -134469 -133570 -134687 -133253 -136812 -137879 -139456
2591 -139456 -139838 -135821 -133604 -131824 -130953 -133652 -135612 -141168 -142873 -139655 -138400 -136921 -136822 -136845 -140784 -142716
2575 -142716 -145431 -146584 -145541 -141890 -140516 -139236 -139869 -141821 -143677 -143002 -140761 -141691 -142223 -137901 -132210
2560 -132210 -133031 -135873 -135569 -134693 -133701 -136180 -136075 -137650 -138356 -136317 -133363 -133698 -135939 -135676 -138862 -138908 -137648
2543 -137648 -135772 -130917 -127194 -128868 -134145 -134858 -134494 -132905 -133625 -137978 -136375 -133129 -131926 -133053 -134293
2528 -134293 -133207 -138094 -141828 -143841 -141859 -138628 -138992 -144290 -142892 -138218 -136889 -138866 -141405 -139226 -141412
2513 -141412 -140425 -134238 -133591 -135482 -139962 -141275 -139427 -132093 -130690 -139019 -140684 -141736 -142754 -146756 -141495
2498 -141495 -139462 -141580 -141064 -141108 -138843 -132553 -128674 -131053 -134213 -133202 -125966 -127769 -131526 -134987 -135118
2483 -135118 -131723 -132534 -137252 -135141 -128392 -129557 -134099 -140584 -146730 -142716 -141623 -140709 -137907 -135214 -129792
2468 -129792 -127805 -127636 -131106 -130970 -131804 -133087 -137528 -136499 -138558 -139652 -134337 -128875 -127736 -128886 -133538
2453 -133538 -138882 -136606 -127857 -126006 -128667 -128257 -128059 -130412 -128822 -133731 -140481 -137915 -136460 -139095 -140498
2438 -140498 -146507 -142017 -135658 -131928 -132343 -129568 -132053 -136818 -139699 -141557 -140577 -133340 -133798 -139388 -139787
2423 -139787 -137199 -136939 -139616 -142921 -138493 -132116 -131533 -130541 -128227 -126989 -128222 -131712 -131623 -132319 -135212 -134961
2407 -134961 -133526 -136541 -137618 -134103 -135348 -135663 -134454 -132539 -129710 -129374 -130854 -132724 -136072 -139017 -139991
2392 -139991 -134974 -135892 -138906 -139660 -137155 -143852 -139430 -137910 -139039 -137564 -140634 -142740 -138660 -138771 -140664
2377 -140664 -139710 -135957 -130526 -130907 -137223 -137602 -135839 -138107 -137533 -136462 -135346 -131043 -128841 -132065 -134771
2362 -134771 -138025 -138613 -137142 -137184 -137493 -136657 -136601 -139862 -139213 -138369 -136602 -132166 -131575 -129398 -125509 -130346 -127860
2345 -127860 -130237 -134285 -137202 -136879 -134648 -136763 -135019 -133770 -136604 -135176 -132089 -130442 -133925 -134141 -130892
2330 -130892 -131319 -132211 -131023 -132173 -135402 -135189 -133092 -131667 -128742 -135139 -138279 -137376 -137282 -136779 -136985 -136334 -134464
2313 -134464 -133897 -133288 -128671 -126699 -127706 -128993 -133492 -137396 -138100 -138426 -137801 -135758 -132739 -131273 -133466 -131515
2297 -131515 -133227 -132626 -132977 -135158 -133850 -133300 -135503 -133633 -126567 -126673 -129761 -127399 -133376 -135327 -133360
2282 -133360 -135319 -138428 -134505 -132294 -136455 -133942 -132863 -137173 -138511 -139386 -135926 -128359 -127306 -130646 -129020
2267 -129020 -127974 -130755 -132057 -127996 -126327 -124362 -123750 -126734 -128893 -131513 -133252 -130224 -123502 -122100 -127462
2252 -127462 -132128 -130506 -130756 -129126 -131465 -131216 -129890 -130139 -129423 -127452 -132258 -134215 -130338 -130896 -131309 -135864
2236 -135864 -139813 -135963 -136405 -135234 -130705 -128853 -132510 -137357 -136848 -135962 -138657 -139233 -138233 -137411 -133690 -137227
2220 -137227 -139429 -139729 -138991 -142962 -143209 -138799 -140225 -138249 -135802 -140097 -138786 -140215 -139342 -138829 -136450 -135711
2204 -135711 -134658 -133643 -134482 -133595 -130311 -127943 -133315 -129506 -130806 -132287 -132567 -134240 -133410 -127502 -125187
2189 -125187 -129851 -134369 -133936 -134436 -134223 -128286 -124664 -124426 -129622 -131247 -125037 -128037 -133271 -131232 -133090
2174 -133090 -135462 -134609 -132911 -128182 -128421 -126883 -131430 -133783 -133474 -133052 -135153 -132964 -130461 -132895 -134788
2159 -134788 -131594 -126151 -124954 -124012 -119959 -120494 -125784 -129104 -124114 -124053 -129858 -131544 -130118 -127896 -129855
2144 -129855 -126447 -127207 -127434 -127732 -127734 -126788 -128056 -125638 -126825 -133587 -134543 -128622 -127102 -133460 -135338 -132465
2128 -132465 -128489 -130260 -133264 -134477 -133450 -129028 -129578 -133279 -134315 -135513 -132634 -127550 -123988 -121807 -127249
2113 -127249 -128480 -131030 -131162 -130089 -129921 -132994 -138731 -141336 -138058 -138156 -136574 -133471 -135601 -137225 -136566 -132219
2097 -132219 -135121 -132303 -131514 -127842 -122760 -121233 -123804 -124139 -124394 -127231 -130196 -132639 -131121 -130924 -130168 -127285
2081 -127285 -130238 -131043 -132343 -134155 -133762 -130610 -127082 -126656 -129143 -129441 -132629 -133895 -133050 -130995 -131658 -133356
2065 -133356 -132951 -133467 -133177 -130795 -131716 -135219 -134368 -132165 -128175 -128313 -130545 -130231 -129321 -130647 -127630 -130842
2049 -130842 -131394 -126999 -129405 -131463 -131405 -128140 -125315 -125338 -129282 -134000 -133856 -130309 -132183 -138147 -133643 -127851
2033 -127851 -127729 -128261 -126238 -124916 -125353 -127937 -128591 -126193 -125364 -123552 -124775 -127072 -127666 -129943 -127049 -122603
2017 -122603 -124619 -128170 -129192 -127340 -126545 -125915 -128734 -129588 -132725 -131353 -128512 -121030 -119063 -123846 -126093
2002 -126093 -124967 -124047 -121341 -117918 -118161 -118924 -120878 -130964 -136154 -136084 -136523 -135644 -132712 -130883 -133679 -135712
1986 -135712 -134723 -132056 -131164 -130825 -137069 -131437 -130079 -131295 -131144 -127382 -119472 -119599 -122627 -126898 -129971 -132816
1970 -132816 -129253 -132314 -130487 -130795 -127797 -124482 -124973 -127542 -126563 -124698 -122776 -124654 -126258 -126338 -126387 -129176
1954 -129176 -133042 -132620 -131931 -128152 -126346 -129565 -127151 -133707 -135848 -131666 -129713 -128897 -129822 -128840 -131750 -131640
1938 -131640 -127527 -123325 -120558 -124711 -128053 -130559 -134955 -133534 -134549 -132808 -128514 -128012 -122213 -117800 -119682
1923 -119682 -126022 -129921 -129152 -123484 -122280 -122531 -127161 -130500 -128442 -127145 -129933 -130121 -126922 -130944 -133391
1908 -133391 -133261 -129853 -128666 -127873 -127143 -131208 -132192 -126544 -122947 -122258 -123557 -125346 -129695 -136013 -134463 -129677
1892 -129677 -127233 -124068 -123986 -126233 -125884 -130422 -133098 -131849 -129668 -127590 -128062 -130093 -126064 -125125 -123814 -124320
1876 -124320 -125585 -126116 -126868 -125756 -121261 -118134 -120545 -121873 -122631 -123688 -126982 -128971 -127942 -127668 -127540 -129421
1860 -129421 -129184 -122784 -124966 -124465 -125212 -124927 -125598 -123889 -121685 -123701 -125682 -123668 -120310 -120276 -124317 -125504
1844 -125504 -125506 -126721 -125088 -123607 -126818 -126670 -129890 -130056 -120280 -122900 -127673 -127575 -128616 -130875 -129166 -125902
1828 -125902 -128141 -130690 -133656 -130276 -127115 -124084 -121413 -122301 -124588 -129004 -132766 -132066 -129251 -126784 -120842
1813 -120842 -124302 -128482 -126134 -123924 -123817 -122780 -120567 -119460 -118332 -127612 -131862 -133583 -131537 -122790 -117069
1798 -117069 -120079 -120802 -116832 -119478 -118560 -119819 -130698 -133560 -132455 -128038 -126354 -123599 -123791 -126832 -132127
1783 -132127 -130427 -128793 -123629 -124777 -126380 -127010 -123547 -123028 -124346 -121923 -125374 -124315 -122227 -122317 -120744
1768 -120744 -121319 -123106 -124611 -126455 -128822 -129169 -131989 -133827 -134265 -130711 -127448 -124405 -125401 -121939 -121147 -123599
1752 -123599 -125272 -128590 -129182 -126400 -125592 -127332 -127659 -125979 -124455 -129894 -132417 -129975 -127273 -127379 -129925
1737 -129925 -129998 -127343 -123990 -123939 -127323 -130817 -128568 -127531 -129477 -129683 -129435 -125472 -124131 -124602 -129231 -130841
1721 -130841 -129398 -127115 -127745 -127342 -126025 -128897 -126757 -123600 -124193 -128308 -128826 -126652 -127132 -124721 -121730 -121163
1705 -121163 -126405 -127921 -125217 -122570 -122788 -126497 -126038 -122012 -122314 -126324 -124461 -124412 -125500 -126115 -129492 -129013
1689 -129013 -127859 -127272 -126669 -123579 -128682 -126587 -126206 -129319 -125466 -125444 -126669 -128212 -133390 -134152 -130936 -126235
1673 -126235 -123830 -122958 -122830 -121801 -125112 -126281 -126018 -122896 -124286 -128160 -128127 -124644 -125270 -130032 -133603 -131757
1657 -131757 -130021 -130928 -130615 -134285 -129093 -127759 -130243 -129298 -128091 -127001 -129980 -128031 -124657 -124826 -124538 -121524
1641 -121524 -124594 -127168 -126634 -129481 -129211 -126570 -125989 -127390 -129927 -120655 -118024 -122379 -125021 -123961 -122891
1626 -122891 -126045 -126601 -128862 -131990 -128844 -123526 -126541 -127184 -122412 -119091 -115233 -116418 -119827 -120916 -119297
1611 -119297 -118061 -120286 -123255 -124847 -128720 -129857 -129409 -126908 -123275 -123886 -122971 -126281 -125106 -120986 -125093
1596 -125093 -125654 -126246 -130028 -129597 -129055 -126264 -121377 -113657 -114518 -110470 -110622 -116110 -120791 -123133 -126201 -129631
1580 -129631 -128399 -124127 -125314 -129069 -127411 -127152 -121048 -123570 -125994 -124246 -124553 -121945 -120204 -122916 -122663
1565 -122663 -123244 -126128 -124214 -123292 -126285 -130169 -129352 -131236 -127485 -124842 -121075 -119800 -122828 -126638 -127623
1550 -127623 -123701 -122828 -123800 -124987 -123139 -124090 -126279 -121699 -118462 -119516 -124002 -123738 -123623 -124747 -121332 -121583
1534 -121583 -123318 -124864 -126692 -123283 -122757 -122938 -125828 -122486 -120110 -118741 -119999 -123722 -122445 -120858 -120994
1519 -120994 -123978 -130202 -129477 -132445 -131495 -132422 -131112 -130578 -128249 -124489 -123466 -126802 -124293 -121069 -124177
1504 -124177 -128368 -126780 -126328 -124287 -119734 -116026 -119944 -121124 -123662 -124395 -124889 -129576 -124957 -121416 -119249
1489 -119249 -119349 -119262 -121095 -122336 -121850 -121343 -122080 -119844 -119766 -121331 -122343 -122646 -121942 -123148 -124160 -125974 -121305
1472 -121305 -114834 -114540 -118081 -123058 -118205 -117010 -116620 -121680 -126036 -126500 -128693 -124759 -123132 -122220 -124132
1457 -124132 -123398 -123251 -123596 -125436 -127186 -124205 -123400 -121344 -118474 -118725 -120718 -120603 -120998 -121556 -119233 -121891
1441 -121891 -121522 -120145 -117833 -119818 -121551 -121837 -119737 -121762 -123982 -120975 -117528 -117778 -116339 -116240 -118292 -118665
1425 -118665 -117738 -118936 -119256 -116253 -118663 -116834 -112904 -115671 -116974 -121060 -122772 -124206 -124096 -120149 -120168 -122308
1409 -122308 -119112 -117077 -119348 -118716 -119515 -122130 -118657 -116003 -120176 -119433 -119209 -123574 -121578 -122087 -123207 -124403
1393 -124403 -125009 -127213 -127430 -127641 -127184 -130071 -127016 -121810 -123166 -124733 -130152 -131034 -127575 -126554 -124464 -119669
1377 -119669 -120216 -126851 -126364 -123395 -119479 -121342 -120177 -121297 -121007 -123420 -127085 -126745 -124793 -124743 -126246 -123418
1361 -123418 -123737 -127659 -129514 -131156 -129767 -121884 -119106 -117596 -116784 -121310 -121358 -124408 -122082 -122881 -119026 -119217
1345 -119217 -124403 -123590 -123097 -124514 -130714 -135942 -133119 -129499 -129679 -129798 -129569 -125608 -122020 -119590 -119615 -119633 -119216
1328 -119216 -114920 -117354 -116581 -117430 -117979 -118006 -119410 -123272 -126536 -128328 -124411 -126250 -126893 -120456 -121148 -124397
1312 -124397 -123361 -120033 -123214 -125232 -121931 -117934 -120751 -124108 -123844 -122016 -116761 -110819 -113520 -115824 -116532
1297 -116532 -116868 -114782 -118559 -120247 -115805 -113146 -114894 -114988 -113058 -121206 -127262 -125791 -122012 -123461 -121460
1282 -121460 -121502 -124223 -124121 -125293 -127142 -124874 -122654 -119938 -122292 -125904 -128060 -125950 -126296 -127428 -122337
1267 -122337 -117220 -120072 -121504 -121269 -118932 -117594 -119502 -124139 -126816 -130065 -131041 -128610 -126454 -125575 -123955
1252 -123955 -125282 -126293 -119667 -120202 -122848 -121788 -122150 -123387 -123442 -120331 -120512 -122779 -126085 -121960 -116411 -116834
1236 -116834 -116459 -116276 -117151 -116598 -115410 -114761 -111787 -111998 -117086 -121121 -122394 -121877 -115217 -112709 -113183 -115926
1220 -115926 -117427 -113122 -112829 -111890 -117047 -123369 -122746 -123604 -126603 -120015 -124115 -124082 -121333 -123030 -124994 -127029
1204 -127029 -124419 -121641 -120529 -121901 -124732 -126821 -126945 -124995 -121203 -120722 -118553 -115425 -119537 -121908 -120438
1189 -120438 -122658 -123166 -122167 -121598 -123984 -122710 -121414 -118250 -117682 -119304 -123546 -124037 -117514 -115415 -118011 -123910
1173 -123910 -124643 -119311 -115154 -116310 -117478 -118155 -117474 -121069 -127368 -126157 -120806 -117738 -119401 -122847 -122525
1158 -122525 -121363 -114829 -111841 -113184 -117914 -121627 -121254 -122112 -120618 -118961 -116428 -120318 -122961 -130749 -130859
1143 -130859 -128143 -122875 -122435 -119282 -117052 -115835 -116333 -116668 -114850 -115810 -117193 -119241 -116255 -111180 -113606
1128 -113606 -118820 -120443 -118892 -114795 -112901 -113696 -116110 -119864 -122745 -118390 -115876 -116017 -115762 -119501 -123518
1113 -123518 -124431 -120365 -118236 -125052 -127288 -121930 -118654 -117364 -114660 -117413 -116024 -115780 -114215 -113955 -115339
1098 -115339 -119578 -122019 -122286 -121971 -120166 -119706 -124415 -122238 -118971 -119240 -118510 -117820 -117452 -114807 -115458 -115988 -117294
1081 -117294 -121878 -123008 -118844 -118096 -119252 -118424 -120960 -128014 -123571 -121462 -122072 -124712 -125441 -126577 -129327
1066 -129327 -129800 -132784 -129081 -120151 -119154 -127709 -130828 -126114 -123159 -126047 -125605 -119511 -117632 -119104 -117895
1051 -117895 -120295 -114371 -114639 -118276 -116823 -115558 -120067 -120258 -118094 -115489 -116356 -115744 -114469 -115825 -113428
1036 -113428 -111864 -110150 -114963 -117508 -113733 -116584 -116020 -119171 -118915 -115255 -113074 -113144 -113268 -117052 -125070 -131319
1020 -131319 -130975 -126311 -119094 -121621 -117897 -114810 -113391 -112802 -116688 -113738 -114573 -117596 -118521 -121709 -122007 -119293
1004 -119293 -114817 -119282 -124167 -119125 -118442 -115461 -117746 -117277 -117165 -112722 -109539 -111026 -111355 -110487 -113467 -114438
988 -114438 -117963 -119315 -119071 -119249 -112608 -112611 -112724 -114130 -116142 -117671 -117521 -114213 -120933 -128091 -123820 -122647
972 -122647 -116137 -111779 -111755 -113238 -116988 -118681 -117670 -115883 -110490 -111214 -112749 -117572 -123437 -122411 -120391
957 -120391 -122369 -122618 -123594 -125152 -122315 -118783 -116603 -116186 -114331 -112712 -114843 -113369 -112718 -116583 -117594 -116355
941 -116355 -113307 -110786 -112985 -115430 -117809 -117778 -114690 -113155 -117188 -119345 -121199 -117551 -115790 -114816 -115844
926 -115844 -119530 -123499 -122373 -119117 -116367 -107844 -108653 -110846 -106635 -105022 -107523 -110774 -117571 -122816 -127732
911 -127732 -126119 -119111 -114601 -113998 -116413 -118112 -117775 -117328 -120226 -122826 -122386 -122936 -122576 -118697 -122725 -120390
895 -120390 -116765 -112596 -106746 -108730 -116106 -122545 -120491 -117105 -116456 -117278 -119210 -119090 -119651 -119832 -117725 -115574
$$ [...]
##END NTUPLES=NMR SPECTRUM
##END=
