##TITLE=Analysis number 327829
Compound Code sb 01952
Book Reference 196026
Project Code adrs flro3
Chemist Name jom
##JCAMPDX= 6.0         $$ Bruker NMR JCAMP-DX V2.0
##DATA TYPE= NMR SPECTRUM
##DATA CLASS= NTUPLES
##ORIGIN= Bruker BioSpin GmbH
##OWNER= nmr
$$ XWIN-NMR		Version 3.5
$$ Wed Apr 11 16:45:34 2007 GMT Daylight Time (UT+1h)  MAYBRIDGE\nmr@NMR_250MHZ
##.OBSERVE FREQUENCY= 250.131544655141
##.OBSERVE NUCLEUS= ^1H
##.ACQUISITION MODE= SIMULTANEOUS (DQD)
##.ACQUISITION SCHEME= undefined
##.AVERAGES= 16
##.DIGITISER RES= 18
##SPECTROMETER/DATA SYSTEM= dpx250
##.PULSE SEQUENCE= zg30
##.SOLVENT NAME= CDCl3
##.SHIFT REFERENCE= (INTERNAL, CDCl3, 0, 16.522)
##AUDIT TRAIL= $$ (NUMBER, WHEN, WHO, WHERE, WHAT)
$$ ##TITLE= Audit trail, XWIN-NMR		Version 3.5
$$ ##JCAMPDX= 5.01
$$ ##ORIGIN= Bruker BioSpin GmbH
$$ ##OWNER= nmr
$$ C:\u/data/dgb/nmr/ADRS/1060/pdata/1/auditp.txt
$$ ##AUDIT TRAIL=  $$ (NUMBER, WHEN, WHO, WHERE, WHAT)
(   1,<2007-04-11 16:45:07.49 +100>,<MAYBRIDGE\nmr>,<NMR_250MHZ>,
      <created by zg, POWCHK disabled, PULCHK disabled
       configuration hash MD5:
       49 4B E0 1D 92 C2 6B 37 9F E6 65 BC 52 41 86 1D
       data hash MD5: 64K
       25 7C AA 33 50 84 1B E1 E9 A8 B2 89 E0 76 23 BC>)
(   2,<2007-04-11 16:45:22.44 +100>,<MAYBRIDGE\nmr>,<NMR_250MHZ>,
      <Start of raw data processing
       ef LB = 0.3 FT_mod = 6 PKNL = 1 SI = 32K 
       data hash MD5: 32K
       76 87 50 EF B2 61 95 10 A5 27 3B B1 A5 9F 09 7A>)
(   3,<2007-04-11 16:45:24.22 +100>,<MAYBRIDGE\nmr>,<NMR_250MHZ>,
      <apk 
       data hash MD5: 32K
       9C 96 2D 1A 67 A0 F0 4E A7 E1 76 59 87 66 69 2B>)
(   4,<2007-04-11 16:45:24.91 +100>,<MAYBRIDGE\nmr>,<NMR_250MHZ>,
      <abs ABSG = 5 
       data hash MD5: 32K
       A3 D1 4C 33 70 8D 37 8A 14 3D D9 FE 53 60 BF B2>)
$$ ##END=
$$ 
$$ hash MD5
$$ 32 A0 9B C3 44 67 9E 99 55 B4 4D 09 07 8B CE A7
##$RELAX= 
##$RELAX= 
##$RELAX= 
##$RELAX= 
##$RELAX= 
##$RELAX= 
##$RELAX= 
$$ Bruker specific parameters
$$ --------------------------
##$DU= <C:\u>
##$EXPNO= 1060
##$NAME= <ADRS>
##$PROCNO= 1
##$TYPE= <nmr>
##$USER= <dgb>
##$AMP= (0..31)
100 100 100 100 100 100 100 100 100 100 100 100 100 100 100 100 100 100 
100 100 100 100 100 100 100 100 100 100 100 100 100 100 
##$AQSEQ= 0
##$AQ_mod= 3
##$AUNM= <au_zg>
##$AUTOPOS= <46 >
##$BF1= 250.13
##$BF2= 250.13
##$BF3= 250.13
##$BF4= 250.13
##$BF5= 500.13
##$BF6= 500.13
##$BF7= 500.13
##$BF8= 500.13
##$BYTORDA= 1
##$CFDGTYP= 0
##$CFRGTYP= 5
##$CHEMSTR= <none>
##$CNST= (0..31)
1 1 145 1 1 1 1 1 1 1 1 1 1 1 1 1 1 1 1 1 1 1 1 1 1 1 1 1 1 1 1 1 
##$CPDPRG= <>
##$CPDPRG1= <>
##$CPDPRG2= <>
##$CPDPRG3= <>
##$CPDPRG4= <mlev>
##$CPDPRG5= <mlev>
##$CPDPRG6= <mlev>
##$CPDPRG7= <mlev>
##$CPDPRG8= <mlev>
##$CPDPRGB= <>
##$CPDPRGT= <>
##$D= (0..31)
0 1 0 0 0 0 0 0 0 0.06 0 0 0 0 0 0 0.0002 0 0 0 0 0 0 0 0 0 0 0 0 0 0 
0 
##$DATE= 1176306305
##$DBL= (0..7)
120 120 120 120 120 120 120 120 
##$DBP= (0..7)
150 150 150 150 150 150 150 150 
##$DBP07= 0
##$DBPNAM0= <>
##$DBPNAM1= <>
$$ [...]
##$SUBNAM7= <"">
##$SUBNAM8= <"">
##$SUBNAM9= <"">
##$SW= 20.6930455092707
##$SWIBOX= (0..15)
0 0 3 0 0 0 0 0 0 0 0 0 0 0 0 0 
##$SW_h= 5175.983436853
##$TD= 65536
##$TD0= 1
##$TE= 683.16
##$TE2= 300
##$TE3= 300
##$TEG= 300
##$TL= (0..7)
0 120 120 120 120 120 120 120 
##$TP= (0..7)
150 150 150 150 150 150 150 150 
##$TP07= 0
##$TPNAME0= <>
##$TPNAME1= <>
##$TPNAME2= <>
##$TPNAME3= <>
##$TPNAME4= <>
##$TPNAME5= <>
##$TPNAME6= <>
##$TPNAME7= <>
##$TPOAL= (0..7)
0.5 0.5 0.5 0.5 0.5 0.5 0.5 0.5 
##$TPOFFS= (0..7)
0 0 0 0 0 0 0 0 
##$TUNHIN= 0
##$TUNHOUT= 0
##$TUNXOUT= 0
##$USERA1= <user>
##$USERA2= <user>
##$USERA3= <user>
##$USERA4= <user>
##$USERA5= <user>
##$V9= 5
##$VALIST= <valist>
##$VCLIST= <CCCCCCCCCCCCCCC>
##$VD= 0
##$VDLIST= <DDDDDDDDDDDDDDD>
##$VPLIST= <PPPPPPPPPPPPPPP>
##$VTLIST= <TTTTTTTTTTTTTTT>
##$WBST= 1024
##$WBSW= 4
##$XGAIN= (0..3)
0 0 0 0 
##$XL= 0
##$YL= 0
##$YMAX_a= 444412
##$YMIN_a= -494145
##$ZGOPTNS= <>
##$ZL1= 120
##$ZL2= 120
##$ZL3= 120
##$ZL4= 120
##$ABSF1= 16.522
##$ABSF2= -4.171173
##$ABSG= 5
##$ABSL= 3
##$ALPHA= 0
##$AQORDER= 0
##$ASSFAC= 0
##$ASSFACI= 0
##$ASSFACX= 0
##$ASSWID= 0
##$AUNMP= <proc_1d>
##$AZFE= 0.1
##$AZFW= 0.1
##$BCFW= 0
##$BC_mod= 0
##$BYTORDP= 0
##$COROFFS= 0
##$CY= 12.5
##$DATMOD= 1
##$DC= 0
##$DFILT= <>
##$DTYPP= 0
##$F1P= 14.0000005364418
##$F2P= -0.99999901652339
##$FCOR= 0.5
##$FTSIZE= 32768
##$FT_mod= 6
##$GAMMA= 0
##$GB= 0
##$INTBC= 1
##$INTSCL= 1
##$ISEN= 128
##$LB= 0.3
##$LEV0= 0
##$LPBIN= 0
##$MAXI= 10000
##$MC2= 0
##$MEAN= 0
##$ME_mod= 0
##$MI= 0
##$NCOEF= 0
##$NC_proc= -3
##$NLEV= 6
##$NOISF1= 0
##$NOISF2= 0
##$NSP= 0
##$NTH_PI= 0
##$NZP= 0
##$OFFSET= 16.522
##$PC= 1
##$PHC0= 230.8559
##$PHC1= 7.595958
##$PH_mod= 1
##$PKNL= yes
##$PPARMOD= 0
##$PSCAL= 4
##$PSIGN= 0
##$REVERSE= no
##$SF= 250.13
##$SI= 32768
##$SIGF1= 0
##$SIGF2= 0
##$SINO= 400
##$SIOLD= 32768
##$SREGLST= <1H.CDCl3>
##$SSB= 0
##$STSI= 32768
##$STSR= 0
##$SW_p= 5175.98343685301
##$SYMM= 0
##$S_DEV= 0
##$TDeff= 65536
##$TDoff= 0
##$TI= <Analysis number 999999
Compound Code 99
Book Reference 9
Project Code 9>
##$TILT= no
##$TM1= 0
##$TM2= 0
##$TOPLEV= 0
##$USERP1= <user>
##$USERP2= <user>
##$USERP3= <user>
##$USERP4= <user>
##$USERP5= <user>
##$WDW= 1
##$XDIM= 32768
##$YMAX_p= 496243354
##$YMIN_p= -111820
$$ End of Bruker specific parameters
$$ ---------------------------------
##NTUPLES= NMR SPECTRUM
##VAR_NAME=  FREQUENCY,     SPECTRUM/REAL,   SPECTRUM/IMAG
##SYMBOL=    X,             R,               I
##VAR_TYPE=  INDEPENDENT,   DEPENDENT,       DEPENDENT
##VAR_FORM=  AFFN,          ASDF,            ASDF
##VAR_DIM=   32768,         32768,           32768
##UNITS=     HZ,            ARBITRARY UNITS, ARBITRARY UNITS
##FACTOR=    0.157963299565203, 1,           1
##FIRST=     4132.6476996994, 0,             0
##LAST=      -1043.33573715361, 0,           0
##MIN=       -1043.33573715361, -111820,     0
##MAX=       4132.6476996994, 496243354,     0
$$ Real data points
##PAGE= N=1
##DATA TABLE= (X++(R..R)), XYDATA
$$ [...]
$$ plain form
18635 18791 10096 43958 48679 13757 -226 14706 18232 -8123 10125 45475 35113 24021
18623 24021 17638 29522 71726 86291 88547 84023 79730 54169 27191 36533 34307 32175 33548
18610 33548 34309 25730 49587 35227 47379 64600 72116 77197 69936 54846 31006 7335 40574
18597 40574 58278 40434 21198 1339 1398 43676 40608 34305 38351 58524 44064 12736 1289
18584 1289 34197 34530 14400 31178 57435 79172 85374 74216 72599 47084 34182 23355 24367
18571 24367 59085 65679 52451 56848 55752 62100 79909 67089 60120 73174 63764 65889 64591
18558 64591 55678 52846 59547 67635 46273 22591 20075 45677 88569 96963 82971 73614 57016
18545 57016 36120 31870 41503 11207 8563 14354 31470 48036 87204 92701 99583 84458 87681
$$ packed form
18635A8791q695L3862M721l4922j3983J4932L526k6355J8248L5350j0362j1092
18623B4021o383J1884M2204J4565K256m524m293k5561k6978R342k226k132J373
18610C3548P61q579K3857j4360J2152J7221P516N081p261j5090k3840k3671L3239
18597D0574J7704j7844j9236j9859N9M2278l068o303M046K0173j4460l1328j1447
18584A289L2908L33k0130J6778K6257K1737O202j1158j617k5515j2902j0827J012
18571B4367L4718O594j3228M397j096O348J7809j2820o969J3054r410K125j298
18558F4591q913k832O701Q088k1362k3682k516K5602M2892Q394j3992r357j6598
18545E7016k0896m250R633l0296k644N791J7116J6566L9168N497O882j5125L223
$$ plain form
18532 87681 103293 119614 110700 100623 102118 96786 83410 93123 83056 72632 82260 49384 67926
18519 67926 97220 93269 85848 97943 105524 101910 97332 61251 37826 51878 61430 93866 114672
18506 114672 86190 90616 79114 94926 121307 108897 114577 118679 129717 126324 83597 66921
18494 66921 83786 106388 116861 110029 113203 125835 120417 87346 75870 57733 78456 103112
18482 103112 118474 120332 121636 110416 113524 114763 111759 99883 108955 114275 123903 161817 161336
18469 161336 144989 152808 180384 179260 125140 120034 157640 176707 208339 227486 231273 201261
18457 201261 203235 212081 229285 252060 267685 274214 291479 289180 296802 312033 324244 353931
18445 353931 368817 376687 385705 397069 403713 455001 464993 485692 452246 461169 446321 429555
$$ packed form
18532H7681J5612J6321q914j0077J495n332j3376R713j0067j0424R628l2876J8542
18519F7926K9294l951p421J2095P581l614m578l6081k3425J4052R552L2436K0806
18506A14672k8482M426j1502J5812K6381j2410N680M102J1038l393m2727j6676
18494F6921J6865K2602J0473o832L174J2632n418l3071j1476j8137K0723K4656
18482A03112J5362J858J304j1220L108J239l004j1876R072N320R628L7914m81
18469A61336j6347P819K7576j124n4120n106L7606J9067L1632J9147L787l0012
18457B01261J974Q846J7204K2775J5625O529J7265k299P622J5231J2211K9687
18445C53931J4886P870R018J1364O644N1288R992K0699l3446Q923j4848j6766
$$ plain form
18433 429555 438806 410433 370352 348090 355886 351323 291033 274944 288782 296388 304590 293097
18421 293097 281542 274492 257262 239584 273981 302091 342144 358863 373916 387806 423044 438758
18409 438758 464271 473305 459256 469829 475775 478232 468325 450377 430780 425396 403650 374370
18397 374370 344434 302356 282367 279518 259055 261522 289068 294035 270566 237370 225197 245228
18385 245228 252875 269615 270245 262954 265601 294515 317062 297229 271562 271373 305567 321153 303214
18372 303214 286144 267717 324863 374413 377203 401940 427233 460337 508581 515486 500851 506059
18360 506059 534384 569551 562398 567288 624770 636842 646703 675766 686273 684353 730881 785062
18348 785062 842801 928838 1009090 1074082 1132761 1195099 1285357 1377098 1471379 1505516 1526845
$$ packed form
18433D29555R251k8373m0081k2262P796m563o0290j6089J3838P606Q202j1493
18421B93097j1555p050j7230j7678L4397K8110M0053J6719J5053J3890L5238J5714
18409D38758K5513R034j4049J0573N946K457r907j7948j9597n384k1746k9280
18397C74370k9936m2078j9989k849k0463K467K7546M967k3469l3196j2173K0031
18385B45228P647J6740O30p291K647K8914K2547j9833k5667j89L4194J5586j7939
18372C03214j7070j8427N7146M9550K790K4737K5293L3104M8244O905j4635N208
18360E06059K8325L5167p153M890N7482J2072R861K9063J0507j920M6528N4181
18348G85062N7739Q6037Q0252O4992N8679O2338R0258R1741R4281L4137K1329
$$ plain form
18337 1526845 1568184 1605415 1614409 1645970 1692552 1804017 1924707 2052902 2228384 2451759
18327 2451759 2678706 2951277 3274668 3655215 4078628 4585015 5161189 5814478 6564579
18318 6564579 7431517 8465052 9675201 11133364 12936848 15178288 18131317 22147746
18310 22147746 27518155 34473443 42602132 50808685 58294435 65046547 70891788 74706139
18302 74706139 74902147 69001359 60798442 53478464 43309339 31654465 23648769 18988116
18294 18988116 16148246 14312579 13075296 12256329 11743729 11501846 11442834 11469029 11638290
18285 11638290 11979491 12472608 13104448 13959549 15141104 16732984 18783246 21487566 25254363
18276 25254363 30404001 37215242 45467277 54191795 62300208 69588604 76066664 80696652
$$ packed form
18337A526845M1339L7231Q994L1561M6582J11465J20690J28195J75482K23375
18327B451759K26947K72571L23391L80547M23413N06387N76174O53289P50101
18318F564579Q66938J033535J210149J458163J803484K241440K953029M016429
18310B2147746N370409O955288Q128689Q206553P485750O752112N845241L814351
18302G4706139J96008n900788q202917p319978j0169125j1654874q005696m660653
18294A8988116k839870j835667j237283q18967n12600k41883n9012K6195J69261
18285A1638290L41201M93117O31840Q55101J181555J591880K050262K704320L766797
18276B5254363N149638O811241Q252035Q724518Q108413P288396O478060M629988
$$ plain form
18268 80696652 82062287 77288624 68390674 60359092 50451857 37542759 27605533 21600230
18260 21600230 17834564 15330750 13565771 12210558 11193783 10407304 9732198 9142686
18252 9142686 8622223 8089415 7626701 7229044 6839656 6484450 6245120 6058376 5861832
18243 5861832 5706101 5568943 5449771 5373975 5279110 5218694 5158235 5093939 5057918 4989378 4909300
18232 4909300 4857023 4801543 4763235 4711629 4657537 4585421 4474138 4389017 4320293 4270221 4200713
18221 4200713 4108166 4021884 3978402 3906143 3807522 3736476 3702083 3628048 3545352 3495875 3449725
18210 3449725 3369800 3268491 3197368 3180138 3147333 3092281 3026357 3011309 2975701 2941401 2903838
18199 2903838 2864893 2854186 2862359 2867889 2875390 2865072 2856074 2871794 2853833 2859097 2850762 2794288
$$ packed form
18268H0696652J365635m773663q897950q031582r907235j2909098r937226o005303
18260B1600230l765666k503814j764979j355213j016775p86479o75106n89512
18252I142686n20463n32808m62714l97657l89388l55206k39330j86744j96544
18243E861832j55731j37158j19172p5796r4865o0416o0459o4296l6021o8540q0078
18232D909300n2277n5480l8308n1606n4092p2116j11283q5121o8724n0072o9508
18221D200713r2547q6282m3482p2259r8621p1046l4393p4035q2696m9477m6150
18210C449725p9925j01309p1123j7230l2805n5052o5924j5048l5608l4300l7563
18199B903838l8945j0707Q173N530P501j0318q998J5720j7961N264q335n6474
$$ plain form
18187 2794288 2742266 2674444 2620595 2576726 2507735 2440512 2379032 2307291 2245341 2186140 2110350
18176 2110350 2062048 1997314 1901834 1835198 1751047 1680160 1581791 1519231 1493935 1452273 1401739
18165 1401739 1379541 1333810 1276357 1262869 1232594 1208115 1201025 1196349 1187049 1175555 1175470 1161452
18153 1161452 1128541 1109133 1099389 1065830 1046500 1043725 1035106 1001595 1014988 1033345 1028636 1003891
18141 1003891 975759 963287 942333 926367 916738 910388 918720 933152 943038 969923 1020979 1057208
18129 1057208 1110341 1173631 1253262 1380115 1522999 1712557 1908296 2139128 2436413 2780588
18119 2780588 3182432 3687014 4354896 5215199 6333075 7871822 10029449 13015267 16701732
18110 16701732 20281888 22720575 23871243 24602192 25530984 26137536 23675387 16602096
$$ packed form
18187B794288n2022o7822n3849m3869o8991o7223o1480p1741o1950n9201p5790
18176B110350m8302o4734r5480o6636q4151p0887r8369o2560k5296m1662n0534
18165A401739k2198m5731n7453j3488l0275k4479p090m676r300j1494q5j4018
18153A161452l2911j9408r744l3559j9330k775q619l3511J3393J8357m709k4745
18141A003891k8132j2472k0954j5966r629o350Q332J4432R886K6885N1056L6229
18129A057208N3133O3290P9631J26853J42884J89558J95739K30832K97285L44175
18119B780588M01844N04582O67882Q60303J117876J538747K157627K985818L686465
18110A6701732L580156K438687J150668P30949R28792O06552k462149p073291
$$ plain form
18102 16602096 10843170 7704116 5947497 4838460 4036158 3424442 3030615 2739960 2471797
18093 2471797 2280369 2128108 1962485 1816696 1687495 1583225 1506239 1448186 1402653 1360091
18083 1360091 1294403 1229629 1188962 1154267 1116949 1080726 1049129 1054357 1037251 1015619 1012424 1008693
18071 1008693 1018864 977893 955911 931690 904785 902314 922061 902179 870225 877596 900238 898871
18059 898871 906855 877698 840342 836550 855735 869505 850674 844761 841604 821785 835062 857807
18047 857807 869422 858289 839247 821423 780026 748808 770822 809185 806851 790648 800185 794889
18035 794889 799671 810117 825159 833219 811626 824144 853462 864842 872092 858338 832760 815434
18023 815434 776507 754749 746648 712870 679565 643388 649795 647726 605633 559946 538696 538979
$$ packed form
18102A6602096n758926l139054j756619j109037q02302o11716l93827k90655k68163
18093B471797j91428j52261j65623j45789j29201j04270p6986n8053m5533m2562
18083A360091o5688o4774m0667l4695l7318l6223l1597N228j7106k1632l195l731
18071A008693J0171m0971k1982k4221k6905k471J9747j9882l1954P371K2642j367
18059H98871P984k9157l7356l792J9185J3770j8831n913l157j9819J3277K2745
18047H57807J1615j1133j9042j7824m1397l1218K2014L8363k334j6203R537n296
18035G94889M782J0446J5042Q060k1593J2518K9318J1380P250j3754k5578j7326
18023H15434l8927k1758q101l3778l3305l6177O407k069m2093m5687k1250K83
$$ plain form
18011 538979 546037 541853 534719 520125 516448 488654 455552 440229 433545 393417 393607 386270 386141
17998 386141 408466 415093 378919 354195 321907 315339 316921 324186 309783 314017 308969 333038 342808
17985 342808 336876 334219 329344 325660 295597 281470 255482 252394 233482 235200 225437 221873 184615
17972 184615 157535 142817 143162 151359 133538 133714 134699 119870 131245 141970 134956 115774 114231
17959 114231 93004 75943 62985 55393 58249 67663 57666 45543 15919 17868 23208 15862 10861
17946 10861 38019 38989 79300 85876 96767 73441 51634 70813 88183 85058 80472 98608 94594
17933 94594 67686 50251 51237 31054 44236 80400 91771 92910 90611 93255 115495 111105 113662
17920 113662 97231 53218 54901 80035 69318 77865 74903 42777 56584 57765 106212 122085
$$ packed form
18011E38979P058m184p134j4594l677k7794l3102j5323o684m0128J90p337j29
17998C86141K2325O627l6174k4724l2288o568J582P265j4403M234n048K4069R770
17985C42808n932k657m875l684l0063j4127k5988l088j8912J718r763l564l7258
17972A84615k7080j4718L45Q197j7821J76R85j4829J1375J0725p014j9182j543
17959A14231k1227j7061j2958p592K856R414r997j2123k9624J949N340p346n001
17946A0861K7158R70M0311O576J0891k3326k1807J9179J7370l125m586J8136m014
17933I4594k6908j7435R86k0183J3182L6164J1371J139k299K644K2240m390K557
17920A13662j6431m4013J683K5134j0717Q547k962l2126J3807J181M8447J5873
$$ plain form
17908 122085 94440 65494 73437 58510 54761 71457 88236 119694 112785 126406 139792 137443
17896 137443 134652 102124 91871 104122 101158 96583 107393 88256 86024 97847 88000 81774 64387
17883 64387 54232 51588 71167 81397 69901 66627 72331 117401 120511 145416 135551 105625 111907
17870 111907 141729 159199 143680 123289 128433 92993 74792 113629 151352 145660 153355 134597
17858 134597 162593 223729 245957 300500 364771 397244 451539 510729 530003 545823 558745
17847 558745 524112 437734 314070 222612 197793 185237 166883 165720 151190 125634 148635
17836 148635 130221 131598 147832 130353 126140 134526 118169 125750 124377 118802 128189 155835 171922
17823 171922 222409 250904 263740 290834 372241 435920 472080 468051 479478 451923 419346 343586
$$ packed form
17908A22085k7645k8946P943j4927l749J6696J6779L1458o909J3621J3386k349
17896A37443k791l2528j0253J2251k964m575J0810j9137k232J1823r847o226j7387
17883F4387j0155k644J9579J0230j1496l274N704M5070L110K4905r865k9926O282
17870A11907K9822J7470j5519k0391N144l5440j8201L8837L7723n692P695j8758
17858A34597K7996O1136K2228N4543O4271L2473N4295N9190J9274J5820J2922
17847E58745l4633q6378j23664r1458k4819j2556j8354j163j4530k5556K3001
17836A48635j8414J377J6234j7479m213Q386j6357P581j373n575R387K7646J6087
17823A71922N0487K8495J2836K7094Q1407O3679L6160m029J1427k7555l2577p5760
$$ plain form
17811 343586 273721 189587 167326 175288 154719 94041 72176 45241 46901 97058 92396 89312
17799 89312 114151 107644 96619 79102 96983 114159 85898 73484 50439 55422 93527 92347
17787 92347 85443 74430 47410 28216 17004 -12753 1646 14443 37296 42924 72824 93664
17775 93664 73141 89625 93583 112258 107462 111015 127756 120455 119436 123354 120930 118015 107602
17762 107602 107791 106943 91018 94039 106145 119128 85828 83506 74475 53621 64836 52852 39310
17749 39310 36924 75968 87088 87925 90967 72212 45309 31351 51479 69596 65048 67043 61183
17736 61183 68199 81877 73293 72070 81274 71278 101176 118186 117957 103552 84357 112036 131082
17723 131082 123387 121732 111665 100096 159054 198251 234630 247597 281756 355340 393414 403148
$$ packed form
17811C43586o9865q4134k2261P962k0569o0678k1865k6935J660N0157m662l084
17799H9312K4839o507j1025j7517J7881J7176k8261j2414k3045M983L8105j180
17787I2347o904j1013k7020j9194j1212k9757J4399J2797K2853N628K9900K0840
17775I3664k0523J6484L958J8675m796L553J6741p301j019L918k424k915j0413
17762A07602J89q48j5925L021J2106J2983l3300k322r031k0854J1215j1984j3542
17749C9310k386L9044J1120Q37L042j8755k6903j3958K0128J8117m548J995n860
17736F1183P016J3678q584j223R204r996K9898J7010k29j4405j9195K7679J9046
17723A31082p695j655j0067j1569N8958L9197L6379J2967L4159P3584L8074R734
$$ plain form
17711 403148 435651 476423 485934 451380 406393 360454 305121 246426 197119 152002 166937 189159
17699 189159 197494 160796 141572 117041 121470 127380 104345 112961 127823 153297 155105 185511
17687 185511 183038 136163 133735 161853 198019 241945 292283 314458 344503 392873 455052 462304
17675 462304 466000 499852 467756 394692 375557 326652 236804 205109 178735 135312 118288 121205
17663 121205 116033 127959 132236 126644 102829 69233 100404 122597 125686 111764 97001 57357
17651 57357 64289 67834 61571 73850 68451 55279 50095 78421 91414 99578 69748 46886 59477
17638 59477 67396 73691 80134 99449 86594 94428 107329 92239 62405 63188 53871 41343 36103
17625 36103 26582 12549 1784 10598 14476 35715 57866 83230 101826 86796 72153 78142
$$ packed form
17711D03148L2503M0772R511l4554m4987m5939n5333n8695m9307m5117J4935K2222
17699A89159Q335l6698j9224k4531M429N910k3035Q616J4862K5474J808L0406
17687A85511k473m6875k428K8118L6166M3926N0338K2175L0045M8370O2179P252
17675D62304L696L3852l2096p3064j9135m8905q9848l1695k6374m3423j7024K917
17663A21205n172J1926M277n592k3815l3596L1171K2193L089j3922j4763l9644
17651E7357O932L545o263J2279n399j3172n184K8326J2993Q164k9830k2862J2591
17638E9477P919O295O443J9315j2855P834J2901j5090k9834P83r317j2528n240
17625C6103r521j4033j0765Q814L878K1239K2151K5364J8596j5030j4643N989
$$ plain form
17613 78142 88092 50718 54006 85025 82621 52686 34338 50564 29397 -12934 10241 55534
17601 55534 73793 64183 48569 57450 86511 92736 70874 61358 54299 43568 20809 22139 47313
17588 47313 54846 55124 43059 63676 65080 77570 83345 84878 76344 78078 90641 96221 102164 92734
17574 92734 43817 23049 59620 106236 95911 73184 65607 61890 46774 34521 66412 109952
17562 109952 94367 78320 62129 85703 86612 78187 55983 60417 86929 78797 60530 49102
17550 49102 59241 109262 138226 120936 122581 118680 90981 88043 103309 107424 87568 79682 82134
17537 82134 94379 100459 115525 118637 99444 105996 100493 102968 113034 92834 100905 114528 122544
17524 122544 123416 99311 93599 111995 105800 90911 54503 53375 49981 69078 100360 80481 57815
$$ packed form
17613G8142R950l7374L288L1019k404k9935j8348J6226k1167m2331K3175M5293
17601E5534J8259r610j5614Q881K9061O225k1862r516p059j0731k2759J330K5174
17588D7313P533K78j2065K0617J404J2490N775J533q534J734J2563N580N943r430
17574I2734m8917k0768L6571M6616j0325k2727p577l717j5116j2253L1891M3540
17562A09952j5585j6047j6191K3574R09q425k2204M434K6512q132j8267j1428
17550D9102J0139N0021K8964j7290J645l901k7699k938J5266M115j9856p886K452
17537H2134J2245O080J5066L112j9193O552n503K475J0066k0200Q071J3623Q016
17524A22544Q72k4105n712J8396o195j4889l6408j128l394J9097L1282j9879k2666
$$ plain form
17511 57815 49891 54663 77715 103537 112796 106388 109544 105167 123327 133828 91760 61655 64503
17498 64503 73023 91753 95373 91727 94202 90088 71209 60401 70022 110378 103057 88471 82119
17485 82119 130019 128419 119058 112050 70440 71953 94470 94767 97620 114936 133020 130710 157717
17472 157717 179064 164141 171212 175600 176750 180486 169650 209389 257237 277294 254469 250329
17460 250329 255460 282938 296962 312472 311028 340607 362493 377417 381298 410662 435838 453855
17448 453855 470195 503428 530401 557427 590765 611843 608634 609083 588656 553713 510790 464697
17436 464697 429268 393692 385553 359328 345984 313173 312251 324704 327968 323859 346172 340186 349892
17423 349892 343399 354632 359912 340494 353253 353943 354909 394070 411451 420413 442028 454701 441552
$$ packed form
17511E7815p924M772K3052K5822R259o408L156m377J8160J0501m2068l0105K848
17498F4503Q520J8730L620l646K475m114j8879j0808R621M0356p321j4586o352
17485H2119M7900j600r361p008m1610J513K2517K97K853J7316J8084k310K7007
17472A57717K1347j4923P071M388J150L736j0836L9739M7848K0057k2825m140
17460B50329N131K7478J4024J5510j444K9579K1886J4924L881K9364K5176J8017
17448D53855J6340L3233K6973K7026L3338K1078l209M49k0427l4943m2923m6093
17436D64697l5429l5576q139k6225j3344l2811r22J2453L264m109K2313n986R706
17423C49892o493J1233N280j9418J2759O90R66L9161J7381Q962K1615J2673j3149
$$ plain form
17410 441552 466111 450563 450824 463049 466896 448294 419410 415926 411147 399577 336449 309583
17398 309583 300079 281680 271324 257542 257428 237928 227743 205415 200977 193067 221543 227867 235706
17385 235706 240211 251937 262159 261846 253618 248510 254671 297345 339403 369068 363584 360730 396325
17372 396325 392046 385502 392561 396947 397431 422076 453151 494506 507247 510445 527829 532482 558064
17359 558064 590879 624048 631227 629018 658646 702687 749205 791828 847809 901001 937239 986914
17347 986914 1031318 1062574 1102628 1180021 1246863 1311931 1431013 1508263 1608977 1717494 1833809
17336 1833809 2012944 2204525 2414874 2636284 2938695 3248302 3593799 3971080 4372877
17327 4372877 4795925 5230301 5708223 6320030 7048329 7922664 8977115 10275710 11907236
$$ packed form
17410D41552K4559j5548K61J2225L847j8602k8884l484m779j1570o3128k6866
17398C09583r504j8399j0356j3782j14j9500j0185k2328m438p910K8476O324P839
17385B35706M505J1726J0222l13q228n108O161M2674M2058K9665n484k854L5595
17372C96325m279o544P059M386M84K4645L1075M1355J2741L198J7384M653K5582
17359E58064L2815L3169P179k209K9628M4041M6518M2623N5981N3192L6238M9675
17347I86914M4404L1256M0054P7393O6842O5068J19082P7250J00714J08517J16315
17336A833809J79135J91581K10349K21410L02411L09607L45497L77281M01797
17327D372877M23048M34376M77922O11807P28299Q74335J054451J298595J631526
$$ plain form
17318 11907236 14005458 16693123 20217914 24993775 31438828 39945771 50203672 60817868
17310 60817868 69694257 75744929 79606163 82278028 83067512 76856743 64217839 47993167
17302 47993167 33960907 25509913 20601693 17450993 15282699 13756149 12701140 11998320
17294 11998320 11581252 11368778 11274809 11327507 11521827 11927260 12513625 13231369 14133752 15297828
17284 15297828 16894421 18967577 21747483 25581496 30869617 38143846 47278318 57118317
17276 57118317 65751186 71871329 75688417 78229064 79538778 75558428 64679816 49901391
17268 49901391 35459016 26151378 20683575 17159092 14684647 12846995 11432547 10389620
17260 10389620 9628205 8994684 8465346 8057509 7712743 7429718 7216256 7022038 6833810
$$ packed form
17318A1907236K098222K687665L524791M775861O445053Q506943J0257901J0614196
17310F0817868Q876389O050672L861234K671865P89484o210769j2638904j6224672
17302D7993167j4032260q450994m908220l150700k168294j526550j055009p02820
17294A1998320m17068k12474r3969N2698J94320M05433N86365P17744R02383J164076
17284A5297828J596593K073156K779906L834013N288121P274229R134472R839999
17276E7118317Q632869O120143L817088K540647J309714l980350j0878612j4778425
17268D9901391j4442375r307638n467803l524483k474445j837652j414448j042927
17260A0389620p61415o33521n29338m07837l44766k83025k13462j94218j88228
$$ plain form
17251 6833810 6628325 6408358 6161752 5902458 5615523 5390617 5241159 5090719 4951783
17242 4951783 4845522 4787607 4706810 4634681 4572957 4508679 4434637 4387781 4324771 4280266 4301285
17231 4301285 4324396 4321688 4294840 4241564 4160838 4070472 3983585 3917549 3856679 3779096 3690426
17220 3690426 3615887 3550735 3458862 3379908 3312417 3277638 3221465 3166574 3126785 3084014 3007769
17209 3007769 2979582 2940041 2883199 2834234 2794259 2749850 2750616 2781660 2773088 2716935 2682710 2675995
17197 2675995 2747226 2780521 2793200 2811741 2778873 2706163 2633631 2552288 2489741 2443916 2387445
17186 2387445 2321601 2233899 2168308 2115363 2051902 1999393 1900783 1818335 1707597 1622291 1556027
17175 1556027 1477913 1416177 1368340 1333808 1316091 1265588 1239697 1217037 1158279 1101944 1054417
$$ packed form
17251F833810k05485k19967k46606k59294k86935k24906j49458j50440j38936
17242D951783j06261n7915q0797p2129o1724o4278p4042m6856o3010m4505K1019
17231D301285K3111k708k6848n3276q0726r0366q6887o6036o0870p7583q8670
17220C690426p4539o5152r1873p8954o7491l4779n6173n4891l9789m2771p6245
17209C007769k8187l9541n6842m8965l9975m4409P66L1044q572n6153l4225o715
17197B675995P1231L3295J2679J8541l2868p2710p2532q1343o2547m5825n6471
17186B387445o5844q7702o5591n2945o3461n2509r8610q2448j10738q5306o6264
17175A556027p8114o1736m7837l4532j7717n0503k5891k2660n8758n6335m7527
$$ plain form
17164 1054417 1041643 1008140 1001181 970268 957621 954991 929984 888065 852580 810618 783135 791527
17152 791527 788199 782477 726954 684671 660223 647557 618486 579070 558819 548170 512981 452182
17140 452182 397827 359520 353935 331961 322537 308384 307137 300611 269549 228511 208544 203450
17128 203450 211083 186803 158619 158139 166049 150185 145142 137379 142732 115338 103951 105685 112281
17115 112281 121657 133493 158663 170569 173783 135016 101310 100544 111881 128080 132117 131396 115498
17102 115498 94761 118283 121151 121165 105174 80338 62213 68303 99170 114647 140060 99711
17090 99711 109521 131672 159611 141260 120145 120228 138020 149646 149199 154388 141758 166004 162947
17077 162947 167031 158230 151646 128281 139658 166582 164158 157583 169785 199566 211944 203053 190687
$$ packed form
17164A054417j2774l3503o959l0913j2647k630k5007m1919l5485m1962k7483Q392
17152G91527l328n722n5523m2283k4448j2666k9071l9416k0251j0649l5189o0799
17140D52182n4355l8307n585k1974r424j4153j247o526l1062m1038j9967n094
17128B03450P633k4280k8184m80P910j5864n043p763N353k7394j1387J734O596
17115A12281R376J1836K5170J1906L214l8767l3706p66J1337J6199M037p21j5898
17102A15498k0737K3522K868J4j5991k4836j8125O090L0867J5477K5413m0349
17090I9711R810K2151K7939j8351k1115Q3J7792J1626m47N189j2630K4246l057
17077A62947M084q801o584k3365J1377K6924k424o575J2202K9781J2378q891j2366
$$ plain form
17064 190687 190131 209595 234532 272916 286298 260328 239608 213651 212191 190889 193615 221198
17052 221198 227191 211858 193525 200598 195625 208958 178189 170184 197553 221701 232017 228064
17040 228064 233058 205968 191189 193081 191169 196432 208033 204656 227323 261306 231696 228102 206130
17027 206130 192867 198550 182050 189678 176060 181068 197035 180146 174677 179613 201372 213170
17015 213170 209019 167835 140605 140526 147183 148468 132485 139073 117245 88749 88631 96376 84832
17002 84832 92801 77200 42465 86831 112912 134456 130399 105896 75761 97056 98205 73341
16990 73341 47871 50836 77827 80206 54094 42586 21998 26118 24347 17634 27616 40249 64431
16977 64431 54280 49495 31957 23473 4432 13840 58514 51272 35495 18408 7135 17316
$$ packed form
17064A90687n56J9464K4937L8384J3382k5970k0720k5957j460k1302K726K7583
17052B21198N993j5333j8333P073m973J3333l0769q005K7369K4148J0316l953
17040B28064M994k7090j4779J892j912N263J1601l377K2667L3983k9610l594k1972
17027B06130j3263N683j6500P628j3618N008J5967j6889n469M936K1759J1798
17015B13170m151m1184k7230p9O657J285j5983O588k1828k8496j18P745j1544
17002H4832P969j5601l4735M4366K6081K1544m057k4503l0135K1295J149k4864
16990G3341k5470K965K6991K379k6112j1508k0588M120j771o713R982J2633K4182
16977F4431j0151m785j7538q484j9041R408M4674p242j5777j7087j1273J0181
$$ plain form
16965 17316 32496 32699 5856 3812 13655 25027 20386 28628 32374 21819 37753 25406 34316
16952 34316 21221 3758 1088 20408 29159 23624 53850 61549 65506 73092 61894 87111 129313
16939 129313 135975 94461 53375 50604 75921 55225 39144 27360 63300 69510 71988 56245
16927 56245 28812 24632 49118 58421 37565 36857 33322 58813 62217 45537 40883 66316 83145
16914 83145 97374 104413 103712 95570 68439 64784 58839 69900 89044 78608 75211 79174 68662
16901 68662 60547 50305 50242 34257 21865 2540 29237 53707 87233 83051 81981 88277 69095
16888 69095 86571 105882 103543 102274 85481 94311 86303 75353 80266 63464 75539 113785 95577
16875 95577 81875 84565 69232 56622 58887 50513 42042 50497 39744 50261 67827 48488 1077
$$ packed form
16965A7316J5180K03k6843k044R843J1372m641Q242L746j0555J5934j2347Q910
16952C4316j3095j7463k670J9320Q751n535L0226P699L957P586j1198K5217M2202
16939A29313O662m1514m1086k771K5317k0696j6081j1784L5940O210K478j5743
16927E6245k7433m180K4486R303k0856p08l535K5491L404j6680m654K5433J6829
16914H3145J4229P039p01q142k7131l655n945J1061J9144j0436l397L963j0512
16901F8662q115j0242o3j5985j2392j9325K6697K4470L3526m182j070O296j9182
16888F9095J7476J9311k339j269j6793Q830q008j0950M913j6802J2075L8246j8208
16875I5577j3702K690j5333j2610K265q374q471Q455j0753J0517J7566j9339m7411
$$ plain form
16862 1077 -3258 41052 67537 71768 71644 63529 40755 24753 3202 5529 15383 42718 25433
16849 25433 9662 9672 13311 6755 -8004 -14370 -3630 -6275 -14078 20 -15713 -2200 6354
16836 6354 2241 7265 2670 3254 20167 5418 -11394 -3001 -1193 3488 -15008 -37910 -15479
16823 -15479 19967 -5890 -5697 9791 3405 18872 30517 -5877 -10456 -16189 -13532 -1632 33608
16810 33608 -7435 -32841 -2865 55018 61101 61891 76113 57923 46864 41984 53773 71948
16798 71948 43698 871 -9203 -12150 -23633 -7692 15100 20859 33483 35861 43755 32618
16786 32618 11995 31909 71405 73893 61507 46436 50545 77283 52265 20991 51506 82841
16774 82841 75484 59894 61688 75855 94545 107715 104778 100331 124618 186768 260577 313409
$$ packed form
16862A077m335M4310K6485M231j24q115k2774j6002k1551K327R854K7335j7285
16849B5433j5771J0L639o556j4759o366J0740k645p803J4098j5733J3513Q554
16836F354m113N024m595N84J6913j4749j6812Q393J808M681j8496k2902K2431
16823a5479L5446k5857J93J5488o386J5467J1645l6394m579n733K657J1900L5240
16810C3608m1043k5406K9976N7883O083P90J4222j8190j1059m880J1789J8175
16798G1948k8250m2827j0074k947j1483J5941K2792N759J2624K378P894j1137
16786C2618k0623J9914L9496K488j2386j5071M109K6738k5018l1274L0515L1335
16774H2841p357j5590J794J4167J8690J3170k937m447K4287O2150P3809N2832
$$ plain form
16762 313409 349779 394889 431817 455066 476967 441200 375058 311913 251663 177185 146722
16751 146722 116123 89067 99414 111401 127441 119813 115752 81745 69729 83879 96504 100273
16739 100273 106475 135317 142549 130168 110696 151390 179437 194745 243927 308519 366574 418942
16727 418942 432366 426826 447725 489841 488282 453487 387020 270965 202018 162584 121759 118507
16715 118507 102395 70101 396 28099 64121 72942 75544 80214 72064 44614 51788 77633
16703 77633 71595 31937 27445 35532 24409 40247 49907 70669 88957 90806 55591 18885 -10413
16690 -10413 -23614 -36263 -13189 9966 31564 12716 -570 -17645 -6791 37479 28448 13236
16678 13236 15769 -10902 -6864 -1802 12654 20449 26756 40943 34574 4828 -16628 13136 12257
$$ packed form
16762C13409L6370M5110L6928K3249K1901l5767o6142o3145o0250p4478l0463
16751A46722l0599k7056J0347J1987J6040p628m061l4007j2016J4150J2625L769
16739A00273O202K8842P232j2381j9472M0694K8047J5308M9182O4592N8055N2368
16727D18942J3424n540K0899M2116j559l4795o6467j16055o8947l9434m0825l252
16715A18507j6112l2294o9705K7703L6022Q821K602M670q150k7450P174K5845
16703G7633o038l9658m492Q087j1123J5838R660K0762J8288J849l5215l6706k9298
16690a0413j3201j2649K3074K3155K1598j8848j3286j7075J0854M4270r031j5212
16678A3236K533k6671M038N062J4456P795O307J4187o369k9746k1456K9764q79
$$ plain form
16665 12257 27130 11209 21976 37705 31328 29572 40140 14207 -4506 -11887 -28822 -72963
16653 -72963 -81042 -65521 -43620 -26228 -17201 -9876 14723 19846 10996 22284 19537 21019 65144
16640 65144 86642 59965 32628 49203 76044 62934 57215 30188 31328 28410 11952 -7427
16628 -7427 19674 20308 -8522 -23999 -51156 -40325 4299 -6871 12203 11817 4030 7104 11583
16615 11583 32399 44178 23489 -18102 -29690 -9780 15135 21807 34193 50700 34045 21163
16603 21163 9822 -6305 -11776 -19470 5939 16801 48035 17754 9707 27668 48827 26211
16591 26211 16094 14871 26568 22864 21702 9806 -7527 -5219 29967 41369 28943 6902
16579 6902 -10756 -3898 46172 29740 -2835 -1776 -14231 -12214 -23401 -14049 -4895 -15068 4754
$$ packed form
16665A2257J4873j5921J0767J5729o377j756J0568k5933j8713p381j6935m4141
16653g2963q079J5521K1901J7392R027P325K4599N123q850J1288k747J482M4125
16640F5144K1498k6677k7337J6575K6841j3110n719k7027J140k918j6458j9379
16628g427K7101O34k8830j5477k7157J0831M4624j1170J9074l86p787L074M479
16615A1583K0816J1779k0689m1591j1588J9910K4915O672J2386J6507j6655j2882
16603B1163j1341j6127n471p694K5409J0862L1234l0281q047J7961K1159k2616
16591B6211j0117j223J1697l704j162j1896j7333K308L5186J1402j2426k2041
16579F902j7658O858N0070j6432l2575J059j2455K017j1187R352R154j0173J9822
$$ plain form
16566 4754 17570 41278 27520 28938 25410 52212 22049 -18291 -21890 -44913 -67245 -69376 -61805
16553 -61805 -24279 -384 -3628 26153 2142 6579 -21299 -61395 -69047 -82686 -60029 -38583
16541 -38583 13464 22925 20372 8738 14406 -6990 -16914 -17407 -27511 -23389 -2957 -3686 -3313 -34441
16527 -34441 -29638 6615 -25791 -39749 -14005 -15340 -27205 -142 7366 -10418 -18161 -31573
16515 -31573 -50311 -40426 -29096 -61555 -57399 -59276 -75475 -45438 20715 44172 46705 18602
16503 18602 6120 15177 20073 8565 -6386 801 -108 3840 -5002 -19788 -26576 -33321 405
16490 405 21005 28598 9987 -6658 -2880 1210 -12673 -15839 16679 45335 17977 -6073 -19109
16477 -19109 -3125 -11626 13998 39452 16551 -25120 -63217 -60440 -53129 -37345 -10214 6763
$$ packed form
16566D754J2816K3708j3758J418l528K6802l0163m0340l599k3023k2332k131P571
16553f1805L7526K3895l244K9781k4011M437k7878m0096p652j3639K2657K1446
16541c8583N2047R461k553j1634N668k1396r924m93j0104M122K0432p29L73l1128
16527c4441M803L6253l2406j3958K5744j335j1865K7063P508j7784p743j3412
16515c1573j8738R885J1330l2459M156j877j6199L0037O6153K3457K533k8103
16503A8602j2482R057M896j1508j4951P187r09L948q842j4786o788o745L3726
16490D05K0600P593j8611j6645L778M090j3883l166L2518K8656k7358k4050j3036
16477a9109J5984q501K5624K5454k2901m1671l8097K777P311J5784K7131J6977
$$ plain form
16465 6763 -9999 -13614 -19033 9309 30695 25653 21701 6500 -1267 -29219 386 12266 39867
16452 39867 49462 27207 29945 23236 -1565 -3731 -3134 -16604 -17666 6168 2146 8022 1143 594
16438 594 10180 -12193 -35905 -15125 -12705 -60602 -68940 -47900 -19760 -25559 -46232 -36409 -27134
16425 -27134 -20449 -27152 -7629 7548 3178 4787 -3305 -32718 -47844 -35525 -38698 -27599 9048
16412 9048 29808 -3171 -18777 -31999 -20560 -10009 1565 -4314 -6979 9782 26223 57983
16400 57983 67780 64032 50343 24883 34485 23950 -9471 -19372 -32814 3293 25627 9574
16388 9574 5539 3846 12093 -3146 20733 19219 14690 6467 580 5866 26695 59817 26927
16375 26927 -24866 -12568 -1986 552 -21406 3521 -5932 12161 339 8061 6348 -7140
$$ packed form
16465F763j6762l615n419K8342K1386n042l952j5201p767k7952K9605J1880K7601
16452C9867R595k2255K738o709k4801k166N97j3470j062K3834m022N876o879n49
16438E94R586k2373k3712K0780K420m7897q338K1040K8140n799k0673R823R275
16425b7134O685o703J9523J5177m370J609q092k9413j5126J2319l173J1099L6647
16412I048K0760l2979j5606j3222J1439J0551J1574n879k665J6761J6441L1760
16400E7983R797l748j3689k5460R602j0535l3421r901j3442L6107K2334j6053
16388I574m035j693Q247j5239K3879j514m529q223n887N286K0829L3122l2890
16375B6927n1793J2298J0582K538k1958K4927r453J8093j1822P722j713j3488
$$ plain form
16363 -7140 -27239 -56589 -74114 -46526 -63219 -79022 -89570 -53302 -14030 -6514 -22232 -36854
16351 -36854 -14549 9507 10816 22844 26386 41946 53214 62550 43560 10014 -10024 -22964
16339 -22964 -39738 -44306 -45472 -43085 -49095 -31114 -33506 -30076 13455 42680 31859 39989 30307
16326 30307 -7191 -54341 -51937 -34599 -9853 5307 14928 -18559 -26376 10291 205 -15970
16314 -15970 -22456 -26581 -15419 10016 36579 11119 -17243 10987 29963 9679 5261 43424
16302 43424 53025 23289 6696 3988 3896 -8634 -39821 -51488 -34998 -9464 -20319 -11043 1560
16289 1560 11277 28069 24618 55309 43724 16817 16242 42048 46861 37343 24263 11017 -1297
16276 -1297 -2396 -8179 -26357 -11797 -22966 -5804 -7202 -19017 11397 41791 18793 3968
$$ packed form
16363g140k0099k9350j7525K7588j6693j5803j0548L6268L9272P516j5718j4622
16351c6854K2305K4056J309J2028L542J5560J1268R336j8990l3546k0038j2940
16339b2964j6774m568j166K387o010J7981k392L430M3531K9225j0821Q130r682
16326C0307l7498m7150K404J7338K4746J5160R621l3487p817L6667j0086j6175
16314a5970o486m125J1162K5435K6563k5460k8362K8230J8976k0284m418L8163
16302D3424R601k9736j6593k708r2j2530l1187j1667J6490K5534j0855R276J2603
16289A560R717J6792l451L0691j1585k6907n75K5806M813r518j3080j3246j2314
16276a297j099n783j8178J4560j1169J7162j398j1815L0414L0394k2998j4825
$$ plain form
16264 3968 4965 -8353 -28659 -40252 -52317 -79900 -78633 -53235 -24266 10070 38260 40263 34702
16251 34702 44255 22624 16582 37937 34773 -785 -3412 21166 27253 23988 19571 -2895 11586
16238 11586 35524 25432 -3206 17501 23746 25806 29216 -6781 -31663 -31514 -37849 -36695 -22340
16225 -22340 -4576 8654 -11693 -5013 -33671 -39663 -31919 -41134 -31350 6186 11250 -9890 -675
16212 -675 -28394 -23670 -7097 -22011 -25254 -19487 -16322 -2664 -28757 -28888 -18368 534 16699
16199 16699 -10143 -7755 -16575 -36355 7482 46483 51772 26560 -961 3417 25803 12460
16187 12460 4753 -5932 -21357 -29725 -47982 -47301 -25214 -25796 -38818 -81044 -89847 -55511 -24558
16174 -24558 -5327 10344 1147 -12095 -28212 -23787 -8499 -5363 -9451 4245 46971 41537 -7626
$$ packed form
16264C968R97j3318k0306j1593j2065k7583J267K5398K8969L4336K8190K003n561
16251C4702R553k1631o042K1355l164l5558k627K4578O087l265m417k2466J4481
16238A1586K3938j0092k8638K0707O245K060L410l5997k4882J49o335J154J4355
16225b2340J7764J3230k0347O680k8658n992P744r215R784L7536N064k1140R215
16212f75k7719M724J6573j4914l243N767L165J3658k6093j31J0520J8902J6165
16199A6699k6842K388q820j9780M3837L9001N289k5212k7521M378K2386j3343
16187A2460p707j0685j5425q368j8257O81K2087n82j3022m2226q803L4336L0953
16174b4558J9231J5671r197j3242j6117M425J5288L136m088J3696M2726n434m9163
$$ plain form
16161 -7626 2927 12398 19281 -5617 -24876 -13247 -9213 -21169 -36973 -28002 -10070 -1271 4098
16148 4098 -10910 17619 19299 9680 -11946 1269 19151 6712 -25133 2598 38020 21711
16136 21711 7261 1015 -15401 -6921 -25178 -29296 -35236 -34836 -52781 -34419 7697 -15477 -41602
16123 -41602 -32539 -28376 -17668 -14627 -12686 1797 18996 29598 2894 3155 659 -12813 551
16110 551 -27999 -53837 -59193 -30120 -4878 -2906 2040 -2126 -18512 -29442 -35106 -27568 -32085
16097 -32085 -30953 -41000 -55378 -50227 -48959 -21725 -58386 -43671 -12962 -8504 18 -613 -10048
16084 -10048 -11805 -24870 -20987 -48226 -44862 7423 45622 37302 5885 -11935 -18521 15635 11304
16071 11304 692 5082 -2191 13473 11111 -22717 -38314 -64250 -30274 -3932 15852 3490
$$ packed form
16161g626J0553R471O883k4898j9259J1629M034j1956j5804Q971J7932Q799N369
16148D098j5008K8529J680r619k1626J3215J7882j2439l1845K7731L5422j6309
16136B1711j4450o246j6416Q480j8257m118n940M00j7945J8362M2116k3174k6125
16123d1602R063M163J0708L041J941J4483J7199J0602k6704K61k496j3472J3364
16110E51k8550k5838n356K9073K5242J972M946m166j6386j0930n664P538m517
16097c2085J132j0047j4378N151J268K7234l6661J4715L0709M458Q522o31r435
16084a0048j757j3065L883k7239L364N2285L8199q320l1417j7820o586L4156m331
16071A1304j0612M390p273J5664k362l3828j5597k5936L3976K6342J9784j2362
$$ plain form
16059 3490 -17399 -56608 -76080 -58376 -37371 -41318 -29087 -22484 -31198 -27752 -22028 5755 -992
16046 -992 -19903 -35655 -8975 -3952 -21198 -7806 18222 -2408 -25164 -30422 -15360 -10020 9791
16033 9791 28664 1804 -32554 -26920 -21021 -3713 9349 25623 13272 -15924 -21341 -23159 -8108
16020 -8108 10702 17579 -2245 -18719 -36951 -30720 -14407 7798 9594 -46755 -57809 -24056
16008 -24056 -10737 -12040 -21246 -19086 -19843 -28500 -4733 5180 35417 33406 19131 23073 14893 12740
15994 12740 20358 245 -7069 21365 21618 7616 -11861 -15252 -29724 -20455 4018 23153 12394
15981 12394 -9310 -29074 -60623 -65632 -21102 -6042 170 2225 -10087 -32617 -26166 -1266
15969 -1266 4202 3749 -12508 -8978 -15509 -10550 1903 12943 30826 158 -22270 -54181 -66960
$$ packed form
16059C490k0889l9209j9472J7704K1005l947J2231O603q714L446N724K7783o747
16046i92j8911j5752K6680N023j7246J3392K6028k0630k2756n258J5062N340J9811
16033I791J8873k6860l4358N634N899J7308J3062J6274j2351k9196n417j818J5051
16020h108J8810O877j9824j6474j8232O231J6313K2205J796n6349j1054L3753
16008b4056J3319j303r206K160p57q657K3767R913L0237k011j4275L942q180k153
15994A2740P618k0113p314K8434K53j4002j9477l391j4472R269K4473J9135j0759
15981A2394k1704j9764l1549n009M4530J5060O212K055j2312k2530O451K4900
15969a266N468m53j6257L530o531M959J2453J1040J7883l0668k2428l1911j2779
$$ plain form
15956 -66960 -42948 -21380 -230 1412 -22219 -33749 -57109 -47591 -19959 -35701 -25034 -9813
15944 -9813 -9241 -31288 -59506 -63036 -27936 8487 4958 -1285 -16276 -7140 -17727 -34642 -39154
15931 -39154 -24563 -39474 -31304 -45369 -21408 -1973 -5295 -10985 -6220 -4775 2261 30928 7666
15918 7666 2448 -11439 -24900 -15242 -20452 -20509 -20687 -19630 -19607 -10291 5724 31562 28007 -17222 -22972
15903 -22972 -24584 -39 -35774 -55734 -39434 6757 10741 -14443 -49352 -53953 -74838 -77389
15891 -77389 -85872 -63896 -37198 -35558 -32453 -17788 -4319 -3193 -17397 -36421 -16380 -24957 -22967
15878 -22967 -34121 -51420 -28557 -31211 -30474 -7537 12 15271 22782 5512 -28272 -40229 -52258
15865 -52258 -75391 -78540 -49082 -30874 -13785 -2283 -13207 -42232 -44720 -37119 -22267 9251
$$ packed form
15956f6960K4012K1568K1150J642k3631j1530k3360R518K7632j5742J0667J5221
15944i813N72k2047k8218l530L5100L6423l529o243j4991R136j0587j6915m512
15931c9154J4591j4911Q170j4065K3961J9435l322n690M765J445P036K8667k3262
15918G666n218j3887j3461R658n210n7j78J057K3R316J6015K5838l555m5229n750
15903b2972j612K4545l5735j9960J6300M6191L984k5184l4909m601k0885k551
15891g7389q483K1976K6698J640L105J4665J3469J126j4204j9024K0041q577J990
15878b2967j1154j7299K2863k654P37K2937P549J5259P511j7270l3784j1957j2029
15865e2258k3133l149K9458J8208J7089J1502j0924k9025k488P601J4852L1518
$$ plain form
15853 9251 21058 13333 -14856 -16201 1289 -8407 -631 37439 52799 54799 40867 7204 5222
15840 5222 4316 -17148 -16249 -5490 -6676 -20322 -714 17283 35223 40546 31276 29031 30639 23419
15826 23419 -517 -47597 -19287 -6824 -11509 -8457 -5662 -25227 -13268 -6263 -7110 -28621 -52229
15813 -52229 -42137 -33853 1126 13997 -13156 -14745 15099 28449 27683 10134 16030 18571 -4104
15800 -4104 532 20682 27762 14858 -4289 5116 7908 21351 29605 16637 1369 11219 -11611
15787 -11611 -4116 34141 1912 -18464 -40387 -50053 -18063 16286 45416 18073 2302 20306
15775 20306 16476 -10044 -17154 -16927 -20514 -14372 13615 21034 11676 6688 -4448 -2456 3541 1929
15761 1929 -15814 9628 -1446 -46086 -43750 -40382 -17106 -1463 -6991 -7639 1935 4045 -32561
$$ packed form
15853I251J1807p725k8189j345J7490r696P776L8070J5360K000j3932l3663j982
15840E222r06k1464Q99J0759j186j3646J9608J7997J7940N323r270k245J608p220
15826B3419k3936m7080K8310J2463m685L052K795j9565J1959P005q47k1511k3608
15813e2229J0092Q284L4979J2871k7153j589K9844J3350p66j7549N896K541k2675
15800d104M636K0150P080j2904j9147R405K792J3443Q254j2968j5268R850k2830
15787a1611P495L8257l2229k0376k1923r666L1990L4349K9130k7343j5771J8004
15775B0306l830k6520p110K27l587O142K7987P419r358m988j1136J992N997j612
15761A929j7743K5442j1074m4640K336L368K3276J5643n528o48R574K110l6606
$$ plain form
15748 -32561 -17026 1877 3566 -15227 -15874 -1407 4317 -10883 -20328 -16441 -13611 -50050 -40759
15735 -40759 -54559 -61824 -42552 -62180 -80629 -80327 -64522 -32922 -19017 -24409 -42514 -36894 -19746
15722 -19746 -1194 4703 -30698 -38341 -44384 -47640 -43588 -45668 -25694 -41003 -15531 32309 1440
15709 1440 -17278 -20603 -30173 -9809 16324 51772 46837 26929 29382 15241 4770 -23542 -44073
15696 -44073 -31166 -24725 3543 17096 -4944 -29447 -50556 -82218 -60706 -67972 -73713 -51340
15684 -51340 -31711 -11818 -11819 -2013 -18891 -17478 9783 21876 25026 16251 26086 36110 14218
15671 14218 -27374 -16304 21955 24668 -3234 10674 8356 5371 22335 5712 20616 21411 6060
15658 6060 -24506 -32359 -30843 -59055 -51104 -30522 -12477 -26460 -28481 -37001 -41800 -46536 -11373
$$ packed form
15748c2561J5535J8903J689j8793o47J4467N724j5200r445L887K830l6439R291
15735d0759j3800p265J9272j9628j8449L02J5805L1600J3905n392j8105N620J7148
15722a9746J8552N897l5401p643o043l256M052k080J9974j5309K5472M7840l0869
15709A440j8718l325r570K0364K6133L5448m935j9908K453j4141j0471k8312k0531
15696d4073J2907O441K8268J3553k2040k4503k1109l1662K1512p266n741K2373
15684e1340J9629J9893jR806j6878J413K7261J2093L150q775R835J0024k1892
15671A4218m1592J1070L8259K713k7902J3908k318k985J6964j6623J4904P95j5351
15658F060l0566p853J516k8212P951K0582J8045j3983k021q520m799m736L5163
$$ plain form
15645 -11373 -10727 -15784 -34618 -41851 -19247 -18598 -10024 14319 8901 -36320 -39560 -26857 -11574
15632 -11574 -8232 -14931 -29004 -24944 -26697 -23723 -26137 -16603 -16217 -7654 -12488 -44679 -34917 -29568
15618 -29568 -20317 -24804 -22400 -12164 -5518 28152 30681 3914 -28272 -46089 -18594 -16888 -21518
15605 -21518 -4037 -4600 -44559 -66468 -58678 -57320 -80358 -77736 -57373 -33805 -29119 -66429 -75946
15592 -75946 -76780 -77253 -70453 -63750 -38372 -9079 -8500 -38680 -20398 -19669 -30745 -37134 -47855 -45482
15578 -45482 -55908 -64070 -50652 -21146 -27572 -31489 -29037 -10234 1352 -10984 -30717 -31620 -53756
15565 -53756 -35171 -16543 8646 -9548 -82462 -49714 -6615 -16750 -20360 -15642 -3886 -39684
15553 -39684 -36380 -18230 -18130 -2341 -16498 -15429 -16371 -34565 -51281 -31913 -7432 906 8851
$$ packed form
15645a1373O46n057j8834p233K2604O49Q574K4343n418m5221l240J2703J5283
15632a1574L342o699j4073M060j753K974k414R534L86Q563m834l2191R762N349
15618b9568R251m487K404J0236O646L3670K529k6767l2186j7817K7495J706m630
15605b1518J7481n63l9959k1909P790J358k3038K622K0363K3568M686l7310r517
15592g5946q34m73O800O703K5378K9293N79l0180J8282P29j1076o389j0721K373
15578d5482j0426q162J3418K9506o426l917K452J8803J1586j2336j9733r03k2136
15565e3756J8585J8628K5189j8194p2914L2748M3099j0135l610M718J1756l5798
15553c9684L304J8150J00J5789j4157J069r42j8194j6716J9368K4481Q338P945
$$ plain form
15540 8851 -19990 -20469 11612 -4286 -34105 -29340 -22204 -17250 -29042 -19565 16591 21295 3134
15527 3134 2313 33270 45412 26161 5967 -26152 -39755 -40869 -10756 11385 5212 -25488 -18999
15514 -18999 1384 1657 2605 -4159 -24701 -35302 -41025 -40943 -47009 -57451 -30546 -18691 -8736 20734
15500 20734 -5810 -34840 -4422 36584 61219 48979 2077 -32907 -22799 -21016 -34727 -17205
15488 -17205 7672 -9724 -21269 -23972 -49095 -50561 -22944 -41002 -37012 -19267 -18350 -44592 -58544
15475 -58544 -66737 -66783 -64055 -51705 -51836 -53744 -45527 -845 4446 21228 47347 38742 19461 -24901
15461 -24901 -35945 -1929 21579 14047 -25142 -913 13245 -24838 -44329 -29457 -31112 -30075
15449 -30075 -42735 -30214 -15572 11780 54813 80015 58190 35483 6254 -11208 -15403 -30766
$$ packed form
15540H851k8841m79L2081j5898k9819M765P136M954j1792R477L6156M704j8161
15527C134q21L0957J2142j9251k0194l2119j3603j114L0113K2141o173l0700O489
15514a8999K0383K73R48o764k0542j0601n723Q2o066j0442K6905J1855R955K9470
15500B0734k6544k9030L0418M1006K4635j2240m6902l4984J0108J783j3711J7522
15488a7205K4877j7396j1545k703k5123j466K7617j8058L990J7745R17k6242j3952
15475e8544q193m6K728J2350j31j908Q217M4682N291J6782K6119q605j9281m4362
15461b4901j1044L4016K3508p532l9189K4229J4158l8083j9491J4872j655J037
15449c0075j2660J2521J4642K7352M3033K5202k1825k2707k9229j7462m195j5363
$$ plain form
15437 -30766 10498 37262 18901 9544 33185 52833 55779 71611 50799 4313 -40944 -29952
15425 -29952 1753 24472 14085 -12114 -17099 -59 21239 15060 5911 8082 -5912 -8983 7051
15412 7051 106 -5099 -11560 2912 19553 13526 14571 28634 1864 -7186 -28050 -6773 -8264
15399 -8264 -26931 -59181 -74908 -70926 -36893 -14784 -21907 -51190 -18719 -4317 12340 17308
15387 17308 7611 2986 24631 44899 21533 21141 31784 36817 48517 37542 21629 1955 -1798
15374 -1798 6298 284 15213 8067 -12893 -16382 -11507 -9564 -30795 -41557 -41451 -48675 -23673 -17492
15360 -17492 -11471 -28807 -18425 -27225 -29342 -17127 -33385 -53859 -26514 -31661 -51798 -31386
15348 -31386 -27487 -45611 -46405 -13788 -1347 -9259 -1841 -199 -11842 11248 12074 -11185 -19763
$$ packed form
15437c0766M1264K6764j8361r357K3641J9648K946J5832k0812m6486m5257J0992
15425b9952L1705K2719j0387k6199m985J7040K1298o179r149K171j3994l071J6034
15412G051o945n205o461J4472J6641o027J045J4063k6770r050k0864K1277j491
15399h264j8667l2250j5727L982L4033K2109p123k9283L2471J4402J6657M968
15387A7308r697m625K1645K0268k3366l92J0643N033J1700j0975j5913j9674l753
15374a798Q096o014J4929p146k0960l489M875J943k1231j0762J06p224K5002O181
15360a7492O021j7336J0382q800k117J2215j6258k0474K7345n147k0137K0412
15348c1386L899j8124p94L2617J2441p912P418J642j1643K3090Q26k3259q578
$$ plain form
15335 -19763 -23635 -43447 -37721 -13407 769 -11635 -56150 -75102 -43049 -26403 -6808 -3996
15323 -3996 -150 -654 11944 16316 -6645 -48992 -70511 -78045 -17720 12141 36227 13831 -9290
15310 -9290 -22008 -27000 -29752 -14710 -21718 -20464 -45217 -65382 -49332 -28150 4121 34587 23267
15297 23267 -14138 -33854 -16058 -44758 -38954 -1877 8037 -11104 -28484 -11113 -14724 -18369
15285 -18369 -37425 -35807 -36217 -49422 -55348 -32877 -1790 24609 38165 50323 18316 5148
15273 5148 17725 4880 -1055 -16081 623 43544 41571 29913 33968 -63 41159 35728 25245
15260 25245 23129 25946 32119 29135 3462 22171 17221 -33356 -30462 12066 -19907 -33565 -58650
15247 -58650 -34807 -3769 -4340 -4604 -14659 -7988 29049 17801 -44608 -47666 -28375 -25502 -10059
$$ packed form
15335a9763l872j9812N726K4314J4176j2404m4515j8952L2053J6646J9595K812
15323c996L846n04J2598M372k2961m2347k1519p534O0325K9861K4086k2396k3121
15310i290j2718m992k752J5042p008J254k4753k0165J6050K1182L2271L0466j1320
15297B3267l7405j9716J7796k8700N804L7077R914j9141j7380J7371l611l645
15285a8369j9056J618m10j3205n926K2471L1087K6399J3556J2158l2007j3168
15273E148J2577j2845n935j5026J6704M2921j973j1658M055l4031M1222n431j0483
15260B5245k116K817O173k984k5673J8709m950n0577K894M2528l1973j3658k5085
15247e8650K3843L1038n71k64j0055O671L7037j1248o2409l058J9291K873J5443
$$ plain form
15234 -10059 -640 -11257 2977 -22588 -31996 -21601 -23217 -20947 -52365 -30170 -24577 -13262 11926
15221 11926 17286 -20428 -21446 -10324 -8760 -4606 -9766 1991 -35 -21033 -40378 -39565 -25091
15208 -25091 -23027 -14886 -13559 -26144 -20222 8171 2885 -23896 -17205 -12095 -5201 3456 -3776 -10251
15194 -10251 23021 33542 10220 18743 39572 54063 47230 3749 3732 -26116 -39907 -36039 -49072
15181 -49072 -37440 3485 15927 31446 2789 -8856 -2355 12562 -2388 -16247 1270 31545
15169 31545 2221 -4876 15675 24095 18247 15307 -4280 -15454 -16492 -7729 -19304 -16618 -5062
15156 -5062 7331 -12777 -51167 -71304 -51756 -47472 -31662 -10062 -22085 -32081 3861 2883 8377
15143 8377 4619 8814 4292 1882 -7129 -38237 -67077 -51050 -30479 -21115 -17661 -5815 17268
$$ packed form
15234a0059R419j0617J4234k5565r408J0395j616K270l1418K2195N593J1315K5188
15221A1926N360l7714j018J1122J564M154n160J1757k026k0998j9345Q13J4474
15208b5091K064Q141J327j2585N922K8393n286k6781O691N110O894Q657p232o475
15194a0251L3272J0521k3322Q523K0829J4491o833m3481j7k9848j3791L868j3033
15181d9072J1632M0925J2442J5519k8657j1645O501J4917j4950j3859J7517L0275
15169C1545k9324p097K0551Q420n848k940j9587j1174j038Q763j1575K686J1556
15156e062J2393k0108l8390k0137J9548M284J5810K1600j2023r996L5942r78N494
15143H377l758M195m522k410r011l1108k8840J6027K0571R364L454J1846K3083
$$ plain form
15130 17268 34634 -6631 -13814 -24388 -18875 -27689 -35652 -230 2991 -25415 -37575 -32208 -24289
15117 -24289 -6396 -3133 11721 46393 53382 63568 57374 21103 2048 -22176 -9263 15936
15105 15936 9072 -22965 -24266 -31203 -40311 -45993 -22640 11102 14675 -34556 -25263 26809 20419
15092 20419 22090 26757 24012 7151 -2902 1866 1396 359 5589 2787 -25178 -46051 -49451 -13596
15078 -13596 4015 -23242 -21727 -11563 78 -19739 -20828 -20482 -8309 -2244 -36125 -29136 -26504
15065 -26504 -32339 -37106 -49388 -34877 -47919 -41107 -30760 -18306 -9495 1021 8043 -11780 -30546
15052 -30546 -38841 -15468 -14867 -3825 18828 10565 -22949 -22423 -2204 -906 -10614 -11811 -4097 -5509
15038 -5509 -13938 -25991 -64026 -71551 -70959 -39926 -29045 -6906 -5462 10645 13233 22461 48702
$$ packed form
15130A7268J7366m1265p183j0574N513q814p963L5422L221k8406j2160N367P919
15117b4289J7893L263J4854L4672O989J0186o194l6271j9055k4224J2913K5199
15105A5936o864l2037j301o937r108n682K3353L3742L573m9231R293N2072o390
15092B0419J671M667k745j6861j0053M768m70j037N230k802k7965k0873l400L5855
15078a3596J7611k7257J515J0164J1641j9817j089L46J2173O065l3881O989K632
15065b6504n835m767j2282J4511j3042O812J0347J2454Q811J0516P022j9823j8766
15052c0546q295K3373O01J1042K2653q263l3514N26K0219J298r708j197P714j412
15038e509q429j2053l8035p525N92L1033J0881K2139J444J6107K588R228K6241
$$ plain form
15025 48702 34703 25793 36493 33325 22964 2339 -15560 -12455 -15582 -51576 -59145 -28505 -20069
15012 -20069 -27069 -32190 193 5928 -487 385 -27120 -31104 -25539 -20257 -22041 -16976 -18448 -32653
14998 -32653 -21467 -35240 -55014 -34023 -24330 -22035 -7587 -3110 -30307 -24592 2287 -37831
14986 -37831 -47616 -22124 -3182 -11414 -5941 13736 11824 16239 10273 33507 35920 37900 23142
14973 23142 -21639 -10295 -12698 -26993 -7425 -3905 4827 34 -4586 19339 45316 36919 -434
14960 -434 -17370 -28687 -40015 -18591 -3507 -4255 -6672 -6965 -5127 -9624 3173 14247 19535 -4049
14946 -4049 -54795 -64325 -28826 -10234 -13802 -7183 -2178 -2734 -12274 501 10774 25415 -3247
14933 -3247 -16414 -14496 -12087 11466 -5433 -28618 -38175 -15019 -10826 14746 23950 12146 6529
$$ packed form
15025D8702j3999q910J0700l168j0361k0625j7899L105l127l5994p569L0640Q436
15012b0069p000n121L2383N735o415Q72k7505l984N565N282j784N065j472j4205
14998c2653J1186j3773j9774K0991R693K295J4448M477k7197N715K6879m0118
14986c7831r785K5492J8942q232N473J9677j912M415n966K3234K413J980j4758
14973B3142m4781J1344k403j4295J9568L520Q732m793m620K3925K5977q397l7353
14960d34j6936j1317j1328K1424J5084p48k417k93J838m497J2797J1074N288k3584
14946d049n0746r530L5499J8592l568O619N005n56r540J2775J0273J4641k8662
14933c247j3167J918K409K3553j6899k3185r557K3156M193K5572R204j1804n617
$$ plain form
14920 6529 -5308 -26962 -47337 -60994 -35422 -11234 -40824 -38495 -32252 -15180 -3417 -3578 -13395
14907 -13395 -20982 -7709 1839 -18948 -25254 16606 12762 -8333 -20069 -10320 13920 -20083 -18763
14894 -18763 -2631 2987 16645 29508 30176 25381 -13801 -13961 -11615 -22622 -4024 13149 -2193
14881 -2193 -14319 -35398 -26224 -31357 -26787 -10031 -8724 -10967 -3924 280 12509 6083 -5759
14868 -5759 -19869 -9566 -26236 -25568 -35306 -53624 -60985 -60783 -31727 -21987 4602 9273 -1571
14855 -1571 7040 -16186 -40817 -17871 -21020 -17189 -17348 -19081 -18909 -26005 -15795 10668 -4521 -7784
14841 -7784 -20099 -29371 -837 -659 -12794 -207 -3867 -19432 -13403 -25828 -35030 -7210 5455
14828 5455 -9887 -10989 -12581 -20914 -26521 -41218 -29644 -14380 15563 28815 36921 34692 21166
$$ packed form
14920F529j1837k1654k0375j3657K5572K4188k9590K329O243J7072J1763j61r817
14907a3395p587J3273R548k0787o306M1860l844k1095j1736R749K4240l4003J320
14894a8763J6132N618J3658J2863O68m795l9182j60K346j1007J8598J7173j5342
14881b193j2126k1079R174n133M570J6756J307k243P043M204J2229o426j1842
14868e759j4110J0303j6670O68r738j8318p361K02K9056R740K6589M671j0844
14855a571Q611k3226k4631K2946l149L831j59j733J72p096J0210K6463j5189l263
14841g784j2315r272K8534J78j2135J2587l660j5565O029j2425r202K7820J2665
14828E455j5342j102j592q333n607j4697J1574J5264K9943J3252Q106k229j3526
$$ plain form
14815 21166 -3676 -6843 -7025 -19836 -12270 3683 5788 -41303 -48993 -2409 11011 748 -12131
14802 -12131 -20346 -36247 -26369 21999 14011 15736 13228 1810 11644 22870 4590 -12671 -28037
14789 -28037 -45656 -39221 -46073 -55773 -50213 -36832 -32665 -52340 -70906 -82194 -58644 -59545 -51982
14776 -51982 -23666 -15906 -17812 -9914 -19547 -30831 -17753 -19496 -20030 4690 35012 7815 24990
14763 24990 15869 -19083 -7969 32908 12140 -11049 336 9705 -14875 -9903 -17389 -17379 17753
14750 17753 13028 -23891 -30491 -18924 -15856 4166 -5085 -27002 -4555 -2442 -11337 -4161 -601
14737 -601 -16497 -5524 18469 19343 30742 28220 2445 5563 9430 -16738 -49655 -44925 -4227
14724 -4227 1701 -25228 -48602 -16839 -256 -10854 -19734 -18135 7790 7835 2166 -22018 -41812
$$ packed form
14815B1166k4842l167j82j2811P566J5953K105m7091p690M6584J3420j0263j2879
14802a2131q215j5901R878M8368p988J725k508j1418R834J1226j8280j7261j5366
14789b8037j7619O435o852r700N560J3381M167j9675j8566j1288K3550r01P563
14776e1982K8316P760j906P898r633j1284J3078j743n34K4720L0322k7197J7175
14763B4990r121l4952J1114M0877k0768k3189J1385R369k4580M972p486J0L5132
14750A7753m725l6919o600J1567L068K0022r251k1917K2447K113q895P176L560
14737f01j5896J0973K3993Q74J1399k522k5775L118L867k6168l2917M730M0698
14724d227N928k6929k3374L1763J6583j0598q880J599K5925M5n669k4184j9794
$$ plain form
14711 -41812 -26211 -9398 4051 4150 -10864 -31574 -28744 -14030 -30979 -40771 -57776 -44942 -40104
14698 -40104 -60337 -46433 -1704 25874 -4396 -10718 -6081 -13882 -7973 1602 10854 19737 22188
14685 22188 1883 6952 25564 50835 53291 40349 13110 1416 -11273 -15903 -13398 -5120 18507
14672 18507 22066 4881 -15281 4667 8876 16535 -11687 -5368 10771 5919 15157 2557 -18712
14659 -18712 -43144 -39081 -32649 -11637 8253 19589 2275 -13058 -6785 10730 18015 13335 -949
14646 -949 -30038 -12349 -11082 -13007 -10453 2581 24859 17628 -2248 -20514 -29489 -114 -16943
14633 -16943 -30318 9113 15725 -3158 -2145 -15897 -34209 -27206 -18575 -3534 -18629 -12782 -17624
14620 -17624 -33695 -17747 -6759 -5832 -8329 6960 26219 14676 -21034 -19078 -919 -11708
$$ packed form
14711d1812J5601J6813J3449R9j5014k0710K830J4714j6949r792j7005J2834M838
14698d0104k0233J3904M4729K7578l0270o322M637p801N909R575R252Q883K451
14685B2188k0305N069J8612K5271K456j2942k7239j1694j2689m630K505Q278K3627
14672A8507L559j7185k0162J9948M209P659k8222O319J6139m852R238j2600k1269
14659a8712k4432M063O432K1012J9890J1336j7314j5333O273J7515P285m680j4284
14646i49k9089J7689J267j925K554J3034K2278p231j9876j8266q975K9375j6829
14633a6943j3375L9431O612j8883J013j3752j8312P003Q631J5041j5095N847m842
14620a7624j6071J5948J0988R27k497J5289J9259j1543l5710J956J8159j0789
$$ plain form
14608 -11708 -23427 -33271 -45877 -46271 -35956 -69961 -68774 -56931 -66788 -53501 -56028 -3063 45644
14595 45644 39359 11624 -1856 -35110 -8661 -3512 -12567 -16600 -12337 -8644 13966 10552 17332
14582 17332 37377 28862 23868 -183 -31586 -9830 27178 42358 40289 38722 20939 777
14570 777 -14486 -63766 -84528 -42734 -22012 -28583 -28883 -43417 -43039 -40088 -57645 -25100 -23797
14557 -23797 -25087 -3282 -20474 -38579 -17409 16737 40779 -211 -34380 -36299 -21887 -10431
14545 -10431 -5810 -41517 -61455 -51373 -36892 -13420 -3356 17138 15838 19658 17253 45253
14533 45253 52865 25277 31543 60315 41351 43667 51949 27585 20093 -6231 10913 25718 6911
14520 6911 -970 -8257 -21183 -15222 5785 -83 3978 6287 34137 40067 20361 28456 51637
$$ packed form
14608a1708j1719r844j2606l94J0315l4005J187J1843r857J3287k527N2965M8707
14595D5644o285k7735j3480l3254K6449N149r055m033M263L693K2610l414O780
14582A7332K0045q515m994k4051l1403K1756L7008J5180k069j567j7783k0162
14570G77j5263m9280k0762M1794K0722o571l00j4534L78K951j7557L2545J303
14557b3797j290K1805j7192j8105K1170L4146K4042m0990l4169j919J4412J1456
14545a0431M621l5707j9938J0082J4481K3472J0064K0494j300L820k405K8000
14533D5253P612k7588O266K8772j8964K316Q282k4364p492k6324J7144J4805j8807
14520F911p881p287j2926N961K1007n868M061K309K7850N930j9706Q095K3181
$$ plain form
14507 51637 37863 36664 22420 10740 15842 24987 4277 -15827 3696 7907 1527 5937 9920
14494 9920 13317 6628 19408 29828 2194 -29407 -43484 -8938 19022 -7204 -31338 -20268
14482 -20268 -42951 -34090 -11110 -16538 -20705 -36372 -51938 -65512 -77882 -81242 -72475 -62358 -44410
14469 -44410 -40696 -38935 -39729 -54716 -68080 -39301 -13589 14476 2184 -28297 -48684 -52433 -30068
14456 -30068 -10295 -17398 -26036 790 3828 -3209 13230 26225 21660 14201 -4879 4060 -22530
14443 -22530 -30250 -24176 -3072 3564 -15946 -33878 -35699 -42700 -29062 -5533 1233 4669 16664
14430 16664 23714 18487 -10689 -15194 -13813 -12994 -4835 1401 -17925 -12322 -324 6151 3192 -13520
14416 -13520 -6858 -7792 -23751 -16536 16663 31536 31444 27954 31429 41099 25849 56131 40866 13807
$$ packed form
14507E1637j3774j199j4244j1680N102R145k0710k0104J9523M211o380M410L983
14494I920L397o689J2780J0420k7634l1601j4077L4546K7960k6226k4134J1070
14482b0268k2683Q861K2980n428m167j5667j5566j3574j2370l360Q767J0117J7948
14469d4410L714J761p94j4987j3364K8779K5712K8065j2292l0481k0387l749K2365
14456c0068J9773p103q638K6826L038p037J6439J2995m565p459j9080Q939k6590
14443b2530p720O074K1104O636j9510j7932j821p001J3638K3529O766L436J1995
14430A6664P050n227k9176m505J381Q19Q159O236j9326N603J1998O475k959j6712
14416a3520O662r34j5959P215L3199J4873r2l490L475R670j5250L0282j5265k7059
$$ plain form
14402 13807 1097 -8986 -14361 14737 5125 -13254 -18307 -22747 -2954 19945 7932 -17565
14390 -17565 -28262 -16087 -10660 -9429 4528 4958 19040 23235 12040 -1640 18234 32719 25518
14377 25518 20255 17847 17354 8085 -4274 2082 29923 8917 -23389 -20214 -9880 14001 9061
14364 9061 -1948 -8312 -20219 -13699 -9149 -27095 -29418 11940 48952 50917 38015 28016 24275
14351 24275 -9165 -4968 1818 -1842 55701 60950 19404 -43398 -68241 -37710 -25601 -48339
14339 -48339 -35668 -25809 -35038 -46446 -39721 -40186 -43669 -35759 -49599 -24850 3313 3954 4364 11777
14325 11777 -4148 1639 -7852 -14898 -12663 -21242 -23571 739 15261 16699 -15204 -12296 -17878
14312 -17878 -32235 -39835 -42690 -38713 -23374 -2601 19600 -4409 20688 8517 20785 19773
$$ packed form
14402A3807j2710j0083n375K9098r612j8379n053m440J9793K2899j2013k5497
14390a7565j0697J2175N427J231J3957M30J4082M195j1195j3680J9874J4485p201
14377B5518n263k408m93r269j2359O356K7841k1006l2306L175J0334K3881m940
14364I061j1009o364j1907O520M550j7946k323M1358L7012J965j2902r999l741
14351B4275l3440M197O786l660N7543N249m1546o2802k4843L0531J2109k2738
14339d8339J2671R859r229j1408O725m65l483P910j3840K4749K8163O41M10P413
14325A1777j5925N787r491p046K235q579k329K4310J4522J438l1903K908n582
14312a7878j4357p600k855L977J5339K0773K2201k4009K5097j2171J2268j012
$$ plain form
14300 19773 29515 33060 12574 10626 45739 54558 39957 32855 31597 26147 -9932 -12266 -18301
14287 -18301 -7410 -8682 -37573 -46195 -35567 -17421 -801 19174 29141 28923 2886 -13137 -8977
14274 -8977 -22660 -2228 12548 -11550 -56394 -75893 -68012 -59963 -36081 -33634 -30620 -7636 -1774
14261 -1774 9653 -6800 13025 11735 -15482 -35423 -39481 -27828 663 33721 25637 25496 22506
14248 22506 -1264 -20061 -41416 -35396 7605 -1297 3321 14669 -5802 -8402 -4947 5674 -14247
14235 -14247 -47453 -54531 -43052 -24015 14958 39622 28714 23494 13605 17688 4532 -10821
14223 -10821 7498 7458 15731 44700 23930 10174 7254 -6434 -19751 -5126 -12490 -46055 -39999
14210 -39999 -24436 -15758 -9366 -29824 -47149 -41939 -18329 -17217 -10497 -11946 -42410 -60693 -27289
$$ packed form
14300A9773R742L545k0486j948L5113Q819j4601p102j258n450l6079k334o035
14287a8301J0891j272k8891q622J0628J8146J6620J9975R967k18k6037j6023M160
14274h977j3683K0432J4776k4098m4844j9499P881Q049K3882K447L014K2984N862
14261a774J1427j6453J9825j290k7217j9941m058J1653K8491L3058q084j41k990
14248B2506k3770j8797k1355O020M3001q902M618J1348k0471k600L455J0621j9921
14235a4247l3206p078J1479J9037L8973K4664j0908n220r889M083j3156j5353
14223a0821J8319m0Q273K8969k0770j3756k920j3688j3317J4625p364l3565O056
14210c9999J5563Q678O392k0458j7325N210K3610J112O720j449l0464j8283L3404
$$ plain form
14197 -27289 -4558 -13242 -17685 -18131 -17850 -11848 -27696 -13006 -7221 -35151 -47597 -47388 -47242 -59020
14183 -59020 -33932 147 8196 -15501 -33378 -7517 19824 6027 3048 28030 53352 37857
14171 37857 38654 32498 14334 -5416 -24065 -34301 -26235 -7394 -9434 -9219 12663 2791 -10796
14158 -10796 15846 39648 46503 49645 33249 -28679 -45013 -37320 -31571 -43914 -48561 -82769 -61986
14145 -61986 -17873 -32141 -32915 7370 55067 57151 54934 58991 34560 13972 -6160 -4984 -6753
14132 -6753 -30393 -35135 -46466 -14867 -4793 -15569 -21102 -33290 -28592 -17068 7760 19277
14120 19277 9796 -1807 -11235 7934 -14427 -26587 -26126 -12123 -7628 3479 23755 11162 13714
14107 13714 18415 25678 -1738 17010 19163 15958 22268 13892 11243 -8751 -22686 -30542 -23616
$$ packed form
14197b7289K2731q684m443m46K81O002j5848J4690N785k7930j2446K09J46j1778
14183e9020K5088L4079Q049k3697j7877K5861K7341j3797k979K4982K5322j5495
14171C7857P97o156j8164j9750j8649j0236Q066J8841k040K15K1882r872j3587
14158a0796K6642K3802O855L142j6396o1928j6334P693N749j2343m647l4208K0783
14145f1986M4113j4268p74M0285M7697K084k217M057k4431k0588k0132J176j769
14132f753k3640m742j1331L1599J0074j0776n533j2188M698J1524K4828J1517
14120A9277r481j1603r428J9169k2361j2160M61J4003M495J1107K0276j2593K552
14107A3714M701P263k7416J8748K153l205O310q376k649j9994j3935p856O926
$$ plain form
14094 -23616 -13056 12049 24711 7959 -10644 -29839 -30158 -18015 -22110 -24774 -22920 -7716 -2152
14081 -2152 320 25735 24825 24133 11559 -11383 -4816 -11957 20353 14571 3815 -21598 -50596
14068 -50596 -43605 -23917 -13763 -4202 16881 46791 51138 47309 24251 8071 11067 13220 15543
14055 15543 9825 -11278 -23251 -47881 -35715 -22090 -24654 -15952 23222 34710 12513 4387
14043 4387 3511 6256 9322 27461 31267 31933 51856 50699 35061 22403 216 -478 -4271 -4213 -10587
14028 -10587 -13315 -31918 -33000 4386 1664 -15886 -15768 12984 14136 3229 37991 57076 10731
14015 10731 -6790 -9890 -46818 -66211 -45118 -20057 11200 -20442 -45384 -18590 -28747 -60560
14003 -60560 -38186 -30605 -41898 -13596 11330 4385 -14030 -2325 -4546 7699 8152 -17148 -18826
$$ packed form
14094b3616J0560K5105J2662j6752j8603j9195l19J2143m095k664J854J5204N564
14081b152K472K5415r10o92j2574k2942O567p141L2310n782j0756k5413k8998
14068e0596O991J9688J0154R561K1083K9910M347l829k3058j6180K996K153K323
14055A5543n718k1103j1973k4630J2166J3625k564Q702L9174J1488k2197q126
14043D387q76K745L066J8139L806O66J9923j157j5638j2658k2187o94l793N8o374
14028a0587k728j8603j082L7386k722j7550J18K8752J152j0907L4762J9085m6345
14015A0731j7521l100l6928j9393K1093K5061L1257l1642k4942K6794j0157l1813
14003f0560K2374P581j1293K8302K4926o945j8415J1705k221J2245M53k5300j678
$$ plain form
13990 -18826 -8698 -2919 -15768 -27327 -14205 10041 17184 -10101 -20342 2583 -6138 -9920
13978 -9920 -16995 -30188 -23712 -22747 -11383 5228 -912 -32430 -13114 20671 6808 8683 5679
13965 5679 16607 2908 -28606 -18953 -26364 -40376 -47527 -31632 -20057 -12000 -15608 -22545 -7170
13952 -7170 -52606 -53796 -3152 1419 -617 2895 -14865 -7329 -20350 -27181 -19443 -17082 31921
13939 31921 25046 7063 6321 27071 46566 48001 54891 52255 30080 -140 -13658 -10535 4274
13926 4274 19174 12164 -9138 7347 35325 30829 12507 9160 29022 28247 49956 82010 43254
13913 43254 -13787 -7535 -18398 -21220 -14454 -11271 -13349 -17364 -10910 -28725 -36899 -41618 -11450
13900 -11450 15576 7441 12254 26697 30564 41829 37695 9403 -5064 -479 14538 10196 -20582
$$ packed form
13990a8826J0128N779j2849j1559J3122K4246P143k7285j0241K2925q721l782
13978i920p075j3193O476R65J1364J6611o140l1518J9316L3785j3863J875l004
13965E679J0928j3699l1514R653p411j4012p151J5895J1575Q057l608o937J5375
13952g170m5436j190N0644M571k036L512j7760P536j3021o831P738K361M9003
13939C1921o875j7983p42K0750J9495J435O890k636k2175l0220j3518L123J4809
13926D274J4900p010k1302J6485K7978m496j8322l347J9862p75K1709L2054l8756
13913D3254n7041O252j0863k822O766L183k078m015O454j7815q174m719L0168
13900a1450K7026q135M813J4443L867J1265m134k8292j4467M585J5017m342l0778
$$ plain form
13887 -20582 -21983 27408 42240 34311 19527 -222 -18108 -8924 -5914 22804 29735 17059 -8174
13874 -8174 9357 22552 15041 22369 46021 39979 36897 38856 1723 -15700 -7245 -5636 -4768 -20843
13860 -20843 -9295 -1775 -6588 -15955 6786 36031 64939 47349 28657 -9757 -20591 -13507
13848 -13507 972 -1220 16442 27176 10642 21826 21035 29564 20778 13684 17584 21585 3975
13835 3975 -21100 -18199 10814 27461 41778 35776 23104 -2636 -10005 7293 28103 40206
13823 40206 25890 -12591 -32238 -10286 35774 36353 38366 38287 29351 26449 7413 -6889 -21129
13810 -21129 -43588 -39227 6144 46868 49871 75796 85755 74870 46259 35990 25766 21439
13798 21439 13845 9094 18974 30566 41075 29850 12895 22179 18605 34481 8628 -29401 -30573
$$ packed form
13887b0582j401M9391J4832p929j4784j9749j7886R184L010K8718O931j2676k5233
13874h174J7531J3195p511P328K3652o042l082J959l7133j7423Q455J609Q68j6075
13860b0843J1548P520m813r367K2741K9245K8908j7590j8692l8414j0834P084
13848a3507J4479k192J7662J0734j6534J1184p91Q529q786p094L900M001j7610
13835C975k5075K901K9013J6647J4317o002j2672k5740p369J7298K0810J2103
13823D0206j4316l8481j9647K1952M6060N79K013p9q936k902j9036j4302j4240
13810b1129k2459M361M5371M0724L003K5925R959j0885k8611j0269j0224m327
13798B1439p594m751R880J1592J0509j1225j6955R284l574J5876k5853l8029j172
$$ plain form
13785 -30573 -6389 9404 -4889 -6039 -2225 6499 16300 4726 -9261 -6489 -29477 -40799 -16553
13772 -16553 6290 29948 52012 44617 24386 24190 5427 -420 -10659 -6547 19604 27865 26288
13759 26288 17266 -17357 -12498 -8769 -838 8758 626 2263 33120 52603 49589 40250 6977
13746 6977 14117 11361 15967 31934 -6953 -31307 28542 3538 -5998 -3087 17147 48903 56849
13733 56849 38835 9853 4767 17247 7033 -10954 11568 17620 28564 25080 17471 24045 4679
13720 4679 -37784 -34190 -26972 779 41712 29024 147 -33731 -36780 -49714 -49869 -27119 1328
13707 1328 -23507 -76631 -57671 -5834 -10563 -16386 -23758 -25065 -26836 -11008 36834 55227 72219
13694 72219 73512 46737 47620 28024 2725 -1402 2294 7095 15414 7787 33262 13528 -5786
$$ packed form
13785c0573K4184J5793j4293j150L814Q724R801j1574j3987K772k2988j1322K4246
13772a6553K2843K3658K2064p395k0231j96j8763n847j0239M112K6151Q261j577
13759B6288r022l4623M859L729P931R596q132J637L0857J9483l014r339l3273
13746F977P140k756M606J5967l8887k4354N9849k5004r536K911K0234L1756P946
13733E6849j8014k8982n086J2480j0214j7987K2522O052J0944l484p609O574j9366
13720D679m2463L594P218K7751M0933j2688k8877l3878l049j2934j55K2750K8447
13707A328k4835n3124J8960N1837m729n823p372j307j771J5828M7842J8393J6992
13694G2219J293k6775Q83j9596k5299m127L696M801Q319p627K5475j9734j9314
$$ plain form
13681 -5786 4795 31652 45054 21002 25780 53756 39526 17954 401 -1186 -10052 11011
13669 11011 22579 9550 -3871 -27623 -36364 -18195 215 -5283 -3626 -5349 -1876 4763 17132
13656 17132 2731 -25047 -36323 9050 15253 -4692 3977 16734 19999 37727 61100 27987
13644 27987 37696 38919 2832 7463 20013 27534 26100 29870 47821 35798 41039 72141 60628
13631 60628 52279 34953 26310 6648 31070 52811 59406 51560 27622 9478 -17755 4543
13619 4543 -10793 -2450 -16152 -13139 3833 -5447 -17486 3435 6071 9403 -2306 -13052 671
13606 671 8616 23629 36222 36176 29414 43394 53396 27598 -5885 -30526 -31213 -13592 2088
13593 2088 -5223 -13501 -30922 -36621 -27606 -21637 -22154 -1807 24412 37001 26519 26656 33827 28413
$$ packed form
13681e786J0581K6857J3402k4052M778K7976j4230k1572j7553j587q866K1063
13669A1011J1568j3029j3421k3752q741J8169J8410n498J657j723L473O639J2369
13656A7132j4401k7778j1276M5373O203j9945Q669J2757L265J7728K3373l3113
13644B7987R709J223l6087M631J2550P521j434L770J7951j2023N241L1102j1513
13631F0628q349j7326q643j9662K4422K1741O595p846k3938j8144k7233K2298
13619D543j5336Q343j3702L013J6972r280j2039K0921K636L332j1709j0746J3723
13606F71P945J5013J2593m6o762J3980J0002k5798l3483k4641o87J7621J5680
13593B088p311q278j7421n699R015N969n17K0347K6219J2589j0482J37P171n414
$$ plain form
13579 28413 26447 14968 12575 26340 43504 41714 12938 -5663 -12483 6131 18487 3166
13567 3166 9529 22625 14736 23803 45769 54235 48321 37799 34308 16339 6551 8922 18677 5274
13553 5274 -12110 -10530 916 11687 15804 37970 42433 39597 39841 18668 -5182 8390 23005
13540 23005 34397 9678 15315 2740 -37478 -36415 -33860 -8018 28438 26906 7440 1712 -24119
13527 -24119 10570 11945 -21505 -30983 -16599 9691 27371 45867 7637 13282 42020 51964
13515 51964 24371 20392 32019 38915 45938 52623 22073 10123 12629 27278 40576 55251 43888
13502 43888 39762 17177 26878 28622 6754 11224 21003 8626 15481 46478 78855 79462 69595
13489 69595 54067 8226 11980 24385 -12067 -23055 -11659 -12497 1910 28610 10949 -21377
$$ packed form
13579B8413j966j1479k393J3765J7164j790k8776j8601o820J8614J2356j5321
13567C166O363J3096p889R067K1966Q466n914j0522l491j7969r788K371R755j3403
13553E274j7384J580J1446J0771M117K2166M463k836K44k1173k3850J3572J4615
13540B3005J1392k4719N637j2575m0218J063K555K5842L6456j532j9466n728k5831
13527b4119L4689J375l3450r478J4384K6290J7680J8496l8230N645K8738R944
13515E1964k7593l979J1627O896P023O685l0550j1950K506J4649J3298J4675j1363
13502D3888m126k2585R701J744k1868M470R779j2377O855L0997L2377O07r867
13489F9595j5528m5841L754J2405l6452j0988J1396q38J4407K6700j7661l2326
$$ plain form
13477 -21377 -15362 -9173 -24090 -13702 -22396 -24700 -28033 -20254 -32558 -22577 26469 38084 48481
13464 48481 22556 5074 -10268 -2886 30952 34656 27298 38435 45738 60343 53202 47793 55617
13451 55617 55868 34369 36457 24820 22449 3117 -18385 -30875 -8527 1989 10710 9825 34148
13438 34148 43037 30421 30824 21534 28372 18428 23766 -2123 -13132 -23260 -17373 -13505 203
13425 203 18636 35400 5902 8401 28476 50303 27668 18982 21358 38355 39097 28854 -10765
13412 -10765 -21947 -23307 -25912 -28261 -30304 -8743 20555 63274 60245 42202 23751 24712 42645
13399 42645 60248 62351 48935 65665 39067 10307 17616 29810 30115 21776 39628 42646 29511
13386 29511 18555 28119 31021 37199 28764 18864 14320 29661 30246 37588 44702 53293 48958 33692
$$ packed form
13477b1377O015O189j4917J0388q694k304l333P779j2304R981M9046J1615J0397
13464D8481k5925j7482j5342P382L3838L704p358J1137P303J4605p141n409P824
13451E5617K51k1499K088j1637k371j9332k1502j2490K2348J0516Q721q85K4323
13438C4148Q889j2616M03r290O838r944N338k5889j1009j0128N887L868J3708
13425B03J8433J6764k9498K499K0075K1827k2635q686K376J6997P42j0243l9619
13412a0765j1182j360k605k349k043K1561K9298M2719l029j8043j8451R61J7933
13399D2645J7603K103j3416J6730k6598k8760P309J2194L05q339J7852L018j3135
13386B9511j0956R564K902O178q435r900m544J5341N85P342P114Q591m335j5266
$$ plain form
13372 33692 35195 28977 43728 61950 59619 43816 41286 38432 52961 44244 25827 2725 -11636
13359 -11636 5049 33001 -2144 -18846 7643 18098 19960 41282 30522 53732 65817 47736
13347 47736 54452 54773 38545 25444 32616 42199 52343 29193 1206 26021 46136 63663 84073
13334 84073 76128 53942 48115 38508 25603 16660 23460 48678 42692 49529 93086 64639 8604
13321 8604 26079 38981 61874 83743 54632 59855 46668 -4666 -9215 217 29461 23114 18987
13308 18987 31375 50217 31402 22263 23451 19526 10826 49735 40401 34538 51015 69379 58545
13295 58545 62805 64464 38258 48277 59907 61970 70788 59991 39576 55043 69711 43635
13283 43635 22657 20203 41188 45320 44589 45818 42894 52772 52221 54445 64905 57671 25821 42234
$$ packed form
13372C3692J503o218J4751J8222k331j5803k530k854J4529q717j8417k3102j4361
13359a1636J6685K7952l5145j6702K6489J0455J862K1322j0760K3210J2085j8081
13347D7736O716L21j6228j3101P172R583J0144k3150k7987K4815K0115J7527K0410
13334H4073p945k2186n827r607j2905q943O800K5218n986O837M3557k8447n6035
13321H604J7475J2902K2893K1869k9111N223j3187n1334m549R432K9244o347m127
13308A8987J2388J8842j8815r139J188l925q700L8909r334n863J6477J8364j0834
13295E8545M260J659k6206J0019J1630K063Q818j0797k0415J5467J4668k6076
13283D3635k0978k454K0985M132p31J229k924R878n51K224J0460p234l1850J6413
$$ plain form
13269 42234 82058 101300 95722 95259 99607 99737 108959 101159 118195 138652 174765 204178 207738
13256 207738 210121 223025 260301 309497 387633 462084 560667 686234 871276 1121099 1446728
13245 1446728 1837460 2144758 2350061 2450543 2542360 2619261 2647290 2334181 1706830 1209973
13235 1209973 914074 738360 596962 475336 408869 353970 336069 334090 315115 297461 295635
13224 295635 295332 282827 285284 275784 254372 259411 239329 233528 229732 193054 185962 212079 221346
13211 221346 218892 185546 164070 154761 131872 166175 184349 152010 122971 132941 138011 125239
13199 125239 137078 113629 114242 130253 151641 184289 181142 153539 141247 162871 155256 132226
13187 132226 160006 183046 171252 146450 153607 158577 152641 138963 113520 122334 120732 119796 139655
$$ packed form
13269D2234L9824J9242n578m63M348J30R222p800J7036K0457L6113K9413L560
13256B07738K383J2904L7276M9196P8136P4451R8583J25567J85042K49823L25629
13245A446728L90732L07298K05303J00482R1817P6901K8029l13109o27351m96857
13235A209973k95899j75714j41398j21626o6467n4899j7901j979j8975j7654j826
13224B95635l03j2505K457r500k1412N039k0082n801l796l6678p092K6117R267
13211B21346k454l3346k1476r309k2889L4303J8174l2339k9039R970N070j2772
13199A25239J1839k3449O13J6011K1388L2648l147k7603j2292K1624p615k3030
13187A32226K7780K3040j1794k4802P157M970n936j3678k5443Q814j602r36J9859
$$ plain form
13174 139655 156270 158405 180306 184091 161818 175469 187105 214214 192124 169511 161785 139963
13162 139963 145312 177898 178928 160445 150473 145399 128069 118312 108003 97978 96473 142582 143962
13149 143962 139196 129417 109468 105011 121419 138419 142303 135014 127032 126060 130049 158044 130617
13136 130617 92334 78513 94144 98344 105022 123946 110678 75502 92896 114647 108393 109591
13124 109591 90464 104790 78840 72090 87291 73650 74641 105500 97073 87188 121735 137992
13112 137992 138141 86429 63822 55664 68061 80633 81678 66453 60480 59921 40931 58022 103541
13099 103541 144892 130573 123236 117211 111910 69657 23564 35161 55204 46155 61929 101954
13087 101954 125939 139642 141950 119328 109315 172072 179526 182669 187151 196987 226092 216816 188845
$$ packed form
13174A39655J6615K135K1901L785k2273J3651J1636K7109k2090k2613p726k1822
13162A39963N349L2586J030j8483r972n074j7330r757j0309j0025j505M6109J380
13149A43962m766r779j9949m457J6408J7000L884p289p982r72L989K7995k7427
13136A30617l8283j3821J5631M200O678J8924j3268l5176J7394K1751o254J198
13124A09591j9127J4326k5950o750J5201j3641R91L0859q427r885L4547J6257
13112A37992J49n1712k2607q158J2397J2572J045j5225n973n59j8990J7091M5519
13099A03541M1351j4319p337o025n301m2253m6093J1597K0043r049J5774M0025
13087A01954K3985J3703K308k2622j0013O2757P454L143M482R836K9105r276k7971
$$ plain form
13074 188845 169554 154026 135983 151005 123183 90754 163510 187716 178699 209889 218456 217103
13062 217103 233267 208856 216756 193831 178530 187738 197608 183843 147806 153170 180726 189641
13050 189641 195764 215467 213274 222413 209340 206750 217502 258243 279395 282708 267865 257577
13038 257577 222318 204637 236778 266498 275155 287743 260635 227622 182874 191777 233609 263213
13026 263213 260823 262934 272111 245053 199642 181276 182653 153002 136428 169241 186261 178341
13014 178341 162329 155266 151987 160533 149907 160056 186843 197722 239724 283381 283400 276723 269765
13001 269765 264959 278139 284836 273576 248987 250107 253148 225984 210585 198058 209617 235489
12989 235489 259972 283096 307469 317562 267886 229547 232392 288111 331195 362689 372378 354442
$$ packed form
13074A88845j9291j5528j8043J5022k7822l2429P2756K4206r017L1190Q567j353
13062B17103J6164k4411P900k2925j5301R208R870j3765l6037N364K7556Q915
13050A89641O123J9703k193R139j3073k590J0752M0741K1152L313j4843j0288
13038B57577l5259j7681L2141K9720Q657J2588k7108l3013m4748Q903M1832K9604
13026B63213k390K111R177k7058m5411j8366J377k9651j6574L2813J7020p920
13014A78341j6012p063l279Q546j0626J0149K6787J0879M2002M3657J9o677o958
13001B69765m806J3180O697j1260k4589J120L041k7164j5399j2527J1559K5872
12989B35489K4483K3124K4373J0093m9676l8339K845N5719M3084L1494R689j7936
$$ plain form
12977 354442 344836 312678 330281 339126 350195 363884 364396 333775 329999 328228 319581 326163 313763
12964 313763 296188 264704 265507 257411 272987 295380 299144 314479 330307 334057 325793 334830 362814
12951 362814 402863 439828 442541 420547 413336 415631 423595 435537 437410 494834 554892 591263
12939 591263 629272 679666 756192 826616 868786 943898 988158 1026332 1095595 1136926 1185515
12928 1185515 1260868 1353665 1436018 1485049 1563830 1638436 1708586 1795514 1885800 1975182 2025653
12917 2025653 2087251 2143147 2174297 2188547 2166456 2180465 2170257 2064325 1943728 1779407 1592739
12906 1592739 1463041 1324148 1214634 1095011 967587 812120 699385 655516 640169 634998
12896 634998 593891 541821 514645 480520 492707 524827 496237 464120 477700 514743 522973 491449
$$ packed form
12977C54442r606l2158J7603Q845J1069J3689N12l0621l776j771q647O582j2400
12964C13763j7575l1484Q03q096J5576K2393L764J5335J5828L750q264R037K7984
12951C62814M0049L6965K713k1994p211K295P964J1942J873N7424O0058L6371
12939E91263L8009N0394P6526P0424M2170P5112M4260L8174O9263M1331M8589
12928A185515P5353R2797Q2353M9031P8781P4606P0150Q6928R0286Q9382N0471
12917B025653O1598N5896L1150J4250k2091J4009j0208j05932j20597j64321j86668
12906A592739j29698j38893j09514j19623j27424j55467j12735m3869j5347n171
12896F34998m1107n2070k7176l4125J2187L2120k8590l2117J3580L7043Q230l1524
$$ plain form
12884 491449 468367 481237 482630 534443 578543 585922 588323 596221 638492 665399 680989 686883
12872 686883 672190 681603 694518 721711 739294 706868 708488 710962 710919 726623 776104 843881 867655
12859 867655 879083 906323 922997 984333 1037722 1035796 1033998 1050673 1085464 1123578 1187045 1237104
12847 1237104 1294153 1331070 1357719 1425124 1480642 1551945 1591351 1650132 1735361 1835740 1899977
12836 1899977 1971595 2060058 2185868 2301644 2432616 2568998 2681698 2779697 2907646 3066706
12826 3066706 3244845 3385810 3504536 3637237 3771708 3915896 4075435 4275586 4481612
12817 4481612 4719643 4941297 5188000 5488545 5806810 6149773 6529283 6935339 7371238
12808 7371238 7905888 8512321 9195018 9967090 10909957 12038060 13312723 14732882 16272284
$$ packed form
12884D91449k3082J2870J393N1813M4100P379K401P898M2271K6907J5590N894
12872F86883j4693R413J2915K7193J7583l2426J620K474m3J5704M9481O7777K3774
12859H67655J1428K7240J6674O1336N3389j926j798J6675L4791L8114O3467N0059
12847A237104N7049L6917K6649O7405N5518P1303L9406N8781Q5229J00379O4237
12836A899977P1618Q8463J25810J15776J30972J36382J12700R7999J27949J59060
12826C066706J78139J40965J18726J32701J34471J44188J59539K00151K06026
12817D481612K38031K21654K46703L00545L18265L42963L79510M06056M35899
12808G371238N34650O06433O82697P72072R42867J128103J274663J420159J539402
$$ plain form
12799 16272284 18073286 20215910 22706677 25607230 29059939 33203517 38078830 43701468
12791 43701468 50190087 57974616 67651095 79758729 94750961 113418975 138202391
12784 138202391 172553663 220075146 282071087 351195059 410731122 446280029 463990528
12777 463990528 480179312 496243354 492312883 410690818 282531918 194319706 144143685
12770 144143685 113918524 93720142 79322738 68803401 60997671 54869708 49907569
12763 49907569 45816833 42241004 38748446 35409045 32678447 30466700 28709549 27270843
12755 27270843 25983924 24814148 23811458 22965110 22224272 21484859 20764192 20107027 19592926
12746 19592926 19124123 18655201 18170629 17691865 17234629 16834567 16478290 16182562 15907031
$$ packed form
12799A6272284J801002K142624K490767K900553L452709M143578M875313N622638
12791D3701468O488619P784529R676479J2107634J4992232J8668014K4783416
12784A38202391L4351272M7521483O1995941O9123972N9536063L5548907J7710499
12777D63990528J6188784J6064042l930471q1622065j28158900q8212212n0176021
12770A44143685l0225161k0198382j4397404j0519337p805730o127963m962139
12763D9907569m090736l575829l492558l339401k730598k211747j757151j438706
12755B7270843j286919j169776j002690q46348p40838p39413p20667o57165n14101
12746A9592926m68803m68922m84572m78764m57236m00062l56277k95728k75531
$$ plain form
12737 15907031 15614056 15342454 15084363 14846067 14529066 14216317 13958126 13727028 13564799
12728 13564799 13416207 13245448 13092150 12952572 12839819 12759122 12675548 12552600 12405412 12274835
12718 12274835 12210300 12146444 12060963 11997578 11920006 11829772 11759758 11702216 11658643 11641312 11616016
12707 11616016 11593070 11579841 11618342 11687217 11756345 11901323 12165817 12472350 12669476 12661856
12697 12661856 12482565 12211131 11908858 11576237 11261597 10953639 10610629 10242686 9919702
12688 9919702 9614376 9286322 8965419 8684484 8418099 8145694 7900911 7686590 7474276
12679 7474276 7295246 7062613 6858154 6706634 6592264 6430793 6282724 6149764 5994585
12670 5994585 5878702 5790314 5670715 5580010 5493696 5432713 5351504 5257319 5153163 5056901 4966039
$$ packed form
12737A5907031k92975k71602k58091k38296l17001l12749k58191k31098j62229
12728A3564799j48592j70759j53298j39578j12753q0697q3574j22948j47188j30577
12718A2274835o4535o3856q5481o3385p7572r0234p0014n7542m3573j7331k5296
12707A1616016k2946j3229L8501O8875O9128J44978K64494L06533J97126p620
12697A2661856j79291k71434l02273l32621l14640l07958l43010l67943l22984
12688I919702l05326l28054l20903k80935k66385k72405k44783k14321k12314
12679G474276j79030k32633k04459j51520j14370j61471j48069j32960j55179
12670E994585j15883q8388j19599r0705q6314o0983q1209r4185j04156r6262r0862
$$ plain form
12659 4966039 4880571 4783651 4684518 4628039 4572871 4491902 4359101 4226763 4088148 3901632
12649 3901632 3676008 3381028 3111976 2890466 2686507 2487482 2325626 2139103 1945340
12640 1945340 1780914 1667210 1592244 1537895 1476547 1413485 1344743 1320816 1263891 1202092 1164225
12629 1164225 1106117 1024344 961189 916400 857074 835870 845223 766382 727794 707582 685195
12618 685195 663168 657130 626507 567513 536072 516988 525787 516219 505843 466379 444340 412385
12606 412385 434045 468085 461444 445690 461823 492596 478199 468150 443215 408797 384289 363343
12594 363343 344725 370942 369939 381804 390267 398087 407350 386890 346565 338273 377675 377995 387707
12581 387707 391757 397074 394156 403620 418452 445874 458729 475307 483223 493748 505964 557812
$$ packed form
12659D966039q5468r6920r9133n6479n5168q0969j32801j32338j38615j86516
12649C901632k25624k94980k69052k21510k03959j99025j61856j86523j93763
12640A945340j64426j13704p4966n4349o1348o3062o8742k3927n6925o1799l7867
12629A164225n8108q1773o3155m4789n9326k1204R353p8841l8588k0212k2387
12618F85195k2027o038l0623n8994l1441j9084Q799r568j0376l9464k2039l1955
12606D12385K1660L4040o641j5754J6133L0773j4397j0049k4935l4418k4508k0946
12594C63343j8618K6217j003J1865Q463P820R263k0460m0325q292L9402L20R712
12581C87707M050N317k918R464J4832K7422J2855J6578P916J0525J2216N1848
$$ plain form
12569 557812 577256 605993 611214 643628 671290 665766 700571 739329 759306 798486 776360 802370
12557 802370 839426 835889 842174 826637 789641 780533 795971 803939 794233 804888 856248 875567
12545 875567 858054 867323 862939 861818 845494 857774 873571 875370 904171 929848 933726 933054 917859
12532 917859 899507 903770 902174 905189 903181 881755 840482 823605 803506 812697 815698 788990 780187
12519 780187 778422 806602 814038 798398 760373 747566 727349 703830 683692 669023 686522 691265
12507 691265 691483 698541 695500 674758 635462 582510 558526 551418 554841 523650 488529 452945 448711
12494 448711 441665 438532 444018 452272 435496 427770 437981 405979 384684 388655 338390 307893 280972
12481 280972 253231 228692 213990 212229 209477 196403 208451 199839 195079 164617 156736 178042
$$ packed form
12569E57812J9444K8737N221L2414K7662n524L4805L8758J9977L9180k2126K6010
12557H02370L7056l537O285j5537l6996r108J5438P968r706J0655N1360J9319
12545H75567j7513R269m384j121j6324J2280J5797J799K8801K5677L878o72j5195
12532I17859j8352M263j596L015k008k1426m1273j6877k0099R191L001k6708q803
12519G80187j765K8180P436j5640l8025j2807k0217k3519k0138j4669J7499M743
12507F91265K18P058l041k0742l9296n2952k3984p108L423l1191l5121l5584m234
12494D48711p046l133N486Q254j6776p726J0211l2002k1295L971n0265l0497k6921
12481B80972k7741k4539j4702j761k752j3074J2048q612m760l0462p881K1306
$$ plain form
12469 178042 193866 185382 182233 215668 225178 244511 252175 238279 231886 223375 183712 199740 178764
12456 178764 161817 161004 141062 118761 134024 152948 156818 171204 175843 205758 191797 178436
12444 178436 208966 202533 186129 141911 154924 164086 192333 171453 183524 179202 189142 192137
12432 192137 191101 178751 167611 163034 165066 170750 167749 187928 185646 180239 211662 228880 243636
12419 243636 258101 236532 216923 206848 184340 206353 233807 208941 198734 230851 234433 259533
12407 259533 260202 278501 290075 288646 285214 268774 249056 266711 271959 269415 276703 280743 295707
12394 295707 312352 306476 295364 317462 326601 320536 325651 319939 297027 280291 253150 235214
12382 235214 237965 240308 237461 228678 253495 256366 274587 298578 282315 292761 302357 299988 289516
$$ packed form
12469A78042J5824q484l149L3435R510J9333P664j3896o393q511l9663J6028k0976
12456A78764j6947q13j9942k2301J5263J8924L870J4386M639K9915j3961j3361
12444A78436L0530o433j6404m4218J3013R162K8247k0880J2071m322R940K995
12432A92137j036j2350j1140m577K032N684l001K0179k282n407L1423J7218J4756
12419B43636J4465k1569j9609j0075k2508K2013K7454k4866j0207L2117L582K5100
12407B59533O69J8299J1574j429l432j6440j9718J7655N248k544P288M040J4964
12394B95707J6645n876j1112K2098R139o065N115n712k2912j6736k7141j7936
12382B35214K751K343k847q783K4817K871J8221K3991j6263J0446R596k369j0472
$$ plain form
12369 289516 310103 305233 293809 294595 309298 289555 254472 270268 272915 280451 275502 237900 208444
12356 208444 220615 236600 236935 213048 210668 195536 153530 152428 164556 187822 212622 215871
12344 215871 219916 207632 194989 190782 181870 162364 147172 184207 181325 162039 158474 142828
12332 142828 127261 143679 164841 218024 210527 218223 246229 270702 262495 268906 279597 302942
12320 302942 306148 321305 397082 477300 556498 619719 710820 885874 1101771 1374876 1726909
12309 1726909 2073515 2366690 2528245 2637240 2730956 2774362 2682193 2196980 1566629 1143433
12299 1143433 870665 691022 597002 530125 475661 411880 378987 362315 317008 259323 229057
12288 229057 235344 223197 220694 210050 208750 198009 204340 218881 237110 228285 251785 247586 205121
$$ packed form
12369B89516K0587m870j1424P86J4703j9743l5083J5796K647P536m949l7602k9456
12356B08444J2171J5985L35k3887k380j5132m2006j102J2128K3266K4800L249
12344B15871M045j2284j2643m207q912j9506j5192L7035k882j9286l565j5646
12332A42828j5567J6418K1162N3183p497P696K8006K4473q207O411J0691K3345
12320C02942L206J5157P5777Q0218P9198O3221R1101J75054K15897K73105L52033
12309A726909L46606K93175J61555J08995R3716M3406r2169m85213o30351m23196
12299A143433k72768j79643r4020o6877n4464o3781l2893j6672m5307n7685l0266
12288B29057O287j2147k503j0644j300j0741O331J4541J8229q825K3500m199m2465
$$ plain form
12275 205121 191003 207960 183965 165551 182411 207450 217247 237421 232091 197721 184386 196568
12263 196568 211195 214847 217614 208178 210438 207756 209373 202358 196363 205604 204326 213771 217856 214163
12249 214163 196748 175652 151306 177802 207401 202736 202010 186219 187839 213501 210769 205550 213598
12236 213598 209138 220217 216829 162651 149316 174526 198765 169495 156409 169587 190121 189325
12224 189325 158799 153983 183876 191769 149359 122131 141518 143823 164999 184871 186806 186193 176140
12211 176140 168410 165466 166421 134614 135071 142291 153673 150285 168059 170169 149290 152319 146567 128862
12197 128862 106882 130540 169922 167684 172616 146746 137728 156038 156802 159365 143126 146293 111352
12184 111352 106077 99952 74924 62044 69565 86633 87648 75398 67922 55326 32005 53741
$$ packed form
12275B05121j4118J6957k3995j8414J6860K5039R797K0174n330l4370j3335J2182
12263A96568J4627L652K767r436K260k682J617p015n995R241j278R445M085l693
12249B14163j7415k1096k4346K6496K9599m665p26j5791J620K5662k732n219Q048
12236B13598m460J1079l388n4178j3335K5210K4239k9270j3086J3178K0534p96
12224A89325l0526m816K9893P893m2410k7228J9387K305K1176J9872J935o13j0053
12211A76140p730k944R55l1807M57P220J1382l388J7774K110k0879L029n752j7705
12197A28862k1980K3658L9382k238M932k5870r018J8310P64K563j6239L167l4941
12184A11352n275o125k5028j2880P521J7068J015j2250p476j2596k3321K1736
$$ plain form
12172 53741 47202 47385 67719 93675 111438 97899 91699 100628 94408 82850 81973 82532 78121 64109
12158 64109 72184 98074 87654 60111 28592 28666 31503 72270 58754 69024 90974 101850 92759
12145 92759 89005 113820 115981 114257 124522 131344 131344 107828 100575 93479 90958 105675 113939 93936
12131 93936 89519 102522 82691 69097 67695 66491 67381 70221 62502 73201 77847 78767 94348 89507
12117 89507 83524 82818 63160 59276 57948 84378 88079 57174 51657 53521 73143 99326 78584
12104 78584 38695 15064 25068 56667 98415 120710 118697 90579 60087 67832 88142 103016
12092 103016 94734 59887 66091 67336 35785 54417 66142 85191 67538 55539 39294 83111
12080 83111 117861 110976 98169 65041 31359 29916 50465 72576 79974 92236 95682 102833 93243
$$ packed form
12172E3741o539J83K0334K5956J7763j3539o200Q929o220j1558q77N59m411j4012
12158F4109Q075K5890j0420k7543l1519P4K837M0767j3516J0270K1950J0876r091
12145I2759l754K4815K161j724J0265O822%k3516p253p096k521J4717Q264k0003
12131I3936m417J3003j9831j3594j402j204Q90K840p719J0699M646R20J5581m841
12117H9507n983p06j9658l884j328K6430L701l0905n517J864J9622K6183k0742
12104G8584l9889k3631J0004L1599M1748K2295k013k8118l0492P745K0310J4874
12092A03016q282l4847O204J245l1551J8632J1725J9049j7653j1999j6245M3817
12080H3111L4750o885j2807l3128l3682j443K0549K2111P398J2262L446P151r590
$$ plain form
12067 93243 77966 107290 119936 107179 99056 66332 59986 75695 77744 61800 68380 41930
12055 41930 9979 4019 44621 40536 34656 34367 56372 59171 49149 51113 51838 38847 50217
12042 50217 74622 54571 49070 42274 76674 75664 49278 42809 17123 20502 38869 29819 31341
12029 31341 52838 50476 47673 53394 44687 29686 23082 16079 41618 54162 63674 51923 44598
12016 44598 43761 61467 67543 69405 67367 36223 3880 6011 11696 -3713 -18347 -15390 -13092
12003 -13092 -19132 246 -6587 -14278 -11727 -2412 24180 49346 63740 55588 69528 56110 65387
11990 65387 61106 38327 36325 30098 26112 6449 -15490 6381 17414 -6018 -15392 22894 54806
11977 54806 58766 44620 21723 31372 20820 10174 23819 45866 52854 68199 79787 87808
$$ packed form
12067I3243j5277K9324J2646j2757q123l2724o346J5709K049j5944O580k6450
12055D1930l1951n960M0602m085n880k89K2005K799j0022J964P25j2991J1370
12042E0217K4405k0051n501o796L4400j010k6386o469k5686L379J8367r050J522
12029C1341K1497k362k803N721q707j5001o604p003K5539J2544R512j1751p325
12016D4598q37J7706O076J862k038l1144l2343K131N685j5409j4634K957K298
12003a3092o040J9378o833p691K551R315K6592K5166J4394q152J3940j3418R277
11990F5387m281k2779k002o227l986j9663k1939K1871J1033k3432r374L8286L1912
11977E4806L960j4146k2897R649j0552j0646J3645K2047O988J5345J1588Q021
$$ plain form
11965 87808 101364 89270 74943 43145 26174 34255 34735 -3032 -15451 21091 28934 36761 86459
11952 86459 72125 63838 73018 65198 57426 46997 40905 40233 12034 10080 23386 28603 5966
11939 5966 -147 1670 5010 -4533 25721 34710 17122 971 -10615 695 16312 43075 59225
11926 59225 47410 51891 85604 48250 32112 40987 67909 56236 44759 56134 64574 74016
11914 74016 42068 48177 53028 66778 70200 64431 48370 25216 21761 20313 17244 16584 23023 65049
11900 65049 64965 55875 16734 29005 51528 62629 41926 30280 60138 89249 86793 55611 33772
11887 33772 61285 98967 70644 56861 39405 11247 29015 64411 61549 51119 51122 76521 86897
11874 86897 76703 54077 19116 23127 43575 57707 56357 33568 -741 2818 -10402 22073
$$ packed form
11965H7808J3556j2094j4327l1798j6971Q081M80l7767j2419L6542P843P827M9698
11952H6459j4334q287R180p820p772j0429o092o72k8199j954J3306N217k2637
11939E966o113J817L340r543L0254Q989j7588j6151j1586J1310J5617K6763J6150
11926E9225j1815M481L3713l7354j6138Q875K6922j1673j1477J1375Q440R442
11914G4016l1948O109M851J3750L422n769j6061k3154l455j448l069o60O439M2026
11900F5049q4r090l9141J2271K2523J1101k0703j1646K9858K9111k456l1182k1839
11887C3772K7513L7682k8323j3783j7456k8158J7768L5396k862j0430LK5399J0376
11874H6897j0194k2626l4961M011K0448J4132j350k2789l4309L559j3220L2475
$$ plain form
11862 22073 24810 -1901 -21264 -8523 16561 72810 60616 24119 29786 66698 87059 84487
11850 84487 70858 77912 50502 36868 20716 5216 18433 10163 18318 36118 54510 42774
11838 42774 17954 -15728 -10964 16626 33592 20088 5042 21974 29511 7864 1817 2843
11826 2843 30077 32194 34619 40002 27278 26077 64868 75334 64885 79206 56464 40493 45782
11813 45782 36289 48688 31546 35462 17613 19081 48013 49390 41729 49777 49077 29412 12492
11800 12492 14019 6916 5831 16779 50589 56672 23411 17097 34982 5451 19762 38496 37877
11787 37877 53222 50233 9166 2438 7841 2697 8771 6226 14834 20090 34677 26488 46620
11774 46620 74589 79425 64882 51121 42008 32480 16234 4449 28285 31532 25857 7689 19016
$$ packed form
11862B2073K737k6711j9363J2741K5084N6249j2194l6497N667L6912K0361k572
11850H4487j3629P054k7410j3634j6152j5500J3217q270Q155J7800J8392j1736
11838D2774k4820l3682M764K7590J6966j3504j5046J6932P537k1647o047J026
11826B843K7234K117K425N383j2724j201L8791J0466j0449J4321k2742j5971N289
11813D5782r493J2399j7142L916j7849J468K8932J377p661Q048p00j9665j6920
11800A2492J527p103j085J0948L3810O083l3261o314J7885k9531J4311J8734o19
11787C7877J5345k989m1067o728N403n144O074k545Q608N256J4587q189K0132
11774D6620K7969M836j4543j3761r113r528j6246j1785K3836L247n675j8168J1327
$$ plain form
11761 19016 3294 18055 36123 47610 30643 24362 44620 35110 32582 64161 50998 36856
11749 36856 44269 33220 12613 -771 1054 28696 35292 12350 8474 679 -24114 -13469 16172
11736 16172 6378 19763 23274 28846 16432 38736 51956 41462 25952 7337 28152 33860
11724 33860 29067 56096 48566 33508 38865 40077 47690 29965 27138 11376 -9478 -2740 9952
11711 9952 19885 20021 23029 30723 27514 40057 46706 60837 55298 43831 13892 -5768 -19380
11698 -19380 -32398 -11717 25446 46236 48864 29001 32364 46551 50150 42792 48655 77527 66089
11685 66089 22271 -3946 23211 27880 13292 11142 16661 -16570 -21722 -24262 -29468 -20203 -7484
11672 -7484 974 15069 10159 22841 21576 16064 -4270 13910 31138 28624 4748 -9483 -1259
$$ packed form
11761A9016j5722J4761J8068J1487j6967o281K0258r510k528L1579j3163j4142
11749C6856P413j1049k0607j3384J825K7642O596k2942l876p795k4793J0645K9641
11736A6172r794J3385L511N572j2414K2304J3220j0494j5510j8615K0815N708
11724C3860m793K7029p530j5058N357J212P613j7725k827j5762k0854O738J2692
11711I952R933J36L008P694l209J2543O649J4131n539j1467k9939j9660j3612
11698a9380j3018K0681L7163K0790K628j9863L363J4187L599p358N863K8872j1438
11685F6089m3818k6217K7157M669j4588k150N519l3231n152k540n206R265J2719
11672g484Q458J4095m910J2682j265n512k0334J8180J7228k514k3876j4231Q224
$$ plain form
11659 -1259 10548 7532 15649 27084 39200 54925 52586 34554 53364 45439 13805 22915 14775
11646 14775 -11684 -23839 -23306 7475 32041 50564 56715 62419 42584 14719 13986 47255 62860
11633 62860 28969 11939 17071 39638 22207 21465 43538 31363 39580 58295 6921 -21005
11621 -21005 -16000 -12644 18343 27133 30491 22115 18399 13956 25919 573 -25127 -14603 17284
11608 17284 21760 -7091 -9589 20039 59945 79244 68558 61944 68184 70008 50807 37981 29386
11595 29386 31641 33315 23615 -8812 5188 28385 38944 35570 46441 45635 1971 -18148 159
11582 159 7985 -37303 -44335 -17824 13402 24256 27778 37937 26333 8904 12404 42220 58467
11569 58467 33219 22420 -15374 46 13226 36857 33972 5540 -13556 -10011 16223 26556
$$ packed form
11659a259J1807l016Q117J1435J2116J5725k339j8032J8810p925l1634R110q140
11646A4775k6459j2155N33L0781K4566J8523O151N704j9835k7865p33L3269J5605
11633F2860l3891j7030N132K2567j7431p42K2073j2175Q217J8715n1374k7926
11621b1005N005L356L0987Q790L358q376l716m443J1963k5346k5700J0524L1887
11608A7284M476k8851k498K9628L9906J9299j0686o614O240J824j9201j2826q595
11595B9386K255J674r700l2427J4000K3197J0559l374J0871q06m3664k0119J8307
11582A59P826m5288p032K6511L1226J0854L522J0159j1604j7429L500K9816J6247
11569E8467k5248j0799l7794J5420J3180K3631k885k8432j9096L545K6234J0333
$$ plain form
11557 26556 35212 38264 47403 51553 41269 -3674 1255 11238 21632 24708 -1348 26272 45651
11544 45651 28521 28583 53632 91107 78793 55453 56088 35177 17817 29182 47950 11309 -15795
11531 -15795 -8731 11536 10129 -9791 3922 19151 35396 58557 44857 67663 28056 2425
11519 2425 32170 46749 21304 18564 322 2141 -30386 -49473 -43720 -42267 -23671 25411 26267
11506 26267 44360 64441 61069 29552 36757 62193 42904 14555 14581 17149 3148 39545 24470
11493 24470 -11294 -3447 4751 -49943 -48057 -54159 -51539 -19275 5865 10991 -796 -24310 3410
11480 3410 54508 40103 37042 57891 74567 49465 34452 58972 51900 35325 11198 -14063
11468 -14063 -7059 -25723 -34422 -29440 -28058 -27760 -36713 -18116 -28692 -33242 -13587 -11298 4006
$$ packed form
11557B6556Q656L052R139M150j0284m4943M929R983J0394L076k6056K7620J9379
11544D5651j7130O2K5049L7475j2314k3340O35k0911j7360J1365J8768l6641k7104
11531a5795P064K0267j407j9920J3713J5229J6245K3161j3700K2806l9607k5631
11519B425K9745J4579k5445k740j8242J819l2527j9087N753J453J8596M9082Q56
11506B6267J8093K0081l372l1517P205K5436j9289k8349K6K568j4001L6397j5075
11493B4470l5764P847Q198n4694J886o102K620L2264K5140N126j1787k3514K7720
11480C410N1098j4405l061K0849J6676k5102j5013K4520p072j6575k4127k5261
11468a4063P004j8664q699M982J382K98q953J8597j0576m550J9655K289J5304
$$ plain form
11455 4006 15471 43344 39686 12829 1126 29612 31916 -12912 -17349 -21792 -34406 -38058 -12196
11442 -12196 4877 -10588 -23457 11626 45883 32977 2707 955 -376 -2749 -35958 -46239
11430 -46239 -22060 -3269 -4222 -25566 -26961 10404 48271 72331 52273 12219 15745 22885 25331
11417 25331 14458 -10100 -10755 -29134 -68615 -40820 4526 9275 551 -14139 -18589 -5507 21312
11404 21312 18011 22289 24140 1396 -3541 17712 38094 24222 30025 23220 14140 16784 24049
11391 24049 13326 -11751 -22104 -15722 10934 -4351 -3793 15278 24032 56644 67350 80025
11379 80025 56446 35122 -493 -15807 -41845 -26246 -9515 10924 -15283 -53166 -62440 -81150
11367 -81150 -83743 -75831 -73267 -68798 -41615 -16908 -26298 -35521 -22507 483 13403 1036 -9049
$$ packed form
11455D006J1465K7873l658k6857j1703K8486K304m4828m437m443j2614l652K5862
11442a2196J7073j5465j2869L5083L4257j2906l0270j752j331k373l3209j0281
11430d6239K4179J8791r53k1344j395L7365L7867K4060k0058m0054L526P140K446
11417B5331j0873k4558o55j8379l9481K7795M5346M749q724j4690m450J3082K6819
11404B1312l301M278J851k2744m937K1253K0382j3872N803o805r080K644P265
11391B4049j0723k5077j0353O382K6656j5285N58J9071Q754L2612J0706J2675
11379H0025k3579k1324l5615j5314k6038J5599J6731K0439k6207l7883r274j8710
11367h1150k593P912K564M469K7183K4707r390r223J3014K2990J2920j2367j0085
$$ plain form
11354 -9049 22214 20523 17191 2734 -7765 2875 32398 25431 25447 21720 6360 10715 9394 10303
11340 10303 13043 -11114 -42298 -36708 -43567 -29342 -41613 -34603 -33878 -23853 -42598 -52696 -37537
11327 -37537 -37627 -36687 -22428 22191 41602 8139 7388 10813 5417 16629 32084 43592 44372 -7929
11313 -7929 -40510 -44765 -23656 -2860 14388 23064 26523 15472 -3252 -27226 -33219 -6144 9764
11300 9764 8143 15619 26164 12076 4253 -2976 14012 5781 -6807 17952 21645 15990 -4402
11287 -4402 -9595 21130 41797 49926 37724 4880 -19032 -19236 -16068 -11540 -19507 -33778 -25400
11274 -25400 9490 19517 26136 31294 39986 45374 73226 19227 -34675 -56531 -49266 -67467 -41482
11261 -41482 -20833 -15189 -1781 18935 86429 52088 14824 7465 -16490 -39241 -33585 -9764
$$ packed form
11354i049L1263j691l332j4457j0499J0640K9523o967J6l727j5360M355j321R09
11340A0303K740k4157l1184N590o859J4225j2271P010P25J0025j8745j0098J5159
11327c7537r0R40J4259M4619J9411l3463p51L425n396J1212J5455J1508P80n2301
11313g929l2581m255K1109K0796J7248Q676L459j1051j8724k3974n993K7075J5908
11300I764j621P476J0545j4088p823p229J6988q231j2588K4759L693n655k0392
11287d402n193L0725K0667Q129j2202l2844k3912k04L168M528p967j4271Q378
11274b5400L4890J0027O619N158Q692N388K7852n3999n3902k1856P265j8201K5985
11261d1482K0649N644J3408K0716O7494l4341l7264p359k3955k2751N656K3821
$$ plain form
11249 -9764 -17622 -33541 -16217 -8784 -29469 -24029 -5956 2952 12002 -5644 29177 -3461 -36188
11236 -36188 -42332 -44222 -38542 -27660 -4119 1973 18702 22813 35258 27180 9104 2625 -10572
11223 -10572 -3931 1752 -2389 13870 -15118 -26999 -37889 -17819 15162 35416 5363 546
11211 546 -17119 2865 1805 -17907 -27642 -46224 -32371 -8217 -34067 -43785 -43140 -51329 -55841
11198 -55841 -24105 19325 11826 559 -360 4728 9980 30500 21593 6143 -4725 26792 23623
11185 23623 20312 38414 12017 -26124 272 37719 46755 8745 -9179 -2355 6761 -8121
11173 -8121 -38558 -40235 22650 49009 13983 -1007 -428 -21568 -35864 -14114 9340 -5972
11161 -5972 -32151 -48230 -35550 -26094 -5878 8791 -7581 -35696 -40339 -19811 -18668 -28999
$$ packed form
11249i764p858j5919J7324P433k0685N440J8073Q908R050j7646L4821l2638l2727
11236c6188o144j890N680J0882K3541O092J6729M111J2445q078j8076o479j3197
11223a0572O641N683m141J6259k8988j1881j0890K0070L2981K0254l0053m817
11211E46j7665J9984j060j9712r735j8582J3853K4154k5850r718O45q189m512
11198e5841L1736M3430p499j1267r19N088N252K0520q907j5450j0868L1517l169
11185B3623l311J8102k6397l8141K6396L7447R036l8010j7924O824R116j4882
11173h121l0437j677O2885K6359l5026j4990N79k1140j4296K1750K3454j5312
11161e972k6179j6079J2680R456K0216J4669j6372k8115m643K0528J143j0331
$$ plain form
11149 -28999 -42567 -32283 -20341 -35331 -55564 -47396 -23837 -19192 -8492 -15175 -46411 -51209
11137 -51209 10958 30423 52167 56728 42802 9241 -11403 -33685 -24224 -13717 -10719 -2173
11125 -2173 -11260 6761 25555 25439 44350 59612 70733 55132 31625 1312 -47235 -7770
11113 -7770 26985 15372 10189 31728 25122 -1491 16451 33328 29528 16127 11660 -10289 -7824
11100 -7824 -4183 -3087 -24650 -28355 -13330 -7631 446 10397 -1120 -24076 -20062 2820 16669
11087 16669 41648 30484 12235 -6948 2170 -2083 24760 9504 -9462 -34063 -35962 -10816
11075 -10816 -9465 -30000 -15872 11089 1790 -12665 -15978 -5216 -12788 -2127 1843 2954 2601
11062 2601 4411 -6605 -33549 -38370 -25913 -14288 -3915 -16236 -37723 -37241 -15685 -8836 31984
$$ packed form
11149b8999j3568J0284J1942j4990k0233Q168K3559M645J0700o683l1236m798
11137e1209O2167J9465K1744M561j3926l3561k0644k2282R461J0507K998Q546
11125b173r087J8021J8794j16J8911J5262J1121j5601k3507l0313m8547L9465
11113g770L4755j1613n183K1539o606k6613J7942J6877l800j3401m467k1949K465
11100g824L641J096k1563l705J5025N699Q077R951j1517k2956M014K2882J3849
11087A6669K4979j1164j8249j9183R118m253K6843j5256j8966k4601j899K5146
11075a0816J351k0535J4128K6961r299j4455l313J0762p572J0661L970J111l53
11062B601J810j1016k6944m821J2457J1625J0373j2321k1487M82K1556O849M0820
$$ plain form
11049 31984 5495 -15207 -14007 -8947 21487 45341 30663 22476 15599 15119 26627 27108 5536
11036 5536 -21900 -24900 -15440 17087 26383 15218 175 -31415 -28123 -37742 -32088 -16092 -3603
11023 -3603 41818 53514 46863 36671 32293 25808 26470 4830 7152 11001 27541 17056 -12328
11010 -12328 -38464 -39937 -44547 -41069 -11333 17259 29292 37174 24322 11389 9004 -6944 -10169
10997 -10169 -3985 -30871 -62206 -30107 24480 30575 1614 -8697 -19526 -3942 16340 -24564
10985 -24564 -32586 -25903 -6731 6423 29499 18005 -1314 -19122 4566 13511 -1396 319
10973 319 10038 22083 14962 15036 13555 11973 33416 33231 4255 -4633 -8358 -2668 -2973 -12645 -16605
10958 -16605 -32166 -36148 -16436 -17255 -1116 8399 4213 1070 -3417 8922 321 -1268 15772
$$ packed form
11049C1984k6489k0702J200N060L0434K3854j4678q187o877m80J1508M81k1572
11036E536k7436l000R460L2527R296j1165j5043l1590L292r619N654J5996J2489
11023c603M5421J1696o651j0192m378o485O62k1640K322L849J6540j0485k9384
11010a2328k6136j473m610L478K9736K8592J2033P882j2852j2933k385j5948l225
10997a0169O184k6886l1335L2099N4587O095k8961j0311j0829J5584K0282m0904
10985b4564q022O683J9172J3154K3076j1494j9319j7808K3688Q945j4907J715
10973C19R719J2045p121P4j481j582K1443j85k8976q888l725N690l05r672l960
10958a6605j5561l982J9712q19J6139R515m186l143m487J2339q601j589J7040
$$ plain form
10945 15772 37295 46950 37958 12483 13831 45873 61307 41974 8231 -23899 -28929 -38576 -16819
10932 -16819 4618 -13653 -19827 -27719 -44447 -68467 -83343 -76106 -51887 -57317 -46692 -34440
10920 -34440 -12526 752 -8201 -34656 -34615 -12903 -1657 -862 7461 -14124 -10562 18971 18685 -17471
10906 -17471 -23914 -25275 -29805 -33434 -53469 -26246 -23322 -24887 19117 17587 -8698 4095 1121
10893 1121 -10817 -21587 -21385 -41428 -14549 4878 17232 1792 -21613 -12923 -22335 -9501 -2249
10880 -2249 -18422 -32066 -34714 6275 17082 29932 26014 2805 -17434 -13963 -10970 1829 -8303
10867 -8303 -11248 -9857 12857 26542 -4979 15392 11724 -16031 -23213 -25558 -52490 -62552 -46202
10854 -46202 -25918 -11226 5326 24839 32813 35672 9123 22960 17947 31682 12848 -2767
$$ packed form
10945A5772K1523R655q992k5475J348L2042J5434j9333l3743l2130n030r647K1757
10932a6819K1437j8271o174p892j6728k4020j4876P237K4219n430J0625J2252
10920c4440K1914J3278q953k6455M1K1712J1246P95Q323k1585L562K9533k86l6156
10906a7471o443j361m530l629k0035K7223K924j565M4004j530k6285J2793k974
10893A121j1938j0770K02k0043K6879J9427J2354j5440k3405Q690r412J2834P252
10880b249j6173j3644k648M0989J0807J2850l918k3209k0239L471K993J2799j0132
10867h303k945J391K2714J3685l1521K0371l668k7755p182k345k6932j0062J6350
10854d6202K0284J4692J6552J9513P974K859k6549J3837n013J3735j8834j5615
$$ plain form
10842 -2767 12875 23064 32398 24230 -1561 -24203 311 27791 25338 -4588 849 10627 28406
10829 28406 27624 15113 3016 -21325 -11142 -35664 -48137 -28021 -35050 -10086 314 1372
10817 1372 -1787 -11989 -42252 -26784 -28952 -38193 -34577 -13310 -12661 -27199 -43072 -19067 11773
10804 11773 -5767 4751 -3039 41045 66141 36651 7348 -14780 -16478 -17716 -13510 4028
10792 4028 9179 19141 17442 -3452 -4110 6459 -5355 -6798 -23422 -14438 1162 -7488 -11582 -6385
10778 -6385 -22615 -18371 -9411 2503 2340 16766 25012 20875 7912 6716 -10300 6326 30606
10765 30606 21818 8823 -28460 -31757 -12277 14782 18690 8227 10930 16164 11582 -2688 4873
10752 4873 7512 9816 -2776 -9358 -16424 -19692 -19638 -15736 -1627 37982 56822 38605 -12885 -21272
$$ packed form
10842b767J5642J0189R334q168k5791k2642K4514K7480k453k9926N437R778J7779
10829B8406p82j2511j2097k4341J0183k4522j2473K0116p029K4964J0400J058
10817A372l159j0202l0263J5468k168r241L616K1267O49j4538j5873K4005L0840
10804A1773j7540J0518p790M4084K5096k9490k9303k2128j698j238M206J7538
10792D028N151R962j699k0894o58J0569j1814j443j6624Q984J5600q650m094N197
10778f385j6230M244Q960J1914j63J4426Q246m137j2963j196j7016J6626K4280
10765C0606q788j2995l7283l297J9480K7059L908j0463K703N234m582j4270P561
10752D873K639K304j2592o582p066l268N4L902J4109L9609J8840j8217n1490q387
$$ plain form
10738 -21272 -1006 3504 -26376 -7689 199 -27883 -52605 -65648 -47146 -39224 -42915 -19654
10726 -19654 -1743 46301 70211 47332 20035 12127 33740 35904 38016 34473 46866 6488
10714 6488 -10402 9067 -1673 25184 11804 -20600 -9558 -1542 -8018 -34087 -26615 -4794
10702 -4794 953 -25794 -17146 21725 4020 14392 25051 1708 8244 3339 -12220 -16492 -16330
10689 -16330 -29767 -36200 -25246 -17121 -14685 -31189 -26940 -8712 -7502 6502 -6120 5767 -23530
10676 -23530 -20234 -23848 -13591 -15615 -13199 -19354 -5874 -18542 -32562 -11907 -3488 -26872 -46983
10663 -46983 -49576 -61974 -55706 -57472 -29817 7776 11442 435 -1746 41250 69812 63929 63894
10650 63894 53501 4555 -21428 -32889 -25501 3921 7307 -29704 -29809 -19899 -13663 -2012 -7362
$$ packed form
10738b1272K0266M510k9880J8687P888k8082k4722j3043J8502P922l691K3261
10726a9654J7911M8044K3910k2879k7297p908K1613K164K112l543J2393m0378
10714F488j6890J9469j0740K6857j3380l2404J1042Q016o476k6069P472K1821
10702d794N747k6747Q648L8871j7705J0372J0659k3343O536m905j5559m272J62
10689a6330j3437o433J0954Q125K436j6504M249J8228J210J4004j2622J1887k9297
10676b3530L296l614J0257k024K416o155J3480j2668j4020K0655Q419k3384k0111
10663d6983k593j2398O268j766K7655L7593L666j1007k181M2996K8562n883l5
10650F3894j0393m8946k5983j1461P388K9422L386l7011j05R910O236J1651n350
$$ plain form
10637 -7362 -38607 -74615 -67983 -38802 -40560 -44000 -10290 6638 17354 -644 -18834 -1698
10625 -1698 7899 6415 -845 4807 17565 18818 -6698 15123 39974 37372 26803 26333 20162 8325
10611 8325 -9049 -5308 15661 26991 24808 -14357 -15413 -4496 -12806 -1578 25426 54566 49205
10598 49205 34592 18402 -24438 -39390 -8649 8150 15434 48882 36771 13072 -4568 -16885
10586 -16885 -28520 6611 20906 4620 -14483 -26245 -5495 11333 11654 8558 40661 36068
10574 36068 -14197 -50205 -15578 34220 54515 34914 4275 34029 49684 24241 -19567 1925
10562 1925 18971 33169 33853 31358 19929 10757 -4953 -18010 -36158 -45317 -41181 -38623 -19739
10549 -19739 -18490 -28743 -34128 -32197 -50284 -48587 -13246 22815 44750 30389 12922 -4373
$$ packed form
10637g362l1245l6008O632K9181j758l440L3710J6928J0716j7998j8190J7136
10625a698R597j484p260N652J2758J253k5516K1821K4851k602j0569m70o171j1837
10611H325j7374L741K0969J1330k183l9165j056J0917q310J1228K7004K9140n361
10598D9205j4613j6190m2840j4952L0741J6799P284L3448j2111k3699j7640j2317
10586a6885j1635L5131J4295j6286j9103j1762K0750J6828L21l096L2103m593
10574C6068n0265l6008L4627M9798K0295j9601l0639K9754J5655k5443m3808K1492
10562A925J7046J4198O84k495j1429r172j5710j3057j8148r159M136K558J8884
10549a9739J249j0253n385J931j8087J697L5341L6061K1935j4361j7467j7295
$$ plain form
10537 -4373 -30484 -46860 -36367 -31661 -45200 -74404 -61225 -30895 -9909 9326 23599 41746
10525 41746 51659 55989 48416 31743 9176 -743 -8961 -16739 -8937 -7976 -22269 -17260 -17243 -16341 -25498
10510 -25498 -22812 -1047 15374 17020 -3147 -9674 8698 28457 41284 22767 15714 11763 18369
10497 18369 2356 -14340 -4048 3225 9714 22223 26727 21521 8058 -2075 13490 13540 13438
10484 13438 35793 34911 17118 6634 11445 -23101 -28232 -10641 12094 4234 -3454 -2602 -9592
10471 -9592 -11403 3094 -15029 -16107 12098 54948 43907 18194 -11065 -52842 -64203 -29743
10459 -29743 19161 42608 32062 23716 36071 -13064 -36089 -15521 -14076 -16704 -40654 -62313
10447 -62313 -59581 -59821 -28999 3955 6840 -17874 -35211 -30444 -2891 -9662 -17711 -24298 -9678
$$ packed form
10537d373k6111j6376J0493M706j3539k9204J3179L0330K0986J9235J4273J8147
10525D1746R913M330p573j6673k2567r919q218p778P802R61j4293N009J7R02r157
10510b5498K686K1765J6421J646k0167o527J8372J9759J2827j8517p053l951O606
10497A8369j6013j6696J0292P273O489J2509M504n206j3463j0133J5565N0j02
10484A3438K2355q82j7793j0484M811l4546n131J7591K2735p860p688Q52o990
10471i592j811J4497j8123j078K8205M2850j1041k5713k9259m1777j1361L4460
10459b9743M8904K3447j0546q346J2355m9135k3025K0568J445k628k3950k1659
10447f2313K732k40L0822L2954K885k4714j7337M767K7553o771q049o587J4620
$$ plain form
10434 -9678 -26628 -18083 3106 12552 25102 -4115 947 2546 -12542 -12225 -24442 -26572 -5944
10421 -5944 -34650 -50981 -47578 -22807 -21370 -11127 -11213 -19270 -32576 -26646 -34842 -36056 -33073 -43017
10407 -43017 -37841 -12831 -2251 7389 11336 18746 39280 15288 7948 32714 41729 64088 63257
10394 63257 70680 31114 26227 34868 9458 -23366 -33216 -31524 -961 15593 21398 -13558 -23011
10381 -23011 3219 27494 3353 -301 24388 36017 22147 -13996 -2950 -14108 -13991 -26064
10369 -26064 -23180 -11076 -16428 -30407 717 13866 -7169 -33562 -24906 -15097 -12475 -14006 2899
10356 2899 11419 4758 34370 57260 43397 38459 26909 36531 1529 -42954 -18749 -6097 3882
10343 3882 1446 -16609 -13003 6437 -5942 -37487 -23592 20542 24166 38362 14302 9537 36371
$$ packed form
10434i678j6950Q545K1189R446J2550k9217N062J599j5088L17j2217k130K0628
10421e944k8706j6331L403K4771J437J0243q6q057j3306N930q196j214K983r944
10407d3017N176K5010J0580R640L947P410K0534k3992p340K4766R015K2359q31
10394F3257P423l9566m887Q641k5410l2824r850J692L0563J6554N805l4956r453
10381b3011K6230K4275k4141l654K4689J1629j3870l6143J1046j1158J17j2073
10369b6064K884J2104n352j3979L1124J3149k1035k6393Q656R809K622j531J6905
10356B899Q520o661K9612K2890j3863m938j1550R622l5002m4483K4205J2652R979
10343C882k436j8055L606J9440j2379l1545J3895M4134L624J4196k4060m765K6834
$$ plain form
10330 36371 41505 18638 38663 28219 36396 54173 54847 34387 25074 36542 50263 33530 4360
10317 4360 10074 12955 -5853 -16250 -12392 4284 40617 22975 -17758 -36006 -19448 -16819 -45105
10304 -45105 -43835 -9817 966 -19939 -31557 -15539 -48 81 -24060 -46388 -37320 -40254 -21159
10291 -21159 8352 -6784 -19692 -10787 -9052 18866 31640 286 -3616 -909 9379 8317 -5019
10278 -5019 12821 16592 5330 -12966 -4354 -1941 -36183 -50606 -35760 -23523 -26915 -38645 -38417
10265 -38417 -31906 -11600 -12575 -50219 -50974 -35115 -51578 -64578 -25434 -4462 33598 56051 53246
10252 53246 35900 20059 31389 25638 -4585 -14530 15799 8002 6111 3406 19838 10200 16490
10239 16490 29128 25238 7626 6306 -1608 19100 7004 11719 4615 -50551 -59568 -21882 11754
$$ packed form
10330C6371N134k2867K0025j0444Q177J7777O74k0460r313J1468J3721j6733k9170
10317D360N714K881j8808j0397L858J6676L6333j7642m0733j8248J6558K629k8286
10304d5105J270L4018J0783k0905j1618J6018J5491J29k4141k2328R068k934J9095
10291b1159K9511j5136j2908Q905J735K7918J2774l1354l902K707J0288j062j3336
10278e019J7840L771j1262j8296Q612K413l4242j4423J4846J2237l392j1730K28
10265c8417O511K0306r75l7644p55J5859j6463j3000L9144K0972L8060K2453k805
10252E3246j7346j5841J1330n751l0223r945L0329p797j891k705J6432r638O290
10239A6490J2638l890j7612j320p914K0708j2096M715p104n5166r017L7686L3636
$$ plain form
10226 11754 23111 46693 14210 -5843 -28346 -22720 -29319 -13810 -33110 -36763 -15019 7733
10214 7733 12674 1573 2573 -4982 -2989 -18360 -22712 -4023 14050 28209 18175 7047 29755
10201 29755 26160 28965 28216 20507 -10178 3039 11895 12963 20448 37194 35940 21526 29837 6707
10187 6707 -12320 -7951 -23564 -40129 -37353 -56403 -66825 -64236 -18474 -10544 5109 12501 13854
10174 13854 33337 20128 23008 25039 9927 -2711 -6639 3927 9447 17478 22199 16222 -12803
10161 -12803 -43729 -59282 -42273 1147 44054 21288 27229 17445 -2103 16603 -1489 -13255
10149 -13255 -8411 -6222 -8488 -9660 -27080 -37527 -16424 -9735 -24495 -43213 -51608 -23190 15962
10136 15962 37163 48787 11933 -13343 -7517 1227 -9859 -8612 -21564 -21068 -25877 -17276 -13021
$$ packed form
10226A1754J1357K3582l2483k0053k2503N626o599J5509j9300l653K1744K2752
10214G733M941j1101J000p555J993j5371m352J8689J8073J4159j0034j1128K2708
10201B9755l595K805p49p709l0685J3217Q856J068P485J6746j254j4414Q311k3130
10187F707j9027M369j5613j6565K776j9050j0422K589M5762P930J5653P392J353
10174A3854J9483j3209K880K031j5112j2638l928J0566N520Q031M721n977k9025
10161a2803l0926j5553J7009M3420M2907k2766N941r784j9548J8706j8092j1766
10149a3255M844K189k266j172j7420j0447K1103O689j4760j8718q395K8418L9152
10136A5962K1201J1624l6854k5276N826Q744j1086J247j2952M96m809Q601M255
$$ plain form
10123 -13021 -17288 -13410 -16662 -30272 -28599 -37852 -37223 -17341 -2777 -12596 -12424 4908 -133 -1096
10109 -1096 2731 -26682 -31662 -4570 -2517 17562 14616 35920 38549 -1216 -6130 -16746 -520
10096 -520 1259 -29650 -45920 -28507 -27992 -23449 -5374 14593 -31690 -86321 -69817 -47255 -46315
10083 -46315 -68336 -76803 -61152 -42401 -24319 4799 2172 -27781 -40388 -10041 -6255 -15493
10071 -15493 -23118 -28332 -33884 -26552 3175 27619 27241 25268 6072 -9487 16556 47362 47718
10058 47718 42744 -4236 -27425 -43722 -56359 -40583 -41647 -6273 27796 47000 27224 2219
10046 2219 -11454 21856 56309 24397 13882 13530 -14372 -31740 -44464 -40093 -29992 -17730
10034 -17730 -19880 -1736 -22215 -43030 -11328 5563 27293 8803 -19595 -23835 -53463 -43564
$$ packed form
10123a3021m267L878l252j3610J673r253O29J9882J4564r819J72J7332n041r63
10109a096L827k9413m980K7092K053K0079k946K1304K629l9765m914j0616J6226
10096e20J779l0909j6270J7413N15M543J8075J9967m6283n4631J6504K2562R40
10083d6315k2021q467J5651J8751J8082K9118k627k9953j2607L0347L786r238
10071a5493p625n214n552P332K9727K4444l78j973j9196j5559K6043L0806L56
10058D7718m974m6980k3189j6297j2637J5776j064L5374L4069J9204j9776k5005
10046B219j3673L3310L4453l1912j0515l52k7902j7368j2724M371J0101J2262
10034a7730k150J8144k0479k0815L1702J6891K1730j8490k8398m240k9628R899
$$ plain form
10022 -43564 -18359 -8659 9046 8729 47640 76768 63833 45718 21649 -15004 245 12694
10010 12694 1001 -20757 -50441 -25015 -16566 -40582 -28368 -12774 -15394 -22311 2770 6813
9998 6813 -15439 -37891 -30375 -33435 -43144 -41522 -38209 5799 10247 21822 15754 -11972 -31085
9985 -31085 -63016 -59524 -20678 -23941 -31265 -36198 -27270 -13502 -14501 4792 -4962 814 4378 21760
9971 21760 25144 16912 -474 11813 26456 26395 19090 -26321 -13517 15104 23718 702 -29675
9958 -29675 -42882 -64343 -34543 -12200 4497 8585 10560 7991 8305 4656 -12966 -13257 -15497 -97
9944 -97 23681 30624 30535 9443 -15979 -7935 -11111 -12071 -11122 23705 2720 -4533 12261 28993 26975
9929 26975 12787 6371 40368 55949 49938 8349 11357 5284 -10893 -13626 -1147 8868 12512
$$ packed form
10022d3564K5205R700J7705l17L8911K9128j2935j8115k4069l6653J5249J2449
10010A2694j1693k1758k9684K5426Q449k4016J2214J5594k620o917K5081M043
9998F813k2252k2452P516l060r709J622L313M4008M448J1575o068k7726j9113
9985c1085l1931L492L8846l263p324m933Q928J3768r99J9293r754N776L564J7382
9971B1760L384q232j7386J2287J4643o1p305m5411J2804K8621Q614k3016l0377
9958b9675j3207k1461K9800K2343J6697M088J975k569L14l649j7622k91k240J5400
9944i7K3778O943q9k1092k5422Q044l176r60R49L4827k0985p253J6794J6732k018
9929B6975j4188o416L3997J5581o011m1589L008o073j6177k733J2479J0015L644
$$ plain form
9916 12512 -15774 -32599 -28835 -37995 -38782 -20136 -39243 -40752 -42784 -40468 -14726 -15084 -16987 -8292
9902 -8292 -16250 -19073 -4561 -7387 6600 20726 17742 -7891 -12845 11466 9780 29028 40211
9889 40211 64683 93018 48569 -4912 -1209 1816 -23801 -32192 3157 32835 15236 26603
9877 26603 29709 -10765 -31954 -44888 -38264 -3002 22414 27447 23857 16347 14547 25484 66750
9864 66750 57074 34101 48657 69187 50599 38666 24425 35617 40822 21716 28882 55860
9852 55860 56239 47779 19988 -2905 -1473 -6713 2983 11462 -291 2631 -18953 -32753 -19249
9839 -19249 -7230 -2289 7937 19780 4653 -450 -24939 -29526 -16986 20868 41391 44336 36932
9826 36932 22971 58943 48375 28352 31850 44914 34483 9840 -3941 -16504 -13392 4673
$$ packed form
9916A2512k8286j6825L764r160p87J8646j9107j509k032K316K5742l58j903Q695
9902h292p958k823J4512k826J3987J4126k984k5633m954K4311j686J9248J1183
9889D0211K4472K8335m4449n3481L703L025k5617q391L5349K9678j7599J1367
9877B6603L106m0474k1189j2934O624L5262K5416N033l590p510j800J0937M1266
9864F6750r676k2973J4556K0530j8588j1933j4241J1192N205j9106P166K6978
9852E5860L79q460k7791k2893J432n240R696Q479j1753K922k1584j3800J3504
9839a9249J2019M941J0226J1843j5127n103k4489m587J2540L7854K0523K945p404
9826C6932j3961L5972j0568k0023L498J3064j0431k4643j3781j2563L112J8065
$$ plain form
9814 4673 36844 46679 41886 12233 2298 3290 20420 74505 94464 83515 70816 73891 34634
9801 34634 15465 24677 11507 218 18639 8306 -29916 -3855 40471 19065 24117 20287
9789 20287 -5390 -7507 -20638 -2826 30919 722 -13651 9163 14696 22430 40528 44459 22435
9776 22435 -13499 -30644 -49441 -12087 30853 14195 10462 36189 68962 50570 41989 8814
9764 8814 -13972 11822 27588 27180 14803 -35717 -41249 -39605 -35714 -44694 -67202 -66938 -24083 7694
9750 7694 5463 -27194 -32304 -13932 -42313 -77937 -82452 -42326 -20978 -14921 -23756 -26856 -11896
9737 -11896 5532 -12272 -17386 -13012 -26034 -44262 -35796 -21062 -6278 16647 13765 2814 -19613
9724 -19613 -28159 -21482 4258 -3154 418 24364 5689 -21635 -7781 6984 -8393 12025 31108
$$ packed form
9814D673L2171R835m793k9653r935R92J7130N4085J9959j0949j2699L075l9257
9801C4634j9169R212j3170j1289J8421j0333l8222K6061M4326k1406N052l830
9789B0287k5677k117j3131J7812L3745l0197j4373K2814N533P734J8098L931k2024
9776B2435l5934j7145j8797L7354M2940j6658l733K5727L2773j8392q581l3175
9764H814k2786K5794J5766m08j2377n0520n532J644L891q980k2508K64M2855L1777
9750G694k231l2657n110J8372k8381l5624m515M0126K1348O057q835l100J4960
9737a1896J7428j7804n114M374j3022j8228Q466J4734J4784K2925k882j0951k2427
9724a9613q546O677K5740p412L572K3946j8675k7324J3854J4765j5377K0418J9083
$$ plain form
9711 31108 -137 11704 7509 -29688 -34444 -49347 -35054 -40294 -10529 -904 373 -7332 -11412
9698 -11412 -21033 -41517 -60175 -71671 -75915 -42700 -5693 -7246 -37099 -39544 -46920 -20591 -2878
9685 -2878 3788 -1425 -33729 -32217 -29022 -18996 -5298 -11706 -15070 981 4289 20991 37824
9672 37824 25075 11809 625 154 54676 41524 -7411 -22358 -25168 -24164 -15465 -37324 -45675
9659 -45675 -10610 126 -20359 -18921 19850 29270 16151 9462 -1056 899 1050 17471 5815
9646 5815 -1328 14711 54384 45611 23058 27191 20900 20615 13888 -9178 -21211 -12048 475 13895
9632 13895 -8187 -15992 -16864 12533 6839 6959 -28653 -40215 -23140 -3684 -1446 -24962 -10681
9619 -10681 11053 2086 -17906 -39797 -61181 -42448 -20162 13925 5310 -34142 -51197 -46251
$$ packed form
9711C1108l1245J1841m195l7197m756j4903J4293n240K9765R625J277p705m080
9698a1412r621k0484j8658j1496m244L3215L7007j553k9853k445p376K6329J7713
9685b878O666n213l2304J512L195J0026J3698o408l364J6051L308J6702J6833
9672C7824j2749j3266j1184m71N4522j3152m8935j4947k810J004Q699k1859q351
9659d5675L5065J0736k0485J438L8771R420j3119o689j0518J955J51J6421j1656
9646E815p143J6039L9673q773k2553M133o291k85o727k3066j2033R163J2523J3420
9632A3895k2082p805q72K9397n694J20l5612j1562J7075J9456K238k3516J4281
9619a0681K1734q967j9992k1891k1384J8733K2286L4087q615l9452j7055M946
$$ plain form
9607 -46251 -47989 -45173 -14283 12190 -21224 -26542 12939 -12218 -18129 16738 27574 32171 12865
9594 12865 -6546 1155 20835 -20219 -2692 36816 60618 58296 43214 22700 8627 -13534
9582 -13534 5805 34139 23946 16642 10063 8482 15795 -26782 -29451 -24659 14242 10092 -6512
9569 -6512 7816 8923 936 -20216 -15087 3017 24571 54617 42932 13410 -11795 -30887 -43939
9556 -43939 -24002 -21529 -15770 -12171 8580 37012 29687 -37654 -55307 -39225 -32257 -24529 -24801
9543 -24801 -9981 -12010 -24478 -32383 -5161 32039 25512 13744 3298 8188 14191 -10161 -23314
9530 -23314 -26005 23294 44517 48114 37631 37047 49626 48285 15111 -8359 -11822 -7555 -11872
9517 -11872 -20563 -19848 -41019 -40065 -26344 -41378 -46768 -26966 -26593 -46638 -20684 -2873 -8169 -1586
$$ packed form
9607d6251j738K816L0890K6473l3414n318L9481k5157n911L4867J0836M597j9306
9594A2865j9411P701J9680m1054J7527L9508K3802k322j5082k0514j4073k2161
9582a3534J9339K8334j0193p304o579j581P313m2577k669M792L8901m150j6604
9569f512J4328J107p987k1152N129J8104K1554L0046j1685k9522k5205j9092j3052
9556d3939J9937K473N759L599K0751K8432p325o7341j7653J6082O968P728k72
9543b4801J4820k029j2468p905K7222L7200o527j1768j0446M890O003k4352j3153
9530b3314k691M9299K1223L597j0483n84J2579j341l3174k3470l463M267m317
9517a1872q691P15k1171R54J3721j5034n390J9802L73k0045K5954J7811n296O583
$$ plain form
9503 -1586 7123 21368 20721 5535 -34371 -27429 -22789 -23190 -17989 -10670 -26345 -15584 -37817 -33495
9489 -33495 -25377 -18164 -24338 139 418 -15258 -35622 -26698 -15384 -15065 -32014 -10656 2204
9476 2204 14986 26605 38691 25977 -1763 -19856 -7922 -8507 -15094 1115 -9171 -3786 6633
9463 6633 30475 41170 35828 40951 24780 17123 37825 52740 35355 27395 20874 30652 11537
9450 11537 -1118 23098 35927 17311 1831 -14212 -3480 -10527 -46584 -57631 -34729 -18140
9438 -18140 -31472 -22838 -33190 -52378 -30465 -8404 4329 35714 12051 4128 16103 4553
9426 4553 11219 16898 14605 15051 3115 -29925 1631 30180 16305 18917 15675 -11175 -33057
9413 -33057 -26422 4745 16174 31262 31824 7939 13382 28646 14531 -19493 -31847 -47809 -35458
$$ packed form
9503a586Q709J4245o47j5186l9906O942M640m01N201P319j5675J0761k2233M322
9489c3495Q118P213o174K4477K79j5676k0364Q924J1314L19j6949K1358J2860
9476B204J2782J1619J2086j2714k7740j8093J1934n85o587J6209j0286N385J0419
9463F633K3842J0695n342N123j6171p657K0702J4915j7385p960o521R778j9115
9450A1537j2655K4216J2829j8616j5480j6043J0732p047l6057j1047K2902J6589
9438a8140j3332Q634j0352j9188K1913K2061J2733L1385k3663p923J1975j1550
9426D553O666N679k293M46j1936l3040L1556K8549j3875K612l242k6850k1882
9413c3057O635L1167J1429J5088N62k3885N443J5264j4115l4024j2354j5962J2351
$$ plain form
9400 -35458 -4869 37840 31179 9850 2191 4113 7868 23055 -7589 -17703 -6841 -620 35552
9387 35552 26610 21661 15152 -23697 -32398 -15961 2365 4468 -6845 -14873 -14564 15545 50264
9374 50264 35320 15188 8910 15728 17813 40003 17921 1973 14391 20410 -11890 -22908 -28457
9361 -28457 -40406 -49637 -26841 -39667 -964 15095 1002 9360 8418 -8251 -3398 -4916 22918
9348 22918 -1274 -20555 8571 18106 -16326 -20476 -19368 -32792 -51968 -46745 -21947 34580 21337
9335 21337 21773 36197 63441 67332 73826 77902 59629 2725 -14035 6031 3170 -19199 1864
9322 1864 5500 10087 21821 -5958 -28627 1043 27614 3644 -2581 7332 8403 -17155 -20802
9309 -20802 -27858 -11562 -18865 -12545 7072 -5387 -5643 8464 12566 -19829 -21353 -36005 -42585
$$ packed form
9400c5458L0589M2709o661k1329p659J922L755J5187l0644j0114J0862O221L6172
9387C5552q942m949o509l8849q701J6437J8326K103j1313q028L09L0109L4719
9374E0264j4944k0132o278O818K085K2190k2082j5948J2418O019l2300j1018n549
9361b8457j1949r231K2796j2826L8703J6059j4093Q358r42j6669M853j518K7834
9348B2918k4192j9281K9126R535l4432m150J108j3424j9176N223K4798N6527j3243
9335B1337M36J4424K7244L891O494M076j8273n6904j6760K0066k861k2369K1063
9322A864L636M587J1734k7779k2669K9670K6571k3970o225R913J071k5558l647
9309b0802p056J6296p303O320J9617j2459k56J4107M102l2395j524j4652o580
$$ plain form
9296 -42585 -15090 6260 28213 29978 25849 40317 20711 30506 47928 32840 36426 31536 4769
9283 4769 3376 -12953 -3956 2253 -2432 -5116 19288 31023 39927 18187 18587 26677 13241 15252
9269 15252 2415 10889 -6317 3808 25712 21059 14072 14127 9113 27889 47584 51381 36113
9256 36113 28086 13942 -7309 2148 32815 70421 72501 43555 55326 76436 65497 95967
9244 95967 111346 85037 88576 99875 75844 67390 48639 25031 31257 30935 11149 10298 1537
9231 1537 5537 -4987 11244 9886 10681 1408 37887 49061 33699 14353 5358 3175 26874
9218 26874 38565 36902 31990 48333 26953 30404 52585 82114 67970 38968 39009 61676 68238
9205 68238 56903 42017 48294 67926 65646 57326 60119 97807 63147 42199 46524 33866 34308
$$ packed form
9296d2585K7495K1350K1953J765m129J4468j9606R795J7422j5088L586m890k6767
9283D769j393j6329Q997O209m685k684K4404J1735Q904k1740M00Q090j3436K011
9269A5252j2837Q474j7206J0125K1904m653o987N5n014J8776J9695L797j5268
9256C6113q027j4144k1251R457L0667L7606K080k8946J1771K1110j0939L0470
9244I5967J5379k6309L539J1299k4031q454j8751k3608O226l22j9786q51q761
9231A537M000j0524J6231j358P95r273L6479J1174j5362j9346q995k183K3699
9218B6874J1691j663m912J6343k1380L451K2181K9529j4144k9002M1K2667O562
9205F8238j1335j4886O277J9632k280q320K793L7688l4660k0948M325j2658M42
$$ plain form
9192 34308 30894 54601 61497 54710 63304 79482 79031 76994 51991 51855 58674 88911 124147 141576
9178 141576 135802 112168 86371 91346 116119 146864 155417 162264 170416 159963 119701 121093 124833
9165 124833 93930 97543 128431 140063 154365 158690 158960 169128 148867 124501 143587 183769
9153 183769 174710 185234 198006 226141 260259 290585 295614 327224 358364 369761 388033 409448
9141 409448 448792 481026 512476 540931 597948 667486 727365 809527 888024 998676 1081364
9130 1081364 1172262 1311870 1467294 1681154 1941984 2168669 2438850 2800664 3201705 3680618
9120 3680618 4192526 4784455 5441457 6118060 6764222 7293816 7710886 7966859 8012390 7808188
9110 7808188 7364830 6732074 5964244 5183601 4453562 3819245 3301478 2893487 2565704 2290817
$$ packed form
9192C4308l414K3707O896o787Q594J6178m51k037k5003j36O819L0237L5236J7429
9178A41576n774k3634k5797M975K4773L0745Q553O847Q152j0453m0262J392L740
9165A24833l0903L613L0888J1632J4302M325K70J0168k0261k4366J9086M0182
9153A83769r059J0524J2772K8135L4118L0326N029L1610L1140J1397J8272K1415
9141D09448L9344L2234L1450K8455N7017O9538N9879Q2162P8497J10652Q2688
9130A081364R0898J39608J55424K13860K60830K26685K70181L61814M01041M78913
9120C680618N11908N91929O57002O76603O46162N29594M17070K55973M5531k04202
9110G808188m43358o32756p67830p80643p30039o34317n17767m07991l27783k74887
$$ plain form
9100 2290817 2063554 1833159 1623210 1472265 1383093 1288664 1201957 1152236 1077287 1011156 971580
9089 971580 917167 868497 846000 807735 761481 703078 657917 662795 641953 600781 585645 586735
9077 586735 576760 550020 530567 504559 498026 496948 486335 472852 449320 420095 394765 391311
9065 391311 373797 378960 394845 375556 367283 380036 402202 386072 354843 370351 381473 356186
9053 356186 358897 356160 346813 340229 326304 347017 381669 392538 367147 333097 291526 280782
9041 280782 286174 273742 294457 310514 325737 316377 321099 331578 360070 361778 329531 304240
9029 304240 285026 285807 260268 239540 209435 214426 228194 247860 263300 252839 267767 279339
9017 279339 260772 245010 235463 216916 191996 177372 184849 177652 175495 191293 193128 179688 151264
$$ packed form
9100B290817k27263k30395k09949j50945q9172r4429q6707m9721p4949o6131l9576
9089I71580n4413m8670k2497l8265m6254n8403m5161M878k0842m1172j5136J090
9077E86735r975k6740j9453k6008o533j078j0613j3483k3532k9225k5330l454
9065C91311j7514N163J5885j9289q273J2753K2166j6130l1229J5508J1122k5287
9053C56186K711k737r347o584j3925K0713L4652J0869k5391l4050m1571j0744
9041B80782N392j2432K0715J6057J5223r360M722J0479K8492J708l2247k5291
9029C04240j9214P81k5539k0728l0105M991J3768J9666J5440j0461J4928J1572
9017B79339j8567j5762r547j8547k4920j4624P477p197k157J5798J835j3440k8424
$$ plain form
9004 151264 141738 112112 107726 130990 144922 152772 148402 109350 119958 144853 155812 158721 145752
8991 145752 146079 121856 115254 145654 130618 98119 90627 80193 79965 68523 47958 80024 97742
8978 97742 94417 89508 77081 53359 41042 60110 75867 70011 41166 5067 -4431 -15157 564
8965 564 12096 -10737 -23656 -3033 -11163 -23883 5985 -2754 11437 19537 -3059 -18049 -7623
8952 -7623 30704 33259 59953 60521 69166 49279 27270 38055 72257 96544 86641 36073 5690
8939 5690 22595 13177 2042 14497 31330 26022 42672 63345 72113 72413 64389 61994 35438
8926 35438 30029 27805 15460 21080 32118 23927 21269 7408 3190 27256 54705 43430 14870
8913 14870 12335 42132 60068 46432 62345 49933 18087 -13216 6523 15193 -21934 -13100
$$ packed form
9004A51264r526k9626m386K3264J3932P850m370l9052J0608K4895J0959K909j2969
8991A45752L27k4223o602L0400j5036l2499p492j0434k28j1442k0565L2066J7718
8978I7742l325m909j2427k3722j2317J9068J5757n856k8845l6099r498j0726J5721
8965E64J1532k2833j2919K0623q130j2720K9868q739J4191Q100k2596j4990J0426
8952g623L8327K555K6694N68Q645j9887k2009J0785L4202K4287r903n0568l0383
8939E690J6905r418j1135J2455J6833n308J6650K0673Q768L00q024k395k6556
8926C5438n409k224j2345N620J1038q191k658j3861m218K4066K7449j1275k8560
8913A4870k535K9797J7936j3636J5913j2412l1846l1303J9739Q670l7127Q834
$$ plain form
8901 -13100 28304 37664 11266 -20650 -16360 26656 52818 44694 56233 39084 14650 21321 14573
8888 14573 -5476 -12592 -42998 -43679 -37185 -26625 -5356 15703 7864 -1674 14312 54898 58038
8875 58038 13115 -20905 7760 12069 37976 55846 48690 50028 46067 -154 -436 29209 39446
8862 39446 61310 67067 56812 28156 -8463 -22003 8866 45075 31200 14068 3050 -3573
8850 -3573 9710 34291 3833 -982 21067 7589 5253 20744 8869 -11263 -9405 -9319 7033
8837 7033 19904 30534 29513 54242 62043 41663 11895 5687 -11552 4058 27149 29531 11808
8824 11808 -5232 -472 9496 7351 -3502 -11437 -14003 6680 3813 -10533 3297 19600 27003
8811 27003 29845 39016 22823 -7780 6837 27677 43910 42440 25559 19493 5368 -648 3750
$$ packed form
8901a3100M1404R360k6398l1916M290M3016K6162q124J1539j7149k4434O671o748
8888A4573k0049p116l0406o81O494J0560K1269K1059p839r538J5986M0586L140
8875E8038m4923l4020K8665M309K5907J7870p156J338l961m6221k82K9645J0237
8862C9446K1864N757j0255k8656l6619j3540L0869L6209j3875j7132j1018o623
8850c573J3283K4581l0458m815K2049j3478k336J5491j1875k0132J858Q6J6352
8837G033J2871J0630j021K4729P801k0380k9768o208j7239J5610K3091K382j7723
8824A1808j7040M760R968k145j0853p935k566K0683k867j4346J3830J6303P403
8811B7003K842R171j6193l0603J4617K0840J6233j470j6881o066j4125o016M398
$$ plain form
8798 3750 23530 42004 16501 -605 -20184 -26073 2176 8408 727 -35227 -17639 4381 -7633
8785 -7633 -30451 -3850 26554 34359 9569 6825 24455 21507 16183 14328 28150 34897 58556
8772 58556 74623 66058 48200 30076 56714 44448 10491 11790 29046 42890 30803 20209
8760 20209 31105 55118 61031 48862 47950 40247 43990 11408 9023 15907 2119 6110 -4780
8747 -4780 13778 11273 19875 27924 32931 37308 49105 46704 27355 18385 19532 29268 53439 65524
8733 65524 35834 16470 25886 40035 45350 60976 93708 82740 71950 85995 90951 70995
8721 70995 42326 41830 46632 59761 58374 59138 36919 19462 5231 2601 32334 65982 72942
8708 72942 61972 84191 66987 54118 52286 26651 29983 41052 33879 39249 53717 55895 64631
$$ packed form
8798C750J9780J8474k5503j7106j9579n889K8249O232p681l5954J7588K2020j2014
8785g633k2818K6601L0404P805k4790k744J7630k948n324j855J3822O747K3659
8772E8556J6067q565j7858j8124K6638j2266l3957J299J7256J3844j2087j0594
8760B0209J0896K4013N913j2169r12p703L743l2582k385O884j3788L991j0890
8747d780J8558k505Q602Q049N007M377J1797k401j9349q970J147R736K4171J2085
8733F5524k9690j9364R416J4149N315J5626L2732j0968j0790J4045M956j9956
8721G0995k8669m96M802J3129j387P64k2219j7457j4231k630K9733L3648O960
8708G2942j0970K2219j7204j2869j832k5635L332J1069p173N370J4468K178Q736
$$ plain form
8695 64631 37592 52320 76047 57632 49051 95943 141657 148881 119412 91068 71762 82735
8683 82735 123923 92528 79133 83341 92440 86049 81495 94815 100213 115623 118968 97491 96329
8670 96329 91957 85379 67427 98134 108786 122589 129466 104032 105758 96130 137968 152646 141403
8657 141403 126245 126495 110206 79574 69564 107803 154903 171238 195783 171070 164030 180631
8645 180631 204748 207255 187839 187268 167846 177558 186863 191650 200535 226800 260822 247291 241614
8632 241614 239996 250922 279724 304256 293496 314647 354882 376946 364933 390517 453120 479049
8620 479049 491259 487317 516773 573476 587415 564112 547886 527764 523552 548871 549180 542345 542802
8607 542802 532090 498049 475619 435909 425208 428931 407767 408204 435984 449623 440133 418270
$$ packed form
8695F4631k7039J4728K3727j8415q581M6892M5714P224k9469k8344j9306J0973
8683H2735M1188l1395j3395M208R099o391m554J3320N398J5410L345k1477j162
8670I6329m372o578j7952L0707J0652J3803O877k5434J726r628M1838J4678j1243
8657A41403j5158K50j6289l0632j0010L8239M7100J6335K4545k4713p040J6601
8645A80631K4117K507j9416n71j9422R712R305M787Q885K6265L4022j3531n677
8632B41614j618J0926K8802K4532j0760K1151M0235K2064j2013K5584O2603K5929
8620D79049J2210l942K9456N6703J3939k3303j6226k0122m212K5319L09o835M57
8607E42802j0712l4041k2430l9710j0701L723k1164M37K7780J3639r490k1863
$$ plain form
8595 418270 403310 407596 414343 388100 373745 361208 333386 319787 305513 278777 234527 196341
8583 196341 206791 215991 206125 210407 210392 193618 165232 129930 145377 123970 117879 130759 135565
8570 135565 124449 122862 138063 134619 113436 83780 80851 90842 86461 77226 74439 55965 64276
8557 64276 36697 45372 53557 67831 69071 74911 65083 65264 66327 72424 35139 34379 73452 85445
8543 85445 60660 79889 82933 50058 34019 59658 70051 73987 66487 77254 82620 90538 91318
8530 91318 91259 69752 49121 49652 68665 88058 93312 93444 79419 66043 82270 69675 63541 64877
8516 64877 50091 51567 44035 64456 59918 48163 34398 12974 18036 31830 43028 50031 26202
8503 26202 11298 5332 -1372 -1156 -3629 22444 11801 6938 17267 11873 -106 -20440 -4006
$$ packed form
8595D18270j4960M286O747k6243j4355j2537k7822j3599j4274k6736m4250l8186
8583A96341J0450R200r866M282j5j6774k8386l5302J5447k1407o091J2880M806
8570A35565j1116j587J5201l444k1183k9656k929R991m381r235k787j8474Q311
8557F4276k7579Q675Q185J4274J240N840r828J81J063O097l7285p60L9073J1993
8543H5445k4785J9229L044l2875j6039K5639J0393L936p500J0767N366P918P80
8530I1318n9k1507k0631N31J9013J9393N254J32j4025j3376J6227j2595o134J336
8516F4877j4786J476p532K0421m538j1755j3765k1424N062J3794J1198P003k3829
8503B6202j4904n966o704K16k473K6073j0643m863J0329n394j1979k0334J6434
$$ plain form
8490 -4006 26053 9200 -15650 -17364 28085 31982 22860 26730 19805 20602 367 -7854 -6207 3808
8476 3808 19267 50406 78998 58648 17518 -28843 -43582 -44493 -36085 -11647 11085 23998 2919
8463 2919 34460 99 -24564 6439 16420 20445 21160 53494 78065 83346 77223 59000 46400
8450 46400 33516 5322 -37053 -32995 -3676 10639 7373 4840 11716 37717 45179 38148 32962
8437 32962 46778 55728 54458 57187 40579 24869 19078 33930 48631 51191 51286 52280 36045 12262
8423 12262 223 -6096 -2797 7197 -10686 -25001 -2387 34834 27175 10714 22266 6286 -308
8410 -308 -2767 18355 16254 -13458 -13855 19357 33287 23753 23971 18187 8459 547 -2541 -2529 5707
8395 5707 17744 13228 -11459 -37912 -38388 -14977 -4207 -7068 -23591 -4307 5941 22555 46948
$$ packed form
8490d006L0059j6853k4850j714M5449L897r122L870o925P97k0235q221J647J0015
8476C808J5459L1139K8592k0350m1130m6361j4739r11Q408K4438K2732J2913k1079
8463B919L1541l4361k4663L1003R981M025P15L2334K4571N281o123j8223j2600
8450D6400j2884k8194m2375M058K9319J4315l266k533O876K6001P462p031n186
8437C2962J3816Q950j270K729j6608j5710n791J4852J4701K560R5R94j6235k3783
8423A2262j2039o319L299R994j7883j4315K2614L7221p659j6461J1552j5980o594
8410c08k459K1122k101k9712l97L3212J3930r534K18n784r728p912l088J2Q236
8395E707J2037m516k4687k6453m76K3411J0770k861j6523J9284J0248J6614K4393
$$ plain form
8382 46948 32972 33636 8994 -1090 4573 7605 22833 9307 26619 37923 11209 -1120 9244
8369 9244 24138 21657 7909 3095 18281 28632 7977 -8274 -6875 28532 10688 3782 13279
8356 13279 22081 2211 -17794 17788 32748 3060 14184 31252 23468 24165 20878 19303 20448
8343 20448 11359 -15184 -7894 2825 9215 16223 23453 22274 9272 -25216 -35240 -30584 -26620
8330 -26620 -11875 -8897 -7905 5888 -18751 -20605 -11324 4029 13487 41274 42143 41176 39326 39371 35084
8315 35084 22835 20066 5464 -1666 1666 1243 15247 28157 -29152 -36957 -21433 -31314 -21142
8302 -21142 -13735 -29799 -38994 -48052 -34699 -35912 -13293 -3964 13171 13957 23385 47058 32659
8289 32659 36766 22728 17710 27458 -5798 -21324 -34980 7397 59180 46712 26245 -5994
$$ packed form
8382D6948j3976O64k4642j0084N663L032J5228j3526J7312J1304k6714j2329J0364
8369I244J4894k481j3748m814J5186J0351k0655j6251J399L5407j7844o906R497
8356A3279Q802j9870k0005L5582J4960k9688J1124J7068p784O97l287j575J145
8343B0448r089k6543P290J0719O390P008P230j179j3002l4488j0024M656L964
8330b6620J4745K978R92J3793k4639j854R281J5353R458K7787Q69r67j850M5m287
8315C5084j2249k769j4602p130L332m23J4004J2910n7309p805J5524r881J0172
8302b1142P407j6064r195r058J3353j213K2619R329J7135P86R428K3673j4399
8289C2659M107j4038n018R748l3256j5526j3656M2377N1783j2468k0467l2239
$$ plain form
8277 -5994 -11290 -6189 32668 26544 29711 30231 27500 25724 18918 9822 -17078 -33096 -31081 -37176
8263 -37176 -34179 -24088 -9207 4988 9221 -12891 -33941 -42500 -31644 -28745 -20922 1103 17937
8250 17937 12833 28451 37248 -3992 -4274 1318 -37028 -68607 -59512 -45142 -28818 -14613 -20560
8237 -20560 -8336 11063 23427 31111 27379 6354 9375 3931 15578 23851 12367 7973 18501
8224 18501 14901 19764 18035 13450 -1725 14893 46001 45532 16214 -40555 -43282 -40266 -39240 -17246
8210 -17246 -8551 -20989 -6157 -1158 -4700 9846 7811 22310 19496 -5319 -17538 -3668 4365
8197 4365 -6833 -2980 -18771 -41015 -70596 -22234 13100 10635 2329 -25153 -3515 -11698 7419
8184 7419 37565 39193 30935 19255 12832 22999 -16947 -25614 -23351 -37894 -8699 14751 26242
$$ packed form
8277e994n296N101L8857o124L167N20k731j776o806r096k6900j6018K015o095
8263c7176K997J0091J4881J4195M233k2112k1050q559J0856K899P823K2025J6834
8250A7937n104J5618Q797m1240k82N592l8346l1579R095J4370J6324J4205n947
8237b0560J2224J9399J2364P684l732k1025L021n444J1647Q273j1484m394J0528
8224A8501l600M863j729m585j5175J6618L1108m69k9318n6769k727L016J026K1994
8210a7246Q695j2438J4832M999l542J4546k035J4499k814k4815j2219J3870Q033
8197D365j1198L853j5791k2244k9581M8362L5334k465q306k7482K1638q183J9117
8184G419L0146J628q258j1680o423J0167l9946q667K263j4543K9195K3450J1491
$$ plain form
8171 26242 20116 16095 15481 22915 2662 8018 22341 6370 -3103 -610 3912 11699 -10936 -25600
8157 -25600 725 5313 9456 26636 15885 13239 17823 34266 38799 24011 2835 -13042 -4707
8144 -4707 -4913 11853 16424 157 -17276 2485 -10983 -37296 -35937 5401 23302 24351 21382
8131 21382 -23697 -16465 -17095 -33481 9479 33247 15503 -14389 -33651 -51149 -48648 -16853 -21437
8118 -21437 -31136 -31462 -32272 -41320 -32091 -19066 19469 22095 32586 22040 784 -3666 -505 11831
8104 11831 81 -9535 7372 32183 39458 28186 20896 18908 16332 6293 19099 37529 26651
8091 26651 12864 8921 -5655 17629 24712 27833 37020 18757 -8288 -5821 3440 2038 12436
8078 12436 30920 18309 4154 14289 8982 6817 6520 16466 19123 30717 29768 32901 21458 21644
$$ packed form
8171B6242o126m021o14P434k0253N356J4323j5971r473K493M522P787k2635j4664
8157b5600K6325M588M143J7180j0751k646M584J6443M533j4788k1176j5877Q335
8144d707k06J6766M571j6267j7433J9761j3468k6313J359M1338J7901J049k969
8131B1382m5079P232o30j6386M2960K3768j7744k9892j9262j7498K501L1795m584
8118b1437r699l26q10r048R229J3025L8535K626J0491j0546k1256m450L161J2336
8104A1831j1750r616J6907K4811P275j1272p290j988k576j0039J2806J8430j0878
8091B6651j3787l943j4576K3284P083L121R187j8263k7045K467R261j402J0398
8078A2436J8484j2611j4155J0135n307k165k97R946K657J1594r49L133j1443J86
$$ plain form
8064 21644 36071 32087 29221 57237 60253 67069 53764 75345 67583 81637 108909 127810 122435
8051 122435 109131 116551 129504 166425 197140 214206 204454 188334 215028 207983 192115 213447
8039 213447 233826 236539 212286 199201 194010 194942 216384 232466 225993 219430 187437 176504 163641
8026 163641 159570 128896 142223 145235 163226 164621 179666 195733 183559 181954 193893 211161
8014 211161 196052 234158 266342 292540 341946 389272 426861 445604 468672 523301 526304 535494
8002 535494 556796 553082 493367 446863 389924 339672 290915 259916 248742 227186 202869 172907
7990 172907 181764 186923 171367 151562 125061 95972 93314 100401 106633 99790 122570 130296 148383
7977 148383 168204 157991 171593 201193 191218 180985 183759 189870 186666 187231 198552 233834 249728
$$ packed form
8064B1644J4427l984k866K8016L016O816j3305K1581p762J4054K7272J8901n375
8051A22435j3304P420J2953L6921L0715J7066r752j6120K6694p045j5868K1332
8039B13447K0379K713k4253j3085n191R32K1442J6082o473o563l1993j0933j2863
8026A63641m071l0674J3327L012J7991J395J5045J6067j2174j605J1939J7268
8014B11161j5109L8106L2184K6198M9406M7326L7589J8743K3068N4629L003R190
8002E35494K1302l714n9715m6504n6939n0252m8757l0999j1174k1556k4317k9962
7990A72907Q857N159j5556j9805k6501k9089k658P087O232o843K2780P726J8087
7977A48383J9821j0213J3602K9600r975j0233K774O111l204N65J1321L5282J5894
$$ plain form
7964 249728 245950 259253 264105 256650 266099 277516 277519 253146 222129 203759 189054 196970 167715
7951 167715 141970 126844 99397 106093 105667 95364 83033 98544 122508 124107 103525 72482
7939 72482 57208 56606 59331 66072 70581 48239 23850 22571 16321 23085 48270 30217 53652
7926 53652 64284 69468 28286 7724 17412 35223 46337 82402 97804 93895 65534 72303 60145
7913 60145 53873 42779 22278 37667 45493 37015 49410 56210 35196 28148 54420 65995 55205
7900 55205 56766 43647 15441 3701 32304 39527 29855 21494 35552 37885 44125 40229 29762
7887 29762 34346 33239 25784 20332 23754 53016 61860 58676 55324 28688 34693 21866 17396 38279
7873 38279 37516 66938 78670 40615 9719 -7500 -36039 -16263 4384 8344 -8977 -8480 1700
$$ packed form
7964B49728l778J3303M852p455R449J1417Lk4373l1017j8370j4705P916k9255
7951A67715k5745j5126k7447O696m26j0303j2331J5511K3964J599k0582l1043
7939G2482j5274o02K725O741M509k2342k4389j279o250O764K5185j8053K3435
7926E3652J0632N184m1182k0562R688J7811J1114L6065J5402l909k8361O769j2158
7913F0145o272j1094k0501J5389P826q478J2395O800k1014p048K6272J1575j0790
7900E5205J561j3119k8206j1740K8603P223r672q361J4058K333O240l896j0467
7887B9762M584j107p455n452L422K9262Q844l184l352k6636O005j2827m470K0883
7873C8279p63K9422J1732l8055l0896j7219k8539J9776K0647L960j7321M97J0180
$$ plain form
7860 1700 23984 45990 40619 78651 63534 34276 12070 23320 -6258 -33605 1078 33115
7848 33115 -1018 -4189 -24188 -17230 -21184 -8645 32657 63210 61722 62756 40377 13060 -2434
7835 -2434 11945 22807 11945 -492 31242 36627 9548 -11733 -3814 -6793 -26670 -24476 -23020
7822 -23020 -201 -12646 -23599 -26924 -18005 -233 6337 16494 11535 12658 8651 3833 -16941
7809 -16941 -20598 -8376 -16775 -2453 7100 12553 16044 8843 -8085 -8554 16042 33177 41502 15366
7795 15366 374 379 9067 44609 51492 43294 45701 64034 44478 48541 52225 63028 69663 44912
7781 44912 10467 22785 11534 31579 4220 -5130 13461 43513 66826 47391 19637 8633
7769 8633 13556 32177 40191 18125 32875 54920 18863 -19178 -23974 -40696 -39430 -21392 -19740
$$ packed form
7860A700K2284K2006n371L8032j5117k9258k2206J1250k9578k7347L4683L2037
7848C3115l4133l171j9999O958l954J2539M1302L0553j488J034k2379k7317j5494
7835b434J4379J0862j0862j2437L1734N385k7079k1281P919k979j9877K194J456
7822b3020K2819j2445j0953l325Q919J7772O570J0157m959J123m007m818k0774
7809a6941l657J2222q399J4322R553N453L491p201j6928m69K4596J7135Q325k6136
7795A5366j4992NQ688L5542O883q198K407J8333j9556M063L684J0803O635k4751
7781D4912l4445J2318j1251K0045k7359r350J8591L0052K3313j9435k7754j1004
7769H633M923J8621Q014k2066J4750K2045l6057l8041m796j6722J266J8038J652
$$ plain form
7756 -19740 -11746 5762 -10886 -32088 -20387 -29691 -13303 8208 6010 11071 10517 -14027 -31066
7743 -31066 -23675 -41170 -36941 6848 38717 38372 39615 49213 64456 45024 19578 24229 31096
7730 31096 33864 44177 38317 14059 7995 2263 -25202 -33685 -46486 -37351 -26078 -10826 30370
7717 30370 25909 2075 -46274 -56666 -19517 11164 24024 11105 327 -31318 -18327 -13703
7705 -13703 7423 -8744 -6443 -7537 10691 -1259 -18086 -12458 -21088 -50045 -42111 -23885 -8394
7692 -8394 3360 8916 -3150 -27932 -38661 -63503 -54272 -32799 -34778 -31708 -33347 -11489 8736
7679 8736 14289 5329 -12114 -10442 -23717 -17961 7539 18823 3682 -9314 -7892 14032 28688
7666 28688 -3354 -42757 -12090 20108 23716 9792 -4291 -21698 -53220 -47364 -34288 -28199
$$ packed form
7756a9740P994J7508j6648k1202J1701r304J6388K1511k198N061n54k4544j7039
7743c1066P391j7495M229M3789L1869l45J243R598J5243j9432k5446M651O867
7730C1096K768J0313n860k4258o064n732k7465q483j2801R135J1273J5252M1196
7717C0370m461k3834m8349j0392L7149L0681J2860j2919j0778l1645J2991M624
7705a3703K1126j6167K301j094J8228j1950j6827N628q630k8957P934J8226J5491
7692h394J1754N556j2066k4782j0729k4842R231K1473j979L070j639K1858K0225
7679H736N553q960j7443J672j3275N756K5500J1284j5141j2996J422K1924J4656
7666B8688l2042l9403L0667L2198L608j3924j4083j7407l1522N856J3076O089
$$ plain form
7654 -28199 -20362 2761 11491 25347 48727 62645 64898 70976 63994 39960 4414 -17025 22
7641 22 -15209 -25867 -32755 -17123 -18453 -29800 -13608 -9007 -11621 -25025 -29322 -56445 -70437
7628 -70437 -38189 -12597 -20010 -11548 -7103 9078 -15518 -52429 -40089 -1486 12010 27035
7616 27035 30097 10261 10786 9807 21017 35848 25919 18073 12022 5542 -36318 -36022 -29559 -22826
7602 -22826 -33724 -32645 -11308 7546 14462 5733 10615 22491 51921 27320 14378 -28581 -59746
7589 -59746 -63712 -55609 -41417 -24294 -30561 -1479 13373 16408 13932 931 1296 38035 54745
7576 54745 34046 31790 15836 -12414 -28124 -6142 12906 32594 40529 40302 16937 -7187 11341
7563 11341 41249 47134 43088 26500 15190 -2939 -19969 -23756 -12010 -1859 -41031 -48099 -34008
$$ packed form
7654b8199P837K3123Q730J3856K3380J3918K253O078o982k4034l5546k1439J7047
7641B2j5231j0658o888J5632j330j1347J6192M601k614j3404m297k7123j3992
7628g0437L2248K5592p413Q462M445J6181k4596l6911J2340L8603J3496J5025
7616B7035L062j9836N25r79J1210J4831r929p846o051o480m1860K96O463O733
7602b2826j0898J079K1337J8854O916q729M882J1876K9430k4601j2942m2959l1165
7589e9746l966Q103J4192J7123o267K9082J4852L035k476j3001L65L6739J6710
7576E4745k0699k256j5954k8250j5710K1982J9048J9688P935k27k3365k4124J8528
7563A1341K9908N885m046j6588j1310j8129j7030l787J1746J0151l9172p068J4091
$$ plain form
7550 -34008 -49233 -54102 -20284 39582 18214 -7750 -798 -38 -4243 -4383 -3704 -3709 4076 17621 10437
7535 10437 -10391 13971 14956 19520 39894 22993 3093 2195 -136 -32053 -52623 -49087 -13569
7522 -13569 -25430 -7873 28292 68761 32066 -28325 -46477 -40864 -29921 -12161 16829 28463
7510 28463 32061 -8347 -31265 -48485 -35563 15555 33566 32976 12073 -29795 -7466 -160 -14159
7497 -14159 -23978 -2379 15585 -2540 -856 24453 4884 -28681 -41504 -40156 -8442 22821
7485 22821 20307 26883 38318 34790 35876 34240 29795 -5275 -7716 -28873 -29606 -12252 1958 16276
7471 16276 13731 17093 -17740 -21609 -14487 -13719 -16464 -1251 18842 22246 18428 8337 -10163 -48820
7457 -48820 -50347 -7275 -9781 -19627 874 19877 38559 29257 -7573 -20250 -13371 3371 13110
$$ packed form
7550c4008j5225m869L3818N9866k1368k5964O952P60m205j40O79nP785J3545p184
7535A0437k0828K4362R85M564K0374j6901j9900q98k331l1917k0570L536L5518
7522a3569j1861J7557L6165M0469l6695o0391j8152N613J0943J7760K8990J1634
7510B8463L598m0408k2918j7220J2922N1118J8011n90k0903m1868K2329P306j3999
7497a4159r819K1599J7964j8125J684K5309j9569l3565j2823J348L1714L1263
7485B2821k514O576J1435l528J086j636m445l5070k441k1157p33J7354J4210J4318
7471A6276k545L362l4833l869P122P68k745J5213K0093L404l818j0091j8500l8657
7457d8820j527M3072k506r846K0501J9003J8682r302l6830j2677O879J6742R739
$$ plain form
7444 13110 19966 37634 21374 15187 7172 8283 -1139 -40761 -19455 17766 43183 23651 7131
7431 7131 1646 15489 -15592 -40632 -13810 15510 22253 14546 -6812 -16348 -19433 7234 29801
7418 29801 -9549 -24122 -2218 -9860 -26005 -33041 -12804 -17471 -16062 -1136 14345 26961 18041
7405 18041 21051 -7083 -31717 -32248 -38563 -13505 -11672 5332 20021 23074 -1119 -42083 -43234
7392 -43234 -13717 -3421 -15765 -38038 -32450 -25582 -20299 9419 5317 -28428 -17414 32366 43743
7379 43743 25131 2873 -3204 29276 56168 26853 5370 11860 6851 15049 30561 22597 -290
7366 -290 -7174 -1213 20888 17076 -4934 -16596 11001 45679 27233 31329 27855 9137 30493
7353 30493 46801 49069 16080 -9157 -9747 -9697 -18890 4676 17488 26592 28919 45403 29400 3503
$$ packed form
7444A3110O856J7668j6260o187q015J111r422l9622K1306L7221K5417j9532j6520
7431G131n485J3843l1081k5040K6822K9320O743p707k1358r536l085K6667K2567
7418B9801l9350j4573K1904p642j6145p036K0237m667J409J4926J5481J2616q920
7405A8041L010k8134k4634n31o315K5058J833J7004J4689L053k4193m0964j151
7392d3234K9517J0296j2344k2273N588O868N283K9718m102l3745J1014M9780J1377
7379D3743j8612k2258o077L2480K6892k9315k1483O490n009Q198J5512p964k2887
7366b90o884N961K2101l812k2010j1662K7597L4678j8446M096l474j8718K1356
7353C0493J6308K268l2989k5237n90N0r193K3566J2812R104K327J6484j6003k5897
$$ plain form
7339 3503 27530 33558 14448 6726 3363 -1217 7125 13372 -4967 10848 39918 42369 36611 23708
7325 23708 19246 13676 33528 39273 25138 18791 26932 5356 -1258 -21579 -46407 -42263 -47639
7312 -47639 -44681 -42116 -31628 -23917 -38733 -67067 -54013 -4099 18555 -7486 -30467 -24864 -22475
7299 -22475 -11871 9313 13019 -4189 -12695 -3628 -13904 -35050 -15273 49552 81265 38320
7287 38320 24060 31622 12690 13669 7119 5583 11244 13914 19315 26065 37634 39360 31555 23296
7273 23296 39259 26184 -8163 -25891 -4722 -7254 -10099 19771 51614 47890 29948 14300
7261 14300 24543 5033 -35420 -14165 -189 -9721 -4632 -12015 -1427 19020 13331 8705 14839
7248 14839 19311 30915 24477 12837 -1363 -6253 2036 3866 -6854 19461 24628 33534 9701
$$ packed form
7339C503K4027O028j9110p722l363m580Q342O247j8339J5815K9070K451n758j2903
7325B3708m462n570J9852N745j4135o347Q141k1576o614k0321k4828M144n376
7312d7639K958K565J0488P711j4816k8334J3054M9914K2654k6041k2981N603K389
7299b2475J0604K1184L706j7208q506R067j0276k1146J9777O4825L1713m2945
7287C8320j4260P562j8932R79o550j536N661K670N401O750J1569J726p805q259
7273B3296J5963j3075l4347j7728K1169k532k845K9870L1843l724j7942j5648
7261A4300J0243j9510m0453K1255J3976r532N089p383J0588K0447n689m626O134
7248A4839M472J1604o438j1640j4200m890Q289J830j0720K6315N167Q906k3833
$$ plain form
7235 9701 9257 -6356 -37751 -16947 20512 11336 -14975 -4300 -5576 11184 13507 225 -22224
7222 -22224 9715 2980 -15755 -39990 -32365 -6837 15467 21195 13687 -11956 -30303 -19753 -9942
7209 -9942 -14026 -41054 -37678 -34944 -43552 -26860 -19461 -16108 8440 20105 32248 46527 59326
7196 59326 62072 36314 24428 21425 5942 -15014 4012 -12869 -25069 -33054 -29065 -29026 -25776
7183 -25776 -3990 -20306 -8082 -10074 -18407 -8132 3431 28692 32748 33324 37116 33844 17594
7170 17594 15183 29297 25215 11081 -17338 -41776 -45358 -32855 -32175 1453 -6761 -5997 19358
7157 19358 2412 4582 -23538 -37679 -40761 -964 31449 14735 5096 15819 554 -3739 3112
7144 3112 27049 52791 35909 -2624 -8412 -18196 -16481 10689 12146 4294 4170 -25512 -41034
$$ packed form
7235I701m44j5613l1395K0804L7459r176k6311J0675j276J6760K323j3282k2449
7222b2224L1939o735j8735k4235P625K5528K2304N728p508k5643j8347J0550R811
7209i942m084k7028L376K734q608J6692P399L353K4548J1665J2143J4279J2799
7196E9326K746k5758j1886l003j5483k0956J9026j6881j2200p985L989L9L250
7183b5776K1786j6316J2224j992q333J0275J1563K5261M056N76L792l272j6250
7170A7594k411J4114m082j4134k8419k4438l582J2503O80L3628q214P64K5355
7157A9358j6946K170k8120j4141l082L9797L2413j6714r639J0723j5265m293O851
7144C112K3937K5742j6882l8533n788r784J715K7170J457p852j24k9682j5522
$$ plain form
7131 -41034 -37228 -19736 -17340 -18604 -26778 -11969 -37084 -39372 -22483 -37879 -23411 -29610 -49377
7118 -49377 -52836 -51561 -24044 -9111 -12155 -5407 20820 18003 -13582 -32357 -31758 -24710 3653
7105 3653 12645 20950 12631 15976 -15957 -63515 -33388 -1129 601 -13866 -6448 -4131 -18124
7092 -18124 -36845 -38213 -49680 -51058 -31514 -32410 -35275 -30487 2030 39977 58766 57653 4008
7079 4008 -17836 -25849 -27206 -36314 -39668 -33588 -14915 6832 -3606 9888 36069 18154 26355
7066 26355 -4484 -19950 434 32099 17727 17337 49214 39728 24786 24936 26868 37957 2444
7053 2444 -2344 19235 26798 -5617 -11278 -9675 -6446 13119 6353 -17118 -23529 -15297 -14576 -18425
7039 -18425 -36565 -43169 -29561 -32126 -26279 -23691 -27467 -32151 -23586 -27109 -52437 -60814 -72160 -71923
$$ packed form
7131d1034L806J7492K396j264q174J4809k5115k288J6889j5396J4468o199j9767
7118d9377l459J275K7517J4933l044O748K6227k817l1585j8775N99P048K8363
7105C653Q992Q305q319L345l1933m7558L0127L2259J730j4467P418K317j3993
7092a8124j8721j368j1467j378J9544q96k865M788L2517L7947J8789j113n3645
7079D008k1844q013j357r108l354O080J8673K1747j0438J3494K6181j7915Q201
7066B6355l0839j5466K0384L1665j4372l90L1877r486j4942J50J932J1089l5513
7053B444m788K1579P563l2415n661J603L229J9565o766k3471o411Q232P21l849
7039a8425j8140o604J3608k565N847K588l776m684Q565l523k5328q377j1346K37
$$ plain form
7025 -71923 -41827 -32424 -21602 -25523 -24634 -31265 -32056 -10940 5392 6057 -11283 6325 -7356 -12602
7011 -12602 7588 42361 45344 58999 81884 38558 -92 -15244 -14247 -39029 -38923 -20084 -15313
6998 -15313 -21439 -40929 -35847 -29009 -19034 -13569 -9489 -8407 -21174 9014 12718 -4003 -22120
6985 -22120 -13897 315 -7693 6807 19879 12738 -12862 -15706 -13736 -13590 13438 16769 -15027
6972 -15027 -19809 5781 -2086 25094 22717 -12184 -19638 -13276 25028 34619 33703 35322 5791 -25291
6958 -25291 -34414 -12899 54 -1885 -80 614 -6093 -33943 -53536 -69527 -44189 -30207 -36125
6945 -36125 -48721 -38206 -25487 -1723 11493 -6401 548 -29560 -65485 -79266 -81311 -63795
6933 -63795 -54563 -43929 -21445 -19965 -6192 26011 39855 -4103 9426 25334 27257 35095 17491
$$ packed form
7025g1923L0096R403J0822l921Q89o631p91K1116J6332O65j7340J7608j3681n246
7011a2602K0190L4773K983J3655K2885m3326l8650j5152R97k4782J06J8839M771
6998a5313o126j9490N082O838R975N465M080J082j2767L0188L704j6721j8117
6985b2120Q223J4212q008J4500J3072p141k5600k844J970J46K7028L331l1796
6972a5027m782K5590p867K7180k377l4901p454O362L8304R591r16J619k9531l1082
6958b5291r123K1515J2953j939J805O94o707k7850j9593j5991K5338J3982n918
6945c6125j2596J0515J2719K3764J3216j7894O949l0108l5925j3781k045J7516
6933f3795R232J0634K2484J480J3773L2203J3844m3958J3529J5908J923P838j7604
$$ plain form
6920 17491 -5209 -20082 -25842 394 3760 -4207 -24125 -9079 -27459 -45217 -5288 24524
6908 24524 4398 -15535 -8497 -17026 -2889 24092 15815 10506 3818 -10696 -6939 -26362 -28912
6895 -28912 -9579 -10126 3977 25393 5383 11620 44928 23085 -11516 -60577 -80898 -61890
6883 -61890 -46351 -19247 -142 -29901 -40475 -40856 -32673 -29941 -38125 -31523 29 -16010 -15274
6870 -15274 -10403 -48691 -59875 49 21726 3948 -7589 -2169 5020 5845 42613 61672 35896
6857 35896 29358 7116 -14588 -24107 -18926 -20720 -48639 -61208 -42136 -31497 -34553 -27530 -5371
6844 -5371 -6662 -16099 -2155 16727 -7459 -36980 -41202 -70235 -53989 -13556 15796 3180 -6062
6831 -6062 -19780 -23550 -43884 -47128 -31939 -20650 -22514 -47575 -39244 -22641 -33859 -29253 -13679
$$ packed form
6920A7491k2700j4873n760K6236L366p967j9918J5046j8380j7758L9929K9812
6908B4524k0126j9933P038q529J4137K6981q277n309o688j4514L757j9423k550
6895b8912J9333n47J4103K1416k0010O237L3308k1843l4601m9061k0321J9008
6883f1890J5539K7104J9105k9759j0574l81Q183K732q184O602L1552j6039P36
6870a5274M871l8288j1184N9924K1677j7778j1537N420P189Q25L6768J9059k5776
6857C5896o538k2242k1704r519N181j794k7919j2569J9072J0639l056P023K2159
6844e371j291r437J3944J8882k4186k9521m222k9033J6246M0433K9352j2616r242
6831f062j3718l770k0334l244J5189J1289j864k5061Q331J6603j1218M606J5574
$$ plain form
6818 -13679 -10843 4071 12194 -3019 7739 -8031 -11890 -7977 3303 -19963 -27432 -6338 334
6805 334 33058 33563 1568 26304 32716 14057 12888 16144 5230 24236 22760 24268 52 -30824
6791 -30824 -27133 -39502 -6230 2938 -4629 -6296 5875 1340 -11235 -31147 -39671 -17589 5763
6778 5763 24748 21497 24437 6691 9144 -2722 -26604 -58090 -43411 -18060 16389 39452 54244
6765 54244 43300 25912 11545 -24265 -34626 -47529 -47497 -67512 -54631 -20830 -10316 -25761
6753 -25761 -1274 21257 -21011 -48661 -41846 -58741 -60172 -52270 -33857 -10048 -13738 3991 -17881
6740 -17881 -40951 -58118 -56835 -39068 -40707 -13304 3557 28456 52406 29347 -11752 -26053
6728 -26053 -32490 -20390 -4616 -1217 -18239 13732 2395 575 -628 -10088 3595 3154 5635
$$ packed form
6818a3679K836J4914Q123j5213J0758j5770l859L913J1280k3266p469K1094O672
6805C34L2724N05l1995K4736O412j8659j169L256j0914J9006j476J508k4216l0876
6791c0824L691j2369L3272R168p567j667J2171m535j2575j9912q524K2082K3352
6778E763J8985l251K940j7746K453j1866k3882l1486J4679K5351L4449K3063J4792
6765E4244j0944j7388j4367l5810j0361j2903L2k0015J2881L3801J0514j5445
6753b5761K4487K2531m2268k7650O815j6895j431P902J8413K3809l690J7729k1872
6740a7881k3070j7167J283J7767j639K7403J6861K4899K3950k3059m1099j4301
6728b6053o437J2100J5774L399j7022L1971j1337j820j203r460J3683m41K481
$$ [...]
##END NTUPLES=NMR SPECTRUM
##END=
