##TITLE=Analysis number 327859
Compound Code sb 02033
Book Reference 180556
Project Code adrs
Chemist Name jom
##JCAMPDX= 6.0         $$ Bruker NMR JCAMP-DX V2.0
##DATA TYPE= NMR SPECTRUM
##DATA CLASS= NTUPLES
##ORIGIN= Bruker BioSpin GmbH
##OWNER= nmr
$$ XWIN-NMR		Version 3.5
$$ Thu Apr 12 13:28:27 2007 GMT Daylight Time (UT+1h)  MAYBRIDGE\nmr@NMR_250MHZ
##.OBSERVE FREQUENCY= 250.131544655141
##.OBSERVE NUCLEUS= ^1H
##.ACQUISITION MODE= SIMULTANEOUS (DQD)
##.ACQUISITION SCHEME= undefined
##.AVERAGES= 16
##.DIGITISER RES= 18
##SPECTROMETER/DATA SYSTEM= dpx250
##.PULSE SEQUENCE= zg30
##.SOLVENT NAME= DMSO
##.SHIFT REFERENCE= (INTERNAL, DMSO, 0, 16.522)
##AUDIT TRAIL= $$ (NUMBER, WHEN, WHO, WHERE, WHAT)
$$ ##TITLE= Audit trail, XWIN-NMR		Version 3.5
$$ ##JCAMPDX= 5.01
$$ ##ORIGIN= Bruker BioSpin GmbH
$$ ##OWNER= nmr
$$ C:\u/data/dgb/nmr/ADRS/1300/pdata/1/auditp.txt
$$ ##AUDIT TRAIL=  $$ (NUMBER, WHEN, WHO, WHERE, WHAT)
(   1,<2007-04-12 13:28:06.15 +100>,<MAYBRIDGE\nmr>,<NMR_250MHZ>,
      <created by zg, POWCHK disabled, PULCHK disabled
       configuration hash MD5:
       49 4B E0 1D 92 C2 6B 37 9F E6 65 BC 52 41 86 1D
       data hash MD5: 64K
       37 6D 28 A7 3E F0 E8 AD 66 85 A9 DF 19 5A B9 0A>)
(   2,<2007-04-12 13:28:17.68 +100>,<MAYBRIDGE\nmr>,<NMR_250MHZ>,
      <Start of raw data processing
       ef LB = 0.3 FT_mod = 6 PKNL = 1 SI = 32K 
       data hash MD5: 32K
       DA 94 6B 77 DD 83 5A 33 7C D1 63 3C DB 3B 41 28>)
(   3,<2007-04-12 13:28:19.71 +100>,<MAYBRIDGE\nmr>,<NMR_250MHZ>,
      <apk 
       data hash MD5: 32K
       8D 3C 12 F4 62 5F DE 2F 9E C7 2A D4 06 13 87 14>)
(   4,<2007-04-12 13:28:20.53 +100>,<MAYBRIDGE\nmr>,<NMR_250MHZ>,
      <abs ABSG = 5 
       data hash MD5: 32K
       28 B4 88 3E 14 86 0A 8B BE 6A 9E 6F A9 35 E7 DC>)
$$ ##END=
$$ 
$$ hash MD5
$$ D9 84 BD 6A AE 44 A3 1E 77 2C 2F DE C3 B3 AF EF
##$RELAX= 
##$RELAX= 
##$RELAX= 
##$RELAX= 
##$RELAX= 
##$RELAX= 
##$RELAX= 
$$ Bruker specific parameters
$$ --------------------------
##$DU= <C:\u>
##$EXPNO= 1300
##$NAME= <ADRS>
##$PROCNO= 1
##$TYPE= <nmr>
##$USER= <dgb>
##$AMP= (0..31)
100 100 100 100 100 100 100 100 100 100 100 100 100 100 100 100 100 100 
100 100 100 100 100 100 100 100 100 100 100 100 100 100 
##$AQSEQ= 0
##$AQ_mod= 3
##$AUNM= <au_zg>
##$AUTOPOS= <24 >
##$BF1= 250.13
##$BF2= 250.13
##$BF3= 250.13
##$BF4= 250.13
##$BF5= 500.13
##$BF6= 500.13
##$BF7= 500.13
##$BF8= 500.13
##$BYTORDA= 1
##$CFDGTYP= 0
##$CFRGTYP= 5
##$CHEMSTR= <none>
##$CNST= (0..31)
1 1 145 1 1 1 1 1 1 1 1 1 1 1 1 1 1 1 1 1 1 1 1 1 1 1 1 1 1 1 1 1 
##$CPDPRG= <>
##$CPDPRG1= <>
##$CPDPRG2= <>
##$CPDPRG3= <>
##$CPDPRG4= <mlev>
##$CPDPRG5= <mlev>
##$CPDPRG6= <mlev>
##$CPDPRG7= <mlev>
##$CPDPRG8= <mlev>
##$CPDPRGB= <>
##$CPDPRGT= <>
##$D= (0..31)
0 1 0 0 0 0 0 0 0 0.06 0 0 0 0 0 0 0.0002 0 0 0 0 0 0 0 0 0 0 0 0 0 0 
0 
##$DATE= 1176380885
##$DBL= (0..7)
120 120 120 120 120 120 120 120 
##$DBP= (0..7)
150 150 150 150 150 150 150 150 
##$DBP07= 0
##$DBPNAM0= <>
##$DBPNAM1= <>
$$ [...]
##$SUBNAM7= <"">
##$SUBNAM8= <"">
##$SUBNAM9= <"">
##$SW= 20.6930455092707
##$SWIBOX= (0..15)
0 0 3 0 0 0 0 0 0 0 0 0 0 0 0 0 
##$SW_h= 5175.983436853
##$TD= 65536
##$TD0= 1
##$TE= 683.16
##$TE2= 300
##$TE3= 300
##$TEG= 300
##$TL= (0..7)
0 120 120 120 120 120 120 120 
##$TP= (0..7)
150 150 150 150 150 150 150 150 
##$TP07= 0
##$TPNAME0= <>
##$TPNAME1= <>
##$TPNAME2= <>
##$TPNAME3= <>
##$TPNAME4= <>
##$TPNAME5= <>
##$TPNAME6= <>
##$TPNAME7= <>
##$TPOAL= (0..7)
0.5 0.5 0.5 0.5 0.5 0.5 0.5 0.5 
##$TPOFFS= (0..7)
0 0 0 0 0 0 0 0 
##$TUNHIN= 0
##$TUNHOUT= 0
##$TUNXOUT= 0
##$USERA1= <user>
##$USERA2= <user>
##$USERA3= <user>
##$USERA4= <user>
##$USERA5= <user>
##$V9= 5
##$VALIST= <valist>
##$VCLIST= <CCCCCCCCCCCCCCC>
##$VD= 0
##$VDLIST= <DDDDDDDDDDDDDDD>
##$VPLIST= <PPPPPPPPPPPPPPP>
##$VTLIST= <TTTTTTTTTTTTTTT>
##$WBST= 1024
##$WBSW= 4
##$XGAIN= (0..3)
0 0 0 0 
##$XL= 0
##$YL= 0
##$YMAX_a= 286742
##$YMIN_a= -389311
##$ZGOPTNS= <>
##$ZL1= 120
##$ZL2= 120
##$ZL3= 120
##$ZL4= 120
##$ABSF1= 16.522
##$ABSF2= -4.171173
##$ABSG= 5
##$ABSL= 3
##$ALPHA= 0
##$AQORDER= 0
##$ASSFAC= 0
##$ASSFACI= 0
##$ASSFACX= 0
##$ASSWID= 0
##$AUNMP= <proc_1d>
##$AZFE= 0.1
##$AZFW= 0.1
##$BCFW= 0
##$BC_mod= 0
##$BYTORDP= 0
##$COROFFS= 0
##$CY= 12.5
##$DATMOD= 1
##$DC= 0
##$DFILT= <>
##$DTYPP= 0
##$F1P= 14.0000005364418
##$F2P= -0.99999901652339
##$FCOR= 0.5
##$FTSIZE= 32768
##$FT_mod= 6
##$GAMMA= 0
##$GB= 0
##$INTBC= 1
##$INTSCL= 1
##$ISEN= 128
##$LB= 0.3
##$LEV0= 0
##$LPBIN= 0
##$MAXI= 10000
##$MC2= 0
##$MEAN= 0
##$ME_mod= 0
##$MI= 0
##$NCOEF= 0
##$NC_proc= -5
##$NLEV= 6
##$NOISF1= 0
##$NOISF2= 0
##$NSP= 0
##$NTH_PI= 0
##$NZP= 0
##$OFFSET= 16.522
##$PC= 1
##$PHC0= 199.3808
##$PHC1= 34.13183
##$PH_mod= 1
##$PKNL= yes
##$PPARMOD= 0
##$PSCAL= 4
##$PSIGN= 0
##$REVERSE= no
##$SF= 250.13
##$SI= 32768
##$SIGF1= 0
##$SIGF2= 0
##$SINO= 400
##$SIOLD= 32768
##$SREGLST= <1H.DMSO>
##$SSB= 0
##$STSI= 32768
##$STSR= 0
##$SW_p= 5175.98343685301
##$SYMM= 0
##$S_DEV= 0
##$TDeff= 65536
##$TDoff= 0
##$TI= <Analysis number 999999
Compound Code 99
Book Reference 9
Project Code 9>
##$TILT= no
##$TM1= 0
##$TM2= 0
##$TOPLEV= 0
##$USERP1= <user>
##$USERP2= <user>
##$USERP3= <user>
##$USERP4= <user>
##$USERP5= <user>
##$WDW= 1
##$XDIM= 32768
##$YMAX_p= 380767560
##$YMIN_p= -684904
$$ End of Bruker specific parameters
$$ ---------------------------------
##NTUPLES= NMR SPECTRUM
##VAR_NAME=  FREQUENCY,     SPECTRUM/REAL,   SPECTRUM/IMAG
##SYMBOL=    X,             R,               I
##VAR_TYPE=  INDEPENDENT,   DEPENDENT,       DEPENDENT
##VAR_FORM=  AFFN,          ASDF,            ASDF
##VAR_DIM=   32768,         32768,           32768
##UNITS=     HZ,            ARBITRARY UNITS, ARBITRARY UNITS
##FACTOR=    0.157963299565203, 1,           1
##FIRST=     4132.6476996994, 0,             0
##LAST=      -1043.33573715361, 0,           0
##MIN=       -1043.33573715361, -684904,     0
##MAX=       4132.6476996994, 380767560,     0
$$ Real data points
##PAGE= N=1
##DATA TABLE= (X++(R..R)), XYDATA
$$ [...]
13239B42671K9604P8115L9952K8245M5249J691j9625M9688Q667l2974N2985M7645
13227E71913J4089R857j2420j9440K5056J4855k3703j9125K827j2063K5308L2966
13215F10120K7006J6263M7664J3259n890L9096P690n872J9740O0464j3375P417
13203H23582M0139J4560J7322k1640k6530m898m4548j1063K7071K4254K468n5166
13191G85551p9414k868M8994M9825j4859n8443R918k322k8638p4772k7106j2443
13179E93423k2825j2186j9802j098O87L6390K9613n078l9343m5227j5407o920
13167D92227j181J3615J430l2675k0071k1384m8095l6184J2600l900k8181l3929
13155B94272j7734k1048n3009J4397N0304m8204m5614k1428l4841k1520Q3020
$$ y = [242671, 272275, 350390, 390342, 418587, 463836, 465527, 445902, 495590, 504257, 471283, 524268, 571913, 586002, 595859, 583439, 563999, 589055, 603910, 580207, 561082, 563909, 551846, 577154, 610120, 637126, 653389, 701053, 714312, 708422, 747518, 755208, 749336, 769076, 829540, 816165, 823582, 863721, 878281, 895603, 873963, 847433, 842535, 797987, 786924, 813995, 838249, 840717, 785551, 706137, 703269, 752263, 802088, 787229, 728786, 738704, 736382, 707744, 632972, 605866, 593423, 570598, 558412, 538610, 537512, 538199, 574589, 604202, 599124, 559781, 514554, 499147, 492227, 491046, 504661, 506091, 473416, 453345, 431961, 383866, 347682, 360282, 356382, 328201, 294272, 276538, 255490, 202481, 216878, 267182, 218978, 173364, 151936, 117095, 95575, 178595]
13144A78595L2936J63l9986J3690K8061j3633n9470K0480M7910J3154r6783o2193
13132F2924k9452L8095N3129n9614n3500j7202R1667M4927m7058J3747K769l8246
13120F2186l9300M5740k8208m9162M5704M8560m5349n4768J0424j6448m2523J0376
13108e2768N1133J3120o805j9236J9935k7010k5917J0815L2375K0036o341j1819
13096b482K9162k075k5238l4960n674J8794J2678m7719N3981R6724l662j3067
13084G6462j2837L6977M121j1776m0627j5417k2477k7028k892R5610O3737l4307
13072A09546r743K402J9363M7381M408k571j30K3441r132j4310j0249j6506j4871
13059A29029j8902m0844L1937L3682j8727j2993l1770l2925k9517L4444R8507
$$ y = [178595, 211531, 211694, 171708, 185398, 213459, 199826, 140356, 160836, 208746, 221900, 125117, 62924, 33472, 71567, 124696, 65082, 11582, -5620, 86047, 130974, 83916, 97663, 100432, 62186, 22886, 68626, 40418, -8744, 36960, 85520, 40171, -14597, -4173, -20621, -63144, -52768, -1635, 11485, 4680, -14556, 5379, -21631, -47548, -36733, -4358, 15678, 9337, -2482, 26680, 24605, -633, -35593, -41267, -22473, -9795, -57514, -3533, 93191, 89529, 76462, 63625, 100602, 104723, 92947, 52320, 36903, 14426, -12602, -15494, 80116, 143853, 109546, 99803, 102205, 121568, 168949, 173357, 170786, 170656, 194097, 184965, 170655, 160406, 143900, 129029, 110127, 69283, 101220, 134902, 116175, 103182, 71412, 38487, 8970, 43414, 141921]
13048A41921N8086j276k2540l228K4596k8671j4765L0997L017K4083j9135L3990
13036B27075l648J7889n431J7464m2033k6686k8355L2479M928k2257J0630M7607
13024B29662P218K6832J3455l4322K2949q881Q22N1429M3114L2350J5570J4876
13012D15074O206K3668K037O367P0500R5099N8105M1312O4169O6919J41097J44512
13000A135065J44214J30553J00509P3546n08j2496l496j4319r8395k11810j53081
12989A089782j15109r8357q8242q2935j11510n9603n5758l8799l3661j6680m7372
12978C41756l5172J7074O5748l8638k0819N7346k2079o7498o0812j470N91K7833
12966B63860n2350N385K1916K8636R082K8411o936j21815o7162l6790j6651J7391
$$ y = [141921, 200007, 198731, 176191, 172963, 197559, 168888, 154123, 185120, 188137, 212220, 193085, 227075, 223427, 241316, 235885, 253349, 211316, 184630, 156275, 188754, 193682, 171425, 182055, 229662, 236880, 263712, 277167, 242845, 265794, 256913, 257735, 309164, 352278, 384628, 400198, 415074, 421280, 444948, 446985, 453352, 523852, 618951, 677056, 718368, 782537, 849456, 990553, 1135065, 1279279, 1409832, 1510341, 1583887, 1583379, 1570883, 1567387, 1553068, 1454673, 1242863, 1089782, 974673, 876316, 788074, 705139, 593629, 534026, 478268, 439469, 405808, 389128, 341756, 306584, 323658, 389406, 350768, 329949, 387295, 365216, 297718, 236906, 235436, 236027, 263860, 211510, 216895, 238811, 267447, 276529, 304940, 298004, 176189, 109027, 72237, 55586, 72977]
12954G2977K1356M0897K5956L5597j7719J4754j5899j7484K198J4300K0909m861
12942A92981J5038o8930j9436L3730M4484j9166o5647K60J374M2346j8914j1627
12930A26493J5156K2647l7792q868k282m0883K5356J6388K2016J7355l8317j3529
12918A03740J225J9687K5310J5284M4273p282j07917R798N14k4109j4505o85K0649
12905H5982J9960K2858J0093k3532l225O5670M5601o892l9287o6298l1203J8215
12893I7942l9204k6178k3749K7405L4150L7525p0284j6589M2668L0606m8938P938
12881E3292K9460l54j2854L8600M982L3489L611K0581m7821k2447L6104j8890
12869A17753J0534K4324n435J4739m5132p950M1068l697M736J0879o9707j155
$$ y = [72977, 94333, 135230, 161186, 196783, 179064, 193818, 177919, 160435, 162633, 176933, 197842, 192981, 208019, 139089, 119653, 153383, 197867, 178701, 113054, 113314, 114688, 157034, 138120, 126493, 141649, 164296, 126504, 117636, 115354, 74471, 99827, 116215, 138231, 155586, 117269, 103740, 104965, 124652, 149962, 165246, 209519, 202237, 94320, 104118, 104632, 80523, 66018, 65333, 85982, 105942, 128800, 138893, 115361, 112136, 177806, 223407, 216515, 177228, 110930, 79727, 97942, 58738, 32560, 8811, 36216, 70366, 107891, 37607, 21018, 63686, 94292, 45354, 53292, 82752, 82398, 69544, 108144, 113126, 146615, 150226, 170807, 122986, 100539, 136643, 117753, 128287, 152611, 147176, 161915, 116783, 108833, 149901, 146204, 150940, 161819, 92112, 90957]
12857I0957L1852K68K7960k84m7505l3775L4656n346j6650N5606J8678m9536j4988
12844I1893j5286j6369M1404N0268j3120l3376n4816R634K9598q574K3047J2851
12832A17154m7380k3593n1222k8930R51K3532P1613J0721L734N1016o4919k5104
12820C7573N0863J6514l0749P141k35o648N812J9875k4872o8054k6258M7587K9227
12807E7776K7034M0164P463k7999k8036l4446k4452q36K2055p51j7190j5999k3267
12794a8484K6360O7210N4893O0147k6139l4268m8967K2773M7715j8179m3405n775
12782H3881k4954P889M1156K2576K902r5250j1107K5907L6768M1454O4774j021
12770A94975J2060K3738q557k4420m8667m1659m9028K4029K578m3263p801J3263
$$ y = [90957, 122809, 123077, 151037, 150753, 103248, 69473, 104129, 98783, 82133, 137739, 156417, 106881, 91893, 76607, 60238, 101642, 151910, 138790, 105414, 50598, 60232, 89830, 81256, 104303, 117154, 69774, 46181, -5041, -33971, -33020, -9488, 62125, 72846, 76580, 127596, 62677, 37573, 88436, 104950, 74201, 81342, 81107, 74459, 80271, 100146, 75274, 7220, -19038, 28549, 57776, 84810, 124974, 132437, 104438, 76402, 41956, 17504, 16668, 38723, 37972, 20782, 4783, -18484, 7876, 75086, 129979, 190126, 163987, 129719, 80752, 103525, 151240, 133061, 89656, 83881, 58927, 66816, 107972, 130548, 133450, 38200, 27093, 53000, 89768, 131222, 195996, 194975, 207035, 230773, 222216, 197796, 149129, 107470, 58442, 82471, 85049, 41786, 33985, 47248]
12758D7248m042r909J4908o765j6970l1696L2302N0378N2416j9563m644l010k0365
12745H0288K6236k64K4714K4664Q973k8647K5966l9035m8047j4629M3257L1408
12733A34884j2226k2830K4724K5939J3068O102r250o551J81r90L5546K4325Q14
12720B13736k0983k5240k8212k0320n250L8588L3443q9770M3532O771m4475l7655
12708F4165L9598L2625k5667l0773P324N4211J9019l3610j3028P039j441K9784
12696A49246k5485J332L7886J4684l1531j0541J3238K3858L9060k1261n8305p2338
12684E9843L0292O3822j9522k6347m3318L563j7805j054J6442L3316P6084J2193
12672A87509l2133r20K5161N7750n6711p2178N8885L869p5242K7740K9652J1778
$$ y = [47248, 43206, 33297, 48205, 41440, 24470, -7226, 25076, 75454, 127870, 108307, 103663, 100653, 80288, 106524, 106260, 130974, 155638, 164611, 135964, 161930, 122895, 74848, 60219, 103476, 134884, 122658, 99828, 124552, 150491, 163559, 169661, 160411, 153860, 154041, 153051, 188597, 212922, 213736, 192753, 167513, 139301, 118981, 113731, 152319, 185762, 95992, 139524, 146295, 101820, 64165, 103763, 136388, 110721, 79948, 87272, 141483, 160502, 126892, 113864, 120903, 119462, 149246, 123761, 125093, 162979, 177663, 146132, 135591, 148829, 172687, 211747, 190486, 132181, 59843, 90135, 153957, 134435, 108088, 64770, 68333, 50528, 49474, 65916, 99232, 175316, 187509, 155376, 154456, 179617, 237367, 180656, 108478, 167363, 171232, 95990, 123730, 153382, 165160]
12660A65160m4570l5153m512L1371O8653M9513n5052n2719l1557O8774M2548K5789
12648B28245j1631l0595o9494j4247M5308j1504N716j7061K101k6334j6958k316
12636H1230o077K7031L0126m7604R264M6853J7461n286j2077J0239J2248l5117
12624A28291L1788Q2349N926l930l5389m1051k689l558o208p3117J0723O4741
12612A57876N4499J6964n8714q7134k5181O4039L6287j3967J2792L5386L6736
12601B29583j3106l2116j3034L8764k248k2218K727M670O639M2881K553k2843
12589B22252k443K2282m0275k0652Q7293K4870l8017R372j7376l0664l1694l4913
12577A50035k9607K8506O4857N9102m3663J4465R914l1936J2866P6095J1457K2880
$$ y = [165160, 120590, 85437, 80925, 112296, 180949, 230462, 175410, 122691, 91134, 159908, 202456, 228245, 216614, 186019, 116525, 102278, 147586, 136082, 141798, 124737, 126838, 100504, 83546, 81230, 75153, 102184, 132310, 84706, 93970, 140823, 158284, 152998, 140921, 151160, 163408, 128291, 160079, 242428, 248354, 244424, 209035, 167984, 165295, 161737, 155529, 82412, 93135, 157876, 212375, 229339, 170625, 83491, 58310, 122349, 158636, 144669, 157461, 192847, 229583, 216477, 184361, 171327, 210091, 207843, 185625, 188352, 193022, 199661, 242542, 245095, 222252, 219809, 242091, 201816, 181164, 268457, 293327, 255310, 264682, 247306, 216642, 184948, 150035, 120428, 148934, 213791, 272893, 229230, 243695, 253609, 221673, 234539, 310634, 322091, 344971]
12565C44971k1995J6371n018l1432m7192n5436k1437J169J6260k1615K1851j681
12553A94816J2138J17191J0738N223K8402j8667k7707l9442l8607m0776J8569
12542B21878K1553L3603M0072N3499L0318n7738j6100k4760J5121j385J1157M2201
12530C69419L432l0587L6848j3484J2554l6343l7006L586N2459N921l4418j7969
12518C14412q030J2543M8495k6223r480k6231K3359Q069m401j8502J7170J7371
12506C48552M274j4607K7014r617L505m3076j9755j5887k9662n576J922j3702
12494B33385L3249Q906N2529M5053L1708l3177R903j9194l4884N4867K1288m5023
12482C58610q8238n9857Q457N8318J6416M7052M2234P0318m1145m7973m3547k8980
$$ y = [344971, 322976, 339347, 334329, 302897, 255705, 200269, 178832, 180001, 196261, 174646, 196497, 194816, 206954, 324145, 334883, 340106, 368508, 349841, 322134, 282692, 244085, 203309, 221878, 243431, 277034, 317106, 370605, 400923, 343185, 327085, 302325, 317446, 316061, 327218, 369419, 372851, 342264, 379112, 365628, 378182, 341839, 304833, 308419, 360878, 366799, 332381, 314412, 306382, 318925, 367420, 341197, 331717, 305486, 328845, 336914, 332513, 314011, 331181, 348552, 352826, 338219, 365233, 355616, 359121, 316045, 296290, 280403, 250741, 245165, 247087, 233385, 266634, 275540, 328069, 373122, 404830, 371653, 381556, 362362, 327478, 382345, 403633, 358610, 270372, 210515, 218972, 277290, 293706, 340758, 382992, 453310, 412165, 364192, 320645, 291665]
12470B91665J7613M444l539O8212L4958j9180l8367k2174n632N985l3433L4244
12458C34796J6360J5465L8362L3784N523L0174o7290j5429L3619j4661l9597J0681
12446C81787J2275K3442M3553l0706k0829K1956m0323j8520L6113k3350k2919
12435C62479M1447k0861l9881q549P880J00650J9952O2268o302j8904J4948j2619
12423E02508l8913m4172l47J0900K8938M6232M8614L6767p3588o1399J6900N1569
12411E24009j8686p2248k4714L3929M2716N8649l0621p2940o8176m798M8414J2253
12399D27787K4420k4032M3890L0933J6352J1395K0643j6466K5046M514J8859k8693
12387E54648j7060O6344K0927k1729L6525K352J8549j867M21L5870j0498l8394
$$ y = [291665, 309278, 313722, 310183, 378395, 413353, 394173, 355806, 333632, 328000, 333985, 300552, 334796, 351156, 366621, 404983, 438767, 444290, 474464, 407174, 391745, 425364, 410703, 371106, 381787, 394062, 417504, 461057, 430351, 409522, 431478, 391155, 372635, 408748, 385398, 362479, 403926, 383065, 343184, 334635, 342515, 443165, 463117, 525385, 519083, 500179, 515127, 502508, 463595, 419423, 419076, 429976, 458914, 505146, 553760, 590527, 516939, 455540, 472440, 524009, 505323, 433075, 408361, 442290, 485006, 543655, 513034, 440094, 371918, 367120, 415534, 427787, 452207, 428175, 472065, 502998, 519350, 530745, 551388, 534922, 559968, 564482, 583341, 554648, 537588, 603932, 624859, 603130, 639655, 642007, 660556, 658689, 659110, 694980, 684482, 646088]
12375F46088o9809K0054M5862K0317L0981j4211r5454r493L6355j5080l5499K7892
12363E88003r956J2970P0394M4066l5823j1946k5456q254K1533r367J7494M4300
12351F97958M3537L2254j0852k0158l6930m5584j0630l9144l4699K1503P466K9281
12339F34002P4191K5722j5040j7309J1118l3276j490K2270j5252l6073J9982l62
12327F68483R344k772n3075M3996m6070r056O9579L8395K4483N1655l1303L298
12315G66957N5609K3265j9642j0578k2127Q866j3454L3511K0722j6352l5555k0501
12303G70721N792N570M8166K8754j8747K2621K5222q457l9137n1086Q822P1827
12291H70068K8254K2899k2881k0855P121M3004l8762o8722O1029q274j4895M9331
$$ y = [646088, 576279, 596333, 642195, 662512, 693493, 679282, 583828, 574335, 610690, 595610, 560111, 588003, 578047, 591017, 661411, 705477, 669654, 657708, 632252, 623998, 645531, 636164, 653658, 697958, 741495, 773749, 762897, 742739, 705809, 660225, 649595, 610451, 575752, 597255, 604721, 634002, 708193, 733915, 718875, 701566, 712684, 679408, 677918, 700188, 684936, 648863, 668845, 668483, 677827, 675055, 621980, 665976, 619906, 610850, 680429, 718824, 743307, 794962, 763659, 766957, 822566, 845831, 826189, 815611, 793484, 802350, 788896, 822407, 843129, 826777, 791222, 770721, 776513, 782083, 830249, 859003, 840256, 862877, 888099, 879642, 840505, 789419, 798241, 870068, 898322, 921221, 898340, 877485, 884606, 927610, 888848, 820126, 881155, 872881, 857986, 907317]
12279I07317J9631L4180l9171R253j1945n1893m963j1704J5959j3380k5531O833
12267H34586P3575P2414o045L1935l7258m5491j7798N073K393R372M5796L1397
12255I99949J5460L0192j6720j9098k067k629N954n08m5408K9822N4649l0663
12243A018933O1336K8128l6165n260m5416k6456N8588j0827l893J9455P6417N3671
12231A188511J2081m6432l7013J898K4064k726Q776l83K4922k0639J7591L0051
12219A200701k5637k904N0K7811J50L7026K7157J272k8420N7494N4594k3626k9354
12206A296314j7506M3391Q484j1934P226J7915J5226p090k4641M600J1992J232
12194A345209j7143L9457l2370p913L8022L910l83o137j5117k2070P3307J5715
$$ y = [907317, 926948, 961128, 921957, 931210, 919265, 867372, 862409, 850705, 866664, 853284, 827753, 834586, 908161, 980575, 974530, 1006465, 969207, 923716, 905918, 910991, 913384, 922756, 968552, 999949, 1015409, 1045601, 1028881, 1009783, 1007716, 1005087, 1011041, 1010533, 965125, 994947, 1049596, 1018933, 1080269, 1108397, 1072232, 1066972, 1021556, 995100, 1053688, 1042861, 1038968, 1058423, 1134840, 1188511, 1200592, 1154160, 1117147, 1119045, 1143109, 1140383, 1149159, 1148776, 1173698, 1153059, 1170650, 1200701, 1175064, 1172160, 1172210, 1200021, 1200171, 1237197, 1264354, 1265626, 1237206, 1294700, 1349294, 1325668, 1296314, 1278808, 1322199, 1330683, 1318749, 1325975, 1343890, 1359116, 1352026, 1327385, 1331985, 1343977, 1345209, 1328066, 1367523, 1335153, 1327240, 1365262, 1369172, 1368789, 1362652, 1347535, 1325465, 1398772, 1414487]
12182A414487P976J8682m4708m3501L1906K4811O445K4575L1759Q682P230j3936
12170A474408l1739J5986J1553p427L3837J5084J1333K8446k115k7743O5840K7435
12158A614898j5671k4692k1202j680L2231O03R713N7518j4677J071k6481k6633
12146A584998r524K7107L7960N22j4997M3867p752J9842L0881K5533J1174n534
12134A744077L305j3092L6649P2354j979K113L2487K88j632o55m8594j0484N4689
12121A869526k1246r2959o1515M9943L4523K0445N0301M9963K883o655L8746j045
12109A932910K5041L4393j47j3016j5111O8159Q3310j0743n6429m6253J4518m9557
12097A967075N3929N4989L4760J2992J7439J3710J8713M3503K2748J4785o7721
$$ y = [1414487, 1422463, 1441145, 1396437, 1352936, 1384842, 1409653, 1416098, 1440673, 1472432, 1481114, 1488344, 1474408, 1442669, 1458655, 1470208, 1462781, 1496618, 1511702, 1523035, 1551481, 1549366, 1521623, 1587463, 1614898, 1599227, 1574535, 1553333, 1551653, 1583884, 1584487, 1594200, 1651718, 1637041, 1638112, 1611631, 1584998, 1575474, 1602581, 1640541, 1641063, 1626066, 1669933, 1662181, 1682023, 1712904, 1738437, 1749611, 1744077, 1747382, 1734290, 1770939, 1843293, 1841314, 1843427, 1875914, 1876202, 1874570, 1873915, 1825321, 1814837, 1869526, 1848280, 1755321, 1693806, 1743749, 1778272, 1798717, 1849018, 1898981, 1901864, 1895209, 1933955, 1932910, 1957951, 1992344, 1992197, 1979181, 1964070, 2032229, 2115539, 2104796, 2048367, 2002114, 2016632, 1967075, 2021004, 2075993, 2110753, 2123745, 2141184, 2154894, 2173607, 2217110, 2239858, 2254643, 2186922]
12086B186922k1357K5212M232j7431L2078J778j6662l584K3930O6452P1782j93
12074B353159m591o6885k6711J4071O929J9043K3819K2268J6681K7718R319J2571
12062B407391k6503m7710L1745L1645J9872l5960j2200l3281K3158p236l6349
12051B314572J04484O7849J5306K5287k1151l4758P308Q6692L4635N0544M4776
12040B695544o5137m6272K4216k9361j7191k014J4740L3444l400n588J1372J9582
12028B629935p430M4674k3347L0766m6198L2639N6083J7530k6327R013j2221k015
12016B703102J7716L0644m87J3972j1481j8151K0367J4369j0509m14J8803R897
12004B787828j1339K4623j5440J8889k9279K262j5603j2472O0525K2060k2801
$$ y = [2186922, 2165565, 2190777, 2195009, 2177578, 2209656, 2211434, 2194772, 2191188, 2215118, 2281570, 2353352, 2353159, 2348568, 2281683, 2254972, 2269043, 2275972, 2295015, 2318834, 2341102, 2357783, 2385501, 2394820, 2407391, 2380888, 2333178, 2364923, 2396568, 2416440, 2380480, 2368280, 2334999, 2358157, 2350921, 2314572, 2419056, 2486905, 2502211, 2527498, 2506347, 2471589, 2478897, 2565589, 2600224, 2650768, 2695544, 2630407, 2584135, 2608351, 2578990, 2561799, 2559785, 2574525, 2607969, 2604569, 2598981, 2610353, 2629935, 2622505, 2667179, 2643832, 2674598, 2628400, 2661039, 2717122, 2734652, 2708325, 2717338, 2705117, 2703102, 2720818, 2751462, 2750975, 2764947, 2753466, 2735315, 2755682, 2770051, 2759542, 2759128, 2777931, 2787828, 2776489, 2801112, 2785672, 2804561, 2775282, 2777544, 2761941, 2749469, 2809994, 2832054, 2809253]
11993B809253l6657L3711N0493L6655r56p068k1826K410J6503M5679N091m6824
11981B886464P366k0009K0491n6387m981L4031K4754l575l6329q662m6571J7057
11969B813649O4982K0745k0716J810k6639j8856Q501J3545k5535L2013O2130L8560
11957B964189k7660k1069k766l7622N1497j5497k7738K7092j9727m414k0378L7773
11945B903680L1482k7396l7562l1948l8820L7210M2584K0444o994k1283L9680
11934B911077M5317k0570j1462L2030J7707m9464O020L1936n019j4779j0145N408
11922B938056m074j0181n4482J7906m939M9853Q530n4187j5390o8918j1664j9102
11910B771408L8328M345M6680K6592k8600n7605J9744K9211n0886r094L6804N443
$$ y = [2809253, 2772596, 2806307, 2856800, 2893455, 2892499, 2885431, 2863605, 2866015, 2882518, 2928197, 2933288, 2886464, 2893830, 2873821, 2894312, 2837925, 2832944, 2866975, 2891729, 2888154, 2851825, 2843163, 2796592, 2813649, 2878631, 2899376, 2878660, 2880470, 2853831, 2834975, 2843476, 2857021, 2831486, 2863499, 2925629, 2964189, 2936529, 2915460, 2912694, 2875072, 2926569, 2911072, 2883334, 2910426, 2890699, 2886285, 2865907, 2903680, 2935162, 2907766, 2870204, 2838256, 2799436, 2836646, 2879230, 2899674, 2892680, 2871397, 2911077, 2956394, 2935824, 2924362, 2956392, 2974099, 2924635, 2930655, 2962591, 2957572, 2942793, 2932648, 2938056, 2933982, 2923801, 2869319, 2887225, 2882286, 2932139, 2940669, 2886482, 2871092, 2802174, 2790510, 2771408, 2809736, 2814081, 2860761, 2887353, 2858753, 2801148, 2820892, 2850103, 2799217, 2790123, 2826927, 2832370]
11898B832370K7893l1053l641M379k8740k0139j0349m7647m7143J1281K7181J4863
11886B729255j1792p3733o691K6504J9680J7087n4128Q294k6215j0393p1212K3187
11874B569843M7545j8556m3212J693j0775Q70J7019J8063K1523n326n2782l1753
11862B514152o117k9014j7821L6129K3723o4817l1331j2651l4610K0831O9147
11851B467621L311l4585m8234k8286K2236O9500L592k4989m6121K7970l1577k4268
11839B356170k4058k4778L7025l9133o7965m3695m9344l0244K1520K2488K9097
11828B187083L6907J2135m6353L650K4735k5321q650O873n9091L010j1006l6465
11816B087507l8731k7531J2058M129L0373M1285o0128k3072J6867P436J9761N5826
$$ y = [2832370, 2860263, 2829210, 2825569, 2829948, 2801208, 2781069, 2770720, 2723073, 2675930, 2687211, 2714392, 2729255, 2717463, 2643730, 2637039, 2663543, 2683223, 2700310, 2646182, 2654476, 2628261, 2617868, 2546656, 2569843, 2617388, 2598832, 2555620, 2557313, 2546538, 2547408, 2564427, 2582490, 2604013, 2598687, 2545905, 2514152, 2508035, 2479021, 2461200, 2497329, 2521052, 2456235, 2424904, 2412253, 2377643, 2398474, 2467621, 2470932, 2436347, 2388113, 2359827, 2382063, 2451563, 2455155, 2430166, 2384045, 2412015, 2380438, 2356170, 2332112, 2307334, 2344359, 2305226, 2237261, 2193566, 2144222, 2113978, 2135498, 2157986, 2187083, 2223990, 2236125, 2189772, 2193422, 2218157, 2192836, 2184186, 2191059, 2131968, 2134978, 2123972, 2087507, 2048776, 2021245, 2033303, 2037432, 2067805, 2109090, 2048962, 2025890, 2042757, 2050193, 2069954, 2125780]
11804B125780j1819j5234q7586o5175p1647k4746M0847J0311M0993K3963q042
11793A957645j5567L7094O3464n6770j6789k0671l5818k1528n388M686k5959j8074
11781A846325M5867j7845n0523j9883r181N1148N809J075n3705p1209Q752L1124
11769A767754J395o7896r4729K054J3715M9716o800j0017p416j6451P880r938
11757A629267k0487N737n5708p7746p181k4851K1774N3802l2798o2306J4851J5671
11745A460025m626L2100R217l6068k2485l3377j2081r454k8067K8099L8077m4899
11733A376461j9929n748L0562M4536L4413K7770m4507n0879J013J2976n9593k3754
11721A323321l2653k0603L7642k0617K1243P1391L2034k6949o9107n1685J4047
$$ y = [2125780, 2113961, 2098727, 2011141, 1945966, 1874319, 1849573, 1890420, 1900731, 1941724, 1965687, 1957645, 1942078, 1979172, 2042636, 1985866, 1969077, 1948406, 1912588, 1891060, 1885672, 1890358, 1864399, 1846325, 1892192, 1874347, 1823824, 1803941, 1794760, 1845908, 1851717, 1852792, 1799087, 1727878, 1736630, 1767754, 1769149, 1701253, 1606524, 1608578, 1622293, 1672009, 1665209, 1655192, 1647776, 1631325, 1639205, 1629267, 1608780, 1614517, 1558809, 1481063, 1473882, 1449031, 1470805, 1524607, 1491809, 1429503, 1444354, 1460025, 1455399, 1487499, 1496716, 1460648, 1438163, 1404786, 1392705, 1383251, 1355184, 1383283, 1421360, 1376461, 1356532, 1350784, 1381346, 1425882, 1460295, 1488065, 1443558, 1392679, 1393692, 1406668, 1347075, 1323321, 1290668, 1270065, 1307707, 1287090, 1308333, 1379724, 1411758, 1384809, 1315702, 1264017, 1278064]
11710A278064L096p6877J7098L9726j7600m3102o567m2288n2419J2150L3901L8341
11698A183523J189L517K4691l0789l2940L4683j5224l1813j9962J7578j5635k2211
11686A096607o4827O567M5455j480K9745q946R4250L4825p6423k1963l0810m4280
11674A058720j1618K2755Q057j8411q035n3563l8159K579n021J7573N934k0319
11662I60492k1532L7338j0429m5128m0281L2546J439M881J535j4308L6146Q4651
11650A027350q996o8044L114N0249l3553j2287k3375k8672p012o4753J1092J5585
11638H60698l6761J7751l2109J7705j097l7097l0208J6064j7517l125L1936J4757
11626H00997k5K1839m9596l3392M901J3442J864p425k7016k5943l9040j3360O4089
$$ y = [1278064, 1281160, 1204283, 1221381, 1261107, 1243507, 1200405, 1193838, 1151550, 1099131, 1111281, 1145182, 1183523, 1184712, 1188229, 1212920, 1182131, 1149191, 1183874, 1168650, 1136837, 1116875, 1134453, 1118818, 1096607, 1031780, 1038347, 1083802, 1082322, 1112067, 1103121, 1197371, 1232196, 1155773, 1133810, 1103000, 1058720, 1047102, 1069857, 1077914, 1059503, 1051468, 997905, 959746, 962325, 957304, 974877, 980811, 960492, 938960, 976298, 965869, 920741, 880460, 913006, 914445, 919326, 920861, 906553, 942699, 1027350, 1018354, 950310, 953424, 1003673, 970120, 957833, 934458, 905786, 898774, 834021, 845113, 860698, 823937, 841688, 809579, 827284, 826187, 789090, 758882, 774946, 757429, 754304, 786240, 800997, 800972, 822811, 773215, 739823, 744724, 758166, 760030, 752605, 725589, 699646, 660606, 647246, 711335]
11613G11335M0536m2188L0226O036J4844K5661j4171m5205m2296o7365L792K3723
11601F44928K7954K4614K4104n5633q2216o0928M3013L9250k896j8708K4788O5042
11589F73312l0450j1339r611J7636k1820N3535K3670p849r670n6267k5302j4381
11577E81464K9707l745j5588l5222K8720K8716k9367l3969L317j6522j8543K0752
11565E39720K4176n2503n5726j8310j4039K9338O0349M4457m007l0483j9348n166
11553D98458j7648n6745J8763L6493p979J0391O4821k9983K2404O1796n8213m2891
11541D99667L5125l2383K6011J5447j4909k2895M3600J647l5411l5895m5380k3899
11529D10725O2245M9570N385n3351n2882r409P2886k1349r218j585Q640J3031
$$ y = [711335, 751871, 709683, 739909, 745945, 760789, 786450, 772279, 727074, 684778, 617413, 621205, 644928, 672882, 697496, 721600, 665967, 583751, 522823, 565836, 605086, 602190, 583482, 608270, 673312, 642862, 631523, 621912, 639548, 617728, 671263, 694933, 687084, 677414, 621147, 595845, 581464, 611171, 607426, 591838, 556616, 585336, 614052, 584685, 550716, 554033, 537511, 518968, 539720, 563896, 511393, 455667, 437357, 423318, 452656, 513005, 557462, 553455, 522972, 503624, 498458, 480810, 424065, 442828, 479321, 471342, 481733, 546554, 516571, 538975, 600771, 542558, 499667, 534792, 502409, 528420, 543867, 528958, 506063, 549663, 551310, 515899, 480004, 434624, 410725, 472970, 522540, 527925, 474574, 421692, 412283, 485169, 463820, 454602, 453017, 461657, 474688]
11517D74688p2630m9488K8736K6448J6245k1041J2278r949K6565J8554n8410L998
11505C95994O59K9551J1635k5696m5320l0011K1401L3364O967j5653L0293J0316
11493D23500m161k5566l218k1011j5421M4404P065J5474m8108j3906L8105L4823
11481D31980J5238J928k0134p2763j7796L8327j3059n169j7368j6644j1507K7788
11469C40821M3575j6429J0097j5675q291L4618J8691n447l3128J9466J1059n8101
11457C41256o7836k5337N688M9633l1121l1515K5309k1765j4447M6974M937K378
11445B84154o967L1626p134p3931j3754M6871K2654J7366K7287L951N52k2666
11433C10009p67r318n0176L6017O2825k157l7809p0964k4891M4634L1566J0795
$$ y = [474688, 402058, 352570, 381306, 407754, 423999, 402958, 415236, 405287, 431852, 450406, 391996, 395994, 396653, 426204, 437839, 412143, 366823, 336812, 358213, 391577, 398544, 382891, 413184, 423500, 419339, 393773, 390555, 369544, 354123, 398527, 405592, 421066, 372958, 359052, 397157, 431980, 447218, 449146, 429012, 356249, 338453, 376780, 363721, 358552, 341184, 324540, 313033, 340821, 384396, 367967, 378064, 362389, 354098, 388716, 407407, 401960, 368832, 388298, 399357, 341256, 273420, 248083, 253771, 303404, 272283, 240768, 266077, 244312, 229865, 276839, 281776, 284154, 277187, 308813, 301679, 227748, 213994, 260865, 283519, 300885, 328172, 332123, 332675, 310009, 309242, 299924, 249748, 285765, 348590, 346433, 308624, 237660, 212769, 257403, 288969, 299764]
11421B99764n3905k1791L9042Q7655K7539k9448j4577J1177q407k7868j6872k5599
11409B66710m1314J1128j3127N4305J8573j4702O48m0973n2186l0531J9050k3685
11397A53896l2992O0825m531l8801l7275K1679O7355j4239N1523L8283l1407j8138
11385B16178K7751J1121m0707M0043M3382k0770p1020p4193K9063N1444L4574
11374B46866q000l045j42J6554R844l682J3023K0981j3723k4253p6048q637K1424
11361A91162R701K6943M813j3154Q760n2752l6520M1252J0323K8353J8224m6506
11349A90599l247l9704l1782N4846k350k8157m1162L3794K126m6402M9968L2400
11337A70929L7149j5951n0090J9180q84j3063l9118N39k0258k3452n6399k6112
$$ y = [299764, 245859, 224068, 263110, 350765, 378304, 348856, 334279, 345456, 337049, 309181, 292309, 266710, 225396, 236524, 223397, 277702, 296275, 281573, 282221, 241248, 189062, 158531, 177581, 153896, 120904, 181729, 177198, 138397, 101122, 122801, 190156, 175917, 227440, 265723, 234316, 216178, 243929, 255050, 214343, 254386, 297768, 276998, 205978, 131785, 160848, 212292, 246866, 238866, 235821, 235679, 252233, 262077, 258395, 271418, 292399, 278676, 254423, 178375, 169738, 191162, 200863, 227806, 232619, 219465, 228225, 175473, 138953, 180205, 190528, 218881, 237105, 190599, 187352, 147648, 115866, 170712, 168362, 140205, 99043, 132837, 134963, 88561, 138529, 170929, 208078, 192127, 142037, 161217, 160333, 147270, 108152, 108691, 88433, 64981, 8582, -17530]
11325a7530N1973J3982M1606K2535P297j0593K0525O7093J5426o300m0387k1760
11313A43867j7387j4756j1291j3965K626M2618n54p697o7743k0326P881K2856
11301F6129M6564l1409l0725Q44r044J2559l8759M0635K1384l0546L4384J333
11289H3349k0359m1880k8334O2717N6212K3765p0407j3159k66L1789k0875m632
11277E7920J7181m409P058m9099J9556L3775K3985j5507q757J820K4304P643q018
11264A07452k2659L9765L670j1601L8894n5506m3392O249K5251k1740l9992P9516
11252A05907L244m9309l2025J8472J7672M016K2070M598r860j9942l1553n6882
11240b3592J0262K4150K7385K5281J7354l0997k5969M7730j0915k0493m5543m99
$$ y = [-17530, 34443, 48425, 90031, 112566, 119863, 109270, 129795, 196888, 212314, 206014, 165627, 143867, 126480, 111724, 100433, 86468, 89094, 131712, 131158, 123461, 55718, 35392, 43273, 66129, 112693, 81284, 50559, 51403, 42359, 54918, 16159, 56794, 78178, 47632, 82016, 83349, 62990, 21110, -7224, 55493, 111705, 135470, 65063, 51904, 51638, 83427, 62552, 57920, 75101, 70692, 77750, 28651, 48207, 81982, 105967, 90460, 81703, 83523, 107827, 115470, 107452, 84793, 124558, 128228, 116627, 155521, 100015, 56623, 62872, 88123, 66383, 26391, 105907, 109151, 59842, 27817, 46289, 63961, 67977, 90047, 94645, 84785, 64843, 33290, -23592, -13330, 10820, 38205, 63486, 80840, 49843, 23874, 71604, 60689, 40196, -5347, -5846]
11228e846L0675P821P2989j5682p36J3802J9000j0958n4849m303M9070N6476k7079
11215A30380o1520K9296j9695k5527k4848j40J2251k2003l6994M083L6798J5290
11203C7371m2256N6494M2260P998l3837k782l5386k2011L0033p731n1345m3677
11191f4869j3987N2906L2941K1008J2491K5210K7121L4399J1531r1776k7668K9994
11179D9301O0071K974n1252l5532k0580K7326M8884K0197K261j5241p508O59K8354
11166A09914J1591Q812m0834l5836L839M406M5837l5511k5152L3256N866J7319
11154A03507K0542k0803j702m179M7326l5708n7140L1551R53m0382K3326K9369
11142I6660l7244m9505r743N6455L603k9139r558j8898j6109l7379o576J119N0333
$$ y = [-5846, 24829, 32650, 105639, 89957, 89221, 103023, 122023, 111065, 56216, 51913, 100983, 157459, 130380, 68860, 98156, 78461, 52934, 28086, 27946, 40197, 18194, -18800, -14717, 22081, 37371, -4885, 51609, 93869, 101867, 68030, 65248, 29862, 7851, 37884, 30153, -21192, -64869, -78856, -25950, 6991, 27999, 40490, 65700, 92821, 127220, 138751, 46975, 19307, 49301, 109372, 112346, 61094, 25562, 4982, 32308, 81192, 101389, 103650, 88409, 80901, 81560, 109914, 121505, 130317, 89483, 53647, 57486, 61892, 107729, 72218, 47066, 80322, 86188, 103507, 124049, 103246, 101544, 97365, 144691, 108983, 51843, 83394, 84347, 43965, 67291, 96660, 59416, 9911, 168, 56623, 60226, 31087, 21529, 2631, -13478, -50857, -57433, -56314, -5981]
11129e981k386r945P2353K0930Q439r884l7728j936k9935K0608J3771j3187r502
11116A5617m963k5141O138M9200L6656N4832L4577k7667m1189K1315L0117k5343
11104A24149j9168N0336N9039K3802m826M5423R3992L9680P9311R0720J8692L7385
11092F38535k717k8921o1282r2686o7531o2077k4639m5497n2166m3154o626o490
11080A44749l6487l3270j8396J5669N5200N3428K6252j4082j6331L789R059J6646
11068B06226K7110L7971J9104J874J5753n2816j2910K6919P8869M4386Q289L9667
11056D40442K5312j3868L2856M5329R0236P8584R8600J21416N1459p978K7612
11045I90000K6224o9665m1576n2470O450L2147k1785m5557l4276l9927r1773k0458
$$ y = [-5981, -8367, -18312, 54041, 74971, 83410, 73526, 35798, 33862, 3927, 24535, 38306, 25119, 15617, 10654, -14487, -8349, 40851, 77507, 132339, 166916, 139249, 98060, 119375, 149492, 124149, 104981, 155317, 214356, 238158, 233332, 278755, 372747, 412427, 491738, 582458, 601150, 638535, 635818, 606897, 545615, 452929, 385398, 323321, 298682, 253185, 201019, 157865, 151239, 144749, 108262, 74992, 56596, 72265, 127465, 180893, 207145, 193063, 176732, 180521, 189580, 206226, 233336, 271307, 290411, 292285, 308038, 255222, 242312, 269231, 348100, 392486, 400775, 440442, 465754, 451886, 484742, 530071, 620307, 698891, 797491, 918907, 970366, 962388, 990000, 1016224, 946559, 904983, 852513, 858963, 891110, 869325, 823768, 789492, 749565, 657792, 637334]
11033F37334K0182l8593R98m5286j5447R963l6881L0444M1948K487K0189l774
11021F23564m5450N5243L0441j4130m0615l5894M3398K803q1374k1620M7689j0004
11009E54051k4672M1935m7786q3744M1499K9831N5936O7827Q0809N7520J5205
10998G88411K980j1375L772J8009n9954j10805n4478n3516l3826m8565o5567J334
10986C76420K415j150K2892n8420p3270J530M3369J8991j0373k4716j5788O2816
10974C44716n676m2454l6956l6195J3519J043p3992J0306K5198L8205J1733q201
10962B41246j7886k3508o247M3309p338J4347M6061L7655J2670l4232m0072l4283
10950B31722o630j3862O6539j222k6960j3822l1471j2696N357O2169J1075p045
$$ y = [637334, 657516, 618923, 619921, 574635, 559188, 569151, 532270, 562714, 604662, 607149, 627338, 623564, 578114, 633357, 663798, 649668, 609053, 573159, 616557, 619360, 537986, 516366, 564055, 554051, 529379, 571314, 523528, 439784, 481283, 511114, 567050, 634877, 715686, 773206, 788411, 791391, 780016, 783788, 801797, 741843, 631038, 576560, 523044, 489218, 440653, 375086, 376420, 378835, 377685, 400577, 342157, 268887, 270417, 313786, 332777, 322404, 297688, 281900, 344716, 339040, 296586, 259630, 223435, 236954, 237997, 164005, 174311, 199509, 237714, 249447, 241246, 223360, 199852, 193605, 236914, 229576, 243923, 289984, 327639, 340309, 306077, 266005, 231722, 225092, 211230, 277769, 276547, 249587, 235765, 204294, 191598, 196955, 259124, 270199, 263154]
10938B63154L1381L309n5533m079K5605L1661J279m0438J1255M9912l636j2742
10926C01128k5496k8457k5066J9267J9790K2641J3590J7633l1787m718N554N500
10914B89579o8974k5932j0009N4639J7438l340M750L2235l1166j2888M9175M5367
10902C40874k937l7668m9123Q65O6638l3190m4792j2740o9470R846O1522n779
10890B24046P19J4883K5502l0012m0578J5491P8070l5296k684K0008k6774j7747
10878B25628M9038L9858J3407M5772o0017l7091M5023N721k311k6152M8192R482
10866C56550j4428p265M2054N4540M1824J7960M734J2304m3228J444J3016l0999
10854D48506k3039N9250L438j2261j2301m529J8920J228L4300R3234J2849j3450
$$ y = [263154, 294535, 297844, 242311, 238232, 263837, 295498, 296777, 256339, 267594, 317506, 313870, 301128, 275632, 247175, 222109, 241376, 261166, 283807, 297397, 315030, 283243, 278525, 284079, 289579, 220605, 194673, 184664, 239303, 256741, 253401, 258151, 290386, 259220, 246332, 295507, 340874, 337937, 300269, 251146, 252011, 318649, 285459, 240667, 227927, 158457, 168303, 229825, 224046, 224765, 239648, 265150, 235138, 194560, 210051, 288121, 252825, 250141, 270149, 243375, 225628, 274666, 314524, 327931, 373703, 313686, 276595, 321618, 327339, 325028, 298876, 347068, 356550, 342122, 334857, 376911, 431451, 473275, 491235, 495969, 508273, 465045, 466489, 479505, 448506, 425467, 484717, 488155, 475894, 463593, 459064, 477984, 479212, 513512, 606746, 619595, 606145]
10842F06145j2215N20K2000M4305M7333N5058P0263P0579J6350k0084M1538N8658
10830A000450k9545m5915m2763J5483m351o5399l6213l4280O336n5465j2989m4793
10818F50556J8586M487l7670j5620k6521L0169Q3612J7979n237J5396k6694M779
10806G13822k5419M019j3073O0499R4832N9686L0547M3933m316k9073J3033O3528
10794A012018L2229Q7723R6426Q4200J00720P2024j932P371O1233N6763M9535
10783A658310M9565l7281l2847J9176L184K0264j0138m9704q2877k0292n5594
10772A461766n8006j8747k8761o6052m9560L6444j7474k6647J1633J9296K7261
10761A291153P8772L2747Q2194L9877p2522k7428K5055M3591N5219Q1662Q9064
$$ y = [606145, 593930, 594450, 616450, 660755, 708088, 763146, 833409, 903988, 920338, 900254, 941792, 1000450, 970905, 924990, 882227, 897710, 893359, 827960, 791747, 757467, 763803, 708338, 695349, 650556, 669142, 673629, 635959, 620339, 593818, 623987, 707599, 725578, 720341, 735737, 709043, 713822, 688403, 692422, 679349, 739848, 834680, 894366, 924913, 968846, 964530, 935457, 948490, 1012018, 1044247, 1131970, 1228396, 1312596, 1413316, 1485340, 1483408, 1490779, 1552012, 1608775, 1658310, 1707875, 1670594, 1637747, 1656923, 1660107, 1680371, 1670233, 1620529, 1537652, 1517360, 1461766, 1403760, 1385013, 1356252, 1290200, 1240640, 1277084, 1259610, 1232963, 1244596, 1263892, 1291153, 1369925, 1402672, 1484866, 1524743, 1452221, 1424793, 1449848, 1493439, 1548658, 1630320, 1719384]
10750A719384J15073K5765M8202O9545R6743J42634R0270O1431J14102J18205
10740B601354J18934J31189O2274l828R2674J16435Q1041J19257J33493J57559
10730C610382J62008J47532K03367J44593J16699J50777K21932K70991L51656
10721E379937L70781L62320M48245M99406N99255N73551O51909P28027P94049
10712A0407480R70287J180192J369250J573503J766985K143476K606762L098623
10704B5116558L788812M755380N957549P514211R374497J1192413J2474185J2001675
10696I2175280Q763523K840619m014450r590717j2385866j2377751j0771548q642939
10688D5996151o650812m966242l709256k775038k189691j680246j254677q91919
$$ y = [1719384, 1834457, 1860222, 1908424, 1977969, 2074712, 2217346, 2307616, 2369047, 2483149, 2601354, 2720288, 2851477, 2913751, 2909923, 3002597, 3119032, 3200073, 3319330, 3452823, 3610382, 3772390, 3919922, 4123289, 4267882, 4384581, 4535358, 4757290, 5028281, 5379937, 5750718, 6113038, 6561283, 7060689, 7659944, 8233495, 8885404, 9613431, 10407480, 11377767, 12557959, 13927209, 15500712, 17267697, 19411173, 22017935, 25116558, 28905370, 33660750, 39618299, 47132510, 56507007, 67699420, 80173605, 92175280, 100938803, 103779422, 99764972, 90174255, 77788389, 65410638, 54639090, 45996151, 39345339, 34379097, 30669841, 27894803, 25705112, 24024866, 22770189, 21878270]
10680B1878270p05866n83519m07092k14695k6K27310M20994O24036Q39380R38155
10670B3016947J162691J308766J634786J795573J988296J999793J902715K079822
10662C6889389K555831L187853L993180N077356O450720Q213317J0362046J2691749
10654H9421441J4760496J6008871J5718575J3875220J0282900N419770K11883
10647A65699156m234569p368384r538801j0961729j1461157j1092326j0161059
10640A00881131r243211q734782q148336p119605n686003m337448l487928l214162
10632E0909656l003763k814427k414390j905812j483020j139241r13366o66950
10624C6568687l48502N2089L49377P12742J228915J743547K224517K867313L421160
$$ y = [21878270, 21172404, 20588885, 20181793, 19967098, 19967072, 20194382, 20615376, 21239412, 22078792, 23016947, 24179638, 25488404, 27123190, 28918763, 30907059, 32906852, 34809567, 36889389, 39445220, 42633073, 46626253, 51703609, 58154329, 66367646, 76729692, 89421441, 104181937, 120190808, 135909383, 149784603, 160067503, 165487273, 165699156, 161464587, 154096203, 144557402, 133595673, 122134516, 111042190, 100881131, 91637920, 82903138, 74754802, 67635197, 61949194, 57611746, 54123818, 50909656, 47905893, 45091466, 42677076, 40771264, 39288244, 38149003, 37235637, 36568687, 36220185, 36272274, 36621651, 37334393, 38563308, 40306855, 42531372, 45398685, 48819845]
10615D8819845L522337L179956K491047J996966K016519K665959L868018N428911
10607G3989558P418550R813530J2415875J5022688J6695019J6289601J3117448
10600A64762269P580655N84319o375058j1401161j3267987j2075836q923240n230052
10592A15653909k303496j298444k775942n672125p837482q239241p111803n209924
10584G5205452l303493j651406k09694J050987J619396R06934j093570l571696
10576F8952910n289631n558579m883804l778663k598417j667338q96757l73679
10568D3906042k09994o18953j409828k302089k908700l034594k784625k399386
10560B8237873j982840j663109j365535j126905r69378q15620o59536o05466n42314
$$ y = [48819845, 52342182, 55522138, 58013185, 60010151, 62026670, 64692629, 68560647, 73989558, 81408108, 91221638, 103637513, 118660201, 135355220, 151644821, 164762269, 172342924, 172927243, 166552185, 155151024, 141883037, 129807201, 120883961, 115653909, 113350413, 112051969, 109276027, 103603902, 95766420, 87527179, 80415376, 75205452, 71901959, 70250553, 70040859, 71091846, 72711242, 73618176, 72524606, 68952910, 63663279, 58104700, 53220896, 49442233, 46843816, 45176478, 44279721, 43906042, 43696048, 43077095, 41667267, 39365178, 36456478, 33421884, 30637259, 28237873, 26255033, 24591924, 23226389, 22099484, 21130106, 20314486, 19654950, 19049484, 18507170]
10551A8507170n00761m99238n04117m26591m11260l86921l54206l94611l27323
10542A4702142k74271k67470k59444k61533k04359j70057j96865j55454j71187
10533A2741502j57619j47804j47876j34741j25054j63476j50231j21397j22517
10524A1470787j49202q3951j25074j76181j75875j15206p5184j23384j29865j42128
10514A0174737k08651j81173k45923k25637k09162k12594k18343j59836j59611
10505H353807k06629j47398j86384j74265j63443j46386j30509j35819j62280
10496F900694j08792o9074j46256j46678j34725j31859j31182j10207n1583j16870
10486E753468q2440p2506j58410m3630j7483p6551q4187q0261r7912o0823q5544
$$ y = [18507170, 18006409, 17507171, 17003054, 16576463, 16165203, 15778282, 15424076, 15029465, 14702142, 14427871, 14160401, 13900957, 13639424, 13435065, 13265008, 13068143, 12912689, 12741502, 12583883, 12436079, 12288203, 12153462, 12028408, 11864932, 11714701, 11593304, 11470787, 11321585, 11237634, 11112560, 10936379, 10760504, 10645298, 10570114, 10446730, 10316865, 10174737, 9966086, 9784913, 9538990, 9313353, 9104191, 8891597, 8673254, 8513418, 8353807, 8147178, 7999780, 7813396, 7639131, 7475688, 7329302, 7198793, 7062974, 6900694, 6791902, 6722828, 6576572, 6429894, 6295169, 6163310, 6032128, 5921921, 5870338, 5753468, 5671028, 5598522, 5440112, 5396482, 5378999, 5302448, 5218261, 5138000, 5040088, 4979265, 4893721]
10475D893721j16776j01019j41918j14715j40066r7429j52359j30846j23464j09134
10465C665995j41445j55226j64557j52088j16961j66141j28305n8421j00524r3585
10455B388742r6936j43367p3334j00224j01206n1097n0902n5797K1636m4153q5889
10444A607473j05717j10819m8053j9522n9583m7955p0251m4839r106J7685J9242
10433A128555r5571p0035j8500n0106o0876j644m7608o962P0874K2508j1778j6024
10421H42833k5463N0192L6493l6973M780o4390k7939k9981N784k0035M1075O4137
10409H40513j2167K6886j282k3481n0682j0524j2674k0069j2129K5583j07M9976
10397G99843L1312M1383J4120k5491q0412n5280o7616L6762M6731L9536L3715
$$ y = [4893721, 4776945, 4675926, 4534008, 4419293, 4279227, 4181798, 4029439, 3898593, 3775129, 3665995, 3524550, 3369324, 3204767, 3052679, 2935718, 2769577, 2641272, 2582851, 2482327, 2388742, 2291806, 2148439, 2075105, 1974881, 1873675, 1822578, 1771676, 1715879, 1737515, 1693362, 1607473, 1501756, 1390937, 1342884, 1323362, 1263779, 1215824, 1145573, 1100734, 1091628, 1109313, 1128555, 1032984, 962949, 944449, 894343, 833467, 831823, 784215, 777253, 848127, 870635, 858857, 842833, 817370, 867562, 904055, 867082, 871862, 807472, 779533, 749552, 755336, 735301, 776376, 840513, 828346, 855232, 853950, 830469, 779787, 769263, 756589, 736520, 724391, 749974, 749867, 799843, 831155, 872538, 886658, 861167, 780755, 725475, 657859, 694621, 741352, 780888, 814603]
10386H14603M5551k7069k2729l5795J2949m158m3812J9861p779j5918m3772K0563
10374G12495r947n1844K1474Q3016L7023m0987n2981J9417M5470N7714r703j5754
10362G95393m9790l2378l0894k1049N0973N0557o2500l1007J8179M7395M5232
10351G80111q414j7940k1229l7551m280K3325Q373j4095q604J1022r625o9855
10339F31238k3754M0098M1575l2793o3933J0298J6417m2720m4382q093M1997K328
10327E68276l9452k3678l0585m413k0146k0189K6181j0492l0744P064K512n3646
10315C70688k2185j7953P458m1881K6269K0112L5386J3117N7061P985r7008J1466
10303C70515K5670K4922j5471k5990R486L5533O7707J16793M4931P929N1537J0580
$$ y = [814603, 860154, 833085, 810356, 774561, 787510, 783352, 739540, 759401, 751622, 735704, 691932, 712495, 702548, 650704, 672178, 755194, 792217, 751230, 698249, 717666, 763136, 820850, 811147, 795393, 745603, 713225, 682331, 661282, 712255, 762812, 700312, 669305, 687484, 734879, 780111, 771697, 753757, 732528, 694977, 690697, 714022, 722395, 708300, 699696, 710718, 701093, 631238, 607484, 647582, 689157, 656364, 592431, 602729, 619146, 576426, 532044, 523951, 565948, 568276, 528824, 505146, 474561, 470148, 450002, 429813, 455994, 445502, 414758, 421822, 424334, 370688, 348503, 330550, 338008, 296127, 322396, 342508, 377894, 391011, 448072, 456057, 359049, 370515, 396185, 421107, 405636, 379646, 389132, 424665, 492372, 609165, 654096, 662025, 713562, 724142]
10291G24142J044j4468j23532p1823o5342o0804j8099k3065k8979l05n072k8535
10279B85162k5471l0589K9230L9387k6098q724m135k6837k5755L7584J0493j6726
10267B37521p163j1874K2953M4179n1817m019L2594N2452k6583K8856K289L8480
10255C57868R5646L6968L3796J6323O6879O3139M1193Q7888M8938K5182J6240
10244H90060j3556m4834n6558q3167p2356m3599l7163o636m3931k5980n44k1025
10232D40711q85l0987j6980K3680j8292l9054Q254m2130j20150l9950K6903J4991
10220B06111R154k090k6977j9356J4033k1746J1110J8389K242L703m782P829K9618
10207B27238K4293K6091O4042N5821K3379k3762j5645K4342P4670M9349N6750
$$ y = [724142, 725186, 710718, 587186, 515363, 450021, 389217, 371118, 348053, 319074, 318769, 313697, 285162, 259691, 229102, 258332, 297719, 271621, 262897, 258762, 231925, 206170, 243754, 254247, 237521, 230358, 218484, 241437, 285616, 233799, 229780, 262374, 314826, 288243, 317099, 319388, 357868, 453514, 490482, 524278, 540601, 607480, 670619, 711812, 799700, 848638, 873820, 890060, 876504, 831670, 775112, 691945, 619589, 575990, 538827, 532191, 488260, 462280, 461736, 440711, 439826, 408839, 391859, 415539, 397247, 358193, 366447, 324317, 204167, 164217, 191120, 206111, 215265, 213175, 186198, 166842, 180875, 159129, 170239, 188628, 190870, 194573, 189791, 197620, 227238, 251531, 277622, 341664, 397485, 420864, 397102, 381457, 405799, 480469, 529818, 586568]
10196E86568N0466l7259p5892m3782k4012j0788p0717m3141p625K4n7505n5356
10184B10981m8966l5802J4662J8826M419l4096K9850M1471l265M1434L3129o414
10172B66229o0052l6278N1814J7996L4233R0403M6091K1423L4391k05q0636q1091
10160C04318l254j8339N9876K5290L261M2582r285m932j6622j4408o2697j3911
10148B91879K719K3231p2109o823K1365l331j1320j4007l7042m3862l3784M4587
10136A61503K534k5082O627K351L3072q153j4311L0533J441l7755k9240m4059
10124G9461o4517J2624N0069m450l7827j01845k1649O1556J0231L6499j566n4680
10112c6094l4361M3395K9199J3724m7857j192L6591l435l3341p233l5677L6432
$$ y = [586568, 637034, 599775, 523883, 480101, 456089, 445301, 374584, 331443, 323818, 323842, 266337, 210981, 162015, 126213, 140875, 159701, 164120, 130024, 159874, 201345, 198080, 239514, 272643, 266229, 206177, 169899, 221713, 239709, 273942, 364345, 410436, 431859, 466250, 466045, 385409, 304318, 301064, 282725, 342601, 367891, 371152, 413734, 404449, 399517, 382895, 368487, 305790, 291879, 294598, 317829, 245720, 238897, 260262, 256931, 245611, 231604, 194562, 150700, 116916, 161503, 164037, 138955, 145582, 147933, 181005, 172852, 158541, 189074, 190515, 152760, 123520, 79461, 14944, 27568, 77637, 73187, 35360, -66485, -88134, -26578, -16347, 20152, 18586, -36094, -70455, -27060, 2139, 15863, -31994, -33186, 3405, -30, -33371, -40604, -76281, -39849]
10100c9849j5316o6352L3041q521L4561N7006P375l0393p0667j0908N003k0598
10088a25618j3841L9160L7129P2766k5126k8453M2656J3887k6748J0290R161N19
10076E782l7559P554j693m7596K495R4j0583l4026p509J4492N4469J7874n1549
10063h7755k3857O638K8768M3002j8803N942m663m4434K5259K0653j5716p8375
10051a43341j5857n753J8119L7181J6219M218n399n545k0732J7682k5260n181
10039a33649k274J6516M027J9741O3670k7475n0706p0128N5812j2679j2117O0018
10027h9244J3794n4107K454L0524J8870K7663j7577p2971j1961j9457k7064M779
10015a94297J9099N2783J5106Q4n273K1671j1302k1490J0744q859j6143n4701
$$ y = [-39849, -55165, -121517, -88476, -96997, -62436, -5430, 1945, -28448, -99115, -110023, -105020, -125618, -139459, -100299, -63170, 9596, -15530, -43983, -1327, 12560, -14188, -3898, 5263, 5782, -31777, -24223, -25916, -73512, -71017, -70923, -81506, -115532, -123041, -108549, -54080, -36206, -87755, -111612, -104974, -76206, -33204, -52007, -46065, -50728, -95162, -69903, -49250, -64966, -143341, -159198, -164951, -146832, -109651, -93432, -89214, -94613, -100158, -120890, -103208, -128468, -133649, -135923, -119407, -115380, -95639, -31969, -59444, -110150, -180278, -124466, -137145, -149262, -89244, -75450, -129557, -127103, -96579, -77709, -50046, -67623, -140594, -152555, -172012, -199076, -194297, -175198, -122415, -107309, -107225, -112498, -90827, -102129, -123619, -112875, -121734, -137877, -192578]
10003a92578j98j8085l428j6188K9716P470K5894N7376k7900k1823M609j060J1934
9990a44261p021n3082k9705M2461L8209k6634n8858l192N3439O6824N190l298
9978a19928l1526K5681K5155j9677j3456M4033L972k2307j6453M1922l4776k0337
9966a37697j19q0967l9939K6135Q4747L464j9595m1680m1672J6543M5172P459
9954a78149l2369N513k0815m707k995K7104L3349M6761k0028n4997J2052Q3904
9942a05377k6187j4523N0778Q565j1131K5687n5875k1469j6723L6690Q2992N8668
9930A2095P1297O500j14635r3225m2037L38k6065R37K682N051M168l3409K3997
9917a82306l5237l1914q186k460J9052M8610k579K8831J6271K3998L135p4714
$$ y = [-192578, -192776, -210861, -214289, -230477, -200761, -193291, -167397, -110021, -137921, -159744, -155135, -156195, -144261, -151282, -204364, -234069, -191608, -153399, -180033, -238891, -242083, -188644, -121820, -116630, -119928, -151454, -125773, -100618, -120295, -133751, -89718, -85746, -108053, -124506, -82584, -117360, -137697, -137816, -218783, -258722, -232587, -147840, -144376, -163971, -205651, -247323, -230780, -185608, -178149, -210518, -205005, -225820, -230527, -233522, -206418, -173069, -126308, -146336, -201333, -189281, -105377, -131564, -146087, -95309, -86744, -97875, -72188, -128063, -149532, -166255, -129565, -46573, 12095, 83392, 89892, -24743, -117968, -160005, -159667, -185732, -184795, -182113, -177062, -172894, -206303, -182306, -217543, -249457, -257643, -260103, -241051, -192441, -195020, -166189, -149918, -125920, -122785, -197499]
9905a97499m6892L6497O442j9798j0625l7962Q079j84L7546L5870P103J870j4927
9892a94480k1000R071P0579J0579n5822J118k8323n216J3099m4925j5469J3249
9880b47540K6698J1631L1539K3935k0239j09094k8915J5439R3619K7569j6339
9869a91697n7378j3111k2348K1600M4899L093j3102l522q276K3858M1930o375
9857a80429L0209J0510l9126l8945k8845j0779N331K299O0O3845K515M3613L3679
9844a06063o0288l25J7366J9243k7532l4404o495l305Q5034K1484o8617n7449
9832b21351q755L396J4141M204k8329j2495M575l874o008O9114j4967q9420J4686
9819b75083J5527j7062P4447K8260o0947l4980j8326L2907M8294O931j2456M5323
$$ y = [-197499, -244391, -207894, -201452, -221250, -231875, -269837, -261758, -261942, -224396, -188526, -181423, -179553, -194480, -215480, -206409, -135830, -125251, -181073, -179955, -208278, -213494, -200395, -245320, -260789, -247540, -220842, -209211, -177672, -153737, -173976, -283070, -311985, -296546, -202927, -175358, -191697, -249075, -262186, -284534, -262934, -218035, -214942, -228044, -231566, -239842, -215984, -174054, -180429, -150220, -139710, -178836, -217781, -246626, -257405, -252074, -249775, -249715, -185870, -183355, -139742, -106063, -166351, -166676, -149310, -130067, -157599, -192003, -198498, -201803, -116769, -95285, -163902, -221351, -230106, -226710, -212569, -208365, -236694, -249189, -244614, -248488, -254496, -185382, -200349, -289769, -275083, -259556, -276618, -202171, -173911, -234858, -269838, -288164, -255257, -206963, -200032, -212488, -167165]
9807a67165k7902j8588M1582n7945j9045P721K1680j5786m7169k0969K6986L2166
9795b44434J0356K8315j8292J4592J0347m6617o9383R852K1448k1598m849P0421
9783b39842j2124m7119J2674L3496M153k9296j2471P8200j7419m730M3922m485
9771a95041k4558J0865l2987L5286Q145j9274K3587N316j8965L751J4087K3038
9759a66750J1576m8434l4930k2943k7840n851k7857K9469k2279n1874P964J8771
9747c40978m795J2945R249N6036M770M3698j7277k8923J2076L7831J7086P541
9735a90741P737k662k8919k9423o7609n813j1744k1616M4340L3105k6522k3556
9723c23423J9831L4078J0412n2889k6954N1248O2040L6728J2341o2593l1053J3137
$$ y = [-167165, -195067, -213655, -172073, -230018, -249063, -241342, -219662, -235448, -282617, -303586, -276600, -244434, -234078, -205763, -224055, -209463, -199116, -245733, -315116, -305264, -283816, -305414, -310263, -239842, -251966, -299085, -286411, -252915, -248762, -278058, -290529, -212329, -229748, -234478, -190556, -195041, -219599, -208734, -241721, -206435, -198290, -217564, -193977, -188661, -207626, -203875, -189788, -166750, -155174, -203608, -238538, -261481, -289321, -295172, -323029, -293560, -315839, -367713, -359749, -340978, -345773, -332828, -323579, -267543, -262773, -219075, -236352, -265275, -253199, -215368, -198282, -190741, -183004, -185666, -214585, -244008, -311617, -317430, -329174, -350790, -306450, -273345, -299867, -323423, -303592, -269514, -259102, -311991, -338945, -287697, -225657, -188929, -176588, -239181, -270234, -257097]
9711b57097j434k178K6832J6363l8801K7688J4760r8727q5580k5951N1943M0193
9699c31989j5431K3571n270n706K3570R823Q392p833K3019k9148j8375K7924L2332
9686b65121q241K1405P6337N777m2660P207L4575M2956l2208n4028k6231k0525
9674b60757j7594J385K7690r557m7512R689L3484j089K3181J517m5693O444O093
9661b72719k7482N2944K0710o7734l9540J8606J1394K5203L3925N9630L7359O458
9649a41246o1692m9510k7877M2262K9484j1738J953N142j0651K9164M5978q997
9637a57728p746j8469L4503R7283J07606J28407L6119q8119j03393R270o4266
9626b6533o0772j9456l6196j4336q2886l9524L3402l383j2328J3085M0251l2992
$$ y = [-257097, -258531, -260709, -233877, -217514, -256315, -228627, -213867, -312594, -398174, -424125, -372182, -331989, -347420, -323849, -329119, -334825, -311255, -301432, -293040, -300873, -277854, -307002, -325377, -297453, -265121, -273362, -251957, -175620, -169843, -212503, -205296, -170721, -127765, -159973, -214001, -240232, -260757, -278351, -276966, -249276, -258833, -306345, -296656, -263172, -264261, -241080, -239563, -285256, -278812, -272719, -300201, -247257, -226547, -294281, -333821, -315215, -303821, -278618, -244693, -185063, -147704, -141246, -202938, -252448, -280325, -238063, -208579, -220317, -218364, -213222, -223873, -194709, -148731, -157728, -165474, -183943, -149440, -52157, 55449, 183856, 219975, 131856, 28463, 37733, -26533, -87305, -106761, -142957, -157293, -240179, -279703, -246301, -249684, -262012, -248927, -208676, -241668]
9614b41668m5786m4501N0305P6962L228k4612j2540p644q829K4010p818L53M9820
9601a88720Q240j4108n3888K6788J06904K0648Q75p5346l1439K7190O7504L4692
9589g0660R133N9998N2678M6821K0702l593k4933l745j0834N2468K6812J5439
9577A70286n9021q7904m8481N607R247k1692l015M1013o3366o0490j0363K9934
9565i8245J9983L792o7917j2879l3119K6896J9820m731K2409M3936r030J6229
9553g2856j5534k0607L2938j865K0788N2334M2630N4059k9681J0782L6077O844
9541A15909M0756O5078K7600k7409l1620j178o7654j4284M4840L1680M0578Q504
9529B32800m2790j8932o1902k9886n3834p26K8840j2624o8246o0549N1278O6720
$$ y = [-241668, -287454, -331955, -281650, -204688, -201460, -226072, -238612, -246256, -255085, -231075, -238893, -238540, -188720, -180480, -194588, -248476, -221688, -114784, -94136, -93261, -168607, -200046, -172856, -105352, -70660, -61527, -1529, 51149, 97970, 118672, 115079, 90146, 86401, 75567, 128035, 154847, 170286, 111265, 23361, -25120, -19513, -10266, -31958, -34973, 6040, -57326, -117816, -128179, -98245, -78262, -74470, -142387, -155266, -188385, -161489, -141669, -146400, -123991, -80055, -89085, -72856, -88390, -108997, -76059, -77924, -57136, -4802, 37828, 91887, 62206, 72988, 109065, 115909, 156665, 221743, 249343, 221934, 190314, 189136, 121482, 107198, 152038, 183718, 224296, 232800, 190010, 171078, 109176, 79290, 25456, 24730, 53570, 40946, -27300, -87849, -36571, 30149]
9517C0149j6002p8967m6291N483k5728k0572l7481J0520J1290J5044l0625K6750
9505a56430K1528J4518L1465P6164J0725j7531J659j8034K3866O2057K0523M6704
9493A17214J3455L581J4094j5981k6027L3720O6550j6736m5162k1441k2709n3803
9481D6755k1347n0189n1708N7928L1355l4095l8561o3451j8356l4792L3720L4010
9469a08731K8787J7301R198p6579j2115N00J9964K7654R884N316O315j2592M573
9456h0525m761m3454k1952k8066j8207K2499L1538O6247J645M949m8991L243L0183
9443h5652M0076l8793p8152k0231K1272J2270M0632J1646l4990l1897j1944l7593
9431b13356j9337r672O609j8959N8994O6084M5185n6013N699N794k8496m0160
$$ y = [30149, 14147, -64820, -111111, -105628, -131356, -151928, -189409, -178889, -167599, -152555, -183180, -156430, -134902, -120384, -88919, -12755, -2030, -19561, -17902, -35936, -12070, 49987, 70510, 117214, 130669, 134250, 148344, 132363, 106336, 140056, 206606, 189870, 144708, 123267, 100558, 46755, 25408, -24781, -76489, -18561, 12794, -21301, -59862, -123313, -141669, -176461, -142741, -108731, -79944, -62643, -53445, -130024, -142139, -141639, -121675, -94021, -84137, -78821, -72506, -85098, -80525, -85286, -128740, -150692, -178758, -196965, -174466, -142928, -76681, -75036, -70087, -119078, -115835, -85652, -45576, -84369, -162521, -182752, -161480, -149210, -108578, -96932, -131922, -163819, -175763, -213356, -232693, -242365, -235756, -254715, -195721, -129637, -84452, -140465, -134766, -128972, -157468, -197628]
9419a97628j8068m288j4292N3745l230n2083j3859K5259K1229K2240k4413k481
9407b07869L0847p855l7628j0264N1759m0013n995K7990k001l4452J3171N9259
9395a63051k3962p123q82k564N7735j5250j03954j522O171M0227K0945q297n455
9382b06982K0543K4838q6274k8649L5828R1463q92K2779P473m0014r576J4370
9370a55093J9804j5358R168j7020K6046K1086J4290j7360K2898j7718N1932L5956
9358b1369j4780j03018m4746K7621L5116O083K9315l6015k2195j4931j9264N261
9346a72922L924m0991j2513J6979O3064R1326j729M170Q6510O9266q668o620l9334
9333E2462j1178N6416J1410L1757M2879J4879L5457l005l4073o3904K9759O8458
$$ y = [-197628, -215696, -219984, -234276, -180531, -183761, -235844, -249703, -224444, -203215, -180975, -205388, -207869, -177022, -184877, -222505, -232769, -181010, -221023, -227018, -199028, -201029, -235481, -222310, -163051, -187013, -194136, -195018, -197582, -139847, -155097, -259051, -260573, -254402, -214175, -193230, -201527, -206982, -186439, -161601, -247875, -276524, -240696, -149233, -150125, -127346, -119873, -159887, -169463, -155093, -135289, -150647, -141479, -158499, -132453, -111367, -97077, -114437, -91539, -109257, -57325, -21369, -36149, -139167, -183913, -156292, -121176, -115093, -85778, -121793, -143988, -158919, -178183, -172922, -168998, -209989, -222502, -205523, -142459, -51133, -52862, -48692, 37818, 107084, 98416, 91796, 52462, 41284, 97700, 109110, 140867, 183746, 198625, 234082, 231077, 197004, 133100, 162859, 231317]
9321B31317M581r877j1243k6931M1218L1176O8402O501l7051l3202J2941q990
9309B68842k9051p5440k1765j6214O001L9599K9506P029m5270j7754o027L026
9297A42482j0821o739N2350J7335l3611K3144J8930M260L6977O0421J028M240
9285C09996R6090R7023Q3425M3792n963Q143Q6467O9886N4846o9259L6569J1835
9273H22850k2981P1892j938K0845Q3765J0681j0200K1310k1404j1718l9564K2262
9261I45800J7570K5810P5605J08609J32546P2450Q3343J57051J54620J67468J96638
9250B137510J70651K68417L63222M25294M27151M33756N38753P12060Q01403Q66612
9240G144829J214690J467562J894493K395997K634360K743699K242030J282675
$$ y = [231317, 235898, 226021, 214778, 187847, 229065, 260241, 328643, 335144, 298093, 264891, 277832, 268842, 239791, 164351, 142586, 126372, 132373, 171972, 201478, 208507, 163237, 145483, 139456, 142482, 131661, 124922, 177272, 194607, 160996, 184140, 203070, 207330, 244307, 304728, 305756, 309996, 406086, 503109, 586534, 630326, 624363, 632506, 718973, 788859, 843705, 774446, 811015, 822850, 799869, 871761, 869823, 890668, 974433, 985114, 974914, 996224, 974820, 963102, 923538, 945800, 963370, 989180, 1064785, 1173394, 1305940, 1378390, 1461733, 1618784, 1773404, 1940872, 2137510, 2308161, 2576578, 2939800, 3365094, 3792245, 4226001, 4764754, 5476814, 6278217, 7144829, 8359519, 9827081, 11721574, 14117571, 16751931, 19495630, 21737660, 23020335]
9232B3020335J40285r09397j814587k312672k341871k116855j785910j435900
9224A0443428j066125q11258o18996m14987k89878k16972j63157j18604j03289
9215F640162l7629L4279J02475J69136L20191L83575M43001N36305O53168Q10532
9205A0055195R13087J043759J279948J607941K010943K433089K772585K972400
9197B5088947K995331L156831L464106L847687M004620M136331M502486M922341
9189E6118680M765294L373874R11492j615123l142051l417382k847734k394046
9181E1753004k381385k634022k610579k055277j219459m41930j38398n66548j545708
9172C8159698k460689k943707k923150k572911k112476j564513j125623p20522
$$ y = [23020335, 23160620, 22251223, 20436636, 18123964, 15782093, 13665238, 11879328, 10443428, 9377303, 8566045, 7947049, 7532062, 7242184, 7025212, 6862055, 6743451, 6640162, 6602533, 6636812, 6739287, 6908423, 7228614, 7612189, 8055190, 8591495, 9244663, 10055195, 10968282, 12012041, 13291989, 14899930, 16910873, 19343962, 22116547, 25088947, 28084278, 31241109, 34705215, 38552902, 42557522, 46693853, 51196339, 56118680, 60883974, 64257848, 65169340, 63554217, 60412166, 56994784, 54147050, 51753004, 49371619, 46737597, 44127018, 42071741, 40852282, 40410352, 40271954, 39705406, 38159698, 35699009, 32755302, 29832152, 27259241, 25146765, 23582252, 22456629, 21736107]
9164B1736107l35494M1054K10764M14354O19504P19321Q84916J213315J649728
9155B7153569K118893K760959L456583M107624M592959M712184M907816N394030
9147E9204617N724296N632441N052302M674857M865510N099216M491298K988009
9139I7732546J338528N3832j077718k675423m462135n874122o313290o083014
9131G2639204n472553m864131m127207l160828j924368p17328l23772r76899j867960
9122D9204158k271657k454830k711395k896944k877631k583685k039075j535961
9114B9832980r50175n25768j95662J86673M74397Q23871J078177J273475J282226
9105C3280194J303596J593606K105755K789639L661399M855472O006979O717448
$$ y = [21736107, 21400613, 21441667, 21652431, 22066785, 22686289, 23405610, 24290526, 25503841, 27153569, 29272462, 32033421, 35490004, 39597628, 44190587, 48902771, 53810587, 59204617, 64928913, 70561354, 75613656, 80288513, 85154023, 90253239, 94744537, 97732546, 99071074, 99124906, 98047188, 95371765, 90909630, 85035508, 78722218, 72639204, 67166651, 62302520, 58175313, 55014485, 53090117, 52372789, 52049017, 51072118, 49204158, 46932501, 44477671, 41766276, 38869332, 35991701, 33408016, 31368941, 29832980, 28882805, 28357037, 28161375, 28348048, 28822445, 29646316, 30724493, 31997968, 33280194, 34583790, 36177396, 38283151, 41072790, 44734189, 49589661, 55596640, 62314088]
9097F2314088O341494M726122K693907J261643Q24101Q88705O72081J4194j054639
9088G8681696k187102l358486m297012n141064n601697n198599m116327k769594
9080D6011815j561704q07187q48243j432670k219265k871494l056185k901705
9072C0313362k444288k070523j684578j362821j085614q97021o87311n71812n14812
9063A8994582l71353k18928j53830j07804n791N6710J28544K25038K56232L71358
9053A9174758N29584P07238Q93018J273545J650850K207445K775611L231028L354450
9044C5797527K683963J348544k56448j705322k883076l599495l649521l318063
9036B4418109k794891k204252j687300j336027j064485q26512o93873n81169n19656
$$ y = [62314088, 68655582, 73381704, 76075611, 77337254, 78161355, 79050060, 79722141, 79736335, 78681696, 76494594, 73136108, 68839096, 63698032, 58096335, 52897736, 48781409, 46011815, 44450111, 43642924, 42794681, 41362011, 39142746, 36271252, 33215067, 30313362, 27869074, 25798551, 24113973, 22751152, 21665538, 20768517, 20081206, 19509394, 18994582, 18623229, 18404301, 18250471, 18142667, 18136876, 18193586, 18322130, 18547168, 18803400, 19174758, 19704342, 20411580, 21304598, 22578143, 24228993, 26436438, 29212049, 32443077, 35797527, 38481490, 39830034, 39573586, 37868264, 34985188, 31385693, 27736172, 24418109, 21623218, 19418966, 17731666, 16395639, 15331154, 14504642, 13810769, 13229600, 12709944]
9027A2709944m90947m41002m35006l32373l31751l30907k07711k60475k67954
9018I611818j88795j36489j69467k04365j81741j72713j93001j80505j75240j50165
9008G859337j24900j26915j46441j69532j85969j39905j45810j96665j87685j46805
8998F288710p8511j18410r5940j70897j82940j60254j40893j67835q4810q4289
8988E003931j04617r5251m5412p8416j03242j11433q5695o5517m1693m5890k4140
8977D202625o3510m7548j8338l0621n5300r0062q5489m3875n3927o0437j6926
8966C636592o3933j09234r2179j7689o9750p1140r8642m3413m1528k070k5628
8955C001386j69259k07220q4871n7043j1507n0454j00812j30232j02647k5230
$$ y = [12709944, 12218997, 11777995, 11342989, 11010616, 10678865, 10347958, 10140247, 9879772, 9611818, 9423023, 9286534, 9117067, 8912702, 8730961, 8558248, 8365247, 8184742, 8009502, 7859337, 7734437, 7607522, 7461081, 7291549, 7105580, 6965675, 6819865, 6623200, 6435515, 6288710, 6210199, 6091789, 5995849, 5824952, 5642012, 5481758, 5340865, 5173030, 5088220, 5003931, 4899314, 4804063, 4758651, 4680235, 4576993, 4465560, 4379865, 4314348, 4272655, 4226765, 4202625, 4139115, 4091567, 4073229, 4042608, 3987308, 3897246, 3811757, 3767882, 3713955, 3653518, 3636592, 3572659, 3463425, 3371246, 3353557, 3283807, 3212667, 3114025, 3070612, 3029084, 3027014, 3001386, 2832127, 2624907, 2540036, 2482993, 2471486, 2421032, 2320220, 2189988, 2087341, 2062111]
8945B062111n4576r6144l9912k7235L808k8246j8665j7421k2381O297j901o1571
8933A704164p4336l0450k8864m6475K0122N0363j4042j3821K5425K3098J0840
8922A626024M118o7487p2926m6741p738J3356K6102o905m1469q9024n0675m911
8910A281724M299n055k7188k2597j4418m2736p6051j17416J0965M6267J4506J7817
8898A070117m5080M799J05n8563K8409J6786k5824L312q094k7344o700M0840R760
8885A002523l1915R748J9670K577l5195L0418O3201K681J4294j5455l8558Q135
8873A032124p00l3334o2645p872P4188L241k3135O381k204m4199m0606q847K4006
8860I16398M0618o4656k5240n932m8824j4693L4412P2372L0162p0315m6471j7561
$$ y = [2062111, 2007535, 1911391, 1871479, 1844244, 1848052, 1819806, 1801141, 1783720, 1761339, 1767636, 1765735, 1704164, 1629828, 1599378, 1570514, 1524039, 1544161, 1594524, 1580482, 1566661, 1592086, 1615184, 1626024, 1630142, 1562655, 1489729, 1442988, 1435250, 1448606, 1474708, 1467803, 1426334, 1337310, 1286635, 1281724, 1286023, 1280968, 1253780, 1231183, 1216765, 1174029, 1097978, 980562, 991527, 1037794, 1052300, 1070117, 1025037, 1029836, 1029941, 971378, 999787, 1016573, 990749, 994061, 985967, 958623, 951923, 992763, 1002523, 970608, 980356, 1000026, 1002603, 967408, 997826, 1061027, 1063708, 1078002, 1062547, 1023989, 1032124, 1031424, 998090, 935445, 927573, 1001761, 1005002, 981867, 988248, 986044, 941845, 901239, 892392, 916398, 957016, 892360, 867120, 861188, 812364, 797671, 832083, 904455, 934617, 864302, 817831, 800270]
8848H00270K7945O6908J3029r560J2050L6360L4161M6185K9174k7174P065K8733
8836A065146K8975R72L812J4085K771L0311q800J074r74P8261N518j4114n4711
8823A152326m3560M0798N8993L4661K1882q634k4693l594j7211l0928k2151J9111
8811A177000K3364n094N1053J17117P8866L8328O4702J14188O5967M8907J88514
8800A962912J95984J50528K17814K93883M05469L96713L74734M71731O18244Q52912
8790E940924J108367J414097J749905J991717K074265J613730N03114p20729j668819
8781A4006571j938684j787603j501572j101502q73610o53495m93736l01749k31147
8772E123473j70965j48423j15813p3455k9313O775L4735J29677J48680J89481
$$ y = [800270, 828215, 895123, 908152, 898592, 910642, 947002, 981163, 1027348, 1056522, 1029348, 1036413, 1065146, 1094121, 1095093, 1098905, 1112990, 1115761, 1146072, 1137272, 1138346, 1137372, 1215633, 1221151, 1207037, 1152326, 1108766, 1149564, 1208557, 1243218, 1265100, 1256466, 1231773, 1228179, 1210968, 1180040, 1157889, 1177000, 1200364, 1195270, 1246323, 1363440, 1442306, 1480634, 1545336, 1659524, 1725491, 1774398, 1962912, 2158896, 2309424, 2527238, 2821121, 3226590, 3623303, 3998037, 4469768, 5088012, 5940924, 7049291, 8463388, 10213293, 12205010, 14279275, 15893005, 16396119, 15675390, 14006571, 12067887, 10280284, 8778712, 7677210, 6803600, 6150105, 5656369, 5354620, 5123473, 4952508, 4804085, 4688272, 4614817, 4585504, 4592279, 4627014, 4756691, 4905371, 5094852]
8762E094852K55798L34225L56265M62416N50558P25228Q73758J021523J171041
8753A0845664J263163J316905J382992J378684J556148J825637K152275K415386
8745B4136854K850070L404222L962731M450729M567398M230971L518708K396022
8737E3517705Q79988r34066k794853m116434m615010m290027l618555l117933
8729C0910815k807040k515139k263333k080494j709014j389592j055028p83039
8721A6308136n19405l39966j56188o7043Q4826K89388N10565O16150Q12129J112652
8711A8651244J376702J593908J989586K208277K390454K690975L045282L166974
8703C7113402L136188L118227L267500L695360M272100M679077M872064M701651
$$ y = [5094852, 5350650, 5684875, 6041140, 6503556, 7054114, 7779342, 8653100, 9674623, 10845664, 12108827, 13425732, 14808724, 16187408, 17743556, 19569193, 21721468, 24136854, 26986924, 30391146, 34353877, 38804606, 43372004, 47602975, 51121683, 53517705, 54397693, 53463627, 50668774, 46552340, 41937330, 37647303, 34028748, 30910815, 28103775, 25588636, 23325303, 21244809, 19535795, 18146203, 17091175, 16308136, 15788731, 15448765, 15292577, 15225534, 15310360, 15599748, 16110313, 16726463, 17538592, 18651244, 20027946, 21621854, 23611440, 25819717, 28210171, 30901146, 33946428, 37113402, 40249590, 43367817, 46635317, 50330677, 54602777, 59281854, 64153918, 68855569]
8695F8855569M475535M194635L578878K634791J834732J539160J136383m2775
8687H8206908j988361l850398n166325n940817o482951o517543o053115n385811
8679D6821587m695360m168672l526663k806586k219769j624060j153552q67126
8671B5759799n66276l63939j27941J99926L84395O79182R92061J259677J641800
8662B9858684J976086K170256K445144K790723L138104L355075L133075K822137
8654E1689284K730198K944849L319761L543876L511720L273900L146791L206058
8646G7366437L307734L411668L420670L162480K322182N72285j893756m564621
8638H7105079o643341p646719p518689o781282o041845n406640m830658m250249
$$ y = [68855569, 73331104, 77525739, 81104617, 83739408, 85574140, 87113300, 88249683, 88206908, 86218547, 82368149, 77201824, 71261007, 64778056, 58260513, 52207398, 46821587, 42126227, 37957555, 34430892, 31624306, 29404537, 27780477, 26626925, 25759799, 25193523, 24829584, 24701643, 24901569, 25285964, 25965146, 26957207, 28216884, 29858684, 31834770, 34005026, 36450170, 39240893, 42378997, 45734072, 48867147, 51689284, 54419482, 57364331, 60684092, 64227968, 67739688, 71013588, 74160379, 77366437, 80674171, 84085839, 87506509, 90668989, 92991171, 93563456, 91669700, 87105079, 80461738, 72815019, 65296330, 58515048, 52473203, 47066563, 42235905, 37985656]
8630C7985656l450787k769677k251029j784772j382409j088327q36053p08930
8622B3713672n07528k81257k15645j01917J01448L16193M96314P66609J093043
8613B5380932J369737J447809J372847J279293J126116J148976J266804J486913
8605C5879427J559047J749495K151036K649008L238516L715634L797556L233943
8597E7973662K083635N83808j150667k908936m294967m976056m868723m414643
8589C8027113l824379l451285k960729k456559k104045j719495j437880j200085
8581A8872656j011589q58681p76156o51510n26730m44190m19117k97621k29330
8572A3657732k32216k42560k08192j64681q8320m9941q464P894K5964J65436K04049
$$ y = [37985656, 34534869, 31765192, 29514163, 27729391, 26346982, 25258655, 24422602, 23713672, 23206144, 22924887, 22709242, 22607325, 22708773, 23024966, 23521280, 24287889, 25380932, 26750669, 28198478, 29571325, 30850618, 31976734, 33125710, 34392514, 35879427, 37438474, 39187969, 41339005, 43988013, 47226529, 50942163, 54739719, 57973662, 60057297, 60641105, 59490438, 56581502, 52286535, 47310479, 42441756, 38027113, 34202734, 30751449, 27790720, 25334161, 23230116, 21510621, 20072741, 18872656, 17861067, 17002386, 16226230, 15574720, 15047990, 14603800, 14184683, 13887062, 13657732, 13425516, 13182956, 12974764, 12810083, 12721763, 12671822, 12663358, 12671252, 12697216, 12862652, 13066701]
8561A3066701K44454L06402N34274P38111Q88048J157583J469439J665289J592443
8552B1662744J065938N3442j055214j815353k114545j973010j682379j337258
8544A2804365j127286q56006n89578m88553l97072m02319l89589k77289k93518
8535G983155k45559k37227k20619k16666j86165j22521j12284j17035j43458j55515
8525F226106r2418q4725p2653n3816o0433j22787j09793q0185j10843j00012p3145
8514E265296j05438j22169j29818j03529j55353j04555o2004p6843j25970j19693
8504D159924j13718j57345j85612j18510q6609m4469k9455j39398j46650k4364
8494C113794k4098l1620n3162l807j9194n6864j10468q2847m5641M158J817o0748
$$ y = [13066701, 13311155, 13617557, 14151831, 14889942, 15777990, 16935573, 18405012, 20070301, 21662744, 22728682, 22782124, 21726910, 19911557, 17797012, 15824002, 14141623, 12804365, 11677079, 10821073, 10231495, 9742942, 9345870, 8943551, 8553962, 8276673, 7983155, 7737596, 7500369, 7279750, 7063084, 6876919, 6754398, 6642114, 6525079, 6381621, 6226106, 6133688, 6048963, 5976310, 5922494, 5862061, 5739274, 5629481, 5549296, 5438453, 5338441, 5265296, 5159858, 5037689, 4907871, 4804342, 4648989, 4544434, 4482430, 4405587, 4279617, 4159924, 4046206, 3888861, 3703249, 3584739, 3498130, 3453661, 3424206, 3284808, 3138158, 3113794, 3089696, 3058076, 3004914, 3001107, 2981913, 2925049, 2814581, 2731734, 2686093, 2690251, 2692068, 2631320]
8482B631320l5708N037l8662k1831j1831k2133l5909m8391J9203L0134k4694p770
8470B438765K5418k5607p8365o4309j2187n609q887m6272n3771p399n140q824
8458B147813Q9073L1275k4596N7143K8741K3565l0212k1027K7092K8122K2992
8447B379981Q639m4566j26077p7096n9225j01006p3987r4326o2486p9802p776
8436A662273J5958o9905j9131j9928n8175k7323K22m5719p320R701J1135m2166
8424A409622m953k9543J1805l2332n7656j6119Q8923P9505P913j4331M2574O1392
8412A546800O2558J4094J58787K52803K33385J00748K8942j8909p1073j34988
8402B173147j18927j51930r9905r0048q3400o3950j13870q1905k5507j6364m0697
$$ y = [2631320, 2595612, 2600649, 2561987, 2540156, 2528325, 2506192, 2470283, 2421892, 2441095, 2471229, 2446535, 2438765, 2464183, 2438576, 2360211, 2295902, 2283715, 2278106, 2269219, 2222947, 2169176, 2161777, 2156637, 2147813, 2236886, 2268161, 2243565, 2300708, 2329449, 2353014, 2322802, 2301775, 2328867, 2356989, 2379981, 2388620, 2344054, 2217977, 2140881, 2081656, 1980650, 1906663, 1812337, 1749851, 1670049, 1662273, 1678231, 1608326, 1589195, 1569267, 1511092, 1483769, 1483991, 1438272, 1430952, 1440653, 1451788, 1409622, 1404669, 1375126, 1386931, 1354599, 1296943, 1280824, 1369747, 1449252, 1457165, 1442834, 1485408, 1546800, 1609358, 1623452, 1782239, 2035042, 2268427, 2369175, 2398117, 2379208, 2308135, 2173147, 2054220, 1902290, 1802385, 1712337, 1628937, 1564987, 1451117, 1369212, 1343705, 1327341, 1286644]
8391A286644q6821n9406j2312j6920k6431j3279m3038m4429L913p1K121k233Q733
8378I96471o554p0653j0538j7854l398Q41J143J9882j8774k2685R0399M1787J8610
8365A018677J7736J3347j0373m237j7344N235m736j4723M6009L9305n6493n9937
8353I72466j4305l4397n7036p285K0983j2341j5519m117j987K4817l5574o1870
8341G73835J6240k3955j4506N389M2445N8050l6283j243l5404l2953m7281o2684
8329F41650m8359K3464K1819K2193M6516j8706q4024j2161M9207L8967J5639J484
8317F97689k6141m1524J9358L0249j510n0046j6868J6056j1906J2314L4965Q299
8305F70935N7159R626p6467L961L1534p553j5207J8306L6313L8608k6169K9697
$$ y = [1286644, 1199823, 1140417, 1128105, 1111185, 1084754, 1071475, 1028437, 984008, 987921, 987850, 989971, 987738, 996471, 989917, 919264, 908726, 890872, 887474, 888315, 889458, 909340, 890566, 867881, 958280, 1000067, 1018677, 1036413, 1049760, 1039387, 1035150, 1017806, 1023041, 1018305, 1003582, 1049591, 1088896, 1032403, 972466, 958161, 923764, 866728, 859443, 880426, 868085, 852566, 848449, 846462, 871279, 835705, 773835, 790075, 766120, 751614, 757003, 799448, 857498, 821215, 819972, 784568, 751615, 704334, 641650, 593291, 616755, 638574, 660767, 707283, 688577, 604553, 592392, 641599, 680566, 696205, 697689, 671548, 630024, 649382, 679631, 678121, 628075, 611207, 627263, 615357, 627671, 662636, 670935, 728094, 737720, 661253, 665214, 696748, 689195, 673988, 692294, 728607, 767215, 741046, 770743]
8293G70743J8055J1155J4133L3821m5874m5481m7631o1953l2594M57n0055O989
8281E71765M3069M3323K9165j7655m9383n5272R347J7602k6911J8308M6868K2487
8269F52713q5424l6465k844k383m7399n7693l1805J8594L1608K2011m805K5457
8257D81565Q4895L8926k6101N949L3150q990j948K433r535M172J3893M1584l8790
8244F21203m2716j3935o224n2816m7636j6908m5252n3518p0296K0668M2319j8883
8232C16006m4402p3784J4795L5640K3081J07621N7864j7182K2888j9537m938l8384
8220C79668N743k0883l3951P1119J26085J826q822j0785M823M3204M7535K0570
8208F26132O7363M8199P6975M5822N4007J28455J22215N4129L5809k3771k5566
$$ y = [770743, 788798, 799953, 814086, 847907, 802033, 756552, 708921, 646968, 614374, 614831, 564776, 571765, 614834, 658157, 687322, 669667, 620284, 565012, 574359, 591961, 565050, 583358, 630226, 652713, 567289, 530824, 527980, 525597, 478198, 420505, 388700, 407294, 438902, 460913, 456108, 481565, 566460, 605386, 579285, 585234, 618384, 609394, 607446, 609879, 600344, 604516, 618409, 659993, 621203, 578487, 564552, 558328, 505512, 457876, 440968, 395716, 342198, 271902, 292570, 334889, 316006, 271604, 197820, 212615, 248255, 271336, 378957, 436821, 419639, 442527, 422990, 418052, 379668, 385411, 364528, 330577, 401696, 527781, 529607, 520785, 510000, 514823, 558027, 605562, 626132, 693495, 741694, 818669, 864491, 918498, 1046953, 1169168, 1223297, 1259106, 1235335, 1209769]
8197A209769j4969p901j2256q5800n3398m6759K3609l4512q6726j16311o4945
8186G09801q8877m7220j03231l2930j4454M734k365p2593J5706L9128k6513J3644
8174C94830N5386o063q0201k0647L2428Q2967J25230P0903P1975O5206K883m9606
8162G45291j4481O1909J66700J08321J06109J36506J54503J30707J05743J55124
8152A856432J5256k5796L0810q4206q1273m0242r072O6643k100j22609j42248
8141A461595k07742k06159k21316j14560j03295l2489k5666n1888p6904j03605
8131C17971k358J421m998j3469J5886L5968l0971l0838k5042N8571J00197K3791
8119D46129L3006L9375Q4280N6148M1983L5787O6897J20772R1920O2701Q4P7275
$$ y = [1209769, 1194800, 1186899, 1174643, 1088843, 1035445, 988686, 1012295, 977783, 891057, 774746, 709801, 620924, 573704, 470473, 437543, 423089, 427823, 425458, 352865, 368571, 407699, 381186, 394830, 450216, 444153, 363952, 343305, 375733, 458700, 583930, 654833, 726808, 792014, 794897, 745291, 730810, 792719, 959419, 1067740, 1173849, 1310355, 1464858, 1595565, 1701308, 1856432, 1871688, 1845892, 1876702, 1792496, 1711223, 1670981, 1661909, 1728552, 1726452, 1603843, 1461595, 1253853, 1047694, 826378, 711818, 608523, 576034, 550368, 498480, 421576, 317971, 315613, 317034, 312036, 298567, 314453, 350421, 319450, 288612, 263570, 322141, 422338, 446129, 479135, 518510, 602790, 658938, 700921, 736708, 803605, 924377, 1016297, 1078998, 1079082, 1156357]
8107A156357J60870R5212M8666J34380R1476L9608j342K9992R4145J25028J14756
8096B089148R0818J12188J79069J61680J91640K52864L07034L70924M39440N03823
8086D698628N61240O35205P44044Q94359R61600J111441J218654J448968J651974
8077A3926113J809300K020597K338333K733302L297564M023197N069634O371004
8069D1589044Q118467J0472216J3450323J7013389K0262997K2046180K1767901
8062A54720517J9693328J4172449L927355p432802j6017660k1563873k3784388
8055A23714926k2410921j8576970j4138554j0400319p647295n707816m269117
8048D0563934l305576k539607j975740j522276j186141q97345o71719l93267j60766
$$ y = [1156357, 1317227, 1412439, 1461105, 1595485, 1686961, 1726569, 1725227, 1755219, 1849364, 1974392, 2089148, 2179966, 2292154, 2471223, 2632903, 2824543, 3077407, 3384441, 3755365, 4194805, 4698628, 5259868, 5895073, 6639117, 7533476, 8495076, 9606517, 10825171, 12274139, 13926113, 15735413, 17756010, 20094343, 22827645, 26125209, 30148406, 35218040, 41589044, 49707511, 60179727, 73630050, 90643439, 110906436, 132952616, 154720517, 174413845, 188586294, 192513649, 185080847, 169063187, 147499314, 123714926, 101304005, 82727035, 68588481, 58188162, 50540867, 44833051, 40563934, 37258358, 34718751, 32743011, 31220735, 30034594, 29137249, 28465530, 28072263, 27911497]
8039B7911497Q1762K91899N78968Q42254J213590J561382J852548K153722K473440
8030C8961062K785181L205622L735244M410279N373386O700897Q568469J1088279
8022H4828419J4483789J9259242K5890295L4889621M5474357N3752036N3285941
8015C31863700L8391630J0512230j9335684m0987559n0967289m9934644m2198187
8008A77344197l2480200k3981637j7679815j3148896j0000383p752990o055470
8001F6244806m780706l898620l281916k900761k492717k273543j956934j570791
7993D3088818j313547j048607q05024m59763k18447q2565Q0333K49562M43856
7984C9934616O72694R70400J268435J737732K240479K852466L683329M869145
$$ y = [27911497, 27993259, 28285158, 28864126, 29706380, 30919970, 32481352, 34333900, 36487622, 38961062, 41746243, 44951865, 48687109, 53097388, 58470774, 65171671, 73740140, 84828419, 99312208, 118571450, 144461745, 179351366, 224825723, 278577759, 331863700, 370255330, 380767560, 361431876, 320444317, 269477028, 219542384, 177344197, 144863997, 120882360, 103202545, 90053649, 80053266, 72300276, 66244806, 61464100, 57565480, 54283564, 51382803, 48890086, 46616543, 44659609, 43088818, 41775271, 40726664, 39921640, 39461877, 39243430, 39160865, 39241198, 39490760, 39934616, 40607310, 41577710, 42846145, 44583877, 46824356, 49676822, 53360151, 58229296]
7976E8229296O416524Q394974J0800722J3332536J5141401J5384025J3965996
7969A41665474J1040895N398262k817005r381679j2216751j3580264j5021015
7962A05087917j5209892j3505212j0874261q320971o123807m632852l595711k899513
7954C9925698k338241j934348j690801j512321j322200j157335j077904r11165
7946B7981383q44953p80903o70576n46649m94706m96323m35391m21569l82720
7937B2907593l49100k90615l21141k57922k06972k07794k73840k83454k80529
7928B0436226l54541m03975m24579m10862m51744m98740m12119l69152l52490
7919A6758024m12397l61134l28220l12786k77980k79640k70248l53192k48129
$$ y = [58229296, 64645820, 73040794, 83841516, 97174052, 112315453, 127699478, 141665474, 152706369, 158104631, 155287626, 145905947, 133689196, 120108932, 105087917, 89878025, 76372813, 65498552, 57177581, 51053774, 46420922, 42825211, 39925698, 37587457, 35653109, 33962308, 32449987, 31127787, 29970452, 28892548, 27981383, 27136430, 26355527, 25684951, 25138302, 24643596, 24147273, 23711882, 23290313, 22907593, 22558493, 22267878, 21946737, 21688815, 21481843, 21274049, 21000209, 20716755, 20436226, 20081685, 19677710, 19253131, 18842269, 18390525, 17891785, 17479666, 17110514, 16758024, 16345627, 15984493, 15656273, 15343487, 15065507, 14785867, 14515619, 14162427, 13914298]
7910A3914298k38156j73946j95946j99265k29459k27600k05793j18027q7265r1581
7900A2147260j40059j81859j11796o8442j18640o2828p9848o829j9401q2972p4338
7889A1200248j70919k00104j57888k21451k78820k75077k58977k19739k00827
7880I216446k15340l23316l91337l79426l05241k44727k16211j79900j99489k17327
7870F544132j68054j50426j21330j16732j14092j08584j16653j45555j38735j29813
7860E234158r1381j14506o9086r1869r2141n7436n6448l1023n6902o4673k9241
7849D479452l3209j2708n0220o5917j8522l4569p6769j04737j26966r9972j36779
7838C719084q1177j12257j45345r1919p3806m0080j22192n9500r3464j24845j02912
$$ y = [13914298, 13676142, 13502196, 13306250, 13106985, 12877526, 12649926, 12444133, 12326106, 12238841, 12147260, 12007201, 11825342, 11713546, 11645104, 11526464, 11463636, 11383788, 11376959, 11357558, 11274586, 11200248, 11029329, 10829225, 10671337, 10449886, 10171066, 9895989, 9637012, 9417273, 9216446, 9001106, 8677790, 8286453, 7907027, 7601786, 7357059, 7140848, 6960948, 6761459, 6544132, 6376078, 6225652, 6104322, 5987590, 5873498, 5764914, 5648261, 5502706, 5363971, 5234158, 5142777, 5028271, 4959185, 4867316, 4775175, 4717739, 4661291, 4630268, 4573366, 4508693, 4479452, 4446243, 4433535, 4383315, 4317398, 4298876, 4264307, 4187538, 4082801, 3955835, 3855863, 3719084, 3637907, 3525650, 3380305, 3288386, 3214580, 3174500, 3052308, 2992808, 2899344, 2774499, 2671587]
7827B671587p6541o8489P421L7788l435n2837o8998j7397l0345m7758K612j250
7815B352358k83l3341k1817n850m3952k8844k5831M3172m052O280M1801n2476
7803B227165n4384k3309J3160L4138L5012k7757r2010P613P5351J9371K1781q423
7791B227708k5928k5864J01m5680p2816K4026O7356k7189m3376J5559j0508r147
7779B074242K7071R9l297m885K3657j6215p0704J5636N201R857P5389j9264m7439
7766B069348N5834j2049k7527j1637K5047R521m8083l3111j2421r0158o949K0128
7754A937943L4976r0095n6491L2365M1518q194k679p4442n186j4833O439l2151
7742A769170l060N955j0935l5010k9468l421L9158k332j7938j2844o0483o0856
$$ y = [2671587, 2595046, 2526557, 2533978, 2571766, 2568331, 2515494, 2446496, 2429099, 2398754, 2350996, 2353608, 2352358, 2352075, 2318734, 2296917, 2291067, 2247115, 2218271, 2192440, 2235612, 2231560, 2237840, 2279641, 2227165, 2172781, 2149472, 2162632, 2196770, 2231782, 2204025, 2112015, 2119628, 2194979, 2214350, 2236131, 2227708, 2201780, 2175916, 2176017, 2130337, 2057521, 2081547, 2148903, 2121714, 2078338, 2093897, 2083389, 2074242, 2101313, 2101412, 2098115, 2093230, 2116887, 2100672, 2029968, 2045604, 2050805, 2060662, 2136051, 2116787, 2069348, 2125182, 2113133, 2085606, 2073969, 2099016, 2108537, 2060454, 2027343, 2014922, 1924764, 1917815, 1937943, 1972919, 1882824, 1826333, 1858698, 1900216, 1892022, 1889343, 1814901, 1809715, 1794882, 1801321, 1769170, 1766110, 1772065, 1761130, 1726120, 1696652, 1693231, 1732389, 1730057, 1712119, 1699275, 1638792, 1577936]
7730A577936n9253O013J9991J7718k147m1467l0217k1321n0967N869J9812P590
7718A449557k8902l1706j1160M637o2804j0817l5925k6651l1857m6060l1670O050
7706A142692Q40P9591M7536r291m5201q510J8263j7831l0771k5022j1767M0024
7694A180553L6055k4872n7404l9776l824K7963J4702L71M483P578l6974j5535
7682A093320k4082l049K8199k057L12l3137N0024P2475J6654M1589O4678K8234
7670A333160Q4409P3105Q0025J02060R3268O0798R7767P1471n3885q6750j19139
7659A736289j86952j68399r6625m1692n0245n6802o8108k1911P166l083M702R211
7647A063551K7614J0852m153L1387M04k2441p3093L4170P4560m0875o6455J4415
$$ y = [1577936, 1518683, 1524696, 1544687, 1562405, 1560258, 1518791, 1488574, 1467253, 1416286, 1422155, 1441967, 1449557, 1420655, 1388949, 1377789, 1382426, 1319622, 1308805, 1272880, 1246229, 1214372, 1168312, 1136642, 1142692, 1143532, 1223123, 1270659, 1261368, 1216167, 1207657, 1225920, 1208089, 1177318, 1152296, 1140529, 1180553, 1216608, 1191736, 1134332, 1094556, 1090732, 1118695, 1133397, 1133768, 1138251, 1145829, 1108855, 1093320, 1069238, 1066189, 1094388, 1092331, 1092643, 1059506, 1109530, 1182005, 1198659, 1240248, 1304926, 1333160, 1417569, 1490674, 1570699, 1672759, 1766027, 1826825, 1924592, 1996063, 1942178, 1855428, 1736289, 1549337, 1380938, 1284313, 1242621, 1192376, 1135574, 1067466, 1045555, 1052721, 1049638, 1054340, 1063551, 1091165, 1102017, 1097864, 1129251, 1129655, 1107214, 1034121, 1068291, 1142851, 1101976, 1035521, 1049936]
7635A049936J4472K3034J7045j1411O085L7647O8475O3955N3918L0621K9860M3883
7623A427520R2942K20393K84312L42325L36725K42097o91j98966l85223l20337
7613B041097k15710j42483j38225j31732j09421m5251j130k8521m1612n1179n2457
7602A083376j155j1625n2479q095l5865k1650J0831K1724O1050R447k9915l0275
7590I95369L6219M1875j3757o3262m2341L2372N9261l8794l6868J2453J5036j321
7578I96242J3455P2636N0970J16343J51806P9779R3316P5860K2917r8401j89959
7567A384964j49984q3295o2670k7872p6779m4290m9279k9219n0697j4422N7238
7556H53695O489n1309j9802M3985K0037j618J5295L8119k3908n3179m0029M7355
$$ y = [1049936, 1064408, 1087442, 1104487, 1093076, 1099161, 1136808, 1205283, 1269238, 1323156, 1353777, 1383637, 1427520, 1520462, 1740855, 2025167, 2367492, 2704217, 2946314, 2945623, 2746657, 2361434, 2041097, 1825387, 1682904, 1544679, 1412947, 1303526, 1258275, 1257145, 1228624, 1187012, 1135833, 1083376, 1082221, 1070596, 1018117, 1010022, 974157, 952507, 963338, 985062, 1046112, 1055559, 1025644, 995369, 1031588, 1073463, 1059706, 996444, 954103, 986475, 1045736, 1006942, 970074, 982527, 997563, 996242, 1009697, 1082333, 1133303, 1249646, 1401452, 1481231, 1574547, 1650407, 1673324, 1574923, 1384964, 1234980, 1151685, 1089015, 1061143, 984364, 940074, 890795, 861576, 810879, 796457, 853695, 860184, 808875, 789073, 833058, 853095, 851477, 866772, 904891, 880983, 827804, 787775, 835130]
7544H35130p7876l65L7051L4650l3996m3557r343k9222m5219j5938L2513m35n1849
7531F31544j2593M1537P7142N7876l6135k359J9974n5859q941q8073n8106M6193
7519F12200K5836J9646k2351k5602j5146P9581M0575q626q595m2514o7094n230
7507E82680N4100M9817p993m565m4383L669N1692N2592N8071m0675o7319m7102
7495F40584j6414k1704n3248L7953J5006M2143k0932J660L3244p075k0794j4768
7483F15655K006p000k0615J2107k5320k2764O759r331j7085M6788Q0337n8746
7471F02791o2805n3890J2223O1305P3118l7565p0627n3296j0419K6744k8977R916
7459D68518M3213P247l6576K1500N9217k777l3590q5393n0142N1027M1440K1375
$$ y = [835130, 757254, 756889, 793940, 828590, 794594, 751037, 741694, 712472, 667253, 651315, 683828, 683393, 631544, 618951, 660488, 737630, 795506, 759371, 757012, 776986, 721127, 712186, 624113, 566007, 612200, 638036, 657682, 635331, 609729, 594583, 674164, 714739, 706113, 697518, 655004, 587910, 582680, 636780, 686597, 678604, 674039, 629656, 633325, 685017, 737609, 795680, 755005, 687686, 640584, 624170, 602466, 549218, 587171, 602177, 644320, 623388, 625048, 658292, 651217, 630423, 615655, 617661, 610661, 590046, 602153, 576833, 554069, 560828, 551497, 534412, 581200, 661537, 602791, 539986, 486096, 498319, 559624, 632742, 595177, 524550, 471254, 460835, 487579, 458602, 468518, 511731, 518978, 482402, 503902, 563119, 560342, 526752, 441359, 391217, 442244, 483684, 505059]
7447E05059j6161P439k2292m9134j5279J8553o507O0389L552K0190L7599o0062
7435D83346m4900N8147J1751j0737J1450M6264K2425n0776m9310P01L2746M4202
7423E55309L8601p1435m6500M957L3908m7109Q753l8509K4257K4706K5061j8829
7411D93170k6759n9j9934k2533j0178k5461q995L4399J0262J606m6076K2769L8491
7398D40702L2407L055K5187K6735J5856k095n1778o4371L7316r323n6060r413
7386C88218n0578J9304O0530M3336q7546k5777J1610R248M443l9681R342K4579
7374C67028K3976m1189Q092N0409Q710m1171j8877n9790J8421K3777N0529r10
7362C89005K7609L1045n872m1414p6017n055J7437K9596L1235J3643l9556K7081
$$ y = [505059, 488898, 496337, 474045, 424911, 409632, 428185, 421678, 482067, 485619, 505809, 543408, 483346, 438446, 496593, 508344, 497607, 509057, 555321, 577746, 526970, 477660, 478361, 511107, 555309, 593910, 522475, 475975, 480932, 514840, 467731, 476484, 437975, 462232, 486938, 511999, 493170, 466411, 466352, 446418, 423885, 413707, 388246, 379251, 413650, 423912, 425518, 379442, 402211, 440702, 473109, 476164, 501351, 528086, 543942, 541847, 490069, 425698, 463014, 453691, 397631, 388218, 337640, 356944, 417474, 460810, 373264, 347487, 359097, 368345, 372788, 333107, 342449, 367028, 391004, 349815, 357907, 408316, 417026, 375855, 356978, 297188, 315609, 339386, 389915, 389005, 416614, 447659, 441787, 400373, 324356, 319301, 336738, 366334, 397569, 411212, 371656, 398737]
7350C98737J9122k7591j0953J5927j5917M769k5078K706j0710P884N0279M2807
7338D51982j0420O439o383k4922L0404J1080N756j5526n8974l8979Q793J9528
7326C78778R747p694n2467R003N0114L2056k393l6217m03m6387l9151L9729J2232
7313C46947k16N5812K0369K3365m0352k8641O842M133M0381k205p3831l2492N950
7300C26062m6141O974M8669N4755j0691J4759L6615l2467q3969n228o1246L3525
7288B81617M5000k0317k2839o2112j9069L874m955N0104j5904P509j3060Q78L1355
7275B62081J755L0381N9554l0031n3367k738J7261k5062j531K4386k0715J8152
7263B80126J4344K8176J08M2266q534p6345K503K5428J9566n5252k2321J335K7122
$$ y = [398737, 417859, 390268, 379315, 395242, 379325, 384094, 359016, 361722, 351012, 358896, 409175, 451982, 441562, 448001, 441618, 416696, 447100, 458180, 463936, 448410, 389436, 350457, 359250, 378778, 388525, 380831, 328364, 337367, 387481, 419537, 417144, 380927, 380524, 334137, 294986, 334715, 346947, 346731, 402543, 422912, 446277, 405925, 377284, 384126, 388259, 428640, 426435, 352604, 320112, 326062, 279921, 286895, 335564, 390319, 379628, 394387, 431002, 398535, 314566, 309338, 248092, 281617, 326617, 306300, 283461, 221349, 202280, 206154, 201199, 251303, 235399, 242908, 229848, 230726, 262081, 263836, 294217, 353771, 323740, 270373, 267635, 284896, 259834, 258303, 282689, 261974, 280126, 294470, 322646, 322754, 365020, 356486, 280141, 282644, 308072, 327638, 272386, 250065, 251400, 278522]
7250B78522L2264n08p870M6523J9509k1238j2552j8792j7963j1608k9454j9810
7238B37023J9565L1984J097M368n8323j4541m5973k587N0703N1546L7654M2216
7226C54732j9361M961k7535n5108k2800J8921J9276J8176R303m670m969K423j5784
7213B77565l9036l3541l8475J6411N4353k989M8916J7341m6743N60K4408N0548
7201C29318J5909m664l3167l2173J462p965J4941j636J0493K5461M648m4541L334
7188B81420k2725M9272L8943j5070o5675M936P126k1950j546N3R938j77M5274
7175C09819O6991m1253l4026l4579o3468j4120k4623K8142J4839m060K6267j009
7163B28920K4555O507K3363n2411o6550j897O36l2277N639O011J2342O723L174
$$ y = [278522, 310786, 310278, 302408, 348931, 368440, 347202, 334650, 315858, 297895, 286287, 256833, 237023, 256588, 288572, 289669, 294037, 235714, 221173, 175200, 172613, 223316, 274862, 312516, 354732, 335371, 340332, 312797, 257689, 234889, 253810, 273086, 291262, 300565, 295895, 290926, 293349, 277565, 238529, 204988, 166513, 182924, 237277, 234288, 283204, 300545, 253802, 254362, 278770, 329318, 345227, 340563, 307396, 275223, 276685, 268720, 283661, 282025, 292518, 317979, 322627, 278086, 281420, 258695, 307967, 346910, 331840, 266165, 271101, 278227, 256277, 254731, 254784, 264722, 264545, 309819, 376810, 335557, 301531, 266952, 203484, 189364, 164741, 192883, 207722, 203662, 229929, 228920, 253475, 259982, 283345, 230934, 164384, 162487, 163123, 130846, 136485, 142496, 154838, 161561, 164735]
7150A64735K8140K4048J6108k6856q330N8816L6985l4073N7881r157o6912m8699
7138A92686Q468O620k8145n1418L0030P3014L7550k3921P36J7310j5645l4321
7126B12964m0094J0912O128P605R989k3840R404K2584Q175l9278j3170L2063O002
7113B09444k4426k8507L1517J1800J8019l5487O516l171l2637m8764k9074n683
7101F9547J542O099J5117K5300L1604J7839o3470l2937r004J0811L1708K7213
7089A31369P891K8266k6445m7937M7679K6700r075L3598l454k0138M2905K4550
7077B35909K2010k3214m3146j423P3754k3030j09744o7046J5540P4740l1311j8408
7065A04631P8377J9037M9211j4550k7857m7997q84L4592r636P3268o811q8638
$$ y = [164735, 192875, 216923, 233031, 206175, 197845, 256661, 293646, 259573, 317454, 308297, 241385, 192686, 201154, 207774, 179629, 128211, 158241, 231255, 268805, 244884, 245620, 262930, 247285, 212964, 172870, 183782, 189910, 197515, 207504, 183664, 193068, 215652, 223827, 184549, 171379, 203442, 209444, 185018, 156511, 188028, 199828, 217847, 182360, 188876, 185705, 153068, 104304, 75230, 69547, 71089, 77188, 92305, 117605, 149209, 167048, 103578, 70641, 61637, 72448, 104156, 131369, 139260, 167526, 141081, 93144, 140823, 167523, 158448, 192046, 188592, 168454, 211359, 235909, 257919, 234705, 191559, 190136, 263890, 240860, 131116, 64070, 79610, 154350, 123039, 104631, 183008, 202045, 251256, 236706, 208849, 160852, 159968, 194560, 184924, 258192, 251381, 162743]
7053A62743J3002K2968P3900K1248j3681K8660k3124p4934o9590m3282Q701L3021
7041A39632K8480o621K9625O736J6701k098N1510j0865k1762K6566J5116m1260
7029B31760q810m5321l1340R297P1418M0497q8861j7746M4353k7647j3266L8902
7017B03236j1768l118L2417J6885k5887N47J7697K3430o0588o2115j3785R6453
7005B13404L6978j7416p001j7246L8274m2448q3988M947Q2826P2213k6143l5968
6993B18432j4366k9489n1644J1018L9942l5772J0164J36110M6261p8291n7253
6982A95112j4545L6316J4836K0243R72j9006M7164m5557o5745k740P6325l281
6970B40094p0201m6950j2381K9922L0484O452J9902k9676k48K9924l8992n927
$$ y = [162743, 175745, 198713, 272613, 293861, 280180, 308840, 285716, 210782, 141192, 97910, 106611, 139632, 168112, 161491, 191116, 197852, 214553, 212455, 263965, 253100, 231338, 257904, 273020, 231760, 222950, 177629, 146289, 155586, 227004, 267501, 178640, 160894, 205247, 177600, 164334, 203236, 191468, 188350, 220767, 237652, 211765, 212312, 230009, 253439, 192851, 130736, 116951, 213404, 250382, 232966, 225965, 208719, 246993, 204545, 120557, 125504, 208330, 280543, 254400, 218432, 204066, 174577, 122933, 133951, 173893, 138121, 148285, 284395, 330656, 252365, 195112, 180567, 216883, 231719, 251962, 252934, 233928, 281092, 235535, 169790, 167050, 243375, 240094, 169893, 122943, 110562, 140484, 170968, 177420, 197322, 167646, 167398, 197322, 158330, 152403]
6958A52403J5004j9422k5072M436r018J6636N196K7259m3638r3136J2736M2965
6946H6349N8059K8264J9117l5223o817M0997q320K0282O9488j1197Q058j8438
6934B50619J3547j8279J7598m0840Q45O1671l483j1598p7606j04437q0843K9225
6922C6419o59M4196N0849N2495L3409n2861n1478m3601n676J3453M3725L513j7162
6909A06622l4387J6204j9966P231J814N251L5703J2127m921L0370L596K4355Q957
6896A92956r728j5899L8682j8064o433L4805J52l9163k9497j7103K3471K7686
6884A81865L5149K4248l4589j3235N612l4700L4127O287m4108n7503p466L5776
6872A31463j995J766R992L009J8310j3456L0914j0414k7261j0763p166M3631K1046
$$ y = [152403, 167407, 147985, 122913, 127349, 118331, 134967, 140163, 167422, 123784, 30648, 43384, 86349, 144408, 172672, 191789, 156566, 149749, 190746, 182426, 202708, 272196, 260999, 269057, 250619, 264166, 245887, 263485, 222645, 223490, 285161, 281678, 270080, 192474, 88037, 7194, 36419, 35760, 79956, 130805, 183300, 216709, 163848, 112370, 68769, 63093, 76546, 120271, 123784, 106622, 72235, 88439, 68473, 75704, 77518, 82769, 118472, 130599, 125678, 156048, 159644, 183999, 192956, 183228, 167329, 206011, 187947, 181514, 216319, 216471, 177308, 147811, 130708, 154179, 181865, 217014, 241262, 206673, 193438, 199050, 164350, 198477, 204764, 160656, 103153, 95687, 131463, 129468, 131234, 141226, 144235, 162545, 149089, 180003, 169589, 142328, 131565, 124399, 168030, 189076]
6859A89076l346L5989n7032J133J8372m7955p3568j8841Q1484J3223k012k5750
6847A10773M0122N1025j2102m8585n4008j827K0789J4587k0012l099l1660K6944
6835I2947L3699K1741k0002M7635j2474k602L2068m5859r709p033Q813o9935M0612
6822A09901K2785L0110K8132j8066p5590k0159J834j4019L9864J2289l7248K0619
6810A00452M1291M1253j7762m1404k431m7556k8761K95k740L8288K8567J4558
6798A24050l0255Q245o072J6304n5261j0079N3044J5998J8431j384L1055k6172
6786A37904n3871K4242L7476j8078o1044K7118K1661l5147j4308N514j6470j3872
6774D1125j3004N8846n699K4341P403l2567j5132k2699K4251j55J9353M8540J1963
$$ y = [189076, 185730, 221719, 164687, 165820, 184192, 136237, 62669, 43828, 125312, 138535, 136523, 110773, 150895, 201920, 189818, 141233, 87225, 85398, 106187, 120774, 100762, 97663, 66003, 92947, 126646, 148387, 128385, 176020, 163546, 160944, 193012, 147153, 137444, 130411, 139224, 69289, 109901, 132686, 162796, 190928, 172862, 97272, 77113, 78947, 64928, 104792, 117081, 79833, 100452, 141743, 182996, 165234, 123830, 121399, 73843, 45082, 45377, 42637, 80925, 109492, 124050, 93795, 102040, 95968, 112272, 57011, 46932, 99976, 115974, 134405, 133021, 164076, 137904, 84033, 108275, 145751, 127673, 66629, 93747, 115408, 80261, 65953, 71467, 54997, 41125, 28121, 86967, 81268, 105609, 113012, 80445, 65313, 42614, 66865, 66710, 86063, 134603, 146566]
6761A46566k48K6250k0525m2177n4921l1195K259j5857M9062O0431K3862K764
6749A46271j0164l3196m0648l501L9535L8884L1627L2336j7900o7527j6990J0854
6737A09581l3518R257m731r238K3751N2544j0086j7281m7653n1335L2034R504
6725F2829o2175k4586N7168J8421K5797J21035K1496m5037m0981o218J822p792
6713A21779l3903j9798j1567k9496K7574J0160l890J0996Q875P718k9040j7522
6701D1886N6595J4236J6821m4708L0018j2966l7832m1998m0047J4968O5166j5889
6689D6250l8455K5016L2386K0435L4702L2549K8896m2803r133k0026J3288N4964
6677A78069L7446l4292k2388k5160P367k8024m6218n527L51k1739k6061P5646
$$ y = [146566, 146318, 172568, 152043, 109866, 54945, 23750, 26009, 10152, 59214, 119645, 143507, 146271, 136107, 102911, 62263, 58762, 98297, 137181, 168808, 201144, 183244, 115717, 98727, 109581, 76063, 85320, 80589, 71351, 95102, 147646, 137560, 120279, 72626, 21291, 53325, 62829, 654, -23932, 33236, 51657, 77454, 198489, 219985, 174948, 133967, 127749, 129571, 121779, 87876, 68078, 56511, 27015, 54589, 64749, 60859, 71855, 80730, 88448, 59408, 41886, 98481, 112717, 129538, 84830, 114848, 101882, 64050, 22052, -17995, -3027, 62139, 46250, 7795, 32811, 65197, 85632, 120334, 152883, 181779, 138976, 129843, 109817, 123105, 178069, 215515, 181223, 158835, 133675, 141042, 113018, 66800, 61273, 61624, 39885, 13824, 89470]
6665H9470J339L2679K4821j0488l8293m4374K1153K3587k383L0892l924l3161
6653I1318k4627K0394M2573m1918l8525k2508Q098M4452L8901J9700o496m2490
6641H8872m2676J4638L0373M3930q518j7335j3974N8581O2898l2804r0214m5378
6629D8393k9437J4383q72o4594k0427K5236N2246M897J2246J4621L0539P683M2449
6616A37363k7063l0638P857L718j2339L3878J8072m167J6980J249J2873r993l6825
6603A10965k7513j5325N2360L9164m4041j4247L1121j5819K351n0117k0622K0341
6591F8618j452K11L7181l820k944J1112j1379R845k2350j168k284o9207j0199
6578B164Q0188L4489k7548j1291k5089M5588L0798m9892m6713L2828O044P505
$$ y = [89470, 90809, 123488, 148309, 137821, 99528, 55154, 76307, 99894, 97511, 128403, 124479, 91318, 66691, 87085, 129658, 87740, 49215, 26707, 34805, 79257, 118158, 137858, 131362, 88872, 46196, 60834, 91207, 135137, 126619, 109284, 95310, 153891, 216789, 183985, 93771, 48393, 18956, 33339, 32467, -32127, -52554, -27318, 24928, 29825, 42071, 56692, 87231, 94914, 137363, 110300, 79662, 87519, 91237, 78898, 112776, 130848, 126681, 143661, 144910, 157783, 147790, 110965, 83452, 68127, 120487, 159651, 115610, 101363, 132484, 116665, 119016, 68899, 48277, 68618, 67166, 67377, 104558, 100738, 97794, 108906, 97527, 107372, 85022, 83854, 81570, 12363, 2164, 82352, 116841, 89293, 78002, 52913, 98501, 129299, 79407, 32694, 65522, 71566, 79071]
6566G9071j2709l0842K1438k9618j2539K6288J00003N982m6618P856q59n378J5427
6553A17502l2536m5858n344j5399L7875j7160m6117q813J5447M4734O4907Q704
6541A17942J5702L961m768l69l6276L064O637l5597n7460L0036L4698L5271K6068
6528A38909o1701k1251r238M1734N6619j4234n4593m9205J1468Q72K5753J6404
6516H1537J8145j6920M28K2627m1426q113r580k8973j9318L9970K164K5985k5648
6503D0878N0450N175j1483J5675j9580P730J5449k8127n548K8246M154l283J1726
6490A11462J1552L2315n3121K2811K5964m3886m3289l055j0096m118K9633O348
6478H2520l1799j9761J2523J2251n746J9929K3164k1794j5449K8805L4508L2967
$$ y = [79071, 66362, 35520, 56958, 27340, 14801, 41089, 141092, 147074, 100456, 108312, 107453, 102075, 117502, 84966, 39108, 33764, 18365, 56240, 39080, -7037, -15850, -403, 44331, 109238, 117942, 133644, 137605, 132837, 132468, 96192, 99256, 105893, 70296, 12836, 42872, 77570, 112841, 138909, 77208, 55957, 46719, 88453, 145072, 130838, 76245, 27040, 38508, 39380, 65133, 81537, 99682, 82762, 83190, 105817, 64391, 56278, 46698, 17725, -1593, 38377, 40541, 66526, 40878, 91328, 96503, 85020, 100695, 81115, 88845, 104294, 76167, 70619, 98865, 103019, 99736, 111462, 123014, 155329, 102208, 125019, 150983, 107097, 63808, 60753, 50657, 46539, 76172, 82520, 50721, 30960, 43483, 55734, 49988, 69917, 93081, 71287, 55838, 84643, 119151, 152118]
6466A52118j1150k4645J3804m3341m0809J1338L7747J6133m3374k1326J5527j5075
6454D6947L285m2878j9662J9958k5532K9604O2450K4871q557N940r4M7232M1838
6441A85402n4612j6808q286O189m4558m6482K346P1994L9244l8133m2765R431
6429F2962L5967k1041j5040P925k8969P5L2396K8631k0075K578P859J6331J4271
6416A23870m1570K9442P6214j800k092j5976k5946l0231k2120p9685p4436J4487
6404d9843O8052J1819J924M390m2177l4227J7659J2245l8698J4565L1616J2250
6392I575M0126L5691N5834l2929J7630M6874o8149k7677K2109o043j618l3675
6380E7748n1881j9210K6615m1949j5686M2116L1995L428M9332J9526J3734N159
$$ y = [152118, 140968, 116323, 130127, 86786, 45977, 57315, 95062, 111195, 67821, 46495, 62022, 46947, 50232, 7354, -12308, 7650, -17882, 11722, 74172, 99043, 90486, 96426, 96332, 143564, 185402, 130790, 113982, 105696, 111885, 67327, 20845, 23191, 95185, 134429, 96296, 53531, 62962, 98929, 77888, 62848, 70773, 41804, 41879, 74275, 102906, 82831, 85409, 93268, 109599, 123870, 82300, 111742, 187956, 186156, 184064, 168088, 142142, 111911, 89791, 10106, -64330, -49843, 18209, 30028, 31952, 36342, -5835, -40062, -22403, -10158, -48856, -34291, -2675, 9575, 49701, 85392, 141226, 108297, 125927, 172801, 104652, 76975, 99084, 93041, 91423, 57748, 5867, -13343, 13272, -28677, -44363, -2247, 29748, 33176, 82508, 102034, 115768, 120927]
6368A20927k1947m5516m709N849j9861O47J1629J0249J2893K9076l0615l3787
6356C4835k4432j090j4398l7231K7523J0029j163l3634j4534J1447K6007N1012
6344C4371Q073k4694m4002l1158Q3567M5337M0800K5027l0417K0321K9631l5473
6332A21383q655l4716K3252L9218N920r3702j2815J3242L596R36k574o1243l1056
6319c7214M945L1684k6655m9015K0289Q033L4030L6790L4487k3255M789K2750
6307F1658j9331O615L7892j3239L0103P607j3643k793m0698n5897q971k47K2871
6294A1927O8355Q0029J2817j2431k1797m4997l0712l3516o1985o2099j7032Q0821
6282c0620O0876r465p290N1018R704R778m4989m5927J419N565n140j8403j868
$$ y = [120927, 98980, 53464, 48755, 54604, 34743, 35390, 47019, 57268, 70161, 99237, 68622, 34835, 10403, 9313, -5085, -42316, -14793, -4764, -5927, -39561, -54095, -42648, -16641, 34371, 42444, 17750, -26252, -57410, 26157, 71494, 112294, 137321, 106904, 127225, 156856, 121383, 112728, 78012, 101264, 140482, 146402, 52700, 39885, 53127, 56723, 57659, 55085, -6158, -37214, -32269, -585, -27240, -76255, -55966, -47933, -13903, 22887, 57374, 34119, 38908, 61658, 42327, 48942, 86834, 73595, 103698, 111305, 97662, 94869, 54171, -1726, -10697, -10944, 11927, 80282, 160311, 173128, 160697, 138900, 93903, 63191, 29675, -32310, -94409, -111441, -30620, 30256, 20791, 13501, 64519, 74223, 84001, 39012, -6915, -5496, 69, -5071, -23474, -25342]
6269b5342J1562m882L134M9779K4453m981m810J4955J0386l0387o1370l7407K1253
6256c3657j9982j9295m4583R65M6870R4344Q7395K3378n4947m745j1066k3694
6244D0983J6950K4052k6545k846q295l9280O1256K104k3669m8261l4217o908l888
6231d8564j8489K619j1376q599L6551P645J8401K6301k0980M8590K9050j9344
6219D1805j818J5623L3240P710o638K4713J5825k6863q1516m7091r39N2793L2401
6206E9245m4796l8778M2942N5174o956k1337k7485L5688K9832m3859L4287K8261
6194A02218j0686j3926j0167k7972l2215k9622j4333r207M8420M2142l1806m4179
6182c1333R859k7088J3784K8097L9800J7086Nj3195p6100N0161Q7282p7663K7651
$$ y = [-25342, -13780, -18662, -15528, 34251, 58704, 53723, 48913, 63868, 74254, 43867, -17503, -54910, -33657, -53639, -72934, -117517, -116552, -69682, 24662, 112057, 135435, 80488, 75743, 64677, 40983, 57933, 81985, 55440, 52594, 44299, 5019, 66275, 68379, 44710, -3551, -37768, -44676, -48564, -67053, -64434, -75810, -84409, -47858, -40213, -21812, 4489, -16491, 32099, 61149, 41805, 39987, 55610, 88850, 96560, 89922, 114635, 130460, 103597, 22081, -25010, -25949, 26844, 59245, 14449, -24329, 18613, 73787, 66831, 45494, 18009, 53697, 83529, 39670, 73957, 102218, 91532, 77606, 67439, 39467, 7252, -22370, -36703, -45910, 2510, 44652, 12846, -31333, -21474, -48562, -34778, -6681, 33119, 50205, 50210, 37015, -39085, 11076, 98358, 20695, 48346]
6169D8346N8531K236j6791m4690j1407M586K8346m4484L1413M5812m2042R083
6157F8939O965J2356m8904m9204k3390O7958r853m7834l4571m598n971O5081l826
6144f852M6217J5448l7862J1509M6570n3772q0579M5752M8178J3315n0287j7119
6132a9482J0975k6085j6882l417l3406K5603K8684j1700M2320Q3939o1396k1445
6120b292j3419p151O4202L1579o66k1875j9560j486N870j4830l437O9052n8115
6107B7872m51K5398j7948L7127K9650Q165l9231l7716k8325J0390j0831m9366
6095d5266L9013J0429r757J0866o985l67q111o820J4243P9412L3626k0520j146
6082H8617j5074L2191m9139m4509l6257J7232K9120k4090K630P275J354N058M5336
$$ y = [48346, 106877, 109113, 92322, 47632, 36225, 40811, 69157, 24673, 56086, 101898, 59856, 68939, 75904, 88260, 39356, -9848, -33238, 34720, 24867, -22967, -57538, -62136, -68107, -3026, -6852, 39365, 54813, 16951, 28460, 75030, 21258, -59321, -13569, 34609, 47924, -2363, -19482, -8507, -34592, -51474, -54891, -88297, -62694, -34010, -45710, -3390, 80549, 19153, -2292, -15711, -22862, 41340, 72919, 72253, 50378, 30818, 29332, 35202, 20372, 16935, 85987, 27872, 27421, 52819, 34871, 71998, 101648, 109813, 70582, 32866, 4541, 14931, 4100, -45266, -6253, 4176, -5581, 5285, -1700, -2067, -10178, -16998, -2755, 76657, 110283, 89763, 88617, 73543, 105734, 56595, 12086, -24171, -6939, 22181, -1909, 721, 7996, 9350, 14408, 59744]
6069E9744J5811k8065k7767J8296M7571M8054j0692n3401l9926k4606N130L6471
6057D6620L2141j754j1941Q238j9131n9678k4320m1299Q3816N6182j1763k387
6045E4724j9083m083N465k5278m1210Q029J9399Q598k7209M1695o787K137l9856
6032b3459k7370J4296J3023K373m235l9904K1306N9009K6709N4042K6728m6058
6020G6460n5535k8426J0041M5168j2090p8755J6616n631k6747j0971J4384K1741
6008c3745K7172L8661L5546J9263l1621n5336o822K5837J9099n51M2337k5770
5996E4070o426j6889M2166n4267l955N5580l4194l2671O9244J4354o0208n0866
5984b4062j998L0882J9894l5334j13O7711K0281J7913j4822k7105O601J0895l0897
$$ y = [59744, 75555, 47490, 19723, 38019, 85590, 133644, 122952, 69551, 29625, 5019, 10149, 46620, 78761, 77007, 65066, 73304, 54173, -5505, -29825, -71124, 12692, 68874, 57111, 54724, 35641, 31558, 37023, 11745, -29465, -21436, -2037, 6561, -20648, 21047, 14260, 16397, -23459, -50829, -36533, -23510, -21137, -25372, -65276, -43970, 15039, 41748, 95790, 122518, 76460, 20925, -7501, 2540, 47708, 35618, -43137, -26521, -32152, -58899, -69870, -55486, -33745, -6573, 32088, 67634, 86897, 55276, -60, -6882, 18955, 38054, 37503, 79840, 54070, 47644, 30755, 72921, 18654, 14699, 70279, 36085, 3414, 72658, 87012, 26804, -24062, -26060, 4822, 24716, -10618, -10731, 56980, 77261, 95174, 80352, 53247, 59848, 70743, 39846]
5971C9846k5894K6991J9066M4074K1105n0920j0643O844o7947L860j6475j1599
5959b1692K9860M9965p382m4339q090n0872K0371M8796K1295M1330K5188m4557
5947E9873q816O242q2074l3182J5887k4179j5460J06N8060J5706k8685J3442N7184
5934C4104K9522m2738o555p606P741Q107L9069j0610k249j8231m3258q2101L2977
5921f1828N0572J5893J4707k1650J9743P7688k744l3220n9517j5310J3148R969
5909G451n150n656K1774l1070j246k8811K6702L4817L5233J6029J0964o166p4504
5896C67m7804o576J2364J0154m9237J4078O9269N1863M4171m628n1783M353J5986
5883F2577j3540l9698O447K0315K7184j249k1769n5207k1486k6178K9357K5201
$$ y = [39846, 13952, 40943, 60009, 104083, 125188, 74268, 63625, 70469, 2522, 6382, -10093, -21692, 8168, 58133, 50751, 6412, -1678, -52550, -32179, 16617, 37912, 79242, 104430, 59873, 51057, 57299, -24775, -57957, -42070, -66249, -81709, -81603, -23543, -7837, -36522, -23080, 34104, 63626, 20888, 14333, 6727, 14468, 22575, 61644, 51034, 48785, 30554, -12704, -94805, -61828, -11256, 4637, 19344, -2306, 17437, 95125, 92381, 59161, -356, -15666, -2518, 7451, 2301, -3355, 18419, -12651, -13897, -42708, -16006, 18811, 54044, 70073, 81037, 74871, 367, -47437, -54013, -41649, -31495, -80732, -66654, 2615, 54478, 98649, 94021, 42238, 46591, 62577, 49037, 9339, 15786, 36101, 63285, 62036, 40267, -14940, -36426, -62604, -33247, -8046]
5871h046N473M5706J3675j2727l1621j6962l1918j5220O8951L8830m6086k3259
5859a3204K192j7169P599K9525J0734j0687l6962n8859j0459k9039M2856K7549
5847e5924K4727j4154r321N9137P6020K2482J0128r547l835J0796l7557j5721
5835E7231l9321J849p676K47j5551R263l5189M835N2074j2930n6648K0324J3664
5822g828N424l2504p023K3064K5626j6385m5581O217r965K545j9089O066O4452
5809d981L0740j7049k1775J8125K703M8169k5661j1167j5065K3939m491r4423
5797g0936m3626J6309N6656K0461l671J3157P0153R56l3622l1831l4365m9108
5785h9467J0725l043L034M3724m4991j4724L204K8186J5715J7120L9106k6951
$$ y = [-8046, -2573, 43133, 56808, 44081, 12460, -4502, -36420, -51640, 17311, 56141, 10055, -13204, -11012, -28181, -20582, 8943, 19677, 8990, -27972, -86831, -97290, -126329, -83473, -55924, -31197, -45351, -54672, 4465, 80485, 102967, 113095, 103548, 99713, 110509, 72952, 57231, 17910, 19759, 12083, 12330, -3221, 6042, -29147, -24312, 27762, 14832, -41816, -21492, -7828, -2404, -34908, -41931, -18867, 6759, -9626, -55207, -48990, -58955, -56410, -75499, -69433, -4981, 25759, 8710, -13065, 5060, 7763, 55932, 30271, 19104, 4039, 27978, 23487, -70936, -114562, -98253, -41597, -21136, -24807, -11650, 58503, 59459, 25837, -5994, -40359, -89467, -78742, -81785, -78751, -35027, -80018, -94742, -91538, -63352, -47637, -30517, 8589, -18362]
5773a8362m3246n220M3839j1173R968j9145Q730m2549k3611K3681R1190J5273
5761B9375l967L2873M5150n2910J2409L7059o9776m6110L4825J3976O243j9730
5749A9417m0658j8065K8772m1199R844P6850K874k7224M0888K0073l6086J472
5737C6958k764l0966J8765k5271l3616j8908M9479P8341J7367J5123m9466p3761
5725a8719k6393N5085L1180k7265J1703M5820k7657k1423N926J2635q103m2916
5713a0127J979k5909j6689R136J409K600J3546L9105P3242m538L169j1066m8121
5700B7736L2530j7228n5728K177J4813q947K9262m3190M046M6913l0226K1891
5688B4049L2558J1608J9329N860m0739r5897J5150K5807n849j8577Q370M8136
$$ y = [-18362, -61608, -66828, -22989, -34162, -24194, -43339, -34609, -77158, -100769, -77088, 14102, 29375, 25408, 58281, 103431, 50521, 62930, 99989, 30213, -15897, 18928, 32904, 39147, 19417, -21241, -39306, -10534, -51733, -41889, 34961, 37835, 10611, 51499, 71572, 35486, 36958, 34194, 3228, 21993, -3278, -36894, -55802, -6323, 72018, 89385, 104508, 55042, -18719, -45112, 9973, 41153, 13888, 25591, 71411, 43754, 22331, 28257, 40892, 32789, -10127, -8148, -34057, -50746, -41610, -40201, -37601, -24055, 15050, 88292, 83754, 86923, 75857, 27736, 60266, 43038, -12690, -10513, 4300, -4647, 24615, -18575, -14529, 32384, 2158, 24049, 56607, 68215, 87544, 93404, 52665, -43232, -28082, -2275, -8124, -26701, -18331, 29805]
5676B9805j2912l5933Q035J2992r322m2617j9957O2416J0719K7993k0970j1982
5664a733L9360K7633j3872j3259m915J8209j9751n788l8904L5970K7380n794q204
5651C6332n0426j6226K345k2021N525J1700l873J9284j4763n722j1093l8014L5293
5638e1659P43l5789N1521K7654m3789j1181K3263J0128k7350M4408P4864k276
5626F0537O160L7626o7614o0257J0343J1643J7422P547N2515P032k436k6670m3101
5613A0747m3974l1834K2391j4390M679J8418J4016K2420k1633K1574J1180J6581
5601C0175k0251l9085r316M340M249L8433L1591Q643P945j3229n008k0499j3869
5588D119L2009L2567k2355o2889M1442L4960j0838J9175n048l4087m9120m4487
$$ y = [29805, 16893, -19040, -11005, 1987, -7335, -49952, -69909, -7493, 3226, 31219, 10249, -1733, 37627, 65260, 51388, 38129, 33214, 51423, 31672, 25884, -13020, 22950, 50330, 44536, 36332, -14094, -30320, -27975, -49996, -44471, -32771, -36644, -17360, -32123, -37845, -48938, -86952, -51659, -50916, -86705, -35184, -7530, -51319, -62500, -39237, -29109, -56459, -12051, 62813, 60537, 66697, 104323, 36709, -23548, -13205, -1562, 15860, 23407, 75922, 82954, 80518, 53848, 10747, -33227, -65061, -42670, -57060, -52381, -33963, -19947, 2473, -19160, 2414, 13594, 30175, 9924, -29161, -38477, -34137, -29888, 8545, 40136, 48779, 56724, 43495, 38487, 17988, 4119, 36128, 68695, 46340, -16549, 24893, 59853, 49015, 68190, 63142, 29055, -20065, -64552]
5576f4552l11N653j3736K7458K5577j1883N7982L6217m6172k5893j7319L2278
5564E299k3473J6352O583l0107j3253J0142K089k9094N3187L2020k4680m305J0585
5551A1345J9071J654m0345n6021M6420K0625L117J7958j8162q044k2088k1656
5539d6126L997j0039J6148p422K8131m0561K9739J1640m557N652q734J7843l5896
5526d0185N2642M4127l0965l2200N141N648J3646K5921n154o512M958m7449j7511
5513b7893j7826L8492K8751M8922L7376r123j2032l510Q800n1215k7795L7809
5501E0756J0412k607r219l7784p977K892r419l1084j1957k4667r64M9558P238
5488a4822k1093N0627N2956k9831l1633k0990j0710k4007j9319L8890j8196l7999
$$ y = [-64552, -64863, -59210, -72946, -45488, -19911, -31794, 26188, 62405, 16233, -9660, -26979, 5299, -18174, -1822, 4761, -25346, -38599, -28457, -26368, -55462, -2275, 29745, 5065, 760, 11345, 30416, 32070, -8275, -64296, -17876, 2749, 5866, 23824, 5662, -2382, -24470, -46126, -42129, -52168, -36020, -43442, -15311, -55872, -26133, -14493, -19050, -13398, -22132, -4289, -40185, 12457, 56584, 25619, -6581, -1440, 4208, 17854, 43775, 38621, 32109, 37067, -10382, -27893, -45719, -7227, 21524, 70446, 107822, 98699, 86667, 83157, 91957, 40742, 12947, 50756, 61168, 58561, 49342, 11558, 3581, 6473, -2946, -34030, -45987, -70654, -71618, -22060, -14822, -35915, 14712, 67668, 37837, 6204, -14786, -25496, -49503, -68822, -29932, -48128, -86127]
5476h6127l3236L129M7617M9681n924p9298l8872j7031P6196M1228Q47n545j0485
5463e7820M6984L7928p368k6083j1336k6662L5625j1126K6919j3928k8201R611
5451b5457M7127J3648K9558L1788J9580q003n2212L083k869k2496p1536n8680
5439i6469j5842Q9515O7812K2998l5750j7641Q1632k5505l4898J5900l917l2736
5427A5099k7828P9041j9475j0558L8610k6731l5576q992l7251l1230J2357M8314
5415d220J3781J2686l620J346R247J221N3857J9478o7846j00955L1738M8358P686
5402B2757P385o487l7086j6964o486j410l058K6734K5221J7227j8222q6578L1947
5389d5020K4803n7166J7735Q2449l045n7725N0286O6638j8910j208l3372k1838
$$ y = [-86127, -119363, -116234, -68617, -18936, -24860, -104158, -143030, -160061, -83865, -42637, -41790, -47335, -57820, -10836, 27092, 19724, -6359, -17695, -44357, -8732, -19858, 7061, -6867, -35068, -25457, 21670, 35318, 64876, 96664, 116244, 108241, 56029, 59112, 56243, 33747, -37789, -96469, -112311, -22796, 45016, 68014, 32264, 14623, 96255, 70750, 35852, 51752, 47835, 15099, -12729, 66312, 46837, 36279, 74889, 48158, 12582, 3590, -33661, -64891, -52534, -4220, 9561, 22247, 18627, 19973, 29220, 30441, 84298, 103776, 35930, -65025, -33287, 15071, 22757, 30142, 23655, -13431, -30395, -36881, -38291, -41349, -14615, 10606, 27833, 9611, -76967, -45020, -20217, -77383, -59648, 22801, 19756, -37969, 12317, 78955, 60045, 58837, 25465, 3627]
5377C627l8544K3848k1385m6592L9946L1038J0367o387p5586J0594j3895j5072
5365i8041m3151J2500M832j3204Q9421j4320L3120P2732k0540k7714n6896l6294
5353i7555O0495K247l4444K1033L6512O194k7908j2927k7236n086L1381J6685
5341c0609k0611l847K7454O868M0688Q719J934m873p5419K6251Q9107k684k2655
5328D0323l1500o7522j2723k2472j1397L7885M6193M9256J722j17414m2457M1749
5316h8357J0696M766K0044L7972n8302n9175J7590N0371j228L5637J6200q4440
5304i8226o966O4229N2073k8268j7301N8643K2238k6309J9854J0268p0772n0431
5292g0968M843M9100k6049n1786L000L5908O5906l459k6048J2423J382J69j4675
$$ y = [3627, -34917, -11069, -32454, -79046, -39100, -8062, 2305, -4082, -79668, -69074, -82969, -98041, -141192, -128692, -123860, -137064, -47643, -61963, -28843, 43889, 23349, -4365, -61261, -97555, -37060, -34813, -69257, -48224, -11712, -5518, -33426, -46353, -73589, -78675, -47294, -30609, -51220, -55067, -27613, -20745, 19943, 28662, 30596, 25723, -49696, -23445, 65662, 62978, 40323, 8823, -58699, -71422, -93894, -105291, -67406, -21213, 28043, 29765, -87649, -130106, -88357, -77661, -72895, -52851, -14879, -73181, -132356, -114766, -64395, -65623, -29986, -13786, -98226, -105192, -40963, 11110, -17158, -34459, 24184, 46422, 20113, 39967, 50235, -20537, -70968, -66125, -17025, -43074, -94860, -91860, -55952, 9954, 6495, -19553, -7130, -5748, -5579, -20254]
5279b0254j06L7830L9554m858o809N555m4407j4021j3364Q88l7830j0129L1748
5266c6203L818l1751P106N5295L2980j2289J5319K497L9445R207m3167L6679n1286
5253B7650m4309J7235K8619K7229k6905L087l2184l3792N968N1624R540j2566
5241B1196n3457L1603j6837P432N6706j0190m4516j2899M913J9560M6987J9840
5229G0338J2478l9348l4017Q011M9035J0215J3345k7819m5870K9210R581k8364
5217B6795K5551J0096l0851k2188J3248J5773m8996Q349L6748q9713N1471L9570
5205C5853l6048k4593p396Q0199k0379r8097J6820L6670N1813l9309J8868k1486
5193g085N104j8988l569k4572L8638J8189o332r656p379N3145q618n4350K4778
$$ y = [-20254, -20360, 17470, 57024, 52166, 45357, 50912, 6505, -7516, -20880, -19992, -57822, -67951, -36203, -32385, -64136, -57030, -1735, 31245, 18956, 34275, 36772, 76217, 85424, 42257, 78936, 27650, -16659, 576, 29195, 56424, 29519, 32606, 422, -33370, -27402, 24222, 33762, 21196, -32261, -658, -17495, -10063, 46643, 36453, -8063, -20962, -16049, 3511, 50498, 70338, 82816, 43468, 9451, 17462, 66497, 76712, 90057, 62238, 16368, 45578, 55159, 26795, 52346, 62442, 31591, 9403, 22651, 38424, -10572, -2223, 34525, -55188, -3717, 35853, -195, -24788, -32184, 48015, 27636, -70461, -53641, -16971, 34842, -4467, 14401, -7085, -1981, -20969, -24538, -49110, -10472, 7717, 1385, -8271, -15650, 37495, 28877, -25473, -695]
5180f95N0545j0358k6987j6650K4673q1373j3145p755M030K4777N6948O483j619
5167H874n491k6925K1320M3127n2454K520M9768l741r682n294n120L4543J5394
5154F6839m2147j5387o3104J863p00j7678J9934q064j8506K2161J4888K5452J5692
5141A243K4576m346J4636q25L8027p0284j3108O0215k9315l299J2413J2963l5390
5128G506k7252K805k7417k5086J9528M0974k2377l192L4564L854k4908K2511L4082
5115C5592k5909n4606n5650j8243O4400J2947L6164N479j0580j1958M1426P103
5103B6165K3721j7060k1366J8611m2647p210O17K7821k4653Q332n472O808J2798
5090F465Q744n4676p983j2354M0704L5178l2799Q144m5910p76M7586K054K8715
$$ y = [-695, 49850, 39492, 12505, -4145, 20528, -60845, -73990, -81745, -77715, -52938, 4010, 10493, 8874, 3383, -23542, -2222, 40905, -11549, -9029, 40739, 36998, 27316, 22022, 16902, 51445, 66839, 24692, 9305, -53799, -51936, -52636, -70314, -50380, -58444, -76950, -54789, -39901, -14449, 1243, 25819, 21473, 36109, 35284, 73311, 3027, -10081, 50134, 20819, 17520, 29933, 42896, 7506, -19746, -16941, -44358, -69444, -49916, -8942, -31319, -34511, 53, 3907, -21001, 1510, 35592, 9683, -44923, -100573, -118816, -54416, -41469, -5305, 174, -10406, -22364, 19062, 26165, 49886, 32826, 11460, 30071, -12576, -19786, -19169, 8652, -16001, -7669, -13141, -6333, 6465, 15209, -39467, -47450, -59804, -19100, 16078, -16721, -8577, -54487, -55263, -7677, -5623, 23092]
5077B3092N9241j5295j6341K0085K4103J623r5201p4566j467K6877L6735K125
5065h989l4065M241L2056J7439l8606o9356k72O1316K3690M0972m1563J975K8446
5052A7284J597Q913L6818m4729p9985k4714Q0405L5462j2341J309L6302n8680
5040b359k3721o3241l0376K5194Q1465L2991J601j0840k1877n1591j6445M917
5028g4282j036J2249p324L0817P7662N3450m4157k2385n5960k3406p996N740K9635
5015b6993L7674N1364m538l4820j5454j9413L4414j9874m267k4438R848N2427
5003C5930J4249m7044m3634J3325L7512K4349k2853j306m3812k7014J8179r375
4991e1494K4905o8244l7759R115k9928O1579L6808J2863M0510k0299J7587K9346
$$ y = [23092, 82333, 67038, 50697, 70782, 94885, 96508, 1307, -73259, -74726, -47849, -11114, -8989, -43054, -38813, -6757, 10682, -27924, -97280, -97552, -36236, -12546, 28426, -13137, -11162, 17284, 18881, 27794, 64612, 19883, -60102, -84816, -4411, 31051, 18710, 20019, 56321, -2359, -26080, -89321, -119697, -94503, -13038, 19953, 21554, 10714, -11163, -62754, -79199, -74282, -75318, -63069, -70393, -39576, 38086, 91536, 47379, 24994, -30966, -54372, -62368, -56628, -26993, 10681, 62045, 57507, 22687, 7233, -12180, 22234, 2360, -1907, -26345, -16497, 35930, 50179, 3135, -40499, -27174, 10338, 34687, 11834, 10528, -33284, -60298, -42119, -51494, -26589, -94833, -132592, -123477, -153405, -91826, -55018, -42155, -1645, -21944, -4357, 24989]
4979B4989m8593o8830o249M3135N793j9465m455J9565M9141k9742J3313R433m5270
4966e7235k4860J3706j8902J7216K8038L1336k6700j9576m831l621N3538k5573
4954c7464L4252n582P125l031J7747N9334J1816o71m2384J3208K2199K4886M0300
4941A41735n4995o8267j143J1449o81O351R5q885k5739K2758j5109k9008j1237
4928c2676J2856J2324o965n0622o6899Q870R7499K4799l5525J6251J9681m7986
4916d8393K8648N4461o056k4263m276k7237n2125K9066O1974R520N157o9108l1355
4903g3987O353L3326L8041j3837P730L023M6573J6135q1990K5719M2628M1721
4891I1435n375p4203n5606k4224M0345N274N150j6891J1890L5233M1172q458l7797
$$ y = [24989, -23604, -92434, -98683, -55548, -49755, -69220, -73675, -54110, -4969, -34711, -21398, -11965, -57235, -82095, -68389, -87291, -70075, -42037, -10701, -37401, -56977, -61808, -65429, -11891, -37464, -3212, -8794, -1669, -4700, 13047, 72381, 84197, 83526, 41142, 54350, 76549, 101435, 141735, 86740, 18473, 17330, 28779, 28098, 34449, 34544, 25659, -80, 22678, 7569, -21439, -32676, -19820, -7496, -14461, -65083, -131982, -123112, -25613, -814, -36339, -20088, -407, -48393, -19745, 34716, 28660, 4397, 121, -27116, -79241, -50175, 11799, 21319, 26476, -42632, -73987, -67634, -34308, 3733, -10104, -2374, 649, 47222, 63357, -18633, 7086, 49714, 91435, 86060, 11857, -43749, -67973, -27628, -22354, -17204, -34095, -22205, 13028, 54200, 45742, 7945]
4878G945k8039P006N933n4840j5857Q2914k187o3887j974J2070j5436l6075k7499
4865a29926K4761L1326j0983K7922r952L136p046K5233O446k345J4636k766l0773
4852f0331k765J3328N9221K212k3180j400p89k4776J5997k4766j1699n94J8163
4839d1379O0250n6852j5780K8133Q2804p4851k5957K9382L8648K4111k0427n2051
4827b3969N752j2191o538Q285Q275l8997k2935M086Q736J9202L6707n92k132J7522
4813A211O353k6720l8507J1143O3544N1635j5554n213m976j4447J9245m3105m6408
4800d1799q971J255K2818k7780k0697L1654K9829O1564o2219K2642m675m6313
4788d2692jM2731J4619J5407k9104j5450k2672k2728P554K5022r705K5436k69
$$ y = [7945, -20094, -13088, -7155, -61995, -77852, 5062, 2875, -61012, -62986, -50916, -66352, -102427, -129926, -105165, -73839, -84822, -56900, -66852, -63716, -70762, -45529, -39083, -41428, -26792, -29558, -60331, -63096, -49768, 9453, 11665, -11515, -12915, -13704, -38480, -22483, -47249, -58948, -59542, -41379, 18871, -37981, -53761, -25628, 57176, -17675, -43632, -14250, 24398, 48509, 28082, -23969, -18217, -30408, -36946, -28661, -20386, -59383, -82318, -78232, -69496, -50294, -13587, -14179, -16311, 1211, 7564, -19156, -57663, -46520, 17024, 68659, 53105, 47892, 42916, 28469, 47714, 4609, -41799, -50770, -49515, -26697, -54477, -75174, -43520, -13691, 47873, -14346, 8296, 3621, -42692, -42693, 38, 14657, 30064, 960, -14490, -37162, -59890, -52336, -27314, -37019, -11583, -11852]
4775a1852j7235K7504l405L0010l2459l7973N938K4239n085K2217o8801o6722
4763a33624m1820J9785j6767K1067M5404L0112K309k4118k3096J814M2028J4396
4751f2510K1416M8425N1156J7566p9402l7737K9968J8574J3070M682N5025j4422
4739F5811l5201o7408O447k4102L697N402k0804K3817L0196k4847o3627l4443
4727a35062q221O8236Q1437j6977o3958J0916o238j6499j1107N9265L735j5557
4715e0030M4404M6273J5944j3844l7155l2736m9428M8605O0543J23j0957p666
4703A4076l5597l4417j5537J6911P4519M1285m440r4145m6946J4682J0783J4101
4691d4725N9070K3904l995l2761m5907J2831k2436k8611M6454k5846k4466K1067
$$ y = [-11852, -29087, -1583, -4988, 25022, -7437, -45410, -39472, -15233, -20318, 1899, -66902, -133624, -175444, -155659, -172426, -151359, -105955, -75843, -73534, -97652, -120748, -118934, -76906, -62510, -41094, 7331, 58487, 76053, -3349, -41086, -11118, 7456, 20526, 25208, 80233, 65811, 30610, -36798, -30351, -54453, -50756, -45354, -66158, -42341, -12145, -36992, -100619, -135062, -143283, -75047, 6390, -10587, -74545, -63629, -69867, -86366, -97473, -38208, -34473, -50030, -5626, 40647, 56591, 42747, 5592, -27144, -76572, -27967, 32576, 32699, 21742, 14076, -21521, -55938, -71475, -54564, 19955, 61240, 56800, -37345, -84291, -69609, -58826, -44725, 14345, 38249, 34254, 1493, -44414, -31583, -54019, -82630, -36176, -62022, -86488, -65421]
4679f5421L1188O0969L9967m1056m8940K484m4862M621J5790L082R397p262n0053
4666i0096j8105L0280j6961L456L8738l025L0833N8270J2822n3006l2576l2615
4654g1985O1986K1229M2480o2711j9678K9153Q101J9793q190m4727l2420j2762
4642f9731q908l4253p543K9528O583J2092L2211J5025k25N8109j9336j119k2912
4629a0479l1286j2093L33L4747N5583l4136p9138m8623K6797R7395J2225O293
4617A7618o1824n8407n286Q017o384L8339K8772L0728P2017L5316j7333n0380
4605C1193p774J3771n7210n6885N234L6322L6046j8844k6468k1442k5498P09J0068
4592h0778j7526K4282M6820K6512J8366J3247L996j007l9846n3709M4475J5613
$$ y = [-65421, -34233, 26736, 66703, 25647, -23293, -20809, -65671, -61050, -45260, -42178, -32781, -40043, -90096, -108201, -77921, -94882, -91426, -52688, -55713, -24880, 33390, 46212, -6794, -39370, -71985, -9999, 11230, 53710, -9001, -28679, 474, 8575, 28368, 20178, -24549, -56969, -69731, -78639, -112892, -120435, -90907, -84324, -72232, -40021, -24996, -25221, 32888, 13552, 12433, -10479, -41765, -53858, -53525, -18778, 36805, 2669, -76469, -125092, -98295, -900, 11325, 17618, -44206, -102613, -107899, -99882, -106266, -67927, -39155, -8427, 63590, 98906, 81573, 31193, 23419, 37190, -20020, -76905, -71671, -35349, 697, -18147, -44615, -66057, -91555, -90846, -80778, -98304, -74022, -27202, -690, 17676, 30923, 34919, 33912, -5934, -59643, -15168, 445]
4580D45n5006l6261N984P018L3952m428j6922p757K2779N9311j0938m1913l5775
4567g9511J95Q1239K474q5346Q128K7390K498k7169n5703Q441P1587n632m3077
4554i4486K3354K206M2189o489J4906J0798M4598J4864m0110m0864L660J6543
4542h831Q7527n732k0597l1847n3512k0536L7359N4184j9067n9666r746j3574
4530f4038K3749N5458K5099k02m1241l8554J7225K6773O032p653k7122j5673l8422
4517g8569J3401K8156J01374j2929o8888K3183J886k324j976L6338L9083K278
4505H1013k2626m8044j4311o278K0666K7309k0176j035l811k028N533J1050K6900
4492E4162L6102m4732o2096l1971M046M7566j2473J4948k0848l3160M826L2459
$$ y = [445, -54561, -90822, -84838, -77820, -43868, -48296, -65218, -72975, -50196, 9115, -1823, -43736, -79511, -79316, 1923, 4397, -80949, -72821, -45431, -42933, -70102, -125805, -117364, -45777, -51409, -94486, -71132, -68926, -26737, -33226, -18320, -7522, 37076, 51940, 11830, -29034, -25374, -8831, 78696, 72964, 52367, 20520, -32992, -53528, -16169, 38015, 18948, -40718, -50464, -64038, -40289, 15169, 40268, 40066, -1175, -39729, -22504, 4269, 10301, 2648, -24474, -40147, -78569, -65168, -37012, 64362, 51433, -17455, 5728, 7614, 5290, 3314, 39652, 78735, 81013, 58387, 10343, -3968, -10246, 10420, 37729, 17553, 16518, 12707, 10679, 16212, 27262, 54162, 90264, 45532, -16564, -48535, -44489, 3077, -9396, 5552, -15296, -48456, -43630, -11171]
4480a1171k5687k878j5283k6738J3896n703o160L0847J2780m5160m2181J4907
4468a08531l2399n4189J2136Q3687Q0221J9538m9532n5201l1731K6035K8022L0477
4456e1467J5946r759j0538l5205M0260j596L5339J8505p050q486n8761K8567Q561
4443c5684k9342K6892K3260M712N2047k8061m3173M3405L0550l8172Q923J5859
4431C1216n7663j6339o257P2598Q3590k9997l0199O757q1004l5283L2514K9175
4419h92j523L689k8688k2122j3716j7163k4739k7768Q220J8871J6085M3452J7931
4406b8363J3243K2995l4938l4270J3619L8474M2427L6752n1938l3281l1182J8996
4394b7466J4599L0785K4817N2902m7281n8046j3638k3775P808j3330k2471J5006
$$ y = [-11171, -36858, -39736, -55019, -81757, -67861, -73564, -79724, -48877, -36097, -81257, -123438, -108531, -140930, -195119, -182983, -99296, -19075, 463, -49069, -104270, -136001, -109966, -81944, -51467, -35521, -45280, -55818, -91023, -50763, -52359, -17020, 1485, -5565, -14051, -72812, -44245, -35684, -65026, -38134, -14874, -10162, 41885, 13824, -29349, 14056, 44606, 6434, 15357, 31216, -26447, -42786, -49043, 23555, 107145, 77148, 46949, 53706, -27298, -62581, -30067, -892, -2415, 1274, -27414, -49536, -63252, -80415, -105154, -132922, -124702, -105831, -89746, -46294, -28363, -15120, 7875, -27063, -61333, -47714, -9240, 33187, 69939, 18001, -15280, -46462, -27466, -12867, 17918, 42735, 95637, 48356, -9690, -23328, -47103, -39295, -52625, -75096, -60090]
4382f0090K7089M9253j5230J1357k8637j3231l7987P502N062J9575q288L7689
4370e936l078n3132J2471j8775j7043J7963J5125l4803m464M9893P204L4579K6000
4357B6004J1560m6279k2593M7124k2367o7898l9221n6413l1650N8676L7482j1989
4345a17564K0770K3659n0928l1581J4055k3764j3745K7305K3710K2389M0393J4539
4333e0762p444J184n960P242r589J9440M4337J9489q729L8064m1180l3796J644
4320b6060O20M1967K2532o9890k3337q179l4187q153k5072K7081M9785L0367L30
4307b2196n1536J072n194R016N7607R441k0680K560k3825k5275m0447p39k28L9044
4293g1380Q6886J019j2225p176j1202j9296l3398K548K5653O1590J1712o1004
$$ y = [-60090, -33001, 16252, 1022, 12379, -16258, -29489, -67476, -59974, -54912, -35337, -43625, -5936, -9014, -62146, -49675, -68450, -85493, -67530, -52405, -87208, -91672, -41779, -34575, 4, 26004, 37564, -8715, -31308, 15816, -6551, -74449, -113670, -170083, -201733, -143057, -105575, -117564, -96794, -73135, -124063, -155644, -141589, -165353, -179098, -151793, -128083, -105694, -65301, -50762, -58206, -57022, -62982, -55740, -65329, -45889, -1552, 17937, 9208, 47272, 6092, -27704, -26060, -25440, 16527, 39059, -30831, -54168, -62347, -96534, -104687, -129759, -102678, -52893, -22526, -22196, -73732, -72660, -77854, -68838, -11231, -1790, -22470, -19910, -43735, -69010, -109457, -110196, -110424, -71380, 15506, 16525, 4300, -2876, -14078, -33374, -66772, -64224, -38571, 23019, 34731, -26273]
4281b6273j1446K0823L370l9918j3681N5886j4231N4934j2825l6719K235p141
4269b4986m6300j014K5607J7501O995m4133K3989O0353l453k1434L659N25p1090
4256g3781k8455l886K3095L1984K647K2181N5275k980j3734p3899j1664J8471
4244e4746K8622r789J980l385J5500j098k450J5188K251M1654J1875l7003m1733
4231c3134q266N5661M9037K4579m0626n2986m2963M1378L6335j5370O6030K1129
4219A00804m4722l1812n1566j44k8767L3544L6638m8007l9506J8047N6734J4503
4207A5746K0643J3680N998l1053l3024o6567N461p253L5856J1737L2541j7561
4195a3796J7868K1484n4705o5293R343J7625n9241l462P1789O2174N103m7031
$$ y = [-26273, -37719, -16896, -13526, -53444, -67125, -11239, -25470, 29464, 16639, -20080, -17845, -24986, -71286, -72300, -46693, -29192, -22197, -66330, -42341, 18012, 14559, -6875, -3216, -2691, -73781, -102236, -106122, -83027, -51043, -48396, -26215, 29060, 26080, 12346, -61553, -73217, -54746, -26124, -35913, -33933, -37318, -21818, -22916, -25366, -10178, -7927, 33727, 45602, 8599, -33134, -41400, 14261, 63298, 87877, 47251, -5735, -48698, -7320, 29015, 13645, 79675, 100804, 56082, 24270, -27296, -27440, -56207, -22663, 13975, -34032, -73538, -55491, 1243, 15746, 36389, 50069, 56067, 25014, -8010, -74577, -69116, -76369, -40513, -28776, 3765, -13796, 4072, 25556, -29149, -94442, -85099, -67474, -126715, -130177, -58388, 3786, 8889, -38142]
4183c8142l9539L2271N9914k3132m522k8474k3954L4502L8491K2445m1463o2643
4171g4246j6819q635M3028K7303l4911j5121N1998L6196K8946n6381l7437m340
4159f0419l2576j9403N87l2611p303K5213N2729J422l0959K3847j8341N0544O4787
4146A7517q891j8328K8753k3666l8991J5877L9834J3576k0497N1410l833j7793
4134C4968k153l6251N79J799l8346j5148M2298M4758K1786n0188m7962J3475K490
4121b7895J9738J7534r118n2107p1351K8834N952q045L4494K8682M4987j548j5577
4108e420m3930K4537L4355j8244n7330j9337J957J761L2733N3449M0207M3386
4096H8124j1448o7335n6305k113P496J4043L636M019k145J8875j0222l5129L336
$$ y = [-38142, -77681, -45410, 14504, -8628, -13150, -41624, -65578, -31076, 7415, 29860, -11603, -74246, -91065, -99700, -56672, -29369, -64280, -79401, -27403, 8793, 37739, -18642, -56079, -60419, -92995, -112398, -111811, -144422, -151725, -126512, -73783, -72361, -103320, -79473, -97814, -47270, 17517, 8626, -9702, 19051, -4615, -43606, -27729, 12105, 25681, 5184, 56594, 52761, 34968, 32815, -3436, -2857, -1058, -39404, -54552, -12254, 32504, 54290, 4102, -43860, -30385, -27895, -8157, 9377, 259, -51848, -123199, -94365, -88413, -96458, -61964, -33282, 11705, 10157, -5420, -49350, -24813, 9542, -8702, -66032, -85369, -83412, -81651, -48918, 4531, 44738, 88124, 76676, 9341, -46964, -49077, -41581, -27538, -23902, -19883, -22028, -3153, -13375, -48504, -45168]
4083d5168J7090P825R143M4073j751o9738K8258j314m6260p429K1714N720J9306
4070a8531K9137K172L6629j8538l6202q881L8734N876j6795j4186o1450J1389
4058e0646L2283k5435M7610M0892l8114m850L100O428J5876q358l870K5369L1382
4045G1667k3000o3479L0942K1377j4254j8714j890n3067L7863m77k4482M216K5098
4032h200K8034K3781k6224p908j9902j801m4542O174j3823K695r146l0285J3232
4019h7915J5461N1338L8126k0085J051L0323m9079R074K9034L629K660l2537m8595
4006e7515K4029O1325K4140J328K6924m6939k4177J3560k1210j9724j5874K9582
3994d551K8935j827O4767N9993m168r1092j13910l0950k7566J5518l1l3462L350
$$ y = [-45168, -28078, -20253, -11110, 32963, 31212, -38526, -10268, -11582, -57842, -65271, -43557, -37837, -18531, 10606, 12778, 49407, 30869, -5333, -14214, 24520, 30396, 13601, -585, -62035, -50646, -18363, -43798, 3812, 44704, 6590, 1740, 4840, 11268, 27144, 18786, 14916, 40285, 71667, 48667, -14812, 16130, 37507, 23253, 4539, 2649, -50418, -12555, -13032, -37514, -33298, -8200, 19834, 43615, 17391, 9483, -10419, -12220, -56762, -50588, -64411, -61716, -70862, -101147, -87915, -72454, -21116, 17010, -3075, -2024, 28299, -20780, -11706, 17328, 20957, 23617, -8920, -57515, -33486, 27839, 51979, 53307, 80231, 33292, 9115, 22675, 1465, -18259, -34133, -4551, 24384, 22557, 87324, 147317, 143149, 52057, -61853, -92803, -120369, -104851, -104882, -138344, -134994]
3981a34994K3255J4648K2821K7892l7755m691j2460p958p278j904L0953L247J6798
3968f7426J9561K2097l9393o280P9426N0249n4916m3162K4192Q636k7989R58R414
3955b4633M5029p714k8637o4270l644L1686L1922k8184j9777L8849j4450l4268
3943g8091j3179K286L9292P7136j7291K8373l9013l5138m170m1208m0331P9681
3931d1653K0977J4522K141J3726m8342j5989L5875q769J9886j2174Q080J3106
3919A386j65n3700n3742k8365J8225K6768o853K0420Q976k66j1819j7257K1779
3906g4613K5114M0764j1503M2144m4492l6864o158j3359j3689M954J986M0008
3894d5708K3328l0216p889R096M4436o747M4672j4031l0127L8641Q189k0865k2486
$$ y = [-134994, -111739, -97091, -74270, -46378, -84133, -88824, -101284, -109242, -116520, -118424, -87471, -84224, -67426, -47865, -25768, -65161, -71441, 7985, 58234, 3318, -39844, -15652, -7016, -35005, -34047, -24633, 20396, 12682, -15955, -80225, -83869, -52183, -20261, -48445, -68222, -29373, -43823, -78091, -91270, -88984, -49692, 27444, 10153, 38526, -487, -35625, -39795, -81003, -121334, -41653, -20676, -6154, -4013, 9713, -38629, -54618, -18743, -27512, -7626, -19800, -11720, 1386, 1221, -52479, -106221, -134586, -116361, -89593, -96446, -76026, -67050, -67316, -79135, -96392, -74613, -49499, -8735, -20238, 21906, -22586, -59450, -65608, -78967, -92656, -87702, -85716, -45708, -22380, -52596, -60485, -51389, -6953, -13700, 30972, 16941, -13186, 25455, 33644, 12779, -9707]
3881i707K7406K3223K4993n1334l1240P523L513o512L9337l2177j5163m5174l2662
3868i7974M6866M7001j6223m9560J1493K1857j5330j122O68k8841N722M0941O351
3855b8151p802l2792L0094L0749N649l6112P4639J3323J3220m0437J6996k1399
3843A7977J9842m7037m2592l8380Q639J1160l4028j8247M031N7759M8071j888
3831a4693n0473l8601j9178M5955p248K9176J7823l3678k0546Q263P09m4072k2543
3818a49106K5757j438J8750K2917j6776N1322o4243l8478L101K2314J07436N3151
3806C4707n0168n0321l9439m3783K3164L6687J274L3656O0158K6127k6949j9331
3794a4218J5540J8146K5169l2171k3844J9801O9842J2478j4862k1865o846l0714
$$ y = [-9707, 17699, 40922, 65915, 14581, -16659, -9136, -5623, -12135, 27202, -4975, -20138, -65312, -97974, -51108, -4107, -20330, -69890, -58397, -36540, -51870, -52992, -52324, -81165, -75443, -34502, -28151, -35953, -68745, -38651, -7902, -2253, -38365, 36274, 49597, 62817, 22380, 39376, 17977, 37819, -9218, -51810, -90190, -81551, -70391, -104419, -122666, -118635, -60876, -12805, -14693, -65166, -103767, -122945, -76990, -84238, -55062, -37239, -70917, -91463, -83200, -82491, -126563, -149106, -123349, -124787, -106037, -83120, -99896, -48574, -112817, -151295, -148194, -125880, -18444, 34707, -15461, -65782, -105221, -149004, -125840, -89153, -87879, -54223, 5935, 32062, 5113, -14218, 1322, 19468, 44637, 12466, -11378, 8423, 78265, 90743, 75881, 54016, 47170, 16456]
3782A6456R435J4497j3931o9130n3990J8527J5681j8388J5870j7514k6760P038
3770a02209K0728l729M7302N0060k1799j9563l7499m7110k4139K5305J5529k2790
3758a19914q301M6822k997k0273k1513K6426L5581R977M9475l0967L1012K6769
3746B2097J3176m3377o3998K0598M2092L0804j467J1834J8761n792l9805o3550
3734e8627j842j9130L3980j0591l0961p199K4950j1091J813j4335L5653O0654
3722C274L9060L414k2226o5171k0546k4841L665N3523K3211l6793r735N360k6506
3709g4311J0833k0623L9680J3080O241l5296K865J6668j4030l6597J3179o251
3697h4562K230L8451J4625K2137Q4066N0077l1771k2992Q266k6372l1773l7499
$$ y = [16456, 25891, 40388, 26457, -42673, -96663, -78136, -62455, -80843, -64973, -82487, -109247, -102209, -81481, -85210, -37908, 12152, -9647, -29210, -66709, -113819, -137958, -112653, -97124, -119914, -128215, -81393, -84390, -104663, -126176, -99750, -64169, -54192, -4717, -35684, -4672, 22097, 35273, -8104, -72102, -51504, -9412, 21392, 19925, 31759, 50520, 44728, 4923, -58627, -60469, -79599, -45619, -56210, -87171, -94370, -69420, -80511, -78698, -93033, -57380, 3274, 42334, 45748, 23522, -41649, -62195, -87036, -83371, -29848, -6637, -43430, -53165, -47805, -74311, -63478, -84101, -44421, -31341, -25100, -60396, -57531, -40863, -54893, -91490, -78311, -84562, -82332, -43881, -29256, -7119, 76947, 127024, 95253, 72261, 80527, 54155, 22382, -15117]
3685a5117o4149j1591J8664L4141O38M0299J2331j9270L2222m69n7008n867J3334
3672b1842M19m1714r689L4212J9968k7257l1672j4019m606L2159M1339j9258m546
3659d6506J7086N3916o723m7484o0525L1427J4154l3648J3201M057L5048O8305
3647D2308k1524n5183m0195K2737l3967L980P55j5414M8189j6267j7343O22J9606
3634f1696K9301k1482M7846o840L9502k5672j04360q599J4077L7232N9641r802
3622a0852Q827O7858K8638l6851m9618n9006o9684K6483M8921k6738n5151L7062
3610i0111M6944m4516M47M3995j1693o49j460K1303J8366M1325M2167k3700l5492
3597F926k7044M9227n603J5416l0714l4378m7280K0050L2298j7641o1223Q206
$$ y = [-15117, -79266, -90857, -72193, -38052, -37414, 2885, 15216, -4054, 28168, 27699, -29309, -35176, -21842, -21423, -63137, -72826, -38614, -18646, -45903, -77575, -91594, -96200, -64041, -22702, -41960, -46506, -29420, 24496, 17773, -29711, -90236, -58809, -44655, -78303, -65102, -61045, -25997, 42308, 20784, -34399, -74594, -51857, -85824, -81844, -81089, -96503, -48314, -64581, -81924, -81302, -61696, -32395, -53877, -6031, -12871, 26631, 959, -103401, -112000, -97923, -60691, -1050, -10852, -2025, 65833, 94471, 57620, 8002, -51004, -120688, -94205, -45284, -72022, -127173, -90111, -43167, -87683, -87236, -43241, -54934, -55583, -57043, -35740, -17374, 23951, 66118, 42418, 6926, -20118, 29109, 23506, 38922, 8208, -26170, -73450, -53400, -21102, -38743, -99966, -91760]
3585i1760J0712k105m9663J0399J1423R605N0648N5437J5916o1629p5613K7608
3573h9022L9323K6333M7012K7414J0864o9867j7511J5977J6862l49N1947m839
3561E4144m1385j9412n52k4565n3005L7109r67l2135L1602M8642q740p7473m1267
3548a28004J0818M4064N5231K7077o6328k3723O0531N705J536j4359k4668k1876
3536g3996K0693M2823l8l5792j7289n0264N2680M2649j402m715J9407r661k2980
3523c7885p851K3303L998J13m7492n1392J7942Q5792N5176j9001j7711K1320m1998
3510a5686l4923J0373J8971M961M2609J2658m6840m1828j0286J6140O443l4869
3498g2277m6581M596K5820J9624j517Q9412P7446J0547o4157l3942j4171k490
$$ y = [-91760, -81048, -83153, -132816, -122417, -110994, -101389, -50741, 4696, 20612, -41017, -116630, -89022, -49699, -23366, 23646, 51060, 61924, -7943, -25454, -9477, 7385, 7036, 58983, 54144, 12759, -6653, -7205, -31770, -84775, -47666, -48633, -80768, -49166, -524, -9264, -86737, -128004, -117186, -73122, -17891, 9186, -57142, -80865, -20334, -14629, -13093, -27452, -52120, -73996, -53303, -10480, -10518, -46310, -63599, -113863, -61183, -18534, -19936, -24651, -5244, -14905, -37885, -45736, -22433, -18435, -18322, -65814, -117206, -99264, -13472, 41704, 22703, 4992, 26312, -15686, -50609, -40236, -21265, -16304, 26305, 38963, -7877, -49705, -59991, -43851, -37408, -72277, -118858, -114262, -88442, -68818, -70335, 19077, 96523, 107070, 42913, 8971, -5200, -7690]
3486g690l1777O2978m7083o7191R18K6799N2194Q588k178M4704R5060l3887o6954
3473C4481n2643L9835K5631j1876N527k792l0093m1240n8107L3802K8263J7695
3461a1517K2227p927m8531m5966j2721K4979j5789l5501K865M7935O2700O797
3449a0449l3605P20l696K377M4690j2607l6757J1599j8143o9757k5N4092L9423
3436c2138r447j14j0597o7298O5493N8274q5138J7678P1272j0385j0865K7035
3424A3770K1186L9235o2253m7283N8776J3892K5566P201M2165j5716p2523o4471
3412d0455J3948J11683k9784l6633r891n5014l2207j5372K7970m012M5736K4160
3400A29j6648n6343k0037r64M5347M1193J8029N679n154k8710l0444J7249L5735
$$ y = [-7690, -39467, 23511, -23572, -90763, -89845, -63046, -10852, -2264, -4442, 40262, 135322, 101435, 34481, -18162, 21673, 47304, 35428, 40955, 38163, 8070, -33170, -91277, -57475, -29212, -11517, 10710, 2783, -45748, -91714, -104435, -79456, -95245, -130746, -127881, -79946, -17246, -10449, -44054, -43334, -47030, -44653, 37, -12570, -49327, -37728, -55871, -125628, -125653, -71561, -32138, -41585, -41699, -52296, -119594, -54101, 4173, -80965, -63287, 7985, -2400, -13265, 13770, 34956, 74191, 11938, -35345, 23431, 37323, 62889, 70090, 112255, 96539, 24016, -40455, -26507, 85176, 55392, 18759, 8868, -46146, -78353, -93725, -65755, -69767, -24031, 129, -16519, -72862, -92899, -93863, -48516, -7323, 10706, 16385, 11231, -17479, -47923, -30674, 5061]
3387E061j4948l736N6042K0085m9045j0695o830M812L312L8811K0202K0319J1689
3374I5079n9027m9357j6800o0849K4268j3212p086K5282K151j3651K1897j836
3362e3141n5090m6624n378K0252j4880K1749P6913L0629j4692j2204R836J0198
3350c2432N374M4664N081j3607n0947K6328K1284N369m636k167K7572j4216p1393
3337e3726l2029J6285J4562l3350k1292L6369N2745j018K4666L0384l3001j3387
3325a2792p0369N1368j080l9459j8039J1745Q5906j8948r1291p507M4230l3834
3313a00070K1243L9328L1965O7852L2845l5364j8430m6173K2850P4812n802n3766
3301C1290n2880m0351J8876J3111Q472M6288j3093l6928k0294j1689P9736L1252
$$ y = [5061, -9887, -13623, 42419, 62504, 13459, 2764, -4066, 746, 4058, 42869, 63071, 83390, 95079, 36052, -13305, -30105, -90954, -66686, -79898, -86984, -61702, -59551, -73202, -51305, -53141, -108231, -154855, -160233, -139981, -154861, -133112, -56199, -25570, -40262, -52466, -42630, -32432, -27058, 17606, 22687, 9080, -41867, -15539, 5745, 11114, 6478, 4311, 31883, 17667, -53726, -85755, -69470, -54908, -88258, -109550, -73181, -20436, -21454, 3212, 33596, 595, -12792, -83161, -31793, -32873, -72332, -90371, -78626, 7280, -11668, -102959, -110466, -66236, -100070, -78827, -39499, -7534, 60318, 93163, 57799, 39369, -6804, 16046, 90858, 85056, 31290, -21590, -61941, -43065, -29954, -21482, 24806, 11713, -25215, -45509, -57198, 22538, 53790]
3289E3790k055l6489R492J8649L6595K3859k5386o1393m0015l4393m1974n3901
3277a53221Q4651O269k8468L3068M7560l7690m135p276L0922l8476k8520o378
3265a01694M1886J0858O892J904J4002K4319J1377k6314l3770j1891r948j0828
3253h3207j8580Q663K7680R616K5471L868Q550N997J6688O045P904L451m1700
3240a9554l5374m7200k9303M9223L0232J3487K8985k1238k5147m80L2622o008
3228b9755k0467J6883N9297l345n6941k5077l3677M9115N6613J8334k4830p3826
3216f7676k9616k2659M8562j4323K2366J9952L001J6090l7737l3100K4408J1L8721
3203c2000M051M485o15J3395r346M5857j8497K3658l4282n9546m4088k079K8094
$$ y = [53790, 51735, 15246, 24738, 43387, 79982, 103841, 78455, 17062, -22953, -57346, -99320, -153221, -68570, -62301, -90769, -57701, -10141, -47831, -51966, -59242, -28320, -66796, -95316, -101694, -59808, -48950, -42058, -40154, -26152, -1833, 9544, -16770, -50540, -62431, -72379, -83207, -101787, -93124, -65444, -55828, -30357, -26489, -17939, -11942, 4746, 10791, 18695, 22146, -19554, -54928, -102128, -131431, -82208, -51976, -38489, -9504, -30742, -55889, -56369, -23747, -29755, -50222, -33339, 25958, 22613, -34328, -59405, -93082, -43967, 12646, 30980, 6150, -67676, -97292, -119951, -71389, -85712, -63346, -43394, -40393, -24303, -62040, -95140, -70732, -70721, -32000, -27949, -23464, -24079, -10684, -20030, 25827, 7330, 30988, -3294, -62840, -106928, -109007, -80913]
3190h0913L8158L2963K6037l0522k6962m2574j0617J2481J1221m7429j3202M2422
3178h8937L36N3319k9181J4941J0531k1542l4704M0468K3037J1119K812j9047
3166c6848K2615L3032k5530k527r045M4063j0139m4457K8087j772P328j0706k7725
3153c3624K62j6867K7689L8425L2058k6672k547m0144m1114j3220J3684M1144
3141b0926L2395m006o923j5329M6301k1571j6363m9607l605J0470L9012R138k403
3128c417M8L3185K9384o2022m9127m77K1707k9526o631M0257O9569l210n1522
3115a1782l0273M9252P89j4473k6339j8857m0299j3507K7056m66L617l2974L3103
3102g5153N9139K8696q847l2595m9678n0143L0996Q878j049K0465J4912M316M0734
$$ y = [-80913, -42755, -9792, 16245, -14277, -41239, -83813, -94430, -81949, -70728, -118157, -131359, -88937, -88601, -35282, -64463, -49522, -38991, -60533, -95237, -54769, -31732, -20613, -17801, -36848, -14233, 18799, -6731, -9258, -18303, 25760, 15621, -28836, -749, -2521, 4807, -5899, -33624, -33362, -50229, -22540, 15885, 47943, 21271, 18724, -21420, -62534, -75754, -62070, -20926, 11469, 7463, 540, -14789, 31512, 9941, -6422, -56029, -59634, -49164, -10152, -1014, -3417, -3369, 29816, 59200, -2822, -51949, -52426, -30719, -60245, -66876, -26619, 42950, 39740, -11782, -42055, 7197, 7986, -6487, -32826, -51683, -91982, -105489, -78433, -78899, -75282, -108256, -75153, -16014, 12682, 3835, -28760, -78438, -128581, -97585, -88707, -89756, -69291, -54379, -50063, -9329]
3089i329j4614l6115M9041l070M423k0800m7468k7643N0543O3217J3104p695q865
3076D729K3807r896j3876M3804o0679J9839L379o778o5393J8723P520M5929K1399
3063C2507M380m5057L6030M7313k6890p7638o2012K4576O8343j8077K720n107
3051a8912j2121K718K4198L3517M5185L8465Q601Q195q9681m4627l5337P231l2675
3038f5243L437j7408K974L1022L8569O53j1506k607m3980M029J729J2797j2866
3025e8400j9950M765j8018K0488J9668P341K5396P2256L0290p2089l0045j4115
3013c2413M037J1874O082p736l6818K828k9796j2161P0224O4656n862l4496K0976
3000B1395k9592k2047j8871K5797K9145q384j2727m3966J6254K8378k4205j0556
$$ y = [-9329, -23943, -60058, -11017, -14087, -9664, -30464, -77932, -105575, -55032, 8185, 21289, 13594, 4729, 28536, 18640, 4764, 48568, -12111, 7728, 11107, 4329, -61064, -42341, -34821, 11108, 32507, 36887, -8170, 27860, 75173, 48283, -29355, -91367, -66791, 1552, -16525, -13805, -18912, -31033, -28315, -4117, 29400, 74585, 113050, 121651, 129846, 40165, -4462, -39799, -32568, -65243, -61806, -79214, -76240, -45218, -6649, -5996, -17502, -20109, -64089, -60060, -58331, -45534, -58400, -78350, -73585, -91603, -71115, -51447, -44106, -18710, 53546, 83836, 11747, -18298, -32413, -28376, -16502, -10420, -18156, -54974, -52146, -81942, -94103, -23879, 40777, 34915, 419, 21395, -8197, -30244, -49115, -23318, 5827, -2557, -15284, -59250, -42996, -14618, -38823, -49379]
2988d9379o975K8230K2625j95J0720J324j27j4177j3175n370J6429L0242j8355
2975A817O3869k0870o9030n6548N903j0967j4865P9907K8650m997k3164m7770
2963f8065j5688M6004P983L0944L6726J7874j6205l3854l6622n0451K8957J7179
2951c5218L6412o3882m9062l5128K0240J9780N4302j4490K2713R27k817K7575
2939a8648K7405Q148K721q873j892J2637M657L659j5857n7430q4n057K080L3103
2925a3431K507J8082k4613m6511k841M0252J9687j8971r294k5298m1587M528K573
2912i4917K9119K2800M4798K708m8722l0608K1268k8909k5336k21L4818O5910
2900g292K1063K806j640n3554k1132k7153j7286L9012K6402r523J1639m183l3539
$$ y = [-49379, -56354, -28124, -5499, -5694, 5026, 6350, 6223, -7954, -21129, -26499, -10070, 20172, 1817, 65686, 44816, -24214, -80762, -74859, -85826, -100691, -20784, 7866, 2869, -20295, -68065, -83753, -37749, -29766, 1178, 37904, 55778, 39573, 5719, -30903, -81354, -52397, -35218, 1194, -62688, -111750, -146878, -126638, -106858, -52556, -67046, -44333, -43406, -46223, -18648, 8757, 16905, 19626, 10753, 8861, 21498, 26155, 29814, 13957, -43473, -43557, -48614, -46534, -13431, -10924, 7158, -17455, -63966, -66807, -26555, -6868, -25839, -35133, -60431, -102018, -97490, -94917, -65798, -42998, 1800, 4508, -44214, -74822, -53554, -82463, -107799, -108020, -73202, -7292, 13771, 16577, 14937, -38617, -59749, -86902, -104188, -65176, -38774, -48297, -36658, -40841, -74380]
2887g4380q0879j1061P3843M7594J9418M9429J5699k4153n1055o0034R641K0652
2875f5286L6816p1399o164N0418j6203N44O0835J5224M710J8469k5008p2393M0563
2862b8874L0954l104l3669K6842L815O091K0369N1409j0397q0392k6239j2526
2850e5721l42J2062Q821M8222l0646m0018k7849j5457J4141N3104O1948J6787
2838D5052R037k7714k3857m5042M2556J5511m9994j5707M2872K1036Q172K1776
2826D3698l828l2729m5210L0783l1479j0382l9541J9846M0636J096k803K4256
2814e657J344k6952l2464N3071J4414l2677o0820K0071l917J174K6164k0123J536
2801f4836l292K719M0334M2538l3709m6476j8393l6945M295J4605J9991K7097
$$ y = [-74380, -155259, -166320, -92477, -44883, -25465, 23964, 39663, 15510, -35545, -95579, -85938, -65286, -28470, -99869, -106033, -55615, -71818, -71274, -10439, 4785, 9495, 27964, 2956, -69437, -28874, 2080, -1024, -34693, -7851, -4036, 2055, 22424, 73833, 63436, -16956, -43195, -55721, -56063, -44001, -35180, 13042, -17604, -57622, -85471, -100928, -86787, -33683, 28265, 45052, 54089, 26375, 2518, -42524, 32, 15543, -34451, -50158, -7286, 13750, 21922, 43698, 39870, 7141, -38069, -7286, -38765, -49147, -88688, -68842, -28206, -27110, -29913, -5657, -4313, -31265, -63729, -10658, 3756, -28921, -89741, -69670, -73587, -72413, -46249, -66372, -64836, -68128, -65409, -25075, 17463, -16246, -62722, -81115, -118060, -113765, -99160, -79169, -52072]
2789e2072K6023L5587k6500P473N532l2245j3640M5284J551j0462K5455P023J5462
2776C4471j1812q529O0262j5355n4210P514K336K6978L6618J1582l476n0668%
2763C5711R803o4132k8474k282O5498M7152l1750o7077q4230L4473M1859P896
2751c5553L3720N1567l6951n7889l6068k9652N0617K5270J2960O0612L3118q923
2739F2828p1905Q80K4213j5564j1269K8190k1024j4971k1414K6984L4827N391
2727B7166m5120K2919R64k211J7897k963k0416j0185n2584p938N3212K5845M3281
2714D9867k6552k8183l04M4395L2844l8280p8398q333L5003j517o0818n4621J2372
2701a22525k3181J4435O6066K1341j2840j5312o525J0016o1322p42N7570K5174
$$ y = [-52072, -26049, 9538, -16962, -9489, -3957, -36202, -49842, -4558, -3007, -13469, 11986, 19009, 34471, 22659, 14130, 74392, 59037, 4827, 12341, 14677, 41655, 78273, 89855, 86379, 35711, 35711, 45514, -18618, -47092, -49374, 16124, 63276, 31526, -35551, -119781, -85308, -43449, -35553, -1833, 49734, 12783, -45106, -81174, -110826, -60209, -34939, -21979, 38633, 71751, 62828, -9077, -8197, 16016, 452, -10817, 17373, -3651, -18622, -40036, -13052, 21775, 27166, -17954, 4965, 5929, 3718, 21615, 18652, -1764, -11949, -64533, -72471, -19259, 6586, 49867, 23315, -4868, -5172, 39223, 72067, 33787, -44611, -52944, -17941, -19458, -80276, -134897, -122525, -145706, -131271, -65205, -43864, -56704, -72016, -78541, -68525, -129847, -130589, -73019, -47845]
2689d7845L8603l3506o0910o319k42K7035K7953m909M3789j1450l5347l6338Q902
2676i0584K9587q814l6130j159o043n3337N2135M6372N3987J9725P784J5692K1657
2663E0872n5326m4728J3007J4112k9186K8162L7275r067J4154J3600P216q316
2651C1775m728k5484N6323N3352j8600j8215j2140m9969n2059K9530j945J0028
2639b132o882J3844O8325J4545j0101n9137m8606m6224r034J8925M8911o449j196
2626b5211m191M1214p029R911m6705o8352K81N2762J3022K8386o183K1139P486
2613A6530N910j9065K2474K3940o501l7111j6028J2855j3720k6844M0989Q2451
2601H5880L6561l7303q9938l0480p633L4510O198M737j4367k3500j184M9275K7593
$$ y = [-47845, -9242, -42748, -103658, -109977, -110219, -83184, -55231, -60140, -16351, -27801, -63148, -99486, -90584, -60997, -69811, -105941, -107100, -113143, -166480, -114345, -67973, -13986, 5739, 13523, 29215, 50872, -4454, -49182, -36175, -22063, -51249, -23087, 14188, 5121, 19275, 32875, 40091, 31775, 27047, 1563, 57886, 111238, 92638, 74423, 62283, 12314, -39745, -10215, -12160, -2132, -9014, 4830, 73155, 87700, 77599, 18462, -30144, -76368, -85402, -66477, -17566, -24015, -25211, -29402, 11812, 4783, 14694, -32011, -100363, -100082, -47320, -34298, -5912, -12095, 9044, 16530, 22440, 3375, 25849, 49789, 43288, 6177, -9851, 3004, -10716, -37560, 3429, 85880, 122441, 85138, -4800, -35280, -42913, -8403, -2205, 2532, -11835, -35335, -36519, 12756, 40349]
2588D0349j7756l9739j4352K513P938L204J2177O811J9061L3364J0599p1305m6074
2575e3210k0177L7954N5637j5266j8338Q6243M6230l6182o3490l7048L9454N989
2563B7796k9285j7082r678N569O3802M8816j9856l2344k5360l4830l4523k3356
2551h0331L9857M0833q750l8189j8375L9405M8374q365K1693p571J4803K4642
2539F8026J020l8646o0080k3036r645k2492M7933M3797l3246m3697k7449o226
2527a03741k7242J04603M8525n1700k693l2821n8493k3811N892K7231O312j8740
2515a26678J2062K8629L4394J3558l3930m518M2717m125j0007J313j7260l0456
2503i4301j7423N5129N1214j9193J2138O0890L810J549M779j7507P036J2569n7568
$$ y = [40349, 22593, -17146, -31498, -28985, -21047, -17843, -5666, 1145, 20206, 53570, 64169, -7136, -53210, -73387, -35433, 20204, 4938, -13400, 72843, 119073, 82891, 19401, -17647, 21807, 27796, -1489, -18571, -28249, -22680, 41122, 89938, 70082, 37738, 12378, -22452, -56975, -80331, -40474, 359, -8391, -46580, -64955, -25550, 22824, 14459, 36152, 28581, 43384, 68026, 69046, 30400, -29680, -52716, -62361, -84853, -36920, 6877, -26369, -70066, -97515, -103741, -130983, -26380, 22145, -29555, -32248, -65069, -123562, -147373, -141481, -114250, -107938, -126678, -114616, -85987, -51593, -38035, -71965, -76483, -33766, -37891, -47898, -46585, -63845, -94301, -111724, -56595, -5381, -24574, -12436, 48454, 52264, 53813, 58592, 41085, 48121, 60690, 3122]
2490C122r2066K0594M6518m4591j8R1242o521K584K1592k9115k6260K6485L4163
2477D7729p9058k4809K7198L1627L0505l5867j4896j8593l5912M504K9728Q56
2465c6988J7500M5250M3329m1805n2748l4413L0803J6870N823j1642r428J173
2453b6276p281M8180K0207p609K8454l7509j8861J92l4535J6406O930J3089k3819
2440b2432l8702J1747R0132M8979m4524m9004j0832K2283l9j5442j6106Q684l9010
2427e4266j3335j7381J5242N4348L3595K1207l1739j5759j1786N1752R6084l3922
2415I4040m7166j5090j5407p713n8920o7675N7852L8084K9740l0502k1756k3330
2403f7843O6568M1732k9417K50j0583l0656j9575o168M6901O0977M292j0664o1767
$$ y = [3122, -88944, -68350, -21832, -66423, -66441, 24801, 18280, 20864, 42456, 13341, -12919, 13566, 47729, -31329, -56138, -28940, 2687, 33192, -2675, -17571, -36164, -72076, -67572, -37844, -36988, -19488, 25762, 69091, 27286, -25462, -59875, -29072, -12202, -6379, -18021, -27449, -26276, -33557, 14623, 34830, 27221, 55675, 18166, -695, -503, -35038, -18632, -11702, 1387, -22432, -61134, -49387, 40745, 89724, 45200, -3804, -14636, 7647, 7608, -7834, -23940, -15256, -54266, -67601, -84982, -69740, -15392, 18203, 39410, 7671, -8088, -19874, 31878, 127962, 94040, 46874, 31784, 16377, 8664, -50256, -117931, -60079, -21995, 7745, -22757, -44513, -67843, -1275, 40457, 11040, 11290, 707, -29949, -49524, -55692, -8791, 52186, 56478, 45814, -15953]
2390a5953k2514J0468P8810o889l2853q862o1506l1872L4906K6468M6381j1198
2378E386L10J28J028K0144n5040J4179J6498l4007K1904M56m5835o9376l360L6736
2364i0849K5554L5183M1434J7504J1724l5315K7501L9541l828J3068J2655L775
2352I7947n873j3725J05535O1757r3748p0287m9424j9678M599k5355p8054M2061
2340d4245r85L3268P4051K5409n9150j4197l3650q0930L7040K6723J5214j3772
2328c5224J1197J2826l3004l3991j7077J0026K4485J2131O1435J8023M42K8678
2316E9947r24m744m293M6877j3560q1578j6320m3327j4618M6870J2375j1347p771
2303c2413l2570M1532l002j4998j9919K2583n8837L034K3432l9482k1844K7930
$$ y = [-15953, -38467, -27999, 50811, 43922, 11069, 2207, -59299, -91171, -56265, -29797, 16584, 5386, 5696, 5824, 6852, 26996, -28044, -13865, 2633, -31374, -9470, -9014, -54849, -124225, -127585, -90849, -65295, -30112, 11322, 28826, 40550, 5235, 32736, 72277, 68449, 81517, 94172, 97947, 92074, 78349, 183884, 245641, 151893, 81606, 32182, 12504, 17103, -8252, -86306, -44245, -45230, -11962, 62089, 87498, 28348, 14151, -19499, -100429, -63389, -36666, -21452, -35224, -24027, -11201, -44205, -78196, -95273, -85247, -60762, -48631, 12804, 30827, 31269, 59947, 59023, 54279, 49986, 96863, 83303, 1725, -14595, -57922, -72540, -25670, -13295, -24642, -32413, -64983, -23451, -26453, -41451, -61370, -38787, -97624, -94590, -71158, -110640, -132484, -104554]
$$ [...]
##END NTUPLES=NMR SPECTRUM
##END=
