##TITLE=Analysis number 326980
Compound Code sb 02086
Project Code adrs
Chemist Name georganics
##JCAMPDX= 6.0         $$ Bruker NMR JCAMP-DX V2.0
##DATA TYPE= NMR SPECTRUM
##DATA CLASS= NTUPLES
##ORIGIN= Bruker BioSpin GmbH
##OWNER= nmr
$$ XWIN-NMR		Version 3.5
$$ Mon Mar  5 15:06:05 2007 GMT Standard Time (UT+0h)  MAYBRIDGE\nmr@NMR_250MHZ
##.OBSERVE FREQUENCY= 250.131544655141
##.OBSERVE NUCLEUS= ^1H
##.ACQUISITION MODE= SIMULTANEOUS (DQD)
##.ACQUISITION SCHEME= undefined
##.AVERAGES= 16
##.DIGITISER RES= 18
##SPECTROMETER/DATA SYSTEM= dpx250
##.PULSE SEQUENCE= zg30
##.SOLVENT NAME= CDCl3
##.SHIFT REFERENCE= (INTERNAL, CDCl3, 0, 16.522)
##AUDIT TRAIL= $$ (NUMBER, WHEN, WHO, WHERE, WHAT)
$$ ##TITLE= Audit trail, XWIN-NMR		Version 3.5
$$ ##JCAMPDX= 5.01
$$ ##ORIGIN= Bruker BioSpin GmbH
$$ ##OWNER= nmr
$$ C:\u/data/dgb/nmr/ADRS/370/pdata/1/auditp.txt
$$ ##AUDIT TRAIL=  $$ (NUMBER, WHEN, WHO, WHERE, WHAT)
(   1,<2007-03-05 15:05:28.67 +000>,<MAYBRIDGE\nmr>,<NMR_250MHZ>,
      <created by zg, POWCHK disabled, PULCHK disabled
       configuration hash MD5:
       49 4B E0 1D 92 C2 6B 37 9F E6 65 BC 52 41 86 1D
       data hash MD5: 64K
       97 3E 48 A0 22 7D 18 78 0F 90 DB 8B 64 AF 36 F4>)
(   2,<2007-03-05 15:05:46.22 +000>,<MAYBRIDGE\nmr>,<NMR_250MHZ>,
      <Start of raw data processing
       ef LB = 0.3 FT_mod = 6 PKNL = 1 SI = 32K 
       data hash MD5: 32K
       0C CD 37 42 F0 47 96 79 1E 6A 34 27 DB D2 05 B3>)
(   3,<2007-03-05 15:05:48.11 +000>,<MAYBRIDGE\nmr>,<NMR_250MHZ>,
      <apk 
       data hash MD5: 32K
       A4 2E 8F 64 71 EA B0 0D 60 06 F4 C8 DB E5 3F A8>)
(   4,<2007-03-05 15:05:48.95 +000>,<MAYBRIDGE\nmr>,<NMR_250MHZ>,
      <abs ABSG = 5 
       data hash MD5: 32K
       2E B7 41 BA 7B 10 03 15 2D 5F CA 0F 9B B3 D8 EF>)
$$ ##END=
$$ 
$$ hash MD5
$$ 5D 25 4A B9 DA 15 D2 D7 0D 37 74 B6 C6 62 CB 95
##$RELAX= 
##$RELAX= 
##$RELAX= 
##$RELAX= 
##$RELAX= 
##$RELAX= 
##$RELAX= 
$$ Bruker specific parameters
$$ --------------------------
##$DU= <C:\u>
##$EXPNO= 370
##$NAME= <ADRS>
##$PROCNO= 1
##$TYPE= <nmr>
##$USER= <dgb>
##$AMP= (0..31)
100 100 100 100 100 100 100 100 100 100 100 100 100 100 100 100 100 100 
100 100 100 100 100 100 100 100 100 100 100 100 100 100 
##$AQSEQ= 0
##$AQ_mod= 3
##$AUNM= <au_zg>
##$AUTOPOS= <42 >
##$BF1= 250.13
##$BF2= 250.13
##$BF3= 250.13
##$BF4= 250.13
##$BF5= 500.13
##$BF6= 500.13
##$BF7= 500.13
##$BF8= 500.13
##$BYTORDA= 1
##$CFDGTYP= 0
##$CFRGTYP= 5
##$CHEMSTR= <none>
##$CNST= (0..31)
1 1 145 1 1 1 1 1 1 1 1 1 1 1 1 1 1 1 1 1 1 1 1 1 1 1 1 1 1 1 1 1 
##$CPDPRG= <>
##$CPDPRG1= <>
##$CPDPRG2= <>
##$CPDPRG3= <>
##$CPDPRG4= <mlev>
##$CPDPRG5= <mlev>
##$CPDPRG6= <mlev>
##$CPDPRG7= <mlev>
##$CPDPRG8= <mlev>
##$CPDPRGB= <>
##$CPDPRGT= <>
##$D= (0..31)
0 1 0 0 0 0 0 0 0 0.06 0 0 0 0 0 0 0.0002 0 0 0 0 0 0 0 0 0 0 0 0 0 0 
0 
##$DATE= 1173107127
##$DBL= (0..7)
120 120 120 120 120 120 120 120 
##$DBP= (0..7)
150 150 150 150 150 150 150 150 
##$DBP07= 0
##$DBPNAM0= <>
##$DBPNAM1= <>
##$DBPNAM2= <>
$$ [...]
##$SUBNAM7= <"">
##$SUBNAM8= <"">
##$SUBNAM9= <"">
##$SW= 20.6930455092707
##$SWIBOX= (0..15)
0 0 3 0 0 0 0 0 0 0 0 0 0 0 0 0 
##$SW_h= 5175.983436853
##$TD= 65536
##$TD0= 1
##$TE= 295.16
##$TE2= 300
##$TE3= 300
##$TEG= 300
##$TL= (0..7)
0 120 120 120 120 120 120 120 
##$TP= (0..7)
150 150 150 150 150 150 150 150 
##$TP07= 0
##$TPNAME0= <>
##$TPNAME1= <>
##$TPNAME2= <>
##$TPNAME3= <>
##$TPNAME4= <>
##$TPNAME5= <>
##$TPNAME6= <>
##$TPNAME7= <>
##$TPOAL= (0..7)
0.5 0.5 0.5 0.5 0.5 0.5 0.5 0.5 
##$TPOFFS= (0..7)
0 0 0 0 0 0 0 0 
##$TUNHIN= 0
##$TUNHOUT= 0
##$TUNXOUT= 0
##$USERA1= <user>
##$USERA2= <user>
##$USERA3= <user>
##$USERA4= <user>
##$USERA5= <user>
##$V9= 5
##$VALIST= <valist>
##$VCLIST= <CCCCCCCCCCCCCCC>
##$VD= 0
##$VDLIST= <DDDDDDDDDDDDDDD>
##$VPLIST= <PPPPPPPPPPPPPPP>
##$VTLIST= <TTTTTTTTTTTTTTT>
##$WBST= 1024
##$WBSW= 4
##$XGAIN= (0..3)
0 0 0 0 
##$XL= 0
##$YL= 0
##$YMAX_a= 811865
##$YMIN_a= -842745
##$ZGOPTNS= <>
##$ZL1= 120
##$ZL2= 120
##$ZL3= 120
##$ZL4= 120
##$ABSF1= 16.522
##$ABSF2= -4.171173
##$ABSG= 5
##$ABSL= 3
##$ALPHA= 0
##$AQORDER= 0
##$ASSFAC= 0
##$ASSFACI= 0
##$ASSFACX= 0
##$ASSWID= 0
##$AUNMP= <proc_1d>
##$AZFE= 0.1
##$AZFW= 0.1
##$BCFW= 0
##$BC_mod= 0
##$BYTORDP= 0
##$COROFFS= 0
##$CY= 12.5
##$DATMOD= 1
##$DC= 0
##$DFILT= <>
##$DTYPP= 0
##$F1P= 14.0000005364418
##$F2P= -0.99999901652339
##$FCOR= 0.5
##$FTSIZE= 32768
##$FT_mod= 6
##$GAMMA= 0
##$GB= 0
##$INTBC= 1
##$INTSCL= 1
##$ISEN= 128
##$LB= 0.3
##$LEV0= 0
##$LPBIN= 0
##$MAXI= 10000
##$MC2= 0
##$MEAN= 0
##$ME_mod= 0
##$MI= 0
##$NCOEF= 0
##$NC_proc= -1
##$NLEV= 6
##$NOISF1= 0
##$NOISF2= 0
##$NSP= 0
##$NTH_PI= 0
##$NZP= 0
##$OFFSET= 16.522
##$PC= 1
##$PHC0= 224.6088
##$PHC1= 5.35641
##$PH_mod= 1
##$PKNL= yes
##$PPARMOD= 0
##$PSCAL= 4
##$PSIGN= 0
##$REVERSE= no
##$SF= 250.13
##$SI= 32768
##$SIGF1= 0
##$SIGF2= 0
##$SINO= 400
##$SIOLD= 32768
##$SREGLST= <1H.CDCl3>
##$SSB= 0
##$STSI= 32768
##$STSR= 0
##$SW_p= 5175.98343685301
##$SYMM= 0
##$S_DEV= 0
##$TDeff= 65536
##$TDoff= 0
##$TI= <Analysis number 999999
Compound Code 99
Book Reference 9
Project Code 9>
##$TILT= no
##$TM1= 0
##$TM2= 0
##$TOPLEV= 0
##$USERP1= <user>
##$USERP2= <user>
##$USERP3= <user>
##$USERP4= <user>
##$USERP5= <user>
##$WDW= 1
##$XDIM= 32768
##$YMAX_p= 409930753
##$YMIN_p= -240571
$$ End of Bruker specific parameters
$$ ---------------------------------
##NTUPLES= NMR SPECTRUM
##VAR_NAME=  FREQUENCY,     SPECTRUM/REAL,   SPECTRUM/IMAG
##SYMBOL=    X,             R,               I
##VAR_TYPE=  INDEPENDENT,   DEPENDENT,       DEPENDENT
##VAR_FORM=  AFFN,          ASDF,            ASDF
##VAR_DIM=   32768,         32768,           32768
##UNITS=     HZ,            ARBITRARY UNITS, ARBITRARY UNITS
##FACTOR=    0.157963299565203, 1,           1
##FIRST=     4132.6476996994, 0,             0
##LAST=      -1043.33573715361, 0,           0
##MIN=       -1043.33573715361, -240571,     0
##MAX=       4132.6476996994, 409930753,     0
$$ Real data points
##PAGE= N=1
##DATA TABLE= (X++(R..R)), XYDATA
$$ [...]
17455B76586J0170M1144L0539r998j302L62m8171n9696m0301m2859m1955k8405
$$ 276586 286756 327900 358439 348441 347139 347501 299330 239634 199333 156474 114519 86114
17443H6114j6311k11P636j284j9933j8260q046o936m997l068m683k703P12K137
$$ 86114 69803 69592 77228 75944 56011 37751 29705 22769 17772 14704 10021 7318 8030 10167
17429A0167K908K615O10j68j034j721J509j710P10L189j970j696k370j647P4o6
$$ 10167 13075 15690 16300 16132 15098 13377 14886 13176 13886 17075 15105 13409 11039 9392 9466 9400
17413I400J282J408q84j186j890m84K451P83J18q92J550p72J819R28K596L873
$$ 9400 10682 12090 11206 10020 8130 7646 10097 10880 10998 10106 11656 10884 12703 13631 16227 20100
17397B0100k263j838l416j144J942k476m857p43L827J435l271k43r16L225j576
$$ 20100 17837 15999 12583 11439 13381 10905 6048 5305 9132 10567 7296 7053 6137 9362 7786
17382G786m145r44J658r1q8O650N29j454K296l08m063l421J218n74Q64R96k337
$$ 7786 3641 2697 4355 4264 4176 10826 11355 9901 12197 11889 7826 4405 5623 5049 5913 6909 4572
17365D572k118J775K96l017M54J503n18k636k314K508o06k254Q97K643R71R70
$$ 4572 2454 4229 4525 1508 1962 3465 2947 311 -2003 505 -101 -2355 -1458 1185 2156 3126
17349C126P32l247j840L29K118R1J532k22O5M6l472r97J937r6Q43j568P40n35
$$ 3126 3858 611 -1229 -900 1218 1309 2841 2619 2684 2730 -742 -1739 198 102 945 -623 117 -418
17331d18O60J947K522Q64O03K493P54J926l41k287J373J531M29k706j3K745J144
$$ -418 242 2189 4711 5575 6178 8671 9425 11351 11010 8723 10096 11627 12056 9350 9337 12082 13226
17314A3226J82j438m22M086K87o486l199J232Q49K021L87k132m56L306K516K998
$$ 13226 13408 11970 11548 15634 15921 9435 6236 7468 8317 10338 10725 8593 8137 11443 13959 16957
17298A6957O44K43k455j186P09K108K76k809l476m146j186m02O94K753K865j01
$$ 16957 17601 17844 15389 14203 14912 17020 17296 14487 11011 6865 5679 5277 5971 8724 11589 11488
17282A1488L964k10J39l25J102m007k093J054L055Q84P0m81j405j32J656o87J594
$$ 11488 15452 15242 15381 15056 16158 12151 10058 11112 14167 15051 15121 14640 13235 13103 14759 14072 15666
17265A5666K562N003O551o22l33j553m245j010r65j35K104k80j144m02K469O153
$$ 15666 18228 23231 29782 29160 28827 27274 23029 22019 21054 20919 23023 22743 21599 21197 23666 29819
17249B9819K797k060l040o455l536M048j606j503o40O13j706j7L676J921k008
$$ 29819 32616 30556 27516 21061 17525 21573 19967 18464 17824 18437 16731 16714 20390 22311 20303
17234B0303Q83k51r25k398J625K407q69M695O46j098m122k260j85j85Q05L300
$$ 20303 21186 20935 20010 17612 19237 21644 20775 25470 26116 25018 20896 18636 18451 18266 19071 22371
17218B2371r62k435K678P026L058l711j878J283j874j455j370l95K428K079M468
$$ 22371 21409 18974 21652 28678 31736 28025 26147 27430 25556 24101 22731 22336 24764 26843 31311
17203C1311J94m04L279K311l569k964k177j795j355n450o405r1K783k23r81k868
$$ 31311 31505 31101 34380 36691 33122 30158 27981 26186 24831 19381 12976 12885 15668 15445 14464 11596
17187A1596O06K079K723K2o026K87O81j766l42j61L406J119j88J935N26J635p85
$$ 11596 12202 14281 17004 17026 11000 11287 11968 10202 9860 9699 13105 14224 14036 15971 16497 18132 17347
17170A7347K57O43K231L795K629L802M843N469M840Q785N257r56j489M65N970
$$ 17347 17604 18247 20478 24273 26902 30704 35547 41016 45856 54641 59898 58942 57453 57918 63888
17155F3888j855n115r19k729K42P124M214J434j353K303m512p636o651n569m611
$$ 63888 62033 56918 55999 53270 53512 60636 64850 66284 64931 67234 62722 55086 48435 42866 38255
17140C8255k245p61m991l042q98j057J657L382q35k647K462J209K517J341j427
$$ 38255 36010 35249 30258 27216 26318 25261 26918 30300 29465 26818 29280 30489 33006 34347 32920
17125C2920l675K625M279k31k83L986J612k007j34K137J76n76j450J559j651J027
$$ 32920 29245 31870 36149 35918 35635 39621 41233 39226 39092 41229 41405 40829 39379 40938 39287 40314
17109D0314Q15j524k025k742n184J575K672q41o9j213O79L09m507l735J82L99
$$ 40314 41129 39605 37580 34838 29654 31229 33901 33060 32991 31778 32457 32766 28259 24524 24706 25105
17093B5105L342L436O99j137J090J780n49m893J779L610K150k045n393P35M786
$$ 25105 28447 31883 32582 31445 32535 34315 33766 28873 30652 34262 36412 34367 28974 29709 34495
17078C4495K461o09l959p09O04k864J595J313l997j688j566j477j038L127O325
$$ 34495 36956 36347 32388 31679 32283 29419 31014 32327 28330 26642 25076 23599 22561 25688 32013
17063C2013L902J112K706K872m82J683R233k190m663M757K034M062M741N564J272
$$ 32013 35915 37027 39733 42605 42123 43806 53039 50849 46186 50943 52977 57039 61780 67344 68616
17048F8616J91K825M141K067M923n71P44j174L769J0800J2480J5981K6504K1381
$$ 68616 68807 71632 75773 77840 82763 82192 82936 81762 85531 96331 108811 124792 151296 172677
17034A72677J6356J7207L960m417O45m209j2390p591pN993N363N401J2807n95
$$ 172677 189033 206240 210200 205783 206428 202219 189829 182238 182231 188224 193587 198988 211795 211200
17020B11200j0540o177j3368k6967k1466j4953j3413j1544n312k433k176o7j728
$$ 211200 200660 194483 181115 154148 132682 117729 104316 92772 87460 85027 82851 82784 81056
17007H1056j801N3O72r87r7N3j751J674J989l14K408K786J653j714O840O426L226
$$ 81056 79255 79308 79980 78993 78896 78949 77198 78872 80861 80547 82955 85741 87394 85680 92520 98946 102172
16990A02172J576J582P463L855K977N450K811M093M047M812r28R76M653L856N428
$$ 102172 103748 105330 112793 116648 119625 125075 127886 131979 136026 140838 139910 140886 145539 149395 154823
16975A54823N841O412N979K158LK837L490J956K399R46Q36O773j659k529L184
$$ 154823 160664 167076 173055 175213 175216 178053 181543 183499 185898 186844 187680 194453 192794 190265 193449
16960A93449P579R296Q391Q981J2231P900N222J4149R357O339Q624J8450J6577
$$ 193449 201028 210324 218715 227696 239927 247827 253049 267198 276555 282894 291518 309968 326545
16947C26545J7576K1049K6496L0639K7674L8540N4315N6427N6080Q1202J04467
$$ 326545 344121 365170 391666 422305 449979 488519 542834 599261 655341 736543 841010
16936H41010O4413L0412O6071N8552Q974K9424P3942P1105R5729J43310J24149
$$ 841010 905423 935835 1001906 1060458 1069432 1098856 1172798 1243903 1339632 1482942 1607091
16925A607091Q3311J09150J30779J01479J25667K04802K54620L47674N01594N88553
$$ 1607091 1690402 1799552 1930331 2031810 2157477 2362279 2616899 2964573 3466167 4054720
16915D054720P07093J088086J724635K781697M810168P561964P954976P383158
$$ 4054720 4761813 5849899 7574534 10356231 15166399 22728363 30683339 38066497
16907C8066497J1873310J1940729O38288k76584M596283l797443r443504l573025
$$ 38066497 49939807 61880536 62518824 62242240 66838523 63041080 53597576 50024551
16899E0024551L88051q01824R09979Q033822P411471k748487j128063K194251
$$ 50024551 50412602 49610778 50520757 58554579 65966050 63217563 62089500 64283751
16891F4283751p857166j2280786q182568p516963q136461o087235l817702k402400
$$ 64283751 56426585 44145799 35963231 28446268 20309807 14222572 10404870 8002470
16883H002470j530484j067852q65261o49932m77323m10875l38902k38950j47399
$$ 8002470 6471986 5404134 4538873 3888941 3411618 3000743 2661841 2422891 2275492
16874B275492j23527j38156p8171o3890j65245j64114j21724j60422j60992j14970
$$ 2275492 2151965 2013809 1935638 1871748 1706503 1542389 1420665 1260243 1099251 984281
16864I84281p6342n5552k8251M116j1150m2763l0270l5409p6682q0651o6413o0924
$$ 984281 907939 852387 824136 828252 817102 774339 744069 708660 631978 551327 484914 423990
16852D23990n2692m0340l0194k4794j7317j6108j8251j4782j0345q762q425p834
$$ 423990 371298 330958 300764 275970 258653 242545 224294 209512 199167 190405 181980 174146
16840A74146n298l000p314j0656o193l915r440q145j0560q466p360q118m332j643
$$ 174146 168848 165848 158534 147878 141685 137770 128330 120185 109625 101159 93799 85681 81349 79706
16826G9706l040k424l869o64j056j842K625j498l960j067J674l256l780j467j322
$$ 79706 76666 74242 70373 69709 68653 66811 69436 67938 63978 62911 64585 61329 57549 56082 54760
16811E4760J487N734M425k039k617J125O74j403j889k805k464j841K348M16K32
$$ 54760 56247 61981 66406 64367 61750 62875 63549 62146 60257 57452 54988 53147 55495 55911 56143
16796E6143R27j235l464k516j077m463k856J411Q65r27K846K876n020n684o936
$$ 56143 57070 55835 52371 49855 48778 44315 41459 42870 43735 42808 45654 48530 43510 37826 30890
16781C0890p536q922p563r904r535p95Q79n612j117O496k776p742n076n249m765
$$ 30890 23354 14432 6869 -3035 -12570 -13365 -12486 -18098 -19215 -12719 -15495 -23237 -28313 -33562 -38327
16766c8327q408m98N119j644M261Q305N035K480K720O138K026k090l93J550J037
$$ -38327 -46735 -47233 -42114 -43758 -39497 -31192 -26157 -23677 -20957 -14819 -12793 -14883 -15276 -13726 -12689
16751a2689M083M035l742n943L190L758J909K482L406J964L07j87N65l945L533
$$ -12689 -8606 -4571 -8313 -14256 -11066 -7308 -5399 -2917 489 2453 2760 2573 3138 -807 2726
16736B726N689K566P98L254P23k916j521K738j90l589P87K364k193l775j462j380
$$ 2726 8415 10981 11779 15033 15756 12840 11319 14057 13867 10278 11065 13429 11236 7461 5999 4619
16720D619q85P88J850M52r42J331L82m525K5N22K184K505l367k109L021L476j782
$$ 4619 3734 4522 6372 6824 5882 7213 7595 3070 3095 3617 5801 8306 4939 2830 5851 9327 7545
16703G545k066L226l409k880K441L040k769m295K58k06o763l794J459N54o79j061
$$ 7545 5479 8705 5296 2416 4857 7897 5128 833 1091 885 -5878 -9672 -8213 -7659 -8338 -9399
16687i399Mj891p40J098q15J303K472j631m612K897R88J408O00L05j559j891K928
$$ -9399 -9395 -11286 -12026 -10928 -11743 -10440 -7968 -9599 -14211 -11314 -10326 -8918 -8318 -8013 -9572 -11463 -8535
16670h535J359K437L670P45K544M404n73j138K501J327j071j150j825P59L912
$$ -8535 -7176 -4739 -1069 -324 2220 6624 6051 4913 7414 8741 7670 6520 4695 5454 9366
16655I366j487k157J721K699K518L847m208k928J350L91o63j008M48n38K80j711
$$ 9366 7879 5722 7443 10142 12660 16507 12299 9371 10721 11112 10449 9441 9889 9351 9631 7920
16639G920K749p80l207k576k376l522k943K013L093m57J533q34k716n58P0K419
$$ 7920 10669 9889 6682 4106 1730 -1792 -4735 -2722 371 -86 1447 613 -2103 -2661 -2591 -172
16623a72J838J092J412M6k6k07j194o522j169K399J074J880q8q99l746j158p58
$$ -172 1666 2758 4170 4216 4190 3983 2789 -3733 -4902 -2503 -1429 451 363 -536 -4282 -5440 -6198
16606f198k272J377K360j590j590j916l888l449k211J811m20m067j427M415K722
$$ -6198 -8470 -7093 -4733 -6323 -7913 -9829 -13717 -17166 -19377 -17566 -17986 -22053 -23480 -19065 -16343
16591a6343l147j517j363Q37K575K292j964N9J521J630L931P009q67l173n093
$$ -16343 -19490 -21007 -22370 -21533 -18958 -16666 -18630 -18571 -17050 -15420 -11489 -4480 -5347 -8520 -13613
16576a3613p35M371K777j237J573j542L33j687j522p02J549J336J379k27k189
$$ -13613 -14348 -9977 -7200 -8437 -6864 -8406 -8073 -9760 -11282 -11984 -10435 -9099 -7720 -7947 -10136
16561a0136k243j907j087J61J656J844p82l27L066q6K44K182K544J590j238j678
$$ -10136 -12379 -14286 -15373 -15212 -13556 -11712 -12494 -12821 -9755 -9841 -9597 -7415 -4871 -3281 -4519 -6197
16545f197o13n299k115K69J281k399K261M383j10j593J265K762o3Q30k009j139
$$ -6197 -6810 -12109 -14224 -13955 -12674 -15073 -12812 -8429 -8539 -10132 -8867 -6105 -6168 -5338 -7347 -8486
16529h486M309J142j910J171j949l044q65m408J965J903K7K982J526k002k404
$$ -8486 -4177 -3035 -4945 -3774 -5723 -8767 -9632 -14040 -12075 -10172 -10145 -7163 -5637 -7639 -10043
16514a0043j575K83m57j3o14J498J679Q18J856k99k036j94l701o92J87p62Q7K422
$$ -10043 -11618 -11335 -11792 -11805 -12419 -10921 -9242 -8424 -6568 -6867 -8903 -9097 -12798 -13490 -13303 -14065 -13978 -11556
16496a1556M858P42j288P50k827o140k841J813K933R85n66m57K50L419P93Jj80
$$ -11556 -6698 -5956 -7244 -6494 -9321 -15461 -18302 -16489 -13556 -12571 -13137 -13594 -13344 -9925 -9132 -9131 -9311
16479i311K129P84l225j582k078j286K365K085N208J679J657L479k97l327p91
$$ -9311 -7182 -6398 -9623 -11205 -13283 -14569 -12204 -10119 -4911 -3232 -1575 1904 1607 -1720 -2511
16464b511J000L828L449Q14j405j222L16J01j650k963j260M86J546k346q92J48
$$ -2511 -1511 2317 5766 6580 5175 3953 4269 4370 2720 -243 -1503 -1017 529 -1817 -2709 -2561
16448b561Q93j049q9j163J013R33J532q77J545R87j076j940k999j563l320q55
$$ -2561 -1668 -2717 -2806 -3969 -2956 -2023 -491 -1368 177 1164 88 -1852 -4851 -6414 -9734 -10589
16432a0589M715J209m138j149l84j911k008q23K87r48J781N8L099J152k150j705
$$ -10589 -5874 -4665 -8803 -9952 -10336 -12247 -14255 -15078 -14791 -15739 -13958 -13900 -10801 -9649 -11799 -13504
16416a3504K88m35K180K115j546j491N365J720k795j391N95J277j147L442p51
$$ -13504 -13216 -13651 -11471 -9356 -10902 -12393 -7028 -5308 -8103 -9494 -8899 -7622 -8769 -5327 -6078
16401f078k667k617o93N02k830p3J816J998O5k055K784K886k694q45K474j053
$$ -6078 -8745 -11362 -12055 -11553 -14383 -14456 -12640 -10642 -10577 -12632 -9848 -6962 -9656 -10501 -8027 -9080
16385i080k02L567j899l475o76O02j228l41j86j135J104L559J656N5Q84J172L796
$$ -9080 -9282 -5715 -7614 -11089 -11765 -11163 -12391 -12732 -12918 -14053 -12949 -9390 -7734 -7679 -6795 -5623 -1827
16368a827K141j005l245k241J693M072N43k781K169L133j470k392J637M793L520
$$ -1827 314 -691 -3936 -6177 -4484 -412 131 -2650 -481 2652 1182 -1210 427 5220 8740
16353H740l009M48L266M007Q697R671J4655K8247M3222L9325M0506O3419N6316
$$ 8740 5731 6179 9445 13452 22149 31820 46475 74722 117944 157269 197775 261194 317510
16340C17510N864M063K2208j7239m2504k0055l443n796J0152M5990L6440j4824
$$ 317510 323374 327437 349645 332406 289902 269847 266404 260608 270760 316750 353190 338366
16328C38366m644K314m6158o3822m3729l9362m3324l0853j6999j1847o934n940
$$ 338366 333722 336036 289878 226056 182327 142965 99641 68788 51789 39942 33008 27068
16316B7068q632p054j396o24k799l040J741K422J182k451l183K624j125k214n45
$$ 27068 18436 11382 9986 9362 6563 3523 5264 7686 8868 6417 3234 5858 4733 2519 1974
16301A974k731k838q54o64j100K005P34k300L67R21k46K619J174k591j513l698
$$ 1974 -757 -3595 -4449 -5113 -6213 -4208 -3474 -5774 -5407 -4486 -4732 -2113 -939 -3530 -5043 -8741
16285h741k327q87K438K164M20j309k26N9N6J287J22J152j696l072q47K576j471
$$ -8741 -11068 -11955 -9517 -7353 -6933 -8242 -8468 -8409 -8353 -7066 -6944 -5792 -7488 -10560 -11407 -8831 -10302
16268a0302j848Q30L024l103Q91J752J326L902L75j049J21J625k508l824J732
$$ -10302 -12150 -11320 -8296 -11399 -10508 -8756 -7430 -3528 -3153 -4202 -4081 -2456 -4964 -8788 -7056
16253g056J106k209m568j134J386K444m4O73J099J588J783j477l319K669J590
$$ -7056 -5950 -8159 -12727 -13861 -12475 -10031 -10075 -9402 -8303 -6715 -4932 -6409 -9728 -7059 -5469
16238e469M06j714l219k566J158L18P17j137k55m14J161K975j182m97n67k42K292
$$ -5469 -5063 -6777 -9996 -12562 -11404 -11086 -10369 -11506 -11761 -12175 -11014 -8039 -9221 -9718 -10285 -10527 -8235
16221h235j049R90M44j270R83m68j728J419Nl647j386L786K048J38k871J17J851
$$ -8235 -9284 -8294 -7850 -9120 -8137 -8605 -10333 -8914 -8909 -12556 -13942 -10156 -8108 -7970 -10841 -10724 -8873
16204h873J449j986k073L005J982p18k675j221K826l620K142P12m853Q31P768
$$ -8873 -7424 -9410 -11483 -8478 -6496 -7214 -9889 -11110 -8284 -11904 -9762 -9050 -13903 -13072 -5304
16189e304K313k13j837j5M13j342l7K696L252M20m677n86K387o19l028K28k530
$$ -5304 -2991 -3204 -5041 -5056 -4643 -5985 -6022 -3326 -74 346 -4331 -4917 -2530 -3149 -6177 -5949 -8479
16172h479k808Q53L15j431L67J643m3N97j478j795k49R28m63J741K186J351M6
$$ -8479 -11287 -10434 -10119 -11550 -11183 -9540 -9583 -8986 -10464 -12259 -12508 -11580 -12043 -10302 -8116 -6765 -6719
16155f719n44N8J985j35k70J546J641P58k345N75k052l16M22j507j456L51L230
$$ -6719 -7263 -7205 -5220 -5355 -5625 -4079 -2438 -1680 -4025 -3450 -5502 -5818 -5396 -6903 -8359 -8008 -4778
16138d778Q21l021J826O556o33l650j224j128r16K360R39j031j216k257j333J640
$$ -4778 -3957 -6978 -5152 1404 771 -2879 -4103 -5231 -6147 -3787 -2848 -3879 -5095 -7352 -8685 -7045
16122g045L122J076K4L65L029R60m449K4k244K83J50R0r69k803M25K469m23k588
$$ -7045 -3923 -2847 -2823 -2458 571 1531 -2918 -2894 -5138 -4855 -4705 -4615 -5584 -8387 -7962 -5493 -5916 -8504
16104h504M05K29j589n79J149P262j270k458k714j116R97J18M68J158j726j027
$$ -8504 -8099 -7870 -9459 -10038 -8889 -1627 -2897 -5355 -8069 -9185 -8188 -8070 -7602 -6444 -8170 -9197
16088i197J378J989R71P1k565j3J675L152j74j763k00r17j020l443J03K410k055
$$ -9197 -7819 -5830 -4859 -4788 -7353 -7366 -5691 -2539 -2713 -4476 -4676 -5593 -6613 -10056 -9953 -7543 -9598
16071i598r3j640N93K136J484Q3K89k709K9M29k123K038K891k50l996j687P103
$$ -9598 -9691 -11331 -10738 -8602 -7118 -7035 -6746 -9455 -9426 -8997 -11120 -9082 -6191 -6441 -10437 -12124 -5021
16054e021M397L95k52q60J793K927J072m072m550K492K61q8K319J098j402j381
$$ -5021 -624 -229 -481 -1341 452 3379 4451 379 -4171 -1679 -1418 -1506 813 1911 509 -872
16038h72n014j971J928J420k273J290j241k517K67Q66k219M053K294l350j259
$$ -872 -5886 -7857 -5929 -4509 -6782 -5492 -6733 -9250 -8983 -8117 -10336 -6283 -3989 -7339 -8598
16023h598J428p09R09K693K462n5j465k350l546J135L049L359j245j881k954j703
$$ -8598 -7170 -7879 -6970 -4277 -1815 -1870 -3335 -5685 -9231 -8096 -5047 -1688 -2933 -4814 -7768 -9471
16007i471L55L682J21k670o141Q02L868m14j396m62M689M028L254j495j764m01
$$ -9471 -9116 -5434 -5313 -7983 -14124 -13322 -9454 -9868 -11264 -11726 -7037 -3009 245 -1250 -3014 -3415
15991c415k289j414L277k32l123J181K773k497k577n12J37M897m63m512j054J183
$$ -3415 -5704 -7118 -3841 -4073 -7196 -6015 -3242 -5739 -8316 -8828 -8691 -3794 -4257 -8769 -9823 -8640
15975h640j450K606j098o26L67p89k1p53J763K624n22L945K702K803K263k853
$$ -8640 -10090 -7484 -8582 -9208 -8841 -9630 -9651 -10404 -8641 -6017 -6539 -2594 108 2911 5174 2321
15959B321j372l0j225m562J053L616L34o27j020J403j838l523j817k084L376J283
$$ 2321 949 919 -306 -4868 -3815 -199 135 -492 -1512 -109 -1947 -5470 -7287 -9371 -5995 -4712
15943d712l177k241J20j574k1o75J261P8K120K429j801q87J026j591Q64k606J718
$$ -4712 -7889 -10130 -10010 -11584 -11605 -12280 -11019 -10941 -8821 -6392 -8193 -9080 -8054 -9645 -8781 -11387 -9669
15926i669M906R53j697j179J503j22k324j322Q24P75J980R98j214j15P77M383
$$ -9669 -4763 -3810 -5507 -6686 -5183 -5305 -7629 -8951 -8127 -7352 -5372 -4374 -5588 -5703 -4926 -543
15910e43O02l594k27Q24m92k979m030P68J516J403p74N424K478n821j936N32P19
$$ -543 59 -3535 -3762 -2938 -3430 -6409 -10439 -9671 -8155 -6752 -7526 -2102 376 -5445 -7381 -6849 -6130
15893f130J723n2n43K242j353J240J716k819p5K935j61K9Q21m92l768n80J772
$$ -6130 -4407 -4459 -5002 -2760 -4113 -2873 -1157 -3976 -4051 -1116 -1277 -1248 -427 -919 -4687 -5267 -3495
15876c495j582J017p29m45O35J926j700L453J272p62k414o10m22j297j990J754
$$ -3495 -5077 -4060 -4789 -5234 -4599 -2673 -4373 -920 352 -410 -2824 -3434 -3856 -5153 -7143 -5389
15860e389j144J026Q17p23m356j839K033K337L7K245j090m97m07J049K219Q27
$$ -5389 -6533 -5507 -4690 -5413 -9769 -11608 -9575 -7238 -7201 -4956 -6046 -6543 -6950 -5901 -3682 -2855
15844b855j966j427j578J268N81o58K434N694j428J8R45l404j771q31l108j54
$$ -2855 -4821 -6248 -7826 -6558 -5977 -6635 -4201 1493 65 83 1028 -2376 -4147 -4978 -8086 -8240
15828h240O91n04P82L358N42m40K983k572P53n29k485J064R49l014N50K858K641
$$ -8240 -7549 -8053 -7271 -3913 -3371 -3811 -828 -3400 -2647 -3176 -5661 -4597 -3648 -6662 -6112 -3254 -613
15811f13k026j802j198L798j2m992J081K284N16p39N55J330n41j871Om422k62
$$ -613 -2639 -4441 -5639 -1841 -1853 -6845 -5764 -3480 -2964 -3703 -3148 -1818 -2359 -4230 -4224 -8646 -8908
15794h908N04R97r90J30L529J791o70j832j362L19k767J136K506j075m72Q06k26
$$ -8908 -8404 -7407 -8397 -8267 -4738 -2947 -3617 -5449 -6811 -6492 -9259 -8123 -5617 -6692 -7164 -6358 -6584
15777f584K083L050K736l44k617J041P24j312k624R0j441k035r27K018K59k215
$$ -6584 -4501 -1451 1285 941 -1676 -635 89 -1223 -3847 -3757 -5198 -7233 -8160 -6142 -5883 -8098
15761h098J239L043K180N238l108m776p3j011Q20r27r12P21p72j439K675j785
$$ -8098 -6859 -3816 -1636 3602 494 -4282 -4355 -5366 -4546 -5473 -6385 -5664 -6436 -7875 -5200 -6985
15745f985j217K951n70J153k667j026M65J309O29L187P10j865k041l553r76j82
$$ -6985 -8202 -5251 -5821 -4668 -7335 -8361 -7896 -6587 -5958 -2771 -2061 -3926 -5967 -9520 -10496 -10678
15729a0678j657L510N013M19k507m65K4j171J27o73J256N2j511j162j033L338
$$ -10678 -12335 -8825 -3812 -3393 -5900 -6365 -6341 -7512 -7385 -8058 -6802 -6750 -8261 -9423 -10456 -7118
15713g118L399J000j878K509k21N83j483j492N66M72j772J30p91K67k011q52l8
$$ -7118 -3719 -2719 -4597 -2088 -2309 -1726 -3209 -4701 -4135 -3663 -5435 -5305 -6096 -5829 -7840 -8692 -8730
15696h730K079M26L016J243K003k094Q62p95k992k460l15K621p52j525j256L322
$$ -8730 -6651 -6225 -3209 -1966 37 -2057 -1195 -1990 -4982 -7442 -7757 -5136 -5888 -7413 -8669 -5347
15680e347j241j395o77J782J705R82O29J772n42p75j01K782n05j62m44k574k215
$$ -5347 -6588 -7983 -8660 -6878 -5173 -4191 -3562 -1790 -2332 -3107 -3208 -426 -931 -1093 -1537 -4111 -6326
15663f326j55K577j136o44l33K954L925J464k036j036p46Q84K012j452R79n517
$$ -6326 -6481 -3904 -5040 -5684 -6017 -3063 862 2326 290 -746 -1492 -608 1404 -48 931 -4586
15647d586J671L486k906l121j619j061J689J697p30k255J88J263j703k68J463
$$ -4586 -2915 571 -2335 -5456 -7075 -8136 -6447 -4750 -5480 -7735 -7547 -6284 -7987 -8255 -6792
15632f792K364M06nM95N04o52l497m82K619m51L67K108j715j497L030k9j045l143
$$ -6792 -4428 -4022 -4027 -3532 -3028 -3680 -7177 -7659 -5040 -5491 -5124 -3016 -4731 -6228 -3198 -3227 -4272 -7415
15614g415q33P27J040k035N87K153K78J9L807k75L139p19k237k515J514J90m541
$$ -7415 -8248 -7521 -6481 -8516 -7929 -5776 -5498 -5479 -1672 -1947 1192 473 -1764 -4279 -2765 -2575 -7116
15597g116o97J405J793K149j424O10Q30m005j484j592j653K743K971j314J8K892
$$ -7116 -7813 -6408 -4615 -2466 -3890 -3280 -2450 -6455 -7939 -9531 -11184 -8441 -5470 -6784 -6766 -3874
15581c874p86l903K529q03J817R41L305K07j161m627j442j782j546K376J075K578
$$ -3874 -4660 -8563 -6034 -6837 -5020 -4079 -774 -567 -1728 -6355 -7797 -9579 -11125 -8749 -7674 -5096
15565e096J282j637K558J56j415n49j310K496K085j648j122r71J92Q88K56k395
$$ -5096 -3814 -5451 -2893 -2737 -4152 -4701 -6011 -3515 -1430 -3078 -4200 -5171 -4979 -4091 -3835 -6230
15549f230l879J527k5q48J053K207K686j027J934o46K198K45r46j310P46J443
$$ -6230 -10109 -8582 -8607 -9455 -8402 -6195 -3509 -4536 -2602 -3248 -1050 -805 -1751 -3061 -2315 -872
15533h72K670j96j226J087J427m957l545r84K297Q88J703k01l440K505L82J572
$$ -872 1798 1602 376 1463 2890 -2067 -5612 -6596 -4299 -3411 -1708 -1909 -5349 -2844 -2462 -890
15517h90K571j219l261j709J29n137l916M0L721J247K257j791j72Q11j047K654
$$ -890 1681 462 -2799 -4508 -4379 -9516 -13432 -13392 -9671 -8424 -6167 -7958 -8130 -7319 -8366 -5712
15501e712N51k535r99m37n55K028K671K227L743l051o343k061M277J329j654j251
$$ -5712 -5161 -7696 -8695 -9132 -9687 -7659 -4988 -2761 982 -2069 -8412 -10473 -6196 -4867 -6521 -7772
15485g772j396J763J715J5k210k289L42L237J611k491k878L244J9j818J736J402
$$ -7772 -9168 -7405 -5690 -5675 -7885 -10174 -9832 -6595 -4984 -7475 -10353 -7109 -7090 -8908 -7172 -5770
15469e770K253M653j445j281j425J41J248j991J130O18j585l537R83j69J464K558
$$ -5770 -3517 1136 -309 -1590 -3015 -2874 -1626 -3617 -2487 -1869 -3454 -6991 -6008 -6177 -4713 -2155
15453b155j215k508J482L988N42k021l430p94K81K091M84L64J684Q40q40j266
$$ -2155 -3370 -5878 -4396 -408 134 -1887 -5317 -6111 -5830 -3739 -3255 -2891 -1207 -367 -1207 -2473
15437b473j157j81o61k686J769R63k772j955L792M703K063K658o46k368j948L37
$$ -2473 -3630 -3811 -4472 -7158 -5389 -4426 -7198 -9153 -5361 -658 1405 4063 3417 1049 -899 -562
15421e62K62Q52k695j508N01l64N2M092l073p323k311J633r01J410N139K138p63
$$ -562 -300 552 -2143 -3651 -3150 -3514 -3462 630 -2443 -9766 -12077 -10444 -11345 -9935 -4796 -2658 -3421
15404c421P07M207j699k318j085K560J826k930j926j942J237K142n2m543m31J900
$$ -3421 -2714 1493 -206 -2524 -3609 -1049 777 -2153 -4079 -6021 -4784 -2642 -2694 -7237 -7668 -5768
15388e768J169K140J441j411Q03k846k580k436P21K163J478K74l596j446J310
$$ -5768 -4599 -2459 -1018 -2429 -1626 -4472 -7052 -9488 -8767 -6604 -5126 -4852 -8448 -9894 -8584
15373h584P34q70L745L257n18K092j666r59O75L373l115q63J737j379l528j437
$$ -8584 -7850 -8720 -4975 -1718 -2236 -144 -1810 -2769 -2094 1279 -1836 -2699 -962 -2341 -5869 -7306
15357g306l63o27j023J347n68j23L017J450J095j203J097K187J597o98K35L263
$$ -7306 -7669 -8296 -9319 -7972 -8540 -8663 -5646 -4196 -3101 -4304 -3207 -1020 577 -121 114 3377
15341C377l180m504L64P43j01L426P69j259l867R37k22O07m20j864n18j96J228
$$ 3377 197 -4307 -3943 -3200 -3301 125 894 -365 -4232 -3295 -3517 -2910 -3330 -5194 -5712 -5908 -4680
15324d680j610j65j445p07K118J822k743j660j43J747l61J774M291n94l20j651
$$ -4680 -6290 -6455 -7900 -8607 -6489 -4667 -7410 -9070 -9213 -7466 -7827 -6053 -1762 -2356 -2676 -4327
15308d327k236j427J252N595J186l698J28R12J578j101K069k793j509j778J472
$$ -4327 -6563 -7990 -6738 -1143 43 -3655 -3527 -2615 -1037 -2138 -69 -2862 -4371 -6149 -4677
15293d677p55r10K177j174j539K54L051J866P41k716Q85L80k526M858M49l875
$$ -4677 -5432 -6342 -4165 -5339 -6878 -6624 -3573 -1707 -966 -3682 -2797 -2417 -4943 -85 364 -3511
15277c511K504L05p17J224R94j523l39k470j94k143l289K202M068P70l158J161
$$ -3511 -1007 -702 -1419 -195 799 -724 -1063 -3533 -3727 -5870 -9159 -6957 -2889 -2119 -5277 -4116
15261d116J200r77M01J614L90J216J022l599O41j778j233L93M917J41m685l626
$$ -4116 -2916 -3893 -3492 -1878 -1488 -272 750 -2849 -2208 -3986 -5219 -4826 91 232 -4453 -8079
15245h079K60K101J680k208J187j993k915L69J540j607j023J777K106L903N293
$$ -8079 -7819 -5718 -4038 -6246 -5059 -7052 -9967 -9598 -8058 -9665 -10688 -8911 -6805 -2902 2391
15230B391J077k721j863l18J932k417m603j047L562L665K103R99o91k926k977
$$ 2391 3468 747 -1116 -1434 498 -1919 -6522 -7569 -4007 -342 1761 2760 2069 -857 -3834
15215c834k356P35J462J762j8L732K074p095n586L414J135L666K492k36l079j19
$$ -3834 -6190 -5455 -3993 -2231 -2249 1483 3557 -3538 -9124 -5710 -4575 -909 1583 1347 -1732 -1851
15199a851l530K445J906l36J085K877j291p746l403J481K172J722k568q32J06
$$ -1851 -5381 -2936 -1030 -1366 -281 2596 1305 -6441 -9844 -8363 -6191 -4469 -7037 -7869 -7763
15184g763J49q16J851K69j251k232P04L52k638N779O008L579p36l158l170R51
$$ -7763 -7614 -8430 -6579 -6310 -7561 -9793 -9089 -8737 -11375 -5596 412 3991 3255 97 -3073 -2122
15168b122m38n16J311j412M07Q91P5j138K798K099l511J773j481k834k866K140
$$ -2122 -2560 -3076 -1765 -3177 -2770 -1879 -1804 -2942 -144 1955 -1556 217 -1264 -4098 -6964 -4824
15152d824p07n299l495j58M636K291M3L116q07k741j655K097J392j49K434J707
$$ -4824 -5531 -10830 -14325 -14483 -9847 -7556 -7513 -4397 -5204 -7945 -9600 -7503 -6111 -6260 -3826 -2119
15136b119j372m238K758L823R56k624P84k09J15Q47J992k422m05k847J836J451
$$ -2119 -3491 -7729 -4971 -1148 -192 -2816 -2032 -2241 -2126 -1279 713 -1709 -2114 -4961 -3125 -1674
15120a674j020l089O40N136p47Q03J484l412j960J817m28j667k806j886p83J548
$$ -1674 -2694 -5783 -5143 -7 -754 49 1533 -1879 -3839 -2022 -2450 -4117 -6923 -8809 -9592 -8044
15104h044M182j699J627J636j757k313R35M355p95j143L11j133j976K348J395
$$ -8044 -3862 -5561 -3934 -2298 -4055 -6368 -5433 -1078 -1873 -3016 -2705 -3838 -5814 -3466 -2071
15089b071K623J090k538l43O41M45j987P05K528r66J217k101K379l11l718l54
$$ -2071 552 1642 -896 -1239 -598 -153 -2140 -1435 1093 127 1344 -757 1622 1311 -2407 -2761
15073b761R85M11k219l14P45k353j470L75J298J613J191j908K004K712L126L654
$$ -2761 -1776 -1365 -3584 -3898 -3153 -5506 -6976 -6601 -5303 -3690 -2499 -4407 -2403 309 3435 7089
15057G089k054m942j9l533n89m51K489J543j292J176n00k12J848q68k15l627l810
$$ 7089 5035 93 74 -3459 -4048 -4499 -2010 -467 -1759 -583 -1083 -1295 553 -315 -530 -4157 -7967
15040g967n97L82J423K602j133q81J939M823K358Q80j326J095k423l548j332J632
$$ -7967 -8564 -8182 -6759 -4157 -5290 -6171 -4232 591 2949 3829 2503 3598 1175 -2373 -3705 -2073
15024b073J692K007N79l095j647K323J09k634J169l419k359J999K242J294j22
$$ -2073 -381 1626 2205 -890 -2537 -214 -105 -2739 -1570 -4989 -7348 -5349 -3107 -1813 -1935
15009a935K5k065n49L720n23m162N09K100J54K531N75o0l547j785j49J756K651
$$ -1935 -1910 -3975 -4524 -804 -1327 -5489 -4980 -2880 -2726 -195 380 320 -3227 -5012 -5161 -3405 -754
14992g54N70K124L59k062R95K693L610N354p53n027l207m054k594j813k741J388
$$ -754 -184 1940 2299 237 1232 3925 7535 12889 12136 7109 3902 -152 -2746 -4559 -7300 -5912
14976e912qp39k032J023K936J981L210J181j825J011J870O33k880k234j753k050
$$ -5912 -5920 -6659 -8691 -7668 -4732 -2751 459 1640 -185 826 2696 3329 449 -1785 -3538 -5588
14960e588J783P87L128J508k157q81M84J550R26k435j131L123M02k757j710l427
$$ -5588 -3805 -3018 110 1618 -539 -1420 -936 614 1540 -895 -2026 1097 1499 -1258 -2968 -6395
14944f395l372L887L819j151m08L218m19l036j416o72J844o20j855O63q28j700
$$ -6395 -9767 -5880 -2061 -3212 -3620 -402 -821 -3857 -5273 -5945 -4101 -4721 -6576 -5913 -6741 -8441
14928h441L341J284m121k978R78J67M151M506L25N11J424l011k726J170N331R80
$$ -8441 -5100 -3816 -7937 -10915 -9937 -9770 -5619 -1113 -788 -277 1147 -1864 -4590 -3420 1911 2891
14912B891n36o42k688l741R8J781k295L371K073l042K776J236k816j5l73j289
$$ 2891 2355 1713 -975 -4716 -4618 -2837 -5132 -1761 312 -2730 46 1282 -1534 -1549 -1922 -3211
14896c211K551J09j391L32J468K899o09l990l382r60Q7J16L383M191M63K870m12
$$ -3211 -660 -551 -1942 -1610 -142 2757 2148 -1842 -5224 -6184 -6097 -5981 -2598 1593 2056 4926 4514
14879D514m319j82o12K45j52k981n64Q25j522L69q54l140m27K954L929j20m74
$$ 4514 195 13 -599 -354 -506 -3487 -4051 -3226 -4748 -4379 -5233 -8373 -8800 -5846 -1917 -2037 -2511
14862b511r51r94O49J984Q68j565k288n44N99M52K85M938J368k723k594K488l289
$$ -2511 -3462 -4456 -3807 -1823 -955 -2520 -4808 -5352 -4753 -4301 -4016 922 2290 -433 -3027 -539 -3828
14845c828n498K076MQ95O51j76L244K226r4r22K325K599k292r14j806j633j004
$$ -3828 -9326 -7250 -7246 -6351 -5700 -5876 -2632 -406 -500 -1422 903 3502 1210 296 -1510 -3143 -4147
14828d147K213K406J210k749l411K089N2l788k171J181K110K465k620r44J232
$$ -4147 -1934 472 1682 -1067 -4478 -2389 -2337 -6125 -8296 -7115 -5005 -2540 -5160 -6104 -4872
14813d872k004R69J26j330J632n0K753r75k094m51L02R82j64j005L321K143j26
$$ -4872 -6876 -5907 -5781 -7111 -5479 -5529 -2776 -3751 -5845 -6296 -5994 -5012 -5176 -6181 -2860 -717 -843
14796h43J324l18j440Q7J55k61q38j903J220M270J167k959r93l5L9j502k069L85
$$ -843 481 163 -1277 -1190 -1035 -1296 -2134 -4037 -2817 1453 2620 -339 -1332 -1367 -1328 -2830 -4899 -4514
14778d514L339P35J350n68j992L69L462K881k977k766J075j497j305m352j998
$$ -4514 -1175 -440 910 342 -1650 -1281 2181 5062 2085 -681 394 -1103 -2408 -6760 -8758
14763h758O171Q97p02j275J270j079k455m00l965p84K067n59J623R10J618K513
$$ -8758 -2587 -1690 -2392 -3667 -2397 -3476 -5931 -6331 -10296 -11080 -9013 -9572 -7949 -7039 -5421 -2908
14747b908R03j937L75Q37M77l04r88r59K414K243Q1j145n06J454n43j038n5J425
$$ -2908 -2005 -3942 -3567 -2730 -2253 -2557 -3545 -4504 -2090 153 234 -911 -1417 37 -506 -1544 -1599 -174
14729a74p83l243j309K723J073k710m859J222J579o69q76L570J607j575J104J524
$$ -174 -957 -4200 -5509 -2786 -1713 -4423 -9282 -8060 -6481 -7150 -8026 -4456 -2849 -4424 -3320 -1796
14713a796l044j834J145j982o2J983N409k906l216k97K551L033n65K02L106l727
$$ -1796 -4840 -6674 -5529 -7511 -7573 -5590 -181 -3087 -6303 -6600 -4049 -1016 -1581 -1379 1727 -2000
14697b000j472K413K781J648J134J606l509j349k185q39r93r98k402K033K594
$$ -2000 -3472 -1059 1722 3370 4504 6110 2601 1252 -933 -1772 -2765 -3763 -6165 -4132 -1538
14682a538k979j228J352L73k03N64j710j396j515J944J013J017m0P72J01N037
$$ -1538 -4517 -5745 -4393 -4020 -4223 -3659 -5369 -6765 -8280 -6336 -5323 -4306 -4346 -3574 -3473 1564
14666A564N62j16n95j131k178l66j365J271n64J534L120J193j063m830k256j08
$$ 1564 2126 2010 1415 284 -1894 -2260 -3625 -2354 -2918 -1384 1736 2929 1866 -2964 -5220 -5328
14650e328K908K914L686k801k247K828o9j976O37O86l28o36j746j261m14M2k93
$$ -5328 -2420 494 4180 1379 -868 1960 1891 -85 552 1238 910 274 -1472 -2733 -3147 -3105 -3398
14633c398r1k587N57K137J46j68K455J256J107J78l315k627o86O2J008K289L747
$$ -3398 -3489 -6076 -5519 -3382 -3236 -3404 -949 307 1414 1592 -1723 -4350 -5036 -4974 -3966 -1677 2070
14616B070r10m575l128j6K38j148J280m94J252r53J189p06j019L578L123K807
$$ 2070 1160 -3415 -6543 -6559 -6321 -7469 -6189 -6683 -5431 -6384 -5195 -5901 -6920 -3342 -219 2588
14600B588o51l636k236o61r33r03o28J920J906K008j724k69l064l095Q61M382
$$ 2588 1937 -1699 -3935 -4596 -5529 -6432 -7060 -5140 -3234 -1226 -2950 -3219 -6283 -9378 -8517 -4135
14584d135j04K306L138m89l999j135L82K799L26R42l278n543j389L542K009J877
$$ -4135 -4239 -1933 1205 716 -3283 -4418 -4036 -1237 -911 31 -3247 -8790 -10179 -6637 -4628 -2751
14568b751r7L08l388M10L738k13J654O04K603l455m343n7R41R60j70k336K09L921
$$ -2751 -2848 -2540 -5928 -5518 -1780 -1993 -339 265 2868 -587 -4930 -4987 -4046 -3086 -3256 -5592 -5383 -1462
14550a462L566l043o09m87K835M513Q17k872Q90j203n30K100r4l415q36p87j149
$$ -1462 2104 -939 -1548 -2035 800 5313 6130 3258 4148 2945 2415 4515 4421 1006 170 -617 -1766
14533a766L290o19K423R55P73j474p93k647l210K621K183J252L245l128L37r04
$$ -1766 1524 905 3328 4283 5056 3582 2789 142 -3068 -447 1736 2988 6233 3105 3442 2538
14517B538k073j099l658Q18K714j477j878O82K881j707j634L362J708q17K37r63
$$ 2538 465 -634 -4292 -3474 -760 -2237 -4115 -3433 -552 -2259 -3893 -531 1177 360 597 -366
14501c66k877m045k2O41q86L006K342j61M73k551Q73L186o11q95m90J442j492
$$ -366 -3243 -7288 -7310 -6669 -7555 -4549 -2207 -2368 -1895 -4446 -3573 -387 -998 -1893 -2383 -941 -2433
14484b433k082L23L675J972j924k216l019k00j346p48L076J15J31K404O309J615
$$ -2433 -4515 -4192 -517 1455 -469 -2685 -5704 -5904 -7250 -7998 -4922 -4807 -4676 -2272 4037 5652
14468E652m329r37K492l05m32j655l057k405k470k21o84R9K975P62L96J712k71
$$ 5652 1323 386 2878 2573 2141 486 -2571 -4976 -7446 -7667 -8351 -8252 -5277 -4515 -4119 -2407 -2678
14451b678n39j08J219O40q54j42K895l115j554L081O31l083n06k763L650J641
$$ -2678 -3217 -3325 -2106 -1466 -2320 -2462 433 -2682 -4236 -1155 -524 -3607 -4113 -6876 -3226 -1585
14435a585J396J106N63j019O3J395K430L29J092m571J406n00m670O34K187J025
$$ -1585 -189 917 1480 461 524 1919 4349 4678 5770 1199 2605 2105 -2565 -1931 256 1281
14419A281j144k272k89j80j51m45p39J407M22k244j628J554M549J80j676J955
$$ 1281 137 -2135 -2424 -2604 -2755 -3200 -3939 -2532 -2110 -4354 -5982 -4428 121 301 -1375 580
14403E80N37O50j133n567k762L865N037j614j589O65J957J998j721j935L66j508
$$ 580 1117 1767 634 -4933 -7695 -3830 1207 -407 -1996 -1331 626 2624 903 -1032 -666 -2174
14387b174R56l152J62K126K371J219m193j066j899l237k849m90M971L454R45p60
$$ -2174 -1218 -4370 -4208 -2082 289 1508 -2685 -3751 -5650 -8887 -11736 -12226 -7255 -3801 -2856 -3616
14371c616l293m32k066M57J156M677J127j928q40J947j625j722K7n93j513L187
$$ -3616 -6909 -7341 -9407 -8950 -7794 -3117 -1990 -3918 -4758 -2811 -4436 -6158 -6131 -6724 -8237 -5050
14355e050J267k394p28m0K079K827K27j346j676J76K087M203P04q25j564j418
$$ -5050 -3783 -6177 -6905 -6945 -4866 -2039 -1812 -3158 -4834 -4658 -2571 1632 2336 1511 -53 -1471
14339a471L033L47m615p69k513J825K049P90k92j264J374o29J810L687k01j556
$$ -1471 1562 1909 -2706 -3475 -5988 -4163 -2114 -1324 -1616 -2880 -1506 -2135 -325 3362 3161 1605
14323A605Q15m21j795k455o25j13j797r8N55R08L504p2m7N97o01J107J310J64
$$ 1605 2420 1999 204 -2251 -2876 -2989 -4786 -4884 -4329 -3421 83 11 -36 561 -40 1067 2377 2541
14305B541p23R78n06J159q43l069k227K477j985j320K907M225j13j574q62N06
$$ 2541 1818 2796 2290 3449 2606 -463 -2690 -213 -2198 -3518 -611 3614 3501 1927 1065 1571
14289A571Lj024j311k018q48R78J878J218J51Q61m32k25J339j584N65L101L374
$$ 1571 1574 550 -761 -2779 -3627 -2649 -771 447 598 1459 1027 802 2141 557 1122 4223 7597
14272G597k073m440R3k075n65j845J137p1l188P02J655M356M107L63p37m416j328
$$ 7597 5524 1084 1177 -898 -1463 -3308 -2171 -2242 -5430 -4728 -3073 1283 5390 5753 5016 600 -728
14255g28k590k610j494K060M305L443J307K74P06p98k427K166K315j023j182r93
$$ -728 -3318 -5928 -7422 -5362 -1057 2386 3693 3967 4673 3875 1448 3614 5929 4906 3724 2731
14239B731j900j365k278k189o37O40J198N43N48J591K073L480k80L09j361l43
$$ 2731 831 -534 -2812 -5001 -5638 -4998 -3800 -3257 -2709 -1118 955 4435 4155 4464 3103 2760
14223B760j066l354k48L52J36J797L657l99k203q9J455k462l343p48K403r14J03
$$ 2760 1694 -1660 -1908 -1556 -1420 377 4034 3635 1432 1343 2798 336 -3007 -3755 -1352 -2266 -2163
14206b163J822J655p85L5p21m72J979q71j744j912M49J075K10J239K000O6j683
$$ -2163 -341 1314 529 564 -157 -629 1350 479 -1265 -3177 -2728 -1653 -1443 -204 1796 1862 179
14189A79j483q31K96K311K770o453k336L404L997k346k59L251J02k809m932m83
$$ 179 -1304 -2135 -1839 472 3242 -3211 -5547 -2143 1854 -492 -751 2500 2602 -207 -5139 -5622
14173e622L936J523n54K6O83j165J564j453l138r87K447K50K369K533K77j751
$$ -5622 -1686 -163 -717 -691 -8 -1173 391 -1062 -4200 -5187 -2740 -2490 -121 2412 2689 938
14157I38Q70k42J273L22m20O72N83M33O59l09k627k172J684J439q68n42k521K19
$$ 938 1808 1566 2839 3161 2741 3413 3996 4429 5088 4779 2152 -20 1664 3103 2235 1693 -828 -609
14139f09j294j216K605L427r22L68K02j000m231l014J492L167K28k563j977J028
$$ -609 -1903 -3119 -514 2913 1991 2359 2561 1561 -2670 -5684 -4192 -1025 -797 -3360 -5337 -4309
14123d309L827m88l47L70n53J438L020l52j619k299K02J02K37J625j446k870K264
$$ -4309 -482 -970 -1317 -947 -1500 -62 2958 2606 987 -1312 -1110 -1008 -771 854 -592 -3462 -1198
14106a198Q35J372m373k071j50K189J047J40m57m46j96O05J436k143l766M561
$$ -1198 -363 1009 -3364 -5435 -5585 -3396 -2349 -2209 -2666 -3112 -3308 -2703 -1267 -3410 -7176 -2615
14090b615K447M37J94j53n84l412j117J734K073K406K041l477j812k657Q22J712
$$ -2615 -168 269 463 310 -274 -3686 -4803 -3069 -996 1410 3451 -26 -1838 -4495 -3673 -1961
14074a961j663P66J314L485K687J87j284j573o00R03l037l112j363k044j344k910
$$ -1961 -3624 -2858 -1544 1941 4628 4815 3531 1958 1358 2261 -776 -3888 -5251 -7295 -8639 -11549
14058a1549K041L231J130l04J408K327j576j497j88K246K614J998J013m051l385
$$ -11549 -9508 -6277 -5147 -5451 -4043 -1716 -3292 -4789 -4977 -2731 -117 1881 2894 -1157 -4542
14043d542O44K960p90j004J676J188J1j946k164J837J357l128J377L099J341k673
$$ -4542 -3898 -938 -1728 -2732 -1056 132 143 -1803 -3967 -2130 -773 -3901 -2524 575 1916 -757
14027g57k308n9j426k969J568J883J037J656j07J022k521k99K024r66L828N67
$$ -757 -3065 -3124 -4550 -7519 -5951 -4068 -3031 -1375 -1482 -460 -2981 -3280 -1256 -2222 1606 2173
14011B173j964J359J116R62l840M56M507k48l973l045j168M03l2q7k478k573m2
$$ 2173 209 1568 2684 3646 -194 262 4769 4521 548 -2497 -3665 -3262 -3294 -3381 -5859 -8432 -8474
13994h474K796J677K181n20j306k397J24J411J54Q52J717L114J001J165j612K667
$$ -8474 -5678 -4001 -1820 -2340 -3646 -6043 -5919 -4508 -4354 -3502 -1785 1329 2330 3495 1883 4550
13978D550m390l562K834L017k058k432n4K581M053Q47j914P9J097m81J232p49
$$ 4550 160 -3402 -568 2449 391 -2041 -2095 486 4539 5386 3472 3551 4648 4167 5399 4650
13962D650l042j07j275n77n7P09o50k537l63j813O59M013L409q20r53j686J06
$$ 4650 1608 1501 226 -351 -408 301 -349 -2886 -3249 -5062 -4403 -390 3019 2199 1246 -440 -334
13945c34J043M253K690k253J03K364k605J727j63j295n227j208J382k586L40L97
$$ -334 709 4962 7652 5399 5502 7866 5261 6988 6825 5530 303 -905 477 -2109 -1769 -1372
13929a372m34n30M394J633l94r99J609L67K229j784j281r82l102l041L225J116
$$ -1372 -1806 -2336 2058 3691 3297 2298 3907 4274 6503 4719 3438 2456 -646 -3687 -462 654
13913F54k437n305l18L778j896j521L694R98o14N36M81K480M869M46j283j922
$$ 654 -1783 -7088 -7406 -3628 -5524 -7045 -3351 -2353 -2967 -2431 -1950 530 5399 5845 4562 2640
13897B640O15J524j930j767k834J04j699K13O24q86K414J778K52K69n806k565
$$ 2640 3255 4779 2849 1082 -1752 -1648 -3347 -3134 -2510 -3396 -982 796 1048 1317 -4489 -7054
13881g054j087k67R33P54K655M386J345L662M93j620J01p54K00l742m128l34M175
$$ -7054 -8141 -8408 -7475 -6721 -4066 320 1665 5327 5820 4200 4301 3547 3747 5 -4123 -4457 -282
13864b82K649J889K348j98k288l116J287N90p46R58L51K210j60l010n211j555
$$ -282 2367 4256 6604 6406 4118 1002 2289 2879 2133 3091 3442 5652 5492 2482 -2729 -4284
13848d284K707P6J57R26l733l724L99K301M58j291J647O942K364j674k105j509
$$ -4284 -1577 -1501 -1344 -418 -4151 -7875 -7476 -5175 -4717 -6008 -4361 2581 4945 3271 1166 -343
13832c43l847j731N795L182l815j40K800j312l365M643K23k371l369K255K214
$$ -343 -4190 -5921 -126 3056 -759 -899 1901 589 -2776 1867 2090 -281 -3650 -1395 819
13817H19J316P30R63k507K06m59k05k751r14L471mj560M182L139m24j672l35l529
$$ 819 2135 2865 3828 1321 1527 1068 863 -1888 -2802 669 665 -895 3287 6426 6002 4330 3995 466
13799D66l338k703L89o25J144J096J964P9k183J178L37l3k2N10J577j39L307k346
$$ 466 -2872 -5575 -5186 -5811 -4667 -3571 -1607 -1528 -3711 -2533 -2196 -2229 -2251 -1741 -164 -303 3004 658
13781F58J40J935K50k49K64j121l155J978K078P03K27m540m92J768Q32l78k492
$$ 658 798 2733 2983 2734 2998 1877 -1278 700 2778 3481 3708 -832 -1324 444 1276 898 -1594
13764a594m9k851k338R52K305N96l0J804K999J488j857j115k01L134R47k875J857
$$ -1594 -1643 -4494 -6832 -5880 -3575 -2979 -3009 -1205 1794 3282 1425 310 109 3243 4190 1315 3172
13747C172J41k419L43j170k849K604L736L270j658k385k755j92o44J15j863K007
$$ 3172 3313 894 1237 67 -2782 -178 3558 6828 5170 2785 30 -162 -806 -691 -2554 -547
13731e47N424n05l686l293P66O22l72L961n04l604N99N75n1o56j94J633l89j274
$$ -547 4877 4372 686 -2607 -1841 -1219 -1591 2370 1866 -1738 -1139 -564 -615 -1271 -1465 168 -221 -1495
13713a495J905K252R96p29k486P10K53L288M79l357j850J446J692r1J697r21J414
$$ -1495 410 2662 3658 2929 443 1153 1406 4694 5173 1816 -34 1412 3104 3013 4710 3789 5203
13696E203K701K435l985k785q37k280k167j164k377J646L703L454L153K82l813
$$ 5203 7904 10339 6354 3569 2732 452 -1715 -2879 -5256 -3610 93 3547 6700 6982 3169
13681C169j257L135M024n97m474m27J781k555J057m01P18m66j277n29J007q47
$$ 3169 1912 5047 9071 8474 4000 3573 5354 2799 3856 3455 4173 3707 2430 1901 2908 2061
13665B061R96P71N44k981R92L454J493k985l395K813j746n30L048N8j456m26j550
$$ 2061 3057 3828 4372 1391 2383 5837 7330 4345 950 3763 2017 1487 4535 4593 3137 2711 1161
13648A161k941n67K69j857k063K651L975N63m20j665P62M082k103r15J714k50
$$ 1161 -1780 -2347 -2078 -3935 -5998 -3347 628 1191 771 -894 -132 3950 1847 932 2646 2396
13632B396J281K152j302Q74k394n654q03R66n37K154J063k410R69p22k992p84
$$ 2396 3677 5829 4527 5401 3007 -2647 -3450 -2484 -3021 -867 196 -2214 -1245 -1967 -4959 -5743
13616e743L201M17J543q80J21K791P404l9l226p259p90O360J47j982P03k489N55
$$ -5743 -2542 -2125 -582 -1462 -1341 1450 8854 8815 5589 -1670 -2460 3900 4047 2065 2768 279 834
13599H34J54O24J91R67J844N48k18l90j089m999l110K490P21L75j056J33L493
$$ 834 988 1612 1803 2770 4614 5162 4944 4554 3465 -1534 -4644 -2154 -1433 -1058 -2114 -1981 1512
13582A512q84k824k73K843K812J697J833j601P86L056J039l662k454K57n81k988
$$ 1512 628 -2196 -2469 374 3186 4883 6716 5115 5901 8957 9996 6334 3880 4137 3556 568
13566E68j136m68K07l019K920K951M421J837j171n86k17j917l209k581l484O80
$$ 568 -568 -1036 -829 -3848 -928 2023 6444 8281 7110 6524 6307 4390 1181 -1400 -4884 -4204
13550d204M136P205K258j808q474j758J507l44k713q24K745K455O13J205J688
$$ -4204 -68 7137 9395 7587 -887 -2645 -1138 -1482 -4195 -5019 -2274 181 794 1999 3687
13535C687k305q17R65L80M20M11J190j448p67l576o33q50K84O2J894L422L587
$$ 3687 1382 565 1530 1910 2330 2741 3931 2483 1716 -1860 -2493 -3343 -3059 -2997 -1103 2319 5906
13518E906k90j657j766K097L151N994M265K113m566o858J058k47m778k275l50
$$ 5906 5616 3959 2193 4290 7441 13435 17700 19813 15247 8389 9447 9200 4422 2147 1797
13503A797J776l110m69L048J383o29J666k759k404Q74o98j975J279k934l456L641
$$ 1797 3573 463 -6 3042 4425 3796 5462 2703 299 1173 475 -1500 -221 -3155 -6611 -2970
13487b970M45K314L951Q01j619j627k560K75J127K608L019N373k03k841m353p58
$$ -2970 -2525 -211 3740 4541 2922 1295 -1265 -990 137 2745 5764 11137 10934 8093 3740 2982
13471B982K635k16K053J716N180L128k703m365l134n348n044p11L104K729k121
$$ 2982 5617 5401 7454 9170 14350 17478 14775 10410 7276 1928 -3116 -3827 -723 2006 -115
13456a15m007j910K075J313L10k68P92N010k459o40j267J66P21l14J062j959k912
$$ -115 -4122 -6032 -3957 -2644 -2334 -2602 -1810 3200 741 101 -1166 -1000 -279 -593 469 -1490 -4402
13439d402j495P80M808L99j136k150J781J696K725L76O27j443o75k144M4K435
$$ -4402 -5897 -5117 -309 90 -1046 -3196 -1415 281 3006 3382 4009 2566 1891 -253 -209 2226
13423B226j239J423K100k930o816o39M777L102j00j119O73L05j741O5L073k050
$$ 2226 987 2410 4510 1580 -5236 -5875 -1098 2004 1904 785 1458 1763 22 87 3160 1110
13407A110k875K49K002r96L233P70j384J47O35k494j567j59L312j88L359k17p76
$$ 1110 -1765 -1516 486 -510 2723 3493 2109 2256 2891 397 -1170 -1329 1983 1795 5154 4937 4161
13390D161J47J195O30k083j638m4K035O48k324J925j445k069N85K075K964J011
$$ 4161 4308 5503 6133 4050 2412 2368 4403 5051 2727 4652 3207 1138 1723 3798 6762 7773
13374G773j764n307K786J30p02K078M16k174L61j752m230m45L227K351M444K063
$$ 7773 6009 702 3488 3618 2916 4994 5410 3236 3597 1845 -2385 -2830 397 2748 7192 9255
13358I255J554k015j652p38K12o83K330J534o38j519l386m58L62n87O70O94k42
$$ 9255 10809 8794 7142 6404 6616 5933 8263 9797 9159 7640 4254 3796 4158 3571 4241 4935 4693
13341D693o23n16k217j86j216j411K187j241k178J264K841Q51q89K093K827j845
$$ 4693 4070 3554 1337 1151 -65 -1476 711 -530 -2708 -1444 1397 2248 1359 3452 6279 4434
13325D434j342K436m79j1j066J771j461r90l00J410K359L568j853m596l136j495
$$ 4434 3092 5528 5049 5038 3972 5743 4282 3292 2992 4402 6761 10329 8476 3880 744 -751
13309g51J659r52m672n41K476J925q57Q79J384P45k403K381P034L287l748q77
$$ -751 908 -44 -4716 -5257 -2781 -856 -1713 -834 550 1295 -1108 1273 8307 11594 7846 6969
13293F969j546m07j546K636J281m61J421k992p49J334k527n740J588m5k247P98
$$ 6969 5423 5016 3470 6106 7387 6926 8347 5355 4606 5940 3413 -2327 -739 -784 -3031 -2233
13277b233M220l5j072K534J071r03p58J86R19K848l089l650P2m44j581J666M029
$$ -2233 1987 1952 880 3414 4485 3582 2824 3010 3929 6777 3688 38 110 -334 -1915 -249 3780
13260C780J964M5J026n54m635k721J500m91j075p01j705N57N011K713J546m50
$$ 3780 5744 5789 6815 6261 1626 -1095 405 -86 -1161 -1862 -3567 -3010 2001 4714 6260 5810
13244E810N3m33K366j138l944j718j415Q00L609j10k792j151K402J766k212O99
$$ 5810 5863 5430 7796 6658 2714 996 -419 381 3990 3880 1088 -63 2339 4105 1893 2592
13228B592j485l316P45L399L169n50K141J334j531l488j603K607K323l38r1K666
$$ 2592 1107 -2209 -1464 1935 5104 4554 6695 8029 6498 3010 1407 4014 6337 5999 5908 8574
13212H574n47j919l89k93j046m00J924j357m054J640J481N50J062N539O96k482
$$ 8574 8027 6108 5719 5426 4380 3980 5904 4547 493 2133 3614 4164 5226 10765 11461 8979
13196H979o040k789j926K726M571J632l200j81K287l6L2J064N95k680l25k446
$$ 8979 2939 150 -1776 950 5521 7153 3953 3772 6059 6023 6055 7119 7714 5034 4709 2263
13180B263K083L0k527k037l536L7N536J493J564P0r65k106p22J368N62k783J63
$$ 2263 4346 4376 1849 -188 -3724 -3687 1849 3342 4906 4976 4011 1905 1183 2551 3113 330 493
13163D93L091L303j686J86M55l2m223M76L660N023k115j097m646p658Q28K710
$$ 493 3584 6887 5201 5387 5842 5810 1587 2063 5723 10746 8631 7534 2888 -4770 -3942 -1232
13147a232N260K214j079j360L082K723K880N224P868O361o183r451l918l894l524
$$ -1232 4028 6242 5163 3803 6885 9608 12488 17712 25580 31941 25758 16307 12389 8495 4971
13132D971L807q06l388p88K182k78m65K075L059K713K015L50L308P668L412n861
$$ 4971 8778 7972 4584 3796 5978 5700 5235 7310 10369 13082 15097 15447 18755 26423 29835 23974
13116B3974p149o160j480o94k332K310j37k503J089n50j0k106o52J107K275K255
$$ 23974 16825 10665 9185 8491 6159 8469 8332 5829 6918 6368 6358 4252 3600 4707 6982 9237
13100I237P38M065J608O29K651P354Q471O745q360r601n886j255j576o337o79
$$ 9237 9975 14040 15648 16277 18928 26282 34753 41498 33138 23537 17651 16396 14820 8483 7804
13085G804J359J933n64k81r15j690J149M833P623J3296K0895K3636J2766j3559
$$ 7804 9163 11096 10532 10251 9336 7646 8795 13628 21251 34547 55442 79078 91844 78285
13071G8285k9267j9123r661n752n533K54p97Q260L905Q037P482j767p676r275
$$ 78285 49018 29895 20234 14482 8949 9203 8406 16666 20571 28608 36090 34323 26647 17372
13057A7372l580R79m126k838j487k741O9M906K810K217r71k744R50R21J62j701
$$ 17372 13792 14771 10645 7807 6320 3579 3648 8554 11364 13581 12610 9866 10816 11737 11899 10198
13041A0198Q98j106k324j029o34j992K94M200N506Q667R334J8426K8216K3668
$$ 10198 11096 9990 7666 6637 6003 4011 4305 8505 14011 22678 32012 50438 78654 102322
13027A02322r871k9967j8813j0389q946l521K890O435Q475J5537K8737J8536j6058
$$ 102322 92451 62484 43671 33282 24336 20815 23705 30140 38615 54152 82889 101425 85367
13014H5367k9443j8747j2616k675j244j014k71m140J847p27n063k885j497N01
$$ 85367 55924 37177 24561 21886 20642 19628 19357 15217 17064 16337 11274 8389 6892 7393
13000G393K80J465K20J903J537q58O26l198j113K247J032K243j75J472N276Q101
$$ 7393 7673 9138 9358 11261 12798 11940 12566 9368 8255 10502 11534 13777 13602 15074 20350 28451
12984B8451O036L918o872j2553q584j166M287L112J335Q423J1524J9506L0314
$$ 28451 34487 38405 31533 18980 10396 9230 13517 16629 17964 26387 37911 57417 87731
12971H7731J6036j6815k6672j8606j4005j1962l861k96j303m357m62L079M86j541
$$ 87731 103767 86952 60280 41674 27669 15707 11846 11550 10247 5890 5428 8507 8993 7452
12957G452j397m81M133K580O935R531P870j492j3938j0974o574O78M16O56L406
$$ 7452 6055 5574 9707 12287 19222 28753 36623 35131 21193 10219 3645 4323 4739 5395 8801
12942H801j139l2k116j572j404J635j915j129L410l01l059J579L926N629Q056
$$ 8801 7662 7630 5514 3942 2538 4173 2258 1129 4539 4238 1179 2758 6684 12313 20369
12927B0369J3250N321p440j1965p321p323Q8J342n75j340l966j796M171K736K15
$$ 20369 33619 38940 31500 19535 12214 4891 4979 6321 5746 4406 440 -1356 2815 5551 5766
12912E766k79k42J949N284Q078P726O099n775p521p357m905r0P57j148j960l683
$$ 5766 5487 5245 7194 12478 20556 28282 34381 28606 21085 13728 8823 8733 9490 8342 6382 2699
12896B699L09j77r47L29L11P09o26k341q71O89N494p25k650j172k857j345j577
$$ 2699 3008 2831 1884 2213 2524 3233 2607 266 -605 84 5578 4853 2203 1031 -1826 -3171 -4748
12879d748K595L263M25L186l32r33k512K71J017J438j489J73j093J050q26j60
$$ -4748 -2153 1110 1535 4721 4389 3456 944 1215 2232 3670 2181 2354 1261 2311 1485 1325
12863A325N504L792j841J640l682p28J460m45m290l730q8J936K416L99j096L860
$$ 1325 6829 10621 8780 10420 6738 6010 7470 7025 2735 -995 -1083 853 3269 3668 2572 6432
12847F432N225j517n193l908q65R27j01Q1M706K383Q84k666l414l773k760J426
$$ 6432 11657 10140 4947 1039 174 1101 1000 1081 5787 8170 9054 6388 2974 -799 -3559 -2133
12831b133R46J116Q14j153k536k384q16L871O651R71J24J932j339j814j220k116
$$ -2133 -1187 -71 743 -410 -2946 -5330 -6146 -2275 4376 5347 5471 7403 6064 4250 3030 914
12815I14J72l434j749Q57L339Q29j422k481J348L334K267o92N08J424J185k976
$$ 914 1086 -2348 -4097 -3240 99 928 -494 -2975 -1627 1707 3974 3282 3790 5214 6399 3423
12799C423l917R10M11k880K139M493j753k492J580L955l341j823l89J975P51j379
$$ 3423 -494 416 827 -2053 86 4579 2826 334 1914 5869 2528 705 316 2291 3042 1663
12783A663j341k687r4J426J333p51j324j200J673L878N78k623k006J518J115m37
$$ 1663 322 -2365 -2459 -1033 300 -451 -1775 -2975 -1302 2576 3154 531 -1475 43 1158 721
12767G21L79O16n3K438N45J410J94n25L5J57K863j681k982l88O67m401j793M560
$$ 721 1100 1716 1663 4101 4646 6056 6250 5725 5760 5917 8780 7099 4117 3729 4396 -5 -1798 2762
12749B762J066j724r31j910j343L220K710J136Q09j289m166l117J112L087K922
$$ 2762 3828 2104 1173 -737 -2080 1140 3850 4986 5795 4506 340 -2777 -1665 1422 4344
12734D344J600j383n32j53k019k204J09L043N460n21k595q70K250J46k683K356
$$ 4344 5944 4561 4029 3876 1857 -347 -238 2805 8265 7744 5149 4279 6529 6675 3992 6348
12718F348M366J81k156k391j663j482l9l620J975M164J632j092J507q20j789m173
$$ 6348 10714 10895 8739 6348 4685 3203 3164 -456 1519 5683 7315 6223 7730 6910 5121 948
12702I48m02J774k851n97J247K887K564j474j210k061O11K918M06M030j372J272
$$ 948 546 2320 -531 -1128 119 3006 5570 4096 2886 825 1436 4354 4760 8790 7418 8690
12686H690l0m569l836L149n75n55K000J910P95j162J249l472k178r08J301K00
$$ 8690 8660 4091 255 3404 2829 2274 4274 6184 6979 5817 7066 3594 1416 508 1809 2009
12670B009J097M192k3m003p66L597j175j655j345p14K204K81k541k467K66K151
$$ 2009 3106 7298 7275 3272 2506 6103 4928 3273 1928 1214 3418 3699 1158 -1309 -1043 1108
12654A108K840K214l460n225j160l17J756M122J087p05j304j748M929J162l352
$$ 1108 3948 6162 2702 -2523 -3683 -4000 -2244 1878 2965 2260 956 -792 4137 5299 1947
12639A947l807k16K052N087L248m24J304Q44J255l98k103J081l151k585l05P44
$$ 1947 -1860 -2076 -24 5063 8311 7887 9191 10035 11290 10892 8789 9870 6719 4134 3829 4573
12623D573k538J8K230M120l353j271k571J991L576k63l00j343o43O85j63J372
$$ 4573 2035 2053 4283 8403 5050 3779 1208 3199 6775 6512 6212 4869 4226 4911 4748 6120
12607F120n44k811k206k70L482L998P64j948j041l40p01J87l360l80K713j414
$$ 6120 5576 2765 559 289 3771 7769 8533 6585 5544 5204 4503 4690 1330 950 3663 2249
12591B249k527L01J019j61N88K4k142K620J439M29J31q39O9K57J656J807l065
$$ 2249 -278 23 1042 881 1469 1493 -649 1971 3410 3839 3970 3131 3200 3457 5113 6920 3855
12574C855m51N69K260n00k572R6m50n54k090k724L59J814L848j303j594j697K426
$$ 3855 3404 3973 6233 5733 3161 3257 2807 2253 163 -2561 -2202 -388 3460 2157 563 -1134 1292
12557A292L371j748j336j765o04J219P35J161l204n97J962k167J950L333K329
$$ 1292 4663 2915 1579 -186 -790 429 1164 2325 -879 -1476 486 -1681 269 3602 5931
12542E931M875n05j022q77j520k6nk432k17L66l923m1o94L559K900N80k72k895
$$ 5931 10806 10301 9279 8402 6882 6856 6851 4419 4202 4568 645 604 -90 3469 6369 6949 6677 3782
12524C782n868K014K882J784J62k105o95j610L228N778j72o99J997l741j880p29
$$ 3782 -2086 -72 2810 4594 4756 2651 1956 346 3574 9352 9180 8481 10478 6737 4857 4128
12508D128m17K197L468M23j275k553j993K485K654M61J172K660K962j385j283
$$ 4128 3711 5908 9376 9799 8524 5971 3978 6463 9117 9578 10750 13410 16372 14987 13704
12493A3704k975j864j02K127j437j72o57j840j980m04M20J04Q03n43k380j769
$$ 13704 10729 8865 8763 10890 9453 9281 8624 6784 4804 4400 4820 4924 5727 5184 2804 1035
12477A035m42J388j295j314L043L913q3k557q07j51R74K020r57K44K862J809k663
$$ 1035 593 1981 686 -628 2415 6328 6245 3688 2881 2730 3704 5724 4767 5011 7873 9682 7019
12460G019Q7J414o49M15k176K818l27L247M720j400k068k40l95m992l055P91j683
$$ 7019 7106 8520 7871 8286 6110 8928 8601 11848 16568 15168 13100 12860 12465 7473 4418 5209 3526
12443C526o56J697M037j135j084j816J56m80K8K324K637O9j957l731L40K002r24
$$ 3526 2870 4567 8604 7469 6385 4569 4725 4245 4273 6597 9234 9303 7346 3615 3955 5957 5033
12426E033m424O61K574k88r30L239k538P01M380J587o414j148L429J527j240J733
$$ 5033 609 1270 3844 3556 2626 5865 3327 4028 8408 9995 3581 2433 5862 7389 6149 7882
12410G882L151J340K106j423k715M52k06j013j063k476J656n80m581J67J182M56
$$ 7882 11033 12373 14479 13056 10341 10793 10587 9574 8511 6035 7691 7111 2530 2697 3879 4335
12394D335K801q52j962q70K011J67K624L02q96j460J109j387j289j11l82J710
$$ 4335 7136 6284 4322 3452 5463 5630 8254 8556 7660 6200 7309 5922 4633 4522 4140 5850
12378E850j684k645j69L112N42L51R97k429j150k910l438L868L130o2K469k018
$$ 5850 4166 1521 1352 4464 5006 5357 6354 3925 2775 -135 -3573 295 3425 3363 5832 3814
12362C814N02Q59l86M28N35J917J182K253j917J309l68o587k983j44J497K860
$$ 3814 4316 5175 4789 5217 5752 7669 8851 11104 9187 10496 10128 3541 558 414 1911 4771
12346D771J971K418j920k370L533K680q65m326j190J035j63Q3k88J188k465l34
$$ 4771 6742 9160 7240 4870 8403 11083 10218 5892 4702 5737 5574 5657 5369 6557 4092 3758
12330C758l2M15j973Q2J561k895J088L077J223l24K371j672o784J223J486j163
$$ 3758 3726 4141 2168 2250 3811 916 2004 5081 6304 5980 8351 6679 -105 1118 2604 1441
12314A441r93J689N607K540k614l355K535N75j330o74K174L53k955k072j205O11
$$ 1441 448 2137 7744 10284 7670 4315 6850 7425 6095 5421 7595 7948 4993 2921 1716 2327
12298B327K246k456j085L722L061j391l115J207M138j8Q26k21l105o68n27j445
$$ 2327 4573 2117 1032 4754 7815 6424 3309 4516 8654 8636 9462 9241 6136 5468 4941 3496
12282C496j147L416j162N07L078k177j628j46K214J332l928O16J593K95J268J652
$$ 3496 2349 5765 4603 5110 8188 6011 4383 4237 6451 7783 3855 4471 6064 6359 7627 9279
12266I279m21L657K104m139k286J268J535K142L885M35k450l859j392j565j394
$$ 9279 8858 12515 14619 10480 8194 9462 10997 13139 17024 17459 15009 11150 9758 8193 6799
12251F799k639j312L38k191O52K559O64M28L313J327j663k997K718n86K469k258
$$ 6799 4160 2848 3186 995 1647 4206 4870 5298 8611 9938 8275 5278 7996 7410 9879 7621
12235G621J906L88k092K022k570l892K780K873K298m703j469J889p31q03J545
$$ 7621 9527 9915 7823 9845 7275 3383 6163 9036 11334 6631 5162 7051 6320 5517 7062
12220G062j296k186j783J586N529L245J980K865R29L03l818k621k42k975l844
$$ 7062 5766 3580 1797 3383 8912 12157 14137 17002 17931 18234 14416 11795 11553 8578 4734
12205D734N05k378k16M57L206K731R93M68j226j356j50m13m35N24K375J908J681
$$ 4734 5239 2861 2645 3102 6308 9039 10032 10500 9274 7918 7768 7355 6920 7444 9819 11727 13408
12188A3408j026l165j364L169J693n35J278K50L37j4P18k281k826J865K084m499
$$ 13408 12382 9217 7853 11022 12715 12180 13458 13708 14045 14031 14749 12468 9642 11507 13591 9092
12172I092m87J738K049l54k466J041K322n96k956k379l312M78J920L12J123K520
$$ 9092 8605 10343 12392 12038 9572 10613 12935 12339 9383 7004 3692 4170 6090 6402 7525 10045
12156A0045L223K412k786j425N5m102p91j60q24K512K52o31j322n1J397R77L435
$$ 10045 13268 15680 12894 11469 11524 7422 6631 6471 5647 8159 8411 7780 6458 6407 7804 8781 12216
12139A2216k264k011r55l036j586o04J062l24j375J153M317j510L24L3K021j810
$$ 12216 9952 7941 6986 3950 2364 1760 2822 2498 1123 2276 6593 5083 5407 5440 7461 5651
12123E651r26n1l013J646K367l48M54J76j086K296N11k729j29J094j181J379J708
$$ 5651 4725 4674 1661 3307 5674 5326 5780 5956 4870 7166 7677 4948 4819 5913 4732 6111 7819
12106G819j624l712k051l055K20l70J10L398J777K115j40J349k69Q63j590J993
$$ 7819 6195 2483 432 -2623 -2403 -2773 -2663 735 2512 4627 4487 5836 5567 6430 4840 6833
12090F833j519j146J843j000j145R94P68M133j389k265J878K562o22J435o68j58
$$ 6833 5314 4168 6011 5011 3866 4860 5628 9761 8372 6107 7985 10547 9925 11360 10692 10534
12074A0534N72J934L117m25j796J190r35L77o91k342k691mj898l049M159K947
$$ 10534 11106 13040 16157 15732 13936 15126 14191 14568 13877 11535 8844 8840 6942 3893 8052 10999
12058A0999l942J019p06j049J251L107O46j520N54L195k072k018m45R24J547Q0
$$ 10999 7057 8076 7370 6321 7572 10679 11325 9805 10359 13554 11482 9464 9019 9943 11490 11570
12042A1570L020L089r07o406k938j743j870K968j11j136P2p0l26p75l312K750
$$ 11570 14590 17679 16772 10366 7428 5685 3815 6783 6672 5536 5608 5538 5212 4437 1125 3875
12026C875K251k133N76O491M99j683l212k419K097L096o49n38J504J829K190j606
$$ 3875 6126 3993 4569 11060 11559 9876 6664 4245 6342 9438 8789 8251 9755 11584 13774 12168
12010A2168l712k476J020J343K95N60l180q37l46R8J956L995O053n74m763n19
$$ 12168 8456 5980 7000 8343 8638 9198 6018 5181 4835 4933 6889 10884 16937 16363 11600 11081
11994A1081l86J15k47j107m64p08J5J205K488j630j187P93K753J561k510N6M58
$$ 11081 10695 10810 10563 9456 8992 8284 8299 9504 11992 10362 9175 9968 12721 14282 11772 11828 12286
11977A2286k004n134j364K66K478m40j048J116q71j298k18J929J597Q77r19K298
$$ 12286 10282 5148 3784 4050 6528 6088 5040 6156 5285 3987 3769 5698 7295 8172 7253 9551
11961I551m75m691l671L97L477J642r77N60L572P72j721m33j337J328Q05r06K614
$$ 9551 9076 4385 714 1111 4588 6230 5253 5813 9385 10157 8436 8003 6666 7994 8799 7893 10507
11944A0507q7k033l182R08K026K617k829j433K34K502k101L601L797l297j798
$$ 10507 10420 8387 5205 6113 8139 10756 7927 6494 6728 9230 7129 10730 14527 11230 9432
11929I432n81k055j518K45J616j398j714j755M111Q788L728K042n80o009m287
$$ 9432 8851 6796 5278 5523 7139 5741 4027 2272 6383 15171 18899 20941 20361 14352 10065
11914A0065j752j113J585P71m300j914J15j489M52J265L334K364j229K956J494
$$ 10065 8313 7200 8785 9556 5256 3342 3457 1968 2420 3685 7019 9383 8154 11110 12604
11899A2604k43k400k782l609j097J622L466J406k71p23j503M898r50j842m85j748
$$ 12604 12361 9961 7179 3570 2473 4095 7561 8967 8696 7973 6470 11368 10418 8576 8091 6343
11883F343k398J904J880P99l076k412p41L85K639O66J717L032J127j145K039k12
$$ 6343 3945 5849 7729 8528 5452 3040 2299 2684 5323 5989 7706 10738 11865 10720 12759 12547
11867A2547l046j937q26q07k247J997L179K237j232k170k493j403J224k200J52
$$ 12547 9501 7564 6738 5931 3684 5681 8860 11097 9865 7695 5202 3799 5023 2823 2975
11852B975J821M14m25j245j171N28M31K887o76k224J705k142j691N525K785L113
$$ 2975 4796 5210 4785 3540 2369 2897 3328 6215 5539 3315 5020 2878 1187 6712 9497 12610
11836A2610j297j152R85J572j875k99K68J29J338J013m119j034M155q96n310o64
$$ 12610 11313 10161 11146 12718 10843 10544 10812 10941 12279 13292 9173 8139 12294 11398 6088 5424
11820E424J660l02J386J575L463M308l727k242j325J744j886j127J936J531k539
$$ 5424 7084 6782 8168 9743 13206 17514 13787 11545 10220 11964 10078 8951 10887 12418 9879
11805I879k295j828K767K692j009j715M306P61k025J770j330l542N84o99k628
$$ 9879 7584 5756 8523 11215 10206 8491 12797 13558 11533 13303 11973 8431 9015 8316 5688
11790E688P55M08k621m70L027K033Q49m5K98j625K921P25n52k7l36k914M259j169
$$ 5688 6443 6851 4230 3760 6787 8820 9669 9624 9922 8297 11218 11943 11391 11364 11028 8114 12373 11204
11772A1204k693j540R90L291J99k117K42j397q36J745M9r56J056j261J851j437
$$ 11204 8511 6971 7961 11252 11451 9334 9576 8179 7343 9088 9137 8181 9237 7976 9827 8390
11756H390L96n13M378K004k331l963k64K611K749k317L95J095P86L364j517j884
$$ 8390 8786 8273 12651 14655 12324 8361 8097 10708 13457 11140 11535 12630 13416 16780 15263 13379
11740A3379J766r8k447P9P92R74N23k137m425l752q91N023M122R03L297j691P7
$$ 13379 15145 15047 12600 12679 13471 14445 14968 12831 8406 4654 3763 8786 12908 13811 17108 15417 15494
11723A5494k65J814J632j382j898l730J191L78J543j729l007J756K938k10N26
$$ 15494 15229 17043 18675 17293 15395 11665 12856 13234 14777 13048 10041 11797 14735 14525 15051
11708A5051k522m495j339Q96J880K978J233L584j819l198o47K486k007j295j258
$$ 15051 12529 8034 6695 7591 9471 12449 13682 17266 15447 12249 11602 14088 12081 10786 9528
11693I528K45J45j258R2L87k319q55P22R69J08L232J695J719J42j555l33L088
$$ 9528 9773 9918 8660 8752 9139 6820 5965 6687 7656 7764 10996 12691 14410 14552 12997 12664 15752
11676A5752J2k430j457k83M643k211j371p92k772N33j249j409M254K182k02N92
$$ 15752 15764 13334 11877 11594 16237 14026 12655 11863 9091 9624 8375 6966 11220 13402 13200 13792
11660A3792P38R40J498j345m509j765J409j156J394j41k042R79K679K724m145
$$ 13792 14530 15470 16968 15623 11114 9349 10758 9602 10996 10855 8813 9792 12471 15195 11050
11645A1050o84K401J533k44l282j581r9J408j275k561P77M486L239M77r20k848
$$ 11050 10366 12767 14300 14056 10774 9193 9094 10502 9227 6666 7443 11929 15168 15645 14725 11877
11629A1877k691M74M588L240m77k693k980j512L315n59l33L24O05M0n23m8J768
$$ 11877 9186 9660 14248 17488 17011 14318 11338 9826 13141 12582 12249 12573 13178 13218 12695 12647 14415
11612A4415L239j214j277l102q81l4q12m65J183J840L42K521j419m10j468J187
$$ 14415 17654 16440 15163 12061 11180 11146 10334 9869 11052 12892 13234 15755 14336 13926 12458 13645
11596A3645K320l17Q14K377j830j685m08m251J960q57N85k558k209j564K426M84
$$ 13645 15965 15648 16462 18839 17009 15324 14916 10665 12625 11768 12353 9795 7586 6022 8448 8932
11580H932R51K791J702k231o76M443L916J026l238k186p37k027K429K059o41j347
$$ 8932 9883 12674 14376 12145 11469 15912 19828 20854 17616 15430 14693 12666 15095 17154 16513 15166
11564A5166k461J04K77j977r59K050R39Q13j656P06p60j219j193J050J901K231
$$ 15166 12705 12809 13086 11109 10150 12200 13139 13952 12296 13002 12242 11023 9830 10880 12781 15012
11548A5012N6q61j807k555m51K745J378K27J739N61j664l657k94K74q16j17J986
$$ 15012 15068 14207 12400 9845 9394 12139 13517 13744 15483 16044 14380 10723 10429 10703 9887 9770 11756
11531A1756J383k32M79j168n18o21L543m92N72K484N02K291K54o015K66o86l962
$$ 11756 13139 12907 13386 12218 11700 11079 14622 14130 14702 17186 17688 19979 20233 14218 14484 13798 9836
11514I836K18j94L568K007j258P86l801P33M716J487k67l16p336m111L791J360
$$ 9836 10054 9860 13428 15435 14177 14963 11162 11895 16611 18098 17831 17515 10179 6068 9859 11219
11498A1219J909K145J059R58N51m83k764l17j850J220R09J456m38l671l400L03
$$ 11219 13128 15273 16332 17290 17841 17358 14594 14277 12427 13647 14556 16012 15574 11903 8503 8806
11482H806K386L520J302Q70n91K33j394J971L51n48Q91j878l865K907J175r81
$$ 8806 11192 14712 16014 16884 16293 16526 15132 17103 17454 16906 17797 15919 12054 14961 16136 15155
11466A5155k385Q81P60K040J818R79k12l531l471O04o38j46P97j524Q53K400j294
$$ 15155 12770 13651 14411 16451 18269 19248 19036 15505 12034 12638 12000 11854 12651 11127 11980 14380 13086
11449A3086l51Q54K917j427m320j495J165J240J730O36L10J775J015j112M083
$$ 13086 12735 13589 16506 15079 10759 9264 10429 11669 13399 14035 14345 16120 17135 16023 20106
11434B0106K512r81l62q88k068j397j549L050j096l439K444K406L050Q74k528
$$ 20106 22618 21637 21275 20387 18319 16922 15373 18423 17327 13888 16332 18738 21788 22662 20134
11419B0134j813J021k167L38K884j962l830M227K34j384k647K76k570l075J350
$$ 20134 18321 19342 17175 17513 20397 18435 14605 18832 19066 17682 15035 15311 12741 9666 11016
11404A1016J933j87J216J571L453J540j06j385j080k154j076K4K694K180K246
$$ 11016 12949 12762 13978 15549 19002 20542 20436 19051 17971 15817 14741 14765 17459 19639 21885
11389B1885q80J622k161k292j578P46M91j15j852o95l544K506J66Q00J107J871
$$ 21885 21005 22627 20466 18174 16596 17342 17833 17718 15866 15171 11627 14133 14299 15099 16206 18077
11373A8077L866k970o19J915K150J073l489l160j380L250p35q57Q96k810n2R75
$$ 18077 21943 18973 18354 20269 22419 23492 20003 16843 15463 18713 17978 17121 18017 15207 15155 16130
11357A6130n08K322J383j311J452K71O36j73J027J83l332j120R22R49K722L252
$$ 16130 15622 17944 19327 18016 19468 19739 20375 20202 21229 21412 18080 16960 17882 18831 21553 24805
11341B4805p33j601l664j49L063O31j263O11m07j834L53P20J391O80j858J391
$$ 24805 24072 22471 18807 18658 21721 22352 21089 21700 21293 19459 19812 20532 21923 22603 20745 22136
11325B2136m92Q04K051M04P59J900K952M3j515l268L16k142j474n58m375j728
$$ 22136 21644 22448 24499 24903 25662 27562 30514 30557 29042 25774 26090 23948 22474 21916 17541 15813
11309A5813K590J871n59n6k116o18j392K607L439K734R7j895o04l622J212p32
$$ 15813 18403 20274 19715 19659 17543 16925 15533 18140 21579 24313 24410 22515 21911 18289 19501 18769
11293A8769n71J362L936n56P37N53n32J653J498M43k257j965K354J93J32M45r88
$$ 18769 18198 19560 23496 22940 23677 24230 23698 25351 26849 27292 25035 23070 25424 25617 25749 26194 25206
11276B5206k75M21J011k352l113L23J63l101J555O33p12k196j540K58J442K039
$$ 25206 24931 25352 26363 24011 20898 21221 21384 18283 19838 20471 19759 17563 16023 16281 17723 19762
11260A9762K761l37N05j145J44n75j399r40K328J67m7J28j257K511M89j827k272
$$ 19762 22523 22186 22691 21546 21690 21115 19716 18776 21104 21271 21224 21352 20095 22606 23095 21268 18996
11243A8996K064p08j323j900o45K506L70M353J957j099p42K086K898J472o413
$$ 18996 21060 20352 19029 17129 16484 18990 19360 23713 25670 24571 23829 25915 28813 30285 23872
11228B3872j242n95k8M734L727j68k062k516L33K01L31Q41l355l415j154L086
$$ 23872 22630 22035 22007 26741 30468 30300 28238 25722 26055 26256 26587 27428 24073 20658 19504 22590
11212B2590J828k477L182q72J013j569k677P6K445K79m71n73j792o28J430J135
$$ 22590 24418 21941 25123 24251 25264 23695 21018 21094 23539 23818 23347 22774 20982 20354 21784 22919
11196B2919N33J03R04j1K247O04j682M71O15K304J138j234k277J883O30P42k367
$$ 22919 23452 23555 24459 24448 26695 27299 25617 26088 26703 29007 30145 28911 26634 28517 29147 29889 27522
11179B7522m390j663j220r99n08K065N130K509R42k690k593j317J727k460P08
$$ 27522 23132 21469 20249 19250 18742 20807 25937 28446 29388 26698 24105 22788 24515 22055 22763
11164B2763r39k464L397K858r65k915J81r59o37K277L613L560j360m445J850j295
$$ 22763 21824 19360 22757 25615 24650 21735 21916 20957 20320 22597 26210 29770 28410 23965 25815 24520
11148B4520P87L707j769m28P02q37k744p22l481k428J904P25m03J963P1RN220
$$ 24520 25307 29014 27245 26817 27519 26682 23938 23216 19735 17307 19211 19936 19533 21496 21567 21576 26796
11131B6796j074l39l50j559k10L913K991k606k997j862j161J23K504P11k520q91
$$ 26796 25722 25383 25033 23474 23264 27177 30168 27562 24565 22703 21542 21665 24169 24880 22360 21469
11115B1469p99J739J623K92l127k206J993J403M672L258Q37k161j195j926J777
$$ 21469 20670 22409 24032 24324 21197 18991 20984 22387 27059 30317 31154 28993 27798 25872 27649
11100B7649J515o34k012P2M070j002l359j547J516J865R27P35L77m54m68N9K097
$$ 27649 29164 28530 26518 26590 30660 29658 26299 24752 26268 28133 29060 29795 30172 29718 29250 29309 31406
11083C1406j410j039k443n82P71M752N122k251n554l471r63J493J571M221l31
$$ 31406 29996 28957 26514 25932 26703 31455 36577 34326 28772 25301 24338 25831 27402 31623 31292
11068C1292k479L051L337J843R38k923o19k459J87O52p68J218J073l75k768l123
$$ 31292 28813 31864 35201 37044 37982 35059 34440 31981 32168 32820 32052 33270 34343 33968 31200 28077
11052B8077k748k009m58L779L990k52J116n90l83j076k990J222M190K594J268
$$ 28077 25329 23320 22862 26641 30631 30379 31495 30905 30522 29446 26456 27678 31868 34462 35730
11037C5730l644N66M346J049J013j335k055J354K76J123K037l833k311l136J270
$$ 35730 32086 32652 36998 38047 39060 37725 35670 37024 37300 38423 40460 36627 34316 31180 32450
11022C2450K145l328N03P52N33j343k109k385M58M081J825J663p73N53J437K335
$$ 32450 34595 31267 31770 32522 33055 31712 29603 27218 27676 31757 33582 35245 34472 35025 36462 38797
11006C8797M633L437l687k753j530m063r23m142l024k85L288k570L653J666N142
$$ 38797 43430 46867 43180 40427 38897 34834 33911 29769 26745 26460 29748 27178 30831 32497 37639
10991C7639M23j018j623K294N70m869k389Q11J310k244j805k882J287L376k5R68
$$ 37639 38062 37044 35421 37715 38285 33416 31027 31838 33148 30904 29099 26217 27504 30880 30855 31823
10975C1823K785J743j613K752p69j564m53K583l314k18l08r97q4j860p74r93r21
$$ 31823 34608 36351 34738 37490 36721 35157 34704 37287 33973 33755 33447 32450 32366 30506 29732 28739 27818
10958B7818M355K272j987J326K005M001J47j403R52k1n20j693k031j172O71j92
$$ 27818 32173 34445 32458 33784 35789 39790 39937 38534 39486 39465 38945 37252 35221 34049 34720 34528
10942C4528j04P12O442N312L076J525J45j723n431o86O16m71J032J203k046o90
$$ 34528 34424 35136 41578 46890 49966 51491 51636 49913 44482 43796 44412 43941 44973 46176 44130 43440
10926D3440J775j307M19j090K871j018J243j064m526m47j603o44Q40l120l592
$$ 43440 45215 43908 44327 43237 46108 45090 46333 45269 40743 40296 38693 38049 38889 35769 32177
10911C2177J784J277K041J18j44L47K191J346k471L0J044o62K881J224P09K0j570
$$ 32177 33961 35238 37279 37397 37253 37600 39791 41137 38666 38696 39740 39078 41959 43183 43892 43912 42342
10894D2342k25K71K426N558J462k978j223M243j929J210K275M214j484L69M18
$$ 42342 42117 42388 44814 50372 51834 48856 47633 51876 49947 51157 53432 57646 56162 56531 56949
10879E6949j092K644Q74k086J824J244l543j290j748l082J102J001o72l18K36
$$ 56949 55857 58501 59375 57289 59113 60357 56814 55524 53776 50694 51796 52797 52125 51807 52043
10864E2043J97l495k845j797m89o49K284L14j628J728L036J462K473J837q39P36
$$ 52043 52240 48745 45900 44103 43614 42965 45249 45563 43935 45663 48699 50161 52634 54471 53632 54368
10848E4368J934K984M48q99m960J05J283K207q64J027r9p113q281l201n268q012
$$ 54368 56302 59286 59734 58835 53875 53980 55263 57470 56606 57633 57534 50421 42140 38939 33671 25659
10832B5659j664R48P40j058M076Q155J331m33r35l05k375J627J424k33k50Q82
$$ 25659 23995 24943 25683 24625 28701 36856 38187 37754 36819 36514 34139 35766 37190 36957 36707 37589
10816C7589m54k151j069J117O995J99j619O005M556K94J452M521M113M593O259
$$ 37589 37135 34984 33915 35032 42027 42226 40607 46612 51168 51462 52914 57435 61548 66141 72400
10801G2400P359J146J786N317N543L941R150J6919R538P483J3923J5458J6740
$$ 72400 79759 80905 82691 88008 93551 97492 106642 123561 133099 140582 154505 169963 186703
10788A86703K4000N1826R5103J72555L06430M58628L67389K15455M04555K72589
$$ 186703 210703 262529 357632 530187 836617 1295245 1662634 1878089 2282644 2555233
10778B555233l16540l40517j90031l85424m43746k96326j65294r7942o2450m1371
$$ 2555233 2238693 1898176 1708145 1322721 878975 582649 417355 319413 256963 215592
10768B15592l0570j6855j2207n302m544r718p249q593o499m820n778l89q8q248
$$ 215592 185022 168167 155960 150658 146114 136396 129147 120554 114055 109235 103457 103068 102980 94732
10754I4732m334m049n743k05R38k099j487J683J281j468L338K908m269k336l209
$$ 94732 90398 86349 80606 80401 81339 79240 77753 79436 80717 79249 82587 85495 81226 78890 75681
10739G5681J31j687j73J998j194K41J783j843k247l969o45J209L84K88k342l788
$$ 75681 75812 74125 73952 75950 74756 74997 76780 74937 72690 68721 68076 69285 69669 69957 67615 63827
10723F3827o85L492K211J967Q58RK132J106l01J414m61L364Q63L878N088M697
$$ 63827 63142 66634 68845 70812 71670 71679 73811 74917 74616 76030 75569 78933 79796 83674 88762 93459
10707I3459J920K787J794N05P84q15j758j363m316j681l728l055o285p622n113
$$ 93459 95379 98166 99960 100465 101249 100434 98676 97313 92997 91316 87588 84533 78248 70626 65513
10692F5513J83L472M010L361Q75K759J1125K9197L6386L5398L6775M0616J6103
$$ 65513 65696 69168 73178 76539 77414 80173 91298 120495 156881 192279 229054 269670 285773
10679B85773k6132l1455k7262k5241k6949k4884j0952p025m551M53k973m846J244
$$ 285773 259641 228186 200924 175683 148734 123850 112898 105873 101322 101775 98802 93956 95200
10666I5200j148n279o677l362l767p957p115o64k917n730J140K882k714J325M479
$$ 95200 94052 88773 82096 78734 74967 67010 59895 59231 56314 50584 51724 54606 51892 53217 57696
10651E7696J330L467R080P683P030Q591N309J517M170pj466J013L949N585L108
$$ 57696 59026 62493 71573 79256 86286 94877 100186 101703 105873 105866 104400 105413 109362 114947 118055
10636A18055K540J0744J4247O659J5093K0813K7339M2041K8356K3935L9740J2892
$$ 118055 120595 131339 145586 152245 167338 188151 215490 257531 285887 309822 349562 362454
10624C62454k4755k3312k2043m2923m6448l1650k3338j8934j1437j1456n013L199
$$ 362454 337699 314387 292344 249421 202973 171323 147985 129051 117614 106158 101145 104344
10612A04344K029M790K357Q44p48j830K975N517K990K560M567K925R102L575o97
$$ 104344 106373 111163 113520 114364 113616 111786 114761 120278 123268 125828 130395 133320 142422 145997 145300
10597A45300l639j147k172m648l110L653K485kR812N536P617N720J335M22L026
$$ 145300 141661 140514 138342 133694 130584 134237 136722 136720 146532 152068 159685 165405 166740 167162 170188
10582A70188N779N94j0161o634j589q859j1698r262j1608j2821j972R12o601K896
$$ 170188 175967 176561 166400 159766 158177 149318 137620 128358 116750 103929 101957 102869 96268 99164
10568I9164J0905O654j966M033Q987Q429K704o400N554J2290K506l778K780L991
$$ 99164 110069 116723 114757 118790 127777 136206 138910 132510 138064 150354 152860 149082 151862 155853
10554A55853l409k872J337l18m143j948J497k809o714k494j189n036m407J307
$$ 155853 152444 149572 150909 150591 146448 144500 145997 143188 136474 133980 132791 127755 123348 124655
10540A24655M117p075k180M497k534k258J0393J0219R617J6074K1935J5859J3381
$$ 124655 128772 121697 119517 124014 121480 119222 129615 139834 149451 165525 187460 203319 216700
10527B16700K6962K4395k755j581J4668N219j1144M14N681j216o801L16j630o98
$$ 216700 243662 268057 265302 263721 278389 283608 272464 272878 278559 277343 270542 270858 269228 268530
10513B68530L991Q591J0956J4828K3717L1808M5028P2140R9821J12342J33997
$$ 268530 272521 281112 292068 306896 330613 362421 407449 479589 579410 691752 825749
10502H25749J49873Q8292L2925L2861m0166j41672j27669j13471j37407j07826
$$ 825749 975622 1063914 1096839 1129700 1089534 947862 820193 706722 569315 461489
10492D61489o6148l6953j9120r049o645m271n185n223m847q797l580Q725M890
$$ 461489 395341 358388 339268 330219 323574 319303 314118 308895 304048 295251 291671 300396 305286
10479C05286j891Q742J1670M181L213M797L809M76r973o007Q653P027L599R010
$$ 305286 303395 312137 323807 327988 331201 335998 339807 340283 330310 324303 332956 339983 343582 352592
10465C52592J1603R360P170N758J4722J9157Q544J3408K6783J9832J1788K2579
$$ 352592 364195 373555 380725 386483 401205 420362 428906 442314 469097 488929 500717 523296
10453E23296K2751J6555J2137J3069J2815P775Q218J0673J1887J7125J8396J5837
$$ 523296 546047 562602 574739 587808 600623 608398 616616 627289 639176 656301 674697 690534
10441F90534P017J1742K0920J9319J2836J4178J0756Q761Q492j1830q103R722
$$ 690534 697551 709293 730213 749532 762368 776546 787302 796063 804555 792725 784622 794344
10429G94344R514J3139L4917N1968O4791O4657O2114Q3103P7014M6134N2126O7846
$$ 794344 803858 816997 851914 903882 968673 1033330 1095444 1178547 1255561 1301695 1353821 1421667
10417A421667M8704M7019O7055P1752Q5181Q4383P3009Q4532O9097P8452J30944
$$ 1421667 1470371 1517390 1584445 1656197 1741378 1825761 1898770 1983302 2052399 2130851 2261795
10406B261795J20275J07377J82634K30844K09246K11169K74420L68781M73055
$$ 2261795 2382070 2489447 2672081 2902925 3112171 3323340 3597760 3966541 4439596
10397D439596O33838O47944N32813P89245R06644N41284Q13781J487115J342579
$$ 4439596 5073434 5721378 6254191 7043436 7950080 8491364 9305145 10792260 12134839
10388A2134839J114717J911467K200343J481066J900778L049299L916117N721158
$$ 12134839 13249556 15161023 17361366 18842432 20743210 23792509 27708626 33429784
10380C3429784R458845J6105974K7989928M8284938P4107859O7747735K8962894
$$ 33429784 42888629 58994603 86984531 135269469 209377328 277125063 306087957
10373C06087957M6108210N7734586k1444853o1043674k9365387m1426783p3369896
$$ 306087957 352196167 409930753 388485900 327442226 298076839 256650056 183280160
10366A83280160o1741095l8322232k3138932j4618136r485090o171070m241324
$$ 183280160 121539065 83216833 60077901 45459765 35974675 29803605 25562281
10359B5562281l171948k051427j492552j985491j886536j277556j208979j289201
$$ 25562281 22390333 20338906 18846354 16860863 14974327 13696771 12487792 11198591
10351A1198591j161483p10618m70186r10437j007478p50143q13912q43175o31272
$$ 11198591 10037108 9326490 8856304 7945867 6938389 6188246 5374334 4531159 3899887
10342C899887m74516l68126k41497j65175j90243k17557j65224j36759j64060
$$ 3899887 3425371 3057245 2815748 2650573 2460330 2242773 2077549 1940790 1776730
10333A776730j52691j20206j11553j03085p6955p1665p7085o4941m7905m6692
$$ 1776730 1624039 1503833 1392280 1289195 1212240 1140575 1063490 998549 950644 903952
10323I03952n3114k2533K623K69m996K027K703r814l0415l9712m5436n2885n7345
$$ 903952 850838 828305 830928 831197 826201 828228 830931 821117 790702 750990 705554 652669 595324
10310E95324n1794l7513l8355k9267k0567j9615j5452j5983j8611r988j0289j2582
$$ 595324 543530 506017 467662 438395 417828 398213 382761 366778 348167 338179 327890 315308
10298C15308j4083j3743j3444j6443j4190j1500o483o727k044N605P815L563Q549
$$ 315308 301225 287482 274038 257595 243405 231905 225422 218695 216651 222256 230071 233634 242183
10285B42183R392n999j782N768n306j0847k58P232Q208j005o014p563m402j2780
$$ 242183 251575 245576 243794 249562 244256 233409 233151 240383 248591 247586 241572 234009 229607 216827
10271B16827j6236j0271l223r885o090O908Q492j33l271L562p14j1407j3684r318
$$ 216827 200591 190320 187097 177212 171122 178030 186522 186389 183118 186680 185966 174559 160875 151557
10257A51557n357m840j256J316r47O99r807l3305l8773l9601o3836p4108l6261
$$ 151557 146200 141360 140104 141420 140473 141172 131365 98060 59287 19686 -44150 -118258 -154519
10244a54519l6066m9986O398L8600J7294K2922M3632M1471K0171M823Q817J6186
$$ -154519 -190585 -240571 -234173 -195573 -178279 -155357 -111725 -70254 -50083 -45260 -36443 -20257
10232b0257R067J476Q930M236o464l152o73m262m149p059j3032j3785P298J0988
$$ -20257 -11190 -9714 -784 3452 -3012 -6164 -6837 -11099 -15248 -22307 -35339 -49124 -41826 -30838
10218c0838n857O868K6403K0378R643J3351J7960J4839K57k426J487j193J125
$$ -30838 -36695 -29827 -3424 16954 26597 39948 57908 72747 73004 70578 72065 70872 71997
10205G1997K526n196n294L104j359j0841n787j684o170n184k371k538m435l636
$$ 71997 74523 69327 64033 67137 65778 54937 49150 47466 41296 36112 33741 31203 26768 23132
10191B3132n762l886l111K610P819R37K607O237K567L90l26J730N298N875k73
$$ 23132 17370 13484 10373 12983 20802 21739 24346 30583 33150 33540 33214 34944 40242 46117 45844
10176D5844m710O567N538r706n07K68r815j3035j0927j1205j0685j284l585j0589
$$ 45844 41134 47701 53239 43533 43026 43294 33479 20444 9517 -1688 -12373 -13657 -17242 -27831
10162b7831j0170K676Q002k944q723R595P699J119J834P877K294M45P92o212j0214
$$ -27831 -38001 -35325 -27323 -30267 -38990 -29395 -21696 -20577 -18743 -10866 -8572 -8127 -7335 -13547 -23761
10147b3761k0k29m663k579O834Q975N548J437N805L711K235j109K017P965J934
$$ -23761 -23781 -24010 -28673 -31252 -24418 -15443 -9895 -8458 -2653 1058 3293 2184 4201 12166 14100
10132A4100R31K644L167K006p23p42j8k08k817P87O756N718P103N581L404K577
$$ 14100 15031 17675 20842 22848 22125 21383 21365 21157 18340 19127 25883 31601 38704 44285 47689 50266
10116E0266P75l978o693o888j0511r218q171l394k270k186k617L600K701m949
$$ 50266 51041 47063 40370 33482 22971 13753 5582 2188 -82 -2268 -4885 -1285 1416 -3533
10102c533l724j253J430K536L404J474L637M534N050O113N798K861l09L992N658
$$ -3533 -7257 -8510 -7080 -4544 -1140 334 3971 8505 13555 19668 25466 28327 28018 32010 37668
10087C7668J627m833p151k589p875q500p625l485k526K13j627j392q25n48k2J897
$$ 37668 39295 34462 27311 24722 16847 8347 722 -2763 -5289 -5076 -6703 -8095 -8920 -9468 -9490 -7593
10071g593n638j1287j9518j9938j2394m397r538j1341J0566K5161J2155O379Q938
$$ -7593 -13231 -24518 -44036 -63974 -76368 -80765 -90303 -101644 -91078 -65917 -53762 -47383 -38445
10058c8445J4759J1355M901J458K532L48O5j668p132n445k999K5K667j667q354
$$ -38445 -23686 -12331 -7430 -5972 -3440 -3092 -3027 -4695 -11827 -17272 -20271 -20246 -17579 -19246 -27600
10043b7600n102l450j142k746m885j340j313O162M366L456L867K073L807L316
$$ -27600 -32702 -36152 -37294 -40040 -44925 -46265 -47578 -41416 -37050 -33594 -29727 -27654 -23847 -20531
10029b0531J425L59K64L068K298M221J809K761k392l201p33K30j453o830j865
$$ -20531 -19106 -18747 -18483 -15415 -13117 -8896 -7087 -4326 -6718 -9919 -10652 -10422 -11875 -18705 -20570
10014b0570l636m584M41J140K681K880L742L507M026k303j603N3j547J187N1L583
$$ -20570 -24206 -28790 -28349 -27209 -24528 -21648 -17906 -14399 -10373 -12676 -14279 -14226 -15773 -14586 -14535 -10952
9998a0952M275j218K6L2J58K271J905Q52j564m280r28L078L857K143L567K002
$$ -10952 -6677 -7895 -7869 -7837 -7679 -5408 -3503 -2651 -4215 -8495 -9423 -6345 -2488 -345 3222 5224
9982E224J603M852P054J979O358P323N294R91R007P136J041M474J3174J9818K4496
$$ 5224 6827 11679 18733 20712 27070 34393 39687 40678 49685 56821 57862 62336 75510 95328 119824
9967A19824M0517P1402J33747K44227M09026M47395K39349L08373M28254r1019
$$ 119824 160341 231743 365490 609717 1018743 1466138 1705487 2013860 2442114 2351095
9957B351095m14300k19932k87207m57194l57935k11285j19242p1203m5180k8626
$$ 2351095 1936795 1716863 1429656 972462 614527 403242 284000 212797 167617 138991
9947A38991j9607j2625r074p525j0702r771m192n087r214n032M15m108m324r12
$$ 138991 119384 106759 97685 90160 79458 69687 65495 60408 51194 46162 46577 42469 38145 37233
9933C7233J203k208n828o70r88l850l984k330Q33o56l013k871L299k163j994o620
$$ 37233 38436 36228 30400 29730 28742 24892 20908 18578 19411 18755 15742 12871 16170 14007 12013 5393
9917E393m87N846L348L006M089M160p70p751j1565k750K784q132j0597l888K013
$$ 5393 4906 10752 14100 17106 21195 25355 24585 16834 5269 2519 5303 -2829 -13426 -17314 -15301
9902a5301j255k078M70Q77m264l306r61J178J917K890O37J890J025M278L527J607
$$ -15301 -16556 -18634 -18164 -17287 -21551 -24857 -25818 -24640 -22723 -19833 -19196 -17306 -16281 -12003 -8476 -6869
9886f869j506l625M34J387m9m517o257o519J050M307K902L843J254m71K256k713
$$ -6869 -8375 -12000 -11566 -10179 -10228 -14745 -21002 -27521 -26471 -22164 -19262 -15419 -14165 -14636 -12380 -15093
9870a5093n612L97j366k806k719L345J282M71M569L951R34j699p54K400l91J618
$$ -15093 -20705 -20308 -21674 -24480 -27199 -23854 -22572 -22101 -17532 -13581 -12647 -14346 -15100 -12700 -13091 -11473
9854a1473O6l010k171k584K92K80k756J649o88J943M514L087J881R94k970j818
$$ -11473 -11407 -14417 -16588 -19172 -18880 -18600 -21356 -19707 -20395 -18452 -13938 -10851 -8970 -7976 -10946 -12764
9838a2764j301n03K461K027k156q27K955M78k314l173l61K02q90K606K243k027
$$ -12764 -14065 -14568 -12107 -10080 -12236 -13063 -10108 -9630 -11944 -15117 -15478 -15276 -16166 -13560 -11317 -13344
9822a3344n173k086J628K736M324L101M536k089l359n581m859k948l37o29l117
$$ -13344 -18517 -20603 -18975 -16239 -11915 -8814 -4278 -6367 -9726 -15307 -20166 -23114 -23451 -24080 -27197
9807b7197N150L696P40K445M89l194q43J012j243K686L541J10K41l369l02M01
$$ -27197 -22047 -18351 -17611 -15166 -14677 -17871 -18714 -17702 -18945 -16259 -12718 -12608 -12367 -15736 -16038 -15637
9791a5637k437L388K723J149J444p24K644M144j009n060n04O99j153j95k293P95
$$ -15637 -18074 -14686 -11963 -10814 -9370 -10094 -7450 -3306 -4315 -9375 -9879 -9180 -10333 -10528 -12821 -12026
9775a2026L892J076L514p89m08l403l330K45l737R89M408J379k482Q57K271O6
$$ -12026 -8134 -7058 -3544 -4333 -4741 -8144 -11474 -11229 -14966 -13977 -9569 -8190 -10672 -9815 -7544 -7478
9759g478j371k08N06J743Q6j901m468l129N05k026N78M599K186L402L394j298
$$ -7478 -8849 -9057 -8551 -6808 -6722 -8623 -13091 -16220 -15715 -17741 -17163 -12564 -10378 -6976 -3582 -4880
9743d880o911j521L100j396o29p37j906j319K379J581K71k216m43L778j461J38
$$ -4880 -11791 -13312 -10212 -11608 -12237 -12974 -14880 -16199 -13820 -12239 -11968 -14184 -14627 -10849 -12310 -12172
9727a2172J090n57k247j992j805k303j260L068K040j277j122J061O77j382k677
$$ -12172 -11082 -11639 -13886 -15878 -17683 -19986 -21246 -18178 -16138 -17415 -18537 -17476 -16799 -18181 -20858
9712b0858j730j412J644J344j692M265K229Q99K425k177L80j78J125M198K967
$$ -20858 -22588 -24000 -22356 -21012 -22704 -18439 -16210 -15311 -12886 -15063 -14683 -14861 -13736 -9538 -6571
9697f571m69r9L12k342j593k729k090p8J531k305m125j382K277k394j070J115
$$ -6571 -7040 -7139 -6827 -9169 -10762 -13491 -15581 -15659 -14128 -16433 -20558 -21940 -19663 -22057 -23127 -22012
9681b2012J448K375L044k46k514N184L479l521j200L816l267n689J692L038L231
$$ -22012 -20564 -18189 -15145 -15391 -17905 -12721 -9242 -12763 -13963 -10147 -13414 -19103 -17411 -14373 -11142
9666a1142M365K32L353L906L794N663J526m134p422l994j785j015J122L95j614
$$ -11142 -6777 -6545 -3192 714 4508 10171 11697 7563 141 -3853 -5638 -6653 -5531 -5136 -6750
9651f750l782l143j275J219j12M926K156J74l153m926R69N84p26L567j888J36
$$ -6750 -10532 -13675 -14950 -13731 -13843 -8917 -6761 -6587 -9740 -14666 -13697 -13113 -13839 -10272 -12160 -12024
9635a2024R06K006J707j80J637N980l430n263l057J068K320o28l710k299q67j014
$$ -12024 -11118 -9112 -7405 -7585 -5948 32 -3398 -8661 -11718 -10650 -8330 -8958 -12668 -14967 -15834 -16848
9619a6848j919L101R13O128K272j798n040m65j464J307q59M607Q49k559q4L882
$$ -16848 -18767 -15666 -14753 -8625 -6353 -8151 -13191 -13656 -15120 -13813 -14672 -10065 -9216 -11775 -11859 -7977
9603g977k172l463R48L601k510k411k556n8J835N246l400l30N046M748p34j622
$$ -7977 -10149 -13612 -12664 -9063 -11573 -13984 -16540 -16598 -14763 -9517 -12917 -13247 -8201 -3453 -4187 -5809
9587e809o02J626p26j299j600N72k670J137J362K34l254j272N23K123K975N13
$$ -5809 -6411 -4785 -5511 -6810 -8410 -7838 -10508 -9371 -8009 -7775 -11029 -12301 -11778 -9655 -6680 -6167
9571f167n811k213l59k160Q44R66J171L07r12O16K65m62j683L026P26j064J295
$$ -6167 -11978 -14191 -14550 -16710 -15866 -14900 -13729 -13422 -14334 -13718 -13453 -13915 -15598 -12572 -11846 -12910 -11615
9554a1615J613j265J071P515j520o287l84J226n471n687j0K954N057l53O99q35
$$ -11615 -10002 -11267 -10196 -2681 -4201 -10488 -10872 -9646 -15117 -20804 -20814 -17860 -12803 -13156 -12457 -13292
9538a3292q38q09P11N36R16Q30l242j998L149k832r6L148J574k548J011K814j52
$$ -13292 -14130 -14939 -14228 -13692 -12776 -11946 -15188 -17186 -14037 -16869 -16965 -13817 -12243 -14791 -13780 -10966 -11118
9521a1118K363m74k484K494N370M195M49j112l518k285j328J701k491K99k773
$$ -11118 -8755 -9229 -11713 -9219 -3849 346 795 -317 -3835 -6120 -7448 -5747 -8238 -7939 -10712
9506a0712k746q85J568L60L991k007j614l306n78K121j56n88K437P361J407l679
$$ -10712 -13458 -14343 -12775 -12415 -8424 -10431 -12045 -15351 -15929 -13808 -13964 -14552 -12115 -4754 -3347 -7026
9490g026K014r91o100k188J145q50P57K728J238K004n119p35L304k059j314J246
$$ -7026 -5012 -6003 -12103 -14291 -13146 -13996 -13239 -10511 -9273 -7269 -12388 -13123 -9819 -11878 -13192 -11946
9474a1946J762o63J6j706R24K470j069l307l113J851K183J61J547L24j145R17
$$ -11946 -10184 -10847 -10831 -12537 -11613 -9143 -10212 -13519 -16632 -14781 -12598 -12437 -10890 -10566 -11711 -10794
9458a0794l96L575m07k653j345K489J325j67J814L392l610K000k32l419q42p15
$$ -10794 -11190 -7615 -8022 -10675 -12020 -9531 -8206 -8373 -6559 -3167 -6777 -4777 -5009 -8428 -9270 -9985
9442i985J592p68r80j964N68j38o83J067L949j208q50j649K707Q55m499k131Q97
$$ -9985 -8393 -9161 -10141 -12105 -11537 -11675 -12358 -11291 -7342 -8550 -9400 -11049 -8342 -7487 -11986 -14117 -13220
9425a3220J545K587j870r2J991j76l991k534K148N21K089L864j115m159l72r93
$$ -13220 -11675 -9088 -10958 -11050 -9059 -9235 -13226 -15760 -13612 -13091 -11002 -7138 -8253 -12412 -12784 -13777
9409a3777M847K513j470k551J243N485M089n129l791K04n07L970J814P35l84j730
$$ -13777 -8930 -6417 -7887 -10438 -9195 -3710 379 -4750 -8541 -8337 -8844 -4874 -3060 -2325 -2709 -4439
9393d439m621m637p80N334L901j380o86j672j78j56j277J723M950P10l427m65
$$ -4439 -9060 -13697 -14477 -9143 -5242 -6622 -7308 -8980 -9158 -9314 -10591 -8868 -3918 -3208 -6635 -7100
9377g100J494J260j689m26n75J477j71l701j987M382M182l602J075J053j388p8
$$ -7100 -5606 -4346 -6035 -6461 -7036 -5559 -5730 -9431 -11418 -7036 -2854 -6456 -5381 -4328 -5716 -5794
9361e794k439N84K018k117M0L959K35q83j305L83r94K934J302o242o632M360K860
$$ -5794 -8233 -7649 -5631 -7748 -7708 -3749 -3514 -4397 -5702 -5319 -6313 -3379 -2077 -8319 -14951 -10591 -7731
9344g731k777j523N46J403j996J150K814L195%J199o44P81K800m10J72n00k065
$$ -7731 -10508 -12031 -11485 -10082 -12078 -10928 -8114 -4919 -4919 -3720 -4364 -3583 -783 -1193 -1021 -1521 -3586
9327c586K143j829m166j566J407K787l233j293J537K286J729J094k360K258K591
$$ -3586 -1443 -3272 -7438 -9004 -7597 -4810 -8043 -9336 -7799 -5513 -3784 -2690 -5050 -2792 -201
9312b01j985m707q23O70r49J5l33J754L123J031j787L554L360R46J077J79L636
$$ -201 -2186 -6893 -7716 -7046 -7995 -7980 -8313 -6559 -3436 -2405 -4192 -638 2722 3668 4745 4924 8560
9295H560k906l612l42k603r67j519j17K364J788k31r36J964N137j856k783J239
$$ 8560 5654 2042 1700 -903 -1870 -3389 -3506 -1142 646 415 -521 1443 6580 4724 1941 3180
9279C180L153L647q40J782p95L40n303l059J060P72N65R74j737M94l449M060R84
$$ 3180 6333 9980 9140 10922 10127 10467 5164 2105 3165 3937 4502 5476 3739 4233 784 4844 5828
9262E828n42k69n24r27k17j86j52q02R46k9j590M00N042L947Q87L47j839K09J732
$$ 5828 5286 5017 4493 3566 3349 3163 3011 2209 3155 3126 1536 1936 6978 10925 11812 12159 10320 10529 12261
9243A2261K302R97L82n071L242J504R45L807J705p79L13L660j892r59K187K233
$$ 12261 14563 15560 15942 10871 14113 15617 16562 20369 22074 21295 21608 25268 23376 22417 24604 26837
9227B6837J665J107P49K387L91M730K705j138L568r13L227L134L612K402N21M347
$$ 26837 28502 29609 30358 32745 33136 37866 40571 39433 43001 42088 45315 48449 52061 54463 54984 59331
9211E9331P051Q584O497M531O186N166P315J1616Q346P095J1874J2734J0657J4271
$$ 59331 66382 74966 81463 85994 92180 97346 104661 116277 124623 131718 143592 156326 166983 181254
9197A81254J6426J2471J2772J9869K1505K4139K8366L1972K9613K9647L2138L2669
$$ 181254 197680 210151 222923 242792 264297 288436 316802 348774 378387 408034 440172 472841
9185D72841L2868L0430K7421J8875J6567L296m705j0495j9147k3765k5548l1289
$$ 472841 505709 536139 563560 582435 599002 602298 597593 587098 567951 544186 518638 487349
9173D87349l4912l3280l0682k8957k8204k5603k2718k5181k2156j7348j3732j3636
$$ 487349 452437 419157 388475 359518 331314 305711 282993 257812 235656 218308 204576 190940
9161A90940j5977j6595j2366r856q906p782o199p029n379p445p575n772o383l876
$$ 190940 174963 158368 146002 136146 127240 119458 113259 106230 100851 93406 85831 80059 73676 69800
9147F9800m006j998k703l183o715n960k119o534k990J15K30J047K62l305l308
$$ 69800 65794 63796 61093 57910 51195 45235 43116 36582 33592 33707 33937 34984 35246 31941 28633
9132B8633m870l308j410j199O68K649k043N29j397p73k455r4K505L24j740Q73
$$ 28633 23763 20455 19045 17846 18514 21163 19120 19649 18252 17479 15024 14930 17435 17759 16019 16892
9116A6892j76k661j142K57J51j850P84k153k568p13K215M477j571p15M347k676
$$ 16892 16716 14055 12913 13170 13321 11471 12255 10102 7534 6821 9036 13513 11942 11227 15574 12898
9100A2898o202r68P35j95n79J655l5j173Q05k478k313J352N19j173L006J868j324
$$ 12898 6696 5728 6463 6268 5689 7344 7309 6136 6941 4463 2150 3502 4021 2848 5854 7722 6398
9083F398k499N87j29k773l462l05K210K174J41J36K191k577k678k209K136r91
$$ 6398 3899 4486 4357 1584 -1878 -2183 27 2201 2342 2478 4669 2092 -586 -2795 -659 -1650
9067a650m82R18k201J284k29j180J096n15K52J712J687K143Q43k294J052r34k757
$$ -1650 -2132 -1214 -3415 -2131 -2360 -3540 -2444 -2959 -2707 -995 692 2835 3678 1384 2436 1502 -1255
9050a255p85N56K40p83L900R22j652j383k055m15J824o28N21k4l951j712L37j578
$$ -1255 -2040 -1484 -1244 -2027 1873 2795 1143 -240 -2295 -2710 -886 -1514 -993 -1017 -4968 -6680 -6343 -7921
9032g921M259J365k848K49J178J278q5J333k278j827O04q55p73K037j256K11k26
$$ -7921 -3662 -2297 -5145 -4896 -3718 -2440 -2525 -1192 -3470 -5297 -4693 -5548 -6321 -4284 -5540 -5329 -5555
9015e555J636o20p06o71k48J896K052J234k936l340Q80L011L082l112k622L58
$$ -5555 -3919 -4539 -5245 -5916 -6164 -4268 -2216 -982 -3918 -7258 -6378 -3367 -285 -3397 -6019 -5661
8999e661j16j269j912l89M181m52L353K909L387m21K310P393J456m078n650k166
$$ -5661 -5777 -7046 -8958 -9347 -5166 -5618 -2265 644 4031 3610 5920 13313 14769 10691 5041 2875
8983B875l981L49K518n21o01l298l80J747J344P3k325j737o78L823N89k127j640
$$ 2875 -1106 -757 1761 1240 639 -2659 -3039 -1292 52 125 -2200 -3937 -4615 -792 -203 -2330 -3970
8966c970p96o57J400J083J228J175J397r37Q36m93P31l461J053L08j07L128q04
$$ -3970 -4766 -5423 -4023 -2940 -1712 -537 860 -77 759 266 997 -2464 -1411 -1103 -1210 1918 1114
8949A114n415j308q77M650O201K321J1947J3782l107q844j2290p817J91N241O859
$$ 1114 -4301 -5609 -6486 -1836 4365 6686 18633 32415 29308 20464 8174 357 548 5789 12648
8934A2648j668n717k724k843k522q33j460O99j211q46k194J478J329j526j262
$$ 12648 10980 5263 2539 -304 -2826 -3659 -5119 -4420 -5631 -6477 -8671 -7193 -5864 -7390 -8652
8919h652L065Q34j70p73K512J995M85j815k976j796K118j207k691l597K065L631
$$ -8652 -5587 -4753 -4923 -5696 -3184 -1189 -704 -2519 -5495 -7291 -5173 -6380 -9071 -12668 -10603 -6972
8903f972M270N029q62K50L902M687M250j40n776l197m111k243k939l19M51O67
$$ -6972 -2702 2327 1465 1715 5617 10304 14554 14414 8638 5441 1330 -913 -3852 -4171 -3720 -3053
8887c053r71k347j016L506J538k235j06j179M425M555J962l311n195Q18Q40m31
$$ -3053 -4024 -6371 -7387 -3881 -2343 -4578 -4684 -5863 -1438 3117 5079 1768 -3427 -2609 -1769 -2200
8871b200K546j301k522m135r81K815J6k459j642L439m1L17j716J681J410J203
$$ -2200 346 -955 -3477 -7612 -8593 -5778 -5762 -8221 -9863 -6424 -6465 -6148 -7864 -6183 -4773 -3570
8855c570l091r19J953j310n4j344J617K547j01P42q36k112M50m221j672J832K426
$$ -3570 -6661 -7580 -5627 -6937 -6991 -8335 -6718 -4171 -4272 -3530 -4366 -6478 -6028 -10249 -11921 -10089 -7663
8838g663J260k247K46J64L221O27P31p41L00J866q6L871N084K895j661n200m575
$$ -7663 -6403 -8650 -8404 -8240 -5019 -4392 -3661 -4402 -4102 -2236 -2322 1549 6633 9528 7867 2667 -1908
8821a908k245L24j386L058K214j230o17M29j617k326l08J243k607J126K764k441
$$ -1908 -4153 -3829 -5215 -2157 57 -1173 -1790 -1361 -2978 -5304 -5612 -4369 -6976 -5850 -3086 -5527
8805e527l321k420j65K126L377J775L733m82k317k931K345L634j585l075m20K934
$$ -5527 -8848 -11268 -11433 -9307 -5930 -4155 -422 -904 -3221 -6152 -3807 -173 -1758 -4833 -5253 -2319
8789b319j134j9J728Q10M93J514O406P427Q906K337o904j3088o908j641K30j223
$$ -2319 -3453 -3472 -1744 -934 -441 1073 7479 14906 23812 26149 19245 6157 -751 -2392 -2162 -3385
8773c385l195q68N76J623L812K43J606M63n04j478j202k99OL853N80j414K313
$$ -3385 -6580 -7448 -6872 -5249 -1437 -1194 412 875 371 -1107 -2309 -2608 -2602 1251 1831 417 2730
8756B730K095n44L3q03K280L548j335L825Q815J1682K2384N0914Q5717P6596j9069
$$ 2730 4825 4281 4314 3511 5791 9339 8004 11829 20644 32326 54710 105624 191341 267937 248868
8741B48868q4608o5039l6697j9409r024l135k461n180q894n937k063J421J38n
$$ 248868 164260 99221 62524 43115 34091 30956 28495 23315 14421 8484 6421 7842 7980 7975
8727G975n525k039l594M31L373L78J041k273k104J460J955K610K955L161k10l016
$$ 7975 2450 411 -3183 -2752 621 999 2040 -233 -2337 -877 1078 3688 6643 9804 9594 6578
8711F578j583M907O150K538L88K170N513J2938J3922K7150M6058R0724J64344
$$ 6578 4995 9902 16052 18590 18978 21148 26661 39599 53521 80671 126729 217453 381797
8698C81797J54209m6315j71875j29692p0633l9380k1466j2563r734o986o645n948
$$ 381797 536006 489691 317816 188124 117491 78111 56645 44082 34348 27362 20717 14769
8686A4769j657j743J52J10k28k519q87q18k711j992J016l87k009J07K341j279
$$ 14769 13112 11369 11521 11631 11403 8884 7997 7179 4468 2476 3492 3105 1096 1203 3544 2265
8670B265J921K804J229N236Q23O40j994J542L592j742m294O529J0683J2866K0349
$$ 2265 4186 6990 8219 13455 14278 14918 12924 14466 18058 16316 12022 18551 29234 42100 62449
8655F2449M4716P8348P3671k0154p8341o3067l8617j8553j2599o942k533m352
$$ 62449 107165 185513 259184 239030 160689 97622 59005 40452 27853 20911 18378 14026
8643A4026o02k718k855p64j76q15O2J278k445k410p35k03k27J559K559r95kJ568
$$ 14026 13424 10706 7851 7087 6911 6096 6158 7436 4991 2581 1846 1643 1416 2975 5534 4539 4537 6105
8625F105l224l105J841p74l275m48J448L733K364M829r0K126j308m576J525j058
$$ 6105 2881 -224 1617 843 -2432 -2880 -1432 2301 4665 9494 9404 11530 10222 5646 7171 6113
8609F113j012j420l370K48p33L503N391m112j841p67j998k06m95K035o81l52J242
$$ 6113 5101 3681 311 559 -174 3329 8720 4608 2767 2000 2 -204 -699 1336 655 303 1545
8592A545M431O793Q073M570l592j0430m490j246k600j941j820m89l10J476J074
$$ 1545 5976 12769 20842 25412 21820 11390 6900 5654 3054 1113 -707 -1196 -1506 -30 1044
8577A044Q78J745J35k658J93J615M487K972k683m365R85K535K484R92j847j51
$$ 1044 1922 3667 3802 1144 1337 2952 7439 10411 7728 3363 4348 6883 9367 10359 8512 8361
8561H361o72N59k993j04j633r69J124m0M13L081j133K095K860q68O406J4056J8402
$$ 8361 7689 8248 5255 5151 3518 2549 3673 3633 4046 7127 5994 8089 10949 10081 16487 30543 48945
8544D8945r19j5975j5174o316l675m744k278j193J239k807L810J264l620l59J62
$$ 48945 48026 32051 16877 10561 6886 2142 -136 -1329 -90 -2897 913 2177 -1443 -1802 -1640
8529a640K215O88M77J702j939l610j072j355l068J055M723K479N17K015p94r48
$$ -1640 575 1263 1740 3442 1503 -2107 -3179 -4534 -7602 -6547 -1824 655 1172 3187 2393 1445
8513A445k121m023J442k634L23j171k476J960N277M092L894N338O150L581n158
$$ 1445 -676 -4699 -3257 -5891 -5568 -6739 -9215 -7255 -1978 2114 6008 11346 17496 21077 15919
8498A5919o458o451k605r34m178J682j451l08J190P47N82m88K144K482j050n75
$$ 15919 9461 3010 405 -529 -4707 -3025 -4476 -4784 -3594 -2847 -2265 -2753 -609 1873 823 248
8482B48k74n017N57N78k201R55J803j082k740J462L839J433K908k947k654N36
$$ 248 -26 -5043 -4486 -3908 -6109 -5154 -3351 -4433 -7173 -5711 -1872 -439 2469 -478 -3132 -2596
8466b596m018j108P17n83j093j283O141R65p04q45K592k288m258J16J583m35K270
$$ -2596 -6614 -7722 -7005 -7588 -8681 -9964 -3823 -2858 -3562 -4407 -1815 -4103 -8361 -8245 -6662 -7097 -4827
8449d827L97K107k4N91L545J761J095l070r0j369J642j342o263Q65K516r6K542
$$ -4827 -4430 -2323 -2347 -1756 1789 3550 4645 1575 1485 116 1758 416 -5847 -4982 -2466 -2562 -20
8432b0j894j890N82J963J074L53j503J588J283q99J93l289Q86l154j89k510L438
$$ -20 -1914 -3804 -3222 -1259 -185 168 -1335 253 1536 637 830 -2459 -1573 -4727 -4916 -7426 -3988
8415c988k4p43j426j513J621k221K663K309p33M15j588r83J036M768o95p16k343
$$ -3988 -4012 -4755 -6181 -7694 -6073 -8294 -5631 -3322 -4055 -3640 -5228 -6211 -5175 -407 -1102 -1818 -4161
8398d161r49j938r72P04L776K148P38m85j343n33K38k85p93R79K63j384k525j064
$$ -4161 -5110 -7048 -8020 -7316 -3540 -1392 -654 -1139 -2482 -3015 -2777 -3062 -3855 -2876 -2613 -3997 -6522 -7586
8380g586K477J343J737J114n70r01J49k017J831j431k453J150P66P22J458J790
$$ -7586 -5109 -3766 -2029 -915 -1485 -2386 -2237 -4254 -2423 -3854 -6307 -5157 -4391 -3669 -2211 -421
8364d21m63l114k173l00K946J627Q63j565O78l81j999N71R03j289Q16J882L185
$$ -421 -884 -3998 -6171 -6471 -3525 -1898 -1035 -2600 -1922 -2303 -4302 -3731 -2828 -4117 -3301 -1419 1766
8347A766O64k595n62l348j591J523J919K524k089j056O25J087K18K961J28k841
$$ 1766 2430 -165 -727 -4075 -5666 -4143 -2224 300 -1789 -2845 -2220 -1133 -915 2046 2174 -667
8331f67j244n07k7k509j157L665J26l0l17j090J334l03J412j869j937n06P56J398
$$ -667 -1911 -2418 -2445 -4954 -6111 -2446 -2320 -2350 -2667 -3757 -2423 -2726 -1314 -3183 -5120 -5626 -4870 -3472
8313c472m97L096j05j403m092k369K953L583K738R4j489j675l301J596N592j129
$$ -3472 -3969 -873 -978 -2381 -6473 -8842 -5889 -2306 432 526 -963 -2638 -5939 -4343 1249 120
8297A20k619k119j341n03M327J687Q27j569q94R86M271j341n060j905J052r51
$$ 120 -2499 -4618 -5959 -6462 -2135 -448 379 -1190 -2084 -1098 3173 1832 -3228 -5133 -4081 -5032
8281e032J30M29O87j8j101q36M81M514M17R12k659k923M65J099k693k182m57L338
$$ -5032 -4902 -4473 -3786 -3804 -4905 -5741 -5260 -746 -329 583 -2076 -4999 -4534 -3435 -6128 -8310 -8767 -5429
8263e429K683J067K894R85l901q00L098L628m647j272L75R75J600l005j271j01
$$ -5429 -2746 -1679 1215 2200 -1701 -2501 597 4225 -422 -1694 -1319 -344 1256 -1749 -3020 -3121
8247c121J20j730M676J204j682n48J78n2j797n65J88J876P94K746L49m643j317
$$ -3121 -3001 -4731 -55 1149 -533 -1081 -903 -955 -2752 -3317 -3129 -1253 -459 2287 2636 -2007 -3324
8230c324R55l554m053L898K308j80K454J817J662k180j156K514k253l48K19k282
$$ -3324 -2369 -5923 -9976 -6078 -3770 -3950 -1496 321 1983 -197 -1353 1161 -1092 -1440 -1221 -3503
8214c503j902P51j503J233J095J545k412m480L94L169N681K178l884J429K463
$$ -3503 -5405 -4654 -6157 -4924 -3829 -2284 -4696 -9176 -8782 -5613 68 2246 -1638 -209 2254
8199B254l264k72j96j820p30K513L416K071r20k070k157m991k60J41J432o56K294
$$ 2254 -1010 -1282 -1478 -3298 -4028 -1515 1901 3972 3052 982 -1175 -6166 -6426 -6285 -4853 -5509 -3215
8182c215j441J988L625k128j291l98K81j162j42L89k037l91k054P95L647M594
$$ -3215 -4656 -2668 957 -1171 -2462 -2860 -2579 -3741 -3883 -3494 -5531 -5922 -7976 -7181 -3534 1060
8166A060K943l659m960L615J537K99J515O49l421o914l142j14J404j98K130L943
$$ 1060 4003 344 -4616 -1001 536 835 2350 2999 -422 -7336 -10478 -10592 -9188 -9386 -7256 -3313
8150c313L7n095j690L904J194j67m17j765J499L201K08n93m151l431K276L699
$$ -3313 -3276 -8371 -10061 -6157 -4963 -5130 -5547 -7312 -5813 -2612 -2404 -2997 -7148 -10579 -8303 -4604
8134d604J803K164r31K443l90m594j782J63J694K470L56p9m239k122k829J717
$$ -4604 -2801 -637 -1568 875 485 -4109 -5891 -5728 -4034 -1564 -1208 -1287 -5526 -7648 -10477 -8760
8118h760M358J439J630p21J48K62r68R65K452j548j641j435k76p33J52m45K542
$$ -8760 -4402 -2963 -1333 -2054 -1906 -1644 -2612 -1647 805 -743 -2384 -3819 -4095 -4828 -4676 -5121 -2579
8101b579J46m834l452J509O028K267j062l558j225k711J628L972K315k676j461
$$ -2579 -2433 -7267 -10719 -9210 -3182 -915 -1977 -5535 -6760 -9471 -7843 -3871 -1556 -4232 -5693
8086e693j27l21L509M064J128k413j584K082L48j520O86n76K80P28O84K81j418
$$ -5693 -5820 -6141 -2632 1432 2560 147 -1437 645 993 -527 159 -417 -137 591 1275 1556 138
8069A38K894j012m714J419K063k064k522k075K116N05m325q41J085j017J980K087
$$ 138 3032 2020 -2694 -1275 788 -1276 -3798 -5873 -3757 -3252 -7577 -8418 -7333 -8350 -6370 -4283
8053d283O6j428L531K771o27k95k45k064r63Q11J98L426K392j166k843m83ln9
$$ -4283 -4217 -5645 -2114 657 30 -265 -510 -2574 -3537 -2726 -2528 898 3290 2124 -719 -1202 -1205 -1264
8035a264K276K636j650j837m53j82l873j215m92O27j42J124L040J118k555k023
$$ -1264 1012 3648 1998 161 -292 -474 -4347 -5562 -6054 -5427 -5569 -4445 -1405 -287 -2842 -4865
8019d865k36P83J450j467j51l75J750J604l148l54j011k64n35L946l022q74K439
$$ -4865 -5101 -4318 -2868 -4335 -4486 -4861 -3111 -1507 -4655 -5009 -6020 -6284 -6819 -2873 -5895 -6769 -4330
8002d330J748N47j673j949L33k671j032M072K858J258L13j84J045K673r13J430
$$ -4330 -2582 -2035 -3708 -5657 -5324 -7995 -9027 -4955 -2097 -839 -526 -710 335 3008 2095 3525
7986C525j132k056L24J476l40J094k322j451l30l435L4Q07L53R26J7O13j19Q26
$$ 3525 2393 337 661 2137 1797 2891 569 -882 -1212 -4647 -4613 -3806 -3453 -2527 -2510 -1897 -2016 -1190
7968a190r93N4N76N66N09J736K446J02l525K233J868j475j305m076j940l81K198
$$ -1190 -2183 -2129 -1553 -987 -478 1258 3704 3806 281 2514 4382 2907 1602 -2474 -4414 -4795 -2597
7951b597j366j200O73J822j061l547k48L111LJ64K747L80k056j074K578p9q8j191
$$ -2597 -3963 -5163 -4490 -2668 -3729 -7276 -7524 -4413 -4410 -4246 -1499 -1119 -3175 -4249 -1671 -1750 -1838 -3029
7933c029k938j690M449L838p21L051J955n115l256l525J627K677K259J153k599
$$ -3029 -5967 -7657 -3208 630 -91 2960 4915 -200 -3456 -6981 -5354 -2677 -418 735 -1864
7918a864q41L248j293j418J693R65o85m357M02J64L151K463M03j139k543l427
$$ -1864 -2705 543 -750 -2168 -475 490 -195 -4552 -4150 -3986 -835 1628 2031 892 -1651 -5078
7902e078j560N418K648j324l515Nk4k242J632K418J119j64Q47L410N93k264j658
$$ -5078 -6638 -1220 1428 104 -3411 -3406 -3430 -5672 -4040 -1622 -503 -667 180 3590 4183 1919 261
7885B61j361K659j61J247J615m218l990L00J809L061N01n283m597K270L880K057
$$ 261 -1100 1559 1398 2645 4260 42 -3948 -3648 -1839 1222 1723 -3560 -8157 -5887 -2007 50
7869E0p08j135o66J278j25j104J460J1j697J331J566J896j445j505P55K530l96
$$ 50 -658 -1793 -2459 -1181 -1306 -2410 -950 -939 -2636 -1305 261 2157 712 -793 -38 2492 2096
7852B096j840j030k67J818l78N59l686j182l124m239Q29K87J594N17k637J289
$$ 2096 256 -774 -1041 777 399 958 -2728 -3910 -7034 -11273 -10444 -10157 -8563 -8046 -10683 -9394
7836i394L451L118L267R63J332n61J278K910L4k114j387r29m29j50r16M57k51
$$ -9394 -5943 -2825 442 1405 2737 2176 3454 6364 6398 4284 2897 1968 1539 1389 473 930 679
7819F79l229j981L124r10l802j063J743m7M96J937l228Q49N606k255r9K878N70
$$ 679 -2550 -4531 -1407 -2317 -6119 -7182 -5439 -5486 -4990 -3053 -6281 -5432 174 -2081 -2180 698 1268
7802A268O94K936Q10l65j402m70m76j435j797J926J945j710l545r78J645P41J218
$$ 1268 1962 4898 5708 5343 3941 3471 2995 1560 -237 1689 3634 1924 -1621 -2599 -954 -213 1005
7785A005k248k788l757N28K775q23n65n88k540J685L737J014n1J91l694J771K043
$$ 1005 -1243 -4031 -7788 -7260 -4485 -5308 -5873 -6461 -9001 -7316 -3579 -2565 -2616 -2425 -6119 -4348 -2305
7768b305q44L484L465j735j763q36J634L398j998m814j152j245l634q28Q60K206
$$ -2305 -3149 335 3800 2065 302 -534 1100 4498 2500 -2314 -3466 -4711 -8345 -9173 -8313 -6107
7752f107n77L073k95l808J931J95j16P89R91J812q99l332r66K327L379l01j927
$$ -6107 -6684 -3611 -3906 -7714 -5783 -5588 -5704 -4915 -3924 -2112 -3011 -6343 -7309 -4982 -1603 -1904 -3831
7735c831M46J562j745M91K060j78l009K309J384m12l40o09j135k840k57q28L406
$$ -3831 -3385 -1823 -3568 -3077 -1017 -1195 -4204 -1895 -511 -923 -1263 -1872 -3007 -5847 -6104 -6932 -3526
7718c526M08K614m759K46L88K592O85J942J478j661r11K905J227j969L251l79
$$ -3526 -3118 -504 -5263 -5017 -4629 -2037 -1352 590 2068 407 -504 2401 3628 1659 4910 4531
7702D531l342q99J89k213j185j993m14K057J615k312l723J807N150N19m821l212
$$ 4531 1189 290 479 -1734 -2919 -4912 -5326 -3269 -1654 -3966 -7689 -5882 -732 -213 -5034 -8246
7686h246j563N58J896K297L360K506l53p54j943J638L599m480k261M46J485L173
$$ -8246 -9809 -9251 -7355 -5058 -1698 808 455 -299 -2242 -604 2995 -1485 -3746 -3300 -1815 1358
7670A358J295j964j480j069j566l063k318J455L248r28P1k802K544l30J452j537
$$ 1358 2653 689 -791 -1860 -3426 -6489 -8807 -7352 -4104 -5032 -4961 -7763 -5219 -5549 -4097 -5634
7654e634K92P15Q50Q99J828O27m057k784M141M243j381k791j744l239J835J455
$$ -5634 -5342 -4627 -3777 -2878 -1050 -423 -4480 -7264 -3123 1120 -261 -3052 -4796 -8035 -6200 -4745
7638d745j246l392M16J710Q2L929P66j261J004l31m05l090K115L933K751k091
$$ -4745 -5991 -9383 -8967 -7257 -7175 -3246 -2480 -3741 -2737 -3068 -3473 -6563 -4448 -515 2236 145
7622A45l742m16q59J274L765J012n91j606p27k539j24J62l90P93L1J016J877K748
$$ 145 -3597 -4013 -4872 -3598 167 1179 588 -1018 -1745 -4284 -4408 -4246 -4636 -3843 -3812 -2796 -919 1829
7604A829j196j196J646J416l258Q29O81j776l513K179L334l93j982k452L70J07
$$ 1829 633 -563 1083 2499 -759 70 751 -1025 -4538 -2359 975 582 -1400 -3852 -3482 -3375
7588c375J203K395k383j044J159n94J341M196k635Q22J25m5l752j109K053J968
$$ -3375 -2172 223 -2160 -3204 -2045 -2639 -1298 2898 263 1085 1210 1165 -2587 -3696 -1643 325
7572C25j999L360j456n56K837q70k478k406j645k547r01l055K394J770L846K455
$$ 325 -1674 1686 230 -326 2511 1641 -837 -3243 -4888 -7435 -8336 -11391 -8997 -7227 -3381 -926
7556i26K096Q0k311L28o06r24P23j357k995J257M72q8L156l45L513o80l067j3
$$ -926 1170 1250 -1061 -733 -1339 -2263 -1540 -2897 -5892 -4635 -4163 -4251 -1095 -1440 2073 1393 -1674 -1687
7538a687l31j394j723j170J499L300l053K419J912k218K725N89o160p00J897K707
$$ -1687 -2018 -3412 -5135 -6305 -4806 -1506 -4559 -2140 -228 -2446 279 868 -5292 -5992 -4095 -1388
7522a388k043j488j481n92J39R04L456Q029K443n608N2J65j093l613j667m43J281
$$ -1388 -3431 -4919 -6400 -6992 -6853 -5949 -2493 5536 7979 2371 2423 2588 1495 -2118 -3785 -4228 -2947
7505b947L019k850P6k467j962J488P82K098R17n292j570L51J721L821j585k381
$$ -2947 72 -2778 -2702 -5169 -7131 -5643 -4861 -2763 -1846 -7138 -8708 -8357 -6636 -2815 -4400 -6781
7489f781L794R68l81k021j05K910J253o68j869N63J985l14k162j103N9L015l01
$$ -6781 -2987 -2019 -2400 -4421 -4526 -1616 -363 -1031 -2900 -2337 -352 -666 -2828 -3931 -3872 -857 -1158
7472a158p76j767J523J190l533k793K587J104J30j183J207K78k243L45K407k307
$$ -1158 -1934 -3701 -2178 -988 -4521 -7314 -4727 -3623 -3493 -4676 -3469 -3191 -5434 -5089 -2682 -4989
7456d989M09K159J392j16m66j501J288M40J174J488j290L76n41N87n02q44L029
$$ -4989 -4580 -2421 -1029 -1145 -1611 -3112 -1824 -1384 -210 1278 -12 364 -177 410 -92 -936 2093
7439B093l228l636K668J260r89m125j857K885J681Q32r96k322O72K350j405K538
$$ 2093 -1135 -4771 -2103 -843 -1832 -5957 -7814 -4929 -3248 -2416 -3412 -5734 -5062 -2712 -4117 -1579
7423a579J208m397l246R87P001j264k120L023K774n06j151J87l19l551M76L860
$$ -1579 -371 -4768 -8014 -7027 -26 -1290 -3410 -387 2387 1881 730 917 598 -2953 -2477 1383
7407A383J261j863l47j914k002k09K134l84K23r65k340L067K684j039j868J979
$$ 1383 2644 781 434 -1480 -3482 -3691 -1557 -1941 -1718 -2683 -5023 -1956 728 -311 -2179 -200
7391b00J800l834o03r48k226o5j08K61j307k1o9j60J077L482m74J14l76j452j081
$$ -200 1600 -2234 -2837 -3785 -6011 -6076 -6184 -5923 -7230 -7251 -7320 -7480 -6403 -2921 -3395 -3281 -3657 -5109 -6190
7372f190j91K537Q38m21j967k418J930L314j38l66j296j833k025k17K893M311
$$ -6190 -6381 -3844 -3006 -3427 -5394 -7812 -5882 -2568 -2706 -3072 -4368 -6201 -8226 -8443 -5550 -1239
7356a239j222k739m525j221K759K162K268K374L63j13J417k690m789o57L363L82
$$ -1239 -2461 -5200 -9725 -10946 -8187 -6025 -3757 -1383 -1020 -1133 284 -2406 -7195 -7852 -4489 -4107
7340d107j53l56L426K079j84K53j274l419k686j317m22K061O932L197j858l168
$$ -4107 -4260 -4616 -1190 889 705 958 -316 -3735 -6421 -7738 -8160 -6099 833 4030 2172 -996
7324i96k040k437p01K348p38n09M01K662m18m029j547k26N95K541k24J293j64
$$ -996 -3036 -5473 -6174 -3826 -4564 -5073 -4672 -2010 -2428 -6457 -8004 -8230 -7635 -5094 -5318 -4025 -4189
7307d189J168O71J078j733J130j925l26L271k50l2o52J31J099k63k13K812o32
$$ -4189 -3021 -2350 -1272 -3005 -1875 -3800 -4126 -855 -1105 -1137 -1789 -1658 -559 -822 -1035 1777 1145
7290A145j373n93j900J198J363p57N82m093k516J512k71J943J72J243j479j267
$$ 1145 -228 -821 -2721 -1523 -160 -917 -335 -4428 -6944 -5432 -5703 -3760 -3588 -2345 -3824 -5091
7274e091J92K264l52p10J528K247J000k246k373L038M011Q66j202j947k110k640
$$ -5091 -4899 -2635 -2987 -3697 -2169 78 1078 -1168 -3541 -503 3508 4374 3172 1225 -885 -3525
7258c525m273K89L974K373O53k806l10K062J178j125j473k973J772K536K500m085
$$ -3525 -7798 -7509 -3535 -1162 -509 -3315 -3625 -1563 -385 -1510 -2983 -5956 -4184 -1648 852 -3233
7242c233l146M83LJ451M360J939K56J1j324J258n41r77l591l502J286M15K570
$$ -3233 -6379 -5896 -5893 -4442 -82 1857 2113 2124 800 2058 1517 540 -3051 -6553 -5267 -4852 -2282
7225b282J477J579K136k203l120K833M183k81k72l890l661J680K476l88q56J465
$$ -2282 -805 774 2910 707 -2413 420 4603 4322 4050 160 -3501 -1821 655 267 -589 876
7209H76M32k736K40M7J269j226k965J287l634J843K90k222J874L201J210J041
$$ 876 1308 -1428 -1188 -1141 128 -1098 -4063 -2776 -6410 -4567 -4277 -6499 -4625 -1424 -214 827
7193H27j306K086N10k563l359P65m20O1j362j055O85J42k19M068q67m914l133
$$ 827 -479 1607 2117 -446 -3805 -3040 -3460 -3399 -4761 -5816 -5131 -4989 -5208 -1140 -2007 -6921 -10054
7176a0054P59L648L797j379j837k017j661O60J250K567R36p98R9n69J494l17P25
$$ -10054 -9295 -5647 -1850 -3229 -5066 -7083 -8744 -8084 -6834 -4267 -3331 -4129 -4030 -4599 -3105 -3422 -2697
7159b697L54K712K581j817l699j936N22L045L767o80l706j01p61R81k840l951
$$ -2697 -2343 369 2950 1133 -2566 -4502 -3980 -935 2832 2152 -1554 -1655 -2416 -1435 -4275 -8226
7143h226r53l116J718L951L254L012K151j198R06k383J091J131J443q46j709k629
$$ -8226 -9179 -12295 -10577 -6626 -3372 -360 1791 593 1499 -884 207 1338 2781 1935 226 -2403
7127b403l119k602J910R36R9L115J164J130K08j100J224k641J473K578k076m86
$$ -2403 -5522 -8124 -6214 -5278 -5179 -2064 -900 230 438 -662 562 -2079 -606 1972 -104 -590
7111e90L692l8j304j085j656R48J469r20P55K27k513j733o98j048p12j961K116
$$ -590 3102 3064 1760 675 -981 -33 1436 516 1271 1498 -1015 -2748 -3446 -4494 -5206 -7167 -5051
7094e051L361p09K624r9o80j467j766K69K991k146PM86j054M08J749J457l167
$$ -5051 -1690 -2399 225 126 -554 -2021 -3787 -3518 -527 -2673 -2666 -2180 -3234 -2826 -1077 380 -2787
7077b787k235M617J021o42n79r23j273j440L93k27RK692o19j936J764n63K055
$$ -2787 -5022 -405 616 -26 -605 -1528 -2801 -4241 -3848 -4075 -4066 -1374 -1993 -3929 -2165 -2728 -673
7060f73J184J051M41L16K45j229j845k333m78K380P53n97J767K228k430m68j485
$$ -673 511 1562 2003 2319 2564 1335 -510 -2843 -3321 -941 -188 -785 982 3210 780 312 -1173
7043a173K675j827k408l126J544K301K620k61k52P14l53k52n35n89k006O87J214
$$ -1173 1502 -325 -2733 -5859 -4315 -2014 606 345 93 807 454 202 -333 -922 -2928 -2241 -1027
7026a027j744j042K084j38m51p8K09r9N58l06j005j624j821L577L887j835m106
$$ -1027 -2771 -3813 -1729 -1867 -2318 -2396 -2187 -2286 -1728 -2034 -3039 -4663 -6484 -2907 980 -855 -4961
7009d961M23L780j244j081k263k472J482j764K785K478l45k291R76M495J943j922
$$ -4961 -4538 -758 -2002 -3083 -5346 -7818 -6336 -8100 -5315 -2837 -3182 -5473 -4497 -2 1941 19
6993A9j463J517K108j531k419m144J500M961L607R63j295j987k748j7o06J68K819
$$ 19 -1444 73 2181 650 -1769 -5913 -4413 548 4155 5118 3823 1836 -912 -929 -1535 -1367 1452
6976A452j787o60J540K129j603m281p51N411K759J201k217n546k613K718N441
$$ 1452 -335 -995 545 2674 1071 -3210 -3961 1450 4209 5410 3193 -2353 -4966 -2248 3193
6961C193M31n140k893O49R65j609j246j240J710l00J121M559p94l519k341Q46
$$ 3193 3624 -1516 -4409 -3760 -2795 -4404 -5650 -6890 -5180 -5480 -4359 200 -594 -4113 -6454 -5608
6945e608J250k612J765J948P47J303K006J668j377j140k296K260l48J701Q04K347
$$ -5608 -4358 -6970 -5205 -3257 -2510 -1207 799 2467 1090 -50 -2346 -86 -434 1267 2071 4418
6929D418k354J447J228K13k504m021m190m56l378R28M626M084l36j895K809M545
$$ 4418 2064 3511 4739 4952 2448 -1573 -5763 -6219 -9597 -8669 -4043 41 -295 -2190 619 5164
6913E164L230m803k017K135m373k386m269J713k765j791L171K469r46L43J699
$$ 5164 8394 3591 1574 3709 -664 -3050 -7319 -5606 -8371 -10162 -6991 -4522 -5468 -5125 -3426
6898c426L87L869J766k541j104J079L377k88j376P19J845J554k7l276n173L1m36
$$ -3426 -3039 830 2596 55 -1049 30 3407 3119 1743 2462 4307 5861 5834 2558 -2615 -2584 -3020
6881c020j443K847O39k973k38J526o55L02j038J119M42M890j742m394J752M171
$$ -3020 -4463 -1616 -977 -3950 -4188 -2662 -3317 -3015 -4053 -2934 -2492 2398 656 -3738 -1986 2185
6865B185k404j044J967L405k9k617l31j194k982K40O84j622L73J773l02K576L600
$$ 2185 -219 -1263 704 4109 4080 1463 1132 -62 -3044 -2804 -2120 -3742 -3369 -1596 -1898 678 4278
6848D278J244k4j87J749N01k781j708k688J247K14j120l705K165L044P47q81l019
$$ 4278 5522 5498 5311 7060 7561 4780 3072 384 1631 1845 725 -2980 -815 2229 2976 2095 -924
6831i24j882p59k174K054n51l56k15K953J375k410k90L796k003l717O33J933Q23
$$ -924 -2806 -3565 -5739 -3685 -4236 -4592 -4807 -1854 -479 -2889 -3179 617 -1386 -5103 -4470 -2537 -1714
6814a714J23K690K515j886n15n87j506L272J866k893o56N34J467J896j995j700
$$ -1714 -1591 1099 3614 1728 1213 626 -880 2392 4258 1365 709 1243 2710 4606 2611 911
6798I11k235j957J977l82l615p20Q83P29j383J272K579M3J100M733n418l035j886
$$ 911 -1324 -3281 -1304 -1686 -5301 -6021 -5138 -4409 -5792 -4520 -1941 -1898 -798 3935 -1483 -4518 -6404
6781f404J267R87J462K750K928R44l241j674O51J023j029l413n54K307j5J725
$$ -6404 -5137 -4150 -2688 62 2990 3934 693 -981 -330 693 -336 -3749 -4303 -1996 -2011 -286
6765b86L842K856K453j35l206l94n113k129o37l37m3R82j833M19p1l347q53J160
$$ -286 3556 6412 8865 8730 5524 5130 17 -2112 -2749 -3086 -3129 -2147 -3980 -3561 -3632 -6979 -7832 -6672
6747f672q53j046J559K184K026R14L400k044r0p92j621p29m99J032K858J471m527
$$ -6672 -7525 -8571 -7012 -4828 -2802 -1888 1512 -532 -622 -1414 -3035 -3764 -4263 -3231 -373 1098 -3429
6730c429r57L585P02k35N47k42j642k363L9Q42M89q67J456J469p53K335m9L91
$$ -3429 -4386 -801 -99 -334 213 -29 -1671 -4034 -3995 -3153 -2664 -3531 -2075 -606 -1359 976 927 1318
6712A318K38k435J202l726k637L050J370M51N01r73l29J379o23K758j945J895
$$ 1318 1556 -879 323 -3403 -6040 -2990 -1620 -1169 -668 -1641 -1970 -591 -1214 1544 -401 1494
6696A494K004j079j37J890L76L58O28k027j459j481j206J234l422l114P15L068
$$ 1494 3498 2419 2282 4172 4548 4906 5534 3507 2048 567 -639 595 -2827 -5941 -5226 -2158
6680b158M404K18k080k747K142L069O01K31q96J003j557l122K041J824k592j483
$$ -2158 2246 2464 384 -2363 -221 2848 3449 3680 2784 3787 2230 -892 1149 2973 381 -1102
6664a102K91K377K351J098l93p36J209l54k166J686L819m046n338Q2n07J09l882
$$ -1102 -811 1566 3917 5015 4622 3886 5095 4741 2575 4261 8080 4034 -1304 -1222 -1729 -1620 -5502
6647e502J966K590J330O28J868k008l522j685J80n5K374N625j54k200J390l71
$$ -5502 -3536 -946 384 1012 2880 872 -2650 -4335 -4155 -4210 -1836 3789 3635 1435 2825 2454
6631B454k014M25K245J652P23l187k5O86K00P85k681j40k953L01L617K282m69
$$ 2454 440 865 3110 4762 5485 2298 2273 2959 3159 3944 1263 1123 -1830 -1529 2088 4370 3901
6614C901q83l304k732J751K491m573k832k083j232m061R53M286J131j220R77J241
$$ 3901 3018 -286 -3018 -1267 1224 -3349 -6181 -8264 -9496 -13557 -12604 -8318 -7187 -8407 -7430 -6189
6598f189J03K087O038L061k43k060K522k756n049j655P82r24J894l837j719L045
$$ -6189 -6086 -3999 2039 5100 4857 2797 5319 2563 -2486 -4141 -3359 -4283 -2389 -6226 -7945 -4900
6582d900J846j046k53M722L09p55Q68K268k401j516j2N156J59l159L6K740j230
$$ -4900 -3054 -4100 -4353 369 678 -77 791 3059 658 -858 -870 4286 4445 1286 1322 4062 2832
6565B832l825k623K556L49J568K309n61k360J218L227j805J89p11n04k762k049
$$ 2832 -993 -3616 -1060 -711 857 3166 2605 245 1463 4690 2885 3074 2363 1859 -903 -2952
6549b952K164k021k657p36M402J424K6Q97k35J038k437q38k31K54J839j503J402
$$ -2952 -788 -2809 -5466 -6202 -1800 -376 -350 547 312 1350 -1087 -1925 -2156 -1902 -63 -1566 -164
6532a64J913k916K243M509j166l427j224J518O4k968k235J736l75p39K661J316
$$ -164 1749 -1167 1076 5585 4419 992 -232 1286 1350 -1618 -3853 -2117 -2492 -3231 -570 746
6516G46r48l741K36L903K078j388k721j327J443L175K826j223k793J423q14j864
$$ 746 -202 -3943 -3707 196 2274 886 -1835 -3162 -1719 1456 4282 3059 266 1689 875 -989
6500i89M80Q70J079j085j555o07k597J462R21K956k009o80N940J826k519k226
$$ -989 -509 361 1440 355 -1200 -1807 -4404 -2942 -2021 935 -1074 -1754 4186 6012 3493 1267
6484A267O89q19q18%J126L375k619q49j51q32j78j2k520N16K375Q99j512j74J796
$$ 1267 1956 1137 319 319 1445 4820 2201 1352 1201 369 191 179 -2341 -1825 550 1449 -63 -237 1559
6465A559k145j584l53J05k950j014n32J191M68J195L194K443j59j121P41M201
$$ 1559 -586 -2170 -2523 -2418 -5368 -6382 -6914 -5723 -5255 -4060 -866 1577 1418 297 1038 5239
6449E239r99r07j896Q7K35J84k99m787k48M068K345j911k020k633m919M06J603
$$ 5239 4240 3333 1437 1524 1759 1943 1644 -3143 -3391 677 3022 1111 -909 -3542 -8461 -8055 -6452
6432f452K573L443J411L67J090l898j213N78J308R84n85Q80J450N966N39l789
$$ -6452 -3879 -436 975 1342 2432 -1466 -2679 -2101 -793 191 -394 486 1936 7902 8441 4652
6416D652K357m79m073k986k731K048L177P83O47o97k840k917l132l743j436J491
$$ 4652 7009 6530 2457 -529 -3260 -1212 1965 2748 3395 2698 -142 -3059 -6191 -9934 -11370 -9879
6400i879J786K652j23R75n8j684P26J257J009K311k70j484j137k028K218l216
$$ -9879 -8093 -5441 -5564 -4589 -4647 -6331 -5605 -4348 -3339 -1028 -1298 -2782 -3919 -5947 -3729 -6945
6384f945L255K593j247J34J473j779K496R12J093k863k874j147K311K344l2K573
$$ -6945 -3690 -1097 -2344 -2210 -737 -2516 -20 892 1985 -878 -3752 -4899 -2588 -244 -276 2297
6368B297M6k204N2J141j862k789l130m234j849O49L501N448K197J120l166j155
$$ 2297 2343 139 191 1332 -530 -3319 -6449 -10683 -12532 -11883 -8382 -2934 -737 383 -2783 -3938
6352c938J330j204L73K884k27k108K116m25K06N92l33r09K25K77j727Q24m26n758
$$ -3938 -2608 -3812 -3439 -555 -782 -2890 -774 -1199 -993 -401 -734 -1643 -1418 -1141 -2868 -2044 -2470 -8228
6334h228k4L602L132k072J633K45j274R94N568j066j865j005k207K212K982j557
$$ -8228 -8252 -4650 -1518 -3590 -1957 -1712 -2986 -1992 3576 2510 645 -360 -2567 -355 2627 1070
6318A070j326o24k413m263j198J84L045M757O75o63K375r32j720j354p23L442
$$ 1070 -256 -880 -3293 -7556 -8754 -8570 -5525 -768 -93 -756 1619 687 -1033 -2387 -3110 332
6302C32K603m07l056l470K196O794k691k648r34J267l240P07m86j30J349L717
$$ 332 2935 2528 -528 -3998 -1802 4992 2301 -347 -1281 -14 -3254 -2547 -3033 -3163 -1814 1903
6286A903K026j807o33k240P0M14J388q27J018k217q30J878m30m19m080l464K822
$$ 1903 3929 2122 1489 -751 -681 -267 1121 294 1312 -905 -1735 143 -287 -706 -4786 -8250 -5428
6269e428J388K70O86k094r11M104J057j508k386K416J315k5K098R43k994P63l21
$$ -5428 -4040 -3770 -3084 -5178 -6089 -1985 -928 -2436 -4822 -2406 -1091 -1116 982 1925 -1069 -306 -627
6252f27m22J343O26N5j148o02J243K79k69k22O95K642p20K427l572j659j873j896
$$ -627 -1049 294 920 975 -173 -775 468 747 478 256 951 3593 2873 5300 1728 69 -1804 -3700
6234c700J210L221R85j143k218K593L14j960J382o42k430K59K555L86K274l275
$$ -3700 -2490 731 1716 573 -1645 948 1262 -698 684 42 -2388 -2129 426 812 3086 -189
6218a89k352K135J316j077k277P83J806J643J431p1n90j681j34J895k030l930
$$ -189 -2541 -406 910 -167 -2444 -1661 145 1788 3219 3148 2558 877 743 2638 608 -3322
6202c322O03o98o74L403L875O75k547r84M31j959k850K066J044N5J260N77J172
$$ -3322 -2719 -3417 -4091 -688 3187 3862 1315 331 762 -1197 -4047 -1981 -937 -882 378 955 2127
6185B127j316j303Q28J427o3K397K40j741r35l259j736j251Q8M310K407j882J145
$$ 2127 811 -492 336 1763 1700 4097 4337 2596 1661 -1598 -3334 -4585 -4497 -187 2220 338 1483
6168A483K114l2r82J168o64O40r09j502n568j723J567J063j776j645K929J451
$$ 1483 3597 3565 2583 3751 3087 3727 2818 1316 -4252 -5975 -4408 -3345 -5121 -6766 -3837 -2386
6152b386j367P98K955J362k632K235j285m503P43J092q1j251p0J723M45k559k21
$$ -2386 -3753 -2955 0 1362 -1270 965 -320 -4823 -4080 -2988 -3069 -4320 -4390 -2667 -2222 -4781 -5002
6135e002j013J674k59k022n21p24J498L157k500j316M479K593P49N31m21N60J63
$$ -5002 -6015 -4341 -4600 -6622 -7143 -7867 -6369 -3212 -5712 -7028 -2549 44 793 1324 903 1463 1626
6118A626J480q35j684K92j213l804k153J75M849j446j808O81L069P474l032l188
$$ 1626 3106 2271 587 879 -334 -4138 -6291 -6116 -1267 -2713 -4521 -3840 -771 6703 3671 483
6102D83k183K49K086J162J177L12k402m193r63O033J961l997k004l664O40J657
$$ 483 -1700 -1451 635 1797 2974 3286 884 -3309 -4272 1761 3722 -275 -2279 -5943 -5303 -3646
6086c646K914K974k19p41j683j905J675n61O36k571J451J542P95N65q43l675m2
$$ -3646 -732 2242 2023 1282 -401 -2306 -631 -1192 -556 -3127 -1676 -134 661 1226 383 -3292 -3334
6069c334Q05J646l172j366l67L597M466L432p68k422n63K545j629k668l32m32
$$ -3334 -2529 -883 -4055 -5421 -5788 -2191 2275 5707 4939 2517 1954 4499 2870 202 -130 -562
6053e62m36j875k05K539j295l15j389L065K362j645j419j765j305K438J350K700
$$ -562 -998 -2873 -3078 -539 -1834 -2149 -3538 -473 1889 244 -1175 -2940 -4245 -1807 -457 2243
6037B243J607l745J277M093J814k969j679j929j286j893j104M271k434m422L493
$$ 2243 3850 105 1382 5475 7289 4320 2641 712 -574 -2467 -3571 700 -1734 -6156 -2663
6022b663K696J006p16j286J617L652l65K2p01k58J76P22m98j854m706j94j53k855
$$ -2663 33 1039 323 -963 654 4306 3941 3963 3262 3004 3180 3902 3404 1550 -3156 -3350 -3503 -6358
6004f358J148o2K08L75M247K295k997k097j093m550j752L489K817J59j614J099
$$ -6358 -5210 -5272 -5064 -4689 -442 1853 -1144 -3241 -4334 -8884 -10636 -7147 -4330 -4171 -5785 -4686
5988d686J573K693N79p31n84J06O99J38K058k706k23m82O48q59Q57L894j178k341
$$ -4686 -3113 -420 159 -572 -1156 -1050 -351 -213 1845 -861 -1084 -1566 -918 -1777 -920 2974 1796 -545
5970e45L55K573K393m70j746j576j855K75j672j234L2J505K765K254J093K65r10
$$ -545 -190 2383 4776 4306 2560 984 -871 -596 -2268 -3502 -3470 -1965 800 3054 4147 4412 3502
5953C502k540l420q60J512K47j725N82K323j390P00J233L331J059J140k355j878
$$ 3502 962 -2458 -3318 -1806 -1559 -3284 -2702 -379 -1769 -1069 164 3495 4554 5694 3339 1461
5937A461p62n545q15N99L301J022j322j282L439Q74m41k726M3M680J133L56r54
$$ 1461 699 -4846 -5661 -5062 -1761 -739 -2061 -3343 96 970 529 -2197 -2154 2526 3659 4015 3061
5920C061j529j846J99j171K084J148L038K47l501n216j538J848L067Q59O24l79
$$ 3061 1532 -314 -115 -1286 798 1946 4984 5231 1730 -3486 -5024 -3176 -109 750 1374 995
5904I95P28J527l86j160o6j665P4J48j859k915k223L322J36L51j983l40K054o25
$$ 995 1723 3250 2864 1704 1638 -27 47 195 -1664 -4579 -6802 -3480 -3344 -2993 -4976 -5316 -3262 -3887
5886c887q51O35n31j001L555L685j267O97l96o90K714k360L349j051J52j346p42
$$ -3887 -4738 -4103 -4634 -5635 -2080 1605 338 1035 639 -51 2663 303 3652 2601 2753 1407 665
5869F65l74K094j80l909%j226L84K055Q22M74K293J236j344j369k68PL98L43K853
$$ 665 291 2385 2205 -1704 -1704 -2930 -2546 -491 331 805 3098 4334 2990 1621 1353 1360 1758 2101 4954
5850D954j676k155j338M811J057l199j125K97Q23J759j792Q32j104j302N0M066
$$ 4954 3278 1123 -215 4596 5653 2454 1329 1626 2449 4208 2416 3248 2144 842 892 4958
5834D958N450O33n253k146J675N65L83j442O54k546k514j350j557K16k592O8m49
$$ 4958 10408 11041 5788 3642 5317 5882 6265 4823 5477 2931 417 -933 -2490 -2274 -4866 -4798 -5247
5817e247L710J984j319K834j434J145O56j23K604l19j427L65P43j25j344Q58J756
$$ -5247 -1537 447 -872 1962 528 1673 2329 2206 4810 4491 3064 3429 4172 4047 2703 3561 5317
5800E317j142K709j217Q7N91k830j910j860j33q36k928n79L097K737O78j189K216
$$ 5317 4175 6884 5667 5754 6345 3515 1605 -255 -388 -1224 -4152 -4731 -1634 1103 1781 592 2808
5783B808J478j410j936l72k060j811J253K783n67J353K06J463k45k835M12l196
$$ 2808 4286 2876 940 568 -1492 -3303 -2050 733 166 1519 1725 3188 2943 108 520 -2676
5767b676j185M339L512k671j936J199R98j282r61k529J654L791j635J174J748
$$ -2676 -3861 478 3990 1319 -617 582 1580 298 -663 -3192 -1538 2253 618 1792 3540
5752C540j074n54J129j343P48M570P72j469n187j358O94M506J219p10j261j032
$$ 3540 2466 1912 3041 1698 2446 7016 7788 6319 1132 -226 468 4974 6193 5483 4222 3190
5736C190K791n11k357l600Q1J608p34j638J498j427K137k301k573L94j76K733
$$ 3190 5981 5470 3113 -487 -406 1202 468 -1170 328 -1099 1038 -1263 -3836 -3442 -3618 -885
5720h85K252j796j145N88J292j388r18L77k36L58p1k380P03L60J718K683J898
$$ -885 1367 -429 -1574 -986 306 -1082 -2000 -1623 -1859 -1501 -1572 -3952 -3249 -2889 -1171 1512 3410
5703C410M146l969k440j581k336P90J656J254m02p21J678J351j361j174K45J811
$$ 3410 7556 3587 1147 -434 -2770 -1980 -324 930 528 -193 1485 2836 1475 301 546 2357
5687B357J034k670l033j659J161O3K363j696l422J492J828L378M310L863N68j515
$$ 2357 3391 721 -2312 -3971 -2810 -2747 -384 -2080 -5502 -4010 -2182 1196 5506 9369 9937 8422
5671H422q43k236m724j326J205J623l727l519N5N168K63j869k274K061J078N57
$$ 8422 7579 5343 619 -707 498 2121 -1606 -5125 -5070 98 361 -1508 -3782 -1721 -643 -86
5655h6L964l528l091K660K418L348M79k891l433q81J110J762l886j697K759J505
$$ -86 3878 350 -2741 -81 2337 5685 6164 3273 -160 -1041 69 1831 -2055 -3752 -993 512
5639E12j383J471n90j774k533L63K76o97m303J65L871L695M269J745l403k246
$$ 512 -871 600 10 -1764 -4297 -3934 -3658 -4355 -8658 -8493 -4622 -927 3342 5087 1684 -562
5623e62O69L79r5j592K19k04N60M940L015o89J449j65m135l250J307M288k793
$$ -562 107 486 391 -1201 -982 -1186 -626 4314 7329 6640 8089 7924 3789 539 1846 6134 3341
5606C341l434k538m524n54M95K171M236M200J743m247k636N67R31R58J1ll302
$$ 3341 -93 -2631 -7155 -7709 -7214 -5043 -807 3393 5136 889 -1747 -1180 -249 709 720 717 -2585
5589b585L214L718m01l64k127l22j419l544J004l90R73L556L94l636j70l96J828
$$ -2585 629 4347 3946 3582 1455 1133 -286 -3830 -2826 -3216 -2243 1313 1707 -1929 -2099 -2495 -667
5572f67J331J786k926k697J834M505M247m2n474k861K810K78j165L177N15rq4
$$ -667 664 2450 -476 -3173 -1339 3166 7413 7371 1897 -964 1846 2124 959 4136 4651 4642 4558
5555D558o97k144l343l348j442J742K105Lj224K053L704l454o09j587R9N973L311
$$ 4558 3861 1717 -1626 -4974 -6416 -4674 -2569 -2566 -3790 -1737 1967 -1487 -2096 -3683 -3584 2389 5700
5538E700k186m108k034K19M970m65j176k81o30L72o75L872P05J687k328l218q43
$$ 5700 3514 -594 -2628 -2409 2561 2096 920 639 9 381 -294 3578 4283 5970 3642 424 -419
5521d19r76j758M69J524J544r00M92j37J46l60J683l52l459L006Q80J787Q90l040
$$ -419 -1395 -3153 -2684 -1160 384 -516 -24 -161 -15 -375 1308 956 -2503 503 1383 3170 4060 1020
5503A020n56Q27p8p32L145J951m919k853j068j947M56O60m35L59L221J900J554
$$ 1020 464 1291 1213 481 3626 5577 658 -2195 -3263 -5210 -4754 -4094 -4529 -4170 -949 951 2505
5486B505k174J401o30m494P96K679k505n09J963k146N86k559O70O852J474o16
$$ 2505 331 1732 1102 -3392 -2596 83 -2422 -2931 -968 -3114 -2528 -5087 -4417 2435 3909 3293
5470C293j082J810K52P84K024K297k753o16J248O92j324l303j064J552K876r20
$$ 3293 2211 4021 4273 5057 7081 9378 6625 6009 7257 7949 6625 3322 2258 3810 6686 5766
5454E766n158j481M155L054l776j223J523l209j04K025L007l62J269M63n666m656
$$ 5766 608 -873 3282 6336 2560 1337 2860 -349 -453 1572 4579 4217 5486 5949 283 -4373
5438d373J24K304M72J304K201Q32K34J877j025J407r02k952j196J43K615k25n24
$$ -4373 -4249 -1945 -1473 -169 2032 2864 3098 4975 3950 5357 4455 1503 307 450 3065 2840 2316
5421B316k911k458K85N402m78k030j610k047j914M025K027k315j260m046l513
$$ 2316 -595 -3053 -2768 2634 2156 126 -1484 -3531 -5445 -1420 607 -1708 -2968 -7014 -10527
5406a0527J222P56N471P040K914m214K07k501o024K740M822M25M266j596m842
$$ -10527 -9305 -8549 -3078 3962 6876 2662 2869 368 -5656 -2916 1906 2331 6597 5001 159
5391A59j727k72J06j550r00o81K93L089K670l008k01J24m20j081o79j41k513J734
$$ 159 -1568 -1840 -1734 -3284 -4184 -4865 -4572 -1483 1187 -1821 -2022 -1898 -2318 -3399 -4078 -4219 -6732 -4998
5373d998J314K645P71q32o64L662L560l018l101K762k209M50Q47J412q90J21M22
$$ -4998 -3684 -1039 -268 -1100 -1764 1898 5458 2440 -661 2101 -108 342 1189 2601 1711 1832 2254
5356B254k832j790J849L681L247q45J03J60j787l16j597j079l07r2k065j443L188
$$ 2254 -578 -2368 -519 3162 6409 5564 5667 5827 4040 3724 2127 1048 741 649 -1416 -2859 329
5339C29O33M9P68J851K37k463r15K425j059j402J994J123K85J231J535m575k087
$$ 329 962 1011 1779 3630 3867 1404 489 2914 1855 453 2447 3570 3855 5086 6621 2046 -41
5322d1Q68K058j205j915K622M191R49K76J259k877k321q87j915Q14J40m82j326
$$ -41 827 2885 1680 -235 2387 6578 7527 7803 9062 6185 3864 2977 1062 1876 2016 1534 208
5305B08k357K747N92J25K411j624M5j538j209Q93k904k282J101L190J739K585
$$ 208 -2149 598 1190 1315 3726 2102 2147 609 -600 293 -2611 -4893 -3792 -602 1137 3722
5289C722j911l178R23M5O72K30J100j25j943k081j105j647K611K625o4O96o31
$$ 3722 1811 -1367 -444 -399 273 503 1603 1478 -465 -2546 -3651 -5298 -2687 -62 -126 570 -61
5272f1j55M014P43L22o4m52j774m239l139K32M391P83p6L66j825O36M438j669
$$ -61 -216 3798 4541 4863 4799 4347 2573 -1666 -4805 -4573 -182 601 525 891 -934 -298 4140 2471
5254B471l18N23o82l004j644J52l55J051j490P45j269N04J723L117K49L0j96l339
$$ 2471 2153 2676 1994 -1010 -2654 -2502 -2857 -1806 -3296 -2551 -3820 -3316 -1593 1524 1773 1803 1607 -1732
5236a732N43K393j019j32J19M819J919j389m27j714J74m46j876k913q70j079n78
$$ -1732 -1189 1204 185 53 172 4991 6910 5521 5094 3380 3554 3108 1232 -1681 -2551 -3630 -4208
5219d208K821j281r58O33k667J472K588M782L031j587k772j877L0J591J750l23
$$ -4208 -1387 -2668 -3626 -2993 -5660 -4188 -1600 3182 6213 4626 1854 -23 7 1598 3348 3025
5203C025k076l497o86j185N75N432K363j85j344j916J125L483q17n129J239k32
$$ 3025 949 -2548 -3234 -4419 -3844 1588 3951 3766 2422 506 1631 5114 4297 -832 407 175
5187A75m06J527j154j091K515J426j757j863L67k011j041P30L48J040J582K698
$$ 175 -231 1296 142 -949 1566 2992 1235 -628 -261 -2272 -3313 -2583 -2235 -1195 387 3085
5171C085M62j089q09k924p95O74m41J138L664j735m156j040R72P24J128K559K168
$$ 3085 3547 2458 1649 -1275 -2070 -1396 -1837 -699 2965 1230 -2926 -3966 -2994 -2270 -1142 1417 3585
5154C585k365k61r68l202M565K254j328r3j630K017j402L08J446k92j440j062
$$ 3585 1220 959 -9 -3211 1354 3608 2280 2187 557 2574 1172 1480 2926 2634 1194 132
5138A32k578l002J805L375J515r23J899q70l414J323K359J60k346j91K5L158L571
$$ 132 -2446 -5448 -3643 -268 1247 324 2223 1353 -2061 -738 1621 1781 -565 -756 -731 2427 5998
5121E998j423n173L02L62J332K516J109l605l297k752k733J065L332J402j600
$$ 5998 4575 -598 -296 66 1398 3914 5023 1418 -1879 -4631 -7364 -6299 -2967 -1565 -3165
5106c165o59J6K392Q84L3n76j046K257j253j777N53M77j738k468K00J496J228
$$ -3165 -3824 -3808 -1416 -532 -499 -1075 -2121 136 -1117 -2894 -2341 -1864 -3602 -6070 -5870 -4374 -3146
5089c146M57R23M214J721j220L685J606r48J18K077J412q18j593l913p82k653
$$ -3146 -2689 -1766 2448 4169 2949 6634 8240 7292 7410 9487 10899 10081 8488 4575 3793 1140
5073A140k771L5j248J304k521j679n58Q95K330M345k01j760l867R18L86J165J063
$$ 1140 -1631 -1596 -2844 -1540 -4061 -5740 -6298 -5403 -3073 1272 1071 -689 -4556 -3638 -3252 -2087 -1024
5056a024m94k470j085N30j1L46J185J429q53j786k18J783L438j15L359L361k799
$$ -1024 -1518 -3988 -5073 -4543 -4554 -4208 -3023 -1594 -2447 -4233 -4451 -2668 770 655 4014 7375 4576
5039D576j387K07l16k623L328k101k687N74K84j283L87K24M356K685n96p645l16
$$ 4576 3189 3396 3080 457 3785 1684 -1003 -429 -145 -1428 -1041 -817 3539 6224 5628 -2017 -2333
5022b333M351j559k633J866K879K454K062l6j663l477L328J26l464l028k07J342
$$ -2333 2018 459 -2174 -308 2571 5025 7087 7051 5388 1911 5239 5365 1901 -1127 -1334 8
5006Hk350J818J488M72j104j968K406q05m97J122p82K643J070l51m212k064K233
$$ 8 -2342 -524 964 1436 332 -1636 770 -35 -532 590 -192 2451 3521 3170 -1042 -3106 -873
4989h73J488q18K229K978j836j252J560N99k831L68n52K454J485p82k743k971
$$ -873 615 -203 2026 5004 3168 1916 3476 4075 1244 1612 1060 3514 4999 4217 1474 -1497
4973a497j192l442j219L909L299M058j945J352J616k413k367N49m80J484o27m26
$$ -1497 -2689 -6131 -7350 -3441 -142 3916 1971 3323 4939 2526 159 708 228 1712 1085 659
4957F59j190Q40j793r38o03K591N48l86j394k48P53M18N5k96o88l86q58L308J327
$$ 659 -531 309 -1484 -2422 -3025 -434 114 -272 -1666 -1914 -1161 -743 -688 -984 -1672 -2058 -2916 392 1719
4938A719J24k777j307N38P74j311L097N0M557J446l592M53K944l61l532J151r37
$$ 1719 1843 -934 -2241 -1703 -929 -2240 857 907 5464 6910 3318 3771 6715 6354 2822 3973 3036
4921C036k544J666k54L441J289j854j88q2P31K570l705l907j609M74P74O89J751
$$ 3036 492 2158 1904 5345 6634 4780 4592 4510 5241 7811 4106 199 -1410 -936 -162 527 2278
4904B278j637q97J448j499p54m612K810O728K264O91j228l127j233j265k51j796
$$ 2278 641 -256 1192 -307 -1061 -5673 -2863 3865 6129 6820 5592 2465 1232 -33 -284 -2080
4888b080m0J878M637K06k61j270k623j950k160O64L552L314j571p14N83n159k114
$$ -2080 -2120 -242 4395 4601 4340 3070 447 -1503 -3663 -2999 553 3867 2296 1582 2165 -2994 -5108
4871e108J345L048j267n78R75r94R97j83j743K284Q36k873j124k8Q93K089lj299
$$ -5108 -3763 -715 -1982 -2560 -1585 -2579 -1582 -1765 -3508 -1224 -388 -3261 -4385 -4413 -3520 -1431 -1434 -2733
4853b733j006K082M25J731j526P84J402l27o25j922l353l89M29K462J040M99J386
$$ -2733 -3739 -1657 -1232 499 -1027 -243 1159 832 207 -1715 -5068 -5457 -5028 -2566 -1526 -1027 359
4836C59n09k019L361K462j586K84j34K296Q59k480k002j093k38K071J491j258
$$ 359 -150 -2169 1192 3654 2068 2352 2218 4514 5373 2893 891 -202 -440 1631 3122 1864
4820A864k962k993K684J168j621j991m246r25K561N59K929K905j515K64k606r48
$$ 1864 -1098 -4091 -1407 -239 -1860 -3851 -8097 -9022 -6461 -5902 -2973 -68 -1583 -1319 -3925 -4873
4804d873K415J165K151j528m451L703J784k676j099m51K576N16M251J757l389
$$ -4873 -2458 -1293 858 -670 -5121 -1418 366 -2310 -3409 -3860 -1284 -768 3483 5240 1851
4789A851l468K598K443K072l436j222R20p35j376l732j789J833N35J969K765o79
$$ 1851 -1617 981 3424 5496 2060 838 1758 1023 -353 -4085 -5874 -4041 -3506 -1537 1228 549
4773E49o55K913J749o30j456K93M916n24l653n27N13j91Q9r77p08K391p56k120
$$ 549 -106 2807 4556 3926 2470 2763 7679 7155 3502 2975 3488 3297 3386 2409 1701 4092 3336 1216
4755A216J837l42j187J569j98m67j630k501P24J138p34K090L244k101N7O71k385
$$ 1216 3053 2711 1524 3093 2895 2428 798 -1703 -979 159 -575 1515 4759 2658 2715 3386 1001
4738A001m954L87J461j367J95R32J197Q11J823K381q6k046R86L093J530k222k073
$$ 1001 -3953 -3566 -2105 -3472 -3277 -2345 -1148 -337 1486 3867 3781 1735 2721 5814 7344 5122 3049
4721C049k432K14k35M045k38p78k143m455MM33K45l36J004J781L07J099K711J708
$$ 3049 617 831 596 4641 4403 3625 1482 -2973 -2969 -2536 -2291 -2627 -1623 158 465 1564 4275 5983
4703E983P00k892l322L424R09j111J024j142k938m08p71K420k451j069l202K547
$$ 5983 6683 3791 469 3893 4802 3691 4715 3573 635 227 -544 1876 -575 -1644 -4846 -2299
4687b299M820J720J669L666L40k173O26l86p562k566L599j13m246K164N204M356
$$ -2299 2521 4241 5910 9576 9916 7743 8369 7983 421 -2145 1454 1341 -2905 -741 4463 8819
4671H819K465m511k020P28j323R56K5L89J234k252j432O99J38J264j827l809k370
$$ 8819 11284 6773 4753 5481 4158 5114 5139 5528 6762 4510 3078 3777 3915 5179 3352 -457 -2827
4654b827J959L850j886j114j527K024Q14J826P36k61l04j887K16k90P09l584O18
$$ -2827 -868 2982 1096 -18 -1545 479 1293 3119 3855 3594 3290 1403 1619 1329 2038 -1546 -928
4637i28L207r01j468j867m99j081N57J431j80K06K226J183R30r70j593N06k334
$$ -928 2279 1378 -90 -1957 -2456 -3537 -2980 -1549 -1729 -1523 703 1886 2816 1846 253 759 -1575
4620a575J144l944K7K168J047O48p79r34m04M118L772K872n71k301k994P15m15
$$ -1575 -431 -4375 -4348 -2180 -1133 -485 -1264 -2198 -2602 1516 5288 8160 7589 5288 2294 3009 2594
4603B594k454j049j360M364K389L55N11l542n670n48K691K093J632J128j035k414
$$ 2594 140 -909 -2269 2095 4484 4839 5350 1808 -3862 -4410 -1719 374 2006 3134 2099 -315
4587c15J941k294J020L161K602J103q83rk308j050J562N18K264j378o90l135n31
$$ -315 1626 -668 352 3513 6115 7218 6335 6326 4018 2968 4530 5048 7312 5934 5244 2109 1578
4570A578L45J014j725j058N77k967q18K563J573J420n95j128K934J968P36l53
$$ 1578 1923 2937 1212 154 731 -2236 -3054 -491 1082 2502 1907 779 3713 5681 6417 6064
4554F064j77k199k259L9J462J964J089k974l279J299L63k058L8p37M70J240n35
$$ 6064 5887 3688 1429 1468 2930 4894 5983 3009 -270 1029 1392 -666 -628 -1365 -895 345 -190
4537a90l156j780k491j305L401L677j655l171J877J666K613J848L194k374k780
$$ -190 -3346 -5126 -7617 -8922 -5521 -1844 -3499 -6670 -4793 -3127 -514 1334 4528 2154 -626
4522f26j783j7R25M226L127l31l371k477r63K261J509m024k433M475L861l411
$$ -626 -2409 -2426 -1501 2725 5852 5521 2150 -327 -1290 971 2480 -1544 -3977 498 4359 948
4506I48o79K013j121j52n61J941p4m565J26K290p10k718k20J77O07k710J120K186
$$ 948 269 2282 1161 1009 448 2389 2315 -2250 -2124 166 -544 -3262 -3482 -3305 -2698 -5408 -4288 -2102
4488b102j932k46J504J631K426K922P72J296N95k29j397r55k848l773J010n58
$$ -2102 -4034 -4280 -2776 -1145 1281 4203 4975 6271 6866 6637 5240 4285 1437 -2336 -1326 -1884
4472a884J102N043j19J765P23l598k556k785L116J889Q76j877o6L791J258m079
$$ -1884 -782 4261 4142 5907 6630 3032 476 -2309 807 2696 3572 1695 1629 5420 6678 2599
4456B599k404p66J349j980m189P55J059O51j63P28J257M95J987j716L11j236l645
$$ 2599 195 -571 778 -1202 -5391 -4636 -3577 -2926 -3089 -2361 -1104 -609 1378 -338 -27 -1263 -4908
4439d908j601J820J389K600J319K397L056ll871o04j720Q75j512K486J698o36
$$ -4908 -6509 -4689 -3300 -700 619 3016 6072 6069 2198 1594 -126 749 -763 1723 3421 2785
4423B785m54j842k440M144L020k868k678K273J114K1K730j701l76P52N77l321
$$ 2785 2331 489 -1951 2193 5213 2345 -333 1940 3054 3075 5805 4104 3728 4480 5057 1736
4407A736k078j034k610O41L208J110N07K36J821N78J697K20m354J988m51j975
$$ 1736 -342 -1376 -3986 -3345 -137 973 1480 1716 3537 4115 5812 6032 1678 3666 3215 1240
4391A240l213k285J699M967K856K869R31j925r29k867k094n62J100k538j883j333
$$ 1240 -1973 -4258 -2559 2408 5264 8133 9064 7139 6210 3343 1249 687 1787 -751 -2634 -3967
4375c967L13K110J501j313J976j54k029j354j887K230M454O22m180j373O18j185
$$ -3967 -3654 -1544 -43 -1356 620 466 -1563 -2917 -4804 -2574 1880 2502 -1678 -3051 -2433 -3618
4359c618M065K690J864J060L53k744R8j493q72L65j410K056K381q60p84J63j786
$$ -3618 447 3137 5001 6061 6414 3670 3768 2275 1403 1768 358 2414 4795 3935 3151 3314 1528
4342A528R36K685k421m41O8J304j572r60k53M317K30k4k635l347K589M889L052
$$ 1528 2464 5149 2728 2287 2355 3659 2087 1127 874 5191 5421 5397 2762 -585 2004 6893 9945
4325I945k328m161p65J397L322R87k534m524M84L38j512m06R28K341N87n70l825
$$ 9945 7617 3456 2691 4088 7410 8397 5863 1339 1823 2161 649 243 1171 3512 4099 3529 -296
4308b96M62J528K38R04j742j528j553L32Q52R14K03j962k041K664M09r20j531
$$ -296 166 1694 1932 2836 1094 -434 -1987 -1655 -803 111 314 -1648 -3689 -1025 -616 -1536 -3067
4291c067r07J146j349M30Q3N178L432L91l423q09O04L701N22j220K0L47K733o69
$$ -3067 -3974 -2828 -4177 -3747 -3664 1514 4946 5337 1914 1105 1709 5410 5932 4712 4732 5079 7812 7143
4273G143j175j265l554l21j181o80R06M398J080m330o16L308m000m756j624J84
$$ 7143 5968 4703 1149 828 -353 -1033 -127 4271 5351 1021 405 3713 -287 -5043 -6667 -6483
4257f483j126P36m88J937R70K688L415j906p04O42L58J251N81L94K226r58r77
$$ -6483 -7609 -6873 -7361 -5424 -4454 -1766 1649 -257 -961 -319 39 1290 1871 2265 4491 3533 2556
4240B556k31j165l17K390n51k634J776K18P0m94l0L452j330j631n68j254K037
$$ 2556 2325 1160 843 3233 2682 48 1824 2042 2112 1618 1588 5040 3710 2079 1511 257 2294
4223B294J011l3K04n8j210j255j696j246N49L472r2j598l79J55K46L578j14P00
$$ 2294 3305 3272 3476 3418 2208 953 -743 -1989 -1440 2032 1940 342 -37 118 364 3942 3828 4528
4205D528r38r39P70j20P78l973k641j140L352J620q62K843K660j981J097N359
$$ 4528 3590 2651 3421 3301 4079 106 -2535 -3675 -323 1297 435 3278 5938 3957 5054 10413
4189A0413j022o293m464K836m45o35Oj215j802j631j539J158N593K018j143J116
$$ 10413 9391 3098 -1366 1470 1025 390 396 -819 -2621 -4252 -5791 -4633 960 2978 1835 2951
4173B951k697j976P63L536O41J02N8O44M25k593k487O59O10k417J050j190Q31
$$ 2951 254 -1722 -959 2577 3218 3320 3378 4022 4447 1854 -633 26 636 -1781 -731 -1921 -1090
4156a090M57K209r51l595Q16J765K417j269J387j207m324K178k509K03n52k560
$$ -1090 -633 1576 625 -2970 -2154 -389 2028 759 2146 939 -3385 -1207 -3716 -3513 -4065 -6625
4140f625p64L678K485N01M5L130J118n38l387K425P04k204l183j408J711K5N07
$$ -6625 -7389 -3711 -1226 -725 -680 2450 3568 3030 -357 2068 2772 568 -2615 -4023 -2312 -2287 -1780
4123a780R40K304r64n90q75j948K280K205l6O48J275P75K357j152j077j106J486
$$ -1780 -840 1464 500 -90 -965 -2913 -633 1572 1536 2184 3459 4234 6591 5439 4362 3256 4742
4106D742j08k914l487L33k188o04L292P55m26M50j259l3k274J890J318j070J135
$$ 4742 4634 1720 -1767 -1434 -3622 -4226 -934 -179 -605 -155 -1414 -1447 -3721 -1831 -513 -1583 -448
4089d48J529l67L135l753l792l758M042K722J937J098p30J39j308l515k903K570
$$ -448 1081 714 3849 96 -3696 -7454 -3412 -690 1247 2345 1615 1754 446 -3069 -5972 -3402
4073c402J35Q08K61J704L605j127J801L121j156j492j507m85K548J844l491p20
$$ -3402 -3267 -2459 -2198 -494 3111 1984 3785 6906 5750 4258 2751 2266 4814 6658 3167 2447
4057B447K158K840J099k630j821n261k635K131l05K004L694n03j109k215n55K151
$$ 2447 4605 7445 8544 5914 4093 -1168 -3803 -1672 -1977 27 3721 3218 2109 -106 -661 1490
4041A490k01j389L243J691l362j277o31N84j312j308L459K518j61k165r82p32
$$ 1490 1289 -100 3143 4834 1472 195 -436 148 -1164 -2472 987 3505 3344 1179 197 -535
4025e35O59j163l76m98N78K003j811J543J965k216L91l75r28K143K692j582l585
$$ -535 124 -1039 -1415 -1913 -1335 668 -1143 400 2365 149 540 165 -763 1380 4072 2490 -1095
4008a095O692L264k372j25j543q18o58l216M67K704k040l94j581Q88O67k637N53
$$ -1095 5597 8861 6489 6364 4821 4003 3345 129 596 3300 1260 866 -715 173 840 -1797 -1244
3991a244J609L478l02m791N60L877j317j0k361K095L84M07L13o76k906j335L980
$$ -1244 365 3843 3541 -1250 -690 3187 1870 1860 -501 1594 1978 2385 2698 2022 -884 -2219 1761
3974A761N094j128M5J275k870j476K108L199K761k617l922j528l27L45K72r48
$$ 1761 6855 5727 5772 7047 4177 2701 4809 8008 10769 8152 4230 2702 2375 2720 2992 2044
3958B044j475p73J253J569J077L52K162k066j781K64m52K29K639l065j661m147
$$ 2044 569 -204 1049 2618 3695 4047 6209 4143 2362 2626 2174 2403 5042 1977 316 -3831
3942c831l64J880O34O60k3q71J425L53J286N34k565j094N25K407p47O28k763l357
$$ -3831 -4195 -2315 -1681 -1021 -1044 -1915 -490 -137 1149 1683 -882 -1976 -1451 956 209 837 -1926 -5283
3924e283j360J463K855J905K956l867m804J818M074J042r35J584J565k0J056K623
$$ -5283 -6643 -5180 -2325 -420 2536 -1331 -6135 -4317 -243 799 -136 1448 3013 2993 4049 6672
3908F672J698J086L48n94l838m327j845k229p38K446K326J058k267M045J43r32
$$ 6672 8370 9456 9804 9210 5372 1045 -800 -3029 -3767 -1321 1005 2063 -204 3841 3984 3052
3892C052Q07K023l46j383%j216k465k723J010J670K918K147k857j463N74J488
$$ 3052 3859 5882 5536 4153 4153 2937 472 -2251 -1241 429 3347 5494 2637 1174 1748 3236
3876C236j026l324k483K016L958J954j532j385j069j809k182K481k77L185J751
$$ 3236 2210 -1114 -3597 -1581 2377 4331 2799 1414 345 -1464 -3646 -1165 -1442 1743 3494
3861C494n360j318L839N203K73k145n66k876J351M681K58k751L239J88l415K9
$$ 3494 -1866 -3184 655 5858 6131 3986 3420 544 1895 6576 6834 4083 7322 7510 4095 4124
3845D124j043k673j358L455M729j140j979L513j665o28p81o432p73K804J422l450
$$ 4124 3081 408 -950 2505 7234 6094 4115 7628 5963 5335 4554 -1878 -2651 153 1575 -1875
3829a875O86j15j162K276k8O48J331q87J045j516k340M023J913q11N60J522J656
$$ -1875 -1189 -1304 -2466 -190 -218 430 1761 874 1919 403 -1937 2086 3999 3188 3748 5270 6926
3812F926J247l031p41m042r46n5m1k192j355J199J440L758m38o33L547J981k101
$$ 6926 8173 5142 4401 359 -587 -642 -683 -2875 -4230 -3031 -1591 2167 1729 1096 4643 6624 4523
3795D523r86K951K333k576m496m412P42N786L472j07l135r38Q3k589N53o97j081
$$ 4523 3537 6488 8821 6245 1749 -2663 -1921 3865 7337 7230 4095 3157 3240 651 1204 507 -574
3778e74L78J950K96M164K312l054l462j372K92J270j263k422K040J217K085j297
$$ -574 -196 1754 2050 6214 8526 5472 2010 638 930 2200 937 -1485 555 1772 3857 2560
3762B560j057k270k053j001M539J054j342K15j951n78J128J467J147k90Q37q1
$$ 2560 1503 -767 -2820 -3821 718 1772 430 645 -1306 -1884 -756 711 1858 1568 2405 2324
3746B324j527l79k374J144n05J871j776j170L183l597Q34L411L197P24n896o93
$$ 2324 797 418 -1956 -812 -1317 554 -1222 -2392 791 -2806 -1972 1439 4636 5360 -536 -1229
3730a229k27J961L053k566l915k93M525j21k944J390J146J116k073j247n21J803
$$ -1229 -1456 505 3558 992 -2923 -3216 1309 1188 -1756 -366 780 1896 -177 -1424 -1945 -142
3714a42j353J439N56j425R56K095J575j423l770l056r5M639O78J892L37k129K976
$$ -142 -1495 -56 500 -925 31 2126 3701 2278 -1492 -4548 -4643 -4 674 2566 2903 774 3750
3697C750Pk211L7Q08j113J723l37k827r4L383j365j600O486J04k627k94O89K266
$$ 3750 3757 1546 1583 2391 1278 3001 2664 -163 -257 3126 1761 161 6647 6751 4124 3830 4519 6785
3679F785k79j487J89l262l100O33j558L213j607k152m25J057l342k95M232O78
$$ 6785 6506 5019 5208 1946 -1154 -521 -2079 1134 -473 -2625 -3050 -1993 -5335 -5630 -1398 -720
3663g20M51L181O55l038k243P136R45j785l91j693j156j025J64R49K031p21K11
$$ -720 -269 2912 3567 529 -1714 5422 6367 4582 4191 2498 1342 317 481 1430 3461 2740 2951
3646B951k385l98j189k15m04M811K696P22J095j140j543l478j303M171n65m566
$$ 2951 566 168 -1021 -1236 -1640 3171 5867 6589 7684 6544 5001 1523 220 4391 3826 -740
3630g40j152j33J472K701J423m089K80O88J60o31m460o21L33K199Q61l69l61L178
$$ -740 -1892 -2025 -553 2148 3571 -518 -238 450 610 -21 -4481 -5102 -4769 -2570 -1709 -2078 -2439 739
3612G39L41q97k90P18J453j757n51l317j258M284o19j666m6k134k035L368m4J272
$$ 739 1080 183 -107 611 2064 307 -244 -3561 -4819 -535 -1154 -2820 -2866 -5000 -7035 -3667 -3711 -2439
3594b439J699r78P01J370L40M52k457J323J554L48J84n65j763q14Q68R99N76P53
$$ -2439 -740 -1718 -1017 353 693 1145 -1312 11 1565 1913 2097 1532 -231 -1045 -177 822 1398 2151
3576B151M75r54L8J130N85P5l331k471j634m56k676P67L364N445r31m03j020j123
$$ 2151 2626 1672 1710 2840 3425 3500 169 -2302 -3936 -4392 -7068 -6301 -2937 2508 1577 1174 154 -969
3558i69l08j605K126J039j744L310K443J689K134J051j628l323l354p28N221J826
$$ -969 -1277 -2882 -756 283 -1461 1849 4292 5981 8115 9166 7538 4215 861 133 5354 7180
3542G180k718l979J13P2j123K191L210P17k466j420j769j248J519n71P48n62J630
$$ 7180 4462 483 596 668 -455 1736 4946 5663 3197 1777 8 -1240 279 -292 456 -106 1524
3525A524K071l089j85j018J69L029k97k030o61j480J054j307j440L694K877q38
$$ 1524 3595 506 321 -697 -528 2501 2204 174 -487 -1967 -913 -2220 -3660 34 2911 2073
3509B073J394j231j540R97J702j537l593J152L592l10L34L44k068P74K093J031
$$ 2073 3467 2236 696 1693 3395 1858 -1735 -583 3009 2699 3033 3377 1309 2083 4176 5207
3493E207j972N10k678l470M32K488J820J643J2L570j907k912p80j762p47L967
$$ 5207 3235 3745 1067 -2403 -1971 517 2337 3980 3992 7562 5655 2743 1963 201 -546 3421
3477C421J120k171%j266j69j40j547j301l629j298K558J551k038l14J324M255
$$ 3421 4541 2370 2370 1104 935 795 -752 -2053 -5682 -6980 -4422 -2871 -4909 -5223 -3899 356
3461C56k717j395J854P15O82J643j99j730J289J625PL99Q93P52OJ83o796k000
$$ 356 -2361 -3756 -1902 -1187 -505 1138 939 -791 498 2123 2130 2529 3422 4174 4180 4363 -2433 -4433
3443d433j02Q33j365o41K976o1j427K209O99r45M49l8P29L704l155p79l21J713
$$ -4433 -4535 -3702 -5067 -5708 -2732 -2793 -4220 -2011 -1312 -2257 -1808 -1846 -1117 2587 -568 -1347 -1668 45
3425D5p7k98K043J707k26J839j142j553l672k068J065K830O9k013J449J128j311
$$ 45 -32 -330 1713 3420 3194 5033 3891 2338 -1334 -3402 -2337 493 562 -1451 -2 1126 -185
3408a85L575Q83k387P47K179q68j231k331M19j968n54K181j495K696r0k082J346
$$ -185 3390 4273 1886 2633 4812 3944 2713 382 801 -1167 -1721 460 -1035 1661 1571 -511 835
3391H35L41L0J572j087j398m71M347q58m256j525J799j018K45J351L142j234O88
$$ 835 1176 1206 2778 1691 293 -178 4169 3311 -945 -2470 -671 -1689 -1444 -93 3049 1815 2503
3374B503J614j327P70K07O01k483m078j555K764j106J448K747o44j314K431K745
$$ 2503 4117 2790 3560 3767 4368 1885 -2193 -3748 -984 -2090 -642 2105 1461 147 2578 5323
3358E323J76m121O63j748J061J532m90J613P02K980l367l965k435K428M142K268
$$ 5323 5499 1378 2041 293 1354 2886 2396 4009 4711 7691 4324 359 -2076 352 4494 6762
3342F762J90p39j854o5R24J168o83j4k179k522j4N63k459j622j548J871J245k83
$$ 6762 6952 6213 4359 4294 5218 6386 5703 5689 3510 988 974 1537 -922 -2544 -4092 -2221 -976 -1259
3324a259j548k118R39K979K458K71k32J173J674l5m814j577J165K988L991o42
$$ -1259 -2807 -4925 -3986 -1007 1451 1722 1490 2663 4337 4302 -512 -2089 -924 2064 6055 5413
3308E413k842O49L646n53j071j502k008k139k479N34k48j687l98M29L029K75L005
$$ 5413 2571 3220 6866 6313 5242 3740 1732 -407 -2886 -2352 -2600 -4287 -4685 -4256 -1227 -952 2053
3291B053J120Q41j248k222k205J275M21O72Q68K432J879l981k629k655j721J336
$$ 2053 3173 4014 2766 544 -1661 -386 35 707 1575 4007 5886 1905 -724 -3379 -5100 -3764
3275c764L96J159L359j262J530j39M36j42O97j318q18l372n5K210m2J937J036
$$ -3764 -3368 -2209 1150 -112 1418 1279 1715 1573 2270 952 134 -3238 -3293 -1083 -1125 812 1848
3258A848k267Q21N57m489K21Q78M946J543k482k186m249J808M517J350m449O25
$$ 1848 -419 402 959 -3530 -3309 -2431 2515 4058 1576 -610 -4859 -3051 1466 2816 -1633 -1008
3242a008k41j186j951J970L787O06j199j981R78j30J214r76J87r71J59J697K087
$$ -1008 -1249 -2435 -4386 -2416 1371 1977 778 -1203 -225 -355 859 -117 70 -901 -742 955 3042
3225C042J524J514J75K30r24R18q21k821k273J64K374L12k040L171K34k861j807
$$ 3042 4566 6080 6255 6485 5561 6479 5658 2837 564 728 3102 3414 1374 4545 4779 1918 111
3208A11O47j702O98J656K412M46n300o202J095N086K11J34M04Q70N36J173k931
$$ 111 758 -944 -246 1410 3822 4268 -1032 -7234 -6139 -1053 -842 -708 -304 566 1102 2275 -656
3191f56j828l98J547m67r07l919K849O118L417J48r71O07J203l631l649J149N65
$$ -656 -2484 -2882 -1335 -1802 -2709 -6628 -3779 2339 5756 5904 4933 5540 6743 3112 -537 612 1177
3174A177M076J968j135n268J17K422M320k228k844m21k135p79K841J937n64k708
$$ 1177 5253 7221 6086 818 935 3357 7677 5449 2605 2184 49 -730 2111 4048 3484 776
3158G76l471q37J926K207j737j53l109k74J65K879J531J737J51J517j622N13q0
$$ 776 -2695 -3532 -1606 601 -1136 -1289 -4398 -4672 -4507 -1628 -97 1640 1791 3308 1686 2199 2119
3141B119o79J092K60J428l004k590R75k032n62J243J47Q95Q79K609M570L10m667
$$ 2119 1440 2532 2792 4220 1216 -1374 -399 -2431 -2993 -1750 -1603 -708 171 2780 7350 7660 2993
3124B993j006K625K87J274Q8Q90l30n006q25J487R91J042J647j90n08j816j437
$$ 2993 1987 4612 4899 6173 6261 7151 6821 1815 990 2477 3468 4510 6157 5967 5459 3643 2206
3107B206N23K872K261n251K037J760o10k235K092q6k811m582N72O55r77L537L669
$$ 2206 2729 5601 7862 2611 4648 6408 5798 3563 5655 5569 2758 -1824 -1252 -597 -1574 1963 5632
3090E632l31j13r43r42K823k29l531J26Q67K321J09o95K613l618l287J576P26
$$ 5632 5301 5188 4245 3303 6126 5897 2366 2492 3359 5680 5789 5094 7707 4089 802 2378 3104
3073C104N78o98l731j004M47J33o27J253k39j530q19P27J444j87j41o54K202L660
$$ 3104 3682 2984 -747 -1751 -1304 -1171 -1798 -545 -784 -2314 -3133 -2406 -962 -1149 -1290 -1944 258 3918
3055C918N99J162K968k229l314J231J517r26p27j211p63j145k67j286l426J13
$$ 3918 4517 5679 8647 6418 3104 4335 5852 4926 4199 2988 2225 1080 813 -473 -3899 -3786
3039c786Q52l95p10J856L190L79P21R36j264k381m007n89R53n04N061P92j004
$$ -3786 -2934 -3329 -4039 -2183 1007 1386 2107 3043 1779 -602 -4609 -5198 -4245 -4749 312 1104 100
3022A00K560J869k958j040r1J687J018p50k985R61J951K02j823k81k253r28M135
$$ 100 2660 4529 1571 531 440 2127 3145 2395 -590 371 2322 2524 701 420 -1833 -2761 1374
3005A374R05k392j08q5j360J659J726P04n68J076l87K108j272k93J185j681N26
$$ 1374 2279 -113 -221 -306 -1666 -7 1719 2423 1855 2931 2544 4652 3380 3087 4272 2591 3117
$$ [...]
##END NTUPLES=NMR SPECTRUM
##END=
