##TITLE=Analysis number 327667
Compound Code sew 02560
Book Reference 226770
Project Code adrs flro3
Chemist Name jom
##JCAMPDX= 6.0         $$ Bruker NMR JCAMP-DX V2.0
##DATA TYPE= NMR SPECTRUM
##DATA CLASS= NTUPLES
##ORIGIN= Bruker BioSpin GmbH
##OWNER= nmr
$$ XWIN-NMR		Version 3.5
$$ Fri Mar 30 08:44:16 2007 GMT Daylight Time (UT+1h)  MAYBRIDGE\nmr@NMR_250MHZ
##.OBSERVE FREQUENCY= 250.131544655141
##.OBSERVE NUCLEUS= ^1H
##.ACQUISITION MODE= SIMULTANEOUS (DQD)
##.ACQUISITION SCHEME= undefined
##.AVERAGES= 16
##.DIGITISER RES= 18
##SPECTROMETER/DATA SYSTEM= dpx250
##.PULSE SEQUENCE= zg30
##.SOLVENT NAME= CDCl3
##.SHIFT REFERENCE= (INTERNAL, CDCl3, 0, 16.522)
##AUDIT TRAIL= $$ (NUMBER, WHEN, WHO, WHERE, WHAT)
$$ ##TITLE= Audit trail, XWIN-NMR		Version 3.5
$$ ##JCAMPDX= 5.01
$$ ##ORIGIN= Bruker BioSpin GmbH
$$ ##OWNER= nmr
$$ C:\u/data/dgb/nmr/ADRS/2640/pdata/1/auditp.txt
$$ ##AUDIT TRAIL=  $$ (NUMBER, WHEN, WHO, WHERE, WHAT)
(   1,<2007-03-30 08:43:30.21 +100>,<MAYBRIDGE\nmr>,<NMR_250MHZ>,
      <created by zg, POWCHK disabled, PULCHK disabled
       configuration hash MD5:
       49 4B E0 1D 92 C2 6B 37 9F E6 65 BC 52 41 86 1D
       data hash MD5: 64K
       60 2F D9 92 00 47 B4 1F FB D7 95 9A 6B 25 79 94>)
(   2,<2007-03-30 08:43:50.79 +100>,<MAYBRIDGE\nmr>,<NMR_250MHZ>,
      <Start of raw data processing
       ef LB = 0.3 FT_mod = 6 PKNL = 1 SI = 32K 
       data hash MD5: 32K
       6B FD CA B4 51 EA CD 90 6C 39 32 96 AD 9B D3 ED>)
(   3,<2007-03-30 08:43:56.31 +100>,<MAYBRIDGE\nmr>,<NMR_250MHZ>,
      <apk 
       data hash MD5: 32K
       47 74 31 B8 4E 85 6D 07 34 97 7C A1 86 E0 A7 D0>)
(   4,<2007-03-30 08:43:57.68 +100>,<MAYBRIDGE\nmr>,<NMR_250MHZ>,
      <abs ABSG = 5 
       data hash MD5: 32K
       CA D1 BD D0 BA 49 34 FA 8C 1B E2 6D 32 3F 1C 01>)
$$ ##END=
$$ 
$$ hash MD5
$$ F1 DE 0A 08 5A 5C F0 54 20 69 10 D8 AD 7B B3 54
##$RELAX= 
##$RELAX= 
##$RELAX= 
##$RELAX= 
##$RELAX= 
##$RELAX= 
##$RELAX= 
$$ Bruker specific parameters
$$ --------------------------
##$DU= <C:\u>
##$EXPNO= 2640
##$NAME= <ADRS>
##$PROCNO= 1
##$TYPE= <nmr>
##$USER= <dgb>
##$AMP= (0..31)
100 100 100 100 100 100 100 100 100 100 100 100 100 100 100 100 100 100 
100 100 100 100 100 100 100 100 100 100 100 100 100 100 
##$AQSEQ= 0
##$AQ_mod= 3
##$AUNM= <au_zg>
##$AUTOPOS= <42 >
##$BF1= 250.13
##$BF2= 250.13
##$BF3= 250.13
##$BF4= 250.13
##$BF5= 500.13
##$BF6= 500.13
##$BF7= 500.13
##$BF8= 500.13
##$BYTORDA= 1
##$CFDGTYP= 0
##$CFRGTYP= 5
##$CHEMSTR= <none>
##$CNST= (0..31)
1 1 145 1 1 1 1 1 1 1 1 1 1 1 1 1 1 1 1 1 1 1 1 1 1 1 1 1 1 1 1 1 
##$CPDPRG= <>
##$CPDPRG1= <>
##$CPDPRG2= <>
##$CPDPRG3= <>
##$CPDPRG4= <mlev>
##$CPDPRG5= <mlev>
##$CPDPRG6= <mlev>
##$CPDPRG7= <mlev>
##$CPDPRG8= <mlev>
##$CPDPRGB= <>
##$CPDPRGT= <>
##$D= (0..31)
0 1 0 0 0 0 0 0 0 0.06 0 0 0 0 0 0 0.0002 0 0 0 0 0 0 0 0 0 0 0 0 0 0 
0 
##$DATE= 1175240607
##$DBL= (0..7)
120 120 120 120 120 120 120 120 
##$DBP= (0..7)
150 150 150 150 150 150 150 150 
##$DBP07= 0
##$DBPNAM0= <>
##$DBPNAM1= <>
$$ [...]
##$SUBNAM7= <"">
##$SUBNAM8= <"">
##$SUBNAM9= <"">
##$SW= 20.6930455092707
##$SWIBOX= (0..15)
0 0 3 0 0 0 0 0 0 0 0 0 0 0 0 0 
##$SW_h= 5175.983436853
##$TD= 65536
##$TD0= 1
##$TE= 683.16
##$TE2= 300
##$TE3= 300
##$TEG= 300
##$TL= (0..7)
0 120 120 120 120 120 120 120 
##$TP= (0..7)
150 150 150 150 150 150 150 150 
##$TP07= 0
##$TPNAME0= <>
##$TPNAME1= <>
##$TPNAME2= <>
##$TPNAME3= <>
##$TPNAME4= <>
##$TPNAME5= <>
##$TPNAME6= <>
##$TPNAME7= <>
##$TPOAL= (0..7)
0.5 0.5 0.5 0.5 0.5 0.5 0.5 0.5 
##$TPOFFS= (0..7)
0 0 0 0 0 0 0 0 
##$TUNHIN= 0
##$TUNHOUT= 0
##$TUNXOUT= 0
##$USERA1= <user>
##$USERA2= <user>
##$USERA3= <user>
##$USERA4= <user>
##$USERA5= <user>
##$V9= 5
##$VALIST= <valist>
##$VCLIST= <CCCCCCCCCCCCCCC>
##$VD= 0
##$VDLIST= <DDDDDDDDDDDDDDD>
##$VPLIST= <PPPPPPPPPPPPPPP>
##$VTLIST= <TTTTTTTTTTTTTTT>
##$WBST= 1024
##$WBSW= 4
##$XGAIN= (0..3)
0 0 0 0 
##$XL= 0
##$YL= 0
##$YMAX_a= 400232
##$YMIN_a= -505719
##$ZGOPTNS= <>
##$ZL1= 120
##$ZL2= 120
##$ZL3= 120
##$ZL4= 120
##$ABSF1= 16.522
##$ABSF2= -4.171173
##$ABSG= 5
##$ABSL= 3
##$ALPHA= 0
##$AQORDER= 0
##$ASSFAC= 0
##$ASSFACI= 0
##$ASSFACX= 0
##$ASSWID= 0
##$AUNMP= <proc_1d>
##$AZFE= 0.1
##$AZFW= 0.1
##$BCFW= 0
##$BC_mod= 0
##$BYTORDP= 0
##$COROFFS= 0
##$CY= 12.5
##$DATMOD= 1
##$DC= 0
##$DFILT= <>
##$DTYPP= 0
##$F1P= 14.0000005364418
##$F2P= -0.99999901652339
##$FCOR= 0.5
##$FTSIZE= 32768
##$FT_mod= 6
##$GAMMA= 0
##$GB= 0
##$INTBC= 1
##$INTSCL= 1
##$ISEN= 128
##$LB= 0.3
##$LEV0= 0
##$LPBIN= 0
##$MAXI= 10000
##$MC2= 0
##$MEAN= 0
##$ME_mod= 0
##$MI= 0
##$NCOEF= 0
##$NC_proc= -4
##$NLEV= 6
##$NOISF1= 0
##$NOISF2= 0
##$NSP= 0
##$NTH_PI= 0
##$NZP= 0
##$OFFSET= 16.522
##$PC= 1
##$PHC0= 224.7004
##$PHC1= 20.85632
##$PH_mod= 1
##$PKNL= yes
##$PPARMOD= 0
##$PSCAL= 4
##$PSIGN= 0
##$REVERSE= no
##$SF= 250.13
##$SI= 32768
##$SIGF1= 0
##$SIGF2= 0
##$SINO= 400
##$SIOLD= 32768
##$SREGLST= <1H.CDCl3>
##$SSB= 0
##$STSI= 32768
##$STSR= 0
##$SW_p= 5175.98343685301
##$SYMM= 0
##$S_DEV= 0
##$TDeff= 65536
##$TDoff= 0
##$TI= <Analysis number 999999
Compound Code 99
Book Reference 9
Project Code 9>
##$TILT= no
##$TM1= 0
##$TM2= 0
##$TOPLEV= 0
##$USERP1= <user>
##$USERP2= <user>
##$USERP3= <user>
##$USERP4= <user>
##$USERP5= <user>
##$WDW= 1
##$XDIM= 32768
##$YMAX_p= 395959247
##$YMIN_p= -302225
$$ End of Bruker specific parameters
$$ ---------------------------------
##NTUPLES= NMR SPECTRUM
##VAR_NAME=  FREQUENCY,     SPECTRUM/REAL,   SPECTRUM/IMAG
##SYMBOL=    X,             R,               I
##VAR_TYPE=  INDEPENDENT,   DEPENDENT,       DEPENDENT
##VAR_FORM=  AFFN,          ASDF,            ASDF
##VAR_DIM=   32768,         32768,           32768
##UNITS=     HZ,            ARBITRARY UNITS, ARBITRARY UNITS
##FACTOR=    0.157963299565203, 1,           1
##FIRST=     4132.6476996994, 0,             0
##LAST=      -1043.33573715361, 0,           0
##MIN=       -1043.33573715361, -302225,     0
##MAX=       4132.6476996994, 395959247,     0
$$ Real data points
##PAGE= N=1
##DATA TABLE= (X++(R..R)), XYDATA
$$ [...]
$$ plain form
23478 5359 16196 -27743 -76014 -84267 -48645 -59356 -82162 -7452 22881 40197 73594 4379
23466 4379 -92355 -94484 -58973 -53142 -64948 -88778 -60526 -538 61143 24197 70866 98462
23454 98462 61677 2317 17965 -25767 -91018 -80687 19122 93062 81471 60257 29515 -611
23442 -611 -25387 -37506 -36355 -124403 -66542 -40131 -39865 -19099 -43215 -71063 -106459 -83944 -7781
23429 -7781 27124 2284 8514 -1911 -89869 -99530 -84383 -73288 -71287 -9904 -59842 -88317
23417 -88317 -71496 -76900 -60551 -24466 4392 -8064 -62722 -87353 -127433 -131568 -69913 -32292
23405 -32292 -45395 -47809 -17042 -21586 -95954 -139503 -106691 -75453 -40705 -12353 12150 -19540
23393 -19540 -64922 -56701 -19474 3919 32475 32215 34487 73171 107611 51444 -25554 -38058
$$ packed form
23478E359J0837m3939m8271q253L5622j0711k2806P4710L0333J7316L3397o9215
23466D379r6734k129L5511N831j1806k3830K8252N9988O1681l6946M6669K7596
23454I8462l6785n9360J5648m3732o5251J0331R9809P3940j1591k1214l0742l0126
23442f11k4776j2119J151q8048N7861K6411K66K0766k4116k7848l5396K2515P6163
23429g781L4905k4840O230j0425q7958r661J5147J1095K001O1383m9938k8475
23417h8317J6821n404J6349L6085K8858j2456n4658k4631m0080m135O1655L7621
23405c2292j3103k414L0767m544p4368m3549L2812L1238L4748K8352K4503l1690
23393a9540m5382Q221L7227K3393K8556k60K272L8684L4440n6167p6998j2504
$$ plain form
23381 -38058 -40749 -7666 3869 -2072 1114 26721 23589 -31948 22349 18978 -17737 11156 10455
23368 10455 24596 45329 66116 29498 40117 -56536 -79188 -26199 -27184 -103505 -111753 -62393
23356 -62393 -104849 -123268 -107507 -128853 -135746 -118556 -63348 -10767 -24141 -28893 48292 45481
23344 45481 31158 -4129 4755 26981 -19249 -43834 -34021 -34086 -50904 -61327 -58482 -58314 -24653
23331 -24653 35696 83559 -32338 -108979 -37422 -16409 24776 20755 30601 41676 103630 47496
23319 47496 -39369 -60744 -33777 12167 20783 76589 77635 70283 62963 93135 63698 -16198
23307 -16198 -32401 -17131 -102909 -145598 -23394 76112 9147 -14398 -14230 12824 -15231 -3461
23295 -3461 -2391 -62599 -39025 -25253 -42255 -56581 -68000 -46273 8020 -5061 -42288 -8181
$$ packed form
23381c8058k691L3083J1535n941L186K5607l132n5537N4297l371l6715K8893p01
23368A0455J4141K0733K0787l6618J0619r6653k2652N2989r85p6321q248M9360
23356f2393m2456j8419J5761k1346o893J7190N5208N2581j3374m752P7185k811
23344D5481j4323l5287Q884K2226m6230k4585R813o5j6818j0423K845J68L3661
23331b4653O0349M7863j15897p6641P1557K1013M1185m021R846J1075O1954n6134
23319D7496q6865k1375K6967M5944Q616N5806J046p352p320L0172k9437p9896
23307a6198j6203J5270q5778m2689J22204R9506o6965k3545J68K7054k8055J1770
23295c461J070o0208K3574J3772j7002j4326j1419K1727N4293j3081l7227L4107
$$ plain form
23283 -8181 23721 82437 20206 -73531 -36785 -28968 -106494 -30677 15544 -21137 -11250 11408
23271 11408 24471 -48772 -28534 3507 4422 -3176 -2067 18191 65038 -34937 -83469 -49896
23259 -49896 46407 105586 110447 51666 -28334 -33796 -52972 -50510 5346 20624 10957 -6728
23247 -6728 22873 62456 56981 42861 94276 24314 -54634 -25414 34936 50696 9354 33572
23235 33572 57348 18055 56483 81145 102074 9380 14923 -35238 -55726 -79506 -50515 -52906
23223 -52906 -19918 21249 14593 34967 39794 9990 38566 -38182 -46191 -24955 -34708 -70233
23211 -70233 -41740 -50062 -88187 -76337 -73873 -51567 81931 126948 36188 -31101 -6933 25926
23199 25926 32174 10498 88811 94118 82559 43174 49157 120407 116265 74929 40645 52223
$$ packed form
23283h181L1902N8716o2231r3737L6746P817p7526P5817M6221l6681R887K2658
23271A1408J3063p3243K0238L2041R15p598J109K0258M6847r9975m8532L3573
23259d9896R6303N9179M861n8781q0000n462j9176K462N5856J5278r667j7685
23247f728K9601L9583n475j4120N1415o9962p8948K9220O0350J5760m1342K4218
23235C3572K3776l9293L8428K4662K0929r2694N543n0161k0488k3780K8991k391
23223e2906L2988M1167o656K0374M827k9804K8576p6748q009K1236r753l5525
23211g0233K8493q322l8125J1850K464K2306J33498M5017r0760o7289K4168L2859
23199B5926O248k1676P8313N307j1559l9385N983P1250m142m1336l4284J1578
$$ plain form
23187 52223 7926 -23365 -22311 31812 16140 -4900 40201 67591 110148 167708 110253 45159
23175 45159 -35698 -46168 9727 81141 129409 107370 17671 -37569 -106240 -82633 -76182 -42828
23163 -42828 -33850 37683 27064 16834 33545 53298 61326 79923 45468 20359 -24551 -58789
23151 -58789 -65895 -64348 -37606 -21922 697 19628 15104 40339 68992 -3344 -32843 -47112
23139 -47112 -80535 -35885 -59915 -56693 -46135 15557 52479 27341 -28429 -30077 -43283 -23610
23127 -23610 -24225 -14730 -10465 -3798 -45490 -24546 -44394 -7000 79470 21601 -57034 -40959 14125
23114 14125 37027 -37176 -65134 -49595 -16906 53706 53415 67674 43118 12769 -7014 -28275
23102 -28275 -79181 -116352 -164765 -155813 -124685 -5489 83739 81648 36198 73111 35648 -42123
$$ packed form
23187E2223m4297l1291J054N4123j5672k1040M5101K7390M2557N7560n7455o5094
23175D5159q0857j0470N5895P1414M8268k2039q9699n5240o8671K3607O451L3354
23163d2828Q978P1533j0619j0230J6711J9753Q028J8597l4455k5109m4910l4238
23151e8789p106J547K6742J5684K2619J8931m524K5235K8653p2336k9499j4269
23139d7112l3423M4650k4030L222J0558O1692L6922k5138n5770j648j3206J9673
23127b3610o15R495M265O667m1692K0944j9848L7394Q6470n7869p8635J6075N5084
23114A4125K2902p4203k7958J5539L2689P0612k91J4259k4556l0349j9783k1261
23102b8275n0906l7171m8413Q952L1128J19196Q9228k091m5450L6913l7463p7771
$$ plain form
23090 -42123 -63430 -10232 13170 13243 -31840 -29646 30676 31500 14393 -64040 -33715 -16179 35630
23077 35630 27888 -2507 -21780 -63923 -133359 -72203 -39243 -35366 -13854 -13554 -11826 25286 66860
23064 66860 30603 15607 5025 -16988 41991 47698 95277 60439 9749 18498 -6700 -41673
23052 -41673 -69458 -97496 -48096 44915 90221 130315 198553 102693 -23893 -94310 -100318 -60176
23040 -60176 2794 -19391 -79219 -55529 15881 32653 13598 -22707 -58915 -86056 6019 27679
23028 27679 22659 -14704 19704 -19779 -104449 -46824 26682 -18054 -30192 32604 17579 21920
23016 21920 36707 18687 3985 19156 43685 24143 -6342 19748 56654 11011 -26183 22383
23004 22383 64787 61205 72695 92025 55832 -20075 -32373 -6780 -73499 -80859 -8697 -13583
$$ packed form
23090d2123k1307N3198K3402P3m5083K194O0322Q24j7107p8433L0325J7536N1809
23077C5630p742l0395j9273m2143o9436O1156L2960L877K1512L00J728L7112M1574
23064F6860l6257j4996j0582k2013N8979N707M7579l4838n0690Q749k5198l4973
23052d1673k7785k8038M9400R3011M5306M0094O8238r5860j26586p0417o008M0142
23040f0176O2970k2185n9828K3690P1410J6772j9055l6305l6208k7141R2075K1660
23028B7679n020l7363L4408l9483q4670N7625P3506m4736j2138O2796j5025M341
23016B1920J4787j8020j4702J5171K4529j9542l0485K6090L6906m5643l7194M8566
23004B2383M2404l582J1490J9330l6193p5907j2298K5593o6719p360P2162m886
$$ plain form
22992 -13583 37359 113408 71435 4696 -17168 2015 5707 -35788 -43591 -24630 17619 49267
22980 49267 54555 26978 -17591 -78654 -84278 -99170 -55362 1725 59865 56940 55981 47098 38646
22967 38646 -7079 20446 21305 66416 66367 56424 40223 74857 73799 -43848 -89878 -9741 67223
22954 67223 125409 126200 67390 68304 109786 62179 3516 -44705 -21723 -44499 -20532 12867
22942 12867 -39655 -47418 -36322 -51829 -19058 27786 60726 50200 19552 52462 64186 60362
22930 60362 68333 44569 76596 68227 112653 29227 -148 -23925 -5332 -53823 -67501 -50864
22918 -50864 -9683 18409 -49723 -34990 -19954 27012 -20179 -37117 -1632 10011 -44044 -113663
22906 -113663 -95359 -49423 -39643 24607 6886 -49192 -68859 -82215 -33207 4402 -34056 -51341
$$ packed form
22992a3583N0942P6049m1973o6739k1864J9183L692m1495p803J8961M2249L1648
22980D9267N288k7577m4569o1063n624j4892M3808N7087N8140k925r59q883q452
22967C8646m5725K7525Q59M5111m9r943j6201L4634j058j17647m6030Q0137P6964
22954F7223N8186P91n8810R14M1482m7607n8663m8221K2982k2776K3967L3399
22942A2867n2522p763J1096j5507L2771M6844L2940j0526l0648L2910J1724l824
22930F0362P971k3764L2027q369M4426q3426k9375k3777J8593m8491j3678J6637
22918e0864M1181K8092o8132J4733J5036M6966m7191j6938L5485J1643n4055o9619
22906a13663J8304M5936R780O4250j7721n6078j9667j3356M9008L7609l8458j7285
$$ plain form
22894 -51341 -57772 -48385 -29861 -79274 -110310 -54619 -33372 -32686 -37535 -86733 -47859 16947 -19277
22881 -19277 -76810 -45035 -50518 -111379 -137406 -102603 -48296 1652 40326 48319 62442 -5064
22869 -5064 -44094 -108922 -117445 -146356 -130786 -49570 -49149 -56676 -100480 -89795 -30350 -36360 -49253
22856 -49253 -30584 -73065 -25175 -2277 16654 83891 80125 96460 81148 433 -47206 -54431
22844 -54431 -38772 18711 47299 -16141 -25479 10848 37222 152853 203637 177294 69119
22833 69119 -21699 -37636 11511 30283 100230 68394 -12834 -40256 -57342 -17266 -49996 -72378
22821 -72378 -114200 -130140 -149753 -112064 -73959 -85269 -73137 -40417 -12738 74013 63875 49503
22809 49503 36055 134273 86327 42218 32490 78597 105177 110323 81406 62824 19374 -30448
$$ packed form
22894e1341o431R387J8524m9413l1036N5691K1247O86m849m9198L8874O4806l6224
22881a9277n7533L1775n483o0861k6027L4803N4307M9948L8674P993J4123o7506
22869e064l9030o4828q523k8911J5570Q1216M21p527m3804J0685N9445o010j2893
22856d9253J8669m2481M7890K2898J8931O7237l766J6335j5312q0715m7639p225
22844e4431J5659N7483K8588o3440r338L6327K6374J15631N0784k6343j08175
22833F9119r0818j5937M9147J8772O9947l1836q1228k7422j7086M0076l2730k2382
22821g2378m1822j5940j9613L7689L8105j1310J2132L2720K7679Q6751j0138j4372
22809D9503j3448R8218m7946m4109r728M6107K6580N146k8917j8582m3450m9822
$$ plain form
22797 -30448 -51335 -59782 12412 13471 61468 81093 91690 104669 77469 68245 101200 95115
22785 95115 52069 -23619 -54050 -51011 -41378 15584 71275 67369 87963 89853 41761 24334
22773 24334 60049 47599 -18446 -32452 -74333 19900 15375 21978 -15867 12824 114522 84285
22761 84285 71378 110714 112569 105024 51970 46986 52244 92482 124156 105404 57685 -23760
22749 -23760 -32001 18022 87957 50147 12735 12668 -31704 -5936 41251 46078 22427 56916 67394
22736 67394 20033 23285 67237 110674 82862 -2628 -61499 -19087 24763 3665 -95918 -137771
22724 -137771 -140178 -91378 -50391 -41212 -57084 -39969 20365 87561 113292 158548 195407 182036
22712 182036 64059 -26902 13763 39901 45534 45035 -7545 -53863 30054 35877 14503 -81290
$$ packed form
22797c0448k0887q447P2194J059M7997J9625J0597J2979k7200r224L2955o085
22785I5115m3046p5688l0431L039R633N6962N5691l906K0594J890m8092j7427
22773B4334L5715j2450o6045j4006m1881R4233m525O603l7845K8691J01698l0237
22761H4285j2907L9336J855p545n3054m984N258M0238L1674j8752m7719q1445
22749b3760q241N0023O9935l7810l7412o7m4372K5768M7187M827k3651L4489J0478
22736F7394m7361L252M3952M3437k7812q5490n8871M2412M3850k1098r9583m1853
22724a37771k407M8800M0987R179j5872J7115O0334O7196K5731M5256L6859j3371
22712A82036j17977r0961M0665K6138N633m99n2580m6318Q3917N823k1374r5793
$$ plain form
22700 -81290 -93947 -62331 -38458 -73090 -104702 -94737 -40750 -18066 -26361 40246 59121 61643
22688 61643 40434 19893 4200 20463 43366 35265 77622 135207 131303 128187 85434 -8427
22676 -8427 -20574 28870 16062 81676 157498 200294 150760 119060 131249 133250 142366 169610
22664 169610 143907 76526 75031 113656 89028 71288 56212 63274 29085 15653 77466 67022
22652 67022 67074 30958 75583 96956 70493 20718 2690 52760 54860 28859 -3198 8462
22640 8462 50217 17416 -233 -37530 -50715 -71617 -104205 -68156 16557 43670 139242 101702
22628 101702 21561 1409 -11390 55898 61954 44091 54176 124 10942 31095 27059 10662
22616 10662 20820 33618 34861 1487 2533 -15962 -20114 5577 20910 -9368 -71431 -79840
$$ packed form
22700h1290j2657L1616K3873l4632l1612R965N3987K2684q295O6607J8875K522
22688F1643k1209k0541j5693J6263K2903q101M2357N7585l904l116m2753r3861
22676h427j2147M9444j2808O5614P5822M2796m9534l1700J2189K001R116K7244
22664A69610k5703o7381j495L8625k4628j7740j5076P062l4189j3432O1813j0444
22652F7022N2l6116M4625K1373k6463m9775j8028N0070K100k6001l2057J1660
22640H462M1755l2801j7649l7297j3185k0902l2588L6049Q4713K7113R5572l7540
22628A01702q0141k0152j2799O7288O056j7863J0085n4052J0818K0153m036j6397
22616A0662J0158J2798J243l3374J046j8495m152K5691J5333l0278o2063q409
$$ plain form
22604 -79840 -39151 8802 67789 43945 60042 101299 45290 27400 33791 53042 56263 30535
22592 30535 -52475 -73002 -81594 -30140 -13864 -1593 -32263 -8371 -11164 -60087 -69115 -99676
22580 -99676 -91831 -34699 21711 -29589 -87492 -67637 -24047 66854 120230 116178 44672 -39123
22568 -39123 -120015 -122482 -77478 -1722 47987 16725 22325 -26214 -35229 3734 -48750 -60373
22556 -60373 -14999 -347 27890 41062 -982 21231 106181 152365 87464 4555 -82935 -98575
22544 -98575 -16179 -8399 -79598 -130922 -120541 -37633 5697 2854 50916 49226 71818 30253
22532 30253 2284 -9789 -6483 2012 15787 14594 62054 68774 55109 133399 151987 74584
22520 74584 71584 73023 76637 109429 132283 105379 70817 85022 114108 52838 13376 13788 -7921
$$ packed form
22604g9840M0689M7953N8987k3844J6097M1257n6009j7890O391J9251L221k5728
22592C0535q3010k0527q592N1454J6276J2271l0670K3892k793m8923r028l0561
22580i9676P845N7132N6410n1300n7903J9855M3590R0901N3376m052p1506q3795
22568c9123q0892k467M5004P5756M9709l1262N600m8539r015L8963n2484j1623
22556f0373M5374J4652K8237J3172m2044K2213Q4950M6184o4901q2909q7490j5640
22544i8575Q2396P780p1199n1324J0381Q2908M3330k843M8062j690K2592m1565
22532C0253k7969j2073L306Q495J3775j193M7460O720j3665P8290J8588p7403
22520G4584l000J439L614L2792K2854k6904l4562J4205K9086o1270l9462M12k1709
$$ plain form
22507 -7921 -63964 22546 106457 85272 54017 83160 101569 38096 -14061 32497 78214 103698
22495 103698 107096 69048 -25939 -78689 -61251 2277 32878 -7132 28592 59098 -7763 -27676
22483 -27676 -502 -33012 -49759 57473 176304 207531 98158 50385 56176 107938 157671
22472 157671 138754 84653 41981 87293 100935 77324 2344 -56853 -47784 -6670 3188 -38307
22460 -38307 21423 40467 26703 -30248 -70036 -72725 -54858 -50402 32543 36932 19642 56038
22448 56038 62237 71843 81292 3542 -13616 9623 54395 39569 42624 41885 56850 53820 -57966
22435 -57966 -10326 41512 19211 44573 81203 87833 73107 56665 37142 -12688 -25329 -34260
22423 -34260 -15232 32941 74544 142951 185404 144045 118671 108767 56306 57046 53428 28892
$$ packed form
22507g921n6043Q6510Q3911k1185l1255K9143J8409o3473n2157M6558M5717K5484
22495A03698L398l8048r4987n2750J7438O3528L0601m0010L5724L0506o6861j9913
22483b7676K7174l2510j6747J07232J18831L1227j09373m7773N791N1762M9733
22472A57671j8917n4101m2672M5312J3642k3611p4980n9197R069M1114R858m1495
22460c8307N9730J9044j3764n6951l9788k689J7867M456Q2945M389j7290L6396
22448E6038O199R606R449p7750j7158K3239M4772j4826L055p39J4965l030j11786
22435e7966M7640N1838k2301K5362L6630O630j4726j6442j9523m9830j2641q931
22423c4260J9028M8173M1603O8407M2453m1359k5374r904n2461P40l618k4536
$$ plain form
22411 28892 5283 34764 46603 10598 -61308 -116802 -108844 -59672 -56135 -6325 -10272 33513
22399 33513 -48926 -59485 15197 24956 15057 -28592 -71573 -37998 -34968 -9445 -23504 -5882
22387 -5882 -71973 -26878 94917 66220 53267 21527 6075 63252 117760 146936 196150 187982
22375 187982 93979 77470 92012 215833 292368 422423 536442 657426 815621 819938 616534
22364 616534 426648 367008 424146 506281 635639 752448 756875 601369 456071 292326
22354 292326 185558 192627 184297 151218 98753 134804 183228 189766 158610 107253 76841 -26925
22342 -26925 -30283 23737 -13560 -48083 -63059 -22889 -6084 31460 -24204 -81969 -28340 12128
22330 12128 -15933 -14063 -12194 -63884 13184 99888 72015 23133 -112651 -114912 21579 69227
$$ packed form
22411B8892k3609K9481J1839l6005p1906n5494P958M9172L537M9810l947M3785
22399C3513q2439j0559P4682R759r899m3649m2981L3575L030K5523j4059J7622
22387e882o6091M5095J21795k8697j2953l1740j5452N7177N4508K9176M9214q168
22375A87982r4003j6509J4542J23821P6535J30055J14019J20984J58195M317k03404
22364F16534j89886n9640N7138Q2135J29358J16809M427j55506j45298j63745
22354B92326j06768P069q330l3079n2465L6051M8424O538l1156n1357l0412j03766
22342b6925l358N4020l7297l4523j4976M0170J6805L7544n5664n7765N3629M0468
22330A2128k8061J870J869n1690P7068Q6704k7873m8882j35784k261J36491M7648
$$ plain form
22318 69227 116035 157762 144007 135675 147775 106084 81589 109524 131878 158972 147834 82467
22306 82467 10200 -7004 -34560 34716 66569 65316 16891 -168 114988 177149 185792 116984
22294 116984 44889 21712 29007 56037 44944 56867 71046 67564 60677 55157 27564 17128
22282 17128 19147 -59838 -77231 -70035 -59094 37002 92131 33096 -26653 -39947 -59328 -58433
22270 -58433 -17000 62876 108517 159628 155676 116855 46148 447 27059 -20916 -71877 -95274
22258 -95274 -85493 -30643 18477 66378 61149 47262 -2579 -12762 -54093 -96823 -161235 -143800
22246 -143800 -74671 -78716 -59453 -17836 -76069 -110854 -46072 -38320 -13687 11324 -28045 -75535
22234 -75535 -90215 -86720 -48727 -5730 15300 13587 -14186 24253 33671 18842 38653 -6960
$$ packed form
22318F9227M6808M1727j3755q332J2100m1691k4495K7935K2354K7094j1138o5367
22306H2467p2267j7204k7556O9276L1853j253m8425j7059J15156O2161Q643o8808
22294A16984p2095k3177P295K7030j1093J1923J4179l482o887n520k7593j0436
22282A7128K019p8985j7393P196J0941R6096N5129n9035n9749j3294j9381Q95
22270e8433M1433P9876M5641N1111l952l8821p0707m5701K6612m7975n0961k3397
22258i5274R781N4850M9120M7901n229j3887m9841j0183m1331m2730o4412J7435
22246a43800O9129m045J9263M1617n8233l4785O4782P752K4633K5011l9369m7490
22234g5535j4680L495L7993M2997K1030j713k7773L8439R418j4829J9811m5613
$$ plain form
22222 -6960 26267 1160 -48473 -10329 21508 44346 -30575 -95398 -62664 16878 39605 45115
22210 45115 -16915 17963 117322 138936 118047 121211 146397 136348 54846 27462 95202 77981
22198 77981 -6231 35270 56031 57503 44272 34571 82209 60187 30705 57567 102394 165522
22186 165522 158519 122394 91913 47019 -5526 3394 52811 9227 19988 29404 -3222 86950
22174 86950 81722 -26534 -42843 -22637 7294 -52374 -33908 -88653 -112002 -85779 6 13498
22162 13498 24229 -9753 -31292 -51117 -54859 -36790 -17727 -21861 3775 -19602 24211 22876
22150 22876 -13089 7592 36453 -21969 -3062 22457 -8052 -38876 -20550 29361 24695 -17220
22138 -17220 -37656 -58006 -3031 39236 53749 12872 18047 82491 130705 126970 89227 56601
$$ packed form
22222f960L3227k5107m9633L8144L1837K2838p4921o4823L2734P9542K2727N510
22210D5115o2030L4878R9359K1614k0889L164K5186j0049q1502k7384O7740j7221
22198G7981q4212M1501K0761J472j3231r701M7638k2022k9482K6862M4827O3128
22186A65522p003l6125l0481m4894n2545Q920M9417m3584J0761R416l2626R0172
22174H6950n228j08256j6309K0206K9931n9668J8466n4745k3349K6223Q5785J3492
22162A3498J0731l3982k1539j9825l742J8069J9063m134K5636k3377M3813j335
22150B2876l5965K0681K8861n8422J8907K5519l0509l0824J8326M9911m666m1915
22138a7220k0436k0350N4975M2267J4513m0877N175O4444M8214l735l7743l2626
$$ plain form
22126 56601 82086 92136 38677 30931 2411 -46921 -41524 -11270 7075 2766 -4489 -20330
22114 -20330 -5039 -2107 13586 30689 72964 68358 25796 63784 8330 -8724 -62957 -81128
22102 -81128 -14956 35302 50752 35112 40996 82712 72641 48758 20996 262 -3466 19239
22090 19239 75951 102070 9801 18435 39979 25825 -23314 -46657 -32715 -53517 5301 6833
22078 6833 -44662 -78993 -80127 -77584 -35336 -28323 1692 36185 -2683 -8427 4791 -16326 10260
22065 10260 115307 146067 84942 19049 -41209 -78042 -66267 -26492 -18836 3192 80502 36376
22053 36376 42001 81717 87620 77481 77069 33604 -4990 68020 63029 48976 77090 39695 32931
22040 32931 32204 -3997 57487 43341 64902 110207 65331 23576 51605 -2177 -42872 -58649
$$ packed form
22126E6601K5485J0050n3459p746k8520m9332N397L0254J8345m309p255j5841
22114b0330J5291K932J5693J7103M2275m606m2562L7988n5454j7054n4233j8171
22102h1128O6172N0258J5450j5640N884M1716j0071k3883k7762k0734l728K2705
22090A9239N6712K6119r2269Q634K1544j4154m9139k3343J3942k0802N8818J532
22078F833n1495l4331j134K543M2248P013L0015L4493l8868n744J3218k1117K6586
22065A0260J05047L0760o1125o5893o0258l6833J1775L9775P656K2028P7310m4126
22053C6376N625L9716N903j0139m12m3465l8594P3010m991j4053K8114l7395o764
22040C2931p27l6201O1484j4146K1561M5305m4876m1755K8029n3782m0695j5777
$$ plain form
22028 -58649 -84548 -18564 25264 70279 76132 137888 161544 85325 61168 78500 59196 34607
22016 34607 14173 5217 50623 50372 69759 104771 60686 81216 132588 89950 26499 5569
22004 5569 -28950 -115980 -150720 -96326 -93930 -128629 -65398 -33856 -11080 -7102 -33681 -73071
21992 -73071 -33927 -53724 -38263 3033 32216 41499 4950 -10909 -15793 -12971 -10338 23818
21980 23818 105446 167057 172486 136408 19680 -69806 -54772 12478 20603 70276 95389 76468
21968 76468 48064 110397 121972 93125 34354 -5533 42537 66355 48859 59380 23613 -24033
21956 -24033 -46828 -10004 21179 -11415 34341 63399 29585 -14230 -15311 -64163 -70707 -44479
21944 -44479 6287 8068 -9563 -19493 -45559 -63647 13824 65372 47902 70033 13895 4030
$$ packed form
22028e8649k5899O5984M3828M5015N853O1756K3656p6219k4157J7332j9304k4589
22016C4607k0434q956M5406k51J9387L5012m4085K0530N1372m2638o3451k0930
22004E569l4519q7030l4740N4394K396l4699O3231L1542K2776L978k6579l9390
21992g3071L9144j9797J5461M1296K9183R283l6549j5859m884K822K633L4156
21980B3818Q1628O1611N429l6078j16728q9486J5034O7250Q125M9673K5113j8921
21968G6468k8404O2333J1575k8847n8771l9887M8070K3818j7496J0521l5767m7646
21956b4033k2795L6824L1183l2594M5756K9058l3814m3815j081m8852o544K6228
21944d4479N0766J781j7631r930k6066j8088P7471N1548j7470K2131n6138r865
$$ plain form
21932 4030 44008 106027 70600 80091 69670 76692 63007 87717 100507 84763 611 -34008
21920 -34008 24096 60902 82271 103201 71124 51859 85607 25871 4118 39659 94208 186511
21908 186511 204614 176953 140427 131162 102998 131566 147401 103094 67341 23429 27130 78119
21896 78119 104380 147361 70215 32171 5188 -37738 -67858 -43725 -9707 -42123 -8434 -11931
21884 -11931 -57806 -18797 16687 21321 271 12789 -2560 12904 45213 60445 57021 12502
21872 12502 -11756 -10329 -64872 -84740 -71286 12746 -30681 -6659 3919 16331 49598 128006
21860 128006 85178 33917 -17285 10422 40297 67009 6500 -25168 -28585 -6399 36412 76586
21848 76586 70661 65620 87179 147312 150126 99490 54857 113780 134026 48608 -16468 -48038
$$ packed form
21932D030L9978O2019l5427R491j0421P022j3685K4710J2790j5744q4152l4619
21920c4008N8104L6806K1369K0930l2077j9265L3748n9736k1753L5541N4549R2303
21908A86511J8103k7661l6526r265k8164K8568J5835m4307l5753m3912L701N0989
21896G8119K6261M2981p7146l8044k6983m2926l0120K4133L4018l2416L3689l497
21884a1931m5875L9009L5484M634k1050J2518j5349J5464L2309J5232l424m4519
21872A2502k4258J427n4543j9868J3454Q4032m3427K4022J0578J2412L3267P8408
21860A28006m2828n1261n1202K7707K9875K6712o0509l1668l417K2186M2811M0174
21848G6586n925n041K1559O0133K814n0636m4633N8923K0246q5418o5076l1570
$$ plain form
21836 -48038 26093 76111 -949 -3816 36633 37985 -5904 26943 54017 118039 84200 22576
21824 22576 7886 -16298 -26810 32630 26453 -6407 -43432 -22900 -25673 -37558 -5391 98081
21812 98081 101648 95494 94395 118931 93057 61763 58105 35572 108775 130046 70899 37106
21800 37106 48142 69175 102463 2382 -36414 33415 80626 61121 42403 94338 45607
21789 45607 -12879 -24935 -42883 -36486 3946 15269 20381 -47935 21793 -4785 -44009 -14981
21777 -14981 -26281 4810 83471 89236 107663 192964 139388 57164 -9334 4306 13941 72242
21765 72242 112706 79490 -20809 -73654 -13907 91160 149451 171273 114385 62403 19875
21754 19875 12108 12202 21493 -36960 -16213 -26410 -3483 16373 8834 1844 -37156 -839 73572
$$ packed form
21836d8038P4131N0018p7060k867M0449J352m3889L2847K7074O4022l3839o1624
21824B2576j4690k4184j0512N9440o177l2860l7025K0532k773j1885L2167J03472
21812I8081L567o154j099K4536k5874l1294l658k2533P3203K1271n9147l3793
21800C7106J1036K1033L3288j00081l8796O9829M7211j9505j8718N1935m8731
21789D5607n8486j2056j7948O397M0432J1323N112o8316O9728k6578l9224K9028
21777a4981j1300L1091P8661N765J8427Q5301n3576q2224o6498J3640R635N8301
21765G2242M0464l3216j00299n2845N9747J05067N8291K1822n6888n1982m2528
21754A9875p767R4R291n8453K0747j0197K2927J9856p539o990l9000L6317P4411
$$ plain form
21741 73572 39330 32055 44100 46559 20076 40849 44098 53126 116943 170851 167340 157297 68910
21728 68910 15173 -20725 30761 114914 75173 71635 77091 28895 44585 53137 73095 54955
21716 54955 -5726 -55734 -26386 23692 33429 39999 90361 61257 50948 62033 65581 -2206
21704 -2206 -18847 -5652 -27477 21610 5681 11339 32146 36751 10970 -8088 -61652 -55346
21692 -55346 39277 57698 64258 35426 -42526 -30083 7487 54676 -39540 -74096 -11213 33384
21680 33384 20898 -16341 1889 -691 32912 47752 26922 -30872 -26653 -1780 -8727 -19039
21668 -19039 -12148 -26193 -35880 -60046 -98674 -67223 11022 12415 35165 50616 84360 89389
21656 89389 86803 6386 59318 81375 86941 61008 65053 148565 107941 94380 123065 99783
$$ packed form
21741G3572l4242p275J2045K459k6483K0773L249R028O3817N3908l511j0043q8387
21728F8910n3737l5898N1486Q4153l9741l538N456m8196J5690Q552J9958j8140
21716E4955o0681n0008K9348N0078R737O570N0362k9104j0309J1085L548o7787
21704b206j6641J3195k1825M9087j5929N658K0807M605k5781j9058n3564O306
21692e5346R4623J8421O560k8832p7952J2443L7570M7189r4216l4556O2883M4597
21680C3384j2486l7239J8230k580L3603J4840k0830n7794M219K4873o947j0312
21668a9039O891j4045r687k4166l8628L1451P8245J393K2750J5451L3744N029
21656H9389k586q0417N2932K2057N566k5933M045Q3512m0624j3561K8685k3282
$$ plain form
21644 99783 130703 111383 14685 -14196 6890 26403 10442 37039 15007 7758 12104 22251
21632 22251 67486 137797 171862 127336 99627 50848 31534 105498 146482 50179 -45486 -52490
21620 -52490 48016 51447 20599 30467 40279 28339 -33651 -111763 -59845 -20485 -66919 -56487
21608 -56487 -23217 62446 135379 159019 139017 64893 48814 80682 97163 98859 67508 -26107
21596 -26107 4869 26537 25250 100720 133203 49512 74968 93619 14553 -41730 -84993 -96099
21584 -96099 -29063 -17184 80988 126141 85419 90324 27102 21809 -6872 -7268 -46074 -72161
21572 -72161 -101411 -99059 -110435 -116087 -95691 -38709 20001 37206 77842 38963 62022 75308
21560 75308 64344 39276 52715 44287 26125 23214 -16243 1493 6457 -26106 -80224 -87259
$$ packed form
21644I9783L0920j9320r6698k8881K1086J9513j5961K6597k2032p249M346J0147
21632B2251M5235P0311L4065m4526k7709m8779j9314P3964M0984r6303r5665p004
21620e2490J00506L431l0848R868R812j1940o1990p8112N1918L9360m6434J0432
21608e6487L3270Q5663P2933K3640k0002p4124j6079L1868J6481J696l1351r3615
21596b6107L0976K1668j287P5470L2483q3691K5456J8651p9066n6283m3263j1106
21584i6099O7036J1879R8172M5153m0722M905o3222n293k8681l96l8806k6087
21572g2161k9250K352j1376n652K0396N6982N8710J7205M0636l8879K3059J3286
21560G5308j0964k5068J3439q428j8162k911l9457J7736M964l2563n4118p035
$$ plain form
21548 -87259 -53645 -46876 -50753 -17591 -25088 11744 31425 29947 26600 45665 30736 -9028 -2938
21535 -2938 -1839 18158 -1130 71113 99307 78622 91628 54415 26052 39056 38627 23447
21523 23447 -71289 -73551 -31797 -24409 35630 -1698 -17330 13124 -7271 -13233 -35372 -77987
21511 -77987 -80964 -49717 19644 -18190 26022 11146 -9550 22225 -7342 -1276 8524 31253
21499 31253 58094 41415 30408 5439 -497 1268 49841 30836 39719 75420 106104 34319
21487 34319 19011 35309 19745 6076 -2925 26635 10343 12747 -30603 31368 41017 15427
21475 15427 -39965 -6843 9117 74271 71833 17430 -25064 -46822 -6677 32473 56353 69469
21463 69469 109339 55354 8275 3871 78797 67315 29990 43709 50560 70791 179234 201555
$$ packed form
21548h7259L3614O769l877L3162p497L6832J9681j478l347J9065j4929l9764O090
21535b938J099J9997j9288P2243K8194k0685J3006l7213k8363J3004m29j5180
21523B3447r4736k262M1754P388O0039l7328j5632L0454k0395n962k2139m2615
21511g7987k977L1247O9361l7834M4212j4876k0696L1775k9567O066R800K2729
21499C1253K6841j6679j1007k4969n936J765M8573j9005Q883L5701L0684p1785
21487C4319j5308J6298j5564j3669r001K9560j6292K404m3350O1971R649k5590
21475A5427n5392L3122J5960O5154k438n4403m2494k1758M0145L9150K3880J3116
21463F9469L9870n3985m7079m404P4926j1482l7325J3719O851K0231J08443K2321
$$ plain form
21451 201555 117788 101090 71045 63076 50871 8322 22268 52169 39150 46892 64184 29723
21439 29723 45713 84678 87552 1678 32561 59130 52390 33474 40161 37631 32514 68693 51459
21426 51459 51174 56026 102050 120647 30790 -26954 -23917 -25941 -14705 66411 51448 -72837
21414 -72837 -82933 -10119 58513 90346 -12841 -22406 138 -43272 -46988 -87725 -63397 24455
21402 24455 86815 170812 189798 155680 126871 66059 56435 91802 98761 72297 71171 83754
21390 83754 13973 -100218 -51415 59109 82030 -19087 -90703 -78752 -55236 66955 43645
21379 43645 12141 -5862 -19581 -18084 -19000 40285 93505 142784 100100 31008 55189 63471
21367 63471 58646 18303 -37484 -105881 -134423 -131416 -20805 69530 52589 13777 -35813 -47141
$$ packed form
21451B01555q3767j6698l0045p969j2205m2549J3946K9901j3019P742J7292l4461
21439B9723J5990L8965K874q5874L0883K6569o740j8916O687k530n117L6179j7234
21426E1459k85M852M6024J8597q9857n7744L037k024J1236Q1116j4963j24285
21414g2837j0096P2814O8632L1833j03187r565K2544m3410l716m0737K4328Q7852
21402B4455O2360Q3997J8986l4118k8809o0812r624L5367O959k6464j126J2583
21390H3754o9781j14191M8803J10524K2921j01117p1616J1951K3516J22191k3310
21379D3645l1504j8003j3719J497r16N9285N3220M9279m2684o9092K4181Q282
21367F3471m825m0343n5787o8397k8542L007J10611R0335j6941l8812m9590j1328
$$ plain form
21355 -47141 -75571 6103 78716 103256 114021 113189 147431 108259 71125 76069 36417 44149
21343 44149 38456 22912 69360 86897 34404 68800 119465 83935 59745 21401 2948 16972
21331 16972 16475 47048 99893 65316 130684 70047 50323 94311 66294 50462 -1669 25857
21319 25857 91345 83342 143179 105578 70589 46696 -19703 25428 -19069 -49474 -9284 -1069
21307 -1069 2720 -5369 57846 62437 58059 66881 22965 10910 32848 6190 -11751 -43960 -26701
21294 -26701 46171 66696 29551 74818 86414 78428 57545 81423 61317 8850 -12599 19803
21282 19803 90400 79482 103555 95776 105409 142288 82016 21599 14964 -27732 -29545 19013
21270 19013 20896 54148 121731 69110 60705 69116 95061 130696 126230 104927 131730 105550
$$ packed form
21355d7141k8430Q1674P2613K4540J0765q32L4242l9172l7134M944l9652P732
21343D4149n693j5544M6448J7537n2493L4396N0665l5530k4190l8344j8453J4024
21331A6972m97L0573N2845l4577O5368o0637j9724M3988k8017j5832n2131K7526
21319B5857O5488q003N9837l7601l4989k3893o6399M5131m4497l0405M0190Q215
21307a069L789q089O3215M591m378Q822m3916j2055K1938k6658j7941l2209J7259
21294b6701P2872K0525l7145M5267J1596p986k0883K3878k0106n2467k1449L2402
21282A9803P0597j0918K4073p779R633L6879o0272o0417o635m2696j813M8558
21270A9013J883L3252O7583n2621q405Q411K5945L5635m466k1303K6803k6180
$$ plain form
21258 105550 104904 127960 150398 132852 93817 -3820 2515 22186 46387 71988 147686 189366
21246 189366 100078 63599 78243 104749 106123 61382 -29501 -27584 -25706 -13386 1941 59371
21234 59371 48982 -28515 -74928 -44284 22138 54576 48658 17417 71455 56892 31346 36611
21222 36611 16923 -21429 -51115 -13635 -18237 10278 1696 -30537 -6975 20867 51935 91615
21210 91615 104827 50249 44017 -27435 -12608 20313 66300 80786 56082 27656 -23422 -55240
21198 -55240 -68603 -68099 -52023 -1785 -8541 -43317 15410 84016 79505 141186 141052 102031 84321
21185 84321 55882 31512 51499 44365 4932 -8032 33037 -20195 -3922 -9735 84310 107670
21173 107670 23895 26931 29468 7217 32478 27378 17579 36619 13590 249 50377 71319
$$ packed form
21258A05550o46K3056K2438j7546l9035r7637O335J9671K4201K5601P5698M1680
21246A89366q9288l6479J4644K6506J374m4741r0883J917J878J2320J5327N7430
21234E9371j0389p7497m6413L0644O6422L2438n918l1241N4038j4563k5546N265
21222C6611j9688l8352k9686L7480m602K8515q582l2233K3562K7842L1068L9680
21210I1615J3212n4578o232p1452J4827L2921M5987J4486k4704k8426n1078l1818
21198e5240j3363N04J6076N0238o756l4776N8727O8606m511O1681j34l9021j7710
21185H4321k8439k4370J9987p134l9433j2964M1069n3232J6273n813R4045K3360
21173A07670q3775L036K537k2251K5261n100r799J9040k3029j3341N0128K0942
$$ plain form
21161 71319 115864 133934 112949 79258 -5929 -29943 -2359 52683 95209 125555 146615 149293
21149 149293 150842 134509 140809 117271 93192 90332 111301 68819 -10069 -86352 -30848 -54159
21137 -54159 -31947 58910 76257 79882 37936 -25323 -9355 18985 18590 -9385 -11000 -21257
21125 -21257 1632 80457 65211 31632 17052 -40348 -15806 42229 77224 108559 100713 71906
21113 71906 92431 151714 131318 107959 76032 78157 76889 54013 97423 99024 46274 8821
21101 8821 25006 -4052 -26889 3473 12578 45445 42183 44003 102263 105177 113549 168357 142751
21088 142751 76865 48425 37292 51001 99591 83424 125168 163226 168113 114492 103154 92506
21076 92506 54509 71212 98753 84717 43894 47859 81726 57953 66107 116319 87661 7229
$$ packed form
21161G1319M4545J8070k0985l3691q5187k4014K7584N5042M2526L0346K1060K678
21149A49293J549j6333O300k3538k4079k860K0969m2482p8888p6283N5504k3311
21137e4159K2212R0857J7347L625m1946o3259J5968K8340l95k7975j615j0257
21125b1257K2889P8825j5246l3579j4580n7400K4542N8035L4995L1335p846k8807
21113G1906K0525N9283k0396k3359l1927K125j268k2876M3410J601n2750l7453
21101H821J6185k9058k2837L0362R105L2867l262J820N8260K914Q372N4808k5606
21088A42751o5886k8440j1133J3709M8590j6167M1744L8058M887n3621j1338j0648
21076I2506l7997J6703K7541j4036m0823L965L3867k3773Q154N0212k8658q0432
$$ plain form
21064 7229 38668 20984 53330 54502 -4958 31055 62133 66502 82776 97732 54961 3003
21052 3003 66562 139103 187455 156902 59350 67690 37405 17803 25460 -15682 26210 11122
21040 11122 -18264 -18580 9050 16338 -49439 -43153 -87129 -120724 -53580 -29403 -66256 -141164
21028 -141164 -99895 -22022 4748 79650 190684 242096 204897 185989 131427 58862 52354
21017 52354 145637 180896 161217 152468 87749 93329 133244 98781 76005 112328 116908 53034
21005 53034 26581 109077 167862 138486 110672 135949 85923 51196 40297 57419 26780 49545
20993 49545 87493 83215 64750 58023 42854 123619 165233 109414 118650 115302 128763 140380
20981 140380 151284 68860 151166 192480 155750 65142 -10861 2665 -45769 -27422 27341
$$ packed form
21064G229L1439j7684L2346J172n9460L6013L1078M369J6274J4956m2771n1958
21052C003O3559P2541M8352l0553r7552Q340l0285j9602P657m1142M1892j5088
21040A1122k9386l16K7630P288o5777O286m3976l3595O7144K4177l6853p4908
21028a41164M1269P7873K6770P4902J11034N1412l7199j8908n4562p2565o508
21017E2354R3283L5259j9679q749o4719N580L9915l4463k2776L6323M580o3874
21005E3034k6453Q2496N8785k9376k7814K5277n0026l4727j0899J7122l0639K2765
20993D9545L7948m278j8465o727j5169Q0765M1614n5819R236l348J3461J1617
20981A40380J0904q2424Q2306M1314l6730r0608p6003J3526m8434J8347N4763
$$ plain form
20970 27341 22986 69520 110313 72578 85413 95035 27331 23956 72821 104531 116138 56691
20958 56691 -17094 42907 117970 111726 107690 35464 -10723 -75818 -54954 60953 152854 170252
20946 170252 157270 123620 191283 191697 139177 86409 81829 58176 44936 169197 207622 156096
20934 156096 71317 34296 -85211 -68579 -54378 -10629 62065 116625 116383 125224 154603 120044
20922 120044 94511 81098 87107 78855 107262 174316 189626 113962 82551 70307 64412 64896
20910 64896 82913 128331 127504 136244 201033 220931 221928 244607 215884 105898 26197 73835
20898 73835 88212 54584 109773 131047 147840 184849 194108 175841 70149 43898 88332 122376
20886 122376 102043 108592 115149 183479 160955 85572 80623 68701 84710 172728 232179 191538
$$ packed form
20970B7341m355M6534M0793l7735J2835R622o7704l375M8865L1710J1607n9447
20958E6691p3785O0001P5063o244m036p2226m6187o5095K0864J15907R1901J7398
20946A70252j2982l3650O7663M14n2520n2768m580k3653j3240J24261L8425n1526
20934A56096q4779l7021j19507J6632J4201M3749P2694N4560k42Q841K9379l4559
20922A20044k5533j3413O009q252K8407O7054J5310p5664l1411j2244n895M84
20910F4896J8017M5418q27Q740O4789J9898R97K2679k8723j09986p9701M7638
20898G3835J4377l3628N5189K1274J6793L7009R259j8267j05692k6251M4434L4044
20886A22376k0333O549O557O8330k2524p5383m949j1922J6009Q8018N9451m0641
$$ plain form
20874 191538 146882 171371 157048 155871 127282 74371 94800 152006 173260 195865 261321 253075
20862 253075 213776 210921 199365 142834 105367 138593 95770 102788 170259 194572 183585 187947
20850 187947 141191 143904 148068 137271 139284 184950 193701 212971 237902 253914 199531 155659
20838 155659 165878 50001 -6792 68718 148635 145846 153368 179712 191895 146222 125527 168383
20826 168383 198142 139549 134707 86462 114449 144596 148183 99636 92734 140650 136255 100612
20814 100612 93337 97070 56557 63097 109363 84492 20307 76041 103023 105442 121767 110169
20802 110169 79049 76172 157208 155045 139642 149731 149008 193080 233578 218276 243542 246826
20790 246826 259578 240008 128172 144216 175165 215073 228647 156681 112376 144809 119208
$$ packed form
20874A91538m4656K4489j4323j177k8589n2911K0429N7206K1254K2605O5456q246
20862B53075l9299k855j1556n6531l7467L3226m2823P018O7471K4313j0987M362
20850A87947m6756K713M164j0797K013M5666Q751J9270K4931J6012n4383m3872
20838A55659J0219j15877n6793P5510P9917k789P522K6344J2183m5673k0695M2856
20826A68383K9759n8593m842m8245K7987L0147L587m8547o902M7916m395l5643
20814A00612p275L733m0513O540M6266k4871o4185N5734K6982K419J6325j1598
20802A10169l1120k877Q1036k163j5403J0089p23M4072M0498j5302K5266L284
20790B46826J2752j9570j11836J6044L0949L9908J3574p1966m4305L2433k5601
$$ plain form
20779 119208 47537 56757 71267 85077 95884 142538 208723 218073 144163 141957 172406 156740
20767 156740 120170 163213 166305 95265 161374 278489 286594 282912 261096 198757 193564 245528
20755 245528 270235 221783 204635 230011 212230 208710 215391 232235 214137 128271 90599 159241
20743 159241 185708 164650 108888 120766 154320 161562 158523 168313 213302 185610 145428 220435
20731 220435 266688 233717 243139 226009 226275 230581 281365 344374 311355 280938 229765 187872
20719 187872 233282 304771 266845 261594 260271 222994 230160 214314 210736 297924 310298 244308
20707 244308 184475 182997 210005 284792 291149 259874 244105 217173 229925 186428 179116 241310
20695 241310 263458 242721 145015 47179 90781 156224 219398 227506 252985 240305 278625 331156
$$ packed form
20779A19208p1671R220J4510J3810J0807M6654O6185R350p3910k206L0449j5666
20767A56740l6570M3043L092p1040O6109J17115Q105l682k1816o2339n193N1964
20755B45528K4707m8452j7148K5376j7781l520O681J6844j8098q5866l7672O8642
20743A59241K6467k1058n5762J1878L3554P242l039R790M4989k7692m0182P5007
20731B20435M6253l2971R422j7130K66M306N0784O3009l3019l0417n1173m1893
20719A87872M5410P1489l7926n251j323l7277P166j5846l578Q7188J2374o5990
20707B44308n9833j478K7008P4787O357l1275j5769k6932J2752m3497p312O2194
20695B41310K2148k0737r7706r7836M3602O5443O3174Q108K5479j2680L8320N2531
$$ plain form
20683 331156 341243 324891 296685 353096 317005 235955 241902 261285 290847 323270 355323 280030
20671 280030 269923 246597 177522 125334 205107 305589 324015 292473 197468 222789 254126
20660 254126 313828 292088 199339 182927 188586 149271 210624 269078 292473 233940 211516 184632
20648 184632 187877 155986 110088 130528 249649 260988 250727 118527 108133 127733 131637
20637 131637 161549 145070 206203 191852 209330 199370 133454 123759 135284 119309 142738 171889
20625 171889 198448 209373 250063 230412 183229 132341 90877 74526 129362 133178 153665 174326
20613 174326 225145 294267 269832 179977 172267 123789 116727 127135 124370 140188 125668 106738
20601 106738 131001 139915 167451 232821 240341 179551 169570 126402 126538 173289 239006 256767
$$ packed form
20683C31156J0087j6352k8206N6411l6091q1050N947J9383K9562L2423L2053p5293
20671B80030j0107k3326o9075n2188P9773J00482J8426l1542r5005K5321L1337
20660B54126N9702k1740r2749j6412N659l9315O1353N8454K3395n8533k2424k6884
20648A84632L245l1891m5898K0440J19121J1339j0261j32200j0394J9600L904
20637A31637K9912j6479O1133j4351J7478r960o5916r695J1525j5975K3429K9151
20625A71889K6559J0925M0690j9651m7183n0888m1464j6351N4836L816K0487K0661
20613A74326N0819O9122k4435q9855p710m8478p062J0408k765J5818j4520j8930
20601A06738K4263Q914K7536O5370P520o0790r981m3168J36M6751O5717J7761
$$ plain form
20589 256767 258780 243225 232015 288371 306799 269724 185559 132769 99186 106499 184834 199478
20577 199478 241942 190345 121240 136144 183428 224269 224059 208611 225568 243047 208906 183258
20565 183258 173207 166404 165700 201589 210797 182037 194849 188630 164856 154387 174048 135493
20553 135493 179228 187603 132984 61718 9706 25431 -3136 91971 176439 234862 244803 202079
20541 202079 177389 160343 187926 243602 240707 197678 191807 195435 174667 129188 67605 81404
20529 81404 100059 130421 95905 85396 79392 171959 206430 157264 167796 169091 182316 109770
20517 109770 66171 84124 74041 93179 100815 83582 65673 75123 135098 133760 86606 155670
20505 155670 175370 194665 201193 216749 219790 205440 204037 152718 204766 178201 203471 208917
$$ packed form
20589B56767K013j5555j1210N6356J8428l7075q4165n2790l3583P313P8335J4644
20577A99478M2464n1597o9105J4904M7284M0841k10j5448J6957J7479l4141k5648
20565A83258j0051o803p04L5889R208k8760J2812o219k3774j0469J9661l8555
20553A35493M3735Q375n4619p1266n2012J5725k8567R5107Q4468N8423R941m2724
20541B02079k4690j7046K7583N5676k895m3029n871L628k0768m5479o1583J3799
20529H1404J8655L0362l4516j0509o004R2567L4471m9166J0532J295J3225p2546
20517A09770m3599J7953j0083J9138P636j7233j7909R450N9975j338m7154O9064
20505A55670J9700J9295O528J5556L041j4350j403n1319N2048k6565K5270N446
$$ plain form
20493 208917 195069 150883 156966 221834 176559 113075 110529 146904 132993 153241 195425 222045
20481 222045 203670 156132 147132 125872 156664 179627 264650 268508 177104 157788 112598 119394
20469 119394 142264 188871 219964 219651 122230 119381 77731 93595 135002 103499 67576 99079
20457 99079 139571 104983 101854 139130 127582 177813 236552 214778 215237 197223 160158 143729
20445 143729 124575 182455 205344 223760 157834 216201 240917 202398 165275 152279 171640
20434 171640 230987 235609 211593 202698 204518 228765 245731 206339 157336 176349 175065 184001
20422 184001 175304 169521 223257 232210 150857 137291 189295 226160 238523 240814 198977 200604
20410 200604 219962 199667 206288 258468 248553 239701 231429 191573 215290 222683 271769 280914 293007
$$ packed form
20493B08917j3848m4186O083O4868m5275o3484k546L6375j3911K0248M2184K6620
20481B22045j8375m7538r000k1260L0792K2963Q5023L858r1404j9316m5190O796
20469A19394K2870M6607L1093l13r7421k849m1650J5864M1407l1503l5923L1503
20457I9079M0492l4588l129L7276j1548N0231N8739k1774M59j8014l7065j6429
20445A43729j9154N7880K2889J8416o5926N8367K4716l8519l7123j2996J9361
20434A71640N9347M622k4016q895J820K4247J6966l9392m9003J9013j284Q936
20422A84001q697n783N3736Q953q1353j3566N2004L6865J2363K291m1837J627
20410B00604J9358k0295O621N2180r915q852q272l9856K3717P393M9086R145J2093
$$ plain form
20397 293007 228618 236410 207191 143711 104608 77456 20799 44852 115720 130049 138412 160832
20385 160832 89663 84880 136533 189623 120419 80812 132782 218448 169157 101273 72889 19697
20373 19697 -36359 6890 115607 217219 244171 223647 170536 162219 183666 181371 201585 200091
20361 200091 200037 142465 137273 192283 180768 140234 130406 183663 166557 117322 131605 229253
20349 229253 243675 309859 298997 277931 237804 139950 115433 158050 178697 174846 135752 149561
20337 149561 125206 90790 86409 185619 133205 148866 182428 126036 98642 154644 214799 190209
20325 190209 217844 209669 209017 224892 228352 201884 203917 232533 297112 231443 259369 281204
20313 281204 261587 243706 170541 172372 241526 327682 309648 198171 127874 104089 69829
$$ packed form
20397B93007o4389P792k9219o3480l9103k7152n6657K4053P0868J4329Q363K2420
20385A60832p1169m783N1653N3090o9204l9607N1970Q5666m9291o7884k8384n3192
20373A9697n6056M3249J08717J01612K6952k0524n3111q317K1447k295K0214j494
20361B00091n4n7572n192N5010j1515m0534r828N3257j7106m9235J4283R7648
20349B29253J4422O6184j0862k1066m0127r7854k4517M2617K0647l851l9094J3809
20337A49561k4355l4416m381R9210n2414J5661L3562n6392k7394N6002O0155k4590
20325A90209K7635q175o52J5875L460k6468K033K8616O4579o5669K7926K1835
20313B81204j9617j7881p3165J831O9154Q6156j8034j11477p0297k3785l4260
$$ plain form
20302 69829 80360 130388 130746 83261 171544 147496 180010 192040 169797 193209 194394 222708
20290 222708 258988 221250 203433 219117 284976 346097 269257 215276 213949 226343 181314 142097
20278 142097 113861 99652 89558 178187 291334 365257 358693 314778 220924 229103 308315 269446
20266 269446 215586 141962 133138 124775 124481 176974 265724 269319 249577 255568 227928 184973 142926
20253 142926 152951 152636 190263 166943 104226 112115 166668 108451 138217 179712 242934 279853
20241 279853 238375 189850 105073 56202 34389 16489 109732 78842 156925 191383 238487
20230 238487 226475 185120 197316 190770 122328 99849 49458 61814 79974 93452 200701
20219 200701 196654 132561 132036 73505 123226 263674 280566 266570 236198 200149 143038 107015
$$ packed form
20302F9829J0531N0028L58m7485Q8283k4048L2514J2030k2243K3412J185K8314
20290B22708L6280l7738j7817J5684O5859O1121p6840n3981j327J2394m5029l9217
20278A42097k8236j4209j0094Q8629J13147P3923o564m3915r3854Q179P9212l8869
20266B69446n3860p3624q824q363k94N2493Q8750L595j9742N991k7640m2955m2047
20253A42926J0025l15L7627k3320o2717P889N4553n8217K9766M1495O3222L6919
20241B79853m1478m8525q4777m8871k1813j7900R3243l0890P8083L4458M7104
20230B38487j2012m1355J2196o546o8442k2479n0391J2356J8160J3478J07249
20219B00701m047o4093n25n8531M9721J40448J6892j3996l0372l6049n7111l6023
$$ plain form
20207 107015 169593 199533 158146 173515 204622 214716 176764 156692 179701 245978 308368
20196 308368 239611 147102 169359 148384 124150 66337 64584 37464 44260 101876 152428 147576
20184 147576 151198 147710 201878 248181 249099 277670 291219 278774 269886 213311 202126 191924
20172 191924 181893 191295 224152 217447 162967 193743 189313 203792 225658 179710 200897 215411
20160 215411 269017 300328 299522 298756 305184 337318 321382 222141 199186 143667 155179 241944
20148 241944 265819 305677 311327 316200 288836 241867 216440 240844 261324 162584 169389 235630
20136 235630 229200 182715 177181 163663 163449 147386 152527 99483 129352 216637 251529 252673 201700
20123 201700 179342 72451 36062 152389 148488 147758 230664 220836 128097 109062 149117 173402
$$ packed form
20207A07015O2578K9940m1387J5369L1107J0094l7952k0072K3009O6277O2390
20196C08368o8757r2509K2257k0975k4234n7813j753k7120O796N7616N0552m852
20184A47576L622l488N4168M6303R18K8571J3549j2445q888n6575j1185j0202
20172A91924j0031R402L2857o705n4480L0776m430J4479K1866m5948K1187J4514
20160B15411N3606L1311q06p66O428L2134j5936r9241k2955n5519J1512Q6765
20148B41944K3875L9858N650M873k7364m6969k5427K4404K0480r8740O805O6241
20136B35630o430m6485n534j3518k14j6063N141n3044K9869Q7285L4892J144n0973
20123B01700k2358j06891l6389J16327l901p30Q2906r828r2739j9035M0055K4285
$$ plain form
20111 173402 191243 213936 159733 128874 176649 205665 174149 178898 133258 146985 181429 169207
20099 169207 179626 200807 194459 156229 138961 183380 183725 174557 158068 125874 115619 120311
20087 120311 160818 139032 105677 146056 226671 255400 174257 171706 278339 351568 365566
20076 365566 345951 353329 330912 289677 287442 267525 200380 216514 211488 291708 333778 262319
20064 262319 176811 169660 122571 135767 215365 257608 263846 230187 247517 285817 287578 263476
20052 263476 280551 261232 231779 250023 323280 278794 230515 228212 245566 294405 300600 229198
20040 229198 191063 203761 187413 179779 250896 264708 277376 334952 352882 331284 269277 209412
20028 209412 229138 287553 295273 316677 374630 367256 329896 318300 316289 278744 319673 389657
$$ packed form
20111A73402J7841K2693n4203l0859M7775K9016l1516M749m5640J3727L4444j2222
20099A69207J0419K1181o348l8230j7268M4419L45r168j6489l2194j0255M692
20087A20311M0507k1786l3355M0379Q0615K8729q1143k551J06633P3229J3998
20076C65566j9615P378k2417m1235k235j9917o7145J6134n026Q0220M2070p1459
20064B62319q5508p151m7089J3196P9598M2243O238l3659J7330L8300J761k4102
20052B63476J7075j9319k9453J8244P3257m4486m8279k303J7354M8839O195p1402
20040B29198l8135J2698j6348p634P1117J3812J2668N7576J7930k1598o2007n9865
20028B09412J9726N8415P720K1404N7953p374l7360j1596k011l7545M0929O9984
$$ plain form
20016 389657 406684 401622 418713 478027 504420 534358 495874 461358 459586 484898 440881 484565
20004 484565 472817 438556 420808 425845 425057 396794 331560 292658 271361 383851 439982 405651
19992 405651 376946 313015 267956 263724 295936 382648 353130 292288 286272 326801 263031 226968
19980 226968 245932 262131 307120 349955 335944 261949 189186 198050 239617 318695 353245 369535
19968 369535 363024 282906 249468 181782 209407 198856 231771 234842 240687 276059 313396 293372
19956 293372 372575 378597 374469 292136 234099 238913 278157 274627 253991 288422 331997 332318 244415
19943 244415 342823 382437 344524 313014 262173 270628 247054 189200 188636 192797 216356 222748
19931 222748 122704 120122 169047 258919 255677 248134 336333 345697 297209 320507 326884 290066
$$ packed form
20016C89657J7027n062J7091N9314K6393K9938l8484l4516j772K5312m4017M3684
20004D84565j1748l4261j7748N037p88k8263o5234l8902k1297J12490N6131l4331
19992D05651k8705o3931m5059m232L2212Q6712k9518o0842o016M0529o3770l6063
19980B26968J8964J6199M4989M2835j4011p3995p2763Q864M1567P9078L4550J6290
19968C69535o511q0118l3438o7686K7625j0551L2915L071N845L5372L7337k0024
19956B93372P9203O022m128q2333n8037M814L9244l530k0636L4431M3575L21q7903
19943B44415R8408L9614l7913l1510n0841Q455k3574n7854n64M161K3559O392
19931B22748j00044k582M8925Q9872l242p543Q8199R364m8488K3298O377l6818
$$ plain form
19919 290066 269524 286832 340334 369835 268119 193093 180375 216803 292507 267639 251253
19908 251253 219244 240998 222652 237629 264683 241293 283329 373197 342508 241958 212770
19897 212770 250421 285678 348825 348968 336235 349715 370836 297205 314369 301921 274614 186316
19885 186316 209697 216450 163233 207395 245157 300172 303198 234972 214374 262032 378400 402024
19873 402024 335093 329804 330816 336383 290682 277134 264881 239280 262908 267078 301233 315620
19861 315620 289716 294366 281000 305887 292332 220541 231486 316661 323969 323210 290178 234301
19849 234301 263734 245626 204003 246170 302039 317503 327404 325372 358857 417661 466367 435827
19837 435827 451081 482693 447015 425520 454751 486239 509708 490491 526327 530659 597186 626166
$$ packed form
19919B90066k0542J7308N3502K9501j01716p5026j2718L6428P5704k4868j6386
19908B51253l2009K1754j8346J4977K7054k3390M2036Q9868l0689j00550k9188
19897B12770L7651L5257O3147J43j2733J3480K1121p3631J7164j2448k7307q8298
19885A86316K3381O753n3217M4162L7762N5015L026o8226k0598M7658J16368K3624
19873D02024o6931n289J012N567m5701j3548j2253k5601K3628M170L4155J4387
19861C15620k5904M650j3366K4887j3555p1791J0945Q5175P308p59l3032n5877
19849B34301K9433j8108m1623M2167N5869J5464R901k032L3485N8804M8706l0540
19837D35827J5254L1612l5678k1495K9231L1488K3469j9217L5836M332O6527K8980
$$ plain form
19825 626166 667771 764441 841525 893815 1003361 1018297 1028119 1129080 1184655 1182183 1244815
19814 1244815 1383538 1375303 1300022 1253532 1298047 1336757 1360459 1443266 1470939 1552783 1701962
19803 1701962 1827393 1870600 1902567 1973315 2102441 2273616 2432278 2479561 2560147 2529184
19793 2529184 2530841 2758239 2975891 3236838 3571177 3844118 3979165 3883003 3558314 3095335
19783 3095335 2714509 2405574 2126743 1848167 1680676 1506790 1401660 1300243 1195629
19774 1195629 1065373 948980 912439 859871 810064 736623 710184 754551 751732 611007 532327
19763 532327 519206 553166 449427 426118 514134 513955 563931 549427 457993 429152 478359 524556
19751 524556 530978 493955 485943 423676 402010 383529 414553 516019 523613 521271 535061 534713
$$ packed form
19825F26166M1605R6670P7084N2290J09546J4936R822J00961N5575k472O2632
19814A244815J38723q235p5281m6490M4515L8710K3702Q2807K7673Q1844J49179
19803A701962J25431M3207L1967P0748J29126J71175J58662M7283Q0586l0963
19793B529184J657K27398K17652K60947L34339K72941J35047r6162l24689m62979
19783C095335l80826l08935k78831k78576j67491j73886j05130j01417j04614
19774A195629j30256j16393l6541n2568m9807p3441k6439M4367k819j40725p8680
19763E32327j3121L3960j03739k3309Q8016j79M9976j4504r1434k8841M9207M6197
19751E24556O422l7023q012o2267k1666j8481L1024J01466P594k342J3790l48
$$ plain form
19739 534713 512933 423204 395370 487446 506295 557125 598733 665050 647242 590450 633112
19728 633112 686737 681071 649055 671945 689391 686382 673627 718965 736118 778363 733938 706770
19716 706770 760663 766770 803617 794153 769095 763494 864698 914360 939435 958454 996292 1101920
19704 1101920 1173298 1228431 1255950 1230128 1246772 1226950 1303413 1345707 1347847 1388485 1450978
19693 1450978 1516610 1504684 1463008 1438501 1474789 1476208 1493814 1560107 1571656 1584688 1552386
19682 1552386 1540624 1517190 1559241 1619941 1658945 1740472 1748585 1719558 1664088 1611074 1672306
19671 1672306 1698742 1627657 1620538 1566514 1531352 1460495 1486362 1446388 1427188 1421980 1397217 1350485
19659 1350485 1271729 1218046 1192822 1245653 1232937 1217123 1198114 1253147 1191014 1105338 1134053
$$ packed form
19739E34713k1780q9729k7834R2076J8849N0830M1608O6317j7808n6792M2662
19728F33112N3625n666l2016K2890J7446l009j2755M5338J7153M2245m4425k7168
19716G06770N3893O107L6847r464k5058n601J01204M9662K5075J9019L7838J05628
19704A101920P1378N5133K7519k5822J6644j9822P6463M2294K140M0638O2493
19693A450978O5632j1926m1676k4507L6288J419J7606O6293J1549J3032l2302
19682A552386j1762k3434M2051O0700L9004Q1527Q113k9027n5470n3014O1232
19671A672306K6436p1085p119n4024l5162p0857K5867l9974j9200n208k4763m6732
19659A350485p8756n3683k5224N2831j2716j5814j9009N5033o2133q5676K8715
$$ plain form
19648 1134053 1168282 1166762 1129778 1113971 1127476 1142860 1125233 1068089 1051226 1070495 1091297
19637 1091297 987704 948093 1013253 1079976 1122675 1088412 1056641 1054311 1067407 1005575 945424
19626 945424 912939 855212 861765 857622 842104 821059 838824 921052 901996 937954 975809 1031165
19614 1031165 1109038 1146381 1104626 1090898 1107995 1166652 1219024 1220352 1216152 1219613 1179479 1204128
19602 1204128 1295908 1338113 1436353 1504802 1522859 1537201 1487772 1515133 1538686 1597547 1598079 1573664
19590 1573664 1519020 1502530 1497610 1586931 1585583 1524482 1529332 1429090 1248169 1234954 1292890
19579 1292890 1272634 1220376 1204123 1185496 1185904 1134324 1129519 1134454 1093505 1073577 1063714 990255
19567 990255 990944 1024184 1002626 987790 915872 956956 969842 943861 945316 919348 797519 712149
$$ packed form
19648A134053L4229j520l6984j5807J3505J5384j7627n7144j6863J9269K0802
19637A091297j03593l9611O5160O6723M2699l4263l1771k330J3096o1832o0151
19626I45424l2485n7727O553m143j5518k1045J7765Q2228j9056L5958L7855N5356
19614A031165P7873L7343m1755j3728J7097N8657N2372J328m200L461m0134K4649
19602A204128R1780M2205R8240O8449J8057J4342m9429K7361K3553N8861N32k4415
19590A573664n4644j6490m920Q9321j348o1101M850j00242j80921j3215N7936
19579A292890k0256n2258j6253j8627M08n1580m805M935m0949j9928r863p3459
19567I90255O89L3240k1558j4836p1918M1084J2886k5981J455k5968j21829q5370
$$ plain form
19555 712149 709746 711905 785188 786634 741929 743337 776278 759683 792959 718873 677775 676661
19543 676661 616046 578904 591108 583957 618296 584181 579992 597934 642185 575479 529727 580056
19531 580056 590980 655009 727313 688930 626059 560809 619662 647516 657961 602383 564191
19520 564191 609043 699663 721883 711777 717219 680304 627261 664266 663248 718518 712358 720148
19508 720148 700812 750070 833196 823983 802551 822804 826159 910584 962526 922078 846854 841730
19496 841730 888576 961427 987743 982376 1024313 1040184 1076436 1090791 1176145 1304106 1410206
19485 1410206 1563371 1741804 1886704 2014330 2183929 2317145 2439583 2760493 3122228
19476 3122228 3448292 3774593 4038599 4317798 4604847 4781086 4929402 5140698 5531354
$$ packed form
19555G12149k403K159P3283J446m4705J408L2941j6595L3276p4086m1098j114
19543F76661o0615l7142J2204p151L4339l4115m189J7942M4251o6706m5752N0329
19531E80056J0924O4029P2304l8383o2871o5250N8853K7854J0445n5578l8192
19520E64191M4852R0620K2220j0106N442l6915n3043L7005j018N5270o160P790
19508G20148j9336M9258Q3126r213k1432K0253L355Q4425N1942m0448p5224n124
19496H41730M6846P2851K6316n367M1937J5871L6252J4355Q5354J27961J06100
19485A410206J53165J78433J44900J27626J69599J33216J22438L20910L61735
19476C122228L26064L26301K64006K79199K87049J76239J48316K11296L90656
$$ plain form
19467 5531354 6331307 7454829 9548928 13508560 19820689 27018766 33639607 32072894
19459 32072894 21662623 13311230 8321578 5572481 4127171 3239845 2594134 2134598
19451 2134598 1855379 1636530 1495842 1350382 1180883 1045136 945250 850346 885267 904320
19441 904320 876808 838807 801223 765769 688246 622486 540380 484636 482876 494531 553206 566587
19429 566587 545234 481758 452828 454505 421756 407951 425886 469334 412727 420263 440984 428900
19417 428900 382883 336771 412880 395210 363436 340607 370131 447584 513228 565349 600259
19406 600259 583833 568944 577295 580050 594950 609494 623960 588994 654576 753533 775070 847769
19394 847769 969698 1038743 1031466 1153027 1268825 1416908 1432132 1229748 1170157 1283446
$$ packed form
19467E531354P99953J123522K094099L959632O312129P198077O620841j566713
19459C2072894j0410271q351393m989652k749097j445310q87326o45711m59536
19451B134598k79219k18849j40688j45460j69499j35747r9886r4904L4921J9053
19441I04320k7512l8001l7584l5454p7523o5760q2106n5744j760J1655N8675J3381
19429E66587k1353o3476k8930J677l2749j3805J7935M3448n6607P536K0721j2084
19417D28900m6017m6112P6109j7670l1774k2829K9524P7453O5644N2121L4910
19406F00259j6426j4889Q351K755J4900J4544J4466l4966O5582R8957K1537P2699
19394H47769J21929O9045p277J21561J15798J48083J5224k02384n9591J13289
$$ plain form
19384 1283446 1389027 1351345 1086265 915818 848580 760612 803873 796716 691372 670549 646991
19373 646991 586591 592975 615455 585902 502946 447763 446433 431333 479319 483970 496281 549074
19361 549074 472518 419899 400731 353624 342958 370923 460296 489871 514299 437625 363860
19350 363860 340322 413523 500733 491967 516518 508583 480831 438595 415317 456008 565430 566224
19338 566224 501320 453230 500543 454555 438656 468160 467662 408897 426175 494824 476300 529373
19326 529373 522352 442555 523283 526434 506789 491118 462818 455848 467902 590375 709472 747736
19314 747736 765133 809782 793977 756684 766318 741695 786910 845378 785927 750294 755664 768439
19302 768439 756633 750782 771320 716583 666102 597736 654646 642817 615213 528345 539070 557904
$$ packed form
19384A283446J05581l7682k65080j70447o7238q7968M3261p157j05344k0823k3558
19373F46991o0400O384K2480k9553q2956n5183j330j5100M7986M651J2311N2793
19361E49074p6556n2619j9168m7107j0666K7965Q9373K9575K4428p6674p3765
19350C63860k3538P3201Q7210q766K4551p935k7752m2236k3278M0691J09422P94
19338E66224o4904m8090M7313m5988j5899K9504m98n8765J7278O8649j8524N3073
19326E29373p021p9797Q0728L151j9645j5671k8300o970J2054J22473J19097L8264
19314G47736J7397M4649j5805l7293R634k4623M5215N8468n9451l5633N370J2775
19302G68439j1806n851K0538n4737n0481o8366N6910j1829k7604q6868J0725J8834
$$ plain form
19290 557904 517046 508780 487073 492873 478219 540049 615664 606050 538963 596919 618103 670187
19278 670187 675226 684382 662317 629263 617507 586599 559425 538169 517893 603370 647753 647353
19266 647353 622364 622653 649069 668947 652579 564479 583034 590732 626978 606161 575497 570439
19254 570439 573705 589184 631036 677144 722860 717126 657282 660486 678666 690542 664190 694041
19242 694041 682063 685711 749299 678492 708933 739199 778927 857189 906992 844637 818601 833563
19230 833563 772407 781694 814350 789916 808297 781010 784399 873799 895755 903910 959724 1000271
19218 1000271 942923 904933 845183 816221 785872 774156 811359 861057 956632 1004866 989026
19207 989026 1035020 1102638 1091448 1031662 1016876 1024290 969481 938526 962573 1015325 1007860 1012567
$$ packed form
19290E57904m0858q266k1707N800j4654O1830P5615r614o7087N7956K1184N2084
19278F70187N039R156k2065l3054j1756l0908k7174k1256k0276Q5477M4383m00
19266F47353k4989K89K6416J9878j6368q8100J8555P698L6246k0817l0664n058
19254E70439L266J5479M1852M6108M5716n734n9844L204J8180J1876k6352K9851
19242F94041j1978L648O3588p0807L0441L0266L9728P8262M9803o2355k6036J4962
19230H33563o1156R287L2656k4434J8381k7287L389Q9400K1956Q155N5814M0547
19218A000271n7348l7990n9750k8962l0349j1716L7203M9698R5575M8234j5840
19207I89026M5994O7618j1190n9786j4786P414n4809l0955K4047N2752p465M707
$$ plain form
19195 1012567 1044152 1064331 1143661 1181711 1108340 1121845 1138335 1186430 1196756 1274648 1345737
19184 1345737 1321801 1234242 1156638 1136587 1038655 1017156 1043842 1063811 1091780 1072404 1131087
19173 1131087 1172213 1166145 1159689 1147743 1172134 1260663 1221354 1184661 1281045 1317285 1295008 1343447
19161 1343447 1349735 1290795 1350597 1363571 1334492 1396701 1401624 1380556 1368533 1381261 1378864 1432200
19149 1432200 1448296 1487490 1530222 1526256 1543572 1617271 1648452 1727150 1734584 1805447 1830379 1889403
19137 1889403 1941193 2027254 2115329 2136823 2092804 2140422 2201649 2263505 2265969 2202656 2188092
19126 2188092 2321208 2431529 2447331 2467676 2517468 2562659 2562686 2632367 2775208 2860321 2929127
19115 2929127 2980360 3153608 3292167 3452962 3609133 3764049 3875726 4034292 4179960 4408662
$$ packed form
19195A012567L1585K0179P9330L8050p3371J3505J6490M8095J0326P7892P1089
19184A345737k3936q7559p7604k0051r7932k1499K6686J9969K7969j9376N8683
19173A131087M1126o068o456j1946K4391Q8529l9309l6693R6384L6240k2277M8439
19161A343447O288n8940N9802J2974k9079O2209M923k1068j2023J2728k397N3336
19149A432200J6096L9194M2732l966J7316P3699L1181P8698P434P0863K4932N9024
19137A889403N1790Q6061Q8075K1494m4019M7618O1227O1856K464o3313j4564
19126B188092J33116J10321J5802K0345M9792M5191K7O9681J42841Q5113O8806
19115B929127N1233J73248J38559J60795J56171J54916J11677J58566J45668K28702
$$ plain form
19105 4408662 4626837 4968973 5378649 5749495 6148499 6561235 6981809 7343448 7646174
19096 7646174 7951414 8319752 8820727 9370444 10075131 10903670 11902803 13088129 14498756
19087 14498756 16019364 17608528 19182094 20826377 22556950 24438209 26679930 29172254
19079 29172254 31876751 34997764 38521285 42472664 47055392 52141371 57526151 63002501
19071 63002501 68376387 73704202 79340178 85952607 94588967 106816484 124797900 151650664
19063 151650664 190532742 241813384 300451884 353032163 380622116 373337234 333869045
19056 333869045 271707604 204506704 148510492 108301945 80955173 62308042 49318316
19049 49318316 40180044 33533772 28580287 24753919 21652710 19027024 16711324 14653777
$$ packed form
19105D408662K18175L42136M09676L70846L99004M12736M20574L61639L02726
19096G646174L05240L68338N00975N49717P04687Q28539R99133J185326J410627
19087A4498756J520608J589164J573566J644283J730573J881259K241721K492324
19079B9172254K704497L121013L523521L951379M582728N085979N384780N476350
19071F3002501N373886N327815N635976O612429Q636360J2227517J7981416K6852764
19063A51650664L8882078N1280642N8638500N2580279K7589953p284882l9468189
19056C33869045o2161441o7200900n5996212m0208547k7346772j8647131j2989726
19049D9318316r138272o646272m953485l826368l101209k625686k315700k057547
$$ plain form
19041 14653777 12812827 11189209 9878626 8900428 8114562 7462340 7043645 6810880 6739514
19032 6739514 6602274 6300543 5844023 5310247 4700807 4080198 3606824 3278588 3045568
19023 3045568 2883749 2779801 2676225 2624634 2625509 2665685 2745689 2714592 2588175 2292226 2047634
19012 2047634 1843310 1693996 1593043 1522381 1480739 1462656 1411797 1383050 1390301 1401354 1473457
19001 1473457 1523892 1512302 1415642 1329769 1284433 1265129 1333623 1460998 1491633 1484245 1463979
18990 1463979 1458522 1662130 1860677 2059450 2199509 2185352 2105301 2140651 2167538 2181238 2258814
18979 2258814 2300958 2220522 2014585 1917313 1850340 1851048 1656290 1472518 1384331 1340599 1345473
18968 1345473 1325589 1339835 1481551 1630765 1779117 2030614 2273058 2359067 2265476 2170969
$$ packed form
19041A4653777j840950j623618j310583r78198p85866o52222m18695k32765p1366
19032F739514j37240l01731m56520n33776o09440o20609m73374l28236k33020
19023C045568j61819j03948j03576n1591Q75M0176Q0004l1097j26417k95949k44592
19012B047634k04324j49314j00953p0662m1642j8083n0859k8747P251J1053P2103
19001A473457N0435j1590r6660q5873m5336j9304O8494J27375L0635p388k0266
18990A463979n457K03608J98547J98773J40059j4157q0051L5350K6887J3700P7576
18979B258814M2144q0436k05937r7272o6973P08j94758j83772q8187m3732M874
18968A345473j9884J4246J41716J49214J48352K51497K42444Q6009r3591r4507
$$ plain form
18958 2170969 2062302 1941804 1984055 2175386 2234653 2149144 1962686 1781402 1547716 1304682
18948 1304682 1148635 1084469 1135708 1192974 1135699 1020153 888414 801430 766722 768162 727045
18937 727045 760899 765319 728311 752215 787248 821998 861604 920964 1010407 1059031 1040842 1049880
18925 1049880 1093639 1184630 1236813 1253483 1263939 1164509 990775 916224 886941 835161 767964
18914 767964 674996 647677 623471 609829 600935 583373 674130 677453 648913 588004 616326 796651
18902 796651 1031707 1188080 1180507 1044642 969426 981505 979508 1063277 1120163 1186338 1170925
18891 1170925 1058643 1004033 1088301 1197527 1382711 1686005 2017388 2152807 2004946 1756328
18881 1756328 1545579 1501715 1550589 1633623 1799375 1753813 1502288 1276292 1200149 1148926
$$ packed form
18958B170969j08667j20498M2251J91331N9267q5509j86458j81284k33686k43034
18948A304682j56047o4166N1239N7266n7275j15546j31739q6984l4708J440m1117
18937G27045L3854M420l7008K3904L5033L4750L9606N9360Q9443M8624j8189R038
18925A049880M3759R0991N2183J6670J0456r9430j73734p4551k9283n1780o7197
18914G67964r2968k7319k4206j3642q894j7562R0757L323k8540o0909K8322J80325
18902G96651K35056J56373p573j35865p5216J2079j997Q3769N6886O6175j5413
18891A170925j12282n4610Q4268J09226J85184L03294L31383J35419j47861k48618
18881A756328k10749m3864M8874Q3034J65752m5562k51525k25996p6143n1223
$$ plain form
18871 1148926 985621 932294 893222 838610 870090 873458 867530 889832 976510 971790 935340 971845
18859 971845 1061983 1090438 1119873 1218887 1476456 1695926 1919628 1964967 1750029 1532956
18849 1532956 1487324 1597532 1800050 1954697 1943296 1869415 1746424 1642791 1522791 1364616
18839 1364616 1210768 1220759 1274246 1384082 1418680 1415961 1283748 1063052 901409 752477
18829 752477 668155 716259 706647 748587 797152 786669 769059 820454 846902 906734 975757 1003505
18817 1003505 1030089 1104437 1267677 1437833 1530141 1561966 1629763 1739242 1664628 1624121 1631517
18806 1631517 1646633 1555917 1522333 1543852 1576143 1437113 1336497 1250704 1137141 1022698
18796 1022698 1002604 970335 1033108 1035607 1088076 1149548 1145395 1031163 898397 823156 855521
$$ packed form
18871A148926j63305n3327l9072n4612L1480L368n928K2302Q6678m720l6450L6505
18859I71845R0138K8455K9435R9014K57569K19470K23702M5339k14938k17073
18849A532956m5632J10208K02518J54647j1401p3881j22991j03633j20000j58175
18839A364616j53848R991N3487J09836L4598k719j32213k20696j61643j48932
18829G52477q4322M8104r612M1940M8565j0483j7610N1395K6448N9832O9023K7748
18817A003505K6584P4348J63240J70156R2308L1825O7797J09479p4614m0507P396
18806A631517J5116r0716l3584K1519L2291j39030j00616q5793j13563j14443
18796A022698k0094l2269O2773K499N2469O1472m153j14232j32766p5241L2365
$$ plain form
18785 855521 871737 973213 1024831 989971 870213 742272 682835 702230 646437 645674 629867
18774 629867 644170 699906 770885 820572 915993 989620 1113439 1193161 1206693 1260339 1126814
18763 1126814 960178 880131 782629 744929 737227 767431 888664 969370 1050536 1174399 1217823
18752 1217823 1214469 1170783 1108364 1072247 1053500 1082319 1061137 1043120 1019491 911790 802909
18741 802909 733823 638109 587818 613455 662427 720935 793342 864102 954600 1066729 1160305
18730 1160305 1154961 1087640 1038946 1025716 1035264 1180535 1349245 1378344 1425873 1436699 1354592
18719 1354592 1141312 935955 859743 816993 797761 817780 879799 947456 852379 713604 685554
18708 685554 678541 579292 564884 642789 608925 570621 594442 598075 578893 598894 611537 585501
$$ packed form
18785H55521J6216J01476N1618l4860j19758j27941n9437J9395n5793p63j5807
18774F29867J4303N5736P0979M9687R5421P3627J23819P9722J3532N3646j33525
18763A126814j66636q0047r7502l7700p702L0204J21233Q0706Q1166J23863M3424
18752A217823l354m3686o2419l6117j8747K8819k1182j8017k3629j07701j08881
18741H02909o9086r5714n0291K5637M8972N8508P2407P0760R0498J12129R3576
18730A160305n344o7321m8694j3230R548J45271J68710K9099M7529J0826q2107
18719A354592k13280k05357p6212m2750j9232K0019O2019O7657r5077j38775k8050
18708F85554p013r9249j4408P7905l3864l8304K3821L633j9182K0001J2643k6036
$$ plain form
18696 585501 634824 597056 629559 712996 751041 875958 947834 991344 1010529 990480 973036
18685 973036 995035 989278 987326 984844 1012399 962696 878346 760026 797236 769901 797756 819851
18673 819851 901427 959591 943511 934342 972771 1071856 1130033 1139687 1162907 1148268 1129016 1228800
18661 1228800 1345224 1434601 1625215 1874845 2225357 2552402 2768602 2855401 2695452 2413954
18651 2413954 2069247 1752460 1452974 1262778 1047161 880114 859098 741171 678535 746362
18641 746362 817533 859180 814863 783144 805867 879833 943373 910421 814967 709597 638153
18630 638153 680346 684506 675671 745273 737011 702009 730285 688713 689358 671616 691788 710840
18618 710840 777257 881817 968336 1011238 966616 926479 972510 1045007 1035147 947345 870495
$$ packed form
18696E85501M9323l7768L2503Q3437L8045J24917P1876M3510J9185k0049j7444
18685I73036K1999n757j952k482K7555m9703q4350j18320L7210k7335K7855K2095
18673H19851Q1576N8164j6080r169L8429R9085N8177R654K3220j4639j9252R9784
18661A228800J16424Q9377J90614K49630L50512L27045K16200Q6799j59949k81498
18651B413954l44707l16787k99486j90196k15617j67047k1016j17927o2636O7827
18641G46362P1171M1647m4317l1719K2723P3966O3540l2952r5454j05370p1444
18630F38153M2193M160q835O9602q262l5002K8276m1572O45j7742K0172J9052
18618G10840O6417J04560Q6519M2902m4622m0137M6031P2497r860q7802p6850
$$ plain form
18607 870495 791997 801736 865988 878105 899124 945124 886721 761888 773725 785651 809187
18596 809187 850102 911445 902262 914131 885963 857235 883091 893009 1027152 1223664 1318822
18585 1318822 1410836 1394268 1297180 1174140 1134318 1118740 1122671 1199893 1262415 1299796 1225716
18574 1225716 1036635 952683 874563 873740 889714 894152 910524 877901 893764 879063 897417 862700
18562 862700 840505 860277 894951 995244 1036050 1080729 1116915 1173420 1276291 1279541 1083051
18551 1083051 903045 816270 817901 947376 1106300 1218597 1276995 1183609 1061603 981853
18541 981853 857742 778638 704507 726998 721029 752233 857591 865121 822163 749391 750304 730425
18529 730425 687784 663355 683766 648572 669641 711066 701920 648641 576990 583133 588329 596994
$$ packed form
18607H70495p8498R739O4252J2117K1019M6000n8403j24833J1837J1926K3536
18596H09187M0915O1343r183J1869k8168k8728K5856R918J34143J96512R5158
18585A318822R2014j6568r7088j23040l9822j5578L931P7222O2522L7381p4080
18574A225716j89081q3952p8120q23J5974M438J6372l2623J5863j4701J8354l4717
18562H62700k2195J9772L4674J00293M0806M4679L6186N6505J02871L250j96490
18551A083051j80006q6775J631J29475J58924J12297N8398r3386j22006p9750
18541I81853j24111p9104p4131K2491n969L1204J05358P530m2958p2772R13j9879
18529G30425m2641k4429K0411l5194K1069M1425r146n3279p1651O143N196Q665
$$ plain form
18517 596994 698413 760513 676902 593774 656361 695935 734995 769114 761856 733009 759221
18506 759221 780423 819850 815296 832877 918765 977329 1019355 1009341 1025011 1005299 1001407 1017585
18494 1017585 1042872 1061202 1017722 1088103 1124047 1146370 1086313 1004886 1024512 973762 964670
18483 964670 956719 913408 918273 904408 902348 998482 1045739 1061689 1081427 1042922 938270 991621
18471 991621 1018216 1061898 1083601 1115026 1080543 1088635 1073128 989010 992467 954403 910331 877583
18459 877583 886568 923802 977578 973227 929731 970610 1008265 1048859 1044039 1009089 989244 964354
18447 964354 945097 912071 937207 1006791 975177 1013355 1059050 1035418 998181 1008660 966538
18436 966538 957149 980205 993846 992588 943893 925225 920478 912933 866441 826166 805811 885952
$$ packed form
18517E96994J01419O2100q3611q3128O2587L9574L9060L4119p258k8847K6212
18506G59221K1202L9427m554J7581Q5888N8564M2026j0014J5670j9712l892J6178
18494A017585K5287J8330m3480P0381L5944K2323o0057q1427J9626n0750r092
18483I64670p951m3311M865j3865k060R6134M7257J5950J9738l8505j04652N3351
18471I91621K6595M3682K1703L1425l4483Q092j5507q4118L457l8064m4072l2748
18459H77583Q985L7234N3776m351m3496M0879L7655M0594m820l4950j9845k4890
18447I64354j9257l3026K5136O9584l1614L8178M5695k3632l7237J0479m2122
18436I66538r389K3056J3641j258m8695j8668m747p545m6492m0275k0355Q0141
$$ plain form
18424 885952 926732 976350 1011203 1006814 1007019 980070 1005264 978343 962848 946405 904484 885349
18412 885349 956070 1002531 1037613 1034151 1027598 997134 1009300 1050651 1050087 1074840 1162135 1248273
18400 1248273 1266274 1266343 1327947 1373354 1352381 1283203 1346112 1466521 1582194 1715214 1821653
18389 1821653 1914625 1947152 1888381 1744853 1600991 1580332 1654417 1735120 1755587 1688260 1623629
18378 1623629 1640341 1714658 1735511 1723209 1783641 1855387 1931606 1948543 1963880 2150794 2312857
18367 2312857 2469697 2478467 2348391 2241545 2172790 2154686 2251241 2392848 2536897 2712060
18357 2712060 2950236 3048862 2869105 2623314 2543430 2453669 2352649 2376740 2453403 2492799
18347 2492799 2488578 2463531 2411945 2369714 2327844 2391890 2535853 2606923 2663236 2771830 2925622
$$ packed form
18424H85952M0780M9618L4853m389K05k6949K5194k6921j5495j6443m1921j9135
18412H85349P0721M6461L5082l462o553l0464J2166M1351n64K4753Q7295Q6138
18400A248273J8001O9O1604M5407k0973o9178O2909J20409J15673J33020J06439
18389A821653R2972L2527n8771j43528j43862k0659P4085Q0703K0467o7327o4631
18378A623629J6712P4317K0853j2302O0432P1746P6219J6937J5337J86914J62063
18367B312857J56840Q770j30076j06846o8755j8104R6555J41607J44049J75163
18357B712060K38176R8626j79757k45791p9884q9761j01020K4091P6663L9396
18347B492799m221k5047n1586m2231m1870O4046J43963P1070N6313J08594J53792
$$ plain form
18336 2925622 3142430 3415952 3582769 3472608 3315358 3194055 3164186 3264733 3294553 3429950
18326 3429950 3631076 3909695 4277952 4577923 4697473 4690883 4522235 4221299 3917405 3738608
18316 3738608 3617158 3547343 3462022 3353619 3326155 3196971 3161034 3129330 3082824 3093791 3172331
18305 3172331 3217250 3266331 3309527 3355155 3506161 3610972 3701607 3786927 3913964 4042636
18295 4042636 4231257 4406639 4625455 4852295 4947739 5032737 5281584 5579979 5929157 6342215
18285 6342215 6777208 7120320 7349563 7640387 8081584 8675001 9427224 10168222 10887479
18276 10887479 11700169 12516083 13460297 14542127 15724627 17030657 18521955 20294268
18268 20294268 22396517 24658568 26847830 29033442 31097190 33204597 35908312 39657246
$$ packed form
18336B925622K16808K73522J66817j10161j57250j21303k9869J00547K9820J35397
18326C429950K01126K78619L68257K99971J19550o590j68648l00936l03894j78797
18316C738608j21450o9815q5321j08403k7464j29184l5937l1704m6506J0967P8540
18305C172331M4919M9081M3196M5628J51006J04811R0635Q5320J27037J28672
18295D042636J88621J75382K18816K26840R5444Q4998K48847K98395L49178M13058
18285F342215M34993L43112K29243K90824M41197N93417P52223P40998P19257
18276A0887479Q12690Q15914R44214J081830J182500J306030J491298J772313
18268B0294268K102249K262051K189262K185612K063748K107407K703715L748934
$$ plain form
18260 39657246 44797028 52267845 63827852 81010805 103026296 125141447 136010429
18253 136010429 127121726 108939617 99500282 106111322 126967966 155104010 176138581
18246 176138581 169759437 135583021 98082915 73274075 59921410 53488037 50691526
18239 50691526 49875192 50682682 52856736 56105616 59890097 63589287 66965575 70494112
18231 70494112 74733427 80742736 89907672 103738192 125083372 157427082 201647355
18224 201647355 252356757 289873640 294178911 268695351 232372628 215139541 230334830
18217 230334830 270766108 316728198 333336734 299986679 232558162 166636275 122719881
18210 122719881 97411122 83235850 75314142 71434961 71081635 74747021 84166821 101684236
$$ packed form
18260C9657246N139782P470817J1560007J7182953K2015491K2115151J0868982
18253A36010429q888703j8182109r439335O611040K0856644K8136044K1034571
18246A76138581o379144l4176416l7500106k4808840j3352665o433373k796511
18239E0691526q16334Q07490K174054L248880L784481L699190L376288L528537
18231G0494112M239315O009309R164936J3830520K1345180L2343710M4220273
18224B01647355N0709402L7516883M305271k5483560l6322723j7233087J5195289
18217B30334830M0431278M5962090J6608536l3350055o7428517o5921887m3916394
18210A22719881k5308759j4175272p921708l879181l53326L665386R419800J7517415
$$ plain form
18202 101684236 128142706 161799412 192948998 202868005 191235742 163338464 129027482
18195 129027482 107587293 102118931 106516393 109330819 102780888 88403935 67054001
18188 67054001 46849182 33287012 25093624 20165918 17011349 14801951 13099358 11578426
18180 11578426 10324096 9269258 8282216 7417757 6607826 5983010 5488962 5200420 5049236
18171 5049236 4905242 4647499 4356915 4142394 3972980 3808906 3662132 3492048 3271100
18162 3271100 3057669 2974800 2938474 3014778 3010807 2898975 2682710 2507647 2401845 2319381
18152 2319381 2303536 2356079 2433574 2487649 2489168 2518626 2645530 2771662 2876668 3076377 3405507
18141 3405507 3782708 4124927 4321888 4393152 4400638 4457264 4610436 4988208 5551868 6086018
$$ packed form
18202A01684236K6458470L3656706L1149586R919007j1632263k7897278l4310982
18195A29027482k1440189n468362M397462K814426o549931j4376953k1349934
18188F7054001k0204819j3562170q193388m927706l154569k209398j702593j520932
18180A1578426j254330j054838r87042q64459q09931o24816m94048k88542j51184
18171E049236j43994k57743k90584k14521j69414j64074j46774j70084k20948
18162C271100k13431q2869l6326P6304l971j11832k16265j75063j05802q2464
18152B319381j5845N2543P7495N4075J519K9458J26904J26132J05006J99709L29130
18141C405507L77201L42219J96961P1264P486N6626J53172L77772N63660N34150
$$ plain form
18131 6086018 6557209 6843643 7099220 7370210 7753604 8328064 8937125 9588072 10331177
18122 10331177 11252983 12430872 13728705 14850846 15784874 16597506 17455123 18624079 20393143
18113 20393143 23216896 27999199 36514658 52055585 75682550 102199122 124900704
18106 124900704 114751183 76458715 47553041 31115140 22161483 17172854 14307302
18099 14307302 12484762 11089517 9968068 9160298 8625907 8267379 7939963 7460017 6958994
18090 6958994 6386409 5805069 5350976 5120211 5083743 5084117 5245816 5452967 5681338 5900129
18080 5900129 6198861 6636232 7191117 7822656 8545295 9291724 9968087 10487814 10989162
18071 10989162 11466282 11984253 12689781 13437669 14236556 15255151 16553429 18155783 19958279
$$ packed form
18131F086018M71191K86434K55577K70990L83394N74460O09061O50947P43105
18122A0331177R21806J177889J297833J122141R34028Q12632Q57617J168956J769064
18113B0393143K823753M782303Q515459J5540927K3626965K6516572K2701582
18106A24900704j0149521l8292468k8905674j6437901q953657m988629k865552
18099A4307302j822540j395245j121449q07770n34391l58528l27416m79946n01023
18090F958994n72585n81340m54093k30765l6468L74J61699K07151K28371K18791
18080E900129K98732M37371N54885O31539P22639P46429O76363N19727N01348
18071A0989162M77120N17971P05528P47888P98887J018595J298278J602354J802496
$$ plain form
18062 19958279 21999331 24259205 26791043 29610119 32588351 35796210 39439088 43588797
18054 43588797 48283491 53288057 58447963 63774796 69208263 74899167 81462812 89930781
18046 89930781 102108196 120758258 149714217 192019915 248023165 310916198 364997646
18039 364997646 395959247 393157719 353766510 291419454 222570407 159920359 112988851
18032 112988851 81668832 61176211 47489074 37992968 31114534 25866171 21894470
18025 21894470 18835229 16468087 14614767 13030704 11829488 10942319 10223983 9643603
18017 9643603 8901053 7836839 6894890 6212468 5725883 5512896 5435271 5389732 5571890 5717942
18007 5717942 5700917 5780094 5907087 5912079 5698726 5388198 4966476 4544916 4127409 3831067
$$ packed form
18062A9958279K041052K259874K531838K819076K978232L207859L642878M149709
18054D3588797M694694N004566N159906N326833N433467N690904O563645Q467969
18046H9930781J2177415J8650062K8955959M2305698N6003250O2893033N4081448
18039C64997646L0961601k801528l9391209o2347056o8849047o2650048m6931508
18032A12988851l1320019k0492621j3687137r496106o878434n248363l971701
18025B1894470l059241k367142j853320j584063j201216q87169p18336n80380
18017I643603p42550j064214r41949o82422m86585k12987p7625m5539J82158J46052
18007E717942j7025P9177J26993M992k13353l10528m21722m21560m17507k96342
$$ plain form
17997 3831067 3637255 3524284 3530148 3533132 3561663 3447138 3205327 3035880 3059844 3261765
17987 3261765 3569749 3834697 3770638 3758011 3870970 3981454 3957501 3706422 3316759 2899130
17977 2899130 2516911 2253950 1982758 1815124 1731218 1602662 1473781 1468413 1572388 1574672
17967 1574672 1512576 1550097 1656333 1753242 1978871 2204542 2140733 1849866 1723753 1642221
17957 1642221 1511245 1433289 1455198 1408910 1352103 1289327 1294103 1389161 1460054 1525418 1496854
17946 1496854 1385549 1301992 1231023 1208477 1292032 1260585 1197166 1125593 1020188 1032067 1058171
17935 1058171 1114340 1177963 1224530 1253856 1215368 1226525 1289512 1330510 1394391 1461517 1540212
17924 1540212 1696733 1856312 1858780 1690980 1526653 1356700 1257157 1193824 1192149 1264474 1307270
$$ packed form
17997C831067j93812j12971N864K984K8531j14525k41811j69447K3964K01921
17987C261765L07984K64948o4059j2627J12959J10484k3953k51079l89663m17629
17977B899130l82219k62961k71192j67634q3906j28556j28881n368J03975K284
17967A574672o2096L7521J06236R6909K25629K25671o3809k90867j26113q1532
17957A642221j30976p7956K1909m6288n6807o2776M776R5058P0893O5364k8564
17946A496854j11305q3557p0969k2546Q3555l1447o3419p1573j05405J1879K6104
17935A058171N6169O3623M6567K9326l8488J1157O2987M0998O3881O7126P8695
17924A540212J56521J59579K468j67800j64327j69953r9543o3333j675P2325M2796
$$ plain form
17913 1307270 1375710 1447434 1482357 1535918 1597637 1679454 1663219 1602125 1626122 1679650 1823462
17902 1823462 1944270 2075479 2222860 2408977 2562493 2549453 2454682 2443043 2522203 2660366
17892 2660366 2914235 3171885 3321222 3456336 3645973 4025962 4509441 4827776 4821582 4864736
17882 4864736 5063300 5458329 6106711 6786552 7610995 8470941 9223298 10074477 10946970
17873 10946970 11753967 12638503 13631613 14728098 15859764 17312522 19103117 21060814
17865 21060814 22813433 24262789 25673336 27221461 29096139 31834563 36331784 43988264
17857 43988264 57506615 80810807 114266838 150904976 178896324 162678157 114167637
17850 114167637 76571731 54417203 42419053 35984154 32444277 30639989 30089440 30555910
$$ packed form
17913A307270O8440P1724L4923N3561O1719Q1817j6235o1094K3997N3528J43812
17902A823462J20808J31209J47381J86117J53516j3040r4771j1639P9160J38163
17892B660366K53869K57650J49337J35114J89637L79989M83479L18335o194M3154
17882D864736J98564L95029O48382O79841Q24443Q59946P52357Q51179Q72493
17873A0946970Q06997Q84536R93110J096485J131666J452758J790595J957697
17865B1060814J752619J449356J410547J548125J874678K738424M497221P656480
17857D3988264J3518351K3304192L3456031L6638138K7991348j6218167m8510520
17850A14167637l7595906k2154528j1998150o434899l539877j804288n50549M66470
$$ plain form
17842 30555910 31497180 32425449 33431863 34736755 36457791 38995063 43020193 49314519
17834 49314519 58965107 74799137 99719834 130833473 161007740 171179895 140058761
17827 140058761 104182510 85503346 84170681 98549447 123299367 149873414 160576236
17820 160576236 128485167 86746890 58939687 42915375 34096839 29071433 25968578
17813 25968578 24253813 23626175 23490965 23483165 23446922 23559666 23850103 24621861 26201608
17804 26201608 29140127 34128724 42821199 58380311 82227893 109403338 132253361
17797 132253361 124766090 86657164 54698053 35188062 24113119 17773797 13979218
17790 13979218 11485572 9809043 8485024 7134291 6085042 5434729 4989674 4838891
$$ packed form
17842C0555910R41270R28269J006414J304892J721036K537272M025130O294326
17834D9314519R650588J5834030K4920697L1113639L0174267J0172155l1121134
17827A40058761l5876251j8679164j332665J4378766K4749920K6574047J0702822
17820A60576236l2091069m1738277k7807203j6024312q818536n025406l102855
17813B5968578j714765o27638j35210p800l6243J12744K90437P71758J579747
17804B6201608K938519M988597Q692475J5559112K3847582K7175445K2850023
17797A32253361p487271l8108926l1959111j9509991j1074943o339322l794579
17790A3979218k493646j676529j324019j350733j049249o50313m45055j50783
$$ plain form
17782 4838891 4904797 4876224 4694931 4377900 3970164 3717342 3649190 3655986 3395030 2907885
17772 2907885 2408326 1995287 1764127 1700074 1797759 1936404 1952963 1807539 1433273 1039326
17762 1039326 771709 642248 560262 541882 536010 563283 530620 432435 365776 283303 250609
17751 250609 197315 141632 126091 224868 286378 307968 304860 270195 266843 284702 287043 284637
17739 284637 281074 238867 295291 335371 296310 286079 200877 196722 152458 148513 15305 -142584
17727 -142584 -173284 -139568 -65794 -47376 -61376 -41427 -52277 -40704 7780 34889 51028
17716 51028 57639 57038 144248 152168 185086 233231 198354 250576 259859 281286 301347 375656 425165
17703 425165 437073 530482 709392 962746 1343945 1747624 2034886 2118792 1929806 1612363
$$ packed form
17782D838891O5906k8573j81293l17031m07736k52822o8152O796k60956m87145
17772B907885m99559m13039k31160o4053R7685J38645J6559j45424l74266l93947
17762A039326k67617j29461q1986j8380n872K7273l2663r8185o6659q2473l2694
17751B50609n3294n5683j5541R8777O1510K1590l108l4665l352J7859K341k406
17739B84637l563m2207N6424M0080l9061j0231q5202m155m4264l945j33208j57889
17727a42584l0700L3716P3774J8418j4000J9949j0850J1573M8484K7109J6139
17716E1028O611o01Q7210P920L2918M8145l4877N2222R283K1427K0061P4309M9509
17703D25165J1908R3409J78910K53354L81199M03679K87262Q3906j88986l17443
$$ plain form
17693 1612363 1365222 1129479 994686 854492 885702 980054 1025676 1164191 1241884 1208279
17683 1208279 1130323 1005378 998587 1234410 1475019 1667488 1886692 2110897 2244466 2240543
17673 2240543 1946328 1595414 1423861 1282165 1220161 1376222 1568019 1935143 2221716 2426926
17663 2426926 2557885 2417062 2087098 1774232 1645145 1671665 1812881 2046113 2129439 2068176
17653 2068176 1836596 1533227 1314024 1241589 1307210 1457648 1505549 1539041 1485167 1368488
17643 1368488 1361293 1378477 1442823 1390989 1262507 1186668 1194874 1171814 1095872 990373 870793
17632 870793 757857 627338 559516 606443 588062 584995 649314 803465 992080 1016971 886397
17621 886397 779043 705664 739357 869401 991508 997511 1039190 1032552 921707 864322 841819
$$ packed form
17693A612363k47141k35743j34793j40194L1210R4352M5622J38515P7693l3605
17683A208279p7956j24945o791K35823K40609J92469K19204K24205J33569l923
17673B240543k94215l50914j71553j41696o2004J56061J91797L67124K86573K05210
17663B426926J30959j40823l29964l12866j29087K6520J41216K33232Q3326o1263
17653B068176k31580l03369k19203p2435O5621J50438M7901L3492n3874j16679
17643A368488p195J7184O4346n1834j28482p5839Q206k3060p5942j05499j19580
17632H70793j12936j30519o7822M6927j8381l067O4319J54151J88615K4891j30574
17621H86397j07354p3379L3693J30044J22107O003M1679o638j10845n7385k2503
$$ plain form
17610 841819 768988 765634 888036 1019010 1210344 1382255 1219115 1000095 867775 781530
17600 781530 623600 545007 507040 454976 353717 307073 322511 318942 343029 352047 267743
17589 267743 137792 37235 -10740 -36316 -2114 33695 32458 85939 135821 171348 151999
17578 151999 11550 -69276 -97657 -23009 42110 76412 101044 126994 44411 37311 42766 46971
17566 46971 121958 189691 142174 131977 170368 190088 265133 310823 349809 353677 298661 143814
17554 143814 43269 -12101 -11986 -40639 7709 40257 116389 152181 134276 150922 150098 95595
17542 95595 64740 33004 -50794 -45901 6350 31552 21976 68644 78509 -13711 40522 135389
17530 135389 129092 97163 142255 220543 217833 287187 304749 221977 148992 51619 10696 50189
$$ packed form
17610H41819p2831l354J22402J30974J91334J71911j63140k19020j32320q6245
17600G81530j57930p8593l7967n2064j01259m6644J5438l569K4087R018q4304
17589B67743j29951j00557m7975k5576L4202L5809j237N3481M9882L5527j9349
17578A51999j40449q0826k8381P4648O5119L4302K4632K5950q2583p100N455M205
17566D6971P4987O7733m7517j0197L8391J9720P5045M5690L8986L868n5016j54847
17554A43814j00545n5370J15k8653M8348L2548P6132L5792j7905J6646q24n4503
17542I5595l0855l1736q3798M893N2251K5202r576M6668R865r2220N4233R4867
17530A35389o297l1929M5092P8288k710O9354J7562q2772p2985r7373m0923L9493
$$ plain form
17518 50189 75578 79800 65319 7128 -4061 60325 65905 108158 192417 101910 57676 50446
17506 50446 20467 7254 29770 8937 45615 104625 67886 -4134 -51769 -42805 -33278 33128
17494 33128 -28695 -90511 -108958 -73632 -55770 -33495 26426 1323 -39166 -77935 -120853 -179461
17482 -179461 -150843 -132462 -86597 -50262 788 21862 -3986 -79012 -101651 -61399 -1909
17471 -1909 50135 11033 -17336 -46745 -64454 -27316 62335 95259 31644 55251 74478 115074
17459 115074 167024 129097 106461 85130 58597 58375 10317 -28370 -49196 -4884 70373 66333
17447 66333 65565 65750 118502 173373 291123 373198 594969 736519 643099 490064 349736
17436 349736 262995 184438 208163 196049 203240 233753 257387 344805 409793 460983 436745 448707
$$ packed form
17518E0189K5389M222j4481n8191j1189O4386N580M2253Q4259r0507m4234p230
17506E0446k9979j3213K2516k0833L6678N9010l6739p2020m7635Q964R527O6406
17494C3128o1823o1816j8447L5326J7862K2275N9921k5103m0489l8769m2918n8608
17482a79461K8618J8381M5865L6335N1050K1074k5848p5026k2639M0252N9490
17471a909N2044l9102k8369k9409j7709L7138Q9651L2924o3615K3607J9227M0596
17459A15074N1950l7927k2636k1331k6533k22m8058l8687k0826M4312P5257m040
17447F6333p68J85N2752N4871J17750Q2075K21771J41550r3420j53035j40328
17436C49736q6741p8557K3725j2114P191L0513K3634Q7418O4988N1190k4238J1962
$$ plain form
17424 448707 435933 418692 542824 809538 1107995 1372534 1657085 1930771 2087469 1999995
17414 1999995 1771694 1436645 1048595 777679 531611 390897 308839 246167 222124 212731
17404 212731 198435 91094 -44969 -154230 -201270 -191942 -93272 103947 46196 -37839 3996
17393 3996 46553 26885 -25017 -29834 -93664 -30073 2195 28084 65671 43419 -11580 -74629
17381 -74629 -51137 -75944 -131160 -173210 -138045 -139386 -126531 -159768 -157206 -135258 -136256 -143024 -147415
17368 -147415 -66117 -2896 -39486 -71190 -72493 -157674 -168238 -192677 -175221 -174410 -158141 -103182
17356 -103182 -128208 -79352 -92880 -169000 -223901 -256844 -207029 -130060 -97969 -124275 -130905 -128147
17344 -128147 -158645 -196507 -161953 -109125 -66721 -85202 -87189 -60778 -109995 -87550 -64760 -63118
$$ packed form
17424D48707j2774j7241J24132K66714K98457K64539K84551K73686J56698q7474
17414A999995k28301l35049l88050k70916k46068j40714q2058o2672k4043r393
17404B12731j4296j07341j36063j09261m7040R328R8670J97219n7751q4035M1835
17393C996M2557j9668n1902m817o3830O3591L2268K5889L7587k2252n4999o3049
17381g4629K3492k4807n5216m2050L5165j341J2855l3237K562K1948r98o768m391
17368a47415Q1298O3221l6590l1704j303q5181j0564k4439J7456Q11J6269N4959
17356a03182k5026M8856j3528p6120n4901l2943M9815P6969L2091k6306o630K758
17344a28147l0498l7862L4554N2828M2404j8481j987K6411m9217K2445K2790J642
$$ plain form
17332 -63118 -21838 22466 82467 107822 143348 161930 217984 251371 173307 227331 287622 275889
17320 275889 259929 219862 307613 411432 521296 666571 619381 420543 264066 215682
17310 215682 134088 58671 56234 119789 105613 92459 187872 321908 364210 312993 205700
17299 205700 199124 236070 219375 309904 408059 440542 578680 772694 852447 679625 432980
17288 432980 259308 293772 378938 472171 584793 583501 509994 388463 272711 120901 1079
17277 1079 -18016 56754 68350 29843 -32440 12873 28668 2220 3779 -292 -8712 43041
17265 43041 87402 124274 215505 345425 512543 656532 621616 411092 278809 182955 114064
17254 114064 106278 41462 -16940 6080 21037 71333 75923 36055 74507 136842 100669 84782
$$ packed form
17332f3118M1280M4304O0001K5355L5526J8582N6054L3387p8064N4024O0291j1733
17320B75889j5960m0067Q7751J03819J09864J45275m7190j98838j56477m8384
17310B15682q1594p5417k437O3555j4176j3154R5413J34036M2302n1217j07293
17299B05700o576L6946j6695R0529R8155L2483J38138J94014P9753j72822k46645
17288D32980j73672L4464Q5166R3233J12622j292p3507j21531j15752j51810j19822
17277A079j9095P4770J1596l8507o2283M5313J5795k6448J559m071q420N1753
17265D3041M4361L6872R1231J29920J67118J43989l4916k10524j32283r5854o8891
17254A14064p786o4816n8402K3020J4957N0296M590l9868L8452O2335l6173j5887
$$ plain form
17242 84782 57312 94760 111148 111268 165860 150850 54967 -11224 -114819 -125030 -78451 38353
17230 38353 129385 76337 2400 -7821 -14949 -69857 -63897 -105613 -118936 -145657 -122571 -90015
17218 -90015 -99275 -93395 -131951 -138607 -135419 -93492 -68301 796 35457 6625 -4272 -65466
17206 -65466 -80737 -65504 -81855 -108883 -114572 -111214 -68212 -16415 -6810 55606 63025 55381 83011
17193 83011 51601 747 -31351 -63699 -31779 -45063 -95997 -120013 -63574 -57299 -45435 -43009
17181 -43009 -33108 14538 34515 50780 33159 -72991 -116968 -129766 -104047 -78719 -124680 -120221
17169 -120221 7551 -8713 -82316 -52835 58223 11063 -27830 -46048 -43961 -98466 -74150
17158 -74150 -48344 -57594 -102655 -121508 -145364 -47383 -11989 -81082 -68912 -68909 -56117 -36332 -31313
$$ packed form
17242H4782k7470L7448J6388J20N4592j5010r5883o6191j03595j0211M6579J16804
17230C8353R1032n3048p3937j0221p128n4908N960m1716j3323k6721K3086L2556
17218i0015r260N880l8556o656L188M1927K5191O9097L4661k8832j0897o1194
17206f5466j5271J5233j6351k7028n689L358M3002N1797R605O2416P419p644K7630
17193H3011l1410n0854l2098l2348L1920j3284n0934k4016N6439O275J1864K426
17181d3009R901M7646J9977J6265j7621j06150m3977j2798K5719K5328m5961M459
17169a20221J27772j6264p3603K9481J11058m7160l8893j8218K087n4505K4316
17158g4150K5806r250m5061j8853k3856R7981L5394o9093J2170LJ2792J9785N019
$$ plain form
17145 -31313 -46539 -67675 -83006 -109034 -148231 -196258 -162991 -139133 -58498 -10603 -33977 -7016
17133 -7016 22138 20145 -16064 -10629 -107603 -102585 -68843 -104746 -97870 -60582 -67662 -82239 -54189
17120 -54189 -67598 -141236 -124639 -100080 -65223 -60025 -104685 -159825 -130017 -94045 -129347 -155420
17108 -155420 -155850 -110465 -154088 -235013 -165246 -162206 -177773 -96639 -124234 -124473 -111174 -120704 -74383
17095 -74383 -80547 -114139 -143500 -154723 -96487 -103830 -176022 -139017 -77347 -106775 -133200 -136068
17083 -136068 -123216 -104609 -68057 -112841 -191423 -149167 -111429 -22057 -33639 -86447 -121235
17072 -121235 -161218 -194037 -185274 -131178 -164101 -166756 -193431 -181619 -146055 -171350 -262548 -244151
17060 -244151 -178928 -109903 -125166 -134224 -168625 -165116 -200142 -183180 -188674 -146304 -147400 -162019
$$ packed form
17145c1313j5226k1136j5331k6028l9197m8027L3267K3858Q0635M7895k3374K6961
17133g016K9154j993l6209N435r6974N018L3742l5903O876L7288p080j4577K8050
17120e4189j3409p3638J6597K4559L4857N198m4660n5140K9808L5972l5302k6073
17108a55420m30M5385m3623q0925O9767L040j5567Q1134k7595k39J3299r530M6321
17095g4383o164l3592k9361j1223N8236p343p2192L7005O1670k9428k6425k868
17083a36068J2852J8607L6552m4784p8582M2256L7738Q9372j1582n2808l4788
17072a21235l9983l2819Q763N4096l2923k655k6675J1812L5564k5295r1198J8397
17060b44151O5223O9025j5263r058l4401L509l5026J6962n494M2370j096j4619
$$ plain form
17048 -162019 -208846 -164199 -155613 -148474 -205002 -165160 -137429 -62849 -83320 -79240 -107091 -137867
17036 -137867 -182866 -173763 -195332 -181484 -153012 -198244 -235365 -198148 -172528 -151509 -151273 -146854
17024 -146854 -160333 -188412 -177148 -171416 -181177 -110898 -112021 -187383 -217445 -250321 -259184 -270113
17012 -270113 -162913 -119268 -58790 -91321 -151921 -208115 -246345 -240871 -188196 -160045 -164299 -176511
17000 -176511 -198314 -143739 -130263 -128578 -109822 -105990 -77567 -152177 -198110 -208258 -166163 -129946
16988 -129946 -116667 -139830 -124414 -70249 -114464 -111092 -116180 -131961 -70420 -61746 -86130 -86777
16976 -86777 -151336 -187810 -118158 -29229 -44147 -86341 -119934 -156517 -99349 -59960 -81247 -71554
16964 -71554 -87409 -95323 -165508 -97376 -121294 -168501 -174660 -150126 -129607 -114268 -92868 -103155
$$ packed form
17048a62019m6827M4647Q586P139n6528L9842K7731P4580k0471M080k7851l0776
17036a37867m4999R103k1569J3848K8472m5232l7121L7217K5620K1019K36M419
17024a46854j3479k8079J1264N732r761P0279j123p5362l0062l2876q863j0929
17012b70113J07200M3645O0478l2531o0600n6194l8230N474N2675K8151m254j2212
17000a76511k1803N4575J3476J685J8756L832K8423p4610m5933j0148M2095L6217
16988a29946J3279k3163J5416N4165m4215L372n088j5781O1541Q674k4384o47
16976h6777o4559l6474O9652Q8929j4918m2194l3593l6583N7168L9389k1287R693
16964g1554j5855p914p0185O8132k3918m7207o159K4534K0519J5339K1400j0287
$$ plain form
16952 -103155 -136220 -127716 -116231 -69933 -150204 -135177 -64092 -102992 -99870 -20265 10482 24595
16940 24595 -46363 -81066 -77126 -50958 -35240 -64132 -81599 -49736 6650 -37823 -119255 -134554
16928 -134554 -141499 -118651 -147339 -139074 -171544 -178812 -150949 -168817 -210491 -268102 -285859 -208352
16916 -208352 -121915 -172056 -219553 -251473 -241363 -257922 -283120 -283973 -236195 -174168 -148400 -125178
16904 -125178 -147215 -182128 -148526 -163749 -216998 -258822 -214467 -158282 -141032 -184289 -194502
16893 -194502 -187269 -163544 -124637 -111903 -133156 -67672 -60026 -56375 -893 -19814 -10846 -150204
16881 -150204 -165614 -121554 -120852 -143047 -159693 -102716 -121628 -156877 -177744 -193959 -146778 -183577
16869 -183577 -183368 -160170 -175299 -162087 -176661 -170495 -185956 -129738 -148145 -137511 -117252 -121724
$$ packed form
16952a03155l3065Q504J1485M6298q0271J5027P1085l8900L122P9605L0747J4113
16940B4595p0958l4703L940K6168J5718k8892j7467L1863N6386m4473q1432j5299
16928a34554o945K2848k8688Q265l2470p268K7863j7868m1674n7611j7757P7507
16916b08352Q6437n0141m7497l1920J0110j6559k5198q53M7778O2027K5768K3222
16904a25178k2037l4913L3602j5223n3249m1824M4355N6185J7250m3257j0213
16893a94502P233K3725L8907J2734k1253O5484P646L651N5482j8921Q968j39358
16881a50204j5410M4060P02k2195j6646N6977j8912l5249k0867j6215M7181l6799
16869a83577K09K3198j5129J3212j4574O166j5461N6218j8407J0634K0259m472
$$ plain form
16857 -121724 -129855 -117461 -117233 -97364 -111866 -172596 -163670 -148512 -152981 -131767 -183873 -207227
16845 -207227 -219102 -154227 -148292 -118396 -157821 -125061 -180071 -197564 -146888 -103989 -208606
16834 -208606 -275597 -247523 -213437 -202108 -187969 -205277 -180382 -159190 -191133 -143863 -100233
16823 -100233 -107653 -142072 -175764 -249220 -222381 -167082 -202238 -285394 -276240 -203585 -142784 -165874
16811 -165874 -206615 -237140 -262104 -252529 -134030 -92420 -119606 -146536 -136846 -142546 -155314 -127847
16799 -127847 -80753 -102662 -107061 -71934 -32965 -107451 -155378 -212203 -220613 -209822 -212653 -204711
16787 -204711 -180346 -149666 -84608 -59468 -113986 -172484 -198406 -198779 -204359 -168408 -145465 -139784
16775 -139784 -125497 -149842 -162090 -107676 -102766 -172688 -189154 -146854 -204966 -187162 -194941 -219970
$$ packed form
16857a21724q131J2394K28J9869j4502o0730Q926J5158m469K1214n2106k3354
16845b07227j1875O4875N935K9896l9425L2760n5010j7493N0676M2899j04617
16834b08606o6991K8074L4086J1329J4139j7308K4895K1192l1943M7270M3630
16823a00233p420l4419l3692p3456K6839N5299l5156q3156R154P2655O0801k3090
16811a65874m0741l0525k4964R575J18499M1610k7186k6930R690n700j2768K7467
16799a27847M7094k1909m399L5127L8969p4486m7927n6825q410J0791k831P942
16787b04711K4365L0680O5058K5140n4518n8498k5922l73n580L5951K2943N681
16775a39784J4287k4345j2248N4414M910o9922j6466M2300n8112J7804p779k5029
$$ plain form
16763 -219970 -176934 -105838 -134620 -124219 -145687 -163314 -119959 -56758 -114588 -139805 -173307
16752 -173307 -183319 -136874 -19347 -29367 -53927 -25226 -15632 -7271 -72883 -113514 -76351 -34663
16740 -34663 -64693 -95906 -87003 -78362 -111076 -96395 -126962 -100611 -71594 -140229 -197146 -196379
16728 -196379 -166876 -66057 -12306 4441 6809 -23203 -42779 -124712 -195072 -141807 -120586
16717 -120586 -97221 -117288 -153288 -160486 -162758 -120025 -71583 -80671 -169307 -199026 -147303 -133262
16705 -133262 -159532 -176958 -153889 -179598 -201026 -223841 -189148 -142635 -102067 -88978 -110003
16694 -110003 -113091 -37245 4651 41600 73958 -2276 -52707 -65181 -56741 -115564 -153326 -137831
16682 -137831 -91473 -67894 -55084 -47954 -29630 -40031 -24591 -18283 -82126 -47365 -29976 -74197
$$ packed form
16763b19970M3036P1096k8782J0401k1468j7627M3355O3201n7830k5217l3502
16752a73307j0012M6445J17527j0020k4560K8701R594Q361o5612m0631L7163M1688
16740c4663l0030l1213Q903Q641l2714J4681l0567K6351K9017o8635n6917P67
16728a96379K9503J00819N3751J6747K368l0012j9576q1933p0360N3265K1221
16717a20586K3365k0067l6000p198k272M2733M8442r088q8636k9719N1723J4041
16705a33262k6270j7426K3069k5709k1428k2815L4693M6513M0568J3089k1025
16694a10003l088P5846M1896L6949L2358p6234n0431j2474Q440n8823l7762J5495
16682a37831M6358K3579J2810P130J8324j0401J5440O308o3843L4761J7389m4221
$$ plain form
16670 -74197 -102959 -124242 -139019 -196604 -155940 -21178 -43690 -97621 -145077 -107718 -91307
16659 -91307 -108616 -160523 -91760 -60868 -35039 12266 31205 7963 -40147 -60411 -8825 -21393
16647 -21393 -34963 -46978 33833 11189 -5851 6776 19969 -38137 -102930 -111571 -75242 -70448
16635 -70448 -1758 -29158 -50275 -81281 -102479 -52155 -8473 -46193 -63841 -109847 -92761 -103667
16623 -103667 -113399 -112082 -81554 -48703 -58258 -62596 -103693 -153039 -159891 -182938 -184605 -184890 -221218
16610 -221218 -302225 -299808 -214338 -191640 -174802 -93240 -72225 -58199 -85816 -123681 -148884 -170874
16598 -170874 -173261 -151365 -120224 -125109 -85523 -81609 -84260 -54107 -77886 -106197 -114668 -119619 -133279
16585 -133279 -107829 -107367 -160221 -174084 -182201 -147314 -88438 -13939 -15813 -86043 -112704 -83849
$$ packed form
16670g4197k8762k1283j4777n7585M0664J34762k2512n3931m7456L7359J6411
16659i1307j7309n1907O8763L0892K5829M7305J8939k3242m8110k0264N1586j2568
16647b1393j3570j2015Q0811k2644j7040J2627J3193n8106o4793q641L6329M794
16635g0448O8690k7400k1117l1006k1198N0324M3682l7720j7648m6006J7086j0906
16623a03667r732J317L0528L2851r555m338m1097m9346o852k3047j667k85l6328
16610b21218q1007K417Q5470K2698J6838Q1562K1015J4026k7617l7865k5203k1990
16598a70874k387K1896L1141m885L9586L914k651L0153k3779k8311q471m951j3660
16585a33279K5450M62n2854j3863q117L4887N8876P4499j874p0230k6661K8855
$$ plain form
16573 -83849 -144197 -54481 -33390 -130760 -136444 -139106 -140704 -119537 -76220 -33476 3293 4419
16561 4419 -46436 -107833 -122156 -174842 -90593 -61330 -105202 -120392 -140463 -119934 -21715 53277
16549 53277 30099 -34875 -91198 -119236 -84299 -93078 -25384 -2770 -6994 -98591 -130611 -134642
16537 -134642 -98182 -150643 -193226 -175293 -150313 -97192 -102987 -53939 10554 583 -36900 -94774
16525 -94774 -124093 -120730 -125531 -155108 -191401 -149139 -108494 -105602 -112413 -116872 -175977 -182050 -153707
16512 -153707 -126473 -48885 12372 54923 2232 -28184 -65881 -87811 -127952 -113252 -86989
16501 -86989 -107263 -91534 -125279 -134490 -137927 -87274 -110427 -84459 -43498 -14240 -25343 -48060
16489 -48060 -142029 -149048 -157931 -145982 -140053 -61995 -14135 34341 59851 6492 -96492 -121317
$$ packed form
16573h3849o0348Q9716K1091r7370n684k662j598K1167M3317M2744L6769J126
16561D419n0855o1397j4323n2686Q4249K9263m3872j5190k0071K0529R8219P4992
16549E3277k3178o4974n6323k8038L4937q779O7694K2614m224r1597l2020m031
16537a34642L6460n2461m2583J7933K4980N3121n795M9048O4493r971l7483n7874
16525i4774k9319L363m801k9577l6293M2262M0645K892o811m459n9105o073K8343
16512a53707K7234P7588O1257M2551n2691l0416l7697k1930m0141J4700K6263
16501h6989k0274J5729l3745r211l437N0653k3153K5968M0961K9258j1103k2717
16489d8060r3969p019q883J1949N929P8058M7860M8476K5510n3359j02984k4825
$$ plain form
16477 -121317 -129877 -73063 -56144 -61797 -44586 -48639 -30870 -57841 -97140 -42199 -32282 458
16465 458 30267 -16880 -96493 -141125 -113477 -48720 -58970 -41610 8642 11306 -58456 -81774
16453 -81774 -47433 -121212 -175273 -120272 -61974 -48819 -161354 -193008 -158552 -100104 -154431
16442 -154431 -157026 -133838 -97107 -89443 -56899 12424 -5437 -72968 -88559 -116222 -71153 -1427
16430 -1427 -45712 -85150 -136348 -129351 -55945 -19696 -2620 -56779 -7511 56457 524 -52747
16418 -52747 -86021 -125616 -123779 -73311 -113120 -168791 -228363 -201970 -129228 -105375 -90692 -54962
16406 -54962 -33900 -31621 -6379 51856 -5479 -37222 -27582 -4009 -38597 -12169 47822 -55815
16394 -55815 -91573 -76296 -45977 -53763 -45663 -18786 -44157 -102341 -98035 -65816 -80213 -91699
$$ packed form
16477a21317q560N6814J6919n653J7211m053J7769k6971l9299N4941R917L2740
16465D58K9809m7147p9613m4632K7648O4757j0250J7360N0252K664o9762k3318
16453h1774L4341p3779n4061N5001N8298J3155j12535l1654L4456N8448n4327
16442a54431k595K3188L6731P664L2544O9323j7861o7531j5591k7663M5069O9726
16430a427m4285l9438n1198O997P3406L6249J7076n4159M9268O3968n5933n3271
16418e2747l3274l9595J837N0468l9809n5671n9572K6393P2742K3853J4683L5730
16406e4962K1062K279K5242N8235n7335l1743R640K3573l4588K6428N9991j03637
16394e5815l5758J5277L0319p786Q100K6877k5371n8184M306L2219j4397j1486
$$ plain form
16382 -91699 -44360 -44005 -84321 -104128 -141930 -97621 -143847 -161663 -147334 -85159 -44232 -4494
16370 -4494 -61602 -119088 -91217 -64225 -56121 -89369 -123628 -106627 -101338 -91067 -80408 -117653
16358 -117653 -109117 -117882 -99489 -82659 -70132 -89905 -141213 -168691 -111188 -99037 -115722 -80318
16346 -80318 -56773 -42258 -89900 -148949 -32930 77563 78811 25469 10552 -40245 18149
16335 18149 49473 -15953 -34820 -29051 -28844 -17730 4227 12271 53777 54342 66594 -3237 -57799
16322 -57799 -5585 39594 31520 -19797 -152433 -136409 -63782 -80546 -84681 -105285 -103660 -95872
16310 -95872 -78015 -24382 -93994 -124645 -97966 -50264 -37864 -29755 -67998 -47387 -30178 -75562
16298 -75562 -79949 -107916 -115753 -129625 -121067 -104584 -82948 -101295 -85472 -60491 -106148 -106714 -7266
$$ packed form
16382i1699M7339L55m0316j9807l7802M4309m6226j7816J4329O2175M0927L9738
16370d494n7108n7486K7871K6992Q104l3248l4259J7001N289J0271J0659l7245
16358a17653Q536q765J8393J6830J2527j9773n1308k7478N7503J2151j6685L5404
16346h0318K3545J4515m7642n9049J16019J10493J248n3342j4917n0797N8394
16335A8149L1324o5426j8867N769K07J1114K1957Q044M1506N65J2252o9831n4562
16322e7799N2214M5179q074n1317j32636J6024P2627j6764m135k0604J625P788
16310i5872J7857N3633o9612l0651K6679M7702J2400Q109l8243K0611J7209m5384
16298g5562m387k7967p837j3872Q558J6483K1636j8347J5823K4981m5657n66R9448
$$ plain form
16285 -7266 67839 40340 46520 92794 105533 109392 69459 22941 51983 126202 112063 144571
16273 144571 189258 202135 147225 145267 187514 224563 238908 196818 81090 3218 -58600
16262 -58600 -141808 -192100 -138553 -63517 32523 129309 164267 96682 73821 122722 92691 11815
16250 11815 -10300 -64016 -48414 -44362 -85535 -102110 -98500 -142526 -151121 -88660 -44987 14785
16238 14785 47540 60379 35629 -16643 -10592 -5013 10873 33020 15051 4847 60899 -25181
16226 -25181 -74057 18460 115320 55006 47077 72971 87094 79693 78882 58237 81081 102066
16214 102066 89650 53588 -34539 5418 -7176 57669 106980 111131 56010 115033 179052 107986
16202 107986 75524 114332 142507 189423 149174 107246 43778 18182 19490 -28454 -36667 -6311
$$ packed form
16285g266P5105k7499O180M6274J2739L859l9933m6518K9042P4219j4139L2508
16273A44571M4687J2877n4910j958M2247L7049J4345m2090j15728p7872o1818
16262e8600q3208n0292N3547P5036R6040R6786L4958o7585k2861M8901l0031q0876
16250A1815k2115n3716J5602M052m1173j6575L610m4026q595O2461M3673N9772
16238A4785L2755J2839k4750n2272O051N579J5886K2147j7969j0204N6052q6080
16226b5181m8876R2517R6860o0314p929K5894J4123p401q11k0645K2844K0985
16214A02066j2416l6062q8127L9957j2594O4845M9311M151n5121N9023O4019p1066
16202A07986l2462L8808K8175M6916m0249m1928o3468k5596J308m7944q213L0356
$$ plain form
16190 -6311 44842 44451 5543 -19534 44098 47734 80283 65277 10085 94179 98608 133987 180446
16177 180446 185630 196807 64034 34898 75788 79965 32945 22779 37297 90811 145826 83701
16165 83701 -40929 -91320 -25005 -25640 -96683 -118654 -53360 17887 48521 71551 44385 -29933
16153 -29933 -21299 -18846 29165 48063 45136 10981 14322 7432 49195 25810 29721 133279 206711
16140 206711 150697 67290 -33652 -85996 -47255 -89605 -54631 1303 71032 53969 13933
16129 13933 -33500 -14574 58402 58749 37656 106893 25772 -60946 -23778 48322 55470 56674
16117 56674 63780 70938 107215 166956 90552 89708 110529 125699 109979 105463 136129 97140 112173
16104 112173 121954 143662 128289 70627 46761 114221 162286 163596 120105 49783 27327 76610
$$ packed form
16190f311N1153l91l8908k5077O3632L636L2549j5006n5192Q4094M429L5379M6459
16177A80446N184J1177j32773k9136M0890M177m7020j0166J4518N3514N5015o2125
16165H3701j24630n0391O6315o35p1043k1971O5294P1247L0634K3030k7166p4318
16153b9933Q634K453M8011J8898k927l4155L341o890M1763k3385L911J03558P3432
16140B06711n6014q3407j00942n2344L8741m2350L4974N5934O9729j7063m0036
16129A3933m7433J8926P2976L47k1093O9237q1121q6718L7168P2100P148J204
16117E6674P106P158L6277N9741p6404q44K0821J5170j5720m516L0666l8989J5033
16104A12173R781K1708j5373n7662k3866O7460M8065J310m3491p0322k2456M9283
$$ plain form
16092 76610 84926 31553 -15955 1869 16520 100318 91214 64285 77323 41450 78559 151756
16080 151756 182718 215161 189096 139684 110415 55995 68403 129781 149524 121644 151387
16069 151387 137889 158773 219932 214539 228701 238739 228158 211040 194683 215144 225344 232146
16057 232146 191001 69124 50262 19611 -14254 64778 101176 91090 159319 220079 231505
16046 231505 270062 244567 271174 280539 255039 190909 204101 226078 266328 311197 274219 301924
16034 301924 252874 293892 334967 362857 335560 349320 396694 382099 305259 296490 263341 169601
16022 169601 93444 107697 139554 209608 216993 223722 208799 126044 189388 245279 292042 281505
16010 281505 248547 254511 278533 312347 345184 431705 426032 429636 399247 294381 199939 181532
$$ packed form
16092G6610Q316n3373m7508J7824J4651Q3798r104k6929J3038l5873L7109P3197
16080A51756L0962L2443k6065m9412k9269n4420J2408O1378J9743k7880K9743
16069A51387j3498K0884O1159n393J4162J0038j0581j7118j6357K0461J0200O802
16057B32146m1145j21877j8862l0651l3865P9032L6398j0086O8229O0760J1426
16046B31505L8557k5495K6607R365k5500o4130J3192K1977M0250M4869l6978K7705
16034C01924m9050M1018M1075K7890k7297J3760M7374j4595p6840q769l3149r3740
16022A69601p6157J4253L1857P0054P385O729j4923q2755O3344N5891M6763j0537
16010B81505l2958N964K4022L3814L2837Q6521n673L604l0389j04866r4442j8407
$$ plain form
15998 181532 246798 271513 209577 241249 256699 227843 291962 381428 423560 399911 386972
15987 386972 392412 449967 502602 457318 435220 432453 464462 455752 445078 395449 423909 484597
15975 484597 482848 527952 519699 449271 427159 464648 443875 396808 420996 425704 413740 382645
15963 382645 365332 326508 278553 273602 312786 320055 260318 299422 365421 380653 351845 320374
15951 320374 348462 295685 259249 225412 231708 272374 267220 252930 208723 255450 331257 344920
15939 344920 355541 340268 333679 309099 329171 327043 332328 326060 305545 272169 210907 219250
15927 219250 265066 272873 280911 235179 264898 265865 288173 287088 318603 308855 303156 358494 373057
15914 373057 323131 314282 353651 308213 299072 311261 271943 321361 357178 380983 319908 309188
$$ packed form
15998A81532O5266K4715o1936L1672J5450k8856O4119Q9466M2132k3649j2939
15987C86972N440N7555N2635m5284k2098k767L2009q710j0674m9629K8460O0688
15975D84597j749M5104q253p0428k2112L7489k0773m7067K4188M708j1964l1095
15963C82645j7313l8824m7955m951L9184P269n9737L9104O5999J5232k8808l1471
15951C20374K8088n2777l6436l3837O296M0666n154j4290m4207M6727P5807J3663
15939C44920J0621j5273o589k4580K0072k128N285o268k0515l3376o1262Q343
15927B19250M5816P807Q038m5732K9719R67K2308j085L1515r748n699N5338J4563
15914C73057m9926q849L9369m5438r141J2189l9318M9418L5817K3805o1075j0720
$$ plain form
15902 309188 330167 343928 275492 286416 263969 170782 185567 159825 133127 191589 231330
15891 231330 289492 273331 152592 188573 202273 169164 209321 229753 213439 250401 295622
15880 295622 322302 277165 194774 169467 171557 188798 218881 304858 352330 383672 347993 298046
15868 298046 244476 295118 275488 365341 399143 379581 358614 322597 277723 240579 287130
15857 287130 333126 292697 250847 227463 227043 272991 328682 326574 329303 247930 205039 200546
15845 200546 147709 136212 165237 185909 154149 196528 225336 213140 248958 326757 409843
15834 409843 381135 262503 221643 178743 253109 322855 259546 233274 235772 286798 360729
15823 360729 387168 393370 366308 356152 312303 235035 167174 228803 249401 221200 210683 227771
$$ packed form
15902C09188K0979J3761o8436J0924k2447r3187J4785k5742k6698N8462L9741
15891B31330N8162j6161j20739L5981J3700l3109M0157K0432j6314L6962M5221
15880B95622K6680m5137q2391k5307K090J7241L0083Q5977M7472L1342l5679m9947
15868B98046n3570N0642j9630Q9853L3802j9562k0967l6017m4874l7144M6551
15857B87130M5996m0429m1850k3384m20M5948N5691k108K729q1373m2891m493
15845B00546n2837j1497K9025K0672l1760M2379K8808j2196L5818P7799Q3086
15834D09843k8708j18632m0860m2900P4366O9746o3309k6272K498N1026P3931
15823C60729K6439O202k7062j0156m3849p7268o7861O1629K0598k8201j0517J7088
$$ plain form
15811 227771 227641 207336 214329 247575 271002 244035 231084 237724 241756 262987 280063 248164
15799 248164 217635 192479 193748 195735 280335 324443 292819 293781 250467 179815 152441 159258
15787 159258 228940 243289 266517 297038 261717 242238 270590 325964 355969 338102 250733
15776 250733 255223 316327 387043 368612 333003 347687 311799 341644 333427 317195 328687 357334
15764 357334 413076 399003 350559 372463 411707 330212 289813 249008 211763 222093 294804
15753 294804 363612 350335 351994 407162 334753 221027 146165 170231 218910 241176 318053
15742 318053 370427 342171 352539 316432 265403 244356 292888 349651 338601 246268 156536
15731 156536 114804 135531 214494 250733 246037 228796 173645 215058 293524 303689 310805 373432
$$ packed form
15811B27771j30k0305O993L3246K3427k6967j2951O640M032K1231J7076l1899
15799B48164l0529k5156J269J987Q4600M4108l1624R62m3314p0652k7374O817
15787A59258O9682J4349K3228L0521l5321j9479K8352N5374L0005j7867q7369
15776B50733M490O1104P0716j8431l5609J4684l5888K9845q217j6232J1492K8647
15764C57334N5742j4073m8444K1904L9244q1495m0399m0805l7245J0330P2711
15753B94804O8808j3277J659N5168p2409j13726p4862K4066M8679K2266P6877
15742C18053N2374k8256J0368l6107n1029k1047M8532N6763j1050r2333q9732
15731A56536m1732K0727P8963L6239m696j7241n5151M1413P8466J0165P116O2627
$$ plain form
15719 373432 414188 428522 477452 388799 341821 315883 374055 350865 356639 482790 528946
15708 528946 447507 364459 319435 282502 268828 259785 317656 333173 315085 284731 278968 254611
15696 254611 269825 279817 319220 320075 249570 198900 167355 191182 181421 156904 208056 190710
15684 190710 236074 251606 269487 255564 265396 238034 246565 234590 316011 294981 266361 323799
15672 323799 325374 273372 242274 267702 295905 260530 285226 268413 299645 309607 198540 120435
15660 120435 130098 197461 215546 216663 247790 288281 311145 289365 239138 216678 296863 298315
15648 298315 327737 262687 255000 310671 329051 347084 316591 315517 273431 225845 220626 233319
15636 233319 286951 335809 289082 285293 288798 309343 315034 281529 255499 196943 195008 277757
$$ packed form
15719C73432M0756J4334M8930q8653m6978k5938N8172k3190N774J26151M6156
15708E28946q1439q3048m5024l6933j3674r043N7871J5517j8088l0354n763k4357
15696B54611J5214R992L9403Q55p0505n0670l1545K3827r761k4517N1152j7346
15684A90710M5364J5532J7881j3923R832k7362Q531j1975Q1421k1030k8620N7438
15672C23799J575n2002l1098K5428K8203l5375K4696j6813L1232R962j11067p8105
15660A20435R663O7363J8085J117L1127M0491K2864k1780n0227k2460Q0185J452
15648B98315K9422o5050p687N5671J8380J8033l0493j074m2086m7586n219J2693
15636B33319N3632M8858m6727l789L505K0545N691l3505k6030n8556j935Q2749
$$ plain form
15624 277757 303423 266846 244809 247426 252354 289660 395837 458583 429675 390563 330267 322098
15612 322098 348905 328891 256701 207929 191302 219895 198859 224566 251694 227784 242210
15601 242210 206950 229962 300492 234697 218718 255155 260894 262378 327165 336782 300225 299059
15589 299059 311186 320036 330699 327349 285919 276108 311924 288755 240734 194584 231836 269769
15577 269769 273559 275230 281372 304660 328534 315040 322053 337548 338916 295538 295708 316705 278553
15564 278553 312486 373999 379976 375879 380965 367077 315313 384857 418166 282655 193453 297579
15552 297579 332186 337473 358616 364781 396721 339519 295294 332062 355996 308521 275165 227396
15540 227396 249553 343379 397424 379606 412919 404314 363927 340259 332666 280801 292456 337219
$$ packed form
15624B77757K5666l6577k2037K617M928L7306J06177O2746k8908l9112o0296q169
15612C22098K6807k0014p2190m8772j6627K8593k1036K5707K7128k3910J4426
15601B42210l5260K3012P0530o5795j5979L6437N739J484O4787R617l6557j166
15589B99059J2127Q850J0663l350m1430r811L5816k3169m8021m6150L7252L7933
15577B69769L790J671O142K3288K3874j3494P013J5495J368m3378J70K0997l8152
15564B78553L3933O1513N977m097N086j3888n1764O9544L3309j35511q9202J04126
15552B97579L4607N287K1143O165L1940n7202m4225L6768K3934m7475l3356m7769
15540B27396K2157R3826N4045j7818L3313q605m0387k3668p593n1865J1655M4763
$$ plain form
15528 337219 355838 375195 371468 376253 398303 388256 324909 302172 386970 366610 354677 322061
15516 322061 240540 273436 367584 426277 446176 395896 406048 510853 488133 477749 461421
15505 461421 437384 394940 454994 430223 363000 334035 355013 385369 363728 339732 381514
15494 381514 473420 479702 375073 387080 468859 447783 340921 341643 403778 406498 368760 375121
15482 375121 391712 299814 218589 317400 403451 390115 429024 476431 472298 371697 305734
15471 305734 341734 394737 369073 385161 343885 359093 350806 399698 477533 475151 517378 463154
15459 463154 398764 410351 382412 415154 492631 498509 438676 356974 337912 342182 300294 265030
15447 265030 267826 316103 338362 396035 390533 379509 407875 342358 305051 341346 426527 370045
$$ packed form
15528C37219J8619J9357l727M785K2050j0047o3347k2737Q4798k0360j1933l2616
15516C22061q1521L2896R4148N8693J9899n0280J0152J04805k2720j0384j6328
15505D61421k4037m2444O0054k4771o7223k8965K0978L0356k1641k3996M1782
15494C81514R1906O282j04629J2007Q1779k1076j06862P22O2135K720l7738O361
15482C75121J6591r1898q1225R8811Q6051j3336L8909M7407m133j00601o5963
15471C05734L6000N3003k5664J6088m1276J5208q287M8892P7835k382M2227n4224
15459D63154o4390J1587k7939L2742P7477N878n9833q1702j9062M270m1888l5264
15447B65030K796M8277K2259N7673n502j1024K8366o5517l7307L6295Q5181n6482
$$ plain form
15435 370045 311546 276018 301577 351007 375630 345249 337750 323376 294255 299053 227744 226752
15423 226752 262826 283704 305383 303801 308900 249033 287982 293510 251672 204129 180847 184283
15411 184283 200506 196245 179290 252124 285887 276767 256124 193908 183287 225886 230924 172542
15399 172542 112494 53933 87426 85193 94329 190143 272380 293882 290970 231331 268900 324691
15387 324691 349970 340838 285137 241137 245186 296798 349065 409766 363292 334535 346766 357864
15375 357864 380627 353069 277066 247414 300784 284029 216388 175351 218722 235485 208793
15364 208793 156880 150477 180354 159737 114985 111116 142993 218069 230504 329043 314477 329722
15352 329722 271679 225330 238371 307536 221173 168667 246566 317444 221201 158092 91032
$$ packed form
15435C70045n8499l5528K5559M9430K4623l0381p499j4374k9121M798p1309r92
15423B26752L6074K0878K1679j582N099n9867L8949N528m1838m7543k3282L436
15411A84283J6223m261j6955P2834L3763r120k0643o2216j0621M2599N038n8382
15399A72542o0048n8561L3493k233R136R5814Q2237K1502k912n9639L7569N5791
15387C24691K5279r132n5701m4000M049N1612N2267O0701m6474k8757J2231J1098
15375C57864K2763k7558p6003k9652N3370j6755o7641m1037M3371J6763k6692
15364B08793n1913o403K9877k0617m4752l869L1877P5076J2435R8539j4566J5245
15352C29722n8043m6349J3041O9165q6363n2506P7899P0878r6243o3109o7060
$$ plain form
15341 91032 85543 96519 128205 145033 160046 169788 174670 226466 270758 206208 167805 163081
15329 163081 166378 122118 75185 49777 102051 210576 291832 326429 258500 198718 197876 199018
15317 199018 217836 307411 335969 281013 270864 268472 223004 171809 134528 142412 172990 276885
15305 276885 319364 286379 199512 146389 176277 215241 168988 142738 199412 255402 251033 265273
15293 265273 273388 271776 227018 155617 147063 143939 168139 157672 201344 195785 174396 158511
15281 158511 205386 234520 186539 89243 73606 156813 151777 171759 199025 237335 222953 212620
15269 212620 175847 124888 153383 182548 149855 146556 194166 175954 203620 222493 231015 159444
15257 159444 127300 129505 206004 263639 276907 200728 201919 221747 217119 175611 148865 177127
$$ packed form
15341I1032n489J0976L1686J6828J5013R742M882N1796M4292o4550l8403m724
15329A63081L297m4260m6933k5408N2274J08525Q1256L4597o7929n9782q42J142
15317A99018J8818Q9575K8558n4956j0149k392m5468n1195l7281P884L0578J03895
15305B76885M2479l2985q6867n3123K9888L8964m6253k6250N6674N5990m369J4240
15293B65273Q115j612m4758p1401q554l124K4200j0467M3672n559k1389j5885
15281A58511M6875K9134m7981r7296j5637Q3207n036J9982K7266L8310j4382j0333
15269B12620l6773n0959K8495K9165l2693l299M7610j8212K7666J8873Q522p1571
15257A59444l2144K205P6499N7635J3268p6179J191J9828m628m1508k6746K8262
$$ plain form
15245 177127 172753 150674 155965 136445 146572 171027 137004 71675 89135 69468 73958 46359
15233 46359 86485 123380 93312 68955 206439 334722 375234 376616 325490 279312 296548
15222 296548 331809 333164 303973 248723 254501 249861 223040 204520 237092 198113 208479 262767
15210 262767 253097 229620 212797 221599 167708 191520 243928 274552 233880 218012 274802 345225
15198 345225 281847 207965 224679 225076 218723 196364 220777 276467 256905 218314 219414 169077
15186 169077 170950 164489 121103 168139 172782 155690 145456 173223 195103 157117 59107 70573
15174 70573 116780 179924 196775 158432 98251 153793 215412 282815 306595 341253 314627 231412
15162 231412 240642 324587 285357 173468 139700 190905 167770 176819 253273 220330 187737 220105
$$ packed form
15245A77127m374k2079N291j9520J0127K4455l4023o5329J7460j9667M490k7599
15233D6359M0126L6895l0068k4357J37484J28283M0512J382n1126m6178J7236
15222B96548L5261J355k9191n5250N778m640k6821j8520L2572l8979J0366N4288
15210B62767r670k3477j6823Q802n3891K3812N2408L0624m0672j5868N6790P0423
15198C45225o3378p3882J6714L97o353k2359K4413N5690j9562l8591J100n0337
15186A69077J873o461m3386M7036M643j7092j0234K7767K1880l7986r8010J1466
15174G0573M6207O3144J6851l8343o0181N5542O1619O7403K3780L4658k6626q3215
15162B31412R230Q3945l9230j11889l3768N1205k3135R049P6454l2943l2593L2368
$$ plain form
15150 220105 233715 253865 308954 338647 282315 233768 171083 136228 206496 180641 202934
15139 202934 216046 189060 153399 184430 216883 243016 250873 232893 172668 161461 200917 153021
15127 153021 179611 135128 71088 90510 147628 140326 174320 192113 160806 152135 138715 128773
15115 128773 87660 89507 92674 115355 156146 163364 184871 257403 273729 126405 122118 200383
15103 200383 201933 164597 192609 262753 288642 253216 254948 248274 296618 358712 347487 339095
15091 339095 327738 318841 244494 213706 244376 278248 307776 337164 282161 218424 238125 182816
15079 182816 176143 100201 72566 18447 -18025 66298 136324 100682 138086 73851 78820 177172
15067 177172 215936 141265 133626 171730 140878 101127 133433 93424 65921 82279 94241 153931
$$ packed form
15150B20105J3610K0150N5089K9693n6332m8547o2685l4855P0268k5855K2293
15139B02934J3112k6986l5661L1031L2453K6133P857j7980o0225j1207L9456m7896
15127A53021K6590m4483o4040J9422N7118p302L3994J7793l1307q671j3420r942
15115A28773m1113J847L167K2681M0791P218K1507P2532J6326j47324m287P8265
15103B00383J550l7336K8012P0144K5889l5426J732o674M8344O2094j1225q392
15091C39095j1357q897p4347l0788L0670L3872K9528K9388n5003o3737J9701n5309
15079A82816o673p5942k7635n4119l6472Q4323P0026l5642L7404o4235M969R8352
15067A77172L8764p4671p639L8104l0852l9751L2306m0009k7503J6358J1962N9690
$$ plain form
15055 153931 241573 218893 195407 145964 136443 198888 242128 309056 320851 253133 170919 147854
15043 147854 144250 93855 97641 186198 233577 231038 168748 175584 174118 60691 14235 45037
15031 45037 54288 56651 58344 52180 68624 80208 22090 16906 84105 108198 121195 48559 3350
15018 3350 24534 89441 104810 166396 153639 52888 -77049 -13856 71266 118770 64836
15007 64836 56102 84609 78778 11242 34040 74740 105498 92437 28719 1800 -873 -14448
14995 -14448 44161 38225 28770 75186 150904 117217 107093 111814 69138 78064 62598 48062
14983 48062 66982 106859 111290 79951 64149 6967 -18977 17689 44020 86905 134607 178669
14971 178669 153978 98228 21488 -61552 -72615 -11525 53315 73174 81687 -16848 -60237 -32336
$$ packed form
15055A53931Q7642k2680k3486m9443r521O2445M3240O6928J1795o7718q2214k3065
15043A47854l604n0395L786Q8557M7379k539o2290O836j466j13427m6456L0802
15031D5037R251K363J693o164J6444J1584n8118n184O7199K4093J2997p2636m5209
15018C350K1184O4907J5369O1586j2757j00751j29937O3193Q5122M7504n3934
15007F4836q734K8507n831o7536K2798M0700L0758j3061o3718k6919k673j3575
14995a4448N8609n936r455M6416P5718l3687j0124M721m2676Q926j5466j4536
14983D8062J8920L9877M431l1339j5802n7182k5944L6666K6331M2885M7702M4062
14971A78669k4691n5750p6740q3040j1063O1090O4840J9859Q513r8535m3389K7901
$$ plain form
14959 -32336 39025 57841 122894 124963 141226 193263 195144 152211 120116 127004 60454 -8991
14947 -8991 63424 75729 24877 58427 59580 56953 15610 40780 -16112 37866 45509 -8201
14935 -8201 -7069 71704 93113 74399 106795 116331 54841 -18285 10135 99656 85331 48111
14923 48111 47300 22886 15236 -22504 8420 52657 25453 -11120 41172 99908 157589 160707
14911 160707 80709 17737 -25191 -72691 -91833 -81448 -63220 -52075 -56783 -14768 12121 36884
14899 36884 25177 -25207 -19033 37692 10816 -116252 -151273 -127123 -126042 -105835 -18134 13734
14887 13734 37078 -22281 -81006 -56216 -57895 -81566 -36348 68916 141727 46635 23962 -61986
14875 -61986 -56755 -19227 23805 29654 -4791 -9778 61006 83330 65518 -2478 1720 -17371
$$ packed form
14959c2336P1361J8816O5053K069J6263N2037J881m2933l2095O888o6550o9445
14947h991P2415J2305n0852L3550J153k627m1343K5170n6892N3978P643n3710
14935h201J132P8773K1409j8714L2396R536o1490p3126K8420Q9521j4325l7220
14923D8111q11k4414p650l7740L0924M4237k7204l6573N2292N8736N7681L118
14911A60707p9998o2972m2928m7500j9142J0385J8228J1145m708M2015K6889K4763
14899C6884j1707n0384O174N6725k6876j27068l5021K4150J081K0207Q7701L1868
14887A3734K3344n9359n8725K4790j679k3671M5218J05264P2811r5092k2673q5948
14875f1986N231L7528M3032N849l4445m987P0784K2324j7812o7996M198j9091
$$ plain form
14863 -17371 -61407 -14013 32225 60538 15786 -45298 11803 104735 128831 114862 53501 -27676
14851 -27676 -76718 -83077 -6571 58990 -2214 -42484 20030 67414 49101 29234 42976 79373
14839 79373 138617 88455 12596 -53004 17901 -6222 -32701 -23362 47224 38382 -17284 -44750
14827 -44750 -54110 -12144 12962 9811 -30080 -56240 -200 -60672 -63915 11352 85107 102244
14815 102244 78739 -20533 -35188 18721 37254 33926 -1727 -53923 4130 22533 -70111 -102846
14803 -102846 -70731 -91257 -37572 -55336 -43007 9526 -1709 -44646 -29249 -80603 -8510
14792 -8510 34373 -26778 -18324 57100 137233 110640 30037 21493 11428 -20868 -52922 -76583
14780 -76583 -109360 -123158 -57515 -27707 -5475 -16375 83867 95697 82513 35367 -25183
$$ packed form
14863a7371m4036M7394M6238K8313m4752o1084N7101R2932K4096j3969o1361q1177
14851b7676m9042o359P6506O5561o1204m0270O2514M7384j8313j9867J3742L6397
14839G9373N9244n0162p5859o5600P0905k4123k6479R339P0586q842n5666k7466
14827d4750r360M1966K5106l151l9891k6160N6040o0472l243P5267P3755J7137
14815A02244k3505r9272j4655N3909J8533l328l5653n2196N8053J8403r2644l2735
14803a02846L2115k0526N3685j7764J2329N2533j1235m2937J5397n1354P2093
14792h510M2883o1151Q454P5424Q0133k6593q0603q544j0065l2296l2054k3661
14780g6583l2777j3798O5643K9808K2232j0900J00242J1830j3184m7146o0550
$$ plain form
14769 -25183 -65176 -91576 -50157 30530 52228 87870 34025 -19120 -42275 -84375 -99719 -56744
14757 -56744 -56889 -74077 -66207 -114341 -79393 -69539 -44739 -48802 -102418 -144158 -103814 -57165 6495
14744 6495 28520 30867 60482 69122 96423 157895 177460 44694 -74920 3310 41588 3950
14732 3950 -2039 18272 8660 -17538 -17555 29688 -42259 -66358 -39775 7150 -13005 -8603 -19121
14719 -19121 -61299 -37707 -78065 -79758 -8122 4703 -32293 -96894 -72189 -6894 -30698 -46066
14707 -46066 -79941 -74503 -60262 -23616 16345 4188 52702 34381 3800 67550 64282 42340
14695 42340 31393 59292 124281 124593 37568 -51194 -42660 6866 48318 8981 75304 79348
14683 79348 59302 -42830 -64510 65062 83336 42011 10031 51398 97484 31145 -3000
$$ packed form
14769b5183l9993k6400M1419Q0687K1698L5642n3845n3145k3155m2100j5344M2975
14757e6744j45j7188P870m8134L4948R854K4800m063n3616m1740M0344M6649O3660
14744F495K2025K347K9615Q640K7301O1472J9565j32766j19614P8230L8278l7638
14732C950n989K0311r612k6198j7M7243p1947k4099K6583M6925k0155M402j0518
14719a9121m2178K3592m0358j693P1636J2825l6996o4601K4705O5295k3804j5368
14707d6066l3875N438J4241L6646L9961j2157M8514j8321l0581O3750l268k1942
14695D2340j0947K7899O4989L12q7025q8762Q534M9526M1452l9337O6323M044
14683G9348k0046j02132k1680J29572J8274m1325l1980M1367M6086o6339l4145
$$ plain form
14672 -3000 -7961 7278 -16965 -53219 -34709 -24234 -47006 -50427 -32193 54687 22292 23259 -43279
14659 -43279 -84089 -7352 54976 88377 115517 135199 101286 35252 -11075 2027 -9504 -12990
14647 -12990 29704 88958 25481 -5774 39038 68059 -5289 -47253 -19068 -22537 -40883 -17392
14635 -17392 41196 71254 74620 2050 1636 -15406 -23274 -68650 -96129 -56731 -4272 12493
14623 12493 46890 88425 81887 73574 39779 20482 33723 27422 55534 79398 34380 107914
14611 107914 85592 29532 83924 67870 -18947 -104009 -86821 -82651 -46781 7487 -1455 1378
14599 1378 9324 -3732 45172 112544 165700 100121 35615 -42431 -32077 -22094 -2470 37652
14587 37652 96320 132742 159106 135736 124251 97498 66190 63814 92010 181199 162401 63819
$$ packed form
14672c000m961J5239k4243l6254J8510J0475k2772l421J8234Q6880l2395R67o6538
14659d3279m0810P6737O2328L3401K7140J9682l3913o6034m6327J3102j1531l486
14647a2990M2694N9254o3477l1255M4812K9021p3348m1964K8185l469j8346K3491
14635a7392N8588L0058L366p2570m14j7042p868m5376k7479L9398N2459J6765
14623A2493L4397M1535o538q313l3795j9297J3241o301K8112K3864m5018P3534
14611A07914k2322n6060N4392j6054q6817q5062J7188M170L5870N4268q942K833
14599A378P946j3056M8904O7372N3156o5579o4506p8046J0354R983J9624M0122
14587C7652N8668L6422K6364k3370j1485k6753l1308k376K8196Q9189j8798r8582
$$ plain form
14575 63819 -716 -34727 -391 11813 75227 141548 222237 165916 78092 -4485 -26230 12868
14563 12868 74565 132021 99017 35697 11727 10155 20479 72387 45617 41969 34860 -45122
14551 -45122 -70652 -2818 102554 82177 35834 -41694 -54009 -7068 54492 82427 105177
14540 105177 51860 58095 26596 7858 37285 101659 37528 -111539 -136788 -89120 11050
14529 11050 106592 113535 145962 184906 136271 29100 30404 81630 41785 -38849 -49550 -10859
14517 -10859 -29092 -34315 -2654 41720 46797 4705 14114 -10155 1983 48754 98057 77951
14505 77951 42809 102096 117902 109528 97590 65115 -24546 -100124 -118438 -48048 -5843 -67504
14493 -67504 -129154 -114987 -65850 -76134 -25913 -5403 -16322 13793 26528 45365 43450 114526
$$ packed form
14575F3819o4535l4011L4336J2204O3414O6321Q0689n6321q7824q2577k1745L9098
14563A2868O1697N7456l3004o3320k3970j572J0324N1908k6770l648p109p9982
14551d5122k5530O7834J05372k0377m6343p7528j2315M6941O1560K7935K2750
14540A05177n3317O235l1499j8738K9427O4374o4131j49067k5249M7668J00170
14529A1050R5542O943L2427L8944m8635j07171J304N1226l9845q0634j0701L8691
14517a0859j8233n223L1661M4374N077m2092R409k4269J2138M6771M9303k0106
14505G7951l5142N9287J5806q374j1938l2475q9661p5578j8314P0390M2205o1661
14493f7504o1650J4167M9137j0284N0221K0510j0919L0115J2735J8837j915P1076
$$ plain form
14481 114526 76240 58170 90684 89780 96234 96371 67787 8255 -30135 -49497 12162 27102
14469 27102 54172 62661 52810 99895 114418 45319 -4780 33504 -37393 -40529 21642 70585
14457 70585 80368 101583 111280 114570 91606 39040 39147 65571 53262 98253 83602 -19382
14445 -19382 -111030 -81792 -41203 28040 9539 -10092 -38732 -20802 37536 90553 110769 9115
14433 9115 -45058 25080 104311 103513 109782 53065 10172 -74196 -89416 8339 63609 32895
14421 32895 57997 35477 26779 29870 25329 43451 111931 113900 49932 46329 84555 45298 25808
14408 25808 6877 103955 189217 135142 53550 14127 -137 48171 28361 -1156 -50481 -70500
14396 -70500 6839 -17016 -51738 48930 20735 -18576 -102177 -96703 -28310 7435 58866 76949
$$ packed form
14481A14526l8286j8070L2514r04O454J37k8584n9532l8390j9362O1659J4940
14469B7102K7070Q489r851M7085J4523o9099n0099L8284p0897l136O2171M8943
14457G0585R783K1215R697L290k2964n2566J07K6424j2309M4991j4651j02984
14445a9382r1648K9238M0589O9243j8501j9631k8640J7930N8338N3017K0216j01654
14433I115n4173P0138P9231p98O269n6717m2893q4368j5220R7755N5270l0714
14421C2895K5102k2520q698L091m541J8122O8480J969o3968l603L8226l9257j9490
14408B5808j8931R7078Q5262n4075q1592l9423j4264M8308j9810k9517m9325k0019
14396g0500P7339k3855l4722J00668k8195l9311q3601N474O8393L5745N1431J8083
$$ plain form
14384 76949 18272 18079 -6840 6386 14959 16648 -17890 -77548 -53012 -33031 -7510 -6548 18855
14371 18855 -27526 -121565 -114074 -5480 13044 -16847 -39462 -4989 -12145 3122 68989 164990
14359 164990 148488 180958 181676 111524 112774 167577 135491 72014 20287 66688 64063 47890
14347 47890 -24194 -19723 14139 21372 -17668 8037 45823 14520 -62125 -46043 -10053 -61100
14335 -61100 -19864 25153 -737 -11449 -23059 -31022 -61146 -31657 15625 24295 -6595 -22235
14323 -22235 27874 29697 -50891 -103123 -92220 -35508 -12512 -24774 -18757 127404 159010 80916
14311 80916 35542 26614 28280 17067 55761 136326 84625 32536 29003 10428 -30681 -17606
14299 -17606 41263 2692 -16123 -19467 -58502 -69924 -22517 26568 24334 20768 94726 117274
$$ packed form
14384G6949n8677j93k4919J3226Q573J689l4538n9658K4536J9981K5521R62K5403
14371A8855m6381r4039P491J08594J8524k9891k2615L4473p156J5267O5867R6001
14359A64990j6502L2470P18p0152J250N4803l2086o3477n1727M6401k625j6173
14347D7890p2084M471L3862P233l9040K5705L7786l1303p6645J6082L5990n1047
14335f1100M1236M5017k5890j0712j1610p963l0124K9489M7282Q670l0890j5640
14323b2235N0109J823q0588n2232J0903N6712K2996j2262O017J46161L1606p8094
14311H0916m5374q928J666j1213L8694Q0565n1701n2089l533j8575m1109J3075
14299a7606N8869l8571j8815l344l9035j1422M7407M9085k234l566P3958K2548
$$ plain form
14287 117274 117536 120307 105399 114873 121432 59144 45241 60082 72678 34116 29771 14069 15603
14274 15603 -80486 -102101 -87871 -41713 51704 80995 84849 118085 117545 49272 35075 -597
14262 -597 4668 -8143 -2727 42957 88411 24406 -39801 -63277 -22382 11659 71800 122390
14250 122390 120705 145941 163745 163194 92280 2312 22860 114465 60273 -43507 -64375 -24733
14238 -24733 56477 80095 82270 118226 107020 -3921 -78437 -48642 38092 120760 98406 -16613
14226 -16613 -34333 19373 82907 89419 68748 65053 38490 15138 25391 111671 146593 74570
14214 74570 38105 40483 -16309 -51908 -378 75621 115971 178268 186965 198464 192503 112273
14202 112273 52585 16222 5313 -32565 -104374 -75630 51255 55744 -4533 -3942 -34752 -69149
$$ packed form
14287A17274K62K771j4908R474O559o2288j3903J4841J2596l8562m345j5702J534
14274A5603r6089k1615J4230M6158R3417K9291L854L3236n40o8273j4197l5672
14262e97N265j2811N416M5684M5454o4005o4207k3476M0895L4041O0141N0590
14250A22390j685K5236J7804n51p0914q9968K0548R1605n4192j03780k0868L9642
14238b4733Q1210K3618K175L5956j1206j10941p4516K9795Q6734Q2668k2354j15019
14226a6613j7720N3706O3534O512k0671l695k6563k3352J0253Q6280L4922p2023
14214G4570l6465K378n6792l5599N1530P5999M0350O2297Q697J1499n961q0230
14202A12273n9688l6363j0909l7878p1809K8744J26885M489o0277N91l0810l4397
$$ plain form
14190 -69149 -103716 -103856 -63007 -18038 -10158 -35515 -23974 31834 59608 55116 26699 19211 30209
14177 30209 90001 150223 180731 182564 161498 199088 229988 210412 265974 160739 68647 51067
14165 51067 126386 182188 313173 335574 353020 403902 418239 397480 390905 445450 480145 538593
14153 538593 687158 753515 775121 836209 1007127 1285649 1689631 2139326 2463384 2560814
14143 2560814 2402713 2205515 2192138 2386331 2693945 2729967 2399387 1859174 1364316 1015270
14133 1015270 880708 770787 655865 642045 661364 661041 604832 595330 565770 602893 701998
14122 701998 813351 852003 997603 1307068 1650411 2065613 2510458 2623632 2318816 2058576
14112 2058576 2094714 2336773 2504505 2390426 1978870 1450726 1006560 718868 490551 403653
$$ packed form
14190f9149l4567j40M0849M4969P880k5357J1541N5808K7774m492k8417p488J0998
14177C0209N9792O0222L0508J833k1066L7590L0900j9576N5562j05235r2092j7580
14165E1067P5319N5802J30985K2401J7446N0882J4337k0759o575N4545L4695N8448
14153E38593J48565O6357K1606O1088J70918K78522M03982M49695L24058R7430
14143B560814j58101j97198j3377J94193L07614L6022l30580n40213m94858l49046
14133A015270j34562j09921j14922j3820J9319l23n6209r502k9560L7123R9105
14122G01998J11353L8652J45600L09465L43343M15202M44845J13174l04816k60240
14112B058576L6138K42059J67732j14079m11556n28144m44166k87692k28317q6898
$$ plain form
14102 403653 380477 430135 439933 360717 351253 380647 472332 487988 534109 542726 451521 336812
14090 336812 198457 112469 72431 89321 12213 -47199 -18466 1619 27439 10174 33929
14079 33929 16768 33146 87333 82037 46350 42750 5431 -81255 -13937 32690 33729 40351
14067 40351 96234 66543 24033 -22924 27642 24969 26206 71212 44469 89362 90196 126787
14055 126787 167936 176792 126497 61880 43743 86233 54014 -48302 -99591 -51627 -27216
14044 -27216 -68235 -52707 -31020 -35105 -29214 -34188 20073 16882 6056 9958 20194 88640 140168
14031 140168 137976 76311 44912 124689 127746 90632 56988 13295 -15480 24725 46766 5949
14019 5949 16630 88761 141341 160351 147920 149910 108136 44192 51273 83718 97874 82331
$$ packed form
14102D03653k3176M9658R798p9216r464K9394R1685J5656M6121Q617r1205j14709
14090C36812j38355q5988m0038J6890p7108n9412K8733K0085K5820j7265K3755
14079C3929j7161J6378N4187n296l5687l600l7319q6686O7318M6627J039O622
14067D0351N5883k9691m2510m6957N0566k673J237M5006k6743M4893Q34L6591
14055A26787M1149Q856n0295o4617j8137M2490l2219j02316n1289M7964K4411
14044b7216m1019J5528K1687m085N891m974N4261l191j0826L902J0236O8446N1528
14031A40168k192o1665l1399P9777L057l7114l3644m3693k8775M0205K2041m0817
14019E949J0681P2131N2580J9010j2431J990m1774o3944P081L2445J4156j5543
$$ plain form
14007 82331 91623 119891 110398 95013 114648 47226 41605 6688 50905 121546 151355 61816
13995 61816 49395 89753 118085 87938 41227 5989 21400 75255 122725 93634 93333 112542
13983 112542 134178 5489 -57096 -60061 -17491 3899 25295 49312 74680 80745 110562 114067
13971 114067 110419 111411 90810 127634 92320 -26583 -48718 43354 79835 125835 153339 139966
13959 139966 136981 114205 86629 23174 5980 18820 27270 19520 17451 37466 531 10677
13947 10677 -14729 -36687 46924 155981 173884 157524 195623 191252 176048 163348 146113 72283
13935 72283 43116 47055 24263 30574 87244 82726 38904 13472 -20536 -17325 25205 -11010
13923 -11010 -49330 -27295 6782 797 -92681 -77578 -51451 49265 54357 33761 26508 98300
$$ packed form
14007H2331R292K8268r493j5385J9635o7422n621l4917M4217P0641K9809q9539
13995F1816j2421M0358K8332l0147m6711l5238J5411N3855M7470k9091l01J9209
13983A12542K1636j28689o2585k965M2570K1390K1396K4017K5368O065K9817L505
13971A14067l648R92k0601L6824l5314j18903k2135R2072L6481M6000K7504j3373
13959A39966k985k2776k7576o3455j7194J2840Q450p750k069K0015l6935J0146
13947A0677k5406k1958Q3611J09057J7903j6360L8099m371j5204j2700j7235p3830
13935G2283k9167L939k2792O311N6670m518m3822k5432l4008L211M2530l6215
13923a1010l8320K2035L4077n985r3478J5103K6127J00716N092k0596p253P1792
$$ plain form
13911 98300 164578 157261 88250 102025 107753 71798 92869 -4343 -71124 -66956 1322 92652
13899 92652 119792 142017 179233 242948 256039 252974 251955 255092 227002 135723 17771 48042
13887 48042 67250 82406 91247 55407 -16129 -36968 50512 86969 87662 -16469 -21182 -20600 -43573
13874 -43573 -48940 -18960 58388 76879 81208 92901 103322 23509 6325 27263 67685 92103
13862 92103 99171 73382 50209 37460 -2526 -42009 -15141 38003 5435 56521 49249 -37997
13850 -37997 9123 57749 44801 -29571 -126010 -116952 -85340 -13311 46746 30551 257 12936
13838 12936 16294 -56827 -83952 -54003 -44614 -64596 -79744 -74815 -9776 -49141 -49866 -41970 -27414
13825 -27414 933 10468 30663 66861 71953 52469 27990 -13239 -62299 -6638 55113 15406
$$ packed form
13911I8300O6278p317o9011J3775N728l5955K1071r7212o6781M168O8278R1330
13899I2652K7140K2225L7216O3715J3091l065j019L137k8090r1279j17952L0271
13887D8042J9208J5156Q841l5840p1536k0839Q7480L6457O93j04131m713N82k2973
13874d3573n367K9980P7348J8491M329J1693J0421p9813j7184K0938M0422K4418
13862I2103P068k5789k3173j2749l9986l9483K6868N3144l2568N1086p272q7246
13850c7997M7120M8626j2948p4372r6439R058L1612P2029O0057j6195l0294J2679
13838A2936L358p3121k7125K9949R389j9982j5148M929O5039l9365p25P896J4556
13825b7414K8347R535K0195L6198N092j9484k4479m1229m9060N5661O1751l9707
$$ plain form
13813 15406 -98738 -119665 -118763 -135930 -146756 -80640 -32203 6450 -8063 -31475 -15210 97961
13801 97961 137887 100984 53615 46669 20355 40151 59186 65714 60730 3013 -24086 -95289
13789 -95289 -183327 -176418 -163060 -135623 -154740 -116257 -63 -11184 -26919 -1563 -40310 -88939
13777 -88939 -79021 -41469 -34490 -35887 -43931 -47405 -76552 -99014 -38946 66558 62344 -1978 -29560
13764 -29560 -19018 23660 37210 -4417 -15809 -43121 -34665 34101 30008 742 26084 14280
13752 14280 78409 167896 90826 -14020 24333 24143 43731 89857 165002 155566 143952 145838
13740 145838 98082 119247 132165 101569 102830 83132 111779 76714 8861 -33113 -35333 10402
13728 10402 63049 55041 47378 31229 59819 42632 22577 -25573 -74386 -64426 -69465 2250
$$ packed form
13813A5406j14144k0927R02j7167j0826O6116M8437L8653j4513k3412J6265J13171
13801I7961L9926l6903m7369o946k6314J9796J9035O528m984n7717k7099p1203
13789i5289q8038O909J3358K7437j9117L8483J16194j1121j5735K5356l8747m8629
13777h8939R918L7552O979j397q044l474k9147k2462O0068J05504m214o4322k7582
13764b9560J0542M2678J3550m1627j1392k7312Q456O8766m093k9266K5342j1804
13752A4280O4129Q9487p7070j04846L8353j90J9588M6126P5145r436j1614J886
13740A45838m7756K1165J2918l0596J261j9698K8647l5065o7853m1974k220M5735
13728A0402N2647q008p663j6149K8590j7187k0055m8150m8813R960n039P1715
$$ plain form
13716 2250 55643 4802 -65479 -55429 37943 53549 32133 -11554 12779 -16714 -90346 -85215
13704 -85215 -60595 -35254 42487 35309 5233 48659 51008 39922 -6058 -15962 851 571 -46576
13691 -46576 -121496 -40915 34343 39096 10868 38297 -20670 -75454 -38215 61359 48956 3991
13679 3991 -4819 17439 11641 60472 16238 -67830 -148111 -122140 -54150 -60646 -86359 -115255
13667 -115255 -63508 -9367 -6046 12304 94031 106892 123062 94386 96301 121639 164431 214930
13655 214930 101990 12711 -14396 -11755 -21468 -38142 -43511 -44628 -41771 -42825 -27972 20339
13643 20339 72636 113782 100792 78697 23417 11471 32554 -36678 -33326 -36808 -71160 -58664
13631 -58664 -8818 9607 33071 -21689 -68885 -45350 -67469 -35861 15014 33999 33905 35991
$$ packed form
13716B250N3393n0841p0281J0050R3372J5606k1416m3687K4333k9493p3632N131
13704h5215K4620K5341P7741p178l0076M3426K349j1086m5980r904J6813k80m7147
13691d6576p4920Q0581P5258M753k8228K7429n8967n4784L7239R9574j2403m4965
13679C991q810K2258n798M8831m4234q4068q0281K5971O7990o496k5713k8896
13667a15255N1747N4141L321J8350Q1727J2861J6170k8676J915K5338M2792N0499
13655B14930j12940q9279k7107K641r713j6674n369j117K857j054J4853M8311
13643B0339N2297M1146j2990k2095n5280j1946K1083o9232L352l482l4352J2496
13631e8664M9846J8425K3464n4760m7196K3535k2119L1608N0875J8985r4K086
$$ plain form
13619 35991 4130 22741 62148 77698 52736 49401 20727 5714 -10853 -22790 -31992 -6329
13607 -6329 -10630 34473 94563 110381 87966 80480 109251 120251 186926 204844 142564 126567
13595 126567 135537 46873 -38921 -100831 -18282 29098 -27436 46672 119424 129031 151337 97760
13583 97760 15477 83605 78164 86956 30769 -10619 -13762 -28307 -29532 -12545 20666 -2113
13571 -2113 -29926 14203 42517 65174 22317 -56439 -6251 -3785 -52368 -1072 23271 -63865
13559 -63865 -15537 46690 20472 37583 -12009 -53401 15282 73956 96058 75962 97884 91027
13547 91027 111941 108397 92450 94582 57124 8330 8087 10308 13907 47793 55965 67327 -18399
13534 -18399 -102775 -116429 -125977 -62743 -44973 -54637 -72885 -24665 44272 -19109 -35546 -14302
$$ packed form
13619C5991l1861J8611L9407J5550k4962l335k8674j5013j6567j1937r202K5663
13607f329m301M5103O0090J5818k2415p486K8771J1000O6675J7918o2280j5997
13595A26567Q970q8664q5794o1910Q2549M7380n6534P4108P2752R607K2306n3577
13583I7760q2283O8128n441Q792n6187m1388l143j4545j225J6987L3211k2779
13571b113k7813M4129K8314K2657m2857p8756N0188K466m8583N1296K4343q7136
13559f3865M8328O2227k6218J7111m9592m1392O8683N8674K2102k0096K1922o857
13547I1027K0914l544j5947K132l7458m8794k43K221L599L3886Q172J1362q5726
13534a8399q4376j3654r548O3234J7770r664j8248M8220O8937o3381j6437K1244
$$ plain form
13522 -14302 -6680 -9176 73046 112632 135731 56375 67260 35919 -14675 -31198 4883 5972
13510 5972 -46167 -79317 -97439 -91166 -89456 -53579 -46378 39048 21905 19294 37924 36202 55983
13497 55983 14788 30524 -8915 -33879 -60371 -7300 44916 8843 -1475 30397 64793 -7984
13485 -7984 -72324 -113006 -61007 -4582 8865 15380 -2681 14761 34460 -34201 -86628 -112359
13473 -112359 -105619 -117015 -130986 -114360 -106919 -64664 -73987 -124015 -76783 9433 3405 -32300
13461 -32300 -63337 -91034 -106810 -80434 -61775 -38562 -27638 19195 -40855 -46037 -6789 -44280
13449 -44280 -105193 -128639 -47101 -1031 -64967 -82095 -100171 -56015 16469 57887 52946 42221
13437 42221 17272 365 -3036 -43207 -95002 -49354 8865 -21923 6363 -16382 -41604 -33784
$$ packed form
13522a4302P622k496Q2222L9586K3099p9356J0885l1341n0594j6523L6081J089
13510E972n2139l3150j8122O273J710L5877P201Q5426j7143k611J8630j722J9781
13497E5983m1195J5736l9439k4964k6492N3071N2216l6073j0318L1872L4396p2777
13485g984o4340m0682N1999N6425J3447O515j8061J7442J9699o8661n2427k5731
13473a12359O740j1396j3971J6626P441M2255r323n0028M7232Q6216o028l5705
13461c2300l1037k7697j5776K6376J8659K3213J0924M6833o0050n182L9248l7491
13449d4280o0913k3446Q1538M6070o3936j7128j8076M4156P2484M1418m941j0725
13437D2221k4949j6907l401m0171n1795M5648N8219l0788K8286k2745k5222P820
$$ plain form
13425 -33784 -20295 -9084 -50090 -53396 -27922 -86134 -85302 -49195 -10078 -6976 -51327 -50690 -52190
13412 -52190 -32111 9315 45190 -3182 -26504 -35888 -15039 11908 -10989 -15857 14266 45130
13400 45130 105284 142247 171409 151636 56846 2436 62306 -14230 -43288 -69680 -75242 -45671
13388 -45671 -63426 -75805 -37481 25373 44080 -4311 -7317 11151 63442 87660 13011 24916
13376 24916 37042 12435 52413 70608 35542 3717 44094 63375 89325 14081 -43951 -7572
13364 -7572 5672 14971 50620 45989 11752 -35011 -81017 -49961 -46548 -20714 52337 53051 78463
13351 78463 21580 -7862 -14242 -108538 -136458 -64041 -12630 -51669 3637 70659 47980 63227
13339 63227 56479 13282 34146 45736 68581 33380 39251 65690 36584 680 325 -20713
$$ packed form
13425c3784J3489J1211m1006l306K5474n8212Q32L6107L9117L102m4351O37j500
13412e2190K0079M1426L5875m8372k3322r384K0849K6947k2897m868L0123L0864
13400D5130O0154L6963K9162j9773r4790n4410N9870p6536k9058k6392n562K9571
13388d5671j7755j2379L8324O2854J8707m8391l006J8468N2291K4218p4649J1905
13376B4916J2126k4607L9978J8195l5066l1825M0377J9281K5950p5244n8032L6379
13364g572J3244R299L5649m631l4237m6763m6006L1056L413K5834P3051P14K5412
13351G8463n6883k9442o380r4296k7920P2417N1411l9039N5306O7022k2679J5247
13339F3227o748m3197K0864J1590K2845l5201N871K6439k9106l5904l55k1038
$$ plain form
13327 -20713 41269 43246 79359 39152 -14046 2997 -19145 2839 -12867 -6735 -21860 -26450
13315 -26450 -4760 -109579 -104659 -23947 21010 25548 108784 87845 544 -31770 -13330 44295
13303 44295 67126 18663 -17892 10150 39528 52956 54295 39827 4427 -6296 -20907 3494
13291 3494 15259 85565 63867 69620 -16086 -8708 48128 47602 35300 35771 56045 -14644 -30705
13278 -30705 -25125 66500 122780 129223 63427 11524 31175 40532 54209 14339 1390 -11460
13266 -11460 -28732 -3777 -37865 -46495 -60185 -50014 -25238 3799 -11617 -16686 33222 54011
13254 54011 -12256 12366 71053 56362 66421 53460 89370 54709 33622 25468 58306 59076
13242 59076 97425 63094 6166 3951 22604 22936 25094 13101 -59376 -74012 -22007 27232
$$ packed form
13327b0713O1982J977L6113m0207n3198J7043k2142K1984j5706O132j5125m590
13315b6450K1690j04819M920Q0712M4957M538Q3236k0939q7301l2314J8440N7625
13303D4295K2831m8463l6555K8042K9378J3428J339j4468l5400j0723j4611K4401
13291C494J1765P0306k1698N753q5706P378N6836n26j2302M71K0274p0689j6061
13278c0705N580R1625N6280O443o5796n1903J9651R357J3677l9870j2949j2850
13266a1460j7272K4955l4088q630j3690J0171K4776K9037j5416n069M9908K0789
13254E4011o6267K4622N8687j4691J0059j2961L5910l4661k1087q154L2838P70
13242E9076L8349l4331n6928k215J8653L32K158j1993p2477j4636N2005M9239
$$ plain form
13230 27232 126567 140273 93990 5656 31881 29486 -7391 -78585 -64529 -28173 -34531 -57956
13218 -57956 -33659 1756 11525 -47903 5480 -6805 -8965 28883 26340 15285 -29434 -30280 20742
13205 20742 32660 17597 -33749 -29440 -38941 -52247 -51900 5842 40959 39670 64088 163901 226858
13192 226858 155557 44768 -9798 -17865 -15945 33623 25286 -21962 -16873 2237 -57150 -86680
13180 -86680 -49499 -24753 41752 83274 47840 22591 23496 -1167 -16712 -77038 -103178 -63094
13168 -63094 -28192 -40816 -65816 -36542 -25980 -29062 -38942 -41988 -52910 -56716 -62294 5246 62858
13155 62858 110877 135173 150049 70886 -27280 15474 6118 13279 37951 61640 36294 -72895
13143 -72895 -56835 6814 38847 50329 83852 98286 102205 59664 -6888 -29325 -10249 18706
$$ packed form
13230B7232R9335J3706m6283q8334K6225k395l6877p1194J4056L6356o358k3425
13218e7956K4297L5415R769n9428N3383j2285k160L7848k543j1055m4719q46N1022
13205B0742J1918j5063n1346M309r501j3306L47N7742L5117j289K4418R9813O2957
13192B26858p1301j10789n4566q067J920M9568q337m7248N089J9110n9387k9530
13180h6680L7181K4746O6505M1522l5434k5249R05k4663j5545o0326k6140M0084
13168f3094L4902j2624k5000K9274J0562l082r880l046j0922l806n578O7540N7612
13155F2858M8019K4296J4876p9163r8166M2754r356P161K4672K3689k5346j09189
13143g2895J6060O3649L2033J1482L3523J4434L919m2541o6552k2437J9076K8955
$$ plain form
13131 18706 44363 51442 44423 29665 24051 39037 -11548 25303 810 -42307 -78256 -43562
13119 -43562 -10295 -20640 -12159 26787 3216 16280 62609 105618 172671 173150 104532 54293
13107 54293 67507 12644 30096 24603 -47223 -34803 -14069 12614 -21988 -73577 -71194 -63851
13095 -63851 -26738 -40844 -32492 -13065 7585 40268 32810 48293 47032 36764 62474 61045
13083 61045 1719 -126192 -119471 -54712 -51956 -17350 -4983 -588 -49673 -70147 -4865 21425
13071 21425 -32212 -72184 -58244 -57047 10139 -7470 -14958 39718 24411 -23212 -39233 -73901
13059 -73901 -97708 -38261 -39408 -16783 -2618 -45696 -5102 -52070 -70376 -44075 -57035 -14676
13047 -14676 65940 1697 -116998 -153165 -125120 -64431 -58424 62806 131201 136185 118520 65179
$$ packed form
13131A8706K5657P079p019j4758n614J4986n0585L6851k4493m3117l5949L4694
13119d3562L3267j0345Q481L8946k3571J3064M6329M3009O7053M79o8618n0239
13107E4293J3214n4863J7452n493p1826J2420K0734K6683l4602n1589K383P343
13095f3851L7113j4106Q352J9427K0650L2683p458J5483j261j0268K5710j429
13083F1045n9326j27911O721O4759K756L4606J2367M395m9085k0474O5282K6290
13071B1425n3637l9972J3940J197O7186j7609p488N4676j5307m7623j6021l4668
13059g3901k3807N9447j147K2625J4165m3078M0594m6968j8306K6301j2960M2359
13047a4676Q0616o4243j18695l6167K8045O0689O007J21230O8395M984j7665n3341
$$ plain form
13035 65179 124943 144926 118211 88995 63599 223 21029 54696 61742 66493 109832 146247
13023 146247 179799 198694 257152 386022 574478 719306 803069 785206 525006 339580
13013 339580 255657 187966 124990 52822 -22726 -99719 -55126 -33133 -87066 -37466 43369
13002 43369 105190 114366 78860 -23227 -62138 -62980 -80090 -91210 -78749 -88903 -39409 55426
12990 55426 49484 60086 65740 10349 -24022 -64689 -81694 -97337 -172938 -155098 -122696 -41671
12978 -41671 3166 28270 3767 37821 13878 -11290 15182 42664 36715 48821 -7080 -57638
12966 -57638 -72943 -21046 -74348 -131965 -61939 -18156 70185 49712 -17525 -55536 -17571 29290
12954 29290 39568 2651 -45355 -87734 -80617 -42271 -45008 20138 32802 78790 127139 36503
$$ packed form
13035F5179N9764J9983k6715k9216k5396o3376K0806L3667P046M751M3339L6415
13023A46247L3552J8895N8458J28870J88456J44828Q3763j7863k60200j85426
13013C39580q3923o7691o2976p2168p5548p6993M4593K1993n3933M9600Q0835
13002D3369O1821R176l5506j02087l8911q42j7110j1120J2461j0154M9494R4835
12990E5426n942J0602N654n5391l4371m0667j7005j5643p5601J7840L2402Q1025
12978d1671M4837K5104k4503L4054k3943k5168K6472K7482n949J2106n5901n0558
12966e7638j5305N1897n3302n7617P0026M3783Q8341k0473o7237l8011L7965M6861
12954B9290J0278l6917m8006m2379P117L8346k737O5146J2664M5988M8349r0636
$$ plain form
12942 36503 21352 49702 85801 22937 -40160 -146692 -113091 -75405 16876 40241 54214
12931 54214 26307 17287 -28127 -32324 614 -43690 -70322 -101599 -79040 -100029 -87871 -51973
12919 -51973 -53866 -62765 -8973 -4870 8929 -30691 -123958 -104094 -81847 -32386 -838 -20304
12907 -20304 -22054 22385 55176 85372 66823 72050 38803 74487 58165 53598 -36167 -67051
12895 -67051 -63744 -82849 -62936 -60981 -33558 13201 -67210 19570 49914 38982 23464 41427
12883 41427 57179 41656 43448 16416 27403 92015 72129 -15473 13261 -10175 11431 39942
12871 39942 7979 -3824 -22477 -53868 -18329 34302 -4348 -19565 -42974 -37143 -55203 -44018
12859 -44018 -60566 -36208 -14151 57352 128231 107131 84508 129113 199091 245856 220135 236446
$$ packed form
12942C6503j5151K8350L6099o2864o3097j06532L3601L7686R2281K3365J3973
12931E4214k7907r020m5414m197L2938m4304k6632l1277K2559k0989J2158L5898
12919e1973j893q899N3792M103J3799l9620r3267J9864K2247M9461L1548j9466
12907b0304j750M4439L2791L0196j8549N227l3247L5684j6322m567q9765l0884
12895f7051L307j9105J9913J955K7423M6759q0411Q6780L0344j0932j5518J7963
12883D1427J5752j5523J792k7032J0987O4612j9886q7602K8734k3436K1606K8511
12871C9942l1963j1803j8653l1391L5539N2631l8650j5217k3409N831j8060J1185
12859d4018j6548K4358K2057P1503P0879k1100k2623M4605O9978M6765k5721J6311
$$ plain form
12847 236446 178388 150643 187785 239358 211631 233537 324233 371040 417694 463288 512731
12836 512731 576069 655230 761531 849538 913644 1004308 1095133 1145092 1237409 1355738 1512640
12825 1512640 1688883 1952284 2392798 3106791 4111921 5330385 6330925 6789745 6525190
12816 6525190 5936822 5479682 5552645 6038371 6352118 6113315 5198802 3991240 2859965
12807 2859965 1977240 1434493 1076801 799888 683521 626055 547906 447805 382890 383578
12797 383578 365788 333497 309948 337511 354023 338053 335932 315228 340697 295914 278392 322296
12785 322296 333111 360284 398306 481192 521844 618547 709146 776722 789879 784310 757967 814570
12773 814570 911517 1064835 1358939 1775767 2554156 3726588 5006828 6010345 5313884
$$ packed form
12847B36446n8058k7745L7142N1573k7727K1906R0696M6807M6654M5594M9443
12836E12731O3338P9161J06301Q8007O4106R0664R0825M9959R2317J18329J56902
12825A512640J76243K63401M40514P13993J005130J218464J000540M58820k64555
12816F525190n88368m57140P2963M85726L13747k38803r14513j207562j131275
12807B859965q82725n42747l57692k76913j16367n7466p8149j00101o4915O88
12797C83578j7790l2291k3549K7563J6512j5970k121k0704K5469m4783j7522M3904
12785C22296J0815K7173L8022Q2886M0652R6703R0599O7576J3157n569k6343N6603
12773H14570R6947J53318K94104M16828P78389J172432J280240J003517o96461
$$ plain form
12764 5313884 3547311 2233620 1434763 1027517 770485 617796 519593 488158 426935 365664
12754 365664 301498 236690 125152 130961 122297 149289 145964 185169 168492 67626 56647 62227
12742 62227 113343 181480 164225 118104 121991 141141 191875 211087 214313 95375 36360 70964
12730 70964 71985 83239 78854 70640 114648 152691 134869 193708 205137 228307 267200 295181
12718 295181 275668 316609 324842 294796 342114 302664 348050 402402 421394 465808 526860 593712
12706 593712 734179 1010784 1381588 1702411 2003232 2171652 2158729 2104353 2108430 1988975
12696 1988975 1688552 1223168 900493 634235 463780 341164 297535 210755 150211 142669
12686 142669 185716 179966 130159 114836 107813 65572 86398 86802 71753 69318 64443 85606 94544
$$ packed form
12764E313884j766573j313691p98857m07246k57032j52689r8203l1435o1223o1271
12754C65664o4166o4808j11538N809q664K6992l325L9205j6677j00866j0979N580
12742F2227N1116O8137j7255m6121L887J9150N0734J9212L226j18938n9015L4604
12730G0964J021J1254m385q214M4008L8043j7822N8839J1429K3170L8893K7981
12718B95181j9513M0941Q233l0046M7318l9450M5386N4352J8992M4414O1052O6852
12706E93712J40467K76605L70804L20823L00821J68420j2923n4376M077j19455
12696A988975l00423m65384l22675k66258j70455j22616m3629q6780o0544p542
12686A42669M3047n750m9807j5323p023m2241K0826M04j5049k435m875K1163Q938
$$ plain form
12673 94544 132271 161163 177381 172490 252271 309143 311549 392726 498633 559543 558344 440896
12661 440896 276670 231404 257888 240031 225426 170799 129811 151795 191766 126199 119966
12650 119966 76835 7395 79483 79215 43053 31639 66617 41703 -17024 -20405 -15233 -48250
12638 -48250 5984 65945 82090 18907 -9259 -1532 52144 100199 45108 57837 -24123 -46330
12626 -46330 -26834 -45975 -47702 5808 88580 24051 -26833 3767 -84334 -134476 -68732 -52631
12614 -52631 -83977 -89015 -32275 -16355 -10913 -13827 7625 64051 17270 -37305 -71294 17158
12602 17158 80427 33125 72215 95903 34595 34486 118069 85677 127190 146226 143367 72561
12590 72561 67703 65537 117513 197644 138001 78054 104443 80221 112443 110153 154820 264710
$$ packed form
12673I4544L7727K8892J6218m891P9781N6872K406Q1177J05907O0910j199j17448
12661D40896j64226m5266K6484j7857j4605n4627m0988K1984L9971o5567o233
12650A19966m3131o9440P2088k68l6162j1414L4978k4914n8727l381N172l3017
12638d8250N4234N9961J6145o3183k8166P727N3676M8055n5091J2729q1960k2207
12626d6330J9496j9141j727N3510Q2772o4529n0884L0600q8101n0142O5744J6101
12614e2631l1346n038N6740J5920N442k914K1452N6426m6781n4575l3989Q8452
12602A7158O3269m7302L9090K3688o1308j09Q3583l2392M1513J9036k859p0806
12590G2561m858k166N1976Q0131n9643n9947K6389k4222L2222k290M4667J09890
$$ plain form
12578 264710 276557 295737 340786 386651 434635 507872 625811 657088 655994 778237 841096
12567 841096 878695 906720 954356 1130532 1441458 1989960 2771309 3616973 4268453 3906622
12557 3906622 3332565 3278002 3548368 3940377 3435452 2377936 1598648 1138471 870492
12548 870492 656892 535666 485168 427578 355447 361104 349985 268099 133514 109020 172595
12537 172595 255488 250653 231318 190525 255127 262871 284415 241653 263552 345494 416718 510274
12525 510274 589864 604657 595582 721451 739106 755309 850646 967547 1027083 1162584 1483473
12514 1483473 2018425 2950627 4098435 5009292 5065107 4107359 2890915 1922461 1337345
$$ packed form
12578B64710J1847J9180M5049M5865M7984P3237J17939L1277j094J22243O2859
12567H41096L7599K8025M7636J76176L10926N48502P81349Q45664O51480l61831
12557C906622n74057n4563K70366L92009n04925j057516p79288m60177k67979
12548H70492k13600j21226n0498n7590p2131N657j1119q1886j34585k4494O3575
12537A72595Q2893m835j9335m0793O4602P744K1544m2762K1899Q1942P1224R3556
12525E10274P9590J4793r075J25869J7655J6203R5337J16901N9536J35501L20889
12514A483473N34952R32202J147808R10857N5815r57748j216444r68454n85116
$$ [...]
##END NTUPLES=NMR SPECTRUM
##END=
