##TITLE=Analysis number 327691
Compound Code sew 03939
Book Reference 272636
Project Code adrs flro3
Chemist Name jom
##JCAMPDX= 6.0         $$ Bruker NMR JCAMP-DX V2.0
##DATA TYPE= NMR SPECTRUM
##DATA CLASS= NTUPLES
##ORIGIN= Bruker BioSpin GmbH
##OWNER= nmr
$$ XWIN-NMR		Version 3.5
$$ Mon Apr  2 09:17:15 2007 GMT Daylight Time (UT+1h)  MAYBRIDGE\nmr@NMR_250MHZ
##.OBSERVE FREQUENCY= 250.131544655141
##.OBSERVE NUCLEUS= ^1H
##.ACQUISITION MODE= SIMULTANEOUS (DQD)
##.ACQUISITION SCHEME= undefined
##.AVERAGES= 16
##.DIGITISER RES= 18
##SPECTROMETER/DATA SYSTEM= dpx250
##.PULSE SEQUENCE= zg30
##.SOLVENT NAME= DMSO
##.SHIFT REFERENCE= (INTERNAL, DMSO, 0, 16.522)
##AUDIT TRAIL= $$ (NUMBER, WHEN, WHO, WHERE, WHAT)
$$ ##TITLE= Audit trail, XWIN-NMR		Version 3.5
$$ ##JCAMPDX= 5.01
$$ ##ORIGIN= Bruker BioSpin GmbH
$$ ##OWNER= nmr
$$ C:\u/data/dgb/nmr/ADRS/20/pdata/1/auditp.txt
$$ ##AUDIT TRAIL=  $$ (NUMBER, WHEN, WHO, WHERE, WHAT)
(   1,<2007-04-02 09:16:52.43 +100>,<MAYBRIDGE\nmr>,<NMR_250MHZ>,
      <created by zg, POWCHK disabled, PULCHK disabled
       configuration hash MD5:
       49 4B E0 1D 92 C2 6B 37 9F E6 65 BC 52 41 86 1D
       data hash MD5: 64K
       7B 35 24 04 DA 4D 3C 37 AF EA 54 BE E9 34 02 27>)
(   2,<2007-04-02 09:17:06.51 +100>,<MAYBRIDGE\nmr>,<NMR_250MHZ>,
      <Start of raw data processing
       ef LB = 0.3 FT_mod = 6 PKNL = 1 SI = 32K 
       data hash MD5: 32K
       A5 DC 15 C5 E2 AC 2C 6D 2D D2 78 D7 94 D9 DA 91>)
(   3,<2007-04-02 09:17:08.06 +100>,<MAYBRIDGE\nmr>,<NMR_250MHZ>,
      <apk 
       data hash MD5: 32K
       57 23 43 5A 01 E4 67 20 4F 06 8B 8A 91 95 3E 87>)
(   4,<2007-04-02 09:17:08.81 +100>,<MAYBRIDGE\nmr>,<NMR_250MHZ>,
      <abs ABSG = 5 
       data hash MD5: 32K
       18 D9 B4 86 81 04 90 D8 44 3E BD 8D BF DB 2B FC>)
$$ ##END=
$$ 
$$ hash MD5
$$ 25 EE 14 16 E9 70 A7 68 69 A0 E5 9E 6A BD A2 5A
##$RELAX= 
##$RELAX= 
##$RELAX= 
##$RELAX= 
##$RELAX= 
##$RELAX= 
##$RELAX= 
$$ Bruker specific parameters
$$ --------------------------
##$DU= <C:\u>
##$EXPNO= 20
##$NAME= <ADRS>
##$PROCNO= 1
##$TYPE= <nmr>
##$USER= <dgb>
##$AMP= (0..31)
100 100 100 100 100 100 100 100 100 100 100 100 100 100 100 100 100 100 
100 100 100 100 100 100 100 100 100 100 100 100 100 100 
##$AQSEQ= 0
##$AQ_mod= 3
##$AUNM= <au_zg>
##$AUTOPOS= <4 >
##$BF1= 250.13
##$BF2= 250.13
##$BF3= 250.13
##$BF4= 250.13
##$BF5= 500.13
##$BF6= 500.13
##$BF7= 500.13
##$BF8= 500.13
##$BYTORDA= 1
##$CFDGTYP= 0
##$CFRGTYP= 5
##$CHEMSTR= <none>
##$CNST= (0..31)
1 1 145 1 1 1 1 1 1 1 1 1 1 1 1 1 1 1 1 1 1 1 1 1 1 1 1 1 1 1 1 1 
##$CPDPRG= <>
##$CPDPRG1= <>
##$CPDPRG2= <>
##$CPDPRG3= <>
##$CPDPRG4= <mlev>
##$CPDPRG5= <mlev>
##$CPDPRG6= <mlev>
##$CPDPRG7= <mlev>
##$CPDPRG8= <mlev>
##$CPDPRGB= <>
##$CPDPRGT= <>
##$D= (0..31)
0 1 0 0 0 0 0 0 0 0.06 0 0 0 0 0 0 0.0002 0 0 0 0 0 0 0 0 0 0 0 0 0 0 
0 
##$DATE= 1175501811
##$DBL= (0..7)
120 120 120 120 120 120 120 120 
##$DBP= (0..7)
150 150 150 150 150 150 150 150 
##$DBP07= 0
##$DBPNAM0= <>
##$DBPNAM1= <>
$$ [...]
##$SUBNAM6= <"">
##$SUBNAM7= <"">
##$SUBNAM8= <"">
##$SUBNAM9= <"">
##$SW= 20.6930455092707
##$SWIBOX= (0..15)
0 0 3 0 0 0 0 0 0 0 0 0 0 0 0 0 
##$SW_h= 5175.983436853
##$TD= 65536
##$TD0= 1
##$TE= 683.16
##$TE2= 300
##$TE3= 300
##$TEG= 300
##$TL= (0..7)
0 120 120 120 120 120 120 120 
##$TP= (0..7)
150 150 150 150 150 150 150 150 
##$TP07= 0
##$TPNAME0= <>
##$TPNAME1= <>
##$TPNAME2= <>
##$TPNAME3= <>
##$TPNAME4= <>
##$TPNAME5= <>
##$TPNAME6= <>
##$TPNAME7= <>
##$TPOAL= (0..7)
0.5 0.5 0.5 0.5 0.5 0.5 0.5 0.5 
##$TPOFFS= (0..7)
0 0 0 0 0 0 0 0 
##$TUNHIN= 0
##$TUNHOUT= 0
##$TUNXOUT= 0
##$USERA1= <user>
##$USERA2= <user>
##$USERA3= <user>
##$USERA4= <user>
##$USERA5= <user>
##$V9= 5
##$VALIST= <valist>
##$VCLIST= <CCCCCCCCCCCCCCC>
##$VD= 0
##$VDLIST= <DDDDDDDDDDDDDDD>
##$VPLIST= <PPPPPPPPPPPPPPP>
##$VTLIST= <TTTTTTTTTTTTTTT>
##$WBST= 1024
##$WBSW= 4
##$XGAIN= (0..3)
0 0 0 0 
##$XL= 0
##$YL= 0
##$YMAX_a= 409556
##$YMIN_a= -361613
##$ZGOPTNS= <>
##$ZL1= 120
##$ZL2= 120
##$ZL3= 120
##$ZL4= 120
##$ABSF1= 16.522
##$ABSF2= -4.171173
##$ABSG= 5
##$ABSL= 3
##$ALPHA= 0
##$AQORDER= 0
##$ASSFAC= 0
##$ASSFACI= 0
##$ASSFACX= 0
##$ASSWID= 0
##$AUNMP= <proc_1d>
##$AZFE= 0.1
##$AZFW= 0.1
##$BCFW= 0
##$BC_mod= 0
##$BYTORDP= 0
##$COROFFS= 0
##$CY= 12.5
##$DATMOD= 1
##$DC= 0
##$DFILT= <>
##$DTYPP= 0
##$F1P= 14.0000005364418
##$F2P= -0.99999901652339
##$FCOR= 0.5
##$FTSIZE= 32768
##$FT_mod= 6
##$GAMMA= 0
##$GB= 0
##$INTBC= 1
##$INTSCL= 1
##$ISEN= 128
##$LB= 0.3
##$LEV0= 0
##$LPBIN= 0
##$MAXI= 10000
##$MC2= 0
##$MEAN= 0
##$ME_mod= 0
##$MI= 0
##$NCOEF= 0
##$NC_proc= -3
##$NLEV= 6
##$NOISF1= 0
##$NOISF2= 0
##$NSP= 0
##$NTH_PI= 0
##$NZP= 0
##$OFFSET= 16.522
##$PC= 1
##$PHC0= 218.8573
##$PHC1= 6.78301
##$PH_mod= 1
##$PKNL= yes
##$PPARMOD= 0
##$PSCAL= 4
##$PSIGN= 0
##$REVERSE= no
##$SF= 250.13
##$SI= 32768
##$SIGF1= 0
##$SIGF2= 0
##$SINO= 400
##$SIOLD= 32768
##$SREGLST= <1H.DMSO>
##$SSB= 0
##$STSI= 32768
##$STSR= 0
##$SW_p= 5175.98343685301
##$SYMM= 0
##$S_DEV= 0
##$TDeff= 65536
##$TDoff= 0
##$TI= <Analysis number 999999
Compound Code 99
Book Reference 9
Project Code 9>
##$TILT= no
##$TM1= 0
##$TM2= 0
##$TOPLEV= 0
##$USERP1= <user>
##$USERP2= <user>
##$USERP3= <user>
##$USERP4= <user>
##$USERP5= <user>
##$WDW= 1
##$XDIM= 32768
##$YMAX_p= 589398232
##$YMIN_p= -119985
$$ End of Bruker specific parameters
$$ ---------------------------------
##NTUPLES= NMR SPECTRUM
##VAR_NAME=  FREQUENCY,     SPECTRUM/REAL,   SPECTRUM/IMAG
##SYMBOL=    X,             R,               I
##VAR_TYPE=  INDEPENDENT,   DEPENDENT,       DEPENDENT
##VAR_FORM=  AFFN,          ASDF,            ASDF
##VAR_DIM=   32768,         32768,           32768
##UNITS=     HZ,            ARBITRARY UNITS, ARBITRARY UNITS
##FACTOR=    0.157963299565203, 1,           1
##FIRST=     4132.6476996994, 0,             0
##LAST=      -1043.33573715361, 0,           0
##MIN=       -1043.33573715361, -119985,     0
##MAX=       4132.6476996994, 589398232,     0
$$ Real data points
##PAGE= N=1
##DATA TABLE= (X++(R..R)), XYDATA
$$ [...]
22397 24834 37733 42779 50311 60510 39894 28047 32685 21614 17530 38766 47797 38267 18491
22384 18491 4169 16703 2802 22748 47917 67040 51044 46925 42546 34385 19425 29158
22372 29158 38665 21883 -11800 -9377 8602 35008 1095 -23461 -5756 14203 5839 -11675
22360 -11675 -4260 18226 25922 38573 54715 57230 45099 10267 -1776 -12313 -23031 -7379
22348 -7379 -3060 33492 41448 14923 4068 15025 11285 -3217 -14134 -28986 -19410 -5038 22819
22335 22819 56681 33465 39435 49857 27813 29889 51011 28870 37053 60710 54249 38416
22323 38416 15849 15245 25095 -4087 -17317 -21058 -10984 979 12392 19397 10318 16265 10563
22310 10563 15199 6535 13593 15272 12613 23613 40617 34719 37027 16509 15593 19426 3760 -2697
22296 -2697 16051 43714 25449 2722 -16106 -10931 -9949 -18455 -26658 -10249 20554 27188 5865
22283 5865 -21741 -5354 17822 30727 8471 33408 57816 42118 22154 7242 10411 38530
22271 38530 53329 51189 38156 14039 37037 70974 44865 19886 -1602 1137 -15282 -31886
22259 -31886 -32159 -11124 -6557 3852 3971 2917 -1542 25620 62376 75877 67795 71924 50779
22246 50779 46059 16342 9436 13799 10572 25772 43532 27544 13131 -7596 -25958 -43161
22234 -43161 -38921 -32703 -31707 -26612 -30429 -27158 -3292 7018 2481 -2923 -23197 -21784 13745 10912
22220 10912 -2912 35380 44681 34058 47861 20154 22615 41249 67306 59999 45404 37443
22208 37443 47714 15001 18150 33989 5231 15559 18751 25537 19143 46163 54423 64286 50887
22195 50887 28505 15112 -5652 3454 8506 15527 4483 -1094 -18715 -38372 -35792 -15804 -19419
22182 -19419 -8310 24618 19421 17508 21007 33741 32905 54291 37626 34063 41211 28853 25477
22169 25477 57646 92890 103861 79838 53022 55071 50416 68482 75954 86489 92144 104182
22157 104182 138910 163364 173864 188517 181023 157837 137793 145817 113722 75199 69375 60071
22145 60071 47687 72347 85240 75275 34196 38148 40189 30444 47410 50182 50617 43122 52975
22132 52975 40381 38813 11441 55091 74956 66159 53050 42078 36131 38718 40382 33178 48852
22119 48852 53560 64536 81624 108703 148271 155837 140679 124383 127686 125980 103248 109234 120401
22106 120401 98730 86934 105401 99862 75584 47106 38583 35448 49745 66609 57432 59984
22094 59984 76115 84143 48619 35433 38803 56893 55032 64060 71712 80056 94645 73499 50929
22081 50929 38316 35579 55332 48205 55748 74071 67728 80310 97213 103243 88506 72122 102313
22068 102313 99553 91714 82145 111199 142058 144483 168203 165949 111280 71505 63203 88146 94043
22055 94043 106070 126831 110055 89280 89471 64362 74759 93997 88981 77777 82091 74141 76913
22042 76913 103325 113901 100065 127119 118539 99670 95162 76191 56845 60604 74411 74331 91897
22029 91897 92054 97404 96124 95255 107119 114308 105776 98331 110447 95028 83304 116958 110780 113029
22015 113029 106561 102361 102515 118302 133806 134721 136822 142324 133016 128167 138068 135148 137084 169049
22001 169049 180800 156087 157601 145773 123039 135875 144573 169854 187229 186295 177995 190740
21989 190740 182054 163617 166491 167718 191481 208515 229471 243106 258096 226234 214924 236405
21977 236405 241643 238973 223519 230224 248928 262807 250889 255158 249931 245751 265860 301447 323198
21964 323198 308982 302947 288184 280062 294962 318995 296456 267012 294812 317441 341428 336347
21952 336347 318791 323033 354987 357342 384915 373993 372888 410572 415352 410057 424108 432007 424427
21939 424427 449707 483259 500621 512976 526556 512838 519293 534009 555880 540443 577307 590391
21927 590391 607869 653842 651666 630187 654502 676778 727614 745980 756131 764076 817348 863658
21915 863658 905493 939867 967730 1011825 1080892 1140882 1160325 1161076 1179419 1234551 1290900 1318549
21903 1318549 1382684 1459269 1546430 1618204 1702876 1819989 1945153 2039977 2112713 2220816 2356301
21892 2356301 2519342 2698878 2882910 3060401 3256347 3492464 3747068 4021806 4332245
21883 4332245 4663842 5048088 5447895 5913268 6441150 7027194 7733505 8516849 9388446
21874 9388446 10364971 11547485 12872125 14374293 16068774 17981921 20096276 22412295
21866 22412295 24877161 27388819 29813263 31980210 33686315 34747785 35046522 34537325
21858 34537325 33285313 31422587 29209335 26806734 24370496 22024512 19817578 17799004
21850 17799004 15983242 14351105 12904100 11623481 10502544 9525348 8671448 7889945
21842 7889945 7205596 6604499 6053964 5546554 5115189 4725801 4362098 4003606 3701971
21833 3701971 3460216 3242254 3022190 2845806 2687257 2544004 2400175 2253240 2111517
21824 2111517 2012096 1931092 1815073 1694966 1614721 1545987 1474357 1388545 1324133 1272156 1226166
21813 1226166 1164497 1120125 1073661 1018126 988543 937475 889566 846107 820537 783681 765336
21802 765336 758401 739344 736575 722447 678887 646911 643980 648248 639840 607383 560777 527486
21790 527486 509395 496336 490957 476216 475802 473077 463684 453051 453023 419595 384364 355731 333765
21777 333765 337323 329169 329660 332237 313105 284236 259830 288795 302233 304246 286722 271377 263822
21764 263822 280925 276691 257602 248207 237971 203923 186338 220225 246117 240401 225044 218745
21752 218745 183954 176904 201880 203720 211309 225823 216265 211803 235198 249878 237865 214394
21740 214394 193448 187078 200825 200508 206032 197427 182754 172776 184737 194371 189147 193300 166883
21727 166883 142244 122408 90135 64923 64109 80819 100530 92118 82162 77334 119487 125040 122433
21714 122433 110895 92779 87020 78662 60622 63423 75978 68531 66915 62439 64519 50838 65621
21701 65621 81891 77578 84766 103664 103245 97406 84696 60487 61709 74492 71780 56329 30485
21688 30485 46925 45578 24581 38050 62364 66945 71563 89021 80471 68154 42693 16540
21676 16540 38998 39599 51180 74940 78350 64554 67599 72533 65105 69649 61799 56152 51230 43261
21662 43261 30038 12165 21252 43165 34215 7921 10438 27895 24788 15101 12391 29581 39671
21649 39671 33130 19005 -4357 -8998 21612 39865 22921 15566 43948 39327 24236 32060 5189
21636 5189 6701 24898 60966 86338 89611 55154 36457 41208 48520 28659 22619 27948 28157
21623 28157 23519 8393 6443 27303 44137 41187 23013 19917 43785 42606 52023 49429 39987
21610 39987 22819 -26317 -14386 17351 39753 46320 48972 36989 25554 9588 22398 16513
21598 16513 26232 35248 39859 37387 5883 6656 9525 -604 4272 7112 7135 1154 41552 51429
21584 51429 73488 65584 28291 3 3102 14561 26113 50062 78770 74746 85713 89642
21572 89642 62495 55122 54516 68660 87407 116684 116393 127837 133337 123058 132698 161028 149307
21559 149307 105558 89890 115246 106744 103717 88883 64199 69914 46595 3109 -3269 662
21547 662 14789 16066 16824 -4829 -1930 -4230 -30897 -7045 48424 42494 8934 27720 49776
21534 49776 47263 50120 40744 29194 18024 23434 12034 -4536 -22045 -3195 10818 -3999
21522 -3999 -11457 -22083 -11687 -19664 -31267 754 3094 5404 18685 17882 -5153 2317 10606
21509 10606 22665 35312 44058 17993 5362 11794 24429 54080 59097 48966 20103 38605
21497 38605 32905 36286 16388 24809 8431 -5325 24036 25480 -917 20879 37922 49035
21485 49035 38525 30012 36289 50184 55493 37293 8646 -18789 -53604 -31834 8586 12627
21473 12627 75 7915 18003 27067 46612 46432 45275 57339 60125 41992 38785 32974 2810
21460 2810 -4686 5572 2043 -8727 -11838 -12337 10471 20119 6100 915 -13434 -6902 -16188 1120
21446 1120 20942 10067 -32469 -15935 16546 33783 41462 28642 29290 39040 31076 429 -11601
21433 -11601 -16098 12009 10753 -6461 -5366 -5521 -5286 -11010 -12022 -4593 16779 25122 2534 -20847
21419 -20847 -17182 -26042 -16807 6417 27747 54641 62594 16912 1056 26476 46774 52019 28237
21406 28237 -4470 3383 20507 26394 11726 3081 10086 32278 21976 4192 -4071 1433 -15155
21393 -15155 -16816 -28607 -54517 -45887 -33778 -11249 18203 44686 26787 31799 38416 45850 58953
21380 58953 42288 43439 17702 33720 47760 61134 51246 16800 2290 18356 26017 26833 13917
21367 13917 10562 7590 15868 2807 -12165 -1144 -5008 -33318 -33722 -34731 -26290 -12890 -39842
21354 -39842 -53184 -23610 -20914 -28586 -17698 -5165 7421 7748 -3475 13995 23222 26891 6416
21341 6416 4283 -2811 -2022 -5858 7868 9045 -2004 10066 31887 36640 34524 19001 10014 11502
21327 11502 -3308 11541 14234 10466 598 11545 8482 -697 13480 24102 30602 17072 24964
21314 24964 28189 24473 22998 -3975 -15913 10945 39916 11083 -12900 -20726 -8600 -8929 183
21301 183 -16537 -37236 -40301 -42877 -46499 -11507 -6588 3898 7491 2850 -2442 -2131 7658 46503
21287 46503 46131 25233 31919 20079 -69 -10815 -10352 34482 23092 -13364 -8180 18816 27847
21274 27847 16826 16595 7930 -24935 -36563 -37145 -46569 -45789 -33730 -55178 -57951 -26579 -17806 -24125
21260 -24125 7139 33315 39676 18630 10007 7572 -5341 -13897 -17558 -39345 -61872 -18679 21456
21247 21456 21856 4811 7944 -2430 -5122 3643 14607 30527 22458 18826 6536 10966 3744
21234 3744 -22277 -15879 16321 27759 4225 -2735 -1187 -5812 13451 21724 5223 3632 -17622
21221 -17622 -41859 -29858 2568 10186 10690 -9464 -33989 -30495 -20468 -30877 -40824 -49199 -40629
21208 -40629 -58327 -47905 -3763 26794 27304 3763 8178 16568 14117 3943 10816 2834 -18292
21195 -18292 -37725 -30219 -7386 3173 24634 353 -18523 -15204 -18887 -10869 -13628 -7945 -18285
21182 -18285 677 -7219 -19251 -19235 -17124 -8245 -22819 -20293 -9018 25094 54616 56275 42234
21169 42234 9087 -6443 -21482 -30500 -31166 1492 5863 -12487 1185 -22420 3920 -14251
21157 -14251 -9574 14627 24341 8654 -210 5010 -3209 30108 54822 46301 20056 2118 5566
21144 5566 12493 10686 10376 -2700 -19304 -29210 -41390 -14620 12750 13390 8736 9804 -5416 -17136
21130 -17136 -30285 -25283 -2168 -890 3004 16157 2483 2699 21054 25020 33866 35195 30077
21117 30077 -4387 -11615 -958 12558 16196 16286 11830 20561 26022 9876 10986 12249 16959 33110
21103 33110 61584 87745 113529 90945 76731 78555 70150 71751 52765 35172 70331 69795 78450
21090 78450 73508 70019 96553 122985 135907 140889 137925 180057 215892 218439 222574 221063 216014
21077 216014 192160 169280 161438 156854 137768 124971 94545 82945 73660 85108 84652 64193
21065 64193 57154 56278 51822 47718 56840 61668 82011 64503 62645 64874 46541 42418 81275 70446
21051 70446 26344 28108 55266 72500 80577 88851 88762 86177 60235 76301 76046 66252 59504 84757
21037 84757 118479 118916 114674 116414 111056 93009 83835 102469 128163 166287 199522 214145 192151
21024 192151 189866 204507 241332 268715 263719 258348 276173 310370 368001 433349 487448 508047
21012 508047 559125 618630 663666 713682 798299 884279 979473 1077952 1190155 1248805 1305741
21001 1305741 1344459 1375035 1386703 1361159 1289327 1209745 1140358 1048742 972891 894057 828969
20990 828969 758443 675953 582013 537907 495911 444141 396355 386333 345699 324515 274424
20979 274424 227063 225998 229768 197612 172796 165831 169309 177701 181519 198070 192806 146675 110584
20966 110584 73974 59573 80018 70521 76600 95243 73905 50663 48973 47420 37355 13277
20954 13277 11616 2559 8093 -2869 5708 66205 79731 67954 83981 102640 80900 60796
20942 60796 55669 29383 2352 17675 6694 5297 16535 24945 1712 -6472 789 35685 44623
20929 44623 38356 18252 5302 -18970 -60319 -29446 -18056 -35047 -23427 14089 40224 24686
20917 24686 -6518 -8134 -4271 19395 18585 27774 21441 9458 20783 5815 320 16970 -6809
20904 -6809 -38638 -27913 -31499 -29459 3292 11709 17141 6710 13602 18936 16179 3542 -14884
20891 -14884 -20524 -18972 -17127 -23258 -32815 -14331 -15660 -10327 -25054 -32510 -15964 -13578 -18646 -31719
20877 -31719 -12159 9936 19582 39738 27392 -1442 21736 36836 27889 20978 -4480 -9145
20865 -9145 -9426 -2055 31845 57679 26202 -17136 -37878 -33781 -42051 -35468 -4159 549 7009
20852 7009 20184 30588 -156 -36565 -31949 -7069 6229 16453 44073 55687 32143 -31586
20840 -31586 -53600 -46653 -40070 -34041 -12754 2451 -9502 -3168 14338 15801 -8212 13114 35503
20827 35503 8799 -31081 -14212 19548 27584 28826 81 -27535 -30779 -15981 -8353 3030
20815 3030 1240 6933 12338 24002 11112 -19304 -38264 -13218 -2395 -1922 8440 6296 -4536
20802 -4536 -3429 -12511 -23707 -31517 -24420 -8298 11288 -4592 -4035 9832 -1651 -5414 2415
20789 2415 14023 29830 18084 15563 -2121 9235 207 7045 4435 -8309 18203 32697 32844
20776 32844 -10364 -29481 -22154 -23450 -33031 -35414 -23538 7224 43519 42975 15732 -116 11071
20763 11071 18509 -17493 -10877 3011 12852 7085 -6770 -7547 109 17453 61 -19428 -15142
20750 -15142 -27619 -51929 -55464 -31416 2952 -2998 -12199 -23497 -28466 -15906 -15028 -27653 -44601
20737 -44601 -35990 -25887 -7804 -16673 -35516 -22401 -16342 -13530 -12781 7454 9963 -682 12150
20724 12150 23795 28096 23834 31214 20748 29056 56093 47966 35884 39913 12313 -10186 13700
20711 13700 4961 -12550 -10763 3569 936 -16810 -40106 7610 24569 1248 7518 36509
20699 36509 55860 42382 11443 -3455 -2858 -21732 -22009 -45792 -47787 -17597 -23038 -25395 -15502
20686 -15502 -18971 -11174 -11903 3963 -5667 21620 40480 28495 8230 11988 15986 21942 11267
20673 11267 -7786 -8848 4303 1179 4363 -878 -17947 -21806 -35387 -35254 -13047 16183 5390
20660 5390 -4315 -4462 28240 24430 3933 23740 10471 -376 -15789 -31774 -48264 -53993 -41571
20647 -41571 868 14438 35728 -5802 -36231 -57234 -40281 -12636 -5057 -3776 6361 19077
20635 19077 26350 16466 -14790 -18077 -3583 4649 20618 32332 35334 19358 5000 19863 -10152
20622 -10152 -38887 -26714 -32882 -88241 -95785 -64990 -17212 -11251 -42825 -63510 -71568 -59019
20610 -59019 -40790 -27002 -15409 -17756 -12276 -13461 -12407 -21771 -31688 -33597 -23989 -14416 -132
20597 -132 -7029 -15454 -23936 -3546 1879 1215 -10505 -26751 -4706 21513 21715 25205 38963 32319
20583 32319 10802 5551 18311 22704 3019 -20549 -12295 -2897 42200 37982 3905 -25319 -10458
20570 -10458 -5422 -2312 -21435 -16873 -41773 -35789 -12937 1880 29460 25726 20553 39701 40235
20557 40235 11251 -13359 -19823 -20033 -25822 -33580 -15705 -8561 -3106 -15864 -23992 1460 2381 19605
20543 19605 14799 4500 -22759 -22038 -33191 -39144 -59046 -40143 -35106 -31370 7469 29410 27883
20530 27883 23130 -9805 -25648 -1413 -17843 -21378 -19867 -29993 -40500 -27869 -23856 -42451
20518 -42451 -69267 -81446 -54195 -37483 -25854 -28111 -7321 30477 25973 25363 1577 -30035
20506 -30035 -6276 5163 -5387 -406 10847 -6607 -23571 -20347 -30002 -19493 -11433 -7672 5174
20493 5174 1614 2254 7491 -7558 -19138 -19024 -17711 -20215 -34884 -2148 -9278 -21636 -48300 -59580
20479 -59580 -41370 -15229 -27608 -25728 -11433 -16405 -4633 -5538 -14745 10620 24361 -419 -16255
20466 -16255 -15089 -30788 -32540 -29818 -1826 21235 47322 49914 22854 39978 53998 39497
20454 39497 25774 23592 28656 17677 18642 34481 18094 -23332 -33706 -18858 -26620 -16576 -15497
20441 -15497 -23371 -24389 -19899 6982 13551 8951 -16573 -28656 -16725 -8926 -11682 -20781 -23571
20428 -23571 -11695 -18290 -28431 -16493 -25301 -26824 -198 -5507 -9588 -13267 -26774 -9209 6605
20415 6605 25769 25251 11478 -4413 -13739 11723 -25182 -26890 -4285 -19539 -2354 -313 -24631
20402 -24631 -63318 -57503 -10888 -665 -29431 -15038 10959 -788 -9548 -20155 -2852 5880
20390 5880 9856 -9559 -10657 -31479 -9713 35274 35593 15712 -22472 -52478 -45801 -25375 -20914
20377 -20914 -39461 -22295 -6550 -2388 3442 -2743 -9359 814 22126 31248 21559 16354 5987
20364 5987 -18885 -31718 -3680 -11235 -27297 -40592 -38290 -14399 -15415 -23004 -23200 -6826 -2953
20351 -2953 -748 7243 -10818 -26645 -28160 -16478 -41141 -34028 -6681 -3693 -17459 -41457 -57869
20338 -57869 -31365 -10639 -13221 -5532 2348 -1935 2993 -5838 -15108 -19805 -27526 -7580 93 2903
20324 2903 5366 6533 -22945 -27428 -11810 14305 15094 -338 7071 19779 -5263 -48148 -76934
20311 -76934 -59710 -36248 -392 522 12283 -40 -27690 -36099 -39342 -30707 -30562 -17250 -30773
20298 -30773 -37629 -59643 -54799 -39282 -42172 -41790 -55859 -78702 -75461 -59380 -82749 -52147 -22449
20285 -22449 -13880 8905 97 -11846 -13233 -12361 -19584 -16721 -25477 -13631 -11885 89 -1466 10004
20271 10004 35994 27709 26522 22171 -1677 7595 31063 33885 16510 -7018 13217 7186 -9319
20258 -9319 -8442 1221 8658 -9189 812 -15892 -12685 9605 27115 22790 -5746 -27869 -28772
20245 -28772 17148 15463 3237 1217 -10214 -26336 -41451 -31023 -28854 -14716 -14874 -26762 -13749
20232 -13749 13582 24358 -3363 -29598 -50056 -37136 -18469 -4347 1977 11841 -8814 -14010
20220 -14010 6541 11170 9716 13373 4121 -490 7817 10146 -23743 -44633 -38961 -18874 -20476
20207 -20476 -37172 -14270 8690 3850 -2729 -13386 -11352 -23308 -1973 5279 -16984 -7418 11342
20194 11342 33468 34616 23199 21900 11684 31229 8549 18055 4340 -4416 -13637 -2754 2129
20181 2129 -1601 -21598 -41481 -5703 10938 2160 -13714 -35584 -31386 -17279 -582 3041 9440
20168 9440 -3712 -17193 -11942 -7429 15035 32782 40198 18062 -567 5908 11828 5875 12229
20155 12229 -4206 4297 -14205 -17296 -8824 -25446 -143 35629 54656 40752 34859 21127
20143 21127 16618 1592 344 -2116 -18641 -26921 -24024 -13778 -14925 -13372 -24497 -34902 -20637
20130 -20637 10538 16898 307 25771 24332 8902 -1120 -1287 14588 73 -33039 -46429
20118 -46429 -44658 -38736 -24520 -24101 -23730 -4213 -31674 -38830 -36137 -45130 -52219 -39218 -46265 -28517
20104 -28517 -8085 -14136 -12447 -25870 -13970 -10196 -9718 -32550 -60237 -63057 -40961 -34837 -12165
20091 -12165 16044 8839 -3353 12716 4816 -4505 10333 -2560 12437 15859 26167 -1163
20079 -1163 -3241 -10917 -24915 -31151 -24750 3809 9923 16250 9861 2962 12140 8439 -30243 -31423
20065 -31423 -24558 -9715 -7028 -10685 -50041 -38794 -15716 -6267 -4854 -3111 -9220 9673 22582
20052 22582 19952 -668 -18727 -1713 -23449 -18349 -24268 -35368 -34918 -43919 -44401 -33286 -19480
20039 -19480 -3992 -3639 -1978 -9392 -4118 -35473 -44504 -40377 -28743 -31673 -44346 -41042 -11019
20026 -11019 -609 15667 51774 39503 13930 7292 11531 39243 28381 13392 19528 29879
20014 29879 18027 -5884 -25585 -21660 -141 -1102 -30118 -36161 -46249 -34724 -15256 -24843 -30908
20001 -30908 -27768 -19748 -40814 -36231 -9246 17998 -794 -33012 -35901 -33046 -58753 -48359 -30775
19988 -30775 -35278 -39785 -56804 -30231 -3151 -4063 -7555 -41846 -54085 -33914 -17783 -18521 -32088
19975 -32088 6599 43922 13544 -34194 -40387 -23616 -7654 1508 15987 16437 8324 4747 7824
19962 7824 -15026 -39865 -27836 5495 -616 -27212 -15965 -10603 -11544 6871 -29547 -28950 -16382
19949 -16382 21539 12191 -8507 -15236 -14137 5145 14517 26670 32114 40303 44857 42350 23742
19936 23742 -806 -911 12007 -5222 -28051 7234 22389 7928 -4329 6544 2305 1677 -21493
19923 -21493 -26747 -17781 -15099 -26577 -43227 -40866 -408 1961 -19074 -19097 -12231 13321 2918
19910 2918 -5396 -39205 -45455 -26961 -36565 -26357 -2611 2892 -11871 -29313 -57509 -82469 -80389
19897 -80389 -52591 -24449 -12620 -8601 -17218 -26519 -23470 -32072 -26937 -9652 -8888 -32774 -21768
19884 -21768 -3139 -1136 -3639 14159 26611 -6151 -21107 7198 -8457 -5295 4450 2944 -28178
19871 -28178 -42277 -50569 -50888 -55276 -38118 -14251 -24846 -37477 -44458 -36380 -8105 -9505 -30382
19858 -30382 -29846 -12306 -26770 -33792 -26040 -21792 10364 12879 -20013 -13305 -49845 -51134 -63671
19845 -63671 -52858 11162 9418 -21684 -23860 -19376 -9845 11123 24378 32044 22043 -15083 -42457
19832 -42457 -53995 -27653 -9800 -4123 7214 2336 -9762 -17117 9078 9710 15497 17556 8008
19819 8008 25154 37830 36835 574 -14853 -5993 -16008 4546 17460 17425 12377 15566 -11791
19806 -11791 -18135 -14191 -24412 -13550 -10630 -14939 -19846 -35563 -32714 22348 22772 992 -6907
19793 -6907 -21657 -18886 -5016 8710 -16314 -14092 10606 2999 -14814 -6501 -295 18414 18064
19780 18064 4574 -3026 -4796 -26393 -14358 15259 34498 20499 -10679 -3930 39755 43161
19768 43161 6212 -3105 3581 30877 21179 2631 -12249 -44948 -27323 3308 -6906 -9270
19756 -9270 -31141 -46974 -40862 -44606 -53456 -64686 -41204 -1809 4235 10241 13477 -14255 -45452
19743 -45452 -58796 -18452 -5386 -17642 -16863 -9288 -14187 -11008 832 -1567 414 -6123 -33508
19730 -33508 -15852 -2334 -3968 -9043 -47974 -46596 -38350 -48936 -44500 -40276 -23622 3243 29433
19717 29433 24186 26324 17783 -7572 -9709 -21025 -795 10283 26844 43289 27239 4982
19705 4982 1248 13949 30425 22856 7082 -539 12290 16881 20492 12709 1164 16050 2193
19692 2193 -29119 -36455 -24726 -17999 -13938 -23770 -38003 -20323 -9111 -1396 -10059 -26902 8874
19679 8874 17861 -5475 -24714 -14892 3813 -6355 -6185 -7110 -24672 -47208 -47644 -15306 -6228 -23328
19665 -23328 -34537 -37255 -43071 -43016 -57544 -35639 -27186 -13887 -17684 19784 11116 -11645 3170
19652 3170 8753 -15004 -30167 -38124 -52068 -48385 -25873 -32617 -45444 -19400 -36079 -36543 -2326
19639 -2326 20960 46623 38997 13720 -9768 3760 -14131 -37531 -30019 -40997 -58600 -55940
19627 -55940 -11683 -756 -42185 -36586 -3213 15773 -18852 -57140 -77945 -51120 -49559 -19600
19615 -19600 -28777 -13592 -20557 -25002 -2855 28807 41767 33216 5539 -5469 -11564 -13833 -16037
19602 -16037 -39422 -49082 -23147 -13137 -6589 -16728 -9520 4102 -5882 -2166 -16217 -53897 -74882
19589 -74882 -69374 -57342 -47387 -21688 -6578 6243 -7044 -18930 -12215 17010 34329 17067
19577 17067 -37530 -49080 -44186 -16690 -26106 -26356 -6169 -20526 -27988 -9038 -8227 -26824 -11053
19564 -11053 -25414 -12580 15185 -18365 -59145 -85091 -87600 -68839 -70809 -40592 7119 -7151
19552 -7151 -51328 -53204 -36180 -49328 -28176 -8483 5799 5778 -8917 -21452 -2699 -212 -26643
19539 -26643 -38560 -50397 -42291 -28505 -51985 -74552 -67039 -39936 -19984 -3301 -8651 -1167
19527 -1167 -25334 -24295 -7396 -27663 -30923 -21284 3597 -6428 -9670 -15394 -23152 -21644 -32694
19514 -32694 -31066 -4227 10732 8239 5240 -2245 15588 -15587 -31506 -7161 30895 44455
19502 44455 29602 -10837 -30058 -34443 -38067 -30977 5677 27884 18574 1630 -12190 -16337 -24145
19489 -24145 -16746 -29479 -39571 -21568 1125 10264 -84 -35647 -26866 -22208 -19378 -9568 -20743
19476 -20743 -19495 1548 -243 -29825 -37612 -12329 -2204 -9613 -10769 -9839 -31209 -21583 -6566
19463 -6566 19449 14490 5489 17645 16464 5393 -8645 15126 24748 23679 41189 27132 16193
19450 16193 26087 10261 -5691 -22524 -26094 -17766 3918 19686 31596 45449 50621 21381
19438 21381 10222 -4818 -241 -9515 -5488 11837 23056 23383 -6132 -24734 -11307 10938 488
19425 488 -21370 -26230 -38535 -36701 -14298 8599 -3443 -34532 -28535 -10382 -11408 -7645 -9398
19412 -9398 9588 27729 -9031 -35692 -43974 -37659 -15909 -17886 -25474 -29646 -34784 -45364 -67753
19399 -67753 -67820 -21034 -14024 -8379 -6869 -27080 -24080 -44305 -33705 -7181 -8870 -5893 -17981
19386 -17981 -6854 1094 16915 21567 20815 6353 -466 -31512 2947 25926 21052 23423 18206
19373 18206 30749 53220 54598 17737 5443 -1918 7335 7021 7991 13563 -2199 2584 38836
19360 38836 60914 28042 -23470 -46496 -49937 -41605 -52179 -55965 -12651 -20542 -27572 -29846 -38586
19347 -38586 -25243 -22068 -45957 -41287 -26300 1715 707 -21135 -19423 -16583 -25646 -12850 10700
19334 10700 22804 -1543 -23845 -32219 -4975 -15159 -46039 -50362 -39773 -43376 -36770 -41907 -26626
19321 -26626 8116 13496 20841 -2643 -15013 -45298 -44345 -55516 -66192 -51714 -43659 -47923 -39160
19308 -39160 -37862 -14415 3265 23672 18618 -13321 -34128 -9890 -22230 -17065 -6011 -7515
19296 -7515 -119 6039 -25213 -13592 -3775 -8255 -21489 2935 25573 17524 -928 -3166 5197
19283 5197 -9887 -22193 -17336 3614 3237 24892 34641 27226 -9241 -5466 8240 3932 -2703
19270 -2703 -4927 239 4774 12285 -12349 -34477 -1139 16855 -5414 -12518 -10828 -27939 -18010
19257 -18010 12068 21662 36259 36910 36259 22210 5668 -4738 1262 23427 34578 25594 31708
19244 31708 29290 6002 2254 20459 19565 16649 7363 8206 -470 21174 16950 3558 -16657 -44514
19230 -44514 -46074 -31760 -1471 28875 52522 66748 23472 11838 11198 -16609 -14723 9870
19218 9870 23860 10049 -534 24380 49334 35996 13400 13463 24951 37064 41207 42554 26500
19205 26500 16687 19331 -2775 -22151 -2827 17738 24305 27544 749 2308 19315 -13383 -20299
19192 -20299 -1378 13954 6922 -22547 -9611 -24164 -47119 -34684 -31552 -26 15609 27163
19180 27163 38826 18646 -9379 -24915 -15478 4173 6640 2302 8213 2926 -946 -14070 473
19167 473 1502 -14085 -962 -17739 -19143 -8077 -1249 1553 -6196 11166 2158 -1093 11145
19154 11145 38801 15504 -30906 -31310 -36175 -43005 -44437 -14632 -11544 -7856 -11920 8336 -9712
19141 -9712 -55383 -63292 -59362 -39858 -57269 -64654 -54104 -51815 -53257 -25648 3907 8839 15082
19128 15082 31735 39331 644 -13070 -11884 -20934 -41547 -62253 -75042 -49763 -2931 -11821
19116 -11821 -20834 -37175 -22027 -27554 -39631 -61347 -69772 -48397 -34647 -23901 -23727 -8346 -17399
19103 -17399 4952 13715 25782 22961 8378 10465 20081 6232 -22444 -35325 -38623 -31861 -34366
19090 -34366 -21109 -13893 -20061 -24483 -50728 -45051 -19767 20025 29429 10662 10507 81 -17531
19077 -17531 -30085 -46320 -25613 -15206 -11306 8672 -18281 -15925 -8634 -3285 7907 8847 13001
19064 13001 -11392 2644 -12350 -47922 -47071 -40391 -31952 -29135 -19505 -3547 -13859 -19679 -23165
19051 -23165 -10808 -31616 -23485 2720 9449 25158 19607 -4464 -26697 -22705 -12618 -13405 -22903
19038 -22903 -12834 -10940 -16611 -32675 -27629 -13220 -9175 -5771 1881 445 23740 20145 19003
19025 19003 -24095 -40720 -32015 -45322 -53488 -56913 -40792 -16280 -5882 -15333 -27571 -29113 -21422
19012 -21422 2553 13181 4200 -5216 -17338 -19789 -4313 15065 22891 29852 4959 9160 16682
18999 16682 4361 -7323 -23222 -13910 -3074 -17317 -46849 -59125 -61164 -62947 -75061 -84418
18987 -84418 -51746 -15355 -19356 -2657 -175 -13538 -1523 6451 -14628 -26748 -41732 -65750
18975 -65750 -54327 -38475 -35765 -38069 -55273 -30269 -32304 -16866 8397 7143 -14769 -19960 -30077
18962 -30077 -29915 -20907 -23612 7639 24951 27423 3674 -4340 40353 50765 54006 67938 66265
18949 66265 61664 56653 36985 5854 14874 27904 15529 -70 41733 68696 57256 21171
18937 21171 22558 39507 23951 12802 22001 17441 26346 23874 16038 -2636 -19198 -28091 -30198
18924 -30198 -24409 -1580 -4468 1069 -7105 -5627 -22688 -38584 -14279 -12950 -27668 -23804 -38271
18911 -38271 -37444 -24644 -30672 -22601 10305 802 -26247 -38303 -40698 -21611 -18156 -11611 6555
18898 6555 -83 3375 28764 22182 7422 20632 16297 11845 -11847 -16478 -13726 -6748 -8894 -33681
18884 -33681 -37866 -33611 -35844 -12123 -208 17473 10288 -4796 -28016 -20143 -11246 19800 26858
18871 26858 -3624 -21768 -7615 26768 42793 7617 1408 -15376 -27519 -11952 4197 -8675
18859 -8675 9443 -4492 -12571 -11196 -24561 -45468 -39735 -14423 -33319 -5464 -3093 -4399 -7832
18846 -7832 -14750 -5952 16906 7436 -11506 -16258 9651 25945 20752 -7456 2102 -6965 -53679
18833 -53679 -81552 -53017 -28938 -29997 -45418 -26052 -7514 -27549 -47226 -37047 -17724 -25762
18821 -25762 -31077 -21451 -18540 429 -2211 -46032 -62751 -83785 -77887 -47047 -13358 -10042 -29301
18808 -29301 -20266 -29645 -46288 -53129 -42028 -15180 -4621 3155 -13397 -37899 -58336 -32017
18796 -32017 -32071 -32943 -5825 -7925 868 6245 -3645 6194 36814 28948 -2151 -23844 -48722 -56509
18782 -56509 -55765 -47141 -29732 -16874 21862 50084 41070 13815 5374 -19945 -11260 -11986 5153
18769 5153 20157 11913 8962 -2052 -1724 21336 23851 -14842 -36206 -16363 -32567 -9397 18282
18756 18282 -2168 -18882 -31221 -43804 -34092 -25125 -1838 21953 19701 12344 10385 19279 32647
18743 32647 30613 32168 38953 50001 56827 50706 47187 68503 67644 71789 62687 43191 17483 26783
18729 26783 26974 82 -20766 -25120 -18453 -6813 -8819 -9511 -12423 -6574 -12947 -48425 -46690 -23714
18715 -23714 -22430 8242 28228 25392 12154 2896 -2593 22662 13672 8535 2959 -6898 -2625
18702 -2625 -4401 11174 -9123 -18457 -27174 -8581 -4845 -20008 -22694 -24130 -30196 -26134 -13526
18689 -13526 1523 -12247 -19806 -22390 -47526 -52330 8595 16689 -4964 -3462 -3766 -14251 -25286
18676 -25286 -23233 10457 36872 49325 54131 37632 13476 12549 40698 -2333 -30453 -18561
18664 -18561 -15438 -18406 -11511 11415 26390 24760 27417 9281 -3492 25954 23652 24570 22715
18651 22715 16799 33126 25495 -1909 -27917 -20632 -2783 -8155 9631 16126 4286 -10663 5520
18638 5520 8546 4441 14804 10779 38616 47406 47279 37762 38483 4413 -23822 -12507 -15976 5914
18624 5914 27534 21456 17106 6270 -36599 -24797 9705 8897 7990 -5739 -25276 -23567 -23541 -28677
18610 -28677 -20734 -8947 -4165 -8082 -21496 -14998 -319 28173 32439 21771 16633 5284 28117
18597 28117 37059 31876 29463 16867 8755 40343 19861 3153 25392 14377 14104 28501 4487
18584 4487 -4896 -15250 7759 31976 27586 25026 27884 17718 21931 34482 41617 30210 5642
18571 5642 2017 5495 -4485 -11857 -9324 -9504 -11170 -18594 -1838 1889 6961 9419 19366 23191 32293
18556 32293 23520 36769 44189 32620 4078 -3574 20269 27357 11195 -8395 8472 35303
18544 35303 39225 32472 28589 19078 13939 7073 7437 -1721 23349 32132 37397 20926 26291 21676
18530 21676 6265 11876 16772 16154 23752 32016 -10554 -46041 -48139 -29202 -16703 5212 -4176
18517 -4176 -17254 -40460 -31561 -6938 -3918 29942 54764 49490 26257 -531 13099 5745 -13406
18504 -13406 -17163 -19227 -19786 -13952 -18636 -11757 7520 13304 47967 39103 11774 -2751 -14915
18491 -14915 -55832 -39906 -5079 8573 20636 20064 19067 24035 17151 7210 2993 -5009 -9478 -25011
18477 -25011 -8216 13596 14766 8153 23503 53461 47157 47725 59539 71006 76761 102115 154811
18464 154811 194503 257980 336207 391872 419502 426122 405860 321088 255701 221251 208921 183263
18452 183263 150873 148330 155251 164187 193715 246004 305296 344344 404861 444650 468213 457455
18440 457455 389305 326213 265984 225123 182793 170053 116257 90260 60396 49324 38796
18429 38796 66530 51698 33746 30286 10532 -13025 1341 25690 63933 66686 40720 33684
18417 33684 35773 27822 7209 -17616 -8353 9491 6179 -2988 20352 34816 9795 26490 36978
18404 36978 26231 42642 20615 6330 7100 -4765 -14348 -27274 -22454 -11370 -27550 -21582 -12919
18391 -12919 -16788 -15121 -2843 10085 -7883 -58574 -46084 -13371 18333 36445 18123 31409
18379 31409 45225 36871 27652 30837 45677 30764 2439 -29542 -21963 3537 14909 20130 43812
18366 43812 26101 14337 11067 -12428 -35164 -44596 -30884 1394 -14919 -33919 -46034 -33765
18354 -33765 -46471 -38207 -19502 -4576 7419 34862 31008 4218 -2424 -8751 -16346 -18482 -16877
18341 -16877 -22073 -13890 -4672 -7403 9611 5727 -9456 -10696 -26523 -23848 -5812 20136 31665
18328 31665 27161 13073 26168 3205 -8807 -12433 -14000 -116 -11394 -2318 -949 -25261 -21322
18315 -21322 2253 -13636 -23023 -10527 6373 14382 11294 22358 11346 -5204 -54495 -36007
18303 -36007 -106 4621 -7248 -13714 -22785 6601 27520 22437 19883 16181 37119 47058 52052
18290 52052 48873 36242 56622 50575 33343 2303 15507 28911 38483 32834 15849 3638
18278 3638 7629 16462 17735 10231 3736 2932 45761 62467 72771 66189 46071 54886 55000 42845
18264 42845 29803 31735 46149 50963 10065 -11945 7835 16029 -5792 -28684 -20364 -4799
18252 -4799 3983 14001 46346 65891 30092 5618 27755 43974 27948 -4591 -5668 10168
18240 10168 16728 15278 -1785 4608 -5676 -17045 -39513 -57851 -27798 2824 8486 13256 3710
18227 3710 -12444 -22827 -12196 16307 10591 -13776 11550 15020 -1789 3529 21868 13890 14717
18214 14717 17471 17477 12236 25172 51548 79045 73209 55487 49661 42445 28859 49030 55739 40921
18200 40921 35992 30049 42346 39821 41544 53206 59727 52918 52385 39421 43846 46403 37989 26561
18186 26561 19142 40467 52378 57010 70794 74027 66672 83693 130155 188998 244497 230742
18174 230742 166494 127680 108816 105301 108918 105947 94057 76965 57526 38912 12214 26560
18162 26560 44342 13904 7781 15515 -6391 2766 -1065 44342 70671 73544 83885 74289 66781
18149 66781 44304 66050 88978 115961 113815 94613 97703 83280 97095 105701 100703 93755 111374
18136 111374 111269 102331 98231 97648 64755 51694 82802 105771 96350 59833 51064 65816 95088
18123 95088 104942 101889 117451 141050 168586 161436 156444 165645 162088 146865 128525 124811 146472
18110 146472 129512 136857 164197 192988 184909 164797 172053 210351 228899 248733 264229 269686
18098 269686 263225 278186 291216 292692 279882 291057 316166 332533 362190 400180 430844 486852
18086 486852 543073 627663 749987 857667 1007177 1229380 1510819 1894779 2465960 3294920
18076 3294920 4423482 5719452 6855238 7349511 6998044 5975308 4708492 3579200
18068 3579200 2747733 2188327 1734954 1451603 1248264 1088576 943914 852588 777730 702106
18058 702106 595626 517191 458959 428623 410216 401700 412544 484309 559689 606740 583002
18047 583002 505758 445927 395498 341452 314468 305102 308970 288209 246721 242173 234465 215613
18035 215613 211602 232528 237588 252286 246412 221632 187019 179662 183587 178208 205207 226825 199215
18022 199215 190950 193288 211729 200115 208131 221965 229251 256195 276828 283079 263811 242275
18010 242275 262769 271125 267067 272710 275131 226634 235014 227215 238311 258590 271024 270380 242434
17997 242434 242727 258300 272097 296915 307571 313558 325198 363706 416892 427539 403905 387664
17985 387664 385345 398354 401716 408242 417856 438932 478715 503678 504324 509198 520717 528622 535868
17972 535868 564161 597259 663906 719961 735250 722330 742188 754758 780778 823759 878293
17961 878293 916012 957515 1020001 1109745 1185619 1276585 1382210 1526702 1690950 1874311 2077276
17950 2077276 2332432 2588127 2831049 3134510 3536021 3970721 4246706 4346842 4395703 4526859
17940 4526859 4822079 5307497 5996503 6964198 8311313 10121189 12305501 14705356 17287198
17931 17287198 20356374 24616878 31342739 42549720 61570937 93356871 141677384
17924 141677384 197562568 230566266 216482099 168673782 116546727 77163600 52453676
17917 52453676 37925616 29286748 23849656 20109317 17348077 15266628 13595569 12020774
17909 12020774 10368655 8826688 7531817 6539170 5863923 5470227 5251721 5027302 4649958
17900 4649958 4179010 3659705 3215910 2878682 2585822 2326432 2133353 1961665 1764177
17891 1764177 1593468 1439106 1293519 1172551 1061723 978120 926945 888720 850500 800698
17881 800698 752389 703266 647516 584766 531536 478394 462899 448191 422067 406233 356271
17870 356271 341559 338103 318825 304477 292569 308666 306617 307162 273767 272458 297291 296607 298746
17857 298746 264125 230039 229789 233244 240974 195266 156218 134817 134671 137880 133033 140606 133182
17844 133182 117843 111116 133847 168960 169853 172290 149840 117952 101643 101282 87452 104318 124035
17831 124035 107770 93946 88874 81113 87092 105146 114035 132997 149461 141610 130166 99429
17819 99429 86817 80476 75864 78493 81636 79644 74871 56462 34985 28554 45711 48549 34689
17806 34689 -2120 9705 -1183 -50 12991 1650 5748 36600 47454 54887 69943 104289
17794 104289 150644 133943 85471 76103 85593 87159 93842 87820 85857 70291 52651 56722 57744
17781 57744 72816 91060 73589 45853 41629 48288 66946 66905 66446 57973 36763 14597 8635
17768 8635 2559 -1298 -5122 22959 40076 14262 18337 1619 -28624 -213 13895 17776 31313
17755 31313 38082 32411 25941 50648 58031 53340 31727 11331 9748 -9168 -15100 -17762 -5566
17742 -5566 -11104 -21364 -34911 -32520 -29250 -12638 -4400 5530 29074 12077 22691 32913 26685
17729 26685 19502 32992 40882 19201 29588 9904 -23867 -30546 -12401 5773 1351 12928
17717 12928 23742 5230 538 -28605 -40493 -8968 1331 -5517 -13300 -13485 -8658 17044 69904
17704 69904 57814 28218 26112 31999 22248 42745 36829 -7322 -50115 -39598 -19286 -14834 -7477
17691 -7477 -12110 -4092 18331 45282 39734 35851 15483 21169 22285 7464 -5952 5896 -4853
17678 -4853 8483 34510 60531 47327 11790 -19019 -28010 -4306 16244 7568 -18756 -29836
17666 -29836 -23772 -15964 -30965 -14441 -8743 7419 9425 17245 12569 -3269 -2222 -3134 9565
17653 9565 61605 72475 42330 -15379 -24963 -29091 -24660 -29857 -27600 3139 10333 -25144 -23183
17640 -23183 -10486 8243 14945 14879 7394 30911 30233 -3752 -28825 -47470 -46070 -31602 -14778
17627 -14778 4209 9798 6681 -3700 -2540 -20674 -32337 -25086 -7979 -6753 -15000 -23410 -17783
17614 -17783 -21315 -25651 -13858 -3975 46338 50998 22639 39994 49758 60220 100748 141571 190937
17601 190937 212150 243253 249305 223754 163922 109081 103338 83849 65036 56030 21586 1246
17589 1246 21110 24382 30774 29894 22431 8544 34331 34310 27818 18897 7593 -3862 -21710 -22087
17575 -22087 -32273 -36339 -48181 -27116 -15464 4944 -6156 -22823 -25063 -28056 -21396 -2265
17563 -2265 -8877 -7845 20816 37424 24203 3159 7058 11853 -14303 -23871 -22465 -23829 -42488
17550 -42488 -30775 -13373 -11179 -20813 -9763 2573 34468 67387 61615 38341 36114 38326 27494
17537 27494 2569 2164 -10378 3822 13703 -12805 -22643 -11949 23870 43604 2903 -7080 25029
17524 25029 29770 -34162 -47002 -45531 -49281 -41585 -14655 -1815 -7358 -18125 -15153 -14303 -527
17511 -527 14649 34967 40874 27987 26889 5947 8440 10288 -29253 -50051 -34239 -5600 -28993
17498 -28993 -34055 -52011 -83916 -105741 -119985 -93413 -47499 -46560 -51975 -47456 -61678 -54520 -8964
17485 -8964 7457 17376 6476 -10390 -13273 -12662 -20887 -16088 -7536 -15950 -33692 -29726 -3277 -255
17471 -255 7832 -9319 -24984 -4443 34897 40742 25999 28096 67915 55554 18617 -15368 -17207
17458 -17207 -10404 -30813 -44518 -15065 2176 -17806 -32790 -22697 -21348 1765 17163 9594
17446 9594 21840 3413 -16710 -18706 -4426 18126 13722 19286 30348 29117 26572 4823 -24286
17433 -24286 -12912 19402 38491 58971 20332 4092 5649 36889 55133 31068 12326 732
17421 732 -15640 -943 15935 22777 37575 55792 32830 13018 17494 33666 16358 10578 37487
17408 37487 49682 70768 87547 98504 105194 150354 218949 250267 323428 382618 411264 407867
17396 407867 376043 330105 257490 202882 176305 170251 163835 158593 144669 147259 181114 208518
17384 208518 228799 282513 343571 419626 448458 416150 329956 223408 167875 136130 97444
17373 97444 89520 81483 68977 67358 59576 55396 24197 45107 53443 31131 38499 70761 53024
17360 53024 38172 31423 7053 -6421 -2492 16032 -5144 -11757 -6007 -19852 -19676 -26176 -31910
17347 -31910 -52071 -54135 -59566 -46221 -29179 -21174 -15759 -27448 -40529 -67156 -57674 -34773 -38504
17334 -38504 -47408 -55929 -59331 -66951 -52021 -34401 -34381 -58051 -30925 -6850 -34891 -61804 -46921
17321 -46921 -1071 -7979 -16829 3675 32673 19130 4318 23326 6482 -1327 14794 5634
17309 5634 -5130 7749 -10031 -34690 -30975 -22009 -2468 -15016 -43980 -45961 -39738 -64913 -88884
17296 -88884 -91221 -87921 -74888 -38902 -42987 -16947 22076 22940 4401 30383 61250 65074 73127
17283 73127 42793 11476 10783 -6798 -9130 -26373 -32756 -17261 2686 -10516 -10841 -35000 -39658
17270 -39658 -33912 -24331 -23403 -31353 -26748 -18785 -21180 -23194 -46667 -36520 -5705 -19666 -7686
17257 -7686 -491 -9143 -34977 -33179 13899 29041 14023 84 -4545 -6490 -35828 -36198 -16773
17244 -16773 -2464 3563 -11334 -18747 -37867 -51931 -19117 -1534 20382 24542 32639 -19
17232 -19 -27449 -61369 -98565 -81578 -52596 -18208 -9435 -49093 -31837 10014 22332 7829
17220 7829 -30120 -9831 13111 -3497 -1992 -16024 -30037 2100 20852 17255 32515 31914 28533
17207 28533 10736 -10263 -24242 -22786 13885 15327 4943 19234 18534 -8132 -27587 -37919
17195 -37919 -29727 -34770 -40990 -27221 -45995 -52279 -36275 -39682 -20677 8444 6232 22169 43169
17182 43169 34173 53177 102401 130955 135569 135947 161865 203914 235364 233527 210633 162908 160606
17169 160606 132097 106728 92024 96717 89173 96190 88028 76803 88016 129087 213562 247974
17157 247974 275601 243911 183206 125011 105714 106805 116131 110111 86092 50998 17266 21035
17145 21035 11728 29756 62214 31241 -17439 -31413 -32375 -19638 -1062 11274 20893 21170 34158
17132 34158 35230 659 -20456 -40347 -25907 -2900 -5119 -15942 -8800 18422 6531 18308
17120 18308 25389 10945 7066 19489 -1225 -32100 -35293 -424 16095 19499 9145 19528
17108 19528 -5779 -10685 6697 13091 18958 -366 -25419 -38653 -27687 -6567 -1104 -5477 -8694
17095 -8694 -17129 256 -2117 11083 24980 23467 29467 7847 -1309 12876 2959 -5151 -10658
17082 -10658 -3483 -9861 -16566 -23254 -23701 -13044 8929 5809 698 -20004 -4466 -3915 -18647 -20853
17068 -20853 -16690 -16377 -22810 -17726 8278 7161 16785 40019 77176 132335 179466 197393 219635
17055 219635 202055 191226 165479 156034 134607 70654 20370 35672 58394 56488 66517 89697
17043 89697 105860 133486 137886 140059 164988 148541 126566 113528 71469 42911 5710 2587
17031 2587 22850 16164 -16009 -16903 -12631 7050 18272 23107 5380 -3025 24476 22174 15097
17018 15097 22606 45335 38164 26366 15087 9201 28951 25586 -409 14602 3967 14543
17006 14543 28530 -26748 -44123 -19453 -6015 6117 22634 22814 29362 -6673 -35334 -39410
16994 -39410 -56837 -36837 -27786 -48617 -35704 -28841 -24830 -35214 -22963 -24816 -36058 -44115 -45983
16981 -45983 -29710 9677 29946 49772 32988 3921 6723 24220 25821 20364 -3400 -25998
16969 -25998 -11145 -3159 -7453 -10197 -32200 -18628 2954 -2314 -6552 -958 -1617 -8553 -17089 -3969
16955 -3969 2920 -14820 -18328 8578 4792 -30943 -45494 -26342 -28999 -25883 -9608 -15235 -20056
16942 -20056 -32992 -44589 -26306 -18035 -9831 -6694 3812 668 -6994 -8656 -27141 -46093 -17977
16929 -17977 -8093 -18453 1718 3374 -11141 -18434 -14195 -32075 -18725 12539 44486 42706 29271
16916 29271 18150 9554 -12859 -21752 -1356 19312 10046 -15028 -2249 -14738 -7561 -2314 -23904
16903 -23904 -25648 -32883 -7758 -13682 4027 -4177 -24167 -25180 -12091 -16386 -57272 -50218 -46135
16890 -46135 -70944 -69415 -50868 -27534 -33680 -50780 -48295 -45423 -38363 -46922 -33362 -38225 -12870
16877 -12870 -11904 -17877 -20582 -7075 -40198 -33991 -35177 -29534 -15172 -15838 3179 12506 16805 15423
16863 15423 -25688 -32500 -3666 26699 4367 -5197 276 32047 42482 26851 16126 -8411
16851 -8411 -44856 -46280 -27091 -27698 -21451 -18222 -33562 -46007 -41761 -40547 -31123 -14575 -13597 -26618
16837 -26618 -32117 -53764 -73938 -95508 -79817 -75486 -67814 -46684 -58062 -85909 -88210 -90330 -70195
16824 -70195 -63848 -40690 -12939 -21000 -19068 8322 -10994 -22750 -22378 -19189 -17772 -19994 -24698
16811 -24698 -43495 -29844 -25063 -24503 -29853 -47504 -37844 -18981 -292 2539 -30576 -51356 -27904
16798 -27904 -24572 -38148 -23418 -30267 -45042 -49343 -31660 -34561 -28776 -13979 -12855 -38062 -27920
16785 -27920 -30413 -5380 21153 -3598 -30347 -25801 -26786 -23933 -44964 -64144 -63467 -45915 -47897
16772 -47897 -35881 -29247 -31533 -25896 -15958 -3864 18517 21566 37921 41812 26691 -3885 -26621
16759 -26621 -40680 -56167 -61949 -38054 -49740 -43946 -20771 -8199 -15617 -5017 7993 -14858
16747 -14858 -236 18588 7973 -36438 -39497 -22293 -47263 -57025 -74905 -69183 -40834 -34911
16735 -34911 -7721 -10973 1596 26762 37846 8387 -8281 1502 4268 -12547 -9448 -15659 -1315
16722 -1315 24693 22665 -4404 -10039 -11034 -30624 -39975 -46258 -72679 -70849 -57661 -38876 -56661
16709 -56661 -56829 -41857 -39752 -49308 -31133 -9443 -1645 -27239 -6069 22893 16100 20635 16948
16696 16948 -20934 -18498 -7698 3581 1648 5161 19029 20744 -3061 -10188 16968 33408 20914
16683 20914 -29715 -59148 -67136 -60177 -20338 -10447 -4193 -4040 -8940 -8395 -27669 -14818 -16635 -22744
16669 -22744 -3370 -18415 -47762 -53880 -23221 -4921 13943 6562 -12885 -27575 -13998 -3763
16657 -3763 9255 7911 -8524 -47506 -52026 -36321 -27921 -31014 -38566 -33983 -9847 -7869 -35037
16644 -35037 -71014 -69587 -85664 -56860 -25917 -21512 -22279 -19989 -4614 8016 15888 -9170 -22027
16631 -22027 -23143 -28988 -29510 -35994 -39987 -64669 -61769 -52525 -24544 -25500 -28093 -6744 -6135 -5606 2531
16616 2531 -19357 -22849 -16306 -27315 -15685 9515 -17037 -47895 -74565 -67083 -47479 -21485
16604 -21485 5328 -7214 -14912 -31255 -26568 -26187 -9984 -5391 -23161 -18939 -16800 -30492 -32384
16591 -32384 -15182 -9784 -18943 -50425 -52047 -30079 -27527 -34729 -25731 -13281 2792 4103 271
16578 271 15441 -3588 -26867 -26654 -40699 -13451 -22246 -24597 -8329 -11285 -39876 -38801 -15530
16565 -15530 -5418 -16703 -24127 -22288 -38989 -36927 -5844 6989 11630 -10264 -33939 -42797 -36941
16552 -36941 -4581 -1126 -3733 8298 9738 9137 21000 17262 3160 1559 -12657 -20914 -18140
16539 -18140 -53647 -67486 -39262 -29138 -39209 -22757 -18775 -28250 -41716 -51102 -60908 -83135
16527 -83135 -89352 -81295 -58185 -31968 -48500 -57809 -30521 -1860 6491 -13722 -40825 -46956 -26870
16514 -26870 -2988 -20444 1673 30074 22891 10869 -13331 -22723 -24830 -38176 -5898 17899
16502 17899 -5606 -24788 -24316 -35037 -53679 -38315 -47968 -62713 -53917 -42277 -17778 -16886 -12613
16489 -12613 -9262 163 -1087 9842 -14045 -16098 12327 6778 8150 4370 5990 17060 20357
16476 20357 -3769 -9550 -8079 -19104 -9877 -2245 -6148 -19768 -49486 -66062 -72442 -66349 -33579
16463 -33579 2599 13054 9298 -8309 -1432 -16915 -37336 -39889 -32283 -18573 -26243 -40822 -21655
16450 -21655 9922 2422 -12514 -36405 -33712 -25912 -10512 13571 -3836 -20720 -38987 -40275
16438 -40275 7263 38790 40544 22316 -11859 -8505 -472 2089 14787 14445 17687 4252 -9616
16425 -9616 6392 -6445 -14550 -12378 15280 21243 -4944 6976 27440 29365 -4271 -11008 -9811
16412 -9811 15049 20763 20016 11028 -489 1800 11427 3316 3772 -11797 -1383 -14942 -16236 -16456
16398 -16456 -40811 -41498 -24130 8304 20863 -7060 -24193 -23930 -34711 -21990 -19275 -34285 -27694
16385 -27694 -13928 946 -11388 -21008 -6988 22727 -1447 -39878 -25463 -21133 -5636 14053
16373 14053 4049 -2882 -14940 -10170 -35621 -42730 -18308 -16836 -3182 13616 8106 -10727 -47929
16360 -47929 -80500 -90191 -66047 -11742 -4475 -38593 -53111 -26805 -23186 -39646 -37918 -6635
16348 -6635 3989 -4095 -15011 -35072 -30452 -9410 18449 -2014 -15802 -15665 -19975 -405 -4312
16335 -4312 -17239 -40144 -42229 -29315 -13007 8001 28296 21155 12855 19608 25366 43692 20036
16322 20036 8007 3004 9447 9062 2487 -2162 -11435 -4477 -4560 -35282 -37601 -8733 -5582 157
16308 157 -13729 -26228 -38166 -42904 -31424 -8553 -24232 -48586 -36398 -12314 14371 9305
16296 9305 6170 695 -1536 925 -16723 -14300 -13098 -25053 -34624 -30880 -31941 -34576 -46281 -33688
16282 -33688 19063 40926 20533 1816 715 -317 -26703 -41702 -49099 -63722 -58432 -40628
16270 -40628 -22902 -15062 -25852 -30247 -21635 -18975 -3282 9675 30701 4198 11172 1260 -19225
16257 -19225 -25522 -13069 17768 20720 20505 23110 25623 21951 12569 -27702 -26776 -4133 14702 7857
16243 7857 -6660 -2984 35589 30604 5925 -15178 -22197 -38374 -32183 -32459 -15170 -14749 -12812 -5058
16229 -5058 -17430 -37106 -31884 -25317 -20955 -23044 -24740 -23848 -332 -2753 -3576 -3006 -11936 -10087 5239
16214 5239 9012 -8108 -30732 -31956 -17718 -4721 7714 -1687 27213 1760 -21909 -29162 -23083
16201 -23083 -14473 13790 29052 -10342 -5262 -3390 -36750 -34775 -34120 -52311 -40864 -44112 -36982
16188 -36982 -29677 -31940 -20309 -21293 -38937 -55138 -40766 -29057 -42034 -51556 -57194 -33960 -25359
16175 -25359 -21435 -36941 -48261 -53037 -13591 -4026 2070 26828 34130 7240 -20088 -20067 -14819
16162 -14819 -29576 -32667 -28348 -15724 -23105 -32188 3155 13636 -811 -11055 -17720 -26412 -25459
16149 -25459 -18290 -9663 -15569 -22395 -12093 -4388 -12080 2749 3226 -366 -5119 -6749 6116 11256
16135 11256 17289 39411 55417 17700 -18966 -26778 -20696 -9973 -19628 -31853 -28544 -28918 -43222
16122 -43222 -46260 -22046 -3451 -2809 9370 15119 19208 -1347 205 8180 4339 -6826 7623
16109 7623 35432 20818 28181 23692 -14136 -51851 -39308 -31548 -21387 -27930 -38050 -41755 -70885
16096 -70885 -65222 -53772 -65122 -58123 -41771 -36850 -36064 -11818 -11305 -18314 -10692 -3611 7713 -478
16082 -478 -16110 -40486 -46027 -27956 -21857 -12065 6725 15133 8038 -13591 -24650 -25469 -24895 -16658
16068 -16658 -8599 -2574 -35865 -35827 -35745 -41236 -42229 -39869 -29325 -12681 11412 23207 5229 -24706
16054 -24706 -22262 -11165 14391 14672 17423 19739 33768 35915 28351 -7842 2307 16705 9385
16041 9385 13697 16642 18907 6539 -5373 11086 -22047 -48635 -55054 -82849 -38169 -14797 -1592
16028 -1592 23941 14567 -5792 -10485 10323 -2733 4474 -6078 -16516 -27612 -40972 -38559 -40675
16015 -40675 -20829 -31982 -28130 -18896 -25422 -7741 -20164 -51116 -55443 -61915 -54833 -47433 -36253
16002 -36253 -14374 -14722 554 6875 4982 1115 -28222 -39069 -8660 -15854 -7011 -10015 -7731
15989 -7731 -4333 -8659 -36236 -45028 -43512 -47849 -45401 -19822 -7278 2741 -9139 3047 1225
15976 1225 5042 13040 23838 -1593 -644 -6953 -13121 -27784 -13112 -15019 -20511 -10693 2933 8669
15962 8669 13178 31452 22664 3687 -8505 -10032 8538 8373 -3501 -14189 -24929 -22302 -27844
15949 -27844 -42541 -51147 -33498 -4932 -6037 -29070 -10628 16102 13670 18793 2478 6525 2189
15936 2189 -7805 -10727 -14087 -27490 -5278 24311 25718 7259 4567 -4115 -28430 -22687 -31351
15923 -31351 -38423 -26148 -29492 -43042 -37214 -15096 -16419 -32423 -18311 -32817 -31695 -6824 13130
15910 13130 389 11474 5784 -9162 -4915 -8152 -35062 -38845 9078 -3055 -14829 -16099 938
15897 938 -12677 -10541 -14575 -12404 5788 3153 16069 7085 -44584 -49346 -30917 -21385 -7591
15884 -7591 -19448 -2184 13644 16269 3452 24712 30574 21965 -3980 -22129 -30811 -9707 2986
15871 2986 -17002 -32209 -27434 -10729 6716 -9231 -10618 -32828 -40832 -10196 -2351 -10345 -21242
15858 -21242 -33353 -55202 -67944 -61903 -34783 -11316 -1439 -5893 1826 -9961 -4856 1532 2438
15845 2438 27501 45486 36616 5175 7729 11416 5050 -21815 -59387 -53006 -26912 -26583 -37260
15832 -37260 -22094 -20088 -41495 -31945 -8866 8456 25480 5360 -24676 -30059 -10094 8784
15820 8784 11071 -5883 -4209 3543 10788 7216 2103 17099 21162 21169 -7577 -17600 320 3215
15806 3215 15139 32977 2923 2828 -2327 -2796 4879 32157 26262 24936 10042 -10901 -12412 3542
15792 3542 25396 34809 20686 10026 18031 14120 3310 3614 -9005 -4482 12066 28076 -5526
15779 -5526 -28520 -12312 -1904 -28868 -44360 -54007 -59712 -74953 -51182 -31088 -9780 -9918 8311
15766 8311 22860 17004 8279 -6638 -27777 -29137 2592 8075 -13633 -24726 -5534 10885 21796
15753 21796 30888 53909 47003 67730 148274 219411 196069 139555 80558 41961 36231 35876 30884
15740 30884 14607 8784 19703 21985 20646 11980 -800 -12884 -11902 16440 26290 3816 4083
15727 4083 19273 37545 19698 9615 41275 44678 18198 -7108 -33586 -16030 8754 18658
15715 18658 16410 24390 26276 -7582 -27307 -27189 -38571 -14948 7555 4358 2021 -3952 -24204
15702 -24204 -7308 8895 627 -1809 5688 -14954 -27164 -18323 -44120 -50230 -38430 -12560 26464
15689 26464 31983 9964 645 -4413 -14024 -17697 -1587 9650 554 -15032 -6501 14540 26293
15676 26293 -5525 -27302 -23779 -26083 -16235 -23448 -26684 -10730 -8795 -10283 -16451 5115 -675
15663 -675 -9884 -18561 -8754 13282 19089 26446 24471 -6641 -33589 -37298 -34418 -25340 -11831 -20012
15649 -20012 -37703 -36573 -10839 17781 27237 -775 -22661 -683 -17384 -19154 -25833 -26656 -25847
15636 -25847 -3323 11472 29346 24143 21508 -1455 -1293 -18860 -27517 -24027 -25711 -39854 -39434
15623 -39434 -17392 -10677 -2642 -9965 -8274 5491 10453 8234 -2072 -35157 -25814 -29615 -57278
15610 -57278 -84383 -58219 -54532 -45874 -23816 -10371 -27594 -59484 -40679 -14194 -23289 -25896
15598 -25896 -43953 -54987 -35359 -11481 -10173 -23414 -11548 -20604 -25006 -17739 -36501 -55121
15586 -55121 -65327 -65392 -70300 -43241 -34375 -5770 9218 -25621 -32272 -33552 -36704 -26029 -18375
15573 -18375 -34206 -21280 1761 10964 -16277 -2521 12085 -22592 -58383 -65412 -44245 -4112
15561 -4112 -39097 -45402 -46179 -21847 2385 215 -1763 -1475 -6797 -33118 -26192 -8991 14724 1003
15547 1003 5838 -9757 -3473 -15686 -5332 -13087 -23355 -48214 -41668 -43127 -68674 -79254 -48827
15534 -48827 -9726 -8699 -12317 13029 -1024 2735 13143 -28432 -49578 -48376 -38591 -24941 -29507
15521 -29507 -21806 -31468 -13614 -15149 -14336 1507 -31711 -70069 -80429 -61739 -5113 15850 7806
15508 7806 13559 33931 27323 6842 -21307 -24777 -36371 -22793 -15772 -34974 -44273 -24502 3409
15495 3409 13242 -8831 -29740 674 48990 65560 44757 27011 7795 -13057 -4690 -12497
15483 -12497 -14200 -3129 2108 19136 10796 -34413 -41056 -30399 -21602 7227 11754 -8641 3418
15470 3418 -13762 -51477 -65574 -47608 -36269 -31440 -11435 -12656 -3890 -44897 -36000 -12130 -10701
15457 -10701 -26698 -18433 -1191 4528 8396 16913 23868 17668 6260 5825 6507 -6697 -2748 26073
15443 26073 44273 20935 14497 16346 1814 2374 1396 12425 10228 12722 34545 16278 -10902
15430 -10902 -16473 -39662 -29276 -34913 -35897 -48520 -27596 -1440 10144 17842 24628 1176 -24923
15417 -24923 -39006 -10063 -8480 -13231 -7830 -1882 -6470 -115 -12322 -55 -7554 -27174 -23828
15404 -23828 -44541 -34233 13458 17350 21800 15358 12044 16331 19869 33569 27386 20622 24933
15391 24933 31870 9467 -14913 -6275 -15528 -13252 -12920 -3312 -2549 -9528 -28656 -9165 -18581 -32923
15377 -32923 -23806 -5042 -7113 89 2059 24507 -13949 -50097 -52602 -71579 -73325 -65604 -42667
15364 -42667 -52793 -26952 -10730 8788 9360 1667 2389 3738 19497 32569 29351 30450 28265
15351 28265 -1415 -39194 -40171 -71790 -65797 -34188 -15932 -14526 4587 4463 -12284 -4372 11894
15338 11894 27887 4653 -23914 -19923 -305 9463 1464 -5560 2091 2940 -640 -5759 -26048
15325 -26048 -17023 -16806 -30423 -21767 -39178 -36299 -56217 -43782 -19296 3863 14459 18671 16571
15312 16571 11473 -11028 -29974 -4769 12163 -5498 -17101 4147 29142 16306 -23691 -37812
15300 -37812 -40525 -27438 1674 -7716 -19826 -20688 -24593 -14433 -15597 -1499 -7054 -30690 -47505
15287 -47505 -59672 -50096 -61498 -68252 -43501 -11152 -5492 -16865 7325 36462 4217 -28994
15275 -28994 -28132 12012 51017 31730 10622 1719 -14278 12124 66486 77168 55073 7478
15263 7478 -484 6921 2342 -23881 -23333 -33965 -14519 6505 29112 28975 18696 15482 6428 14886
15249 14886 -2173 -33354 -47239 -19502 21504 55997 50824 21620 -2235 -36989 -57245 -64710
15237 -64710 -40547 -26295 -30593 4352 -5013 -13066 -19509 -20335 -4671 -17787 -33974 -42003 -45627
15224 -45627 -24305 -6098 -8666 -33434 -35181 -7916 -7516 -16945 -28350 -29466 -44660 -59885 -50464
15211 -50464 -42945 -46886 -63324 -55607 -12272 1045 12241 27430 -873 -5893 -3525 -36334 -9093
15198 -9093 12532 12685 10344 20742 16691 12439 3052 14188 22417 7172 -6862 -3283 -13970
15185 -13970 -38006 -42485 -18489 8886 14541 21678 42936 53504 46702 25030 13228 28575
15173 28575 42558 21815 21263 15483 -8054 6569 7040 19564 17433 -7478 -16775 -7463 -55
15160 -55 -11781 1617 -9767 -20476 -27286 -11517 -12884 -14299 -28072 -13185 -5201 -19673 -26766
15147 -26766 1980 2165 -3534 10712 1724 -29060 -44364 -50130 -26605 -16093 1263 28619 50197
15134 50197 59306 46251 26344 26414 4637 4528 31577 48694 46199 19100 -6488 -4936 25664
15121 25664 28001 30310 35162 10749 -11926 -5640 -9273 -16618 -10163 -2523 939 -7594 6200 20902
15107 20902 5647 15363 22417 23853 10239 17426 -7544 -14820 -9239 -12716 -17930 -29004 5083
15094 5083 22645 16919 28269 4840 -8773 7736 23352 13906 28842 28999 21439 -2118 -31946
15081 -31946 -17497 19140 45757 13891 -25643 -47730 -42402 -12271 -7830 8418 508 -6581
15069 -6581 -14505 -2702 -5225 4624 -1892 -6871 19061 22929 10033 18406 10264 -14582 -24471 -16420
15055 -16420 -10220 -9165 -14298 -8994 -15458 13371 26167 24560 3673 -12394 -21056 -8725 -14119
15042 -14119 -37451 -20031 -10360 -1070 1441 -25408 -34107 -36600 -27271 -10846 -8845 -20797 -30895
15029 -30895 -33037 -32281 -38732 -39180 -29879 -31615 -19408 -14586 -6888 1048 -4805 -2399 -8008 -13102 14780
15014 14780 16473 9796 -10940 -14095 -43432 -58111 -56087 -77517 -64547 -55572 -33318 -12939 -20327
15001 -20327 -12506 9022 -6345 -39579 -32546 -18174 -26696 -25127 -36952 -20035 12741 479
14989 479 -16053 -11986 -9398 -1288 6157 -425 10220 -4711 -23100 -32103 -61575 -55735 -34015
14976 -34015 -41499 -14981 -17585 -35469 -12145 -88 -4184 -17808 -29721 -5985 2182 -12718
14964 -12718 28081 28506 2004 18246 33996 4728 5739 -10798 -26138 -37821 -41360 -30195
14952 -30195 -15149 -14505 -29908 -32168 -13456 -13652 -13157 12218 12908 -8932 -10634 -16841 -11061 13561
14938 13561 27771 41334 33244 9545 -12406 -35462 -21809 1077 -1005 -10834 -14598 -9747 -18873
14925 -18873 -19157 -19509 -1332 21504 37262 31415 22031 3800 -16364 88 23453 46846 60113
14912 60113 22175 15600 39595 42596 42297 55374 79422 51681 40537 42728 -1656 -49833 -69221
14899 -69221 -26807 5039 19921 7241 -26491 -26293 -11508 -34546 -15949 2627 12134 13414
14887 13414 -21027 -47376 -37707 -29966 -17242 -21852 -12697 -9323 -20103 -20115 -9658 -19975 -28900
14874 -28900 -16121 -21635 -32387 -38627 -34160 -11252 -18530 -40115 -53933 -65735 -34737 -11099
14862 -11099 -27599 -41239 -23161 -19943 -4169 -8757 -25705 28108 60655 58762 38856 -23968
14850 -23968 -10349 -4229 -3152 -4710 -3337 14570 7645 -17570 -15465 3141 22142 1423 -15087
14837 -15087 -14362 -40075 -41360 -23524 -36220 -29479 8170 14118 -2554 2731 9501 27514 14823
14824 14823 25558 21467 33312 15914 28042 41252 22436 -8962 -13359 -24239 -8703 27659
14812 27659 23188 7502 -6970 1715 11690 3694 -13025 -13386 -13626 -20312 4529 19764 1140
14799 1140 -6148 9028 19815 7300 7181 9261 8701 -346 3204 33091 41028 23979 -7204 -22813
14785 -22813 -10306 32203 35730 27189 11630 12257 28465 14962 -11835 17525 4741 -8823
14773 -8823 -16323 -29035 -33381 -28931 -27169 -12998 -6092 -11901 -5972 15103 10854 -12750 -24686
14760 -24686 -19052 -11029 10848 26858 11982 14228 25742 44175 47682 10409 12204 18065 11636
14747 11636 3871 -13709 -6708 -5705 -12749 6159 33119 41002 37045 29877 30981 31810 32059 37608
14733 37608 18781 1709 10722 22818 20581 -1806 2684 -998 -7394 -19664 -11294 -28942 -58151
14720 -58151 -93188 -96461 -51532 -20173 -6383 27818 10508 -31059 -69064 -62636 -67516 -89260
14708 -89260 -36952 17844 39192 43630 14698 16726 31140 3108 -31622 -19724 -6738 -4453
14696 -4453 -2615 -3697 10047 9453 -797 15261 32714 41735 45075 19830 27965 55572 79181
14683 79181 50999 38867 37357 6697 7703 39372 4204 -14842 -17604 14566 19979 -2509
14671 -2509 -4267 -9838 -17596 4745 9650 -14358 -18517 12118 28237 38476 38804 29402 15931
14658 15931 -6469 -29747 -19233 -309 2506 -7957 -5019 -1310 -35594 -35870 -17379 2084 12937
14645 12937 9499 8823 22916 27809 8414 10968 -10087 -16017 -7495 -5103 -2838 -23478 -45802
14632 -45802 -45448 -29921 -47656 -26653 -17541 -12050 -21804 6634 13481 6027 -9502 -26176 -15037
14619 -15037 -11998 -26509 -34528 -31049 -10239 24239 12556 2954 -12035 -8750 4359 31203 25656
14606 25656 9445 7720 18897 32703 56401 54133 13929 1984 -8801 -10708 26573 34369
14594 34369 24677 -7289 20417 27219 -6721 -10147 -2239 15411 -5884 -7530 -208 14876 -5271
14581 -5271 -12928 -39145 -20104 -5311 -12273 -10550 -7578 9932 6577 23059 54327 28406 24713
14568 24713 37599 43669 31632 35959 21534 10109 -338 -5568 -3487 1125 20946 18811 15079
14555 15079 2086 18694 23641 5580 594 -4369 377 15650 35402 20424 28847 25591 -16033
14542 -16033 -3517 19207 7846 -15753 -44722 -28815 7030 21975 9823 -10389 7982 25689
14530 25689 10309 1870 20526 1215 -13276 -16011 -17786 -24526 7019 35646 28853 24503 22531
14517 22531 4532 -19233 -14324 13924 46250 54075 59520 50342 54441 57349 44170 61754 77013
14504 77013 77389 46297 41612 55863 67708 65116 53099 51294 34403 7073 -2280 14360 55030
14491 55030 66190 54492 63478 56455 39744 31537 48559 36699 4066 -3014 6485 26545 18504
14478 18504 15236 10758 13282 4805 -2208 771 13716 1877 4215 15842 16103 31128 39188 18665
14464 18665 856 11530 23122 33791 39776 38013 27004 24402 34012 32369 -5388 3606 33366
14451 33366 61025 66361 59600 47241 45400 42666 47568 64654 37858 20462 -6410 -1424 7960
14438 7960 -9622 3447 10583 31670 33667 28363 24715 18000 15637 14363 -1238 -2457 -2365 14895
14424 14895 5677 -4183 2563 -14753 -19719 17725 47579 52764 27207 -7766 5034 30669 39234
14411 39234 1552 -11220 -12657 -2845 -25001 -22971 15678 19733 29206 29577 3625 16777 9240
14398 9240 11901 14396 -11200 -9833 2119 18534 22484 32584 19819 14374 3516 11367 1151
14385 1151 -2740 15971 14972 -8258 -23051 -15891 -13125 -21726 -31804 -25479 -10942 -7434 -802 7866
14371 7866 23005 33830 41409 19162 9652 5871 16543 19934 23072 6554 2281 21547 3872
14358 3872 -9590 5991 26874 5786 -1879 -4581 -2831 -1965 -23276 -21578 -13212 -28654 -27323
14345 -27323 -7269 -5091 -10401 -41594 -53944 -7575 32009 12454 1102 -10408 -10277 -19940 -22240
14332 -22240 5526 30731 18592 697 -38357 -43945 -16940 -25354 -36320 -38731 -26005 -8086
14320 -8086 4134 8913 6766 15399 465 -14270 -14155 1339 10451 32645 10993 3659 -3942
14307 -3942 80 -1498 -25864 -24122 10359 31093 38733 27565 43644 39825 17666 -4351 301
14294 301 7122 760 6252 30603 47917 36908 4513 -6374 5479 10018 9931 -13634 -22078 -35999
14280 -35999 -40949 -36817 -26499 -3028 -901 -6478 4285 12267 34934 19597 -1898 -27131 -67821
14267 -67821 -57936 -36331 -25381 846 12542 25203 49250 27570 -21561 -22886 19953 27550
14255 27550 9295 13310 20613 12331 -6660 -7662 -1067 5058 32823 49939 48015 39368 11091
14242 11091 -19924 -15169 3277 11408 7873 5167 4417 -10816 -25348 -16347 -6389 7547 -3430
14229 -3430 -11562 1431 -3600 -20015 -21632 -9665 -655 6074 26910 28862 18271 14691 20591
14216 20591 8147 -23469 -52586 -52617 -42405 -39622 -50171 -42130 -27681 6922 31924 20098 15795
14203 15795 21476 40988 30593 -2002 -9018 -9654 9605 14476 21992 5759 -4444 -35888 -50354
14190 -50354 -37477 -38774 -18347 -3936 -15832 -14154 -15008 -8899 -17540 -15170 -1495 -3275 -37958
14177 -37958 -55616 -23146 -4661 1539 -43351 -47871 -14655 449 -8497 1125 8727 8935 17787
14164 17787 27133 15822 13774 18397 7083 17066 4442 -19177 -2942 -3065 -4803 -9921 1371
14151 1371 3651 -12745 -3000 -1053 -22337 -39452 -54620 -55829 -34981 -9606 -21578 -3205 -3858
14138 -3858 -25680 -29955 -42914 -4674 -8850 -39496 -30981 -9595 -19869 -37827 -29153 -32775 -18940
14125 -18940 -32160 -41665 -29367 -12105 -26941 5604 23044 16122 13297 -2368 26520 42863
14113 42863 32307 31213 29275 13985 16002 4338 -10903 6941 30126 14858 16194 12426 7741
14100 7741 8599 -9277 -30813 -30114 -30540 -38120 -22678 16700 53541 39742 4307 -7463 -8410 -13875
14086 -13875 -11438 9336 -915 -1103 1306 10784 18586 -4404 -18920 -20410 1881 22966 38881
14073 38881 41239 1115 -13468 -1575 -9154 -32639 -40096 -33763 -29923 -50679 -52750 -52264 -51896 -31637
14059 -31637 -3374 13619 18297 38513 33814 53395 48953 18313 -16611 -19726 -4648 -5846 -20161
14046 -20161 -23194 -30083 -35275 -35412 -13919 17800 27316 28325 28007 7999 8892 24707 48815 53239
14032 53239 18725 -14387 -11310 7131 -103 29674 23289 11537 -11155 -21295 5958 43662
14020 43662 55527 35790 12153 4508 20923 27462 -4270 -18446 13784 30189 38063 29058
14008 29058 18718 21973 271 -41912 -60772 -29188 -15008 -12291 -1489 -16891 -24230 -3529
13996 -3529 -15669 -19533 -11533 16593 25850 21715 41806 32782 16985 10143 -6552 -2888 3817
13983 3817 -4235 -1808 3022 7227 -2410 10078 9128 5726 5737 18007 -6122 -8177 -8639 -16188 -14746
13968 -14746 -12645 -1061 19743 29064 2365 6929 29569 25475 27677 29062 38841 52623 54299
13955 54299 42341 45865 53755 58522 38435 28460 21041 8447 -10018 -3362 315 19176 14392
13942 14392 5762 1084 14239 26680 8858 7087 1188 16466 10701 -4186 -8290 -6739 -16056
13929 -16056 -17387 19374 41899 35420 26294 17183 -10919 -36983 -10708 29246 33767 41172 38501
13916 38501 44480 33815 35719 57776 22729 -4020 18515 33278 42313 35633 34541 28369 20596
13903 20596 -1260 -15793 -27241 -15251 -13864 -8871 -2341 2710 -23784 -27185 -9433 -6296 -29931
13890 -29931 -40966 -34362 1576 14873 -9621 4253 5078 13317 34432 35990 43880 19909 8419
13877 8419 17373 19546 11828 3448 20217 37041 31156 24702 -1653 -16807 -3758 14606 2460
13864 2460 -7505 -3639 4118 24499 26283 1117 -17814 -20289 -24912 -26376 -10813 1447 2239 20762
13850 20762 42796 43362 35942 30517 41903 27353 8044 -2331 -25035 -38039 -15029 723
13838 723 2396 36848 51986 23118 12698 21778 28453 43773 49019 24881 6172 14961 -2756
13825 -2756 6386 31678 3060 -10616 179 15623 33362 51554 43255 38092 36038 20750 30290
13812 30290 6093 -6846 7104 705 8880 12474 16741 37675 51095 39075 29764 21758 23059
13799 23059 24507 1855 -10207 673 3189 -18122 -21949 1361 23126 46091 22149 29228
13787 29228 32624 11397 -224 -2466 5370 5776 -10821 -637 27840 29900 -5454 -19854 25418
13774 25418 35896 45269 65911 47063 21772 6165 19565 24590 34853 46781 24484 30960
13762 30960 57174 37484 17260 9779 -7098 -7086 23961 23084 17804 9973 4279 12896 9503 20050
13748 20050 -10009 9947 25488 32738 22786 39758 47964 41351 23413 -3341 -15346 -4825
13736 -4825 -340 12006 48881 45530 21431 23043 24376 18590 -10754 -23209 -18614 -32005 -35163
13723 -35163 -9985 5809 3531 -7747 -20775 -31235 4684 21223 31822 30005 1836 -21459
13711 -21459 -21301 -25833 -27761 -7152 3853 5169 13428 11693 14550 33866 12952 -11721 -15831
13698 -15831 16297 57706 52554 82976 81906 62453 30625 30170 67500 68315 53786 53521 45583
13685 45583 58134 78001 73122 47198 9669 -8383 -19703 -18098 -6824 2700 9407 21300
13673 21300 20624 16933 16787 -2033 -1884 6649 23463 35465 18503 16396 33659 44941 29882
13660 29882 33840 35395 45041 66295 38443 14209 7942 26000 27073 22169 22456 19813 -6880
13647 -6880 -18024 3111 7951 -20940 -6048 12957 -5590 8496 -1982 -14126 -986 17549
13635 17549 53465 55962 33888 1793 -19585 -13619 7090 21852 34946 43625 29548 -1953
13623 -1953 2219 3711 4805 442 -10759 -24353 -15030 15190 33088 25515 14268 5853 3302
13610 3302 3125 9928 6046 25779 5798 6733 12081 18598 47276 61623 42140 17027 11867 -6019
13596 -6019 -19843 -26123 -23384 3862 1707 1213 12048 23638 -280 -979 4799 5802 7060 15086
13582 15086 57951 48678 32421 37005 48111 27305 23082 18826 12808 -7080 -19112 628 14362
13569 14362 11125 28044 47338 31792 27389 36901 48155 45346 47893 48629 43557 71243 67213
13556 67213 59090 36819 23831 23263 17967 20404 27768 35566 33752 18235 9460 28346 19710 1414
13542 1414 4988 4939 14486 26509 16753 21527 30679 20726 42792 51857 27236 22063 21390 13734 9233
13527 9233 8223 54037 72858 56157 80947 95307 67991 53455 43095 39836 25236 11509
13515 11509 23068 25921 27439 32092 22839 45287 47057 43420 32928 36459 48239 52880 67597
13502 67597 62640 56449 38645 43345 43035 47175 47145 32498 51433 64008 42880 31210 29464 22817
13488 22817 5620 18812 52350 62370 52398 47835 24359 21373 21092 22531 39569 38502 32836
13475 32836 42187 23585 21648 19361 10373 11888 30976 13685 22128 8073 -11785 -2401 22435
13462 22435 6589 -16489 -21441 -18692 -11823 6834 2360 -13659 -23554 -23634 -37708 -50477 -33843
13449 -33843 3346 12659 1451 9093 34631 38536 29412 20532 18131 -804 -22931 -23000 -2783
13436 -2783 8958 12135 26751 29007 13130 -23261 -50831 -10530 19382 19988 30268 38738 22080
13423 22080 20890 20321 47056 35142 30144 3534 -26751 -7668 9328 20421 25463 12635 20541
13410 20541 18482 2427 6111 36038 60670 54519 32973 13313 5851 8416 5288 8302 31287
13397 31287 44351 50704 51232 50282 58820 53349 61568 53835 32585 40953 39351 12603 884 10406
13383 10406 23549 15340 14959 13020 -11128 -13826 -15507 -7747 15208 39939 66269 53965 35451
13370 35451 23383 40476 25574 3868 16809 11741 -18953 20186 32688 19317 36407 60326
13358 60326 50037 18523 8503 28152 42175 23254 11356 40828 57825 32386 29108 41928
13346 41928 43453 20981 21555 -141 18934 2251 646 13108 -9622 8470 46308 33018
13334 33018 21857 42371 40774 23737 12800 -7561 -7553 15391 21953 25654 20157 11723 -7706
13321 -7706 10395 11102 -13218 -42050 -26665 10850 6116 13021 24527 36933 1405 -21355 -13836
13308 -13836 6645 28013 37217 14311 -13044 -1108 13784 61205 75800 59514 32093 35821
13296 35821 42137 41718 37733 6243 -17756 6824 23461 39497 49380 46731 55803 43513 10809
13283 10809 -19765 -2783 -7370 -2142 22312 41244 41550 37893 36232 35477 26661 -4075 -22401
13270 -22401 -6616 21298 34777 34614 23746 28876 48312 47630 44912 27070 14885 21505 36800
13257 36800 63949 93031 71035 44724 56382 63674 34948 -4124 -16652 1349 25128 29031
13245 29031 38109 32640 19885 7864 -21577 34445 68226 31856 5839 2076 11597 26456
13233 26456 4242 -411 23876 46182 74659 55865 34086 35605 19983 13743 40127 37001
13221 37001 25058 48425 23205 19551 47166 47241 42276 24094 29743 8345 -11760 -6081 477
13208 477 -1370 -12018 14235 21379 24889 37213 26261 13050 -2696 4181 25072 40782 53092
13195 53092 56985 62124 65006 54372 28086 14652 20722 19879 26200 60086 31980 10944 5440
13182 5440 1086 22745 16089 8070 14207 21512 20991 30942 63600 68511 46405 45814 49309 38758
13168 38758 26195 14042 -9906 3472 50092 55303 27198 40552 36466 42661 47692 40479 20570
13155 20570 17088 39396 38979 49191 19094 33132 32131 4026 19746 47476 47524 51191 58633
13142 58633 55967 66430 38438 15520 33135 25937 23351 27825 41271 38480 51239 54417 45950
13129 45950 77214 72132 74792 86885 84167 85477 66672 67606 77695 90105 93359 103497 124161
13116 124161 137844 150149 137890 120143 130340 146040 131318 114949 154465 196000 238557
13105 238557 271583 321743 411482 571110 752817 996157 1282177 1470502 1457513 1250352
13095 1250352 980755 738984 525860 390051 324455 270622 226582 198591 182111 150864
13085 150864 122914 118192 83528 70971 89899 94535 65099 17713 15204 20384 25969 48490
13073 48490 42463 46589 77781 94327 101156 113402 102404 67745 41787 15687 4092 4509 14207
13060 14207 28254 33907 15210 11098 30976 43500 35923 33774 82908 105386 71910 38551
13048 38551 18974 6289 8432 6083 14361 24014 21247 38752 56136 43330 34930 28138 20359
13035 20359 47658 47126 41775 34884 32307 28445 33787 47034 20607 -817 10416 21126 34933
13022 34933 28203 30224 6569 -24178 16198 48330 47609 35741 49397 46740 33307 15529 9159
13009 9159 -1008 25010 46874 45323 34755 49222 62358 57556 80358 62000 56731 56482 76216
12996 76216 81421 56750 31368 25644 44177 39735 23434 21741 49441 58822 37088 48908 55063
12983 55063 41524 16266 -6242 -17669 -9871 -20943 -10747 20205 51183 25609 14551 27598
12971 27598 53132 65181 58463 50105 52025 58239 71192 62887 53505 32867 12889 33393 45078
12958 45078 18877 -9118 9212 41911 52911 52098 40682 16914 -2014 33525 54402 61309
12946 61309 50680 46641 46275 77076 66941 50366 83497 96310 73832 58044 51045 57651 41127
12933 41127 33906 27440 46965 66029 55816 65938 83644 90973 115983 100123 51875 56088
12921 56088 59223 47348 51077 49911 48033 54123 51278 54906 49061 54566 61225 70912 85770 101460
12907 101460 115823 114329 100633 78140 87361 113273 144517 160511 183340 203153 218048 238402
12895 238402 294770 322619 298426 264559 189493 137554 124240 130985 130356 104183 90858 92751
12883 92751 78761 85867 65286 69963 45649 44492 65980 86057 94155 84765 83264 79273 83005
12870 83005 78352 72028 71500 64760 57378 59622 75309 94416 96204 107896 101783 136454 153576
12857 153576 135613 132635 132850 138086 145538 153016 148336 136130 115616 120948 131526 109527 106022
12844 106022 107023 118382 112194 84334 85722 82300 86502 107129 95517 111535 126942 118147 111518
12831 111518 97944 123442 129645 163412 192309 211856 199771 168902 141522 125781 147760 165358
12819 165358 167790 127856 130508 138158 152639 147947 133656 144293 164661 182841 170189 144736
12807 144736 135281 145276 156216 150764 154319 167798 168974 175410 142693 116780 128621 141307 138287
12794 138287 131938 129134 136740 144827 152402 166217 162923 173340 182981 193336 166627 168207 191089
12781 191089 158818 128194 111574 106557 103761 117637 144321 172597 215317 244042 296530 364550
12769 364550 435466 508735 561419 543324 500229 469237 443119 393353 349434 327173 300257
12758 300257 316438 308048 283709 276258 292575 322428 334106 334463 340604 334289 336583 347139 327665
12745 327665 323806 357148 352786 324024 305496 334810 378909 374933 374129 381433 375065 413222 422495
12732 422495 442307 469781 480955 479265 483752 493671 518636 530908 519435 517681 534801 552624
12720 552624 565383 543779 533823 555728 583430 585366 611798 655627 676303 691412 703490 736976
12708 736976 770863 795601 795271 809544 847100 859448 891802 923317 940646 1007814 1097229 1142723
12696 1142723 1192362 1250432 1301454 1358000 1463320 1585363 1731082 1878764 2054726 2209310
12686 2209310 2398286 2614501 2941616 3381591 3941507 4715893 5724971 7047952 8704464
12677 8704464 10430311 11762767 12218838 11715183 10579776 9280530 8177030 7351945 6796151
12668 6796151 6455517 6284534 6264780 6371371 6586915 6869323 7276117 7795298 8456108 9311442
12658 9311442 10362751 11694691 13312840 15048789 16856001 18933537 21619249 25275278
12650 25275278 30316504 37313739 47184581 61500562 82934166 115446285 163477590
12643 163477590 226017817 284503496 305504581 275793122 217093850 158001380 112778143
12636 112778143 82262971 62232031 48819144 39511175 32828664 27864457 24084564
12629 24084564 21148863 18822845 16844683 14986377 13153548 11463119 10037879 8882728
12621 8882728 7915245 7074439 6385729 5811624 5336115 4918977 4552891 4257875 4023713
12612 4023713 3879444 3803951 3787929 3860924 3956696 3944821 3788853 3479433 3084171 2694575
12602 2694575 2388261 2179784 2004765 1847272 1704654 1581085 1483252 1388213 1299079 1242741
12592 1242741 1200084 1161190 1124967 1113941 1080753 1041829 1002690 980970 957883 919678 920213 947348
12580 947348 979850 987193 986166 944833 906432 880707 866643 876195 897596 920113 1033030 1151746
12568 1151746 1288579 1484700 1672541 1748800 1668238 1486399 1267760 1074814 892298 774135
12558 774135 709030 621786 559620 519374 497789 473389 434150 430038 409200 384419 389415 378672
12546 378672 338398 319268 325418 315415 317795 313584 292724 280368 256127 251648 258625 280896
12534 280896 279494 275905 261151 246051 246232 248729 268444 286578 251127 246183 230933 215874 188366
12521 188366 207055 212043 186734 185259 209298 206174 216634 251405 243164 245419 248183 259759 246222
12508 246222 230758 242793 235886 207260 194910 181216 181828 171314 180832 180349 171534 167048 183726
12495 183726 184605 174014 160103 132910 99929 117693 142854 183292 157805 148270 138254 127790
12483 127790 163920 164515 147391 171050 186068 167082 133165 112100 89666 90615 96374 72938
12471 72938 79406 104297 113998 97554 97988 96381 103391 107524 80858 76643 87960 103796 104179 102748
12457 102748 71816 52785 44880 58763 102511 136220 189540 209208 268588 344100 450842
12446 450842 571542 596729 504680 382910 273326 215066 149071 105965 122798 141444 112469
12435 112469 96720 112544 117829 95097 77130 58419 69670 81068 102439 89143 67907 57695
12423 57695 26921 22601 54439 104275 140212 146889 120521 111546 139408 107983 86336 102530
12411 102530 119580 129599 168186 163277 146421 161802 176795 148900 110800 100759 112016 109663
12399 109663 105819 102075 121707 149771 154882 151554 130028 125675 120806 117626 136214 155582 154891
12386 154891 136693 119064 108106 78393 57716 65260 58747 51786 82745 103299 102000 77055
12374 77055 79984 103784 117313 114863 119186 87860 70514 77093 89272 80428 61265 71783 87019
12361 87019 80980 72808 64952 51272 65301 99564 116072 78290 55195 45277 49513 52485 54551
12348 54551 38867 57503 64061 66917 90403 130619 119408 63226 44127 48222 55577 71730
12336 71730 68131 68757 77113 54875 49609 44740 42801 70833 83155 73730 89473 86747 86028 87162
12322 87162 62248 47416 30517 28007 37406 69412 77279 76180 84179 75651 67392 67921 59422 65425
12308 65425 63352 66401 59698 83174 89148 57571 37162 35764 43067 55468 92268 106925 122152
12295 122152 131605 118792 108524 103238 103133 95680 88400 92081 71597 72399 84028 103907 117732
12282 117732 128178 122656 113470 113421 123126 111736 113367 115888 119344 141948 125345 106230 118975
12269 118975 116433 85967 82518 91570 106690 88535 81646 72849 71668 86745 79856 64608 56873
12256 56873 50421 57727 90526 101605 88779 55383 26913 10828 32030 70961 70019 80924
12244 80924 78114 81234 105196 103542 114674 137802 120501 97181 125990 104304 70067 42770
12232 42770 60430 94218 122270 152045 121008 110508 116881 138788 141886 114793 72489 68696
12220 68696 89738 97532 99924 104575 100008 93481 101762 122832 156119 182140 181143 166844 136089
12207 136089 148513 163660 150016 150850 170379 171774 173015 202416 241144 239070 244777 283584 265696
12194 265696 268107 281581 282441 266063 266728 299581 330340 380374 437942 570865 767344 879078
12182 879078 896955 931212 1044523 1260694 1511763 1654344 1556783 1325099 1065744 841199
12172 841199 637629 477875 358544 311429 275554 239821 207153 180297 153185 147697 118425
12161 118425 136063 151348 129247 91703 84920 93256 113587 114409 113424 122280 125644 145548 156760
12148 156760 180780 188792 177311 220086 249975 237150 202050 176684 188407 178034 189283 182532
12136 182532 179721 175152 164242 158865 162125 159978 145655 176891 190652 206729 195623 224224
12124 224224 226728 204480 185849 157472 166533 187037 208459 249131 263606 294479 339362 342123
12112 342123 309593 298939 257353 225916 224126 216015 201742 203234 201674 209782 220834 194023
12100 194023 173017 166128 180478 196951 213454 216680 251709 270067 264772 243649 207130 201953
12088 201953 193450 190002 197874 212045 208311 227190 245747 253108 283414 288895 265967 259634 271503
12075 271503 264618 256812 244203 222669 226960 233825 228729 217603 220992 223573 219538 225844 241121
12062 241121 266249 350078 495354 710388 949577 1052315 1019030 931932 816403 706568
12052 706568 623389 553644 490475 443903 394106 385214 398353 402101 393521 426307 438037 411404
12040 411404 429263 430512 455606 452422 451346 450807 450887 460123 478713 481973 518561 556871 548083 561377
12026 561377 598297 630343 651154 669712 642555 629552 632862 631275 627559 642093 655269 657033
12014 657033 663296 670618 693100 710648 711736 725286 757499 780684 802590 826412 859886 865498
12002 865498 856353 858900 889169 924688 942771 943044 991961 1033792 1061959 1124686 1146638 1167297
11990 1167297 1205035 1217561 1270649 1352528 1392766 1409159 1446539 1509155 1566579 1633678 1736576
11979 1736576 1858275 1955242 2015921 2057598 2128279 2227525 2295856 2370072 2490019 2635400 2752422
11968 2752422 2876401 3035545 3212407 3406182 3585910 3780273 3992383 4254210 4609725
11959 4609725 4995386 5408640 5861185 6324557 6830913 7423770 8071969 8800115 9671777
11950 9671777 10686766 11856829 13227317 14819494 16744469 19094185 21978844 25507292
11942 25507292 29870502 35457296 42793935 52590090 66120107 85450141 114174947 158574483
11934 158574483 228698991 336727191 478908827 589398232 573641056 458284966
11928 458284966 326172580 224263718 158283042 116927046 90165471 72032883 59112344
11921 59112344 49554464 42206179 36314566 31439471 27409628 24070818 21210867 18705486
11913 18705486 16548993 14703290 13131131 11801798 10650521 9657203 8807994 8043437
11905 8043437 7369561 6784283 6298641 5889532 5508189 5156053 4840029 4535610 4286102
11896 4286102 4059595 3860509 3665436 3467889 3292957 3140952 2965967 2780944 2606524
11887 2606524 2448105 2286031 2155047 2048625 1928483 1816593 1741264 1721438 1667420 1581119
11877 1581119 1509917 1433873 1357021 1293592 1235359 1192262 1155936 1138760 1113672 1057347 1026264
11866 1026264 993134 958826 934249 909501 908103 905300 855039 799843 786008 752710 702694 677207
11854 677207 637075 601831 598324 592101 589229 583444 584711 555515 495733 472282 451862 441516
11842 441516 447916 443324 447035 436051 416653 388668 381635 391041 404357 395760 375189 373886 388285
11829 388285 367735 356699 332808 318086 299523 300664 308536 305830 303387 343020 374164 369393
11817 369393 346220 339029 320777 302177 287837 262623 246566 264870 251543 211818 201931 209470
11805 209470 271319 315513 340418 353352 353042 346888 316332 312106 314535 332632 312575 280585
11793 280585 269862 262890 242085 263346 258290 246257 227287 212279 197477 186105 173965 196332
11781 196332 187810 174060 177189 189670 210024 199575 185088 184203 162471 140094 153272 159474
11769 159474 170529 172692 156489 114219 125116 164914 188687 170615 170155 165268 148381 126333
11757 126333 109011 107534 110059 101798 82406 89764 68043 38608 23520 12897 -18713 -19139 17505
11744 17505 44503 81251 94380 116553 124172 107150 98089 143803 161572 163773 145312 149186
11732 149186 150562 133270 125761 90453 76357 78196 57344 63944 71043 67572 59788 61244 49593
11719 49593 49473 53729 46384 59471 66135 52210 51686 86172 101515 105696 136514 148337 139999
11706 139999 130888 111000 123550 145345 139371 118796 138246 147779 140983 106097 116051 157161
11694 157161 165543 146011 138498 126116 118279 128748 114807 133838 142622 110087 87639 98064
11682 98064 102701 119613 118812 123279 163266 188715 170272 156610 128434 110780 98910 89498 87049
11669 87049 87101 69153 55233 46161 34053 71304 101196 78475 77356 100364 76183 65880 96936
11656 96936 118962 113428 99744 73337 41840 55022 76072 62323 52210 55382 42577 32365
11644 32365 50922 56341 69138 91321 92624 68744 61105 59581 54310 33091 31407 30536 19289
11631 19289 27112 41966 58227 80823 74255 35082 32815 45390 72386 85317 54516 59391
11619 59391 82935 87718 74597 56116 47241 32494 37266 44984 64798 55731 31546 22265 1746
11606 1746 -2479 12661 -12413 -10297 -5984 18094 22663 -5715 -1377 6361 -18257 -27593 -6846
11593 -6846 8626 22748 10740 1172 27126 39741 20317 20411 34317 39694 42258 52381 29640
11580 29640 16730 35990 61081 44807 31230 49333 46727 25236 11548 5360 17508 32184
11568 32184 16488 18631 18904 11676 1389 8724 39974 52254 34196 20257 16060 25204 14149
11555 14149 -3755 20424 39750 74542 84353 79257 67639 72814 64229 71877 70026 70547 56041
11542 56041 56171 52201 41241 23093 14405 20225 35416 37490 35977 24024 -22869 -13626 15228
11529 15228 26752 31953 51122 63946 35700 14024 7459 31976 8213 -11617 25388 57762
11517 57762 73453 56981 44288 26181 18382 40295 59230 80471 53564 37707 22497 7326
11505 7326 -10683 -11818 4907 -1110 -5831 2077 24741 47408 56838 61164 79949 87860 77342
11492 77342 67143 51605 31554 41558 66270 47648 53695 22942 18012 7799 4763 -4812
11480 -4812 4828 33992 45508 27818 24440 15709 20508 21905 8241 -4033 -3947 20214 31020
11467 31020 18637 9719 24577 14451 3630 27039 64539 53496 24031 49389 57589 22697
11455 22697 3314 22243 51308 89984 85649 49077 32530 20460 38442 -8185 -31532 -3850
11443 -3850 -18983 -30179 -8282 22272 4279 22365 44607 32026 40672 68414 66283 19839
11431 19839 570 -14766 -6736 188 -6643 -21652 3543 19228 3792 -22246 -26955 -12022
11419 -12022 19675 35294 37678 50064 38335 35570 62121 46293 25809 22059 26727 48859
11407 48859 50992 45560 35010 12773 -11569 5555 2505 -20026 -9648 5784 -16660 -16110 -8248
11394 -8248 -22104 -33449 -30362 -5391 7322 -266 -6287 16629 30821 38557 50338 35907 45127
11381 45127 43833 21039 18746 19178 22762 23282 25389 35012 11272 15178 24430 36218 57185 57556
11367 57556 35283 28449 41220 43736 40863 68177 96265 78609 64872 56339 33497 23941 26258
11354 26258 19109 47337 56895 63322 56155 56288 67013 48920 -2836 -9074 17917 19063 11102
11341 11102 -10486 -5987 2397 13257 12693 -4475 -6041 4506 -1516 7624 3345 -8483 -27067
11328 -27067 -22721 -28518 10630 26460 14696 -8767 83 10222 382 -30762 -32490 15790 52567
11315 52567 35501 31315 -3918 -1393 -5629 -3840 -10512 22769 45031 23873 7760 -50111 -43669
11302 -43669 -9325 -13288 6698 30493 34275 26477 11558 7829 -3300 1268 353 2048 -17244
11289 -17244 -6213 16759 14027 -3527 -17354 1828 16522 2578 -14544 -7622 12129 16076
11277 16076 30091 19692 -13619 -29042 -45024 -17101 1705 -12763 -2709 -14652 -938 15012
11265 15012 16953 -13342 -16785 1401 13281 -5377 -1890 15215 -15400 -58219 -45532 -20043
11253 -20043 -3370 6639 -7866 1636 40993 49149 31781 42160 58902 44479 19714 16069
11241 16069 20636 3881 18754 19476 -9079 -32898 -35757 -8701 35656 32814 20090 22128 19552
11228 19552 33838 73588 84421 53382 19357 12542 29870 60862 84581 86627 48397 19418
11216 19418 5111 21934 25843 41721 39221 35050 30550 2742 22636 18302 1608 14362 38916
11203 38916 58121 45802 8367 20185 31338 1367 -18185 -27762 -23691 -20693 1932 27276
11191 27276 9480 -9891 -15011 6122 -2030 -19677 -9188 -13577 -40719 -16105 10901 17704
11179 17704 7199 -5312 12289 14857 18664 13866 12114 8708 17735 28472 14152 -4048 -16907
11166 -16907 -6692 -1906 3413 11062 21140 35424 35400 32965 28844 10324 9819 25429 24083 16927
11152 16927 4966 -13427 -45364 -35428 -29838 -30560 -35939 -34230 -29024 -26749 -21964 -25965 -26506 -25493
11138 -25493 -24890 -13770 7337 31293 36138 8818 16672 352 -27348 -10485 -6645 -12080 -5986
11125 -5986 -14637 -23532 -13751 -14511 6757 19190 14673 22313 52046 43691 18486 12197 17971 35566
11111 35566 32218 47867 23827 -2617 -5615 13980 5496 36522 49200 35269 33592 42025 38692
11098 38692 36594 14490 -3681 19095 28971 44306 59641 73415 50124 20712 29944 14120
11086 14120 16683 24101 1839 3113 8633 16694 22018 15184 6908 17242 21156 33794 40811 42075
11072 42075 53775 35397 6077 35660 50177 50063 46877 30408 19929 33249 26630 52703
11060 52703 67150 69440 39287 18703 12059 17898 1506 30671 53146 40881 44005 48429 74664
11047 74664 101086 116590 103957 95877 93140 86913 65803 77361 93149 118825 139515 180408
11035 180408 174960 177665 205680 222258 219479 185061 144883 145167 152873 176406 200171 196928 183656
11022 183656 214155 260169 260502 220852 206315 209877 194550 156608 124995 127806 155615 214988
11010 214988 233803 256569 238330 221652 177181 136176 107740 100486 108290 117902 98036 77109
10998 77109 99996 123813 113757 96123 57735 10431 -9604 18910 49502 39517 12112 24414
10986 24414 34939 30386 12152 31826 56150 61113 44193 54987 82535 76718 67835 58558 45867
10973 45867 30201 30508 15751 28985 25359 25725 30208 44668 45922 30405 10729 5940 -8609
10960 -8609 7615 30225 50326 29422 6898 14466 -8374 -22638 11127 16755 13499 16302 11957
10947 11957 20553 40401 23572 19797 7197 2960 10775 4404 14960 8939 14860 -449 6759
10934 6759 8124 8355 13379 22706 12444 21575 28943 33675 37099 15086 8545 -7598 19566 14252
10920 14252 2684 -4638 -19598 -2718 14962 30822 13384 4344 -754 28560 33085 31297 40762
10907 40762 31534 14832 -11074 -5148 3297 6212 6791 18339 8750 16327 1387 8742 12007 -12210
10893 -12210 -35445 -26314 -11531 -12212 -25393 -16915 9896 8825 10635 17487 16745 18472 17880 14730
10879 14730 13277 -6613 -32041 -27140 9717 17632 6570 -8858 -10733 -10266 12341 32027 56495
10866 56495 64963 57145 69924 80924 79275 58613 19283 16259 37150 19647 18251 48608 33781
10853 33781 9111 22053 38341 30783 24693 21057 33077 32606 55159 66322 94704 103983 105586
10840 105586 86994 53156 52394 47913 43563 45497 60976 80818 104955 119647 118070 93836 51886
10827 51886 40984 50406 63814 55045 33995 28448 14917 29164 27291 30804 24765 42004 71797
10814 71797 60880 55173 57103 23680 3131 -5869 -5003 14551 36883 37927 25135 17509 3551
10801 3551 -2346 18031 23036 14083 23100 47841 37609 22174 17059 19464 23151 7033 -23893
10788 -23893 -46117 -24363 12586 -9318 -22428 7549 40370 61578 64610 54763 30378 28368
10776 28368 29256 32186 30577 43776 24204 24041 20293 5566 16938 36782 38365 42949 54495
10763 54495 50939 65628 79288 82613 51265 41952 37245 42305 56008 50689 21132 -19323 -9802
10750 -9802 27242 48352 72238 62891 46737 45405 71621 64213 93327 96228 90704 91871 68118
10737 68118 52139 46476 57194 56226 63292 71819 78131 76197 70239 88939 116125 141642 157772
10724 157772 147444 132690 103361 118785 136772 114646 143825 153429 163876 164736 128795 97690
10712 97690 93875 88914 74820 77974 81831 112810 131462 155089 164033 163304 161630 160686 137273 145003
10698 145003 163579 141784 124724 111156 129257 162782 159931 150059 152950 168818 159390 120212
10686 120212 91603 76626 79064 107000 149779 191928 166272 147606 148443 144994 150909 164097
10674 164097 142821 133557 114667 114438 120207 129649 148121 163121 175814 163636 168854 195440 198031
10661 198031 198078 202509 205364 226795 262271 284946 299403 347120 383328 369417 366944 400049 439316
10648 439316 486862 480504 459038 429591 417728 431983 440580 474510 507912 542134 591416 657736
10636 657736 705136 756585 842929 926644 1016229 1165301 1329600 1437358 1497945 1591694 1761766
10625 1761766 1959354 2232865 2582820 3046387 3684673 4580234 5806001 7388995 9444869
10616 9444869 11906882 14344130 16003415 16477161 15996887 15160247 14529475 14489880 15201144
10607 15201144 16814940 19538084 23550867 28555385 33364703 36025270 35477749 32653791
10599 32653791 29318978 26722990 25440557 25668373 27480502 30994107 36308696 42765630
10591 42765630 48363579 50324137 47591277 41851615 35671225 30677331 27407098 25857871
10583 25857871 25877962 27367053 30154694 33615496 36225441 36183448 33041092 28180461 23317160
10574 23317160 19460574 16869759 15391552 14851608 15005085 15698726 16549148 16906560 16184521
10565 16184521 14342073 11905162 9502121 7481573 5942731 4808607 3982276 3370822
10557 3370822 2875276 2498334 2205688 1923679 1710429 1523004 1340657 1205554 1115062 1016196
10547 1016196 922318 861653 810769 742415 641208 577889 543998 513391 489938 451769 415389
10536 415389 363910 344928 353342 343895 341355 340910 330022 329974 306698 282190 271047 269947 249951
10523 249951 248824 232339 219302 186234 165260 160710 170051 162308 143248 129993 149082 151707
10511 151707 151569 149651 124585 106353 101633 105435 127299 137943 119387 102335 105254 101660 91120
10498 91120 110040 128796 109818 134791 125904 115722 84959 71231 74048 64398 55654 51539 77479
10485 77479 79795 64542 79098 71283 83771 106378 104570 85468 81076 70540 60395 54520 34684
10472 34684 35921 65707 43449 17658 22233 55307 66023 70388 78273 82026 95724 93893 87634
10459 87634 90368 79377 68504 78879 63177 61021 44059 59270 56843 62784 82446 76196 86721
10446 86721 85261 78404 61738 71949 61634 64191 80521 78593 53886 60597 78948 67887 90302
10433 90302 85691 54440 28597 14680 29822 26241 49662 82324 69594 63447 69569 64940 47251
10420 47251 35168 43842 55531 52378 45758 25653 20564 50598 80984 78109 56204 35977 27420
10407 27420 28506 -3280 -23613 -15549 13205 32884 63909 74902 36940 49562 52721 39761
10395 39761 31388 25088 17539 18428 12946 24578 25702 2359 10243 45461 43197 8185 -426 -10299
10381 -10299 3586 16216 20209 33355 36590 6976 6992 36777 33768 36784 27541 41484 42681
10368 42681 35885 33657 46697 44098 37668 30583 48094 44303 22863 -1500 1561 22570 27721
10355 27721 42454 63901 52667 40473 12612 10153 30464 44454 58507 48010 20458 21576
10343 21576 35256 44625 46442 35353 37013 40707 32825 51177 49239 62304 50319 36689 40548
10330 40548 49106 46573 48213 25236 14981 28695 59370 76542 68492 61323 37488 28765 30261
10317 30261 24155 52910 62383 70392 48859 50453 55762 51532 46316 76652 62406 70168 71337
10304 71337 55777 37211 44250 33828 38951 59762 65611 61336 44695 17473 6688 -8414
10292 -8414 -11424 4871 36760 30280 12340 16782 32325 52184 50982 33568 40888 38091 15987
10279 15987 15382 12061 23322 40280 54856 40310 29012 30358 43386 51910 31651 21292 67033
10266 67033 86699 71109 55294 54096 70879 58047 42624 47164 64771 73196 71684 63160 63931
10253 63931 105676 122287 138281 124469 119369 166564 195797 191149 231552 281464 365471 449799
10241 449799 555971 720814 927120 1164196 1326592 1304795 1142434 903440 739615 587878
10231 587878 457162 384167 305748 269755 219579 199058 187325 176235 160013 156686 142554
10220 142554 127162 124438 120378 123739 117821 88074 73350 83338 75418 59042 64418 68104 48779
10207 48779 41477 51549 52495 74428 81844 58451 39393 23489 10908 16558 21163 35557 38088
10194 38088 38718 36100 35934 29721 23582 7712 -9760 5121 31486 4951 10649 44373 63114
10181 63114 51526 65090 115722 156010 183452 197903 203922 173853 153861 117230 92611 110613
10169 110613 125164 166365 186023 221396 223724 208636 183847 174460 180481 172659 187880 200039
10157 200039 235331 264500 314812 324980 319926 328958 295112 240419 193264 212539 209530 182777
10145 182777 164306 190359 208574 225982 241808 237792 209314 198391 176249 145920 131709 107347
10133 107347 98596 105560 106918 96432 108845 136161 146059 153208 135551 105457 81511 82086 75154
10120 75154 59796 64094 71639 49360 25565 41681 37115 40631 44745 27082 36563 43584 74769
10107 74769 102134 105502 87673 117214 113629 86975 83659 80700 107251 112752 123115 102947 95239
10094 95239 113366 115865 104798 110645 137180 183056 268773 306141 268109 188297 147797 114645
10082 114645 88493 82474 74206 52239 49999 66881 72441 93375 107569 127163 120393 75812
10070 75812 39530 32042 58417 58314 53612 78223 54544 54416 67826 59402 38610 46581 71513
10057 71513 63430 52970 58753 71442 72951 62283 82650 95175 72617 43552 30873 36222
10045 36222 33188 32749 79647 117223 111495 94137 89417 101347 93406 73787 59499 68656 67156
10032 67156 88619 89044 83594 90495 86485 97234 105843 97810 107445 110030 96238 97857 130536 167370
10018 167370 156386 154733 166290 182813 180714 167141 156394 159777 126249 137650 132649 98693
10006 98693 112355 118866 95993 104284 108094 120077 148400 147710 118661 117215 131420 119446 108673
9993 108673 103126 116256 100043 92039 100672 97777 103974 107105 118943 125878 132097 138158 136065 165156
9979 165156 191884 180402 180694 170865 172049 141610 97941 112646 126026 128244 149006 161452 170858
9966 170858 188648 233900 281537 333366 413837 518376 521211 506423 457023 417090 394270 351317
9954 351317 310129 300912 315643 304399 275082 263069 262023 277640 264290 274861 271039 243222
9942 243222 263698 274809 263769 247856 244967 284403 316551 306105 306921 300888 314570 360157
9930 360157 383822 392914 424669 420127 401826 400686 393733 404349 416530 422272 448465 488523 499697
9917 499697 492394 492523 512202 525916 503652 505605 522703 519414 519824 570428 608570 618334 621976
9904 621976 616401 592339 594847 625202 662106 693438 732136 760572 779328 834145 874424 905826
9892 905826 918769 969884 1010129 1016663 1042142 1081998 1111300 1164541 1222300 1270394 1347852 1391397
9880 1391397 1457420 1534377 1605971 1661799 1718987 1792444 1869982 1944176 2049220 2209604 2378325
9869 2378325 2526358 2652561 2800725 2933164 3161435 3440189 3718700 4032385 4379266 4787233
9859 4787233 5235567 5758097 6367500 7102029 7985289 8940683 9874266 10730935 11605872 12668497
9849 12668497 14067739 15871246 18164374 21054948 24719314 29516819 35867451 44448545
9841 44448545 56278130 72935728 96654373 130307303 175972206 230088070 272508407
9834 272508407 270780827 229275005 176363180 130918635 97913067 75054612 59118159
9827 59118159 47757590 39456178 33243788 28441107 24634254 21487039 18846165 16617657
9819 16617657 14821687 13334016 12121625 11197619 10425578 9608424 8686436 7777505 6938711
9810 6938711 6226087 5637456 5115554 4675192 4328678 4027079 3789822 3543346 3324060 3115161
9800 3115161 2898034 2703719 2535534 2392322 2276761 2149922 2020848 1931516 1851311 1750659
9790 1750659 1647816 1563504 1488009 1400434 1330549 1273404 1275836 1228589 1153830 1112686 1087368
9779 1087368 1063688 1005787 949809 899421 882283 846186 792208 757045 752794 767821 772434 752839
9767 752839 716791 704343 715262 698705 658069 631393 610115 602432 607536 619694 602434 601974
9755 601974 620185 631120 640830 689367 794698 890775 1024771 1240098 1468952 1600670 1586064
9744 1586064 1407415 1204924 965849 821029 718987 652105 583320 551478 514605 472606
9734 472606 422196 369392 357160 346466 354543 335560 295158 276675 268478 236347 254821 280952
9722 280952 285382 275214 280908 257762 243944 242397 247065 233515 223561 235818 242272 217743 207175
9709 207175 232193 270124 309945 301939 271480 253450 233178 229000 212287 193054 169731 156628
9697 156628 183334 219985 220621 204572 182768 161316 155283 151209 164210 171317 178550 173730 181216
9684 181216 195281 190138 180993 166969 162683 186241 163761 132220 141449 141117 126480 108874 103925
9671 103925 115143 105916 113822 146035 158396 137305 151284 129922 116281 91580 80998 100519
9659 100519 114628 128837 134675 95095 63332 45657 43278 38958 38622 44964 45360 49450 67201
9646 67201 96985 81065 66192 41694 14084 15671 39063 61119 58292 63279 86346 84773 85030
9633 85030 94818 106088 109356 83294 69925 58803 63254 71622 65730 39222 17961 8473 32956
9620 32956 43685 39414 25269 47434 76851 60861 66518 82349 106704 95964 84056 96478
9608 96478 107487 113732 110080 96799 73018 77137 86767 98487 101235 125435 130093 114158 103790
9595 103790 89481 90514 93230 80339 58240 58691 69715 92883 98817 86349 78201 98600 139014
9582 139014 152814 173206 163351 138700 105165 92851 81315 59518 49462 39950 42716 63925
9570 63925 47589 28220 23997 32910 44357 29013 28502 41910 42694 40584 32666 32377 64289 69054
9556 69054 56754 47409 38790 67044 57160 49462 45666 16568 9155 16617 25136 31858 30090 27666
9542 27666 29724 55575 89823 88999 73774 62987 53506 72875 77752 76930 70057 50173 46579 52964
9528 52964 45838 44932 73036 89924 95256 60101 62128 52728 35006 32321 37690 54825 31006
9515 31006 13640 16362 29470 72506 70649 84607 79855 51746 78014 76961 54167 43642 34857
9502 34857 73252 76404 46130 39936 54574 66808 73852 77530 73358 67884 56650 65255 76216
9489 76216 67771 66536 83213 67950 72031 87040 105655 106173 83597 88610 92715 73506 69379
9476 69379 93268 81314 36269 22791 39989 63512 61598 42803 57777 63320 73924 95659
9464 95659 94385 95958 86372 93004 93052 65824 70300 89447 92984 134615 119235 56470 42327 47768
9450 47768 56325 77981 78637 92363 101969 75382 101310 119034 113873 83383 107729 124189 125042
9437 125042 155723 186053 248455 304471 361092 460425 608028 789472 1002172 1221334 1333034
9426 1333034 1250543 1065454 853605 679827 527218 415217 342005 286721 243064 208315
9416 208315 200556 170805 109225 92585 63907 53760 85761 119821 102132 87941 93946 71783
9404 71783 91268 101070 63005 35357 30378 45537 70048 69132 59578 41523 37355 44485 56239
9391 56239 50733 46494 40742 30950 48649 60908 44558 51439 52682 32339 32479 24060 129 -11250
9377 -11250 1604 1808 10763 13450 39172 41032 25470 -6542 -3731 33895 51702 42009 29132
9364 29132 27899 38170 58548 48260 43867 35206 36888 23121 20541 19410 -786 -24262 10598
9351 10598 19194 -2755 2697 3865 18860 14970 -14483 -12722 10639 -6106 -10592 -13621 -13827 7627
9337 7627 4274 -14501 -12176 -10330 2529 -6816 5030 15856 13318 11865 -18266 -39186 -30908
9324 -30908 -8269 -742 15886 23796 24470 26417 12121 16720 33411 35116 29465 11443 8955 14389
9310 14389 34306 37929 44766 37204 43860 58220 24421 15388 23733 21126 37834 61705 58594
9297 58594 47729 55237 56808 74606 43132 25574 22554 12387 17787 19283 5596 6305 -11725
9284 -11725 -17797 -17967 -6328 -10129 10247 12396 -11744 -17087 3405 32370 50800 53020 39339
9271 39339 36557 69473 87777 84729 64159 43920 18380 8539 17222 30510 9626 24175 46083
9258 46083 33542 29778 18355 2175 6250 33291 37869 36774 26199 37389 39878 48213 27345
9245 27345 21084 17976 8397 24042 -225 -5322 38934 69160 52855 42371 25205 27571 44381
9232 44381 55822 67558 45610 31848 40902 60755 94311 116582 110062 95322 74398 74500 73934
9219 73934 72848 85801 89249 118890 124115 117052 109039 137462 163870 167319 156552 189779 200027
9206 200027 206861 229914 255641 278367 298218 332502 393629 423343 477428 524049 569069 640605
9194 640605 724649 840015 1000044 1153606 1333755 1587966 1939293 2398380 3001780 3780129
9184 3780129 4814637 6113122 7586002 8931995 9671613 9478535 8454648 7020032 5615708
9175 5615708 4417807 3494818 2802872 2267620 1879996 1578489 1351683 1182580 1047390
9166 1047390 941480 829629 724798 643200 594258 573535 535640 469022 404580 369798 348844
9155 348844 305177 287707 282936 286878 252451 206476 200676 210007 187917 145902 143591 117427 82368
9142 82368 92938 104780 88581 72158 78013 91644 91498 63523 60061 67813 51631 63914 39739
9129 39739 40181 59948 73347 71273 103621 116933 92768 80115 78636 54636 52239 56088 23723
9116 23723 32545 44254 16055 26555 43746 53305 37224 3713 6624 28333 48639 70478
9104 70478 75220 71264 60511 43702 34034 23476 33185 -4644 -30697 -1295 26033 17109 29262
9091 29262 34396 8199 32635 51303 24058 -2793 3801 21952 20080 3195 -23656 -41106
9079 -41106 -29675 -1528 8943 6248 -7173 -25680 -30665 -6530 6516 -2952 1681 -7158 -12909
9066 -12909 -37103 -29703 -3152 -6378 -14079 -8174 18411 51323 60075 23135 -10589 -34431 -21626
9053 -21626 10947 20535 24766 28287 23941 8875 -4620 -34597 -40356 -20831 4184 32106 20619
9040 20619 18309 3513 19808 11417 -11579 -3173 -6707 -14543 30317 28596 11796 9124 -3088
9027 -3088 -11657 -21545 -25527 -25951 -21182 -20461 -8615 4699 8866 796 -8198 -36936 -80861 -41046
9013 -41046 -24118 -4216 -12669 6171 26183 17367 24947 14414 4025 7205 -6849 -20283 6118
9000 6118 256 1150 7951 -16885 -22691 -30249 -38959 -23385 8653 -16945 -16204 -9613 -17551 -14734
8986 -14734 1400 19549 36091 16814 -9698 -22937 -17961 -16433 -39596 -43315 -49359 -23628 19856
8973 19856 31089 6208 266 -1313 2372 801 1838 16309 29295 4397 16219 47471 42682
8960 42682 33911 16197 21700 31439 10593 -8838 -27398 -31656 -21017 -20071 -67825 -62197 -38309
8947 -38309 -8276 5588 -17552 -20477 -7919 -15367 -2452 -14909 -18792 7482 1977 18464 26694
8934 26694 20314 -3645 -730 14465 160 -11891 1556 22253 7742 13100 12684 -10013 -9144
8921 -9144 -6930 -13860 7056 3901 -12339 -8004 -4408 3080 -21850 -33042 -30845 -10278 -2181 6512
8907 6512 2247 5578 -8401 3734 24536 26523 4817 8514 -9062 -25182 -25035 14727 38597
8894 38597 43052 68168 47113 751 -7751 -9932 -10557 -22882 -24455 -27363 -6372 32629 39925
8881 39925 5712 6967 11695 36210 40357 -1649 -5980 12194 28299 34284 28164 3382 -7215
8868 -7215 -31566 -33875 -42784 -23597 -9413 5647 16080 35745 32799 5549 18138 17212 22337
8855 22337 12178 -2269 -19661 -2835 7673 10087 24357 18257 -1042 -31935 -14971 -2568
8843 -2568 4488 12350 39749 14148 7959 10099 13428 31926 33332 25934 54766 63024 57424 54664
8829 54664 30790 8454 -14833 -16773 12976 26 -22136 -37409 -53360 -20758 -18650 1780
8817 1780 -23115 -53102 -43722 -13700 17996 32534 7207 -30801 -33683 -14501 -8853 -9979 10653
8804 10653 26190 22614 19245 4375 -4688 12645 4485 -16353 -16252 -23135 -31509 -14217 -26962
8791 -26962 -34118 -18986 8322 23791 10756 1011 -5272 18009 5954 -1062 16188 28533 9859
8778 9859 1869 7016 5924 6480 43098 68542 69613 51509 48574 51290 16969 -20900 -32403 -15797
8764 -15797 118 9009 2632 18163 12266 11817 53108 68752 54116 34155 37703 37758 3304 -693
8750 -693 7101 15402 -1030 -9704 -7366 -20500 -21560 -6306 -12973 -18959 -15876 -26825 -48695 -40787
8736 -40787 -26453 -15032 -5160 9120 12144 5237 -9833 11889 20257 9613 -10462 -32255 -52791
8723 -52791 -62445 -52603 -40234 -30181 -13267 9944 13049 1260 -12177 -9002 -12273 -23072 -28455
8710 -28455 -35756 -16318 -10066 11571 4875 9829 -5589 -24376 -22815 -6579 27849 28654 15687
8697 15687 25739 24085 8180 -18631 -35678 -16804 -9122 -19469 3452 19258 -5931 -20848
8685 -20848 -29382 -16626 -265 13302 -1614 -13908 -8370 -38614 -46873 -51784 -57514 -60274 -38480
8672 -38480 -18289 -22343 -32052 -51716 -40410 -32931 -41361 -24423 -22844 -37843 -32615 -22094 -33598
8659 -33598 -24749 -12302 -11336 -11159 -20285 -11382 -12346 -29542 -35210 -36262 -3382 296 -11917 -33487
8645 -33487 -39533 -18742 4395 -6886 -38767 -69963 -54574 -43362 -11626 -11463 -13855 2904 19617
8632 19617 12137 742 -17047 -15199 -22407 734 -9207 -3102 -9861 2839 6958 1913 26990
8619 26990 18405 2650 -30742 -21306 -12468 123 663 -13605 2557 20440 26534 13190 24943
8606 24943 23537 21125 12751 -3763 -8187 -6905 -24010 -4143 596 -5600 -3743 37406 47034 50080
8592 50080 51179 21199 19118 9945 -18643 -32620 -33566 -35368 -3170 9599 4581 9072 23658
8579 23658 33237 51967 28815 25626 24804 11571 1375 7367 14277 13845 -695 -27567 -54168
8566 -54168 -42176 -20181 -20765 -11992 -309 -3781 -3840 -15400 -16177 -44248 -47112 -9801 -1312 -4906
8552 -4906 8371 18301 12486 -4257 -8349 -16683 -29995 -32649 -11217 -2712 -21227 -25159 5412
8539 5412 48670 10304 397 3918 -10387 -24672 -49643 -43202 -28609 -22290 -2028 -13970 -36530
8526 -36530 -37830 -49315 -64472 -52942 -22233 -11366 -31302 -25047 3317 26575 5622 1464
8514 1464 4980 1880 2465 9309 26003 -3717 -22932 -29353 -43319 -36053 -51646 -43581 -34146 -2955
8500 -2955 12355 11456 -1416 -26549 -30288 -19928 -18484 -10271 -5167 5294 22577 24045 2905
8487 2905 -23507 -11933 -1971 -1606 17942 37796 36574 41859 14400 8019 18100 14747 870
8474 870 -4274 -11016 2937 -3609 796 27803 23749 -22945 -52962 -35075 -49541 -76945 -70879
8461 -70879 -48691 -26915 -18107 9002 17608 18876 13847 16492 27089 15624 -23242 -47509 -16176
8448 -16176 4217 4555 3700 -9712 18460 27498 33907 32789 4661 727 9178 -3216 8025 17537
8434 17537 10178 6956 12893 30500 28557 25196 18922 15714 18164 -5301 -17812 -26129 -49600 -52745
8420 -52745 -26789 -16042 -12159 -16359 -31796 -47491 -41179 -13867 4075 -7707 -26484 -43849
8408 -43849 -16205 -8764 -21056 -29239 -33152 -14634 -9289 -10372 8616 12038 -601 -15389 -23436
8395 -23436 -26797 -23358 -7396 5156 24597 18132 -19333 -34519 -43411 -22577 -3773 -16448 -27939
8382 -27939 -13825 20335 1632 -7930 -21510 -1468 29167 22805 22729 38132 39155 26491 9951
8369 9951 -23943 -42229 -37233 -25092 -19183 -32075 -42141 -53623 -40129 -32239 -43281 -50240 -45828
8356 -45828 -42265 -35985 -49078 -52162 -29848 6949 17890 11029 12416 11973 1824 -4620 -23547
8343 -23547 -17171 -4494 -5065 -167 -13076 -30438 -30960 -16385 -40199 -59515 -64672 -43165 -15283
8330 -15283 4636 34825 38119 29582 10735 17077 23000 19556 13384 -1279 7202 11210 27464
8317 27464 21791 -6034 -31486 -33167 -22766 -5676 -12163 -5046 1949 -3039 -10262 9926 -16031
8304 -16031 -33452 -21771 -16047 -984 14664 20706 37585 39190 25714 10072 -7556 -29894
8292 -29894 -33165 -29508 -38307 -23078 9275 25045 11081 -26772 -48147 -50176 -31791 19968 34949
8279 34949 4071 -31935 -10339 13073 8554 5790 -9758 -1691 730 12867 17196 -7355 -51822
8266 -51822 -63112 -34361 6102 16307 9592 295 13490 34947 46846 34841 11627 -11787
8254 -11787 -22029 -17044 -5254 -12266 18694 31339 14278 -9209 -22099 -20565 -24259 -34606 -25501
8241 -25501 -19708 -7870 9130 6288 5429 12309 -12782 -42181 -45982 -20368 -4945 17798 21427
8228 21427 31494 -2034 -39796 -23876 13057 12508 42196 65180 48856 14904 -12132 -20512
8216 -20512 16145 58582 50650 14363 21097 30215 23708 -1294 -15158 -32653 -6391 5102 9224
8203 9224 7569 9397 5458 -29399 -22145 15658 43113 69869 57608 35777 4892 -11373 -4789
8190 -4789 2999 12503 12044 18788 25613 23693 13230 -6943 5338 -6535 -25394 -3454 15247
8177 15247 -3320 -34324 -52618 -56021 -31799 -17591 -6777 -24269 -34856 -32093 -29501 3975
8165 3975 58303 59201 34244 23322 17811 32065 10468 11542 -1211 4978 -5758 295 14246
8152 14246 13934 2883 14581 -4715 -35061 -62483 -55111 -61964 -58531 -35709 -15879 6485 380
8139 380 15454 17974 -7306 3989 230 -240 -1080 2917 -21067 -16517 -4249 -4029 -20582 -158
8125 -158 21956 8443 -5795 9040 23782 32116 20584 18362 2326 -11247 -6226 9665 15539
8112 15539 11764 10761 -2210 -31490 -30373 -4854 25764 11621 1518 9456 7067 -31746 -35787
8099 -35787 -25941 -25397 -23287 -17537 3146 17268 -3615 -4278 -2205 20457 14734 14694 -12088 -17482
8085 -17482 -25850 -27229 -14289 5747 22236 28731 9364 -18267 -28835 -24711 -11802 -15245 -28718
8072 -28718 -17960 -15332 -22584 -21800 -11694 10657 18828 -1134 -14009 -830 -9073 5257 5597
8059 5597 -32351 -32242 -29455 -28469 -15749 -1694 11257 25814 21615 16747 9873 7839 15423 -3210
8045 -3210 -14168 -4374 1102 887 20137 39394 39515 22116 -13 5699 -6262 -5829 -5044 -12218
8031 -12218 -2930 -26130 -47887 -16151 7414 -7373 -2733 18925 24161 22495 14188 -1630 -11638
8018 -11638 -24391 -35571 -32063 -21005 16858 44550 25690 18805 -13148 -32664 -22045 -36595
8006 -36595 -54237 -36773 -8439 -23338 -23183 -33751 -47516 -52378 -48858 -10274 19633 8842 -9296
7993 -9296 -16703 -27970 -28040 -9121 9927 -3496 -31638 -17800 330 30153 35062 10895 1801
7980 1801 4505 -2113 -14239 3230 15604 27172 43790 27174 -4085 -15341 -14656 -22886 -24768
7967 -24768 -19155 -14602 8805 25190 8389 5997 -11113 -7051 5539 -13030 -7261 -8058 -24079
7954 -24079 -5318 16714 18562 -6251 -22576 -19326 -15349 -10449 -1368 -6498 -9108 -11770 918
7941 918 -3291 1917 1808 -21696 -39919 -19393 -8058 -3076 -20890 -22255 -23547 -5413 -8443 -26630
7927 -26630 -29177 -33038 -53950 -41432 -26158 -33261 -28880 -21834 -16843 -5232 -30437 -53983 -51006
7914 -51006 -50637 -38230 -21757 -29195 -40191 -68060 -51369 -39409 -29090 -22779 -10201 -24096 -32602
7901 -32602 -482 31881 11989 27307 48878 31887 20877 5899 -11954 -27497 10306 20969
7889 20969 9484 -4415 -26867 -16985 -13532 19328 36686 3283 3353 3966 -28766 -11336 21980
7876 21980 26789 23822 27504 26511 5975 -4434 -20346 -18600 6257 5709 -10980 1650 21272
7863 21272 16636 8709 -1843 220 -10354 -21959 -4081 -20391 -20320 -17840 -29362 -13211 -22099
7850 -22099 -21976 -31457 -48859 -26487 -19423 -20630 -34628 -7573 11174 16383 2750 19731 16122
7837 16122 -5828 -1299 -4420 -7120 475 -3706 -28282 -24077 -12107 -14835 -12956 14465 30397
7824 30397 16868 11995 -16052 -49436 -33582 -9981 -5112 -24655 -12275 -28358 -31958 -53484
7812 -53484 -41678 -28914 7450 8838 -8463 -32030 -49846 -54410 -74731 -41167 12378 17223
7800 17223 410 -4646 -4682 -5557 -20189 -21468 -10907 20023 48947 60824 12566 -38361 -67793
7787 -67793 -65811 -37757 -21507 -14076 -34700 -48297 -43377 -31871 -54630 -65582 -38742 -42923 -33169
7774 -33169 -29303 -11157 -9869 -33307 -50266 -26501 15183 18959 31749 27451 -20503 -21609 -31005
7761 -31005 -39296 -36919 -18776 -15501 -12632 3576 -20545 -35598 -50036 -42678 8171 -8558 -57989
7748 -57989 -60147 -44103 -31583 -11103 -23900 -63624 -30463 -14870 5310 43274 51491 45752
7736 45752 26635 18460 25721 17573 5152 -6366 -16353 -5528 -14985 -15801 -3065 6763 10162 22905
7722 22905 24130 16004 10376 -3026 -1490 -5567 -20647 -8103 1252 16317 17526 -30017 -48661
7709 -48661 -34676 -17781 14856 14499 -10051 -28600 1100 1761 -619 8280 37168 24015 -14790
7696 -14790 -32009 10524 19607 6868 18214 2304 -6454 -23379 -23360 -17643 3513 7885 -12120
7683 -12120 -11426 12854 14112 13712 5989 -22627 -20234 -7302 7516 -11685 -23713 -52859 -54814
7670 -54814 -58444 -38647 4310 37276 39011 27178 10855 15883 15818 22460 5323 -8651 -2863
7657 -2863 16077 27264 11580 9703 6247 19477 27160 8188 -4176 -26075 -10709 25871 19831
7644 19831 1130 -17624 -17654 -2243 -382 -24725 -31414 -12676 -2041 22311 8273 -10955 -1851
7631 -1851 -2239 21781 30465 19123 29173 16734 -13115 -38195 -19145 -11164 -856 -13167 -6083
7618 -6083 -6287 -4134 3929 -8766 -32249 -16624 18688 20710 18679 20087 26716 16576 12783 12213
7604 12213 6460 -60 -3424 15982 18150 43506 57792 22709 20122 -2858 -21496 -42543 -21821
7591 -21821 -19024 -37831 -30056 -46097 -36636 -24621 -24184 -10534 5936 3256 8567 17013 -3363
7578 -3363 7442 15596 -10250 -25394 -3599 8551 639 -13700 -15535 -18106 -15512 -4734 -3139
7565 -3139 -5141 -17860 -28046 -3522 -2113 -16810 -54516 -45244 -1241 37913 42856 34443 139
7552 139 -21049 -24791 -36679 -36014 -33123 -13530 13945 39368 45738 62924 59542 41236 19321
7539 19321 21511 28013 18080 38591 52274 25404 43575 42904 25636 -6991 -12731 -14418 -16078
7526 -16078 -7986 -23132 -50342 -53241 -57012 -56068 -32355 -29651 -15879 12066 -9457 -19041 -19222 -15642
7512 -15642 -15883 -13570 -19324 -5274 6722 -6771 -30217 -25232 6938 26508 26829 6125 -11299
7499 -11299 -3197 -2666 -15301 -33062 -16012 -8514 -25676 -20358 -61 12817 -18950 -72 22338
7486 22338 21758 32954 28541 19518 11706 14562 11979 6745 -6662 2412 -7017 -10959 -25556 -14292
7472 -14292 10496 16974 5109 6776 2046 7106 4275 -10193 -20664 -24262 -18002 -38908 -44054
7459 -44054 -11689 -10189 -25795 -24356 2048 9125 13743 16237 28269 30457 30597 47927 29745
7446 29745 13457 28464 19267 4929 6992 10100 -1078 -14800 -9923 -3695 3878 -5432 13511
7433 13511 21886 26348 20204 15438 17117 8937 -7146 -9319 -25692 -5343 13490 6685 28971
7420 28971 38649 39423 28885 -4417 -37330 -23588 -17312 -115 -2567 -9648 -35132 -21528 -32006
7407 -32006 -24736 -21488 -30063 -32291 -12903 4636 -13538 -34000 -18829 3150 22662 8228 -7486
7394 -7486 -5388 2166 3130 -22520 -55928 -55808 -40696 -26651 -39211 -30425 1462 18969 14450 14462
7380 14462 11468 11525 10287 6761 -12839 -47469 -12440 24778 62807 42523 8601 15311 25502
7367 25502 30382 28333 39314 33937 33182 19971 17976 23142 -12908 -17033 -13560 2648 -6654 -27067
7353 -27067 -16417 1254 -16014 -6463 20275 35159 34053 16542 480 -9274 -2535 6776 12334
7340 12334 7809 -3708 -11555 -18975 -33039 -18164 3149 20550 4885 -16914 -36535 -25074
7328 -25074 10804 20059 4355 16520 34686 24415 -5663 -4761 -12548 -11026 -19943 -34576 -56524
7315 -56524 -43699 -19050 -7249 -21104 -21142 -27536 -42617 -27532 8383 16746 40753 37597 10691
7302 10691 -10503 -8126 -1514 -16582 -35125 -40019 -4365 8862 2076 34269 40437 13830 4272
7289 4272 -23175 -39391 -23019 -25760 -22953 163 -16297 -8296 12152 22825 3202 -19551 -32019
7276 -32019 -27668 13337 43670 31091 35913 31302 6041 -4675 -10326 -45225 -57674 -33698 -40101
7263 -40101 -61057 -23654 15495 41214 37396 33874 30463 5299 -18194 -33717 -36320 -22317 -32988
7250 -32988 -6101 -4394 -9119 -27835 -414 23205 22312 32538 26619 7976 11282 5996 4783
7237 4783 -38 -24251 -9213 2277 -17843 -5794 -20944 -30193 -47325 -57095 -47325 -52140 -37902
7224 -37902 -27187 -7209 6893 1639 -3376 -18720 -45108 -48339 -43391 -35690 -46474 -39516 -34789
7211 -34789 -26853 -36443 -30795 -11977 -13010 -23729 -37459 -18500 -1922 -12830 -1096 1532 -5177
7198 -5177 7349 19186 -4386 -52584 -54359 -35534 -7637 -4115 -20201 -33555 6386 9601 25707
7185 25707 6077 -23657 -13375 -24325 -34049 -33169 -5365 1197 -2403 10235 13919 -8358 -8253
7172 -8253 19342 3160 -25774 -10283 4719 -5911 5677 -6197 -5705 -7031 -5766 -1832 16794
7159 16794 29496 21589 16436 12606 -655 -3753 -1889 10357 -851 -15358 -25113 -17806 -15435
7146 -15435 -24078 -22586 -16951 -16569 -14662 -20863 -49091 -71057 -75322 -46706 4952 10545 5319 -26310
7132 -26310 -34812 -17651 -5004 -11972 -13379 -17926 -9694 3535 999 21684 37167 51423 47502
7119 47502 19532 10968 23964 42002 14442 -19246 -43800 -56604 -48562 -42126 -39778 -33920 2707
7106 2707 34150 31240 -11648 -45042 -56801 -77557 -65303 -55677 -47971 -53687 -25345 -1525 -1853
7093 -1853 1863 -3610 -23842 -29012 -4009 -5881 13399 24297 3187 -20934 -12818 32653 37990
7080 37990 16287 297 -18316 -28428 -25996 -34337 -33974 -42442 -39909 -40441 -31917 -19987 -3408 -1429
7066 -1429 -40755 -82227 -78782 -68967 -50952 -53625 -75138 -90100 -76825 -51955 -21967 -23504 -37612
7053 -37612 -10230 -17245 -17953 -13282 2219 -6696 -20402 -3260 7456 -14567 -16653 6943 22055
7040 22055 27356 -525 -42862 -44364 -19693 -9438 -5875 -24880 -43258 -31800 -26061 -25809 -33809
7027 -33809 -11069 -6212 -1365 7847 -23325 -28822 -18060 8887 -3686 -19875 -13897 -699 -950
7014 -950 -13440 -40101 -51225 -28542 -6496 9536 5602 -6631 -3779 6872 18065 34828 30201
7001 30201 -9566 -11496 -1169 -18793 -18726 -18684 -16646 -16910 -33552 -65343 -54749 -48266 -21368 -2827
6987 -2827 14458 26923 1151 -33310 -42862 -20346 -23998 -6725 27785 31397 20957 -13200 -15548
6974 -15548 5069 26258 46182 34920 50522 23445 4308 -19802 -2265 5754 35648 45000
6962 45000 44855 17925 11918 12680 3586 -5150 -7457 -5587 637 -6980 -53202 -63170 -53827 -51221 -16888
6947 -16888 -1158 -1193 -5016 -15648 -21396 6633 17625 11003 1083 -962 13772 -2468 -29140
6934 -29140 -14914 -4110 -12283 16985 24700 19262 10018 -8842 -15070 -13867 -14635 27781 33686 6894
6920 6894 -2536 4748 3666 -6191 -402 -1057 14164 4855 -7941 -20673 -35749 -33083 -42921 -49635
6906 -49635 -35988 -33161 -16303 15332 17554 -10404 -33305 -27026 -32417 -27313 -28185 -65068 -76230
6893 -76230 -61422 -63711 -59139 -25785 11179 2479 -22957 -30184 -7630 -5196 -17054 -30628 -46940
6880 -46940 -29407 -22579 -7132 3723 -17236 -11401 83 17753 -6287 -21415 -11325 24705
6868 24705 28880 27230 22142 31186 33735 36707 39910 27977 14439 6103 31924 43076 54025
6855 54025 48548 27453 24786 30039 35719 26358 19038 17532 8130 2784 -8584 -28983 -22519 -10859
6841 -10859 7708 26752 34032 22510 24668 15864 30475 37703 13941 2926 259 -6746 8018
6828 8018 2410 14013 39269 29977 29533 31114 20841 21586 11587 -27933 -53762 -34876 -26226 -19166
6814 -19166 -11393 -9193 12503 6040 11162 3836 -7007 -10266 3792 -10848 -19335 -8909 -15489
6801 -15489 -1857 704 -14121 -16987 -13763 4650 -5074 -13268 -13198 -21964 -5108 16834 -7273 -50146
6787 -50146 -28545 -21435 -1221 -1420 -18369 -23156 3026 -5351 6505 6339 -3506 -17562 -29979
6774 -29979 -35373 -28583 -36518 -36586 -29198 -36884 -54466 -47212 -38399 -17442 11723 17328 5897 -8747
6760 -8747 -16078 6614 27546 16441 20597 22209 13579 9004 10973 14526 31915 6301 4120 3264
6746 3264 17627 30334 58653 48611 38713 43809 34692 41825 48804 40171 24068 18586 4520
6733 4520 -20565 -29903 -35081 -23987 138 36329 30309 27797 22453 16606 11605 -11745 -35899
6720 -35899 -67675 -55891 -19411 -5425 -23190 -30789 -36583 -18259 -21226 -45351 -2478 348 -15549
6707 -15549 -23564 -16407 -2766 -7667 -22290 -33045 -58181 -39952 -18360 -26063 -38847 -48333 -28412
6694 -28412 -24912 -23772 -9456 -23628 -24383 -23795 -20493 -11461 -6333 -9195 2020 3609 16659 12903
6680 12903 -4642 1050 2394 9590 -8454 -23456 -22552 -26783 -3638 9576 2061 8840 -3090
6667 -3090 -13684 -46222 -77140 -56935 -37728 -20572 -8633 -2081 -12187 -33667 -28049 -42683
6655 -42683 -32055 -25615 -23554 26000 60899 63647 59895 28333 14984 -11692 -14686 -14114 -3193
6642 -3193 1203 16691 11970 9019 6067 27965 -2472 -40382 -23070 -15145 -11957 -20614 6034
6629 6034 -6767 5317 -18799 -28402 -3640 -5130 7163 8955 4609 29608 26526 10935 -15762
6616 -15762 -51220 -60362 -34376 -14370 778 -11018 -1210 4679 -2111 -3795 -12963 -12309 -4113 6776
6602 6776 -34505 -56061 -17010 -13588 -19382 -18307 -9802 -5302 4905 -4136 -12116 -29094 -22552 1354
6588 1354 -27298 -35554 -4206 -8761 -16442 -13851 -16167 -25700 -12825 -18270 -20922 -31416 -20974 11376
6574 11376 2621 -8744 -5917 12327 18034 -1943 1315 -9283 -18630 -15977 -2509 1299 -3499
6561 -3499 9238 3372 -21801 -42927 -46113 -23565 18494 5225 -34240 -7924 -3737 -3554 -5670
6548 -5670 16227 11586 -677 6027 -297 -19357 -14547 -29369 -27367 1832 -3868 -20278 -23583
6535 -23583 -17073 -3952 -4083 -11792 -9435 5729 10612 4786 4976 -1186 -17153 -30756 -38617 -19531
6521 -19531 -19881 -31219 -14775 24017 41672 29737 11027 940 -3942 -41303 -39200 -5643 2654
6508 2654 13186 14086 11615 -15483 -15164 5174 -18796 -20386 -12087 23247 45815 36963 16457 -11018
6494 -11018 -44698 -38824 -10331 4374 -6805 1789 -10354 -47062 -35368 7816 38548 23298
6482 23298 15452 20548 9479 -12884 -35820 -40194 -14562 11937 -237 7812 27314 31191 12906
6469 12906 11053 22768 3893 -5905 -2633 13628 24700 4805 -15146 -21273 -35429 -41365 -33006
6456 -33006 -23397 11228 7567 -29940 -43531 -35040 -34035 -37017 -39062 -44366 -51621 -68859 -58002
6443 -58002 -30835 -9606 4772 -1767 10307 15102 18190 -7600 -17380 -20354 -11303 8915 24101
6430 24101 24146 14095 -8753 -18801 -39386 -32877 -18889 -15755 10923 23624 13518 -5310 -15895
6417 -15895 -17697 -8761 -9951 -21809 -24534 -20700 -23374 -12060 14491 20773 23557 44926 36724 22590
6403 22590 16839 14643 1089 -20772 -63979 -59145 -19621 15589 4113 4839 -1305 6647 44026
6390 44026 39963 17057 -32764 -11051 24982 23146 3069 50 -2263 -12262 -14120 -7734 -42099
6377 -42099 -67659 -55516 -21849 -41245 -59517 -57045 -41576 -28099 -19885 -8378 7697 2187
6365 2187 11470 1919 1524 -5912 -2354 -25817 -24236 -22161 -33012 -23340 -15547 -4696 -14668 -20053
6351 -20053 1991 23772 -1938 -1599 6928 339 -205 -18960 -37019 -41064 -34970 -41375 -39699 -34553
6337 -34553 -19579 -19126 -16461 -8416 8770 36614 19675 -20747 -22076 -24484 -18358 3154 -863
6324 -863 -5733 -24573 -16989 -12266 -17669 -16345 -5516 -36377 -60506 -16723 17622 24057 23942 7981
6310 7981 442 -28565 -18394 -25295 -35257 -17146 11813 34439 37999 59733 41182 -1576 -22463
6297 -22463 -24126 -16145 -4103 11105 17084 4288 -23447 -44703 -53897 -40052 -15468 9854 -11434
6284 -11434 -34592 -42093 -60734 -59788 -33397 -25304 -30182 -24154 -40 15623 2015 -2063 26082
6271 26082 34642 10537 8292 15923 1664 4317 -27780 -37065 -20427 -41435 -35913 -18914 -13299
6258 -13299 -18643 -32556 -33351 -3587 5468 45709 36181 41838 18399 -15677 -15361 14931 5605 -30888
6244 -30888 -17415 14379 24275 13148 20781 1583 -17982 -16409 -26719 -30407 14758 31381 17724
6231 17724 8500 32357 37910 46917 22046 4296 19795 43381 46707 44160 48194 10344 -2334
6218 -2334 28885 35864 32460 28055 21891 19210 14512 -22007 -6581 11279 20118 -7537 -21631
6205 -21631 -20073 -13845 -17792 -25114 -28486 -20552 1500 21128 1590 -21413 -38416 -32025 -42739
6192 -42739 -32046 -36318 -48066 -45419 -28322 -7361 207 -1289 -2628 -3074 47392 64425 40901
6179 40901 25219 13539 18518 35692 15624 6766 9111 -9506 -2370 -9806 -2252 4686 2320
6166 2320 -17545 -5183 -242 -19683 -42496 -4847 12030 -496 -22677 -29153 -13210 1410
6154 1410 -2701 -12014 2011 22457 4204 -17625 -924 5406 19897 23254 1682 27751 56398
6141 56398 38826 18224 25245 47398 47704 52480 31510 -403 -7227 13865 13994 16856 4513
6128 4513 -30937 -34503 -100 -15821 -31741 2727 -5251 -3919 18603 36581 37212 26656 -706
6115 -706 -13271 -19977 -27981 -42415 -39488 -11839 14753 9584 -28640 -48602 -57876 -49611 -32748
6102 -32748 -19584 -31363 -30926 -20798 -2230 -31177 -50421 -40041 -34070 -54664 -35103 -24279
6090 -24279 -30558 -10606 29232 34371 31052 50830 34708 29836 40106 40366 53525 52763 36447
6077 36447 18528 9639 -15050 7756 23962 29969 22257 27204 38058 30228 -19463 -22601 -1785
6064 -1785 -606 9823 -8296 -5309 15350 24704 31746 26708 6579 -1559 -2391 -10845 -15180 -195
6050 -195 14157 8083 -429 16418 28943 42270 36609 24851 -2264 -10019 6696 -1304 -17059
6037 -17059 -17928 2899 2788 -24936 -35511 -30780 9639 38535 54678 20625 10713 29417 23232
6024 23232 8502 -16682 -9359 -19514 -21769 -32877 -45020 -35803 -12335 15647 13764 1208 13771
6011 13771 11559 6573 -11806 -25985 -11101 5106 4978 13974 9324 -23423 -12626 -12959 25666
5998 25666 32529 26516 61945 52074 38092 25495 14876 -8656 -9430 -12095 -13032 -11647 -13405 7733
5984 7733 -8754 -32542 -51845 -37534 -37445 -20642 -592 -1301 7354 18401 10330 20359 22848 19062
5970 19062 -3742 -7889 7129 9631 19984 11374 8112 10979 6559 -20671 -45230 -60550 -45938
5957 -45938 -14002 3297 -10556 -24480 -22321 -17828 8821 9586 11474 6018 -17767 -19393 -9582
5944 -9582 -3185 -30443 -41831 -18808 193 30060 19371 -13878 -40731 -43531 -10998 -13362 10031
5931 10031 -6174 -29043 -20812 -31532 -44459 -36992 -22643 -13143 -43536 -39327 -57861 -53987 -51291
5918 -51291 -34198 -23169 -19021 -25637 -26252 5292 17057 -13658 -20662 -6153 -18787 -21696 -7415
5905 -7415 -5291 2220 -25971 -27964 648 21068 25645 33607 40739 15347 2330 9104 2075 -23912
5891 -23912 -11988 -13682 -21477 -17915 -20405 -10018 -1688 -9279 19763 37140 24970 32572 35435
5878 35435 46493 29779 -8055 -21061 -35073 -45789 -39700 -45908 -31424 -14120 -6986 -5089 -3829
5865 -3829 3346 6414 23733 42475 42020 23522 15390 8888 -7572 -12379 123 4627 -16647 -29945
5851 -29945 -3568 -1522 -16712 -15130 -14275 -18951 19305 42582 41698 27433 28886 20052 1563 -8452
5837 -8452 9937 31639 32303 15540 -13158 -18617 -8354 8760 219 -27686 -50255 -76241 -72971
5824 -72971 -54683 -33598 -31144 -50845 -36546 -17728 -3395 -23567 -23575 -24793 -34009 -24642 -21948 -11056
5810 -11056 6531 4063 2155 -7778 10778 1223 11175 31289 5357 -14381 -46559 -63850 -54088
5797 -54088 -31431 -28494 -32839 -18533 4717 13734 21474 19416 5682 6205 -1529 460 -10817 8394
5783 8394 14197 -4083 -7147 1822 15036 16279 4399 16292 -6239 3857 29666 38226 55933
5770 55933 56743 53330 29991 7996 6832 14685 11388 -4995 9566 -3253 4310 18424 -9422
5757 -9422 -17760 -17971 -16633 -35086 -15999 7839 8878 18937 -11992 -42644 -38969 -56146 -44439
5744 -44439 -37645 -13101 25787 23792 20479 8278 8959 7722 16738 3715 6500 17662 3764
5731 3764 25698 33803 -1260 -1597 24610 21963 14527 30317 12500 -12041 -6526 -10747 -15997 7057
5717 7057 24120 9998 -5386 11465 20493 26883 18774 -347 -683 -3582 -30243 -28422 -31891 -20829
5703 -20829 -20140 -21127 12592 15329 4371 8637 17398 50567 16067 -8014 -20517 -27611 -31353 -16519
5689 -16519 10322 14062 9928 27840 24095 29650 33946 38911 42092 19714 -11704 -24759 -27468
5676 -27468 -14717 508 -10376 -4494 31262 23495 23412 17543 -3177 -38717 -48606 -21325 -4251
5663 -4251 -7297 -11840 2015 -2487 -14651 -10070 -16959 -29055 -38431 -5686 11584 -19439 -40451
5650 -40451 -54454 -44501 -53341 -52601 -50738 -55960 -35326 -19982 -18764 -28740 -41197 -32765 -54943 -49979
5636 -49979 -17897 -3226 -14557 13774 13903 -9298 -19151 -18567 -24457 -7338 25458 22105 1457
5623 1457 -13867 -1927 -10120 9142 3977 15157 -10045 -28735 343 21096 20058 -18210 -40126
5610 -40126 -14375 -2182 80 383 -11834 -20332 -16033 -24204 -24273 -18301 -5036 21283 9545 -8816
5596 -8816 -7095 -8069 -1158 -23168 -45161 -44713 -28656 -14805 -19460 -11584 -14942 388 3632 -18304
5582 -18304 -34083 -11285 -17753 -8850 -3320 -6752 13412 27138 33802 51310 39050 28498 -4493
5569 -4493 -15225 -3980 -9651 -20124 -24256 -28249 -20306 -39227 -41669 -25293 14160 19861 13054
5556 13054 27950 15455 31652 23249 21584 25660 40478 27448 3090 -19934 -4422 -3024 -38236
5543 -38236 -41294 -18085 -3749 -10008 -31092 -35654 -63711 -66413 -26116 -696 -10507 -5142 18719
5530 18719 231 -14998 24105 5735 -19812 -36984 -60637 -80612 -79471 -69194 -52886 -50268
5518 -50268 -27521 -12221 18656 21238 4511 -7610 26054 21287 19008 -4390 -28735 -20069 -13926
5505 -13926 -8091 11509 14262 2281 -11629 -30496 -25089 -15551 -7859 -3755 -13414 -41845 -59612
5492 -59612 -29891 8443 27610 26239 6369 18974 12087 2315 9140 -5359 5798 -1695 -17264
5479 -17264 -10306 -496 -24997 -42814 -51121 -46314 -19182 -2774 -10923 -14373 -5582 -9408 15409
5466 15409 -7534 -22042 -19680 -18168 -24931 -43276 -31602 -12583 -24304 -17228 -22982 -31385 -33157
5453 -33157 -30594 -19367 -2297 28266 33296 20744 -2485 -26542 -8654 7416 11895 14766 31962
5440 31962 34513 32874 501 -2209 7947 -6630 -44878 -41096 -27819 -17020 -23503 -28097 -20804
5427 -20804 -13679 -7129 -19754 -17685 15470 28450 20218 -15992 -10737 6935 37343 16394 6403
5414 6403 8901 484 16593 28385 6422 -23469 -50514 -53978 -37162 -23651 -887 24476 7181
5401 7181 4119 10542 10485 17619 47748 46212 19911 586 -12062 -1652 -6794 4731 14006 -2336
5387 -2336 11912 11147 4711 -771 -11449 10339 15901 -1275 -19874 -32509 -39310 -34603 -15111
5374 -15111 -6977 -30455 -45576 -39101 -30298 -43127 -31466 -18691 -22304 -17937 -30204 -10227 6458
5361 6458 3691 -13936 -24186 -10825 -23235 -22973 -9530 -11246 -25706 -24412 -27178 4203 28461
5348 28461 10462 -10814 5292 -2106 -12117 -11386 -17937 -5452 16029 1061 -29238 -25072 -29838
5335 -29838 -24624 -22181 1282 2910 6197 -11286 -31712 -25645 -23523 -7891 7262 871 16038
5322 16038 -19800 -37998 -45030 -13733 16455 30217 17161 -14788 -21177 11866 17254 20782 6839
5309 6839 9507 18559 8408 -18055 -28018 131 8189 19019 12141 2455 3049 13519 2124 -26178
5295 -26178 -24072 -6907 -3722 6363 1872 22393 28756 63475 61624 14159 -21186 -234 -1675
5282 -1675 -5029 -10733 -1481 2549 13942 17995 30306 47020 27695 -5037 -28517 -24300 -16528
5269 -16528 -3799 2430 -8133 -20628 4925 14777 26278 26461 34394 38599 60420 47292 15264
5256 15264 7102 377 9311 -5627 -26687 -7148 18372 44398 4544 3622 443 13132 61460
5243 61460 54340 37140 22659 -14004 -24151 -10544 23747 20070 4423 6799 964 -14581 -40753
5230 -40753 -57642 -71293 -78503 -63173 -38558 -33384 -86692 -88728 -62254 -49199 -27543 -911
5218 -911 -5574 -5096 5283 -921 -12301 1533 15212 -11775 -7097 4299 -19529 -11154 629
5205 629 -21221 -38010 -20532 -14234 -11539 -28308 -9032 1952 11595 9091 -8477 -180 -1918
5192 -1918 -11653 -3800 -5468 -14896 -27598 -19808 3952 -6868 -12498 -12868 -16111 -7346 -2565 -16538
5178 -16538 -25055 -3774 -10056 6371 11260 5822 -7149 -17065 -26613 -21672 -31072 -20101 -4626
5165 -4626 -20506 -23031 -41182 -43515 -16683 6722 9348 -2216 -16210 -12996 16345 23306 1159
5152 1159 -8996 -3755 7508 -572 7782 22268 -14051 -26087 -14863 -5920 2613 11092 44372
5139 44372 41927 9658 -16992 -39104 -25361 -5365 -805 -19738 -2252 4516 -5937 10726
5127 10726 26388 28805 23138 17680 -11742 -13186 -30269 -36021 -53184 -63071 -35226 -23611 13462
5114 13462 23636 31177 -5928 -34297 -31921 -51016 -44631 -3157 30653 4848 -18375 -24153 -8096
5101 -8096 9925 9888 4265 -1285 15181 13088 13719 9051 -8877 -28526 -62530 -58148 -32844 -20082
5087 -20082 -4979 -8401 -16736 -26706 -23099 -2955 -3705 -30318 -22074 -22830 -30391 -29951 -30282 -26594 -10682
5072 -10682 -23476 -29762 7048 -2428 -16412 -800 14138 17976 10310 2164 6531 12867 31566
5059 31566 53703 54705 30189 25912 25966 7247 31989 55923 58987 65831 71176 63051 65962 57591
5045 57591 26563 12931 6287 2844 13763 21601 251 -1435 3831 -11804 -13976 -16549 -11837
5032 -11837 -23099 -5621 5054 9106 17538 41655 42064 33203 27004 37713 31982 -4616 -34842
5019 -34842 -41964 -27054 -7825 -24543 -22564 -778 -3403 12566 8074 -10714 -1908 11808 7329
5006 7329 -1774 -2366 22113 39261 44715 24639 3823 10836 31728 30339 30453 30942 43279 52909
4992 52909 69624 51891 21156 9235 4478 6239 23384 -3896 -8455 4085 14016 7352 -9778
4979 -9778 4996 4034 1237 15228 -9908 -17417 -11375 -10685 -13004 -4838 10544 20608 24003 30911
4965 30911 44233 27152 15395 2609 2169 -5347 1329 5200 19810 24670 22953 27995 36055 56913
4951 56913 64476 21868 -89 9644 26155 45386 25723 -1577 1738 7683 17726 -875 -16530
4938 -16530 -2467 -4799 -19185 -15794 -6879 -19150 -8259 12783 -13754 -15542 -8572 -29367 -6835
4925 -6835 -6826 -11900 784 19881 19326 -5674 -32940 -48750 -43788 -17990 -26872 -64268 -58565 -17864
4911 -17864 20541 9886 -6290 18189 39248 17614 609 14169 22989 15880 2259 14659
4899 14659 19280 3450 -22321 -11799 3267 -11088 2050 8782 531 -26524 -11661 -27
4887 -27 -3083 -3085 -7802 -19020 -13069 409 8720 -22348 -42969 -20115 -14282 -37144 -64129 -48378
4873 -48378 -15687 -8475 -35643 -28221 -14122 -3864 915 -7557 9994 24628 15100 476 -5013
4860 -5013 -6550 -3294 -22454 -26365 -14492 -33012 -54571 -26124 -17037 -28659 -46644 -56102 -31302
4847 -31302 -12859 -17146 -25579 -22540 -27326 -25778 2407 10251 -1734 5441 23119 12180 -20934
4834 -20934 -37685 -25567 -36478 -63301 -78253 -79237 -60813 -28283 -24111 -7294 20830 52661
4822 52661 51985 29796 8244 -7191 -27474 -42499 -43341 -38810 -25280 410 7220 -14206 -22607
4809 -22607 -18620 6518 16360 9166 -7746 3360 -24978 -45975 -34079 -31448 -14417 195 -8243
4796 -8243 -4000 -7315 -14094 -4245 -13386 -8697 -4045 16493 41370 42060 49404 44139 57848 60114
4782 60114 37702 787 3427 16673 42728 55285 43209 29467 44426 36458 19581 25761
4770 25761 36317 10183 11104 17153 33404 34754 12980 -3399 -6792 9228 31030 36149 35160
4757 35160 24750 22729 24141 18544 24434 18984 31113 45602 52780 22299 10810 6708 20382
4744 20382 30808 22691 15050 10586 4142 7640 35876 28903 18404 -4295 9118 10388 23671
4731 23671 30217 30635 10021 -10770 -16432 522 22822 22504 6311 5111 8217 2452 8972 -2284
4717 -2284 -12356 15997 38990 17640 19217 20678 33997 25366 2601 -1191 11733 1704 16894
4704 16894 6353 -9314 -22272 9744 28706 35245 9649 -5209 -11985 -7151 1037 -5967 -12288
4691 -12288 -2978 4403 -16684 -39401 -6592 17365 13746 15248 3307 4505 1453 706 13861
4678 13861 -7344 -23074 -13352 -6615 -17173 3085 8848 -25378 -31587 -18004 6021 15342 -7915
4665 -7915 -12435 -12678 18969 25301 14015 32176 30338 3941 -16913 -16163 13394 22113 3618 408
4651 408 -1894 10212 -5184 -11420 944 -3118 1738 27355 20622 21288 20622 -716 -19372 -4190
4637 -4190 28277 60551 22766 -8989 -22562 -27839 -7365 -3129 -1858 2677 7640 26595 25129
4624 25129 25450 19985 29767 -12774 -19169 -31443 -14512 759 -26295 -28221 -10273 -16000 1967
4611 1967 -7944 -17936 5436 38240 33519 10960 14631 18902 5800 -31315 -55205 -67022 -48025
4598 -48025 -44290 -16558 12743 20989 3095 -25338 -2811 -1835 -20878 -13592 16289 5643 2093
4585 2093 14887 12356 3497 -821 13221 19782 26668 25648 30389 43115 20592 14435 3045 -21219
4571 -21219 -17335 -4329 -14763 -11848 -9232 -23511 3925 33990 23394 19519 -4580 -30376 -43017
4558 -43017 -50719 -28880 -12066 16947 25059 18584 2377 11702 31344 28536 -3561 -24740 -24634
4545 -24634 -21428 -18001 -9794 -8833 -11503 19155 18767 4379 -9587 9357 5505 -18470 -33371 -28487
4531 -28487 -41367 -16917 -14302 -26418 -29873 -30224 -41668 -30475 -22872 -22399 -21025 7508 18929
4518 18929 24634 25535 12738 -17484 -42369 -54014 -41173 -947 2612 -22267 -14857 3058 1095
4505 1095 11370 23944 53674 44783 12910 -4080 -25994 -23032 -5813 -14072 -2222 -3153 11000
4492 11000 28232 24215 11816 4432 -5777 -20818 -23800 2999 4623 -13434 -190 -9102 -26277
4479 -26277 -34286 -29690 -28529 -3049 19323 -8330 4898 16169 -2573 -28209 -1338 26238
4467 26238 45339 31225 29174 18837 -24569 -48650 -30492 -9154 -7543 -10439 -24247 15127
4455 15127 53938 24552 -20048 -17728 -14673 -33375 -21682 5544 14056 8719 -5174 -10426 -43825
4442 -43825 -51103 -22091 866 4679 10857 -2434 2365 -2965 -24758 -29756 -16910 -7165 -3100
4429 -3100 19529 18367 -2740 -20338 -22579 -38568 -13227 11351 32993 45634 32481 36191 29374
4416 29374 25478 4046 -932 -2987 -2589 6295 -6127 -12261 -10882 -4360 -8264 4709 -2306 45
4402 45 -16967 -25967 -42585 -41539 -21924 -10637 9513 -89 -13908 -12920 -22862 -33874 -19146 -25570
4388 -25570 -34086 -43577 -17410 -4441 -3634 -5665 -1390 -8592 7233 11319 25398 30470 37962 36568
4374 36568 28153 37772 30492 31069 30309 16716 -24844 -33329 -18575 13 -6341 -9159 -7646 -3771
4360 -3771 7509 15730 -10485 -36832 -43082 -28464 -8901 11290 670 -24683 -12243 2925
4348 2925 -14024 -56220 -48468 -26265 -12147 9966 -11185 -24341 -3265 1250 -11384 8735
4336 8735 27380 28283 12269 11477 -7064 -14975 -18550 -23283 -5839 -5835 -28448 -11703 33487 36006
4322 36006 39983 12904 -21031 -45905 -43873 -47658 -32696 -22061 -7537 9173 31010 27090 23758
4309 23758 7335 -7405 -18200 15146 25399 31753 32761 8812 160 -22852 -39249 1417
4297 1417 36166 56414 64986 32371 4800 5637 -7643 -20142 7847 25645 14140 -21500 -10970
4284 -10970 -2079 -2780 93 6466 6510 34470 46015 36380 28989 20420 21711 4264 -2042 -16904
4270 -16904 -42171 -71766 -54129 -31529 -8558 43 -20366 -36094 -28178 -24105 -31786 -29782 -50958
4257 -50958 -64844 -43094 -15079 -2510 2714 5462 -8030 -21308 5882 7978 -7771 -3398 9048
4244 9048 9597 -3613 -16573 8760 16238 13832 17254 24842 -1059 506 17115 -23641 -29954 -19864
4230 -19864 -25672 -28506 -29424 -28687 -22493 -30918 -35882 -32060 -31216 -4748 17718 32772 19202 -14594
4216 -14594 -48725 -45043 -21500 -45069 -57186 -72943 -48182 -26864 -20338 -28362 -23228 -15759 -1527
4203 -1527 -7451 4466 14549 11142 17447 -750 -20370 12669 9316 -842 11355 -11217 -39220
4190 -39220 -26249 -28752 -24618 -18468 10048 18623 -5399 -26147 -38709 -20010 -21147 -39864 -34174
4177 -34174 -21528 -7179 8691 12884 -21300 -20091 13298 19781 -6219 -4136 -473 -18160 -25914
4164 -25914 -14862 -18405 -27538 -11162 -20387 -39361 -41693 -14495 -9367 -14703 14843 23203 30577
4151 30577 33359 41061 20261 1685 10985 -7198 1348 25435 37323 38168 29965 36661 22180
4138 22180 14063 45743 54921 68709 40071 18692 598 -25002 -16431 -10160 -12695 -13249 -10639
4125 -10639 -9304 -6101 2844 24429 35718 38452 24942 33777 59417 23863 -5945 -4972 -18905
4112 -18905 -19641 -21270 -34747 -18452 14817 -15250 -52401 -37219 -2215 7276 -19485 -24089 -4138
4099 -4138 -7744 -1019 16736 21620 42159 45841 40879 23297 7087 -1396 -7743 -18976 -17011 20854
4085 20854 44685 45161 20229 -13800 -31627 -28773 -32686 -27768 -9697 6584 10274 8075 3096
4072 3096 -7746 -25882 -26787 -26832 -26618 -28486 -18571 -12331 -14591 -3508 -19051 -15929 -4053 5265 7284
4057 7284 -10356 -5573 -20574 -16593 -19906 -30463 -18758 1527 1942 6818 -1655 -7931 -13264 -6904
4043 -6904 18662 -8106 -57401 -81468 -57340 -6240 1391 1468 -10449 -3762 -5994 -29986 -24197
4030 -24197 -16855 -20969 -17668 8064 33932 25284 9104 10282 17252 10072 1949 32956 32722 18223
4016 18223 22105 34646 66841 93167 80375 47578 20331 11424 20118 16031 15012 20603 -6666
4003 -6666 -37578 -33439 -7052 -7866 -21222 -43948 -32756 -18027 -35989 -23272 1213 27790 10695
3990 10695 19688 -14741 -26211 -7838 5985 -29779 -49642 -30970 -9486 292 6755 7434 566
3977 566 -6553 -19890 -24499 -43886 -66817 -57522 -12024 -12475 -25408 -35002 -16290 11599 16707 22711
3963 22711 1387 -14923 -26666 -26951 -19600 -3609 12520 18707 5376 24829 -4270 -35048 -26609
3950 -26609 -16903 -25801 -43830 -34099 -26977 -26831 -25261 -36981 -46683 -52602 -38305 -41501 -29664 -7866
3936 -7866 2986 -17374 -17351 -15410 -38448 -46039 -44862 -36083 -9851 17720 30487 14639 30857
3923 30857 34071 30377 11536 -20589 -26850 -23704 -18729 -3542 -2472 -26201 -25219 -18203 -6903 -8503
3909 -8503 -4124 -6274 6584 24064 6898 -19786 -5409 35441 61822 37934 25041 21655 36385
3896 36385 11272 -17561 -26191 -46711 -34878 -2322 -606 -32839 -39545 -22910 -11938 10693
3884 10693 -6429 -14357 -6106 16107 34216 38602 26546 20044 -23484 -28945 14931 9892 -22611
3871 -22611 -9839 11357 15546 -10773 -12765 -18643 -2888 9402 -7600 -38795 -25452 -7822
3859 -7822 -18400 -7185 -8476 1353 -1450 916 -27182 -40388 2342 17767 -257 -5961 -9669
3846 -9669 -1202 -13329 2378 6583 10084 13258 35155 24681 40756 30285 15743 21329 24309
3833 24309 -1349 -45458 -72626 -51871 -650 -1440 -16226 64 -7250 -5140 13782 23219 31640
3820 31640 18796 -60 13848 -1540 -12400 -22453 -11478 -750 -4836 -12302 3801 9114
3808 9114 18358 1149 -18027 -19792 5109 21220 8381 -12307 -19300 -15404 -18827 6195 17224
3795 17224 42915 40163 21353 5400 15245 21917 7722 -12435 -35159 -12066 20282 44990
3783 44990 54069 43620 7722 -25414 -2958 31733 7769 -25085 -26222 -36161 -4690 5799
3771 5799 -2295 -13382 -14001 -24382 -28260 -37626 -20450 -7526 -4666 1309 -1749 -5060 -11201 -11646
3757 -11646 -11989 -29223 -23554 -6203 -14158 -25360 -31164 -26794 -22076 -8358 -18369 -28463 -5518
3744 -5518 17383 25144 39536 38317 3098 -33081 -23419 13206 24200 -1002 7253 8554 -10545
3731 -10545 -19921 -17969 -11660 -25895 -24849 -25282 -18130 -9896 -2658 -8715 -13624 -6037 22659 43043
3717 43043 15177 13477 -99 -11248 -29557 -35665 -18623 -15906 -44835 -46724 -26948 -42405 -67191
3704 -67191 -76424 -68224 -56546 -53238 -37530 -40596 -25862 -4734 23336 24266 -2429 2319 3059 2910
3690 2910 -11538 -8897 13463 -11193 -17509 -1817 12848 25325 36622 45707 41855 19496 17052
3677 17052 28402 6278 -3130 -11743 -22616 -12130 12927 34097 49706 58304 38913 900
3665 900 -22676 -3993 -4900 -26368 -41670 -43250 -29286 -12759 -12035 -5685 11683 -18652 -44617
3652 -44617 -42431 -12965 -4903 -12860 -3496 21838 16727 -1372 -4502 -4470 -6225 -5494 5015 -15712
3638 -15712 -22529 -25722 2544 7072 21256 29386 33143 25769 -6836 -3236 -12661 -63 15029
3625 15029 -3697 2808 19563 5092 1396 -15999 -13392 -1951 22969 39105 13885 -589
3613 -589 -16845 -6296 19171 14850 -3349 -15050 -19521 -14266 804 -21867 -31134 -1225 26511
3600 26511 46427 35834 -16083 -40114 -41622 -18362 -21927 -19046 -14738 -44140 -37117 -17154 -22718
3587 -22718 -84 861 15495 8282 14998 22296 19989 -14678 -38544 -27550 -22913 -22920 -2334 1507
3573 1507 17898 35370 27514 26457 27441 21970 18377 27942 28471 34748 41414 29679 25894 32909 37803
3558 37803 1813 -75 4290 -10059 26190 33685 36127 24147 38950 62868 67706 38028 18059
3545 18059 5754 -9119 4251 27080 44003 27256 20906 15386 -22988 -23704 11260 20267 23852
3532 23852 9198 11024 8455 -12464 16538 63574 55654 28394 8160 9083 315 -22148 -40167
3519 -40167 -47004 -51689 -48612 -48895 -22978 -38906 -14260 27845 27324 33464 38516 30517 24168 -4966
3505 -4966 -16875 -9036 3647 -274 -9843 12598 23764 15573 -6287 -33771 -8166 18670 33462
3492 33462 11115 -26295 -15248 -36981 -28294 -23305 -53274 -49439 -36774 -49608 -48399 -38471 -24957
3479 -24957 -9646 -8907 13971 12419 -20436 -31079 -32821 -34008 -19371 6791 -4328 -11285 -4784
3466 -4784 4573 5062 -11311 -30022 -23137 -10195 4812 -744 2581 -15084 -26700 -23621 -8215
3453 -8215 5979 23964 27770 16664 -87 -11500 -4292 -9658 -23620 19746 34308 16610 15101
3440 15101 25089 13271 4044 -11441 -31357 -39964 -48176 -10546 12594 28026 -385 -2564 4993
3427 4993 -1144 -27372 -52978 -56232 -43861 -27450 -30478 -40032 -47255 -47785 -38358 -14673 -26431 -17817
3413 -17817 10406 24069 22778 17176 15908 13451 3012 19968 32264 16122 10850 20284 34004
3400 34004 21046 4643 5510 11095 -6203 -3451 -4156 -3284 -4684 12576 37137 58159 36058 5677
3386 5677 -628 20800 26489 12975 7782 17431 7794 12209 18082 14396 11037 1585 -19337 -3054
3372 -3054 482 39001 52698 50816 32157 8998 8771 13655 13845 20484 16197 31145 42642 45226
3358 45226 50519 -14580 -26042 -38575 -30969 -18629 27092 38943 47912 26773 38449 43829 8339
3345 8339 -21492 -26037 -23021 -15183 -15531 -21188 -33742 6232 43454 39311 22138 30812 34218 29549
3331 29549 25342 33204 23377 50427 58599 71676 72397 48684 41672 20901 8615 31157 27709
3318 27709 23195 27818 25680 -7975 -3687 -2220 -30788 -46593 -54227 -22837 -2477 5652 183
3305 183 16116 30981 38070 18270 -8446 -27122 -46196 -44698 -16051 1242 -13636 -16995 -5572
3292 -5572 -14365 -11047 -5870 -195 -8340 -2896 1780 4683 121 21107 34865 31470 23298 19127
3278 19127 10655 13454 4248 23915 20114 14903 -3902 6831 13478 29995 31977 30801 29705 31487
3264 31487 37569 26984 12562 23747 7063 13821 29986 31233 31094 19017 28535 7975 -13497
3251 -13497 -23278 -8607 6966 4456 9174 434 8316 19478 39871 35569 32301 15991 -1120
3238 -1120 -8861 6254 8907 -4932 -866 39902 21523 -402 944 13717 21228 24635 10780
3225 10780 4823 9021 17035 7 -16312 -29300 -28008 -47738 -43801 -34011 -43097 -48446 -25211
3212 -25211 -13194 -13537 1002 -5339 -16319 -26371 -30517 -19240 -15679 -6150 -20899 -29720 -16367
3199 -16367 -21332 -19922 -20769 -1972 -2524 -5079 -19297 -20467 -8735 -9669 22065 43344 24438 -2901
3185 -2901 -2324 -846 1389 5274 11703 -9787 -30890 -55675 -47600 -5130 38895 39009 29744 23195
3171 23195 34630 18471 11270 21783 20110 17838 8245 -2025 -219 -10839 -18239 -24661 -6824
3158 -6824 -1590 -3428 16604 34447 11158 -28477 -31867 -59108 -59008 -19708 3672 -10891 -25758
3145 -25758 -20383 -19144 -17583 -14762 -12061 9071 15371 1032 22410 27532 15573 8501 13835 19552
3131 19552 14116 10736 -334 9111 43272 27963 12514 -13803 -44044 -13405 24558 27755 4080
3118 4080 -12785 -4040 2286 -2365 -23982 465 26163 16869 5492 -2547 -25865 -23325 17098
3105 17098 30910 48816 36183 -9221 -20045 -14923 -18677 -7593 -5370 6919 12675 -10124 -75612
3092 -75612 -66569 -40351 -29849 -6286 -6093 -4769 5020 22154 13954 -15714 1684 9582 -10118
3079 -10118 -20492 12228 11597 -13742 -21874 -17469 9019 34300 48090 27847 -19927 -27421 7184
3066 7184 25240 28389 10049 14970 25465 10750 831 -5967 6889 49242 58879 16662 -6765
3053 -6765 -503 4293 9224 12314 21194 19721 -1716 -18023 -4697 12392 14866 3080 -5760 -9502
3039 -9502 2681 -5350 3445 5227 -9840 -21164 1471 -9796 -12514 -15617 -3252 48989 37925
3026 37925 24244 11684 -10345 -21080 -12009 -23639 -27478 -40862 -22583 1609 -18765 -14610
3014 -14610 -3138 21850 30325 8114 -9202 -27266 -28783 -32032 -15952 23393 37753 22579
3002 22579 9367 22218 26047 16081 -9196 -36205 -36400 -18726 -25728 -27255 -8579 4045 18384
2989 18384 16617 15787 20427 25030 22153 2774 -16237 -12672 -4783 -15195 7125 26373 47778
2976 47778 33879 29021 10896 1124 32160 44266 9907 8347 17169 28352 31182 40460 34788
2963 34788 17003 2708 19023 -2615 -36493 -22386 -19305 -14223 -8197 21521 15360 21726 19742
2950 19742 15578 18950 19380 16108 32459 38914 16574 -14341 -12895 -7858 -10677 -37455 -35238 10546
2936 10546 19949 -4531 3035 -2927 -21040 9799 25320 30183 46116 29712 15782 43228 26633
2923 26633 2484 -17287 -27907 -24438 -17326 -13798 -2400 -2321 14521 24575 2897 -2291 1160
2910 1160 -11152 -27015 -30285 -8433 693 8086 1337 16211 4054 -18420 -24117 -23081 -18588
2897 -18588 -20320 -20983 -30873 -49410 -37766 -33240 -26255 -31983 -15514 -1597 8910 -16470 -44762
2884 -44762 -52850 -61872 -51165 -29703 -22504 -8810 -13166 -34987 -29123 -5119 -21882 -26155 -18465
2871 -18465 -12813 19327 42280 18534 -19060 -20729 4360 17410 -12006 -20086 -11078 -31687 -57622
2858 -57622 -58306 -25868 -21246 -17348 -14150 -24693 -8538 14317 31689 14728 -11510 -8533 -28362
2845 -28362 -34539 -33779 -30881 -26878 -17205 -10244 -4079 -4781 -3447 -9564 -4888 2745 -6725 -4436 41618
2830 41618 40551 21943 15862 45607 42745 37068 10204 -7185 12472 16475 8643 -591 1549
2817 1549 -6064 -31559 -9197 976 -49165 -56511 -33638 14662 32642 35679 35155 20404 20414 42575
2803 42575 42422 42309 36730 25603 4854 2059 -2259 -12791 -11208 5161 3798 1403 17076 9185
2789 9185 -8990 -15282 11515 10293 -15781 -11297 -18264 -36388 -34566 -14219 6259 -7088 -32847
2776 -32847 -56999 -74688 -66340 -74854 -52387 -42212 -9761 26368 56948 55619 17889 -27237
2764 -27237 -37344 -32742 4148 3156 -12096 -4963 -14212 -10016 10820 14469 28074 18658 -18112
2751 -18112 -7141 3883 -6418 -2929 -5049 10347 -1083 -1995 43026 61279 51692 41808 23263
2738 23263 -7285 -11758 2529 6256 11665 2402 -21154 -22859 3418 -18980 -36398 -44666 -14935
2725 -14935 15312 -12788 -23615 -13865 -4712 11458 -14879 -20497 -33559 -28797 -24451 -7876 12603
2712 12603 -7226 -36728 -27816 -11822 -23607 -32959 -27818 2627 8250 2744 6740 -5202 69
2699 69 35910 39789 49815 58657 64482 5314 -24587 -10254 -3699 -8765 14773 14351 -8360 -12323
2685 -12323 -694 -921 3581 36008 44909 38980 25298 -25342 -29863 -12839 -7312 -13547 -25922
2672 -25922 -41088 -23615 -17301 -22157 -26160 -32994 -34833 -24046 2028 15565 3824 10491 17807
2659 17807 2037 -16868 -34902 -34114 6042 25022 -57 -8388 -7796 -8990 -29877 -26324 -22992
2646 -22992 -32645 -29724 -5733 7539 9961 -83 -526 2589 3121 -835 1105 61 -1583 9915
2632 9915 10918 14913 174 -39737 -29407 -22740 -24385 -39568 -19360 -6468 -7519 -27768 -8086
2619 -8086 -4438 -1444 -2214 -2525 -14247 -27027 -4369 31228 53871 53657 44115 58872 46038 20494
2605 20494 31364 56079 68385 39199 17293 11000 3598 -13388 -19925 -5829 -4773 -14873 -5171
2592 -5171 -6137 -24913 -37384 -54260 -51348 -39798 -44666 -29431 27 23998 31642 27102 22301
2579 22301 -453 701 27149 3816 -15896 -17530 10260 32932 10263 -5173 -480 1085 -16869
2566 -16869 -6054 3153 -79 18942 45830 53302 18128 19198 37547 38384 42724 37196 10484
2553 10484 -8585 6315 -6960 -4849 -7179 -13449 5726 18597 19593 -6307 -26716 -15530 -267
2540 -267 11832 37687 54779 61773 36217 13368 8101 4831 29388 57890 63765 46934 35462
2527 35462 21018 6789 3446 8234 17025 33225 35771 35427 33726 13853 2455 2806 -9041 -18328
2513 -18328 -2333 32050 45080 15975 -3561 12821 221 -36130 -5766 28012 19001 8530
2501 8530 -9656 -17208 -28140 -23900 -7791 -3903 13290 7979 -5591 -16718 -20571 -7438 -28815
2488 -28815 -9264 17967 18098 -2566 -8232 11199 20101 832 -18276 -20705 -11235 -6189 -7859
2475 -7859 -30567 -8938 20138 2797 -27116 -18491 -6691 -11429 -23174 -66290 -58745 -27798 -13781
2462 -13781 -12803 -4153 14602 -10915 2430 -7251 -19455 -11946 -4094 4578 2636 -7705 -14440 -18563
2448 -18563 -1965 -1705 2784 14720 32612 16379 -10274 -2966 2741 9236 -10671 -30243 -3581
2435 -3581 27769 23801 24341 -10078 10801 21293 10689 -6612 -6404 -1288 22602 26063 25462 4230
2421 4230 -25026 -10183 -11893 -9940 -16934 -16531 -36156 -11970 17295 36786 40023 19366 -6863
2408 -6863 -20672 -21112 -13730 9229 24120 15195 -1020 -18035 -18296 -14928 -9128 -10821 -18864 -16711
2394 -16711 -3418 -18456 -6206 -1900 -13716 -16017 -2886 7652 8527 -16599 -7533 11938 -5953
2381 -5953 -13403 -30138 -22884 -13898 -18149 -5083 11742 -1679 17294 45950 44752 10577 -3436
2368 -3436 15371 19180 35652 3571 2548 7620 -16195 -15049 6128 8211 5851 7834 9844 1846
2354 1846 707 6381 6007 299 16514 24510 33983 41468 50087 12875 -10842 -10526 13503 6144
2340 6144 -13772 -6535 7928 35478 60974 46072 39237 50296 32981 26056 31946 37814 20958
2327 20958 -23823 -38732 -34451 -41231 -64759 -44498 -5988 -12089 -21506 5357 25810 17846 13266
2314 13266 14302 -223 -2185 -11853 5562 11588 14106 21340 38907 54239 38845 1779 -13383
2301 -13383 6972 12600 7046 12319 -3257 -17443 -1326 3288 -7129 -2346 16497 3633 -3044
2288 -3044 1672 -8153 -11856 -10996 -24159 -25502 -46278 -30371 -8276 5129 8818 -2137 -21529
2275 -21529 -13442 4622 40050 39620 10455 -28300 -38228 -13981 -22090 -40426 -18087 -12836 -17480
2262 -17480 -44622 -60352 -34322 -11205 7471 11071 -5461 -18358 -8228 -2106 28246 28629 28964
2249 28964 47355 40616 26134 13144 4066 -9761 -29554 -30042 -412 19266 7208 23592 58300
2236 58300 52208 35855 32114 7859 -14018 -12222 15591 37764 52452 34567 21259 13563 12296
2223 12296 9069 20033 27428 15183 7101 13347 24086 -7370 -9289 -13316 -18775 -27745 -43972
2210 -43972 -42478 -39741 -36255 -6268 28663 23116 11227 32380 37348 24428 10906 9643 19066
2197 19066 12843 12253 -17529 -26551 24 -13088 -17810 14837 47709 34972 10168 17548 34469
2184 34469 39678 29756 4864 -16571 -11407 -40014 -18135 1721 -8568 8463 17380 11930 -11475
2171 -11475 -31501 -43259 -31634 -41412 -65336 -69894 -41056 -9261 -3088 -2407 -18769 -42306 -48073
2158 -48073 -30427 -6242 12408 -15544 -32187 -22776 -6979 17651 14570 -19666 -36932 -39815
2146 -39815 -25479 -25408 -32724 -16994 -4700 30102 49462 16369 16426 9471 10540 23689 24246 43874
2132 43874 66340 44170 17963 5525 5497 4174 -11318 -1560 10655 36767 47535 40251 27068
2119 27068 15952 29272 15950 9777 7510 -12492 -20948 7069 25272 7390 16580 43289 48328
2106 48328 52313 59959 43847 17918 22339 42436 23750 39826 16444 785 17327 20373 7048
2093 7048 25081 78961 103626 104531 74308 9443 -3695 -12320 -19093 -24437 -40445 -22502 4225
2080 4225 35407 56267 45108 29937 17834 -2241 -18223 -55773 -46237 -14675 -22995 -28245 -36898
2067 -36898 -33772 -33467 -27120 -23638 -21395 -5808 -4255 -13662 -12775 -6470 -1568 -28227 -43549 -23206
2053 -23206 -35408 -43836 -6919 3879 -6016 -588 -2454 8384 13695 26569 -6517 4363 10731
2040 10731 -3339 1582 4978 25950 22013 10386 16038 24823 12871 14029 -8792 -3002 -2499 754
2026 754 10858 -16139 -6787 -10581 9849 16272 -21082 -24841 -15653 -19953 -5130 -13101 -42272 -44952
2012 -44952 -49320 -61482 -52409 -25643 -3035 19455 30384 9442 -25063 -32748 -5740 -3846 15105
1999 15105 30863 26191 32012 16886 -4947 3839 2614 2844 -4246 -11944 -27549 -10905 -3637 -12337
1985 -12337 -11853 -3730 -15344 -34426 -16735 3832 27429 23608 19353 4411 -4480 478 11963
1972 11963 -11662 -15609 4353 6932 16937 44165 44111 38611 39358 40470 24227 13940 -7048 -20336
1958 -20336 -19780 1461 9527 10878 4408 366 2950 7842 8468 -18436 -35929 -35927 -25125 -6184 16916
1943 16916 25593 22746 35992 41297 36879 49462 30541 15816 20016 6820 -18328 -36145 -16356
1930 -16356 13597 20668 38156 61462 59721 30609 24823 12136 13140 13650 -14696 -26492 4650
1917 4650 12523 -553 -9647 43248 55105 5430 -4523 -12903 -19631 -1382 5634 -5527 8597
1904 8597 20043 533 -3728 2823 15398 12117 4107 -2916 5961 8500 18573 26436 12245 -14550
1890 -14550 -14821 -17070 -1616 15358 -2092 -30037 -20636 -6840 6176 12450 23289 36557 15841
1877 15841 -10148 -8655 -6609 -12664 -3160 -10499 -22781 -20095 -21106 -20124 -18826 588 12266 32158
1863 32158 30071 33351 47323 36469 29504 15625 -1783 -10548 6798 16795 -27079 85 12730
1850 12730 10678 7653 22413 -4793 -5859 10048 13585 25007 11907 -11399 -6444 6705 325
1837 325 -8899 2668 37646 50152 5206 -14916 17133 39935 64705 48785 34421 39757 19437
1824 19437 -16439 -23693 8889 10227 7590 2825 -10908 -2067 -25080 -22871 -9548 -3484 12733
1811 12733 9118 -11551 -17006 -11717 7001 11553 6614 24881 26878 -7105 -24084 -30268 -26444
1798 -26444 -8536 10246 21821 7803 1167 -38352 -60954 -48391 -49801 -44523 -52139 -60718 -59623
1785 -59623 -42415 -12992 604 5084 4449 -4258 2015 -15082 -17673 -4939 -16414 -3065 3225
1772 3225 19046 12215 -56 -875 19522 27475 32102 19253 -9597 6684 17837 23096 10799
1759 10799 -16001 -20911 -9340 1814 -7437 -18692 -29602 -34353 -45478 -23179 13537 17453 26585
1746 26585 36472 42162 50266 41976 8247 3044 -10862 18302 5714 7578 36435 50727 77070
1733 77070 66617 34383 44682 16926 -8266 203 5237 17635 11609 10685 12451 15313 8759
1720 8759 7491 9556 24501 30093 25158 32154 39388 19056 8776 -2693 -6402 -19097 -45838
1707 -45838 -10653 -311 -2045 7877 -2062 -22286 -23580 -8506 -14380 1948 24718 20201 -3164
1694 -3164 -37399 -32090 -3499 12843 -32801 -34259 10666 28025 -2098 -11112 -8081 -9119 1632
1681 1632 22900 54917 35204 12639 11883 48237 44606 18135 17178 22869 27609 48518 38788 37068
1667 37068 26714 27010 36582 25754 17926 6364 2601 6548 -12169 -24091 -8486 4837 -11138
1654 -11138 14613 27510 21685 14632 7107 -13099 -7576 -15151 -28318 -1483 18907 22258 31129
1641 31129 22940 4023 6494 11249 21544 27367 22233 23511 34184 29303 18871 10744 16309 9870
1627 9870 11414 13028 30380 42591 39823 56093 38883 1425 9961 8296 1048 6152 -26940
1614 -26940 -53593 -30935 -10297 -5538 -1041 5252 3187 -942 1834 15877 6533 -14231 -35781
1601 -35781 -63676 -50182 -28876 -25632 -4918 9618 3916 9525 3414 -13249 -40810 -45822 -29149
1588 -29149 -7517 14763 -2140 -3457 -5239 10315 -8835 -23014 -52821 -42596 -17604 -6343
1576 -6343 3848 13176 5644 36598 25234 12086 40247 58016 37193 21538 19591 -3347 -20316
1563 -20316 -28952 -34700 -39018 -33909 -17989 -11472 -31472 -45734 -44324 -25246 -7113 138 -2596
1550 -2596 16368 19804 3089 5672 23019 16675 -1774 325 106 22268 39199 31470 29457 16121
1536 16121 31549 5456 -8239 1235 14104 10513 7271 -946 -17163 -42397 -64053 -38409 -17908
1523 -17908 -29775 -36697 -56926 -71786 -44922 -6639 -12883 -19956 -4034 19761 45381 35277
1511 35277 24202 37423 51602 52545 25211 -17099 -20396 4238 -4978 -2235 5943 22797 27657
1498 27657 8432 -21361 -40951 -60261 -60462 -58536 -29696 -6008 -11622 6693 25327 42467 25090
1485 25090 -5030 -22798 -33540 -18806 1579 -2752 8487 13130 -4522 -1989 26912 22816 10247
1472 10247 18355 40733 40583 30535 31750 19095 16859 16869 17044 7001 -12225 -10101 -1074 24251
1458 24251 30603 3046 904 -4715 -7048 -19539 -55373 -39354 -5031 7611 9581 -5770 -3743
1445 -3743 5291 -364 -6855 -606 -21025 -3142 -1273 -24024 -23812 -19286 -27886 -25782 -27068 -14211
1431 -14211 -10780 13770 46352 14716 -8787 -25033 -31914 2275 35102 21036 -600 -38150
1419 -38150 -37640 -758 4493 2792 8947 27150 35465 31654 13507 -19909 408 12319 1383
1406 1383 1569 477 14893 23609 10849 -1361 -9387 -17110 -24404 -38402 -45326 -21401 -4992 -4565
1392 -4565 -4000 -5289 -13668 -13678 -28363 -18282 -1274 -8659 6254 8351 -412 -16198 219 -4475
1378 -4475 -26294 -13194 -21760 -10489 -4125 -11476 5733 36345 42331 58042 26738 23717 12373
1365 12373 -6582 2760 17000 17608 12178 17147 15634 -4412 2127 25898 41854 15321 13427
1352 13427 32138 48917 43379 32508 11717 -3941 2252 6492 -5485 -19476 5468 13608 -2792
1339 -2792 2201 4563 3695 8647 -2902 16461 59467 65499 34678 29920 35886 41999 38713 35249
1325 35249 30771 10576 9067 1535 -11720 -18794 -6765 -14349 15984 35765 34956 33460 8771
1312 8771 -12509 -7216 -30 -10874 -12323 -13284 -13113 -41849 -34540 -11241 -11062 -19254 -20926 -51587
1298 -51587 -40735 -17305 -16502 -20828 -12791 14214 31986 12031 2838 -5814 1264 23999 38746
1285 38746 14159 5960 -845 -5089 -10172 -20508 -36396 -34098 -21952 -36799 -53531 -38189 -6375
1272 -6375 5016 26940 50538 64800 36469 15576 26764 39993 32222 34480 27471 28079 48544
1259 48544 57473 55859 40764 40670 37174 23921 23110 30404 36961 35199 13000 -18430 -12299 -15149
1245 -15149 -39213 -38494 -13498 -23668 -39833 -20194 2204 2396 -3769 -25476 -11791 -11915 -4416
1232 -4416 18299 33680 39759 45063 19192 -16510 -5023 7003 8824 -762 6417 18896 31397
$$ [...]
##END NTUPLES=NMR SPECTRUM
##END=
