##TITLE=Analysis number 327625
Compound Code sew 05200
Project Code adrs
Chemist Name stores
##JCAMPDX= 6.0         $$ Bruker NMR JCAMP-DX V2.0
##DATA TYPE= NMR SPECTRUM
##DATA CLASS= NTUPLES
##ORIGIN= Bruker BioSpin GmbH
##OWNER= nmr
$$ XWIN-NMR		Version 3.5
$$ Wed Mar 28 13:18:43 2007 GMT Daylight Time (UT+1h)  MAYBRIDGE\nmr@NMR_250MHZ
##.OBSERVE FREQUENCY= 250.131544655141
##.OBSERVE NUCLEUS= ^1H
##.ACQUISITION MODE= SIMULTANEOUS (DQD)
##.ACQUISITION SCHEME= undefined
##.AVERAGES= 16
##.DIGITISER RES= 18
##SPECTROMETER/DATA SYSTEM= dpx250
##.PULSE SEQUENCE= zg30
##.SOLVENT NAME= DMSO
##.SHIFT REFERENCE= (INTERNAL, DMSO, 0, 16.522)
##AUDIT TRAIL= $$ (NUMBER, WHEN, WHO, WHERE, WHAT)
$$ ##TITLE= Audit trail, XWIN-NMR		Version 3.5
$$ ##JCAMPDX= 5.01
$$ ##ORIGIN= Bruker BioSpin GmbH
$$ ##OWNER= nmr
$$ C:\u/data/dgb/nmr/ADRS/2450/pdata/1/auditp.txt
$$ ##AUDIT TRAIL=  $$ (NUMBER, WHEN, WHO, WHERE, WHAT)
(   1,<2007-03-28 13:18:17.69 +100>,<MAYBRIDGE\nmr>,<NMR_250MHZ>,
      <created by zg, POWCHK disabled, PULCHK disabled
       configuration hash MD5:
       49 4B E0 1D 92 C2 6B 37 9F E6 65 BC 52 41 86 1D
       data hash MD5: 64K
       06 1B B7 93 BA 55 24 8C AD 62 20 BE AF E0 A9 00>)
(   2,<2007-03-28 13:18:33.33 +100>,<MAYBRIDGE\nmr>,<NMR_250MHZ>,
      <Start of raw data processing
       ef LB = 0.3 FT_mod = 6 PKNL = 1 SI = 32K 
       data hash MD5: 32K
       E8 D6 E2 21 4E 5B 15 22 A6 C0 FA AE 0B 49 96 69>)
(   3,<2007-03-28 13:18:34.88 +100>,<MAYBRIDGE\nmr>,<NMR_250MHZ>,
      <apk 
       data hash MD5: 32K
       72 31 7E 65 3B 8B 4B 3D A2 59 53 E6 21 40 C8 F5>)
(   4,<2007-03-28 13:18:35.63 +100>,<MAYBRIDGE\nmr>,<NMR_250MHZ>,
      <abs ABSG = 5 
       data hash MD5: 32K
       0D 8C D1 65 BF A5 32 07 3D 57 36 27 1D E9 C6 C3>)
$$ ##END=
$$ 
$$ hash MD5
$$ 58 30 1D 2C 8F 29 29 F0 98 5E AF CC D4 20 76 73
##$RELAX= 
##$RELAX= 
##$RELAX= 
##$RELAX= 
##$RELAX= 
##$RELAX= 
##$RELAX= 
$$ Bruker specific parameters
$$ --------------------------
##$DU= <C:\u>
##$EXPNO= 2450
##$NAME= <ADRS>
##$PROCNO= 1
##$TYPE= <nmr>
##$USER= <dgb>
##$AMP= (0..31)
100 100 100 100 100 100 100 100 100 100 100 100 100 100 100 100 100 100 
100 100 100 100 100 100 100 100 100 100 100 100 100 100 
##$AQSEQ= 0
##$AQ_mod= 3
##$AUNM= <au_zg>
##$AUTOPOS= <28 >
##$BF1= 250.13
##$BF2= 250.13
##$BF3= 250.13
##$BF4= 250.13
##$BF5= 500.13
##$BF6= 500.13
##$BF7= 500.13
##$BF8= 500.13
##$BYTORDA= 1
##$CFDGTYP= 0
##$CFRGTYP= 5
##$CHEMSTR= <none>
##$CNST= (0..31)
1 1 145 1 1 1 1 1 1 1 1 1 1 1 1 1 1 1 1 1 1 1 1 1 1 1 1 1 1 1 1 1 
##$CPDPRG= <>
##$CPDPRG1= <>
##$CPDPRG2= <>
##$CPDPRG3= <>
##$CPDPRG4= <mlev>
##$CPDPRG5= <mlev>
##$CPDPRG6= <mlev>
##$CPDPRG7= <mlev>
##$CPDPRG8= <mlev>
##$CPDPRGB= <>
##$CPDPRGT= <>
##$D= (0..31)
0 1 0 0 0 0 0 0 0 0.06 0 0 0 0 0 0 0.0002 0 0 0 0 0 0 0 0 0 0 0 0 0 0 
0 
##$DATE= 1175084296
##$DBL= (0..7)
120 120 120 120 120 120 120 120 
##$DBP= (0..7)
150 150 150 150 150 150 150 150 
##$DBP07= 0
##$DBPNAM0= <>
##$DBPNAM1= <>
##$DBPNAM2= <>
$$ [...]
##$SUBNAM7= <"">
##$SUBNAM8= <"">
##$SUBNAM9= <"">
##$SW= 20.6930455092707
##$SWIBOX= (0..15)
0 0 3 0 0 0 0 0 0 0 0 0 0 0 0 0 
##$SW_h= 5175.983436853
##$TD= 65536
##$TD0= 1
##$TE= 683.16
##$TE2= 300
##$TE3= 300
##$TEG= 300
##$TL= (0..7)
0 120 120 120 120 120 120 120 
##$TP= (0..7)
150 150 150 150 150 150 150 150 
##$TP07= 0
##$TPNAME0= <>
##$TPNAME1= <>
##$TPNAME2= <>
##$TPNAME3= <>
##$TPNAME4= <>
##$TPNAME5= <>
##$TPNAME6= <>
##$TPNAME7= <>
##$TPOAL= (0..7)
0.5 0.5 0.5 0.5 0.5 0.5 0.5 0.5 
##$TPOFFS= (0..7)
0 0 0 0 0 0 0 0 
##$TUNHIN= 0
##$TUNHOUT= 0
##$TUNXOUT= 0
##$USERA1= <user>
##$USERA2= <user>
##$USERA3= <user>
##$USERA4= <user>
##$USERA5= <user>
##$V9= 5
##$VALIST= <valist>
##$VCLIST= <CCCCCCCCCCCCCCC>
##$VD= 0
##$VDLIST= <DDDDDDDDDDDDDDD>
##$VPLIST= <PPPPPPPPPPPPPPP>
##$VTLIST= <TTTTTTTTTTTTTTT>
##$WBST= 1024
##$WBSW= 4
##$XGAIN= (0..3)
0 0 0 0 
##$XL= 0
##$YL= 0
##$YMAX_a= 326439
##$YMIN_a= -373396
##$ZGOPTNS= <>
##$ZL1= 120
##$ZL2= 120
##$ZL3= 120
##$ZL4= 120
##$ABSF1= 16.522
##$ABSF2= -4.171173
##$ABSG= 5
##$ABSL= 3
##$ALPHA= 0
##$AQORDER= 0
##$ASSFAC= 0
##$ASSFACI= 0
##$ASSFACX= 0
##$ASSWID= 0
##$AUNMP= <proc_1d>
##$AZFE= 0.1
##$AZFW= 0.1
##$BCFW= 0
##$BC_mod= 0
##$BYTORDP= 0
##$COROFFS= 0
##$CY= 12.5
##$DATMOD= 1
##$DC= 0
##$DFILT= <>
##$DTYPP= 0
##$F1P= 14.0000005364418
##$F2P= -0.99999901652339
##$FCOR= 0.5
##$FTSIZE= 32768
##$FT_mod= 6
##$GAMMA= 0
##$GB= 0
##$INTBC= 1
##$INTSCL= 1
##$ISEN= 128
##$LB= 0.3
##$LEV0= 0
##$LPBIN= 0
##$MAXI= 10000
##$MC2= 0
##$MEAN= 0
##$ME_mod= 0
##$MI= 0
##$NCOEF= 0
##$NC_proc= -5
##$NLEV= 6
##$NOISF1= 0
##$NOISF2= 0
##$NSP= 0
##$NTH_PI= 0
##$NZP= 0
##$OFFSET= 16.522
##$PC= 1
##$PHC0= 215.5781
##$PHC1= 13.61348
##$PH_mod= 1
##$PKNL= yes
##$PPARMOD= 0
##$PSCAL= 4
##$PSIGN= 0
##$REVERSE= no
##$SF= 250.13
##$SI= 32768
##$SIGF1= 0
##$SIGF2= 0
##$SINO= 400
##$SIOLD= 32768
##$SREGLST= <1H.DMSO>
##$SSB= 0
##$STSI= 32768
##$STSR= 0
##$SW_p= 5175.98343685301
##$SYMM= 0
##$S_DEV= 0
##$TDeff= 65536
##$TDoff= 0
##$TI= <Analysis number 999999
Compound Code 99
Book Reference 9
Project Code 9>
##$TILT= no
##$TM1= 0
##$TM2= 0
##$TOPLEV= 0
##$USERP1= <user>
##$USERP2= <user>
##$USERP3= <user>
##$USERP4= <user>
##$USERP5= <user>
##$WDW= 1
##$XDIM= 32768
##$YMAX_p= 320395849
##$YMIN_p= -645370
$$ End of Bruker specific parameters
$$ ---------------------------------
##NTUPLES= NMR SPECTRUM
##VAR_NAME=  FREQUENCY,     SPECTRUM/REAL,   SPECTRUM/IMAG
##SYMBOL=    X,             R,               I
##VAR_TYPE=  INDEPENDENT,   DEPENDENT,       DEPENDENT
##VAR_FORM=  AFFN,          ASDF,            ASDF
##VAR_DIM=   32768,         32768,           32768
##UNITS=     HZ,            ARBITRARY UNITS, ARBITRARY UNITS
##FACTOR=    0.157963299565203, 1,           1
##FIRST=     4132.6476996994, 0,             0
##LAST=      -1043.33573715361, 0,           0
##MIN=       -1043.33573715361, -645370,     0
##MAX=       4132.6476996994, 320395849,     0
$$ Real data points
##PAGE= N=1
##DATA TABLE= (X++(R..R)), XYDATA
$$ [...]
$$ plain form
24631 176349 -1627 -107431 -151622 -36342 53070 -39514 -85912 -36315 -15564 80453 153799
24620 153799 280499 225466 53547 24941 45710 -30424 3930 -66712 -192023 -179541 -111774
24609 -111774 -19548 -34098 40941 -7026 -8772 -33143 -62186 2704 85105 93553 59885 89806
24597 89806 156855 38284 -144405 -85103 -27896 71561 105206 79984 45261 44879 50054 -61341
24585 -61341 -34507 -60477 -128430 -22995 -36313 -172996 -239700 -73097 -32058 -166736 -86481
24574 -86481 -134189 -159076 -140517 -19954 60619 -55740 -102724 -108638 -203024 -164069 -44223
24563 -44223 23121 -45496 -96688 -46287 -72060 -97409 -45176 -36867 -82118 -68362 -92123 -180747
24551 -180747 -142780 -111013 -202442 -172304 -21999 72320 127089 112199 24633 23112 -78388
$$ packed form
24631A76349j77976j05804m4191J15280Q9412r2584m6398M9597K0751R6017P3346
24620A53799J26700n5033j71919k8606K0769p6134L4354p0642j25311J2482O7767
24609a11774R2226j4550P5039m7967j746k4371k9043O4890Q2401Q448l3668K9921
24597H9806O7049j18571j82689N9302N7207R9457L3645k5222l4723l82N175j11395
24585f1341K6834k5970o7953J05435j3318j36683o6704J66603M1039j34678Q0255
24574h6481m7708k4887J8559J20563Q0573j16359m6984n914r4386L8955J19846
24563d4223O7344o8617n1192N0401k5773k5349N2233Q309m5251J3756k3761q8624
24551a80747L7967L1767r1429L0138J50305R4319N4769j4890q7566j521j01500
$$ plain form
24540 -78388 -7194 91039 15416 -73359 -86158 -126306 -181444 -124989 1268 125444 118498
24529 118498 140053 18965 -30386 44520 68575 57745 65036 61809 62372 88608 50526 -24313
24517 -24313 -66666 -101812 -271926 -263590 -125166 -97369 -6317 -52095 -177551 -189776 -141454
24506 -141454 -82960 22414 111809 130115 127874 38625 -37877 -188800 -323045 -364677 -346567
24495 -346567 -295433 -152436 7296 105102 86406 167244 78582 -3819 -134188 -194939 -134073
24484 -134073 -101306 -88509 -175799 -21087 20977 47994 118119 63778 -77461 -103681 -85559
24473 -85559 -70579 23058 -19835 -81447 -121359 -210623 -215384 -262850 -236857 -298671 -213058 -142832
24461 -142832 -62682 -3715 -8857 -52160 56790 -68328 -204016 -230682 -211463 -75172 -73230
$$ packed form
24540g8388P1194R8233p5623q8775j2799m0148n5138N6455J26257J24176o946
24529A18498K1555j21088m9351P4906K4055j0830P291l227N63K6236l8082p4839
24517b4313m2353l5146j70114Q336J38424K7797R1052m5778j25456j2225M8322
24506a41454N8494J05374Q9395J8306k241q9249p6502j50923j34245m1632J8110
24495c46567N1134J42997J59732R7806j8696Q0838q8662q2401j30369o0751O0866
24484a34073L2767J2797q7290J54712M2064K7017P0125n4341j41239k6220J8122
24473h5559J4980R3637m2893o1612l9912q9264m761m7466K5993o1814Q5613P0226
24461a42832Q0150N8967n142m3303J08950j25118j35688k6666J9219J36291J942
$$ plain form
24450 -73230 -14251 -48582 -52193 49478 75914 -9231 -116320 -68852 -51250 -83274 -165327
24439 -165327 -38804 106936 84232 92930 -14663 -110175 -63504 49573 27751 68784 64459
24428 64459 85350 51399 29705 -136794 -193303 -153952 -130068 -114509 -44582 162264 154290
24417 154290 95539 9151 71372 90322 120054 124083 -57126 25284 210438 207538 15142
24406 15142 -58891 -202857 -141237 -6441 -77465 -89314 60633 127652 128996 82096 17692
24395 17692 -24602 10691 -21531 -40922 -9764 -62641 -129953 -198721 -232915 -190747 -145344 18370
24383 18370 58938 169206 12797 -28460 69696 22325 43606 30883 -50985 -141687 -104098
24372 -104098 -68936 -52004 -107863 78173 149215 83770 76936 78362 51240 14616 43509 -7763
$$ packed form
24450g3230N8979l4331l611J01671K6436q5145j07089M7468J7602l2024q2053
24439a65327J26523J45740k2704Q698j07593r5512M6671J13077k1822M1033m325
24428F4459K0891l3951k1694j66499n6509L9351K3884J5559O9927K06846p974
24417A54290n8751q6388O2221J8950K9732M029j81209Q2410J85154k900j92396
24406A5142p4033j43966O1620J34796p1024j1849J49947O7019J344m6900o4404
24395A7692m2294L5293l2222j9391L1158n2877o7312o8768l4194M2168M5403J63714
24383A8370M0568J10268j56409m1257R8156m7371K1281j2723q1868r0702L7589
24372a04098L5162J6932n5859J86036P1042o5445o834J426k7122l6624K8893n1272
$$ plain form
24360 -7763 -37241 -47260 -158813 -150929 -86869 -63327 -105757 -61874 77400 90781 12663 38907
24348 38907 77170 -34647 -124543 -53145 -135436 -44109 35397 31493 -10109 131849 145037
24337 145037 60932 -24486 -107044 -202072 -324058 -399234 -282739 -183030 -204705 -104517 -35473
24326 -35473 46591 70581 176891 260456 281474 217028 106143 116451 177366 179025 99953
24315 99953 -103539 550 182727 103029 -13780 -147610 -344673 -270469 -122045 -74541
24305 -74541 -7267 -33007 -204325 -364414 -312918 -342967 -293212 -349985 -268642 -248615 -300027
24294 -300027 -235655 -225256 -192146 -152665 -26087 16176 -138969 -190511 -67940 -35051 -41239
24283 -41239 29363 68841 2302 11516 107677 97412 19478 34032 38939 141179 204232 176495
$$ packed form
24360g763k9478j0019j11553P884O4060K3542m2430M3883J39274J3381p8118K6244
24348C8907L8263j11817q9896P1398q2291R1327P9506l904m1602J41958J3188
24337A45037q4105q5418q2558r5028j21986p5176J16495R9709k1675J00188O9044
24326c5473Q2064K3990J06310Q3565K1018o4446j10885J0308O0915J659p9072
24315I9953k03492J04089J82177p9698j16809j33830j97063P4204J48424M7504
24305g4541O7274k5740j71318j60089N1496l0049M9755n6773Q1343K0027n1412
24294c00027O4372J0399L3110L9481J26578M2263j55145n1542J22571L2889o188
24283d1239P0602L9478o6539R214R6161j0265p7934J4554M907J02240O3053k7737
$$ plain form
24271 176495 99823 39408 9194 -26320 24510 145305 193742 235435 105938 18703 40069
24260 40069 -105065 -229866 -179978 -92194 -7469 28342 85477 90653 82372 -62059 -103012
24249 -103012 -65104 -192983 -164626 -19839 34112 8043 -49706 -121968 -78253 -80705 -60689
24238 -60689 -205489 -280143 -254920 -112169 22441 208704 202206 93045 -7711 38197 -39024
24227 -39024 77110 161572 34807 -34782 -27154 -66965 31374 107270 30259 -113734 -85238
24216 -85238 -75565 -137090 -184215 -119293 -103917 -144411 -152553 -197118 -199505 -196648 -103162 -92907
24204 -92907 -238259 -241923 -161894 -10026 21820 -69134 -194589 -236422 -275358 -219524 -103452
24193 -103452 72103 45645 -13182 65513 66885 -97959 -161410 -184638 -131955 -171611 -224653
$$ packed form
24271A76495p6672o0415l0214l5514N0830J20795M8437M1693j29497q7235K1366
24260D0069j45134j24801M9888Q7784Q4725L5811N7135N176q281j44431m0953
24249a03012L7908j27879K8357J44787N3951k6069n7749p2262M3715k452K0016
24238f0689j44800p4654K5223J42751J34610J86263o498j09161j00756M5908p7221
24227c9024J16134Q4462j26765o9589P628l9811R8339P5896p7011j43993K8496
24216h5238R673o1525m7125O4922J5376m0494q142m4565k387K857R3486J0255
24204i2907j45352l664Q0029J51868L1846r0954j25455m1833l8936N5834J16072
24193a03452J75555k6458n8827P8695J372j64844o3451k3228N2683l9656n3042
$$ plain form
24182 -224653 -78000 -171375 -251085 -231171 -134862 -213431 -234881 -130640 -119737 -95262 -13513
24171 -13513 113529 74143 193532 238890 104970 -41956 -54057 27432 142064 145357 117630
24160 117630 46991 4707 7115 -19813 -71699 34467 62697 48543 12975 73154 51087
24149 51087 -17911 -5439 -107584 -221316 -205346 -266992 -318647 -202226 -118890 -143135 -132648
24138 -132648 -160781 -256625 -146091 25679 109349 174280 190111 198782 116494 25150 -13222
24127 -13222 -23414 3209 -80797 -126769 -59875 -103421 -36166 -30234 -135793 -93036 -25606 -42419
24115 -42419 65153 177054 220094 171048 28344 -150359 -185393 -72862 -72799 -56803 -68685
24104 -68685 -127360 -88277 -59921 -32760 -101964 -62187 -164365 -100008 -103700 -46850 -38051 -83999
$$ packed form
24182b24653J46653r3375p9710J9914R6309p8569k1450J04241J0903K4475Q1749
24171a3513J27042l9386J19389M5358j33920j46926j2101Q1489J14632L293k7727
24160A17630p0639m2284K408k6928n1886J06166K8230j4154l5568O0179k2067
24149E1087o8998J2472j02145j13732J5970o1646n1655J16421Q3336k4245J0487
24138a32648k8133r5844J10534J71770Q3670O4931J5831Q671q2288r1344l8372
24127a3222j0192K6623q4006m5972O6894m3546O7255N932j05559M2757O7430j6813
24115d2419J07572J11901M3040m9046j42704j78703l5034J12531O3J5996j1882
24104f8685n8675L9083K8356K7161o9204L9777j02178O4357l692N6850Q799m5948
$$ plain form
24092 -83999 -184229 -175762 -186710 54954 193343 96810 -105249 -25568 -9667 -110678 -144455
24081 -144455 -103397 -119319 -192859 -247935 -118467 -93926 -94643 -101441 -16509 29539 96728 34028
24069 34028 -16848 -9340 -158666 -68411 -39800 -97146 -11004 91699 115392 -17891 -189594
24058 -189594 -184248 -66430 -129063 -216398 -189456 -212039 -328545 -325764 -138149 -36149 -29483
24047 -29483 -63534 -207634 -229303 -197906 -160821 -56758 -52245 -84075 -33444 -47906 -128389
24036 -128389 -186606 -241453 -208532 -184010 -221211 -186318 -44370 42049 44097 -3027 -159247
24025 -159247 -192780 -120884 -77788 -66469 -69469 -83870 -112116 -14460 -29818 -31956 21709 -57525
24013 -57525 -31558 -53330 -38231 64486 217623 212755 245570 126747 78267 42846 55516
$$ packed form
24092h3999j00230Q467j0948K41664J38389r6533k02059P9681J5901j01011l3777
24081a44455M1058j5922p3540n5076J29468K4541p17o798Q4932M6048O7189o2700
24069C4028n0876P508j49326R0255K8611n7346Q6142J02703K3693j33283j71703
24058a89594N346J17818o2633q7335K6942k2583j16506K781J87615J02000O666
24047b9483l4051j44100k1669L1397L7085J04063M513l1830N0631j4462q0483
24036a28389n8217n4847L2921K4522l7201L4893J41948Q6419K048m7124j56220
24025a59247l3533P1896M3096J1319l000j4401k8246R7656j5358k138N3665p9234
24013e7525K5967k1772J5099J02717J53137m868L2815j18823m8480l5421J2670
$$ plain form
24002 55516 155372 109312 109303 148527 76375 100084 -71587 -73100 -161893 -205396 -192160 -124201
23990 -124201 -99997 -109294 -117341 -87784 -136268 -321809 -348073 -130587 -16723 -6164 -15363
23979 -15363 -71143 -183275 -243258 -116858 2152 -30541 -47842 -81713 -84079 30778 -51442
23968 -51442 -139891 -65348 -74546 -66231 -22024 -144 -167241 -261297 -180099 -77665 -21899 -64162
23956 -64162 -843 67691 65038 -68764 -163985 -87774 -87434 -125720 -194597 -193112 -132701 -28816
23944 -28816 -31910 -132279 -128414 -86277 -51601 7957 -104605 -109310 -27675 -104710 -97948 -139847
23932 -139847 -167509 -202865 -205083 -19975 118195 12408 -92032 -35973 -49700 -99899 31610
23921 31610 109464 124827 -31984 10235 51432 102399 127338 66724 118829 109854 34981 21839
$$ packed form
24002E5516R9856m6060rL9224p2152K3709j71671j513q8793m3503J3236O7959
23990a24201K4204r297q047K9557m8484j85541k6264K17486J13864J0559r199
23979a5363n5780j12132n9983J26400J19010l2693j7301l3871k366J14857q2220
23968e1442q8449P4543r198Q315M4207K1880j67097r4056Q1198J02434N5766m2263
23956f4162O3319O8534k653j33802r5221P6211L40l8286o8877J485O0411J03885
23944b8816l094j00369L865M2137L4676N9558j12562m705Q1635p7035O762m1899
23932a39847k7662l5356k218J85108J38170j05787j04440N6059j3727n0199J31509
23921C1610P7854J5363j56811M2219M1197N0967K4939o0614N2105q975p4873j3142
$$ plain form
23909 21839 -63282 -77647 -4122 -32821 -15733 -47579 -116976 -71120 -58025 23178 70414 -14548
23897 -14548 -27872 -21490 -4302 -47647 -51127 -133758 -83674 -127621 -119008 14190 92 -20548
23885 -20548 45997 35272 26900 106022 45384 -25767 -79063 -126186 -197767 -248962 -221356 -73876
23873 -73876 -64148 -20040 25959 -46706 -132890 -203132 -225163 -181220 -133312 -91110 -67056 -108029
23861 -108029 -204626 -73013 33134 64590 -66349 -178800 -184035 -208343 -185457 -251981 -255480
23850 -255480 -249568 -147621 -42496 -5554 -86936 -197019 -198314 -67207 59348 102178 25681
23839 25681 5941 91850 38951 -159187 -204013 -18977 36741 -39491 -64209 61716 123335
23828 123335 164767 42241 34024 -71164 -201299 -115347 -30786 114007 226425 194581 135364
$$ packed form
23909B1839q5121j4365P3525k8699J7088l1846o9397M5856J3095Q1203M7236q4962
23897a4548j3324O382J7188m3345l480q2631N0084m3947Q613J33198j4098k0640
23885b0548O6545j0725q372P9122o0638p1151n3296m7123p1581n1195K7606J47480
23873g3876R728M4108M5999p2665q6184p0242k2031M3943M7908M2202K4054m0973
23861a08029r6597J31613J06147L1456j30939j12451n235k4308K2886o6524l499
23850b55480N912J01947J05125L6942q1382j10083j295J31107J26555M2830p6497
23839B5681j9740Q5909n2899j98138m4826J85036N5718p6232k4718J25925O1619
23828A23335M1432j22526q217j05188j30135Q5952Q4561J44793J12418l1844n9217
$$ plain form
23817 135364 8602 20097 -52567 -69394 -41906 14684 109227 93939 166107 10938 -88739
23806 -88739 -216183 -149610 -11734 142234 96301 74993 -73920 -69341 110659 154480 151712
23795 151712 274168 144143 147700 70743 23417 34199 28823 21289 -34548 -182627 -139863
23784 -139863 -151742 -181520 -216512 -214799 -218598 -250591 -180836 -71027 -27428 54273 123363 110632
23772 110632 -87585 -147872 -197789 -85411 15191 20467 -49527 -74041 -181712 -235883 -203449
23761 -203449 -207378 -192606 -169002 -38777 -5217 -4848 -83253 -24478 -104560 -238448 -85098
23750 -85098 -36126 -169625 -136325 -129460 -123604 -90325 -72186 -160641 -217290 -149169 -5451 44320
23738 44320 -11997 -5434 65728 26621 -48626 -99548 -133465 -34671 -101986 -201839 -102312 -100327
$$ packed form
23817A35364j26762J1495p2664j6827K7488N6590R4543j5288P2168j55169r9677
23806h8739j27444O6573J37876J53968m5933k1308j48913M579J80000M3821k768
23795A51712J22456j30025L557p6957m7326J0782n376p534n5837j48079M2764
23784a39863j1879k9778l4992J713l799l1993O9755J09809M3599Q1701O9090j2731
23772A10632j98217o0287m9917J12378J00602N276o9994k4514j07671n4171L2434
23761b03449l929J4772K3604J30225L3560L69p8405N8775q0082j33888J53350
23750h5098M8972j33499L3300O865N856L3279J8139q8455n6649O8121J43718M9771
23738D4320n6317O563P1162l9107p5247n0922l3917R8794o7315r9853R9527J985
$$ plain form
23726 -100327 -72587 -12153 -9615 -64784 -42434 -77715 -70421 -8817 -10716 11438 76683 114266
23714 114266 -29206 3448 -9288 -63411 -119883 -138628 -187334 -224637 -165821 -193245 -72717
23703 -72717 93441 104371 28902 99767 61774 -25848 23097 43885 -95067 -83759 17110
23692 17110 87246 8287 -56411 -29062 10282 -12572 -155715 -71236 -60782 54717 129517
23681 129517 112176 -24107 -150525 -82004 -45934 -94573 -234922 -237179 -235692 -249249 -215684
23670 -215684 7247 5831 130365 244240 93206 -47152 92634 170551 -44741 -123358
23660 -123358 -122352 -205785 -136503 31266 -24092 -599 -996 -5560 -24330 22559 22647 13462 31941
23647 31941 9572 50059 108187 80110 16624 7528 -9944 -148660 -204661 -251206 -195378 -108480
$$ packed form
23726a00327K7740O0434K538n5169K2350l5281P294O1604j899K2154O5245L7583
23714A14266j43472L2654j2736n4123n6472j8745m8706l7303N8816k7424J20528
23703g2717J66158J0930p5469P0865l7993q7622M8945K0788j38952J1308J00869
23692A7110P0136p8959o4698K7349L9344k2854j43143Q4479J0454J15499P4800
23681A29517j7341j36283j26418O8521L6070m8639j40349k257J487j3557L3565
23670b15684K22931j416J24534J13875j51034j40358J39786P7917k15292p8617
23660a23358J006q3433O9282J67769n5358K3493l97m564j8770M6889Q8r185J8479
23647C1941k2369M0487N8128k8077o3486r096j7472j38716n6001m6545N5828Q6898
$$ plain form
23635 -108480 -117707 -174944 -101220 -37503 -19782 -57519 -101962 -129926 -81389 -74180 -106445 -55011
23623 -55011 -93958 -84118 -194313 -100778 -6792 -31599 37809 206951 171809 113658 130837
23612 130837 92641 23592 -1314 -8304 -60294 -168405 -186255 -235085 -234878 -111548 -111653 -152600
23600 -152600 -159219 -111222 -26450 9872 31538 24652 -111099 -156531 -64780 -62756 51543 127434
23588 127434 117163 30804 14785 -191788 -318320 -261953 -290736 -399134 -256705 -130016
23578 -130016 -239908 -248695 -217427 -189184 -202169 -253051 -171008 -132770 -77266 -98472 -82179
23567 -82179 -154923 -257181 -237997 -214155 -240948 -232618 -85353 -63404 3419 -8740 -125108
23556 -125108 -129517 -58311 -45761 42558 70392 -12118 -47630 -39760 24955 -87846 -115610 -201509
$$ packed form
23635a08480r227n7237P3724O3717J7721l7737m4443k7964M8537P209l2265N1434
23623e5011l8947R840j10195R3535R3986k4807O9408J69142l5142n8151J7179
23612A30837l8196o9049k4906o990n1990j08111j7850m8830K07J23330j05m0947
23600a52600o619M7997Q4772L6322K1666o886j35751m5432R1751K024J14299P5891
23588A27434j0271q6359j6019k06573j26532N6367k8783j08398J42429J26689
23578a30016j09892q787L1268K8243j2985n0882Q2043L8238N5504k1206J6293
23567h2179p2744j02258J9184K3842k6793Q330J47265K1949O6823j2159j16368
23556a25108m409P1206J2550Q8319K7834q2510l5512P870O4715j12801k7764q5899
$$ plain form
23544 -201509 -225953 -224416 -98312 206410 254649 253329 167895 89729 -23277 -101535 -216941
23533 -216941 -195490 22978 70265 -28884 -72754 51483 49927 -2188 -32620 -100585 -210429
23522 -210429 -289187 -289585 -283999 -188168 -45273 28170 -73986 -252146 -314810 -287871 -247882
23511 -247882 -253732 -146791 -147879 -36919 -60980 -206490 -161899 -54560 44013 -38442 -65927
23500 -65927 -54584 -746 -98897 -290550 -231976 -107619 -34403 38799 82678 124460 68936
23489 68936 -49183 -98162 -97919 -92729 -57219 29230 117425 31939 84026 131859 117930 65207
23477 65207 30077 -11908 -129617 -136724 -101152 44278 1359 4188 -14982 -22179 1020 -88865
23465 -88865 -199604 -194703 -191502 -253490 -259725 -255208 -153620 -115297 -254736 -216702 -88925 -67040
$$ packed form
23544b01509k4444J537J26104L04722M8239j320q5434p8166j13006p8258j15406
23533b16941K1451K18468M7287r9149m3870J24237j556n2115l0432o7965j09844
23522b10429p8758l98N586R5831J42895P3443j02156j78160o2664K6939L9989
23511b47882n850J06941j088J10960k4061j45510M4591J07339R8573q2455k7485
23500f5927J1343N3838r8151j91653N8574J24357P3216P3202M3879M1782n5524
23489F8936j18119m8979K43N190L5510Q6449Q8195q5486N2087M7833j3929n2723
23477F5207l5130m1985j17709p107L5572J45430m2919K829j9170p197K3199q9885
23465h8865j10739M901L201o1988o235M517J01588L8323j39439L8034J27777K1885
$$ plain form
23453 -67040 -73270 -47963 -136592 -85861 -149647 -183017 -143889 -98702 -52764 -155076 -164465 -63493
23441 -63493 -15127 33122 -55302 -201361 -60761 15375 -28374 -11093 -86239 -9872 -112012
23430 -112012 -109583 -832 106689 94652 -62785 -7152 42532 36552 54538 93338 -14640
23419 -14640 -23773 -28728 -19899 -62084 -154226 -17468 94170 129880 41824 -12514 36826 35331
23407 35331 -79520 -102782 -1894 -6231 -12280 10804 -64720 -70386 -107450 -29802 -8719 -32581
23395 -32581 -234116 -393481 -344187 -204142 -132265 -175077 4512 51733 91903 39871 -21550
23384 -21550 132662 128814 85107 66147 39845 53298 -99541 -78560 -84009 -58942 -82568 -148267
23372 -148267 -195002 -310531 -287410 -243663 -161948 -216447 -90397 21116 68078 -53866 -199065
$$ packed form
23453f7040o230K5307q8629N0731o3786l3370L9128M5187M5938j02312r389J00972
23441f3493M8366M8249q8424j46059J40600P6136m3749J7281p5146P6367j02140
23430a12012K429J08751J07521j2037j57437N5633M9684n980J7986L8800j07978
23419a4640r133m955Q829m2185r2142J36758J11638L5710q8056n4338M9340j495
23407C5331j14851k3262J00888m337o049K3084p5524n666l7064P7648K1083k3862
23395c2581k01535j59365M9294J40045P1877m2812J79589M7221M0170n2032o1421
23384b1550J54212l848m3707j8960k6302J3453j52839K0981n449K5067k3626o5699
23372a48267m6735j15529K3121M3747Q1715n4499J26050J11513M6962j21944j45199
$$ plain form
23361 -199065 -169757 -52546 41473 -62133 65332 135742 47191 29935 -64371 -130540 -94189
23350 -94189 -13400 79231 57553 -17929 -134702 -140817 -137937 -104409 468 -37153 -87903 -81089
23338 -81089 -138941 -246385 -231070 -153378 -173663 -254545 -220627 -47901 94451 149888 51101
23327 51101 -146775 -171704 -37000 84104 85016 -20165 -75455 -104384 -204113 -187600 -220617
23316 -220617 -198545 -173148 -112335 -31426 -5920 -147786 -113326 -48170 -212068 -262559 -279536
23305 -279536 -311216 -177404 -129533 -109613 -46669 -30042 48158 51908 38119 -66347 -111505
23294 -111505 -208955 -158185 -147149 -123142 63407 -60602 -129961 -72646 -4287 -84701 -85808
23283 -85808 -28314 19709 24779 -9212 -104286 -154325 -234006 -217474 -106824 -48926 -32744 -44822
$$ packed form
23361a99065K9308J17211R4019j03606J27465P0410q8551j7256r4306o6169L6351
23350i4189Q0789R2631k1678p5482j16773o115K880L3528J04877l7621n0750O814
23338h1089n7852j07444J5315P7692k0285q0882L3918J72726J42352N5437r8787
23327E1101j97876k4929J34704J21104R12j05181n5290k8929r9729J6513l3017
23316b20617K2072K5397O0813Q0909K5506j41866L4460O5156j63898n0491j6977
23305b79536l1680J33812M7871J9920O2944J6627P8200L750j3789j04466m5158
23294a11505r7450N0770J1036K4007J86549j24009o9359N7315O8359q0414j107
23283h5808N7494M8023N070l3991r5074n0039p9681J6532J10650N7898J6182j2078
$$ plain form
23271 -44822 -95041 -145078 -57214 57792 94035 119283 31007 -9549 75284 120675 39072
23260 39072 -10888 -64647 -23863 -2067 27426 117192 104234 -2097 -32106 -52728 -169663
23249 -169663 -124148 -208985 -137428 -57492 -193562 -335654 -270227 -149732 -234963 -312329 -153979
23238 -153979 -75807 -79107 -96902 -119103 -51752 5130 26604 -28466 -104682 -211456 -239073
23227 -239073 -166993 -127408 -107297 -72329 45113 94664 91848 106154 -21584 -107175 -152523
23216 -152523 -147449 -159340 -202806 -371512 -375002 -280934 -10673 12593 -74150 -91764 -196937
23205 -196937 -176096 -102649 116737 76708 -89070 -208770 -164002 -183202 -116831 -61878 -58184
23194 -58184 -38861 -134851 -148689 3872 77228 70249 -68643 -201971 -161953 15972 -30811
$$ packed form
23271d4822n0219n0037Q7864J15006L6243K5248q8276m0556Q4833M5391q1603
23260C9072m9960n3759M0784K1796K9493Q9766j2958j06331l0009k0622j16935
23249a69663M5515q4837P1557P9936j36070j42092O5427J20495q5231p7366J58350
23238a53979P8172l300j7795k2201O7351N6882K1474n5070p6216j06774k7617
23227b39073P2080L9585K0111L4968J17442M9551k816J4306j27738q5591m5348
23216a52523N074j1891m3466j68706l490R4068K70261K3266q6743j7614j05173
23205a96937K0841P3447K19386m0029j65778j19700M4768j9200O6371N4953L694
23194e8184J9323r5990j3838J52561P3356o979j38892j33328M0018J77925m6783
$$ plain form
23183 -30811 -69011 -110072 -196988 -243097 -204907 -230575 -125888 -86500 -19930 -72209 -151174
23172 -151174 -95668 -83710 -228796 -396333 -325466 -181327 -102527 -171510 -203020 -121798 -98388
23161 -98388 -35300 -10839 -90232 -156905 -163581 -194106 -145734 -150832 -311857 -343431 -265782 -122742
23149 -122742 -89443 -70494 -75706 -150109 -190765 -268980 -358464 -246230 -232556 -234025 -229967 -151630
23137 -151630 -120202 -182337 -139600 -50396 -5800 32473 13397 -6809 -99369 -128844 -115632
23126 -115632 -218150 -258476 -210213 -116222 -181283 -240656 -149951 -165844 -282740 -304235 -289891
23115 -289891 -118103 -46020 -75383 -128367 -154387 -171340 -118028 -3562 43267 -17912 -27559
23104 -27559 16452 30908 -75125 -241548 -204627 -139655 -183711 -206052 -200319 -216029 -245023
$$ packed form
23183c0811l8200m1061q6916m6109L8190k5668J04687L9388O6570n2279p8965
23172a51174N5506J1958j45086j67537P0867J44139P8800o8983l1510Q1222K3410
23161i8388O3088K4461p9393o6673o676l0525M8372n098j61025l1574P7649J43040
23149a22742L3299J8949n212p4403m0656p8215q9484J12234J3674j469M058P8337
23137a51630L1428o2135M2737Q9204M4596L8273j9076k0206r2560k9475J3212
23126a15632j02518m0326M8263R3991o5061n9373R0705j5893j16896k1495J4344
23115b89891J71788P2083k9363n2984k6020j6953N3312J14466M6829o1179r647
23104b7559M4011J4456j06033j66423L6921O4972m4056k2341N733j5710k8994
$$ plain form
23093 -245023 -177843 -165244 -148259 -108693 -80673 5582 29776 86620 76611 229223 203065
23082 203065 76691 51038 68764 207834 134340 27549 16698 51667 140714 140808 20434
23071 20434 -73277 -169127 -365777 -307597 3212 35064 -1604 -115237 -155196 -58813 66518
23060 66518 -9320 -166463 -251995 -256622 -243558 -237911 -326041 -185500 -43364 -167041 -96527
23049 -96527 76780 -5634 -101272 -129003 -14553 37122 113527 244446 120696 -14400 -74383
23038 -74383 -74279 -47725 -125570 -19040 -29930 33964 -102239 -210921 -160209 -110167 -26637
23027 -26637 19319 -92938 -9708 53612 3089 -15725 -78497 -163059 -205143 -239188 -228839
23016 -228839 -139591 -42543 59836 -33067 -178315 -72895 -78257 -106941 -73460 -93945 -177620
$$ packed form
23093b45023O7180J2599J6985L9566K8020Q6255K4194N6844j0009J52612k6158
23082B03065j26374k5653J7726J39070p3494j06791j0851L4969Q9047R4j20374
23071B0434r3711r5850j96650N8180L10809L1852l6668j13633l9959R6383J25331
23060F6518p5838j57143q5532m627J3064N647q8130J40541J42136j23677P0514
23049i6527J73307q2414r5638k7731J14450N1675P6405J30919j23750j35096n9983
23038g4383J04K6554p7845J06530j0890O3894j36203j08682N0712N0042Q3530
23027b6637M5956j12257Q3230O3320n0523j8814o2772q4562m2084l4045J0349
23016b28839Q9248R7048J02379r2903j45248J05420n362k8684L3481k0485q3675
$$ plain form
23005 -177620 -88546 -74620 -92954 -61456 11839 -109959 -144366 -136544 8900 60713 -125336
22994 -125336 -239209 -204273 -131278 -75455 73259 111360 118883 104697 16951 -86111 -76458
22983 -76458 -21088 -42200 9989 97699 -15900 31070 79160 54437 -102308 -217425 -218051
22972 -218051 -122779 -142880 -195788 -150537 -65648 -28090 -37416 -107109 -92017 -123628 -97990 -114043
22960 -114043 -143289 -102101 -198918 -273332 -311198 -173271 -172935 -129471 -29475 32684 -60804 -35607
22948 -35607 -3827 53943 71126 106137 229319 66067 -153079 -272993 -259181 -239108 -194667
22937 -194667 -89484 -106949 -42790 44422 34861 111274 188568 273017 121733 13496 15541
22926 15541 11480 -17383 -104727 -161139 -47275 -65062 -37081 77101 166306 107781 22454
$$ packed form
23005a77620Q9074J3926j8334L1498P3295j21798l4407P822J45444N1813j86049
22994a25336j13873L4936P2995N5823J48714L8101P523j4186q7746j03062R653
22983g6458N5370k1112N2189Q7710j13599M6970M8090k4723j56745j15117o26
22972b18051R5272k0101n2908M5251Q4889L7558r326o9693J5092l1611K5638j6053
22960a14043k9246M1188r6817p4414l7866J37927L36M3464R9996O2159r3488K5197
22948c5607L1780N7770J7183L5011J23182j63252k19146j19914J3812K0073M4441
22937a94667J05183j7465O4159Q7212r561P6413P7294Q4449j51284j08237K045
22926A5541m061k8863q7344n6412J13864j7787K7981J14182Q9205n8525q5327
$$ plain form
22915 22454 -74750 -67985 -99339 19117 70676 110740 22316 -34627 37792 67289 47044 147126
22903 147126 121867 19160 -147331 -61726 -16636 -27616 -53974 -87613 -82276 -177929 -255003
22892 -255003 -372056 -444493 -478408 -382395 -358913 -214266 -2695 131307 60470 16826 -178588
22881 -178588 -300425 -333088 -378587 -367627 -286559 -162810 -154427 -105167 -52904 -47464 -38554 -74824
22869 -74824 -106017 -114229 27643 -38517 -119998 -43295 112282 56914 -90767 -120152 -97175
22858 -97175 -31089 -25766 -79383 -85733 -115767 -118135 -154663 -233570 -203748 -109660 -105810 -54435
22846 -54435 -144565 -169640 -55680 -82865 -53719 -97556 -94676 -2441 24049 -111528 -29813
22835 -29813 -11799 -89656 -177858 -222722 -130120 -74701 -113136 -160097 -158245 -92551 -114521 -54395
$$ packed form
22915B2454r7204O765l1354J18456N1559M0064q8424n6943P2419K9497k0245J00082
22903A47126k5259j02707j66491Q5605M5090j0980k6358l3639N337r5653p7074
22892b55003j17053p2437l3915R6013K3482J44647K11571J34002p0837m3644j95414
22881a78588j21837l2663m5499J0960Q1068J23749Q383M9260N2263N440Q910l6270
22869g4824l1193q212J41872o6160q1481P6703J55577n5368j47681k9385K2977
22858i7175O6086N323n3617o350l0034k368l6528p8907K9822R4088L850N1375
22846e4435r0130k5075J13960k7185K9146m3837K880R2235K6490j35577Q1715
22835b9813J8014p7857q8202m4864R2602N5419l8435m6961J852O5694k1970O0126
$$ plain form
22823 -54395 -88280 -178365 -260691 -185335 -89180 -184033 -211198 -194770 -73288 -17800 -23274 -93020
22811 -93020 -94318 -107841 -39216 43804 5542 27196 58400 14891 -88760 -174026 -186272 -125766
22799 -125766 -10739 151515 116372 -108394 -331268 -338800 -230230 -135391 -63999 -62758 -49107
22788 -49107 -64196 -158413 -189271 -239900 -240327 -217412 -272396 -369036 -204558 -133422 -349454 -304874
22776 -304874 -268265 -132358 -102624 -143892 -98043 -164215 -223161 -211071 -131442 -147704 -179048
22765 -179048 -122432 160 45257 -35873 -266804 -373147 -289859 -132889 -223692 -220501 -251977
22754 -251977 -193799 -296286 -326664 -139152 -81309 -19283 168706 287045 306738 162605
22744 162605 -19745 -242488 -314040 -385250 -349001 -263403 -183689 -142907 -105691 -212163 -258636
$$ packed form
22823e4395l3885r0085q2326P5356R6155r4853k7165J6428J21482N5488n474o9746
22811i3020j298j3523O8625Q3020l8262K1654L1204m3509j03651q5266j2246O0506
22799a25766J15027J62254l5143k24766k22874p532J08570R4839P1392J241J3651
22788d9107j5089r4217l0858n0629m27K2915n4984r6640J64478P1136k16032M4580
22776c04874L6609J35907K9734m1268M5849o6172n8946J2090P9629j6262l1344
22765a79048N6616J22592M5097q1130k30931j06343Q3288J56970r0803L191l1476
22754b51977N8178j02487l0378J87512N7843O2026J87989J18339J9693j44133
22744A62605j82350k22743p1552p1210L6249Q5598P9714M0782L7216j06472m6473
$$ plain form
22733 -258636 -244787 -146771 -146792 -149140 -190518 -156517 -193062 -221260 -371974 -263240 -161088 -88391
22721 -88391 -163247 -2034 54173 93764 95335 43356 -61512 -109395 -186854 -359079 -233981
22710 -233981 -233411 -312525 -245717 -237954 -223307 -243471 -176869 -253552 -250749 -153216 -207895 -159700
22698 -159700 -125552 -130890 -45405 -77769 -107406 -34924 48850 84618 -38264 -29269 -43923 -79047
22686 -79047 -30960 -53819 -193006 -301016 -252575 -145229 43865 -1438 -198929 -347831
22676 -347831 -376955 -283026 -338217 -273467 -172730 -25588 -20435 -93277 -160979 -93540 -50922
22665 -50922 -65142 -87757 -159159 -209947 -62618 60218 61115 96163 120799 137836 82219 -122919
22653 -122919 -186073 -156297 -177129 -214326 -40174 -20336 -149145 -145556 -159254 -171049 -163920
$$ packed form
22733b58636J3849R8016k1k348m1378L4001l6545k8198j50714J08734J02152P2697
22721h8391p4856J61213N6207L9591J571n1979j04868m7883p7459j72225J25098
22710b33981N70p9114O6808P763J4647k0164O6602p6683K803R7533n4679M8195
22698a59700L4148n338Q5485l2364k9637P2482Q3774L5768j22882Q995j4654l5124
22686g9047M8087k2859j39187j08010M8441J07346J89094m5303j97491j48902
22676c47831k9124R3929n5191O4750J00737J47142N153p2842o7702O7439M2618
22665e0922j4220k2615p1402n0788J47329J22836Q97L5048K4636J7037n5617k05138
22653a22919o3154K9776k0832l7197J74152J9838j28809L589j3698j1795P129
$$ plain form
22642 -163920 -107654 -82874 -100137 -173903 -230281 -172207 17547 -37471 -88736 -142099 -179018
22631 -179018 -108804 -17394 -4226 -84815 -105561 -199885 -108266 17580 84781 151439 136896
22620 136896 32822 63155 -96678 -134265 -213410 -246102 -131949 47128 205821 134685
22610 134685 71245 54653 57521 -13162 -108240 -261081 -234232 -69441 -133643 -146202 -122907
22599 -122907 -55827 -31656 -54448 -99053 -93839 -43411 -155277 -264456 -143568 -122792 -208410
22588 -208410 -182052 -194574 -241864 -310986 -352430 -215888 -224928 -236156 -190413 -77108 7500
22577 7500 49154 43718 160131 183847 186492 122008 182036 230219 186453 -29762 -110203 -116619
22565 -116619 -161353 -234780 -320326 -329026 -267324 -218777 -141911 -277444 -303299 -130145 -171207
$$ packed form
22642a63920N6266K4780j7263p3766n6378N8074J89754n5018n1265n3363l6919
22631a79018P0214R1410J3168q0589k0746r4324R1619J25846O7201O6658j4543
22620A36896j04074L0333j59833l7587p9145l2692J14153J79077J58693p1136
22610A34685o3440j6592K868p0683r5078j52841K6849J64791o4202j2559K3295
22599a22907O7080K4171k2792m4605N214N0428j11866j09179J20888K0776q5618
22588b08410K6358j2522m7290o9122m1444J36542r040j1228M5743J13305Q4608
22577G500M1654n436J16413K3716K645o4484O0028M8183m3766k16215q0441o416
22565a16619m4734p3427q5546q700O1702M8547P6866j35533k5855J73154m1062
$$ plain form
22554 -171207 -248250 -190869 -178872 -73009 -201388 -325945 -235536 -145315 -268431 -241077 -292237
22543 -292237 -361199 -368179 -372981 -317888 -242439 -198455 -212777 -163766 -175910 -228123 -222574 -182788
22531 -182788 -184871 -147317 -274149 -248754 -311636 -486916 -379560 -185566 -248860 -175984 -153358
22520 -153358 -194951 -95409 -39424 42822 104137 18125 -37107 -63153 -130404 -286942 -347574
22509 -347574 -366405 -171384 -44279 -38232 -85770 -89861 -125096 -219994 -128154 -48141 -159385
22498 -159385 -182871 -114076 35688 38475 -127207 -155734 2300 -144971 -184168 -124191 -223158
22487 -223158 -104378 24559 30849 12238 -75933 -164705 -176518 -159712 -138358 -161439 -145718
22476 -145718 -148558 -173639 -123239 -168581 -225227 -155018 -298782 -332501 -214824 -133246 -122814
$$ packed form
22554a71207p7043N7381J1997J05863j28379j24557R0409R0221j23116K7354n1160
22543b92237o8962o980m802N5093P5449M3984j4322M9011j2144n2213N549L9786
22531a82788k083L7554j26832K5395o2882j75280J07356J93994o3294P2876K2626
22520a53358m1593R9542N5985Q2246O1315q6012n5232k6046o7251j56538o0632
22509c47574j8831J95021J27105O047m7538m091l5235r4898R1840Q0013j11244
22498a59385k3486O8795J49764K787j65682k8527J58034j47271l9197N9977r8967
22487b23158J18780J28937O290j8611q8171q8772j1813J6806K1354k3081J5721
22476a45718k840k5081N0400m5342n6646P0209j43764l3719J17677Q1578J0432
$$ plain form
22465 -122814 -135758 -114557 -157055 -49983 -146922 -174920 -118886 -67688 24243 76654 -33015
22454 -33015 -109609 -186030 -310306 -265252 -328562 -328938 -157252 -89691 -31508 -68673 -50987 121652
22442 121652 61820 -73481 -45987 90711 108612 5672 -96137 -142820 -104132 -82754 -159913
22431 -159913 -149528 -109780 -155226 -137709 -37048 -118259 -130655 -132236 -160362 -144765 -106492
22420 -106492 -124215 -148018 -168985 -191517 -358233 -397147 -254119 -261461 -389365 -320892 -335836
22409 -335836 -302816 -353019 -408750 -219153 -80963 -147463 -128126 -193213 -280582 -247541 -145175
22398 -145175 -100491 -94628 -19425 39160 -44866 -162416 -193852 -63105 -33563 -91352 -131023
22387 -131023 -61481 4026 65592 75054 -20262 -42741 -143023 -181962 -188156 -308426 -337931
$$ packed form
22465a22814j2944K1201m2498J07072r6939k7998N6034N1198R1931N2411j09669
22454c3015p6594p6421j24276M5054o3310l76J71686O7561N8183l7165J7686J72639
22442A21652n9832j35301K7494J36698J7901j02940j01809m6683L8688K1378p7159
22431a59913J0385L9748m5446J7517J00661q1211j2396j581k8126J5597L8273
22420a06492j7723k3803k0967k2532j66716l8914J43028p342j27904O8473j4944
22409c35836L3020n0203n5731J89597J38190o6500J9337o5087q7369L3041J02366
22398a45175M4684N863P5203N8585q4026j17550l1436J30747K9542n7789l9671
22387a31023O9542O5507O1566R462r5316k2479j00282l8939o194j20270k9505
$$ plain form
22376 -337931 -288473 -195385 -157567 -207520 -83988 -58790 -222154 -401011 -355640 -256539 -264290
22365 -264290 -247576 -161176 -76275 -89966 -188779 -184367 -110434 -75265 -118639 -164714 -88737 -228238
22353 -228238 -407158 -245118 -161393 -107037 -147648 -185289 -202386 -66815 21492 -72853 -118981
22342 -118981 -124020 -30964 -6272 -130856 -99970 -36900 -123500 -317493 -339716 -256260 -196383
22331 -196383 -162205 -116811 -13463 50333 -15814 -53633 60027 48292 -88602 -158572 -209590
22320 -209590 -349978 -388847 -383846 -350509 -248144 -240900 -221639 -136342 -75588 -103264 -162874
22309 -162874 -97763 -44021 12752 -4122 -114981 -183161 -165211 -213918 -191183 -179697 -115236
22298 -115236 -43428 -90864 -142892 -135821 -49147 38383 53290 -136244 -344590 -444619 -348720
$$ packed form
22376c37931M9458R3088L7818m9953J23532K5198j63364j78857M5371R9101p751
22365b64290J6714Q6400Q4901j3691r8813M412P3933L5169m3374m6075P5977j39501
22353b28238j78920J62040Q3725N4356m0611l7641j7097J35571Q8307r4345m6128
22342a18981n039R3056K4692j24584L0886O3070q6600j93993k2223Q3456N9877
22331a96383L4178M5394J03348O3796o6147l7819J13660j1735j36894o9970n1018
22320b09590j40388l8869N001L3337J02365P244J9261Q5297O0754k7676n9610
22309a62874O5111N3742N6773j6874j10859o8180J7950m8707K2735J1486O4461
22298a15236P1808m7436n2028P071Q6674Q7530J4907j89534k08346j00029R5899
$$ plain form
22287 -348720 -300739 -332032 -247719 -173171 -209483 -238271 -321135 -363511 -231567 -194812 -193894 -117838
22275 -117838 -65084 -120862 -122604 -252542 -164268 -23001 -85486 -223111 -95806 -67393 -171424
22264 -171424 -191840 -198243 -113068 61688 68280 53956 28684 18905 98405 20551 -120068 27043
22252 27043 50188 22957 -48628 -135064 -194195 -114175 -89627 -133833 -151051 -233653 -259293 -255971
22240 -255971 -182687 -116893 -191949 -286497 -386459 -342394 -219754 -138118 -76269 -82659 40132
22229 40132 19949 15018 -54388 -141799 -118274 -164399 -134278 -212159 -259965 -182603 -226927 -248521
22217 -248521 -218536 -245837 -120701 -39699 29824 46342 -1376 4114 41828 80878 -52023
22206 -52023 -214451 -260253 -239321 -172533 -75422 43932 135954 41406 -48783 -30508 -54457
$$ packed form
22287c48720M7981l1293Q4313P4548l6312k8788q2864m2376J31944L6755R18P6056
22275a17838N2754n5778j742j29938Q8274J41267o2485j37625J27305K8413j04031
22264a71424k0416o403Q5175J74756O592j4324k5272r779P9500p7854j40619J47111
22252B7043K3145k7231p1585q6436n9131Q0020K4548m4206j7218q2602k5640L322
22240b55971P3284O5794p5056r4548r9962M4065J22640Q1636O1849o390J22791
22229D0132k0183m931o9406q7411K3525m6125L0121p7881m7806P7362m4324k1594
22217b48521K9985k7301J25136Q1002O9523J6518m7718N490L7714L9050j32901
22206e2023j62428m5802K0932O6788R7111J19354R2022r4548r0189J8275k3949
$$ plain form
22195 -54457 -73865 -63042 -101348 -182244 -255244 -291987 -203266 -141900 -257116 -412738 -406705
22184 -406705 -276207 -159890 -167770 -132761 -257796 -321734 -197900 -178736 -105345 -9964 -108207
22173 -108207 -9796 -22593 91981 88118 68695 93614 81009 -59676 -82222 -103031 -37641
22162 -37641 32215 32153 -59090 -177679 -266095 -38757 -101367 -224076 -78890 -44523 -121491
22151 -121491 -99619 -137172 -130254 -70728 -145433 -169053 -135909 -189238 -187285 -95282 -83403 -84257
22139 -84257 -161672 -92565 -78878 -119335 -226785 -159773 -222458 -248455 -321175 -466751 -414991
22128 -414991 -214631 -103133 -88701 -137091 -170143 -132477 -132212 -147873 -164010 -105881 -68995
22117 -68995 -116815 -165823 -167653 -176039 -126318 -124092 -65402 3309 -73729 -58922 -119341 -138878
$$ packed form
22195e4457j9408J0823l8306q0896p3000l6743Q8721O1366j15216j55622O033
22184d06705J30498J16317p880L5009j25035o3938J23834J9164P3391R5381r8243
22173a08207R8411j2797J14574l863j9423K4919j2605j40685k2546k0809O5390
22162c7641O9856o2r1243j18589q8416K27338o2610j22709J45186L4367p6968
22151a21491K1872l7553O918N9526p4705k3620L3144n3329J953R2003J1879q54
22139h4257p7415O9107J3687m0457j07450O7012o2685k5997p2720j45576N1760
22128d14991K00360J11498J4432m8390l3052L7666K65j5661j6137N8129L6886
22117f8995m7820m9008j830q386M9721K226N8690O8711p7038J4807o0419j9537
$$ plain form
22105 -138878 -60590 87043 94330 101452 45295 30310 -72865 -149770 -241447 -367324 -404336
22094 -404336 -244736 -157392 -185785 -247957 -118803 8756 19044 57820 52864 -43634 -57809
22083 -57809 -73454 -131719 -172679 -165580 -122799 -212839 -210514 -90408 -132518 -155566 -256806 -346871
22071 -346871 -287818 -301195 -287051 -232178 -216364 -275198 -219322 -145280 -150722 -324629 -288785
22060 -288785 -80302 -3325 -40506 -112838 -156921 -234563 -160928 -145467 -89534 -12665 -2966
22049 -2966 12787 -77288 -164855 -295825 -290314 -247718 -232158 -242942 -143297 -53744 4213 -103228
22037 -103228 -247296 -193138 -225751 -214881 -221258 -307041 -325674 -234309 -193189 -146065 -31104
22026 -31104 1195 -181585 -153016 -92217 -151088 -300945 -270951 -166568 -84002 5639 -165659
$$ packed form
22105a38878P8288J47633P287P122n6157j4985j03175p6905r1677j25877l7012
22094d04336J59600Q7344k8393o2172J29154J27559J0288L8776m956r6498j4175
22083e7809j5645n8265m0960P099M2781r0040K325J20106m2110k3048j01240r0065
22071c46871N9053j3377J4144N4873J5814n8834N5876P4042n442j73907L5844
22060b88785K08483P6977l7181p2332m4083p7642P3635J5461N5933P6869R699
22049b966J5753r0075q7567j30970N511M2596J5560j0784R9645Q9553N7957j07441
22037a03228j44068N4158l2613J0870o377q5783j8633R1365M1120M7124J14961
22026c1104L2299j82780K8569O0799n8871j49857K9994J04383Q2566Q9641j71298
$$ plain form
22015 -165659 -241685 -290272 -239814 18758 62953 36298 -63535 -138895 -109558 -20618 -70723
22004 -70723 -19572 3888 -29212 -104769 -235650 -289796 -220805 -94111 2833 -76520 -70538
21993 -70538 -67080 -200960 -206034 -167386 -206228 -101233 -190880 -328694 -282411 -195922 -221622
21982 -221622 -389250 -331475 -172102 -42354 -41868 -66018 -92176 -139960 -199042 -393073 -548318
21971 -548318 -445834 -366309 -357690 -290348 -216978 -186070 -181263 -212073 -225737 -249058 -276408 -248095
21959 -248095 -145093 -87067 -105506 -102314 -113358 -85510 7387 -22675 -58033 -104399 -124345
21948 -124345 -120728 -66935 -66682 -203808 -147547 2338 101558 106085 -28814 4432 34406 126979
21936 126979 164083 240480 169787 26394 -97460 -170836 -119262 -86893 -95435 -145854 -214858
$$ packed form
22015a65659p6026m8587N0458K58572M4195k6655r9833p5360K9337Q8940n0105
22004g0723N1151K3460l3100p5557j30881n4146O8991J26694R6944p9353N982
21993g0538L458j33880n074L8648l8842J04995q9647j37814M6283Q6489k5700
21982b21622j67628N7775J59373J29748M86k4150k6158m7784n9082j94031j55245
21971e48318J02484P9525Q619O7342P3370L0908M807l0810j3664k3321k7350K8313
21959b48095J03002N8026j8439L192j1044K7848R2897l0062l5358m6366j9946
21948a24345L617N3793K53j37126N6261J49885R9220M527j34899L3246K9974R2573
21936A26979L7104P6397p0693j43393j23854p3376N1574L2369q542n0419o9004
$$ plain form
21925 -214858 -216689 -206826 -218199 -182884 -225567 -210518 -192390 -229703 -249911 -142633 -143806 -205836
21913 -205836 -97245 -143521 -291784 -338754 -212012 -224093 -264834 -340258 -373652 -360618 -268121
21902 -268121 -372720 -354987 -414824 -415123 -274763 -124823 -46641 -63602 -83158 -120229 -183875
21891 -183875 -174783 -229850 -196170 -175699 -199172 -80490 -192232 -233632 -102422 -61589 56455
21880 56455 150208 75610 26857 -25986 -119460 -87139 -80848 -124876 -121046 -84914 -124062 -224382
21868 -224382 -174066 -150867 -165020 -47117 -30871 21219 -18424 -74941 -83342 -92542 -587 -80587
21856 -80587 -118967 16631 -173833 -301672 -250193 -184342 -21369 26095 -87069 -214613
21846 -214613 -206450 -202338 -299828 -236900 -265693 -322116 -250900 -207425 -208870 -334747 -311178 -386204
$$ packed form
21925b14858j831R863j1373L5315m2683J5049J8128l7313k0208J07278j173o2030
21913b05836J08591m6276j48263m6970J26742j2081m0741p5424l3394J3034R2497
21902b68121j04599J7733n9837k99J40360J49940P8182j6961j9556l7071o3646
21891a83875R092n5067L3680K0471k3473J18682j11742m1400J31210M0833J18044
21880E6455R3753p4598m8753n2843r3474L2321O291m4028L830L6132l9148j00320
21868b24382N0316K3199j4153J17903J6246N2090l9643n6517q401r200R1955q0000
21856h0587l8380J35598j90464j27839N1479O5851J62973M7464j13164j27544
21846b14613Q163M112r7490O2928k8793n6423P1216M3475j445j25877K3569p5026
$$ plain form
21834 -386204 -453568 -333559 -222081 -157634 -75662 -225868 -285727 -275799 -322352 -454743 -500012
21823 -500012 -357387 -203858 -79143 -884 26304 -60651 -72818 -165162 -211243 -218804 -313479
21812 -313479 -316545 -266448 -175439 -210604 -88180 -93286 -36719 78820 166658 142497 -77391
21801 -77391 -257662 -183552 -186828 -198796 -192138 -196116 -232768 -145148 -105343 -105015 -188218 -311395
21789 -311395 -275122 -238898 -219585 -197208 -180363 -187489 -210268 -222608 -305082 -408720 -389786
21778 -389786 -175741 -291766 -270740 -153113 -39412 -61904 -210500 -262535 -259421 -302972 -187824
21767 -187824 44538 92447 -66765 -176482 -196386 -250327 -321142 -210178 -152921 -124493 -161160
21756 -161160 -253956 -287446 -351836 -344163 -340757 -287007 -116171 -6631 -32683 -84958 -131323
$$ packed form
21834c86204o7364J20009J11478O4447Q1972j50206n9859R928m6553j32391m5269
21823e00012J42625J53529J24715P8259K7188q6955j2167r2344m6081p561r4675
21812c13479l066N0097R1009l5165J22424n106N6567J15539Q7838k4161k19888
21801g7391j80271P4110l276j1968O658l978l6652Q7620L9805L28q3203j23177
21789c11395L6273L6224J9313K2377J6845p126k2779j2340q2474j03638J8934
21778c89786K14045j16025K1026J17627J13701k2492j48596n2035L114m3551J15148
21767a87824K32362M7909j59212j09717j9904n3941p0815J10964N7257K8428l6667
21756a61160r2796l3490o4390P673L406N3750J70836J09540k6052n2275m6365
$$ plain form
21745 -131323 -91953 -75147 -88844 -23379 -87216 -177062 -395660 -389246 -171863 -85509 -152110
21734 -152110 -156253 -125455 -20660 -2717 -75588 -45184 -64866 -138491 -291161 -133167 -157301
21723 -157301 -229676 -342749 -278706 -235960 -220175 -164972 -125034 31948 116492 100210 -23857
21712 -23857 -162945 -161731 -221624 -384187 -383107 -187098 -113751 -41318 -81072 -119027 -42526
21701 -42526 -41667 -207678 -260053 -233947 -312021 -231819 -220719 -132681 -119401 -253408 -254428 -267029
21689 -267029 -129230 -144020 -155988 -222079 -139310 -5917 -2701 -68652 -117819 -162765 -167909
21678 -167909 -131118 -168466 -186283 -240353 -197836 -107684 -51115 11996 65973 39968 -34599
21667 -34599 -215513 -274225 -278643 -207403 -87849 -83144 -107070 -37508 -46457 -76155 -75525 -42217
$$ packed form
21745a31323L9370J6806j3697O5465o3837q9846k18598O414K17383Q6354o6601
21734a52110m143L0798J04795J7943p2871L0404j9682p3625j52670J57994k4134
21723a57301p2375j13073O4043M2746J5785N5203L9938J56982Q4544j6282j24067
21712b3857j39088J214n9893j62563J080J96009P3347P2433l9754l7955P6501
21701d2526Q59j66011n2375K6106p8074Q0202J1100Q8038J3280j34007j020j2601
21689b67029J37799j4790j1968o6091Q2769J33393L216o5951m9167m4946n144
21678a67909L6791l7348j7817n4070M2517R0152N6569O3111N3977k6005p4567
21667c4599j80914n8712m418P1240J19554M705k3926O9562q949k9698O30L3308
$$ plain form
21655 -42217 10785 -39376 21689 -38227 8603 -53783 -106090 -174277 -140723 -144937 -160286 -172124
21643 -172124 -163317 -169383 -154330 -125982 -83537 -115810 -126089 59298 111900 986 -55115
21632 -55115 -33588 41992 30036 -32534 -167012 -140869 -26865 -29817 -24147 52519 -4452 -56901
21620 -56901 -163915 -191141 -69617 7 -25225 -3136 -19482 32777 6991 3563 64479
21609 64479 29521 -7756 -4700 -66858 -243808 -311250 -237200 -192634 -336454 -378147 -296729
21598 -296729 -201083 -324477 -330786 -214852 -221337 -215308 -215301 -109797 -121150 -242934 -103450 156870
21586 156870 64922 -47252 -82891 -41315 -106232 -203276 -121707 4802 -39095 -118944 -171377
21575 -171377 -232605 -171146 -93575 -68019 -26813 -127566 -144581 -112628 -164826 -268635 -184982
$$ packed form
21655d2217N3002n0161O1065n9916M6830o2386n2307o8187L3554m214j5349j1838
21643a72124Q807o066J5053K8348M2445l2273j0279J85387N2602j10914n6101
21632e5115K1527P5580j1956o2570j34478K6143J14004k952N670P6666n6971n2449
21620e6901j07014k7226J21524O9624k5232K2089j6346N2259k5786l428O0916
21609F4479l4958l7277L056o2158j76950o7442P4050M4566j43820m1693Q1418
21598b96729R5646j23394o309J15934o485O029PJ05504j1353j21784J39484K60320
21586A56870r1948j12174l5639M1576o4917r7044Q1569J26509m3897p9849n2433
21575a71377o1228O1459P7571K5556M1206j00753j7015L1953n2198j03809Q3653
$$ plain form
21564 -184982 -210968 -179045 -182881 -303626 -155947 -140568 -186970 -145880 -85747 -216566 -222623
21553 -222623 -213908 -434680 -342561 -46607 -16508 -119214 -103960 -203774 -238352 -259185 -318725
21542 -318725 -305237 -182703 -74349 37184 2588 -88988 -90237 -29953 -82080 -92964 -89704
21531 -89704 -116964 -260443 -224927 -59788 -19722 -59060 -79021 -230522 -233701 -131176 -42775
21520 -42775 -125061 -86084 -112678 -251546 -294966 -85398 -55282 -219039 -333556 -283086 -314615
21509 -314615 -205554 -162827 -152256 -198835 -142563 -118596 -134499 -117793 -122220 -166170 -273913
21498 -273913 -212016 -212028 -385026 -420012 -327764 -262332 -199429 -12730 129773 105280 -37972
21487 -37972 -113929 -111511 -29405 -152411 -261353 -217723 -151419 -104066 -84762 -134827 -113684
$$ packed form
21564a84982k5986L1923l836j20745J47679J5379m6402M1090O0133j30819o057
21553b22623Q715k20772R2119K95954L0099j02706J5254r9814l4578k0833n9540
21542c18725J3488J22534J08354J11533l4596r1576j249O0284n2127j0884L260
21531h9704k7260j43479L5516J65139M0066l9338j9961j51501l179J02525Q8401
21520d2775q2286L8977k6594j38868m3420K09568L0116j63757j14517N0470l1529
21509c14615J09061M2727J0571m6579N6272K3967j5903J6706m427m3950j07743
21498b73913O1897j2j72998l4986R2248O5432O2903J86699J42503k4493j43252
21487c7972p5957K418Q2106j23006j08942M3630O6304M7353J9304n0065K1143
$$ plain form
21476 -113684 -171694 -264520 -390328 -470627 -442197 -379140 -429099 -366170 -261911 -200637 -179229
21465 -179229 -201593 -171365 -98570 -24101 -40027 -138866 -160895 -186765 -281563 -320387 -251946
21454 -251946 -108200 -81787 -124573 -179347 -173621 -214111 -191838 -36791 -18301 -98121 -30688
21443 -30688 -75643 8452 -20794 -211781 -288029 -100697 -6387 403 -105441 -169839 -143078
21432 -143078 -260468 -274899 -370939 -291038 -229897 -111077 -135911 -198277 -89332 107649 81100
21421 81100 -127616 -108235 -89684 -149676 -202771 -118508 -66532 -61441 -108935 -240927 -138817
21410 -138817 -113322 -182777 -225972 -234908 -164153 -143485 -233812 -178904 -224452 -287741 -128295
21399 -128295 -293357 -527792 -429479 -451117 -379385 -283051 -271586 -265906 -253778 -253862 -240116 -184292
$$ packed form
21476a13684n8010r2826j25808q0299K8430O3057m9959O2929J04259O1274K1408
21465a79229k2364L0228P2795P4469j5926r8839k2029k5870r4798l8824O8441
21454b51946J43746K6413m2786n4774N726m0490K2273J55047J8490p9820O7433
21443c0688m4955Q4095k9246j90987p6248J87332R4310O790j05844o4398K6761
21432a43078j17390j4431r6040P9901O1141J18820k4834o2366J08945J96981k6549
21421H1100k08716J9381J8551n9992n3095Q4263N1976N091m7494j31992J02110
21410a38817K5495o9455m3195q936P0755K0668r0327N4908m5548o3289J59446
21399a28295j65062k34435R8313k1638P1732R6334J1465N680J2128q4J3746N5824
$$ plain form
21387 -184292 -59237 -73907 -141359 -312360 -372105 -279120 -239522 -49530 52651 24614 -164908
21376 -164908 -370822 -369028 -398152 -417716 -259991 -64718 -24189 -93648 -107356 -156023 -244638
21365 -244638 -88269 23127 -59194 -83048 -103907 11747 72815 10105 -33297 -173904 -217140
21354 -217140 -138237 5054 69623 54763 44441 -110101 -103545 -138764 -126718 -164880 -191737
21343 -191737 -163506 -233252 -157942 -182323 -264144 -348413 -228899 -125594 -213797 -221745 -296215
21332 -296215 -311483 -252719 -229492 -92557 42845 81780 -128745 -189768 -204168 -110180 -10286
21321 -10286 32407 55832 102684 47692 -91312 -190130 -269467 -232225 -152124 -114517 -122138 -124108
21309 -124108 -22657 126552 149656 56339 -56511 -10424 31368 -78494 -156551 -140433 -185931
$$ packed form
21387a84292J25055j4670o7452j71001n9745R2985L9598J89992J02181k8037j89522
21376a64908k05914J794k9124j9564J57725J95273M0529o9459j3708m8667q8615
21365b44638J56369J11396q2321k3854k0859J15654O1068o2710m3402j40607m3236
21354b17140P8903J43291O4569j4860j0322j54542O556l5219J2046l8162k6857
21343a91737K8231o9746P5310k4381q1821q4269J19514J03305q8203p948p4470
21332b96215j5268N8764K3227J36935J35402L8935k10525o1023j4400R3988R9894
21321a0286M2693K3425M6852n4992j39004r8818p9337L7242Q0101L7607p621j970
21309a24108J01451J49209K3104r3317j12850M6087M1792j09862p8057J6118m5498
$$ plain form
21298 -185931 -123466 -88609 -61188 8480 -35398 -97147 33694 133352 55705 -46599 -206992
21287 -206992 -439597 -388783 -436478 -446579 -352999 -271118 -236427 -245189 -186373 -255161 -275514
21276 -275514 -209655 -181511 -219056 -250165 -124845 3911 42514 -44024 -71616 -149552 -144414
21265 -144414 28301 27680 -181484 -212780 -9785 60803 75293 4599 -170247 -175802 -155401
21254 -155401 -150981 -62064 -190482 -245432 -283619 -141261 -55331 -25374 -10119 -66655 -194056
21243 -194056 -177095 -80086 -33092 22385 -67689 -159164 -234395 -245816 -214455 -247595 -207331
21232 -207331 -157330 -4959 42960 -97916 -159277 -87056 -138006 -232701 -184745 -97317 -199395
21221 -199395 -277101 -135785 -157718 -206794 -79270 -86283 -128906 -90408 -164965 -297168 -201765
$$ packed form
21298a85931O2465L4857K7421O9668m3878o1749J30841R9658p7647j02304j60393
21287b06992k32605N0814m7695j0101R3580Q1881L4691q762N8816o8788k0353
21276b75514O5859K8144l7545l1109J25320J28756L8603q6538k7592p7936N138
21265a44414J72715o21k09164l1296K02995P0588J4490p0694j74846n555K0401
21254a55401M420Q8917j28418n4950l8187J42358Q5930K9957J5255n6536j27401
21243a94056J6961R7009M6994N5477r0074r1475p5231j1421L1361l3140M0264
21232b07331N0001J52371M7919j40876o1361P2221n0950r4695M7956Q7428j02078
21221a99395p7706J41316k1933m9076J27524p013m2623L8498p4557j32203R5403
$$ plain form
21210 -201765 -206247 -219523 -208136 -184405 -217091 -108890 -40683 -36115 -55132 -84225 -96469 -70197
21198 -70197 -76542 -13381 103081 -16334 -95306 -220207 -182370 -73461 18036 54009 -137815
21187 -137815 -245026 -95704 -67684 -177400 -251842 -219305 -31299 36686 -87305 -140241
21177 -140241 -269768 -341335 -277331 -184095 -181878 -158096 -142971 -251843 -382555 -455634 -274807
21166 -274807 -56006 82727 99101 146864 200216 55154 -138207 -233079 -214603 -203833 -190080
21155 -190080 -231492 -115515 61971 26354 -13101 -72410 -41329 -154863 -224132 -267432 -252847
21144 -252847 -275009 -131403 -38247 -100337 -245449 -305731 -121025 31972 -2440 11431 -102262
21133 -102262 -190576 -277767 -338971 -151897 -161344 -196612 -257094 -326017 -459391 -388128 -294476
$$ packed form
21210b01765m482j3276J1387K3731l2686J08201O8207M568j9017k9093j2244K6272
21198g0197o345O3161J16462j19415p8972j24901L7837J08909R1497L5973j91824
21187a37815j07211J49322K8020j09716p4442L2537J88006O7985j23991n2936
21177a40241j29527p1567O4004R3236K217K3782J5125j08872j30712p3079J80827
21166b74807K18801J38733J6374M7763N3352j45062j93361r4872J8476J0770J3753
21155a90080m1412J15977J77486l5617l9455n9309L1081j13534o9269m3300J4585
21144b52847k2162J43606R3156o2090j45112o0282J84706J52997l4412J3871j13693
21133a02262q8314q7191o1204J87074r447l5268o0482o8923j33374P1263R3652
$$ plain form
21122 -294476 -232338 -215653 -210580 -299192 -351684 -281171 -243811 -60362 66853 -53665 -88599
21111 -88599 -188994 -195210 -164238 -129077 -29996 61703 71593 2106 -121847 -134686 -116560 -202262
21099 -202262 -235493 -128954 9369 24343 8813 -40526 -90125 -84991 -154499 -230628 -43021
21088 -43021 48865 -34125 -255444 -301583 -301648 -239378 -161339 -58576 -110160 -71880 -95204 -85000
21076 -85000 -49327 -107176 -194954 -148959 -137992 -191810 -188724 -246839 -240531 -218423 -39766 163560
21064 163560 130889 38832 60049 14684 -82638 -145371 -211281 -241591 -304931 -324148 -254718
21053 -254718 -256697 -237875 -253160 -223429 -202104 -117663 -139402 -198202 -176681 -229980 -340615
21042 -340615 -433954 -392521 -356770 -368504 -297397 -299971 -201324 -224905 -90834 -84427 -268555
$$ packed form
21122b94476O2138J6685N073q8612n2492P0513L7360J83449J27215j20518l4934
21111h8599j00395o216L0972L5161R9081R1699R890o9487j23953j2839J8126q5702
21099b02262l3231J06539J38323J4974j5530m9339m9599N134o9508p6129J87607
21088d3021R1886q2990k21319m6139o5O2270P8039J02763n1584L8280k3324J0204
21076h5000L5673n7849q7778M5995J0967n3818L086n8115O308K2108J78657K03326
21064A63560l2671r2057K1217m5365r7322o2733o5910l0310o3340j9217O9430
21053b54718j979J8822j5285K9731K1325Q4441k1739n8800K1521n3299j10635
21042c40615r3339M1433L5751j1734P1107k574R8647k3581J34071O407j84128
$$ plain form
21031 -268555 -313138 -311786 -200855 -144051 -255742 -211664 -67793 -124194 -252069 -199204 -97919
21020 -97919 -118015 -130923 -98686 -196048 -123187 169 80873 47881 -39791 -36160 76816
21009 76816 -112729 -161759 -138772 -151344 -142397 -19574 -8165 -29214 79112 80860 -129653
20998 -129653 -59810 65652 211338 137297 -51641 -84206 -83974 -151172 -99429 -94992 -170294
20987 -170294 -8635 -29843 -208682 -198629 15242 -38219 -61612 -67393 -63968 -156909 -267475
20976 -267475 -321327 -156560 -120903 -76872 -21615 53270 49313 -29685 8045 6281 -23646 -84709
20964 -84709 -195085 -155653 -47859 -123759 -159648 -121105 -118498 -81179 -77306 -150510 -136463 -147891
20952 -147891 -22312 61341 3857 -109988 -180242 -86176 -109543 -134931 -239323 -393464 -471926
$$ packed form
21031b68555m4583J352J10931N6804j11691M4078J43871n6401j27875N2865J01285
21020i7919k0096j2908L2237r7362P2861J23356Q0704l2992q7672L631J12976
21009G6816j89545m9030K2987j2572Q947J22823J1409k1049J08326J748k10513
20998a29653O9843J25462J45686p4041j88938l2565K32o7198N1743M437p5302
20987a70294J61659k1208j78839J0053K13871n3461k3393n781L425r2941j10566
20976b67475n3852J64767L5657M4031N5257P4885l957p8998L7730j764k9927o1063
20964h4709j10376L9432J07794p5900l5889L8543K607L7319L873p3204J4047j1428
20952a47891J25579Q3653n7484j13845p0254R4066k3367k5388j04392j54141p8462
$$ plain form
20941 -471926 -451332 -304278 -344811 -484571 -556252 -554851 -645370 -563523 -446840 -302450 -185750
20930 -185750 -167022 -286351 -256067 -251821 -267506 -252956 -163181 -140868 40596 -78170 -225189
20919 -225189 -212761 -243117 -386410 -289957 -146952 -80949 -2990 59928 49395 54567 -1814
20908 -1814 -86071 -50831 6619 78074 -4158 -23585 5385 76739 77145 -62432 -217037 -320783
20896 -320783 -359079 -404650 -335459 -245536 -160883 -63412 -122568 -183873 -257538 -267970 -262518 -99534
20884 -99534 -131447 -344518 -302197 -56477 -27488 -110739 -69901 -2622 -83134 -51364 -76073
20873 -76073 -54182 -71563 -114118 -165063 -89727 -208227 -247266 -276107 -346797 -322363 -69178
20862 -69178 96071 22997 -48741 -32963 113790 108828 137137 106294 55673 31770 37007 17972
$$ packed form
20941d71926K0594J47054m0533j39760p1681J401r0519Q1847J16683J44390J16700
20930a85750J8728j19329L0284M246j5685J4550Q9775K2313J81464j18766j47019
20919b25189J2428l0356j43293R6453J43005O6003P7959O2918j0533N172n6381
20908a814q4257L5240N7450P1455q2232j9427K8970P1354M06j39577j54605j03746
20896c20783l8296m5571O9191Q9923Q4653R7471n9156o1305p3665j0432N452J62984
20884i9534l1913k13071M2321K45720K8989q3251M0838O7279q0512L1770k4709
20873g6073K1891j7381m2555n0945P5336j18500l9039k8841p0690K4434K53185
20862f9178J65249p3074p1738J5778J46753m962K8309l0843n0621k3903N237j9035
$$ plain form
20850 17972 -115022 -187431 -157665 13345 -84764 -186266 -218389 -278558 -240940 -137867 -219948
20839 -219948 -214847 -280549 -209803 -40988 94451 -28914 -142536 -200494 -225750 -151939 -84071
20828 -84071 -2298 -13011 82523 -63758 -19198 -39636 -51019 49964 15156 -208 -68768
20817 -68768 -175129 -172049 -72352 65795 3522 -159148 -280671 -315026 -279108 -214928 -225687
20806 -225687 -169857 -90444 -71662 -97628 -127666 -203338 -179424 -106698 3516 47049 -14338
20795 -14338 -138342 -121280 -114381 -96951 -143961 -85544 42155 65540 78482 11112 -163626
20784 -163626 -139310 -95520 30151 112062 51130 -4909 -43768 -119233 -230142 -289142 -152523
20773 -152523 20421 -75287 -139434 6893 28175 -86419 -107411 -106388 -133618 -89159 19724
$$ packed form
20850A7972j32994p2409K9766J71010r8109j01502l2123o0169L7618J03073q2081
20839b19948N101o5702P0746J68815J35439j23365j13622n7958k5256P3811O7868
20828h4071Q1773j0713R5534j46281M4560k0438j1383J00983l4808j5364o8560
20817f8768j06361L080R9697J38147o2273j62670j21523l4355L5918O4180j0759
20806b25687N5830P9413J8782k5966l0038p5672K3914P2726J10214M3533o1387
20795a4338j24004J7062O899J7430m7010N8417J27699K3385J2942o7370j74738
20784a63626K4316M3790J25671Q1911o0932n6039l8859p5465j10909n9000J36619
20773a52523J72944r5708o4147J46327K1282j14594k0992J023k7230M4459J08883
$$ plain form
20762 19724 36144 11298 -14201 24525 -84021 -94786 -134217 -96046 -43706 -31220 -12177
20751 -12177 66029 -58447 -183717 -152306 -158992 -137025 -13478 73738 70883 -5177 -54152
20740 -54152 -44519 -70136 -57183 -42036 -40544 36453 116837 6596 -91358 -93360 54026 37585
20728 37585 8985 -67223 -9356 -15696 -151613 -164317 -8435 67467 18114 54994 -81978
20717 -81978 -149095 -199379 -108809 19123 16588 -43596 -118503 -191719 -291435 -223359 -52682
20706 -52682 92565 63021 -377 -6490 -140062 -211139 -152020 -143831 -124452 -78108 -95039 -45970
20694 -45970 -54509 -76899 -66825 14019 127697 73334 -38330 33865 -52890 -252871 -281899
20683 -281899 -310929 -254415 -75816 -91592 -227893 -349770 -362209 -247969 -101221 -65107
$$ packed form
20762A9724J6420k4846k5499L8726j08546j0765l9431L8171N2340J2486J9043
20751a2177P8206j24476j25270L1411o686K1967J23547Q7216k855p6060m8975
20740e4152R633k5617J2953J5147J492P6997Q0384j10241r7954k002J47386j6441
20728C7585k8600p6208N7867o340j35917j2704J55882P5902m9353L6880j36972
20717h1978o7117n0284R0570J27932k535o0184p4907p3216r9716O8076J70677
20706e2682J45247k9544o3398o113j33572p1077N9119Q189J9379M6344j6931M9069
20694d5970q539k2390J0074Q0844J13678n4363j11664P2195q6755j99981k9028
20683b81899k9030N6514J78599j5776j36301j21877j2439J14240J46748L6114
$$ plain form
20673 -65107 -179413 -297921 -310535 -249953 -196535 -179218 -255452 -277127 -268025 -215048 -101350
20662 -101350 14333 58656 80868 326 -192249 -245426 -219272 -118071 -123572 -186909 -168311
20651 -168311 -85630 -119383 -230531 -74354 103101 148516 49761 -75483 -206982 -173444
20641 -173444 -84263 -36639 -58994 -78378 45616 -10656 -48096 -76486 -148118 -182234 -24993
20630 -24993 65598 142940 191082 127391 31575 35546 -14022 -122644 -37070 -11684 69678 -11822
20618 -11822 -98041 -68580 -123228 -196025 -48612 -53572 -189486 -236459 -247599 -211594 -148615
20607 -148615 -180831 8372 118429 18250 -91928 -53807 -2605 13090 -152516 -251509
20597 -251509 -224787 -80323 -103723 -285930 -180891 -147518 -267682 -302655 -341551 -296759 -233702
$$ packed form
20673f5107j14306j18508j2614O0582N3418J7317p6234k1675R102N2977J13698
20662a01350J15683M4323K2212q0542j92575n3177K6154J01201n501o3337J8598
20651a68311Q2681l3753j11148J56177J77455M5415r8755j25244j31499L3538
20641a73444Q9181M7624k2355j9384J23994n6272l7440k8390p1632l4116J57241
20630b4993R0591P7342M8142o3691r5816L971m9568j08622Q5574K5386Q1362q1500
20618a1822q6219K9461n4648p2797J47413m960j35914m6973j1140L6005O2979
20607a48615l2216J89203J10057j00179j10178L8121N1202J5695j65606r8993
20597b51509K6722J44464k3400j82207J05039L3373j20164l4973l8896M4792O3057
$$ plain form
20586 -233702 -227688 -284295 -165960 -20047 -115333 -127076 66415 81997 -67393 -73143 -230860
20575 -230860 -237771 -181838 -154233 -62001 -80147 -111582 -48072 57129 115651 120262 -36310
20564 -36310 -163559 -211548 -249262 -255744 -257866 -299902 -270034 -232423 -74523 -5493 -59557 -17306
20552 -17306 -30741 -84592 -81908 -60641 -39454 -220894 -274191 -128886 -22553 -112337 -88956
20541 -88956 -91372 -241026 -250168 -169439 -150586 -227215 -285665 -295225 -275678 -300552 -441836 -415325
20529 -415325 -299792 -171756 -108978 -119981 -113770 -81282 -50150 -77739 -59755 -55993 -9487
20518 -9487 46192 -112370 -133300 -142386 -131077 -127256 -70454 16 -82553 -120646 -56387 -29885
20506 -29885 -113370 -145275 -87312 -151043 -278500 -85013 -9805 21249 56344 -238 -44915
$$ packed form
20586b33702O014n6607J18335J45913r5286j1743J93491J5582j49390n750j57717
20575b30860o911N5933K7605R2232j8146l1435O3510J05201N8522M611j56572
20564c6310j27249m7989l7714o482k122m2036K9868L7611J57900O9030n4064M2251
20552a7306j3435n3851K684K1267K1187j81440n3297J45305J06333q9784K3381
20541h8956k416j49654r142Q0729J8853p6629n8450r560J9547k4874j41284K6511
20529d15325J15533J28036O2778j1003O211L2488L1132k7589J7984L762M6506
20518i487N5679j58562k0930r086J1309L821N6802P0470q2569l8093O4259K6502
20506b9885q3485l1905N7963o3731j27457J93487P5208L1054L5095n6582m4677
$$ plain form
20495 -44915 -10399 15935 39260 4420 -102859 -109233 400 -44720 -346283 -338173 -94032
20484 -94032 2224 31036 66408 68560 -178045 -233746 -241070 -302987 -310479 -206872 -152835 -255382
20472 -255382 -231188 -175936 -83434 -41724 -80993 -50129 -152798 -250502 -109938 -105094 -118513
20461 -118513 -77029 -9010 -87826 -328268 -287905 -213534 -156882 -167923 -185899 -182901 -112592
20450 -112592 -155189 -254718 -197160 -87354 -97311 -146676 -278961 -323098 -211013 -228400 -256605
20439 -256605 -253925 -123953 8531 42003 94435 49091 -96534 -32485 32273 31383 107067
20428 107067 91046 34814 29675 27427 38395 -91066 -171123 -101140 -172210 -155304 -174282 -282222
20416 -282222 -236903 -219999 -242716 -254947 -208531 -76480 -36004 70538 40183 -64612 -87287
$$ packed form
20495d4915L4516K6334K3325l4840j07279o374J09633m5120l01563Q110K44141
20484i4032R6256K8812L5372K152k46605n5701p324o1917p492J03607N4037j02547
20472b55382K4194N5252R2502M1710l9269L0864j02669r7704J40564M844j3419
20461a18513M1484O8019p8816k40442M0363P4371N6652j1041j7976K998P0309
20450a12592m2597r9529N7558J09806r957m9365j32285m4137J12085j7387k8205
20439b56605K680J29972J32484L3472N2432m5344j45625O4049O4758q90P5684
20428A07067j6021n6232n139k248J0968j29461q0057O9983p1070J6906j8978j07940
20416b82222M5319J6904k2717j2231M6416J32051M0476J06542l0355j04795k2675
$$ plain form
20405 -87287 -106070 -165457 -171954 -269022 -253198 -197414 -224549 -346601 -383940 -237762 -18433
20394 -18433 44357 -37969 -91393 -74028 -20818 1564 -98444 -169276 -108907 -158687 -184555
20383 -184555 -191736 -207819 -76113 -28210 -42267 73926 29442 2510 32276 -82412 -130904
20372 -130904 -156772 -138131 -125295 -156694 -87916 61 -38709 -168883 -159807 -68042 -90463
20361 -90463 18462 114521 148846 157313 5302 -100465 -167070 -10204 21139 17615 -36253
20350 -36253 -176566 -266839 -259009 -257225 -236296 -170531 -200431 -242550 -170040 -123870 -82873 -128547
20338 -128547 -83527 -80917 -108637 -93412 -98570 -135740 -184354 -168735 -174907 -145902 -168592 -136156
20326 -136156 36374 81412 -62538 -110491 -231786 -186841 -38190 89737 -55400 -80765
$$ packed form
20405h7287j8783n9387o497r7068J5824N5784k7135j22052l7339J46178K19329
20394a8433O2790q2326n3424J7365N3210K2382j00008p0832O0369m9780k5868
20383a84555p181j6083J31706M7903j4057J16193m4484k6932K9766j14688m8492
20372a30904k5868J8641J2836l1399O8778Q7977l8770j30174R076R1765k2421
20361i0463J08925R6059L4325Q467j52011j05767o6605J56866L1343l524n3868
20350c6253j40313r0273P830J784K0929O5765k9900m2119P2510M6170M0997m5674
20338a28547M5020K610k7720J5225n158l7170m8614J5619o172K9005k2690L2436
20326a36156J72530M5038j43950m7953j21295M4945J48651J27927j45137k5365
$$ plain form
20316 -80765 21805 24793 -29142 -59718 -122304 -162534 -369320 -319250 -230810 -171694 -85830
20305 -85830 -95251 -55578 -71293 -176147 -217209 -319684 -277446 -206606 -177530 -35554 -116027
20294 -116027 -129371 -181115 -215627 -149909 -80924 -118666 -90713 -111284 -45356 -98475 -143793
20283 -143793 -209068 -64034 -231452 -98551 43834 206610 206467 71333 -85783 -163337
20273 -163337 -125122 -130189 -103106 -33700 -67321 -26941 47769 50199 -50230 -19001 -70175 -85744
20261 -85744 -179392 -93561 -104908 -88566 -63504 -40645 -95360 -186868 -321379 -303849 -133323
20250 -133323 -59637 -59556 -48663 -72913 -139583 -91186 -14869 25201 39351 95299 -37108 -30105
20238 -30105 16433 51253 24922 -28793 -75027 -64515 3486 142395 99147 -92222 -262123
$$ packed form
20316h0765J02570K988n3935l0576o2586m0230k06786N0070Q8440N9116Q5864
20305h5830r421L9673j5715j04854m1062j02475M2238P0840K9076J41976q0473
20294a16027j3344n1744l4512O5718O8985l7742K7953k0571O5928n3119m5318
20283a43793o5275J45034j67418J32901J42385J62776j43j35134j57116p7554
20273a63337L8215n067K7083O9406l3621M0380P4710K430j00429L1229n1174j5569
20261h5744r3648Q5831j1347J6342K5062K2859n4715r1508j34511J7530J70526
20250a33323P3686Q1J0893k4250o6670M8397P6317M0070J4150N5948j32407P003
20238c0105M6538L4820k6331n3715m6234J0512O8001J38909m3248j91369j69901
$$ plain form
20227 -262123 -129993 -188550 -225488 -179499 -108825 -59991 -42185 46927 -27654 -112463 -183332
20216 -183332 -99092 56816 73235 -45153 -135619 -70036 -103925 -123253 -111026 -148356 -82463
20205 -82463 18537 25789 28887 -152568 -190701 -173494 -138958 -177051 -210730 -102994 -143309
20194 -143309 -204332 -105217 25992 45470 88908 246820 194370 8400 -93770 -118155 -40340
20183 -40340 53002 -6103 -108919 -178438 -150586 -13761 41784 -24142 -80789 -3698 -6913
20172 -6913 1244 -81825 -57215 -230931 -332992 -277785 -183277 -145869 -112885 -8193 25222
20161 25222 -38002 -59074 -81392 14622 16320 -66864 -151141 -101547 -63714 -45136 -169863 -162770
20149 -162770 -84456 -91503 -29054 -130708 -144366 -179972 -298265 -240243 -265575 -225698 -79044
$$ packed form
20227b62123J32130n8557l6938M5989P0674M8834J7806Q9112p4581q4809p0869
20216a83332Q4240J55908J6419j18388r0466O5583l3889j9328J2227l7330O5893
20205h2463J01000P252L098j81455l8133J7207L4536l8093l3679J07736m0315
20194a43309o1023R9115J31209J9478M3438J57912n2450j85970j02170k4385P7815
20183d0340R3342n9105j02816o9519K7852J36825N5545o5926n6647P7091l215
20172f913Q157q3069K4610j73716j02061N5207R4508L7408L2984J04692L3415
20161B5222o3224k1072k2318R6014J698q3184q4277M9594L7833J8578j24727P093
20149a62770P8314p047O2449j01654j3658l5606j18293N8022k5332L9877J46654
$$ plain form
20138 -79044 54242 149544 115541 -19921 -4487 -71077 -45902 -21297 -19868 -99261 -63808
20127 -63808 -54912 -84278 -83312 -90441 -133448 -216947 -175767 -76854 27884 -30509 -7419 36550
20115 36550 -88787 -211563 -181059 -108643 -138214 -226183 -224568 -112840 -144539 -175892 -157926
20104 -157926 -183053 -190777 -95299 -42438 -23635 -65773 66931 79956 -58698 -222563 -210404
20093 -210404 -103293 -132555 -171879 -49303 42021 -8816 -69466 -39393 68814 68714 25899
20082 25899 -45637 -5916 121557 58901 -23170 -91005 -104383 -70920 -22486 -65974 -143724
20071 -143724 -64283 217633 277422 160859 211934 153514 291605 268291 120009 125123 143645
20060 143645 157632 221484 169432 139955 130302 114442 7269 -139938 -153331 -97420 -18793
$$ packed form
20138g9044J33286R5302l4003j35462J5434o6590K5175K4605J429p9393L5453
20127f3808Q896k9366R66p129m3007q3499M1180R8913J04738n8393K3090M3969
20115C6550j25337j22776L0504P2416k9571q7969J615J11728l1699l1353J7966
20104a57926k5127p724R5478N2861J8803m2138J32704J3025j38654j63865J2159
20093b10404J07111k9262l9324J22576R1324n0837o0650L0073J08207j00m2815
20082B5899p1536L9721J27473o2656q2071o7835j3378L3463M8434m3488p7750
20071a43724P9441K81916N9789j16563N1075n8420J38091k3314j48282N114J8522
20060A43645J3987O3852n2052k9477r653j5860j07173j47207j3393N5911P8627
$$ plain form
20049 -18793 100391 53705 29732 -2653 -40892 100685 219076 267228 212258 120280 -12834
20038 -12834 -45528 36405 119556 82547 -46746 -111428 -209354 -74899 77471 93619 7273
20027 7273 -31441 21870 59211 149393 109958 -38248 -221780 -330551 -402851 -276713 -62313
20016 -62313 953 -38019 66949 -8707 -5527 201380 163327 51711 13991 14243 -5633 -110822
20004 -110822 -89487 17674 11810 50834 144645 241774 286165 294457 237302 109922 -37033
19993 -37033 -41387 10320 93783 145102 150643 60983 38732 -86581 -148865 365 43735 -113983
19981 -113983 -217720 -150541 -8777 -49239 35902 9729 -43878 -210618 -169908 -75549 -132001
19970 -132001 -125420 -13502 55699 123765 334647 367635 373015 214577 124885 59458 81187
$$ packed form
20049a8793J19184m6686k3973l2385l8239J41577J18391M8152n4970r1978j33114
20038a2834l2694Q1933Q3151l7009j29293o4682r7926J34455J52370J6148q6346
20027G273l8714N3311L7341R0182l9435j48206j83532j08771p2300J26138K14400
20016f2313O3266l8972J04968p5656L180K06907l8053j11616l7720K52j9876j05189
20004a10822K1335J07161n864L9024R3811R7129M4391Q292n7155j27380j46955
19993c7033m354N1707Q3463N1319N541q9660k2251j25313o2284J49230M3370j57718
19981a13983j03737O7179J41764m0462Q5141k6173n3607j66740M0710R4359n6452
19970a32001O581J11918O9201O8066K10882L2988N380j58438q9692o5427K1729
$$ plain form
19959 81187 112724 149627 232928 179482 248325 39988 -84427 -81207 -93758 46458 90222
19948 90222 102093 190586 185100 84369 75022 84193 76264 88606 39354 65050 204652 331300
19936 331300 260698 187881 96618 66989 -78944 -29479 72625 66722 57577 33195 128007
19925 128007 376351 356287 180548 56902 5567 -50811 224639 296950 227149 83841
19915 83841 -46715 59673 229714 420637 543851 692701 846394 971538 826019 627388
19905 627388 578864 512581 598152 709795 675462 591396 547300 572164 681787 911871 1012835
19894 1012835 1135115 943928 832392 765782 703223 696169 678541 572434 396301 256156
19884 256156 217397 218931 243898 165191 100461 190373 224073 336932 316364 127313 272260
$$ packed form
19959H1187L1537L6903Q3301n3446O8843k08337j24415L220j2551J40216M3764
19948I0222J1871Q8493n486j00731r347R171p929J2342m9252K5696J39602J26648
19936C31300p0602p2817r1263k9629j45933M9465J02104n903r145k4382R4812
19925A28007K48344k0064j75739j23646n1335n6378K75450P2311o9801j43308
19915H3841j30556J06388J70041J90923J23214J48850J53693J25144j45519j98631
19905F27388m8524o6283Q5571J11643l4333q4066m4096K4864J09623K30084J00964
19894A012835J22280j91187j11536o6610o2559p054j7628j06107j76133j40145
19884B56156l8759J534K4967p8707o4730Q9912L3700J12859k0568j89051J44947
$$ plain form
19873 272260 396549 455436 431043 398909 228011 144599 196921 342029 356532 279428 234865
19862 234865 264660 237815 227711 366608 456282 694744 845153 862421 987027 1109000
19852 1109000 1220916 1167647 1304022 1365158 1230291 1090575 1013061 973871 980412 921181 937543
19841 937543 969189 870273 729175 514083 359999 292261 283414 288799 232261 197738 58771
19830 58771 38270 -57163 -29301 64093 2836 97689 155097 283477 208350 151648 285130
19819 285130 404928 354835 206946 55791 146749 174877 177538 313083 199673 118483 63995
19808 63995 146101 129567 77256 199692 96595 -17924 108399 323601 250147 213407 318564
19797 318564 196062 185556 135703 12886 -18477 -45438 -86197 78061 187622 90392 94409
$$ packed form
19873B72260J24289N8887k4393l2134j70898q3412N2322J45108J4503p7104m4563
19862B34865K9795k6845j0104J38897Q9674K38462J50409J7268J24606J21973
19852A109000J11916n3269J36375O1136j34867j39716p7514l9190O541n9231J6362
19841I37543L1646r8916j41098k15092j54084o7738q847N385n6538l4523j38967
19830E8771k0501r5433K7862R3394o1257R4853N7408J28380p5127n6702J33482
19819B85130J19798n0093j47889j51155R0958K8128K661J35545j13410q1190n4488
19808F3995Q2106j6534n2311J22436j03097j14519J26323K15202p3454l6740J05157
19797C18564j22502j0506m9853j22817l1363k6961m0759J64258J09561r7230M017
$$ plain form
19786 94409 192069 218893 159746 160357 259654 297748 141211 96851 225350 343060 370230
19775 370230 406219 343466 305920 366172 372684 233773 24988 -133414 -51823 99299 215098
19764 215098 27026 -157887 -85547 18382 -82159 -33011 -33765 99365 104654 -42164 -128612
19753 -128612 -44078 51641 146392 113805 164701 136817 210020 321145 364200 289799 229765
19742 229765 58058 39622 148885 113297 34426 -38160 -57316 -62322 -103736 -156972 17400
19731 17400 201671 240682 159932 127979 30066 -4161 93354 197639 74823 -19386 133853
19720 133853 152798 196194 263597 214943 56514 72680 153966 191905 119540 108810 30267
19709 30267 6192 217619 218833 194471 305455 283874 148336 65910 93201 168098 252269
$$ packed form
19786I4409R7660K6824n9147O11R9297L8094j56537m4360J28499J17710K7170
19775C70230L5989o2753l7546O0252O512j38911k08785j58402Q1591J51122J15799
19764B15098j88072j84913P2340J03929j00541M9148p54J33130N289j46818q6448
19753a28612Q4534R5719R4751l2587N0896k7884P3203J11125M3055p4401o0034
19742B29765j71707j8436J09263l5588p8871p2586j9156n006m1414n3236J74372
19731A7400J84271L9011q0750l1953r7913l4227R7515J04285j22816r4209J53239
19720A33853J8945M3396O7403m8654j58429J6166Q1286L7939p2365j0730p8543
19709C0267k4075K11427J214k4362J10984k1581j35538q2426K7291P4897Q4171
$$ plain form
19698 252269 344082 337374 258982 272086 272772 328594 206354 96427 129279 207705 201516 190953
19686 190953 182634 328068 353603 199374 261118 319343 142915 59263 -3450 24471 22207
19675 22207 76987 108729 169059 136708 10653 -81510 -12359 -163547 -211166 -176009 -214422
19664 -214422 -244928 -101339 -43771 -106687 19518 15523 77068 136983 166302 171067 173096 287121
19652 287121 313803 266159 209493 167313 246414 260554 339395 502851 571652 686799 702604
19641 702604 635724 670147 702723 607532 538171 394923 174885 140743 159582 161047 244926
19630 244926 336689 288047 228217 179536 95158 82334 152097 94406 117636 116790 143295 171942
19618 171942 256027 282430 209961 154630 93449 134851 208858 253818 277164 277197 125853 143583
$$ packed form
19698B52269R1813o708p8392J3104O86N5822j22240j09927L2852P8426o189j0563
19686A90953q319J45434K5535j54229O1744N8225j76428q3652o2713K7921k264
19675B2207N4780L1742O0330l2351j26055r2163O9151j51188m7619L5157l8413
19664b14422l0506J43589N7568o2916J26205l995O1545N9915K9319M765K029J14025
19652B87121K6682m7644n6666m2180P9101J4140P8841J63456O8801J15147J5805
19641G02604o6880L4423L2576r5191o9361j43248k20038l4142J8839J465Q3879
19630B44926R1763m8642n9830m8681q4378j2824O9763n7691K3230q46K6505K8647
19618A71942Q4085K6403p2469n5331o1181M1402P4007M4960K3346L3j51344J7730
$$ plain form
19606 143583 216400 277806 354013 294449 278272 357411 350557 257149 237878 101945 130300
19595 130300 223188 359199 332721 176547 190840 348704 335021 373639 383361 202643 114015
19584 114015 76017 47207 12426 38294 120410 214838 272323 231355 134939 11548 14680
19573 14680 104526 131141 344700 381869 357595 309099 124609 146460 248493 155557 103939
19562 103939 224361 175235 91735 198656 251068 361691 401703 453868 474821 369696 194062
19551 194062 144523 391508 492098 445999 376544 402589 453232 371178 232439 298949 329498
19540 329498 492037 643296 747376 802424 628915 567718 381928 340975 302166 262432
19530 262432 297462 215222 261457 282098 241465 259941 302554 351998 371698 386922 372279
$$ packed form
19606A43583P2817O1406P6207n9564j6177P9139o854r3408j9271j35933K8355
19595A30300R2888J36011k6478j56174J4293J57864j3683L8618R722j80718q8628
19584A14015l7998k8810l4781K5868Q2116R4428N7485m0968r6416j23391L132
19573A4680Q9846K6615K13559L7169k4274m8496j84490K1851J02033r2936n1618
19562A03939J20422m9126q3500J06921N2412J10623M0012N2165K0953j05125j75634
19551A94062m9539K46985J00590m6099o9455K6045N0643q2054j38739O6510L0549
19540C29498J62539J51259J04080N5048j73509o1197j85790m0953l8809l9734
19530B62432L5030q2240M6235K0641m0633J8476M2613M9444J9700J5224j4643
$$ plain form
19519 372279 449265 547046 482751 506641 574903 732502 821085 826590 745918 660207 577873
19508 577873 699782 719997 510870 408582 348142 389421 335311 343330 454838 428853 363057
19497 363057 433229 609716 558506 345047 361939 469351 599184 759667 840625 729565
19487 729565 772942 901123 774886 584118 617863 718498 746689 748709 812354 853165 940059
19476 940059 916059 832179 814320 801317 877311 909554 1006518 960199 942489 912992 868458
19465 868458 918171 986318 1079626 1121171 1276234 1285344 1175599 1114067 1055174 1017649 1070225
19454 1070225 1049278 1100089 1048148 1061115 946312 1017384 1117442 1152455 1110293 1059583 1148337
19443 1148337 1159451 1168710 1269123 1384875 1493446 1575722 1600260 1730443 1776710 1720918 1730874
$$ packed form
19519C72279P6986R7781o4295K3890O8262J57599Q8583N505q0672q5711q2334
19508E77873J21909K0215k09127j02288o0440M1279n4110Q019J11508k5985o5796
19497C63057P0172J76487n1210k13459J6892J07412J29833J60483Q0958j11060
19487G29565M3377J28181j26237j90768L3745J00635K8191K020O3645M0811Q6894
19476I40059k4000q3880j7859j3003P5994L2243R6964m6319j7710k9497m4534
19465H68458M9713O8147R3308M1545J55063R110j09745o1532n8893l7525N2576
19454A070225k0947N0811n1941J2967j14803P1072J00058L5013m2162n0710Q8754
19443A148337J1114R259J00413J15752J08571Q2276K4538J30183M6267n5792R956
$$ plain form
19432 1730874 1741911 1817867 1854985 1959263 2097703 2231189 2308453 2451351 2715240 2975766
19422 2975766 3100541 3293708 3514628 3814598 4075024 4473763 5094856 5706671 6333346
19413 6333346 7068959 7516203 7924936 8539607 9176053 10059914 10990764 12277646 14153033
19404 14153033 16811256 20561871 25626650 31917474 38357143 42620243 43319426 42244471
19396 42244471 42335238 45102873 51428116 62384825 79804710 105868029 143028918 192111654
19388 192111654 241472879 261846904 246634655 224537243 207095556 179792681 143151434
19381 143151434 112337976 93403315 84533977 82832262 85894843 91071902 92785432 86118071
19373 86118071 72514848 57901933 46034491 37422662 31156505 26870739 23948102 21823504
$$ packed form
19432A730874J1037P5956L7118J04278J38440J33486P7264J42898K63889K60526
19422B975766J24775J93167K20920K99970K60426L98739O21093O11815O26675
19413F333346P35613M47244M08733O14671O36446Q83861R30850J286882J875387
19404A4153033K658223L750615N064779O290824O439669M263100O99183j074955
19396D2244471R0767K767635O325243J0956709J7419885K6063319L7160889M9082736
19388A92111654M9361225K0374025j5212249k2097412j7441687k7302875l6641247
19381A43151434l0813458j8934661q869338j701715L062581N177059J713530o667361
19373H6118071j3603223j4612915j1867442q611829o266157m285766k922637k124598
$$ plain form
19365 21823504 20777772 20147613 19798553 19615301 19584784 19675321 19881365 20298753 20729469
19356 20729469 21233812 22166412 23984753 26503151 30003932 35501295 43064344 53338100
19348 53338100 66373205 81442985 94875409 100570117 97648386 91938157 89531061 93408920
19340 93408920 105190476 127076107 161352604 208018108 254936453 284529827 304820377
19333 304820377 320395849 301707928 241598487 175788300 127292300 96437526 77707250
19326 77707250 66677641 60747004 58584322 59244108 60658984 58813687 51725605 42234809
19318 42234809 33689790 27084439 22518080 19228948 16809551 15151732 13764871 12599719
19310 12599719 11735136 11070521 10293881 9406245 8402178 7646794 6802813 5990469 5447671
$$ packed form
19365B1823504j045732o30159l49060j83252l0517R0537K06044M17388M30716
19356B0729469N04343R32600J818341K518398L500781N497363P563049J0273756
19348E3338100J3035105J5069780J3432424N694708k921731n710229k407096L877859
19340I3408920J1781556K1885631L4276497M6665504M6918345K9593374K0290550
19333C04820377J5575472j8687921o0109441o5810187m8496000l0854774j8730276
19326G7707250j1029609n930637k162682O59786J414876j845297p088082r490796
19318D2234809q545019o605351m566359l289132k419397j657819j386861j165152
19310A2599719q64583o64615p76640q87636j004067p55384q43981q12344n42798
$$ plain form
19301 5447671 5054728 4680849 4378714 4182243 3938747 3609425 3223473 3029080 2937538 2904240
19291 2904240 2748997 2483648 2267233 2139841 2114826 1998689 1836110 1779300 1867100 1932489
19281 1932489 1849611 1795145 1726394 1658540 1602453 1557736 1502219 1374054 1404876 1446180 1414849
19270 1414849 1314001 1319828 1296736 1111476 1043932 1148641 1186903 1173132 1050072 921274
19260 921274 905174 821608 820258 814297 681529 612186 644243 740344 768917 727306 665279 659266
19248 659266 728186 640283 639307 688820 660404 567641 538831 543445 404865 325742 323794 327871
19236 327871 322957 298925 239332 276997 245504 360369 448216 510551 555722 552039 425795
19225 425795 342085 473171 482996 552919 671686 747131 637687 501184 460520 461807 440959
$$ packed form
19301E447671l92943l73879l02135j96471k43496l29322l85952j94393r1542l3298
19291B904240j55243k65349k16415j27392k5015j16137j62579n6810Q7800O5389
19281A932489q2878n4466o8751o7854n6087m4717n5517j28165L0822M1304l1331
19270A414849j00848N827k3092j85260o7544J04709L8262j3771j23060j28798
19260I21274j6100q3566j350n961j32768o9343L2057R6101K8573m1611o2027o013
19248F59266O8920q7903r76M9513k8416r2763k8810M614j38580p9123j948M077
19236C27871m914k4032n9593L7665l1493J14865Q7847O2335M5171l683j26244
19225D25795q3710J31086R825O9923J18767P5445j09444j36503m0664J287k0848
$$ plain form
19214 440959 501445 703759 880126 867806 776076 528410 519874 501110 401712 321207 459128
19203 459128 621907 549858 560303 646812 525759 510545 530382 471350 294079 252931 264420
19192 264420 187959 134123 320529 450491 340211 115426 94049 15769 -127397 -70686
19182 -70686 -55566 -24315 -33428 108588 184713 296052 544544 573861 479850 283151 273441
19171 273441 401840 380748 354609 445423 460006 538584 771242 839266 819224 728818 606494
19160 606494 622564 616969 620366 701786 714080 748758 679743 663289 703669 708064 726692 867528
19148 867528 881233 793278 664746 674839 602483 616715 682120 653023 602923 446949 364810
19137 364810 398630 389438 439041 511556 603128 580558 522828 576967 580357 593925 528463 452416
$$ packed form
19214D40959O0486K02314J76367j2320r1730k47666q536j8764r9398q0505J37921
19203D59128J62779p2049J0445Q6509j21053j5214J9837n9032j77271m1148J1489
19192B64420p6461n3836J86406J29962j10280k24785k1377p8280j43166N6711
19182g0686J5120L1251r113J42016P6125J11339K48492K9317r4011j96699r710
19171B73441J28399k1092k6139R0814J4583P8578K32658O8024k0042r0406j22324
19160F06494J6070n595L397Q1420J2294L4678o9015j6454M0380M395J8628J40836
19148H67528J3705q7955j28532J0093p2356J4232O5405k9097n0100j55974q2139
19137C64810L3820r192M9603P2515R1572k2570n7730N4139L390J3568o5462p6047
$$ plain form
19125 452416 472709 584997 563434 522864 437402 334011 331913 426962 482037 455423 444955
19114 444955 327583 221731 259898 334095 451689 359821 215217 212830 367642 544182
19104 544182 620464 671818 823438 850237 729425 568330 555125 525679 537398 616254 550980
19093 550980 444531 298361 297415 317447 371833 503439 601789 541800 439763 266245 302376
19082 302376 375769 448673 578895 591116 375469 241137 81224 113579 226887 259401
19072 259401 274179 204074 113007 248923 408736 483085 431644 346673 329828 400067 444716
19061 444716 527215 568817 485254 498812 330681 462676 502703 425348 396932 464730 469645
19050 469645 581010 591541 494161 476137 511524 498809 539528 531889 554804 491092 419141
$$ packed form
19125D52416K0293J12288k1563m0570q5462j03391k098R5049N5075k6614j0468
19114D44955j17372j05852L8167P4197J17594r1868j44604k387J54812J76540
19104E44182P6282N1354J51620K6799j20812j61095j3205k9446J1719P8856o5274
19093E50980j06449j46170r46K0032N4386J31606R8350n9989j02037j73518L6131
19082C02376P3393P2904J30222J2221k15647j34332j59913L2355J13308L2514
19072B59401J4778p0105r1067J35916J59813P4349n1441q4971j6845P0239M4649
19061D44716Q2499M1602q3563J3558j68131J31995M0027p7355k8416O7798M915
19050D69645J11365J0531r7380j8024L5387j2715M0719p639K2915o3712p1951
$$ plain form
19039 419141 452343 394192 360732 370890 514965 602218 476981 476761 589300 599563 426498
19028 426498 216619 227685 219223 127054 107972 118813 219957 419902 473240 567377 599588
19017 599588 629503 692497 694856 733298 548360 438499 526831 532148 516776 412324 382069
19006 382069 459283 448127 494039 456110 480472 579587 584194 542161 581907 571942 617088 702010
18994 702010 671514 603803 667057 734293 764239 749747 693225 773477 817528 717666 662993
18983 662993 763113 802536 896465 931547 929699 933314 926984 892097 804216 892808 891340 929304
18971 929304 947760 867653 840126 881996 901289 994843 1108304 1025068 1023353 1050509 953529
18960 953529 934130 1098084 1208338 1108080 1016049 942863 972841 1029592 1072003 1089172 959500
$$ packed form
19039D19141L3202n8151l3460J0158J44075Q7253j25237k20J12539J0263j73065
19028D26498k09879J1066q462r2169j9082J0841J01144J99945N3338R4137L2211
19017E99588K9915O2994K359L8442j84938j09861Q8332N317j5372j04452l0255
19006C82069P7214j1156M5912l7929K4362R9115M607m2033L9746r965M5146Q4922
18994G02010l0496o7711O3254O7236K9946j4492n6522Q0252M4051r9862n4673
18983F62993J00120L9423R3929L5082j848L615o330l4887q7881Q8592j468L7964
18971I29304J8456q0107k7527M1870J9293R3554J13461q3236j715K7156r6980
18960I53529j9399J63954J10254j00258r2031p3186K9978N6751M2411J7169j29672
$$ plain form
18949 959500 930848 1027334 1102145 1103831 1053230 952080 973919 962047 1014004 1110245 965675
18938 965675 866811 930446 1081203 973026 936988 721512 844991 957145 989179 1030663
18928 1030663 985469 925584 979005 1007173 982812 1031763 1026917 1115759 1080143 1107856 1164038
18917 1164038 1136568 1097351 1042470 1035486 974023 946812 981645 999489 988553 1099306 1259946
18906 1259946 1281450 1262797 1309852 1289649 1354798 1445653 1398094 1344353 1430529 1471045 1577557
18895 1577557 1502566 1483516 1538625 1605545 1560033 1406032 1405959 1447784 1502565 1641517 1700012
18884 1700012 1756203 1801805 1990150 2087373 1983571 2100835 2148698 2137904 2122138 2123079 2168191
18873 2168191 2243480 2403075 2545805 2565806 2669479 2771931 2908030 3065853 3113144 3224389
$$ packed form
18949I59500k8652R6486P4811J686n0601j01150K1839j1872N1957R6241j44570
18938I65675r8864O3635J50757j08177l6038k15476J23479J12154L2034M1484
18928A030663m5194n9885N3421K8168k4361M8951m846Q8842l5616K7713N6182
18917A164038k7470l9217n4881o984o1463k7211L4833J7844j0936J10753J60640
18906A259946K1504j8653M7055k0203O5149R0855m7559n3741Q6176M0516J06512
18895A577557p4991j9050N5109O6920m5512j54001p3M1825N4781J38952N8495
18884A700012N6191M5602J88345R7223j03802J17264M7863j0794j5766R41M5112
18873B168191P5289J59595J42730K0001J03673J02452J36099J57823M7291J11245
$$ plain form
18863 3224389 3367501 3559529 3674997 3982650 4478360 4748462 5111773 5670033 6154059
18854 6154059 6694961 7270080 7709161 8307042 9076224 9844889 10896117 12428411 14463540
18845 14463540 16880883 19854578 23690899 27901514 31436384 33400159 34316598 35639687
18837 35639687 38571249 44205553 53094418 66291990 84739841 109148352 137979299
18830 137979299 163390208 174814250 171725973 163200977 153277131 141469278 131678046
18823 131678046 129277762 136437837 152910406 175825874 195988750 201716158 193080389
18816 193080389 177611450 156579951 130242467 104962476 85984875 73664149 66490429
18809 66490429 63251958 62526158 62668467 61443657 57148318 50163382 42782590 36552580
$$ packed form
18863C224389J43112J92028J15468L07653M95710K70102L63311N58260M84026
18854F154059N40902N75119M39081N97881P69182P68665J051228J532294K035129
18845A4463540K417343K973695L836321M210615L534870J963775R16439J323089
18837C5639687K931562N634304Q888865J3197572J8447851K4408511K8830947
18830A37979299K5410909J1424042l088277q524996r923846j1807853r791232
18823A31678046k400284P160075J6472569K2915468K0162876N727408q635769
18816A93080389j5468939k1031499k6337484k5279991j8977601j2320726p173720
18809F6490429l238471p25800J42309j224810m295339o984936p380792o230010
$$ plain form
18801 36552580 31853798 28590074 26285920 24852972 24239999 24099455 24247357 24836597 26224285
18792 26224285 28784041 32614356 37702821 43749765 49772563 53741127 54662526 54250385
18784 54250385 55053882 58761320 66431071 79115904 97195239 118908196 138567356 152371009
18776 152371009 162192116 166931267 160233269 142869529 124922071 114165245 112137633
18769 112137633 117476212 126602908 133900619 138128352 141668237 141366266 129255713 106554795
18761 106554795 82797248 64077690 50916138 42005238 36188946 32592211 30672047
18754 30672047 29597656 28765025 27300992 24436285 20828872 17459265 15032629 13155195
18746 13155195 11714390 10762335 9951378 9245930 8452812 7814451 7478362 7200074 6598217
$$ packed form
18801C6552580m698782l263724k304154j432948o12973j40544J47902N89240J387688
18792B6224285K559756L830315N088465O046944O022798L968564R21399m12141
18784E4250385Q03497L707438P669751J2684833J8079335K1712957J9659160J3803653
18776A52371009R821107M739151o697998j7363740j7947458j0756826k027612
18769A12137633N338579R126696P297711M227733L539885l01971j2110553k2700918
18761A06554795k3757547j8719558j3161552q910900n816292l596735j920164
18754C0672047j074391q32631j464033k864707l607413l369607k426636j877434
18746A3155195j440805r52055q10957p05448p93118o38361l36089k78288o01857
$$ plain form
18737 6598217 6195964 5946497 5557088 5282112 5189264 5196176 5071807 4938706 4925501 4892043
18727 4892043 4980481 4859948 4934664 5067305 4979325 4889090 4977414 5088463 5263137 5440540
18717 5440540 5613727 5901008 6118639 6394977 7040868 7907618 9160422 10958448 13502001
18708 13502001 17205426 22259472 28608588 35113173 39428805 40824041 40081183 37408438
18700 37408438 33161753 29064045 26733659 26612865 29014681 33749169 40487158 46921438
18692 46921438 49628906 47997567 43215438 36223637 28830662 22811194 18358469 15197339
18684 15197339 13019613 11495379 10301441 9586374 9052394 8704889 8419149 8126682 8053639
18675 8053639 8020666 7992287 8273467 8381529 8544546 8861458 9203866 9584204 10218905 11079764
$$ packed form
18737F598217m02253k49467l89409k74976r2848O912j24369j33101j3205l3458
18727D892043Q8438j20533P4716J32641q7980r0235Q8324J11049J74674J77403
18717E440540J73187K87281K17631K76338O45891Q66750J252804J798026K543553
18708A3502001L703425N054046O349116O504585M315632J395236p42858k672745
18700C7408438m246685m097708k330386j20794K401816M734488O737989O434280
18692D6921438K707468j631339m782129o991801p392975o019468m452725l161130
18684A5197339k177726j524234j193938p15067n33980l47505k85740k92467p3043
18675H053639l2973k8379K81180J08062J63017L16912L42408L80338O34701Q60859
$$ plain form
18665 11079764 12356060 14250569 16812837 20379129 25290653 32202782 41423448 52813830
18657 52813830 64820435 74938240 82237473 85115298 80864645 70601363 59828337
18650 59828337 52611994 49947956 51420285 56873407 65842083 76143998 84765810 90560028
18642 90560028 93082506 90300322 81962438 71222052 60281045 50014130 41375903 34411471
18634 34411471 28622494 24054347 20577802 17826720 15887466 14561341 13678248 13050585
18626 13050585 12595547 12401862 12698805 13379496 14208772 14700883 14162990 12964756 11692075
18617 11692075 10739906 10143202 10057329 10159867 10549871 11098271 12051355 13353722 15367977
18608 15367977 18112318 22096353 27579574 34849566 43257221 50786464 53647033 50298931
$$ packed form
18665A1079764J276296J894509K562268L566292M911524O912129R220666J1390382
18657E2813830J2006605J0117805P299233K877825m250653j0263282j0773026
18650E9828337p216343k664038J472329N453122Q968676J0301915Q621812N794218
18642I0560028K522478k782184q337884j0740386j0941007j0266915q638227o964432
18634C4411471n788977m568147l476545k751082j939254j326125q83093o27663
18626A3050585m55038j93685K96943O80691Q29276M92111n37893j198234j272681
18617A1692075r52169n96704q5873J02538L90004N48400R53084J302367K014255
18608A5367977K744341L984035N483221P269992Q407655P529243K860569l348102
$$ plain form
18600 50298931 43500245 37706451 35064885 35748797 39727487 46683445 55011579 60913943
18592 60913943 61040750 55861380 47522479 38049023 29440495 22715217 17825856 14426511
18584 14426511 11985090 10315568 9082646 8149310 7286904 6584983 5987199 5566550 5138423
18575 5138423 4861851 4481373 4261657 4055984 3770735 3553526 3487656 3475969 3293211 3264920
18565 3264920 3194401 2999974 2985026 3015670 3165210 3234480 3226610 3203919 3090239 3162203 3375576
18554 3375576 3632476 3939542 4430889 5198376 6310088 7913219 10249342 13223769 16625504
18545 16625504 19053533 18677923 16061443 13192965 11085896 9848035 9621095 9994363
18537 9994363 11085846 12991097 15771662 18668750 19720615 17681461 14028762 10982281
$$ packed form
18600E0298931o798686n793794k641566O83912L978690O955958Q328134N902364
18592F0913943J26807n179370q338901r473456q608528o725278m889361l399345
18584A4426511k441421j669522j232922r33336q62406p01921n97784m20649m28127
18575E138423k76572l80478k19716k05673k85249k17209o5870j1687j82758k8291
18565C264920p0519j94427j4948L0644J49540O9270p870k2691j13680P1964K13373
18554C375576K56900L07066M91347P67487J111712J603131K336123K974427L401735
18545A6625504K428029l75610k616480k868478k107069j237861k26940L73268
18537I994363J091483J905251K780565K897088J051865k039154l652699l046481
$$ plain form
18529 10982281 8840999 7393049 6483803 5995192 5697525 5343112 5263004 5262471 5416612 5758196
18519 5758196 6343303 7129118 8217345 9873169 12269615 15538765 19363709 22102864
18511 22102864 21880593 19173444 16378310 14893758 14497777 15276666 17384056 21008514
18503 21008514 26418913 33944729 42712862 48887176 47833879 41536287 35429234 32087280
18495 32087280 31761912 34019237 37855562 41049723 41747704 40758345 39798136 39112774 37305175
18486 37305175 34066192 31336494 30573664 32129189 35157434 37517186 36210456 31232573
18478 31232573 25500312 21197729 18321384 16460384 15381087 15044969 15137883 15858771 17515980
18469 17515980 20239971 24241900 29894520 37481900 46073112 52264833 53329917 50685419
$$ packed form
18529A0982281k141282j447950r09246m88611k97667l54413q0108n33J54141L41584
18519E758196N85107P85815J088227J655824K396446L269150L824944K739155
18511B2102864k22271k707149k795134j484552l95981P78889K107390L624458
18503B1008514N410399P525816Q768133O174314j053297o297592o107053l341954
18495C2087280l25368K257325L836325L194161O97981r89359r60209o85362j807599
18486C7305175l238983k729698p62830J555525L028245K359752j306730m977883
18478C1232573n732261m302583k876345j861000j079297l36118R2914P20888J657209
18469A7515980K723991M001929N652620P587380Q591212O191721J065084k644498
$$ plain form
18461 50685419 46496396 42282161 39177637 38028469 38584396 39057144 37416527 34402309
18453 34402309 32514752 33129874 36435531 42590013 51521589 62225397 70667129 71407183
18445 71407183 63706646 52461126 42717531 36165397 32626521 31605842 32947443 36465472
18437 36465472 41346823 45974375 47174802 43108184 35776296 28708094 23357527 19654584
18429 19654584 17312134 15590733 14367178 13412328 12829813 12768203 12965851 13432407 14521221
18420 14521221 16254234 18948275 22940022 28275280 35085709 42241379 46910039 45593728
18412 45593728 39456019 32369390 26876273 23415787 21777910 21889167 23545253 26787955
18404 26787955 31180694 36195423 39419426 37623272 31458996 24329868 18410078 14286513
$$ packed form
18461E0685419m189023m214235l104524j149168N55927M72748j640617l014218
18453C4402309j887557O15122L305657O154482Q931576J0703808Q441732P40054
18445G1407183p700537j1245520r743595o552134l538876j020679J341601L518029
18437C6465472M881351M627552J200427m066618p331888p068202n350567l702943
18429A9654584k342450j721401j223555r54850n82515o1610J97648M66556J088814
18420A4521221J733013K694041L991747N335258O810429P155670M668660j316311
18412D5593728o137709p086629n493117l460486j637877J11257J656086L242702
18404B6787955M392739N014729L224003j796154o164276p129128n919790m123565
$$ plain form
18396 14286513 11514658 9580139 8155354 7119001 6339478 5646916 5099061 4728457 4415341
18387 4415341 4111917 3677429 3488185 3305771 3075329 3017644 3009973 2917831 2930560 2850810
18377 2850810 2726344 2658143 2524391 2391372 2613311 2791350 2804929 2728757 2904683 2813615
18367 2813615 2664718 2495857 2483808 2596434 2720015 2858226 2852653 2952481 3039475 3157325
18357 3157325 3501206 3743216 3931579 4212681 4431544 4663653 4900133 5404864 6012248
18348 6012248 6756124 7618982 8623174 10015321 11865272 14413731 18323341 23656059
18340 23656059 30621599 38929275 47119777 53584380 58011385 59687586 58453111 56990582
18332 56990582 59116745 65819403 75146683 82095033 82937838 78289029 69294193 56819894
$$ packed form
18396A4286513k771855j934519j424785j036353p79523o92562n47855l70604l13116
18387D415341l03424m34488j89244j82414k30442n7685p671r2142J2729p9750
18377B850810j24466o8201j33752j33019K21939J78039J3579p6172J75926r1068
18367B813615j48897j68861j2049J12626J23581J38211n573R9828Q6994J17850
18357C157325L43881K42010J88363K81102K18863K32109K36480N04731O07384
18348F012248P43876Q62858J004192J392147J849951K548459L909610N332718
18340B3656059O965540Q307676Q190502O464603M427005J676201j234475j462529
18332E6990582K126163O702658R327280O948350Q42805m648809q994836j2474299
$$ plain form
18324 56819894 44279349 34564746 27592113 22707289 19291433 16976127 15393769 14342496
18316 14342496 13673262 13185089 12762183 12480815 12341388 12155358 12193649 12556450 13071390
18307 13071390 13918759 15197194 17094382 19511630 23082272 28430141 35881647 46228620
18299 46228620 58521206 70371536 78792591 81727951 78368347 72685991 70319360 73608778
18291 73608778 81664858 91678111 98531218 98658942 93330385 86023407 79325734 73663469
18283 73663469 68132660 61406468 54161055 48877261 47008796 48176758 51224813 53823182
18275 53823182 54160719 52136445 48319650 44372190 42325347 43148894 47014793 54109032
18267 54109032 63936882 74258140 79900672 77836661 71801543 67504234 67907607 73393520
$$ packed form
18324E6819894j2540545r714603o972633m884824l415856k315306j582358j051273
18316A4342496o69234m88173m22906k81368j39427j86030L8291L62801N14940
18307A3071390Q47369J278435J897188K417248L570642N347869P451506J0346973
18299D6228620J2292586J1850330Q421055K935360l359604n682356k366631L289418
18291G3608778Q056080J0013253O853107J27724n328557p306978o697673n662265
18283G3663469n530809o726192p245413n283794j868465J167962L048055K598369
18275E3823182L37537k024274l816795l947460k046843Q23547L865899P094239
18267E4109032R827850J0321258N642532k064011o035118m297309M03373N485913
$$ plain form
18259 73393520 83574133 95751749 103593607 102304239 95423316 90892934 93897893 104869644
18251 104869644 118464381 126735867 129779123 130509398 126066836 114868940 103035885 96924228
18243 96924228 97224683 98381144 94698464 86963518 76828047 63978621 50396156 39276101
18235 39276101 31489177 26141813 22255393 19646031 17806068 16385387 15257165 14581322
18227 14581322 13983117 13602713 13482023 13498401 13742232 14325958 15207457 16826113 19317397
18218 19317397 22821395 27640138 33951212 40972346 46575799 49510320 49525531 46759997
18210 46759997 43586615 42924872 46227632 53394957 63538994 74390228 84172761 88803504
18202 88803504 81279136 65197031 50521465 41493461 37601916 37739130 41110748 46310413
$$ packed form
18259G3393520J0180613J2177616P841858j289368o880923m530382L004959J0971751
18251A04869644J3594737Q271486L043256P30275m442562j1197896j1833055o111657
18243I6924228L00455J156461l682680p734946j0135471j2849426j3582465j1120055
18235C9276101p786924n347364l886420k609362j839963j420681j128222o75843
18227A4581322n98205l80404j20690J6378K43831N83726Q81499J618656K491284
18218A9317397L503998M818743O311074P021134N603453K934521J5211k765534
18210D6759997l173382o61743L302760P167325J0144037J0851234R782533M630743
18202H8803504p524368j6082105j4675566r028004l891545J37214L371618N199665
$$ plain form
18194 46310413 48464458 42937374 33140389 24530744 18620747 14828651 12222663 10271055
18186 10271055 8839048 7699440 6885370 6237231 5709914 5258719 4944082 4587855 4196791
18177 4196791 4009132 3781718 3571018 3327364 3053029 2837327 2703562 2755757 2802457 2663260
18167 2663260 2347554 2194592 2079547 1988313 1808561 1738025 1608007 1519299 1428690 1410352
18157 1410352 1311905 1276304 1351434 1322911 1174224 1099469 932689 832336 834122 798866 810969
18146 810969 765936 682783 526518 573599 524808 525656 429475 552299 678484 933497 1084362
18135 1084362 977074 882783 918941 773009 630956 582141 753218 807490 821272 687189
18125 687189 604234 677761 622154 523599 712502 849715 808233 837865 731871 611156 446899
$$ packed form
18194D6310413K154045n527084r796985q609645n909997l792096k605988j951608
18186A0271055j432007j139608q14070o48139n27317m51195l14637l56227l91064
18177D196791j87659k27414k10700k43654k74335k15702j33765N2195M6700j39197
18167B663260l15706j52962j15045r1234j79752p0536j30018q8708r0609j8338
18157A410352r8447l5601P5130k8523j48687p4755j66780j00353J786l5256J2103
18146H10969m5033q3153j56265M7081m8791Q48r6181J22824J26185K55013J50865
18135A084362j07288r4291L6158j45932j42053m8815J71077N4272J3782j34083
18125F87189q2955P3527n5607r8555J88903J37213m1482K9632j05994j20715j64257
$$ plain form
18114 446899 336419 304235 352981 298653 229229 276170 416626 574779 573552 411780 287818
18103 287818 264794 366727 266558 222405 267223 375382 321903 315356 319841 220866 190565
18092 190565 303622 450110 442352 362186 463863 508226 474512 387323 394516 443275 551082
18081 551082 579034 492429 313025 291659 321583 432345 590599 712215 635468 481113
18071 481113 404641 470402 343556 249443 296500 316527 369984 437132 314323 204855 218470
18060 218470 234919 215666 217262 188521 177952 129284 171717 138582 197884 195161 104196 77939
18048 77939 171866 303683 266090 139767 146056 278511 262564 304904 266539 206515 197473
18037 197473 197833 252116 222508 291124 317486 393721 351803 236289 43468 140179 210362
$$ packed form
18114D46899j10480l2184M8746n4328o9424M6941J40456J58153j227j61772j23962
18103B87818k3024J01933j00169m4153M4818J08159n3479o547M485r8975l0301
18092A90565J13057J46488p758q0166J01677M4363l3714q7189P193M8759J07807
18081E51082K7952q6605j79404k1366K9924J10762J58254J21616p6747j54355
18071D81113p6472O5761j26846r4113M7057K0027N3457O7148j22809j09468J3615
18060B18470J6449j9253J596k8741j0569m8668M2433l3135N9302k723r0965k6257
18048G7939R3927J31817l7593j26323O289J32455j5947M2340l8365o0024r042
18037A97473L60N4283k9608O8616K6362P6235m1918j15514j92821R6711P0183
$$ plain form
18026 210362 150242 185203 93678 105076 211724 64204 142664 273780 195471 224305 222997
18015 222997 256709 367901 406536 359850 259173 219745 315076 351888 479916 576846 438680
18004 438680 331394 321696 313602 242569 186017 355048 359786 336628 167795 105478 156002
17993 156002 137081 53611 91401 137215 47609 99952 187202 155385 161381 153300 122476 103125
17981 103125 116857 72466 144034 135438 61277 200635 340326 341910 199651 65854 93339
17970 93339 175038 262464 300669 217790 287737 408519 256213 376450 435007 322883 217641
17959 217641 275840 283508 249302 231808 352885 361201 215080 150246 164288 72598 72961 216998
17947 216998 370370 329889 242601 255686 180826 155330 176671 318614 355677 305253 244691
$$ packed form
18026B10362o0120L4961r1525J1398J06648j47520P8460J31116p8309K8834j308
18015B22997L3712J11192L8635m6686j00677l9428R5331L6812J28028R6930j38166
18004D38680j07286r698q094p1033n6552J69031M738k3158j68833o2317N0524
17993A56002j8921q3470L7790M5814q9606N2343Q7250l1817N996q081l0824j9351
17981A03125J3732m4391P1568q596p4161J39358J39691J584j42259j33797K7485
17970I3339Q1699Q7426L8205q2879O9947J20782j52306J20237N8557j12124j05242
17959B17641N8199P668l4206j7494J21077Q316j46121o4834J4042r1690L63J44037
17947B16998J53372m0481q7288J3085p4860k5496K1341J41943L7063n0424o0562
$$ plain form
17936 244691 211375 391918 395555 336612 397759 366696 310465 196582 226490 279095 254031
17925 254031 205749 204615 115918 266431 327714 267330 240022 260295 265155 330567 132044
17914 132044 227970 292010 123575 -37414 -93795 -100538 -41300 73001 27921 -20872 -95693
17903 -95693 -100535 -167067 -101509 -127363 -172363 -74093 -99344 -207486 -250082 -113450 -116585 -133445
17891 -133445 -145017 -146246 -78796 13038 106857 152883 142292 36633 48939 141999 197720
17880 197720 157813 85162 -88346 -56156 91146 173268 213492 219321 150756 15477 -71724
17869 -71724 -1166 64642 31217 -27884 -42897 -30888 -44869 -75674 -75802 145908 205486 92151
17857 92151 63604 23113 -23685 -31798 -64525 -67540 -121681 11212 -10124 -44832 38512 -131693
$$ packed form
17936B44691l3316J80543L637n8943O1147l1063n6231j13883K9908N2605k5064
17925B54031m8282j134q8697J50513O1283o0384k7308K0273M860O5412j98523
17914A32044R5926O4040j68435j60989n6381o743N9238J14301m5080m8793p4821
17903i5693m842o6532O5558k5854m5000R8270k5251j08142m2596J36632l135j6860
17891a33445j1572j229O7450R1834R3819M6026j0591j05659J2306R3060N5721
17880A97720l9907p2651j73508L2190J47302Q2122M0224N829o8565j35279q7201
17869g1724P0558O5808l3425n9101j5013J2009j3981l0805j28K21710N9578j13335
17857I2151k8547m0491m6798q113l2727l015n4141J32893k1336l4708Q3344j70205
$$ plain form
17845 -131693 -91286 -33788 -80195 -125752 -153478 -176677 -194153 -86063 -68838 -107103 -64805
17834 -64805 -65793 -116955 -182115 -170630 -173213 -161955 18532 124945 150406 259987 287448 264001
17822 264001 254552 283719 298416 310446 222761 224804 223397 207489 158854 267392 260390 222799
17810 222799 297958 227554 144289 143199 64092 3330 79769 29325 -6225 6975 -54000 -107587
17798 -107587 -85534 -98190 -178667 -166978 -59253 12562 -23808 -98685 -79776 -11981 63631
17787 63631 68873 92272 190582 174208 115643 189891 279982 373797 366343 405146 259341 253071
17775 253071 283614 276966 277468 197228 194963 187727 189775 75643 154423 269505 325956 221701
17763 221701 115390 113699 185826 83536 48586 161153 267859 284264 256301 285171 308319
$$ packed form
17845a31693M0407N7498m6407m5557k7726k3199j7476J08090J7225l8265M2298
17834f4805r88n1162o5160J1485k583J1258J80487J06413K5461J09581K7461k3447
17822B64001r449K9167J4697J2030q7685K043j407j5908m8635J08538p002l7591
17810B22799P5159p0404q3265j090p9107o0762P6439n0444l5550J3200o0975n3587
17798a07587K2053j2656q0477J1689J07725P1815l6370p4877J8909O7795P5612
17787F3631N242K3399R8310j6374n8565P4248R0091R3815p454L8803j45805o270
17775B53071L0543o648N02q0240k265p236K048j14132P8780J15082N6451j04255
17763B21701j06311j691P2127j02290l4950J12567J06706J6405k7963K8870K3148
$$ plain form
17752 308319 290241 159852 258651 317382 268344 364907 384934 566246 556124 439922 397111
17741 397111 473839 543171 713128 669571 626827 621097 602225 523356 498663 498687 490194 429454
17729 429454 473037 468120 315103 207295 175814 128321 97697 239476 352126 314290 233265
17718 233265 76100 -41603 -115340 -66745 -9994 -110661 -111355 -123814 -136170 -59729 -25193
17707 -25193 -22300 36949 81133 158668 243287 314851 394862 429092 306470 103898 45362
17696 45362 55680 28561 -12964 120059 300399 389971 271096 225707 328489 412250 519656
17685 519656 534675 415620 396221 408136 433410 350616 227434 274611 283200 284927 285195 259996
17673 259996 184287 190744 165024 98709 81917 -84339 -70288 109754 336096 336358 213767
$$ packed form
17752C08319j8078j30389R8799N8731m9038R6563K0027J81312j0122j16202m2811
17741C97111P6728O9332J69957m3557m2744n730j8872p8869k4693K4q493o0740
17729D29454M3583m917j53017j07808l1481m7493l0624J41779J12650l7836q1025
17718B33265j57165j17703p3737M8595N6751j00667o94j2459j2356P6441L4536
17707b5193K893N9249M4184P7535Q4619P1564Q0011L4230j22622k02572n8536
17696D5362J0318k7119m1525J33023J80340Q9572j18875m5389J02782Q3761J07406
17685E19656J5019j19055j9399J1915K5274q2794j23182M7177Q589J727K68k5199
17673B59996p5709O457k5720o6315j6792j66256J4051J80042K26342K62j22591
$$ plain form
17662 213767 75926 5218 -61248 27204 39612 -58337 -78597 -128132 -151496 -59023 132277
17651 132277 129762 80660 -24528 -69959 -38817 20863 26986 -20343 -93996 -16722 74979 -16804
17639 -16804 -170722 -256423 -195190 -52800 63782 45928 -18621 -37957 -33493 7889 -59820
17628 -59820 -204906 -117719 -105064 -169889 -186965 -3368 123801 76090 12148 -39578 -80323
17617 -80323 -83802 21877 138480 76265 32313 49504 222110 219356 140512 186077 234332
17606 234332 337208 208546 109014 22395 77295 170530 138698 14930 -147666 9438
17596 9438 96809 82246 108059 33375 -54495 22879 11793 -14226 -35035 -112585 -195979 -236653
17584 -236653 -217190 -160801 -98311 -45666 -237887 -459890 -336045 -180960 -113604 -35217 -29472
$$ packed form
17662B13767j37841p0708o6466Q8452J2408r7949k0260m9535k3364R2473J91300
17651A32277k515m9102j05188m5431L1142N9680O123m7329p3653P7274R1701r1783
17639a6804j53918q5701O1233J42390J16582j7854o4549j9336M464M1382o7709
17628e9820j45086Q7187J2655o4825j7076J83597J27169m7711o3942n1726m0745
17617h0323l479J05679J16603o2215m3952J7191J72606k754p8844M5565M8255
17606B34332J02876j28662r9532q6619N4900R3235l1832j23768j62596J57104
17596I438Q7371j4563K5813p4684q7870P7374j1086k6019k0809p7550q3394m0674
17584b36653J9463N6389O2490N2645j92221k22003J23845J55085O7356P8387N745
$$ plain form
17573 -29472 -30410 -7446 -145072 -83515 -30370 -32352 -73341 -84663 -42055 -91166 -155713 -46964
17561 -46964 -130604 -167927 -142886 -74762 -60509 -49844 -13689 -76196 -55159 -118771 -92269 -164901
17549 -164901 -253279 -119641 33589 134733 186893 241522 72165 -99280 43345 68818
17539 68818 25462 -70360 -82970 -13197 -16766 -50861 -78169 -133669 -225908 -253272 -217641 -60663
17527 -60663 7010 -84738 -116374 -212988 -240649 -259982 -190855 -205470 -219112 -181355 -103907 -151908
17515 -151908 -342481 -379499 -198977 -128659 -103548 -22519 -1922 22836 -115637 -52505 -2904
17504 -2904 -142352 -181461 -194612 -182602 -66686 -19494 -215362 -223227 -141041 -49563 49462
17493 49462 -49816 -201536 -235751 -194747 -87957 -43015 -275354 -406560 -359750 -126784 -62342
$$ packed form
17573b9472r38K2964j37626O1557N3145j982m0989j1322M2608m9111o4547J08749
17561d6964q3640l7323K5041O8124J4253J0665L6155o2507K1037o3612K6502p2632
17549a64901q8378J33638J53230J01144N2160N4629j69357j71445J42625K5473
17539F8818m3356r5822j2610O9773l569l4095k7308n5500r2239k7364L5631J56978
17527f0663O7673r1748l1636r6614k7661j9333O9127j4615j3642L7757P7448m8001
17515a51908j90573l7018J80522P0318K5111Q1029K0597K4758j38473O3132M9601
17504b904j39448l9109j3151J2010J15916M7192j95868p865Q2186R1478R9025
17493D9462r9278j51720l4215M1004J06790M4942k32339j31206M6810K32966O4442
$$ plain form
17482 -62342 -73845 -2014 65043 101423 -6305 -125497 -120493 -55054 -44804 -101825 -143416
17471 -143416 -169877 -58314 -28018 -50706 -56301 -114821 -226627 -170927 -40606 -74235 -188322
17460 -188322 -297539 -185857 -95565 -86518 65511 27645 48232 -36060 -116987 -151202 -185669
17449 -185669 -93366 -25715 -37825 -76722 -77023 -167295 -267274 -225292 -209935 -201964 -204342 -193640
17437 -193640 -73926 -3958 -46260 -6520 -904 -83280 -3919 123084 81833 95236 133686
17426 133686 189068 114827 165624 227011 -2938 7357 -92093 -276465 -320401 -262061 -147895
17415 -147895 -12315 14075 -99395 -247327 -128652 -139381 -156362 -153058 -43564 42791 47857
17404 47857 -128591 -199844 -283707 -255343 -174328 -116551 -60309 -160952 -175413 -182941 -244894
$$ packed form
17482f2342j1503P1831O7057L6380j07728j19192N004O5439J0250n7021m1591
17471a43416k6461J11563L0296k2688n595n8520j11806N5700J30321l3629j14087
17460a88322j09217J11682R0292R047J52029l7866K0587q4292q0927l4215l4467
17449a85669R2303O7651j2110l8897l01r0272r9979M1982J5357P971k378J0702
17437a93640J19714O9968m2302L9740N616q2376P9361J27003m1251J3403L8450
17426A33686N5382p4241N0797O1387k29949J0295r9450j84372m3936N8340J14166
17415a47895J35580K6390j13470j47932J18675j0729j6981L304J09494Q6355N066
17404D7857j76448p1253q3863K8364Q1015N7777N6242j00643j4461p528o1953
$$ plain form
17393 -244894 -133265 36383 11253 44064 61082 -18752 -138989 -122349 -68805 -37343 -124762
17382 -124762 -52282 -84660 -180615 -220950 -249471 -337887 -337813 -320029 -306374 -116218 -5322 52896
17370 52896 192921 281054 310605 269043 33812 -56282 -128108 -206103 -117888 -117546 -153746 -181555
17358 -181555 -176618 -238177 -313010 -419823 -337870 -324374 -284773 -207551 -115209 -94459 -9475
17347 -9475 -109640 -86753 -107166 -80278 -183042 -212128 -182794 -20528 -50294 -175313 -214267
17336 -214267 -160028 -17881 130722 112388 87639 58659 -2410 -107576 -232748 -223537 -49896
17325 -49896 38064 69669 101671 89351 102131 199905 93125 -57954 -10661 71849 19100
17314 19100 40594 -33692 103130 151635 39373 -93189 -73146 -58753 -182392 -390656 -428407
$$ packed form
17393b44894J11629J69648k5130L2811J7018p9834j20237J6640N3544L1462q7419
17382a24762P2480l2378r5955m0335k8521q8416P4J7784J3655J90156J10896N8218
17370E2896J40025Q8133K9551m1562k35231r0094p1826p7995Q8215L42l6200k7809
17358a81555M937o1559p4833j06813Q1953J3496L9601P7222R2342K0750Q4984
17347i475j00165K2887k0413K6888j02764k9086K9334J62266k9766j25019l8954
17336b14267N4239J42147J48603j8334k4749k8980o1069j05166j25172R211J73641
17325d9896Q7960L1605L2002j2320J2780R7774j06780j51079M7293Q2510n2749
17314A9100K1494p4286J36822M8505j12262j32562K0043J4393j23639k08264l7751
$$ plain form
17303 -428407 -255657 -95756 -47198 -9574 -201488 -183474 -198812 -172941 -169005 -229277 -142117
17292 -142117 12821 86663 -47109 -165653 -172625 -284818 -199143 -100498 -128129 -125683 -95578
17281 -95578 -175244 -103409 121494 -21961 -182416 -199958 -342303 -270671 -151739 -169654 -210049
17270 -210049 -234661 -150133 -33281 -49264 -176233 -112982 -19043 -57466 -144444 -137214 -147269
17259 -147269 -168481 -133755 -82003 -114065 -166951 -222793 -201543 -141821 -137158 -91709 16294
17248 16294 101355 72528 68183 -26505 -125348 -183654 -328667 -345254 -210121 -121947 -202713
17237 -202713 -164384 -64613 -62898 -133406 -270893 -289977 -264565 -321832 -250927 -154467 -201703
17226 -201703 -319205 -187007 -17425 9466 7515 15913 106879 66677 -1494 -108506 -138118
$$ packed form
17303d28407J72750J59901M8558L7624j91914J8014j5338K5871L936o0272Q7160
17292a42117J54938P3842j33772j18544o972j12193Q5675R8645k7631K446L0105
17281i5578p9666P1835K24903j43455j60455j7542j42345P1632J18932j7915m0395
17270b10049k4612Q4528J16852j5983j26969O3251R3939l8423q6978P230j0055
17259a47269k1212L4726N1752l2062n2886n5842K1250N9722M663M5449J08003
17248A6294Q5061k8827m345r4688r8843n8306j45013j6587J35133Q8174q0766
17237b02713L8329R9771J715p0508j37487j9084K5412n7267P0905R6460m7236
17226b01703j17502J32198J69582K6891j951Q398R0966m0202o8171j07012k9612
$$ plain form
17215 -138118 -166921 -128755 -5962 37686 -66245 -176939 -153888 -165379 -236379 -218051 -208699
17204 -208699 -126364 -101977 -61762 44049 208776 163369 -54237 -35899 11704 -5329 -146262
17193 -146262 -134109 -130549 -184685 -201335 -73145 21247 89909 161550 130552 62354 13858
17182 13858 6866 -137168 -331199 -315975 -133203 -108347 -38334 23762 17053 36304 82635
17171 82635 7517 3142 17247 -28419 -63379 -17487 62040 99930 -25099 -66900 -101618 -250948
17159 -250948 -507133 -368857 -267611 -217403 -246745 -198700 -236470 -280850 -192948 -203218 -290586
17148 -290586 -376731 -345566 -146425 -109268 -93685 -114590 -233834 -146722 -14504 54953 -9098
17137 -9098 -119315 -126623 -86292 -115013 -45258 -98318 -206007 -205073 -114930 -18399 -52699 -73699
$$ packed form
17215a38118k8803L8166J22793M3648j03931j10694K3051j1491p1000J8328R352
17204b08699Q2335K4387M0215J05811J64727m5407k17606J8338M7603j7033j40933
17193a46262J2153L560n4136j6650J28190R4392O8662P1641l0998o8198m8496
17182A3858o992j44034j94031J5224J82772K4856P0013O2096o709J9251M6331
17171H2635p5118m375J4105m5666l4960M5892P9527L7890j25029m1801l4718j49330
17159b50948k56185J38276J01246N0208k9342M8045l7770m4380Q7902j0270q7368
17148b90586q6145L1165J99141L7157J5583k0905j19244Q7112J32218O9457o4051
17137i098j10217p308M0331k8721O9755n3060j07689R34R0143R6531l4300k1000
$$ plain form
17125 -73699 29007 118047 98038 -15838 -65616 -93416 -77895 -136095 -224725 -124906 -137623
17114 -137623 -173232 -179085 -61018 -37550 -72334 -54724 -52209 17024 -1537 -195221 -322738
17103 -322738 -361591 -341405 -214099 -124766 -49666 -126702 25082 59087 56993 103525 63202
17092 63202 -11607 -72739 -131881 -57359 -60359 -25090 -5806 60977 52894 107998 261842 133148
17080 133148 63424 -31894 -10008 -58815 -11718 -104423 -127404 -81100 -44732 -187245 -196449
17069 -196449 -126966 -208151 -247651 -276317 -228904 -155918 -180267 -253145 -344595 -200949 -46477
17058 -46477 50131 88181 120019 122825 125803 149274 -24921 -172217 -123660 -37778 -115543 -68684
17046 -68684 -8487 25556 23689 -152603 -332151 -317446 -248877 -97694 28167 37644 62083
$$ packed form
17125g3699J02706Q9040k0009j13876m9778k7800J5521n8200q8630R9819j2717
17114a37623l5609n853J18067K3468l4784J7610K515O9233j8561j93684j27517
17103c22738l8853K0186J27306Q9333P5100p7036J51784L4005k094M6532m0323
17092F3202p4809o1132n9142P4522l000L5269J9284O6783q083N5104J53844j28694
17080A33148o9724r5318K1886m8807M7097r2705k2981M6304L6368j42513r204
17069a96449O9483q1185l9500k8666M7413P2986k4349p2878r1450J43646J54472
17058d6477R6608L8050L1838K806K978K3471j74195j47296M8557Q5882p7765M6859
17046f8684O0197L4043j867j76292j79548J4705O8569J51183J25861R477K4439
$$ plain form
17035 62083 143089 193323 219863 223055 49748 -111869 -145853 -292092 -498139 -464494 -365056
17024 -365056 -410645 -264941 -61008 -87939 -28223 -21544 24550 38403 -144309 -197529 -112911
17013 -112911 -105865 -237595 -386147 -330456 -208836 -127121 -131346 -178506 -206171 -235164 -187726
17002 -187726 -239422 -210535 -145314 20229 88331 -33252 -43679 -8071 -12835 -102821 -85312
16991 -85312 -126886 -112597 -118197 -88717 -75279 -31033 -181804 -264979 -243925 -247713 -334670 -272806
16979 -272806 -208691 -237334 -296602 -243387 -177262 -111803 -169802 -160549 -133516 31203 -64407
16968 -64407 -249717 -335190 -255976 -218059 -194886 -132893 -172051 -237564 -250333 -167888 -63788
16957 -63788 -71715 -47008 42663 -40596 -29287 -35962 14226 60247 -398 -127651 -188672 -4088
$$ packed form
17035F2083Q1006N0234K6540L192j73307j61617l3984j46239k06047L3645R9438
17024c65056m5589J45704K03933k6931N9716O679M6094J3853j82712n3220Q4618
17013a12911P046j31730j48552N5691J21620Q1715m225m7160k7665k8993M7438
17002a87726n1696K8887O5221J65543O8102j21583j0427L5608m764q9986J7509
16991h5312m1574J4289n600K9480J3438M4246j50771q3175K1054l788q6957O1864
16979b72806O4115k8643n9268N3215O6125O5459n7999R253K7033J64719r5610
16968f4407j85310q5473P9214L7917K3173O1993l9158o5513j2769Q2445J04100
16957f3788p927K4707Q9671q3259J1309o675N0188M6021o0645j27253o1021J84584
$$ plain form
16945 -4088 214724 123414 -49161 -91378 3908 49684 115705 92843 36897 -15804 -90462
16934 -90462 -85064 -135051 -275974 -301745 -390127 -354524 -299727 -241360 -87361 39000 192040
16923 192040 237837 65483 -39571 -79287 -127094 -114851 -125046 -171640 -174370 -139332 -185102
16912 -185102 -69251 37249 103028 30084 -50940 -18652 -69847 -81988 -101246 -92165 27469
16901 27469 -18224 -109397 -104036 -81217 -25810 -30553 -17770 68332 -24436 -16445 4010 -101418
16889 -101418 -92604 -71735 -117766 -161825 -35863 -68860 -56677 80455 229113 109476 54027
16878 54027 73380 79829 6319 -85472 -88825 -52092 -110683 -126724 -78794 -107481 -195317 -35298
16866 -35298 -1099 -31350 -101605 -205724 -206591 -130151 -35338 -16340 4793 -35628 1285 -27435
$$ packed form
16945d088K18812r1310j72575m2217R5286M5776O6021k2862n5946n2701p4658
16934i0462N398m9987j40923k5771q8382L5603N4797N8367J53999J26361J53040
16923A92040M5797j72354j05054l9716m7807J2243j0195m6594k730L5038m5770
16912a85102J15851J06500O5779p2944q1024L2288n1195j2141j9258R081J19634
16901B7469m5693r1173N361K2819N5407m743J2783Q6102r2768P991K0455j05428
16889a01418Q814K0869m6031m4059J25962l2997J2183J37132J48658j19637n5449
16878E4027J9353O449p3510r1791l353L6733n8591j6041M7930k8687q7836J60019
16866c5298L4199l0251p0255j04119q67P6440R4813J8998K1133m0421L6913k8720
$$ plain form
16854 -27435 -101517 -112845 -17456 -31977 -4903 48256 -30042 -151985 -158579 -56273 -26675
16843 -26675 -91317 -240731 -286658 -331629 -174899 -6435 127241 133236 89741 -117735 -239665
16832 -239665 -350362 -361881 -365824 -334188 -147143 -134907 -192207 -151100 -193019 -233186 -97092
16821 -97092 -137003 -181225 -274044 -171744 -47388 -92835 -149263 -24799 103986 80394 91895
16810 91895 47942 -74303 -37266 -338 -1126 -99236 -70578 13291 -94577 -214892 -124192
16799 -124192 -24071 71674 12776 -84908 -114049 -14336 59546 192732 143862 84356 -34720
16788 -34720 -79319 -84583 -211136 -207769 -19511 -58216 33002 -5622 14960 -32144 -41117 -127722
16776 -127722 -225675 -75254 -1657 178 -51701 -114193 -62211 -46569 -99078 -101272 100977
$$ packed form
16854b7435p4082j1328R5389j4521K7074N3159p8298j21943o594J02306K9598
16843b6675o4642j49414m5927m4971J56730J68464J33676N995m3495k07476j21930
16832b39665j10697j1519l943L1636J87045J2236n7300M1107m1919m0167J36094
16821i7092l9911m4222r2819J02300J24356m5447n6428J24464J28785k3592J1501
16810I1895m3953j22245L7037L6928p88r8110K8658Q3869j07868j20315R0700
16799a24192J00121R5745n8898r7684k9141R9713P3882J33186m8870n9506j19076
16788c4720m4599n264j26553L367J88258l8705R1218l8624K0582m7104q973q6605
16776a27722r7953J50421P3597J835n1879o2492N1982J5642n2509k194K02249
$$ plain form
16765 100977 199635 -53242 -42500 112874 28690 -11973 59331 77463 107606 112691 75437
16754 75437 77807 52101 -112292 -302579 -373912 -375068 -433816 -401689 -387343 -362424 -201165
16743 -201165 -70795 50659 90761 61141 -70789 -168826 -103492 -15823 54698 159956 174851
16732 174851 202792 231771 144408 123482 116739 219846 343216 335773 29421 140566 184150
16721 184150 115510 74627 171514 124287 -2829 -70803 -57808 -7738 -84523 -18863 91773
16710 91773 110537 50867 36919 42106 221 85699 72843 13590 71778 72501 18925 4739
16698 4739 135246 95350 -38221 -136582 -96300 30741 81925 71152 117015 223270 351063
16687 351063 338034 203946 252160 313897 155932 63273 3424 -105689 19800 147690
$$ packed form
16765A00977R8658k52877J0742J55374q4184m0663P1304J8132L0143N085l7254
16754G5437K370k5706j64393j90287p1333j156n8748L2127J4346K4919J61259
16743b01165J30370J21454M0102k9620j31930r8037O5334Q7669P0521J05258J4895
16732A74851K7941K8979q7363k0926o743J03107J23370p443l06352J11145M3584
16721A84150o8640m0883R6887m7227j27116o7974J2995N0070p6785O5660J10636
16710I1773J8764n9670j3948N187m1885Q5478j2856n9253N8188P23n3576j4186
16698D739J30507l9896j33571r8361M0282J27041N1184j0773M5863J06255J27793
16687C51063j3029j34088M8214O1737j57965r2659n9849j09113J25489J27890
$$ plain form
16677 147690 31589 -66460 -131988 -124703 -95185 -57078 121210 285883 252899 154241 -14297
16666 -14297 107510 143334 23268 -93173 -85810 -29808 58833 -25993 -124692 -96939 -9799
16655 -9799 -60548 -58417 -43773 -1648 -26189 -113276 -74382 -17961 24721 58930 107507 -114530
16643 -114530 -187541 -131786 -50922 -38456 5948 -41450 -108237 -164736 -122355 -71998 -101429
16632 -101429 -238058 -407986 -348884 -310852 -375002 -333793 -236096 -252244 -226197 -254685 -109164
16621 -109164 -133387 -155973 -216561 -366608 -415099 -272768 -97796 -42172 -36205 -52066 102021
16610 102021 143761 112606 271005 335907 282516 146657 -33413 -122378 -125560 -24716 46604
16599 46604 103946 36089 -56896 -111889 -36630 24291 1388 -71395 -51672 161774 385925
$$ packed form
16677A47690j16101r8049o5528P285K9518L8107J78288J64673l2984r8658j68538
16666a4297J21807L5824j20066j16441P363N6002Q8641q4826r8699K7753Q7140
16655i799n0749K131J4644M2125k4541q7087L8894N6421M2682L4209M8577k22037
16643a14530p3011N5755Q0864J2466M4404m7398o6787n6499M2381N0357k9431
16632a01429j36629j69928N9102L8032o4150M1209R7697j6148K6047k8488J45521
16621a09164k4223k2586o0588j50047m8491J42331J74972N5624N967j5861J54087
16610A02021M1740l1155J58399O4902n3391j35859j80070q8965l182J00844P1320
16599D6604N7342o7857r2985n4993P5259O0921k2903p2783J9723K13446K24151
$$ plain form
16588 385925 264855 148449 43257 -17067 18072 55633 -64960 -89804 44990 8528
16578 8528 -97062 -83875 -47315 60932 81767 -21875 1719 57494 15078 -27638 -114163
16567 -114163 -227302 -237289 -185378 -126536 -84957 58080 150044 85231 4530 -160112 -269957
16556 -269957 -224212 -44340 -6780 -21239 -207812 -352791 -354604 -344880 -249644 -130987 -136814
16545 -136814 -120985 -261193 -243411 -154224 -67765 -135318 -247146 -245308 -298159 -285281 -298112
16534 -298112 -236861 -284016 -321869 -295586 -196121 -155855 7401 131685 188229 174870 82291
16523 82291 -103001 -121249 -171656 -86720 -42859 -39651 66024 186433 210189 233718 206841
16512 206841 74930 168537 244123 73762 66437 120851 88316 3410 -65742 -191938 -264573
$$ packed form
16588C85925j21070j16406j05192o0324L5139L7561j20593k4844J34794l6462
16578H528j05590J3187L6560J08247K0835j03642K3594N5775m2416m2716q6525
16567a14163j13139r987N1911N8842M1579J43037R1964o4813q0701j64642j09845
16556b69957M5745J79872L7560j4459j86573j44979j813R724R5236J18657n827
16545a36814J5829j40208J7782Q9187Q6459o7553j11828J838n2851J2878j2831
16534b98112O1251m7155l7853K6283R9465M0266J63256J24284N6544j3359r2579
16523H2291j85292j8248n0407Q4936M3861L208J05675J20409K3756K3529k6877
16512B06841j31911R3607P5586j70361p325N4414l2535q4906o9152j26196p2635
$$ plain form
16501 -264573 -310246 -256539 -84511 -29979 49156 191912 210086 121786 34480 43383 78157
16490 78157 -20032 -102312 -89625 -87777 -84040 -25645 -146355 -242114 -270152 -62438 17188 -20003
16478 -20003 -105989 -206273 -229715 -136028 -74085 -97546 -58509 19294 20275 -46598 -41409 -65727
16466 -65727 67559 174238 1498 -118503 -114304 -812 -107007 -84472 30293 -39746
16456 -39746 -139875 -216006 -209881 -139751 -184311 -267754 -278279 -163090 -151376 -225815 -334241
16445 -334241 -461336 -470963 -288694 -87848 -81197 -90671 -248307 -227656 -125556 -117630 -52731
16434 -52731 -53765 2066 95872 44753 -73042 -154796 -73328 91202 185206 225972 126357
16423 126357 -9547 -104534 -113852 -172346 16212 81390 -95726 -306858 -346083 -354954 -229354
$$ packed form
16501b64573m5673N3707J72028N4532P9135J42756J8174q8300q7306Q903L4774
16490G8157r8189q2280J2687J848L737N8395j20710r5759k8038K07714P9626l7191
16478b0003q5986j00284k3442R3687O1943k3461L9037P7803R81o6873N189k4318
16466f5727J33286J06679j72740j20001M199J13492j06195K2535J14765p0039
16456c9746j00129p6131O125P0130m4560q3443j0525J15189J1714p4439j08426
16445c34241j27095r627J82269K00846O651r474j57636K0651J02100P926O4899
16434e2731j034N5831R3806n1119j17795q1754Q1468J64530R4004M0766r9615
16423A26357j35904r4987r318n8494J88558O5178j77116k11132l9225q871J25600
$$ plain form
16412 -229354 -78723 -81078 -229637 -212947 -167349 -183622 -116446 -137996 -151080 -141169 -25605
16401 -25605 86471 154023 222874 54631 -114212 -142076 -145770 -168494 -193329 -145711 -125178
16390 -125178 -110091 -73408 62445 44447 6427 -78756 -145112 -141901 -38706 28924 -4024
16379 -4024 -62545 -69679 -103561 -113156 11196 40792 3415 -97798 -164589 -201131 -63889 71241
16367 71241 88813 -116679 -202417 -101350 23123 128359 156500 40164 56035 3378 -122432
16356 -122432 -172171 -150457 -16119 71462 68072 108778 88197 7688 111772 189524 86729
16345 86729 -97479 -65529 -35669 -66348 -111526 -79288 -73869 -96804 -226517 -167413 -133705
16334 -133705 -86560 -37028 -84346 -53109 85383 -1439 3616 160372 144637 138796 124261
$$ packed form
16412b29354J50631k355j48559J6690M5598j6273O7176k1550j3084R911J15564
16401b5605J12076O7552O8851j68243j68843k7864l694k2724k4835M7618K0533
16390a25178J5087L6683J35853j7998l8020q5183o6356L211J03195O7630l2948
16379d024n8521p134l3882r595J24352K9596l7377j01213o6791l6542J37242J35130
16367G1241J7572k05492q5738J01067J24473J05236K8141j16336J5871n2657j25810
16356a22432m9739K1714J34338Q7581l390M0706k0581q0509J04084P7752j02795
16345H6729j84208L1950K9860l0679m5178L2238N419k2935j29713N9104L3708
16334a33705M7145M9532m7318L1237J38492q6822N055J56756j5735n841j4535
$$ plain form
16323 124261 22826 -5851 58821 72431 125571 143010 93716 4495 18297 -9848 -76678
16312 -76678 -77041 -63330 -64129 10301 100511 4741 -75911 -114198 -151866 -102178 15137 47246
16300 47246 -22701 -14007 108306 78534 156476 164437 -24348 -105957 6091 -54071 -167422
16289 -167422 -98684 -6147 27188 20029 60064 85730 81646 73057 64247 62462 127327 131457 124988
16276 124988 -9326 -70209 -53066 -70035 -61695 -42244 2900 26619 47245 18782 66429
16265 66429 29729 30735 59295 66762 -92899 -129034 -100123 -134462 -158952 -113862 -102006 -61656
16253 -61656 -22529 -6931 -2406 83176 46528 -12232 89921 179366 149544 185230 112500 42541
16241 42541 101433 53659 -30066 -63713 -92774 -105592 -171922 -273286 -201799 -331302 -306017
$$ packed form
16323A24261j01435k8677O4672J3610N3140J7439m9294q9221J3802k8145o6830
16312g6678l63J3711p99P4430R0210r5770q0652l8287l7668M9688J17315L2109
16300D7246o9947Q694J22313k9772P7942P961j88785q1609J12048o0162j13351
16289a67422O8738R2537L3335p159M0035K5666m084q589q810j785O4865M130o469
16276A24988j34314o0883J7143j6969Q340J9451M5144K3719K0626k8463M7647
16265F6429l6700J006K8560P467j59661l6135K8911l4339k4490M5090J1856M0350
16253f1656L9127J5598M525Q5582l6648n8760J02153Q9445k9822L5686p2730o9959
16241D2541N8892m7774q3725l3647k9061j2818o6330j01364P1487j29503K5285
$$ plain form
16230 -306017 -288501 -188712 -89172 -168126 -288560 -233058 -198644 -156556 -223898 -303240 -154460
16219 -154460 -112170 -188462 -104937 54628 3010 -5636 9798 -28158 120298 135481 -58603
16208 -58603 -104240 -116865 -154368 -206280 -237625 -260500 -236751 -198972 -138925 -77598 -88000 -46445
16196 -46445 -145794 -120596 -94701 -27662 36563 154203 202750 1977 -24599 89096 120869
16185 120869 55991 -139921 -115562 -44509 -6086 -87871 -54397 22106 150842 68379 -79259
16174 -79259 -100918 -108811 -18620 -1603 -61279 -79747 -52816 -14927 149495 250042 186597
16163 186597 68778 58489 -111071 -234843 -215678 -101811 -148799 -270933 -235405 -229594 -237106
16152 -237106 -322941 -225234 -48234 -41612 -86577 -129507 -143917 -136734 -66892 -26236 15462 35979
$$ packed form
16230c06017J7516R9789R9540p8954j20434N5502L4414M2088o7342p9342J48780
16219a54460M2290p6292Q3525J59565n1618q646J5434l7956J48456J5183j94084
16208e8603m5637j2625l7503n1912l1345k2875K3749L7779O0047O1327j0402M1555
16196d6445r9349K5198K5895O7039O4225J17640M8547k00773k6576J13695L1773
16185A20869o4878j95912K4359P1053L8423q1785L3474P6503J28736q2463j47638
16174g9259k1659p893R0191J7017n9676j8468K6931L7889J64422J00547o3445
16163A86597j17819j0289j69560j23772J9165J13867m6988j22134L5528N811p512
16152b37106q5835R7707J77000O622m4965m2930j4410P183O9842M0656M1698K0517
$$ plain form
16140 35979 -244646 -300454 -204037 -78294 -129553 -180595 -168873 -102766 -151777 -283435 -157043
16129 -157043 -195650 -137203 -93947 -35174 29574 99266 -66635 -196008 -208890 -13405 -31757
16118 -31757 -10969 -66868 -103713 -46937 -73098 -44257 -56794 -50605 -48725 1247 -39503 -31655
16106 -31655 156988 263809 211440 93494 26194 -22322 -59897 -15569 86228 65913 915
16095 915 -63708 -127659 -254424 -324004 -394000 -445467 -438521 -305332 -210555 -166611 -215968 -195890
16083 -195890 -202488 -106514 -102949 -145594 26450 -30433 15550 30177 -49394 -163041 -225915
16072 -225915 -96894 -31395 -109145 -193316 -171675 -150269 -52084 -2663 -26895 -24528 -20478 4397
16060 4397 -172475 -207641 -281688 -253130 -162761 -132750 -47297 -80881 4736 18391 -104388
$$ packed form
16140C5979k80625n5808R6417J25743n1259n1042J1722O6107m9011j31658J26392
16129a57043l8607N8447M3256N8773O4748O9692j65901j29373j2882J95485j8352
16118c1757K0788n5899l6845N6776k6161K8841j2537O189J880M9972m0750P848
16106c1655J88643J06821n2369j17946o7300m8516l7575M4328J01797k0315o4998
16095I15o4623o3951j26765o9580o9996n1467O946J33189R4777M3944m9357K0078
16083a95890o598R5974L565m2645J72044n6883M5983J4627p9571j13647o2874
16072b25915J29021O5499p7750q4171K1641K1406R8185M9421k4232K367M050K4875
16060D397j76872l5166p4047K8558R0369L0011Q5453l3584Q5617J3655j22779
$$ plain form
16049 -104388 -120730 1135 47982 -26769 -1091 60375 29504 -107781 -221133 -207822 -252787
16038 -252787 -213374 -204938 -186979 -119146 -88583 -174595 -247425 -165864 -139000 -151336 -66724 12536
16026 12536 -37144 -59058 -69082 -215184 -237559 -24806 149699 175956 165921 43479 35035
16015 35035 8530 48066 194505 228694 77298 -95460 -372258 -303861 -157057 -58276 -5990
16004 -5990 -4248 65 83154 106068 56476 15986 -53491 -63554 -80646 -128421 -97385 99999
15992 99999 159963 46685 -83715 -102049 -106989 -124802 -3721 9919 -62610 66874 209726
15981 209726 161566 92873 77 4652 -6482 -133815 -41730 94471 -22015 43674 -8971
15970 -8971 -95952 -180420 -70449 34226 61319 87352 37974 -7765 39050 51544 -109786
$$ packed form
16049a04388j6342J21865M6847p4751K5678O1466l0871j37285j13352J3311m4965
16038b52787L9413Q436J7959O7833L0563q6012p2830Q1561K6864j2336Q4612P9260
16026A2536m9680k1914j0024j46102k2375K12753J74505K6257j0035j22442q444
16015C5035k6505L9536J46439L4189j51396j72758k76798O8397J46804R8781N2286
16004e990J742M313Q3089K2914m9592m0490o9477j0063j7092m7775L1036J97384
15992I9999N9964j13278j30400j8334m940j7813J21081J3640p2529J29484J42852
15981B09726m8160o8693r2796M575j1134j27333R2085J36201j16486O5689n2645
15970h971q6981q4468J09971J04675K7093K6033m9378m5739M6815J2494j61330
$$ plain form
15959 -109786 -136323 -142818 -136526 -67398 -18406 10856 -64596 -80766 -157680 -175459 -213466 -150885
15947 -150885 -67908 -187761 -209723 -32690 139034 162054 61391 47483 -54280 -144738
15937 -144738 -188953 -169586 -350358 -330777 -171027 -29103 20968 -62288 -116999 -102558 -32703
15926 -32703 -31574 44233 112689 92342 178595 233576 249739 60642 813 4914 -184615 -179212
15914 -179212 -149426 -123718 -34359 14698 66483 86515 90458 -20144 -18577 46342 8327 -130604
15902 -130604 -176335 -36386 16993 41327 50311 -22326 -9223 41605 107479 -33689 -131373
15891 -131373 30639 101688 117739 103263 93327 82990 41763 86976 2934 -94633 -81776
15880 -81776 -63991 -114925 -141186 -54049 39541 -8861 -83532 -13982 -31803 125329 120714 -12112
$$ packed form
15959a09786k6537o495O292O9128M8992K9262p5452j6170p6914j7779l8007O2581
15947a50885Q2977j19853k1962J77033J71724K3020j00663j3908j01763r0458
15937a44738m4215J9367j80772J9581J59750J41924N0071q3256n4711J4441O9855
15926c2703J129P5807O8456k0347Q6253N4981J6163j89097n9829M101j89529N403
15914a79212K9786K5708Q9359M9057N1785K0032L943j10602J567O4919l8015j38931
15902a30604m5731J39949N3379K4334Q984p2637J3103N0828O5874j41168r7684
15891a31373J62012P1049J6051j4476r936j0337m1227M5213q4042r7567J2857
15880h1776J7785n0934k6261Q7137R3590m8402p4671O9550j7821J57132m615j32826
$$ plain form
15868 -12112 13610 -127270 -235592 -200671 -52128 -150238 -78289 -8438 -108949 -98472 -44492
15857 -44492 124591 193402 132613 112658 44409 -58185 -94163 -59106 -59840 -14649 -60583 -52332
15845 -52332 24990 117588 149756 128842 85356 65540 18114 40251 57186 56962 5179 -8330
15833 -8330 -145288 -147240 -27605 -107114 -192510 -54150 62289 75366 8255 -124125 -121541
15822 -121541 -69853 -18535 54778 80638 69773 -74169 14402 122280 45822 -177941 -173626
15811 -173626 -236391 -160422 -163993 -254827 -329559 -204027 -230393 -252714 -220797 -112479 -77291
15800 -77291 -30369 49264 51736 -15474 -57254 -150429 -271770 -261168 -200294 -146882 -346358
15789 -346358 -416442 -261746 -183681 -110938 -53387 -56809 -76572 -109441 -31833 85414 36878
$$ packed form
15868a2112K5722j40880j08322L4921J48543r8110P1949O9851j00511J0477N3980
15857d4492J69083O8811o0789j9955o8249j02594l5978L5057p34M5191m5934Q251
15845e2332P7322R2598L2168k0914m3486j9816m7426K2137J6935k24n1783j3509
15833h330j36958j952J19635p9509q5396J38360J16439J3077o7111j32380K584
15822a21541N1688N1318P3313K5860j0865j43942Q8571J07878p6458k23763M315
15811a73626o2765P5969l571r0834p4732J25532k6366k2321L1917J08318L5188
15800g7291M6922P9633K472o7210m1780r3175j21341J0602O0874N3412j99476
15789c46358p0084J54696P8065P2743N7551l422j9763l2869P7608J17247m8536
$$ plain form
15778 36878 36708 48849 53941 103301 137663 56973 21629 -32267 -149048 -62951 47516 -25389
15766 -25389 -3515 111071 179965 158429 18149 34976 2891 -302061 -216593 -188713 -346744
15755 -346744 -312553 -203897 -71140 -90548 -139093 -55753 68549 36936 12489 -66956 -28662
15744 -28662 -32153 -11585 -31799 -14757 13684 31493 47784 92256 143374 42546 -66350
15733 -66350 -24385 -109722 -116506 54542 165918 106399 53873 63580 114604 79777 -72984
15722 -72984 -251989 -207627 -169136 -130621 -67696 -42371 112143 165524 143010 62472 -139046
15711 -139046 -220361 -159374 -122871 -44206 -105863 -224981 -156407 -137810 -136544 -104997 -178051
15700 -178051 -166172 -112110 -93779 -13986 -82048 -64721 -26893 29262 139749 64957 -33565
$$ packed form
15778C6878j70J2141N092M9360L4362q0690l5344n3896j16781Q6097J10467p2905
15766b5389K1874J14586O8894k1536j40280J6827l2085l04952Q5468K7880j58031
15755c46744L4191J08656J32757j9408m8545Q3340J24302l1613k4447p9445L8294
15744b8662l491K0568k0214J7042K8441J7809J6291M4472N1118j00828j08896
15733f6350M1965q5337o784J71048J11376n9519n2526R707N1024l4827j52761
15722g2984j79005M4362L8491L8515O2925K5325J54514N3381k2514q0538k01518
15711a39046q1315O0987L6503P8665o1657j19118O8574J8597J266L1547p3054
15700a78051J1879N4062J8331P9793o8062J7327L7828N6155J10487p4792r8522
$$ plain form
15689 -33565 -256879 -173746 -51266 79469 69911 -14181 -50388 -118118 -139880 -144031 26554
15678 26554 84439 76661 152474 126419 2601 -65629 5980 165506 95644 17950 -22847
15667 -22847 15096 -94882 -192257 -152468 -105959 -30234 18678 -92332 -280057 -259441 -19825
15656 -19825 157987 214630 64730 -54246 25323 161713 213068 72801 103910 25555 94277
15645 94277 212847 134221 111921 134057 17699 -48049 -60128 -174726 -189679 -66918 22660
15634 22660 -25637 41564 27546 -13398 55411 109823 46188 6318 80818 188212 99944
15623 99944 159670 168812 168643 138811 45380 12481 93235 19333 58187 154397 120141 71633
15611 71633 60289 -56489 -77915 70489 149666 139946 -34687 -53475 22538 113147 118383
$$ packed form
15689c3565k23314Q3133J22480J30735r558q4092l6207o7730k1762m151J70585
15678B6554N7885p778P5813k6055j23818o8230P1609J59526o9862p7694m0797
15667b2847L7943j09978r7375L9789M6509P5725M8912j11010j87725K0616K39616
15656a9825J77812N6643j49900j18976P9569J36390N1355j40267L1109p8355O8722
15645I4277J18570p8626k2300K2136j16358o5748j2079j14598j4953J22761Q9578
15634B2660m8297O7201j4018m0944O8809N4412o3635l9870P4500J07394q8268
15623I9944N9726R142j69k9832r3431l2899Q0754p3902L8854R6210l4256m8508
15611G1633j1344j16778k1426J48404P9177r720j74633j8788P6013R0609N236
$$ plain form
15600 118383 121031 67763 125072 31281 49300 88159 30006 87109 109020 516 -7638 -61059
15588 -61059 -148525 -55433 -29021 2281 -35422 -10552 -6021 -29769 14684 -56731 -80898 8893
15576 8893 7938 -19851 -18872 -124796 -60712 -55032 -189845 -63909 -72800 14632 143769 31691
15564 31691 -121024 -99076 -69035 -59054 33579 137897 62706 22633 44722 99211 205097
15553 205097 266479 393817 217317 139117 121705 45832 145112 178166 150220 -33643 18071
15542 18071 182103 172006 14975 23420 305393 269825 130844 68320 120260 191829 97595
15531 97595 222192 142639 109332 61274 119623 79589 22488 177157 295633 184215 74605
15520 74605 178659 141011 201905 142192 18625 -114376 -79055 7731 -3413 -86992 -67258
$$ packed form
15600A18383K648n3268N7309r3791J8019L8859n8153N7103K1911j08504q154n3421
15588f1059q7466R3092K6412L1302l7703K4870M531k3748M4453p1415k4167Q9791
15576H893r55k7789R79j05924O4084N680j34813J25936q891Q7432J29137j12078
15564C1691j52715K1948L0041R981R2633J04318p5191m0073K2089N4489J05886
15553B05097O1382J27338j76500p8200j7412p5873R9280L3054k7946j83863N1714
15542A8071J64032j0097j57031Q445K81973l5568j38981o2524N1940P1569r4234
15531I7595J24597p9553l3307m8058N8349m0034n7101J54669J18476j11418j09610
15520G4605J04054l7648O0894n9713j23567j33001L5321Q6786j1144q3579J9734
$$ plain form
15509 -67258 -67542 -78126 70085 133718 146911 142997 153468 60497 47349 42582 51198 -87685
15497 -87685 -108543 -141877 -145576 -91405 98338 89622 7453 -80054 -54763 55603 87899 51140
15485 51140 113311 252249 194448 138492 153289 267960 399424 399005 258697 20117 -91578
15474 -91578 7057 -14882 -158140 -97079 19564 26379 -14595 -51066 73688 219319 128759
15463 128759 178434 265593 346033 332498 100654 57863 5882 684 -919 -16680 4448 87797
15451 87797 57217 -26011 -81165 -50213 -52391 130019 80765 41090 149635 202455 285566
15440 285566 238636 57097 -39328 -38407 -2747 16689 -105083 -164410 -181857 -59830 6896
15429 6896 63932 -1322 -54661 -144864 17112 21304 73271 136800 177504 148091 66772 -100121
$$ packed form
15509f7258k84j0584J48211O3633J3193l914J0471r2971j3148m767Q616j38883
15497h7685k0858l3334l699N4171J89743q716q2169q7507K5291J10366L2296l6759
15485E1140O2171J38938n7801n5956J4797J14671J31464m19j40308k38580j11695
15474i1578R8635k1939j43258O1061J16643O815m0974l6471J24754J45631r0560
15463A28759M9675Q7159Q0440j3535k31844m2791n1981n198j603j5761K1128Q3349
15451H7797l0580q3228n5154L0952k178J82410m9254l9675J08545N2820Q3111
15440B85566m6930j81539r6425R21L5660J9436j21772n9327j7447J22027O6726
15429F896N7036o5254n3339r0203J61976M192N1967O3529M0704k9413q1319j66893
$$ plain form
15417 -100121 -199106 -227956 -58135 35483 -226 -24400 38455 -5507 110166 173122 195660
15406 195660 175421 74009 -33776 -42733 8234 -55243 -89616 56471 137035 54230 17204
15395 17204 34059 121700 125243 144713 90682 134363 295157 307480 132440 106289 54908
15384 54908 61348 178131 192732 110980 89499 68178 6004 81175 153461 167358 158453 182172
15372 182172 204807 308355 314688 214412 70563 27621 55842 -15683 -165680 -330381 -287660
15361 -287660 -49914 52901 -15520 -29808 -1829 -63537 -44060 81744 92497 11542 -105082
15350 -105082 -92012 45235 67322 16589 26567 81654 58699 88115 7393 -185594 -307926
15339 -307926 -160938 -87412 -14401 163331 201818 194154 242071 186585 64019 46515 75377
$$ packed form
15417a00121r8985k8850J69821R3618l5709k4174O2855m3962J15673O2956K2538
15406A95660k0239j01412j07785q957N0967o3477l4373J46087Q0564q2805l7026
15395A7204J6855Q7641L543J9470n4031M3681J60794J2323j75040k6151n1381
15384E4908O440J16783J4601q1752k1481k1321o2174P5171P2286J3897q905K3719
15372A82172K2635J03548O333j00276j43849m2942K8221p1525j49997j64701M2721
15361b87660K37746J02815o8421j4288K7979o1708J9477J25804J0753q0955j16624
15350a05082J3070J37247K2087n0733R978N5087k2955K9416q0722j92987j22332
15339c07926J46988P3526P3011J77732L8487p664M7917n5486j22566j7504K8862
$$ plain form
15328 75377 -15963 -121026 -71126 47625 120189 178861 116839 36926 56943 64087 80932
15317 80932 71855 151039 134323 83931 121518 208748 196221 82313 88116 108655 90429 99626
15305 99626 83226 90947 -1491 -51233 -4680 127994 256054 290661 278058 108487 23138
15294 23138 23519 1136 38350 49439 73647 33850 -62180 -129085 -224165 -145708 -123903 -13764
15282 -13764 154857 268742 276657 221354 260997 130799 11465 -107927 -30300 -42049 5475
15271 5475 45800 -69417 -140005 -78996 -148270 -192798 -223031 -153283 -127362 -58426 -101420 -74148
15259 -74148 -103870 -160494 -64642 57481 173137 129695 18293 -15556 14949 107306 104922
15248 104922 54505 76055 -8745 -45185 -34348 -57063 42270 95303 217440 220691 63570
$$ packed form
15328G5377r1340j05063M9900J18751P2564N8672o2022p9913K0017P144J6845
15317H0932r077P9184j6716n0392L7587Q7230j2527j13908N803K0539j8226R197
15305I9626j6400P721r2438m9742M6553J32674J28060L4607j2603j69571q5349
15294B3138L81k2383L7214J1089K4208l9797r6030o6905r5080P8457K1805J10139
15282a3764J68621J13885P915n5303L9643j30198j19334j19392P7627j1749M7524
15271E475M0325j15217p0588O1009o9274m4528l0233O9748K5921O8936m2994K7272
15259g4148k9722n6624R5852J22123J15656m3442j11402l3849L0505R2357k384
15248A04922n0417K1550q4800l6440J0837k2715R9333N3033J22137L251j57121
$$ plain form
15237 63570 89713 178283 143851 138253 59146 71369 22373 -114373 -135879 -240697 -256885
15226 -256885 -164760 -156701 -197361 -62394 78361 137767 103119 143389 5378 32629 76742
15215 76742 168147 97977 148701 199705 142125 184284 204581 50500 71641 92521 77632
15204 77632 16853 140310 243251 205718 185831 287618 196210 61253 2974 1141 141068
15193 141068 41479 -69612 295 46797 70487 101309 55318 67707 -14208 -32214 -34085
15182 -34085 -56986 -26352 35079 60971 36167 44602 69468 -17124 -4268 40608 26929 -14404
15170 -14404 -14972 148508 114311 94197 182370 92843 50237 89692 92076 59801 -37844 -120857
15158 -120857 -87988 -128992 -83704 -13310 62562 45830 164088 161861 29347 21711 12540 -5861
$$ packed form
15237F3570K6143Q8570l4432n598p9107J2223m8996j36746k1506j04818j6188
15226b56885R2125Q059m0660J34967J40755N9406l4648M0270j38011K7251M4113
15215G6742R1405p0170N0724N1004n7580M2159K0297j54081K1141K0880j4889
15204G7632o0779J23457J02941l7533j9887J01787r1408j34957n8279j833J39927
15193A41068r9589j11091O9907M6502K3690L0822m5991J2389q1915j8006j871
15182c4085k2901L0634O1431K5892k4804Q435K4866q6592J2856M4876j3679m1333
15170a4404n68J63480l4197k0114Q8173q9527m2606L9455K384l2275r7645q3013
15158a20857L2869m1004M5288P0394P5872j6732J18258k227j32514p636r171j8401
$$ plain form
15146 -5861 45045 123951 96614 -32462 1378 -43205 -154023 -168345 -121770 -91300 2089
15135 2089 -61054 -189126 -286377 -285646 -110516 101286 176345 96507 32253 -66518 -34350 -44441
15123 -44441 -30469 28195 139428 185626 -793 61817 119671 -29307 48739 174305 100544
15112 100544 86746 28177 -71860 -192819 -114397 -273121 -367488 -295538 -96872 -62347 -78661
15101 -78661 -58263 98038 46444 -49630 -18453 -36421 2911 3883 -14347 23716 94398 59825
15089 59825 63394 94353 180764 128272 122298 137898 67704 2707 -159319 -275758 -131314
15078 -131314 902 160380 236129 176235 252913 315228 199185 163671 166503 148181 184600
15067 184600 204274 152770 197846 100568 75072 88094 115727 152006 160710 87396 125906 128885
$$ packed form
15146e861N0906P8906k7337j29076L3840m4583j10818j4322M6575L0470R3389
15135B089o3143j28072r7251P31J75130K11802P5059p9838o4254r8771L2168j0091
15123d4441J3972N8664J11233M6198j86419O2610N7854j48978P8046J25566p3761
15112A00544j3798n8569j00037j20959P8422j58724r4367P1950J98666L4525j6314
15101g8661K0398J56301n1594r6074L1177j7968L9332R72j8230L8063P0682l4573
15089E9825L569L0959Q6411n2492n974J5600p0194o4997j62026j16439J44444
15078a31314J32216J59478P5749n9894P6678O2315j16043l5514K832j8322L6419
15067A84600J9674n1504M5076r7278k5496J3022K7633L6279Q704p3314L8510K979
$$ plain form
15055 128885 65874 91711 50533 57553 31718 -64346 -158640 -203365 -174647 -65061 4147
15044 4147 44373 91573 92029 4157 85638 63830 -6296 -65735 -107667 48184 213201 281423
15032 281423 274921 166908 106202 12674 -10995 93853 185321 202761 126111 216580 267081
15021 267081 156552 56060 120702 149080 149044 234565 247310 221805 297876 421123 336681
15010 336681 373416 277987 201591 216182 284258 253628 251043 262186 204985 320558 174980
14999 174980 55928 30932 14391 152513 171232 49351 14650 75257 247441 337650 395906
14988 395906 343188 168720 133317 142205 85408 40861 45011 156823 115089 132337 109464
14977 109464 115736 13412 -12859 -72560 61628 46987 61139 103272 -41094 -98269 -101912
$$ packed form
15055A28885o3011K5837m1178P020k5835r6064r4294m4725K8718J09586O9208
15044D147M0226M7200M56q7872Q1481k1808p0126n9439m1932J55851J65017O8222
15032B81423o502j08013o0706r3528k3669J04848R1468J7440p6650R0469N0501
15021B67081j10529j00492O4642K8378l6Q5521J2745k5505P6071J23247q4442
15010C36681L6735r5429p6396J4591O8076l0630k585J1143n7201J15573j45578
14999A74980j19052k4996j6541J38122J8719j21881l4701O0607J72184R0209N8256
14988C95906n2718j74468l5403Q888n6797m4547M150J11812m1734J7248k2873
14977A09464O272j02324k6271n9701J34188j4641J4152M2133j44366n7175l643
$$ plain form
14966 -101912 -162667 -120503 35492 124694 316743 309435 229320 195467 166870 242376 150230
14955 150230 41429 113712 208098 344719 317604 236108 74519 -67553 35893 177337
14945 177337 165269 99344 1354 -71954 -120705 -93976 -30206 -29560 -73059 -1403 124513 226979
14933 226979 247606 180623 120797 102765 77055 -27089 12844 171747 175822 117413 214191
14922 214191 282710 192997 213520 181004 128913 176475 144937 95273 108758 170094 192643
14911 192643 229874 266396 238838 152638 168824 295201 275389 217702 182120 197158 210744
14900 210744 248710 225999 198053 92549 129194 137180 192200 298208 166754 158938 299652
14889 299652 201709 237037 302322 222337 214664 294253 269315 264650 335116 286892 227542 227250
$$ packed form
14966a01912o0755M2164J55995Q9202J92049p308q0115l3853k8597P5506r2146
14955A50230j08801P2283R4386J36621k7115q1496j61589j42072J03446J41444
14945A77337j2068o5925r7990p3308m8751K6729O3770O46m3499P1656J25916J02466
14933B26979K0627o6983n9826j8032k5710j04144L9933J58903M075n8409R6778
14922B14191O8519q9713K0523l2516n2091M7562l1538m9664J3485O1336K2549
14911A92643L7231L6522k7558q6200J6186J26377j9812n7687l5582J5038J3586
14900B10744L7966k2711k7946j05504L6645P986N5020J06008j31454p816J40714
14889B99652r7943L5328O5285p9985p673P9589k4938m665P0466m8224n9350k92
$$ plain form
14877 227250 200453 163270 208301 153132 26572 128333 217279 102425 42779 44116 23378
14866 23378 -33121 4127 -1126 -4432 144977 193238 226286 277391 227295 265079 239588 229982
14854 229982 248790 151431 131739 53880 32144 85034 40695 29061 19651 205021 224885
14843 224885 212006 188740 178275 247291 364845 314676 280520 348869 350783 221553 91668
14832 91668 105132 94826 84954 138783 173482 52990 130493 135254 22285 140623 70891
14821 70891 75937 200673 102238 73105 147318 206970 279367 352168 357210 272492 228414 194267
14809 194267 212052 189299 288550 183448 204760 299522 258257 118167 125273 270374 258743
14798 258743 253043 339429 261491 140215 123316 117377 85430 46803 129387 143144 234934 233542
$$ packed form
14877B27250k6797l7183M5031n5169j26560J01761Q8946j14854n9646J337k0738
14866B3378n6499L7248n253l306J49409M8261L3048N1105n0096L7784k5491r606
14854B29982J8808r7359j9692p7859k1736N2890m4339j1634r410J85370J9864
14843B24885j2879k3266j0465O9016J17554n0169l4156O8349J914j29230j29885
14832I1668J3464j0306r872N3829L4699j20492P7503M761j12969J18338o9732
14821G0891N046J24736r8435k9133P4213N9652P2397P2801N042q4718m4078l4147
14809A94267J7785k2753R9251j05102K1312R4762m1265j40090P106J45101j1631
14798B58743n700Q6386p7938j21276j6899n939l1947l8627Q2584J3757R1790j392
$$ plain form
14786 233542 273213 229008 160239 175781 53028 86081 57334 78543 105796 79020 96235
14775 96235 171939 135195 55962 -2814 -28238 57209 138583 2488 84066 210061 151900
14764 151900 116450 170101 95867 91313 199940 139206 113432 102643 53643 97902 320653
14753 320653 264005 216330 196269 111240 138177 -1504 -120716 -202870 -36212 135842 136693
14742 136693 260195 324045 164773 251424 248865 92507 -38468 -25256 69433 158058 93080
14731 93080 12765 -51894 23799 17597 18593 29722 -44213 -86123 110572 313860 373483 235316
14719 235316 171913 130674 227192 149686 48100 67914 246821 225459 217746 253135 208969
14708 208969 280610 395818 301902 304642 183631 192593 262167 337641 328020 285560 279109 201862
$$ packed form
14786B33542L9671m4205o8769J5542j22753L3053k8747K1209K7253k6776J7215
14775I6235P5704l6744p9233n8776k5424Q5447Q1374j36095Q1578J25995n8161
14764A51900l5450N3651p4234m554J08627o0734k5774j0789m9000M4259K22751
14753C20653n6648m7675k0061q5029K6937j39681j19212q2154J66658J72054Q51
14742A36693J23502O3850j59272Q6651k559j56358j30975J3212R4689Q8625o4978
14731I3080q0315o4659P5693o202R96J1129p3935m1910J96695K03288N9623j38167
14719B35316o3403m1239R6518p7506j01586J9814J78907k1362p713L5389m4166
14708B08969P1641J15208r3916K740j21011Q962O9574P5474r621m2460o451p7247
$$ plain form
14696 201862 146421 42263 -18164 -63650 -40894 183034 321283 314225 226424 81117 142058
14685 142058 233838 207261 148646 198930 174786 185839 134158 108062 243387 242497 101899
14674 101899 -1033 94053 244021 208998 226272 239529 180947 179298 128948 202505 251154
14663 251154 195216 137132 195417 228319 200714 145539 353984 425296 391102 423998 362243
14652 362243 227736 159236 130057 92815 -27466 -66443 -2834 121287 81906 11181 16580
14641 16580 55378 94536 181368 171756 8420 71876 104261 125444 152219 336044 468623
14630 468623 545611 466159 423537 405751 333745 296928 297080 378803 343985 242056 288378 395662
14618 395662 360526 227949 306739 313045 267729 323847 287779 302742 366211 274144 214672
$$ packed form
14696B01862n5441j04158o0427m5486K2756K23928J38249p058q7801j45307O0941
14685A42058R1780k6577n8615N0284k4144J1053n1681k6096J35325q90j40598
14674A01899j02932R5086J49968l5023J7274J3257n8582j649n0350P3557M8649
14663B51154n5938n8084N8285L2902k7605n5175K08445P1312l4194L2896o1755
14652C62243j34507o8500k9179l7242j20281l8977O3609J24121l9381p0725N399
14641A6580L8798L9158Q6832r612j63336O3456L2385K1183K6775J83825J32579
14630D68623P6988p9452m2622j7786p2006l6817J52Q1723l4818j01929M6322J07284
14618C95662l5136j32577P8790O306m5316N6118l6068J4963O3469r2067n9472
$$ plain form
14607 214672 192604 89323 70129 141984 176628 220568 289774 292453 172476 119503 94612
14596 94612 183134 313025 422492 413375 388964 292638 387734 339498 247729 302453 384913
14585 384913 356127 447409 427486 320208 316340 292531 267198 146886 144244 236993 306766
14574 306766 259832 315572 200660 128496 31114 86835 305679 299413 144062 141779 195894
14563 195894 84265 46202 196710 236624 320826 257172 137591 -49435 -2723 210204
14553 210204 289823 214088 247183 446444 469781 381430 381743 321099 181932 223502 394967
14542 394967 300988 298602 286608 274486 322720 308098 320954 260178 324844 416002 486274 462114
14530 462114 466122 382497 427727 455643 310070 271842 176599 205550 231615 199467 177914
$$ packed form
14607B14672k2068j03281j9194P1855L4644M3940O9206K679j19977n2973k4891
14596I4612Q8522J29891J09467r117k4411r6326R5096m8236r1769N4724Q2460
14585C84913k8786R1282j9923j07278l868k3809k5333j20312k642R2749O9773
14574C06766m6934N5740j14912p2164r7382N5721K18844o266j55351k283N4115
14563A95894j11629l8063J50508L9914Q4202o3654j19581j87026M6712K12927
14553B10204P9619p5735L3095J99261K3337q8351L13o0644j39167M1570J71465
14542C94967r3979k386j1994j2122M8234j4622J2856o0776O4666R1158P0272k4160
14530D62114M008q3625M5230K7916j45573l8228r5243K8951K6065l2148k1553
$$ plain form
14519 177914 224237 348186 299015 282721 269639 397410 426569 321335 201833 320725
14509 320725 402017 299530 244033 283396 352480 388919 398303 494785 666303 566617 498764
14498 498764 408808 382366 265060 148252 140001 256563 164166 43450 21002 103728 71956
14487 71956 34617 -15257 90292 211687 310448 300179 257953 209274 282577 161326 37754
14476 37754 111256 194150 219472 280000 348760 406996 394781 386271 378792 301463 291761 307154
14464 307154 270619 263088 361339 352404 273938 229650 202210 132542 115599 164350 219140 187587
14452 187587 19847 6831 212061 420652 464919 398074 342136 263286 236707 164083 23892
14441 23892 -46660 -46551 36891 121572 183226 148827 156337 286574 290580 272218 240497 309039
$$ packed form
14519A77914M6323J23949m9171j6294j3082J27771K9159j05234j19502J18892
14509C20725Q1292j02487n5497L9363O9084L6439R384R6482J71518r9686o7853
14498D98764q9956k6442j17306j16808q251J16562r2397j20716k2448Q2726l1772
14487G1956l7339m9874J05549J21395R8761j0269m2226m8679P3303j21251j23572
14476C7754P3502Q2894K5322O0528O8760N8236j2215q510p479p7329r702J5393
14464C07154l6535p531R8251q935p8466m4288k7440o9668j6943M8751N4790l1553
14452A87587j67740j3016K05230K08591M4267o6845n5938p8850k6579p2624j40191
14441B3892p0552J09Q3442Q4681O1654l4399P510J30237M006j8362l1721O8542
$$ plain form
14429 309039 359544 359773 231776 12561 -29136 -33223 7413 143140 86233 134389 318634
14418 318634 369296 354461 262550 260196 281038 382677 412770 273621 294924 285637 261766
14407 261766 214918 220226 211099 177317 218562 200023 189827 120216 268645 282634 288768 254242
14395 254242 221643 146544 136502 97050 175810 235624 222291 279417 215277 253079 283059
14384 283059 275726 395085 284226 209904 159761 144006 185635 378534 347203 380697 355901
14373 355901 300606 297587 282579 318073 388276 372482 296861 203942 229211 271267 258199 312600
14361 312600 329075 318133 315651 222619 151940 287931 408799 462740 342318 307996 459581
14350 459581 468336 478551 445467 318640 261185 330146 361525 479756 452586 392206 400346
$$ packed form
14429C09039N0505K29j27997k19215m1697m087M0636J35727n6907M8156J84245
14418C18634N0662j4835r1911k354K0842J01639L0093j39149K1303r287k3871
14407B61766m6848N308r127l3782M1245j8539j0196o9611J48429J3989O134l4526
14395B54242l2599p5099j0042l9452P8760N9814j3333N7126o4140L7802K9980
14384B83059p333J19359j10859p4322n0143j5755M1629J92899l1331L3494k4796
14373C55901n5295l019j5008L5494P0203j5794p5621r2919K5269M2056j3068N4401
14361C12600J6475j0942k482r3032p0679J35991J20868N3941j20422l4322J51585
14350D59581Q755J0215l3084j26827n7455O8961L1379J18231k7170o0380Q140
$$ plain form
14339 400346 443468 402936 401130 499452 411972 365280 174475 161062 247145 395998 499403
14328 499403 510274 616096 590057 526601 452208 440742 385049 306950 333599 438059 364862
14317 364862 306406 354382 513413 497103 411099 291008 372454 449133 406454 391382 331088
14306 331088 354585 348184 381154 428831 502102 463527 431507 375141 235853 265903 409262
14295 409262 471330 399386 317325 243541 194511 217431 299678 352573 419585 383063 409463
14284 409463 510284 469324 321119 281371 400904 463862 342791 372224 365621 363844 474661
14273 474661 566520 654202 599003 501108 471574 513534 294837 289303 388281 227959 198696
14262 198696 187902 273860 361586 353198 296028 301186 360245 410847 578068 596747 531625 310962
$$ packed form
14339D00346M3122m0532j806R8322q7480m6692j90805j3413Q6083J48853J03405
14328D99403J0871J05822k6039o3456p4393j1466n5693p8099K6649J04460p3197
14317C64862n8456M7976J59031j6310q6004j20091Q1446P6679m2679j5072o0294
14306C31088K3497o401L2970M7677P3271l8575l2020n6366j39288L0050J43359
14295D09262O2068p1944q2061p3784m9030K2920Q2247N2895O7012l6522K6400
14284D09463J00821m0960j48205l9748J19533O2958j21071K9433o603j777J10817
14273D74661R1859Q7682n5199r7895k9534M1960k18697n534R8978j60322k9263
14262A98696j0794Q5958Q7726q388n7170N158N9059N0602J67221J8679o5122k20663
$$ plain form
14250 310962 188399 228537 290447 396907 481643 417022 330820 356714 322521 360549 404967
$$ packed form
14250C10962j22563M0138O1910J06460Q4736o4621q6202K5894l4193L8028M4418
$$ [...]
##END NTUPLES=NMR SPECTRUM
##END=
