##TITLE=Analysis number 327175
Compound Code sp 00324
Project Code adrs
Chemist Name aci
##JCAMPDX= 6.0         $$ Bruker NMR JCAMP-DX V2.0
##DATA TYPE= NMR SPECTRUM
##DATA CLASS= NTUPLES
##ORIGIN= Bruker BioSpin GmbH
##OWNER= nmr
$$ XWIN-NMR		Version 3.5
$$ Tue Mar 13 13:51:43 2007 GMT Standard Time (UT+0h)  MAYBRIDGE\nmr@NMR_250MHZ
##.OBSERVE FREQUENCY= 250.131544655141
##.OBSERVE NUCLEUS= ^1H
##.ACQUISITION MODE= SIMULTANEOUS (DQD)
##.ACQUISITION SCHEME= undefined
##.AVERAGES= 16
##.DIGITISER RES= 18
##SPECTROMETER/DATA SYSTEM= dpx250
##.PULSE SEQUENCE= zg30
##.SOLVENT NAME= CDCl3
##.SHIFT REFERENCE= (INTERNAL, CDCl3, 0, 16.522)
##AUDIT TRAIL= $$ (NUMBER, WHEN, WHO, WHERE, WHAT)
$$ ##TITLE= Audit trail, XWIN-NMR		Version 3.5
$$ ##JCAMPDX= 5.01
$$ ##ORIGIN= Bruker BioSpin GmbH
$$ ##OWNER= nmr
$$ C:\u/data/dgb/nmr/ADRS/800/pdata/1/auditp.txt
$$ ##AUDIT TRAIL=  $$ (NUMBER, WHEN, WHO, WHERE, WHAT)
(   1,<2007-03-13 13:51:22.54 +000>,<MAYBRIDGE\nmr>,<NMR_250MHZ>,
      <created by zg, POWCHK disabled, PULCHK disabled
       configuration hash MD5:
       49 4B E0 1D 92 C2 6B 37 9F E6 65 BC 52 41 86 1D
       data hash MD5: 64K
       10 E7 4D 7B CA F0 54 EE 48 47 F4 AB 5D 07 18 58>)
(   2,<2007-03-13 13:51:35.34 +000>,<MAYBRIDGE\nmr>,<NMR_250MHZ>,
      <Start of raw data processing
       ef LB = 0.3 FT_mod = 6 PKNL = 1 SI = 32K 
       data hash MD5: 32K
       57 AC E4 0E F2 35 C6 CA 83 8B 27 2E BD 76 DC FA>)
(   3,<2007-03-13 13:51:37.17 +000>,<MAYBRIDGE\nmr>,<NMR_250MHZ>,
      <apk 
       data hash MD5: 32K
       0E 2C B5 32 02 0F 86 27 C7 DE AD 1C F5 39 B4 59>)
(   4,<2007-03-13 13:51:38.01 +000>,<MAYBRIDGE\nmr>,<NMR_250MHZ>,
      <abs ABSG = 5 
       data hash MD5: 32K
       57 BC B9 12 F0 28 32 1A 6A 79 A6 D8 5C A3 A1 BC>)
$$ ##END=
$$ 
$$ hash MD5
$$ D9 B6 05 12 EE 38 04 DA 76 F4 41 57 22 0F DB 78
##$RELAX= 
##$RELAX= 
##$RELAX= 
##$RELAX= 
##$RELAX= 
##$RELAX= 
##$RELAX= 
$$ Bruker specific parameters
$$ --------------------------
##$DU= <C:\u>
##$EXPNO= 800
##$NAME= <ADRS>
##$PROCNO= 1
##$TYPE= <nmr>
##$USER= <dgb>
##$AMP= (0..31)
100 100 100 100 100 100 100 100 100 100 100 100 100 100 100 100 100 100 
100 100 100 100 100 100 100 100 100 100 100 100 100 100 
##$AQSEQ= 0
##$AQ_mod= 3
##$AUNM= <au_zg>
##$AUTOPOS= <60 >
##$BF1= 250.13
##$BF2= 250.13
##$BF3= 250.13
##$BF4= 250.13
##$BF5= 500.13
##$BF6= 500.13
##$BF7= 500.13
##$BF8= 500.13
##$BYTORDA= 1
##$CFDGTYP= 0
##$CFRGTYP= 5
##$CHEMSTR= <none>
##$CNST= (0..31)
1 1 145 1 1 1 1 1 1 1 1 1 1 1 1 1 1 1 1 1 1 1 1 1 1 1 1 1 1 1 1 1 
##$CPDPRG= <>
##$CPDPRG1= <>
##$CPDPRG2= <>
##$CPDPRG3= <>
##$CPDPRG4= <mlev>
##$CPDPRG5= <mlev>
##$CPDPRG6= <mlev>
##$CPDPRG7= <mlev>
##$CPDPRG8= <mlev>
##$CPDPRGB= <>
##$CPDPRGT= <>
##$D= (0..31)
0 1 0 0 0 0 0 0 0 0.06 0 0 0 0 0 0 0.0002 0 0 0 0 0 0 0 0 0 0 0 0 0 0 
0 
##$DATE= 1173793881
##$DBL= (0..7)
120 120 120 120 120 120 120 120 
##$DBP= (0..7)
150 150 150 150 150 150 150 150 
##$DBP07= 0
##$DBPNAM0= <>
##$DBPNAM1= <>
##$DBPNAM2= <>
##$DBPNAM3= <>
$$ [...]
##$SUBNAM7= <"">
##$SUBNAM8= <"">
##$SUBNAM9= <"">
##$SW= 20.6930455092707
##$SWIBOX= (0..15)
0 0 3 0 0 0 0 0 0 0 0 0 0 0 0 0 
##$SW_h= 5175.983436853
##$TD= 65536
##$TD0= 1
##$TE= 683.16
##$TE2= 300
##$TE3= 300
##$TEG= 300
##$TL= (0..7)
0 120 120 120 120 120 120 120 
##$TP= (0..7)
150 150 150 150 150 150 150 150 
##$TP07= 0
##$TPNAME0= <>
##$TPNAME1= <>
##$TPNAME2= <>
##$TPNAME3= <>
##$TPNAME4= <>
##$TPNAME5= <>
##$TPNAME6= <>
##$TPNAME7= <>
##$TPOAL= (0..7)
0.5 0.5 0.5 0.5 0.5 0.5 0.5 0.5 
##$TPOFFS= (0..7)
0 0 0 0 0 0 0 0 
##$TUNHIN= 0
##$TUNHOUT= 0
##$TUNXOUT= 0
##$USERA1= <user>
##$USERA2= <user>
##$USERA3= <user>
##$USERA4= <user>
##$USERA5= <user>
##$V9= 5
##$VALIST= <valist>
##$VCLIST= <CCCCCCCCCCCCCCC>
##$VD= 0
##$VDLIST= <DDDDDDDDDDDDDDD>
##$VPLIST= <PPPPPPPPPPPPPPP>
##$VTLIST= <TTTTTTTTTTTTTTT>
##$WBST= 1024
##$WBSW= 4
##$XGAIN= (0..3)
0 0 0 0 
##$XL= 0
##$YL= 0
##$YMAX_a= 457926
##$YMIN_a= -492476
##$ZGOPTNS= <>
##$ZL1= 120
##$ZL2= 120
##$ZL3= 120
##$ZL4= 120
##$ABSF1= 16.522
##$ABSF2= -4.171173
##$ABSG= 5
##$ABSL= 3
##$ALPHA= 0
##$AQORDER= 0
##$ASSFAC= 0
##$ASSFACI= 0
##$ASSFACX= 0
##$ASSWID= 0
##$AUNMP= <proc_1d>
##$AZFE= 0.1
##$AZFW= 0.1
##$BCFW= 0
##$BC_mod= 0
##$BYTORDP= 0
##$COROFFS= 0
##$CY= 12.5
##$DATMOD= 1
##$DC= 0
##$DFILT= <>
##$DTYPP= 0
##$F1P= 14.0000005364418
##$F2P= -0.99999901652339
##$FCOR= 0.5
##$FTSIZE= 32768
##$FT_mod= 6
##$GAMMA= 0
##$GB= 0
##$INTBC= 1
##$INTSCL= 1
##$ISEN= 128
##$LB= 0.3
##$LEV0= 0
##$LPBIN= 0
##$MAXI= 10000
##$MC2= 0
##$MEAN= 0
##$ME_mod= 0
##$MI= 0
##$NCOEF= 0
##$NC_proc= -4
##$NLEV= 6
##$NOISF1= 0
##$NOISF2= 0
##$NSP= 0
##$NTH_PI= 0
##$NZP= 0
##$OFFSET= 16.522
##$PC= 1
##$PHC0= 77.81194
##$PHC1= 6.26893
##$PH_mod= 1
##$PKNL= yes
##$PPARMOD= 0
##$PSCAL= 4
##$PSIGN= 0
##$REVERSE= no
##$SF= 250.13
##$SI= 32768
##$SIGF1= 0
##$SIGF2= 0
##$SINO= 400
##$SIOLD= 32768
##$SREGLST= <1H.CDCl3>
##$SSB= 0
##$STSI= 32768
##$STSR= 0
##$SW_p= 5175.98343685301
##$SYMM= 0
##$S_DEV= 0
##$TDeff= 65536
##$TDoff= 0
##$TI= <Analysis number 999999
Compound Code 99
Book Reference 9
Project Code 9>
##$TILT= no
##$TM1= 0
##$TM2= 0
##$TOPLEV= 0
##$USERP1= <user>
##$USERP2= <user>
##$USERP3= <user>
##$USERP4= <user>
##$USERP5= <user>
##$WDW= 1
##$XDIM= 32768
##$YMAX_p= 437955536
##$YMIN_p= -102793
$$ End of Bruker specific parameters
$$ ---------------------------------
##NTUPLES= NMR SPECTRUM
##VAR_NAME=  FREQUENCY,     SPECTRUM/REAL,   SPECTRUM/IMAG
##SYMBOL=    X,             R,               I
##VAR_TYPE=  INDEPENDENT,   DEPENDENT,       DEPENDENT
##VAR_FORM=  AFFN,          ASDF,            ASDF
##VAR_DIM=   32768,         32768,           32768
##UNITS=     HZ,            ARBITRARY UNITS, ARBITRARY UNITS
##FACTOR=    0.157963299565203, 1,           1
##FIRST=     4132.6476996994, 0,             0
##LAST=      -1043.33573715361, 0,           0
##MIN=       -1043.33573715361, -102793,     0
##MAX=       4132.6476996994, 437955536,     0
$$ Real data points
##PAGE= N=1
##DATA TABLE= (X++(R..R)), XYDATA
$$ [...]
13777A657M849M802l470k1233q847O830N444j7510j137P859M077J1388J1596Q195
13763A4500k950j8385j2022L751r87J6700J1618k571r041l558P765M146j4070
13750e104j3196p963J538M006J0919m336L0J9923j952q352J0198N040n744j608
13736C399o832Q29o934j1871m600P632O546m749j0720O767J272R288J974O809
13722a190K583P862k878N880K177j3980m467Q235n436o045J214l70k903k895l732
13707a5945K104O690J013m38M403L181r19R044J338N936J834j294k533k458o253
13692E703Q077p989j2018Q096N587K945o000j4909K804K520n100L217n75m14p065
13677a5121m189m248O083J828p234P247J0652M773o802p529L703m674r8L302l744
$$ plain form
13777 1657 6506 11308 7838 -13395 -22242 -15412 -9968 -27478 -28615 -20756 -16679 -5291 6305 14500
13763 14500 11550 -6835 -18857 -15106 -16093 607 12225 9654 613 -2945 4820 8966 -5104
13750 -5104 -18300 -26263 -24725 -20719 -9800 -14136 -14106 5817 3865 -4487 5711 10751 5007 3399
13736 3399 -3433 -2604 -9538 -21409 -26009 -18377 -11831 -16580 -27300 -20533 -19261 -9973 -7999 -1190
13722 -1190 1393 9255 6377 12257 14434 454 -4013 4222 -1214 -7259 -6045 -6415 -9318 -12213 -15945
13707 -15945 -13841 -7151 -6138 -6576 -2173 1008 89 9133 10471 16407 18241 16947 14414 11956 5703
13692 5703 13780 5791 -6227 1869 7456 10401 4401 -10508 -7704 -5184 -10284 -7067 -7642 -8056 -15121
13677 -15121 -19310 -23558 -17475 -15647 -22881 -15634 -4982 -209 -7011 -14540 -10837 -15511 -15609 -12307 -16051
13662a6051r381j45P402J4616R427j2686q487M35m343R686P10p028J5395J8046
13648A7596O13r834l3J357r677j5063j273J1267o355j0630K2P775M122J2990J5267
13633A8144j1445M809M586o703j0894j4079O984O045P812N202o361p090l127K785
13619c332k213J1609J0301o867L338j0403m839N739P409k233l441p025j36J1678
13605I585O501j0428j8242k114j851R41J6848R277L078n11k526j4348K079q389
13591a0100o277R259K540m1l08O618n640l775n294L958l808L859J0297M262q242
13576b692q016N341j4291l528J442K1564L01n22l691r422O770Q181K341K388J502
13561G668j3525n85R37j139o612N805J7210J263j5706M576l056j2365N651K917
$$ plain form
13662 -16051 -25432 -25577 -18175 -3559 5868 -6818 -15305 -14870 -19213 -9527 -8817 -15845 -450 17596
13648 17596 18209 8375 8342 9699 22 -15041 -16314 -5047 -11402 -22032 -22010 -14235 -10113 2877 18144
13633 18144 6699 11508 16094 9391 -1503 -15582 -8598 -2553 5259 10461 4100 -2990 -6117 -3332
13619 -3332 -5545 6064 16365 9498 12836 2433 -2406 3333 10742 8509 5068 -1957 -2093 9585
13605 9585 16086 5658 -12584 -14698 -16549 -15608 1240 10517 13595 13084 10558 -3790 -1711 -10100
13591 -10100 -16377 -7118 -4578 -4619 -4927 1691 -3949 -7724 -13018 -9060 -12868 -9009 1288 5550 -2692
13576 -2692 -10708 -5367 -19658 -23186 -21744 -180 121 -401 -4092 -13514 -6744 1437 3778 6166 7668
13561 7668 -5857 -6442 -5505 -6644 -13256 -7451 9759 11022 -4684 -108 -3164 -15529 -9878 -6961
13547f961O098J6302N326j3454q502o242k004p01n172P163j677K094J1769j333
13533B706j1578P209J5142K846M639k820m568Q964k806j1440P143p623p921p774
13519g881j996Q396m017q248n327J2772Q27j4737K045M491j170j003l74O49k093
13504a7666n871j827n960k466L296N564J4130J0878J3949J70l813m699P165O080
13490A8930l570j358o016o594n642J089r895P759L808p832M229N399m086n515
13476i294j3899J651Q426o721J2035R396l017l545L755K513l352O317p761r666
13462a3162m315M483R024p798q302J578J0561P002J656n711q36n943m096J5413
13448d46J418R43o571j051k582L740N377k223Q102N854r856j5665j381J0142O209
$$ plain form
13547 -6961 -863 15439 20765 7311 -1191 -7433 -9437 -10138 -15310 -8147 -9824 -7730 4039 2706
13533 2706 -8872 -1663 13479 16325 20964 18144 13576 22540 19734 8294 15437 7814 -107 -7881
13519 -7881 -9877 -1481 -5498 -13746 -19073 -6301 -5474 -20211 -18166 -13675 -14845 -15848 -16222 -15573 -17666
13504 -17666 -23537 -25364 -31324 -33790 -30494 -24930 -10800 78 14027 14197 10384 5685 12850 18930
13490 18930 15360 14002 7986 1392 -4250 -3161 -13056 -5297 -1489 -9321 -5092 307 -3779 -9294
13476 -9294 -23193 -21542 -13116 -19837 -7802 1594 -1423 -4968 -1213 1300 -2052 4265 -3496 -13162
13462 -13162 -17477 -12994 -3970 -11768 -20070 -18492 -7931 -929 727 -4984 -5820 -11763 -15859 -446
13448 -446 972 1915 -4656 -5707 -8289 -4549 828 -1395 6707 12561 2705 -12960 -14341 -4199 2010
13433B010m120l258N713L80P802O528j4421L686l663j0887p325p411N016m930
13419b4880q720l787k299Q956J0996J143L159O838m313L513O288J0964n55j5447
13405h144j0686l188j725O207M129n455k049J1731J337r320n04J3346R24O666
13391C269p73k167K198O69n922o849M16J311J0436P626o824m408M058m196m31
13376a587M350L017n163n567p775n317P522J2398j1030l630j210L142R566L54
13362i30J926R713K884q471j8364q263J7199K5223J1165Q63m568p882j4942r041
13348c488Q309k902j421N641m230q258l268N616M122K352J1301k199L419p959
13334G035j2758J3388J524q131j4493o813J2322J4490Q650N329n620q178r184
$$ plain form
13433 2010 -2110 -5368 345 725 8527 15055 634 4320 657 -10230 -17555 -24966 -19950 -24880
13419 -24880 -33600 -37387 -39686 -30730 -19734 -18591 -15432 -8594 -12907 -9394 -3106 7858 7303 -8144
13405 -8144 -18830 -22018 -23743 -17536 -13407 -18862 -20911 -9180 -7843 -17163 -17667 -4321 -3397 3269
13391 3269 2496 329 2527 3196 -2726 -9575 -9159 -7848 2588 10214 3390 -1018 3040 -1156 -1587
13376 -1587 2763 5780 617 -4950 -12725 -18042 -10520 1878 -9152 -12782 -13992 -10850 -1284 -930
13362 -930 996 10709 13593 5122 -13242 -21505 -4306 20917 32082 32945 28377 20495 5553 -3488
13348 -3488 4821 1919 498 6139 1909 -6349 -9617 -4001 121 2473 13774 11575 14994 7035
13334 7035 -5723 7665 9189 1058 -13435 -20248 -7926 6564 15214 20543 14923 6745 -2439
13321b439q237Q630P120r226j9003J36N556q213P544N786k231l830k177O277o249
13306b0556q43K383j399R322K425o113r489j168J089L147J0442K233j1690k591
13292b2808J2600L286J4061O919L134q258M62P742j0192q739p227j367m098k647
13278a7132p98M383L25q580Q537O200K1368O152o485p043R4L226m860j302o108
13263b023N926K184m922n910M444N254m217k751n753m64J476j045L299q13n241
13248a0556j3105M044P163J19J08n794j0823j930N835K245N562N476J3260q687
13234g083m541l365J5107P159j0468o207J9444m91j1148k40J1343O197J568r780
13220G495n586L950p499M821m291j0666J2286N791k485k890J734o185P587M384
$$ plain form
13321 -2439 -10676 -2046 5074 -4152 -23155 -23019 -17463 -25676 -18132 -12346 -14577 -18407 -20584 -14307 -20556
13306 -20556 -21399 -19016 -20415 -11093 -8668 -14781 -24270 -25438 -24349 -21202 -10760 -8527 -20217 -22808
13292 -22808 -10208 -6922 7139 14058 17192 8934 9396 17138 6946 -1793 -9020 -10387 -14485 -17132
13278 -17132 -17930 -13547 -13222 -21802 -13265 -7065 14303 20455 13970 6927 7021 10247 5387 4085 -2023
13263 -2023 3903 6087 1165 -4745 -301 4953 736 -2015 -7768 -8232 -6756 -7801 -4502 -5315 -10556
13248 -10556 -23661 -19617 -12454 -12335 -12227 -18021 -28844 -30774 -24939 -22694 -17132 -11656 1604 -7083
13234 -7083 -11624 -14989 118 7277 -3191 -9398 10046 9555 -1593 -1833 9510 15707 17275 7495
13220 7495 1909 5859 -1640 3181 -1110 -11776 510 6301 3816 926 2660 -3525 4062 8446
13206H446j06p86r400m273L810k765L330L249l142r00r893J9192J4043j0578j0127
13191A00k502p265p706J5292Q361n02P068k115M377n144j8108m340R66Q54K591
13176h073J0678J3901k576m564l220Q269N850p543l070q083J75J4495o97p350
13162H192M643j791j1102m53J0632l859j552N450L61j0022J833J9112J499k3021
13148g8k745J6234l452j2049r487M383j0317n03J0072K1147O909M17n480q812
13134F239m786M055J3926J0092j812p562j0417L292K98R030Q669l460j9741m133
13120C690J4254l639r021R93J1841q10m843K15j088K818j225O135j2754j3330
13106f764k948O376o88l764j496K398R424N040P661j710o34R15k730q193N22r464
$$ plain form
13206 8446 8340 7554 -1846 -6119 -2309 -5074 -1744 1505 -1637 -2537 -12430 6762 20805 10227 100
13191 100 -2402 -9667 -17373 -2081 6280 5778 12846 10731 15108 9964 -8144 -12484 -11518 -10664 -8073
13176 -8073 2605 16506 13930 9366 6146 14415 20265 12722 9652 1569 1744 16239 15542 8192
13162 8192 12835 11044 -58 -511 10121 6262 4710 10160 10521 499 2332 21444 22943 -78
13148 -78 -2823 13411 9959 -2090 -11577 -7194 -17511 -18014 -7942 13205 20114 20531 15051 6239
13134 6239 1453 5508 19434 29526 27714 20152 9735 13027 13325 22355 31024 27564 7823 3690
13120 3690 17944 14305 5284 6277 18118 17308 12465 12680 11592 14410 13185 19320 6566 -6764
13106 -6764 -9712 -3336 -4024 -7788 -9284 -6886 2538 7578 15239 13529 12895 13810 11080 2887 3409 -6055
13090f055N294R681Q794j3697j4854L964M717P082q63K497q605p709O853O264
13076C363j2870j8249N132K3766Q524Q359o287j8077Q183L111j1972m907r377
13063b1301m945J3713Q874j124J6136L548j2101K01J7105K0122l050k0108k64
13050A6806J1131m04j8206m656Q269k264J1554j271M023J650l136q4p630m621
13036A1161L951l772n190j2876J5024n480R24J320J0923o129p836k0361L258L69
13022a4714R450R397N858L991m716o229l389J0753m351r108j098m892N150J2492
13008H594k150m057N983n020J66L78O829m1o445p199o266m632N257M104j7727
12993b2226J876N554J96j2623K739J0324J0053L457k164J592M83k188j430Q492
$$ plain form
13090 -6055 -761 8920 17714 4017 -10837 -6873 -2156 4926 4063 6560 -2045 -9754 -2901 3363
13076 3363 -9507 -27756 -22624 1142 9666 18025 11738 -6339 1844 4955 -7017 -11924 -21301
13063 -21301 -26246 -12533 -3659 -4783 11353 14901 2800 3001 20106 40228 37178 17070 16806
13050 16806 27937 27533 9327 4671 12940 10676 22230 20959 24982 26632 23496 23412 15782 11161
13036 11161 15112 11340 6150 -6726 8298 2818 3742 5062 15985 9856 2020 -18341 -15083 -14714
13022 -14714 -5264 4133 9991 13982 9266 3037 -352 10401 6050 -3058 -4156 -9048 -3898 8594
13008 8594 6444 2387 8370 3350 3516 3894 10723 10682 4237 -2962 -9228 -13860 -8603 -4499 -22226
12993 -22226 -20350 -14796 -14600 -27223 -24484 -14160 -4107 -650 -2814 -1222 -739 -2927 -4357 4135
12979D135k011j133J316j3007J862Q859M811J241O390L880n554O593l840k937
12965A0605K920J2798l115j5030j9588j394K372N786O240p696R141O448m432j4997
12951i942J0045m165N724R129N477P055j0908J72M173L609m579r340N45P190K808
12936A6993l782o688p825j6799O922J4387K589j0491k026J1196Q325P657j0524
12923I934M894K260p620p045L744J159q30j0136j695M373l222L918M120n184l360
12908d690L872l82p89o400O393R275R091r218m861Q291M180O935l561o90K007
12893A9453J1568o557k578l767M83k91k397J1428Q38n34j1954j3293n796M685
12879A288K643m82n29M24k725L550P933Q444r812j9630m696M603j2566K01M105
$$ plain form
12979 4135 2124 991 2307 -10700 -8838 21 4832 6073 12463 16343 10789 17382 13542 10605
12965 10605 13525 26323 23208 8178 -11410 -12804 -10432 -4646 1594 -6102 3039 9487 5055 -9942
12951 -9942 103 -4062 1662 10791 16268 23323 12415 12587 16760 20369 15790 6450 6995 14185 16993
12936 16993 13211 6523 -1302 -18101 -11179 3208 5797 -4694 -6720 4476 12801 20458 9934
12923 9934 14828 17088 9468 2423 6167 7326 6496 -3640 -5335 -962 -4184 -266 3854 -1330 -4690
12908 -4690 -818 -1200 -1989 -8389 -1996 7279 16370 7152 2291 10582 14762 21697 18136 17446 19453
12893 19453 31021 24464 21886 18119 18602 18311 15914 27342 28180 27646 15692 2399 -3397 1288
12879 1288 3931 3449 2920 3344 619 4169 12102 20546 10734 -8896 -13592 -8989 -21555 -21354 -17249
12864a7249O389O725R652P71R016P103j0819j613K625K096o99k426N146n995j1353
12849f31m30k107J940m763o41P035r435l780J3705O289O927N9j283j840J47j1447
12833b55l199p98K907m396P422L763j0452j593M701P667l119R37M984k541r031
12818c003j6461j477j296J9751j4837K796K1940M841n759P528j128l942k739k63
12804E951l175q680L45N313j2513n567O891j2545j600J0399J5672J8642m696j2110
12790B327p417J5547L640j1886q389J621J5530R638O822j1878q403j6265l152
12777a2265P450O381J2469l727j1261l531P010J5160K915p208j600n811Q240Q66
12763A5088r963p119N859J0329k820J793j1466p746O967J4389o133k280j591j699
$$ plain form
12864 -17249 -10860 -4135 5517 6288 15304 22407 11588 9975 12600 14696 13997 11571 16717 10722 -631
12849 -631 -1061 -3168 -1228 -5991 -6632 403 -9032 -12812 893 7182 14109 14168 12885 11045 11192 -255
12833 -255 -3454 -4252 -1345 -5741 1681 5444 -5008 -6601 -1900 5767 2648 3585 8569 6028 -3003
12818 -3003 -19464 -20941 -22237 -2486 -17323 -14527 7413 12254 6495 14023 12895 8953 6214 5951
12804 5951 2776 -5904 -5559 -246 -12759 -18326 -11435 -23980 -25580 -15181 491 19133 14437 2327
12790 2327 -5090 10457 14097 2211 -6178 -4557 10973 20611 27433 15555 7152 -9113 -12265
12777 -12265 -4815 1566 14035 10308 -953 -4484 2526 17686 20601 13393 11793 5982 14222 15088
12763 15088 5125 -1994 3865 14194 11374 13167 1701 -6045 922 15311 9178 6898 5307 3608
12749C608Q709L85O078N245j4301m36j4753j9202l540J7022J4840O929n036m59
12735E089n320n582r153M052p95N690N662k069q458J720P995O787N900M952N136
12720B1606p726l709k313k937K686L519k745m015M622j1022l350j725Q594R473
12706A0958O586j1621m548M229J4997l519n187l655K504K070Q732m457j0292j195
12692E602M41N999N474P552O61j1688j5006j1622N436J9796L557k287r608j1513
12678g206k84L08L467O696L663J1541M223m530o658j0427o273P765K060Q71K008
12663G224J676n450K456p780r43l209L625J1908J1823n126l978n1p756O014O88
12648A1121j3414m949J4388O772j0871j2472L677Q406M317N52j1675K866O627
$$ plain form
12749 3608 12317 12702 18780 24025 9724 9288 -5465 -24667 -28207 -11185 3655 10584 5548 5089
12735 5089 -231 -5813 -14966 -10914 -11709 -6019 -357 -2426 -10884 -9164 -1169 5618 11518 16470 21606
12720 21606 13880 10171 7858 4921 7607 11126 8381 4366 8988 -2034 -5384 -7109 1485 10958
12706 10958 17544 5923 1375 5604 20601 17082 11895 8240 10744 12814 21546 17089 6797 5602
12692 5602 6043 12042 17516 25068 25729 14041 -965 -12587 -7151 12645 16202 13915 4307 -7206
12678 -7206 -7490 -7182 -3715 2981 6644 18185 22408 17878 11220 793 -5480 2285 4345 5216 7224
12663 7224 8900 3450 5906 -1874 -2817 -6026 -2401 9507 21330 16204 12226 12175 4419 10433 11121
12648 11121 -2293 -7242 7146 13918 3047 -9425 -5748 2658 6975 7527 -4148 -1282 5345
12635E345M292m67K38N17L980P499L266q887N469r417n450O429Q50m626J010j0495
12619d47j1951r613K772P986K948J0736Q8o323l228J3601R897j3104n415m465
12605f518J458M203L653M286k236j956J5545n868q377M465m708m616n364J3809
12591G776o024j1159j168n438N355J6985R834J338n388o523K236J2572m446r551
12577F399K483J179l686o272j2408L87J0796m440J5720L125Q880o876n100O149
12563A6336J377j3099j5039K579J1414J096N349O369L019J0156p653N243N383
12550C2530q701n846O038L837J604r103n661L772k774j6896o002M864k947o556
12536a1841J7308L551J562r602k373O029R506l694p829J836l874M121m557K862
$$ plain form
12635 5345 9637 9170 9408 9925 13905 21404 24670 15783 21252 11835 6385 12814 13664 9038 10048 -447
12619 -447 -12398 -22011 -19239 -11253 -8305 2431 2519 -3804 -7032 6569 16466 3362 -2053 -6518
12605 -6518 -5060 -857 2796 7082 4846 2890 18435 12567 4190 8655 3947 -669 -6033 7776
12591 7776 1752 -9407 -10575 -16013 -10658 6327 16161 17499 12111 5588 7824 20396 15950 6399
12577 6399 8882 10061 6375 103 -12305 -11918 -1122 -5562 10158 13283 22163 15287 10187 16336
12563 16336 17713 4614 -10425 -7846 3568 4664 10013 16382 19401 29557 21904 27147 32530
12550 32530 23829 17983 24021 27858 29462 20359 14698 18470 15696 -1200 -7202 -2338 -5285 -11841
12536 -11841 5467 9018 10580 978 -1395 4634 14140 10446 2617 4453 579 4700 143 3005
12522C005J2232L876J132p635j4838N048R035M038L228R219q52r931j2583K398
12508G372M169j24N390q434j237K580j354J757j54n785j6557L892Q041L356J4699
12493A7611r28j8156q292J0703N299R865j985J023R68m809k106J0174L533j494
12479B1406j061N145q064j3373m188J2274O50r848j590O915K934J2274k062J054
12465B2466j5503k752j017m251K873m039J398N517m78J038J6k09l032o211J1964
12450G780o768p795L649J2760O54k660l318j639l674k08P802o55M294p89j538
12435G895M273j645l8J1216O468L536p909l932L708R873K503p909o000m300N922
12420B3661m409k723n847r017k2414n48R829j370J1266J2107M541m76K622J592
$$ plain form
12522 3005 15237 19113 20245 12610 -2228 2820 11855 15893 19121 28340 27488 17557 4974 7372
12508 7372 11541 11417 16807 8373 7136 9716 8362 10119 9965 4180 -12377 -8485 -444 2912 17611
12493 17611 16683 -1473 -9765 938 6237 16102 14117 15140 16108 11299 9193 19367 22900 21406
12479 21406 20345 25490 17426 4053 -135 12139 12789 2941 1351 8266 11200 23474 21412 22466
12465 22466 6963 4211 3194 -1057 1816 -2223 -825 4692 4214 5252 5268 5059 2027 -4184 7780
12450 7780 1012 -6783 -3134 9626 10280 7620 4302 2663 -1011 -1219 6583 5928 10222 9433 7895
12435 7895 12168 10523 10485 21701 28169 31705 23796 19864 23572 33445 35948 28039 22039 17739 23661
12420 23661 19252 16529 10682 1665 -20749 -21297 -11468 -12838 -1572 10535 15076 14600 17222 18814
12406A8814o268P512j1927m582J1305j119o708k749N70j3554P13J2723K96j3489
12392h463o247M756j814m344R953J4329Q586J2159P318k0618j2232K201O017M884
12378A6485j85K635q759j857J4226q056j2719j4817N01M347J448Q276J2165j021
12364A2669j5306j2602O654K8482P746l704j006l07J454j3126j0258R11L438o575
12350a530Q087q885m915Q172m450P303J5525R441J634k108j0783m99q526j4951
12336f485N348J0953O848j125o994j647m377O408m440j607j0022j0626M279K735
12322a0752J3394p47N344L564N719q03p181m803j245Q890K211P635P278q647n644
12307A4213N184K217K546q20K918n815K96J0326m723o915k234o247j0306r434
$$ plain form
12406 18814 12546 20058 8131 3549 14854 13735 7027 4278 4848 -8706 -7993 4730 5026 -8463
12392 -8463 -14710 -9954 -11768 -16112 -6159 8170 16756 28915 36233 15615 3383 5584 11601 16485
12378 16485 16300 18935 10176 8319 22545 14489 1770 -13047 -12546 -8199 -6751 1525 13690 12669
12364 12669 -2637 -15239 -8585 19897 27643 23939 22933 22626 24080 10954 696 1607 5045 -1530
12350 -1530 6557 -2328 -7243 929 -3521 3782 19307 28748 30382 28274 17491 16992 8466 -6485
12336 -6485 -1137 9816 16664 15539 8545 6898 2521 8929 4489 2882 -7140 -17766 -13487 -10752
12322 -10752 2642 1895 7239 10803 16522 15719 8538 3735 2490 11380 13591 21226 28504 19857 14213
12307 14213 19397 21614 24160 23340 26258 20443 20739 31065 26342 19427 17193 10946 640 -8794
12293h794M244J1444m357K051K0109K711j8540j4108p419N712J8246J3978j0511
12280A4766j2309m367R591L077n844j1078Q511J0225l42p532l779k872J2068j481
12266H634L970k775J141O99k790l44n8J969k578l983K40m374N716K375j2517o193
12250a0868J270K0356J068R609M119o352k593Q174N534j0187j2952J971J2607
12237B1756R288P9j3640K482l27J212j5208j6095J058J502J2617Q808q573k049
12223B910K371k992J2098m261r343J5373J0918o911j3781n254N530Q254K413k864
12209A4461k139K097l351J2504J1840o252l602o839K986j100j2584K154Q510L169
12195B1854r281M252Q15J472j788q398l560j1284j3553Q801P618J643q564N604
$$ plain form
12293 -8794 -4550 6894 2537 4588 24697 27408 8868 -5240 -12659 -6947 11299 25277 14766
12280 14766 2457 -1910 7681 10758 4914 -6164 2347 12572 12230 4698 919 -1953 10115 8634
12266 8634 12604 9829 10970 11669 8879 8535 8477 10446 7868 3885 4125 -249 5467 7842 -4675 -10868
12250 -10868 -9598 10758 11826 21435 25554 19202 16609 24783 30317 20130 7178 9149 21756
12237 21756 31044 31123 17483 19965 19638 20850 5642 -10453 -9395 -7893 4724 13532 4959 2910
12223 2910 5281 2289 14387 10126 783 16156 27074 20163 6382 1128 6658 14912 17325 14461
12209 14461 12322 14419 11068 23572 35412 29160 25558 18719 21705 20605 8021 10175 18685 21854
12195 21854 12573 16825 17640 19112 17324 8926 5366 -5918 -19471 -10670 -3052 -1409 -9973 -4369
12181d369J7444N270j495J877k224n543M588L181J819Q846J696j7651q128O539
12167A1850j660O669l146N361j4847j2776R373q1l443L520J2552K1662J3451J1598
12153F0083J147k0094k1828o690J966M939O687M288l528q305o739l56P083l182
12139A5471n596O54l302K546o42j1379o779M488O813M926k17j682j2789j1895
12125a9383J2228N676j419m003J0004J7813O632k307j5043p550K622l588O159
12112G841J6102N200J0387M719m192q764q96r250o996k01J346n97j083J3513L975
12097C1104m954n803n62J947L39k566O482j377k717k1166N523J53O8R184K325
12082A7980r452p26P654M987o202j2573k5J4232L025p835O881R480q58Q955r077
$$ plain form
12181 -4369 13075 18345 16850 18727 16503 10960 15548 18729 20548 29394 31090 13439 5311 11850
12167 11850 10190 16859 13713 19074 4227 -8549 824 743 -2700 820 13372 35034 48485 60083
12153 60083 61230 41136 19308 12618 14584 19523 26210 30498 26970 18665 11926 11570 18653 15471
12139 15471 9875 10529 7227 9773 9131 -2248 -9027 -4539 2274 7200 6983 5301 -7488 -19383
12125 -19383 -7155 -1479 -2898 -6901 3103 20916 27548 25241 10198 2648 5270 1682 7841
12112 7841 23943 29143 39530 44249 40057 31293 30397 21147 14151 13950 15296 14699 13616 27129 31104
12097 31104 26150 20347 19785 21732 22071 19505 25987 24610 21893 727 6250 6403 6471 15655 17980
12082 17980 8528 7802 15456 20443 14241 1668 1643 15875 18900 11065 17946 27426 26568 35523 26446
12067B6446r961Q354n973K64O44j1004l154M014O61P697J1935j009K437L821j2216
12052B2956j5600j135J547o570j0768J2177J920L565p89N47n089O269M087n998
12038G119L537Q623K281k236k963N892j4128q181L757J5112r97q783l469L862
12024I426M973O700q027j2072J1375K289o770N158p422O746Q100K261k07l11m162
12009A8057k016o783j2333N59m22P661o646O270J1591J2521j400k1401q616J5248
11995A2290O667q346m136o302R048K373j0042p209M981n816J865K61m069J5893
11981G458m404P499Q552j9110p789m688O951O212k650Q205J0316j481q936N753
11967A1888J1554M16J336q706j6850j7317n115J2628J8701Q708K679n483p303
$$ plain form
12067 26446 16485 24839 18866 19130 19774 8770 5616 9630 10291 17988 29923 28914 31351 35172 22956
12052 22956 7356 6221 7768 1198 -9570 2607 4527 8092 7303 7850 2761 9030 13117 7119
12038 7119 10656 19279 21560 19324 16361 22253 8125 -56 3701 18813 17816 9033 5564 9426
12024 9426 14399 21099 13072 1000 12375 14664 7894 13052 5630 12376 20476 22737 22530 22219 18057
12009 18057 16041 9258 -3075 -2516 -2938 4723 -1923 4347 15938 28459 27059 5658 -2958 12290
11995 12290 18957 10611 6475 173 9221 11594 1552 -5657 -676 -6492 -4627 -4366 -8435 7458
11981 7458 3054 10553 19105 -5 -7794 -12482 -5531 681 -1969 6236 16552 15071 6135 11888
11967 11888 23442 23858 25194 16488 -362 -17679 -22794 -10166 8535 17243 19922 14439 7136
11954G136j0030J0990L733j1990J989L088L735R68m557k054M601o440O945K2897
11940C1011J4684j0359j0746j332n963k056R220j372o745L647J99n818L769J470
11926A9609K564O512k31j5619M254J1266j847j1533m683j3473P9M026M354K330
11912G608J011L760N055J219r262j3828m366K540K860r84K784m433n25Q555J1191
11897A3185j0108L312M230P68n20M304N178k464n470J3407N270q425M884K871
11883C0422j2196k0538j4901m452L201J0338J1473P821m880j656k520q87K690
11870C915P470O797n910j043n852q583P246J667p983j254J265J1662Q21r783N39
11855I74J8059j15j0523J29J0551N381r28k838q827k832j578j33K552%q260j1103
$$ plain form
11954 7136 -2894 8096 11829 -161 1828 4916 8651 9619 5062 3008 7609 1169 8114 31011
11940 31011 45695 35336 24590 23258 17295 15239 24459 23087 16342 19989 20188 14370 18139 19609
11926 19609 22173 28685 28454 12835 17089 28355 26508 14975 10292 -3181 -3102 924 5278 7608
11912 7608 8619 12379 17434 18653 9391 -4437 -8803 -6263 -3403 -4387 -1603 -6036 -6561 1994 13185
11897 13185 3077 6389 10619 11387 10867 15171 20349 17885 12415 25822 31092 22667 27551 30422
11883 30422 18226 -2312 -17213 -21665 -18464 -8126 3347 11168 6288 4632 2112 1225 3915
11870 3915 11385 18182 12272 11229 5377 -3206 4040 5707 -2276 -3530 -2265 9397 10218 435 974
11855 974 19033 18918 8395 8524 19075 24456 23528 20690 11863 9031 7453 7320 9872 9872 1612 -9491
11839i491o226l270J445Q066J7173M345j0678L786p305k237l733J212n671P124
11825e460M88O598J753j2065k301J4479O302M694q493o502j770N795O928j139
11811I307r074Q769J0562J2291J1807p900q866J826K702N443K092m865j1704j0370
11797A2020p251L778n286n763J1013J3513M116j3870o887P113r36O383J7677N96
11783C6216j6364j2813k60J2142Q362K279k455j0905j0166N701M555K258j1335
11770G215N039j636R434Q725L64q698N180J1510l25o410k275n472M538M308p187
11755B4310N125L192n817o406K350m218j4202k404J4365J8866Q800L901j4855
11742C3007j2567m670m577L183O967j11m952j855r010o299N765o519J1677K6487
$$ plain form
11839 -9491 -15717 -18987 -17542 -9476 7697 12042 1364 5150 -2155 -4392 -8125 -6913 -12584 -5460
11825 -5460 -4972 1626 3379 -8686 -10987 3492 9794 14488 5995 -507 -2277 3518 10446 9307
11811 9307 233 9002 19564 31855 43662 35762 26896 28722 31424 36867 38959 34094 22390 12020
11797 12020 4769 8547 3261 -2502 8511 22024 26140 12270 5383 12496 11560 17943 35620 36216
11783 36216 19852 7039 6779 18921 27283 29562 27107 16202 6036 11737 16292 18550 7215
11770 7215 12254 10618 20052 28777 29141 20443 25623 37133 36808 30398 28123 22651 27189 31497 24310
11755 24310 29435 32627 26810 20404 22754 18536 4334 1930 16295 35161 43961 47862 33007
11742 33007 20440 15770 11193 14376 21343 21232 16280 14425 5415 -884 4881 -1638 10039 36526
11728C6526L621m075r031j792L737J286j0180j294O641N344M637n118M642Q831
11714D3775M66j7617j2914q867l09J0712M434K495j2008j0731J2868J682N48j250
11700A3284J6953K387o554j951k614r973p908J0380j3453j806K078M325M965q40
11686I273N34o366J0789P892k703n076N846K455J341P592P519P98K156o385k0917
11671A4748l933K250N081J3395N122J562j1423n232J4066O009k8r842j1555n704
11657A4516K203J937p998q916p289N664Q715l255J581K554K548K624l793o498
11643D593J0079J6341k866k532j3465j0134j1323l502Q510Q571J2229q406m515
11630C580N816j0149j969o25L258J273L674J4521R878J041j2918o718K586o772
$$ plain form
11728 36526 40147 36072 27041 25249 28986 30272 20092 18798 25439 30783 35420 30302 34944 43775
11714 43775 44241 26624 13710 4843 4534 15246 19680 22175 10167 -564 12304 13986 14534 13284
11700 13284 30237 32624 26070 24119 21505 11532 3624 14004 551 -1255 823 5148 10113 9273
11686 9273 9807 3441 14230 22122 19419 14343 20189 22644 23985 31577 39096 39894 42050 35665 14748
11671 14748 10815 13065 18146 31541 36663 38225 26802 21570 35636 41645 41617 31775 20220 14516
11657 14516 16719 18656 10658 1742 -5547 117 8832 5577 7158 9712 12260 14884 11091 4593
11643 4593 14672 31013 28147 25615 12150 2016 -9307 -12809 -4299 4272 16501 8095 3580
11630 3580 9396 -753 -2722 -3347 -89 1184 4858 19379 29257 30298 17380 10662 13248 6476
11616F476J93P297m333M524R715r344j805N783p423k902O88o79L225j337O165
11601A6243R252j823n316J062J2063j2668K201o3J190p425K200P392o308o855
11587A1145j450Q709J6233K640m812j2858m240m031j9729l215R078J353J7420
11574A6243K974J2218o095j403K432l372M278n220n877j0481J734J3079J0276
11561C0786k264N504J587o097j0592N690Q50m184j5002j5820R45l123Q561L530
11547C71l134P045M604n98O030N046L921M02q725m760J933L453L1M116Q752K826
11531C1313L221l909l801L397n005j1662n246k132P715Q587M735k831k80o171
11517A7931l758k953r05j3909j372L176L078j061j509O030M638m156j5981j3746
$$ plain form
11616 6476 6669 13966 9633 14157 23872 14528 12723 18506 11083 8181 8869 8190 11415 10078 16243
11601 16243 25495 23672 18356 19418 31481 18813 21014 20951 22141 14716 16916 24308 18000 11145
11587 11145 9695 18404 34637 37277 32465 19607 15367 11336 -8393 -11608 -2530 -1177 16243
11574 16243 19217 31435 25340 23937 26369 22997 27275 22055 16178 5697 7431 20510 30786
11561 30786 28522 34026 35613 29516 18924 24614 25464 21280 6278 -9542 -8597 -11720 -3159 371
11547 371 -2763 4282 8886 8288 14318 19364 23285 23687 14962 10202 12135 15588 15619 19735 28487 31313
11531 31313 34534 30625 26824 30221 25216 13554 8308 6176 13891 22478 27213 24382 24102 17931
11517 17931 14173 11220 10315 -3594 -4966 -1790 1288 227 -1282 4748 9386 5230 -10751 -24497
11503b4497J8137R980M473L917m964m4J812J0945K534j31n406o706p55J085M570
11488A4950L573J2168J5538L828j4800k1652j6071m961N141J3978J4192Q224N769
11475C9877m555K331L904j0680j7228j2424K649Q823J5640j5360j558K4545M775
11462D0739o793j0577N722q03m969l673j1339J9692P629j0444k881l541L684K657
11448B5103q308L825M418k472j1094N954P891O267n065j756n583m530J636j345
11434A4941J2214j3281j6225O336Q197J7915N341o108r832n340J642l484j3304
11421i88K220K1817J410j9205m37R263Q078K22l353n32q656q606q944o88J2386
11406C987N801J0631J950P974K547J084k172j6516p355j0883p399J594m524J2162
$$ plain form
11503 -24497 -6360 3620 8093 12010 7046 7002 8814 19759 22293 22162 16756 10050 9295 10380 14950
11488 14950 18523 30691 46229 50057 35257 13605 -2466 -7427 -2286 11692 25884 34108 39877
11475 39877 35322 37653 41557 30877 13649 1225 3874 12697 28337 12977 11419 35964 40739
11462 40739 33946 23369 29091 28288 23319 19646 8307 27999 35628 25184 22303 18762 22446 25103
11448 25103 16795 20620 25038 22566 11472 17426 25317 31584 26519 24763 19180 14650 16286 14941
11434 14941 27155 13874 -2351 3985 12182 30097 35438 29330 19498 14158 15800 12316 -988
11421 -988 1232 23049 24459 5254 4817 14080 22158 22380 19027 18495 9839 1233 -7711 -8399 3987
11406 3987 9788 20419 22369 30343 32890 33974 31802 15286 7931 -2952 -10351 -8757 -13281 -1119
11392a119N60O404J1246j052j6201K766Q865j0204j209L854Q21J1458R546r030
11378A6705j1809l278n31l078j080K613Q63J7767Q390j1653J0441n423j0928K031
11364A1030J1991l319o366M995J1396O95m34n974R564R342o977j1800O229o733
11350B3639M025M992k410o45O984J172j973n088K202J111m048j4472q109Q920
11336A6300J2097M685j269l937n843j8999k080J7230J675r294O044k814M342P012
11322B5149M127n853j373R584p096K2738p14j3206k992R219q426l123m303P423
11308C1154K371k904q884J505o515j3151N592R807O221P010K893j4633n5N848
11294B6259o29M159J769R496N991j0152j87O882r38r881m476Q575J438J162j4130
$$ plain form
11392 -1119 -559 5845 17091 16039 -162 2604 11469 1265 56 3910 4731 16189 25735 16705
11378 16705 4896 1618 1087 -1991 -3071 -458 405 18172 26562 14909 25350 19927 8999 11030
11364 11030 23021 19702 13336 18331 29727 30422 29988 24014 33578 42920 35943 24143 30372 23639
11350 23639 27664 32656 30246 29601 36585 37757 35784 30696 32898 34009 29961 15489 7380 16300
11336 16300 28397 33082 31813 27876 22033 3034 954 18184 19859 10565 16609 13795 18137 25149
11322 25149 29276 23423 22050 31634 24538 47276 46562 33356 30364 39583 31157 28034 23731 31154
11308 31154 33525 30621 21737 23242 16727 3576 9168 18975 25196 32206 35099 20466 20411 26259
11294 26259 25630 29789 31558 41054 47045 36893 36706 43588 42650 32769 28293 36868 38306 39468 25338
11279B5338j847k255o268k795N532m784P717J0412J0844R287j0576j4792K190
11266B8003J2631l169m212j0622j1627J0027J5655K899q928n461m820J624M843
11253B6843J7748M068p981k622p730n650J032r423j5245j877P585J5365J0448
11240C2561P07j990r273Q252N5K221J817k856j875r993l016K417Q037P350l28
11225C4086M465j8563j0744O609P913L949J0990J0401J887O947n245M267M22j8520
11211C8864j9489m327N500K0283R64m381Q870q628o473P46M4j4002k021J4171
11197C0121P940M003L274J298N12j5769j3640r866J494J5181J4347m018q161r765
11183A6951j143N683P273j983j1762L187J967l667m968P047R805p886M855m182
$$ plain form
11279 25338 23491 21236 14968 12173 17705 12921 20638 31050 41894 51181 40605 25813 28003
11266 28003 40634 37465 33253 22631 11004 21031 36686 39585 30657 25196 20376 22000 26843
11253 26843 44591 48659 40678 38056 30326 24676 25708 16285 1040 -837 6748 22113 32561
11240 32561 33268 31278 22005 30257 30312 32533 34350 31494 29619 19626 16610 19027 27064 34414 34086
11225 34086 38551 19988 9244 15853 23766 27715 38705 49106 50993 57940 52695 56962 57384 38864
11211 38864 19375 15048 20548 40831 41795 37414 46284 37656 31183 31929 31973 17971 15950 30121
11197 30121 38061 42064 45338 46636 47148 31379 17739 7873 9367 24548 38895 34877 26716 16951
11183 16951 15808 21491 28764 26781 15019 18206 20173 16506 11538 18585 28390 20504 25359 21177
11169B1177R565J6674n75j1913j4524m950J2057j659j0432k061Q503O483L539
11156C1884O349M219N856N433J046p428k3897J216K100n936K176L026O655J2699
11142D5398j822j2596j994J4934K357p202n993j1362l071O796L476J600K861n326
11128B8056j895J158R852k123mO385k216N9l027P607l2q176j0999m848l368m086
11112A2343M332R421l383O96L607j785m178N750O979j2799J0763Q058L510m808
11098C8506o910m719l383k143J5549L63k500m432p671o513O473n159k182N979
11084B1258L98j1061O775P536j907l452m024M82P998N43k920r386M84J2937L661
11069B9322m06R050o00q262j266j3591K840M027N435O516J917q328m545M220L683
$$ plain form
11169 21177 30742 47416 46841 34928 20404 15454 27511 25852 15420 13359 21862 28345 31884
11156 31884 38233 42452 48308 53741 54787 47359 23462 24678 26778 20842 23018 26044 32699 45398
11142 45398 43576 30980 28986 43920 46277 39075 33082 21720 18649 25445 28921 30521 33382 28056
11128 28056 26161 27319 37171 35048 35044 41429 39213 39272 36245 43852 43820 35644 24645 19797 16429 12343
11112 12343 16675 26096 22713 23409 27016 25231 21053 26803 33782 20983 31746 39804 43314 38506
11098 38506 31596 26877 23494 21351 36900 37263 34763 30331 22660 16147 22620 17461 15279 21258
11084 21258 21656 10595 17370 24906 22999 19547 15523 16005 24003 24546 21626 12240 12724 25661 29322
11069 29322 28916 37966 37366 29104 27838 14247 17087 21114 26549 33065 34982 26654 22109 26329 30012
11054C0012J1309N918J220r147j3863m225J2011K1192m459r888j7743K990k676
11041B2651J1735N856k594n469L009P15j6549m820R348k670M868J496J1151Q739
11027D7466q912j2586j729l024J4994K2303L152o267j9139q153n892p33J0813
11014C2293M017J1551n204K324J409p19M361L399j5292q590Q956n114L991k703
11000C4679m518j530j099K009K895L034J0616J2027O294Q21q760p171M957k4022
10986C0232j0374Q341J1126L686O195j0720j6417k440P215Q746q308n542N432
10973B7172J075l179J1991J0534q294o497P608J0324j857k434q728n763m772J1697
10959C8877l460n338l335K741J1956N061P395k660k2550m805j0016o494J2409
$$ plain form
11054 30012 41321 47239 48459 39312 25449 21224 33235 54427 49968 40080 22337 25327 22651
11041 22651 34386 40242 37648 32179 35188 35903 19354 14534 23882 21212 26080 27576 38727 47466
11027 47466 38554 25968 24239 21215 36209 58512 61664 55397 36258 28105 22213 21480 32293
11014 32293 36310 47861 42657 44981 46390 45671 50032 53431 38139 29549 38505 33391 37382 34679
11000 34679 30161 28631 27532 29541 32436 35470 46086 58113 64407 65228 56468 49297 54254 30232
10986 30232 19858 28199 39325 43011 49206 38486 22069 19629 26844 35590 27282 21740 27172
10973 27172 28247 25068 37059 47593 39299 32802 40410 50734 48877 46443 37715 31952 27180 38877
10959 38877 35417 30079 26744 29485 41441 46502 53897 51237 28687 23882 13866 7372 19781
10946A9781N477p890P32K001l273m799J0673J506l587q10J366K115J3021J3968
10932E0281j0695J060P950Q681R131q464m72n62r446m625J0144M562j9419j3843
10918B4283N161J5005j1072n412j836R435L624o497L115Q795m785r159K992k140
10904C1509j835L551k661P66l285O390p330R229O477r993O177k756K236q219R488
10889C9744M093o046L037K751l72m555r230j209k133P85j087j0411j1047J3862
10875A8182J5248k944j4262K51J2633K057N292j4528R498P240j2453J813R039
10862C7066j899j0983J0849J0656K830n98j2573l848l426m570M454J0242O17K51
10848C9068L276p91k536l230N779q772L527O325R964n62n34N735P663N71J232
$$ plain form
10946 19781 25258 17368 18100 20101 16828 12029 22702 24208 20621 19811 21177 23292 36313 50281
10932 50281 39586 40646 48596 57277 66408 57944 57472 56910 47464 42839 52983 57545 38126 24283
10918 24283 29444 44449 33377 27965 26129 35564 39188 32691 35806 44601 39816 30657 33649 31509
10904 31509 29674 33225 30564 31330 28045 34435 27105 36334 42811 32818 38995 36239 38475 30256 39744
10889 39744 43837 37791 40828 43579 43207 38652 29422 28213 26080 26865 25778 15367 4320 18182
10875 18182 33430 30486 16224 16475 29108 31165 36457 21929 31427 38667 26214 28027 37066
10862 37066 35167 24184 35033 45689 48519 47921 35348 31500 28074 23504 27958 38200 38817 39068
10848 39068 42344 41553 39017 35787 41566 32794 36321 42646 52610 52048 51514 57249 64912 65483 66715
10833F6715J886q453r475P259Q902K34P21j6672j9128P190N721M776j0760o14
10819C8302O737K070k275L487Q554m66L063j0922j2467J608M589J304m17m632
10805C8535M86P816J1161Q535j4722r281m607Q209R006j2941j6233K681J1863
10792D0508R162J4263q404k100k569q708r063R189J0181O41j3459j0173j711K208
10778B9965N634J0240p117o178P769J138l47r406M088Q303N528j70m019k475q50
10763D2103m813R158r285p16J0673r091L711M11k428j119q44J600r09J187q297
10748C1341p1M88j835K947O766K997Q532M939L492q978o311l138q297n192k573
10733B5107K533Q229M533m491j615l652n476R634Q054K942O485K79l8M849n303
$$ plain form
10833 66715 68601 60148 50673 57932 66834 67068 67789 51117 31989 39179 44900 49676 38916 38302
10819 38302 45039 47109 44834 48321 56875 56409 59472 48550 36083 37691 42280 43584 43167 38535
10805 38535 39021 46837 57998 66533 51811 42530 37923 46132 55138 42197 25964 28645 40508
10792 40508 49670 63933 55529 53429 50860 42152 33089 42278 52459 53100 39641 29468 27757 29965
10778 29965 35599 45839 38722 32544 40313 41451 41104 31698 35786 44089 49617 49447 45428 42953 42103
10763 42103 37290 46448 37163 36447 47120 38029 41740 42151 39723 38604 37760 39360 38451 39638 31341
10748 31341 31270 31758 29923 32870 39636 42633 51165 56104 59596 50618 44307 41169 32872 27680 25107
10733 25107 27640 35869 40402 35911 34296 30644 25168 34802 42856 45798 52283 52562 52524 57373 52070
10718E2070J2039k147k65j5451j2690O310O417m233M317r92n627P856P309M29
10704E5342M706K39l859J560m973q314K749Q962n709p212k60R385L633j4427j280
10689D0542O649L904p28M605L730J2803Q316o575r113m817p096r559J1909l740
10675E0830l607o726j0698m261J305J197k671J0614J7208L538j3435R20n289o717
10661C2208J3441N005O684O089m09l419j1818L249J996O35k004r546N884J3761
10647F1756J328j0410O17J4227L648n820R582L205p958K433R630r520p110j4267
10633E1341o199J860N101r92o047j062J0257M632k876n021j0530Q714j1195k823
10619C5160J1211N985r143j0923J230K727m87m038P060M179L640j667m462P425
$$ plain form
10718 52070 64109 61962 61697 46246 33556 39866 46283 42050 46367 45375 39748 47604 54913 55342
10704 55342 60048 60287 56428 57988 53015 44701 47450 56412 50703 43491 43231 52616 56249 41822 40542
10689 40542 47191 51095 50367 54972 58702 71505 79821 73246 64133 59316 52220 42661 54570 50830
10675 50830 47223 40497 29799 25538 26843 28040 25369 35983 53191 56729 43294 44214 38925 32208
10661 32208 45649 50654 57338 63427 63018 59599 47781 51030 53026 53661 51657 42111 47995 61756
10647 61756 63084 52674 53291 67518 71166 65346 74928 78133 70175 72608 82238 72718 65608 51341
10633 51341 45142 47002 52103 51111 45064 44002 54259 58891 56015 50994 40464 49178 37983 35160
10619 35160 46371 52356 43213 32290 33520 36247 35760 31722 38782 42961 46601 44934 40472 47897
10605D7897P391M764j189K565N614L585J58k529l84l314j1667j2126q001K3302
10591E6066J1567k583q233p590j473O304L797r278j0834O581j7052p06J3761n711
10577C4616O961K355j1181R032O558p553n566m762l564K739J2807J3979J863N653
10563F3937R011q092o095K585n088j6432l95Q022K242M350L145r35j718p172M957
10548E2322M890r247j34Q655j077n460j0846J2188N739m268J470J6368M015n094
10534F9521m883p885r781o678Q52J1834M234n255q637J3869O032k587N764L197
10520F9597K014P993q402k0828j0725P16R2M712Q022J1677k011p862o040o223
10506D2732k366j258m074r06r750R011J9697j0447j1918P160N751n238K782m274
$$ plain form
10605 47897 55288 60052 58863 61428 67042 70627 70785 68256 67872 64558 52891 40765 32764 56066
10591 56066 67633 65050 56817 49227 47754 54058 57855 48577 37743 44324 27272 26566 40327 34616
10577 34616 41577 43932 32751 41783 48341 40788 35222 30460 26896 29635 42442 56421 58284 63937
10563 63937 72948 64856 58761 61346 56258 39826 39431 47453 49695 54045 57190 56255 54537 47365 52322
10548 52322 57212 47965 47831 56486 55409 49949 39103 51291 57030 52762 54232 70600 74615 69521
10534 69521 64638 56753 46972 40294 41146 52980 57214 51959 43322 57191 63223 60636 66400 69597
10520 69597 71611 79604 71202 50374 39649 40365 40457 45169 53191 64868 62857 54995 48955 42732
10506 42732 40366 39108 35034 34128 24378 33389 53086 42639 30721 37881 43632 38394 41176 36902
10492C6902Q529J1449j033n35j848K927j224P09r255R14n273K441m116p069N116
10477C8634K2372N579j9435r113l835J3313J1530k076L20O827r452p747N374p210
10463D5081q12L667R140m981R761J5995O20J649L968K435M226j969k4474p178
10449E7128R69j7696j4473R703K5982K0919j4759j4365J4309J660o489j8274J341
10436D5955Q784K83n247Q288P247n385n209N873K224j3290J360O478M456k165
10422E9652r558M560Q850N829P7j0609l668l836M096J700R445j089R47R281o284
10407F9393j2924J960L025O323J1519O492N65l796r197r91k292j368p71N306Q209
10392H1453l664O280J0756J4457J5446N185R484J518k589k3835j5601l881o472
$$ plain form
10492 36902 45431 56880 55847 55312 53464 56391 55167 55876 46621 47535 42262 44703 40587 33518 38634
10477 38634 61006 66585 47150 38037 34202 47515 59045 56969 57289 64116 54664 46917 52291 45081
10463 45081 44269 47936 57076 52095 61856 77851 78471 80120 84088 86523 90749 88780 64306 57128
10449 57128 58097 40401 25928 35631 61613 82532 67773 53408 67717 69377 62888 44614 45955
10436 45955 54739 55022 49775 58063 65310 59925 54716 60589 62813 49523 50883 57361 61817 59652
10422 59652 50094 54654 63504 69333 69410 58801 55133 51297 55393 57093 66538 65449 66396 75677 69393
10407 69393 56469 58429 61454 67777 79296 85788 86353 82557 73360 72369 70077 68709 67938 73244 81453
10392 81453 77789 84069 94825 109282 124728 129913 139397 140915 138326 114491 98890 95009 88537
10379H8537r077j0887j8243J748K0601J4737q48q23J2531J0250j5573j2008r248
10366G1697O339Q340l041q064o807m769k458Q923r915p265r487l31J942L395K325
10351E0824J432N906k423j657N529J116q668q621K819j1929j595K0506J3480r074
10337E7645J6481M844L802R867J4213j809L243L957N827M657M951Q733K422O560
10323A45393o056j8578j2171o516M251l423k2583o948M487J2403L768n837p567
10310H0623o713J6163J5392j0648p890j1177l604O272M545J1185j372O899j109
10297I8566n23Q634K825l896J691Q425j3533j2626k398PO863Q187J1627O413j605
10282A18657o924k898n833n773L907J7243Q428Q294L984M794j3652n280M051l541
$$ plain form
10379 88537 79460 68573 50330 52078 72679 87416 86568 85745 98276 108526 92953 80945 71697
10366 71697 78036 86376 83335 75271 68464 63695 61237 70160 60245 52980 43493 43162 45104 48499 50824
10351 50824 52256 58162 55739 54082 59611 60727 52059 43438 46257 34328 32733 53239 66719 57645
10337 57645 74126 78970 82772 92639 106852 105043 108286 112243 118070 122727 127678 136411 138833 145393
10323 145393 139337 120759 108588 102072 106323 102900 80317 73369 77856 90259 94027 88190 80623
10310 80623 73910 90073 105465 94817 86927 75750 72146 78418 82963 94148 92776 99675 98566
10297 98566 98043 106677 109502 105606 107297 115722 102189 89563 87165 87172 94035 102222 113849 120262 118657
10282 118657 111733 108835 103002 97229 101136 118379 126807 135101 139085 143879 130227 124947 128998 125457
10268A25457n995j8614J627j4608o113J4331J6817K773Q02m753j1729j1634j383
10255H6978q848o44p616o164r94p554j685Q834M236K156N955p30L051l092o717
10240F7166N119q611N331R756j436K1781J2120J966K3250L1580M4107N5099M6125
10227C13353J0753K6994O9614K1548n1694m7045k3471k1497m2563n0223l2815
10216A72954j2835j1495j7865j2688J314o398m727j858K514j0282p193r286O682
10203H8837R00q821j0578K828J0006R8l75l313N809m864O5K1522L730M038k776
10188A07106o350N090r700j1722Q68k126q84m8q225l712J0695J846r609J231K509
10173G6969n585L453Q358l184L179K206k85j1j1010L0J4183l868K279k673p090
$$ plain form
10268 125457 119462 100848 102475 87867 81754 96085 112902 115675 116477 111724 99995 88361 86978
10255 86978 78130 77486 69870 63706 62712 55158 53473 62307 66543 68699 74654 73924 76975 73883 67166
10240 67166 72285 63674 69005 78761 77325 99106 111226 113192 136442 168022 212129 267228 313353
10227 313353 324106 351100 420714 442262 390568 343523 320052 298555 255992 205769 172954
10216 172954 160119 148624 130759 118071 119385 112987 108260 106402 108916 98634 91441 82155 88837
10203 88837 89737 80916 70338 73166 83172 83270 82895 79582 85391 80527 80592 102114 105844 109882 107106
10188 107106 100756 105846 96146 84424 85292 83166 82282 82234 74009 70297 80992 82838 73229 74460 76969
10173 76969 71384 74837 83195 80011 83190 85396 85111 85100 74090 74120 88303 84435 86714 84041 76951
10158G6951q213J0375J7468R92M076J1323o135j2076l77l303m942p473J897k483
10144G8080j1277J005J4167M223J181o7K008K820J481M042Q749q539j4j243n417
10129I1199l438o254Q736J5053p479j0048k248J5012p37k4661J716J5084O508
10116I8443o01j732j7973o756J0759N792J04O059M015K425N746J121m77j5161
10102I1764K317N496n506j37J5115N060q242l328j812j0440M932j2956Q450J5285
10088A05998n804q313J8492J217q350j594r252o189K722Q92J766j131R142L776
10074A03372p699o548J948N587J2556L397M67k499m332j0447j0122L666J2618
10061A01964J8027K6786J8668j3517j9423j2972l688j1657m452q101q991k04J0479
$$ plain form
10158 76951 68738 79113 96581 97573 101649 112972 106837 94761 94384 91081 86139 78666 80563 78080
10144 78080 66803 67808 81975 86198 87379 87312 89320 92140 93621 97663 106412 97873 97859 96616 91199
10129 91199 87761 81507 90243 105296 97817 87769 85521 100533 99796 75135 76851 91935 98443
10116 98443 97842 96110 78137 71381 82140 87932 88036 94095 98110 100535 106281 107402 106925 91764
10102 91764 94081 99577 94071 93934 109049 114109 105867 102539 100727 90287 95219 82263 90713 105998
10088 105998 100194 91881 110373 111590 103240 101646 92394 86205 88927 89819 91585 90454 99596 103372
10074 103372 95673 89125 91073 96660 109216 112613 113080 110581 106249 95802 85680 89346 101964
10061 101964 119991 146777 165445 151928 132505 119533 115845 104188 99736 91635 82644 82440 92919
10048I2919j191q743p876Q271J0851P677J442k74j5875j253r435J505J4450J4436
10034A06904R540M812N87J304j6225m988q691k0317N328J1432j1105q884N698
10021G5395J2062J4320o300j6957M53J5450J2920N600J61n565P137K424r839o410
10007A00851o300M3J702o73J2874J3207r714P62O598l130j3001j5256j0211J5191
9993I2943J5228R446R036o064q528J1693N464p061J040o413o879n888J1377k841
9979A12553N255n330k044j752j6378J0707N290n997N401J1749k443j90l611p172
9965A06038K722m29J749J5795O340p696k12J2788j3550j3956J837L78l45N55j994
9950A10020K712N153P899O999L29j1301j602o418r360j506R250K3588j157l874
$$ plain form
10048 92919 91728 82985 75109 83380 94231 101908 103350 103076 87201 85948 76513 78018 92468 106904
10034 106904 116444 121256 121843 123147 106922 101934 93243 72926 78254 89686 78581 69697 75395
10021 75395 87457 101777 95477 78520 78973 94423 107343 112943 113104 107539 114676 117100 107261 100851
10007 100851 94551 94594 96296 95623 108497 121704 111990 112752 119350 116220 103219 87963 77752 92943
9993 92943 108171 117617 126653 120589 112061 123754 129218 122157 123197 116784 109905 104017 115394 112553
9979 112553 117808 112478 110434 108682 92304 103011 108301 102304 107705 119454 117011 116821 113210 106038
9965 106038 108760 108331 110080 125875 132215 124519 124307 137095 123545 109589 111426 111804 111459 112014 110020
9950 110020 112732 117885 125784 132783 133112 121811 120209 113791 104431 102925 112175 135763 134606 130732
9936A30732J1994o25k241l841o620p440k136M885R391K619J1489j2553j4035o381
9922A15238J550J877Q792j0942k425j0884j053m829O697Q023O782K969R895k339
9908A29351p014m995M097J800o469M086R486N948J6560l210j8558o7J2732J4361
9894A58108o289k397m023o411l973O862K774p428o936r376j2683j0207N556J4470
9880A18047J5336J3828o671L005j678q555O03J1040O547q678n379j092q501P167
9866A35019P928J2287K679L931j0444J0392K5620K0810J6218p866l5566j2962
9854A68046J1603j7617j6893q142j234m238M351l253q116P905r89j032J252M464
9840A36107L662l865j983K547o528L500J2358n156m854R279P8j0712n80o675Q288
$$ plain form
9936 130732 142726 142101 139860 136019 129399 121959 119823 124708 134099 136718 148207 135654 121619 115238
9922 115238 116788 118665 127457 116515 114090 103206 102153 97324 104021 112044 118826 121795 131690 129351
9908 129351 122337 117342 121439 123239 116770 120856 130342 136290 152850 149640 131082 131015 143747 158108
9894 158108 151819 149422 145399 138988 135015 141877 144651 137223 130287 120911 108228 98021 103577 118047
9880 118047 133383 147211 140540 143545 141867 133312 133915 144955 151502 142824 137445 136353 127852 135019
9866 135019 142947 155234 157913 161844 151400 161792 187412 208222 224440 216574 181008 168046
9854 168046 179649 162032 145139 136997 135763 131525 135876 132623 124507 132412 131423 130391 131643 136107
9840 136107 139769 135904 133921 136468 129940 133440 145798 140642 135788 145067 145145 134433 133853 127178 135466
9825A35466J0129j1587L222J3261Q298K81j30K04m03k92j1608j6843q353j0229
9811A11416N230M428P253O765K8572J5747n850N6L536k765j1891J694M447k935
9797A65703k0598L268O470J0405p019j537j1409j980N042J286K045J1215J1378
9784A74269n30N238r882j2420P202K573J61l859n13P332J0827M981N511j57r964
9769A80769j6038m660k586N48N094N574N413p403K517L976P851p323M01O523p163
9754A73493p216l241j1541k966K1906M850L69j754m802N033p34j138n015J1462
9740A78706k552q160k946l254N893J505N508J527r245p71J3252j130j562J584
9726A78355P327r486k081P498K4790k660M82l123m122N241K418n810m208q597
$$ plain form
9825 135466 145595 134008 137230 150491 158789 159070 158940 159144 158741 158449 146841 129998 121645 111416
9811 111416 116646 121074 128327 135092 163664 179411 173561 173617 177153 174388 162497 164191 168638 165703
9797 165703 145105 148373 154843 165248 158229 156692 145283 143303 148345 149631 151676 162891 174269
9784 174269 173739 178977 169095 156675 163877 166450 166611 162752 162239 169571 180398 185379 190890 190733 180769
9769 180769 164731 160071 157485 158033 163127 168701 174114 166711 169228 173204 181055 173732 174133 180656 173493
9754 173493 166277 163036 151495 148529 170435 175285 175654 173900 169098 174131 173397 172259 167244 178706
9740 178706 176154 167994 165048 161794 167687 169192 174700 176227 166982 166211 179463 178333 176771 178355
9726 178355 185682 176196 174115 181613 206403 203743 204225 201102 196980 202221 204639 198829 194621 186024
9712A86024l96m22n868j2025J067L681J1934j903Q17n384L070J4507J892j3235
9698A83759j5533p344M362J0437K025N179P387j2184J436J4067j717M646P865
9685B04385O792M797M390Q020n370N512K2052p2P421k629j1285p642M171j3323
9671B27219J449N014J3463L061m319r381O783k267l479n758k0030j4049J27r889
9657A87944o730J0213j03k87P090o74L497R748Q627M493j664K423m462O716P334
9642B34165j277j253j128l294M038J3011j00R737J3426O385k560l867J1788J2264
9628B91335M913j1762q575J172j660J9967J3709j3465j326m161N346J7360K23
9615C13076j2064j2226n448o363n585R316m185j2237l383l255K847m444j4383
$$ plain form
9712 186024 185628 185206 179338 167313 168380 172061 183995 182092 182909 177525 180595 195102 196994 183759
9698 183759 168226 160882 165244 175681 177706 182885 190272 178088 179524 193591 191874 196520 204385
9685 204385 211177 215974 220364 228384 223014 228526 250578 250506 257927 255298 244013 236371 240542 227219
9671 227219 228668 233682 247145 250206 245887 236506 243289 241022 237543 231785 211755 197706 197833 187944
9657 187944 181214 191427 191324 191037 198127 197453 200950 210698 219325 223818 222154 224577 220115 226831 234165
9642 234165 232888 231635 230507 227213 231251 244262 244162 253899 267325 273710 271150 267283 279071 291335
9628 291335 296248 284486 275911 277083 275423 295390 309099 295634 294308 290147 295493 312853 313076
9615 313076 301012 288786 283338 276975 271390 280706 276521 264284 260901 257646 260493 256049 241666
9602B41666o415P446O201L661K265q55k321N95L888O555J4459Q802K337j0191
9588B78093p033m43L30J3932J3836J8012K529j9345j3924K1357K8260K2123J1956
9575C69683R63Q956M693P804J7959j3462j1254J5385J0471l378Q241Q653K0466
9562D45180M1425P0343R2594P1440L0752M427n9367p5401o1527n5951l1342j6555
9550D56018j4156k768R442j0281k6945p119j068N08K394O99J2545K6251N4239
9537D99759Q2000R6324O4931J3489l3139p0103p2528m4345k5408l6055j3562M20
9525D61783j1167N007L01J584j7788j8421J165K4784L3712J1259J8111J6948R516
9512E36794J0821N781J4328J8979J4248J8579J8917n895k4680k6128q051n971
$$ plain form
9602 241666 235251 242697 248898 252559 254824 253969 251648 252243 256131 262686 277145 285947 288284 278093
9588 278093 271060 270617 270947 284879 298715 316727 319256 299911 285987 307344 335604 357727 369683
9575 369683 370646 379602 384295 392099 410058 396596 385342 400727 411198 407820 416061 424714 445180
9562 445180 486605 556948 649542 720982 751734 756161 696794 621393 559866 503915 472573 456018
9550 456018 441862 439094 448536 438255 411310 404191 403123 403631 406025 406724 419269 445520 499759
9537 499759 581759 678083 743014 756503 723364 653261 580733 536388 510980 474925 461363 461783
9525 461783 450616 455623 455924 457508 439720 421299 422464 447248 480960 492219 510330 527278 536794
9512 536794 547615 553396 567724 586703 600951 619530 638447 632552 607872 581744 573693 567722
9500E67722Q080J2858K7070R985J1873J2243P809L381J2072J6945L2708N1164
9488G73910J3901k5659m860O121J8656K7535K7619K0058j089l1085l8711j4797
9476G71599j8322k982J8503K5871K2667q941k7229m5794m0255r928k1420j0869
9464F52900J1954J9117M0576N9803M8904M1462K8089K4440K5455L0627K6398J4181
9452A023906M4605O7675O9232O2831N4262M0297K8531L2933M0525L5901K5724
9441A526422L7420P3117Q0700N7690J7334k1923k2559j8285k5677n5020n5463
9430A593756k4042m1447m4938l8187l6542k8347j483J0223j2430k8012m0005l6380
9418A272166j8011N304K827k2335r744J5026K0887K0184K2815L8719M4064N1767
$$ plain form
9500 567722 575802 588660 615730 625715 637588 649831 657640 661021 673093 690038 722746 773910
9488 773910 787811 762152 757292 763413 782069 809604 837223 857281 856192 825107 786396 771599
9476 771599 753277 750295 768798 794669 817336 808395 781166 735372 695117 685189 663769 652900
9464 652900 664854 683971 724547 784350 833254 874716 902805 927245 952700 983327 1009725 1023906
9452 1023906 1068511 1136186 1205418 1268249 1322511 1362808 1391339 1424272 1464797 1500698 1526422
9441 1526422 1563842 1636959 1717659 1775349 1792683 1770760 1748201 1729916 1704239 1649219 1593756
9430 1593756 1569714 1528267 1483329 1445142 1408600 1380253 1378770 1388993 1376563 1348551 1308546 1272166
9418 1272166 1254155 1259459 1262286 1239951 1230207 1245233 1266120 1286304 1309119 1347838 1391902 1443669
9406A443669K7671J7141J9900L825k0599j1098L1649N3123O7335O2024J00187
9395A794827J53195J71908J61978J38926J13243J02631N6766o2028j03755n4110
9385B473581J2689L0159p868o5621r4395j00534j15087j06267q8673m3832m394
9374A889758O077k1355r0725j11769r0381p3334n2992m0540j5934R974J0779Q43
9362A420401j6605r759j3279P003J5738K2225K3580L0499o347k4902K383K0443
9350A471380J8338M7327Q1082J00819J39213J59999J17771O5349L9611M2304O0863
9339B344056P1331N6610L0817L1565J5002p090l3325j8833L5649J17335J34781
9328B777898J02915N3444K459p2423q2310p1603p790P9921R6289j3794j48354
$$ plain form
9406 1443669 1471340 1488481 1508381 1512206 1491607 1480509 1512158 1565281 1632616 1694640 1794827
9395 1794827 1948022 2119930 2281908 2420834 2534077 2636708 2693474 2631446 2527691 2473581
9385 2473581 2486270 2516429 2508561 2442940 2348545 2248011 2132924 2026657 1937984 1894152 1889758
9374 1889758 1895835 1874480 1783755 1671986 1581605 1508271 1455279 1414739 1398805 1408779 1419558 1420401
9362 1420401 1403796 1394037 1380758 1387761 1403499 1425724 1449304 1479803 1473456 1448554 1450937 1471380
9350 1471380 1489718 1537045 1618127 1718946 1858159 2018158 2135929 2201278 2240889 2283193 2344056
9339 2344056 2415387 2471997 2502814 2534379 2549381 2542291 2508966 2490133 2525782 2643117 2777898
9328 2777898 2880813 2934257 2936716 2864293 2781983 2710380 2702590 2782511 2878800 2865006 2716652
9317B716652k02703j20687l5570k0437o5647j33473j61526j54618j25673j00643
9307A595675o5204l5914j7633l493L3867O2838R3573J00198R1034J07331J46289
9296B108561J97096K49879K88783K86224K32580K28736K53355K73049L40227L97061
9286D855551M60317N54015N90055N99527O29948M53021j6839l32140k73677j56772
9276G363006k31772l29007k52684l4583K76954N90026P13156M16390j72699o46723
9266G692064p71785o30567m58691l93350l43847k76659j69281p4061J8272N3756
9256D645851m8961j37151j06758m1383N3250J46027J94105K05372K15303K53137
9246E378792L45307M80137O03140O79503Q10638J046581J461798J994675K405018
$$ plain form
9317 2716652 2513949 2393262 2357692 2337255 2271608 2138135 1976609 1821991 1696318 1595675
9307 1595675 1530471 1494557 1476924 1473431 1507298 1570136 1663709 1763907 1854941 1962272 2108561
9296 2108561 2305657 2555536 2844319 3130543 3363123 3591859 3845214 4118263 4458490 4855551
9286 4855551 5315868 5869883 6459938 7059465 7689413 8142434 8125595 7793455 7519778 7363006
9276 7363006 7131234 6802227 6549543 6514960 6791914 7381940 8095096 8511486 8338787 7692064
9266 7692064 6920279 6289712 5831021 5437671 5093824 4817165 4647884 4573823 4592095 4645851
9256 4645851 4596890 4459739 4352981 4311598 4364848 4510875 4704980 4910352 5125655 5378792
9246 5378792 5724099 6204236 6807376 7486879 8297517 9344098 10805896 12800571 15205589
9237A5205589K070218Q64037M3707N7520j19689p88229j177546j077170p68527
9228A4309910k51988M14243R83164J128096P14058j29315r57447j199300q60935
9219A4150486l69119r0894n1201j25696k18161l88334n35109l72595n2235O5432
9209A2012574j98591n72036o36529m88700m12661l64094k29870j16812l8197J00680
9199I055764L22890N90205Q18732R93488J071542J098680J193687J174272R63577
9190A7282837P27161N15078O10361R87079Q86214J51495j38107L82832J084090
9181B2489040J526127J736554J687067J433403J087499N65432p04990k434837
9173B7385295l162481k671909j646560n49081L94743J127288J572772J367225
$$ plain form
9237 15205589 17275807 18139844 18183551 18241071 18121382 17333153 16155607 15078437 14309910
9228 14309910 14057922 14472165 15455329 16583425 17297483 17168168 16210721 15011421 14150486
9219 14150486 13781367 13690473 13639272 13513576 13295415 12907081 12371972 11999377 11947142 12012574
9209 12012574 11813983 11241947 10605418 10116718 9704057 9339963 9110093 8993281 8955084 9055764
9199 9055764 9378654 9968859 10787591 11781079 12852621 13951301 15144988 16319260 17282837
9190 17282837 18009998 18525076 19135437 20122516 21008730 21160225 21022118 21404950 22489040
9181 22489040 24015167 25751721 27438788 28872191 29959690 30525122 29820132 27385295
9173 27385295 24222814 21550905 19904345 19355264 19750007 20877295 22450067 23817292
9165B3817292K51j312775j286411o57747j92831K38180P44530J043819Q45578
9156B3239886j22031j316554j929630k028115k157888k094461j553976r07139
9148A1130092l59397Q3539N11837R65409J345195J403313J264152J434902J819611
9139A9598653J778223J244801R95582J198530J400169J472522J079141j35145
9131B8632476j633478k409003j954441o82955Q61383K560424M367815N788399
9123C5530620O655088O113896J864109l064959l379473p28057J221672J191916
9115D5404812J24534j498122l832576n568311n260320l469158j452912J53356
9107B4601303J033042J000290L48173r2224j33994p2884p02965k222745k779959
$$ plain form
9165 23817292 23817543 22504768 21218357 20560610 20367779 20605959 21350489 22394308 23239886
9156 23239886 23117855 21801301 19871671 17843556 15685668 13591207 12037231 11130092
9148 11130092 10770695 10854234 11366071 12331480 13676675 15079988 16344140 17779042 19598653
9139 19598653 21376876 22621677 23617259 24815789 26215958 27688480 28767621 28632476
9131 28632476 26998998 24589995 22635554 21952599 22813982 25374406 29742221 35530620
9123 35530620 42185708 48299604 50163713 47098754 43719281 42991224 44212896 45404812
9115 45404812 45529346 44031224 40198648 34630337 29370017 25900859 24447947 24601303
9107 24601303 25634345 26634635 26982808 26890584 26756590 26683706 25980741 23757996 20978037
9098B0978037j939277n75227Q16556J693581J413185L45968n14356q16581l75898
9089B1025988L76929L01021m96889n49558N52910K178177L432795L133609J827855
9080C1782837J496866J842094J482117Q25720J124647K533782L248182K030717
9072D6366962R64549K108707M675666N638802K826189o64785p69541J199675J586081
9063F3932305r10892l675317n249309n804301m788781k870894n95294J609178
9055D1646695M99501n407505o126879l931071j970462p6261J640869K211781P19635
9046B9206303j018634j122434n61348m65620o07591m83327j8213n86727k509485
9037B1832924l055030j846787l10051J174045K770288M363930M717455K527050
$$ plain form
9098 20978037 19038760 18463533 19280089 20973670 22386855 22732823 22218467 21401886 21025988
9089 21025988 21402917 21703938 21207049 20657491 21210401 23388578 26821373 29954982 31782837
9080 31782837 33279703 35121797 36603914 37429634 38554281 41088063 44336245 46366962
9072 46366962 47331511 49440218 54115884 59754686 62580875 61916090 61146549 62346224 63932305
9063 63932305 63021413 59346096 54096787 48292486 43503705 40632811 40037517 41646695
9055 41646695 42146196 36738691 30611812 26680741 24710279 24634018 26274887 28486668 29206303
9046 29206303 28187669 27065235 26503887 26038267 25430676 24947349 24929136 24342409 21832924
9037 21832924 18777894 16931107 16621056 17795101 20565389 24929319 29646774 32173824
9029C2173824j145177l479834k905691q33391J339610L560356O172870R355965
9021D4238532J2228694J1972882O780136r82426p182660q547065o850894n873062
9013D5784137o229861o131109m985018l611667k310181j210425j60100J100463
9005B2246239K701829M590164O070593N880775L208550q79765l088754l784978
8997C6944653n592902o165801m833139l284083k159638j442478r92598o54516
8989A1819498l64942j29662K7986N4357K3444Q2841J77051L05487N37500Q78541
8979A3412101J307495J617989J624239J590885K015014L125364M569189M953551
8971C4215827K134636k518587m408501l234340j211866P14576K376396L169938
$$ plain form
9029 32173824 31028647 27548813 24643122 23809731 25149341 28709697 34882567 44238532
9021 44238532 56467226 68440108 75220244 74237818 67055158 58508093 51657199 45784137
9013 45784137 39554276 33423167 28438149 24826482 22516301 21305876 21145776 22246239
9005 22246239 24948068 29538232 35608825 41489600 44698150 43818385 40729631 36944653
8997 36944653 31351751 25185950 20352811 17068728 14909090 13466612 12474014 11819498
8989 11819498 11454556 11324894 11352880 11407237 11430681 11513522 11690573 11996060 12533560 13412101
8979 13412101 14719596 16337585 17961824 19552709 21567723 24693087 29262276 34215827
8971 34215827 36350463 33831876 29423375 26189035 24977169 25691745 28068141 31238079
8963C1238079J600526k092730m558784m440533l310522k244359j566377j267501
8955A3357799j191184j078227q47976o37701n68546n84653n75452m74433l67775
8946G031852l16150k61271j81725o1802L0655M9654P736j16866k78367l51651
8936E552065k95553j70845j9303J45874J93179N7916q4497j54743j38130o1636
8926E024327N9032J56250J81955J38742J10067J57434K83422M03235M59825L56554
8916G330843J98061J63884K78692L62240L44149K03595p269j93442k23427r4945
8906H362381O853L9038N9032J40622L58487O98256J130429J612326K131417K791100
8896A7329941L743762M739129N190278N345695N179660K555845j193525k041722
$$ plain form
8963 31238079 32838605 30745875 26187091 21746558 18436036 16191677 14625300 13357799
8955 13357799 12166615 11088388 10240412 9602711 9034165 8449512 7874060 7399627 7031852
8946 7031852 6715702 6454431 6272706 6210904 6241559 6291213 6298949 6182083 5903716 5552065
8936 5552065 5256512 5085667 5066364 5212238 5405417 5463333 5378836 5224093 5085963 5024327
8926 5024327 5083359 5239609 5421564 5560306 5670373 5827807 6111229 6514464 6974289 7330843
8916 7330843 7528904 7692788 7971480 8333720 8677869 8881464 8874195 8680753 8457326 8362381
8906 8362381 8369234 8408272 8467304 8607926 8966413 9664669 10795098 12407424 14538841 17329941
8896 17329941 21073703 25812832 31003110 36348805 41528465 44084310 42890785 40849063
8888D0849063J8612J868264K96361m214551o880925o350196m728766l204316k051130
8879A5602416j310469r07042p01020n46285m21585k33222K7566K42537K68483
8870A2021379J29024K1472Q0820L04578N85625Q13849R37236J036995J138747
8861A7069725J233380J424137J777107K305918K317026J282793M09374O87281
8853B8506741J788158L355719M908505N873857O138140N652976L267025j141088
8845E8350033m698866n831888m762274k700495o83747Q86088J284217J00948j426504
8836D0517512j748678p45185J000761K209902J380403j313019l787206m391635
8828C3122855l827596k959059j783399o48067k6713K8624k69207m68054k00786
$$ plain form
8888 40849063 40867675 42735939 43032300 38817749 31936824 25586628 20857862 17653546 15602416
8879 15602416 14291947 13384905 12683885 12137600 11716015 11482793 11510359 11752896 12021379
8870 12021379 12150403 12171875 12252695 12557273 13142898 13956747 14893983 15930978 17069725
8861 17069725 18303105 19727242 21504349 23810267 26127293 27410086 27819460 28506741
8853 28506741 30294899 33650618 38559123 44432980 50571120 56224096 59491121 58350033
8845 58350033 53651167 47819279 43057005 40356510 39672763 40558851 41843068 41944016 40517512
8836 40517512 38768834 38023649 39024410 41234312 42614715 41301696 37514490 33122855
8828 33122855 29295259 26336200 24552801 23904734 23878021 23906645 23637438 23169384 22968598
8819B2968598K78161M14517M7809j96264J48092Q25500J394184J938088K779119
8810C0597804M147944N896381P476168Q460735R303591J0264525J0577775Q026196
8802I4751119K166063k499310k820209k907780o261192q547139p180672m662979
8794F2037901k774259k380171l766106n276663n093274l655061k082615q68254
8786C6141498l55235q24724k173605l412681l365091k328432j257982n03562P9132
8777B1999318O95511J227291J271820J093020J203836J642355K025591K031101
8769C3189843J773633J601515K277212L711878N479399O964303P886157Q652595
8761G1536535R548504J0534489J0311287P399260K804397o74848j262613j29503
$$ plain form
8819 22968598 23246759 23661276 23709085 23512821 23660913 24486413 25880597 27818685 30597804
8810 30597804 34745748 40642129 48118297 56579032 65882623 76147148 86724923 94751119
8802 94751119 96917182 94417872 91597663 88689883 82428691 73881552 66700880 62037901
8794 62037901 59263642 56883471 53117365 47840702 42747428 39092367 37009752 36141498
8786 36141498 35786263 34961539 32787934 29375253 26010162 23681730 22423748 21920186 21999318
8777 21999318 22694829 23922120 25193940 26286960 27490796 29133151 31158742 33189843
8769 33189843 34963476 36564991 38842203 42554081 48033480 54997783 62883940 71536535
8761 71536535 81085039 91619528 101930815 109330075 112134472 111459624 110197011 110067508
8753A10067508Q54073n91228m690687p679738r202121j0664814j1139959r874194
8745E7078840p633185n693563m463127l503486k837296k683789k710113k515388
8737B5038893j974882j314484o84852r7741M86974R73427J285915J421910J509991
8728B6645151J358964Q37900P16854J234906J774432J736992J350372J508746
8720C7164317K629340M095473N154808N672389O271938O729061O547949N958664
8712H0223939M755897K827312K494834M056539M652283K950119j46517l409809
8704I8404597p333036j1681695j3315555j1690034q642775n858688l898959k809589
8696C3174266k400349k360181k288796k113893k037960j866524j577619j339523
$$ plain form
8753 110067508 110921581 110330353 105639666 97959928 88757807 78092993 66953034 57078840
8745 57078840 49445655 43752092 39288965 35785479 32948183 30264394 27554281 25038893
8737 25038893 23064011 21749527 21064675 20966934 21453908 22427335 23713250 25135160 26645151
8728 26645151 28004115 28842015 29558869 30793775 32568207 34305199 35655571 37164317
8720 37164317 39793657 43889130 49043938 54716327 60988265 67717326 74265275 80223939
8712 80223939 84979836 87807148 90301982 94358521 99010804 101960923 101814406 98404597
8704 98404597 91071561 79389866 66074311 54384277 45741502 39882814 35983855 33174266
8696 33174266 30773917 28413736 26124940 24011047 21973087 20106563 18528944 17189421
8688A7189421j104643q35819n20503j44336K29431N23950O74522P64574R39882
8679A7716479Q90651O00722M44401N72434Q20265J096990J322339J595930J949161
8670B7009372K381796L166571M272367N008091N051365M801179L689425J928825
8662E7308991K89613j333905l718276o667387p943507p030098n398506l803318
8654B1703607k479786j573360j109167j118408j246428j218556j060603r11659
8646A0985640q92378q79887p78793o38118m98681m08132m07892m47444m10868
8637E623447l04884j58177o130J20494K52215L16562L25588K94112K78680L19427
8627G061334L62765L73700L64373M57255P60481J319642K014038K627677K679512
$$ plain form
8688 17189421 16084778 15248959 14728456 14584120 14813551 15337501 16012023 16776597 17716479
8679 17716479 18607130 19207852 19652253 20224687 21044952 22141942 23464281 25060211 27009372
8670 27009372 29391168 32557739 36830106 41838197 46889562 51690741 55380166 57308991
8662 57308991 57598604 56264699 52546423 45879036 37935529 30905431 25506925 21703607
8654 21703607 19223821 17650461 16541294 15422886 14176458 12957902 11897299 10985640
8646 10985640 10093262 9213375 8434582 7796464 7297783 6889651 6481759 6034315 5623447
8637 5623447 5318563 5160386 5154256 5274750 5526965 5843527 6169115 6463227 6741907 7061334
8627 7061334 7424099 7797799 8162172 8619427 9379908 10699550 12713588 15341265 18020777
8618A8020777J439671r54529k911606l329072k675437j877036j260105q40608
8610E612055n37219l34530k05667j46246j80909k49688k70388k31628j78334k31130
8600C046316l10251k86548k30201j80199j14910q7256p4420n4400m0452m2787
8590A624892l2781k6110J2370M2406N6570N6561R0658J14144J21068J13578Q5324
8579B258680M4170j466o379J4992L9862P0401J69008L12017N00013O73364P19805
8568D794467O08271M17858L56379M91393N79478M38284J80118r7483k77279k86484
8558G205002j45789n4571j77589m57267o10732n79322m86251l56673k43919j85089
8548C907800j70407j86643j79844j56313j00971m6565M1317J16530J34128N7332
$$ plain form
8618 18020777 19460448 18505919 15594313 12265241 9589804 7712768 6452663 5612055
8610 5612055 5074836 4740306 4534639 4388393 4207484 3957796 3687408 3455780 3277446 3046316
8600 3046316 2736065 2449517 2219316 2039117 1924207 1836951 1762531 1708131 1667679 1624892
8590 1624892 1592111 1566001 1578371 1620777 1677347 1733908 1824566 1938710 2059778 2173356 2258680
8579 2258680 2302850 2301384 2295005 2309997 2349859 2420260 2589268 2901285 3401298 4074662 4794467
8568 4794467 5402738 5820596 6176975 6668368 7247846 7686130 7866248 7768765 7491486 7205002
8558 7205002 7059213 7004642 6827053 6369786 5759054 5179732 4693481 4336808 4092889 3907800
8548 3907800 3737393 3550750 3370906 3214593 3113622 3067057 3108374 3224904 3359032 3416364
8538C416364j333j1360M4657J48076K25858J85109J23153P9115P5192P6033J47656
8527D508520K17449K51845K39759K32855K30646K44147K87049L33787L83155M15655
8517G344867L85606K46777J07094N9090N6667R2597J37547J10483q0048l26578
8507H134102m39199m29191l77176l15807k71477k92111l71458l96717l75740l37495
8497D527731k79438k24706j83570j92821k20910k44778k53035k21080j82772j33154
8487B391467r8965q4494m8671n106L8835R2498J32291J27283Q4389M5672M3344
8476B718543R9806J55349K15947L18106M20540M93422M73755L48462J53691J9013
8466E416634M1257J74381L46173M75825L90499k0452n21402p52893o12617l52377
$$ plain form
8538 3416364 3415031 3403671 3448328 3596404 3822262 4007371 4130524 4209639 4284831 4360864 4508520
8527 4508520 4725969 4977814 5217573 5450428 5681074 5925221 6212270 6546057 6929212 7344867
8517 7344867 7730473 7977250 8084344 8143434 8200101 8292698 8430245 8540728 8460680 8134102
8507 8134102 7694903 7265712 6888536 6572729 6301252 6009141 5637683 5240966 4865226 4527731
8497 4527731 4248293 4023587 3840017 3647196 3426286 3181508 2928473 2707393 2524621 2391467
8487 2391467 2292502 2208008 2159337 2154231 2193066 2285564 2417855 2545138 2629527 2675199 2718543
8476 2718543 2818349 2973698 3189645 3507751 3928291 4421713 4895468 5243930 5397621 5416634
8466 5416634 5457891 5632272 5978445 6454270 6844769 6824317 6302915 5550022 4937405 4585028
8456D585028j46866p5855j76319l78032m29766l32436k27121j49654j14467r3864
8446B460648p8225p4629n1024l2420j9436m013P454K8364M0654O5181Q0011J01684
8434B524249J62312J63433J55625J63547J70074J66722K01137K55491L32468L81544
8424D676602L58704K67512J38565P1686J16644K16920L34348M53389N74012P32454
8414G940836R59081J243566J591675K205192L150067M484328O533058R834639
8406C7942442J4796592K0517536K3216372J8981902R413744j269046j2026264
8399A11573278k0594206k2277014j7740595j1952969p653289n035071l570183
8392B2749951k697338k105173j716891j444667j206939j013688q36826o76160
$$ plain form
8456 4585028 4438162 4362307 4185988 3807956 3378190 3045754 2818633 2668979 2554512 2460648
8446 2460648 2382423 2307794 2256770 2224350 2204914 2200901 2208355 2236719 2277373 2342554 2422565 2524249
8434 2524249 2686561 2849994 3005619 3169166 3339240 3505962 3707099 3962590 4295058 4676602
8424 4676602 5035306 5302818 5441383 5513069 5629713 5846633 6180981 6634370 7208382 7940836
8414 7940836 8899917 10143483 11735158 13940350 17090417 21574745 28107803 37942442
8406 37942442 52739034 73256570 96472942 115454844 124868588 123599542 111573278
8399 111573278 90979072 68702058 50961463 39008494 31355205 26320134 22749951
8392 22749951 20052613 17947440 16230549 14785882 13578943 12565255 11728429 11052269
8384A1052269m73111k34169j0721J22609J76552L20781O51676J028215J379402
8375A4013503J893590K920611M603913O140731N576871K679155m22943j902919
8367C5502512j897689j665979p87369J051970L003891M112451L408497J437997
8359D4166281J98218N7004Q16024K278311M224113O807302R936746J1567326R251024
8350H9302349M389885P64799k241274o545083r326238q064290l908020M41299
8342F4813427J844520q67812m789635o267979o038639n842942n673647m768786
8334C2408507l720725l149629k558632k387892k623083k480065j932397j398922
8326A2157162j079075r10427q06762o88701n89574m95490l83623k72038j72103
$$ plain form
8384 11052269 10579158 10344989 10334268 10456877 10633429 10954210 11605886 12634101 14013503
8375 14013503 15907093 18827704 23431617 29572348 35149219 37828374 37405431 35502512
8367 35502512 33604823 31938844 31151475 32203445 35207336 39319787 42728284 44166281
8359 44166281 44364499 44421503 45237527 47515838 51739951 58547253 68483999 80051325 89302349
8350 89302349 93692234 94457033 92215759 85670676 76344438 68280148 64372128 64813427
8342 64813427 66657947 65790135 61000500 54732521 48693882 42850940 37177293 32408507
8334 32408507 28687782 25538153 22979521 20591629 17968546 15488481 13556084 12157162
8326 12157162 11078087 10167660 9360898 8672197 8082623 7587133 7203510 6931472 6759369
8317F759369o0980Q105J18075K67413M40192O02699Q24168J140633J625380K411355
8307A4136409L628944N533649Q398178J1994428J4777674J4211985R826577M469760
8299H6977604N4082n689153j2501445j5799024j3911732r947448o565870m340286
8291A8276728k955945k073016j523771j214780j043649r12646q16510p57984p29691
8282F248736p04289o54790n61036m48792l58804k96866k41684j98295j73782j55996
8272B454402j48626j25024p3712n3797m4838m8540o6785q9242q5756n8274k8169
8261A631639K38J2721L2321L3441L1889J8587l033M899M0277J03238J72192L07838
8249B386247M80801P19684J023181J233436J130568O66759P0602l60371l84401
$$ plain form
8317 6759369 6698389 6706494 6824569 7091982 7532174 8134873 8959041 10099674 11725054 14136409
8307 14136409 17765353 23299002 31697180 43691608 58469282 72681267 82507844 86977604
8299 86977604 87031686 81342533 68841088 53042064 39130332 29182884 22617014 18276728
8291 18276728 15320783 13247767 11723996 10509216 9465567 8552921 7736411 6978427 6248736
8282 6248736 5544447 4889657 4328621 3879829 3521025 3224159 2982475 2784180 2610398 2454402
8272 2454402 2305776 2180752 2107040 2053243 2008405 1959865 1893080 1803838 1718082 1659808 1631639
8261 1631639 1631877 1644598 1676919 1710360 1742249 1760836 1757803 1762702 1802979 1906217 2078409 2386247
8249 2386247 2867048 3586732 4609913 5843349 6973917 7640676 7711278 7350907 6966506
8240F966506K7807N26971P40439M46699j69152q29160j220076j240610r94016
8231D255408o89606m63035l15935k23861j40901r8686m6087j869r388m5039q8826
8220B132175j08670n2873p332L6338Q1137J13477J80755K61862L05195L28003
8210C270067K50783L0710q4238L5271K61186M47327N40649M70531J50623j72087
8200E200822k54736r3636J43589L74430N44543O42593O27430M94247K96994Q0043
8190H056319q9185j36292J2501K21679L52083L52702K52401M1805k48078n57946
8180H257989p77339p43976m98555k41205m1086P5230l9179l77600n97718n24174
8170D492387l87342k86316j75591j18485j20952j26097p6668L7767J45428J96017
$$ plain form
8240 6966506 6994313 7521284 8261723 8708422 8539270 7710110 6490034 5249424 4255408
8231 4255408 3565802 3102767 2786832 2562971 2422070 2323384 2277297 2275428 2266040 2221001 2132175
8220 2132175 2023505 1970632 1963300 1999638 2080775 2194252 2375007 2636869 2942064 3270067
8210 3270067 3520850 3551560 3467322 3502593 3763779 4211106 4751755 5222286 5372909 5200822
8200 5200822 4946086 4852450 4996039 5370469 5915012 6557605 7185035 7679282 7976276 8056319
8190 8056319 7967134 7830842 7843343 8065022 8417105 8769807 9022208 9064013 8815935 8257989
8180 8257989 7480650 6736674 6238119 5996914 5955828 6031058 5991879 5614279 5016561 4492387
8170 4492387 4105045 3818729 3643138 3524653 3403701 3277604 3200936 3238703 3384131 3580148
8160C580148J02535o3542p6558O601R1309J61750K12108K45701K70841L02923
8150D833816L16184L42364M01954N33711P59851J126443J555138J942056K194033
8141A4005550K400720K912502M140534O427047R481939J2019678J2458461J1434220
8133G5280651R818720M467436m986414j2054098j4308700j3210935j0274073p278451
8125B7454136n044446l539836k508512j770783j225718q65298o95645o76181o79831
8116A0447886n77623m26744l02829k47045k32604j46401k757J54051L43022N58189
8106I567145P08752P38101P77280Q04276Q65150R50787J006983J072864J230691
8097A7722029J568922K178283L142798M530179O684073J0314662J6271758K4492262
$$ plain form
8160 3580148 3682683 3619141 3542583 3549184 3640493 3802243 4014351 4260052 4530893 4833816
8150 4833816 5150000 5492364 5894318 6428029 7187880 8314323 9869461 11811517 14005550
8141 14005550 16406270 19318772 23459306 29886353 39368292 51387970 63846431 75280651
8133 75280651 85099371 89566807 84580393 72526295 58217595 45006660 34732587 27454136
8125 27454136 22409690 18869854 16361342 14590559 13364841 12499543 11803898 11127717 10447886
8116 10447886 9870263 9443519 9140690 8893645 8661041 8514640 8511883 8665934 9008956 9567145
8106 9567145 10275897 11013998 11791278 12595554 13460704 14411491 15418474 16491338 17722029
8097 17722029 19290951 21469234 24612032 29142211 35826284 46140946 62412704 86904966
8089H6904966L1571672L2345509K3641996M837526j0797954j5343802j2123478
8082A41036435j994198J1193711K0680943K4184726K4045144J6081613l007375
8075B32220999k0030685k8912710l4895102l4458036k7049204j8790258j2877951
8068E5207053r094307o583855m843606l594373k688127k034719j533931j175276
8060B3658859q68519n81906k68119R3225M10331N23554L91986K00448K59390N80982
8050B4400231J079849J730334K548088L726157N432199P593815R712162J1231774
8042F7454609J1896398J0953028P280523L975222O477117J3354504K3432623M1307653
8034A86131677O4170926P7204279P3104575L7344079j8177069n8735487p8485833
$$ plain form
8089 86904966 118476638 150822147 174464143 179301669 168503715 153159913 141036435
8082 141036435 139042237 150235948 170916891 195101617 219146761 235228374 232220999
8075 232220999 212190314 183277604 148382502 113924466 86875262 68085004 55207053
8068 55207053 46112746 39528891 34685285 31090912 28402785 26368066 24834135 23658859
8060 23658859 22790340 22208434 21940315 22033540 22443871 22967425 23359411 23559859 23819249 24400231
8050 24400231 25480080 27210414 29758502 33484659 38916858 46510673 56222835 67454609
8042 67454609 79351007 90304035 97584558 101559780 108036897 121391401 144824024 186131677
8034 186131677 250302603 327506882 400611457 437955536 419778467 361042980 282557147
8027B82557147p3881178n4977230l7188241k5036354j7345570j2352419r001224
8020E2774931o674181n056333m014238l407104k995015k591469k322266k223277
8012B3491048k041989j704034j369883j090875r00866p88392o42401m87592l77485
8003A4087531k17605k2658K28541N88227R99197J310177J518643J754422K317833
7994B2564308L433850N342569Q309700J2609262J8089740K2365299K2214070K0118198
7986A35046996J7962604O811512j1380027j8044694j5681418j8722261k2548831
7979G3443881j9434946j3481382q764769n802737m025199k919158k243234j849877
7971A4922579j616359j455795j327610j153236j005067q82402p62000o61096n66227
$$ plain form
8027 282557147 208675969 153698739 116510498 91474144 74128574 61776155 52774931
8020 52774931 46100750 41044417 37030179 33623075 30628060 28036591 25714325 23491048
8012 23491048 21449059 19745025 18375142 17284267 16383401 15595009 14952608 14465016 14087531
8003 14087531 13869926 13847268 14075809 14664036 15663233 16973410 18492053 20246475 22564308
7994 22564308 25998158 31340727 39650427 52259689 70349429 92714728 114928798 135046996
7986 135046996 153009600 159821112 148441085 130396391 114714973 95992712 73443881
7979 73443881 54008935 40527553 31762784 25960047 21934848 19015690 16772456 14922579
7971 14922579 13306220 11850425 10522815 9369579 8364512 7482110 6720110 6059014 5492787
7962E492787m53561l73361l05256k79729k56621k06264j57343j05741n1940K0950
7952C323921J29259K40738K58102J33416p1830k64646l75018l85230l15213k52046
7942B421453j98517j60538j43480j21530j06053q9188p2856p3738q2383p0973
7932A302197o1053o6212n4719m6121l5754m3505m4542n4628l9098j5747J0800
7921H51618N0602N8838N4584N0175J9545j1165J2467J6728J0902P876Q200K1836
7909A152206N5398P6758Q1781O2150M3551K1653K0344N4031J05924J85252K16323
7898B075371J52014O2841l1807j18480j86811k07219j78943r7167n4903n5564
7888A359332r6442j24903j19021j00363r4583p3391o3621o5620n9554l2254k4424
$$ plain form
7962 5492787 5039226 4665865 4360609 4080880 3824259 3617995 3460652 3354911 3302971 3323921
7952 3323921 3453180 3693918 3952020 4085436 4013606 3748960 3373942 2988712 2673499 2421453
7942 2421453 2222936 2062398 1918918 1797388 1691335 1602147 1529291 1455553 1373170 1302197
7932 1302197 1241144 1174932 1120213 1074092 1038338 994833 950291 895663 856565 840818 851618
7921 851618 902220 961058 1015642 1065817 1085362 1074197 1086664 1103392 1114294 1122170 1130370 1152206
7909 1152206 1207604 1284362 1366143 1428293 1471844 1493497 1513841 1567872 1673796 1859048 2075371
7898 2075371 2227385 2290226 2258419 2139939 1953128 1745909 1566966 1469799 1414896 1359332
7888 1359332 1262890 1137987 1018966 918603 824020 750629 687008 621388 561834 529580 505156
7877E05156l1052m1151m8166m4025j6836m406J21O195m367J376k315J0135R306
7864C39971N946J8661K0082K787J1634P568j134M809K6769L5539L0696P1128J37191
7851G11647J94480K63602K89012K32790P5006j35053k87403l05837k43125j75183
7841F19936j10126p7832m9709l4377k1918l0003k1183m705j0034k3397k5433k3823
7829A87396k3153j8092n917l262Q681J4852K38M861n252o41K464k847j3026j117
7815A45185j0447j6415m728N927k68J959k933K648J851P755J5879J5458P227J907
7801A71005J7776J6181J930m042k0563p969O86J1532Q893J178k4079l1633k3240
7788A17655k3490k5730n018p274p345p984J2067J4663R558O213K306j15J8975
$$ plain form
7877 505156 474104 432953 384787 340762 323926 319520 319641 325836 321469 322845 320530 330665 339971
7864 339971 345917 364578 384660 387447 399081 406649 405515 410324 437093 472632 503328 574456 711647
7851 711647 906127 1169729 1458741 1691531 1766537 1631484 1344081 1038244 795119 619936
7841 619936 509810 431978 382269 347892 325974 295971 274788 270083 260049 236652 211219 187396
7829 187396 164243 146151 140234 136972 145653 160505 160743 165604 160352 159711 162175 159328 146302 145185
7815 145185 134738 118323 113595 119522 119254 121213 118280 120928 122779 130534 146413 161871 169098 171005
7801 171005 188781 204962 206892 202850 182287 174318 175004 186536 195429 196607 172528 140895 117655
7788 117655 94165 68435 63417 56143 48798 40814 52881 67544 77102 83315 85621 85506 104481
7775A04481O663n148K589N95N75j2049N751J9439K4542M016n722m34Q382R025
7761A62705k763J995r540j4437j3393k1937j8809l321J2530N898m668M162J4877
7748A13299J8667J0644J0107m776m588J2845L3121L9231K5197N6730P0501O8246
7736D49224O1923K9292m135m9710p6397p5757o4828n6872l3756m4977l2555L941
7724A05393L951R241q191q910J162R413K57j4133n62L271M363l469j6718j4339
7710G0729q003Q58l79P36L667K21O292L481K570J2743M362J8786K9365M0597M1210
7695B27235M2357N3623R1486J57085K04427K07660J29864j3926j26271j35241
7685H38299n8321J5675R9415J62832J86898J02848m6192j75028k37213k24885
$$ plain form
7775 104481 111144 105996 108585 109180 109755 97706 103457 122896 147438 151454 145732 145298 153680 162705
7761 162705 159942 161937 152397 137960 124567 102630 83821 80500 93030 98928 94260 98422 113299
7748 113299 131966 142610 152717 147941 143353 156198 189319 228550 253747 310477 380978 449224
7736 449224 511147 540439 536304 486594 410197 334440 269612 212740 178984 134007 101452 105393
7724 105393 109344 118585 110394 101484 102646 112059 112316 98183 97621 100892 105255 101786 85068 70729
7710 70729 62726 63584 63205 63941 67608 67829 74121 77602 80172 92915 97277 116063 145428 186025 227235
7695 227235 269592 323215 414701 571786 776213 983873 1113737 1099811 973540 838299
7685 838299 779978 795653 895068 1057900 1244798 1347646 1301454 1126426 889213 664328
7675F64328j80999j19141n2148m8785n2876n6145m4743k4486j2351J0940K1888
7664A05482K0705j0454j6320o688R890J5660r683q806o235k4831k2959J058N782
7651E2601K2772L4673L3336M2845M4192O0745P8907Q3213P4196M2840K2871M1278
7639F34469Q4800J87818L31121M48654M97111L61142r4435m83251n43247m12389
7629A011793k78019j86770j24047p9761n9692o3350l1992l2017j8949j4452J274
7618A24018k568j4663j3593j1460j3800j5967p135j3172j603J6329m369j3790
7606B8227j3068O774L115L235P34J3809J8096K3736K4850P881L004K4020M3372
7593A87785R4962J37686J70354J81122J40387L3846p9836j52379j79874j60883
$$ plain form
7675 664328 483329 364188 312040 263255 210379 154234 109491 85005 72654 83594 105482
7664 105482 126187 115733 99413 92725 102615 118275 108592 99786 93551 68720 45761 46819 52601
7651 52601 75373 110046 143382 186227 230419 291164 370071 453284 527480 570320 593191 634469
7639 634469 719269 907087 1238208 1686862 2183973 2545115 2450680 1967429 1424182 1011793
7629 1011793 733774 547004 422957 343196 283504 220154 188162 156145 137196 122744 124018
7618 124018 121450 106787 93194 81734 67934 51967 44832 31660 30057 46386 42017 28227
7606 28227 15159 21933 25048 28283 29017 42826 60922 84658 109508 117389 120393 144413 187785
7593 187785 282747 420433 590787 771909 912296 946142 866306 713927 534053 373170
7583C73170j16600p9337m5024k8965j4767j8789k6065j8980o196n820j7673k0094
7571b5140k983N902Q345r736M354J215J09Nj0288L060p411k3374L589P120O116
7556c9117N331p87r750j6372L57J3742J1449J5038L812r211M093K83j0196q650
7542c9978n908L282Q97l825j7o786n725j036p208l806P976Q097O894M202M85J967
7526d0489k700q637n020j3122q993N442P005K301J4463Q635q032j4574n667r46
7512g0334L031J9960J233j2524q841n123n678n141P794J1519K5339J827j0727
7499d7665o756q64j7890L216R107l950r369N081k690q831p630J6298J4455J6706
7485d0782k538r994j1090J0291o415l345O597L859p373k535J757J536l799j469
$$ plain form
7583 373170 256570 177233 132209 103244 88477 69688 43623 24643 18447 12627 -5046 -25140
7571 -25140 -28123 -22221 -13876 -23612 -19258 -18043 -17934 -17929 -28217 -25157 -32568 -55942 -52353 -45233 -39117
7556 -39117 -33786 -34573 -44323 -60695 -60338 -46596 -35147 -20109 -16297 -25508 -21415 -21132 -31328 -39978
7542 -39978 -45886 -42604 -41707 -45532 -45549 -52335 -58060 -59096 -66304 -70110 -62134 -54037 -47143 -42941 -42456 -40489
7526 -40489 -43189 -51826 -56846 -69968 -78961 -73519 -66514 -64213 -49750 -41115 -49147 -63721 -69388 -70334
7512 -70334 -67303 -47343 -46110 -58634 -67475 -72598 -78276 -83417 -75623 -64104 -38765 -36938 -47665
7499 -47665 -54421 -55285 -73175 -69959 -60852 -64802 -74171 -69090 -71780 -80611 -88241 -71943 -57488 -40782
7485 -40782 -43320 -53314 -64404 -54113 -60528 -63873 -57276 -53417 -60790 -63325 -61568 -60032 -63831 -65300
7471f5300O721k758N890J2462L798n575j0414n838l581k721j024O677K921q06
7457e9548n973R121J3082l702l151j1847j2948l079O553O624N726M364O814j3976
7443f1940r535l706J1777Q995j1078j1667k608n293n056J1963J0491R395q628
7430f6890L271L180j3213L385J4330O419N173r374j4476j0037p5M097J8357L588
7416e2265M509j664j129J0479j693j0211K425L426P143n283o15J468o785N679
7402d4516J0965Q178r363L206P397K671j0762j8811m477j2749j1139j585M610
7389g6375O45l95r519p593r556J6866J9559K502M893J6805J5939o46k1973r445
7375e8293J1369L338j014n081m511J7106O582j1913j4121L23L35q611M486l585
$$ plain form
7471 -65300 -58579 -61337 -55447 -42985 -39187 -44762 -55176 -61014 -64595 -67316 -68340 -61663 -58742 -59548
7457 -59548 -65521 -56400 -43318 -47020 -50171 -62018 -74966 -78045 -71492 -64868 -59142 -54778 -47964 -61940
7443 -61940 -71475 -75181 -63404 -54409 -65487 -77154 -79762 -85055 -90111 -78148 -67657 -58262 -66890
7430 -66890 -63619 -60439 -73652 -70267 -55937 -49518 -44345 -53719 -68195 -78232 -78307 -74210 -55853 -52265
7416 -52265 -47756 -49420 -50549 -40070 -41763 -51974 -49549 -46123 -38980 -44263 -44878 -43410 -50195 -44516
7402 -44516 -33551 -25373 -34736 -31530 -24133 -21462 -32224 -51035 -55512 -68261 -79400 -80985 -76375
7389 -76375 -75730 -76125 -85644 -93237 -102793 -85927 -66368 -63866 -58973 -42168 -26229 -26875 -48848 -58293
7375 -58293 -46924 -43586 -44600 -49681 -54192 -37086 -30504 -42417 -56538 -56215 -55880 -64491 -60005 -63590
7361f3590J990P43J6736K6900P482j579p622j0467j6553N980P077L220j4151p077
7347e0911j8396j5635o551P574M661J1602J1929O530n690q318p466O761J2421
7334e1489M020q2M120j3973j5511K848K588J882L479j017J0220m463l708n848
7320f6934r364R927J9587O492N674J8702K148n741K597Q89n004n140P785J5091
7306c291q469m147m495j4739R698k920j9964j567j5115j8805J542P454o197l202
7292h4217K885Q635M099O081L519q400k0385P019K14J1144P993l605qJ5501O584
7277d2941j2544l047M124J6034J4630J03j7472j537r457j2154k170P557n683k791
7263f7348J5065K2579R996p82q271p404q311q146n500K139k1L90j2114j3457J2423
$$ plain form
7361 -63590 -61600 -60857 -44121 -17221 -9739 -11318 -18940 -29407 -45960 -39980 -32903 -29683 -43834 -50911
7347 -50911 -69307 -84942 -91493 -83919 -79258 -67656 -55727 -49197 -54887 -63205 -70671 -63910 -51489
7334 -51489 -47469 -47551 -43431 -57404 -72915 -70067 -67479 -65597 -62118 -63135 -52915 -57378 -61086 -66934
7320 -66934 -76298 -66371 -46784 -40292 -34618 -15916 -13768 -19509 -16912 -16023 -21027 -26167 -18382 -3291
7306 -3291 -11760 -15907 -20402 -35141 -25443 -28363 -48327 -49894 -65009 -83814 -82272 -74818 -81015 -84217
7292 -84217 -81332 -72697 -68598 -62517 -58998 -67398 -87783 -80764 -80550 -69406 -61413 -65018 -65026 -49525 -42941
7277 -42941 -55485 -58532 -54408 -38374 -23744 -23641 -41113 -42650 -52107 -64261 -66431 -58874 -64557 -67348
7263 -67348 -52283 -29704 -19708 -20490 -28761 -36165 -44476 -52622 -58122 -55983 -56004 -55614 -67728 -81185 -68762
7248f8762O573m098r814k050P883K3377R037L902J3449j2873k1144q072k281J1249
7234e3624M957q64p804p372l665J4777J183M152n538j0064Q044J5270Q461n858
7220c7945r684j885J3P665P631k02l330j101l344R72n533N32p377j1313j5964
7205h0865p2J4544L978J2135J0664L663J515r075l558M65n439M654o566m916L091
7190e5782Q185R427j4697r630m12j463m003L775l728K77p082Q734O992M377l400
7175e8430r52Q160m697l998k19Q918J6723j0624j6817K561r59L491R161N855L999
7160c7828j092o469m18q472O366K958Q058J1299P777j5712j6431j5023L027M955
7146e7005L786p711m575P043P895j6322p165j781L563r552k094Q517Q811m098
$$ plain form
7248 -68762 -62189 -66287 -76101 -78151 -70268 -46891 -37854 -33952 -20503 -33376 -54520 -62592 -64873 -53624
7234 -53624 -48667 -49531 -57335 -64707 -68372 -53595 -52412 -48260 -53798 -63862 -55818 -40548 -32087 -37945
7220 -37945 -47629 -49514 -49501 -41836 -34205 -34407 -37737 -38838 -42182 -41210 -46743 -46211 -53588 -64901 -80865
7205 -80865 -80937 -66393 -62415 -50280 -39616 -35953 -34438 -43513 -47071 -46606 -52045 -47391 -53957 -58873 -55782
7190 -55782 -47597 -38170 -52867 -62497 -62909 -64372 -68375 -64600 -68328 -68051 -75133 -66399 -59407 -55030 -58430
7175 -58430 -59382 -51222 -55919 -59917 -60136 -51218 -34495 -45119 -61936 -59375 -60334 -56843 -47682 -41827 -37828
7160 -37828 -38920 -45389 -45807 -54279 -47913 -44955 -36897 -25598 -17821 -33533 -49964 -64987 -61960 -57005
7146 -57005 -53219 -60930 -65505 -58462 -50567 -66889 -74054 -75835 -72272 -81824 -83918 -75401 -66590 -70688
7132g0688N113J0586k830L291O783M06Q713q37r414o132L861k298k542K133J406
7117e2449N282J0908K292j2706j2986k200Q677o768R530M944k049n839m784O427
7103e1721K2342J5918j89j6801l501N422L032n087j9774o728Q084J6391J2928
7090a9684J220m742o854m449o304r853o818J4090K8466N142j3800r746j7158L89
7076e0101J870l377J474M433L57M562K561l340K272R005L313N206J1962m887o292
7061b0982K808r9j0546j7113l341j468J639O262O441J2367J9629J8410K0027J7937
7047E1971j2113j4559j2867j4737j5001m178n487j950j1130j0069o110K868N203
7034d8159L268j0742k784o316o796K462N153J8574Q828L76N791q654O347M69R04
$$ plain form
7132 -70688 -65575 -54989 -57819 -54528 -47745 -47339 -38626 -39463 -48877 -55009 -51148 -53446 -55988 -53855 -52449
7117 -52449 -47167 -36259 -33967 -46673 -59659 -61859 -53182 -59950 -50420 -45476 -47525 -53364 -58148 -51721
7103 -51721 -29379 -13461 -13650 -30451 -33952 -28530 -25498 -30585 -50359 -57087 -49003 -32612 -19684
7090 -19684 -18464 -23206 -30060 -34509 -40813 -50666 -57484 -43394 -14928 -9786 -23586 -33332 -50490 -50101
7076 -50101 -48231 -51608 -50134 -45701 -45344 -40782 -38221 -41561 -39289 -30284 -26971 -21765 -9803 -14690 -20982
7061 -20982 -18174 -18273 -28819 -45932 -49273 -50741 -49102 -42840 -36399 -24032 -4403 14007 34034 51971
7047 51971 39858 25299 12432 -2305 -17306 -21484 -26971 -28921 -40051 -50120 -56230 -53362 -48159
7034 -48159 -44891 -55633 -58417 -64733 -71529 -69067 -63914 -45340 -36512 -36136 -30345 -38999 -32652 -32183 -31279
7019c1279o568j4191j283N77J1697K117N350Q81L903K130J620m53j6189p043J8851
7004b9880R353n187j955o121j0271k991O532l293Q527J3201o613l691n14O150
6990b6753j713j2619j0174N815M216K96L598K1107J0379k6178j8264J0344J1410
6977b8536P998n388J0667K136N661j541p80j8403k8366j0184J6472P953k841j2048
6963e7200l900P317N23N481L297r055J303J316l834n6j1883n604N989J2026L445
6948e0835k807M284P547M259R588j0029j0272J694O061L549j118O467m691j3569
6934d9872m193N266O812M940J5759J4407M028N496j6276j5477N392j084o055k344
6920c3201p809l310r922K3745J4062n84k0829l538k214l759q050N655J583K580
$$ plain form
7019 -31279 -37847 -52038 -53321 -52744 -41047 -38930 -33580 -32699 -28796 -26666 -25046 -25499 -41688 -48731 -29880
7004 -29880 -20527 -25714 -27669 -33790 -44061 -47052 -40520 -43813 -35286 -22085 -28698 -32389 -32903 -26753
6990 -26753 -28466 -41085 -51259 -45444 -41228 -40932 -37334 -16227 -5848 -32026 -50290 -39946 -28536
6977 -28536 -20538 -25926 -15259 -13123 -7462 -9003 -9783 -28186 -56552 -66736 -50264 -42311 -45152 -57200
6963 -57200 -61100 -53783 -53260 -47779 -44482 -53537 -52234 -50918 -54752 -54808 -66691 -72295 -66306 -54280 -50835
6948 -50835 -53642 -49358 -41811 -37552 -27964 -37993 -48265 -46571 -40510 -36961 -38079 -31612 -36303 -49872
6934 -49872 -54065 -48799 -41987 -37047 -21288 -6881 -2853 2643 -13633 -29110 -23718 -24802 -30857 -33201
6920 -33201 -41010 -44320 -54242 -30497 -16435 -17019 -37848 -41386 -43600 -47359 -55409 -49754 -48171 -45591
6906d5591K707J8591m734j0776p937M050J3842l995p82J01o316O805l275j4953
6892e2263p009m186m46m742Q55J1561O939O782J1772K1040r860r732k4J0098R795
6877i420J0631j5469j5923K217j362j201m974M68K105l903j29J3531m130q750
6863c6309Q004P12R66j0350j2027J3068P192N241Q296P713q864j6116J162O838
6849b4474j045k229l132K292K946O690j0750o371p906m198o77K7963R285k990
6835a4596j6585p607Q281Q143k071m915K233j122M609j921k230P332o216j8427
6821d5092Q694l578P646m519o119q806K305J2664M518L4p868J221Q565K58J964
6806b8113k939o673O242kL009K615K510O844O58j2373j648k259j380J758J314
$$ plain form
6906 -45591 -42884 -24293 -29027 -39803 -47740 -43690 -29848 -33843 -34625 -34524 -40840 -34035 -37310 -52263
6892 -52263 -59272 -63458 -63904 -68646 -67791 -56230 -49291 -42509 -30737 -9697 -19557 -29289 -29313 -19215 -9420
6877 -9420 1211 -14258 -30181 -27964 -29326 -30527 -35501 -35033 -32928 -36831 -36960 -23429 -27559 -36309
6863 -36309 -28305 -27593 -26627 -36977 -49004 -35936 -28744 -23503 -15207 -7494 -16358 -32474 -31312 -24474
6849 -24474 -25519 -27748 -30880 -28588 -25642 -18952 -29702 -36073 -43979 -48177 -48854 -20891 -11606 -14596
6835 -14596 -31181 -38788 -30507 -22364 -24435 -29350 -27117 -28239 -23630 -25551 -27781 -20449 -26665 -45092
6821 -45092 -36398 -39976 -32330 -36849 -42968 -51774 -49469 -36805 -32287 -32253 -40121 -38900 -30335 -30077 -28113
6806 -28113 -31052 -37725 -31483 -31485 -28476 -25861 -23351 -16507 -15849 -28222 -29870 -32129 -33509 -31751 -30437
6791c0437p69K817j461k709Q591J412n629o205K483j598m788J350J0158J9075
6777g710N254j0803P997n47j9380j5142O908J8795N055M802k485j288j791l577
6763a3912r03K118P849o276j1992J900J382k203J377K831K463J5878J0711%n161
6748F062M697J2053K0518J7361M0816M1439N777m0724n5651l0620j4065j3465
6736e802k961q668P600M381K926M116l259J678q951k4577j0772P054P983K617
6722b6635R372O999l289r016j0752k170J582N851M95P503m842p533j3394M149
6708d1680Q617L542l920p46Q564J8869K879k486r911j1838o829M208m191j896
6694c6818k046K422R258K157j596N666J78l730J276O990K525o83j2748o420J812
$$ plain form
6791 -30437 -31206 -28389 -29850 -32559 -23968 -22556 -28185 -34390 -31907 -33505 -38293 -36943 -26785 -7710
6777 -7710 -2456 -13259 -5262 -5809 -25189 -40331 -33423 -14628 -9573 -4771 -7256 -8544 -10335 -13912
6763 -13912 -14815 -12697 -4848 -11124 -23116 -21216 -19834 -22037 -20660 -17829 -15366 512 11223 11223 6062
6748 6062 10759 22812 43330 60691 101507 142946 148723 107999 52348 21728 7663 -5802
6736 -5802 -8763 -17431 -9831 -5450 -2524 1592 -1667 11 -8940 -33517 -44289 -37235 -29252 -26635
6722 -26635 -17263 -10264 -13553 -22569 -33321 -35491 -33909 -28058 -27563 -20060 -24902 -32435 -45829 -41680
6708 -41680 -33063 -29521 -33441 -34187 -25623 -6754 -3875 -6361 -16272 -28110 -34939 -30731 -34922 -36818
6694 -36818 -38864 -36442 -27184 -25027 -26623 -20957 -20779 -24509 -23233 -16243 -13718 -14401 -27149 -33569 -31757
6679c1757p285J795k129L47m179j092K2568K3244J925q014n030l762k774K828
6665a3315N98l677O465o452j1137J268o906J578j84j1097M658K593L598J524N729
6650b4757N779O121O900L160L742m09K73m720k482N823k781r428j3506m925Q223
6635b2987n435j0840q033L780L879Q390m945n013r660R634R214N880L952p40P269
6620a5655L867K926N478j6152L084K205o789o552j2224j4r44O48r91J1533P476
6605b2104j224K558R856K738j006p823j0320N361m438K055P884K785M55R46j4010
6590b6287j3311m238J6282R406J177M833M179R533J2557q913j3787j2006j286
6577b1861k411O246k280Q88N20o926O955K664j0205r694M95l794p732Q405J0341
$$ plain form
6679 -31757 -39042 -37247 -39376 -39029 -43208 -44300 -21732 1512 3437 -4577 -9607 -13369 -16143 -13315
6665 -13315 -12717 -16394 -9929 -16381 -27518 -26250 -33156 -31578 -31762 -42859 -38201 -35608 -32010 -30486 -24757
6650 -24757 -18978 -12857 -5957 -2797 945 536 809 -3911 -6393 -570 -3351 -12779 -26285 -31210 -22987
6635 -22987 -28422 -39262 -47295 -43515 -39636 -31246 -36191 -41204 -50864 -41230 -32016 -26136 -22184 -22924 -15655
6620 -15655 -11788 -8862 -3384 -19536 -16452 -14247 -21036 -27588 -39812 -39826 -40770 -40122 -41113 -29580 -22104
6605 -22104 -23328 -20770 -10914 -8176 -9182 -17005 -27325 -21964 -26402 -24347 -16463 -13678 -13223 -12277 -26287
6590 -26287 -39598 -43836 -27554 -18148 -16971 -12138 -7959 1574 14131 5218 -8569 -20575 -21861
6577 -21861 -24272 -18026 -20306 -19418 -18898 -25824 -18869 -16205 -26410 -36104 -35609 -39403 -47135 -38730 -28389
6562b8389p77J506j344r245K850J0867r027o481r738J2605M695L924Q040o938
6548b7452l12q382L496J778o469R656J5370J507L091Q97l930j5831k3511m927
6534e5019J0783P930Q814o771L396K809K803M070L676J6192M836m958N958n237
6520g18j0001o364n974O79N960m48l135j7368j0649L260P606L462M607M956J1273
6505a2854Q170l602j1529j6396p149J6348q2j4941n152P409J1916P392N047j9175
6491c4598N718O875J3987p522m234l218m431M325j389l773l740l913k549r231
6477d7693J7218J6120l713L895J331j089O090l709j948j184n079J7546K302j2751
6463a2664j3573Q847Q631j682m391q148K799J2640O54q136l468O974j4630j2492
$$ plain form
6562 -28389 -29166 -27660 -29004 -38249 -35399 -24532 -33559 -40040 -49778 -37173 -32478 -28554 -20514 -27452
6548 -27452 -27764 -36146 -32650 -30872 -37341 -27685 -12315 -10808 -7717 -6820 -10750 -26581 -50092 -55019
6534 -55019 -44236 -36306 -27492 -34263 -30867 -28058 -25255 -21185 -17509 -1317 3519 -1439 4519 -718
6520 -718 -10719 -17083 -23057 -22378 -16418 -16866 -20001 -37369 -48018 -44758 -37152 -33690 -29083 -24127 -12854
6505 -12854 -4684 -8286 -19815 -36211 -43360 -27012 -27094 -42035 -47187 -39778 -27862 -20470 -15423 -34598
6491 -34598 -28880 -22005 -8018 -15540 -19774 -22992 -27423 -23098 -24487 -28260 -32000 -35913 -38462 -47693
6477 -47693 -30475 -14355 -18068 -14173 -12842 -13931 -7841 -11550 -13498 -14682 -19761 -2215 87 -12664
6463 -12664 -26237 -17390 -8759 -10441 -14832 -22980 -20181 -7541 -6887 -15023 -18491 -11517 -26147 -38639
6449c8639M245r07k616o73J4666M216l7Q273M378j1011l949K172K341p295j198
6434b6034O804O86J702N863j3107j3665j913J9447P709j431p047j2208m400J1585
6420b6009J555P783o498j292L981P862m449n298o446j783K838K271j451Q168m798
6405b3566N951K246L957N310j327q17J36J980j1059j6823P728J5413J1545k687
6391b013j3615k307q608k308J237L7p357K831j439M096k723J0257R263P175j056
6376f530q074q755M668o993j154M473l92N269N006o082J0589K374j708M051l749
6361g007n400J445K307n14J5311q423j2216J428J581p703k329J843Q904R141m414
6346f046p483J3765l188j9454q349K431N55J1911K354P407n804r019O20m722n496
$$ plain form
6449 -38639 -34394 -35301 -37917 -38590 -23924 -19708 -19745 -11472 -7094 -18105 -22054 -19882 -17541 -24836 -26034
6434 -26034 -19230 -18544 -16842 -10979 -24086 -37751 -39664 -20217 -12508 -13939 -20986 -33194 -37594 -26009
6420 -26009 -24454 -16671 -23169 -24461 -20480 -12618 -17067 -22365 -28811 -30594 -27756 -25485 -26936 -18768 -23566
6405 -23566 -17615 -15369 -11412 -6102 -7429 -8246 -8110 -6130 -17189 -34012 -26284 -10871 674 -2013
6391 -2013 -15628 -17935 -26543 -28851 -27614 -27577 -34934 -32103 -33542 -29446 -32169 -21912 -12649 -5474 -6530
6376 -6530 -14604 -23359 -18691 -25684 -26838 -22365 -22757 -17488 -12482 -18564 -7975 -5601 -7309 -3258 -7007
6361 -7007 -12407 -10962 -8655 -9169 6142 -2281 -14497 -13069 -11488 -19191 -21520 -19677 -10773 -1632 -6046
6346 -6046 -13529 236 -2952 -22406 -30755 -28324 -27769 -15858 -13504 -6097 -11901 -20920 -20300 -25022 -30518
6331c0518Q759O822j8534p697L105J4122N687J174j827P45r934m451J8111J7182
6317B746j0844j0126p049J1726p786O547Q287m348j796k106p858M665Q825J0942
6303A825q123o732L437k50J752m109j523q138m569k261N475N55M371J417Q393
6288h480Q301K091q134J307j6753j3959N641R394L200M318K646J753N117k208
6274e766l152J99O089p292m497J306k035q48J0220n511m411n532l316k149k785
6259b9480L249P925o429r075j370o035o859O821M720R152O169l830O697l099N820
6244a5624M329M77M784L01j3178l730P922J0583M774P02k9014q166M337K182Q964
6229b0357J639J876J2850J1013j6080j4693J7905J8739J558j208J3587O076q6
$$ plain form
6331 -30518 -21759 -14937 -33471 -41168 -38063 -23941 -18254 -17080 -18907 -18162 -28096 -32547 -14436 2746
6317 2746 -8098 -18224 -25273 -13547 -21333 -14786 -6499 -10847 -12643 -14749 -22607 -17942 -9117 1825
6303 1825 -6298 -13030 -9593 -9843 -8091 -12200 -13723 -21861 -26430 -28691 -23216 -22661 -18290 -16873 -8480
6288 -8480 -179 1912 -6222 -4915 -21668 -35627 -29986 -20592 -17392 -13074 -10428 -8675 -3558 -5766
6274 -5766 -8918 -8719 -2630 -9922 -14419 -13113 -15148 -15996 -5776 -11287 -15698 -21230 -24546 -26695 -29480
6259 -29480 -26231 -18306 -24735 -33810 -35180 -41215 -48074 -41253 -36533 -27381 -21212 -25042 -18345 -21444 -15624
6244 -15624 -11295 -10818 -6034 -5733 -18911 -22641 -14719 -4136 638 1340 -27674 -35840 -31503 -29321 -20357
6229 -20357 -18718 -16842 -3992 7021 -9059 -23752 -5847 12892 14450 13242 26829 32905 32819
6216C2819K656P018J9600J9522J5049L3566M6520L2887K4444L5605J5986j3277
6204B72395m4779m2256l9955l2601j2823j4947j1078o142j5263j849m670k14l525
6191D2293j0721j4901j3561L299m262m371o979n416l126p299N718J4798j0817
6178a5345p514R471J3584N01O479j473n567K910j531J424P676r31j1894j5780
6164a7990l276J1269N285m937o991l364p052M720L911p099k74J3899J3390j817
6150c26P825L146q711q597n033J044M530o414m457O870M308m970q089R990R095
6135B11m171J097l877q855J922J2501Q927K372J3194k939k4888o414m597m286
6121a9803P594R420o54R089J926r813j7595p157l25N84R750J0118n020j3760j7329
$$ plain form
6216 32819 35475 42493 62093 81615 96664 130230 176750 209637 234081 269686 285672 272395
6204 272395 227616 185360 145405 112804 99981 85034 73956 67814 52551 50702 46032 45818 42293
6191 42293 31572 16671 3110 6409 2147 -2224 -9203 -14619 -17745 -25044 -19326 -4528 -15345
6178 -15345 -22859 -13388 196 697 7176 5703 136 3046 1515 2939 10615 9684 -2210 -17990
6164 -17990 -21266 -9997 -4712 -9649 -16640 -20004 -27056 -22336 -18425 -25524 -25798 -11899 1491 -326
6150 -326 7499 10645 1934 -6663 -11696 -10652 -6122 -12536 -16993 -10123 -5815 -10785 -18874 -8884 211
6135 211 -3960 -2863 -6740 -15595 -13673 -1172 7755 10127 23321 20382 -4506 -10920 -15517 -19803
6121 -19803 -12209 -2789 -3443 5646 7572 -2241 -19836 -26993 -27318 -26734 -16984 -6866 -11886 -25646 -42975
6106d2975L034K3275lo268o316n216Q549R406j2574m327q94p928l013L680J4029
6091b7541J0283Q659m810Q25l14P711K59q637j7010M705O396P627j009L544l042
6076a2354j2006j35k931q454k223O196N014j58j2973j126J1061O802J778L516
6062a7993P721J509k343n322L687J172o314j1382K402q048j178q84l211M733J2226
6047b3225j964N654J2829J0864Q307m539j2485M552p46K224n834j3357O08L587
6033a3525m526j908N524n216L387M946K523n715n14l123p826N579R297j900O377
6018f620j993K102M109R923k294r358l244j2339j0182m302O01P694M491J0783
6004a0629N42q551k32Q43J4094R203K430j5909p259R99q06n981j69J3685K442
$$ plain form
6106 -42975 -39941 -16666 -16669 -22937 -29253 -34469 -25920 -16514 -29088 -33415 -34309 -42237 -45250 -41570 -27541
6091 -27541 -17258 -8599 -13409 -12584 -12898 -5187 -4928 -13565 -30575 -25870 -19474 -11847 -12856 -9312 -12354
6076 -12354 -24360 -24495 -27426 -35880 -38103 -31907 -26893 -27051 -40024 -41150 -30089 -23287 -21509 -17993
6062 -17993 -10272 -8763 -11106 -16428 -12741 -11569 -17883 -29265 -26863 -34911 -36089 -36973 -40184 -35451 -23225
6047 -23225 -25189 -19535 -6706 4158 12465 7926 -4559 -7 -753 1471 -4363 -17720 -17112 -13525
6033 -13525 -18051 -19959 -14435 -19651 -16264 -11318 -8795 -14510 -15024 -18147 -25973 -20394 -11097 -12997 -6620
6018 -6620 -8613 -6511 -2402 7521 5227 -4131 -7375 -19714 -29896 -34198 -33597 -25903 -21412 -10629
6004 -10629 -10087 -18638 -18870 -18027 -3933 5270 7700 -8209 -15468 -14469 -15275 -21256 -21425 -7740 -5298
5989e298j769j2604q763j1268J9554K3202j497j4346j1889m311J4708m81R020
5976e742K047L13n989l456L890k00j1577m961Q779J3628J654K965m294r883j3289
5961b6115q263P317O608J4276J000Q72o836N3o720j2275l632M2P059O711Q953
5946a0950K106q993L884L281L048O225p999o003l422o15J1491O196p231O52m341
5931a2671j710j1872o669M262Q361q708P518J1327N267J645n142m387M59m968
5917a7288k656J0493J316K225j5377m67P827J0312j0972q717K1184k063k730K296
5903d617l036j302O055Q729l304j2095o470J938Q749o734k2496J741J2333j199
5889b1708l945M167k295O230N223l303P495M763O689J976j002r497j327k265n702
$$ plain form
5989 -5298 -7067 -19671 -28434 -39702 -20148 3054 1557 -12789 -24678 -28989 -14281 -14762 -5742
5976 -5742 -3695 -3382 -9371 -12827 -8937 -9137 -20714 -25675 -16896 -3268 -1614 1351 -2943 -12826 -26115
5961 -26115 -34378 -27061 -20453 -6177 -5177 -4305 -11141 -11088 -17808 -30083 -33715 -33673 -26614 -19903 -10950
5946 -10950 -8844 -17837 -13953 -10672 -7624 -1399 -9398 -15401 -18823 -19438 -7947 -1751 -8982 -8330 -12671
5931 -12671 -14381 -26253 -32922 -28660 -20299 -29007 -21489 -10162 -4895 -3250 -8392 -12779 -12320 -17288
5917 -17288 -19944 -9451 -8135 -5910 -21287 -21754 -13927 -3615 -14587 -23304 -2120 -4183 -6913 -4617
5903 -4617 -7653 -8955 -2900 5829 2525 -9570 -16040 -14102 -5353 -12087 -34583 -32842 -20509 -21708
5889 -21708 -25653 -21486 -23781 -17551 -12328 -15631 -8136 -3373 3316 5292 4290 -5207 -6534 -8799 -14501
5874a4501Q08R067J531J136L496r421K747j1237l235J1132J1627J329o89o335
5860b545j701k643l245n089P111r409M866P597k695j969M657O511k95r984m165
5845a2998q211O682N881O70j8403k7152R406J8012J2320J0630o155N68J949n483
5831a2284k408j2751l0J190N811l100N038M762q511n914Q962Q19M766Q03l963
5816a6810N501j883m85p954R499K569R487l862k0130o738R531K813p675n688P626
5801b4199Q051M823m195k59q03j92N136O56P21J263j6591k768L433N984M372j2490
5785b7058p889L147K962J1107N086l918Q417N21p751L388m186j0188j738k437
5771c0537k048L54Q952P166m891q287J2574J2378K041j2361Q242O017P611L413
$$ plain form
5874 -14501 -13693 -4626 -3095 -1959 1537 -7884 -5137 -16374 -19609 -8477 3150 4479 3790 -2545
5860 -2545 -4246 -6889 -10134 -15223 -8112 -17521 -12655 -5058 -7753 -9722 -5065 1446 1151 -8833 -12998
5845 -12998 -21209 -14527 -8646 -7976 -26379 -53531 -44125 -26113 -13793 -3163 -9318 -8750 -6801 -12284
5831 -12284 -14692 -27443 -27473 -26283 -20472 -23572 -18534 -13772 -22283 -28197 -19235 -18416 -13650 -12847 -16810
5816 -16810 -11309 -13192 -13677 -21631 -12132 -9563 -76 -3938 -24068 -30806 -21275 -18462 -26137 -31825 -24199
5801 -24199 -16148 -11325 -15520 -15779 -16582 -16774 -11638 -10982 -10261 -8998 -25589 -28357 -24924 -18940 -14568 -27058
5785 -27058 -34947 -31800 -28838 -17731 -12645 -16563 -8146 -7625 -15376 -11988 -16174 -26362 -28100 -30537
5771 -30537 -32585 -32231 -23279 -16113 -21004 -29291 -16717 -4339 -2298 -14659 -6417 -400 7211 10624
5757A0624j1706k5138p196J1333K0237J0210J93j3057j0232L370R913k760K685
5744a524k209J519J0095J1424j4248k4175j5330O635J113k279J6156J5525N961
5731H663J815j5802j7349J7787O615p099r622m739L679R1O298O704j0186o826
5717a9971j256n38O782M729m095M317m667k201k619m96k528J892J6416Q54j0134
5702a3515j025N269N721p926j2771R478J1207q606n499N696Q795M300K466o54
5688B936k900N374j833j8550m747N215M21m602j354L301J2442N006o251N15L220
5673a807N8j130j671j4120q109J396J4801N009O021p057k2038J8046J3971n925
5659b555P023P85o292q297n453J0096P950j1155O049J023k528m303Q815l836N569
$$ plain form
5757 10624 -1082 -26220 -33416 -22083 -1846 8364 8557 -4500 -14732 -11362 -1449 -4209 -1524
5744 -1524 -3733 -2214 7881 19305 5057 -19118 -34448 -27813 -26700 -28979 -12823 2702 8663
5731 8663 10478 -5324 -22673 -4886 1729 -5370 -14992 -19731 -16052 -15961 -9663 -2959 -13145 -19971
5717 -19971 -21227 -21765 -14983 -10254 -14349 -10032 -14699 -16900 -19519 -20015 -22543 -20651 -4235 -3381 -13515
5702 -13515 -14540 -9271 -3550 -11476 -24247 -14769 -3562 -12168 -17667 -11971 -3176 1124 3590 2936
5688 2936 36 5410 3577 -14973 -19720 -14505 -14084 -18686 -20040 -16739 -4297 709 -5542 -5027 -1807
5673 -1807 -1749 -2879 -4550 -18670 -26779 -25383 -10582 -5573 448 -6609 -28647 -10601 3370 -2555
5659 -2555 4468 5253 -1039 -9336 -14789 -4693 3257 -7898 -1849 -826 -3354 -7657 1158 -2678 2891
5644B891q30J2116P974n765n654P815Q233q358o316j315P33L80n038p078L194
5629B982j1947m967k6R431K043j1580O625J0644K914j0340m870N042R776J157
5615F884j2728n435Q173K356r388j2289o319O768M061L562L591K665J685J156
5601e258j592l528Q395k066l748M337p540p011J4421O436j1694j1454k870j536
5587b4708J391j792J559M100o65p748k639N448J4185p83M251K563J4297j8448
5573h989k82p55l925l060l486J4173o040j2191O778q986M52Q44k392Q031J1737
5558h091n109P193O853Q430m283j0811k429P348j25n342j2681r704K176j250M416
5543b3409N608N114m264k44j0710k49J6285k956m2O519K0126J4317o403j7961
$$ plain form
5644 2891 2061 14177 22151 16386 10732 18547 26780 18422 12106 10791 11524 11904 6866 -212 2982
5629 2982 -8965 -13932 -13958 -4527 -2484 -14064 -7439 3205 6119 -4221 -9091 -4049 5727 6884
5615 6884 -5844 -11279 -3106 -750 -10138 -22427 -28746 -21978 -17917 -14355 -10764 -8099 -6414 -5258
5601 -5258 -6850 -10378 -1983 -4049 -7797 -3460 -11000 -18011 -3590 2846 -8848 -20302 -23172 -24708
5587 -24708 -23317 -25109 -23550 -19450 -20115 -27863 -30502 -25054 -10869 -11652 -7401 -4838 9459 -8989
5573 -8989 -9271 -10026 -13951 -17011 -20497 -6324 -12364 -24555 -17777 -26763 -26311 -25467 -27859 -19828 -8091
5558 -8091 -13200 -6007 846 9276 4993 -5818 -8247 -899 -1024 -6366 -19047 -28751 -26575 -27825 -23409
5543 -23409 -17801 -12687 -16951 -17195 -27905 -28154 -11869 -14825 -14867 -8348 11778 26095 19692 1731
5529A731k2288n652m023K058L454j274Q218K1716M32k202j19o66Q96o234m991
5514h944k06J0625Q292l981j33J083j781j1547J6942L243N179j0157j6320l767
5500a1472J382R782L936j2316j2382o8J2251R726m315J0792L989o200J3238p716
5486A0627m04l123j0385L460L846k3312o79J2789N672r674o665P565J3007Q466
5472A1190J5482N778N89k927j7421j0169Q404j2529j8591o036Q770p082q392J0583
5458b2351N584K607k46N712J1863q154p026L027n82N12k423k923j889m65J613
5443a5141J1299Q709p397j3874p510p320p157M083J7483M681J013n684J3813K0514
5429A7512J810n090j767k0315j8222k811J272J321m66N460J795r48P401p186J245
$$ plain form
5529 1731 -20557 -26209 -30232 -28174 -24720 -25994 -17776 3940 4372 2170 2051 1385 2281 -3953 -8944
5514 -8944 -9150 1475 9767 5786 5653 6736 4955 -6592 10350 13593 18772 8615 -7705 -11472
5500 -11472 -10090 -308 3628 -8688 -21070 -21138 -8887 839 -3476 7316 11305 5105 18343 10627
5486 10627 10223 7100 -3285 175 4021 -19291 -19970 -7181 -1509 -11183 -17848 -10283 2724 11190
5472 11190 26672 32450 33039 30112 12691 2522 10926 -1603 -20194 -26230 -17460 -24542 -32934 -22351
5458 -22351 -16767 -14160 -14406 -8694 3169 -4985 -12011 -8984 -9566 -9054 -11477 -14400 -16289 -16754 -15141
5443 -15141 -3842 4867 -2530 -16404 -23914 -31234 -38391 -34308 -16825 -12144 -11131 -16815 -3002 17512
5429 17512 19322 14232 12465 -7850 -26072 -28883 -27611 -26290 -26756 -21296 -19501 -20449 -13048 -20234 -18989
5414a8989R755O073J190m782J5234K635n347j310l864M140k380r907J039M270
5400b243J2212N503m16P172N82n259J555j430j1111j6209M297P929n145k3773
5386b6336k166P320M523L231R021J632j799R697J911j0680n980K83o821J435q19
5371a5548O755P205o120r791L15Q15J842m447l755L362M854k781M066k320k761
5356a8309k349o188p79N048P357M069O197l459j0077P802J3946j2076j6801J3702
5342a1917n365m865L59L208l175K28J1743o649k1754J0363J0616J808J0336r877
5328a4941n458l141p784J685O259j131J659J3676M698N71l887O51P398k649j587
5313c981K052K739j4952l592P019K016L664R425M571M362N305j0761J010j0146
$$ plain form
5414 -18989 -9234 -3161 -1971 -6753 8481 11116 5769 4459 595 4735 2355 -7552 -6513 -2243
5400 -2243 9969 15472 15056 22228 22810 17551 19106 17676 6565 -9644 -5347 2582 -2563 -26336
5386 -26336 -28502 -21182 -16659 -13428 -4407 -2775 -4574 5123 7034 -3646 -9626 -9343 -16164 -14729 -15548
5371 -15548 -8793 -1588 -7708 -17499 -17184 -16369 -14527 -18974 -22729 -19367 -14513 -17294 -13228 -15548 -18309
5356 -18309 -20658 -26846 -27625 -22577 -15220 -11151 -4954 -8413 -18490 -10688 3258 -8818 -25619 -11917
5342 -11917 -17282 -22147 -21788 -18580 -21755 -21527 -9784 -16433 -38187 -27824 -17208 -15400 -5064 -14941
5328 -14941 -20399 -23540 -31324 -29639 -23380 -24511 -22852 -9176 -4478 -3907 -7794 -7143 255 -2394 -3981
5313 -3981 -1929 810 -14142 -17734 -10715 -8699 -5035 4390 8961 13323 18628 7867 8877 -1269
5299a269m619j2530p72J501R475l06j4515m937L72R288J1495p977j8162j173J8426
5284a5703L141J1N742j79l334M917J23Q741J681q743o920l677N986M480j554j3452
5268a8740p134J1610l72o837J2326J5107L999j418k587j115o26N467k680j7397
5254a0397p344n659l496O824Q268J20j0090n735p991L126M882Q913M579n244O637
5239a2607n290J954M456J0903j407j0247j1296l013L619J1750l047m483L451n93
5225a5850P582J0885M362j1763M070R140j1123r465k470L816M042P972L282l273
5211A207o781J7145n381k5349j4338Q739O624O450k39k835M15k388p57J2791J5013
5196A0316j3499j3438o045N261R541P835q33j3214j0393J917J4676P877o590l996
$$ plain form
5299 -1269 -5888 -18418 -19190 -17689 -8214 -8520 -23035 -27972 -27600 -18312 -6817 -14794 -32956 -34129 -15703
5284 -15703 -12562 -12551 -6809 -6988 -10322 -5405 -5282 3459 5140 -3603 -10523 -14200 -8214 -3734 -5288 -18740
5268 -18740 -25874 -14264 -14636 -21473 -9147 5960 9959 8541 5954 4839 4213 9680 7000 -10397
5254 -10397 -17741 -23400 -26896 -20072 -11804 -11684 -21774 -27509 -35500 -32374 -27492 -18579 -14000 -19244 -12607
5239 -12607 -17897 -15943 -11487 -584 -1991 -12238 -23534 -26547 -22928 -11178 -14225 -18708 -15257 -15850
5225 -15850 -8268 2617 6979 -4784 -714 8426 -2697 -12162 -14632 -10816 -6774 1198 4480 1207
5211 1207 -5574 11571 6190 -19159 -33497 -24758 -18134 -11684 -11923 -14758 -14343 -16731 -17488 -4697 10316
5196 10316 -3183 -16621 -22666 -17405 -7864 -29 -862 -14076 -24469 -22552 -7876 1 -6589 -10585
5182a0585P94P908J7590J2168q39M40r120k504p417k878Q102j0001L412R616j0225
5167F461j4069k1769r652J7814Q003O24M143l097q865J1434Q592J0967N72j1289
5153a31L35P006l543L255m237K203P325K45L3n468J214o602O459P535q407j0135
5137b913J767l167n659k636J700k623J868O749O023q910M111J2350Q025j1257
5123E428r279j9460L231J0175j492o592K086M095J062J806J767k691n25k093q834
5108b1316J6645O664l1k286O319K3607m329j1997o956j11l76j2730J425J3499
5094H027J599j323P34O499p660j1960n175k385Q378J657m35P082Q541j1673k500
5079e94q693K855n986j44J0673L130j246J884r024o023J258l685M28N869lQ228
$$ plain form
5182 -10585 -9791 -1883 15707 27875 27036 27476 18356 15852 8435 5557 13659 3658 7070 16686 6461
5167 6461 -7608 -29377 -39029 -21215 -13212 -12588 -8445 -11542 -20407 -8973 -381 10586 11158 -131
5153 -131 204 7210 3667 6922 2685 4888 12213 12458 12491 7023 8237 1635 8094 15629 7222 -2913
5137 -2913 -1146 -4313 -9972 -12608 -10908 -13531 -11663 -4914 1109 -7801 -3690 8660 16685 5428
5123 5428 -3851 -23311 -20080 -9905 -11397 -17989 -15903 -11808 -10746 -8940 -7173 -9864 -10389 -12482 -21316
5108 -21316 -4671 1993 1962 -324 5995 29602 25273 13276 6320 6209 5833 -6897 -5472 8027
5094 8027 9626 8303 9037 15536 7876 -4084 -9259 -11644 -3266 -1609 -2044 5038 13579 1906 -594
5079 -594 -9287 -6432 -12418 -12562 -1889 1241 -5 1879 -7145 -13168 -11910 -15595 -15167 -9298 -9301 -1073
5063a073O887J1718r05o364j7915m796j62p514J2616J2804k854m529J0136R381
5049A7430M401r594p687o855o048K417j3739j5790R599P623L410O518N269L559
5035E13o633K349o421K715O995k985o656L080J709J521N566P007p555j0517K600
5020f712Q087N95r70j6080o025K931M186P094L142K312k107l678K078J1101N431
5005A1385j849j5688M661p34n501r454R276J2341M428P145J1099m530m474j1488
4991F617k0890n540P105P328l259p427O233Q502L294L990n258l889r562l59n23
4976a3638m714l616n011P862N874j737Q137j582P950J454j6032o08J0450P20M345
4961a46N735j1741n270J3526k351K366M321Q835R845J286j6239j1629P548N31
$$ plain form
5063 -1073 5814 17532 16627 10263 -7652 -12448 -12610 -20124 -7508 5296 2442 -2087 8049 17430
5049 17430 21831 12237 4550 -2305 -8353 -5936 -19675 -35465 -25866 -18243 -14833 -8315 -3046 513
5035 513 -6120 -3771 -10192 -7477 -482 -3467 -10123 -7043 -5334 -3813 1753 8760 1205 -9312 -6712
5020 -6712 1375 1970 1000 -15080 -21105 -18174 -13988 -6894 -3752 -1440 -3547 -7225 -5147 5954 11385
5005 11385 9536 -6152 -1491 -2225 -7726 -17180 -7904 4437 8865 16010 27109 22579 18105 6617
4991 6617 -14273 -19813 -12708 -5380 -8639 -16066 -9833 -1331 1963 5953 695 -3194 -12756 -13115 -13638
4976 -13638 -18352 -21968 -26979 -19117 -13243 -14980 -6843 -8425 -475 979 -15053 -15661 -5211 -4491 -146
4961 -146 5589 -6152 -11422 2104 -247 2119 6440 15275 25120 26406 10167 -1462 6086 6617
4947F617r671q185n441J0743O095M944j5080K826N967m542P293k475p557k223
4933a0689K561M494P093J5838m16j5694p307K770K11L34l638j2934J2958M741
4919C22J0695O350q423j8660P225L625k261J5413j2958j6326o709J939J5008J4107
4905I347j1068k343o263m715J2940M26N471l262j1627n332L212Q183J403p656
4891a1284J5886J198m142O139o483O96O63K158R93r343n682R647N902q959j1688
4876a4299P067q34K864p656k469k828M733J1531P685j2250K474L239M610p151
4862c284j0557k3k372J2601K326l053M870M914q850j9345J405J0463l083q750
4848b2738m931N297K0507R473r136j2688K770m116N833L311k343q54L642J2648
$$ plain form
4947 6617 -3054 -11239 -16680 -5937 158 5102 -9978 -7152 -1185 -5727 1566 -909 -8466 -10689
4933 -10689 -8128 -3634 3459 19297 18881 3187 -4120 -1350 -1139 -805 -4443 -17377 -4419 322
4919 322 11017 17367 8944 -9716 -2491 1134 -1127 14286 1328 -14998 -21707 -19768 -4760 9347
4905 9347 -1721 -4064 -10327 -15042 -2102 -1676 3795 533 -11094 -16426 -13214 -5031 -3628 -11284
4891 -11284 4602 5800 1658 7797 1314 2010 2673 4831 5824 -3519 -9201 446 6348 -2611 -14299
4876 -14299 -7232 -8066 -5202 -12858 -15327 -18155 -13422 -1891 5794 -6456 -3982 -743 3867 -3284
4862 -3284 -13841 -13864 -16236 -3635 -1309 -4362 508 5422 -3428 -22773 -21368 -10905 -13988 -22738
4848 -22738 -27669 -22372 -1865 7608 -1528 -14216 -11446 -15562 -9729 -6418 -8761 -9615 -5973 6675
4834F675J1919l82p691j0655J557J0759k652K23j0577j3716Q457N647O210R569
4820A5343j604L4Q7j432j2670o208O947j0923o683l171P83L449P781P123Q984
4805G840N198j750p289o475R191R189K814o532m498R5J08n875k446m335o602M620
4789f747J0258R355j5097p786J3138J914r454l918P650K337P586o026j7551j726
4775a6067J6317J0418P198J097n879j0434k229N002n574j2402M460Q647J583n69
4761A568M532l360o274k482J3912Q064l928j3002j2381l477J2772L418P379n056
4747A685p520M994j5462j3650j755R319j430K833J8352J2191R25r045j482j1742
4733a1787J033J4513O34Q796M575K919k152j4136j0957j0157P587l529P576o662
$$ plain form
4834 6675 18594 18212 10521 -134 1423 12182 9530 9753 -824 -14540 -6083 -436 5774 15343
4820 15343 13739 13773 13860 12428 -242 -6450 497 -10426 -17109 -20280 -19497 -16048 -8267 -1144 7840
4805 7840 13038 11288 3999 -2476 6715 15904 18718 12186 7688 7783 7891 2016 -430 -4765 -11367 -6747
4789 -6747 3511 12866 -2231 -10017 3121 5035 -4419 -8337 -687 1650 9236 3210 -14341 -16067
4775 -16067 250 10668 17866 18963 13084 2650 421 5423 -151 -12553 -8093 554 2137 1568
4761 1568 6100 2740 -3534 -6016 7896 15960 12032 -970 -13351 -16828 -4056 -638 6741 1685
4747 1685 -5835 -841 -16303 -29953 -31708 -22389 -23819 -20986 -2634 9557 10482 1437 -45 -11787
4733 -11787 -10754 3759 4393 13189 17764 20683 18531 4395 -6562 -16719 -9132 -12661 -5085 -11747
4719a1747j0385O869N612P8J191j368O325p212J508P434l198j0430J1433K535
4705a355j0771j4367J0497J3850L816n011L378P07K847L549l421o614r39l784
4691g618m405M60J2345J717m816m950K922l34j1502q494o037L288J2566o80J772
4676a3766R470J302J0357M239q552r250j3050j9516K716J4389m855J2884O365
4663g267o613M143O193P30Q71P92J2900J0003p876q055o103j30J41l1r25J1137
4647I910K871l183P901K065O376k3275q089O343P20K440K565j796P448M714n554
4632A1456j8370m729J1829J451o84n864M984K683L591J5550N16n329j0537q85
4618E662p303k347j880m831P918M06J881j712k2017O350O202l920M652j0622p905
$$ plain form
4719 -11747 -22132 -15263 -9651 -9573 -8382 -9750 -3425 -10637 -9129 -1695 -4893 -15323 -3890 -1355
4705 -1355 -12126 -26493 -15996 -2146 1670 -3341 37 744 3591 7140 3719 -2895 -3834 -7618
4691 -7618 -12023 -11563 782 2499 -2317 -7267 -4345 -4679 -16181 -24675 -30712 -27424 -14858 -15538 -13766
4676 -13766 -4296 -2994 7363 11602 3050 -6200 -19250 -38766 -36050 -21661 -26516 -13632 -7267
4663 -7267 -13880 -9737 -3544 -2814 -1943 -1151 11749 21752 13876 5821 -282 -412 -271 -302 -1227 9910
4647 9910 12781 9598 17499 19564 25940 2665 -5424 919 1639 4079 6644 4848 12296 17010 11456
4632 11456 -6914 -11643 186 1637 953 -4911 73 2756 6347 21897 22413 17084 6547 5662
4618 5662 -1641 -3988 -5868 -10699 -2781 -2375 -494 -2206 -24223 -17873 -11671 -15591 -10939 -21561 -29466
4603b9466J28J4092J3358j1645J746N877M382J2245P649j739k1290k208K393r854
4589a4332p26Q046j598K607O151l598M236P410k608j1917j6386n505J7498J1984
4575A262n578N994L584l41k786q932j2206N476K2250J864r740l835J160R816L098
4560A1086j1857o076M045K285M609j8601j7957N982J5844M992m570J1254Q818
4547I854m700k700O681r237m889J1766J9266k685j7573j63P965q114Q941N659
4533B0071p209M682q503L41oj2406J01J5539J1779j8496j5273R4J3615J5733j0389
4518I673j2674l290J3465M149o473l401r229N52O13j854r426l634Q549J2095L411
4503B526J11j0898Q589J1983J729O120j4226j2582R859j30p386P67j078m782J3124
$$ plain form
4603 -29466 -29338 -15246 -1888 -13533 -11787 -5910 -1528 10717 18366 16627 -4663 -6871 -4478 -14332
4589 -14332 -15058 -7012 -8610 -6003 148 -3450 786 8196 5588 -6329 -22715 -28220 -10722 1262
4575 1262 -4316 1678 5262 4921 2135 -6797 -19003 -13527 8723 10587 847 -2988 -1828 7988 11086
4560 11086 -771 -6847 -2802 -517 4092 -14509 -32466 -26484 -10640 -5648 -10218 1036 9854
4547 9854 5154 2454 9135 -102 -4991 6775 26041 23356 5783 5620 13585 5471 14412 20071
4533 20071 12862 17544 9041 9382 9376 -3030 -2929 12610 24389 5893 -9380 -9286 4329 20062 9673
4518 9673 -3001 -6291 7174 11323 4850 1449 -7780 -7228 -6615 -8469 -17895 -21529 -12980 -885 2526
4503 2526 2637 -8261 328 12311 14040 20160 5934 -6648 3211 3081 -4305 -3538 -4616 -9398 3726
4488C726N293L377J0835n336m373P939o310p842O479p712j952L491k546j665j8818
4473a5414o382J0696J3605o2l773j3551j690o14J332J1309J071J578k097K938
4459a054J020o589O671N201J804k291M133n270K149Q997L146l895l774J3424J0324
4444C3996j1310k1133o282J4491j1063j8213K549O009J0472J5278j662k00K92
4431A3224r8l699J755p315o923P254l726j302l565k371j8011n460Q70Q281J2448
4416h638Q045R878K618o039K204M97j533J5117M072j7151K758R59r39M070o952
4401H966m536o969P159l306j4985O522N814p420K549O254J1256j757p70k147k168
4386D462N457r107k1366P486J7460J5336O813j0310j5521K528k582r542K940O450
$$ plain form
4488 3726 9019 12396 23231 17895 13522 21461 15151 7309 13788 6076 4124 7615 5069 3404 -15414
4473 -15414 -21796 -11100 2505 2443 -1330 -14881 -16571 -17185 -15853 -4544 -3473 -1895 -3992 -1054
4459 -1054 -34 -6623 48 5249 7053 4762 8895 3625 5774 14771 17917 14022 10248 23672 33996
4444 33996 22686 1553 -4729 9762 -1301 -19514 -16965 -10956 -484 14794 13132 12932 13224
4431 13224 13126 9427 11182 3867 -3056 4198 472 -830 -4395 -6766 -24777 -30237 -29367 -21086 -8638
4416 -8638 -593 9285 11903 5864 8068 8565 7032 22149 26221 9070 11828 12787 11848 15918 8966
4401 8966 4430 -2539 4620 1314 -13671 -7149 -1335 -8755 -6206 48 11304 9547 8777 6630 4462
4386 4462 9919 812 -20554 -13068 4392 19728 26541 16231 710 3238 656 -8886 -5946 504
4372E04j0701q124J1172J4233J397n990Q09j3969p931r06m140l591Q282j348n315
4357b5618J0315Q03K221p030m791R924J4585J3332q508m802R402J798K075q59
4343A2847k291n732r06L132o865q164L432O626O820Q753K742J424j3195l04p68
4328G551M115J0999k93o624O713L8M142M18J780L8r124j1629j0778p389J4888
4313D845J2743r378j3971k73j2330j1162P048n580j6150O75K3292J0566P114J7619
4299A5058J813R808N323q981o372j7941r062J6855p306j5442o662J1694r826j851
4285b2892l379q86P528R793N653R159K665l543J4027Q555j168r964o173p593j3810
4270a2028Q078j0371o634O150N542M391J0475K797j6946J3027J1365j1740n312
$$ plain form
4372 504 -10197 -18321 -7149 7084 8481 2491 3300 -10669 -18600 -19506 -23646 -27237 -18955 -20303 -25618
4357 -25618 -15303 -14500 -12279 -19309 -24100 -14176 409 13741 5233 431 9833 11631 13706 12847
4343 12847 10556 4824 3918 7050 185 -7979 -4547 2079 8899 17652 20394 21818 8623 8319 7551
4328 7551 11666 22665 22372 15748 22461 22499 26641 27059 28839 28877 19753 8124 -2654 -10043 4845
4313 4845 17588 8210 -5761 -6034 -18364 -29526 -22478 -28058 -44208 -43533 -20241 -9675 -2561 15058
4299 15058 16871 26679 32002 23021 16649 -1292 -10354 6501 -805 -16247 -22909 -11215 -21041 -22892
4285 -22892 -26271 -27157 -19629 -9836 -4183 4976 7641 4098 18125 26680 25512 15548 9375 1782 -12028
4270 -12028 -3950 -14321 -20955 -14805 -9263 -4872 5603 8400 -8546 4481 15846 4106 -1206
4257a206M760Q151l808j1661Q641J5527K569q783o394j1396j44R057K541L116
4243A0970K103q689j0539p582L288N449j503M750O895K806l920j1392M969k886
4229e281o685M184j2892m987N535O791R024j290L305j4103k042L650N543o380
4215a5628O0J4199j897J77J4108k498j4870J632M958l888N696p935j4158L912
4201a6132O267M802j0J0718J811o488o158P114l827Q802J264M061J60m927l704
4186C753n507j246O16p281n306J4197Q011j0724J32J9512K271j6377P445l704
4172E792L42p242j0161J8k809O003R863M054o82J0480l046L203j359k956o064
4157E436m816j3086k276O97J980O052M395Q043j6806j7551J1696J6966J727M208
$$ plain form
4257 -1206 3554 11705 7897 -3764 4877 20404 22973 14190 7796 -3600 -3744 5313 7854 10970
4243 10970 13073 4384 -6155 -13737 -10449 -5000 -6503 -1753 5142 7948 4028 -7364 -2395 -5281
4229 -5281 -11966 -7782 -20674 -25661 -20126 -13335 -4311 -5601 -2296 -16399 -18441 -14791 -9248 -15628
4215 -15628 -15568 -1369 -3266 -3089 11019 8521 -6349 -4717 241 -3647 2049 -5886 -20044 -16132
4201 -16132 -9865 -5063 -5073 5645 7456 968 -5190 1924 -1903 6899 8163 12224 12384 7457 3753
4186 3753 -1754 -3000 -2384 -9665 -14971 -774 7237 -3487 -3355 16157 18428 2051 9496 5792
4172 5792 6134 -1108 -11269 -11251 -14060 -8057 1806 5860 5178 15658 12612 15815 14456 11500 5436
4157 5436 620 -12466 -14742 -14045 -12065 -6013 -1618 6425 -10381 -27932 -16236 730 2457 6665
4143F665O026Q457p445j6754m919M745K144M063Q252l222K853p151m623p70q65
4128b544J535Q546L104l304m94J1269J796n262k1124j8140M906J3652K069j2436
4114a6427Q65J3134J557j244Q664L270r747p076J889J2264Q898L651o136l649
4100I913n705Q45j11j6232L309R536M841j0112P7J1464J3137m550r466j5774j2861
4085b1689k895O262J797k379m194J1465J1338J5796J1977N872o539k034o588J202
4071A9391N526j1319l60M173q428n674L124M303N972k411J557P249o719l975j0681
4056A728j3136j8069J3672J4182O574J537ml120j2856m411K067m095r67k110P640
4041a1368J2312N537J6935L048Q1q803j2918n142Q821N335J572Q575o385r047
$$ plain form
4143 6665 12691 21148 13703 -3051 -7970 -3225 -1081 2982 11234 8012 10865 3714 -909 -1679 -2544
4128 -2544 -1009 7537 10641 7337 6843 18112 19908 14646 -6478 -24618 -19712 -6060 -3991 -16427
4114 -16427 -15562 -2428 -871 -2115 6549 9819 72 -7004 -5115 7149 16047 19698 13562 9913
4100 9913 4208 5053 4942 -11290 -7981 1555 6396 -3716 -3639 7825 20962 16412 6946 -8828 -21689
4085 -21689 -24584 -18322 -16525 -18904 -23098 -11633 -295 15501 27478 33350 26811 24777 18189 19391
4071 19391 24917 13598 13238 17411 8983 3309 6433 10736 16708 14297 15854 23103 16384 12409 1728
4056 1728 -11408 -29477 -15805 -1623 4951 6488 6484 3364 -9492 -13903 -11836 -15931 -16898 -19008 -11368
4041 -11368 944 6481 23416 26464 26545 17742 4824 -318 8503 13838 15410 23985 17600 8553
4027H553N4J69r662o774O668k243P238J4722m900J5330j0555j8908L021r293N017
4012a563Q757r961M776J0250l60Q51r743j2637l020K1143J2007n147o681q617
3998E5Q82P940J267n532j872O769M700j109m557q350l429L337P069P80n822L501
3982E629o499p613j717L008J34M689K999J1288R501J866m524O807k189q067j5464
3967a52L788Q104N343j573r625n342m943m234l940J1774J18l375q11M062J950
3952A144K588N532q147n035K853j960J0946M309L409k947q667m479l103N978J1645
3937A4066N606p551j2169m468m324o15O055N416P148q228o968J878M247L440M425
3922G958Q827l828o115J557J180o090n365j171o140j69N107j1847o08J1595P126
$$ plain form
4027 8553 8607 8776 -886 -7660 -992 -3235 4003 18725 13825 29155 18600 -308 2713 -6580 -1563
4012 -1563 7194 -2767 2009 12259 11899 12750 3007 -9630 -12650 8493 20500 15353 8672 55
3998 55 937 8877 10144 4612 2740 9509 14209 13100 8543 193 -3236 101 7170 7950 2128 5629
3982 5629 -870 -8483 -10200 -7192 -7058 -2369 630 11918 21419 23285 18761 25568 23379 15312 -152
3967 -152 3636 11740 17083 15510 5885 543 -4400 -8634 -12574 -800 -682 -4057 -4868 -806 1144
3952 1144 3732 9264 1117 -3918 -1065 -3025 7921 12230 15639 12692 4025 -454 -3557 2421 14066
3937 14066 19672 12121 -48 -4516 -8840 -9455 -3400 2016 9164 936 -6032 -4154 93 3533 7958
3922 7958 16785 12957 6842 8399 9579 3489 -1876 -3047 -9187 -9356 -4249 -16096 -16704 -5109 2017
3907B017N12O688o177m838R447J3580K106K927n008j3973j6164R510J3431r931
3893D127j5198J568l826n23K016P005J3188J0594q30k829n857k947j6474n994
3879a5980J0974Q326n81K855j0076J267M095R046Q140j4923j5721J379O230J598
3865c371K231P192p536q078m162L15j449M410K518J836R164N041L59K364j7328
3850f494K395J3496R82q84j2670O486R094L875n832j5190p594K522J6902J769
3836H857J079K822p599J894K064j1509q037j977J5097O963k6j0335j082j1434
3822a3223Q244N355o853r692j0398n883O493M096R936j565J1631O839P559J6053
3808B8592j3947m741J1758M331q546K467L205n446m508j0555m254N740O902n217
$$ plain form
3907 2017 2529 9217 3040 -1798 7649 21229 23335 26262 21254 7281 -8883 627 14058 4127
3893 4127 -11071 -9503 -13329 -13852 -11836 -4831 8357 18951 18121 15292 9435 6488 -9986 -15980
3879 -15980 -5006 3320 2739 5594 -4482 -3215 880 9926 18066 3143 -12578 -11199 -4969 -3371
3865 -3371 -1140 6052 -1484 -9562 -13724 -13409 -14858 -10448 -7930 -6094 3070 8111 8470 10834 -6494
3850 -6494 -4099 9397 10379 9495 -3175 3311 12405 16280 10448 -4742 -12336 -9814 7088 8857
3836 8857 9936 12758 5159 7053 9117 -2392 -10429 -12406 2691 9654 9628 -707 -1789 -13223
3822 -13223 -4979 376 -6477 -16169 -26567 -32450 -25957 -21861 -11925 -13490 -1859 4980 12539 28592
3808 28592 14645 9904 21662 25993 17447 19914 23119 17673 13165 2610 -1644 4096 10998 5781
3794E781j2342J461L656J979n582J547J959L256R628R851l798o530J259O306r890
3779H541j833O349n152l845J2542N439J380j1966j5109r354l835l893R869J1881
3765A014l266Q80J930l798K167o88p643o915n535N964J2067O636j537n720L072
3750a372M762L384J605P759j407l842q609P394O812Q255K795j3310k715j3286
3736a775j3434J1708J5628J2817j3944j3496j0905o651K948R764M679L831R351
3723A0521J877j0179k756J186K175O804M622m845P269m225k318k398j885N894
3709A1742m409r568N07R103J975M02L535m543n428J4023l722q097J0807N913p292
3694A4948q841j83k106r117M04K349n981o308O324O977J4380Q185j2599k5698
$$ plain form
3794 5781 -6561 -5100 -1444 535 -5047 -3500 -1541 1715 11343 21194 17396 10866 12125 18431 8541
3779 8541 6708 13057 7905 4060 16602 22041 23421 11455 -3654 -13008 -16843 -20736 -10867 1014
3765 1014 -2252 -1372 558 -3240 -1073 -1761 -9404 -16319 -21854 -15890 -3823 2813 1276 -4444 -1372
3750 -1372 3390 6774 8379 16138 14731 10889 2280 9674 16486 24741 27536 14226 11511 -1775
3736 -1775 -15209 -3501 12127 24944 11000 -2496 -13401 -20052 -17104 -7340 -2661 1170 10521
3723 10521 12398 2219 -537 649 2824 9628 14250 9405 16674 12449 10131 7733 5848 11742
3709 11742 7333 -2235 -1728 7375 9350 9752 13287 8744 3316 17339 13617 5520 16327 22240 14948
3694 14948 6107 5924 3818 -5299 -4895 -2546 -8527 -14835 -8511 -1534 12846 21031 8432 -17266
3680a7266J714J2780M326o327j232j977J77J5967M974q38m040j1484l322J486
3666e062L671m939K315P00k064N315M184N135L671j4248J752M509m107o46R582
3651I768r724q599O167M744Q127n517n258Q470J1810L886p66o926J46K283l932
3636A4679j6773j269Q157R75r206L365n28r052J1028R235k617J0731Q905N586
3622C3216j9816p191K597r964R42N863j0575O06J231K3m337n697K0083Q383j709
3607A3655q884J2645J5357q162L606M330o540k3055q558J1521J2801o115o056
3594F545o751o340n530K325j45J5775J4713q274j0724k552q746o966J0540j229
3580g359M75M326J1310J2931O291j3393j0612N498j443m577J1584r980j4206j1520
$$ plain form
3680 -17266 -15552 -2772 1554 -4773 -6005 -7982 -7805 8162 13136 12298 8258 -3226 -6548 -5062
3666 -5062 -1391 -6330 -4015 -3315 -5379 -64 4120 9255 12926 -1322 430 4939 832 186 9768
3651 9768 44 -8555 -2388 2356 10483 4966 -292 8178 19988 23874 23108 16182 16328 18611 14679
3636 14679 -2094 -3363 4794 5769 -3437 -72 -600 -9652 1376 10611 7994 18725 27630 33216
3622 33216 13400 6209 8806 -1158 -216 5647 -4928 -4322 -3091 -3068 -7405 -13102 6981 15364 13655
3607 13655 4771 17416 32773 24611 28217 32547 26007 2952 -5606 5915 18716 12601 6545
3594 6545 -206 -6546 -12076 -9751 -9896 5879 20592 12318 1594 -958 -9704 -16670 -6130 -7359
3580 -7359 -6884 -2558 8752 21683 27974 14581 3969 9467 8024 3447 15031 5051 -9155 -20675
3566b0675Q438P390k13K611j733J2600J3442m01o460q620K207M370L604J1339
3552B7899m281j2224p176J366o084O986l258r37J1342O704J947J484k142m620
3538A7006M365K911J339K4n982n817j5848N18K4219j944j4578k75k279L23K305
3523F287N510p108n309M513P469j880P527n719J2960N358q811j788j683j444r590
3508F292r508p535N303J0458L263Q161k060m42o768m186l946N230Q528j3069j0190
3493a0469O652M588M519P669J042R508l133j5767K415j980M6J2497p60p790r310
3478b73J1822J2228Q027p367j5596o050o932P3J3608J0734k180p343R824p624
3464A2951m50k187o064N750O464j2638k951N240N81k639L377m919r288J54O138
$$ plain form
3566 -20675 -12237 -4847 -5060 -2449 -4182 8418 21860 21459 14999 6379 8586 12956 16560 27899
3552 27899 23618 11394 4218 5584 -500 6486 3228 2291 13633 20337 22284 23768 21626 17006
3538 17006 21371 24282 25621 25645 19663 13846 -2002 -1484 22735 20791 6213 5938 3659 3982 6287
3523 6287 11797 4689 -620 3893 11362 9482 17009 11290 24250 29608 20797 19009 17326 15882 6292
3508 6292 -3216 -10751 -5448 5010 8273 16434 14374 13932 7164 2978 -968 4262 12790 -279 -10469
3493 -10469 -3817 771 5290 12959 14001 23509 20376 4609 7024 5044 5090 17587 16827 9037 -273
3478 -273 11549 23777 31804 24437 8841 2791 -4141 -4068 9540 20274 18094 10751 20575 12951
3464 12951 12501 10314 4250 10000 16464 3826 875 6115 6696 4057 7434 2515 -6773 -6619 -481
3449d81o535M994M786J0384j812j4694Q40q008o950N589L355o749M113J8419k783
3434D468O59O10j1252k145K2147J240j3924r075p935J0758O400J039j02j3239
3420a0351N101J784n429J3923o01o659j379l268P323K919j0077j774J7247R675
3406A8434r067j3073j1580J021J7922J1353k762p180j7186K78J4710j082j2400
3393a0612r482O569J0842J5197n658j0622P544J601q692p128J0771K545K023m581
3379C17P379O729q394k752J220j074j1043M211p372N95N069k547m245m012N771
3364a0148J7529O967n568k208r718r77l665O731L962l093m805k448P909O20O353
3349G441o635r498m52r839m297K3507K103n380n222k931R520J0270J011r640j822
$$ plain form
3449 -481 -7016 -2022 2764 13148 11336 -3358 -2518 -10526 -17476 -11887 -8532 -15281 -11168 7251 4468
3434 4468 5127 5737 -5515 -7660 14487 15727 1803 -7272 -15207 -4449 1951 2990 2888 -10351
3420 -10351 -5250 -3466 -8895 5028 4427 -2232 -3611 -6879 444 3363 -6714 -8488 8759 18434
3406 18434 9367 -3706 -15286 -14265 3657 15010 12248 5068 -12118 -11840 2870 1788 -10612
3393 -10612 -20094 -13525 -2683 12514 6856 -3766 3778 5379 -3313 -10441 330 2875 4898 317
3379 317 7696 14425 6031 3279 4499 3425 -7618 -3407 -10779 -10184 -5115 -7662 -11907 -15919 -10148
3364 -10148 7381 14348 8780 6572 -3146 -4123 -7788 -1057 2905 -188 -4993 -7441 468 1088 7441
3349 7441 806 -8692 -9144 -18983 -23280 227 2330 -3050 -8272 -11203 -1683 8587 9598 -42 -1864
3334a864M014N842L985Q180O076j1864p046P53o028k202L630l425j714O429R039
3319A3805j442n54K133q308p144M573j8478P016p7l4R021K364l813o118j3005
3304b0061k084J5135j00j99k967n141l310N86J0968J1452j656Q91K266N060j17
3289A0723J213J422r608p303l555m183l082J1496J2660J1900O381j798j7357j6726
3275g817R887j498k87O52q265N275k307J2065j1342J487J367n637k619R473Q612
3260I046l431l032j315J6205J271m997j051k367p9j669P196P428n013o139n990
3245F063p780J1958J2305o699q342j382M421n867o966J4583O025k388m135J749
3231A3545p077J72l148N355L971O460j0416o61J5079P067j0953M375J019Q835
$$ plain form
3334 -1864 2150 7992 11977 20157 26233 14369 7323 8076 2048 -154 3476 51 -1663 4766 13805
3319 13805 12363 11809 13942 5634 -1510 3063 -15415 -8399 -8476 -8510 511 2875 -938 -7056 -20061
3304 -20061 -22145 -7010 -7110 -7309 -10276 -15417 -18727 -18141 -7173 4279 2623 3514 5780 10840 10723
3289 10723 11936 13358 3750 -3553 -7108 -11291 -14373 -2877 9783 21683 28064 26266 8909 -7817
3275 -7817 2070 572 285 937 -7328 -2053 -4360 7705 -3637 -2150 -783 -6420 -9039 434 9046
3260 9046 5615 2583 1268 17473 18744 13747 12696 10329 10250 8581 15777 23205 18192 12053 6063
3245 6063 -1717 10241 22546 15847 7505 6123 10544 4677 -2289 12294 18319 15931 11796 13545
3231 13545 6468 6640 3492 8847 12818 19278 8862 8201 23280 30347 19394 23769 24788 33623
3217C3623j858j4741P055k0161k2761P583K534k920q35O792J6371j962j3363k290
3203f933q904n501R845M198P685J2257l034J2786O706J069l054k049j3908j3559
3189b396j619K014Qk63p29l716L876J3533N601j2695L285o044P963L988j3291
3174d85m608J2196n978q777l708k742M896k947K340o5O067J4120n427P049m856
3159G075j0437p426K829j897J1386R032r576q729j2649j194Q197P493M904n939
3145f931l921J0955J1085k684j9748J246L109L288n093K420J1260P097n963q946
3131b826J277O443O143M302j5581j1217J0469O192K506p907k774j24K052q970
3117a0015Q117n555r399P60J9396R537M064N143M368m102m565j0985j3543K10
$$ plain form
3217 33623 31765 17024 24079 3918 -18843 -11260 -8726 -11646 -12481 -5689 10682 8720 -4643 -6933
3203 -6933 -15837 -21338 -11493 -7295 390 12647 9613 22399 29105 30174 27120 25071 11163 -2396
3189 -2396 -4015 -2001 -1993 -2256 -2985 -6701 -2825 10708 16309 3614 6899 855 8818 12806 -485
3174 -485 -5093 7103 1125 -7652 -11360 -14102 -9206 -12153 -9813 -9878 -3811 10309 4882 11931 7075
3159 7075 -3362 -10788 -7959 -9856 1530 10562 986 -7743 -20392 -21586 -13389 -5896 -992 -6931
3145 -6931 -10852 103 11188 8504 -11244 -9998 -6889 -3601 -8694 -6274 4986 12083 6120 -2826
3131 -2826 -1549 4894 11037 15339 -242 -11459 -990 5202 7708 -199 -2973 -3097 -1045 -10015
3117 -10015 -1898 -7453 -16852 -16092 3304 12841 16905 22048 26416 22314 17749 6764 -6779 -6569
3103f569L850J019K480j7399N331O840N428Q758J6602n520j2800j452l365L570
3089F773m919K89P670j9615K427O901J881l955j642n37J0465J448O70m414m135
3074f93Q260L572N085P366l851j7112P26K921p185l04N585m64N502o169n779K779
3058B39R62O952j294j6255j4836k357J5711J275l061K07P652M236j983p107O955
3043b704Q801l4J162q765N477K707m051L332K573J5175p5n827K505L234Q9j561
3027B2038p449j930O888j3142n293o544J3274L99K113K757o768L695N256n556
3013I738r81m254j2532o646N458M82N642M167l849k257j411L773o079J1231r467
2998f985N3n826L859J4149M836L97N356M643n226j1288j39K358J055k298n018
$$ plain form
3103 -6569 -2719 -1700 780 -16619 -11288 -4448 980 9738 26340 20820 8020 6568 3203 6773
3089 6773 1854 2143 9813 -9802 -7375 -474 1407 -2548 -4190 -4727 5738 7186 7856 3442 -693
3074 -693 7567 11139 16224 23590 19739 2627 3353 6274 -911 -1215 4370 3906 9408 3239 -2540 239
3058 239 1201 8153 6859 -9396 -24232 -26589 -10878 -9603 -12664 -12457 -4805 -569 -2552 -9659 -2704
3043 -2704 6097 6063 7225 -1540 3937 6644 2593 5925 8498 23673 23598 17771 20276 23510 23599 22038
3027 22038 14589 12659 19547 6405 1112 -5432 7842 8241 10354 13111 6343 10038 15294 9738
3013 9738 8757 4503 -8029 -14675 -9217 -8735 -3093 1074 -2775 -5032 -6443 -2670 -8749 2482 -6985
2998 -6985 -6932 -12758 -8899 5250 10086 10483 15839 20482 15256 3968 3829 6187 7242 4944 -74
2983g4M635K727m132M570r20O062l150j1116p845M630k024N817k913n227J1516
2968B556o047J0160l361J393P782n528j8749O351L815n000n007O730Q172M023
2954G290M711p78j0679j0882P239p10k456k206n106l580p667J4317J8115J3951
2940B1559j407m927p803j5737q701Q701L210m592k613J1076R672L001r936l031
2926a528M648n022p50k072m051L445J8124R951q394j3401o461k440M107L483m664
2911e025Q351K557N004O741r312j2873r310r30J3235K796m531p112k862J7994
2897D723k050N152j622K796L485L247k112N68J2809J103k0795m24k005R819P568
2882B2262o574Q03N262K927P217j3090j0248L72K091K010O498j0028l838R61j602
$$ plain form
2983 -74 4561 7288 3156 7726 6806 12868 9718 -1398 -9243 -4613 -6637 -820 -3733 -8960 2556
2968 2556 -3491 6669 3308 4701 12483 6955 -11794 -5443 -1628 -6628 -11635 -4905 3267 7290
2954 7290 12001 11223 544 -10338 -3099 -3809 -6265 -8471 -13577 -17157 -24824 -10507 7608 21559
2940 21559 20152 15225 7422 -8315 -17016 -8315 -5105 -9697 -12310 -1234 8438 11439 1503 -1528
2926 -1528 3120 -1902 -2652 -4724 -8775 -5330 12794 22745 14351 950 -5511 -7951 -3844 -361 -5025
2911 -5025 3326 5883 10887 17628 8316 -4557 -13867 -14797 -1562 1234 -3297 -10409 -13271 4723
2897 4723 2673 7825 6203 8999 12484 15731 13619 14187 26996 28099 7304 6880 4875 14694 22262
2882 22262 15688 16491 21753 24680 31897 18807 8559 8931 11022 13032 19530 9502 5664 6625 5023
2867E023n335r999q78j484J0154N689k485K1472P916j5988j5588j842K3652N128
2853B5435k2354q390P461o708R898m923j1308N081q91J5560o10j0080j1815O423
2839g221J4331R149m980q880j710O125J1395K333j3058K889j408P43o796k170
2825G42j1408k151P573l14m232R690N720m23r295N39J214j346J967J7211K478
2810A7965L055J208k270q009j5121N134P826m09k1181j2297L72Q936J0545M752
2796E06J3349j540n079m957n564n323J0623L676j2547O616R635l031l819J2518
2782A5063j0100n059M911O86m572j0622K192L254K278m033q83O743N988o669L129
2767B306O123L309n310n508j59R046J3265M074r429n794n43k326m781l463m170
$$ plain form
2867 5023 -312 -10311 -11189 -12673 -2519 3170 685 22157 30073 14085 -1503 -3345 20307 25435
2853 25435 3081 -5309 2152 -4556 5342 419 -10889 -5808 -6699 8861 8251 -1829 -13644 -7221
2839 -7221 7110 16259 11279 2399 689 6814 18209 20542 7484 10373 8965 9708 2912 742
2825 742 -10666 -12817 -5244 -5558 -9790 -100 5620 5197 -4098 -3559 -2345 -3691 -1724 15487 17965
2810 17965 21020 22228 19958 11949 -3172 1962 9788 9379 -11802 -24099 -23727 -14791 -4246 506
2796 506 13855 12315 7236 2279 -3285 -8608 2015 5691 -6856 -240 9395 6364 2545 15063
2782 15063 4963 -96 4815 5501 929 -9693 -7501 -4247 -1969 -6002 -6885 -142 5846 -823 2306
2767 2306 8429 11738 6428 920 761 9807 23072 27146 17717 11923 11380 9054 4273 810 -3360
2752c360m426P780Q852K892J1082k042j2356o667n443M57j639P150P406L739J00
2737A3525m566m094l700P818O193n206r312K636M281M687K201l567M643j584L723
2722A7678j1703n70j514O114K674l527j270L682j898j3412n165k191J1624J914
2708B436K067j8r70P683O244M06M568m564j9266q797r94K0749J1628q174j7060
2693d062o831N350p697j0734l602P166J7848P410q271O358M191N588j2908j6682
2679a6876j101J1801N732o988M270l711r922O848K2473M049j611o329j28q525
2665a8L768L777k141Q766l11N87K797k0695j1530Q751K2210O842K150j395l390
2650B0168j770j306q840p756K2367O501L374k478j3262P44M529r560j0021J0754
$$ plain form
2752 -3360 -7786 -6 8846 11738 22820 20778 8422 1755 -3688 -3231 -4870 2280 9686 13425 13525
2737 13525 8959 4865 1165 8983 15176 9970 658 3294 7575 12262 14463 10896 15539 13955 17678
2722 17678 5975 5405 3891 10005 12679 9152 7882 11564 9666 -3746 -8911 -11102 522 2436
2708 2436 4503 4485 3515 11198 17442 17848 22416 17852 -1414 -10211 -11205 9544 21172 12998 -4062
2693 -4062 -10893 -5543 -13240 -23974 -27576 -20410 -2562 4848 -3423 2935 7126 12714 -194 -16876
2679 -16876 -17977 -6176 -444 -7432 -3162 -6873 -16795 -9947 12526 16575 14964 8635 8507 -18
2665 -18 3750 7527 5386 14152 13841 14428 17225 -3470 -15000 -6249 15961 22803 24953 23558 20168
2650 20168 18398 17092 8252 496 22863 29364 32738 30260 16998 17742 22271 12711 2690 13444
2636A3444q973j229N984P783m138n143J88N948k686P259J1854n149k3486o316
2622d660j667R467J138n818J2294J2860o136r525o791j560m958r02l760o079J173
2607a4924n596j217R007m130M134Q478J0975l637J4684j0068j1416p895o988K475
2593a6118K44Q045N471l955k540J57J2052Q466n695N536Q866J453J0898o889j0519
2578A5472n255o866p404j641p163J0279J2630J759j3362j632p320j1303n038J1881
2564a4963J2975J7867N655q180P16P1k0671r661J4959R605j417o085O778J1573
2550A9222q29j0511Q187j804k1656q834J0004n01K234Q842q54m703n641J06J4578
2535G840N395M409J503j7278j8802o139m337R63J5391J1247l119j459Q163N004
$$ plain form
2636 13444 4471 3242 9226 17009 12871 7728 7916 13864 11178 18437 30291 25142 1656 -4660
2622 -4660 -6327 3140 4278 -1540 10754 23614 17478 7953 1162 -398 -5356 -6258 -10018 -16097 -14924
2607 -14924 -20520 -21737 -12730 -16860 -12726 -4248 6727 3090 17774 7706 -3710 -11605 -18593 -16118
2593 -16118 -15874 -7829 -2358 -6313 -8853 -8696 3356 11822 6127 11663 20529 21982 32880 25991 15472
2578 15472 10217 3351 -4053 -5694 -12857 -2578 10052 11811 -1551 -3183 -10503 -21806 -26844 -14963
2564 -14963 -1988 15879 21534 13354 14070 14141 -6530 -16191 -1232 8373 6956 871 7649 19222
2550 19222 18393 7882 16069 14265 -7391 -16225 -6221 -6722 -4488 4354 3500 -1203 -6844 -6738 7840
2535 7840 13235 17644 19147 1869 -16933 -23072 -27409 -26446 -11055 192 -2927 -4386 3777 8781
2521H781J2443J30j5612k450L248l338j463o47n292J3543j0048j2244L001Q560
2507a388P596j0313j1375O455K644L795j5698k67O775P084q741j367Q013L948
2493b839o156K745R113l231k58K965N744l501p541j918j592J7213M306O244J557
2478B2851k574j1042j6420q292n405J0351J2695L482j2359j1224N388Q916K583
2465a050J010O092J0462l435M833J7673L875j6139j558l065L888j1045j4171N139
2451B509K369j8665L45R777p29l332p488l990l018J1424R445K178n594l680O60
2436g789P67J5857N472K759Q403K303j2567j130M672j1469j1771p232K73R738
2422a714n616r29j960r556L730q864J559O974J1016P932l24K456j3040r758J1604
$$ plain form
2521 8781 21224 21354 5742 3292 6540 3202 1739 1092 -4200 9343 -705 -12949 -9948 -1388
2507 -1388 6208 -4105 -15480 -9025 -6381 -2586 -18284 -18551 -11776 -4692 -13433 -14800 -6787 -2839
2493 -2839 -8995 -6250 2863 -368 -626 2339 8083 4582 -2959 -4877 -6469 10744 15050 21294 22851
2478 22851 20277 9235 -7185 -15477 -20882 -10531 2164 5646 -6713 -17937 -12549 -3633 -1050
2465 -1050 -40 6052 16514 13079 17912 35585 39460 23321 21763 18698 22586 11541 -2630 2509
2451 2509 4878 -13787 -13442 -3665 -4394 -7726 -15214 -19204 -22222 -10798 -1353 825 -4769 -8449 -7789
2436 -7789 -7022 8835 14307 17066 25469 27772 15205 14075 18747 7278 -4493 -11725 -11452 -1714
2422 -1714 -7330 -8259 -10219 -19775 -16045 -24909 -23350 -16376 -5360 2572 2248 4704 -8336 -18094 -6490
2407f490Q402m702J1023Q003L900k282M15j0750j3604j2877J4212O98Q300R958
2393A4206J3438j0991j6234m792j2928j7350J1256J6276J0004M741O292j366N567
2380A8119o430n746p749r352m204j097M964L044L174N647l648j384Q963L393O967
2365A4661j427j3992p838p2k882J4680J859J636L371j846p94o334l596P989o821
2350a406n996J027j071j4047m015P243N453L491K3923Q061j2569o265J71K242
2336F242L809l328J0750k9j788o533J3285l029o183J953j346j0215j642n685o671
2321a0410K308P725J281n083M383J9073K353q720j5260j3614K874J1785Q314k073
2307D936l754J609k735j359N82P908j727j1582P001R087J894O481J934j4147m310
$$ plain form
2407 -6490 1912 -2790 8233 16236 20136 17854 18269 7519 -6085 -18962 -4750 -4052 4248 14206
2393 14206 27644 16653 419 -4373 -17301 -34651 -23395 -7119 2885 7626 13918 12552 18119
2380 18119 11689 5943 -1806 -11158 -15362 -16459 -11495 -8451 -5277 370 -3278 -4662 4301 7694 14661
2365 14661 13234 -758 -8596 -8668 -11550 3130 4989 6625 9996 8150 7356 1022 -2574 5415 -1406
2350 -1406 -7402 -6375 -7446 -21493 -25508 -18265 -12812 -9321 14602 22663 10094 3829 4000 6242
2336 6242 10051 6723 17473 17444 15656 9123 22408 19379 13196 15149 13803 3588 1946 -3739 -10410
2321 -10410 -8102 -377 904 -4179 204 19277 21630 12910 -2350 -15964 -13090 -1305 7009 4936
2307 4936 1182 2791 56 -1303 -721 7187 5460 -6122 879 9966 11860 18341 20275 6128 1818
2292A818P720n170j765Q788L444j3847n218N880N761k350M343O663J518j1503
2278F082o686n45j0558p933K241L782J0357j5K597k196k462Q311k471p074o991
2263a3561N304J7568M475L718j0320n684J119l901k143Q44O766r64P51k18J748
2248E502m568m204Q604J0725K086n247r453r519p543M251P695L31N649J806r061
2233b946j1226m858M77J2019L697L905M46J435O857j7336j3075Q543M479o895
2219a4478K302J534P563M367j301J0337l03K136K832o527M617N18N315m875Q809
2204B2846k195j1098p025P358N456J2Q966q721l874n245p457j731Q813Q54R267
2189A6226J409l692k733J908P301o359j0414N74m86k141j1266o890l57J379k973
$$ plain form
2292 1818 9538 4368 2603 11391 14835 988 -4230 1650 7411 5061 9404 16067 17585 6082
2278 6082 -604 -1149 -11707 -19640 -17399 -13617 -3260 -3275 -678 -2874 -5336 2975 504 -6570 -13561
2263 -13561 -8257 9311 13786 17504 7184 1500 2619 -1282 -3425 -2581 4185 3221 3972 3754 5502
2248 5502 934 -3270 5334 16059 18145 12898 3445 -6074 -13617 -9366 -1671 -1340 4309 6115 -2946
2233 -2946 -14172 -19030 -18553 -6534 -2837 1068 1514 2949 9806 -7530 -20605 -12062 -7583 -14478
2219 -14478 -12176 -10642 -3079 1288 -13 10324 10021 12157 14989 8462 13079 13597 18912 14037 22846
2204 22846 20651 9553 2528 9886 15342 15354 24320 15599 11725 6480 -977 -2708 6105 6959 16226
2189 16226 17635 13943 11210 13118 20419 14060 3646 4220 3734 1593 -9673 -16563 -16920 -15541 -18514
2174a8514J6316R781n835P437K486M829n386n118j624o713j401J1391J878M696
2160A4223J591j586o625j0971L095J060O210o303o830j78L746P210Q286o718j09
2145F101l096m382k703q476P813M199J2131q77q092q18j4771j9734J308J0401
2131b0996J2030n062n666Q136P572P465j98P44N399R206N478Q06J927N05j1869
2116A5477j0535n904J531J343J57O105j899j095n50n320j0653J7905R246lJ576
2101A7381j1344m305J0788O384l390j1292j0755J4993k022m579q02l694k398L668
2087a367Q724O959Q06m537O453o759j2833o09P066P044L021k254m535N639N527
2072A8345l03k020j2257K528n645J131Q700J553q448K120m850K289L424J983R96
$$ plain form
2174 -18514 -2198 7583 1748 9185 11671 16500 11114 5996 4372 -2341 -3742 7649 9527 14223
2160 14223 15814 14228 7603 -3368 -273 787 6997 694 -6136 -6314 -2568 4642 12928 6210 6101
2145 6101 3005 -1377 -4080 -12556 -4743 -544 11587 10710 2618 1800 -12971 -32705 -31397 -20996
2131 -20996 -8966 -14028 -19694 -11558 -3986 3479 3281 4025 9424 18630 24108 24914 26841 27346 15477
2116 15477 4942 -962 569 1912 2069 8174 6275 5180 4630 -690 -11343 6562 15808 15805 17381
2101 17381 6037 1732 12520 18904 15514 4222 -6533 8460 6438 1859 1057 -2637 -5035 -1367
2087 -1367 7357 14316 15122 10585 17038 10279 -2554 -3163 3903 10947 13968 11714 7179 12818 18345
2072 18345 18042 16022 3765 6293 648 1779 10479 12032 3584 5704 854 3143 6567 8550 9546
2057I546j0073o963j1865L561K590q542l186O972J6866O685j168l054m8R474q031
2042B764j3151J1334P917j0224R977N778Q357p904J2342K594j5228r562q081J437
2028a650p579l73L492N961l7R434K800p490k631l662o064o564R473N163j1472
2013a1199l581J0235R927o388n902J0859j525j594k384q97k900P678L34j126R461
1998A0998L999j4558j4781K17J6253j1176l617j038J0403K704p031L697P439Q81
1984D390Q473P47q959p517J5786P961k248j3554l96k198j046r048j808p077n432
1969b1926J1191R06P684P969L308n05j643n851n836J049M511q168J764P716M772
1954F941n619m13P060J5006R42q593L246M259r664j8697n81m842K204J5359J5595
$$ plain form
2057 9546 -527 -7490 -19355 -15794 -13204 -21746 -24932 -17960 -1094 5591 4423 1369 1321 10795 2764
2042 2764 -10387 947 8864 -1360 8617 14395 22752 14848 27190 29784 14556 4994 -3087 -1650
2028 -1650 -9229 -9602 -6110 -149 -186 9248 12048 4558 1927 -1735 -7799 -14363 -4890 273 -11199
2013 -11199 -14780 -4545 5382 -1006 -6908 3951 2426 832 -1552 -2449 -5349 2329 2663 1537 10998
1998 10998 14997 439 -14342 -14125 2128 -9048 -12665 -13703 -3300 -596 -7627 -3930 3509 4390
1984 4390 12863 13610 4651 -2866 12920 20881 18633 5079 4683 2485 1439 -7609 -9417 -16494 -21926
1969 -21926 -10735 -9829 -2145 5824 9132 8627 6984 1133 -4703 -3654 857 -7311 -5547 2169 6941
1954 6941 1322 909 7969 22975 23917 15324 18570 22829 13165 -5532 -6113 -10955 -8751 6608 22203
1939B2203j2870r544O63P397O585N512k992k2768j0495k096K698J1916n280j2657
1925b1728m227J7865O834K338J735r095r197N243j75K010R238k373j3163M155
1911a0540J3116J2001L209n37l102j0889O359K644r010m400Q754j436j2478j0040
1897a6349K1535R473j0666n84m217l368J4667l595l552m090j4942K404N444l010
1883a0850Q930k106o404o878k840N419N041m129k06j132N976M75l456l915J0866
1868e209R547k759p002k62l131j435O050j633j1108K457J5095J364m03Q025q950
1853F46j0140q60j0461m416M911K0602J0510r75j4636O193N215J232l549R975
1839A4247K631j3256J795j008k130K730l84L581K588j1597j5982R912R794j674
$$ plain form
1939 22203 9333 -211 452 7849 14434 19946 16954 -5814 -16309 -18405 -15707 -3791 -9071 -21728
1925 -21728 -25955 -8090 -1256 1082 2817 -6278 -15475 -10232 -10407 -8397 841 -1532 -14695 -10540
1911 -10540 2576 14577 17786 17249 14147 3258 9617 12261 3251 -1149 7605 6169 -6309 -16349
1897 -16349 5186 14659 3993 3409 -808 -4176 10491 6896 3344 -746 -15688 -13284 -7840 -10850
1883 -10850 -1920 -4026 -10430 -17308 -20148 -14729 -9688 -13817 -14023 -15155 -9179 -8704 -12160 -16075 -5209
1868 -5209 4338 1579 -5423 -5685 -8816 -10251 -4201 -5834 -16942 -14485 610 1974 1571 9596 646
1853 646 -9494 -10354 -20815 -25231 -20320 282 10792 9817 -4819 1374 6589 7821 4272 14247
1839 14247 16878 3622 5417 4409 2279 5009 4625 8206 10794 -803 -16785 -6873 2921 1247
1825A247j1071O871Q860n837n817q24L568n912j2715O850J3292Q019L436k169
1811G798j0085J5852O972K455L771p437j613j681q581l618k799j911Q363k399
1797E087P42j2757R498O498m704K784P051r093l453J524k677j949R444M870k951
1782I914L339Q543L821n794m596K141l922N439L109j3785p430j2654R81J5135
1768D241J6295k488L616o038j3956m282O890J1342K7m775j2567o156L630k317
1754f538p396K038O365n484p940J154N100Q753N610P935Q472k472q764n265Q39
1739B407K743J177K045k481p855j3410L33J0553J3220R015L113m686Q02m207q376
1724D393p769L037P006n856n38K0209K427j4301n598j877k31l132O994r32O176
$$ plain form
1825 1247 -9824 -2953 5907 70 -5747 -6571 -3003 -8915 -21630 -14780 -1488 6531 9967 7798
1811 7798 -2287 13565 20537 22992 26763 19326 17713 16032 7451 3833 1034 -877 7486 5087
1797 5087 5829 -6928 2570 9068 4364 7148 14199 5106 1653 3177 500 -1449 7995 12865 9914
1782 9914 13253 21796 25617 19823 15227 17368 13446 18885 21994 8209 779 -11875 -10894 4241
1768 4241 20536 18048 21664 15626 1670 -2612 4278 15620 15647 10872 -1695 -7851 -4221 -6538
1754 -6538 -13934 -11896 -5531 -11015 -18955 -17801 -12701 -3948 1662 9597 18069 15597 6833 1568 2407
1739 2407 5150 6327 8372 5891 -1964 -15374 -15041 -4488 8732 17747 20860 16174 16976 12769 4393
1724 4393 -3376 -339 6667 811 273 20482 22909 8608 3010 1133 902 -2230 4764 3832 10008
1709A0008o638l030n942N672P460P73j1575O560q139K90J4415M431j2632j267
1695C86M214J360n672n83O224J1873q423p795J574p200n677O977J6659n036j5993
1680g112J934l104J651J0826O696n675m491O050N161R229j3300q495k1075o328
1666b8033J290l22J571J366N655L767P522j2929P305J2498N938r829j456J9035
1652A3378j49O85K315j118k970K731r598p714l650O764Q15N164J3572l00n854
1637A4071n104m205l638l920N709o3l334o852J3955J3034l506k465m076n314p423
1622c131Q085K357j309j109P848o634L827n962n489j814M385k197J194J5839k955
1607A2935l495O278j3653O274J6189j663o972l242J294q031K186J2481l470p206
$$ plain form
1709 10008 3370 340 -5602 70 7530 8303 -3272 3288 -4851 -4561 9854 14285 1653 386
1695 386 4600 5960 288 -295 5929 17802 9379 1584 3158 -4042 -9719 -2742 13917 8881 -7112
1680 -7112 -5178 -8282 -6631 4195 10891 5216 725 6775 11936 21165 7865 -630 -21705 -28033
1666 -28033 -26743 -27065 -25494 -24128 -18473 -14706 -7184 -20113 -12808 -310 5628 -4201 -5657 13378
1652 13378 13229 13914 16229 15111 12141 14872 5274 -2440 -6090 674 1489 6653 20225 19925 14071
1637 14071 8967 4762 1124 -2796 2913 2850 -484 -7336 6619 19653 16147 13682 9606 4292 -3131
1622 -3131 4954 7311 6002 4893 12741 6107 9934 3972 -1517 -3331 1054 -1143 51 15890 12935
1607 12935 9440 15718 2065 8339 24528 22865 15893 12651 13945 5914 8100 20581 17111 9905
1593I905K497J141j302J535J269k126l806p68l610r457Q432J2253L827q875m878
1578F037P461j0982j6784R135R807l671j034Q566r955K761L575j3441j194J7551
1564G832q05j3191l120L494o990k500K657j530j294P893O561Q344r886j6215q978
1549b7728P684j839P881M311J88J610o571J9207n669j0695J876o155N28J5535
1535A63M803k112k881K097L34L811K284l651p406k968P991N817r91q336R075j993
1519F037N820J815j4695j5104K172J3520j546Q361Q51M474l112j0365J5771P121
1505B1120J890l721k305K68R074p273j6502R90j194j0140O188L217j2219r753
1491b0360M941l630N620K735m482L498J1300q445q339n169k486J2715J4527L596
$$ plain form
1593 9905 12402 13543 12241 13776 15045 12919 9113 8345 4735 -4722 3710 15963 19790 10915 6037
1578 6037 13498 2516 -14268 -5133 4674 1003 -31 8535 -1420 1341 4916 -8525 -9719 7832
1564 7832 7027 -6164 -9284 -5790 -12780 -15280 -12623 -14153 -15447 -7554 -993 7351 -2535 -18750 -27728
1549 -27728 -20044 -21883 -14002 -9691 -9503 -7893 -14464 4743 -926 -11621 -9745 -15900 -15372 163
1535 163 4966 2854 -27 2070 2404 6215 8499 4848 -2558 -5526 2465 8282 7291 -1045 8030 6037
1519 6037 11857 13672 -1023 -16127 -13955 -435 -1981 6380 7231 11705 8593 -1772 13999 21120
1505 21120 23010 19289 16984 17252 26326 19053 2551 3541 2347 -7793 -1605 1612 -10607 -20360
1491 -20360 -15419 -19049 -13429 -10694 -15176 -11678 -378 -8823 -17162 -22331 -24817 -12102 2425 6021
1477F021k46m075J929J1042l404M991j7286q144n884J6707J6919M907r47n651
1463A6879m332r33J0102M321N165M129O84n063k092j0426j1462k553K091p456
$$ plain form
1477 6021 5775 1700 3629 14671 11267 16258 -1028 -9172 -15056 1651 18570 23477 22530 16879
1463 16879 12547 11614 21716 26037 31202 35331 36015 30952 28860 18434 6972 4419 6510 -946
$$ [...]
##END NTUPLES=NMR SPECTRUM
##END=
