##TITLE=Analysis number 327825
Compound Code spb 02181
Project Code adrs flro3
Chemist Name jom
##JCAMPDX= 6.0         $$ Bruker NMR JCAMP-DX V2.0
##DATA TYPE= NMR SPECTRUM
##DATA CLASS= NTUPLES
##ORIGIN= Bruker BioSpin GmbH
##OWNER= nmr
$$ XWIN-NMR		Version 3.5
$$ Wed Apr 11 16:14:00 2007 GMT Daylight Time (UT+1h)  MAYBRIDGE\nmr@NMR_250MHZ
##.OBSERVE FREQUENCY= 250.131544655141
##.OBSERVE NUCLEUS= ^1H
##.ACQUISITION MODE= SIMULTANEOUS (DQD)
##.ACQUISITION SCHEME= undefined
##.AVERAGES= 16
##.DIGITISER RES= 18
##SPECTROMETER/DATA SYSTEM= dpx250
##.PULSE SEQUENCE= zg30
##.SOLVENT NAME= DMSO
##.SHIFT REFERENCE= (INTERNAL, DMSO, 0, 16.522)
##AUDIT TRAIL= $$ (NUMBER, WHEN, WHO, WHERE, WHAT)
$$ ##TITLE= Audit trail, XWIN-NMR		Version 3.5
$$ ##JCAMPDX= 5.01
$$ ##ORIGIN= Bruker BioSpin GmbH
$$ ##OWNER= nmr
$$ C:\u/data/dgb/nmr/ADRS/1020/pdata/1/auditp.txt
$$ ##AUDIT TRAIL=  $$ (NUMBER, WHEN, WHO, WHERE, WHAT)
(   1,<2007-04-11 16:13:35.95 +100>,<MAYBRIDGE\nmr>,<NMR_250MHZ>,
      <created by zg, POWCHK disabled, PULCHK disabled
       configuration hash MD5:
       49 4B E0 1D 92 C2 6B 37 9F E6 65 BC 52 41 86 1D
       data hash MD5: 64K
       DC 0B 47 26 7E 74 D6 31 AB 7B 03 C0 47 55 1C C5>)
(   2,<2007-04-11 16:13:50.56 +100>,<MAYBRIDGE\nmr>,<NMR_250MHZ>,
      <Start of raw data processing
       ef LB = 0.3 FT_mod = 6 PKNL = 1 SI = 32K 
       data hash MD5: 32K
       86 95 61 19 A6 E0 FE EC E4 6F 0D 69 3F 35 64 81>)
(   3,<2007-04-11 16:13:52.28 +100>,<MAYBRIDGE\nmr>,<NMR_250MHZ>,
      <apk 
       data hash MD5: 32K
       16 D3 7A B9 7C DB C2 E2 ED 0E EB 5D BE F2 00 E4>)
(   4,<2007-04-11 16:13:53.02 +100>,<MAYBRIDGE\nmr>,<NMR_250MHZ>,
      <abs ABSG = 5 
       data hash MD5: 32K
       AE AD F1 CC 4E 09 45 00 1A 26 4A 2C BD F6 2E 58>)
$$ ##END=
$$ 
$$ hash MD5
$$ AD D3 2F 49 0E 6A 3B CC 92 A4 09 CD CB 98 CC 29
##$RELAX= 
##$RELAX= 
##$RELAX= 
##$RELAX= 
##$RELAX= 
##$RELAX= 
##$RELAX= 
$$ Bruker specific parameters
$$ --------------------------
##$DU= <C:\u>
##$EXPNO= 1020
##$NAME= <ADRS>
##$PROCNO= 1
##$TYPE= <nmr>
##$USER= <dgb>
##$AMP= (0..31)
100 100 100 100 100 100 100 100 100 100 100 100 100 100 100 100 100 100 
100 100 100 100 100 100 100 100 100 100 100 100 100 100 
##$AQSEQ= 0
##$AQ_mod= 3
##$AUNM= <au_zg>
##$AUTOPOS= <42 >
##$BF1= 250.13
##$BF2= 250.13
##$BF3= 250.13
##$BF4= 250.13
##$BF5= 500.13
##$BF6= 500.13
##$BF7= 500.13
##$BF8= 500.13
##$BYTORDA= 1
##$CFDGTYP= 0
##$CFRGTYP= 5
##$CHEMSTR= <none>
##$CNST= (0..31)
1 1 145 1 1 1 1 1 1 1 1 1 1 1 1 1 1 1 1 1 1 1 1 1 1 1 1 1 1 1 1 1 
##$CPDPRG= <>
##$CPDPRG1= <>
##$CPDPRG2= <>
##$CPDPRG3= <>
##$CPDPRG4= <mlev>
##$CPDPRG5= <mlev>
##$CPDPRG6= <mlev>
##$CPDPRG7= <mlev>
##$CPDPRG8= <mlev>
##$CPDPRGB= <>
##$CPDPRGT= <>
##$D= (0..31)
0 1 0 0 0 0 0 0 0 0.06 0 0 0 0 0 0 0.0002 0 0 0 0 0 0 0 0 0 0 0 0 0 0 
0 
##$DATE= 1176304414
##$DBL= (0..7)
120 120 120 120 120 120 120 120 
##$DBP= (0..7)
150 150 150 150 150 150 150 150 
##$DBP07= 0
##$DBPNAM0= <>
##$DBPNAM1= <>
##$DBPNAM2= <>
$$ [...]
##$SUBNAM7= <"">
##$SUBNAM8= <"">
##$SUBNAM9= <"">
##$SW= 20.6930455092707
##$SWIBOX= (0..15)
0 0 3 0 0 0 0 0 0 0 0 0 0 0 0 0 
##$SW_h= 5175.983436853
##$TD= 65536
##$TD0= 1
##$TE= 683.16
##$TE2= 300
##$TE3= 300
##$TEG= 300
##$TL= (0..7)
0 120 120 120 120 120 120 120 
##$TP= (0..7)
150 150 150 150 150 150 150 150 
##$TP07= 0
##$TPNAME0= <>
##$TPNAME1= <>
##$TPNAME2= <>
##$TPNAME3= <>
##$TPNAME4= <>
##$TPNAME5= <>
##$TPNAME6= <>
##$TPNAME7= <>
##$TPOAL= (0..7)
0.5 0.5 0.5 0.5 0.5 0.5 0.5 0.5 
##$TPOFFS= (0..7)
0 0 0 0 0 0 0 0 
##$TUNHIN= 0
##$TUNHOUT= 0
##$TUNXOUT= 0
##$USERA1= <user>
##$USERA2= <user>
##$USERA3= <user>
##$USERA4= <user>
##$USERA5= <user>
##$V9= 5
##$VALIST= <valist>
##$VCLIST= <CCCCCCCCCCCCCCC>
##$VD= 0
##$VDLIST= <DDDDDDDDDDDDDDD>
##$VPLIST= <PPPPPPPPPPPPPPP>
##$VTLIST= <TTTTTTTTTTTTTTT>
##$WBST= 1024
##$WBSW= 4
##$XGAIN= (0..3)
0 0 0 0 
##$XL= 0
##$YL= 0
##$YMAX_a= 216409
##$YMIN_a= -225914
##$ZGOPTNS= <>
##$ZL1= 120
##$ZL2= 120
##$ZL3= 120
##$ZL4= 120
##$ABSF1= 16.522
##$ABSF2= -4.171173
##$ABSG= 5
##$ABSL= 3
##$ALPHA= 0
##$AQORDER= 0
##$ASSFAC= 0
##$ASSFACI= 0
##$ASSFACX= 0
##$ASSWID= 0
##$AUNMP= <proc_1d>
##$AZFE= 0.1
##$AZFW= 0.1
##$BCFW= 0
##$BC_mod= 0
##$BYTORDP= 0
##$COROFFS= 0
##$CY= 12.5
##$DATMOD= 1
##$DC= 0
##$DFILT= <>
##$DTYPP= 0
##$F1P= 14.0000005364418
##$F2P= -0.99999901652339
##$FCOR= 0.5
##$FTSIZE= 32768
##$FT_mod= 6
##$GAMMA= 0
##$GB= 0
##$INTBC= 1
##$INTSCL= 1
##$ISEN= 128
##$LB= 0.3
##$LEV0= 0
##$LPBIN= 0
##$MAXI= 10000
##$MC2= 0
##$MEAN= 0
##$ME_mod= 0
##$MI= 0
##$NCOEF= 0
##$NC_proc= -6
##$NLEV= 6
##$NOISF1= 0
##$NOISF2= 0
##$NSP= 0
##$NTH_PI= 0
##$NZP= 0
##$OFFSET= 16.522
##$PC= 1
##$PHC0= 223.511
##$PHC1= 9.668247
##$PH_mod= 1
##$PKNL= yes
##$PPARMOD= 0
##$PSCAL= 4
##$PSIGN= 0
##$REVERSE= no
##$SF= 250.13
##$SI= 32768
##$SIGF1= 0
##$SIGF2= 0
##$SINO= 400
##$SIOLD= 32768
##$SREGLST= <1H.DMSO>
##$SSB= 0
##$STSI= 32768
##$STSR= 0
##$SW_p= 5175.98343685301
##$SYMM= 0
##$S_DEV= 0
##$TDeff= 65536
##$TDoff= 0
##$TI= <Analysis number 999999
Compound Code 99
Book Reference 9
Project Code 9>
##$TILT= no
##$TM1= 0
##$TM2= 0
##$TOPLEV= 0
##$USERP1= <user>
##$USERP2= <user>
##$USERP3= <user>
##$USERP4= <user>
##$USERP5= <user>
##$WDW= 1
##$XDIM= 32768
##$YMAX_p= 456617317
##$YMIN_p= -1249072
$$ End of Bruker specific parameters
$$ ---------------------------------
##NTUPLES= NMR SPECTRUM
##VAR_NAME=  FREQUENCY,     SPECTRUM/REAL,   SPECTRUM/IMAG
##SYMBOL=    X,             R,               I
##VAR_TYPE=  INDEPENDENT,   DEPENDENT,       DEPENDENT
##VAR_FORM=  AFFN,          ASDF,            ASDF
##VAR_DIM=   32768,         32768,           32768
##UNITS=     HZ,            ARBITRARY UNITS, ARBITRARY UNITS
##FACTOR=    0.157963299565203, 1,           1
##FIRST=     4132.6476996994, 0,             0
##LAST=      -1043.33573715361, 0,           0
##MIN=       -1043.33573715361, -1249072,    0
##MAX=       4132.6476996994, 456617317,     0
$$ Real data points
##PAGE= N=1
##DATA TABLE= (X++(R..R)), XYDATA
$$ [...]
29267 -477327 -324984 59294 410721 284937 118520 194784 123053 200760 265103 204247
29257 204247 -99557 100738 185875 -75138 119195 107308 178466 173235 -218277 -239895 -321296
29246 -321296 -502350 -502018 -168114 50230 286389 89785 45592 90860 -175730 -440820
29236 -440820 -607604 -525131 -459929 -309176 -6627 124884 320441 440140 -223637 -429120
29226 -429120 -257710 -239083 -238571 -18987 -70688 -302483 -647785 -552222 -306371 77443 239137
29215 239137 387985 -179569 -444828 -216247 -135084 375136 841165 770366 559767 486284
29205 486284 286711 451704 628844 367334 81695 -70773 -176289 -462706 -564187 -614368
29195 -614368 -1007299 -1009005 -727676 -639507 -617539 -522178 -296354 129390 258800 433542
29185 433542 97097 -180640 33211 3786 -217269 -224234 -304190 -203726 -462336 -544791
29175 -544791 -410102 -367769 -554175 -407455 -62560 165502 -125416 -164804 -52309 75412
29165 75412 121306 -48725 30909 253802 294316 52964 -68605 147464 171353 100532 136836
29154 136836 22974 322913 595202 500044 -222216 -246693 139073 140663 131907 361823 598975
29143 598975 206502 163974 189029 361572 452488 257219 195952 335282 5452 -215912
29133 -215912 -243782 -430369 -412738 -297205 -272281 -202718 -169399 -177867 -93273 12921 355033
29122 355033 170549 -220399 -293954 -261460 -334537 -193671 -94253 197817 239222 239264 313350
29111 313350 90349 -187644 -389749 -609260 -662948 -452469 -71161 191345 -149519 -89193
29101 -89193 -95727 -129547 -433082 -518144 -501662 -493581 -262854 -274873 -380940 -51961 257090
29090 257090 -38125 -1351 88646 129256 175904 20618 -499 121353 351792 410337 223248
29079 223248 220028 499909 650762 385352 -303834 -632608 -534310 -230900 -295905 -394449
29069 -394449 -312396 -234627 -255116 -77796 81417 347086 486972 763829 987350 925673
29059 925673 975506 684260 372360 104684 46635 31345 50184 -50451 -166118 21952
29049 21952 371832 311194 197746 39295 47436 357842 296324 -14247 -490775 -539217 -419542
29038 -419542 -343305 -31743 67235 -62732 -443493 -607620 -516117 -390291 -303337 4796
29028 4796 351299 299365 283682 293095 224970 -70611 -191572 115992 -10938 56787 369234
29017 369234 548797 187355 -105766 -347663 -268539 178843 554755 598171 204627 52105
29007 52105 390545 404482 276047 160227 11694 -235647 -404319 -192575 -291516 -45991
28997 -45991 144145 150528 171737 -196734 -110863 -238668 -387038 -260373 -203214 -143449 87794
28986 87794 243334 297160 72337 51143 188393 18761 -16066 127015 1743 36233
28976 36233 -97096 -233507 -219841 -188019 -77555 267738 375278 180075 109019 303974
28966 303974 242410 -39999 -62714 236410 232026 336101 66401 -359149 -487270 -488725 -269853
28955 -269853 -215806 -201679 -34944 -98138 -110171 -13959 27210 27718 -92021 167577 420111
28944 420111 351096 151214 160364 69448 -163662 -416977 -397835 -214053 -138146 -309559 -22226
28933 -22226 444874 465779 580625 397502 542673 635474 337485 89692 9702 -36085
28923 -36085 -100730 -38626 60617 50744 160143 6211 -94208 -156782 -322097 -276497 -210501
28912 -210501 -25669 165229 -163776 137848 274132 120422 -328167 -372244 -124938 -7676
28902 -7676 -90286 28318 -12706 -69500 25462 -2980 -141730 -416811 -214906 -180831 -79426
28891 -79426 307250 763782 676048 329441 435123 368331 346016 34031 61015 -33347 71317
28880 71317 -97030 -14915 -217889 -197631 53495 326776 116272 151771 78767 196840
28870 196840 84959 -23581 286370 566037 536659 509896 128494 -19291 112693 108657
28860 108657 -83530 -388507 -362285 -410632 -344666 82239 781887 940153 453497 429381
28850 429381 318354 280207 383331 300201 209212 223241 146028 34117 302629 387651 91182
28839 91182 -231313 -351896 -457631 -469736 -441863 -383792 -577638 -348217 -83704 101903
28829 101903 250960 479576 389694 328411 -201362 -443345 -83141 69125 132055 230071
28819 230071 -7842 -246377 -68971 -32678 96476 128706 190577 -68286 24065 58433
28809 58433 201452 140824 -218616 -235143 -130513 -239847 -116130 -83205 238992 -10779
28799 -10779 -90935 -3526 -359130 -498645 -244102 36319 86823 -107593 -273731 -221305
28789 -221305 -397329 -535909 -767337 -512666 -354710 -100056 100794 163120 173354 437709
28779 437709 515306 126262 -16033 222811 66521 -168155 -173024 -138785 163760 521661
28769 521661 512184 394918 291817 215900 -116560 -213140 -112865 -102512 151801 125170 29134
28758 29134 155269 301070 578120 743893 665793 448769 356314 164824 93088 -95467
28748 -95467 -71962 359410 793302 866075 752468 440700 165296 123271 241481 222076
28738 222076 24218 -50025 -247669 -227850 135017 112195 -5896 -59500 -97002 -63904 -225605
28727 -225605 -187609 -49583 -77492 -156935 -203309 218186 944061 930311 829430 499236
28717 499236 245897 -128699 -107439 -11736 170236 -66618 -124942 -11973 -39418 -39552 115277
28706 115277 319310 306818 233229 -208596 -425690 -418234 -263820 -384025 -63335 203168
28696 203168 -199941 -647184 -760975 -530697 5998 654930 806774 350515 128240 218412
28686 218412 463514 233564 294024 345242 434646 132621 -59509 -397717 -539431 -389458
28676 -389458 -159777 -80404 272231 165301 290841 482232 224806 17565 -108284 35256
28666 35256 -41592 -289067 -616372 -462336 -104498 -58255 42073 -11433 111052 348496
28656 348496 402986 330164 285712 88733 310669 292009 335362 311717 388807 -81623 -255094
28645 -255094 -93923 15019 -40201 68082 37359 -158536 -8404 -423563 -754563 -396752
28635 -396752 -336519 -329539 72136 151432 169999 349768 346671 266716 182898 22640 12393
28624 12393 72028 -132517 -278481 -217033 254188 267478 608808 573568 561792 627678 491653
28613 491653 308790 491948 390507 -106263 -5091 155379 263476 -62524 144751 358267
28603 358267 245038 -80626 -71274 11652 -3422 20560 72719 107364 -43270 -161637 35270
28592 35270 83820 416994 492323 681038 596240 238363 304332 331391 323683 313547 74360
28581 74360 -166152 14186 -18223 127575 321145 400228 395873 378654 466542 348047 -12197
28570 -12197 -108132 -48015 36513 165647 23140 -191458 -140390 278644 299083 25601 -258372
28559 -258372 43116 363498 418256 156712 -352399 -389900 -131567 147013 30725 -171133
28549 -171133 -252450 -168641 -311067 -109282 -240471 -274754 -413781 -139250 2392 -33096
28539 -33096 142828 339085 256296 102925 60100 -102340 -321927 -362615 -149290 -155745 140260
28528 140260 1085 -35743 125225 113274 -161 -28011 194554 405992 199508 128676
28518 128676 496197 576796 523391 472547 -55963 -406668 -570941 -955716 -929945 -577251
28508 -577251 -167539 167851 312067 299604 324882 484060 564125 398102 461204 169703
28498 169703 105583 236484 136908 193563 64175 158771 328007 684352 761279 636634
28488 636634 695359 710567 444454 237876 187873 125419 503282 851298 764296 313736
28478 313736 -28270 -180569 -427356 -431653 -214219 -231002 101699 259222 246968 272717
28468 272717 349700 314633 398113 478486 727198 788854 406987 -46579 -56547 59424 290758
28457 290758 588069 401126 25130 112824 288528 676096 458235 -33314 113980 596309
28447 596309 672588 210741 157986 347837 145371 58778 245242 409698 514620 688438
28437 688438 756087 795878 429973 272381 297681 244589 314873 202060 -273845 -527192
28427 -527192 -141354 183944 256039 419122 478939 302553 380304 633036 596290 478197
28417 478197 580913 670456 568363 456763 349019 195758 174047 289914 702165 1047427
28407 1047427 822045 855780 423828 135905 -74040 -317829 -363983 -420181 -252414 -246137
28397 -246137 -133428 29399 76859 186854 131155 344931 225778 172145 423029 429751
28387 429751 606138 461467 238641 43360 38225 126423 -25397 -201245 151394 198961
28377 198961 55819 128419 593210 755397 655092 509296 627009 -139843 -416665 -44652
28367 -44652 -62223 -173533 50724 240 94514 145418 28509 368672 515993 398154
28357 398154 573287 993233 833102 441021 231554 341001 386438 664156 560563 382851
28347 382851 580258 419989 -120173 -195809 3553 255384 353397 282305 165831 415404
28337 415404 674390 871814 655684 721031 790895 463032 410912 219125 301282 178016
28327 178016 283459 145267 354541 656336 586745 831351 900247 414309 130663 235832
28317 235832 63813 79425 442751 512783 631694 370890 141634 37644 319023 472558
28307 472558 409587 405680 273529 277693 536732 553028 450958 351739 575215 368619 142328
28296 142328 283607 226162 263751 152577 -190834 -169177 231278 433407 147694 -36617
28286 -36617 -37366 291562 282532 433219 393541 308865 288277 339003 426564 478013 668800 531812
28274 531812 913174 701610 409292 346124 57856 109253 252907 236256 27479 -83299
28264 -83299 72213 536849 517994 248013 109189 -19969 471312 793557 621193 422907
28254 422907 223291 166199 219119 96417 -112949 27605 99566 304659 499161 287874
28244 287874 263689 523971 507926 558305 390534 534834 414607 102570 334757 805483
28234 805483 950371 1045106 838322 588720 215803 196670 304350 530230 537466 506482
28224 506482 277593 293458 424377 353927 580256 757666 493123 426775 496670 544344
28214 544344 645979 479240 387537 442975 724680 904136 744358 368004 317832 283243
28204 283243 470016 887334 1152103 1108543 922348 1003827 738371 400659 414300 543055
28194 543055 476725 423757 589382 938129 761036 768794 412189 642126 937389 768833
28184 768833 590533 526264 369815 600037 726355 519572 261726 446060 590269 611189
28174 611189 705811 711193 689543 543864 520422 283912 53914 82357 272473 283187 144438
28163 144438 238629 433560 349480 525611 775234 505630 134388 381320 385576 101611
28153 101611 85369 303339 402208 308510 598938 454068 441985 174095 404945 778749
28143 778749 452917 74875 431672 440832 517915 242856 373973 478587 509729 458410
28133 458410 284234 285148 432339 739229 976705 966821 827266 673861 365900 540807
28123 540807 536637 23332 -63492 164219 362680 416434 279270 201957 741103 925702
28113 925702 766389 701166 742238 885493 1156632 459076 -55100 263914 494280 598063
28103 598063 705800 816515 863544 640125 314657 458983 441309 228662 153345 373683
28093 373683 575036 648427 574437 817021 874709 661035 548669 379281 206169 -81918
28083 -81918 -51772 67101 147071 654651 848995 748010 680514 324772 494055 909760
28073 909760 684549 736023 1306461 1330519 927465 800272 895224 691396 919460 1056051
28063 1056051 684165 894167 1030920 919925 809218 641163 498999 589596 519178 490339
28053 490339 590035 548044 676420 438885 365051 934078 870796 616119 539703 778983
28043 778983 1124159 1225745 931057 1021448 924210 849533 844569 878324 934398 1318092 1249490
28032 1249490 1162602 957379 584499 573256 262748 441087 649612 521434 480207 508930
28022 508930 731833 860478 678957 563595 1042501 1304237 1318176 1252932 1226839 1240714
28012 1240714 854004 639306 702148 711025 488568 682047 1234479 1190945 1170124 1076357
28002 1076357 1014771 946618 872001 836003 846199 1247064 1540909 1162309 840846 836082 1110581
27991 1110581 1137524 964032 1015814 1270579 1196862 1077918 1179672 1386645 1117295 1099301
27981 1099301 1224351 1422841 1594905 1299519 1233136 1325771 1020760 885662 980923 1149156
27971 1149156 1140280 1325645 1518490 1502386 1477662 1272413 898387 1068916 1165797 1101133
27961 1101133 1115741 861438 943864 933053 1069586 1246664 1153654 1059291 1168997 1353003
27951 1353003 1634009 1673295 1439061 1480624 1211841 1182782 1204871 1075622 1256098 1254602
27941 1254602 1293044 1416359 1674006 1982423 1868871 1645070 1497649 1311646 1371102 1326147
27931 1326147 1395005 1314001 1310661 1546942 1559646 1167687 1069096 931736 1007663 1080216 1190351
27920 1190351 1122198 1134626 1177838 1704085 2054271 1978289 1746588 1835593 1714083 1710351 1580797
27909 1580797 1653899 1881426 1734173 1355816 1341826 1648544 1571486 1709626 1715456 1719622 1675713
27898 1675713 1680664 1569377 1456486 1705348 1675659 1737484 1692628 1397161 1115610 1354621
27888 1354621 1532360 1452957 1566153 1518697 1671278 2047233 2091807 1719606 1736902 1781705
27878 1781705 1832323 1677837 1613821 1645664 1456055 1812449 2324842 2350799 2194047 2301128
27868 2301128 2155583 2068799 2301960 2167214 2242453 2071072 1899875 2019414 2330638 2863523
27858 2863523 2604589 2366617 2216600 2069833 2097926 2311552 2178305 2066494 2494585 2537521
27848 2537521 2289662 2236096 2350373 2346149 2488918 2716026 2763113 2725218 2399899 2253756
27838 2253756 2409364 2327437 2452618 2619452 2367007 2237100 2103530 2038732 2169471 2225574
27828 2225574 2375591 2214315 1961921 2321311 2619344 2718418 2702776 2868730 2907106 2794828
27818 2794828 2736808 2745019 2805562 3115519 3203817 3342987 3239668 2768252 2520562 2506808
27808 2506808 2755371 2717644 2539928 2509731 2650773 3006823 3429243 3578476 3737256 3827441
27798 3827441 3805996 3533744 3775867 3860405 3482340 3106325 3052217 3233057 3543461 3764664
27788 3764664 3851485 3704399 3603275 3570926 3794817 4082009 4100581 4103385 4409298 4505882
27778 4505882 4340564 4390707 4313028 4203439 4149244 3914287 4387539 4564483 4568334 4713053
27768 4713053 4542709 4175176 4400576 4878871 5015518 5117433 5211054 5227685 5564207 5841073
27758 5841073 5917856 5825833 5486353 5314782 5335081 5288826 5396533 5458681 5487108 5523203 5396632
27747 5396632 5801416 6556480 6845229 6826773 6520801 6218572 6120123 6332650 6791319 6718158
27737 6718158 6888755 7089532 6930407 7029187 6944755 6789159 6945228 6999829 7154491 7348957
27727 7348957 7334025 7444758 7759673 8087190 8196717 8042445 7668031 7752550 8170795 8496744
27717 8496744 8484019 8731326 8793088 8725267 8594028 8754600 9126062 9126013 8976661 8778876 9177455
27706 9177455 9621652 9718326 9783891 10009967 10451192 10365891 10767740 11083012 11465400 11488319
27696 11488319 11488146 11504896 11634005 11618193 11742418 12042863 12386575 12861353 12980072 13031748
27686 13031748 12725942 13028949 13415129 13533044 13661908 13796229 14160246 14685671 14937844
27677 14937844 14819157 14898815 15252074 15740178 15757754 15717115 16067288 16252274 16489101 16850286
27667 16850286 16863660 17242326 17834056 17833210 17936344 18643411 19457128 20012089 20318899 20391224
27657 20391224 20332291 20479595 20536204 20829784 21244091 21446199 21795550 22451416 22818091 22963074
27647 22963074 23252391 23481682 23999906 24557214 24790835 25238628 25671857 26215797 26592876
27638 26592876 26812722 27108850 27418762 27704173 28066792 28237626 28622452 29121168 29591990
27629 29591990 29890529 30260501 30811922 31212907 31304451 31444917 31720416 32628419 33129994
27620 33129994 32860688 32823938 33031855 33614614 34423872 34826342 34980433 34919429 35061393 35166285
27610 35166285 35407891 35697026 36202839 36540042 36505406 36413105 36398338 36705640 36645235 36719277
27600 36719277 37084605 37232220 36731313 36580485 36585980 36461193 36506683 36414177 36160632 35916912
27590 35916912 35947313 35892644 35870064 35684216 35627431 35736225 35441007 35076739 34761362 34788587
27580 34788587 34362739 33987958 33486978 33173196 33237675 32762435 32564116 32278206 32014673
27571 32014673 31553716 31275331 31448315 31450536 31174972 30397816 29922313 29675997 29000020 28704594
27561 28704594 28666077 28621875 28316043 28195772 27766124 27148183 26692367 26408629 26062583 25872474
27551 25872474 25648489 25464121 24804092 24322471 23825419 23260061 23187356 23352355 23110451
27542 23110451 22999713 22747949 22691930 21950726 21319826 20820705 20376194 20125009 19940935
27533 19940935 19528014 19744067 19736031 19625120 19679357 19277972 18755895 18180523 18000483 17774889
27523 17774889 17798299 17623800 17465821 17288354 16732462 16222544 16105674 16093749 15921921 15557896
27513 15557896 15363741 15137278 14930610 14805376 14460915 14354261 13984570 14120722 14479831
27504 14479831 14289989 13637253 13289667 13026310 12968817 12746916 12523791 12401961 12364713 12242379
27494 12242379 12254565 12078729 11671564 11656092 11460285 11222976 10978345 10763502 10576031 10455232
27484 10455232 10659451 10685751 10524490 10272822 10026733 10071513 9909393 9493169 9565941 9602967
27474 9602967 9732465 9569165 9750522 9435362 9231299 9131076 9017924 8852456 8397259
27465 8397259 8174184 8180197 8125489 8146626 8202494 7951527 7974898 7550950 7278661 6931783
27455 6931783 6808202 6667005 6592447 6668919 6996310 6926166 6676102 6445863 6444003 6690727
27445 6690727 6440600 6289338 6196034 6186871 6513474 6378509 6028154 5983850 6111341 5967232
27435 5967232 5987793 5855309 5617600 5705964 5408871 4853380 4563417 4804076 4987934 5124429
27425 5124429 5203682 5110520 5129329 5198047 4907363 4906678 5195840 5092106 4897405 4726790 4945686
27414 4945686 5099336 4860879 4566594 4532916 4496887 4391659 4613301 4647123 4692466 4670752
27404 4670752 4733738 4684233 4493239 4171354 4130252 3924887 3889235 3797933 3669301 3603560
27394 3603560 3525411 3580343 3800496 3893571 4200164 4241128 4181638 4146589 3740686 3404609
27384 3404609 3910895 3870491 3482684 3576531 3431320 2901095 3108416 3378140 3320831 3065862
27374 3065862 3308805 3180088 2590562 2645147 2654315 2855877 3026145 3285072 3251104 2847948
27364 2847948 2597046 2367257 2042003 2126703 2743247 3083322 3010246 3014480 2824146 2771283
27354 2771283 2586507 2482216 2508472 2708733 2693529 2565900 2456656 2459881 2662551 2569266
27344 2569266 2636819 2622975 2530991 2459236 2662535 2757099 2904113 2859621 2672266 2473056
27334 2473056 2570471 2398882 2676568 2607972 2229442 2069058 1899254 1720142 1574326 1697232
27324 1697232 2044365 2431095 2332519 2114408 2097388 2237763 2180673 1914791 1599129 1828443
27314 1828443 2019649 2104096 2394529 2637514 2455194 2477437 2670584 2966624 2942599 2714384
27304 2714384 2543369 1981090 1959775 2071040 1991682 1977644 2139529 2132048 1836966 2161915
27294 2161915 2356297 2215529 2236191 2386751 2541829 2447474 2317276 2285734 2190121 2084443
27284 2084443 1926076 1927342 1755114 1737653 1701707 1714889 1496262 1495360 1650633 1390474 1305467
27273 1305467 1375403 1489012 1202869 983928 880454 828928 1050767 1327506 1064360 1096921
27263 1096921 1244447 1436746 1395260 1246701 1277533 1373753 1334060 1430993 1394897 1363191 1259495
27252 1259495 1295680 1092798 1039878 1135102 1010095 1119264 1507741 1220438 992589 1324656
27242 1324656 1407778 926129 861147 853943 1216680 1349379 1310860 1301644 1171140 1202349 1162452
27231 1162452 1012501 1061618 1343371 1259846 1137086 1138433 1114930 1344147 1210411 824579
27221 824579 780346 1028187 1288985 1306470 1491565 1408233 1319451 1384929 1069973 841199
27211 841199 701415 733895 984177 1243214 1056880 879435 546693 566281 680343 656366
27201 656366 698372 652670 572361 939247 1335376 1417693 1022154 565888 628248 439056
27191 439056 392243 688072 789957 797515 733661 527260 537752 634135 447918 374718 408590
27180 408590 853274 1070649 930484 888270 987996 999941 1054166 1164107 829868 676900
27170 676900 675569 680717 690573 734607 867046 961466 1168834 1033320 1208645 1528909 1756152
27159 1756152 1451162 1138845 1152338 1184231 1099580 1207534 978570 995655 1038119 699912
27149 699912 720871 823003 794989 1011494 1122991 922520 904769 672140 374247 449191
27139 449191 826622 932411 675150 423043 579304 802713 795564 913988 763598 615969
27129 615969 574198 226909 159486 258904 523556 843458 823861 880610 628076 753235
27119 753235 630126 74503 -15865 347997 602718 614274 463532 623154 934126 825507
27109 825507 728651 893677 787603 588806 876855 978905 1006583 1008111 853135 696040
27099 696040 498667 291481 237535 475546 520869 341020 435660 546744 654144 659546
27089 659546 576758 436717 444962 669078 644197 624013 259441 -93251 -313686 -212716
27079 -212716 75865 95940 68985 112114 254097 582843 752613 820794 590061 468779
27069 468779 407918 39488 -97424 -116670 -116697 626311 1076230 745634 669531 423806 348618
27058 348618 152680 226494 494462 685901 346249 334794 517898 399419 455060 627671
27048 627671 526350 337566 140724 287201 126299 299381 795758 808734 733846 460057
27038 460057 370566 513860 525040 483433 560886 527940 722407 953602 1059706 1170129
27028 1170129 762858 519537 445024 420810 187338 107366 303055 518748 419562 194561
27018 194561 227008 331627 17790 -75909 -172769 55662 426897 399198 101291 -68006
27008 -68006 -2943 -180618 -32711 88922 322237 352699 170196 -80160 -87182 163144
26998 163144 -49824 -80785 112058 67414 -193639 49085 230524 257895 598350 674958
26988 674958 539243 449843 519812 664349 783471 725932 625847 419729 352955 161984
26978 161984 353052 380652 181150 -42219 110893 227992 451225 202814 -82530 143403
26968 143403 527661 825202 917261 736871 621030 592140 508163 824301 1027105 931231
26958 931231 597569 684909 515624 255228 269284 357886 397720 590619 349476 339648 387995
26947 387995 124084 -260309 -141724 -1974 94470 112829 -18984 -82561 241900 413385
26937 413385 208700 213859 130356 183333 338062 68849 -328624 -61537 181387 480169
26927 480169 616906 448432 646117 845565 863996 658617 661307 524784 478973 614512
26917 614512 542481 308180 276741 387079 373962 452213 773019 658386 286679 519246
26907 519246 571457 651665 823506 450002 137683 267064 256147 345872 294054 40575
26897 40575 -91824 189770 390616 559615 713546 744133 452575 103289 -32536 65956
26887 65956 267036 495583 630934 1006675 585895 324605 130881 142450 17555 -145950
26877 -145950 16093 52432 69587 139556 316642 221016 317606 694088 712715 909737 748889
26866 748889 542403 430214 645906 801331 720819 326638 92238 18968 -4740 63339
26856 63339 -59903 -3103 -184550 -677654 -491955 -98045 33867 333347 303733 170622
26846 170622 98553 45581 -29286 -209232 -154392 30759 92948 102939 426610 437552 344235
26835 344235 98615 216592 396793 268456 369366 458058 535553 399607 125901 321751
26825 321751 534153 686251 588191 511508 498734 78988 145740 341677 280447 368584 215872
26814 215872 47341 297404 758948 637779 424561 146883 -53597 -255584 -115353 13352
26804 13352 13079 483386 342375 202464 199804 36505 58826 -69471 37015 -98765 58719
26793 58719 5993 260444 282530 -163744 -464360 -188314 188715 313734 377209 369292 195989
26782 195989 -65290 99432 118683 323984 582428 591119 503957 327129 367672 474918
26772 474918 623460 580282 453482 234894 340911 645663 779396 873098 738942 440794
26762 440794 62035 96012 214720 454576 373086 708843 661357 471916 399742 186519
26752 186519 262589 364553 452502 312139 372482 37791 98575 -34951 -2208 -24077 142310
26741 142310 540081 233144 34110 -12243 398017 364101 -144840 -222540 64436 51453
26731 51453 -320292 -489308 -512175 -458841 -394603 -151554 30709 -333253 -413609 -439628 -261081
26720 -261081 124661 314936 6564 -157523 -189610 -202110 33393 142723 -70536 -179508
26710 -179508 101377 45905 57944 84215 -8573 279089 532903 628603 392449 381053 320935
26699 320935 86589 -47829 -166905 -41375 -45044 -47967 -19301 229454 200360 356518 378200
26688 378200 332565 409093 412416 367032 273033 456897 599820 365406 227824 349171 356825
26677 356825 209441 123609 123250 122083 475776 394049 155592 131479 194733 161204 204674
26666 204674 323151 72400 -327587 -15480 22679 -366858 -522801 -494672 -187716 65145
26656 65145 -66789 -71214 4523 223861 89997 182838 321157 229895 61868 17727 -78012
26645 -78012 136193 544800 525085 383195 -34340 228056 267670 450434 390621 -55991
26635 -55991 -211165 -281713 -256988 -3788 194159 93383 -229392 10164 211315 594874
26625 594874 637707 559381 378759 -2164 23983 256627 -805 -136783 -280602 -462540
26615 -462540 -446613 43086 17904 10591 -13128 -169479 -135416 -46553 -45008 49053 101982
26604 101982 52291 -156558 -240266 75132 317679 491798 248735 -124882 -216028 -138172
26594 -138172 -96477 -356297 -552870 -111588 105457 164648 234552 48869 -378996 -481126
26584 -481126 -211210 5786 97216 -15644 -109401 612 473918 729058 412456 77151
26574 77151 -78268 190722 249227 109293 188899 668992 557239 543491 184248 -61487
26564 -61487 -256525 -213163 -239722 -386644 -420807 -278152 -234440 66508 77989 -10524 -53361
26553 -53361 -157821 -586565 -784738 -798439 -543667 130369 358796 275974 414963 158095
26543 158095 191906 359895 178746 149462 263425 437475 191656 256319 285694 164105
26533 164105 173655 46069 -32838 -103503 -170525 -313125 -119948 -133048 102627 253810 554731
26522 554731 369023 237743 225007 151300 111956 296826 154565 40599 99258 -77071
26512 -77071 -179981 -248479 -496727 -249091 35194 132419 178123 57979 230019 433481
26502 433481 417271 190159 18089 283037 278165 61441 -77240 -127176 -272513 -280345 -125593
26491 -125593 110794 235326 199922 253835 291699 -67052 -83360 -309977 32955 111704
26481 111704 -120560 -105979 318152 194746 -164413 -457513 -158031 -218000 -85243 71299
26471 71299 140919 38077 6309 -237219 -8422 -32413 -119632 -193223 33412 210728 257496
26460 257496 72857 8848 -169348 -175490 65540 -20905 -315108 8599 347284 109795
26450 109795 238881 211458 92328 184388 428980 510854 562320 639866 433898 206539
26440 206539 50782 -225633 -330686 75896 112658 -149651 276644 199520 -80655 -158204
26430 -158204 -15335 -159704 -222732 -584820 -472152 -365353 -198578 107828 108677 -201818
26420 -201818 -215317 -185871 -485580 -427024 -614200 -684241 -698903 -587547 -472312 -60612
26410 -60612 90715 233418 498140 557113 149730 117921 196666 14353 -67658 -42495 -123618
26399 -123618 -277351 -236595 -47165 244803 412733 164905 -106934 -18372 335893 445177
26389 445177 207310 40971 -220671 -115655 162155 119177 -249412 -200194 83310 49343
26379 49343 175103 291504 440960 694652 617801 356253 359701 211158 318826 620324
26369 620324 390545 164826 -126511 11464 353381 590669 328325 -120817 50808 27202
26359 27202 -189916 -404934 -506285 -397985 121589 472039 608968 429135 387069 304243
26349 304243 464479 613685 523996 305313 -98074 -111888 -12517 301705 241240 -64567
26339 -64567 105286 -48640 -421919 -359527 -215726 -525916 -626556 -339724 -309040 -155628
26329 -155628 39646 -224556 -124172 -73311 -105183 -198352 150977 -35178 -394595 -260282
26319 -260282 -265672 -158596 133476 331136 473766 726082 657690 453123 182830 543148
26309 543148 780853 445680 72343 -235713 -5709 166715 201670 229838 162735 310892
26299 310892 200402 -195995 -119787 -93172 13833 -180289 7595 -75970 -128973 -572726
26289 -572726 -648453 -224239 79094 334676 355166 225386 134627 -9252 -275672 -273611
26279 -273611 29182 170576 226759 211458 170455 145495 94204 204568 370934 559869
26269 559869 407430 121022 -68651 80668 31850 252484 220818 141159 437583 179393
26259 179393 194047 464543 299349 134485 190169 29016 -146911 -11983 255428 245021
26249 245021 -285642 -366462 116140 459677 667191 524036 45476 -199214 86215 179959
26239 179959 -31769 165217 -9852 -398636 -75577 273102 32718 -510297 -758867 -409071
26229 -409071 -28317 134869 317706 328516 332370 311570 385416 276301 -84547 -135885 -333623
26218 -333623 -304149 -79416 351260 694575 316105 -212363 -512596 -499965 -183316 107941
26208 107941 109928 -227169 -388661 40776 422918 234167 110490 135676 112697 399401
26198 399401 493541 530019 385332 351223 264168 179470 -7225 -76097 -103054 -291777 -366503
26187 -366503 -103179 85831 124582 183764 287131 339165 92341 20058 -51527 -101619 -213449
26176 -213449 -21857 245919 19107 87449 94598 -111735 -304258 -370255 -367258 -162968 -141503
26165 -141503 -256632 -88138 94902 217444 329083 338832 240273 138164 195088 212360
26155 212360 132150 99156 154336 -350376 -530927 -217951 -80063 -58529 -13840 325012
26145 325012 187018 -345594 -303126 -201927 -162514 158682 124547 80001 -300049 -691367
26135 -691367 -553265 -465603 -369343 131315 287792 110686 -361977 -318762 -6372 -47065
26125 -47065 -172472 -395209 -511717 -240510 54833 310761 211056 118721 394256 376976
26115 376976 383901 272976 250826 388153 424207 -77013 -246647 4975 137089 34487
26105 34487 259488 181906 -207112 -318136 -374293 -307253 -365391 -353591 -445496 -585517 -34259
26094 -34259 -43132 165026 117831 -28232 -15508 311213 392981 182167 -47244 -235162 -72137
26083 -72137 260708 443830 349291 207039 -126810 -672165 -574479 -207477 -9398 -300863
26073 -300863 -411054 249379 543185 181901 -224244 -255449 -148842 -124969 174632 162002
26063 162002 205725 -133326 -148256 -144350 -170105 147695 458868 506815 514460 484340 494451
26052 494451 528195 335958 388539 322602 495331 46536 -93022 186475 190186 206317 28751
26041 28751 -78131 -186819 -156087 -238549 -52218 143991 162871 -47366 -325398 -168466
26031 -168466 36954 205241 44305 -104115 -279465 -205513 -509563 -657517 -505546 -456391
26021 -456391 -363227 -361215 -206142 -210881 -243942 -150622 -392589 -438992 -284826 -370790 -394889
26010 -394889 -223421 155754 117696 80983 -156339 -309616 12015 201461 17324 -121615
26000 -121615 -218669 -447063 -273746 -189462 -119140 -93302 63801 62400 -32357 12389 -118665
25989 -118665 -19685 212702 318130 117269 22085 -92011 -55409 2978 -56153 -150557 -257087
25978 -257087 -170152 -163962 -168309 -274914 -406729 -270964 -255525 -219547 -24591 395269 385935
25967 385935 293883 -9808 -102133 -554294 -479990 -544611 -696966 -419671 -434284 -383580 -327943
25956 -327943 -522409 -330666 -316636 -486469 -665109 -531202 -42651 -251695 -398609 149732
25946 149732 480346 234724 233648 325811 169086 -154360 -235598 -370107 -52433 108336
25936 108336 482925 469548 92203 109579 261665 330168 417128 433609 137364 43103 -388133
25925 -388133 -464684 -18768 -106976 -11398 -253540 -481272 -277913 -169 25109 68476
25915 68476 -7784 28345 -6391 -231483 -346124 -305067 -190344 49659 59885 158733 -221686
25904 -221686 -262683 -301811 4419 95327 68590 -116596 -44906 245813 -18598 -208422
25894 -208422 -248078 -119559 75642 77951 170577 7223 -51905 -110182 -521218 -679903 -526529
25883 -526529 -484845 -368669 -288316 -349779 -128339 -164166 -64451 23490 -363789 -245436 -290841
25872 -290841 -296704 -296337 -394880 -160604 -240346 -328880 -535301 -764084 -836604 -749405 81733
25861 81733 416756 345186 544276 334263 426839 346674 -226288 -691891 -784345 -497819
25851 -497819 -156545 22407 -344159 -680151 -602418 -286112 -301324 -507099 -363771 -143613
25841 -143613 -60814 82011 -97930 -199393 16447 3042 47980 102368 -14849 138453
25831 138453 91935 106166 233190 301373 160579 -86134 -291948 -110810 -40935 5784
25821 5784 236803 247464 286043 6638 -58769 115350 -32205 -208061 -254607 -118824 46662
25810 46662 -441605 -797720 -1144707 -1219057 -1189348 -556744 -113681 -168573 71605 106550
25800 106550 -49651 -355878 -471808 -317877 -275346 -532379 -506509 -173550 -111145 102555
25790 102555 350830 304744 76979 -159729 -413537 -309063 -244339 -296800 -216137 208378
25780 208378 34491 30924 -37730 -170352 17763 4161 55519 18617 -261361 -408150 -252073
25769 -252073 -485189 -488390 -209700 -112741 129995 30280 52014 154506 443362 488266 438011
25758 438011 490973 525816 479113 437244 327608 -19535 -141739 -92563 -228184 -384257
25748 -384257 -606613 -325375 98572 135776 -222689 -587939 -366674 -187757 -371386 -228397
25738 -228397 -64998 -183907 -431179 -585959 -610030 -146381 180640 -43268 -118527 -15954
25728 -15954 -129449 -144497 -26783 147560 420587 667906 539423 -125051 40979 -2999
25718 -2999 -215634 -39986 -338141 -258749 -593540 -620530 -506719 -319620 -481240 -514331
25708 -514331 -256259 -217413 -528877 -442203 -55019 163638 -49524 -48596 -11553 184509 280712
25697 280712 334689 -17032 -216122 31827 56083 -225860 -398191 -275551 -26743 -301227
25687 -301227 -22923 542923 372932 202319 304551 535888 404843 519780 790865 551638
25677 551638 440981 181020 -230483 -153366 131321 184134 42289 -147115 129953 106046
25667 106046 141286 -1547 -368959 -424553 -92578 128961 46822 -73675 -24808 170507
25657 170507 222227 -19753 -319723 -644041 -747210 -726808 -533251 -278183 -314411 -406613
25647 -406613 -387017 -167336 84820 248966 277577 135256 -148040 -127995 -107123 72294
25637 72294 193959 162283 247386 239580 386797 241048 -146413 -4304 78245 182352 196977
25626 196977 96398 278559 380802 388345 317447 187873 8499 52274 45047 -377379 -184873
25615 -184873 92800 15270 -90053 -354204 -480111 -284281 -45612 311200 288455 -163803
25605 -163803 -36912 364272 539777 370793 202677 72905 133224 252692 142973 -177422
25595 -177422 -501065 -633011 -518434 -287487 -193700 -312779 -200455 255237 177873 -6703
25585 -6703 121230 79654 187702 -320401 -321260 -273529 -263739 34313 -64513 -70094 -250513 -265758
25573 -265758 -133395 124345 -27000 -189623 -241308 -207356 9123 41147 22421 -87820
25563 -87820 181716 157895 281220 184407 287499 286132 28785 -69480 -69542 -158192 -366613
25552 -366613 -199987 -137773 -533797 -633044 -682789 -279944 -15402 -32780 -398184 -940031
25542 -940031 -880118 -539456 -359055 -48688 -37740 -356374 -417208 -439124 -643774 -425796
25532 -425796 -53725 -199165 -164914 79772 5180 -300856 -394853 -345488 -492964 -294540
25522 -294540 -268653 -505346 -855049 -840378 -670264 -339221 -305620 -380916 -184650 -276948
25512 -276948 -236395 -8225 -126401 -328161 159567 -21444 -336082 -318160 -180797 -54017
25502 -54017 258536 633517 674030 335395 -60225 -76363 -389454 -708212 -538293 -127869
25492 -127869 -108909 -214369 -154887 -167584 -338395 -601768 -528072 10073 242590 -51809
25482 -51809 -318786 -236446 -235123 -276301 -366419 -758057 -510297 -391883 -224708 -56669 -117943
25471 -117943 38801 -270414 -264655 -386883 -673342 -662561 -369649 -290086 -328227 -115028
25461 -115028 86034 159786 263391 304761 -100714 -752865 -955776 -614486 -92745 192435
25451 192435 409826 204454 -70995 16256 287652 438804 359355 270305 283307 150914
25441 150914 197045 72947 314802 571298 415745 381598 504200 265425 -266100 -442763
25431 -442763 -84362 154344 254282 98636 -17368 -198223 -210621 -41130 270502 332284
25421 332284 92128 -173692 -350705 -333840 -511542 -347220 -99589 -179016 -609095 -177541
25411 -177541 182081 61681 63168 154719 304122 256370 160816 104242 -50324 371620 402739
25400 402739 226391 278884 37169 126437 215545 -177669 -58967 -129718 -79684 7206 -83143
25389 -83143 -88733 -310488 -400051 -431515 -100922 255052 198107 -124759 -533788 -634100 -408339
25378 -408339 -300598 -528718 -460087 -291945 217914 476486 -55352 -343019 -369845 -320801
25368 -320801 -439865 -381181 -461872 -204261 -89196 49673 207068 285871 189420 108629
25358 108629 26849 109987 262696 332315 275313 249267 -214375 -503801 -161532 249426
25348 249426 176853 -24003 -330273 -364954 -387628 -829539 -830949 -587671 -543974 -327091 -304454
25337 -304454 -238428 -138227 -428306 -546486 -448012 70852 339924 -3055 -388860 -133376
25327 -133376 -92487 -373773 -362474 96622 460205 568173 464602 437221 460775 121471
25317 121471 -224049 167792 215533 349097 357260 356335 -159544 -408847 -658327 -576523 -396517
25306 -396517 81127 -2907 -207536 -717220 -646589 -395045 -437693 -252771 -126178 122689
25296 122689 53234 -195738 -438560 -317559 50361 170653 165147 121053 11694 -150372
25286 -150372 -333711 -254074 -267347 -639736 -752355 -284625 98489 -186360 -56342 164166
25276 164166 19120 289568 444807 152143 68518 -11532 18338 47522 86115 231189
25266 231189 209927 58530 -72529 -244656 7131 -100095 174768 143657 250755 72670
25256 72670 -250765 -214807 307183 706546 876989 708344 409012 211410 255858 300495
25246 300495 403565 537990 217004 -1229 205045 -4644 49470 33030 -228781 -234894
25236 -234894 -43859 133722 137591 -269411 -213614 4584 82914 159636 106405 97276 49604
25225 49604 -28192 -153701 -49292 16139 -185586 -248358 -164776 -322771 -447679 -776279
25215 -776279 -691768 -482710 -186106 -105492 -223711 -271708 -155061 160333 152344 18524
25205 18524 193954 432387 194968 238188 413653 352953 169398 138126 82651 41438 -140692
25194 -140692 -50349 -313735 -536751 -222851 -3510 -124833 -266610 -210075 -561119 -486702
25184 -486702 -338681 -463627 -406432 -220905 -317854 -231633 167058 339008 422240 574803
25174 574803 809396 624046 66977 -127578 -5212 542329 653791 460607 -66446 -351496
25164 -351496 -171464 -158557 290008 513132 477083 551810 162428 -14085 -157027 -231129
25154 -231129 -52400 -69697 -138876 4732 216289 342817 450457 97384 -416910 -624411
25144 -624411 -244554 -184432 -212321 -359834 -593847 -539024 -131612 125054 507425 589353
25134 589353 611864 496248 684 -260505 -243893 -288031 -361496 -515845 898 451085
25124 451085 278350 353747 91006 -61227 71936 11902 -90512 -163616 -169303 119623
25114 119623 114202 -238539 -280274 -474355 -586991 -179622 -148310 -241646 -421410 -123027
25104 -123027 263664 96611 -230861 -387974 -562827 -455960 157789 274034 168990 112242
25094 112242 -93913 56463 35205 -186592 76143 427869 348703 -6665 50741 117396
25084 117396 -71948 -8967 -7584 -43537 396686 558610 563510 108282 -84182 -253754 -116635
25073 -116635 -116785 79235 -75672 -203662 -39132 153218 100533 144401 119 -147395
25063 -147395 -42197 22285 184955 454850 357682 79899 82555 232827 398482 324701
25053 324701 31733 -88466 -417064 -509075 -527331 -250135 -256673 -68444 -611384 -876138
25043 -876138 -430729 -209398 -441849 -605738 -660177 -701650 -779735 -564945 -268793 -108414
25033 -108414 -197694 -366458 -249369 -279924 -254439 -218142 -312088 -444046 -232673 -132925 142326
25022 142326 284353 318303 257683 447393 685548 898233 993887 700887 700047 444666 445979
25011 445979 410474 211315 48348 63294 66394 333113 22578 -305749 -284087 -264344 -268458
25000 -268458 -50777 138509 68418 -84254 -226098 70780 440353 59639 -220745 -118406
24990 -118406 -35872 -45140 283966 434961 487473 463223 397716 112761 -121978 -316566 -448372
24979 -448372 -560966 -634038 -421416 -428650 -288578 -21027 72152 -213334 -185956 49118
24969 49118 124331 -111700 -591758 -628311 -655281 -449331 -622288 -609355 -342874 -111150
24959 -111150 -94993 63287 -52149 -28402 -97789 -202325 -542081 -372555 -424076 -410742
24949 -410742 -178932 -298250 -379271 -237897 220602 418976 334933 330088 -9802 -100567
24939 -100567 -134558 229988 199271 16431 17392 -192082 -387012 -308230 -382369 -287544 137698
24928 137698 213736 183578 31044 -199125 4998 237862 74864 1466 -28899 -192257
24918 -192257 -317952 -400151 -255835 -227425 -164116 -161406 -350475 -335305 -395982 -346564 132601
24907 132601 74110 163469 289302 122782 -452673 -651141 -971459 -1107424 -936560 -768524
24897 -768524 -494172 -375731 -205713 -234936 -179167 -56390 431580 453119 346865 68598
24887 68598 -31988 -284290 -477266 -348978 -96832 64974 150485 99981 39439 -337808
24877 -337808 72290 -161240 -183707 -177624 115178 157971 -90635 -150957 -150135 -25530 112567
24866 112567 3431 -1814 -49477 -205735 23436 -32848 -167467 -52589 -51786 -55511 -127789
24855 -127789 -194110 -368307 -6143 61662 18922 -30118 43539 92060 33095 101624 45720
24844 45720 4656 212196 180721 197649 184059 13502 -165548 -361572 -133436 100558
24834 100558 244287 262616 -251006 -522526 -660329 -377393 -105729 59982 -3399 -54466
24824 -54466 39635 -136314 -347005 -433101 -453703 -222360 -232967 -475702 -393558 -122740 261274
24813 261274 142567 -211528 -279496 -109907 193907 -15501 -288454 -172497 -214265 -665163
24803 -665163 -560917 -179447 -107841 52578 -142852 -152355 -178050 -291119 -115320 -51477
24793 -51477 -388259 -345647 -130891 -391610 -428351 -430283 -449804 -387824 -283458 -229961 -209436
24782 -209436 84973 408142 335890 377509 189532 -199859 -351307 -93645 103910 -159671
24772 -159671 -215489 -117261 -230651 -293305 -508984 -285268 -366318 -429008 -354050 -194933 -258544
24761 -258544 -2695 89236 -99346 -241371 -528007 -552709 -862716 -776471 -328614 -82296
24751 -82296 -72354 182194 222331 146805 116440 253924 -6331 -45597 -268357 -368185 -143656
24740 -143656 340846 321503 112692 -52858 -207379 -80750 234477 291947 405544 46298
24730 46298 -86018 -142979 82188 212343 -43227 -158016 28258 -84742 -83567 -157730
24720 -157730 319573 68971 15789 317242 209616 71270 53538 202173 205327 51640
24710 51640 50220 205783 -117856 -219994 125309 296484 263724 278417 73947 144929 74301
24699 74301 391898 620624 696474 448495 492980 613500 397842 330488 427000 320275
24689 320275 -2571 -297985 -118139 269567 379557 455681 496913 556682 442084 339252
24679 339252 384752 612393 266810 92686 -49049 -267476 -26617 259301 582959 539998
24669 539998 331628 407006 527991 303239 -111955 -106252 -39843 89453 239513 123526
24659 123526 19833 55218 14829 -151702 -37531 -125885 17071 72816 70301 -60142 19656
24648 19656 292493 471155 170005 -290209 -284994 -299857 -13623 42050 220843 288861 300563
24637 300563 -35078 -271009 -486339 -773927 -972242 -690441 -164602 -28486 -134159 -96982
24627 -96982 -222049 -224358 530926 806425 1233089 1184633 638155 154311 -143574 -369940
24617 -369940 -241214 -10853 106096 62378 110227 303165 635619 617865 152192 -202520
24607 -202520 -115235 -297664 -356010 -495183 -685631 -647791 -602935 -604968 -493244 -441304 -138234
24596 -138234 223876 373982 341691 235212 100676 48910 263612 286146 77550 -166642
24586 -166642 -185706 -297847 -83731 37778 21411 -103696 -260398 -553412 -450153 -14323
24576 -14323 100212 28990 -65674 -91065 -164741 94738 231674 175304 21610 -48366 1276
24565 1276 98202 -110854 -271055 -86708 -249327 -92309 98654 251508 133689 -195909
24555 -195909 -271633 -161895 -388319 -447648 -570075 -416992 -305555 -477825 -576427 -437350
24545 -437350 232077 495144 599210 769989 453602 340584 258713 -98942 -228352 -276029
24535 -276029 -361400 -317222 48250 107976 -80382 -136300 82910 118603 -29010 -439464
24525 -439464 -631869 -397961 -36777 -172812 -10473 223997 220025 -206274 -214079 -101521
24515 -101521 -117805 -181089 -334212 -424206 -396127 -394194 -320597 -298494 28508 137677 74542
24504 74542 355353 410148 126245 -200174 -195714 150668 393289 266531 -77567 -468904
24494 -468904 -551449 -388796 -82068 94336 216838 438476 282519 56590 44140 -18305
24484 -18305 -131078 -272455 -540848 -562037 -451326 -284534 -295838 -52776 105197 123986
24474 123986 -35604 -132662 -197142 -88361 -18842 -171794 -315515 -322151 -177024 -234066 -222067
24463 -222067 159641 340267 98799 -36163 -14778 17762 357550 551368 170768 -336157
24453 -336157 -220604 -78410 36894 -9382 5015 377276 301938 68014 110215 271761
24443 271761 -76806 -617460 -494366 20618 235448 330541 390918 98302 -157273 -220439
24433 -220439 -269434 -346843 -193079 -184728 -343514 -357459 -306068 -109461 218106 335847 261216
24422 261216 111771 -190212 -431526 -111361 485462 880522 331372 -37449 -26112 -180938
24412 -180938 221720 480000 291282 -222792 -534498 -332258 33555 365412 289684 103736
24402 103736 -123497 271587 752760 413609 130238 335881 276825 -139885 -344051 -793052
24392 -793052 -277103 145191 -26446 -126762 121976 674752 516390 362804 -87487 -150658
24382 -150658 -44147 19918 -17481 56692 163222 159791 66240 -48622 136888 -27272 -69944
24371 -69944 -401055 -488507 -360163 -264775 -193799 -148640 171854 195511 199823 31288 73526
24360 73526 -121225 -144935 -175599 -242765 -139274 -306963 -325376 -236693 -286696 -532828 -423002
24349 -423002 -62574 291569 31023 -221054 -118059 -429761 -531421 -332348 -482037 -690403
24339 -690403 -854998 -215295 -28191 -303619 -282129 -79106 117940 -49544 -72354 124591
24329 124591 137812 127404 34706 174551 159133 -151064 -375742 -446352 -461214 -330551 -254954
24318 -254954 -437185 -545486 -600902 -737288 -410438 216991 157462 -222504 -433513 -537341
24308 -537341 -432407 -293359 -115676 -223662 -158583 -78539 242582 249080 -31452 -429421
24298 -429421 -712350 -617244 -749219 -815144 -671694 -550100 -474623 -445520 -796780 -635592
24288 -635592 -434794 -160357 -275246 -211377 20320 27970 -9230 -15529 -59455 -171325 -11911
24277 -11911 -225964 -679001 -725636 -557645 -747693 -573310 -274953 -348552 -286501 -91791
24267 -91791 -178418 -224999 -254243 -573767 -780694 -621510 -650329 -395949 -108056 48906
24257 48906 73552 151809 -56748 -31497 279829 386210 123401 -340956 -602518 -620995
24247 -620995 -734019 -752469 -501140 -496366 -623305 -517652 -237828 68129 37002 -252538
24237 -252538 -275842 -154668 -79709 192855 224357 -139244 -129932 -305184 -163386 98090
24227 98090 352440 367860 408977 477160 153487 -274118 -147230 -143937 -467913 -389388 -42312
24216 -42312 274323 -8294 -295693 -112244 168965 57092 -123056 -312169 -495488 -832705
24206 -832705 -666176 -570907 -343756 -275932 -157129 2157 174584 -44077 -204574 4707
24196 4707 -186363 -594029 -522165 -550327 -808533 -769613 -322716 -254553 -685798 -932248 -1178951
24185 -1178951 -933469 -474927 -127749 66683 -6161 -26631 11617 -186254 -452661 -515341
24175 -515341 -463035 -519481 -290650 -188406 -124205 -185633 46257 29461 94224 118688 46224
24164 46224 -317949 -712944 -434855 -399724 -169977 62245 28530 -24458 76922 81765 88902
24153 88902 256222 528186 335074 -273563 -342507 -189960 -316198 37110 356446 154084
24143 154084 135152 122439 -340156 -303933 -188264 -427313 -316239 -212349 -124326 -68333
24133 -68333 -36836 63531 7160 104425 77986 128502 -214615 -239857 -8928 25630 35622
24122 35622 -100454 78977 73334 -255564 -433605 -353303 -38940 8749 -373591 -550287
24112 -550287 -544249 -655177 -396193 -253421 -576136 -311853 256890 562204 400034 -3463
24102 -3463 -159424 -184870 -332109 -431618 -652564 -385693 84463 492620 366805 172622
24092 172622 -152816 168142 267184 113153 85816 -101661 -86897 -141350 -262138 -41047
24082 -41047 45621 23094 381766 277158 -82411 70445 -91295 -316074 -548628 -527870
24072 -527870 -552881 -278186 97776 290029 75891 2040 -262523 -177730 -115211 23648
24062 23648 -347657 -574103 -493525 -447199 -495937 -592817 -597801 -396489 -361679 -159605 -328112
24051 -328112 -347572 -270750 -545848 -255684 -219621 -390744 -387164 -99743 -47972 219031 308818
24040 308818 102922 -162397 115224 161639 -185865 -579744 -256889 133782 157485 63960
24030 63960 -145762 23644 124617 -193996 -354680 -386327 -240940 -78657 -66025 -68184
24020 -68184 9438 -16577 -145728 -41650 64928 -14596 -151495 -33510 135513 66165
24010 66165 262040 143304 145080 277754 258668 121779 -95762 20057 109521 393740
24000 393740 671388 343059 -13452 -240414 -552386 -446173 -28445 -247661 -194755 68447
23990 68447 57724 -61379 -231076 -286030 23777 296178 147616 130145 260461 -141553
23980 -141553 -226730 118227 281713 -123749 -559639 -506374 -387270 -281279 -225204 -73774
23970 -73774 -43382 27216 233241 63709 -21938 9340 79905 99109 21269 -402770 -469044
23959 -469044 -521112 -574922 -587432 -777515 -311588 186216 393774 469087 168680 -15506
23949 -15506 -146923 -171111 -167737 -217537 -380733 -329933 -455106 -446919 -158190 -18886 -220374
23938 -220374 -227309 -155690 198240 141203 85059 72600 -358843 -443554 -295531 -271164 -641763
23927 -641763 -509613 -387599 -319904 25168 -26177 -345543 -392100 6096 21071 42407
23917 42407 -240333 -503053 -570752 -634208 -655601 -465335 -176809 -66368 100004 278189
23907 278189 258713 -93057 -232172 -259263 -35027 216130 236951 96331 -21286 -24217
23897 -24217 248582 245607 449475 566006 232334 -297218 -441641 -353134 -167941 95804
23887 95804 250365 51719 -35413 -124784 -243903 -70732 -41801 112901 190429 -96372
23877 -96372 -362103 -671053 -657502 -466645 -317002 -98022 104040 430042 545279 297149
23867 297149 183544 25962 79441 350538 205688 118050 204611 8052 -165957 -416444
23857 -416444 -223388 49317 -140283 -269358 -235858 106541 -118935 -466042 -560439 -344481
23847 -344481 -497695 -407747 18139 343926 612481 790209 698206 533450 381102 240803
23837 240803 230671 313705 491938 435317 424669 639110 476371 399235 494936 551003 373534
23826 373534 153273 456692 643850 542557 269417 212130 295071 415594 466418 471636
23816 471636 303247 -112290 -60534 -333938 -331410 -136425 60689 94601 282952 152934
23806 152934 71847 -430441 -329400 -157545 -237004 59549 368654 175968 -84836 99775
23796 99775 28631 -110220 -271200 -544430 -581492 -169437 -25790 -236047 -310973 -64016
23786 -64016 122756 39474 108046 15360 -290772 -10058 -16143 5498 126232 227391 115118
23775 115118 -409839 -599694 -415596 -584440 -365669 -21838 -84367 -352602 -406891 -110096
23765 -110096 138155 343144 397331 281566 13318 -436494 -841374 -586463 -580962 -276851
23755 -276851 29052 253090 416870 103900 90568 113560 -178538 -110623 -292376 -453041
23745 -453041 -160417 -13799 92445 189023 -25790 -128275 -192936 -357937 -511598 -297717
23735 -297717 -202984 -431836 -479587 9226 -25984 -235554 -183881 -50411 59505 358761
23725 358761 723104 754170 289725 350071 570773 -110110 -284069 72508 406641 649709
23715 649709 479752 -3144 -173054 -276663 -483798 -68546 425287 350517 -56027 -49904
23705 -49904 301202 292943 -255386 -458065 -331418 -259828 -287896 -146791 -224577 -622545 -418996
23694 -418996 -287500 -452834 -364001 103457 173699 305699 148867 -327744 -379643 95881
23684 95881 322963 289054 208989 382760 246039 124357 377354 322149 368155 61879
23674 61879 -11833 -215213 -537075 -460056 276166 669763 713709 511767 299803 239776
23664 239776 265860 292609 -84121 -486745 -408948 -187720 -106106 -9750 58298 -125830 -290345
23653 -290345 -207736 -364457 -388029 -285219 -68071 -25840 125866 105031 56717 235788
23643 235788 46848 286263 387841 173165 -406468 -670183 -376138 -273468 -542689 -737789
23633 -737789 -608494 -711934 -692319 -445382 -279974 -132883 -77870 -28436 -392905 -269944
23623 -269944 -141453 -164002 -320688 -522910 -670814 -541917 -404225 -267470 -119 184829
23613 184829 294293 500890 407544 318462 190664 -9812 82728 331681 249684 295012
23603 295012 33805 -43648 73271 93845 246771 -74449 -217895 263215 366345 251956
23593 251956 -113554 -268166 -239243 -498041 -364871 -152060 12151 -432494 -659577 -554431
23583 -554431 -190279 239601 196649 -2424 16759 99170 101728 -5148 -350388 -501535
23573 -501535 -322303 -140123 225915 348002 -48185 -433413 -721376 -518322 -243178 60370
23563 60370 127067 -298187 -402578 -334926 54855 -69628 -85327 -374462 13473 443601
23553 443601 546578 501816 430415 293742 237998 249500 136858 -72966 -114361 -239552
23543 -239552 -547714 -239982 -278495 -763800 -946168 -635822 -232350 -116421 -140835 -96484
23533 -96484 194806 186175 16557 -140328 -142455 -358552 -288985 -395673 -563231 -577414 -252103
23522 -252103 -114972 94887 132766 -117716 -172874 6097 213590 206592 -63239 -161580
23512 -161580 8868 -95707 -458862 -362434 -249966 -52460 -86246 -478716 -556858 -762176
23502 -762176 -465231 -84014 287762 242965 -116150 -315034 -281884 -190969 19854 -67004
23492 -67004 -271719 -382904 -294982 265882 388546 353896 359934 292825 758903 323989 28116
23481 28116 -280419 -366468 -409715 -267641 20373 -170044 -281131 -172468 -266092 -97116
23471 -97116 -75633 -72468 105453 212243 -289503 -172211 300236 90040 -416940 -798560
23461 -798560 -576913 -639448 -830613 -920022 -596784 -317547 2934 158010 149030 -26809
23451 -26809 -61938 -299245 -664493 -430517 -482605 -481956 -656330 -627188 -719160 -618873 -186018
23440 -186018 196372 96651 -211002 -98429 -250878 -261592 -121837 -30837 -270016 -230119
23430 -230119 -245953 -88713 -233875 -380228 -261899 -393468 -443646 -184970 267711 57561
23420 57561 -265819 -416339 -492145 -481782 -182461 -216302 -40723 145953 97366 -124260
23410 -124260 110619 55091 -171512 -118936 -159446 -338061 -205126 -341354 -443128 -710181
23400 -710181 -685395 -404174 34694 154674 -159715 -254777 -337173 -196120 -150628 -246087
23390 -246087 -369162 -302125 37235 425888 320359 135687 -173257 -119903 348651 110398
23380 110398 -196514 -547248 -732940 -411235 -280565 -206944 -296633 -243786 33349 144255
23370 144255 -51366 -347872 -396349 -278204 -464424 -273350 -177723 -126415 167139 371927
23360 371927 592134 751511 852650 764020 781145 787547 398633 548857 700380 341742
23350 341742 66194 -66975 -144215 -97123 81688 116470 -109044 -254324 -379964 -446784
23340 -446784 -55934 184238 242590 -108859 -154727 41049 120111 326129 491442 441311
23330 441311 57153 52256 170973 157232 149041 -106177 -372542 -398766 -545472 -260759 116475
23319 116475 -66841 24611 -56172 -477291 -77013 337759 391967 480599 369875 230051
23309 230051 -237804 -541277 -549309 -524377 -294262 14207 170029 63183 90126 -4536
23299 -4536 -184921 -35334 -56150 -111194 -238884 -409429 -189094 -392035 -364021 -254079
23289 -254079 -347752 -308471 -46770 -22211 56278 49738 80545 -234071 -250977 -43384 25844
23278 25844 189339 -118469 -7328 -115473 -185538 -33063 -219367 -518686 -911804 -711788
23268 -711788 -515487 -480385 -468264 -397821 -488350 -476910 -307101 -102616 52764 170968
23258 170968 110565 -158409 -204221 -154656 -145754 -393189 -453889 -490001 -321517 -319124 -754933
23247 -754933 -932605 -724490 -456975 -637518 -701840 -474603 -386997 -410179 -306553 -394658
23237 -394658 -220298 -122173 -53373 -231794 -28915 47017 -208826 -207468 -288495 -349017 -64770
23226 -64770 -265539 -170514 -36497 26127 -214018 -301973 -265635 -221893 -161277 -142635 -13523
23215 -13523 90169 -243460 -59941 164022 185310 116432 107545 20476 75546 226499 500313
23204 500313 452594 378188 371165 455822 395176 215055 -132094 -152929 -114981 -523375 -542104
23193 -542104 -244201 232522 412728 286905 79964 115888 194338 -7565 301686 162679
23183 162679 -57428 121815 148899 -127995 -481994 -688249 -162965 290698 182261 146521
23173 146521 78508 155946 -17318 68295 -185546 -338045 -293162 -76607 -26648 244451
23163 244451 231758 266114 238392 -52645 -203143 57109 283828 188822 -123773 -312618
23153 -312618 -370485 -446368 -592086 -767578 -709376 -581374 -362849 -145043 -169210 79606
23143 79606 -22322 -233623 -82727 47245 -66831 -255833 -220605 -33330 80795 171903
23133 171903 431593 114987 -301351 -560255 -496661 -141339 58754 34463 53528 183124
23123 183124 22169 -232998 -122751 158988 151815 -78029 -204882 -209805 -231008 -151075 -74239
23112 -74239 -6998 7935 -18404 -38271 -127343 -544058 -541350 -658364 -544765 -564061 -577218
23101 -577218 -478137 -318073 -283411 -331418 -289370 -86721 -180082 -254175 -308273 -287179 -506732
23090 -506732 -826338 -654437 -459747 -567939 -173071 -36868 -117068 -198542 -216490 -143852
23080 -143852 -434182 -848857 -928223 -818678 -669663 -746238 -826372 -782501 -849425 -803654 -867734
23069 -867734 -739783 -537269 -318847 -168282 -174445 -416982 -723725 -757853 -722859 -476002
23059 -476002 -140155 -127784 -27245 55645 -13759 5561 42221 -17975 -59789 -69981 -218352
23048 -218352 -329181 -237278 -40819 104592 -574805 -754938 -718722 -762279 -937608 -1249072
23038 -1249072 -1020307 -655829 -167498 -118462 -86452 53518 135421 177724 -170062 -235203
23028 -235203 35892 456569 466173 651991 618534 597189 426404 63264 63087 180613 278255
23017 278255 521738 572265 412206 434900 466547 143420 216380 162533 -180345 -323573
23007 -323573 -277703 -570687 -268033 -52573 -54353 88745 172691 297517 568090 465936
22997 465936 199350 57628 153301 267692 33150 -225886 -195381 -60347 254536 205461
22987 205461 6528 99334 528639 578941 418852 147935 263336 262287 202130 258224 112562
22976 112562 46951 15450 197656 476858 296287 88343 292216 329023 551673 420992
22966 420992 332690 314212 309709 100256 371538 258125 170239 261969 231770 137611 -133536
22955 -133536 -585574 -472073 -338388 -374562 -116183 121956 -81230 -279979 -273834 -17126
22945 -17126 -40266 -200075 -459405 -434763 -168841 -112471 -257701 -42604 -232043 -300899
22935 -300899 -86846 150856 487018 195819 -380945 -524991 -401246 -357882 -637814 -415990
22925 -415990 -390776 -178769 39559 29573 -99379 -268213 -329508 -383001 -388494 -512964 -417666
22914 -417666 -455999 -327562 -33663 240945 392193 53930 -190309 -6085 -312746 -231502
22904 -231502 196117 160655 196622 -65971 -465625 -714393 -741367 -675895 -595706 -234201
22894 -234201 -300915 -289836 148701 126042 232932 -32293 -289348 -289747 53126 80672 -156321
22883 -156321 -127338 -301079 -440831 -685429 -721593 -575766 -471592 -485859 -462085 -253414
22873 -253414 -455049 -298127 -193921 -159903 -74517 -20670 38766 -61161 61516 -24529 -371883
22862 -371883 -669789 -465276 -484121 -339908 -309698 -348350 -268155 -329322 -212261 -4337
22852 -4337 186726 358224 523506 631151 593101 367163 17125 -377295 -533626 -377113
22842 -377113 -192952 -158569 100997 -143804 -180488 -277296 -301102 -52664 -139474 -260020
22832 -260020 9844 479155 337688 -21210 93 -128979 -562202 -566636 -336734 -221247
22822 -221247 -192453 172645 -19174 -254916 -381032 -302918 -273200 -64171 172314 279973
22812 279973 227248 -182017 -267241 -398986 -415335 -74925 291597 530931 435324 173093
22802 173093 -218603 -471502 -252287 -45126 133870 116600 -22872 57587 -139032 -291285
22792 -291285 102678 481337 159209 -89887 -146036 -36238 -9420 63660 -1885 -136562
22782 -136562 69852 397003 188299 99329 171197 252762 12287 -162831 -348998 -334247
22772 -334247 -394524 -463518 -224158 -69145 -38558 -69797 -140715 -402037 -562129 -426681
22762 -426681 -531532 -669682 -650689 27292 171094 -256617 -182249 -251606 -330485 -384241
22752 -384241 -177707 -6986 -143682 -284515 -165071 21807 66060 -171818 38212 63594
22742 63594 -80872 260771 181998 188050 -41966 -86899 -249651 -313227 -451590 -719631 -585374
22731 -585374 -288729 -36207 -14205 -10599 127849 352028 391298 598034 390553 387757 212444
22720 212444 175395 -110094 -265192 -197389 22128 -92317 -39342 70850 291235 291346 138833
22709 138833 107927 310008 111776 80219 557541 614619 636858 501958 71694 -275708
22699 -275708 -274061 -58424 -396469 -763241 -938586 -769448 -376173 -217221 -332033 -189143
22689 -189143 -109908 -234023 134050 339215 445597 194467 36363 161107 271870 349087
22679 349087 -124428 -537555 -744581 -630720 -328422 -181766 -357396 -291405 -205282 -180602
22669 -180602 59557 117661 73928 112878 117063 -188894 -154146 -79030 120796 159925 -14747
22658 -14747 -79229 -270243 32906 202682 -64487 -340148 -112785 -68960 -185948 -172037
22648 -172037 -23506 289573 360209 391555 239044 259605 235835 350125 275085 30133
22638 30133 -328379 -578697 -911035 -836553 -224512 -120683 -332297 -193987 -227902 85204
22628 85204 -71547 -327144 -223758 17606 -212364 -301256 -92885 -120776 150338 28048
22618 28048 -340173 -225348 -4915 -76873 -73793 -130112 161088 387798 424152 536585 703335
22607 703335 806245 561829 692955 488266 182598 -349204 -590786 -257747 -74137 -130664
22597 -130664 -488099 -539318 -289654 -279118 -216442 -132287 -323195 -395981 -627731 -805697
22587 -805697 -614890 -291690 -318275 -709173 -901624 -538730 -113972 -384850 -247855 -227255
22577 -227255 -358096 -435633 -42324 385271 285675 179446 98185 282566 617293 717005
22567 717005 118378 -129708 -62840 -276390 -291940 -69782 39954 56388 311042 269493
22557 269493 45867 -153272 -50618 513005 758644 562396 353401 188591 260337 584373
22547 584373 581495 325133 125085 345252 494488 126649 -25362 269332 302442 -205964
22537 -205964 -221748 -56341 41706 148815 -40069 -158988 -291447 -94762 177818 331407
22527 331407 284894 -172109 -456710 -534465 -537202 -335459 -248423 -57984 89541 352883
22517 352883 663812 690112 309472 362594 409596 330915 19695 -76732 -39183 -15652 160338
22506 160338 559693 550675 453085 238855 61515 184020 464924 651530 867376 873638
22496 873638 602957 103125 -172693 -169058 -135974 -234967 -413305 -275036 -109012 -359402
22486 -359402 -425008 -620565 -825231 -732045 -352608 -160707 -105399 -120052 -89797 -113212 -51589
22475 -51589 -45755 -347784 -533012 -532245 -612739 -943742 -993000 -905777 -820078 -467107 -263823
22464 -263823 -329783 -6924 139498 32156 -196425 -302726 -61075 66165 -242402 -518501
22454 -518501 -582852 -542916 -421456 -120381 225252 473348 534243 400905 317725 40904
22444 40904 -307092 -343079 -81969 -151765 -299293 -380821 -288976 -13561 74396 447552 282796
22433 282796 -241541 -34181 95728 103885 -133931 -374787 178347 507428 340553 567029
22423 567029 655864 799216 559149 550795 391950 698693 513350 -23918 -274026 -186133
22413 -186133 -349351 -683831 -751154 -450842 -294712 -19756 -9980 -185505 88273 128467
22403 128467 -244142 -343094 -191310 -180930 -349868 -340473 -481804 -511665 -325674 -77431
22393 -77431 -250189 -78251 -136309 -62028 -119629 -220955 -98450 -232399 -803706 -778091
22383 -778091 -570365 -246934 -275585 -74436 50967 112617 91824 -108548 -131861 157193
22373 157193 252725 418866 472932 566329 677613 701111 553983 300711 -10016 -243721
22363 -243721 -294996 -128613 -158218 -210741 54243 117236 -26670 -234106 -449013 -333304
22353 -333304 -184791 -98783 9957 -162196 -440931 -451365 -324789 -179925 -222495 -226577
22343 -226577 -151131 -108119 -135556 -23791 110219 82140 215576 37758 -2886 126321
22333 126321 -119722 -125585 -4180 -259914 -348491 -392834 -404152 -328240 -41526 255951 21751
22322 21751 -274725 -207291 182291 188183 459423 467585 148640 256269 349680 356050 190131
22311 190131 168428 235341 129003 163518 419663 352793 161765 -175893 -20591 -257950
22301 -257950 -534177 -545159 -314428 -7541 195933 196560 115382 146723 80611 93638 14037
22290 14037 97249 272761 411512 321447 64340 113039 -169992 -630920 -1081869 -1013760
22280 -1013760 -886110 -692837 -693355 -612046 -524816 -494047 -547749 -169305 141953 188425 126211
22269 126211 150947 180639 -94716 -337412 -419929 -524998 -571777 -315325 -509178 -720759
22259 -720759 -995988 -1040284 -704327 -783729 -660776 -304328 -110699 128762 130121 64867
22249 64867 69110 -84842 497 50794 -173244 -458073 -435422 -90086 39942 30393 -345411
22238 -345411 -216668 -177220 -241162 -720939 -894057 -901562 -1062274 -1159600 -1004511 -580501
22228 -580501 -144962 -345860 -514765 -348039 49246 271648 -111787 -365316 -380493 -208710
22218 -208710 -43581 222806 142509 -104024 -256737 -648865 -528370 -247876 -271709 54112
22208 54112 159938 564516 393541 187230 -125910 -464728 -165485 -6939 -346822 -552748
22198 -552748 -352559 -100680 -255637 -595034 -364055 -62284 34468 -100770 -381642 -445768
22188 -445768 -549517 -227596 -227054 -430181 -147609 -176541 -358648 -545105 -483543 -62561
22178 -62561 5397 -94081 -158106 46104 -163897 -382101 -16734 295296 362933 289437 57348
22167 57348 -56451 -29384 -20211 -189285 -143187 -75704 -32681 -253729 -106708 -2788 -72150
22156 -72150 -463449 -304828 159369 -309155 -795979 -650167 -83363 4227 -65829 -225900
22146 -225900 -100158 -32585 -293740 -438281 -390810 -103517 58771 -15907 -101141 -66441
22136 -66441 -201945 -316051 -121042 -111828 28808 120585 111810 208013 102360 96623 306444
22125 306444 211602 -194241 -273849 -307647 -269252 -448606 -590456 -511197 -244522 -353216
22115 -353216 -713088 -713380 -1168762 -1216186 -644739 -366238 -561298 -551397 -320366 -287532 -247878
22104 -247878 -101958 105408 239327 74662 14481 -288924 -115839 140115 124089 -134230
22094 -134230 -33695 310341 395973 178792 -188057 -397138 -409493 -340137 -331887 -207496
22084 -207496 -222043 -529832 -347116 76860 187861 228907 52579 88340 -12835 -569727
22074 -569727 -1044725 -817702 -450821 -325221 -676323 -971653 -661727 -453989 -147880 -3996
22064 -3996 8674 -71109 -183523 -305157 -364264 -352390 -634347 -724135 -619267 -416710 -203673
22053 -203673 -156565 -443858 -503827 -174766 -55031 -76795 -356255 -254907 10412 122581
22043 122581 43131 -217577 23606 124457 16787 10682 -66345 -652036 -619928 -255724
22033 -255724 18495 -148728 -284588 -245493 -96205 -172178 -370732 -509695 -136791 -9962
22023 -9962 330481 459606 160199 -155366 -354512 16197 121426 277417 261772 136279
22013 136279 37562 -49311 204761 390465 447459 590583 682085 272722 209802 240057 171634
22002 171634 -239778 -414076 -97827 -123701 -243655 91014 246996 56082 -252539 -342915
21992 -342915 -107490 -165707 -403959 -522120 -832435 -471955 -172677 66927 -150708 -337778
21982 -337778 -421482 -475056 -269141 -197906 -339632 -358538 157557 -89036 -264787 22365
21972 22365 -53076 -51006 153312 389116 276666 355673 -31571 -245822 -151931 117933 266415
21961 266415 185869 -32807 243539 533802 620804 643382 576068 218691 298772 175736
21951 175736 72292 357084 209847 130398 412976 245905 83738 235920 57690 -59492
21941 -59492 -118330 47021 68806 160083 239602 89705 98939 136700 -41797 205913 257674
21930 257674 83373 340187 177352 -249555 -523500 -402933 -357895 -282065 198151 389486
21920 389486 294541 168785 196379 68511 -17232 -208078 -55889 141736 -323855 -584100
21910 -584100 -343362 -123911 -51317 -6085 -406621 -422394 -184086 88789 101679 -269343
21900 -269343 -268771 -51831 105431 101573 284389 264515 63045 -308767 -352208 -21935 246940
21889 246940 227680 -106688 -275622 -461664 -258137 -248554 -151591 -63222 -311766 -556239
21879 -556239 -536027 -307974 41508 212581 285701 102677 -230327 -351254 -266912 -144186
21869 -144186 -138468 -161653 -201898 87145 408666 209900 -297512 -822681 -780640 -821987 -854644
21858 -854644 -453046 -290949 -211050 -153101 -153368 -636784 -774185 -860597 -931789 -1166841 -649790
21847 -649790 -131017 -99175 -261924 -242505 -62646 84291 119331 121487 216603 345180 369204
21836 369204 308638 -97746 -27247 169889 75191 204742 129563 65672 -158643 14571
21826 14571 362518 451508 251719 371741 399251 266603 386794 344928 562127 578872
21816 578872 437607 516835 619081 525700 473953 621161 244214 207654 -161029 -231930
21806 -231930 -148372 -150230 -218958 -346369 -473913 -218399 -218366 -403491 -527531 -176422 223074
21795 223074 97290 -63480 -19103 201280 407731 413893 105054 -310454 -66421 84951
21785 84951 -293192 -152736 -338188 -354400 -414659 -90181 101752 207102 610140 354749
21775 354749 150424 132231 -205455 -370888 -113085 184402 -50579 -41118 189663 -51285
21765 -51285 91318 3245 -186955 7994 118959 -25077 -99205 -146070 204265 258764
21755 258764 162853 -167138 -365326 -109232 193433 275814 255729 -92096 -117569 75267
21745 75267 281993 43406 -110276 -80910 -41823 -163956 231587 49605 -150627 -181899
21735 -181899 -193031 -262724 -313034 -112050 -26126 -37573 57530 -44128 -136388 -24149 -102403
21724 -102403 61878 -181575 -527237 -463004 -187293 -232156 -236302 -56955 -161043 -20652
21714 -20652 57792 153718 154696 261908 186809 -6486 18698 -18560 -105481 -248868 -189930
21703 -189930 -222008 -321305 -256311 -36198 -127383 303661 719059 522640 67811 194954
21693 194954 214669 343511 281412 194459 118870 -263403 -652478 -442140 93674 177064
21683 177064 33808 25832 49673 17298 35299 -123989 -122213 12327 -220006 -321262 -521137
21672 -521137 -530409 -95705 -308876 -463825 -388066 -246876 -194530 -281695 -362571 -457282 -454002
21661 -454002 -418969 -385588 -479998 -284021 -386553 -94881 140351 73963 -69363 -73621 -343646
21650 -343646 -470324 -532897 -725707 -623669 -404271 -491612 -488923 -259722 -163140 -56064
21640 -56064 -484 -60053 -39553 -124356 12071 71243 14117 -91812 18723 24974 375105
21629 375105 288447 -152371 -299303 -261198 -551140 -657845 -660583 -460131 -300916 -132848
21619 -132848 22059 -48859 -67470 -76267 191027 73076 -223110 -23917 267303 246978
21609 246978 42994 -146236 -55646 62332 184151 88168 -25505 -15223 -68497 -23434
21599 -23434 -261155 -97689 -205195 -546099 -541450 -345225 -336585 -413710 -245024 387610 456165
21588 456165 408810 358541 552803 716056 418079 74825 33100 144021 45038 -169536
21578 -169536 27083 236483 -206460 -411103 -218346 -115415 46994 63697 184796 358919
21568 358919 341619 219740 58699 53784 214803 521696 289243 88224 75762 91527
21558 91527 -113156 -209618 180085 345712 231085 343482 569702 362792 370053 412859
21548 412859 283561 444952 315416 228876 141459 259878 296968 84353 -49481 -94778
21538 -94778 83688 424917 323565 292192 343305 202080 185999 183678 63863 7934 -209736
21527 -209736 -446131 -266867 213473 488812 -51437 -447286 -163166 143226 365793 200479
21517 200479 299158 256927 196865 566958 653077 579744 348339 164890 -93333 -321165
21507 -321165 -241779 88688 6713 -286863 -216645 -144248 -185352 -30667 22547 -227514 -310524
21496 -310524 -84051 151280 56504 152139 -131016 -309735 -469685 -587607 -192314 -141169
21486 -141169 -498112 -837955 -663131 -336773 -29630 273618 156073 -360022 -240397 -348210
21476 -348210 -553252 -562217 -157213 29732 30319 -3076 -162201 -379196 -352863 -481554 -318212
21465 -318212 -279108 -114225 42522 177066 48174 -151776 -351707 -353712 -281642 -141898
21455 -141898 -40168 -81188 -65734 113296 342456 476354 248015 205405 213200 114512 -271852
21444 -271852 -346369 -629439 -822258 -933345 -710557 -644752 -394570 -52612 25331 214764
21434 214764 302951 230867 351813 99560 42652 263666 263192 100950 6878 -336621 -498178
21423 -498178 -317332 -206547 -403666 -483064 -374273 -169784 -56171 -349665 -709235 -926007
21413 -926007 -929432 -565557 -681964 -353322 -294020 -340087 -92512 -255749 -137924 -199597
21403 -199597 -418290 -189498 -80240 -341419 -347254 -30624 -99698 7569 -108555 62355
21393 62355 301740 154709 -15372 127948 53782 53020 131398 139582 266315 11785 -199990
21382 -199990 -246349 -111284 -170241 -62391 -6518 -339758 -894845 -1012523 -998146 -910138
21372 -910138 -631271 -510372 -636805 -688489 -459785 -344608 -389482 -432220 -302940 -218155
21362 -218155 -175466 -315808 -272275 -253891 -125941 125110 287963 408738 -55410 -275990
21352 -275990 -156374 -131831 -166557 -43134 -228273 -122774 211543 199739 -121303 -193244
21342 -193244 -90260 143705 52934 -67106 -252189 -497050 -444566 -254743 137811 122235
21332 122235 -197445 -391362 -447603 -438498 -135744 -54963 -218744 -378814 -415095 -333215 -337990
21321 -337990 -202171 -118509 -2189 306898 468225 447144 343760 117463 127149 -35734
21311 -35734 -131136 95503 44322 129530 -176247 -218405 -14160 -77516 -142729 -34092 307978
21300 307978 418073 386286 354589 106999 29082 31156 -218321 -154042 -69804 167436 467836
21289 467836 724747 928132 731357 472812 583710 1033538 832961 446366 325886 100701
21279 100701 -279824 -282741 -34997 36051 206855 202054 -186180 -85156 -30835 37516 118951
21268 118951 6350 -7103 38825 -3656 130674 121721 38905 -221067 -269820 13777 190259
21257 190259 235824 116427 -69333 111909 474602 618939 544048 252960 311869 282444
21247 282444 194189 161578 -20765 202153 424076 487328 464713 447488 610495 559142 656866
21236 656866 284239 -88074 -285761 109511 138556 -269696 -416287 -259814 -181154 -139004
21226 -139004 -108426 170889 275530 -99805 -483419 -482329 -308807 -82825 277572 420323
21216 420323 -57131 -484015 -229178 -112086 165489 60636 38819 181014 182704 -13368
21206 -13368 61536 16271 -83890 -248315 -174470 96653 -31973 97920 225647 40896
21196 40896 117574 277801 75165 -77769 -307142 -173620 206954 211568 99641 222326
21186 222326 262728 5575 -164360 406879 745595 344820 56632 -181410 -288959 -280219
21176 -280219 -141555 -173674 -140591 -116769 -346497 -329921 -277167 -229555 -212981 -141636 -78869
21165 -78869 179361 157199 -307602 -443762 -355880 -324596 -232312 -137261 82585 180215 76603
21154 76603 -30031 -68874 -189174 -337772 -6737 -70771 -480087 -572265 -225870 72077
21144 72077 -29343 -202434 92947 236175 110710 354809 405860 37716 -347252 -426824
21134 -426824 -507979 -284852 -59222 90153 474053 719839 549115 521102 296781 335541
21124 335541 452239 496175 318540 46081 -369740 -356873 -258559 -39791 154758 229331
21114 229331 -93640 -697357 -662647 -123262 149166 -119800 -187563 82024 -136888 -318995
21104 -318995 -36264 233019 136088 -650 -83075 -207689 -311679 -277177 -277527 -295976 -258705
21093 -258705 -257183 -232653 266956 658022 473591 582646 468000 112320 67811 -125761
21083 -125761 -19040 68884 -67262 -92266 -97058 -117863 20871 185243 77324 -283012
21073 -283012 -244678 -128940 -96875 -35101 -99260 383990 465768 621182 254125 -121150
21063 -121150 -315245 -32654 37662 -219079 -64421 18475 -122244 204566 405313 203610
21053 203610 12281 -108769 20065 -92675 -179617 -202016 -46008 487724 439224 208188
21043 208188 -150557 -535572 -444331 -542468 -302898 42055 80912 98716 328345 203668
21033 203668 73104 210321 470264 422456 434772 159816 52665 226947 47111 3549
21023 3549 -9910 -16397 157397 236754 365846 299013 375669 635495 799901 868718 872601
21012 872601 710841 731134 707654 818722 1191601 1744153 2006206 1976029 1796260 1867755
21002 1867755 1624113 1448035 1426466 1382999 944418 667794 341678 209197 -4812 76142
20992 76142 227211 394073 265385 327648 536633 467083 475726 395655 93265 -45594 70169
20981 70169 350943 614509 382999 -22170 -212426 -507792 -284512 117120 112296 -205079
20971 -205079 -509614 -511053 -223127 156866 121968 -224980 -389912 -57764 214245 130201
20961 130201 -135458 16676 243308 -86464 -554980 -458101 -356039 -187347 -39527 179787
20951 179787 345516 244462 236306 125025 36279 216573 281283 8544 -183353 -321919
20941 -321919 -6432 214546 50742 -15357 186604 11161 92153 131449 4764 -57158
20931 -57158 -29977 246678 387755 520832 451617 507936 468960 475839 79329 -34115 190499
20920 190499 609528 860566 611375 138046 -269941 -231325 -114856 -227763 -499058 -569712
20910 -569712 -528301 -233246 -176600 -104034 90058 483653 740370 293734 23135 -136136
20900 -136136 -432640 -567420 -407378 123562 397921 604509 817660 738160 486233 166714
20890 166714 199034 316597 450596 370407 159650 -7940 95635 200028 152150 30461
20880 30461 -246823 34179 351190 462759 532276 269276 94543 149151 183589 253866
20870 253866 137417 189381 321372 482898 327939 21093 -11828 28945 93088 79935
20860 79935 22291 334039 37982 -208186 -59907 -123129 -85570 -65072 -51820 -37164 -75602
20849 -75602 177462 -12135 259402 659451 501551 374734 542490 319302 -81493 -364694
20839 -364694 -242963 -247955 -67402 234961 236094 180739 225653 203417 -12244 202406 133886
20828 133886 356285 457174 31833 96835 490615 400168 -1145 -425547 -437377 20497
20818 20497 336019 -71277 -102922 121435 54982 -94465 -183532 -78645 154924 69695
20808 69695 278816 -33866 -165632 170505 378300 497453 610749 537910 215503 223810
20798 223810 181265 216808 157428 -62349 161274 258428 14872 -408506 -600954 -632134
20788 -632134 -291339 52228 284485 564554 506747 229801 153945 35845 295249 405126
20778 405126 211538 458182 643414 20565 -371870 -318919 -342153 -270109 -349878 -124783
20768 -124783 -25074 -330111 -364251 -218400 180956 269056 74009 507267 691280 534013
20758 534013 86315 63670 149682 -120624 -242926 -269940 -318753 268690 40975 115808
20748 115808 106457 156847 374016 518357 152585 -78704 -101938 180454 169425 117298 204550
20737 204550 298083 347992 303187 483558 395394 199885 379662 -40781 -236529 -103511
20727 -103511 122634 106766 271484 364751 -215808 -371262 -5577 486011 385128 -60049
20717 -60049 -44659 141357 82547 57219 -31630 -274589 -341569 -122518 -193393 -157968 -300107
20706 -300107 -320198 976 289081 473326 160822 -143188 -54541 56302 152018 411209
20696 411209 453456 -47708 -363020 -448986 -200619 113739 135495 206447 230501 315737 363591
20685 363591 147603 27108 285744 216334 -27249 -115870 -24067 13818 12595 235 -62979
20674 -62979 -215779 -639397 -568150 -88141 40014 -3307 158343 114422 -4629 69884
20664 69884 402350 308923 182295 175787 188739 -80024 -251180 -40792 36814 119055 178629
20653 178629 171773 277167 295083 -51594 -50739 307787 91465 -28374 114988 134461 -61484
20642 -61484 176250 270559 245248 415828 286282 102250 -28207 -143521 50871 21108
20632 21108 95021 -68330 -69842 38748 436702 254491 63614 97269 -118404 -253604
20622 -253604 -172805 87156 115137 258385 399811 145433 312487 412253 73326 148169
20612 148169 186745 3888 55604 31496 -119795 58283 402662 132329 26907 271733
20602 271733 527322 513383 434836 592352 401251 86853 74559 308235 253998 86398
20592 86398 -75059 12607 316584 121894 232317 301306 217190 130766 152894 425444 604904
20581 604904 297181 313168 411379 125447 -349224 -386948 -278875 3532 -124292 -87331
20571 -87331 10153 71645 71920 152008 42774 326602 706752 649235 572378 596359 575112
20560 575112 313434 228379 635892 457726 272186 294854 113679 175034 -58272 72868
20550 72868 405637 466090 583400 823970 1232609 1273878 1073310 653958 529826 186597
20540 186597 -101921 418353 646375 654560 1141846 1633264 1628835 1612997 1737364 1447406
20530 1447406 1171012 1465193 1946022 2046955 1799476 1718350 1349847 1305591 961647 635313
20520 635313 348808 4862 165784 571876 758149 935637 688500 704549 540748 555749
20510 555749 902424 1025721 1104465 1055385 969391 983965 713616 583476 623123 628169 328636
20499 328636 433499 343072 306212 382862 535029 570094 621873 335985 476481 358594
20489 358594 339336 322329 169275 245801 284276 208557 273927 288216 -93280 180741 719338
20478 719338 838174 761916 741639 1092543 1106356 769474 625471 427337 506587 609924
20468 609924 809166 998205 618364 361939 418798 696898 517793 290722 611972 897672
20458 897672 619337 399934 576618 638622 545899 447756 784362 974088 1094714 1099699
20448 1099699 1150766 1076270 954718 1104773 1712391 2004221 1872703 2009493 2049212 1677240
20438 1677240 1762698 1995291 2048734 2126155 2361448 2435333 2481923 2641220 3040148 3593813
20428 3593813 3755605 3752769 4059073 4587346 4827771 5150125 5841074 6530176 7168983 8147171
20418 8147171 9268068 10298883 11200430 12593975 13762469 14975465 15987653 17323995
20410 17323995 19501776 22026667 25121298 28927357 33737547 38515634 43846566 50545827
20402 50545827 58465915 68319314 80790627 97385256 120130079 152274226 197887583
20395 197887583 262638910 345142813 414635633 441199581 448406924 450430135 456617317
20388 456617317 424550390 303315887 195068673 136045819 102796712 82433335 68548545
20381 68548545 58995522 52535419 47375074 43310489 40228590 37340708 35160628 33319119
20373 33319119 31719747 30188002 28579996 27097820 25596279 24557667 23936875 23376731
20365 23376731 22774562 22251357 21589003 20467970 19228392 17971907 16750487 15802633 15042513
20356 15042513 14625373 14354426 14083371 13780613 13433999 13247320 12751253 12361658 12255212
20347 12255212 12223248 12361205 12185255 11724471 11710304 11622746 11497670 11500306 11516164 11222968
20337 11222968 11134745 10636960 10456112 10474070 10393720 10348257 10194779 9767242 9620069 9558204
20327 9558204 9789431 9882860 9966871 9505063 9260958 9129103 9093716 9426426 9657908 9931631
20317 9931631 10424083 10601817 10692415 10713559 11001198 11067068 10811696 10374653 10121349 9717653
20307 9717653 9008502 8715281 8822189 8557759 7905278 7402496 7539072 7566593 7315101 7029230
20297 7029230 6648244 6256091 5713513 5285727 5178736 5347707 5279579 5168151 5342613 5401785
20287 5401785 5494241 5454275 5002198 4639156 4649273 4537394 4228021 4250498 4099630 3811836
20277 3811836 3682840 3381955 3423353 3618664 3562653 3277802 3637054 3651507 3530969 3429495
20267 3429495 3278284 3359255 3334586 2983479 2914613 2471529 2320805 2426600 2275887 2281310
20257 2281310 2466627 2001546 1807776 1534890 1570349 1750612 1934452 1497500 1131139 1229228
20247 1229228 1203025 1013875 1143132 1117833 1408366 1481837 1272764 920924 890124 816199
20237 816199 578331 123155 87581 347407 195901 -55248 68072 349030 240824 178095
20227 178095 219098 127553 151994 168416 443715 702455 437448 438460 573827 358085 383326
20216 383326 656679 583120 239427 159759 298034 197994 -3724 -92686 354337 485782
20206 485782 731915 555126 467849 775857 780728 219257 312082 680174 881558 789834
20196 789834 585474 622083 687337 999925 1209856 1501879 1454339 985784 970441 1328479
20186 1328479 1500090 1252599 1023038 561519 599467 501499 440956 367350 335537 361496
20176 361496 623994 971066 1089479 848282 547591 467736 525876 467383 554383 350649
20166 350649 60228 108711 569520 592798 532715 752516 772706 839952 806857 973915 1194174
20155 1194174 891577 874190 916860 853344 1149386 1366934 1184652 923676 1013615 1203100
20145 1203100 1282974 1113641 755622 461824 488300 695349 643079 586381 458326 143922
20135 143922 -111935 2044 119015 504314 592564 494663 525625 636232 909899 445216
20125 445216 465112 769925 821099 530855 551280 479784 363950 387338 240809 358729
20115 358729 -42176 -313 554694 625299 523512 410682 139839 229272 216637 258062
20105 258062 67335 202397 720280 766117 486119 605126 434721 588050 343384 -111762
20095 -111762 -240619 -58996 372761 404763 502854 670849 553465 605329 619570 618781 482755
20084 482755 368900 402456 305913 203547 -76876 -390375 -616747 -708034 -593043 -522143
20074 -522143 -557892 -416676 -107537 -140506 -178703 -14942 293704 264417 -137072 -514116
20064 -514116 -399544 -382324 -260772 142852 169205 -63265 93106 371234 268543 134071
20054 134071 357532 391360 429787 496811 524358 585892 798626 598032 784809 827873 593064
20043 593064 360540 273860 297206 335640 320690 282410 487626 1051825 1039414 901382 733465
20032 733465 618128 781301 928695 709850 701800 754916 724558 600532 575111 671877 682569
20021 682569 493065 414683 401326 167311 393790 250028 185086 302238 451277 469036
20011 469036 675109 588308 335939 267264 186470 75618 331558 615668 540786 259922
20001 259922 450595 387007 544733 553052 481203 651757 1105814 1212850 1243357 1217894 1021192
19990 1021192 901311 963528 816713 779193 575344 678362 1282926 1454549 1250048 1582213
19980 1582213 1663205 1435268 1177096 1183133 1473184 1300531 1000488 719342 591520 502976
19970 502976 362112 565403 495891 620516 733999 864156 792534 975277 898452 604960
19960 604960 659536 217731 56671 260260 312239 314317 460769 325249 328108 396880 268810
19949 268810 189581 36749 -176998 -245374 43009 178776 -154127 -393926 -411768 -430113
19939 -430113 -274381 98751 117471 220333 324663 341788 405713 679883 368938 -107026
19929 -107026 -87336 75241 345485 453729 451488 488586 303267 262690 333092 233888 302007
19918 302007 422481 230518 -55108 -309794 -215428 -266482 -273761 -202073 27069 154468
19908 154468 324076 197037 225377 161462 77179 -24856 262547 510821 137949 -37358
19898 -37358 -120441 -174906 -220427 -189626 92345 7474 122747 358387 519685 303875 149232
19887 149232 41360 -79070 -23967 107170 390196 652805 634670 439051 443261 594346
19877 594346 570553 405152 143172 160190 138919 175319 100921 -5777 -85941 189199 259561
19866 259561 145995 -166720 -165541 297 -30010 102685 20607 1596 42313 -253687 -221164
19855 -221164 -178700 -24741 410342 494448 173076 -268121 -203347 176997 419293 240579
19845 240579 29768 -190021 -181111 -169804 -401093 -230401 141567 -249496 -351292 -348697
19835 -348697 -357983 281810 238999 317516 337546 116499 -113895 -354454 -414744 -469885 -334812
19824 -334812 -126418 118138 100489 53092 -428810 -316801 -216693 -321495 -874015 -1038796
19814 -1038796 -414360 150317 307043 79682 -104996 -215886 -43396 -273611 -445046
19805 -445046 62380 167089 -93365 -25492 13829 -120542 -276401 -327471 -103259 143946
19795 143946 597815 579846 252872 -608146 -671712 -280539 -317506 -284496 118540 291942
19785 291942 306427 107473 -442 118646 211406 345626 313289 452171 769926 1051651
19775 1051651 1384932 1719038 1948676 1992656 2006541 2282113 2130985 1926407 1412119 856545
19765 856545 842125 696280 345887 143714 242700 131868 132386 75193 103194 405799 365829
19754 365829 399055 374597 256836 217301 327966 472327 438619 21024 -310892 -371369
19744 -371369 -362515 -116767 120683 257903 -139426 -177503 133004 273476 494388 580407
19734 580407 544230 437849 113252 -18016 349403 707923 1080006 803561 542064 556592
19724 556592 382124 260071 163127 206980 467010 415262 191837 13635 155122 -62894
19714 -62894 -333737 -10987 275133 -32378 -368269 9056 463158 724711 446971 440259
19704 440259 181149 254240 174242 311253 244914 394571 254979 376477 589096 403710
19694 403710 468371 375410 275690 468086 486616 417068 762747 707335 463632 456309 -12201
19683 -12201 -208637 130077 75456 353228 474025 314504 473180 717211 611650 524981
19673 524981 248873 25762 28641 112801 220121 165000 171178 253720 239078 424199 319225
19662 319225 -38340 -36001 347923 453378 285702 585448 475960 90420 283223 615402
19652 615402 687861 651333 591898 513403 518556 619173 490911 668475 564606 406477 571524
19641 571524 558432 623772 689025 1037803 1338271 1362959 1219096 1124876 972619 827800
19631 827800 662835 649051 559399 985280 1143673 1129469 1091461 689009 245926 434678
19621 434678 815313 872520 1010814 893687 893780 1322619 1010198 121207 70892 561744 596388
19610 596388 507213 729463 980172 1418626 1553997 1248998 1148501 994866 1166120 1390608
19600 1390608 1853606 2057168 1710024 1464821 1032893 1317077 1269730 1268236 1069796 1184577
19590 1184577 1298542 1302422 1264825 1167027 1229174 1277875 1054976 1105046 1094770 699537 543226
19579 543226 917793 1187321 1298229 1528652 1725653 1548707 1131972 1037764 1201613 1158405
19569 1158405 1163511 1028764 1196604 1181944 1006065 1065642 944891 1099788 1184431 1379452
19559 1379452 1554495 2018280 2167589 2332486 2293946 2264824 2265383 2210679 2445729 2545065 2691939
19548 2691939 2532609 2583133 2714425 3055732 3470632 3461587 3265531 3264202 3623959 3904611
19538 3904611 4182236 4468186 4828303 5387972 6099282 6259700 6640458 7263422 7905298
19529 7905298 8563604 9125863 10143770 10937228 11849486 13459242 15136988 17049400 19210816
19520 19210816 22226176 25810519 30187463 35737870 43291457 53400714 66772408 83059896
19512 83059896 99696775 111771977 119247775 124174027 128344891 129240781 120616226 108225542
19504 108225542 103782313 109390189 120028801 127164262 128675448 127960162 126430767 122346631
19496 122346631 105503671 79165575 58895597 46365811 38609187 33537073 30199086
19489 30199086 27672852 25752407 24207415 22935375 22118000 21999635 22014027 22143016 22031119
19480 22031119 21896985 21688493 21590532 21758529 22054525 23006524 24282705 25776069 27499781
19471 27499781 30060983 33076344 36306735 40255992 45867708 53494300 63959318 77660107
19463 77660107 95254679 115214199 131303513 140547345 146255117 150892449 154344668 147773191
19455 147773191 131135120 121280843 123809902 133419173 141853275 144692789 144154957 142416439
19447 142416439 138330228 123791347 97322399 73187387 57461814 47668614 41105343
19440 41105343 36012935 32088146 29364047 27813099 26079191 24808080 24398081 23705739
19432 23705739 22666094 21858979 21077220 19745063 18702837 18273394 17980542 17713703 16965905
19423 16965905 16295633 15756585 15317610 15099909 14879282 14738282 14481170 14077068 13456171
19414 13456171 12745686 12038000 11600860 11374935 11094934 11118415 11190894 10644384 10475972 10221733
19404 10221733 9705116 9643029 9803804 9754706 9300122 8992699 8808865 9034782 9139568 8393699
19394 8393699 7914458 7569674 7779877 7864372 7915030 7544339 7158032 7146245 7233076 7244078
19384 7244078 7548223 8049549 8190979 8083403 7888471 8034520 7732226 7471053 7381871 7430322
19374 7430322 7224196 7287610 7362801 7323170 7122309 6773217 6493630 6166365 5825940 5636792
19364 5636792 5551390 5448446 4948709 4735349 4856289 4699665 4230040 4086279 4024847 3844566
19354 3844566 3690151 3578939 3966402 4405283 4243727 3964413 3343049 3184828 3170258 3230271
19344 3230271 3018318 2542518 2127293 2107224 2322690 2334622 2278682 2318049 2361695 2375898
19334 2375898 2467562 2365764 2490411 2355341 2100044 1923085 2031927 1866175 1629324 1495332
19324 1495332 1527490 1403130 1435260 1468796 1707120 1830769 1572138 1545739 1507470 1313909
19314 1313909 1190311 1259539 1455476 1465734 1359937 1273196 1390001 1348652 1338175 1192875
19304 1192875 752344 693449 795177 1253331 1406361 1104662 672665 776387 1031218 1412661
19294 1412661 1229001 873293 721104 356060 135697 251686 281184 495698 845965 746138
19284 746138 712791 766618 727276 720236 779580 795976 664036 323323 383260 367641 403224
19273 403224 283463 708113 1088737 1138583 1524249 1343719 1162094 1328276 1282298 862708
19263 862708 926848 939807 746227 730925 744400 891256 755936 819123 867488 875301 855915
19252 855915 931062 868481 856494 854333 718206 576109 562299 705355 941342 971588 974733
19241 974733 985502 1154977 1114290 999663 871653 893527 1010077 1111675 1233164 1471578
19231 1471578 1458907 1317966 1243709 908877 841307 1032788 1276906 1481969 1465376 1404655
19221 1404655 1036133 1151841 1238128 642494 447993 630668 972277 1028183 859453 897915
19211 897915 949947 1104086 1354420 1349082 1344771 1535112 1589844 1633463 1728878 1612158 1554095
19200 1554095 1642232 1759413 1490078 984007 1073087 922387 727898 723776 766982 979075
19190 979075 922665 659890 216713 128095 373922 1040714 1125495 1142041 1230696 1137058 1258193
19179 1258193 1210940 1251684 1435424 1046493 887816 1433014 1357668 1330552 1136592 857317
19169 857317 968072 993346 966622 872101 936831 907803 1134802 1244327 1074546 1100483 1179069
19158 1179069 1114006 1073546 1050114 1043239 933264 816471 650907 430521 495391 788993
19148 788993 992186 922373 858095 927957 1013260 1162118 1253179 1160387 1097047 1042511 1194510
19137 1194510 1311883 1405628 1398606 1273112 1315792 1619787 1979631 1962040 2001369 2090085 2051300
19126 2051300 1811804 2136692 2366551 2472704 2087757 2019418 2061823 2421763 2339524 2341221
19116 2341221 2185121 2104745 2237692 2559685 2620460 2403945 2237618 1951502 2176141 2198704
19106 2198704 2000484 1954166 1871771 1973762 2339265 2958509 3490231 3904405 4226544 4173717
19096 4173717 4523774 5193630 5817687 6147171 6637880 7447006 7967307 8666226 9852733
19087 9852733 10845854 12148760 13580592 15265278 17066821 19131618 22057295 25515309
19079 25515309 29685835 35614798 43521927 53937472 67306722 83679379 99696523
19072 99696523 110226469 116453511 120772880 124420463 123832689 112778570 100320652 97535601
19064 97535601 104330783 113945866 118902663 119832003 118819816 117654458 112939063 93552786
19056 93552786 68229970 50992061 40747155 34432484 30222817 27546094 25967832 24505192
19048 24505192 23678580 23124135 22384472 21807585 21414450 21070556 21328499 21665244 21600136
19039 21600136 21296996 21673582 22599652 23560672 24618762 26129053 27902704 29831868 32542365
19030 32542365 35903374 40221238 45716587 53159318 63364590 76706915 94891318 117637361
19022 117637361 138437492 150695549 157244703 162181512 166674546 164358098 145304923
19015 145304923 128208676 124733933 131868744 141104045 145441259 145449194 143823478 140710217
19007 140710217 130680213 106084998 79049875 60858907 49501499 41763281 36662261
19000 36662261 33299992 30943912 28746221 26803103 25384649 24179198 23022902 21852868
18992 21852868 20937504 20373933 19726839 19031279 18449580 18053265 17422296 16699201 16508443
18983 16508443 16326911 15975843 15551099 14755988 14107176 13793113 13586575 13248599 12389376
18974 12389376 11977846 11784570 11830669 11386595 11505772 11407384 11194461 10662686 10626480 9945924
18964 9945924 9405455 9508805 9535660 9409599 9576016 9731676 9449155 9276517 8944622 8867129
18954 8867129 9010820 8993696 8778436 8561717 8541411 8242052 8105412 8181565 7994343 7741225
18944 7741225 7828214 7759799 7820100 7695071 7687823 8140615 8363537 8094360 7862310 7565491
18934 7565491 7454368 7441367 7469705 7122591 7077423 7201189 7081826 6614873 6485064 6572396
18924 6572396 6866763 6523598 5992430 5698632 5313998 5177799 5043881 4715140 4557810
18915 4557810 4552457 4546971 4442574 4506063 4501537 4249813 3950119 3553737 3353701 3243572 3155669
18904 3155669 2940579 2562106 2822057 2689008 2590688 2687546 2536248 2192847 2201640 2093303
18894 2093303 2509523 2535326 2351758 2049312 1972615 2395611 2622459 2192312 1961242 1886396
18884 1886396 1976843 2148423 2081061 1612894 1600631 1504761 1488359 1726429 1865786 1550932
18874 1550932 1416306 1350287 887115 762261 861609 1047686 1192374 1318128 1147412 1228156
18864 1228156 1018292 992424 1039901 976651 1059192 1182985 1122314 1035117 707893 567494
18854 567494 582965 501391 338932 167037 -14115 14395 -50633 222114 579836 569729
18844 569729 522360 665241 836539 855842 746186 843785 1070743 1285583 1195177 968712
18834 968712 741386 568656 331334 405282 781513 840739 850221 787424 986000 1086006
18824 1086006 849475 474791 544674 626541 341446 584353 841596 691186 782796 1135624
18814 1135624 1283230 1179875 838381 628198 688897 633055 693464 633056 710521 1001838
18804 1001838 813709 742591 921740 716479 544153 741315 973081 964835 753257 771649
18794 771649 926078 794867 469752 441496 920628 942755 1105227 1143340 1008147 874636
18784 874636 1026875 967579 799880 823451 1038775 1359271 1163542 1151336 965499 764415
18774 764415 989923 1069068 1201203 1171976 899511 1040748 1046951 944510 1054856 819517
18764 819517 746124 716307 726020 702415 595982 740249 919118 926606 1280327 1345877 1222582
18753 1222582 1267988 901210 1008044 1006396 847042 1024760 1166427 806533 525766 920647
18743 920647 1071236 691950 601352 798088 1304700 1311061 1333292 1109574 1088033 1006545 849692
18732 849692 760548 800404 1091586 989778 559296 801032 1118249 896115 1123068 1091018
18722 1091018 1213211 1009928 883476 1020706 1302495 1462710 1555225 1506439 1525799 1507655
18712 1507655 1252101 1011372 975878 871184 663746 576684 455178 668879 737667 960691
18702 960691 1192144 1346044 1211368 1123561 988104 984489 948140 1019742 1147807 1295701
18692 1295701 1052192 1112039 1567662 1707663 1937905 2118609 2114150 2325204 2717517 2790056
18682 2790056 2680270 2982140 3505982 3490907 3711077 3796072 3512070 3483219 3555349 3755149
18672 3755149 4119472 4291379 4553085 4752393 4576499 4671737 5712220 6123912 6420294
18663 6420294 6919050 7639862 8532273 9461930 10477515 12136834 13806309 15548076 17919324
18654 17919324 21054179 24514882 28789272 34009009 41150199 51126202 64127406 80673794
18646 80673794 100546715 118824241 128912042 132983865 133931850 133308276 124993969 100432978
18638 100432978 72609188 53797508 42012670 34394279 29203183 25771610 23174127
18631 23174127 20866021 19257149 18075443 17159963 16211384 15502429 14613328 14108043 14252616
18622 14252616 14209078 14325933 14343444 14296773 14538817 14797802 15409860 15718376 16148357 17045305
18612 17045305 17794610 18449367 19896045 21510415 23476525 26097472 28944965 31742832
18604 31742832 35784433 40797061 46591127 54769362 64585291 77822212 96021064 120850405
18596 120850405 152257186 186637392 212191943 223999614 228218397 228833023 224474497
18589 224474497 197333533 148326203 106612821 80339948 63511625 52581319 44817061
18582 44817061 39650499 35764449 32121236 29282984 27022224 25234119 23785233 22667906
18574 22667906 21882769 21009162 20424832 19884083 19712314 19726385 19604150 19321536 19296104 19388967
18564 19388967 19116404 19161980 19185615 19239950 19504268 19623199 20329960 21194264 21787507 22343877
18554 22343877 23394156 25185528 27319174 30109529 33355507 37717395 44067457 52699895
18546 52699895 64327889 78919846 92948772 100652467 103355576 104321478 104400660 99930318
18538 99930318 81716801 59648736 44783347 35756310 29934681 26052814 23225877 20992028
18530 20992028 19668008 18516324 17291484 16191064 15595655 15136234 14694037 14359544 13829562
18521 13829562 13307660 13389555 13253958 13123214 13022192 12711618 12734852 12441394 12167455 12099150
18511 12099150 11749423 11628267 11380805 10890853 10734576 10555283 9980044 9362622 9057053
18502 9057053 9067309 9162731 8427793 7766715 7683264 7770184 7632150 7303503 7085291 6984406
18492 6984406 6643308 6802342 6761522 6397660 5944157 5650047 5820099 5561956 5513003 5516229
18482 5516229 5578597 5565858 5312545 5331298 5318898 5320755 5133629 5126272 4863546 4864132 5013717
18471 5013717 4901370 4787004 4756219 4476295 4599475 4445580 4430608 4488011 4478661 4408067
18461 4408067 4589078 4583454 4289684 3592213 3289580 3359394 3550361 3575789 3849510 3518901
18451 3518901 3137336 2925393 2762807 2706261 2481064 2376936 2312514 2077472 1918221 1549152
18441 1549152 1909704 2535433 2404674 1863457 1685872 1385452 1088704 780127 1171942
18432 1171942 1408200 1604439 1688698 1839254 1539912 1591792 1661365 1497741 1396951 1064618
18422 1064618 864468 669156 489746 819426 1216899 1107576 1016055 1018175 950095 1146292
18412 1146292 1462489 1254447 946266 901183 964889 1211896 1392189 1634523 1549394 1263932
18402 1263932 571903 520164 369512 495490 732717 937157 1255538 1276039 1465580 1462391
18392 1462391 1392975 1170378 787520 134063 241449 144082 13907 390064 396595 501448
18382 501448 428777 285499 410491 558902 428326 380860 303436 456644 554780 655414
18372 655414 679005 686625 829790 807750 413567 387383 489207 445664 527649 439739 243865
18361 243865 138043 96195 127716 172701 476521 581619 661051 855308 1004414 763670
18351 763670 615426 641081 543912 608676 469680 365049 494016 516470 271549 296188
18341 296188 409315 602290 472619 513245 516857 341661 33512 197370 426125 320463
18331 320463 99168 138807 294670 279540 367751 402461 467434 570339 444957 194603
18321 194603 470276 547417 304216 457046 602552 615728 422253 469884 368348 331410
18311 331410 478743 611042 330308 -83549 273296 361292 164883 54049 296202 268133
18301 268133 35371 -263612 247736 384703 453295 503701 769406 692672 308499 297763
18291 297763 138693 308622 344951 789328 938017 693327 436787 95155 -191353 -353616
18281 -353616 -249250 -76314 244326 552746 403731 237940 289091 141055 191164 90853
18271 90853 -289551 -564380 -694533 -375801 -225420 -253178 -334204 -401555 -205588 122122
18261 122122 533280 567907 349149 221013 23605 48857 44888 47746 88799 288185 320058
18250 320058 270242 -321012 -382266 -325728 -257003 -207245 98356 21672 -306446 -347738 -323002
18239 -323002 34818 106514 -220250 -160037 -16049 292808 479060 166107 -105398 -57165
18229 -57165 -78335 -6379 -35430 155860 193804 -121813 -604330 -1083249 -884926 -260977
18219 -260977 52738 292823 169470 28481 92163 63232 -65748 -3898 -95404 -3635
18209 -3635 539907 229680 -52988 172804 341183 427961 262717 97639 -103782 -168773
18199 -168773 -436368 -23439 387590 392797 66118 -451465 -298177 -15936 -106873 94507
18189 94507 296634 274356 230427 442196 338790 193623 262218 419071 454245 390045 366984
18178 366984 170027 -30359 -28215 526740 749883 842750 1013675 828721 653123 633919
18168 633919 664395 718834 613096 657686 404277 305355 316645 306659 93792 -122758 -161379
18157 -161379 -25190 -126297 -47500 -80648 -258543 -6904 264738 -134340 -277866 -202256
18147 -202256 -138229 128892 294134 223322 374829 378729 9997 -358343 -164906 -168503 41053
18136 41053 -66702 -343124 -630510 -415365 47437 103554 -81275 90068 75411 160727
18126 160727 449742 759489 484365 432874 490404 165141 -2054 74178 302918 362060
18116 362060 241111 191976 36918 148412 387959 902966 876875 785451 789962 907915
18106 907915 753185 564509 126117 -199075 -399767 -415333 -52259 293763 262014 232387
18096 232387 440812 583626 324407 327314 108274 -55380 -97107 -95271 -19615 -75807 -149900
18085 -149900 -707 317928 759070 900906 244013 171196 98832 135802 132968 51653 102819
18074 102819 344377 546797 727431 613889 446835 384474 372672 555759 362887 572923
18064 572923 1054142 1276458 1037511 877501 847452 966621 884753 659024 423092 241089
18054 241089 7786 -238189 -244291 -213271 7053 162392 -18828 175860 445231 307875
18044 307875 300242 -150653 -490287 -239666 -227829 53799 301978 254807 196223 91754
18034 91754 -31160 164897 417342 252006 48754 -145200 -217006 -59577 -66696 129673
18024 129673 236872 -32924 -187631 -244149 -499634 -257830 -41609 74057 176594 355927
18014 355927 276377 67166 13320 156422 260627 303919 439638 482245 390744 281072
18004 281072 174755 104854 -347310 -480316 -153212 -208906 -229739 -315486 -243475 -232922 -120518
17993 -120518 -153560 -375631 -651453 -456569 -118095 -172676 -320655 -116555 301986 365556
17983 365556 97627 -102316 -66120 -84207 46996 -222493 -245187 -5849 -223428 -376013
17973 -376013 -458023 -600438 -909412 -1043193 -771474 -644927 -648247 -550758 -692809 -714145
17963 -714145 -143645 130032 -72109 -21706 91366 308676 188474 164723 39368 -335185
17953 -335185 -494025 -351250 -427227 -277330 -68180 -23263 -85776 -8560 82815 39704 -15555
17942 -15555 -225660 -290323 -329145 -60236 325558 358850 270419 453994 308137 66140
17932 66140 51480 -64081 -174783 -375379 -206580 -113370 101476 301896 326841 -2006
17922 -2006 -545029 -604194 -303835 -362830 -151138 -361646 -209212 -131504 -9139 -73021 -28770
17911 -28770 63100 -5132 -260343 -311854 -283330 -270967 -471384 -115816 206655 332423 -79955
17900 -79955 -21751 -144498 -332468 -127608 9525 74522 373579 256103 -4466 58076
17890 58076 195887 756608 563597 -48034 -738531 -636712 -349069 49907 127168 176891
17880 176891 184179 60748 177833 2492 -205204 105070 301007 115307 292325 193866
17870 193866 124139 303466 465131 441233 81793 -193855 -24359 46238 -67121 -371824
17860 -371824 -308724 80306 398828 455671 342401 323834 310215 464855 629073 493222
17850 493222 272504 236630 81990 -100344 -101070 104342 250799 103688 32778 -49270 -70997
17839 -70997 -33516 -35716 95032 49035 -64478 -108455 127224 363373 311295 266479 322619
17828 322619 241613 45379 -87535 147504 194132 -150294 -196784 102328 407293 660020
17818 660020 386677 -103429 -382090 -287356 -69531 -159488 -707369 -670078 -503943 -4768
17808 -4768 433070 577229 392552 -164286 -264794 -546334 -637502 -159489 128406 96156
17798 96156 208909 185849 297501 198172 -62656 -73519 231602 399951 352178 370568 -18635
17787 -18635 206452 267292 67019 -135100 -293841 -416969 -726464 -403397 29573 31041
17777 31041 73648 114157 -69300 -252915 -33595 281953 351633 -172168 -43275 222416
17767 222416 262540 471270 708641 875503 896234 712581 474674 192272 463869 501710
17757 501710 304854 307204 304305 272940 -65126 -785732 -565583 -265462 -314616 -440864 -495608
17746 -495608 -431056 -298959 -421474 -622762 -270589 88177 65658 363208 638009 599352
17736 599352 332372 -58110 77419 299423 294999 -16656 -396348 -386594 -411398 -581161
17726 -581161 -259404 -129303 -150941 -296021 -255339 25382 -102641 -96084 -93556 197581 6212
17715 6212 -115765 -23050 -226520 -397129 -498424 -378521 -134083 -220890 -264179 -641503
17705 -641503 -694752 -488558 -239531 73077 267153 244243 243942 186143 34779 -213210 -229689
17694 -229689 -196428 -329962 -435097 -97282 28504 -145435 -396309 -270047 -96805 -52782
17684 -52782 -136528 -323003 -557072 -691649 -497003 -226128 78730 272753 138156 -146600
17674 -146600 -405937 -370119 -435432 -762195 -938905 -667471 -103379 -166355 -282569 -399560
17664 -399560 -650818 -762477 -575699 -497134 -230423 -138018 91805 129684 -91934 -187351
17654 -187351 -352077 -302815 -345847 -482780 -409708 -290052 -344861 -467305 -139816 8150
17644 8150 -61718 -51414 -107386 30484 -80149 -265413 -369261 -280034 -337903 -537357 -654007
17633 -654007 -540213 -296672 -139041 83583 109094 492202 603273 594096 687699 454451
17623 454451 19892 -340112 -330447 -316873 -581847 -388013 90026 113541 -187464 -142531
17613 -142531 -168547 -284751 -303635 -38573 197497 86206 -64874 -91534 -223889 -337983
17603 -337983 -145981 31465 -320015 -328658 -434254 -80787 166788 46903 24039 -102951
17593 -102951 10449 -23371 331850 742507 892657 528064 -76164 -264667 -375055 -717649
17583 -717649 -1121664 -854685 -675619 -799463 -818194 -337783 -29342 -336632 -155083 188135
17573 188135 370489 217598 127894 489497 543741 433048 155830 117334 -18287 176571
17563 176571 -293489 -234540 103864 183528 88423 227091 202979 370576 263792 -11206
17553 -11206 -71874 -103543 -208199 -139330 -73515 165403 -99003 -554782 -526760 -739065 -835592
17542 -835592 -514261 -253451 16713 64475 13432 -492544 -519664 -331092 -43282 109490
17532 109490 317001 94797 -300616 -374317 -153528 865 155495 70988 73763 -167171
17522 -167171 -145996 -347985 -308832 -253536 -198830 -108160 191455 360950 509033 142638
17512 142638 -190421 -89520 -142786 -389543 -265576 262603 472560 143782 -125120 152669
17502 152669 213859 191970 -36873 -252807 -149766 -67957 -435 221309 132854 -300995
17492 -300995 -936842 -969090 -698099 -673499 -559535 -558506 -813181 -705096 -588521 -530543
17482 -530543 -670372 -214125 227668 297725 276099 101892 -64784 -389268 -784514 -490418
17472 -490418 -307878 -65460 -447027 -434832 -143400 -144327 -70822 177038 -46493 -61449 313923
17461 313923 480619 248371 -19431 -240254 -352108 -218560 87059 -126823 -321135 -354127
17451 -354127 -269590 -63035 14814 -2043 -373060 -459231 -541907 -656313 -447783 -84108
17441 -84108 -81209 -131204 -97485 55047 36564 -145035 -141766 -165102 -433129 -691584 -632475
17430 -632475 -271890 52568 -44708 -256 60373 10508 -43146 140211 321973 212547
17420 212547 -116807 -344136 -224078 -142887 -258747 -200727 -562408 -684859 -289609 -313899
17410 -313899 -624448 -752783 -428639 -74760 -36706 -370641 -450659 -300026 -98551 522104
17400 522104 782733 460621 192375 190096 207640 -278097 -209059 -45052 157268 181064
17390 181064 -424726 -661228 -361928 -365845 -534451 -639347 -410744 -119645 57970 167722
17380 167722 224010 289640 504118 265700 -101135 -490331 -264977 -60650 -318400 -307069
17370 -307069 -456663 -225452 -325072 -533882 -526608 -253073 94584 201131 189424 253523
17360 253523 297198 423007 304920 -47151 -299970 90180 195729 -130111 -113529 -93629
17350 -93629 -275886 -279001 -16768 160847 -72777 -101817 -221302 -287019 -63049 244871
17340 244871 161075 -83424 -211730 -233907 -103464 8782 -123368 -127119 83020 329404
17330 329404 309016 516754 664299 509900 302299 103444 -2168 152020 519869 36784
17320 36784 -574839 -556870 -384122 152989 302881 144696 -128434 -350400 -203431 -29302
17310 -29302 109359 199967 -1996 -215957 -392685 -246778 -53000 -73220 -8458 449352
17300 449352 364421 36659 -159683 -80408 -163367 -58083 -24856 94365 41149 23543 17851
17289 17851 -205346 -451360 -538734 -578622 -407353 -402549 -460848 -387324 -386701 -476190 -256983
17278 -256983 -4753 294740 -74501 -221181 -422334 -618223 -432889 -62084 425922 649105
17268 649105 624999 -144951 -754844 -504821 -230300 -24126 -28029 -214454 -240023 -320587
17258 -320587 -319248 -249242 -205288 64261 -17823 -12058 -222784 -524320 -590586 -661619 -450823
17247 -450823 -381989 -199911 -186736 -273356 -301277 -421501 -357012 -317638 -353385 -2312 545728
17236 545728 424877 -151845 -99291 39974 -74923 -13740 -9510 56714 197452 283449 121237
17225 121237 370261 37251 -280052 358128 472545 188732 -153663 -63118 3508 -202090
17215 -202090 -251458 -58594 -103767 -227219 -246606 -242244 -337798 -10220 420089 80418 -352770
17204 -352770 -448474 -510337 -735016 -522780 -491566 -304131 -300545 -319927 -130302 -343685 -292352
17193 -292352 -73334 108979 80147 -119945 -367350 -802532 -497902 -84825 132827 67056
17183 67056 46032 -172514 -195691 -322671 -429627 -126291 7071 -217118 -162466 52781
17173 52781 101362 50752 -7439 113553 212422 470442 473659 236957 -150677 -464635 -701961
17162 -701961 -787189 -657836 -580313 -548337 -484055 -812612 -914236 -735767 -837021 -645566
17152 -645566 -145322 -92543 -436727 -585873 -502091 -276393 -317193 -173425 379266 465052
17142 465052 -168299 -408449 -494438 -39321 137250 136821 188183 255791 151952 279241 369434
17131 369434 308887 466724 277141 35145 -233468 -72506 -174015 -372521 -264201 106159
17121 106159 426390 426606 67111 -92847 2300 203774 177707 8754 -426198 -435938 -513547
17110 -513547 -643252 -711859 -482166 -261242 -270680 -510255 -678182 -377082 -3463 254954
17100 254954 -53714 -54803 -244770 -276428 -315209 -356691 -231248 182593 448289 221718
17090 221718 40078 -234155 -520866 -485248 -468627 -391432 -186021 -281579 -684069 -603640
17080 -603640 -338783 -15688 234570 -212811 -510557 -137273 250119 312864 -63505 -22744
17070 -22744 -50662 -290041 -317379 -486027 -388219 -266511 -316387 -303513 -152549 -52227 55422
17059 55422 262524 313151 172777 -138842 -117088 197982 35661 -73219 -284092 -310033
17049 -310033 56973 234397 169495 125700 -195705 -337998 -27138 -76869 -316865 -359940
17039 -359940 -28992 126781 -140766 -327916 -329339 -252886 -142935 -49539 -37656 197006
17029 197006 327911 187740 194587 283696 17943 -20300 14351 -42802 -383270 -410099 -337894
17018 -337894 -481592 -418884 -367392 -20389 184178 330255 473196 493035 204435 -104469
17008 -104469 -147298 -267642 75266 70170 120824 148655 -111270 -478812 -503496 -437543 -369111
16997 -369111 -593553 -481616 -603867 -767466 -580663 -619490 -180659 93457 285455 119670
16987 119670 12497 91624 440436 558301 443033 96706 -211996 -395850 -442800 -317365
16977 -317365 -455594 -614136 -487577 -126712 -41075 35036 -147617 -294677 29739 33780
16967 33780 -228865 -380152 -454363 -14170 145886 21437 116877 -48855 -283504 52975
16957 52975 5755 128224 -95605 -507504 -377297 -29459 5140 -206141 -313303 -356657
16947 -356657 -330928 -22534 156259 287399 419356 632081 496070 288647 74697 264316
16937 264316 207950 71701 227033 12369 -206448 -10033 66154 -25134 -172267 -98875
16927 -98875 16270 -276736 -148596 140763 87782 -526361 -673251 -373432 -396480 -538063
16917 -538063 -655565 -922087 -804798 -695384 -291604 -57223 -113548 43844 324969 203653
16907 203653 -11258 -129223 95949 354691 274663 132474 -81914 -355480 -235736 -198611
16897 -198611 -268533 -77899 -130966 -117879 -95728 -80467 -18806 109223 -171380 -117215 5455
16886 5455 236398 197005 238263 105529 -218685 -411379 -405029 -716802 -597936 -597188 -529045
16875 -529045 -623687 -593235 -374207 -509558 -698384 -316328 -164464 -253125 -566081 -339441
16865 -339441 -367902 -337382 -162183 -427649 -683308 -686120 -322650 -32892 -135799 95029
16855 95029 -43014 -499936 -681272 -353760 -315516 -643548 -536356 -313968 -306004 -92610
16845 -92610 99229 178160 157437 357285 124526 -188249 -244483 -323866 -503627 -572612 -464680
16834 -464680 -510196 -416005 -399842 -20152 241500 -71461 -258514 -85136 -275837 -90838
16824 -90838 -93209 -319367 -554889 -469149 -407264 -454799 -255782 -32187 246858 256617 71259
16813 71259 -198963 -32366 38805 -162001 -337239 -138968 146160 128127 2088 -38688
16803 -38688 -96929 181391 -12776 -205232 -121567 -27237 98589 111677 -639 -245705
16793 -245705 -158927 -389169 -347506 -351229 -457678 -344230 -16453 -111314 -392402 -261901
16783 -261901 -128607 -190825 -59910 39786 -177636 -368302 -395297 -416404 -232027 15338
16773 15338 167961 23061 -125294 -122930 -244115 -260638 -321574 20076 235803 123030
16763 123030 -145394 -114038 255690 179708 81420 92234 -339541 -314568 -36100 -202672
16753 -202672 -528585 -647108 -564998 -163370 -179623 -149582 17608 -73639 -377584 -383607 -461803
16742 -461803 -253486 -233421 -96521 -72939 -333270 -372493 -127485 41492 -97312 -302744
16732 -302744 -471489 -511385 -783691 -714578 -454526 -118236 256468 -32626 -61199 -419964
16722 -419964 -313935 -345359 -177018 -269932 -508969 -509737 -150024 -165154 -389379 -194704 -58350
16711 -58350 -42962 -250273 -347684 -315713 -369663 -507255 -398755 -265933 -202190 -43248 -183576
16700 -183576 -343586 -501828 -587400 -501477 -231364 111249 324940 272539 157930 224241
16690 224241 369738 -28340 -355952 -456414 -800131 -767654 -392159 -213291 -32116 331406
16680 331406 42759 -581403 -711508 -479784 -540688 -573636 -571699 -406145 -278998 -239836
16670 -239836 -422594 -322322 -245398 -325140 -211732 -101835 -234232 -98290 197175 110519
16660 110519 36067 -37368 -344694 -403439 -228973 8916 296267 284276 94184 209878
16650 209878 210668 -102621 -122401 -193680 -219304 -29107 57478 107345 -38916 -409612 -455053
16639 -455053 -563914 -522202 -521493 -112456 -23199 -323357 -369068 -263803 -290554 -283487 -9005
16628 -9005 148381 167768 -95242 -413570 -246188 5754 -235679 -359680 25865 254475
16618 254475 29126 -391695 -545140 -290014 -260789 -324677 -107089 -180231 -158356 -122354
16608 -122354 11560 131599 181615 470756 316708 87864 -249892 -278509 -114217 78510
16598 78510 75525 63848 -190120 -303637 -298818 -172250 -393749 -643462 -404132 -111802 91141
16587 91141 -186933 -151975 -34007 -249888 -199500 97854 139479 -339596 -807661 -670415
16577 -670415 -161173 236153 529235 337478 -120078 43287 268413 266136 105401 -50087
16567 -50087 -255214 -64786 120590 39676 -59770 -1207 -91683 -216089 -293163 -444486 -560761
16556 -560761 -487001 -486999 -446192 -386723 -117758 -140887 -28877 121659 -127927 -427893 -656246
16545 -656246 -561135 -544963 -536213 -336499 -314173 -327903 -451745 -516392 -377285 -305051 -144835
16534 -144835 -307147 -372222 -122718 -18867 -94648 11836 212611 399688 94883 -314412
16524 -314412 -314980 -208834 -173720 120147 310680 281407 49285 -187344 -172805 -153707 26882
16513 26882 -10103 177075 120200 -151808 -540960 -744045 -525108 -2208 242921 49040
16503 49040 -527662 -408500 -6452 -159437 -188673 -399396 -372067 -113294 -75566 -123435
16493 -123435 -248832 -394902 -580724 -745414 -463035 -446154 -609502 -737279 -493910 -215369
16483 -215369 140174 94573 -172420 -267788 -146768 -76641 -204937 -35536 60683 -118579
16473 -118579 -444921 -430901 -401543 -45768 -35187 -97633 -190832 49727 153461 -121244
16463 -121244 -191750 -221547 -137035 -87627 -27888 92712 16579 -213590 -653260 -667094 -565587
16452 -565587 -333536 -65390 -130682 -507198 -398985 -526150 -667460 -482855 -370486 -274312
16442 -274312 -164187 62092 -45507 147400 -374398 -984231 -868644 -602830 -371792 -284706
16432 -284706 -263085 -332131 -404754 -301565 -42538 -88701 -427862 -600879 -520853 -249425
16422 -249425 -117010 -297364 -475473 -571395 -557920 -612535 -243711 -17493 78529 -42572
16412 -42572 -209995 -438220 -578111 -615069 -508482 -650537 -460982 -236579 -335811 -333826
16402 -333826 -114319 -64972 -312598 -222180 140427 209728 392265 203946 6390 -208506
16392 -208506 -255377 -208269 -101191 78269 -145368 -329072 -80927 81848 100609 305694
16382 305694 31676 -164714 61622 200224 183590 -117584 20823 196147 491282 176733
16372 176733 -293387 -523660 -36166 277840 362286 197721 -259526 -84502 -277861 -377325
16362 -377325 -214980 -156399 -75430 -179844 -541523 -959446 -701947 -127698 21977 -83016
16352 -83016 -134307 152035 -172352 -389254 -402570 -322679 -574509 -862815 -668325 -118295
16342 -118295 -38410 107507 470174 51146 -251254 -196187 23879 81676 -332897 -133483
16332 -133483 -71536 54813 -34730 -32229 -61207 13363 223553 -83714 134621 516200 456442
16321 456442 247409 265978 336108 229217 -131928 -370799 -184061 -10820 -18013 80688
16311 80688 338384 275595 443025 428416 191112 181536 132790 341181 268258 133672 344151
16300 344151 700744 468974 115012 -192753 -208973 98409 241689 132360 -151792 -85112
16290 -85112 -76084 -179095 -229330 -129546 -287163 -332568 -82747 263176 144699 200712 228068
16279 228068 294763 146016 272853 500375 800823 1010307 643685 210167 284394 140103
16269 140103 -17540 -205269 -593379 -650131 -548575 -525835 -318454 -67810 -35227 -127113
16259 -127113 -274200 -326296 -414798 -115408 -34192 -287685 -79714 197425 301829 162433
16249 162433 -825 -60744 -214255 -10136 -146023 -265427 -456251 -244319 -108001 -85220
16239 -85220 -158052 -30137 -55152 212042 232625 -6283 -98100 -264739 -355502 -102249 29998
16228 29998 100378 176833 305056 540815 470084 186643 54075 -50013 -141645 -119122 -260003
16217 -260003 -423528 -272275 -208448 -180790 -344767 -235799 -98585 130127 53492 297808
16207 297808 61539 -243597 32608 27830 199516 170778 -79883 -229394 40906 155785
16197 155785 28250 175138 533182 563015 381668 177387 315952 401529 458127 85207
16187 85207 -23117 -54350 -79753 -149368 -103242 -195008 -291555 -370952 -281503 -98438 -310909
16176 -310909 -484691 -132886 48874 -6018 86950 382517 232899 61704 -70299 -108223
16166 -108223 -97577 -258641 -663781 -750576 -477905 -269298 -209179 -87919 -176960 -290490
16156 -290490 -181286 -370166 -156926 -422966 -695732 -448196 -48667 109711 9002 -113735
16146 -113735 122766 420085 396529 158168 218038 -27043 -326761 -167405 120672 283304
16136 283304 202101 83517 -270228 -350555 -203549 73431 311787 198028 75288 148886
16126 148886 220969 -73528 -219597 -227754 -183146 -327045 -178701 -83364 -90880 -497438 -348049
16115 -348049 -256524 -421916 -517938 -76072 -151035 -154008 15926 3182 -142770 -79842 -130773
16104 -130773 -85233 -374473 -677336 -839867 -901345 -629004 -292933 -406377 -772981 -751521
16094 -751521 -449377 -98959 -146191 -16702 318908 364335 264295 81335 -3717 -29543
16084 -29543 -363096 -219350 -143741 -126586 -428083 -676387 -643732 -586956 -316823 -127087
16074 -127087 -105480 -34370 -36428 -200194 -392235 -704867 -655601 -466324 -352337 -499868
16064 -499868 -220465 -327880 -740082 -947894 -713162 -576728 -616376 -334721 -185766 -239287
16054 -239287 -518227 -578994 -483261 -331230 -358224 -390778 -182473 9786 361392 386354
16044 386354 273772 328795 276823 61149 291439 169873 216351 203017 67649 268562
16034 268562 275184 234575 -64467 -39685 2254 -151525 -311443 30479 63453 -724925 -702787
16023 -702787 -512314 -390090 -392017 -436933 -358284 -640777 -596961 -434763 -108267 314180
16013 314180 315137 97908 97023 177689 96958 206960 474805 10314 -504854 -433112 28840
16002 28840 45943 45940 157862 -115223 -313826 -369575 -331191 -208308 12366 177195 156337
15991 156337 46658 224528 -42460 225791 294825 -134980 -169809 -218523 -376831 -461132
15981 -461132 -666445 -548283 -385167 -166673 -48281 -112897 -100256 -145617 -193913 66618
15971 66618 -242189 -429063 -460745 -217148 85238 143053 150146 132178 81121 -204837 -401434
15960 -401434 -209980 -594696 -430500 -495204 -439599 -29668 8900 -58872 244105 154320
15950 154320 -124868 -168485 72333 -12940 -619031 -813460 -954118 -793390 -445313 -126897
15940 -126897 160207 46821 185097 214489 177022 -98958 -337328 -192725 -49357 -480575
15930 -480575 -647153 -693953 -595510 -517336 -176714 -154154 -377298 -295427 116488 140464 31509
15919 31509 -204418 -71786 -126834 12502 -40421 -398883 -217674 -278355 -138014 304795
15909 304795 340460 338753 92521 -133384 -785800 -560719 -56601 464085 338292 107628
15899 107628 -80779 -7331 186097 49308 -443829 -264615 -337304 -457611 178333 233977
15889 233977 -125911 -59461 -267844 -372065 -767486 -512339 -26123 137945 -61304 -275067
15879 -275067 72979 285680 499941 96362 -24858 119849 330485 627143 659925 543238
15869 543238 487497 323520 357758 389036 113504 -134505 -137393 3604 -420684 -443154 -218356
15858 -218356 -84231 -183920 -191053 -156936 -126212 -12324 -211186 -333897 -298512 -432311 -537894
15847 -537894 -555376 -353101 -130881 -108859 -82750 -155283 -270078 -201528 -124440 -356252 -477769
15836 -477769 -417425 -415884 -11863 221745 68129 -88710 -148888 84057 305148 14357
15826 14357 -543418 -692734 -659920 -61183 -100500 -116014 141477 108603 -95000 -302132
15816 -302132 -467627 -473977 -404205 -412516 -300701 -15698 33750 -484757 -797278 -453994 3369
15805 3369 -153465 -345447 -110165 111268 403000 502084 804839 1032252 758918 471050
15795 471050 207617 73906 -151723 -133653 -153306 -308192 68815 -159754 51143 -54497
15785 -54497 -261641 -195251 -370315 -221971 -60355 -64676 174216 497693 198098 151343
15775 151343 49056 -137010 -190861 -86946 -68815 35184 12823 -36473 119370 271572
15765 271572 211250 367466 214641 242345 329333 65565 -14733 85607 160374 78679 -185916
15754 -185916 -647598 -920297 -491118 -517951 -355122 -237215 -348616 -418027 -84343 75478
15744 75478 -113442 -59591 -23540 -128902 -153062 -275782 59052 108255 -152768 -210581 -49786
15733 -49786 89205 5849 -49064 -99437 -224781 -100165 -153664 -149548 -66731 -184786 -124029
15722 -124029 -15228 -65953 6144 38038 173743 -81411 -263202 -64666 172811 447348
15712 447348 540718 348285 9548 10223 -249547 -212428 -102159 -163178 -431723 -290864 81841
15701 81841 357925 473234 200221 347516 647393 659212 31855 -112473 -25999 -105647
15691 -105647 55182 24889 284060 520032 20464 -380796 -369562 -29888 286210 237497
15681 237497 157199 116641 -226693 -256550 154756 -27713 198426 64621 -49404 100555
15671 100555 18407 137242 -418680 -427265 -495809 -611422 -491841 -547524 -557037 -278253 -31319
15660 -31319 -85694 -58565 -24193 161586 42796 -17718 76882 -485208 -803680 -627624 -472095
15649 -472095 -389182 -570341 -835768 -649152 -434487 -280124 -290076 -71662 -14593 -280223
15639 -280223 -292267 -86028 -81798 -39205 -243046 -306380 -164078 18012 86970 162332 373094
15628 373094 486761 -68019 -398737 -503407 -173678 -231482 -545861 -294665 -169684 -261660
15618 -261660 -567692 -485173 -283158 -146930 18942 -50815 -231049 -248733 -29521 -129664
15608 -129664 -450687 -495421 48933 268665 45359 135923 -6248 -179655 -266757 -472379
15598 -472379 -285511 -461488 -593374 -580400 -690857 -471304 -297134 -358184 -209360 -73064
15588 -73064 34018 23241 -326637 -560435 -404592 -397532 -166127 18290 177176 -22325
15578 -22325 -1500 -143709 -226405 -9888 15714 -173624 -217418 -279270 -280384 -386539 -318187
15567 -318187 -356825 -366493 -491619 -670110 -561027 -534243 -175093 -141613 214942 32180
15557 32180 164050 -352438 -344179 -101288 -97714 -86220 265211 360444 28523 245024 257440
15546 257440 122909 160904 211699 31598 79822 138851 -12192 -55241 171120 27712
15536 27712 277151 380306 309757 271259 267303 271585 279099 190996 399238 473123 221168
15525 221168 -165192 -73869 5985 276953 486982 412458 348279 436248 267265 -312767
15515 -312767 -402095 -363212 -492936 -538679 -382803 -318387 -304615 -290059 -458417 -712573 -719641
15504 -719641 -749548 -814096 -522767 -234897 -352028 -342358 -308105 15359 160811 230968 -53341
15493 -53341 -115576 -161658 -32879 84926 349002 512083 392752 156919 353746 229494
15483 229494 39152 30924 -265438 -449890 -282150 -124539 -80198 -91590 -198302 -37144
15473 -37144 265281 111522 -11773 138117 174442 -65078 46757 231708 141946 23622
15463 23622 -86740 -49256 142516 135658 26282 240843 579831 508538 73169 -158554
15453 -158554 -508445 -736940 -233392 4232 -218154 -274683 -218234 -128251 -58507 99320
15443 99320 -79087 -102522 -197674 -191322 30103 -60046 -424730 -115277 289821 69052 -131157
15432 -131157 -28721 -77232 -220297 -7499 162966 -30595 -472510 -618994 -578724 -768036
15422 -768036 -1018046 -418043 34627 -2981 -124736 -51546 37181 -54587 99440 -194727
15412 -194727 -495444 -283473 -24875 -127953 -218672 396909 516743 29632 -138873 -343829
15402 -343829 -506554 -503534 -701110 -503861 -298752 -229769 -328749 -148126 -43441 20823
15392 20823 -535829 -915055 -702614 -492564 -86844 66587 46354 -104613 -189792 -50072
15382 -50072 -173814 -230895 -192573 -29371 -186064 -286163 -382046 131236 259955 93025
15372 93025 404649 303041 302425 650001 528147 208210 388947 646043 596266 546365 536853
15361 536853 450708 157986 -68220 53809 8979 -237495 -368999 -296872 -433176 -395966
15351 -395966 -138315 -48761 -412834 -306618 -62235 245403 314952 -121382 -194282 -44425
15341 -44425 10557 212898 156957 194617 297777 373199 126087 -389662 -661415 -494222
15331 -494222 -181082 -433185 -535271 -287282 -249651 -172993 -104253 -72532 -120101 -50322 -312383
15320 -312383 -136057 107158 -372299 -773155 -793251 -606597 -535399 -171201 -70597 -557695
15310 -557695 -861022 -967375 -707495 -311719 173684 203090 239971 28352 168464 290818
15300 290818 154509 30712 150895 138408 -391965 -327187 -500285 -591459 -426101 -181030
15290 -181030 -243928 -589995 -681104 -521255 -270007 -271867 -210898 -83394 79146 -108832
15280 -108832 -473468 -373213 -538048 -438873 -326065 -300856 -266088 -183059 181699 266296
15270 266296 -129208 -169022 -227374 -525613 -633556 -457619 -194812 -248512 -318087 -279566
15260 -279566 -534784 -732982 -478353 -270301 -218063 24123 216540 530709 496913 228098
15250 228098 -167381 -177851 -159927 -124971 -110982 38472 -77117 98204 424870 209717
15240 209717 -48009 -78228 26994 -32438 -64943 99421 193515 -149095 -265181 -151107
15230 -151107 -325046 -377402 -360183 -274446 -231822 -412921 -598876 -527812 -564726 -218356 30727
15219 30727 102706 -71660 -491109 -317475 -358 24119 -58397 236565 220526 -75047
15209 -75047 26202 -111006 -196497 -1599 -20264 -60454 54104 281586 217301 232902 -60711
15198 -60711 -138941 104715 209724 255002 380405 423224 458759 443864 417940 273680 -40278
15187 -40278 -129621 -64242 213918 161252 250307 308326 22305 -193223 -237862 -457127 -489471
15176 -489471 -754492 -776946 -655458 -267459 -300248 -407735 -305784 -232436 -345940 -386597
15166 -386597 -360225 50513 316032 146063 189579 365135 360045 249970 -123257 -415631
15156 -415631 -229489 -135547 -233733 43574 280608 30030 54756 509854 548025 451419
15146 451419 328703 391691 251394 78502 -166198 -86469 237057 231414 224553 170815 70178
15135 70178 -353201 -512595 -405870 -282337 65693 240785 331029 227040 88727 -46859
15125 -46859 -289422 -424225 28318 244315 -78254 -12932 215235 368268 -17940 -252065
15115 -252065 -526089 -663914 -305255 -249846 -239338 119020 267525 132934 26484 -17169
15105 -17169 236885 261428 232006 274504 117546 -461279 -359628 -195448 -93950 363739
15095 363739 478250 285290 407185 382417 272915 76060 61442 -346961 -202932 277495
15085 277495 -19291 -357176 -542171 -638160 -311066 -257035 -334824 -151300 -117275 -106451
15075 -106451 281814 256093 161853 260032 180546 384641 457160 357474 -52303 -465834 -467911
15064 -467911 155920 311394 205260 154028 57617 -112885 -401352 -784072 -796467 -511609
15054 -511609 -577684 -746593 -663607 -381466 -75860 45773 115378 51078 25801 -37305 -78597
15043 -78597 -159769 -17156 92027 -165164 -216807 -122364 -60397 347054 311333 225442 391333
15032 391333 365326 204493 -780 -150942 -291936 -223173 -83451 25507 -30655 -216721
15022 -216721 -58531 233259 -151648 -328736 1636 456234 711209 823799 444497 529481
15012 529481 633355 509034 353341 42803 -143763 -177000 22602 265051 387302 166179
15002 166179 -223668 -136990 113313 218384 96754 296754 407452 369620 461580 262612
14992 262612 -138396 53721 383930 401833 166615 -306328 -358484 -193762 50042 269432
14982 269432 432323 337713 324925 247783 241513 237954 4970 94219 516194 615570 561495
14971 561495 551919 287479 273972 110010 -338484 -342225 -222945 -152968 129490 352062 271666
14960 271666 79347 -162249 -144562 48626 64077 -4836 37265 34679 -306776 -3871 240654
14949 240654 368657 695554 560761 7284 -83137 -222965 -273459 -435966 -466878 -152714
14939 -152714 166512 309992 443249 633581 403238 236704 243760 437222 380427 296078
14929 296078 76532 -50723 -115723 -315426 -216021 -76631 228456 530212 637898 324919
14919 324919 -258911 -473317 -43384 182670 48601 -374108 -682132 -754368 -753327 -626876
14909 -626876 -380101 -553252 -523344 -325318 -264837 -545047 -531655 -612264 -665529 -776937
14899 -776937 -1018136 -873140 -549837 -562144 -416151 -84275 -198206 -99323 91741 -6010
14889 -6010 -56286 65062 231620 314484 340294 552208 465667 267517 410628 579240 537661
14878 537661 329882 582805 556777 607437 348250 381213 186740 160468 216481 240149 339240
14867 339240 319467 179897 26931 230566 226910 89494 90421 -196386 -237737 -254452 -629108
14856 -629108 -442800 -456882 -376304 -507569 -472908 -411694 -68323 391858 94779 -92211
14846 -92211 90164 243224 352787 625595 731149 245488 -24334 68682 79598 57855
14836 57855 -40899 -203826 -288079 -559722 -251073 -101473 -41807 -354775 -612202 -246122
14826 -246122 47752 -48287 -191631 -650440 -774342 -360969 -223993 -387309 -269816 -337272
14816 -337272 -331965 -428383 -442683 -71848 154287 114924 126819 -26737 8554 463606 688793
14805 688793 369248 185491 98096 -25941 -118871 -253648 -181475 105226 141727 -1923
14795 -1923 -173815 -282781 -339608 -541621 -239685 45103 -261055 -428102 -97232 112219
14785 112219 21175 -162669 51848 274956 348375 116701 94945 -100454 -181765 -127664
14775 -127664 -121004 -119847 99016 -101733 -46495 -27494 118130 92499 117807 93208 249422
14764 249422 143524 68030 159747 -237196 -440898 -347602 -413823 -525924 -289067 -1757
14754 -1757 62808 -163621 -123209 -36781 -183837 -410848 -230901 -302360 -371584 -434000 -465573
14743 -465573 -174013 81185 -5415 -42660 241152 240546 56813 -111579 -177089 -180079 -227953
14732 -227953 -216507 -68201 35385 -159038 -189273 -369837 -376170 -238549 101508 296228
14722 296228 130514 57537 -21651 -12990 -66101 4095 30172 1341 -163786 -274792 -372107
14711 -372107 -380313 -289740 -43002 155696 365346 365242 183864 -250821 -439405 -81249 212467
14700 212467 239790 112970 107722 143464 297475 385934 182956 371074 406790 -17782 -70578
14689 -70578 31936 -33399 -35555 -241598 -172456 24216 381470 551273 618095 489259 181089
14678 181089 -6245 -176540 -56431 -107275 -300685 -105882 179367 228216 44880 -20912
14668 -20912 189346 455038 523139 521180 423852 294319 250467 127583 158833 201374 112640
14657 112640 90079 21716 14668 9124 48849 -88634 6232 -123624 237071 220728 114290
14646 114290 281465 186502 324081 309395 -140939 -66104 -87388 -100989 -86989 80957 295988
14635 295988 240725 345894 268431 -224551 -601533 -490393 -131788 -48593 -341151 -353886
14625 -353886 -154383 -22263 -108195 -229724 -21858 -23973 -93892 -145803 63921 369899
14615 369899 359541 125442 -53746 -344309 -305538 -116905 -4269 -130116 -207966 -36863
14605 -36863 -175072 -446935 -302112 -43699 202844 515880 324395 215570 93804 224453
14595 224453 -16903 -218066 -54821 54437 -215114 -147906 136582 33448 -50667 -123913
14585 -123913 -389841 64842 301850 123396 -258914 -277689 26642 602937 771349 922449
14575 922449 1105384 646748 400691 331841 325395 142237 186797 157390 249302 369608 478824
14564 478824 823746 740497 326374 14964 -99560 82612 209474 141608 39793 154676
14554 154676 390793 603699 463545 417417 124655 -204331 -310876 -85469 1172 -257941
14544 -257941 -99045 23751 86368 -51936 -81633 -212621 -14293 43157 -227356 26083
14534 26083 86788 -172717 -349018 -51185 -125121 -172336 -344913 -214593 -175325 140557
14524 140557 66777 103379 -79299 -259000 -355686 -284051 -404073 -613533 -681783 -398006
14514 -398006 141058 289114 125502 -282003 -657586 -422439 40486 121324 -57960 -324417
14504 -324417 -679904 -789389 -340495 -295312 -343624 -135064 -1874 -424110 -384466 -122787
14494 -122787 -143782 -423560 -490142 -451527 58706 336305 19580 -105043 -75511 -124983
14484 -124983 -164396 359418 421124 289190 -84860 -240906 -523576 -420788 -313133 -328878
14474 -328878 61833 225242 244398 19193 -214621 -495638 -426527 67011 -107626 -172968
14464 -172968 -158604 -213113 -124719 360829 728231 365057 165110 390929 258697 -65529
14454 -65529 -197939 -273337 -34190 -59408 -250376 87066 99149 123538 -216945 -235721 74756
14443 74756 -148166 -72604 -71610 74579 76870 -208361 -73888 125517 362813 73104 200332
14432 200332 408994 166692 133438 -300753 -746061 -504051 165019 -12279 -109485 -110386
14422 -110386 -138729 -167149 -46943 65198 4593 94176 88338 313754 200648 106641 190167
14411 190167 98913 43498 164300 343246 77138 266958 573208 237702 -17201 -103900
14401 -103900 -208931 -349766 -420301 -328945 -270520 -125454 254043 405477 79969 -141425
14391 -141425 -254576 -250642 -86539 340188 247315 127236 -37362 -341529 -110888 172427
14381 172427 -141337 14651 396608 640122 435103 220960 -2805 106884 216060 51832
14371 51832 282751 434831 164528 12007 140359 231419 109235 83804 239277 435271
14361 435271 426939 54113 -188686 -492261 -216630 2157 63159 -134203 50416 180506
14351 180506 270562 96257 -213767 -394422 -443149 -378453 -212537 -25149 180167 366483
14341 366483 579292 738546 365751 -419451 -691355 -435651 -620034 -818226 -859847 -276975
14331 -276975 91424 55034 -415534 -630191 -425021 -128960 -80045 21305 -15334 169334
14321 169334 174651 204058 214190 48764 -25657 -434292 -620790 -754611 -1083422 -896351
14311 -896351 -616589 -436912 -396728 -265876 -7021 -164816 -152842 -189749 -222423 -32910
14301 -32910 48688 371276 401310 73864 -64400 111127 -91090 29052 2059 94772
14291 94772 360424 304085 109705 253743 346288 373339 499592 230637 -45921 208111
14281 208111 265468 221606 -285245 -9243 266723 142930 -9043 -151379 -312201 -224300
14271 -224300 23710 -129465 -364385 -37472 149456 255543 387704 319350 104739 10986
14261 10986 129595 347150 373459 441868 760850 792385 385374 234048 -11490 -156801
14251 -156801 -324962 -244791 -253188 -264220 -9997 244313 200708 385128 548095 281065
14241 281065 70870 204347 370230 371310 333740 517706 604931 63273 -272879 -28629
14231 -28629 286089 184736 246816 180522 124503 -84335 133597 -48143 42521 -39981 -193038
14220 -193038 -197839 -409844 -510165 -500627 -405383 -192213 46716 312569 93495 55560 -263763
14209 -263763 -174848 -75987 -102039 -103058 -63036 144531 172955 373286 260914 44252 114081
14198 114081 145760 16133 -263592 43172 189772 55301 -187656 -400993 -508801 -825404
14188 -825404 -809259 -464557 -122425 -309836 -434385 -280173 110624 465612 689515 67477
14178 67477 -401150 -435499 -336007 -121475 -229585 -491871 -800374 -993172 -879806 -642100
14168 -642100 -522728 -506187 -482011 -529087 -372051 -251488 -82717 -15467 -142777 -260348
14158 -260348 -31410 209692 -215924 -384903 -215469 59621 -71892 -407301 -688207 -896767
14148 -896767 -674672 -369606 -114119 243824 7928 -264387 -395012 -628000 -339639 -269054
14138 -269054 -500853 -601753 -517481 -552687 -398538 -397836 148145 383367 332513 229471 47586
14127 47586 2307 -311398 -145973 32594 -148535 -31249 155478 157978 -40410 -215791
14117 -215791 -151680 -26148 25352 253892 252760 55783 75139 -156399 -231775 -164924 -182713
14106 -182713 -53149 -131553 -475159 -502703 -600416 -773346 -778562 -699085 -484053 -386368 -7572
14095 -7572 126295 100400 -126981 -295944 -592318 -653629 -412352 -505281 -551989 -672307 -604808
14084 -604808 -321469 -210828 247215 253363 21583 40120 124695 275187 52067 106951
14074 106951 388164 278457 -106415 -111196 72373 28082 161388 45418 211305 232273
14064 232273 -206814 -650262 -504931 -731978 -532630 -443620 -661060 -462080 -329664 -158402
14054 -158402 123753 -76934 -99494 55319 -229934 -187691 -266205 -224863 -15416 -97154
14044 -97154 -120906 -390872 -382448 -405859 -188200 30204 676 145861 -112097 -202008 36909
14033 36909 -50837 -60376 -190548 74939 399017 304365 -277 -258613 -362045 -341655 -423943
14022 -423943 -585824 -351642 -74959 -109167 -93969 -58452 -184517 -196543 -28852 -11760
14012 -11760 -143265 39654 -49513 -55623 -73546 129298 12212 -134066 -328934 -528859
14002 -528859 -360088 -237974 -233425 -509127 -462527 55439 582338 746272 541304 -68325
13992 -68325 -308129 -149750 -387002 -746724 -592715 -641605 -457801 -183693 -289856 -69127
13982 -69127 -95198 -316196 -554709 -547115 -336602 -21490 125555 218077 228780 78995 61075
13971 61075 60189 238045 401965 101258 113311 35303 -288745 -289795 -355059 -215778 -2801
13960 -2801 -23604 -316866 -377615 -417201 -381942 -332440 287727 767641 982661 487562 297157
13949 297157 200462 -20785 -164702 -294293 -246091 -216212 -353173 -264930 -177725 -446956
13939 -446956 -318133 -22638 -2154 -183865 -11943 -12958 -190039 -273402 -51029 252579
13929 252579 -26751 -325234 -255582 -89296 -17033 123291 155088 315247 -4864 -375443
13919 -375443 -279766 -255024 -23247 260450 243988 262470 275232 73075 35948 -91817 -125085
13908 -125085 -116138 -363410 -504771 -391213 -299670 -52083 -98501 -257977 -205151 -373567
13898 -373567 -369094 -299932 -25730 -110997 120745 409349 374115 -180957 -306168 -243838 -328894
13887 -328894 -630278 -532683 -82589 142809 225885 192578 155439 -59540 -312444 -388058
13877 -388058 -241831 -312083 -354076 -178217 101396 333031 360613 370072 143252 -1498
13867 -1498 -59476 -369238 -615338 -453689 -197686 16110 -225986 -249857 -95466 -192334
13857 -192334 -128906 -434431 -424675 168878 225044 169726 557455 412491 398921 24063 55056
13846 55056 468436 622032 346156 133917 -192718 -371455 -146981 -97839 80095 98290
13836 98290 209468 559037 670292 448086 -51025 32732 78485 309293 554569 568447
13826 568447 410374 79523 87483 156335 462 -308871 -180512 -95173 -107757 -110513 -364124
13815 -364124 -489852 -117146 -145426 -62167 272445 331565 150616 82056 -73518 376921
13805 376921 235695 -127266 -22692 66833 93778 -142279 -123880 -180528 -188332 -23055 84899
13794 84899 455818 496493 404359 769984 817377 421832 83452 230112 411084 489062
13784 489062 334903 180175 57783 222405 24427 -167541 -12676 -20159 7681 -310304
13774 -310304 -562950 -219752 216020 272857 342357 341964 548822 819327 402182 16024
13764 16024 -185023 -531062 -895035 -691501 -567611 -507263 -163598 -138915 83386 55412
13754 55412 -227422 -477562 -363225 -154613 -405944 -810526 -603441 -626699 -578541 -253983
13744 -253983 -166078 -298647 85451 468816 474949 -40356 -145461 137726 68069 118683
13734 118683 490858 417751 306186 183075 413445 568171 398467 70950 -100080 75317
13724 75317 -59256 -149676 -216906 -66359 -136277 -249688 -109346 -8305 -140361 -138182 -325578
13713 -325578 -277916 -310429 -84742 78858 118766 502070 614601 453612 255950 116252
13703 116252 -266262 -152434 -39582 75688 -43610 -79950 -376967 -157178 25461 134920
13693 134920 20806 239570 129650 77972 104070 262509 219791 -122193 -931 -99762
13683 -99762 -382875 -314646 -273390 -4885 49230 23398 452877 418686 -7786 -400338 -320082
13672 -320082 -342032 -262678 -133786 71614 195607 54712 -162224 -332853 -122259 103388
13662 103388 128397 88666 -67708 -44064 241167 429595 458265 486404 239075 162070 33147
13651 33147 17242 173839 216678 319618 87950 176865 596827 517339 482120 506814 453181
13640 453181 583363 641211 230007 128191 -88345 -72254 220411 131562 21030 255054
13630 255054 553148 339758 161762 327269 462454 368817 1548 223800 -38958 -388962
13620 -388962 -488478 -543183 -558208 -355938 -170415 -75429 -94929 -367709 -242866 217251
13610 217251 485519 465806 406407 611129 684533 466542 554167 412316 349907 459090
13600 459090 545616 877720 719152 529188 539767 552862 385423 171491 -248769 -170311
13590 -170311 -65269 -129882 -276654 -157259 -182833 -261939 -101699 -147743 -252464 -257850 -50690
13579 -50690 -62616 -205284 -561769 -823187 -691261 -424492 -147699 190701 196369 -139993
13569 -139993 -58791 469137 3526 -214817 6476 -303739 -568606 -535071 -374404 -240162
13559 -240162 -69924 -195798 -339027 -381123 -317391 -100540 -78635 72211 88670 279770
13549 279770 502711 336188 143970 26088 63723 29057 204645 235407 222659 -168608
13539 -168608 -48638 207216 219788 173328 106865 -78116 -305982 -161406 125771 245488
13529 245488 212018 260178 201025 59272 -17385 293027 428150 109490 -180165 -101658
13519 -101658 -159601 88629 249208 293951 48526 59307 161644 211419 177326 149466 -65640
13508 -65640 61028 273905 246250 66634 90645 -142400 -241188 -70776 250624 131933
13498 131933 488319 636564 568373 448577 60060 -427083 -419538 -243250 -151292 -652461
13488 -652461 -638707 -95518 -229602 -383121 -245174 -190506 -129555 -214856 30463 81399
13478 81399 164603 448444 156139 -228392 -473734 -442872 -491873 -65725 53398 -137106
13468 -137106 -195855 -206771 299386 491239 156402 -130787 -136356 -159603 -437758 -414209 -329695
13457 -329695 -200448 -324643 40549 277793 303224 630278 391741 175511 -316570 -501110
13447 -501110 -495433 -549086 -340437 -135689 65134 75539 38222 130483 262006 238694 196462
13436 196462 377824 236955 193933 89976 -60343 149085 127495 163675 391799 399915
13426 399915 4574 -33201 245929 298330 204105 401890 378335 153952 125162 2996
13416 2996 105177 15380 93935 -100152 -330781 -621489 -600832 -638125 -817555 -806029 -591606
13405 -591606 -614275 -593559 -392436 -231379 203 83657 199327 301919 505171 293393
13395 293393 50064 110393 165237 -90438 -66130 -26942 -106413 86051 -136321 -46648 325025
13384 325025 88158 117492 347305 246116 67129 46391 88618 113012 354863 276238
13374 276238 -47927 -192712 -90598 -79908 129885 -51114 147536 371195 283947 229227
13364 229227 247463 55806 -12871 208602 -42175 -126111 89152 -55930 -74543 -123207
13354 -123207 -34883 -230106 -396916 -540251 -199245 -144696 -200222 105138 268935 112271
13344 112271 -125689 -70604 -34457 -254080 -124057 -178687 -95324 -35838 167039 233766 5092
13333 5092 -214703 52800 385574 520178 298282 146724 57580 267238 -73088 -378159
13323 -378159 -188534 -245281 -284084 -89146 230481 369169 345922 516029 464576 389681
13313 389681 187295 -11790 -29090 -89760 -195261 -168960 -71717 -42079 229036 725997
13303 725997 839995 635043 219986 -189329 -78719 -325511 -298167 -142190 26099 43561
13293 43561 113584 -56536 -35413 -125238 -89533 -175540 -79089 54934 -52226 -260677 -334960
13282 -334960 -343818 -135483 43524 -102190 -423172 -243344 80544 2634 -83821 111206
13272 111206 378934 355199 -67076 -193144 194365 497078 406407 432636 428594 300354
13262 300354 316864 477998 430944 269238 16481 -148492 -127707 -119750 40733 48749 -106485
13251 -106485 139320 153250 262490 550745 523746 302423 -37262 -640947 -580098 -306744
13241 -306744 24729 46734 52737 24457 -146605 6103 89602 350478 274895 412663 412527
13230 412527 411771 225685 -78505 -182102 54276 98617 520279 787158 547888 397910
13220 397910 128408 -45295 212241 191749 308072 423703 427643 315784 228108 60844
13210 60844 157358 -60051 -31657 36128 176472 367770 487047 84108 -158 57730 -202788
13199 -202788 -195055 107401 470760 648492 445956 225924 105920 -26098 -5106 74717
13189 74717 67126 70451 -44648 100931 137173 11268 180759 394919 323472 -5145 -80930
13178 -80930 -292482 -431361 -167192 -102472 -74340 -49590 21285 -316635 -462809 -389654 76468
13167 76468 399349 528304 485149 341337 153831 185030 65186 341426 393124 111574
13157 111574 -281543 -133840 68896 -48211 136259 352237 -17926 -344953 -235842 90295
13147 90295 17152 88469 237617 301070 345810 530785 830684 649001 171751 112846 -110365
13136 -110365 -325156 -37386 87075 177530 403873 797408 662727 542183 350466 -11642
13126 -11642 -78954 81151 130978 -53765 -254192 -106654 248525 151118 -106370 -264749
13116 -264749 -166400 70381 367638 301865 293840 251533 105365 79464 187913 170234 308679
13105 308679 282366 420417 314942 169519 347557 435148 156083 87077 305794 26251
13095 26251 -212109 -205538 -93841 40930 66219 156147 -45385 -235994 -263537 -270446 -138173
13084 -138173 8494 341388 67436 -143208 -123057 -70437 74797 -37973 -497777 -540500
13074 -540500 -173402 -107969 -52684 299465 381505 174532 -35289 -25044 -20263 11018 -42887
13063 -42887 -260868 -484980 -198301 -353393 -529217 -526585 -207867 -37710 -263371 -289971
13053 -289971 -269917 -74271 -55635 -86085 -25554 206937 669400 1062581 674850 277321
13043 277321 30445 95656 380171 204655 40747 83079 96469 36855 139243 95819
13033 95819 -82201 -150668 -77708 -86475 -175608 -179682 267423 810095 694891 483110 726315
13022 726315 649507 169664 93766 -147596 -315631 -377152 -349252 -166285 -160586 256048 569162
13011 569162 607209 612432 381207 375957 49545 -424232 -179862 -21334 245962 46997
13001 46997 -194914 -200232 17377 403862 386056 229748 157445 9725 45046 -14035 -146136
12990 -146136 -43180 468692 580363 469077 666438 504506 339819 173844 294553 287817
12980 287817 97570 -3376 -95658 -293845 -9055 104513 245031 470319 788499 723237
12970 723237 650394 709972 682253 654371 410841 330942 413961 372306 205191 12304 66521
12959 66521 194433 284226 437057 192507 284488 822096 871687 421990 80996 -96697
12949 -96697 -76350 40779 328725 370422 199869 12879 203156 286903 101373 -68276
12939 -68276 48950 51461 -31878 300984 519907 388437 237286 23103 68721 256446
12929 256446 278794 238265 314885 195431 262725 429322 123044 21729 -37303 210331
12919 210331 70519 126835 610294 885758 461765 -623 -68325 -208577 -589672 -261413
12909 -261413 43465 43072 -39434 123695 362143 512917 373990 391554 517191 483573 45669
12898 45669 -33378 81390 133946 246869 108884 90102 204701 183478 253340 427738 358246
12887 358246 124377 371150 460815 479053 222465 18521 68477 373228 59266 -40228
12877 -40228 -85182 -90095 -295123 -44186 212259 322673 76570 148928 31899 214373
12867 214373 444749 218063 38804 78247 399883 604469 317672 161008 -28954 -472130
12857 -472130 -222965 98131 159614 206118 297459 89051 6733 34333 -43884 26805 -56470
12846 -56470 -197704 -319064 -162991 252443 118265 -44681 -317963 123045 -26587 -171294
12836 -171294 13039 168486 387208 411491 397842 63998 -62179 53168 115619 253716
12826 253716 232023 -79868 -441753 -459942 -21890 22293 -28191 97989 198464 227029
12816 227029 252067 560089 384677 403912 598043 448559 401656 273301 143692 57586
12806 57586 -91424 -280758 -185221 -204313 -197207 15708 110523 7875 196317 91118 -178318
12795 -178318 -168882 -11579 -117612 -7726 -173161 -104603 166947 231609 299605 163542
12785 163542 92191 -51858 156208 167389 211245 320894 796366 808173 811274 664755 365192
12774 365192 258504 446844 570907 418727 645818 569948 548075 451596 432429 319081
12764 319081 286344 531140 588764 452801 597642 97450 -290982 -188799 -155000 -352402
12754 -352402 -498847 -268998 32849 -71716 314 13047 -80748 215994 481114 323029
12744 323029 450031 427842 424190 675876 781941 969271 811055 398731 478258 301749
12734 301749 192811 -83893 -187759 -103851 204108 523458 519540 386958 148226 185471
12724 185471 404888 576923 437583 204689 -55793 -97617 297764 317847 127659 53982
12714 53982 -177869 -206768 112062 89316 135184 167756 283833 155584 9655 65365 287146
12703 287146 528115 195267 144362 175749 211517 371601 424728 88764 198213 123055
12693 123055 -195376 -231951 -108242 -75785 -220037 -1823 135115 306464 516379 630067
12683 630067 701807 727760 540592 535216 404460 226202 210476 24527 7919 -113682 -255640
12672 -255640 -221347 41694 -47665 -146741 -326873 -172400 61786 40932 289081 640731
12662 640731 219474 267888 322637 134435 262784 419597 550874 398318 421000 297451
12652 297451 54840 152197 143037 -213986 -22424 -23285 91604 -184768 -205725 -56320 139069
12641 139069 127636 -1308 326133 676719 651558 421021 310647 118384 -25514 -97661
12631 -97661 400394 512116 398124 144676 179440 243624 438630 405540 582869 972536
12621 972536 532291 26489 179250 321817 512336 394990 200488 447339 403224 411387
12611 411387 543078 373616 344494 4584 223182 498322 502006 528544 340035 129488
12601 129488 -218707 -504479 -579085 -559093 -487489 -267201 137291 128127 97316 -129478 -192253
12590 -192253 -98765 -54041 121763 276927 76511 147638 300348 405267 446767 162753
12580 162753 161343 418093 512294 526752 569761 731857 687208 779434 784643 621557 589306
12569 589306 601326 293129 -277010 -233638 61349 231936 19814 100241 408383 376139
12559 376139 454787 718944 871894 684222 344142 300028 -41094 159218 463951 715056
12549 715056 828353 877998 675041 124927 120813 318668 765810 866968 510758 353942
12539 353942 467395 220910 -39175 122390 137194 134106 262205 451076 283287 120989
12529 120989 319462 336403 172161 110835 287070 546289 934681 891167 677373 400931
12519 400931 69264 -274248 25756 633738 600220 268542 320661 375826 582649 615494
12509 615494 408097 172636 278875 321356 192985 248162 437551 319291 27031 53184
12499 53184 208299 321181 362472 495530 444946 327983 680939 760530 965262 1180113
12489 1180113 965961 466541 317613 217934 388045 278146 205656 182107 446843 -70076
12479 -70076 -568145 -195460 210436 538553 500858 600833 892593 841371 614747 366843
12469 366843 720446 770949 586783 689950 586463 766954 896438 886124 847859 330595
12459 330595 266042 244650 230273 353281 405014 176207 163132 257774 583738 726285 929879
12448 929879 771327 678699 498250 637594 365922 263630 320419 427498 284536 197065
12438 197065 337949 122263 31993 -23148 56608 212811 150801 423796 713996 725985
12428 725985 726755 612893 356353 534036 863369 927584 883853 856772 953077 1106046 863175
12417 863175 396179 597374 938669 795748 831465 381787 164588 268568 281145 507112
12407 507112 565867 454666 386502 276315 260260 658945 649977 819193 713681 409502
12397 409502 747832 939354 666771 790998 940762 835250 592282 223042 212892 452915
12387 452915 1131715 1485854 1411077 844703 520730 681397 790242 728861 650835 549525
12377 549525 672853 903344 876505 1059096 1181419 976163 807587 878889 909837 898390
12367 898390 704194 650637 972577 1120399 891200 675950 556399 287353 106235 382017
12357 382017 548121 620761 643691 550860 717112 495779 509216 1044393 1452190 1193733
12347 1193733 1248168 1530566 1282640 722184 679871 952057 1394401 1398669 955353 601207
12337 601207 665445 604618 549879 916324 864265 974609 617494 468261 264954 269377 256663
12326 256663 412343 837739 947537 873972 792421 549308 472306 133113 50002 326537
12316 326537 537714 988446 1118468 784444 518487 651506 831870 1116236 1103728 930909
12306 930909 1299760 1387983 848276 737238 1076955 998130 818039 952074 724238 912210
12296 912210 806961 874616 939641 1160189 1159802 970767 763968 1048541 1199403 894514
12286 894514 697646 657085 697441 873387 1093332 1272625 1108675 837639 957138 948819
12276 948819 775552 529407 742785 748378 723769 1143817 1221294 1000923 1203541 1004806
12266 1004806 846829 604321 591565 901730 1087378 1361149 1642549 1650874 1491693 1224997
12256 1224997 1285707 1403130 1500252 1700013 1822441 1684058 1230662 1077756 1134299 1312650
12246 1312650 1262866 1157279 1716757 1745763 1529537 1533145 1964918 1836372 1635353 1526192
12236 1526192 1418198 1304317 1057323 1042582 1160248 1048287 1207385 1403948 1315635 1286328
12226 1286328 1580684 1454024 1242721 1161287 1215640 1175158 1194154 1366416 1799932 1876902
12216 1876902 1894504 1815307 1312668 1715551 2268932 1985286 1869903 1797053 1954656 1696340
12206 1696340 1360644 1096801 1109246 1242880 1338048 1751032 1966671 1675824 1675594 1939633
12196 1939633 1808749 1486054 1560081 1794097 1860831 1939098 2223289 2330284 2232999 2126748
12186 2126748 2233489 2116332 2157754 2159514 1970908 1912358 2084199 2149340 2108534 2129807 2000089
12175 2000089 2281399 2456972 2744260 2608777 2710913 2855570 2628744 2408321 2168485
12166 2168485 2274523 2093787 2183195 2585309 2514566 2412057 2489128 2754802 2561056 2661045
12156 2661045 2555793 2773888 2831717 2744482 2544416 2613652 2570094 2540048 2452966 2407309 2746029
12145 2746029 3057348 3024345 2925870 2635926 2372020 2544476 2637662 2542543 2683959 2733923
12135 2733923 2639883 2202713 2239857 2555373 2738177 2838281 3009162 3029789 2773042 2935816
12125 2935816 3203259 2840866 2701950 2903719 3252433 3150379 3284128 3835991 3922866 3518559
12115 3518559 3138734 3203035 3286767 3548726 3748410 3673456 3755673 3572813 3466384 3875466
12105 3875466 4193542 4132442 4366243 4478638 4316406 4284535 4311908 4190966 4300602 4457405
12095 4457405 4350192 4536714 4901630 4992053 4834285 4781489 4470445 4414387 4601489 5257577
12085 5257577 5493723 5690791 5774038 5620322 5347498 5351449 5481209 5748898 5814035 5605317
12075 5605317 5542567 5760646 6012830 5993594 5873348 5873886 5797449 6192659 6482204 6559736 6652435
12064 6652435 6951777 6998790 6643726 6812742 6857538 6811229 7203376 7584390 7713993 7424566
12054 7424566 7301354 7353919 7236867 7491735 7939039 8025271 8036961 8083489 8136610 8396895
12044 8396895 8771663 8825691 8984940 9060463 9503957 9077515 8601476 8582024 8864793 8796936
12034 8796936 8869646 9430311 9644540 9786677 9717011 9998099 10019147 9877224 10067247 10280243
12024 10280243 10483560 10683754 10916373 10855234 11158407 11394849 11585242 11780354 12081115
12015 12081115 12372321 12638923 13079631 13153845 13103806 13666037 14035688 14162328 14259704 14585002
12005 14585002 15068887 15558387 15912676 15890895 15956376 16042344 16405830 16918452 17473882 17879688
11995 17879688 18257300 18749726 19183922 19628700 19873298 20212547 20615731 20859520 21402405
11986 21402405 22100470 22642258 23170776 23472570 24146239 24857001 25229556 25614181 26312459
11977 26312459 26903614 27689704 28463715 29120457 29824259 30438948 30969706 31859717 32918899
11968 32918899 34079799 35155769 36066616 37080811 38335942 39446305 40302822 41415274
11960 41415274 42577638 43732874 45206480 46274964 47634129 49384075 51020861 52595591
11952 52595591 53989507 55920348 57638643 59613803 61511717 63588782 65792510 67749967
11944 67749967 69271862 71034551 72970480 75326307 77825268 80636039 83460949 86018266
11936 86018266 88526439 91275517 93922166 96331522 98956957 101628450 104453919 107326432
11928 107326432 110076448 112571991 115091996 117877337 120610706 123268429 125755458 128059033
11920 128059033 130211208 131943172 133343740 134848032 136242368 137340554 138067042 138760325
11912 138760325 139028260 139178884 139036308 138611309 137996433 137021098 135974461 134647927 133014929
11903 133014929 131665114 130412213 128449659 126368660 124692865 122395997 119991912 117969108
11895 117969108 115414193 112657531 110116922 107854389 105742156 103180186 100719414 98501164
11887 98501164 96235665 93757563 91707831 89607961 87319563 84866466 82769850 81125359
11879 81125359 79602496 77720130 75905766 73948737 72148704 70285955 68590015 67312912
11871 67312912 66049440 64415520 62595794 61195967 59802207 58398679 57307458 56231043
11863 56231043 55087374 53964401 52962626 51919544 51181449 50293776 49039338 48283845
11855 48283845 47555316 46444561 45542393 44815781 43865936 43086076 42390628 41497888 40882522
11846 40882522 40235704 39741852 39168728 37985406 37266068 36975661 36221232 35585295 34819188
11837 34819188 34630055 34331725 33761077 32838004 32166987 31812924 31202675 30402882 29929489
11828 29929489 29662489 29169793 28833603 28203624 27712756 27333841 27182136 26882410 26502582
11819 26502582 25911844 25251494 24700058 24525671 23752805 23184009 23175153 23166750 22841374 22252750
11809 22252750 21692992 21328519 21068708 21078109 20993102 20837947 20446425 19951209 19261261 19200220
11799 19200220 18952707 18513282 18535594 18065910 17701241 17390569 16974600 16646136 16481189
11790 16481189 16116505 15731186 15640227 15263567 15234929 15033281 14505908 14141327 13891684 13995391
11780 13995391 13912996 13714322 13445510 13139989 12879453 12744928 12542695 12306866 12295068 11841253
11770 11841253 11427180 10984939 11128866 11278021 11012726 10810913 10739393 10659576 10538221 10380366
11760 10380366 9965333 9744673 9186923 9225897 9502805 9795605 9683751 9337301 9176557
11751 9176557 8712814 8421641 8200066 8332803 8037755 7850567 7995549 8155208 8030730
11742 8030730 7688727 7600344 7263297 6842539 6848874 6734850 6755645 6700862 6585820 6624116
11732 6624116 6716900 7006587 6807627 6775768 6594419 6388922 5870775 5614966 5588635 5502793
11722 5502793 5287631 4979541 5163535 5235485 5217318 5110877 4946546 4984142 5061685 5127561
11712 5127561 5302791 5212036 4927124 4899272 4759755 4672742 4309786 4299395 4510376 4590344
11702 4590344 4898400 4775949 4637765 4368622 4650308 4963280 4946215 4654014 4539077 4333718
11692 4333718 4578073 4605134 4370732 4279940 4238716 4217098 4108566 3867796 3982709 4024167
11682 4024167 4108977 4036046 4167956 4272930 4298022 4171902 4267829 4290823 4040054 4276192
11672 4276192 4545549 4514591 4223724 4007770 3841942 3823097 4058198 4238041 3882319 3579129
11662 3579129 3459098 3262872 3204263 3382335 3620010 3662956 3739355 3833807 3664822 3730761
11652 3730761 3873372 3631823 3491254 3785258 3947625 3842048 3540456 3316179 3320041 3464984
$$ [...]
##END NTUPLES=NMR SPECTRUM
##END=
