##TITLE=Analysis number 327451
Compound Code spb 02431
Book Reference 147316
Project Code adrs  flro3
Chemist Name jom
##JCAMPDX= 6.0         $$ Bruker NMR JCAMP-DX V2.0
##DATA TYPE= NMR SPECTRUM
##DATA CLASS= NTUPLES
##ORIGIN= Bruker BioSpin GmbH
##OWNER= nmr
$$ XWIN-NMR		Version 3.5
$$ Mon Mar 26 14:53:29 2007 GMT Daylight Time (UT+1h)  MAYBRIDGE\nmr@NMR_250MHZ
##.OBSERVE FREQUENCY= 250.131544655141
##.OBSERVE NUCLEUS= ^1H
##.ACQUISITION MODE= SIMULTANEOUS (DQD)
##.ACQUISITION SCHEME= undefined
##.AVERAGES= 16
##.DIGITISER RES= 18
##SPECTROMETER/DATA SYSTEM= dpx250
##.PULSE SEQUENCE= zg30
##.SOLVENT NAME= CDCl3
##.SHIFT REFERENCE= (INTERNAL, CDCl3, 0, 16.522)
##AUDIT TRAIL= $$ (NUMBER, WHEN, WHO, WHERE, WHAT)
$$ ##TITLE= Audit trail, XWIN-NMR		Version 3.5
$$ ##JCAMPDX= 5.01
$$ ##ORIGIN= Bruker BioSpin GmbH
$$ ##OWNER= nmr
$$ C:\u/data/dgb/nmr/ADRS/1950/pdata/1/auditp.txt
$$ ##AUDIT TRAIL=  $$ (NUMBER, WHEN, WHO, WHERE, WHAT)
(   1,<2007-03-26 14:53:04.08 +100>,<MAYBRIDGE\nmr>,<NMR_250MHZ>,
      <created by zg, POWCHK disabled, PULCHK disabled
       configuration hash MD5:
       49 4B E0 1D 92 C2 6B 37 9F E6 65 BC 52 41 86 1D
       data hash MD5: 64K
       4A 77 0D B6 FC 3B 50 1F 8C E8 AA 10 3E 2D BD 33>)
(   2,<2007-03-26 14:53:19.75 +100>,<MAYBRIDGE\nmr>,<NMR_250MHZ>,
      <Start of raw data processing
       ef LB = 0.3 FT_mod = 6 PKNL = 1 SI = 32K 
       data hash MD5: 32K
       8E CA 9A 94 5D 66 AA 88 C8 00 D5 31 B0 C6 35 1D>)
(   3,<2007-03-26 14:53:21.36 +100>,<MAYBRIDGE\nmr>,<NMR_250MHZ>,
      <apk 
       data hash MD5: 32K
       2A A5 01 3D 35 5E 1C D4 AE 67 A3 2F 64 E8 93 EF>)
(   4,<2007-03-26 14:53:22.08 +100>,<MAYBRIDGE\nmr>,<NMR_250MHZ>,
      <abs ABSG = 5 
       data hash MD5: 32K
       7C B0 D1 85 94 D7 09 27 C9 3D 60 64 A5 A3 F5 85>)
$$ ##END=
$$ 
$$ hash MD5
$$ 88 23 EC D8 9D A0 EB AE 00 7A 19 E3 D1 23 C2 33
##$RELAX= 
##$RELAX= 
##$RELAX= 
##$RELAX= 
##$RELAX= 
##$RELAX= 
##$RELAX= 
$$ Bruker specific parameters
$$ --------------------------
##$DU= <C:\u>
##$EXPNO= 1950
##$NAME= <ADRS>
##$PROCNO= 1
##$TYPE= <nmr>
##$USER= <dgb>
##$AMP= (0..31)
100 100 100 100 100 100 100 100 100 100 100 100 100 100 100 100 100 100 
100 100 100 100 100 100 100 100 100 100 100 100 100 100 
##$AQSEQ= 0
##$AQ_mod= 3
##$AUNM= <au_zg>
##$AUTOPOS= <41 >
##$BF1= 250.13
##$BF2= 250.13
##$BF3= 250.13
##$BF4= 250.13
##$BF5= 500.13
##$BF6= 500.13
##$BF7= 500.13
##$BF8= 500.13
##$BYTORDA= 1
##$CFDGTYP= 0
##$CFRGTYP= 5
##$CHEMSTR= <none>
##$CNST= (0..31)
1 1 145 1 1 1 1 1 1 1 1 1 1 1 1 1 1 1 1 1 1 1 1 1 1 1 1 1 1 1 1 1 
##$CPDPRG= <>
##$CPDPRG1= <>
##$CPDPRG2= <>
##$CPDPRG3= <>
##$CPDPRG4= <mlev>
##$CPDPRG5= <mlev>
##$CPDPRG6= <mlev>
##$CPDPRG7= <mlev>
##$CPDPRG8= <mlev>
##$CPDPRGB= <>
##$CPDPRGT= <>
##$D= (0..31)
0 1 0 0 0 0 0 0 0 0.06 0 0 0 0 0 0 0.0002 0 0 0 0 0 0 0 0 0 0 0 0 0 0 
0 
##$DATE= 1174917182
##$DBL= (0..7)
120 120 120 120 120 120 120 120 
##$DBP= (0..7)
150 150 150 150 150 150 150 150 
##$DBP07= 0
##$DBPNAM0= <>
##$DBPNAM1= <>
$$ [...]
##$SUBNAM7= <"">
##$SUBNAM8= <"">
##$SUBNAM9= <"">
##$SW= 20.6930455092707
##$SWIBOX= (0..15)
0 0 3 0 0 0 0 0 0 0 0 0 0 0 0 0 
##$SW_h= 5175.983436853
##$TD= 65536
##$TD0= 1
##$TE= 683.16
##$TE2= 300
##$TE3= 300
##$TEG= 300
##$TL= (0..7)
0 120 120 120 120 120 120 120 
##$TP= (0..7)
150 150 150 150 150 150 150 150 
##$TP07= 0
##$TPNAME0= <>
##$TPNAME1= <>
##$TPNAME2= <>
##$TPNAME3= <>
##$TPNAME4= <>
##$TPNAME5= <>
##$TPNAME6= <>
##$TPNAME7= <>
##$TPOAL= (0..7)
0.5 0.5 0.5 0.5 0.5 0.5 0.5 0.5 
##$TPOFFS= (0..7)
0 0 0 0 0 0 0 0 
##$TUNHIN= 0
##$TUNHOUT= 0
##$TUNXOUT= 0
##$USERA1= <user>
##$USERA2= <user>
##$USERA3= <user>
##$USERA4= <user>
##$USERA5= <user>
##$V9= 5
##$VALIST= <valist>
##$VCLIST= <CCCCCCCCCCCCCCC>
##$VD= 0
##$VDLIST= <DDDDDDDDDDDDDDD>
##$VPLIST= <PPPPPPPPPPPPPPP>
##$VTLIST= <TTTTTTTTTTTTTTT>
##$WBST= 1024
##$WBSW= 4
##$XGAIN= (0..3)
0 0 0 0 
##$XL= 0
##$YL= 0
##$YMAX_a= 262372
##$YMIN_a= -407672
##$ZGOPTNS= <>
##$ZL1= 120
##$ZL2= 120
##$ZL3= 120
##$ZL4= 120
##$ABSF1= 16.522
##$ABSF2= -4.171173
##$ABSG= 5
##$ABSL= 3
##$ALPHA= 0
##$AQORDER= 0
##$ASSFAC= 0
##$ASSFACI= 0
##$ASSFACX= 0
##$ASSWID= 0
##$AUNMP= <proc_1d>
##$AZFE= 0.1
##$AZFW= 0.1
##$BCFW= 0
##$BC_mod= 0
##$BYTORDP= 0
##$COROFFS= 0
##$CY= 12.5
##$DATMOD= 1
##$DC= 0
##$DFILT= <>
##$DTYPP= 0
##$F1P= 14.0000005364418
##$F2P= -0.99999901652339
##$FCOR= 0.5
##$FTSIZE= 32768
##$FT_mod= 6
##$GAMMA= 0
##$GB= 0
##$INTBC= 1
##$INTSCL= 1
##$ISEN= 128
##$LB= 0.3
##$LEV0= 0
##$LPBIN= 0
##$MAXI= 10000
##$MC2= 0
##$MEAN= 0
##$ME_mod= 0
##$MI= 0
##$NCOEF= 0
##$NC_proc= -4
##$NLEV= 6
##$NOISF1= 0
##$NOISF2= 0
##$NSP= 0
##$NTH_PI= 0
##$NZP= 0
##$OFFSET= 16.522
##$PC= 1
##$PHC0= 230.4443
##$PHC1= 8.025895
##$PH_mod= 1
##$PKNL= yes
##$PPARMOD= 0
##$PSCAL= 4
##$PSIGN= 0
##$REVERSE= no
##$SF= 250.13
##$SI= 32768
##$SIGF1= 0
##$SIGF2= 0
##$SINO= 400
##$SIOLD= 32768
##$SREGLST= <1H.CDCl3>
##$SSB= 0
##$STSI= 32768
##$STSR= 0
##$SW_p= 5175.98343685301
##$SYMM= 0
##$S_DEV= 0
##$TDeff= 65536
##$TDoff= 0
##$TI= <Analysis number 999999
Compound Code 99
Book Reference 9
Project Code 9>
##$TILT= no
##$TM1= 0
##$TM2= 0
##$TOPLEV= 0
##$USERP1= <user>
##$USERP2= <user>
##$USERP3= <user>
##$USERP4= <user>
##$USERP5= <user>
##$WDW= 1
##$XDIM= 32768
##$YMAX_p= 432219720
##$YMIN_p= -279988
$$ End of Bruker specific parameters
$$ ---------------------------------
##NTUPLES= NMR SPECTRUM
##VAR_NAME=  FREQUENCY,     SPECTRUM/REAL,   SPECTRUM/IMAG
##SYMBOL=    X,             R,               I
##VAR_TYPE=  INDEPENDENT,   DEPENDENT,       DEPENDENT
##VAR_FORM=  AFFN,          ASDF,            ASDF
##VAR_DIM=   32768,         32768,           32768
##UNITS=     HZ,            ARBITRARY UNITS, ARBITRARY UNITS
##FACTOR=    0.157963299565203, 1,           1
##FIRST=     4132.6476996994, 0,             0
##LAST=      -1043.33573715361, 0,           0
##MIN=       -1043.33573715361, -279988,     0
##MAX=       4132.6476996994, 432219720,     0
$$ Real data points
##PAGE= N=1
##DATA TABLE= (X++(R..R)), XYDATA
$$ [...]
19781A8011n2391J1284l4403L6125O4546k4268k9839N5429K7790k3222o5299q1710
19769i7947o4898l7748Q8091L6285M2223K4062l9494n5311N6226J5580n8357N9478
19757c1810N5046q7324r5236J1272P7887K8785M260l5796K2385J8150J2955m7568
19745f6994O1059L0944o012L3129N1603n8835k9689P358j4165r078M537K4397
19733B8254J6253J4561l3094n520m2288l485k042K3596K6275l4405j5511l9461
19721f6867p108K7949O6329O0673n3628k2204M7825m4156j6728K492k3955k2189
19709e1567l657P7731k2486K1733p551q7014n1650J4192Q244j5721J9343L1832
19697f6571M3381p005K9226L9903k4066l0352j0402j8525j0519M7228J9205O9665
$$ plain form
19781 18011 -34380 -23096 -57499 -21374 43172 18904 -10935 44494 72284 49062 -16237 -97947
19769 -97947 -162845 -200593 -112502 -76217 -33994 -9932 -49426 -104737 -48511 -32931 -91288 -31810
19757 -31810 23236 -64088 -159324 -148052 -70165 -41380 -37120 -72916 -50531 -32381 -19426 -66994
19745 -66994 -5935 25009 18997 52126 103729 44894 15205 22563 8398 -680 3857 28254
19733 28254 44507 59068 25974 20454 -21834 -25319 -27361 -3765 22510 -11895 -27406 -66867
19721 -66867 -73975 -46026 20303 80976 27348 5144 52969 8813 -7915 -5423 -29378 -51567
19709 -51567 -55224 22507 21 21754 14203 -72811 -124461 -110269 -102025 -117746 -98403 -66571
19697 -66571 -23190 -30195 -969 38934 14868 -15484 -25886 -44411 -54930 -7702 11503 81168
19685H1168n835P039J4098q112p2732P716N799k3666J0586J0047m8470J6661M0849
19672C5148j3671K191Q604O40j0417j2010K8588M4535O875m7756j3093l8518l9941
19659d8825n2807L2610Q3319O9548k8165k8178p4456m3299K3573K9915j2403l0376
19647g9544q794l2697M1372J3984m6730r938n4188P351N9932O2668N9863J5309
19635B8588J6839J1474Q752m1886l4694O112K6478N6632l5819M529P9582k6632
19623I9955j7852J9572j20592Q133M6222L217k8063M750N6531l248P882O776M924
19610H8207M40J4796m3020m6096M265K608o2782k2070L0146M2339j4152n7079
19598f2398k3250L1281k1641M0923M9144K9180K8677q7110r022Q1226N6916M3967
$$ plain form
19685 81168 75333 82372 96470 88358 15626 23342 29141 5475 16061 26108 -22362 -5701 35148
19672 35148 21477 23668 32272 32912 22495 10485 39073 83608 90483 42727 29634 -8884 -48825
19659 -48825 -101632 -69022 14297 83845 55680 27502 -46954 -90253 -66680 -36765 -49168 -79544
19647 -79544 -88338 -121035 -79663 -65679 -112409 -122347 -176535 -169184 -109252 -46584 13279 28588
19635 28588 45427 56901 65653 23767 -10927 -4815 21663 78295 42476 47005 126587 99955
19623 99955 82103 101675 -18917 -10784 35438 38655 10592 15342 71873 68625 76507 83283 88207
19610 88207 88647 103443 60423 14327 18592 21200 -41582 -63652 -33506 8833 -5319 -62398
19598 -62398 -85648 -54367 -76008 -35085 14059 43239 71916 -15194 -24216 57010 113926 157893
19586A57893N4307k403r2322m0414R3601J09060k0054q2248j6187M9698P9126
19575B90057R2766J2252K3593N9846j31237j45149P7427O1960j98K6835k8616
19564C39536r44l9358L7063O3693j8659l1697l3891n9080r7341j812J599K1877
19552A80986k7952l5880j2701N3188k7487q6969n88o161n0308N6868P8729N0442
19540A72167L1018n7004q064P075J6062L9536k826k0027L97K2734J661J0278o661
19527B06346N7055L4853n0494p3797k5206N327N1268P8960K6973M2703J19040
19516D73028N5968r0802m2236j5205J4172M766k9197p457o1726o8452J5299Q9710
19504C37868O5242M084j6380n1983p5498o0617L7643M1311l3371j17676L296l1446
$$ plain form
19586 157893 212200 209797 117475 77061 170662 279722 259668 177420 161233 210931 290057
19575 290057 382823 395075 418668 478514 347277 202128 279555 341515 341317 368152 339536
19564 339536 338592 299234 336297 399990 381331 349634 315743 256663 159322 157510 159109 180986
19552 180986 153034 117154 104453 157641 130154 43185 42597 36436 -13872 42996 121725 172167
19540 172167 203185 146181 138117 145192 161254 200790 197964 177937 178334 201068 202729 213007 206346
19527 206346 263401 298254 247760 173963 148757 154084 205352 284312 311285 353988 473028
19516 473028 528996 438194 395958 380753 394925 399691 370494 363037 301311 232859 248158 337868
19504 337868 403110 407194 390814 338831 263333 202716 240359 281670 248299 130623 133919 102473
19492A02473q4954J8050K5831m1709r210J9339j8804m1015L2794M3874M9705l3617
19480F2757j8807k0067p427R549q930n501K3420j6080k2140j9743k2893j7180
19468f3042k9821l2261l1817l1560J3295J07263k7936m7468J9622K8086L0126
19457f5513J884j1386N1761R028l8331L635m8372l5613q832N1275O3867L8409
19445A1812O390k6379q4567l0649k9806l2338L2476O151P8424P0715n5648l9514
19433i2933L0033r274k0625M1402J7825M7320K7799m2006L3039n2147q9622M271
19421a04918P2204p524r376K1995k8258j7336J2246M146l4170K8252L2420k0468
19409e0787n7624J4000P8107Q1410M7915O688o6420m0496K2139K8810p4279j8170
$$ plain form
19492 102473 17519 35569 61400 19691 10481 29820 11016 -29999 2795 46669 96374 62757
19480 62757 43950 23883 16456 26005 17075 11574 34994 18914 -3226 -22969 -45862 -63042
19468 -63042 -92863 -125124 -156941 -188501 -175206 -67943 -95879 -143347 -123725 -95639 -65513
19457 -65513 -63629 -75015 -23254 -14226 -52557 -48922 -97294 -132907 -141739 -90464 -26597 11812
19445 11812 18202 -8177 -92744 -123393 -153199 -185537 -153061 -146910 -68486 2229 -53419 -92933
19433 -92933 -62900 -72174 -92799 -51397 -33572 13748 41547 -459 32580 -19567 -109189 -104918
19421 -104918 -32714 -40238 -49614 -27619 -55877 -73213 -60967 -56821 -90991 -62739 -30319 -50787
19409 -50787 -108411 -94411 -16304 65106 113021 119709 53289 12793 34932 63742 -10537 -28707
19397b8707L3456M6281l0032L2742L2287l5845k1044O8154K1809R605k0206r702
19385I8798M7861N2274n6125o9074k9090P9863J9077N742K459r923l3261l2859
19373G5742m5802L14J2334l8130j9149K9030P2965O8905m4360k6312n6068k0012
19361I457j6677K7828K6416K2002m3778k0443K8855K795n9788o0816P1954P6415
19349F4220K3891K0349m4785q5949L6790P3197n595O2845n405l9687J3090p595
19337A05366L1443k6393m8087p6516j5515K2304N0593M9888j8527J0361K87l4061
19325E1143m6050K7523K0156N323k8860K423N2661L5993k92J5500l8933l254K4980
19312A18313j404j738J7278k0497l5588q2421P995K2269K0410Q962m3180L2685
$$ plain form
19397 -28707 4749 51030 20998 53740 86027 50182 29138 97292 119101 128706 108500 98798
19385 98798 146659 198933 142808 73734 44644 124507 143584 149326 151785 141862 108601 75742
19373 75742 29940 30254 42588 4458 -14691 14339 87304 156209 111849 85537 29469 9457
19361 9457 -7220 20608 47024 69026 25248 4805 33660 36455 -23333 -84149 -12195 64220
19349 64220 88111 108460 63675 -22274 14516 87713 82118 144963 139558 99871 112961 105366
19337 105366 136809 110416 62329 -14187 -29702 -7398 43195 93083 74556 84917 85204 51143
19325 51143 5093 32616 52772 58095 29235 31658 84319 120312 120020 135520 96587 93333 118313
19312 118313 116909 115171 132449 111952 76364 -6057 1938 24207 44617 53579 10399 43084
19300D3084K9516j1572L377J0586r725l877N4643k5364j2137K3415N3542r777
19288A45711n2140n0208Q357J2328m2699P6363N9144R515m8107J4101r876O494
19276A28983K9167o113n3941l9058J2059N9423J3956j5572l1771j936k664m8230
19264D4303l3083j9927J5583k2491Q9351O1558J3282k3220n6029M0485L3083N538
19252A48433o2385l9016m4779L2017L8329K0649k0641K3381K7872J0260J4522
19241A48642J6848P549l4769l5483m0169o8352J5274J03165M6583P1677o6084
19230A64881j17871o2989N0694J7167q3370m834L8767Q2864o4517o81L8354N884
19218F4349M832k6110j2149O156K8834l9042N6191M6673o0001o1769j9603R7951
$$ plain form
19300 43084 72600 61028 64405 74991 65266 61389 116032 90668 78531 101946 155488 145711
19288 145711 93571 43363 51720 64048 21349 97712 156856 166371 118264 132365 122489 128983
19276 128983 158150 152037 98096 59038 71097 130520 144476 128904 97133 95197 92533 44303
19264 44303 11220 -8707 6876 -15615 73736 135294 148576 125356 69327 109812 142895 148433
19252 148433 86048 47032 2253 34270 72599 93248 72607 95988 123860 134120 148642
19241 148642 165490 173039 138270 102787 62618 -5734 9540 112705 159288 230965 164881
19230 164881 47010 -15979 34715 51882 -31488 -36322 2445 85309 20792 20111 58465 64349
19218 64349 69181 43071 30922 37078 65912 26870 83061 129734 69733 7964 -11639 86312
19206H6312J21666J6667n3940K301l2188O535k1602k0846j9532J1646q970n389
19194H2660j9271n566m7546m7008M1839O5028K4309R5166P7847j9736l0880p0282
19182A46560m4763o3923l7464O4969P729k7124M2093j9331k498L5635n340l982
19170I2561k2468L3445O3802l4173n3259M6120N7884K7340P410k0877p1260L7730
19158A64255N4326J357n198j0797p073P437K1643O8320L2285K6820N4690l4091
19146C73974q8335o2325J1054L3422J8365K4863q213K6911P6884K4797r970R25
19134D22352K4917j2815P2889J0851l4196L707k9855K589l000L1454N4411L1907
19122E75211l50K1077k5086k59L4827Q0198M6618l8967j3278L8845N7386O7578
$$ plain form
19206 86312 207978 224645 170705 173006 140818 147353 125751 104905 85373 97019 88049 82660
19194 82660 63389 57823 10277 -36731 5108 70136 94445 189611 267458 247722 216842 146560
19182 146560 101797 37874 410 65379 73108 45984 88077 68746 66248 101883 96543 92561
19170 92561 70093 103538 167340 133167 79908 126028 183912 211252 218662 197785 126525 164255
19158 164255 218581 219938 214740 203943 196870 204307 225950 294270 326555 353375 408065 373974
19146 373974 285639 223314 234368 267790 286155 311018 302805 329716 406600 431397 421427 422352
19134 422352 447269 434454 507343 518194 483998 487705 457850 460439 457439 488893 543304 575211
19122 575211 574861 595938 570852 570593 605420 685618 732236 693269 679991 718836 776222 843800
19110H43800K2635M9416P7593P2285J30193J24759J22921N8839J48948J64648
19100A816037J49897J58052J23539K22757K66133K29344K71450L21525K75093
19091C833827L49707M74895N44383O34024P02275O67197P05065P55137Q96696
19082I563206J112188J200865J448396J678858J990654K323617K487890K371528
19074B4177202J553201J82786q57661r93756m78045J56208R84068J828182K837904
19065B9390089M064929N356068O625996Q425816J0678655J3004684J5425405J7721027
19057A10692669J7840107J1415718k537696j6654884k1748667j9013110j4712585
19050F5281552j1875624r026443n452907k214689K04266J844830K837050K683070
$$ plain form
19110 843800 866435 915851 993444 1065729 1195922 1320681 1443602 1502441 1651389 1816037
19100 1816037 1965934 2123986 2247525 2470282 2736415 2965759 3237209 3558734 3833827
19091 3833827 4183534 4658429 5202812 5836836 6539111 7206308 7911373 8666510 9563206
19082 9563206 10675394 11876259 13324655 15003513 16994167 19317784 21805674 24177202
19074 24177202 25730403 25913189 25055528 24061772 23583727 23739935 24724003 26552185 29390089
19065 29390089 33455018 38811086 45437082 53862898 64541553 77546237 92971642 110692669
19057 110692669 128532776 139948494 137410798 120755914 99007247 79994137 65281552
19050 65281552 53405928 44379485 38926578 36711889 36916155 38760985 41598035 44281105
19042D4281105N64995l235801o726036p526347o074020m084437k354057j188507
19034A3656895n31530k14174J53220L93859O02216O26351O05437O51405Q35156
19025A6778835R50384J123867J444806J794090K293520K787756L297365L953872
19017C4424495M732358N366153N888933N731458M134009P47004k835346l913904
19009E4275160k030027J477935M886156P754149J0544216J3173518J4534392J3809997
19001A18425496J1928335R897099L944475r154482k4341761l0281556k5449703
18994E4967903j6924618j0165127n973925l569029k179559j323873q11311m01858
18986A3618603Q327M10553O82174Q01037Q66708M39616q21346k238951k895527
$$ plain form
19042 44281105 44846100 41610299 34884263 27357916 21283896 17199459 14845402 13656895
19034 13656895 13125365 12911191 13064411 13458270 14060486 14686837 15292274 15943679 16778835
19025 16778835 17729219 18853086 20297892 22091982 24385502 27173258 30470623 34424495
19017 34424495 39156853 44523006 50411939 56143397 60277406 61024410 58189064 54275160
19009 54275160 52245133 53723068 58609224 66363373 76907589 90081107 104615499 118425496
19001 118425496 130353831 140250930 144195405 135040923 110699162 80417606 54967903
18994 54967903 38043285 27878158 21904233 18335204 16155645 14831772 14020461 13618603
18986 13618603 13626930 14037483 14719657 15520694 16387402 16827018 16005672 13766721 10871194
18977A0871194k575925j749648j162453p28179m29072k70859k14873k14012j10405
18968C415768r1305k59768l71099k87895j64278j30406n7290o1352j22323j14226
18958A755826j9150p0503j76024k49043j52753O745n3536n1677l1673R99l6378
18947I22833M4456k402r5574o9214p1603M7154N3191J2796n9440o7557N8462M9191
18935H22293L5449P7067N8471M0949k5911J7405k6979j98724j36641p7007r9503
18924D86869p1529N702L6194l3055l0102J9923M4635N8380K9689k2432o1700K762
18912D65336Q767o4849m3744k923J0009o2258j941j2649k9540J25264n2591n1690
18900B87191K7975K984M1922J4832o7369m78N633k0162n5025n3356N1282N4297
$$ plain form
18977 10871194 8295269 6545621 5383168 4654989 4225917 3955058 3740185 3526173 3415768
18968 3415768 3324463 3064695 2693596 2405701 2241423 2111017 2053727 1992375 1870052 1755826
18958 1755826 1736676 1666173 1490149 1241106 1088353 1095098 1041562 989885 958212 959211 922833
18947 922833 967289 964887 869313 800099 728496 775650 828841 841637 782197 714640 773102 822293
18935 822293 857742 934809 993280 1034229 1008318 1025723 998744 800020 663379 586372 486869
18924 486869 415340 421042 457236 424181 394079 414002 458637 517017 546706 524274 462574 465336
18912 465336 474103 409254 365510 362587 372596 310338 308397 295748 266208 391472 338881 287191
18900 287191 315166 318150 360072 374904 307535 307057 312690 292528 237503 184147 235429 289726
18888B89726M8925K0920m4544k1683J7122j7062k2887q1966m9942Q1755K1587
18877B41951j8972L916K1418k3078J0493n118j0808j9561k6471j1692m035l2811
18865A25232L8443N2402J4404J408r990o7947J9768L4299O2365M6180p8498p6990
18853A61076o6046n3186o5066o492L5280Q5534P6207L4821j6683n6271m9085J0333
18841I0422M5141J7969L7789k0286O1290l5351n7624j02311K53L4789k0374M31
18829E2138M1978M5282j3093m2747M8578J3176l155q014K4928m4967K6811L7014
18817A77929M0117j7399q2764J570k0345o8415o5476P9876J08253J0320k6101
18806A37565J0878K9975m1083o4074J8543o2440k5956N1502n265k9134J5703M228
$$ plain form
18888 289726 338651 359571 315027 293344 310466 293404 270517 188551 138609 220364 241951
18877 241951 222979 226895 248313 225235 235728 230610 219802 200241 173770 162078 158043 125232
18865 125232 163675 216077 230481 231889 221899 153952 173720 208019 270384 316564 238066 161076
18853 161076 95030 41844 -23222 -29714 5566 91100 167307 202128 185445 129174 80089 90422
18841 90422 135563 153532 191321 171035 232325 196974 139350 37039 37292 72081 51707 52138
18829 52138 94116 139398 126305 83558 132136 145312 142157 134143 159071 114104 140915 177929
18817 177929 218046 200647 117883 119453 99108 30693 -34783 45093 153346 163666 137565
18806 137565 148443 178418 137335 73261 91804 29364 3408 54910 49645 20511 36214 40442
18794D0442j800N4752K8176l2168m699l8317O3679j0609J9528L6764M3711j9806
18782A79653m1596m3949J2253n5525n254P870J5216N3250L2799O5682L8616r4345
18770A64670p0233P6965Q3506K9640L9889R2242O2610n9484j07226j02855r021
18759B00703k2959q4915r4764o0125K3925m651R626J5013M445P3409n396j9476
18747C4835N3239l8251n6269L7294N8822P0348k4801n5079k1699M7559M253n2011
18735E8240j6213J050K4311j3752o4407l9624J810M9422Q5181N327l3623l8227
18723A9495o7995K4038J4162n4962K5173L9514o9462N305L4458k360L7088j7487
18711a3033p933L2580K0808N1721k818l8704L9523L2244j9125M815j0433k4026
$$ plain form
18794 40442 38642 93394 121570 89402 84703 46386 110065 99456 118984 155748 199459 179653
18782 179653 138057 94108 106361 50836 45582 53452 68668 121918 154717 220399 259015 164670
18770 164670 94437 171402 254908 284548 324437 416679 479289 419805 312579 209724 200703
18759 200703 177744 92829 -1935 -62060 -38135 -42786 -33160 -18147 -13702 59707 54311 34835
18747 34835 88074 49823 -6446 30848 89670 160018 135217 80138 58439 105998 110251 58240
18735 58240 42027 43077 67388 53636 -10771 -50395 -48585 837 86018 91345 57722 19495
18723 19495 -48500 -24462 -10300 -65262 -40089 -575 -70037 -64732 -30274 -32634 4454 -13033
18711 -13033 -20966 11614 32422 84143 81325 42621 82144 114388 95263 100078 89645 65619
18699F5619l7603j1475J7119L5502L94m2829L3583O833l3387n3151L4115R0920
18687A05640k6062K1384L9427j00370j05847r681l1570k6043M4020P777P334K2211
18675e1780M512l087K1039L1060P245o1283l6662K2780L8126J5238j3910o8715
18663i5437L1017J20223L4714o4045J0470N5535M9166k831j02853l1382j6336
18652a1759l0360n1838n0269l4318N0966P7899K7782J13045P9207R065m3292Q037
18640A44165P588k8384m4909N1116L6237P386l9789J034L3072j1963l7995j08423
18628I135O250L3638M4545P834r4149j9754P1886k6277l1549l2794k4850L289
18616e2796N8709l0931k6450J4216J332k3490o462M0548Q9296J504J2559l3070
$$ plain form
18699 65619 28016 16541 33660 69162 69556 26727 60310 67143 33756 -19395 14720 105640
18687 105640 79578 100962 140389 40019 -65828 -75509 -107079 -133122 -89102 -81325 -73991 -51780
18675 -51780 -47268 -50355 -29316 1744 8989 -52294 -88956 -66176 -28050 -12812 -26722 -95437
18663 -95437 -64420 55803 90517 26472 36942 92477 141643 138812 35959 4577 -11759
18652 -11759 -42119 -93957 -144226 -178544 -127578 -49679 -21897 91148 170355 179420 136128 144165
18640 144165 151753 123369 78460 129576 165813 173199 133410 134444 167516 155553 117558 9135
18628 9135 15385 49023 93568 101402 7253 -12501 59385 33108 1559 -31235 -56085 -52796
18616 -52796 5913 -25018 -51468 -37252 -35920 -59410 -65872 -25324 63972 65476 78035 44965
18604D4965k2751Q183J1083n0088m1161k3413j4655n810O6213j4500P4602O316
18592C8984K42j389k2483J7748M1361J8155j3607l8788r226p8020k4765P9485
18580G697J0581n8717k4176O3791M1249R48P965j9022j6418L5401N0142j09203
18568i762m3438Q2272Q0132J7097n6666k6804m5426j0472L2438n3120N1499N8670
18556G6420O1457r961l0918J6605J2143K1806R5431K9392K9421M0687o0314o0921
18544B21248K4309K2390P3348J4071j0654L9500Q5609o0811m557j657o4659N1513
18532C89650l2166n5233J0469k2868q7555j9827N433L7602k152L163J6010k5604
18520B16922N5441L9908p4326o9975j6262m0950o6741k0125O1971Q4236M1758
$$ plain form
18604 44965 22214 30397 41480 -8608 -49769 -73182 -87837 -93647 -27434 -41934 32668 38984
18592 38984 39226 37837 15354 33102 74463 92618 79011 40223 30997 -47023 -71788 7697
18580 7697 18278 -40439 -64615 -824 40425 41373 49338 30316 13898 49299 99441 -9762
18568 -9762 -53200 29072 109204 126301 69635 42831 -2595 -13067 19371 -33749 17750 76420
18556 76420 137877 127916 96998 113603 125746 147552 242983 272375 301796 342483 282169 221248
18544 221248 245557 267947 341295 355366 344712 384212 469821 409010 404453 402796 338137 389650
18532 389650 357484 302251 312720 289852 202297 182470 187903 225505 223353 226516 242526 216922
18520 216922 272363 312271 237945 167970 151708 110758 44017 23892 85863 170099 211857
18509B11857j7187m8185K5303m1523k9687l2923L4556L5249k3638O2926O996J23292
18497C07036P7359L5235k9626k4764j9467J8101K8932j2554R767K6545K5825k9932
18485D12457o8446o9347n0668N368M4076J5018k5501l7282L6266J06229Q270l0301
18473C46139k7671j15115q2699k2622Q228L8287m7835j33671k7385O0619O3874
18462F0149R471j8134K5478j1675k8127K4661l4786R606J8120K3737l1335o3561
18450a6396J4939P4948J4316N579O8559q3537o3783M261L3476j1121k1465K0022
18438C9798M6884J9507o7195n9856K3375k1021K968k6902l0043L7959K3448n864
18426a6942p2810k3049J5852K2400N5536R3037O1533n2842m4765k1003J926J4951
$$ plain form
18509 211857 194670 146485 171788 130265 100578 67655 102211 137460 113822 176748 183744 307036
18497 307036 384395 419630 390004 365240 345773 363874 392806 380252 390019 416564 442389 412457
18485 412457 344011 274664 223996 229364 273440 288458 262957 225675 261941 368170 376440 346139
18473 346139 318468 203353 120654 98032 106260 144547 96712 -36959 -64344 -3725 60149
18462 60149 69620 51486 76964 65289 37162 61823 27037 36643 54763 78500 47165 -16396
18450 -16396 -1457 73491 87807 93386 161945 78408 14625 18886 52362 41241 19776 39798
18438 39798 86682 106189 38994 -20862 2513 -18508 -15540 -42442 -72485 -34526 -11078 -16942
18426 -16942 -89752 -112801 -96949 -74549 -19013 74024 135557 82715 37950 16947 18873 33824
18414C3824j5577j2861j0303p8254q636K4083P036P6313J6586N3998l8374p6765
18402b8930k7223j2143O9129O3344o0571L5881L2428p1204o186L60m3472k3698
18390g2285O5298O9946K8188m7275j0074p012j6969J9100J3244J5263K4425K4860
18378A06709M551l9545m0015Q955R595N0048p2875K1371K0203j8206L4888j0694
18366G4985P853j098o4481M0897o102l5614k3512k6748l0255k8519O8934M9828
18354B6168K0446K565R745j9M3751m6191l5932O377N5589q5757q4535L7022J0088
18341d0683r2261P6660J20031m8227j08824N1288P403j160L3021o761j5059L8002
18329A3430L3613l1685j5115M2482N748p026k2886P518k6649m9471l1907l4063
$$ plain form
18414 33824 18247 5386 -4917 -83171 -91807 -67724 -60688 15625 32211 86209 47835 -28930
18402 -28930 -56153 -68296 833 64177 3606 39487 71915 711 -5475 -5115 -48587 -72285
18390 -72285 -6987 62959 91147 43872 33798 26786 9817 28917 42161 57424 81849 106709
18378 106709 111260 71715 31700 40655 50250 100298 27423 48794 68997 50791 85679 74985
18366 74985 82838 81740 17259 58156 52054 16440 -7072 -33820 -64075 -92594 -23660 26168
18354 26168 46614 49179 58924 58905 102656 56465 20533 26910 82499 -3258 -87793 -50771 -40683
18341 -40683 -132944 -56284 63747 15520 -93304 -42016 -34613 -35773 -2752 -9513 -24572 13430
18329 13430 47043 15358 243 42725 48473 41447 18561 26079 -570 -50041 -81948 -116011
18317a16011N027N2350K7402n7181o593l516N4228l6163K065K2816P4740l7870
18305a8706p8784L0366L3324L886J7304K5573J307l5849n6454j6282J11052K4822
18293D1559m4442p856L1090P2532k327l6071l5111m5934k5434l7568j9313J18439
18281I564M9625j886o132J5550p1665J2330K0116o031L1827k598N9828L32l7002
18268G3858n716j936M106N5195Q0634k8838m2688r88j0663K9113J8022q821O48
18255A61926Q16l2012J5244m451n9945J67M2910M4277O6089J3355m0460j3968
18243A93948J16266M6011M5509l90l8585r76l4427j9620j7801M0024k7179r476
18231B93304o1634J4195k7921K3556N4001o845P0609N7885O2554m3812j9309Q8801
$$ plain form
18317 -116011 -110984 -58634 -31232 -88413 -95006 -98522 -44294 -80457 -78392 -55576 19164 -18706
18305 -18706 -97490 -67124 -33800 -29914 -12610 12963 14270 -21579 -78033 -94315 16737 41559
18293 41559 -2883 -10739 20351 92883 90556 54485 19374 -26560 -51994 -89562 -108875 9564
18281 9564 59189 57303 51171 66721 -4944 7386 27502 21471 53298 50700 110528 110860 73858
18268 73858 68142 66206 70312 125507 206141 177303 134615 133627 122964 152077 170099 161278 161926
18255 161926 162742 130730 145974 141523 81578 81745 124655 168932 235021 248376 207916 193948
18243 193948 310214 356225 401734 401344 362759 361783 327356 307736 289935 329959 302780 293304
18231 293304 231670 245865 217944 241500 295501 288656 359265 417150 479704 435892 416583 505384
18219E05384P700l9047k7881K7187L6787m1961J0100m7210l8114J5943r767m9112
18207C50009j09401j05922p9288M2859j3426l1554l2932k0954O2724O2441N47
18196A25103J6598k0710L5554o89L3883L1065K7147N29j7394L086r473j3766J1029
18183B21962K8065k7411M1814P8810L9958J267M6680M1569q576l5336L047k5415
18171D06434k4533M8618K3844M9549N1102m3879n9607m46L7690O6300N4340k4340
18159E85072J2058p5701r4906k266M2827N4885m389L5787k1555K0827N5199L7912
18147F45750J5949P9600O1738J08937J29785J35650J31670J23237J68411L18918
18137A919645K62544K92708L50378L93585L88147L84689K88583L77553M86478
$$ plain form
18219 505384 513084 474037 446156 473343 510130 468169 478269 431059 392945 408888 399121 350009
18207 350009 240608 134686 55398 98257 84831 53277 20345 -609 62115 124556 125103
18196 125103 141701 120991 156545 155856 189739 220804 247951 248480 231086 234172 224699 210933 221962
18183 221962 250027 222616 264430 343240 383198 384465 431145 472714 464138 428802 431849 406434
18171 406434 381901 430519 454363 503912 555014 511135 451528 451082 488772 555072 609412 585072
18159 585072 597130 521429 426523 424257 467084 521969 517580 553367 531812 552639 607838 645750
18147 645750 661699 741299 803037 911974 1041759 1177409 1309079 1432316 1600727 1919645
18137 1919645 2182189 2474897 2825275 3218860 3607007 3991696 4280279 4657832 5144310
18128E144310N10614N22587N22831N02952N02473N30098N45274M55284M68723
18119I705146O31586R85887J358121J975526K881072L883620M178994N262024
18111C0861976P703793R230325J0006484J2373322J6017395J2506320j0891826
18104H7807789l0107344k4264783j2767871o600481l823900k403871j607563j171333
18096E060643r74805o80168n01376m06174k76602k47130k89655k18117j98190
18087A268426j52576j51956j30719n9421j30217r9628p2195l778m4434n4439l1630
18076C37433j0800k376J0204Q8898J9347q1338p5871o4451k5669L2819m6363o5140
18064A16693J3994j550L4000J0110l1225J4975k1051l743l8761M3445M9600M7330
$$ plain form
18128 5144310 5654924 6177511 6700342 7203294 7705767 8235865 8781139 9236423 9705146
18119 9705146 10336732 11322619 12680740 14656266 17537338 21420958 25599952 30861976
18111 30861976 38565769 47796094 57802578 70175900 86193295 98699615 87807789
18104 87807789 57700445 33435662 20667791 14067310 10243410 7839539 6231976 5060643
18096 5060643 4085838 3405670 2904294 2498120 2221518 1974388 1684733 1466616 1268426
18087 1268426 1115850 963894 833175 773754 643537 543909 471714 467936 423502 369063 337433
18076 337433 326633 324257 334461 423359 442706 361368 285497 221046 195377 228196 181833 116693
18064 116693 130687 129137 163137 173247 142022 156997 135946 132203 93442 136887 186487 233817
18052B33817o8025j01738n4986O745j135l0665q688R40M7231P345m2007N2300
18040D1134M5375k1875l6426k2368j9420j7049j7376K6947O4137J0607P89Q546
18028F3021n707l2578j60p1250o6547J04002P4599J0465J6370n3536k9386l6029
18016b6736N3725M9806J8795r743p7662l1951K4346J3402M2228K9787l8150k1959
18004B5888K231O901L2879J049M6500l6804o1326m7436K2837N2780k4323k7568
17992f392K8804R0126N8506j1577o655n6814k4838n011j5354l0465L05o921j2920
17979G94L9014l1957k081J8562O4972m7332n8780m9994q747P9581M5627n7824
17967h165k628M3076L2206p562k6589J9340j9264l7038j555J6618M5606M8321
$$ plain form
18052 233817 165792 64054 9068 15813 14678 -15987 -24675 -23735 23496 30841 -11166 41134
18040 41134 86509 64634 28208 5840 -13580 -30629 -48005 -21058 43079 53686 54475 63021
18028 63021 57314 24736 24576 -46674 -113221 -9219 65380 75845 92215 38679 9293 -26736
18016 -26736 26989 76795 95590 85847 8185 -23766 580 13982 56210 85997 47847 25888
18004 25888 28119 35020 67899 68948 115448 78644 17318 -30118 -7281 45499 21176 -6392
17992 -6392 22412 112538 171044 159467 152812 95998 71160 66149 50795 20330 20635 13714 794
17979 794 39808 7851 5770 24332 89304 41972 -16808 -66802 -75549 4032 49659 -8165
17967 -8165 -10793 32283 64489 56927 30338 49678 30414 -6624 -8179 8439 54045 102366
17955A02366m2793J3131N3843L648j1863j7040K4639j1146L2361J292l4757o1447
17943E2234l0375N3161N3217k2632L4676N0870m55K4217m3517j792J5318m1156
17931A43766o5755l8441q656K1713m1751j0040O8447M2822L0903j9840p3574k9774
17919A9820P3804m722q6306J670k9148K8623j7260j6874Q0084K202l8767j3431
17907c05K0049P715k4051l2179L2114J4151K9943m2102r553m945J7061K2950L571
17894C4419j4273k8139K8484k5259o1891K7268J57784P4815o7562j3119m9317
17883F3210o8309k0567N4759j5035n2865L6487Q1690J1336k4666n0538j00654
17872h5152n0535N2157O7126J1291J2741P4485M3758L1198m3536j7655K2888o650
$$ plain form
17955 102366 59573 72704 126547 130195 118332 101292 125931 114785 147146 148438 113681 52234
17943 52234 21859 75020 128237 105605 140281 191151 190696 214913 171396 169604 184922 143766
17931 143766 78011 39570 30914 52627 10876 836 69283 112105 143008 123168 49594 19820
17919 19820 93624 88902 2596 4266 -24882 3741 -13519 -30393 49691 51893 13126 -305
17907 -305 19744 27459 3408 -28771 3343 17494 47437 5335 -4218 -9163 7898 30848 34419
17894 34419 20146 -7993 20491 -4768 -66659 -39391 118393 193208 125646 112527 63210
17883 63210 -5099 -25666 29093 14058 -38807 -2320 79370 90706 66040 15502 -85152
17872 -85152 -135687 -83530 -16404 -5113 7628 82113 125871 157069 113533 95878 118766 112116
17860A12116O7149L1108J1420m4469j9035J547k734j7894K0891l8175j198J0043
17848A30769L608J1309m0002J4047K2523Q2881M3167k369N88P403O892n5405j1930
17835B13481l1940p2323k3206J6232J5841k2240J01866L9436M518j7264L1848
17824B56249l2974L7444M852k9477l1206j9711M9652j440J1286j7528j9684M8325
17812B55788L585K3863P1784n073m5598k495M5231p922k4991j3184p091K7445
17800C21342N9930k5964M0317K1180l9920l1159L3315M3269p189L1706J01905
17789E48732K8961r487k5983o928k9334j0689N0798M6883J5235J3822J07830N1276
17777G81116l1983k4719P9965M4436N4408J10102M8958l7909R206J06842R8436
$$ plain form
17860 112116 179265 210373 221793 177324 158289 159836 157102 139208 160099 121924 120726 130769
17848 130769 134377 145686 105684 119731 142254 225135 268302 265933 266521 273924 280816 225411 213481
17835 213481 181541 109218 86012 102244 118085 95845 197711 237147 241665 224401 256249
17824 256249 223275 260719 265571 236094 204888 185177 234829 233389 244675 227147 207463 255788
17812 255788 259373 283236 355020 349947 304349 301854 347085 339163 314172 300988 293897 321342
17800 321342 381272 355308 395625 416805 376885 345726 379041 422310 415121 446827 548732
17789 548732 577693 568206 542223 535295 505961 495272 546070 592953 608188 622010 729840 781116
17777 781116 749133 724414 804379 848815 903223 1013325 1062283 1024374 1033580 1140422 1238858
17766A238858J91760P1875P2477J43916J88799J63371J48884K18709K46517K49620
17756B934786K74369K87232L34294L90555N55770N32700O31063P47151Q13523
17747G501443R31411J157182J294768J423173J624614J836555J951246K075843
17739A9796235K374224K763297K735451J670959l81805j813184j420786l14179
17731B5410212O75892J567912K437279L477040M924076O350267P612766R519713
17723F1975157J2322641J4904800J7334145K0474660K1426983J2369943r045531
17716A51762798k6126994k6396634j9049798j4695210j2330377q779816m659189
17709C9724780j354891P71372K061069K972006L007689O15608m461583q550996
$$ plain form
17766 1238858 1430618 1502493 1574970 1718886 1907685 2071056 2219940 2438649 2685166 2934786
17756 2934786 3209155 3496387 3830681 4221236 4777006 5309706 5940769 6687920 7501443
17747 7501443 8432854 9590036 10884804 12307977 13932591 15769146 17720392 19796235
17739 19796235 22170459 24933756 27669207 29340166 28958361 27145177 25724391 25410212
17731 25410212 26086104 27654016 30091295 33568335 38492411 44842678 52455444 61975157
17723 61975157 74297798 89202598 106536743 127011403 148438386 160808329 151762798
17716 151762798 125635804 99239170 80189372 65494162 53163785 44383969 39724780
17709 39724780 38369889 39141261 41202330 44174336 47182025 47797633 43336050 34785054
17701C4785054q529286n984698l636516j998557j067771n87145j24393J85877
17693A3042565J98028J87630K47570N28073O85954P30823R53211J254827J560976
17684A9389657J803396K192092K551520L038331L702005M380716M989392N727637
17676D7774746O062724M556932N22360l794041m299669j384078K376414N443735
17668E7259123P683261J0032575J2703878J3594152J1747298J0226648J0046801
17661A33293736M178291j2553225k9194002l0653950k1365233j2613582p340503
17654B3751532m425090k805686j811293j223710q48942o57321k92985J15282N44137
17645A2345924Q69158J091887Q05858o16428k279930k779979k126406j330742
$$ plain form
17701 34785054 26255768 20271070 16634554 14635997 13568226 12981081 12856688 13042565
17693 13042565 13240593 13428223 13675793 14203866 14889820 15620643 16573854 17828681 19389657
17684 19389657 21193053 23385145 25936665 28974996 32677001 37057717 42047109 47774746
17676 47774746 53837470 58394402 58916762 55122721 50823052 49438974 51815388 57259123
17668 57259123 64942384 74974959 87678837 101272989 113020287 123246935 133293736
17661 133293736 137472027 124918802 95724800 65070850 43705617 31092035 23751532
17654 23751532 19326442 16520756 14709463 13485753 12636811 11979490 11686505 11801787 12345924
17645 12345924 13215082 14306969 15112827 14496399 12216469 9436490 7310084 5979342
17637E979342q06343n98383m95418l90871l47780l62823l25211l10465j70413
17628B171635j58647j73747j13489r1048n1319p2375J9836L9485J8015K8712N7839
17617A674897l672k9490o8400k10593j38458j18503r7712m0317q9351l3460j0616
17606H34325p1008q0972P878K4426N309j2701m9736M944J0961k4502J1842j2897
17594F47869L2257K8489l7141m8310K7825N2521n4728m7398K5722j1200N4853
17583F70759O4874N6618R0835R3994R2383Q6903r080p4047r3308m1513j16620
17572H21798j33180n0047j2628L8236N967j4053m1855Q8713R8296J07902N9697
17561I68846N7724K9326o8707j22374j47091j63859o4709r2746k4423K1128Q691
$$ plain form
17637 5979342 5172999 4574616 4079198 3688327 3340547 2977724 2652513 2342048 2171635
17628 2171635 2012988 1839241 1725752 1634704 1583385 1511010 1530846 1570331 1588346 1617058 1674897
17617 1674897 1671225 1641735 1573335 1362742 1224284 1105781 1008069 967752 878401 844941 834325
17606 834325 763317 682345 690223 714649 719958 707257 657521 662465 673426 648924 660766 647869
17594 647869 680126 708615 671474 623164 650989 703510 648782 601384 627106 615906 670759
17583 670759 735633 792251 883086 977080 1069463 1156366 1147286 1073239 979931 938418 821798
17572 821798 688618 638571 625943 664179 670146 656093 614238 702951 801247 909149 968846
17561 968846 1026570 1055896 987189 864815 717724 553865 489156 396410 371987 393115 401806
17550D01806J4140O0991j0356j2855L0291n458q111n464m7145o6761n1262l4170
17538B65646n6690j0598j8743l3474J4463L3449j171J2573n9477k4101k8850M3771
17526A36798l7233K6654M1264L3861M2532n7006q4332r3516L8618J1876k9260
17515C0256J2368O3502K1869k5028n0144M6181k106K0687j0066m956j2707J1698
17503A01554l1470K2495M9165J0669k9744K9706l073j8844j2664m5932n7839K7722
17491D1745O8466j7668L6176k9720j5757r8137k5544R2651m9287n3263J899L0387
17479a8052N6730L5788K7868N246j3473l3411O518l1588K106K0134m4484k6533
17467a3151M2624m9493j7655N4942l0229q2595j128N8256P1764M8275Q589r4700
$$ plain form
17550 401806 415946 476937 466581 453726 484017 478559 470448 464984 417839 351078 299816 265646
17538 265646 208956 198358 179615 146141 160604 194053 192882 205455 145978 121877 93027 136798
17526 136798 99565 126219 167483 201344 243876 186870 102538 9022 47640 59516 30256
17515 30256 42624 106126 127995 102967 52823 99004 96898 117585 107519 102563 89856 101554
17503 101554 70084 92579 141744 152413 122669 152375 149302 130458 117794 71862 14023 41745
17491 41745 110211 92543 128719 98999 83242 -14895 -40439 52212 2925 -50338 -48439 -18052
17479 -18052 38678 74466 102334 107580 94107 60696 67214 35626 37732 57866 13382 -13151
17467 -13151 29473 -20020 -37675 17267 -12962 -95557 -96685 -38429 33335 81610 90199 -4501
17455d501j9393j7856n0987k493K9770N8793P5624N4291L8161P9687Q0402N6816
17443C78314K502K1003K9604O6684Q398j25923j52404j37265k994k891P126n400
17431H6754L6463k8850l2360K5204o7092O398O6224l2407j3680j6535n7661m6051
17419g3593O1865o105l1057m48J0471N9512K0505k0475L2504n0850k5674N0785
17407B7440N6925M292J3629O850j0246m7919L8978n162k4258n3990l4565m6459
17395g4485m6736L4721N5178O1372L2502m9168n8991q0770k9429n6747Q2310N9864
17383g0379O3632N1617P0408m600k530L2538r3450J7557N904J868q6470k8875
17371d2780J2646K0252j931K0899K6424k1762r4261o7138J7025P2986m8877j8677
$$ plain form
17455 -4501 -23894 -41750 -92737 -95230 -65460 -6667 68957 123248 161409 241096 321498 378314
17443 378314 380816 401819 431423 498107 506505 380582 228178 90913 87919 85028 92154 86754
17431 86754 123217 94367 62007 87211 20119 26517 92741 60334 46654 30119 -27542 -73593
17419 -73593 -11728 -17833 -48890 -49338 -38867 20645 41150 20675 53179 2329 -23345 27440
17407 27440 84365 88657 102286 109136 98890 50971 89949 84787 60529 6539 -28026 -74485
17395 -74485 -121221 -86500 -31322 30050 62552 13384 -45607 -126377 -155806 -212553 -130243 -70379
17383 -70379 -6747 44870 115278 110678 108148 140686 47236 64793 70697 72565 -13905 -42780
17371 -42780 -30134 -9882 -11813 9086 35510 13748 -80513 -147651 -130626 -57640 -106517 -125194
17359a25194L6980L1867P3049O312n9516Q74k6427L464L2898O9581K5899o2480
17347G307k8770k1837K628j2452n0974J1887M6326M5290j4641k9612K1996K1912
17335i40N427L0489p4903K8645N7495q5j1240o4977K3137k4720N944j0324J9283
17322a6769L2093M647J0858J0316k5107l3023m343Q912K4657K7498K0256J376
17310F1371n5786j1319J7758J6694K4738n2046m5158r3938L3480R3720j881p0592
17298h2959k4580j5509L6712J07842M6679l878L6028N2587n6525k8831M3898K2477
17286A33941o7273K5228O8106n7647o8389p6822N730N8938K2601K6381L7992k1088
17274H7698o1532q659J5919J8327j3562O4369l0112L1480j4001n7136k1339n602
$$ plain form
17359 -125194 -88214 -56347 16702 23014 -36502 -35628 -62055 -58591 -25693 43888 69787 7307
17347 7307 -21463 -43300 -40672 -53124 -104098 -92211 -45885 -595 -15236 -44848 -22852 -940
17335 -940 4487 34976 -39927 -11282 46213 46128 34888 -30089 -6952 -31672 -25728 -36052 -16769
17322 -16769 15324 19971 30829 41145 16038 -16985 -21328 -12416 12241 39739 59995 61371
17310 61371 5585 -5734 12024 28718 53456 1410 -43748 -137686 -104206 -10486 -12367 -82959
17298 -82959 -107539 -123048 -86336 21506 68185 64307 100335 152922 96397 67566 111464 133941
17286 133941 66668 91896 160002 102355 33966 -42856 -37126 21812 44413 70794 108786 87698
17274 87698 26166 17507 33426 51753 38191 102560 72448 103928 89927 32791 11452 5850
17262E850n9936l086M8571l5604k3262J2668k3580k155O2841J1215K083L3279
17250B8884N5290l4437r328n0283o9950l880K5488J6692N1848K8090k909m1806
17238f301j869M524k3913O7202Q8024K1743j06776J8611L5722J6692q733l1789
17226G3137O6768J106l7522K546r26m0405O3262M5081M7950Q3963P8603J4026
17214C97589O2999O6128o4466p0398R106N2890J1489p958n0663m9634l3796k0848
17202C02438J6372O7597m0459m6817P5138Q6688L7123j02586j11732r1715o9028
17191A23019j22796j0654K9661k25o3606m1726K0151R6753J3228j1451M3465n5144
17179B0675l3234l612J5011L0675m7676J6601J00551Q5250K269j5799m7572K2756
$$ plain form
17262 5850 -54086 -57172 -8601 -44205 -67467 -54799 -78379 -80534 -17693 -6478 -4395 28884
17250 28884 84174 49737 40409 -9874 -79824 -83704 -58216 -41524 10324 38414 35505 -6301
17238 -6301 -8170 -3646 -27559 39643 127667 149410 42634 61245 96967 113659 104926 73137
17226 73137 139905 141011 103489 106035 105109 64704 127966 173047 220997 304960 383563 397589
17214 397589 460588 526716 462250 391852 400958 453848 465337 457379 406716 357082 323286 302438
17202 302438 318810 386407 345948 299131 374269 460957 498080 395494 283762 192047 123019
17191 123019 223 -10431 19230 19005 -44601 -86327 -66176 30577 43805 32354 75819 20675
17179 20675 -12559 -16171 -1160 29515 -18161 -1560 98991 184241 186510 170711 123139 145895
17167A45895J18431L4574K0824R465J508k8894J0889R329K3058R7731l8000n8519
17155C46291J0074M828m3905m3180m7728q6030J8858L3926r106k243l8454P0914
17143B14245L8983J2445L8534N5136L8443n6j0069o1329j20424r7869J658n9970
17131D9727j2943J6340k4022n1769l7282L923L5390L2742L0500K7046l8288J6230
17119D7594J2040j129N922J0798j5146J2727q6899k5027k4861Q8042M025K7171
17107E5257J5125L480K4020n1888p2870R861j0066k2342J0205n3408j6524l2926
17095a42076K657K2735N6602Q1536m5364o4488J8867O3613K9957j8588P2291P1570
17083A49312k62m8411o8119m6638k9381l5881L001p31j9136N9143j3191n6466
$$ plain form
17167 145895 264326 298900 319724 329189 330697 301803 312692 322021 345079 442810 404810 346291
17155 346291 356365 361193 317288 274108 226380 140350 159208 193134 184028 181785 143331 214245
17143 214245 253228 265673 304207 359343 397786 397730 387661 326332 205908 108039 109697 49727
17131 49727 36784 53124 29102 -22667 -59949 -56026 -20636 12106 42606 69652 31364 47594
17119 47594 59634 58505 64427 75225 60079 72806 -14093 -39120 -63981 24061 28086 55257
17107 55257 70382 73862 97882 45994 -26876 -17015 -27081 -49423 -39218 -92626 -109150 -142076
17095 -142076 -139419 -116684 -60082 21454 -23910 -88398 -69531 -5918 24039 5451 77742 149312
17083 149312 149050 100639 32520 -14118 -43499 -79380 -76379 -77110 -96246 -37103 -50294 -106760
17071a06760M8171O3168l8987m2099R8750L0560q4938l5432l3703M6715Q637M3669
17059b249K9715o158p1984j6385M3948P4180j6229j7933K1714J5977l134m653
17047D6809j5841k3546k9978k0461j7746m9061l8588m1244J22335N3390l8806
17036e2737k7196N2661m7348j6572O1563M1706n0879k2999L8663o338J1183O818
17024a1475l4009J8117K9672j113J08973N2810l4910r9117m6314k6919P4002J6289
17012D6006k0846j9516m6014Q39J1438J0934P343K9222l2383K030k3730k4573
17000e9250O616L8375J7788j3046k7095j3882M6484K2999n8269J5340L6962n2949
16988c9927n0506N4105O032k8590m1803m5999Q0518P1089k2884L6114Q7850L479
$$ plain form
17071 -106760 -58589 4579 -34408 -76507 22243 52803 -32135 -67567 -101270 -54555 -45918 -2249
17059 -2249 27466 21308 -50676 -67061 -23113 51067 34838 16905 38619 54596 51462 46809
17047 46809 30968 7422 -22556 -43017 -60763 -109824 -148412 -189656 -67321 -13931 -52737
17036 -52737 -79933 -27272 -74620 -91192 -29629 12077 -38802 -61801 -23138 -29476 -18293 -11475
17024 -11475 -45484 -27367 2305 1192 110165 162975 128065 28948 -17366 -44285 29717 46006
17012 46006 25160 5644 -40370 -39531 -28093 -17159 -9816 19406 -12977 -10947 -34677 -59250
17000 -59250 -52634 -14259 3529 -9517 -36612 -50494 -4010 18989 -39280 -23940 13022 -39927
16988 -39927 -90433 -36328 -30296 -58886 -100689 -146688 -66170 4919 -17965 18149 105999 109478
16976A09478m1742J9390J4898k0169n6577l8219r183j1910n8118l2734K6724J10002
16964A1840N2126J9264n7083O521J4927q5893l4367r491M3642O3716p724j9774
16952b296M193L1867N9638n7310n3665M0458n0933l4255j739K9270k991J9762
16940a8001O0384J3041j5303L2099N816l3227j5429Q102o847J5025M7233L3165
16928A26058n3005k6039m6768p2828q2352P6714R0454L2816K282j2288l525O662
16916C8181M1151l593J485j8333r3902m5297j4974Q405j4770M3767O3227N4099
16904E9446j2545o1819K9054R4841l4100r2386o7159q0589J6968N6572j561J22765
16892B9487J1649p840k6474j4588l4053N7888l4701J6009K5749P7378J9876L9340
$$ plain form
16976 109478 67736 87126 102024 81855 25278 -12941 -22124 -34034 -92152 -124886 -98162 11840
16964 11840 63966 83230 26147 32668 47595 -38298 -72665 -82156 -38514 25202 17478 -2296
16952 -2296 1897 33764 93402 36092 -17573 22885 -28048 -62303 -64042 -34772 -37763 -18001
16940 -18001 42383 55424 40121 72220 78036 44809 29380 37482 30635 45660 92893 126058
16928 126058 73053 47014 246 -72582 -154934 -78220 12234 45050 47332 35044 31519 38181
16916 38181 79332 75739 77224 58891 -35011 -80308 -95282 -86877 -101647 -57880 5347 59446
16904 59446 46901 -14918 14136 108977 74877 -17509 -84668 -165257 -148289 -91717 -93278 29487
16892 29487 41136 33296 6822 -7766 -41819 16069 -18632 -2623 23126 100504 120380 159720
16880A59720j6514l7893q4561p0900o6886L0803N0338k876k6553j4725Q9017M4323
16868E3293J6189j21557P283K8598K7365m4146n8359N900M0004K9847J5255j9678
16856b0006l0204J4705K2087j4241J1165l280j8574K3368M014k1249L7394M9949
16844E5128M0787l7703k82j4937o4946J848p496L2473q361j4676J6497j927j1202
16831a4797N4354O915N844j0361j6046N6396k4286r966l278K878l5340L4009l1020
16818A5302m7277j9835r025o5200l1431J1286Q6328L9192K9528L4316o5045l9187
16806f1048N2821Q942l4223N965M288r785N4447K1681n9911j8303l21n8417K8533
16793f5331l8800r6074J7887P2394O7333K5932l3785j2986M823Q2531J0785m8918
$$ plain form
16880 159720 143206 105313 20752 -50148 -117034 -86231 -35893 -38769 -65322 -80047 8970 53293
16868 53293 69482 -52075 -44792 -16194 11171 -32975 -91334 -85434 -45430 -15583 -328 -20006
16856 -20006 -50210 -35505 -13418 -27659 -16494 -19774 -38348 -14980 -10966 -32215 5179 55128
16844 55128 95915 58212 57930 42993 -21953 -20105 -27601 4872 -3489 -18165 -1668 -3595 -14797
16831 -14797 39557 46472 52316 41955 25909 82305 58019 48053 44775 47653 12313 46322 15302
16818 15302 -31975 -51810 -60835 -126035 -157466 -146180 -59852 -20660 8868 43184 -21861 -61048
16806 -61048 -8227 715 -33508 -27543 -23255 -33040 21407 43088 -16823 -35126 -35447 -93864 -65331
16793 -65331 -104131 -200205 -182318 -109924 -42591 -16659 -50444 -63430 -58607 23924 34709 -14209
16781a4209q674M8384n5913l0441k3577q760j0737M9637k373q1384M973l2079
16769a65153L2253L0300N5180O6920j2311m6541m2576k8566K0246l1386p742l3473
16757a62849J2466M4133N6749n473k0541m8372P3742R732l2578n115L2757k0030
16745f5379M036j1995J2439n7887k0678L7386M4733Q4196K9655r0239r2173J3934
16733a11972P4296m0565O406M3692P192k0570j1443P1763j5455m5781Q743j7174
16721e0868l953m6432L235L9594L1596J1267N008L2765l337k1005l8482k3249
16709f3861M1140o0634l1144Q281O0491k6867m12M5790K0214M1471M8432j6952
16697F5949J4915m720J5348q3959j8991K5247k1595J5089j0164r0733m5925k2879
$$ plain form
16781 -14209 -22883 25501 -30412 -60853 -84430 -93190 -103927 -54290 -56663 -138047 -133074 -165153
16769 -165153 -132900 -102600 -47420 19500 7189 -39352 -81928 -110494 -90248 -121634 -129376 -162849
16757 -162849 -150383 -106250 -49501 -54974 -75515 -123887 -50145 -40413 -72991 -78106 -45349 -65379
16745 -65379 -61343 -73338 -60899 -118786 -139464 -102078 -57345 26851 56506 -33733 -125906 -111972
16733 -111972 -37676 -78241 -71835 -28143 -20951 -41521 -52964 18799 3344 -42437 -33694 -50868
16721 -50868 -54821 -101253 -98018 -58424 -26828 -15561 -10553 22212 18875 -2130 -40612 -63861
16709 -63861 -22721 -83355 -114499 -106218 -45727 -72594 -73006 -27216 -7002 34469 82901 65949
16697 65949 80864 76144 91492 7533 -11458 13789 -7806 7283 -2881 -93614 -139539 -162418
16685a62418P2355p0391j2994J21626M4448o800l7183j0297j2052j9939J5322
16674g8323J1560j2159k1827M2813M7089p3289L5809O2394N9524l209l7258j3149
16662A9975m7825R15k8980q7923J15946J31633L8452m2351R832L4927k4556n8795
16650F1250o0376L5061p1889n3557L4240M2778O1984j7842L6642K2875J1564L3287
16638A36017N214k8852l4475n7699N2312O0072J0696j12732j8738M3033m7136
16627G712k3929O2879M7457j9033L406p3747q6616j3355J12310O5316j3278j4282
16615E4840m4039L9884j678P81k4463n7k1224o1693N0768Q4007N5475o1748l7847
16602C3006n4197l3777l4193K9018M1407o1135m2469r896M3991L7661J1146O2162
$$ plain form
16685 -162418 -90063 -160454 -173448 -51822 -7374 -14174 -51357 -61654 -73706 -93645 -78323
16674 -78323 -66763 -78922 -100749 -57936 -10847 -84136 -48327 14067 73591 70382 33124 19975
16662 19975 -27850 -26935 -55915 -143838 -27892 103741 142193 99842 109674 144601 120045 61250
16650 61250 874 35935 -35954 -89511 -55271 -12493 49491 31649 68291 91166 102730 136017
16638 136017 141231 112379 77904 20205 72517 132589 143285 30553 11815 54848 7712
16627 7712 -16217 46662 94119 75086 78492 4745 -81871 -95226 17084 82400 69122 54840
16615 54840 10801 50685 49007 49788 25325 25268 4044 -57649 -6881 77126 132601 70853 33006
16602 33006 -21191 -54968 -89161 -60143 -18736 -79871 -122340 -132236 -88245 -50584 -39438 22724
16590B2724k5449k4306K1892J15752N2113o9116m7835J00661k1534o1504n4139
16579I259p1480m9737J1883K8842Q410l2616k3175l1423L696L3531L3591n320
16567h4539L3354j4000J8823l5835K6255L8700K2398K640J505j8863n9576K1030
16555d8108k1193m151M265M4216K1995L8790J9106l1870m910O6709L2664m4914
16543G2599l2323K2873K5952k0502k4190j3360J1268K6133j0989l6545m0362l1410
16531e0856L7897k0437l0633O383N9358n930n8163m2248m037L5179J3394m1368
16519a01461N0181N4434r897k7739n327M4383M5305L1449n3516J0555j8887l9063
16507a9583k1250l4948k902J348J4717M9089j5841K5501o1124j8390L3901M1247
$$ plain form
16590 22724 -2725 -27031 -5139 110613 162726 93610 45775 146436 124902 63398 9259
16579 9259 -62221 -111958 -100075 -71233 -62823 -95439 -118614 -150037 -146341 -112810 -79219 -84539
16567 -84539 -51185 -65185 -46362 -82197 -55942 -17242 5156 7796 9301 -9562 -69138 -48108
16555 -48108 -69301 -73452 -69187 -24971 -2976 35814 54920 23050 18140 84849 117513 72599
16543 72599 40276 63149 89101 68599 44409 31049 42317 68450 57461 20916 -19446 -50856
16531 -50856 -12959 -33396 -64029 -57646 1712 -4218 -62381 -104629 -108666 -73487 -60093 -101461
16519 -101461 -51280 3154 -6743 -34482 -39809 4574 49879 81328 27812 38367 19480 -19583
16507 -19583 -40833 -75781 -78683 -77335 -62618 -13529 -29370 -3869 -64993 -83383 -49482 -8235
16495h235n0915N6986Q9789J1733j21677k126J4022k8696K4114m620K8855m0189
16483c0959L711K8201K6084K5013J1216o4447p5814L562L5543j9645K3118K4652
16471i765K0880N0973q263q1511j08283J5830O1024M3251k9173k2007J4728J9507
16459c2809j9847n6972M6739M3300J6723Q7613j1156p4899l3419N2007l7493j9959
16447d0172P8811J1178o7328n6592R33J0761j0785P3212K2790o8274r1190O9614
16435f7042N2815L5084j6626m778p4382o7484K8960L0805O9186J46998K4432m2427
16423A15541k2019m9023q052j6724P995M5549Q8978M7929n5851n6104r7217n9411
16411e8409m4711M8508N4159o0990j9723j3171K8131K5425N9863j342l2151j0947
$$ plain form
16495 -8235 -59150 -2164 87625 99358 -22319 -24445 -10423 -39119 -15005 -19625 9230 -30959
16483 -30959 -27248 953 27037 52050 63266 -1181 -76995 -73433 -37890 -57535 -34417 -9765
16471 -9765 11115 62088 53825 -27686 -135969 -120139 -59115 -15864 -45037 -67044 -52316 -32809
16459 -32809 -52656 -109628 -62889 -19589 -2866 84747 73591 -1308 -34727 17280 -20213 -40172
16447 -40172 38639 49817 -17511 -74103 -73170 -62409 -73194 18 22808 -45466 -136656 -67042
16435 -67042 -14227 20857 4231 -547 -74929 -142413 -113453 -82648 -13462 133536 157968 115541
16423 115541 93522 44499 36447 19723 27718 73267 162245 210174 154323 98219 1002 -58409
16411 -58409 -103120 -54612 -453 -61443 -81166 -94337 -66206 -40781 19082 17740 -14411 -25358
16399b5358l5108n072J3199M1956K9411K1311j2979p4602j3293N9898J0824m7024
16387c6837m1391N8029k4881k0363N536M4695j5337l1941R3963M751l1335n5405
16375e0516k6406N2305L5672l0993P7560K3412j9346l4050p4995m4903j176N5176
16363c8260M5700n672o128k6361k2382r119M6777q880N0298l1817q157k2501k1627
16350e8129k228M0740K0380l7336J0030K5876p190K5263L9807p6181k7594R8536
16338E1974M0849k9399j3087l3212l9686K8043J7560q813p442O0911P4616K2162
16326A64476K0016n3047m7536j9355n2638j06429j16363p44Q5290l6536m51R458
16314a53859m473J12312M485J3179O1095M5480J863n8897l7974L7046r397o4212
$$ plain form
16399 -25358 -60466 -65538 -52339 -10383 19028 40339 27360 -47242 -60535 -637 10187 -36837
16387 -36837 -78228 -20199 -45080 -65443 -59907 -15212 -30549 -62490 31473 36224 4889 -50516
16375 -50516 -76922 -24617 11055 -19938 57622 81034 61688 27638 -47357 -92260 -93436 -38260
16363 -38260 7440 1768 -4360 -30721 -53103 -62222 -15445 -24325 25973 -5844 -14001 -36502 -58129
16350 -58129 -60357 -19617 763 -36573 -26543 -667 -7857 17406 57213 -18968 -46562 51974
16338 51974 92823 63424 50337 17125 -22561 5482 23042 14229 6787 67698 142314 164476
16326 164476 184492 131445 83909 64554 11916 -94513 -210876 -211620 -126330 -162866 -163317 -153859
16314 -153859 -158332 -46020 -41535 -28356 32739 78219 80082 21185 -16789 20257 10860 -53352
16302e3352k7508P0004N0702J6915m4526o344n0179l0204J8731j8516L5333k6323
16290f5267l2175J3510j5185l0524L3476J5788r664L9358K0073k1586J5884L2938
16278c374J9396j011j1207k4398l0219L1675Q8409K9956p3038m4542M8062p9419
16266d9710m2206L0739M1988k293L654q875J7189M7648P2562k4481j11480k9713
16254e4978J4828J6516P408o390J4515j3141L2047L1308K7076k7350m6234p456
16242a1851n2821K3153L3509K4567R020j92P4919K2231k9309p0697o9627m7991
16230i5089l1995J9503J7644m7972N3503K3248L7896l4134k758J6473j9450O7630
16218D499N8841k6018L4606j3193j01961n1206L5677O3181J2206o163p2351j6393
$$ plain form
16302 -53352 -80860 -10856 39846 56761 12235 5891 -44288 -74492 -55761 -74277 -38944 -65267
16290 -65267 -97442 -83932 -99117 -129641 -96165 -80377 -90041 -50683 -30610 -52196 -36312 -3374
16278 -3374 16022 15011 3804 -20594 -50813 -19138 69271 99227 26189 -18353 29709 -49710
16266 -49710 -91916 -61177 -19189 -21482 -17828 -26703 -9514 38134 110696 86215 -25265 -54978
16254 -54978 -40150 -23634 -16226 -22616 -8101 -21242 10805 42113 69189 41839 -4395 -11851
16242 -11851 -64672 -41519 -8010 16557 25577 25385 100304 122535 93226 22529 -47098 -95089
16230 -95089 -127084 -107581 -89937 -137909 -84406 -61158 -23262 -57396 -60154 -43681 -63131 4499
16218 4499 63340 37322 71928 58735 -43226 -94432 -58755 4426 16632 10469 -61882 -78275
16206g8275K2043K7796q396j5633l3151M7509K854m3364J3063M0593L7756n7255
16194d4460n7377J107L5811m957j0191M1965K3297o1062q0799R489N1009L7724
16182e8444l8689n6395o693J6402O4273O9626j1354j22031J4604L8496K66j4509
16170a04448o2354l6630P1870N5443k844o924p653M6242j3193j0124m2128N86
16158a12157J5242n226N6613J0632J9814K5587J4522o2587Q120K8014m3508P7625
16146C2691N6750m9355j1981Q0340J3922q7451p6724o843J2772Q432P71K0568
16134f108J3885K1031l741l1640q9372m4631N3081j8288R9640J09941J0319r5904
16122A8213j05033o844J7181J0505J2255Q691J3011k6729J6809M37r483J9476
$$ plain form
16206 -78275 -56232 -28436 -36832 -52465 -85616 -38107 -35253 -78617 -65554 -24961 12795 -44460
16194 -44460 -101837 -100730 -64919 -69876 -80067 -38102 -14805 -75867 -156666 -147177 -96168 -58444
16182 -58444 -97133 -153528 -160221 -143819 -79546 -9920 -21274 -143305 -128701 -90205 -89939 -104448
16170 -104448 -166802 -203432 -131562 -76119 -78963 -85887 -93540 -47298 -60491 -70615 -112743 -112157
16158 -112157 -96915 -102141 -45528 -34896 -15082 10505 25027 -37560 -29440 -1426 -44934 32691
16146 32691 89441 40086 28105 108445 122367 34916 -41808 -48651 -35879 -27447 -26676 -6108
16134 -6108 7777 28808 25067 -6573 -95945 -140576 -87495 -105783 -6143 103798 114117 18213
16122 18213 -86820 -93664 -76483 -65978 -53723 -45032 -32021 -58750 -41941 -41504 -50987 -31511
16110c1511k9859J1659J3555K3559m163o9364k3105O2296l2094j7871J491l1737
16098a27144N3455M2224L2385M175J427J6318M5931k0806k8366o496K293m5517
16086c0121J6852Q1657N3832L4573r2057p2452l2149k3536n1017J3440M3408J5111
16074d2459O260L3655M7846m1640n2119R836l3617Q044l8069L969K7215J8714
16062e2365J2527o660l8162p863o4304r935P9845J09525L7868n580j4686K5391
16050F5601N882n2416m7210O614L8371K7775L8259j9963M1146M9888q1162n7234
16038A5551J110m1699o3020K66l4388O3181M0293M2388N2915m012L8396p0059
16026D0922k3718L4984o0636M8898M9016n2103l7132r123o005o2658j3562k6025
$$ plain form
16110 -31511 -61370 -49711 -36156 -12597 -16760 -86124 -109229 -46933 -79027 -96898 -95407 -127144
16098 -127144 -73689 -31465 920 5095 6522 22840 68771 47965 19599 13103 15396 -30121
16086 -30121 -13269 68388 122220 156793 64736 -7716 -39865 -63401 -114418 -100978 -57570 -42459
16074 -42459 -36199 -2544 45302 3662 -48457 -38621 -72238 -64194 -102263 -98294 -71079 -52365
16062 -52365 -39838 -46498 -84660 -92523 -156827 -166762 -86917 22608 60476 54896 40210 65601
16050 65601 71483 19067 -28143 -21529 16842 44617 82876 62913 104059 153947 72785 15551
16038 15551 16661 -25038 -88058 -87792 -122180 -58999 -18706 23682 76597 72585 110981 40922
16026 40922 17204 52188 -8448 40450 89466 37363 231 -8892 -14897 -77555 -91117 -117142
16014a17142O6831l9670j6654M9680k8588L3904K9898N2714K1657j6375o226n049
16002B4980J7047m1569k7851j1404m3876M7033K9364M5212J7176n0411l9901L9732
15990E532N2633m7684l3359j2156K2151K0536n143M0852Q588l2162J0610K8501
15978E8899j9206M0476n84k3195n676n1883n4419O9127O162M976L8064N15k4887
15965C8369o4034p5009l4303L4372K8801P438l644J6725L4613q5341j284O0235
15953d3062N8174l4815l3779j5649R206N6336K2588k8729q2850m3809K3464M215
15941a08710J1203O5512R347j7104p9402Q216M9750M4289k8102M8508M4073j8919
15929B8661j3846K0604r394j5946l5810k519J966k375P619N005M6034l2701L4184
$$ plain form
16014 -117142 -50311 -89981 -106635 -56955 -85543 -51639 -21741 30973 52630 36255 30029 24980
16002 24980 42027 458 -27393 -38797 -82673 -35640 -6276 38936 56112 5701 -34200 5532
15990 5532 58165 10481 -22878 -35034 -12883 7653 2510 43362 51950 19788 30398 58899
15978 58899 39693 80169 79585 56390 50714 -1169 -55588 13539 19701 24677 62741 63256 38369
15965 38369 -25665 -100674 -134977 -100605 -71804 -64366 -68010 -51285 -16672 -102013 -103297 -43062
15953 -43062 15112 -19703 -53482 -69131 -59925 -3589 18999 -9730 -92580 -136389 -112925 -108710
15941 -108710 -97507 -31995 -22648 -39752 -119154 -110938 -61188 -16899 -45001 3507 47580 28661
15929 28661 14815 35419 26025 10079 -25731 -28250 -26284 -28659 -21040 -16035 29999 -2702 31482
15916C1482L0923l3095o545K9063K6167K6839o1329l7988O9308k4557m0415p5227
15904f5374J5892M1721k7765J4643P702J2291O307o7844k9162j3359J5647O6908
15892b2393J9332K5642l847l8114J895k3189n1368Q058L4401K8821k4392L9989
15880e165k4523l1124J341Q524J249K2670m934r209q772j4042j6762j0746k8079
15867a19572k6328K1548M2944J4806L9117K0584j1177k7205m6798L7050N987J9044
15855c0000J179L4250M0156j2333p562n7605J32O4858p194n5263k3502P1270k6780
15842h394j14833k4741k6791J0536N7458p16O4046k2819q8025M9979J02401Q3429
15830H1530l4651k3962p788J0588j7331j918m0615q9657j308N6829L6139q6267
$$ plain form
15916 31482 62405 29310 22765 51828 77995 104834 43505 5517 74825 50268 9853 -65374
15904 -65374 -49482 -7761 -35526 -20883 -13181 -890 5417 -62427 -91589 -104948 -89301 -22393
15892 -22393 -3061 22581 18734 -19380 -17485 -40674 -92042 -83984 -49583 -20762 -45154 -5165
15880 -5165 -29688 -60812 -59471 -50947 -49698 -27028 -31962 -41171 -49943 -63985 -80747 -91493 -119572
15867 -119572 -145900 -124352 -81408 -66602 -27485 -6901 -18078 -45283 -92081 -55031 -49044 -30000
15855 -30000 -28821 5429 45585 33252 25690 -31915 -31783 33075 25881 -29382 -52884 18386 -8394
15842 -8394 -123227 -147968 -174759 -164223 -106765 -107481 -43435 -66254 -154279 -104300 -1899 81530
15830 81530 46879 22917 15129 25717 8386 6468 -34147 -123804 -125112 -68283 -32144 -118411
15818a18411J0108N7940L1732K6767k1640n5613K2120N5499L4884m80o4079J4951
15806f222O683l1764m5774k3951L4656J0421j3085q123K5607J7229j1466j0975
15794e6764L955L4778k6856J7738n913M5850Q224P4311k1987r1772n7075k870
15782g8381p259Q801k7587k9177j3956P9275R0735n3181L1953m1309J1454L7604
15770H972k4398K4214K1302J6611m10k291k0600l89o4666k991L6020J4436q4309
15757g8499l1329l110K4879K7411L303k6678K850O300M4096j7771N3151Q2322
15745H6925O2768l3189k1735q286m684k7013O374j8692o780J3805J0735o4676
15733d448n637l7256R393M2075J8030p372K1234m544j5303q962k731J9603L9527
$$ plain form
15818 -118411 -108303 -50363 -18631 8136 -13504 -69117 -46997 8502 43386 42906 -21173 -6222
15806 -6222 461 -31303 -77077 -101028 -66372 -55951 -69036 -77159 -51552 -34323 -45789 -56764
15794 -56764 -52809 -18031 -44887 -27149 -33062 12788 21012 95323 73336 -18436 -75511 -78381
15782 -78381 -85640 -76839 -104426 -133603 -147559 -68284 22451 -30730 1223 -40086 -28632 8972
15770 8972 -15426 8788 30090 46701 46291 44000 23400 23011 -41655 -44646 -8626 5810 -78499
15757 -78499 -109828 -112938 -88059 -60648 -57345 -84023 -81173 -74873 -30777 -48548 4603 86925
15745 86925 149693 116504 94769 86483 81799 54786 61160 42468 35688 49493 60228 -4448
15733 -4448 -10085 -47341 -37948 4127 22157 14785 36019 31475 16172 7210 4479 24082 63609
15720F3609Q913n2724k9472O1812N66o3200r2861l5317J3367k8125L7419L4021
15708h1992Q9193M2140l5567p9083l576L0483K1413N2440P21m1060o1160J033
15696f5015j4155j4314j368J4848K3203P654k7763K156L0965L0076l0032j3494
15684e7239J0437J12486j9098p1385j7781r699J0707N2808J130l4918O5271M4741
15672H7460o9132p1522o3766Q163P702L8101L376j9078R706j4856j1745j1993
15660a07584m798j2897l2122J2724J10301J5605K2162N2903p257k778J941k005
15648D6195j7107K4691j6733m858r6127K4035L0051K95k637m178l8700j739Q5455
15635B8643O3558Q016J6119p8209o8137L7053M9061p3468o1850K0406K9179K4613
$$ plain form
15720 63609 72522 19798 -9674 52138 52704 -10496 -103357 -138674 -125307 -153432 -116013 -81992
15708 -81992 7201 49341 13774 -65309 -68885 -38402 -16989 35451 36172 -4888 -66048 -65015
15696 -65015 -79170 -93484 -94852 -80004 -56801 -49147 -76910 -74754 -43789 -13713 -43745 -57239
15684 -57239 -46802 65684 46586 -24799 -42580 -52279 -41572 11236 12366 -22552 42719 87460
15672 87460 18328 -53194 -116960 -108797 -101095 -62994 -59618 -78696 -68990 -83846 -95591 -107584
15660 -107584 -112382 -125279 -157401 -144677 -34376 -18771 3391 56294 49037 46259 48200 46195
15648 46195 29088 53779 37046 32188 -63939 -39904 -9853 -9558 -12195 -16373 -55073 -56812 28643
15635 28643 92201 100217 116336 38127 -30010 7043 56104 -17364 -79214 -58808 -29629 -5016
15623e016M0675l2333j5816m7611j26J0700L9080K0799N2161q9474J448j439O453
15610b0499J9636p4210k0005Q7438K8543k0471o8596J7198m2431k8505N5502J4640
15598e1760L631K3684M6833J5219n0063n4239L8005R282M4037m6817p3778j1543
15586a07509l1935M2261L2991J2431k4695K6509M3239J3903m4700n4218R767R6240
15574A4284j9881p6121J8809R2564J3112K5828j6252o171r6819n1882P0031K2580
15562i918L7013n4070j2092J8997N108k4737P9310L3638l3373k772k7775p8031
15550f8702l7019M8418q549o448P0127J7638k8739n7741p8709M2388J3472L6350
15538e7514p3431o9846L3600M498J10106J07132q4720m0722n450J08K7677N2904
$$ plain form
15623 -5016 35659 3326 -12490 -60101 -60227 -49527 -10447 10352 62513 -26961 -25513 -26952 -20499
15610 -20499 -863 -75073 -95078 -7640 20903 432 -68164 -50966 -93397 -121902 -66400 -51760
15598 -51760 -48129 -24445 22388 37607 -12456 -66695 -28690 -19408 24629 -22188 -95966 -107509
15586 -107509 -139444 -97183 -64192 -51761 -76456 -49947 -6708 7195 -37505 -91723 -81956 14284
15574 14284 -5597 -81718 -62909 29655 42767 68595 52343 46172 -50647 -102529 -32498 -9918
15562 -9918 27095 -26975 -39067 -20070 -14962 -39699 39611 73249 39876 37104 9329 -68702
15550 -68702 -105721 -57303 -65852 -72300 -2173 15465 -13274 -71015 -149724 -107336 -93864 -57514
15538 -57514 -130945 -200791 -167191 -162693 -52587 54545 -30175 -70897 -76347 -76239 -48562 4342
15526D342K2506j6663J1718k5489L1640L7443L2276O896j8668m3213j4960o1374
15514c3546k7574l4564n240K2868j4445P336O1274O1772k8596K1631k9646q946
15502g676l9448n8564K8606Q0706P6737k7279o5866P218L3896L2386l8243j5588
15490F885L0230K8638N0157J4119M757q1773m7297J493q502q0P442K0843l2746
15477e834J0679Q348j0095J9401J6589n0230K4067L4413l2285j2427k0922l3708
15465e2004m2707M0758N8346M9097M649l3622L1067L8532n4911j7682p6161j5611
15453g0249k64K0439N8535M1854k8602n0914m8072m2035M2558P2378J03163K0497
15441A19288n1254n7943k1363K0725r8031l5708O7109O2172J8352O4676K8270
$$ plain form
15526 4342 26848 10185 21903 -3586 28054 65497 97773 104669 86001 42788 27828 -33546
15514 -33546 -61120 -95684 -100924 -78056 -92501 -85165 -23891 37881 9285 30916 1270 -7676
15502 -7676 -47124 -105688 -77082 3624 80361 53082 -12784 -5566 28330 60716 22473 6885
15490 6885 37115 65753 115910 130029 134786 53013 5716 7209 -1293 -1373 6069 26912 -5834
15477 -5834 4845 13193 3098 22499 39088 -11142 12925 47338 15053 2626 -18296 -52004
15465 -52004 -94711 -53953 4393 53490 58139 24517 55584 94116 39205 21523 -54638 -70249
15453 -70249 -70513 -50074 8461 50315 21713 -29201 -77273 -119308 -76750 -4372 98791 119288
15441 119288 68034 10091 -11272 9453 -88578 -124286 -57177 4995 23347 88023 116293
15430A16293K9320M499p7908j02690K2045K9572L544N99K9258L1537o9379m7657
15418c0967R0998O4049L4419k6569j15217L5887K2610p2029k6522K9700K0993
15407B7352m2870n4165j7915J4134K1994N1129L5270l5318N3208P414K8865o929
15395H2169p1257k5271j7596k0943J469J6374J8824K3184R763L7970m3920n6585
15383d5819Q860O2542J9105k5784J3236J5704n7438K9892J9188k3259r43J841
15371A7125Q7169j2142k1021l6107o491K3408M0991p3375k1130M4066N0628k7795
15359F5326R579N145j1114P535N2949j116k922q6921o4820N9686M0113l8122M3102
15346G8420M1014j2854j0705p2629n1894P7648L5597o1709l8968J7789J0748N1504
$$ plain form
15430 116293 145613 150112 72204 -30486 -8441 21131 24675 25274 54532 86069 16690 -30967
15418 -30967 60031 124080 158499 131930 16713 52600 75210 3181 -23341 6359 27352
15407 27352 -15518 -69683 -87598 -73464 -51470 -341 34929 -389 52819 60233 89098 82169
15395 82169 10912 -14359 -31955 -52898 -51429 -35055 -16231 6953 16716 54686 10766 -45819
15383 -45819 -36959 25583 44688 18904 32140 47844 -9594 20298 39486 16227 15284 17125
15371 17125 104294 92152 71131 35024 28533 51941 92932 19557 -1573 42493 93121 65326
15359 65326 74905 80050 68936 76471 129420 128304 125382 38461 -26359 33327 73440 35318 78420
15346 78420 119434 106580 95875 23246 -28648 49000 84597 22888 -16080 1709 12457 63961
15334F3961R012l82L8515k249j07925j250O0180M859K2096M4211l5360p9671o7217
15321e1220K6626j3922J2406J05306J3036k5140j2376m8424K3032R132l665L0596
15309F5387L24j12151l5590l820O2061k1059K8707J572k7162q0718J128R258m2811
15296a54874Q55M5076M7868K1657M6217O2566r554O0644k417j0580K9515q446
15284A28527q8112O858J2167p5873j0589J8863J4495m1462K257j2408m296M4949
15272d624n448p3698n0491O8115P4620o220p7304L0505J6128k3460N125L0535
15260a6217J3387k2160r929N5875L3305m3176M1641Q208q6881n0174l6280Q6312
15248b6089O7888l5265O2162L8365m9209r5692m1279M9246j2362J7012N7284R705
$$ plain form
15334 63961 72973 72591 111106 108857 932 -318 59862 64721 86817 131028 95668 15997 -51220
15321 -51220 -24594 -38516 -26110 79196 92232 67092 54716 6292 29324 38456 34791 65387
15309 65387 65711 -46440 -82030 -85850 -23789 -44848 -16141 -14569 -41731 -122449 -121321 -112063 -154874
15296 -154874 -154019 -108943 -61075 -39418 6799 69365 59811 120455 118038 107458 136973 128527
15284 128527 40415 47273 59440 -16433 -27022 -8159 6336 -35126 -32869 -45277 -49573 -4624
15272 -4624 -10072 -83770 -134261 -66146 8474 2254 -75050 -44545 -28417 -51877 -46752 -16217
15260 -16217 -2830 -24990 -34919 20956 54261 11085 52726 60934 -25947 -76121 -112401 -26089
15248 -26089 41799 6534 68696 107061 57852 -37840 -79119 -29873 -42235 -25223 32061 41766
15236D1766o8142l3256J2248q5153L3491L0849j6321N7511j1719K1019k9480N109
15224d2078M170J9629l2243m5820m0816K0038J8605K6147N4610n2433k8303J397
15212i7097K7288P2313K3533j9959q530q0654m333p652R470j1662L1513L56p5076
15199a40490j7253j7486M8530j4913J20784P0894L6780n5728j4219M4785M9687
15188A11371l5279n5424j6609P5j2676N478O8094M1704Q251n3232j7070J9982
15176F4665J9574N003n0229p3752J1862M5227L8487q8755K5071j3119j7903M0476
15164F607O8792K3492l0522k4853J2357j2338m6868j3484K0875q4462L2942O4340
15152A6878M9013n0109l3161L064k8941k8879P933L3272k5991n7579M3232L6669
$$ plain form
15236 41766 -26376 -59632 -47384 -132537 -99046 -68197 -84518 -27007 -38726 -17707 -47187 -42078
15224 -42078 -37908 -18279 -50522 -96342 -137158 -117120 -98515 -72368 -17758 -70191 -98494 -97097
15212 -97097 -69809 2504 26037 6078 -2452 -83106 -87439 -95091 -85621 -97283 -65770 -65414 -140490
15199 -140490 -157743 -175229 -126699 -141612 -20828 50066 86846 31118 16899 61684 111371
15188 111371 76092 20668 4059 4134 -8542 -3064 65030 106734 114985 61753 44683 64665
15176 64665 84239 89242 39013 -34739 -22877 22350 60837 -27918 -2847 -15966 -33869 6607
15164 6607 75399 98891 68369 43516 55873 43535 -3333 -16817 4058 -80404 -47462 16878
15152 16878 65891 15782 -17379 -14315 -43256 -72135 -64202 -30930 -56921 -114500 -71268 -34599
15140c4599l7323k0439M0927p907N3474O8077M4687K8643l9280j20696m8105m6832
15128a19373J20393M4900J2281N2677K2805p8440n7218J1213j9425M0735r114
15117B1434l4773K1716r479m1141J5385M0017q677l1497o772L3868p0786l2739
15105a03444l0879J3837M6461Q765K3594K0098q405q3871N036M3573j6258k4073
15093a05566l543k3150j9486p451R2054Q542o4000m820M6467J20039P5573R562
15081A24221K276j8117j0610m5924p1325K6382R4641J2310q9087j03234N6006
15070b2461K3543m1835K1571k76K1104P554J9898J4766m584m1511m6866M5581
15058c516O5212n7078l8964Q6336k6890j14588K9239M0037O8281p0898k9123J0454
$$ plain form
15140 -34599 -71922 -92361 -51434 -59341 -5867 62210 106897 135540 96260 -24436 -72541 -119373
15128 -119373 1020 45920 58201 110878 133683 55243 -1975 9238 -10187 30548 21434
15117 21434 -13339 8377 -1102 -42243 -26858 13159 4482 -27015 -33787 81 -70705 -103444
15105 -103444 -134323 -120486 -74025 -65260 -41666 -21568 -29973 -113844 -108808 -65235 -81493 -105566
15093 -105566 -109109 -132259 -151745 -159196 -67142 -58600 -122600 -127420 -80953 39086 114659 124221
15081 124221 126497 108380 97770 51846 -19479 6903 101544 113854 24767 -78467 -22461
15070 -22461 1082 -40753 -19182 -19458 1646 9200 29098 43864 39280 -2231 -49097 -3516
15058 -3516 61696 4618 -34346 51990 25100 -89488 -60249 -20212 48069 -22829 -51952 -41498
15046d1498Q5273O9535m8499r9300l3198P7867J6603N1784J5450j16603q4698
15035a07284L1940J5795k0998J6141L685k314K2893J7260j824k5424K384J5641
15023c2105M785Q936O7582M3304J1216M1249m8420l3358N1570M1631k6538O864
15011A36716P118k11j7542j0527k9120Q5268L6281M7469o1495K9862N2858m310
14999B72367r4761j01427L031k902n6134r2728j0855O1375L7142l9631O852J13551
14987I5880J9835l3495M9362k1149m9279J0637p2245o8656j5058J6664P1401M4403
14975D8300m9196o384r954K6448J3585k6403k2818N0402j0868m7761j810M9158
14963A2699p2254n6241k5195m7318M4101P7480m000J1114J2538Q781l7510j1202
$$ plain form
15046 -41498 43775 113310 64811 -34489 -67687 10180 26783 78567 94017 -22586 -107284
15035 -107284 -75344 -59549 -80547 -64406 -60721 -63035 -40142 -22882 -24706 -50130 -47746 -32105
15023 -32105 -27320 -18384 49198 92502 103718 144967 96547 63189 114759 156390 129852 136716
15011 136716 143834 143623 126081 115554 86434 171702 207983 255452 193957 223819 276677 272367
14999 272367 177606 76179 79210 76308 20174 -72554 -83409 -22034 15108 -24523 -17671 95880
14987 95880 115715 82220 131582 110433 61154 71791 -454 -69110 -84168 -67504 3897 48300
14975 48300 -896 -7280 -17234 9214 22799 -3604 -26422 23980 13112 -34649 -36459 12699
14963 12699 -59555 -115796 -140991 -188309 -144208 -66728 -70728 -59614 -47076 -38295 -75805 -87007
14951h7007Q2687J8751p1986n1800n5675J0897K1430Q4151l97L7980O0230m4676
14939D585k7887L3926m7351r1301M0373J21053L3532n5769k1003J8938K2980J3945
14927D6021l0018j4954j6579K8136m0444k1325K5845L8499J426k371o419l1859
14915b4042N291j0472o1948J7960P2533L935j0775m7883L91L2969M6664K9974
14903E4597J7142k4668n9671p2480m1256M6128O3679R713M7046k23n185m3281
14891h459l6886j4658J8514k2005q334k915k123K7930o100O5040R395q9625j0671
14878h0897K1197K1691J1683j3808N016P4001k2788L664k7579J9019N8789L1809
14866A01797q6168p5294j4078N5216k270k927M6013P0457l438o2099O032N3068
$$ plain form
14951 -87007 -4320 14431 -57555 -109355 -165030 -154133 -132703 -48552 -48949 -10969 49261 4585
14939 4585 -23302 10624 -36727 -128028 -87655 33398 66930 11161 -9842 9096 32076 46021
14927 46021 16003 1049 -15530 12606 -27838 -49163 -23318 15181 16607 14236 7817 -24042
14915 -24042 -18751 -29223 -91171 -73211 -678 3257 -7518 -55401 -55010 -22041 24623 54597
14903 54597 71739 47071 -12600 -85080 -126336 -80208 -16529 -6816 40230 40007 34822 -8459
14891 -8459 -45345 -60003 -41489 -63494 -71828 -74743 -76866 -48936 -55036 10004 19399 -70226 -80897
14878 -80897 -59700 -38009 -26326 -40134 -35118 38883 16095 19759 -7820 11199 69988 101797
14866 101797 15629 -59665 -73743 -18527 -20797 -23724 22289 92746 89308 27209 33241 86309
14854H6309Q061m3673n6172k4299n0075r577K5265L203R335J8235n943O0492M56
14841B1617m8296n5970l8065M1793P9344M450P413K1626Q9671P4092J2588m6211
14829A64052p3287r1776M3387k5993k0663n7937j4504L2719J5532K0684L38j02253
14817a09701O1164N1681J9697n371J2952n7343j00720N4541J19710L1169j6707
14806F1072p4453j33065M7535J7738L6280N4756P0573j6153o5567l6426k8670
14795f6380P586p99q5891k335L3565K7113J5467J2053p316M3187J4577N97k8169
14782c6745R593o5709r17M1763j437M3285p0350n7492j5910L6516L8504J3788
14770f5111Q717L8361L6132j5526k0420k2033M2424J8448N6625P6114M2480m1212
$$ plain form
14854 86309 94370 50697 -5475 -29774 -79849 -89426 -64161 -60958 -51623 -33388 -39331 21161 21617
14841 21617 -26679 -82649 -120714 -78921 423 4873 12286 33912 123583 197675 210263 164052
14829 164052 90765 -1011 42376 16383 -4280 -62217 -76721 -44002 -28470 -7786 -7448 -109701
14817 -109701 -48537 3144 22841 17470 30422 -26921 -127641 -73100 46610 77779 61072
14806 61072 -13381 -146446 -98911 -81173 -44893 9863 80436 64283 -1284 -37710 -66380
14795 -66380 -58794 -59593 -145484 -147819 -114254 -87141 -71674 -59621 -66937 -23750 -9173 -8576 -36745
14782 -36745 -27152 -92861 -93778 -52015 -53452 -10167 -80517 -138009 -153919 -117403 -78899 -65111
14770 -65111 -56394 -18033 18099 2573 -17847 -39880 2544 20992 77617 153731 196211 154999
14758A54999J6648K2264m6984o7458j34898J5743K7462n1610o7715J4278J4265
14747a03006J3297l2219N4858L8590l7610K1305K7945p781N3258O6505J1708k323
14735A04527o2863m1226J9833L7441N1388m2180O7451M7324L5575j1117n936Q4681
14723B84898P9609P6569R500N2629J8996n841O9678R8451J25802J21047J00029
14712A031367J12671L18798L23266K49869J01402j44310m66204n49261l54382
14703F23216k39915j18508k5787l3113n0430j2677J2120n5188r5112N347j1623
14692a670J4703o931L3612L5573m3558k4906q507j9854j9620r672J04359J0764
14680F4293q9219k597q900k8193K5195O0112N7898J06389k5046K3765m9030n6168
$$ plain form
14758 154999 171647 193911 146927 79469 -55429 -39686 -12224 -63834 -131549 -117271 -103006
14747 -103006 -89709 -121928 -67070 -28480 -66090 -44785 -16840 -24621 28637 95142 106850 104527
14735 104527 41664 438 20271 57712 109100 66920 134371 181695 217270 206153 200217 284898
14723 284898 364507 441076 450576 503205 522201 516360 586038 684489 810291 931338 1031367
14712 1031367 1144038 1462836 1786102 2035971 2137373 1993063 1526859 977598 623216
14703 623216 383301 264793 239006 205893 155463 142786 154906 99718 4606 9953 -1670
14692 -1670 13033 6102 39714 75287 31729 6823 -1684 -21538 -41158 -50830 53529 64293
14680 64293 -24926 -27523 -36423 -64616 -39421 20691 78589 184978 159932 183697 134667 78499
14668G8499n3901N9975J7723j15995o735J250M5011J9973l7211j9144m7239k3671
14656h1465o857l0936P0711k206m927N0461N9325n6457l6806o4579J7669O3633
14644b2434M9656J7479p642k5811l2629J3310K3402m8641l2267l139J8558M6229
14632c929J2243J4900N2927j1073L0881l1667j7979J1628j256n329J3313K6608
14620I1267k047p8027o9703N0398M070O1630J7689L1236l9687j12o3065n9122
14608e5473J6886P0476j5880p8227m5656M646O6802M2708K9632n2905r2449j9122
14596a28562K5440K6740J3894J1750K5644R732j711j6632L595K3371k1535R086
14584a9188K5790N0343J302j5862q135K5198j4653J7569J7712j140j1494J8937
$$ plain form
14668 78499 24598 84573 102296 -13699 -20434 -19184 25827 45800 8589 -10555 -57794 -81465
14656 -81465 -88322 -119258 -48547 -50753 -55680 -5219 54106 -2351 -39157 -103736 -86067 -22434
14644 -22434 27222 44701 37059 11248 -21381 -8071 15331 -33310 -65577 -68716 -50158 -3929
14632 -3929 8314 23214 76141 65068 95949 64282 46303 57931 56675 51346 64659 91267
14620 91267 89220 11193 -58510 -8112 -4042 57588 75277 106513 66826 66714 3649 -55473
14608 -55473 -38587 31889 16009 -62218 -107874 -103228 -36426 6282 35914 -16991 -109440 -128562
14596 -128562 -103122 -76382 -62488 -50738 -25094 -15362 -17073 -33705 -30110 -6739 -28274 -19188
14584 -19188 6602 56945 58247 42385 34250 59448 44795 62364 80076 78936 67442 86379
14572H6379l2450p8211l7472p3143J7456M3815M9421M4469N3575K7260k992l6431
14560F1676k6579q0638j0376k8946R745L8755L9039O055l932J7215j1660n482
14548D872J6356J1800l9107K6791L8516M2473J7037m6821p4708k2419N3421L46
14536B8557o946J7170j9582r4220j8442N0781L3160l3383k3029n3232N9401J04
14524e9661m8217J979J09999L9722n203Q7279K3221r6014j8660p630l3923j9539
14512b6647N7643J6874L2842P1115j623n5858n489P9810L3131k3122Q006l7034
14500A49648J273k5756n8394J1748l4686L197N1825K9570l1713n4990j5062L2036
14488E8696M3937l603k099K8959L8836j4945m3638l6580J6686k3741l1360P077
$$ plain form
14572 86379 53929 -24282 -61754 -134897 -117441 -73626 -24205 20264 73839 101099 98107 61676
14560 61676 35097 -45541 -55917 -84863 -75118 -36363 2676 8731 4799 22014 10354 4872
14548 4872 21228 33028 -6079 20712 59228 101701 118738 71917 -2791 -25210 28211 28557
14536 28557 21611 38781 19199 -75021 -93463 -42682 -9522 -42905 -65934 -119166 -59765 -59661
14524 -59661 -107878 -105899 4100 43822 38619 125898 149119 53105 34445 26815 -7108 -26647
14512 -26647 30996 47870 80712 151827 150204 94346 88857 168667 201798 178676 186682 149648
14500 149648 150921 125165 66771 78519 43833 47030 98855 128425 96712 41722 26660 58696
14488 58696 102633 99030 96931 125890 164726 149781 106143 69563 86249 62508 31148 38225
14476C8225M038l4181k8876K4748l8833Q41L5453o953l1210R920L9878M9779P0052
14463A32881N283Q3007l7203j17572J8490N498Q777j1940J1035L811j4829J3333
14451A00571L2677j3647o5100q3426m2097J6884l2300m729P0494Q9741n6162n1262
14439c8356K9064k0569O0288J2735l0974q3853l1090M1762Q7147K6309J6330N3786
14427A22579L2322j5881Q928j16806l5673M0122L6139l4733j654m0501J1245N8105
14415F4192Q325n39k8221m3828l939k1394P180k8116N1976N9417m3062J7597L8470
14402G8058k1647J9137J8080k583K0934q2594n7432n236J6694M1076Q2779L2014
14390A39280l1537j5658J2287n1228l9048j7698K4381l0578l2965k3930J4361
$$ plain form
14476 38225 42263 8082 -20794 3954 -34879 -34038 1415 -5538 -36748 -26828 13050 62829 132881
14463 132881 138164 221171 183968 66396 84886 90384 99161 87221 98256 102067 87238 100571
14451 100571 133248 119601 54501 -28925 -71022 -54138 -86438 -91167 -20673 69068 12906 -38356
14439 -38356 -9292 -29861 30427 43162 12188 -71665 -102755 -60993 26154 52463 68793 122579
14427 122579 154901 139020 147948 31142 -4531 35591 71730 36997 35343 -5158 6087 64192
14415 64192 72517 71978 43757 -71 -4010 -25404 -18224 -46340 5636 65053 21991 39588 78058
14402 78058 56411 75548 93628 91045 111979 29385 -28047 -33283 -16589 24487 107266 139280
14390 139280 107743 92085 104372 53144 14096 -3602 20779 -9799 -42764 -66694 -52333
14379e2333M3238M6330N9077J06626J33979o580m7635J380o8252o6369p054L0019
14367A72426J0963n941j0965j9991N5510L2721R175q3809l1992L9194J00193N3876
14355C21360o3540Q22l84L557p8972j9527J1409K6868P3610J2466p1700n5928
14343A60041M0265J0435l1994R2785N4760p8802k8355N568r204K6953J5081P876
14331B65409q3013l9073M1866l2028P2669K459m7014J18081N6226l2308p0835
14320B52439J4891J4156k0792K1748L3202k7426O8549J9023j6760k145k3018k5861
14308C08006J04771J10651K9977m3772m9332j1399l3772O7451R0385P1059J5502
14297F59527n1032Q0580M2473k0272L9448M8046K8343M8647J4534M450Q2860N0131
$$ plain form
14379 -52333 -9095 37235 96312 202938 336917 330337 282702 284082 215830 149461 142407 172426
14367 172426 183389 177448 166483 146492 202002 234723 243898 160089 128097 167291 267484 321360
14355 321360 257820 258642 258258 261815 182843 163316 174725 201593 275203 287669 215969 160041
14343 160041 200306 210741 178747 271532 326292 247490 219135 224703 215499 242452 257533 265409
14331 265409 182396 143323 185189 153161 225830 228289 181275 299356 355582 323274 252439
14320 252439 267330 281486 260694 282442 315644 288218 356767 375790 359030 356885 333867 308006
14308 308006 412777 523428 553405 509633 460301 448902 415130 482581 572966 644025 659527
14297 659527 608495 689075 731548 711276 750724 798770 827113 875760 890294 894744 977604 1027735
14285A027735Q0356j350n2910l1056O9082M2390K7671J12252R4315J30680O4257
14274A563422N9744N1114R9071J15612J86637K61974K24879K40685K54579K50566
14264C308283K94891M64446N05508N32643O30385P70758R65389J082054J255101
14255I809458J360059J540571J696005J819226J903127K019347K073908K249481
14247B4471182K541940K761169L013235L061517K860351K459868K372826K625446
14239D6167534K853582L128837L498380M379206O236859R290432J3344990J7555797
14231A06455617K1150790K6147860L3899893M1214703M7082483N5037118O0695860
14224C91684324M0535396k3461438r1262884j04537188p5049920m4208207k5787550
$$ plain form
14285 1027735 1108091 1106741 1053831 1022775 1091857 1134247 1161918 1274170 1368485 1499165 1563422
14274 1563422 1623166 1674280 1773351 1888963 2075600 2337574 2562453 2803138 3057717 3308283
14264 3308283 3603174 4067620 4573128 5105771 5736156 6506914 7472303 8554357 9809458
14255 9809458 11169517 12710088 14406093 16225319 18128446 20147793 22221701 24471182
14247 24471182 27013122 29774291 32787526 35849043 38709394 41169262 43542088 46167534
14239 46167534 49021116 52149953 55648333 60027539 66264398 75554830 88899820 106455617
14231 106455617 127606407 153754267 187654160 228868863 275951346 330988464 391684324
14224 391684324 432219720 408758282 317495398 212958210 137908290 93700083 67912533
14217F7912533j6029366j0625285p556111n501486m083158l013233k193498j659295
14209A7251101j619727j808706j746066j462836j018195n11636l63521n08049
14201H212365p77744j101278r61032p11404n13196l95584l67637k54986j06921
14192C022583j81093j77730j44492j35434l3338j57026j83499j22717r0879l7866
14182A758509r6798K48m657q3627p3702j13964j46518L331N6701j1658J8257n7467
14170A248655j38044j17303j2759J3914j4150j43998j18484j109q6730p6685M0027
14159E93334K3916K089k2382m8632K0579R995Q498j0536N0726N5570M536O2977
14147G50670j1560k1654L1764K5737Q1653q696J5004n855N2300l1638q2496j39941
$$ plain form
14217 67912533 51883167 41257882 33701771 28200285 24117127 21103894 18910396 17251101
14209 17251101 15631374 13822668 12076602 10613766 9595571 9083935 8720414 8212365
14201 8212365 7434621 6333343 5372311 4660907 4147711 3752127 3384490 3129504 3022583
14192 3022583 2841490 2663760 2519268 2383834 2350496 2193470 2009971 1887254 1796375 1758509
14182 1758509 1661711 1661959 1657302 1573675 1499973 1386009 1239491 1242822 1299523 1287865 1306122 1248655
14170 1248655 1110611 993308 980549 994463 980313 836315 717831 716722 629992 553307 593334
14159 593334 617250 619339 596957 548325 568904 578899 587397 576861 627587 683157 687693 750670
14147 750670 739110 717456 749220 774957 856610 847914 862918 857063 909363 877725 795229 655288
14135F55288p0170l409J8147k9360r7638l0831j2205P838j478k9291j1477L7565
14123D32979k5819j4343L9490O0719Q399J7507J9349n0054l9485l6766k0374J4513
14111D06115N4666n651m3247N4340L3858j8466n418k8721l1702J7174R1333N1732
14099E76013n6636j2329N5442j6240M4810M6021O6860K3931Q5030J46202J05818
14088A064922K0689L0672l5426k06143j70258j64480j79855j02075j0520J4602
14078B62128k9091q0198k7037L7335L8192N3992O9085M9823L6884j0123l4815
14067C66175l4723m0281K4915N4875l1288j5069k5703l7654Q7108J6302n4694
14056C09963l8558l7540o296N955K4079K562n949N818j0760P6691J1487K82R488
$$ plain form
14135 655288 585118 581709 599856 570496 472858 442027 429822 437660 436182 406891 395414 432979
14123 432979 407160 392817 432307 493026 501425 518932 538281 488227 448742 411976 391602 406115
14111 406115 460781 455130 411883 466223 500081 481615 476197 447476 415774 432948 524281 576013
14099 576013 519377 507048 562490 546250 591060 637081 703941 727872 812902 959104 1064922
14088 1064922 1085611 1116283 1080857 874714 704456 539976 360121 258046 247526 262128
14078 262128 233037 152839 125802 163137 201329 255321 324406 374229 411113 400990 366175
14067 366175 331452 291171 316086 370961 339673 324604 298901 261247 348355 364657 309963
14056 309963 271405 233865 227569 233524 257603 260165 254216 260034 249274 325965 337452 337734 347222
14043C47222N5826J0376O0091O4699j3891N6402J27579J37686M7298l3340j12923
14032G47025j63991q5345n8713K034p3742n3107k0846o1966o1356p0627N5769
14021A55135L6220J739K48J8976j6830p477P2105M636l033l7851o1864q2571q458
14008G0975L6166O765P3870J08751J9223q9039k9979M9112m0140n4374Q097m296
13996A55131l7305j6189j4256M7945R914m4319l3751n0929K6408r646p8599N1285
13984E689P4183M2309M4802K6347m2892p8795m583O2980O868n5121M6163J8867
13972A46817q9392n1740P2041N0402l8900o4329J7352M2745L4027M6253L9193
13961B04469K603q2473k1257M6160J5549m111j7719q057K0784m3216O606M1019
$$ plain form
14043 347222 403048 413424 473515 538214 524323 580725 708304 845990 893288 859948 747025
14032 747025 583034 497689 438976 441010 367268 314161 293315 231349 169993 99366 155135
14021 155135 191355 193094 193342 212318 195488 188011 260116 264752 261719 223868 162004 79433 70975
14008 70975 107141 113906 187776 296527 315750 226711 196732 245844 205704 151330 159427 155131
13996 155131 117826 101637 87381 135326 145240 100921 67170 16241 42649 33003 -45596 5689
13984 5689 79872 122181 166983 193330 150438 71643 67060 130040 136908 81787 127950 146817
13972 146817 57425 5685 77726 128128 89228 24899 42251 84996 119023 165276 204469
13961 204469 207072 124599 103342 149502 165051 160940 143221 135164 155948 112732 119338 160357
13949A60357J3067J242p54p5562K583O8130n3076k2864k5331l5682L0486M0297
13937A02893M621L920J6717p529R45l9006K5535O2632L7676Q904L5538j28256
13925A24590j7817p133k9262J6056N9043L1065P140m7208N343R1535N0606J5728
13913B99686J3966j5417r0529m9496J8322L0362k8165n2795l5263Q006l6107L5840
13901I8410k017l036k6255J7622R510L3822m1261l3321K1823K8096k2044l5863
13889D5486N3038O357j0065j4643M9398j8789L5819J089l5240j10896j5576J7335
13877C313L2739O7950M3410k2632l4208l3480o50J02217Q143j1950k6648j4358
13865A13846J1992m1437l6315K9344J8371k8451N1048O5507J6977J3779j2146
$$ plain form
13949 160357 173424 174666 173912 98350 100933 169063 115987 93123 67792 32110 62596 102893
13937 102893 107514 111434 128151 120622 121567 82561 108096 170728 208404 217308 252846 124590
13925 124590 106773 99640 70378 86434 145477 176542 183682 136474 141817 233352 283958 299686
13913 299686 313652 298235 207706 158210 176532 206894 178729 125934 90671 98677 62570 98410
13901 98410 96393 93357 67102 84724 94234 128056 86795 53474 75297 103393 81349 45486
13889 45486 98524 104881 94816 80173 129571 110782 146601 147690 112450 1554 -14022 3313
13877 3313 36052 104002 147412 124780 90572 57092 56442 158659 166802 154852 128204 113846
13865 113846 125838 84401 48086 77430 95801 67350 118398 183905 200882 214661 202515
13854B02515m5940k2627o555l778K2364K8791L7527k2934m5852m2326J1257L2169
13842A44611Q6450K2667M5267K3992m5137J22444N4853j7671p8116n8129J5104
13831C16335M1901n1263l6056r4774p6639Q4281J16142Q9607m2894q1431q7747
13820A77462M6794M3814P3770O606k7331j0064M9021J5793O674J0985l4275N2943
13808D12192K9672m9214L8140O3233O6197P3876J53029P6312J27600K90069L12573
13797A593679L48152K26446P5012j34714l51850l98634l27144k23328j68431r2031
13787E47157o8254p6903o1136Q644l8369j1924O1282m4007n2041M6157N6894m3535
13775C23965o2357M0233K8698J6080L2447p2170o8985K372J009L8940N2944M5240
$$ plain form
13854 202515 156575 133948 127393 123615 145979 174770 212297 189363 143511 101185 112442 144611
13842 144611 231061 253728 298995 322987 277850 400294 455147 437476 359360 301231 316335
13831 316335 358236 306973 270917 176143 99504 183785 299927 389534 346640 265209 177462
13820 177462 224256 268070 341840 348446 321115 311051 360072 375865 382539 393524 359249 412192
13808 412192 441864 392650 430790 494023 560220 634096 787125 863437 991037 1281106 1593679
13797 1593679 1941831 2168277 2243289 2108575 1756725 1358091 1030947 807619 639188 547157
13787 547157 478903 402000 340864 349508 311139 299215 360497 316490 264449 310606 367500 323965
13775 323965 261608 301841 330539 346619 379066 306896 237911 240283 241292 280232 333176 378416
13763C78416J9723J03254K3956j3563R985K0092l6974R201O5000j5207n6711M7629
13751E54801N19J5410O5979R3952J08175Q0366N0768J09402J47204J25698J23201
13740A475475J48896J77162J89121K63411L56927K78863L56674L16674J77863
13731C741066j04381k14515j60710J2276J54147J63681L48326M51997M26578M51548
13721E270013M50494M40921N27120M95519M68674N84028O73630O27296P00598
13712A0238293O76802P08873Q60675J029713J220538J616946K259498L021196
13704B1632534L794441M742139N918432P146646Q467104R730034J0281903R061706
13696H0774939N231931j369591q711251j3837594j4886375j2430291q774136n680668
$$ plain form
13763 378416 398139 501393 525349 511786 521771 541863 504889 514090 579090 563883 507172 554801
13751 554801 555320 570730 636709 730661 838836 919202 969970 1079372 1226576 1352274 1475475
13740 1475475 1624371 1801533 1990654 2254065 2610992 2889855 3246529 3563203 3741066
13731 3741066 3636685 3422170 3261460 3273736 3427883 3591564 3939890 4391887 4818465 5270013
13721 5270013 5720507 6161428 6688548 7184067 7652741 8236769 8910399 9537695 10238293
13712 10238293 10915095 11623968 12484643 13514356 14734894 16351840 18611338 21632534
13704 21632534 25426975 30169114 36087546 43234192 51701296 61431330 71713233 80774939
13696 80774939 86006870 84637279 75926028 62088434 47202059 34771768 25997632 20316964
13688B0316964l695751k510992j752086j414794j191879r15752p44912l89752
13680G701046j74911L786J79218L37352M12212N49091N52396N61056O06943O31443
13670A1359632P63053Q25888P74248Q00533Q88361Q17943R30021J141137J202417
13661A9503233J309713J353019J394365J572837J780588K188906K847582L898519
13653C5848762N354794O977473Q851910J1012761J3528698J6225054J9061460
13646A16860912K1300082K1385830J6799207N618434j0134375k4622418l2072916
13639A15134756l0850904k4053110j6423293j0578075o960094m731786l444076
13632A8093418k609998k041015j608676j146805q07859n87071m35391l11905k64432
$$ plain form
13688 20316964 16621213 14110221 12358135 10943341 9751462 8835710 8090798 7701046
13680 7701046 7526135 7529921 7709139 8046491 8458703 9007794 9560190 10121246 10728189 11359632
13670 11359632 12122685 12948573 13722821 14523354 15411715 16229658 17159679 18300816 19503233
13661 19503233 20812946 22165965 23560330 25133167 26913755 29102661 31950243 35848762
13653 35848762 41203556 48181029 57032939 68045700 81574398 97799452 116860912
13646 116860912 138160994 159546824 176346031 181964465 171830090 147207672 115134756
13639 115134756 84283852 60230742 43807449 33229374 26269280 21537494 18093418
13632 18093418 15483420 13442405 11833729 10686924 9879065 9291994 8856603 8544698 8280266
13623H280266j27639m0126J30693L19669L52040L99797L74622M19151L42286L35660
13613A0786419L46738L94185N21255O09620M87968M48073M98740N11284P40544
13604A5344826R40135J259115J747284K388955L166209M159686N144032O352551
13596D0502793P751874R296523J0807036J1661668J0938081P042095o87971r793222
13588H7518877j6421536j7869719j5009307j0626221p012954m586855l157930
13581A2834355k279225j740592j266738j060547q85204o26941m79062m52047l69027
13572C674972k93553k92649j93015k03983j49607j00972j31247j14291j46096
13563B049559j01776j61057k28636o6274k092j10610j21935j14244q8155l1134
$$ plain form
13623 8280266 8152627 8112501 8243194 8562863 8914903 9314700 9689322 10108473 10450759 10786419
13613 10786419 11133157 11527342 12048597 12658217 13146185 13594258 14092998 14604282 15344826
13604 15344826 16284961 17544076 19291360 21680315 24846524 29006210 34150242 40502793
13596 40502793 48254667 57551190 68358226 80019894 90957975 98000070 97312099 87518877
13588 87518877 71097341 53227622 38218315 27592094 20579140 15992285 12834355
13581 12834355 10555130 8814538 7547800 6487253 5602049 4975108 4496046 4043999 3674972
13572 3674972 3381419 3088770 2895755 2691772 2542165 2441193 2309946 2195655 2049559
13563 2049559 1947783 1786726 1558090 1491816 1489724 1379114 1257179 1142935 1054780 1023646
13553A023646l9556k7649o4189p9701k5628Q2401N4980n1430j4969l1642m6727
13542G79536m6311k9354P233k2552J6874n8441n9847J512N6842p2309o7444k9940
13530D75799j1526l0688m5897j9420m9648L9175k2019K0827n9555L9717N7630
13519C94395l0417K3452n489n9234J4560k384l3354j8695j877k4025K6325K0770
13507C04027p278m6325q241R2718j8589n8611K206j6753j919N1401m5824r0396
13495A56416k0927L569j768j039M5556M1925J7931n526L3778L9076J8244L6284
13483C63519K8353K6367p2534k2903P59q1807J2252Q3916j9872j19483l0335k583
13471A65649J9393M4191O744p4612l5456j887m343k0804k4834l8645L1720K5068
$$ plain form
13553 1023646 984090 956441 892252 812551 786923 869324 924304 872874 857905 826263 779536
13542 779536 733225 703871 711104 688552 705426 646985 587138 588650 645492 573183 505739 475799
13530 475799 464273 433585 387688 368268 318620 357795 335776 356603 297048 336765 394395
13519 394395 363978 387430 381941 322707 337267 334883 301529 282834 280957 256932 283257 304027
13507 304027 296749 250424 242183 334901 316312 257701 259907 243154 241235 292636 246812 156416
13495 156416 135489 139058 137290 136251 181807 223732 241663 236137 269915 308991 327235 363519
13483 363519 391872 418239 345705 322802 323561 241754 254006 337922 318050 198567 168232 165649
13471 165649 185042 229233 235977 161365 125909 124022 119679 98875 74041 35396 67116 92184
13459I2184J8104K5573j3833j6022J3875L8546n4651M3314R3598J7987N0709p2944
13447B36440k6856L5526r9367n278Q718l7613L3478K0378J2093K2942k7773J9108
13435A91796P3405J191o3166n6769J2483J401P0064j7826l212o5585M60l516J079
13422A41805l8846k8586J046l055m0397M4526M3791L0889Q822K8524m0732m7443
13410A00344j6552J3354O794K0192m8870k6466M1346K0609j8038K0103L1663m1908
13398A02571n543M2689l5466k3503J066N3703R599n1857j585k0826L0176K686
13386A03710m7392l1808O0418J11602M4183n5731k6014R22n8135p9158K5394L3286
13374H1277O6335K263k2271k4409m1536l8841O3720J2808m7092l9866q15O6739
$$ plain form
13459 92184 110288 135861 122028 106006 119881 158427 103776 147090 240688 258675 309384 236440
13447 236440 209584 245110 145743 140465 149183 111570 145048 165426 177519 200461 172688 191796
13435 191796 265201 266392 203226 146457 158940 160341 230405 212579 209367 143782 144242 140726 141805
13422 141805 102959 74373 75419 72364 31967 76493 120284 151173 159995 188519 147787 100344
13410 100344 83792 97146 103940 124132 75262 48796 90142 110751 92713 112816 144479 102571
13398 102571 97028 139717 104251 80748 81814 135517 145116 93259 91674 70848 101024 103710
13386 103710 56318 24510 84928 196530 240713 184982 158968 159890 101755 22597 47991 81277
13374 81277 147612 149875 127604 103195 61659 22818 86538 99346 52254 12388 11573 78312
13362G8312O3121K587p3837O758K2433k1921n1435l4703K7052J185L7515n1735
13350E332m0106M6630J7208Q0465J5807m6097l637N0537J5575J3897O0946M6584
13338B63141l2324o0265K1192m3402o9302j2567J4572k1540M909p5152l0213K3779
13326a7172n2295M0509K8604P194K5667P1236L9538l2120o0338J578q60J0560
13314F2101J0959n0346l4573N4971L4051L2049L9504M1076K0189j2130j22672
13303G5179m5589j7606J4102J162P0678l600n1523o5450J4777N6891l923p994
13291C7104k904n7093q8880l0032O6785O0252J8127M6758Q6620J5131l8849j6432
13279I6587n5738j838J4309k8816l4362P0880J8836m2276j8862n2827j6444K0482
$$ plain form
13362 78312 141433 144020 70183 76941 99374 77453 26018 -8685 18367 19552 57067 5332
13350 5332 -34774 11856 29064 109529 125336 79239 75602 126139 141714 155611 216557 263141
13338 263141 230817 170552 191744 148342 79040 66473 81045 59505 64414 -10738 -40951 -17172
13326 -17172 -69467 -28958 -354 6840 32507 103743 143281 111161 50823 52401 51541 62101
13314 62101 73060 22714 -11859 43112 77163 109212 148716 189792 209981 197851 75179
13303 75179 29590 11984 26086 27248 97926 94326 42803 -22647 -7870 49021 45098 37104
13291 37104 34200 -22893 -111773 -141805 -75020 -14768 3359 50117 136737 151868 113019 96587
13279 96587 40849 39011 53320 24504 -9858 61022 79858 37582 18720 -34107 -50551 -30069
13267c0069N5842J5475r445K1849m98j4907m630K2525J4575M9737Q434L1501L9047
13254A99436J8556k9640N7452l469k4437N6703M9590O2149O1450Q0905n7984o1997
13242D08714o13l6516o1252k0856m1505p540j6353q9197j05602J0318k9737J1164
13230B1025L6010N218O1724O1118r6307l6457K9847M1791n7595n4984r239P8221
13218H0372K4300j5283j3398l7192J1701j7209N0555J5867o3299o6861L1801R7992
13206I9346J0292j7320R4012P3825N4926O5544p391P767J4988K8757J8545J39394
13194E82685J67302J45144Q0681K5900o0067j19077j93454j35882p8103p8247
13184C36882n6805p0240K0465j4907k0700k2692J6814k3744p4303o4956m9114
$$ plain form
13267 -30069 25773 41248 31803 53652 53154 38247 33617 56142 70717 120454 128888 160389 199436
13254 199436 217992 188352 245804 242335 217898 274601 324191 386340 447790 528695 470711 408714
13242 408714 408101 371585 310333 289477 247972 240432 224079 134882 29280 39598 9861 21025
13230 21025 57035 62253 123977 185095 88788 52331 82178 123969 66374 11390 2151 80372
13218 80372 104672 89389 75991 38799 50500 33291 83846 99713 36414 -30447 1354 99346
13206 99346 109638 92318 186330 260155 315081 380625 373234 381001 395989 424746 443291 582685
13194 582685 749987 895131 975812 1001712 941645 822568 629114 493232 415129 336882
13184 336882 280077 209837 230302 215395 194695 172003 188817 165073 90770 25814 -23300
13173b3300L3088L5897J2957j4943p067K1260j9083K0040M0849j2108L5191K6002
13161A48783M0348l1680m2402J1098L877k1462J7646j5046J4920j6002j9161J7051
13149A07970M5608P9571k0978k6498L7245O2915M1054N1732Q8793L0449L3980
13138E31841K7107l8905m4890o7841j04622j39025q1219n9935K2841K7642k7161
13127D5833o7416k8167l5852j4649Q203P9047P4396J5223K8014n4228p6061J0698
13115a4959N7375o0130O3169P1513r917j2873j7652j9005J474k8633J6576l0666
13103A6272n0699L3130L2237m7915L9713K2567L163m9671j21445m7733O4054L8487
13091f7840j9765O0474P9655P0029l7999l0086J9349L5978j6206o476l4743n2451
$$ plain form
13173 -23300 9788 45685 58642 43699 36632 57892 38809 58849 99698 87590 122781 148783
13161 148783 189131 157451 115049 126147 130024 108562 126208 111162 126082 110080 90919 107970
13149 107970 153578 233149 212171 185673 222918 285833 326887 378619 467412 497861 531841
13138 531841 558948 520043 475153 407312 302690 163665 82446 22511 45352 72994 45833
13127 45833 -21583 -49750 -85602 -100251 -92048 -13001 61395 76618 104632 50404 -25657 -14959
13115 -14959 42416 -17714 45455 116968 107051 94178 76526 57521 58995 30362 46938 16272
13103 16272 -34427 -1297 30940 -16975 22738 45305 48468 -1203 -122648 -170381 -106327 -67840
13091 -67840 -87605 -27131 52524 122553 84554 54468 73817 109795 93589 87113 52370 -81
13079h1l208K4399o595j5693P583n184k9681n676J4606m464J930m0494O398O1993
13065E833P3806l6606p3326k6389K2376R5067K7767L1085m5992l5852p592m975
13053B5202k7052N580j6251L562k3613K3977L286M3849J3007j9874l213Q329K6741
13040F3530N9179k6694p372j1624q180o256k1263L9232K4707O476j6313l3788
13028F1634m3272m8021K4826J326q572K3570O127l2083j7969N0144n2811J4542
13016b0559K9880j4501J2965L5417K1708m8818K6295j7925k6964K1681l74L868
13004B2673q9475r6214j3402N9880O3084M5071K066l7475O408P2149J6655n2976
12992a556Q421j4091m5847j3901P0913m0070m5841J746k7720L5721O1816j2359
$$ plain form
13079 -81 -3289 21110 14515 -1178 6405 1221 -28460 -34136 -19530 -23994 -22064 -62558 -56160 5833
13065 5833 79639 43033 -30293 -56682 -34306 60761 88528 119613 73621 37769 30177 25202
13053 25202 -1850 3730 -12521 -8959 -32572 -8595 -5309 38540 51547 31673 28460 36789 63530
13040 63530 122709 96015 88643 77019 68839 62583 41320 80552 105259 111735 95422 61634
13028 61634 18362 -29659 -4833 -3507 -12079 11491 17618 -14465 -32434 17710 -35101 -20559
13016 -20559 9321 -5180 7785 43202 64910 16092 42387 24462 -2502 19179 18805 22673
13004 22673 -66802 -163016 -176418 -116538 -53454 -8383 -6317 -43792 -37384 34765 51420 -1556
12992 -1556 6865 -7226 -53073 -66974 3939 -36131 -81972 -80226 -107946 -72225 -10409 -22768
12980b2768k1436L6156k6683J2590J1543N404k7972j444l2434l0634K4025L6022
12968c7631L559P733J8147N5624m0988k7582j1314k417k7911n0885K9016R2435
12956G786O8214k1381m6437n8198j1872j9163K1411m2553n1122j0653J13371P8214
12944B7617M1798o2169O491K4799n4064l0382K0271N8782j1209o54n3952M6574
12932A3902K0906K610l4195L014L4075L8067j2732K455N49m1513m0830o873M8041
12919B7476j5396m2451J9459K1881R292q143n0436P705j6432n233Q8117O4691
12907A00530j888n3991n7020j2698k0655M572J02539K9923P796l922o0093m9026
12895a3933k8542O6636J2538m3237L3691N9400L129j3510q8545K3715K4750L1684
$$ plain form
12980 -22768 -44204 -8048 -34731 -22141 -10598 -5194 -33166 -34610 -67044 -97678 -73653 -37631
12968 -37631 -34072 -26339 -8192 47432 6444 -21138 -32452 -34869 -62780 -113665 -84649 7786
12956 7786 76000 54619 8182 -50016 -61888 -81051 -59640 -102193 -153315 -163968 -50597 27617
12944 27617 69415 7246 13737 38536 -15528 -45910 -25639 33143 21934 21280 -32672 13902
12932 13902 34808 37418 3223 6237 40312 78379 65647 68102 68651 27138 -13692 -20565 27476
12919 27476 12080 -30371 -10912 10969 20261 12118 -38318 -30613 -47045 -52278 35839 100530
12907 100530 98642 44651 -12369 -25067 -45722 -41150 61389 91312 99108 95186 35093 -13933
12895 -13933 -42475 24161 36699 -6538 27153 86553 89682 76172 -12373 11342 36092 67776
12883F7776K263o9200p5351m8048J3631O8514K2040q354N6667K2386J4627m9134
12871A7817n3618J3323l5092j4847J8069l6361L2872L5839m0888r590M0001k8153
12859f0628k7901l2173m560O740L1986P7413N9755l795L8776J2531n6366r3210
12847e1432K8610l2670L0841K6111l2856n8169Q2765K4127p3842p591K867m031
12835f5270L3432Q6219J1158n259L2775l1604k2825K3874l3188p3051K1179K3611
12823A051m0385o631j0873O824M3001k7410N2144L2532r6472P25K6768L7375J5005
12810C3654M9131m0148j02318k4782K4767N677K9955L3034q578J5641j3108p4545
12798g1620p8635j8679M8241J09614l2830k6904k8094P548j6456N1675M2420r015
$$ plain form
12883 67776 70039 839 -74512 -122560 -108929 -40415 -18375 -26729 29938 52324 66951 17817
12871 17817 -35801 -22478 -57570 -72417 -54348 -90709 -57837 -21998 -62886 -72476 -32475 -60628
12859 -60628 -88529 -120702 -125262 -118522 -86536 -9123 50632 46837 85613 98144 41778 -51432
12847 -51432 -22822 -55492 -24651 1460 -31396 -89565 -6800 17327 -56515 -64106 -61239 -65270
12835 -65270 -31838 54381 65539 60280 93055 61451 38626 62500 29312 -43739 -22560 1051
12823 1051 -39334 -45965 -56838 -50014 -7013 -34423 17721 50253 -46219 -45494 -18726 18649 33654
12810 33654 82785 42637 -59681 -84463 -59696 -54019 -24064 8970 392 16033 2925 -71620
12798 -71620 -150255 -168934 -120693 -11079 -43909 -70813 -98907 -91359 -107815 -56140 -13720 -22735
12786b2735L8641O9411J1022q1593n7617r841J23418J8814l8971L4886j8615K0765
12774H7585L3890k1208J7306n8479l7732L6156N9375n6683l5222N637M332n8189
12762b3232j3005L599m2942o9137L263Q6367k574J5894j8319M4776M6511k755
12750B8446K0271K1232k226o081K599N355m3527j00114m957j0108k8079k8747
12738a45936L8599Q5556J01633K6602M7882O1781M2017n8551J1120p5268j25685
12727I750R1102Q8918K0959N6056J7224l2913J9080L5419J7960L6987K7262P1482
12715D59286M0375M5468O6073O383O4188J76457R7100K35537L38961K88221K78383
12704B096432K38485J28584j03121l46158m61361m67094l63972k04676r6607j12196
$$ plain form
12786 -22735 15906 85317 96339 14746 -42871 -52712 70706 89520 50549 85435 66820 87585
12774 87585 121475 100267 117573 59094 21362 57518 116893 60210 24988 30625 34957 -23232
12762 -23232 -36237 -32638 -75580 -144717 -141454 -55087 -57661 -41767 -60086 -15310 31201 28446
12750 28446 48717 69949 67723 61642 64241 69596 26069 -74045 -79002 -89110 -117189 -145936
12738 -145936 -107337 -21781 79852 106454 154336 216117 258134 199583 210703 135435 9750
12727 9750 100852 189770 210729 266785 284009 251096 270176 305595 323555 360542 387804 459286
12715 459286 499661 545129 611202 617585 681773 858230 955330 1190867 1529828 1818049 2096432
12704 2096432 2334917 2463501 2360380 2014222 1552861 1085767 721795 517119 420512 308316
12694C08316j47807q9762M5545K3174m1875O639k0791K3658M914m2323L6835K7299
12682A33822j9670j0800q993R86n1090n3083q871N283M140l0840n5742k0155j6691
12669a31704N6939L8207O578J5519L9103M4076K3880l0130j0851L6789L5584o67
12657A23323M642n5993p0283k7288K6591k85o9184K4880P7954O3382n617J4359
12645A06481j8798l3249L4893N4957p1605m8393j7793K2489o6835j4675j0485
12634f3013K3179L0169k9566k1172K5105L9136j7569j4437m4838k4489j9612L688
12622a13419K7672J5353Q9376O8623r791m1603o5706k7681n0999K9654P5347M2808
12610C9634M5893l1821j4884k6936p543l4784P886J1424O3216O6691k5895o3924
$$ plain form
12694 308316 160509 70747 116292 139466 97591 104230 83439 107097 112011 69688 106523 133822
12682 133822 114152 103352 94359 95345 44255 -8828 -17699 -12416 -8276 -39116 -94858 -115013 -131704
12669 -131704 -74765 -36558 -29980 -14461 24642 68718 92598 62468 51617 88406 123990 123323
12657 123323 127965 71972 1689 -25599 992 707 -68477 -43597 34357 97739 92122 106481
12645 106481 87683 54434 89327 144284 72679 24286 6493 28982 -37853 -52528 -63013
12634 -63013 -39834 -9665 -39231 -60403 -35298 3838 -13731 -28168 -73006 -97495 -117107 -113419
12622 -113419 -85747 -70394 18982 87605 77814 36211 -29495 -57176 -108175 -78521 -3174 39634
12610 39634 85527 53706 38822 11886 4343 -30441 -22555 -11131 52085 118776 92881 28957
12598B8957j0406k5003M4160j963k6969n9989K5005J08437J187m6576K4200J0747
12586G1787j7672k2577j2760K9807K882n1843l5656O2991O2001L339K407m9807
12574D4899m8700J0736J11082J5066n2128J5241n4317m5423K856R891j6435R066
12562A834n9171l3060O6034K3212j6648M154L5379m9337P530j0497L4973J01909
12550A06312m5150p5416k177j2773K9393J6673N877L695K3336J210n6148J3611
12538H443P4755N9576K7490m8172K7383O5185L4237P8925R6836P4566J8643M9644
12526E67511o912q6574j09564o9145n7122q1856l5899m3917N10n5058l1264o9684
12514g8974J2260J02933j3527m1654j7574K9614Q0021J6912M7375j9296n2328
$$ plain form
12598 28957 18551 -6452 37708 35745 8776 -51213 -26208 82229 83416 36840 61040 71787
12586 71787 54115 31538 18778 48585 51467 -376 -36032 26959 88960 92299 94706 44899
12574 44899 -3801 6935 118017 133083 80955 96196 41879 -3544 -688 9203 -7232 1834
12562 1834 -57337 -90397 -24363 -1151 -17799 -13645 21734 -27603 -20073 -30570 4403 106312
12550 106312 61162 -14254 -16431 -29204 189 16862 22739 26434 49770 50980 -5168 8443
12538 8443 83198 142774 170264 122092 149475 214660 248897 327822 424658 499224 517867 567511
12526 567511 560599 474025 364461 295316 238194 156338 120439 76522 77032 21974 -9290 -78974
12514 -78974 -66714 36219 22692 -18962 -36536 -6922 73099 90011 137386 118090 65762
12503F5762J4025n3826o3144P825m4483L3338M7029k8864J9583L5246Q7460j4358
12491A05593Q558N0819k5377K3110K7221j4494J1226Q8563M1177M8234J12008
12480D76638M9813M1813Q8593L3487J05071O0948N6876n2376j44474j48356r9748
12469D68285j63464j02026n4718p1049n6278L9423P745J949k9498m1594j3246
12458a4471K3705N2506M8767l3372n3480n2591q292K5033M1119L1702Q377M4865
12446A13868N3799j7087J1666j0025P389m0083o4751k4888J1852l5406j9931K077
12434a1520O1526l0669p861O404K1004P1149P0541L8600M5188M8778Q2445n417
12422C90168j3578k0896l2577k6871O03j09807j15722m2668p888P595m951l4379
$$ plain form
12503 65762 79787 25961 -37183 -29358 -73841 -40503 6526 -22338 -2755 32491 119951 105593
12491 105593 114151 164970 139593 162703 189924 175430 186656 275219 316396 364630 476638
12480 476638 526451 568264 656857 690344 795415 856363 913239 860863 716389 568033 468285
12469 468285 304821 202795 148077 77028 20750 60173 67918 69867 40369 -1225 -14471
12458 -14471 9234 61740 110507 77135 23655 -28936 -37228 -12195 28924 60626 69003 113868
12446 113868 167667 150580 162246 152221 159610 119527 54776 29888 41740 6334 -13597 -11520
12434 -11520 50006 19337 11476 17880 38884 110033 180574 219174 264362 313140 395585 390168
12422 390168 376590 355694 323117 296246 296849 187042 71320 28652 20764 28359 23408 -10971
12410a0971j1033M9802k5863j862K0154L3996M882J3984J0103p2997J3476N5991
12398G9662n4334m4019q287L3449j3712l4832M7500L9793l8574K6617j0577J14
12386B2800k9754L6518k0049j3893j6706j4791l1599k112Q3737k932m8613M483
12374c2911K951N2168j1763Q78K6601P1906R220q48m5012l6077Q3864K0449k1972
12361A19454r910k4746k887n5216k9447o0395J246L7318M1219O502m2390j6794
12349c6046l8964P8804Q1986L2307P658l2192p0718q088k2626R872j6272j6890
12337c1169K385j3998j3421L3767l3777M0780P2319L3618N4330m3940p6565j3309
12325A1020N7873K586L7315N1993Q033p864p487l6629j9422M1696N3274o1765
$$ plain form
12410 -10971 -22004 27798 1935 73 20227 54223 59105 73089 83192 10195 23671 79662
12398 79662 25328 -18691 -26978 6471 -7241 -42073 5427 45220 6646 33263 22686 22800
12386 22800 -6954 29564 9515 -4378 -21084 -35875 -67474 -69586 14151 11219 -37394 -32911
12374 -32911 -29960 22208 10445 11323 37924 109830 119050 118202 73190 37113 120977 141426 119454
12361 119454 109544 84798 81911 26695 -2752 -63147 -61901 -24583 16636 23138 -19252 -36046
12349 -36046 -75010 3794 85780 118087 125745 93553 22835 14747 -7879 1993 -14279 -31169
12337 -31169 -28784 -42782 -56203 -22436 -56213 -15433 56886 90504 144834 100894 24329 11020
12325 11020 68893 71479 108794 160787 168820 160956 153469 116840 97418 139114 192388 130623
12313A30623r0978N2659P7038j4182L6557K2424O553p470j3781m7793j6872O2683
12301A97461p5507m4183j8737j2414J6531n4612m7391J9140J8342L2392j9418
12290A1604L6941l1449j7136J0474j0535o0575m7343M7158o022J1621M4599M79
12278a0184j084l502N3377J8767k5835k3809p80M587k2664L770N9211j0127l2601
12265I126L950K6383M7403l5630p4949K0235Q3234N4764R839o6051M9182O032
12253A33518q2164r2226p0974P6528K1686L6946k4323l0461K2896K3955o914k0780
12241a2313K3313N0152k1896K906l4707R804l7236k349K2874K5254p195k2538
12229c931m5929L1063R8609N2413J3073J7833n2505l9026q308j3227N3812k5483
$$ plain form
12313 130623 39645 92304 169342 155160 191717 214141 220694 213224 199443 151650 134778 197461
12301 197461 121954 77771 59034 46620 63151 8539 -38852 -19712 -1370 31022 11604
12290 11604 48545 17096 -40 10434 -101 -60676 -108019 -60861 -66883 -55262 -10663 -10184
12278 -10184 -11268 -14770 38607 57374 31539 7730 6950 11537 -11127 -7357 51854 41727 9126
12265 9126 13076 39459 86862 51232 -23717 -3482 79752 134516 144355 78304 127486 133518
12253 133518 51354 -40872 -111846 -35318 -13632 23314 -1009 -31470 -8574 15381 8467 -12313
12241 -12313 11000 61152 39256 42162 7455 17259 -19977 -22326 548 25802 18607 -3931
12229 -3931 -49860 -18797 79812 132225 145298 163131 110626 71600 63292 50065 103877 78394
12217G8394J0652l9106o4704J8696R564J242R545R407q432r765L2088J4601M5930
12204A08112J1329k922j10224J2949N2749N2148P6563r2796o2811J1804J4972
12193G1873r137k5071j3451J10690M3996l6079k8382O3729R4885j04551r8630
12182F9872J569m9501o0272M648P4852L6735L7377J23171N7439m0016L0982l3901
12170B52955p4712K0319K0159n6567n8543L2949K9395J7269l5362m8420N1608
12159A51050J32382K4571k5273k4587M879K6009P82J3687P9759K9147k5641K239
12147C89004r834L3828k5720O950Q6101l2286m659Q3207Q0332L1189M4864M2713
12135G25689J5024Q2087N5757P7966K8578Q8183J9313R7640Q3427L3035J5490
$$ plain form
12217 78394 89046 49940 -14764 3932 13496 14738 24283 33690 25258 15493 47581 62182 108112
12204 108112 119441 116519 6295 19244 71993 124141 200704 107908 45097 56901 71873
12193 71873 62736 37665 24214 134904 178900 142821 114439 178168 273053 168502 69872
12182 69872 71441 21940 -38332 -33684 41168 77903 115280 238451 295890 255874 286856 252955
12170 252955 178243 198562 218721 162154 103611 136560 165955 183224 147862 99442 151050
12159 151050 283432 308003 282730 258143 263022 289031 289813 303500 383259 412406 386765 389004
12147 389004 379170 412998 387278 394228 480329 448043 443384 526591 606923 638112 682976 725689
12135 725689 740713 822800 878557 956523 985101 1073284 1092597 1190237 1273664 1306699 1322189
12124A322189K4699M8880L5471N415p3164m5438l460R3022J6777J1762Q3474R3536
12112A613163J82930K08169J51504J26914K52303M30579M48375M17587M35678
12103D267202N17766M39021N13614M91992N29959O50150O64372P32020P90936
12094I597032Q44413Q01430P18512P69641Q74701J022582J237822J715928K372680
12085A9954741L199693M201894N193659O167820P548037R351255J1072873J2758963
12077G9448935J4184811J2226097J792380j3541402k2918023k1545615j4840359
12070C4806824r065077n629136l610672k375220j802563j469543j135904r17155
12062H801554o32499m07858j94939j29420o396L29084M85821M51120K27007K28566
$$ plain form
12124 1322189 1346888 1395768 1431239 1436654 1363490 1318052 1314592 1407614 1424391 1436153 1519627 1613163
12112 1613163 1796093 2004262 2155766 2282680 2534983 2965562 3413937 3831524 4267202
12103 4267202 4784968 5223989 5737603 6229595 6759554 7409704 8074076 8806096 9597032
12094 9597032 10441445 11242875 11961387 12731028 13605729 14628311 15866133 17582061 19954741
12085 19954741 23154434 27356328 32549987 38717807 46265844 55617099 66689972 79448935
12077 79448935 93633746 105859843 107652223 94110821 71192798 49647183 34806824
12070 34806824 25741747 20112611 16501939 14126719 12324156 10854613 9718709 8801554
12062 8801554 8169055 7761197 7566258 7436838 7430442 7759526 8245347 8696467 8923474 9152040
12052I152040M97107O64335O62145O49732P97564Q99828R55990J053310J187280
12043A6519331J318355J393391J392915J318759J400921J396762J574831K045530
12035B8360795K675730L646579M959414O733968Q462635J0370755J2852985J5879011
12027I3941872J9124897K2641594K6553087K6531249J2996460j2373519l4901583
12020A54514057m2456951l4932131k2981131j4005441q598755n678151m026320
12013B1835177l193122k649687k173848j778884j422506j088893q43428p31442
12005G953367n10862l17551q9894J27449J96409K59876J97027K27895J36397J24946
11995H305059L02888M25958N59133O67143N82345L09383K62199L65066M53781
$$ plain form
12052 9152040 9649147 10313482 10975627 11625359 12422923 13322751 14278741 15332051 16519331
12043 16519331 17837686 19231077 20623992 21942751 23343672 24740434 26315265 28360795
12035 28360795 31036525 34683104 39642518 46376486 54839121 65209876 78062861 93941872
12027 93941872 113066769 135708363 162261450 188792699 201789159 189415640 154514057
12020 154514057 112057106 77124975 54143844 40138403 31539648 25861497 21835177
12013 21835177 18642055 15992368 13818520 12039636 10617130 9528237 8684809 7953367
12005 7953367 7442505 7124954 7035060 7162509 7358918 7618794 7815821 8043716 8180113 8305059
11995 8305059 8607947 9033905 9593038 10260181 10842526 11151909 11414108 11779174 12232955
11986A2232955N42789O62970P72536J010815J430352J991996K752879L484310
11978B4881602M289974N268159O508122P937190R337057J0861337J2016775R995340
11970I1095556J398987r831599j7666844j8816877j4352859r073645n567380l491555
11962A3693784k306487j750686j399912j281370r82412q09758o37756n31710m65464
11953C528229l69316m03849k60069j53381j39064m0601n7486j64618j81215k13632
11943A544998j65987q9459o5458K0402p7785o8456j9138q8688m8973j6187k9194
11932H96075L5338L09o0061n4085k8548m1603p2236q0448l8318j7135L0699N3049
11920F23036p9043l4481Q866K157j3626N727j5491N024J6995k2092K3740J2300
$$ plain form
11986 12232955 12775744 13438714 14211250 15222065 16652417 18644413 21397292 24881602
11978 24881602 29171576 34439735 40947857 48885047 58222104 69083441 81100216 91095556
11970 91095556 92494543 82662944 64996100 46179223 31826364 22752719 17185339 13693784
11962 13693784 11387297 9636611 8236699 6955329 5972917 5163159 4525403 3993693 3528229
11953 3528229 3158913 2755064 2494995 2341614 2202550 2161949 2104463 1939845 1758630 1544998
11943 1544998 1379011 1289552 1224094 1244496 1166711 1098255 1079117 990429 941456 925269 896075
11932 896075 931413 931722 871661 817576 789028 747425 675189 594741 556423 539288 569987 623036
11920 623036 543993 509512 518378 520535 506909 512636 497145 502169 519164 497072 520812 533112
11908E33112M9283k3236j5604l5043K2617o615q6012q8835p8964j036N1386K4918
11896C45971m2814q0135l6019M3255j1871K6055m7765m8873K8645P5344K5474
11885B77267j3006N7202L6465j4278m7643L438q247j00664K840j5808l2986O3093
11873B07673Q7751o8273m4512J0169K3459J11987L9323j2724J4605O3219j5112
11862D17565m7116k1464o5713p0601l905j8901m4500M2130M6028l3258j662L3829
11850B32432K2158n7564p166O2349m3420n1626j2299q754J3723o7384n6844j88
11838B5417M6435o095l3366J06234M6148M550K9253l0281p8229j498J4303L0428
11826A53299j6105n7911l7839L8773J31326l347q7880l3553O1946k7077N8667
$$ plain form
11908 533112 582395 559159 543555 508512 531129 524514 438502 349667 270703 269667 321053 345971
11896 345971 303157 223022 187003 230258 218387 244442 196677 147804 176449 251793 277267
11885 277267 264261 321463 357928 343650 296007 299445 291198 190534 193374 177566 144580 207673
11873 207673 295424 227151 182639 192808 216267 328254 367577 354853 369458 432677 417565
11862 417565 370449 348985 283272 212671 208766 189865 145365 187495 233523 200265 198603 232432
11850 232432 254590 197026 189860 252209 208789 157163 144864 136110 149833 82449 25605 25417
11838 25417 71852 65757 32391 138625 184773 189323 218576 188295 110066 108568 122871 153299
11826 153299 137194 79283 41444 80217 211543 208196 120316 86763 148709 121632 180299
11815A80299K3140k3862n1836k6482k435j3938R497J3814q02M4097L3157P738
11803A92387K5644k8321q8107J1298P4728N8126n5324l1354n742J0291p8349j5552
11791F9725J1788K9433l0133K4347m4377J1137N5091j5258Q726M9367K725l8513
11779A34058k7180Q334m3611j0234N7906K5924r502K1771O785m7013n8193l2518
11767B6527R677J0012k2156J3010j8497q967L0903k4018L8928P4533J7882m0006
11755A07828o9106J7124o4499L9078J6656J2471J2588j2343K8539p0805m3701
11744b6170L1367O4995R38k4048l6096O111n8888l1209R298K2194J5332j7925
11732d4101O1414O3977n609J9108k1729J8536M9636q287J0574k7183K3462l6982
$$ plain form
11815 180299 203439 179577 127741 101259 98824 84886 94383 108197 107395 151492 184649 192387
11803 192387 218031 189710 101603 112901 187629 245755 190431 159077 153335 163626 85277 69725
11791 69725 81513 110946 80813 105160 60783 71920 127011 111753 120479 169846 172571 134058
11779 134058 106878 115212 71601 61367 119273 145197 135695 157466 164251 117238 59045 26527
11767 26527 36204 46216 24060 37070 18573 9606 40509 16491 55419 129952 147834 107828
11755 107828 38722 55846 -8653 30425 47081 59552 72140 59797 88336 17531 -26170
11744 -26170 5197 70192 71130 47082 10986 17097 -41791 -73000 -63702 -41508 -26176 -44101
11732 -44101 17313 81290 75681 94789 73060 91596 141232 132945 143519 116336 139798 102816
11720A02816p8156L884J4311q4611k351M0068j0632K2591L6158j825k1576L7280
11708E7957L8021q3786l2005N7712o628m0024p478L0161J9250O4548M457k3030
11696G9155l609K8666r2420J1288P2212j5974m3244m2426M7937o62j1554L9193
11684F8562q064J1768Q06j8154o2027l1688L0670K6065k8593N0650K8824r199
11672E9620M451J1959m2339J5126N2053K1828p8404j261M4269N4973K0714k7744
11660A35245n6829L4338j6115l9794l783k8378Q589M3763K5332o6365l0462j6093
11648a0552M3164O0027K5508K3269M465j27018n0271J1722j5979L129m535K6435
11636a0636j6618m0006K6780M999J2623K3224K4027J5953J377K6560P7715p105
$$ plain form
11720 102816 24660 28544 42855 -41756 -44107 -4039 -14671 7920 44078 42253 20677 57957
11708 57957 95978 12192 -19813 37899 31271 -8753 -16231 13930 33180 97728 102185 79155
11696 79155 75546 104212 11792 23080 95292 79318 36074 -6352 41585 40923 29369 68562
11684 68562 60498 72266 73072 54918 -7109 -38797 -8127 17938 -10655 39995 68819 59620
11672 59620 64071 76030 33691 48817 100870 122698 44294 43033 87302 142275 162989 135245
11660 135245 78416 112754 96639 56845 53062 24684 33273 77036 102368 36003 5541 -10552
11648 -10552 32612 92639 118147 141416 145881 18863 -31408 -19686 -35665 -32536 -37071 -10636
11636 -10636 -27254 -67260 -40480 -35481 -22858 366 24393 40346 41723 68283 145998 138893
11624A38893m677K0571R2037Q8073P5306O3732M7213L3649n8355p6733j15282
11613C04427k6832l4788n8649j3262k3567k0789m8549k1030q410o962o29L6751
11601G7711M9055k5128m4719J4930K4520k6898M8954M3990K7416m0269L8995J0961
11589A99518J5368k6893k5822L3987K6437q2028k5669K2662J8443K4162j2666
11578A67499M0895L8813J3088M1667N7526O8851K2095r741M4349J62370J90188
11567H37600Q7687L9270J79297R3519j20145k63369k23322k40077j42376k7681
11557B20403K8089K2906m2993j05823j17013o0812K5400L0046J4520N150m904
11546A4969M7266n9849l6887j2144P3883j8411p8510L7555P389J9758M7177l2541
$$ plain form
11624 138893 134216 154787 246824 334897 410203 473935 521148 554797 496442 419709 304427
11613 304427 277595 242807 184158 170896 147329 126540 77991 56961 48551 41589 40960 77711
11601 77711 126766 101638 56919 71849 96369 69471 118425 162415 189831 149562 188557 199518
11589 199518 214886 187993 162171 196158 222595 140567 114898 137560 156003 180165 167499
11578 167499 208394 247207 260295 301962 359488 428339 450434 440693 485042 647412 837600
11567 837600 925287 964557 1143854 1237373 1117228 853859 630537 390460 248084 220403
11557 220403 248492 271398 228405 122582 5569 -55243 -29843 203 14723 19873 14969
11546 14969 62235 2386 -34501 -46645 27238 8827 -69683 -32128 -24739 -4981 42196 9655
11534I655j6962k3200j5001M7350n397p4747l0355P9322j1786R508N6223R681
11522C4291K2870N6058N6321p3280M658P6099N9465P9582R1501J56073M5009o2334
11510E46313j03115j41469p8528m5635l0614o0324O0852P5234l846j35360q5593
11499b085L6759R9897L1683n2511p1653j7911n2832l5367L2988L4023R1440N299
11487I9730q0135l0605J3990M4314J8569K631J9713j9L4161J4815p8914j22825
11475f4575l3713l3307L7795M4795K8074L3968K7464p151k6959k2199N1200P1047
11463A06439j7448n543o9387k6311j9060N91K2468q5251k5368K7202P0746N7254
11451C6332r994K4443N3626j5942k6971J1673K407l488j3707j1984L9327K5469
$$ plain form
11534 9655 -7307 -30507 -45508 1842 -3555 -78302 -108657 -29335 -41121 -31613 24610 34291
11522 34291 57161 113219 169540 96260 100918 177017 236482 316064 407565 563638 608647 546313
11510 546313 443198 301729 223201 177566 146952 86628 147480 222714 218868 83508 -2085
11499 -2085 34674 134571 166254 113743 42090 24179 -28653 -64020 -31032 2991 94431 99730
11487 99730 19595 -11010 2980 47294 65863 68494 88207 88188 122349 137164 58250 -64575
11475 -64575 -98288 -131595 -93800 -49005 -20931 13037 40501 33350 6391 -15808 35392 106439
11463 106439 88991 83448 14061 -12250 -31310 -30719 -8251 -93502 -118870 -91668 -20922 36332
11451 36332 26338 50781 104407 88465 61494 73167 75574 72086 58379 46395 85722 111191
11439A11191n1590j0948l8548l0618m2713l129M0499M1082L5215j179M3899j4046
11427G9115K7364N8755n5955q4139m9542o8609n0504L3443O6889R4038O90l2855
11415A8690p8565M169Q5477J01594J8067m1921j19015o603J1178m2472l5556n7132
11403a42089Q62j4619k9856K0484N1300J2890N419K2162M4113m9091m5054J9528
11391a03951N3453L3097P4138J8601n3447k4948j2714J15572O8381k3495l4586
11380A10101k27o0925n0448L9299K1790L6025J1357m5115n7075m1754M808r133
11368d1297N0233N0583j234j7501l3141O0166N0140j2074q3050j0003k7745M4987
11356C0064K421J2695j6772l0609k8111N1885j432l4094L4040K923p8371l7633
$$ plain form
11439 111191 59601 48653 10105 -20513 -63226 -66355 -25856 15226 50441 49262 93161 79115
11427 79115 106479 165234 109279 25140 -24402 -93011 -143515 -110072 -43183 50855 51545 18690
11415 18690 -59875 -55706 29771 131365 149432 107511 -11504 -18107 -6929 -49401 -84957 -142089
11403 -142089 -141227 -155846 -185702 -165218 -113918 -101028 -95609 -73447 -29334 -78425 -123479 -103951
11391 -103951 -50498 -17401 56737 75338 21891 -3057 -15771 99801 168182 144687 110101
11380 110101 109874 48949 -1499 37800 59590 95615 106972 61857 4782 -36972 -32164 -41297
11368 -41297 8936 59519 58285 40784 7643 67809 117949 105875 22825 12822 -14923 30064
11356 30064 32485 45180 28408 -2201 -30312 21573 20141 -13953 20087 23010 -55361 -92994
11344i2994R5207j971M097l4477j2587l2107L074J2498k0510L0822m207r721N5920
11331f956M1130l9234J5133r210P0407K5793K8511N4541j5742n3822m0550K5626
11319I5627j8571k1414R506m1863l6094j8815k0148K8990l8461M9004L8871p064
11307A9568m372j0358L125n166l6802p031k1228L5282J9217J3108j285q2686J1245
11294f7383K9041r254q9573L8722Q6314J9046Q0199Q2639q8196j07653k2082K6299
11282b1881j8862o4467l3223L8706L2019m9690K419N5079m0120m070K7240N3864
11270b2986O5702n4236m4854p9708j2961j971J5744O9114Q8961J3571n6540M2761
11258B2597L0379m4768K7156o945N6192R3016l4160r0178n6062m7029L987K3717
$$ plain form
11344 -92994 2213 242 4339 -30138 -42725 -74832 -71758 -59260 -79770 -48948 -53155 -62876 -6956
11331 -6956 34174 -5060 10073 863 71270 97063 125574 180115 164373 110551 70001 95627
11319 95627 77056 55642 65148 23285 -12809 -31624 -51772 -22782 -61243 -12239 26632 19568
11307 19568 15196 4838 7963 2797 -34005 -41036 -62264 -26982 -7765 5343 4058 -78628 -67383
11294 -67383 -38342 -47596 -137169 -98447 -12133 6913 87112 169751 81555 -26098 -48180 -21881
11282 -21881 -40743 -105210 -138433 -99727 -67708 -117398 -114979 -59900 -100020 -104090 -76850 -22986
11270 -22986 42716 -11520 -56374 -136082 -149043 -151014 -135270 -66156 22805 36376 -20164 22597
11258 22597 52976 8208 35364 28419 84611 177627 143467 53289 -2773 -49802 -45815 -22098
11246b2098k4583K3781J26007j0742p2885l3575l1812J0618L1593o312n7378K4370
11234d3016j6127O3160P791k0403L384N0568P588N32j439Q218K9458n5364r3644
11221e9294L8606M6290k3106l5568K4618J1440m9699j6964q937j9978K9714m9082
11209a11960K6681N4279M4078L9824q17l1658J3808l1639j319J6804J0391j1235
11197A7237k2736k4296k1451P803j4214J3163M858m294p782L523J6521K1144K7412
11184A6888J9930m932L2268K9524p420K9515M8273l3388P891l6098p3722q9880
11172f1151j3436L4255L0810K3406k1232j8293J7184L0528j099k1137l2200K0160
11160a2205J8585k7913j4080R0700Q1610l4915m2249m4087P7902L197j4175m5507
$$ plain form
11246 -22098 -46681 -22900 103107 92365 19480 -14095 -45907 -35289 -3696 -10008 -67386 -43016
11234 -43016 -59143 4017 11808 -8595 -5211 45357 52945 53477 52038 60256 89714 34350 -59294
11221 -59294 -20688 25602 2496 -33072 -8454 2986 -46713 -63677 -72614 -92592 -62878 -111960
11209 -111960 -85279 -31000 13078 52902 52085 20427 34235 2596 1277 18081 28472 17237
11197 17237 -5499 -29795 -51246 -43443 -57657 -44494 -39636 -43930 -51712 -48189 -31668 -10524 16888
11184 16888 36818 31886 64154 93678 86258 115773 164046 130658 138549 102451 28729 -61151
11172 -61151 -74587 -40332 -9522 13884 -7348 -25641 -8457 22071 20972 -165 -32365 -12205
11160 -12205 6380 -21533 -35613 55087 136697 101782 59533 15446 93348 96545 82370 36863
11148C6863N0679J5963k7920j2136J9387k7068k1379q1499k1596K1403K1589M2955
11136A7241k8949r853j354k2595n7207P0501M0617N6n702j9714L8520j9338k0036
11123a7813J59L5226N3555l4552l5700M9865k351m7760l8921P330l318K1880J5629
11110C229k4250k8710p326K1496p157J4552m4741k2366R7116k7526m2173j1074
11098g8930o917J4047n3153k7570Q5463P9217j1653M688K7235N4598l9891j76
11086D6958M8567q4922j4009K2735L5917m7523m9511K698M0772M385l9569r3020
11074a26522L6506O5310J1731k3012k2583j0959L4012L1047J0903K1780Qj3111
11062A5110j8505k9580p3689M342R7706L1309Q88J7136l7428m5158O0124M703
$$ plain form
11148 36863 87542 103505 75585 63449 82836 55768 34389 -47110 -68706 -47303 -25714 17241
11136 17241 -11708 -21561 -22915 -45510 -102717 -32216 8401 8457 2755 -16959 21561 2223 -17813
11123 -17813 -17654 17572 71127 36575 875 50740 48389 629 -38292 -30962 -34280 -12400 3229
11110 3229 -21021 -49731 -57057 -35561 -42718 -28166 -72907 -95273 1843 -25683 -67856 -78930
11098 -78930 -85847 -71800 -124953 -152523 -67060 12157 504 5192 32427 87025 47134 46958
11086 46958 95525 10603 -3406 19329 55246 7723 -41788 -39090 1682 6067 -33502 -126522
11074 -126522 -90016 -24706 -12975 -35987 -58570 -69529 -35517 -4470 6433 28213 28221 15110
11062 15110 -3395 -32975 -106664 -102322 -4616 26693 27581 44717 7289 -37869 22255 26958
11050B6958r4134k7050O6189N2647n0276m9172k1975L5751M0409L9374j8265m0176
11038c9720P0347l1242k1783l6612L6012K6259k1373L1345O184J9788J8667k1504
11026C6368k4498l168m516k3528n2571p039P0666p006o9932j6287M5829N3328
11014b354J6679N9074J1652J353j9555p1786p3678L7410Q59K147j3330K2627j8816
11001d7718M2864O6450l3891j00946m8618O3104J4641K5643P1413K719j5001n8198
10989a7538J1430J5612N7087L255n9948l5928m1432N0095L0969n0319p3886k5136
10977a35739L5947J20827L1978n1183p0608P6007K5166k8777l1429p0891k1069
10966a19771L4841K4075J0288M4326j1207j7454l8254M8386K3614k2772j31664
$$ plain form
11050 26958 -67176 -94226 -28037 24610 -25666 -74838 -96813 -61062 -20653 18721 456 -39720
11038 -39720 30627 -615 -22398 -59010 -22998 3261 -18112 13233 19417 39205 57872 36368
11026 36368 11870 8702 4186 -19342 -71913 -78952 -8286 -15292 -85224 -101511 -55682 -2354
11014 -2354 14325 73399 85051 86404 66849 -4937 -78615 -41205 -40346 -38199 -51529 -28902 -47718
11001 -47718 -4854 61596 27705 -73241 -121859 -58755 -44114 -18471 52942 55661 40660 -17538
10989 -17538 -6108 9504 66591 69846 9898 -26030 -67462 -17367 13602 -36717 -110603 -135739
10977 -135739 -99792 21035 53013 1830 -68778 7229 32395 3618 -27811 -98702 -119771
10966 -119771 -84930 -60855 -50567 -6241 -17448 -34902 -73156 -24770 -1156 -23928 -155592
10955a55592N9941J17049n7057n8668O3222Q208n8285m6459M7257M8180J03281
10944G1077k9321m1893m0608l3923Q746J8327o5318k2556N6015N5806J3105L1051
10932B0508k6760n9347k4202J2490O1403L4976K1106m5365q6904k0487M7495J110
10920f3977O9971j9733m5957k7673O8901P4195l4686q67j3966L366k1377K7632
10908A5829k2957n1942K93p209j339R3459K4020J0155l4651j0851R4400K8397
10896A37604n0788k9317O5421k5336n0957n093k5646l4578O0084K7214n2047o1123
10884d4562j0031K1861J9677M5630P435k286K3034L788J730o3449p5794m1273
10872a14240J8194M4049M6518N310J2651o311J6731J4943L2336r079l7246J0814
$$ plain form
10955 -155592 -95651 21398 -35659 -94327 -31105 -22897 -81182 -127641 -80384 -32204 71077
10944 71077 41756 -137 -40745 -74668 -65922 -47595 -112913 -135469 -79454 -23648 -10543 20508
10932 20508 -6252 -65599 -89801 -77311 -15908 19068 40174 -5191 -92095 -112582 -65087 -63977
10920 -63977 5994 -13739 -59696 -87369 -18468 55727 21041 20174 6208 9574 -11803 15829
10908 15829 -7128 -59070 -58777 -65986 -67325 26134 50154 60309 25658 14807 109207 137604
10896 137604 86816 57499 122920 97584 46627 41534 15888 -18690 41394 68608 16561 -44562
10884 -44562 -54593 -32732 -13055 32575 40010 37724 60758 64546 66276 2827 -72967 -114240
10872 -114240 -96046 -51997 -5479 -169 12482 6171 22902 37845 70181 61102 23856 34670
10860C4670M630q2113q6655J3823K2315L6957R685k7246n3497l0734R965M9537
10848i8663l6453L2661Q3455M5071Q944O432Q007j4825k1326O063j0968r8115
10836h9717K1835P715j4293j8440K9247L7999L2529k3999L3013J3029k1783k0362
10824a3227r179P767J452k4128p4446J4301J0431L3107J4477L625j0353l5598
10812h1771M4234l047K560k4190J1608m6124j3223P5198J8677m2152L4782K0772
10800b676m254m706n85J2673M2593n1022j4344j6260J5685P174j7961O6256M726
10787C7299l9873n0460l1482L3972p96k4014j1789J121O9231Q2369m202n9470
10775A906O87m144j8516k5534l7917j7308M8586Q6878j1528l2807N7118n9728
$$ plain form
10860 34670 39300 -42813 -129468 -115645 -93330 -56373 -46688 -73934 -127431 -158165 -148200 -98663
10848 -98663 -135116 -102455 -19000 26071 35015 41447 49454 34629 13303 19366 8398 -89717
10836 -89717 -67882 -60167 -74460 -92900 -63653 -25654 6875 -17124 15889 28918 7135 -13227
10824 -13227 -22406 -14639 -13187 -37315 -111761 -97460 -87029 -53922 -39445 -35820 -46173 -81771
10812 -81771 -37537 -40584 -38024 -62214 -50606 -96730 -109953 -34755 -16078 -58230 -23448 -2676
10800 -2676 -6930 -11636 -12221 452 43045 -7977 -22321 -38581 -22896 -15722 -33683 32573 37299
10787 37299 -2574 -53034 -84516 -50544 -51340 -75354 -87143 -86022 -16791 65578 61376 1906
10775 1906 2593 -1551 -20067 -45601 -83518 -100826 -52240 34638 23110 -9697 47421 -12307
10763a2307p6640q6804J7186O1227Q7445j8873J0156K2515j4900Q806N3974L5601
10751H7386j1677M2796K2470k9236l4357j1590m1862n2208K8056M9345J205L295
10739E3623p3689n5671m0339j5291N4192P9420p020j08835L847l5139q662M6136
10727a07428L7250O541j4047J8867K9204M2832J7063k4108l6301J2593j2764P269
10715b3029L5126M5688j3655n9759Q184J8544j0547p8654m4581O6510O7098j5119
10703d194o1868k9021O017K3328N101N3004O8840J1010n8337m2895j1959M5933
10691D959o697r6745Q99P0564J3753K2372n177j8760K9413J1766k0684l0408p111
10678c1856m7348K8895k7085p5734k1208R6485K0953L6049P905L4956o791K2126
$$ plain form
10763 -12307 -88947 -175751 -158565 -97338 -9893 -28766 -18610 3905 -10995 -2189 51785 87386
10751 87386 75709 118505 140975 111739 77382 65792 23930 -28278 -222 49123 50328 53623
10739 53623 -20066 -75737 -116076 -131367 -77175 2245 -4775 -113610 -109763 -144902 -153564 -107428
10727 -107428 -70178 -63637 -77684 -58817 -29613 13219 30282 6174 -30127 -17534 -30298 -23029
10715 -23029 12097 57785 44130 -15629 -7445 11099 552 -78102 -122683 -56173 10925 -4194
10703 -4194 -66062 -95083 -89066 -65738 -60637 -7633 61207 72217 13880 -29015 -40974 4959
10691 4959 -1738 -98483 -97584 -27020 -13267 9105 3928 -14832 14581 26347 5663 -24745 -31856
10678 -31856 -79204 -50309 -77394 -153128 -174336 -77851 -56898 -20849 -12944 22012 15221 37347
10666C7347J1310R521o4238J7012J3607k7665j441K6770j2906r2826N7853R6152
10654G0496N9444M1164K9310n4712r3030k7873r4859m5727O364O1033J4270K100
10642c2020L2669N8826J7736j3007j3414o2074n7200P846j4902o0669N3150J9168
10630f3891j3158M8493j3651k8388k7705k8755M7025K9368J3923P5152M1665m5056
10618C5022m6560p814k9170J01389K9391n3209j202l487m7096m6720n8109l4911
10606a62476P1024M2649l5838Q091j9385K8610O3094J0049j7954K4837P490j2345
10594G846m0821l7671q200J11384J2024o9182M217J2762k3614r1928K033j0709
10582a31859M4408j2127M1671N6323k284k2171k6385P5402M4086L797m1253k2831
$$ plain form
10666 37347 48657 58178 -6060 10952 24559 -3106 -4547 22223 9317 -83509 -25656 70496
10654 70496 129940 171104 200414 145702 52672 24799 -70060 -115787 -109423 -48390 -34120 -32020
10642 -32020 649 59475 77211 64204 50790 -11284 -68484 -60638 -75540 -136209 -83059 -63891
10630 -63891 -77049 -28556 -42207 -70595 -98300 -127055 -80030 -50662 -36739 38413 80078 35022
10618 35022 -11538 -19352 -48522 52867 82258 29049 27847 24360 -22736 -69456 -127565 -162476
10606 -162476 -91452 -48803 -84641 -76550 -95935 -67325 -4231 5818 -12136 12701 20191 7846
10594 7846 -32975 -70646 -78846 32538 44562 -24620 -20403 -7641 -31255 -123183 -121150 -131859
10582 -131859 -87451 -99578 -57907 -1584 -3868 -26039 -52424 22978 67064 70861 29608 6777
10570F777O1784K9653j9113k2901o106o6171K8770J3373j5183l2238n9842M5908
10558c5289M4279O4946p6077o0167O1567Q3184p5861j6512m7750j0010J2102K1810
10546c3778L7989M3925l2905J260k2603K26P4368k6817j46643o9693K319J5774
10534a56578M1696L1441m142j8545j0160M3394Q978J7433N1871M7184o6227k5377
10522c9032L9621J3049j05270q2382M9173L3240L149J6561l5209J0571M5475M057
10510d6997l9446K4963l1714l1171n3154K6389M6813K4473K4327O4499m0803m979
10498c6800j7359j205j6859l3522J4589l3056o3146P2208L0534M6857P131q2326
10486a12954L8987M9194R154M336l6775j4209p4869j8895o7039n2682M1986L4590
$$ plain form
10570 6777 68561 98214 79101 56200 50094 -16077 12693 26066 10883 -21355 -81197 -35289
10558 -35289 8990 73936 -2141 -62308 -741 82443 6582 -9930 -57680 -67690 -55588 -33778
10546 -33778 4211 48136 15231 16491 -6112 -5886 68482 41665 -104978 -174671 -172352 -156578
10534 -156578 -114882 -83441 -87583 -106128 -116288 -72894 -63916 -46483 5388 52572 -13655 -39032
10522 -39032 589 13638 -91632 -174014 -124841 -91601 -88452 -71891 -107100 -96529 -51054 -46997
10510 -46997 -86443 -61480 -93194 -124365 -177519 -151130 -104317 -79844 -55517 8982 -31821 -36800
10498 -36800 -54159 -55364 -72223 -105745 -91156 -124212 -187358 -115150 -84616 -37759 -30628 -112954
10486 -112954 -73967 -24773 -15619 -11283 -48058 -62267 -137136 -156031 -223070 -275752 -233766 -199176
10474a99176L1676P9293L8214r2664L8432J16583r308m3752k4827N7972R517r18
10462A042j7460k0826K3253J5915L8297p53O5510L8862o052o0503l0489K4729
10450G1525l8988j21546l1870K0435L6888k325P5242K8568l6504k6609J6136Q0710
10438G1662K205r554k9420k5742o3699j3854Q9269K0631M3823J9246k8071k965
10426G3531r758m7740l2804j5771N032Q7123k2658m6040O7235N2896k1349p0645
10414A9052p5851j4196N511M4156K8692m9148J4697j6070k5658K020j1768K2206
10402e6357M9589o697K4191p0775p904N8001j6748l5090n0075P817k2746j5074
10390a41868O7579Q586n3837K2447k5860J6566K0716L7974k8732j3132P4906k5086
$$ plain form
10474 -199176 -167500 -88207 -49993 -142657 -104225 12358 3050 -40702 -65529 -7557 1960 1042
10462 1042 -16418 -37244 -13991 1924 40221 39468 104978 143840 137788 77285 46796 71525
10450 71525 32537 -89009 -120879 -100444 -63556 -65881 9361 37929 1425 -25184 -9048 71662
10438 71662 73867 64313 34893 9151 -54548 -68402 20867 41498 85321 104567 76496 73531
10426 73531 63773 16033 -16771 -32542 -27510 59613 36955 -9085 58150 111046 89697 19052
10414 19052 -56799 -70995 -65484 -21328 7364 -41784 -27087 -43157 -68815 -66795 -78563 -56357
10402 -56357 -6768 -13465 10726 -60049 -67953 -9952 -26700 -61790 -111865 -104048 -126794 -141868
10390 -141868 -74289 -65703 -119540 -97093 -122953 -106387 -85671 -47697 -76429 -89561 -14655 -39741
10378c9741J5632M186Q183K3174l9435L9730K8535j8474j5427m244j5825L780
10366i926O3715m8930k9539R571l1827j0146n6933m8120N0677J2673j0646l4781
10354a44212K7485p0356k552J447N8548P5601L3294k5341j8169L823p706J6923
10342e1215J3276j3345l472K3217J6050l2861R657m3532L1576P773N4414N2073
10330F3611o2683J6046L3188m559k8094o4641Q880L9475n195p580j6711l4286
10318f2549l0663l3876L4904k3381m128J2924M9282L3469k7504k6737l3405Q4484
10306b7180P5639k6632o484n3161r7668K4834Q0497N7501K3011l5156n4434j0207
10294d9440O473M7043J4941l5524n5257K8180N0020o8617o2680M4607J4131j8302
$$ plain form
10378 -39741 -24109 -19923 -11740 11434 -28001 11729 40264 21790 6363 2119 -13706 -9926
10366 -9926 53789 4859 -24680 -15109 -46936 -57082 -114015 -162135 -111458 -98785 -109431 -144212
10354 -144212 -116727 -187083 -189635 -188188 -129640 -54039 -20745 -46086 -64255 -60432 -68138 -51215
10342 -51215 -37939 -51284 -54756 -31539 -15489 -48350 -38693 -82225 -50649 -42876 11538 63611
10330 63611 928 16974 50162 45603 17509 -47132 -38252 1223 -3972 -11552 -28263 -62549
10318 -62549 -93212 -127088 -92184 -115565 -119693 -106769 -57487 -24018 -51522 -78259 -111664 -27180
10306 -27180 48459 21827 15343 -37818 -135486 -110652 -30155 27346 50357 15201 -39233 -49440
10294 -49440 -42967 4076 19017 -16507 -71764 -43584 6436 -62181 -124861 -80254 -66123 -84425
10282h4425N3783p645K396j696J6082Q125m089n1240R875O8768N2586k7013k4274
10269A1233j6222l326k2553l635q601q410j0439L2310K0977K0994k8446J5424
10257f94m8566p9722n4246L2118N3340P7053n2793N3381J8310k1288M5464P1286
10245I3643m1537n4696j4928m9795j6492m1654P687m4868P1701J04301M2182m4101
10233A1443m0009K3298j4013n4760K6502K9050J2896P8932L6082j12851j23697
10222a27127J1933J7620L4160M0513K316J7024N8694M3866q3197r8929l622Q117
10210g8632M0338j6561K7339l9786o0555P3889P1379K0333l1773o1610n652K844
10198e8447K4154J00208Q7955m4717j37455j14241k6110M5525j746Q6963N0637
$$ plain form
10282 -84425 -30642 -38287 -35891 -37587 -21505 -13380 -17469 -68709 -58834 9934 62520 35507 11233
10269 11233 -4989 -8315 -30868 -34503 -43104 -51514 -61953 -29643 -8666 12328 -16118 -694
10257 -694 -49260 -128982 -183228 -151110 -97770 -20717 -73510 -20129 -1819 -23107 22357 93643
10245 93643 52106 -2590 -17518 -67313 -83805 -125459 -117772 -162640 -90939 13362 55544 11443
10233 11443 -28566 -5268 -19281 -74041 -47539 -18489 -5593 73339 109421 -3430 -127127
10222 -127127 -115194 -97574 -63414 -22901 -20585 -3561 55133 98999 15802 -83127 -86749 -78632
10210 -78632 -38294 -54855 -27516 -67302 -127857 -53968 17411 37744 5971 -55639 -61291 -58447
10198 -58447 -34293 65915 153870 109153 -28302 -142543 -168653 -123128 -124874 -37911 12726
10187A2726L8050l429j5481K8099l0325R865K7415k2767L7348P785K5058m1637
10175G2707k6872J2578j7658j3216L4590M8806j6838l568J9057o7821m0934J455
10163B286O1139M3600N9293j9834q3923o4888K7579J9412L9213l3177n2426O1618
10151E9892J1807m8710m7701l0351J0522o022n7944N0848Q2251n416l2918K8944
10139A5202j6832q2600J5282l405K053j9334k0553M8529K6441K6520j3217O0091
10127C8177N45o7207J1792r717m5148J4688N8409K2283J6592k4823P599J3100
10115C6290n4603k2636J7309o3656n1621R213M1184M1625M3202j0701n6974K2961
10103d8407P9796M1947L4434k768j2678M6987j5007p3954m5549L6396K5158r546
$$ plain form
10187 12726 50776 47347 31866 59965 29640 39505 66920 44153 81501 89286 114344 72707
10175 72707 45835 58413 40755 27539 62129 110935 94097 90529 109586 41765 831 2286
10163 2286 63425 107025 166318 146484 62561 -2327 25252 44664 83877 50700 -1726 59892
10151 59892 71699 22989 -24712 -55063 -44541 -50563 -108507 -57659 24592 19176 -13742 15202
10139 15202 -1630 -84230 -68948 -72353 -70300 -89634 -110187 -61658 -35217 -8697 -21914 38177
10127 38177 38722 -28485 -16693 -26410 -71558 -56870 1539 23822 40414 15591 23190 36290
10115 36290 -18313 -40949 -23640 -87296 -138917 -129704 -88520 -46895 -3693 -14394 -71368 -48407
10103 -48407 31389 73336 107770 105002 92324 139311 124304 50350 4801 41197 66355 56809
10091E6809k5022m654o289p8457m1830K5641P647m8039J9957j8896J7192M8431
10079d7510M5143l3849m7533J2453O364O95k0128j9876j386P7581L6829l3469
10067b4686n2001j7186M4847p808n5853K0512j1286J5393l7028O53J7468l0018
10055a36993K810M2798L7587k5232P7725O5132L5042k6468n8261m3196J2323K7740
10043A1007O764k9387m3298r346j5095p305l6071K6146N3238M7751M0850j0144
10031C5110k538N1114k2059p5774o1759j2761P2563J3289l4468q9781K6911K654
10019i7499N6058J8672K5170k7612K2312k1206o3977j0687K0342k3081j4303N0417
10007f5394j2878m5351m612J3583N642N0563J1437J5825J1314l4206K671p8502
$$ plain form
10091 56809 31787 27133 20844 -57613 -99443 -73802 -66155 -114194 -94237 -113133 -95941 -47510
10079 -47510 -2367 -36216 -83749 -71296 -64932 -64237 -84365 -104241 -105627 -28046 8783 -24686
10067 -24686 -76687 -93873 -49026 -56834 -112687 -92175 -103461 -88068 -125096 -124443 -106975 -136993
10055 -136993 -134183 -91385 -53798 -79030 -1305 63827 98869 72401 14140 -29056 -16733 11007
10043 11007 17771 -11616 -54914 -64260 -79355 -86660 -122731 -96585 -43347 4404 45254 35110
10031 35110 32572 83686 61627 -14147 -75906 -88667 -16104 -2815 -37283 -127064 -100153 -97499
10019 -97499 -41441 -22769 2401 -25211 -2899 -24105 -88082 -98769 -78427 -101508 -115811 -65394
10007 -65394 -78272 -123623 -128235 -114652 -109010 -58447 -47010 -31185 -19871 -54077 -51406 -129908
9995a29908R326N1581O501m853j579Q5199N1186m9274j4100L6387j1345l6112
9983f991J02005k0344r3936n6299J8495J4571m1165N0853N0274J1912j4972Q343
9971B2746l9587O5278J9341n0148p289l5286K202l913n3375N1113l482k804j1457
9958d6661l5183j1475m549J8165N0628N2953q9649j9778J1492M7141L9290k8523
9946a6149n9793J5943K9726K8036J897j5900l62M4601K2377r4634l3570J05719
9934B7891K6963p3209r3492K5222Q3539N8046L8757j0411k8425m9701r534M3286
9922C8932N5544q5203k5256p7160m0082J9772P8228k4989m5876n1386N4202K2939
9910h0335K016J4678J4537L116l5138K315M2909K8342K6518N109n469k8989m1540
$$ plain form
9995 -129908 -120582 -69001 -62500 -67353 -68932 16267 67453 18179 4079 40466 29121 -6991
9983 -6991 95014 74670 -19266 -75565 -57070 -42499 -83664 -32811 17463 29375 14403 22746
9971 22746 -16841 48437 67778 17630 10341 -24945 -22743 -26656 -80031 -28918 -32400 -35204 -46661
9958 -46661 -81844 -93319 -97868 -79703 -29075 23878 -65771 -85549 -74057 -26916 12374 -16149
9946 -16149 -75942 -59999 -30273 -2237 -340 -16240 -16602 27999 50376 -44258 -77828 27891
9934 27891 54854 -18355 -111847 -86625 -3086 54960 93717 83306 54881 5180 -4354 38932
9922 38932 94476 9273 -15983 -93143 -133225 -113453 -35225 -60214 -106090 -157476 -103274 -80335
9910 -80335 -78319 -63641 -49104 -45988 -81126 -78811 -35902 -7560 18958 24067 18598 -10391 -51931
9897e1931l3108j1475k3138k1206O7934J06281K9981j9883j0974P9725Q630l8318
9885H2518K3478J7219n6838j16464K8048N4392k3880l6412O6310P1677l8344Q697
9873H0401M2349K1154k0134r8293j7100J5793k7998M2187P58O436l4900n1950
9861d1297o6831J4942K3223J7064J7176N6797m8504R013L5163j0055P99L0006
9849C7496m5219o5820n7101L9046O6569K0151j6769l7002k6832k8063M039J8449
9837i1056P134N6376j9885j8720j7861K3916N8063L1861o0477l6820L418m6847
9825a10898L4849j8025N230Q4516K9004p8662k3029J4998K1345K2814L8016K2826
9813D2984m4367j1839L6088M4864J6048o4297L8399O1556j6052r691n7679q753
$$ plain form
9897 -51931 -85039 -96514 -119652 -140858 -72924 33357 63338 43455 32481 112206 120836 82518
9885 82518 105996 123215 66377 -50087 -22039 32353 8473 -27939 38371 110048 71704 80401
9873 80401 122750 143904 123770 25477 8377 24170 -3828 38359 39117 45553 10653 -41297
9861 -41297 -108128 -93186 -69963 -52899 -35723 21074 -27430 -18417 16746 6691 7490 37496
9849 37496 -7723 -73543 -130644 -91598 -25029 -4878 -21647 -58649 -85481 -113544 -109505 -91056
9837 -91056 -83922 -27546 -47431 -66151 -84012 -60096 -2033 29828 -30649 -67469 -64051 -110898
9825 -110898 -76049 -94074 -88844 -4328 24676 -53986 -77015 -62017 -40672 -17858 20158 42984
9813 42984 -1383 -13222 22866 67730 83778 19481 57880 119436 103384 93693 36014 27261
9801B7261m8537k6394j2710J562O5600k7096J5578L5065K0764k0016l8091j056
9789h070k309j8635n1159R830O590k1718M9435P243j1368K8027n700k5683J8877
9776b4640j891m3626N323N5633m9796K6751N0524p455M6053J1850l4588k3564
9764A0574j3435J7564r586p1359j7014l704Q5590R09J3543j067n5587o3523j4166
9751a21261M6824k9851n4007L1113J35952K4247R093M2416j6977q2398n8771p265
9739h0885L3701q500m0409M5259P8999j2906p0447o7782L0615P3384n246L3070
9727H853L1590k9043l8308k3945j7786O201L9056M7458L8809J6842n8649l4273
9715a3195r626Q619j111N087o1753J3811N9978j9941L1631L6276k101K7877N7916
$$ plain form
9801 27261 -21276 -47670 -60380 -58818 6782 -20314 -4736 30329 51093 31077 -7014 -8070
9789 -8070 -10379 -29014 -80173 -70343 -63753 -85471 -36036 -28793 -40161 -12134 -17834 -43517 -24640
9776 -24640 -26531 -70157 -64834 -9201 -58997 -32246 18278 10823 56876 68726 34138 10574
9764 10574 -2861 14703 5117 -66242 -83256 -86960 -1370 -461 13082 12015 -43572 -107095 -121261
9751 -121261 -74437 -104288 -158295 -127182 8770 33017 42110 84526 67549 -14849 -73620 -80885
9739 -80885 -47184 -55684 -96093 -50834 28165 15259 -55188 -122970 -92355 -18971 -24217 8853
9727 8853 40443 11400 -26908 -50853 -68639 -62438 -23382 24076 62885 79727 21078 -13195
9715 -13195 -22821 -14202 -15313 -10226 -71979 -58168 1810 -18131 13500 49776 47675 75552 133468
9702A33468j0824L151n056J0814j1957m2946J1406K5399o181j8806p8264j03064
9690i2860K8596O4016Q756K838k180Q602P9697R535J0494o883L5580l89k1018
9677A24784j49980o9969Q2875k0606n8441O4372J11157n716p7568M517L9886j7824
9665B7487q0877m149L6448P6541K3596n725L06L937L0805j5355l1501m9120q37
9652A1556p466K913L4774L2852J750l6262p186K3042o519o7304R912K7613m9537
9639b9862J530K300l703k8067M290P7606J7007k9260l9878L9941L5050n9615j02453
9626a15114N3292M1437P585l901m8569l4855K2717K2992M1944L0466J339J9891
9614C9224N4645j2678r100m6957n9717p5079Q8829N7964j4360n3306m6051J4577
$$ plain form
9702 133468 122644 125795 120739 131553 119596 76650 88056 113455 107274 88468 10204 -92860
9690 -92860 -64264 -248 8508 11346 9166 17768 97465 107000 117494 110611 146191 145802 124784
9677 124784 -25196 -95165 -12290 -32896 -91337 -26965 84192 78476 908 5425 45311 27487
9665 27487 -53390 -57539 -21091 55450 79046 73321 73627 77564 108369 93014 61513 12393 11556
9652 11556 4090 7003 41777 74629 76379 40117 32931 55973 49454 -17850 -7938 19675 -29862
9639 -29862 -28332 -26032 -29735 -57802 -53512 24094 41101 11841 -28037 11904 46954 -12661 -115114
9626 -115114 -61822 -20385 -12800 -16701 -65270 -100125 -77408 -54416 -12472 17994 19333 39224
9614 39224 93869 81191 72091 25134 -34583 -109662 -20833 37131 22771 -30535 -76586 -62009
9602f2009R8346Q8408J6311q8313n4886N4394K5328K481q1490l8524M3414k3150
9590a9690J4683Q8058n2992m0633L6798O172j6983Q12L4847K968J687n0782M806
9577I751J5702j2690k6695n2415n9409P603N848Q7051J4766k6865k6991M6955
9565a7389P3215J2282k7068m3499n0522J9609P134N7604O4834N6376p0446q5906
9553c776P5515P0320q3473m0088k4404j5977J3996l2196r09k5116l2643K4620
9541g4131J3878k5638m1936O5561L6713J7062L4914l5789o4745r683N4578N4142
9529B4926m3280n2512L944J9332K5942N825M6051J0171K704m696J468K0259n3825
9516F309J1346J6914O143k887m0150Q714q249k4486O8137O8097M738l8055k9077
$$ plain form
9602 -62009 36337 124745 141056 52743 -2143 52251 77579 80060 -1430 -39954 3460 -19690
9590 -19690 -5007 83051 30059 -10574 26224 32396 15413 16225 51072 54040 55727 4945 9751
9577 9751 25453 12763 -13932 -66347 -125756 -118153 -112305 -25254 -10488 -37353 -64344 -17389
9565 -17389 55826 68108 41040 -2459 -52981 -33372 -26238 31366 96200 152576 82130 -3776
9553 -3776 71739 142059 58586 18498 -5906 -21883 -7887 -40083 -40992 -66108 -98751 -74131
9541 -74131 -60253 -85891 -127827 -62266 -25553 -8491 26423 -9366 -74111 -83794 -29216 24926
9529 24926 -18354 -70866 -66922 -47590 -21648 -15823 30228 40399 43103 38407 39875 60134 6309
9516 6309 17655 34569 40712 37825 -2325 6389 -1860 -26346 41791 109888 114626 76571 47494
9503D7494J150N0770K3187J6179l3490J9816K2892n3201l1116Q6087r696p6064
9491F4008n7566m154K4290R171k49J1068q579M9920J1870J1344P871L8905n7349
9478A00550n7698m108L3383k0488o2922p5062p633O2383j5676J5499P965J6982
9466f825j4197k0659l7395q3243Q2420J34836L0567p7272P691k4574m844P6676
9454F3181K6087k3803k3792J3367O2490K1829k400j1011l5420J0148P0644n1224
9442A20096k2162l9573l9079N1263J3796m1251m189O2124L3698O965k3505J3518
9430A31701p9510k2936P187k2899M618J13269J6572j09266r1511L7281L9145J2646
9418C6297n0015J259Q6728j541k9763j3573J2886M0517l0589o9853R2880R8617
$$ plain form
9503 47494 48644 99414 122601 138780 105290 125106 147998 94797 63681 149768 140072 64008
9491 64008 6442 2288 26578 35749 35500 46568 37989 87909 99779 111123 118994 157899 100550
9478 100550 42852 38744 72127 51639 -11283 -86345 -93978 -31595 -47271 -31772 -23807 -6825
9466 -6825 -21022 -41681 -79076 -162319 -79899 54937 85504 8232 15923 -8651 -13495 63181
9454 63181 89268 65465 41673 55040 117530 139359 136959 125948 90528 100676 171320 120096
9442 120096 97934 58361 19282 70545 84341 43090 38901 101025 134723 141688 118183 131701
9430 131701 52191 29255 36442 13543 18161 131430 148002 38736 -52775 -15494 23651 36297
9418 36297 -13718 -12459 74269 72728 42965 29392 42278 82795 52206 -17647 75233 173850
9406A73850l2182j07024n9596Q2177L5142o1480p0775k9630L3171M9897L9517
9395E3067O7592L3428j7839R854M311j1989n8451q0737J2996L2175j742M5221
9383H7886L6280k8615r804L911L2456L835K2773L8422l3849m5374m6655n3726
9371G540J9632M9136J6049J4766K2844N2668J3325k4095j28198j5356O5561J5889
9359A09761K7179M9444J7695M7478L3098j00502j34220r0305M2234M4224J515
9348D7601O829N9744O1423L9740l7890l7294N7045N831p499J0241L1535M6694
9336B84000q6153m3532L2732n6706r582n5999l4555K7958N5512Q7931N3536Q365
9324B63507J9197L2058m3142l4486n2133m8705k6615J3855K397j3217J575j1108
$$ plain form
9406 173850 141668 34644 -24952 57225 92367 30887 -39888 -69518 -36347 13550 53067
9395 53067 120659 154087 136248 146102 150413 138424 79973 -764 12232 44407 42665 87886
9383 87886 124166 95551 85747 89658 122114 125949 148722 187144 153295 107921 61266 7540
9371 7540 27172 76308 92357 107123 129967 182635 195960 171865 43667 28311 93872 109761
9359 109761 136940 186384 204079 251557 284655 184153 49933 -40372 1862 46086 47601
9348 47601 54430 114174 175597 215337 177447 140153 197198 203029 195530 205771 237306 284000
9336 284000 197847 154315 187047 130341 120759 64760 30205 58163 113675 201606 255142 263507
9324 263507 282704 314762 271620 237134 185001 136296 109681 123536 125933 112716 114291 103183
9312A03183k1305K1963j2861J7502n649q759L5695O2269O4452J3364p3905m534
9300A91415J7417K0869N4080J4498m527j1353P4878K1897j16661l5383m2534O1390
9288B45986K7014j6612k3046m4979l5679L2998J29873J3545n2615J8109O7523
9277C62117M7113K1466o0456j7391n137K5079J9273L3315N0422j7112m5379j6839
9265C96471M0022L0722P4900J3720J1625j3603j8635p182M7622Q8924m5677n651
9253F13258R232L6870L5281K5504o507k1019O5307J11513M69K2817L2890l0021
9241H95594K7925P6895M4037m3549N0462Q0915L7914L6290M7310J16979O6330
9230A437102L0803Q7433P0537N7676K6955P4111Q4675J45260J06767P6577J6777
$$ plain form
9312 103183 81878 103841 90980 108482 102833 94074 129769 192038 256490 269854 195949 191415
9300 191415 208832 229701 283781 298279 293752 282399 357277 379174 262513 227130 184596 245986
9288 245986 273000 256388 233342 188363 152684 185682 315555 329100 276485 294594 362117
9277 362117 409230 430696 370240 352849 347712 372791 392064 425379 475801 458689 413310 396471
9265 396471 436493 467215 542115 555835 567460 553857 535222 528040 575662 664586 618909 613258
9253 613258 622490 659360 694641 720145 713638 692619 757926 869439 869908 892725 925615 895594
9241 895594 923519 1000414 1044451 1000902 1051364 1132279 1170193 1206483 1253793 1370772 1437102
9230 1437102 1467905 1555338 1625875 1683551 1710506 1784617 1869292 2014552 2121319 2197896 2214673
9219B214673L4557P3877P1838M7326O0427J19802P9056K2137Q3018P4748J19474
9208C000933M3199L7322J02738J20323J01249q393j0195R225J0860n781n3090
9197C348390o9521k5861J2209L6460l464n4671j15639p5267n7308j07482o5935
9186B821911j04442p845m4152n4400j17066j25577j22891r8447p5717j31871m0221
9175A899282m8393k6477k1242j26735j21738j7827o6926j58551j2294j4003k7781
9164A257315o4593o3879o9225p637L616j2043n95j4260j24384m9089m8606k6302
9152G80318J10037j734j00925k3774j6096k1067l0150p5935o8139M2K2579N2389
9140F27545j7300k5104n4059m326M3299k2450k5453L6048m9111l2760K2240J5404
$$ plain form
9219 2214673 2249230 2323107 2394945 2442271 2502698 2622500 2701556 2723693 2806711 2881459 3000933
9208 3000933 3044132 3081454 3184192 3304515 3405764 3397371 3387176 3396401 3407261 3401480 3348390
9197 3348390 3278869 3253008 3265217 3301677 3298213 3243542 3127903 3052636 2995328 2887846 2821911
9186 2821911 2717469 2709624 2665472 2611072 2494006 2368429 2245538 2147091 2071374 1939503 1899282
9175 1899282 1850889 1824412 1803170 1676435 1554697 1536870 1469944 1311393 1299099 1285096 1257315
9164 1257315 1192722 1128843 1059618 1051981 1055597 1043554 1042959 1028699 904315 855226 806620 780318
9152 780318 890355 888621 787696 763922 747826 726759 696609 620674 552535 552577 575156 627545
9140 627545 610245 585141 531082 526756 570055 547605 522152 558200 509089 476329 498569 513973
9128E13973j7237l4757r6170o4632j3561L0007K5641N605p4922J1828M6094L273
9116C35142p977L5266M8917K1533n6551m7287l8328m4098l6538J3125M9316Q2069
9104C54589N0583m5438q1507K1639o3455m5516O5047N9689M149r2912n9284J3712
9092A81296l5177N9777O3006q0985m2257O4688L3344k5666l7803K3748J6524k3033
9080A97462k2091j6161P163J2906l985n2241p8177O5213O3896J1976k9588m8469
9068A07904K6626N1660k7568j4452J6551M8261m7971j4002J0541q388J441k2341
9056A28262o1052P9513P9747R952J2942l8962k7190n483K4490j6368n4L1221k3738
9043A93280N9330J5688o6747m9449k7331k7886J8661K7397r188m7395j2229M4746
$$ plain form
9128 513973 496736 461979 365809 301177 287616 317623 343264 348869 273947 285775 331869 335142
9116 335142 327165 362431 411348 432881 376330 329043 290715 246617 210079 223204 272520 354589
9104 354589 405172 359734 278227 299866 236411 190895 255942 315631 319780 226868 167584 181296
9092 181296 146119 205896 268902 187917 145660 210348 243692 218026 180223 203971 220495 197462
9080 197462 175371 159210 166373 179279 175294 123053 44876 110089 173985 185961 156373 107904
9068 107904 134530 186190 158622 144170 160721 208982 161011 147009 157550 149162 150603 128262
9056 128262 67210 146723 226470 236422 249364 210402 183212 177729 202219 185851 185797 217018 193280
9043 193280 252610 268298 201551 152102 124771 96885 115546 142943 133755 86360 74131 118877
9031A18877p295p0672j3405l0540J6080l463J1452K0502N2122Q4430K9428l0194
9019A77322k126N688J2607M1360l826n0201R929L0464k74p2747p1329n979K7482
9006I8370k4221L23J0253J8499J076L2803K1300m1892q5870j5886L5508Q1381
8994A31644K6056J068K3671L966o196L596k4894p2404o8119R946P3879J06811
8982B09024j736k1272J602m3559n3168k9899Q776m2352L4946K0232l500P143M1370
8969A27607K3935m8834J537N2191j7932j4673m510K123l0461n3246o9324q2002
8957a13589K5054R7377Q8238Q9366l3068m8289O8770l8205p1659J3182J5298j02144
8945i669n3244m781N0944j3205o8328N0052J02273L9984n4331m9921k2989O816
$$ plain form
9031 118877 111582 40910 27505 -3035 13045 9582 21034 41536 93658 178088 207516 177322
9019 177322 175196 180884 193491 234851 231025 180824 190753 221217 220943 148196 76867 70888 98370
9006 98370 74149 74472 84725 103224 104300 137103 158403 116511 30641 14755 50263 131644
8994 131644 157700 158768 182439 186405 180209 183805 158911 86507 18388 28334 102213 209024
8982 209024 207288 186016 187618 144059 90891 60992 69768 27416 62362 82594 79094 86237 127607
8969 127607 151542 102708 104245 156436 138504 123831 119321 121444 90983 37737 -31587 -113589
8957 -113589 -88535 8842 97080 186446 153378 105089 173859 135654 63995 77177 92475 -9669
8945 -9669 -62913 -67694 -16750 -29955 -98283 -48231 54042 94026 39695 -10226 -33215 -26399
8933b6399K9162O9131K3960J7843J0507m5717r626P4759K0178k0769l0914p4815
8921C7300j2182k1411o52k9909k1583P0449R7882M2095J6156l8105o0125o892
8909G3023M5148K4665L5938p603l3343p9820j5845K4248j2644m5931M2107J2046
8897F1989L7200L567o8253q757M158K3250K0533j4292J1420Q342m1018q5925J5263
8884c2523P999O505K6061L1680q4985m9582O1056J00215q838L1325J1176l548
8872I6541j7402M0386P525o160n4871k7093K3775J2339J0322J4007K2379n1424
8860G0324n4410J9910K0291n1735n1398j8716o4J763O4181K8236M2737L8298m1540
8847F7877J707L8552l3576l5007o0565o7651J396K2557P7459N6615N467N5174
$$ plain form
8933 -26399 2763 71894 95854 113697 124204 78487 68861 143620 163798 143029 112115 37300
8921 37300 25118 3707 3055 -26854 -48437 22012 119894 161989 178145 140040 79915 73023
8909 73023 118171 142836 178774 171171 137828 58008 42163 66411 53767 7836 49943 61989
8897 61989 99189 102756 34503 25746 29904 53154 73687 59395 70815 79157 38139 -47786 -32523
8884 -32523 -24524 -18019 8042 39722 -45263 -94845 -33789 66426 57588 88913 100089 96541
8872 96541 79139 119525 127050 120890 66019 38926 62701 75040 85362 99369 121748 70324
8860 70324 15914 35824 56115 4380 -47018 -65734 -65798 -64035 146 28382 71119 109417 67877
8847 67877 69584 108136 74560 39553 -21012 -88663 -87267 -64710 12749 69364 74831 130005
8835A30005m5737n7184L976m3415N8573j033N3953J7620n9169j9408J5927N9890
8823A13998L8816j2307q3147n5664L8983O9912p280L922K4563M8478k9787j3269
8811A37218J0366K4484q206l8973M741l5068j2729l8680M3932j022p0216k778
8799A3069n1233j4878K1432p79R2355P6525k8351m7588m1581o1265J9349J7548
8787e397Q8800N8564k5168l3516m9513m2014P4222k8531l5333n3270k5378N6034
8775b0500R4019j2888M999K7788K3420P5245l2119l3470k9529j6905r261O2799
8763A33598k4129n9805j1779o8886k8578J0261Q3288M4308L8896K4061j4805J866
8751A28296j7949o9180K4962L5488K6481L0913m5607q8862k4253j0657o854k579
$$ plain form
8835 130005 84268 27084 31060 -12355 46218 45185 99138 116758 57589 38181 54108 113998
8823 113998 152814 140507 57360 1696 40679 110591 103311 107233 131796 180274 150487 137218
8811 137218 147584 172068 163862 124889 129630 94562 81833 43153 87085 86063 15847 13069
8799 13069 -38164 -53042 -31610 -32389 59966 136491 108140 60552 18971 -42294 -22945 -5397
8787 -5397 83403 141967 116799 83283 33770 -8244 65978 37447 2114 -51156 -76534 -20500
8775 -20500 73519 60631 65630 93418 116838 192083 159964 126494 96965 80060 70799 133598
8763 133598 109469 49664 37885 -31001 -59579 -49318 33970 78278 117174 141235 126430 128296
8751 128296 110347 41167 66129 101617 128098 159011 113404 24542 289 -10368 -17222 -19801
8739a9801J14238Q2606l8987q4417J4390O792n2282m3234N6507K4511j0695M6979
8727I6607O0662R681j4599k4358j8968k817L1703N1816k3850o044O931K6952K7055
8714B20771k693j3691p5332q045M8641j474J895k3387P19K9880r326J2488K6278
8701B06724K374l8735j1973m5958J461K9092j1796K4864j4971m9499K54O9269
8689A61106L4009K6885K0737l7818k3869M4948K7997R531n8147M840L257l0043
8677A83433o6000K4216n1932j1598O3688K1103P2025J3028k7633o2233j5306N5009
8665A97800J13435j4152o9803r679l1020n9658K787J14639M297L777M2763J7967
8653C13153j317q341j3900o1086m0124P6154P7495m3015j1492J09357Q7079k1128
$$ plain form
8739 -19801 94437 177043 138056 53639 68029 74821 22539 -20695 35812 60323 49628 96607
8727 96607 157269 166950 152351 127993 109025 106208 137911 189727 165877 159833 166764 193716 220771
8714 220771 218078 204387 129055 121010 169651 168177 170072 146685 147404 177284 167958 180446 206724
8701 206724 209098 170363 158390 112432 113893 142985 131189 156053 141082 91583 91837 161106
8689 161106 195115 222000 242737 204919 181050 225998 253995 263526 205379 210219 213476 183433
8677 183433 117433 141649 89717 78119 141807 162910 234935 247963 220330 158097 142791 197800
8665 197800 311235 297083 227280 217601 186581 126923 129710 244349 248646 252423 295186 313153
8653 313153 311836 303495 289595 228509 188385 264539 342034 299019 287527 396884 483963 462835
$$ [...]
##END NTUPLES=NMR SPECTRUM
##END=
