##TITLE=Analysis number 327492
Compound Code spb 03150
Project Code adrs 
Chemist Name fudan
##JCAMPDX= 6.0         $$ Bruker NMR JCAMP-DX V2.0
##DATA TYPE= NMR SPECTRUM
##DATA CLASS= NTUPLES
##ORIGIN= Bruker BioSpin GmbH
##OWNER= nmr
$$ XWIN-NMR		Version 3.5
$$ Tue Mar 27 12:18:09 2007 GMT Daylight Time (UT+1h)  MAYBRIDGE\nmr@NMR_250MHZ
##.OBSERVE FREQUENCY= 250.131544655141
##.OBSERVE NUCLEUS= ^1H
##.ACQUISITION MODE= SIMULTANEOUS (DQD)
##.ACQUISITION SCHEME= undefined
##.AVERAGES= 16
##.DIGITISER RES= 18
##SPECTROMETER/DATA SYSTEM= dpx250
##.PULSE SEQUENCE= zg30
##.SOLVENT NAME= CDCl3
##.SHIFT REFERENCE= (INTERNAL, CDCl3, 0, 16.522)
##AUDIT TRAIL= $$ (NUMBER, WHEN, WHO, WHERE, WHAT)
$$ ##TITLE= Audit trail, XWIN-NMR		Version 3.5
$$ ##JCAMPDX= 5.01
$$ ##ORIGIN= Bruker BioSpin GmbH
$$ ##OWNER= nmr
$$ C:\u/data/dgb/nmr/ADRS/2220/pdata/1/auditp.txt
$$ ##AUDIT TRAIL=  $$ (NUMBER, WHEN, WHO, WHERE, WHAT)
(   1,<2007-03-27 12:17:45.10 +100>,<MAYBRIDGE\nmr>,<NMR_250MHZ>,
      <created by zg, POWCHK disabled, PULCHK disabled
       configuration hash MD5:
       49 4B E0 1D 92 C2 6B 37 9F E6 65 BC 52 41 86 1D
       data hash MD5: 64K
       3B 02 04 AC 3E 2D B9 5A B2 CB 9C 31 68 21 7E 94>)
(   2,<2007-03-27 12:17:59.14 +100>,<MAYBRIDGE\nmr>,<NMR_250MHZ>,
      <Start of raw data processing
       ef LB = 0.3 FT_mod = 6 PKNL = 1 SI = 32K 
       data hash MD5: 32K
       3B D6 2A E7 4C 8C CC A9 F9 9B E0 22 0B 37 ED 81>)
(   3,<2007-03-27 12:18:00.80 +100>,<MAYBRIDGE\nmr>,<NMR_250MHZ>,
      <apk 
       data hash MD5: 32K
       97 07 EE BC F2 EA 97 ED B4 D8 DF 66 1B 82 AC 57>)
(   4,<2007-03-27 12:18:01.49 +100>,<MAYBRIDGE\nmr>,<NMR_250MHZ>,
      <abs ABSG = 5 
       data hash MD5: 32K
       7D 81 06 EC 88 7A 45 BF A3 63 0E 53 04 6B 9F 1F>)
$$ ##END=
$$ 
$$ hash MD5
$$ 68 91 F2 44 41 EA 94 88 30 17 7D 2D 66 4E 35 25
##$RELAX= 
##$RELAX= 
##$RELAX= 
##$RELAX= 
##$RELAX= 
##$RELAX= 
##$RELAX= 
$$ Bruker specific parameters
$$ --------------------------
##$DU= <C:\u>
##$EXPNO= 2220
##$NAME= <ADRS>
##$PROCNO= 1
##$TYPE= <nmr>
##$USER= <dgb>
##$AMP= (0..31)
100 100 100 100 100 100 100 100 100 100 100 100 100 100 100 100 100 100 
100 100 100 100 100 100 100 100 100 100 100 100 100 100 
##$AQSEQ= 0
##$AQ_mod= 3
##$AUNM= <au_zg>
##$AUTOPOS= <25 >
##$BF1= 250.13
##$BF2= 250.13
##$BF3= 250.13
##$BF4= 250.13
##$BF5= 500.13
##$BF6= 500.13
##$BF7= 500.13
##$BF8= 500.13
##$BYTORDA= 1
##$CFDGTYP= 0
##$CFRGTYP= 5
##$CHEMSTR= <none>
##$CNST= (0..31)
1 1 145 1 1 1 1 1 1 1 1 1 1 1 1 1 1 1 1 1 1 1 1 1 1 1 1 1 1 1 1 1 
##$CPDPRG= <>
##$CPDPRG1= <>
##$CPDPRG2= <>
##$CPDPRG3= <>
##$CPDPRG4= <mlev>
##$CPDPRG5= <mlev>
##$CPDPRG6= <mlev>
##$CPDPRG7= <mlev>
##$CPDPRG8= <mlev>
##$CPDPRGB= <>
##$CPDPRGT= <>
##$D= (0..31)
0 1 0 0 0 0 0 0 0 0.06 0 0 0 0 0 0 0.0002 0 0 0 0 0 0 0 0 0 0 0 0 0 0 
0 
##$DATE= 1174994263
##$DBL= (0..7)
120 120 120 120 120 120 120 120 
##$DBP= (0..7)
150 150 150 150 150 150 150 150 
##$DBP07= 0
##$DBPNAM0= <>
##$DBPNAM1= <>
##$DBPNAM2= <>
$$ [...]
##$SUBNAM6= <"">
##$SUBNAM7= <"">
##$SUBNAM8= <"">
##$SUBNAM9= <"">
##$SW= 20.6930455092707
##$SWIBOX= (0..15)
0 0 3 0 0 0 0 0 0 0 0 0 0 0 0 0 
##$SW_h= 5175.983436853
##$TD= 65536
##$TD0= 1
##$TE= 683.16
##$TE2= 300
##$TE3= 300
##$TEG= 300
##$TL= (0..7)
0 120 120 120 120 120 120 120 
##$TP= (0..7)
150 150 150 150 150 150 150 150 
##$TP07= 0
##$TPNAME0= <>
##$TPNAME1= <>
##$TPNAME2= <>
##$TPNAME3= <>
##$TPNAME4= <>
##$TPNAME5= <>
##$TPNAME6= <>
##$TPNAME7= <>
##$TPOAL= (0..7)
0.5 0.5 0.5 0.5 0.5 0.5 0.5 0.5 
##$TPOFFS= (0..7)
0 0 0 0 0 0 0 0 
##$TUNHIN= 0
##$TUNHOUT= 0
##$TUNXOUT= 0
##$USERA1= <user>
##$USERA2= <user>
##$USERA3= <user>
##$USERA4= <user>
##$USERA5= <user>
##$V9= 5
##$VALIST= <valist>
##$VCLIST= <CCCCCCCCCCCCCCC>
##$VD= 0
##$VDLIST= <DDDDDDDDDDDDDDD>
##$VPLIST= <PPPPPPPPPPPPPPP>
##$VTLIST= <TTTTTTTTTTTTTTT>
##$WBST= 1024
##$WBSW= 4
##$XGAIN= (0..3)
0 0 0 0 
##$XL= 0
##$YL= 0
##$YMAX_a= 761328
##$YMIN_a= -714409
##$ZGOPTNS= <>
##$ZL1= 120
##$ZL2= 120
##$ZL3= 120
##$ZL4= 120
##$ABSF1= 16.522
##$ABSF2= -4.171173
##$ABSG= 5
##$ABSL= 3
##$ALPHA= 0
##$AQORDER= 0
##$ASSFAC= 0
##$ASSFACI= 0
##$ASSFACX= 0
##$ASSWID= 0
##$AUNMP= <proc_1d>
##$AZFE= 0.1
##$AZFW= 0.1
##$BCFW= 0
##$BC_mod= 0
##$BYTORDP= 0
##$COROFFS= 0
##$CY= 12.5
##$DATMOD= 1
##$DC= 0
##$DFILT= <>
##$DTYPP= 0
##$F1P= 14.0000005364418
##$F2P= -0.99999901652339
##$FCOR= 0.5
##$FTSIZE= 32768
##$FT_mod= 6
##$GAMMA= 0
##$GB= 0
##$INTBC= 1
##$INTSCL= 1
##$ISEN= 128
##$LB= 0.3
##$LEV0= 0
##$LPBIN= 0
##$MAXI= 10000
##$MC2= 0
##$MEAN= 0
##$ME_mod= 0
##$MI= 0
##$NCOEF= 0
##$NC_proc= -1
##$NLEV= 6
##$NOISF1= 0
##$NOISF2= 0
##$NSP= 0
##$NTH_PI= 0
##$NZP= 0
##$OFFSET= 16.522
##$PC= 1
##$PHC0= 231.756
##$PHC1= 4.077723
##$PH_mod= 1
##$PKNL= yes
##$PPARMOD= 0
##$PSCAL= 4
##$PSIGN= 0
##$REVERSE= no
##$SF= 250.13
##$SI= 32768
##$SIGF1= 0
##$SIGF2= 0
##$SINO= 400
##$SIOLD= 32768
##$SREGLST= <1H.CDCl3>
##$SSB= 0
##$STSI= 32768
##$STSR= 0
##$SW_p= 5175.98343685301
##$SYMM= 0
##$S_DEV= 0
##$TDeff= 65536
##$TDoff= 0
##$TI= <Analysis number 999999
Compound Code 99
Book Reference 9
Project Code 9>
##$TILT= no
##$TM1= 0
##$TM2= 0
##$TOPLEV= 0
##$USERP1= <user>
##$USERP2= <user>
##$USERP3= <user>
##$USERP4= <user>
##$USERP5= <user>
##$WDW= 1
##$XDIM= 32768
##$YMAX_p= 509129176
##$YMIN_p= -57261
$$ End of Bruker specific parameters
$$ ---------------------------------
##NTUPLES= NMR SPECTRUM
##VAR_NAME=  FREQUENCY,     SPECTRUM/REAL,   SPECTRUM/IMAG
##SYMBOL=    X,             R,               I
##VAR_TYPE=  INDEPENDENT,   DEPENDENT,       DEPENDENT
##VAR_FORM=  AFFN,          ASDF,            ASDF
##VAR_DIM=   32768,         32768,           32768
##UNITS=     HZ,            ARBITRARY UNITS, ARBITRARY UNITS
##FACTOR=    0.157963299565203, 1,           1
##FIRST=     4132.6476996994, 0,             0
##LAST=      -1043.33573715361, 0,           0
##MIN=       -1043.33573715361, -57261,      0
##MAX=       4132.6476996994, 509129176,     0
$$ Real data points
##PAGE= N=1
##DATA TABLE= (X++(R..R)), XYDATA
$$ [...]
15835e5K073J012k00j213j54J636j391p97J544j718m635K820R41j94J526j365
15819a70J563J214Q7k062l776J76L964q71n54p63o42L3j176M860j904j355k516
15802c892M7J455m81J537p51k697j6L632K245P03n55k344N041o64m225K08J142
15785C85k1j125k959M52J358J410j533k275j660K332L65J31J983q37l61J62N61
15768a632j46J806J153r51J982K11j277j164k778o0l90j276k732J682L221R23
15752a428R07k180q13K365K919l31l35Q13K496q65n24M88Q67j420k581N63l182
15735b241o20J790L753k33k265l259k528J063K944J521m57l48j445J407J240K936
15719C258K69N9P52k874o47k089j633j224J861k98J085O73K087j444k272j173
$$ y = [-55, 2018, 3030, 2830, 1617, 1463, 3099, 1708, 911, 2455, 737, -3898, -1078, -137, -331, 1195, -170, 1393, 2607, 2694, 632, -3144, -2968, 996, 125, -429, -1192, -1834, -1801, -2977, 1883, -21, -1376, -3892, -3845, -2390, -2871, -1334, -2085, -4782, -4798, -1166, 1079, 1782, 1227, -1117, 3924, 3260, -965, -757, 385, 364, -761, -3720, -3268, -1910, -500, -2033, -4308, -5968, -3636, -3271, -3140, -1157, -1994, -2355, -2193, -1632, -1778, 28, 1181, 230, 2212, 2423, 1146, -18, -2796, -2856, -3246, -4522, -7254, -5572, -2351, -1428, -521, -2701, -3514, -1149, 1770, 1439, 1104, 1917, 4413, 3548, 3024, 3512, 4379, 2959, 378, 941, -2241, -2861, -1071, 2682, 2449, 184, -3075, -5603, -4540, -1596, -75, -532, -880, -2325, -918, 322, 3258, 3527, 3586, 4338, 1464, 817, -1272, -2905, -4129, -2268, -2566, -1481, -808, 1279, -165, -2437, -3610]
15703c610N35L339M455K0p81j015l549j671m22j996K37K790k380m374L907J975
15687b540J229K926L883N51N01J530m74j761k063M7l835l697r12J901q49k503
15671f066J983J649M36N84O87j576j457L406J968J917o11j521n34p53J373M11
15655A896j869K84L491P61q97K42l281q63L193J42p651j366M648M750j25k751
15639F04k518l618N56K322K506p26N451j037l360j618p09R51m82M97K394m44j949
15622a180L24j81k189n12Q21J232j136k760K094J904J890j525j68K43o20j663
15606c426J490j240J32J189K49J689k815J88L88p15J114K44M186P74m068L32J363
15589A074K302m07j462L83l244j449K32m53K854L357J29j032j75l486j108J546
$$ y = [-3610, -3075, 264, 4719, 4739, 3958, 2943, -606, -2277, -2699, -4695, -4458, -1668, -4048, -8422, -4515, -2540, -1311, 1615, 5498, 6049, 6550, 8080, 7606, 5845, 3782, 3829, -6, -3703, -4615, -2714, -3563, -6066, -4083, -2434, -1998, -1414, -727, -2303, -3760, -354, 1614, 3531, 2920, 1399, 865, 112, 1485, 1896, 27, 311, 3802, 4563, 3666, 3908, 627, -236, 2957, 3099, -4552, -5918, -1270, 3480, 3355, 604, -1914, -5532, -4976, -2654, -148, -874, 4577, 3540, 180, -1438, -2147, -1196, -1678, -1181, 1213, 769, -1180, -856, -1037, -3226, -3738, -2917, -1685, -2821, -5581, -3487, -1583, 307, -1218, -1386, -1143, -1763, -3426, -1936, -3176, -3044, -1855, -1606, 83, -2732, -2544, -2156, -2871, -1757, -1513, 2673, 3447, -621, -289, 1074, 3376, 2969, 1507, 1890, -1354, -2803, -2571, -3024, -170, 3187, 3316, 2284, 2109, -1377, -2485, -939]
15573i39J585j732k510Q16K025L148k216n24r26J278K664l412J032M911k985k880
15557f65j326P90J156k106K947R28K160l92l338L063j334l905m59L708r76r75
15541g24P68j993l463m635K230L590l5J548J991k314j091k156Q45l975K335K910
15525d169K453L002K379j664j210k889j062K880M930j741j403m06j698k598K304
15510h92j344q27J677k866J175J218O50Q87J896R96j807j519k260j386k293L658
15494c037M059P66L905N7j342k471k92J396J584j229k19j99k741m02J92k755o63
15477c391k072o52J576J519R72j007r68q7m851P54O613K568k951j83M68q40j216
15460c748K696l87K254j579k627k603j176R05K425K747J093j141o06k523K86J317
$$ y = [-939, 646, -1086, -3596, -2780, -755, 2393, 177, -347, -1273, 5, 2669, -743, 289, 5200, 2215, -665, -1991, -1201, -45, -2151, 796, 1724, 3884, 3492, 154, 3217, 1883, -2022, -2481, 1227, 251, -724, 44, -1949, -5412, -10047, -7817, -4227, -4262, -2714, -723, -3037, -4128, -6284, -5439, -9414, -7079, -4169, -1716, 1286, 3665, 2001, 791, -2098, -3160, -280, 4650, 2909, 1506, 1100, -598, -3196, -892, -2236, -3063, -1386, -4252, -3077, -1859, -1209, -322, 1574, 2570, 763, -756, -3016, -4402, -6695, -3037, 1022, 1788, 5693, 5750, 4408, 1937, 1645, 3041, 4625, 3396, 3177, 2978, 237, -165, 27, -2728, -3391, -5463, -6115, -4539, -3020, -2048, -3055, -4023, -4110, -8961, -8207, -1594, 974, -1977, -2160, -1692, -2532, -3748, -1052, -1439, 815, -764, -3391, -5994, -7170, -6265, -3840, -1093, 0, -1141, -1747, -4270, -3984, -2667]
15444b667L55M47k70J73K827j11l382k985L916K151J404P48p57l646k867J620
15428c044L640J063k835l491j488k771m36L910J551M292K503J126j010k517j545
15413a052j550L935J520N98j153l69l672k924J874L760K256q72q0K90q14L22k791
15396g22j02J64P39k913l939k378K232L423K341J202j367J152J820j041k103l789
15380e281k728M628K768k26N44l827k114k490J141L341K954P55m455r12L682j30
15364b350m63K220j45k299L50J703N523j91j890l996J418p34j504p5Q99j192P27
15347a999L137J100k791k101j977N58L019N012J339J85k28l066j511N39j958j15
15331h57J561J093j555j564j968m048M51L281J794R16J485o34j490K007j340j055
$$ y = [-2667, -2312, -1865, -2135, -1962, 865, 754, -2628, -5613, -1697, 454, 1858, 2606, 1849, -1797, -4664, -3044, 596, 1659, -1176, -4667, -6155, -8926, -9362, -5452, -3901, 391, 2894, 4020, 3010, 493, -1052, -2602, 1333, 2853, 3451, 2298, 1929, -1743, -4667, -2793, 967, 3223, 2351, 2271, 2561, 1747, 2069, -722, -824, -660, 79, -2834, -6773, -9151, -6919, -3496, -1155, 47, -1320, -168, 1652, 611, -1492, -5281, -8009, -3381, -613, -839, -295, -4122, -6236, -8726, -7585, -4244, -1290, -535, -4990, -5902, -2220, -2350, -2813, -593, -738, -3037, -2687, -984, 4539, 4348, 2458, -1538, -120, -854, -2358, -2433, -1534, -2726, -1999, 1138, 2238, -553, -2654, -4631, -4073, -1054, 3958, 5297, 5482, 5254, 2188, 677, 1216, -742, -857, 704, 1797, 242, -1322, -3290, -7338, -6887, -3606, -1812, -896, 589, -45, -1535, 472, -868, -1923]
15315a923J59K00J897j992m982R68J941J633j552L53k53L21J155l593q05O812
15299C39K945j362j087k533k839N04N502N19j113Q63K550k391p02J253L95R34
15283C777l548k443n96L56l049n73L407L158k165k648K773K156J486J124J868
15268E083O4k710J40j464k540j840p72j755J478K821J412K607J133k69p44j970
15252F74r36k24j464J047J772Q03k402r72j371k95K103K048P70j812R26o59J856
15235A864k518p84m253J051R94j510j417j842K485K963M523N350r64l622n448
15220c128l242L644M819Q65P89k500l132l45J679j817q26M846J203j346j685j040
15204a216k009M51J097J950J646j560l69K812j675l059l68j586J709J36j831P04
$$ y = [-1923, -1764, -1564, 333, -1659, -6641, -5673, -3732, -2099, -3651, -3298, -3551, -3230, -2075, -5668, -6473, 339, 3284, 1922, 835, -1698, -4537, -4033, 1469, 1988, 875, 1738, 4288, 1897, 1195, 2448, 2843, 3777, 229, -2214, -2810, -2454, -5503, -6076, -2669, 489, -1676, -4324, -1551, 605, 2091, 3215, 5083, 5147, 2437, 2577, 1113, -1427, -3267, -4039, -5794, -4316, -1495, -83, 2524, 3657, 3388, 2644, 674, -262, -486, -1950, -903, 869, 1672, -730, -1702, -3073, -3368, -1265, 783, 1553, -259, 667, 8, 1864, -654, -1438, -5691, -4640, -3646, -5156, -6573, -8415, -5930, -2967, 1556, 6906, 5942, 2320, -3128, -6370, -2726, 2093, 2958, 3747, 1247, -1885, -2230, -551, -2368, -3194, 1652, 2855, 1509, -176, -1216, -3225, -2774, -1677, 273, 1919, 359, -10, 2802, 1127, -1932, -2300, -3886, -2177, -2041, -3872, -3168]
15188c168L506L949l3j850K499K526k082j828m019J343j40j758k034J227N186
15173C324k66l312l411j869j292j327L045L955J336j912O83j921J071k96l02l907
15157f401j784J519j177O72M149L110L151M07j948j33k731j463J690L131n832
15142c640k875P64J524L452N52J440M98k356l629j823K940N301J117K775o13l463
15126A964k593n12O15M44l72k952k507Q40l59R77J609J62J146j835O57j293J394
15109b615N51L625K402j890j81J323j809J929M954P96l707Q77n78m056j226m51
15093e6J954R10N03j185R62l559k126L87K209J008Q28l17L122j302J50k89j788
15076A411k278k824K128M766J24j856j045m429k947J598j230K782P35m091R15
$$ y = [-3168, 338, 4287, 4254, 2404, 4903, 7429, 5347, 3519, -500, 843, 703, -1055, -3089, -1862, 3324, 3058, -254, -3665, -5534, -6826, -8153, -5108, -1153, 183, -1729, -1046, -2967, -1896, -2192, -2494, -6401, -8185, -6666, -7843, -7171, -3022, 88, 3239, 3646, 1698, 1565, -1166, -2629, -939, 2192, -3640, -6515, -5751, -4227, -775, -223, 1217, 1715, -641, -4270, -6093, -3153, 2148, 3265, 6040, 5427, 1964, -629, -1141, -526, -82, -454, -3406, -5913, -5073, -5432, -4455, -2846, -2684, -1538, -3373, -2716, -4009, -2615, -2064, 1561, 3963, 2073, 1892, 3215, 1406, 3335, 8289, 9085, 5378, 6255, 5677, 1621, 395, -56, 1898, 2808, 3311, 2126, 3088, -471, -2597, -2210, -1, 1007, 1835, 1518, 4640, 3338, 3488, 3199, 1411, -867, -3691, -1563, 3203, 3327, 1471, 426, -4003, -6950, -5352, -6582, -3800, -3065, -7156, -6241]
15061f241N098L383j888l91J257J410l117p42p11L71K674O88K228J254N3k131
15045C195Q00j787K98j040j265M55j081j33L7M30K426J349k67N88l388n039k74
15028d696J226K131R56k13l374j996J88R15L40J361j165k271L113J906J34P69
15012f76K184N64r58J626j253L27K356K69l601j226j031m60K065K024k15L239
14996E234k331n387j964L441K338j325k82J153k21j457J832O96m6k78l711P96
14980a512J025R45J662j058J47J274m490K608k596k361L146P35j082K752j33k858
14964a796Q45O17j913K148j266K26j512k566j961K999M121O59k426k914k667q51
14948h257p34M127M364J686J452r98j755J864o08M04j370q19j311J603o89o82
$$ y = [-6241, -1143, 2240, 352, -39, 1218, 2628, -489, -1231, -1942, -1571, 1103, 1791, 4019, 5273, 5326, 3195, 3995, 2208, 2506, 1466, 201, 656, -425, -558, -521, -91, 2335, 3684, 3417, 4005, 617, -4422, -4696, -3470, -1339, -383, -596, -3970, -5966, -5778, -4863, -4523, -3162, -4327, -6598, -3485, -1579, -1445, -676, 1508, 2072, 1114, 2740, 1487, 1814, 4170, 4439, 838, -388, -1419, -1879, 186, 2210, 1995, 5234, 2903, -2484, -4448, -1007, 1331, 6, -276, 877, 656, -801, 1031, 1727, 1681, 1403, -2308, -1512, -487, 458, 2120, 1062, 1209, 2483, -2007, 601, -1995, -4356, -1210, -475, -1557, 1195, 1062, -1796, -951, -334, -2247, -99, -1365, -1139, -2651, -5217, -7178, -4179, -58, 601, -1825, -4739, -7406, -8257, -8991, -4864, -500, 1186, 2638, 1640, -115, 1749, 1141, 1545, 175, -644, -1955, -352, -1041, -1723]
14932a723L17L65j865M31K453J116Q74R17n56q64j668k04K320J601j587K064J508
14915E499O34L28m189k325j233J301j93k560l742k255m89K682L495M244l73n15
14899C09k39j412p93j934j040J207o54J081j62J677L140j22o11j09o67O71J444
14882A786q24p3J506m45K227J134L83Q65j84k032j465p43J157J566l057n139j21
14865c459j348j553K932N188n92L70L20J439K204q3k736k17j361j927L748J009
14849C934j503J570J57j596j172l435k269M25J89L867j886k767K142L671K772
14834D099k526k157P91K245j404l468k4J806j68k21k02O74J616L931J463k753
14818C702M71O30k164L87k081j204o69j961O57k13L106J856k967l202K389K571
$$ y = [-1723, -1406, -1041, -2906, -2475, -22, 1094, 1968, 2885, 2329, 1465, -203, -407, 1913, 3514, 1927, 3991, 5499, 6133, 6461, 2272, -53, -1286, 15, -178, -2738, -6480, -8735, -9224, -6542, -3047, 1197, 824, 309, 70, -1342, -2135, -4069, -5109, -3902, -4556, -3475, -3637, -1960, 1180, 1058, 447, 338, -329, 342, 1786, 962, 889, 2395, 1950, 4177, 5311, 5694, 6559, 6375, 4343, 2878, 2135, 3292, 4858, 1801, -3338, -3459, -4807, -6360, -3428, 1760, 1168, 1538, 1858, 3297, 5501, 5418, 2682, 2465, 1104, -823, 2925, 3934, 2431, 4001, 4158, 2562, 1390, -2045, -4314, -3889, -3700, 167, -1719, -4486, -2344, 1327, 4099, 1573, -584, 207, 2452, 1048, -2420, -2444, -638, -806, -1027, -1229, -555, 1061, 4992, 6455, 3702, 4173, 4803, 2639, 3026, 945, -259, -928, -2889, -2232, -2445, 661, 2517, -450, -3652, -1263, 1308]
14802A308m207M286L159k125l719l122O84L142L074N37R76k168l561o10l53N30
14786b169j070O50K246l68q98J120M943j527l967K904J338j586j780l238m46J747
14770b101M076K57m580j342j440J38L69K449J041j241o20J61L65J401k521k219
14754e807k97K076J487o5j342r25l03l67M67Q33N141l96j792M39m776k417J90
14737g854l94r88O497J009J370J393q22p36l351k911L514L69K011o55p10J628
14721f30n64p14M23j177K140n54O25l548P28K435J794k246k526j039k55J830K208
14704a070K090j255k83J791N42Q89J29m01k47l362N33K227j548o165l316N048
14688d398K483m017j259r92J81K268J046K371Q28M68j193q31O84o6l601J624K789
$$ y = [1308, -2899, 1387, 4546, 2421, -1298, -4420, -3736, -594, 2480, 3017, 3993, 1825, -1736, -2346, -2699, -2169, -3239, -2589, -343, -711, -1609, -489, 4454, 2927, -1040, 1864, 3202, 1616, -164, -3402, -3848, -2101, 1975, 2232, -2348, -3690, -5130, -4992, -4623, -2174, -1133, -2374, -2994, -2833, -2468, -1067, -3588, -5807, -6104, -4028, -2541, -2606, -3948, -4873, -5176, -5543, -5076, -4243, 898, 502, -1290, -851, -5627, -8044, -7854, -8248, -9236, -2739, -1730, -360, 1033, 211, -525, -3876, -6787, -3273, -2904, -893, -1548, -2258, -630, -1194, -1908, -1485, -2662, -522, -1076, -451, -3999, -3271, -836, 958, -1288, -3814, -4853, -5108, -3278, -1070, 1020, -235, -518, 1273, 1815, 2704, 2833, 2432, 2185, -1177, -644, 1583, 35, -6130, -9446, -4398, -1915, -5932, -7191, -8183, -8002, -5734, -4688, -2317, -1489, -1021, -2214, -3045, -2361, -2427, -6028, -4404, -1615]
14671a615K350M53j997J07K415M13k219Q9n27l75k240j744k054J954M272O78o03
14654f43J14J993k300k33L10j875K49n18N44L18K431n18j22n14k978k916j496
14637h154Q16M41J27J090r84k83Q79J087L877J518j938K768L951Q66k780o112
14621b831n78K871J460R27J605k53q00l403j271k13L249P44j698j272l774K561
14605b676J569j078J476J839j039Q09m06l396j001k712j91J861j00J653L466l20
14589b46m10J621l913r34J128O31K400j953j152m15J572j950j407M74j953R04
14573e603J770J418j016j110j96j337k137K393L051o45J007O14k197J099L75k897
14557e411N27J292J41J575j832j640J613J092L480k953J389K073m343O92J211
$$ y = [-1615, 735, 1188, -809, -702, 1713, 2126, -93, -4, -531, -906, -3146, -4890, -6944, -4990, -718, -40, -643, -529, 1464, -836, -1069, -759, -2634, -2385, -2903, -2359, -2041, 390, -128, -250, -764, -3742, -6658, -8154, -7338, -6897, -6770, -5680, -6664, -6947, -6068, -4981, -1104, 414, -1524, 1244, 5195, 6061, 3281, -2831, -3409, -538, 922, 1849, 3454, 3201, 2401, -1002, -2273, -2486, 763, 1507, -191, -1463, -5237, -2676, -1107, -2185, -709, 1130, 91, 900, 494, -2902, -3903, -6615, -6806, -4945, -5045, -3392, 74, -246, -656, 965, -2948, -3882, -2754, -2123, 277, -1676, -2828, -3243, -1671, -3621, -5028, -4554, -6507, -5603, -3833, -2415, -3431, -4541, -4737, -6074, -8211, -5818, -2767, -3412, -2405, -1791, -3988, -2889, -2514, -5411, -4884, -3592, -3451, -1876, -3708, -5348, -3735, -2643, 837, -2116, -727, 1346, -2997, -2305, -1094]
14542a094j166l020q02J142K615R23K051J023k889O95K459J103L93j36R30q50
14526C377k423j603r9j126J955J016l298j663l837j361K698K453K948l69m783
14511f115n690l585L523K899K086j109J904J901j106K485L075q0l234p55P79J506
14495a516J846k911p93J203Q09J667J870N2n65o20O44P87j444m481l047J356M187
14478i56L081l232k756p22J078R24J098j369l237k81q39J805J898m046q20K911
14462e463L978l043k570K685%J569K807Q40l070q90J759J465J853j175k759N69
14446a445j850k15J524J56K408J263j843J092K191k223j067j122j136j411k142
14431e820M9K281K099K62K108l452j744p88L041L166p96k709J150J601m15k934
$$ y = [-1094, -2260, -5280, -6082, -4940, -2325, -1402, 649, 1672, -1217, -522, 1937, 3040, 3433, 3297, 4227, 3377, 954, -649, -748, -1874, 81, 1097, -2201, -3864, -7701, -9062, -6364, -3911, -963, -1332, -6115, -11805, -15390, -11867, -8968, -6882, -7991, -6087, -4186, -5292, -2807, 268, 188, -3046, -3801, -3022, -1516, 330, -2581, -3374, -2171, -1362, 305, 2175, 2227, 1662, 1042, 1686, 2473, 1029, -3452, -6499, -5143, -956, 2125, -1107, -3863, -4585, -3507, -2583, -1485, -2854, -6091, -6372, -7211, -5406, -3508, -7554, -8374, -5463, -1485, -4528, -7098, -4413, -4413, -2844, -37, 803, -2267, -3157, -1398, 67, 1920, 745, -2014, -1445, -3295, -3510, -1986, -1830, 578, 1841, -2, 1090, 3281, 1058, -9, -1131, -2267, -3678, -5820, -5771, -3490, -1391, -1129, 979, -2473, -4217, -5005, -1964, 1202, 406, -2303, -1153, 448, 33, -2901]
14415b901k847j461k483Q24M938J147R65j386n17L590K187l237j231L422k762
14400a752k117k440Q63Q1k37L859M743j721m628k774p85J935N93J652L800j255
14384a83k021N69N88o21K276J838j712j809p83J532J688K114k993l069P91Q61
14368i34L739N01j597j742k536l429J631M365K015j179l235J152J600K767M15
14353C533L36r45j109j745J01J796l985J219j070n78j702j046K396P43J346Jl35
14336a044k25M94n28j597J968j145r67j560N666J345n75k674k920l577J026J37
14320f176k355J693J487k2k020J30R62J286O2J547M305j470j467j999N39J03M711
14303A316O29j270j956j595P72j747p56m80P08R89j781K973J145o65J502l180
$$ y = [-2901, -5748, -7209, -9692, -8868, -3930, -2783, -1818, -3204, -3721, -131, 2056, -1181, -2412, 1010, -1752, -3869, -6309, -5446, -5365, -5602, -1743, 3000, 1279, -3349, -6123, -6908, -4973, -4380, -2728, 1072, -183, -2204, -1635, -1047, -1668, 608, 2446, 734, -1075, -1858, -326, 1362, 3476, 483, -2586, -1795, -934, 2805, 3306, 1709, -33, -2569, -5998, -4367, -2, 2013, 834, -2401, -1249, 351, 3118, 3533, 3869, 2924, 1815, 70, 171, 1967, -2018, -799, -1869, -2447, -4149, -5195, -2799, -2056, -710, -709, -1044, -1269, -775, -1303, -2900, -932, -2077, -3044, -4604, 1062, 2407, 1832, -842, -3762, -7339, -6313, -6176, -8531, -6838, -5351, -5373, -7393, -7263, -6301, -5015, -4953, -3406, 899, -571, -2038, -4037, -3498, -3395, 1316, 1945, 675, -1281, -2876, -2104, -3851, -4607, -5087, -4379, -3390, -5171, -2198, -1053, -1718, -216, -3396]
14287c396j373L61K715L103J571J189k601k857n69j548K908L014K399k95o84m67
14271C470P4j106m924q8k473k325k085R4M400M539j728k447J796L352K580n01
14255B628k444K12j788J775M060m684l436O27K285J567m40k538P69K424K666J56
14239C839m011M34J500l73J480K72l919L69J888m600j870O97J61M09O83R17L344
14222A220R7k847Q7K685L121k73j497j241k107N99l628j870R79K647J690k853
14206c191j067J044K966j432P04J455m94j412k616j898J987k28M30K15l869j632
14190i038K050L680J23j70P30j067N19L633M152m01m260m40J065p06j984j17K214
14173a7k77l82j590n99o31K45K660K102J319R14L3l77P42n55n340j414K007J975
$$ y = [-3396, -4769, -4408, -1693, 1410, 2981, 4170, 1569, -1288, -1857, -3405, -497, 2517, 4916, 4621, 3937, 3470, 3544, 2438, -2486, -2574, -5047, -7372, -9457, -9363, -4963, -424, -2152, -4599, -2803, 549, 3129, 2628, 184, 396, -1392, 383, 4443, -241, -3677, -3050, -765, 802, 362, -2176, -1407, 1017, 3683, 3839, -172, 262, 1762, 1389, 2869, 3141, -778, -409, 1479, -3121, -4991, -4294, -4133, -3724, -3041, -2124, 1220, 1317, -1530, -1443, 1242, 4363, 4090, 2593, 1352, -755, -156, -3784, -5654, -4675, -2028, -338, -3191, -4258, -3214, -248, -1680, -976, 479, -15, -1427, -4043, -5941, -3954, -4182, -3752, -3537, -7406, -9038, -6988, -3308, -3185, -3355, -2625, -3692, -3173, 460, 4612, 4211, -49, -489, 576, -130, -2114, -2231, -17, -294, -676, -2266, -2865, -3496, -3251, -591, 1511, 2830, 3744, 3777, 3400, 4142, 3587, -1753, -3167, -1160, 815]
14155H15k18p89J242m49r87K623l22o59j809k048n75m44J768J920P72j098j372
14138a630q46K150K116r64k736O09O73o41j788j460j65j22k725J39K067K386L295
14121C58P02j594l03J846L314Q23m026j957o9r39N12j957J97P1L183N18k06N43
14103A016L64k883N48K78o4K31j170N49J272J220j522k077l205r40L881K94j077
14086c285L013l75j263l24L130m8j638O15J387L637j432k928k071l19j515Q94
14070b522N50J71k99k475j647Q42R1M35J544L365J434k231J403j122j712L136
14054I63K658j179k115l658m116J798K212J124j24J47K323J794j281J891j031
14039A406k10J514k240R96j86l598k096j010K881J880M2M34j813m26j711K963
$$ y = [815, 597, -192, 1050, 601, -386, 2237, 1915, 1256, -553, -2601, -3176, -3620, -1852, 68, 840, -258, -1630, -2476, -326, 1790, 826, -1910, -1301, -628, -1269, -3057, -4517, -4682, -4804, -7529, -7390, -5323, -2937, 358, 1060, -534, -837, 1009, 4323, 5146, 1120, -837, -906, -1845, -1333, -3290, -3093, -3022, 161, 679, 473, 1016, 1380, -1503, -955, -677, -741, -510, -1680, -1131, 141, 1361, -161, -2238, -5443, -6383, -2502, -2208, -3285, -272, -647, -1910, -2234, 896, 848, -790, -175, 1212, 4849, 3417, 489, -1582, -1901, -3416, -2522, -1972, -1801, -2100, -4575, -6222, -5380, -5289, -4854, -3310, 55, 1489, -742, 661, -461, -2173, 963, 3621, 2442, 327, -3331, -7447, -5649, -3437, -2313, -2437, -2290, 33, 1827, 546, 2437, 1406, 1196, 2710, 470, 1466, 1280, -2318, -4414, -5424, -2543, -663, -621, -187, -2000, -2426, -4137, -1174]
14023a174J333j621o57K379N97P79J135k287k507j290o21p56M508M8p02j785j27
14006b748j866J018J364J948q45k749m89l028k71M682J272J975k223j694O07k573
13990e620j252r1j668J954j236K438J087N36l58J61j243j275J704O253J006p90
13974A606n5q76R66m31l9L52k900m441J305L98j131J406J476Q58K735R08k365
13957b28N78j322j088k539L239j436k905r50j295P54L697o0K802J030m307j339
13941e369Q38K707j06K640O12J264r64j39Q3P84K81j339r37j626n22j505l317
13924f615K458K385J35k227n57K089Q61l064l031J44Q94K156l20k980J366M317
13908a989O73p97m45Q20j04l25j856K295L928j951j768j736j498l47J281P30n91
$$ y = [-1174, 159, -1462, -2119, 260, 857, 1636, 2771, 484, -2023, -3313, -3934, -4690, -182, -134, -836, -2621, -2748, -4614, -3596, -2232, -284, -1129, -3878, -4367, -7395, -7666, -2984, -1712, 263, -1960, -3654, -3047, -5620, -6872, -6963, -8631, -6677, -7913, -5475, -4388, -3852, -4210, -4049, -5292, -6567, -4863, 1390, 2396, 1606, 1551, 675, 1641, 1210, 1171, 1523, -1377, -5818, -4513, -4115, -5246, -3840, -2364, -1506, 1229, 2137, -228, 350, -972, -2060, -4599, -1360, -2796, -5701, -6651, -7946, -7192, -3495, -3555, -753, 277, -4030, -5369, -4531, -1824, -1930, 710, 1322, 2586, 1622, 1483, 1566, 2350, 2631, 1292, 355, -1271, -1793, -3298, -6615, -4157, -1772, -1637, -3864, -4421, -2332, -1471, -4535, -7566, -7422, -6528, -4372, -4692, -7672, -6306, -1989, -1316, -2113, -2558, -1738, -1842, -2167, -4023, -1728, 2200, 249, -1519, -3255, -4753, -5100, -3819, -3089, -3680]
13891c680j66K334k64r93k326n40j245J845K422l559l24M553L72j645l74J682
13875a908J002r73j392j628P34L654L503l165j104L434q69j014O96q04k138r38
13859b910J286R40K923J24o74j253k581J448k264m289k386K091M412J876j363
13844b620l137M860O021k251j090j668j877P59Q89j810M844J040O15J523m347
13829A751l396J253O77p32r91m287j916p26L503N350K206J553J574j700O6m947
13813g62k249R03J949K122k798J44M778M14l862L12k86j146q70k550j433K839
13797b495J288J264K386r0j067j326k634n54P27r98N15J393Q43m604k258J679
13781e931n45q36L776j679L354K091l56j448J434O01L96K774m50l323l038j190
$$ y = [-3680, -3846, -1512, -1776, -2769, -5095, -5635, -6880, -5035, -2613, -6172, -6496, -1943, -1571, -3216, -3590, -1908, -906, -1879, -3271, -4899, -4165, -511, 2992, -173, -1277, 2157, 1288, 274, 970, 166, -1972, -2910, -1624, -684, 2239, 2363, 1689, 436, -2145, -697, -2961, -7250, -9636, -7545, -3133, -1257, -2620, -5757, -897, 5124, 2873, 1783, 115, -1762, -1003, -114, -1924, 2920, 3960, 4575, 6098, 1751, -1645, -392, 285, -447, -1438, -5725, -7641, -8367, -4864, 486, 2692, 4245, 5819, 4119, 4185, -762, -3011, -2108, -159, 1963, -835, -691, 4087, 4501, 639, 951, 665, -481, -1351, -3901, -5334, -2495, -1207, 57, 2443, 2353, 1286, -40, -2674, -3228, -2501, -3499, -2984, -1591, -748, -5352, -7610, -5931, -6476, -7312, -3536, -5215, -1861, 230, -126, -1574, -140, 461, 857, 3631, 3181, -142, -3180, -4370]
13765d370L45j099L517J136Q1K579J203k029j23k266n068L68J125j135K606K543
13749e87L591K06J074j750K4q81n557n673J898K952L138J218k131J282K590m61
13733I33m008J941R70Q21k293J224j180J54k024j285r62j163O18K307L134Q07
13717fJ695R41J94j365k598q92J514rl503k377L434L488L6N14M24j293O45r68
13699a26J66j825K75J177J236K167m24k0J247J481J378m416n325K688o81K47K614
13682A859J445J973K77k314j481j130m16j700k136j049J509K080p56k489J674
13667b654P78J980P59p3J647L549N67L131P163O441q31n089l630n633m024m029
13651E2l00j377j073J555J238j409j593J047K614J395k24j019j573K08J860j59
$$ y = [-4370, -4025, -5124, -1607, -471, -390, 2189, 3392, 1363, 1240, -1026, -6094, -5726, -4601, -5736, -3130, -587, 3004, 3210, 4284, 2534, 2558, 1677, -3880, -9553, -7655, -4703, -1565, -347, -2478, -1196, 1394, 933, -3075, -1134, -164, 657, -1636, -412, -1592, -1438, -3462, -4747, -5709, -6872, -6254, -3947, -813, -6, 1689, 2630, 2824, 1459, -1139, -2031, -517, -526, -4029, -6406, -2972, 516, 552, 1066, 1490, 197, 842, -126, 40, -1785, -1510, -333, 903, 3070, 2646, 2626, 3873, 5354, 6732, 2316, -3009, -321, -1002, -755, 1859, 3304, 5277, 5554, 3240, 1759, 629, 213, -1487, -3623, -4672, -3163, -1083, -1839, -4328, -2654, -1876, 104, 863, 790, 2437, 5986, 6553, 9684, 16847, 23288, 22457, 17368, 13738, 8105, 4081, 52, -248, -1625, -2698, -1143, 95, -1314, -2907, -1860, 754, 2149, 1925, 906, -667, -459, 1401, 1242]
13635A242j013k837m110R66J530K150k162k372K311K094K360L272N884j499m845
13620B971k089J8j377R38L036M309K504M034K932R47k472k441j218o025n361m34
13604B72K376K763l098k700l34j073R6K777k33J195k889P70k13k592j999L783
13588a099j061M36J289l027j23O141O076J179k122l459m584K921K592k957k771
13573e69M79K076K590O41r1k336J242K290k245J310j143n675k915J179L625o50
13557a92j810j538r60q03J45k0l969J019J514L497K531N20J024M541L249m368
13541D380P59J208m186j603R14j267O37J742J464R83j456j716j453k706j768J116
13525b952o92N49M95m37K355M257J615J448r97M679M86k400k750j447R48P67J582
$$ y = [1242, 229, -2608, -6718, -5752, -4222, -2072, -4234, -6606, -4295, -2201, 159, 3431, 9315, 7816, 2971, 882, 900, -477, 461, 3497, 7806, 10310, 14344, 17276, 18223, 15751, 13310, 12092, 6067, 706, 272, 2648, 5411, 2313, -387, -721, -1794, -1698, 1079, 846, 2041, -848, -78, -291, -2883, -4882, -1099, -2160, -1724, -435, -3462, -3585, 2556, 8632, 9811, 7689, 4230, -354, 2567, 5159, 2202, -569, -90, 1986, 4576, 5217, 5126, 2790, 4032, 6322, 4077, 5387, 4244, -1431, -4346, -3167, 458, -192, -2002, -3540, -4500, -5303, -5158, -5178, -9147, -8128, -6614, -3117, -586, -66, 958, 5499, 8748, 4380, 5139, 6347, 2161, 558, 1472, 205, 842, 2584, 4048, 5031, 3575, 1859, 406, -2300, -4068, -2952, -3644, -3095, -2600, -3037, -682, 3575, 5190, 6638, 5641, 10320, 10806, 8406, 5656, 4209, 5157, 5924, 7506]
13508G506p17l268P087R214Q300P737J2306J6969K0932K7198L9743O0211R9185
13495C12403J84087K81869K13477m8171k26754k38121j67902r4264n5750l7876
13485A22998k9363j9695j3335r091n173l109m377l047j281p481n601j784n085
13472A4576j274L68m26k489l193j790r26k723L682j135j841K802k281k884k047
13457a581K6J034k740j973J449K805p59j054j820k829K014L803J031j352M46L063
13441A563J538P85L184m67k002l507q68j186N631k13k990j653j793k161J903J92
13425b044o88K493N479J88j671k185L282jk543m902k026k524O76L835M153J69
13409A691m505k621j243j916J450J239K665J563m01k738J471m44j550K088R24
$$ y = [7506, 6789, 3521, 10608, 19822, 28122, 35859, 48165, 65134, 86066, 113264, 153007, 213218, 312403, 496490, 778359, 991836, 943665, 716911, 478790, 310888, 216624, 160874, 122998, 93635, 73940, 60605, 51514, 46341, 43232, 38855, 35808, 34527, 27046, 21445, 19661, 14576, 13302, 13670, 13244, 10755, 7562, 5772, 4846, 2123, 5805, 4670, 2829, 5631, 3350, 466, -1581, -1555, -521, -3261, -5234, -3785, -980, -1739, -2793, -4613, -7442, -5428, -1625, -594, -1946, -1500, 1563, 3101, 3886, 7070, 6603, 4601, 1094, 226, -960, 4671, 4458, 1468, -185, -1978, -4139, -2236, -2044, -2732, -239, 5240, 5428, 3757, 1572, 4854, 4853, 2310, -2592, -4618, -7142, -6466, -2631, 1522, 1691, -2814, -5435, -6678, -8594, -7144, -5905, -3240, -1677, -2078, -4816, -3345, -3789, -5339, -3251, -2327]
13394b327j282k871P38J048k54j089m8j370m50K722K79k1N2M1M00O36L435N205
13376D844j448n057j676K382l080n241J67L967k091o046m912J122M584L315n0
13361i220K076J40n126o373r74Q056J2095O238O502J1989J2029O347n035q668
13347C0076k38J872l668m714m729m701j602l635J132L79j269l97J165M962J646
13332A6279N96r03Q19q82J095j626k128J145O39l832j906R59J623n42j425j303
13316H608M341J0597R065P303J708K205K429k791m831q974l472N923J0019Q862
13302E0992M321o432j6359j0412o023L179J4946J3988M696q28n749q379j295l732
13288C2913j0516r462J075k398j905k655k410m088m074k024O53J453N17j174l429
$$ y = [-2327, -3609, -6480, -5742, -4694, -4948, -6037, -6085, -7455, -7905, -5183, -4904, -4925, -4873, -4832, -4432, -3796, -361, 4844, 3396, -1661, -3337, -955, -4035, -9276, -9109, -5142, -7233, -13279, -18191, -17069, -12485, -9170, -9220, -7144, -7004, -12130, -18503, -19477, -11421, 674, 6912, 13414, 25403, 37432, 43779, 38744, 30076, 29838, 31710, 28042, 23328, 18599, 13898, 12296, 8661, 9793, 10172, 8903, 8506, 9671, 14633, 16279, 16875, 15972, 16791, 15909, 17004, 15378, 13250, 14395, 15034, 11202, 9296, 10255, 11878, 11336, 9911, 8608, 12949, 23546, 32611, 39914, 41622, 43827, 46256, 43465, 38634, 29660, 26188, 32111, 42130, 50992, 55313, 48881, 32522, 22110, 16087, 19266, 34212, 48200, 52896, 52068, 46319, 37940, 36645, 32913, 22397, 12935, 14010, 11612, 9707, 7052, 4642, 554, -3520, -5544, -4891, -3438, -2921, -4095, -7524]
13273g524l749k262K785K630K949j82k107K173j572j351n21N061J1171R704K619
13258A9824k583R6J908L616J497O759R018P165l905n482r187j4572j8241j3028
13244a7115o653r795m423O178R307J0876L889p328n610J993N301K974N485J630
13230c291J440N287M828m14L86O590j30J846l549m744l523o610l875J828J201
13215b730M085P651J497j04l649p258n61j486o978r005j880L199P897J8062K1585
13200C0325J9722J2151P469j538k825m604j591n16J417j279J029N087P432N020
13186G7299j107J603J0206J1135K885j3070l118K570p733k505L620J1115J3000
13173A05900J2906K365j2816k1806j8831j0775p633n14j364j429Q59K862L492
$$ y = [-7524, -11273, -13535, -10750, -8120, -5171, -5353, -7460, -5287, -6859, -8210, -8731, -3670, 7501, 17205, 19824, 17241, 17337, 19245, 22861, 24358, 31117, 40135, 47300, 43395, 37913, 28726, 14154, -4087, -17115, -23768, -33563, -37986, -31808, -22501, -11625, -7736, -15064, -20674, -18681, -13380, -10406, -4921, -3291, -1851, 3436, 8264, 7850, 8236, 14826, 14696, 16542, 12993, 8249, 4726, -1884, -5759, -3931, -2730, 1355, 9006, 10503, 10399, 6750, -508, -1069, -2555, -9533, -18538, -20418, -17219, -9322, 8740, 30325, 50047, 62198, 69667, 68129, 65304, 60700, 59109, 58593, 60010, 58731, 59760, 64847, 72279, 77299, 76192, 77795, 88001, 99136, 102021, 88951, 85833, 88403, 80670, 78165, 81785, 92900, 105900, 118806, 121171, 108355, 86549, 67718, 56943, 49310, 48796, 47432, 46003, 46862, 49724, 53216]
13160E3216j505k39j403P9k036j911O58L943O702L603O920R259Q847M752o536
13145H4349j2406m965m196q097k597L164O778Q320Q742N031M385Q115J1804J5629
13131A24056P510k168k345o980p741r697j019N622L867O911J1854Q518K907q925
13117A32370j6615q450n207n018J318N053J0499R746P708R397J1612J9659K0485
13104A92557J1610L825L511M350M026O795Q691M216P628J6073K1584K4746K3460
13091C33072K9298M6401P6273O0313N689k6152j8264n244R025K5317L6580M8860
13079F21168O1676O3693N2067O0067R7806J10901R6949Q5995P9363Q4177J21959
13068A535821J73365K14873K28941K25480K55641L41286M58553O06158P40440
$$ y = [53216, 51711, 51472, 50069, 50148, 48112, 46201, 46859, 50802, 57504, 61107, 68027, 77286, 86133, 90885, 84349, 71943, 66978, 62782, 54685, 52088, 55252, 62030, 70350, 79092, 84123, 88508, 96623, 108427, 124056, 131566, 129398, 127053, 120073, 112332, 102635, 101616, 107238, 111105, 118016, 129870, 138388, 141295, 132370, 115755, 107305, 102098, 97080, 98398, 103451, 113950, 123696, 131404, 140801, 152413, 172072, 192557, 204167, 207992, 211503, 215853, 219879, 226674, 235365, 239581, 247209, 263282, 284866, 309612, 333072, 362370, 408771, 485044, 545357, 551046, 524894, 506630, 501386, 510411, 535728, 572308, 621168, 682844, 746537, 798604, 858671, 956477, 1067378, 1164327, 1250322, 1329685, 1413862, 1535821, 1709186, 1924059, 2153000, 2378480, 2634121, 2975407, 3433960, 4040118, 4780558]
13059D780558Q99344J193575J625885K269970L264978M616665O461687R394031
13051C4506693J5064106K6588126M6190567N2601085J6250625k9047683m6278243
13044A15875276l9989350k5120926j4251525q644261n905782m466760l423986
13037A4072686k560839j946572j524427j169050q93055p18090o45618n80895m91070
13028C543070l92322k97349k49188k42156k31359k06151j79770j50038j07297
13019A487440q6226q5178q2925p7918o4732m9054l8402m6241n0882m3617l2461
13008H29804k8656k1687j117J8007j3755n8946p2291n7888m4033k6176k6783l0533
12996D65946k9877k1184j9788j6985j9812j5640j1542q618m462m374k562m939
$$ y = [4780558, 5679902, 6873477, 8499362, 10769332, 14034310, 18650975, 25112662, 34506693, 49570799, 76158925, 122349492, 174950577, 191201202, 162153519, 115875276, 75885926, 50765000, 36513475, 27869214, 21963432, 17496672, 14072686, 11511847, 9565275, 8040848, 6871798, 5978743, 5260653, 4615035, 4034140, 3543070, 3150748, 2853399, 2604211, 2362055, 2130696, 1924545, 1744775, 1594737, 1487440, 1401214, 1316036, 1233111, 1155193, 1090461, 1041407, 1003005, 956764, 905882, 862265, 829804, 801148, 779461, 778344, 796351, 782596, 723650, 651359, 593471, 549438, 523262, 496479, 465946, 436069, 414885, 395097, 378112, 358300, 342660, 331118, 322500, 318038, 313664, 311102, 306163]
12984C06163l096k802l875o083j1680j6070j6765k0945j9291j8103j1004O52L972
12971A81073K737J138l334r220j0720j1188o621r863j0071M54M915Q99K647j139
12957A31707j566K08P54J566J489o31o158p910o914l356k935K165K340l010l204
12942A04545N85Q36K490J706k204l531j80L753n8k187QO275N822J1454J1120O410
12926A46844j1018k0617j5613j0014p729K450J5953K5748J1559o020j1686j3628
12914A06229j7969k5346j7225o086Q25j937p088j726K154J895r16l712j839k431
12900B4828l302m166o129p212k217O446J2020J9018K2939J9662J2191K144n060
12887I1162r355p264m668q295r137k769k43M399Q594K158o664m456m623l897j676
$$ y = [306163, 303067, 300265, 296390, 290307, 278627, 262557, 245792, 224847, 205556, 187453, 176449, 177101, 181073, 183810, 184948, 181614, 172394, 161674, 150486, 143865, 134002, 123931, 124385, 129300, 130199, 132846, 131707, 130141, 130349, 131103, 132669, 134158, 133527, 127369, 119459, 112545, 109189, 106254, 108419, 110759, 107749, 104545, 105130, 105966, 108456, 110162, 107958, 104427, 104247, 108000, 107942, 105755, 105763, 112038, 117860, 129314, 140434, 146844, 135826, 115209, 99596, 89582, 81853, 84303, 100256, 126004, 137563, 131543, 119857, 106229, 88260, 62914, 45689, 39603, 40428, 38491, 31403, 29677, 31831, 33726, 32810, 29098, 27259, 24828, 21526, 17360, 11231, 4019, 1802, 8248, 20268, 39286, 62225, 81887, 94078, 96222, 91162, 81807, 74543, 69875, 61580, 52443, 49674, 49431, 53830, 62424, 64582, 57918, 53462, 48839, 44942, 43266]
12872D3266r14r14L554K706L636P79J136M199M134k900k0M460M226J151j848m081
12856F2570M25K084K102O883Q385J279p540j2978j8813j8925j1556j0263o532
12843b879J672O628O109J142K179N013K236O65L314J149N343P648L523K346J383
12828D7471k482o1M397K738J153q58k298O31j009j760k285r92o38L235k306o438
12812C8498m040K227p42n767jj213n19K416K711k37P36J765l129r35N095m6r65
12795C5854q10l883j111J712j620l386K779K677l745o608k713k62L251K910J460
12780B6505K286L640L551p06l795m873n820j151j521l404l68l539j308J515R16
12765A1928J535J513J297r96k929m87p86J245n75k39j403l003l178k872j954M5
$$ y = [43266, 42352, 41438, 44992, 47698, 51334, 52113, 53249, 57448, 61582, 58682, 58662, 63122, 67348, 68499, 66651, 62570, 62995, 65079, 67181, 74064, 82449, 83728, 76188, 63210, 44397, 25472, 13916, 3653, -2879, -1207, 5421, 11530, 12672, 14851, 19864, 22100, 22765, 26079, 27228, 32571, 40219, 43742, 46088, 47471, 44989, 44928, 49325, 52063, 53216, 52358, 50060, 50691, 49682, 47922, 45637, 44645, 44007, 47242, 44936, 38498, 34458, 36685, 35943, 30176, 30175, 28962, 28443, 30859, 33570, 33333, 34069, 35834, 32705, 31770, 36865, 36819, 35854, 35044, 31161, 30050, 31762, 30142, 26756, 29535, 32212, 28467, 21859, 19146, 18884, 22135, 25045, 26505, 28791, 32431, 35982, 35276, 31481, 26608, 20788, 19637, 18116, 14712, 14344, 10805, 9497, 11012, 11928, 13463, 14976, 16273, 15277, 12348, 11861, 11075, 12320, 11745, 11506, 10103, 7100, 3922, 1050, -904, -859]
12749h59j254k356j795L2k283q293k827J2637J3831M901L591Q219R287L635l400
12734C3066k151O26j197m498o57R69J395K71K724n7k176k746k61l11N17k89j057
12717B4168k7j374qj844j565K72J03J630j502k619p82J907r65K765K610j835l975
12700A6959k204M76N49k921J260K785M7J208j75r98j880j001J722p53o61j403
12684A3010O03L028J536K216k057p967m276k304r54K39L155M111R09J984M184
12669A7417J577K455Q16k405k195j335K707m084k339l112m08J665j518Q92J034
12654A1167K494J1r69L343K831n234n411K19K475K353K192k686m452R58J802j139
12638I954O09N627O161J580m82m625p68L806p64J319L431k122l437K14j286l938
$$ y = [-859, -2113, -4469, -6264, -6232, -8515, -16808, -19635, -6998, 6833, 11734, 15325, 23544, 32831, 36466, 33066, 30915, 31541, 30344, 25846, 25189, 26158, 27553, 27824, 30548, 30491, 28315, 25569, 25308, 24997, 25514, 25225, 24168, 24141, 22767, 22759, 20915, 19350, 19622, 19725, 21355, 19853, 17234, 16452, 18359, 17394, 20159, 22769, 20934, 16959, 14755, 15231, 15780, 12859, 14119, 16904, 16951, 18159, 17984, 16986, 15106, 14105, 15827, 15074, 14413, 13010, 13613, 16641, 18177, 20393, 18336, 10369, 6093, 3789, 2835, 3074, 6229, 10340, 11249, 13233, 17417, 18994, 21449, 22265, 19860, 17665, 16330, 19037, 14953, 12614, 9502, 9094, 10759, 9241, 10133, 11167, 13661, 13672, 12703, 16046, 18877, 13643, 8232, 8451, 10926, 13279, 15471, 12785, 8333, 9291, 11093, 9954, 10563, 16190, 22351, 23931, 23449, 18824, 18056, 21862, 21098, 22417, 25848, 23726, 20289, 20503, 19217, 15279]
12622A5279k193J869L170j401l716j679k416K378K600J042L946N977N595K630
12608C3081p75l96J509Q026Q839J5119K1120K5143L6261N8681R7941J74218K77207
12595G55974K32556j9590k18479k43827j76166r8130n2555l6553k5986k3265k0813
12584G3166q558p475j1455n484K13k634m580m582k06k969L72J087j665k667k67
12569B2296m115j269j09l577K85O011L22k245j415n70l872k393l403k260N07M316
12553H509L105m39k58k537J637K411K451J91l553J45o11j275j447k64K157J862
12537A2084j589j092j172j613p7J071j480P72k512l886p0K706j540M39M33N033
12521G507Q388j704j856k156l413l933m32n96J140K111J917k016m55q93j14J463
$$ y = [15279, 13086, 14955, 18125, 16724, 13008, 11329, 8913, 11291, 13891, 14933, 18879, 24856, 30451, 33081, 32306, 31910, 33419, 41445, 50284, 65403, 86523, 111666, 147927, 206608, 304549, 478767, 755974, 988530, 968940, 750461, 506634, 330468, 232338, 179783, 143230, 117244, 93979, 73166, 64608, 57133, 45678, 40194, 40407, 37773, 33193, 28611, 28405, 25436, 25808, 26895, 25230, 22563, 22296, 18181, 16912, 16803, 13226, 13511, 19522, 19844, 17599, 16184, 15614, 11742, 9349, 5946, 3686, 4193, 8509, 11614, 11175, 10917, 8380, 10017, 12428, 14879, 15070, 11517, 11662, 11051, 9776, 8329, 8065, 10222, 12084, 10495, 9403, 8231, 6618, 6541, 7612, 6132, 6904, 4392, 506, 436, 3142, 1602, 2041, 2474, 7507, 15895, 14191, 12335, 10179, 6766, 2833, 2401, 1805, 2945, 5056, 6973, 4957, 4502, 3609, 3495, 4958]
12505D958j143p67p35L025J800p94r69J481R72r50J434k866J05j30K858q72r85
12488F422O34Q23QJ844L125m618n727m99J612j050j095m68q39L759J447J992J061
12471H431j956k567J968K425O8K31j346M52l129q83J214L726j233k078k388p81
12455B154K66j271R15J988J904m51J039J259J436k933j604K119J637k636l475
12440B347O91Q36K156m05j845K970R04K855K107K50j929o97l899m963J097L630
12424F105K636J05l408j859k283k852L475L061J779l152k473j320K557K182M914
12409I467k058l356r93K137L18M679R36j991m828j717J553j077j416L054j350
12394C358l501Q52p35j531q46J365k061R29M990q17j175J264K370O44k049j016
$$ y = [4958, 3815, 3048, 2313, 5338, 7138, 6344, 5375, 6856, 7828, 6878, 8312, 5446, 5551, 5421, 8279, 7407, 6422, 7056, 7879, 7887, 9731, 12856, 8238, 2511, 2012, 3624, 2574, 1479, 1011, 172, 3931, 5378, 7370, 8431, 6475, 3908, 5876, 8301, 8369, 8600, 7254, 7706, 4577, 3694, 4908, 8634, 7401, 5323, 2935, 2154, 2420, 1149, 2064, 4052, 5956, 5505, 6544, 7803, 9239, 6306, 4702, 6821, 8458, 5822, 2347, 3038, 3874, 6030, 5625, 3780, 6750, 7654, 10509, 12616, 12866, 10937, 10240, 6341, 1378, 2475, 6105, 8741, 8846, 5438, 3579, 1296, -1556, 1919, 4980, 6759, 3607, 1134, -186, 2371, 4553, 9467, 7409, 4053, 3060, 5197, 5515, 10194, 11130, 9139, 4311, 2594, 4147, 3070, 1654, 4708, 3358, -143, 709, -26, -1557, -2403, -1038, -3099, -2170, 2820, 2003, 828, 2092, 4462, 5106, 3057, 2041]
12378B041K827J091j529j489p77L333J162n08k628R63K028q26n20j187O44K12
12362D837J086K605j560j854j079q00J198J197J606pl39j651k345L987N6n80k741
12345C616k44j756K307J021j789K167K169n81q16l281j594L87K054L389m59k080
12329D510k272k301j946N91L724j020J880K83L485M87l297l131J808K515J391
12314F707k445k073k55R30M43k168j549J836J821J19L18J825K319N29l257l883
12298A217q86K400j464P4J574J424q91j667j857n49K997m56N905n44L8J782j829
12281G268k290J269J631O76l530l813r82J421n44J960j692R57j339j912k280M7
12265c153J853N08K495l711K128J978J56k28O92J287k920r09J038P98Q63M108
$$ y = [2041, 4868, 5959, 4430, 2941, 2164, 5497, 6659, 6151, 3523, 4486, 6514, 5688, 5168, 3981, 4625, 4837, 5923, 8528, 6968, 5114, 4035, 3235, 4433, 5630, 7236, 7229, 6890, 5239, 2894, 6881, 6937, 6357, 3616, 3372, 1616, 3923, 4944, 3155, 5322, 7491, 6910, 6094, 2813, 1219, 1606, 3660, 7049, 6590, 4510, 2238, -63, -2009, -1418, 2306, 1286, 3166, 3449, 6934, 7421, 4124, 993, 2801, 5316, 6707, 4262, 2189, 1934, 2864, 3307, 1139, -410, 1426, 3247, 3366, 3684, 5509, 7828, 8357, 5100, 1217, 331, 2731, 1267, 1341, 2915, 4339, 3448, 1781, -76, -625, 2372, 1916, 7821, 7277, 7315, 9097, 7268, 4978, 6247, 7878, 8554, 5024, 1211, 229, 1650, 1106, 3066, 1374, 2331, 992, -920, -3200, -3153, -1300, -792, 1703, -2008, 120, 2098, 2254, 2026, 2718, 4005, 1085, 176, 1214, 2012, 2875, 6983]
12249F983q73k444j320k357J920o72K16j961j401J326J178l5j433Q12L367n20
12233B786q00O94m010k261j066Q21P35K106J219j990p65j544k778K329L196K391
12217A063J143M98k93l01L2q94j873J114O1m482M061O201j806n44r87r70j719
12200C04J238k022l318o33K003M453m8J598L451J817j009o421k295p29m67j994
12184d072K919N262L709R29r00j456l266j882J285J330J490k228j248K557j666
12169B763R15J16p68J249k403K67K393J818k941k254j215m095j685L918K008n13
12153d27J859J2L21m30k657l733k052N473K359L43l561p14J986R61o90M37J02
12136d11k58n02r58k605J669K016j240l895J577K517m85K33J274O72q83J49J628
$$ y = [6983, 6110, 3666, 2346, -11, 1909, 1237, 1453, -508, -1909, -583, 595, 560, -873, -61, 3306, 2786, 1986, 2680, -1330, -3591, -4657, -3836, -3101, -995, 224, -1766, -2531, -4075, -6853, -4524, -1328, 1063, 2206, 2704, 2411, 2110, 2142, 1248, -625, 489, 550, -3932, 129, 6330, 4524, 3980, 2993, 2023, 304, 1542, -480, -3798, -4431, -2428, 2025, 1977, 3575, 7026, 8843, 7834, 1413, -882, -1611, -2078, -4072, -1153, 4109, 7818, 8747, 7847, 6391, 3125, 1243, 2528, 3858, 5348, 3120, 1872, 4429, 2763, 3678, 3794, 3026, 4275, 1872, 2139, 4532, 6350, 3409, 1155, -60, -4155, -5840, -1922, 86, -427, 1432, 1444, 1765, 1335, -1322, -5055, -7107, -1634, 725, 1068, -2493, -3207, -1221, -260, -950, -513, -411, -669, -1171, -2129, -4734, -3065, -1049, -2289, -6184, -4607, -2090, -2575, -2342, -1068, -396, -1279, -1130, 498]
12119D98L33K02J837j409k222K425M19r15J127k34j6j791J015J203n13j471K091
12102B579L190j826k708n056j872O757L182l274Q65j860k327L314K367O98O91
12087D720j548l461j270j873M25J915P90j1l78K718K731P70r66n899m034j01Q51
12070d621K162K695L339K593j799j070k658k36N5L529L635m977o057m640J158
12055f892J953M605L233k337J836k934k514L14r36L002K801q95J770J643r69k636
12039A044l785K135J290l22k124m7M868M66j449l76l197O82K35k808j687M120
12023i55L04J695L391l31j173l076r97k61K677R39j10q29r65p3J667K995N0J320
12005F268k607k598Q82J046j851J110j316J232j347k653l036J036K637l18l50
$$ y = [498, 831, 1033, 2870, 1461, -761, 1664, 2083, 1168, 2295, 2061, 2045, 254, 1269, 2472, 1959, 488, 2579, 5769, 3943, 1235, -3821, -5693, 1064, 4246, 972, 1837, -23, -2350, 964, 3331, 4029, 4720, 3172, -289, -1559, -3432, -3007, -1092, -302, -313, -691, 2027, 4758, 5528, 4562, -1337, -5371, -5472, -4621, -2459, 236, 3575, 6168, 4369, 3299, 641, 405, 460, 3989, 7624, 2647, -3410, -8050, -6892, -4939, -334, 2899, 562, 2398, -536, -3050, -2736, -3672, -670, 2131, 1236, 3006, 4649, 3680, 1044, -2741, -606, 684, 362, -1762, -1809, 3059, 3525, 2076, 1700, -1497, -815, -580, -3388, -5075, -955, -651, 1044, 4435, 4104, 2931, -145, -1142, -1403, 1274, 2213, 2103, 1274, 309, 236, 1903, 4898, 4948, 6268, 3661, 1063, 1945, 2991, 1140, 2250, 934, 2166, 819, -1834, -4870, -3834, -1197, -1515, -1865]
11990a865k172J31K500J899n29Q80J15J691K392k73m334l341j231O92K28L217
11974@k793p42J500k473r25K04P10k242k024J571N328J120J626k98l313K9j364
11957d086J437J864J240Q54l65j367L693J280j176j203j123k622l164j87O3j143
11941f005k403M211M415K838k978k414J396M055j403K601l706l109K056J518L096
11926D168p85j577r23R0J842j657q83o70o58n40j267K332j557n240O12K015j319
11909f017L925J80l239M179J882j190J21K94K196M48j492O35j977l102J294K275
11893D12J060j984j052J848k366j035N88j127J830K02J27L021j005l260J671j48
11877a218k713l79O85J949j463J394J114L83j666k316M021L72j244K41O79M300
$$ y = [-1865, -4037, -3906, -1406, 493, -36, 844, 959, 2650, 5042, 4769, 435, -2906, -4137, -3445, -3217, 0, -2793, -3535, -2035, -4508, -5433, -5229, -4519, -6761, -8785, -7214, -1886, -766, 860, 562, -2751, -2722, -4086, -2649, -785, 455, 1309, 944, -423, 3270, 4550, 3374, 2171, 1048, -1574, -4738, -4925, -4862, -6005, -8408, -4197, 218, 3056, 78, -2336, -940, 3115, 1712, 4313, 607, -2502, -446, 1072, 4168, 3383, 1806, 883, 973, 2815, 1158, 275, -395, -1053, -1593, -2860, -528, -2085, -7325, -6713, -4698, -6017, -2092, -1912, -5151, -972, 910, -280, -159, 135, 2331, 2779, 1287, 1922, -55, -3157, -1863, 412, 1472, -512, -1564, 284, -2082, -3117, -2529, -3656, -1826, -1624, -1497, 1524, 519, -2741, -1070, -1218, -3931, -4310, -3625, -1676, -3139, -1745, -631, -248, -1914, -4230, -209, 163, -1081, -840, -161, 4139]
11861D139o65L00p74q06K293k866n276j536J225O46K988J688m416Q23M85r19j651
11844d322J10L083j092J072j228k597K98K077m20K23M58K077L494j825k439L177
11828B146n01Q50k95R21j486j221K066m95k720Q93J688l084q49K669k163j957
11812c538K618J095K68k889J19L636J119k33L921k305j591M02l868K56K137j256
11796a09l059P69L300m23k150j629J722j82J876O01o76L4l381J105O90M9j101
11779b564p6L569L368L039k206k326l186J365M437n89j977l637j554P38P6N90
11763i33j323j38l91j109J050Q26j780O1J108r99j741K254K079J802J751K487
11747E004P24k856r12l121K769K584l722p509k332J978M89K182O398Q45k778l702
$$ y = [4139, 3474, 3774, 3000, 2194, 4487, 1621, -3655, -5191, -3966, -3320, -332, 1356, -3060, -2237, -1752, -2671, -4322, -4212, -1129, -2221, -1149, -2377, -4974, -4676, -2599, -3019, -2796, -2338, -261, 3233, 1408, -1031, 2146, 1645, 2495, 2200, 3121, 1635, 414, 2480, 1985, -735, 158, 1846, -1238, -2087, 582, -1581, -3538, -920, 175, 443, -2446, -2327, 1309, 2428, 2195, 6116, 3811, 2220, 2622, -1246, -990, 1147, -109, -3168, -2399, 901, 478, -1672, -3301, -1579, -1761, 115, 716, 40, 74, -3307, -2202, -1512, -1463, -2564, -2640, 929, 4297, 7336, 5130, 2804, -382, 983, 5420, 4831, 2854, -783, -2337, -1599, -1523, -933, -2256, -2394, -2785, -3894, -2844, -2018, -3798, -3737, -2629, -3628, -5369, -3115, -1036, 766, 2517, 5004, 5728, 2872, 1960, -1161, 1608, 4192, 470, -7039, -9371, -7393, -6904, -4722, 1676, 2521, -257, -3959]
11731c959k33l252J522J907J71m50n66o87J042N02l191l04J348K432R40P75J558
11714d45M55l75l365j586M047l48K643J784L6k303J213j929k505j28J956j979
11698b829k852K613J087L623M75m917j755P23p00J951R63l211j424L770Q17k365
11682d031J598L222k106J291J297L65q5Q11k189J45K865k72k65j831l684p25N47
11665c047P65R53P84L988J463k136Q95k369m256k668J493M325k113k269J789l37
11649b740r48J284Q42L5M00j767l393j270k876O96K094j422j083O15K363K504
11633d666j161J215L440J87l504J656K885j608j271Q8r43j17J531M264N85Q19
11617C400J172j602j705j357O99n6M73K374P39m222j622j033K51n80M8O99k2J662
$$ y = [-3959, -4192, -7444, -5922, -4015, -3844, -4294, -4860, -5547, -4505, -4003, -7194, -7498, -6150, -3718, -2778, -2003, -445, 10, -365, -3730, -5316, -1269, -1617, 1026, 2810, 2846, 543, 1756, -173, -2678, -2806, -850, -2829, -5681, -3068, -1981, 1642, 2117, -2800, -4555, -3832, -4532, -2581, -1618, -4829, -6253, -2483, -1666, -4031, -2433, 789, -1317, -26, 1271, 1636, 1551, 2362, 173, 318, 3183, 2911, 2646, 815, -2869, -3594, -3047, -2282, -1329, -545, 3443, 4906, 2770, 3665, 1296, -2960, -5628, -4135, 190, -1923, -4192, -2403, -2740, -3688, -2404, -1562, -1527, -1127, -2894, -6287, -7557, -10433, -9737, -7643, -9065, -10148, -9533, -7170, -4666, -5827, -4612, -1172, -985, -4489, -2833, 52, -1556, -2827, -2739, -3682, -3799, -2268, 1996, 2581, 3400, 4572, 2970, 1265, -92, 607, 551, 1024, 3398, 4137, -85, -1707, -2740, -2489, -3069, -3021, -2322, -2344, -682]
11599f82j994j050l545j498L379N157k97K677M126j037m782k407J590J402M752
11584E791k096k656J700k421M739K82k866j788k791l709M8K218J79J572p74K668
11568I6L166L86l83Q15l96m26k297k07J224k031J34L493P00j719m585j168K172
11551a026L846L57m925m115p96J506L915j235K278M529K719q72k635l363m680
11536d497p26L508j932J220M545k636k624O06m936P92N426o33k804r87K363K021
11520a294m05M69j708L820N162j545j946q95k618J61P42j980k692L15K740P74
11504i00k748r86j279j679K453J598K79m55K151Q35o62k780K204J062R3J606k083
11487a291J849L88l607l612j165L513R01q77M23j888Q76l08K37O207K758k404
$$ y = [-682, -2676, -3726, -7271, -8769, -5390, -233, -530, 2147, 6273, 5236, 454, -1953, -363, 1039, 5791, 3695, 1039, 2739, 318, 5057, 5339, 2473, 685, -2106, -5815, -5767, -3549, -3370, -1798, -2572, 96, 3262, 3648, 3265, 4080, 3684, 3258, 961, 754, 1978, -53, 81, 3574, 4274, 2555, -2030, -3198, -1026, 2820, 3177, -1748, -5863, -6659, -5153, -1238, -2473, -195, 4334, 7053, 6181, 3546, 183, -4497, -5223, -1715, -3647, -2427, 2118, -518, -3142, -2536, -7472, -6680, -1254, -1887, -4691, -5678, -3315, -1294, -1699, -1230, -2938, 882, 6044, 4499, 2553, 1658, -960, -799, -57, -2037, -4729, -4414, -1674, -900, -3648, -4634, -5913, -7592, -5139, -3541, -3262, -3717, -1566, -731, -1393, -4173, -1969, -907, -814, 792, -1291, 558, 946, -2661, -6273, -7438, -3925, -3024, -3901, -3478, -5366, -4490, -4798, -4561, 1646, 4404, 2000]
11471B000o00j959r25K949P2O05j508m722j166M250j131j629j452J588k74m99
11455d401k648J6J590M908J885j379k415L027K211o24k815m692j506J33J9J956
11439d735K699o23j652J840R06K053N93K842R67r42k506k994n06j908k154O89
11423e431J495K256j233j201R00M485M395K652l489k171q93J834m47K436j701
11408C887j941l500l76n86J35J126K038K151l507q73L656k494p8L014P40o242
11392b850j575J113J194l19L66k958R69J213o9K957K093J51o29k839M36j515m71
11375b733J517R86k051j240N89n06l47J516J335k698n14J927L366j793J161n2
11359D63K589K704m985J517L669l125j148p30j078j840l095j827j708Q25K52J424
$$ y = [2000, 1400, -559, -1484, 1465, 1537, 2142, 634, -4088, -5254, -1004, -2135, -3764, -5216, -3628, -3902, -4401, -7049, -7033, -5443, -535, 1350, -29, -2444, 583, 2794, 2170, -645, -5337, -6843, -6710, -6691, -4735, -2036, -2659, -4311, -2471, -1565, 488, 1081, 3923, 4890, 3948, 1442, -1552, -2058, -3966, -6120, -5431, -3936, -1680, -2913, -4114, -3214, 1271, 5666, 8318, 4829, 2658, 1765, 3599, 3152, 5588, 3887, 1946, -1554, -1930, -2516, -2381, -1255, 783, 2934, -573, -1446, 2210, -284, -362, 2652, 3392, -2850, -4425, -3312, -2118, -2437, -2071, -5029, -4060, -2847, -2916, 41, 2134, 2285, 1656, -1183, -747, -2262, -2733, -1216, -230, -2281, -3521, -2932, -3438, -3785, -2269, -934, -3632, -4146, -2219, 1147, -646, 515, 463, 3052, 5756, 771, 2288, 5957, 2832, 1684, 954, -124, -1964, -5059, -6886, -8594, -7769, -7517, -6093]
11343f093j373K13Q77J616Q61j181J308J772J843M310j298j468k936J151O21J175
11327A398N213j193l705o417k270J770p86J702L862K685l45J60J787N50l184j845
11311f18l211j339P02J028J032j786k942l697K992J092N68J658J282K608j444
11296b075l728J293J045o71j85K717k39r40j134K804J852J200m751m71M145J758
11280B620N88L948L229j862j666k091j714k476l034P75R06j447m93J383o50k620
11264d604k17k28K861n8n74J642K526q88l060j589n21Q04k19o90j170L55O31L481
11246a518R43m125l450M40O071n97j210L059k125j753m58J725R10j706J359L730
11230A295M756K034j835N89j312j241l573m943j163Q92j049R02J358L24J885J125
$$ y = [-6093, -7466, -7253, -6376, -4760, -3899, -5080, -3772, -2000, -157, 4153, 2855, 1387, -1549, -398, 223, 1398, 6611, 5418, 1713, -4704, -6974, -5204, -5990, -4288, -426, 2259, 1914, 2074, 3861, 4411, 1227, -618, -3829, -5168, -4466, -3438, -2406, -4192, -7134, -10831, -7839, -6747, -6179, -4521, -3239, -631, -2075, -5803, -4510, -3465, -4136, -4321, -1604, -1843, -2783, -3917, -1113, 739, 1939, -2812, -3283, 862, 2620, 3208, 7156, 10385, 8523, 6857, 4766, 3052, 576, -2458, -1683, -777, -2224, -2717, -1334, -1984, -4604, -4821, -5049, -2188, -2246, -2820, -1178, 1348, 460, -2600, -4189, -4710, -3906, -4125, -4815, -5985, -5630, -4999, -1518, -575, -4700, -8150, -7710, -1639, -2236, -3446, -387, -2512, -4265, -4723, -2998, -2088, -3794, -2435, 1295, 6051, 8085, 6250, 6839, 5527, 4286, 713, -4230, -5393, -4501, -5550, -4648, -3290, -2966, -1081, 44]
11214D4J396P97L04j577j179K588j227o49j068l55o79J155O46k862q48k587o33
11197f734L045j46k472K866K296J695j581m426r53l033k582K854M857r34o7L784
11181a531K411j854K93J747M2M81J817k382l366k892k787M34J040L282O13j352
11165d004j818O15J694k492j135j612L303K616K969j424J904L30m807j446J436
11150c871l83k82k227q08L949j197K447P9l718K381K968l15J103j019l177k089
11134f159k012K57j157L231J346K91K476R13K58j886k445j328O49J672J21j620
11118e393j440K499L752k349m35m37j398J762L062J298M303p75o005n92Q02m11
11102a757P67k378j652K178R04Q38l59J116p65q46J394L84k860m012J071J939
$$ y = [44, 1440, 2237, 2541, 964, -215, 2373, 1146, 497, -571, -926, -1605, -450, 196, -2666, -3514, -6101, -6734, -3689, -3835, -6307, -3441, -1145, 550, -1031, -5457, -6410, -9443, -12025, -9171, -4314, -5248, -5315, -1531, 880, -974, -681, 1066, 1108, 1589, 3406, 1024, -2342, -5234, -8021, -7587, -6547, -3265, -2652, -4004, -5822, -5207, -3513, -6005, -7140, -8752, -5449, -2833, 136, -1288, 616, 946, -3861, -5307, -3871, -4254, -4536, -6763, -7571, -3622, -4819, -2372, -2293, -6011, -3630, -662, -977, 126, -893, -4070, -6159, -8171, -7914, -9071, -5840, -4494, -4203, -1727, -814, -556, -2442, -4887, -6215, -5566, -3894, -3773, -5393, -6833, -4334, -582, -2931, -3366, -3803, -5201, -3439, -377, 921, 5224, 4449, -1556, -2148, -1346, -1757, -990, -3368, -5020, -2842, -1938, -1100, -1459, -343, -1108, -1954, -560, -176, -3036, -7048, -5977, -4038]
11086d038K382L146J21N77j782k606M29l84J773m65k679R34j296J87J732J307
11070f62p36l22J318J544k807l428r03K229J039J958k150k973j338j981k159L134
11054h237J216M74J543r6L287L4k160j535j04N08J253L32K173L044M49k232J85
11037A34k425k495K926J672Q29j125j82L008j957l602k876j308N085M594n99l131
11021a452k684J628M954M521M854o46l160m611j325J387K4R35j177K35J052l559
11005I76k228K157J482M47k396o77L431M15k072M80l551j825O54j650N15K554
10989a288J199P06j914l164K497Q99k93O9K451K635k153J2k33K836L442O084K749
10972A6534j117j706j838o036l174m756l023J580J280j854j100N10R24K47J351
$$ y = [-4038, -1656, 1490, 1611, 2188, 406, -2200, -1771, -2155, -382, -847, -3526, -2592, -3888, -3701, -1969, -662, -1398, -1720, -402, 1142, -1665, -5093, -5996, -3767, -2728, -770, -2920, -5893, -7231, -9212, -11371, -8237, -7021, -6547, -5004, -5100, -1813, -1779, -3939, -5474, -5578, -5070, -3817, -3485, -1312, 1732, 2181, -51, 134, -2291, -4786, -1860, -188, 641, -484, -666, 2342, 385, -3217, -6093, -7401, -2316, 2278, 1679, -1452, -4136, -2508, 2446, 6967, 11821, 11175, 8015, 3404, 2079, 3466, 3490, 4425, 3248, 3483, 4535, 976, -1252, 905, 2387, 2834, 438, -239, 3192, 3607, 1535, 2015, -1536, -3361, -2707, -4357, -3842, -1288, -89, 617, -1297, -4461, -1964, -1065, -1358, -1289, 1162, 3797, 1644, 1656, 1423, 4259, 7701, 13785, 16534, 15417, 13711, 11873, 5837, 2663, -2093, -5116, -3536, -2256, -4110, -5210, -4700, -3776, -3529, -2178]
10957b178M169m40k702p76J200j993m330l869o89o89J772J561P75K871l002N20
10941g800M057J02l461K477K474q0q1K475M695L622l89K848L565r96k577K72j958
10924I245m898q39j125j213K202J238J650J161o49m94k605k32r70j135J399o13
10908B122k205j308M13p3j927R52J597j265J321O19l628l022j604K993K881Q31
10892a303m76n68K035L028j098K70J02k126K020m85o46n3R01R10j322k638J281
10875a68l33j985P98m69j028M86o2L214q4j690L2k403p47K96J771K350l657l157
10857f836R38L069J016j502k58o88J892r24K869M29m202o73M57j38J156j249K264
10840b380K424J938j441J542j206J441p89k923j124l777p5K042K574k74j863q13
$$ y = [-2178, 1991, 1551, -1151, -1927, -727, -2720, -7050, -10919, -11608, -12297, -10525, -8964, -8189, -5318, -8320, -7800, -3743, -3641, -7102, -4625, -2151, -2231, -2312, 163, 4858, 8480, 8091, 10939, 14504, 13508, 10931, 11203, 9245, 4347, 3508, 2383, 1170, 3372, 4610, 6260, 7421, 6772, 6278, 3673, 3441, 2471, 1336, 2735, 2122, -83, -1391, -978, -1051, -2978, -2026, -429, -1694, -373, 246, -3382, -6404, -8008, -5015, -2134, -1303, -1779, -2347, -312, 2716, 1618, 1888, 1990, -136, 1884, 1399, 753, 700, 1601, 2511, 1189, -1449, -168, -501, -2486, -1688, -2157, -3185, -2699, -2761, 453, 369, -1321, -1289, -3692, -4439, -4143, -2372, -22, -3679, -6836, -5898, -2829, -1813, -3315, -3573, -4261, -2369, -3293, -424, 5, -4197, -4870, -4413, -4551, -3395, -4644, -2380, 44, 1982, 541, 2083, 877, 2318, 1529, -1394, -2518, -6295, -6370, -4328, -1754, -2028, -3891, -4704]
10824d704K279o33P52Q16k879k661N75j770r4J072o59J158K23R29J082J440L35
10807b739J216q58N05k136j15R69j423q58J387K255K424R47k528l974j387J356
10791d959L93J663J247k966o685r73O36L053J575N729J726J35M01j415N96K773
10775B929l548m038k204M29J737J934k02M45L003o57J399K879r28J35k839r58
10759d84N74k94r84r56L330J32J66J17q80p08j639O59m851k933k16K997M402J341
10741b27J252L498J091k421o314k135M09J130J11L655n19K780L651J17K871k98
10725H651k234m08K024k317j024r82J249o70k09j216J142j774L68m478k357K9
10709d206k92K280j916L76q46J131L304k68k185j271K858K373M35n163j380J210
$$ y = [-4704, -2425, -3058, -2306, -1490, -4369, -7030, -6455, -8225, -8319, -7247, -7906, -6748, -6525, -5596, -4514, -3074, -2739, -1523, -2381, -1876, -4012, -4127, -3158, -4581, -5439, -4052, -1797, 627, 1574, -954, -4928, -6315, -4959, -4566, -2903, -1656, -4622, -11307, -12280, -11644, -8591, -7016, -1287, 439, 574, 975, -440, 156, 2929, -619, -4657, -6861, -6432, -4695, -2761, -2963, -2518, 485, -172, 1227, 4106, 3178, 3313, 474, -484, 90, -204, -1188, -2144, 1186, 1318, 1484, 1601, 721, 13, -1626, -967, -5818, -8751, -8967, -5970, -1568, -227, 1025, 4523, 5614, 3193, -3121, -5256, -4847, -3717, -3606, 49, -470, 2310, 5961, 6078, 8949, 8651, 6417, 6009, 8033, 5716, 4692, 3710, 4959, 4289, 4080, 2864, 4006, 2232, 2600, -1878, -4235, -4206, -4498, -2218, -4134, -3758, -4604, -3473, -169, -437, -2622, -3893, -1035, 1338, 1773, -3390, -4770, -3560]
10693c560j500p51J354M48K92l14j413j630L840J944N68J354J421J53j056p64
10677C86n524j077l192N164N223J21j626K194M43k674j243J91l161k879J195j279
10661g738K04J926O1k93J456k34q04K231J583J318j453L321j801l237o71j971
10645f102q92J343J940J693k538n88j127m127k712K390M233N138J571k051k121
10630c950N35J813K340J096l593K610K817k089r84K27p52R25N50k026O87J419
10614A625l400k914M057M092r47nj961j404n66k480o69J537K69J396L622L003
10598E255j643l167j606l548p10K454K879J137j952m072o22LL034K917l290j705
10582d636L236R29J677J178n60J096j053k62j010n504l087K311Q18K84O62kK582
$$ y = [-3560, -5060, -5811, -4457, -4009, -3717, -4031, -5444, -7074, -3234, -1290, -722, 632, 2053, 2206, 1150, 386, -5138, -6215, -9407, -4243, 980, 1101, -525, 1669, 2112, -562, -1805, -1614, -4775, -7654, -6459, -7738, -7534, -5608, -5547, -5840, -4384, -4618, -5422, -3191, -1608, -290, -1743, 1578, -223, -3460, -4131, -6102, -6994, -5651, -3711, -2018, -4556, -5144, -6271, -10398, -13110, -10720, -6487, -1349, 222, -1829, -3950, -3415, -1602, 738, 1834, -1759, 851, 3668, 1579, 595, 822, 70, 995, 1545, -481, 206, 1625, -1775, -4689, -632, 3460, 2513, 2508, 547, -857, -1423, -3903, -4572, -3035, -2766, -1370, 2252, 5255, 3612, 445, -1161, -4709, -5419, -2965, -86, 1051, -901, -4973, -5595, -5592, -2558, 359, -2931, -4636, -1400, -471, 1206, 2384, 1824, 2920, 1867, 1605, 595, -4909, -7996, -5685, -4867, -4583, -3921, -3923, -1341]
10565a341P83K55k470n65J648K284j744j684K245L288J562L662l06k303l485j708
10549A21N04k562k264N12J249J930K245r42k345J018J620n83K320J898k746l469
10533a494j485j199j847J172J761j52K51L011N98J471q76Q99R8k914o02K252l13
10516F31l400j499m21j99M974K826n370l543kJ533L329m14J087k301M17j760j74
10499d286K43k975M25M852K478m323J714L066k846P12J015k98j724K293K196k020
10483E22L11j185M86Q63N57k411m519P38Om081K962M194k327K597M361R4m271
10466a103m18M753q31k092n80J21O04l289k083k16K257K03m98k63k2R32Q2N165
10448B722K979l303J47J779j445R96j382R07J013k097k773J215k173k221M65K32
$$ y = [-1341, -558, -303, -2773, -3338, -1690, 594, -1150, -2834, -589, 2699, 4261, 7923, 7617, 5314, 1829, 121, 625, -1937, -4201, -3689, -2440, -510, 1735, 793, -1552, -534, 1086, 503, 2823, 4721, 1975, -1494, -2979, -4178, -6025, -4853, -3092, -3244, -2993, 18, 616, 2087, 1211, 2110, 2208, -706, -1308, 944, 631, -2769, -4268, -4689, -4888, 86, 2912, -2458, -6001, -6003, -4470, -1141, -1555, -468, -2769, -2352, -4112, -4286, -4043, -7018, -6593, -1741, 737, -3586, -1872, 1194, -1652, -940, 75, -223, -1947, 346, 2542, 522, 833, -352, 134, 997, 1554, -857, -5376, -4638, -4632, -8713, -5751, -1557, -3884, -1287, 3074, 3168, -1103, -1521, 3232, 2401, 309, -271, -150, 454, -2835, -4918, -5134, -2877, -2674, -3172, -3435, -3457, -2525, -2443, 2722, 5701, 2398, 2545, 4324, 2879, 3875, 2493, 3400, 4413, 2316, -457, 758, -1415, -3636, -3171, -2939]
10432b939K848m8M36j876K848r42J83j632k57J420l686l078M319L573L411r58
10416C622J261l681m204Q02L06j643J170n72k010K148M09L594J185k738k218n09
10400c078J044l132j686Q47N93n25L848L732o46K721O13l836l951R60P42L458
10384A704K791l074Q52K072J411q44m402K156M31K390K040J63k357l555j868M67
10368C77M929J969l499r83K088M24o88P29P98k85K904M594L212J676K998N053
10352B6296L208K694M758P198Q203K935Q291N697Q379J4599J3983K2249L4193
10339A62683N1007Q2920J30410J70440J85770J98599K17834K20620J68723R6080
10329A685086K6172j5684p5787j47229j99427k18132j93094j69495j52168j34890
$$ y = [-2939, -91, -139, 297, -1579, 1269, 327, 510, -1122, -1379, 41, -3645, -6723, -2404, 1169, 4580, 3622, 4883, 1202, -3002, -2200, -1894, -3537, -2367, -2939, -4949, -2801, -2392, 1202, 2387, -351, -2569, -3078, -2034, -5166, -6852, -6005, -5412, -5937, -2089, 1643, 997, 3718, 4331, 495, -3456, -2496, -1754, 1704, 4495, 1421, 2273, 4345, 5756, 4912, 510, 2666, 3097, 5487, 7527, 7690, 5333, 1778, -90, 377, 5306, 7275, 3776, 2793, 4881, 5305, 4617, 5346, 6144, 5859, 8763, 13357, 16569, 18245, 21243, 26296, 29504, 32198, 36956, 44154, 52357, 55292, 63583, 69280, 77659, 92258, 106241, 128490, 162683, 213690, 296610, 427020, 597460, 783230, 981829, 1199663, 1420283, 1589006, 1685086, 1711258, 1695574, 1619787, 1472558, 1273131, 1054999, 861905, 692410, 540242, 405352]
10319D05352j02805p2026m6770k7349k0327j8802j4005j1328q254p017j0462r289
10307E6918o035j716m612n250l078m165k805l580k373n300k72k870m794m084j490
10292D494J210l94K551J900r45q09j328L31O81j958q92J809J498q58k34M90m52
10275G094r28K128J952j66l261j632L139J937n9j099J178K33p51j093j701m029
10259B942k942K223L040J38l94N268K456k718m812m147n37L878K502k14l820k557
10243C06j674j436J932Q44K517p03l275j065K561M080N85l346r92l50J316l110
10227a810J68L536J145J219j007m650k766K759N027K133m426m566J149J40J180
10212g69O83j541k293J558J23j94J850O14J039o94O28K968m84m586m398R29P25
$$ y = [405352, 302547, 230521, 183751, 156402, 136075, 117273, 103268, 91940, 83686, 76669, 66207, 56918, 50883, 49167, 44555, 39305, 36227, 32062, 29257, 25677, 23304, 18004, 17732, 14862, 10068, 5984, 4494, 5704, 5310, 7861, 9761, 8816, 8007, 6679, 7010, 7691, 5733, 4841, 6650, 8148, 7290, 7056, 7546, 7094, 6166, 8294, 10246, 10080, 6819, 5187, 8326, 10263, 10204, 9105, 10283, 10516, 9765, 8672, 6971, 2942, 0, 2223, 5263, 5401, 5007, 10275, 12731, 10013, 5201, 1054, 517, 4395, 6897, 6683, 2863, 306, -1368, -2804, -872, -28, 2489, 1786, -1489, -2554, 7, 4087, 4672, 1326, 334, -16, 1300, -1810, -1642, 1894, 3039, 4258, 3251, -1399, -4165, -1406, 3621, 5754, 1328, -3238, -2089, -1949, -769, -86, -1627, -3920, -2362, -2239, -2433, -583, 31, 1070, 376, 1004, 3972, 3488, -1098, -5496, -4567, -3842]
10195c842k762R04L028j076j094j553K485L263M517N84j18M39P28o97k824m068
10179b086l155K04R82K081L878j436k193J933K204q20J52J68l049p54k637P97
10163c731R1l74j806k256R89K48J456M4K169K770p65J516K060j640j597R36j647
10146a537j292j64J210J009J501k891J133j868q88J562J555n306k023M329K711
10131i59l448J479K818K064q90n08j3j36P03k910l610J307O7j667J363M379Q44
10114H83K273j545k464J38K943K03j30P48j19J333k420j142j217k440R70r87k551
10097e524q01n73J846M866J561P03l134r39J393j166L353K708k239j756N265R33
10081F496j341o219n167L417N5r42k269J027K455J600K016J571M038j336m268
$$ y = [-3842, -6604, -5700, -2672, -3748, -4842, -6395, -3910, -647, 3870, 4454, 4336, 4775, 5503, 4806, 1982, -2086, -5241, -5037, -4055, -1974, 1904, 468, -1725, 208, 2412, 1592, 1744, 1912, -1137, -1891, -4528, -3731, -3640, -4014, -5820, -8076, -7087, -6839, -5383, -5339, -3170, -400, -1165, 351, 2411, 771, -826, 110, -1537, -2829, -2993, -1783, -774, 727, -2164, -1031, -2899, -3787, -2225, -670, -5976, -7999, -3670, -959, -4407, -2928, -110, 1954, 1064, 556, 543, 407, 1110, -1800, -5410, -4103, -4036, -5703, -4340, 39, 883, 3156, 1611, -853, -715, 2228, 2431, 2301, 3049, 2930, 4263, 1843, 701, -516, -2956, -1986, -2973, -5524, -6325, -6898, -5052, -186, 1375, 2078, -1056, -1995, -602, -1768, 1585, 4293, 2054, 298, 5563, 6496, 5155, -1064, -6231, -2814, -2759, -3701, -5970, -4943, -2488, -888, 1128, 2699, 6737, 5401, 1133]
10066A133l833K428J912K315M46J316Q34l524k521j624P75L674K867J866q80N290
10050A2474O697O208O329J4827K8454O6451R8793J8407n8627p2223n4269k5578
10038D7943j2269o118o408m135m983j470l673m133j810k134k196J758M119L5j1
10023D515M70J045q49k658m653j356L278j140R47p18R59K804j472L75L8J052J520
10006D157J187J752q11j71j706j236J326l511j436K011j505m27J246j320p52Q
9990a188K738Q62r96q12j126j75m013j180j76k980K731J823k542M85j395k30J866
9973f308M020M91R33n96L261m75J296r98K45j119k121j010J299L457J165J556
9957E096J146k088k616p11K978k340p210k13n28J590J113K668J394k550Q47K19
$$ y = [1133, -2700, -272, 1640, 3955, 4401, 5717, 6551, 3027, 506, -1118, -343, 3331, 6198, 8064, 7184, 12474, 19171, 25379, 31708, 46535, 74989, 141440, 240233, 258640, 200013, 127790, 73521, 47943, 35674, 29556, 23148, 19013, 14030, 12560, 8887, 4754, 2944, 810, -1386, 372, 4491, 4526, 4515, 4985, 6030, 5181, 2523, -2130, -3486, -208, -1348, -401, -1119, -160, 2644, 1172, 1547, 1585, 2637, 4157, 5344, 7096, 6285, 6114, 4408, 3172, 4498, 987, -449, 1562, 57, -370, 876, -444, -1196, -1188, 1550, 2412, 1416, 604, -522, -697, -4710, -5890, -6066, -9046, -6315, -4492, -7034, -6549, -7944, -8174, -6308, -2288, -1797, -864, -1460, 1801, 1326, 2622, 1624, 1869, 750, -1371, -2381, -1082, 2375, 3540, 5096, 6242, 4154, 1538, 827, 3805, 1465, -5745, -5958, -6486, -4896, -3783, -1115, 279, -2271, -1424, -1205]
9941a205R41n99r04O21N23K076n4q63J011L435o53j44N620M870r00J478k25m292
9923A0736l060k107k084m143j767J141K112L596P05k162m082k714j764L592K133
9908A32j197O61m45Q81N438J508k827j096J311m067j133m67k971j81J763l60j176
9891d226K622K513J429K423J044o14J376l01j825m155j915o0L61L38J880j129
9875b39Q69J053K356K788L41k993l171j976k391k194K852L061L837J933j993k085
9859B048q94q75l699K78j356J600L721J840L885N797n05j49k820l321k782P51
9843C519r57J088j940P22o61J642o43l542j186r96P26K506k597j943Q29L206J164
9826I37l6m869r50K025L383l365k580j416M700K980K002J38L93l753k456P78j350
$$ y = [-1205, -264, -863, -1767, -1146, -623, 1453, 1399, 536, 1547, 4982, 4329, 4185, 9805, 14675, 13775, 15253, 15028, 10736, 7676, 5569, 3485, -658, -2425, -1284, 828, 4424, 5129, 2967, -1115, -3829, -5593, -2001, 132, -1065, -404, -849, 32, 5470, 6978, 4151, 3055, 4366, 299, -834, -1301, -4272, -4453, -2690, -3050, -4226, -1604, 909, 2338, 4761, 5805, 5191, 6567, 6266, 4441, 286, -1629, -1689, -1328, -990, 890, -239, 630, 1683, 4039, 6827, 7168, 4175, 1004, -972, -3363, -5557, -2705, 356, 4193, 6126, 4133, 2048, 1154, 279, -3420, -3142, -4498, -2898, 823, 2663, 6548, 12345, 11840, 11691, 8871, 5550, 2768, 3519, 2562, 3650, 1710, 2432, 1771, 3413, 2770, -772, -1958, -2954, -2228, 278, -2319, -4262, -3433, -227, 937, 901, -3968, -4918, -2893, 490, -2875, -5455, -6871, -2171, 809, 2811, 2949, 3342, -411, -2867, -2089, -3439]
9809c439p43K103K567m83l449k577j862K543L859M054J468k71k122l044m40l341
9793e177L12N44J628J605q37k806K289J595k123n87K893K646n02K284k786K83
9777A261K00l113k524L45j553J016J880K616k325j81L143p12j20P11j563j478
9761b397k554J518K502p42R28J427j579m021k136l40J987L403J682q92j32L565
9745B219k578m271K49L675J71j221o97o62J16L16K39N00L638M055O47k498j677
9728B221k495O9N95J379p69J624O63j963j524J375N58r22o098m296K516J061K252
9711c754L818J209K540q27k900J537M436n38k658k359k662m3j164L74j691J9J775
9694b888n14j791k576J670L799K419j085k302J459R58N45r85P69K485J93O9p78
$$ y = [-3439, -4182, -2079, 488, 5, -3444, -6021, -7883, -5340, -1481, 2573, 4041, 3770, 1648, -1396, -1836, -5177, -4865, -4321, -2693, -1088, -1925, -4731, -2442, -847, -2970, -3557, -664, 1982, 1480, 3764, 978, 1261, 1461, -1652, -4176, -3831, -5384, -4368, -2488, 128, -2197, -2378, 765, 53, -67, 644, -919, -2397, -4951, -3433, -931, -1673, -745, 682, -897, -4918, -7054, -7394, -5407, -2004, -322, -1214, -1346, 2219, -359, -4630, -4381, -706, -535, -1756, -2453, -3115, -2999, -2683, -2444, -1944, 1694, 5749, 6396, 3898, 2221, -274, -205, 390, 1769, 1000, 2624, 3287, 1324, -200, 1175, 1733, 811, -5287, -9583, -7067, -6006, -3754, 64, 1273, 3813, 2986, 86, 1623, 6059, 5521, 2863, 504, -2158, -2201, -3365, -2991, -4682, -4663, -2888, -3402, -5193, -7769, -6099, -2300, 119, -966, -3268, -1809, -851, -306, -1291, -522, 1963, 2156, 2225, 1447]
9677A447j701l05J156J212k515j433N11N38J640j202J827L994j64m53J176o42
9661E086k1j582r95K387o51l933n646N65M631J850j710m205j939Q13n92j353K216
9644e079J095j112L557J079l262j575L501K657k101k181O35m4l226J139L816j580
9628b681J805L882O42q62k053l614K56J107J023m052n31L668M161j798k859l731
9612e637k10k456L341J431K154K92L527k505k053K236j982k337J816L528j790
9597f45k916j531K681M026J086L821J60k097K308l516k368k192N21J143K5P63
9581A269l56j51q01p11K416J140p76k065L083j078o33M60Q3j112J818J354M82
9564D422m528M72J551P41k910J70J777n11J405l35J229k102k092j990L334p02
$$ y = [1447, -254, -559, 597, 1809, -706, -2139, -1628, -1090, 550, -652, 1175, 5169, 5005, 4552, 5728, 5086, 5065, 3483, 2488, 4875, 4224, 291, -5355, -4790, -159, 1691, -19, -4224, -6163, -5350, -5942, -7295, -5079, -3984, -5096, -1539, -460, -3722, -5297, -1796, 861, -1240, -3421, -2786, -2830, -6056, -4917, -1101, -2681, -876, 3006, 3648, 2786, 733, -2881, -2625, -1518, -495, -4547, -5078, -1410, 2751, 953, -1906, -5637, -5847, -8303, -4962, -3531, -1377, -1085, 2442, -63, -2116, 120, -1862, -4199, -2383, 1145, -645, -3561, -5092, -2411, 1615, 2701, 6522, 6682, 4585, 6893, 3377, 1009, -1183, -662, 481, 506, 1269, 913, 762, -39, -750, 1666, 2806, 2030, -35, 3048, 1970, 1337, 1797, 1880, 768, 2586, 3940, 4422, -106, 366, 1917, 2658, -252, -82, 1695, 1184, 2589, 2254, 3483, 1381, -711, -2701, 633, -69]
9548f9j574m11L265K110q34l156L15K248K43M42J606L2k307o40r63J84J17L293
9530C901L540j322m697m586j182J076M675J736k870l027M45L284j781j470J185
9515a093M759J074j652r94L62J299J45k535k367M35P48K230J152N50J66m095r72
9498g88Q11k149j898j556M810n60j964P47J366P123J004o309k592K84L68J24M53
9481g26M2O37J906j606L39O54R53J297M73l489P2N8k466o80k38J725N095R5j456
9462B685j31m71K571k34j222p11L478n10j040m98j246J27J132J224j164l368n09
9445A13j039L52N751R38j501J817J061m68l817j844O67l64k941N78K223o36k78
9428F12L230m96L404r37l099m070O20J705Q67J465P96Q15k628n20J890K222j981
$$ y = [-69, -1643, -2054, 1211, 3321, 2487, -669, -354, 1894, 2137, 2579, 4185, 4217, 1910, 1270, 307, 491, 608, 3901, 7441, 6119, 1422, -3164, -4346, -3270, 1405, 3141, 271, -2756, -2311, 973, -808, -2278, -1093, 3666, 4740, 3088, 2094, 2456, 3755, 3900, 1365, -1002, -567, 181, 2411, 3563, 4113, 4279, 184, -788, 23, -2126, -4024, -5580, -770, -1330, -3294, -2547, -1181, 5942, 6946, 637, -1955, -1671, -1303, -1179, -726, -684, -47, 1859, 253, 592, 1246, 2199, 3496, 3969, 480, 552, 610, -1856, -2536, -2774, -1049, 4046, 4141, 2685, 2554, 2083, 4654, 4420, 3198, 2487, 5965, 5455, 4415, 3917, 2671, 2798, 3930, 5154, 3990, 622, 113, -926, -574, 5177, 6115, 4614, 6431, 7492, 7024, 3207, 1363, 2030, 1666, -1275, -697, 1526, 890, 612, 3842, 3346, 6750, 5813, 2714, -1356, -736, 969, 1836, 3301, 4097, 4912, 2284, 1764, 3654, 5876, 3895]
9411C895K974L61L80K277o01J802J25k27k867m080j074M7j461L32J602J544j971
9394C058J325n61L361O43l225q59N03l227m089q90R21L799J644m81K69J965k503
9377A653m469J163l17k369J591J708k82o4P08N47K021K548K447K342l40j933q28
9360F126p99j526k650K726J143l579l973l325K142L450l72P32l418L529J151r83
9344C74L416N066M285j968m125L85K271J650r01k139r79J224k925J353K090K75
9328I352o33l557k368L975L959N78J14K105P41O24j093m641j242J185m51n64q70
9311G214J154L060K007j949l175K252L625K93j808M284K880J01J390k831J05j111
9295A7491j926m30K785L460K789L705j547l299K133P43J573O77K556O4J600j416
$$ y = [3895, 6869, 7230, 7610, 9887, 9286, 11088, 11213, 10986, 8119, 4039, 2965, 3012, 1551, 1883, 3485, 5029, 3058, 4383, 3822, 7183, 7826, 4601, 3742, 4245, 1018, -3071, -3961, -3040, 759, 2403, 1922, 2191, 4156, 1653, -2816, -1653, -1970, -4339, -2748, -1040, -1322, -1386, -678, -131, 1890, 4438, 6885, 9227, 8887, 6954, 6126, 5327, 3801, 1151, 3877, 5020, 1441, -2532, -5857, -3715, -265, -637, 95, -3323, 206, 1357, 374, 3790, 8856, 13141, 11173, 7048, 7433, 9704, 11354, 10453, 8314, 7335, 8559, 5634, 6987, 9077, 9352, 8719, 5162, 2794, 6769, 10728, 11306, 11420, 13525, 14266, 14890, 13797, 9156, 7914, 9099, 8648, 8084, 7214, 8368, 11428, 13435, 11486, 8311, 10563, 14188, 14481, 12673, 16957, 19837, 19938, 21328, 18497, 18602, 17491, 15565, 15135, 17920, 21380, 24169, 27874, 26327, 23028, 25161, 25904, 27477, 28154, 30710, 30774, 32374, 30958]
9279C0958J094P72m14N138M201k66O60N12L206N835M424N281O160N686R084J2539
9263I4870J3332J7017K2773K6697L6049M1728N3645P5885J05571J44837K05272
9252H37676K73250L12654K47879M8083j64109k74831k78150k30692j73612j27877
9242D70271q8677o8960m8875l4357l2033k8687j8021j5516j3485j0466r341n933
9230I5920q038j1559j0200n973m230m03J65l44q36m387m878j906J055N51n588
9215C9349m266q5J658j732j857j347J444J103j979J372L58J136k254l69Q59j263
9199C2127J592K42m646L345K609o4l902j632k725l923j461J343J87R49k118l360
9183A8563n402M76q68N43K226J296P178L779j358m440R34r92j925j939j06J004
$$ y = [30958, 32052, 32824, 32410, 37548, 41749, 41483, 42143, 42655, 45861, 51696, 56120, 61401, 67561, 73247, 82331, 94870, 108202, 125219, 147992, 174689, 210738, 252466, 306111, 381996, 487567, 632404, 837676, 1110926, 1423580, 1671459, 1719542, 1555433, 1280602, 1002452, 771760, 598148, 470271, 381594, 312634, 263759, 229402, 197369, 168682, 150661, 135145, 121660, 111194, 101853, 95920, 87882, 76323, 66123, 60150, 55920, 55517, 55682, 55338, 54502, 50115, 45237, 43331, 44386, 44937, 39349, 35083, 34998, 36656, 34924, 33067, 31720, 33164, 34267, 32288, 33660, 34018, 35154, 32900, 32531, 33390, 32127, 33719, 33961, 29315, 32660, 35269, 35205, 31303, 29671, 26946, 23023, 21562, 22905, 23092, 24041, 21923, 18563, 13161, 13637, 12769, 13312, 15538, 16834, 24012, 27791, 26433, 21993, 22927, 21935, 20010, 18071, 17965, 18969]
9167A8969K793l031j295n59j748l788l116j229k102p9J934L762R71K598K679J958
9151A8717p90J556j388j704j083j871l226K851L370K513J688l605l664Q97K244
9136A6505O059O513N117R16k178l941n602m700l585J116K090q01l71m35J629j176
9120A7156j271K146L84J10L561M872L833J253J249l10Q26L41M051J797J485l158
9104C8325j970L60J323K127l112J591O326O507Q027J3390J6419J1582R153P692
9090A17740P269J9832K8085L1990N1725P8781J07118J47747J96941K46114K71266
9079A304608K55152J96172R8333k6654j34093k14527k53939k53727k23494j79437
9069E68394j32814r3471o2949m2804l2270k6918k4523k3947j8380j6650r204j211
$$ y = [18969, 21762, 18731, 17436, 16877, 15129, 11341, 8225, 6996, 4894, 4815, 6749, 10511, 11482, 14080, 16759, 18717, 17927, 19483, 18095, 16391, 15308, 13437, 10211, 13062, 16432, 18945, 20633, 17028, 13364, 14261, 16505, 22564, 29077, 34194, 35110, 32932, 28991, 23389, 18689, 15104, 16220, 18310, 17509, 17138, 16703, 18332, 17156, 15885, 18031, 18415, 18525, 22086, 26958, 30791, 32044, 33293, 32983, 33809, 34150, 38201, 39998, 41483, 38325, 36355, 36715, 38038, 40165, 37053, 38644, 44970, 51477, 59504, 72894, 89313, 100895, 110048, 117740, 125009, 144841, 172926, 204916, 256641, 335422, 442540, 590287, 787228, 1033342, 1304608, 1559760, 1755932, 1854265, 1827611, 1693518, 1478991, 1225052, 971325, 747831, 568394, 435580, 342109, 279160, 236356, 204086, 177168, 152645, 128698, 110318, 93668, 84464, 83253]
9057H3253M80j754j281k031k581l660l565n836q072j1213q535n695k935m88k357
9042B3730n485J750j32l406k860m066m040n32N010J061N12J049J192j98p53J853
9026A4685m29J41J889p66m353L099J25l092j959l664j794M013M52l465L649q89
9010G642j552j544k374K911k799j670l336l142J420j274l088K281L156j133j382
8995e884N40P3j532m035j0725j0100J1840L0826K5757K9515L5618K8982P852j7673
8981A21054j5583p408n218n636J055l127n546n533l428o635o700m739l239j343
8967D7974K466K550L42K728J555k084k29J511J164R43L074K33k609K427J842q52
8951F3035m926o441M706J7031K5197K1870J4226J5111L296r300j7575j7105l443
$$ y = [83253, 83733, 81979, 80698, 78667, 76086, 72426, 68861, 63025, 54953, 43740, 35205, 29510, 26575, 26087, 23730, 18245, 19995, 19863, 16457, 13597, 9531, 5491, 4959, 9969, 11030, 11542, 12591, 13783, 13585, 12832, 14685, 14256, 14397, 16286, 15520, 11167, 14266, 14391, 11299, 9340, 5676, 3882, 7895, 8347, 4882, 8531, 7642, 6090, 4546, 2172, 5083, 2284, 614, -2722, -5864, -4444, -5718, -8806, -6525, -3369, -4502, -5884, -5344, -5271, -6803, -10838, -21563, -31663, -19823, 11003, 36760, 66275, 101893, 130875, 138727, 121054, 105471, 98063, 92845, 87209, 88264, 85137, 79591, 74058, 70630, 63995, 57295, 52556, 49317, 47974, 50440, 52990, 53332, 56060, 57615, 55531, 55302, 56813, 57977, 58920, 61994, 62227, 59618, 62045, 63887, 63035, 58109, 51668, 56374, 73405, 98602, 120472, 134698, 149809, 153105, 143805, 126230, 109125, 105682]
8938A05682J2979K6453K4291J8143q628l6460l6188k1192L128K5749L9802J8494
8926A72253k492k0069k3919o794K386j5657k0144j8113j0253j0804o817n757q034
8913B5786j2310q918l089m482N69M370K612l661p539m943K042J1267P537J702
8899A0943J706L105J680M563J3813J7535J4516J0943J0682M191O243J3171R125
8886A22216P132J3545J5286J032j4066j9261l3363n2102m0962k2987k3955r776
8874e7261J2055J9503K3419K4175m214j5926p0R507P831J1125O182K727M237M122
8860D7412L130Q925J4461J1423P776K032J953M330J116o590j3979o765O014R671
8846I0909O822N552P37n144r398q177r145o040l320R807L0810N1842P8561R0015
$$ y = [105682, 118661, 145114, 169405, 187548, 178920, 142460, 106272, 85080, 88208, 113957, 153759, 172253, 169761, 149692, 125773, 118979, 121365, 105708, 85564, 67451, 57198, 46394, 39577, 33820, 25786, 13476, 4558, 1469, -3013, -2444, 1926, 4538, 877, -6662, -11605, -9563, 1704, 9241, 10943, 12649, 15754, 17434, 21997, 35810, 53345, 67861, 78804, 89486, 93677, 99920, 113091, 122216, 129348, 142893, 158179, 159211, 145145, 125884, 92521, 40419, -543, -23530, -47485, -57261, -45206, -25703, -2284, 21891, 17677, 1751, 1681, 11188, 19019, 30144, 36326, 39053, 43290, 47412, 50542, 59467, 73928, 85351, 93127, 95159, 97112, 101442, 102558, 95968, 81989, 75224, 81238, 90909, 97731, 103283, 104020, 98876, 89478, 81301, 72156, 66116, 62796, 72603, 103413, 155255, 233816, 323831]
8832C23831R7739J21597J54118R8158m3252j12897r7662m8054J591N8699J12947
8821F66815P6673l6104r9850q8643l6832j0447j8612l9990k1124l702k4665j7464
8809C46055J1804L0793M8590M9391Q067m5326p2826o5920m2851k4402j3273r899
8797B20203J18n08j035L012j466k197j508l28n443l45J1786J2321J3441J0872
8783B58923o17K048J3430J4113O441m084p922p517Q06Q665Q914J3000J9760J6194
8769C42154J7257K1415K1219K4429J7483P442L983N269M89l359j0012l851N849
8756D49767K0093K9203L1499K4140K120j0973j6406j6114j3929r327J243J4138
8744E05454K4855L1300L2703L3183L2843L9665N2139M4971L1364K4832K1825K0356
$$ y = [323831, 421570, 543167, 697285, 795443, 752191, 639294, 541632, 493578, 495169, 553868, 666815, 743488, 707384, 607534, 518891, 482059, 471612, 453000, 413010, 391886, 388184, 363519, 346055, 357859, 388652, 437242, 486633, 494700, 449374, 376548, 310628, 267777, 243375, 230102, 220203, 220321, 219813, 218778, 221790, 220324, 218127, 216619, 216291, 210848, 210503, 222289, 234610, 248051, 258923, 258306, 260354, 273784, 287897, 294338, 290254, 282332, 274815, 275621, 284286, 293200, 306200, 325960, 342154, 359411, 380826, 402045, 426474, 443957, 451399, 455382, 460651, 461140, 457781, 447769, 443918, 449767, 469860, 499063, 530562, 554702, 556822, 545849, 529443, 513329, 499400, 490073, 491316, 505454, 530309, 561609, 594312, 627495, 660338, 700003, 752142, 797113, 828477, 853309, 875134, 895490]
8732H95490K9450K6719K1100K8444N1121O4250N8235O1788O4902O7830P6742Q0997
8720A527068Q0482Q7225Q9941R7883J09264J31611J59235J90074K34325K49549
8710B956657K31939K66331L58778M10082M12436L94806M06674M83888O26064Q70421
8700G418076J157269J438242J699714K029850K439311K940356L341860K880808
8692B5345486K244994J880993K684790M676805P763793J1849704J7536609K6249079
8684A00232253M0594676O5485031J06816018J35705001O0296197n2563111j04604164
8677C51961901j08419662p7005963m7104762k9289728j9463520j3828741r990803
8670D6858722p017294m660247k584307j081143j733002l051557l578465l448720
$$ y = [895490, 924940, 951659, 972759, 1001203, 1052324, 1116574, 1174809, 1236597, 1301499, 1369329, 1446071, 1527068, 1607550, 1694775, 1784716, 1882599, 1991863, 2123474, 2282709, 2472783, 2707108, 2956657, 3188596, 3454927, 3813705, 4223787, 4636223, 5031029, 5437703, 5921591, 6547655, 7418076, 8575345, 10013587, 11713301, 13743151, 16182462, 19122818, 22464678, 25345486, 27590480, 29471473, 32156263, 36833068, 44596861, 56446565, 73983174, 100232253, 140826929, 206311960, 313127978, 448832979, 509129176, 456566065, 351961901, 243542239, 166536276, 119431514, 90141786, 70678266, 56849525, 46858722, 39841428, 35181181, 32596874, 31515731, 29782729, 26731172, 23152707, 19703987]
8662A9703987k961555k454669j952396j542326j277573j091321r22344p76368
8654F725435o38353m82560l81679l46761l21175l03457k78286k26903j89523j91075
8644C365663j96584j83049j56718j40379j28702j21757j23205j29124j18728j06834
8634A960583r5836q4271p2520o7282p7536q0914p0325n9588n8748o2121n7413
8623A174029m8660l6262k4210j8505j8996k0283p234j1222j9813k8425l2672m1378
8611H66369m9852n0169n1199m3682l2753j7479K325R532Q28o384q252n274j604
8598F12406N243o55j6534k6781k9978k3206j9725j0699n423m558k921m524o009
8585D66636r608j8559k0802j7375j5832n416j797n627k793l331q38R29N645N202
$$ y = [19703987, 16742432, 14287763, 12335367, 10793041, 9515468, 8424147, 7501803, 6725435, 6087082, 5604522, 5222843, 4876082, 4554907, 4251450, 3973164, 3746261, 3556738, 3365663, 3169079, 2986030, 2829312, 2688933, 2560231, 2438474, 2315269, 2186145, 2067417, 1960583, 1864747, 1780476, 1707956, 1640674, 1563138, 1482224, 1411899, 1352311, 1293563, 1231442, 1174029, 1125369, 1089107, 1064897, 1046392, 1027396, 1007113, 999879, 988657, 968844, 940419, 907747, 866369, 816517, 766348, 715149, 671467, 638714, 621235, 623560, 633092, 633920, 627536, 619284, 614010, 612406, 617649, 616994, 600460, 573679, 543701, 520495, 500770, 490071, 484648, 480090, 477169, 472645, 466636, 457028, 438469, 417667, 400292, 384460, 379044, 377247, 371620, 368827, 365496, 364658, 365587, 371232, 376434]
8571C76434j695j0229j1538o481J881J883J504K530J3210K6658L3469J3545k8846
8558D12325m7330l4347j3642O61K8985N2790M8281J3670l0695m2821m1503m9780
8546B96594o0176n1484l5878j5771j0402j2768m555M743N637J851l426o345k787
8533A05233j0398j6637j8285j2228o622J1989K9611M7239N5481N5289L5672P283
8521B83627j4638j9251j3978j5986j9244j2472r125m266K922J0672L541m426m261
8508A83115r561j3325n491j188n268m515N125Q213N832P24P595L594o72M219Q806
8493A87203N234P641m163j1055L72O326P158K1426K2648l881j6114k6712m5337
8480A50746m8055m0360k6666j4099j884O481J1802J1295R287O207M620O562N366
$$ y = [376434, 374739, 364510, 352972, 346491, 348372, 350255, 351759, 354289, 367499, 394157, 427626, 441171, 412325, 364995, 330648, 317006, 317667, 346652, 399442, 447723, 461393, 430698, 387877, 346374, 296594, 236418, 184934, 149056, 133285, 122883, 110115, 105560, 110303, 115940, 117791, 114365, 108020, 105233, 94835, 78198, 59913, 47685, 41063, 53052, 82663, 129902, 185383, 240672, 276344, 283627, 268989, 249738, 235760, 219774, 200530, 188058, 178933, 174667, 177589, 188261, 191802, 187376, 183115, 173554, 160229, 154738, 153550, 148282, 143767, 148892, 157105, 162937, 163661, 171256, 174850, 174178, 178397, 187203, 192437, 200078, 195915, 184860, 185232, 191558, 198716, 220142, 242790, 238909, 222795, 196083, 150746, 102691, 62331, 35665, 21566, 19682, 26163, 37965, 49260, 58547, 64754, 69374, 75936, 81302]
8467H1302O652J0534J8667J4406N223J901M933j974j523R178R535K421l764m996
8453A52495m885k091J20Q47K762o12o231j0845q884j137m615r535q568m641J590
8438I5770P749N977M694R39k620k155K931J953o112k577m306m611m413l315o36
8423H9268P702R229J165j0257j6266j3635p595L906J1695J1404O73j672K013K119
8409H9749j517p900m353n100r305q194m225q96k247J240M585J450k727j885J720
8394E0395r64k736m042J935r93n929q314m567n024m341k766k465k776k424o548
8379a559n071l800j9931j3109K6443L9058J8014Q947J9411K4546O012m895j728
8366I2338l645n344k566L188J751l25K862K96k115q54k229j39r71j193l183k095
$$ y = [81302, 87954, 98488, 117155, 131561, 136784, 138685, 143618, 141644, 140121, 149299, 158834, 161255, 157491, 152495, 147610, 145519, 145639, 146486, 149248, 148636, 142405, 131560, 122676, 121539, 116924, 107389, 98821, 94180, 95770, 103519, 109496, 114190, 115129, 112509, 110354, 113285, 115238, 109126, 106549, 102243, 97632, 93219, 89904, 89268, 96970, 106199, 107364, 97107, 80841, 67206, 59611, 63517, 75212, 86616, 87289, 85617, 87630, 89749, 88232, 80332, 75979, 70879, 61574, 53380, 49155, 48259, 46012, 47252, 51837, 53287, 50560, 48675, 50395, 49431, 46695, 42653, 44588, 43595, 37666, 29352, 24785, 19761, 15420, 12654, 10189, 7413, 4989, -1559, -6630, -10430, -30361, -43470, -17027, 22031, 40045, 48992, 68403, 92949, 98961, 94066, 92338, 88693, 83349, 80783, 83971, 85722, 85397, 88259, 88555, 86440, 85586, 83357, 83218, 82247, 81054, 77871, 75776]
8350G5776j416j846k456Q55k185L44K447K302r2j725l667q91l34j600j824k683
8334F1005j289j773K435N04L386q55k266m90J872J249j520m402j223k530J446
8319E5549J851k068M19J700n14L126K071j457o185o485m766k323K939M340N200
8304E3397N536O610J0194R128P081R221P484L875L05j601P902J6378J3557J4367
8290A63434J2141J5991K3924L9066N9882Q6595J29032J69684K13702K57768K70937
8279A442156K32818J61541M6470p0609j74000k44541k56988k40000k03347j55328
8269E38172j11655q0997n6560l6550k6469k0622j4778j5129j5373j6617j7439
8258A25983j4250j2571j2588p946o806n649n083j273k542n783l393l13K380J601
$$ y = [75776, 74360, 72514, 70058, 70913, 68728, 69072, 71519, 73821, 73729, 72004, 68337, 67446, 67112, 65512, 63688, 61005, 59716, 57943, 60378, 60882, 64268, 63413, 61147, 60657, 62529, 63778, 62258, 57856, 56633, 54103, 55549, 57400, 55332, 55751, 57451, 56937, 60063, 62134, 60677, 54492, 48007, 43241, 40918, 43857, 48197, 53397, 58933, 65543, 75737, 84865, 91946, 101167, 108651, 112526, 112831, 111230, 119132, 135510, 149067, 163434, 175575, 191566, 215490, 254556, 314438, 401033, 530065, 699749, 913451, 1171219, 1442156, 1674974, 1836515, 1882985, 1812376, 1638376, 1393835, 1136847, 896847, 693500, 538172, 426517, 345520, 288960, 252410, 225941, 205319, 190541, 175412, 160039, 143422, 125983, 111733, 99162, 86574, 78628, 71822, 66173, 61090, 59817, 57275, 51492, 48099, 47786, 50166, 51767]
8244E1767k094k384k053N42o16j680N71J466k267j33k943k456J003j929l525m988
8228B8281n740k220k5k61P408J0095L559k076J866L08m836o90N834K904o63l162
8212D0582n532k617J144P99L975J753K185J779j168p01O13m519l680l305j579
8197B9729j319N093J152R17j689l436m091jj57j956K757j808n805j328K083L439
8181B3580K455J821N724L345n045k469J63l01m13N018J587j094l033m613j555
8166B5170j568k91l04K755m42n58L077m244P91N61k082o62J416J708j814j204
8150B2309mk870j945o01j746n17R46j379m354k948j344L554J639J01K369M889
8134A8099K778R3j993l164R20M294M488J731l029j507m412J018J39l970k531r16
$$ y = [51767, 49673, 47289, 45236, 45778, 45162, 43482, 44053, 45519, 43252, 43119, 40176, 37720, 38723, 36794, 33269, 28281, 22541, 20321, 20296, 20035, 27443, 37538, 41097, 39021, 40887, 41195, 36359, 35669, 41503, 44407, 43744, 40582, 35050, 32433, 33577, 34376, 38351, 40104, 42289, 44068, 42900, 42199, 42812, 38293, 34613, 31308, 29729, 28410, 33503, 34655, 35572, 33883, 30447, 26356, 26355, 26198, 24242, 26999, 25191, 19386, 18058, 20141, 23580, 26035, 27856, 33580, 36925, 31880, 29411, 29574, 29273, 28860, 33878, 35465, 34371, 31338, 26725, 25170, 23602, 23311, 23007, 25762, 25320, 24762, 27839, 23595, 24386, 24947, 22865, 22203, 23619, 25327, 23513, 22309, 22305, 19435, 17490, 16889, 15143, 14626, 15572, 14193, 9839, 6891, 5547, 9101, 10740, 10841, 13210, 18099, 20877, 20970, 18977, 15813, 16733, 21027, 25515, 27246, 24217, 22710, 18298, 19316, 19455, 15485, 12954, 12038]
8118A2038k88P3J043K142M49O9j52K74j203k655J968j866Q7K435R1K29L889j252
8100A7371n467J007j248l829K55L775L443M368J417N39k319K942j56k500k49L656
8084B3005k063l107j969J710q39j18o70Q49o82m35L600K900j232m688m849j454
8068I958n97N827L842L15q77n667n094K088K176J615L517K118p37L613Q602M692
8052C5391O534J0348M900L18o288n931j1543r370n674J16J781R98k212m434Q59
8037A5793J771L797J781p54k428j499j487l03K355j67J155K478J503O95o37K60
8021B4313r68k309j687j208J771L874K374J127R38L114K296K150J810N707O759
8006E0061J5980K3782K2869N084q154j9805j8501j6003j0952r508l233k10l90
$$ y = [12038, 11750, 11823, 12866, 15008, 15457, 15526, 15374, 15648, 14445, 11790, 13758, 11892, 11979, 14414, 14505, 14734, 18623, 17371, 11904, 12911, 11663, 7834, 8089, 11864, 15307, 19675, 21092, 21631, 19312, 22254, 22098, 19598, 19349, 23005, 20942, 17835, 15866, 17576, 16737, 16619, 15949, 16798, 16116, 15681, 19281, 22181, 20949, 16261, 11412, 9958, 9361, 15188, 19030, 19345, 18468, 12801, 7707, 9795, 11971, 13586, 17103, 19221, 18484, 22097, 30699, 35391, 41925, 52273, 57173, 57491, 51203, 45272, 33729, 24359, 18685, 18801, 20582, 21580, 19368, 14934, 15793, 17564, 21361, 23142, 22388, 19960, 18461, 16974, 16671, 19026, 18859, 20014, 22492, 23995, 24690, 24053, 24313, 23345, 21036, 19349, 18141, 19912, 23786, 26160, 27287, 28225, 31339, 33635, 35785, 37595, 43302, 50061, 66041, 89823, 112692, 117776, 109622, 89817, 71316, 55313, 44361, 34853, 31620, 31410, 31020]
7993C1020J742r80j061l036k152j314K723m61r82k122j410J202M941J001l87j126
7977B7598J899l536l711j938J06J287J376n94k6L34L76q02M94M224Q62l555J629
7960B6023N528P437Q060P854J809j39o511r740n230l354k375P04j220l462L5p
7944B5412m428O2K178j639k696j752j242L425R50l023l98p28K529J89l562j444
7928A3833k839j261J305J14J998M250R13k420j163j642j44J590L096j224m106
7913A2300l608O60nL35K143K964K318r47q62P67j18k613k9J208L84k103m993k936
7895D865J344k601k689M72K338K59J755P60J517K342M193r93P28L67k778J949
7879A3828J632N17j795n9L955J394k130n082m467P96K613n136R2J135k295r22
$$ y = [31020, 32762, 31782, 30721, 27685, 25533, 24219, 26942, 26481, 25499, 23377, 21967, 23169, 28110, 29111, 28724, 27598, 29497, 25961, 22250, 20312, 20418, 21705, 23081, 22487, 22461, 22795, 23171, 22369, 22863, 27087, 27949, 24394, 26023, 31551, 38988, 47048, 54902, 56711, 56572, 50061, 40321, 35091, 31737, 29362, 30066, 28846, 25384, 25419, 25412, 20984, 21046, 23224, 21585, 18889, 17137, 15895, 19320, 20270, 17247, 16849, 16121, 18650, 18839, 15277, 13833, 10994, 9733, 11038, 11152, 13150, 17400, 18313, 15893, 14730, 13088, 12944, 14534, 17630, 16406, 12300, 8692, 9352, 9347, 9682, 11825, 14789, 17107, 16160, 15298, 16065, 15947, 13334, 13305, 14513, 14897, 12794, 7801, 4865, 6209, 3608, 919, 1391, 3729, 3988, 5743, 6503, 8020, 10362, 14555, 13562, 14290, 14657, 11879, 13828, 15460, 15977, 14182, 14123, 18078, 19472, 17342, 12260, 7793, 8589, 11202, 6066, 6158, 7293, 4998, 4076]
7863D076L622Q37m55m92k47M56l250k194K603L662L894K70l698l393J489K433
7847I613P80J06j709k286M30K23j372o59J532L986K138n94n32k23j678N10J174
7830A1439O24j847k891j283L019l6l709q82K564J230j812k000J395J962o84l38
7814F751j278K719J686j072l701j938J507O574N309q26k809l351l561l19K615
7799H306Q09J033j896k23n98r78J484o45M64J739j812j960j820O95j8o01k19J525
7781E285K122m82j166k085J016j24j530r5J868PJ141L31O03j043O65J520k849
7764E184j26q80n12M501k174m16K10j968l176p14l48J754M617J983P46K28K0j788
7746G141N95J409l144n240N31M135R40j440j367N52j015j263j215K948K51K4K71
$$ y = [4076, 7698, 8535, 8080, 7588, 7341, 7797, 4547, 2353, 4956, 8618, 12512, 12782, 9084, 5691, 7180, 9613, 10393, 10499, 8790, 6504, 6934, 7157, 5785, 5126, 6658, 10644, 12782, 12188, 11656, 11433, 9755, 10265, 11439, 12063, 10216, 7325, 6042, 9061, 9025, 5316, 4434, 6998, 8228, 6416, 4416, 5811, 7773, 7089, 6751, 5473, 8192, 9878, 8806, 5105, 3167, 4674, 11248, 16557, 15731, 12922, 9571, 6010, 5691, 8306, 9115, 10148, 8252, 8029, 7431, 6453, 7937, 7292, 7756, 9495, 7683, 5723, 3903, 4598, 4580, 3979, 3760, 5285, 7407, 6925, 5759, 3674, 4690, 4566, 3036, 2941, 4809, 4816, 5957, 6288, 6891, 5848, 6513, 8033, 5184, 5058, 4178, 3666, 8167, 5993, 5577, 5787, 3819, 643, -71, -419, 1335, 5952, 7935, 8681, 8909, 8929, 7141, 7736, 9145, 6001, 761, 1292, 5427, 6367, 4927, 3560, 4112, 3097, 1834, 619, 3567, 3818, 3842, 4113]
7729D113L296K988R85j784p28k522j641o1Q13O37M872K063m613k875N081J34K020
7712A2778K443j916k284k403j856j200l46J518K460J674k177J464k258j232p53
7697E912k688J000J241k718M28Q254L34P12J896K11j797l393q296l594K702J872
7681B076j478Q56k679l0L589M567L65k653N86N13K931k154j117J77j221j661P36
7664C403K295J669n2k192M63J27K684J079j895p87J687L732J330j686k643J166
7648A0380K92j49j75l664j692J202N088K173l896j411l82N73o35J879K229n49
7632A1263k728j823m89q24l799l01K513N989J745R10k932k257n00J932k977L82
7616F104j765j548J897L179q05m898l229R10Q7J972K803l71q0j009j31j241M2
$$ y = [4113, 7409, 10397, 11382, 9598, 8870, 6348, 4707, 4646, 5459, 6096, 10968, 13031, 8418, 5543, 10624, 10758, 12778, 15221, 13305, 11021, 8618, 6762, 5562, 5216, 6734, 9194, 10868, 8691, 10155, 7897, 6665, 5912, 3224, 4224, 5465, 2747, 3175, 11429, 11763, 12475, 14371, 14582, 12785, 9392, 1096, -2498, 204, 2076, 598, 1454, -1225, -1255, 2334, 6901, 7266, 4613, 5199, 5712, 8643, 6489, 5372, 5549, 4328, 2667, 3403, 5698, 7367, 7315, 5123, 5586, 5713, 8397, 9476, 7581, 6794, 8481, 12213, 13543, 11857, 9214, 10380, 10672, 10523, 10348, 6684, 4992, 6194, 11282, 13455, 9559, 8148, 7766, 8339, 7704, 9583, 11812, 11263, 8535, 6712, 6223, 5399, 1600, 1299, 3812, 9801, 11546, 12456, 9524, 7267, 6767, 8699, 5722, 6104, 4339, 2791, 4688, 7867, 7062, 2164, -1065, -155, -68, 1904, 4707, 4336, 4256, 3247, 3116, 1875, 1917]
7599A917j120J250j878k919k8K363M538q23j943k90j454K980J265j78K360K673
7583H713J06J01K02k133K46m92j315M77J51j676l489J161M072k988l30J639k115
7566B330Q20j62O59K031K725L62l530m486l756M67K856L080K016M73j464J609
7550F030J874k56j881k622J21J483j387O21j712M39K080jR72J697J337k136j580
7533E079M440k438J51O72k065j288K559K456k57Q75O58m138k16O38k059K887J265
7516I219k116m308j029J754P4O39L293j584j720j726J456M008P16J160J904k674
7500I066j277m679l138j466J271J67L078p28K796K994K286j223P72K962k216j202
7484I463q99l631J252l703q75P81j062J440K886N6p21q18j427k195j803J310K131
$$ y = [1917, 797, 2047, 169, -2750, -2778, -415, 4123, 3300, 1357, 1067, -387, 2593, 3858, 3680, 6040, 8713, 8819, 8920, 9122, 6989, 7235, 6743, 5428, 5905, 6056, 4380, 891, 2052, 6124, 3136, 2806, 4445, 2330, 3150, 2988, 3647, 5678, 8403, 8765, 5235, 749, -3007, -2540, 316, 3396, 5412, 5885, 4421, 6030, 7904, 7648, 5767, 3145, 3266, 4749, 3362, 3983, 2271, 2710, 4790, 4789, 5761, 7458, 8795, 6659, 5079, 9519, 7081, 7232, 7904, 5839, 4551, 7110, 9566, 9309, 10184, 10842, 6704, 6488, 7126, 5067, 7954, 9219, 7103, 2795, 1766, 3520, 3594, 4233, 7526, 5942, 4222, 2496, 3952, 7960, 8676, 9836, 11740, 9066, 7789, 3110, -28, -1494, -223, -56, 3022, 2294, 5090, 8084, 10370, 9147, 9919, 12881, 10665, 9463, 8564, 4933, 6185, 2482, 1607, 2388, 1326, 2766, 5652, 5708, 4987, 4169, 2742, 547, -1256, 54, 2185]
7467B185Q5M69K505k179j791J295L05q51j531K383J555m13J052j98N96M097p43
7450H821n06l415M16Q1j760K191p2Q52J476k66r3m295N9R64n30k068l288R62o83
7431a154J491P33j722p82J986K374o30k93m79j330J838j445m58J649R23q35j582
7414B84K521N076K18J460K913N09n893m656o48m57q69R74K459J039M06K660j467
7397F529J56k493j683j219K189R34M00n49o71k64R15K997Q80j215j14K018o28
7380H182l719K85N02R61l463j746Q29J629L247P03J52J975k53k375k362j740J350
7363D157j733j929k657q13K066J286J533J648J755j385k868j378J56J245J453
7348B536j138J042k506p15o33j106m23J84J008J838Q99L694K75J224k173j46K484
$$ y = [2185, 2270, 2739, 5244, 3065, 1274, 2569, 2874, 2023, 492, 2875, 4430, 4017, 5069, 4871, 5467, 9564, 8821, 8315, 4900, 5316, 5397, 3637, 5828, 5756, 6608, 8084, 7818, 7725, 3430, 3489, 4453, 3923, 1855, -1433, -471, -1154, 337, 1070, -652, -1434, 552, 2926, 2296, 2003, 1524, 194, 2032, 587, 129, 1778, 2701, 1866, 284, 2805, 7881, 8099, 9559, 12472, 12981, 7088, 2432, 1784, 1327, 458, 1432, 3891, 4930, 5336, 7996, 6529, 6685, 4192, 2509, 1290, 3479, 4413, 4813, 4264, 3593, 3329, 4244, 7241, 8121, 6906, 6792, 8810, 8182, 4463, 4748, 5250, 6211, 2748, 1002, 1831, 3460, 6707, 7410, 7562, 9537, 9284, 6909, 4547, 2807, 4157, 2424, 495, -2162, -2975, -909, 377, 1910, 3558, 5313, 3928, 1060, -318, -162, 1083, 2536, 1398, 2440, -66, -781, -1414, -2520, -2943, -2759, -1751, 87, 986, 4680, 4955, 6179, 4006, 3860, 6344]
7331F344K051M18m36j513M45M76o60m65k716l410L784L178l8k237j97j730j558
7314A736k348K106k57l905j569j2K241J616K252K618J640k296k259N18J129m42
7298B768k082Q36l58j773K33L533J881l332K537K305Q94l270j083p90j076q82
7282C41o99K110l06k407P22J649m53r62R71J084k474k05r51N65n82J304J843M216
7264E766k634j561K520L987N26j246k271l974J853N18j13J504l721n551q72K196
7248c073o75J730L088j480J726L478p96k221J46M725j81j658j400Q35P02j844
7232C102m759j196Q09J086J654L493Q27l129k796L9J802O6r4Q3R28K453J786K375
7214H529K49j977J607q56j291L03r29j680j078Q37Q97P07L783k274j557m324r75
$$ y = [6344, 8395, 8813, 8377, 6864, 7309, 7785, 7125, 6660, 3944, 534, 4318, 7496, 7458, 5221, 5024, 3294, 1736, -612, 1494, 1237, -2668, -4237, -4249, -2008, -392, 1860, 4478, 6118, 3822, 1563, 2081, 3210, 2768, 686, 1522, 1164, -609, -376, 3157, 5038, 1706, 4243, 6548, 7442, 4172, 3089, 2299, 1223, 341, -358, 1752, 1446, -961, -239, 1410, 957, -5, 966, 2050, -424, -629, -1580, -1015, -1597, -293, 1550, 5766, 3132, 1571, 4091, 8078, 8604, 7358, 5087, 1113, 2966, 3484, 3371, 4875, 1154, -4397, -5269, -3073, -3748, -2018, 1070, -410, 1316, 4794, 3998, 1777, 1923, 6648, 6467, 4809, 3409, 4244, 4946, 3102, -1657, -2853, -2044, -958, 696, 4189, 5016, 1887, -909, -870, 932, 998, 904, 987, 1915, 4368, 6154, 8529, 8778, 6801, 8408, 7552, 6261, 6564, 5635, 3955, 2877, 3714, 4611, 5318, 9101, 6827, 5270, 946, -29]
7197b9K553K392L042J299m181l856j444K326R88N81l046r47L098J706j162j499
7181A821K744j182l511J1M00J263L787m30j089q25j962m09k224K55j54L523P20
7164B738J845l88r62J421l82r11j735k163o99K228K046q75R82Q95J937p65k982
7147B230K78J832j437M03K21j387l41k100r63j469K504L756K298q27k940k2n40
7130A496o6K804Q95J003O84m267l130j203J761J322M86q30o51R55J199K098j71
7113D385l015k358Q90j57k938K583L099k294j488k708J208M49n72p76m397j065
7097i154M225M793J309J152M09r28J396J396j878k091k870K543M301J311N91r97
7081E508k726J743L855o70j740l89l50j386K12k206r76j673K936N91j220j067
$$ y = [-29, 2524, 4916, 7958, 9257, 5076, 1220, -224, 2102, 3090, 3671, 625, -322, 2776, 4482, 3320, 1821, 4565, 3383, -128, -117, 283, 1546, 5333, 4903, 3814, 2989, 1027, 618, -1606, -1351, -1505, 2018, 2738, 4583, 4195, 3233, 4654, 4272, 3361, 1626, -537, -1236, 992, 3038, 2163, 3145, 4040, 5977, 5212, 2230, 2508, 4340, 2903, 3306, 3527, 2140, 1799, -301, -1264, -2733, -229, 3527, 5825, 4998, 2058, 2036, 1496, 1430, 4234, 5129, 6132, 6816, 2549, -581, -1784, -23, 1299, 1785, 955, 304, 1259, 2458, 4556, 4385, 1370, -988, -98, -255, -3193, -610, 2489, 195, -1293, -4001, -2793, -2344, -2916, -3692, -8089, -9154, -4929, -136, 1173, 2325, 2734, 1806, 3202, 4598, 2720, 629, -2241, 302, 4603, 5914, 6505, 5508, 2782, 4525, 8380, 7710, 5970, 5581, 5231, 3845, 4057, 1851, 875, -798, 2138, 2729, 1509, 442]
7065D42k446q31K753J326R89Ql37k884j781k405oK898L796L273j703m41m550j155
7047c054K604J031L368k088M48M776J098n47r65o7k079n539r93Q53P23K225j555
7030B39k719P94J099J26J746K003J26J014O46k099k69L157R36r37m659k863j027
7013b687K22R89K092K274M7L46l046Q14J509l8o80l712J721J016k03l192l035
6996e563m80J264M281J063j508k355J205N14j215L702Q22J170J601L12j607k45
6980B961j509j095J198Q43l54k043k541j126J682J407k60r67l13J684Q76j114
6964f71L58Q01L935J87m827l41n25l451j493K934J888r69M108J269K967l74j747
6947D049P13L651q31l814l107p96j811k402J975J372N92j2R31m152k650K388J775
$$ y = [442, -2004, -2835, -82, 1244, 2233, 2241, 1904, -980, -2761, -5166, -5172, -2274, 1522, 4795, 3092, 2651, -1899, -3054, -450, 581, 3949, 1861, 2309, 7085, 8183, 7636, 6671, 6604, 4525, -1014, -2007, -1154, -431, 1794, 239, -2480, -1686, -587, -461, 1285, 3288, 3414, 4428, 5074, 2975, 2706, 5863, 6799, 5862, 1203, -1660, -2687, -2465, -1476, 616, 2890, 2937, 3283, 237, 1051, 2560, 2522, 1842, -1870, -149, 867, 664, -2528, -5563, -6043, -4779, -498, 565, -943, -3298, -2093, -1579, -2794, 908, 1730, 2900, 4501, 4813, 3206, 2961, 1452, 357, 1555, 2398, 2044, 1, -2540, -3666, -1984, -577, -837, -1804, -2117, -433, 443, -671, -313, 488, 4423, 4610, -217, -558, -1083, -4534, -6027, -3093, -1205, -2174, 1934, 3203, 6170, 5796, 4049, 4762, 8413, 7582, 3768, 661, -135, -1946, -4348, -2373, -1001, -409, -421, 510, -3642, -6292, -3904, -2129]
6930b129J960j024r73m4L192K511k360k809J159J559j570k171K25J282K261j1
6914A058j087o93L60K41K558J555j461n45K177J870m124m937n513P04J703P03
6898e431J653K804J195k530k036J611N37n09p68Q55J272L915K717j236pn70j418
6881B054o21l84Mj745j353m53Q6K240J64k821P39L739J038M84J399j591N00l45
6863C134K55j9k336o024j89K985Q4J791J099K468l39P78k868n74K225K672j134
6846D008j680P30J444j769l680o62J690L43n76m07N307q59k035l67J436J212k745
6829A390l108k729L046K552j882M35J165R22J252J061p10q62P09j761j306O76
6813H50L000K436L70j910l524J900L457l238k555j960J102K540L099j307m813
$$ y = [-2129, -169, -1193, -2166, -2210, 982, 3493, 1133, -1676, -517, 1042, -528, -2699, -2474, -1192, 1069, 1058, -29, -722, -362, -121, 2437, 3992, 2531, 1986, 4163, 6033, 1909, -3028, -8541, -7837, -6134, -5431, -3778, -974, 221, -2309, -4345, -2734, -2197, -2706, -3474, -2619, -1347, 2568, 5285, 4049, 4042, 3472, 2054, 1433, 1049, 1053, -692, -2045, -2498, -2412, -172, -8, -2829, -2090, 1649, 2687, 3171, 4570, 2979, 3479, 3134, 3389, 3370, 1034, -4990, -5179, -2194, -2110, -319, 780, 3248, 2909, 3687, 819, 245, 2470, 5142, 4008, 2328, 3058, 4502, 2733, -947, -1609, 81, 424, -152, -559, 4748, 3889, 1854, 1487, 2923, 4135, 1390, -1718, -4447, -1401, 1151, -731, -296, 869, 1791, 3043, 4104, 3394, 2532, 3241, 1480, 174, 850, 3850, 6286, 6656, 4746, 1222, 3122, 6579, 3341, 786, -1174, -72, 2468, 5567, 4260, -553]
6798e53k068q62J131K679p58k351J72J511J983K351J216K569m68n22R56k084J85
6781E087R84j038k060N29l022j665J506K850l36n25J942j579k065k535k199o35
6765d761J832O898K930j295m780q44P84J706L64j229O57L388k69j926j284K245
6749D416k059m02J649J43j065m089J05J458J960J050m40j224k554j438J029j36
6733a597j10L28L689L869j428k171l159j637J432M374L54j893l645R26M264r19
6717B677m22M75l185l103p78nK095l05J430O00P91l083k615J644N52P01L545Q19
6699A833Q96j821L035K645j574r15M34j363j545r90o5j399J73O8J014k82J13L94
6681F51q94j745O74P64J444k02j656l295j501L26K045L036p74r48K85R88J123
$$ y = [-553, -2621, -3483, -2352, 327, -431, -2782, -2610, -1099, 884, 3235, 4451, 7020, 6552, 6030, 6986, 4902, 5087, 6071, 5033, 2973, 3502, 480, -1185, 321, 3171, 2835, 2310, 4252, 2673, 608, -1927, -4126, -4761, -2929, 3969, 6899, 5604, 824, -20, 764, 2470, 2834, 1605, 2262, 5650, 5381, 3455, 2171, 4416, 2357, 1955, 3604, 3747, 2682, -1407, -1302, 156, 2116, 3166, 2726, 1502, -1052, -2490, -1461, -1597, -1707, -1379, 2310, 6179, 4751, 2580, -579, -2216, -784, 3590, 3944, 2051, -1594, -668, 3596, 2677, 2255, 2730, -455, -3558, -4336, -4341, -2246, -2551, -1121, -521, 270, -2813, -5428, -3784, -3232, -2531, 1014, 1833, 2729, 908, 3943, 6588, 5014, 4099, 4533, 3170, 1625, 635, 570, -829, -656, -588, 426, 144, 257, 651, -243, -1988, -1314, -550, 894, 692, -964, -4259, -5760, -5434, -3389, -353, -1127, -2075, -1790, -802, 321]
6664C21j975q38j059m60K776j782j646M38L702J014L07L226Q07j953k414j153
6648f89r99J844K583K00l58l42j39J196j86l336K635k460l47J590o77R06L541
6631D962M568k025j963l040P28K33j085l917K006K922J50r60K298l90n26m306
6615c45j614L369M495j511j806j10l668l050J41L659j78k625J961K999M877j615
6599D979p32L59j05Q92m114l744j635K69J827M89j688m83j606Q58K792K118Q48
6582A324K212O58J203O03k541k860J498k499o95J264J807m06R39L89j867J324
6566B353k919k859J346K604j01M11K334n61r04k371J12k228j34J967j44n00J783
6549A89L75P42j516k194L665O15j089o34o73j35j743k11J301n46O11K366K129
$$ y = [321, -1654, -2492, -3551, -4011, -1235, -3017, -4663, -4225, -523, 491, 798, 4024, 4831, 2878, 464, -689, -1688, 156, 2739, 2939, 2581, 2239, 2100, 3296, 3110, -226, 2409, -51, -398, 1192, 515, 1421, 4962, 9530, 7505, 5542, 2502, 3230, 3463, 2378, -1539, 467, 3389, 3539, 2579, 4877, 4487, 3961, -345, -1959, 1410, 5905, 4394, 2588, 2478, -1190, -4240, -4099, -440, -618, -3243, -1282, 1717, 6594, 4979, 4247, 4606, 4501, 5393, 1279, -2465, -4100, -3831, -2004, -1515, -3203, -3686, -5292, -4434, -1642, 476, 1324, 3536, 4194, 5397, 6000, 3459, 599, 2097, -402, -1097, 167, 1974, 1568, 2507, 2896, 1029, 2353, -566, -3425, -2079, 525, 424, 835, 3169, 2608, 1704, -667, -555, -2783, -2917, -950, -1094, -1594, 189, 564, 1306, -210, -2404, 1261, 1876, 787, 153, -520, -655, -2398, -2609, -1308, -1854, -1243, 1123, 3252]
6532C252m25j694J776P07K681O44j562j944qK281J318k553k626k760j146J265
6516g94P5k814q87L659K570j170o14j156P13J509N2J390L059j538k330j722K99
6499C01p2O05J195J610P70j802j209j500K2Q61J497L07J041j275l012l581L807
6482d35L038j339j114L8J231J520K033k507k308pk127J452K968j851N72J60J879
6465C203N0j331k765o00Q19N72j800J80L792N17r92j458L836J664j108o290Q0
6448a631J793K846l446m3N822J746k692o8J601j328p4l237j727L20j896j06k171
6431d291n83p36l357L929N385N090j960n021q07j91P93l511k613K709J359J932
6415a873k999j332J587J173j95L90K197L867J571L695K013l022m129m477j371
$$ y = [3252, 2827, 1133, 2909, 3616, 6297, 6941, 5379, 3435, 3427, 5708, 7026, 4473, 1847, -913, -2059, -794, -719, -3533, -4420, -761, 1809, 639, 25, -1131, -418, 1091, 1143, 2533, 5592, 4054, 1724, 2, 301, 229, 834, 2029, 3639, 4409, 2607, 1398, -102, -80, 781, 2278, 2585, 3626, 2351, -661, -4242, -435, 2603, 1264, 150, 188, 1419, 2939, 4972, 2465, 157, 150, -1977, -525, 2443, 592, 1164, 1324, 3203, 3253, 1922, -843, -1443, -624, -52, -1852, -1672, 2120, 2637, 1645, 187, 4023, 5687, 4579, -1711, -1631, 162, 3008, -438, -481, 5341, 7087, 4395, 4327, 5928, 4600, 4526, 1289, -438, -118, -2014, -2120, -4291, -4874, -5610, -8967, -5038, 347, 5437, 3477, -1544, -2351, -2542, -1749, -5260, -7873, -5164, -3805, -1873, -4872, -6204, -4617, -3444, -3639, -3249, -1052, 2815, 4386, 8081, 10094, 7072, 2943, -1534, -2905]
6400b905J817N23K468J007j601L246O1k243o311k632N47J243M978K602J50R05
6384C855k002k303k183K776K766J523r5o94L02j492j267K293n0r85k079l868j047
6367d550K474J617p44R43q55K277L010J08k27K276r78k157Q64k966m432n37MK74
6349c599J803K143J314l245o18q21m86J547J561N333j484J42p7M03j790l950k937
6332d761k955R73L947L406J706j57P50K313J826n91m751K51Q96n735k170K448
6316b604L132j368k930K42J544r30J93K571J604J517O63m51K83r21m50l954j120
6299b979J815K950N81m09j003j084O18J258M46N58m89m049J886J315l780j875
6283d241q96N315K620J544n81k983j465P65J968N3j529Q64j906j33K639o2K663
$$ y = [-2905, -1088, -565, 1903, 2910, 1309, 4555, 4616, 2373, -3938, -6570, -6023, -4780, 198, 2800, 2950, 3855, 1853, -450, -2633, 143, 2909, 4432, 4337, 3643, 3945, 2453, 1186, 3479, 3429, 2444, 365, -3503, -4550, -2076, -459, -1203, -260, -1115, 1162, 4172, 4280, 4053, 6329, 5351, 3194, 4058, 1092, -3340, -3877, -3873, -3599, -1796, 347, 1661, -1584, -2202, -3023, -3509, -1962, -401, 4932, 3448, 3590, 3513, 3916, 2126, -1824, -4761, -7716, -6743, -2796, 610, 2316, 2159, 2909, 5222, 7048, 6457, 1706, 1957, 2853, -2882, -5052, -2604, 528, -840, -3770, -3528, -1984, -2914, -2721, -150, 1454, 2971, 3634, 3183, 3466, 2545, 2095, -1859, -2979, -1164, 1786, 2367, 1958, 955, -129, 489, 1747, 2193, 2751, 2262, -1787, 99, 1414, -2366, -4241, -5137, 178, 2798, 4342, 3761, 778, -687, 78, 2046, 2099, 570, 1434, -472, -605, 2034, 1972, 4635]
6266D635K646m708l227J154j252j560K690M637L237o22m711l103L17k008L93L204
6250A722Q69k758R24L462K39l247r68m76K413N80j03K591l788k24j944p48j150
6233b606k75K553J503k336j707L440J863O36L44m4j255k800J593J83j69l575O71
6216a981j928J590J434k016Q96l269j559K618J773K878P27k138k198J064o92j822
6200d623k739j23J098J705N389N774m225r59k073O45J429K303P27l006k371k511
6184c560k233N887L464J78l58j242m73o81k622K084J64l055l546k356K183O484
6168C18K218J634K206k572j435L24K471k420l845l864J024L507k034j565J825
6153b208J554K232J242K752o91m448r52K487n99l203J543Q19r73J096l27k687
$$ y = [4635, 7281, 2573, -654, 500, -752, -2312, 378, 5015, 8252, 7630, 2919, -184, 133, -1875, -1482, 1722, 2591, -167, 757, 4219, 4458, 1211, 243, -233, 2180, 2760, 2657, 5248, 1460, 1236, -708, -1456, -2606, -2881, -328, 1175, -1161, -2868, 572, 2435, 3071, 3415, 3371, 2116, -684, 909, 1092, 923, -2652, -1981, -3909, -2319, -885, -2901, -2005, -5274, -6833, -4215, -2442, 436, 1163, -975, -3173, -2109, -2801, -4623, -7362, -7485, -6387, -4682, 707, 6481, 2256, 1297, -776, -131, 1298, 3601, 4328, 1322, -1049, -3560, -5793, 94, 3558, 3736, 3378, 2136, 1663, 982, -1640, 444, 608, -2447, -5993, -8349, -6166, 318, 2536, 4170, 6376, 3804, 2369, 2693, 5164, 2744, -1101, -4965, -3941, -434, -2468, -4033, -2208, -654, 1578, 2820, 5572, 4881, 433, -519, 1968, 1369, -1834, -291, 528, -445, 651, 324, -2363]
6137b363N46J421J245l380j38K889r13L65J010J854k474j832P17J839l023r85
6121c222J12K963N11Jl494M65N12j397q41K343Q98K884L528J054r29k628q4j032
6103A644Q57K161J68N17j191J877L517k645N30O5k896j523r02j460r04l16k298
6086b799k619J162J071j70P21J571J03l135j362K32P62L735K016J146k263k385
6070b214o25p43j235m30J181K748K492J411m29L06n12j626j81l39r91O87o19J97
6052i22j481n833j719K873L067L414j171Q97j735K45J426k225R99J458q70j292
6036b869K201K647j516j697l775j391K176J819P41o10j426j256L083N8N25J294
6020DJ261J219K489K88m220j846N60K635q52k989J303k56m18J203r25J196K8j516
$$ y = [-2363, -1817, -396, 849, -2531, -2669, 220, -693, -328, 682, 2536, 62, -1770, -1053, 786, -2237, -3222, -3110, -147, 364, 365, -3129, -2664, -2152, -3549, -4390, -2047, -1149, 1735, 5263, 6317, 5388, 2760, 2676, 1644, 2501, 4662, 4830, 5347, 4156, 6033, 9550, 6905, 7435, 7500, 4604, 3081, 2179, 719, -185, -501, -2799, -5418, -4256, -3185, -3355, -2634, -1063, -960, -4095, -5457, -5225, -4463, -728, 1288, 2434, 171, -2214, -2839, -3582, -4817, -5247, -4066, -1318, 1174, 2585, 2156, 2462, 1950, 324, 143, -196, -1187, -500, -1119, -922, -2403, -8236, -9955, -7082, -4015, -601, -1772, -875, -2610, -2365, -939, -3164, -2165, -707, -1577, -2869, -668, 1979, 463, -1234, -5009, -6400, -4224, -2405, -1664, -2274, -3700, -4956, -1873, -1815, -1290, 4, 1265, 2484, 4973, 5261, 1041, -805, -245, 2390, 1538, -1451, -148, -404, -822, 381, -544, 652, 680, -836]
6002h36j830J085J064K044J082l199k409P59J064O91p8L58J543L61k628l40L2
5985a237J304K531L438n45j816m236o35o97J569j82l58j851l634J856K648L405
5969A560l293k010J092m25j532K736J981M50j707j375Q22QK030k603J104m46n75
5952b183M204L725j621m518k374k13j118j339o59J136O58M106K544j749j640K127
5936A086l201J289P77j835OK88j267j070j631J171J037K491K06J877K0q51j669
5919a276K804k80J814j791k329k184r56M272K533m053l576P95r84K70L245K985
5903A289j94J927J053k281j26J581l14k045l695K59m99k786J204o40q26k14K028
5886d279O50L853O761p93k464k575k042k276m84K560m54j232l42j818k502K932
$$ y = [-836, -2666, -1581, -517, 1527, 2609, -590, -2999, -2240, -1176, -485, -563, -205, 1338, 1699, -929, -1269, -1237, 67, 2598, 6036, 5491, 3675, -561, -1196, -1893, -324, -506, -864, -2715, -6349, -4493, -1845, 1560, -1733, -3743, -2651, -3076, -4608, -1872, 109, 559, -1148, -2523, -1701, -1693, 337, -2266, -1162, -1608, -2183, 2021, 5746, 4125, -393, -2767, -2980, -4098, -5437, -6096, -4960, -4302, -196, 2348, 599, -1041, 1086, -2115, -826, -49, -1884, -1878, -1590, -2857, -3927, -5558, -4387, -3350, -859, -653, 1224, 1244, 393, -1276, 1528, 1248, 3062, 1271, -1058, -3242, -4198, 74, 2607, -1446, -5022, -4227, -5211, -4941, -1696, 1289, 1095, 3022, 4075, 1794, 1668, 3249, 2935, 890, -2805, -2546, -3045, -5831, -4627, -5267, -6093, -6307, -4279, -3629, 224, 6985, 6192, 3728, 1153, -889, -3165, -3649, -1089, -1543, -2775, -3117, -4935, -7437, -4505]
5870d505R69K827L038K681J485j914k148p02r09k828K733K199M06l914m048k633
5854g263L00K412J152j633L584J706J554k292l372J196L408R68l514j97K135k052
5838a908L11M15J315J363j81q56j605j339k259r34J097k542Q09N056O60l123j228
5821d949n21R38J268J708R87L077m67j323n81k365K76k4J839J497j778j393k506
5804d317P1J041J12p24J543K601K250j968k704p51n35N4j590j253J289J110L230
5787e41o95Q75r5l948K302M786K347j192J145O7l387J315l353l415L22mL577N315
5769E421l491l103m090l692J755K741J994M6J296J861j076N74O32j003P70N72
5753A207N17j681L32j249j566R0K889m01l475j677L380K828K194J176j576k470
$$ y = [-4505, -3536, -709, 2329, 5010, 6495, 4581, 2433, 1731, 822, -2006, 727, 2926, 3332, -582, -4630, -7263, -6963, -4551, -3399, -5032, -1448, 258, 1812, -480, -3852, -2656, 752, 1720, -1794, -1991, 144, -1908, -1597, -1182, 133, 1496, 1315, 459, -1146, -2485, -4744, -5678, -4581, -7123, -6314, -1258, -598, -3721, -4949, -5470, -4532, -3264, -1556, -569, 2508, 2041, 718, 137, -2228, -1952, -1976, -137, 1360, -418, -1811, -4317, -4246, -3205, -3093, -3817, -2274, 327, 2577, 609, -2095, -2846, -3381, -3327, -4917, -6170, -4881, -3771, -541, -1236, -361, -456, -4404, -2102, 2684, 5031, 3839, 4984, 5051, 1664, 2979, -374, -3789, -3467, -3471, 106, 5421, 1930, -1173, -5263, -8955, -7200, -4459, -2465, -2419, -1123, 738, -338, 236, 868, -135, 635, 1207, 1724, 43, 375, -874, -2440, -2350, 539, 138, -3337, -5014, -1634, 1194, 3388, 4564, 2988, 518]
5737E18j062J669P32m01m96J853j004J382J402J366k110l485l97r97K448J249
5721B667k407k804K089M162k645l387L414J824j947k167q81o00l470j115L931
5706c336M536K227n87l537K548p73r11K70K22R15k324m081K22L879J826J111l782
5689a575j40K058r0k391L628J320l452j581j25K118L70k06K869n99J337O39l491
5672F89j760P09J404Q08J90k38l795j127p53j600K308L59j039J435L705q51J330
5655A774n7M30l586r05p99j612K719K271M62j705k796m42J993j248l395l081L498
5638f479K917K656J720L27j065o36K319k214k040J489K862o68k440L74K853k10
5622A765k457n25J33j110p8L84M0k140k61j073N287P438j100n717k025M696N177
$$ y = [518, -544, 1125, 1857, 1456, 960, 2813, 1809, 3191, 4593, 5959, 3849, 364, -33, -1030, 1418, 2667, 260, -2544, -455, 3707, 1062, -2325, 1089, 2913, 966, -1201, -2082, -2682, -6152, -7267, -3336, 1200, 3427, 2840, -697, 1851, 1078, 167, 437, 659, 1574, -750, -4831, -4609, -730, 1096, 2207, -1575, -1715, 343, 253, -2138, 1490, 2810, -642, -2223, -2348, -230, 140, -66, 2803, 2204, 3541, 4180, 689, -1071, -362, 1042, 1850, 2040, 1802, -1993, -3120, -3873, -5473, -3165, -2806, -3845, -2410, 1295, 444, 1774, 1717, 2147, -1439, -2344, -3143, -4755, -2036, 235, 697, -1008, -3804, -4246, -2253, -3501, -6896, -9977, -6479, -3562, -906, 814, 1141, 76, -560, 1759, -455, -2495, -1006, 1856, 1188, -1252, -878, 1975, 1765, -692, -1217, -1084, -2194, -2272, -1888, -1848, -3988, -4249, -5322, -35, 7403, 6303, 586, -1439, 3257, 8434]
5605H434P50n011m211o87K408M496j168m636r26L461j256K01Q14J609n387J06
5589a003j33L68o00m78M757J121J339j433n489j057K665L83q6J847J809J034k071
5572B973l311J655N83J160N10j301j50q17k36J115j181r90J234l928j247j740
5556e671j617J157j089j958J750L6j07K888L705m81k773k000L362O59j431o97
5540d267j968k73Q19K710Q69o65p24j193m110J759M49R82P93p63j777M5J324J753
5522d237K38J887J987l310k364K012J125K096K048k20j051n893n22l52M99L138
5506b919K081P23k103k597l028K389L39K903K20m90k41m03J210J932o56m374l25
5489e339L327K483J589Q68j481k061R81j979l397K83J262K065J242k74J214J064
$$ y = [8434, 9184, 4173, -38, -725, 1683, 6179, 5011, 375, -551, 2910, 1654, 1855, 2669, 4278, -1109, -1003, -1136, -768, -1368, -1846, 2911, 4032, 5371, 3938, -1551, -2608, 57, 440, 354, 2201, 4010, 5044, 2973, -338, 1317, 1900, 3060, 3570, 2269, 2119, 1302, 1066, 2181, 1000, 10, 1244, -2684, -3931, -5671, -7288, -6131, -7220, -9178, -7428, -7392, -7499, -4611, -906, -1387, -4160, -6160, -2798, -2139, -3570, -4267, -6235, -6508, -5689, -2979, -2110, -2775, -3499, -4692, -8802, -7043, -6594, -5612, -4819, -5582, -7359, -7314, -5990, -4237, -3999, -2112, -125, -3435, -5799, -3787, -2662, -566, 1482, 1262, 211, -5682, -6204, -6556, -6057, -2919, -838, -115, -2218, -4815, -7843, -5454, -5115, -2212, -1992, -2482, -2723, -3126, -1916, 16, -640, -5014, -5339, -2012, 471, 2060, 2928, 1447, -614, 367, -1612, -5009, -4726, -3464, -1399, -157, -431, 783, 1847]
5473A847P04j401J356J162m807j370J588K91m90Q21J106J613j743J005j176N84
5457A090r05o53j658K617M99l335q00J003R62J317R23K477L9k26n80J70m60J01
5439B581j034n81P41K875J079k93j68R64k697k738m45J718M35j750j271j000l72
5422a956J508p12J408o69q98r39j767K283k941N44M96q59j644O14k158J778K675
5405c237K427J710N92j109K226Q75m055j367o88j525L42K959j37j141J322J943
5389A137K248j105k565j14k466k880j679L398L14k714P13K999J650n39j108k921
5373e632j289J998O30k8O00R04J606J489k610k750K254J252J413K804k241J00
5357E00l4J055j828n19l401o76m34P86N015L007K83l220J155l11L20j144p58p27
$$ y = [1847, 2551, 1150, 2506, 3668, -1139, -2509, -921, -630, -1120, -299, 807, 2420, 677, 1682, 506, 1090, 185, -468, -2126, 491, 990, -2345, -3145, -2142, -1180, 137, 1060, 3537, 3576, 3350, 2770, 2940, 2480, 2581, 1547, 966, 1707, 4582, 5661, 5368, 5200, 6164, 3467, 729, 284, 2002, 2437, 687, -584, -1584, -1956, -448, -1160, 248, -421, -1319, -2258, -4025, -1742, -4683, -4139, -3643, -4502, -6146, -5532, -7690, -5912, -3237, -810, 900, 1492, 383, 2609, 3484, -571, -1938, -2626, -4151, -3809, -850, -987, -2128, -806, 1137, 3385, 2280, -285, -399, -2865, -5745, -7424, -4026, -3712, -6426, -5713, -2714, -1064, -1603, -2711, -5632, -6921, -4923, -4293, -4321, -3721, -2817, -1211, 278, -2332, -5082, -2828, -1576, -163, 2641, 400, 500, 466, 1521, -307, -826, -4227, -4903, -5337, -4551, 464, 3471, 3754, 534, 1689, 1378, 1698, 554, -204, -931]
5339i31P41L41j747Qk747r44J155L171j676N93J0o12R08j273j819J390Q83K598
5321D9K686J009n436n39j764J245M749J717Q18p03k959p89O41J25J103J97k295
5304a46K265L017L43j681k323j926l329N86Q4k783K350J443j692p36K879m5k87
5287a981r20L682J804N19Q30N1r15l54M94o28J012k69J078j739n486k190j148
5270f160N102L697l116l892m22R45M702P4p3J025j484l869J222p74P33K105j694
5253a879J42K346K855Q11n05r29j147j197j228J955J773J472k158k855j447l361
5237e352J360K067J038M89J685o8q04o67n15j876k361K460j684p84P22K064J64
5220b062K476K129m69k490L61j130j787o78L706K509k533j623l91j9Q78K15M39
$$ y = [-931, -190, 151, -1596, -1588, -4335, -5279, -4124, -953, -2629, -2036, -2026, -2638, -1730, -3003, -4822, -3432, -2549, 49, 2735, 3744, -1692, -2231, -3995, -2750, 1999, 3716, 4534, 3831, 872, 83, 724, 849, 1952, 2149, -146, 2119, 5136, 5479, 3798, 1475, -451, -3780, -3194, -3110, -5893, -3543, -2100, -3792, -4528, -1649, -1694, -1981, -2901, 781, 2585, 3104, 3934, 3985, 3070, 2716, 3210, 2582, 3594, 3325, 4403, 2664, -2822, -5012, -6160, -1058, 2639, -477, -4369, -4791, -3846, 856, 930, 857, 1882, 398, -3471, -2249, -3023, -2290, -185, -1879, -1737, 609, 3464, 4275, 3770, 2841, 1694, 497, -731, 1224, 2997, 4469, 2311, -544, -1991, -5352, -3992, -1925, -887, -398, 1287, 1219, 415, -252, -767, -2643, -5004, -2544, -4228, -5012, -4290, -2226, -2062, 414, 2543, 2074, -416, -55, -1185, -2972, -3650, 56, 2565, 32, -1591, -1982, -2001, -1123, -908, -469]
5203d69j322j741o17J709L937m1j495K097j92j327j866J153K819K082l000m145
5187b418R2K450J516k498j935j034m33K024N10n59J978J01j037l34J889J286O33
5170B231j389j78n14j14k115r08k692L923L491l17k187k663N24j133R79K472L637
5153C047m04p57k666l3O63j057j541q19K090K363j996j219k143k064K358J337
5137b841k166j532K935R61L227K560k853j731k434l254M178L166M48r61K388j59
5121A932J724k82k583R81j4J374k726l101L459J91j582j663j537J408L976J319
5105B876J303l341R41n15k02J68m237j810J530j443j067P435L965o187k198q90
5089c672O52k34J024j45j006n06k91k703K524J757O90j898k412k115K466K454
$$ y = [-469, -1791, -3532, -4149, -2440, 1497, 1456, -39, 2058, 1866, 539, -1327, -174, 2645, 4727, 1727, -2418, -2326, 124, 1640, -858, -2793, -3827, -4260, -2236, -1726, -2285, -307, -206, -1243, -1577, 312, 1598, 2231, 842, 664, 150, 36, -2079, -2987, -5679, -1756, 1735, 1418, -769, -3432, -2908, -4041, -3062, -590, 3047, 2643, 1886, -780, -813, -150, -1207, -2748, -3567, -1477, 886, -1110, -2329, -4472, -6536, -4178, -2841, -5007, -6539, -3604, -2643, 584, 3144, 291, -1440, -3874, -7128, -2950, 216, 664, -297, 2091, 1932, 3656, 3374, 791, 1772, 1758, 3132, 406, -2695, 764, 955, -627, -2290, -3827, -2419, 1557, 2876, 4179, 838, 1779, 1264, 1062, 1230, -3007, -4817, -3287, -4730, -5797, 1638, 5603, -584, -2782, -3672, -3020, -3254, -2230, -2375, -3381, -3887, -4178, -6881, -4357, -2600, -1910, -3808, -6220, -8335, -5869, -3415]
5073c415n11o39Q92J285K91j657K805L206j499j314j8J585K271k728j237l484
5057d167o63J275K68R94J856K222J5k083j912J076J229J78k563p39j155n45J151
5040c563J328J115k412k375J936J557K859O64J246P10j335m995l200J093M339
5025a033P48M482K548j007k727k654j737j474O26J587K88J319k139J001n60j171
5009a903K716K76n58nj279l221j055o07j892j78J314J104j138j911K782K557l452
4992f450q16J425J7M46J121j834l88P92J42M72K168M30L948J491J563M737k959
4975F305j671k095o39j430l22k170J159O216R69j676j206l21J258n583k445q56
4959d507r05J344Q68k638p30J019K514K230n01o62J487j145j114J774J096o28
$$ y = [-3415, -3926, -4565, -3673, -2388, -2097, -3754, -949, 2257, 758, -556, -574, 1011, 3282, 554, -683, -4167, -4830, -3555, -3287, -2293, -437, 1785, 1800, -283, -2195, -1119, 110, 288, -2275, -3014, -4169, -4714, -3563, -2235, -1120, -3532, -5907, -3971, -2414, 445, 1109, 2355, 3065, 1730, -3265, -6465, -5372, -1033, -285, 4197, 6745, 5738, 3011, 357, -1380, -2854, -2228, -641, -353, 966, -1173, -172, -732, -1903, 813, 1089, 531, 526, -753, -3974, -5029, -5636, -7528, -7706, -6392, -5288, -6426, -8337, -5555, -2998, -6450, -7266, -5841, -5824, -5378, -4257, -6091, -6479, -5687, -5545, -5073, -2905, -2475, 1473, 2964, 4527, 9264, 6305, 4634, 2539, 1900, 470, 148, -2022, -863, 5353, 6322, 4646, 3440, 3119, 4377, -1206, -3651, -4507, -5412, -4068, -3200, -5838, -6568, -5549, -3035, -805, -1306, -1968, -481, -1626, -2740, -966, 130, -498]
4943d98j302k869j225K77p57L225L209k530j102L143n82L87Q58k964P22K163J468
4926A623K135j736Q05n74l232o04J399l59N052j078k926J64j729O56j568k323
4910d295q20k170M30K592j56J596n33m36J567K49j11r41k894j655J688J344J896
4893b649R39j157n43j871K136J510L982J043k286k37m8L381J34l759J41N4J343
4876B113k853n611j281K620N117L164j975l575P14o85l538K522Q01m64O16J617
4860f98Q1M86L370k032n05r3q50p38K295K271K377k366k806l104k767R31J721
4843b427r57j10j645j944P30L501J286L78k842j031m37r0k466L978M883o3n143
4826d399j992M371j91P95J018K471j738p82l941m608L70N543J732k84J449l271
$$ y = [-498, -1800, -4669, -5894, -5617, -6374, -3149, 60, -2470, -3572, -429, -1011, -624, 234, -2730, -2008, 155, 1623, 3758, 2022, 2827, 2253, -979, -1583, -184, -543, 4509, 3431, 505, 669, -1060, -404, -1972, -4295, -5115, -7285, -6855, -4263, -4419, -2823, -3356, -3792, -2225, -1976, -2087, -3028, -5922, -7577, -5889, -4545, -2649, -1710, -2867, -3410, -5281, -3145, -1635, 2347, 3390, 1104, 867, 819, 4200, 4334, 575, 716, 770, 2113, -740, -6351, -7632, -5012, 105, 3269, 1294, -2281, -1567, -2252, -5790, -3268, -2467, -2931, -2315, -698, -617, -131, 3239, 1207, 702, 609, -241, -979, 1316, 3587, 5964, 3598, 792, -2312, -5079, -4148, -2427, -3384, -3494, -5139, -7083, -6353, -2852, -1566, -1188, -4030, -5061, -5498, -5588, -8054, -4076, 807, 744, -4399, -6391, -2020, -2211, -1416, -398, 2073, 335, -447, -4388, -8996, -8626, -3083, -1351, -1635, -186, -3457]
4810c457r10L232L76o66r43j544j268J462J538J416l314nJ10o22K29O01L893J175
4792A303j143j2j6r27N81k277j964l255J626L842J484m728q85N11K825J06j89
4775c118k45J136J081M00J555Q89o23j346j236j02N439o69m096k717K252j914
4759c314R92L201J525K920L413l222l481j072N066J016l766m495K9L001M319j282
4743D850m65k209j858k736J384n16l665k751M269K889J064K734K090l129k804
4728h53J595o56N10K188l709J739K764j949k245k237l448l609L363N481J524k190
4712a732j854J80M197j082J512p91r41J039J033k702j136M986n74j200l779k790
4696e634O28P99L320o64p35j3J936j19l472o81L575K485K115j453k482J195J389
$$ y = [-3457, -4367, -1135, -759, -1425, -2368, -3912, -5180, -3718, -2180, -764, -4078, -4083, -3973, -4595, -4366, -3765, 128, 1303, 160, 148, 132, -795, -214, -2491, -4455, -7710, -6084, -2242, -758, -5486, -6371, -5860, -3035, -2929, -3118, -3363, -2227, -1146, -746, 809, 1698, 1075, -271, -1507, -1609, 3830, 3161, -935, -3652, -1400, -3314, -2322, 879, 2404, 5324, 8737, 5515, 2034, 962, 6028, 7044, 3278, -1217, -1188, 1813, 6132, 4850, 4385, 2176, 318, -2418, -1034, -1550, -5215, -7966, -3697, -808, 256, 2990, 5080, 1951, -853, 742, 86, 596, 2784, -925, 814, 3578, 1629, -616, -2853, -6301, -9910, -6547, -1066, 458, -1732, -3586, -3406, 791, -291, 1221, 430, -511, 528, 1561, -1141, -2277, 2709, 2135, 935, -2844, -5634, -5006, -4207, -887, -1551, -2286, -2299, -363, -482, -3954, -4635, -1060, 1425, 3540, 2087, -395, 800, 2189]
4679B189J663o64k480r12j34k193q46n04J098j416K404J230l342J14k152l227
4663i172J001L584M594K78J16p57j652J111R85o72j62K313k539j627k800q12J306
4646d905N148J867r09k946o83k00n3l772K066K719j695k72L160M053L408k507
4630D479k926m811n352L574L747k362M87K485r1j534L79O86j090K708L633j119
4614B893m031j479J49k709K423K70O46K757K629n07J27k351j984l12m3r45O2J558
4596h47J055J491n42r12L39J188O0J933J497lR4l29k585m489j234L005N53K320
4578B594P81r79j392j018o67j714J193K14k013j291kj081r69L014N430O35k277
4561D58k155P19O91L00o25L73Q22J161l655J32n1N36j52M66l385k074J76J49j057
$$ y = [2189, 3852, 3188, 708, -204, -338, -2531, -3377, -3881, -2783, -4199, -1795, -565, -3907, -3793, -5945, -9172, -8171, -4587, 7, 285, 401, -356, -2008, -897, 88, -584, -746, 1567, -972, -2599, -5399, -6211, -4905, 243, 2110, 1201, -1745, -2428, -2628, -2681, -6453, -4387, -1668, -3363, -3635, -475, 3578, 6986, 4479, 1553, -3258, -8610, -5036, -1289, -3651, -3164, -679, -770, -2304, -1925, -1239, -2329, 379, 4012, 2893, -1138, -2617, -2468, -5177, -2754, -2484, -1838, 919, 3548, 3041, 3168, 817, -1167, -1479, -1522, -2467, -2405, -847, 208, 1699, 1157, 245, 584, 1772, 1832, 3765, 5262, 5259, 5353, 5024, 2439, -2050, -3284, -279, 274, 2594, 3375, 2396, 1004, -14, -681, -2395, -1202, -988, -3001, -4292, -4294, -5375, -6344, -3330, 2100, 2735, 458, -1697, -978, -287, 13, -612, -239, 583, 1744, -1911, -1779, -1830, -1294, -1446, -980, -4365, -6439, -6263, -6114, -7171]
4542g171K567M457O27Q12n74k148k070q80l230J355K922l642k715M30L120K844
4526c296L895K795k190j615o9K28k294l78N30k905j706k10J407J947k25m25m39
4509d950O09Q25J534r57J414J638r08j390j106n66O35K419k017n057k763L461
4493g179M39L079o77L56K545J37j886O56j500k139Q33K346J125J539Q44J452l544
4476a574l349j291L510J772l776j52L336R03J309j62j535j700l801j308J200J437
4460e181M187p82m167J683K543K03k743K28K383Q24j433o0L543N03K965L043k018
4443E721m124k219m261j554L396k47n20J197k026J0J593M727K831k64j371j068
4427A821l343r84K690m127j81J761j534K354K096j518N37L140L724k030k753j972
$$ y = [-7171, -4604, -147, 480, 1292, 718, -1430, -3500, -4380, -7610, -6255, -3333, -6975, -9690, -9260, -6140, -3296, 599, 3394, 1204, -411, -480, -252, -2546, -2924, -2394, -5299, -7005, -7215, -5808, -3861, -4086, -4511, -4950, -4341, -3516, -1982, -2939, -1525, 113, -795, -2185, -3291, -3857, -3222, -803, -2820, -7877, -10640, -7179, -6740, -3661, -4338, -3982, -1437, -1300, -3186, -2530, -4030, -6169, -5336, -2990, -1865, -326, 518, 1970, -1574, -4923, -6214, -2704, -932, -4708, -4860, -1524, -621, 688, 526, -1009, -2709, -6510, -7818, -6618, -5181, -994, -1776, -5943, -4260, -1717, -1514, -4257, -4029, -1646, -822, -2255, -2315, 1228, 1731, 4696, 7739, 5721, 1597, -622, -4883, -6437, -3041, -3288, -3808, -2611, -4637, -4627, -3034, 1693, 4524, 4260, 2889, 1821, -1522, -2506, 184, -3943, -4124, -2363, -3897, -1543, 553, -965, -428, 2712, 6436, 4406, 1653, -319]
4411c19l95l515K97N12q64j697m29K150J167j588J779J335j741J788j1j18J135
4394e14q01J50o75j518J276l446p23K814O60r09k800P23K836K533J84l851P76
4377c285K02O76J800K03k422K115J07M83Q68l323k560j648M121L082k714J078
4361a217J558J53k1Q8k269m299J657j981p56r96M09l18j003L197K510o69k985
4344f942K92K07P16M809o0l814r65L673q67k214R59P18Q43N6J584r42j387m342
4326g676m31J814L541q38n175J248M195J518l418P07l06J72J7895Q360j6009j2178
4310f581o36K314K433R3l221M117L870j851k590J7K250o88k125l254R88O51J439
4293b774j271q21q86J372j101K077M190r13J88j320J601K184K799n24l93j582
$$ y = [-319, -714, -4229, -3932, -3420, -4284, -5981, -6410, -4260, -3093, -4681, -2902, -1567, -3308, -1520, -1531, -1649, -514, -1315, -1165, -1840, -3358, -2082, -5528, -6251, -3437, -2777, -3686, -6486, -5763, -2927, -394, -210, -4061, -3285, -3083, -2407, -607, -404, -2826, -711, -604, -121, 747, -2576, -5136, -6784, -2663, 419, -2295, -1217, 341, 494, 473, 561, -1708, -6007, -4350, -6331, -7087, -8083, -7674, -7992, -8995, -5798, -3288, -3957, -6942, -6650, -6443, -5727, -918, -978, -4792, -5757, -2084, -2951, -5165, -4206, -3488, -2645, -2589, -1005, -1947, -3334, -7676, -8107, -6293, -2752, -3590, -8765, -7517, -3322, -1804, -5222, -4515, -4821, -4649, 13246, 21606, 5597, -6581, -7217, -4903, -2470, -2377, -5598, -1481, 2389, 538, -2052, -2035, 215, -473, -2598, -5852, -4864, -4213, -2774, -4045, -4866, -5752, -4380, -5481, -3404, 786, -127, 61, -1259, 342, 2526, 5325, 4801, 4408, 2826]
4277B826l85R90N242j812l383j832j016j918p21m424J324M717n18m05L040J226
4261B951K32j921J213L15r15j42j503l427o05m95j942O78J054K545J946J450Q94
4244B328m054l582j250L102p13j338J918J257K647K555K25m638m319n21K520J446
4228b417k233p48J420L851K692q82l899J612q51k858j70k703N45L269M74J128
4212a770R60N66K813O3l311m72j625o03J243K888r91r79K93K698j732l041j329
4195d329L299L830m59l865j906q22J790k18k389P12K536Q47J895L019j864k79
4179A797j630N93J124J491L65k197n771l457L434K175j731r84L723P89q83J410
4163B48R76m441m186K796N140L433N11l464j848MK952O1k530N3J691N418o30N41
$$ y = [2826, 2441, 3431, 8673, 6861, 3478, 1646, 630, -1288, -2009, -6433, -5109, -392, -910, -1315, 1725, 2951, 3183, 1262, 2475, 2790, 1875, 1733, 230, -3197, -3802, -4297, -6239, -5561, -4507, -1962, -16, 1434, 2328, -1726, -5308, -6558, -3456, -4169, -5507, -3589, -2332, 315, 2870, 3095, -1543, -5862, -6383, -3863, -2417, -4650, -5398, -3978, -127, 2565, 1683, -2216, -604, -1455, -4313, -4483, -7186, -6641, -3372, -2898, -1770, -810, -244, 2569, 2632, -679, -1151, -2776, -3379, -2136, 752, -239, -1218, -925, 1773, 41, -3000, -4329, -1030, 2800, 2341, -1524, -3430, -4252, -2462, -2680, -5069, -4357, -1821, -974, 921, 3940, 2076, 1797, 167, 760, 1884, 3375, 3740, 1543, -4228, -7685, -4251, -2076, -3807, -4791, -1068, -279, -1162, 248, 1224, -3217, -7403, -4607, 533, 3966, 4477, 1013, -835, -831, 2121, 2182, -348, -295, 1396, 6814, 6184, 6725]
4145F725k338k656Q13q52j213l04j708L651K661j743j428J734o87j371K194n91
4129B887p712J492J030j737J298K02K508M705J756j752l072N58j633k277K514
4114G67K553k257n889L61L044R34J359J549q42k969K278R65j506L326J83n411
4098a555n332J393M201K059K178k129j404j311j736j388J666N259K757R44l073
4083B529k030j676J730q71j245J093N43J226q64j877J249J917O04j6R2k400j070
4066a066r65K346l0L060l08l85j112l943m250j140l4M268L872k411k319n58L253
4049a722O042p17j086P81k320k044k545K028K992J274o81k485k7n15j821L112
4033B66j063l016O58M622p37p82n972j165N097p85k004N69J270N805j971j077
$$ y = [6725, 4387, 1731, 2544, 1692, 479, 175, -1533, 2118, 4779, 3036, 1608, 3342, 2655, 1284, 3478, 2887, -4825, -3333, -2303, -4040, -2742, -2540, -32, 4673, 6429, 4677, 1605, 2163, 530, -1747, 767, 3320, 1063, -4826, -4465, -1421, -487, 872, 2421, 1579, -1390, 888, 1853, 347, 3673, 3856, -1555, -6887, -5494, -1293, 766, 2944, 815, -589, -1900, -3636, -5024, -3358, 1901, 4658, 5602, 2529, 499, -1177, 553, -318, -1563, -470, 73, 1299, 435, -1442, -193, 1724, 2328, 2312, 2404, 4, -1066, -2031, 315, 285, 3345, 3037, 2652, 1540, -2403, -6653, -7793, -7827, -3559, 313, -2098, -4417, -4975, -1722, 4320, 3603, 2517, 3298, 978, -1066, -3611, -1583, 1409, 2683, 2002, -483, -510, -1025, -2846, 266, -797, -3813, -3155, 1467, 730, -52, -6024, -7189, -2092, -2877, -4881, -4312, -3042, 2763, 792, -285]
4017b85N14k28j480k346m771J950L274K335J151r26p36j746J863J110m32J457
4001G04J30j403K025J553N260k056M50nl660k774j493k19L496M187L17m663k24
3984A625j013J553j194j763j990L328J419k981R03l43m074j063k22J05K034r0
3968c766q7K516L407p05j905r99j788J663J276J840K683l18j788Rk053J822J492
3951C299L4k531K035k457N66j729k100m459m530K596L027L094M948M781j871l785
3935I18R75L67J499J243j726l56k579k323q9J583J162m168K567k549j824N321
3919B1M766l109j144J483o29J136J546j135j336K621Q14O26k079k987k943m66
3903b815n33K393L39k561P44K89L97j932K299J923j361k354M5M940P36r81k144
$$ y = [-285, 229, 1, -1479, -3825, -8596, -6646, -3372, -1037, 114, -812, -1548, -3294, -1431, -321, -753, 704, 834, -569, 1456, 3009, 8269, 6213, 6663, 6658, 2998, 224, -1269, -1488, 2008, 6195, 6512, 1849, 1625, 612, 2165, 971, -792, -2782, 546, 1965, -1016, -113, -456, -4530, -5593, -5815, -5710, -3676, -3766, -3853, -1337, 2070, 1365, -540, -1539, -3327, -1664, -388, 1452, 4135, 3817, 2029, 2038, -15, 1807, 3299, 3333, 802, 2837, 380, 946, -783, -2883, -7342, -11872, -9276, -6249, -3155, 1793, 6574, 4703, 918, 1893, 2260, 3759, 5002, 3276, 2920, 341, -1982, -2071, -488, 674, -3494, -927, -3476, -5300, 21, 4787, 1678, 534, 2017, 1388, 2524, 4070, 2935, 1599, 4220, 5034, 5660, 3581, 594, -2349, -2815, -3348, -955, -616, -3177, -2433, -2144, -1747, -3679, -1380, 543, -818, -3172, -3127, 1813, 2549, 1568, -576]
3886e76o30j752K489J332m420m78J794o3K203N27j498j703k20Q73N529K509k143
3869C773j136k305k999J382J402p90j894P19m99L6L057J329N40k560n438l994
3853i377L066O312n75j541K07m88J435J24M87l9Q67j489k326k925J855O5J121
3836c221M384L307m112k649M46K622K678J715J358r73o58j952k787O03J428R39
3820C128j575l348k431j255J350k38K170L965j320m89L566L004j660n864J051
3805E4L412L991j006m8j667k762m147k848j346qL221J851L191L248o72n554j787
3788b877K189N46L43j851m141k050K619M087J425k466J846R45L1n45L70J028J325
3771B824k393k436O24J383m58k488l015N16r1K834L307K276j461J660O0j385j046
$$ y = [-576, -1206, -2958, -469, 863, -3557, -4035, -2241, -2304, -101, 426, -1072, -2775, -2995, -2122, 3407, 5916, 3773, 2637, 332, -2667, -1285, 117, -673, -2567, -1848, -2347, -2311, 746, 2075, 2615, 55, -5383, -9377, -6311, 1, -574, -2115, -1908, -2396, -961, -837, -350, -389, 478, -1011, -3337, -6262, -4407, -4342, -3221, 1163, 4470, 358, -2291, -1845, 777, 3455, 5170, 6528, 5555, 4897, 2945, 158, 761, 2189, 3128, 1553, -1795, -4226, -5481, -4131, -4369, -2199, 1766, 446, -43, 3523, 6527, 4867, -997, 54, 3466, 7457, 6451, 6403, 4736, 1974, -2173, -5021, -6367, -6375, -3154, -1303, 1888, 5136, 4464, -1090, -2877, -688, -142, 201, -1650, -5791, -7841, -5222, -1135, 290, -2176, -330, 615, 646, 101, 471, 1499, 2824, 431, -2005, -1381, 2, -456, -2944, -5959, -5443, -5534, -2700, 607, 2883, 1422, 3082, 3142, 1757, 711]
3754G11n428rr02Q34O68J422K064k248Q9M053k002j698M14p08j865R8n90n84J418
3735d263J191L998J274k448l751o11k935k669L318K873l258l111L318L165R12
3720b997q96J36K619R08m127k775L288J579k036j771n8J932N1O31J528J334j012
3703a666j545r6P30J556M02j703k241J383J476Q66j924L204m17j387Q42N01j917
3686a936K540K888k513j565J718J704O53j847n93p38K581r32l512l558K800K625
3670C15J228j107Q12M06K636k230k448K072J706k947J050n21k759o12J823J622
3654A046j432j129Q23J933R28q03j449j295k102J839m82l33K244J028K20l107
3638b071j620O39j49o4l583p45M201J370J16J482J932J765j033o76r4L14J196
$$ y = [711, -4717, -4726, -5628, -4794, -4126, -2704, -640, -2888, -2799, 1254, -748, -2446, -2032, -2740, -4605, -4507, -5097, -5681, -4263, -3072, 926, 2200, -248, -3999, -4610, -7545, -10214, -6896, -4023, -7281, -10392, -7074, -3909, -2997, -3893, -3757, -1138, -230, -4357, -7132, -3844, -2265, -4301, -6072, -6130, -4198, -4147, -3516, -1988, -654, -1666, -3211, -3307, -2577, -1021, -619, -2322, -4563, -3180, -1704, -838, -2762, 442, 25, -1362, -520, -19, -1936, 604, 3492, 979, -586, 1132, 2836, 3489, 1642, 1049, 311, 2892, 1960, -1552, -5110, -2310, 315, 1543, 436, 1248, 1654, 4290, 2060, -388, 1684, 3390, 443, 1493, 972, -1787, -2399, -576, 1046, -386, -1515, -692, 1241, 2169, 1366, -83, -1378, -3480, -1641, -2123, -2456, -212, 816, 1036, -2071, -3691, -3052, -3201, -3265, -6848, -7593, -3392, -2022, -1906, -424, 1508, 3273, 2240, 1564, 1470, 1784, 2980]
3621B980R44p3K92j591r45K264P78R8j454j510J258n49k554j213J421K197J652
3604C995j819j616r57j349K243q96o04M95j694P10K876R05L452j331l283j571
3588d44p47J89O37P31k23J40q33k198k021J69O07p17O11K348k552j62j385P21
3570e129J45K466k134k464j206L751L732j681M64L008o0k794l95K462r30l557
3554d322N42J679k567L35j29J27K001P8J340K708n15l393k17J846k11j225O37
3537a286j555m727j861N36k493K563N166M896j227l57j960J470j80p11K090L65
3521G29m36j149j046J54J424Q18L184j290m917p43O35R90J413J824j20j680j897
3504b107N93J25j239J564J410k795R19L277J072k475m47k407k361J166k106k026
$$ y = [2980, 3924, 3851, 4143, 2552, 1607, 3871, 4649, 4747, 3293, 1783, 3041, 2492, -62, -1275, 146, 2343, 3995, 2176, 560, -397, -1746, 497, -399, -1003, -508, -2202, -1492, 1384, 2289, 5741, 4410, 1127, -444, -1191, -1002, -365, 366, 143, 283, -550, -2748, -4769, -4600, -3993, -4710, -4099, -1751, -4303, -4465, -5850, -5129, -4984, -2518, -4652, -7116, -8322, -4571, -839, -2520, -2056, 952, 892, -1902, -2297, 165, -765, -4322, -3780, -2101, -4668, -4333, -4462, -4335, -2334, -2256, -916, 1792, 1277, -2116, -2333, -487, -698, -1923, -1286, -2841, -7568, -9429, -8893, -11386, -8823, -3657, 1239, 12, -345, -2305, -835, -1015, -1726, 364, 729, 293, -856, -1902, -1748, -324, 494, 3678, 2388, -2529, -3272, -2637, -1647, -234, 1590, 1470, -210, -2107, -1514, -1389, -2628, -1064, 346, -2449, -1530, 1747, 2819, 344, -103, -2510, -4871, -3705, -5811, -7837]
3488g837J564K420J636J058Q24K914j618l005J167K494j669j025K677k464j811
3473b675kJ998o11J267Q91q33m540L148O48q38j231j438K618J44M4j05J452k059
3455b122j352r26J93k46K558J704Q90n24j160O76L357k069J88J11l530n7K597
3438B88K79J857L946O23p5j637l537m672K163K547l204q26M347k016j187j628
3422b732j050K647j176l617R21Q99L098Q22k501k258J30M008J474j692j510O47
3406a890Q02J371k488m532J522L537j85l702J864J630J238K066K961K985K376
3391I555p93k592K780l707m913J657L47k825k437J938L068l4o40m50M69j216p8
3374A29K086j075K231R45m721m361P06M11j005q25L587o33M57K121r2K426j841
$$ y = [-7837, -6273, -3853, -2217, -1159, -335, 2579, 961, -2044, -877, 1617, -52, -1077, 1600, -864, -2675, -2677, -679, -1290, -23, 868, 35, -4505, -1357, -709, -1547, -2778, -4216, -1598, -1454, -1410, -1515, -63, -2122, -3474, -4400, -4207, -4453, -1895, -191, 699, 175, -985, -309, 3048, 979, 1167, 1278, -2252, -2309, 288, 567, 2424, 6370, 6993, 6918, 5281, 1744, -2928, -765, 1782, -1422, -2248, 2099, 83, -1104, -2732, -3782, -1135, -2311, -5928, -5007, -4108, -1010, -188, -2689, -4947, -4817, -809, 665, -1027, -2537, -1890, -1088, 283, -2205, -6737, -5215, -1678, -1863, -5565, -3701, -2071, -833, 1233, 4194, 7179, 9555, 8762, 6170, 8950, 5243, 330, 1987, 2334, -491, -2928, -990, 2078, 2044, 1404, 954, 1423, 207, 129, 2215, 1140, 3371, 4316, -405, -4766, -4060, -3649, -4654, -5479, -1892, -2525, -2068, 53, -39, 2387, 546]
3357E46M93K546P22k212j329j194r60K302j291k834M78L471K946K684J591J38
3341H097j645R60j245m273j499J072m328J006L112K268J849j687j037l967J257
3326f0N732N46k93k815l469L56J039m38j691J458j42K430l464o1k797j309j010
3309e988m86K034O10K431k361m525L222K512R32j13J09K055L522J844p35J687
3293F750j33l406J430l703k963o88k320m0K218J916J312L577L131l125j583K87
3277B660q60k379l211l96K058L039M47p51k590L055R83k096J03o10M906r57P41
3260D142m2j215j754k68j289J381k312k712K022J896J121K23l65L67p43R64J652
3243C068j570N80K5r92l79j479n87p89J123L70p19m737p9J849O42J766j065J508
$$ y = [546, 1039, 3585, 4307, 2095, 766, -428, -1388, 914, -377, -3211, -2733, 738, 3684, 6368, 7959, 8097, 6452, 7412, 6167, 1894, 395, 1467, -2861, -1855, 1257, 3525, 5374, 3687, 2650, -1317, -60, 5672, 6218, 5925, 3110, -359, -3, 1036, 598, -1093, 365, 223, 2653, -811, -872, -3669, -4978, -5988, -6474, -4440, -3830, -1399, -3760, -8285, -5063, -2551, -1619, -1732, -1623, 432, 3954, 5798, 5063, 6750, 6617, 3211, 4641, 938, -2025, -2713, -5033, -5073, -2855, -939, 373, 3950, 7081, 3956, 2373, 2660, 1800, -579, -3790, -4186, -2128, 911, 1358, 607, -1983, 1072, 2055, -41, 62, -548, 4358, 3401, 4142, 4100, 2885, 1131, 863, -426, 955, -1357, -4069, -2047, -151, 970, 1193, 828, 1195, 452, 1416, 3068, 1498, 2078, 2103, 1111, 732, -747, -1334, -2123, -1000, -630, -1349, -6086, -6165, -4316, -3674, -1908, -2973, -1465]
3225a465M298K537k375l586l171M8J805l339K180M137j650j495r4j25n62M399
3209A542L381m466l943K77J61J83K669J467J49l387k44l084k04K655O20J342J763
3192H81q00l609q62L474L545j592O91J259m63l962k209L232J247k548J088Q11
3176A83N47L89k019m33k74J64N72J779p35L09R70J887O66j83R31j204j353j901
3158B95q92J323q71J125K6j783k844J214K572M543J361Q65K47l037j794k722m696
3141e068K05K968j51J38k946J237N591m40l829m06j131k855N18L312K331l362
3125c888k35L448L715n400p71L157J656J433j655L63M34k598K357K054K82k241
3109B111Q06K736k279k362j183m56K9J551q57r91J729o99m575q59L18j797L13
$$ y = [-1465, 2833, 5370, 2995, -591, -3762, -3714, -1909, -5248, -3068, 1069, -581, -2076, -2170, -2295, -2857, 1542, 4923, 457, -3486, -3209, -3048, -2865, -196, 1271, 1420, -1967, -2211, -5295, -5499, -2844, -2224, -882, 881, 81, -3528, -4390, -916, 2629, 1037, 1728, 2987, 2524, -1438, -3647, -415, 832, -1716, -628, 183, 730, 1119, -900, -1333, -1607, -1443, -871, 908, 173, 482, 1452, 3339, 4005, 3822, 4753, 3549, 2196, 295, -597, 726, -145, 980, 1006, -777, -3621, -2407, 165, 4708, 6069, 6934, 7181, 4144, 2350, -372, -5068, -4863, -1895, -2046, -1908, -4854, -3617, 1974, 1534, -2295, -2701, -3832, -6687, -6169, -2857, -526, -3888, -4123, -675, 3040, -2360, -3131, 26, 1682, 3115, 1460, 1823, 2257, -341, 2016, 4070, 4352, 2111, 2917, 5653, 3374, 1012, -171, -627, -598, 953, 96, -895, 834, 135, -4440, -5299, -4981, -6778, -6465]
3092f465L863J726k514k932p63K507M60j07K206r83O82P98J688J931j025R07K692
3075D671M060q50k425J340p21k457n029j453K473M756j101j615j553l073J22L044
3059A89K409J908L298l651l680K227r17M42J898o55n335N52M132P04o43k076J69
3042I71j35N23k016K747L270l912k141M91k692l281j431O11R98L070J458p67J980
3025b56R51N00j614J366j605n6j757o55j727j485L508J312N88j168n3N01j833
3008c483j197o65q15n00J387J767J384L054O36O21p53L046K247l76k985r32l831
2991a395k648j056j064K181M133R14k84L637K982j860o291k951J004K615L477
2976C394k256j198J376Q14l626j568J574j155k11p45J258j708L00J887q91o78
$$ y = [-6465, -2602, -876, -3390, -6322, -7085, -4578, -4118, -4225, -2019, -3002, -2320, -1522, 166, 2097, 1072, 1979, 4671, 8731, 7881, 5456, 6796, 6075, 3618, -1411, -2864, -391, 4365, 3264, 1649, 96, -2977, -2855, 189, 2598, 4506, 7804, 4153, 473, 2700, 1783, 2225, 4123, 3468, -1867, -1315, 2817, 3521, 2878, 802, 971, 836, 1359, -657, 2090, 5360, 1448, -693, -202, -2894, -6175, -7606, -6995, -5997, -2927, -1469, -2236, -256, 695, 1195, -419, 947, -658, -714, -2471, -3126, -4853, -6338, -2830, -1518, -930, -2098, -2151, -1650, -3483, -4680, -5345, -6160, -6660, -5273, -3506, -2122, 932, 1568, 2189, 1436, 4482, 6729, 6353, 3368, 2436, -1395, -4043, -5099, -6163, -3982, 151, 1065, 781, 4418, 7400, 5540, -751, -3702, -2698, -83, 3394, 1138, -60, 1316, 2130, -1496, -3064, -1490, -2645, -2856, -3601, -2343, -4051, -3751, -1864, -2755, -3433]
2960c433k060K785M204k308l2R10K74j637p23N76K471J888K156J23j551k562n520
2943d439j838J935L435j432m0J797j310k757K565O9J679J1m18k197J32K585Q33
2926F10q94r40M46J125p3k359m133n11J820J002N773J299k581o60j66r07K08l428
2908d369q16J055K389M355J306k941J898j360n121K4J154K745K421j547j2k064
2892h83l59j40J157q48m60K208K967j117l96R45j048p24N88k58O08j736N49m249
2874c196o60K263K060K552J522L461N05j533m558k413K921J293k238k47J198k17
2858B713p10q44L3L68K937J336k201N37l68k475l900R94k59K80Q20j024j20J277
2840f06J216J420l417k681K420J422J002P73j60q89k193o06J433J774M301J634
$$ y = [-3433, -5493, -2708, 1496, -812, -844, 66, 340, -1297, -2020, -1444, 1027, 2915, 5071, 5194, 3643, 1081, -4439, -6277, -4342, -907, -2339, -2379, -582, -1892, -4649, -2084, -2015, -336, -325, -743, -2940, -2808, -223, 610, -284, -1224, -778, 347, 274, -2085, -6218, -6729, -4909, -3907, 1866, 3165, 584, -76, -242, -1149, -941, -4369, -5185, -4130, -1741, 2614, 3920, 979, 2877, 1517, -3604, -3580, -2426, 319, 2740, 1193, 1181, -883, -1242, -1382, -225, -1073, -1533, 675, 3642, 2525, 2129, 3074, 2026, 1302, 1890, 1632, 2240, 504, 1053, -3196, -3856, -1593, 467, 3019, 4541, 8002, 8507, 6974, 2416, 3, 2924, 4217, 1979, 1732, 2930, 2713, 2003, 1159, 1192, 1560, 4497, 5833, 3632, 4169, 3801, 1326, -2574, -1580, -1839, -1559, -739, -1763, -1883, -606, 610, 2030, -1387, -4068, -1648, -226, 776, 1549, 1389, 500, -1693, -2299, -866, 908, 5209, 6843]
2824F843M0O51k748J547q31L71m48K201K874n27l362j033J723K300p46k885k606
2807C364J104L28K226j424R58j005l132r57q63p04j846J62O30n3P21J417J005
2790A931j879j907K608M189j848m340O55l54q1j720l249j266J484J84O98J197
2774c698L895J914k642k919l837l180K902N256K984J317J529j167p22Q31j560
2759I03K8n22l502R15J524j493k914k57J507k085j050J513R49K33N57R37K841
2742H4J076J018m44J898K375n641n326J093J418K27J495k781k564k854L015J22
2726e789n7L127K034R3j687j314n38K757J933j907j336j306l121j101J970K531
2710c711J06K852J460j395K673j38m174k732k392K046J719M36K646J971q92k749
$$ y = [6843, 6883, 7534, 4786, 6333, 5502, 5873, 5425, 7626, 10500, 9973, 6611, 5578, 7301, 9601, 8855, 5970, 3364, 4468, 4796, 7022, 5598, 6556, 5551, 2419, 1462, 599, -105, -1951, -1789, -1159, -1212, -491, 926, 1931, 52, -1855, 753, 4942, 3094, -1246, -591, -945, -1026, -2746, -5995, -7261, -5777, -5593, -4895, -3698, 197, 2111, -531, -3450, -7287, -10467, -7565, -2309, 675, 1992, 3521, 2354, 1632, 2463, 903, 931, 409, -3093, -2178, -654, -2147, -5061, -5318, -3811, -5896, -6946, -5433, -4484, -4251, -3694, -2757, 84, 1160, 2178, 1734, 3632, 6007, 366, -4960, -3867, -2449, -2222, -727, -3508, -6072, -8926, -5911, -5789, -5846, -2719, -685, -592, -2279, -3593, -4131, -1374, 559, -1348, -2684, -3990, -7111, -8212, -6242, -3711, -3605, -753, 707, -688, 1985, 1847, -2327, -5059, -7451, -5405, -3686, -3250, -604, 1367, 475, -2274]
2694b274m492l258P71K436L204M13L742J194l405j812L192m09j570j613j397j07
2678e385J004M820J596L445k84m706m31R7l371k972J353J810j088k010l320j451
2662a0893M120O982L460j450k163j188k272K217J551L558j011J3k050K1K859K774
2646F528n78l840j514K22O68j591j211l11m26p84L722L963J170k037m816l367
2630d202J850J518j036K32J859J505J266p8j511j046R0j158k944K957M003K18
2614C523k425k176K533J316j619m180l583r71O22j18J411J378j086J111j93n39
2598d996J538J11N10l90M083J000j899o04j387m42K486L020j766O18j000l410
2582b528l134K318M02K068j803k067Q45K407J837j209k84q00K5o63L39K853Q07
$$ y = [-2274, -6766, -10024, -9253, -6817, -3613, -3200, 542, 1736, -1669, -3481, -289, -698, -2268, -3881, -5278, -5385, -4381, 439, 2035, 5480, 5196, 490, 59, 156, -3215, -6187, -4834, -3024, -4112, -6122, -9442, -10893, -6773, 209, 3669, 2219, 56, -1132, -3404, -1187, 364, 3922, 2911, 2924, 874, 895, 3754, 6528, 5950, 2110, 596, 818, 1486, -105, -1316, -1627, -2053, -2837, 885, 4848, 6018, 3981, -835, -4202, -2352, -834, -1870, -1638, 221, 1726, 2992, 2914, 1403, 357, 447, -711, -3655, -698, 3305, 3523, 1098, -1078, 1455, 2771, 1152, -3028, -6611, -7582, -6960, -7078, -5667, -4289, -5375, -4264, -4457, -4996, -3458, -3347, -2837, -3227, 856, 1856, -43, -647, -2034, -2476, 10, 3030, 1264, 1882, 882, -2528, -5662, -3344, -2942, -874, -2677, -4744, -3899, -1492, 345, -864, -1148, -1948, -1923, -2586, -2247, 606, 1413]
2565A413j798k891K363m31n21K567P10p93R03l113l446n35m3j283K726K96J035
2548b841L596K723k588j277O67r06J587J195m017j036M05j94J917J177J005J490
2532B903k416j429r70j125L219k977o62l44J506M542N83m33K871L710k75k887
2516E816k64k718k977R74J608K185j907k823k562J278M07J082j698J005j453K261
2500B14K077l466q70J456J457j612J659M251m82O01j672J396q02o168k356M816
2484D99K011m047Q41k869j570M660q48k913L087K399J325r88l052J078m13k402
2468c202l24J833J007J489J57p15j148j0p1J228j777M83j90J046j705r05k75L905
2450H26r07k265j190k62K316L316k79m519l861R51M37M176J61R08j368l95J468
$$ y = [1413, -385, -3276, -913, -1344, -1865, 702, 1412, 619, 1522, -1591, -5037, -5572, -5615, -6898, -4172, -3876, -2841, 755, 3478, 890, -387, 280, -626, 961, 2156, -1861, -2897, -2492, -2686, -769, 408, 1413, 2903, 487, -942, -1912, -3037, 182, -2795, -3457, -3801, -2295, 2247, 2830, 2397, 5268, 8978, 8703, 5816, 5552, 2834, -143, 831, 2439, 4624, 2717, -106, -2668, -1390, -983, 99, -1599, -594, -2047, 214, 2291, -1175, -2045, -589, 868, -744, 915, 5166, 4684, 5285, 3613, 5009, 4207, -1961, -4317, 499, 2510, -1537, -696, -3565, -5135, -475, -1323, -4236, -1149, 1250, 2575, 1587, -1465, -387, -800, -3202, -3526, -1693, -686, 803, 960, 245, -903, -913, -984, 244, -1533, -1050, -1240, -194, -1899, -2804, -3079, 826, -81, -2346, -3536, -3798, -1482, 1834, 1555, -2964, -6825, -5874, -5437, -1261, -1100, -192, -1560, -1955, -487]
2433d87k740k934N25M897K723K837k130l726k228l65K490K042K7l07J321N59l858
2416a354k421k27J910M510J018J053j751j983k993k372j435n99L579P33J171K191
2400A030J864m479j492N18j698O1n38N26r43L103K969J797p97q12j045k891o96
2383c523N54L374o36J20K839m05n6m33N91m07p37k764j201K814K939j432j475
2366A62K687n66j121M86j676l52K333j669j287M48J924k455j408Q44J978k362
2350b034r48K477J798l810J425J425L558L50o74k62M68J888P20l379N39J250K778
2333G569j680l921q25k48j375j186J119K585J597l180J086R6k06n33l654m568
2317g324j555L831K80j556M338K315L29K838K885M76j012k17j231R72J009l878
$$ y = [-487, -3227, -6161, -5636, -739, 1984, 4821, 2691, -1035, -3263, -3628, -1138, 904, 931, 624, 1945, 2504, -1354, -3775, -4002, -2092, 2418, 3436, 4489, 2738, 755, -2238, -4610, -6045, -6644, -3065, -2332, -1161, 1030, 2894, -1585, -3077, -2559, -4257, -4196, -4734, -4208, -5151, -2048, 921, 2718, 1921, 1109, 64, -2827, -3523, -2969, 405, -231, -111, 2728, 2323, 2267, 1834, 2425, 2018, 1281, -1483, -2684, 130, 3069, 1637, 162, 2849, 2283, 1162, 1648, -28, -380, 1953, 284, -1003, -555, 1369, -1086, -2494, -1650, 328, -2034, -2982, -505, 1293, -2517, -1092, 333, 3891, 4241, 3567, 3305, 3773, 5661, 6381, 3002, 3541, 4791, 7569, 5889, 1968, 1143, 895, -480, -1666, -547, 2038, 3635, 455, 1541, 1637, 1431, 898, -2756, -7324, -8879, -5048, -4768, -6324, -1986, 329, 658, 3496, 6381, 6857, 5845, 5628, 4397, 5369, 6378, 2500]
2301B500j121j935n85j869J480K936K133J272m07k95k451j595j347j635k63J707
2285a475n05k59M28j366K004J567R53J351N44J17l901N09j05l685J436R53J022
2268d12m97q48j096K088K465L317j188l524j59l78q98j472P38L590k70j544q82
2251i70K133P05J455k001j042k917k617J488N081J587K4k063p29J629n11L92r48
2234F96l149J470J991l205j349J879P67p61J306q04j518j24M421J804p1l40j463
2217A550K41Q30k318J94L757J459m679j673J160J405J806N98k682k196m05k262
2201c215j142L124J661J278j192k538J497j555m222O2M205R37j648j316M641J281
2185A858j438k318k979n18M260M247j789k480k196N24M088L571L47k413k442j494
$$ y = [2500, 1379, -556, -1141, -3010, -1530, 1406, 3539, 4811, 4404, 4109, 1658, 63, -1284, -2919, -3182, -1475, -1980, -2239, -1811, -3177, -1173, 394, 1347, 2698, 3242, 3359, -542, -33, -138, -3823, -2387, -1434, -412, -909, -1757, -2853, -765, 1700, 5017, 3829, 305, 146, -232, -1130, -2602, -1864, 1726, 1456, -88, -970, 1163, 1868, 3323, 1322, 280, -2637, -5254, -3766, 1315, 2902, 2926, 863, 134, 1763, 1252, 1644, 696, -2453, -983, 1008, -2197, -3546, -1667, -900, -1661, -355, -1159, -2677, -2801, 1620, 3424, 3353, 3013, 1550, 1791, 2621, 303, 497, 4254, 5713, 1034, -639, 521, 1926, 3732, 4330, 1648, -548, -953, -3215, -4357, -1233, 428, 1706, 514, -2024, -527, -2082, -6304, -6242, -2037, -1100, -2748, -4064, 577, 1858, 420, -1898, -4877, -5395, -1135, 3112, 1323, -1157, -3353, -2829, 1259, 4830, 5177, 2764, 322, -1172]
2169a172M08j440J70J161r09j142j31j64J696p46L011N87j299k344k347J36R51
2152c574p36N93K847K930N188L377j424J222r0o932n197m51J546K047j424L14
2136B36L230o95l120J924j832j232j208j379q20M111K171l066j388j207J893J360
2120a022J577j188m397K041Q95R4j9M20j85K064L834j653k124J590K3k809o01
2103a460j091n20M038j577k849J501j60p58n14J354J795j211J568k69l37J246
2087G56J639j307j063J663j67P3j087k149O54M8P33L50k899j705P72N15J26Q42
2069b206M087L003P17J814l013m237Q44M70L183J15K68l134o519j145p4K770J956
2052a101k433j703J012L013J191rN21L1j712j120J467K837j889k954P86L283M12
$$ y = [-1172, -764, -2204, -2034, -873, -1782, -2924, -3055, -3219, -1523, -2269, 742, 1329, 30, -2314, -4661, -4525, -3574, -4310, -3717, -870, 2060, 7248, 10625, 9201, 10423, 10333, 3401, -1796, -2247, -701, 1346, -78, 236, 3466, 2771, -349, 1575, -257, -1489, -2697, -4076, -4896, -785, 1386, -1680, -3068, -4275, -2382, -1022, 555, -633, -5030, -2989, -2094, -2000, -2019, -1599, -1784, 280, 4114, 2461, 337, 1927, 1950, -859, -1460, -2551, -3071, 967, -610, -3459, -1958, -2118, -2876, -3390, -2036, -241, -1452, 116, -153, -490, 756, 2395, 1088, 25, 1688, 1521, 1594, 507, -1642, -988, -940, -207, 143, -2756, -4461, -3689, -3174, -3048, -2206, 1881, 4884, 5601, 7415, 4402, 165, 1009, 1479, 4662, 4777, 5045, 1911, -4608, -5753, -5827, -3057, -1101, -3534, -5237, -4225, -1212, -21, -30, 491, 522, -1190, -2310, -843, 1994, 105, -2849, -2063, 1220, 1632]
2035A632r91l81L59J19n28J506K837J486K190j230k271l579l381j15j698n67N32
2018d080M323J738l09j342o71j72j174k305q57q66K607M578O05k91l196r75j914
2001d301l87M86j29j64l59K668J294O43M177O12m583m347q12L130L820j531j260
1984a043J185M04j026N760J075j613m63j825l18K238k93N44K044p78j621K375
1968F645l934j043J884M87n057p55J0K116L215jk104l58k816k709M44L144K606
1951A774k542O45J111J753l7L00l025l41J467p11j85l9j555K10N56j98j338K403
1933B48L502K352l4l027k455J102K569m98m987m21j372L079J791j61J28K11j856
1916A71J6K952N49K416k671k092P46j75p99m298k938K058j525K83L496K39m59
$$ y = [1632, 641, 260, 619, 738, 210, 1716, 4553, 6039, 8229, 6999, 4728, 1149, -2232, -2347, -4045, -4612, -4080, 243, 1981, 1672, 330, -341, -513, -1687, -3992, -4849, -5715, -3108, 1470, 2075, 1784, -1412, -2387, -4301, -4688, -4202, -4331, -4495, -4854, -2186, -892, -249, 3928, 4540, -43, -4390, -5202, -2072, 1748, 217, -1043, 142, 546, -480, 5280, 6355, 4742, 4279, 2454, 2136, 4374, 4081, 4625, 6669, 5891, 4270, 6645, 2711, 1668, 3552, 4039, -1018, -1773, -1763, 353, 3568, 3567, 1463, 1105, -1711, -4420, -3976, -832, 1774, -768, -123, 988, 2741, 2704, 3004, -21, -362, 1105, 394, 209, 170, -1385, -1175, -619, -817, -2155, 248, 3750, 6102, 6068, 3041, 586, 1688, 4257, 3759, -1228, -1649, -3021, 58, 1849, 1688, 1816, 2027, 171, 187, 3139, 3688, 6104, 3433, 1341, 2087, 1912, 1113, -3185, -6123, -4065, -5590, -5307, -1811, -1572, -2031]
1899b031M18rn02j453R5K576K631N79k229m186k21J099o78O4J660K235J107k126
1881i71k626j275L103L833n02k14k053j822J929j590q48J83j758k077R51M174
1865a563L509J133m779L439J915o24O94L313Q31m076l743K51J373J643j403j795
1849A18k789J235q64J45P26O2J267M207k599J476L0J088K142j695K260j711j560
1832C538L2j992K1K240l813k569j092j477j811N701K541J544K49J612p39j827
1816B158J07P50J346K75j433k809l198j425j308J002L880K557j609r85L127l914
1800a479p22r68m93j158r66j372l02Q2J943O78L763M09m798q53L581M696J263
1783C304l464O1o46K13K176K307j48l298j422k491J625L318L591N48l539l250
$$ y = [-2031, -1613, -1622, -2124, -3577, -3482, -906, 1725, 2304, 75, -4111, -4332, -3233, -3911, -3847, -2187, 48, 1155, -971, -3597, -4872, -1769, 2064, 1562, 1348, -705, -2527, -598, -2188, -3036, -2853, -4611, -6688, -5737, -1563, 1946, 3079, -1700, 1739, 3654, 3030, 3724, 7037, 7868, 3792, 49, 300, 1673, 3316, 1913, 118, -2671, -1436, -2300, -2155, -1429, -1367, -100, 4107, 1508, 2984, 3014, 4102, 6244, 4549, 6809, 5098, 3538, 3570, 1578, 1599, 3839, 26, -2543, -3635, -5112, -6923, -1222, 1319, 2863, 3112, 4724, 3985, 2158, 2265, 3015, 4361, 4636, 3203, 394, -2804, -4229, -5537, -4535, -655, 1902, 293, -692, 2435, -1479, -2201, -3169, -3662, -4820, -5786, -7158, -7460, -7378, -5435, -4757, -994, -585, -5383, -6236, -2655, 2041, 3304, -160, -99, -745, -532, 1644, 3951, 3803, 505, -917, -3408, -1783, 1535, 5126, 5674, 2135, -1115]
1767a115o2j259j015m57L028k341k014j002L688N83K1L451K717Q5k577J24L094
1750D949j957K360J981k796l429Q70K732J446k240j138j82m143q38J817j81j0
1734g59j28k478K101J321P87l384M8J213j096l65K049K606J491J93O07N29j267
1717C468r02K921j204m650m681M142K438p4l443J027J882K684j450l107k620P12
1701b857L297P0l054l357j467J881J486m96J270K223M23o94o70M14J432N09J801
1684B211p4j093k95j784j679n46q36K167K987K005p23J567M62j067p36K92j809
1667A049j232L46J103P49k145o58k795O78J392J710K432J365K41l887l049J701
1651a000K70J317J216J827m039j548q55K788O78L52K918J480k705n679J192L963
$$ y = [-1115, -1177, -2436, -3451, -3908, -880, -3221, -5235, -6237, -2549, -1966, -1945, 1506, 4223, 4308, 1731, 1855, 4949, 2992, 5352, 7333, 4537, 1108, 1978, 4710, 6156, 3916, 2778, 2596, -1547, -2385, -568, -749, -759, -887, -3365, -1264, 57, 844, -2540, -2492, -1279, -2375, -2740, -691, 1915, 3406, 3599, 4206, 4735, 3468, 2566, 5487, 4283, -367, -5048, -906, 1532, 1458, -1985, -958, 924, 3608, 2158, -949, -3569, -2857, 440, 510, -2544, -5901, -7368, -5487, -4001, -4497, -3227, -1004, -581, -1275, -1945, -1531, -99, 410, 2211, 2137, 1044, 749, -1035, -2714, -3260, -4096, -1929, 1058, 3063, 2340, 3907, 4369, 3302, 2566, 2858, 1049, -183, 163, 1266, 2015, -130, -788, -3583, -2905, -1513, 197, 2629, 3994, 4235, 348, -2701, -1000, -730, 587, 1803, 3630, -409, -1957, -2812, -24, 654, 1006, 3924, 5404, 2699, -2980, -1788, 2175]
1635B175J955j282m31j224l313J27K918R62m942n00J379J445J251J586J428j774
1619A760k093j546n63j83M636R19q58J503j110J11j257j019J726Q40K36M42K223
1602E767m34j688n37q43m83O01J293J210k237j42J754J119k185l223j29M879L018
1585G740j481k422o39j723j126m20j046K351K055R23R41k78P23L55K854k994m98
1568E315j774M74n376J99K952J896l828m210J03K038L813K642j770l320k889j376
1552e111R75O94J454O271P89l582l77m88K55R18j38O88O40J74j056n23O36J258
1534C477K794j111k318O97j740k604j834J964L011L34K013K052Q69J747r23l776
1518D652k988J830K767q10j919j60m428j028J473k19L90r40j090O180M15J596
$$ y = [2175, 4130, 2848, 2417, 1193, -2120, -1993, 925, 1887, -3055, -3555, -2176, -731, 520, 2106, 3534, 1760, -333, -1879, -2442, -2625, 2011, 2930, 2072, 3575, 2465, 2576, 1319, 300, 2026, 2866, 3102, 3544, 5767, 5333, 3645, 3108, 2265, 1782, 2383, 3676, 4886, 2649, 2507, 4261, 5380, 3195, -28, -157, 4722, 7740, 6259, 3837, 3198, 1475, 349, -71, -1117, 1234, 3289, 4212, 5153, 4875, 5598, 5953, 8807, 5813, 5315, 3541, 4015, -1361, -1162, 1790, 3686, -142, -4352, -4249, -2211, 1602, 4244, 2474, -846, -3735, -5111, -4136, -3442, -1988, 4283, 5072, 1490, 1113, 625, 880, 1798, 1660, 2348, 2988, 3162, 2106, 1583, 2219, 3477, 6271, 5160, 2842, 3539, 1799, -805, -2639, -675, 2336, 2670, 4683, 6735, 7604, 9351, 8428, 4652, 1664, 3494, 6261, 5451, 3532, 3372, -1056, -2084, -611, -830, -440, -1380, -2470, 3710, 4125, 5721]
1502E721J683j548j335k484J809P55k793J233K885J20k795n758R89K442l85j519
1486i80J926j419M55k859l889j253J334L27K228m14Q06M524J492R96n39N14j205
1469B044k816j709R10M278K69j992M314K005n634l359m073J046N500J256k905
1454h66j770j134k31K341J07J275K406J157m7n46l771Q37L518J985K286l888m90
1437C169k686Q93K735L135j332n39K465k457m76J175j016k403l909J618N562K063
1421G997m311l084J460r05l069K999K375n342j075K788k354K75J440K386l22O79
1405A937K685J296N72j098j496M34l86k67Q24n086l579q04L235L121R8k122j362
1388a998P36R03O53J227J320k75%k034r11R56m94j757j486L603K004K531l121
$$ y = [5721, 7404, 5856, 4521, 2037, 3846, 4601, 1808, 3041, 5926, 6046, 3251, -2507, -1518, 924, 539, -980, 946, -473, -18, -2877, -6766, -8019, -6685, -6358, -4130, -4544, -3738, 786, 2278, 3274, 2735, 3249, 2044, -772, -2481, -1571, 2707, 2976, 984, 5298, 7303, 1669, -1690, -5763, -4717, 783, 2039, -866, -2636, -3770, -4001, -1660, -1553, -278, 2128, 3285, 3238, 2692, -1079, -242, 3276, 5261, 7547, 3659, 3169, 483, 1376, 4111, 7246, 5914, 5375, 7840, 5383, 4907, 6082, 5066, 2663, -1246, 372, 5934, 7997, 3686, 602, 2062, 1157, -1912, 1087, 3462, -1880, -2955, -167, -2521, -2246, -806, 1580, 1258, 1937, 4622, 5918, 6490, 5392, 3896, 4330, 3944, 3677, 4501, -585, -4164, -4968, -1733, 1388, 1486, -636, -1998, -1262, -359, 294, 1521, 2841, 2566, 2566, 532, -379, 577, 83, -1674, -3160, 443, 2447, 4978, 1857]
1371A857j549j47R02R43J598r70k189k038O03j105m665R02J245k682K41o45M739
1354b960J146J67j9j113J750J971N88L92J368j539k62j651j24J96K05R90J229
1337B334j159k990Q53l25j975K217J076m143j390j76l420K81K576M000J513k116
1321b844L34j2P46j455K662J531J11l68N29o63K326L281k208K057j655k358o00
1304A414l86J792L356K938l562k795Q3p86J312Q66k861L26j471J856K780O15n27
1287D950l355l429j02M191j46J178j015j689K55P26j650j5q18k126K935j793j335
1270c238J59L211N011K195k072o75K26j679j182L10J388q67M54k32j318j399K52
1253E44q29nr34l683N6N36K950L239O37Q8k766l59J148k115J88K323K913j986
$$ y = [1857, 308, 161, 1063, 2006, 3604, 2634, 445, -1593, -990, -2095, -6760, -5858, -4613, -7295, -7054, -7699, -2960, -1814, -1647, -1666, -2779, -1029, 942, 1530, 1922, 3290, 1751, 1489, -162, -286, -90, 115, 1105, 2334, 1175, -1815, -962, -1287, -3262, -1045, 31, -4112, -5502, -5678, -9098, -8817, -6241, -2241, -728, -2844, -2510, -2522, -1776, -3231, -569, 962, 1073, 705, 1234, 571, 2897, 6178, 3970, 6027, 4372, 2014, 1414, 1028, 2820, 6176, 9114, 5552, 2757, 2840, 2054, 3366, 4232, 1371, 1697, 226, 2082, 4862, 5477, 4950, 1595, -1834, -1936, 2255, 2109, 3287, 2272, 583, 838, 1564, -86, -101, -919, -3045, -110, -1903, -3238, -3079, 132, 5143, 7338, 5266, 4591, 4817, 3138, 1956, 2266, 3654, 2787, 3241, 3009, 1691, 292, 544, -285, -290, -1224, -4907, -4851, -4315, -1365, 1874, 2511, 2599, -167, -526, 622, -1493, -1305, 1018, 3931, 1945]
1235A945m125j662j07J742L856m45l335J275K603l178j494J86K102N123m484l340
1219c338K828P51k886j224o38J273N272L898l030L50L93L17P01j013m26q48l057
1202f77k413N60K042O52J359K590l050n112j349K029J420J638M48N88J693L60
1186B778l93L994P63k4k550J6K113j122k922j938J310n1J222R02j022k373k313
1169a610k46K309P82O04k809k162J40J503j39j172l6r64j260M887L254J18J47
1152C346p53k70l063J022J640J600j793J093R84j518n377r58J250K990k999l775
$$ y = [1945, -2180, -3842, -3949, -2207, 1649, 1204, -2131, -856, 1747, -1431, -2925, -2739, -637, 4486, 2, -3338, -510, 241, -2645, -3869, -4507, -3234, 2038, 5936, 2906, 3256, 3649, 3966, 4667, 3654, 3228, 2380, -677, -3090, -2530, -488, 164, 1523, 4113, 1063, -4049, -5398, -3369, -1949, -311, 137, 725, 2418, 2778, 2385, 6379, 7142, 7118, 4568, 4584, 6697, 5575, 2653, 715, 2025, 1974, 3196, 4098, 3076, 703, -1610, -1856, 453, 1235, 1839, -970, -3132, -2992, -1489, -1628, -2800, -2836, -3800, -5060, -173, 3081, 3199, 3346, 2593, 2323, -740, 282, 1922, 3522, 1729, 2822, 3806, 2288, -3089, -4047, -2797, 193, -2806, -6581]
$$ [...]
##END NTUPLES=NMR SPECTRUM
##END=
