##TITLE=Analysis number 327435
Compound Code spb 04448
Book Reference 197118
Project Code adrs flr03
Chemist Name jom
##JCAMPDX= 6.0         $$ Bruker NMR JCAMP-DX V2.0
##DATA TYPE= NMR SPECTRUM
##DATA CLASS= NTUPLES
##ORIGIN= Bruker BioSpin GmbH
##OWNER= nmr
$$ XWIN-NMR		Version 3.5
$$ Fri Mar 23 12:30:06 2007 GMT Standard Time (UT+0h)  MAYBRIDGE\nmr@NMR_250MHZ
##.OBSERVE FREQUENCY= 250.131544655141
##.OBSERVE NUCLEUS= ^1H
##.ACQUISITION MODE= SIMULTANEOUS (DQD)
##.ACQUISITION SCHEME= undefined
##.AVERAGES= 16
##.DIGITISER RES= 18
##SPECTROMETER/DATA SYSTEM= dpx250
##.PULSE SEQUENCE= zg30
##.SOLVENT NAME= DMSO
##.SHIFT REFERENCE= (INTERNAL, DMSO, 0, 16.522)
##AUDIT TRAIL= $$ (NUMBER, WHEN, WHO, WHERE, WHAT)
$$ ##TITLE= Audit trail, XWIN-NMR		Version 3.5
$$ ##JCAMPDX= 5.01
$$ ##ORIGIN= Bruker BioSpin GmbH
$$ ##OWNER= nmr
$$ C:\u/data/dgb/nmr/ADRS/1810/pdata/1/auditp.txt
$$ ##AUDIT TRAIL=  $$ (NUMBER, WHEN, WHO, WHERE, WHAT)
(   1,<2007-03-23 12:29:42.08 +000>,<MAYBRIDGE\nmr>,<NMR_250MHZ>,
      <created by zg, POWCHK disabled, PULCHK disabled
       configuration hash MD5:
       49 4B E0 1D 92 C2 6B 37 9F E6 65 BC 52 41 86 1D
       data hash MD5: 64K
       70 71 15 96 56 B5 1E 98 22 8A 37 E1 15 47 0E 10>)
(   2,<2007-03-23 12:29:56.83 +000>,<MAYBRIDGE\nmr>,<NMR_250MHZ>,
      <Start of raw data processing
       ef LB = 0.3 FT_mod = 6 PKNL = 1 SI = 32K 
       data hash MD5: 32K
       42 BA FC E2 84 3B E1 18 4B 5F FD 5F 76 00 3E A5>)
(   3,<2007-03-23 12:29:58.43 +000>,<MAYBRIDGE\nmr>,<NMR_250MHZ>,
      <apk 
       data hash MD5: 32K
       F6 A5 42 5A A3 25 4C 89 95 DC AD D5 BC 0F FF 6E>)
(   4,<2007-03-23 12:29:59.24 +000>,<MAYBRIDGE\nmr>,<NMR_250MHZ>,
      <abs ABSG = 5 
       data hash MD5: 32K
       C0 99 A2 30 CE 6E 5A 67 95 04 27 C1 78 DB 16 46>)
$$ ##END=
$$ 
$$ hash MD5
$$ C6 11 5B 2A A6 27 D0 B8 14 15 A6 20 01 F5 2D 36
##$RELAX= 
##$RELAX= 
##$RELAX= 
##$RELAX= 
##$RELAX= 
##$RELAX= 
##$RELAX= 
$$ Bruker specific parameters
$$ --------------------------
##$DU= <C:\u>
##$EXPNO= 1810
##$NAME= <ADRS>
##$PROCNO= 1
##$TYPE= <nmr>
##$USER= <dgb>
##$AMP= (0..31)
100 100 100 100 100 100 100 100 100 100 100 100 100 100 100 100 100 100 
100 100 100 100 100 100 100 100 100 100 100 100 100 100 
##$AQSEQ= 0
##$AQ_mod= 3
##$AUNM= <au_zg>
##$AUTOPOS= <33 >
##$BF1= 250.13
##$BF2= 250.13
##$BF3= 250.13
##$BF4= 250.13
##$BF5= 500.13
##$BF6= 500.13
##$BF7= 500.13
##$BF8= 500.13
##$BYTORDA= 1
##$CFDGTYP= 0
##$CFRGTYP= 5
##$CHEMSTR= <none>
##$CNST= (0..31)
1 1 145 1 1 1 1 1 1 1 1 1 1 1 1 1 1 1 1 1 1 1 1 1 1 1 1 1 1 1 1 1 
##$CPDPRG= <>
##$CPDPRG1= <>
##$CPDPRG2= <>
##$CPDPRG3= <>
##$CPDPRG4= <mlev>
##$CPDPRG5= <mlev>
##$CPDPRG6= <mlev>
##$CPDPRG7= <mlev>
##$CPDPRG8= <mlev>
##$CPDPRGB= <>
##$CPDPRGT= <>
##$D= (0..31)
0 1 0 0 0 0 0 0 0 0.06 0 0 0 0 0 0 0.0002 0 0 0 0 0 0 0 0 0 0 0 0 0 0 
0 
##$DATE= 1174652980
##$DBL= (0..7)
120 120 120 120 120 120 120 120 
##$DBP= (0..7)
150 150 150 150 150 150 150 150 
##$DBP07= 0
##$DBPNAM0= <>
##$DBPNAM1= <>
$$ [...]
##$SUBNAM7= <"">
##$SUBNAM8= <"">
##$SUBNAM9= <"">
##$SW= 20.6930455092707
##$SWIBOX= (0..15)
0 0 3 0 0 0 0 0 0 0 0 0 0 0 0 0 
##$SW_h= 5175.983436853
##$TD= 65536
##$TD0= 1
##$TE= 683.16
##$TE2= 300
##$TE3= 300
##$TEG= 300
##$TL= (0..7)
0 120 120 120 120 120 120 120 
##$TP= (0..7)
150 150 150 150 150 150 150 150 
##$TP07= 0
##$TPNAME0= <>
##$TPNAME1= <>
##$TPNAME2= <>
##$TPNAME3= <>
##$TPNAME4= <>
##$TPNAME5= <>
##$TPNAME6= <>
##$TPNAME7= <>
##$TPOAL= (0..7)
0.5 0.5 0.5 0.5 0.5 0.5 0.5 0.5 
##$TPOFFS= (0..7)
0 0 0 0 0 0 0 0 
##$TUNHIN= 0
##$TUNHOUT= 0
##$TUNXOUT= 0
##$USERA1= <user>
##$USERA2= <user>
##$USERA3= <user>
##$USERA4= <user>
##$USERA5= <user>
##$V9= 5
##$VALIST= <valist>
##$VCLIST= <CCCCCCCCCCCCCCC>
##$VD= 0
##$VDLIST= <DDDDDDDDDDDDDDD>
##$VPLIST= <PPPPPPPPPPPPPPP>
##$VTLIST= <TTTTTTTTTTTTTTT>
##$WBST= 1024
##$WBSW= 4
##$XGAIN= (0..3)
0 0 0 0 
##$XL= 0
##$YL= 0
##$YMAX_a= 207309
##$YMIN_a= -281516
##$ZGOPTNS= <>
##$ZL1= 120
##$ZL2= 120
##$ZL3= 120
##$ZL4= 120
##$ABSF1= 16.522
##$ABSF2= -4.171173
##$ABSG= 5
##$ABSL= 3
##$ALPHA= 0
##$AQORDER= 0
##$ASSFAC= 0
##$ASSFACI= 0
##$ASSFACX= 0
##$ASSWID= 0
##$AUNMP= <proc_1d>
##$AZFE= 0.1
##$AZFW= 0.1
##$BCFW= 0
##$BC_mod= 0
##$BYTORDP= 0
##$COROFFS= 0
##$CY= 12.5
##$DATMOD= 1
##$DC= 0
##$DFILT= <>
##$DTYPP= 0
##$F1P= 14.0000005364418
##$F2P= -0.99999901652339
##$FCOR= 0.5
##$FTSIZE= 32768
##$FT_mod= 6
##$GAMMA= 0
##$GB= 0
##$INTBC= 1
##$INTSCL= 1
##$ISEN= 128
##$LB= 0.3
##$LEV0= 0
##$LPBIN= 0
##$MAXI= 10000
##$MC2= 0
##$MEAN= 0
##$ME_mod= 0
##$MI= 0
##$NCOEF= 0
##$NC_proc= -5
##$NLEV= 6
##$NOISF1= 0
##$NOISF2= 0
##$NSP= 0
##$NTH_PI= 0
##$NZP= 0
##$OFFSET= 16.522
##$PC= 1
##$PHC0= 219.2691
##$PHC1= 7.202712
##$PH_mod= 1
##$PKNL= yes
##$PPARMOD= 0
##$PSCAL= 4
##$PSIGN= 0
##$REVERSE= no
##$SF= 250.13
##$SI= 32768
##$SIGF1= 0
##$SIGF2= 0
##$SINO= 400
##$SIOLD= 32768
##$SREGLST= <1H.DMSO>
##$SSB= 0
##$STSI= 32768
##$STSR= 0
##$SW_p= 5175.98343685301
##$SYMM= 0
##$S_DEV= 0
##$TDeff= 65536
##$TDoff= 0
##$TI= <Analysis number 999999
Compound Code 99
Book Reference 9
Project Code 9>
##$TILT= no
##$TM1= 0
##$TM2= 0
##$TOPLEV= 0
##$USERP1= <user>
##$USERP2= <user>
##$USERP3= <user>
##$USERP4= <user>
##$USERP5= <user>
##$WDW= 1
##$XDIM= 32768
##$YMAX_p= 598494919
##$YMIN_p= -533294
$$ End of Bruker specific parameters
$$ ---------------------------------
##NTUPLES= NMR SPECTRUM
##VAR_NAME=  FREQUENCY,     SPECTRUM/REAL,   SPECTRUM/IMAG
##SYMBOL=    X,             R,               I
##VAR_TYPE=  INDEPENDENT,   DEPENDENT,       DEPENDENT
##VAR_FORM=  AFFN,          ASDF,            ASDF
##VAR_DIM=   32768,         32768,           32768
##UNITS=     HZ,            ARBITRARY UNITS, ARBITRARY UNITS
##FACTOR=    0.157963299565203, 1,           1
##FIRST=     4132.6476996994, 0,             0
##LAST=      -1043.33573715361, 0,           0
##MIN=       -1043.33573715361, -533294,     0
##MAX=       4132.6476996994, 598494919,     0
$$ Real data points
##PAGE= N=1
##DATA TABLE= (X++(R..R)), XYDATA
$$ [...]
23022G659158J42361M4117J11954R7047N3076J36186L46322K56195M1908P5952
23012H964276N1264J46794J2818J86226M00884K53514K21175J64015J65267K29772
23002A0796005J37626P9976J51342K74244J35744J69226K41083K22698K48898
22993A2456842J80320K21319J95570L70552K83815K65557L47747L88599L37010
22984A5047331L29869K31563L02936L94946M15143L20882K51633L64443L69933
22975A8028679L41481L90328M57801M85821N07739M70966L59406L62820N24204
22966B1929245N02674N65237N57518N33263O24996N74793L72190O40814O67266
22957B6967996O91705P07167O36386P75923P51769N78521O47344O63460P09444
$$ y = [7659158, 7801519, 7845636, 7957590, 8054637, 8107713, 8243899, 8590221, 8846416, 8888324, 8964276, 9015540, 9162334, 9175152, 9361378, 9762262, 10015776, 10236951, 10400966, 10566233, 10796005, 10933631, 11013607, 11164949, 11439193, 11574937, 11744163, 11985246, 12207944, 12456842, 12637162, 12858481, 13054051, 13424603, 13708418, 13973975, 14321722, 14710321, 15047331, 15377200, 15608763, 15911699, 16306645, 16721788, 17042670, 17294303, 17658746, 18028679, 18370160, 18760488, 19218289, 19704110, 20211849, 20682815, 21042221, 21405041, 21929245, 22431919, 22997156, 23554674, 24087937, 24712933, 25287726, 25659916, 26300730, 26967996, 27659701, 28366868, 29003254, 29779177, 30530946, 31109467, 31756811, 32420271, 33129715]
22948C3129715O52376P23828P23412Q30008P81983O15456Q47693Q43210P59810
22939C9907491Q94082P87505P86128O99072O36791O93246O35407O25268P34941
22930D6399931O41150P45178O47309M83867M63029M75266M23258L48240K86012
22921E0913240L65038L42335K54274J5490L0089O7914L5979j15054j61966o7206
22911E1680133j15900j97122m76858k56304l21894m89134o35707o22044o23810
22902D7941360n59246n61477o66992p64940p91176o97168n52082o66621q07225
22893D1874433p07297o82109p46614o38773p27795p36449p71541r60704q85218
22884C5017933o88781p68263o10083o76873p24906o34475n68337o08570n87490
$$ y = [33129715, 33782091, 34505919, 35229331, 36059339, 36841322, 37456778, 38304471, 39147681, 39907491, 40801573, 41589078, 42375206, 43074278, 43711069, 44404315, 45039722, 45664990, 46399931, 47041081, 47786259, 48433568, 48917435, 49380464, 49855730, 50278988, 50627228, 50913240, 51278278, 51620613, 51874887, 51890377, 51920466, 51988380, 52024359, 51909305, 51747339, 51680133, 51564233, 51367111, 50890253, 50633949, 50312055, 49822921, 49187214, 48565170, 47941360, 47382114, 46820637, 46153645, 45388705, 44597529, 43900361, 43348279, 42681658, 41874433, 41167136, 40485027, 39738413, 39099640, 38371845, 37635396, 36863855, 35903151, 35017933, 34329152, 33560889, 32950806, 32273933, 31549027, 30914552, 30346215, 29737645, 29150155]
22875B9150155o22151o42187o49415o11332o30139n95316n98282n42829n92135
22866B3666369n88616p18425m60736k78849m02673m43322m75286m74278m54132
22857A9370052n50769l32383m63271l32831j89139l39711l84550l56660l15071
22848A6105667l41225l89479l99719k41630j95086l01237l32236k81189l05141
22839A3318725k74429k58518k55027j84632k36227k39507l04944j76601j76888
22830A1211952k00533j06779k46259j55336j35897j52585j35470j42070j98996
22821I738027k59402r9572j31189j71729r5838k17040j41535j90413j58860l01786
22811G970663k8145N0795j09285j17757j26844q3231j96701j63817j69078j91385
$$ y = [29150155, 28528004, 27885817, 27236402, 26625070, 25994931, 25399615, 24801333, 24258504, 23666369, 23077753, 22359328, 21898592, 21619743, 21217070, 20773748, 20298462, 19824184, 19370052, 18819283, 18486900, 18023629, 17690798, 17501659, 17161948, 16777398, 16420738, 16105667, 15764442, 15374963, 14975244, 14733614, 14538528, 14237291, 13905055, 13623866, 13318725, 13044296, 12785778, 12530751, 12346119, 12109892, 11870385, 11565441, 11388840, 11211952, 11011419, 10904640, 10658381, 10503045, 10367148, 10214563, 10079093, 9937023, 9738027, 9478625, 9379053, 9247864, 9076135, 8980297, 8763257, 8621722, 8431309, 8272449, 7970663, 7942518, 7993313, 7884028, 7766271, 7639427, 7556196, 7359495, 7195678, 7026600, 6835215]
22801F835215j40239r9530J8691K3016l2082j66929j77698K1224m65j76561j55440
22790E949202l9467q304n8955o9368K5262j30531j27992j03631l2787p4348j72182
22779E156899p6370R3076j638J0538n4299o4651m1559j23967j50429j9615j0079
22768D717906N566j05340j12569m5437q8269l9762K5502J14536O7763l7561j19034
22757D383301j11323j44245J6527Q0188j10649L6448o8845r2460m0131l0038j12711
22746C806062o8020r5334j21791q8115P0616P5813J8849J06153l6368j15711j50605
22735C401549j41657L6699M0001q2159l3062o8529Q389O034L8334Q1263l3119
22724C253743n8335j06368j12761L4564j34675j0339P8228P7268m8810K6171Q4714
$$ y = [6835215, 6694976, 6595446, 6614137, 6637153, 6605071, 6438142, 6260444, 6281668, 6281203, 6104642, 5949202, 5909735, 5901431, 5842476, 5773108, 5798370, 5667839, 5539847, 5436216, 5403429, 5329081, 5156899, 5080529, 5173605, 5171967, 5182505, 5128206, 5063555, 5021996, 4898029, 4747600, 4727985, 4717906, 4723472, 4618132, 4505563, 4460126, 4371857, 4332095, 4357597, 4472133, 4539896, 4502335, 4383301, 4271978, 4127733, 4144260, 4224448, 4113799, 4150247, 4081402, 3988942, 3948811, 3918773, 3806062, 3738042, 3642708, 3520917, 3432802, 3503418, 3579231, 3598080, 3704233, 3667865, 3552154, 3401549, 3259892, 3296591, 3336592, 3254433, 3221371, 3152842, 3161231, 3167265, 3205599, 3286862, 3253743, 3195408, 3089040, 2976279, 3010843, 2876168, 2865829, 2944057, 3021325, 2972515, 2998686, 3083400]
22713C083400M437j37039p1387j22566m0110N8611J8826n2781R019K14164J38749
22702C103323m5601k60718j17242j01803p3042O9409J08769m9433J4613k5068
22692B623207o7473n8058j66104k0156J24331M6344R2434l1896L1846j715j22993
22681B449767J08507M6635k00774j55368N1025K5755J08939P9309m2880o3858
22671B407057m0255M6984k2060r1971o8769J59630Q4446j17664j90998J8445m3235
22660B141610p0757J37884J28121K6721j36502j07254J6245J58691Q807L9352
22650B342918J10635P8211K4059O1075j34726n7L068k19992n1861P6631L315Q3200
22638B376476k8042n4052n8997o397K24576L04344J85507J49660M1636o3668k69759
$$ y = [3083400, 3087837, 2950798, 2879411, 2756845, 2716735, 2775346, 2794172, 2741391, 2750410, 2964574, 3103323, 3057722, 2797004, 2679762, 2577959, 2504917, 2574326, 2683095, 2633662, 2648275, 2623207, 2555734, 2497676, 2331572, 2311416, 2435747, 2482091, 2574525, 2542629, 2574475, 2572760, 2449767, 2558274, 2604909, 2404135, 2248767, 2299792, 2325547, 2434486, 2513795, 2470915, 2407057, 2366802, 2413786, 2391726, 2299755, 2230986, 2390616, 2475062, 2357398, 2166400, 2184845, 2141610, 2070853, 2208737, 2336858, 2363579, 2227077, 2119823, 2136068, 2294759, 2303566, 2342918, 2453553, 2531764, 2555823, 2616898, 2482172, 2482115, 2485183, 2265191, 2213330, 2289961, 2293276, 2376476, 2348434, 2294382, 2235385, 2228988, 2453564, 2757908, 2943415, 3093075, 3134711, 3071043, 2801284]
22627B801284j43870m8759J80549K15465J61508R2414j0211P1867r2553q2686
22617C145008j30165K1252J13445n9109j5455M9927K1943j04123n1086j01805
22607B889832j15782k78148j47125j15539r06J57784P5316o0002q8781P8160j33602
22596B261207k02519P2363j374l1883J23943K7456J6031K95r5265q4549o6791
22585B018914Q8414Q0125j6009M3322L7530N8819r3378P661Q4214M3583J0184
22574B363379Q4343j28342n9812K8381m0584R6320J03956j73675k5546J40003
22564B388423O0549k6818R2793j1960P046J59180n1003p9565J77074J09584p3066
22553B752237L0769O781r1117j07147p4793J01943R8389Q5492o6159l1519O8464
$$ y = [2801284, 2657414, 2608655, 2789204, 3004669, 3166177, 3258591, 3248380, 3320247, 3227694, 3145008, 3014843, 3036095, 3149540, 3090431, 3074976, 3124903, 3146846, 3042723, 2991637, 2889832, 2774050, 2495902, 2348777, 2233238, 2232332, 2390116, 2465432, 2405430, 2316649, 2394809, 2261207, 2058688, 2131051, 2129677, 2097794, 2221737, 2249193, 2265224, 2265519, 2170254, 2085705, 2018914, 2107328, 2187453, 2171444, 2214766, 2252296, 2311115, 2217737, 2225398, 2309612, 2353195, 2363379, 2447722, 2319380, 2259568, 2287949, 2247365, 2343685, 2447641, 2273966, 2248420, 2388423, 2448972, 2422154, 2514947, 2502987, 2510033, 2669213, 2618210, 2538645, 2715719, 2825303, 2752237, 2783006, 2789787, 2698670, 2591523, 2516730, 2618673, 2717062, 2802554, 2736395, 2704876, 2773340]
22542B773340P8370n0838k3754M2579o6333R1345O0088k4685q028O8527N6019
22531B996630k7731q0384o2274j9707m6255J00246N5002n4328o7655R5621J62354
22520C051519R9065O0025J4016o8422m8632k8326J38815P2870K220k667K7371
22509C317854m2499K4532M6716R0310J3933p806J48784J25716o3077K4130O1522
22498C740115l2323j08383N0819J72958J14956q0091K7533J61469O3881O716J45669
22487D263319O3480O3433M4482K668m1881J06970l4744M8532Q6877J2372n1087
22476D564421M5487J92515J40533K3655J4509P9744P6237n3923J8944J60275N935
22465E268332M3864K22698o6686R6249Q2661P5241Q8540j0087j6513J31266L20754
$$ y = [2773340, 2851710, 2800872, 2777118, 2819697, 2753364, 2844709, 2904797, 2880112, 2872084, 2940611, 2996630, 2968899, 2888515, 2826241, 2806534, 2760279, 2860525, 2915527, 2861199, 2793544, 2889165, 3051519, 3150584, 3210609, 3224625, 3156203, 3107571, 3079245, 3218060, 3290930, 3293150, 3290483, 3317854, 3275355, 3299887, 3346603, 3436913, 3450846, 3443040, 3591824, 3717540, 3654463, 3678593, 3740115, 3707792, 3599409, 3650228, 3823186, 3938142, 3858051, 3885584, 4047053, 4110934, 4117650, 4263319, 4326799, 4390232, 4434714, 4437382, 4395501, 4502471, 4467727, 4516259, 4603136, 4615508, 4564421, 4609908, 4802423, 4942956, 4966611, 4981120, 5060864, 5137101, 5083178, 5102122, 5262397, 5268332, 5312196, 5534894, 5468208, 5564457, 5647118, 5722359, 5810899, 5800812, 5784299, 5915565, 6236319]
22454F236319P0763L8418P6201O9020K73071J20464N2601O9323P3618k7631J43433
22443G195600K28202J27719R8960Q4893Q1058J25412q5570Q3301K58617J50031
22433H348223Q5939J67408K99485K00603J91540J61340L22795L60241K6921p3801
22423A0090694Q3248J04828J33784K72439L70262J65135J17967J17889K47822
22414A1704068J85970M08755K83763K25860K94651J78123K07509K89248L93360
22405A4171307J09772K63733L98456M76365M16552L45020L55448L45254K84874
22396A7166781N10418M36117K20416L67676M38992M01577L89896M36330M73341
22387B0841544M80281N11022M98478N32934N54275O74471N68092N40698O72147
$$ y = [6236319, 6307082, 6345500, 6421701, 6490721, 6763792, 6884256, 6936857, 7006180, 7079798, 7052167, 7195600, 7423802, 7551521, 7650481, 7735374, 7816432, 7941844, 7856274, 7939575, 8198192, 8348223, 8434162, 8601570, 8901055, 9101658, 9293198, 9454538, 9777333, 10137574, 10164495, 10090694, 10173942, 10278770, 10412554, 10684993, 11055255, 11220390, 11338357, 11456246, 11704068, 11890038, 12298793, 12582556, 12808416, 13103067, 13281190, 13488699, 13777947, 14171307, 14281079, 14544812, 14943268, 15419633, 15836185, 16181205, 16536653, 16881907, 17166781, 17677199, 18113316, 18333732, 18701408, 19140400, 19541977, 19931873, 20368203, 20841544, 21321825, 21832847, 22331325, 22864259, 23418534, 24093005, 24661097, 25201795, 25873942]
22378B5873942N88734N34599O55541N59588O59864Q31411P76326P61220N96460
22369C1837685O47676P84074O29965Q32382Q92719R26337Q34215Q72407R82807
22360C9240267Q16005O60636Q19110P78212Q14207Q73769Q57172Q31347P58162
22351D6448887P53345P67921O36685O99024N88784O11381N28915N11428M67616
22342E2013986L48037L45729L79367M16391L03866J17943J21243J4174L1290J439
22332E4093465r8590k71425k18730k60273m61023m07776k91264l15396n70235
22323E1198753o77205o88982o85831o31741o44695o99972p63249q44970p44924
22314D4817184p26654q24128p65613q49724p18910p85076r22133q04375p72440
$$ y = [25873942, 26462676, 26997275, 27652816, 28212404, 28872268, 29703679, 30480005, 31241225, 31837685, 32485361, 33269435, 33899400, 34731782, 35624501, 36550838, 37385053, 38257460, 39240267, 40056272, 40716908, 41536018, 42314230, 43128437, 44002206, 44859378, 45690725, 46448887, 47202232, 47970153, 48606838, 49305862, 49894646, 50506027, 51034942, 51546370, 52013986, 52362023, 52707752, 53087119, 53503510, 53807376, 53925319, 54046562, 54060736, 54092026, 54093465, 53994875, 53723450, 53504720, 53244447, 52783424, 52375648, 52084384, 51768988, 51198753, 50521548, 49832566, 49146735, 48514994, 47870299, 47170327, 46407078, 45562108, 44817184, 44090530, 43266402, 42500789, 41651065, 40932155, 40147079, 39224946, 38420571, 37648131]
22305C7648131p57436q71495p87147p12505p59007q46871q44393q33624q03354
22296C0432299o96020n70464p11891o61244p00184n76237m94931o76156m95324
22287B4849848n65107p69292n42234m62357n19256m93319o01916m98469m70277
22278A9927621m06833l94487n19685m38438k74299m16961m01775k98935k24969
22269A6551239l87575m51907l25888l95099l60893l10827k13287k16045j99118
22260A3690600l24081l90792j47233k00530m70908m62937k00007k7505k10061
22251A1256546j69695o0398k35103k13123j46585j01641j43151j13695k95265
22242I777890k44995k36946r1490j92424l21316k44871j44366n7521j9407j67800
$$ y = [37648131, 36890695, 36019200, 35232053, 34519548, 33760541, 32913670, 32069277, 31235653, 30432299, 29736279, 29165815, 28453924, 27792680, 27092496, 26516259, 26021328, 25345172, 24849848, 24284741, 23515449, 22973215, 22510858, 21991602, 21498283, 20896367, 20397898, 19927621, 19520788, 19126301, 18606616, 18168178, 17893879, 17476918, 17075143, 16776208, 16551239, 16163664, 15711757, 15385869, 14990770, 14629877, 14319050, 14105763, 13889718, 13690600, 13366519, 12975727, 12828494, 12627964, 12157056, 11694119, 11494112, 11466607, 11256546, 11086851, 11026453, 10791350, 10578227, 10431642, 10330001, 10186850, 10073155, 9777890, 9532895, 9295949, 9204459, 9012035, 8690719, 8445848, 8301482, 8243961, 8224554, 8056754]
22232H056754j85979j60188j50660j17189n4903o1265j45740k85255m0391n4411
22222F800773j88019k66467m2640n0199r6483j33927j48215J9312l9078j66140
22212E688917q1411m6464k7606j3584j28423N8510j4894n4917j34912j40644n7231
22201E047341k7088J8027k6596K3860n6520j75061j65913j12399j12067o960l2887
22190D373737Q0718n0765p326l6639k07909q2041o5306R5591M1957O5687r4212
22179D113492r3702J8594k3407j37054j16234j00118p8958J5872k56672j21713
22169C220100n770J06485O053j6337q3304j04428J8685O79J4593J36661o1792
22158C231625q5953P3914K6770o1067j5016j00586k28771j54743j9491l7977j1395
$$ y = [8056754, 7870775, 7710587, 7559927, 7442738, 7387835, 7326570, 7180830, 6895575, 6855184, 6800773, 6612754, 6346287, 6303647, 6253448, 6156965, 6023038, 5874823, 5894135, 5855057, 5688917, 5607506, 5561042, 5533436, 5519852, 5391429, 5449939, 5435045, 5380128, 5245216, 5104572, 5047341, 5020253, 5038280, 5011684, 5035544, 4979024, 4803963, 4638050, 4525651, 4413584, 4406624, 4373737, 4454455, 4403690, 4396364, 4359725, 4151816, 4069775, 4004469, 4100060, 4142017, 4207704, 4113492, 4019790, 4038384, 4014977, 3877923, 3761689, 3661571, 3582613, 3598485, 3341813, 3220100, 3214330, 3320815, 3326868, 3310531, 3227227, 3122799, 3141484, 3142163, 3156756, 3293417, 3231625, 3145672, 3219586, 3246356, 3185289, 3170273, 3069687, 2840916, 2686173, 2666682, 2628705, 2617310]
22147B617310o9875k03644l2054O80P0794J60398K7872P4616O7678j09765j15164
22136B488846k6898m9464l7418j16082n0146Q6617J9554R297J39336J26296k22102
22125B367836r8182j9536O5459j00040J6766j13217n9693L8916r5926p5835N9859
22114A986407n2679j2963R3521M0759j2069q4722j65906o5725L9308Q8753o2767
22103A791917K100J31706K7501K7537k5184j31152p0141J24540L4232r7611j34918
22092A680527l7206p1468n9059k9867K20J70900J40885m1121m7977p5386L0874
22081A661322j4940p0636N2848k2743o0982M1189o2983j9318j7831n1174p0357
22070A364395M1115M5731J47969j05537m5578J28275m9458j0184R578k0579J04547
$$ y = [2617310, 2547435, 2343791, 2311737, 2312417, 2383211, 2543609, 2571481, 2646097, 2713775, 2604010, 2488846, 2461948, 2412484, 2375066, 2258984, 2208838, 2295455, 2315009, 2324306, 2463642, 2589938, 2367836, 2269654, 2250118, 2315577, 2215537, 2232303, 2119086, 2059393, 2098309, 2002383, 1926548, 1986407, 1933728, 1920765, 2014286, 2055045, 2042976, 1958254, 1792348, 1726623, 1765931, 1854684, 1791917, 1794017, 1925723, 1953224, 1980761, 1955577, 1824425, 1754284, 1878824, 1913056, 1815445, 1680527, 1643321, 1571853, 1512794, 1482927, 1483147, 1654047, 1794932, 1753811, 1705834, 1630448, 1661322, 1646382, 1575746, 1628594, 1605851, 1544869, 1586058, 1523075, 1503757, 1485926, 1434752, 1364395, 1405510, 1451241, 1599210, 1493673, 1448095, 1576370, 1526912, 1516728, 1526306, 1505727, 1610274]
22059A610274N9950l6060M2055K41556J41463N8038o7786j32606m5686q3831n880
22048A781487L6657j595J12056j49438j50728j31637j59545l6015k0769K8323
22038A308796M282K9307K4823J9803j02312q9072L8494l7579o2285r4625k4300
22027A015332R873O0200N017j5882p4756J4263o7242O2879K6604j6036l1018j53094
22015H36140M4471J72414n6012J28798K3473o0748k04682j90615M9824L2696P0633
22004H46392O4563o4476o0959r5921l2217K22804Q3139m0810l6112L0552k7787
21993H89168j3495J10572j40545r3905N7227J18886k6969j0552K5876j07380j15364
21982F93519K765L7123r4273j13703n3604Q3930J35504K8710K3902m9947n0043
$$ y = [1610274, 1670224, 1634164, 1676219, 1917775, 2059238, 2117276, 2049490, 1916884, 1871198, 1787367, 1781487, 1818144, 1816549, 1928605, 1779167, 1628439, 1496802, 1337257, 1301242, 1280473, 1308796, 1313078, 1342385, 1367208, 1387011, 1284699, 1195627, 1234121, 1196542, 1134257, 1039632, 1015332, 1025205, 1085405, 1090422, 1074540, 999784, 1014047, 946805, 1009684, 1036288, 1020252, 989234, 836140, 880611, 1053025, 997013, 1125811, 1149284, 1088536, 883854, 693239, 743063, 775759, 846392, 910955, 846479, 785520, 689599, 657382, 880186, 963325, 922515, 886403, 916955, 889168, 875673, 986245, 845700, 751795, 809022, 927908, 900939, 890387, 916263, 808883, 693519, 696284, 733407, 639134, 525431, 471827, 555757, 691261, 719971, 743873, 693926, 643883]
21971F43883L7413J2590q8103r2030P5397M0821L458Q013N4992M2738q281Q2285
21959H13176j4670n3944k9268j47388l9269j0911K8317j108n0309j5810J72277
21948F51093m492N4515J44214K3530j60980j22935O9420p6674p8973r9361k1297
21937C78060Q2468J38757m2781j5027O0202Q1643o7717j0067K3181J15264J5610
21926G59593K977L374K9252o9388j54183m9874j3035j50015l9946K9732o7929
21915B80558k6568J85951K04576O2734o6247L0995l8330m5010j8480J9946j13924
21904D76201o4723N1438O6881k595n315J3311m5607L4828k0252q932N8402j8943
21892E34694J24031m440q8418l3434L5851q1280n4827N437R6546J12687R2247
$$ y = [643883, 681296, 693886, 605783, 513753, 589150, 629971, 633429, 641442, 696434, 739172, 730891, 813176, 798506, 744562, 715294, 567906, 528637, 517726, 546043, 544935, 494626, 478816, 651093, 646601, 701116, 845330, 868860, 707880, 584945, 654365, 577691, 498718, 399357, 378060, 460528, 599285, 556504, 541477, 601679, 683322, 615605, 605538, 628719, 743983, 759593, 762570, 765944, 795196, 725808, 571625, 521751, 508716, 358701, 318755, 348487, 280558, 253990, 439941, 644517, 707251, 641004, 671999, 633669, 588659, 570179, 590125, 476201, 411478, 462916, 529797, 527202, 521887, 535198, 489591, 524419, 504167, 495235, 553637, 534694, 658725, 654285, 565867, 532433, 568284, 487004, 432177, 437614, 534160, 646847, 739094]
21881G39094o8398O5521j12918p5441l4245j06546K2249J09020j2463k6360L3120
21870E32633n4096j02051n6303j3865J05449J03593k4466J37208j5770j05228
21860E07104j55789n6277M851J17022M8030R027K8856j79391j09168O8091J18131
21849D00487j3663j09857j0213p4024k9929J24987R9114j046n6959j48644J0900
21838A91153J63671J44233K7622k5135j17052k39548o6059J78473P7785J09056
21828D44199j9417J7252M0764k5515l8633K9100j7337j1573p7890j61071K7546
21817B07425O5166M6615N5384M2229o3863n0307N6243O0223j25140o860L3199
21806C20314M6959j28566k5380L8982R9093j09012p2529N4478L9158P614P4354
$$ y = [739094, 670696, 736217, 623299, 547858, 513613, 407067, 429316, 538336, 525873, 499513, 532633, 478537, 376486, 320183, 306318, 411767, 515360, 490894, 628102, 612332, 507104, 351315, 295038, 299889, 416911, 464941, 473968, 502824, 323433, 214265, 282356, 400487, 386824, 276967, 266754, 192730, 162801, 287788, 386902, 385856, 328897, 180253, 191153, 354824, 499057, 526679, 501544, 384492, 144944, 78885, 257358, 335143, 444199, 424782, 442034, 482798, 457283, 418650, 447750, 430413, 418840, 340950, 179879, 207425, 272591, 319206, 374590, 416819, 352956, 302649, 358892, 419115, 293975, 287115, 320314, 367273, 238707, 213327, 252309, 351402, 242390, 169861, 224339, 263497, 271111, 345465]
21795C45465j0594L437K2010J06989k6448n5810O1825l1653k7410l7465j28520
21784B21826l4341O4901r1839j25203O1429P6620Q3560J3583j28353m371J48675
21773B86487L845K0149P6720k9068l6166r1372J09161N3395j4325k02493p7488
21762I8845l2136l6245J728J37923J63172J3789r1118j10094K1615O5645k2054
21751B11070j12383j04152J16877J86180L0182j8577o7072j40555L855N4323n3212
21740A06536N5339j6930l8463R3384Q2506P4760K0704J31740j1807j68621R9896
21729D29044n68o6068k21865r1843L1455n8808J79312J56010o9517p1148p1858
21718A44146j944J76795N3336j78341j1068o670M8321P1246p427J8292L781j903
$$ y = [345465, 334871, 338308, 360318, 467307, 440859, 385049, 446874, 415221, 387811, 350346, 221826, 187485, 252386, 160547, 35344, 96773, 173393, 256953, 270536, 142183, 137812, 286487, 290332, 310481, 387201, 358133, 321967, 230595, 339756, 393151, 378826, 176333, 98845, 66709, 30464, 32192, 170115, 333287, 347076, 255958, 145864, 167479, 233124, 211070, 98687, -5465, 111412, 297592, 327774, 309197, 242125, 101570, 105425, 159748, 106536, 161875, 144945, 106482, 199866, 282372, 357132, 377836, 509576, 497769, 329148, 429044, 428476, 362408, 140543, 48700, 80155, 21347, 200659, 356669, 287152, 216004, 144146, 142202, 318997, 372333, 193992, 182924, 176254, 224575, 295821, 288394, 306686, 310467, 308564]
21706C08564J43205n5372r5460j7504m0907P8882N0334Q133k765n6613j07608
21695B12889j3818l0966P7004J42269k3387K9321l3980N279l5104J6863k3852
21684C22518j29766n6261J41764L7481n945j27473O301J15006J4883m6195l0439
21673B41874J84470P1313q8889n323r6191k7675J03206j80919M7258J80386M8582
21662D78092k8194j82082l3113R5217N1362m0217J9468n5521m0029L4300j00956
21651A98327j8149m7108j10818Q025j1230R6668J47031L3991j62375p9144k1327
21640C3891J08496J6362N9383p289o4125P2828j4475o6602j18947j67978J25781
21629b2675J87654L2326M342K6188K8145J18583p0937j71292l3672k3477N7618
$$ y = [308564, 451769, 396397, 300937, 283433, 242526, 321408, 371742, 379875, 377110, 320497, 212889, 199071, 168105, 245109, 387378, 363991, 393312, 359332, 364611, 329507, 346370, 322518, 192752, 136491, 278255, 315736, 309791, 182318, 188619, 303625, 318508, 272313, 241874, 426344, 497657, 408768, 403445, 307254, 279579, 382785, 201866, 249124, 429510, 478092, 449898, 267816, 234703, 329920, 381282, 341065, 360533, 305012, 264983, 299283, 198327, 180178, 133070, 22252, 30277, 19047, 115715, 262746, 296737, 134362, 55218, 33891, 142387, 158749, 218132, 210843, 146718, 219546, 205071, 138469, 19522, -148456, -22675, 164979, 197305, 201647, 227835, 255980, 374563, 303626, 132334, 98662, 75185, 132803]
21618A32803m1585L2505O0611O5018j09225j38579J2111l5313r991M8638k4806
21607g813L1549J32973Q6837m7017j03462K8875K6848n3929J39413M223J4665
21596B53162o360K8925n231o6831j35165l6945N469J16875P1873K5416K9100K747
21584B83035J8573L3962j16094o5629R1712P8005j80645k9903j4913M5082N5650
21573A98835M4911r4564j49878l107m0919P7198J09085O3759J19208k2859L7926
21562C39595J0084j16029m309p2596P3592J30912r852J5591j54986q9975k072
21551A19955O2846j19954j79487J81225J08123J02274J01609j35120j51567R463
21541I9367O9489J26922k9346o7439j10427o586J6328j6594j08048k2487P7741
$$ y = [132803, 91218, 123723, 184334, 249352, 140127, 1548, 13659, -21654, -31645, 16993, -7813, 23736, 156709, 243546, 196529, 93067, 121942, 148790, 94861, 234274, 238497, 253162, 246802, 275727, 270496, 203665, 68500, 31555, 37024, 153899, 225772, 251188, 280288, 283035, 301608, 335570, 219476, 153847, 245559, 323564, 142919, 113016, 98103, 143185, 198835, 243746, 149182, -696, -3803, -44722, 32476, 141561, 205320, 324528, 301669, 339595, 349679, 233650, 229341, 156745, 230337, 361249, 351397, 366988, 212002, 122027, 119955, 182801, 62847, -116640, 64585, 172708, 274982, 376591, 241471, 89904, 99367, 168856, 295778, 266432, 198993, 88566, 81980, 98308, 81714, -26334, -48821, 28920]
21530B8920J32432r933P1325L5203n0986p2022J00868J9005l7500r2020J4904
21519A40196R8632J30145n4033p7816p207j42459j36763L0926K19105J84387k6318
21508C58795q9903j3561j05669n1455P5951J21413P6590k1373n3150n5865Q4789
21497C26562M1904j42285r5718J8720p2331L340k8087J60484K2549r1880k9689
21486A13569k7279j222j4718M4263K931n2345n6967j88022o6092J31508J92365
21475G7991n0718O3951N8451k9204j01506r411J0074N1321O0647L3087j3380N4520
21463B05823P2406R1671j19576M7693j788j30070N5815P9866J1638m1868r9950
21452A71660K7631J0512J65487o5454j90246r2674j9552J01115O6047Q6164O470
$$ y = [28920, 161352, 151419, 222744, 257947, 206961, 134939, 235807, 254812, 217312, 125292, 140196, 238828, 368973, 314940, 237124, 229917, 87458, -49305, -18379, 200726, 385113, 358795, 268892, 255331, 149662, 98207, 174158, 295571, 372161, 350788, 297638, 241773, 326562, 368466, 226181, 130463, 149183, 76852, 80192, 52105, 212589, 235138, 143258, 113569, 86290, 85068, 70350, 114613, 117544, 65199, 8232, -179790, -245882, -114374, 77991, 27273, 91224, 149675, 120471, 18965, 9554, 19628, 70949, 131596, 164683, 151303, 205823, 278229, 369900, 250324, 298017, 296229, 166159, 221974, 301840, 313478, 271610, 171660, 199291, 209803, 375290, 309836, 119590, 26916, 7364, 108479, 174526, 260690, 267160]
21441B67160o1309j14506R3818O751l6718k0398N4486l872K0645l6215j2043N4685
21429B12484K3387j30750j36338p3518M5247Q0840j3937o740J2899l9115j9417
21418d4958Q7160J8967L2322j444J7112R6894M8527j32514j10392P947j3652j09370
21406a03401K9149K04807Q5391M6532Q62k8093l4740j3109k5598m3424m9862J90885
21394B59399k3045j35669r7586j5269l5255m8728J299J12009N7750Q3595P4645
21383B33145j01982k710O7884j26982l4626L6441o791K1304J0742r1488n9260
21372e4323J6108J15564O1388l2020m5832q0827K9690Q4151N9586P728K9154K1360
21360B11727L0293J3905r3681j82815K7224R4398Q9423j6106k11071r4620q784
$$ y = [267160, 205851, 91345, 185163, 191914, 155196, 134798, 189284, 185412, 206057, 169842, 157799, 212484, 235871, 105121, -31217, -104735, -59488, 21352, 7415, 675, 13574, -25541, -44958, 42202, 61169, 93491, 92047, 109159, 206053, 254580, 122066, 11674, 19621, 5969, -103401, -74252, 130555, 215946, 262478, 263340, 235247, 200507, 187398, 161800, 118376, 68514, 259399, 236354, 100685, 3099, -12170, -47425, -96153, -94854, 17155, 74905, 158500, 233145, 131163, 128453, 196337, 69355, 34729, 71170, 64379, 85683, 96425, 4937, -54323, -38215, 77349, 138737, 106717, 60885, -19942, 9748, 93899, 153485, 161213, 190367, 211727, 242020, 255925, 162244, -20571, 6653, 101051, 190474, 174368, -36703, -131323, -140107]
21349a40107r0662Q0032J97880j7971p2554k7122J07361J19950O4344j28240j35446
21338d2535m8263l6862L0394J75925Q9671j07612n6635j96454K0268M3427J20029
21327h647J10392L3870m7859j53328m9505J13816R1966R2890R6892j54866j0726
21316A14895j47712l1220o691R0063o806l5975J10759l4323m6476J33553n4942
21305H5125j43183l1959K7313M1304L3601j0657P6521M0622k855p4552N401k1627
21293B5054J506M3291k0671n2422J81634M9350j91625p0416J29692K9721O8674
21282A93788o0140j32202j85538L6882j1135l1523J51158P5997P9469P0442o2803
21271A24395r9079J12731l050n3907O1958J20284m5467n8296r3936j07079n3572
$$ y = [-140107, -230769, -150737, 47143, 29172, -43382, -70504, 36857, 156807, 221151, 92911, -42535, -90798, -127660, -97266, 78659, 168330, 60718, 4083, -192371, -172103, -128676, -8647, 101745, 135615, 87756, -65572, -115077, -1261, 90705, 183595, 280487, 125621, 114895, -32817, -64037, -70728, 19335, 12529, -23446, 87313, 52990, 6514, 140067, 85125, -58058, -90017, -62704, -21400, 12201, 1544, 78065, 118687, 115832, 41280, 46681, 25054, 26560, 69851, 49180, -3242, 178392, 227742, 36117, -34299, 95393, 125114, 193788, 133648, 1446, -184092, -147210, -158345, -189868, -38710, 37287, 116756, 187198, 124395, 25316, 138047, 134997, 81090, 143048, 263332, 217865, 159569, 65633, -41446, -95018]
21260i5018K1617j03069p1943J59446J66561Q8897r673l1784j37570N0267O4905
21249A02636j6632J1652J40656j29790k5792J30905J07037j390r5649j29779l307
21238I0547J07844j31328J2119P8777J0863K0274k2724r5100p4810j10002L3367
21227h0173L2273N9841K08122L1834j44314J3354l0044m1072l9010K2730R8257
21216A31798l2745p4094r4182O7731O5950P9975j8675j7194l2429r8186k61642
21205b83693q2240Q1919L2334J24941R5998M425k8132k8953J39085J36939M2259
21194B34882O8042K040o3243o8332j7768o5152q7770J2673J20164R3571j55528
21183G3579j51320K0329o7104j08283L9836J52173O1521R086P4339n3266r187
$$ y = [-95018, -73401, -176470, -248413, -88967, 77594, 166491, 156818, 125034, -12536, 37731, 102636, 86004, 97656, 238312, 108522, 82730, 213635, 320672, 319282, 223633, 93854, 90547, 198391, 67063, 79182, 157959, 168822, 189096, 166372, 71272, -3538, -113540, -80173, -47900, 11941, 220063, 251897, 107583, 120937, 90893, 49821, 10811, 33541, 131798, 99053, 24959, -69223, -1492, 64458, 144433, 125758, 108564, 76135, -22051, -283693, -365933, -284014, -251680, -126739, -30741, -26316, -54448, -83401, 55684, 192623, 234882, 302924, 304964, 241721, 173389, 155621, 90469, 2699, 15372, 135536, 229107, 73579, -77741, -57412, -124516, -232799, -192963, -40790, 20731, 29817, 104156, 50890, 41703]
21172D1703m8414j4388L4647k0027M398j10370L669J78337O3111q8518j55293
21161a11145m4577P5938k2835l1016N9186J60850o0128O8823N2538l8453j10272
21150a091j405o0507q4301Q5487N2162k6254Q2167k3224J7996n5479J68637L1948
21138A86136J5760M3386J0265p1006K7827q7787o2865O3063M4501q9396p4166
21127E718J31698K2837L6606p4798j24223l1291K7330L0995J00653P6989J1779
21116B14293M054L8092o2104q7403j22148P905j67472r416P7683N3053l1796O5508
21104a9751n2003n7176N0756N7446J48734J22643p259K1730P6021n1600j18375
21093A71166j04138j66213j82654L0760J58404K31499R6095N2658k2723p1050
$$ y = [41703, -6711, -21099, 13548, -6479, -2081, -112451, -108782, 69555, 132666, 44148, -111145, -155722, -79784, -102619, -133635, -74449, 86401, 26273, 95096, 147634, 109181, -1091, -2496, -63003, -147304, -61817, -9655, -35909, 46258, 23034, 41030, -14449, 154188, 186136, 201896, 245282, 255547, 184541, 212368, 124581, 61716, 124779, 169280, 79884, 5718, 137416, 160253, 196859, 122061, -2162, -33453, -6123, 24872, 125525, 202514, 214293, 218347, 256439, 194335, 106932, -15216, -7311, -174783, -184199, -106516, -53463, -85259, -19751, -71754, -128930, -78174, -20728, 128006, 250649, 243390, 265120, 341141, 289541, 171166, 67028, -99185, -281839, -251079, -92675, 138824, 234919, 287577, 264854, 193804]
21083A93804p4580p2789o5038R3995J85214J7374L5828p7015q4018q9191j13435
21072d9851N6556J94883o0581j69903r4122m3773L5200O9125J10227K0524M7603
21061A15888m5800o7157P461l2723p8177J09379m9167L2559J16423K6617Q632
21050A43935j60987q3932p526O7928J7078N3285p340o5688p3138j18530M6116
21039a88799R5449K0676J2193J29962j7004m1122q428J20755o1485j33347j946
21028g3096m1152M6387L9597O493k3546n9029q2064L5488R4145J14062K1289j66964
21016h8390M7995K3208J61898m2656k6266J786q2836o5026J56123J06694j3909
21005A78621j55975P0967q9558p0923J0388q2219M4028P2396J30869L9157k092
$$ y = [193804, 119224, 46435, -18603, 75392, 260606, 277980, 313808, 236793, 152775, 63584, -49851, 6705, 201588, 141007, -28896, -123018, -166791, -131591, -62466, 47761, 68285, 115888, 70088, 2931, 10392, -22331, -100508, 8871, -40296, -7737, 108686, 135303, 143935, -17052, -100984, -108510, -40582, -23504, 29781, 22441, -43247, -116385, -234915, -188799, -93350, -72674, -60481, 69481, 52477, 11355, 2927, 123682, 62197, -71150, -73096, -114248, -67861, -28264, -21771, -45317, -104346, -186410, -150922, -56777, 57285, 78574, -88390, -40395, -17187, 144711, 102055, 75789, 77575, -5261, -70287, 85836, 192530, 178621, 22646, 93613, 4055, -66868, -56480, -138699, -94671, -22275, 108594, 147751, 145659]
20994A45659m2868N3623J46761j38099j07119o6485O0501J15641j939l818J55992
20983C17849N4023n5262l1341m0780j44248n7055J39909J63136o3197M2831Q2271
20972D08136L7089J78294R0645r7473O4543K63298L39409L20500L58776R1716
20962B054933l16675l89142l40719k96626j03767R7829N0665R2956K69523M21675
20952A540652L24923N4399l62474n10421k87537j73170k4617k0947p0891r3786
20942C76131o1805K7078J37787j30792k1721k4797o6238j41694o2671R2411J7537
20931A41226j02073j28243q0994J27867P7247K9113j05932m6545J9687M0792l0792
20920e8647L454N8262j2923k2016J99621q7873j20562J9920J46247L9624j20286
$$ y = [145659, 102791, 156414, 303175, 165076, 57957, -8528, 51973, 167614, 165675, 161857, 317849, 371872, 316610, 285269, 244489, 100241, 43186, 183095, 346231, 283034, 325865, 408136, 445225, 623519, 714164, 616691, 681234, 944532, 1283941, 1604441, 1963217, 2054933, 1738258, 1349116, 1008397, 711771, 608004, 705833, 756498, 849454, 1118977, 1540652, 1865575, 1919974, 1557500, 1047079, 759542, 586372, 561755, 540808, 469917, 376131, 314326, 341404, 479191, 348399, 326678, 301881, 235643, 93949, 31278, 123689, 141226, 39153, -89090, -170084, -42217, 35030, 64143, -41789, -88334, -68647, -27855, -58647, -55193, 3069, -9854, -31870, 167751, 79878, -40684, -20764, 125483, 165107, 44821]
20909D4821l3649P089O057m4837m3284m1580K0078N0071K8522P2135k4577n7611
20897a6765J87293l6628j24903R8953J09837o6526r824J52293j43201j74443P5935
20886E2021J97436K63352K86806K68075J94195k77365m05033k20039m7307j0460
20876C01681P0427m6249j1198K03440K49710J13026J86846j21786l51977k79344
20866C14576j37962n8568k7675j67034l5130J6717J59151l1795N3933J4310j28557
20855b8034m4432m5093M9585R547M3707J52358k0544J2392j00796K4119j27577
20844g4768j6702j5594L4084J45755m8163j13189O4560J56702O2328j8117M1723
20833B18619k6321j38321j3890N2634n127K4094J20867p3054r3707j10915k5036
$$ y = [44821, 11172, 18261, 24318, -20519, -63803, -105383, -85305, -35234, -6712, 65423, 40846, -16765, 170528, 133900, 8997, 107950, 217787, 151261, 141437, 293730, 150529, -23914, 52021, 249457, 512809, 799615, 1067690, 1261885, 984520, 579487, 359448, 312141, 301681, 372108, 325859, 314661, 518101, 767811, 880837, 1067683, 945897, 593920, 314576, 176614, 118046, 90371, -76663, -111793, -95076, 64075, 32280, 86213, 100523, -28034, -72466, -117559, -67974, -58427, -14720, 137638, 117094, 129486, 28690, 52809, -74768, -91470, -107064, -72980, 72775, 24612, -88577, -24017, 132685, 195013, 176896, 218619, 192298, 53977, 40087, 92721, 87594, 111688, 232555, 159501, 65794, -45121, -70157]
20822g0157j78572l021J11408R1989K6636n9844K4825o1155j12202J6687J91422
20811b1984J53558J23006J4702m2707j77098j06788J07975J68095q362o9745o4411
20800G6241q984o9877M3085J74001o5410q2708j94157K3397O6754Q5725N0665
20789I8732m628n390l579j07758J4887L2574K8285j3759J9990R0752J42676k0493
20777B72289j09425j45497j78044O9298P5672J04706q4305J03494l7154n9236
20767A1798J46015J22132k1503j27770j70685q8599P3716k2956o6891J61680R9437
20756A16374M7667j7121q9914q2643n4299O0799k426n3851O934Q4978P7475L3779
20744A27752j8629j18315j12355n8953J6740L9224K7561L9343m2616j4027J28238
$$ y = [-70157, -248729, -251750, -140342, -48353, -21717, -81561, -56736, -117891, -230093, -213406, -21984, 131574, 254580, 269282, 226575, 49477, -57311, 50664, 218759, 210397, 140652, 76241, 67257, -2620, 40465, 214466, 149056, 66348, -127809, -104412, -37658, 48067, 98732, 94104, 88714, 85135, -22623, -7736, 24838, 53123, 39364, 59354, 150106, 292782, 272289, 162864, 17367, -160677, -91379, -15707, 88999, 4694, 108188, 71034, 11798, 157813, 279945, 258442, 130672, -40013, -128612, -54896, -77852, -144743, 16937, 116374, 164041, 146920, 57006, -25637, -79936, -19137, -21563, -75414, -68480, 16498, 93973, 127752, 109123, -9192, -121547, -180500, -163760, -124536, -96975, -57632, -100248, -114275, 13963]
20733A3963J34305j1703Q7088J21619p2371n8830M7627P3037K28235K87858K66438
20722A117266K26455j56917l89937k60227j35110N1844n058k0957P3658P7374
20712E78391J53369K59928K26954j13790m01068l20368j58026j36070j45834J1806
20702d4708M9320l2152L4527j934P5669P5016J00822J0717K7314O0719O7210j7415
20690D05105k11130r7722m0169m2168J6114K5498j3144j21030j39076N2131O1509
20679a04082o8709j55788J33286J12652K7034R0166j38900l5981l5107j21453
20669b96882j07841j28571J4360Q1381J87179R842J18008J47987J0780J17738
20659A53981J29228n8417p8762j60290n7139L3689N2286J96849R4421l6525k38848
$$ y = [13963, 148268, 136565, 223653, 345272, 272901, 214071, 261698, 334735, 562970, 850828, 1117266, 1343721, 1186804, 796867, 536640, 401530, 453374, 448316, 427359, 501017, 578391, 731760, 991688, 1218642, 1104852, 703784, 383416, 225390, 89320, -56514, -44708, 4612, -27540, 6987, 5053, 80722, 155738, 256560, 267277, 294591, 355310, 422520, 405105, 193975, 96253, 56084, 13916, 30030, 55528, 42384, -78646, -217722, -165591, -104082, -172791, -328579, -195293, -82641, -55607, 34559, -104341, -140322, -175429, -296882, -404723, -533294, -518934, -437553, -250374, -240532, -122524, 25463, 36243, 153981, 283209, 224792, 146030, -14260, -71399, -37710, 14576, 211425, 305846, 269321, 30473]
20648C0473o9829M3774K47406N4569j74585o3140l4623J02298J03317p5844j08489
20637E5327R9732J07721j5619j48522k1879R1888R0763n399R5693J16306K5937
20626D91948N1505J5686o3441j47164r9972J0857M2319n0663n2942L4133P106
20615B39372j2640p1710j2388P9095R0323n3403j34055j8913K644r1288Q2129
20604I9166k6282r4553J7242K6127J20763j27475q6045q9092j486p1393K4675
20593b08353M0456O3284o5340k2360J18865J08616l8795l5890R664P418j9934
20582d2369l8345k3932m765J08891K04398K8592j42116j70289N7859J28125o0326
20571D5723j06773o5829o2123j5947O2529R5954J65624l9794N89M8733q0701j08224
$$ y = [30473, -39356, 4418, 251824, 306393, 131808, 68668, 34045, 136343, 239660, 163816, 55327, 155059, 262780, 247161, 98639, 76760, 168648, 259411, 254012, 349705, 466011, 491948, 543453, 559139, 495698, 348534, 248562, 259419, 301738, 251075, 198133, 232266, 239372, 226732, 155022, 142634, 221729, 312052, 258649, 124594, 105681, 108325, 17037, 99166, 72884, -21669, -4427, 21700, 142463, 14988, -71057, -160149, -161635, -233028, -208353, -167897, -104613, -169953, -192313, -73448, 35168, -3627, -39517, -29853, -22435, -42369, -80714, -104646, -109411, -520, 203878, 232470, 90354, -79935, -22076, 106049, 45723, -61050, -126879, -189002, -204949, -142420, -46466, 119158, 79364, 79953, 128686, 47985, -60239]
20559f0239Q0889J89390M1247j00481q1969k5735K9013n8969q5737j16639M7755
20548a41475J25493J25639J9968l3944j30303J18622m047k4850p0280p6628J3346
20537g8459j5490J14906O93J40243M4353q2249j17847Q337L2875p3304k4805o301
20525e7048M1224m3835M8085K60213Q5461N5681j8861o1417j30966j98601j060
20514b1124K1359r8506j0817Q3197o103K0559P8724M4027J7677o0019q7635n9859
20502g8520m6577K7075J10499M4390r1706J00418Q9016l0030J5784J36145R123
20491B85617o0195p6706j756J55913K7725l3948J7303r1706L628R7844K1645k6712
20479C18652l0387j7377j443n1270Q5722j6336o0919J5167r5970Q1435Q6226Q4232
$$ y = [-60239, 20650, 210040, 251287, 150806, 68837, 43102, 72115, 13146, -72591, -189230, -141475, -15982, 109657, 129625, 95681, -34622, 84000, 79953, 55103, -15177, -91805, -78459, -93949, 20957, 21650, 161893, 206246, 123997, 6150, 14487, 47362, -25942, -50747, -57048, -15824, -59659, -11574, 248639, 334100, 389781, 370920, 309503, 178537, -20064, -21124, 235, -98271, -109088, -25891, -31994, -11435, 67289, 111316, 128993, 68974, -18661, -78520, -125097, -98022, 12477, 56867, -34839, 65579, 154595, 124565, 140349, 276494, 285617, 225422, 148716, 146960, 302873, 330598, 296650, 313953, 222247, 225875, 323719, 345364, 318652, 288265, 270888, 269445, 218175, 303897, 287561, 226642, 241809, 145839, 227274, 313500, 397732]
20467C97732Q8964L5858L854J28934N9505k7089q7598j04188j07869k5420O3402
20456D26085J07055R8930j6873j28338j97616j4585M8571P0897L3953j8074P8357
20445D88362J63537n5394j02759j0608J58745K31487J58962J25290p9133j11537
20435I66952j48688J07032p178j1032Q5046m7075Q4772K00045J37192l0394k4231
20424A312441j30322L8676Q4213p1860q7507j28400R9580J81013n817L7342K0499
20413A349858J54189J31781K05763L46646K44310Q1142P457r2988k53795o7455
20403B106908L5357J09414K63061L15625L21576M16317N83004N16310L76996K43733
20393E288301K12655j4054k33775j60354n278J94107M01149M29420P89227J128012
$$ y = [397732, 486696, 522554, 526408, 655342, 714847, 687758, 600160, 495972, 388103, 362683, 426085, 533140, 632070, 615197, 486859, 289243, 274658, 323229, 394126, 428079, 410005, 488362, 651899, 596505, 493746, 483138, 641883, 873370, 1032332, 1157622, 1078489, 966952, 818264, 925296, 918118, 907086, 992132, 945057, 1029829, 1229874, 1367066, 1336672, 1312441, 1182119, 1220795, 1305008, 1233148, 1145641, 1017241, 1116821, 1297834, 1292017, 1329359, 1349858, 1504047, 1635828, 1841591, 2188237, 2432547, 2513689, 2521146, 2428158, 2174363, 2106908, 2142265, 2251679, 2514740, 2830365, 3151941, 3568258, 4151262, 4667572, 5044568, 5288301, 5500956, 5486902, 5253127, 5092773, 5087495, 5281602, 5682751, 6112171, 6901398, 8029410]
20383H029410J362379J675133J636002J365919J164038P99283Q95251J625461
20375A8552876K763728M006576N901055Q944380J4039513K2261877L6377937N9057536
20367A71905478Q8398769J11209134R3677087p965841j15813021j19627217o9180993
20360A52603396l1878730r784888P619555K6862199N2566007Q3906503J07484450
20353C89378492Q7175060j8736279j24811311j25070978p5399128m1433719k4018930
20346F7083207j5024408r919616o899122n231492l991777k920503k245166j495962
20338A9355161j335115j568380j449042j069211j190864j476322j361752r78726
20330H925749q78014n59972m30245l28418l3819J10603j83701k66514m94419n76698
$$ y = [8029410, 9391789, 11066922, 12702924, 14068843, 15232881, 16032164, 16927415, 18552876, 21316604, 25323180, 31224235, 40168615, 54208128, 76470005, 112847942, 171905478, 260304247, 371513381, 465190468, 457224627, 341411606, 221784389, 152603396, 120724666, 110939778, 118559333, 145421532, 197987539, 281894042, 389378492, 476553552, 457817273, 333005962, 207934984, 132535856, 91102137, 67083207, 52058799, 42139183, 35240061, 30008569, 26016792, 23096289, 20851123, 19355161, 18020046, 16451666, 15002624, 13933413, 12742549, 11266227, 9904475, 8925749, 8047735, 7487763, 7057518, 6729100, 6695281, 6805884, 6622183, 6355669, 5861250, 5284552]
20320E284552n14710k50977m4604j42217m32191m08937n83142l99627j33891n0662
20310B323594j03142M8477o6889R8602J40903N8311k20006k56685k50317j44993
20300A627855j06858j0309j71778j74814j4901j07984j13634j2333L5234O0093
20290A010571j18534p1077k3323K1847j32754M4018L6823n0106m6174q020p5573
20279E87698q2788n8234l0752J13267m6575m0712J52726j54221K0959O5909J2689
20268E39966j3491j1529m4855m2594j58253k0158Q8922N1802n3406j05331k4647
20257B06426l4872k5134O8445J48723o368m3224P3911J36886M7523j50335k33883
20246A88098M5347P489k3320N4430P944Q7731l5041m1476p1461j59358P172J24892
$$ y = [5284552, 4769842, 4518865, 4474261, 4332044, 3899853, 3490916, 2907774, 2508147, 2374256, 2323594, 2220452, 2268929, 2202040, 2300642, 2441545, 2499856, 2279850, 2023165, 1772848, 1627855, 1520997, 1510688, 1338910, 1164096, 1149195, 1041211, 927577, 915244, 950478, 1010571, 892037, 820960, 797637, 819484, 686730, 730748, 767571, 717465, 671291, 663271, 587698, 504910, 446676, 415924, 529191, 482616, 441904, 594630, 440409, 461368, 527277, 539966, 526475, 514946, 470091, 427497, 269244, 249086, 338008, 389810, 336404, 231073, 206426, 171554, 146420, 214865, 363588, 357220, 313996, 387907, 524793, 572316, 421981, 188098, 233445, 240934, 217614, 272044, 279988, 367719, 332678, 291202, 219741, 60383, 67555, 192447]
20234A92447J4974R0031O335J31312K7301k46419N9321J38280m7035j05582n7821
20223B03144J33371J7639k7286j9708J08260j11238j14655J58446j9813j36203
20213A91957j73484J25929N7565J09801J40361o3531M9336M7652j6961p0851N196
20202D02970k5773J6425o068K775j2303m7790p6402j3717J77936L6327j15562
20191C38818j0361M0063j56193k93749J48084J87076J30925j32045k03478N2999
20181A02139N0316M8285J6304p353O480j00141N0950J49308J21522p4127n5165
20170C08518M8383N2394j19541j07079Q4190Q569n8157p7470j3378J46949p26
20159B72652n6337k5907k1073j86209j25390J21499K42547n3632j36647q2848
$$ y = [192447, 207421, 297452, 303787, 435099, 462400, 215981, 275302, 413582, 366547, 260965, 203144, 336515, 354154, 326868, 307160, 415420, 304182, 189527, 347973, 328160, 191957, 18473, 144402, 201967, 311768, 452129, 388598, 437934, 485586, 468625, 397774, 402970, 377197, 393622, 387554, 390329, 378026, 330236, 253834, 240117, 418053, 454380, 338818, 328457, 368520, 212327, -81422, 66662, 253738, 384663, 252618, 49140, 102139, 152455, 200740, 217044, 209691, 216171, 116030, 166980, 316288, 437810, 363683, 308518, 356901, 409295, 289754, 182675, 266865, 275434, 217277, 139807, 126429, 273378, 272652, 216315, 190408, 169335, -16874, -142264, -20765, 221782, 168150, 31503, -51345]
20149e1345q1518R6966J85103l6338m5142j82934O6905P7172M925q8803J80O6734
20137A1905n0613L182K3961j22629l8340k0789Q090l9142K7526J08110R5411N063
20125A1735j28923j16967O5694j5830J33585L1621M1450J54M7176N4221K6048
20114A49964K3046j23783L8776o7280K1484j0366n8034O3625J64081K0409j67632
20103E4290J6919n1113p0013J09825K7061L0809O5556m3170j1859k2076N6134
20092A62363k4543p3092m1564J16339l630j74196J85553N1413r3534j02580N0904
20081E3433Q7472o5346M1334J62856j8709r4172j32481j13976K7538R209M5311
20070B469J25457Q6199j17133j22733K7235k810L8622M2853q749q5942p6468N6193
$$ y = [-51345, -132863, -35897, 149206, 112868, 67726, -115208, -48303, 28869, 33794, -55009, -54829, 11905, -38708, -35526, -11565, -134194, -172534, -193323, -185233, -224375, -196849, -88739, 6672, 11735, -117188, -234155, -168461, -184291, -50706, -19085, 22365, 22519, 69695, 123916, 149964, 173010, 49227, 88003, 20723, 42207, 31841, -26193, 37432, 201513, 221922, 54290, 71209, 20096, -49917, 59908, 86969, 117778, 183334, 140164, 128305, 106229, 162363, 137820, 64728, 23164, 139503, 135873, -38323, 147230, 198643, 105109, 2529, 53433, 140905, 75559, 116893, 279749, 261040, 166868, 34387, -79589, -52051, -42842, 2469, 127926, 214125, 96992, -25741, 1494, -1316, 37306, 80159, 71410, -14532, -91000, -34807]
20058c4807N9960L1582j0860n1430R0582P0688J1831j11197N5554J37927r6629
20047A53201n5328k4435j10530J69394N2917n2227j8580q8622J8925K6063Q3491
20036A54269n5203r1136O8075O4934j33075o4134J2230j54585n6590J24408l4196
20025a65003N972N5939M2378k9960J4067J54544M1918q0351j5195K8130J9124
20014G1563q6527m6041P983p9384M4607J05496J11914P8612q9273l1621j29692
20003d2363n5629j3770j05321R3047J18700m7189j12383o2548J33899M7812J55033
19992A09288K7257l1376o6995j37870j4448o2066J13090O0042J07258P5178p5309
19981A04049q1631N011k0299L9640J7862j46033j8511L5627o0560o294L0114R6438
$$ y = [-34807, 25153, 56735, 45875, -5555, 85027, 155715, 167546, 56349, 111903, 249830, 153201, 97873, 73438, -37092, 132302, 185219, 132992, 114412, 25790, 44715, 70778, 154269, 99066, 7930, 76005, 140939, 7864, -56270, -44040, -198625, -255215, -130807, -165003, -159031, -103092, -60714, -90674, -76607, 77937, 119855, 39504, 24309, 52439, 71563, -14964, -61005, -53022, -132406, -87799, 17697, 129611, 208223, 118950, 87329, -42363, -97992, -111762, -217083, -124036, -5336, -52525, -164908, -227456, -93557, -45745, 109288, 136545, 105169, 38174, -99696, -114144, -176210, -63120, -3078, 104180, 179358, 104049, 22418, 27429, 7130, 46770, 64632, -81401, -99912, -64285, -124845, -131139, -101025, -4587]
19969d587J14651r0318n8774q4632J9640j0547j71542p9415J7740K20099Q4612
19958d3073J9969L8390P7146J42093j4582j30975j23594m3356o8797k8862O5696
19947a09945k533R3387J01411k9962j42875J9156M0804k2350m6369K9917j25866
19936a95225L9908N9480K5579p1479j6865O1399K243M3325J10791o1601q5746
19925h8191O6750O2657J9390L3169j09318o5182o9631P3973q2126N7056N164j213
19913i7502k4255r164j10584k3555J41946L0127K3461j04693l6437N9135L4327
19902a17194m2386k8239J01634J43892j00446n8858N0594k3533P48K8979J20742
19891G5933J04231o4267k5596o3123K2107o7848j05431m5256R7899J12708j8598
$$ y = [-4587, 110064, 19746, -39028, -123660, -104020, -114567, -286109, -365524, -347784, -127685, -43073, -23104, 15286, 92432, 234525, 219943, 88968, -34626, -77982, -146779, -175641, -109945, -112478, -19091, 82320, 52358, -90517, -71361, -30557, -52907, -99276, -69359, -195225, -155317, -95837, -70258, -141737, -158602, -97203, -94960, -51635, 59156, -2445, -88191, -21441, 41216, 60606, 93775, -15543, -80725, -150356, -76383, -158509, -101453, -96289, -97502, -121757, -130921, -241505, -265060, -123114, -92987, -69526, -174219, -210656, -151521, -117194, -159580, -187819, -86185, 57707, -42739, -101597, -51003, -74536, -73788, -44809, 75933, 180164, 115897, 90301, 27178, 49285, -18563, -123994, -169250, -71351, 41357, 22759]
19880B2759P6766M0076j17117M6393P9415j16629m9281Q5490n7185N1115Q1026
19869A42828l077M9967j1389j16950J4917k3166k5446k0758P5101R148n4089l9297
19857b211k686o5439m630q6575N1809J05154l500p4731P6133l3318L5441k2434
19845b6987K3819P7545O1149o7117p0173k0510P3181L3664p0609K6630j33235
19834i2643L9035P6801O115n1011P6860M0339Q5678M5735q8737j79147L3635O2810
19822E5470M6827M8426m4085j86308P6509K19145K4282l2939K8219k16053o562
19811A2931J9982q4099j42723P0440J05843L7800l2076k483M1201O6403K1613
19800A14832l775o6880L7957q7314O04Q6422J96058P1503p8534r9377j65360K9958
$$ y = [22759, 99525, 139601, 22484, 68877, 148292, 31663, -17618, 67872, 10687, 61802, 142828, 139751, 189718, 178329, 61379, 76296, 53130, 27684, 6926, 82027, 91175, 37086, -2211, -4897, -70336, -74966, -161541, -109732, -4578, -8078, -82809, -6676, -39994, -4553, -26987, -3168, 74377, 135526, 68409, -1764, -22274, 50907, 84571, 13962, 40592, -92643, -53608, 23193, 29308, -21703, 55157, 95496, 181174, 226909, 138172, -40975, -7340, 55470, 102297, 150723, 106638, -79670, -3161, 215984, 240266, 207327, 235546, 19493, 12931, 32913, -51186, -193909, -123469, -17626, 20174, -11902, -14385, 26816, 93219, 114832, 111057, 44177, 82134, -5180, -4576, 81846, 277904, 349407, 270873, 171496, 6136, 36094]
19788C6094J50961P5198o7913L7311K2480p1871M332m4665j3261M6466O8754l3866
19776B10020j02324k1272K2733J3448p4581k21269J39292J88276N6120q666Q2576
19765B84353M0302K7608J25415J25360J48510J50514J94924M31658K59807o8917
19755A719534j83726k58765k11048j85166q5261P0485K23680K04649J84933K25426
19745A704741K41518m4379j68457m09555m31152k52590j80081j72693j02852j28559
19735E5941M0593m7838l4624R9485O7364j15412L2391K0008r5235j00752M012
19724g4067L2636K4216J15763K7033r7724K4528J05151N4410O0001q8237j11571
19713G2139k0886m5347r1526J01864Q0752n6635L6236O9200p9057M6377n3528
$$ y = [36094, 187055, 262253, 194340, 231651, 254131, 182260, 186592, 141927, 128666, 175132, 243886, 210020, 107696, 86424, 109157, 122605, 48024, -173245, -33953, 154323, 210443, 201777, 284353, 324655, 352263, 477678, 603038, 751548, 902062, 1096986, 1528644, 1788451, 1719534, 1535808, 1277043, 1065995, 880829, 795568, 866053, 1089733, 1294382, 1479315, 1704741, 1946259, 1901880, 1733423, 1323868, 892716, 640126, 460045, 287352, 184500, 55941, 96534, 48696, 14072, 113557, 180921, 65509, 97900, 117908, 22673, -78079, -74067, -41431, -17215, 98548, 125581, 27857, 52385, 157536, 211946, 271947, 183710, 72139, 51253, 5906, -85620, 16244, 96996, 40361, 76597, 145797, 66740, 113117, 59589]
19702E9589M8826L0022m4500m3682M8657L6731k1597O5804j44950q4593P9307
19691B9614K11750q970j71610q2710K21813k0078l5550r44q1970O1352P9502J2597
19679B14796o1811r5085j92332K5648O2925m7074p8598O2315M9475j06349p085
19668a73175o1248J10405J35385j9125j42742n5992o9468m4328P6180R2855K69597
19657A18344Q1410n830N7412j75730p7639n0091N5601K2858j06312r059M5931
19646d3105M7595J32j3537Q8707J5708o1237o8637K42587J7590j91494j3116J02790
19634A23983j25944j39650m760O8821J39863l5920j8371J52041K6828j00049p5478
19623A1364n9531r1933j05429J18489J66320l161j00911J07117n2693j10938R0024
$$ y = [59589, 108415, 138437, 93937, 50255, 98912, 135643, 114046, 179850, 34900, -49693, 29614, 241364, 232394, 60784, -21926, 199887, 179809, 144259, 143315, 61345, 122697, 202199, 214796, 152985, 57900, -134432, -108784, -45859, -92933, -171531, -109216, -59741, -166090, -173175, -234423, -124018, 11367, -7758, -150500, -206492, -275960, -320288, -244108, -151253, 118344, 199754, 193924, 251336, 75606, -2033, -52124, 3477, 26335, -79977, -89036, -43105, 4490, 4622, -8915, 79792, 95500, 34263, -34374, 208213, 225803, 34309, 21193, 123983, -1961, -141611, -146371, -77550, 62313, 26393, 8022, 160063, 186891, 86842, 11364, -48167, -140100, -245529, -127040, 39280, 36119, -64792, 42325, -10368, -121306, -31282]
19612c1282o848j33226L9984P0841j3963m820J05149J8853r0014L1585J5425O7302
19600F8986K5632M2419q6849j52414p3984q5951L6984P7154M8469P553j02438
19589a94439j03629J38024J89984k2444j2937n1919Q1187N1564j72726j33972
19579b31307L3591K8855K2007j8148R5596K2601l5944q8112p8674j49114M2917
19568c55732J33977J25957Q8461P855O0241J9166j10508j3399J01733Q5168K8716
19557A71635k0320o8894j04199o855J05089J05544o9498q8507K6116P6949M5307
19546A72367Q5674p9830Q475K8246Q6404L3677k4776j0454p8687j02588j5762
19535A02746m528r0160j0477k0500r5537j0674l9374M4902r55O7486L6432M6159
$$ y = [-31282, -38130, -171356, -131372, -60531, -74494, -79314, 25835, 44688, -45326, -13741, 1684, 68986, 94618, 137037, 50188, -102226, -176210, -262161, -225177, -148023, -99554, -92001, -194439, -298068, -160044, 29940, 7496, -5441, -57360, 23827, 75391, -97335, -231307, -197716, -168861, -146854, -165002, -69406, -46805, -82749, -170861, -249535, -398649, -355732, -221755, -95798, -7337, 518, 60759, 79925, -30583, -43982, 57751, 142919, 171635, 151315, 82421, -21778, -28633, 76456, 182000, 112502, 23995, 50111, 127060, 172367, 258041, 178211, 186686, 214932, 301336, 335013, 310237, 299783, 221096, 118508, 102746, 98218, 8058, -2419, -22919, -118456, -129130, -168504, -123602, -124557, -57071, -20639, 25520]
19523B5520J8806N4943n4476m6733j9174n9365k8112O700n2019K8142l0073p5279
19511b31120L4711N5336P7529L2932n5114J8379J05582j9111K6504P5822j07202
19500A4248J30596J26550k3954m5304m2521m6474M591o9054m3487N2157m043J39896
19488A93201P3334p2402k09471k0212p7314q4402K9262O1417j3152l4093k0458
19477a74290J16696J9038R076j46881j42377K9842K6519l4646n8750k7098J36907
19466b45964O4060R6179j314o1939J05833M744j9185j8980j6942O7301k3803n991
19454e6001k0134o1510o771L24j56550n6992P3168J27349n7533k04226o8713J24350
19442c63239O8988J83715J06952P4483M353L9250J9539l3029r1838l0846m903
$$ y = [25520, 44326, 99269, 44793, -1940, -21114, -80479, -108591, -101891, -153910, -125768, -155841, -231120, -196409, -141073, -63544, -30612, -85726, -67347, 38235, 19124, 45628, 121450, 14248, 144844, 271394, 247440, 202136, 159615, 113141, 117732, 48678, 5191, 57348, 53305, 193201, 266535, 194133, -15338, -35550, -112864, -197266, -168004, -106587, -119739, -153832, -174290, -57594, -38556, -29480, -176361, -318738, -288896, -262377, -297023, -355773, -382871, -245964, -181904, -85725, -87039, -148978, -43145, -38401, -57586, -76566, -93508, -26207, -50010, -56001, -76135, -137645, -144416, -144092, -300642, -357634, -284466, -157117, -214650, -418876, -487589, -363239, -294251, -110536, -3584, 70899, 75252, 114502, 134041, 101012, 9174, -21672, -26575]
19431b6575K8201o1099k657K9299q069j5867O9490K5960k2128l880j9774j09163
19419a16262p4186O3478L9044o136Q4071J04713j10403j04154R232N3193M5474
19408a1936j17041k5683J50847K76980N4979j2135o1106j34970j26425N2513p9814
19397c3791j28553j15975J87354N7278m5149L7660l0347K41k1873J24907P4962
19386A06714K7327m4183l5021m5679P0110p0036j69147K899q306j5774j44561
19375c25657p3999R3968J67097J11068q854Q0026k1540n7774n2673O331J6350
19364f5657p8772J44804O151p802m1124L992N0356M7971m2805M0981j4174L9835
19352H3756M2083n0082l8949N7714k6987p8362M3517O4290m6554P171k4925J7556
$$ y = [-26575, 1626, -59473, -62130, -32831, -40900, -56767, 12723, 38683, 16555, 12675, -7099, -116262, -190448, -126970, -87926, -94062, -9991, 94722, -15681, -119835, -110603, -57410, -11936, -128977, -154660, -3813, 273167, 328146, 316011, 254905, 119935, -6490, 46023, -33791, -162344, -278319, -90965, -33687, -78836, -41176, -71523, -71282, -93155, 31752, 106714, 134041, 89858, 54837, 9158, 79268, 9232, -159915, -157016, -165322, -181096, -325657, -399656, -305688, -138591, -27523, -36377, 43649, 22109, -35665, -88338, -82007, -65657, -144429, 375, 6526, -1276, -42400, -38408, 11948, 59919, 17114, 58095, 43921, 83756, 125839, 75757, 36808, 94522, 67535, -10827, 32690, 96980, 50426, 57597, 32672, 50228]
19340E0228j5373l287l230n8296K2756n4810j35742l2121N9624K8706N8399O7447
19328a5699J31300L8961l7125q8579n5927O4529j63572o8544N8416m1054q2932
19317b60226R1271J556J7477M4304J51403L2356n1809j70775m0304O4905K1716
19306i8126r6433R6836Q046J52823J60805j29447j61286r4069Q527R4846p312
19295f4790J9733N7837N3911j7249r0094k6429r0204n5487M0568Q0650o3066l8167
19283a92787J12558K08972j7777j00238M0504j45387M4148j20215o4148l6009
19273b70379m290Q3887J16276m9860l4300R8961P241m1538j4935L6150K5964J73619
19261A26796o744j83155m0778k5244m9492o415O1765J16028j7936J44570r774
$$ y = [50228, 34855, 31568, 28338, -29958, -7202, -62012, -197754, -229875, -170251, -141545, -83146, -15699, 115601, 154562, 117437, 28858, -27069, 37460, -126112, -194656, -136240, -177294, -260226, -168955, -167399, -149922, -105618, 45785, 78141, 26332, -144443, -184747, -119842, -98126, -194559, -97723, -89677, 63146, 223951, 94504, -66782, -160851, -152324, -57478, -64790, -45057, 12780, 66691, 49442, -40652, -67081, -157285, -212772, -172204, -91554, -154620, -192787, -80229, 128743, 110966, 10728, 51232, -94155, -50007, -170222, -234370, -270379, -274669, -190782, -74506, -124366, -158666, -59705, -52464, -94002, -108937, -72787, -46823, 126796, 120052, -63103, -103881, -129125, -178617, -185032, -123267, -7239, -25175, 119395, 109621]
19250A09621m9446M9818R4869q7043j07556j41810L5089M7822Q0615l1027J9679
19239B0631J3147l0218N4622N6584O0075l3941q31K0126q593L758N0969J19582
19227C25911k03425q3453m858N346l2717N4837K6983R5291L361k6001Q6886m6775
19215B01386p1309j10276J1172o6739M8826J92998j0912q149o9275r8186j16581
19204i7045k8148J64008J01426J9944j00969O6856k1875o5610m9548j2774J7329
19193f406O2333o6881p6018k4453L2672O7067O1590q7711j880O4035J7826j55239
19181a13065J57398Q3216m3396n387k8287o3296j46064n3673J14835J44011N3875
19170A00167p1249l5162J40534N9045j724j06242l5061k5188J09454Q4948p0736
$$ y = [109621, 60175, 109993, 204862, 117819, 10263, -131547, -96458, -48636, 31979, 952, 20631, 33778, 3560, 58182, 114766, 174841, 140900, 140069, 160195, 151602, 155360, 206329, 325911, 122486, 39033, 34175, 39521, 6804, 61641, 88624, 183915, 187276, 161275, 248161, 201386, 130077, 19801, 30973, -35766, 13060, 206058, 195146, 186997, 117722, 19536, -97045, -125193, 38815, 140241, 160185, 59216, 126072, 104197, 38587, -10961, -23735, -6406, 55927, -10954, -86972, -111425, -78753, -11686, 49904, -37807, -39687, 24348, 42174, -113065, 44333, 127549, 84153, 78766, 50479, -12817, -158881, -212554, -97719, 46292, 100167, 28918, -6244, 134290, 193335, 191611, 85369, 50308, 25120, 134574, 219522, 148786]
19159A48786j15786K7064J41198p8607l8263o5489j824j64122j59400M4429J31099
19148a30915J3476p5524q4140K12005N8633l978k9890N119p4183o5194j28955
19137c03546j42124N1414J54551O9689K652J2697n904J45828O1133O5943L0918
19126A43251P2894m0534J7874k09499j44056O5028M9564L5488m1300k2078R746
19115f3622L3442l9225l8258m5118j8680j1724K9585m8793L1980J7986l0453p535
19103a90415J29461R5724M2598j7711n1987j15967r4219P4621l493M3811p1958
19092a59535n8170P1069L6441J29517j08273r9073J5050J04888Q3491P500J5181
19081C8086q2145K3977o1396N4614l7442k2056q564m3544n8833R8968J11299M7242
$$ y = [148786, 33000, 60064, 201262, 122655, 84392, 18903, 17079, -147043, -306443, -262014, -130915, -117439, -192963, -277103, -65098, -6465, -10443, -40333, -35214, -109397, -174591, -303546, -445670, -394256, -239705, -170016, -167364, -154667, -160571, -14743, 46390, 112333, 143251, 216145, 175611, 193485, -16014, -160070, -95042, -45478, -9990, -51290, -73368, -63622, -30180, -69405, -107663, -152781, -171461, -183185, -153600, -202393, -170413, -152427, -182880, -190415, -60954, 34770, 77368, 59657, 7670, -108297, -202516, -127895, -131388, -87577, -159535, -217705, -146636, -110195, 19322, -88951, -188024, -172974, -68086, 15405, 22905, 38086, -44059, -20082, -81478, -26864, -64306, -86362, -94926, -138470, -197303, -98335, 12964, 60206]
19069F0206o0153K690Q30n5552q8756Q8352q6341M140P4089k9106N6268k6645
19057e9978j22259J5271j081J42919L7650N8558n2555o6047L4778n024j39291
19046a57059j50879K5787M2O007P1249K3831M1094j01279L5327M6413Q3094P0036
19034f337M3276O4413l8060j50898J25233o5991j73526M4770P2404J4608M6013
19023b4095j743M3869m8848N020r9945K3889N9046j49452L3148O7140L2197l9778
19011i9552k5027m2679n2514l9686N3890J8148J59936J19949p1911K2591Q7708
19000A30853o3103Q3780n1221o0176K7578J42068n8455j5546j18280j03337j13095
18989a98934L7608L0089N9048R5541N718K525M2603L7242r9106K5952O9995o3023
$$ y = [60206, 53, 2743, 3573, -51979, -140735, -52383, -138724, -134584, -60495, -89601, -33333, -59978, -182237, -166966, -168047, -25128, 12522, 71080, 18525, -47522, -12744, -17768, -157059, -307938, -282151, -282109, -276102, -204853, -181022, -139928, -241207, -205880, -159467, -76373, -6337, 36939, 101352, 63292, -87606, 37627, -28364, -201890, -157120, -84716, -70108, -24095, -25838, 18031, -30817, -25797, -125742, -101853, -42807, -192259, -159111, -91971, -59774, -99552, -124579, -167258, -219772, -259458, -205568, -187420, -27484, 92465, 20554, 43145, 130853, 67750, 151530, 100309, 40133, 67711, 209779, 151324, 135778, 17498, -85839, -198934, -161326, -131237, -72189, 23352, 29070, 31595, 74198, 111440, 12334, 38286, 108281, 45258]
18977D5258j09108O8859J24733k1272j29892j65629j67796o2858L1893K18045
18967a67767N7881m4108P3995K4981L5218q1718K903L6080M6974q6562j12291
18956b14414q544O7723L9098k5325K0720l4245M7213K02462J9437P628j63968
18945d2215j50412M9561J13578O4964m7332J26444J53r2729k8058o8994r144m7694
18933a31878J22199P5989l8457j12686r552P0244n8347O9108P4422J45286j1817
18922A94511m1670j49422j97356L8201P3700J98339N8175k70636n4242J6932j5868
18911a49336J03894J84219j5735K2318m6906j10812r2877j6583J32399r0833o7891
18900a48143j39931K8147K27719J88681o9190K7386j37055k09149J6858O9082
$$ y = [45258, -63850, 5009, 129742, 108470, -21422, -187051, -354847, -417705, -385812, -167767, -109886, -153994, -79999, -55018, -19800, -101518, -98615, -62535, -15561, -102123, -214414, -222958, -155235, -116137, -141462, -120742, -154987, -107774, 94688, 114125, 121753, -42215, -192627, -143066, -29488, 35476, -11856, 114588, 114741, 22012, -6046, -75040, -84184, -131878, -9679, 66310, 27853, -84833, -94385, -24141, -82488, -13380, 61042, 206328, 194511, 152841, 3419, -193937, -155736, -82036, 116303, 174478, -96158, -150400, -133468, -149336, -45442, 138777, 123042, 145360, 98454, -12358, -105235, -121818, 10581, -80252, -148143, -288074, -259927, -32208, 156473, 87283, 114669, -22386, -231535, -214677, -145595]
18890a45595j4469p0830n0703L4318J14300R6962l8722N9173M9937n3001o9701
18879h8331J2995O1993J06573J18294n6756j02245R1991N847r7673m5805o9382
18868f2499j48561J1694J62925N9986M7337l1887q5733Q1367l1919k6558r8997
18857a22845O3503J65977J45817J11942M10p8304n5630k0022l433R803N6267j10424
18845A63061l7203r5065n615J28658K6082o9729o1018n6234r1540J9275N002n1174
18833a25500m3245N1783J9069l4033J1694L0259q651Q750n3280q0842P8340K16344
18821G0688p2206r4898J51146j4140j53398J2704n1190q100n7585J12231M9000
18810e5748o416j11415J05668J70421k5113j49115j29517j10848M1897L0290n0987
$$ y = [-145595, -160064, -230894, -281597, -247279, -132979, -36017, -74739, -15566, 34371, -18630, -88331, -75336, -13343, 93230, 211524, 154768, 52523, 144514, 150361, 52688, 6883, -62499, -211060, -199366, -36441, 23545, 70882, 38995, -46738, 34629, 2710, -23848, -122845, -59342, 106635, 252452, 364394, 364804, 286500, 230870, 210848, 207415, 217218, 273485, 163061, 125858, 30793, 25178, 153836, 179918, 110189, 49171, -7063, -98603, -79328, -74326, -125500, -168745, -116962, -97893, -131926, -120232, -89973, -98624, -89874, -143154, -223996, -145656, 70688, -1518, -96416, 54730, 40590, -112808, -100104, -151294, -159394, -216979, -104748, -55748, -62164, -173579, -67911, 102510, 77397, -71718, -201235, -312083, -270186, -239896, -290883]
18799b90883J60235N5225K3646M1240R9293m6504N072m8142m296J02587N729L832
18787A07034m0565k9701j23898j6178J51421R9237j04377k6021R1117J30482j47780
18776I0771j07613j05o2797n1406J09528j9926J3896Q132K4778j4506o367N2824
18764C7209J9856j866q6498j04924O007J00307N336j21243J2818O6926J4199Q6880
18752C5007j79237l7940N0127n2957J43557Q9155l4740m9361R0645J2440j13108
18741d6412n0042j5058O7120J48800R6978j00154j29781K404q552O6200l7328
18730e825L874j21605J3091N8778J02526j02128K3115N7734j6353n4970N9182
18719A7419J19025j24424j20078j1562K6822k6997l2634J65833k7462j31842J00286
$$ y = [-290883, -130648, -75423, -51777, -10537, 88756, 42252, 47324, -818, -5114, 97473, 103202, 107034, 66469, 36768, -87130, -103308, 48113, 147350, 42973, 16952, 108069, 238551, 90771, -16842, -16947, -79744, -131150, -21622, -41548, -27652, -19520, 5258, -9248, -15615, 37209, 57065, 55199, -31299, -136223, -130216, -29909, -24573, -145816, -132998, -66072, -51873, 35007, -144230, -182170, -132043, -185000, -41443, 47712, 12972, -36389, 54256, 66696, -46412, -96454, -111512, -44392, 104408, 201386, 101232, -28549, -26145, -34697, 31503, -5825, -1951, -123556, -110465, -51687, 50839, -51289, -28174, 29560, 13207, -41763, 17419, 136444, 12020, -108058, -119620, -92798, -119795, -152429, 13404, -14058, -145900, -45614]
18708d5614R2461r6771j59130J1531N5705R9744J63530L2254j26903r1884J8340
18697d6737J00719m7723n803K8810L0897k6077N9792R0180J01097P0585J42232
18686D97972L71182L07104p6814m26739l97061o1364l0438p0518k1742Q3568J80792
18675C55942J14936K02526L32356K37167k69023l66038j90902l01913q4721L2215
18665F2545J321M6843R0347M368m1145M1523r3708j9590k2829j22800j11356M5456
18653a19025l736M2228j2522J98499M6404o1713j19542j25626p8353J47057J12351
18642B6022l4703P595k116P362l058N1129p3727n8258o6528p4426m751l3067r6895
18629c55421L2979l4200J1685P9424J75478N7916P6j02080j8934n9671j16218
$$ y = [-45614, 46847, -49924, -209054, -197523, -141818, -42074, 121456, 153710, 26807, -65077, -46737, 53982, 6259, 456, 29266, 60163, 34086, 93878, 184058, 285155, 355740, 497972, 869154, 1176258, 1099444, 672705, 275644, 214280, 183842, 113324, 91582, 175150, 355942, 470878, 673404, 1005760, 1242927, 973904, 607866, 416964, 115051, 30330, 62545, 63866, 110709, 201056, 205424, 164279, 205802, 112094, 92504, 69675, -53125, -164481, -119025, -122761, -80533, -93055, 105444, 151848, 90135, -29407, -155033, -233386, -86329, 26022, -8681, -1086, -3202, 4160, 1102, 52231, -21496, -79754, -146282, -220708, -225459, -258526, -355421, -322442, -356642, -344957, -265533, -90055, -32139, -32063, -134143, -153077, -212748, -328966]
18618c28966J19249K06493N9108j60664r6163P5946n4467M4039N9287O6379K8625
18607A8866L2553j45491j35666M4870P8003J26654O9722m8920q0675n929J0735
18596c5278j36193j20023j677R4556J20168J2277K6790r6442n3880n3346j098
18585b44146o3796N2815l6111L9284J94348m0196j2663J24441J09687o4025j47074
18574h7436j2167o9317P7419M6934K108l0278k2587L1993J60131j105N9029R0138
18562B44862m1426m2651j0898j56199k09771O9677P9598M2598J8243p4172n4611
18551a34750K2426J67253L6736Q4212m9973k09779q5314Q1992L5280P7285N5329
18540H0697p3455L4473O1236p1700j30256n5008l9736q253j41162J50501J89391
$$ y = [-328966, -209717, -3224, 55884, -104780, -200943, -124997, -179464, -135425, -76138, -9759, 18866, 51419, -94072, -229738, -184868, -106865, 19789, 89511, 40591, -40084, -46013, -35278, -171471, -291494, -293171, -198615, -78447, -66170, -39380, -135822, -189702, -243048, -244146, -307942, -255127, -291238, -251954, -57606, -97802, -110465, 13976, 123663, 59638, -87436, -99603, -168920, -91501, -44567, -42459, -72737, -95324, -63331, 96800, 95695, 154724, 244862, 203436, 160785, 149887, -6312, -216083, -146406, -66808, -24210, -5967, -80139, -134750, -112324, 54929, 91665, 175877, 125904, -83875, -169189, -87197, -51917, 25368, 80697, 7242, 41715, 102951, 31251, -99005, -154013, -193749, -202002, -343164, -192663, -3272]
18529c272M15n3783j14796R0739m1710l1146m3402P741o5182M4750J61303l23
18517d8666K9735m1685P490J5070j05424J42871M2808l6775n9587j7357o5396
18506a36916q212p4226j37899j7911J16131J09271J49861Q0128k0605j72230k5194
18495a37802J3654m9565K7237J85499O316P2147j63308j05053R1657m7469n5937
18484a62624l6909L4229R6999j05514Q8069M4682l9552j4045n8070N5975O3227
18473c3533j32016q836p512O1356O4344J55638P3713N4069j35793j57494k0129
18462h6193J55638q012J2205M2253M4770K8720j03420r4065l28p1052k5642J34865
18450B9739Q493R4659l642k23386O7594R1515r009n8687o2328J52726J06653k4194
$$ y = [-3272, -2857, -56640, -171436, -80697, -122407, -153553, -196955, -189214, -254396, -209646, -48343, -48666, -18931, -60616, -53126, -38056, -143480, -609, 42199, 5424, -54163, -71520, -136916, -145128, -219354, -357253, -375164, -259033, -149762, 99, 80227, 59622, -112608, -137802, -124148, -173713, -146476, 39023, 45339, 117486, -45822, -150875, -59218, -106687, -162624, -199533, -165304, -68305, -173819, -85750, -41068, -80620, -94665, -152735, -96760, -33533, -165549, -174385, -181897, -120541, -56197, 99441, 173154, 227223, 91430, -66064, -86193, 69445, 61433, 73638, 115891, 160661, 189381, 85961, -8104, -8432, -79484, -105126, 29739, 38232, 132891, 129249, -94137, -26543, 64972, 55963, -2724, -65052, 87674, 194327, 170133]
18438A70133R5138J37270J78242K99446L75794J90708L08673L23687l1914l86166
18428A661011m49028l49906k53565p9901J02994R1289K12634M21044M32098K70776
18418B059446j938m27797m71455l89151k51536j51848m3309j07247p8581n5126
18408H1458J8351j9087k132q0713k8778O6693j06073j47077Q1594J43686N6847
18397F4769q762o2732q999K4032j41779l746N0160n5892j15537L3410J76246M0714
18385h116K381O1345O4602N2312q6658j8634L6470p5030n8358J4113j73139R037
18373a79675O1941J25379j1324p9182l3671P8764N7180j03126p4223J40710J02302
18362H5075L6001n8195k7618j19182j04201j3724J34386J01363n2467l2371j8398
$$ y = [170133, 265271, 402541, 580783, 880229, 1256023, 1446731, 1755404, 2079091, 2047177, 1661011, 1211983, 862077, 608512, 528611, 631605, 722894, 935528, 1356572, 1788670, 2059446, 2057508, 1629711, 1158256, 769105, 517569, 365721, 322412, 215165, 136584, 81458, 99809, 80722, 78590, -2123, -30901, 35792, -70281, -217358, -135764, 7922, 64769, 56007, -6725, -15724, 8308, -133471, -137217, -87057, -142949, -258486, -225076, -48830, -8116, -5735, 55610, 120212, 172524, 85866, 67232, 103702, 28672, -29686, -15573, -188712, -179675, -117734, 7645, -3679, -82861, -116532, -37768, 19412, -83714, -157937, -17227, 85075, 121076, 62881, 35263, -83919, -188120, -201844, -67458, 33905, -18562, -50933, -69331]
18351f9331o5808N4678r882M4605r0994L5348P1428K684q6561O407J10003Q1536
18339H4113J08164m3663O776k0409j46626k9667j0309L0287J20516m8818l7385
18328A2979N5454p4224q8036P0717j9573k4967j07673P94k8580m1009J17899K90997
18316A64778L2996j65679L747N2117J9025r2777j03896N6809Q3132O2804l565
18305A09491l8517j67555J9720J31442n2746k2492J06670K7767n5670Q0752J42572
18294B81434K55705J23997Q9245K64371L86906J16060m22430n69929k75494r4228
18284A55637q9427K2009R3757J18513J41532J69888M36247L59575l30405m42832
18274F34494j80183j71306k19267j05637j727M4620n196j41375j38036J40920
$$ y = [-69331, -135139, -80461, -90343, -45738, -136732, -101384, -29956, -27272, -113833, -107426, 2577, 84113, 192277, 148614, 155390, 134981, -11645, -41312, -51621, -21334, 99182, 50364, 12979, 68433, -5791, -93827, -23110, -42683, -67650, -175323, -174529, -203109, -244118, -126219, 164778, 197774, 32095, 35842, 87959, 106984, 14207, -89689, -32880, 50252, 113056, 109491, 70974, -96581, -76861, 54581, 1835, -20657, 86013, 113780, 58110, 138862, 281434, 537139, 661136, 750381, 1014752, 1401658, 1517718, 1095288, 525359, 249865, 155637, 66210, 88219, 181976, 300489, 442021, 611909, 1048156, 1407731, 1077326, 634494, 454311, 283005, 63738, -41899, -43626, 994, -4202, -145577, -283613, -142693]
18264a42693Q5974j9463P4106J7751N4385j1901j16763l4473o981m6947O7115
18253g9890Q172K104K0047R0766j8947M1360p8998K263Q8267K2137q0235Q9009
18241A06055R4849P5461l4673j15933j13234Q652j345M9516J7696j12716N6062
18230C0390L2463j06494J6403O4208l4469j25991j00781N4616J10970l4677n2754
18219a46116k3366J3816N4896l5951K8288j57037p7761O5423O5488n0002P9298
18208a83024M4762k6012J160Q9378o7804k7666N9956Q8794N7402n399j817k3918
18196E812p1064q9707J0298J17331P8531N3343o8619k7728P9632q310j04361R1239
18184F6397M1982k9104O9712K0106m4884o4382L0008m3974q7548O8606R6445l773
$$ y = [-142693, -56719, -76182, -2076, 15675, 70060, 58159, -58604, -93077, -100058, -147005, -79890, -71718, -69614, -49567, 41199, 22252, 63612, -15386, -13123, 75144, 97281, 17046, 106055, 200904, 276365, 241692, 125759, 12525, 21177, 19832, 69348, 87044, -25672, 30390, 62853, -43641, -27238, 36970, 2501, -123490, -224271, -169655, -58685, -93362, -146116, -169482, -155666, -100770, -136721, -108433, -265470, -343231, -277808, -212320, -262322, -183024, -138262, -164274, -163114, -73736, -141540, -169206, -109250, -20456, 36946, 31547, 29730, 5812, -65252, -154959, -144661, -27330, 51201, 104544, 35925, 8197, 87829, 79519, -24842, 66397, 108379, 79275, 148987, 169093, 124209, 59827, 89835, 45861, -41687, 26919, 123364, 119591]
18172A19591L8928Q307l2919j02253p8235o6723j5724M0335Q0257P2793M8217
18161A12574o611k5097P9416R7368j7367j29405M8245m5598J6796L342M1547q8630
18149H6580J8636l0342m1806o1975j50015O2985K35961m4186n1370p9401o8325
18138a23258k2508k4723l1295l9678J37302O654J04105J16445m1575q5558Q21
18127c268J14513M5101j26948O0569P6567j51068q338R7006K7953P3263J591l4644
18115A72297q2700k3666L1861q877R1110L0182k7383O0887k2302j2943J01370
18104C09836J94459J6954j31874l9211J23161r5236j27874K565N261j05449j13441
18093C9151P3342J42898J615j14484P4858Q3265N8746K0559j03990j73478k13258
$$ y = [119591, 158519, 166826, 133907, 31654, -46581, -113304, -129028, -88693, -8436, 64357, 112574, 105963, 80866, 160282, 257650, 240283, 110878, 159123, 113525, 130321, 133663, 175210, 86580, 105216, 74874, 33068, -28907, -178922, -115937, 120024, 75838, 24468, -54933, -123258, -145766, -170489, -201784, -241462, -104160, -97506, 6599, 123044, 81469, -4089, -3268, 111245, 156346, 29398, 89967, 166534, 15466, 7128, 104134, 132087, 205350, 206941, 172297, 89597, 65931, 97792, 88915, 180025, 210207, 182824, 243711, 221409, 208466, 309836, 504295, 521249, 389375, 350164, 473325, 378089, 250215, 252780, 258041, 152592, 39151, 112493, 255391, 257006, 142522, 217380, 300645, 359391, 379950, 275960, 102482, -110776]
18082a10776k0794J69357N1707j52339p6881J1751K38318L415j73623j3949L638
18071g0176p1310M4019j16507j07957J7979q192J73355J89692J16015n6988j78311
18060f8381r8928O93R9482L5298j1859J67299n4407j55134m5830M7198q7138M454
18048a67253O6588J51905J47520o7757l7111O8929j1660K0748k6108j13627l3113
18037i39j11016K7307N2556l206o7884J8415k3246K8288L7811j4731m1025n6343
18025a54013O5259J12642j2201j52279j34551Q379J73075j1331K696Q5666J29058
18014A12400J3162q4030J1810l6064j72976P1292l1346Q0081J27681j9489m3650
18003B8871n4403j06029n7887j14997Q6699n7227J17883J45970J75023P7491q9582
$$ y = [-110776, -131570, 37787, 89494, -62845, -139726, -127975, 110343, 113758, -59865, -73814, -70176, -141486, -97467, -213974, -321931, -303952, -312144, -138789, 50903, 166918, 109930, -68381, -167309, -166616, -67134, -31836, -43695, 123604, 69197, -85937, -131767, -84569, -171707, -167253, -100665, 51240, 198760, 131003, 93892, 162821, 151161, 171909, 145801, 32174, -939, -111955, -84648, -32092, -35298, -103182, -84767, -108013, -79725, -41914, -56645, -97670, -154013, -88754, 23888, 11687, -140592, -275143, -266764, -93689, -105020, -102324, -16658, 112400, 125562, 41532, 53342, 17278, -155698, -84406, -115752, -35671, 92010, 72521, 28871, -25532, -131561, -189448, -304445, -217746, -274973, -157090, -11120, 163903, 241394, 151812]
17992A51812J14055Q245j04987j38701p3274K6416P7952J1941P9668M6946K0972
17981B21045l2682p0611Q1244l4812J34835J5362j27032N830J2885j44026m3051
17970A8987l1970M8521k5805j21795O0800J61835J95089O6616j10644m1910j19853
17959I9871q535L7988j6629j9261J45883J37725J6762k6734n1340M6064M8503
17948D10297l2120j7720m6225n6970n0340q1069M7453J81756R0924l2814q073
17937D05099J36273q9585m9871p2280L1264r6868O4780J27619j7148n0703j06527
17926B82053J08921J08455p143O8266j20196m0234J02486K3855N5682K2033m3746
17915E60432O8152P1002L3162q724r139j71573k8154Q329l8215J41513J42112
$$ y = [151812, 265867, 274112, 169125, 30424, -42850, -16434, 61518, 73459, 153127, 200073, 221045, 188363, 117752, 198996, 164184, 299019, 314381, 187349, 193179, 206064, 62038, 18987, -12983, 35538, 9733, -112062, -51262, 110573, 305662, 372278, 261634, 219724, 99871, 91336, 129324, 112695, 93434, 239317, 377042, 393804, 367070, 315730, 361794, 410297, 378177, 360457, 314232, 257262, 206922, 125853, 173306, 355062, 445986, 413172, 405099, 541372, 451787, 401916, 329636, 360900, 264032, 328812, 456431, 439283, 388580, 282053, 390974, 499429, 492286, 560552, 440356, 400122, 502608, 526463, 582145, 604178, 560432, 628584, 699586, 732748, 724024, 714885, 543312, 515158, 523487, 485272, 626785, 768897]
17904G68897Q5353o7732o0091k8170K8253k7880M6606L6560l7489o4329J20639
17893H00617J65438L3361o0954n7820J46573J01148J68863L7796l2528J11189
17883A413683l1408O9994O1458J80233K00091n6694J09439Q3788Q3564J79102
17873B293250L42783L99059K88843K01454K78129M73345Q36921Q38434Q43868
17864F796086R1815l24330l9666M52275Q53069J007958J111733J287396J244843
17855A2481179J341213J641563J867603J629167K194519L448676N281689Q187295
17847C8072904J2447018J9129423K9656691M6141537O7348421R4788938J25737967
17840D33322899Q5556952p2054752j61277553j04142036m8114975j8483383K52359
$$ y = [768897, 854250, 786518, 726427, 698257, 726510, 698630, 745236, 781796, 744307, 679978, 800617, 966055, 999416, 938462, 880642, 1027215, 1128363, 1297226, 1335022, 1302494, 1413683, 1382275, 1452269, 1513727, 1693960, 1894051, 1837357, 1946796, 2030584, 2114148, 2293250, 2636033, 3035092, 3323935, 3525389, 3803518, 4276863, 5113784, 5952218, 6796086, 6887901, 6563571, 6523905, 6976180, 7829249, 8837207, 9948940, 11236336, 12481179, 13822392, 15463955, 17331558, 18960725, 21155244, 24603920, 29885609, 38072904, 50519922, 69649345, 99306036, 145447573, 212795994, 307584932, 433322899, 518879851, 446825099, 285547546, 181405510, 133290535, 114807152, 115059511]
17833A15059511J7460625L8069005O0989503Q9262475J19834932P5121480q2708836
17826D33088695j65373171j06639295n4292627k9560318j7662919j1372970p971478
17819D0215917o344228n357543m139980k890341k040611j575194j016426o25441
17811A6226153j143242j565711j237976r56065r89430r80984p90001o47556n29323
17802G385865o0209K98630m3556p76691j166041q62437o55033l90632j97409j69951
17792C362536k87640k13676j84818R9207Q3265K9418j46415k65094k90553j62290
17782B023940j94743k08425Q0660R4209p0917j30148J77242L56022Q704m24786
17772A711758k73659j20891m0357r5595j61577p8352P8055J5836j24031r4118
$$ y = [115059511, 132520136, 170589141, 231578644, 320841119, 440676051, 515797531, 433088695, 267715524, 161076229, 106783602, 77223284, 59560365, 48187395, 40215917, 33871689, 28514146, 24374166, 21483825, 19443214, 17868020, 16851594, 16226153, 15082911, 13517200, 12279224, 11323159, 10333729, 9352745, 8562744, 7915188, 7385865, 7325656, 7624286, 7580730, 6804039, 5637998, 4775561, 4120528, 3729896, 3532487, 3362536, 3074896, 2861220, 2676402, 2775609, 2858874, 2888292, 2741877, 2476783, 2186230, 2023940, 1829197, 1620772, 1701432, 1795641, 1724724, 1594576, 1771818, 2127840, 2136544, 1711758, 1438099, 1317208, 1276851, 1181256, 1019679, 941327, 1019382, 1035218, 911187, 817069]
17762H17069L124Q2190L6150o9766l5395n9893l2020r4236j76208M067q9242L5679
17750D21519R5352m6985q6493R7225J0269o768P7288M6919p2385K093n7190p2902
17738D07942r391j0054m4309P2651n4093j42241n9054j27893M0773J38903K8661
17727B41895o8047L9958j0221R7507L8953l943J49895j29530p0936J38689l1525
17716C92695k3849j3740J7383j8242j33083j83783p3570m1827P2263J68182R6348
17705B58777Q5853k8921N5850o8756j11624j04580m6219N4734K20403J13203m1387
17694C87333j11490n86l4256K2757J8588k0167n9131k2J07493J05667m8469J48072
17682E15789Q8904q6052j10073k00305m0743p007K5264k9196O6762J51694j15270
$$ y = [817069, 820193, 902383, 938533, 868767, 833372, 773479, 741459, 647223, 471015, 475082, 385840, 421519, 516871, 469886, 383393, 480618, 490887, 484119, 561407, 608326, 535941, 538034, 480844, 407942, 398551, 388497, 344188, 416839, 362746, 220505, 161451, 33558, 74331, 213234, 241895, 173848, 213806, 203585, 301092, 340045, 336102, 485997, 356467, 285531, 424220, 392695, 368846, 355106, 372489, 354247, 221164, 37381, -36189, -78016, -5753, 162429, 258777, 344630, 315709, 371559, 302803, 191179, 86599, 40380, 95114, 315517, 428720, 387333, 275843, 275257, 241001, 263758, 282346, 262179, 203048, 203026, 310519, 416186, 367717, 515789, 604693, 518641, 408568, 208263, 167520, 160513, 185777, 156581, 223343, 375037, 259767]
17671B59767j21033j5412M0639k5476l0113J1726J38007Q2886j31396l6987l909
17660A68699l3446K8831L7629J14866O600m9025l2764Q483L2819j12751M7802
17649B17743N2688J3108L9697l7288q3610N603l8209K2676k3549k9798j749n2461
17637H4851j44245M825m255J4697q9043L9792J43326J15530K9489l4368n5559
17626A05040K7889N1023q8342r0002l0788r242J87582O6082j35046o9212M659
17615A9643Q5991o2922M9501N5494Q6578P6238K5039k9351j3869j3821l0508N4000
17603C02013N7017k2307j58913j4814r0187k8393P8966J12584P041q9287N6060
17592B09780L611P103j9831j25239L1877J98104j670j03759N4163j08577j14712
$$ y = [259767, 138734, 123322, 163961, 138485, 108372, 120098, 258105, 340991, 209595, 172608, 168699, 135253, 164084, 201713, 316579, 323179, 274154, 241390, 249873, 282692, 169941, 217743, 270431, 283539, 323236, 285948, 202338, 207941, 169732, 192408, 168859, 139061, 137312, 84851, -59394, -54569, -58824, -44127, -133170, -93378, 49948, 165478, 194967, 160599, 105040, 132929, 183952, 95610, 5608, -25180, -34422, 153160, 219242, 84196, 14984, 19643, 105634, 42712, 92213, 147707, 234285, 310523, 335562, 306211, 292342, 278521, 248013, 302013, 359030, 336723, 177810, 162996, 72809, 44416, 123382, 235966, 243007, 153720, 209780, 213391, 220494, 200663, 75424, 107301, 305405, 303735, 199976, 254139, 145562, 30850]
17581C0850r87l1947J3995Q0503L5579K9868l7167N0900R989j39370n0836N8432
17569D9809J6751O4463n9787p8144r8241l7740R9092O3683J46454j379J4180J2408
17557A91549o6357q8101q0947R4656J4694Q9645J9125m7627n8402R1284j5828
17546A43691l582O7306M1268j61206j46898p7171Q1728k3609M8444o6212N2382
17535d3859k8872o4510P3281K4808j28559r902L2850M2500L1987m7497K6044p9930
17523a71659k1228K10239M2779o9923p5583O73r373L956l3976J12525K465J9918
17511A0813M7164M6169L1363N0536J9128r85K77O4764l2172l7690j7181o2343
17499A19843j31522j31680J9494p287J4802O0147P9479J26165j24594k45199j33597
$$ y = [30850, 29863, -2084, 11911, 92414, 127993, 157861, 120694, 171594, 181583, 42213, -8623, 49809, 66560, 131023, 71236, -6908, -105149, -142889, -43797, 19886, 166340, 164961, 179141, 191549, 125192, 37091, -43856, 50800, 65494, 155139, 174264, 126637, 68235, 159519, 143691, 140109, 207415, 248683, 87477, -59421, -136592, -54864, -78473, -30029, -96241, -43859, -72731, -137241, -63960, -39152, -167711, -177613, -144763, -102263, -70276, -117773, -91729, -171659, -192887, 17352, 60131, -9792, -85375, -84702, -94075, -90119, -124095, -11570, -9105, 10813, 57977, 104146, 135509, 186045, 205173, 204188, 204465, 269229, 237057, 199367, 182186, 119843, -11679, -143359, -123865, -131152, -116350, -56203, 23276, 149441, 24847, -220352, -353949]
17488c53949P2819J70471J78766k4112O7132j28203o6750M3496j4443m4704J447
17477i8030J16887p288j00543K1722N5617M6044r7357p8495o8751j4124J0539
17466b13779K7403J9636L7344l1140O087J29640j07469L5992O3388m7388K3036
17455e7250M5339M7455k2346j7047p1536n2164K6886J32836p0743j11295R2404
17444e7461J12969j15036k3648N5368k8309n4490P0985R9060J5199p0838l7646
17433c3847j5247O5181O0322j44561J9763M8435L9390n312J7141o0176k7846K03743
17421A66986J63296j61179j01432j8232J3011j34265K5757N9401J38321K2495
17411A74159k19990M7580R7658L7723J07000j15297j33439l0343N5621o5144k4663
$$ y = [-353949, -281130, -110659, 68107, 43995, 111127, -17076, -83826, -40330, -54773, -99477, -98030, 18857, 11569, -88974, -67252, -11635, 34409, -62948, -141443, -210194, -224318, -213779, -186376, -166740, -129396, -160536, -154449, -24809, -132278, -96286, -32898, -80286, -57250, -11911, 35544, 13198, -3849, -75385, -127549, -100663, 32173, -38570, -149865, -57461, 55508, -59528, -83176, -27808, -56117, -110607, -39622, 59438, 74637, 3799, -33847, -49094, 16087, 76409, -68152, -48389, 46, 39436, 34124, 51265, -8911, -36757, 166986, 330282, 169103, 67671, 49439, 62450, -71815, -46058, 13343, 151664, 174159, -45831, 1749, 99407, 137130, 244130, 128833, -4606, -34949, 20672, -44472, -69135]
17400f9135L822N6610R181m3433p3445j01762P4595J00097o4546O379R3190J3281
17388D834N9454m2941j50090p6635O1800P45J9792O7318M0616J80923j4890j70022
17376a9096j78715L7247J04447l807k5860K4828r9302L6926L3084K0518Q6937
17365A7207P6985r957j7812O2275p7809L7004j4406p0583o7785N498J58449m904
17353I4162l7546J3106K6963m5856n7871n8830J1079J689L6898J49134l2496o3240
17341C7192N9980p9943r9223j60354p672J28525Q0769n5141o1319K7328K44182
17330A14324J24419k6455j21991j77108n2445m024R894Q0650n895k0509p1997
17319a51137L0352J83245M7733O9730j350n3833M6018K7220q3581j54983j63702
$$ y = [-69135, -65313, -8703, 478, -42955, -116400, -218162, -143567, -43470, -108016, -101637, -8447, 4834, 64288, 21347, -128743, -205378, -143578, -142833, -123041, -55723, -15107, 165816, 150926, -19096, -197811, -160564, -56117, -59924, -85784, -60956, -160258, -123332, -90248, -69730, 17207, 94192, 84235, 66423, 128698, 50889, 87893, 73487, 2904, -64881, -59383, 99066, 94162, 56616, 69722, 96685, 50829, -7042, -65872, -54793, -53104, -16206, 132928, 100432, 37192, 97172, 17229, -81994, -242348, -250020, -121495, -40726, -95867, -157186, -129858, 114324, 238743, 212288, 90297, -86811, -139256, -143280, -133386, -52736, -58631, -79140, -151137, -120785, 62460, 110193, 179923, 178573, 124740, 170758, 197978, 114397, -40586, -204288]
17308b04288J39630Q8616M6949q9536j3467j2563J1472M4143L1715r3522l9943
17297i0794p565J19703J04723l4637n56Q4611J33865M0991k57740k14283M8737
17286g2945N9860j7983j00741p6576L0299R1912K1705R7939N2200K0419r4276
17275A1813q8883j5432K4482J05610N7156L0397k6964o4940m7496K3065J05097
17264A13905L765j1468N7736j18819N8006j3430j0471O2693J36066L8261l7510
17253B78734r1582L7245R7365J62872L1777N1751L39169L57337L04151L81607
17243A950426K44752j28483m58517n52223m12353k01479n3179P9122K48967L88058
17233A105091L84678M16054L54275k14061o10005n61696l29000k60353j17903
$$ y = [-204288, -64658, 23958, 70907, -18629, -32096, -44659, -33187, 10956, 42671, -50851, -90794, -98359, 21344, 126067, 91430, 90874, 175485, 309350, 350341, 92601, -121682, -72945, -13085, -31068, -131809, -208385, -178086, -86174, -64469, 33470, 85670, 106089, 11813, -77070, -92502, -68020, 37590, 94746, 125143, 98179, 33239, -14257, 8808, 113905, 117670, 106202, 163938, 45119, 103125, 89695, 79224, 141917, 277983, 316244, 278734, 187152, 224397, 321762, 484634, 516411, 568162, 907331, 1264668, 1568819, 1950426, 2195178, 2066695, 1608178, 1055955, 643602, 442123, 388944, 468066, 717033, 1105091, 1489769, 1905823, 2260098, 2046037, 1436032, 874336, 545336, 284983, 167080]
17224A67080K9170L5116M1694j26605o3370j39217m2829M4083o804M5787N3455
17213C7560J0624L1203p1011o1820N2487M8733l5213J21179N5161n5116j06952
17202B6835M8431J3352j64215p4581p9798M2980J74648K7150j25138j08441p0070
17191b88847r149J46395L5356K8843J81612p7912k17321K7451J49852l6164P0848
17180A0964K3165k1235K6312L0540n4867j30460l0813l8904N3186l6441J6615
17169a51938r2041M7663J01149o4452j02999N7808J05602k4033J81004J03557
17159A61320j8845j88943n5958R8198L5141r0758j01007q9673o693J15459J22092
17148a9667L6450j43148L5238M0921r3596J6860P7494k2275Q1915j32935p7217
$$ y = [167080, 196250, 231366, 273060, 146455, 83085, -56132, -98961, -54878, -61682, -15895, 37560, 48184, 79387, 8376, -53444, -957, 47776, 12563, 133742, 188903, 133787, 26835, 75266, 88618, -75597, -150178, -229976, -186996, -12348, 14802, -110336, -218777, -288847, -297996, -151601, -116245, -87402, 94210, 16298, -201023, -173572, -23720, -59884, 10964, 34129, 12894, 39206, 69746, 14879, -115581, -146394, -185298, -132112, -168553, -151938, -243979, -196316, -95167, -159619, -262618, -204810, -99208, -123241, 57763, 161320, 142475, -46468, -102426, -4228, 30913, -59845, -160852, -250525, -257218, -141759, -19667, 16783, -126365, -91127, -50206, -143802, -126942, -49448, -71723, 10192, -122743, -199960]
17137a99960m6045P7615J22024n1050q5446o0545k7642p1264Q2622P3203k4858
17126b11346R1949l3369J07627k1238L5374j50231N3624J77046j27289L5150P7624
17115C4921L882j9672k0349j4686L1583n1711n9736L543J73469R9050r13j31096
17103D8285J9782J18135L4265r8053j20587o261J2899M9270k1897K9657Q6001
17092A51496l1371O3127O5163q5073r5226q7425m7789J7284O6628p519J15983
17081A25278j64999j87300K5067R3820J3665n6609O2946L4259m4047J08587J26658
17070A37325m4615p3890j00445j46748M7178Q9868N2255J33918J1444l2461j2764
17059F1065J3010p5338r6623L9101M9919q2408R2754J12094K6530N0026j63257
$$ y = [-199960, -246005, -168390, -46366, -97416, -182862, -243407, -271049, -342313, -259691, -186488, -211346, -119397, -152766, -45139, -66377, -31003, -181234, -127610, 49436, -77853, -42703, 34921, 38803, 19131, -1218, -15904, 15679, -36032, -95768, -92225, 81244, 180294, 179381, 48285, 68067, 186202, 220467, 122414, 1827, -4434, 8465, 57735, 35838, 65495, 151496, 120125, 183252, 248415, 163342, 68116, -19309, -67098, -49814, 16814, 9295, 125278, -39721, -227021, -201954, -108134, -94469, -151078, -88132, -53873, -97920, 10667, 137325, 92710, 18820, -81625, -228373, -181195, -91327, -39072, 94846, 106290, 73829, 61065, 74075, -1263, -97886, -58785, -8866, -91274, 1480, 113574, 140104, 190130, 26873]
17048B6873o1322N6236l1777P3823q9537j27458N8841q2151m5020K4412l7443
17037b34523k9050J6464J4196O3484R437P0287q4628M0049O0913r8092l2320k0761
17025b24544R3945o6156l3578J01755M9824N7811o075n1029n9567N2073K5509
17014f0032p0966p4720M7958J29061L9594r917N2721l7540r7221R1276P868P6888
17002I4970O9232O130P7575j13923r1039q6243r2320l8954O2283K2704p3492k6549
16990a89626l8180p6663R0928M0040O3086q3772q6423o7096l8935m4403j5336
16979d46380P6425O9255J47072J49458J0554J8062l1228o2012k8039K6933L0678
16968c9222m9387J6215J68376N3951j1948j9534o0337q7249j1714J2955K8479
$$ y = [26873, -34449, 21787, -9990, 63833, -25704, -153162, -94321, -176472, -221492, -197080, -234523, -263573, -247109, -232913, -169429, -159992, -89705, -174333, -134284, -73371, -171463, -203783, -224544, -130599, -196755, -230333, -128578, -78754, -20943, -27018, -78047, -137614, -85541, -60032, -130998, -205718, -157760, -28699, 10895, 978, 53699, 16159, -81062, 10214, 18082, 94970, 164202, 170332, 247907, 133984, 42945, -43298, -135618, -174572, -112289, -89585, -163077, -189626, -227806, -304469, -213541, -173501, -110415, -194187, -280610, -347706, -386641, -431044, -446380, -369955, -300700, -153628, -4170, 6384, 24446, -6782, -68794, -96833, -69900, -39222, -88609, -72394, 95982, 149933, 137985, 118451, 58114, -29135, -40849, -27894, 585]
16957E85n5583j47655Q172M9902K0026J6426J62857J2229p7480j821K0333J00133
16945A08124N4927l9337j15479m0806K02487M7064j09267r9303j01007q574J86526
16934H5355n0172p5584R9447J20033M8924k1353j52708L1l6100j6910K4646L8361
16922F3970n9756m5409j0685j914P8430J10916M400k11617q3563q2278P1044O9588
16910i6874m646N7369J38876n1836K6365R8935l1410l0732q487n3517j48784n0853
16898a55594L7464n416Q2144o4328M746l7757j13265Q480J29847K1214l597P8717
16886a7345J8320p4906k2607k5243k0614j9123j0762L3530J6631J04108L6076
16875A8065j22297K8828j1457M2219L6089N8146q957l5513q7189Q0854p901k0837
$$ y = [585, -54998, -202653, -194481, -144579, -124553, -108127, 54730, 66959, -10521, -12342, 7991, 108124, 163051, 123714, 8235, -32571, 169916, 216980, 107713, 8410, -92597, -101171, 85355, 35183, -40401, 59046, 179079, 228003, 206650, 53942, 53973, 17873, 963, 25609, 63970, 4214, -41195, -51880, -53794, 24636, 135552, 139952, -71665, -155228, -237506, -166462, -96874, -101520, -44151, 94725, 42889, 69254, 168189, 136779, 106047, 97560, 44043, -104741, -155594, -118130, -123546, -41402, -105730, -100984, -138741, -252006, -243526, -113679, -92465, -96062, -17345, 975, -73931, -96538, -121781, -142395, -161518, -172280, -138750, -122119, -18011, 18065, -104232, -75404, -86861, -44642, -8553, 49593, 40636, 5123, -82066, -1212, -9113, -29950]
16863b9950j04086J6248O0662n0454n5981r365n5983J06108J06499J0293o0748
16852f6757n5327j9196o6294P3110J14253J58890K0678L5316p3959j11819j38478
16841a29583oj8040K6838L2640O0521o2719J3309k4401J9875o6786k0773k8177
16829a97302k2033p1853L081N8650Q7240K24769Q2480J21041r0643N2296j60170
16818H7556j85660n1865L2913L9222L785j2652K3306Q4765K3830m2758j8094j20878
16806a36530K3423J09463N5090K8447n8404j62989n0417p6142J15176J41677N6630
16795D5424O6635L9208k2720l9603j7451Q4159J053p1276l8444l5030n2701M5304
16783D558J09743n6379j06885n4389Q2952J13553J06199p5874j93750q2436Q9752
$$ y = [-29950, -134036, -117788, -57126, -107580, -163561, -172926, -228909, -122801, -16302, -6009, -66757, -122084, -141280, -207574, -134464, -20211, 138679, 159357, 194673, 120714, 8895, -129583, -129589, -147629, -120791, -88151, -27630, -90349, -77040, -101441, -81566, -148352, -169125, -197302, -219335, -291188, -288107, -229457, -142217, 82552, 165032, 286073, 195430, 247726, 87556, -98104, -149969, -117056, -77834, -74049, -86701, -63395, 21370, 45200, 2442, -15652, -136530, -113107, -3644, 51446, 79893, 21489, -141500, -191917, -268059, -152883, -11206, 45424, 112059, 151267, 128547, 88944, 71493, 155652, 156705, 85429, 46985, 11955, -40746, 4558, 114301, 57922, -48963, -103352, -20400, 93153, 199352, 123478, -70272, -152708, -62956]
16772f2956L9902p7879k0613o8335J6819L9216K1558Q1655j1869j4868J39030
16761H1660Q1250P1565n8882j04649M4739J272q0645j54115k01755J063J09319
16750b09178J5933J3424N4041Q6178J15537J9019j11717r5195K5966J08061k982
16739A9087P5116J4062k2549j14572j06530O1251J18277J1158L2055j13000l4151
16728e9796m3637K405k4070k1726N5029o131R8200K8509l21k4234j11182j7315
16716a24269J6950O9516L5656j5301j17446m4592Q2903J18750J39554O8331J4204
16705B44256j29078j08130R497n6556j49157l9950M3293O1633l2472j11842M2578
16694b25928q3962J18663J83876K14063j34985j21650J14266M7152p1636l2481
$$ y = [-62956, -23054, -100933, -121546, -189881, -173062, -133846, -112288, -30633, -42502, -57370, 81660, 162910, 234475, 175593, 70944, 115683, 116955, 36310, -117805, -319560, -318497, -209178, -193245, -179821, -125780, -39602, 75935, 94954, -16763, -111958, -85992, 22069, 19087, 94203, 108265, 85716, -28856, -135386, -74135, 44142, 55300, 87355, -25645, -59796, -103433, -101028, -125098, -146824, -91795, -97926, 274, 28783, 28462, 4228, -106954, -124269, -107319, -37803, -2147, -17448, -134894, -179486, -96583, 22167, 161721, 230052, 244256, 115178, 7048, 16545, -40011, -189168, -229118, -185825, -124192, -156664, -268506, -225928, -309890, -191227, -7351, 206712, 71727, -49923, 64343, 111495, 39859, 7378]
16684G378p2800k27577q0690J27450K57025M7096N0410m9108l8906N8091M6651
16673A25020r2082k3116R6194N6625l2695j2342l0746j25728n9596L8376K0253
16662c9837R1563m3892q1201n406P5094l2395j43253j92813o1680K30095Q5338
16651a18387j36232q5125p4765O7939J75200J76257l6879Q4047m3828q4566j11857
16640a88196J14107O5091K1370k2299K0383o9103n7207J5801j31322Q549J89516
16629c3310O2034l3705l2431k0058j27667n9437J04722J10507J07631n674q3742
16618a1130j0220j1290j1528p7619q3145J28319J12459n8397j0014J59236J6911
16607A43582j05293p9676p460j28044n3110K9193O4507P5187M0338O991J4268
$$ y = [7378, -65422, -292999, -373689, -246239, 10786, 57882, 108292, 59184, 20278, 78369, 125020, 32938, 9822, 106016, 162641, 129946, 117604, 86858, -38870, -98466, -60090, -39837, 51726, 7834, -73367, -78773, -3679, -36074, -179327, -372140, -433820, -203725, -118387, -254619, -339744, -414509, -346570, -171370, 4887, -31992, 52055, 8227, -76339, -188196, -74089, -8998, 12372, -9927, 10456, -58647, -115854, -100053, -231375, -222826, -33310, 28724, -4981, -37412, -57470, -185137, -244574, -139852, -29345, 78286, 72612, -11130, -21350, -32640, -44168, -121787, -204932, -76613, 35846, -22551, -32565, 126671, 143582, 38289, -41387, -48847, -176891, -230001, -200808, -136301, -61114, -20776, -13785, 483]
16596D83L7083o3945m1121J10232p3877j04498J772J4005J11655o5226L752j533
16584g1218Q8269N6679j04938j11985R1338L1691j7475l1790p7377O8706R0913
16573A2813L1101p0595m1636Q945l0699n255R3580Q4740p4778j06149P0981k0718
16561d7670l9999k2865M1284O9740R2443Q664m4092J6879N6859j01717p0102o3291
16549a03867J71994K7789l9066j46869n7218m55K6278J87860J68237j83956j10732
16538f0005o1231K0580Q5187M9161n1784L0311J1993l2099j5492M6569K3207q4828
16526c8431m2677M4668Q351L589q5612L5111j126L6223J29944j89973k5863k7860
16514a53656k9993j9784L44L5031J43222M7838j31762l5701J05609q0439k7634
$$ y = [483, 37566, -26379, -67500, 42732, -31145, -135643, -133871, -119866, -8211, -73437, -69685, -71218, 17051, 73730, -31208, -143193, -51855, -20164, -37639, -69429, -146806, -78100, 12813, 43914, -26681, -68317, -59372, -90071, -95326, -1746, 82994, 8216, -97933, -26952, -47670, -87669, -110534, -69250, 490, 92933, 101597, 57505, 74384, 131243, 29526, -40576, -103867, 68127, 95916, 56850, -90019, -147237, -147692, -121414, 66446, 234683, 50727, -60005, -121236, -100656, -15469, 33692, -18092, 12219, 24212, -7887, -23379, 23190, 46397, -38431, -81108, -36440, -28089, -24500, -110112, -75001, -76127, -39904, 90040, -99933, -125796, -153656, -183649, -203433, -203089, -168058, -24836, 23002, -108760, -144461, -38852, -119291, -146925]
16503a46925Q0197M4803Q7346O3523L5183N3687k0238n7167n4267j9472k287l7611
16491B6772N973P1493j06977k42259n2091M5033J05161p4758m1587J46534J20512
16480C806N41j34815l9323j461O2751N3483m428P0279J9849m0565p9923j54247
16468b44053L0143M0734J02976k2462p9668m6025R5852Q1504J1240m4413L7417
16457c6755j37551L1732O4071p713P0439M1107P5408k5523r518r0425K1487j58868
16445a62109R7901J01504q5274m7253J06243J22307J4305l0730l2287n3652l4439
16434c484j7437J4199M4669M7757n7798j35617p7729n5724q873M7244J79312J66933
16422A43452m5291q3358o5658o2785O0440K2703l4349N0045o3072j49811l0210
$$ y = [-146925, -66728, -21925, 65421, 128944, 164127, 217814, 197576, 140409, 86142, 66670, 64383, 26772, 32745, 104238, -2739, -244998, -297089, -252056, -146895, -221653, -263240, -116706, 3806, 4347, -130468, -169791, -171252, -108501, -55018, -59446, 10833, 30682, -9883, -89806, -244053, -213910, -173176, -70200, -92662, -172330, -218355, -122503, -40999, -29759, -74172, -36755, -174306, -142574, -78503, -86216, -15777, 25330, 100738, 75215, 65697, -24728, -3241, -162109, -64208, 37296, -47978, -95231, 11012, 133319, 147624, 116894, 84607, 30955, -3484, -20921, -6722, 37947, 85704, 27906, -107711, -185440, -241164, -250037, -202793, -23481, 143452, 98161, 14803, -50855, -113640, -53200, -30497, -64846, -14801, -77873, -227684, -257894]
16411b57894R5888m8608q456J69984J23486M0155j11366r8954m9311J04835J58078
16400A17837J8850p6018k497M1285m3135l9277J21875M3373k09961r3026m8189
16389a68883o404O810o3086l3713j334Q5768R1616n1458j02704J5451l8997R8224
16377a68710l2315M003P7900J07580P4922L6154l9955j11985j29694j28436M9067
16366b61469J52675P8659j57877q7555n8514P6898l241N5414P7400m97o1371k6301
16354b15779J53647n521J3222m0077k6548J65858L3786j595q7612r8129j13388
16343b22136k7530N9581k1014m971q361J09926J44711L0045p103n3259k6774l9197
16331f6082J06579J02742q4852Q743r859R0181M0134p2220m9250m2886l5537n2979
$$ y = [-257894, -162006, -210614, -219070, -49086, 74400, 114555, 3189, -95765, -145076, -40241, 117837, 136687, 60669, 58172, 99457, 56322, 17045, 138920, 182293, -27668, -120694, -168883, -175287, -168477, -231563, -265276, -266610, -180842, -89226, -140684, -243388, -227937, -266934, -168710, -201025, -197022, -119122, -11542, 63380, 99534, 59579, -52406, -182100, -310536, -261469, -108794, -30135, -188012, -275567, -334081, -257183, -260424, -205010, -127610, -128107, -189478, -215779, -62132, -67653, -54431, -94508, -121056, 44802, 78588, 76993, -10619, -108748, -222136, -249666, -190085, -211099, -216070, -224431, -114505, 30206, 60251, 53148, -111, -26885, -66082, 40497, 143239, 58387, 67130, 57271, 147452, 187586, 115366, 66116, 23230, -12307, -65286]
16319f5286r2429p0001P5270J38660R1406J01440J2395l5083J4639j2309j48128
16308A0574j08483Q2424j8658p5788j36668P1801J1421q4208m7193J5352K05595
16297g3831J45036O1204r5168j40709m4402l7562M0220L7746l9845N5857J59509
16286F8055L2157o0839j16793n8203P5209P3831n2729L4859l1690j71256J1774
16275a95625m0777p3515L86L6935K9918J82824J41478p6513j32789n6283O000
16264a77961n845L5273J32728R9262J53980o5980j93742q3089K9284P1360J4100
16253I370l7245K7822l1607l7737q7301r7884J28585l7854q8181K2741N4919P5037
16241i9335r8980l469J57407J39614j9410l7418p4677P4939J11746M0025j29833
$$ y = [-65286, -157715, -227716, -152446, -13786, 77620, 179060, 191455, 156372, 171011, 158702, 10574, -97909, -15485, -34143, -109931, -246599, -174798, -163377, -247585, -294778, -279426, -73831, 71205, 132409, 37241, -103468, -147870, -185432, -145212, -107466, -147311, -91454, 68055, 100212, 39373, -77420, -135623, -60414, 13417, -39312, -4453, -36143, -207399, -195625, -236402, -309917, -309531, -272596, -242678, -59854, 81624, 5111, -127678, -183961, -177961, -183806, -148533, -15805, 83457, 237437, 171457, -22285, -105374, -76090, -4730, 9370, -27875, -53, -31660, -69397, -156698, -254582, -125997, -163851, -252032, -229291, -174372, -99335, -198315, -201784, -44377, 95237, 75827, 38409, -36268, 38671, 150417, 190442, 60609]
16230F0609J18119O314P0486j4516k56535j6463J73203J92028p6538j08935q3282
16219F4490o387j689K7213J26626o0784j61781n971j21359n6476R5624k0144J2074
16207a08564m3366l320Q9713J09972L1225o0669j10507m277j27612j05522J26352
16196b06575m0403J24265P1280j6022J35643j5153j24253N9695j6373l1829r043
16185f8768J2689j35094q2606k5561M2236N1882k1455J7083K2872P6535P2203
16174c7984o7578Q033M9481m540P6820L2577n8984o6210p6116J22335O805p3439
16162h8800J06631J7816l1162q6894J27850N7803q6028K8014j2j86n3061J5622
16150G593r502k3516J3252l1222l5456j813o5657J29121K12471J3237j02118j67725
$$ y = [60609, 178728, 185042, 255528, 241012, -15523, -31986, 141217, 333245, 256707, 147772, 64490, 58103, 56414, 83627, 210253, 149469, -12312, -18283, -139642, -196118, -100494, -120638, -108564, -151930, -155250, -65537, 44435, 75660, 14991, -95516, -99793, -227405, -332927, -206575, -246978, -122713, -51433, -67455, 68188, 53035, -71218, -11523, -27896, -59725, -68768, -56079, -191173, -273779, -299340, -257104, -205222, -226677, -209594, -186722, -110187, -37984, -105562, -97529, -48048, -52588, 24232, 56809, -2175, -68385, -144501, -22166, -15361, -88800, 17831, 35647, 4485, -82409, 45441, 103244, 17216, 45230, 45218, 45032, -8029, 7593, -1909, -25425, -12173, -43395, -78851, -80664, -146321, -17200, 195271, 208508, 106390, -61335]
16138f1335j4335O3837L7230N7495q5979N3137n2831q7378j8764M5817J58559
16127I5453L3934j28437L0677r8621j3342m7698m1298L5772j24347q0436m1963
16116c80306j0971R2961J02436N3740K6496N7459p5494p661J53202J14719Q1872
16105B08453j08436j0037l1933K1861r8712k575k7528o9815J6224J14735J34052
16094A46289L4197j97673p2874j6207R715K8729Q5631n8501l1511J64538O8593
16083A60926O5890o0531j93096l0396k172m4893l470p734n3596n671K1944J8726
16071a34073N0547L731M3653N9094J28260l6643m0261o791j80431m5914J29032
16060b9796J80785r929k2062O2389K707q926j18951j50974m2631l3940J32117
$$ y = [-61335, -75670, -11833, 25397, 82892, -3087, 50050, -2781, -90159, -108923, -63106, 95453, 129387, 950, 31627, -66994, -80336, -128034, -169332, -133560, -257907, -338343, -380306, -391277, -298316, -195880, -142140, -115644, -58185, -133679, -141340, 11862, 126581, 208453, 100017, 89980, 58047, 79908, -18804, -21379, -48907, -118722, -102498, 12237, 146289, 180486, -17187, -90061, -106268, -96553, -67824, 17807, -40694, -72205, 92333, 160926, 226816, 166285, -26811, -57207, -59379, -104272, -107742, -115476, -169072, -174743, -152799, -134073, -83526, -79795, -36142, 22952, 151212, 114569, 74308, 67517, -112914, -158828, -29796, 150989, 141060, 118998, 181387, 184094, 175168, 56217, -94757, -137388, -171328, -39211]
16049c9211M2150j7903n7463L5102q449M035J2815N546J1898p5143J1399K0877
16037e4347l7436j1558j9948Q9617K8752q1077N1249M2446Q707j59245m141J29116
16025a7865R8215R156j54607p9494J35098J02967q1756j50598L143J11963J37755
16014A13977k152R629n3217L5145n6048p7129m7231M2063J06232L4643O069j09487
16002B494O6466L0168p4603K3794k3492N0849Q075P4475Q2550L7469J4494j31386
15990A61353j39264K920K1361K8210p6305j23172j83007o8250J49099J25056k5114
15979a27113j04054L1026R7037J18346P0175j13129p5822J60440J39318o7338
15969A28886n4166j74790l4431M7377j760j74136l8986l9797l7927L5191M0606
$$ y = [-39211, 2939, -14964, -72427, -37325, -45774, -41739, -28924, -23378, -11480, -86623, -75224, -54347, -91783, -103341, -123289, -33672, -4920, -85997, -34748, 7698, 16405, -142840, -146981, -17865, 80350, 89506, -65101, -144595, -9497, 93470, 11714, -138884, -135741, -23778, 113977, 111825, 121454, 68237, 103382, 47334, -29795, -77026, -34963, 71269, 105912, 111981, 2494, 68960, 99128, 24525, 48319, 24827, 75676, 83751, 158226, 240776, 278245, 292739, 161353, 22089, 25009, 46370, 74580, -1725, -124897, -307904, -376154, -227055, -101999, -127113, -231167, -200141, -103104, 15242, 85417, -27712, -103534, 56906, 196224, 128886, 74720, -100070, -134501, -87124, -88884, -263020, -302006, -341803, -379730, -344539, -303933]
15958c03933j9286O2898L9428J40805J25399j1259j17436N1605k734l9588L245
15947g0856j0409q3496N9691K2032q5454L8957P8491N9797o4405K2156O9659N5175
15935I1338J2410j5964m5965j29251j33927n5294o2451R115J18917J4305N1036
15924a45731J08949r701j2510l3221R984n573O2811j04277q4833K6355J12634
15913g5113J00468P7141q0159r8599R434J23196R1766k2271Q275k5571K5542J02683
15901B36792r6324m6205m206r7624q1189L4719J00297l2207q2061K9154l3520
15890g2374M8306m4606o6546M0821J61019J47199J7346k01138r4917l370l1892
15879a00152l4359j6691R4552N5685K9910L0041j512r1288q9869j15096J04633
$$ y = [-303933, -323219, -260321, -220893, -80088, 45311, 34052, -83384, -31779, -34513, -74101, -70856, -81265, -164761, -105070, -83038, -168492, -129535, -51044, 8753, -55652, -33496, 36163, 91338, 103748, 87784, 41819, -87432, -221359, -276653, -339104, -329989, -211072, -196767, -145731, -36782, -46483, -58993, -92214, -82230, -87803, -24992, -129269, -214102, -187747, -75113, 25355, 102496, 22337, -76262, -66828, 56368, 148134, 125863, 134138, 108567, 134109, 236792, 140468, 94263, 90057, -7567, -88756, -54037, 46260, 14053, -68008, -38854, -72374, -24068, -68674, -135220, -94399, 66620, 213819, 231165, 30027, -64890, -68260, -100152, -134511, -151202, -56650, -965, 28945, 58986, 57474, -33814, -123683, -238779, -134146]
15868a34146K030N3375L766m7962K5901M6731L6621M8520k4009m0053r4171K8567
15856i4830k4522J6664r1250P6061J11099n3777j1367J07326m5794q792L2437
15845A3255R3952q085R3969J07484r4079j30052o2059R365m0617j29881N4715
15834i2033R3236m8252L7107L7748j05326P4705N7550P9341j45266r3702J8473
15823h6419J24977J1807J1408N644j26889J6383J9858o9051j19740O1758Q4472
15812f5792j2317J7866m0553L9686o9135R7175P2168m7005k6573R0909N7584n3446
15800F0567j32011j29144j5768J79560M1761n4682R0737o1002J4777k3602j30639
15789a59446N5176Q8217P5201p4672K9740k4917n8r4911L0272R5539m645j5198
$$ y = [-134146, -132116, -78741, -74975, -122937, -97036, -50305, -13684, 34836, 10827, -29226, -123397, -94830, -119352, -102688, -193938, -117877, -6778, -60555, -71922, 35404, -10390, -19182, 13255, 107207, 99122, 193091, 300575, 206496, 76444, 14385, 23750, -16867, -146748, -92033, 1203, -47049, -9942, 27806, -77520, -2815, 54735, 134076, -11190, -104892, -86419, 38558, 50365, 61773, 67417, -59472, -43089, -23231, -92282, -212022, -150264, -65792, -78109, -60243, -100796, -61110, -130245, -33070, 39098, -7907, -34480, 56429, 114013, 60567, -71444, -200588, -216356, -36796, 4965, -49717, 41020, -19982, -5205, -28807, -159446, -104270, -16053, 59148, -15524, 14216, -10701, -10759, -105670, -75398, 20141, 15496, 298]
15777B98J19450O2910Q213j66416r184L5883k00607j39548N8043O1210J0307n2404
15765b11845N691O7143r478O4087p8827j43860o21R857J28907J79545R2146M926
15753A07671o0448k0735m6078j9690o6701K4507J36639J18346o5467j61092j39669
15742a92717J98137J27518J9992J031Q598K3804j50038k15340j2565o674J13251
15731h5003J66834J46891l2413l9387R422j44027p9562k7439j11262j2682k6118
15720b34746k9133L8006P0015P878J2437n1346L941J45343J28924j2525l0518
15709D8276P6738p0434m3413l5860k4528j4097O8978M7646m3852j94101N9912
15698a24735J39688M5973q8517J25869k69j40057L6435L1530l9291O8264L8790
$$ y = [298, 119748, 182658, 190871, 24455, 15271, 51154, -149453, -289001, -230958, -169748, -159441, -211845, -206154, -139011, -148489, -84402, -163229, -307089, -307710, -297853, -168946, 10599, 102745, 107671, 47223, 26488, -19590, -39280, -105981, -81474, 55165, 173511, 108044, -53048, -192717, 5420, 132938, 152930, 153961, 162559, 186363, 36325, -179015, -191580, -198254, -85003, 81831, 228722, 196309, 156922, 166344, 22317, -57245, -84684, -195946, -208628, -234746, -263879, -225873, -155858, -147980, -135543, -186889, -182948, -37605, 91319, 78794, 48276, 125014, 54580, 11167, -24693, -49221, -63318, 5660, 53306, 9454, -184647, -124735, 14953, 60926, -27591, 98278, 98009, -42048, -5613, 25917, -13374, 54890, 93680]
15687I3680n6735j56424j56386N4975J40445j08039r1377M5271L9020j04655R2521
15676b07704R5717J61414J27626k3776o6938J6626p0663p7000p1860m6617J54082
15665i093n581j6870J9754K7770m8023K0302K134M66J13805j61759k1470K1885
15653e6680q4562o1294M1701j04987n3651J12228J58158M0000Q879l2683Q207
15642b4684k8519M2121p3958q368o2891l5501L4915L0344K1598p5699r8258L1214
15630b47686J38234J4346M7070p0529j21677J68167J78183J68284K8571n6180
15620B46783M7117o5727j28564K4812J60850j05451m9264q0385o9142l2950N2109
15609A88L30n9559m5910m2005K0779O6929R5885m8636J6944r2537l0577R6695
$$ y = [93680, 36945, -119479, -275865, -220890, -80445, -188484, -279861, -234590, -195570, -300225, -207704, -111987, 49427, 177053, 153277, 86339, 102965, 32302, -44698, -116558, -163175, -9093, -14674, -31544, -11790, 15980, -32043, -11741, -9607, -9141, 104664, -57095, -78565, -56680, -141242, -202536, -160835, -265822, -319473, -207245, -49087, -9087, -208, -32891, -24684, -53203, -11082, -85040, -93408, -156299, -191800, -156885, -126541, -104943, -180642, -278900, -247686, -109452, -95106, -48036, -118565, -240242, -72075, 106108, 274392, 302963, 246783, 293900, 228173, 99609, 124421, 285271, 179820, 130556, 50171, -18971, -51921, 188, 518, -59041, -104951, -146956, -126177, -59248, 36637, -11999, 4945, -87592, -118169, -21474]
15597b1474j3125J7061R742j06537j18177K4735L0003k809J7478R7814K6731M3972
15585E414K5346O0278L0424r3554j21018j0906N6326o4778o1559J01500J41732
15574F9205O4728j82123l0171J50414j8436p4964M5738N4574O4062J7364m5164
15563A15227r1759n1182p8831k2247l1654j03968n4022L5351L845J19818L0304
15552a29118j2629p8288p5817O7843N6246j67605k6683P1288Q7059M3377k667
15541a66994J45251m0704p3561l3242N2709k7377m2880l4411k6776L1185K2530
15530a94270O234P2645l8139l2014O290L7807J65784J5677M5752M533j6457j81548
15518a07706j29648O7564R829L9426J3521L3967Q4979R2262J2735R0883j60753
$$ y = [-21474, -34599, -17538, -7796, -114333, -232510, -207775, -177772, -180581, -163103, -65289, -38558, 5414, 30760, 91038, 121462, 27908, -93110, -104016, -47690, -112468, -174027, -72527, 69205, 133933, -48190, -78361, 72053, 53617, -21347, 24391, 78965, 143027, 160391, 115227, 23468, -27714, -106545, -128792, -160446, -264414, -318436, -283085, -279240, -159422, -129118, -141747, -220035, -295852, -228009, -171763, -339368, -366051, -294763, -207704, -164327, -166994, -21743, -62447, -136008, -169250, -116541, -143918, -186798, -221209, -247985, -216800, -194270, -188036, -115391, -153530, -185544, -179254, -141447, 24337, 40014, 85766, 90299, 73842, -107706, -237354, -169790, -159961, -120535, -107014, -73047, 11932, 104194, 116929, 207812, 47059]
15507D7059j01519L1004Q7814M1236J0562q401M3033q5225L0650m8411m2871o1765
15495e6834j0638L6746j23484o7348Q9338R4768K5413o192L1363m4114j9606r4979
15483a45567P1607J33041k1165R0926N1452j75773j78484P6551K7915m3952M9044
15472f4405O0238j18443p4789K5825p0827l8197J55796P5297l49k888m8575m0762
15460a42079p8972Q8339N5137P5365L9231l161N4452P2072l2818j6248N1256j6105
15448A46469J16901j1888r0563o1822p1780q893J5331O3744J37348k2151n3785
15437A58911m8756j1625m6824o2457o4599o0157O4462M9741q273L1922M6130j8266
15425C0209j26620K3550Q2433l2073Q914L1244J28503M0485q2346k6863m9740
$$ y = [47059, -54460, -23456, 64358, 105594, 116156, 107755, 150788, 65563, 96213, 47802, 4931, -56834, -67472, -30726, -154210, -221558, -132220, -37452, -12039, -18231, 13132, -30982, -50588, -145567, -73960, 59081, 37916, 128842, 180294, 4521, -173963, -97412, -69497, -113449, -64405, -4167, -122610, -197399, -171574, -242401, -280598, -124802, -49505, -49854, -52742, -101317, -142079, -221051, -132712, -77575, -2210, 37021, 33860, 88312, 160384, 127566, 111318, 162574, 146469, 263370, 251482, 160919, 99097, 27317, 18424, 33755, 97499, 234847, 212696, 158911, 110155, 98530, 51706, -10751, -75350, -135507, -71045, -21304, -29577, 2345, 48475, 30209, -96411, -72861, 9572, -22501, -13587, 17657, 146160, 186645, 104299, 77436, 27696]
15414B7696j02693L1190K3426O5526o5167j0917L1497r08r3248o0974J31814k9353
15402e2111O4996N4174j8102q3100q4585n7949L2135J30746Q2787N4997k5378
15391I8610q5668q0616p513M8281k2807m2746j7437R9625N9266K9583j12098k8915
15379f2435J4820J6772q7511L0214J47080M6938p998P3744M5265p2017p5584P2934
15367A42222m9058q3491n7870K7438l9098k7801J38782P9778N1717r2542j32510
15356d2433m6804L6877P9229J57980J57031j52090k28132o02P4090k3428j58999
15345a47281J09870J06421j11933p2111j86841N6575J32709k356p7418O1056n7548
15334a88857K3016L819L5407J86019r8298o944Q9160J21084p3281o9157k7110
$$ y = [27696, -74997, -43807, -20381, 45145, -20022, -30939, 558, -350, -93598, -154572, -22758, -52111, 12885, 67059, 48957, -34143, -118728, -176677, -144542, -13796, 68991, 123988, 98610, 12942, -67674, -75187, -26906, -49713, -92459, -109896, -10271, 48995, 78578, -33520, -62435, -47615, -30843, -118354, -88140, 58940, 105878, 97880, 171624, 216889, 144872, 69288, 142222, 93164, 9673, -48197, -20759, -59857, -87658, 51124, 130902, 182619, 90077, -42433, -89237, -52360, 26869, 184849, 341880, 189790, -38342, -38944, 35146, 11718, -147281, -37411, 69010, -42923, -115034, -301875, -245300, -112591, -114947, -192365, -131309, -188857, -165841, -162022, -126615, 59404, -38894, -45838, 43322, 164406, 91125, 21968, -5142]
15323e142O931L9315j9849n6521r1900l0707O9103k5792N5397K6026o6963J29495
15311B9393J33308j04395o5623p105r0889J05852O2217j2908r3577q3039j12192
15300b38958l7616P9390J11984P8142J67049r9089j33938j8736O9933K5050J3324
15289A6535J8003l6718n1699N7865M3421q3706k9006k7256k0914L9181J33462
15278E9168q5865j08750o853n820L9201J36063L4630K5682O3329m0390k7805L6505
15266A19095p1408O3683K5455j54369J5600J03832j99218n665Q2246j01831j4747
15255a37327l8925Q0908P0835k0022K6108p8684K5385k6779k1334l0423R8948
15244e1310N6604K28828O1971j63622j33267O861p0965P4420P6895n994M9732
$$ y = [-5142, 1789, 41104, 21255, -35266, -127166, -157873, -88770, -114562, -59165, -33139, -100102, 29393, 162701, 58306, -7317, -14422, -105311, 541, 62758, 49850, -43727, -126766, -238958, -276574, -197184, -85200, -7058, 159991, 60902, -73036, -91772, -21839, 3211, 16535, 34538, -2180, -53879, 3986, 47407, -36299, -65305, -92561, -113475, -74294, 59168, -26697, -135447, -142300, -148120, -108919, 27144, 61774, 87456, 150785, 110395, 82590, 119095, 47687, 111370, 136825, -17544, -1944, 101888, -97330, -102995, -20749, -122580, -137327, -176252, -95344, -24509, -44531, -18423, -97107, -71722, -98501, -119835, -150258, -51310, 5294, 234122, 296093, 132471, -796, 6065, -64900, 9520, 86415, 80421, 130153]
15233A30153j27032j51044p2997l4433J76355J53756j1224M4349n9464p0539j02166
15222a24286o9768J04378k8329O1956J24662P3884j05233n1833L9921j23537l5986
15211a34171Q2483k8792Q9567J5842j4115N1080N8349j9083J17611R344o0109
15200A68006k8036j2280j9390r5187j69340l9259J73021Q5806N5788M285o1772
15189F1642o7973R3293j8963L637k9044j181N01j14418n5973m6152r4405O4914
15177b04122N0840N8224J95213J5318m0109l4979P0469M8924q6038M3389O9726
15166A86855q5766j55126j15619k1464J45191Q2150r1098l7863N3689m9409n4857
15155a43317P0780Q803L3784m4140m006N4778m631o5565J12440J45954m8739r8275
$$ y = [130153, 3121, -147923, -220920, -255353, -78998, 74758, 63534, 107883, 48419, -22120, -124286, -194054, -89676, -118005, -56049, 68613, 142497, 37264, -14569, 25352, -98185, -134171, -51688, -80480, 9087, 24929, 10814, 61894, 120243, 101160, 218771, 228115, 168006, 139970, 127690, 108300, 13113, -156227, -195486, -22465, 63341, 119129, 123414, 61642, -6331, 86962, 67999, 71636, 42592, 41411, 41912, -72506, -128479, -174631, -269036, -204122, -153282, -95058, 100155, 115473, 75364, 40385, 110854, 159778, 73740, 117129, 186855, 101089, -54037, -169656, -191120, -45929, 36221, -54877, -92740, -39051, -88460, -143317, -72537, -63734, -29950, -74090, -78096, -23318, -27949, -93514, 18926, 164880, 116141, 17866]
15143A7866l9984j19860L1635L525P3926J5080L5264l0850J8773n0908P0608O3336
15131H8411j5655j67869m5514L2923J19732P8516m3772m0635p2338j8944J87290
15120A02145K21959m7835J8038j954m484k0896j51199j13205r2757K8349Q5399
15109B3560J0212r8285m0467j48410J5870Q9040n485N3173p11N8199n6526P1009
15097b8821J28524l0014r954P6032O2027L1673q3337N6531l8928m2915m9626p6692
15085e500k6606j01971O7831P1096n9708j5684Q2676J5919o2894N5558n0075K0692
15073h666p113j51891K7118J14807O8790R0398R9499L556k4119j6003j64529j86082
15061a54235L3600J01428J5819R175Q6463J7795J04184j47806j35234m7919P6289
$$ y = [17866, -22118, -141978, -110343, -106818, -32892, -17812, 17452, -13398, 5375, -45533, 25075, 88411, 72756, -95113, -140627, -107704, 12028, 90544, 46772, 6137, -66201, -85145, 102145, 324104, 276269, 294307, 292353, 287869, 266973, 115774, 2569, -90188, -61839, 23560, 33772, -64513, -104980, -253390, -237520, -148480, -153965, -100792, -101503, -43304, -99830, -28821, 99703, 69689, 59735, 135767, 197794, 229467, 146130, 202661, 163733, 120818, 71192, -5500, -32106, -134077, -66246, 4850, -54858, -70542, 12134, 28053, -34841, 20717, -29358, -8666, -15779, -167670, -140552, -25745, 43045, 133443, 232942, 236498, 212379, 196376, 31847, -154235, -120635, -19207, -3388, 5787, 92250, 110045, 214229, 66423, -68811, -116730, -40441]
15050d0441L2719j09753n8587m4584l2471O7273N1639K0609L6424o1342J41317
15039B803J80903j14523j84089j30180L5761j9127M0732N1819k99j1231j231J06922
15027d1740J5177K9238r7437j8853p708J17112k6680p8037p0101Q8928L2743m4778
15015a02136j2543J28805R0019l2364O0757K3874p5609m8554m0188L6525K4259
15004E2845J22141j0575k28855n8630M9406o0383J6017L0401k877L3733P7169
14993B0392m5113L3293R8991R0789Q0622o3329j55835j2561J9238j28576J33345
14982G1256n7443p6902p3625k7759P8020K0983j07204j4271M6718Q9523N6255
14971E551K9965K5787q7202n1729k5369N9479O5610o0571k2539N5829n5393n1710
$$ y = [-40441, -7722, -117475, -176062, -220646, -253117, -185844, -134205, -113596, -77172, -138514, 2803, 183706, 69183, -114906, -245086, -209325, -228452, -187720, -135901, -136200, -147431, -148662, -41740, -26563, 2675, -94762, -113615, -121323, -4211, -30891, -108928, -179029, -90101, -57358, -102136, -114679, 14126, 104145, 71781, 132538, 156412, 80803, 32249, -7939, 28586, 52845, 174986, 164411, -64444, -123074, -73668, -134051, -118034, -87633, -90510, -56777, 20392, -24721, 8572, 107563, 198352, 278974, 215645, 59810, 47249, 66487, -62089, 71256, 13813, -63089, -136714, -164473, -86453, -65470, -172674, -186945, -140227, -50704, 5551, 35516, 61303, -25899, -77628, -102997, -43518, 22092, -38479, -61018, -5189, -60582, -112292]
14959a12292M1590R7635o2837J11058J19459q7706l0611M1174M222q61n9191M6967
14947A08607R7378o3431j60888O0337l9142j9509q3885N4871Q590n7489J8473
14936g6088P9245M7182P3328j08668j95014j45428J44229J25431N8106p3459J4913
14925e6223n289O8504J26452l3956j86726N9075J8764m9686n367j502k4310K1937
14913f8327r0394k47501l9142J01868k1J30347K25884J03590p8051M5016m0125
14902D3144m7487J08127j0934j10310j56328n3934P3897l6096j24862j5286Q9498
14891b40571J18012j15196L2719J37504J10958p6596J9945L601j22308n0216L8641
14880a43507R3810Q6001j03815j14557R1910k2724m4693M3583K00408K1290j23880
$$ y = [-112292, -70702, 26933, -35904, 75154, 194613, 106907, 76296, 117470, 121692, 120831, 61640, 108607, 205985, 142554, -18334, 42003, 2861, -16648, -100533, -45662, -37072, -94561, -76088, 3157, 50339, 123667, 14999, -180015, -325443, -181214, -55783, 2323, -71136, -56223, -61512, 6992, 133444, 99488, -87238, -28163, -9399, -59085, -64452, -65954, -90264, -68327, -158721, -406222, -445364, -343496, -343517, -213170, 12714, 116304, 38253, 83269, 43144, -4343, 103784, 92850, -17460, -173788, -227722, -153825, -189921, -314783, -330069, -240571, -122559, -237755, -205036, -67532, 43426, -33170, -13225, -9624, -131932, -182148, -143507, -49697, 36304, -67511, -182068, -90158, -112882, -157575, -113992, 86416, 107706, -16174]
14869a6174Q4825M6433m61k4274o390r2431p8414L846J13096R4870L1040j33506
14857B2460m3374l1487j22754Q7059K21738M8290j06181j22491P163k6652K8059
14846c8170r2967k1317r685J18277J74149m4779L8875j6005Q342n9532j10788
14835e3600N8357K3406O6417j1023l4288k5144p1294L9703Q5718j1136N4285Q037
14823A29438n8533q0495P2003K8144o0311j9208M210L7042l2802j44925j3414
14812a38851O4605l6194L3366p9206J54214q103q4321J7375R0752P3236k1501
14801F5372r0531J87724n6081J4324J46326m0217p6224j16345J0600k3068k3206
14790a326j32094n6037J42708P4124j06974o5132n6428m3967J25561J22526Q6319
$$ y = [-16174, 68651, 115084, 114623, 90349, 83959, -8472, -86886, -83040, 30056, 124926, 155966, 22460, -20914, -52401, -175155, -88096, 133642, 181932, 75751, -46740, -39577, -66229, -38170, -131137, -152454, -162139, -43862, 130287, 85508, 124383, 108378, 116720, 57188, -53600, 4757, 28163, 94580, 83557, 49269, 24125, -47169, -7466, 78252, 67116, 121401, 129438, 70905, -9590, 62413, 90557, 30246, 11038, 15248, 52290, 19488, -125437, -138851, -74246, -110440, -77074, -156280, -2066, -10169, -94490, -77115, 13637, 86873, 65372, -25159, 162565, 106484, 120808, 267134, 226917, 150693, 34348, 44948, 21880, -1326, -133420, -189457, -46749, 27375, -79599, -144731, -201159, -245126, -119565, 2961, 89280]
14779H9280q0040j56403l1203M7608J42617p5648m6411O4432K26r2161J13614
14768b4089P4010N5502L3429K9181q5015r0222o8688j91856n3898J13084J13797
14757i4765P0207m0117N8602P6464K44m8524P1386J954j19407p3033M0167q793
14745f5615P9999O0214p0739q8344j5104J34756P4699m0162M0009N2161M1571
14734B03445r6349j17813P6252J01879M771L8325o5735l2671j15284n9030n2986
14723a15196M7705m0140k5541K07030N6527L4615O44L2999p4925j12556k7288
14712a6126o622R668P170J72527r9104p7456n901M9399M3182n4512P991l7284
14700g068j41490m3002R4290l2638j9109Q0929N7271m3289O6128R8697J2080j06331
$$ y = [89280, 9240, -147163, -178366, -130758, 11859, -63789, -110200, -45768, -45542, -137703, -24089, 49921, 105423, 138852, 168033, 83018, -7204, -75892, -267748, -321646, -208562, -94765, -24558, -64675, -6073, 70391, 70635, 22111, 93497, 95451, -23956, -96989, -56822, -65615, 14384, 74598, 3859, -84485, -99589, 35167, 109866, 69704, 109713, 161874, 203445, 107096, -10717, 65535, 167414, 172185, 210510, 144775, 112104, -3180, -62210, -115196, -67491, -107631, -133172, 73858, 130385, 165000, 165644, 198643, 123718, 11162, -16126, -22748, -13080, -5910, 166617, 67513, -9943, -15844, 33555, 76737, 22225, 30216, -7068, -148558, -191560, -97270, -129908, -149017, -68088, -10817, -54106, 12022, 110719, 122799, 16468]
14688A6468q1073m2171L5321m3977j21864j4212j440O5361P6487Q9590J46195
14677A24685o859J7823j31503j5030M8789n5944k4947N0993J7544q9207O5696
14666B040l8868k8574O6715l3620p6787n2297r9605K207P6771J17106J41083Q1676
14654A57847J7844j3049j42125j76262j7202N9725O3232o6469n6654R5393N0290
14643b7430o6766K4954M4051l2153N3542j20152o2734O4514o1871J36L0064J22451
14631c1394J04410O4026R7083m6048o3986l1179j18472k0816L5331K0872l0023
14620b0196j86722o1534R7171K3110M4461j2170K350M637k7368Q9132J17894R2098
14608A62863J21948k0450j23959k1283j567n8093j29750p9408k4290K6679j4783
$$ y = [16468, -64605, -106776, -71455, -115432, -237296, -251508, -252948, -187587, -111100, -21510, 124685, 117826, 135649, 4146, -10884, 37905, -18039, -42986, 8007, 25551, -63656, 2040, -36828, -65402, 1313, -32307, -109094, -161391, -260996, -258789, -182018, -64912, 76171, 157847, 175691, 162642, 20517, -155745, -172947, -113222, -49990, -116459, -173113, -77720, -27430, -94196, -69242, -25191, -57344, -3802, -123954, -186688, -122174, -184045, -183909, -153845, -31394, 73016, 137042, 234125, 188077, 124091, 92912, -25560, -46376, -11045, 9827, -20196, -206918, -268452, -171281, -148171, -103710, -115880, -113530, -108893, -136261, -47129, 70765, 162863, 284811, 264361, 140402, 119119, 117552, 59459, -70291, -149699, -173989, -147310, -162093]
14597a62093q4918K32051J26033L2780n9148j03800N5216P5601j02048j91495
14587a81821L104j6698q2887J0329Q6415P70j4230o0513m3926L7512L3224j5117
14575b43838J00882J59618n7654n8469j05242N808Q5557O4289K2093l052k00120
14564b30128P744J48958J12411m7431o5689j7386m5145O3753J71786Q4761K6654
14553B10288j60107j11991k5642K0937R8401L0969k62374n0757J42505N3466l6343
14542i0648j05083m5097j20585J0172J48195K721J00848J01139J42057O9277o4370
14531A48626M7977j66361k42900O3958m956j41172L282N1474J16725J06439o2208
14520g9116j9211P0043j04178R2076J09010N251m9895m1168L299m5281k2681J33615
$$ y = [-162093, -247011, -14960, 111073, 143853, 84705, -19095, 36121, 111722, 9674, -181821, -178717, -195415, -278302, -267973, -181558, -180788, -195018, -255531, -299457, -261945, -228721, -243838, -142956, 16662, -40992, -99461, -204703, -198895, -113338, -49049, -26956, -30008, -230128, -222384, -73426, 38985, -8446, -74135, -91521, -136666, -72913, 98873, 183634, 210288, 50181, -61810, -87452, -66515, 31886, 62855, -199519, -250276, -107771, -54305, -90648, -195731, -240828, -361413, -351241, -203046, -200325, -99477, 1662, 143719, 212996, 148626, 196603, 30242, -212658, -148700, -153656, -294828, -291546, -240072, -123347, -16908, -79116, -98327, -28284, -132462, -40386, 68624, 73875, 23980, -17188, -13889, -59170, -81851, 51764]
14508E1764k4648q0996m448J47032J3046j43073j32634J20693Q4944N403m0609
14497c526P763k1430O7150P447J35448P2726m2229p3082j96743q2088k5676Q1226
14485g3014J58255m7893m4979N2141K3167M8476j9985j2618p0455k9522l8531
14474e4958j1744M2333J24585K9729k7924r1879j60019K6909p0858q8257J2567
14463b69516R8731Q2460P6397P1609l3637K2746j2561M2865K381j18626N362r8333
14451a30122O4667K7589m2254P4639K9867N6248J16670J3727P1613P615m2344
14440B47915m7235r4290k36490j2165R1605j5588q5764q8846Q4350q79R275J39349
14428h763P9315k6447R137R2264j5845k807P9003J02822j40690j93649J7844J41837
$$ y = [51764, 27116, -53880, -58328, 88704, 101750, -41323, -173957, -53264, 31680, 37083, -3526, 4237, -17193, 49957, 57404, 192852, 265578, 223349, 150267, -46476, -128564, -154240, -73014, 85241, 37348, -7631, 44510, 67677, 116153, 96168, 83550, 13095, -16427, -54958, -66702, -24369, 100216, 129945, 102021, 10142, -149877, -122968, -193826, -282083, -269516, -170785, -88325, -11928, 59681, 26044, 48790, 36229, 79094, 81475, -37151, -31789, -130122, -65455, -37866, -80120, -5481, 24386, 80634, 197304, 211031, 282644, 290259, 247915, 200680, 106390, -130100, -142265, -50660, -66248, -152012, -240858, -156508, -157387, -148112, -8763, 70552, 44105, 53242, 145506, 129661, 126854, 205857, 308679, 167989, -25660, -7816, 134021]
14416A34021r465M2194m7400j13806k5252j1705P1825k2102N4051O3867N6967
14405A93195m397O1143p5091r9918q5742j16950m4717J63447Q7824J3964j37250
14394d4492P4510J6815j51599M6238N8704L6044m2593N8761k3552J01170R4034
14383B24040m8372j03567K3470N071o5373o6519m3266j0325O9663K3128j05857
14372i7907n1525Q1352J03531K02023l6396j44327j19777j3971J13239L8025P8540
14361A52807J2349j84229j14952N540Q526K8246P7833K07252m0444q5409j8723
14350D8796L6988L0934r3873l1824J8811m4140o3162J8743J43345O9968j20311
14339A4275l7631J16068m5011o9617l6201J7835m227K7267J04910J28605m0521
$$ y = [134021, 124556, 166750, 119350, 5544, -19708, -31413, 40412, 18310, 72361, 136228, 193195, 188798, 249941, 174850, 74932, -10810, -127760, -172477, -9030, 78794, 92758, -44492, 30018, 46833, -104766, -58528, 176, 36220, -6373, 52388, 28836, 130006, 224040, 175668, 72101, 95571, 100642, 35269, -31250, -74516, -84841, -15178, 7950, -97907, -149432, -68080, 35451, 237474, 201078, 56751, -63026, -76997, 36242, 74267, 152807, 165156, -19073, -134025, -128485, -119959, -91713, -13880, 193372, 152928, 67519, 48796, 85784, 116718, 22845, -8979, 9832, -34308, -97470, -78727, 64618, 134586, 14275, -23356, 92712, 47701, -21916, -58117, -40282, -44509, -17242, 87668, 216273, 175752]
14328A75752L1971l9432q6446q1840J0874Q7156L6914m4921r3167J7875J07549
14317A22285M3914j16693j79914J4156r4515j0238M044m8387P3810K64394O2092
14306A34948J8695j07945J930p3559J2392R0339j56825j40240J84011J41421o7497
14295C7670j22366j48787j52088O8952J07151M8687R7626L9102q7330P4113k3973
14284f1243N4848l0078j3132L6658J34688N6753M490l8595m7312J13198N1069
14273B61344n9547j26105o9390j14982K6034M5343m6366j6830n2978R9084o2772
14262a17165j1105R1096J33884K1644j26080l3121j4953J6218j1625r4196J0531
14251a34872j43524j43902J06601J89552J82151n6069k6038K1435j37040j09778
$$ y = [175752, 207723, 168291, 81845, 5, 10879, 98035, 134949, 90028, -3139, 14736, 122285, 166199, 49506, -130408, -116252, -210767, -221005, -216961, -265348, -191538, 72856, 134948, 153643, 45698, 47628, -25931, -13539, 76800, -80025, -220265, -36254, 105167, 37670, -84696, -233483, -385571, -316619, -209468, -160781, -63155, -24053, -111383, -37270, -61243, -6395, -36473, -49605, -12947, 121741, 178494, 182984, 144389, 97077, 210275, 261344, 201797, 75692, 6302, -108680, -82646, -37303, -83669, -100499, -153477, -54393, -117165, -128270, -37174, 96710, 118354, -7726, -40847, -55800, -39582, -51207, -145403, -134872, -278396, -422298, -315697, -126145, 56006, -63, -26101, -4666, -141706, -251484]
14241b51484K5411K0438J5048Q688n4668O5430O0760m7431J00849K31513J00290
14230B74844j92833j11551L6319J9395K4791J41271J26772j25359n7458m2889
14220I3302l18834j24763J36394K20935j7953r4500j9898n344m6252j25607n32
14209c03052Q3772J69161M1834j56149L548J85029L7052p1377K1151N600q9081
14198g2512j00097l0196m1663R3663k1844o3740J33765n7536m6277J80403J61694
14187A35660k1311j19795J4521l5862O604k4294J04074m6750P0047j15253q7718
14176a20077l494L9022P3767O8893j5443j25230q9309M8681N1364M7662K03443
14165A79279k845j02384N201J07505j1159k0411k8487Q5827Q0444j8680q6742
$$ y = [-251484, -226073, -205635, -190587, -181899, -236567, -171137, -110377, -157808, -56959, 174554, 274844, 82011, -29540, 6779, 26174, 50965, 192236, 319008, 193649, 136191, 93302, -225532, -350295, -213901, 7034, -10919, -105419, -125317, -130661, -176913, -302520, -303052, -219280, -50119, -8285, -164434, -160886, 24143, 61195, -10182, 10969, 16569, -72512, -172609, -202805, -244468, -150805, -172649, -236389, -102624, -160160, -206437, -26034, 135660, 114349, -5446, 9075, -26787, -20183, -44477, 59597, 12847, 82894, -32359, -120077, -123571, -84549, -10782, 58111, 42668, -82562, -171871, -123190, -71826, -24164, 179279, 176434, 74050, 79251, 186756, 175597, 155186, 126699, 212526, 292970, 274290, 187548]
14154A87548r5411k29431j69019K5952K8123J18150k6839l3369M042P3543M6650
14143g0061k9321j9748Q9149N5769j1479m6314M9031r972M988n366l9101K7493
14131d932Q6811Q0311N6468l1310j8435m7786o0949l1754M612Q6745P3567m9493
14119A43855m2019n7299j30264K5863r9360r4742J71625K09933j42224r0275K1270
14108h3637m3761r4001N6810J19029j0158k9693J06281N4864L7982q7156j2030
14097A4530J8142M7641O5105j6567j19329q4931Q425Q3207M4927o8532p3573L8386
14085d2569L8955r9544j02201m6344M8081Q3574J1242p535M5745N0872O7007M267
14073E1550j03153k28319r8629O5419P7026l7052N7953O1322L7580L3082r8028
$$ y = [187548, 92137, -137294, -306313, -280361, -252238, -134088, -160927, -194296, -190254, -116711, -70061, -99382, -119130, -29981, 25788, 14309, -32005, 17026, 7054, 12042, 6676, -32425, -4932, 81879, 162190, 218658, 187348, 168913, 121127, 60178, 28424, 33036, 119781, 193348, 143855, 101836, 44537, -85727, -59864, -159224, -253966, -82341, 127592, -14632, -104907, -83637, -127398, -221399, -164589, -45560, -55718, -85411, 20870, 75734, 113716, 26560, 14530, 32672, 80313, 145418, 128851, 9522, -75409, -66984, 16223, 61150, -7382, -80955, -42569, -3614, -103158, -205359, -251703, -203622, -120048, -108806, -116341, -70596, -19724, 47283, 51550, -51603, -279922, -378551, -313132, -236106, -273158, -215205, -153883, -116303, -83221, -181249]
14062a81249r3554J46827J48236R4588j43196m2411P6078Q553L597K2315r0146
14051e0362J9112j9238j46j10478m3999j7103O0371R7948P522N68k1799m9669
14039a27273P7509N8901L9629R7393k9402n6415j32291p630J48588o5467o9036
14028f5494l6273R1154J22543O8477o1992l3818n8046J8629j11797M2101L9082
14017A4566j06249N4290p9754o4742P2915M0257R7513N1414o1248L0902m8665
14006A199p8258K282j09674o8434L0060J10753K4540p139Q2153O6029N7408n8867
13994E2052R0360O0262k7714N7242M4125M6340k01802j79128l2323j8731m893
13983a14210K7427J7831k9999Q1357O6668N2019n0211j34395O0450J24897j4321
$$ y = [-181249, -274803, -127976, 20260, 114848, -28348, -70759, 5319, 13872, 17469, 39784, -50362, -31250, -50488, -50634, -161112, -205111, -222214, -161843, -63895, -56373, -55805, -77604, -127273, -49764, 9137, 48766, 146159, 116757, 60342, -71949, -79579, 69009, 3542, -65494, -101767, -10613, 111930, 180407, 118415, 84597, 26551, 45180, -66617, -24516, 14566, -91683, -37393, -117147, -181889, -108974, -68717, 28796, 80210, 18962, 49864, 1199, -77059, -74777, -184451, -252885, -222825, -112072, -87532, -94671, -12518, 53511, 110919, 52052, 142412, 202674, 174960, 232202, 276327, 322667, 120865, -58263, -90586, -109317, -114210, -86783, -68952, -98951, -17594, 49074, 101093, 50882, -83513, -23063, 101834, 87513]
13972H7513J0988l9107j10198j09462J36137n0607j6176q1859j3036J81124J08089
13961A03406J24526M8941j17174k10951P8811N63n3172Q9273J14459j11469p7719
13950a0506k3577k4134j44843P2159O5514q517J40958R5146k4184M2527O4490
13939B45033j30343k25530p3879k1547p0695P109R5797J74523Q163m0575n5205
13928h7149M1462K4185q800K611M6427p7056k4091P6565k9571q6277M5722n5516
13916a31488m8964J8902J15113M4803l9433o8250M2142R4329j3529m355o8899
13905e9629n5459n3883l8828p1024O3026K00682O3939p3870k9219J1123L7455
13894e687j36218K3760q6089l2885L8427J63395J16229j24600R0729l8135j16635
$$ y = [87513, 98501, 59394, -50804, -160266, -24129, -74736, -90912, -172771, -185807, -4683, 103406, 227932, 276873, 159699, -51252, 27559, 28122, -25050, 64223, 178682, 67213, -10506, -34083, -58217, -203060, -130901, -65387, -73904, 67054, 162200, 138016, 180543, 245033, 114690, -110840, -184719, -206266, -276961, -269852, -174055, 468, 8631, -31944, -87149, -45687, -21502, -30302, -27691, 18736, -58320, -82411, -5846, -35417, -121694, -75972, -131488, -180452, -161550, -46437, -1634, -41067, -109317, -67175, 27154, 13625, 9270, -59629, -115088, -168971, -207799, -278823, -215797, -15115, 48824, -25046, -54265, -43142, -5687, -141905, -118145, -204234, -237119, -198692, -35297, 80932, -43668, 47061, 8926, -107709]
13883a07709R9533J95489j8138j8611n950K3019k489k9934n6236j55088P4302
13872a812K7814r5809J82836J33841q8184j46585N7135m0925k03757o1701J315
13861b35832K06797J22815j82497q9084J33184O3718J9713l219l7239Q9704r7961
13850i901j61543Q7710O6293j40336j3205r0463L5937J56868R4844n8681o9612
13839a02089P6532N0872J49039k2476N4684o2037j08560r3139q1761J45357J57459
13828A63881j5088j10443m0192M6479p6429O4447J44969J6569o9200J0012J17723
13817B52728j50588j59688j11083Q5059P992q7205R323J88464J05542j71668n7465
13806h8589j14514N0152L6220j8186K6649N1900J22985L4455j40902n2181q715
$$ y = [-107709, -8176, 187313, 169175, 150564, 144614, 167633, 165144, 135210, 78974, -76114, -1812, 26002, -69807, 113029, 246870, 158686, 12101, 69236, 28311, -175446, -237147, -235832, -29035, 93780, -88717, -177801, -44617, 19101, 38814, 35595, -1644, 88060, -9901, -171444, -83734, -17441, -157777, -170982, -261445, -225508, -68640, 26204, -32477, -102089, -25557, 25315, 174354, 151878, 206562, 144525, 35965, -57174, -138935, 6422, 163881, 148793, 38350, -1842, 44637, -31792, 32655, 177624, 194193, 124993, 135005, 252728, 102140, -57548, -168631, -83572, -75580, -162785, -153462, 35002, 140544, -31124, -88589, -203103, -152951, -116731, -134917, -108268, -56368, 66617, 101072, -39830, -92011, -100726]
13795a00726J32521L6810K0623m4605n9612r6015N4480P3806j07205L6229r3453
13784a47147L0307J13201L8112o8475K2479N3900M7110j2401L4982r1762p7952
13773e7646Q0424J01925L3486q3182L5983Q3540j1084l7121o3893n7919L714L6152
13761F4379k2937Q030j10779K5529N996l2432P2187j4251j6546o0452l8932O8722
13749e1486l5787N4989O8859J9313N367Q1269M5261j72808q9895K5952J13724
13738F4758m635o0209l5948M0357N3326j44847m8643J61979m3664J06368N9182
13727A48024l094p0709L9291j6491p2525L3163J27786N3230j04309j11379l162
13716A9825p7609j19941K9202J81942J60485J34134j2740j07029q3497r0245j48115
$$ y = [-100726, 31795, 68605, 89228, 44623, -14989, -111004, -56524, 17282, -89923, -53694, -147147, -116840, -3639, 34473, -34002, -11523, 42377, 89487, 77086, 112068, 20306, -57646, 22778, 124703, 158189, 75007, 110990, 194530, 183446, 146325, 82432, 24513, 28227, 64379, 41442, 49472, -61307, -35778, -29782, -62214, 9973, -4278, -20824, -81276, -120208, -51486, -87273, -32284, 36575, 55888, 61255, 142524, 187785, 14977, -74918, -48966, 64758, 60123, -86, -36034, 4323, 57649, -87198, -135841, 26138, -17526, 88842, 148024, 144930, 74221, 113512, 97021, 24496, 57659, 185445, 238675, 134366, 22987, 19825, -57784, -177725, -148523, 33419, 193904, 328038, 315298, 208269, 124772, 34527, -113588]
13705a13588Q66J5899N0148O1977J4665M2043k690J09330q1021k55504N8891j2271
13693a11255n3532j0465r6677J03845J57038O8565P8052j8488j06500r3641m4646
13682a27704n95L572l9112M2060J5508n4480K6681J083k8107k7865l6234K879
13670b22314J6939n5276J30448L5101N1776k9837M3546Q210j9044m2774K4308
13659e8917p55o6830k36665l031J12881J03566O8253J09847k1918j85284j1154
13648a90007J28165q6543j67419k2603M7370J23923J9325L8768N2359J03358N1718
13637I8414n5310j10576q9661J8788P1252r6881m9469P2268L0503J58480J03080
13626A50888J17389m3561L3988j57282p3653J8874j2659l3290J85542J01296k6903
$$ y = [-113588, -112722, -96823, -46675, 15302, 29967, 72010, 69320, 178650, 97629, -157875, -98984, -111255, -164787, -175252, -271929, -168084, -11046, 57519, 135571, 117083, 10583, -83058, -127704, -128299, -124727, -163839, -121779, -106271, -160751, -134070, -132987, -161094, -188959, -225193, -222314, -205375, -260651, -130203, -95102, -43326, -73163, -29617, -21407, -40451, -83225, -58917, -59672, -126502, -363167, -366198, -253317, -149751, -81498, 28349, 6431, -178853, -190007, -61842, -148385, -315804, -338407, -291037, -167114, -147789, -109021, -56662, 46696, 98414, 43104, -67472, -157133, -138345, -67093, -163974, -213443, -141175, -110672, 47808, 150888, 268277, 224716, 258704, 101422, 27769, 46643, 33984, 694, 186236, 287532, 260629]
13615B60629l2407o2095J5544o4144l6479r4254m3436R2677O7694j6784k3532
13604F3413j38966j64822L8555j7527J17006J38769K1423Q1635J30751j77815
13594I2422q6257q246J2235N954n0662q6430q5337J17479M6440l1802p512j1726
13582i3442K6102K4625R9867O8259k7884j8603n599n1535J12966J18648O4121
13571C17525j01231r9490n5467n1575q4346R8790J01102M3817j56685j43129J33586
13560B897M9644M1513p844J2222R1897p3823q3483m6992Q2466r7762j18109L1376
13548a15998J37318M1671M6707J53949o7360r7704k140k5759J93209l2729j41138
13537I0026m4830J31075L00o2370Q8378p9992p7610j02044l118P802k6166M4893
$$ y = [260629, 228222, 166127, 181671, 117527, 81048, -13206, -56642, 36035, 103729, 86945, 63413, -75553, -240375, -201820, -219347, -102341, 36428, 57851, 139486, 270237, 92422, 6165, -2081, 10154, 16108, -34554, -120984, -206321, -88842, -42402, -74204, -81716, -93442, -67340, -42715, 57152, 125411, 97527, 78924, 73325, 21790, 134756, 253404, 317525, 216294, 116804, 61337, 9762, -74584, 24206, 125308, 169125, 12440, -130689, 2897, 52541, 94054, 86210, 98432, 190329, 116506, 33023, -13969, 68497, -29265, -147374, -115998, 21320, 62991, 109698, 263647, 196287, 98583, 96443, 70684, 263893, 231164, 90026, 45196, 176271, 176571, 114201, 202579, 122587, 44977, -57067, -60185, -52383, -78549, -33656]
13525c3656J36381m139o8003r2614O5268J84472J13961q3138k2678j11461j43918
13514e9525m2575Q6963N1389K568K871m7052p4395K3322J0794P7426j54017j51223
13502b73454J01797l349L7773K06878k7k4357J13056j00336M998M8672j6650O4878
13490A59879J5495n6713j36428l2605N1585M3773j2669J43393K8739N5833R867
13479B70149N0114p4832j13584j20619N5384o1964p7950M8045N2336m2272m7221
13468f2414L6025K4350R4641j20109p4949P7085J13779j6825J2685m6386k8047
13457I835l3558j07540J17899Q5555j51146m757l7836J08338k6873k7100k0452
13446h7635l3553K2961J99918N7667m4256p5385M9407J34587m4119J04246m4066
$$ y = [-33656, 102725, 98586, 30583, -62031, 3237, 187709, 301670, 218532, 195854, 84393, -59525, -102100, -15137, 36252, 38820, 41691, -5361, -79756, -56434, -45640, 31786, -122231, -273454, -171657, -175006, -137233, 69645, 69618, 45261, 158317, 57981, 62979, 111651, 95001, 159879, 175374, 118661, -17767, -50372, 1213, 44986, 32317, 175710, 204449, 260282, 270149, 320263, 245431, 131847, 11228, 66612, 4648, -73302, -25257, 27079, -15193, -62414, -26389, -2039, 92602, -27507, -102456, -25371, 88408, 71583, 84268, 37882, 9835, -23723, -131263, -13364, 72191, -78955, -83712, -121548, -13210, -40083, -67183, -87635, -121188, -98227, 101691, 159358, 115102, 39717, 89124, 223711, 179592, 283838, 239772]
13435B39772n7957j30955j42688K433o5415n9480k4967Q5259K1168q6536J71774
13424d7592L1786p9402P7842J09082p6060j2218j5483j03853j9018M0684J01422
13413G190J31669N7571r8875k6846j67753j64260J68247Q9329Q9796j44436j1713
13402g0081P3881L692M9348k254r1265P7230M2935K1562M410o3049r905J6418
13390E2922J8948J27942L4388j26677p5042j741L0403M3701J2037K1k2748J0009
13378A04163p7122j41328l6514l7907P0790N6412J28647j1432k05935r8780J31702
13367a17304O2109k5668N4230P1221l0795o5107J65442R2760p5822P6561J48884
13356C56511j01807j13253Q250j33326j09350p7244L6150m5846p5409Q8612N5584
$$ y = [239772, 181815, 50860, -91828, -89395, -154810, -214290, -239257, -153998, -132830, -219366, -47592, -15806, -95208, -17366, 91716, 15656, 3438, -12045, -115898, -134916, -94232, 7190, 138859, 196430, 97555, 70709, -97044, -261304, -93057, -3728, 86068, -58368, -70081, 3800, 7492, 56840, 54586, -36679, 40551, 83486, 105048, 109458, 46409, 36504, 52922, 71870, 199812, 234200, 107523, 32481, 30740, 61143, 104844, 116881, 116902, 94154, 104163, 27041, -114287, -150801, -188708, -117918, -61506, 67141, 55709, -150226, -249006, -117304, -55195, -80863, -26633, 44588, 13793, -51314, 114128, 206888, 131066, 207627, 356511, 254704, 141451, 149701, 16375, -92975, -170219, -134069, -179915, -255324, -166712, -111128]
13345a11128q0990J14703P3360J5777J8749j1002j9569k1647l9699k3435R3225
13334H344N6026j33806M370O9845O933M2628r2512o2021O8009J40097L6255o1823
13322H2345O5062K5331j46539j11428q8960J4648L8765R3487J12959m7072l2732
13311E866k2634m7696k2092o7297K5391j1372m3973O7117J71982K8622j28509
13300d4595M1937J9815N8338J949n6838j31532j82662J08899Q7179Q7896J47280
13289A37666J7144j73747r9837N2193M5637Q5676l8967j01649k9894O3749J8351
13278b3678L9384n2455j7269L4797L2322R483L610j13771J01687M4408o1611K741
13266c52p511j130J00647n8021p3618m420J3608n0748k664M3855L9955j1482m906
$$ y = [-111128, -192118, -77415, -4055, 11722, 30471, 19469, -100, -21747, -61446, -84881, 8344, 64370, -69436, -65066, 4779, 11712, 54340, -38172, -100193, -32184, 107913, 144168, 82345, 147407, 172738, 26199, -85229, -174189, -159541, -120776, -27289, 85670, 38598, 5866, -16768, -64464, -86556, -153853, -128462, -139834, -183807, -116690, 55292, 83914, -44595, -2658, 17157, 75495, 77444, 20606, -110926, -293588, -184689, -97510, -9614, 137666, 154810, -18937, -118774, -66581, -20944, 64732, 25765, -75884, -105778, -42029, -23678, 15706, -36749, -54018, -19221, 13101, 22584, 26194, -87577, 14110, 58518, -3093, -352, -7863, -8993, 91654, 33633, -39985, -44405, -30797, -81545, -84209, -40354, -399, -11881, -16787]
13253a6787J18661L3155l8347j53541J4895L8184P4711j4797k9142j2981J9065
13242C3076P4231P9641r939K7506R169o9482p001k1026j00131o3754L0072J40666
13230A23028O523j85098p3951j056L0918j7615o466J64865R9462o7067j75585
13219a02042j42100J713J17886J12545o4211j2643r0745K108R5796J13862R9497
13208A31666j9812j31695o1258q5776L0606O5723L912J10132Q2196m9170L1499
13197A08023k0396N6660J37838J04593p7191L1230n272n0232l7008m2226q9005
13186A17014K0522o4325o0999J30325K3424p3699m7870M9654J33560O4675k3589
13175B68692j02505N7764M0905m9074m3360M4472P4945L4898o0094l4596j04470
$$ y = [-16787, 101874, 135029, 96682, -56859, -41964, -3780, 70931, 56134, 26992, 14011, 33076, 107307, 186948, 177009, 204515, 213684, 144202, 137201, 116175, 16044, -47710, -17638, 123028, 129551, -55547, -129498, -130554, -99636, -117251, -123717, 41148, 140610, 73543, -102042, -244142, -242429, -124543, -11998, -76209, -88852, -179597, -177489, -81693, 32169, 131666, 111854, -19841, -81099, -166875, -136269, -70546, -66634, 43498, 125694, 76524, 108023, 87627, 144287, 282125, 386718, 309527, 340757, 335485, 285253, 248245, 206019, 117014, 137536, 73211, 12212, 142537, 165961, 92262, 44392, 94046, 227606, 292281, 268692, 166187, 223951, 264856, 215782, 172422, 216894, 291839, 326737, 266643, 232047, 127577]
13164A27577j33481J38672J47348M0461J520J259n9600l6196J82291J10004M7429
13153E67284k0086j01295p613L8029K500M8571R7673O4217K8232l6766k718j0133
13141F67895J8192j01193l2524J6631j01227j16944K0763q0489j1872P110j0064
13130B76278P4503N9993j13290k0819Q2795O2499j95258l8961K15238O702o6347
13119C43333J09366J3435j9238L7235J02381J17314J13600O3026k2357N9414N972
13108I23481j95883j61216j75469K173O5112l2578j3912O527l6737p5757o112
13097B99629N2551k1641l755j27467o7234Q812Q529K5856Q1712P3377r0314r8090
13085A41965J08279k2036J7466R2725M7464k1966N8423k7753o6658j02660K654
$$ y = [127577, -5904, 132768, 280116, 320577, 322097, 323356, 263756, 227560, 409851, 519855, 567284, 547198, 445903, 438290, 476319, 478819, 527390, 625063, 689280, 717512, 680746, 678028, 667895, 686087, 584894, 552370, 569001, 467774, 350830, 371593, 291104, 279232, 286342, 276278, 350781, 410774, 297484, 276665, 359460, 421959, 226701, 187740, 402978, 409680, 343333, 452699, 466134, 446896, 484131, 586512, 703826, 817426, 880452, 858095, 917509, 923481, 727598, 566382, 390913, 393086, 458198, 425620, 411708, 418235, 381498, 305741, 299629, 352180, 330539, 326784, 199317, 132083, 140895, 149424, 175280, 256992, 330369, 240055, 141965, 250244, 228208, 245674, 338399, 385863, 363897, 422320, 394567, 327909, 225249, 227903]
13074B27903o442p2156o0842p120L8717j33855n1863k4706O3712L8901m8634L6519
13062A34O1982j33637n4197J01623K1764M2034J8924j42757L9346M3369L287J07361
13050A09233l6161r4580j48592K1867M1338P9786N6120K08954O2530j50840m1096
13039A08559o0141l0376k0511Q0969M6852j77420k21825K2920K38147K53229k7291
13028B13112j39478j08303P9004J09248o9391P522m7914J49917P4778q7383p4082
13017A07030K0120J12392j05450j65479L7762n1026J1253J6942K2188k0514p4366
13006h9148J19735J62970r3087m0402k2506j9118J8273J44141O2383l4087j26498
12995H2656j32791j07614p4784N6062Q1028j2753l9550L1473K652j41807l8215
$$ y = [227903, 221461, 149305, 88463, 81343, 120060, -13795, -65658, -90364, -26652, 12249, -36385, 134, 62116, -71521, -125718, -24095, -2331, 39703, 58627, -84130, -44784, -1415, 1872, 109233, 73072, -21508, -170100, -148233, -106895, -27109, 29011, 237965, 300495, 149655, 108559, 48418, 18042, -2469, 78500, 125352, -52068, -273893, -250973, -12826, 240403, 213112, 73634, -34669, 44335, 153583, 84192, 91714, 43800, 193717, 268495, 181112, 107030, 127150, 239542, 134092, -31387, 6375, -44651, -33398, -16456, 5732, -14782, -89148, 30587, 193557, 100470, 60068, 37562, 18444, 36717, 180858, 243241, 209154, 82656, -50135, -157749, -232533, -176471, -95443, -108196, -147746, -116273, -113621, -255428, -293643]
12984b93643J05886J14510j5051j1147K4148j63857l4419K4624K0916M9730n1425
12973b29728n1420J6434L4271P4365p363P7636R5858o0273L7307Q4990l6493l6869
12961a285k5365j7089J7820M7845K7681l1K4201o1675m8924o2530j30819J38828
12949i1343J33887j2581j2292N2426j5007j07286j91153k3291M8474R0330P1451
12938e6385L111j10900j9175O6862L9915k1062K9962j9628P837o4533n3972k1126
12926b19094J63054k7777q8181R9730L7044o146j0832J61757o1567j48674j8664
12915a19350J1023J4286P3749n4663l0330J27239Q3900K8477k53346n8452K5141
12904a52326R3871J12344j1257K277Q0881L4280J9862l9788j37291j31617j52826
$$ y = [-293643, -187757, -73247, -88298, -99445, -75297, -239154, -273573, -248949, -228033, -178303, -229728, -281148, -264714, -230443, -156078, -163441, -85805, 10053, -50220, -12913, 72077, 35584, -1285, -26650, -43739, -25919, 21926, 49607, 49576, 73777, 12102, -36822, -99352, -230171, -91343, 42544, 29963, 17671, 70097, 55090, -52196, -243349, -266640, -218166, -127836, -56385, -53274, -164174, -183349, -116487, -76572, -97634, -67672, -87300, -79463, -143996, -197968, -219094, -56040, -83817, -171998, -72268, -35224, -41370, -52202, 109555, 47988, -100686, -119350, -108327, -94041, -20292, -74955, -105285, 21954, 105854, 134331, -119015, -177467, -152326, -58455, 53889, 42632, 44909, 125790, 160070, 179932, 140144, 2853, -128764, -281590]
12893b81590r809R1967q1475L9268M9153n541L653J39088J30961R7922N1739q5189
12881A40147j14715k16475m6273J70528l8156J0644J2653j6309j4611R1625j0011
12870c0953o8913m236M6713n9419j08820Q3393J13005R7673j03988P4633Q2005
12859A21093n7395q733j35557j0029N4609Q4519j62684j93110N3908j715K685
12848b52409N3886J01906J6506J5900n3927M4358J43455J84076O2651n6072r8600
12837A61730L9499l4163j46922n5214J73471Q2033o5212L1952K8382o794J2440
12826B21202N568j85868r3065L3139q1220R687o824P350L8046m7786P4804L6719
12814A1752K7493R7352k9672L2557M173n1679p2057j49870j43823R3581J26308
$$ y = [-281590, -291399, -199432, -280907, -241639, -192486, -198027, -194374, -55286, 75675, 173597, 225336, 140147, 25432, -191043, -237316, -66788, -104944, -94300, -81647, -97956, -112567, -20942, -30953, -99866, -104102, -57389, -116808, -225628, -142235, -29230, 68443, -35545, 39088, 121093, 63698, 54965, -80592, -90621, -36012, 48507, -114177, -307287, -253379, -255094, -252409, -198523, -96617, -80111, -64211, -118138, -73780, 69675, 253751, 316402, 260330, 161730, 201229, 167066, 20144, -35070, 138401, 220434, 155222, 187174, 215556, 208762, 221202, 226770, 40902, -52163, -19024, -100244, -90557, -97381, -90031, -51985, -99771, -24967, 11752, 39245, 136597, 106925, 139482, 143655, 91976, 19919, -129951, -273774, -180193, -53885]
12803e3885M3826l7640K3241m118J55193J0463j23986m2021m0003K8553n5161
12792i5538N0530K8593k0043P7034J9215j07049r9235k3786N8646M9640J21541
12781E9548o2603p4337P0766O238j5581l9068Q4263K5617q9161o2511J03368P1417
12769G7956J25482N6683p508k06330n6717M7487k3636j10576j41677R507Q5602
12758a43727l9065q809J4566M2859R8382q228K1932Q605K3919L5096j53781j18618
12746b26869l862J10189O4895m9663P772o5029m0222J20895R4526r1085J4660
12735f3793O1368J3216q4431j37337j14041K0999K12059J07651p8627j02581r7045
12724b62562J0550O011K7539Q2920N6557J24780J6385n5587m2383p9879j28378
$$ y = [-53885, -10059, -47699, -24458, -28576, 126617, 137080, 13094, -28927, -68930, -40377, -95538, -45008, -16415, -36458, 40576, 59791, -47258, -146493, -170279, -111633, -61993, 59548, -3055, -77392, -6626, -388, -15969, -55037, 29226, 54843, -34318, -96829, 6539, 77956, 203438, 260121, 252613, 46283, -10434, 37053, 13417, -97159, -238836, -229329, -143727, -182792, -191601, -177035, -134176, -35794, -44022, -22090, -13485, 10434, 45530, -108251, -226869, -230731, -120542, -55647, -105310, -97538, -162567, -202789, -81894, 12632, -78453, -63793, -2425, 10791, -73640, -210977, -325018, -304019, -91960, 15691, -62936, -165517, -262562, -252012, -246001, -218462, -135542, -78985, 45795, 62180, 6593, -35790, -115669, -244047]
12713b44047m1138O6099P1752M1414J9543J38626L5981j58611q8558J23543O7898
12702C2502l171j643M7271k1713k5093P5850N2654K0424O678n6690k2664m4476
12690E9929J4244q3438q6381O5491J79217k6021j91738j77912j33509P8783Q8072
12679b13263j4121j05308K5003J17896L0986l1936M3624K0919l6307j69385J33608
12668a98284J06973j5706K3772N3447J5084J01746M3421j82785M0401J09041K35
12657I7345N0821M1987r7828m7370m0314r6998Q3573o6275n8853M8913j4688J31314
12645C1627k741J420L1651L9496N1185p7282L1906J02948K736O5258r4840P2152
12633B55516j35141m2559k6863p1689m4217P2096l8344p6234j9155K690J49746
$$ y = [-244047, -285185, -219086, -147334, -105920, -86377, 52249, 88230, -70381, -158939, -35396, 32502, 29331, 27688, 74959, 53246, 28153, 104003, 156657, 177081, 183759, 127069, 104405, 59929, 74173, -9265, -95646, -30155, 149062, 123041, -68697, -246609, -380118, -301335, -213263, -227384, -332692, -307689, -189793, -158807, -190743, -147119, -126200, -162507, -331892, -198284, -91311, -107017, -83245, -29798, -14714, 87032, 130453, -52332, -11931, 97110, 97345, 148166, 190153, 92325, 44955, 4641, -92357, -8784, -75059, -133912, -84999, -99687, 31627, 28886, 30306, 61957, 101453, 152638, 75356, 107262, 210210, 212946, 278204, 183364, 255516, 120375, 77816, 50953, -20736, -64953, 7143, -31201, -107435, -126590, -123900, 25846]
12622B5846q6140J2124O4988O2722N0106Q5760O9820q829j7080m3488N7244J75608
12610D48681k1894q9521j75956p4022K9884q289m805n2170o4118m3693k1557j21835
12598a99295J79474J46401O9340J57606j07460j85286o6004k2318J0564J6679
12588b99R9988q5n7103m033M3450L5282j64736q5312J09927J77334K2004q9854
12576H6563p0835R8401J37992p2024l1336q1256m9532l5963R4728j1199l9207
12565B6332Q418K7504L477n5899m7990l1j03183p5292r3160L8075L16152N9668
12553A04071j36410p0635J258N4367J4397M6311R2551o1960l6400j8386J07417
12542I6581J27089K8341K6124L6317k04068j30707J26192M2015k6532q7666l5121
$$ y = [25846, -60294, -48170, 16818, 79540, 129646, 215406, 285226, 276397, 259317, 215829, 273073, 448681, 426787, 337266, 161310, 87288, 117172, 108883, 104078, 51908, -12210, -55903, -77460, -199295, -19821, 126580, 195920, 353526, 246066, 60780, -5224, -27542, -16978, -299, 99689, 99604, 42501, 38468, 81918, 117200, -47536, -132848, -22921, 154413, 176417, 86563, 15728, 114129, 252121, 180097, 148761, 67505, 17973, -17990, 76738, 65539, 26332, 34750, 62254, 65731, 9832, -38158, -38189, -141372, -216664, -309824, -271749, 44403, 104071, -32339, -102974, -101716, -47349, -32952, 13359, 105910, 43950, 7550, -10836, 96581, 223670, 252011, 278135, 314452, 110384, -20323, 105869, 147884, 121352, 33686, -1435]
12531a435L4157Q6813l1526L4092O9814M5600p1821q5699l6491O103P7822O9161
12519A96590q8483j21536n342r8281L2404N4202q851o3430o254J84362Q3720l9026
12507A20075J0309P7852J23663p398r4146l1597q6118n8100p148O5646r3666l5577
12495a6205j20834J1223L1854M6868J9758J54884K2818j19994o1402m4333O8743
12484f620j0420K1087j4273j9249n6378L6110P3909J3355q7656J7770R0962J8989
12472G7586L3639j69744j69632l0190Q589J4613O5734O0119R684k6903L6388J20263
12460C0146P2397j3530J623m5965o6364J9057P9025j13438L4333R3733l9308j97929
$$ y = [-1435, 32722, 119535, 88009, 122101, 191915, 237515, 165694, 79995, 43504, 49607, 127429, 196590, 108107, -13429, -18771, -117052, -84648, -30446, -39297, -102727, -108981, 75381, 159101, 120075, 130384, 208236, 331899, 324501, 230355, 198758, 112640, 54540, 47392, 113038, 19372, -16205, -137039, -125816, -93962, -47094, -27336, 127548, 150366, 30372, -31030, -75363, -6620, -17040, 4047, -10226, -29475, -85853, -49743, 24166, 37521, -50135, -32365, 58597, 77586, 111225, -58519, -228151, -258341, -249752, -235139, -169405, -109286, -99602, -126505, -90117, 30146, 102543, 89013, 90636, 44671, -21693, -2636, 76389, -37049, -2716, 91017, 51709, -146220]
$$ [...]
##END NTUPLES=NMR SPECTRUM
##END=
