##TITLE=Analysis number 327477
Compound Code spb 05974
Book Reference 184855
Project Code adrs flro3
Chemist Name jom
##JCAMPDX= 6.0         $$ Bruker NMR JCAMP-DX V2.0
##DATA TYPE= NMR SPECTRUM
##DATA CLASS= NTUPLES
##ORIGIN= Bruker BioSpin GmbH
##OWNER= nmr
$$ XWIN-NMR		Version 3.5
$$ Tue Mar 27 09:52:37 2007 GMT Daylight Time (UT+1h)  MAYBRIDGE\nmr@NMR_250MHZ
##.OBSERVE FREQUENCY= 250.131544655141
##.OBSERVE NUCLEUS= ^1H
##.ACQUISITION MODE= SIMULTANEOUS (DQD)
##.ACQUISITION SCHEME= undefined
##.AVERAGES= 16
##.DIGITISER RES= 18
##SPECTROMETER/DATA SYSTEM= dpx250
##.PULSE SEQUENCE= zg30
##.SOLVENT NAME= DMSO
##.SHIFT REFERENCE= (INTERNAL, DMSO, 0, 16.522)
##AUDIT TRAIL= $$ (NUMBER, WHEN, WHO, WHERE, WHAT)
$$ ##TITLE= Audit trail, XWIN-NMR		Version 3.5
$$ ##JCAMPDX= 5.01
$$ ##ORIGIN= Bruker BioSpin GmbH
$$ ##OWNER= nmr
$$ C:\u/data/dgb/nmr/ADRS/2070/pdata/1/auditp.txt
$$ ##AUDIT TRAIL=  $$ (NUMBER, WHEN, WHO, WHERE, WHAT)
(   1,<2007-03-27 09:52:06.91 +100>,<MAYBRIDGE\nmr>,<NMR_250MHZ>,
      <created by zg, POWCHK disabled, PULCHK disabled
       configuration hash MD5:
       49 4B E0 1D 92 C2 6B 37 9F E6 65 BC 52 41 86 1D
       data hash MD5: 64K
       2D 1E 26 18 8E A0 FB ED 34 F3 5F 87 D8 57 A3 95>)
(   2,<2007-03-27 09:52:24.54 +100>,<MAYBRIDGE\nmr>,<NMR_250MHZ>,
      <Start of raw data processing
       ef LB = 0.3 FT_mod = 6 PKNL = 1 SI = 32K 
       data hash MD5: 32K
       61 42 92 09 4D 7F C0 DF BE 2F 5B E5 95 F1 7E AE>)
(   3,<2007-03-27 09:52:26.24 +100>,<MAYBRIDGE\nmr>,<NMR_250MHZ>,
      <apk 
       data hash MD5: 32K
       15 44 61 BB F5 98 23 C0 58 1C E3 D2 F1 F7 07 DF>)
(   4,<2007-03-27 09:52:27.19 +100>,<MAYBRIDGE\nmr>,<NMR_250MHZ>,
      <abs ABSG = 5 
       data hash MD5: 32K
       8D 81 C5 B0 F5 BE F9 3E C2 25 D8 FC E6 4B 73 91>)
$$ ##END=
$$ 
$$ hash MD5
$$ 43 B3 58 47 F4 8D 36 59 D7 D1 03 4C 70 4D 21 E9
##$RELAX= 
##$RELAX= 
##$RELAX= 
##$RELAX= 
##$RELAX= 
##$RELAX= 
##$RELAX= 
$$ Bruker specific parameters
$$ --------------------------
##$DU= <C:\u>
##$EXPNO= 2070
##$NAME= <ADRS>
##$PROCNO= 1
##$TYPE= <nmr>
##$USER= <dgb>
##$AMP= (0..31)
100 100 100 100 100 100 100 100 100 100 100 100 100 100 100 100 100 100 
100 100 100 100 100 100 100 100 100 100 100 100 100 100 
##$AQSEQ= 0
##$AQ_mod= 3
##$AUNM= <au_zg>
##$AUTOPOS= <6 >
##$BF1= 250.13
##$BF2= 250.13
##$BF3= 250.13
##$BF4= 250.13
##$BF5= 500.13
##$BF6= 500.13
##$BF7= 500.13
##$BF8= 500.13
##$BYTORDA= 1
##$CFDGTYP= 0
##$CFRGTYP= 5
##$CHEMSTR= <none>
##$CNST= (0..31)
1 1 145 1 1 1 1 1 1 1 1 1 1 1 1 1 1 1 1 1 1 1 1 1 1 1 1 1 1 1 1 1 
##$CPDPRG= <>
##$CPDPRG1= <>
##$CPDPRG2= <>
##$CPDPRG3= <>
##$CPDPRG4= <mlev>
##$CPDPRG5= <mlev>
##$CPDPRG6= <mlev>
##$CPDPRG7= <mlev>
##$CPDPRG8= <mlev>
##$CPDPRGB= <>
##$CPDPRGT= <>
##$D= (0..31)
0 1 0 0 0 0 0 0 0 0.06 0 0 0 0 0 0 0.0002 0 0 0 0 0 0 0 0 0 0 0 0 0 0 
0 
##$DATE= 1174985525
##$DBL= (0..7)
120 120 120 120 120 120 120 120 
##$DBP= (0..7)
150 150 150 150 150 150 150 150 
##$DBP07= 0
##$DBPNAM0= <>
##$DBPNAM1= <>
$$ [...]
##$SUBNAM6= <"">
##$SUBNAM7= <"">
##$SUBNAM8= <"">
##$SUBNAM9= <"">
##$SW= 20.6930455092707
##$SWIBOX= (0..15)
0 0 3 0 0 0 0 0 0 0 0 0 0 0 0 0 
##$SW_h= 5175.983436853
##$TD= 65536
##$TD0= 1
##$TE= 683.16
##$TE2= 300
##$TE3= 300
##$TEG= 300
##$TL= (0..7)
0 120 120 120 120 120 120 120 
##$TP= (0..7)
150 150 150 150 150 150 150 150 
##$TP07= 0
##$TPNAME0= <>
##$TPNAME1= <>
##$TPNAME2= <>
##$TPNAME3= <>
##$TPNAME4= <>
##$TPNAME5= <>
##$TPNAME6= <>
##$TPNAME7= <>
##$TPOAL= (0..7)
0.5 0.5 0.5 0.5 0.5 0.5 0.5 0.5 
##$TPOFFS= (0..7)
0 0 0 0 0 0 0 0 
##$TUNHIN= 0
##$TUNHOUT= 0
##$TUNXOUT= 0
##$USERA1= <user>
##$USERA2= <user>
##$USERA3= <user>
##$USERA4= <user>
##$USERA5= <user>
##$V9= 5
##$VALIST= <valist>
##$VCLIST= <CCCCCCCCCCCCCCC>
##$VD= 0
##$VDLIST= <DDDDDDDDDDDDDDD>
##$VPLIST= <PPPPPPPPPPPPPPP>
##$VTLIST= <TTTTTTTTTTTTTTT>
##$WBST= 1024
##$WBSW= 4
##$XGAIN= (0..3)
0 0 0 0 
##$XL= 0
##$YL= 0
##$YMAX_a= 265561
##$YMIN_a= -321249
##$ZGOPTNS= <>
##$ZL1= 120
##$ZL2= 120
##$ZL3= 120
##$ZL4= 120
##$ABSF1= 16.522
##$ABSF2= -4.171173
##$ABSG= 5
##$ABSL= 3
##$ALPHA= 0
##$AQORDER= 0
##$ASSFAC= 0
##$ASSFACI= 0
##$ASSFACX= 0
##$ASSWID= 0
##$AUNMP= <proc_1d>
##$AZFE= 0.1
##$AZFW= 0.1
##$BCFW= 0
##$BC_mod= 0
##$BYTORDP= 0
##$COROFFS= 0
##$CY= 12.5
##$DATMOD= 1
##$DC= 0
##$DFILT= <>
##$DTYPP= 0
##$F1P= 14.0000005364418
##$F2P= -0.99999901652339
##$FCOR= 0.5
##$FTSIZE= 32768
##$FT_mod= 6
##$GAMMA= 0
##$GB= 0
##$INTBC= 1
##$INTSCL= 1
##$ISEN= 128
##$LB= 0.3
##$LEV0= 0
##$LPBIN= 0
##$MAXI= 10000
##$MC2= 0
##$MEAN= 0
##$ME_mod= 0
##$MI= 0
##$NCOEF= 0
##$NC_proc= -4
##$NLEV= 6
##$NOISF1= 0
##$NOISF2= 0
##$NSP= 0
##$NTH_PI= 0
##$NZP= 0
##$OFFSET= 16.522
##$PC= 1
##$PHC0= 224.808
##$PHC1= 6.107862
##$PH_mod= 1
##$PKNL= yes
##$PPARMOD= 0
##$PSCAL= 4
##$PSIGN= 0
##$REVERSE= no
##$SF= 250.13
##$SI= 32768
##$SIGF1= 0
##$SIGF2= 0
##$SINO= 400
##$SIOLD= 32768
##$SREGLST= <1H.DMSO>
##$SSB= 0
##$STSI= 32768
##$STSR= 0
##$SW_p= 5175.98343685301
##$SYMM= 0
##$S_DEV= 0
##$TDeff= 65536
##$TDoff= 0
##$TI= <Analysis number 999999
Compound Code 99
Book Reference 9
Project Code 9>
##$TILT= no
##$TM1= 0
##$TM2= 0
##$TOPLEV= 0
##$USERP1= <user>
##$USERP2= <user>
##$USERP3= <user>
##$USERP4= <user>
##$USERP5= <user>
##$WDW= 1
##$XDIM= 32768
##$YMAX_p= 392991709
##$YMIN_p= -369756
$$ End of Bruker specific parameters
$$ ---------------------------------
##NTUPLES= NMR SPECTRUM
##VAR_NAME=  FREQUENCY,     SPECTRUM/REAL,   SPECTRUM/IMAG
##SYMBOL=    X,             R,               I
##VAR_TYPE=  INDEPENDENT,   DEPENDENT,       DEPENDENT
##VAR_FORM=  AFFN,          ASDF,            ASDF
##VAR_DIM=   32768,         32768,           32768
##UNITS=     HZ,            ARBITRARY UNITS, ARBITRARY UNITS
##FACTOR=    0.157963299565203, 1,           1
##FIRST=     4132.6476996994, 0,             0
##LAST=      -1043.33573715361, 0,           0
##MIN=       -1043.33573715361, -369756,     0
##MAX=       4132.6476996994, 392991709,     0
$$ Real data points
##PAGE= N=1
##DATA TABLE= (X++(R..R)), XYDATA
$$ [...]
17476e7938K4547K11j024l2496n5263K2150J28173K0851n2119J2407o1600p7476
17464a29577o2452Q298J23211Q9151M9075j40553l9479L217P1928Q8794O5214
17453A26827n8094k0378n332k6432l198J34401L2892L0701j01169k60M703l3329
17441H1332r7292j2458N6953M1123j1749P679L5706j9147k7004r6197m5191L2507
17429e3738Q4716o568J2513o2610m4422L0647P3321M3261q5984P578M7910m3963
17417B661R599k2324n0803L4959n720l1812r851N3964J4001j700n394k7140o3699
17404a03259O1719Q7603j3301k8666J6778j19613O7189P4528j1494q5786o130
17393f0432l351j719J10677L2880l7550p6015r9320Q0304K5543j393r3669l8015
$$ plain form
17476 -57938 -33391 -33180 -34204 -66700 -121963 -99813 28360 49211 -2908 9499 -52101 -129577
17464 -129577 -192029 -183731 -60520 28631 77706 -62847 -102326 -99109 -27181 61613 126827
17453 126827 68733 48355 43023 16591 13393 147794 180686 211387 110218 109958 114661 81332
17441 81332 -15960 -28418 28535 69658 57909 65588 101294 82147 55143 -41054 -86245 -53738
17429 -53738 30978 24410 36923 -25687 -70109 -39462 33859 77120 -8864 -1286 46624 2661
17417 2661 12260 -10064 -60867 -25908 -31628 -63440 -73291 -19327 -5326 -7026 -12420 -39560 -103259
17404 -103259 -41540 46063 32762 4096 20874 -98739 -31550 42978 31484 -54302 -60432
17393 -60432 -63783 -65502 45175 78055 40505 -35510 -134830 -54526 -28983 -30376 -124045 -162060
17381a62060Q8850j4942J5594J0713l6741j9962m1927o4782m866P7021m311J3512
17369a43901O1284J1542L0067J06436K6793l4686m7809k3324N3093r929r411o647
17357A3508K2687J8102j0705L1551j2982o8902m519M549Q9872j1197o3698q4897
17345g6631L2499k435L1791P306m5351p8644m9773M3002Q5815L5154j041j05764
17333a24072M1143O1983k7750K0092j3955N4651K3539L1225M2658o3319L0622
17322G6817l0351k3272K8754l5722J2031J7550J5573o8716N1426j1969l9235j0604
17310a7718O783l9567k0595N3586K9332K7699J235q525n4083P7583L1940o5308
17298B2362k3786R031N1775M7043m8265q3943j465L3590K4519J1704p4275l8783
$$ plain form
17381 -162060 -73210 -88152 -72558 -61845 -98586 -118548 -160475 -225257 -230123 -153102 -157413 -143901
17369 -143901 -82617 -71075 -41008 65428 92221 57535 9726 -13598 39495 29566 20155 13508
17357 13508 36195 54297 43592 75143 62161 -6741 -11260 -6711 83161 71964 8266 -76631
17345 -76631 -44132 -46567 -14776 -7470 -52821 -131465 -181238 -138236 -52421 -17267 -18308 -124072
17333 -124072 -82929 -20946 -48696 -28604 -42559 12092 35631 66856 109514 46195 76817
17322 76817 46466 23194 51948 16226 28257 45807 61380 -7336 44090 32121 -7114 -17718
17310 -17718 -10935 -50502 -71097 -17511 11821 39520 40755 32230 -21853 55730 87670 22362
17298 22362 -1424 7607 59382 106425 58160 -25783 -27248 6342 30861 42565 -31710 -70493
17286g0493J5385l9232k4226O4502M7264K9182n5612L9756J2709j13155j25J1224
17274h2821l5601r1122O421L8504O0760J38258O1672n5236l7309L1615O1613N1746
17262A48500M0504N3754K365M4695R195j5008J8360P4198j341l7424m0867q4967
17250B11964k1429J9709l7751o8918o3365p4353o1256M3250M6011l2737L7746
17239a129p3113j1326P4402J1804M3235K4638n929q8206m6769P6577M9588N250
17227E9022N0406r9199r6293O0137R0196M4453L3647J3562n4774p0638p0088M8839
17215I270J5765j1131O6785k7691j11834n4149J19014R9391M5567Q5943K5790
17204B62720M5075O7256L9902m5726m2928P908j20976j2952n7420j12311K471
$$ plain form
17286 -70493 -55108 -94340 -118566 -54064 -6800 22382 -33230 6526 19235 -93920 -94045 -82821
17274 -82821 -118422 -209544 -203123 -164619 -103859 34399 96071 40835 3526 35141 96754 148500
17262 148500 189004 242758 245123 289818 299013 284005 302365 376563 375222 337798 296931 211964
17250 211964 190535 210244 172493 103575 40210 -34143 -95399 -52149 -6138 -38875 -1129
17239 -1129 -74242 -85568 -11166 638 43873 68511 62582 -25624 -72393 4184 53772 59022
17227 59022 109428 10229 -86064 -25927 64269 108722 142369 155931 101157 30519 -39569 9270
17215 9270 25035 13904 80689 52998 -58836 -112985 6029 105420 150987 236930 262720
17204 262720 307795 375051 414953 369227 326299 334207 213231 200279 142859 30548 33019
17193C3019l9214k4891k7689j5714n2095k5929l7875Q4411J00028M1776q2004
17182d6177J8793M5185M008j5032O3731k6740k0657k6348N4150M1424L3964L2092
17170A58393J8418l7418j07853n6255m9806M6783J7070J6667j0714N0627L1308
17159G7220r8206m2869R1378N6007q7370N321K3009r2240l4734J1486O7389k4502
17147d8111l3024p7392q8099k1298r109M0072O0590L5508J23331N5813L3301J9499
17135I1081k6575J7310l3279r6777m8537M7468n8486k3992Q8862j7200j321K3465
17123c7981M2642m342k4565j0323L2366L6991K323n1557j12507n9541O6299P3653
17111d6542O0524O6975l6391j06929k071P2364o376p5039m3063J2169K2510p213
$$ plain form
17193 33019 -6195 -31086 -58775 -74489 -126584 -152513 -190388 -105977 -5949 35827 -46177
17182 -46177 -27384 17801 21809 6777 70508 43768 23111 -3237 50913 92337 126301 158393
17170 158393 176811 139393 31540 -24715 -74521 -27738 -10668 5999 -4715 45912 77220
17159 77220 -20986 -63855 27523 83530 -3840 1481 24490 -67750 -102484 -90998 -23609 -48111
17147 -48111 -81135 -158527 -246626 -267924 -277033 -236961 -176371 -140863 -17532 38281 71582 91081
17135 91081 64506 81816 48537 -48240 -96777 -49309 -107795 -131787 -42925 -60125 -61446 -37981
17123 -37981 4661 319 -24246 -34569 -2203 34788 37111 -14446 -126953 -186494 -120195 -46542
17111 -46542 13982 80957 44566 -62363 -64434 7930 1554 -73485 -116548 -104379 -81869 -89082
17099h9082P0920j353p0004l174K0881M6809L2247l3114K3165M3948J9316m6999
17087A3560l4876J5293K4648M5014O3356j14156q5576M0048L5419N1902j9346
17076C5286r3274M8160M1203k6249k426q8911k8371Q3536P8827j8721L9303j7066
17064E1297j06411P379P1554P7683p0819k1427k3961m8841K94M3269J3898m7058
17052e3143j7106O166K2563k2956l9499P2941J8265J7559P9584m2339k2857M3762
17040F2940K9870J4519j2257j218k4371m4744Q811O3995J2281j6125k0428n9427
17028A3846m1523P5629J1414J8774r4270J864k8557O859J37392O0933m4401q1252
17016C6708n6242l0285K0859O4771R3165o265n0027m6169l4737k2198M6917l1258
$$ plain form
17099 -89082 -18162 -19515 -89519 -92693 -71812 -25003 7244 -25870 -2705 41243 60559 13560
17087 13560 -21316 -6023 18625 63639 126995 12839 -72737 -32689 2730 54632 35286
17076 35286 -57988 -9828 31375 5126 2700 -86211 -114582 -31046 47781 29060 68363 51297
17064 51297 -55114 -47735 23819 101502 30683 9256 -14705 -63546 -63252 -19983 -6085 -53143
17052 -53143 -70249 -64083 -41520 -64476 -103975 -31034 -12769 4790 84374 42035 19178 62940
17040 62940 92810 107329 95072 93854 69483 24739 33550 97545 109826 93701 73273 13846
17028 13846 -27677 47952 59366 78140 -16130 -14266 -42823 -35964 101428 162361 117960 36708
17016 36708 -19534 -49819 -28960 35811 128976 122711 72684 26515 -8222 -30420 16497 -14761
17004a4761K9311l1700n2243O6328m298j2402j7931N185J09671K9753o8596k1344
16992A6973M1309l9849p6830O8230P81j33527K7505K821N669l3034N6010K0116
16980d3826k7716J1189M8921K8124J3226K019m2524m5637m9814J7752L1592j4703
16968g1397n0151R5693J19125n097N7431M1583j10358j26320q2229l5944R6357
16957g1307J51140r134o5227K7555m9036q0255r987K5272m0874o80M9574L5438
16945c7521n3127j3074O4819k435m1903K4271K1976p4320m8133L8778J21663M3839
16933D4833P118K3354n1956J140M1045m0479M6414O6487M1105q5056r7453o081
16921i529K9984j0411k2132p8769p049R9066L9006k8150k3530o330j39886o9865
$$ plain form
17004 -14761 14550 -17150 -69393 -3065 -7363 -19765 -37696 -32511 77160 106913 38317 16973
16992 16973 58282 18433 -58397 9833 10614 -122913 -95408 -92587 -86918 -119952 -63942 -43826
16980 -43826 -71542 -60353 -11432 16692 29918 31937 -10587 -56224 -106038 -88286 -56694 -71397
16968 -71397 -121548 -25855 93270 88173 145604 187187 76829 -49491 -131720 -167664 -71307
16957 -71307 79833 70699 5472 33027 -16009 -96264 -106251 -80979 -121853 -122533 -72959 -37521
16945 -37521 -90648 -103722 -38903 -41338 -83241 -58970 -36994 -111314 -159447 -120669 994 44833
16933 44833 51951 75305 23349 24489 65534 25055 71469 137956 179061 94005 -3448 -9529
16921 -9529 20455 10044 -12088 -90857 -97906 1160 40166 12016 -11514 -17844 -157730 -227595
16909b27595P019R3335N3386n5269J9557P5k8926l9193m4473O5161J19264J4389
16897b3270n2895l6184P6072k357J1903o383r0191l0273l6655j3705L8678L9691
16885a25569j0053M8575o862l1635L3271Q8981k0109p2776k7550j2657M7308O6608
16873b2468K2893l2258n3492m7745m5844l4403N1816J05535O3037o9040r294l5883
16861a07146L0817O0533J5235n7441n0305O3722O492K0677o1216O5487P5609n1307
16849A1157l9511k3607r44l1389j5178m3027J3990N4609N6739o72l9025j6063
16837g2921k6661p569l6393l105J7213L1524L1221J3062m2350M9567K149j0877
16825e5140j44P915M4025Q5703K3027L6446p8836j04776o9030J7854l2418J2606
$$ plain form
16909 -227595 -220576 -127241 -73855 -129124 -109567 -109492 -138418 -177611 -222084 -156923 -37659 -23270
16897 -23270 -76165 -112349 -36277 -38634 -26731 -33114 -123305 -153578 -190233 -203938 -165260 -125569
16885 -125569 -135622 -87047 -93909 -125544 -92273 -3292 -23401 -96177 -123727 -136384 -89076 -22468
16873 -22468 425 -31833 -85325 -133070 -178914 -213317 -161501 -55966 7071 -61969 -71263 -107146
16861 -107146 -76329 -15796 -561 -58002 -108307 -44585 -38093 -17416 -78632 -13145 62464 11157
16849 11157 -28354 -51961 -52905 -84294 -99472 -142499 -128509 -73900 -17161 -17833 -56858 -72921
16837 -72921 -99582 -107151 -143544 -146649 -129436 -97912 -66691 -53629 -95979 -46412 -44263 -55140
16825 -55140 -55284 -47369 -3344 82359 105386 141832 62996 -41780 -110810 -92956 -125374 -112768
16813a12768J490l8064L071k2411N4997O1905o525q1318o0229j6600l4247K1241
16801b29458R3366J7228j3498K209O6482q045L3988J15242M1339R271p3236q0614
16789b5726J8708L6614m9380K7808o398l516n2218J02752K9991l9844m93N3800
16777I2098m1333q4807j84k1876j4424L7078l5192J10293L5887m6171l6430K1115
16765A6054n552K7649l1869o4062n8305m1223Q232R2828n159J5913P105K6737
16753a1652k1181m8869j9014M6251Q6356N9090K2114q1537j6461k1930j7386j0352
16741c4571o2883j1980n5732m8515K282M5968J8212n1176k9554Q0476O6621m4341
16729a25193l9682M3540m604o9971K8962L6988M1730M5449P210R12K2146k7678
$$ plain form
16813 -112768 -111278 -149342 -146271 -168682 -113685 -51780 -58305 -139623 -199852 -216452 -250699 -229458
16801 -229458 -136092 -118864 -132362 -130153 -63671 -71716 -37728 77514 118853 128124 54888 -25726
16789 -25726 -7018 29596 -19784 8024 1626 -1890 -54108 48644 78635 38791 38298 92098
16777 92098 50765 -34042 -34226 -56102 -70526 -33448 -68640 41653 77540 31369 -5061 16054
16765 16054 10502 38151 6282 -57780 -116085 -157308 -149076 -56248 -61407 -45494 -38389 -11652
16753 -11652 -32833 -81702 -100716 -54465 31891 90981 113095 31558 15097 -6833 -24219 -34571
16741 -34571 -97454 -109434 -165166 -213681 -211399 -165431 -147219 -198395 -227949 -147473 -80852 -125193
16729 -125193 -164875 -121335 -125939 -195910 -166948 -129960 -88230 -42781 -35571 -34659 -12513 -40191
16717d0191n0219m9286j122O7616N8454r5895j2099Q1659L0832M547l5288m8376
16705h9368J9275m6374K9840L9616O2843n0532p9427L4517K6335l2374J9572m88
16693f6565j4122L2139J03890M6054l1684r4891m4060J6277M5836l9444l4796
16682h1366N2951K5867P053L5706k1986m4610j02918l5284Q5225J12036L865j12495
16670g5956l4196r256k5254P8131P1897K1994k7943l2326N9994j1549q8608j8340
16658i1412k1040l5389R1078R7172L5452k3197j3818q722k04k4665q1108r0343
16646a66196o8992N2754M3623P0803p189L2905l095n3544l4130N5918Q3585Q4898
16634I1340R574q2916r1219L7340L1430n8902m512L1043J6281P179p5326m2407
$$ plain form
16717 -40191 -90410 -139696 -140818 -73202 -14748 -110643 -122742 -41083 -10251 -5704 -40992 -89368
16705 -89368 -70093 -116467 -86627 -47011 15832 -34700 -114127 -79610 -53275 -85649 -66077 -66565
16693 -66565 -80687 -48548 55342 101396 69712 -25179 -69239 -52962 -7126 -46570 -81366
16682 -81366 -28415 -2548 4505 40211 18225 -26385 -129303 -164587 -79362 32674 36539 -75956
16670 -75956 -110152 -119408 -144662 -66531 5366 27360 -583 -32909 27085 15536 -73072 -91412
16658 -91412 -112452 -147841 -56763 40409 75861 52664 38846 30124 29920 5255 -75853 -166196
16646 -166196 -235188 -182434 -138811 -68008 -75197 -42292 -45387 -98931 -133061 -77143 6442 91340
16634 91340 100914 17998 -73221 -35881 -4451 -63353 -67865 -36822 -20541 -13362 -88688 -131095
16622a31095R2798M9968P6718l2292q2160p9436M9067L5602l2626M8852M8200
16611D3596k6067P6329K5788m2114q9275J9646M3607p8467o6187Q3458m3139q1107
16599a33932m222L1021l2562p7563P29j9211J1295Q985P3348L8080J3332Q201
16587h2499O9115l3718k3470R811m757J15273L0628j8352j01752j9527M4111K6499
16575A1362n8374m2479O2186Q8910J7908p1959R602o728R033K4110j1120L0580
16563F3031j6226j8180r250q9480k4503o1804k2134L0360r470K5291P3195O1987
16551B817j5258N490J2705j1465P0002K8168k0586j10141j00306l5169N1059L4067
16539h8617m388P1543K4926j3900M0171q552n7525K4403M705L957k2441R068j3118
$$ plain form
16622 -131095 -38297 11671 88389 56097 -26063 -105499 -56432 -20830 -53456 -4604 43596
16611 43596 17529 93858 119646 77532 -11743 7903 51510 -26957 -93144 -9686 -52825 -133932
16599 -133932 -138154 -107133 -139695 -217258 -216529 -235740 -224445 -215460 -142112 -104032 -90700 -82499
16587 -82499 -13384 -47102 -70572 -60761 -65518 49755 80383 62031 -39721 -59248 -15137 11362
16575 11362 -47012 -89491 -27305 61605 79513 7554 17156 10428 19461 43571 32451 63031
16563 63031 46805 28625 19375 -70105 -94608 -156412 -178546 -148186 -157656 -132365 -59170 2817
16551 2817 -12441 -6951 5754 -5711 64291 92459 71873 -38268 -138574 -173743 -122684 -88617
16539 -88617 -93005 -21462 3464 -10436 29735 21183 -36342 -11939 -7234 -3277 -25718 -16650 -29768
16526b9768n3135l9919Q6547P8712Q0052K0849j01286j1241M874L8863n3745n1528
16514c0725J5974L2659j7492M5587J9271m5873m8921J4541l4039J8856k122l3569
16502f5853P7612R570q6828n2894j5584N6469O5006J0061k7637l8991o8491n4160
16490a91720k0478L7201M8601q996L238J4961O200N0775m4624q009L469J03735
16478e647L6700o576K6k4402N476m0214K5897O8124J605r1245L4614K3075L1426
16465E8859k1262o2237k6724L846L186Q4177K9028p0977l3819n8836L8964K0270
16453c5525k1252l6423l306k6028M48k2076J3781l7001J17492K6147q2116j6359
16441a22218M9531K5713K7590J8217J0727K4742n688j28651j8909O9754J04138
$$ plain form
16526 -29768 -82903 -122822 -36275 42437 122489 143338 42052 30811 35685 74548 20803 -30725
16514 -30725 -14751 17908 416 46003 65274 19401 -29520 -14979 -49018 -30162 -32284 -65853
16502 -65853 11759 21329 -65499 -118393 -133977 -77508 -12502 -2441 -30078 -69069 -137560 -191720
16490 -191720 -212198 -174997 -126396 -135392 -132154 -117193 -110993 -60218 -104842 -112851 -109382 -5647
16478 -5647 31053 24477 24503 101 5577 -34637 -8740 59384 60989 -30256 4358 27433 58859
16465 58859 37597 -24640 -51364 -47518 -44332 39845 68873 -2104 -35923 -94759 -55795 -35525
16453 -35525 -56777 -93200 -96506 -122534 -122086 -144162 -130381 -167382 -49890 -23743 -105859 -122218
16441 -122218 -72687 -46974 -19384 -1167 9560 34302 28614 -100037 -118946 -49192 54946
16430E4946j1792n9688m1085l5919L8588m8215k2O5624L9186l4819o6164m7845
16418a47205j9373R619M8036l1927Q0730j713q5568Q8660R3113m3005r5787k9368
16406a33788P8301p476K4886m043j7962n1821j9978O879J5954r644m9595K5793
16394a42494M8536l992L2543J9122m9309k3117J0989O2392J8192j850K3963j5147
16382b0172j07076k6227k6136M3169O939Q4803K9794J9266l1778o3319L2600O382
16370e1755k4277q5473k7512m8326j1182j3650l6426K5580O0639k2616O7328J8011
16358a49659m8742K0476J05702j2032J1798J16373O214j3911p3296K4127q2m4653
16346e7685j5278N5121j2014n511l2459m0524K0717l8555r9135J08172Q6534J03424
$$ plain form
16430 54946 43154 -16534 -57619 -93538 -54950 -103165 -103187 -37563 1623 -33196 -99360 -147205
16418 -147205 -166578 -156959 -108923 -140850 -60120 -61833 -147401 -58741 34372 -8633 -104420 -133788
16406 -133788 -55487 -62963 -38077 -42120 -60082 -111903 -131881 -125002 -109048 -118692 -168287 -142494
16394 -142494 -93958 -97950 -65407 -46285 -95594 -118711 -107722 -45330 -27138 -28988 -5025 -20172
16382 -20172 -127248 -153475 -179611 -136442 -129503 -44700 -14906 4360 -27418 -90737 -58137 -51755
16370 -51755 -76032 -161505 -189017 -237343 -248525 -262175 -298601 -273021 -212382 -234998 -167670 -149659
16358 -149659 -198401 -177925 -72223 -84255 -72457 43916 50130 36219 -37077 -12950 -13032 -57685
16346 -57685 -72963 -17842 -29856 -35367 -67826 -108350 -87633 -126188 -225323 -117151 -30617 72807
16334G2807n9849p7794J8368m8120m975J10494P696l418J7311L0611L208k4377
16322D1962j27974l6268R8609P3088k9135n4730l8222J57379P6941p7597m3599
16311D0454j07005m5074K2109K9051L6617P136o72m9730P956m160n2226K3667
16299i1877M6699o327j23423M2987P2580J6342k4174R368P9545J5233j886m1488
16287f421k9803J7519o8196n653M4116n955M6665L284l4389J06907R3613o5122
16275I6565j27685j14752L74o0391M875J22041n1005j10923Q2970Q7168L1525
16264c9238O283L1977m9596n1616m1271M0645P6647N5395l0520K2579j7401K5923
16252B9807q2503K16M5961P9167l8611p5482q3643J2628N634O326m0795O4182
$$ plain form
16334 72807 12958 -64836 -46468 -94588 -99563 10931 18627 15209 32520 63131 66339 41962
16322 41962 -86012 -122280 -23671 49417 20282 -34448 -72670 84709 161650 84053 40454
16311 40454 -66551 -111625 -89516 -60465 -23848 -16712 -17384 -67114 -59158 -63318 -115544 -91877
16299 -91877 -45178 -51505 -174928 -131941 -59361 -43019 -67193 -57825 21720 36953 35067 -6421
16287 -6421 -36224 -18705 -86901 -92554 -48438 -54393 -7728 -4444 -38833 68074 161687 96565
16275 96565 -31120 -145872 -145498 -205889 -201014 -78973 -129978 -240901 -157931 -70763 -39238
16264 -39238 -32955 -978 -50574 -102190 -143461 -102816 -26169 29226 -1294 21285 3884 29807
16252 29807 -52696 -52480 -6519 72648 34037 -41445 -125088 -112460 -106826 -100500 -141295 -77113
16240g7113J26848P1595r2917n6019k1965K5503O6810M0516n2364J4326r0740
16229d5520m0425j0441J8308P9554P0492M8859r4147Q382P2185n9886m0574l9353
16217c2566Q707L2459k9738M4337K8659j00562M6563P1048k0426k1260q591o3863
16205d5233k9676N8489L6645p2858n3269M9700n3404r0637Q354O5255J14469Q1453
16193F9288q4544q4658K8116P6344N253O256L3306k6789n2832o039P2417Q1254
16181A17372k9867j07768l3770K5599m1324R4k0815J1482L0689n0369L3893R717
16169e5067M1826O7107l2450k6881M2859K9985J0978m7511L1692j1026J2589j9656
16157D4445p8977k0708J6142l875M9342K8963j16347N2305N9547p7394J5063J6520
$$ plain form
16240 -77113 49735 121330 28413 -27606 -49571 -24068 42742 83258 30894 45220 -45520
16229 -45520 -85945 -96386 -78078 1476 71968 120827 26680 35062 107247 47361 6787 -32566
16217 -32566 -23859 8600 -21138 23199 51858 -48704 -2141 68907 48481 27221 18630 -45233
16205 -45233 -74909 -16420 20225 -52633 -105902 -56202 -109606 -200243 -191889 -126634 -12165 69288
16193 69288 -15256 -99914 -71798 4546 9799 16055 49361 22572 -30260 -36299 36118 117372
16181 117372 87505 -20263 -54033 -28434 -69758 -69664 -90479 -78997 -48308 -98677 -64784 -55067
16169 -55067 -13241 53866 21416 -5465 37394 67379 78357 30846 62538 51512 64101 44445
16157 44445 -34532 -55240 -39098 -42973 6369 35332 -81015 -28710 30837 -46557 -31494 -14974
16145a4974k8454J9761M373J4846J12469J8081q5539n5532j5693P2763N1567M5619
16133A39287Q137l5400J4552m453j21448o4407K8625M4930m1898m2824k9331j5688
16121a19918N8073K8541M5085j3715q959N055n9072O0527J16318l8559o6357m321
16109B698p3510p7362P4692L4028m7426q0390j26778p5708J07997J64862j030
16098i7927l6400N8626M2487m6352j33254m0093R6268J00585N4754q5313J602
16087h5017O9968L3514n1523M2366j8997j3189l5426o385O388k0627r168P320
16075h0776q0309P718L902J4567L3425j7429o3365N996Q639O6651P3930R405j12
16062a7758N7968k3485q592l1871m0087j36175Q6378J9703k4958j7056k3195N8134
$$ plain form
16145 -14974 -43428 -23667 -19294 -4448 108021 126102 40563 -14969 -30662 42101 93668 139287
16133 139287 147424 112024 126576 122123 675 -63732 -35107 9823 -32075 -74899 -104230 -119918
16121 -119918 -61845 -33304 11781 -1934 -10893 -5838 -64910 -4383 111935 73376 7019 2698
16109 2698 -70812 -148174 -73482 -39454 -86880 -167270 -294048 -369756 -261759 -96897 -97927
16098 -97927 -134327 -75701 -33214 -79566 -212820 -252913 -156645 -56060 -1306 -86619 -85017
16087 -85017 -15049 18465 -33058 9308 -9689 -22878 -58304 -64689 -58301 -78928 -88096 -80776
16075 -80776 -161085 -153367 -149465 -134898 -101473 -118902 -182267 -176271 -167632 -100981 -27051 -17646 -17758
16062 -17758 40210 16725 8133 -23738 -63825 -200000 -113622 -93919 -118877 -135933 -159128 -100994
16050a00994M128l889p8111m6289j9271M4186N5921O7173O1094j04855n7138Q3043
16038i5002P0964l3018K0928K8320j0750j9951l8189k6541j4801J7054N5076N8444
16026A2534J6016J9576P9895o9914m6813j7254k463m6440l6392K0446j1628N7320
16014b5117R0626Q1794O7908q2423q5250l2040l6312m2194J6577J3376O1938O3470
16002I2353r07p3644K8967M7023n6268k5305n0495p6402M683N7969J3231l2975
15990g1770K6673k1961P6365J21264q0133p6545L2950N0875K2996l5719J4208
15979E9203K4163l0396L9955K0483j17570n2739N6601j3739K3952o4712q5757
15968a40556j22145P9052Q9788Q918O4053P3745p6128m7136j4819j5457l3020
$$ plain form
16050 -100994 -96866 -100755 -178866 -225155 -244426 -200240 -144319 -77146 -16052 -120907 -178045 -95002
16038 -95002 -24038 -57056 -36128 -7808 -18558 -38509 -76698 -103239 -118040 -100986 -45910 12534
16026 12534 28550 48126 128021 58107 11294 -5960 -8423 -54863 -91255 -70809 -82437 -25117
16014 -25117 65509 147303 215211 132788 47538 15498 -20814 -63008 -46431 -33055 28883 92353
16002 92353 91446 17802 46769 93792 37524 12219 -38276 -114678 -109995 -52026 -38795 -71770
15990 -71770 -45097 -67058 9307 130571 50438 -26107 6843 57718 80714 44995 59203
15979 59203 83366 52970 92925 113408 -4162 -56901 -300 -14039 9913 -54799 -140556
15968 -140556 -262701 -183649 -93861 -84943 -20890 52855 -23273 -70409 -85228 -100685 -133705
15957a33705j4495k8516j563n2376N3525P1262K2824m4205L5440q821R3789M6282
15945C9441m9956L598N1987R254j577j5907N5019m3701r1214m8020m3082N126
15933a29032J28382M4521n8267O9010N1574k9322j4635m2534j381j6198k2608
15922b0490P0857N088l8672M1381L4352j4309r5754j9183R004l2290l4337M0908
15910e3445J9568m8590k9733K0794O1376N3299l6464J6028L3582p9013r3055r814
15898a45467M3850j5133K6268O4801M8503O5078o450L022k6421K8498M8262Q874
15886A43685l7390m1228p1412j49860k6210Q1294J11026P040M807m150j3384M493
15874H711n6204l6048Q6460J0130m0277n7688K5100M0910n1700j8932k0484Q2170
$$ plain form
15957 -133705 -148200 -176716 -178279 -230655 -177130 -105868 -83044 -127249 -91809 -100630 -6841 39441
15945 39441 -10515 -6917 45070 54324 52747 36840 91859 48158 -43056 -91076 -134158 -129032
15933 -129032 -650 43871 -14396 54614 106188 76866 62231 19697 18316 2118 -20490
15922 -20490 50367 55455 16783 58164 92516 78207 -17547 -36730 -27726 -60016 -94353 -53445
15910 -53445 -33877 -82467 -112200 -91406 -30030 23269 -13195 2833 36415 -42598 -135653 -145467
15898 -145467 -101617 -116750 -90482 -25681 22822 87900 81450 84472 58051 86549 134811 143685
15886 143685 106295 65067 -6345 -156205 -182415 -101121 9905 16945 21752 17602 4218 8711
15874 8711 -47493 -83541 2919 13049 -27228 -84916 -59816 -18906 -70606 -89538 -110022 -27852
15862b7852J0070Q062o3510L6631J04663m0353r8054k6076K061j1412J03366M5809
15850D3405p577p517q1368M3888R237j3693J6233p3480o3869P9217Q152J3804
15838c3568j7140l6967J8647j9508J24955M6404m1162o0923K993J08095P340p4162
15826B5004l3342J4341M317k9078J2746m6752O125l1440M8177j0686m2712K1022
15814f2278l2438r1470n2878M4674J32828O2703J49475L8067r6097o8228l7309
15803a2951l6811k4879m557p5864j7089m5915l804p686J2103k959K4192o1677
15791b57897L7097P8345l9988l0923K95J18802J21920j7583j1845L4680L1059
15780F3962j6763n7666p0671p3767m2259Q2918N5391k0409L9028L5658n9880o6890
$$ plain form
15862 -27852 -17782 -9720 -73230 -36599 68064 27711 -70343 -96419 -94358 -105770 -2404 43405
15850 43405 35828 28311 -53057 -9169 68 -13625 2608 -70872 -134741 -55524 -47372 -33568
15838 -33568 -50708 -87675 -69028 -88536 36419 82823 41661 -19262 -16269 91826 99166 25004
15826 25004 -8338 6003 10320 -18758 -6012 -52764 -46639 -78079 -29902 -40588 -83300 -62278
15814 -62278 -94716 -186186 -239064 -194390 -61562 1141 150616 188683 92586 24358 -12951
15803 -12951 -49762 -74641 -79198 -155062 -172151 -218066 -221870 -229556 -217453 -220412 -196220 -257897
15791 -257897 -220800 -142455 -182443 -213366 -213071 -94269 27651 10068 -1777 32903 63962
15780 63962 47199 -10467 -81138 -154905 -197164 -114246 -58855 -79264 -40236 -4578 -64458 -131348
15768a31348O4063J9893o5431n2008J1864M194J7576P1829L4931L3210M414q7154
15756g3967k8774P0611K0529l4418j6225k0292k8068J4873m5106Q1716N0475L1269
15744B2623j6388j8687L7265J6732K0537K5616m2185j6641j766l4870O6094p360
15732E0970k3156L8175l1895j2220L1804M9304j03889p5126L2314L9921M5752
15721D1954N532N0233P858k3886o3189N6412O583m3511m9332j0731k5629n5424
15709a03130j9265O6713M6086K3420q6354q4786l1465R9745K4587K7445L530j00917
15697a34391l7800O630m518L1083k3344N3282M0799m3334l7166O8434P238m8811
15685a21898k1508k2094M7253J56819O3656j36610m6310J1459p3049r412M1630
$$ plain form
15768 -131348 -67285 -47392 -112823 -164831 -152967 -148773 -131197 -59368 -24437 8773 13187 -73967
15756 -73967 -102741 -32130 -11601 -46019 -62244 -82536 -110604 -95731 -140837 -59121 -8646 22623
15744 22623 6235 -12452 24813 41545 62082 87698 45513 28872 27106 -7764 58330 50970
15732 50970 27814 65989 34094 21874 53678 102982 -907 -76033 -43719 -3798 41954
15721 41954 47486 97719 105577 81691 18502 74914 81497 37986 -11346 -22077 -47706 -103130
15709 -103130 -122395 -55682 -9596 13824 -72530 -157316 -188781 -89036 -64449 -37004 -33474 -134391
15697 -134391 -172191 -165561 -170079 -138996 -162340 -109058 -68259 -111593 -148759 -80325 -73087 -121898
15685 -121898 -143406 -165500 -118247 38572 102228 -34382 -80692 -69233 -142282 -151694 -110064
15674a10064N4999j8416O9639K4946M3269O6981p193j0187j45255N042K9808j7369
15662a3800k8825J06256m8632r7489p5467l8275l543J18370Q0063l258j7936Q1903
15650E9367m5323p891n4078R4940L8511m2599l1106n2363n994l6682J7633m23
15638f6008K5129l3301J2638P5049K694K4109O4156M3612j6009j65215j54803
15627a87949L7212N0701k7409M5091R852O6765j7898j04130o198Q4383O0906k5657
15615a4331p0914L0946N4247m1847J871K2803N5727j15270q4873j266L3014m9138
15603a79031Q7818N2424k1413N4701m8671o2463M9819N7773N6394j2454k3052
15592A1845q601o4717r538L1520J4983m471M400L6156R3786M4383M3738R692l5716
$$ plain form
15674 -110064 -55065 -73481 -3842 21104 64373 131354 124161 113974 -31281 -26239 3569 -13800
15662 -13800 -42625 63631 14999 -82490 -157957 -196232 -199775 -81405 -1342 -4600 -22536 59367
15650 59367 14044 6153 -47925 47015 85526 42927 11821 -40542 -46536 -83218 -65585 -66008
15638 -66008 -40879 -74180 -61542 13507 16201 40310 104466 148078 132069 -33146 -187949
15627 -187949 -150737 -100036 -127445 -82354 -72502 -5737 -23635 -127765 -133963 -49580 11326 -14331
15615 -14331 -85245 -54299 -52 -41899 -40028 -17225 38502 -76768 -161641 -162907 -129893 -179031
15603 -179031 -91213 -38789 -60202 -5501 -54172 -116635 -66816 -9043 47351 34897 11845
15592 11845 3244 -61473 -71011 -39491 -24508 -28979 -24579 11577 105363 149746 193484 203176 167460
15579A67460r2255k2440m9949q2736l8980M9985m3890K3584N7678k7232j9717
15568g8492j213k2585k1563M080J7513O308K2946K4777Q8256q44N762p2833o4487
15555i2375L5684M5462k7460j072j0051Q8203J7400m4109l8857l6053P013m6985
15543a03200N48J6368J6747Q0104L5355l5193j0509j0774j6532M2309k6555k9976
15531d1308J6667J439j5558J2531M6647K3315o0335j99j0876L504L0107m1350
15519c5416k2554L5545K1133m8192m6151m1957o4681K7756J17124Q6801K1707
15508E1115J4054K2654O1864m2894o4359Q228j5997k052r1524L1751k2727j2785
15496f2672m0018m7690J8935L1247M9214L5971R9868J1973K8800q4609p3105q201
$$ plain form
15579 167460 75205 52765 2816 -79920 -118900 -68915 -112805 -89221 -31543 -58775 -78492
15568 -78492 -79705 -102290 -123853 -119773 -102260 -95952 -73006 -48229 40027 39183 44945 -27888 -92375
15555 -92375 -56691 -11229 -38689 -39761 -49812 38391 55791 11682 -27175 -63228 -56215 -103200
15543 -103200 -102652 -86284 -69537 10567 45922 10729 220 -10554 -27086 15223 -11332 -41308
15531 -41308 -24641 -23202 -38760 -26229 20418 43733 -16602 -16801 -27677 -24173 5934 -35416
15519 -35416 -57970 -22425 -1292 -49484 -95635 -137592 -202273 -174517 -57393 29408 51115
15508 51115 65169 87823 149687 106793 42434 50662 34665 32613 -58911 -27160 -49887 -62672
15496 -62672 -102690 -150380 -131445 -100198 -50984 -15013 84855 96828 125628 41019 -32086 -40287
15484d0287p141J2663l3907O3779k4802K5550M8853j0676k9295r994l143l8501
15472d6901K8390N2679j819j7208J1528p0211Q256M1966n1844K92K3339J7300
15460d233M3350k3893K961k9506k7384J09514O2537l6840k8704j4736L319k9351
15448B7034P0468P2611k2499o727N600Q3398l7999j33281r3691J08100L0069j50611
15436d7528J1441M5025k132j1252l6612L6480m6211j36869O4185N5606L238K3932
15424d0697l3024L8953l1090o013O9750J2612p3949j7053m4371K7992L9789n5751
15412a12852M3923j8067K6391l2159k4345O7048J11300K4443k8503r8154q9329
15401a30304J14114K0858j4937l9531L8170M7737O0027L4100o4701l8892O801
$$ plain form
15484 -40287 -47428 -34765 -68672 -4893 -29695 -4145 44708 34032 4737 -5257 -8400 -46901
15472 -46901 -18511 34168 32349 15141 26669 -43542 -35286 6680 -45164 -44872 -21533 -4233
15460 -4233 39117 15224 18185 -11321 -38705 70809 133346 96506 67802 53066 56385 27034
15448 27034 97502 170113 147614 140887 146487 229885 191886 58605 -35086 73014 103083 -47528
15436 -47528 -36087 8938 6806 -4446 -41058 -4578 -50789 -187658 -123473 -67867 -64629 -40697
15424 -40697 -73721 -34768 -65858 -71871 -2121 10491 -63458 -80511 -124882 -96890 -57101 -112852
15412 -112852 -68929 -86996 -60605 -92764 -117109 -50061 61239 85682 57179 -40975 -130304
15401 -130304 -16190 4668 -10269 -49800 -11630 36107 96134 130234 65533 26641 33442
15390C3442L565l3364m3853K2477q927k8558R221M4019Q0491M228m1038m1560
15378A43j0678k6224K7354K2495L4084l8673L0172k4239o096k4444k490m2308
15366f0904m7813J173k0888o0312m3067J34354J00166N9141l267k7143J7768k8464
15354B0744N5596N3700L163m4963j02841K9653R8932k7841r7675o1154m3241J3198
15342a02729M3482L2996O0993l0864O541N5362N0009j7654K1852k8061K3111k6317
15330H8721l1909L5594l4296r5111p6053K4752P505O430j6921K9263o3286j844
15318a27155K2493j4152K324N5179K3991m7638k4932N0468J2353j3498J1463P6940
15306B7836m2658j6564k5724j5646Q0807K0149p5428n1762O0203N0310l5305j00729
$$ plain form
15390 33442 37007 3643 -40210 -17733 -26660 -55218 -45997 -1978 78513 82741 41703 143
15378 143 -10535 -36759 -9405 13090 47174 8501 38673 14434 8338 -16106 -18596 -60904
15366 -60904 -108717 -107544 -128432 -188744 -231811 -97457 2709 61850 58583 31440 49208 20744
15354 20744 76340 130040 133203 88240 -14601 15052 113984 86143 -11532 -72686 -115927 -102729
15342 -102729 -59247 -26251 34742 3878 10419 65781 115790 98136 119988 91927 115038 88721
15330 88721 56812 92406 58110 -37001 -113054 -88302 -80797 -74367 -91288 -62025 -125311 -127155
15318 -127155 -104662 -118814 -116490 -61311 -37320 -84958 -109890 -59422 -47069 -60567 -49104 27836
15306 27836 -14822 -31386 -57110 -72756 8051 28200 -47228 -98990 -38787 11523 -23782 -124511
15294a24511q1539O3213L8369J7062N8471M641K681k491k998k4042k5249j2429
15282h8822L2430p4612J4798M7311N9811k7519j20786j7333P90j7067K2458l1541
15270b00082o692p61j1012N1185K9523O6427O2966J0820j1943l9736R665R903
15258b9737j2774l0388M154Q2716P4067m5196k4977j9335j0344K3192j285M493
15246A4586L7543n6137k4653J6998J2069K8829J9784k787j11118J7338O1750K914
15234A7116j5353L6907L2513m1340l9413n2098m5601n1646j1351Q7605O0134M3635
15222B1108o9631o652L3581K4071p2667K1274J4923J22789P6097L9924N6196K8899
15210B89912K0074k30084j16698K7066M2086K5463K3419k0308k4865k4768j3134
$$ plain form
15294 -124511 -206050 -142837 -104468 -87406 -28935 -24294 -21613 -24104 -27102 -51144 -76393 -88822
15282 -88822 -56392 -131004 -116206 -68895 -9084 -36603 -157389 -174722 -173932 -190999 -168541 -200082
15270 -200082 -206774 -207535 -218547 -167362 -137839 -71412 -8446 2374 -9569 -49305 -39640 -29737
15258 -29737 -42511 -72899 -68745 13971 88038 42842 17865 -1470 -11814 11378 10093 14586
15246 14586 52129 -4008 -28661 -11663 406 29235 49019 46232 -64886 -47548 14202 17116
15234 17116 1763 38670 71183 29843 -9570 -61668 -107269 -158915 -170266 -82661 -22527 21108
15222 21108 -48523 -55175 -21594 2477 -70190 -48916 -33993 88796 164893 204817 261013 289912
15210 289912 309986 79902 -36796 -9730 32356 57819 81238 60930 36065 11297 -1837
15199a837n759J9527O743P6107J7634q763j05952o1043J6461L3789K5269N1124
15187F3300n6278J932o048m472M1900k1442K8433n8656o5824j7269q562N4009
15175d8977k409K297P0056k1689q560P4235k882j3801q4239q4881m486Q4798N7564
15162A7026R361Q9901N3030Q7252J29370Q8652J36640P4042K6605j06362k05875
15151C99642j48890j11126j2690o1834L4605r321p3788q0232k3761L6201O8187
15140A6993j8341l6149j7430j8277n9086K1739L244o845J05669N7664o6347j24890
15128a42056K8946J20090L8808p4260J6784k4673k2668o6520M6364M4774j628
15117c6039k196K033n7273l1632Q6449L1173K2668J04412k2031j9279K364J8325
$$ plain form
15199 -1837 -7596 11931 18674 94781 112415 103652 -2300 -63343 -46882 -13093 12176 63300
15187 63300 7022 8954 2906 -1566 40334 18892 47325 -11331 -77155 -94424 -102986 -48977
15175 -48977 -51386 -49089 20967 -722 -9282 64953 62071 48270 -35969 -120850 -125336 -40538 17026
15162 17026 26387 116288 169318 256570 385940 474592 611232 685274 711879 605517 399642
15151 399642 250752 139626 126936 65102 99707 90386 16598 -63634 -87395 -51194 16993
15140 16993 -1348 -37497 -54927 -73204 -132290 -110551 -107307 -114152 -8483 49181 -17166 -142056
15128 -142056 -113110 6980 45788 -28472 -11688 -36361 -59029 -125549 -79185 -34411 -36039
15117 -36039 -38235 -36202 -93475 -125107 -38658 -7485 15183 119595 97564 78285 80649 98974
15105I8974J2491k908J4984O3641J55591J11655J28970P6477J10601p1878j28923
15094E69675p6284j06805o1196j58352r8993r777n5446j8749R0240M7864p867
15083A14310k5762P225M6211l330m2004R8040m8434q0037J9010l7331n9705j7536
15071b9343R19Q8637n3140m2313j3890N5242L5573j01645q6872M709R4689Q2765
15059C5331l162k9423k6460L6397N7457j2592k7972R844m2685j0622p244m1369
15047f2500L6035N7490Q7049m0119k0899L9485P9938O7224J8689L401l8999n1847
15035A74947j37583R1243j8904q5485M5637l3681k6370o1306n966Q6987Q231m4766
15023g016n185K3533l870R432p4203k2121L1718J9713n2121m9718K6658K9340
$$ plain form
15105 98974 111465 108557 123541 187182 342773 454428 583398 659875 770476 698598 569675
15094 569675 493391 386586 325390 167038 68045 58268 2822 -15927 74313 122177 114310
15083 114310 88548 95773 141984 138654 96650 194690 146256 66219 85229 47898 -11807 -29343
15071 -29343 -28424 60213 7073 -35240 -49130 6112 41685 -59960 -146832 -142123 -47434 35331
15059 35331 32169 2746 -23714 12683 70140 57548 29576 39420 -3265 -13887 -21131 -62500
15047 -62500 -26465 31025 118074 77955 57056 96541 176479 243703 262392 265793 226794 174947
15035 174947 37364 128607 109703 24218 69855 36174 9804 -51502 -57468 29519 37750 -7016
15023 -7016 -12201 11332 7462 16894 -57309 -79430 -47712 -27999 -80120 -129838 -103180 -73840
15011g3840K0015P3852j64o912n6165k4075J3033k059Q7998K8622K3043J6193
14999I9541j15250j8057L9373R191k5201j31295k5511R1391J23274N1639n2820
14988D6275N3146J4603k4823l020M1192j44440q9994J2537O2849J20479J5842
14977A04646p3816j4221N6341K6373Q928k5986j33410r9543K4551K1720n2056
14966a56473m0424O3745O1630n5439P4871Q8377L0761m902p1585l9102K9773L1623
14954A2855n9235M331l2932N0467J7213j119n3016p3512m6256N001k0503J4854
14942a81852P5186P3433L7319K9720L7430L6425J9791L2534J7547L0152p1943
14931A35742n0645o6835r7462J2028j2869k5387R0316L5663l0326n1167Q4595
$$ plain form
15011 -73840 -53825 20027 19863 12951 -43214 -67289 -54256 -56315 31683 60305 83348 99541
14999 99541 -15709 -33766 5607 14798 -10403 -141698 -167209 -75818 47456 99095 46275
14988 46275 99421 114024 89201 86181 127373 -17067 -107061 -94524 -31675 88804 104646
14977 104646 30830 16609 72950 99323 108251 82265 -51145 -150688 -126137 -104417 -156473
14966 -156473 -196897 -133152 -71522 -126961 -52090 36287 67048 62146 -9439 -48541 -18768 12855
14954 12855 -46380 -42049 -74981 -24514 -7301 -8420 -61436 -134948 -181204 -176203 -196706 -181852
14942 -181852 -106666 -33233 4086 33806 71236 107661 127452 159986 177533 207685 135742
14931 135742 85097 18262 -79200 -67172 -80041 -105428 -15112 20551 -9775 -60942 23653
14920B3653Q2124n0833o4636l832P6974P115M346m0066n3383K5103m7969M1819
14908D15P6523K7491l6835o7299j00567k5598N6391J8544K2807J22416J7623k5890
14896H6021l391M626J7176P100K1159k2069k4658J2040M5207l6779j32041m5076
14884g0685J07484J9165p8031n2075J0494J55330M2685p1738R873j0249k6256
14873C5997l7410N6207J6757Q028P1177p9507k8968j7544K1633n571L8044N9774
14861A38617J8394q8432r3146j1520O2196Q4251j8558o3218J4910J3884K7787
14850H5165J89N504j0346j95o4404m8415O4896K0287j7889n7611J3590L2481O8055
14837I1307M2337J5022l0038L0016L919k3693j00783j35928O5419J10437R1148
$$ plain form
14920 23653 105777 54944 -9692 -13524 63450 70565 74911 34845 -18538 6565 -41404 415
14908 415 76938 104429 67594 295 -100272 -125870 -69479 -50935 -28128 94288 111911 86021
14896 86021 82630 87256 104432 111532 132691 110622 85964 98004 143211 106432 -25609 -70685
14884 -70685 36799 55964 -22067 -74142 -63648 91682 134367 62629 72502 62253 35997
14873 35997 -1413 54794 71551 79579 150756 71249 42281 24737 46370 40799 78843 138617
14861 138617 157011 68579 -24567 -36087 26109 110360 91802 28584 43494 57378 85165
14850 85165 85354 90858 80512 80317 15913 -32502 32394 52681 34792 -22819 -9229 23252 91307
14837 91307 133644 148666 118628 148644 152563 128870 28087 -107841 -42422 68015 159163
14826A59163r178k6508p0899j9532k608J03958P4079j02262n8974m7092r873L6897
14814B7171R3456o3685l270j1509M4379Q0412m9974K5407N9513M6502n4854q1701
14802A11847m2017M5823M09j09297Q686J0460o5559k4052J46057J20550J3193
14791B16100q7230m2703m6369Q863R1290J3257L5928L7004o086j2750N3867N4834
14779C16005k9064k4030n8697K6877M565n0981j17480L3288P7581M6005J8422
14768B42491O6815R3440O7642p0686r424M0545J05135L0533J5913J33918K0543
14757G36865N0399K0248J14524J93043R7506J53476K07812K11148K67106L23024
14747B375151M56332M59130N02239P06901Q96064J334051J848817K452543L649285
$$ plain form
14826 159163 149985 123477 52578 33046 30438 134396 208475 106213 47239 147 -9726 27171
14814 27171 120627 56942 53672 42163 86542 166954 116980 142387 201900 248402 193548 111847
14802 111847 69830 115653 116062 6765 15451 25911 -39648 -63700 82357 202907 216100
14791 216100 128870 86167 39798 48661 139951 153208 189136 226140 220054 207304 261171 316005
14779 316005 286941 262911 204214 231091 235656 184675 67195 100483 178064 224069 242491
14768 242491 309306 402746 470388 399702 390278 430823 535958 566491 582404 716322 736865
14757 736865 787264 807512 922036 1115079 1212585 1366061 1573873 1785021 2052127 2375151
14747 2375151 2831483 3290613 3792852 4499753 5395817 6729868 8578685 11031228 14680513
14738A4680513N460052P670734R618255R120567L621659m662011r051704q656880
14730B7801185o671141m864510l404603k423424j710432j299168j011402p57053
14722E659452o17180n42733l95052l28762l18870k14347j89440k19944j55887
14713B677237j24938r1693k4117K23m7224j49300r71J34296J11779O0565M8226
14702B594083J39322J61233J19437J43220J78622K97374L63160L62450M33608
14693D792509O02286Q37024Q75513J039369J179877J431119J835073K329651L115846
14684A8038267M352867O355804R488128J4460263K1584250L0179078L5932277
14677A40390934K5477954o905565l2342121l3799128k5386925j7401206j1699216
$$ plain form
14738 14680513 20140565 27811299 37429554 46550121 50171780 45509769 36458065 27801185
14730 27801185 21130044 16265534 12860931 10437507 8727075 7427907 6416505 5659452
14722 5659452 5042272 4499539 4104487 3775725 3456855 3242508 3053068 2833124 2677237
14713 2677237 2552299 2460606 2436489 2436712 2389488 2240188 2239217 2373513 2485292 2545857 2594083
14702 2594083 2733405 2894638 3014075 3157295 3335917 3633291 3996451 4358901 4792509
14693 4792509 5394795 6231819 7107332 8146701 9326578 10757697 12592770 14922421 18038267
14684 18038267 22391134 28746938 38235066 52695329 74279579 104458657 140390934
14677 140390934 165868888 158963323 126621202 92822074 67435149 50033943 38334727
14670C8334727q072436n635197l988949l072459k488262k002130j504129j136484
14662A0434681r28376q39402r39503q70256o95660m23831l32252m04852l68332
14653D632217k22806j33183r3214j80260j09864n1247m162K6914L7553J5645M3410
14642C961003J33051J72719J71497K16385L70619K85986M87575O43007Q47306
14633G289148J007790J123842J261130J616493K057379K628914L604173N301012
14625B5889881P970886J2122434J8516225K7369934L6853384L6581209R507431
14618A74811384k7878753l9262104l1372240k1314541j4003809r298684o378556
14611B5302697m537159l259561k541651k161041j654228j279859r99979q09773
$$ plain form
14670 38334727 30262291 24627094 20638145 17565686 15077424 13075294 11571165 10434681
14662 10434681 9506305 8666903 7727400 6857144 6161484 5737653 5405401 5000549 4632217
14653 4632217 4409411 4276228 4183014 4002754 3892890 3841643 3837481 3864395 3901948 3917593 3961003
14642 3961003 4094054 4266773 4438270 4654655 5025274 5311260 5798835 6441842 7289148
14633 7289148 8296938 9420780 10681910 12298403 14355782 16984696 20588869 25889881
14625 25889881 33860767 45983201 64499426 91869360 128722744 165303953 174811384
14618 174811384 146932631 107670527 76298287 54983746 40979937 31681253 25302697
14611 25302697 20765538 17505977 14964326 12803285 11149057 9869198 8869219 8059446
14603H059446p52349p81930o63117m98078m53284m94628m31428l59077j66128
14594C459427j42620j89076k60019j95312k7357j16478q2783n8728j7507j1646
14584B357901K0314q593Q4496J34717K8467P0428J04148J98988L18573L69681
14574C679120L81048M89823O20196Q54002R63717J410803K179583L342660N151195
14565A9072147P704995J0790145J2619992Q098475m156040j2297279j1730687
14558C0101748q478761n638323l726676k519394j733665j311587j062803p58484
14550D872055n50331m77055m76071l25641l25577j82950k78114k44669k28059
14541A783588j47653j59741r5509j43743p9748m6127p557o9685j11105j36943
$$ plain form
14603 8059446 7307097 6525167 5862050 5363972 4910688 4416060 3984632 3625555 3459427
14594 3459427 3316807 3127731 2867712 2672400 2645043 2528565 2445782 2387054 2369547 2357901
14584 2357901 2378215 2369622 2454118 2588835 2617302 2687730 2791878 2990866 3309439 3679120
14574 3679120 4060168 4549991 5170187 6024189 6987906 8398709 10578292 13920952 19072147
14565 19072147 26777142 37567287 50187279 58285754 54129714 41832435 30101748
14558 30101748 21622987 15984664 12257988 9738594 8004929 6693342 5630539 4872055
14550 4872055 4321724 3844669 3368598 3042957 2717380 2534430 2256316 2011647 1783588
14541 1783588 1635935 1476194 1380685 1236942 1157194 1111067 1103510 1033825 922720 785777
14531G85777N9128R7634J850j95880p1055N821o0030J78J3267p6602j27304l9070
14519C93714L3542k3746o242n1446k4136j3839M9886L3891m6695j4192k2389k8054
14507B80294o021Q412R963M632P9549j2770L8756O2878J0346l3404L9978J12475
14495E95088o50P761j7081j25862m9131K6154n5892n4992n5481o3917l7256J25227
14483B93968O5327Q77L668j6829n5778r4892Q699o7077J6213J2649J8617o157
14471A79285L2892P983p6848N418p241K4205m7752J8372L4260O409q5638l9793
14459E1552J3906m7458J16016M8032q0608p882J06845N2789j4157m5660J7647
14448B11022p0973m3246j4501l8164l878j05226q6263J45343J22565N0516L8445
$$ plain form
14531 785777 844905 942539 944389 748509 677454 683275 623245 623423 636690 560088 432784 393714
14519 393714 427256 403510 397268 345822 321686 307847 357733 391624 344929 330737 308348 280294
14507 280294 274273 282685 292648 297280 376829 364059 402815 465693 476039 442635 482613 595088
14495 595088 594438 602199 585118 459256 410125 436279 380387 325395 269914 205997 168741 293968
14483 293968 359295 360172 363840 347011 291233 196341 205040 137963 154176 166825 185442 179285
14471 179285 212177 220160 143312 148730 141489 165694 117942 136314 170574 176983 91345 51552
14459 51552 65458 18000 134016 182048 101440 93558 200403 253192 239035 193375 211022
14448 211022 140049 96803 82302 44138 40260 -64966 -151229 -5886 116679 167195 205640
14437B05640j7597m0505J3782K6153N1391N1353K0956j13772q16J7437j475j06486
14425A06061k2630j5563J00930K5279r472K966O285k4637j10774r9368l6456R5264
14413A7885J12276J5l3107K1607o0044p4936K6030k7246n603M2905K1622N9034
14401A00438k2784P1459K4938K0419J37192k4110n7247j3997J2282j17259j33559
14390b228P2376J3167J9571p332j0476j9936K9550K5740l0422j3930o1631K1533
14378C5982O4108J2334j23861o644N3972P9505K6572L7083L7913o6904o4807r759
14366G5494M1987m5562n9325R2085O3313o709o1340q8613N9344O3030R652m1675
14354A01681l4991M9972l6263o1008J6255m7972P8425R1130k9714o3807m799K6070
$$ plain form
14437 205640 188043 147538 161320 187473 238864 290217 311173 197401 196585 214022 212547 106061
14425 106061 83431 67868 168798 194077 184605 187571 193856 169219 58445 -40923 -77379 17885
14413 17885 130161 130176 97069 118676 58632 -16304 9726 -17520 -23123 19782 41404 100438
14401 100438 77654 149113 174051 194470 331662 307552 250305 236308 248590 131331 -2228
14390 -2228 70148 83315 102886 95554 85078 65142 94692 120432 90010 76080 14449 35982
14378 35982 100090 112424 -11437 -18081 35891 115396 141968 179051 216964 150060 85253 75494
14366 75494 117481 71919 12594 104679 167992 161283 99943 11330 70674 133704 143356 101681
14354 101681 66690 116662 80399 19391 35646 -12326 66099 157229 127515 63708 58909 84979
14342H4979K427k664q22K5304o4570M4989Q886L2068k1109J5921J0963M3101p485
14329A71988p6247j1227Q2322o1146j59155J6202P1052N4206O4247K4697l7472
14318A39467J3735O937j384k4081M2017m1824M9882O8037m7206p3265j502N5024
14306A85837K5327n1815o2685L486K5034m4247k7609K0653J27645K5181j24105
14295A02702p8385l9250l5729q780L7838J5389O0392J23502n0165n9870l2952
14284C4692j6651K3994m6851j30543o0663N9198k0389K113K0228R7849o8L9482
14272B391n519k4732j0597j8205L9331J1941j529j178N3608L7468l7934n5199
14260a0154r4183J8258M9750N4423J3242L6948j5672J7074O5559M4556R3019P4802
$$ plain form
14342 84979 87406 84742 83920 109224 44654 89643 98529 130597 109488 125409 136372 179473 171988
14329 171988 95741 84514 166836 105690 -53465 -37263 33789 87995 152242 176939 139467
14318 139467 153202 160139 158755 134674 176691 134867 184749 252786 205580 132315 130813 185837
14306 185837 211164 159349 96664 100150 125184 80937 53328 73981 201626 226807 102702
14295 102702 24317 -14933 -50662 -59442 -21604 -6215 54177 177679 127514 67644 34692
14284 34692 18041 42035 -4816 -135359 -196022 -136824 -157213 -155100 -134872 -37023 -37091 2391
14272 2391 -3128 -27860 -38457 -56662 -17331 -5390 -6919 -8097 45511 82979 45045 -10154
14260 -10154 -104337 -86079 -36329 18094 31336 68284 52612 69686 135245 179801 272820 347622
14248C47622k4801l3766q4355o6078P4860O9267o8153l8162k2172m3659O4125
14237A74728J0205l5501J6567j5794K124j0555n2867m1917J4087k2714J8787N2740
14225A09890j7633K3866p8973k6267L5232K3523J8676K0435p5045m4199k6909
14214c7404m9565p6124L3191k4483J0257J4759K7854O5508M3359R550J2623J25078
14202A54603M0322r8893K0304J07286J2514k8778Q0536J24073J48743J52144R6695
14191H09549j03047j12829j05211q0626j10585j51192o8608l38m3097J7318J10380
14180A61714p6985j17543l0946P454k7385O1371J12613l806N4785j9256k4771
14169I7245O9587n2012r1998p4955J737M7015L802R207R9330m0137j8840j10641
$$ plain form
14248 347622 322821 289055 204700 138622 213482 282749 214596 176434 154262 110603 174728
14237 174728 184933 149432 165999 150205 152329 141774 88907 46990 61077 38363 57150 109890
14225 109890 92257 116123 37150 10883 46115 69638 88314 108749 33704 -10495 -37404
14214 -37404 -86969 -163093 -129902 -154385 -144128 -129369 -101515 -36007 7352 16902 29525 154603
14202 154603 194925 96032 116336 223622 236136 207358 287894 411967 560710 712854 809549
14191 809549 706502 593673 488462 407836 297251 146059 77451 77113 34016 51334 161714
14180 161714 84729 -32814 -63760 -56306 -83691 -22320 90293 86487 141272 122016 97245
14169 97245 166832 114820 22822 -52133 -50396 -3381 421 9628 108958 68821 49981 -60660
14157f0660J8678j0302n5465K4262N8664L8914K1409m3626L8022R2730r8604o1215
14145c7193R452O7888J00675j7453n498L4122P6857L5786P4550J84658J05229
14134F29073L6240J9651j05992j45872k8003p803j24036l3017o7466N370M056
14123A82201n4395j02134R983L1591o8711n5050l4441R1894J16704K7986o1558
14112H4070n6532j2003M3268j8422k8051O1627K381L0927l5063k8309O8222M112
14100A16227L7591k9490j397l2963j20898K5954K400M4984l2437K9517L0155l0253
14088C9390l7742M7762M4833o6376P320L9716m8523j8645K7557J09445Q3828J2419
14076B40984K0938K4583n232j5817o3586j21413O21J3940n739K1401j9430n4490
$$ plain form
14157 -60660 -41982 -52284 -107749 -83487 -24823 14091 35500 -8126 29896 122626 24022 -37193
14145 -37193 -27741 40147 140822 123369 117871 151993 228850 264636 339186 523844 629073
14134 629073 665313 684964 578972 433100 405097 397294 273258 240241 172775 178145 182201
14123 182201 127806 25672 35655 67246 -1465 -56515 -90956 938 117642 145628 84070
14112 84070 27538 15535 58803 40381 12330 73957 76338 107265 72202 43893 112115 116227
14100 116227 153818 124328 122931 89968 -30930 -4976 -2576 42408 9971 39488 69643 39390
14088 39390 1648 49410 94243 27867 35187 74903 26380 7735 35292 144737 228565 240984
14076 240984 261922 286505 281273 265456 201870 80457 81078 95018 89279 110680 91250 36760
14064C6760K7791P5172m6099j6436K9146J6203m3476l2209L4431Q8777m598q4220
14052H1242j4932L8911J0532p5464k5406L2347N9175k7960j623n5254N860K2088
14040D9516l8657k7756N8261j7954O455K5883P1323j2049J4848m7703k8490L6821
14028I0498o545j6080L4846k5323K289J06747Q5411o4563q2832m0199r3137l5999
14016d4887L8027O3265k1325n0530K8871N3400r645K4149l2090q3945L5311J02815
14004A03416m8695l1995n9328n710M2622Q712P049n0352n5902J3706N9511k4948
13992d1914q070M6125j3213J23208o3131o3068j321M8325j3965J6139K1531M3904
13980I4550n7687k1574N4474M4865L887K3702o5468N1323N9603P4396M7106r0308
$$ plain form
14064 36760 64551 139723 93624 77188 106334 122537 79061 46852 81283 170060 165462 81242
14052 81242 66310 105221 115753 40289 14883 47230 106405 78445 76822 21568 27428 49516
14040 49516 10859 -16897 41364 23410 29865 55748 127071 115022 129870 82167 53677 90498
14028 90498 83953 67873 102719 77396 79685 186432 271843 207280 124448 84249 -8888 -44887
14016 -44887 -6860 56405 35080 -15450 13421 66821 57176 81325 49235 -34710 601 103416
14004 103416 54721 22726 -36602 -42312 310 9022 16071 -34281 -90183 -76477 -16966 -41914
13992 -41914 -49984 -3859 -17072 106136 43005 -20063 -21384 26941 12976 29115 50646 94550
13980 94550 36863 15289 69763 114628 118515 142217 76749 128072 187675 262071 309177 218869
13968B18869j43746r9616n4258K2392P6796M8337O5927j29051q2047M5363J34580
13957A03546O5436K0174k525p9263q1320k3766k2473M527J178r757j6720r248
13945e0211o325M4782P9029j6580P5778l8255l2806n1723j6524k9149m406L0405
13933a5985k2360q4800q1547J11089J13248N0567o2606j9135L1134L2961m550
13922D8016n3145j06301j6561k4907N4229Q5662M3910J5572o3406n3096k2932
13911i2959J7364R8890K3308k5716k2473o7195N7871R185j04415l3778M3399o300
13899a02819k3168N8075J12303P8676K3151k1918l5472j15857l8504J1595P6226
13888B2288K7104l7689K7812j6466Q3057L655m3451o3016j0695N3442Q676O820
$$ plain form
13968 218869 75123 -24493 -78751 -56359 20437 68774 134701 5650 -76397 -31034 103546
13957 103546 168982 189156 186631 107368 26048 2282 -20191 -15664 -14486 -24243 -40963 -50211
13945 -50211 -56536 -11754 67275 50695 126473 88218 55412 3689 -12835 -41984 -46390 -15985
13933 -15985 -38345 -123145 -204692 -93603 19645 70212 7606 -11529 19605 52566 48016
13922 48016 -5129 -111430 -127991 -152898 -98669 -13007 30903 46475 -16931 -70027 -92959
13911 -92959 -75595 23295 46603 20887 -1586 -68781 -10910 -1725 -106140 -139918 -96519 -102819
13899 -102819 -125987 -67912 44391 123067 146218 124300 88828 -27029 -65533 -53938 22288
13888 22288 49392 11703 39515 23049 106106 109761 66310 3294 -7401 46041 54717 61537
13876F1537j32414j2165K9917O0501L3161k865n125K5042J1687n3011j1866L2182
13864C6581m6324o3196q0071O0148N4052K9463j1003P843p4545o273P648L819
13852h1858P8050J4597k8065O3281K6035K378r9992n4333K7617J7389M7078K9434
13840D1611m7600K4058j0141O147K0775q425N8879l3639m6381M4962K1240m8518
13828B2968k3772N8215J2952o6336l5386j576L4779M74j8725P8434k2883j9890
13816A9254o2568k4385l6620j6828N4574n494M6518M9822m4320o461j8590K6559
13804a8539R8564L3653r7741l6420J5347L7385P616o1314n8079n2073Q7214J4011
13792c0376O0360m808M8593l6577R604k3088k6550J9331L8725k8150l0911O1939
$$ plain form
13876 61537 -70877 -83042 -53125 7376 40537 37672 32547 57589 69276 16265 4399 36581
13864 36581 -9743 -72939 -153010 -92862 -38810 -9347 -20350 -12507 -87052 -93325 -85677 -81858
13852 -81858 -3808 10789 -17276 46005 72040 74418 -25574 -79907 -52290 -34901 12177 41611
13840 41611 -5989 18069 7928 14075 34850 26425 85304 51665 5284 50246 71486 22968
13828 22968 -804 57411 70363 4027 -31359 -32935 1844 2318 -16407 62027 39144 19254
13816 19254 -43314 -67699 -104319 -121147 -66573 -72067 -25549 24273 -20047 -26508 -45098 -18539
13804 -18539 80025 113678 15937 -20483 -5136 32249 39865 -21449 -79528 -131601 -44387 -30376
13792 -30376 29984 25176 73769 37192 46796 23708 -2842 16489 55214 27064 -3847 58092
13780E8092n860j8747L8747N041l4139n3634p6181n6782L6550L433j7071Q5320
13768c5231Q935l4295j6672k1050j44q363O5574K6402j3486l4652o2754Q587J6279
13755a00870n9000m6727L1231R9075L4699o103j8145K3370j922j25643q8025J09692
13743a48368J54139N9035l2833k1500j9324m1624K1870j6311j9517K0590J3380
13732c0463J03879l6717q8680N7920J15194m9197j48588J5532L3992M9871J0763
13721C3506r9387q5326J12983O3914K9742M8527K5968n7568j28447L1919M0964
13710A6795Q0251l4054o8819N23n1900J7230M5746L7136l7180k2624j1609J5766
13698a2739L6295J567J9803L5638m9406o4386m3N6306k4978M5862J2922j11428
$$ plain form
13780 58092 52232 33485 72232 77273 43134 -10500 -86681 -143463 -106913 -103480 -120551 -35231
13768 -35231 -26296 -60591 -77263 -98313 -98457 -106820 -41246 -14844 -28330 -62982 -125736 -117149 -100870
13755 -100870 -159870 -206597 -175366 -76291 -41592 -47695 -65840 -42470 -44392 -170035 -258060 -148368
13743 -148368 5771 64806 31973 10473 -8851 -50475 -28605 -44916 -64433 -43843 -30463
13732 -30463 73416 36699 -51981 5939 121133 71936 -76652 -61120 -27128 22743 33506
13721 33506 -65881 -151207 -38224 25690 55432 103959 129927 72359 -56088 -24169 16795
13710 16795 97046 62992 -5827 -5304 -57204 -39974 5772 42908 5728 -16896 -28505 -12739
13698 -12739 23556 25123 44926 80564 31158 -33228 -33271 23035 -1943 43919 56841 -54587
13686e4587o1098K9819k0193k2910O9264K4412l0423L7585O9108K684o2423l5739
13674e4501l6901L2649M2134K9676N5362O3603m861q1860m8049j1446J5394Q9016
13662I0216O1201n6633R403M4069k4733q0485M1971N3086r3495N27L2480O6967
13650A44574p1209o6356K6680p8045j6239m826K7238M5568Q4361J4029J2874o5792
13638E2857n2245J1443N9373k9252p0458K1199P5198J3184o288J4884m5492M615
13626D9018k3331j5018L085k8931n6595p6470L12L7438N5377L9356n5894m3155
13614a14808M2784R6691r397n6593k6798L5260R9847K1528m7189q4367l8273J5225
13602f6090L7080M7866R4285L9142o6204o130j7118o0519q9791j770L6690N6314
$$ plain form
13686 -54587 -115685 -85866 -106059 -128969 -59705 -35293 -65716 -28131 40977 43661 -18762 -54501
13674 -54501 -91402 -58753 -16619 13057 68419 132022 127161 45301 -2748 -14194 1200 90216
13662 90216 151417 94784 104187 148256 123523 43038 85009 138095 44600 45127 77607 144574
13650 144574 73365 7009 33689 -44356 -60595 -65421 -38183 7385 91746 105775 118649 52857
13638 52857 612 12055 71428 42176 -28282 -7083 68115 81299 75011 89895 44403 49018
13626 49018 25687 10669 13754 -15177 -71772 -148242 -147930 -110492 -55115 -15759 -71653 -114808
13614 -114808 -72024 24667 15270 -41323 -68121 -32861 66986 88514 41325 -43042 -81315 -66090
13602 -66090 -29010 18856 113141 152283 86079 79949 62831 2312 -87479 -89249 -52559 3755
13590C755O6697k1619k2906j7407M216J7550J1562n3357j4830P9703O227r8286
13578c8695m3464L0570K1750J00741j1102n6209p5873j24046k803J5207M5248
13567a38676J5032O5754L4899k9407L356N047l9137K0509J7400L9095Q8660R590
13555I2122J5168m5453q3449J6804K8409R2020P2942n5716j34221j6614J19168
13544A01180Q5612o894l6662j13506o6873n580n553M7883q289o1514M8430L6292
13532A4526l4413J8204m0039j5470J3174L5623k1858Q2954J33808n8005n8544
13521F9960P3425m9276p0130N5994k852q4996m8802M2550o849L6121j3594M0245
13509D1796p748q577m5434o3474K4458k2092m3817l9437Q4829L4285k3774L1669
$$ plain form
13590 3755 70452 48833 25927 8520 12736 30286 41848 -11509 -26339 53364 59591 -38695
13578 -38695 -82159 -51589 -29839 70902 59800 3591 -72282 -196328 -199131 -183924 -138676
13567 -138676 -123644 -57890 -22991 -52398 -49042 -43995 -83132 -62623 -45223 -6128 82532 92122
13555 92122 107290 61837 -21612 -4808 23601 115621 188563 132847 -1374 -17988 101180
13544 101180 186792 179898 143236 29730 -37143 -42723 -48276 -393 -8682 -70196 -21766 14526
13532 14526 -19887 -1683 -41722 -57192 -44018 -8395 -30253 52701 186509 128504 69960
13521 69960 143385 94109 23979 79973 77121 -7875 -56677 -14127 -20976 15145 1551 41796
13509 41796 34048 25471 -19963 -83437 -58979 -81071 -124888 -164325 -79496 -45211 -68985 -37316
13497c7316J21541N2399k8417m9199j5451p2667L2824N2207j8920K3082N1757
13486A11840j5306j2062j28048o2455l6614Q9595P5938N7867l9608J8701J2917
13475G2765k1512j1782J0155n0125p8183K5359K2369o7478k6930N6544L2235K6495
13463a0088l2044j8442N3361L0986L3083R274n1447M699J13938J22076j4401j56391
13451H4604m0037L0324J9194k8846j15519n350N2729m928M1071K0014L111o8777
13439a2410n8419o571N3387m2915j7277P4587M304j2652M1681j9048K6145J7536
13427D8348K9099J7960k6831q817M4630m1509q3814l0548L2935P549l2320P48
13415d2570j2974J5127m6552K4487K4797K151j4378J9426n0593M3952N2787M9564
$$ plain form
13497 -37316 84225 136624 108207 59008 43557 -29110 3714 55921 37001 60083 111840
13486 111840 96534 84472 -43576 -106031 -142645 -53050 22888 80755 41147 59848 72765
13475 72765 51253 39471 49626 -499 -78682 -53323 -30954 -98432 -125362 -68818 -36583 -10088
13463 -10088 -42132 -60574 -7213 23773 56856 66130 14683 19382 133320 255396 240995 84604
13451 84604 44567 74891 94085 65239 -50280 -55630 -2901 -7829 33242 53256 56367 -12410
13439 -12410 -70829 -77400 -24013 -66928 -84205 -9618 -5314 -17966 23715 4667 30812 48348
13427 48348 77447 95407 68576 59759 104389 62880 -20934 -51482 -18547 -10998 -43318 -42570
13415 -42570 -55544 -40417 -86969 -62482 -37685 -35534 -49912 -30486 -81079 -37127 15660 65224
13403F5224p5077k3828k9007m7636j7937N8664M1828Q3547O705q1316j695k5716
13391d6244p6329O9101J36424J157j24973k1676J03611k4691j2880k6379M2587
13380A9708J5910K4791k4801j0481K5942m3953r1658r0918K8790O9916m708M3566
13368c7896k941K5757J17043j9431r3125K6136j7246K2707M4546l416k5393j21418
13356h4677M1536P9549L2885M4114o2555m4769Q1N3347J6414k0097k9474k2147
13344D207O0664L8614k0786j9039K814J9781o3708Q780O4313q248r3520n2422
13332e8550n9134L357P9381J5536l0963M4031J1283K1255j2904o6539o4427R7292
13320b0382O3149p7447p4002L2752N9842R393M7932m822p9280L8958P8177J38559
$$ plain form
13403 65224 -9853 -33681 -62688 -110324 -128261 -69597 -27769 55778 62483 -18833 -20528 -46244
13391 -46244 -122573 -53472 82952 84109 -40864 -62540 41071 16380 3500 -22879 19708
13380 19708 35618 60409 35608 25127 51069 7116 -84542 -175460 -146670 -76754 -81462 -37896
13368 -37896 -40837 -15080 101963 82532 -10593 15543 -1703 21004 65550 62134 36741 -84677
13356 -84677 -43141 36408 69293 113407 50852 6083 6164 59511 75925 55828 26354 4207
13344 4207 64871 103485 82699 63660 66474 86255 22547 31327 95640 87392 -6128 -58550
13332 -58550 -117684 -114327 -34946 -19410 -50373 -6342 4941 26196 13292 -53247 -117674 -20382
13320 -20382 42767 -34680 -108682 -75930 -16088 -6695 41237 36415 -42865 -3907 74270 212829
13308B12829o6437j01476l4671l6434J3717l2851Q2862J01301r284J9751m9925
13297I9382n7224j7850p884K495n0311o0745m2193O8182P5423K2096K58m1231
13285i602O312m1507k9721K9643m6197K573q574l4258J7329K18L8566r958j5061
13272a00237k7002J24156L3679M672J990J14992m4622p2497M062J2544j15512
13261f3775q2479K7148k1104M7318M7306J0624K0529p449p6654n7109j1880j0178
13249a77703M0603P1046K5009N6915k4823J621N1253M715j2323K4120l9709K1842
13237D2566q771l191q0861k4299O0464Q8494R8812J3501J8156m8902p3067P464
13225I0366L0774j29941m2777l5040j07171l1602M4330M7131k7621R8335P9187
$$ plain form
13308 212829 146392 44916 10245 -26189 -12472 -45323 37539 138840 129556 149307 99382
13297 99382 42158 24308 16424 18919 -31392 -92137 -134330 -66148 9275 31371 31629 -9602
13285 -9602 -3290 -44797 -74518 -44875 -91072 -88499 -97073 -131331 -114002 -113784 -75218 -85176 -100237
13272 -100237 -127239 -3083 30596 35268 37258 152250 107628 35131 39193 51737 -63775
13261 -63775 -146254 -119106 -140210 -92892 -45586 -34962 -14433 -21882 -98536 -155645 -167525 -177703
13249 -177703 -137100 -66054 -41045 15870 -8953 -7332 43921 48636 36313 60433 20724 42566
13237 42566 33795 30604 -50257 -74556 -14092 74402 173214 186715 204871 155969 82902 90366
13225 90366 121140 -8801 -51578 -86618 -193789 -225391 -181061 -133930 -161551 -63216 15971
13214A5971j4626j9840k7017O6493K8013J0366j4475Q470M0781K627m1310j0297
13202D5156M7296l863J4856K5900j7889q0342l2286j8935J539K0152J15009k7811
13190H8782p1584j9729J09614j5989r8850q1768K6983l9350k873O7219n0370p3965
13178a61880L2509N551Q6368L0361K1136O5384q266q1937j3494N6905L1629l4955
13166B9311m3769j3354R1618K0572J034k1984m5279K2521n8251p076M828n9514
13154g9343L1398K5397Q3684o815j09846m9394j3434K6290P8851J26148M9790
13143A62726M5068n4962j89554p0487j8289l046L6681M4061K8963N1038O803j00882
13131f1880n1877K6767M9002m3775k9682R9589L4539l765N802m1391j8281J3702
$$ plain form
13214 15971 1345 -18495 -45512 20981 48994 59360 44885 53355 94136 96763 55453 45156
13202 45156 92452 88589 103445 129345 111456 31114 -1172 -20107 -18568 1584 116593 88782
13190 88782 17198 -2531 107083 91094 -7756 -89524 -62541 -101891 -104764 -37545 -87915 -161880
13178 -161880 -129371 -123820 -37452 -7091 14045 79429 71163 -10774 -24268 32637 64266 29311
13166 29311 -14458 -27812 63806 84378 85412 63428 18149 40670 -17581 -24657 -19829 -79343
13154 -79343 -47945 -22548 61136 54321 -55525 -104919 -118353 -92063 -13212 112936 162726
13143 162726 207794 152832 -36722 -107209 -125498 -128544 -91863 -47802 -18839 32199 39002 -61880
13131 -61880 -113757 -86990 -37988 -81763 -111445 -11856 22683 18918 24720 -16671 -34952 -21250
13119b1250R2692M1590l7493N5884P2395r4074q2332n4202P7822M0685j25367
13108c3650M4544P2869r6660l9807M882P5128K9332K8228m3026m4172k3608M3282
13096A7342j0518R533k975m731k054l048O0003q660R259M3033N8654o5873l892
13083I6073j4696K3111n7078M6598o5655m7681k7992O7447O8337K2893J1310L189
13071A25856q7012J7508J12037J115r1122k3464K4135M3880k6843o4129j917J0184
13059D0228q7298K5028M7783M579q7545m7230J8694j7472J02739p880l5505K969
13047d0910M1786m3560k4101M5011Q8185M2650m0943l7012j1995M6710l2836M4990
13035G7975P627r7378M5198o0549K5665N249Q9563O7725n6541o2051n2507n3789
$$ plain form
13119 -21250 71442 113032 75539 131423 203818 109744 27412 -26790 51032 91717 -33650
13108 -33650 10894 83763 -12897 -52704 -47822 27306 56638 84866 41840 -2332 -25940 17342
13096 17342 6824 16357 13382 8651 6597 3549 63552 54892 64151 107184 165838 99965 96073
13083 96073 81377 104488 47410 94008 28353 -19328 -47320 20127 88464 111357 122667 125856
13071 125856 38844 56352 168389 169504 78382 54918 79053 122933 96090 31961 30044 40228
13059 40228 -47070 -22042 25741 30320 -57225 -104455 -85761 -103233 -494 -8374 -43879 -40910
13047 -40910 876 -42684 -66785 -21774 66411 109061 68118 31106 19111 65821 32985 77975
13035 77975 85602 -11776 33422 -27127 -1462 3787 93350 161075 104534 42483 -10024 -63813
13023f3813K6634R0078Q3148o0132r6051l8768n747R1262R0825n7177j00Q646
13011F8805j548k7047k7580j6084j5619q591k9442j4833M7258N1948l8333l526
12999a4592K5393P8905j588l9433L262Q246j4448j25794n1025l1653j9305P3896
12987a08136M1427k2626L6309r790p3719J9914K4784Q8903R5788N5393n1498k4179
12975G2570j19128j06419M4018M9324l5N8999o980m0700M1341j9958p56O56K8907
12962A839j0505n6704J5296O6578N2021L4175J837o976q3101o1394J1475P2417
12950C6958P21J6118K9340J0480P297m7371P332k5696J0290k3227R1278L1446
12938A44966j15555m4818R7988K7556o4525j42755J924O5308Q696J2095J8197
$$ plain form
13023 -63813 -37179 52899 136047 75915 -20136 -58904 -64651 26611 117436 60259 60159 68805
13011 68805 67257 40210 12630 -3454 -19073 -27664 -57106 -71939 -24681 27267 -11066 -14592
12999 -14592 10801 89706 88118 48685 51947 60193 45745 -80049 -131074 -162727 -182032 -108136
12987 -108136 -66709 -89335 -53026 -62816 -136535 -116621 -91837 -2934 92854 148247 96749 72570
12975 72570 -46558 -152977 -108959 -59635 -59670 -671 -7651 -48351 -7010 -26968 -27724 -27068 1839
12962 1839 -8666 -65370 -50074 16504 68525 102700 104537 97561 14460 -46934 -35459 36958
12950 36958 37679 53797 83137 93617 100914 53543 60875 35179 45469 22242 113520 144966
12938 144966 29411 -15407 82581 110137 45612 -97143 -95219 -29911 -21215 -9120 9077
12927I077J8713O0673l172J3911O953l3706k7525J1716J647o6869J0519Q8292
12915I0229r1883k2451l026J8086n0259l4631K5082J08867N6869L1341L2818N4766
12903B15808j7451n2319m1668n0652m4300O594J9421K7909o9205p8435m1494P043
12891a18749L2320M2150M1176Q250J9694Q1959N9002n7984j37546j3268O1250
12880A8254P8804k3710o2016k4816l1990m5269L9471O2164o67l7178q2936p784
12868a17673K0343Q0870N7055m4390N1140N0790l4353J0843n1837k1193l633O604
12856D566o4155o053Q7719o1193m0643j9659N4107M8586M3334p168q3181L1708
12844a2032J00190k2182p669o25j07709L3727N6636L1752N6614n955j35905j0834
$$ plain form
12927 9077 27790 88463 85291 99202 106155 72449 44924 56640 58287 -8582 1937 90229
12915 90229 -1654 -24105 -27131 -9045 -59304 -93935 -68853 40014 96883 128224 161042 215808
12903 215808 198357 146038 104370 53718 9418 16012 35433 63342 -5863 -84298 -125792 -118749
12891 -118749 -86429 -44279 -3103 5147 24841 106800 165802 107818 -29728 -42996 18254
12880 18254 97058 73348 11332 -13484 -45474 -90743 -51272 10892 10225 -26953 -109889 -117673
12868 -117673 -97330 -16460 40595 -3795 47345 98135 63782 74625 22788 1595 -2038 4566
12856 4566 -59589 -65642 22077 -39116 -79759 -99418 -45311 3275 46609 39441 -43740 -12032
12844 -12032 88158 65976 58307 57682 -50027 -16300 40336 72088 128702 122747 -13158 -23992
12832b3992K8907J2721j9279n2562L7918Q2921n2844r4460L2916N4868J8140p3481
12820d8227j5687J988k0657K0809R7804k4932m5162p7447o5607j5129P6030O2566
12808e3651O4543M4905p8992k9703K1330K5000O481O5236J21337l9855k7254r1946
12796B7431m8226J1986P5580M2862L4207n179o4631r5174K8773l7794k0440J1031
12784c9574J7857J22313O7715j30552j04922P9236K1875p8458q6329l951R4765
12773d0025J26141l7099l4228k4269M4197n8118l9487M5850L0761m1222k6953
12762e4452M4048J8628K6548j0361P236j2297L1624o212k1869p3041j8410j7867
12750h6425L7484q6068r270K4509O7100k1334l0025N0156L0680o1587l6752O9997
$$ plain form
12832 -23992 4915 17636 -1643 -54205 -16287 66634 13790 -80670 -47754 7114 25254 -48227
12820 -48227 -63914 -61926 -82583 -61774 36030 11098 -34064 -111511 -177118 -192247 -116217 -53651
12808 -53651 10892 55797 -23195 -52898 -31568 -6568 -87 65149 186486 146631 119377 27431
12796 27431 -20795 -8809 66771 109633 143840 138661 74030 -21144 7629 -30165 -50605 -39574
12784 -39574 -21717 100596 168311 37759 -67163 12073 33948 -44510 -130839 -134790 -40025
12773 -40025 86116 49017 14789 -9480 34717 -23401 -62888 -17038 13723 -27499 -54452
12762 -54452 -10404 8224 34772 24411 31647 19350 50974 44762 22893 -50148 -68558 -86425
12750 -86425 -48941 -135009 -144279 -119770 -52670 -74004 -104029 -53873 -23193 -84780 -121532 -51535
12738e1535r424m2375m8802k1458q550J4548l5660o251J6399K4073K7345l100
12726a44790R0033O5031o548n561J360o3556l109L4772l558l0766n4658P3292
12714d8058P663J3520m9773r2329l9547O8862Q1778k4851J9661L9423l2484N0861
12702e274Q2184p839o8824j2666K6250m4058N558O4859K1070j0003l9675j9693
12690h111K9556k0730P4970Q560k8577o4012M7025q601q4399O5963N0169p1999
12678a0186j5790K5943M5810J4936L4549m4469n4035n765N105M9260k1334M1650
12666F5674l7442o7880J5819k6597l9993M2224L6963j6693r829q497L10J8627
12654b7314N7619k633m128l1807j1484M262j9116n5985p6999J1687L9598j9207
$$ plain form
12738 -51535 -60959 -103334 -152136 -173594 -182144 -167596 -203256 -209507 -193108 -169035 -141690 -144790
12726 -144790 -54757 10274 3726 -1835 -475 -64031 -67140 -32368 -35926 -66692 -121350 -48058
12714 -48058 -40395 -26875 -76648 -168977 -208524 -139662 -57884 -82735 -63074 -23651 -56135 -5274
12702 -5274 76910 69071 247 -12419 13831 -30227 -24669 40190 61260 51257 11582 -8111
12690 -8111 21445 715 75685 84245 55668 -8344 38681 30080 -54319 11644 61813 -10186
12678 -10186 -25976 -33 45777 60713 95262 50793 -3242 -9007 -3902 45358 24024 65674
12666 65674 28232 -39648 -23829 -50426 -90419 -48195 -11232 -27925 -37754 -46251 -45941 -27314
12654 -27314 30305 27672 23544 -8263 -19747 -15485 -34601 -90586 -167585 -155898 -116300 -135507
12642a35507p5230N9227L6416Q0322N2384O6253L6201m3447k7929M878j03111
12631d9543R610P8022J4513k2124k4474N9598M5245k6303j0472M0074K5255k9072
12619A10329o1513p8M5206l1403l5331p1066l3228K3484k5279m1441Q9694Q143
12607b2483k1733M5654L2501Q998k5499M6763m2525j8827m7398l3771O5027M9815
12595C6522o8230n7141O1427N2385p1901n4147J44118K6720k0942n2870p88k6349
12583c1196j8327j5435k2764m634L7108L3075%j2658r447R3123N6503j5861j6861
12570G2626p6332m6800m9977J21511O4228L4232k4274n5668o0337j0482j9588
12559e0861m1217L7972O4291M7879L416J4395Q649l57n3513m5679k9906P5258
$$ plain form
12642 -135507 -210737 -151510 -115094 -34772 17612 83865 120066 76619 48690 53568 -49543
12631 -49543 -39933 38089 52602 30478 6004 65602 110847 84544 74072 114146 139401 110329
12619 110329 48816 48738 93944 62541 27210 -43856 -77084 -53600 -78879 -120320 -30626 -22483
12607 -22483 -44216 1438 33939 42937 17438 64201 21676 2849 -44549 -78320 -13293 36522
12595 36522 -31708 -88849 -27422 24963 -46938 -101085 43033 69753 48811 -4059 -4847 -31196
12583 -31196 -49523 -64958 -87722 -92356 -55248 -22173 -22173 -34831 -44278 48845 105348 89487 72626
12570 72626 -3706 -50506 -100483 21028 85256 119488 95214 39546 -20791 -31273 -50861
12559 -50861 -92078 -54106 10185 58064 61480 75875 84524 84167 30654 -15025 -44931 30327
12547C0327N0285m7150q0347n8880J2644L9127n5645J8489O3641j3466j5118O2928
12535F835L0214k7009J9278j15101M4485N6877P4o7890q2631J5311L2164j501
12523h8894L7618Q7355p3598N5972l1491K2402R12m4252O4658k029m6696k7110
12511d5153o024L4541L4721J8096m4685j8838Q7052P0220l9941o9610n9069m588
12499d3278l4149k7656J63938P6459o442j0155k450m1270o6774p7165k644K6550
12487d5036L0248N352J6332k8365k8934j6633k4990k0241J8030j0263o71m4772
12475a49943N5496J09312K3721N307p3939M6831N7610j3040N865m4878m043K4087
12463D2386R137q3743j8348O7693q455m3912J0764Q3621J6039J5758m1098n7995
$$ plain form
12547 30327 80612 33462 -46885 -105765 -93121 -53994 -109639 -91150 -27509 -40975 -56093 6835
12535 6835 37049 10040 29318 -85783 -41298 15579 15653 -52237 -134868 -119557 -87393 -88894
12523 -88894 -51276 36079 -37519 18453 -13038 9364 10276 -33976 30682 28653 -18043 -45153
12511 -45153 -51177 -16636 18085 36181 -8504 -27342 59710 129930 89989 20379 -38690 -43278
12499 -43278 -77427 -105083 58855 135314 128872 118717 116267 74997 8223 -68942 -71586 -45036
12487 -45036 -14788 -9436 6896 -21469 -50403 -67036 -92026 -112267 -94237 -104500 -105171 -149943
12475 -149943 -94447 14865 38586 43893 -30046 16785 74395 61355 67220 22342 18299 42386
12463 42386 51523 -32220 -50568 17125 8670 -35242 -24478 59143 75182 90940 49842 -8153
12451h153p7900o4280l4862L9202R9879M8171L567J7884j2914m0842m1078k4703
12439i6029M0296q939O844N9354N3922O0963Q451j11115m9786J4285N2210N4779
12427H5235j9013r28m6693L534p677q9540p377o514L7121P764O493K5242K2087
12414I734j3494J4902N4501L3420k9005l9476j08899m027J6785K4705R792J5364
12402a5698J8982N191M0439k1318l3402p7787M4653P2972o8298K3842K9439o8927
12390d9912j0970M5417m5742k6113l4147P5149P0282j7644j9063q9875j5725J0388
12378a07955J5211M3262O0477L1957P4263Q540n1702m8052k1925N0289N7004l1803
12366G9566m1556J5344p24O390m8174k1106j5733N5834L2230O347r4853o3807
$$ plain form
12451 -8153 -86053 -150333 -185195 -145993 -46114 2057 5624 23508 10594 -30248 -71326 -96029
12439 -96029 -55733 -64672 -57828 1526 55448 116411 124862 13747 -36039 -21754 30456 85235
12427 85235 66222 65294 18601 22135 14458 -75082 -82459 -88973 -51852 -44088 -37595 -12353 9734
12414 9734 -3760 11142 65643 99063 70058 30582 -78317 -82344 -65559 -40854 -31062 -15698
12402 -15698 3284 8475 48914 27596 -5806 -83593 -38940 34032 -34266 -10424 19015 -49912
12390 -49912 -60882 -15465 -61207 -87320 -121467 -46318 23964 6320 -12743 -102618 -118343 -107955
12378 -107955 -92744 -49482 10995 42952 117215 125755 74053 26001 4076 54365 111369 79566
12366 79566 38010 53354 52630 59020 10846 -10260 -25993 29841 62071 68418 -26435 -90242
12354i0242J14123J0791Q1626L3717m2220l8758n5461o9294k9729l1564N3681
12343f3330l7686m146J4946J03137L3601m3950r5861m8719J3278M2284K9279k6203
12331h3370M3248L1512O0875J5760m134l6703j53381R626O6786n8044K7422J36177
12319E5774Q5654o2922o1265m1462R3855K9754j52848k5186l0773k4740q777L254
12307a39682M7599k9219K8966Q5712m6170n3898P40j0025q9293J9606J02987N9820
12295b2857J0052k7952j2887K6320P8213J8577l2831p7852J573N3270q627k8116
12283b3117J285O5025n536j23784J527M1190o9873k0372k6213j1150L4109Q5230
12271e1679L6511P4362r150n8474L1838L0676k3199Q2769l1162m204L795p7200
$$ plain form
12354 -90242 23881 34672 116298 150015 107795 69037 13576 -55718 -85447 -117011 -63330
12343 -63330 -101016 -105162 -90216 12921 46522 2572 -93289 -142008 -128730 -86446 -57167 -83370
12331 -83370 -40122 -8610 52265 68025 63891 27188 -126193 -116567 -49781 -107825 -80403 55774
12319 55774 141428 78506 17241 -24221 69634 99388 -53460 -78646 -109419 -134159 -142936 -139682
12307 -139682 -92083 -121302 -92336 -6624 -52794 -106692 -105952 -115977 -205270 -185664 -82677 -22857
12295 -22857 -12805 -40757 -53644 -27324 50889 69466 36635 -41217 -39644 13626 4999 -23117
12283 -23117 -21832 43193 37657 -86127 -84600 -43410 -113283 -133655 -159868 -171018 -136909 -51679
12271 -51679 -15168 59194 50044 -8430 23408 54084 30885 113654 82492 78288 82083 4883
12259D883j09175l9293j0535J8765j2754k0129L7316J09417N631O5389j6897j7601
12247A5017k1375l6223o8238k6687n6408O2725J43455L4967l5360J3171K8765
12236E3809l6595k9391p524k2070j1121L6783L8417k7514o4507K2622o545j47311
12224b00947K3546O2863p6875m0844P4405J6787p7246N1221P8320N7829L1516
12213E75J9512n1029r7496N512Q4972m1481j20643M497Q3761M2330j0297j4428
12201i4215L6819P804j5722L2542J2132j6234n4689O0551M5835l2991K6072m1116
12189c3212J7873P3140K3858q1595k4482Q7762J11528N50J7059n452j4441p2000
12177A00588j6462K9923m9476j2493N6213L1944k5918q562r504n6600j76057J2543
$$ plain form
12259 4883 -104292 -143585 -154120 -135355 -148109 -168238 -130922 -21505 -15874 49515 32618 15017
12247 15017 -6358 -42581 -110819 -137506 -193914 -131189 12266 47233 11873 25044 53809
12236 53809 17214 -12177 -19701 -41771 -52892 -16109 22308 -5206 -69713 -47091 -53636 -200947
12224 -200947 -177401 -114538 -191413 -232257 -157852 -141065 -218311 -167090 -88770 -30941 575
12213 575 20087 -30942 -128438 -122926 -37954 -79435 -200078 -195581 -111820 -69490 -79787 -94215
12201 -94215 -57396 -49592 -65314 -32772 -20640 -36874 -91563 -31012 14823 -18168 7904 -33212
12189 -33212 -15339 57801 81659 64 -24418 63344 174872 175422 192481 187029 172588 100588
12177 100588 84126 114049 64573 52080 108293 140237 114319 105757 96253 39653 -136404 -123861
12165a23861P2300L2227N0509K7230K9312k9494O7419k0268J0989M969K7466n6472
12153I2326l0008J1680L3511q210L4086l8274o0066p9455J4126J20719j2687m5282
12141C2466k4023o2465j6319N4436J23199P4267n8132M6788J50324m1606j98163
12130H0772j09777N9467L8022m5482p3431M3151j544l280J419m4503p9870P4624
12118f0432o317K9655L2853q142m5357l5301j6861j1403J3633O3716Q2478j3501
12106B5021l6572N7894k461m3520M6354J1800j6138p061j4547l8166q111j3915
12094c9422L3023K1165n6702L8614J16550o7952j0535P7959j7245k7130j4942
12083E3383L6750M5373o1157o7737m5785J5254M2352P596j0746p8978J9385P5329
$$ plain form
12165 -123861 -51561 -19334 31175 58405 87717 58223 125642 105374 116363 121332 148798 92326
12153 92326 62318 73998 107509 99299 133385 95111 35045 -44410 -30284 90435 77748 32466
12141 32466 8443 -54022 -70341 -15905 107294 181561 123429 170217 320541 278935 80772
12130 80772 -29005 30462 68484 23002 -50429 -7278 -8822 -12102 -10683 -55186 -135056 -60432
12118 -60432 -66749 -37094 -4241 -12383 -57740 -93041 -109902 -121305 -107672 -43956 38522 25021
12106 25021 -11551 46343 43882 362 46716 58516 42378 35317 20770 -17396 -25507 -39422
12094 -39422 -6399 14766 -41936 -3322 113228 45276 34741 112700 95455 68325 53383
12083 53383 90133 135506 74349 6612 -39173 -23919 18433 26029 15283 -63695 -44310 31019
12071C1019M5379L6894K5169o580M2026P2225r3892j86111J9506M1153n2593j9093
12059d4898J0222p4258J1047R1952K7679J17862l2896M4077j0278m5637M9049
12048A43921J697K7741O3945Q1523o1486m5094j6682P90k4312r3092p6703n6119
12036e3871J4833J11061M8379K2713m1865l9442p2655k3734J5266P5155J0168
12025F6008q4746r1817p740J10624M0163K447m4833p1503O2107N8233k2930Q2594
12013I8607l091p0466L5014J25612K9829k8557m4124p057j04460q8498J804P7668
12001B2281Q1129M4676O529j4381m7634J8604L597N0685J2969q4611k2563j859
11989F9422J01108L6006k725o1118j2812L78J3406j0244l5528k6181j14130L259
$$ plain form
12071 31019 76398 113292 138461 131881 173907 246132 152240 -33871 -14365 26788 -25805 -44898
12059 -44898 -34676 -108934 -97887 -5935 21744 139606 106710 150787 140509 94872 143921
12048 143921 145618 173359 237304 318827 257341 212247 195565 196355 172043 78951 2248 -53871
12036 -53871 -39038 72023 120402 143115 101250 61808 -10847 -34581 -19315 55840 66008
12025 66008 -18738 -110555 -118295 -7671 32492 34939 -9894 -81397 -19290 38943 16013 98607
12013 98607 95516 25050 60064 185676 215505 186948 142824 135767 31307 -57191 -55387 22281
12001 22281 103410 148086 154615 140234 92600 111204 114801 165486 178455 93844 71281 69422
11989 69422 170530 206536 203811 142693 129881 130259 143665 133421 97893 71712 -42418 -39159
11977c9159J04814O7861L1791M5687J29481o386J3852K9440L8306M7557r135J4184
11965D68293p4801p2581k4066K1832M5714K1542J00980Q317J4016O7214Q3875
11954F60335J45770N1105P0992K9184l6686k3038M8688J20800L9236N5321Q8442
11943A250149O3995R1000J61530J26549K04210K58015J98027K20597L18843L06914
11933C199829L85945M11057M33739M29306O37613N97041P22802J023993J350647
11924I191972J699381K092082K775594L612300M804908O607002R775390J4827461
11916E5386090K3130694L6809511N8026039Q5739138R8092180L5808057p0723262
11909C22268447r8383282p2288321m5989723k8989449j8815398j2780425r010337
$$ plain form
11977 -39159 65655 133516 165307 210994 340475 334089 347941 377381 415687 463244 454109 468293
11965 468293 393492 320911 296845 318677 364391 385933 486913 495230 509246 576460 660335
11954 660335 806105 857210 928202 957386 920700 897662 946350 1067150 1106386 1161707 1250149
11943 1250149 1314144 1405144 1566674 1693223 1897433 2155448 2353475 2574072 2892915 3199829
11933 3199829 3585774 3996831 4430570 4859876 5497489 6094530 6817332 7841325 9191972
11924 9191972 10891353 12983435 15759029 19371329 24176237 30783239 40558629 55386090
11916 55386090 78516784 115326295 173352334 259091472 357183652 392991709 322268447
11909 322268447 223885165 151596844 105607121 76617672 57802274 45021849 36011512
11902C6011512o571680m914398l693315k918843k326551j819906j585186j408906
11894A0772727j150671r71910q17629p06592n22649k96167k14060j84186j96151
11885E712712k9428J12440J37771M28675N20067P04659P78386P82045Q62980Q70958
11875A0881265P30218M92709j29550p36347j068829j111892j027135r85942q36538
11866F207959p52944p14919p27329o34312m48715k89238l50721l28238j29989
11857A831554r0545o8314j56832j38868P109o6681j45377q1904r1294k6518q478
11846I63852L2360Q429r9686j22265K0903J7987k2946m5800L3630Q4554j3483
11835H57535j4880R49p8798l4386o1636m2644J0005l9933j9020J9358K4405k6816
$$ plain form
11902 36011512 29439832 24525434 20832119 17913276 15586725 13766819 12181633 10772727
11894 10772727 9622056 8650146 7832517 7125925 6603276 6307109 6093049 5908863 5712712
11885 5712712 5683284 5795724 5933495 6362170 6882237 7586896 8365282 9147327 10010307 10881265
11875 10881265 11611483 12104192 11974642 11238295 10169466 9057574 8030439 7044497 6207959
11866 6207959 5455015 4740096 4012767 3378455 2929740 2640502 2289781 1961543 1831554
11857 1831554 1741009 1672695 1515863 1376995 1384104 1317423 1172046 1090142 998848 972330 963852
11846 963852 996212 1004641 904955 782690 803593 821580 798634 752834 786464 871018 857535
11835 857535 842655 843604 764806 730420 668784 626140 636145 596212 577192 596550 620955 594139
11823E94139p4537j0071J05561n7064j46863K1896N9239K4184p471m9167p9650
11812C80196n1674M3910J03583J1948n1836q5998q3815o2857J9282N1203O9797
11801C43739m7779L7660o056O6205l4419p2409n3941L1164J15874N5756O9864
11790E05658J5482J6915o5224K3409j3286J1575N5292m9484m0098l6873q224k2407
11778C92735j51320q9815J7612Q0249P38k5069n6530K9154k0265j06513Q2083
11767A53059J09699j2782r8949L0092J3063L0846o375q1104p5520L0215r495o0260
11755B2489L0776P5031j3147j9213l9227n1828k7K2930k3935K9764J14349M3951
11743A91913M7168k7924j1340n0707l2228O4982l8324p5685R2229N7267l6604
$$ plain form
11823 594139 519602 509531 615092 558028 411165 433061 492300 516484 509013 459846 380196
11812 380196 328522 372432 476015 487963 436127 350129 266314 203457 222739 273942 343739
11801 343739 295960 333620 327564 393769 359350 286941 233000 264164 380038 435794 505658
11790 505658 521140 538055 472831 496240 482954 494529 549821 500337 460239 423366 415142 392735
11778 392735 241415 151600 169212 249461 250199 225130 168600 197754 177489 70976 153059
11767 153059 262758 249976 151027 181119 194182 225028 218653 137549 62029 92244 82749 22489
11755 22489 53265 128296 115149 95936 56709 4881 4854 27784 3849 33613 147962 191913
11743 191913 239081 211157 199817 149110 116882 181864 143540 67855 160084 217351 180747
11732A80747l1917M717n7691K398R2228j36k6662m4033J7594J5829L8576n973
11720A85677j38687n5849Q549O6595M9081M8483J8036k5175j16437q799P3381
11709A04855M1578r13l7386m2464N4327O6407J4661j06461l0900m5973L6617J3331
11697F7679P3547M6193P467j02640r9856M767J7732P966M0381L9224n736N3338
11685A50062N8142O60p3010k7839O8042k1545j05162m9717J00526O2277m760n4117
11673A03559j3381M8087K7091P9793o3095p7870J4967M0110l9189k229Q4793K2986
11661B25622q5116p5317Q94m4199p688N5696P3432m6013k6609K3814O8629L2795
11649A95940n4116M3901k0584j14493q062R8348j7512q7069j53550L2604J06048
$$ plain form
11732 180747 148830 153547 95856 98254 190482 190346 163684 119651 137245 153074 191650 185677
11720 185677 46990 -8859 -310 66285 115366 163849 181885 156710 40273 31474 104855
11709 104855 146433 145520 108134 65670 119997 186404 201065 94604 63704 17731 54348 67679
11697 67679 141226 187419 194886 92246 -7610 -2843 14889 22855 63236 102460 96724 150062
11685 150062 208204 208864 135854 108015 176057 154512 49350 -367 100159 162436 157676 103559
11673 103559 90178 138265 165356 245149 182054 104184 119151 159261 120072 117843 202636 225622
11661 225622 140506 65189 66083 21884 14196 69892 143324 97311 70702 94516 163145 195940
11649 195940 141824 185725 165141 50648 42586 140934 123422 36353 -117197 -84593 21455
11638B1455R5536M1951j625j1483j2860L1131n2301n8017j5157k8166K2644N1397
11626H4505m8140J8410J13937P9387r5598o6304l7905o5499l4709k6790O8537
11615a0169K8184J8175M554k5900k7687L3021Q9968L0446n4803M664N0832L5486
11603A76771L4345o2408j43j7305R822p0282M7456N8898j2585K625q9034J9212
11591I7372n6946k3062O6067n0663q0057N6810J20396j2046j06437M534O2042
11580G8010K6064k0829j04461k2495P2847n6835R968N6782L7014R364M5759l8097
11568I3091K0107m2384q5009J5204N0953k7158j335K080J4564j7741K1692k5488
11556A8576j86589j2069J06543J3195l1263O3700J26291r11p6142J750k8362q131
$$ plain form
11638 21455 116991 158942 157317 145834 132974 164105 111804 53787 38630 10464 33108 84505
11626 84505 36365 54775 168712 248099 152501 86197 48292 -17207 -51916 -78706 -10169
11615 -10169 18015 36190 40744 14844 -12843 20178 110146 140592 85789 90453 141285 176771
11603 176771 211116 148708 148565 131260 141082 70800 118256 177154 164569 167194 78160 97372
11591 97372 40426 17364 83431 32768 -47289 9521 129917 117871 11434 15968 78010
11580 78010 104074 83245 -21216 -43711 29136 -27699 -17731 39051 76065 85429 131188 93091
11568 93091 113198 70814 -14195 1009 51962 24804 23469 25549 40113 22372 44064 18576
11556 18576 -168013 -180082 -73539 -60344 -91607 -27907 98384 97473 21331 23081 -5281 -13412
11544a3412M116K1980N7795J32j05436m0469l3704p4077K4059L0126P2315L5960
11532b0615r699K8559P7920L1610j4313N3233m0026L0094K2828l9322r5433o7591
11520d2755j6991n6022j9679M0249M2621j5978j3598Q9702J8697n2788P4540l210
11508D4788p6722L9802O6592O9925L5685j3361k5616p682O087J83k2265o547L0951
11495A41820l004j04538q0537K2508J6945P0205J100n6392m8784k6698j0871N2307
11483b5939J1689k5083k5120l2106r507K4174M9549L7186l7742J4311Q2668j3007
11471E1073l9404N0487J90m1841L4436L2778n6656k7506r3221l5565J00866M1525
11459A7162Q364m5687r095q0284Q9564O3269K6613N7167j0814n896m2980n0476
$$ plain form
11544 -13412 -9296 12684 70479 70611 -34825 -75294 -108998 -183075 -159016 -128890 -56575 -20615
11532 -20615 -30314 -1755 76165 107775 93462 146695 106669 136763 159591 120269 24836 -42755
11520 -42755 -59746 -115768 -135447 -95198 -52577 -68555 -82153 7549 26246 -26542 47998 44788
11508 44788 -31934 7868 74460 144385 180070 166709 141093 133411 139498 139681 117416 110869 141820
11495 141820 138816 34278 -46259 -23751 -6806 63399 64499 8107 -40677 -67375 -78246 -25939
11483 -25939 -14250 -39333 -64453 -96559 -106066 -81892 -32343 4843 -32899 -18588 64080 51073
11471 51073 11669 62156 62346 20505 54941 87719 31063 3557 -89664 -125229 -24363 17162
11459 17162 25526 -20161 -29256 -109540 -19976 43293 69906 127073 116259 110363 67383 16907
11447A6907l2548o4115l9153K6414N700J00912P1079K2009j5588N910L3875j12089
11435A9313l5342O993L3767L2024J6668K2292M2098k4086K0773p4520o3952m6648
11423e0620j208Q0368O1070o9003p9275J2725N3888N7047N4826n3452j07755p9850
11411a21239J05130M0807l2554k2748R54r2064K9088R9759M3873J4147j2985n588
11399D6580N9445n2793o5931m5188M8476j6602m8004K0778K4549M0767J14698
11388A26775K762n3248o2094r8139M5406j1094N095J5829N4962r6471m7054L7172
11376h0099J48174J1366k2088p1288o0725J2348j8356j13853m9356K5636O9022
11365a49219O5349N7170K1460m8438l1255L9625N4262P1650K1424K4886j0988
$$ plain form
11447 16907 -15641 -79756 -118909 -92495 -86795 14117 85196 107205 91617 97527 131402 19313
11435 19313 -16029 -9036 24731 56755 73423 95715 137813 113727 134500 59980 -3972 -50620
11423 -50620 -51828 28540 89610 20607 -58668 -45943 7945 64992 119818 66366 -41389 -121239
11411 -121239 -16109 24698 -7856 -30604 -29650 -121714 -92626 7133 51006 65153 52168 46580
11399 46580 106025 53232 -12699 -57887 -9411 -26013 -74017 -53239 -28690 12077 126775
11388 126775 129537 76289 14195 -83944 -38538 -49632 -44537 -28708 26254 -70217 -117271 -80099
11376 -80099 68075 79441 57353 -13935 -74660 -62312 -80668 -194521 -243877 -218241 -149219
11365 -149219 -83870 -26700 -5240 -53678 -84933 -45308 8954 80604 102028 126914 115926
11354A15926m34j3086l520m5767n9589k3901m5471R6745J03766m9643j7880k9983
11342B7163M7842N1343m7014m6565k0651J6075n9603q6831j459j2893m2138L5887
11330a38844Q2972J10279J9515m9983K6643K2359j1977k153L1127r8617j0371
11319a9050m015L7769L3419m2062j43741J5080P8554l9000j2883Q4116N2119k050
11307C8256k1505n9627J1804M3286j3694o1569K5923m6565J5441L0854N9827l8590
11295a6159p556j9867J0237M5683M3073K5631j20272l0717M5967J2544L9590l534
11283B4620n2466q9396L1559J8852m7308O2266L2407K3471m5800L3512m576J022
11271a1837j5277p430Q4656k170l7966M5062j3297R185l4328O6060L7226j17298
$$ plain form
11354 115926 115492 102406 98886 53119 -6470 -30371 -75842 20903 124669 75026 57146 27163
11342 27163 75005 126348 79334 32769 12118 28193 -31410 -118241 -119700 -132593 -174731 -138844
11330 -138844 -55872 54407 73922 23939 50582 72941 60964 58811 89938 -8679 -19050
11319 -19050 -23065 14704 48123 6061 -137680 -122600 -44046 -83046 -95929 -11813 40306 38256
11307 38256 16751 -42876 -31072 12214 -1480 -63049 -37126 -83691 -68250 -37396 22431 -16159
11295 -16159 -23715 -43582 -33345 12338 55411 81042 -39230 -69947 -23980 -11436 28154 24620
11283 24620 -27846 -117242 -85683 -66831 -114139 -51873 -19466 4005 -41795 -8283 -12859 -11837
11271 -11837 -27114 -34544 50112 47942 9976 55038 41741 50926 16598 82658 119884 2586
11259B586n0790k2462J539J06463m5274o1666M7854N242m1787N319O2372J20325
11247A29721M1722n9301n5710l6991J4934n3543n8906J904R5883K9929k0860p6219
11235d7437K0538K7343l8685l4472J0883k5311L2977L9939j3730M6894k8979J1962
11223A922j2190J6639l7000K8920K6920J5551m0987q1202m7177J20337O5138p3337
11211a6466l0937n336j0053O2101K0689m121j5479p661N2585J4505k1974j4865
11199B2988K5021l057m3381L9295j4891j8687M3030L2620m9561L6908K8177K7960
11187A26422k3760q0490j16714m1884K8496M8685n6009N6661L1732o6495K7807
11176f5549l146R4741N2611q0651q3400P8458M1604l0810k625L2613k8864M5149
$$ plain form
11259 2586 -48204 -70666 -69127 37336 -7938 -69604 -21750 -16508 -58295 -52976 9396 129721
11247 129721 171443 112142 56432 19441 34375 -19168 -78074 -76170 19713 49642 28782 -47437
11235 -47437 -26899 444 -38241 -72713 -61830 -87141 -54164 -14225 -27955 18939 -10040 1922
11223 1922 -10268 6371 -30629 -1709 25211 40762 -225 -81427 -128604 -8267 56871 -16466
11211 -16466 -47403 -52739 -62792 -691 19998 15877 398 -7263 45322 59827 37853 22988
11199 22988 48009 44952 1571 40866 25975 7288 50318 82938 33377 70285 98462 126422
11187 126422 102662 22172 -94542 -136426 -107930 -59245 -115254 -58593 -26861 -93356 -65549
11176 -65549 -68695 26046 78657 -1994 -85394 -6936 34668 3858 1233 33846 4982 50131
11164E0131J8890j8277m8502K7802k921J584j0091R726j6185K1860j8033J7212
11152C3196J13405K7124M0857j6486p1684l9536j19341J1876n836l4126K0624
11141c9927o5220M7200l0166J19699L2387m5857j6122M1048P2466l245p9344q6473
11129e3554J03200R0424q6066L3090n9433r7769R1922J8311n896o1731m9009Q794
11117f7717l772K6737P8738M3608m6997q4582l6399j5353L8540P0175P8379O4675
11105A46032M4272j6136o6679l6908K5509l7793p785r7721o0617M9947M4355l952
11093a7476M4302n7176m8635K1422J0882J4376j4114j9130K1858l6864m2693q141
11081a31389K3679O8547M4235K5956N577o362K5901m1633O8752M4387j48585n1707
$$ plain form
11164 50131 69021 50744 2242 30044 27123 28707 18616 28342 12157 34017 15984 33196
11152 33196 146601 173725 214582 198096 126412 86876 -32465 -20589 -26425 -60551 -39927
11141 -39927 -105147 -57947 -88113 31586 63973 18116 1994 43042 115508 112263 32919 -53554
11129 -53554 49646 140070 54004 87094 27661 -70108 21814 40125 34229 -27502 -76511 -67717
11117 -67717 -71489 -44752 33986 77594 30597 -53985 -90384 -105737 -67197 2978 81357 146032
11105 146032 190304 174168 107489 70581 96090 58297 50512 -47209 -107826 -57879 -13524 -17476
11093 -17476 26826 -30350 -78985 -57563 -46681 -32305 -46419 -65549 -43691 -80555 -123248 -131389
11081 -131389 -107710 -39163 5072 31028 36605 30243 56144 14511 83263 127650 -20935 -72642
11069g2642J8555O255k970O5431r720L1811o0488n5577k2330J01763J34357j6936
11057A17509n2377k8085r1328L3241J18918O2085J0771J5427N51J12783P3784
11046C73279k1985L7977Q2978p249J8728k527l2272q1778n2382J10408R4142L0858
11034E50177J44743K05570J36281l6167j01087j35874p5030N296p4452O2158Q5482
11023G67097K10525L03648J03995k4286o4426j56193j22395o1595j9366j05518
11013H31486j07966J2598J59833K04495l6135j12003j04767j72147j77081j27357
11003C70956l493M8866L1591p076J4312P38J1421k5462l0936j35095l2938K7945
10991B70829r3539q0197r743K876k6759j3346K5722k2797O7788o808j20252o2087
$$ plain form
11069 -72642 -54087 -47832 -50802 14629 4909 36720 -23768 -79345 -101675 88 134445 117509
11057 117509 65132 37047 -54281 -21040 97878 159963 170734 186161 186712 299495 373279
11046 373279 351294 389271 472249 465000 483728 481201 448929 367151 314769 425177 519319 550177
11034 550177 694920 900490 1036771 1000604 899517 763643 688613 693909 619457 681615 767097
11023 767097 977622 1281270 1385265 1360979 1296553 1140360 1017965 956370 937004 831486
11013 831486 723520 736118 895951 1100446 1064311 952308 847541 675394 498313 370956
11003 370956 367463 416329 447920 440844 455156 455894 467315 441853 410917 275822 242884 270829
10991 270829 177290 97093 87350 90226 63467 50121 75843 53046 120834 114026 -6226 -68313
10979f8313J0773K7545k9589N2661R652L262J021p745N2346p1607K6805L1450
10967C8261o0039j06142k9340N8104Q4308N150p145k7144P4280p77k6272k9338
10955b6094M1284P4898l0440k733m781R871p9103q320q071j02645K7787K0103
10943h8244j8861j3803O8070N4227j3103j7121l1305n1013L0316l6774k6900O9179
10931g5332Q3861K523J18041N3655m9302q7654j8584J7039m5541j4680p261L9059
10919A5824N2929n0394K1780o5576O7112L009O0313m7048k6206l1241n2240m2792
10907i4530K9022K0672K4381j3344k3469j352M6489r6824p3586L1492l0255p558
10895a88862N0096M8576K2890J3854l045M8560K5328l9075J9610M4332o5000N4249
$$ plain form
10979 -68313 -57540 -29995 -59584 -6923 2729 5991 7012 -733 51613 -19994 6811 38261
10967 38261 -21778 -127920 -157260 -99156 -14848 -9698 -16843 -43987 30293 29516 3244 -26094
10955 -26094 15190 90088 59648 56915 52134 62005 -17098 -25418 -33489 -136134 -108347 -88244
10943 -88244 -107105 -120908 -52838 1389 -11714 -28835 -60140 -111153 -80837 -117611 -144511 -75332
10931 -75332 8529 11052 129093 182748 133446 45792 27208 44247 -1294 -15974 -23235 15824
10919 15824 68753 18359 40139 -25437 41675 44684 104997 57949 31743 502 -51738 -94530
10907 -94530 -65508 -44836 -20455 -33799 -57268 -58620 -12131 -108955 -182541 -151049 -181304 -188862
10895 -188862 -138766 -90190 -67300 -53446 -56491 -7931 17397 -21678 -2068 42264 -22736 31513
10883C1513P8491J4448o7418q1260R0924L2528k7479p6547J0942M1205P0110K4350
10871A41807K1255r9281r2391K6647k6327m1502N6085K6762j2758Q077K1949M4341
10859G4664P6041N3524n702N6498j2466n4421l4276n1472K4248o9444q4426J8122
10847i110N6255n680k8930J8587K8740n7178L98N9464L8565J0418p0474N0076
10835I1131j3918n2205k9682M6343o0846J8053j5399K4216n477k1766J3584P307
10823A341J2370k3590J4312p0607j6455o3459K4933j7099J059J06842Q2812l5818
10811A6641m8141l1133o453J3498K1205k1260j5510k3747L731J07456J7825n6737
10799b2625R996J9586m7244n157j1143R5072k4050k580R706p4994j17836j2466
$$ plain form
10883 31513 110004 124452 57034 -24226 66698 99226 71747 -4800 6142 47347 117457 141807
10871 141807 163062 63781 -28610 -1963 -28290 -69792 -13707 13055 297 8374 30323 74664
10859 74664 150705 204229 198527 255025 242559 188138 153862 102390 126638 57194 -27232 -9110
10847 -9110 47145 41465 12535 31122 59862 2684 3082 62546 101111 111529 41055 91131
10835 91131 77213 25008 -4674 41669 -19177 -1124 -16523 7693 2216 -19550 -5966 1341
10823 1341 13711 -9879 4433 -66174 -82629 -146088 -121155 -138254 -137195 -30353 52459 16641
10811 16641 -31500 -62633 -69086 -55588 -34383 -55643 -71153 -94900 -91169 16287 34112 -22625
10799 -22625 -12629 6957 -40287 -45444 -56587 38485 14435 11855 21561 -53433 -171269 -183735
10787a83735O7545J8984M7004M7274l0381l3001o4215n6905l466O4290N5565L8804
10775c2237J7671J6321L1401j7772l9352O8086J5377K3189l1235l0664k1941J453
10763B97l4691l1999L1391Q3569M0936m1192r5795J36492M1940p5808l4145N7826
10751G8821m7701n7605j1846N1019P8001P5597L7145j3691k3478p4096m0383M3650
10739I5433M8176O0658N5699p6330p0457K5913J06692k4368J1953L7064n3961
10728B16472o6450M0224M3021o1365p2882N1874P9778k7283q9657j8517k2145
10717G3070l9020k8864J03K0070Q3481j4689j7800p0964p0912L1553R969J02407
10705G8404j4353o3071m556R1872J5699j16900n7578J5613J4114j014j0748j6086
$$ plain form
10787 -183735 -116190 -97206 -50202 -2928 -33309 -66310 -130525 -187430 -190896 -126606 -71041 -32237
10775 -32237 -14566 1755 33156 15384 -23968 44118 59495 82684 51449 20785 -1156 297
10763 297 -34394 -66393 -35002 48567 89503 48311 -47484 89008 130948 55140 20995 78821
10751 78821 31120 -26485 -38331 12688 90689 166286 203431 189740 166262 92166 51783 95433
10739 95433 143609 204267 259966 183636 113179 139092 245784 221416 233369 270433 216472
10728 216472 150022 190246 233267 171902 99020 150894 230672 203389 113732 95215 73070
10717 73070 34050 5186 5289 25359 108840 94151 76351 5387 -65525 -33972 -24003 78404
10705 78404 64051 980 -3576 88296 103995 -12905 -70483 -54870 -40756 -41770 -52518 -68604
10693f8604q603L681Q22N5065J3500p6600n6031L44r504R7129K8165o6723j3828
10680a01187o793k745J7057J41521J9400n3124j5401n275j2279j12579L7008P2594
10668b1803J0953J8047P1706L6096j9085n1949k040J5222L1934k1753l6270r001
10656B2057J4887O3118K9533L0875p00O3927M0012L8436J85673M9295O7166L1619
10644F35898j21821J8730N8368Q9961Q7823J15221J77120J59082J80866J15505
10634A516753J56195M11079N30197N26666L29575K83092K95531L55634N71747
10625D976469P16500J040180J359560K032135K838730L963582N484152P390318
10617B9801626R921606J2461964J3017162R391923K258964l841216n793953m426456
$$ plain form
10693 -68604 -77207 -73526 -72704 -17639 -4139 -80739 -136770 -136426 -145930 -48801 -20636 -87359 -101187
10680 -101187 -107980 -110725 -93668 47853 67253 14129 -1272 -6547 -18826 -131405 -94397 -21803
10668 -21803 -10850 7197 78903 114999 95914 43965 41925 57147 89081 67328 31058 22057
10656 22057 36944 100062 129595 160470 159770 223697 263709 302145 487818 537113 604279 635898
10644 635898 514077 532807 591175 681136 768959 884180 1061300 1220382 1401248 1516753
10634 1516753 1672948 2084027 2614224 3140890 3470465 3753557 4049088 4404722 4976469
10625 4976469 5692969 6733149 8092709 10124844 12963574 16927156 22411308 29801626
10617 29801626 39723232 52185196 65202358 74594281 76853245 73012029 67218076 62791620
10609F2791620j320220K598980P338229J2992435J9689650K6033838K7232872
10602A57357404J6533170l141377j7257730j9425451j4449389p203471L64108
10595A12777264Q355125J7291828K6843667L4460186L3304978J4774656j4770333
10588B33037371l3155392l3667355k5817857j6572677q005709n6694P604034J4767450
10580A38133171J9504737J7010357K878227j6476856k7044229k5806090j9333840
10573H8865477j2594635o999079k386479J392884M247871N581089L575264k321764
10565G9360628r439645j3033425j2480024j0116291p538206n475335l995357k837671
10557A4444674k060929j696116j278934r09947q81902p20226o06558n52164n34453
$$ plain form
10609 62791620 61471400 64070380 71408609 84401044 104090694 130124532 157357404
10602 157357404 173890574 170749197 153491467 134066016 119616627 112413156 112777264
10595 112777264 121132389 138424217 165267884 199728070 233033048 247807704 233037371
10588 233037371 199881979 166214624 140396767 123824090 115818381 115761687 123365721 138133171
10580 138133171 157637908 174648265 177526492 161049636 134005407 108199317 88865477
10573 88865477 76270842 69271763 66885284 68278168 72526039 78107128 81682392 79360628
10565 79360628 69920983 56887558 44407534 34291243 26753037 21277702 17282345 14444674
10557 14444674 12383745 10687629 9408695 8498748 7616846 6896620 6290062 5737898 5203445
10548E203445m66322m00771l56047k26030j89863k51754k49560j58287p1136r7789
10538B735886j13570j09917j63520m5352j04002j26142j15317j72806m3608k7626
10528A714026k6930j17841r6302J23N4367Q5139q3756j0835n2865o1353n236p6419
10516A322118q7346j0934l4032K1592r7813r6092O045m0072L1247K2018p4081
10505I62650j33636J5733J2678J0462M5887m6638j04895l4777j0380N0844J2854
10494G80782j14947m1224N8596J4956J9401K3695P5057p778N6037l0337j22659
10483G11579p3128l8226O2637n9837q8290J3372R1694K5292k7138J6130l7860
10472E96225l566O9319P5017m6735l4553P5267J0530l9996o3777N146n2625j01739
$$ plain form
10548 5203445 4737123 4336352 3980305 3754275 3564412 3312658 3063098 2904811 2833675 2735886
10538 2735886 2622316 2512399 2348879 2303527 2199525 2073383 1958066 1785260 1741652 1714026
10528 1714026 1687096 1569255 1472953 1473076 1527443 1612582 1528826 1517991 1465126 1403773 1398537 1322118
10516 1322118 1234772 1223838 1189806 1211398 1113585 1017493 1023538 983466 1014713 1036731 962650
10505 962650 829014 844747 857425 867887 913774 867136 762241 727464 717084 767928 780782
10494 780782 665835 624611 683207 698163 717564 741259 816316 808538 864575 834238 711579
10483 711579 638451 600225 662862 603025 514735 528107 619801 645093 617955 634085 596225
10472 596225 592659 661978 736995 690260 655707 730974 741504 701508 637731 642877 590252 488513
10460D88513p6686Q5918o472p794J5786K6466m065n2657m5555L0083n1673k2140
10448C79724J8226j5060p690k7048n6052L2190M0969J9297r3519k1910r74q5018
10436A83135o3811M0173J1324N3518m9727n2154M6778P6867J2051O2326j2759
10425C07721j25485j7109K5504n5227q273L445p728j7522m7536O6849Q649j2397
10413A20891K3342K2641M3565q2760J2238M4379N7470m5610l6438m109J2367J2993
10401A80969N509j0123J3656M5579m2506l9282Q8851J17577M3878j07171k6836
10390B70101l6268J8870J2915K4328P992k2524K2780M4991M2189r897k6926q0734
10378B67817L691L8533m072K6183k4701l2435R025k9173L2461k4527m6040L3428
$$ plain form
10460 488513 411827 497745 491273 483479 499265 525731 521666 469009 423454 453537 401864 379724
10448 379724 397950 382890 375200 348152 292100 324290 365259 384556 291037 269127 268153 183135
10436 183135 119324 159497 170821 224339 174612 122458 169236 246103 258154 320480 307721
10425 307721 182236 165127 190631 135404 127131 130576 122848 105326 57790 124639 133288 120891
10413 120891 144233 166874 210439 127679 139917 184296 241766 196156 159718 155609 167976 180969
10401 180969 186478 176355 190011 235590 193084 153802 242653 360230 404108 296937 270101
10390 270101 233833 252703 265618 289946 297938 275414 298194 343185 385374 375477 348551 267817
10378 267817 271508 310041 305969 332152 307451 275016 284041 254868 287329 262802 216762 250190
10366B50190L3543P503q5482o3209N5808M3924J20593R8040n852j33851n4157
10355B67050m2246p2184k2694L9011J987p3755j3106M6285l9938q3206K0773j29
10343B7848Q7426Q0051K9908j6579q2870j01414j4443J01488O8417L0418K4563
10332B34813K9853j40251l6263L0970O3733J4264o0195m1217M7631k5673j5933
10321A01732m1303M5565P6540K83n1872m8591m0662P542N6471P2529n7219K1158
10309A42173l4855K699N9990j04091k8403L5141Q8411P3290l4185o7917p0246
10298F2007P725o6729J5594P5715J10045O9929K9373l2217o4345q5048j00147
10287B1902l4678O6079N6796O8723j9496K1044M5993L5024L0287j18871n5503
$$ plain form
10366 250190 283733 291236 205754 142545 198353 242277 362870 460910 455058 321207 267050
10355 267050 224804 152620 129926 168937 170924 97169 84063 130348 90410 7204 27977 27848
10343 27848 115274 195325 225233 208654 125784 24370 9927 111415 179832 210250 234813
10332 234813 264666 124415 88152 119122 182855 197119 136924 95707 143338 117665 101732
10321 101732 60429 105994 182534 182817 130945 82354 41692 49234 105705 178234 121015 142173
10309 142173 107318 110017 170007 65916 37513 72654 161065 234355 200170 132253 62007
10298 62007 69732 3003 18597 94312 204357 274286 303659 271442 207097 122049 21902
10287 21902 -12776 53303 110099 178822 159326 180370 226363 261387 291674 172803 117300
10276A17300J48815J72068J96221N3722J33433J94145J79188J11768j1671j14352
10266A180637r1149j04797n4888o9334m9440j83263j83408j29753j55211n888
10256A53506k8147m2917K2901N8414N7743o802q6962j38991m2919Q5646J20268
10245A51740Q0557j11659k7893k8413K29L7330N465k3221n2988J203k7415n1770
10233d6835J3946q2277N0610J06205N2305L1288J0276q7560Q5572K9792l9812
10222A23510m8662n6881n9834P2263J7278j6842M725J7506L629O2308j0620K5544
10210A33924m9280j24313o7168J70311M9463P125l809j4651Q3754O820k0674o870
10198A64632L7458M3586j0304p2652R226n6250j32182n0284J9593o753n6584J07734
$$ plain form
10276 117300 266115 438183 634404 688126 821559 1015704 1194892 1306660 1294989 1180637
10266 1180637 1089488 984691 929803 860469 811029 627766 444358 314605 159394 153506
10256 153506 125359 82442 105343 163757 221500 214698 127736 -11255 -54174 31472 151740
10245 151740 232297 120638 92745 64332 64561 101891 107356 84135 31147 32350 4935 -46835
10233 -46835 -32889 -115166 -64556 41649 93954 125242 135518 47958 133530 163322 123510
10222 123510 74848 17967 -41867 30396 47674 30832 35557 53063 56692 119000 108380 133924
10210 133924 84644 -39669 -106837 63474 112937 120062 116253 101602 185356 192176 171502 164632
10198 164632 202090 245676 235372 162720 171946 115696 -16486 -66770 -47177 -53930 -110514 -2780
10186b780J12572K0022k1371j1767Q6640O5079j8377M7119J61542J00899K4215
10175E63793r6983r4945o0388o108N8453Q7917J1412R9316K47296K25420R0547
10164A125730k4701j60006j90825j9913j0402J17657K6841J85595K08122J46914
10154A405012J65298j7232k26470k37325j48462j20929j0282l9801q5751L2980
10144G17038Q0387J55702Q5267m9021j29157o8700j47395r0320K8256K8189j6721
10133E93525J1246m2369L7282R3060n1684o5801p0943j01059r6756q6430J9289
10122B39360n2448n5411L4862p5492k3477j3134l5555k2593l2042L1177J05347
10111A00594J8922O3582J4063r8075k3298M6864q361n6662n1559L3878r066r916
$$ plain form
10186 -2780 109792 129814 108443 96676 183316 248395 230018 277137 438679 539578 563793
10175 563793 466810 371865 311477 305369 363822 451739 463151 562467 809763 1035183 1125730
10164 1125730 1101029 941023 750198 730285 719883 837540 864381 1049976 1258098 1405012
10154 1405012 1570310 1553078 1326608 1089283 940821 819892 809610 769809 684058 717038
10144 717038 797425 953127 1038394 989373 860216 791516 644121 553801 582057 610246 593525
10133 593525 604771 562402 599684 692744 641060 575259 504316 403257 306501 220071 239360
10122 239360 186912 131501 166363 90871 67394 54260 18705 -3888 -35930 -4753 100594
10111 100594 119516 183098 197161 99086 75788 122652 114291 57629 6070 39948 30882 20966
10099B0966k5236K183K7181L8878K0882M7977j4290k0292j7673N4394J6904m6481
10087A05393l9899Q1173M3926J9593j18622m7035l2978Q22N3574K5533K1398O1600
10075A74478j25770j6876K4274L4731l405L3264j4165q5017K4108K7650r0487
10064a7215j6664J875M2597M751j3000J5880l5535n6973N7357K2027m2975l1869
10052f9744q535m6838K6003M9882O5633j520K5012n722N3441l8588J7437j1044
10040E5417j23174m504P3939L9902o667l9021m4645R926L4866J05430O1829n0912
10028A12386L5r4557p555o5556k8859l1679R0433J9610M2610Q7241L3379l5779
10016A21709O1039m5213o7203j4563o3825m6826q237P8675K4688n0904p7141m4683
$$ plain form
10099 20966 -4270 -2087 25094 63972 84854 132831 118541 98249 80576 134970 151874 105393
10087 105393 65494 146667 190593 210186 91564 44529 11551 12373 65947 91480 112878 174478
10075 174478 48708 31832 56106 90837 87432 120696 106531 21514 45622 73272 -17215
10064 -17215 -33879 -32004 10593 15344 2344 18224 -17311 -74284 -16927 5100 -37875 -69744
10052 -69744 -78279 -125117 -99114 -49232 16401 14881 39893 34171 87612 49024 66461 55417
10040 55417 -67757 -72261 1678 41580 34913 -4108 -48753 -38827 -3961 101469 163298 112386
10028 112386 112421 17864 10309 -55247 -84106 -115785 -25352 -5742 36868 124109 157488 121709
10016 121709 182748 137535 70332 55769 -8056 -54882 -63119 15556 40244 -10660 -87801 -132484
10004a32484M0476L465j07456l4633J58106K5724k7106P1434K4057J7894r1051
9993e1574k260Q593M8833K1643k0638r770J6191k9442P9906K2101l7858l0071
9981A5654L7273o9048n0474k5742o298O7411N8476M3374n384J6646m2216K0004
9969E9676k9475M542J3666p8908K3052j5110m8765n0251J0698L595J85j0244M1010
9956g6329N1565j2421k3748L565K6608M2008n477N3746J15791j2753m8974j17821
9944d240n3324K4852m6237n1838M7027M1237J2843N3605l0367m3915m9918J0271
9932i0004R4291K13813K60128q8087r6463j39176o4183P2874j3539o7123r3477
9921a0946k9857k0641p6203P3216Q2638O5437p5088q0895N1716R8805l5216p6136
$$ plain form
10004 -132484 -92008 -88543 -195999 -230632 -72526 -46802 -73908 -2474 21583 39477 -51574
9993 -51574 -53834 -45241 3592 25235 4597 -5173 11018 -18424 61482 83583 45725 15654
9981 15654 52927 -16121 -66595 -92337 -98635 -31224 27252 70626 65242 81888 39672 59676
9969 59676 30201 34743 48409 -30499 -7447 -22557 -71322 -121573 -110875 -107280 -107095 -117339 -76329
9956 -76329 -24764 -37185 -60933 -57368 -30760 11248 5771 59517 175308 162555 113581 -4240
9944 -4240 -57564 -32712 -78949 -130787 -83760 -42523 -29680 23925 -6442 -50357 -100275 -90004
9932 -90004 4287 218100 478228 390141 293678 154502 90319 163193 149654 82531 -10946
9921 -10946 -40803 -61444 -137647 -64431 18207 83644 8556 -72339 -20623 78182 42966 -33170
9909c3170n9425R1734Q2763L6865m8751m0245O158k4316j1833j0692k4283O5298
9897C0103R7818k406m2947j13760M9029K1080k2120k2378l9339L0249O7899M8033
9885A01261q0755k2965Q1803Q4487L2256r2290J0874L1342K4839n4022j34385
9874a7555j29177N0241J20855K5618J993O4408P565j5779Q10l0643m7163k7068
9862D105J8636j0027n6333o0652l0607o029O5059M9063K794P7121j9241r1876
9850e7987r445J902J907o316Q8142n937j604J8940n8506J7768m7256o13Q3949
9837B4944o0416O353J05166l8079j8873L8488O417k4921m8717r3302K9141j8480
9825i2279L7447J1226m562M6875O8379J0985k8596q7899o3117K3884L9964J8671
$$ plain form
9909 -33170 -92595 -861 81902 118767 70016 29771 35929 11613 -220 -10912 -35195 30103
9897 30103 127921 125515 82568 -31192 17837 38917 16797 -5581 -44920 -14671 53228 101261
9885 101261 20506 -2459 79344 163831 196087 103797 114671 146013 170852 116830 -17555
9874 -17555 -146732 -96491 24364 49982 51975 116383 123948 108169 108979 78336 31173 4105
9862 4105 22741 12714 -43619 -104271 -134878 -140907 -75848 -26785 -23991 53130 33889 -57987
9850 -57987 -67432 -65530 -63623 -69939 18203 12266 10662 29602 -28904 -11136 -58392 -59005 24944
9837 24944 -35472 -29119 76047 37968 19095 57583 64000 39079 -9638 -102940 -73799 -92279
9825 -92279 -54832 -43606 -48168 -1293 67086 78071 49475 -38424 -101541 -77657 -37693 -19022
9813a9022L5699N2690q4652q5095K0501J22918l645j2191N0069J11853R863n5757
9801A43231r6147q7953P107L1537k7964o9938L9413L9538J06657J21125l5098
9790A71508m7333l726l1798l0095l2317L4963k7165K0455j4773j3282k9690J7367
9778A4114j5861R0625L5925j274j30914p7641j1832L7762M9463L2148J09388j1285
9766A20618o9853k5364L4242k0243n0793K7018N432L2779J456m8991J14011m2414
9754G7898j29870j9935N2632j7230K4916L9022r2166K7014O8280M6032o2603p8477
9742f4487K0038J5877J9209k4646p8329Q5498Q4208q2033q7489O5735N1011j7933
9730a3341l0008R5818l7193L3219M4758K3070p3507m7238J7155l9468j249N0716
$$ plain form
9813 -19022 16677 69367 -15285 -100380 -79879 43039 39394 27203 77272 189125 198988 143231
9801 143231 47084 -40869 -33762 -2225 -30189 -100127 -60714 -21176 85481 206606 171508
9790 171508 124175 120449 88651 58556 26239 61202 34037 54492 39719 26437 -3253 14114
9778 14114 -1747 88878 124803 123529 -7385 -85026 -96858 -59096 -9633 22515 131903 120618
9766 120618 50765 25401 59643 39400 -11393 15625 21057 53836 55292 6301 120312 77898
9754 77898 -51972 -71907 -19275 -36505 -11589 27433 -64733 -37719 30561 76593 13990 -64487
9742 -64487 -44449 -28572 -9363 -34009 -112338 -26840 57368 -24665 -112154 -46419 4592 -13341
9730 -13341 -43349 52469 15276 48495 93253 116323 42816 -4422 12733 -26735 -27984 22732
9718B2732P1870L3207J5388P382j52193p0985k4286p259M5897k1639k5433l2753
9706a38072O466O6939R6732M3837j9838k2411K4302l282O6443L9690p2484k7990
9694F0332n370j25274q3942O837N0484K6198k7527m1044K2148J7573M7528N2467
9682D10J537o3173J0095K8245J167R3496M4093O76k9703J0389m6456q7037j9656
9669e5917O2614l1551l5139M6296m3385j6588L9958L5011k8748O7025L6210o0508
9657A5278p3063M6834p9657j1754j063K9477M0681k2634p0220J5963N107K5587
9645g9464L1025N2883O733P911l0147k8604j06844K3908Q2722k4000M0569Q13
9633b2495K5031n3053k4562j6071M3402R3721P5186J243J5749k8439j8348n7842
$$ plain form
9718 22732 94602 127809 143197 150579 -1614 -72599 -96885 -104144 -58247 -79886 -105319 -138072
9706 -138072 -131606 -64667 32065 75902 56064 33653 57955 54673 121116 160806 88322 60332
9694 60332 54962 -70312 -154254 -147417 -96933 -70735 -98262 -139306 -117158 -99585 -52057 410
9682 410 1947 -61226 -51131 -22886 -21719 71777 115870 116546 86843 97232 50776 -36261 -55917
9669 -55917 6697 -24854 -59993 -13697 -57082 -73670 -33712 1299 -27449 39576 75786 15278
9657 15278 -57785 -10951 -90608 -102362 -103425 -73948 -33267 -55901 -126121 -110158 -105051 -79464
9645 -79464 -48439 4444 11177 19088 -11059 -39663 -146507 -122599 -39877 -63877 -23308 -22495
9633 -22495 2536 -50517 -75079 -91150 -47748 45973 121159 122402 138151 109712 91364 33522
9621C3522P475J9096r497j4160j4810n383o0560M4906P4837K703K1582J1510j3994
9608I7227o830n1969p3254P7758o3654l1352M246O214O1597R754p8803K9538N9380
9595C9852J9128p55J7207l4199J2107J0044j52864L2868K9610k7705O2127N9122
9583F6542j04716k2815P8091N9994j18060n0092k9625n3203n4519K3546N5951
9572a48906O1122Q9820k2259m9083J23k6443j2467m933K1483q61K8720o037j5994
9559h5715M1036l6184q0401N3101M2185J0558l514K5240M1959P079m7273j2394
9547d4323l762M467o7126L6983j5525J9696R393k1976r272J23542M779K7561M9099
9534A13536j27618p7717N6522Q1729M2313o8171p9944K1334L6091J25714l2455
$$ plain form
9621 33522 40997 60093 50596 36436 21626 16243 -44317 589 75426 78129 99711 111221 97227
9608 97227 90397 38428 -34826 42932 -20722 -52074 -47828 -41614 19983 29737 -49066 -19528 39852
9595 39852 58980 58225 75432 41233 53340 63384 -89480 -56612 -27002 -54707 7420 66542
9583 66542 -38174 -60989 17102 77096 -40964 -91056 -120681 -173884 -228403 -204857 -148906
9572 -148906 -87784 2036 -20223 -69306 -69183 -95626 -108093 -113026 -91543 -92404 -63684 -69721 -85715
9559 -85715 -44679 -80863 -161264 -108163 -65978 -55420 -58934 -33694 8265 15344 -31929 -44323
9547 -44323 -48085 -43618 -110744 -73761 -89286 -69590 -60197 -82173 -91445 32097 36876 64437 113536
9534 113536 -14082 -91799 -35277 46452 88765 20594 -59350 -38016 -1925 123789 91334
9523I1334l6895p8780l1571J9571K5732P3175J22183l0067L7954m1907j8773k2936
9511A09020o8842p1966n0607J367M0434K1267N4880k8565j5640j8975l2063O6156
9499F466M8256k9274l3759L6005n7298j8370k1267M2152j3542o3897j7697K4066
9487i8159N6484o782j8196M753N2022M0892r1907p2548l0515J8929K6867J7558
9475a00602P1827J6493l1309P3309l0843L5417M4382k2157O2143K5783r7460k8788
9463A8195O1245J5561q4526q2436M2591K9877m0042j4821N8280L5435M0285M325
9451H3969J8746O4097k5746m105k2594q2126k9010P0561M8560j4508l8993j8406
9439E0445J7851O2422N697k2101k2175J2114l9874K7917R7412P2559l8318j06438
$$ plain form
9523 91334 54439 -24341 -55912 -36341 -10609 62566 184749 154682 192636 150729 131956 109020
9511 109020 40178 -31788 -82395 -81028 -40594 -19327 35553 6988 -8652 -27627 -59690 6466
9499 6466 54722 25448 -8311 27694 -29604 -47974 -69241 -27089 -40631 -104528 -122225 -98159
9487 -98159 -41675 -48457 -66653 -61900 -9878 31014 -60893 -133441 -163956 -145027 -118160 -100602
9475 -100602 -28775 -12282 -43591 29718 -1125 34292 78674 56517 118660 144443 46983 18195
9463 18195 79440 95001 10475 -71961 -29370 507 -39535 -54356 3924 39359 79644 83969
9451 83969 102715 166812 141066 136961 114367 32241 3231 73792 122352 107844 68851 50445
9439 50445 68296 130718 136415 114314 92139 104253 64379 92296 189708 262267 223949 117511
9427A17511m3253p4646N4384K0729k0545J1807J7544j6732p018j273N1008J2366
9415A21882m6452l3440k5904k907O7798L4194o053J4071m5310k6932L6697p9461
9403H183j02219n1260J0066R9901q493J9709R7036O1149l220j48449M2416N5150
9391G9969k479o3199K8242K3859j2404r7714j35461P5053J06448J8188n2532n29
9379c2559P3802J2921j099K4059j4636L0675q816j4105L5933n543R140j8074k57
9366I1441K8121k8969n8066p7259o8118k724O0506K6373p2230N3419k7214J8999
9354e5721K4226K3983K0118M849K5724K4205J5891j2462j7855N7774k6093l0262
9342E4377n36L470j26565K8955O7379m7959L0941P1587O6985K4940n8990q4821
$$ plain form
9427 117511 74258 -388 53996 74725 54180 65987 83531 66799 59781 58508 109516 121882
9415 121882 75430 41990 16086 13179 80977 115171 109118 123189 77879 50947 87644 8183
9403 8183 -94036 -145296 -135230 -35329 -43822 -24113 72923 134072 130852 -17597 24819 79969
9391 79969 77490 14291 42533 66392 53988 -43726 -179187 -104134 2314 20502 -32030 -32559
9379 -32559 41243 54164 53065 77124 62488 93163 84347 70242 106175 100632 109772 91698 91441
9366 91441 119562 90593 32527 -44732 -112850 -115574 -55068 -28695 -100925 -47506 -74720 -55721
9354 -55721 -31495 -7512 12606 17455 43179 67384 83275 70813 52958 110732 84639 54377
9342 54377 53841 57311 -69254 -40299 27080 -20879 10062 81649 148634 173574 114584 29763
9330B9763l6407Q2642K4699r2412p5480P8384Q3171k0568Q3971N4088j1454q3931
9318A16466j44126r366K7518p9264l0201N6437K6511L8870L8086M2089k8922j07307
9306e3209P860R5808j9121o5399j6197l1448k4341K6741J33922J10626K012k7532
9294A39722p2507j9925q5167n0715J3766J8256K8990R4301L982m5645r1828o3372
9282a30142O808J07408J3473l4942J5968K0552q412M596N3817p636j0668K8065
9270E8887R393k9070j7313N7804l2430j3436K399k5196j5044J5101o5395J7744
9258c6556j105p440j3258r599J2392N068n5641j7536L6877Q2014L1331O334p7597
9245d4716l861O519m1482K0117n6875l8974L3712k1178J25731P9046o949l866
$$ plain form
9330 29763 -6644 75998 100697 8285 -67195 11189 94360 73792 157763 211851 200397 116466
9318 116466 -27660 -37026 -9508 -88772 -118973 -62536 -36025 2845 40931 83020 54098 -53209
9306 -53209 -45349 50459 31338 -34061 -50258 -81706 -106047 -79306 54616 165242 167254 139722
9294 139722 67215 47290 -37877 -88592 -74826 -56570 -27580 66721 70703 25058 -66770 -130142
9282 -130142 -123334 -15926 -2453 -37395 -21427 -875 -9287 -4691 49126 41490 30822 58887
9270 58887 68280 39210 21897 79701 47271 33835 36234 11038 -4006 11095 -54300 -36556
9258 -36556 -37661 -45101 -58359 -67958 -55566 -50498 -106139 -123675 -86798 -4784 26547 32881 -44716
9245 -44716 -48577 -42058 -83540 -63423 -120298 -159272 -125560 -146738 -21007 58039 51090 47224
9233D7224K1705J2292j9391J6220P1645j29259j22398J7464O9703O1830n4093
9222g058o5213n5275L2080K5622M7723M0565O7543K6978m0943l8680l8311J04891
9210I9922l6716l8874p06L7399J4149O7871J26760L617j60669j19202L7845Q7450
9198A18846L5345K3359p2968p7150j05902p4770P6763l3284L775J02989K9462
9187B6465M8661K7530o4628Q2610K1308j01771j7600p6795n1262L6544K7392J2120
9175b9426K6202P3295M5684p2733k2625j825n4616p3516j6659m3014R5615N0393
9163b3225J0249O5268k0721o8888J3482J59052J0146j70956J5808o062N741l0634
9151d0740q2134L0515L8256P3374J25599o0801j00476K5009M1046k5754k2802
$$ plain form
9233 47224 68929 81221 61830 78050 149695 20436 -101962 -84498 -14795 47035 -7058
9222 -7058 -72271 -127546 -95466 -69844 -22121 18444 85987 112965 72022 33342 -4969 99922
9210 99922 63206 24332 23626 61025 75174 143045 269805 273422 112753 -6449 31396 118846
9198 118846 154191 177550 104582 27432 -78470 -153240 -76477 -109761 -105986 -2997 26465
9187 26465 75126 102656 38028 120638 141946 40175 22575 -54220 -105482 -68938 -41546 -29426
9175 -29426 -3224 70071 115755 43022 20397 18572 -36044 -109560 -126219 -169233 -73618 -23225
9163 -23225 -12976 52292 31571 -37317 -23835 135217 145363 -25593 -9785 -15847 -10106 -40740
9151 -40740 -122874 -92359 -54103 19271 144870 84069 -16407 8602 49648 23894 1092
9140A092J6750J2206l1895o7414L0510J0910P7576N752M2809Q6075K2292j9932
9128A86731m872q973p8020q6242q7974j6536n0462L4003L5021M4784P8061M836
9116E0357M243l1272k4115J7804n677n951K0638o3058M4330K214L0023K9403J7547
9103H6486j7556L2263K537j8374k2826q8104K7245O4789M2542q2585r0651l1530
9091i5764j216j5843K4738K8094J3002j30k048K8599L4566l9286K343K6654J3889
9078A7598J1727M8937j1061K5249p4885o1081m5249L8209J9671P9670K2537N1710
9066A23032r3786j06932J2480N1399P937L0049o4511M8586N5049m1534n2246R734
9054b0743o743n5910P2739n25p9485o794K1138J03815m1775o964L1594J504l4156
$$ plain form
9140 1092 17842 30048 -1847 -69261 -38751 -27841 49735 55487 98296 184371 206663 186731
9128 186731 181859 172886 94866 8624 -79350 -95886 -146348 -112345 -77324 -32540 45521 50357
9116 50357 54600 23328 -787 17017 11340 5389 26027 -37031 7299 9513 39536 68939 86486
9103 86486 68930 101193 103730 85356 62530 -25574 1671 66460 109002 26417 -64234 -95764
9091 -95764 -96980 -112823 -88085 -59991 -46989 -47119 -49167 -20568 13998 -25288 -22945 3709 17598
9078 17598 29325 78262 67201 92450 17565 -43516 -88765 -50556 -30885 48785 71322 123032
9066 123032 29246 -77686 -65206 -13807 -5870 24179 -40332 8254 63303 21769 -30477 -20743
9054 -20743 -27486 -83396 -10657 -11182 -90667 -97461 -76323 27492 -14283 -21247 10347 11851 -22305
9041b2305j14456P9789J11345N0283K5071r3822j28294l5381N5385M8987l3687
9030e7085o3869m3307J10051O9461K1494o9187k2626l681K9050N3848L0525O756
9018F1430q982N351q0100k4454J02907Q4265j3827j33118Q732L6232j8407k0606
9006e77o7688P5498P2991l6373j17077n9202K7552M3576L7940M5431J5379o7287
8994b9837J11501P4610k5689m1464k566k4060l6722k7591J5766M8183l6255J0005
8982C5881O4298J67p961o1849l9870N3584O7998k7823p4131J3196k2171l7652
8970c6333j7109M6730M1444j1048q439n552n1726p9064N4792L1797n91J0788J1079
8957a3232K9413Q325k1687m5236J1202j057k2796j729l379M917L2274K1560L3746
$$ plain form
9041 -22305 -136761 -56972 54373 104656 129727 35905 -92389 -127770 -72385 -23398 -57085
9030 -57085 -120954 -164261 -54210 15251 36745 -32442 -55068 -58749 -29699 24149 54674 61430
9018 61430 52448 57799 -22301 -46755 56152 140417 126590 -6528 2204 38436 20029 -577
9006 -577 -68265 7233 80224 43851 -73226 -132428 -104876 -61300 -23360 22071 37450 -29837
8994 -29837 81664 156274 130585 89121 86555 62495 25773 -1818 13948 62131 25876 35881
8982 35881 100179 100346 92385 30536 -9334 44250 112248 84425 10294 23490 1319 -36333
8970 -36333 -53442 -6712 34732 23684 15245 9693 -42033 -121097 -66305 -34508 -35099 -24311 -13232
8957 -13232 16181 24506 2819 -42417 -31215 -32272 -55068 -56797 -60176 -55259 -22985 -1425 32321
8944C2321R972O0067p2009k3256J1200J4496o1357m5479L9401P433l2104o3548
8932a22863N7663P4180j9589l672P8305Q2493k5426l3616p1327n066k7051o4655
8920h0624K2118Q6842j4107o9326k1329O8093Q950J0138J8174L6398L0593J8612
8908A14532o7534l6782L0465P067N1880P9374l3064M6461M1780o1793o4539m7295
8896F0552L5833L4681J4844N3343k1584r5260q2747k6172K2533N6394L224J022
8884E6663m1951m3095K8661J967P3384O75P7295R2161q982r0408j58756n2444
8872f4830j8093N9916J0416m3776K3775j7494J0749O382k1782L4566j1651J1389
8860b0433P5582p3N757N897k4449m8782k2744L7560j07145L118P0284j9281q989
$$ plain form
8944 32321 42293 102360 30351 7095 18295 32791 -28566 -74045 -34644 -27211 -59315 -122863
8932 -122863 -65200 8980 -10609 -14281 64024 146517 121091 87475 16148 11082 -15969 -80624
8920 -80624 -58506 28336 14229 -55097 -76426 -8333 617 10755 28929 65327 95920 114532
8908 114532 46998 10216 40681 47748 99628 179002 145938 192399 234179 172386 107847 60552
8896 60552 96385 131066 145910 199253 177669 82409 -338 -26510 -3977 52417 55641 56663
8884 56663 14712 -28383 278 2245 75629 76304 153599 245760 236778 146370 -12386 -64830
8872 -64830 -82923 -23007 -12591 -56367 -32592 -50086 -39337 -32955 -54737 -20171 -31822 -20433
8860 -20433 55149 55076 60833 66730 42281 -6501 -29245 8315 -98830 -95712 -25428 -44709 -53698
8847e3698N7156q774k2736j7097P5772M8995o7151j7960o3085n4683N3911P3941
8835D591n557j5679n3759J8119o7916l683j1599M5538P1261K5589m2141M3719
8823H483K1801R7848j4653r7239n886m3578l6673Q899K6051q530l8652j4032n5597
8810a51758k6383j1837L0641Q9821O3441m3717p0180O789J30964L9866o7604r6116
8798a06073O5972R430l6071R2732P0015L7023m2692o3971o473P3599P9479R8039
8786B71009n2105j20051k8141n5299n7711L85m3041q1307j1176P2571P7833K967
8774b4066n5018k6410J693j3169L8443j2879O4662j3268k5474k4986k6849K5597
8762i1724J9228o2372M3641M4186N7978J8068K0749L4131M2261O779j05534p7030
$$ plain form
8847 -53698 3458 -5316 -28052 -45149 30623 79618 12467 -5493 -68578 -123261 -69350 4591
8835 4591 -966 -16645 -70404 -52285 -120201 -123884 -135483 -89945 -18684 6905 -35236 8483
8823 8483 30284 128132 113479 16240 10354 -33224 -69897 -60998 -34947 -43477 -82129 -96161 -151758
8810 -151758 -178141 -189978 -159337 -69516 -6075 -49792 -119972 -113183 17781 57647 -9957 -106073
8798 -106073 -40101 -30671 -66742 25990 96005 133028 90336 26365 19892 93491 172970 271009
8786 271009 218904 98853 70712 15413 -42298 -41913 -84954 -166261 -177437 -104866 -27033 -24066
8774 -24066 -79084 -105494 -103801 -116970 -78527 -91406 -26744 -40012 -65486 -90472 -117321 -91724
8762 -91724 -72496 -134868 -91227 -47041 10937 29005 49754 83885 126146 132925 27391 -49639
8750d9639J1246J00883J3394l2139k8247n2750n4942J8891O7937M0935O357J0408
8738E2334J4632r18J4781n8165q146m3115L0060N5800q0838m6722k0685q02L1074
8725f0710k4826j0421N7723j8798K57O59L8914l9334L753K2073P6848Q3642p0109
8712E9671q5659K7864M4089K1985Q291m9593M0144l5939m9298L81L7032N402J0475
8699C4845l6198J6167l274N7030J0550n3228K1294J0205p7589k0793P0781O70
8687C0460j5050p1981J14706J25625l7543k0385l9707n2339j3496k0183j3881
8676a3774N7638J4785m4150n6106o2207M2767N7963K4403K3182O539K7711k0998
8664E7753O219K8494J396n2718j1778K5913O4386K5272O2815o2889p7860k4111
$$ plain form
8750 -49639 -38393 62490 75884 43745 15498 -37252 -92194 -73303 -5366 35569 41926 52334
8738 52334 66966 66048 80829 22664 14518 -28597 1463 57263 -23575 -70297 -90982 -91784 -60710
8725 -60710 -85536 -95957 -38234 -57032 -56775 -56116 -17202 -56536 -52783 -30710 46138 129780 59671
8712 59671 -25988 1876 45965 67950 76241 26648 66792 30853 -18445 -18064 18968 24370 34845
8699 34845 -1353 14814 11540 68570 79120 25892 47186 57391 -20198 -40991 29790 30460
8687 30460 15410 -56571 58135 183760 146217 125832 86125 33786 20290 107 -13774
8676 -13774 43864 58649 14499 -41607 -103814 -61047 -3084 21319 44501 51040 78751 57753
8664 57753 63972 92466 93862 41144 29366 55279 119665 144937 207752 144863 67003 42892
8652D2892K4521L9950M8115O7961N3356k3539j23264J0058j570N476k3716n9203
8640F1037N3046K3620l8730j18555M40Q333O0479J1356j6842l940r715K1127Q084
8627E9740l7684m1549n5822L2807R6663Q69j2757k560P596o3435p2840q1658J3567
8614a57063q687O1192J00935R3812p3317k3294J7587o494L4669J2748o4485k3813
8602c6210M5861K7408J1739O6513m7334j22874m4503J9416M0806O493R1461j2237
8590D6539j9549P161k4351m808p6404K167O1689l6043m7318J3529N8045R6001
8578G6658k0381j46086p4090P2000P0309P5694J5753L671L8887k2284m6640Q0207
8566A23698O7319m0172o7474j3830m0741q0165l7249R8966J13601k7293k9589
$$ plain form
8652 42892 67413 107363 155478 223439 276795 253256 129992 140050 138480 143956 120240 61037
8640 61037 114083 137703 98973 -19582 -19142 -10809 49670 61026 44184 40244 30529 51656 59740
8627 59740 22056 -19493 -75315 -42508 54155 55024 42267 39707 47303 -16132 -88972 -170630 -157063
8614 -157063 -165750 -104558 -3623 90189 16872 -6422 11165 4671 39340 52088 -12397 -36210
8602 -36210 9651 37059 48798 115311 67977 -54897 -99400 -79984 -39178 -32685 58776 46539
8590 46539 26990 34151 9800 4992 -71412 -69245 -7556 -43599 -90917 -77388 -19343 76658
8578 76658 56277 -89809 -163899 -91899 -21590 54104 69857 73528 112415 90131 43491 123698
8566 123698 191017 150845 83371 69541 28800 -51365 -88614 10352 123953 96660 67071
8555F7071o5177k8195l817J9285o6897m0918J7410p730m1569J2227K6575N3123
8543e8612J04904L1894m0865j21093j7741O4831N8515P6749J2912k4520N9792
8532A46766p9310p8272J6530J0048p729p2644J0066J07249r823m7706J642l8489
8520d1672K0286N740M0921Q5698k0637p3500p6777L1280J3303J4142Q9331l655
8508H4460K1125l4997J965r6331q8537M4421j1655m7973N8034Q7861K0958L5215
8496G4546p5433o6762L7952J8928O3147m5071k58l5859k3245N5411L6306K5742
8484F5404K0129l4074J8618M0527j2421l2567p8830J0857N8738L0779l0444p7397
8472b0681M8694L0231J9941N335o128l529n1593m3340p675k8729K3637n883k5958
$$ plain form
8555 67071 1894 -26301 -30118 -10833 -77730 -118648 -101238 -108968 -150537 -138310 -111735 -58612
8543 -58612 46292 78186 37321 -83772 -101513 -36682 21833 98582 111494 86974 146766
8532 146766 67456 -10816 5714 15762 8033 -64611 -54545 52704 42881 -4825 -3183 -41672
8520 -41672 -21386 -15646 25275 110973 90336 16836 -59941 -28661 -15358 -1216 88115 84460
8508 84460 105585 70588 72553 -23778 -112315 -67894 -79549 -127522 -69488 18373 39331 74546
8496 74546 -887 -67649 -29697 -10769 52378 7307 7049 -28810 -52055 3356 39662 65404
8484 65404 85533 51459 70077 110604 98183 65616 -13214 -2357 56381 87160 56716 -20681
8472 -20681 28013 58244 78185 83520 77392 73863 22270 -21070 -28745 -57474 -33837 -39720 -65678
8459f5678n9920K9744m825P4895M3697J343J0552J0268J7940l6889j46630p5210
8447b00713J4936N6911J00161L8884J3965R7606L705o7966n5507k8502N8919k3882
8435H517J0314P7628J652m619P1294L2566L3130j0328l2475j25657K0524K1993
8423A04539m5643J9529m344p226k3501N8838o553j1274k6634L164j0944K6555
8411G6506L4268K6389n9871k8886k7898l9006R95J0143m8197J8320L2389k888
8399g736L1529j2779J1180k7587n9844j2139M4166o8595o4224N255M4888N5507
8387f0379N6968K1926L2583J7497k6515j59300n0167O7014P4557L5523P5704M1122
8375A26533K2474m9692o8233l7854J0213O819M1642m2245j07963P451P5173J8241
$$ plain form
8459 -65678 -125598 -95854 -100679 -25784 17913 19256 29808 40076 58016 21127 -125503 -200713
8447 -200713 -185777 -128866 -28705 10179 24144 121750 125455 57489 1982 -26520 32399 8517
8435 8517 18831 96459 98111 93492 164786 197352 230482 220154 187679 62022 82546 104539
8423 104539 58896 78425 74081 66855 43354 102192 95639 84365 57731 60895 49951 76506
8411 76506 110774 137163 77292 48406 20508 -18498 -17503 -7360 -55557 -37237 -4848 -7736
8399 -7736 23793 11014 22194 -5393 -65237 -77376 -33210 -101805 -166029 -160774 -115886 -60379
8387 -60379 -3411 18515 51098 68595 42080 -117220 -167387 -100373 -25816 9707 85411 126533
8375 126533 149007 99315 31082 -6772 3441 10260 51902 9657 -98306 -90855 -15682 2559
8363B559L6678j3734L3618r2164q8031J0174L5689J36006K2806M6710L0812k0768
8351A40355J5897r2863l9979L7485L0635o9536K5551j0215J0198N7943P9595p8699
8339A06367j52607n9680l0646k9254O1316P3615P1424J00299M2945n0243j04291
8328B9245m5635R316J948L333o1710L7130Q6992k1177P9580p8689j13536p5074
8316a48277L2149J10879l6289m9210M7590k3206N884r6102j7713O8017L9411P014
8304e9853j3840M8498L9595L5378P91o5257M7872J08689J1182o9565j2394M0588
8292A11684M0958J9782j13073l5138r06L4961K3763n7939o857P6228R1300l6569
8280A48194p0837J230J8639J6188j13683J0380J9310L266J4389o468J5745K5939
$$ plain form
8363 2559 39237 25503 59121 -33043 -121074 -110900 -75211 60795 83601 130311 161123 140355
8351 140355 156252 63389 23410 60895 91530 21994 47545 37330 47528 105471 185066 106367
8339 106367 -46240 -105920 -136566 -165820 -104504 -30889 40535 140834 183779 133536 29245
8328 29245 -16390 -7074 -5126 -1793 -63503 -26373 60619 39442 119022 40333 -73203 -148277
8316 -148277 -116128 -5249 -41538 -90748 -43158 -66364 -60480 -156582 -174295 -106278 -66867 -59853
8304 -59853 -73693 -25195 14400 49778 50569 -14688 33184 141873 153055 83490 71096 111684
8292 111684 152642 172424 59351 24213 23307 58268 82031 24092 17235 93463 184763 148194
8280 148194 77357 78587 97226 113414 -269 10111 29421 32687 47076 40608 56353 82292
8268H2292k4600l8772k6810L4835j07684J4117n2136n5961J26752K9643q1867
8257a00191Q630M2741P4010K0111l5210n0896m3147q73K6357k9585k6697P7371
8245c7379J19425n0717n5305K7735n2052L8253P3136M73j3462k7441L5477O0065
8233A18208j00407k8969Q677R0209l0018m5858K5683r016k4941k9147k7119l0253
8221h2951n8936M1404P4549K4106J6163L3184J3274o1871O996N1073J05212L3883
8209A96086K608m0972m9590m1590j2925k1054j0048M1314M7115Q092j9698m4036
8197E5302o7242K4403L0909K1903k3888o9666P3405P4209N7992n6148p9415j04988
8185f3224N697P5431n7847N5420J07037k8563o4827o5891n7699P0098J10009n911
$$ plain form
8268 82292 57692 18920 -7890 26945 -80739 -66622 -118758 -174719 -47967 -18324 -100191
8257 -100191 -91561 -48820 25190 45301 10091 -40805 -83952 -84825 -58468 -88053 -114750 -37379
8245 -37379 82046 31329 -23976 3759 -48293 -10040 63096 63569 50107 22666 58143 118208
8233 118208 17801 -11168 -2491 87718 57700 11842 37525 28509 3568 -25579 -52698 -82951
8221 -82951 -141887 -100483 -25934 -1828 14335 47519 60793 -1078 5918 56991 162203 196086
8209 196086 198694 157722 108132 66542 53617 32563 22515 63829 110944 119036 99338 55302
8197 55302 -11940 12463 43372 65275 41387 -28279 45126 119335 177327 121179 41764 -63224
8185 -63224 -57527 17904 -39943 15477 122514 93951 29124 -36767 -94466 -24368 85641 79730
8173G9730j17157k3133J1130J7679j9375o1557N003J8649l7386n1203J6289j3236
8161a74567O5669J03404o0417j52352j15878J01930J70573K2277K3968m2032o3700
8150a21125q6580N9783J23821J4799n2257j5452R2046J0101m8749k1778n7909
8139a03300J9334n895k031L1636O1921n1138j5482P5593M4361m0443N808o764
8127A3600o5117p7779P8529Q9855K2035k2933P0330L82J9722N5593L0400o566
8115B08051k6633j04075p4405J0680Q9759m7414n9064J537n943l1249m0088K4553
8103e4291O8194L1032l3310M0813N3467O223P599p5839q5325p125Q1105K9733
8091F2276l7382O94Q8760l1877j7809r7806m8318L551P7916p4553l4217J7622
$$ plain form
8173 79730 -37427 -60560 -49430 -31751 -51126 -112683 -107680 -89031 -126417 -177620 -161331 -174567
8161 -174567 -108898 -5494 -65911 -218263 -334141 -232211 -61638 -39361 -15393 -57425 -121125
8150 -121125 -207705 -147922 -24101 -9302 -61559 -77011 15035 25136 -23613 -45391 -103300
8139 -103300 -83966 -89861 -91892 -60256 1665 -49473 -64955 10638 54999 14556 20364 13600
8127 13600 -51517 -129296 -50767 39088 61123 38190 108520 108902 128624 184217 214617 208051
8115 208051 181418 77343 2938 13618 103377 55963 -3101 -1564 -7507 -38756 -78844 -54291
8103 -54291 13903 44935 11625 52438 105905 112128 119727 43888 -41437 -48562 32543 62276
8091 62276 24894 25588 114348 82471 64662 -33144 -81462 -77911 5 -74548 -108765 -91143
8079i1143N4880R2762j4823Q615l9737p7542M2849K8566K1510L5922j4726M5755
8067I2888o2516J0999n2920j9492O0039O0326k5909j06072P2323M7023Q1246k8662
8055A29273j1138k9665q5181n1164k8526k8455R0078J0910k1918k655L9145R193
8043A9897K4286k4842r422l7693L2634P8498p8397p1445j6216N0179Q7975K6786
8031H2240l7787j41749J3997k8793n1140N2284R1665J14437l4443n4040p213n596
8019f138O624O474P009N0131K638R358m5684k8876L1281l0178n632M3717k6773
8006A3951n9573l5941Q3790P1711j561M8768k0841q0233l3962J5233N8081k711
7994E6712r0976r1791M0318P2353N5141J21540P4929j17131m7378N847J5701k8469
$$ plain form
8079 -91143 -36263 56499 41676 50291 10554 -66988 -24139 4427 25937 61859 47133 92888
8067 92888 30372 41371 -11549 -31041 28998 89324 63415 -42657 29666 76689 157935 129273
8055 129273 118135 88470 3289 -47875 -76401 -104856 -14778 -3868 -25786 -28441 10704 19897
8043 19897 44183 19341 9919 -27774 4860 83358 4961 -66484 -82700 -32521 55454 82240
8031 82240 44453 -97296 -83299 -112092 -163232 -110948 -19283 95154 60711 6671 -542 -6138
8019 -6138 486 6960 13969 64100 66738 76096 30412 1536 32817 2639 -2993 40724 13951
8006 13951 -45622 -81563 2227 73938 72377 121145 100304 20071 -13891 1342 59423 56712
7994 56712 -34264 -126055 -85737 -13384 41757 163297 238226 121095 73717 79564 95265 66796
7982F6796k6592P0430k3612p3045K5699K4158m8723p6926n6713J2820P0806J2115
7970b2787j9508l2034K264O1136M5847K8120l1320j1135m9197Q408J7805O7522
7958F5121j6270P0973J4820R601q990q8794n6078J6671J3012P9384K9979j32817
7946c388j03194M4421Q2291L0220L3652J2143m5935N282n6758J3471j426l67P6825
7933H7237n2053p0775M7785K5241k6523J314L3596M859J489J1416m4376N102m6761
7920b2449l259j9O3501j0982o2356N1015j2605q2428m8908P7417L1983K167J0008
7907f915M246K915M8344j8145q3384M2120j8279j1826N178N9275K7749K4957J5558
7894I1793j9136m2955o2458j474M0097N552j9244J3547l5577k4473K7940r163
$$ plain form
7982 66796 40204 110634 87022 13977 39676 63834 15111 -61815 -118528 -105708 -34902 -22787
7970 -22787 -42295 -74329 -72065 -10929 34918 63038 31718 20583 -28614 -20206 -2401 65121
7958 65121 48851 119824 134644 144245 135255 46461 -9617 7054 20066 99450 129429 -3388
7946 -3388 -106582 -62161 20130 50350 84002 96145 50210 55492 -1266 12205 10779 10412 87237
7933 87237 35184 -35591 12194 37435 10912 12226 45822 50681 52170 63586 19210 24312 -22449
7920 -22449 -25708 -25727 37774 26792 -35564 15451 2846 -79582 -128490 -51073 -19090 -16923 -6915
7907 -6915 -2669 246 48590 30445 -52939 -10819 -29098 -40924 -35746 23529 51278 76235 91793
7894 91793 72657 29702 -32756 -34230 5867 11419 -7825 5722 -29855 -54328 -26388 -35551
7882c5551L0143l786o8687j06636k3859Q7921O1937N9491M9935n99j586j06213
7870e7490Q691Q3517l0929r4728L4991k8029l5810o2705q28P6819P1591o8661
7858a03571o2586k692P7909J4197m682k6218l2230J00774P0186o8226j1738p6463
7846a25340r5569M8053J51424J5163K6598k5346k8967o82O1447m7459n2476m5226
7834a18380r011M1640P2790M3556n3417j7670J12460P188J2023j9215l7376j06866
7822g2278L2893J8141O1699k0629M4171Q962j16K1901n595n4201k1924Q4745K0017
7809A17786r0715K6837P3022l8442m0344j2919l9998P0360l8531m0713k9570K554
7797d0673M0176M7351m945k5067O9292N6749k6116m0787k0517N215k5328K9777
$$ plain form
7882 -35551 -5408 -9194 -77881 -184517 -208376 -120455 -58518 973 50908 50309 48723 -57490
7870 -57490 -48799 34718 3789 -90939 -55948 -83977 -119787 -182492 -183320 -106501 -34910 -103571
7858 -103571 -166157 -168849 -90940 -76743 -81425 -107643 -139873 -39099 31087 -37139 -48877 -125340
7846 -125340 -220909 -172856 -21432 -6269 20329 -5017 -33984 -34666 26781 -20678 -73154 -118380
7834 -118380 -127391 -85751 -12961 30595 -22822 -40492 71968 79156 91179 71964 34588 -72278
7822 -72278 -39385 -21244 40455 19826 63997 72959 72843 94744 89149 34948 13024 97769 117786
7809 117786 27071 53908 126930 88488 48144 35225 -4773 65587 27056 -13657 -43227 -40673
7797 -40673 -497 46854 41909 16842 86134 142883 116767 75980 55463 60678 35350 65127
7785F5127r1353o7207l6216l4108O0257P7120K7384L2819K1024L7276j8434M5700
7773A19389M7105p5722q8169o6838m9328m704L8527l2830K9259l605M2752K2749
7761b1415k0848j0914J07118M547m3565n5794J1549P0214J4371n516K3218O8895
7749A41860j63874q7803Q0606J18691k7272J1175N5326k1147j2086l3466N447
7738F7457M9604k0360j9067L8112N5277K4035r6522r3705P3423L5180J7826o9492
7726F1768m5864m1737l7629k8910J0118j8131R2809P1035k8942j8910n7991k3403
7714f5787M0540R7290J0726n563N3185J783j15148l0809L4445n4066n219j9020
7702e7643L7503Q7966O912J9712q785K686n1849m8090k1736M7474J90849M1939
$$ plain form
7785 65127 -26226 -93433 -129649 -163757 -103500 -26380 1004 33823 54847 92123 73689 119389
7773 119389 166494 90772 2603 -64235 -113563 -118267 -79740 -112570 -83311 -86916 -44164 -21415
7761 -21415 -42263 -53177 53941 58488 14923 -40871 -29322 40892 55263 49747 72965 141860
7749 141860 -22014 -109817 -29211 89480 62208 73383 128709 107562 95476 62010 67457
7738 67457 117061 96701 77634 115746 171023 195058 98536 4831 78254 113434 131260 61768
7726 61768 15904 -25833 -63462 -92372 -82254 -100385 -7576 63459 34517 15607 -42384 -65787
7714 -65787 -25247 72043 82769 77206 130391 132174 17026 -13783 20662 -33404 -38623 -57643
7702 -57643 -20140 67826 74738 94450 85665 88351 36502 -11588 -33324 14150 204999 246938
7690B46938j14227J4853m674l7300m9151J0161J3832q5642n8011K6839J21499
7679H5117M7082j3373m0537O5K7842j770m3154Q949k9304o1323k3949L9746M2345
7666C7736k0261p0529P6732M6581p1881k510R3750r857o4052j1839q2170j0236
7654h8536l707N7993k987o440k1022n1760O0013k0912K4090J511k0876q4813K7905
7641a29541K0087N4966M8474p29K3802P3376j2724L5771M71j10626k9510R5118
7629F8935p0913l1889j9772n1913n8855P517N1160J3094l5997L0515n482n367
7617a08967j4533L3263M0660n6677n90J8606M2572L3894M1455p709M9450o7501
7605C923j20514R887N2788L8543j7038J4076J6843n8123o0552M963O2097L7389
$$ plain form
7690 246938 132711 147564 142890 105590 56439 66600 80432 -5210 -63221 -36382 85117
7679 85117 132199 118826 78289 78354 106196 104426 61272 70221 40917 -20406 -44355 -4609 37736
7666 37736 17475 -53054 23678 70259 -1622 -4132 89618 79761 15709 3870 -78300 -88536
7654 -88536 -92243 -34250 -37237 -43677 -64699 -116459 -56446 -77358 -53268 -51757 -72633 -157446 -129541
7641 -129541 -109454 -54488 -6014 -6743 17059 90435 77711 113482 113953 3327 -26183 68935
7629 68935 -1978 -33867 -53639 -105552 -164407 -156890 -105730 -92636 -128633 -98118 -103600 -108967
7617 -108967 -123500 -90237 -49577 -106254 -106844 -88238 -45666 -11772 29683 21974 71424 3923
7605 3923 -116591 -106704 -53916 -15373 -32411 -18335 -1492 -59615 -120167 -115204 -53107 -15718
7593a5718j3443M7093J17254M3496P935r8332o2586p819K864m5321k4881m206
7581e3664J41791J16196J9124n4346r9918j2375K7303o6883m4360P5491K6377
7570G4736R838r9132K5950O8233J3333q095n9739j30342l0237O1584O6909j6485
7558b3447K5229P0471O451J5984j9370q2186n5533o893N3508L5787l792r3281
7546g7072k1233R3683O2704k603o8900o6940Q3150j0870O843l8430M2458k1570
7534a8780l6999P2053k3523K3019n3525J358k5605m4187R689M3441L1344k165
7522b3880p3609m3074j2645J05622K7488K3734q898m6730L6509J12668P180J3953
7510A18318K9517j011m5292O1477L7943j04418p4816m0497K688J1038j710k8509
$$ plain form
7593 -15718 -29161 17932 135186 178682 186617 88285 25699 17880 20744 -24577 -49458 -53664
7581 -53664 88127 204323 223447 169101 69183 56808 84111 17228 -27132 48359 74736
7570 74736 84574 -14558 11392 79625 92958 84863 25124 -105218 -135455 -73871 -6962 -23447
7558 -23447 1782 72253 78704 94688 75318 -6868 -62401 -69294 -15786 20001 16209 -77072
7546 -77072 -98305 -4622 58082 55479 -13421 -80361 2789 -8081 -1238 -39668 2790 -18780
7534 -18780 -55779 16274 -7249 15770 -37755 -36397 -62002 -106189 -96500 -53059 -21715 -23880
7522 -23880 -97489 -140563 -153208 -47586 -20098 3636 -5262 -51992 -15483 97185 104365 118318
7510 118318 147835 146824 101532 163009 200952 96534 21718 -18779 -16091 -5053 -6763 -35272
7498c5272M0274m1072l6387k816Q9680O4193K9787j5541m1538p0090m1673M7007
7486a3448K4630o9338p1877O8075O0876L6886N5187k1101k0374L0279j9407o1126
7474g38J04590M4023p3924j09618n6965j4209j6518P1709M5199m9953k6520P3202
7462i722P429N2854O029l4403N2573Q8665M7695n0781k0291o7102n9361l8882
7450b5297j0964L2721J4550m9135o094k673L0219N559r954J7421J6560K8133K2749
7437F3795j09667l3582O4560k9049K97K2975o600l2724p2373k4672K9931K8501
7425i8608J5854n4620l9657N0729J04773o783p4801J4876K5180m6662m5322N4983
7413a00058m2749o996N6549M6167J358o3499l9535j4242M3170P0964Q0760j1657
$$ plain form
7498 -35272 5002 -36070 -72457 -75273 14407 78600 108387 92846 51308 -18782 -60455 -13448
7486 -13448 11182 -58156 -130033 -61958 -1082 35804 90991 69890 49516 79795 60388 -738
7474 -738 103852 147875 73951 -35667 -92632 -106841 -123359 -51650 -6451 -56404 -82924 -9722
7462 -9722 -2293 50561 56590 22187 74760 163425 211120 160339 140048 72946 13585 -25297
7450 -25297 -36261 -3540 11010 -38125 -44219 -46892 -16673 -11114 -21068 -3647 12913 41046 63795
7437 63795 -45872 -79454 -14894 -43943 -43646 -20671 -27271 -59995 -132368 -157040 -127109 -98608
7425 -98608 -82754 -137374 -177031 -126302 -21529 -28312 -103113 -88237 -63057 -109719 -155041 -100058
7413 -100058 -142807 -149803 -93254 -47087 -45729 -109228 -148763 -163005 -119835 -48871 31889 20232
7401B0232m3611r569N2262J22625P0040l5161j76004o4054O8579J5467m6562p9938
7389a05694J8759P4685j6789n658o9654j2170R3216M4277L2848K5905p5811K5757
7377B9671O3757p0369L5114K0129q6138n0438R9194Q1611j978j9373j4043r594
7365G7543K2684j6761m3242J6217m9173m1795k4220o56R6175K608L322M2592k0737
7352F4557r5497q563j1133O64J0276k141N4758m5613m4333n959k2962R4851M7616
7339C6521o4201M2890Q5583M9833r1236k9870o5040k2139Q0010O642k7398k1108
7327a9513m410L140o503N0684M320l0616J3105n8562L3320L4860p233j1613O7008
7314F7987j4649m5407m7588n7971J3442J5876k8322K4844O8878P1127L4385j7322
$$ plain form
7401 20232 -23379 -32948 19314 141939 211979 176818 814 -63240 5339 20806 -25756 -105694
7389 -105694 -86935 -12250 -29039 -34697 -104351 -116521 -23305 20972 53820 79725 3914 29671
7377 29671 93428 23059 58173 78302 -7836 -58274 40920 122531 120553 101180 87137 77543
7365 77543 100227 83466 40224 56441 7268 -34527 -58747 -59403 36772 39380 42702 85294 64557
7352 64557 -30940 -39503 -50636 -49972 -39696 -41837 12921 -32692 -77025 -82984 -105946 -11095 36521
7339 36521 -27680 15210 100793 150626 59390 29520 -35520 -57659 22351 28993 1595 -19513
7327 -19513 -23923 -20783 -27286 23398 27718 -2898 10207 -48355 -15035 19825 12592 979 67987
7314 67987 53338 7931 -39657 -97628 -84186 -68310 -96632 -71788 -2910 68217 102602 85280
7302H5280j10724j17080j1951n0264N0358J6324k992o4086N8916L30K8121J4331
7290a03437O5219M2218K2022k1098j0525p87o2407O45J3867L5176K0990J0171
7278A2054K7660l5825j4975k1360n3888n2694j8161p098l1893L9067O4474r406
7266a02045l8853l083k0881j7330J7580R5789O4302J0857l2512N6668J2600M9724
7254I2816N577J7029m0308o6274L4862m8871j3462J001J04085P7904o9542O26
7242I5443o4711k9893k5454L7345n1584j4889m8882O697K1709J5225N5929J3052
7230I987l2812q2991k2831K5308Q0015L0597l218j0553L217o9076K6493P9917
7218C4053N3094l1842l7535K2219k8406K1269m5972p1308K1867K5880Q7434N1439
$$ plain form
7302 85280 -25444 -142524 -154475 -204739 -154381 -138057 -141049 -205135 -146219 -145889 -117768 -103437
7290 -103437 -38218 4000 26022 4924 -5601 -6388 -68795 -68150 -54283 -19107 1883 12054
7278 12054 39714 3889 -11086 -32446 -86334 -139028 -157189 -164287 -196180 -157113 -92639 -102045
7266 -102045 -140898 -143981 -164862 -182192 -164612 -68823 -4521 6336 -26176 30492 43092 92816
7254 92816 98393 115422 75114 8840 43702 -5169 -18631 -17630 86455 164359 94817 95443
7242 95443 30732 839 -24615 12730 -38854 -53743 -102625 -95928 -74219 -58994 -3065 9987
7230 9987 -22825 -105816 -128647 -103339 -23324 7273 4055 -6498 -3281 -72357 -45864 34053
7218 34053 87147 55305 17770 39989 11583 32852 -13120 -84428 -62561 -36681 50753 102192
7206A02192n2452l3189J9681N0125p1718l5375m0910N6339L5968M0140J8493M1242
7194A30536j09562j05393k7941J1516M2759L9810j5006l6783m4504N4863N9008
7183f97o67o402L1849N6588M443Q540p5303k7269j4335l2038L5103J7874K7806
7170B5492L5724j9980l5127l1507j0347O0068j7032k7823R5236j4106j03489l5378
7158g8269L3901M5288L3381J1537p0999M2103Q5829k6873m1153P1074L5181j07769
7146C3231n3976M7083N3659N1185N4912k1002m9029j00582j08776L1828J9672
7135d1795m8533O6692o1019n1416L0221K6828j1588l8992J5043K7795K344L1022
7123e3398Q6835L9333Q687L5440l8476n6196O044m5711n4294J3960M0017l8049
$$ plain form
7206 102192 49740 16551 36232 86357 14639 -20736 -61646 -5307 30661 70801 89294 130536
7194 130536 20974 -84419 -112360 -100844 -58085 -18275 -33281 -70064 -114568 -59705 -697
7183 -697 -1364 -7766 24083 80671 85114 93654 18351 -8918 -23253 -55291 -20188 -2314 25492
7170 25492 61216 41236 6109 -25398 -35745 24323 7291 -20532 74704 60598 -42891 -78269
7158 -78269 -44368 920 34301 45838 -25161 16942 102771 75898 34745 105819 141000 33231
7146 33231 -20745 26338 79997 131182 186094 165092 116063 15481 -93295 -61467 -41795
7135 -41795 -90328 -23636 -84655 -136071 -105850 -79022 -90610 -129602 -114559 -86764 -84420 -53398
7123 -53398 33437 72770 81457 116897 78421 22225 28269 -17442 -71736 -57776 -17759 -55808
7111e5808P8O5862k4951q588L3964L1779p0036K1706J3796K313P794m2511m062
7098b8664n5221L43R4653j629N7921J083o5064p0951o814m0742J3653M4859l2248
7085h8821N1997J7667j0417j1915o8713J6940O3678L1068p711K104L4371n1025
7073b0777k0786K7060K8385L5545o806J292n342l2178N0415R072J5352J2321q0237
7060A3316p6472q0436K2674P437M9561P7392K6765k2372m287K0904q4280p080
7048e6878K9068P223L4639L1090p2868l8743l0423N096O2344O0703j7268k8729
7036a4746o873L4217O7416j4664N837j8338k5707J9376L1877K4766k2233j10465
7024b9537j01459N2621j892J7176m6911k3203l390J11313Q376n0910J09278k066
$$ plain form
7111 -55808 -55730 10132 -14819 -23407 10557 42336 -27700 -5994 7802 10115 17909 -24602 -28664
7098 -28664 -83885 -83542 11111 9482 67403 68486 3422 -67529 -74343 -115085 -101432 -56573 -88821
7085 -88821 -36824 -19157 -29574 -41489 -110202 -93262 -29584 1484 -6227 -4123 30248 -20777
7073 -20777 -41563 -14503 13882 49427 42621 43913 38571 6393 56808 65880 81232 93553 13316
7060 13316 -63156 -143592 -120918 -113481 -63920 13472 40237 17865 13578 34482 -49798 -56878
7048 -56878 -27810 -20587 14052 45142 -27726 -66469 -96892 -91796 -29452 31251 13983 -14746
7036 -14746 -21619 12598 80014 65350 71187 52849 27142 46518 78395 103161 80928 -29537
7024 -29537 -130996 -78375 -80267 -63091 -110002 -133205 -136595 -25282 -16906 -67816 41462 39396
7012C9396p4713r811K4873m2923k4344R35P2122P19p6785M1153L8551L8712k8036
6999a51J0904J00924K3071o80m0368j46426j27174L2288P3936J04850l7419m6601
6987e2846l2404l2482J3019j090K1110K3017n4573N0429K7926l7169J7446K7465
6975c0152O7966j3627k6362J4953k015R5225J3654p4129j8006n0603P3540N97
6963E1041j52998j4579P1686L1492J0859m2449m427q3542k2600K3618L140Q645
6951a20114J16229j556j2217r517K2751Q7858k6069k0152k0987m0808m3171O2708
6939e045m4829l1355M3170J2859j7385L718K2451R6851K9338r4563j23099k3654
6927a31543j15763m438J14969N0464M1183k3970m762L1126N4687K672n1223r2101
$$ plain form
7012 39396 -35317 -45128 -20255 -63178 -87522 -86587 -14465 -13746 -90531 -49378 -10827 27885 -151
6999 -151 10753 111677 134748 134068 93700 -52726 -179900 -147612 -73676 31174 -6245 -52846
6987 -52846 -85250 -117732 -104713 -105803 -84693 -61676 -116249 -65820 -37894 -75063 -57617 -30152
6975 -30152 37814 24187 -2175 12778 10763 105988 119642 45513 27507 -23096 50444 51041
6963 51041 -101957 -116536 -44850 -13358 -2499 -44948 -49375 -132917 -155517 -131899 -128759 -120114
6951 -120114 -3885 -5441 -17658 -27175 -4424 83434 57365 37213 16226 -24582 -67753 -5045
6939 -5045 -49874 -81229 -38059 -25200 -42585 -38867 -16416 80435 109773 15210 -107889 -131543
6927 -131543 -247306 -251744 -136775 -86311 -45128 -69098 -73860 -42734 11953 14625 -36598 -128699
6915a28699l0956j0346L4438l5848P9990M7340l1712L182O8290M552j9447L3282
6903A4066R742p5529p9471K9368N6119L4799r377P416J4344O8409K3310k0351
6891G2845m5046j36769L8991M0759n96o5809K6635K4329j5271L0847o115l0159
6879f5359r0661j2138J37947p9222J330O7358N3230O3448J2805J2660m2479j4662
6867D4257l4074K6957n2820J1974r219k8807r7558P0733L4395o7419k8970J3920
6855a16631P8783m777l2386L6431K5489J183l7285j3488K9291M4616m2174L8730
6843G782q8646j7379r50K8339J11221n5035j35735L7190M0933J7210J7903J7685
6831a9482j0664J7501J6173q270k4517m8634p7401N6674R2585o6448o4873J46037
$$ plain form
6915 -128699 -159655 -170001 -135563 -171411 -91421 -44081 -75793 -72611 -4321 231 -19216 14066
6903 14066 23808 -51721 -131192 -101824 -45705 -10906 -20283 -12867 1477 69886 93196 72845
6891 72845 27799 -108970 -69979 -29220 -29816 -95625 -68990 -44661 -59932 -29085 -35200 -65359
6879 -65359 -156020 -168158 -30211 -109433 -108103 -40745 12485 75933 88738 101398 58919 44257
6867 44257 10183 37140 -15680 -3706 -12925 -41732 -139290 -68557 -34162 -101581 -130551 -116631
6855 -116631 -37848 -42625 -75011 -38580 -13091 -11908 -49193 -62681 -33390 11226 -30948 7782
6843 7782 -80864 -98243 -99193 -70854 40367 -14668 -150403 -113213 -72280 -55070 -37167 -19482
6831 -19482 -30146 -12645 3528 -4742 -29259 -77893 -155294 -98620 -6035 -72483 -137356 8681
6819H681J21643q1159m6458J672r5473l655K5535R747L4310k5137j7240n9359
6807a26893J3126k6611K660J32849R6087L0896M187J3729n1906q0663m3975N4539
6795A8025P4967l1243p1070K0856p22k135L634j21024k302J6164L9865l1806L3109
6782e3682K3181o9836J6415K104j15009P958N2513P0586Q8973l3364o6382k6567
6770a03110J0441r198Q00M4405N0282P8364o509l6186j9422q183k7539k286N7486
6757B9345J2988j955K2702J2654j753L2347J2584p9571j20241K5032J0731m4548
6745h9685m428J8202K4010O496p1680Q448M0845K7953O1901J317k4795o0286n5302
6732a17004J4675P694m2524P640M3141K6314j2292O4597L0460o0858k2374j115
$$ plain form
6819 8681 130324 49165 2707 4379 -91094 -94749 -69214 -59467 -25157 -50294 -67534 -126893
6807 -126893 -113767 -140378 -137718 -4869 91218 122114 126301 140030 88124 7461 -36514 18025
6795 18025 92992 61749 -9321 11535 10813 8678 12312 -108712 -111014 -94850 -54985 -86791 -53682
6782 -53682 -30501 -100337 -83922 -81818 -196827 -188869 -136356 -65770 23203 -10161 -76543 -103110
6770 -103110 -92669 -101867 -101067 -56662 -6380 71984 65475 29289 9867 1684 -25855 -28141 29345
6757 29345 42333 40378 63080 75734 73981 106328 118912 39341 -80900 -55868 -45137 -89685
6745 -89685 -94113 -75911 -51901 -45405 -117085 -108637 -67792 -39839 22062 23379 -1416 -61702 -117004
6732 -117004 -102329 -94635 -137159 -129519 -86378 -60064 -72356 -7759 22701 -38157 -60531 -61646
6720f1646J1621J7864q052L6255m5583j3832J5549M6644k4953k3674K3989K3268
6708b550r619L6149L5680k4806l4220L1746M7462J1762J9918m8683k0303M3177
6696H5713N3807m4858m0295n5332K8345n0513q18O0962j8202M2586N818r278l6752
6683B1183r0669j9046M0820J0558k5076k5693O4476K5438m0557p0177j7425K2821
6671a03347Q66M2417K9810M481M9483J01524K3962m3273j01382l9049k0977J0302
6659d5183P6139Q354l4197j3156N9493J05221m478o4456q2495m517N7772J8976
6647G7473o437j5419P0621j2033L985m1672k2139J1551K3666m6380n4582j0386
6635b1752q2875o7791Q6320L3404P8932J8466K0537K7470K0560m2169p2872j3189
$$ plain form
6720 -61646 -50025 -32161 -40213 -3958 -49541 -63373 -47824 -1180 -26133 -49807 -25818 -2550
6708 -2550 -12169 23980 59660 34854 634 32380 79842 91604 111522 62839 42536 85713
6696 85713 139520 94662 54367 -965 27380 -23133 -23951 37011 18809 61395 67213 57935 21183
6683 21183 -69486 -88532 -47712 -37154 -62230 -87923 -23447 1991 -38566 -108743 -126168 -103347
6671 -103347 -102481 -60064 -30254 -25773 23710 125234 149196 105923 4541 -34508 -55485 -45183
6659 -45183 30956 39310 5113 -8043 51450 156671 152193 87737 5242 725 58497 77473
6647 77473 71036 55617 126238 114205 118190 76518 54379 65930 89596 43216 -11366 -21752
6635 -21752 -104627 -172418 -86098 -52694 26238 44704 65241 92711 113271 71102 -1770 -14959
6623a4959M4857k5745p1412o4082j6768R9754J30861J3621o7618o2864j7010o8611
6611a19976K3318Q969o677q595K9815K1738j4763n1283J1681O7850J2385k0585
6599d6123j8218J8045l2276m802M0110J15805O4659J0522p2285o7991q475K5380
6587B4351p7879n3814P7395L5709M36N3842N8680J8083o5902L014J1330R5187
6575A80432j6852o1018m8564k6316M0049o527q5348J0024n3227Q026P7315n300
6563A2694K619M4385P6495o6171p2184O1818M858j985N8909k0134k1346l7486
6551D2472r0833k8456Q5168j1815J5359N5112M4371J6983L4705j6823L136j4572
6539A34807L3927Q704p7270k7739J7518l0558j23762o1861P5648k430o5842M1382
$$ plain form
6623 -14959 29898 4153 -67259 -131341 -148109 -48355 82506 96127 28509 -34355 -51365 -119976
6611 -119976 -96658 -87689 -94366 -102961 -73146 -51408 -66171 -117454 -105773 -37923 -25538 -46123
6599 -46123 -64341 -46296 -78572 -83374 -43264 72541 137200 147722 75437 7446 -1029 24351
6587 24351 -53528 -107342 -29947 5762 6198 60040 118720 136803 70901 73915 85245 180432
6575 180432 163580 102562 53998 27682 67731 61204 -24144 -14120 -67347 -59321 17994 12694
6563 12694 15313 59698 136193 70022 -2162 59656 64514 62529 121438 101304 79958 42472
6551 42472 -48361 -76817 8351 -3464 11895 67007 111378 128361 163066 146243 149379 134807
6539 134807 168734 177438 100168 72429 89947 59389 -64373 -126234 -50586 -53016 -118858 -77476
6527g7476M6044L6020j4664r0164M4299L1243n0176n1923l304K2287K9788N3950
6515b4076N5338Q6183K1550j17832n4313O2947O2369q6717K6431L2738L8369M3073
6503A46060K0618K429m5526j13889K2186K8880j26989o3182L972O3000R498p1740
6491a24683J11570P9809n825m0245J3365j0134r2897Q486Q8494L6622n1114K9980
6479D3428O0795M2039k3016k4353k4435K5540l4591m0490R507o2680L220P651
6467a7385k3183M5362k5241m4471j1857L3053J646k6892j2436j2424P2494n31
6455b1865p0807n2055R3021L7370O6001L1545Q140n385r1374k2458N24O2177N7020
6442I1854K3390J9698j14591l2870q8612k3630r674L0408O5076M4947J1668K3818
$$ plain form
6527 -77476 -31432 4588 -10076 -100240 -55941 -24698 -74874 -126797 -130101 -107814 -78026 -24076
6515 -24076 31262 117445 138995 21163 -33150 29797 92166 5449 31880 64618 102987 146060
6503 146060 166678 169107 123581 9692 31878 60758 -66231 -129413 -125441 -62441 -52943 -124683
6491 -124683 -13113 66696 60871 20626 33991 23857 -69040 -60554 27940 64562 13448 43428
6479 43428 104223 146262 123246 98893 74458 99998 65407 24917 34424 -28256 -25036 -17385
6467 -17385 -40568 4794 -20447 -64918 -76775 -43722 -42076 -68968 -81404 -93828 -21334 -21865
6455 -21865 -92672 -144727 -51706 -14336 51665 83210 91350 85965 -5409 -27867 -27343 34834 91854
6442 91854 115244 134942 20351 -12519 -101131 -124761 -134435 -104027 -38951 5996 17664 41482
6430D1482K5805r303m4806O565N1666Q6059k7266p901m4227m0868L9104Q1597
6418A57907k512K3640k1393j07715K343p246J5358J1372o6616k6641j9018j04707
6406a45228k0060Q5248N780j6152Q4968L924o6740k951N0914l8741k564M2406
6394a9196R0639j9430l1942M6383k0615p1169L3715M8332m0160p0521L2896j0951
6382c2019M882O9744o920j23470l3726O6068p2928K0598N7436j433M1816N7046
6370D7094o6222m2343L2330l6805m9234k1328L5350m0361p306J2665O8767L4596
6358c2797j0932j6451O7774n726q226k9204K7982l7771l5190m53M2597p2084K1355
6345h9126M9013M0859M9974n1680J1767M6195O9371J5753j05312j01964o5688
$$ plain form
6430 41482 67287 57984 13178 19743 71409 157468 130202 122301 78074 37206 76310 157907
6418 157907 155395 179035 157642 49927 52270 45024 60382 71754 5138 -21503 -40521 -145228
6406 -145228 -165288 -80040 -74260 -90412 -5444 -1520 -68260 -71211 -20297 -59038 -61602 -19196
6394 -19196 71443 52013 20071 66454 45839 -25330 8385 56717 16557 -53964 -21068 -32019
6382 -32019 -27137 42607 35687 -87783 -121509 -55441 -128369 -107771 -50335 -51768 -9952 47094
6370 47094 -19128 -61471 -29141 -65946 -115180 -136508 -101158 -141519 -148825 -136160 -67393 -32797
6358 -32797 -43729 -60180 7594 1868 -6358 -35562 -7580 -45351 -80541 -80994 -38397 -110481 -89126
6345 -89126 -40113 746 50720 -960 10807 57002 126373 142126 36814 -65150 -130838
6334a30838r6870Q1311J00738O7067p6417o3612L7173K3616Q692P9321P1248q266
6322I3163o8286m4357o6243R1662J18727N5095J261j6831r2918p3149M9424m557
6310D2991q2113k9845K0308l545N6366L2036o1938l9538k2475K9121n7256k3003
6298a38891Q6086O4289o9092m3634Q3471N2475n7081m6882j5686O3403O8798J04270
6286A51526J4907r3661m4247J1789k793p6874k4497r9297N4300Q7671L0056K0180
6274B9060k5095r941k1153m5651q1616O864P6901O600m298j2690k7488K2487l4183
6261a20203l7180M6108q661J6660R3197M6122l796r0420n8182j9877M4471P9511
6249a2250K028j1427J03372M3420n0256K9601l9664j49178j00364L0632K7299
$$ plain form
6334 -130838 -227708 -146397 -45659 21408 -55009 -118621 -81448 -57832 -49140 30181 101429 93163
6322 93163 24877 -19480 -85723 5939 124666 179761 181022 164191 71273 -1876 47548 42991
6310 42991 -39122 -68967 -48659 -52204 4162 36198 -25740 -65278 -87753 -58632 -115888 -138891
6298 -138891 -52805 11484 -57608 -101242 -17771 34704 -22377 -69259 -84945 -21542 47256 151526
6286 151526 166433 72772 28525 40314 37521 -39353 -63850 -163147 -108847 -21176 8880 29060
6274 29060 3965 -5976 -27129 -72780 -154396 -147532 -70631 -64031 -68329 -81019 -108507 -86020 -120203
6261 -120203 -157383 -111275 -119936 -103276 -10079 36043 32247 -58173 -116355 -136232 -91761 -12250
6249 -12250 -10222 -21649 81723 125143 74887 104488 64824 -84354 -184718 -154086 -126787
$$ [...]
##END NTUPLES=NMR SPECTRUM
##END=
