##TITLE=Analysis number 327436
Compound Code spb 06067
Book Reference 193793
Project Code adrs flr03
Chemist Name jom
##JCAMPDX= 6.0         $$ Bruker NMR JCAMP-DX V2.0
##DATA TYPE= NMR SPECTRUM
##DATA CLASS= NTUPLES
##ORIGIN= Bruker BioSpin GmbH
##OWNER= nmr
$$ XWIN-NMR		Version 3.5
$$ Fri Mar 23 12:37:37 2007 GMT Standard Time (UT+0h)  MAYBRIDGE\nmr@NMR_250MHZ
##.OBSERVE FREQUENCY= 250.131544655141
##.OBSERVE NUCLEUS= ^1H
##.ACQUISITION MODE= SIMULTANEOUS (DQD)
##.ACQUISITION SCHEME= undefined
##.AVERAGES= 16
##.DIGITISER RES= 18
##SPECTROMETER/DATA SYSTEM= dpx250
##.PULSE SEQUENCE= zg30
##.SOLVENT NAME= DMSO
##.SHIFT REFERENCE= (INTERNAL, DMSO, 0, 16.522)
##AUDIT TRAIL= $$ (NUMBER, WHEN, WHO, WHERE, WHAT)
$$ ##TITLE= Audit trail, XWIN-NMR		Version 3.5
$$ ##JCAMPDX= 5.01
$$ ##ORIGIN= Bruker BioSpin GmbH
$$ ##OWNER= nmr
$$ C:\u/data/dgb/nmr/ADRS/1820/pdata/1/auditp.txt
$$ ##AUDIT TRAIL=  $$ (NUMBER, WHEN, WHO, WHERE, WHAT)
(   1,<2007-03-23 12:37:16.07 +000>,<MAYBRIDGE\nmr>,<NMR_250MHZ>,
      <created by zg, POWCHK disabled, PULCHK disabled
       configuration hash MD5:
       49 4B E0 1D 92 C2 6B 37 9F E6 65 BC 52 41 86 1D
       data hash MD5: 64K
       68 A3 E1 6F 6B 87 00 DE B2 1E 2D A9 E4 90 44 C8>)
(   2,<2007-03-23 12:37:28.61 +000>,<MAYBRIDGE\nmr>,<NMR_250MHZ>,
      <Start of raw data processing
       ef LB = 0.3 FT_mod = 6 PKNL = 1 SI = 32K 
       data hash MD5: 32K
       B4 62 5E 02 06 14 17 9A 03 6D 90 63 AE 05 C2 EC>)
(   3,<2007-03-23 12:37:30.25 +000>,<MAYBRIDGE\nmr>,<NMR_250MHZ>,
      <apk 
       data hash MD5: 32K
       2E 49 1B 53 55 7E D2 EA 92 D4 D4 70 C5 4E C3 CC>)
(   4,<2007-03-23 12:37:31.10 +000>,<MAYBRIDGE\nmr>,<NMR_250MHZ>,
      <abs ABSG = 5 
       data hash MD5: 32K
       D0 51 26 49 D0 17 AD 36 C7 24 27 CB C7 D1 06 E8>)
$$ ##END=
$$ 
$$ hash MD5
$$ 01 15 AF BA 22 C2 7C B5 CD FB 27 E3 6B 6E 4C F1
##$RELAX= 
##$RELAX= 
##$RELAX= 
##$RELAX= 
##$RELAX= 
##$RELAX= 
##$RELAX= 
$$ Bruker specific parameters
$$ --------------------------
##$DU= <C:\u>
##$EXPNO= 1820
##$NAME= <ADRS>
##$PROCNO= 1
##$TYPE= <nmr>
##$USER= <dgb>
##$AMP= (0..31)
100 100 100 100 100 100 100 100 100 100 100 100 100 100 100 100 100 100 
100 100 100 100 100 100 100 100 100 100 100 100 100 100 
##$AQSEQ= 0
##$AQ_mod= 3
##$AUNM= <au_zg>
##$AUTOPOS= <34 >
##$BF1= 250.13
##$BF2= 250.13
##$BF3= 250.13
##$BF4= 250.13
##$BF5= 500.13
##$BF6= 500.13
##$BF7= 500.13
##$BF8= 500.13
##$BYTORDA= 1
##$CFDGTYP= 0
##$CFRGTYP= 5
##$CHEMSTR= <none>
##$CNST= (0..31)
1 1 145 1 1 1 1 1 1 1 1 1 1 1 1 1 1 1 1 1 1 1 1 1 1 1 1 1 1 1 1 1 
##$CPDPRG= <>
##$CPDPRG1= <>
##$CPDPRG2= <>
##$CPDPRG3= <>
##$CPDPRG4= <mlev>
##$CPDPRG5= <mlev>
##$CPDPRG6= <mlev>
##$CPDPRG7= <mlev>
##$CPDPRG8= <mlev>
##$CPDPRGB= <>
##$CPDPRGT= <>
##$D= (0..31)
0 1 0 0 0 0 0 0 0 0.06 0 0 0 0 0 0 0.0002 0 0 0 0 0 0 0 0 0 0 0 0 0 0 
0 
##$DATE= 1174653434
##$DBL= (0..7)
120 120 120 120 120 120 120 120 
##$DBP= (0..7)
150 150 150 150 150 150 150 150 
##$DBP07= 0
##$DBPNAM0= <>
##$DBPNAM1= <>
$$ [...]
##$SUBNAM7= <"">
##$SUBNAM8= <"">
##$SUBNAM9= <"">
##$SW= 20.6930455092707
##$SWIBOX= (0..15)
0 0 3 0 0 0 0 0 0 0 0 0 0 0 0 0 
##$SW_h= 5175.983436853
##$TD= 65536
##$TD0= 1
##$TE= 683.16
##$TE2= 300
##$TE3= 300
##$TEG= 300
##$TL= (0..7)
0 120 120 120 120 120 120 120 
##$TP= (0..7)
150 150 150 150 150 150 150 150 
##$TP07= 0
##$TPNAME0= <>
##$TPNAME1= <>
##$TPNAME2= <>
##$TPNAME3= <>
##$TPNAME4= <>
##$TPNAME5= <>
##$TPNAME6= <>
##$TPNAME7= <>
##$TPOAL= (0..7)
0.5 0.5 0.5 0.5 0.5 0.5 0.5 0.5 
##$TPOFFS= (0..7)
0 0 0 0 0 0 0 0 
##$TUNHIN= 0
##$TUNHOUT= 0
##$TUNXOUT= 0
##$USERA1= <user>
##$USERA2= <user>
##$USERA3= <user>
##$USERA4= <user>
##$USERA5= <user>
##$V9= 5
##$VALIST= <valist>
##$VCLIST= <CCCCCCCCCCCCCCC>
##$VD= 0
##$VDLIST= <DDDDDDDDDDDDDDD>
##$VPLIST= <PPPPPPPPPPPPPPP>
##$VTLIST= <TTTTTTTTTTTTTTT>
##$WBST= 1024
##$WBSW= 4
##$XGAIN= (0..3)
0 0 0 0 
##$XL= 0
##$YL= 0
##$YMAX_a= 226879
##$YMIN_a= -326412
##$ZGOPTNS= <>
##$ZL1= 120
##$ZL2= 120
##$ZL3= 120
##$ZL4= 120
##$ABSF1= 16.522
##$ABSF2= -4.171173
##$ABSG= 5
##$ABSL= 3
##$ALPHA= 0
##$AQORDER= 0
##$ASSFAC= 0
##$ASSFACI= 0
##$ASSFACX= 0
##$ASSWID= 0
##$AUNMP= <proc_1d>
##$AZFE= 0.1
##$AZFW= 0.1
##$BCFW= 0
##$BC_mod= 0
##$BYTORDP= 0
##$COROFFS= 0
##$CY= 12.5
##$DATMOD= 1
##$DC= 0
##$DFILT= <>
##$DTYPP= 0
##$F1P= 14.0000005364418
##$F2P= -0.99999901652339
##$FCOR= 0.5
##$FTSIZE= 32768
##$FT_mod= 6
##$GAMMA= 0
##$GB= 0
##$INTBC= 1
##$INTSCL= 1
##$ISEN= 128
##$LB= 0.3
##$LEV0= 0
##$LPBIN= 0
##$MAXI= 10000
##$MC2= 0
##$MEAN= 0
##$ME_mod= 0
##$MI= 0
##$NCOEF= 0
##$NC_proc= -5
##$NLEV= 6
##$NOISF1= 0
##$NOISF2= 0
##$NSP= 0
##$NTH_PI= 0
##$NZP= 0
##$OFFSET= 16.522
##$PC= 1
##$PHC0= 220.3369
##$PHC1= 5.663541
##$PH_mod= 1
##$PKNL= yes
##$PPARMOD= 0
##$PSCAL= 4
##$PSIGN= 0
##$REVERSE= no
##$SF= 250.13
##$SI= 32768
##$SIGF1= 0
##$SIGF2= 0
##$SINO= 400
##$SIOLD= 32768
##$SREGLST= <1H.DMSO>
##$SSB= 0
##$STSI= 32768
##$STSR= 0
##$SW_p= 5175.98343685301
##$SYMM= 0
##$S_DEV= 0
##$TDeff= 65536
##$TDoff= 0
##$TI= <Analysis number 999999
Compound Code 99
Book Reference 9
Project Code 9>
##$TILT= no
##$TM1= 0
##$TM2= 0
##$TOPLEV= 0
##$USERP1= <user>
##$USERP2= <user>
##$USERP3= <user>
##$USERP4= <user>
##$USERP5= <user>
##$WDW= 1
##$XDIM= 32768
##$YMAX_p= 365062185
##$YMIN_p= -618158
$$ End of Bruker specific parameters
$$ ---------------------------------
##NTUPLES= NMR SPECTRUM
##VAR_NAME=  FREQUENCY,     SPECTRUM/REAL,   SPECTRUM/IMAG
##SYMBOL=    X,             R,               I
##VAR_TYPE=  INDEPENDENT,   DEPENDENT,       DEPENDENT
##VAR_FORM=  AFFN,          ASDF,            ASDF
##VAR_DIM=   32768,         32768,           32768
##UNITS=     HZ,            ARBITRARY UNITS, ARBITRARY UNITS
##FACTOR=    0.157963299565203, 1,           1
##FIRST=     4132.6476996994, 0,             0
##LAST=      -1043.33573715361, 0,           0
##MIN=       -1043.33573715361, -618158,     0
##MAX=       4132.6476996994, 365062185,     0
$$ Real data points
##PAGE= N=1
##DATA TABLE= (X++(R..R)), XYDATA
$$ [...]
15875A14793N4753n2850j16497q685j14982m6255q0960Q7774J69444K20107j0114
$$ 114793 169546 116696 199 -8486 -123468 -169723 -250683 -162909 6535 226642 216528
15864B16528p0131l1519j60946l0285k094J77314L1206K2831j07379j05488n7212
$$ 216528 146397 114878 -46068 -76353 -78447 98867 130073 152904 45525 -59963 -117175
15853a17175j7210J5071n7234P1480J94724j3687j04867j25261P7527O9377P4150
$$ -117175 -134385 -119314 -176548 -105068 89656 75969 -28898 -154159 -76632 -7255 66895
15842F6895N0160m4997k9366j51943j14650P9222J35676j2189l6331r0290J0933
$$ 66895 117055 72058 42692 -109251 -223901 -144679 -9003 -21192 -57523 -147813 -136880
15831a36880M0996N277k544m3406N5729K5813R247j4226r6396q1329p5143k1573
$$ -136880 -95884 -90607 -93151 -136557 -80828 -55015 -45768 -59994 -156390 -237719 -312862 -334435
15819c34435O8791O6979J17824K07516J4223j86990o6371k0501J19192J12448
$$ -334435 -265644 -198665 -80841 126675 140898 -46092 -112463 -132964 -13772 98676
15809I8676j020l3080L7882J8247j8252j32195j13798J920J21273L213K9216N7812
$$ 98676 97656 64576 102458 120705 102453 -29742 -143540 -141620 -20347 -17134 12082 69894
15797F9894o6043n3490q6646l4771k4400o3219J6560J7620k7893K2449M9471j9085
$$ 69894 3851 -49639 -136285 -171056 -195456 -258675 -242115 -224495 -252388 -229939 -180468 -199553
15785a99553j5012Q3654R817q7186K9927K8452Q2322J02883o8623p7230L6089
$$ -199553 -214565 -130911 -121094 -208280 -178353 -149901 -67579 35304 -33319 -110549 -74460
15774g4460L9742j40529n2271J52078J06071l2709k1036J2229N6991J40644j76196
$$ -74460 -34718 -175247 -227518 -75440 30631 -2078 -23114 -10885 46106 186750 10554
15763A0554k21461N0335Q3036K910J09253P9296M8927o8862l3181L4538j33336
$$ 10554 -210907 -160572 -77536 -74626 34627 113923 162850 93988 60807 95345 -37991
15752c7991r2450J36090J7669J27148l5290L594p916R7022O8285r873j73692q4683
$$ -37991 -130441 5649 23318 150466 115176 118770 110854 207876 276161 266288 92596 7913
15740G913N3125N2125j14374r3941J8121K0348m5381P9886p1982L698k0896q2398
$$ 7913 61038 113163 -1211 -95152 -77031 -56683 -102064 -22178 -94160 -90462 -111358 -193756
15728a93756O8039m8562M2367O7075j9110J1682M7590L1487l9026m4344K3777
$$ -193756 -125717 -174279 -131912 -64837 -83947 -72265 -24675 6812 -32214 -76558 -52781
15717e2781J3595k4095j0168p7934M631Q4498j61180p9178J67679O1389J22140
$$ -52781 -39186 -63281 -73449 -151383 -146752 -62254 -223434 -302612 -134933 -73544 48596
15706D8596l391J6979j02042p9190L2366N0262M2664O2652j177M7792R1325m6646
$$ 48596 45205 62184 -39858 -119048 -86682 -36420 6244 68896 67719 115511 206836 160190
15694A60190k9349r287o3306j65512j01716J12502J26169j09131M6659N7954O2977
$$ 160190 130841 121554 58248 -107264 -208980 -96478 29691 -79440 -32781 25173 88150
15683H8150k8127K9609r8461M902m1991p57J7518j05251l7917q653n8763j4402
$$ 88150 60023 89632 -8829 -3927 -45918 -46675 -29157 -134408 -172325 -180978 -239741 -254143
15671b54143o072O9377J44845M0564J8762k4467l4316J04829j0883p8080n81L9995
$$ -254143 -260215 -190838 -45993 -5429 13333 -11134 -45450 59379 48496 -29584 -30165 9830
15659I830L6318p3646j2658Q3231J1840P1475p5980j05559N8066j4015j14644
$$ 9830 46148 -27498 -40156 43075 54915 126390 50410 -55149 2917 -11098 -125742
15648a25742q0160P1181J55683Q5223N5086j01508m9476l4791N8388l4460R886
$$ -125742 -205902 -134721 20962 106185 161271 59763 10287 -24504 33884 -576 9310
15637I310o4000n4041o958J00594N5326n6683J46158k7918k13321l4235J35194
$$ 9310 -54690 -108731 -115689 -15095 40231 -16452 129706 101788 -111533 -145768 -10574
15626a0574Q9317n2994j90265r3666k8744j9576r814K099P5385J13744N5472l1601
$$ -10574 78743 25749 -164516 -258182 -286926 -306502 -316316 -314217 -238832 -125088 -69616 -101217
15614a01217r908J41694L0300n9514k4637M3096R365n678J3217k6011p3861M4619
$$ -101217 -111125 30569 60869 1355 -23282 19814 29179 23501 36718 10707 -63154 -18535
15602a8535J52163K143o3388n6638m4087o4578J04534K25306Q8551n9010k21908
$$ -18535 133628 135771 72383 15745 -28342 -92920 11614 236920 325471 266461 44553
15591D4553k44157m1470J28150R3120Q3619L0366m1438j4834j2635k1169J14090
$$ 44553 -199604 -241074 -112924 -19804 63815 94181 52743 37909 25274 4105 118195
15580A18195j13660R8757P624j51960o828M3800l0869n0838o6780l8438j01408
$$ 118195 4535 103292 110916 -41044 -47872 -4072 -34941 -85779 -152559 -190997 -292405
15569b92405O6959J27594k9263o1292n1017l5102O427R4917M8095M2840q4979
$$ -292405 -225446 -97852 -127115 -188407 -239424 -274526 -268099 -173182 -125087 -82247 -167226
15558a67226K1363J06680N4437R0333n9032j50833q1891K0107q4192M1079J60570
$$ -167226 -145863 -39183 15254 105587 46555 -104278 -186169 -166062 -250254 -209175 -48605
15547d8605K4003L1625J34923j0120j35723k01816n1236J23024J6665q7793J04406
$$ -48605 -24602 7023 141946 131826 -3897 -205713 -256949 -133925 -117260 -205053 -100647
15536a00647J26686r63m8007k6487R3535j25048o9560l127J13496J57302M7501
$$ -100647 26039 25076 -22931 -49418 44117 -80931 -150491 -153618 -40122 117180 164681
15525A64681J7189l2002j31612o5685j78771j24832N1788K6384J37825J09447
$$ 164681 181870 149868 18256 -47429 -226200 -351032 -299244 -272860 -135035 -25588
15515b5588n4675k3207l0243j9678O0662m212N1631j3573n6143R277N9530n7523
$$ -25588 -80263 -103470 -133713 -153391 -92729 -96941 -45310 -58883 -115026 -105749 -46219 -103742
15503a03742L8383M0241j01419m8127M8438j22587P586R5116K5432p4521M0512
$$ -103742 -65359 -25118 -126537 -174664 -126226 -248813 -241227 -146111 -120679 -195200 -154688
15492a54688l1106p3769m6548O3036J03412J41928L8857r2580k5858l4044o8095
$$ -154688 -185794 -259563 -306111 -243075 -139663 2265 41122 -51458 -77316 -111360 -179455
15481a79455L779Q8610M4379O0933J836q7025J6995M4841n2946k1311k6721o6576
$$ -179455 -175676 -87066 -42687 18246 20082 -66943 -49948 -5107 -58053 -79364 -106085 -172661
15469a72661M691L3874p7198K6593K21387k4586j86629l0842J3387j37109j49128
$$ -172661 -167970 -134096 -211294 -184701 36686 12100 -174529 -205371 -191984 -329093 -478221
15458d78221J55915O9798J43942R8747O6009q1985p9005j94556k7038M4662J41115
$$ -478221 -322306 -252508 -108566 -9819 56190 -25795 -104800 -299356 -326394 -281732 -140617
15447a40617M2331J42198J7213o0749K87R0620k552j78795p9381K4409N3628M882
$$ -140617 -98286 43912 61125 376 663 91283 88731 -90064 -169445 -145036 -91408 -86526
15435h6526K7029j09339j30231J93594J69403r9795j33439L1458p54N6329K7629
$$ -86526 -59497 -168836 -299067 -105473 63930 -35865 -169304 -137846 -138600 -82271 -54642
15424e4642l5717J346J3026P5168J4577r8587j97742m5968K04970K47258L4853
$$ -54642 -90359 -89013 -75987 -819 13758 -84829 -282571 -328539 -123569 123689 158542
15413A58542N075p2025L642n2160J1550p3217j27676j9564J51630J41282n5824
$$ 158542 163617 91592 95234 43074 54624 -18593 -146269 -165833 -14203 127079 71255
15402G1255o6742r583J8180n2675m0677m0512P205m25K3844J60809q7672p8939
$$ 71255 4513 -5070 13110 -39565 -80242 -120754 -113549 -113974 -90130 70679 -16993 -95932
15390i5932Q0177P4802K4867q7882j09315j3386N4529J76804p428M7n0702m9687
$$ -95932 -15755 59047 83914 -3968 -113283 -126669 -72140 104664 97236 97283 46581 -3106
15378c106n4089J6908K4432j10307j0958J01049q6477n2650R4559l5033r6700
$$ -3106 -57195 -40287 -15855 -126162 -137120 -36071 -122548 -175198 -80639 -115672 -212372
15367b12372Q0288O4809l1200j3690Q6649O8805q3637j41421l819J14357Q7429
$$ -212372 -132084 -67275 -98475 -112165 -25516 43289 -40348 -181769 -185588 -71231 16198
15356A6198K3173q6985k22458L1932P5551P6905k6378N3738L7546l7826m530M4466
$$ 16198 39371 -47614 -270072 -238140 -162589 -85684 -112062 -58324 -20778 -58604 -63134 -18668
15344a8668L7748N9313N3539q065J4054p2521r6250j5637n338m4719J7196p0980
$$ -18668 19080 78393 131932 123867 137921 65400 -30850 -46487 -51825 -96544 -79348 -150328
15332a50328j1549j077J5727j12364l124J73262J28268N4702O1422M1561j59497
$$ -150328 -161877 -162954 -147227 -259591 -262715 -89453 38815 93517 154939 196500 37003
15321C7003p2045m0033j14643l4361J18949Q2575k9108n143j5580J34890r4921
$$ 37003 -35042 -75075 -189718 -224079 -105130 -22555 -51663 -56806 -72386 62504 -32417
15310c2417n3287P9828J38616o370L3143l6835j05593J4320J4771k0672k8083
$$ -32417 -85704 -5876 132740 126370 159513 122678 17085 31405 46176 25504 -2579
15299b579l4457L3836j8188J3617j9209o3971o1249L4153R6030Q2481j18606j24835
$$ -2579 -37036 -3200 -21388 -7771 -26980 -90951 -152200 -118047 -22017 60464 -58142 -182977
15287a82977J25833J01341L1428m655O3768O35j18158k619m6499J47053k63j01868
$$ -182977 -57144 44197 75625 70970 134738 135373 17215 14596 -31903 115150 114887 13019
15275A3019Q6983k058q6164p1923o1562l715n9870Q6324m6157K9650K4072J23021
$$ 13019 100002 97944 11780 -60143 -121705 -125420 -185290 -98966 -145123 -115473 -91401 31620
15263C1620N5594L0331j4591r5878k1379j0627n9680j1319l1598P7735j2629K7180
$$ 31620 87214 117545 102954 7076 -14303 -24930 -84610 -95929 -127527 -49792 -62421 -35241
15251c5241p7333k2100j06795Q560K0147l2478J7997K2074J39310j53734J7675
$$ -35241 -112574 -134674 -241469 -232909 -212762 -245240 -227243 -205169 -65859 -219593 -201918
15240b01918Q7682O6881o2295j7678j9107J64680L1629m521K9798j2231J3777
$$ -201918 -114236 -47355 -109650 -127328 -146435 18245 49874 45353 75151 62920 76697
15229G6697r8622m2158N4829n0359k1368O8057M1499L4329j0067n9792j6832J46754
$$ 76697 -21925 -64083 -9254 -59613 -80981 -12924 28575 62904 52837 -6955 -23787 122967
15217A22967J55043P4238j12886j22038M4762l0561j3207l2440k7262J2333o3114
$$ 122967 278010 352248 239362 117324 162086 131525 118318 85878 58616 70949 7835
15206G835J6111L2049m2797J07559L2223j06991M2160l3866m9741R4926j26393
$$ 7835 23946 55995 13198 120757 152980 45989 88149 54283 4542 99468 -26925
15195b6925l8154l9004P402J05601M376L5599R4572l5245k8907l4183m249m7797
$$ -26925 -65079 -104083 -96681 8920 13296 48895 143467 108222 79315 45132 40883 -6914
15183f914k7475k4439L1231k9399m7467q876Q3273r2366L1339n9730L8512O0666
$$ -6914 -34389 -58828 -27597 -56996 -104463 -113339 -30066 -122432 -91093 -150823 -112311 -51645
15171e1645p4983J9770L5540K7569N7972o344j20263j28561Q6211N8959J0169
$$ -51645 -126628 -106858 -71318 -43749 14223 7879 -112384 -240945 -154734 -95775 -85606
15160h5606j0102m814J14181J09910k3985J22904K6367m4914k821k6647r4555
$$ -85606 -95708 -100522 13659 123569 99584 222488 248855 203941 201120 174473 79918
15149G9918j09024r264J12898o9299J0494n832r0408l1832J13189q9365q0539
$$ 79918 -29106 -38370 74528 5229 15723 9891 -80517 -112349 840 -88525 -169064
15138a69064J28665N9222J03446n6016j09581p4536O2012N2287j26572p8653l9266
$$ -169064 -40399 18823 122269 66253 -43328 -117864 -55852 -3565 -130137 -208790 -248056
15127b48056M1415P2337P2056P1013J11824P892p9054k4641J00333J0970j46217
$$ -248056 -206641 -134304 -62248 8765 120589 128481 49427 24786 125119 136089 -10128
15116a0128q6061n6292j9541j01780k4984J01405K17485K5114n3659l61j9146
$$ -10128 -96189 -152481 -172022 -273802 -298786 -197381 20104 45218 -8441 -8802 -27948
15105b7948q2349K7503J10520R266M5727m0871p4708K23003k5373j4562R0801
$$ -27948 -110297 -82794 27726 36992 82719 41848 -32860 190143 164770 150208 241009
15094B41009J6354j12103m2003j94988J5405J52968O1188l3478k65069j45500
$$ 241009 257363 145260 103257 -91731 -76326 76642 137830 104352 -160717 -306217
15084c06217J19100K05229L3705l6137L6213J2875k0544J36o4330N3340J17662
$$ -306217 -187117 18112 51817 15680 51893 64768 44224 44360 -19970 33370 151032
15073A51032O7083j64242n3581M7005R810n6849p7144q0508j3482L8352P3160
$$ 151032 218115 53873 292 47297 57107 258 -76886 -157394 -170876 -132524 -59364
15062e9364M6126j7488J26665O6936k10896j56056O7483J93869n565J1361Q5201
$$ -59364 -13238 -30726 95939 162875 -48021 -204077 -136594 57275 51710 63071 148272
15051A48272m6736K3046l1882j2061R2970M1345k9636j70125j48862J29727O9610
$$ 148272 101536 124582 92700 80639 173609 214954 185318 15193 -133669 -3942 65668
15040F5668j11942k1154j3385j02810m1741l5097J16981P1130Q9150K9729N0215
$$ 65668 -46274 -67428 -80813 -183623 -225364 -260461 -143480 -72350 16800 46529 96744
15029I6744k2443j39313q9311N5510J16022Q6470j62198o5472J6905J84988J73985
$$ 96744 74301 -65012 -154323 -98813 17209 103679 -58519 -123991 -107086 77902 251887
15018B51887m1866p1863R1090j0670r4186n9644n2234l9291r8128J31847r966
$$ 251887 210021 138158 229248 218578 124392 64748 12514 -26777 -124905 6942 -3024
15007c024j04371P1944J82174O2086j46606j40752m4353M4564J19642r6708j97300
$$ -3024 -107395 -35451 146723 208809 62203 -78549 -122902 -78338 41304 -55404 -252704
14996b52704P529J86499Q7619k9143M914j25525Q18m2102m0467J26904M6727j4187
$$ -252704 -245175 -58676 28943 -200 4714 -120811 -119993 -162095 -202562 -75658 -28931 -43118
14984d3118r9776Q7895n1978j19462J8452M7291K6382k2873J01540J52080l1705
$$ -43118 -142894 -54999 -106977 -226439 -207987 -160696 -134314 -157187 -55647 96433 64728
14973F4728n8106Q259p4779q58J17492q9383j07708j753J62928J16457o1631l3688
$$ 64728 6622 14881 -59898 -60756 56736 -32647 -140355 -142108 20820 137277 75646 41958
14961D1958n824O3235Q9772j20220m4856k1799p1797L6831Q8659p6744l454r266
$$ 41958 36134 99369 189141 68921 24065 2266 -69531 -32700 55959 -20785 -24239 -33505
14949c3505L3119n3367m2775J12903l9991J07991J88641o9346j49954m0361O6177
$$ -33505 -386 -53753 -96528 16375 -23616 84375 273016 203670 53716 13355 79532
14938G9532j3431j08366j00913j6128p659J47591n1135q7400L0345K05593N1837
$$ 79532 66101 -42265 -143178 -159306 -166965 -19374 -70509 -157909 -127564 78029 129866
14927A29866j59436p6822J43818p5464j58587m4468L5108N4546Q7125J45308J0353
$$ 129866 -29570 -106392 37426 -38038 -196625 -241093 -205985 -151439 -64314 80994 91347
14916I1347J7078j9010J07488l8138j20844o538j12363j23812k8324J32765J40687
$$ 91347 108425 89415 196903 158765 37921 31383 -80980 -204792 -233116 -100351 40336
14905D0336K2451J33287n9952j02053J01484J9478j01486L4555M0858O3567J12960
$$ 40336 62787 196074 136122 34069 135553 155031 53545 88100 128958 192525 305485
14894C05485r7532j56387o7690n0300j6899L4519J30205p6818j57868O1301O582
$$ 305485 207953 51566 -16124 -66424 -83323 -48804 81401 4583 -153285 -91984 -85402
14883h5402Q5744N4115k19976j8699N3169n9260j04593J51530Q6383j047J22361
$$ -85402 342 54457 -165519 -184218 -131049 -190309 -294902 -143372 -56989 -58036 64325
14872F4325l7647r8573n982J36146j3955J5340K6196j2620Q420J02945j55221
$$ 64325 26678 -71895 -77877 58269 44314 59654 85850 73230 81650 184595 29374
14861B9374o1774O3601o8830l8327j7658N0080j7580m2961J1205N2132m6364K4905
$$ 29374 -32400 31201 -37629 -75956 -93614 -43534 -61114 -104075 -92870 -40738 -87102 -62197
14849f2197K4950n6415M9342K28664m1089m3632j14317q5036L6369R0487K1787
$$ -62197 -37247 -93662 -44320 184344 143255 99623 -14694 -99730 -63361 27126 48913
14838D8913J027L4809P9919J4448k61457j47890O4134J21864P9479J04841Q4339
$$ 48913 49940 84749 164668 179116 -82341 -230231 -166097 -44233 35246 140087 224426
14827B24426j26025L3382j10167j432J10958Q7113P7039m0545n4475K0567o2861
$$ 224426 98401 131783 21616 20184 131142 218255 295294 254749 200274 220841 157980
14816A57980j04003p6375Q030n3857m9953o0043J19266P5130P7420P3259J73762
$$ 157980 53977 -22398 -14368 -68225 -118178 -178221 -58955 16175 93595 166854 340616
14805C40616r6222j69554j10234K5752m2741m6738J7608J81722o037j74541K9904
$$ 340616 244394 74840 -35394 -9642 -52383 -99121 -81513 100209 94172 -80369 -50465
14794e0465k6620K7319J32015J44710Q5227l8763j36249j19j3983J3298M4155
$$ -50465 -77085 -49766 82249 226959 312186 273423 137174 137055 123072 136370 180525
14783A80525n6379L4156j06696m0686N6250o0218K1823Q9705P419j97757l1310
$$ 180525 124146 158302 51606 10920 67170 6952 28775 118480 125899 -71858 -103168
14772a03168k8989O0204p0639j10136R5989J03808L2562N4946J59551Q0561l090
$$ -103168 -132157 -71953 -142592 -252728 -156739 -52931 -20369 34577 194128 274689 271599
14761B71599j27832j12615M9086p6881p2109o3451J13545J22342J23677m94j27352
$$ 271599 143767 31152 80238 3357 -68752 -132203 -18658 103684 227361 226867 99515
14750I9515j3625J05638m0766j40365j20054p2381J4621J68202J77118l3072l4979
$$ 99515 85890 191528 150762 10397 -109657 -182038 -167417 785 177903 144831 109852
14739A09852n4068o8422o2999j01791q3380k8552Q4937J37716L4144L600K7126
$$ 109852 55784 -12638 -75637 -177428 -260808 -289360 -204423 -66707 -32563 -28963 -1837
14728a837k1903J7663p9283J3493j41756M3658J33807M5631p4360K663M7545j1671
$$ -1837 -23740 -6077 -85360 -71867 -213623 -169965 -36158 9473 -64887 -62224 -14679 -26350
14716b6350k3918L2635l3543m3572J35828J48237L5753k01105k1238q0663n315
$$ -26350 -50268 -17633 -51176 -94748 41080 189317 225070 23965 2727 -77936 -83251
14705h3251P9467l1359j8949q8642o0234L8801J78725J04062p9222n9997l8348
$$ -83251 -3784 -35143 -54092 -142734 -202968 -164167 14558 118620 39398 -20599 -58947
14694e8947J5319R720N5816n3986j4899J834r9843j55559j01901J34743J497M4304
$$ -58947 -43628 -33908 21908 -32078 -46977 -45143 -144986 -300545 -402446 -267703 -266206 -221902
14682b21902J33767N8771o865q3893m4341q0923J1247O9561M9332J5009J03206
$$ -221902 -88135 -29364 -36229 -120122 -164463 -245386 -234139 -164578 -115246 -100237 2969
14671B969M6897l6683k0859k3420l479M1349Q8627L939m7737J06664l327k2204
$$ 2969 49866 13183 -7676 -31096 -34575 6774 95401 99340 51603 158267 154940 132736
14659A32736o7576o6593K0986m8742P8813j02208O4663K7163j558p2483p4963
$$ 132736 65160 -1433 19553 -29189 49624 -52584 12079 39242 37684 -34799 -109762
14648a09762N4512J17324P248k6895j574J03483m1433j00812j02400m1163J8795
$$ -109762 -55250 62074 69322 42427 40853 144336 102903 2091 -100309 -141472 -122677
14637a22677P2032j14451J399K00727J58052K2481j21947j10798M8934j0318o4141
$$ -122677 -50645 -165096 -163697 37030 195082 217563 95616 -15182 33752 23434 -40707
14626d0707j003K536P6335q604p7561j40753Q3398J54567J9882k4212M2174j26260
$$ -40707 -41710 -39174 37161 28557 -49004 -189757 -106359 48208 68090 43878 86052 -40208
14614d0208o6509Q6476L4921M4804N1655j93442r0055n675M3833l1768O7233R5905
$$ -40208 -106717 -20241 14680 59484 111139 -82303 -172358 -178033 -134200 -165968 -98735 -2830
14602b830J05036j04357l9728J59084r860l1246m1906q0357J13053K7572q6348
$$ -2830 102206 -2151 -41879 117205 107345 76099 34193 -46164 66889 94461 8113
14591H113N8816K9900l7952p3867j19412M6615J72447r363K238j01183l1669k490
$$ 8113 66929 96829 58877 -14990 -134402 -87787 84660 75297 77535 -23648 -55317 -57807
14579e7807L6086J0007j002r9090J9893m1891L2P7023P2014J28569o3620j86474
$$ -57807 -21721 -11714 -12716 -111806 -91913 -133804 -133772 -56749 15265 143834 80214 -106260
14567a06260j30989n1170r5940R9277J30521N3272o0504j05731o0584M0930m7329
$$ -106260 -237249 -288419 -384359 -285082 -154561 -101289 -161793 -267524 -328108 -287178 -334507
14556c34507J75593O8493O2069p3738k6747q8156P8718N8668k6217M7049Q4757
$$ -334507 -158914 -90421 -28352 -102090 -128837 -216993 -138275 -79607 -105824 -58775 25982
14545B5982Q5604o7653k00280n2008J01614Q2326N4657M3061m1076k07463m5788
$$ 25982 111586 43933 -156347 -208355 -106741 -24415 30242 73303 32227 -175236 -221024
14534b21024j5752J55469P7576m9910j59741K9323K8453p8713J10435J00182q6327
$$ -221024 -236776 -81307 -3731 -53641 -213382 -184059 -155606 -234319 -123884 -23702 -110029
14523a10029J5422n5451l7198J32490j956n0469L188J49671k2865j13580O3505
$$ -110029 -94607 -150058 -187256 -54766 -56722 -107191 -104003 45668 22803 -90777 -27272
14512b7272J554j30594J34385P9435J0866j8438k2410Q1714r9096j57702j18148
$$ -27272 -25718 -156312 -21927 57508 68374 49936 27526 109240 10144 -147558 -265706
14501b65706j1074j922J26289J12655J33009j28901m8772J12548k3942j57545
$$ -265706 -276780 -278702 -152413 -39758 93251 -35650 -84422 28126 4184 -153361
14491a53361Q5896J06161p7675J3638m057j08275n7627N5036k8986j40939n5190
$$ -153361 -67465 38696 -38979 -25341 -29398 -137673 -195300 -140264 -169250 -310189 -365379
14480c65379K8583K1948L4831J44190J1629j215M9533J01220k2820J0456k6506
$$ -365379 -336796 -314848 -280017 -135827 -124198 -125413 -75880 25340 2520 12976 -13530
14469a3530M385N813m0044K7253O5296J30173q2398O4111j47002J9250J30921
$$ -13530 -9145 -3332 -43376 -16123 49173 179346 96948 161059 14057 33307 164228
14458A64228k4971K6424j36756j0769k1228m9160k2155Q5453p80k31011k4367
$$ 164228 139257 165681 28925 18156 -3072 -52232 -74387 11066 10286 -220725 -245092
14447b45092L9871P4150R1200P4420n9786j24108J4385J65046R5770j60807j00313
$$ -245092 -205221 -131071 -39871 34549 -25237 -149345 -134960 30086 125856 -34951 -135264
14436a35264n5757P0728J27157m7102p2690P1248Q1254j41309j22397J9721L7576
$$ -135264 -191021 -120293 6864 -40238 -112928 -41680 39574 -101735 -224132 -204411 -166835
14425a66835M3205N7536j5138j6324O6325L5029K8817K0221j42098M9372j1781
$$ -166835 -123630 -66094 -81232 -97556 -31231 3798 32615 52836 -89262 -39890 -51671
14414e1671J7525l084o0314L7038P4780J3377j03866o843P2066J27454M9775j27030
$$ -51671 -34146 -37230 -97544 -60506 14274 27651 -76215 -83058 -10992 116462 166237 39207
14402C9207k26855k2513K9967L5128J19279J24672L2315N5549N0171r6067j91954
$$ 39207 -187648 -210161 -180194 -145066 -25787 98885 131200 186749 236920 140853 -51101
14391e1101j6954K6409J0383m4104j03138R4329N3386M3507r4604j17052J37845
$$ -51101 -68055 -41646 -31263 -75367 -178505 -84176 -30790 12717 -81887 -198939 -61094
14380f1094Q2709P7646o0224q5741k8889k9742J53053Q9515j05239n6683J4956
$$ -61094 21615 99261 39037 -46704 -75593 -105335 47718 137233 31994 -24689 -9733
14369i733j16005r3528J05964l0788J50057R2006k8243k03612n690L1573N5805
$$ -9733 -125738 -219266 -113302 -144090 5967 97973 69730 -133882 -139572 -107999 -52194
14358e2194O4327M8284J16206m0310o7923p8050k4325j6884q3520L8210K059l959
$$ -52194 12133 60417 176623 136313 68390 -9660 -33985 -50869 -134389 -96179 -94120 -98079
14346i8079m5262n7998p523P1015J22369P654q3894j04646p2913L2728n681O6543
$$ -98079 -143341 -201339 -208862 -137847 -15478 -7824 -91718 -196364 -269277 -236549 -242230 -175687
14334a75687M0962k5571O6467J30533j12226m5913M7160J22329k401j25698o0950
$$ -175687 -134725 -160296 -93829 36704 -75522 -121435 -74275 48054 45653 -80045 -140995
14323a40995P8065R1496L9988l7996q8024j78249Q6161N9174l7640J1528P1183
$$ -140995 -62930 28566 68554 30558 -57466 -235715 -149554 -90380 -128020 -116492 -45309
14312d5309P9881k7184p7144k2450P4812o5099J5784m0062L8663Q4849O7006n9197
$$ -45309 34572 7388 -69756 -92206 -17394 -82493 -66709 -106771 -68108 16741 83747 24550
14300B4550r4879m8454Q3063K6482o8492l1102O2634J70040P8402M4016J4476
$$ 24550 -70329 -118783 -35720 -9238 -77730 -108832 -46198 123842 202244 246260 260736
14289B60736o0773K1511r9846j40530o0370M0968N0107P9778N505p6454j14782
$$ 260736 199963 221474 121628 -18902 -79272 -38304 11803 91581 97086 20632 -94150
14278i4150o3325N8924M4912k9753o0515J25549P2352q0676N6439L7318o7711
$$ -94150 -157475 -98551 -53639 -83392 -143907 -18358 53994 -26682 29757 67075 -636
14267f36o4066m3638p7249P5805n147R4092K0461j83966l7335J34469J11960q5689
$$ -636 -64702 -108340 -185589 -109784 -114931 -20839 -378 -184344 -221679 -87210 24750 -60939
14255f0939K0610K1831J2480q540o3355k9741P7903J13252m4287j67019m1835
$$ -60939 -40329 -18498 -6018 -14558 -77913 -107654 -29751 83501 39214 -127805 -169640
14244a69640r5260L1724R2930O9256K5339Q7904M6245p0729j19819j361j11819
$$ -169640 -264900 -233176 -140246 -70990 -45651 42253 88498 17769 -102050 -103411 -215230
14233b15230j39048J67814J52372n8149l3240p2247O9473J88657K4116n0881J00183
$$ -215230 -354278 -186464 -34092 -92241 -125481 -197728 -128255 60402 84518 33637 133820
14222A33820L4528j60581k2133L0000O0601q324p9706j07529R6467L7815p8460
$$ 133820 168348 7767 -14366 15634 76235 67911 -11795 -119324 -22857 14958 -63502
14211f3502N3864N7445N2213Q23n3290r017j03683R7714l3681L7000R8786O4498
$$ -63502 -9638 47807 100020 100843 47553 38536 -65147 32567 -1114 35886 134672 199170
14199A99170j68159j22793L6994J07254j4779l0379L1667K7869j34910J2303J94779
$$ 199170 31011 -91782 -54788 52466 37687 7308 38975 66844 -68066 -55763 139016
14188A39016O2037j4103m0769k4130J00659j04904k9124m6572p5013r5971o6685
$$ 139016 201053 186950 146181 122051 222710 117806 88682 42110 -32903 -128874 -195559
14177a95559N9136Q0183L7779M1772m2226j08699Q6658P4125K3976n1984j11797
$$ -195559 -136423 -56240 -18461 23311 -18915 -127614 -40956 33169 57145 5161 -106636
14166a06636j01350n0756L2617J1947O3132J05640N5620O6901K6236q9068O4632
$$ -106636 -207986 -258742 -226125 -214178 -151046 -45406 10214 77115 103351 14283 78915
14155G8915k0195j31895q8162l0149M9317N9260J3031k089N4962J00979O10j0334
$$ 78915 58720 -73175 -161337 -191486 -142169 -82909 -69878 -71967 -17005 83974 84584 74250
14143G4250L8187J1747n5513K0427R8086O8860j33500o5623q9382k1063p3778
$$ 74250 112437 124184 68671 89098 187184 256044 122544 56921 -32461 -53524 -127302
14132a27302j42095O3109Q8778J43038Q4379J1387q7360r7840k9687q2942J2940
$$ -127302 -269397 -206288 -117510 25528 109907 121294 33934 -63906 -93593 -176535 -163595
14121a63595Q0756k4621j40131J01331J20944K9727j7315r1459m938r882l094
$$ -163595 -82839 -107460 -247591 -146260 -25316 4411 -12904 -104363 -109301 -119183 -122277
14110a22277j43800k7879J39327R9403J13620R9632k1231m3677j02862j42049
$$ -122277 -266077 -293956 -154629 -55226 58394 158026 136795 93118 -9744 -151793
14100a51793K7291L5306j04133M332J81969O7923k5575r8530m007j22386l6800
$$ -151793 -124502 -89196 -193329 -188997 -7028 60895 35320 -63210 -67217 -189603 -226403
14089b26403m6867m9443p0864J17447N5976J68325O7301N5907K8565k13937j1577
$$ -226403 -273270 -322713 -393577 -276130 -220154 -51829 15472 71379 99944 -113993 -125570
14078a25570J36689l0755l9466n6393J18903N0124j38296Q29P5741j3443L0304
$$ -125570 11119 -19636 -59102 -115495 3408 53532 -84764 -83935 -8194 -21637 8667
14067H667k2755r230L7388M0044J11813k2020j24078o4008l1054N8636R1466p5785
$$ 8667 -14088 -23318 14070 54114 165927 143907 19829 -44179 -75233 -16597 74869 -916
14055i16o593j7845l8230m7680N0148K8805J6897Q1532J7670r4111l6759j0877
$$ -916 -7509 -25354 -63584 -111264 -61116 -32311 -15414 66118 83788 -10323 -47082 -57959
14043e7959J15833o3855j58063m7816l6484Q7430N2561l3308L3362P7714P2482
$$ -57959 57874 -5981 -164044 -211860 -248344 -160914 -108353 -141661 -108299 -30585 41897
14032D1897k3652o5350p1227J48004R1355l1248K2680Q9102p7150o7974j70943
$$ 41897 18245 -47105 -118332 29672 121027 89779 112459 201561 124411 56437 -114506
14021a14506K8491J09973N931J52530O7562j37266M3119M4799j76145m9711P9728
$$ -114506 -86015 23958 29889 182419 249981 112715 155834 200633 24488 -25223 54505
14010E4505j4988p0967M8290J5540o3426j4941k2346J42415J8871j84223q3347
$$ 54505 39517 -31450 16840 32380 -31046 -45987 -68333 74082 92953 -91270 -174617
13999a74617N0943Q576j02296j948j8589m8049M9977P7421j63820P9686O5329
$$ -174617 -123674 -115098 -217394 -219342 -237931 -285980 -236003 -158582 -322402 -242716 -177387
13988a77387K8160P7788K8023n0940M5532Q9052k0164N382p7760L3320p5185j21038
$$ -177387 -149227 -71439 -43416 -94356 -48824 40228 20064 25446 -52314 -18994 -94179 -215217
13976b15217J0256m597M4293R0118O9393n1168n3331J25084k8306q00q7044J664
$$ -215217 -204961 -209558 -165265 -75147 -5754 -56922 -110253 14831 -13475 -14275 -101319 -99655
13964i9655M2009J3719l0244q5456J1501k4150p180K21895J29024m1821j50082
$$ -99655 -57646 -43927 -74171 -159627 -148126 -172276 -179456 42439 171463 129642 -20440
13953b0440n5165p8308l6945J9572Q5504O5771p8971j06131P9607J32252N5533
$$ -20440 -75605 -153913 -190858 -171286 -85782 -20011 -98982 -205113 -125506 6746 62279
13942F2279k1154q5433q718P0993m5594R420N2569k8906k0462j3422n2843q1826
$$ 62279 41125 -44308 -53026 17967 -27627 -18207 34362 5456 -15006 -28428 -81271 -163097
13930a63097j36545K13585J18601p5593m062K1064K09494R1610j0209j274q0265
$$ -163097 -299642 -86057 32544 -43049 -47111 -26047 183447 275057 264848 263574 183309
13919A83309q5044L3745m7908j52528o5473m119L9253J17559Q8039o8939J38209
$$ 183309 98265 132010 84102 -68426 -133899 -138018 -98765 18794 106833 37894 176103
13908A76103l083k55385M8483P4444K2870J51992j6333j88401q5925p1890k7765
$$ 176103 173020 -82365 -33882 40562 63432 215424 199091 10690 -75235 -147125 -174890
13897a74890J5195J19985K951o9213k6257R0705J19238j1028j15502Q7939R0857
$$ -174890 -159695 -39710 -36759 -105972 -132229 -41524 77714 66686 -48816 39123 129980
13886A29980J8066P1527q6132j10188m1912M8852P0164k1280m6385m4798n9931
$$ 129980 148046 219573 133441 23253 -18659 30193 100357 79077 32692 -12106 -72037
13875g2037r463J42565J41126j7218o0837j0829K5955P055N4884l4232m6100p3781
$$ -72037 -81500 61065 202191 184973 124136 113307 139262 146317 201201 166969 120869 47088
13863D7088J2577J5325j43967q487K00521J31363O8031n5123Q4431o4316j15447
$$ 47088 59665 74990 -68977 -77464 123057 254420 322451 267328 351759 287443 171996
13852A71996j45782J3489L2220p912N7752R1338q7217j72285J08486n381J1950
$$ 171996 26214 39703 71923 64011 121763 213101 125884 -46401 62085 56704 68654
13841F8654j7123J356j13823p6464m518P7868l9691Q672Q5868N3523l9599j14972
$$ 68654 51531 52887 -60936 -137400 -141918 -64050 -103741 -95069 -9201 44322 4723 -110249
13829a10249j26217J26043J04036N0724j25021l3773K1269N8321l4587J28110
$$ -110249 -236466 -110423 -6387 44337 -80684 -114457 -93188 -34867 -69454 58656
13819E8656J26273K0660j21845j81783m0612M6408K5296L0058J3586l2207M9500
$$ 58656 184929 205589 83744 -98039 -138651 -92243 -66947 -36889 -23303 -55510 -6010
13808f010j4204J7419j1159n976J1514K5228m6538O422N6378j06843J1309J41028
$$ -6010 -20214 -2795 -13954 -19930 -8416 16812 -29726 -23304 33074 -73769 -62460 78568
13796G8568J27370j52081j68796l0364Q6468J53078L1816p4380M3319j65146q6269
$$ 78568 205938 53857 -114939 -145303 -58835 94243 126059 51679 94998 -70148 -156417
13785a56417J1539R9602n203o1443q1075m9433J56721J91654l2322J6652l5016
$$ -156417 -144878 -45276 -50479 -111922 -192997 -242430 -85709 105945 73623 90275 55259
13774E5259p5505j6607M1607K6512l0400r5391n2672j21369J05093J33007K0346
$$ 55259 -20246 -36853 4754 31266 866 -94525 -147197 -268566 -163473 -30466 -10120
13763a0120J27406n5288p7905J39218K1254p6977k4189l4263n9031p9875M7262
$$ -10120 117286 61998 -15907 123311 144565 67588 43399 9136 -49895 -129770 -82508
13752h2508J30475P6556o9614M4470l4866j15928J9937j6907J9705R3014J04097
$$ -82508 47967 124523 54909 99379 64513 -51415 -31478 -48385 -28680 64334 168431
13741A68431q831K2802K3966j07060k1292n0679j5207K5474N4459q0003J10889
$$ 168431 159600 182402 206368 99308 78016 27337 12130 37604 92063 12060 122949
13730A22949M0228n8129j7434J25835j55625j00527J2471O7907K7182K42591P4530
$$ 122949 163177 105048 87614 213449 57824 -42703 -30232 37675 64857 307448 381978
13719C81978j4993j19561l8564m6500j82468J14567J21301L9516K1939m9589k0806
$$ 381978 366985 247424 208860 162360 -20108 94459 215760 255276 277215 227626 206820
13708B06820p2697l6516n590q5579j4138j16773Q9858k9166P5951Q8094R2235
$$ 206820 134123 97607 92017 6438 -7700 -124473 -34615 -63781 12170 100264 192499
13697A92499L9132j4530q4264m2597k5289J5127r5129N0560l4052N1849L3731
$$ 192499 231631 217101 132837 90240 64951 80078 -15051 35509 1457 53306 87037
13686H7037M6191N7591n8287j51779M1738q161K4357R105j16794M4654P9287r816
$$ 87037 133228 190819 132532 -19247 22491 14330 38687 47792 -69002 -24348 54939 45123
13674D5123l3176N252j8144j10656M8867p1224J6475J07460k1995j20845J57220
$$ 45123 11947 17199 -945 -111601 -62734 -133958 -117483 -10023 -32018 -152863 4357
13663D357R4221Q0853R555n9517r0831p634J09990n0433j69078j6760m8040J14940
$$ 4357 98578 179431 188986 129469 38638 31004 140994 90561 -78517 -95277 -143317 -28377
13651b8377R4082p9310n7480M5880J04796K459l4518r3911l3620J34769n625J3092
$$ -28377 65705 -13605 -71085 -25205 79591 82050 47532 -46379 -79999 54770 49145 62237
13639F2237K2228R474l3239j38508K1363Q0054o193q1244k2366R9985L7783R3181
$$ 62237 84465 93939 60700 -77808 -56445 23609 17416 -63828 -86194 13791 51574 144755
13627A44755O6293k5285j11691o2977L3516R6211M8585m827J7153O2025J8894
$$ 144755 211048 185763 74072 11095 44611 140822 189407 184580 201733 263758 282652
13616B82652j47427j55815N9832P1206k2965n9503p7727J45423M1193r1261Q2307
$$ 282652 135225 -20590 39242 110448 87483 27980 -49747 95676 136869 45608 127915
13605A27915q136j28649l8997P0645P044o2078J35716M5858J75503M7085j94089
$$ 127915 119779 -8870 -47867 22778 29822 -32256 103460 149318 324821 371906 177817
13594A77817j63254o8049p817n7470m9140J4815J67882J30906O9283k3488p8309
$$ 177817 14563 -53486 -61303 -118773 -167913 -153098 14784 145690 214973 191485 113176
13583A13176p5690Q5702J04919J81519O3289j50635j05515j307n583l7009m3958
$$ 113176 37486 123188 228107 409626 472915 322280 216765 215458 209875 172866 128908
13572A28908m245K8094j2493r0566k9272j51458j8517J64757P1919L182n2528
$$ 128908 124663 152757 140264 49698 20426 -131032 -149549 15208 87127 90309 37781
13561C7781K0065j84730j8757J27361P6819J4829N0315L4301j6337R6626j09949
$$ 37781 57846 -126884 -145641 -18280 58539 73368 123683 157984 141647 238273 128324
13550A28324L8112p9208j570J1910P7273N9426j27848n6097K1914J25663R5572
$$ 128324 166436 87228 85658 97568 174841 234267 106419 50322 72236 197899 293471
13539B93471l7631j17491k1571N3225j20826j7762L197m7033K7908l2847m3376
$$ 293471 255840 138349 116778 170003 49177 31415 34612 -12421 15487 -17360 -60736
13528f0736J77732J13450j59214k1466O4178j9201j33368J6335J43755l7286J2473
$$ -60736 116996 230446 71232 49766 113944 94743 -38625 -22290 121465 84179 96652
13517I6652k4170j28039J06777J21739O4825l3743j42275Q1840N7319k04038q9026
$$ 96652 72482 -55557 51220 172959 237784 204041 61766 143606 200925 -3113 -92139
13506i2139n602O3967Q9023L3963j14692O1672J09030K7901j36952J8225J3031
$$ -92139 -97741 -33774 55249 89212 -25480 36192 145222 173123 36171 54396 67427
13495F7427j0925J16620j49066j81883J17957j5503Q2642k7174j4232m9311M415
$$ 67427 56502 173122 24056 -157827 -39870 -55373 27269 95 -14137 -63448 -59033
13484e9033j556k2884K9431J38985L2539N08M7120q9335j12221K2413N5845J26010
$$ -59033 -60589 -83473 -54042 84943 117482 117990 165110 75775 -36446 -14033 41812 167822
13472A67822p8632N6504K35145k309k8700j48085j69094j8906o9655K8961K6154
$$ 167822 89190 145694 380839 378530 349830 201745 32651 13745 -55910 -26949 -795
13461g95L3257o8895R0739J69556L0872Q4328r7904j12476o2653K6497O9399j8673
$$ -795 32462 -36433 54306 223862 254734 339062 241158 128682 66029 92526 161925 143252
13449A43252n8409J3376m3230K2583M8418l8855n2139m646N3805N5211J10051
$$ 143252 84843 98219 54989 77572 125990 87135 34996 30350 84155 139366 249417
13438B49417J14823o9141j55389J1294j64902J07955L3195n5302p4234j05618
$$ 249417 364240 295099 139710 151004 -13898 94057 127252 71950 -2284 -107902
13428a07902M6717J04493m1969n2812l638L8344p2909q3418R5161J76035N9204
$$ -107902 -61185 43308 1339 -51473 -55111 -16767 -89676 -173094 -77933 98102 157306
13417A57306J12397N5163j20948n4175j1991Q036J41673O7823n5916j23096j1828
$$ 157306 269703 324866 203918 149743 137752 145788 287461 355284 299368 176272 164444
13406A64444l8471J3430N2285Q9334N9479p3423j06429j49374J23271J55124R3219
$$ 164444 125973 139403 191688 281022 340501 267078 160649 11275 134546 289670 382889
13395C82889M0396j04435j0545j1422q7560q3240l9648M0499J7632j57361k6013
$$ 382889 423285 318850 308305 296883 209323 126083 86435 126934 144566 -12795 -38808
13384c8808P1900l6516Q303K35544J3774j43727j79433k001J20221P8940J4891
$$ -38808 33092 -3424 4879 240423 254197 110470 -68963 -70964 49257 128197 143088
13373A43088P0292O892L020p1414l836n0058n9324R572l7438r667J6777j30504
$$ 143088 213380 220272 223292 151878 148042 97984 38660 48232 10794 1127 17904 -112600
13361a12600l6231K14665N5295r6957R1547L5519l2324N1733J01145j11032M1756
$$ -112600 -148831 65834 121129 24172 115719 151238 118914 170647 271792 160760 202516
13350B02516Q6740k5492r0548r6063N7364J3102N8493R2465k8869M7470Q355j06822
$$ 202516 289256 263764 173216 77153 134517 147619 206112 298577 269708 317178 325533 218711
13338B18711K9089j1086k8753l8688n1455J44L0836k9987J71732J86712o9742
$$ 218711 247800 236714 207961 169273 117818 117962 148798 118811 290543 477255 407513
13327D07513j44721r4632J7179N4603O7713N2462j04800m7673L0961q8277j22169
$$ 407513 262792 168160 185339 239942 307655 360117 255317 207644 238605 150328 28159
13316B8159J28840l5339p734j3662P3435J41123J4921L7378r2938j74133o040
$$ 28159 156999 121660 113926 100264 173699 314822 329743 367121 274183 100050 94010
13305I4010P7976J08149j43444p2371p1125N0504J18336P0458J3082m5878m6585
$$ 94010 171986 280135 136691 64320 -6805 43699 162035 232493 245575 199697 153112
13294A53112J00972J04803L0836N237k9026l3240P946n2688k3152k2326o3525
$$ 153112 254084 358887 389723 394960 365934 332694 340640 287952 264800 242474 178949
13283A78949k646q0386N1225Q2843m0096l1872J4568k3460j43514O913M9191N1428
$$ 178949 176303 95917 147142 229985 189889 158017 172585 149125 5611 12524 61715 113143
13271A13143J28306p8905j50676j6322m6419n0687M4653Q5030J62245J8284J35515
$$ 113143 241449 162544 11868 -4454 -50873 -101560 -56907 28123 190368 208652 344167
13260C44167L8141M3826k2274j0858m4220j08037p5870P4341R3773l008J7070
$$ 344167 382308 426134 403860 393002 348782 240745 164875 239216 332989 329981 347051
13249C47051m2872k7397O8943Q6947N6701j26362j49447n9603Q3976R4761k9950
$$ 347051 304179 276782 345725 432672 489373 363011 213564 153961 237937 332698 302748
13238C02748k0909n1253r793J40633j43499l8600k8868L0538n3309j73460j70409
$$ 302748 281839 230586 220793 361426 217927 179327 150459 180997 127688 -45772 -216181
13227b16181N7101J56610K6549N7473J8085j02565L0798J3016J3767j2620j10540
$$ -216181 -159080 -2470 24079 81552 99637 -2928 27870 40886 54653 42033 -68507
13216f8507O2575J59365o2213P8349R1831m2671R954k9969j38801P2712J68624
$$ -68507 -5932 153433 91220 169569 261400 218729 228683 198714 59913 132625 301249
13205C01249K1103k5120q1743R2885r512p0296N7148l9207p0384Q848p3140O0207
$$ 301249 322352 297232 215489 308374 298862 228566 285714 246507 176123 184971 111831 172038
13193A72038M5674p5667K4232l4565j49108J19377O8633J05375Q7493p6862l004
$$ 172038 217712 142045 166277 131712 -17396 101981 170614 275989 363482 286620 283616
13182B83616N5702p810j06604m9137O371j50900N027R0378j7815J15231Q6393
$$ 283616 339318 331508 224904 175767 182138 31238 36265 126643 108828 224059 310452
13171C10452K6499K3825j62844m4775L0125M3902L3892n7615N1814M2596k2479
$$ 310452 336951 360776 197932 153157 183282 227184 261076 203461 255275 297871 275392
13160B75392k9364J80993n5189o0168J3287l2339j00255Q1310Q9745J55993q5013
$$ 275392 246028 427021 371832 311664 324951 292612 192357 273667 363412 519405 434392
13149D34392n8000m6K0595j33534n2401m7153K4352J13530n0288k02182p6103
$$ 434392 376392 376346 396941 263407 211006 163853 188205 301735 251447 49265 -26838
13138b6838J86574M8589m4247l0699L0358R352M1378r3969L3143M6167k5512J03058
$$ -26838 159736 208325 164078 133379 163737 173089 214467 120498 153641 199808 174296 277354
13126B77354r4690q0101N5953O7131R2792P5611K5560r2818k7864r2254m2940
$$ 277354 182664 102563 158516 225647 318439 394050 419610 326792 298928 206674 163734
13115A63734J4125n935k5855k3243q247J9083K1077l5123p5338m7841M9252O9196
$$ 163734 177859 171924 146069 122826 114579 133662 154739 119616 44278 -3563 45689 114885
13103A14885Q8178O0674K6732j64875k7257R4101O1366J66319O1321m3211j72755
$$ 114885 203063 263737 290469 125594 98337 192438 253804 420123 481444 438233 265478
13092B65478j89607o8470O3033N2505Q4132J46973j11415J81807L9745l3120r3780
$$ 265478 75871 7401 70434 122939 207071 354044 242629 424436 464181 431061 337281
13081C37281M8469j5386j22795j2386k4483j0208J83662R0981J02768j03007P585
$$ 337281 385750 370364 247569 235183 210700 200492 384154 475135 577903 474896 482481
13070D82481n4665m61J90267j9430q8195j89199j09104k0277J99158J89480q0029
$$ 482481 427816 427355 617622 598192 509997 320798 211694 191417 390575 580055 500026
13059E00026L3353k4225l5135l2726o5450p2341q8294k6999R5880R9055L8918
$$ 500026 533379 509154 474019 441293 375843 303502 215208 188209 284089 383144 422062
13048D22062l6406q7949q034r739K9951o0739R2103P2185n2930j35600O8218J07193
$$ 422062 385656 297707 289673 279934 309885 249146 341249 413434 360504 224904 293122 400315
13036D00315p759k7571p1861j3948Q0522O4820K6152j00590j18955P8059p995
$$ 400315 392556 364985 293124 279176 359698 424518 450670 350080 231125 309184 301189
13025C01189O9836o3230o2384N8541P570k9034J2543j7892l8465p4749l9168K0699
$$ 301189 371025 307795 245411 303952 311522 282488 295031 277139 238674 163925 124757 145456
13013A45456O251N2380O5697P8125q708j32317P4463n9116O4828M3597m5926n6004
$$ 145456 151707 204087 269784 347909 339201 206884 281347 222231 287059 330656 284730 228726
13001B28726m445M7243O2554O5948j30617j06592K06648J59834m1149k6607M1126
$$ 228726 224281 271524 334078 400026 269409 162817 369465 529299 488150 461543 502669
12990E02669k0767j22865r9591M4991J6640R5961r7384r4023N7299o9666N5894
$$ 502669 481902 359037 259446 304437 321077 417038 319654 225631 282930 213264 269158
12979B69158L3409j01989R2871J16100J4968L4779o5138r720P5891k118o5437
$$ 269158 302567 200578 293449 409549 424517 459296 394158 384438 460329 458211 392774
12968C92774j04232j0730J79989Q9840j16836p7934O3463p59P9480q9824O7104
$$ 392774 288542 277812 457801 547641 430805 352871 416334 415575 495055 405231 472335
12957D72335o7916j23716J8776P4746j7365o7084N050l386N2022J00106n2187
$$ 472335 404419 280703 299479 374225 356860 289776 294826 291440 343462 443568 391381
12946C91381j04029j06379K2170J30385J01910O2904q1659j6566K6962K6891J20099
$$ 391381 287352 180973 203143 333528 435438 498342 416683 400117 427079 453970 574069
12935E74069J4221o7368q1707p6037O2191J01309l3542r4504j50289M16J21810
$$ 574069 588290 520922 439215 363178 425369 526678 493136 398632 248343 248759 370569
12924C70569O8968l0403Q2577O5185j43430j5619L5764J09346m7096j21174r4506
$$ 370569 439537 409134 491711 556896 413466 397847 433611 542957 495861 374687 280181
12913B80181J60714K5255p3294k8462r0392l5153m2602J94234P5859M0442p0117
$$ 280181 440895 466150 392856 364394 274002 238849 196247 390481 466340 506782 436665
12902D36665m1657Q0925Q6923J5010j14399l1814P4339p9656p0068J3000n2578
$$ 436665 395008 475933 562856 577866 463467 431653 505992 426336 356268 369268 316690
12891C16690q2624K8866R0327J71653P4648J5946M1749J0130j4191j7171n1015
$$ 316690 234066 262932 353259 524912 599560 615506 657255 667385 653194 636023 585008
12880E85008m888o499K9418j59597k5883l484j9941L9264n7562J5564M283j2587
$$ 585008 580120 573621 603039 443442 417559 414075 394134 433398 375836 391400 395683 383096
12868C83096J07569P9397m1743j03334q771K1315O2301n880M5901l2700M727j04250
$$ 383096 490665 570062 528319 424985 416214 437529 499830 493950 539851 507151 511878 407628
12856D07628p9228K1371M2636M5385J30350J92808Q5895o5980j43461j7313K442
$$ 407628 328400 349771 392407 437792 568142 760950 846845 780865 637404 620091 622533
12845F22533N9060L2438l7121m1676R136j11295o8756K1509K4708k4500K2407
$$ 622533 681593 714031 676910 635234 644370 533075 464319 485828 510536 486036 508443
12834E08443J29982P3178j30773L3640P8230m6032M3411j31528q8327j08J30999
$$ 508443 638425 711603 580830 614470 692700 646668 690079 558551 470224 470116 601115
12823F01115J55784l3857j19256p5893j502l7341J02796P5181n4930j32713K35291
$$ 601115 756899 723042 603786 527893 526391 489050 591846 667027 612097 479384 714675
12812G14675K27060r7967k28269p103M7059j2923k3724q881r3919k864P7900K1215
$$ 714675 941735 843768 615499 608396 655455 642532 618808 609927 516008 513144 591044 612259
12800F12259n4059Q7269M9043K7103o0980p3157L8956k2757j18645n6602P9532
$$ 612259 558200 645469 694512 721615 660635 587478 626434 603677 485032 428430 507962
12789E07962L5816Q6336R5263j4146p396j03767k652P2147P6415o2976r7995J12815
$$ 507962 543778 630114 725377 711231 703835 600068 597416 669563 745978 683002 585007 697822
12777F97822J38657j01313k1981L3526k6495j39064K0686J8177j24987J42518
$$ 697822 836479 735166 713185 746711 720216 581152 601838 620015 495028 637546
12767F37546Q4715o2789p9681K1495R1686N6935j9354J68375J9507n0574o385
$$ 637546 722261 659472 579791 601286 692972 749907 730553 898928 918435 867861 861476
12756H61476k4838n6154k6798n414L0846o7950P7894J1663p8050q7195P6390J83730
$$ 861476 836638 780484 753686 748272 779118 711168 789062 800725 722675 635480 711870 895600
12744H95600M8826K1452L1311N7271j05915j07144n8227l561M7718n0210K2591
$$ 895600 944426 965878 997189 1054460 948545 841401 783174 779613 827331 777121 799712
12733G99712R6095L609L4451O4885j61791n1112o8844p6405J7962l429j70191
$$ 799712 895807 899416 933867 998752 836961 785849 717005 640600 658562 655133 484942
12722D84942N2765J67380J26809p7342l5877K5196l6687J2276J65057O4852j23802
$$ 484942 537707 705087 831896 754554 718677 743873 707186 719462 884519 949371 825569
12711H25569q5448l9683l7339J20169L4787P0411K4256Q9296j86224j17712M2674
$$ 825569 740121 700438 663099 783268 818055 888466 912722 1002018 815794 698082 740756
12700G40756J07469j8867K5838K4189N0389L7908M6938J36783O1089r6191k35076
$$ 740756 848225 829358 855196 879385 929774 967682 1014620 1151403 1212492 1116301 881225
12689H81225l4512k2546R9568L2457K0224N3991P2377p4270j24693p6737j3940
$$ 881225 846713 824167 923735 956192 976416 1030407 1102784 1028514 903821 827084 813144
12678H13144j19536J51775R8753n3978n9446P6091J49938J09873r4439j02829
$$ 813144 693608 845383 944136 890158 830712 906803 1056741 1166614 1072175 969346
12668I69346R682n605K1131o2084Q245J53794P5811j02647j76465K3715J9591
$$ 969346 979028 973423 994554 932470 940715 1094509 1170320 1067673 891208 914923 934514
12657I34514m7632j8191K0349k1329l4977j6653N6369K3432j03827P7087J71371
$$ 934514 886882 868691 889040 867711 832734 816081 872450 895882 792055 869142 1040513
12646A040513p6203j3180N835m1242j83890J17219J22943J36932R149k06j09235
$$ 1040513 964310 951130 956965 915723 731833 849052 971995 1108927 1118076 1117870 1008635
12635A008635K4722J10552j6866M3362O000m6512n3119J060N8713K0406l7151
$$ 1008635 1033357 1143909 1127043 1170405 1176405 1129893 1076774 1077834 1136547 1156953 1119802
12624A119802O7156K2535j28336n5020K550q1262N4200J83072K8757L3747o0195
$$ 1119802 1186958 1209493 1081157 1026137 1028687 947425 1001625 1184697 1213454 1247201 1187006
12613A187006q2677r3509L5330P3039N3160M0301p7378K0613M3384j0817K2023
$$ 1187006 1104329 1010820 1046150 1119189 1172349 1212650 1135272 1155885 1199269 1188452 1210475
12602A210475J7610o0124J05525p4380N3909J28785n6247p2825J7318J6691p8650
$$ 1210475 1228085 1167961 1273486 1199106 1253015 1381800 1325553 1252728 1270046 1286737 1208087
12591A208087K8945p045j8977q1572K545k8226K82595J24001k7605o112q128j34816
$$ 1208087 1237032 1229987 1211010 1129438 1131983 1103757 1386352 1510353 1482748 1476636 1468508 1333692
12579A333692k0417J04890K187m1522j5082N792j9826o3011o6982m4530k9763
$$ 1333692 1313275 1418165 1420352 1378830 1363748 1369540 1349714 1286703 1219721 1175191 1145428
12568A145428P2470n6029j6186R9519M6322J50259R9663p3007j32770r4047k1508
$$ 1145428 1217898 1161869 1145683 1245202 1291524 1441783 1541446 1468439 1335669 1241622 1220114
12557A220114O4763K2612j7682J57986R5509p1475k0181N1844P3352J4897j23061
$$ 1220114 1284877 1307489 1289807 1447793 1543302 1471827 1451646 1503490 1576842 1591739 1468678
12546A468678m1687J15881N1041o8439Q8935N2078K5812j02163q6371P3479K923
$$ 1468678 1426991 1542872 1593913 1525474 1614409 1666487 1692299 1590136 1503765 1577244 1580167
12535A580167j16408J3033Q1985M2734J4023M2545P5104p718L5829M8835p0870
$$ 1580167 1463759 1476792 1558777 1601511 1615534 1658079 1733183 1725465 1761294 1810129 1739259
12524A739259j93378j08163J552O9886L3114K0084r393Q8145n4814o0316Q9751
$$ 1739259 1545881 1437718 1439270 1509156 1542270 1562354 1552961 1641106 1586292 1525976 1615727
12513A615727Q4552J06441j1217j2520n8467m6460N2577J7282J32859Q4398r3108
$$ 1615727 1700279 1806720 1795503 1782983 1724516 1678056 1730633 1747915 1880774 1965172 1872064
12502A872064N6349M7091J66620O173k87925j53771Q2666J44805J16232l7065
$$ 1872064 1928413 1975504 2142124 2148297 1860372 1706601 1789267 1934072 2050304 2013239
12492B013239o4190r3529M1581P1964m5606k3251J3427o0065N1090K30118O1163
$$ 2013239 1949049 1855520 1897101 1969065 1923459 1900208 1913635 1853570 1904660 2134778 2195941
12481B195941p0200j25320n5163K6600j786M3419P2154M7128j5716L3328q8794
$$ 2195941 2125741 2000421 1945258 1971858 1970072 2013491 2085645 2132773 2117057 2150385 2061591
12470B061591m6025L9959J08749k0867O8821N8436N760j503l2261k9405L4783
$$ 2061591 2015566 2055525 2164274 2143407 2212228 2270664 2276424 2274921 2242660 2213255 2248038
12459B248038J57753j7271p3272k9078l782m9941L2371O4475N3140Q0768k0916
$$ 2248038 2405791 2388520 2315248 2286170 2282388 2232447 2264818 2329293 2382433 2463201 2442285
12448B442285J6210J07144J07806N4318N0813m6971j4673J0660r5954o6302Q1597
$$ 2442285 2458495 2565639 2673445 2727763 2778576 2731605 2716932 2727592 2631638 2565336 2646933
12437B646933j30246k3800l0842J89212J24524J13637o6074P0758P7281M0483
$$ 2646933 2516687 2492887 2462045 2651257 2775781 2889418 2823344 2894102 2971383 3011866
12427C011866o0102l7244l1337k2618Q9452J6979n4591q1248J06729l7605K5325
$$ 3011866 2951764 2914520 2883183 2860565 2950017 2966996 2912405 2831157 2937886 2900281 2925606
12416B925606l1837q1990q3290Q724J59827R9209O6238k1212j26967m3329R9158
$$ 2925606 2893769 2811779 2728489 2737213 2897040 2996249 3062487 3041275 2914308 2870979 2970137
12405B970137j18968J25424Q2838j5051j0122P0805J01688M2084p1399j96681
$$ 2970137 2851169 2976593 3059431 3044380 3034258 3105063 3206751 3248835 3177436 2980755
12395B980755p9392P5649P4753J03499J33416N8413m3936q4033P1763J04059j8531
$$ 2980755 2901363 2977012 3051765 3155264 3288680 3347093 3303157 3219124 3290887 3394946 3376415
12384C376415K8278J3679J29138K06993P4298p8149j96242j07374N0204J32185
$$ 3376415 3404693 3418372 3547510 3754503 3828801 3750652 3554410 3447036 3497240 3629425
12374C629425Q5191K6768J04509j5043k1257o7891l2626J59222M7696J1315J37488
$$ 3629425 3714616 3741384 3845893 3830850 3809593 3741702 3709076 3868298 3915994 3927309 4064797
12363D064797K5358O1925J4451j12380r4849j00556P7140N3416p869M9770J47831
$$ 4064797 4090155 4152080 4166531 4054151 3959302 3858746 3935886 3989302 3981433 4031203 4179034
12352D179034Q1430L4088o704k8594l358P7868m0481n1334R9802J2976o7961K04920
$$ 4179034 4260464 4294552 4287848 4259254 4255896 4333764 4293283 4241949 4341751 4354727 4286766 4491686
12340D491686K72197q0599l1231J1468R9934J3465m5760l8189J497k4016P1837
$$ 4491686 4763883 4683284 4652053 4663521 4763455 4776920 4731160 4692971 4694468 4670452 4742289
12329D742289L9188n6479O8279J63447Q6848n1823P3483J11327L8623n1745M6221
$$ 4742289 4781477 4724998 4793277 4956724 5043572 4991749 5065232 5176559 5215182 5163437 5209658
12318E209658Q9200n8977o7057J45259O5196L4103n0513K5423r0437j3631L1582
$$ 5209658 5298858 5239881 5172824 5318083 5383279 5417382 5366869 5392292 5301855 5288224 5319806
12307E319806K4720J78889L1069r6595j4965N7937j4279M7666K46665J81272O2179
$$ 5319806 5344526 5523415 5554484 5457889 5442924 5500861 5486582 5534248 5780913 5962185 6024364
12296F024364N7669L9005j6505l203L7648N5908L2487j4101N1430L6636N8634
$$ 6024364 6082033 6121038 6104533 6101330 6138978 6194886 6227373 6213272 6264702 6301338 6359972
12285F359972L6303M8236M1718n8372k1679r7903L8992J41334J02955N0366J09986
$$ 6359972 6396275 6444511 6486229 6427857 6406178 6308275 6347267 6488601 6591556 6641922 6751908
12274F751908J72952N5902J35903n1451M5089J74743j679r0298N2555Q5756J22149
$$ 6751908 6924860 6980762 7116665 7065214 7110303 7285046 7283367 7193069 7245624 7331380 7453529
12263G453529L355R2422K28552J17558p6399r4052o9860J1661r69J29972M8068
$$ 7453529 7456884 7549306 7777858 7895416 7819017 7724965 7655105 7666766 7665797 7795769 7843837
12252G843837j07283P869K37902K08454P8845p4156O0830J04448J03811Q1843
$$ 7843837 7736554 7744423 7982325 8190779 8269624 8195468 8256298 8360746 8464557 8546400
12242H546400r2301P5537P6394Q4107M9199J16342J04088N893N8262P1724j3859
$$ 8546400 8454099 8529636 8606030 8690137 8739336 8855678 8959766 8965659 9023921 9095645 9081786
12231I081786r8326K6658J26557R8965J40411K29341J01961N5036M5374o1519
$$ 9081786 8983460 9010118 9136675 9235640 9376051 9605392 9707353 9762389 9807763 9746244
12221I746244q4433O0495J34469J24616L8989J20913J97816J90209o9700l6795
$$ 9746244 9661811 9722306 9856775 9981391 10020380 10141293 10339109 10529318 10459618 10422823
12211A0422823J40838Q2675K3727p603J8285J2472R7875J04762O6449m597R8950
$$ 10422823 10563661 10646336 10670063 10662460 10680745 10693217 10791092 10895854 10962303 10957706 11056656
12200A1056656J93284L253Q0110J33419P5246N5628J10117J19602L5864k466q4538
$$ 11056656 11249940 11253193 11333303 11466722 11541968 11597596 11707713 11827315 11863179 11860713 11776175
12189A1776175R4205O7088J10843J09904J29572P7182N2372m9808n7204O6781
$$ 11776175 11870380 11937468 12048311 12158215 12287787 12364969 12417341 12367533 12310329 12377110
12179A2377110K08295K45447K21201J86952j1241K5405j8772p821J06696J34762
$$ 12377110 12585405 12830852 13052053 13239005 13227764 13253169 13234397 13226576 13333272 13468034
12169A3468034K64543O4086k2717m4353r6137N5828J94123J62492P7450Q5283
$$ 13468034 13732577 13796663 13773946 13729593 13633456 13689284 13883407 14045899 14123349 14208632
12159A4208632n7961j0662J12852L6265J399J49377J04635P4487P3211M3002K8996
$$ 14208632 14150671 14140009 14252861 14289126 14290525 14439902 14544537 14619024 14692235 14735237 14764233
12148A4764233P0255n6260Q2620M5960L2236J66255J4325o7941J19762J66307
$$ 14764233 14834488 14778228 14860848 14906808 14939044 15105299 15119624 15051683 15171445 15337752
12138A5337752r3251m1860J09580J13728k4436q211J70884L5860j481m5140J31453
$$ 15337752 15244501 15202641 15312221 15425949 15401513 15393302 15564186 15600046 15598565 15553425 15684878
12127A5684878J25839r6841M9385J48093J1927M3321J6485j05082L5494J39382
$$ 15684878 15810717 15713876 15763261 15911354 15923281 15966602 15983087 15878005 15913499 16052881
12117A6052881L9914j4375R6802N2768p6253r4710j848l4132J9524l2520j4897
$$ 16052881 16092795 16078420 16175222 16227990 16151737 16057027 16055179 16021047 16040571 16008051 15993154
12106A5993154P1056M4796l1167j39169m2990R0364M5226M2183J05240J6349n7199
$$ 15993154 16064210 16109006 16077839 15938670 15895680 15986044 16031270 16073453 16178693 16195042 16137843
12095A6137843j4507J949L555o8348L5539j29172j75936J39877K09903L0490j42563
$$ 16137843 16123336 16125285 16128840 16060492 16096031 15966859 15790923 15930800 16140703 16171193 16028630
12084A6028630j08967q415k11065j05888l2066J18101J09010l8237j69396j02041
$$ 16028630 15919663 15911248 15700183 15594295 15562229 15680330 15789340 15751103 15581707 15479666
12074A5479666k1089k972J00852m2930j49054j58797j12474L576r564Q2163K8936
$$ 15479666 15458577 15455605 15556457 15513527 15364473 15205676 15093202 15096778 15087214 15169377 15198313
12063A5198313j73618r9879j10787k9312K4023m5125n2025K9683r2020p0489m6745
$$ 15198313 15024695 14924816 14814029 14784717 14808740 14763615 14711590 14741273 14649253 14578764 14532019
12052A4532019j47869j05295r507j02969m1869L1645j24545k9863l4523l319j12353
$$ 14532019 14384150 14278855 14269348 14166379 14124510 14156155 14031610 14001747 13967224 13963905 13851552
12041A3851552k02790o6613q9131j02957K5264o0361p7586n5278q0635o9606j85502
$$ 13851552 13648762 13582149 13493018 13390061 13415325 13354964 13277378 13222100 13141465 13071859 12886357
12030A2886357q8585j55403j40217M1298K3597j67466j43037j24036j49941m7035
$$ 12886357 12797772 12642369 12502152 12543450 12567047 12399581 12256544 12132508 11982567 11935532
12020A1935532k8332q659L7133L4028m8564q3651m8646r5964j92219j54853m6249
$$ 11935532 11907200 11898541 11935674 11969702 11921138 11837487 11788841 11692877 11500658 11345805 11299556
12009A1299556o8355o7422r7108J5085N4281j12721j69902p5342r5225j8090j46787
$$ 11299556 11231201 11163779 11066671 11081756 11136037 11023316 10853414 10778072 10682847 10664757 10517970
11998A0517970k0114R2232m6770j96709k29318J6805J01788m7681j71129j20689
$$ 10517970 10497856 10590088 10543318 10346609 10117291 10134096 10235884 10188203 10017074 9896385
11988I896385J5182L1213j16834j91692j89319n9935j57453j89405J02384J62032
$$ 9896385 9911567 9942780 9825946 9634254 9444935 9385000 9227547 9038142 9140526 9302558
11978I302558j29937m1733o5461o3590j69251j0352n1632l6982k4553K3674j53282
$$ 9302558 9172621 9130888 9065427 9001837 8832586 8822234 8770602 8733620 8709067 8732741 8579459
11967H579459j06360K2728k2334P474j61409j18412J48985N9130N2047j04692
$$ 8579459 8473099 8495827 8473493 8480967 8319558 8201146 8350131 8409261 8461308 8356616
11957H356616j48538q7377q5486k70404j09119m3563j14580j3290J78867j56568
$$ 8356616 8208078 8120701 8035215 7764811 7655692 7612129 7497549 7484259 7663126 7506558
11947G506558r1435m6008p3488j0050m8863j47246l9793l1090m5787p706o2998
$$ 7506558 7415123 7369115 7295627 7285577 7236714 7089468 7049675 7018585 6972798 6965092 6902094
11936F902094q7488n7030L509o2393j71587j2582K91566Q1419j0549j43155r4667
$$ 6902094 6814606 6757576 6761085 6698692 6527105 6514523 6806089 6887508 6876959 6733804 6639137
11925F639137p8896O73j51494n752j07284j516Q6046j96862r6777o2066j09623
$$ 6639137 6560241 6560914 6409420 6403668 6296384 6294868 6380914 6184052 6087275 6025209 5915586
11914E915586m066N8978O1419o1133m2375N1706j47443j41584m5032r0288o8236
$$ 5915586 5911520 5970498 6031917 5970784 5928409 5980115 5832672 5691088 5646056 5555768 5487532
11903E487532j13630K9861m8209Q2274P720j47388p3540O3567o0660j49826l4029
$$ 5487532 5373902 5403763 5355554 5437828 5445548 5298160 5224620 5288187 5227527 5077701 5043672
11892E043672M7179q0381J5669K3682n0493q4047r738P860j18463r3786o1464
$$ 5043672 5090851 5010470 5026139 5049821 4999328 4915281 4905543 4913403 4794940 4701154 4639690
11881D639690N1907L7734n9358r600N9047L0238J846j12147k7459J64391j01108
$$ 4639690 4691597 4729331 4669973 4660373 4719420 4749658 4751504 4639357 4611898 4776289 4675181
11870D675181j15845k451j87724j15288J08674K2593q2055p230q4825P3481r5703
$$ 4675181 4559336 4556885 4369161 4253873 4362547 4385140 4303085 4295855 4211030 4284511 4188808
11859D188808o2182p8820j01988J29425J07678L0581k6148r2469j51207l8032
$$ 4188808 4126626 4047806 3945818 4075243 4182921 4213502 4187354 4094885 3943678 3905646
11849C905646n3584n5418j53509N7667Q1732m5817o2766l3153K1423j0581K9712
$$ 3905646 3852062 3796644 3643135 3700802 3782534 3736717 3673951 3640798 3662221 3651640 3681352
11838C681352n9484K2913M6758j5046j37625L1868K036J4386J4286M2746m6192
$$ 3681352 3621868 3644781 3691539 3676493 3538868 3570736 3572772 3587158 3601444 3644190 3597998
11827C597998l4766j23294j12789l9056p7015m4124L612j030o6626J24141J23026
$$ 3597998 3563232 3439938 3327149 3288093 3211078 3166954 3170566 3169536 3102910 3227051 3350077
11816C350077j36737j31994J13342j9416o1665K45698Q8006j20607j09220j08084
$$ 3350077 3213340 3081346 3194688 3175272 3113607 3359305 3447311 3326704 3217484 3109400
11806C109400k2658l6125l9806M1234n7240k2814n6700r6137P2781J7573J8926
$$ 3109400 3086742 3050617 3010811 3052045 2994805 2971991 2915291 2819154 2891935 2909508 2928434
11795B928434m8211p6574n561j03011m9930J17796n498Q530L9970l8098L6586
$$ 2928434 2880223 2803649 2798088 2695077 2645147 2762943 2757445 2765975 2805945 2767847 2804433
11784B804433O1369j1486j60108j3222o3776j6819m658j15289l7253J0944j10140
$$ 2804433 2865802 2854316 2694208 2680986 2617210 2600391 2595733 2480444 2443191 2454135 2343995
11773B343995L7240Q3900k3545q3802K3094J56574O1435K000K15n6305r081m9392
$$ 2343995 2381235 2465135 2441590 2357788 2380882 2537456 2598891 2600891 2601106 2544801 2535720 2486328
11761B486328o2343K1348l1602J2686o176m8888p7483q032J3317J9242l1404j31551
$$ 2486328 2423985 2445333 2413731 2426417 2420241 2371353 2293870 2285838 2299155 2318397 2286993 2155442
11749B155442M1574K9431n573r1947M3308l9959l4835O7625J335N4218j1723J29162
$$ 2155442 2197016 2226447 2220874 2128927 2172235 2132276 2097441 2165066 2166401 2220619 2208896 2338058
11737B338058o718j24581r6559L6861o5852j13205m2365L1897K5460j64426L4235
$$ 2338058 2331340 2206759 2110200 2147061 2081209 1968004 1925639 1957536 1982996 1818570 1852805
11726A852805J9907J70373J3404l9865j3587j38462N736K8848j8761l4048N7034
$$ 1852805 1872712 2043085 2056489 2016624 2003037 1864575 1870311 1899159 1880398 1846350 1903384
11715A903384j44281j8406P9822Q4981P9395J2225j49933j21603M6786l607J15446
$$ 1903384 1759103 1740697 1820519 1905500 1984895 1997120 1847187 1725584 1772370 1768763 1884209
11704A884209L068l7538J07550k8646q7312r0463j19649K2237J68183q6901K2651
$$ 1884209 1887277 1849739 1957289 1928643 1841331 1750868 1631219 1653456 1821639 1734738 1757389
11693A757389P4607M7531k1423p5922n3645j7514j05552J62542L9181j36150q8242
$$ 1757389 1831996 1879527 1858104 1782182 1728537 1711023 1605471 1768013 1807194 1671044 1582802
11682A582802J47703l5788j90373o5528Q5182J13031N5163R2710P2103q9616n1900
$$ 1582802 1730505 1694717 1504344 1438816 1523998 1637029 1692192 1784902 1857005 1767389 1715489
11671A715489N353l1363j30794r1357J44656R5999n9486o8134j38582j3350o8086
$$ 1715489 1720842 1689479 1558685 1467328 1611984 1707983 1648497 1580363 1441781 1428431 1360345
11660A360345M7217K04973n7115M2571J2476j45842o1018P2138M854r0429J9092
$$ 1360345 1407562 1612535 1555420 1597991 1610467 1464625 1403607 1475745 1480599 1390170 1409262
11649A409262m4487P4205q0420R9695J29377j26569j97164J69126o3345l7939
$$ 1409262 1364775 1438980 1358560 1458255 1587632 1461063 1263899 1433025 1369680 1331741
11639A331741K8000M6755j4686O8802M9123K945n098j13196j17688p8351k4286
$$ 1331741 1359741 1406496 1391810 1460612 1509735 1512680 1507582 1394386 1276698 1198347 1174061
11628A174061J50563P139m9635p4255j3819R3839j8026j16087o2756j01664K5010
$$ 1174061 1324624 1331763 1282128 1207873 1194054 1287893 1269867 1153780 1091024 989360 1014370
11617A014370q2104k5832O2700M1709j3758p4055K3914R7196P537n6563j31264
$$ 1014370 932266 906434 969134 1010843 997085 923030 946944 1044140 1051677 995114 863850
11606H63850N1503J50521j14640k04655N5257R5465L1155J03077r935j9045k0078
$$ 863850 915353 1065874 951234 746579 801836 897301 928456 1031533 1021598 1002553 982475
11595I82475O7516k0527P6449j4064P318l6p5810l9872N5193Q4207O6003K4331
$$ 982475 1049991 1029464 1105913 1091849 1099167 1099131 1023321 983449 1038642 1122849 1188852 1213183
11583A213183j44270n136K5509m0612r1878J27254M7091j23736j28265q846j960
$$ 1213183 1068913 1063777 1089286 1048674 956796 1084050 1131141 1007405 879140 870294 868334
11572H68334p4036n5208j328j9116m1856P935J44000J27593o1361O237P3011j0124
$$ 868334 794298 739090 737762 718646 676790 684725 828725 956318 894957 901194 974205 964081
11560I64081o2294n0742O6814O0751o6589M7264k228J08523q899j50587m5440
$$ 964081 901787 851045 917859 978610 912021 959285 957057 1065580 1056681 906094 860654
11549H60654n122n9685J8445J13336m1563M375j28009q919o844q8563m7260N0078
$$ 860654 855532 795847 814292 927628 886065 890440 762431 753512 746668 658105 610845 660923
11537F60923J78418J79479m4715p9482J9689J31138K6189O7966J1736p1487j74402
$$ 660923 839341 1018820 974105 894623 914312 1045450 1071639 1139605 1151341 1079854 905452
11526I05452j03151K5212j3776m4164m9873q2217n1207L6889J30983M4146l2432
$$ 905452 802301 827513 813737 769573 719700 637483 586276 623165 754148 798294 765862
11515G65862k8588M8929J19675K8821j36906j4088k0977j13340m6492L1184j1757
$$ 765862 737274 786203 905878 934699 797793 783705 762728 649388 602896 634080 622323
11504F22323j3744J25222K754N8819K5481O8088J0283p6953J3737r6882l4115
$$ 622323 608579 733801 736555 795374 820855 888943 899226 822273 836010 739128 705013
11493G05013n1002m7646o4116Q8336J37186M2293K0638n8565j05683l8366o3884
$$ 705013 654011 606365 542249 630585 767771 810064 830702 772137 666454 628088 564204
11482E64204k610K4484M5711j39730j4914M6928O9412p817K6544m3536k6297j0888
$$ 564204 561594 586078 631789 492059 477145 524073 593485 585668 612212 568676 542379 531491
11470E31491o1543N4403J1926o4935Q5714J46119K5129j65761L5208L1042J6282
$$ 531491 469948 524351 536277 471342 557056 703175 728304 562543 597751 628793 645075
11459F45075l3107p7328r1717K0045P9557J30265m182P587M3932K3460p0085k6674
$$ 645075 611968 534640 442923 462968 542525 672790 668608 676195 720127 743587 673502 646828
11447F46828Q618j5999j5817q154k4911j6951l2185j10239o9329J9021J61133
$$ 646828 655446 639447 623630 615476 590565 573614 541429 431190 361861 380882 542015
11436E42015J6467L2235J37952k1151j14849j28170l1545L4183J9034J1011N0872
$$ 542015 558482 590717 728669 707518 592669 464499 432954 467137 486171 497182 548054
11425E48054R9140K3613o4596N4127j5467m311L4985j255j24513j23578l989j6049
$$ 548054 647194 670807 606211 660338 644871 640560 675545 674290 549777 426199 422210 406161
11413D06161j03628Q4240j1584M1175L4815L1816l4686l4821J3728L664n1336
$$ 406161 302533 386773 375189 416364 451179 482995 448309 413488 427216 430880 379544
11402C79544l1148q2775n5250J39679j9863m149J43384N3717q7013j03364P2086
$$ 379544 348396 265621 210371 350050 330187 326038 469422 523139 436126 332762 404848
11391D04848J35784j28499J2188q0860n6391J03633M5536N7380J00516l5298j79765
$$ 404848 540632 412133 424321 343461 287070 390703 436239 493619 594135 558837 379072
11380C79072k5995P6252R9253J44045J7556j191q3319j20040j39312o6504o168
$$ 379072 353077 429329 528582 672627 690183 688992 605673 485633 346321 279817 273649
11369B73649j3366J04249J32270M1103O6314j7495r9380j19125O8619O741J9715
$$ 273649 260283 364532 496802 537905 604219 586724 487344 368219 436838 443579 463294
11358D63294O5484q3307j1484K1997p2832p7056k4317P5210Q99N2642L6005J01508
$$ 463294 528778 445471 433987 455984 383152 306096 281779 356989 357888 410530 446535 548043
11346E48043O5824p0188m4961K2738O1904m589O3782o7362k1917K0335q8259j50352
$$ 548043 613867 543679 498718 521456 583360 578771 642553 575191 553274 573609 485350 334998
11334C34998m4359K4730k4987O2175J00851J2005p7953k0967Q8914N2813p5388
$$ 334998 290639 315369 290382 352557 453408 465413 387460 366493 455407 508220 432832
11323D32832j54940P260O2946j18786M5273k4531l9999q7940n5080N7646N7312
$$ 432832 277892 285152 348098 229312 274585 250054 210055 122115 67035 124681 181993
11312A81993P8693P8509Q7870j72911k7306N8632Q5262M4230L8869n3308q9659
$$ 181993 260686 339195 427065 254154 226848 285480 370742 414972 453841 400533 310874
11301C10874L7638n5091l6219M6955j733j1721R4825k1999O4937j17778j24213
$$ 310874 348512 293421 257202 304157 302424 290703 385528 363529 428466 310688 186475
11290A86475J25393L7877j02826K342L6734J68216J01739q7843p1499j36189l3048
$$ 186475 311868 349745 246919 249261 285995 454211 555950 468107 396608 260419 227371
11279B27371p8457l8584j5528J26481M5311k3755Q5431O6072j05899j09807J9844
$$ 227371 148914 110330 94802 221283 266594 242839 328270 394342 288443 178636 198480
11268A98480M5787O183P9211N9257m0909j5433p3304n1756N3959L6272k8916p0043
$$ 198480 244267 250450 329661 388918 348009 332576 259272 207516 261475 297747 268831 198788
11256A98788j16665M0118R1393J15572K2764n5590n7532l6781N3496K1306l2347
$$ 198788 82123 122241 213634 329206 351970 296380 238848 202067 255563 276869 244522
11245B44522m2578L3539J29202j0906L6320l0992j5457j1283m4304k4722J04031
$$ 244522 201944 235483 364685 353779 390099 359107 343650 332367 288063 263341 367372
11234C67372M4417L8135N8126p1058j04536p5946K1778J2798K7845J361K3247
$$ 367372 411789 449924 508050 436992 332456 256510 278288 291086 318931 320292 343539
11223C43539j08912J7428j29047L0279k1230Q5460J03542K5295q5035J8840J35532
$$ 343539 234627 252055 123008 153287 132057 217517 321059 346354 261319 280159 415691
11212D15691j13513j15955O2763j38210l0825J29908M4243k7004j52629r311N7466
$$ 415691 302178 186223 248986 110776 79951 209859 254102 227098 74469 65158 122624
11201A22624N3618J7189J40L9924J2153K1089L257k0260J5424M9571N3043N796
$$ 122624 176242 193431 193571 233495 245648 266737 269994 249734 265158 314729 367772 373568
11189C73568j53788r5463M0319J3476L6376l7158j02434K6253O3701J01896j11581
$$ 373568 219780 124317 164636 178112 214488 177330 74896 101149 164850 266746 155165
11178A55165n8315k8849J6251K65068Q7131r6242j06708j49966o8242p4389K915
$$ 155165 96850 68001 84252 349320 436451 340209 233501 83535 15293 -59096 -56181
11167e6181Q5692o95k2462R1039O9333J28896K6051j4805p7186k7044m1853k2831
$$ -56181 29511 28816 6354 97393 166726 295622 321673 306868 229682 202638 160785 137954
11155A37954P7972l1357k6704q7300N6759J17731j20532p3084P1351J10595N5534
$$ 137954 215926 184569 157865 70565 127324 245055 124523 51439 122790 233385 288919
11144B88919L3265q3768p8405P722o0647r5000j9385J45679j9670j62246n061
$$ 288919 322184 238416 160011 167733 107086 12086 -7299 138380 118710 -43536 -48597
11133d8597J55268o2458K4147K2773J19697l9638j36639N2522J6978N4490q1372
$$ -48597 106671 44213 68360 91133 210830 171192 34553 87075 104053 158543 77171
11122G7171m5606n3274l2929J25167J57266N4279k077k6696J1461J5736r1417
$$ 77171 31565 -21709 -54638 70529 227795 282074 279997 253301 264762 280498 189081
11111A89081j71791L382M9641K2594R8134J1805o7639j54681J65185N9223J71991
$$ 189081 17290 20672 70313 92907 191041 202846 135207 -19474 145711 204934 376925
11100C76925k0752r0865o4233j28523q7717M8050k1108j14622j5956J468J3884
$$ 376925 356173 265308 201075 72552 -15165 32885 11777 -102845 -118801 -117333 -103449
11089a03449O2257p3253o534J47965R0566j2556L0529J6349o222r934Q0390l88
$$ -103449 -41192 -114445 -120979 26986 117552 104996 135525 151874 145652 135718 216108 215720
11077B15720o3202n8461O6142P8262q0935r7957O4689m458K7556p946K16N1074
$$ 215720 152518 94057 160199 238461 157526 59569 124258 119800 147356 139410 139626 190700
11065A90700j07401q2087J378K8815m3858k0712n0766J28909J5681n0016J46073
$$ 190700 83299 1212 2590 31405 -12453 -33165 -83931 44978 60659 10643 156716
11054A56716Q4972L7960k614l9340L4452M2166j2636K5959J66154J50870J49892
$$ 156716 241688 279648 277034 237694 272146 314312 301676 327635 493789 644659 794551
11043G94551O8204o5482j09551j2545J2725R9137Q8582l2766J77128J35238K60784
$$ 794551 862755 797273 687722 675177 687902 787039 875621 842855 1019983 1155221 1416005
11032A416005J08940J51331j02358k37859j19142l0540R0797M0812J92151K67156
$$ 1416005 1524945 1676276 1573918 1336059 1216917 1186377 1277174 1317986 1510137 1777293
11022A777293J55556J30239Q1781p1303k70177k41838k26017j28755m3017P7490
$$ 1777293 1932849 2063088 2144869 2073566 1803389 1561551 1335534 1206779 1163762 1241252
11012A241252J03206N8715N7626o155r5905j9387j61846l29697k30339k4732p4752
$$ 1241252 1344458 1403173 1460799 1454644 1358739 1339352 1177506 847809 617470 592738 517986
11001E17986o7651j6338R7828K2093L9678m338j35442K5996n663j6925l6151k6477
$$ 517986 450335 433997 531825 553918 593596 589258 453816 479812 474149 457224 421073 394596
10989C94596j68942j48715k0793J25913O1972l8711j47549j1043l6819q3162r6794
$$ 394596 225654 76939 56146 182059 244031 205320 57771 46728 9909 -73253 -170047
10978a70047Q4812O1473R7068M0443o4963k8554j6976O9918o4456N2772K6001
$$ -170047 -85235 -23762 73306 113749 48786 20232 3256 73174 8718 61490 87491
10967H7491r6506p846J16544L696p3199K0183M6597j11434K5094p936J8554L7863
$$ 87491 -9015 -16861 99683 103379 30180 50363 96960 -14474 10620 2684 21238 59101
10955E9101N2652j47265m238J2157l9795J78962O4354r8817j23832j01345K1034
$$ 59101 111753 -35512 -39750 -27593 -67388 111574 175928 77111 -46721 -148066 -127032
10944a27032q0285Q1280Q0317P9432J29593o5961O5230L2714l5815j82948l176
$$ -127032 -207317 -126037 -45720 33712 163305 97344 162574 195288 159473 -23475 -26651
10933b6651J03444o6156J2008o3378p1358K9379j7348N1588l5638P5137N1400
$$ -26651 76793 10637 22645 -40733 -112091 -82712 -100060 -48472 -84110 -8973 42427
10922D2427j00392J50925O7860j3520l356p3912m2150J835O5064p7994O6031o3483
$$ 42427 -57965 92960 160820 147300 143944 70032 27882 29717 94781 16787 82818 19335
10910A9335n6545l0614n9190j4774J05008m7549J31065J45627q3237N700n4710
$$ 19335 -37210 -67824 -127014 -141788 -36780 -84329 46736 192363 109126 114826 60116
10899F0116j7425M9604j01297j30749j07159N3150O2738n6536j21879j39446L670
$$ 60116 42691 92295 -9002 -139751 -246910 -193760 -131022 -187558 -309437 -448883 -445213
10888d45213K54211J6431J592J25158J02333j10975J4507M3590o2813J6872J62786
$$ -445213 -191002 -174571 -172979 -47821 54512 -56463 -41956 1634 -61179 -44307 118479
10877A18479J5555R6543o5484n913o2593j75778l2613n9921j127L9402R2586M4772
$$ 118479 134034 230577 165093 159180 96587 -79191 -111804 -171725 -172852 -133450 -40864 3908
10865C908R4847J66522n1776j31649k7784M4147P8970j52547M9888R3025q0945
$$ 3908 98755 265277 213501 81852 54068 98215 177185 24638 74526 167551 86606
10854H6606q9391o0981O2895P5838K40284o2358k3972m9796j34388k0406J17009
$$ 86606 -2785 -63766 -871 74967 315251 252893 228921 179125 44737 24331 141340
10843A41340M8319j07903J9384J49836j24283n4570p6326l4797o5471O648N661
$$ 141340 189659 81756 101140 250976 126693 72123 -4203 -39000 -104471 -97823 -92162
10832i2162o9898r9434o8014q6762O1539J35839L3292j08303j27985q0826l8852
$$ -92162 -162060 -261494 -329508 -416270 -354731 -218892 -185600 -293903 -421888 -502714 -541566
10821e41566Q5140J06208O4134O0563r5807K1688P7519O4159k2924m0076J34446
$$ -541566 -456426 -350218 -286084 -225521 -321328 -299640 -222121 -157962 -180886 -220962 -86516
10810h6516M0111J785L8726j37688j32255n371P8043n2143K385J060K2896l5957
$$ -86516 -46405 -44620 -5894 -143582 -275837 -281208 -203165 -255308 -252923 -251863 -228967 -264924
10798b64924J72623O7741n3264p3871r241L873O6992M9202o2615m7997J68363
$$ -264924 -92301 -24560 -77824 -151695 -160936 -157063 -90071 -40869 -103484 -151481 16882
10787A6882Q0507m0270q5589l9013p0160j29966l6600R9009O6575K2295K8895
$$ 16882 97389 57119 -28470 -67483 -137643 -267609 -304209 -205200 -138625 -116330 -87435
10776h7435J3103j4924r2712j881r479J2857P7366K4421m1041m005k1519o0052
$$ -87435 -74332 -89256 -181968 -183849 -193328 -180471 -103105 -78684 -119725 -123730 -145249 -205301
10764b05301J7427P6197M2005O306m4745N8951J0756j14563m3638L931k1659j9930
$$ -205301 -187874 -111677 -69672 -63366 -108111 -49160 -38404 -152967 -196605 -192674 -214333 -234263
10752b34263Q4064O1832K8210L7192J4000j5835m4977l9688J22757O9114J13964
$$ -234263 -150199 -88367 -60157 -22965 -8965 -24800 -69777 -109465 13292 82406 196370
10741A96370l692j78142j47558J74544P2544m3483k4043Q670n0387m5780o7795
$$ 196370 192678 14536 -133022 41522 114066 70583 46540 55210 4823 -40957 -108752
10730a08752L6187p5081q9809J86973P2108K694O5892k2897K215k9150n540j16925
$$ -108752 -72565 -147646 -237455 -50482 21626 24320 90212 67315 69530 40380 34840 -82085
10718h2085j05565m8946K1760j12545k2624K3936J6314o6665J23688J18182J73872
$$ -82085 -187650 -236596 -214836 -327381 -350005 -326069 -309755 -376420 -252732 -134550 39322
10707C9322J9204o609K1208n6169n6714J07721j04077k37336l0948o4136R5544
$$ 39322 58526 51917 73125 16956 -39758 67963 -36114 -273450 -304398 -368534 -272990
10696b72990o1171q1017L8184J7452o425M5400j78471R3106M2459k3553J19448
$$ -272990 -334161 -415178 -376994 -359542 -365967 -320567 -499038 -405932 -363473 -387026 -267578
10685b67578R35m6229j65431r3834J4539L9615P5909m5420M9896J70279K7437
$$ -267578 -266643 -312872 -478303 -572137 -557598 -517983 -442074 -487494 -437598 -267319 -239882
10674b39882j02391l6023J12908R1918K2994k33517j26350J7684J73378J67971
$$ -239882 -342273 -378296 -265388 -173470 -150476 -383993 -510343 -492659 -319281 -151310
10664a51310Q2102k9376k9703j03960q1655j21136J50824K05416P36J7391O7313
$$ -151310 -69208 -98584 -128287 -232247 -313902 -435038 -284214 -78798 -78062 -60671 6642
10653F642O2253J73626J54754L9163M9007Q6422n2735j30066R2131J35584Q0406
$$ 6642 68895 242521 397275 436438 485445 571867 519132 389066 481197 616781 697187
10642F97187J05326P9690J05727J07976K84731K38878J46718L23430N56265M99210
$$ 697187 802513 882203 987930 1095906 1380637 1619515 1766233 2089663 2645928 3145138
10632C145138P44724P32237Q58201N97956N94148O94122Q68672J327498J826100
$$ 3145138 3889862 4622099 5480300 6078256 6672404 7366526 8235198 9562696 11388796
10623A1388796K401642L208188M582336O529854Q865850J1664285J5049198J7658341
$$ 11388796 13790438 16998626 21580962 28110816 36976666 48640951 63690149 81348490
10615H1348490J7121976J2105758L875255l002264n843597m674670n74649N133716
$$ 81348490 98470466 110576224 114451479 111449215 105605618 100930948 100356299 105490015
10607A05490015J2342126K0587077K9404938L5640436L3799530J9717580k028672
$$ 105490015 117832141 138419218 167824156 203464592 237264122 256981702 254953030
10600B54953030j8753272k3377405j8439002r256041J551259J3620433K6413615
$$ 254953030 236199758 212822353 194383351 185127310 186678569 200299002 226712617
10593B26712617L8443462M5204728L9075673J5625705j7019705l9424376m3552127
$$ 226712617 265156079 310360807 349436480 365062185 348042480 308618104 265065977
10586B65065977l5954653k3929446j1687702j80890J0618517J9676842K3603691
$$ 265065977 229111324 205181878 193494176 193313286 203931803 223608645 247212336
10579B47212336J7752447M82040k0951840l3951160l4723876k8179475j9330475
$$ 247212336 264964783 265446823 244494983 210543823 175819947 147640472 128309997
10572A28309997j1011127m349686Q66853M587360N463570K238103m861061j2862622
$$ 128309997 117298870 112949184 113816037 118403397 123866967 126105070 121244009 108381387
10564A08381387j7593298j7647907j4716265j1342065q578515o502401m960140
$$ 108381387 90788089 73140182 58423917 47081852 38503337 32000936 27040796
10557B7040796l805124k937605k377507j805367j473475j358696j198626j215834
$$ 27040796 23235672 20298067 17920560 16115193 14641718 13283022 12084396 10868562
10549A0868562q54984q19075o90309n36031m49342m28040l56155k92638l40325
$$ 10868562 10013578 9194503 8504194 7968163 7518821 7090781 6734626 6441988 6101663
10540F101663l41367k98105l32228j93960k40519k12615k10866j11686r7192j58402
$$ 6101663 5760296 5462191 5129963 4936003 4695484 4482869 4272003 4160317 4063125 3904723
10530C904723j58141k08734k54769R5017l6223k64413j86219J1301l2970j04795
$$ 3904723 3746582 3537848 3283079 3378096 3341873 3077460 2891241 2902542 2869572 2764777
10520B764777J2491r665r211k4956p6389m7683j01596R5285o645j43161m2495
$$ 2764777 2777268 2767603 2758392 2733436 2657047 2609364 2507768 2603053 2596408 2453247 2410752
10509B410752n3077o198l3533p4806q2757q9501L5878K4233j47091q53n4775j10511
$$ 2410752 2357675 2351477 2317944 2243138 2160381 2070880 2106758 2130991 1983900 1983047 1928272 1817761
10497A817761M8175O2270j5115j30524m049J335J6960K2027n0169J11039M4723
$$ 1817761 1865936 1928206 1913091 1782567 1778518 1779853 1796813 1818840 1768671 1879710 1924433
10486A924433j65122q4994L4743J5925j8292K9845J10957j19788j65581r0614
$$ 1924433 1759311 1674317 1709060 1724985 1706693 1736538 1847495 1727707 1562126 1471512
10476A471512J35860J27199o7310r6617l8467J6161p0291q4903m3704j0315J0093
$$ 1471512 1607372 1734571 1667261 1570644 1532177 1548338 1478047 1393144 1349440 1339125 1349218
10465A349218r0086J07811N4766K398k32181r7644J73856O1104j14602L1632M3208
$$ 1349218 1259132 1366943 1421709 1424107 1191926 1094282 1268138 1329242 1214640 1246272 1289480
10454A289480k0392m5714r0854m1566J7546J1764o1978p929R2418j88234o0435
$$ 1289480 1269088 1223374 1132520 1090954 1108500 1120264 1058286 1050357 1142775 954541 894106
10443H94106R299N5534J28401R7683J6757j41961j29621k01916j71305J37206
$$ 894106 903405 958939 1087340 1185023 1201780 1059819 930198 728282 556977 694183
10433F94183K15530J72227N9548r4932j74959r5712N3322L1527K183m0267j35928
$$ 694183 909713 1081940 1141488 1046556 871597 775885 829207 860734 862917 822650 686722
10422F86722p0139Q7652m5186K7945J36092K5535L7843q6316j37739p2531k0769
$$ 686722 616583 704235 659049 686994 823086 848621 886464 800148 662409 589878 569109
10411E69109P488J09848J0972O1078q1860K2481O3590j01415j48084O2183J59851
$$ 569109 576597 686445 697417 758495 676635 699116 762706 661291 513207 575390 735241
10400G35241q9735K1564M7850n4445m7666L0592O3012m7965j23354L0036M1138
$$ 735241 645506 667070 714920 660475 612809 643401 706413 658448 535094 565130 606268
10389F06268R741L9977P8673Q867q8171m6723r8534j34999J13718P0551m8466
$$ 606268 616009 655986 734659 743526 655355 608632 510098 375099 488817 559368 510902
10378E10902o0051l0070r1361J04119N0632l6815K3008m57K7528J0007Q3525P8735
$$ 510902 450851 420781 329420 433539 484171 447356 470364 469907 497435 507442 590967 669702
10366F69702J02869o8806o0057l8645Q6088O3526o0967j24187j7572k1301j57768
$$ 669702 772571 703765 643708 605063 691151 754677 693710 569523 551951 530650 372882
10355C72882N4186J51262Q6952l1259j67186j17609J33144J22091m7945l5668
$$ 372882 427068 578330 665282 634023 466837 349228 482372 604463 556518 520850
10345E20850L2522M8847o4674j16265k5621O3564O2055J01963m7723k008m7463
$$ 520850 553372 602219 537545 421280 395659 459223 521278 623241 575518 573510 526047
10334E26047p9046k9254J44438m9432r5968J0471j7250L5070n4800Q117O586r8732
$$ 526047 447001 417747 562185 512753 416785 427256 410006 445076 390276 398393 404979 306247
10322C06247k06119O9300L13010N1806r5279l0751j6640K4966Q4790R3039k6927
$$ 306247 100128 169428 482438 534244 438965 408214 391574 416540 501330 594369 567442
10311E67442j9596M6614n3496Q9491O6062K0460j3609n10J2178j20979q43j18144
$$ 567442 547846 594460 540964 630455 696517 716977 703368 702858 715036 594057 593214 475070
10299D75070j15289m3616k4017M0678Q8832R924R414m0816K2283P4531k7666M0545
$$ 475070 359781 316165 292148 332826 421658 431582 440996 400180 422463 496994 469328 509873
10287E09873J35725p4131J7810j1749j39168l5878M3415k1612j68218j91476O3800
$$ 509873 645598 571467 589277 577528 438360 402482 445897 424285 256067 64591 128391
10276A28391K70477P2868j84010J5288O2168Q9604l6936n8484M0160r4679k9897
$$ 128391 398868 471736 287726 303014 365182 454786 417850 359366 399526 304847 274950
10265B74950R5332M1790p4429j19345p4242L6795L7150J55111Q1415K6793j12258
$$ 274950 370282 412072 337643 218298 144056 180851 218001 373112 454527 481320 369062
10254C69062p5883j1481J26114L9460j02192M0003k2481l9751p1533K8367N9147
$$ 369062 293179 281698 407812 447272 345080 385083 362602 322851 251318 279685 338832
10243C38832N2056n519j45360j61531L4863L5537J96679J08306j392Q1150J29785
$$ 338832 390888 385369 240009 78478 113341 148878 345557 453863 452471 533621 663406
10232F63406O9912n6630l7515j00619p9202j18370m6496J15803r0017k8515Q9615
$$ 663406 733318 676688 639173 538554 459352 340982 294486 410289 320272 291757 381372
10221C81372J3075j54558j41843l5737O8596Q3205m286Q9462J5346r7264r04J08156
$$ 381372 394447 239889 98046 62309 130905 214110 209824 299286 314632 217368 216464 324620
10209C24620Qj06112j29933M8405J10127n9400j67353K21227K82867j431j65439
$$ 324620 324628 218516 88583 136988 247115 187715 20362 241589 524456 523025 357586
10198C57586k3143O3091L6852o6195j2863k8601o5665m5286l0067K5122J20444
$$ 357586 334443 397534 434386 368191 355328 326727 261062 215776 185709 210831 331275
10187C31275K5649R2390Q9135p677L0793p0384N5814K12283R6604M7666O2370
$$ 331275 356924 449314 538449 530772 561565 491181 546995 759278 855882 903548 965918
10176I65918M4356p3368j22029k9779q9603l5170Q8301K43416K86671K04655J43633
$$ 965918 1010274 936906 814877 785098 695495 660325 748626 992042 1278713 1483368 1627001
10165A627001J07658j17796j46074j48923k15537k2652O1160J91027L55217K68918
$$ 1627001 1734659 1616863 1470789 1321866 1106329 1083677 1144837 1335864 1691081 1959999
10155A959999K16478R8945j35515j19154k34215j38273k20528j54056j2281O1877
$$ 1959999 2176477 2275422 2139907 2020753 1786538 1648265 1427737 1273681 1261400 1323277
10145A323277L5194J93626J29517o211j14498k37201j83540k04860K0899l2784
$$ 1323277 1358471 1552097 1681614 1675403 1560905 1323704 1140164 935304 956203 923419
10135I23419j08553M6756L1186R4677J04110J28022o1932k00999p5502j46455
$$ 923419 814866 861622 892808 987485 1091595 1219617 1157685 956686 881184 734729
10125G34729j06557j17387J61800M850k20993o5981j33569M7543M3339J34093
$$ 734729 628172 510785 672585 677435 456442 390461 256892 304435 347774 481867
10115D81867J8010m7462j11708m8509N6649o0125k25804l6313J481Q352m9960
$$ 481867 499877 452415 340707 292198 348847 288722 62918 26605 28086 36438 -13522
10104a3522N7970J18326j5569q9377j13260m4425P0967J02778J04343j23565O1538
$$ -13522 44448 162774 147205 57828 -55432 -99857 -28890 73888 178231 54666 116204
10093A16204M8523r6716P4900p3417m5981Q6300Q5083J30964O5507p5810P5117
$$ 116204 164727 68011 142911 69494 23513 109813 194896 325860 391367 315557 390674
10082C90674R2852j61859j9791J92094O052k3945O690j66097j72669j27756p96
$$ 390674 483526 321667 301876 493970 500022 476077 482767 316670 144001 16245 15449
10071A5449Q4550P1861j6000N7080J18075R1022J0693m4930M4294o193r5249p5414
$$ 15449 99999 171860 155860 212940 331015 422037 432730 387800 432094 425901 330652 255238
10059B55238r3344o0918m6088J71718O1602j109r9441j5816r7451M4693J35410
$$ 255238 161894 100976 54888 226606 288208 287099 187658 171842 74391 119084 254494
10048B54494n2101p1719M8536J09596m2111k1775r4478M7606J1083m2730K6191
$$ 254494 202393 130674 179210 288806 246695 224920 130442 178048 189131 146401 172592
10037A72592Q563m9692K1883q150j82232j49978Q2255K5914M8709R8228K67120
$$ 172592 181155 131463 153346 145196 -37036 -187014 -104759 -78845 -30136 68092 335212
10026C35212J8124o6550L2978l7813j29796M6167P7291j02503L347J6722n4214
$$ 335212 353336 286786 319764 281951 152155 198322 275613 173110 176457 193179 138965
10015A38965j0600j7670m516L2202Q8183p8847o8592o5914k2890J205J27799K24320
$$ 138965 128365 110695 106179 138381 226564 147717 79125 13211 -9679 -8474 119325 343645
10003C43645R3018m1396p3047k2174j5513J12590n1899r2719j1698j14672K9557
$$ 343645 436663 395267 322220 300046 284533 397123 345224 252505 240807 126135 155692
9992A55692K4071m6202M4430K8756q7941M9472M6198M6609Q8659J2595r1288j01041
$$ 155692 179763 133561 177991 206747 118806 168278 214476 261085 349744 362339 271051 170010
9980A70010n9600P4083L7153j20526Q2530j06586n6198O4025j9709N5489k8437
$$ 170010 110410 184493 221646 101120 183650 77064 20866 84891 65182 120671 92234
9969I2234J7113o6712o1272K4347Q0760n8838J38022R5836j25214n4746J46198
$$ 92234 109347 42635 -18637 5710 86470 27632 165654 261490 136276 81530 227728
9958B27728M0379P3876J463k0439j45804k11622l2612K04219K12447Q5149k34353
$$ 227728 268107 341983 343446 323007 177203 -34419 -67031 137188 349635 434784 200431
9947B00431j67095n0172J5489R1146R976r3578o5537P8720K2248N4242q1408n9647
$$ 200431 33336 -16836 -1347 89799 99775 6197 -59340 19380 41628 95870 14462 -45185
9935d5185N7483Q4917J5036n1893L12955L85004M52641L84682k66589l38779j99547
$$ -45185 12298 97215 112251 60358 373313 758317 1210958 1595640 1329051 990272 790725
9924G90725l14776k26096n8657J52928R7202j13082j23518K2592N5632j89421
$$ 790725 475949 249853 191196 344124 441326 328244 204726 227318 282950 93529
9914I3529j00125o6622J06856J08832J43637J6235m4101k4992k2189j36383k05376
$$ 93529 -6596 -73218 33638 142470 286107 302342 258241 233249 211060 74677 -130699
9903a30699J43907J28322K7032k5010M2165J29788Q5217j07365k29731j0123k5652
$$ -130699 13208 141530 168562 143552 185717 315505 400722 293357 63626 53503 27851
9892B7851k050K24871J25653J25245m6245j07428m2117P8417r8780j61783k064
$$ 27851 25801 250672 376325 501570 455325 347897 305780 384197 285417 123634 121570
9881A21570m3089Q8774l2940n6490k7221j594j2389M7399J1235O9435p5190j30248
$$ 121570 78481 167255 134315 77825 50604 49010 36621 84020 95255 164690 89500 -40748
9869d0748j18191o52R9566J09542K8891L7390K1010j17751k3926L7662J25294
$$ -40748 -158939 -159591 -60025 49517 78408 115798 136808 19057 -4869 32793 158087
9858A58087R8590k7917n2726k07370N0575P4613q0314L290j5871r8829K28906
$$ 158087 256677 228760 176034 -31336 19239 93852 13538 16828 957 -97872 131034
9847A31034J35536r0426p0574m7672J10102k1277j6031j3643j8381j00774l1859
$$ 131034 266570 176144 105570 57898 168000 146723 130692 117049 98668 -2106 -33965
9836c3965L2819O9667p4313k5187M884M0362j32446j1858K08543N9343o4863j74762
$$ -33965 -1146 68521 -5792 -30979 -26095 14267 -118179 -130037 78506 137849 72986 -101776
9824a01776p4217K04874J7340O0107M0278N2595J00782j61778M6756R2227J0927
$$ -101776 -175993 28881 46221 106328 146606 199201 299983 138205 184961 277188 288115
9813B88115q087R582l2397L1279l7918k2892N8369j05673j05218K99724J58752
$$ 288115 280028 289610 257213 288492 250574 227682 286051 180378 75160 374884 533636
9802E33636n221r9460m0969R5516k5275j52217j51778o5364N028j00545N1587
$$ 533636 528415 428955 387986 483502 458227 306010 154232 88868 93896 -6649 44938
9791D4938J39244Q2824O8136K0866r4457k1661q4944j5258N7639K3262N6788r9072
$$ 44938 184182 267006 335142 356008 261551 239890 154946 139688 197327 220589 277377 178305
9779A78305j74029j05388Q7367P5287Q6348Q8994j11335J6589J4492j10819m3203
$$ 178305 4276 -101112 -13745 61542 147890 236884 125549 142138 156630 45811 2608
9768B608R07Q3468j7778r3719l4437P3593J33200j7622l8627L3397p1624r786
$$ 2608 3515 86983 69205 -24514 -58951 14642 147842 130220 91593 124990 53366 43580
9756D3580J76809K2312j88449j42663m6195J62254J9734j2853j10484l8108K5347
$$ 43580 220389 242701 54252 -88411 -134606 27648 47382 34529 -75955 -114063 -88716
9745h8716K8400J38320M8336N4002K2279o1573P7817P3793p5291q4149n3126J08137
$$ -88716 -60316 78004 126340 180342 202621 141048 218865 292658 217367 133218 80092 188229
9733A88229Q2779O7412q0727k00264p4403j7563O4420J10168P1157o0002q2800
$$ 188229 271008 338420 257693 57429 -16974 -34537 29883 140051 211208 151206 68406
9722F8406j00257M3748J56872J13133J34118j74161j30829K7203J49429L9545
$$ 68406 -31851 11897 168769 281902 416020 241859 111030 138233 287662 327207
9712C27207j33196R008k6493J928L201k012q2823j95161N7704k8491n0165n9669
$$ 327207 194011 203019 176526 178454 181655 179643 96820 -98341 -40637 -69128 -119293 -178962
9700a78962o2695J83672J74200L8882L013R8045K5777j35528j27515N015M0413
$$ -178962 -241657 -57985 116215 155097 158110 256155 281932 146404 18889 23904 64317
9689F4317L1770n2929p5568M9343N7417M589J18526p7041n1118J38507Q9540n7094
$$ 64317 96087 43158 -32410 16933 74350 78939 197465 120424 69306 207813 297353 240259
9677B40259m4986j8970M2434n0262j17414P7594J60898J0976j36038J13Q5216
$$ 240259 195273 176303 218737 168475 51061 128655 289553 300529 164491 164604 249820
9666B49820n9782r5380M705M2258N4745P4042J2187q0926p82L3952J56484M7409
$$ 249820 190038 94658 99363 141621 196366 270408 282595 201669 200887 234839 391323 438732
9654D38732N7243O9480M75489M92219L42804l37923n54735k91980p0390j13033
$$ 438732 495975 565455 1040944 1533163 1875967 1538044 983309 691329 620939 507906
9644E07906r5096p3201j25078J5307N9110n8268q2566Q9132J25964m5430o5250
$$ 507906 412810 339609 214531 229838 288948 230680 148114 237246 363210 317780 252530
9633B52530o7912j17448Q8995L3491j3905q0264l5243j7303q7257o2080K9846
$$ 252530 184618 67170 156165 189656 175751 95487 60244 42941 -44316 -106396 -76550
9622g6550J2566P3679o1941L9755J04960P220r6793J02159J25471l6430q4566
$$ -76550 -63984 9695 -52246 -12491 92469 99689 2896 105055 230526 194096 109530
9611A09530o347M2911m4970j32912r599j0426L0842l0633m880L6936M7390R5274
$$ 109530 103183 146094 101124 -31788 -41387 -51813 -20971 -51604 -56484 -19548 27842 123116
9599A23116k1107j54408r4199N2659J09122K6535J01126J1386j8326j3330j82808
$$ 123116 102009 -52399 -146598 -93939 15183 41718 142844 154230 135904 122574 -60234
9588f0234K2420J29355k1825Q1087l7894j09082P1484p5680j43372R9331N8869
$$ -60234 -37814 91541 69716 150803 112909 3827 75311 -369 -143741 -44410 14459
9577A4459J07099l6911j3476m6629k1484l4012n7339M9273k1639Q7968M8856l7908
$$ 14459 121558 84647 71171 24542 3058 -30954 -88293 -39020 -60659 27309 76165 38257
9565C8257j19909j5698R6255l1473O6924R7199j05114j18419l4445J53369P6439
$$ 38257 -81652 -97350 -1095 -32568 34356 131555 26441 -91978 -126423 26946 103385
9554A03385p9847q3980o1706J8576J17852J19460q6818j1744m6206Q4672J53013
$$ 103385 23538 -60442 -122148 -103572 14280 133740 46922 35178 -11028 73644 226657
9543B26657M4359l8533o3575p9104q5873k4150O2231K3948j12371L7120N2185
$$ 226657 271016 232483 168908 89804 3931 -20219 42012 65960 -46411 -9291 42894
9532D2894P4262l9504q8446K2451Q1303L9124m4491m0586P2886k7342J28301P4140
$$ 42894 117156 77652 -10794 11657 92960 132084 87593 47007 119893 92551 220852 294992
9520B94992o9818j80899j4978K9374l8920R2887P2709N2754Q4015R4148j60051
$$ 294992 225174 44275 29297 58671 19751 112638 185347 238101 322116 416264 256213
9509B56213k07486r0802J39j3774P30J14102K1507n8990n0445l556N0748K9846
$$ 256213 48727 -42075 -41936 -55710 -54980 59122 80629 21639 -28806 -32362 18386 48232
9497D8232p280r2201q2251Q3166j896R99k8519l3960J73052L0487n9452J0681
$$ 48232 40952 -51249 -133500 -50334 -52230 -51231 -79750 -113710 59342 89829 30377 41058
9485D1058J2485k150n2596l6122N485j7649m5455K2616Q3456K2074K6932l2395
$$ 41058 53543 51393 -1203 -37325 -31840 -49489 -94944 -72328 11128 33202 60134 27739
9473B7739k2396J00611o1933j17337M5873L1593J44193m123N5620J22214j17639
$$ 27739 5343 105954 44021 -73316 -27443 4150 148343 144220 199840 322054 204415
9462B04415r5193n6875R5544J28474n3602j57004q5083j82298l5277J25847J39043
$$ 204415 109222 52347 147891 276365 222763 65759 -19324 -201622 -236899 -111052 27991
9451B7991J15103N0567Q629m9588q9904K8605l5982K3518k1049k1201J0143L5693
$$ 27991 143094 193661 202290 152702 62798 91403 55421 78939 57890 36689 46832 82525
9439H2525K9991P705l815R7392J9124j91249r167k9902m3519O5353n9954m3319
$$ 82525 112516 120221 116406 213798 232922 41673 32506 2604 -40915 24438 -35516 -78835
9427g8835j7960J6051P6762n3656j06316J36773O1323k04426j81341R2348J11239
$$ -78835 -96795 -80744 -3982 -57638 -163954 -27181 34142 -170284 -351625 -259277 -148038
9416a48038L925L8913O1471r5557l7847K3048M3475l6867J07871N7893r0008J16340
$$ -148038 -144113 -105200 -43729 -139286 -177133 -154085 -110610 -147477 -39606 18287 -71721 44619
9404D4619N6691n7625R3028J51729N0069j39084p7765l4517k18587j7703J24166
$$ 44619 101310 43685 136713 288442 338511 199427 121662 87145 -131442 -149145 -24979
9393b4979L2643R8040J16993R9095J3370L8014j62062j61639j12398j25314L5129
$$ -24979 7664 105704 222697 321792 335162 373176 211114 49475 -62923 -188237 -153108
9382a53108J52557k8016O6478k3337O4017m7320Q0114O5309o2280p512j7158l8802
$$ -153108 -551 -28567 37911 14574 78591 31271 111385 176694 114414 106902 89744 50942
9370E0942l8112J12256J2864j40273L4086N3866q8947k7435M7658j4237j35220
$$ 50942 12830 125086 137950 -2323 31763 85629 -3318 -30753 16905 2668 -132552
9359a32552l1816K3461K5970L7993J34714Q4994N6230o5298l8187K2038L7111
$$ -132552 -164368 -140907 -114937 -76944 57770 142764 198994 133696 95509 117547 154658
9348A54658k3744r1680L5296O90k8404p4170m4240j27577M5633J33751J21841
$$ 154658 130914 39234 74530 75220 46816 -27354 -71594 -199171 -153538 -19787 102054
9337A02054K8546r8191j22848n9406L1295J16977J04377P2599q9305O235j03255
$$ 102054 130600 32409 -90439 -149845 -118550 -1573 102804 175403 86098 92333 -10922
9326a0922K2773J23916P3599O8616n0994j63925j11015Q0162P2907P246K2591
$$ -10922 11851 135767 209366 277982 226988 63063 -47952 32210 105117 112363 134954
9315A34954n5864q7679j083J2982J28271p0302N2887L6699m5826M0630j4628m9219
$$ 134954 79090 -8589 -9672 3310 131581 61279 114166 150865 105039 145669 131041 81822
9303H1822O9226J6922j16478J973N1370K9841M8213l8547l3974q7376o2232Q2583
$$ 81822 151048 167970 51492 53465 104835 134676 182889 144342 110368 22992 -39240 43343
9291D3343O1615m8748j8568P6761M1344j6536k2666l191N6025r833p1204l2731
$$ 43343 104958 56210 37642 114403 155747 139211 116545 113354 169379 159546 88342 55611
9279E5611l5390N5536Q516j02447j41660K7462m3339m2040M3073J12064K1782
$$ 55611 20221 75757 84273 -18174 -159834 -132372 -175711 -217751 -174678 -62614 -40832
9268d0832R2583O4865r3968N1313l1709n5514J8096k7378N3357j6500k6085Q6935
$$ -40832 51751 116616 22648 73961 42252 -13262 4834 -22544 30813 14313 -11772 75163
9256G5163J24515m8370o5337m144p4110q2731M8615R4588M0984O4212M3255j68589
$$ 75163 199678 151308 85971 81827 7717 -75014 -26399 68189 109173 173385 216640 48051
9244D8051q5677l9363Q3769n078K5171K5411J33451J36486K1371j23954o1712
$$ 48051 -37626 -76989 6780 1702 26873 52284 185735 322221 343592 219638 157926
9233A57926k6831k7501N1227k2280j0157K5763N258J8262q6050m9399o6579m3021
$$ 157926 131095 103594 154821 132541 122384 148147 153405 171667 85617 36218 -30361 -73382
9221g3382J36528J09787n0915o7397Q900K24j1905j9121n1052Q648m5810P4289
$$ -73382 63146 172933 122018 54621 63521 63745 51840 32719 -18333 -9685 -55495 18794
9209A8794o289r1689o0826j3983L8650P4000K8335R6447N6595r2070J8380l4812
$$ 18794 12505 -79184 -140010 -153993 -115343 -41343 -13008 83439 140034 47964 66344 31532
9197C1532L5032l9589l8290O5600L6038m8558N52r1721l7031j4051q834o9198
$$ 31532 66564 26975 -11315 54285 90323 41765 42317 -49404 -86435 -100486 -109320 -178518
9185a78518J28697Q8592N8887j14822j97973M5552J34346P4127l7361j5608R5059
$$ -178518 -49821 38771 97658 -17164 -215137 -169585 -35239 38888 1527 -14081 80978
9174H0978J13673n6904n6173r7278Q1330L9009l0759j15373J7772l102r3621k8333
$$ 80978 194651 137747 81574 -15704 65626 104635 73876 -41497 -23725 -26827 -120448 -148781
9162a48781M501K2319J17042j6383j60247j4648N2900L1332Q6428J48347J11826
$$ -148781 -144280 -121961 -4919 -21302 -181549 -196197 -143297 -111965 -25537 122810 234636
9151B34636K2699j68789l2526p2351j37242q2953R5508J42824m3587j6613K7478
$$ 234636 257335 88546 56020 -16331 -153573 -236526 -141018 1806 -41781 -58394 -30916
9140c0916j32082j64158N1074Q4206j3384j11840J16906K16798J41248J2009K5984
$$ -30916 -162998 -327156 -276082 -191876 -205260 -317100 -200194 16604 157852 169861 195845
9129A95845O1914m9911r4586j10607r670J19744K6207j11456q2403J26438K6603
$$ 195845 257759 207848 113262 2655 -7015 112729 138936 27480 -54923 71515 98118
9118I8118L5514n5091j18192j39751R1338J68623L6146j5214j6988M710j49790
$$ 98118 133632 78541 -39651 -179402 -88064 80559 116705 101491 84503 89213 -60577
9107f0577m5060N9040J05794j151Q920r3598K5469r1614j08473j09575J52126
$$ -60577 -105637 -46597 59197 58046 66966 -26632 -1163 -92777 -201250 -310825 -158699
9096a58699R3853J4933l7156k034j5865Q0055J86494l5281j21884j21455q4995
$$ -158699 -64846 -49913 -87069 -89103 -104968 -24913 161581 126300 4416 -117039 -202034
9085b02034J3046j9798J86254r2384j6349O3538O1335k279k3008j11653K2983
$$ -202034 -188988 -208786 -22532 -114916 -131265 -67727 -6392 -8671 -31679 -143332 -120349
9074a20349L0414J6801J01608J40129j36029j27732J97802J6589j00781R1133
$$ -120349 -89935 -73134 28474 168603 32574 -95158 102644 119233 18452 109585
9064A09585K8219J8175L4492m4023j09814K3788P7504o7020j07136K6384Q5471
$$ 109585 137804 155979 190471 146448 36634 60422 137926 70906 -36230 -9846 75625
9053G5625P346k3146j870J00181p2615l04240n18N0497j8837j36413j4558K6522
$$ 75625 82971 59825 57955 158136 85521 -218719 -219237 -168740 -187577 -323990 -338548 -312026
9041c12026M5015J66740O4517j10834r1442L8543o6893K008J25143K39549L7874
$$ -312026 -267011 -100271 -35754 -146588 -238030 -199487 -266380 -264372 -139229 100320 138194
9030A38194j53397K2904M5006L0081j2326o6054m1362R4087j8188l1082K1595
$$ 138194 -15203 7701 52707 82788 70462 4408 -36954 57133 38945 7863 29458
9019B9458J15837M4935M387q6600p9397j5757q6826q191J33984K9555p3953j9907
$$ 29458 145295 190230 194617 108017 28620 12863 -73963 -82154 51830 81385 7432 -12475
9007a2475r6658k3331N702q6266j68483J30644K29468O2981k8183J862l4543k9979
$$ -12475 -109133 -132464 -126762 -213028 -381511 -250867 -21399 41582 13399 15261 -19282 -49261
8995d9261K7715O0087N6498K5848o1276j4680j1005n2358q8248O2469J20585j06008
$$ -49261 -21546 38541 95039 120887 59611 44931 33926 -18432 -106680 -44211 76374 -29634
8983b9634p7j19453K3522M6117p4907N2159J31260o2722K0491j7712k8744P122
$$ -29634 -29711 -149164 -125642 -79525 -154432 -102273 28987 -33735 -13244 -30956 -59700 -52578
8971e2578J7334k4165n4988M7507p110l2859n0893j022M4636n6918p5539J52457
$$ -52578 -35244 -59409 -114397 -66890 -74000 -106859 -157752 -158774 -114138 -171056 -246595 -94138
8959i4138J51746o0738M3093P1777Q6942j50922j0488J74599l3553r4349o2735
$$ -94138 57608 -3130 39963 111740 198682 47760 37272 211871 178318 83969 21234
8948B1234p7348p6276Q759m2193K964j04651l6190P0838K8157l2654M1588O4538
$$ 21234 -56114 -132390 -123631 -165824 -162860 -267511 -303701 -232863 -204706 -237360 -195772 -131234
8936a31234K00052O0208r323j33824p6852Q9798J5016N3521M1691Q1122P3579
$$ -131234 68818 129026 119703 -14121 -90973 -1175 13841 67362 109053 190175 263754
8925B63754j3407P359M6472L2834n6087K1667j5142q7151j30749j03225J0992
$$ 263754 250347 257706 304178 337012 280925 302592 287450 200299 69550 -33675 -22683
8914b2683J14442K9009M8713j7212l7114o8497p998j8805M1710l4060o1711m7041
$$ -22683 91759 120768 169481 152269 115155 46658 38660 19855 61565 27505 -34206 -81247
8902h1247L8081k6696R1228J11465q4341R9383J3428j50978m5178n2190n2518
$$ -81247 -43166 -69862 21366 132831 48490 147873 161301 10323 -34855 -87045 -139563
8891a39563O7111Q459M1398P4417L2569o1652j27396K3386l1507J58286J37406
$$ -139563 -72452 -63993 -22595 51822 84391 22739 -104657 -81271 -112778 45508 182914
8880A82914j08716K3452J18537r8494n6131J38553o7941r4169R3509M2265o8101
$$ 182914 74198 97650 216187 117693 61562 200115 132174 38005 131514 173779 105678
8869A05678K5730R1897P6523q4475j50110j07530L1368j6903M9864N3024j12468
$$ 105678 131408 223305 299828 215353 65243 -42287 -10919 -27822 22042 75066 -37402
8858c7402O1915L7595J9002P3545J27549m8906j63692m1585P8489j9150k5882
$$ -37402 24513 62108 81110 154655 282204 233298 69606 28021 106510 87360 61478
8847F1478j19673k00352Q4212P1958q009O1952o122l9025Q3783m216l1575L3187
$$ 61478 -58195 -258547 -174335 -102377 -110386 -48434 -54556 -93581 -9798 -14014 -45589 -12402
8835a2402k431Q0899L762K1572j5817O4456J02512m882j22650p9642M560j18465
$$ -12402 -14833 66066 69828 91400 75583 140039 242551 237669 115019 35377 39937 -78528
8823g8528J6826M3809o1685o7157K2018J04200M5734K8956n75j15389L9100k5600
$$ -78528 -61702 -17893 -79578 -146735 -124717 -20517 25217 54173 53598 -61791 -22691 -48291
8811d8291L2541R4806j13504m5513N9189J6724O200K1735R3166M4799K2190j70744
$$ -48291 -15750 79056 -34448 -79961 -20772 -4048 2152 23887 117053 161852 184042 13298
8799A3298j06848J35596j04109o4007j55569j7387J27641M1002R1704N7135R333
$$ 13298 -93550 42046 -62063 -126070 -281639 -299026 -171385 -130383 -38679 18456 27789
8788B7789m9180j43065M835J48928l1947k40647j3511J47223L6276l0539L6329
$$ 27789 -21391 -164456 -159621 -10693 -42640 -283287 -296798 -149575 -113299 -143838 -107509
8777a07509R3134k10120k60652P6470J10083O5642J37619J11783n0019j15734
$$ -107509 -14375 -224495 -485147 -408677 -298594 -232952 -95333 16450 -33569 -149303
8767a49303M4204Q9767J4228o7730m70N3484R5126K0981q02r0889j56613j4580
$$ -149303 -105099 -15332 -1104 -68834 -69304 -15820 79306 100287 99485 8596 -148017 -162597
8755a62597m4802P0552J22747k4569Q7931M0495j02958j3551P9787J52521k1341
$$ -162597 -207399 -136847 -14100 -38669 49262 89757 -13201 -26752 53035 205556 184215
8744A84215l9510P995P211R040r9541j14031K9989J49413P4332J40742J11443
$$ 184215 144705 152700 159911 168951 69410 -44621 -14632 134781 209113 349855 461298
8733D61298L427j46575j39687o8189r9240k7155m1769P449O6979R5147J15584
$$ 461298 464725 318150 178463 110274 11034 -16121 -57890 -50441 16538 111685 227269
8722B27269l3441J9303O4928J2129p2835m6236j31280p3979J07996M0673K9542
$$ 227269 193828 213131 278059 290188 217353 171117 39837 -34142 73854 114527 144069
8711A44069K5106O2373m9408J167j26480j17888K3899O9134j03302j05431L2500
$$ 144069 169175 231548 182140 183307 56827 -61061 -37162 31972 -71330 -176761 -144261
8700a44261J46977k732J0212j633n4157L402R9830M3308n2386m2786J08653k4719
$$ -144261 2716 -16 10196 8563 -45594 -42192 57638 100946 48560 5774 114427 89708
8688H9708j29406p7327Q4825j1800p1830M6891n2343J6972P6482R1769Q7013J56597
$$ 89708 -39698 -117025 -32200 -44000 -115830 -68939 -121282 -104310 -27828 63941 150954 307551
8676C07551q9282p6331n2118L1473M7379j59825j35991j53659k3306J22164K79059
$$ 307551 218269 141938 89820 121293 168672 8847 -127144 -280803 -304109 -181945 97114
8665I7114Q0705k3689j6685j19059J9551J39472k964L530j12019n4192K4441M8437
$$ 97114 177819 154130 137445 18386 37937 177409 174445 177975 65956 11764 36205 84642
8653H4642j1467K0783k1142n3381R0059P0440j255l0639K6185q5070k0827N800
$$ 84642 73175 93958 72816 19435 109494 179934 178679 148040 174225 89155 68328 74128
8641G4128m1902q327j5700Q6821O1941n6169k02022R572R4448L7377k7907p7509
$$ 74128 32226 23899 8199 95020 156961 100792 -101230 -91658 2790 40167 12260 -65249
8629f5249o0712L0387J42324K4313j92397K3279J12971K2461K0865j5122j60798
$$ -65249 -125961 -95574 46750 71063 -121334 -98055 14916 37377 58242 43120 -117678
8618a17678j74452L4050P9047J21868m6226l1625L5742j8408K374R0626J65217
$$ -117678 -292130 -258080 -179033 -57165 -103391 -135016 -99274 -117682 -115308 -24682 140535
8607A40535K4820k1204n3221p5398j5447Q1324J2357r0573l089k0366k6833P1963
$$ 140535 165355 144151 90930 15532 85 81409 93766 3193 104 -20262 -47095 24868
8595B4868K6610P4083L6676j8718m0351J8758j38891k5957N9944P8267R8976n5637
$$ 24868 51478 125561 162237 143519 103168 121926 -16965 -42922 17022 95289 194265 138628
8583A38628J6376n9979j5779l410r1410j1863O3744q2399m845l8254q737q956
$$ 138628 155004 95025 79246 75836 -15574 -27437 36307 -46092 -50937 -89191 -97928 -106884
8571a06884J50565J698K6792K7700p3866Q0462R9245O7612q2058j4218m590k7840
$$ -106884 43681 45379 72171 99871 26005 106467 205712 273324 191266 177048 172458 144618
8559A44618l0120N3547N1723j73267l0209q6190L96l4765J26463j0343j7889J09618
$$ 144618 114498 168045 219768 46501 16292 -69898 -69502 -104267 22196 11853 -6036 103582
8547A03582R6049j94069j25317P0814K685j8137P1159J6233l2319R6608l932r6779
$$ 103582 199631 5562 -119755 -48941 -46256 -64393 6766 22999 -9320 87288 83356 -13423
8535a3423R95n616k9143n6851J2050j4390j3430Q4020Q7945j25007L6839L3421
$$ -13423 -12428 -18044 -47187 -104038 -91988 -106378 -119808 -35788 52157 -72850 -36011 -2590
8523b590K19362p982p2491j14601j10622J6442K9002n7889M3079N7297l4389M1070
$$ -2590 216772 208790 136299 21698 -88924 -72482 -43480 -101369 -58290 -993 -35382 5688
8511E688M5912r1158l2103p9760O2909K31633o2629l142K9214j3325l2617J37114
$$ 5688 51600 -39558 -71661 -151421 -88512 143121 80492 77350 106564 93239 60622 197736
8499A97736P9225j16384m7281j08246j6732P8222n9863K5127q918L067q287m4018
$$ 197736 276961 160577 113296 5050 -11682 66540 6677 31804 22886 25953 17666 -26352
8487b6352R1752p9062o6211o0206R6855N2585J8281l0312K6348j2160M3329k0326
$$ -26352 65400 -13662 -79873 -140079 -43224 9361 27642 -2670 23678 11518 54847 34521
8475C4521o4140j11872m204N9074k2368N4378L9996j2405J79435J2473r9107j16842
$$ 34521 -29619 -141491 -145695 -86621 -108989 -54611 -14615 -27020 152415 164888 65781 -51061
8463e1061j16606n314m548l3703k6566K346O9081P6558J2337m7908J24826J73118
$$ -51061 -167667 -172981 -177529 -211232 -237798 -235452 -166371 -89813 -77476 -125384 -558 172560
8451A72560N9241K3087j7122k1163j22941l1457L3916l5672J1685k8847o7478
$$ 172560 231801 254888 237766 216603 93662 62205 96121 60449 72134 43287 -24191
8440b4191K3883J02415J16484r438j1858P2015r9708P8603p0138j21368p8147
$$ -24191 -308 102107 218591 209153 197295 269310 169602 248205 178067 56699 -21448
8429b1448J2097L1330J27372O4381p1353p4060j84666q924J34812M6181L2116
$$ -21448 -9351 21979 149351 213732 142379 68319 -116347 -125271 9541 55722 87838
8418H7838l7834p9539l0519Q872L90k5420l8669J9717q305r178l160M6156J3073
$$ 87838 50004 -29535 -60054 -51182 -50792 -76212 -114881 -95164 -103469 -112647 -115807 -69651 -56578
8405e6578J3806L7706q4484o3903J12860P2672n2773j4975l0141p9258Q2107R3404
$$ -56578 -42772 -5066 -89550 -153453 -40593 32079 -20694 -35669 -65810 -145068 -62961 30443
8393C0443r5410j40568m3709J02845R7805L4186l134K8069m32M2604j7372j01486
$$ 30443 -64967 -205535 -249244 -146399 -48594 -14408 -17542 10527 10095 52699 35327 -66159
8381f6159k12833q2075K33218J05671k6988q6518O607J02645n4J1721O2146P3186
$$ -66159 -278992 -361067 -127849 -22178 -49166 -135684 -129077 -26432 -26486 -14765 47381 120567
8369A20567K2164o0714O5407j29583m1967K4126l9095M40M2043j9893p7806n0027
$$ 120567 142731 82017 147424 17841 -24126 0 -39095 -38655 3388 -16505 -94311 -144338
8357a44338r2839r332J39597k3618Q2029O2512n2489o6051J05224Q0567p7278
$$ -144338 -237177 -246509 -106912 -130530 -48501 14011 -38478 -104529 695 81262 3984
8346C984m3834j4932N0565J25966J04218m6905j11609m8417j22622m0172M1229
$$ 3984 -39850 -54782 -4217 121749 225967 179062 67453 19036 -103586 -143758 -102529
8335a02529J21558M3767l8667m1839P7146l5178O1668k1090j36925n3988N6104
$$ -102529 19029 62796 24129 -17710 59436 24258 85926 64836 -72089 -126077 -69973
8324f9973J30860J13646m3906n6789m2424Q9272O4524M5045r1591p2487m8893
$$ -69973 60887 174533 130627 73838 31414 120686 185210 230255 138664 66177 17284
8313A7284K37093M9863k64597p6380N0378K7033j12837j62988m9993J2139J42580
$$ 17284 254377 304240 39643 -36737 13641 40674 -72163 -235151 -285144 -273005 -130425
8302a30425J24466j237j9017M314J3410j04592o8358M592Q5413M9628p7944m0803
$$ -130425 -5959 -7196 -26213 -21899 -8489 -113081 -181439 -176847 -91434 -41806 -119750 -160553
8290a60553P5223J2973j01796q4731R5956J44214Q6322O2979j9488J09851p5055
$$ -160553 -85330 -72357 -174153 -258884 -162928 -18714 67608 130587 111099 220950 145895
8279A45895j43836k2454N9324o7935m8919l6083J6468J62316J43000L0947m0076
$$ 145895 2059 -20395 38929 -29006 -77925 -114008 -97540 64776 207776 238723 198647
8268A98647j03390j12090J4595K3858Q4493J122r8171j78112n9705M9456J54514
$$ 198647 95257 -16833 -2238 21620 106113 107235 9064 -169048 -228753 -179297 -24783
8257b4783L2110Q7254Q1298N6725j29802n9161k370N9904O9716L4265j9560o7819
$$ -24783 7327 94581 175879 232604 102802 43641 41271 101175 170891 205156 185596 117777
8245A17777M9115n3540j86186M4299j5444o3207J46966J363j8474J0421M6813
$$ 117777 166892 113352 -72834 -28535 -43979 -107186 39780 41143 22669 33090 79903
8234G9903L9881p8644m0588l8753l1159L2608n0878O5623J13771R1418Q10J1941
$$ 79903 119784 41140 552 -38201 -69360 -36752 -87630 -22007 91764 183182 183992 195933
8222A95933o6521j78339j63696J8378J12215j6703k3610j02209p8801J99112K29213
$$ 195933 129412 -48927 -212623 -194245 -82030 -98733 -122343 -224552 -303353 -104241 124972
8211A24972q0847j94238k2792J20941J46594m6335O0241M2431j5353J5456m7567
$$ 124972 44125 -150113 -172905 -51964 94630 48295 108536 150967 135614 151070 103503
8200A03503j50465J6667M1205p1287k68302m2716K16653J20733L3725l066k0012
$$ 103503 -46962 -30295 10910 -60377 -328679 -371395 -154742 -34009 -284 -3350 -23362
8189b3362M0312P6910o1169J02454o8349p7253M946K7689J5519N7353L9240J329
$$ -23362 16950 93860 32691 135145 66796 -10457 -5511 22178 37697 95050 134290 135619
8177A35619L012K0826M0890k0816n9619j29284j3338O859j68840O3788J2147K5605
$$ 135619 138631 159457 200347 179531 119912 -9372 -22710 -15851 -184691 -120903 -108756 -83151
8165h3151J34583N6739O5391n2671j56745J554M0312n6073K9855N4039R4191K427
$$ -83151 51432 108171 173562 120891 -35854 -34300 6012 -50061 -20206 33833 128024 130451
8153A30451l8386K09691N3856m4448r2809l7699j29773M4580k143J7536R2737
$$ 130451 92065 301756 355612 311164 218355 180656 50883 95463 93320 110856 203593
8142B03593j11171N6300M1466j97895l2739j0294J63558Q6680k3661j6901j55751
$$ 203593 92422 148722 190188 -7707 -40446 -50740 112818 199498 175837 158936 3185
8131C185o5600J09460p5444m6760N4415l2601J5922k363o9289K3543J16744P9573
$$ 3185 -62415 47045 -28399 -75159 -20744 -53345 -37423 -39786 -109075 -85532 31212 110785
8119A10785m2812j9113K9066n7454j19000J6694M8999J9391m5903k2240l4428
$$ 110785 67973 48860 77926 20472 -98528 -81834 -32835 -13444 -59347 -81587 -116015
8108a16015M8441M5841n091K9581R531M4935K1008r5687m7625P5219J77563L5875
$$ -116015 -67574 -21733 -26824 2757 12288 57223 78231 -17456 -65081 10138 187701 223576
8096B23576r8850n822j5681j21253K1402K5615J3293m6019j02405J765J2517O4476
$$ 223576 124726 118904 103223 -18030 3372 28987 42280 -3739 -106144 -104379 -91862 -27386
8084b7386J9901N906r1434p9545Q2084k3752k04980J11278O0639K122l9292K74563
$$ -27386 -7485 -1579 -93013 -172558 -90474 -114226 -319206 -207928 -147289 -145167 -184459 90104
8072I0104K9427k07634j69674j6808O2688N5468L4330J83534J43777j32380j06371
$$ 90104 119531 -88103 -257777 -274585 -211897 -156429 -122099 61435 205212 72832 -33539
8061c3539J3838R9762J631K2477Q4597N3760O9374m5303j24445R250o833m2857
$$ -33539 -19701 80061 81692 104169 188766 242526 311900 266597 142152 151402 144569 101712
8049A01712p4499p8560k755J07979P8410q7381o1940J93658J45526m4213l8433
$$ 101712 27213 -51347 -54102 53877 132287 44906 -17034 176624 322150 277937 239504
8038B39504j10902l8918J8022k9890r3094P4954J8878j76627j20697N7894M7670
$$ 239504 128602 89684 107706 77816 -15278 59676 78554 -98073 -218770 -160876 -113206
8027a13206m6314o7021J44175O9259l6344K0948l6621N2266q3877j00253J8322
$$ -113206 -159520 -226541 -82366 -13107 -49451 -28503 -65124 -12858 -96735 -196988 -178666
8016a78666J37180Q6605P2207o2751l2496Q8507J40511K1096j85227l5254m779
$$ -178666 -41486 45119 117326 54575 22079 110586 251097 272193 86966 51712 46933
8005D6933M2865j55244O6062J28920l9887j900N8426l1273o2468K186j10766O7668
$$ 46933 89798 -65446 616 129536 89649 87749 146175 114902 52434 54620 -56146 11522
7993A1522q001j17891K087J72033K0161K766l9359n4970j23552J43378K4387o9300
$$ 11522 3521 -114370 -112283 59750 79911 82677 43318 -11652 -135204 8174 32561 -36739
7981c6739j03216n5714Q5622J8817k15506o1279J28645J21652J10170P183j2105
$$ -36739 -139955 -195669 -110047 -91230 -306736 -368015 -239370 -117718 -7548 -365 -12470
7970a2470l9120P6264J9041Q1235J3805N662j01179K7614M4292j09065O6662K6611
$$ -12470 -51590 24674 43715 124950 138755 144417 43238 70852 115144 6079 72741 99352
7958I9352j47421m8626j1685O7213L6036m8696R3552O9318j44620o2933J51258
$$ 99352 -48069 -96695 -108380 -41167 -5131 -53827 39725 109043 -35577 -98510 52748
7947E2748J4239q9595m7290R257N5993N862l3186M5694l3232m0428J31252M2869
$$ 52748 66987 -22608 -69898 -60641 -4648 1214 -31972 13722 -19510 -59938 71314 114183
7935A14183r3832k6494M6521R2125K9871q509j56914j10936L6833k433p7531J2560
$$ 114183 20351 -6143 40378 132503 162374 153865 -3049 -113985 -77152 -79585 -157116 -144556
7923a44556P5776K4251N136l9236K0670L276R478j1132J12588l0398p2316l8040
$$ -144556 -68780 -44529 -39393 -78629 -57959 -54683 -45205 -56337 56251 25853 -46463 -84503
7911h4503R0228j9885M3548p1165O075O9592o641l9292l9109Q986N232Q4914J62211
$$ -84503 5725 -14160 29388 -41777 -35702 33890 27249 -12043 -51152 -42166 -36934 47980 210191
7898B10191K7569o0991p1008q847o5915r673J00017M5546n9200q2777l3172J2343
$$ 210191 237760 176769 105761 96914 30999 21326 121343 166889 107689 24912 -8260 4083
7886D083j3741P7005J9844j483m5317r5220l4544p93r8980M4310L6393M4076M5231
$$ 4083 -9658 67347 87191 85708 40391 -54829 -89373 -90166 -189146 -144836 -108443 -64367 -19136
7873a9136J92798n0172j62936j9767P4469O3359L7820J8422j1564p2517K0578
$$ -19136 173662 123490 -39446 -59213 15256 78615 116435 134857 123293 50776 71354
7862G1354q4716m7811m3020L3570N5777J4507L8873m583M356P2838L8241n1069
$$ 71354 -13362 -61173 -104193 -70623 -14846 -339 38534 33951 38307 111145 149386 98317
7850I8317j83366n9131m3120k6766K4240R140J3764J100O0656O260j20366k4245
$$ 98317 -85049 -144180 -187300 -214066 -189826 -180686 -166922 -165822 -105166 -98906 -219272 -243517
7838b43517J38782L7893J27512O146k3397l1576j82625K5040Q0115P5247J7973
$$ -243517 -104735 -66842 60670 66816 43419 11843 -170782 -145742 -65627 9620 27593
7827B7593q9981j7656J02329j4419l5943l9960k0775J0975K05867J15551r5354
$$ 27593 -62388 -80044 22285 7866 -28077 -68037 -88812 -77837 128030 243581 148227
7816A48227j75469j39545j31139m5813J5418J45016K07765O8309K833q9169o8335
$$ 148227 -27242 -166787 -297926 -343739 -328321 -183305 24460 92769 95602 6433 -61902
7805f1902O9111j06345p8883j8497j7879J30042k333n7350m115M2526J7190L343
$$ -61902 7209 -99136 -178019 -196516 -214395 -84353 -86686 -144036 -148151 -105625 -88435 -85092
7793h5092N8884j50453k2450J85766p6808r0905P463J4117L1250J15735J03443
$$ -85092 -26208 -176661 -199111 -13345 -90153 -181058 -173595 -159478 -128228 -12493 90950
7782I0950j51042Q1410J25270P3441o4213K0044j80404J05130o845j6752q6111
$$ 90950 -60092 21318 146588 220029 155816 175860 -4544 100586 93741 76989 -9122
7771i122j19096M0690J6129j8672J1125m0550m0388m3548O5604Q9542K11668n8825
$$ -9122 -128218 -87528 -71399 -90071 -78946 -119496 -159884 -203432 -137828 -48286 163382 104557
7759A04557j15246k140j985P7111j5783j16965k20580j2989l2021K3236M5936
$$ 104557 -10689 -12829 -14814 62297 46514 -70451 -291031 -304020 -336041 -312805 -266869
7748b66869P6239k9364k4061K4864Q5949J64196L5601q6467j44507J01862K12560
$$ -266869 -190630 -219994 -244055 -219191 -133242 30954 66555 -19912 -164419 -62557 150003
7737A50003k4915r3845M822L822q2036L0562R9213j6880K0590o3107j09284J9402
$$ 150003 125088 31243 36065 39887 -42149 -11587 87626 70746 91336 28229 -81055 -61653
7725f1653K4743l5368j8604j3655L5945J27245O0347j24353j13783j42345M2437
$$ -61653 -36910 -72278 -90882 -104537 -68592 58653 119000 -5353 -119136 -261481 -219044
7714b19044Q0519N3905l3025j33437M7576K39023K14697j44180k3348m5821j23570
$$ -219044 -138525 -84620 -117645 -251082 -203506 35517 250214 106034 82686 36865 -86705
7703h6705P374P850L9839o5295o2383k7346R3753J22092Q1928n2101j03378j9368
$$ -86705 -79331 -71481 -31642 -96937 -159320 -186666 -92913 29179 111107 59006 -44372 -63740
7691f3740K9462o7748p79K48032J62397K477j24322j35221k2738n1883j74561
$$ -63740 -34278 -102026 -102805 145227 307624 310101 185779 50558 27820 -24063 -198624
7680a98624p4740N5326Q8650o0338o5008P5628L5193R856J77786L7244J9599p059
$$ -198624 -273364 -218038 -129388 -189726 -254734 -179106 -143913 -134057 43729 80973 100572 93513
7668I3513o7574P2888P18n3146n5438j12340r3440J52880J53602N1463J06830
$$ 93513 25939 98827 99545 46399 -9039 -121379 -214819 -61939 91663 143126 249956
7657B49956l3775q1113j36706k9245J65514J692j0114j04159N0514O3223m1505
$$ 249956 216181 135068 -1638 -30883 134631 136323 126209 22050 72564 135787 94282
7646I4282j4664M8647q0187M1774O4441m4816k4811o3711j3918P243j2029k6785
$$ 94282 79618 128265 48078 89852 154293 109477 84666 20955 7037 14280 2251 -24534
7634b4534L4618j5691J9919J0916j05810k4076L3889O479J09592N7754p4327q2790
$$ -24534 10084 -5607 14312 25228 -80582 -104658 -70769 -64290 45302 103056 28729 -54061
7622e4061O8394J7676J20089P112j98938l8664K5143o9945n5475J10709K16504
$$ -54061 14333 32009 152098 159210 -39728 -78392 -53249 -123194 -178669 -67960 148544
7611A48544m4394n8395n3879j8522K1535O6514q4479j6057K1748j58358k3631
$$ 148544 104150 45755 -8124 -26646 -5111 61403 -23076 -39133 -17385 -175743 -199374
7600a99374R063j960O0779J02384j4627j11547j3537J55758J4138p7070j04460
$$ -199374 -190311 -192271 -131492 -29108 -43735 -155282 -168819 -13061 1077 -75993 -180453
7589a80453k9189J68627Q4703j14412l7897l7884O4160N8945R3876R7594Q1616
$$ -180453 -209642 -41015 43688 -70724 -108621 -146505 -82345 -23400 70476 168070 249686
7578B49686j07703q5983M2049L2070N447r192N9143N0271j04215o9160j8770J23686
$$ 249686 141983 56000 98049 130119 135566 126374 185517 235788 131573 62413 43643 167329
7566A67329J2839j59551k6436m0525O126K4958Q5503P3050o3362r0343M760l3481
$$ 167329 180168 20617 -5819 -46344 -40218 -15260 70243 143293 79931 -10412 -5652 -39133
7554c9133K5530j01438j73824m8914K14747K28919K7001o3274L709P1958q2222
$$ -39133 -13603 -115041 -288865 -337779 -123032 105887 132888 69614 73323 145281 63059
7543F3059m7885N7750Q6726J4012l1103j10652j33328j4407j221m325Q983J572
$$ 63059 15174 72924 159650 173662 142559 31907 -101421 -115828 -117049 -121374 -112391 -110819
7531a10819L4625J17896k2256j23516q3447m4525m0096L3863M2292P7434J5170
$$ -110819 -76194 41702 19446 -104070 -187517 -232042 -272138 -238275 -195983 -118549 -103379
7520a03379M2987J10446k2388q3954m0133M1254r2768m4674O4204K3060N4182
$$ -103379 -60392 50054 27666 -56288 -96421 -55167 -147935 -192609 -128405 -105345 -51163
7509e1163l9194M9823j00637n3824J52397J26008j01200q1975m0969p4134L8346
$$ -51163 -90357 -40534 -141171 -194995 -42598 83410 -17790 -99765 -140734 -214868 -176522
7498a76522J37783k3948j1218n1051K1864N2127j63416r8340j4886m7060O9871
$$ -176522 -38739 -62687 -73905 -124956 -103092 -50965 -214381 -312721 -327607 -374667 -304796
7487c04796J80471J15003J41427R0456o7249j4470m3604l4713K3872L2984j85553
$$ -304796 -124325 -9322 132105 222561 155312 140842 97238 62525 86397 119381 -66172
7476f6172k5614n6969p9126j13505J17200J67479m0669P2304J70136l6643r8503
$$ -66172 -91786 -148755 -227881 -341386 -224186 -56707 -97376 -25072 145064 108421 9918
7465I918n6267N3689N1267O0066q3949K9726J15178J5894j6328r2895j8503N7600
$$ 9918 -46349 7340 58607 118673 34724 64450 179628 195522 179194 86299 67796 125396
7453A25396P4930Q433p5495j79684m8104K867q6929k0139j03715K4186J60480
$$ 125396 200326 208759 133264 -46420 -94524 -91657 -178586 -198725 -302440 -278254 -117774
7442a17774K3720J25375r5445p3220j18937k7773J22646l7266j14845O8254J13188
$$ -117774 -94054 31321 -64124 -137344 -256281 -284054 -161408 -198674 -313519 -245265 -132077
7431a32077J05145J25595m9732k20967p8737N5791J34259k6084o8888O4658P517
$$ -132077 -26932 98663 48931 -172036 -250773 -194982 -60723 -86807 -155695 -91037 -83520
7420h3520l3616q4791p857l6204l2678J56948k3970l4975K1622J27407O3701m8914
$$ -83520 -117136 -201927 -209784 -245988 -278666 -121718 -145688 -180663 -159041 -31634 32067 -16847
7408a6847N5124m411j12411L412l8262o8046j13861j488J51011L0763K5535O0603
$$ -16847 38277 33866 -78545 -75133 -113395 -181441 -295302 -296790 -145779 -115016 -89481 -28878
7396b8878m6011J34937K6462l0185n8546j62432O9082N282n4310M1263p9657k0198
$$ -28878 -74889 60048 86510 56325 -2221 -164653 -95571 -90289 -144599 -103336 -182993 -203191
7384b03191q176R9619J25659M3076M1070q6591j47198L6197Q5272m4779M1918
$$ -203191 -211367 -111748 13911 56987 98057 11466 -135732 -99535 -14263 -59042 -17124
7373a7124Q670O279K4522M3657m5525n760N2800Q2827n5015j71148j09400N0483
$$ -17124 -8454 -2175 22347 66004 20479 14719 67519 150346 95331 -75817 -185217 -134734
7361a34734J03302K5116J4109l8419R2949j25768q5545k4182k3694J5167j2622
$$ -134734 -31432 -6316 7793 -30626 62323 -63445 -148990 -173172 -196866 -181699 -194321
7350a94321P8623J48305m0326j27946J37750N8425p5183K650r2176j70537P3425
$$ -194321 -115698 32607 -7719 -135665 2085 60510 -14673 -12023 -104199 -274736 -201311
7339b01311J5295N1551M7441l8290j32258M9535O96K4968K9575J5889Q4080P6142
$$ -201311 -186016 -134465 -87024 -125314 -257572 -208037 -207341 -182373 -152798 -136909 -52829 23313
7327B3313j7653q8325p1127k2328J29601J21194Q9650N816o7276o1112l1035m2628
$$ 23313 5660 -82665 -153792 -176120 -46519 74675 164325 170141 102865 41753 10718 -31910
7315c1910j48375N3611l8894l2787n898L2629L0578j23300j4279k591L0868J00536
$$ -31910 -180285 -126674 -165568 -198355 -204253 -171624 -141046 -264346 -278625 -281216 -250348 -149812
7303a49812k8858l7027J38422J20227n69j48786k5710n843M2059J54877j41351
$$ -149812 -178670 -215697 -77275 42952 42383 -106403 -132113 -137956 -95897 58980 -82371
7292h2371r0719R4808K0724m3493n8797K0974J3410o2594K778L3304K9111j3218
$$ -82371 -173090 -78282 -57558 -101051 -159848 -138874 -125464 -188058 -185280 -151976 -122865 -136083
7280a36083j33491N7304q8752l8452K7951K04632L0618p0597M3636Q705j4841
$$ -136083 -269574 -212270 -301022 -339474 -311523 -106891 -76273 -146870 -103234 -94529 -109370
7269a09370j3221R7909p0841L620l0499P862N1191Q4503P4613n1660n7326J03364
$$ -109370 -122591 -24682 -95523 -91903 -122402 -114540 -63349 21154 95767 44107 -13219 90145
7257I0145R7320j2922j63647j65960l8640Q5751n3430p8002L2659M8242J34375
$$ 90145 187465 174543 10896 -155064 -193704 -107953 -161383 -239385 -206726 -158484 -24109
7246b4109Q0471J7431j06143o7821m0812j1513k2246j8997N4634o5436J48902
$$ -24109 56362 73793 -32350 -100171 -140983 -152496 -174742 -193739 -139105 -204541 -55639
7235e5639J85177k8265m7148j5088O2266j5303j20047j61280o708J62318J04677
$$ -55639 129538 101273 54125 39037 101303 86000 -34047 -195327 -202035 -39717 64960
7224F4960M9913j4375j26005k2205j6825m8677J9364J39157R2409J9440o8984
$$ 64960 114873 100498 -25507 -47712 -64537 -113214 -93850 45307 137716 157156 88172
7213H8172j13055k4286o2949L1237N672P4891N0401p9196K6406J7549j028j25550
$$ 88172 -24883 -49169 -112118 -80881 -75209 -318 50083 -29113 -2707 14842 13814 -111736
7201a11736r687K6225k4264j4144L8340N0971M0731M4206p1890n9357J68553p114
$$ -111736 -121423 -95198 -119462 -133606 -95266 -44295 -3564 40642 -31248 -90605 77948 70834
7189G0834j16998N9881J04076l4752k14206n6357J17347J17503J39788J1740L4907
$$ 70834 -46164 13717 117793 83041 -131165 -187522 -70175 47328 187116 198856 233763
7178B33763q1927j24348L5708n5800N9046j00347j67405R5007o7581n5572L2721
$$ 233763 151836 27488 63196 7396 66442 -33905 -201310 -106303 -173884 -229456 -196735
7167a96735n743m0490m0889J01652M8693K8008K2290P826J17267R043r2641j39212
$$ -196735 -202478 -242968 -283857 -182205 -133512 -105504 -83214 -75388 41879 50922 -41719 -180931
7155a80931r6649J25693K33635R7625K5543j2518N611j74142n7872o1847m2055
$$ -180931 -277580 -151887 81748 179373 204916 192398 198009 23867 -34005 -95852 -137907
7144a37907O8075k1501J17527J15303n0571j21011p6471Q4348J55851N004j9478
$$ -137907 -69832 -91333 26194 141497 90926 -30085 -106556 -22208 133643 138647 119169
7133A19169q6359j41350j24327j17096O149Q7971P5585j2611M2622R8805L5650
$$ 119169 32810 -108540 -232867 -349963 -343814 -255843 -180258 -192869 -150247 -51442 -15792
7122a5792N2246J5688M3975k9344K5471l4121r9821j45333n5400P8939J92857
$$ -15792 36454 52142 96117 66773 92244 58123 -41698 -187031 -242431 -163492 29365
7111B9365O3049L5071L1491m5710J6191K1266J0990j30462r0990r4719j87513
$$ 29365 92414 127485 158976 113266 129457 150723 161713 31251 -59739 -154458 -341971
7100c41971n2047J04385K33335J30371K1823O8342n3209r1215p0870n8606j17935
$$ -341971 -394018 -289633 -56298 74073 95896 164238 111029 19814 -51056 -109662 -227597
7089b27597k0197R8251l7520R1446L470l1339J0085Q7440q799l7939k6549J41418
$$ -227597 -247794 -149543 -187063 -95617 -92147 -123486 -113401 -25961 -34760 -72699 -99248 42170
7077D2170j9818r7549m3953J08663M4903k1722J8688n0368n4291P4793k8688L2526
$$ 42170 22352 -75197 -119150 -10487 34416 12694 31382 -18986 -73277 1516 -27172 5354
7065E354J5614L9703P824j2513o9572O434J08431m8265q059j09613n1829j4289
$$ 5354 20968 60671 68495 55982 -13590 -7156 101275 53010 44951 -64662 -116491 -130780
7053a30780l7056Q502O4325J35874P1809j12913o6548j23531o9761K4940K07699
$$ -130780 -167836 -159334 -95009 40865 112674 -239 -66787 -190318 -260079 -235139 -27440
7042b7440J67965l3440j88105K1421J1564m6941N565J06572P4533L750l5780p6890
$$ -27440 140525 107085 -81020 -59599 -48035 -94976 -89411 17161 91694 95444 59664 -17226
7030a7226P794K0329J8019J46646j8252j28093o3469n599J08705J53054j2758
$$ -17226 -9432 10897 28916 175562 157310 29217 -34252 -39851 68854 221908 209150
7019B09150k67267j63846m3038k0684N9200K50809Q3386J59897j40273j55103
$$ 209150 -58117 -221963 -265001 -285685 -226485 24324 107710 267607 127334 -27769
7009b7769l2074j8104j153Q9803K0003K8417k37l1938l7542k6768r3585o3311
$$ -27769 -59843 -77947 -79100 10703 30706 59123 58886 26948 -10594 -37362 -130947 -194258
6997a94258m5514R6339O0778Q8449R2408r9916j4096J35681j38041j06224N2573
$$ -194258 -239772 -143433 -82655 5794 98202 -1714 -15810 119871 -18170 -124394 -71821
6986g1821K6210l4805P0034Q07R679N5575j40466q1187P4696J03616K2684l7680
$$ -71821 -45611 -80416 -10382 -9575 104 55679 -84787 -165974 -91278 12338 35022 -2658
6974b658m2195j53340n3094J03780Q8532j2275j3224j57706R2120j1167j947L6348
$$ -2658 -44853 -198193 -251287 -147507 -58975 -71250 -84474 -242180 -150060 -161227 -163174 -126826
6962a26826J9276J1068r6969N7067K0955R980K7187n6682R6328J02505j26959
$$ -126826 -107550 -96482 -193451 -136384 -115429 -105449 -78262 -134944 -38616 63889 -63070
6951f3070l8533k4101j49228j8174N0180J41873J88650J7030J7899l0942q3574
$$ -63070 -101603 -125704 -274932 -293106 -242926 -101053 87597 104627 122526 91584 8010
6940H010n5150r3125J07311N7181j52744M9090M0961L170L7365r9290n4396J9102
$$ 8010 -47140 -140265 -32954 24227 -128517 -79427 -38466 -35296 2069 -97221 -151617 -132515
6928a32515J49762J61866j40894k07946Q0244N1576J31331R6305j81532j28141
$$ -132515 17247 179113 38219 -169727 -89483 -37907 93424 189729 8197 -119944
6918a19944L309O7835j3652J33817J18989n1286q5814J24412K453j11642j02116
$$ -119944 -116635 -48800 -62452 71365 190354 139068 53254 177666 180119 68477 -33639
6907c3639J04900J14804k7956q9583q0039n0491M7231M7888n4737K22911j01853
$$ -33639 71261 186065 158109 68526 -11513 -62004 -14773 33115 -21622 201289 99436
6896I9436p6167k8309j82539q1062Q9279J88275n3324J6882J63337M2276j22902
$$ 99436 23269 -5040 -187579 -268641 -179362 8913 -44411 -27529 135808 178084 55182
6885E5182j03703j4555O9720n7480M8064p5208p7394K49329O0751j01365r7985
$$ 55182 -48521 -63076 6644 -50836 -2772 -77980 -155374 93955 154706 53341 -44644
6874d4644j07841p3360M4727J5823O2839L2905Q4548L5874p9957m2354r5571o1763
$$ -44644 -152485 -225845 -181118 -165295 -102456 -69551 14997 50871 -29086 -71440 -167011 -228774
6862b28774N7588J24588M2958n4041N2607j17094L3949P6146r7776j7213J50876
$$ -228774 -171186 -46598 -3640 -57681 -5074 -122168 -88219 -12073 -109849 -127062 23814
6851B3814J38140M3902k1897N6338j9403k12136j79300m4601J17271N8934l7928
$$ 23814 161954 205856 183959 240297 220894 8758 -170542 -215143 -97872 -38938 -76866
6840g6866j2261q6139K0892J5089M764O9480K7291P0764r6564o1378J07951J40064
$$ -76866 -89127 -175266 -154374 -139285 -134521 -65041 -37750 33014 -63550 -124928 -16977 123087
6828A23087N1593j73032j4325K2585o8313n3250P5321o9990N840L8002J39540
$$ 123087 174680 1648 -12677 9908 -58405 -111655 -36334 -106324 -100484 -62482 77058
6817G7058J03573j7451M3816n2145m3383M5686m226J4814o1424q3876o3j6817
$$ 77058 180631 163180 206996 154851 111468 157154 152928 167742 106318 22442 22379 5562
6805E562k4161J13346O9005o3272j40110j01324L8047J83958J1382j01948r3840
$$ 5562 -18599 94747 163752 100480 -39630 -140954 -102907 81051 92433 -9515 -103355
6794a03355q3784Q598k8441k404K7499J18047Q4737J31393j591j00516l6119P7037
$$ -103355 -187139 -178541 -206982 -209386 -181887 -63840 20897 152290 150699 50183 14064 91101
6782I1101j7656J6547M3777O3690q2608k1616o201j5813k8323J19106K9715j4047
$$ 91101 73445 89992 133769 197459 114851 93235 87034 71221 42898 162004 191719 177672
6770A77672j7657j47455O107J5119j06113q5938P1889N4244J56949N7737K3865
$$ 177672 160015 12560 18667 33786 -72327 -158265 -86376 -32132 124817 182554 206419
6759B06419k6336q9811r1873j5847j09791n0867j10557P088J16592K2133j892
$$ 206419 180083 90272 -1601 -17448 -127239 -178106 -288663 -281575 -164983 -142850 -144742
6748a44742L5148J90257l3053O5492l79k859R478j1576o396n5936P2492J4915
$$ -144742 -109594 80663 47610 113102 112723 109864 119342 107766 101370 45434 117926 132841
6736A32841J4711r2463q9376L6766l1360j7626O8129N467N7264J7887p4026P7933
$$ 132841 147552 55089 -34287 2479 -28881 -46507 21622 27089 84353 102240 28214 106147
6724A06147j09241j37422M0429L5098Q9226R666j07198L4952j2717j64839l05
$$ 106147 -3094 -140516 -100087 -64989 24237 33903 -73295 -38343 -51060 -215899 -216204
6713b16204K10696J15811Q5907l0460n9112J07158o5261j74560N8055N1760L7926
$$ -216204 -5508 110303 196210 165750 106638 213796 148535 -26025 32030 83790 121716
6702A21716j26345L7367j8900q9744R8996p742J1733N4350Q006R7872r4711j88511
$$ 121716 -4629 32738 13838 -75906 23090 15348 27081 81431 89437 187309 92598 -95913
6690i5913m5816q5829m630m2659Q4940N6523o6280M525R6301P0837J3580J9315
$$ -95913 -141729 -227558 -232188 -274847 -189907 -133384 -199664 -195139 -98838 -28001 -14421 4894
6678D894Q0876j82008l6839M9889N3487p0757j27655o3091N8028J0138N3473L7414
$$ 4894 85770 -96238 -133077 -83188 -29701 -100458 -228113 -291204 -233176 -223038 -169565 -132151
6666a32151P4245Q9378j8998j10580r2982k2732l4066k4388j8397J53434L8414
$$ -132151 -57906 31472 12474 -98106 -191088 -213820 -247886 -272274 -290671 -137237 -98823
6655i8823j17401o9854J61125R3863k8685N2128L2422k7419j07967R7492J4210
$$ -98823 -216224 -286078 -124953 -31090 -59775 -7647 24775 -2644 -110611 -13119 1091
6644A091j22718J2750J8164J6147L5013O885J7332R5231J26394n1651j69372P3473
$$ 1091 -121627 -108877 -90713 -74566 -39553 -32668 -15336 79895 206289 154638 -14734 58739
6632E8739J5605K1507j37751k5181M2469K4545O972O7562M4211j5794o8338J62730
$$ 58739 74344 95851 -41900 -67081 -24612 -67 6905 74467 118678 102884 34546 197276
6620A97276q4242o9221o4768j4885J26894M9572q1347j20943n1229n3167K3224
$$ 197276 113034 43813 -20955 -35840 91054 140626 59279 -61664 -112893 -166060 -142836
6609a42836R7619j6954j7131O1154k02244j3535Q8700R3713M7550p3886M6309
$$ -142836 -45217 -62171 -79302 -18148 -220392 -233927 -145227 -51514 -3964 -77850 -31541
6598c1541o0014O360R5544P6311K1522L2563j04724j30819L4670P455l7930p0756
$$ -31541 -91555 -85195 10349 86660 108182 140745 36021 -94798 -60128 -52673 -90603 -161359
6586a61359K01160K33595L3575j61404o3528J90620l6061j47982q8414j12991
$$ -161359 39801 273396 306971 145567 82039 272659 236598 88616 202 -112789
6576a12789q7394k3759J50284J14090q0860O053P2476k8355K5294M1572J47839
$$ -112789 -200183 -223942 -73658 40432 -40428 -34375 38101 9746 35040 76612 224451
6565B24451L4027m2129j66666r7088N3868K7700j41677o4020K2857O9970K9136
$$ 224451 258478 216349 49683 -47405 6463 34163 -107514 -171534 -148677 -78707 -49571
6554d9571J00799l8189j37441j0750J06452J76741J7564P522O1857j27425j53539
$$ -49571 51228 13039 -124402 -135152 -28700 148041 165605 173127 234984 107559 -45980
6543d5980j31176j0676M4160R2902J7242l0296K2607Q6630J28658K1550j78951
$$ -45980 -177156 -187832 -143672 -50770 -33528 -63824 -41217 45413 174071 195621 16670
6532A6670O324P5725J66132J24991M6303j01791r5411r9792j5657j11232j0661
$$ 16670 22994 98719 264851 389842 436145 334354 238943 139151 123494 12262 1601
6521A601O63P0565O2185l7817j20070j02244j21024M5257N1179k5686J78087O7300
$$ 1601 2264 72829 135014 97197 -22873 -125117 -246141 -200884 -149705 -175391 2696 69996
6509F9996r1036j04801k0969j14807L2465j8989P5862J25119J52122O3114j23475
$$ 69996 -21040 -125841 -146810 -261617 -229152 -248141 -172279 -47160 104962 168076 44601
6498D4601j01480j49094k637m629Q5584K9224J04763J00617m4271j21894k2073
$$ 44601 -56879 -205973 -208610 -213239 -127655 -98431 6332 106949 62678 -59216 -81289
6487h1289L0631j83434n8464J66871j3466r4793O2731N0026L0788j18144j07158
$$ -81289 -50658 -234092 -292556 -125685 -139151 -233944 -171213 -121187 -90399 -208543 -315701
6476c15701J6495Q2279K19659j4553j01068j37208K6363N1577P915N3831Q5191
$$ -315701 -299206 -216927 2732 -11821 -112889 -250097 -223734 -172157 -164242 -110411 -25220
6465b5220k4802k3060o1873n2996Q8032J72081j6212m013l0820M2641J9535M4803
$$ -25220 -50022 -73082 -134955 -187951 -99919 72162 55950 51937 21117 63758 83293 128096
6453A28096j02239M7968K3633q5224N8477M5746K2402o8828j39030J207j7337
$$ 128096 25857 73825 97458 12234 70711 116457 138859 70031 -68999 -67792 -85129
6442h5129J1959j36971L0957o9686k565Q0763j0422N7115L1613O4765m8653j2913
$$ -85129 -73170 -210141 -179184 -248870 -251435 -170672 -181094 -123979 -92366 -27601 -76254 -89167
6430h9167P9952Q8817r712R2576M4814q8119M576k995j3030J5037k7589l0826
$$ -89167 -9215 79602 69890 162466 207280 119161 123737 120742 107712 122749 95160 64334
6418F4334L3931j9796j11613O478j8865N193J70453L1527r9720o6989J70642k0529
$$ 64334 98265 78469 -33144 -26666 -45531 -40338 130115 161642 61922 -5067 165575 145046
6406A45046j18993j26158q5779J093J08743k1737M4780K02583O0010r2344l9999
$$ 145046 26053 -100105 -185884 -184791 -76048 -97785 -53005 149578 209588 117244 77245
6395G7245n2570J35831J44237j00748l6710R840n5926r2047N6764N1876Q3850
$$ 77245 24675 160506 304743 203995 167285 177125 121199 29152 85916 137792 221642
6384B21642j72385k48950J549N7630P0618m8084K5875K06493o4402k62536R6914
$$ 221642 49257 -199693 -198144 -140514 -69896 -117980 -92105 114388 49986 -212550 -115636
6373a15636o8005m4108o7074M8765J22421j744J0886N9387J69085J42059j9312
$$ -115636 -183641 -227749 -294823 -246058 -123637 -125381 -114495 -55108 113977 256036 236724
6362B36724j99597r6493N7031P8869j88307j46922O7533J13968j26594r1292N0266
$$ 236724 37127 -59366 -2335 76534 -111773 -258695 -191162 -77194 -203788 -295080 -244814
6351b44814M3034Q2803R775K7119Q7708m4710q9827R2965Q2356q6160l1851L0650
$$ -244814 -201780 -118977 -109202 -82083 5625 -39085 -128912 -35947 46409 -39751 -71602 -40952
6339d0952k4282K29J4881j0274j01242K4453J28276J05395j0711o8242k29596
$$ -40952 -65234 -65005 -50124 -60398 -161640 -137187 -8911 96484 85773 17531 -212065
6328b12065J2491N6416r6085k7925M551R9134J53804J9741O2713q2501m8504m3006
$$ -212065 -199574 -143158 -239243 -267168 -262617 -163483 -9679 10062 72775 -9726 -58230 -101236
6316a01236l9607j2563j35686P1156Q8709l9465l2254J2448m7909M0289J41714
$$ -101236 -140843 -153406 -289092 -217936 -129227 -168692 -200946 -188498 -236407 -196118 -54404
6305e4404N229J3485K1174L9009Q1737O9088k0330j5781O546j8858j51283j39086
$$ -54404 -49175 -35690 -14516 24493 106230 175318 154988 139207 145753 126895 -24388 -163474
6293a63474L2510O3566J64374J35417k2342p5987Q1721m9329k19391n4472N2702
$$ -163474 -130964 -67398 96976 232393 210051 134064 215785 166456 -52935 -107407 -54705
6282e4705J04374j6815j9298j6669q121n5376r9030M2072p4629O3195J4285j12333
$$ -54705 49669 32854 13556 -3113 -11234 -66610 -165640 -123568 -198197 -135002 -120717 -233050
6270b33050k7988l6209P621M9646J63623M9196J6723l3171O604J9914j8038k9376
$$ -233050 -261038 -297247 -289626 -239980 -76357 -27161 -10438 -43609 -37005 -17091 -35129 -64505
6258f4505J29567K4839K9739l8297r4779m4339j61844p52M5370K29595J14186
$$ -64505 65062 89901 119640 81343 -13436 -57775 -219619 -220371 -175001 54594 168780
6247A68780q488K1691l2643j08007o5142l259n6033K2426O9920L5529L2022j4041
$$ 168780 160292 181983 149340 41333 -23809 -27068 -83101 -60675 9245 44774 76796 62755
6235F2755n2673n2502m2509r3094o0835M10o1999j4964P7354K6774R1068J01381
$$ 62755 10082 -42420 -84929 -178023 -238858 -238448 -300447 -315411 -238057 -211283 -120215 -18834
6223a8834K2414M3907n6930j9735J6429p9223L8986L0139q3658j45804R6276J15264
$$ -18834 3580 47487 -9443 -29178 -12749 -91972 -52986 -22847 -106505 -252309 -156033 -40769
6211d0769j2019j2034J47191k1355j58916J06479O0480j9121J08474j625m4045
$$ -40769 -52788 -64822 82369 61014 -97902 8577 69057 49936 158410 156785 112740
6200A12740j8916j1300j1755p3248m1630Q38J12737R8580l8756q2322R9053r270
$$ 112740 93824 82524 70769 -2479 -44109 -43271 69466 168046 129290 46968 146021 136751
6188A36751r5127l8330m8521J40164l2021j58822l7834J47733O0518N7270O2277
$$ 136751 41624 3294 -45227 94937 62916 -95906 -133740 13993 74511 131781 194058
6177A94058r537j34410L4126l1932J08141q7370j62075m4298O5414k5473L0977
$$ 194058 184521 50111 84237 52305 160446 73076 -88999 -133297 -67883 -93356 -62379
6166f2379K3991P7705Q0597Q6740L2284j21721k9170n3720j4263P779M553j5308
$$ -62379 -38388 39317 119914 206654 238938 117217 88047 34327 20064 27843 32396 17088
6154A7088l4213k9893j27899J40398j3631k7540N0542J33405K6654Q802j8466
$$ 17088 -17125 -47018 -174917 -34519 -48150 -75690 -25148 108257 134911 143713 125247
6143A25247k5075j04426o0729o4693k5178n83J6480Q9004K9923L2314p7390p6505
$$ 125247 100172 -4254 -64983 -129676 -154854 -155437 -138957 -49953 -20030 12284 -65106 -141611
6131a41611J7707K8786Q1537J2659M5036j3904M2077j06588j13096m7034P4518
$$ -141611 -123904 -95118 -13581 -922 44114 30210 72287 -34301 -147397 -194431 -119913
6120a19913M2330N6105M1122M847J07140M0583J01410k94916j10842m3170r588
$$ -119913 -77583 -21478 19644 24491 131631 172214 273624 -21292 -132134 -175304 -184892
6109a84892O9985J05242l325m1456o4107J2159m5955K7529M6129J27499Q0120
$$ -184892 -114907 -9665 -12990 -54446 -118553 -106394 -152349 -124820 -78691 48808 128928
6098A28928L7917K3938M0805m5730r9975m9766j65361q1038R7660N3260P3888
$$ 128928 166845 190783 231588 185858 85883 36117 -129244 -210282 -112622 -59362 14526
6087A4526k6594r5189m7073N562P0652O5582m2016o67M1159r3747N9630j02972
$$ 14526 -12068 -107257 -154330 -148768 -78116 -12534 -54550 -55217 -14058 -107805 -48175 -151147
6075a51147m8482J4040J64806l2048k07396K2608P6964J28583N2207k7898k8260
$$ -151147 -199629 -185589 -20783 -52831 -260227 -237619 -160655 -32072 20135 -7763 -36023
6064c6023o5461J50335N3874j04273j4437P6897N8154m392j0425n1670p0974Q9446
$$ -36023 -101484 48851 102725 -1548 -15985 60912 119066 114674 104249 52579 -18395 71051
6052G1051J05680O219n2215o848j26813n7272l3292M8805N3010o1825j00636n1761
$$ 71051 176731 182950 130735 123887 -2926 -60198 -93490 -44685 8325 -53500 -154136 -205897
6040b05897J17282P0572r0666L908J60697Q699j27232k07455J06909K05980P1599
$$ -205897 -88615 -18043 -108709 -104801 55896 64595 -62637 -270092 -163183 42797 114396
6029A14396n2619j39075o309M4340M7955N6011m2072q6917r5304P7915n900q4030
$$ 114396 61777 -77298 -83607 -39267 8688 64699 22627 -64290 -159594 -81679 -87579 -171609
6017a71609j7164P0135p741M09P3848o581O1883Q3331K2227k26604J2576m960
$$ -171609 -188773 -118638 -126379 -125970 -52122 -58703 3180 86511 108738 -117866 -105290 -110250
6005a10250P3936J81370J17733p1873K5812p9176j60496j3621j4830r7639R642
$$ -110250 -36314 145056 262789 190916 216728 137552 -22944 -36565 -51395 -149034 -139392
5994a39392R1358J06615n2134j14730l2234J2410R6940J6412p8100j7172m8019
$$ -139392 -48034 58581 6447 -108283 -140517 -128107 -31167 -14755 -92855 -110027 -158046
5983a58046K4101O9224L7105j03077n9620R6211J38447M8709O5166j54691p6145
$$ -158046 -133945 -64721 -27616 -130693 -190313 -94102 44345 93054 158220 3529 -72616
5972g2616M9149j19166n6358J18501J9356K7220J9772j5619n7734k0463p6547
$$ -72616 -23467 -142633 -198991 -80490 -61134 -33914 -14142 -29761 -87495 -107958 -184505
5961a84505P2119O0549o6680J12483R1532P4046J9526j0424l0998p9290P863k9949
$$ -184505 -112386 -51837 -118517 -6034 85498 159544 179070 168646 137648 58358 66221 36272
5949C6272j22228k4007Q6885N4864J31245j47157j49623o1632P5184J72728P8065
$$ 36272 -85956 -109963 -23078 31786 163031 15874 -133749 -195381 -120197 52531 130596
5938A30596n0991j8744k11581K1224Q2737r4060j0230J7602P2349p1140n5396
$$ 130596 79605 60861 -150720 -129496 -46759 -140819 -151049 -133447 -61098 -132238 -187634
5927a87634J40330J03836O5947J02350L4500r5478J4161r9829j50529q0555O6177
$$ -187634 -47304 56532 122479 224829 259329 163851 178012 78183 -72346 -152901 -86724
5916h6724J71231R5375k994K183J01457k9702j64744j00411k0063n2278p1232
$$ -86724 84507 179882 176888 179071 280528 250826 86082 -14329 -34392 -86670 -157902
5905a57902L5744J9348j56030m7572k4703j32938K3336K52451R5069j9835j05515
$$ -157902 -122158 -102810 -258840 -306412 -331115 -464053 -440717 -188266 -93197 -113032 -218547
5894b18547J30526P5051l2298J37888K7587J1395j42687j10825r294K2343N7055
$$ -218547 -88021 -12970 -45268 92620 120207 131602 -11085 -121910 -131204 -108861 -51806
5883e1806k9496K4994r3387r8832j11738R254J21057J58877J7089m6234j44819
$$ -51806 -81302 -56308 -149695 -248527 -360265 -351011 -229954 -71077 -53988 -100222 -245041
5872b45041K640K38275L8764l3369L9351m2913m7759j7266Q7153k9314J026k8930
$$ -245041 -242401 -4126 34638 1269 40620 -2293 -50052 -67318 19835 -9479 -8453 -37383
5860c7383j59634P8682J85292R3063o8859j22209p21p4351r8665k3208L9697m3125
$$ -37383 -197017 -118335 66957 160020 91161 -31048 -31769 -106120 -204785 -227993 -188296 -231421
5848b31421k8817k498J05102K1541n9897r3785K07853J12818L4422Q361j5229
$$ -231421 -260238 -262736 -157634 -136093 -195990 -289775 -81922 30896 65318 73679 58450
5837E8450j9537P8815M0420p2160o2090k535K9822m8478j35535o4175L4223L5639
$$ 58450 38913 117728 158148 85988 23898 21363 51185 2707 -132828 -197003 -162780 -127141
5825a27141K2796N205J2817J19394R4994K0399j83072j48297k4080P021k1030
$$ -127141 -104345 -99140 -86323 33071 128065 148464 -34608 -182905 -206985 -199964 -220994
5814b20994J18931J59107J30894j31076p7425j4901M2675n1986n392J12822P0418
$$ -220994 -102063 57044 187938 56862 -20563 -35464 7211 -44775 -50167 62655 133073
5803A33073n3885q3059q6801k3377J71384j6056m8788P6146p412j31296K0973
$$ 133073 79188 -3871 -90672 -114049 57335 41279 -7509 68637 61225 -70071 -49098
5792d9098q272Q5913l9563j48504L7811O546L7111j5702J35683k3466J4171N8101
$$ -49098 -57370 28543 -11020 -159524 -121713 -115167 -78056 -93758 41925 18459 32630 90731
5780I0731J21769j7932l2721j1745p9698j23094r966j92396L0522J94835J16797
$$ 90731 212500 194568 161847 150102 70404 -52690 -62656 -255052 -224530 -29695 87102
5769H7102M7627k36631j34715J72294K70221K8889k50189q7691o6476n3361N1936
$$ 87102 134729 -101902 -236617 -64323 205898 234787 -15402 -103093 -169569 -222930 -170994
5758a70994P73N1836J58151K1392m7946j9700J36856m1628k0546o2994O6204k0986
$$ -170994 -170221 -118385 39766 61158 13212 -6488 130368 88740 68194 5200 71404 50418
5746E0418m1026m9720j03077k8694P7116N0384O3211j1581q1622j09164q0283
$$ 50418 9392 -40328 -143405 -172099 -94983 -44599 18612 7031 -74591 -183755 -264038
5735b64038j2493m8070P5238J70620J32009j52771j8515O0369K1997L8921r2399
$$ -264038 -276531 -324601 -249363 -78743 53266 -99505 -118020 -57651 -35654 3267 -89132
5724h9132j13762m4622J36036P8335M4897j53312N3193O5343m2358j4355J31475
$$ -89132 -202894 -247516 -111480 -33145 11752 -141560 -88367 -23024 -65382 -79737 51738
5713E1738m4595p8475Q7295O5890p3985N7846o7153m1393K8116o8646k796J21588
$$ 51738 7143 -71332 15963 81853 7868 65714 -1439 -42832 -14716 -83362 -86158 35430
5701C5430P2487n9769l3659J5346M7689p8630k12895P7K71239J84422q5633k27507
$$ 35430 107917 48148 14489 29835 77524 -1106 -214001 -213924 57315 241737 156104 -71403
5689g1403j26205k9346p6471J5250k4471j0772Q3155J98556M4383L1052J8672
$$ -71403 -197608 -226954 -303425 -288175 -312646 -323418 -240263 -41707 2676 33728 52400
5678E2400m6144o1681m7336j37184J19754L0535n9179J63074L3041P8982j85167
$$ 52400 6256 -55425 -102761 -239945 -120191 -89656 -148835 14239 47280 126262 -58905
5667e8905j22161J21962J40582k7970P8784p0892m0766k0190m8774K0990N3113
$$ -58905 -181066 -59104 81478 53508 132292 61400 20634 444 -48330 -27340 25773
5656B5773R340r2574j35846O785J01956L3631l6391j8074J811L7509J10662R9402
$$ 25773 35113 -57461 -193307 -186522 -84566 -50935 -87326 -105400 -103589 -66080 44582 143984
5644A43984j8864j71422N7759O7703J07990m7422j13826j04102n8075O3929J3042
$$ 143984 125120 -46302 11457 79160 187150 139728 25902 -78200 -136275 -72346 -59304
5633e9304L8850K2196Q5609k6715O1949M7560r605L4265l3520r0915J64190O0177
$$ -59304 -20454 1742 87351 60636 122585 170145 160540 194805 161285 70370 234560 294737
5621B94737j24055j49925j13323j3052q104R3731l3916o5465R0952K8908N7376
$$ 294737 170682 20757 -92566 -105618 -113722 -19991 -53907 -119372 -28420 488 57864
5610E7864M0079k1891j33831L4593J44169l5158j44220m5879M1614r7970r0569
$$ 57864 97943 76052 -57779 -23186 120983 85825 -58395 -104274 -62660 -160630 -251199
5599b51199J66910M5328N916J24451P3592j01669j51725j02431m4961K15194K0185
$$ -251199 -84289 -38961 -33045 91406 164998 63329 -88396 -190827 -235788 -20594 -409
5588d09j20839m0864j398J13947N4140o9619O6345M3813P1228l2734j43856k16201
$$ -409 -121248 -162112 -163510 -49563 4577 -65042 1303 45116 116344 83610 -60246 -276447
5576b76447P9212Q7503N9094m3843j9046o3803J28839L5430K2444O759l7793N0608
$$ -276447 -197235 -109732 -50638 -94481 -113527 -177330 -48491 -13061 9383 16142 -21651 28957
5564B8957R3282m4005q5662Q7692K2379p5662p4924M8512j4551j37813l2606J70808
$$ 28957 122239 78234 -7428 80264 102643 26981 -47943 569 -13982 -151795 -184401 -13593
5552a3593P233j08176K9225J06242J3735K7307l1323n5883M7126N9586J7964M522
$$ -13593 -6360 -114536 -85311 20931 34666 61973 30650 -25233 21893 81479 99443 103965
5540A03965j24109m5025j9612k1794n204K1939O8405q5078q2440l5581N8858K9889
$$ 103965 -20144 -65169 -84781 -106575 -111779 -89840 -21435 -106513 -188953 -224534 -165676 -135787
5528a35787J03872J37325L5600P5288K5992k6529O5781P2j04354j99534n9824
$$ -135787 -31915 105410 141010 216298 242290 215761 281542 281614 177260 -22274 -82098
5517h2098P4683P9087J3609r9265q7419j23498R0944J20087N2925O9578l6380
$$ -82098 -7415 71672 85281 -13984 -101403 -224901 -133957 -13870 39055 108633 72253
5506G2253j74361l4192R195J08894M534L8633k8900j24947q6981L0644J93926
$$ 72253 -102108 -136300 -127105 -18211 -13677 24956 -3944 -128891 -215872 -185228 8698
5495H698J12494N7947q0457r002Q3469j50874j27224J5039j0408N4695J79288
$$ 8698 121192 179139 98682 89680 173149 22275 -104949 -89910 -100318 -45623 133665
5484A33665n8416j25759K4863k4755o7233K6494J22255n7932l2404j11529J02502
$$ 133665 75249 -50510 -25647 -50402 -117635 -91141 31114 -26818 -59222 -170751 -68249
5473f8249L5904K5257l662Q5462J22137r6711j69274p3877J15353J67791J7911
$$ -68249 -32345 -7088 -10750 74712 196849 100138 -69136 -143013 -27660 140131 158042
5462A58042l7289m1230p1446n1772k8030r1928Q348P0292N8622M4796n3899L0730
$$ 158042 120753 79523 8077 -43695 -71725 -163653 -155305 -85013 -26391 18405 -35494 -4764
5450d764R1414j9743N901K1884J00209J2094k72825p3560R7493R0439O3233R273
$$ -4764 86650 66907 72808 94692 194901 206995 -65830 -139390 -41897 48542 111775 121048
5438A21048J3391k6814n5295m8733K9105Q6299Q8912q214p7845k1404J26395n4066
$$ 121048 134439 107625 52330 3597 32702 119001 207913 199699 121854 100450 226845 172779
5426A72779j15666n9693j3979N9237N3423O8825j2179r9085j62627j1878O244
$$ 172779 57113 -2580 -16559 42678 96101 164926 152747 53662 -108965 -120843 -114599
5415a14599l0732N1719N8487Q7414M458N4519J0666o6633P6198N2350k6852j6253
$$ -114599 -145331 -93612 -35125 52289 56747 111266 121932 55299 131497 183847 156995 140742
5403A40742J28163j07811J1309k9353J2873O7628j34144r1008p2992j48210n9652
$$ 140742 268905 161094 172403 143050 155923 223551 89407 -1601 -74593 -222803 -282455
5392b82455q575J19290J10604J27014J39445o832j70159o6346o3993o5727J03551
$$ -282455 -291030 -171740 -61136 65878 205323 198491 28332 -38014 -102007 -167734 -64183
5381f4183M7203M6962M9428j5162j65151n5357k752J60893J20846k1153r7212
$$ -64183 -16980 29982 79410 64248 -100903 -156260 -159012 1881 122727 101574 4362
5370D362n2014M9594N969o2000m084K980L708M0742N8154j5144j8016M4030j30551
$$ 4362 -47652 1942 7911 -54089 -58173 -55193 -51485 -10743 47411 32267 14251 58281 -72270
5357g2270j56649N7370J09992r167N8113o4833o0922Q27q059J87917L2881j20063
$$ -72270 -228919 -171549 -61557 -70724 -12611 -77444 -138366 -137539 -145598 42319 75200 -44863
5345d4863K3278Q9623N1504L3532J07589q5938n7482j8660n8577K6590O8838r6399
$$ -44863 -21585 68038 119542 153074 260663 174725 117243 98583 40006 66596 135434 39035
5333C9035l027k9197K6749Q8129Q3517J31325m8779j93147j10666K7281q0381
$$ 39035 36008 6811 33560 121689 205206 336531 287752 94605 -16061 11220 -69161
5322f9161P0734R7734N0097r1246m4179O9024m2309l6806Q693o6734k4399J21373
$$ -69161 1573 99307 149404 58158 13979 83003 40694 3888 12581 -54153 -78552 42821
5310D2821k9165P5729j1667j14899j18242m3161K8506O1187l2862Q7065Q571J8085
$$ 42821 13656 89385 77718 -37181 -155423 -198584 -170078 -108891 -141753 -54688 -46117 -28032
5298b8032j007M9017O8829O4823K487L6564j09232m6083l8793l7307K2374L4620
$$ -28032 -29039 19978 88807 153630 156117 192681 83449 37366 -1427 -38734 -16360 18260
5286A8260L281j21917R411j00620j71259P4296J97936J74046q8351q7234M2944
$$ 18260 21541 -100376 -90965 -191585 -362844 -288548 -90612 83434 -4917 -92151 -49207
5275d9207L3341O0662m5647K0405r3836r6827R3188M1093R6397O5831J2739p2796
$$ -49207 -15866 44796 -851 19554 -74282 -171109 -77921 -36828 59569 125400 138139 65343
5263F5343q4587J32016n4348N8240j03819p363M5894L791o7113m1641m4808K5789
$$ 65343 -19244 112772 58424 116664 12845 5482 51376 55167 -11946 -53587 -98395 -72606
5251g2606J78081R8805L1013M548o7032j1837j15879k33443l534K01197J8451
$$ -72606 105475 204280 235293 239841 172809 160972 45093 -188350 -191884 9313 27764
5240B7764j48894l4338m8527P5194J59308J37101j29588k05133l3884J12863N8295
$$ 27764 -121130 -155468 -203995 -128801 30507 167608 38020 -167113 -200997 -88134 -29839
5229b9839J02861j79591j31140K5966P0607J05320L998j31935q5396l4485J21086
$$ -29839 73022 -106569 -237709 -211743 -141136 -35816 -31818 -163753 -249149 -283634 -162548
5218a62548J02950L3826Q8139K9717j00750k7984J2641P7282J6378o9712J58835
$$ -162548 -59598 -25772 62367 92084 -8666 -36650 -24009 53273 69651 -61 158774
5207A58774N7497K7443J9948r779j28370K2723k6864j11850j73453j01884Q3974
$$ 158774 216271 243714 263662 253883 125513 148236 121372 9522 -163931 -265815 -181841
5196a81841R7996o2862l2246o4163M2711J25214R6371l8338J9728j135M7696j069
$$ -181841 -83845 -146707 -178953 -243116 -200405 -75191 21180 -17158 2570 1435 49131 48062
5184D8062m6226O0426N8749N6832J7454r3424j40780J03537k2485j63052J5999
$$ 48062 1836 62262 121011 177843 195297 101873 -38907 64630 42145 -120907 -104908
5173a04908k70j82512m1626K4564J87810J84575n1786m4789l9942R6312L2090
$$ -104908 -105178 -287690 -329316 -304752 -116942 67633 15847 -28942 -68884 27428 59518
$$ [...]
##END NTUPLES=NMR SPECTRUM
##END=
