##TITLE=Analysis number 327855
Compound Code tl 00100
Book Reference 164744
Project Code adrs
Chemist Name jom
##JCAMPDX= 6.0         $$ Bruker NMR JCAMP-DX V2.0
##DATA TYPE= NMR SPECTRUM
##DATA CLASS= NTUPLES
##ORIGIN= Bruker BioSpin GmbH
##OWNER= nmr
$$ XWIN-NMR		Version 3.5
$$ Thu Apr 12 13:13:26 2007 GMT Daylight Time (UT+1h)  MAYBRIDGE\nmr@NMR_250MHZ
##.OBSERVE FREQUENCY= 250.131544655141
##.OBSERVE NUCLEUS= ^1H
##.ACQUISITION MODE= SIMULTANEOUS (DQD)
##.ACQUISITION SCHEME= undefined
##.AVERAGES= 16
##.DIGITISER RES= 18
##SPECTROMETER/DATA SYSTEM= dpx250
##.PULSE SEQUENCE= zg30
##.SOLVENT NAME= CDCl3
##.SHIFT REFERENCE= (INTERNAL, CDCl3, 0, 16.522)
##AUDIT TRAIL= $$ (NUMBER, WHEN, WHO, WHERE, WHAT)
$$ ##TITLE= Audit trail, XWIN-NMR		Version 3.5
$$ ##JCAMPDX= 5.01
$$ ##ORIGIN= Bruker BioSpin GmbH
$$ ##OWNER= nmr
$$ C:\u/data/dgb/nmr/ADRS/1280/pdata/1/auditp.txt
$$ ##AUDIT TRAIL=  $$ (NUMBER, WHEN, WHO, WHERE, WHAT)
(   1,<2007-04-12 13:13:03.98 +100>,<MAYBRIDGE\nmr>,<NMR_250MHZ>,
      <created by zg, POWCHK disabled, PULCHK disabled
       configuration hash MD5:
       49 4B E0 1D 92 C2 6B 37 9F E6 65 BC 52 41 86 1D
       data hash MD5: 64K
       2A 7E D5 2B 51 96 A6 FC 90 87 31 7A 6E A7 DC 45>)
(   2,<2007-04-12 13:13:16.85 +100>,<MAYBRIDGE\nmr>,<NMR_250MHZ>,
      <Start of raw data processing
       ef LB = 0.3 FT_mod = 6 PKNL = 1 SI = 32K 
       data hash MD5: 32K
       D4 20 68 58 CB 63 B5 14 5C 68 4B 60 87 97 0E CB>)
(   3,<2007-04-12 13:13:18.54 +100>,<MAYBRIDGE\nmr>,<NMR_250MHZ>,
      <apk 
       data hash MD5: 32K
       18 C8 F4 97 CF D9 2E F2 31 AF D7 2D B9 4A 18 C1>)
(   4,<2007-04-12 13:13:19.31 +100>,<MAYBRIDGE\nmr>,<NMR_250MHZ>,
      <abs ABSG = 5 
       data hash MD5: 32K
       94 2E 37 37 31 4B B7 A3 B4 E0 29 E9 68 A5 FA E5>)
$$ ##END=
$$ 
$$ hash MD5
$$ DB B3 96 12 2A 79 B9 2D 5F 6C FF 5D A0 17 AF F3
##$RELAX= 
##$RELAX= 
##$RELAX= 
##$RELAX= 
##$RELAX= 
##$RELAX= 
##$RELAX= 
$$ Bruker specific parameters
$$ --------------------------
##$DU= <C:\u>
##$EXPNO= 1280
##$NAME= <ADRS>
##$PROCNO= 1
##$TYPE= <nmr>
##$USER= <dgb>
##$AMP= (0..31)
100 100 100 100 100 100 100 100 100 100 100 100 100 100 100 100 100 100 
100 100 100 100 100 100 100 100 100 100 100 100 100 100 
##$AQSEQ= 0
##$AQ_mod= 3
##$AUNM= <au_zg>
##$AUTOPOS= <22 >
##$BF1= 250.13
##$BF2= 250.13
##$BF3= 250.13
##$BF4= 250.13
##$BF5= 500.13
##$BF6= 500.13
##$BF7= 500.13
##$BF8= 500.13
##$BYTORDA= 1
##$CFDGTYP= 0
##$CFRGTYP= 5
##$CHEMSTR= <none>
##$CNST= (0..31)
1 1 145 1 1 1 1 1 1 1 1 1 1 1 1 1 1 1 1 1 1 1 1 1 1 1 1 1 1 1 1 1 
##$CPDPRG= <>
##$CPDPRG1= <>
##$CPDPRG2= <>
##$CPDPRG3= <>
##$CPDPRG4= <mlev>
##$CPDPRG5= <mlev>
##$CPDPRG6= <mlev>
##$CPDPRG7= <mlev>
##$CPDPRG8= <mlev>
##$CPDPRGB= <>
##$CPDPRGT= <>
##$D= (0..31)
0 1 0 0 0 0 0 0 0 0.06 0 0 0 0 0 0 0.0002 0 0 0 0 0 0 0 0 0 0 0 0 0 0 
0 
##$DATE= 1176379983
##$DBL= (0..7)
120 120 120 120 120 120 120 120 
##$DBP= (0..7)
150 150 150 150 150 150 150 150 
##$DBP07= 0
##$DBPNAM0= <>
##$DBPNAM1= <>
$$ [...]
##$SUBNAM7= <"">
##$SUBNAM8= <"">
##$SUBNAM9= <"">
##$SW= 20.6930455092707
##$SWIBOX= (0..15)
0 0 3 0 0 0 0 0 0 0 0 0 0 0 0 0 
##$SW_h= 5175.983436853
##$TD= 65536
##$TD0= 1
##$TE= 683.16
##$TE2= 300
##$TE3= 300
##$TEG= 300
##$TL= (0..7)
0 120 120 120 120 120 120 120 
##$TP= (0..7)
150 150 150 150 150 150 150 150 
##$TP07= 0
##$TPNAME0= <>
##$TPNAME1= <>
##$TPNAME2= <>
##$TPNAME3= <>
##$TPNAME4= <>
##$TPNAME5= <>
##$TPNAME6= <>
##$TPNAME7= <>
##$TPOAL= (0..7)
0.5 0.5 0.5 0.5 0.5 0.5 0.5 0.5 
##$TPOFFS= (0..7)
0 0 0 0 0 0 0 0 
##$TUNHIN= 0
##$TUNHOUT= 0
##$TUNXOUT= 0
##$USERA1= <user>
##$USERA2= <user>
##$USERA3= <user>
##$USERA4= <user>
##$USERA5= <user>
##$V9= 5
##$VALIST= <valist>
##$VCLIST= <CCCCCCCCCCCCCCC>
##$VD= 0
##$VDLIST= <DDDDDDDDDDDDDDD>
##$VPLIST= <PPPPPPPPPPPPPPP>
##$VTLIST= <TTTTTTTTTTTTTTT>
##$WBST= 1024
##$WBSW= 4
##$XGAIN= (0..3)
0 0 0 0 
##$XL= 0
##$YL= 0
##$YMAX_a= 703671
##$YMIN_a= -741918
##$ZGOPTNS= <>
##$ZL1= 120
##$ZL2= 120
##$ZL3= 120
##$ZL4= 120
##$ABSF1= 16.522
##$ABSF2= -4.171173
##$ABSG= 5
##$ABSL= 3
##$ALPHA= 0
##$AQORDER= 0
##$ASSFAC= 0
##$ASSFACI= 0
##$ASSFACX= 0
##$ASSWID= 0
##$AUNMP= <proc_1d>
##$AZFE= 0.1
##$AZFW= 0.1
##$BCFW= 0
##$BC_mod= 0
##$BYTORDP= 0
##$COROFFS= 0
##$CY= 12.5
##$DATMOD= 1
##$DC= 0
##$DFILT= <>
##$DTYPP= 0
##$F1P= 14.0000005364418
##$F2P= -0.99999901652339
##$FCOR= 0.5
##$FTSIZE= 32768
##$FT_mod= 6
##$GAMMA= 0
##$GB= 0
##$INTBC= 1
##$INTSCL= 1
##$ISEN= 128
##$LB= 0.3
##$LEV0= 0
##$LPBIN= 0
##$MAXI= 10000
##$MC2= 0
##$MEAN= 0
##$ME_mod= 0
##$MI= 0
##$NCOEF= 0
##$NC_proc= -4
##$NLEV= 6
##$NOISF1= 0
##$NOISF2= 0
##$NSP= 0
##$NTH_PI= 0
##$NZP= 0
##$OFFSET= 16.522
##$PC= 1
##$PHC0= 229.6767
##$PHC1= 8.601541
##$PH_mod= 1
##$PKNL= yes
##$PPARMOD= 0
##$PSCAL= 4
##$PSIGN= 0
##$REVERSE= no
##$SF= 250.13
##$SI= 32768
##$SIGF1= 0
##$SIGF2= 0
##$SINO= 400
##$SIOLD= 32768
##$SREGLST= <1H.CDCl3>
##$SSB= 0
##$STSI= 32768
##$STSR= 0
##$SW_p= 5175.98343685301
##$SYMM= 0
##$S_DEV= 0
##$TDeff= 65536
##$TDoff= 0
##$TI= <Analysis number 999999
Compound Code 99
Book Reference 9
Project Code 9>
##$TILT= no
##$TM1= 0
##$TM2= 0
##$TOPLEV= 0
##$USERP1= <user>
##$USERP2= <user>
##$USERP3= <user>
##$USERP4= <user>
##$USERP5= <user>
##$WDW= 1
##$XDIM= 32768
##$YMAX_p= 437295739
##$YMIN_p= -120551
$$ End of Bruker specific parameters
$$ ---------------------------------
##NTUPLES= NMR SPECTRUM
##VAR_NAME=  FREQUENCY,     SPECTRUM/REAL,   SPECTRUM/IMAG
##SYMBOL=    X,             R,               I
##VAR_TYPE=  INDEPENDENT,   DEPENDENT,       DEPENDENT
##VAR_FORM=  AFFN,          ASDF,            ASDF
##VAR_DIM=   32768,         32768,           32768
##UNITS=     HZ,            ARBITRARY UNITS, ARBITRARY UNITS
##FACTOR=    0.157963299565203, 1,           1
##FIRST=     4132.6476996994, 0,             0
##LAST=      -1043.33573715361, 0,           0
##MIN=       -1043.33573715361, -120551,     0
##MAX=       4132.6476996994, 437295739,     0
$$ Real data points
##PAGE= N=1
##DATA TABLE= (X++(R..R)), XYDATA
$$ [...]
16829B092431M159l5741r0672r1397p2225o3715n1992l6124l9300l1657k7057
$$ 2092431 2096590 2060849 1970177 1878780 1806555 1742840 1690848 1654724 1615424 1583767 1556710
16818A556710J7865M0951K2042M3122J3051j2191J9992K130k9022l4961m4262
$$ 1556710 1574575 1615526 1637568 1680690 1693741 1681550 1701542 1703672 1674650 1639689 1595427
16807A595427l4172n8455m0320o3427p9434n6205m2680n2265l5703m3331l4893
$$ 1595427 1561255 1502800 1462480 1399053 1319619 1263414 1220734 1168469 1132766 1089435 1054542
16796A054542j4232j7784j1093L0151o75m4953k987L1304L29j1370J3586K7232
$$ 1054542 1040310 1022526 1011433 1041584 1040909 995956 992969 1024273 1024602 1013232 1026818 1054050
16784A054050K7734L178J9480J4402N8830P5585L5821K8286J5357l73j7769k5639
$$ 1054050 1081784 1084962 1104442 1118844 1177674 1253259 1289080 1317366 1332723 1332350 1314581 1288942
16772A288942o8414n1218l3553m109K107r174m3571k5748j0260J7759K1763N5446
$$ 1288942 1220528 1169310 1135757 1131648 1133755 1124581 1081010 1055262 1045002 1062761 1084524 1139970
16760A139970P8200L5781n439l365k9914n8532j1177l6711k7515n2323o2644m1537
$$ 1139970 1218170 1253951 1248512 1245147 1215233 1156701 1145524 1108813 1081298 1028975 966331 924794
16748I24794n2501n233r910m4415j7596j5013j6774n460j1718P969M52p111j4160
$$ 924794 872293 867060 857150 812735 795139 780126 763352 757892 746174 754143 754595 747484 733324
16735G33324j9721K0191k3147k5323k331l6369l0042j3156L080K178k2499k965
$$ 733324 713603 733794 710647 685324 682993 646624 616582 603426 606506 608684 586185 583220
16723E83220R166J8003Q007j1032j2610k1401k2464l7106j646j3088o392j653
$$ 583220 592386 610389 618396 607364 594754 573353 550889 513783 512137 499049 492657 491004
16711D91004K1017J9489L2257j8523k7271j2663K1386K5569j3424j0941j5038
$$ 491004 512021 531510 563767 545244 517973 505310 526696 552265 538841 527900 512862
16700E12862j0800K0951j5363l2844q516J146K0436q9n763n423K894K4144J760
$$ 512862 502062 523013 507650 474806 466290 467436 487872 487783 482020 476597 479491 503635 505395
16687E05395k3520l8371R838r163k5773K770R852j3859j6404J5846q526j9570
$$ 505395 481875 443504 453342 444179 418406 421176 431028 417169 400765 416611 408085 388515
16675C88515J6647J7815k022k6307j3098K957P794P784q617j0292q513k5445r47
$$ 388515 405162 422977 420955 394648 381550 384507 392301 400085 391468 381176 372663 347218 346271
16662C46271L219P8634K8417p664k3401l1607j2366J0062q217J357Q224R727k6373
$$ 346271 349490 428124 456541 448877 425476 393869 381503 391565 383348 384705 392929 402656 376283
16649C76283j0768K6777M013l350o397K166L2760j4026j6434r284L757J3481K9979
$$ 376283 365515 392292 396305 392955 386558 388724 421484 407458 391024 381740 385497 398978 428957
16636D28957L466k2216K633l2242O979K9199j0512l0498k599l628N605J1757M4032
$$ 428957 432423 410207 412840 380598 387577 416776 406264 375766 373167 369539 375144 386901 430933
16623D30933N6716L4459J3689j7936N233M7663K4163K7297p914m0971j5851m6186
$$ 430933 487649 522108 535797 517861 523094 570757 594920 622217 614303 573332 557481 511295
16611E11295j6196j2099k8117l6394k9216j7166k332K7413j9655l6505O218q071
$$ 511295 495099 483000 454883 418489 389273 372107 369775 397188 377533 341028 347246 339175
16599C39175L4080L2861Q885l1059k1917p791j3046m060J8606K5776O754M1677
$$ 339175 373255 406116 415001 383942 362025 354234 341188 337128 355734 381510 388264 429941
16587D29941N7455L8372K622K4745L7420m215M406n320l3206j4778k0599m9778
$$ 429941 487396 525768 528390 553135 590555 586340 590746 585426 552220 537442 516843 467065
16575D67065j3547J9756j4750j9515O714J4910L2892L873k847K5902M3490N3707
$$ 467065 453518 473274 458524 439009 445723 460633 493525 497398 494551 520453 563943 617650
16563F17650L2105J5807j4407p385P313J6468L974M620k8760m7273m7747l8811
$$ 617650 649755 665562 651155 643770 651083 667551 671525 676145 647385 600112 552365 513554
16551E13554l1008k8297L5751J7604l5639l6817J9866k9427j2015J5025k1004
$$ 513554 482546 454249 490000 507604 471965 435148 455014 425587 413572 428597 407593
16540D07593J4433O186k0198j7442k49O0200L0836L2345O604j5666L2184Q4781
$$ 407593 422026 428212 408014 390572 390323 450523 481359 513704 520308 504642 536826 621607
16528F21607L7267m0n9818j1132K9627j5657L0814p878k6416l7837k4072n8493
$$ 621607 658874 658834 599016 587884 617511 601854 632668 624790 598374 560537 536465 477972
16516D77972j5493J1472j3140q104q945n599P525J4088r062K365R46J4883k471
$$ 477972 462479 473951 460811 452707 443762 438163 445688 459776 450714 453079 454025 468908 466437
16503D66437L236K2928j0971r369l385q876K5299J3076J542j6978n2095m9727
$$ 466437 469673 492601 481630 472261 468876 460000 485299 498375 499917 482939 430844 381117
16491C81117k2167j236L3988k09j4281k6112N784P412j1451k5883j129q005p015
$$ 381117 358950 357714 391702 391493 377212 351100 356884 364296 352845 326962 325833 317828 310813
16478C10813l155J5770R367J9786J4165J0459l43k1200j220K2588l560n953K3359
$$ 310813 307658 323428 332795 352581 366746 377205 376862 355662 354442 377030 373470 367517 390876
16465C90876Q137J2942j6486k2209k820m678m9572m615l290j1711k3823k4742
$$ 390876 399013 411955 395469 373260 370440 365762 316190 311575 308285 296574 272751 248009
16453B48009P126J2827K688J2124k0308q437N682m7911k5125K783k26J2435J4528
$$ 248009 255135 267962 270650 282774 262466 254029 259711 211800 186675 189458 189232 201667 216195
16440B16195K6615R848l1719j2222J2422K1133j6104j5396l2963P532k330K2449
$$ 216195 242810 252658 220939 208717 221139 242272 226168 210772 177809 185341 183011 205460
16428B05460j5901Q250k569m4609p821M0366P951q233r98J0480q201O122J0430
$$ 205460 189559 197809 195240 150631 142810 183176 191127 182894 181896 192376 184175 190297 200727
16415B00727o214k4088P231K721j4932r074o855m4359m43K3926R075P589o539
$$ 200727 194513 170425 177656 180377 165445 156371 149516 105157 104714 128640 137715 145304 138765
16402A38765k661K6496q65J084k1198q537N1350J5996O633k2571l2499k3627K3427
$$ 138765 136104 162600 161735 162819 141621 133084 184434 200430 207063 184492 151993 128366 151793
16389A51793q213j4083L5218J4752L145j1103l4776m226M1364n0q199j058l4981
$$ 151793 143580 129497 164715 179467 182612 171509 136733 132507 173871 173821 165622 164564 129583
16376A29583K356K6263J2802o965l2640J7853j0499J3541J041J0527j8399k443
$$ 129583 131939 158202 171004 164039 131399 149252 138753 152294 153335 163862 145463 143020
16364A43020p546n279j2301j7898n952K0553J8965k1574J4446p113l4415L625
$$ 143020 135474 130195 117894 99996 94044 114597 133562 111988 126434 119321 84906 88531
16352H8531K585K316l4948r220N8968K3974P469M724j1268k4778O163N637J7830
$$ 88531 91116 93432 58484 49264 108232 132206 139675 144399 133131 108353 114516 120153 137983
16339A37983J475k390n73r818l6008j2780P299L4084R21m22k0671N507p235P758
$$ 137983 139458 137068 136495 126677 90669 77889 85188 119272 120193 119771 99100 104607 97372 105130
16325A05130q049q17K2055j185r481R682K0253j2123j4239L925n294j0565j835
$$ 105130 97081 96264 118319 117134 107653 117335 137588 125465 111226 115151 109857 99292 97457
16312I7457K0484O96j9637M771J4328j2686r256r5o698Q166k367j5820k9587P265
$$ 97457 117941 118637 99000 103771 118099 105413 96157 96062 89364 97530 95163 79343 49756 57021
16298E7021j0857Q141J3928j9301K128P453K8071O267O647j4107K3842Q492k6631
$$ 57021 46164 54305 68233 48932 51060 58513 86584 92851 99498 85391 109233 117725 91094
16285I1094j7423j1373J2806O586L040j2855m3666k4495N7722J4874K0901J6312
$$ 91094 73671 62298 75104 81690 84730 71875 28209 3714 61436 76310 97211 113523
16273A13523O634r262j2153j5748j9370K0571o586l8937J0581J8175K6966J8659
$$ 113523 120157 110895 98742 82994 63624 84195 77609 38672 49253 67428 94394 113053
16261A13053l157K0863P38J821N14N697k0022k3745J0385l083j8305K1708N465
$$ 113053 109896 130759 131497 133318 133832 139529 119507 95762 106147 103064 84759 106467 111932
16248A11932n353k8274n951J5596K0779Q642j363k6480K1189M1420J90k3432l3511
$$ 111932 106579 78305 72354 87950 108729 117371 116008 89528 110717 152137 152327 128895 95384
16235I5384l6710j717J6778O054K2458j4174J0683L6731J3548j9200j4559j8721
$$ 95384 58674 56957 73735 79789 102247 88073 98756 135487 149035 129835 115276 96555
16223I6555O305j3605j9515m422K7116j4394l7322k095Q512p24o972K0345J3259
$$ 96555 102860 89255 69740 65318 92434 78040 40718 38623 47135 46411 39439 59784 73043
16210G3043L494r772L502j5973O850K0291p372K9198R467j765J170j723R62k9964
$$ 73043 76537 66765 70267 54294 61144 81435 74063 103261 112728 110963 112133 110410 111372 81408
16196H1408r931j4268j0125K065J8095o206n226k4388K7451L2949J2998L535k934
$$ 81408 71477 57209 47084 49149 67244 61038 55812 31424 58875 91824 104822 108357 105423
16183A05423j8762j0291J5713k626j4678o68j4386j3019q818J6288L7122M219
$$ 105423 86661 76370 92083 89457 74779 74111 59725 46706 37888 54176 91298 95517
16171I5517l1229m117J5598o985j7294j2593J3151q66K7025N586r507j9346O90
$$ 95517 64288 60171 75769 68784 51490 38897 52048 51182 78207 83793 74286 54940 55630
16158E5630J4510J4555k7055k4940J0263K401K3602L3847k3346j2008k497n593
$$ 55630 70140 84695 57640 32700 42963 45364 68966 102813 79467 67459 64962 59369
16146E9369k306k3145l353L8220m893J2999o501j0878k540J963N2667J0480k2833
$$ 59369 57063 33918 30565 68785 63892 76891 70390 59512 56972 58935 111602 122082 99249
16133I9249k3182j1325k153k002J1790O976M675J9560n381j5807k4146J095N999
$$ 99249 76067 64742 62589 60587 72377 79353 84028 103588 98207 82400 58254 59349 65348
16120F5348P575n408n080PK0945J7546M264k5971j8143j9919K3901J8235k2357
$$ 65348 72923 67515 62435 62442 83387 100933 105197 79226 61083 41164 65065 83300 60943
16107F0943j9645M889M3387R965l624j7139o056J4831L4182k6374l0117J0167
$$ 60943 41298 46187 89574 99539 95915 78776 72720 87551 121733 95359 65242 75409
16095G5409J3234P448l795J2303j0837l5083m366M024j5704R169J12J5050N288
$$ 75409 88643 96091 92296 104599 93762 58679 54313 58337 42633 51802 51914 66964 72252
16082G2252Q124J6481p309j1479j5600J3176n621k1607n134K6819J0212j3060
$$ 72252 80376 96857 89548 78069 62469 75645 70024 48417 43283 70102 80314 67254
16070F7254k61J5998j418j885o396l7302l1416L821K2436j1849J460j3022K5712
$$ 67254 66993 82991 81573 79688 73292 35990 4574 8395 30831 18982 20442 7420 33132
16057C3132j0071k6418J7552L0770M6280K8521j9224k7868k7066j1105L639m209
$$ 33132 23061 -3357 14195 44965 91245 119766 100542 72674 45608 34503 38142 33933
16045C3933q649J4702L5767j4830l0128J8736R215J5527l673k2221K4253k911
$$ 33933 25284 39986 75753 60923 30795 49531 58746 74273 70600 48379 72632 69721
16033F9721n771m000n609P872R99M470r694O935m521J5782n330j588o588r882
$$ 69721 63950 59950 54341 62213 63212 67682 57988 64923 60402 76184 70854 69266 62678 52796
16019E2796J3100p624j2962k8003J8750J1346k52j198M510M130K8557o199n844
$$ 52796 65896 58272 45310 17307 36057 47403 47151 45953 50463 54593 83150 76951 71107
16006G1107J103k7285j0596J3677L3962J1405O131k622J0911j4675k4812j4669
$$ 71107 72210 44925 34329 48006 81968 93373 99504 96882 107793 93118 68306 53637
15994E3637J2914j4086k3896j4095l893q07J5531K7142K3636k7467r884N703K5866
$$ 53637 66551 52465 28569 14474 10581 9774 25305 52447 76083 48616 38732 44435 70301
15981G0301o377M793l816j4158k3212j5304N911Q673R758J1475K262J8603J1741
$$ 70301 63924 68717 64901 50743 27531 12227 18138 26811 36569 48044 50306 68909 80650
15968H0650l8679j0589M429j5336q191J4763P019k0310k999K513j6614K8313m167
$$ 80650 41971 31382 35811 20475 12284 27047 34066 13756 10757 13270 -3344 24969 20802
15955B0802J7975j054q910l2387P529J1935K8829J5244k9907j6864J9403Q739
$$ 20802 38777 37723 28813 -3574 3955 15890 44719 59963 30056 13192 32595 41334
15943D1334k748J108j8227N352J8285L0496R363k3176O863q523k1917k0973n730
$$ 41334 38586 39694 21467 26819 45104 75600 84963 61787 68650 60127 38210 17237 11507
15930A1507L1181K3709o996N980K978p913n5440j56J5839J764N247J998O301K1145
$$ 11507 42688 66397 59401 65381 68359 60446 5006 4850 20689 22453 27700 29698 35999 57144
15916E7144J952q415L9316Q365l1355m5437k787R665J0304j0682k2048J981P177
$$ 57144 59096 50681 89997 98362 67007 21570 18783 28448 38752 28070 6022 8003 15180
15903A5180o332k278j3087K1385J5285k25j543K2272L1691J7197k7717o721k4854
$$ 15180 8848 6570 -6517 14868 30153 29928 28385 50657 82348 99545 71828 65107 40253
15890D0253j0209J72J7072j6952p274J0028J4561O107q531k5703o652m879L1739
$$ 40253 30044 30216 47288 30336 23062 33090 47651 53758 45227 19524 12872 7993 39732
15877C9732J5526J3239J0738J2393k4502k2532L353j3454J0365J301j5289l70
$$ 39732 55258 68497 79235 91628 67126 44594 47947 34493 44858 46159 30870 30500
15865C0500o856k412K4974l443J2876j7646Q174j4889m934K2812j7763j3143J9156
$$ 30500 23644 21232 46206 42763 55639 37993 46167 31278 26344 49156 31393 18250 37406
15852C7406k998j6337J4078J6525l5470J5918r20K6977l305l4806N983J0820l7862
$$ 37406 34408 18071 32149 48674 13204 29122 28202 55179 51874 17068 23051 33871 -3991
15839c991l8599L148j3219L2264K1379L0975J7720K9178j3773k3603k8262J8391
$$ -3991 -42590 -39442 -52661 -20397 982 31957 49677 78855 65082 41479 13217 31608
15827C1608j437m633R634l698M1742J2418K04j5696K9762j2229m516q628l1563
$$ 31608 30171 25538 35172 31474 73216 85634 85838 70142 99904 87675 83159 74531 42968
15814D2968l1029J9204j3091L538J5065L7820R858j8235k4238j4815k3129j3050
$$ 42968 11939 31143 18052 21590 36655 74475 84333 66098 41860 27045 3916 -9134
15802i134l074J8785J7122J1092M870M95k1069k0323j0203j2694L8282K49p823
$$ -9134 -12208 6577 23699 34791 39661 40156 19087 -1236 -11439 -24133 14149 14398 6575
15789F575J3343k900j3067k339K898J7699J9148K9220o293n537j0677J6219R998
$$ 6575 19918 17018 3951 1612 4510 22209 41357 70577 64284 58747 48070 64289 74287
15776G4287l8940q944n785J4861q342J0089n108p041J0786j4249q880j8114J9632
$$ 74287 35347 26403 20618 35479 27137 37226 32118 25077 35863 21614 12734 -5380 14252
15763A4252L5441J6985j2122m883j2199l6156n251L2544K1569j2715k0336J3348
$$ 14252 49693 66678 54556 49673 37474 1318 -3933 28611 50180 37465 17129 30477
15751C0477J1739j972p437j4829O547J2305J3605J2172j6912j1717K1724j1193
$$ 30477 42216 40244 32807 17978 24525 36830 50435 62607 45695 33978 55702 44509
15739D4509J7357j0030m2276J3505M303L708K7411m147k0070J1038K1399r43j9310
$$ 44509 61866 51836 9560 23065 27368 31076 58487 54340 34270 45308 66707 65764 46454
15726D6454l167j2668k4997L329J2117R250J0704j7858j4815j5829K3433J4011
$$ 46454 43287 30619 5622 8951 21068 30318 41022 23164 8349 -7480 15953 29964
15714B9964j9500M783K3573k791K893Q68r734P224J299L191N339j877K957j2664
$$ 29964 10464 15247 38820 36029 38922 39790 30056 37280 38579 41770 47109 45232 48189 35525
15700C5525j8983j0994R70n378k688Q856J6914l6633j3181N165L7761J9157j0199
$$ 35525 16542 5548 6518 1140 -1548 7308 24222 -12411 -25592 -20427 17334 36491 26292
15687B6292J0772P14Q827j8162O001j2573r286P952n591j3962J2610l7082N839
$$ 26292 37064 37778 46605 28443 34444 21871 12585 20537 14946 984 13594 -23488 -17649
15674a7649L9101j3917j3554J4798l649K7367K4976k4077j7708J544J5470P856
$$ -17649 21452 7535 -6019 8779 5130 32497 57473 33396 15688 17232 32702 40558
15662D0558N499J3279k6506k0738j5876J2381J0216l463J1415J1220l78p946J663
$$ 40558 46057 59336 32830 12092 -3784 8597 18813 15350 26765 37985 37607 29661 31324
15649C1324J0264k8701J351L3820O623j2027l3801j5066P012M969K2226K2961
$$ 31324 41588 12887 14238 48058 54681 42654 8853 -6213 799 5768 27994 50955
15637E0955l1126k5822o084R470J0267Q379Q916J773L157n559J4168q265r408
$$ 50955 19829 -5993 -12077 -2607 7660 16039 24955 26728 29885 24326 38494 30229 20821
15624B0821j1560J2529j6596R649l8000j7941K3255K4192R268P189j462K218P698
$$ 20821 9261 21790 5194 14843 -23157 -41098 -17843 6349 15617 22806 21344 23562 31260
15611C1260L269K555p140l274j5774k6602M712J3737J5227J5616j1601j4051J4164
$$ 31260 34529 37084 29944 26670 10896 -15706 -10994 2743 17970 33586 21985 7934 22098
15598B2098Q597J5313J4100m0851j0948K4837l429q67k8284j7041J9347j155l984
$$ 22098 30695 46008 60108 19257 8309 33146 29717 28850 566 -16475 2872 1717 -2267
15585b267o795J0846j8010J8132K006k0563j179j7775k4130M461L0802J9036K3963
$$ -2267 -9062 1784 -16226 1906 3912 -16651 -17830 -35605 -59735 -55274 -24472 -5436 18527
15572A8527Q012m188j1542j4874m259O983L86l463P993J765l796J6425J6222q46
$$ 18527 26539 22351 10809 -4065 -8324 -1341 -955 -4418 3575 5340 1544 17969 34191 33345
15558C3345j6266o968J0455P60k2508j0717J7935N43J1422J2888k1718o635p008
$$ 33345 17079 10111 20566 21326 -1182 -11899 6036 6579 18001 30889 9171 2536 -4472
15545d472k522J4800L950R98n359p764J7640l465j1762P782k1746j3998J2135
$$ -4472 -6994 7806 11756 12754 7395 -369 17271 13806 2044 9826 -11920 -25918 -13783
15532a3783K2393J163j07o758P884K0066K2867k1678k377l502k0619J9410R40
$$ -13783 8610 9773 9666 2908 10792 30858 53725 32047 29670 26168 5549 24959 25899
15519B5899j2962R989J9798k890j8714l4012R729J1957K3440k4771k505J6236
$$ 25899 12937 22926 42724 39834 21120 -12892 -3163 8794 32234 7463 4958 21194
15507B1194J240l4177J2593M947p605K0868M0766k733j3504L936j6296p501K2650
$$ 21194 22434 -11743 850 5797 -1808 19060 59826 57093 43589 47525 31229 23728 46378
15494D6378j6228n8186p346M0622N270m222J3568K1430k7399k7038J9709K9436
$$ 46378 30150 -28036 -35382 5240 10510 6288 19856 41286 13887 -13151 6558 35994
15482C5994J321l4524j3767j7494N051L1864J3236k828m805l1082k878L3800l714
$$ 35994 37315 2791 -10976 -28470 -23419 8445 21681 18853 14048 -17034 -19912 13888 10174
15469A0174N627l632k3280n216k2533J735j53R443K6000j820k1504k160J6021
$$ 10174 15801 12169 -11111 -16327 -38860 -37125 -37278 -27835 -1835 -3655 -25159 -27319 -11298
15456a1298R120m5633n290K7088J8557N062o389M378J2319r326j6010J5170N916
$$ -11298 -2178 -47811 -53101 -26013 -7456 -2394 -8783 -4405 7914 -1412 -17422 -2252 3664
15443C664l6910l0769K4580L7467n867j7374n48L0278M224R258k7524k429j4281
$$ 3664 -33246 -64015 -39435 -1968 -7835 -25209 -25757 4521 8745 18003 -9521 -11950 -26231
15430b6231L0871K2971m01j8583J5912j0185k7884o3J5835K1974K3136j3556j1416
$$ -26231 4640 27611 27210 8627 24539 14354 -13530 -13593 2242 24216 47352 33796 22380
15417B2380m472r837L240J3637J7378j6377L795l3439O568L1186N949j3292l6103
$$ 22380 17908 8071 11311 24948 42326 25949 29744 -3695 2873 34059 40008 26716 -9387
15404i387k2203K8905o992J883o482J1385j0271r475M962k557N330J9996m549
$$ -9387 -31590 -2685 -9677 -7794 -14276 -2891 -13162 -22637 -17675 -20232 -14902 5094 545
15391E45p139j0349J925M342Q436K293R028j8959j8680M3281j0143k6178P632
$$ 545 -6594 -16943 -15018 -10676 -2240 53 9081 -9878 -28558 14723 4580 -21598 -13966
15378a3966R758L3125k810m2005R062j707R497N241m798k7864P981P766k8269
$$ -13966 -4208 28917 26107 -15898 -6836 -8543 954 6195 1397 -26467 -18486 -10720 -38989
15365c8989j9062K7978L3585K0377N3122p394l6281q238n851k9612o072L2521
$$ -38989 -58051 -30073 3512 23889 77011 69617 33336 25098 19247 -10365 -16437 16084
15353A6084j2408j5821L354J4687m468l977Q078K087N270R495j0752L215N317
$$ 16084 3676 -12145 -8791 5896 1428 -2549 5529 7616 12886 22381 11629 14844 20161
15340B0161K0046K2821l6021j5398m2R199J1501k7513j3747m05M748k7212J2040
$$ 20161 40207 63028 27007 11609 11567 20766 32267 4754 -8993 -9398 -4650 -31862 -19822
15327a9822Q029Q759N337O191J5663J5233O352L88m848r556j915J1801m5130k0650
$$ -19822 -11793 -3034 2303 8494 24157 39390 45742 46130 41282 31726 29811 41612 -3518 -24168
15313b4168J1908K4046q800r347j9782j3963j1057J8454L2708k7583j0707P910
$$ -24168 -12260 11786 2986 -6361 -26143 -40106 -51163 -32709 -1 -27584 -38291 -30381
15301c0381k346N525J1226L8203J2454o640J0493o83l5445n396K7545j0697q723
$$ -30381 -32727 -27202 -15976 22227 34681 28041 38534 37851 2406 -2990 24555 13858 5135
15288E135L0761l797j3813p611k3186m979K6418M2690k0447l2972n1282j8652
$$ 5135 35896 32099 18286 10675 -12511 -17490 8928 51618 31171 -1801 -53083 -71735
15276g1735J9209J984o559J9156K1515l753J1138J4662J6948j7553j0720J0720
$$ -71735 -52526 -50542 -57101 -37945 -16430 -20183 -9045 5617 22565 5012 -5708 5012
15264E012k0644O627J4783j986j2624o652P318J9360N817m513k4612K3333Q019
$$ 5012 -15632 -9005 5778 3792 -8832 -15484 -8166 11194 17011 12498 -12114 11219 19238
15251A9238K100l3737o380J090j965M1844J1897r526j5903j4785j7926j0825K1863
$$ 19238 21338 -12399 -18779 -17689 -19654 22190 34087 24561 8658 -6127 -24053 -34878 -13015
15238a3015M0901N686j591p637q829r612j0773q742K7971q159k5347k991j432
$$ -13015 27886 33572 31981 24344 15515 5903 -4870 -13612 14359 6200 -19147 -22138 -23570
15225b3570L5125j582p893n429P124J4492K1284L550k2685m6792J3385K3834k7251
$$ -23570 11555 9973 2080 -3349 3775 18267 39551 43101 20416 -26376 -12991 10843 -16408
15212a6408j0342M8827L2784l26k4289m6529R490r439J461m936j4167k0860m105
$$ -16408 -26750 22077 54861 54535 30246 -16283 -6793 -16232 -14771 -19707 -33874 -54734 -58839
15199e8839K0139j9002P258J9666k4590k6165K801P629L8650L6643k0071M726
$$ -58839 -38700 -57702 -50444 -30778 -55368 -81533 -78732 -71103 -32453 4190 -15881 -11155
15187a1155j5875o557J1776K3423J0825J3207P780R341j4567j7930n590j2785
$$ -11155 -27030 -33587 -21811 1612 12437 25644 33424 42765 28198 10268 4678 -8107
15175h107K0144N931l121j0388j1475o647l762K55l250R197o815K0374K9165J2755
$$ -8107 12037 17968 14847 4459 -7016 -13663 -17425 -17170 -20420 -11223 -18038 2336 31501 44256
15161D4256k9999Q442J5988L885o692j3101j8730N793J3202K1298l173l0531Q182
$$ 44256 14257 22699 38687 42572 35880 22779 4049 9842 23044 44342 41169 10638 18820
15148A8820J8631p87k3089n895P075N273m036J1614K0686k9935j5094K3384j3843
$$ 18820 37451 36664 13575 7680 14755 20028 15992 27606 48292 18357 3263 26647 12804
15135A2804j4625k8298M856R838J424J1359O069O692k11j499j4964O543k9408
$$ 12804 -1821 -30119 -25263 -15425 -14001 -2642 3427 10119 9908 8409 -6555 -12 -29420
15122b9420j9351k044K7768L1728M703l5267j9443j366j2367J8111J1417J5153
$$ -29420 -48771 -50815 -23047 8681 13384 -21883 -41326 -42692 -55059 -36948 -25531 -10378
15110a0378N335k889n396O074N424q101J7203q94Q104j0758k0653q479J0174K1947
$$ -10378 -5043 -7932 -13328 -7254 -1830 -9931 7272 6378 14482 3724 -16929 -25408 -15234 6713
15096F713o012o329J4285j7780Q557J6815J1115k8788J415J2474l583l7377M872
$$ 6713 701 -5628 8657 -9123 -566 16249 27364 -1424 -9 12465 8882 -28495 -23623
15083b3623o270J939m272o423K2599k0403k4085K9934J3833j7307p79L361J0686
$$ -23623 -29893 -27954 -32226 -38649 -16050 -36453 -60538 -30604 -16771 -34078 -34857 -31496 -20810
15070b0810q087o780L02k2099K9360L3923R525o774j5014j0355Q055k946j0042
$$ -20810 -28897 -35677 -35375 -57474 -28114 5809 15334 8560 -6454 -16809 -8754 -11700 -21742
15057b1742k2650N305K1578L7576j9740k4207l5964k6400M367L5156K8873N472
$$ -21742 -44392 -39087 -17509 20067 327 -23880 -59844 -86244 -81877 -46721 -17848 -12376
15045a2376J4991R023L858m462k4140j3278K916J3968K736O333L998j0759R885
$$ -12376 2615 11638 15496 11034 -13106 -26384 -23468 -9500 -6764 -431 3567 -7192 2693
15032B693j5705q394P330j6132J5360J9923N038r155o63O123j9308l850K9625
$$ 2693 -13012 -21406 -14076 -30208 -14848 5075 10113 958 295 6418 -12890 -16740 12885
15019A2885J4610J009K2027J0498l6322m845N317J9894n504J4777p449O557K2942
$$ 12885 27495 28504 50531 61029 24707 19862 25179 45073 39569 54346 46897 53454 76396
15006G6396L7966N0425N887K6623K3030L4388M8J1940p356m8504o9908l8651m7286
$$ 76396 114362 164787 170674 197297 220327 254715 254763 266703 259347 210843 140935 102284 54998
14993E4998j1946k0997j3706K2002J34j1338k3431J0562P454j2110k4372L4547
$$ 54998 43052 22055 8349 30351 30485 19147 -4284 6278 13732 1622 -22750 11797
14981A1797J5444K581q726k706N71J1640J0835q23k0927j141J5492M87K2384q308
$$ 11797 27241 29822 21096 18390 18961 30601 41436 40613 19686 18545 34037 34524 56908 48600
14967D8600j3448q074r412l3489O343p998r314J1178K3742Q146p285K7221K6023
$$ 48600 35152 27078 17666 -15823 -9480 -17478 -26792 -15614 8128 16274 8989 36210 62233
14954F2233j0492m6828M880Q00k3211Q936M2139j260j5568r859j7407q432J8515
$$ 62233 51741 4913 9793 10593 -12618 -3682 38457 37197 21629 11770 -5637 -14069 4446
14941D446M0924l3899k5484J6955J5462J6927n415n798K8157m1252j7418L5829
$$ 4446 45370 11471 -14013 2942 18404 35331 29916 24118 52275 11023 -6395 29434
14929B9434J8820j5881J7194j2137l1459k5125n102m97L1019J620J1515l036j5745
$$ 29434 48254 32373 49567 37430 5971 -19154 -24256 -24753 6266 7886 19401 16365 620
14916F20M158J3311l3904n056K8270J0387j2057l6164k0773J4588M8144K1973
$$ 620 4778 18089 -15815 -20871 7399 17786 5729 -30435 -51208 -36620 11524 33497
14904C3497m706l269j3612r541R415O444j816n009j3681p745l823L884O140Q604
$$ 33497 28791 25522 11910 2369 11784 18228 16412 11403 -2278 -10023 -13846 -9962 -3822 4782
14890D782J3507j4885k2693l345L2727N337o604J0585J620k0183l408O681m551
$$ 4782 18289 3404 -19289 -22634 10093 15430 8826 19411 21031 848 -2560 4121 -430
14877d30j6009J9068L869J6092q486L510q218o192k0170n115L3398K1328k4581
$$ -430 -16439 2629 6498 22590 14104 17614 9396 3204 -16966 -22081 11317 32645 8064
14864H064j90j1659o231p995O453L217J7163P948j872j6844j6215L5998m943r568
$$ 8064 7874 -3785 -10016 -18011 -11558 -8341 8822 16770 14898 -1946 -18161 17837 12894 3326
14850C326K3931k9550j4647L8831J6947k9156k6033m074J234n28j5469J2831P935
$$ 3326 27257 -2293 -16940 21891 38838 9682 -16351 -20425 -19191 -19719 -35188 -22357 -14422
14837a4422j2685j6005M463J553K354L078J3010R540j8061j8174L46Q543K0091
$$ -14422 -27107 -43112 -38649 -37096 -34742 -31664 -18654 -9114 -27175 -45349 -45003 -36460 -16369
14824a6369M315l902o676Q762P611r757o175j0801K0156l098j8140J1484L598
$$ -16369 -12054 -15956 -22632 -13870 -6259 -16016 -22191 -32992 -12836 -15934 -34074 -22590 -18992
14811a8992J7743j1152k6186J6584J8265j5151K1191L4984J0610j8867j4242j8149
$$ -18992 -1249 -12401 -38587 -22003 -3738 -18889 2302 37286 47896 29029 14787 -3362
14799c362O673j3871r458j3998K2138J9851L596q246p156K4429j228j6265j0697
$$ -3362 3311 -10560 -20018 -34016 -11878 7973 11569 3323 -3833 20596 19368 3103 -7594
14786g594j0735q22n281k7764k2256J0714L9386K8153J5344J7570k5564j2031
$$ -7594 -18329 -19151 -24432 -52196 -74452 -63738 -24352 3801 19145 36715 11151 -880
14774h80L7J0059J56m1987k6362K1466K6328k2308r756K3683J2513P330j5516
$$ -880 -843 9216 9372 -32615 -58977 -37511 -11183 -33491 -43247 -19564 -7051 279 -15237
14761a5237J2237J6864J1643J7136l0219j8454p91k1767n209J0250p365k0042
$$ -15237 -3000 13864 25507 42643 12424 -6030 -6821 -28588 -33797 -23547 -30912 -50954
14749e0954R093K8812j5803J0345K4355J953j5450N996l5923j7514L374J2110
$$ -50954 -41861 -13049 -28852 -18507 5848 7801 -7649 -1653 -37576 -55090 -51716 -39606
14737c9606J4017Q0K633L023N195P709p906N92j236J7474M031J837j6819R935
$$ -39606 -25589 -25509 -22876 -19853 -14658 -6949 -14855 -14263 -15499 1975 6006 7843 -8976 959
14723I59K4306j795k0414L506M565P093l0437K5508L5340Q594L254k6497p869
$$ 959 25265 23470 3056 6562 11127 18220 -12217 13291 48631 57225 60479 33982 26113
14710B6113l8385j6923k429j9222k7566J9597M9596J3521k0156k11j3157L277
$$ 26113 -12272 -29195 -31624 -50846 -78412 -58815 -9219 4302 -15854 -16065 -29222 -25945
14698b5945J2165K4610k9534k1819R759K2368q366k4166p73K063P00N108n676
$$ -25945 -13780 10830 -18704 -40523 -30764 -8396 -16762 -40928 -41701 -39638 -38938 -33830 -39506
14685c9506J24J4011j2770j4992L1841K0012Q211O777K513k225j3887o961k6504
$$ -39506 -39382 -25371 -38141 -53133 -21292 -1280 6931 13708 16221 13996 109 -6852 -33356
14672c3356k144l935l409K0991K6566J7657p83j1179J2356k802k5661j1025N382
$$ -33356 -35500 -39435 -42844 -21853 4713 22370 21587 10408 22764 19962 -5699 -16724 -11342
14659a1342J2035l74o45k0180j2225j6052N048J128q771J568q667J9747k2610
$$ -11342 693 319 -326 -20506 -32731 -48783 -43735 -42607 -51378 -49810 -58477 -38730 -61340
14646f1340j2011M4716K8010P58K1803K0007k3392k8046j5830m3293J2708J1362
$$ -61340 -73351 -28635 -625 133 21936 41943 18551 -9495 -25325 -68618 -55910 -44548
14634d4548r385n967o749J5946p045J5029J0230J2088J4209m157k7617k6414J0833
$$ -44548 -53933 -59900 -66649 -50703 -57748 -42719 -32489 -20401 -6192 -10349 -37966 -64380 -53547
14621e3547m496O558K707j4598N134J0874q671J5494N1090K1756k4805k8421J5494
$$ -53547 -58043 -51485 -48778 -63376 -58242 -47368 -56039 -40545 10545 32301 7496 -20925 -5431
14608e431j4864o869n215P116L9357J1805m42l3653j6142K0329K0790k6510k0597
$$ -5431 -20295 -27164 -32379 -25263 14094 25899 25457 -8196 -24338 -4009 16781 -9729 -30326
14595c0326L265J6832J6098O396j8439k5306n887L6688m452j4493o302K8503l52
$$ -30326 -27061 -10229 5869 12265 -6174 -31480 -37367 -679 -5131 -19624 -25926 2577 2225
14582B225K2066J0595k8145k8530p564M46N615k056R021J2631k092j2306N534
$$ 2225 24291 34886 6741 -21789 -29353 -28907 -23292 -25348 -16327 -3696 -5788 -18094 -12560
14569a2560K01K5170J8206M703J1496m6106m5418j455N147J4989j0833q337N0859
$$ -12560 -12359 12811 31017 35720 47216 1110 -44308 -45763 -40616 -25627 -36460 -44797 6062
14556F062N865r814k0879j4455M997K9026R130m2875R828r415K1472K4217j4691
$$ 6062 11927 2113 -18766 -33221 -28224 802 9932 -32943 -23115 -32530 -11058 13159 -1532
14543a532j5410k4956k3798J2992J4266M547K6797O329q828j6684q249J1075n698
$$ -1532 -16942 -41898 -65696 -52704 -38438 -33891 -7094 -765 -9593 -26277 -34526 -23451 -29149
14530b9149p441N939r144k2738J2116M1041L4067J9187k0348n7898j2733J3233
$$ -29149 -36590 -30651 -39795 -62533 -50417 -9376 24691 43878 23530 -34368 -47101 -33868
14518c3868l09j9376o668K0178L3376M143J1420K65k5677l1473l738K5812K7639
$$ -33868 -34177 -53553 -60221 -40043 -6667 -2524 8896 9161 -16516 -47989 -51727 -25915 1724
14505A724r129j738k2552J641m205J898N3849j289l2674j3755j4511L0800N831
$$ 1724 -7405 -9143 -31695 -30054 -34259 -32361 21488 20199 -12475 -26230 -40741 -9941 -4110
14492d110n8927k5317J5715J4110j0640K2812J3199p67K33r075K8480O818j7298
$$ -4110 -63037 -88354 -72639 -58529 -69169 -46357 -33158 -33925 -33692 -42767 -14287 -7469 -24767
14479b4767j8729J9091K4797J0720j3007J7224J5036j1448j3124k0692J2206m862
$$ -24767 -43496 -24405 392 11112 -1895 15329 30365 18917 5793 -14899 -2693 -7555
14467g555r55M317N487q380q05L4457K3213k5609k3258K1983k5146j6557j2465
$$ -7555 -8510 -4193 1294 -7086 -7891 26566 49779 24170 912 22895 -2251 -18808 -31273
14454c1273j7423o301L1305R620j0252J6296l820k7704l903K4877N922P402K2283
$$ -31273 -48696 -54997 -23692 -14072 -24324 -8028 -11848 -39552 -43455 -18578 -12656 -5254 17029
14441A7029j7038o808m754J2625O786K2728K44n0945m6398J6078P252k9704j5781
$$ 17029 -9 -6817 -11571 1054 7840 30568 30812 -20133 -66531 -50453 -43201 -72905 -88686
14428h8686J8147K614K2061P60M548q026k3502p274N9960J5540N00k1436l41K679
$$ -88686 -70539 -67925 -45864 -45104 -40556 -48582 -72084 -79358 -19398 -3858 -3358 -24794 -25135 -22456
14414b2456J5808j3013m977M123L11p712j1396J7153J7662j3133k2319M070R888
$$ -22456 -6648 -19661 -24638 -20515 -20204 -27916 -39312 -22159 -4497 -17630 -39949 -35879 -25991
14401b5991J969K2467N009K0151J8336l7104j3339o776O425M200r695l0704j5443
$$ -25991 -24022 -1555 3454 23605 41941 4837 -8502 -15278 -8853 -4653 -14348 -45052 -60495
14388f0495q43L462J2542K6748K3852L744j2158P735j691j6992j8009j1053K2265
$$ -60495 -61338 -57876 -45334 -18586 5266 9010 -3148 4587 2896 -14096 -32105 -43158 -20893
14375b0893J124J676J7240k0170O346m48m496J0373J8123j2726Q960k2795p05
$$ -20893 -19769 -18093 -853 -21023 -14677 -15125 -19621 -9248 8875 -3851 5109 -17686 -18391
14362a8391N245K6259K3598o128j1249l0359k8621j5876K9408j50r534K862P960
$$ -18391 -13146 13113 36711 30583 19334 -11025 -39646 -55522 -26114 -26264 -35798 -32936 -24976
14349b4976M638J2944N749Q260J5826M466m799J0420P313j1071l4667o62J5421
$$ -24976 -20338 -7394 -1645 6615 22441 26907 22108 32528 39841 28770 -5897 -6559 8862
14336H862K6282J583r445J031k5955l0421R050J9481k047l880k7419k256K272
$$ 8862 35144 36727 27282 28313 2358 -28063 -19013 468 -1579 -5459 -32878 -35134 -32862
14323c2862l2086j8581J0698J0458n052J6946o752J7981K6558K9784j8605M656
$$ -32862 -64948 -83529 -72831 -62373 -67425 -50479 -57231 -39250 -12692 17092 -1513 3143
14311C143J398Q582j6043N172J3916q315r256j4377j397m616O206K9372Q870J7572
$$ 3143 4541 13123 -2920 2252 16168 7853 -1403 -15780 -17177 -21793 -15587 13785 22655 40227
14297D0227m318j5142j2489r929p848m103J2835M633m80j1614n766J588j7939
$$ 40227 35909 20767 8278 -1651 -9499 -13602 -767 3866 3386 -8228 -13994 -12406 -30345
14284c0345j7553M849K6326L055q012J4094k0063j428R849j982r57j3660J4375
$$ -30345 -47898 -43049 -16723 -13668 -21680 -7586 -27649 -29077 -19228 -21210 -22167 -35827 -21452
14271b1452R253j0357L876r462k2496K1366K5467K610m107l2973q334j651L685
$$ -21452 -12199 -22556 -18680 -28142 -50638 -29272 -3805 -1195 -5302 -38275 -46609 -48260 -44575
14258d4575J3917L993L595m998O228N047J1546l150J0302N761J2496j3106j1398
$$ -44575 -30658 -26665 -23070 -28068 -21840 -16793 -5247 -8397 1905 7666 20162 7056 -4342
14245d342J0509J5214k3352j7191L715M17k1042M2752K0449l3985q558J3469o074
$$ -4342 6167 21381 -1971 -19162 -15447 -15030 -36072 6680 27129 -6856 -15414 -1945 -8019
14232h019l630J0546j5950p378r504N17J0839m250j1543j0101J5876J3950l112
$$ -8019 -11649 -1103 -17053 -24431 -33935 -33418 -22579 -26829 -38372 -48473 -32597 -18647 -21759
14219b1759J1905r494J4792K814k85K967N631K821j2878j1790J0846j6718j7311
$$ -21759 -9854 -19348 -4556 -1742 -2027 940 6571 9392 -3486 -15276 -4430 -21148 -38459
14206c8459r534o144L4604J0487m563r38K1812J6796m710L2529j4052m7349l3367
$$ -38459 -47993 -54137 -19533 -9046 -13609 -14547 7265 24061 19351 51880 37828 -9521 -42888
14193d2888n442K612J6569J1784Q166j0253L703J653k6744R148O1065J7208k6760
$$ -42888 -48330 -45718 -29149 -17365 -9199 -19452 -15749 -14096 -40840 -31692 29373 46581 19821
14180A9821j2494J9095N261j7996l0791J4818k214j4856J7758J4548m920j2536
$$ 19821 7327 26422 31683 13687 -17104 -2286 -4500 -19356 -1598 12950 8030 -4506
14168d506l4184j0537Q228j6084J0936N1417J608j767k5235n386k210j8162r37
$$ -4506 -38690 -49227 -40999 -57083 -46147 5270 6878 5111 -20124 -25510 -27720 -45882 -46819
14155d6819J8130M9730K9043p324j6211l8848Q157K0802M021j3188J2162j4317
$$ -46819 -28689 21041 50084 42760 26549 -12299 -4142 16660 20681 7493 19655 5338
14143E338O548j5169P143J1934n730p28k2262k1235J348L4670K2382M164k8591
$$ 5338 11886 -3283 3860 15794 10064 9336 -12926 -34161 -32813 1857 24239 28403 -188
14130a88l6698j7217J6866L2795K7153k030n514k8540j2097K6885P194J1956l79
$$ -188 -36886 -54103 -37237 -4442 22711 20681 15167 -13373 -25470 1415 8609 20565 20186
14117B0186j1272k4757k7023Q38K3151k9224j1854J6241J3075K481J354l534J0517
$$ 20186 8914 -15843 -42866 -42028 -18877 -48101 -59955 -43714 -30639 -28158 -26804 -30338 -19821
14104a9821O484j301k2238k7643l484q593K4946K4926M164P87k3449l194L0399
$$ -19821 -13337 -14638 -36876 -64519 -68003 -76596 -51650 -26724 -22560 -21773 -45222 -48416 -18017
14091a8017J2911j4483P937L9153M359k1814l3423L999L492K633K0974R716Q671
$$ -18017 -5106 -19589 -11652 27501 31860 10046 -23377 -19378 -15886 -13253 7721 17437 26108
14078B6108j2590o1K697L172L823J781N835j9555K937o035k9558N65L1473R889
$$ 26108 13518 13457 16154 19326 23149 24930 30765 11210 14147 8112 -21446 -20881 10592 20481
14064B0481Q637m5124j4624J7349m536j679P36N125j3273j4514N697O698J5517
$$ 20481 29118 -16006 -30630 -13281 -17817 -19496 -18760 -13635 -26908 -41422 -35725 -29027 -13510
14051a3510j2280m29o038O616K601Q162J6755m190Q704Q126M861J2578p499m826
$$ -13510 -25790 -26219 -32257 -25641 -23040 -14878 1877 -2313 6391 14517 19378 31956 24457 19631
14037A9631r427j9009K958J6405j7131l2524j9984Q875p964N334N442K5768L3060
$$ 19631 10204 -8805 -5847 10558 -6573 -39097 -59081 -50206 -58170 -52836 -47394 -21626 11434
14024A1434j2110P643k913J6838k4321k866K4538j0145p726M590K2584K2583j4360
$$ 11434 -676 6967 4054 20892 -3429 -6295 18243 8098 372 4962 27546 50129 35769
14011C5769k7137n462k7003M56Q777J8699j364j6204K3352J9940J6358j2882k1352
$$ 35769 8632 3170 -23833 -23377 -14600 4099 2735 -13469 9883 29823 46181 33299 11947
13998A1947K056M469k1371j5535j1681n920p108K2258L4352q439r420n80j414
$$ 11947 14003 18472 -2899 -18434 -30115 -36035 -43143 -20885 13467 5028 -4392 -4972 -6386
13985f386p792n395o018L40l695J8035N24R357k1799j5380J7245J7462J8243j5562
$$ -6386 -14178 -19573 -25591 -25251 -28946 -10911 -10387 -1030 -22829 -38209 -20964 -3502 14741 -821
13971h21M085o937k5547J054K586j4280M846n694j0537J2864K5693n178l7407
$$ -821 3264 -3673 -29220 -28166 -25580 -39860 -35014 -40708 -51245 -38381 -12688 -17866 -55273
13958e5273Q656K8255J3991N631j6245q153k101n992K303l082q91M5691L4344
$$ -55273 -46617 -18362 -4371 1260 -14985 -23138 -25239 -31231 -28928 -32010 -32901 12790 47134
13945D7134k660k9123l88N964k473j4483j2097J9649J8367k9813l2279j9129N716
$$ 47134 44474 15351 14963 20927 18454 3971 -8126 11523 29890 77 -32202 -51331 -45615
13932d5615L3150J1854J0168J0796J287k4268k0520L7256k4559l4044J9611L5198
$$ -45615 -12465 -611 9557 20353 21640 -2628 -23148 14108 -10451 -44495 -24884 10314
13920A0314j7620l1525l6971J8886K2846K3481J8562K7058O242m547j7503j0088
$$ 10314 -7306 -38831 -75802 -56916 -34070 -10589 7973 35031 41273 36726 19223 9135
13908I135r362K4779M630k3482J9691K633L824K5033l0082m8594K6056J8169j9288
$$ 9135 -227 24552 29182 5700 25391 28024 31848 56881 26799 -21795 4261 22430 3142
13895C142J8343j3201o2577j1169L87N963K0743J0450J3630K1665j7550j4352
$$ 3142 21485 8284 -54293 -65462 -65075 -59112 -38369 -27919 -14289 7376 -10174 -24526
13883b4526O104j7206k0074O049K1473J7060Q991J605K798K552K409j4364J3873
$$ -24526 -18422 -35628 -55702 -49653 -28180 -11120 -2129 -524 2274 4826 7235 -7129 6744
13870F744j3844k0276N930N478J1621k2868k9803L1251K0371o019J0574j4004
$$ 6744 -7100 -27376 -21446 -15968 -4347 -27215 -57018 -25767 -5396 -11415 -841 -14845
13858a4845j8675k7838J6132K486J8944K7351L591L411N687j055O6j5727J0091
$$ -14845 -33520 -61358 -45226 -42740 -23796 3555 7146 10557 16244 15189 15255 -472 9619
13845I619p115j2057j4014q075K2153M0526j8343l2540j7024p364k046M1203L7439
$$ 9619 2504 -9553 -23567 -31642 -9489 31037 12694 -19846 -36870 -44234 -46280 -5077 32362
13832C2362P328m113j3776k6569P649j850J6135K8965p982k2162m219l897o262
$$ 32362 39690 35577 21801 -4768 2881 1031 17166 46131 38149 15987 11768 7871 1609
13819A609J5354K935L939p867k1554n072K7135N240j60j0218J3982J1202j9481
$$ 1609 16963 19898 23837 15970 -5584 -10656 16479 21719 21559 11341 25323 36525 17044
13806A7044J2684k322J6845l5073j1893r912K7R454k2493j0640Q698j5480K5736
$$ 17044 29728 27406 44251 9178 -2715 -12627 -12600 -3146 -25639 -36279 -27581 -43061 -17325
13793a7325l367k3813M199J3947O33L0360J3874N554k5906r979K98r554P42M432
$$ -17325 -20692 -44505 -40306 -26359 -25726 4634 18508 24062 -1844 -11823 -11525 -21079 -20337 -15905
13779a5905L2025r26O503j4781J3878N773n826l3058r246J9121L0039J5949j4050
$$ -15905 16120 15194 21697 6916 20794 26567 20741 -12317 -21563 -2442 27597 43546 29496
13766B9496n015K4824K0310P063q288K8551J1889n403j2557j7475l4630o990j3185
$$ 29496 24481 49305 69615 76678 68390 96941 108830 103427 90870 73395 38765 31775 18590
13753A8590J4241M6029l773k3658j1790O919j8211k64J7048R619k0184n7866R000
$$ 18590 32831 78860 75087 51429 39639 46558 28347 28083 45131 54750 34566 -23300 -14300
13740a4300K750J897j1872P561l952J5762J8753J2079Q809L454J2465j9224l2291
$$ -14300 -11550 -9653 -21525 -13964 -17916 -2154 16599 28678 37487 40941 53406 34182 1891
13727A891o028J8971K4866L115J4044j427L0869J6589K4758J2478k6619k4192
$$ 1891 -4137 14834 39700 42815 56859 55432 86301 102890 127648 140126 113507 89315
13715H9315P814o082K3016q650k77J4812p813j7744r011k2179j7487q001j877
$$ 89315 97129 91047 114063 105413 105136 119948 112135 94391 85380 63201 45714 37713 35836
13702C5836M70r001R579L8376K8493k9205k7631j2843j2465L568K3656k3331j4152
$$ 35836 36306 27305 36884 75260 103753 74548 46917 34074 21609 25177 48833 25502 11350
13689A1350J4161j3057J2662K728m010J5568k398n310J857j416n967p406K0636
$$ 11350 25511 12454 25116 27844 23834 39402 37004 31694 33551 32135 26168 18762 39398
13676C9398R972l0254R35K6734Q891q760l6081j3901J5786R611l1537J507K4905
$$ 39398 49370 19116 20051 46785 55676 46916 10835 -3066 12720 22331 -9206 -7699 17206
13663A7206K6378J0133j1507Q560Q686r68O939m419j631r855p818o987l6744m432
$$ 17206 43584 53717 42210 50770 59456 58488 65427 61008 59377 49522 41704 34717 -2027 -6459
13649f459j1560N740J1538P566J8808j8798J7391J0137O130K4779j4535j0177
$$ -6459 -18019 -12279 -741 6825 25633 6835 24226 34363 40493 65272 50737 40560
13637D0560J0910Q037j0966j0242k0539j0012Q596L2698N094k626p022J917J5530
$$ 40560 51470 59507 48541 38299 17760 7748 16344 49042 54136 51510 44488 46405 61935
13624F1935l4891R668K7570l47j1040J1980k7485k9968K0268J8957q344p393q805
$$ 61935 27044 36712 64282 63935 52895 64875 37390 7422 27690 46647 38303 30910 22105
13611B2105J7604P499O773J5344j2305L0835k1608l7933j1866N0833j4648m5677
$$ 22105 39709 47208 53981 69325 57020 87855 66247 28314 16448 67281 52633 6956
13599F956K08J14J4491J4675R612J508k694J0405J1782l7018p882L838k165l2383
$$ 6956 7164 7278 21769 36444 46056 47564 44870 55275 67057 30039 22157 25995 23830 -8553
13585h553L22K8004J8257j1800N945K1851L581M678K5315l460k595Q217j132l1450
$$ -8553 -8231 19773 38030 26230 32175 54026 57607 62285 87600 84140 81545 89762 88630 57180
13571E7180l5833j1869r735K056K7344N254l260R987J4850k3392j2895O371K844
$$ 57180 21347 9478 -257 1799 29143 34397 31137 41124 55974 32582 19687 26058 28902
13558B8902l7055L2491L7281l694R959j2971j8901m3756Q80P191K7059K90N948
$$ 28902 -8153 24338 61619 57925 67884 54913 36012 -7744 -6864 327 27386 27676 33624
13545C3624K0981q99K585m273k154J8577j7535N033K2110p038j3441k789k9471
$$ 33624 54605 53706 56291 52018 49864 68441 50906 55939 78049 71011 57570 54781 25310
13532B5310j9349q872J6263L582P011R235J5433N191M617J7672k3257j4513q448
$$ 25310 5961 -2911 13352 16934 23945 33180 48613 53804 58421 76093 52836 38323 29875
13519B9875J9968J9867j534J1684q371K745L5852P6r089k5154j261k4143j5290
$$ 29875 49843 69710 68176 79860 71489 74234 110086 110162 101073 75919 74658 50515 35225
13506C5225n290J7941L9198J4311j4678L680J6550K5966K4165L0278M7854M3845
$$ 35225 29935 47876 87074 101385 86707 90387 106937 132903 157068 187346 235200 279045
13494B79045M0870N8168L2063L8095L2715J0030J6905k4266k5408j5352l7614
$$ 279045 319915 378083 410146 448241 480956 490986 507891 483625 458217 442865 405251
13483D05251n2598m1283p367k0097m1929m1299m2344n0416p745M898K2847J8167
$$ 405251 352653 311370 304003 283906 241977 200678 158334 107918 100173 105071 127918 146085
13471A46085m754j190k1292J9055J6610l2387l8014k38Q69r396J2438L0512L2275
$$ 146085 141331 140141 118849 137904 154514 122127 84113 83875 84744 75348 87786 118298 150573
13458A50573q779k0862j4265j1931p036O773p54J3942P830j4410m7258j8637J7469
$$ 150573 141794 120932 106667 94736 87700 94473 93719 107661 115491 101081 53823 35186 52655
13445E2655K9096J370k1256M160o080j0062O2755L5162m1561N958J212J1260J2475
$$ 52655 81751 83121 61865 66025 59945 49883 112638 147800 106239 112197 113409 124669 137144
13432A37144n920l3133k4514K353K7316n622j7204N526L7763j0723j2541l5973
$$ 137144 131224 98091 73577 75930 103246 97624 80420 85946 123709 112986 100445 64472
13420F4472O437J5639o391K2443q14j0391O5k3576j9712r40L0254m9l6873M069
$$ 64472 70909 86548 80157 102600 101786 91395 91460 67884 48172 47232 77486 77437 40564 44633
13406D4633Q182J6819R717j2945m487p950J761m136j0522J8497j5996j1661j0668
$$ 44633 52815 69634 79351 66406 61919 53969 55730 51594 41072 59569 43573 31912 21244
13393B1244J955j5134J03J9949J662p457j6497M4138L9066j402p892K7061R650
$$ 21244 23199 8065 8168 28117 29779 22322 5825 49963 89029 87627 79735 106796 116446
13380A16446J1108j2560k3802N206q721J417O109l4057p652K4337K0662K2820
$$ 116446 127554 114994 91192 96398 87677 89094 95203 61146 53494 77831 98493 121313
13368A21313J1900k4323m3j3150n854m637K7070R509j9575j4802l556J965K2225
$$ 121313 133213 108890 108847 95697 89843 85206 112276 121785 102210 87408 83852 85817 108042
13355A08042K0054m747k2191J9547J3898J3279J2324j4393k5746l600J7935J0627
$$ 108042 128096 123349 101158 120705 134603 147882 160206 145813 120067 116467 134402 145029
13343A45029j4274j2143j2762q219j3649j8212M3087K5047l3083r25j1668K4486
$$ 145029 130755 118612 105850 97631 83982 65770 108857 133904 100821 99896 88228 112714
13331A12714O189L260j6836p589n451J4964K8365K1725j5319j7850p796Q821k485
$$ 112714 118903 122163 105327 97738 92287 107251 135616 157341 142022 124172 116376 125197 122712
13318A22712j01M642K983k5584k2125j832Q239K3321Q212P846p971m0855P464
$$ 122712 122611 127253 130236 104652 82527 80695 88934 112255 120467 128313 120342 79487 86951
13305H6951K8771l403Q534o0r36k04J2548K1316j6419j0013J6418L081R539l2764
$$ 86951 115722 112319 120853 120793 119857 119653 132201 153517 137098 127085 143503 146584 156123 123359
13291A23359N85J7425j2048p080J3958K1505j5572o1720K2172O952L880J5085
$$ 123359 123944 141369 129321 122241 136199 157704 142132 80412 102584 109536 113416 128501
13279A28501K7449R392j1757M511O398j8709j3079M0498J4047j8227j1073k962
$$ 128501 155950 165342 153585 158096 164494 145785 132706 173204 187251 169024 157951 154989
13267A54989j2482j2922M720J2893m491j4423J9745J0149P005k4587J5804J3569
$$ 154989 142507 129585 134305 147198 142707 128284 148029 158178 165183 140596 156400 169969
13255A69969k7162j7248J1145K5729J4591p252j7316J3291Q896j7715j5698q498
$$ 169969 142807 125559 136704 162433 177024 169772 152456 165747 174643 156928 141230 132732
13243A32732j83J3569l6016l1596K1842J2636k88Q511J7765M616J0966j7089j6788
$$ 132732 132549 146118 110102 78506 100348 112984 112696 121207 138972 143588 154554 137465 120677
13230A20677p828K150K3486o153O392R760J1521J6950L539P08k555k3841j075
$$ 120677 112849 114999 138485 132332 138724 148484 160005 176955 180494 181202 178647 154806 153731
13217A53731K201N4336J2333P163l8725k6324o955J2547Q424j7222k325J2452
$$ 153731 155932 210268 222601 229764 191039 164715 157760 170307 178731 161509 159184 171636
13205A71636R66r775m136j1960k774j2583Q417K6013K5341K6559k1521j153J7841
$$ 171636 172602 162827 158691 146731 143957 131374 139791 165804 191145 217704 196183 195030 212871
13192B12871P67j5492O560p982O248J6440J5414l319j5533K121J6101J1484P097
$$ 212871 213638 198146 204706 196724 202972 219412 234826 231507 215974 218095 234196 245680 252777
13179B52777j5420j0545j579l486N22J8870k5666j4212q443N082P982L1621K08
$$ 252777 237357 226812 225233 221747 222269 241139 215473 201261 192818 197900 205882 237503 237711
13166B37711J487q533k6756k0930J608R032P125j9520J3381K5191j690j2891K999
$$ 237711 239198 230665 203909 182979 184587 193619 200744 181224 194605 219796 218106 205215 208214
13153B08214J2705J24j3520K307J1558J377r686l7309K2740J9715J6143J583l9715
$$ 208214 220919 221043 207523 209830 221388 222765 213079 175770 198510 218225 234368 235951 196236
13140A96236j3429J9451j592P432n194J7105K4175l3987R44J5068l185j619K588
$$ 196236 182807 202258 200666 208098 202904 220009 244184 210197 211141 226209 223024 221405 223993
13127B23993J9674K1010J8820k291j9054Q830J3724j4848j9830J8516L4260m052
$$ 223993 243667 264677 283497 281206 262152 270982 284706 269858 250028 268544 302804 298752
13115B98752j8253J7512j8747j710K1820K234n2156l4307J0567L9968L3508Q781
$$ 298752 280499 298011 279264 277554 299374 301608 249452 215145 225712 265680 299188 307969
13103C07969n997m684J0321M186j4831j0699k0316R54J5230N386o009J450K4630
$$ 307969 301972 297288 307609 311795 296964 286265 265949 266903 282133 287519 281510 282960 307590
13090C07590J6508j207j3976K1855J1139k1210j5287K3871O594k1608l8291j686
$$ 307590 324098 322891 308915 330770 341909 320699 305412 329283 335877 314269 275978 274292
13078B74292L9147J5722P472l2008p884K4372M392O780J8002Q417k8130j4282
$$ 274292 313439 329161 336633 304625 296741 321113 325505 332285 350287 358704 330574 316292
13066C16292L2412J788m501j3303j8008L255J5057R805K6962N47L753J712K4210
$$ 316292 348704 350492 345991 332688 314680 317935 332992 342797 369759 370306 374059 375771 399981
13053C99981k3887j3745L778j9516n255J8095J1536L1691k577j1285J2788Q693
$$ 399981 376094 362349 366127 346611 341356 359451 370987 402678 400101 388816 401604 410297
13041D10297J0299k3527Q918K0622m898O897J6123J7790j0200L033r142J1829
$$ 410297 420596 397069 405987 426609 421711 428608 444731 462521 452321 455354 446212 458041
13029D58041j4084K60j2059j3235j4528j8170K8003L4842r00o581L914M358k9580
$$ 458041 443957 444217 432158 418923 404395 386225 414228 449070 448170 441589 445503 449861 420281
13016D20281j4064J7603J8967K1992J2448k3417Q350k9292j5775r58L200J1205
$$ 420281 406217 423820 442787 464779 477227 453810 462160 432868 417093 416135 419335 430540
13004D30540L6299k070j3484j1231P471p088M181P269N177K244J1933j3665K3601
$$ 430540 466839 464769 451285 440054 447525 440437 444618 451887 457064 459308 471241 457576 481177
12991D81177J7706j363l403J7852L805P256k1087J2691J2679n948k612j1805J5223
$$ 481177 498883 497520 494117 511969 515774 523030 501943 514634 527313 521365 518753 506948 522171
12978E22171K9746K4985K127j0861l690P098N471K3581q025l3955R134L7498O51
$$ 522171 551917 576902 579029 568168 564478 571576 577047 600628 592603 558648 567782 605280 605931
12965F05931l4602j1213L2598K6234k1029m9526j6986J7217K1526J6134L2134
$$ 605931 571329 560116 592714 618948 597919 548393 531407 548624 570150 586284 618418
12954F18418J1185k5223j7585K7297p137r669K1079J6214K956K5084K8359J2246
$$ 618418 629603 604380 586795 614092 606955 597286 618365 634579 637535 662619 690978 703224
12942G03224J5507j4926k0719R857k2385j5071Q444K9414N350l846k1226N552
$$ 703224 718731 703805 683086 692943 670558 655487 663931 693345 698695 694849 673623 679175
12930F79175J4873J9371K4208m340N989J6490R862J2495m709J0707J7472J6511
$$ 679175 694048 713419 737627 733287 739276 755766 765628 778123 773414 784121 801593 818104
12918H18104k0612k4977K3679L2654J2551J3205k2620r086J2143L5404L91j7803
$$ 818104 797492 772515 796194 828848 841399 854604 831984 822898 835041 870445 870836 853033
12906H53033K0499K7788J3574q76L927L6174L3895j7785k8298L440M166J7290
$$ 853033 873532 901320 914894 914018 917945 954119 988014 970229 941931 945371 949537 966827
12894I66827j506k2927Q882J1954K3938K2562k025k442R805o178J6212K7191P548
$$ 966827 965321 942394 951276 963230 987168 1009730 1007705 1005263 1015068 1008890 1025102 1052293 1059841
12881A059841j3559m805J6843p790L1576J6377o909J023K0176r655j971J8042
$$ 1059841 1046282 1041477 1058320 1050530 1082106 1098483 1091574 1092597 1112773 1103118 1101147 1119189
12869A119189K6477P446J6518M514j8934K7384M7429N851m776J8404J7925j3663
$$ 1119189 1145666 1153112 1169630 1174144 1155210 1182594 1230023 1235874 1231098 1249502 1267427 1253764
12857A253764J2729O764J9519K1329J0491P639L7914J2222L7275J3147l0288j6461
$$ 1253764 1266493 1273257 1292776 1314105 1324596 1332235 1370149 1382371 1419646 1432793 1402505 1386044
12845A386044R014J3920J5559L2392K0114L367J0097p840l299J0869m245j9154
$$ 1386044 1395058 1408978 1424537 1456929 1477043 1480410 1490507 1482667 1479368 1490237 1485992 1466838
12833A466838K5657N8700M0829Q878N930J0174j7562K1748L453L9851r775L1020
$$ 1466838 1492495 1551195 1592024 1600902 1606832 1617006 1599444 1621192 1624645 1664496 1654721 1685741
12821A685741K3596M273o318J4277j8398j1265L9539K5226K5362J0844P865J457
$$ 1685741 1709337 1713610 1707292 1721569 1703171 1691906 1731445 1756671 1782033 1792877 1800742 1802199
12809A802199L0855J2029l268m468J2039K831J1969N7007M0640K4260K378J283
$$ 1802199 1833054 1845083 1841815 1837347 1849386 1852217 1864186 1921193 1961833 1986093 1988471 1989754
12797A989754J6703N8513J5963n90M066n819J6026L8709R246J4184N7540K2133
$$ 1989754 2006457 2064970 2080933 2080343 2084409 2078590 2094616 2133325 2142571 2156755 2214295 2236428
12785B236428M34J3468Q579r677K3297K2808L9530M6327N0495o875N246N3507
$$ 2236428 2236862 2250330 2258909 2249232 2272529 2295337 2334867 2381194 2431689 2424814 2430060 2483567
12773B483567M8545J4185J575J5444K7638L4818K6316L8776J5612J9922J5486
$$ 2483567 2532112 2546297 2547872 2563316 2590954 2625772 2652088 2690864 2706476 2726398 2741884
12762B741884K5061O1980M1376J188J2243M6415N0766K3609N5081N6752j3572
$$ 2741884 2766945 2828925 2870301 2871489 2883732 2930147 2980913 3004522 3059603 3116355 3102783
12751C102783Q005J4166M9750K9473L8695P8538M1659P3584N2486K3193L573L378
$$ 3102783 3110788 3124954 3174704 3204177 3242872 3321410 3363069 3436653 3489139 3512332 3515905 3519283
12739C519283M1551N2272M3773J8188K6834N3179L6430L5534P0615O7045K8532
$$ 3519283 3560834 3613106 3656879 3675067 3701901 3755080 3791510 3827044 3897659 3964704 3993236
12728C993236N3397P3704O3594O3848K8922N0204P1815M4678N1182P0765M6985
$$ 3993236 4046633 4120337 4183931 4247779 4276701 4326905 4398720 4443398 4494580 4565345 4612330
12717D612330L7254N2655P8062N4053Q1299P5840Q0924O9520M4025N8348Q8254
$$ 4612330 4649584 4702239 4780301 4834354 4915653 4991493 5072417 5141937 5185962 5244310 5332564
12706E332564Q2138O1656P7042N6475P4907N9341P1509P4319P1580J01878J16032
$$ 5332564 5414702 5476358 5553400 5609875 5684782 5744123 5815632 5889951 5961531 6063409 6179441
12695F179441Q4171Q0759O9239J02433J15810R0924J23948J20524J15918J14962
$$ 6179441 6263612 6344371 6413610 6516043 6631853 6722777 6846725 6967249 7083167 7198129
12685G198129J00271J19275J16529J02348J02625J10554R9860J46083J65040J20466
$$ 7198129 7298400 7417675 7534204 7636552 7739177 7849731 7949591 8095674 8260714 8381180
12675H381180J13589J31383J44561J27687J53347J58846J49946J54341J64523
$$ 8381180 8494769 8626152 8770713 8898400 9051747 9210593 9360539 9514880 9679403
12666I679403J65302J67711J61093J69371J63022K01287K10239J99286J99261
$$ 9679403 9844705 10012416 10173509 10342880 10505902 10707189 10917428 11116714 11315975
12657A1315975J75247K24902K13783J71991K17028K29666K49504K63886K23863
$$ 11315975 11491222 11716124 11929907 12101898 12318926 12548592 12798096 13061982 13285845
12648A3285845K15573K58931K45478K71020K64231K40878K62193K76152K85122
$$ 13285845 13501418 13760349 14005827 14276847 14541078 14781956 15044149 15320301 15605423
12639A5605423K93093K84506K74204K86163L10081L08818L32784L00618L10236
$$ 15605423 15898516 16183022 16457226 16743389 17053470 17362288 17695072 17995690 18305926
12630A8305926L38048K97567L10420L69118L47426L49180L83952L52947L45799
$$ 18305926 18643974 18941541 19251961 19621079 19968505 20317685 20701637 21054584 21400383
12621B1400383L54357L64873L64965L85208L54655L81995L91137L87144L93604
$$ 21400383 21754740 22119613 22484578 22869786 23224441 23606436 23997573 24384717 24778321
12612B4778321M14475L83954L80575L92391L60702L70099L64327L70540L76083
$$ 24778321 25192796 25576750 25957325 26349716 26710418 27080517 27444844 27815384 28191467
12603B8191467L73056L84883M15998L74134L92292L79958L75881L81215L72535
$$ 28191467 28564523 28949406 29365404 29739538 30131830 30511788 30887669 31268884 31641419
12594C1641419L72935L44341L49879L60260L74897L14799L47770L35685K84005
$$ 31641419 32014354 32358695 32708574 33068834 33443731 33758530 34106300 34441985 34725990
12585C4725990K78425K87522K89071K73252K45509K36349K44904K50523K53669
$$ 34725990 35004415 35291937 35581008 35854260 36099769 36336118 36581022 36831545 37085214
12576C7085214K35083J89051J85977J83694J76911J57336J26213J10850J37867
$$ 37085214 37320297 37509348 37695325 37879019 38055930 38213266 38339479 38450329 38588196
12567C8588196J32440J36228J14285N8274P1946L3194L1362L7578L0784J1121
$$ 38588196 38720636 38856864 38971149 39029423 39101369 39134563 39165925 39203503 39234287 39245408
12557C9245408k3283k728k9925r7329q3213p2408n7032r3020j39291j32457j49694
$$ 39245408 39222125 39219397 39189472 39092143 39008930 38936522 38879490 38786470 38647179 38514722 38365028
12546C8365028j49732j74435j56882j63160j84058k10681j95051j95761k38997
$$ 38365028 38215296 38040861 37883979 37720819 37536761 37326080 37131029 36935268 36696271
12537C6696271k49182k44661k61657k64254k82498k62321k62543k98693k90008
$$ 36696271 36447089 36202428 35940771 35676517 35394019 35131698 34869155 34570462 34280454
12528C4280454k64887k88428l59345l06279k89033l13347l21196l23685l09631
$$ 34280454 34015567 33727139 33367794 33061515 32772482 32459135 32137939 31814254 31504623
12519C1504623l17260l76739l80678l49720l18132k93681l14694l52005l55223
$$ 31504623 31187363 30810624 30429946 30080226 29762094 29468413 29153719 28801714 28446491
12510B8446491l57445l18352k94848l34188l70595l37746l10737l29218l69434
$$ 28446491 28089046 27770694 27475846 27141658 26771063 26433317 26122580 25793362 25423928
12501B5423928l36121l21806l22236l26760k89451l09641l29003l04241l21447
$$ 25423928 25087807 24766001 24443765 24117005 23827554 23517913 23188910 22884669 22563222
12492B2563222l07635k87383k79749l08285k97454k86402k83066l28770l09923
$$ 22563222 22255587 21968204 21688455 21380170 21082716 20796314 20513248 20184478 19874555
12483A9874555k67814k42407k67615k68490k58871k84657k73555k53009k18870
$$ 19874555 19606741 19364334 19096719 18828229 18569358 18284701 18011146 17758137 17539267
12474A7539267k50579k54572k58206k44642k24488k12634k24942k35525k43145
$$ 17539267 17288688 17034116 16775910 16531268 16306780 16094146 15869204 15633679 15390534
12465A5390534k37393j67552k07546k11412k10840k28694j95209j64402k17481
$$ 15390534 15153141 14985589 14778043 14566631 14355791 14127097 13931888 13767486 13550005
12456A3550005j89673j73649j82588j60195j80405j82719j47728j86640j91187
$$ 13550005 13360332 13186683 13004095 12843900 12663495 12480776 12333048 12146408 11955221
12447A1955221j66744j48890j78791j96391j63250j22802j18291j54134j69279
$$ 11955221 11788477 11639587 11460796 11264405 11101155 10978353 10860062 10705928 10536649
12438A0536649j45913j20379j53564j17441j18964j30901j26451j33188j19741
$$ 10536649 10390736 10270357 10116793 9999352 9880388 9749487 9623036 9489848 9370107
12429I370107j30815j44400j32953j30304j02096j19183j38425j15663j02319
$$ 9370107 9239292 9094892 8961939 8831635 8729539 8610356 8471931 8356268 8253949
12420H253949j04785r7298q1213j07518j05249r2719q6319r5061r7628q6158q8692
$$ 8253949 8149164 8051866 7970653 7863135 7757886 7665167 7578848 7483787 7386159 7300001 7211309
12409G211309o2903j00875j10067p9264o8497r5240r4418j03081j14927p5896
$$ 7211309 7148406 7047531 6937464 6858200 6789703 6694463 6600045 6496964 6382037 6306141
12399F306141o1880o1513r6164q8900l0159n5250p6235p1959p4243p8995m9145
$$ 6306141 6244261 6182748 6086584 5997684 5967525 5912275 5836040 5764081 5689838 5610843 5561698
12388E561698m6107o9628j00388n1298m6061n5137o5891p7235m9393q0820o4543
$$ 5561698 5515591 5445963 5345575 5294277 5248216 5193079 5127188 5049953 5000560 4919740 4855197
12377D855197m8559m3509M842n4971o7064o4150n1674n0236n6812n4124n8025
$$ 4855197 4806638 4763129 4767971 4713000 4645936 4581786 4530112 4479876 4423064 4368940 4310915
12366D310915k0023k9647l6543n7691n7272n0005l1835l8143j5312m7366m8281
$$ 4310915 4290892 4261245 4224702 4167011 4109739 4059734 4027899 3989756 3974444 3927078 3878797
12355C878797l9196m2243k3569l8327k2808j6305l0253k4048m2151n2896j2401
$$ 3878797 3839601 3797358 3773789 3735462 3712654 3696349 3666096 3642048 3599897 3547001 3534600
12344C534600k3390m7217k440l4095l7151L670n346l1559m0078m4325j9359m8090
$$ 3534600 3511210 3463993 3461553 3427458 3390307 3393977 3388631 3357072 3316994 3272669 3253310 3205220
12332C205220m6947j5394J1330M235k5805j8453k6641m1774k5599k6427l4145
$$ 3205220 3158273 3142879 3154209 3158444 3132639 3114186 3087545 3045771 3020172 2993745 2959600
12321B959600k1045j0766k7489o779n627k7842l4685j3235o999k0628j5964J212
$$ 2959600 2938555 2927789 2900300 2893521 2887894 2860052 2825367 2812132 2805133 2784505 2768541 2769753
12309B769753m0640j6128p662p476j5400j1678j8363j3167k0076j5061q105k1235
$$ 2769753 2729113 2712985 2705323 2697847 2682447 2670769 2652406 2639239 2619163 2604102 2595997 2574762
12297B574762l4396q865j4312k5678k3582O815N13n956k4508k9285k0165j3004
$$ 2574762 2540366 2531501 2517189 2491511 2467929 2474744 2475257 2469301 2444793 2415508 2395343 2382339
12285B382339o09J8259o700k0050l6305n1983q298J4790J3634r352n4818n0821
$$ 2382339 2381730 2399989 2393289 2373239 2336934 2284951 2276653 2291443 2305077 2295725 2240907 2190086
12273B190086m129l5197j4829J4792Q167j2331m1921k1189p709j0370r355k4474
$$ 2190086 2185957 2150760 2135931 2150723 2158890 2146559 2104638 2083449 2075740 2065370 2056015 2031541
12261B031541j2407m588m1117j5290J7577k6786k6852l4269j1691k3776k625O916
$$ 2031541 2019134 2014546 1973429 1958139 1975716 1948930 1922078 1887809 1876118 1852342 1849717 1856633
12249A856633k3316l4282j5166J3064J2398k0167k4696j7968k0748k5884j1842
$$ 1856633 1833317 1799035 1783869 1796933 1809331 1789164 1764468 1746500 1725752 1699868 1688026
12238A688026J1026l7090l5068j747n692k116K414N707j0711K174j9782l7248
$$ 1688026 1699052 1661962 1626894 1625147 1619455 1617339 1619753 1625460 1614749 1616923 1597141 1559893
12226A559893j1677n828q682l27l395l2942K516j8895j4674j3405k4118r447j4763
$$ 1559893 1548216 1542388 1533706 1533379 1529984 1497042 1499558 1480663 1465989 1452584 1428466 1419019 1404256
12213A404256l0255n381J3033K846j4851k2800J7729j1945k384j7778j9688K342
$$ 1404256 1374001 1368620 1381653 1384499 1369648 1346848 1364577 1352632 1350248 1332470 1312782 1315124
12201A315124L8861J5853k6169k614l1839j3362j4044j5099q402j0823j8625L005
$$ 1315124 1353985 1369838 1343669 1341055 1309216 1295854 1281810 1266711 1258309 1247486 1228861 1231866
12189A231866j8991Q04n927l5033l3325R084P068q015Q51q039r458l4840J8683
$$ 1231866 1212875 1213679 1207752 1172719 1139394 1148478 1155546 1147531 1148382 1140343 1130885 1096045 1114728
12176A114728J6288j0679J6491k5850k5012j6568l8260l5466n57P782n326J227
$$ 1114728 1131016 1120337 1136828 1110978 1085966 1069398 1031138 995672 995115 1002897 997571 998798
12164I98798L6055K1639O663k4795m0516k8254j3488J6521p8J850J8664l9594
$$ 998798 1034853 1056492 1063155 1038360 997844 969590 956102 972623 972545 974395 993059 953465
12152I53465r401J8521K2483k7117m3837j2855L4381p35n088k0275p872k0659
$$ 953465 944064 962585 985068 957951 914114 901259 935640 934905 929817 909542 901670 881011
12140H81011l3742N716J6082m79qk4031P053Q576j6952k3348p903k141j636j6782
$$ 881011 847269 852985 869067 868588 868580 844549 851602 860178 843226 819878 811975 809834 808198 791416
12126G91416m0582O267r806J9406L1154k527r186k951J3956m468r154k6092K360
$$ 791416 750834 757101 747295 766701 797855 795328 786142 783191 797147 792679 783525 757433 759793
12113G59793Q588N103o759j1619l466M362j7582l5275Q8L709j0979j8124J3573
$$ 759793 768381 773484 766725 755106 751640 756002 738420 703145 703233 706942 695963 677839 691412
12100F91412l623r319j018J3791k1268k0616j5448M411M250o45j3882l677J2538
$$ 691412 687789 678470 677452 691243 669975 649359 633911 638322 642572 641927 628045 624368 636906
12087F36906L127M97j6513r575l105P116O964r602J3939n435j9259r260J3817
$$ 636906 640033 640530 624017 614442 611337 618453 625417 615815 629754 624319 605060 595800 609617
12074F09617N665j0661j5257K6981L5472k1438j9419j2692j0951q045m9066q854
$$ 609617 615282 604621 589364 616345 651817 630379 610960 598268 587317 579272 530206 521352
12062E21352n871R824L3784j406k5008j3740R005N160m109j7875r407M055P187
$$ 521352 515481 525305 559089 557683 532675 518935 527940 533100 528991 511116 501709 505764 512951
12049E12951j5356O55K8159J3683j9623j9087R95J944m571J8566j5330j4932o448
$$ 512951 497595 498250 526409 540092 520469 501382 502377 504321 499750 518316 502986 488054 481606
12036D81606k742j975K0805N724j5126j2870N290o057J6308l449k3894l32k7845
$$ 481606 478864 476889 497694 503418 488292 475422 480712 474655 490963 487514 463620 463288 435443
12023D35443j8624p280L3342L663k1095j7019j7087K7461K6197J0423j2853j4535
$$ 435443 416819 409539 442881 446544 425449 408430 391343 418804 445001 455424 442571 428036
12011D28036j3759M743L2881J2152j8434J6342M116l1620l6199j2494J5393q436
$$ 428036 414277 419020 451901 464053 445619 461961 466077 434457 398258 385764 401157 392721
11999C92721l6274K8070J6771K6513L0982k3387l4974j7851o26K3403L244N20
$$ 392721 356447 384517 401288 427801 458783 435396 400422 382571 381945 405348 408592 409112
11987D09112l1825q638K2855Q652J4498o336l0982j4468p530J6203J1365K8373
$$ 409112 377287 368649 391504 400156 414654 408318 377336 362868 355338 371541 382906 411279
11975D11279j1886l0591M122O954o608J8722K2938l058m7278j3393j881l4109
$$ 411279 399393 368802 372924 379878 373270 391992 414930 411872 364594 351201 349320 315211
11963C15211J7848K7770K3591M798j3540m751M392n200j7675L346J4939j5163
$$ 315211 333059 360829 384420 389218 375678 370927 375319 370119 352444 355790 370729 355566
11951C55566J4429k8528P885O962q603K6329K3567k6188j7316j6086j3757j9626
$$ 355566 369995 341467 349352 356314 347711 374040 397607 371419 354103 338017 324260 304634
11939C04634r627o338j1726J1927K4926J1797J9136j504M778J934L125j6028j7792
$$ 304634 295007 288669 276943 288870 313796 325593 344729 343225 348003 349937 353062 337034 319242
11926C19242J741O938j8771l03L027K4774k4840o627J2220q856n876p922k1608
$$ 319242 320983 327921 309150 308847 311874 336648 311808 305181 317401 308545 302669 294747 273139
11913B73139K7545J2741l6004j8818R527J2736j0481Q530P83k5436j0347o080
$$ 273139 300684 313425 277421 258603 268130 280866 270385 278915 279698 254262 243915 237835
11901B37835K601J795J8663L1395r881k466J4728k8521l3362k4689j6851m26M3805
$$ 237835 240436 242231 260894 292289 282408 279942 294670 266149 232787 208098 191247 190821 234626
11888B34626M764J3530J3657m2004o966J8397J1732P249k9386o899q042K5312
$$ 234626 239390 252920 266577 224573 217607 236004 247736 254985 225599 218700 210658 235970
11876B35970J8134J6102o979l104j5283j7646m635R981K2056j025l2585N231p643
$$ 235970 254104 270206 263227 260123 244840 227194 222559 232540 254596 253571 220986 226217 218574
11863B18574P280m082J825k6704O556L1057j2429k3995j1185K6105M0235k8301
$$ 218574 225854 221772 223597 196893 203449 234506 222077 198082 186897 213002 253237 224936
11851B24936n7630k5614J6723K8893K931j8748O326K9566j888p110j1912P466
$$ 224936 167306 141692 158415 187308 190239 171491 177817 207383 205495 198385 186473 193939
11839A93939M353r742J7192M513m88M43M602J537j4956K7840N034n508M142l5776
$$ 193939 198292 188550 205742 210255 209767 210210 214812 216349 201393 229233 234267 228759 232901 197125
11825A97125k3009K4637J9012m218K2482M714j2818j5203m44K571l0020j0492
$$ 197125 174116 198753 217765 213547 236029 240743 227925 212722 212278 214849 184829 174337
11813A74337K2602o503k0904m994L919K7670r226o078M402O24K3604l445j079
$$ 174337 196939 190436 169532 164538 168457 196127 186901 180823 185225 185849 209453 206008 204929
11800B04929p569l857j1872j1746n668p305K3256P861l758l6k4908P732J2162
$$ 204929 197360 193503 181631 169885 164217 156912 180168 188029 184271 184235 159327 167059 179221
11787A79221p655P591N450j2923j369p149j1067l207K9303L3710j0674l4240m516
$$ 179221 171566 179157 184607 171684 170315 163166 152099 148892 178195 211905 201231 166991 162475
11774A62475K1171k2140k0740P515J8627K0602K2855K9141K4838L5300j8261l9000
$$ 162475 183646 161506 140766 148281 166908 187510 210365 239506 264344 299644 281383 242383
11762B42383k4459j479q628l2559k1398o472K780J020j1624j5874m3095J7117
$$ 242383 217924 216445 207817 175258 153860 147388 150168 151188 139564 123690 80595 97712
11750I7712M2916J0743k430l261L488j3803P682K4594p207l944j1312k0865k3656
$$ 97712 140628 151371 148941 145680 149168 135365 143047 167641 160434 156490 145178 124313 100657
11737A00657j551J1921K4449J8644k4584q32J344N105j5738j5406O817L5806K0383
$$ 100657 99106 111027 135476 154120 129536 128704 130048 135153 119415 104009 110826 146632 167015
11724A67015Q93J3992K679J2394o210j6913j1872k0747m955r68J2873j0737M1634
$$ 167015 167908 181900 184579 196973 190763 173850 161978 141231 136276 135308 148181 137444 179078
11711A79078K1607M2680L8630J9530j4817j4030k183K5756k0678m0155R49J073
$$ 179078 200685 243365 281995 301525 286708 272678 270495 296251 275573 235418 236367 237440
11699B37440j2772k9089j1646k0581r337J2124q290n070J289K2689K536p131l63
$$ 237440 224668 195579 183933 163352 154015 166139 157849 152779 154068 176757 179293 172162 171799
11686A71799J8794j4769L5m017j3819l8564j8607N688L0506P504L704J9564j33
$$ 171799 190593 175824 175859 171842 158023 119459 100852 106540 137046 144550 148254 167818 167685
11673A67685P765j7378o648k4189L572L6587J7058p167M663L904L5718J6141j1549
$$ 167685 175450 158072 151424 127235 130807 167394 184452 177285 181948 185852 221570 237711 226162
11660B26162k6072j0236j6364k9621p163K2762J79M454j0977k3770n559J0924
$$ 226162 200090 189854 173490 143869 136706 159468 159647 164101 153124 129354 123795 134719
11648A34719O488r877r827J8580Q143q864R909L818K0265j0792k4299j0834k2422
$$ 134719 141207 131330 121503 140083 148226 139362 149271 153089 173354 162562 138263 127429 105007
11635A05007j1176M946K9817J6220p789j7046j3835j209o144K0665K3993m848
$$ 105007 93831 98777 128594 144814 137025 119979 106144 104935 98791 119456 143449 138601
11623A38601k3625j9216n518j4266j2702o248J3136O411j8866k1157j6927J5227
$$ 138601 114976 95760 90242 75976 63274 57026 70162 76573 57707 36550 19623 34850
11611C4850K3147J778N281K2875M611K797K5615l426R972R73j5166K1607K9749
$$ 34850 57997 59775 65056 87931 92542 95339 120954 117528 127500 128473 113307 134914 164663
11598A64663K3943N674K248K6591J0201N4053N6755M4309K6905K9390M9542O5830
$$ 164663 188606 194280 196528 223119 233320 287373 344128 388437 415342 444732 494274 560104
11586E60104R2662J07731J10837J35405J57150J75969J74359J96160J78894J43457
$$ 560104 652766 760497 871334 1006739 1163889 1339858 1514217 1710377 1889271 2032728
11576B032728J25444J01350K5482k4973k9373r8631j22477j14508j03595q8308
$$ 2032728 2158172 2259522 2285004 2260031 2230658 2132027 2009550 1895042 1791447 1703139
11566A703139m7126n6217o4054k9749m0946l7038m6739K761J3150J5944M3466
$$ 1703139 1656013 1599796 1535742 1505993 1465047 1428009 1381270 1384031 1397181 1413125 1456591
11555A456591N2555N8507L6064M7583N5810J08454J31432J16532Q3905Q6755O4570
$$ 1456591 1509146 1567653 1603717 1651300 1707110 1815564 1946996 2063528 2147433 2234188 2298758
11544B298758M3711J4068k2824n5967j02161j57988j73988j75372j70534j42521
$$ 2298758 2342469 2356537 2333713 2277746 2175585 2017597 1843609 1668237 1497703 1355182
11534A355182j10356j24155j13287p5854o8071l4716k8736n2325l1528j5823l9232
$$ 1355182 1244826 1120671 1007384 931530 863459 828743 800007 747682 716154 700331 661099
11523F61099k6317l5168l2345l9383m7236j6009P053k737j3988J1540q196k6647
$$ 661099 634782 599614 567269 527886 480650 464641 471694 468957 454969 466509 458313 431666
11511D31666q382j1789o457l0048k6494J9305K7760l093k9069L458j8947l1502
$$ 431666 423284 411495 405038 374990 348496 367801 395561 392468 363399 366857 347910 316408
11499C16408k0866k3484l297R684k711l8807j1281K470N176j7689l2283J686L77
$$ 316408 295542 272058 268761 278445 275734 236927 225646 228116 233292 215603 183320 185006 185383
11486A85383K8612K937k1526p799q595n58J7433k0625k2165K4288J9404k5123
$$ 185383 213995 216932 195406 187607 179012 178454 195887 175262 153097 177385 196789 171666
11474A71666K818m446m716k9565P910M4036K1412N861M299k2810r448j5452K153
$$ 171666 174484 170038 165322 135757 143667 187703 209115 214976 219275 196465 187017 171565 173718
11461A73718m766m48J1008J5136L6416J9166j9678j6883L533L804R544o856L786
$$ 173718 168952 168504 179512 194648 231064 250230 230552 213669 217202 221006 230550 223694 227480
11448B27480j9322l1515j6937J8717p053Q406K6984N1993J962j3994j2531j6630
$$ 227480 208158 176643 159706 178423 171370 179776 206760 258753 260715 246721 234190 217560
11436B17560J5262K7184J3508j194J3807M5641K9170j5199k9129K6496M8998q601
$$ 217560 232822 260006 273514 272320 286127 331768 360938 345739 316610 343106 392104 383503
11424C83503j3984J2259J4454j7637k1658Q18L0195R600J0689K4335K7336j125
$$ 383503 369519 381778 396232 378595 356937 357755 387950 397550 408239 432574 459910 458785
11412D58785L234L795J4092M3537J4658J280j590j0462k9817l626J3401j9568
$$ 458785 462019 465814 479906 523443 538101 539381 537791 527329 497512 493886 507287 487719
11400D87719l710l693Q30j6841m8403j2828J674k6012j3717q772l632J3675k893
$$ 487719 484009 480316 481146 464305 415902 403074 404748 378736 365019 356247 352615 366290 363397
11387C63397j2627K3844j8187j7413j6158l7485J7939K5440k175l755l7745q122
$$ 363397 350770 374614 356427 339014 322856 285371 303310 328750 326575 322820 285075 276953
11375B76953L036K1070j454l7876k2876r020l4089n6038k4815N132r341k6573
$$ 276953 279989 301059 299605 261729 238853 229833 195744 139706 114891 120023 110682 84109
11363H4109k781L482k0919j4455j5423M287J381k0805l821j0148r775P307j0781
$$ 84109 81328 84810 63891 49436 34013 38300 39681 18876 15055 4907 -4868 2439 -8342
11350h342l4734j4349j1526K7210K4234O823j2925J76J9553J6290J6709m300N868
$$ -8342 -43076 -57425 -68951 -41741 -17507 -10684 -23609 -23433 -3880 12410 29119 24819 30687
11337C0687K6697j1572K654K313k276K0217m661L601L5254j0099m26J1069m982
$$ 30687 57384 45812 48466 50779 48503 68720 64059 67660 102914 92815 92389 103458 98476
11324I8476J0155K2588L1288J2566l206J7466L4954L267M726N820L9366J7357
$$ 98476 108631 131219 162507 175073 171867 189333 224287 227554 232280 238100 277466 294823
11312B94823N0466O3790O5294N0157P2640N5737J8117K1054P6786Q2647M2942
$$ 294823 345289 409079 474373 524530 597170 652907 671024 692078 768864 851511 894453
11301H94453L4302Q3772Q2273J02109J11445J01896P9593R3047J10108J40681
$$ 894453 928755 1012527 1094800 1196909 1308354 1410250 1489843 1582890 1692998 1833679
11291A833679J05578R3497J44763J34742R3950R8171J35445J29960Q6051O1546
$$ 1833679 1939257 2032754 2177517 2312259 2406209 2504380 2639825 2769785 2855836 2917382
11281B917382M5702J5840M700k6644m2120m1389l7946j6446J0065j5878k0944
$$ 2917382 2963084 2978924 2983624 2956980 2914860 2873471 2835525 2819079 2829144 2813266 2792322
11270B792322l3696n8938J642L2225J010J1442K8888M4670P7022L2134K755N8184
$$ 2792322 2758626 2699688 2701330 2733555 2734565 2746007 2774895 2819565 2896587 2928721 2931476 2989660
11258B989660K9635K8615O1480K7867L1836m6393k3389R61J1873k4589o4129q2334
$$ 2989660 3019295 3047910 3109390 3137257 3169093 3122700 3099311 3100272 3112145 3087556 3023427 2941093
11246B941093q2577j26315j03788j13574j17717j40072p7294q849o6159j07262
$$ 2941093 2858516 2732201 2628413 2514839 2397122 2257050 2179756 2170907 2104748 1997486
11236A997486o6366l3561k9560l3417j1347l08j7255m978k9019K298J9997J3893
$$ 1997486 1931120 1897559 1867999 1834582 1823235 1822927 1805672 1800694 1771675 1773973 1793970 1807863
11224A807863L9413K0880l377K8698P0677M4003M4709Q5652R2960P4117N2305
$$ 1807863 1847276 1868156 1864779 1893477 1964154 2008157 2052866 2138518 2231478 2305595 2357900
11213B357900Q2056J07601J35387J55886J19313J11493J50617J49750J56464J69240
$$ 2357900 2439956 2547557 2682944 2838830 2958143 3069636 3220253 3370003 3526467 3695707
11203C695707J76295J70567J66430K29590K30117K41259K37196K39215K55838
$$ 3695707 3872002 4042569 4208999 4438589 4668706 4909965 5147161 5386376 5642214
11194E642214L28255L42323L89997M26076M89302N02753N03256N87802O45303
$$ 5642214 5970469 6312792 6702789 7128865 7618167 8120920 8624176 9211978 9857281
11185I857281O83714P48309P87116Q80997R92511J092577J209116J364933J518058
$$ 9857281 10540995 11289304 12076420 12957417 13949928 15042505 16251621 17616554 19134612
11176A9134612J697162J894843K153644K396656K733694L119440L517168M004081
$$ 19134612 20831774 22726617 24880261 27276917 30010611 33130051 36647219 40651300
11168D0651300M554213N234973O014142O985850Q055144R383290J0942247J2827288
$$ 40651300 45205513 50440486 56454628 63440478 71495622 80878912 91821159 104648447
11160A04648447J5102388J7698407K0727274K4068819K7540879L0738665L3187782
$$ 104648447 119750835 137449242 158176516 182245335 209786214 240524879 273712661
11153B73712661L4292506L3454985L0282939K4755844J7212850Q457439m87046
$$ 273712661 308005167 341460152 371743091 396498935 413711785 422169224 421682178
11146D21682178q546810j4877336j9017933k0837525k0752632j9285768j6951433
$$ 421682178 413135368 398258032 379240099 358402574 337649942 318364174 301412741
11139C01412741j4321391j1674919r165990o899100m790359k849259j049315P30465
$$ 301412741 287091350 275416431 266250441 259351341 254560982 251711723 250662408 251392873
11131B51392873K518013M306807O127952Q095896J0222107J2466450J4736677
$$ 251392873 253910886 258217693 264345645 272441541 282663648 295130098 309866775
11124C09866775J6962965J8958907K0323650K0594147J9327673J6167013J1033726
$$ 309866775 326829740 345788647 366112297 386706444 406034117 422201130 433234856
11117D33234856M060883m056490j2486681k0299047k6460783l0358173l1871715
$$ 433234856 437295739 433239249 420752568 400453521 373992738 343634565 311762850
11110C11762850l1213097k8980216k5815387k2312952j8946326j5991218j3475238
$$ 311762850 280549753 251569537 225754150 203441198 184494872 168503654 155028416
11103A55028416j1467498r827193q503719p474416o605485n891755n305753m904085
$$ 155028416 143560918 133733725 125230006 117755590 111150105 105258350 99952597 95048512
11095I5048512m533279m179759l899596l632358l396258l201398k962438k780539
$$ 95048512 90515233 86335474 82435878 78803520 75407262 72205864 69243426 66462887
11087F6462887k584581k362081k136687j962070j782736j632825j537980j398042
$$ 66462887 63878306 61516225 59379538 57417468 55634732 54001907 52463927 51065885
11079E1065885j309044j188298j148250j045665r35961q97674q07922p05858o60556
$$ 51065885 49756841 48568543 47420293 46374628 45438667 44540993 43733071 43027213 42366657
11070D2366657n91176n16062n16502m85616m33272m39875m50376m48943m95565
$$ 42366657 41775481 41259419 40742917 40257301 39824029 39384154 38933778 38484835 37989270
11061C7989270n17575n67879n80119o09211o05327n79672n46003n25273m99096
$$ 37989270 37471695 36903816 36323697 35714486 35109159 34529487 33983484 33458211 32959115
11052C2959115m92568m52486m58979m50378m26766l98002l60411l61314l43333
$$ 32959115 32466547 32014061 31555082 31104704 30677938 30279936 29919525 29558211 29214878
11043B9214878l18347k80412k91271k89899k41361k41655k43813k27796k32487
$$ 29214878 28896531 28616119 28324848 28034949 27793588 27551933 27308120 27080324 26847837
11034B6847837k40396k40997k97149l33600l62828l72637l99965m38085m56524
$$ 26847837 26607441 26366444 26069295 25735695 25372867 25000230 24600265 24162180 23705656
11025B3705656m77735m78957m53894m76450n14987n29031n26049n26975n25088
$$ 23705656 23227921 22748964 22295070 21818620 21303633 20774602 20248553 19721578 19196490
11016A9196490n13195n13684m99403m71795m61035m76316m52719l94091l95760
$$ 19196490 18683295 18169611 17670208 17198413 16737378 16261062 15808343 15414252 15018492
11007A5018492l53403l42878l25111l65394l47903l02240k84378k79827k84097
$$ 15018492 14665089 14322211 13997100 13631706 13283803 12981563 12697185 12417358 12133261
10998A2133261k67267k63876k77380k97668l01829k99774k91547k79486k72684
$$ 12133261 11865994 11602118 11324738 11027070 10725241 10425467 10133920 9854434 9581750
10989I581750l07455l00664l16499l18146k94359l16628l03121k65939k82707
$$ 9581750 9274295 8973631 8657132 8338986 8044627 7727999 7424878 7158939 6876232
10980F876232k91248k89182k59348k35653j88505k16925k30495k34791k39474
$$ 6876232 6584984 6295802 6036454 5800801 5612296 5395371 5164876 4930085 4690611
10971D690611j66502j29686j59253j79924j41578j44215j52683j11298j12664
$$ 4690611 4524109 4394423 4235170 4055246 3913668 3769453 3616770 3505472 3392808
10962C392808j18995j35580r9655m8736p9031p9047o9520r0767p1135m1207k4527
$$ 3392808 3273813 3138233 3038578 2989842 2910811 2831764 2762244 2671477 2600342 2559135 2534608
10951B534608j6745k9068m014k6007m4801n5462n0221k9337j2498k6976l554L131
$$ 2534608 2517863 2488795 2484781 2458774 2413973 2358511 2308290 2278953 2266455 2239479 2235925 2239056
10939B239056m35M939k3844k151K3886M1826L4946N388j2456J6016J7585J8690
$$ 2239056 2238621 2243560 2219716 2217565 2241451 2283277 2318223 2323611 2311155 2327171 2344756 2363446
10927B363446L4508K3348K4547R590J2413K262J6606K4991K2845K9877M3798L0712
$$ 2363446 2397954 2421302 2445849 2455439 2467852 2470114 2486720 2511711 2534556 2564433 2608231 2638943
10915B638943n63J6766K4938K5273P967k1962k3976J8507L7739K5824j1463l588
$$ 2638943 2638380 2655146 2680084 2705357 2713324 2691362 2667386 2685893 2723632 2749456 2737993 2734405
10903B734405L2430P918Q251L929K692L6287J0028K5565p097m413p702J1537J6775
$$ 2734405 2766835 2774753 2783004 2786933 2789625 2825912 2835940 2861505 2854408 2849995 2842293 2853830 2870605
10890B870605j3944J6241l365N469k896L445J3062k1415l5940j9641J318R27n928
$$ 2870605 2856661 2872902 2869537 2875006 2872110 2875555 2888617 2867202 2831262 2811621 2812939 2813866 2807938
10877B807938k7592k2051k4358k873l2775l7247j9817k8266k7428m7071l4456
$$ 2807938 2780346 2758295 2733937 2731064 2698289 2661042 2641225 2612959 2585531 2538460 2504004
10866B504004m1260m1041k9194j5197k4080k3660j2255k1268k2412k8645n5930
$$ 2504004 2462744 2421703 2392509 2377312 2353232 2329572 2317317 2296049 2273637 2244992 2189062
10855B189062l4188j3188n6261m1217l2833l1510l7708k7951k8146l6504m9674
$$ 2189062 2154874 2141686 2085425 2044208 2011375 1979865 1942157 1914206 1886060 1849556 1799882
10844A799882l7913n1420n3333m1839p883J571r082k3538m3259m0459k6946j9465
$$ 1799882 1761969 1710549 1657216 1615377 1607494 1609065 1599983 1576445 1533186 1492727 1465781 1446316
10832A446316l4560k9853l7868k7817j9639j3450m9504m476m833k8716j1056n835
$$ 1446316 1411756 1381903 1344035 1316218 1296579 1283129 1233625 1229149 1224316 1195600 1184544 1178709
10820A178709k6917k3687k3060k5635j4806j707j3092l3057l8040m4714j939L5680
$$ 1178709 1151792 1128105 1105045 1079410 1064604 1062897 1049805 1016748 978708 933994 932055 967735
10808I67735k697j6160o359q874k4666j0180j945j6305l827l865j778K686n936
$$ 967735 965038 948878 942519 933645 908979 898799 896854 880549 876722 872857 871079 873765 867829
10795H67829j8862l625j062J7992J5428n209k347q018k203Q362l998O279J0075
$$ 867829 848967 845342 844280 862272 877700 872491 870144 862126 859923 868285 864287 870566 880641
10782H80641j8236K1183J7021J5915J5011n610l7751J5817K1407K1562j3564K8357
$$ 880641 862405 883588 900609 916524 931535 925925 888174 903991 925398 946960 933396 961753
10770I61753J6730j1031Q403K186P215M777O170J2908k01J1128L7744Q345M85
$$ 961753 978483 967452 975855 978041 985256 990033 996203 1009111 1008910 1020038 1057782 1066127 1066612
10757A066612j1918K4093K5833m378k2982J6645J8207J5134O1J7595N623n8k641
$$ 1066612 1054694 1078787 1104620 1100242 1077260 1093905 1112112 1127246 1127307 1144902 1150525 1150467 1147826
10744A147826j3939k549J1600L5482L2466K0697J3232K800J6307L4810M5112L9240
$$ 1147826 1133887 1131338 1142938 1178420 1210886 1231583 1244815 1247615 1263922 1298732 1343844 1383084
10732A383084K5453R169N0953O1568K4208M0060P0683J27363J27744J24080J47864
$$ 1383084 1408537 1417706 1468659 1530227 1554435 1594495 1665178 1792541 1920285 2044365 2192229
10721B192229J72577J79314J68851J64564J70159J18766M6697L476o5806p8700
$$ 2192229 2364806 2544120 2712971 2877535 3047694 3166460 3213157 3216633 3150827 3072127
10711C072127j13227r7196j00701j17606j03187r0993r6960l3993j6192m1274
$$ 3072127 2958900 2861704 2761003 2643397 2540210 2449217 2352257 2318264 2302072 2260798
10701B260798n0430m2960R382K8589j5403M447M4034N6762L4361N8731Q3961R1317
$$ 2260798 2210368 2167408 2176790 2205379 2189976 2194423 2238457 2295219 2329580 2388311 2472272 2563589
10689B563589J07197R5832J26084J03901N3243K4308j9744m3270q4834j54464
$$ 2563589 2670786 2766618 2892702 2996603 3049846 3074154 3054410 3011140 2926306 2771842
10679B771842k04251j79085j45584j75605j35536j06551j20119j04146j17932
$$ 2771842 2567591 2388506 2242922 2067317 1931781 1825230 1705111 1600965 1483033
10670A483033q9754q6017m3413l4418j7199j7778k4570m9452n3008k7352l9374
$$ 1483033 1393279 1307262 1263849 1229431 1212232 1194454 1169884 1120432 1067424 1040072 1000698
10659A000698l4722J182m779q883k9133J7698k6288l4131k0423m091l5294l4857
$$ 1000698 965976 967158 962379 953496 924363 942061 915773 881642 861219 857128 821834 786977
10647G86977j0814M134K247m662K255j0838n1J0050k3228l0732R07j8429K235
$$ 786977 776163 780297 782544 777882 780137 769299 769248 779298 756070 725338 726245 707816 710051
10634G10051j0775O781J8543R210j5932K3139J0115n346j5515k9015k7817j1042
$$ 710051 699276 706057 724600 733810 717878 741017 751132 745786 730271 701256 673439 662397
10622F62397K5084Q775k6759Q919j0906J2756J0884J2830j4349J3589K4571k943
$$ 662397 687481 696256 669497 678416 667510 680266 691150 703980 689631 703220 727791 724848
10610G24848N520j1830j6558l693j5155J2055j2902j4826J1663L575p556K5260
$$ 724848 730368 718538 701980 698287 683132 695187 682285 667459 679122 682697 675141 700401
10598G00401J7155J7378J4116k4847k0884J4183p894n547R587k6520J1820J9469
$$ 700401 717556 734934 749050 724203 703319 717502 709608 704061 713648 687128 698948 718417
10586G18417k8244K2299j7392n512j4881j3552K2244o830j3598j291J517J5068
$$ 718417 690173 712472 695080 689568 674687 661135 683379 676549 662951 661660 663177 678245
10574F78245k8177j6848o183r217k599k152K635r312j1914j4865k1491J241N208
$$ 678245 650068 633220 627037 617820 615221 613069 615704 606392 594478 579613 558122 559363 564571
10561E64571J7312L1366J4162j8176l1996j8973k7090J6346K9858q810l9977J2990
$$ 564571 581883 613249 627411 609235 577239 558266 531176 547522 577380 568570 528593 541583
10549E41583L1859k1067l2485k9591L153J2184O808r495o674k8265j0920o42l6850
$$ 541583 573442 552375 519890 490299 493452 505636 512444 502949 496275 468010 457090 456448 419598
10536D19598j7547K0524L548J9870j0893K936J8901j7663O880K1374k0317N655
$$ 419598 402051 422575 426123 445993 435100 438036 456937 439274 446154 467528 447211 452866
10524D52866l942Q907q769r467k4215R008k4242R94k424o136j6299j8469q859
$$ 452866 448924 457831 449062 439595 415380 424388 400146 401140 398716 392580 376281 357812 348953
10511C48953l522J2905J6206J140l035j9807J164p665o438k380L2186J8073k2858
$$ 348953 345431 358336 374542 375682 372647 352840 354004 346339 339901 337521 369707 387780 364922
10498C64922l8519j4884R584J4028K497O423o23R537Q744n269J0528L7503J5616
$$ 364922 326403 311519 321103 335131 337628 344051 343428 352965 361709 356440 366968 404471 420087
10485D20087K914j0835l5569k2967J229m684N159j8716k911k773n912j1190P902
$$ 420087 423001 412166 376597 353630 354859 350175 355334 336618 333707 330934 325022 313832 321734
10472C21734K5378J1770K3870k726l6835l5130j7717J7163Q521K3928P934K9296
$$ 321734 347112 358882 382752 380026 343191 308061 290344 307507 316028 339956 347890 377186
10460C77186R869k1196l527K6683R185K53P392j9322j0299j5454k8658L712M0948
$$ 377186 387055 365859 362332 389015 398200 398453 405845 386523 376224 360770 332112 335824 376772
10447C76772l321j6372J9953J8303p953j4033k343J1652m480Q071M996r428j920
$$ 376772 373451 357079 377032 395335 387382 373349 371006 382658 378178 386249 391245 381817 379897
10434C79897o952k0267j9102j6188J0698J2090O228L4139o562N86j0070O639m93
$$ 379897 372945 352678 333576 317388 328086 340176 346404 380543 373981 374567 364497 371136 370643
10421C70643J7759j3945k5254k1514k367K0986J5193n345P825o19r028k0945j1376
$$ 370643 388402 374457 349203 327689 325322 346308 361501 356156 363981 363362 354334 333389 322013
10408C22013q638J5869M998J4921j0769K5605L4796j4064k9378j1557N550O594
$$ 322013 313375 329244 334242 349163 338394 363999 398795 384731 355353 343796 349346 355940
10396C55940p607k7317j75J1268J550J0403j8987k8704j6012p938K6052P289j3259
$$ 355940 348333 321016 320841 332109 333659 344062 325075 296371 280359 272421 298473 305762 292503
10383B92503j5793J8467J5725K5345l939k2576l1554l1389j3154j4769J7318L1466
$$ 292503 276710 295177 310902 336247 332308 309732 278178 246789 233635 218866 236184 267650
10371B67650K4540j5131j4887J4214r626J3622K0723q815n38J9928P573m0190
$$ 267650 292190 277059 262172 276386 266760 280382 301105 292290 291752 311680 319253 279063
10359B79063k4509K1016J2451m800j92j6546j3426q145J4529Q24R810J0794J5672
$$ 279063 254554 275570 288021 283221 283029 266483 253057 244912 259441 260265 270075 280869 296541
10346B96541k1177O446p700J2474O681j801J4896r56l4676l3117k1133J3451J1987
$$ 296541 275364 281810 274110 286584 293265 291464 306360 305404 270728 237611 216478 229929 241916
10333B41916j193k1369J4861M1377k0516k3084j7060P057n635J4584K2768j5078
$$ 241916 240723 219354 234215 275592 255076 231992 214932 221989 216354 230938 253706 238628
10321B38628l951L5272L3654r290n0885m444J5638J1628J3959m405q273l8799
$$ 238628 234677 269949 303603 294313 243428 238984 254622 266250 280209 275804 267531 228732
10309B28732j0753j138J1398L133L4678q404r090R52j3745m967Q062p017J6039
$$ 228732 217979 216841 228239 231372 266050 257646 248556 249508 235763 230796 238858 231841 247880
10296B47880N011J2895J0710Q30m515j0029q9o110Q04L2817J0916k4460l901N790
$$ 247880 252891 265786 276496 277326 272811 262782 262693 256583 257387 290204 301120 276660 272759 278549
10282B78549K009k833k1542l417j1933K0176K3359J3166k2236k2543J1096j9697
$$ 278549 280558 277725 256183 252766 240833 261009 284368 297534 275298 252755 263851 244154
10270B44154j1589l178o715K3373K4907J2403J2029J1924l695k7283k124p998
$$ 244154 232565 229387 222672 246045 270952 283355 295384 307308 303613 276330 274206 266208
10258B66208n449j1155K458J3997k287n91M861p365j9567j2168J9070j836K6000
$$ 266208 260759 249604 252062 266059 263772 263181 268042 260677 241110 228942 248012 246176 272176
10245B72176J4529n228n3651l3636n637j4441m190J5692J7780j0283j8891L3602
$$ 272176 286705 281477 227826 194190 188553 174112 169922 185614 203394 193111 174220 207822
10233B07822J4008l2205k0662n19p93m398J9511M4996j008J237J0069j8834j0468
$$ 207822 221830 189625 168963 168444 167651 163253 182764 227760 226752 227989 238058 219224 208756
10220B08756O281o740L166J7312o722j4503R172K0573o564k3033m0998m898K7019
$$ 208756 215037 208297 211463 228775 222053 207550 216722 237295 230731 207698 166700 161802 188821
10207A88821j4354j1643j582j2982L3770Q990Q932q130j4790J149K3255N079M757
$$ 188821 174467 162824 161242 148260 182030 191020 199952 191822 177032 178181 201436 206515 211272
10194B11272M0188R269j9233k6892P5J7613K717l1692l376m35J7375J227j9651
$$ 211272 251460 260729 241496 214604 214679 232292 235009 203317 199941 199506 216881 218108 198457
10181A98457k58p697j7124M046K1683J0972J4646M062k599m987J1452P99J753
$$ 198457 198199 190502 173378 177424 199107 210079 224725 228787 226188 221201 232653 233452 235205
10168B35205j5189l0186j5226J3220J8956P436k834k049j4265j2005r013k635
$$ 235205 220016 189830 174604 187824 206780 214216 211382 209333 195068 183063 174050 171415
10156A71415j1712R81p32q82J2058q481m179K3613K0565J2354k0238q285N706
$$ 171415 159703 160684 159952 159070 171128 162647 158468 182081 202646 215000 194762 186477 192183
10143A92183R880O767j0529j9054O633J9109P411j4960j7083j6947K149J8562
$$ 192183 202063 208830 198301 179247 185880 204989 212400 197440 180357 163410 165559 184121
10131A84121j1388r489J4471K1478j745k3815K0570J9548j4148J7041J2505k2659
$$ 184121 172733 163244 177715 199193 197448 173633 194203 213751 199603 216644 229149 206490
10119B06490L422m37K3028J0679j1148l778j3281n241L350M129k1633n0755k6461
$$ 206490 209912 209475 232503 243182 232034 228256 214975 209734 213084 217213 195580 144825 118364
10106A18364L3223m544K2896K3053J833m0311j6194j516Q157J9358J4224K7964
$$ 118364 151587 147043 169939 192992 194825 154514 138320 136804 144961 164319 178543 206507
10094B06507J732j8832j5283Q305L9001M691q466m869j5761j8668j9926J280p274
$$ 206507 208239 189407 174124 182429 221430 226121 217655 212786 197025 178357 158431 159711 152437
10081A52437k0336M376J65R24K630J5374P789p568j8494J237k539J3000j988L350
$$ 152437 132101 136477 136642 137566 140196 155570 163359 155791 137297 138534 135995 148995 147007 150357
10067A50357o350j66K0370J5187j7249j4415L8361M2446N760k3177N595J7038
$$ 150357 144007 143841 164211 179398 162149 147734 186095 228541 234301 211124 216719 233757
10055B33757J6241m745j7477j2412p581m5720j216p932J5792L608o475O347P301
$$ 233757 249998 245253 227776 215364 207783 162063 160847 152915 168707 172315 165840 172187 179488
10042A79488j8844j9449K6426J2493r728J806j6039R969J595m78J383k002Q3l232
$$ 179488 160644 141195 167621 180114 170386 172192 156153 166122 167717 167239 168622 166620 166703 163471
10028A63471m120r968K5595J6703O422J8169k36l5281p269K9222J1346k050p263
$$ 163471 159351 149383 174978 191681 198103 216272 216036 180755 173486 202708 214054 212004 204741
10015B04741O601K2569P544J1307p446k5813l362j2518N911p953l0407j3993q462
$$ 204741 211342 233911 241455 252762 245316 219503 216141 203623 209534 201581 171174 157181 148719
10002A48719m125K260J3824M2195j4865m4883p438k7768k707P245O991J4182j8501
$$ 148719 144594 146854 160678 202873 188008 143125 135687 107919 105212 112457 119448 133630 115129
9989A15129r227J5940J749o120R721p344L4593L6257n662k3114l308k850o96p74
$$ 115129 105902 121842 123591 117471 127192 119848 154441 190698 185036 161922 158614 155764 155068 154294
9975A54294j0995j2572j0296l2824K0312J9112K9020L227q937r025k1408q772
$$ 154294 143299 130727 120431 87607 107919 127031 156051 159278 150341 141316 119908 111136
9963A11136K6100o511j6073n894j058n26o085j6466N588J4729O029J1283M1711
$$ 111136 137236 130725 114652 108758 107700 107174 101089 84623 90211 104940 110969 122252 163963
9950A63963J5040k5552j0836p36N600j0071j0866J101k6252J3519R478J5420k0261
$$ 163963 179003 153451 142615 141879 147479 137408 126542 127643 101391 114910 124388 139808 119547
9937A19547j3078r164k443j1058j606M943L6270R902q361J1777Q124j8408j2619
$$ 119547 106469 97305 94862 83804 82198 87141 123411 133313 124952 136729 144853 126445 113826
9924A13826m52m146k140L8218K1151j5039m5847j7901r15q45j1241j804O815K8885
$$ 113826 113374 109228 107088 145306 166457 151418 105571 87670 86755 85910 74669 72865 79680 108565
9910A08565Q047K5376k6667L007K0427j7427O731J1860k137M295K6787J5458K2496
$$ 108565 116612 141988 115321 118328 138755 121328 128059 139919 137782 142077 168864 184322 206818
9897B06818O652j732p032k0336J2686M132k1047p419N085J0705N506l3965k5878
$$ 206818 213470 211738 204706 184370 197056 201188 180141 172722 177807 188512 194018 160053 134175
9884A34175Q689j6442j7970p062M5647J4143l0437o183J5040q299O476P393k395
$$ 134175 142864 126422 108452 101390 147037 161180 130743 124560 139600 131301 137777 145170 142775
9871A42775J520J6959O713K5617k1312l7187Q666J4188L2760p598j3191j8692
$$ 142775 144295 161254 167967 193584 172272 135085 143751 157939 190699 183101 169910 151218
9859A51218M723o62j8617j0593n346K4894P679j7781l826K3153K517O53j5346
$$ 151218 155941 155279 136662 126069 120723 145617 153296 135515 131689 154842 157359 158012 142666
9846A42666r41j9178k0936O343K7552k4350J908K4248L57j1413M527j8628k2548
$$ 142666 141725 122547 101611 107954 135506 111156 113064 137312 137669 126256 130783 112155 89607
9833H9607r769J0292K8082J5830j1347J241K2362K2521k0796j2909l2303j4603
$$ 89607 79838 90130 118212 134042 122695 123936 146298 168819 148023 135114 102811 88208
9821H8208l85o651J0644K9462J5533j2528j0003Q594j6779J4937m664J3498P641
$$ 88208 87823 81172 91816 121278 136811 124283 114280 122874 106095 121032 116368 129866 137507
9808A37507j3895m155l0002M000o332K2061j4027J2075J9104j7640j2577m617
$$ 137507 123612 119457 89455 93455 87123 109184 95157 107232 126336 108696 96119 91502
9796I1502J2310J9218k125k8841J1313Q560n74Q403j3673m4185p686K893K8003
$$ 91502 103812 123030 120905 92064 103377 111937 111363 119766 106093 61908 54222 57115 85118
9783H5118J6502K2323L0703Q768r941j3535o928j2236J973L669J0443j3790k7049
$$ 85118 101620 123943 154646 163414 153473 139938 133010 120774 122747 126416 136859 123069 96020
9770I6020l530K5302p236j9854m736R994j6631j8739J2948m669l829J3272J0624
$$ 96020 92490 117792 110556 90702 85966 95960 79329 60590 73538 68869 65040 78312 88936
9757H8936R508K3523K2473j0778l684M30k3315k1931j5497J983M6344M0458M518
$$ 88936 98444 121967 144440 133662 129978 130408 107093 85162 69665 71648 117992 158450 162968
9744A62968k6796k0700J1571M981j4197N979J0132n343k9263k3571Q568K7030
$$ 162968 136172 115472 127043 132024 117827 123806 133938 128595 99332 75761 84329 111359
9732A11359n981l2985Q422L3582o134K1390p995j555R332j7306k4361j841O317
$$ 111359 105378 72393 80815 114397 108263 129653 121658 120103 129435 112129 87768 85927 92244
9719I2244L6449j811J4461k0624J3006N266K1809o533k6259j7022j0630J8115
$$ 92244 128693 126882 141343 120719 133725 138991 160800 154267 128008 110986 100356 118471
9707A18471j5142j5622K0725K0662l2267R803R573k1064j1353N335L5349M347
$$ 118471 103329 87707 108432 129094 96827 106630 116203 95139 83786 89121 124470 128817
9695A28817m741p079k1486k1630m914k4847n510K5425M1244K4381K6097P626j5172
$$ 128817 124076 116997 95511 73881 68967 44120 38610 64035 105279 129660 155757 163383 148211
9682A48211j2321j1811q241k0955L99J76M188j469J508J8912M1910p327j4804
$$ 148211 135890 124079 115838 94883 95282 95458 99646 98177 99685 118597 160507 153180 138376
9669A38376k1817r915j2470k360M040R25k5241p185L5239J0430k044j6294j1427
$$ 138376 116559 106644 94174 91814 95854 96779 71538 64353 99592 110022 107978 91684 80257
9656H0257P964J5445q072l5761K4338M417p178l686M056o932N606J0861J9180
$$ 80257 88221 103666 95594 59833 84171 88588 81410 77724 81780 74848 80454 91315 110495
9643A10495Q907j0113J981J2416k448k8014J7004J2836p405l511l4216j5K2194
$$ 110495 119402 109289 111270 123686 121238 93224 110228 123064 115659 112148 77932 77917 100111
9630A00111K995J6839M92R532l5779q399J0617J6681m483q132L592P817j6729
$$ 100111 103106 119945 120437 129969 94190 85791 96408 113089 108606 100474 104066 111883 95154
9617I5154K1462n999j0213n488l19k6699q349J4277L4261J9854l751J4287p598
$$ 95154 116616 110617 100404 94916 94597 67898 59549 73826 108087 127941 124190 138477 130879
9604A30879l766j0420m1360j1313J8650P714j2853J619Q218J0424R141k1259J8398
$$ 130879 127113 116693 75333 64020 82670 90384 77531 79150 87368 97792 106933 85674 104072
9591A04072J0959j022l1236m6325l6187L3790M2215k340l0467q30L1046l850J3698
$$ 104072 115031 114009 82773 36448 261 34051 76266 73926 43459 42629 73675 69825 83523
9578H3523L6132M1639K1356l6093K0610P633k7143J1708N3441L5878Q740N730
$$ 83523 119655 161294 182650 146557 167167 174800 147657 159365 212806 248684 257424 263154
9566B63154j1130k9373r116k4618k1859j4447j6084j0062j9937N457k1907J1900
$$ 263154 252024 222651 213535 188917 167058 152611 136527 126465 106528 111985 90078 101978
9554A01978j76Q857K748j9257P736J9613r53R416j0644j7734L2017K8357k4816
$$ 101978 101802 110659 113407 94150 101886 121499 120546 129962 119318 101584 133601 161958 137142
9541A37142k5434k695N372r256P566L256r09k3412n379l422K098J9246J213j1295
$$ 137142 111708 109013 114385 105129 112695 115951 115042 91630 86251 82829 84927 104173 105386 94091
9527I4091J0119R579j9039J1493k2340l3953k4311K3793L419NP738J7189j424
$$ 94091 104210 113789 94750 106243 83903 49950 25639 49432 52851 52856 60594 77783 76359
9514G6359J636L877J5293j671J8615J6788k876J668m258k0890j8605j0290L3706
$$ 76359 77995 81872 97165 95494 114109 130897 128021 129689 125431 104541 85936 75646 109352
9501A09352K1743j4897j1033q973o33K0719r814J0531J4587m676k1024l8896J5380
$$ 109352 131095 116198 105165 96192 95559 116278 106464 116995 131582 126906 105882 66986 82366
9488H2366K4171l525K1075J5459n0702j7129m539r176O854J0478k5245p096q854
$$ 82366 106537 103012 124087 139546 88844 71715 67176 58000 64854 75332 50087 42991 34137
9475C4137K3181O744m136k0275k2430n11J9364L437L8501J6548p696K095J7932
$$ 34137 57318 64062 59926 39651 17221 16710 36074 39511 78012 94560 86864 88959 106891
9462A06891J3102n784k1229K305Q491k9859j8373J83J2584J4619K435j1147j1278
$$ 106891 119993 114209 92980 95285 103776 73917 55544 55727 68311 82930 85365 74218 62940
9449F2940K9754j1281J2379J6035k9962L616j0285p052j2852L5678K29n710J7621
$$ 62940 92694 81413 93792 109827 79865 83481 73196 66144 53292 88970 89199 83489 101110
9436A01110J022J821L458l5827l7287P765J6066K735j5667j0235J2393m057j9653
$$ 101110 102132 103953 107411 71584 34297 42062 58128 60863 45196 34961 47354 43297 23644
9423B3644P330L581L0118O606Q495j715P788J8065J6480L1432n133k0025j2114
$$ 23644 30974 34555 64673 71279 79774 78059 85847 103912 120392 151824 146691 126666 114552
9410A14552k2247p37K410J3297n200J165p179j2741O540j2497k5853K2495L427
$$ 114552 92305 91568 93978 107275 102075 103240 96061 83320 89860 77363 51510 74005 77432
9397G7432p190m677k2386m332J3396K9215J6760q479J102q88k5541j2857J1459
$$ 77432 70242 65565 43179 38847 52243 81458 98218 89739 90841 89953 64412 51555 63014
9384F3014N464K0719K929j5070J7177j7549j0717k8779m213j4164L3443K0238
$$ 63014 68478 89197 92126 77056 94233 76684 65967 37188 32975 18811 52254 72492
9372G2492K580J576k848J3239K5022J512j8935q049q657q839o007K0189K3808
$$ 72492 75072 76648 73800 87039 112061 113573 94638 86589 77932 69093 63086 83275 107083
9359A07083n807k1031m438j3089k0879O179P228L4009P818j4772k947Q950j7085
$$ 107083 101276 80245 75807 62718 41839 48018 55246 89255 97073 82301 79354 88304 71219
9346G1219k4924q656L5264K0166k2637l023L5696j540l266O4j7495l345q654j1971
$$ 71219 46295 37639 72903 93069 70432 67409 103105 101565 98299 98363 80868 77523 68869 56898
9332E6898l586k9518k7288J4416J9876J4248J9483j01J4631j2017k6945J7501
$$ 56898 53312 23794 -3494 10922 30798 45046 64529 64428 79059 67042 40097 57598
9320E7598N2456q091k4782j2000L9418J1127l587J37J32j2584k8288q157L51J5935
$$ 57598 110054 101963 77181 65181 104599 115726 112139 112276 112408 99824 71536 63379 63730 79665
9306G9665N38j2414k0013k3171K0507N6196J1515j6739j3602L3016j1166n915
$$ 79665 80203 67789 47776 24605 45112 101308 112823 96084 82482 115498 104332 98417
9294I8417Ml8780q072L2662K8827M65j7255m006j5202m899J0571R876K5216R617
$$ 98417 98421 59641 51569 84231 113058 113523 96268 92262 77060 72161 82732 92608 117824 127441
9280A27441R438O972R687L006k3821j2017Q354L777J5820P26l9222j9598J9468
$$ 127441 136879 143851 153538 156544 132723 120706 129060 132837 148657 149383 110161 90563 110031
9267A10031K0066j2005J9320K275P083o76j999q019o886L968K096K7906r433m2447
$$ 110031 130097 118092 137412 139687 146770 146094 144095 136076 129190 133158 135254 163160 153727 111280
9253A11280n919L7830M1502l6934j6736J2178P487K845k2080j3489j1049k3803
$$ 111280 105361 143191 184693 147759 131023 143201 150688 153533 131453 117964 106915 83112
9241H3112j391m330j5428J2618J0634L105Q01K476j063o379j423K4784q445n899
$$ 83112 81721 77391 61963 74581 85215 88320 89121 91597 90534 84155 82732 107516 99071 93172
9227I3172k0302P673J4820J9244J5657K8858p72k9462K0171P070j8588M545j4275
$$ 93172 72870 80543 95363 114607 130264 159122 158350 128888 149059 156129 137541 142086 127811
9214A27811k1975K6002J5377j0999O900K7371J1196J573q900J0255j6694m861
$$ 127811 105836 131838 147215 136216 143116 170487 181683 183256 174356 184611 167917 163056
9202A63056N99j2393k1294j1241K5181M2526R434J0915K0349j3691j3474L1126
$$ 163056 163655 151262 129968 118727 143908 186434 195868 206783 227132 213441 199967 231093
9190B31093M8042m012R556J6289J0725M791L961R812o72j5846L1066M4078j563
$$ 231093 279135 275123 284679 300968 311693 316484 320445 330257 329585 313739 344805 388883 387320
9177C87320k102J2985K3811K7384N0531M7427M1255N0056P4456N6602N5631N2072
$$ 387320 385218 398203 422014 449398 499929 547356 588611 638667 713123 769725 825356 877428
9165H77428M4965P7513J02349J17120J41770J62357J91655K07106K74866K74714
$$ 877428 922393 999906 1102255 1219375 1361145 1523502 1715157 1922263 2197129 2471843
9155B471843L29748M13540M82288N72773O81542P96426Q55016Q84234Q53954P18780
$$ 2471843 2801591 3215131 3697419 4270192 4951734 5748160 6603176 7487410 8341364 9060144
9145I060144M96976J64135k10346n05850p46102q82358q85514q10430p09594n94994
$$ 9060144 9557120 9721255 9510909 9005059 8258957 7376599 6491085 5680655 4971061 4376067
9135D376067m75095l69496l06841k51458k30361j82021j59994j69340j29417j13289
$$ 4376067 3900972 3531476 3224635 2973177 2742816 2560795 2400801 2231461 2102044 1988755
9125A988755p2557j14651j10124p5428r7999j05072n8594n6780q3370n0676l9476
$$ 1988755 1916198 1801547 1691423 1615995 1517996 1412924 1354330 1297550 1214180 1163504 1124028
9114A124028n7323m2971k6919l6401m9187l9200k6895K965j6329l4309m2387l8309
$$ 1124028 1066705 1023734 996815 960414 911227 872027 845132 848097 831768 797459 755072 716763
9102G16763p291L4376j5242m9219o749J1677q712k6182m3526k2721j738n878o531
$$ 716763 709472 743848 728606 679387 672638 684315 675603 649421 605895 583174 581436 575558 569027
9089E69027r088K388j1492j0596K4039L0537J2065m5274m1560R421M630q124j0780
$$ 569027 559939 562327 550835 540239 564278 594815 606880 561606 520046 529467 534097 525973 515193
9076E15193m4441o001j5221l26q058L164j4535J1756J5462j3643k3714k560K4090
$$ 515193 470752 464751 449530 449204 441146 444310 429775 441531 456993 443350 419636 417076 441166
9063D41166K0990M7994J4502n7362l5855j4043N992k727j8923k4635J3973J6451
$$ 441166 462156 510150 524652 467290 431435 417392 423384 420657 401734 377099 391072 407523
9051D07523k109J2421R255j1516Q60O908j3690j7955m5127l4947L034j8910q456
$$ 407523 405414 417835 427090 415574 416434 423342 409652 391697 346570 311623 314657 295747 287291
9038B87291M087K3122m605o370k6352j9498l1599K0180N0454J8268m3693l4500
$$ 287291 291378 314500 309895 303525 277173 257675 226076 246256 296710 314978 271285 236785
9026B36785j1710L3511K7657K0736j2938K6629j6942l8066j9685p271J6332K645
$$ 236785 225075 258586 286243 306979 294041 320670 303728 265662 245977 238706 255038 257683
9014B57683m3313j4096p508J8446o893k6283j0796k1753o035j62K5245k343r066
$$ 257683 214370 200274 192766 211212 204319 178036 167240 145487 139452 139290 164535 162192 153126
9001A53126j0519j8699L085j7606P8K1974R367Q378J9046k8917p555m3311k1514
$$ 153126 142607 123908 126993 109387 109465 131439 140806 149184 168230 139313 131758 88447 66933
8988F6933j1995J2537j2984P859M383K566K0132J191M264j155j2516n414m33J0262
$$ 66933 54938 67475 54491 62350 66733 69299 89431 90622 94886 93731 81215 75801 75368 85630
8974H5630J1450M820J9463k2594m08j5810j4594n128M398J6513J8457K0699j9506
$$ 85630 97080 101900 121363 98769 98361 82551 67957 62829 67227 83740 102197 122896 103390
8961A03390j4358Q732K0806L695j8633k4136r691k5765L218L6008j2589k0403
$$ 103390 89032 97764 118570 122265 103632 79496 69805 44040 47258 83266 70677 50274
8949E0274J8726K6866L73L080m116K661L556O40o138j7310J0976p675K730n240
$$ 50274 69000 95866 96239 99319 95203 97864 101420 102060 95922 78612 89588 81913 84643 79403
8935G9403k1462K154P326l690m385K4448J1218J0549k1941R928o170O833K9415
$$ 79403 57941 60095 67421 63731 59346 83794 95012 105561 83620 93548 87378 94211 123626
8922A23626R215j5274p1559o545K1396J6471k4096j9938L005K7634J6702j29J3853
$$ 123626 132841 117567 46008 39463 60859 77330 53234 33296 36301 63935 80637 80508 94361
8909I4361K113j6367j4609j6714j1247l5J5940r067k1391q968l672J3917J0245
$$ 94361 96474 80107 65498 48784 37537 37502 53442 44375 22984 14016 10344 24261 34506
8896C4506J4377L2837L7806R323J1622j7096J2810l5739J1967L0894j9266k457
$$ 34506 48883 81720 119526 128849 140471 123375 136185 100446 112413 143307 124041 121584
8884A21584l7728R776L1541O217J457k477j6641N810J7740j029j4944J934J3060
$$ 121584 83856 93632 125173 131390 132847 130370 113729 119539 137279 136250 121306 123240 136300
8871A36300j42J1267m1460k4038R080q95J984n998j416p661l0792L2044K2704
$$ 136300 136158 147425 105965 81927 91007 90112 92096 86098 84682 77021 46229 78273 100977
8858A00977m049m732K6318N953Q009j6240l3027M812N395n514q651J7523J5173
$$ 100977 96928 92196 118514 124467 132476 116236 83209 88021 93416 87902 79251 96774 111947
8845A11947K533j3897k0343p3K2316N863l3629l7725k2427K5890K2864N896K5000
$$ 111947 114480 100583 80240 80167 102483 108346 74717 36992 14565 40455 63319 69215 94215
8832I4215M0776K5580p238o6223j7760j0673Q238J856j220R74j4802m030l044
$$ 94215 134991 160571 153333 87110 69350 58677 66915 68771 67551 68525 53723 49693 46649
8819D6649J1472L646m6424L879J5834M805M606J2817q390j617l126M0137K7162
$$ 46649 58121 61767 15343 19222 35056 39861 44467 57284 48894 47277 44151 84288 111450
8806A11450k1694j8464j9050P545J5872q516j2240j7850j7586n966J4876M607
$$ 111450 89756 71292 52242 59787 75659 67143 54903 37053 19467 13501 28377 32984
8794C2984P061m940K3209K1865j2326p242J2373K64l0261j1089J3617L631r907
$$ 32984 40045 35105 58314 80179 67853 60611 72984 73248 42987 31898 45515 49146 39239
8781C9239o728M590M0007Q320j9780J0261n041l726o05J704l077L861j4865j9891
$$ 39239 32511 37101 77108 85428 65648 75909 70868 67142 66537 68241 65164 69025 54160 34269
8767C4269n763m0R253N524M978M715o292l4113r065M8503L9073l7401r452R268
$$ 34269 28506 28466 37719 43243 48221 52936 46644 12531 3466 51969 91042 53641 44189 53457
8753E3457J8873K770k4718k0670J0566K3761L7872R937m570m6498k2738L8312
$$ 53457 72330 75100 50382 29712 40278 64039 101911 111848 107278 60780 38042 76354
8741G6354K7401j4944p09J6631m1418m0293j0982L2072O491K3692M798j3391p34
$$ 76354 103755 88811 88102 104733 63315 23022 12040 44112 50603 74295 79093 65702 64968
8728F4968J0247l285L659j8126J620j4912j3992j0152J3318J0072j2411q696j5867
$$ 64968 75215 71930 75589 57463 59083 44171 30179 20027 33345 43417 31006 22310 6443
8715F443K7403J4224j9637n554L428l008J216J1502M2503L1223p982m002k746
$$ 6443 33846 48070 28433 22879 26307 23299 24515 36017 78520 109743 101761 97759 95013
8702I5013O836P918K258j6816k1791K036q058O417N4r354o982J3707J3154L2806
$$ 95013 101849 109767 112025 95209 73418 75454 67396 73813 73867 64513 57531 71238 84392 117198
8688A17198J8350k321l3149k96j7019K4044J6303k945k3988q947J909J027l0345
$$ 117198 135548 133227 100078 99782 82763 106807 123110 120165 96177 87230 89139 90166 59821
8675E9821m426J0896p7M591J1544M118j0398l475O474N96o449J103r346K893q009
$$ 59821 55395 66291 66214 70805 82349 86467 76069 72594 79068 79664 73215 74318 64972 67865 59856
8660E9856p096J0474n483j7258j5955N3409L5006k3609j3706j2973J168r152n279
$$ 59856 52760 63234 57751 40493 24538 77947 112953 89344 75638 62665 63833 54681 49402
8647D9402M806J9591P408J6432L0019K8382O510r68K6014J6646j5885j0122J206
$$ 49402 54208 73799 81207 97639 127658 156040 162550 161582 187596 204242 188357 178235 179441
8634A79441j3255k7134N573q744o483L575j8214J4997n370o746J6510J8583P021
$$ 179441 166186 139052 144625 135881 129398 132973 114759 129756 124386 117640 134150 152733 159754
8621A59754k8723j4851J3436K3322j2145N434j4232n8362j7684P413l579j9326
$$ 159754 131031 116180 129616 152938 140793 146227 131995 73633 55949 63362 59783 40457
8609D0457K595K4636k69P797L2206m069k1520j9266n016j5066R954P954J8572
$$ 40457 43052 67688 67419 75216 107422 103353 81833 62567 57551 42485 52439 60393 78965
8596G8965M261m086O073N954J5007O139j3388q347k3385k1400k1129k532L5181
$$ 78965 83226 79140 85213 91167 106174 112313 98925 90578 67193 45793 24664 22132 57313
8583E7313J8134M280J1924J505j6028l140P574J6404N571J1549K717j0361k7914
$$ 57313 75447 79727 91651 93156 77128 73988 81562 97966 103537 115086 117803 107442 79528
8570G9528k2751o531k081n170p262j2335R08J8061K4739k9220j0598J9982J7964
$$ 79528 56777 50246 48165 42995 35733 23398 24306 42367 67106 37886 27288 47270 65234
8557F5234M138M829j5846M883M2520m47j5604j5059L3945k8211k0515N091L3242
$$ 65234 69372 74201 58355 63238 105758 105311 89707 74648 108593 80382 59867 64958 98200
8544I8200j0306j5141j3071q983K626M583k7179j3640K1629j1577J7793K6592
$$ 98200 87894 72753 59682 50699 53325 57908 30729 17089 38718 27141 44934 71526
8532G1526n00m137J7425J1198K9082q664k9444k4015j1864N123K3614m199l1425
$$ 71526 71026 66889 84314 95512 124594 115930 86486 62471 50607 55730 79344 75145 43720
8519D3720k2545M548L1987l281K464r407Q997K3582o383O895Q372k9574k0460
$$ 43720 21175 25723 57710 54429 56893 47486 56483 80065 73682 80577 88949 59375 38915
8506C8915J2553J7641j3693J2332J0607j2480J6736p530k053K7249M627j8334
$$ 38915 51468 69109 55416 67748 78355 65875 82611 75081 73028 100277 104904 86570
8494H6570j8625l5584j2330K6883q868k0108Q369j0013n604J0106j0220k6230
$$ 86570 67945 32361 20031 46914 38046 17938 26307 16294 10690 20796 10576 -15654
8482a5654J9931K427K9482N651j5204k5147k2936J2321M5676K5665q836j8838
$$ -15654 4277 6704 36186 41837 26633 1486 -21450 -9129 36547 62212 53376 34538
8470C4538j3154j454K938K1693m091K865M868O13j4780O428j3921M719j576l2754
$$ 34538 21384 19930 22868 44561 40470 43335 48203 48816 34036 40464 26543 31262 29686 -3068
8456c068j8859K6598M2991J7841M155J9478j4518j6345K69K9102k0179k9797l7683
$$ -3068 -21927 4671 47662 65503 69658 89136 74618 58273 58542 87644 67465 37668 -15
8443a5p0L6699J9062J68k7339j1920j0224J2927r187Q427J6160M0508J5594l103
$$ -15 -85 36614 55676 55844 28505 16585 6361 19288 10101 18528 34688 75196 90790 87687
8429H7687j4362q221n867j3606l591J2994k9228j5619k163j0811K0982J6055k1220
$$ 87687 73325 65104 59237 45631 42040 55034 25806 10187 8024 -2787 18195 34250 13030
8416A3030L33J9533K4553J4280J093L100O970k4330k3822k2665M97J6657P218
$$ 13030 13363 32896 57449 71729 72822 75922 82892 58562 34740 12075 12572 29229 36447
8403C6447p616n547L291K0995J711P148K2194J7075j0061j3313k0415Q170j4486
$$ 36447 28831 23284 26575 47570 49281 56429 78623 95698 85637 72324 51909 60079 45593
8390D5593j6494j0100N267l447K2825R677j9727K08J366j2295l1324K1055K1028
$$ 45593 29099 18999 24266 20819 43644 53321 33594 33802 35168 22873 -8451 12604 33632
8377C3632K858j5733k2453k6075M652L1588L3410Q698l1852j4280m097J8293J3349
$$ 33632 36490 20757 -1696 -27771 -23119 8469 41879 50577 18725 4445 348 18641 31990
8364C1990J7898j991j5008l0753j6621J5364J8365J3137O94j7434J5517M8346
$$ 31990 49888 47897 32889 2136 -14485 879 19244 32381 33075 15641 31158 79504
8352G9504j0383j5406K3051J6889J629j3825n2962l9493j0814N593J6824J8210
$$ 79504 69121 53715 76766 93655 95284 81459 28497 -10996 -21810 -16217 607 18817
8340A8817n342j6827p539K2485M197o321j8469M1408K2366j3169j5196J549j5059
$$ 18817 13475 -3352 -10891 11594 15791 9470 -8999 32409 54775 41606 26410 27959 12900
8327A2900J3176K036l266N348p448j1774K675j217L1079J584j5441l3268l0717
$$ 12900 26076 28112 24846 30194 22746 10972 13647 12430 43509 45093 29652 -3616 -34333
8314c4333Q388J8341P399k211L791K6201j967R793l59J5683r12j5528j914j344
$$ -34333 -25945 -7604 -205 -2416 1375 27576 25609 35402 35043 50726 49814 34286 32372 31028
8300C1028k8118k0476J0555J7010L988j2287M089L0792K5109J328l4910k2579
$$ 31028 2910 -17566 -7011 9999 13987 1700 5789 36581 61690 63018 28108 5529
8288E529L4914J8008L483j0513L5997J5884k0000n0379j3086J4745N164N5099
$$ 5529 40443 58451 61934 51421 87418 103302 83302 32923 19837 34582 39746 94845
8276I4845K390o929m628j7474j9610k9244K503m690K6175K9798j3478q542j3321
$$ 94845 97235 90306 85678 68204 48594 19350 21853 17163 43338 73136 59658 51116 37795
8263C7795J1560K1451o729k8619R921J5254Q098k963j4200j9421j2533K6057J0968
$$ 37795 49355 70806 64077 35458 45379 60633 68731 65768 51568 32147 19614 45671 56639
8250E6639o865j4727k252P074j9247K5668K0688K044J6499L3427R821l0274q367
$$ 56639 49774 35047 32795 39869 20622 46290 66978 69022 85521 118948 128769 98495 90128
8237I0128j7743k3480M035K480K915J8135J6398R904j6618l3890J0096N342n460
$$ 90128 72385 48905 52940 55420 58335 76470 92868 102772 86154 52264 62360 67702 62242
8224F2242l6565J1699j0027j3401P522J7081m241K1171J0352l016l8918r786L5838
$$ 62242 25677 37376 27349 13948 21470 38551 34310 55481 65833 62817 23899 14113 49951
8211D9951L1343k4526k2798Q3N731N623k0081n378L4402l836j4473k5255L094
$$ 49951 81294 56768 33970 34053 39784 45407 25326 19948 54350 50514 36041 10786 13880
8198A3880J2195j5724o897J7632R030K124j0891K365K0786k409j9004J9653J5341
$$ 13880 26075 10351 3454 21086 30116 32240 21349 23714 44500 42091 23087 42740 58081
8185E8081N689k0568j0994N868L1228k2653q224Q629k4649L0683J116k3979M4081
$$ 58081 63770 43202 32208 38076 69304 46651 38427 47056 22407 53090 54206 30227 74308
8172G4308J8770j2403m1411k3393l394J1663J4676N74m513l833k0434k7950K2185
$$ 74308 93078 80675 39264 15871 12477 24140 38816 39390 34877 31044 10610 -17340 4845
8159D845K2598k1012J9714J9589J3910l1945k0709K4926Q680j5721j0901R780
$$ 4845 27443 6431 26145 45734 59644 27699 6990 31916 40596 24875 13974 23754
8147B3754O829k6902l884k491j059j8181J7132J0260o945o842N366K4395j9824
$$ 23754 30583 3681 -203 -2694 -3753 -21934 -4802 5458 -1487 -8329 -2963 21432 1608
8134A608O836K1269J7308K381L78q8l3126k1529L2837K3113j1417R982J2763n59
$$ 1608 8444 29713 47021 49402 49780 49692 16566 -4963 27874 50987 39570 49552 62315 61756
8120F1756m4857l5504L288l607k640J8672R996m917r297J5753K8567j8214Po25
$$ 61756 16899 -18605 -15317 -18924 -21564 -2892 7104 2187 -7110 8643 37210 18996 19003 18378
8106A8378J337K4981R626L426Q985J3301n780l4660k3805j6494O481J7209k3534
$$ 18378 19715 44696 54322 57748 66733 80034 74254 39594 15789 -705 5776 22985 -549
8093e49J4948J5388n574L859J2067J133N173M981n201K31J0450j542j0548r11
$$ -549 14399 29787 24213 28072 40139 41272 46445 51426 46225 46456 56906 55364 44816 43905
8079D3905k4114p115L945L959R583k489j3138Q185K8952j1855k7388K3135Q587
$$ 43905 19791 12676 16621 20580 30163 27674 14536 22721 51673 39818 12430 35565 44152
8066D4152j8666q785l834q910j1071j7090k5114K1059L7222r776O219K2802O135
$$ 44152 25486 16701 12867 3957 -7114 -24204 -49318 -28259 8963 -813 5406 28208 34343
8053C4343r059Q744m951n88J125O432J3635J008l8046l3912K1989M5793N973l064
$$ 34343 25284 34028 29077 28489 29614 36046 49681 50689 12643 -21269 720 46513 52486 49422
8039D9422J3230k2063l018m779l0532J523J7407K2786o07J3510J0871k7929J3758
$$ 49422 62652 40589 37571 32792 2260 3783 21190 43976 43369 56879 67750 39821 53579
8026E3579J4118K352j1201j7523J3467N793j3282k1800j174j4978j341L3023J6389
$$ 53579 67697 70049 58848 41325 54792 60585 47303 25503 24329 9351 8010 41033 57422
8013E7422R158J832K339q769j9424l192J0576J4141n222N776o597J1807K967M26
$$ 57422 66580 68412 70751 61982 42558 39366 49942 64083 58861 64637 58040 69847 72814 73240
7999G3240K805m413l4212k9486J4486J5630p620J5791k7190l6069J4500L1149
$$ 73240 76045 71632 37420 7934 22420 38050 30430 46221 19031 -17038 -2538 28611
7987B8611K9214L1781n860j6212k1270j8587l551m590R826J7847j1034j20j803
$$ 28611 57825 89606 83746 67534 46264 27677 24126 19536 29362 47209 36175 36055 34252
7974C4252j5269K1275N004m14J4140K3144O69L902M457k2323j3803r954n021R382
$$ 34252 18983 40258 45262 44848 58988 82132 82801 86703 91160 68837 55034 45080 40059 49441
7960D9441J1541O473l974m408K3595J763j8465R034J1495K882j036j0817j0346
$$ 49441 60982 67455 63481 59073 82668 84431 65966 75000 86495 89377 88341 77524 67178
7947F7178k1541p278j64P980q155J4235K0428P440l1149j1701Q403K5824o728
$$ 67178 45637 38359 38195 46175 38020 52255 72683 80123 48974 37273 45676 71500 64772
7934F4772j2291L552j4318r483J1935J3643p603l8118m317Q375J2387P533j3941
$$ 64772 52481 56033 41715 32232 44167 57810 50207 12089 7772 16147 28534 36067 22126
7921B2126j5513j3061K0539L3162J3102j1994R832l907j539j4148k006r09j2299
$$ 22126 6613 -6448 14091 47253 60355 48361 58193 54286 52747 38599 36593 35684 23385
7908B3385j6553j1121O362j645o133l53m376J5241K3221K5669J2425j4247k3124
$$ 23385 6832 -4289 2073 428 -5705 -6058 -10434 4807 28028 53697 66122 51875 28751
7895B8751K403p62k484K6767J5702J9621l6077k8591p228r60M91K5532j54j672
$$ 28751 31154 30392 27908 54675 70377 89998 53921 25330 18102 17142 17633 43165 43011 41339
7881D1339m659M154q822j1977j2855j8428J4117R732m484L1867N874o364J2220
$$ 41339 36680 40834 32012 20035 7180 -11248 2869 12601 8117 39984 45858 39494 51714
7868E1714r49m616j112j2269q468j0128j4731k4085K6588J6583j4941K0984K2074
$$ 51714 50765 46149 45037 32768 24300 14172 -559 -24644 1944 18527 3586 24570 46644
7855D6644P845J6798j9086l0613k6709j5229K5363N0721m976l169Q323J0022j3813
$$ 46644 54489 71287 52201 21588 -5121 -20350 5013 55734 50758 47589 55912 65934 52121
7842E2121j9113k253o469j2903j5778J013Q007P784J0772j6743j6266K333J5290
$$ 52121 33008 30755 24286 11383 -4395 -3382 4625 12409 23181 6438 -9828 -7495 7795
7829G795j3982O025L703J7676j2721l0189R281K1373j2782J517k4772j3676q900
$$ 7795 -6187 -162 3541 21217 8496 -21693 -12412 8961 -3821 -2304 -27076 -40752 -49652
7816d9652J7523J8369J5863J0634J9261k0108j9964K7377M490j9450l0262O955
$$ -49652 -32129 -13760 2103 12737 31998 11890 -8074 19303 23793 4343 -25919 -18964
7804a8964M3454K2998k8576n1000j4239J6906K7983J8657j9665j287K3655k0425
$$ -18964 24490 47488 18912 -32088 -46327 -29421 -1438 17219 -2446 -3733 19922 -503
7792e03m200o854N173K3411J9849K3966K1058j6050k2020j265O658k74N585K3587
$$ -503 -4703 -11557 -6384 17027 36876 60842 81900 65850 43830 42565 49223 48949 54534 78121
7778G8121k7820k0802l1282j9387N64K0819j2481P999J9069L4182J4075j816k461
$$ 78121 50301 29499 -1783 -21170 -20606 213 -12268 -4269 14800 48982 63057 61241 58780
7765E8780j7427q055o850l3328p333P254J3168K0735j1880l703J3386l5180k7157
$$ 58780 41353 33298 26448 -6880 -14213 -6959 6209 26944 15064 11361 24747 -10433 -37590
7752c7590n124K3159k626l235J0706O73L6773K4228q534j5771r877J2154J1184
$$ -37590 -42714 -19555 -22181 -25416 -14710 -14037 22736 46964 38430 22659 12782 24936 36120
7739C6120j1106J2845Q538j6095k3707j5350o039j1229j6608K9833J6530j999
$$ 36120 25014 37859 46397 30302 6595 -8755 -14794 -26023 -42631 -12798 3732 1733
7727A733j4953Q603L1818K1859l1593j0818J73q947J1793q388j011O39q539J1942
$$ 1733 -13220 -4617 27201 49060 17467 6649 6822 -2125 9668 1280 269 908 -7631 4311
7713D311j3206J3664J4677j6880j8067j2384K4008R353k5666P681L8498P699K7849
$$ 4311 -8895 4769 19446 2566 -15501 -27885 -3877 5476 -20190 -12509 25989 33688 61537
7700F1537q55k9293j7315j9104k4831j4543J6627M0444L4621p275k8424k8298
$$ 61537 60682 31389 14074 -5030 -29861 -44404 -27777 12667 47288 40013 11589 -16709
7688a6709j687M284p224j0949K0504K2046j1614m725j3566j4742J2168L3489J088
$$ -16709 -18396 -14112 -21336 -32285 -11781 10265 -1349 -6074 -19640 -34382 -22214 11275 12363
7675A2363l0196L59j6962q968M827j141R514j877j2421L016K4971K2295k3084
$$ 12363 -17833 -17474 -34436 -43404 -38577 -39718 -30204 -32081 -44502 -41486 -16515 5780 -17304
7662a7304l44n414Q055n120J0422j3708j5657R883L3709N283k951j4245o485j8512
$$ -17304 -17648 -23062 -15007 -20127 -9705 -23413 -39070 -29187 4522 9805 6854 -7391 -13876 -32388
7648c2388J1402o468j2107L6125J9409N412J0190P041P84k9301k2263Q478O507
$$ -32388 -20986 -27454 -39561 -3436 15973 21385 31575 38616 39400 10099 -12164 -3686 2821
7635B821j4934j8897J1990R921O017N247K1810Q670j4363k1721P360P202P708
$$ 2821 -12113 -31010 -19020 -9099 -3082 2165 23975 32645 18282 -3439 3921 11123 18831
7622A8831O21J6224Q820j8341j4970K281m6131O950J1936Q927J5867N586Q346
$$ 18831 19452 35676 44496 26155 11185 13466 -32665 -25715 -13779 -4852 11015 16601 24947
7609B4947k2992j7625n427n036K373Q527j1036J5444J894J3383L652K918J298
$$ 24947 1955 -15670 -21097 -26133 -23760 -15233 -26269 -10825 -8931 4452 8104 11022 12320
7596A2320k0923K0729p920j7816j1717m692Q679K5509L0199r274k0631o96N805
$$ 12320 -8603 12126 4206 -13610 -25327 -30019 -21340 4169 34368 25094 4463 3767 9572
7583I572j327K224k1715Q632l773m492M5598K458j6386K828k1180n809K5360K2414
$$ 9572 8245 10469 -11246 -2614 -6387 -10879 34719 37177 20791 23619 2439 -3370 21990 44404
7569D4404J0693j6270l3840k3942p581Q526J4420J1388l047L1077O612k8577K2297
$$ 44404 55097 38827 4987 -18955 -26536 -18010 -3590 7798 4751 35828 42440 13863 36160
7556C6160K0703k0582k2961k70O366R450J5358k8843l6914K683M6668K8874l2984
$$ 36160 56863 36281 13320 13050 19416 28866 44224 15381 -21533 -18850 27818 56692 23708
7543B3708N862n053k2558K0178K3908M57p393l8801j7098J3137J2299l500M138
$$ 23708 29570 24517 1959 22137 46045 46502 39109 308 -16790 -3653 8646 5146 9284
7530I284L73P60J9548M015r849k6423k1893J1123J5586K5264O074o800l166J3188
$$ 9284 9657 10417 29965 33980 24131 -2292 -24185 -13062 2524 27788 33862 27062 23896 37084
7516C7084J5653n6954j2133J3569n862J2481J2959J2435o767P976K9340P714J0596
$$ 37084 52737 -4217 -16350 -2781 -8643 3838 16797 29232 22465 30441 59781 67495 78091
7503G8091k3537k2791L34q672j327K2091J7835o120j530j0451k3154k6216P505
$$ 78091 54554 31763 32097 23425 22098 44189 62024 55904 54374 43923 20769 -5447 2058
7490B058L3406J1756M345k448m499j9641j9531N840J9334l0651L681J2712o927
$$ 2058 35464 47220 51565 49117 44618 24977 5446 11286 30620 -31 3650 16362 9435
7477I435R735m578L954O356j7589M500j6808k2531k4341r631J7612M1911N5840
$$ 9435 19170 14592 18546 24902 7313 11813 -4995 -27526 -51867 -61498 -43886 -1975 53865
7464E3865P846l9622r018J885j1267P635r925j3913j0408N269N750P063j4179
$$ 53865 61711 22089 13071 14956 3689 11324 1399 -12514 -22922 -17653 -11903 -4840 -19019
7451a9019k334J5177P310l596r243m328o281K727L4438N259r716j596K565j0462
$$ -19019 -21353 -6176 1134 -2462 -11705 -16033 -22314 -19587 14851 20110 10394 8798 11363 901
7437I01m108J2656o982k0193J9073L9142j0025j0828Q174J266j6376r920m317
$$ 901 -3207 9449 2467 -17726 1347 40489 30464 19636 27810 29076 12700 2780 -1537
7424a537j2205k2819j86K5136K471J7671K778j2447O874j4823j9145j0338P993
$$ -1537 -13742 -36561 -36747 -11611 -9140 8531 11309 -1138 5736 -9087 -28232 -38570 -30577
7411c0577L1661J6537N739J1388L5247J109l1105k3115k4044J299J9412j8724
$$ -30577 1084 17621 23360 34748 69995 71104 39999 16884 -7160 -5861 13551 -5173
7399e173J8963L8143m774j5495j9972r725J3478j7725m001P195j5362j566j067
$$ -5173 13790 51933 47159 31664 11692 1967 15445 -2280 -6281 914 -14448 -16014 -17081
7386a7081k130J3393l933K0960k315K5968M9763J3021k4228k9812l517j0356j0740
$$ -17081 -19211 -5818 -9751 11209 8894 34862 84625 97646 73418 43606 40089 29733 18993
7373A8993R965J740k33r398k023M024M190j7112r616l113k0843l1429K2361K5639
$$ 18993 28958 30698 30465 21067 19044 23068 27258 10146 530 -2583 -23426 -54855 -32494 -6855
7359f855O560o014R105k4566p413j5089M093Q250J8080J4054N2583J4420m7118
$$ -6855 -295 -6309 2796 -21770 -29183 -44272 -40179 -31929 -13849 205 52788 67208 20090
7346B0090k116J2896J3468N415J0349O546j4251k4307r060j3599J068K2545r127
$$ 20090 17974 30870 44338 49753 60102 66648 52397 28090 19030 5431 6499 29044 19917
7333A9917k5262L4660o973k7067j1332J4841L719K7160L757r619J876J5054j0612
$$ 19917 -5345 29315 22342 -4725 -16057 -1216 2503 29663 33420 23801 25677 40731 30119
7320C0119j686K537K7875L322q118k4131k1148P756J6073O557r403k9072k8027
$$ 30119 28433 30970 58845 62167 54049 29918 8770 16526 32599 39156 29753 681 -27346
7307b7346K0842L18J2102J6175J3887O789l0583l1672n237r709N144J4282N954
$$ -27346 -6504 -6186 5916 22091 35978 42767 12184 -19488 -24725 -34434 -29290 -15008 -9054
7294i054J2139k689n313J4714K8058j465k0140q091j2287R229O731Q252j867R9
$$ -9054 3085 396 -4917 9797 37855 36390 16250 8159 -4128 5101 11832 20084 18217 18316
7280A8316j5823P669J9803j5569k6830J4606L4417P7m4917l076J7266l0939J191
$$ 18316 2493 10162 29965 14396 -12434 2172 36589 36666 -8251 -11327 5939 -25000 -23809
7267b3809J866K3438J8079k2690L623J0390K508j6271n185O593J1530J0993k0475
$$ -23809 -21943 1495 19574 -3116 507 10897 13405 -2866 -8051 -1458 10072 21065 590
7254E90l722o754K7606J3136j2263q237J4505L7732Q788k3347k8684J4441m557
$$ 590 -3132 -9886 17720 30856 18593 10356 24861 62593 71381 48034 19350 33791 29234
7241B9234l8529k035r346l0994K6560N7390M696j517M967M93j3834j3277N922
$$ 29234 -9295 -11330 -20676 -51670 -25110 32280 36976 35459 40426 40919 27085 13808 19730
7228A9730M32m0854J1166P723J2476N602J8841K0529r854R20j9080Q295O355k3823
$$ 19730 20162 -20692 -9526 -1803 10673 16275 35116 55645 45791 46711 27631 35926 42281 18458
7214A8458k6939J9771O632j9294k9576j3558r443l084N021K0245J8670L785K0536
$$ 18458 -8481 11290 17922 -1372 -30948 -44506 -53949 -57033 -52012 -31767 -13097 -9312 11224
7201A1224j8411m1402m466r443J2512L8432J3209k5643j6637J2869N551J2401
$$ 11224 -7187 -48589 -53055 -62498 -49986 -11554 1655 -23988 -40625 -27756 -22205 -9804
7189i804j8747k9769J8410K2681j9008Q981J1270O329J0127J8180j8849r127J3078
$$ -9804 -28551 -58320 -39910 -17229 -36237 -27256 -15986 -9657 470 18650 -199 -9326 3752
7176C752j1123r688K1870j594K2888n830j4645k4964j7768o147K8366R488o382
$$ 3752 -7371 -17059 4811 3217 26105 20275 5630 -19334 -37102 -43249 -14883 -5395 -11777
7163a1777j750j5899m891m604p14K4617M48Q764J4850J1121L287o60m404j1780
$$ -11777 -13527 -29426 -34317 -38921 -39635 -15018 -14570 -5806 9044 20165 23452 22792 18388 6608
7149F608N591L869l061L1198M100q4K198r032N271l8868l6982k2918J0015J5858
$$ 6608 12199 16068 13007 44205 48305 48221 50419 41387 46658 7790 -29192 -52110 -42095 -26237
7135b6237j9979j0217R956K8817j6130M424N602m974K377j112O292K5203J491
$$ -26237 -46216 -56433 -46477 -17660 -33790 -29366 -23764 -28738 -26361 -27473 -21181 4022 5513
7122E513O951j8798k7809L071M263L2637K2164r588q170j5720l575j198K0146
$$ 5513 12464 -6334 -34143 -31072 -26809 5828 27992 18404 10234 -5486 -9061 -10259 9887
7109I887L738p274M321l749j9896J195L707q332j7675M1776J1394l7983J6206
$$ 9887 13625 6351 10672 6923 -12973 -11778 -8071 -16403 -34078 7698 19092 -18891 -2685
7096b685l965J3139J4190M061K1492K4930k0558l5000j2079j5693j3851j1551
$$ -2685 -6650 6489 20679 24740 46232 71162 50604 15604 3525 -12168 -26019 -37570
7084c7570j995L1450R743j4100j5952r697J6243L5815R235M031p570J3402O884
$$ -37570 -39565 -8115 1628 -12472 -28424 -38121 -21878 13937 23172 27203 19633 33035 39919
7071C9919l6838j1450p285L2367L548l0839j0555R016J5369Q263k228j202R909
$$ 39919 3081 -8369 -15654 16713 20261 -10578 -21133 -12117 3252 11515 9287 8085 17994
7058A7994j6192j0240j8093n738K907J1725J6954l722J7733K0638P119j3083k3798
$$ 17994 1802 -8438 -26531 -32269 -29362 -17637 -683 -4405 13328 33966 41085 28002 4204
7045D204k6315q491k6939J8645N452L732J8909k285k1230n089q70J8705J1084
$$ 4204 -22111 -30602 -57541 -38896 -33444 -29712 -10803 -13088 -34318 -39407 -40277 -21572 -10488
7032a0488J0008N593L3935L61o974j2391n308O738r96j2255q006k6500M57M773
$$ -10488 -480 5113 39048 39409 32435 20044 14736 21474 20478 8223 217 -26283 -25826 -21053
7018b1053K8976M4624J0826j8268j7086P878p332k8157j495P394K6296k4755L393
$$ -21053 7923 52547 63373 45105 28019 35897 28565 408 -1087 6307 32603 7848 11241
7005A1241K4590j8036k6550j1230k084N654K547j8118J04q039l978J3889K2285
$$ 11241 35831 17795 -8755 -19985 -22069 -16415 -13868 -31986 -31882 -39921 -43899 -30010 -7725
6992g725O648q84j5911l1960m356L822J5869K9359j0578j453p592k0391K7400
$$ -7725 -1077 -1961 -17872 -49832 -54188 -50366 -34497 -5138 -15716 -17169 -24761 -45152 -17752
6979a7752K9712j9870j7299J3974j9262l6260m052M714L4950L7054p801k7385
$$ -17752 11960 -7910 -25209 -11235 -30497 -66757 -70809 -66095 -31145 5909 -1892 -29277
6967b9277q936J4084K340K8637k1045m927J423M5497K3561j1488l1194J2677J6330
$$ -29277 -38213 -24129 -21789 6848 -14197 -19124 -17701 27796 51357 39869 8675 21352 37682
6954C7682k9369k5941N681J628p224j225J2851J5886p180j0835K806J1640l8779
$$ 37682 8313 -17628 -11947 -10319 -17543 -18768 -5917 9969 2789 -8046 -5240 6400 -32379
6941c2379l1265J029L4869k208r368l415j1622j0584J9863J6960J8061P752p211
$$ -32379 -63644 -62615 -27746 -29954 -39322 -42737 -54359 -64943 -45080 -28120 -10059 -2307 -9518
6928i518P063L911K792K673j4163N198j2005n76J0601J7297J3449j1592r779J200
$$ -9518 -2455 1456 4248 6921 -7242 -2044 -14049 -14625 -4024 13273 26722 15130 5351 6551
6914F551J4141J2457J1686p712j993j1230j2281q928r46J0450j4852M695L719
$$ 6551 20692 33149 44835 37123 35130 23900 11619 2691 1745 12195 -2657 2038 5757
6901E757j069j8819k8474J1034L2001L9056J8891k4155k7041O147P12j3145j3075
$$ 5757 4688 -14131 -42605 -31571 430 39486 58377 34222 7181 13328 14040 895 -12180
6888a2180Q657j5170O158J0810P958r452J6105j0626l338J0308j1065k1740k741
$$ -12180 -3523 -18693 -12535 -1725 6233 -3219 12886 2260 -1078 9230 -1835 -23575 -26316
6875b6316P496O328K6272n859k0310K1957n126k5947J2608J486K90l968M849M426
$$ -26316 -18820 -12492 13780 7921 -12389 9568 4442 -21505 -8897 -7411 -7121 -11089 -6240 -1814
6861a814N148L283k19R28o509J1274L892j0559J400L997J9164J1935k388j0694
$$ -1814 3334 6617 6398 7326 817 12091 15983 5424 6824 10821 29985 41920 39532 28838
6847B8838p771m642J7611j8175j1509J6862Q509O372l033l0319r407J1179L824
$$ 28838 21067 16425 34036 15861 4352 21214 29723 36095 33062 2743 -6664 4515 8339
6834H339j8150r207n3K9249J1040j0748m6401j2372J1658K3955l889j0458J4614
$$ 8339 -9811 -19018 -19071 10178 21218 10470 -35931 -48303 -36645 -12690 -16579 -27037 -12423
6821a2423R227k0773j6211R92J4495M322n411O965K745J3108K5452j8623M604
$$ -12423 -3196 -23969 -40180 -39188 -24693 -20371 -25782 -18817 -16072 -2964 22488 3865 8469
6808H469j5398J6655M275r174p594o535J4354J434k2618p514M2183R248p700j3740
$$ 8469 -6929 9726 14001 4827 -2767 -9302 5052 6486 -16132 -23646 18537 27785 20085 6345
6794F345j3448j1647K5018j3708j9385L3289Q49M663P43M206r415j1586k4115
$$ 6345 -7103 -18750 6268 -7440 -26825 6464 7313 11976 12719 16925 7510 -4076 -28191
6781b8191N482K8791J0084J1787Q263k3937q174R3j209P054J5890O105q939k9644
$$ -28191 -22709 6082 16166 27953 36216 12279 4105 4198 2989 10043 25933 32038 23099 -6545
6767f545k604q344j8608K9359L6381R55N921J1621L2702r6n592j743j0319j0791
$$ -6545 -9149 -17493 -36101 -6742 29639 30594 36515 48136 80838 80742 75150 73407 63088 52297
6753E2297r282j0355j5390J0194N843l596j4445M44K5455J501k2075l1878l0962
$$ 52297 43015 32660 17270 27464 33307 29711 15266 15710 41165 42666 20591 -11287 -42249
6740d2249O975K5123J7664l1455j3806Q548r655J1681K1886j961l1545j0891J8988
$$ -42249 -35274 -10151 7513 -23942 -37748 -29200 -38855 -27174 -5288 -7249 -38794 -49685 -30697
6727c0697K4651L2744N673l450j465j7415O180Q123K376j9319k3404k644K9282
$$ -30697 -6046 26698 32371 28921 27456 10041 16221 24344 26720 7401 -16003 -18647 10635
6714A0635p120n951j0004k566J2577K397M672k2120l0260O510N430K518Q518J8650
$$ 10635 3515 -2436 -12440 -15006 -2429 -32 4640 -17480 -47740 -41230 -35800 -33282 -24764 -6114
6700f114J6934K9491M263k0609j2531j411K184k0146m4468J3545K0532J6719O474
$$ -6114 10820 40311 44574 23965 11434 10023 12207 -7939 -52407 -38862 -18330 -1611 4863
6687D863J2319L265K4688k9688k3262j4198K442N097k5202k8401J7345J5344J0253
$$ 4863 17182 20447 45135 15447 -7815 -22013 -19571 -14474 -39676 -68077 -50732 -35388 -25135
6674b5135K5582R970j2444K9184m632m9634j4627J6473p090j2745k332N944J003
$$ -25135 447 10417 -2027 27157 22525 -27109 -41736 -25263 -32353 -45098 -47430 -41486 -40483
6661d0483L2729K4683k0597K8864k512j2818R474K0741K91n0927m7217J9615L1143
$$ -40483 -7754 16929 -3668 25196 22684 9866 19340 40081 40372 -10555 -57772 -38157 -7014
6648g014k0109j1048R264J203j772p426j4917j3025L025L0586K991J3141J4068
$$ -7014 -27123 -38171 -28907 -27704 -29476 -36902 -51819 -64844 -61819 -31233 -28242 -15101 -1033
6635a033M003J4279J272k354k259j623M067l240k6861Q685L251L896p196j1000
$$ -1033 2970 17249 18521 16167 13908 12285 16352 13112 -13749 -5064 -1813 2083 -5113 -16113
6621a6113k599q350P863J7459N332K0382L46j8219K7451R29k4856j4028Q24L7927
$$ -16113 -18712 -27062 -19199 -1740 3592 23974 24320 6101 33552 34481 9625 -4403 -3579 34348
6607C4348m781m0883j3415k5393r427J3560J3125j8195j207K3896J0035j8947
$$ 34348 29567 -11316 -24731 -50124 -59551 -45991 -32866 -51061 -52268 -28372 -18337 -37284
6595c7284k6352q940q960L5780K0344J2133K4142j0420k058n529J5492J3597J9786
$$ -37284 -63636 -72576 -81536 -45756 -25412 -13279 10863 443 -1615 -7144 8348 21945 41731
6582D1731M275j2265p913L1581m690q142o325l4584k253J6236J8910k3808k9630
$$ 41731 46006 33741 25828 57409 52719 44577 38252 3668 1415 17651 36561 12753 -16877
6569a6877L324J3613p437l6777J1527J1149k1202J2930n39L924L5097M208j2212
$$ -16877 -13553 60 -7377 -44154 -32627 -21478 -42680 -29750 -30289 -26365 8732 12940 728
6556G28j4547J8066O214k2978l2137j5587K0525K9015j7447l8692K5554J4948
$$ 728 -13819 4247 10461 -12517 -44654 -60241 -39716 -10701 -28148 -66840 -41286 -26338
6544b6338q508k0092K0549R465P964J0206K30P81k0120r711m699q247L2909K1586
$$ -26338 -34846 -54938 -34389 -24924 -16960 -6754 -6524 -5743 -25863 -35574 -40273 -48520 -15611 5975
6530E975r887L9353K6054n6149j7218K8862Q240o532n665J2043k6418k2715L8221
$$ 5975 -3912 35441 61495 5346 -11872 16990 25230 18698 13033 25076 -1342 -24057 14164
6517A4164l277m3792k4787l100M2207K3239M74l1815m4869Q75Q380J3427K7482
$$ 14164 10887 -32905 -57692 -60792 -18585 4654 5128 -26687 -71556 -70681 -62301 -48874 -21392
6504b1392K9014k3985k8520K1322J1850r015K520M665K5603J7644n338k5578j2830
$$ -21392 7622 -16363 -44883 -23561 -11711 -20726 -18206 -13541 12062 29706 24368 -1210 -14040
6491a4040j0287J1884R019K0980n785Q878K91J1682N77N65l436j9970J4850j8251
$$ -14040 -24327 -12443 -3424 17556 11771 20649 20940 32622 33199 33764 30328 10358 25208 6957
6477F957k7703N948N672J3967j217l9759n589J7731L4661M991j5143k0090J669
$$ 6957 -20746 -14798 -9126 4841 3624 -36135 -41724 -23993 10668 15659 516 -19574 -17905
6464a7905Q13j7939O060K7763m22k0409m71J7419K0627o417l1436R900m818q575
$$ -17905 -17092 -35031 -28971 -1208 -1630 -22039 -22510 -5091 15536 9119 -22317 -12417 -17235 -25810
6450b5810j2487j1260O621Q234P673j412k0858J4614K6879J5576r269J2296l64
$$ -25810 -38297 -49557 -42936 -34702 -27029 -28441 -49299 -34685 -7806 7770 -1499 10797 10433
6437A0433k5333k1783k338O132J0323Q23j4512R790k7125j1196M1018L8657k1164
$$ 10433 -14900 -36683 -39021 -32889 -22566 -21743 -36255 -26465 -53590 -64786 -23768 14889 -6275
6424f275q38k9796j6601j1326O912J8389K1490M0510L9696J2000j7050m9309k5852
$$ -6275 -7113 -36909 -53510 -64836 -57924 -39535 -18045 22465 62161 74161 57111 7802 -18050
6411a8050K6786L1948L029j3639l8189j3634K2842R348k3004K2388L463l380o929
$$ -18050 8736 40684 43713 30074 -8115 -21749 1093 10441 -12563 9825 13288 9908 2979
6398B979J912j3195p647l432j2210m525J5200J5782j270J5551L229r593J0615
$$ 2979 4891 -8304 -15951 -19383 -31593 -36118 -20918 -5136 -6406 9145 12374 2781 13396
6385A3396j8802k3640J5613L2216K0940j9662l3623j1161j405p693J9630K1957
$$ 13396 -5406 -29046 -13433 18783 39723 20061 -13562 -24723 -26128 -33821 -14191 7766
6373G766j6617k9721k0904l387K9966R286j2961O880p22L0122J5188P316k4141
$$ 7766 -8851 -38572 -59476 -62863 -32897 -23611 -36572 -29692 -30414 -292 14896 22212 -1929
6360a929k8641O649m831q434K735N206j0593K1035o301m0293j3825L8714Q017
$$ -1929 -30570 -23921 -28752 -37186 -34451 -29245 -39838 -18803 -25104 -65397 -79222 -40508 -32491
6347c2491K9416K8397k3978l5962K312J8495K233K03P918j8610j931Q611J9003
$$ -32491 -3075 25322 1344 -34618 -32306 -13811 -11578 -11375 -3457 -22067 -23998 -15387 3616
6334C616j5915J761p332j737J8969J552j0366l1794J938J5542n851L3835K1500
$$ 3616 -12299 -10538 -17870 -19607 -638 914 -9452 -41246 -39308 -23766 -29617 4218 25718
6321B5718j7447k8162j4136p279R734J0855J7643J3150J6777L6083m06j6879K748
$$ 25718 8271 -19891 -34027 -41306 -31572 -20717 -3074 10076 26853 62936 62530 45651 48399
6308D8399m6695k1195K2197j115R58m918m362J5279l3465k150J1429P441k1479
$$ 48399 1704 -19491 2706 1591 2549 -2369 -6731 8548 -24917 -27067 -15638 -8197 -29676
6295b9676p121k216j015J1494K2582J6603k1821r521J7474K373K4373M820n29
$$ -29676 -36797 -39013 -40028 -28534 -5952 10651 -11170 -20691 -3217 -844 23529 28349 27820
6282B7820k5235o677N22R284R205M953j7988k0428L030N285j9623j8905L0591
$$ 27820 2585 -4092 -3570 5714 14919 19872 1884 -18544 -15514 -10229 -29852 -48757 -18166
6269a8166J6502K100O964M503J8484k5889k927n338k0558O534J997j1017K2241
$$ -18166 -1664 436 7400 11903 30387 4498 1571 -3767 -24325 -17791 -15794 -26811 -4570
6256d570J1249Q880J1823j6618j9214k335j4688K4842L3672n482j2652k1441O952
$$ -4570 6679 15559 27382 10764 -8450 -10785 -25473 -631 33041 27559 14907 -6534 418
6243D18L5241k5875j8463p160k3574j1796p222K230L2386j250L614M40J0686j0756
$$ 418 35659 9784 -8679 -15839 -39413 -51209 -58431 -56201 -23815 -25065 -21451 -21011 -10325 -21081
6229b1081l900n198m4497J4943N3023L1595j1980P827l966k5861l2229J6320K4130
$$ -21081 -24981 -30179 -74676 -59733 -6710 24885 12905 20732 16766 -9095 -41324 -25004 -874
6216h74M730m915j7121R660R125l866L120J3667j0861o051K016q981j988J6529
$$ -874 3856 -1059 -18180 -8520 605 -3261 -141 13526 2665 -3386 -1370 -10351 -12339 4190
6202D190m5060j6390J4143L4396J6387J30K8673O43j9390m8158j4250J1007l524
$$ 4190 -40870 -57260 -43117 -8721 7666 7796 36469 37112 17722 -30436 -44686 -33679 -37203
6189c7203j8208K8307O745j7277J8163K2947k9r28m032p491n774J7169j0079j7238
$$ -37203 -55411 -27104 -20359 -37636 -19473 3474 3445 2517 -1515 -9006 -14780 2389 -7690 -24928
6175b4928p679J4631j8305m521K7581J4550J4685J237k1933k2628j7872K3306
$$ -24928 -32607 -17976 -36281 -40802 -13221 1329 16014 17251 -4682 -27310 -45182 -21876
6163b1876J9248j296j3481Q911k8413R376K9720J31n623L111Q707R56j1544J578
$$ -21876 -2628 -3924 -17405 -8494 -36907 -27531 2189 2320 -3303 -192 8515 9471 -2073 -495
6149d95L2635j75o033j5121l7718L2957L3854J0547l2189l4860j6088J0021J2897
$$ -495 32140 31965 25932 10811 -26907 6050 39904 50451 18262 -16598 -32686 -22665 -9768
6136i768O143J336q112J7019K230j6996k8295r424L7329J3994J8337k446o870
$$ -9768 -3625 -2289 -10401 6618 8848 -8148 -36443 -45867 -8538 5456 23793 21347 14477
6123A4477n130K223m507r272j237n76r90k2548j0398L8674L8429j6810j6486j5253
$$ 14477 9347 11570 7063 -2209 -3446 -4022 -5012 -27560 -37958 716 39145 22335 5849 -9404
6109i404P713n02j5744j3137K1507r468Q832J9503j0482n635p783l098M123L760
$$ -9404 -1691 -2193 -17937 -31074 -9567 -19035 -10203 9300 -1182 -6817 -14600 -17698 -13575 -9815
6095i815Q452j7983l2617K0699L2668q253j3770J3011K2218J1988q217l123L3074
$$ -9815 -1363 -19346 -51963 -31264 1404 -6849 -20619 -7608 14610 26598 18381 15258 48332
6082D8332Q259k0553k1690k0664J4020j9066m1963j4499K4129J1097j8714l268
$$ 48332 56591 36038 14348 -6316 7704 -11362 -53325 -67824 -43695 -32598 -51312 -54580
6070e4580J5548K7058L3924L043k1320k4561j3237J3182K2987K6519n177r28P718
$$ -54580 -39032 -11974 21950 24993 3673 -20888 -34125 -20943 2044 28563 23386 22458 30176
6057C0176l457l8731k6917K5701J9596K0374j9235j1330j0451j8194m786o935
$$ 30176 26719 -12012 -38929 -13228 6368 26742 7507 -3823 -14274 -32468 -37254 -44189
6045d4189j19j6190M86J0666N0j316K0609K3278j2846j7639M12j3147K0682K6484
$$ -44189 -44308 -60498 -60012 -49346 -49296 -50612 -30003 -6725 -19571 -37210 -36798 -49945 -29263 -2779
6031b779J1507r001k8490j0877j8475J0597j6690L0452J1290O401K3407J4910
$$ -2779 8728 -273 -28763 -39640 -58115 -47518 -64208 -33756 -22466 -16065 7342 22252
6019B2252K259J0292k2041o457j056q461L613k2224j1330k8729m242K2518N684
$$ 22252 24511 34803 12762 6305 5249 -3212 401 -21823 -33153 -61882 -66124 -43606 -37922
6006c7922j8778K3043J3762R508j6093j0574P134J9132L388j6734j7296j019j1700
$$ -37922 -56700 -33657 -19895 -10387 -26480 -37054 -29920 -10788 -7400 -24134 -41430 -42449 -54149
5993e4149L3401J4330k2212K0878J3520J7568r517j6439m476K3236J2048q458
$$ -54149 -20748 -6418 -28630 -7752 5768 23336 13819 -2620 -7096 16140 28188 19730
5981A9730l2053j1957L403j5267J5540k514J051J0840J8110j0670P716J4131l588
$$ 19730 -12323 -24280 -20877 -36144 -20604 -23118 -22067 -11227 6883 -3787 3929 18060 14472
5968A4472R79R613J099k639k7269o031J2370P228k0423k2696R010q390k4795o750
$$ 14472 15451 25064 26163 23524 -3745 -9776 2594 9822 -10601 -33297 -24287 -32677 -57472 -64222
5954f4222l921O721K1222K0642K1933j5360m0467l0517J4784L0905J6492K391
$$ -64222 -68143 -61422 -40200 -19558 2375 -12985 -53452 -83969 -69185 -38280 -21788 -19397
5942a9397J1349L049K370n531Q111m43k1012j213J3333J2697O067m273l1515l0291
$$ -19397 -8048 -4999 -2629 -8160 -49 -492 -21504 -22717 -9384 3313 9380 5107 -26408 -56699
5928e6699J2152M2421J3123j9674j1763j1957J931L940M1235p853n683j7817J4235
$$ -56699 -44547 -2126 10997 -8677 -20440 -32397 -30466 -26526 14709 6856 1173 -16644 -2409
5915b409k783J8052O071j6485p627j452j5695l195K5899k64n526O912n466k0130
$$ -2409 -5192 12860 18931 2446 -5181 -6633 -22328 -25523 376 112 -5414 1498 -3968 -24098
5901b4098j3122Q719J258Q060K9378R735j7376P917K186j4488k1722j0356P823
$$ -24098 -37220 -28501 -27243 -19183 10195 19930 2554 10471 12657 -1831 -23553 -33909 -26086
5888b6086J6204L846N028j022n01j9098L254J3758p660q594k8679p625K8371M1914
$$ -26086 -9882 -6036 -1008 -2030 -2531 -21629 -18375 -4617 -12277 -20871 -49550 -57175 -28804 13110
5874A3110m734k1988l4713q394K31K6898J8431m568l840Q471K9340J0847j7998
$$ 13110 8376 -13612 -48325 -56719 -56488 -29590 -11159 -15727 -19567 -11096 18244 29091 11093
5861A1093K156k4368Q61J8701r854q559K254J2378O11j2866j6929n336J1139k348
$$ 11093 13249 -11119 -10258 8443 -1411 -9970 -7716 4662 5273 -7593 -24522 -29858 -18719 -21067
5847b1067O262j3005Q068P827J4366J3715j8142q086k3931J1476J393j883r46
$$ -21067 -14805 -27810 -19742 -11915 2451 16166 -1976 -10062 -33993 -22517 -21124 -23007 -23953
5834b3953j1229m673m067j2788J2851o404J103J7957k7467r498R06K8991M4709
$$ -23953 -35182 -39855 -43922 -56710 -43859 -50263 -49160 -31203 -58670 -68168 -67262 -38271 6438
5821F438K2678P165l280J9864k6808l1700K1565K5288l0048k6490K0888L1835
$$ 6438 29116 36281 33001 52865 26057 -5643 15922 41210 11162 -15328 5560 37395
5809C7395k5474l9817l3300J2602L5408J6728j6568k4295J7857P871p462J09J6267
$$ 37395 11921 -27896 -61196 -48594 -13186 3542 -13026 -37321 -19464 -11593 -19055 -18946 -2679
5796b679N79k0726P39l296K4878K8702M278j4787q831q025O33k7975K1707p601
$$ -2679 -2100 -22826 -22087 -25383 -505 28197 32475 17688 8857 832 1465 -26510 -4803 -12404
5782a2404j502K731j6804J6094L9072k2327J864j006p870J3266O762j3404j7315
$$ -12404 -13906 -11175 -27979 -11885 27187 4860 6724 5718 -2152 11114 17876 4472 -12843
5769a2843m800l570J4305o102j5465K3067K5358k3145l1852N221K3142K5963m17
$$ -12843 -17643 -21213 -6908 -13010 -28475 -5408 19950 -3195 -35047 -29826 -6684 19279 18862
5756A8862j5118M201j3513j5380J2168l994q817N478r381Q185P042q657m483J4628
$$ 18862 3744 7945 -5568 -20948 -8780 -12774 -21591 -16113 -25494 -17309 -10267 -18924 -23407 -8779
5742h779n779q65n935R627j222l326l3855m827J3099L4065J7098k3367L694R820
$$ -8779 -14558 -15423 -21358 -11731 -12953 -16279 -50134 -54961 -41862 -7797 9301 -14066 -10372 -552
5728e52K6020j4261k8261l2150p947m426j151P384M5762o952K2739p482K0692
$$ -552 25468 11207 -17054 -49204 -57151 -61577 -62728 -55344 -9582 -16534 6205 -1277 19415
5715A9415j9445k3813P035N957j1972J3617j874O797J1226j8731q922m265q963
$$ 19415 -30 -23843 -16808 -10851 -22823 -9206 -11080 -4283 6943 -11788 -20710 -24975 -33938
5702c3938K1565J9748Q696M276M896l1251o393J3843m359O188k184k4497j0301
$$ -33938 -12373 7375 16071 20347 25243 -6008 -12401 1442 -2917 3271 1087 -23410 -33711
5689c3711Q194o314J9101J2939k671k8037m006j453n285k9746j777J8479K0579
$$ -33711 -25517 -31831 -12730 209 -2462 -30499 -34505 -35958 -41243 -70989 -72766 -54287 -33708
5676c3708q528o899J2476J5689k8783l2786m220K1032O2843L5169k2997J6072
$$ -33708 -42236 -49135 -36659 -20970 -49753 -82539 -86759 -65727 -2884 32285 9288 25360
5664B5360J8158k2953q166L291k1027k0782j7482J2028L6597j0154R75j0252o410
$$ 25360 43518 20565 12399 15690 -5337 -26119 -43601 -31573 5024 -5130 -4155 -14407 -20817
5651b0817K7165j4166n586Q862p73o912J3702q889l2540j3371j2100L2542K6874
$$ -20817 6348 -7818 -13404 -4542 -5315 -12227 1475 -7414 -39954 -53325 -65425 -32883 -6009
5638f009K6790N78k0017M962k8392J3634L4802n703m0347K03O683j0097R007J7211
$$ -6009 20781 21359 1342 6304 -22088 -8454 26348 20645 -19702 -19499 -12816 -22913 -13906 3305
5624C305j2328p304l2489j4550l557K0526K5204k5312m406K0764K5788n4433q88
$$ 3305 -9023 -16327 -48816 -63366 -66923 -46397 -21193 -46505 -50911 -30147 -4359 -58792 -59680
5611e9680J8960q250q164K5864M4911J2181k1381l1747j5061J6608L652j1370
$$ -59680 -40720 -48970 -57134 -31270 13641 25822 4441 -27306 -42367 -25759 -22107 -33477
5599c3477k5026J732K3512P136k7844o825j1316k710M8654M0985J8598j9847J4540
$$ -33477 -58503 -56771 -33259 -26123 -53967 -60792 -72108 -74818 -26164 14821 33419 13572 28112
5586B8112N226j1560j1612n849j1438J518L922k5327m1342J0929n986K6070k60
$$ 28112 33338 21778 10166 4317 -7121 -5603 -1681 -27008 -68350 -57421 -63407 -37337 -37597
5573c7597j5858J4754N573p512L977j1139j4508j5851J6839L6047j3417N309L9979
$$ -37597 -53455 -38701 -33128 -40640 -36663 -47802 -62310 -78161 -61322 -25275 -38692 -33383 6596
5560F596r054J6874L061K578j5872J3954P711k6861l9149j3455K0023J8498K3079
$$ 6596 -2458 14416 17477 20055 4183 18137 25848 -1013 -40162 -53617 -33594 -15096 7983
5547G983J589k5586k9363l466N068J5111j5926j2016J0788J7487Q585k834M920
$$ 7983 9572 -16014 -45377 -48843 -43775 -28664 -44590 -56606 -45818 -28331 -19746 -22580 -17660
5534a7660Q314J5006j81R60o280L987r579K2238L1387j762p575k5625n153k2238
$$ -17660 -9346 5660 5479 6439 159 4146 -5433 16805 48192 46430 38855 13230 8077 -14161
5520a4161k2428m358j3025J280J0522J0940j296J1257j8822l846N237j1159j4357
$$ -14161 -36589 -40947 -53972 -52692 -42170 -31230 -32526 -21269 -40091 -43937 -38700 -49859 -64216
5507f4216J7046M1293P889j7480K156K300k5123r868K3287L896J876O078L777
$$ -64216 -47170 -5877 2012 -15468 -13312 -11012 -36135 -46003 -22716 -18820 -16944 -10866 -7089
5494g089k0797K377j2384k3684K4515J8660k6638k783O991O016N3973o699k155
$$ -7089 -27886 -25509 -37893 -61577 -37062 -18402 -45040 -47823 -40832 -34816 19157 12458 10303
5481A0303j3931r798m476m870K8627R766J3707k8454o776o601j9888j5738j4913
$$ 10303 -3628 -13426 -17902 -22772 5855 15621 29328 874 -5902 -12503 -32391 -48129 -63042
5468f3042J1606j0176J3934K2492N575j6259J2243J2294j370j3045N076j2388
$$ -63042 -51436 -61612 -47678 -25186 -19611 -35870 -23627 -11333 -12703 -25748 -20672 -33060
5456c3060m384O598J3886K6598j625j2668l465o554l6980O468j44m267M921L145
$$ -33060 -37444 -30846 -16960 9638 8013 -4655 -8120 -14674 -51654 -45186 -45330 -49597 -44676 -41531
5442d1531j3776J2987K756l191o52L830q847j3516q095M674R937K9731M791r664
$$ -41531 -55307 -42320 -39564 -42755 -43407 -39577 -48424 -61940 -70035 -65361 -55424 -25693 -20902 -30566
5428c0566J9984M0157k2437l0485l942n61J0848k1994J2261n055m961j6092o529
$$ -30566 -10582 29575 7138 -23347 -27289 -27850 -17002 -38996 -26735 -31790 -36751 -52843 -59372
5415e9372L2240J9158j3906O207k0266m547N836l856J3779K968L7133j4088q828
$$ -59372 -27132 -7974 -21880 -15673 -35939 -40486 -34650 -38506 -24727 -21759 15374 1286 -7542
5402g542q723L030J2811Q920k7695k0355o764k6973j1846L7980J9850Q788O932
$$ -7542 -16265 -13235 -424 8496 -19199 -39554 -46318 -73291 -85137 -47157 -27307 -18519 -11587
5389a1587j5641j4108P732J7159j4930n139p785k3132q507K7172K10J873K7042
$$ -11587 -27228 -41336 -33604 -16445 -31375 -36514 -44299 -67431 -75938 -48766 -48556 -46683 -19641
5376a9641M762L025J0402J0845J5378P908j5466k7108p245K0817L7693k2385k5348
$$ -19641 -14879 -11854 -1452 9393 24771 32679 17213 -9895 -17140 3677 41370 18985 -6363
5363f363N144j655l754j0867l73p162K1259r205p555l885k1439M593l2205Q192
$$ -6363 -1219 -2874 -6628 -17495 -17868 -25030 -3771 -12976 -20531 -24416 -45855 -41262 -73467 -65275
5349f5275N259L1659L9257J811k682k2146m398j0253j6973K633J149j972L70J2069
$$ -65275 -60016 -28357 10900 12711 10029 -12117 -16515 -26768 -43741 -41108 -39959 -41931 -41561 -29492
5335b9492n943j1184L2P619L0564k0418k8148L7015K1401J7114J7390l1721k2664
$$ -29492 -35435 -46619 -46587 -38968 -8404 -28822 -56970 -19955 1446 18560 35950 4229 -18435
5322a8435j283K7947J5287j5769j6498O237l1615P267K333l21L020j0501O055
$$ -18435 -19718 8229 23516 7747 -8751 -2514 -34129 -26862 -24529 -24850 -21830 -32331 -26276
5309b6276J3943K2589P074k8911k2652L707J7622J1795o392L657P912Q421k6075
$$ -26276 -12333 10256 17330 -11581 -34233 -30526 -12904 -1109 -7501 -3844 4068 12489 -13586
5296a3586r65J7108K9127J6360k4050j0361N198L729J9035j2657r700k0096m129
$$ -13586 -14551 2557 31684 48044 23994 13633 18831 22560 41595 28938 19238 -858 -4987
5283d987L044K2892l3975j8153j586k282K2871J2732M794j3572k4708j6554N225
$$ -4987 -1943 20949 -13026 -31179 -32765 -35047 -12176 556 5350 -8222 -32930 -49484 -44259
5270d4259K7419j4065j2333K2217J3402o515N299J6351k8777M827M878l4074J0197
$$ -44259 -16840 -30905 -43238 -21021 -7619 -14134 -8835 7516 -21261 -16434 -11556 -45630 -35433
5257c5433J647J3837J1764l3854k3777o575K8784J0559J3427O045j5253q805j302
$$ -35433 -33786 -19949 -8185 -42039 -65816 -72391 -43607 -33048 -19621 -13576 -28829 -37634 -38936
5244c8936M391L8625r105K51k6007k4614m611K503j341K8790L4375P174j8562
$$ -38936 -34545 4080 -5025 -4774 -30781 -55395 -60006 -57503 -58844 -30054 4321 11495 -7067
5231g067n456o436J4810p810r177O644M0124n15k4378j7290l05j62J2041j3946
$$ -7067 -12523 -18959 -4149 -11959 -21136 -14492 25632 25117 739 -16551 -16856 -17018 -4977 -18923
5217a8923L782J1596R983j3420J4939l794r198k0095j9475L5563L7908J6927r292
$$ -18923 -15141 -3545 6438 -6982 7957 4163 -5035 -25130 -44605 -9042 28866 45793 36501
5204C6501r419J212J7440k619r770m4935j8108Q932k7311N064L2706K9467p645
$$ 36501 27082 28294 45734 43115 33345 -11590 -29698 -20766 -48077 -43013 -10307 19160 11515
5191A1515n297m3128q873K4158K0250k7162K4832K1753j3149m8506j3851L2989
$$ 11515 6218 -36910 -45783 -21625 -1375 -28537 -3705 18048 4899 -43607 -57458 -24469
5179b4469J0652M3957j3650k6358j9301j6764N425k959o756O346J6200N156l115
$$ -24469 -13817 30140 16490 -9868 -29169 -45933 -40508 -43467 -50223 -43877 -27677 -22521 -25636
5166b5636j320Q326l3167K5963N040k8676n661K3257J3825J6044j5056k230Q886
$$ -25636 -26956 -18630 -51797 -25834 -20794 -49470 -55131 -31874 -18049 -2005 -17061 -19291 -10405
5153a0405Kj2597o761J6510K5800j8100l213J1692j3428n75K1085k4365q60N736
$$ -10405 -10403 -23000 -29761 -13251 12549 -5551 -8764 2928 -10500 -11075 10010 -14355 -15215 -9479
$$ [...]
##END NTUPLES=NMR SPECTRUM
##END=
