##TITLE=Analysis number 327815
Compound Code tl 00138
Project Code adrs
Chemist Name fudan
##JCAMPDX= 6.0         $$ Bruker NMR JCAMP-DX V2.0
##DATA TYPE= NMR SPECTRUM
##DATA CLASS= NTUPLES
##ORIGIN= Bruker BioSpin GmbH
##OWNER= nmr
$$ XWIN-NMR		Version 3.5
$$ Wed Apr 11 15:28:12 2007 GMT Daylight Time (UT+1h)  MAYBRIDGE\nmr@NMR_250MHZ
##.OBSERVE FREQUENCY= 250.131544655141
##.OBSERVE NUCLEUS= ^1H
##.ACQUISITION MODE= SIMULTANEOUS (DQD)
##.ACQUISITION SCHEME= undefined
##.AVERAGES= 16
##.DIGITISER RES= 18
##SPECTROMETER/DATA SYSTEM= dpx250
##.PULSE SEQUENCE= zg30
##.SOLVENT NAME= CDCl3
##.SHIFT REFERENCE= (INTERNAL, CDCl3, 0, 16.522)
##AUDIT TRAIL= $$ (NUMBER, WHEN, WHO, WHERE, WHAT)
$$ ##TITLE= Audit trail, XWIN-NMR		Version 3.5
$$ ##JCAMPDX= 5.01
$$ ##ORIGIN= Bruker BioSpin GmbH
$$ ##OWNER= nmr
$$ C:\u/data/dgb/nmr/ADRS/960/pdata/1/auditp.txt
$$ ##AUDIT TRAIL=  $$ (NUMBER, WHEN, WHO, WHERE, WHAT)
(   1,<2007-04-11 15:27:50.83 +100>,<MAYBRIDGE\nmr>,<NMR_250MHZ>,
      <created by zg, POWCHK disabled, PULCHK disabled
       configuration hash MD5:
       49 4B E0 1D 92 C2 6B 37 9F E6 65 BC 52 41 86 1D
       data hash MD5: 64K
       58 20 36 0F 2C E3 64 95 0A 6B DB 97 BA 3E DF CF>)
(   2,<2007-04-11 15:28:02.63 +100>,<MAYBRIDGE\nmr>,<NMR_250MHZ>,
      <Start of raw data processing
       ef LB = 0.3 FT_mod = 6 PKNL = 1 SI = 32K 
       data hash MD5: 32K
       68 FD EC FA 32 CF 9F 1C 19 BA 6A 5B A5 0A 21 B3>)
(   3,<2007-04-11 15:28:04.60 +100>,<MAYBRIDGE\nmr>,<NMR_250MHZ>,
      <apk 
       data hash MD5: 32K
       1C 51 40 EA E2 9C 89 0B A4 EE 65 2A 2E A3 7D E6>)
(   4,<2007-04-11 15:28:05.56 +100>,<MAYBRIDGE\nmr>,<NMR_250MHZ>,
      <abs ABSG = 5 
       data hash MD5: 32K
       FB B7 B7 7E DB 88 87 8A 7C 0B D2 F6 B8 4D 19 14>)
$$ ##END=
$$ 
$$ hash MD5
$$ AB AB 59 DA CC EB 84 10 30 E4 9D 7E 2A ED 44 9D
##$RELAX= 
##$RELAX= 
##$RELAX= 
##$RELAX= 
##$RELAX= 
##$RELAX= 
##$RELAX= 
$$ Bruker specific parameters
$$ --------------------------
##$DU= <C:\u>
##$EXPNO= 960
##$NAME= <ADRS>
##$PROCNO= 1
##$TYPE= <nmr>
##$USER= <dgb>
##$AMP= (0..31)
100 100 100 100 100 100 100 100 100 100 100 100 100 100 100 100 100 100 
100 100 100 100 100 100 100 100 100 100 100 100 100 100 
##$AQSEQ= 0
##$AQ_mod= 3
##$AUNM= <au_zg>
##$AUTOPOS= <36 >
##$BF1= 250.13
##$BF2= 250.13
##$BF3= 250.13
##$BF4= 250.13
##$BF5= 500.13
##$BF6= 500.13
##$BF7= 500.13
##$BF8= 500.13
##$BYTORDA= 1
##$CFDGTYP= 0
##$CFRGTYP= 5
##$CHEMSTR= <none>
##$CNST= (0..31)
1 1 145 1 1 1 1 1 1 1 1 1 1 1 1 1 1 1 1 1 1 1 1 1 1 1 1 1 1 1 1 1 
##$CPDPRG= <>
##$CPDPRG1= <>
##$CPDPRG2= <>
##$CPDPRG3= <>
##$CPDPRG4= <mlev>
##$CPDPRG5= <mlev>
##$CPDPRG6= <mlev>
##$CPDPRG7= <mlev>
##$CPDPRG8= <mlev>
##$CPDPRGB= <>
##$CPDPRGT= <>
##$D= (0..31)
0 1 0 0 0 0 0 0 0 0.06 0 0 0 0 0 0 0.0002 0 0 0 0 0 0 0 0 0 0 0 0 0 0 
0 
##$DATE= 1176301669
##$DBL= (0..7)
120 120 120 120 120 120 120 120 
##$DBP= (0..7)
150 150 150 150 150 150 150 150 
##$DBP07= 0
##$DBPNAM0= <>
##$DBPNAM1= <>
##$DBPNAM2= <>
##$DBPNAM3= <>
$$ [...]
##$SUBNAM7= <"">
##$SUBNAM8= <"">
##$SUBNAM9= <"">
##$SW= 20.6930455092707
##$SWIBOX= (0..15)
0 0 3 0 0 0 0 0 0 0 0 0 0 0 0 0 
##$SW_h= 5175.983436853
##$TD= 65536
##$TD0= 1
##$TE= 683.16
##$TE2= 300
##$TE3= 300
##$TEG= 300
##$TL= (0..7)
0 120 120 120 120 120 120 120 
##$TP= (0..7)
150 150 150 150 150 150 150 150 
##$TP07= 0
##$TPNAME0= <>
##$TPNAME1= <>
##$TPNAME2= <>
##$TPNAME3= <>
##$TPNAME4= <>
##$TPNAME5= <>
##$TPNAME6= <>
##$TPNAME7= <>
##$TPOAL= (0..7)
0.5 0.5 0.5 0.5 0.5 0.5 0.5 0.5 
##$TPOFFS= (0..7)
0 0 0 0 0 0 0 0 
##$TUNHIN= 0
##$TUNHOUT= 0
##$TUNXOUT= 0
##$USERA1= <user>
##$USERA2= <user>
##$USERA3= <user>
##$USERA4= <user>
##$USERA5= <user>
##$V9= 5
##$VALIST= <valist>
##$VCLIST= <CCCCCCCCCCCCCCC>
##$VD= 0
##$VDLIST= <DDDDDDDDDDDDDDD>
##$VPLIST= <PPPPPPPPPPPPPPP>
##$VTLIST= <TTTTTTTTTTTTTTT>
##$WBST= 1024
##$WBSW= 4
##$XGAIN= (0..3)
0 0 0 0 
##$XL= 0
##$YL= 0
##$YMAX_a= 453146
##$YMIN_a= -430050
##$ZGOPTNS= <>
##$ZL1= 120
##$ZL2= 120
##$ZL3= 120
##$ZL4= 120
##$ABSF1= 16.522
##$ABSF2= -4.171173
##$ABSG= 5
##$ABSL= 3
##$ALPHA= 0
##$AQORDER= 0
##$ASSFAC= 0
##$ASSFACI= 0
##$ASSFACX= 0
##$ASSWID= 0
##$AUNMP= <proc_1d>
##$AZFE= 0.1
##$AZFW= 0.1
##$BCFW= 0
##$BC_mod= 0
##$BYTORDP= 0
##$COROFFS= 0
##$CY= 12.5
##$DATMOD= 1
##$DC= 0
##$DFILT= <>
##$DTYPP= 0
##$F1P= 14.0000005364418
##$F2P= -0.99999901652339
##$FCOR= 0.5
##$FTSIZE= 32768
##$FT_mod= 6
##$GAMMA= 0
##$GB= 0
##$INTBC= 1
##$INTSCL= 1
##$ISEN= 128
##$LB= 0.3
##$LEV0= 0
##$LPBIN= 0
##$MAXI= 10000
##$MC2= 0
##$MEAN= 0
##$ME_mod= 0
##$MI= 0
##$NCOEF= 0
##$NC_proc= -3
##$NLEV= 6
##$NOISF1= 0
##$NOISF2= 0
##$NSP= 0
##$NTH_PI= 0
##$NZP= 0
##$OFFSET= 16.522
##$PC= 1
##$PHC0= 79.18827
##$PHC1= 4.444396
##$PH_mod= 1
##$PKNL= yes
##$PPARMOD= 0
##$PSCAL= 4
##$PSIGN= 0
##$REVERSE= no
##$SF= 250.13
##$SI= 32768
##$SIGF1= 0
##$SIGF2= 0
##$SINO= 400
##$SIOLD= 32768
##$SREGLST= <1H.CDCl3>
##$SSB= 0
##$STSI= 32768
##$STSR= 0
##$SW_p= 5175.98343685301
##$SYMM= 0
##$S_DEV= 0
##$TDeff= 65536
##$TDoff= 0
##$TI= <Analysis number 999999
Compound Code 99
Book Reference 9
Project Code 9>
##$TILT= no
##$TM1= 0
##$TM2= 0
##$TOPLEV= 0
##$USERP1= <user>
##$USERP2= <user>
##$USERP3= <user>
##$USERP4= <user>
##$USERP5= <user>
##$WDW= 1
##$XDIM= 32768
##$YMAX_p= 278010257
##$YMIN_p= -27133
$$ End of Bruker specific parameters
$$ ---------------------------------
##NTUPLES= NMR SPECTRUM
##VAR_NAME=  FREQUENCY,     SPECTRUM/REAL,   SPECTRUM/IMAG
##SYMBOL=    X,             R,               I
##VAR_TYPE=  INDEPENDENT,   DEPENDENT,       DEPENDENT
##VAR_FORM=  AFFN,          ASDF,            ASDF
##VAR_DIM=   32768,         32768,           32768
##UNITS=     HZ,            ARBITRARY UNITS, ARBITRARY UNITS
##FACTOR=    0.157963299565203, 1,           1
##FIRST=     4132.6476996994, 0,             0
##LAST=      -1043.33573715361, 0,           0
##MIN=       -1043.33573715361, -27133,      0
##MAX=       4132.6476996994, 278010257,     0
$$ Real data points
##PAGE= N=1
##DATA TABLE= (X++(R..R)), XYDATA
$$ [...]
$$ plain form
17008 3420 1050 -59 -2059 3414 3060 445 2116 4402 3008 5260 7168 8507 10115 7724 6342
16993 6342 6171 3399 8107 14700 15453 17012 19973 16999 14950 13725 14184 11461 11647 12571 11722 13022
16977 13022 13740 13141 9361 11950 14171 11994 5529 4797 8573 8815 7089 7202 7743 4043 3752 7916
16961 7916 13126 15370 13356 13364 11970 11384 10133 5657 3854 3097 4655 9132 9738 11693 13823 12083
16945 12083 12159 11564 10093 11183 12557 10145 10800 9076 6520 8212 10226 7905 7179 11121 15730 16407
16929 16407 13957 10641 9168 6515 9371 9800 11313 11878 12586 10344 9297 10610 10173 10475 11395 13160
16913 13160 10648 8454 9601 10709 13695 11307 8428 5628 9881 12166 9223 8911 11725 7933 955
16898 955 2128 5981 4387 5278 7580 7915 5037 6396 8439 6499 6380 8894 7443 6742 4708 2423
$$ packed form
17008C420k370j109k000N473l54k615J671K286j394K252J908J339J608k391j382
16993F342j71k772M708O593P53J559K961k974k049j225M59k723J86R24q49J300
16977A3022P18n99l780K589K221k177o465p32L776K42j726J13N41l700k91M164
16961G916N210K244k014Qj394n86j251m476j803p57J558M477O06J955K130j740
16945A2083P6n95j471J090J374k412O55j724k556J692K014k321p26L942M609O77
16929A6407k450l316j473k653K856M29J513N65P08k242j047J313m37L02R20J765
16913A3160k512k194J147J108K986k388k879k800M253K285k943l12K814l792o978
16898I55J173L853j594Q91K302L35k878J359K043j940j19K514j451p01k034k285
$$ plain form
16882 2423 4001 5841 6736 4822 5118 2649 614 3409 4004 6433 9141 7019 3330 1267 5048
16867 5048 5155 4205 6371 8659 9014 7738 8879 7467 3522 5819 7632 4564 3137 3744 3269 4727
16851 4727 4667 4636 5462 2759 2090 2264 4542 5855 5736 1646 135 -449 -3214 -2597 -4782 -3820 -1597
16834 -1597 -2661 926 3958 2993 695 -2100 -2800 -633 -416 389 2258 4984 9536 10345 9758 6241
16818 6241 1024 -2645 204 4364 1856 2708 7022 7647 5652 4384 633 1803 4047 6996 8792
16803 8792 6079 5460 7521 9327 7851 8470 10215 13661 11026 11863 10817 6013 -904 -2805 -1949 1485
16787 1485 -354 -1541 -4523 -3280 -2725 -4618 -793 4239 1639 -2293 -3565 261 1820 143 3959
16772 3959 8441 8327 7152 6368 3925 1694 2115 1774 1195 4818 6523 494 4364 11041 10894 10670
$$ packed form
16882B423J578J840Q95j914K96k469k035K795N95K429K708k122l689k063L781
16867E048J07r50K166K288L55j276J141j412l945K297J813l068j427O07m75J458
16851D727o0l1Q26k703o69J74K278J313j19m090j511n84k765O17k185R62K223
16834a597j064L587L032r65k298k795p00K167K17Q05J869K726M552Q09n87l517
16818F241n217l669K849M160k508Q52M314O25j995j268l751J170K244K949J796
16803H792k713o19K061J806j476O19J745L446k635Q37j046m804o917j901Q56L434
16787A485j839j187k982J243N55j893L825N032k600l932j272L826J559j677L816
16772C959M482j14j175p84k443k231M21l41n79L623J705o029L870O677j47k24
$$ plain form
16756 10670 8449 10213 8941 6675 6572 10210 8816 7346 7822 9518 7955 5237 5789 6173 6015 7947
16740 7947 8160 3393 2903 4212 4548 7137 9214 7530 4433 5942 7319 8056 7715 2975 1772 -820
16724 -820 1829 4024 5438 4265 382 1707 1448 2935 4479 5524 9032 14420 12453 7638 5186
16709 5186 4127 5946 5844 6843 6742 10067 10941 11230 8278 8711 10830 8520 5677 8886 13634 13086
16693 13086 7391 6700 6701 7425 6998 4604 3247 4503 487 318 1886 -1761 -4394 -880 2197 5478
16677 5478 3879 -1711 -3785 -2725 -596 531 2597 1371 -412 -1949 -1318 386 4466 5518 2162
16662 2162 960 -577 -4037 -3110 -103 -23 2405 244 -1778 79 4221 2299 -3988 -4155 920 2153
16646 2153 2347 4945 5187 7788 7362 3806 3749 4739 2816 -1301 -5903 -8647 -6889 -1998 -174 2987
$$ packed form
16756A0670k221J764j272k266j03L638j394j470M76J696j563k718N52L84j58J932
16740G947K13m767m90J309L36K589K077j684l097J509J377P37l41m740j203k592
16724h20K649K195J414j173l883J325k59J487J544J045L508N388j967m815k452
16709E186j059J819j02R99j01L325Q74K89k952M33K119k310k843L209M748n48
16693A3086n695o91JP24m27k394j357J256m016j69J568l647k633L514L077L281
16677E478j599n590k074J060K129J127K066j226j783j537O31J704M080J052l356
16662B162j202j537l460R27L007Q0K428k161k022J857M142j922o287j67N075J233
16646B153J94K598K42K601m26l556n7R90j923m117m602k744J758M891J824L161
$$ plain form
16630 2987 5726 1054 -805 1726 -553 -2556 -3686 -3480 -281 992 6672 9505 5805 1315 4237
16615 4237 4824 4835 3391 1788 3753 3707 -908 493 6750 4916 4929 2866 1806 5128 6113 3278 1374
16598 1374 -862 -5452 -6614 -8219 -5269 -2185 940 5301 8648 8886 8025 9861 11781 11254 7643
16583 7643 4212 1364 1906 6233 2756 939 -108 -1947 -492 -894 -1451 -991 -868 -5321 -4459 135
16567 135 1245 -1774 -1703 -719 -157 2741 5545 5965 6246 6585 7792 7398 2230 -1646 -1364 -383 3888
16550 3888 2866 703 -660 1331 2559 4045 3433 -1053 -4745 -6417 -5087 -3811 -4775 -6372 -6446 -3720
16534 -3720 -7 765 -515 243 2114 2220 3467 2054 1763 -135 -2356 -3103 -4670 -1561 -1380 -4092
16518 -4092 -4891 -5205 -4830 -1535 530 -250 -1694 -1091 -123 -1957 -2169 -3141 -3878 -2556 -1072 1392 -3332
$$ packed form
16630B987K739m672j859K531k279k003j130K06L199J273N680K833l700m490K922
16615D237N87J1j444j603J965m6m615J401O257j834J3k063j060L322R85k835j904
16598A374k236m590j162j605K950L084L125M361L347K38q61J836J920n27l611
16583G643l431k848N42M327l477j817j047j839J455m02n57M60J23m453Q62M594
16567A35J110l019P1R84N62K898K804M20K81L39J207l94n168l876K82R81M271
16550C888j022k163j363J991J228J486o12m486l692j672J330J276r64j597p4K726
16534c720L713P72j280P58J871J06J247j413k91j898k221p47j567L109J81k712
16518d092p99l14L75L295K065p80j444O03R68j834k12r72p37J322J484K464m724
$$ plain form
16501 -3332 -5924 -3035 -2465 -1525 -3360 -2133 -687 -497 -1804 2099 4391 1385 -459 -743 835 562
16485 562 949 205 676 2010 2677 1594 2491 2804 3058 -559 -1407 3256 2573 -4005 -1473 -1060 -2159
16468 -2159 263 1034 -1006 435 3385 -579 -3087 -1553 2531 3502 3848 936 -996 538 -1058
16453 -1058 158 4916 8897 8304 1819 431 2664 2223 -306 -346 -1559 -2796 -4684 -1525 -868 -1964
16437 -1964 -52 5860 7317 5725 6087 6991 8556 10104 9677 4265 3337 6210 6269 818 -825 -332
16421 -332 619 2670 5129 4684 4681 6258 9397 4108 -844 61 -1662 -1955 -2930 -2257 -647 260 -2030
16404 -2030 -3912 -5260 -7329 -3413 1447 -1573 -1314 1399 98 -73 2041 2849 730 -3121 -762
16389 -762 272 -1613 1009 1294 1085 3601 5023 3244 -599 215 3326 5167 5227 4728 6255 1659
$$ packed form
16501c332k592K889N70R40j835J227J446J90j307L903K292l006j844k84J578k73
16485E62L87p44M71J334O67j083Q97L13K54l617q48M663o83o578K532M13j099
16468b159K422P71k040J441K950l964k508J534M084R71L46k912j932J534j596
16453a058J216M758L981n93o485j388K233m41k529m0j213j237j888L159O57j096
16437a964J912N912J457j592L62R04J565J548m27n412r28K873N9n451j643M93
16421c32R51K051K459m45lJ577L139n289m952R05j723k93r75O73J610R07k290
16404b030j882j348k069L916M860l020K59K713j301j71K114Q08k119l851K359
16389g62J034j885K622K85k09K516J422j779l843Q14L111J841O0m99J527m596
$$ plain form
16373 1659 -568 1790 -513 -3175 -3169 -1054 695 84 -1943 -127 1981 3350 1269 -504 2977 3503
16357 3503 4511 45 689 6095 5543 3911 804 1467 3658 1232 -1742 -1757 -1402 -1135 556 4234
16341 4234 3809 2697 2169 3153 4378 2879 4056 4993 6542 6944 8072 6959 3891 2405 1362 376
16325 376 4225 5063 1925 -47 3642 4694 4645 3273 719 -1965 -601 1198 472 -3592 -2182 -4365
16309 -4365 -3851 -693 -3240 -3250 -4695 -3289 -859 -1758 -1545 1099 -411 -3198 -2744 -1141 -1884 -384
16293 -384 916 3871 2461 -310 397 406 1110 359 382 1466 -809 -149 1235 3182 2038 3391 3345 5193
16275 5193 7330 7694 11645 10195 5897 4644 6934 3690 1823 1490 527 -231 -152 1339 -2039 -1470
16259 -1470 -949 2057 6376 6413 4645 1802 -1453 -2372 3679 4220 2857 5156 3932 2331 870 -1039
$$ packed form
16373A659k227K358k303k662OK115J749o11k027J816K108J369k081j773L481N26
16357C503J008m466O44N406n52j632l107O63K191k426k974j5L55K67J691L678
16341D234m25j112n28R84J225j499J177R37J549M02J128j113l068j486j043r86
16325C76L849Q38l138j972L689J052m9j372k554k684J364J799p26m064J410k183
16309d365N14L158k547j0j445J406K430q99K13K644j510k787M54J603p43J500
16293c84J300K955j410k771P07RP04p51K3J084k275O60J384J947j144J353m6J848
16275E193K137L64L951j450m298j253K290l244j867l33r63p58P9J491l378N69
16259a470N21L006M319L7j768k843l255r19O051N41j363K299j224j601j461j909
$$ plain form
16243 -1039 -4067 -4055 -2037 252 1207 1354 3591 1285 2403 2539 1787 1876 5441 9291 5211 2864 2829
16226 2829 3317 3806 4838 1867 1912 913 -950 -4728 -4152 -283 3388 5865 7544 5644 7020 6874
16210 6874 6178 7206 7637 8289 7640 12022 13810 14047 13951 10693 9027 5914 2297 2666 4335 9189 9052
16193 9052 8421 8324 5333 7192 7452 7978 7123 8802 9806 11550 11820 10732 13697 13539 10347 9658 8205
16176 8205 6639 6977 4155 4425 7688 9456 8797 8217 8481 6730 5847 5090 8689 6617 4567 4755 5769
16159 5769 6068 4710 4019 6442 2974 2602 5286 5663 5903 2205 -834 -893 2057 7347 11338 8334
16143 8334 5773 5452 3650 1651 3455 1598 4481 9036 7044 4718 4504 2654 1004 2397 3758
16128 3758 3428 2908 4107 4797 3165 4425 5403 6668 6023 7204 7447 4503 4157 2441 1501 -1284 -2545
$$ packed form
16243a039l028J2K018K289R55J47K237k306J118J36p52Q9L565L850m080k347l5
16226B829M88M89J032k971M5r99j863l778N76L869L671K477J679j900J376j46
16210F874o96J028M31O52o49M382J788K37r6l258j666l113l617L69J669M854j37
16193I052o31r7k991J859K60N26q55J679J004J744K70j088K965j58l192o89j453
16176H205j566L38k822K70L263J768o59n80K64j751q83p57L599k072k050J88J014
16159E769K99j358o91K423l468l72K684L77K40l698l039n9K950N290L991l004
16143H334k561l21j802j999J804j857K883M555j992k326k14j850j650J393J361
16128C758l30n20J199O90j632J260R78J265o45J181K43k944l46j716r40k785j261
$$ plain form
16111 -2545 -3508 -2001 -2324 -2139 227 1727 -1233 -485 5351 7032 3101 1135 -180 -1615 -1340 -1967
16095 -1967 1748 745 1561 2108 -799 803 -290 -2999 -4278 -2259 3634 5244 4287 6985 5621
16080 5621 1717 1909 -517 -1918 -904 14 368 -1085 1927 2368 3061 3267 4178 7178 6777 2373 2323
16063 2323 3342 1061 3456 6805 4344 2620 2979 2959 3738 2561 1495 2490 -570 -5592 -3879 91
16047 91 1156 7181 8209 4286 3120 -2050 -668 3718 3669 2137 2999 3298 1520 -199 -949 -911 -4665
16030 -4665 -7255 -4412 -1079 -1602 -5920 -7716 -3075 -1429 -4275 -5849 -4764 -3652 -1154 -4503 -4076
16015 -4076 -2126 -458 -1086 -1343 -744 -1240 -2518 -2048 -3877 -6868 -8106 -7652 -3482 -1808 -3766 -2372
15999 -2372 -1510 -1824 -6293 -3949 -427 -279 984 1239 855 -1730 -2179 1662 521 -1073 -1055 -2864 -4613
$$ packed form
16111b545r63J507l23J85K366J500k960P48N836J681l931j966j315j435K75o27
16095a967L715j003Q16N47k907J602j093k709j279K019N893J610r57K698j364
16080E621l904J92k426j401J014R18L54j453L012M41O93K06R11L000m01m404n0
16063B323J019k281K395L349k461j724L59k0P79j177j066R95l060n022J713L970
16047I1J065O025J028l923j166n170J382M386m9j532Q62K99j778j719p50L8l754
16030d665k590K843L333n23m318j796M641J646k846j574J085J112K498l349M27
16015d076J950J668o28k57N99m96j278M70j829k991j238M54M170J674j958J394
15999b372Q62l14m469K344L522J48J263K55l84k585m49L841j141j594J8j809j749
$$ plain form
15982 -4613 -3084 -2963 -2054 -5336 -5744 -862 -1215 199 202 -1627 -953 -701 -5778 -4962 -312 -2199 169
15965 169 -753 -1956 -1579 70 1294 3042 1622 -1281 -6335 -8596 -7344 -4331 -489 -458 -2659 -4108
15949 -4108 -4973 -6149 -7430 -6494 -4322 -3101 -3330 -1705 -776 1700 5518 5848 5215 1529 -567 -929
15933 -929 1089 193 -3071 -4820 -4608 -3490 -5865 -5407 -5744 -6069 -5454 -2296 1124 5 -5585 -5140 -2912
15916 -2912 668 3680 3856 991 -331 -897 -3873 -5459 -3301 -4293 -4654 -2131 -3336 -3614 471 2529
15900 2529 428 -3524 -2772 -6141 -4134 -569 -1260 -1519 -931 2119 2461 2617 729 -890 -4527 -5572
15884 -5572 -1615 -2832 -7653 -9767 -7981 -10879 -9257 -5687 -7998 -7777 -7567 -5764 -2360 -2627 -1604
15869 -1604 -270 -2849 -4199 -3463 -6268 -3744 370 -310 -1728 -3120 -1599 -1964 -1054 -2909 -3805 -5699
$$ packed form
15982d613J529J21R09l282m08M882l53J414Lj829O74K52n077Q16M650j887K368
15965A69r22j203L77J649J224J748j420k903n054k261J252L013L842L1k201j449
15949d108q65j176j281R36K172J221k29J625R29K476L818L30o33l686k096l62
15933i29K018q96l264j749K12J118k375M58l37l25O15L158L420j119n590M45K228
15916b912L580L012J76k865j322n66k976j586K158r92l61K523j205k78M085K058
15900B529k101l952P52l369K007L565o91k59N88L050L42J56j888j619l637j045
15884e572L957j217m821k114J786k898J622L570k311K21K10J803L404k67J023
15869a604J334k579j350P36k805K524M114o80j418j392J521l65R10j855q96j894
$$ plain form
15853 -5699 -6784 -8793 -8625 -5723 -3302 -7577 -8300 -5908 -5025 -5055 -1442 1411 -970 -2703 -4369 -1453
15837 -1453 327 -201 -2810 -1805 -1944 -2430 -499 -2262 -6489 -6682 -3978 -4195 -6746 -6316 -5273 -3307
15821 -3307 1013 -1087 -3420 -1388 -2944 308 53 -4023 -5151 -6271 -5747 -5405 -8193 -11142 -4835
15806 -4835 -679 -1366 -1752 -3097 -3151 2829 3340 3086 -265 -2995 -6898 -7163 -3751 -775 -866 -3549 -4742
15789 -4742 -2996 -1866 -495 -2357 -2946 -2695 -1009 -3225 -5491 -3503 -1369 -5939 -10621 -12573 -16321
15774 -16321 -11489 -6968 -2551 -392 -316 -3272 -3910 -3970 -3100 1911 3983 1573 -7926 -9929 -10163 -9611
15758 -9611 -5991 -3394 -6270 -5239 -4526 -2408 612 -1716 -6843 -4016 -1144 1495 6359 2436 -4187
15743 -4187 -5587 -2988 -1942 -1936 -5737 -3284 -3423 -4336 -7297 -5757 -3681 -2735 -6395 -5920 -1758 -2074 -4599
$$ packed form
15853e699j085k009J68K902K421m275p23K392Q83l0L613K853k381j733j666K916
15837a453J780n28k609J005j39m86J931j763m227j93K704k17k551M30J043J966
15821c307M320k100k333K032j556L252k55m076j128j120N24L42k788k949O307
15806d835M156o87l86j345n4N980N11k54l351k730l903k65L412K976r1k683j193
15789d742J746J130J371j862n89K51J686k216k266J988K134m570m682j952l748
15774a6321M832M521M417K159P6k956o38o0Q70N011K072k410r499k003k34N52
15758i611L620K597k876J031P13K118L020k328n127K827K872K639M864l923o623
15743d187j400K599J046Ol801K453j39r13k961J540K076R46l660M75M162l16k525
$$ plain form
15726 -4599 -6936 -10504 -9036 -8347 -7148 -4377 -2971 -2142 -3488 -3895 -3573 -858 745 -1289 -552 584
15710 584 4428 3379 -1833 -4325 -1946 -1153 -2835 -2206 -1124 -3389 1391 1151 -2681 -5177 -4520 -3822
15694 -3822 -1737 -4111 -4283 -2717 1316 5232 4706 11 -4014 -3590 830 -741 -123 -66 1339 114
15678 114 -1152 -2200 -2282 225 -445 -4138 -6190 -8326 -9007 -10710 -6609 -78 4080 2187 494 -3049
15662 -3049 -5329 -4089 -916 -11 1400 2039 1532 2279 2804 2817 2077 875 -3039 -2298 -6260 -6622 -5274
15645 -5274 -1455 -1522 -3369 -5224 -1924 317 -298 -7393 -10311 -8327 -7431 -4847 -6059 -7803 -7571 -8596
15629 -8596 -7553 -5018 -3192 -3859 -6817 -5453 -4493 -2153 1232 -671 -391 412 -4051 -3735 -762 -1152
15613 -1152 -5695 -8188 -5774 -6762 -7779 -6484 -5804 -4338 -3640 -5087 -4520 -2030 1628 -173 485 1338
$$ packed form
15726d599k337l568J468O89J199K771J406Q29j346m07L22K715J603k034P37J136
15710E84L844j049n212k492K379P93j682O29J082k265M780k40l832k496O57O98
15694c822K085k374j72J566M033L916n26m695m025M24M420j571O18N7J405j225
15678A14j266j048q2K507o70l693k052k136o81j703M101O531M158j893j693l543
15662c049k280J240L173R05J411O39n07P47N25J3p40j202l914P41l962l62J348
15645e274L819o7j847j855L300K241o15p095k918J984Q96K584j212j744K32j025
15629h596J043K535J826o67k958J364R60K340L385j903K80Q03m463L16K973l90
15613a152m543k493K414r88j017J295O80J466O98j447N67K490L658j801O58Q53
$$ plain form
15597 1338 -1028 -1061 256 -5519 -9612 -8956 -2819 -2695 -3797 -2568 -696 3472 1812 -1225 -5100 -5417
15581 -5417 -9643 -13485 -14279 -14081 -14302 -11246 -6647 -2143 1050 1747 716 21 2432 4721 163 -3640
15565 -3640 477 1206 -374 2373 2754 -327 3298 6523 2911 3463 5039 -305 -3796 -1900 1964
15550 1964 855 -2220 1007 4579 6083 6031 3442 -1632 -6234 -5361 -6045 -8067 -9950 -10192 -6729 -6623
15534 -6623 -7049 -9739 -6946 -3035 -1848 -1369 -702 1041 1087 1051 -809 898 3406 2731 -2015 -3666 -2448
15517 -2448 -1508 -3699 -4660 -5137 -4663 -2856 -7525 -10565 -6682 -9340 -6679 -1047 374 -3852 -4229 -7519
15501 -7519 -8110 -6763 -6274 -1171 2146 2956 7567 9027 3823 5184 5826 3720 670 303 -768 -3225
15485 -3225 -5428 -8967 -9443 -5186 -2851 -1466 -2323 -3979 -5332 -5431 -723 -1158 -5760 -7986 -10631 -12093
$$ packed form
15597A338k366l3J317n775m093O56O137J24j102J229J872M168j660l037l875l17
15581e417m226l842p94J98k21L056M599M504L193O97j031o95K411K289m558l803
15565c640M117P29j580K747L81l081L625L225l612N52J576n344l491J896L864
15550A964j109l075L227L572J504n2k589n074m602Q73o84k022j883k42L463J06
15534f623m26k690K793L911J187M79O67J743M6l6j860J707K508o75m746j651J218
15517b448R40k191r61m77M74J807m669l040L883k658K661N632J421m226l77l290
15501g519n91J347M89N103L317Q10M611J460n204J361O42k106l050l67j071k457
15485c225k203l539m76M257K335J385q57j656j353r9M708m35m602k226k645j462
$$ plain form
15469 -12093 -12368 -6214 208 854 1147 -150 -3927 -6653 -2894 -1694 -5426 -3544 0 512 -2922
15454 -2922 -1202 428 -2939 -5715 -5054 -3500 -10057 -18346 -14917 -8773 -9167 -12693 -11022 -10247 -9855 -9175
15438 -9175 -8283 -4779 418 519 -3304 -8292 -8013 -7855 -6971 -7796 -9051 -9137 -9336 -7000 -7571 -7619 -10220 -7277
15420 -7277 -4635 928 1263 -160 147 -1395 -2373 -7337 -14018 -17439 -20165 -18268 -13097 -8916 -4888
15405 -4888 1951 6388 7890 8320 6092 -743 -6144 -7673 -6339 -6848 -7056 -6342 -6922 -7646 -7559 -3499 -2342
15388 -2342 2481 819 3663 5883 3563 -3272 -9279 -16462 -14026 -4821 161 2871 4676 4843 94
15373 94 -6231 -11391 -8249 -6236 -2214 1591 4143 4111 3648 3073 5673 2178 -4206 -7212 -11504 -18267
15357 -18267 -15589 -8020 -3304 683 -1376 -3765 -3407 -4186 -1670 -4792 -7839 -7292 -10522 -10047 -4184
$$ packed form
15469a2093k75O154O422O46K93j297l777k726L759J200l732J882L544N12l434
15454b922J720J630l367k776O61J554o557q289L429O144l94l526J671P75L92O80
15438i175Q92L504N197J01l823m988K79J58Q84q25j255q6j99K336n71m8k601K943
15420g277K642N563L35j423L07j542r78m964o681l421k726J897N171M181M028
15405d888O839M437J502M30k228o835n401j529J334n09k08P14n80p24Q7M060J157
15388b342M823j662K844K220k320o835o007p183K436R205M982K710J805J67m749
15373I4o325n160L142K013M022L805K552l2m63n75K600l495o384l006m292o763
15357a8267K678P569M716L987k059k389L58p79K516l122l047N47l230M75N863
$$ plain form
15342 -4184 -790 -814 678 1609 236 -1775 -4138 -2803 -7886 -13903 -14620 -8192 -1167 3640 9434 10812
15326 10812 8499 3809 179 851 -155 -418 -1474 -2327 -4050 -2222 -3351 -5159 -5745 -4434 -4383 -6651
15310 -6651 -9086 -10193 -7901 -6796 -5235 -241 4531 4993 2748 -3321 -8367 -9388 -4669 -5982 -9990
15295 -9990 -9493 -2954 -805 -3036 -6959 -11755 -12756 -17234 -18731 -17034 -8721 2778 6757 6575 7197
15280 7197 1277 -2263 -5514 -11727 -15188 -18843 -20392 -17084 -11589 -2930 815 -579 -4368 -6739 -12409
15265 -12409 -13462 -13763 -11642 -8764 -4252 715 119 -1783 -2823 -3145 -4829 -3893 -6614 -8124 -9490
15250 -9490 -10731 -7751 -1989 1337 4064 3912 4018 3335 -1290 -7591 -13824 -17437 -14572 -12426 -10176
15235 -10176 -7307 -7150 -5776 -4966 -5045 -4689 -2631 -1477 -2902 -8678 -7266 -9836 -12356 -14599 -12427 -8466
$$ packed form
15342d184L394k4J492R31j373k011k363J335n083o017p17O428P025M807N794J378
15326A0812k313m690l630O72j006k63j056q53j723J828j129j808n86J311N1k268
15310f651k435j107K292J105J561M994M772M62k245o069n046j021M719j313m008
15295i990M97O539K149k231l923m796j001m478j497J697Q313J1499L979j82O22
15280G197n920l540l251o213l461l655j549L308N495Q659L745j394l789k371n670
15265a2409j053l01K121K878M512M967n96j902j040l22j684R36k721j510j366
15250i490j241K980N762L326K727j52J06o83m625o301o233l613K865K146K250
15235a0176K869J57J374Q10p9L56K058J154j425n776J412k570k520k243K172L961
$$ plain form
15219 -8466 -5701 -8622 -8332 -6352 -8013 -5456 -3666 -1363 -1946 -643 994 1064 2878 4602 4445 969
15203 969 3428 -2083 -6040 -12777 -11932 -7220 -5390 -5628 755 4100 2109 2 -89 -36 -2862 -3640 -3663
15186 -3663 -4880 -1824 -446 3523 3708 2695 3519 5050 201 289 -1526 799 -1412 -2212 -3603 -5192
15170 -5192 -4951 -4366 -4794 -8320 -9255 -7999 -11469 -13357 -16030 -17685 -15706 -9571 -2195 2529 1946 246
15154 246 -1351 -6160 -6855 -5889 -6980 -7426 -6899 -4906 -7349 -8502 -6280 -4404 -2637 1331 987 -1464
15138 -1464 -3276 -5140 -5125 -4377 -1103 -859 -3023 -2514 -2363 -3099 -6494 -3322 1649 835 365 -2466 -5885
15121 -5885 -5256 -758 -329 -1638 -1302 1294 3036 1659 3377 3724 1116 -1488 -1970 2 -2183 -2558
15105 -2558 -2947 -5631 -10459 -8167 -5676 -2648 -330 -3794 -4343 -381 -511 -3559 -3870 -3118 -4171 -2281
$$ packed form
15219h466K765k921K90J980j661K557J790K303n83J303J637P0J814J724j57l476
15203I69K459n511l957o737Q45M712J830k38O383L345j991k107r1N3k826p78k3
15186c663j217L056J378L969J85j013Q24J531m849Q8j815K325k211q00j391j589
15170e192K41N85m28l526r35J256l470j888k673j655J979O135P376M724n83j700
15154B46j597m809o95R66j091m46N27J993k443j153K222J876J767L968l44k451
15138a464j812j864J5P48L274K44k164N09J51p36l395L172M971q14m70k831l419
15121e885O29M498M29j309L36K596J742j377J718L47k608k604m82J972k185l75
15105b558l89k684m828K292K491L028K318l464n49L962j30l048l11P52j053J890
$$ plain form
15089 -2281 -2813 -123 -154 -4315 -3124 1393 1742 -2247 -3432 -1327 -90 -879 -3384 -6758 -6649 -2331
15073 -2331 -2782 -3476 -4026 -2759 -2066 -3982 -3877 -6505 -7017 -5230 -2158 -1517 -3744 -3595 -6162 -7100 -6227
15056 -6227 -5632 -6403 -5901 -5554 -2542 -3523 -5997 -9326 -8847 -7296 -9709 -10015 -8688 -10051 -7826 -6159
15040 -6159 -8145 -8920 -6272 -1821 -630 -270 -3915 -3477 2311 -1993 -7089 -8593 -5922 -3545 -2475
15025 -2475 -4786 -3222 1539 4089 3291 -300 -1335 65 -2750 -5943 -1820 602 1159 32 309
15010 309 -2835 -6599 -7949 -7162 -10547 -9498 -10059 -9199 -9296 -9639 -8555 -6886 -6943 -2635 -3790 -4432 -7564
14993 -7564 -6198 -7349 -5861 -6224 -8972 -6955 -5266 -6048 -5027 -6277 -10988 -9591 -3749 -4737 -3631
14978 -3631 -2460 -131 -1856 -8167 -8320 -5448 -5876 -6762 -5519 -5527 -6111 -3961 -2912 -1871 -1925 591 1768
$$ packed form
15089b281n32K690l1m161J191M517L49l989j185K105J237p89k505l374J09M318
15073b331m51o94n50J267O93j916J05k628n12J787L072O41k227J49k567r38Q73
15056f227N95p71N02L47L012r81k474l329M79J551k413l06J327j363K225J667
15040f159j986p75K648M451J191L60l645M38N788m304n096j504K671K377J070
15025b475k311J564M761K550p98l591j035J400k815l193M123K422N57j127K77
15010C09l144l764j350P87l385J049n61Q60r7l43J084J669n7M308j155o42l132
14993g564J366j151J488l63k748K017J689p82J021j250m711J397N842r88J106
14978c631J171K329j725o311j53K872m28q86J243qn84K150J049J041n4K516J177
$$ plain form
14961 1768 24 -723 -390 608 116 -3973 -5587 -9083 -11826 -11667 -9634 -7018 -6079 -5154 -2205 600
14945 600 -583 -2586 -7496 -9041 -6499 -5497 -3126 -4216 -7930 -10846 -9691 -8308 -5855 -5314 -6184
14930 -6184 -7665 -8999 -10502 -9549 -9788 -12383 -9618 -3494 -3571 -3351 -2363 -2666 -4036 -6334 -6359 -2492 21
14913 21 2038 4756 3120 -2090 -2957 -3074 -1586 480 -765 -3073 -2501 -1497 -2063 -8329 -10409 -4782
14897 -4782 -2587 -4709 -6106 -7249 -6069 191 3410 3379 -552 -468 -1641 -2543 -4399 -8229 -9065 -7245
14881 -7245 -7335 -9962 -10039 -6604 -6827 -3989 -541 572 589 -855 -4141 -7628 -6213 -8542 -7391 692
14865 692 2661 -2125 -191 -1456 -4064 -2512 -2683 -757 409 -571 -4609 -6933 -5622 -2065 -956
14850 -956 -2553 -5024 -703 2576 -3577 -7513 -9592 -9715 -4406 -1577 -2888 -1433 -1461 -1984 -3895 -6407
$$ packed form
14961A768j744p47L33R98m92m089j614l496k743J59K033K616R39R25K949K805
14945F00j183k003m910j545K542J002K371j090l714k916J155J383K453N41q70
14930f184j481j334j503R53k39k595K765O124p7K20R88l03j370k298k5L867K513
14913B1K017K718j636n210q67j17J488K066j245k308N72J004n66o266k080N627
14897d782K195k122j397j143J180O260L219l1l931Q4j173r02j856l830q36J820
14881g245r0k627p7L435k23K838L448J113J7j444l286l487J415k329J151Q083
14865F92J969m786J934j265k608J552j71J926J166r80m038k324J311L557J109
14850i56j597k471M321L279o153l936k079j23N309K829j311J455k8n23j911k512
$$ plain form
14834 -6407 -7555 -9021 -7260 -5313 -5652 -6650 -9901 -11957 -13427 -12889 -9120 -5726 -3446 -5807 -8063
14819 -8063 -10159 -11897 -10371 -7194 -4642 -5255 -5816 -7318 -6450 -5958 -5584 -5408 -6412 -8778 -8250 -5979
14803 -5979 -6158 -7030 -7861 -6869 -7662 -4319 -773 -3255 -4240 -7986 -8265 -9136 -6556 -5047 -5284 -4575 -7346
14786 -7346 -6568 -5879 -11629 -10395 -2423 -1289 -997 -2704 -4415 -3781 -4372 -3382 -3392 -1544 -169 2680 894
14769 894 -1789 -2303 -2261 -3545 -7145 -10323 -8143 -4204 -4517 -3551 -2217 -3311 -5422 -4522 1050 -3131
14753 -3131 -7784 -4276 -540 -4654 -6968 -2069 -2072 -4144 -3624 -2214 -5236 -10249 -8526 -5226 -7695 -11207
14737 -11207 -12535 -12397 -12567 -10629 -8653 -8096 -7219 -5163 -4614 -2487 -1446 -943 -3313 -3214 -3339 -6756 -4942
14720 -4942 -4051 -7048 -5951 -4662 -6896 -8450 -6625 -4542 -5278 -3817 -4304 -3531 -504 -1793 -1797 -3777
$$ packed form
14834f407j148j466J761J947l39r98l251k056j470N38L769L394K280k361k256
14819h063k096j738J526L177K552o13n61j502Q68M92L74J76j004k366N28K271
14803e979j79q72q31R92p93L343L546k482r85l746k79q71K580J509k37P09k771
14786g346P78O89n750J234P972J134K92j707j711O34n91R90j0J848J375K849j786
14769H94k683n14M2j284l600l178K180L939l13R66J334j094k111R00N572m181
14753c131m653L508L736m114k314M899lk072N20J410l022n013J723L300k469l512
14737a1207j328J38j70J938J976N57Q77K056N49K127J041N03k370R9j25l417J814
14720d942Q91k997J097J289k234j554J825K083p36J461m87P73L027j289mj980
$$ plain form
14704 -3777 -3863 -5065 -7175 -6925 -4355 -4828 -2757 -498 -593 -538 -895 -2842 -4273 -6051 -6264 -4926 -3518
14687 -3518 -1484 -4248 -9230 -10054 -5553 -3477 -5821 -5722 -7492 -6897 -3764 -3840 -3372 -2228 -6664 -9133
14671 -9133 -9307 -8575 -12019 -9397 -6732 -4654 -4269 -10530 -12216 -11840 -11076 -10343 -7387 -2830 -4864 -6635
14655 -6635 -2820 -5292 -4343 -5221 -4621 -7302 -7398 -5646 -520 1361 -3395 -4822 -7378 -8457 -9359 -9468
14639 -9468 -3890 -2947 -9504 -10698 -7612 -7073 -9963 -12116 -7908 -8921 -7987 -8318 -8353 -9621 -6613 -562
14623 -562 -1937 -4292 -10466 -9341 -4865 -3609 -238 919 -3853 -4322 -3515 -2381 -3994 -2023 2383
14608 2383 -2075 -5794 -8430 -13229 -8416 -5051 -4798 -6118 -8384 -6612 -2123 -992 -1413 -5255 -3795
14593 -3795 -1006 -729 -2881 -8600 -9606 -10172 -9371 -9115 -11356 -11869 -9916 -9195 -10341 -6540 -8402 -12337
$$ packed form
14704c777q6j202k110K50K570m73K071K259r5N5l57j947j431j778k13J338J408
14687c518K034k764m982q24M501K076k344R9j770N95L133p6M68J144m436k469
14671i133j74P32l444K622K665K078L85o261j686L76P64P33K956M557k034j771
14655f635L815k472R49q78O00k681r6J752N126J881m756j427k556j079r02j09
14639i468N578R43o557j194L086N39k890k153M208j013R34l31l5j268L008O051
14623e62j375k355o174J125M476J256L371J157m772m69Q07J134j613J971M406
14608B383m458l719k636m799M813L365K53j320k266J772M489J131m21l842J460
14593c795K789K77k152n719j006n66Q01K56k241n13J953P21j146L801j862l935
$$ plain form
14577 -12337 -9348 -6664 -4373 -3081 -511 -1520 114 493 -3683 -7990 -10057 -6461 -2185 329 464
14562 464 712 433 -4346 -9219 -6206 -1960 -2365 -530 -4694 -12140 -8029 -3575 -4618 -4504 -1100 2372
14546 2372 3452 2328 2154 1601 998 -2270 -6116 -4412 -3558 -6958 -5731 -4051 -4044 -7208 -8242 -11517
14530 -11517 -12582 -8152 -6325 -8219 -5833 -6447 -8275 -7942 -10412 -6335 -6680 -9196 -8403 -10829 -13695
14515 -13695 -10078 -7344 -8698 -5347 -1144 -410 -620 -345 1170 -178 -4110 -6511 -7337 -5876 -5133 -3782
14499 -3782 -2159 -4850 -4968 -2460 -707 -4084 -823 -2171 -3397 -2676 -248 249 -1781 -3874 -7943
14484 -7943 -9143 -7489 -7556 -6091 -6709 -7829 -10031 -6119 -4157 -1907 -2968 -5569 -2831 -4125 -3761 -3625
14468 -3625 -5782 -5195 -4685 -7762 -12658 -7922 -1894 -181 -3586 -7889 -6138 -1948 -5965 -11327 -6380
$$ packed form
14577a2337K989K684K291J292K570j009J634L79m176m307k067L596M276K514J35
14562D64K48k79m779m873L013M246m05J835m164p446M111M454j043J14L404L472
14546B372J080j124j74n53o03l268l846J704Q54l400J227J680Pl164j034l275
14530a1517j065M430J827j894K386o14j828L33k470M077l45k516P93k426k866
14515a3695L617K734j354L351M203P34k10K75J515j348l932k401q26J461P43J351
14499c782J623k691j18K508J753l377L261j348j226P21K428M97k030k093m069
14484g943j200J654o7J465o18j120k202L912J962K250j061k601K738j294L64J36
14468c625k157N87N10l077m896M736O028J713l405m303J751M190m017n362M947
$$ plain form
14453 -6380 -326 -4684 -5197 -2669 -1548 -3719 -9478 -9256 -5563 -3614 -3179 1369 4628 2586 -1812
14438 -1812 -4798 -4986 -3468 -2777 -3689 -1824 -1881 -901 -2917 -6146 -9351 -8472 -8657 -9811 -8835 -10970 -12309
14421 -12309 -14115 -11388 -12141 -10591 -6763 -1876 -1159 -4795 -5148 -7900 -6753 -798 -4060 -4324 -3385 -4933
14405 -4933 -7811 -9436 -7925 -8454 -10577 -9417 -6366 -6876 -7167 -6608 -3195 -4490 -1522 287 -2391 -1370
14389 -1370 -4128 -3716 -3436 -1905 -2818 -644 -410 -1440 -1951 853 2606 2167 589 -1462 -1061 -433 -2344
14372 -2344 -4237 -5820 -4206 -2771 -3838 -7567 -6882 -6416 -1982 278 -421 -2333 -3316 -2748 -4653 -7229
14356 -7229 -6757 -5140 -4030 -4192 -5533 -6720 -7610 -8928 -8154 -5160 -5252 -4889 1816 3141 4317 8044
14340 8044 13598 19131 23764 25846 31810 42651 53644 62394 65041 63890 63595 60170 56675 59587
$$ packed form
14453f380O054m358n13K528J121k171n759K22L693J949M35M548L259k042m398
14438a812k986j88J518O91r12J865n7R80k016l229l205Q79j85j154R76k135j339
14421a2309j806K727p53J550L828M887P17l636l53k752J147N955l262k64R39j548
14405d933k878j625J511n29k123J160L051n10k91N59L413j295K968J809k678J021
14389a370k758M12K80J531r13K174K34j030n11K804J753m39j578k051M01O28j911
14372b344j893j583J614J435j067l729O85M66M434K260o99j912r83N68j905k576
14356g229M72J617J110j62j341j187q90j318P74K994r2L63O705J325J176L727
14340H044N554N533M633K082N964J0841J0993Q750K647j151k95l425l495K912
$$ plain form
14326 59587 60004 63482 65333 65205 64445 61259 54499 47020 38719 31534 20869 16670 11499 12092 11109
14311 11109 9807 7494 5418 4820 -289 -1481 3541 1651 -225 983 2909 4063 2442 2474 2984
14296 2984 649 462 -1693 -2648 -3599 -1432 -5630 -6642 -5669 -3573 538 -1536 -505 -67 199 2726
14280 2726 6435 4196 3065 4496 3323 3081 4801 1327 3613 8482 8457 5433 8468 11250 5792
14265 5792 3374 2550 946 -2171 -5061 -5478 -8281 -3572 -2478 -4440 -9364 -10472 -4693 -281 -1246
14250 -1246 -7576 -9207 -10077 -6423 -1774 -1671 -7239 -6116 -5298 -4225 -5440 -5792 -4267 -4075 -8801 -10915
14234 -10915 -12337 -9571 -5595 -3487 -870 882 1143 -124 -2316 2025 1980 4592 1471 -6509 -10863
14219 -10863 -6085 -703 -1712 -5304 -3335 -5421 -6948 -4967 -6169 -6005 -3114 -2204 -2161 -1396 -1304 -3718
$$ packed form
14326E9587M17L478J851j28p60l186o760p479q301p185j0665m199n171N93r83
14311A1109j302k313k076n98n109j192N022j890j876J208J926J154j621L2N10
14296B984k335j87k155r55r51K167m198j012R73K096M111k074J031M38K66K527
14280B726L709k239j131J431j173k42J720l474K286M869k5l024L035K782n458
14265E792k418q24j604l117k890m17k803M709J094j962m924j108N779M412r65
14250a246o330j631q70L654M649J03n568J123Q18J073j215l52J525J92m726k114
14234a0915j422K766L976K108K617J752K61j267k192M341m5K612l121p980m354
14219a0863M778N382j009l592J969k086j527J981j202J64K891R10M3P65R2k414
$$ plain form
14203 -3718 -5139 -7769 -6894 -5266 -4980 -5112 -4261 -3375 2488 5234 2932 796 -2414 -5457 -2935 -1200
14187 -1200 1533 1950 -849 -5020 -10087 -12564 -12004 -10018 -8795 -6702 -7493 -9413 -9334 -7290 -8083 -10376
14171 -10376 -10105 -8667 -9015 -10214 -10259 -8901 -8638 -7624 -6259 -7704 -10490 -10413 -9120 -8743 -6844 -5695
14155 -5695 -2922 -1418 -919 -5503 -5746 -6408 -6926 -6667 -7553 -6325 -4117 -6879 -7935 -8597 -10045 -10358 -12502
14138 -12502 -10575 -9635 -7695 -4672 -899 -1509 -2536 -6228 -8168 -10204 -8731 -6617 -6273 -2875 2744
14123 2744 1524 -3248 -2351 149 -4460 -6867 -5495 -8733 -7979 -8446 -8878 -9806 -10547 -8306 -10237 -10292 -5770
14106 -5770 -6713 -10083 -10868 -11796 -14545 -14071 -10321 -9856 -6853 -3486 -4799 -4112 -5763 -9301 -7544 -3293
14090 -3293 -5978 -6963 -4367 -1732 -3854 -6061 -2772 -5609 -2706 -5629 -7709 -3006 -703 -1348 -6061
$$ packed form
14203c718j421k630Q75J628K86j32Q51Q86N863K746k302k136l210l043K522J735
14187a200K733M17k799m171n067k477N60J986J223K093p91j920P9K044p93k293
14171a0376K71J438l48j199m5J358K63J014J365j445k786P7J293L77J899J149
14155e695K773J504M99m584k43o62n18K59q86J228K208k762j056o62j448l13k144
14138a2502J927R40J940L023L773o10j027l692j940k036J473K114L44L398N619
14123B744j220m772Q97K500m609k407J372l238P54m67m32r28p41K241j931n5M522
14106e770r43l370p85r28k749M74L750M65L003L367j313O87j651l538J757M251
14090c293k685r85K596K635k122k207L289k837K903k923k080M703K303o45m713
$$ plain form
14075 -6061 -7568 -7124 -6813 -6640 -3085 -5246 -7727 -6482 -3101 -3417 -3167 -1309 2247 -1638 -2300 1324
14059 1324 4243 3646 -769 -1963 -953 1267 -1212 -2551 -2922 -3653 -5205 -5641 -5339 -6071 -5886 -9824
14043 -9824 -10263 -8679 -6525 -6480 -8331 -10836 -12225 -7655 -4896 -5569 -3550 -4124 -4799 -3134 2419 3836
14027 3836 1749 -2290 -1678 -1943 -516 3739 3026 500 -78 -4383 -9036 -10410 -9238 -5037 -6871 -8396
14011 -8396 -7891 -7995 -6729 -5368 -6631 -8311 -4585 -3868 -4648 -564 -3288 -5731 -4097 -7883 -11843 -9949
13995 -9949 -11603 -9895 -5877 -5663 -4755 -3687 383 465 4378 6437 3820 2672 5279 5137 5424 6941
13979 6941 3690 2965 263 -2820 -1735 -3137 -6906 -8976 -9149 -9258 -7531 -8641 -12801 -13210 -11941 -10649
13963 -10649 -11427 -16389 -17044 -18874 -15109 -10683 -4719 -3130 -4342 -6761 -7306 -4945 -3258 -5078 -6702
$$ packed form
14075f061j507M44L11J73L555k161k481J245L381l16K50J858L556l885o62L624
14059A324K919n97m415j194J010K220k479j339l71p31j552m36L02p32J85l938
14043i824m39J584K154M5j851k505j389M570K759o73K019n74o75J665N553J417
14027C836k087m039O12k65J427M255p13k526n78m305m653j374J172M201j834j525
14011h396N05j04J266J361j263j680L726P17p80M084k724k443J634l786l960J894
13995i949j654J708M018K14R08J068M070Q2L913K059k617j148K607j42K87J517
13979F941l251p25k702l083J085j402l769k070j73j09J727j110m160m09J269J292
13963a0649p78m962o55j830L765M426N964J589j212k419n45K361J687j820j624
$$ plain form
13948 -6702 -9939 -9862 -8753 -8116 -8437 -7396 -3838 -4886 -6026 -9746 -12261 -10553 -7076 -5539 -6980 -5584
13932 -5584 -6429 -7137 -4652 -4792 -9586 -6009 -6963 -6463 -3579 2993 6536 2467 652 -855 344 2560
13916 2560 3147 7470 10386 11195 9416 12279 15017 16187 18338 18977 18929 21075 18167 20350 20503 18464
13900 18464 20416 23491 23533 26030 26091 24551 22154 22512 22419 18468 17512 12654 11070 11968 14460 12636 4854
13883 4854 2511 1716 2657 2709 4431 7576 7525 8309 8942 8300 11232 9640 6611 2249 -1124 -4207 -3777
13866 -3777 -5225 -5633 -4560 -5364 -3113 -953 -327 -2523 -3457 -1503 -1942 -2671 -3677 381 1655 -1446
13850 -1446 -1902 -5168 -4075 -5375 -5585 -1712 -1965 -1480 -5968 -10282 -6433 -2006 -2327 -5593 -3719 -533
13834 -533 3237 -341 -2186 -2973 -3215 -3505 -6145 -9102 -12273 -11429 -8881 -4519 -8442 -12825 -15354 -12426
$$ packed form
13948f702l237P7J109O37l21J041L558j048j140l720k515J708L477J537j441J396
13932e584q45p08K485j40m794L577r54N00K884O572L543m069j815j507J199K216
13916B560N87M323K916Q09j779K863K738J170K151O39m8K146k908K183J53k039
13900A8464J952L075M2K497O1j540k397L58r3l951r56m858j584Q98K492j824p782
13883D854k343p95R41N2J722L145n1P84O33o42K932j592l029m362l373l083M30
13866c777j448m08J073q04K251K160O26k196r34J954m39p29j006M058J274l101
13850a446m56l266J093j300k10L873k53M85m488m314L849M427l21l266J874L186
13834e33L770l578j845p87k42k90k640k957l171Q44K548M362l923m383k529K928
$$ plain form
13818 -12426 -5440 -1437 -1062 -2136 -3498 -6876 -6732 -6982 -4323 291 1918 5645 7125 5338 1307
13803 1307 1621 -720 381 -1996 -1804 -3065 -6362 -7592 -8920 -10415 -11995 -7497 -7649 -3762 -1942
13788 -1942 -3881 -5471 -4147 -2923 -5343 -7757 -6328 -4547 -4185 -4563 -5417 -8800 -13489 -15128 -11366
13773 -11366 -6701 -4432 -7397 -9135 -9376 -11556 -8517 -6478 -5844 -7811 -10280 -9493 -10160 -8182 -617
13758 -617 -249 -2175 -1965 -4945 -4076 -4566 -7339 -9096 -9062 -8183 -8002 -4744 -2567 -3726 -2326 -2069 -5099
13741 -5099 -2794 1110 1975 3832 1697 938 359 669 3719 2502 1397 2225 1321 -4158 -2239 -5075
13725 -5075 -5603 -3227 -559 2705 1610 -2055 -8410 -8807 -5553 -4557 -7850 -11168 -6960 -1635 -482
13710 -482 1841 3974 2090 2415 -3331 -5284 -5305 -2882 -972 -2773 -4291 -6664 -4475 -4199 -3184 -2783
$$ packed form
13818a2426O986M003L75j074j362l378J44k50K659M614J627L727J480j787m031
13803A307L14k341J101k377J92j261l297j230j328j495j580M498j52L887J820
13788a942j939j590J324J224k420k414J429J781L62l78q54l383m689j639L762
13773a1366M665K269k965j738k41k180L039K039O34j967k469P87o67J978P565
13758f17L68j926K10k980Q69m90k773j757L4Q79J81L258K177j159J400K57l030
13741e099K305L904Q65J857k135p59n79L10L050j217j105Q28r04n479J919k836
13725e075n28K376K668L264j095l665o355l97L254R96l293l318M208N325J153
13710d82K323K133j884L25n746j953k1K423J910j801j518k373K189K76J015M01
$$ plain form
13694 -2783 -3389 -2700 1879 7198 6589 4012 7645 10384 11080 13629 11581 13650 19551 25045 34206 45344
13678 45344 58278 70769 83101 91052 97184 95835 87127 75194 60136 46265 39395 35882 28048
13665 28048 20139 16118 13671 10834 8090 4861 1098 3643 7413 9625 11513 14236 13804 15339 17376
13650 17376 16663 24030 33592 37238 46235 63786 81462 90254 92474 94887 92410 86944 72535 60026
13636 60026 49742 35931 25670 20562 14309 10877 7334 8363 10564 4588 -209 -2565 -4085 -1331
13622 -1331 2049 7381 4655 2478 20 -739 396 -1986 -363 4829 5124 2315 2716 -834 -2880
13607 -2880 -1220 -1777 -1463 -1089 -1230 1486 2041 -509 912 3128 2190 1906 3485 2530 -2415 -3116 -2019
13590 -2019 -3251 -1859 -1296 -2969 -8328 -9711 -8980 -6552 -7239 -6482 -1785 -1210 -1225 -1461 -3645 -3991 -5586
$$ packed form
13694b783o06O89M579N319o09k577L633K739O96K549k048K069N901N494R161J1138
13678D5344J2934J2491J2332P951O132j349q708j1933j5058j3871o870l513p834
13665B8048p909m021k447k837k744l229l763K545L770K212J888K723m32J535K037
13650A7376p13P367R562L646Q997J7551J7676Q792K220K413k477n466j4409j2509
13636F0026j0284j3811j0261n108o253l432l543J029K201n976m797k356j520K754
13622a331L380N332k726k177k458p59J135k382J623N192K95k809M01l550k046
13607b880J660n57L14L74j41K716N55k550J421K216r38k84J579r55m945p01J097
13590b019j232J392N63j673n359j383P31K428o87P57M697N75j5k36k184l46j595
$$ plain form
13573 -5586 -5092 -2480 -5202 -10821 -11351 -7187 -4162 -3399 -1983 6450 11054 7781 2366 1547 4134 4374
13557 4374 3739 3388 4336 5787 875 2756 3510 2705 2513 592 -2509 -290 449 3376 1157 -756
13541 -756 107 4141 4699 4033 3670 5437 4161 3754 3492 6132 7143 6426 1098 845 3687 7752 9376
13524 9376 7635 6102 9757 11665 11397 8810 7360 10461 13257 11033 6886 4184 2793 5060 6972
13509 6972 6025 4878 266 -1209 1389 1881 3169 7042 7549 8705 6402 4708 3997 5473 10108 10753
13493 10753 11462 6902 2303 3087 5774 3080 3239 3886 4330 6594 7471 5620 4535 1639 -1451 -2639
13477 -2639 -4234 -295 3201 5947 7856 10448 15990 18498 17037 8278 6057 4904 4377 3040 2905
13462 2905 3106 3062 2250 5896 8391 6438 2473 2360 1642 689 457 -2212 -7434 -6497 -6132 -3540 -1629
$$ packed form
13573e586M94K612k722n619n30M164L025P63J416Q433M604l273n415q19K587K40
13557D374o35l51R48J451m912J881P54q05j92j921l101K219P39K927k219j913
13541g56Q63M034N58o66l63J767j276m07k62K640J011p17n328k53K842M065J624
13524I376j741j533L655J908k68k587j450L101K796k224m147k702j391K267J912
13509F972r47j147m612j475K598M92J288L873N07J156k303j694p11J476M635O45
13493A0753P09m560m599P84K687k694J59O47M44K264Q77j851j085k896l090j188
13477b639j595L939L496K746J909K592N542K508j461q759k221j153n27j337j35
13462B905K01m4q12L646K495j953l965j13p18r53k32k669n222R37L65K592J911
$$ plain form
13445 -1629 606 -1803 -767 2580 2581 265 499 837 2180 -394 -987 1975 3323 748 316 -2416
13429 -2416 -1742 1732 1989 4666 6360 7041 7584 9774 10271 3257 -2422 -5863 -8462 -7113 -2101 1645
13413 1645 2398 -681 -2979 -622 -637 -175 783 6690 7740 3319 1981 3021 3224 3156 4534 5442 6885
13396 6885 8461 8156 7718 4603 1767 -165 573 1350 734 2962 3274 3598 4528 1063 -3112 -3314 -3840
13379 -3840 -2242 835 1487 -1308 -5088 -3723 -1679 706 1740 795 -672 1758 1900 229 2384
13364 2384 6207 6073 6340 3607 2217 6852 9118 4690 2122 1371 2739 1370 2442 7839 7783 5412
13348 5412 3993 4447 1998 -415 -387 6579 6154 1564 1929 -963 3346 4750 3701 2675 2012 2575
13332 2575 3122 61 -1508 -958 1144 4935 4275 4939 5933 3664 -429 -877 -228 2826 1441 -2144
$$ packed form
13445a629K235k409J036L347Jk316K34L38J343k574n93K962J348k575m32k732
13429b416O74L474K57K677J694O81N43K190M97p014n679l441k599J349N012L746
13413A645P53l079k298K357j5M62R58N907J050m421j338J040K03o8J378R08J443
13396F885J576l05m38l115k836j932P38P77o16K228L12L24R30l465m175k02n26
13379c840J598L077O52k795l780J365K044K385J034r45j467K430J42j671K155
13364B384L823j34K67k733j390M635K266m428k568p51J368j369J072N397n6k371
13348E412j419M54k449k413K8O966m25m590L65k892M309J404j049j026o63N63
13332B575N47l061j569N50K102L791o60O64R94k269m093m48O49L054j385l585
$$ plain form
13316 -2144 -3869 -2354 555 2367 5356 10250 5643 1569 1510 1043 532 1575 2282 -71 -3229 -2766
13300 -2766 -309 -40 -533 275 -644 165 3898 5891 4323 2845 1808 48 -746 -2779 -711 4501
13284 4501 4318 2262 3953 6413 3634 4302 2467 913 4308 4703 4054 9415 15134 16945 15188 12898
13268 12898 7607 2805 6283 7579 2346 -141 -3222 -2382 1466 3739 3842 2835 5597 5650 7052
13253 7052 7115 8936 9189 9987 6745 6849 8256 9508 11822 11549 12022 14660 14872 11961 13729 5998 4662
13236 4662 8109 10627 10734 8430 11090 12781 12192 13970 14062 13309 15289 17307 12318 4232 -1687 -3577
13220 -3577 -3542 -1950 3293 7226 10326 13718 18784 22427 23370 25030 26046 21437 20635 23901 32201 39217
13204 39217 46445 52497 58923 68399 78354 90453 105845 125573 157061 203890 279616 392566
$$ packed form
13316b144j725J515K909J812K989M894m607m074n9m67n11J043P07k353l158M63
13300b766K457K69m93Q08r19Q09L733J993j568j478j037j760p94k033K068N212
13284D501j83k056J691K460k779O68j835j554L395L95o49N361N719J811j757k290
13268A2898n291m802L478J296n233k487l081Q40L848K273J03j007K762N3J402
13253G052O3J821K53P98l242J04J407J252K314k73M73K638K12k911J768p731j336
13236D662L447K518J07k304K660J691n89J778R2p53J980K018m989q086n919j890
13220c577L5J592N243L933L100L392N066L643R43J660J016m609q02L266Q300P016
13204C9217P228O052O426R476R955J2099J5392J9728L1488M6829P5726J12950
$$ plain form
13192 392566 558602 764673 967577 1115893 1175647 1147700 1049921 898112 717486 533753
13182 533753 385028 276905 203113 156809 128684 111614 101890 93119 84933 79448 79679 89984
13170 89984 106853 115096 103327 76454 53848 40077 31531 29589 26585 20121 19111 16251 14623
13157 14623 18968 19339 22655 19161 13446 12266 16020 15225 10327 6222 3791 1796 -1990 -3318 -2866
13142 -2866 -1441 653 5045 11878 16604 14539 10071 9642 12055 13491 16962 20083 20798 24962 27598
13127 27598 30656 29340 22221 13937 9796 9847 13148 12294 12174 13895 15164 15973 15970 13903 12553 12895 16936
13110 16936 18251 16584 15191 14933 14591 14959 16606 17829 17465 20297 16219 10472 7586 6822 4944 8836
13094 8836 8722 9845 8181 4959 4544 10303 13360 12817 10890 11554 12821 14661 12185 14170 14505 13902
$$ packed form
13192C92566J66036K06071K02904J48316N9754k7947r7779j51809j80626j83733
13182E33753j48725j08123p3792m6304k8125j7070r724q771q186n485K31J0305
13170H9984J6869Q243j1769k6873k2606j3771q546j942l004o464j010k860j628
13157A4623M345L71L316l494n715j180L754p95m898m105k431j995l786j328M52
13142b866J425K094M392O833M726k065m468m29K413J436L471L121P15M164K636
13127B7598L058j316p119q284m141N1L301q54j20J721J269Q09lk067j350L42M041
13110A6936J315j667j393k58l42L68J647J223l64K832m078n747k886p64j878L892
13094H836j14J123j664l222m15N759L057n43j927O64J267J840k476J985L35o03
$$ plain form
13078 13902 13635 14436 18467 15563 14726 17448 21676 25834 25035 27456 32250 33933 37681 40030 41074
13063 41074 36947 35931 38232 37427 35590 35647 37281 35019 29872 22506 18112 21260 23571 27454 31928
13048 31928 32203 31579 32675 37537 39354 43490 50830 63967 72516 79212 85920 87283 87967 88796 92112
13033 92112 90596 83285 80763 80337 85161 87926 90296 93673 98433 107101 108295 108327 107205 103736 98819
13018 98819 87565 74035 66857 61329 57312 56531 55010 53428 51089 48368 45733 43358 38180 30561
13004 30561 28727 31220 37379 39279 42905 48705 51579 52970 55214 53575 51211 47885 45532 44462
12990 44462 37725 31267 26157 25876 23860 22375 26209 30541 35792 38991 42153 45107 41833 46225 48682
12975 48682 45025 45101 46997 49631 53466 51942 50952 49595 41574 36167 30178 23397 18327 20661 22566
$$ packed form
13078A3902k67Q01M031k904q37K722M228M158p99K421M794J683L748K349J044
13063D1074m127j016K301q05j837N7J634k262n147p366m394L148K311L883M474
13048C1928K75o24J096M862J817M136P340J3137Q549O696O708J363O84Q29L316
13033I2112j516p311k522m26M824K765K370L377M760Q668J194L2j122l469m917
13018I8819j1254j3530p178n528m017p81j521j582k339k721k635k375n178p619
13004C0561j834K493O159J900L626N800K874J391K244j639k364l326k353j070
12990D4462o737o458n110k81k016j485L834M332N251L199L162K954l274M392K457
12975D8682l657P6J896K634L835j524r90j357q021n407n989o781n070K334J905
$$ plain form
12960 22566 23317 20829 18318 19128 15952 9444 12402 15170 21529 29356 35016 42229 50138 47756 43670
12945 43670 40287 40428 42018 44903 49129 50293 52160 53436 54873 54019 50859 48220 46495 49077 55591
12930 55591 61118 64335 65744 62834 61693 58800 56866 50549 44551 36487 21363 10009 7194 11088
12916 11088 21679 38381 51823 70024 88538 103622 117170 135421 151892 166274 176169 183296
12904 183296 193538 206907 224957 235391 240064 241058 242608 241067 232046 219997 206110 190850 174214
12891 174214 157940 139497 128608 128858 130963 136848 147091 155530 167599 185008 210350 249149
12879 249149 306059 365212 413104 466521 518355 551013 559615 556441 536373 498369 447336 394412
12867 394412 348210 295042 249874 226434 213822 205444 207137 207181 206153 205813 202093 201661 208254 218948
$$ packed form
12960B2566P51k488k511Q10l176o508K958K768O359P827N660P213P909k382m086
12945D3670l383J41J590K885M226J164J867J276J437q54l160k639j725K582O514
12930E5591N527L217J409k910j141k893j934o317n998q064j5124j1354k815L894
12916A1088J0591J6702J3442J8201J8514J5084J3548J8251J6471J4382R895P127
12904A83296J0242J3369J8050J0434M673R94J550j541r021j2049j3887j5260j6636
12891A74214j6274j8443j0889K50K105N885J0243Q439J2069J7409K5342L8799
12879B49149N6910N9153M7892N3417N1834L2658Q602l174k0068l8004n1033n2924
12867C94412m6202n3168m5168k3440j2612q378J693M4j028l40l720m32O593J0694
$$ plain form
12853 218948 233443 253389 275556 298513 321613 340609 350425 357194 364239 369825 377959 394202
12841 394202 413145 423988 434866 441656 437583 430665 418882 409138 404704 409962 413333 420843 433581
12828 433581 441298 449927 459404 468444 478776 487970 497463 505317 521272 544266 570322 602166 637441
12815 637441 673779 711774 756372 797387 823670 843305 869566 900357 932491 959779 991933
12804 991933 1030432 1077904 1129955 1173700 1225308 1283696 1356437 1442753 1547104 1670067 1806712
12793 1806712 1952866 2112359 2288152 2488006 2719216 2989250 3328141 3761060 4317770
12784 4317770 5033811 5930660 7007245 8227558 9541521 10925901 12387478 14001185
12776 14001185 15959845 18615297 22532175 28630831 38365303 53884852 77611182 110337667
$$ packed form
12853B18948J4495J9946K2167K2957K3100J8996R816O769P045N586Q134J6243
12841C94202J8943J0843J0878O790m073o918j1783r744m434N258L371P510J2738
12828D33581P717Q629R477R040J0332R194R493P854J5955K2994K6056L1844L5275
12815F37441L6338L7995M4598M1015K6283J9635K6261L0791L2134K7288L2154
12804I91933L8499M7472N2051M3745N1608N8388P2741Q6316J04351J22963J36645
12793A806712J46154J59493J75793J99854K31210K70034L38891M32919N56710
12784D317770P16041Q96849J076585J220313J313963J384380J461577J613707
12776A4001185J958660K655452L916878O098656R734472J5519549K3726330L2726485
$$ plain form
12768 110337667 148264195 182688675 205090201 212121147 204765340 185087875 155892409
12761 155892409 122128064 90124647 64637671 46876897 35341697 27913753 23016152
12754 23016152 19668261 17242342 15318100 13633865 12070230 10601569 9240632 8019336
12746 8019336 6955255 6060239 5327933 4722384 4221365 3806405 3454267 3158789 2904762
12737 2904762 2684040 2493532 2325194 2169684 2026829 1897060 1773767 1656836 1552532
12728 1552532 1459172 1373623 1297575 1237951 1188012 1138998 1090039 1035359 980958 925864 879664
12717 879664 838508 802709 771686 746990 724001 704304 692023 673897 652249 630441 605387
12706 605387 582305 560799 542656 527636 515077 506723 505729 505351 510420 519774 534335 553196 578785
$$ packed form
12768A10337667L7926528L4424480K2401526P030946p355807j9677465k9195466
12761A55892409l3764345l2003417k5486976j7760774j1535200p427944m897601
12754B3016152l347891k425919j924242j684235j563635j468661j360937j221296
12746H019336j064081q95016p32306o05549n01019m14960l52138k95478k54027
12737B904762k20722j90508j68338j55510j42855j29769j23293j16931j04304
12728A552532r3360q5549p6048n9624m9939m9014m8959n4680n4401n5094m6200
12717H79664m1156l5799l1023k4696k2989j9697j2281j8126k1648k1808k5054
12706F05387k3082k1506j8143j5020j2559q354r94l78N069R354J4561J8861K5589
$$ plain form
12693 578785 611755 648911 690592 739680 800001 870785 954202 1052065 1158061 1255797 1338773
12682 1338773 1396770 1412272 1383643 1310761 1205948 1080305 944830 813198 699640 610786
12672 610786 539606 487741 444035 410013 388272 369967 359666 355733 360514 370039 391925 430917
12660 430917 481524 545771 624768 719171 821382 909501 967304 991852 983565 953898 902685
12649 902685 829521 746703 660507 581437 508194 449880 411905 381363 362160 354897 352838 348739
12637 348739 341134 329428 320778 301427 283636 266437 244966 226011 204747 182872 165688 151120
12625 151120 136556 122333 109268 103442 102709 107540 116237 126446 139184 156940 171891 182382
12613 182382 186857 189364 187433 175653 155670 139037 128009 116466 106749 95067 87886 82719 76200
$$ packed form
12693E78785L2970L7156M1681M9088O0321P0784Q3417R7863J05996R7736Q2976
12682A338773N7997J5502k8629p2882j04813j25643j35475j31632j13558q8854
12672F10786p1180n1865m3706l4022k1741j8305j0301l933M781R525K1886L8992
12660D30917N0607O4247P8997R4403J02211Q8119N7803K4548q287k9667n1213
12649I02685p3164q2818q6196p9070p3243n8314l7975l0542j9203p263k059m099
12637C48739p605j1706q650j9351j7791j7199k1471j8955k1264k1875j7184j4568
12625A51120j4564j4223j3065n826p33M831Q697J0209J2738J7756J4951J0491
12613A82382M475K507j931j1780j9983j6633j1028j1543r717j1682p181n167o519
$$ plain form
12600 76200 77570 79797 79427 81877 85607 95149 99502 100771 101332 104115 103819 108096 112353 109326 109400 107343
12584 107343 107411 112925 123928 139433 160361 181252 198288 214869 231101 248228 261249 277116
12572 277116 300837 335317 395081 491804 646176 880306 1206827 1614274 2050295 2437419
12562 2437419 2701802 2766990 2583941 2186045 1684720 1220170 868909 637345 487522 393769
12552 393769 335330 301259 274837 259977 247500 232367 219863 203823 180310 157774 136469
12541 136469 121112 107266 93839 79708 69026 60492 54670 52782 53004 47361 49583 55978 60318
12528 60318 63507 65458 66633 65060 66245 65961 67639 74790 87018 109547 133308 142727 124374 102541
12514 102541 88063 77392 70017 67480 64625 58622 54912 55777 59115 58991 59907 61486 61271 58952 57473
$$ packed form
12600G6200J370K227l70K450L730R542M353J269N61K783k96M277M257l027P4k057
12584A07343O8N514J1003J5505K0928K0891J7036J6581J6232J7127J3021J5867
12572B77116K3721L4480N9764R6723J54372K34130L26521M07447M36021L87124
12562B437419K64383O5188j83049l97896n01325m64550l51261k31564j49823r3753
12552C93769n8439l4071k6422j4860j2477j5133j2504j6040k3513k2536k1305
12541A36469j5357j3846j3427j4131j0682q534n822j888K22n643K222O395M340
12528F0318L189J951J175j573J185k84J678P151J2228K2529K3761R419j8353k1833
12514A02541j4478j0671p375k537k855o003l710Q65L338j24R16J579k15k319j479
$$ plain form
12499 57473 61471 66015 64089 59471 59490 64194 67125 71822 72276 65717 62030 59883 58008 56262 49259
12484 49259 46240 49245 55349 61460 69225 76232 88337 106020 143687 202807 277257 334026 312133
12471 312133 222677 149784 108274 87990 76772 66575 60308 65186 69517 67698 67671 67570 66441
12458 66441 66670 62761 55153 51547 50895 53669 55892 58188 60101 63413 60765 56519 53619 54598 51413
12443 51413 49959 48781 51465 53516 58909 64502 68814 73070 78187 86445 98547 124688 174617 248199
12429 248199 329739 350812 281227 190943 138796 110814 96350 87703 87601 83506 82238 86096 90356
12416 90356 102138 126240 161210 204295 252698 295444 303522 270016 222554 189017 168528 165390
12404 165390 162681 160045 155596 151743 153951 160145 165788 175695 181334 180217 179244 185176 197189 210874
$$ packed form
12499E7473L998M544j926m618J9M704K931M697M54o559l687k147j875j746p003
12484D9259l019L005O104O111P765P007J2105J7683L7667N9120P4450N6769k1893
12471C12133q9456p2893m1510k0284j1218j0197o267M878M331j819k7j01j129
12458F6441K29l909p608l606o52K774K223K296J913L312k648m246k900R79l185
12443E1413j454j178K684K051N393N593M312M256N117Q258J2102K6141M9929P3582
12429B48199Q1540K1073o9585r0284n2147k7982j4464q647j02m095j268L858M260
12416I0356J1782K4102L4970M3085M8403M2746Q078l3506m7462l3537k0489l138
12404A65390k709k636m449l853K208O194N643R907N639j117r73N932J2013J3685
$$ plain form
12390 210874 225342 244099 259778 271734 283583 304135 316434 297406 271063 259700 262883 278963
12378 278963 321639 394615 488661 583212 645423 651834 593716 506065 416939 343056 292995 263524
12366 263524 249633 240002 236502 243109 253184 264845 268895 264633 250327 234984 219482 207348
12354 207348 204652 209698 214515 219254 216658 208127 204594 209764 216718 234622 262694 312718 395997
12341 395997 532560 724617 971691 1230460 1422740 1481006 1400762 1229804 1005668 771738
12331 771738 566066 413288 306787 239831 196651 166378 150639 139736 132551 125188 116634
12320 116634 108664 103381 96442 86404 77408 71760 69512 69100 68978 63296 59481 56992 54013 48575
12306 48575 42549 32534 24621 19210 15984 13850 15312 20437 20759 21361 19605 14133 8766 8280 3187
$$ packed form
12390B10874J4468J8757J5679J1956J1849K0552J2299j9028k6343j1363L183J6080
12378B78963M2676P2976R4046R4551O2211O411n8118q7651q9126p3883n0061k9471
12366B63524j3891r631l500O607J0075J1661M050m262j4306j5343j5502j2134
12354B07348k696N046M817M739k596q531l533N170O954J7904K8072N0024Q3279
12341C95997J36563J92057K47074K58769J92280N8266q0244j70958k24136k33930
12331G71738k05672j52778j06501o6956m3180l0273j5739j0903p185p363q554
12320A16634p970n283o939j0038q996n648k248m12j22n682l815k489k979n438
12306D8575o026j0015p913n411l226k134J462N125L22O02j756n472n367m86n093
$$ plain form
12291 3187 5948 8970 6668 7116 10849 10391 9211 9701 15383 16391 15241 14087 11902 8569 7139
12276 7139 8191 9257 11784 15626 19867 19857 21413 21759 16678 14470 14937 16613 15184 9611 5685 7625
12260 7625 11143 12119 13372 15919 14452 9984 10784 16348 20391 19158 19326 20474 17054 13912 11248
12245 11248 10736 5808 2936 2504 5282 2166 414 1739 4666 5725 3523 3070 4748 7451 5821
12230 5821 4351 6423 5967 9610 12287 14624 14600 15713 15755 12773 11836 13247 11779 11432 10365 12967
12214 12967 13151 12376 11264 12718 10410 6269 2194 2277 6835 7135 6842 4763 2693 2318 2625 1818 3242
12197 3242 2216 3573 7621 9068 8773 6643 5174 5873 6545 5341 4853 1149 5579 6577 6473 11069
12181 11069 9086 6745 2754 619 -679 2091 4923 5088 3337 2149 2873 -960 -3897 -1504 -2445
$$ packed form
12291C187K761L022k302M48L733m58j180M90N682J008j150j154k185l333j430
12276G139J052J066K527L842M241j0J556L46n081k208M67J676j429n573l926J940
12260G625L518R76J253K547j467m468Q00N564M043j233J68J148l420l142k664
12245A1248n12m928k872m32K778l116j752J325K927J059k202m53J678K703j630
12230E821j470K072m56L643K677K337k4J113M2k982r37J411j468l47j067K602
12214A2967J84p75j112J454k308m141m075Q3M558L00k93k079k070l75L07q07J424
12197C242j026J357M048J447k95k130j469O99O72j204m88l704M430R98j04M596
12181A1069j983k341l991k135j298K770K832J65j751j188P24l833k937K393r41
$$ plain form
12166 -2445 -3319 1301 4200 3962 2918 765 3157 7176 10648 9349 770 973 3639 7666 3368
12151 3368 4981 6803 4548 -522 -1474 -3398 -654 2212 4208 4046 8519 9603 10629 13382 12554
12136 12554 12369 13357 11139 7060 5817 4594 3654 4251 3061 3731 3845 5228 1673 -186 1256 2685
12120 2685 2472 1749 4926 7267 4405 1311 1923 4640 960 -5597 -3315 2220 4064 5130 3229
12105 3229 884 1886 3510 4209 3110 57 -540 3761 636 -4967 -7294 -2373 -712 1912 834
12090 834 -3387 -3992 -2153 4518 10058 7140 9945 10598 7315 7188 3073 -1475 -258 -468 -496 3845
12074 3845 1033 -965 -1349 -1727 -4239 -1926 67 983 -990 -3499 -3209 -2628 2676 2974 -1768 -4893
12058 -4893 -3663 -1481 2929 7272 5327 1799 2399 3155 4122 3336 2718 5058 8717 10549 11703 18914
$$ packed form
12166b445q74M620K899k38j044k153K392M019L472j299q579K03K666M027m298
12151C368J613J822k255n070r52j924K744K866J996j62M473J084J026K753q28
12136A2554j85R88k218m079j243j223r40N97j190O70J14J383l555j859J442J429
12120B685k13p23L177K341k862l094O12K717l680o557K282N535J844J066j901
12105C229k345J002J624O99j099l053n97M301l125n603k327M921J661K624j078
12090H34m221o05J839O671N540k918K805O53l283j27m115m548J217k10k8M341
12074C845k812j998l84l78k512K313J993R16j973k509K90N81N304K98m742l125
12058d893J230K182M410M343j945l528O00P56R67p86o18K340L659J832J154P211
$$ plain form
12042 18914 33672 42117 32927 17252 11757 13280 10171 8747 9942 6936 2344 691 -639 2165
12028 2165 7573 8409 10828 13744 15443 13119 10965 9706 7702 5414 508 -1264 19 988 6151
12013 6151 6829 1960 803 314 304 -860 -768 -1880 -1395 -3299 -2299 603 1664 4120 9289 12815
11997 12815 12273 15637 17314 14303 18088 16838 17116 13562 9983 10846 8706 6447 6013 7358 5458
11982 5458 641 -1366 -328 2615 6016 3432 5668 7167 6620 8337 6514 -156 -356 3776 4140
11967 4140 1557 1450 2372 3053 3657 6562 12111 14320 12295 10584 7507 5396 7054 8396 6494 6184
11951 6184 8892 7011 4705 6821 5431 2613 4233 3508 3652 4594 3808 -523 -4845 -1619 914 2890
11935 2890 1851 1272 -543 998 5820 8913 10277 9427 6919 5259 2038 1916 1478 5945 9271 8340
$$ packed form
12042A8914J4758Q445r190j5675n495J523l109j424J195l006m592j653j330K804
12028B165N408Q36K419K916J699k324k154j259k004k288m906j772J283R69N163
12013F151O78m869j157m89j0j164R2j112M85j904J000K902J061K456N169L526
11997A2815n42L364J677l011L785j250K78l554l579Q63k140k259m34J345j900
11982E458m817k007J038K943L401k584K236J499n47J717j823o670k00M132L64
11967D140k583j07R22O81O04K905N549K209k025j711l077k111J658J342j902l10
11951F184K708j881k306K116j390k818J620p25J44R42p86m331m322L226K533J976
11935B890j039n79j815J541M822L093J364q50k508j660l221j22m38M467L326r31
$$ plain form
11919 8340 4984 4136 2827 2859 3547 6237 6464 8607 8147 8476 6206 2517 693 -833 1673 1268 1151
11902 1151 620 -4358 -4225 -2251 2260 5306 1558 -198 -298 1390 1573 3271 -433 1783 1435 1626
11886 1626 286 -3381 -4668 -6861 -7419 -7263 -8460 -10447 -11764 -9389 -12691 -12555 -7074 -4574 -4421 -5255
11870 -5255 -4188 -7168 -8750 -7941 -7623 -11363 -12085 -6860 -5959 -6298 -7348 -3073 -1383 -458 -903 -567 -564
11853 -564 2793 5653 4046 2419 5617 6206 7784 9689 6513 2409 313 341 -2303 -2790 -11 3036
11837 3036 5511 8375 3801 -1923 -239 5570 8549 8693 3109 2019 3496 5803 12267 12817 7393
11822 7393 4089 3802 4831 3947 5989 7752 10341 9385 9544 6234 3422 2266 4402 4806 4853 7143
11806 7143 7171 9384 12830 13883 12048 12589 12719 7578 2794 1869 -175 -3343 -5692 -5159 -3969 -1217
$$ packed form
11919H340l356q48j309L2O88K690K27K143m60L29k270l689j824j526K506m05j17
11902A151n31m978J33J974M511L046l748j756j00J688J83J698l704K216l48J91
11886A626j340l667j287k193n58J56j197j987j317K375l302J36N481K500J53q34
11870e255J067k980j582Q09L18l740p22N225R01l39j050M275J690R25m45L36L
11853e64L357K860j607j627L198N89J578J905l176m104k096K8k644m87K779L047
11837C036K475K864m574n724J684N809K979J44n584j090J477K307O464N50n424
11822G393l304k87J029q84K042J763K589r56J59l310k812j156K136M04M7K290
11806G143K8K213L446J053j835N41J30n141m784r25k044l168k349N33J190K752
$$ plain form
11790 -1217 617 3907 6610 5576 4131 2746 1739 3976 6111 9796 12003 11016 8391 8386 9990 10561
11774 10561 4658 -1133 -5576 -5234 -5893 -1528 -315 348 1747 2483 5610 6938 6812 10435 12337 7703
11758 7703 9594 15071 16955 14062 11838 9278 7550 2539 -1827 -2845 -1690 -1314 -2619 -3101 -3158 -4439
11742 -4439 -668 -1323 -3876 -5412 -6822 -6999 -3662 2569 3768 1102 1581 -1564 -6126 -6915 -2282 -836
11726 -836 1470 -2468 -992 534 4528 12845 16223 19132 21297 21530 20489 18908 19808 19867 18927 19473
11710 19473 15104 14581 17521 22745 22881 17842 12472 7192 915 1457 5376 9395 7854 3913 270
11695 270 -1595 -2224 -1476 -1572 -1223 -4722 -6098 -6150 -4500 -4186 -2255 1266 847 -2456 -4913 -5384 -486
11678 -486 -1630 49 3888 8711 7626 8139 11641 11677 8592 5247 127 -3668 -2441 -385 -3449 -692
$$ packed form
11790a217J834L290K703j034j445j385j007K237K135L685K207r87k625nJ604N71
11774A0561n903n791m443L42o59M365J213O63J399P36L127J328j26L623J902m634
11758G703J891N477J884k893k224k560j728n011m366j018J155L76j305m82n7j281
11742d439L771o55k553j536j410j77L337O231J199k666M79l145m562p89M633J446
11726h36K306l938J476J526L994Q317L378K909K165K33j041j581R00N9r40N46
11710A9473m369n23K940N224J36n039n370n280o277N42L919M019j541l941l643
11695B70j865o29P48r6L49l499j376n2J650L14J931L521m19l303k457m71M898
11678d86j144J679L839M823j085N13L502L6l085l345n120l795J227K056l064K757
$$ plain form
11662 -692 -590 -2632 -2298 -1429 -1060 1782 4020 4833 778 -2273 -1191 947 2065 1346 -25 1044
11646 1044 -143 -2049 -2756 -4157 -5522 -2100 1716 739 676 -496 -7405 -8722 -3313 3985 759 -1349
11630 -1349 -2080 -2439 729 1385 1022 2692 5167 5424 3047 -156 -386 -1585 -4957 -6793 -2711 -2437
11614 -2437 1031 5440 4172 -1552 -6180 -8636 -9239 -8857 -6916 -3892 3789 6437 5366 4509 551
11599 551 -5296 -5741 -2458 -562 -425 1769 2380 4539 2692 1493 -319 -1549 -3237 -1628 -974 636
11583 636 532 869 2260 5348 5746 5227 5082 6209 4302 2308 3628 3333 -677 -1616 -14 894 1743
11566 1743 -2814 40 2689 -655 -4167 -4841 -3804 -272 3482 8461 11741 8097 6665 4554 1907
11551 1907 2719 455 -4862 -5898 -686 -467 -1049 3292 3078 1208 -1771 -6625 -1593 -224 -2761 -4717
$$ packed form
11662f92J02k042L34Q69L69K842K238Q13m055l051J082K138J118p19j371J069
11646A044j187j906p07j401j365L422L816r77o3j172o909j317N409P298l226k108
11630a349p31l59L168O56l63J670K475K57k377l203k30j199l372j836M082K74
11614b437L468M409j268n724m628k456o03L82J941L024P681K648j071q57l958
11599E51n847m45L283J896J37K194O11K159j847j199j812j230j688J609O54J610
11583F36j04L37J391L088L98n19j45J127j907j994J320k95m010r39J602R08Q49
11566A743m557K854K649l344l512o74J037L532L754M979L280l644j432k111k647
11551A907Q12k264n317j036N212K19n82M341k14j870k979m854N032J369k537j956
$$ plain form
11535 -4717 -3656 3274 5536 5102 3679 2201 -787 1102 -560 2924 2831 42 1909 7024 8369
11520 8369 5718 4487 4959 -946 -5239 -5677 -2092 -2118 -950 334 6306 7812 6281 3962 5090 4501
11504 4501 4754 4467 1403 -501 -1529 -2798 -1722 798 1459 -919 20 2575 2957 -207 491 386
11488 386 427 2921 4296 4565 3510 187 -3581 -5580 -5581 -1592 3174 1599 536 3201 1677 901 929
11471 929 3370 2656 1325 -2466 -6618 -6394 -6140 -8373 -3453 2961 4226 3184 1030 3500 1966 3759
11455 3759 6753 7596 2655 2345 772 652 2961 6141 7468 7395 5476 2018 -3087 -2700 231 -1916
11439 -1916 -4572 -407 2590 690 -1752 -3067 -5156 -5476 -2716 -4954 -4414 -2524 -2108 -794 -892 -4346
11423 -4346 -1880 -316 -3198 -2693 -1875 -2987 -3130 521 2832 2438 -1582 -5143 -6629 -2678 -989 799
$$ packed form
11535d717J061O930K262m34j423j478k988J889j662L484r3k789J867N115J345
11520H369k651j231M72n905m293m38L585k6J168J284N972J506j531k319J128n89
11504D501K53k87l064j904j028j269J076K520O61k378R39K555L82l164O98j05
11488C86M1K494J375K69j055l323l768j999jL989M766j575j063K665j524p76K8
11471I29K441p14j331l791m152K24K54k233M920O414J265j042k154K470j534J793
11455C759K994Q43m941l10j573j20K309L180J327p3j919l458n105L87K931k147
11439a916k656M165K997j900k442j315k089l20K760k238N40J890M16J314r8l454
11423d346K466J564k882N05Q18j112j43L651K311l94m020l561j486L951J689J788
$$ plain form
11407 799 2217 4033 5681 1473 -1111 9 -2587 -4418 -2647 -985 1054 2742 2891 5811 4691
11392 4691 2470 1294 -2001 915 -1449 -3115 3669 7617 9162 7331 3644 3190 3027 -502 139
11377 139 -967 3056 4646 3589 4677 5679 3233 3269 565 424 4459 5721 3256 1931 5004 4668
11361 4668 5225 5398 6974 4945 1147 -1505 2001 3993 4218 6277 9555 10845 9933 9066 6525 9080
11345 9080 7426 9287 13136 12613 9992 10223 7836 9270 8283 6222 6331 3325 3122 3860 2757 1361
11329 1361 3058 1876 5471 3904 1970 2392 1304 -1945 -2954 339 5358 8839 9023 8626 6930
11314 6930 10171 8443 7534 6033 10714 11207 8695 9304 9427 12180 12060 7744 5356 9097 9163 10715
11298 10715 10793 8282 11756 14035 16670 20192 24983 30050 33614 35721 32491 24506 17741 17975 15401
$$ packed form
11407G99J418J816J648m208k584J120k596j831J771J662K039J688J49K920j120
11392D691k221j176l295K916k364j666O784L948J545j831l687m54j63l529O41
11377A39j106M023J590j057J088J002k446L6k704j41M035J262k465j325L073l36
11361D668N57J73J576k029l798k652L506J992K25K059L278J290r12q67k541K555
11345I080j654J861L849n23k621K31k387J434r87k061J09l006k03P38j103j396
11329A361J697j182L595j567j934M22j088l249j009L293N019L481J84l97j696
11314F930L241j728r09j501M681M93k512O09J23K753j20m316k388L741O6J552
11298A0715P8k511L474K279K635L522M791N067L564K107l230p985o765K34k574
$$ plain form
11283 15401 12164 12269 11455 10324 7547 9174 10531 10994 13232 12535 5785 3643 6789 8974 11439
11268 11439 11993 10761 12464 13483 11967 13749 15499 15876 14225 14999 12648 10461 7218 6013 9083
11253 9083 10997 10349 14097 13661 8774 7604 7134 9328 10496 11338 6842 5125 2633 1203 2183 1820
11237 1820 3220 1770 -313 -1089 1698 -341 -49 -1675 371 3622 6836 11061 12041 9194 5184
11222 5184 4165 5402 6441 9857 16931 17120 12329 17243 21935 21153 19188 19304 19399 16787 16326 16483
11206 16483 20072 22859 25997 34989 47423 60228 70444 76346 79739 78237 68122 55679 43608
11193 43608 27931 20455 18483 17472 17790 16551 12950 9396 9989 9857 11742 9474 8317 11035 6528
11178 6528 -487 -5344 -5161 -2011 -648 3213 6394 7851 11675 15175 17916 16403 15165 12398 8195
$$ packed form
11283A5401l237J05q14j131k777J627J357M63K238o97o750k142L146K185K465
11268A1439N54j232J703J019j516J782J750L77j651P74k351k187l243j205L070
11253I083J914o48L748m36m887j170m70K194J168Q42m496j717k492j430R80l63
11237A820J400j450k083p76K787k039K92j626K046L251L214M225R80k847m010
11222E184j019J237J039L416P074J89m791M914M692p82j965J16R5k612m61J57
11206A6483L589K787L138Q992J2434J2805J0216N902L393j502j0115j2443j2071
11193D3608j5677p476j972j011L18j239l601l554N93j32J885k268j157K718m507
11178F528p015m857J83L150J363L861L181J457L824L500K741j513j238k767m203
$$ plain form
11163 8195 4553 3410 2451 3677 5410 11017 12820 10992 8057 3266 -580 -3228 -528 4230 5798
11148 5798 7645 10835 9841 7378 11129 11013 8446 9408 11389 16252 17713 14580 11089 10462 9846 9812
11132 9812 6698 6843 6153 6412 7780 8586 9148 9551 13968 12627 13017 12227 9115 8528 10512 10446 10189 11348
11114 11348 12974 12344 10126 7283 5175 2549 3149 3710 2568 3952 6860 10745 11534 11527 10250 8363
11098 8363 10221 14343 19410 21958 18029 12965 10998 11888 11959 10620 8664 8443 11371 15573 18113 16148
11082 16148 11198 9605 9401 10515 13266 14190 13123 13862 15925 17273 13637 10834 13025 14421 12345
11067 12345 8927 10504 11028 9043 7948 11903 9033 8355 10894 12129 12857 12037 12306 13304 12670 14419
11051 14419 14961 15316 14974 12418 12493 12450 12985 12613 19551 20943 18329 14140 12734 9510 2870 -3683 -3187
$$ packed form
11163H195l642j143r59J226J733N607J803j828k935m791l846k648K700M758J568
11148E798J847L190r94k463L751j16k567R62J981M863J461l133l491o27o16l4
11132I812l114J45o90K59J368Q06N62M03M417j341L90p90l112n87J984o6k57J159
11114A1348J626o30k218k843k108k626O00N61j142J384K908L885P89pj277j887
11098H363J858M122N067K548l929n064j967Q90P1j339j956k21K928M202K540j965
11082A6148m950j593k04J114K751R24j067P39K063J348l636k803K191J396k076
11067A2345l418J577N24j985j095L955k870o78K539J235P28q20K69R98o34J749
11051A4419N42L55l42k556P5m3N35l72O938J392k614m189j406l224o640o553M96
$$ plain form
11034 -3187 2478 6230 6904 9588 8318 7331 12368 9321 7174 10137 8085 7263 12108 19447 23416
11019 23416 27516 33120 38803 33949 27038 21786 15579 8881 6691 5302 3737 3959 5717 8203 6362
11004 6362 3181 4057 6458 6167 6035 10519 11723 12113 14606 14379 12748 13295 14209 17442 19643 21888
10988 21888 20660 17580 16876 19050 20638 20131 15965 13174 12770 8536 11340 9793 9363 10155 13965 16585
10972 16585 11624 8611 8475 13549 17462 17402 18022 18214 18687 21706 23067 19914 14898 13732 14350 15542
10956 15542 15474 12993 13952 18765 22502 22359 21418 21059 21801 20161 21134 24115 24727 24879 20197 13799 13766
10939 13766 20308 23972 21158 13053 8763 12811 16085 17197 16721 14880 13151 9699 9419 12710 17334
10924 17334 18169 17711 17323 17247 16567 15915 18332 16908 17311 17975 19113 18873 20257 16770 12971 13147 14962
$$ packed form
11034c187N665L752O74K684j270r87N037l047k147K963k052q22M845P339L969
11019B3416M100N604N683m854o911n252o207o698k190j389j565K22J758K486j841
11004F362l181Q76K401k91j32M484J204L90K493k27j631N47R14L233K201K245
10988B1888j228l080p04K174J588n07m166k791m04m234K804j547m30P92L810K620
10972A6585m961l013j36N074L913o0O20J92M73L019J361l153n016j166O18J192
10956A5542o8k481R59M813L737j43r41l59P42j640R73K981O12J52m682o398l3
10939A3766O542L664k814q105m290M048L274J112m76j841j729l452k80L291M624
10924A7334Q35m58l88p6o80o52K417j424M03O64J138k40J384l487l799J76J815
$$ plain form
10907 14962 17602 23340 21766 18682 14934 13823 18141 23937 26604 25645 20362 18835 16994 13846 13899
10892 13899 14702 16405 18961 18997 19428 20321 21207 22820 25140 25141 25484 27125 28948 28838 30806 34002 33977 33087
10874 33087 31371 26614 25721 25914 30816 33810 31628 29455 30941 29628 27536 29957 33360 33192 31079
10859 31079 27693 30231 26511 24295 22485 22148 23599 26344 26128 28859 28579 27593 23950 21981 23951
10844 23951 29534 28091 27601 23584 25243 28356 27397 25694 28191 28590 26979 24784 24259 28190 32722
10829 32722 32038 32398 31244 32002 32911 30810 29155 28027 27628 25457 25651 27519 28750 25467 25092 26783
10813 26783 27100 28723 30649 31245 31696 33027 30397 27112 27853 28943 26880 27703 28349 32061 32339 29327
10797 29327 30361 33890 35774 36891 38118 43184 42318 41610 43846 43671 38662 33621 35007 35685 32872
$$ packed form
10907A4962K640N738j574l084l748j111M318N796K667r59n283j527j841l148N3
10892A3899Q03J703K556L6M31Q93Q86J613K320JL43J641J823j10J968L196k5q90
10874C3087j716m757q93J93M902K994k182k173J486j313k092K421L403j68k113
10859C1079l386K538l720k216j810l37J451K745k16K731k80r86l643j969J970
10844B3951N583j443m90m017J659L113r59j703K497L99j611k195n25L931M532
10829C2722o84L60j154P58R09k101j655j128l99k171J94J868J231l283l75J691
10813B6783L17J623J926N96M51J331k630l285P41J090k063Q23O46L712K78l012
10797B9327J034L529J884J117J227N066q66p08K236j75n009n041J386O78k813
$$ plain form
10782 32872 33110 32786 27842 26292 27605 30026 28750 30542 36583 38529 38132 41044 41881 42133 43978 42800
10766 42800 43783 42040 38731 38790 41676 39745 39665 39213 42139 46068 47380 46261 45459 44887 48141 52221
10750 52221 56334 58926 60513 60873 64884 62447 50497 37311 30689 25620 21821 24473 26547 26144
10736 26144 28689 29455 33407 36284 38250 38462 38837 38107 41355 46302 51045 54204 58488 55578 50266
10721 50266 49523 51078 53774 52425 54673 60820 63070 64482 68105 69211 67844 69816 70628 73658 73787
10706 73787 70824 69338 73342 76099 83180 88044 94557 103013 112459 123627 132530 142521 162109 181890
10692 181890 215717 267180 340347 437659 569456 741349 943355 1153326 1352196 1496202
10682 1496202 1560921 1543834 1446296 1283859 1094315 899661 714964 558990 442431 351819
$$ packed form
10782C2872K38l24m944j550J313K421j276J792O041J946l97K912Q37K52J845j178
10766D2800R83j743l309N9K886j931q0m52K926L929J312j119q02n72L254M080
10750E2221M113K592J587L60M011k437j1950j3186o622n069l799K652K074m03
10736B6144K545P66L952K877J966K12L75p30L248M947M743L159M284k910n312
10721E0266p43J555K696j349K248O147K250J412L623J106j367J972Q12L030J29
10706G3787k963j486M004K757P081M864O513Q456R446J1168Q903R991J9588J9781
10692A81890L3827N1463P3167R7312J31797J71893K02006K09971J98870J44006
10682A496202O4719j7087r7538j62437j89544j94654j84697j55974j16559r0612
$$ plain form
10672 351819 285291 247207 217829 192974 175215 158627 144425 131503 116724 105620 97266 88704
10660 88704 81147 76578 74692 70827 69011 68041 66578 66373 67527 65861 66276 67638 70232 68205 64653
10645 64653 62356 65325 65484 70211 78051 84995 84985 84919 86527 93015 98528 106645 110082 111987 112215 111126
10629 111126 110962 118113 122880 124705 124389 123886 127741 134483 146350 159977 175667 195666 217310 238757
10615 238757 254546 272492 302212 340017 384265 445541 526792 645745 821496 1076124 1450589
10604 1450589 1995890 2817238 4054751 5739034 7325744 7586224 6263886 4490896 3176728
10595 3176728 2308966 1712021 1284055 980948 767367 625519 530172 459174 400535 354865
10585 354865 325733 303147 292784 287002 281070 271731 261497 243271 219764 198224 180006 168633
$$ packed form
10672C51819o6528l8084k9378k4855j7759j6588j4202j2922j4779j1104q354q562
10660H8704p557m569j886l865j816r70j463k05J154j666M15J362K594k027l552
10645F4653k297K969J59M727P840O944j0o6J608O488N513Q117L437J905K28j089
10629A11126j64P151M767J825l16n03L855O742J1867J3627J5690J9999K1644K1447
10615B38757J5789J7946K9720L7805M4248O1276Q1251J18953J75751K54628L74465
10604A450589N45301Q21348J237513J684283J586710K60480j322338j772990j314168
10595C176728q67762n96945m27966l03107k13581j41848r5347p0998n8639m5670
10585C54865k9132k2586j0363n782n932r339j0234j8226k3507k1540j8218j1373
$$ plain form
10573 168633 163097 154301 152570 148460 144525 140318 140527 142289 146453 150324 155809 165214 174393 182982
10559 182982 192099 199267 210297 219458 229106 238584 247860 258915 266345 265756 264569 263569 258719 254085
10545 254085 249398 247712 241665 229434 215444 205751 199135 184632 169758 154770 143596 134434 134251
10532 134251 128577 125991 124919 127514 130207 131386 132968 126051 117965 111533 112382 113146 114350 116764 120446
10517 120446 121765 121655 123381 123713 121647 118023 110163 101743 98693 95739 91390 95028 104175 106738 107916
10502 107916 112681 115312 121376 128413 134779 143240 151603 152141 151231 150683 152467 152582 153136 152705 147668 141902
10486 141902 140557 143044 145396 147706 147084 148243 153894 160497 171666 180748 185132 193337 194976 197114
10472 197114 204383 219761 234003 248780 265953 283267 298117 311793 325178 336274 338560 339059
$$ packed form
10573A68633n536q796j731m110l935m207K09J762M164L871N485R405R179Q589
10559A82982R117P168J1030R161R648R478R276J1055P430n89j187j000m850m634
10545B54085m687j686o047j2231j3990r693o616j4503j4874j4988j1174r162j83
10532A34251n674k586j072K595K693J179J582o917q086o432Q49P64J204K414L682
10517A20446J319j10J726L32k066l624p860q420l050k954m349L638R147K563J178
10502A07916M765K631O064P037O366Q461Q363N38r10n48J784J15N54m31n037n766
10486A41902j345K487K352K310o22J159N651O603J1169R082M384Q205J639K138
10472A97114P269J5378J4242J4777J7173J7314J4850J3676J3385J1096K286M99
$$ plain form
10460 339059 336422 332591 322559 306390 287760 275505 267970 267743 278795 300244 336908 374325
10448 374325 399408 402331 380335 349940 319375 288991 258742 226721 199430 185444 184677 188272
10436 188272 200782 221360 246169 267002 283117 297056 312550 331258 348701 363042 377395
10425 377395 396410 415122 435864 462078 493705 526676 561987 589638 606389 613677 612064 595534
10413 595534 565974 532396 495266 457089 421855 392205 370087 350876 336961 324607 315216 311001
10401 311001 305737 299702 295545 293570 287848 285610 281886 277680 279055 281238 289634 298870 307186 319065
10387 319065 337953 356956 370392 380762 391712 402402 412578 427096 440801 450983 463725
10376 463725 477756 496104 519802 544067 566671 590878 616255 641038 661256 679526 692624
$$ packed form
10460C39059k637l831j0032j6169j8630j2255p535k27J1052K1449L6664L7417
10448C74325K5083K923k1996l0395l0565l0384l0249l2021k7291j3986p67L595
10436A88272J2510K0578K4809K0833J6115J3939J5494J8708J7443J4341J4353
10425C77395J9015J8712K0742K6214L1627L2971L5311K7651J6751P288j613j6530
10413E95534k9560l3578l7130l8177l5234k9650k2118j9211j3915j2354r391m215
10401C11001n264o035m157j975n722k238l724m206J375K183Q396R236Q316J1879
10387C19065J8888J9003J3436J0370J0950J0690J0176J4518J3705J0182J2742
10376D63725J4031J8348K3698K4265K2604K4207K5377K4783K0218J8270J3098
$$ plain form
10365 692624 702756 705623 706296 706818 706056 701821 700253 700068 703191 718841 747447 786264 830233 883688
10351 883688 942420 1008100 1070018 1124805 1168658 1209436 1248574 1287013 1325609 1370799 1428183
10340 1428183 1496715 1576822 1665671 1758238 1857844 1961966 2061671 2135608 2178924 2198967 2200415
10329 2200415 2194260 2192204 2199599 2226180 2265145 2324037 2396993 2492705 2610632 2746474 2907219
10318 2907219 3095124 3308150 3551162 3817901 4112397 4447410 4836840 5295754 5869443
10309 5869443 6600295 7530436 8664972 9994424 11484730 13080102 14737934 16433324
10301 16433324 18179199 20012646 22056585 24529194 27849385 32677344 40025040 51290034
10293 51290034 67962247 91057830 120688845 155258177 190782327 222728066 246928262
$$ packed form
10365F92624J0132K867O73N22p62m235j568j85L123J5650K8606L8817M3969N3455
10351H83688N8732O5680O1918N4787M3853M0778L9138L8439L8596M5190N7384
10340A428183O8532Q0107Q8849R2567R9606J04122R9705P3937M3316K0043J448
10329B200415o155k056P395K6581L8965N8892P2956R5712J17927J35842J60745
10318B907219J87905K13026K43012K66739K94496L35013L89430M58914N73689
10309E869443P30852R30141J134536J329452J490306J595372J657832J695390
10301A6433324J745875J833447K043939K472609L320191M827959P347696J1264994
10293E1290034J6672213K3095583K9631015L4569332L5524150L1945739K4200196
$$ plain form
10286 246928262 259570238 260569936 251045929 230708550 202965383 173233883 142961054
10279 142961054 113637161 88592414 68917680 53957853 43193438 35740050 30431590
10272 30431590 26404643 23188115 20506981 18210558 16221399 14464612 12898248 11501481
10264 11501481 10244288 9108716 8108704 7241509 6509058 5903994 5412593 5013623 4690820
10255 4690820 4427090 4207857 4019404 3860385 3723438 3604530 3507891 3434395 3385176 3353142
10245 3353142 3331403 3312232 3305833 3319056 3364737 3453323 3580996 3745553 3934106 4131065 4323781
10234 4323781 4492074 4638816 4782815 4930908 5104860 5322567 5606934 5994264 6514022
10225 6514022 7193764 8072778 9170473 10502977 12075862 13896524 15947515 18223353
$$ packed form
10286B46928262J2641976R99698r524007k0337379k7743167k9731500l0272829
10279A42961054k9323893k5044747j9674734j4959827j0764415p453388n308460
10272C0431590m026947l216528k681134k296423j989159j756787j566364j396767
10264A1501481j257193j135572j000012q67195p32451o05064m91401l98970l22803
10255D690820k63730k19233j88453j59019j36947j18908r6639p3496m9219l2034
10245C353142k1739j9171o399J3223M5681Q8586J27673J64557J88553J96959J92716
10234D323781J68293J46742J43999J48093J73952K17707K84367L87330N19758
10225F514022O79742Q79014J097695J332504J572885J820662K050991K275838
$$ plain form
10217 18223353 20741979 23586947 27039722 31651822 38298985 48279126 63121598 84168574
10209 84168574 112045492 145897707 182977185 219267157 250232066 271166241 278010257
10202 278010257 269743848 248290587 216126688 177491793 138819117 105135126 78458084
10195 78458084 58982639 45673426 36786242 30726420 26406686 23150018 20551016 18366528
10187 18366528 16476168 14795369 13280743 11900377 10639589 9497597 8475989 7579160
10179 7579160 6807045 6149903 5599900 5140259 4746047 4398784 4089262 3808516 3556263
10170 3556263 3330934 3123475 2934699 2765734 2616143 2487499 2373757 2278664 2200668 2143811
10160 2143811 2102334 2073135 2051119 2022285 1979459 1918401 1847925 1776223 1725135 1694125 1664895
$$ packed form
10217A8223353K518626K844968L452775M612100O647163R980141J4842472K1046976
10209H4168574K7876918L3852215L7079478L6289972L0964909K0934175O844016
10202B78010257q266409k1453261l2163899l8634895l8672676l3683991k6677042
10195G8458084j9475445j3309213q887184o059822m319734l256668k599002k184488
10187A8366528j890360j680799j514626j380366j260788j141992j021608q96829
10179G579160p72115o57142n50003m59641l94212l47263l09522k80746k52253
10170C556263k25329k07459j88776j68965j49591j28644j13742r5093p7996n6857
10160B143811m1477k9199k2016k8834m2826o1058p0476p1702n1088l1010k9230
$$ plain form
10149 1664895 1634277 1601724 1550071 1481383 1402643 1319027 1241221 1169180 1114292 1073900 1037328
10138 1037328 1009540 986501 963284 942821 922857 902933 875866 839871 805999 770125 732834
10127 732834 694300 660447 633919 609471 589848 579462 569371 561577 553369 546684 545828 546037 543906
10114 543906 538343 532766 529566 527265 524719 521114 515260 510118 502717 495269 492304 486953 487439 492047
10100 492047 499932 507955 511719 512025 505062 497191 485566 472560 461689 448252 436684 427786 419137
10087 419137 410277 402645 400808 396123 394295 394966 402370 415077 430197 437867 447798 462053 467167 469618
10073 469618 476826 486513 506925 548998 622505 713040 710353 591939 463237 388074 340457 303082
10061 303082 280255 264559 256723 255655 258344 262565 270907 286359 301205 313819 320213 325852 324335
$$ packed form
10149A664895l0618l2553n1653o8688p8740q3616p7806p2041n4888m0392l6572
10138A037328k7788k3039k3217k0463j9964j9924k7067l5995l3872l5874l7291
10127G32834l8534l3853k6528k4448j9623j0386j0091p794q208o685q56K09k131
10114E43906n563n577l200k301k546l605n854n142p401p448k965n351M86M608
10100D92047P885Q023L764L06o963p871j1625j3006j0871j3437j1568q898q649
10087D19137q860p632j837m685j828O71P404J2707J5120P670R931J4255N114K451
10073D69618P208R687K0412M2073P3507R0535k687j18414j28702p5163m7617l7375
10061C03082k2827j5696p836j068K689M221Q342J5452J4846J2614O394N639j517
$$ plain form
10048 324335 317746 301865 282601 261919 240961 224568 211028 198944 193008 189995 186031 180740
10036 180740 181647 188771 193844 202334 206179 205107 209283 213206 214895 215332 211648 211216 211563 211170 210101
10021 210101 209351 209290 212426 219037 219750 223278 224451 225811 223436 225920 221269 214100 209574 202384 195630
10006 195630 189778 180901 174750 165234 152055 143980 136664 135329 135615 130742 122575 121636 120220 119465 117673
9991 117673 115383 117862 125821 131974 139814 146052 150695 156442 158954 158953 153332 145727 141296 138525 135405
9976 135405 132244 124186 116845 113323 114699 116800 119416 121609 119163 120082 121167 127173 133402 131373 131316
9961 131316 133550 137690 138944 130233 122692 116076 113851 112673 117032 121151 121885 121095 121199 118731 118472
9946 118472 123403 125109 125946 127307 129005 131564 132231 133305 131941 133142 131192 128670 127538 122918 114374
$$ packed form
10048C24335o589j5881j9264k0682k0958j6393j3540j2084n936l013l964n291
10036A80740R07P124N073Q490L845j072M176L923J689M37l684m32L47l93j069
10021B10101p50o1L136O611P13L528J173J360k375K484m651p169m526p190o754
10006A95630n852q877o151r516j3179q075p316j335K86m873q167r39j416p55j792
9991A17673k290K479P959O153P840O238M643N747K512jn621p605m431k771l120
9976A35405l161q058p341l522J376K101K616K193k446R19J085O006O229k029n7
9961A31316K234M140J254q711p541o616k225j178M359M119P34p90J04k468k59
9946A18472M931J706Q37J361J698K559O67J074j364J201j950k522j132m620q544
$$ plain form
9931 114374 111164 111732 111709 112161 113961 116297 113736 112770 112822 114366 119251 118719 112187 110736 107627 100964
9915 100964 99188 96595 96231 96307 95861 95148 102128 108390 111231 119088 131272 142983 153766 164416 174901
9900 174901 182889 195490 209963 223646 240823 258755 283589 318620 377691 469051 597958 768563
9888 768563 970594 1184991 1386778 1549527 1637400 1639645 1564438 1423955 1248913 1070326
9878 1070326 894690 727261 585911 475717 394289 341052 307896 278646 257628 242295 227840
9867 227840 207685 186624 169682 153525 136910 125415 112242 104747 102623 98648 89146 80099 79685
9854 79685 73819 70037 70795 70185 70619 75562 80340 84927 90066 94503 98903 105026 109860 113817 119771
9839 119771 127098 141945 172079 206202 235424 239507 211061 176822 154419 145027 140580 135276 128859
$$ packed form
9931A14374l210N68k3M52J800K336k561r66N2J544M885n32o532j451l109o663
9915A00964j776k593l64P6m46p13O980O262K841P857J2184J1711J0783J0650J0485
9900A74901P988J2601J4473J3683J7177J7932K4834L5031N9071R1360J28907J70605
9888G68563K02031K14397K01787J62749Q7873K245p5207j40483j75042j78587
9878A070326j75636j67429j41350j10194q1428n3237l3156k9250k1018j5333j4455
9867B27840k0155k1061j6942j6157j6615j1495j3173p495k124l975r502r047m14
9854G9685n866l782P58o10M34M943M778M587N139M437M400O123M834L957N954
9839A19771P327J4847L0134L4123K9222M083k8446l4239k2403r392m447n304o417
$$ plain form
9826 128859 121652 118653 117554 117668 115461 113822 118830 124437 132948 144490 153623 167880 190586 217133
9812 217133 247999 289870 352507 445587 572896 742244 947596 1172004 1388205 1564288
9802 1564288 1666715 1674700 1586761 1418193 1196034 961484 751310 581407 450243 360666
9792 360666 307794 279588 272014 281859 320032 372030 427282 474784 498689 478419 424173 349427
9780 349427 272620 208396 159430 125927 103522 87960 77339 66470 60878 58766 60943 63003
9768 63003 63654 65653 65768 66372 66626 66584 68240 71664 67993 62294 59983 61085 61278 62647 64915 62005
9752 62005 59633 61514 60390 60624 61307 61612 61213 56269 47519 39973 32718 31701 28942 23472 21821 20231
9736 20231 15663 21220 30160 32895 29175 27446 31252 31542 30397 29962 27162 25396 32099 39094 40084
$$ packed form
9826A28859p207k999j099J14k207j639N008N607Q511J1542R133J4257K2706K6547
9812B17133L0866M1871O2637R3080J27309J69348K05352K24408K16201J76083
9802A564288J02427P985q7939j68568k22159k34550k10174j69903j31164q9577
9792C60666n2872k8206p574R845L8173N1998N5252M7502K3905k0270n4246p4746
9780C49427p6807o4224m8966l3503k2405j5562j0621j0869n592k112K177K060
9768F3003O51J999J15O04K54m2J656L424l671n699k311J102J93J369K268k910
9752F2005k372J881j124K34O83L05l99m944q750p546p255j017k759n470j651j590
9736B0231m568N557Q940K735l720j729L806K90j145m35k800j766O703O995R90
$$ plain form
9721 40084 40974 45365 47551 47734 51232 50743 51313 51418 55672 56404 53759 53901 52690 51484 49052 48118 45736
9704 45736 46340 42434 39627 37598 34436 34234 33088 25160 20426 23831 25856 27676 33036 35214 38706
9689 38706 35988 35169 35011 36500 36388 34394 32755 37364 35154 30984 31690 34105 32881 29052 28695 31659
9673 31659 33083 35008 31881 30392 30946 33220 33667 32466 33486 34542 32629 30370 32160 37600 38405
9658 38405 34979 31713 30108 32460 34801 39316 38831 35474 33538 34426 38353 35787 35580 36526 35115 32773
9642 32773 32244 34385 33204 29833 29721 29787 28568 29516 34181 33338 27858 28438 30170 38649 43253 39646
9626 39646 33814 27392 26770 27168 24138 22544 22000 23350 27105 31526 26439 24200 25678 28247 29099 31404
9610 31404 35690 37487 37427 39881 41229 34496 28972 29815 30514 33878 38000 36104 35337 36707 33230 30055
$$ packed form
9721D0084Q90M391K186J83L498m89N70J05M254P32k645J42j211j206k432r34k382
9704D5736O04l906k807k029l162k02j146p928m734L405K025J820N360K178L492
9689C8706k718q19j58J489j12j994j639M609k210m170P06K415j224l829l57K964
9673C1659J424J925l127j489N54K274M47j201J020J056j913k259J790N440Q05
9658C8405l426l266j605K352K341M515m85l357j936Q88L927k566k07R46j411k342
9642C2773n29K141j181l371j12O6j219R48M665q43n480N80J732Q479M604l607
9626C9646n832o422o22L98l030j594n44J350L755M421n087k239J478K569Q52K305
9610C1404M286J797o0K454J348o733n524Q43O99L364M122j896p67J370l477l175
$$ plain form
9594 30055 27599 31220 35526 34224 28853 27439 26575 26179 27095 29685 32126 30561 27527 27792 22878 21338
9578 21338 22726 24254 23939 23700 25245 24804 23864 22940 22489 24037 22993 22221 22997 24402 26566 27591 31002
9561 31002 32274 29244 27565 26971 27330 25610 26217 31204 30767 27207 30020 30560 29768 31230 31413 27602
9545 27602 25049 26004 24666 26576 31329 34795 35626 32127 32448 30257 25422 21132 22562 25607 24111
9530 24111 27564 24998 21792 21270 17278 19530 22931 25706 24823 23738 18951 22533 28839 29877 32336
9515 32336 34884 32790 31093 30775 28357 28915 25464 22821 21991 26762 30882 31302 29047 27493 30222 33256
9499 33256 33362 31662 30685 28004 28192 31761 33180 33066 32511 29601 29231 29652 30403 31670 32713 33302 34806
9482 34806 36753 38698 38139 39907 40150 39073 32312 32058 30381 30157 28331 25763 29271 31280 27796 25150
$$ packed form
9594C0055k456L621M306j302n371j414q64l96R16K590K441j565l034K65m914j540
9578B1338J388J528l15k39J545m41r40r24m51J548j044p72P76J405K164J025L411
9561C1002J272l030j679n94L59j720O07M987m37l560K813N40p92J462J83l811
9545B7602k553R55j338J910M753L466Q31l499L21k191m835m290J430L045j496
9530B4111L453k566l206n22l992K252L401K775q83j085m787L582O306J038K459
9515C2336K548k094j697l18k418N58l451k643q30M771M120M20k255j554K729L034
9499C3256J06j700r77k681J88L569J419j14n55k910l70M21P51J267J043N89J504
9482C4806J947J945n59J768K43j077o761k54j677k24j826k568L508K009l484k646
$$ plain form
9466 25150 25354 29077 30102 30239 30019 32379 33712 33920 35145 36540 32520 30860 32141 32734 34628 36491
9450 36491 34356 34075 28968 25653 27283 29600 29025 29095 29558 34017 36247 30901 28318 30011 32060 28872
9434 28872 29903 30677 30678 29578 27894 29091 32389 32994 28617 24529 22634 22394 21765 23672 21560 21362 29289
9417 29289 35423 33575 30149 29319 29053 28861 32776 36506 39757 41143 40994 41232 39248 39334 41959 43286
9401 43286 43853 44787 42332 42704 43565 42716 42606 41695 40131 40255 41292 39536 36025 34514 35124 37776 34353
9384 34353 35011 33756 33588 34283 36175 37969 34872 35768 34750 32206 38776 43323 42484 41808 45602 46771
9368 46771 49398 48132 46240 48326 45518 39206 37576 41101 41521 39282 36230 36299 36537 36249 34032 36331
9352 36331 39016 41261 43051 42622 45481 47521 45580 45301 43955 45717 45416 49385 54860 57091 62625
$$ packed form
9466B5150K04L723J025J37k20K360J333K08J225J395m020j660J281N93J894J863
9450C6491k135k81n107l315J630K317n75P0M63M459K230n346k583J693K049l188
9434B8872J031P74Jj100j684J197L298O05m377m088j895k40o29J907k112j98P927
9417B9289O134j848l426q30k66j92L915L730L251J386j49K38j984Q6K625J327
9401D3286N67R34k455L72Q61q49j10r11j564J24J037j756l511j511O10K652l423
9384C4353O58j255j68O95J892J794l097Q96j018k544O570M547q39o76L794J169
9368D6771K627j266j892K086k808o312j630L525M20k239l052O9K38k88k217K299
9352C6331K685K245J790m29K859K040j941k79j346J762l01L969N475K231N534
$$ plain form
9337 62625 64843 65626 67247 68049 64910 62285 60398 58523 52586 52879 54945 51935 47811 44404 44831 48642
9321 48642 49540 45109 46595 48649 48475 49938 48061 47553 50324 57526 60831 67467 68367 65341 69050 74042
9305 74042 71807 72274 76603 85715 97455 114242 139998 176581 218863 263413 301372 312797 286706
9292 286706 240226 198724 165507 142239 128492 122272 120988 124784 135561 155121 184561 214236
9280 214236 242742 269471 283875 284691 271980 258390 249810 244031 234883 226231 219012 214864 211883
9267 211883 213080 215815 224451 240721 277305 333961 416621 527531 641478 720809 715953 628365
9255 628365 508374 400801 322477 270821 240822 227708 222793 215674 211081 211559 213344 221375 238384
9242 238384 252283 264211 274586 287441 299712 295934 278302 246735 209136 177005 149658 132504
$$ packed form
9337F2625K218P83J621Q02l139k625j887j875n937K93K066l010m124l407M27L811
9321D8642Q98m431J486K054j74J463j877n08K771P202L305O636R00l026L709M992
9305G4042k235M67M329R112J1740J6787K5756L6583M2282M4550L7959J1425k6091
9292B86706m6480m1502l3217k3268j3747o220j284L796J0777J9560K9440K9675
9280B14236K8506K6729J4404Q16j2711j3590q580n779r148q652p219m148k981
9267B11883J197K735Q636J6270L6584N6656Q2660J10910J13947P9331m856q7588
9255F28365j19991j07573p8324n1656k9999j3114m915p119m593M78J785Q031J7009
9242B38384J3899J1928J0375J2855J2271l778j7632l1567l7599l2131k7347j7154
$$ plain form
9230 132504 121905 118191 119974 128332 145801 165763 202693 247184 290264 312057 301182 259422
9218 259422 218145 181955 154633 133541 114820 98854 92125 89055 86663 85942 88527 88742 87121
9205 87121 83569 78168 77188 77259 75289 75684 73925 73314 75930 71919 70134 71423 70552 68896 70043 70476
9189 70476 67341 66089 68529 71472 75199 76100 79480 79199 75533 74418 75105 72381 68004 64192 66604
9174 66604 67718 70366 73031 74393 74004 70178 67412 67470 68909 66516 64902 65185 62996 62805 62028 65935
9158 65935 65666 68350 70340 68953 67248 67550 68324 69641 69309 66696 66795 69969 71851 71817 72530 74290 73490
9141 73490 70640 76470 76107 71052 70281 74378 74395 73526 79836 79694 76222 76512 74343 74776 73800 74828 74413
9124 74413 73788 77203 77369 77040 78726 80696 80049 78629 79501 79569 81479 80698 82507 80796 78815 79555 77408
$$ packed form
9230A32504j0599l714J783Q358J7469J9962L6930M4491M3080K1793j0875m1760
9218B59422m1277l6190k7322k1092j8721j5966o729l070k392p21K585K15j621
9205H7121l552n401r80P1j970L95j759o11K616m011j785J289q71j656J147M33
9189G0476l135j252K440K943L727R01L380k81l666j115O87k724m377l812K412
9174F6604J114K648K665J362l89l826k766N8J439k393j614K83k189j91p77L907
9158F5935k69K684J990j387j705L02P74J317l32k613R9L174J882l4P13J760q00
9141G3490k850N830l63n055p71M097J7q69O310j42l472K90k169M33r76J028m15
9124G4413o25L415J66l29J686J970o47j420Q72O8J910p81J809j711j981P40k147
$$ plain form
9107 77408 77168 76023 73606 73068 75298 71938 70387 71767 71952 72759 80072 82716 80993 80642 83596 88285
9091 88285 85301 88547 92811 94369 94309 94372 93114 94359 91446 94341 99660 102989 105545 109622 108609 107612
9075 107612 106443 106801 108037 110173 113190 115234 116413 117554 117410 120759 120083 123566 131000 137170 140285
9060 140285 140802 139729 142113 144027 146198 149896 150730 154197 155471 154752 154159 156485 157165 157708 161159 160448
9044 160448 168104 173914 175257 174651 173805 173771 172502 171307 171864 173825 175835 175752 171491 169599 169739 167998
9028 167998 169542 169250 164195 160567 157229 155208 157943 160360 159267 161857 162808 166833 171622 171696 171891 174412
9012 174412 176500 179382 178303 177554 173466 167651 166423 169798 169060 169996 173078 172714 172930 175201 179157 179694
8996 179694 180181 178694 181552 183298 183107 184253 186855 187866 192714 192560 195884 201150 203587 200939 199108
$$ packed form
9107G7408k40j145k417n38K230l360j551J380J85Q07P313K644j723l51K954M689
9091H8285k984L246M264J558o0O3j258J245k913K895N319L329K556M077j013r97
9075A07612j169L58J236K136L017K044J179J141j44L349o76L483P434O170L115
9060A40285N17j073K384J914K171L698Q34L467J274p19n93K326O80N43L451p11
9044A60448P656N810J343o06q46l4j269j195N57J961K010q3m261j892J40j741
9028A67998J544k92n055l628l338k021K735K417j093K590R51M025M789P4J95K521
9012A74412K088K882j079p49m088n815j228L375p38R36L082l64K16K271L956N37
8996A79694M87j487K858J746j91J146K602J011M848j54L324N266K437k648j831
$$ plain form
8981 199108 199455 200482 198545 198164 199094 200196 202817 201762 203340 206693 210227 210621 213385 215538 217588
8966 217588 221188 224316 228586 232041 234177 240634 245671 248922 252989 255817 260146 261204 264408 263634 265526
8951 265526 269923 273965 277448 280389 287501 292172 291334 291919 291374 291885 296118 299617 301170 305147 308563
8936 308563 312374 316042 319203 326844 338968 344944 351695 357736 367355 380197 392990 403129 413235
8923 413235 421407 433161 446578 456987 468338 476781 484289 491633 501092 508167 512149 519901 525936
8910 525936 526042 528904 537104 538489 540739 541400 543357 546998 546504 546445 554337 561695 571508 579445 590747
8895 590747 596418 598893 606588 615773 623991 634071 644388 654628 662144 672423 683131 694980 709940
8882 709940 726232 741709 756053 772836 785521 801851 822924 845278 868859 892323 913915 940042
$$ packed form
8981A99108L47J027j937l81R30J102K621j055J578L353L534L94K764K153K050
8966B17588L600L128M270L455K136O457N037L251M067K828M329J058L204p74J892
8951B65526M397M042L483K941P112M671q38N85n45N11M233L499J553L977L416
8936C08563L811L668L161P641J2124N976O751O041R619J2842J2793J0139J0106
8923D13235Q172J1754J3417J0409J1351Q443P508P344R459P075L982P752O035
8910E25936J06K862Q200J385K250O61J957L641m94n9P892P358R813P937J1302
8895E90747N671K475P695R185Q218J0080J0317J0240P516J0279J0708J1849J4960
8882G09940J6292J5477J4344J6783J2685J6330K1073K2354K3581K3464K1592K6127
$$ plain form
8870 940042 967198 989602 1007682 1028052 1051046 1073604 1100449 1132859 1160330 1186373 1215157 1244133
8858 1244133 1268262 1294044 1324196 1360441 1394677 1427173 1462188 1495963 1530963 1574857 1619077
8847 1619077 1663924 1712370 1761933 1814103 1864106 1917726 1978989 2040554 2104499 2174076 2245775
8836 2245775 2321668 2403431 2486736 2574991 2668248 2768461 2877998 2995112 3114498 3244792
8826 3244792 3384044 3532723 3683413 3834555 3990982 4160409 4348693 4556775 4778627 5012055
8816 5012055 5262443 5529607 5823195 6146229 6498325 6878974 7293691 7747674 8242257 8787230
8806 8787230 9384170 10042911 10775501 11583258 12481951 13483961 14603597 15863598 17274710
8797 17274710 18862362 20661116 22702201 25014236 27638610 30623940 34015723 37855608
$$ packed form
8870I40042K7156K2404J8080K0370K2994K2558K6845L2410K7471K6043K8784K8976
8858A244133K4129K5782L0152L6245L4236L2496L5015L3775L5000M3894M4220
8847A619077M4847M8446M9563N2170N0003N3620O1263O1565O3945O9577P1699
8836B245775P5893Q1763Q3305Q8255R3257J00213J09537J17114J19386J30294
8826C244792J39252J48679J50690J51142J56427J69427J88284K08082K21852K33428
8816E012055K50388K67164K93588L23034L52096L80649M14717M53983M94583N44973
8806H787230N96940O58741P32590Q07757Q98693J002010J119636J260001J411112
8797A7274710J587652J798754K041085K312035K624374K985330L391783L839885
$$ plain form
8789 37855608 42182119 47018921 52346327 58095000 64125633 70210253 75994891 81045747
8781 81045747 84892934 87116830 87464440 85893391 82608573 77992119 72505247 66594992
8773 66594992 60629621 54873132 49489641 44565894 40124127 36159345 32636024 29521868
8765 29521868 26768973 24334936 22184511 20281535 18591624 17089393 15748270 14548813
8757 14548813 13472654 12509044 11638234 10847360 10134170 9486594 8895679 8356281 7863634
8748 7863634 7408590 6990529 6604598 6246814 5922327 5619149 5337856 5077697 4833625 4608765
8738 4608765 4395907 4200015 4018830 3851569 3698573 3560489 3439105 3339588 3266583 3204995
8728 3204995 3111505 2962010 2798202 2661196 2549723 2454369 2365216 2278346 2195089 2119423 2048345
$$ packed form
8789C7855608M326511M836802N327406N748673O030633O084620N784638N050856
8781H1045747L847187K223896L47610j571049l284818m616454n486872n910255
8773F6594992n965371n756489n383491m923747m441767l964782l523321l114156
8765B9521868k752895k434037k150425j902976j689911j502231j341123j199457
8757A4548813j076159r63610q70810p90874p13190o47576n90915n39398m92647
8748G863634m55044m18061l85931l57784l24487l03178k81293k60159k44072k24860
8738D608765k12858j95892j81185j67261j52996j38084j21384r9517p3005o1588
8728C204995r3490j49495j63808j37006j11473r5354q9153q6870q3257p5666p1078
$$ plain form
8717 2048345 1983187 1925946 1871500 1814378 1758895 1705707 1656486 1614090 1568382 1523763 1488114
8706 1488114 1453973 1413337 1371575 1338677 1303991 1272478 1241684 1211313 1183990 1159667 1138822
8695 1138822 1116487 1099072 1079644 1059576 1040841 1024932 1005667 986606 969916 950002 932457
8684 932457 921630 908361 893472 881085 878895 882870 891128 908064 942423 993002 1052185 1103147
8672 1103147 1104470 1043102 947671 864473 811298 777920 752723 735158 723716 721433 721993 725128
8660 725128 737928 752774 771054 791282 807738 819790 826024 820725 793004 752005 706661 669503
8648 669503 640669 615582 592070 573419 556437 545542 532519 516954 504116 491110 483128 475614
8636 475614 474119 478933 492453 515223 559433 630786 718771 770504 746218 662960 575310 514466
$$ packed form
8717B048345o5158n7241n4446n7122n5483n3188m9221m2396m5708m4619l5649
8706A488114l4141m0636m1762l2898l4686l1513l0794l0371k7323k4323k0845
8695A138822k2335j7415j9428k0068j8735j5909j9265j9061j6690j9914j7545
8684I32457j0827j3269j4889j2387k190L975Q258J6936L4359N0579N9183N0962
8672A103147J323o1368r5431q3198n3175l3378k5197j7565j1442k283N60L135
8660G25128J2800J4846J8280K0228J6456J2052O234n299k7721m0999m5344l7158
8648F69503k8834k5087k3512j8651j6982j0895j3023j5565j2838j3006p982p514
8636D75614j495M814J3520K2770M4210P1353Q7985N1733k4286q3258q7650o0844
$$ plain form
8624 514466 482139 465761 463744 474549 505645 571999 655361 678720 610149 512884 448124 412483
8612 412483 389778 370200 354722 342363 334916 327058 321024 313444 305795 303263 298360 296685 295197
8599 295197 294865 292844 291200 283888 278451 273344 272632 275046 275436 280621 278799 271232 272687 271730 267382
8584 267382 264774 264867 270474 274334 277718 290398 311693 353073 423783 546110 724323 844796
8572 844796 772171 580166 428809 343438 292564 262883 247998 234733 224425 220590 217164 216198
8560 216198 210635 203895 198685 193996 187468 182009 174234 168638 164201 164469 165982 164827 161859 159922 159544
8545 159544 160037 162982 160722 155937 156093 158427 158878 160223 160353 159508 165514 177612 192109 217952 267168
8530 267168 344726 423979 440961 367329 278058 223937 194928 182467 175074 165785 157193 153194
$$ packed form
8624E14466l2327j6378k017J0805L1096O6354Q3362K3359o8571r7265o4760l5641
8612D12483k2705j9578j5478j2359p447p858o034p580p649k532m903j675j488
8599B95197l32k021j644p312n437n107p12K414L90N185j822p567J455r57m348
8584B67382k608R3N607L860L384J2680K1295M1380P0710J22327J78213J20473
8572H44796p2625j92005j51357q5371n0874k9681j4885j3265j0308l835l426r66
8560B16198n563o740n210m689o528n459p775n596m437K68J513j155k968j937l78
8545A59544M93K945k260m785J56K334M51J345J30q45O006J2098J4497K5843M9216
8530B67168P7558P9253J6982p3632q9271n4121k9009j2461p393r289q592l999
$$ plain form
8518 153194 152958 153252 155443 152568 149080 146505 144881 142850 139041 135955 133446 135855 134663 133036 131979
8503 131979 133447 137837 139253 134635 124423 121756 118023 115992 113049 109982 111980 111985 110813 110748 110705 110148
8487 110148 105973 99395 99971 102493 102213 98225 95569 97597 100187 101576 104198 107743 105708 108608 109928
8472 109928 108005 107283 106103 105619 105058 101044 99198 98093 97491 96650 96709 97110 93529 92311 94238 97486
8456 97486 99569 97516 99628 93629 90805 90704 88092 85438 88215 84819 81845 76330 78401 78508 79153
8441 79153 77793 76469 79513 82249 79024 78525 79004 77597 74898 76427 76072 73200 71955 75212 76619
8426 76619 77169 75335 70269 69492 72806 71704 70196 68695 66562 67772 67897 65682 65974 69486 71281 70107
8410 70107 70085 67713 68799 65717 63049 63102 64300 68655 71490 72550 71052 66594 66408 64378 65020 67091
$$ packed form
8518A53194k36K94K191k875l488k575j624k031l809l086k509K409j192j627j057
8503A31979J468M390J416m618j0212k667l733k031k943l067J998Nj172o5m3n57
8487A10148m175o578N76K522k80l988k656K028K590J389K622L545k035K900J320
8472A09928j923p22j180m84n61m014j846j105o02q41N9M01l581j218J927L248
8456I7486K083k053K112n999k824j01k612k654K777l396k974n515K071J07O45
8441G9153j360j324L044K736l225m99M79j407k699J529l55k872j245L257J407
8426G6619N50j834n066p77L314j102j508j501k133J210J25k215K92L512J795j174
8410G0107k2k372J086l082k668N3J198M355K835J060j498m458j86k030O42K071
$$ plain form
8394 67091 67363 69278 66140 64082 63097 62444 63981 65478 66920 67931 63132 60496 61161 62683 64603 66198
8378 66198 63032 59902 55694 54151 57379 55158 53363 52624 52282 56663 55815 54521 54611 51757 52173 51364
8362 51364 47579 46730 45164 38506 34801 36097 38250 38999 43553 44818 45052 43224 41014 41195 43137 46037
8346 46037 45682 47147 51023 47029 40602 44267 38574 36180 37192 38400 39975 40315 45673 51461 50406
8331 50406 46559 43772 45282 47837 50452 47452 46686 49144 46235 43383 41814 40872 37485 36729 35231
8316 35231 31432 31948 34840 35899 34467 30282 29700 30526 31124 31303 30583 35498 37560 37004 32641 33537 37611
8299 37611 39531 36645 34632 34179 33548 35224 37448 38167 36027 29654 29523 27751 26760 27426 33278 35969
8283 35969 31853 28779 33037 34571 31518 28411 27032 26042 25966 28998 31101 26727 25081 27095 33098
$$ packed form
8394F7091K72J915l138k058r85o53J537J497J442J011m799k636O65J522J920J595
8378F6198l166l130m208j543L228k221j795p39l42M381q48j294R0k854M16q09
8362E1364l785q49j566o658l705J296K153P49M554J265K34j828k210J81J942K900
8346D6037l55J465L876l994o427L665n693k394J012J208J575L40N358N788j055
8331E0406l847k787J510K555K615l000p66K458k909k852j569r42l387p56j498
8316C5231l799N16K892J059j432m185n82Q26N98J79p20M915K062n56m363Q96M074
8299C7611J920k886k013m53o31J676K224P19k140o373j31j772r91O66N852K691
8283C5969m116l074M258J534l053l107j379r90p6L032K103m374j646K014O003
$$ plain form
8268 33098 36343 35837 35052 33278 28465 29654 29543 29678 31721 33824 37739 39063 36327 34904 34867 35159
8252 35159 36223 40206 42280 37164 31743 29111 28622 28609 30301 31310 31307 30125 29358 28103 26510 24796
8236 24796 25669 28746 31488 34391 30372 25969 24895 28341 30360 29788 30639 30728 29565 26990 27078 27251 26332
8219 26332 23698 24156 26445 27087 29051 30979 31732 32668 33408 35691 36291 31060 29899 29104 28892 31567 31727
8202 31727 32188 31094 29215 30718 31069 28807 30790 30203 28616 28281 24250 25276 29918 32048 27818 23100
8186 23100 24912 27794 28379 26157 31856 33082 30266 25882 27045 25877 26963 29862 31455 28746 27607
8171 27607 26583 24331 27223 30238 32540 33442 34843 36814 37297 38876 35182 35708 38027 40653 43669
8156 43669 44413 45189 41526 41503 42889 37598 33522 32880 37386 32943 28302 28358 27634 28612 29102 28884 27388
$$ packed form
8268C3098L245n06p85j774m813J189j11J35K043K103L915J324k736j423l7K92
8252C5159J064L983K074n116n421k632m89j3J692J009lj182p67j255j593j714
8236B4796Q73L077K742K903m019m403j074L446K019n72Q51Q9j163k575Q8J73r19
8219B6332k634M58K289O42J964J928P53R36P40K283O00n231j161p95k12K675J60
8202C1727M61j094j879J503L51k262J983n87j587l35m031J026M642K130m230m718
8186B3100J812K882N85k222N699J226k816m384J163j168J086K899J593k709j139
8171B7607j024k252K892L015K302R02J401J971M83J579l694N26K319K626L016
8156D3669P44P76l663k3J386n291m076o42M506m443m641N6p24R78M90k18j496
$$ plain form
8139 27388 27143 29807 30890 31806 33537 33987 32974 33086 32932 34522 35021 34469 36506 35564 29087 30131 33045
8122 33045 30671 32746 34445 37198 36491 39747 42800 42180 41235 43007 40890 37296 35979 39686 45348
8107 45348 46431 48599 51585 52920 56206 59999 58535 59545 63510 70117 80883 101513 123718 126975
8093 126975 117856 118222 139980 177871 230215 259823 233253 174209 126682 96923 80126 66965
8081 66965 60962 56482 49277 48144 46955 41130 36303 37118 37638 32939 30475 29073 31006 36127 36942
8066 36942 35785 33021 33842 37008 41724 42137 40250 39653 40260 36369 34153 34559 33507 32756 36556 36273
8050 36273 28005 28242 32380 33237 32585 29376 25098 21368 21713 21233 20224 19810 18283 19502 18641 16969
8034 16969 21897 26706 23991 23873 27434 25037 21493 18255 15892 18864 21177 22129 26756 29807 25837
$$ packed form
8139B7388k45K664J083R16J731M50j013J12j54J590M99n52K037r42o477J044K914
8122C3045k374K075J699K753p07L256L053o20r45J772k117l594j317L707N662
8107D5348J083K168K986J335L286L793j464J010L965O607J0766K0630K2205L257
8093A26975r119L66K1758L7891N2344K9608k6570n9044m7527k9759j6797j3161
8081F6965o003m480p205j133j189n825m827Q15N20m699k464j402J933N121Q15
8066C6942j157k764Q21L166M716M13j887n97O07l891k216M06j052p51L800k83
8050C6273q268K37M138Q57o52l209m278l730L45m80j009m14j527J219q61j672
8034A6969M928M809k715j18L561k397l544l238k363K972K313R52M627L051l970
$$ plain form
8019 25837 21693 23466 22246 21799 21909 21180 24285 24371 21426 19364 20520 20220 16689 16117 13707 12842 14662
8002 14662 15971 15596 15298 16990 21009 23099 24333 21690 21597 21854 20102 19856 18629 16576 14667 20949
7986 20949 25712 24876 22962 21093 23756 23150 19066 16934 21697 25276 26246 26520 20871 22727 24546 22564
7970 22564 21795 18956 16792 15234 14062 11206 11581 13769 12837 9371 11939 13058 9633 9924 10222 13320
7954 13320 16365 16104 14511 14339 11963 10082 6758 9620 10596 10306 12554 16439 17715 18197 17789 19274
7938 19274 14878 12556 10032 9499 10284 9702 11099 12728 9869 5648 9580 14553 12732 13717 14799 12804
7922 12804 10018 7595 9407 11483 7265 637 2507 3874 7091 8261 7182 5929 6281 8764 9960
7907 9960 8541 7994 5890 5442 7251 6974 3629 2217 3966 -732 -1710 1862 1594 -2323 -2164 2268
$$ packed form
8019B5837m144J773j220m47J10p29L105Q6k945k062J156l00l531n72k410q65J820
8002A4662J309l75k98J692M019K090J234k643r3K57j752k46j227k053j909O282
7986B0949M763q36j914j869K663o06m084k132M763L579R70K74n649J856J819j982
7970B2564p69k839k164j558j172k856L75K188r32l466K568J119l425K91K98L098
7954A3320L045k61j593j72k376j881l324K862R76k90K248L885J276M82m08J485
7938A9274m396k322k524n33P85n82J397J629k859m221L932M973j821R85J082j995
7922A2804k786k423J812K076m218o628J870J367L217J170j079j253L52K483J196
7907I960j419n47k104m48J809k77l345j412J749m698r78L572k68l917J59M432
$$ plain form
7891 2268 4319 2901 2893 2944 -185 -886 915 5844 7565 6721 611 4896 11804 12671 10142 4493 3989
7874 3989 6513 5717 2450 5586 10349 9472 10662 10826 9957 7185 5372 5819 4432 3224 2882 1780
7858 1780 3563 6955 8009 12087 14791 15654 13309 11910 13768 14053 14923 14152 12809 13593 12728 11033
7842 11033 10205 9380 10568 7565 7133 10216 10742 9515 10667 12959 10007 7311 7161 7650 6932 10446
7826 10446 11905 8238 10364 11092 10343 9300 8240 8230 5564 2351 3231 6185 9859 11017 11147 11994
7810 11994 13849 14388 17554 19535 15268 13305 9096 4429 4612 7854 8184 9526 10952 10921 10772 4339
7794 4339 1219 2115 2929 8008 9553 8265 11253 11997 6913 3388 1668 2229 5043 9389 16008 17160
7778 17160 12960 9577 6720 2353 3847 4461 4771 3338 -70 -1205 80 2446 9447 13782 13990
$$ packed form
7891B268K051j418qN1l129p01J801M929J721q44o110M285O908Q67k529n649n04
7874C989K524p96l267L136M763q77J190J64q69k772j813M47j387j208l42j102
7858A780J783L392J054M078K704Q63k345j399J858K85Q70p71j343P84q65j695
7842A1033q28q25J188l003m32L083N26j227J152K292k952k696j50M89p18L514
7826A0446J459l667K126P28p49j043j060j0k666l213Q80K954L674J158J30Q47
7810A1994J855N39L166J981m267j963m209m667J83L242L30J342J426l1j49o433
7794D339l120Q96Q14N079J545j288K988P44n084l525j720N61K814M346O619J152
7778A7160m200l383k857m367J494O14L10j433l408j135J285K366P001M335K08
$$ plain form
7763 13990 11701 7120 4432 5690 9100 4116 5124 7485 7269 6482 5301 5867 8120 6534 7412 5436
7747 5436 2240 -2654 -4367 -6095 -6991 -5105 -2690 -1025 -131 2734 5924 6990 1927 -4636 -12739
7732 -12739 -18202 -13019 -7615 6162 24309 40235 51699 55968 57588 54171 48284 35768 20729
7719 20729 10310 1446 -6492 -8022 -6429 -5161 -3823 -557 3767 2547 2141 3361 -133 -4770 -6704
7704 -6704 -3798 -1902 2420 5968 12993 10767 6427 940 -1078 -4448 -4784 -547 5424 11895 15722
7689 15722 13832 8481 4927 4929 8017 6139 2901 -5690 -11889 -12016 -3668 1881 8588 9221 3098 -5193
7673 -5193 -5557 -8772 -7090 -2081 760 5943 10584 11117 6995 4066 -1309 -6001 -3635 -1877 1956
7658 1956 8330 6440 6317 7413 7893 7673 2718 1633 6221 6251 6957 9168 12290 14939 19716 22314
$$ packed form
7763A3990k289m581k688J258L410m984J008K361k16p87j181N66K253j586Q78j976
7747E436l196m894j713j728q96J886K415J665Q94K865L190J066n063o563q103
7732a2739n463N183N404J3777J8147J5926J1464M269J620l417n887j2516j5039
7719B0729j0419q864p938j530J593J268J338L266M324j220m06J220l494m637j934
7704f704K906J896M322L548P025k226m340n487k018l370l36M237N971O471L827
7689A5722j890n351l554KL088j878l238q591o199j27Q348N549O707O33o123q291
7673e193l64l215J682N009K841N183M641N33m122k929n375m692K366J758L833
7658A956O374j890j23J096M80k20m955j085M588L0P06K211L122K649M777K598
$$ plain form
7642 22314 19762 17800 18789 14702 3883 -3620 -5458 -7534 -7275 -7389 -4139 -477 5327 6682 634
7627 634 -669 5282 4632 3311 5210 7968 9807 2441 881 471 3994 5351 3481 3885 8211 11206
7611 11206 13680 12341 6548 3611 1019 1875 4252 4537 3486 5226 5189 5758 6713 9957 9110 7981
7595 7981 7277 5466 5566 3368 358 1894 2232 560 -308 4360 9610 9034 2536 -281 -347 1386 6707
7578 6707 13390 12932 10851 4983 2753 4605 4481 7659 7561 5674 27 -735 -3213 -7638 -9918 -8758
7562 -8758 -5410 -3753 -6426 -4415 2297 7258 7680 2129 2130 4346 8399 10901 7471 4423 3659 5798
7546 5798 6172 2361 -1574 6 1085 2151 4384 7935 7882 6330 8538 7292 6824 7605 9201 7451
7530 7451 4376 4828 6678 9306 10611 9710 7975 8068 9483 6698 6681 4110 1035 761 896 17 460
$$ packed form
7642B2314k552j962R89m087j0819p503j838k076K59j14L250L662N804J355o048
7627F34j303N951o50j321J899K758J839p366j560m10L523J357j870M04M326K995
7611A1206K474j339n793k937k592Q56K377K85j051J740l7N69R55L244q47j129
7595G981p04j811J00k198l010J536L38j672q68M668N250n76o498k817o6J733N321
7578F707O683m58k081n868k230J852j24L178r8j887n647p62k478m425k280J160
7562h758L348J657k673K011O712M961M22n551JK216M053K502l430l048p64K139
7546E798L74l811l935J580J079J066K233L551n3j552K208j246m68P81J596j750
7530G451l075M52J850K628J305r01j735R3J415k785j7k571l075k74J35q79M43
$$ plain form
7513 460 1705 1214 -1506 -2279 1746 2352 3322 3948 5424 7493 4191 3385 6865 8484 3647 -1700 -4588
7496 -4588 -4944 -6081 -4589 -1820 472 2225 2308 1101 1443 222 -2468 -3628 -944 -150 5936 9092
7480 9092 10270 9564 8550 6140 5150 3136 2253 1747 560 2991 -416 -574 1099 3293 3734 6923
7464 6923 5230 5191 4105 1889 921 1488 3943 4662 5357 8767 10261 6636 2858 1820 5511 5254 916
7447 916 2377 5890 2656 -69 -429 -1272 -2427 -3426 -5042 -4179 20 3246 2912 1363 -1716 -2652 -1955
7430 -1955 6541 9723 8198 7470 3749 6183 5930 5355 4964 5307 4864 5627 4075 7095 11946 6921 4653
7413 4653 2193 1802 6171 7121 6580 5119 4308 4997 3829 3686 3401 5260 2941 3581 2292 -1055 -4943
7396 -4943 -5498 -1056 -2086 -2375 1021 2865 -1635 -650 4468 4831 2998 2431 -1308 -287 2542 2002
$$ packed form
7513D60J245m91k720p73M025O06R70O26J476K069l302q06L480J619m837n347k888
7496d588l56j137J492K769K292J753Q3j207L42j221k690j160K684P94O086L156
7480I092J178p06j014k410r90k014q83n06j187K431l407j58J673K194M41L189
7464F923j693l9j086k216r68N67K455P19O95L410J494l625l778j038L691k57m338
7447I16J461L513l234k725l60q43j155r99j616Q63M199L226l34j549l079r36O97
7430a955Q496L182j525p28l721K434k53n75l91L43m43P63j552L020M851n025k268
7413D653k460l91M369R50n41j461q11O89j168j43k85J859k319O40j289l347l888
7396d943n55M442j030k89L396J844m500R85N118L63j833n67l739J021K829n40
$$ plain form
7380 2002 1378 926 -493 -426 -713 -1136 -2676 497 3133 3437 1030 3352 4286 1858 -1175 -2030 -250
7363 -250 -1708 -3811 316 5179 5801 2660 149 -1883 -2054 -5523 -6768 -2668 -138 -979 358 2620
7347 2620 283 -1660 -2600 2981 6885 7663 4788 5372 2499 1983 4097 3575 3782 9169 9552 6249 1934
7330 1934 1121 -1587 -5083 -2893 350 384 -666 -1737 943 1134 -542 -607 -3661 -3923 -1748 -981 -2471
7313 -2471 -3091 -425 -532 -1431 -94 -3405 -6873 -5813 -5291 -3198 -806 -132 2580 4662 4396 5234 3361
7296 3361 3758 8506 7710 3535 6359 5413 3635 3666 -375 -4006 -1242 1928 -657 -1231 1111 2456
7280 2456 2215 340 -1879 1378 5879 7455 7468 8383 5617 2439 1328 4239 5772 5759 5489 3982 2698
7263 2698 3856 5085 8480 6750 5092 6737 7320 8704 7635 3794 5230 4437 710 -625 2039
$$ packed form
7380B002o24m52j419O7k87m23j540L173K636L04k407K322R34k428l033q55J780
7363b50j458k103M127M863O22l141k511k032j71l469j245M100K530q41J337K262
7347B620k337j943r40N581L904P78k875N84k873n16K114n22K07N387L83l303m315
7330A934q13k708l496K190L243L4j050j071K680J91j676o5l054k62K175P67j490
7313b471o20K666j07q99J337l311l468J060N22K093K392O74K712K082k66Q38j873
7296C361L97M748p96m175K824r46j778L1m041l631K764L170k585n74K342J345
7280B456k41j875k219L257M501J576J3R15k766l178j111K911J533j3k70j507j284
7263B698J158J229L395j730j658J645N83J384j069l841J436p93l727j335K664
$$ plain form
7248 2039 2819 3007 2916 3671 5119 4433 797 3673 5718 665 -1690 -1751 -3456 -2477 -2106 -4048 -3955 -495
7230 -495 229 -2835 -5553 -5777 -4285 4421 3982 -1599 -1832 -953 -2838 -4342 -5117 146 425 -233 -1540
7213 -1540 -1098 -2594 1842 4195 5024 5665 6322 6021 4659 -338 -3040 -5734 -6637 -6695 -6702 -2146 -3484 -2321
7195 -2321 1824 1165 2272 3663 2155 3029 1332 -3781 -5311 -755 2616 874 3151 2620 -605 -599
7179 -599 4332 3505 4567 1685 -387 -808 -2401 -3498 342 3693 7430 10835 10991 10870 8243 7335
7163 7335 4364 4541 1325 1218 740 -2077 -3959 -5070 -6368 -6525 -4635 1189 3378 -506 -2040 1567
7147 1567 4365 4543 -443 -741 -282 792 824 6482 9811 4221 217 -2297 1199 3962 1322 -2390
7131 -2390 422 4967 7238 6629 3823 1714 1287 3231 1876 -979 -1855 -3126 -586 -602 1963 2052 1065
$$ packed form
7248B039P80J88r1P55J448o86l636K876K045n053k355o1j705R79L71j942R3L460
7230d95P24l064k718k24J492Q706m39n581k33Q79j885j504p75N263K79o58j307
7213a540M42j496M436K353Q29O41O57l01j362m997k702k694r03n8pM556j338J163
7195b321M145o59J107J391j508Q74j697n113j530M556L371j742K277n31l225O
7179e99M931q27J062k882k072m21j593j097L840L351L737L405J56j21k627r08
7163G335k971J77l216j07m78k817j882j111j298j57J890N824K189l884j534L607
7147A567K798J78m986k98M59J074L2N658L329n590m004k514L496K763k640l712
7131b390K812M545K271o09k806k109m27J944j355k855q76j271K540j6K565Q9r87
$$ plain form
7114 1065 4546 8121 3368 -433 -3147 -1952 434 1640 1845 364 -530 -295 -514 -4463 -1241 -561
7098 -561 -2074 752 3134 3543 2935 812 619 1363 -716 -1397 -1603 -1816 73 4 3311 4068 5185 3289
7080 3289 3513 1356 3353 2047 94 -243 3916 5617 4825 2447 4820 7189 7195 4487 2513 4090
7064 4090 3723 -1446 -3268 -2195 -2417 -2425 -1539 -964 -2945 1281 5618 6639 5748 5657 2579 3530 3906 5367
7046 5367 3671 -108 -1669 524 1521 -1948 -1684 -587 -2402 -5791 -2571 -3542 167 -2550 -5451 -3556
7030 -3556 -3616 -4105 -2307 -2403 -1646 -773 -1150 -629 4191 4295 785 -5433 -5315 347 1514 -2200 -7429 -4955
7012 -4955 -2176 839 2949 333 -5044 -7806 -4648 -981 -656 -992 -916 -3836 -6611 -5474 -2338 732
6996 732 -2849 -5537 -8024 -7891 62 804 -1465 -1140 -3884 -4358 1302 3342 3126 1263 2055 -484 -2760
$$ packed form
7114A065L481L575m753l801k714J195K386J206K05j481q94K35k19l949L222O80
7098e61j513K826K382M09o08k123j93P44k079o81k06k13J889o9L307P57J117j896
7080C289K24k157J997j306j953l37M159J701p92k378K373K369Ok708j974J577
7064D090l67n169j822J073k22qQ86N75j981M226M337J021q91r1l078R51L76J461
7046E367j696l779j561K193R97l469K64J097j815l389L220r71L709k717k901J895
7030c556o0m89J798r6P57Q73l77N21M820J04l510o218J18N662J167l714n229K474
7012d955K779L015K110k616n377k762L158L667L25l36P6k920k775J137L136L070
6996G32l581k688k487J33P953P42k269L25k744m74N660K040k16j863P92k539k276
$$ plain form
6979 -2760 -4614 -3204 -2947 -6969 -6898 -4208 -4934 -5360 -3734 -5859 -5021 -1213 3495 2240 -1510 -4291
6963 -4291 -4128 -1227 751 -1530 -2026 -2744 -94 -238 -2495 -2544 -5348 -4802 160 -1351 -1493 -3788 -4088
6946 -4088 -41 4465 2838 1941 2830 -859 -6324 -6052 -4986 -511 -144 1054 3251 4079 5530 7835
6930 7835 4864 -4823 -4133 -1919 -974 1128 -2188 -112 2788 3473 5814 5972 2717 -540 -3582 -2255
6914 -2255 -685 -615 1069 705 -871 -592 49 -1666 -483 -2043 168 3031 -1343 -5719 -9217 -5390
6898 -5390 -6407 -7664 -6915 -6813 -7216 -6627 -8549 -11433 -11701 -6042 -5824 -9221 -7797 -5555 -2168 1207
6882 1207 461 -1902 -2604 -3041 -6172 -3600 -2834 -1028 1202 -154 -2713 -437 -582 -805 -1717 -3855 -1409
6865 -1409 -388 -1537 -3071 -5463 -5964 -4395 -6263 -6799 -7398 -4351 -806 1050 1052 3057 2148 -928 821
$$ packed form
6979b760j854J410K57m022P1K690p26m26J626k125Q38L808M708j255l750k781
6963d291J63K901J978k281m96p18K650j44k257m9k804N46M962j511j42k295l00
6946d088M047M506j627q97Q89l689n465K72J066M475L67J198K197Q28J451K305
6930G835k971r687O90K214R45K102l316K076K900O85K341J58l255l257l042J327
6914b255J570P0J684l64j576K79O41j715J183j560K211K863m374m376l498L827
6898e390j017j257P49J02m03N89j922k884k68N659K18l397J424K242L387L375
6882A207p46k363p02m37l131K572P66J806K230j356k559K276j45k23r12k138K446
6865a409J021j149j534k392n01J569j868n36n99L047L545J856KK005r09l076J749
$$ plain form
6848 821 2837 4631 6114 5214 2964 1216 78 -704 -2778 -1255 -838 -1425 -2802 -5800 -5247 -4079
6832 -4079 -337 691 -2329 -5345 -4898 -4645 -6779 -4898 -1951 -1514 -3473 -3013 -1061 916 -1501 -2611
6816 -2611 -1666 87 5127 6663 4581 1639 -964 -1322 -100 -511 -339 69 742 -526 -619 530 1568
6799 1568 965 -229 2146 3479 1037 1246 4112 633 -6677 -7075 -5152 -5477 -5472 -5874 -6878 -3326 -869
6782 -869 759 -2657 -2843 -904 -2033 540 2781 2041 339 -2164 -6797 -6338 -5501 -3870 -1860 -483
6766 -483 1000 3519 609 1115 6478 4595 -2138 -4683 -2540 -5305 -6100 -3392 -4621 -3574 -889 5315
6750 5315 4097 -245 -2401 -3624 -2454 -4155 -4542 -3807 -2569 -974 -2522 -3795 -5192 -5562 -3737 -379
6734 -379 2882 4731 2780 2650 2347 2157 3966 4625 4260 1861 -810 -2661 -587 5108 5821 5690 5958
$$ packed form
6848H21K016J794J483r00k250j748j138p82k074J523M17n87j377k998N53J168
6832d079L742J028l020l016M47K53k134J881K947M37j959M60J952J977k417j110
6816b611R45J753N040J536k082k942k603l58J222m11J72M08O73j268r3J149J038
6799A568o03j194K375J333k442K09K866l479p310l98J923l25Nm02j004L552K457
6782h69J628l416j86J939j129K573K241p40j702k503m633M59Q37J631K010J377
6766d83J483K519k910N06N363j883o733k545K143k765p95K708j229J047K685O204
6750E315j218m342k156j223J170j701l87P35J238J595j548j273j397l70J825L358
6734c79L261J849j951j30l03j90J809O59l65k399k671j851K074N695P13j31K68
$$ plain form
6717 5958 7421 9770 8851 6603 1615 1710 1749 4051 2491 -850 103 3379 5450 1509 -2242 -448
6701 -448 -2764 -3171 2259 3265 -2895 -6189 -2784 -906 -2960 -4657 -7940 -5780 -3295 -3014 -2687 722
6685 722 3648 607 -5239 -6283 -4920 -2520 1457 3808 1311 3070 5508 2853 2297 2809 4291 2365
6669 2365 2550 1697 4350 3555 1092 -1351 -5866 -6625 -2952 -2721 -3074 -1598 -757 55 676 -2750 -1809
6652 -1809 -699 -167 1364 898 190 -3097 -4123 -7445 -8612 -6700 -2962 -3951 -6496 -5474 -2447 -1938
6636 -1938 -1865 -649 -144 144 645 -659 -4749 -6752 -4927 -6377 -8119 -3268 2636 4086 -2323 -5997
6620 -5997 -5325 -5209 -9146 -10162 -7065 -2009 -60 2590 5068 7380 4861 1235 -3088 -2132 -4438 -7107
6604 -7107 -1426 -2207 -6699 -5333 -7208 -8612 -10377 -8489 -5394 -984 1505 -986 -789 -2844 -5386
$$ packed form
6717E958J463K349r19k248m988R5L9K302j560l341R53L276K071l941l751J794
6701d48k316m07N430J006o160l294L405J878k054j697l283K160K485K81L27L409
6685G22K926l041n846j044J363K400L977K351k497J759K438k655n56N12J482j926
6669B365J85q53K653p95k463k443m515p59L673K31l53J476Q41Q12O21l426R41
6652a809J110N32J531m66p08l287j026l322j167J912L738r89k545J022L027N09
6636a938P3J216N05K88N01j304m090k003J825j450j742M851N904J450o409l674
6620e997O72J16l937j016L097N056J949K650K478K312k519l626m323R56k306k669
6604g107N681p81m492J366j875j404j765J888L095M410K489k491J97k055k542
$$ plain form
6589 -5386 -2938 -1631 5209 9624 13503 10082 5201 2524 2143 3673 3050 2475 2527 1087 -1035 -3108
6573 -3108 -2261 -1633 -2791 -149 4644 3561 3703 2189 152 -1708 -4188 -5703 -5523 -2998 -5040 -3895
6557 -3895 -2508 -739 1361 3277 4498 -1229 -5915 -4099 -2525 -273 2286 -566 -3710 -4849 -6177
6542 -6177 -3909 -1459 -1104 -1526 -1629 -3275 -6590 -6492 -6366 -4900 -3618 -4265 -4029 -3658 -2248 2002 4564
6525 4564 2421 -2901 -6855 -1638 -50 -954 -2981 -2309 -2977 -2981 -596 -570 -1546 -2296 -4570 -3054 -7048
6508 -7048 -6080 -3004 -1787 -3254 -2489 -1452 108 -2848 -2558 -3339 -4999 -5473 -3380 -4816 -5872 -3521
6492 -3521 -520 3835 2446 -448 -4413 -4933 -3927 -2084 -20 4228 8059 10418 9126 9266 10599
6477 10599 6161 -145 -2053 -2584 -2271 2615 3344 668 2761 2190 1097 1172 716 -54 3269 1908 449
$$ packed form
6589e386K448J307O840M415L879l421m881k677l81J530o23n75N2j440k122k073
6573c108Q47O28j158K642M793j083J42j514k037j860k480j515J80K525k042J145
6557c895J387J769K100J916J221n727m686J816J574K252K559k852l144j139j328
6542f177K268K450L55m22j03j646l315R8J26J466J282o47K36L71J410M250K562
6525D564k143n322l954N217J588r04k027O72o68mK385K6r76p50k274J516l994
6508g048R68L076J217j467P65J037J560k956K90p81j660m74K093j436j056K351
6492c521L001M355j389k894l965n20J006J843K064M248L831K359j292J40J333
6477A0599m438o306j908n31L13M886P29k676K093n71j093P5m56p70L323j361j459
$$ plain form
6460 449 378 524 742 -3339 -5337 -4513 -1336 -2319 -4095 -1525 -120 1858 -1176 -4271 -4842 -1840 -2009
6443 -2009 -1260 585 1606 50 -4557 -4452 -4019 -3799 -4536 -4890 -6098 -6444 -8129 -5839 -3446 -1353 -2766
6426 -2766 -1501 1836 4645 5383 8888 8910 7467 5036 8777 8926 6841 3170 -3730 -8773 -6528 -4690
6410 -4690 -1998 -3212 -2859 -245 270 -1941 -5621 -3116 719 -432 -1483 -177 -2739 -8880 -7502
6395 -7502 -3707 -3488 -6859 -10895 -8428 -2155 -3468 -5258 -3163 -4426 -2631 -1860 -4164 -8275 -10028
6380 -10028 -10396 -12985 -13430 -8313 -7277 -8580 -8020 -5375 -2904 -2000 -2702 -3849 -4321 -4836 -7238 -1701
6364 -1701 1892 1091 -2530 -4380 966 -466 -3090 -4509 -4278 -4730 -5361 -7291 -4107 -3029 -913 -904 318
6347 318 2902 2069 1564 4705 3310 1466 1902 3598 1138 2251 140 -2349 -1771 1197 628 -1131
$$ packed form
6460D49p1J46K18m081j998Q24L177r83j776K570J405J978l034l095n71L002j69
6443b009P49J845J021j556m607J05M33K20p37l54j208l46j685K290K393K093j413
6426b766J265L337K809P38L505K2j443k431L741J49k085l671o900n043K245J838
6410d690K692j214L53K614N15k211l680K505L835j151j051J306k562o141J378
6395g502L795K19l371m036K467O273j313j790K095j263J795P71k304m111j753
6380a0028l68k589m45N117J036j303N60K645K471R04p02j147m72n15k402N537
6364a701L593q01l621j850N346j432k624j419K31m52o31j930L184J078K116RJ222
6347C18K584q33n05L141j395j844M36J696k460J113k111k489N78K968n69j759
$$ plain form
6331 -1131 -1677 -1238 1082 813 -2481 -5331 -5360 -5230 -2611 2386 4663 4858 6615 3134 2074 1436 -932
6314 -932 -184 2000 3495 1003 -3142 -1779 -305 836 126 -2459 -33 7187 6076 6485 7600 6402
6298 6402 3596 814 1738 -684 -780 550 167 -921 -1181 -770 -2097 -6461 -7085 -2819 -4465 -5163 -3005
6281 -3005 -4153 -2036 -5791 -3490 -4316 -2925 237 1310 -811 -4450 -7499 -4108 -2025 -2675 -3467 -2124
6265 -2124 -1037 274 -711 358 2575 3038 2027 -151 -1817 -4438 -6757 -6519 -3866 -2707 4053 3854
6249 3854 676 3340 4555 -959 -2235 -2611 -2815 -1365 -1009 -2876 -4991 -2908 85 2067 124 -2862
6233 -2862 -3150 -229 214 1120 -2926 -8466 -9730 -8127 -3638 -311 -2228 -3868 -719 1972 5651 3656
6217 3656 1316 708 800 488 -2153 -411 -4064 -3286 -5973 -7432 -4299 -435 3868 1545 2640 6908
$$ packed form
6331a131n46M39K320k69l294k850k9J30K619M997K277J95J757l481j060o38k368
6314i32P48K184J495k492m145J363J474J141p10k585K426P220j111M09J115j198
6298F402k806k782R24k422r6J330l83j088k60M11j327m364o24M266j646o98K158
6281c005j148K117l755K301q26J391L162J073k121l639l049L391K083o50p92J343
6265b124J087J311r85J069K217M63j011k178j666k621k319K38K653J159O760j99
6249C854l178K664J215n514j276l76k04J450L56j867k115K083K993J982j943k986
6233b862k88K921M43R06m046n540j264J603M489L327j917j640L149K691L679j995
6217C656k340o08R2l12k641J742l653P78k687j459L133L864M303k323J095M268
$$ plain form
6201 6908 3186 1712 6973 6596 345 -1075 -4147 -4844 -3112 -3896 -4064 -6561 -10533 -7907 -4816 -5090
6185 -5090 -6004 -1669 -1533 -962 -3950 -4846 -2591 -2348 -492 3784 8444 5027 -1682 -1594 -3788 -4728 -1074
6168 -1074 -1697 -4947 -5974 -6525 -5236 -4792 -3602 -171 1231 -1989 -3664 -3717 -5067 -3785 -4464 -6507
6152 -6507 -6145 -2184 -2708 34 -3546 -8719 -10671 -9511 -6167 -5328 -1727 -92 -4959 -4959 -3130 -3935 -4030
6135 -4030 -7163 -8801 -9187 -13367 -8157 -2871 -3369 -4205 -3641 -3727 -5656 -6914 -9416 -10183 -9651 -4412 -3584
6118 -3584 -967 -3476 -2726 496 2913 2754 1416 1107 -3562 -3135 -1528 2593 1154 -1135 -1579 -1695
6102 -1695 -1910 -587 628 2147 -2940 -3973 -1041 -489 -4110 -4208 -5114 -2858 -5197 -8693 -8706 -6333 -8474
6085 -8474 -7896 -4425 -3598 -1810 1765 1495 -68 -698 -1821 -682 694 3844 4273 2167 4589 3784
$$ packed form
6201F908l722j474N261l77o251j420l072o97J732p84j68k497l972K626L091k74
6185e090r14M335J36N71k988q96K255K43J856M276M660l417o709Q8k194r40L654
6168a074o23l250j027n51J289M44J190L431J402l220j675n3j350J282o79k043
6152f507L62L961n24K742l580n173j952J160L344Q39L601J635m867%J829q05r5
6135d030l133j638l86m180N210N286m98q36N64q6j929j258k502p67N32N239Q28
6118c584K617k509P50L222K417j59j338l09m669M27J607M121j439k289m44j16
6102a695k15J323J215J519n087j033K932N52l621r8r06K256k339l496j3K373k141
6085h474N78L471Q27J788L575k70j563o30j123J139J376L150M29k106K422q05
$$ plain form
6069 3784 -3125 -2555 2498 2927 5300 2094 -199 2186 7030 9968 13682 13024 9647 10610 5689 6432
6053 6432 9957 12249 14678 11681 10218 7628 3992 1449 2110 1726 1352 1651 2754 3498 2335 1820
6037 1820 2658 876 -79 2255 4125 1553 -2773 -1943 -24 -388 1436 3141 4700 5910 5180 2798
6021 2798 1732 -493 -2600 -3130 -1797 -2108 -4175 -2720 789 2563 305 -4048 -2508 2339 -1350
6006 -1350 -4509 -4288 -1196 2354 2871 1240 1988 3522 -1968 -1734 -2437 1853 7528 5214 3203 -100
5990 -100 79 -2236 -5018 -4368 -6650 -6413 -5193 -6541 -2811 -308 -4881 -6635 -7113 -4635 -7334 -11239
5974 -11239 -8153 -5902 -9852 -13775 -10816 -9725 -6909 -5818 -3789 -1260 -1679 -6115 -5064 -1916 -3866
5959 -3866 -942 1027 3221 879 1332 -1670 -5528 -6369 -7609 -6889 -3124 -2612 -2360 -3461 -1609 227
$$ packed form
6069C784o909N70N053M29K373l206k293K385M844K938L714o58l377R63m921P43
6053F432L525K292K429k997j463k590l636k543O61l84l74K99J103P44j163n15
6037A820Q38j782r55K334J870k572m326Q30J919l64J824J705J559J210p30k382
6021B798j066k225k107n30J333l11k067J455L509J774k258m353J540M847l689
6006a350l159K21L092L550N17j631P48J534n490K34p03M290N675k314k011l303
5990a00J79k315k782O50k282K37J220j348L730K503m573j754m78K478k699l905
5974a1239L086K251l950l923K959J091K816J091K029K529m19m436J051L148j950
5959c866K924J969K194k342M53l002l858q41j240P20L765N12K52j101J852J836
$$ plain form
5943 227 -1188 -4975 -6570 -6198 -6348 -8039 -4927 27 -201 -4915 -6498 -4029 -6522 -7737 -6383 -6865
5927 -6865 -9155 -7018 -4530 -2706 -4359 -6037 -7267 -5570 -4983 -6650 -6792 -6512 -4937 -4662 1646 5583
5911 5583 2824 1959 1068 1123 1080 2952 6461 512 -3753 -3963 -1847 742 4794 6973 3043 -446 -6586
5894 -6586 -8095 -6747 -3959 -5322 -4802 -4859 -3486 -2606 -1980 -3218 -6924 -11015 -10603 -6760 -4337 -1380
5878 -1380 -1511 2302 6670 5735 3305 4959 6703 3558 740 -2967 -9512 -12257 -3980 -2431 -4340
5863 -4340 -4934 -4058 -3108 -4398 -2407 -67 -2119 -2653 -2419 -1294 1137 1293 2728 344 -3666 -6847
5847 -6847 -9011 -4487 1436 5964 4821 4616 4417 1625 2080 -119 -1280 -1502 -4803 -4385 -2206 -3233
5831 -3233 -3078 -3597 -4763 -6402 -3388 -5035 -2286 -5684 -5967 -9792 -6725 -1679 1925 6056 2370 1868
$$ packed form
5943B27j415l787j595L72j50j691L112M954k28m714j583K469k493j215J354m82
5927f865k290K137K488J824j653j678j230J697N87j667j42K80J575K75O308L937
5911E583k759q65q91N5m3J872L509n949m265k10K116K589M052K179l930l489o140
5894f586j509J348K788j363N20n7J373Q80O26j238l706m091M12L843K423K957
5878a380j31L813M368r35k430J654J744l145k818l707o545k745Q277J549j909
5863d340n94Q76R50j290J991K340k052n34K34J125K431J56J435k384m010l181
5847f847k164M524N923M528j143k05j99k792M55k199j161k22l301M18K179j027
5831c233J55n19j166j639L014j647K749l398k83l825L067N046L604M131l686n02
$$ plain form
5815 1868 331 -2436 -2581 -3047 -7515 -9105 -7889 -916 2596 -1395 -8186 -5428 -574 2524 1102
5800 1102 -4708 -4642 -2629 -4524 -3018 -1658 -3127 -1134 1106 279 -7861 -9057 -4231 -2042 -526 -3049
5784 -3049 -6284 -5319 -5526 -8284 -7706 -6373 -2407 402 383 -634 -3222 -8130 -9321 -7431 -5455 -650
5768 -650 2806 -779 -3221 -2404 -806 2576 3367 -147 -3462 -2950 -4101 -6131 -8190 -7219 -6544 -4318
5752 -4318 -3919 -1704 670 2867 -535 -2078 635 333 97 910 -2410 -3850 -406 307 -1919 -7581
5736 -7581 -8879 -8237 -6614 -746 2421 2268 -1234 -1002 -2391 -1709 -4158 -5603 -4687 -3595 -7313 -2455
5720 -2455 -2377 -5089 -5617 -3206 -1185 141 78 -2280 -4580 -1879 1122 2758 -371 -2385 -8247 -12019
5704 -12019 -12697 -9413 -3341 -865 -2152 -3125 -150 -418 -978 -4452 -7467 -4107 -1408 -3922 -1591 -999
$$ packed form
5815A868j537k767j45m66m468j590J216O973L512l991o791K758M854L098j422
5800A102n810O6K013j895J506J360j469J993K240q27q140j196M826K189J516k523
5784c049l235R65k07k758N78J333L966K809j9j017k588m908j191J890J976M805
5768f50L456l585k442Q17J598L382P91l514l315N12j151k030k059R71O75K226
5752d318L99K215K374K197l402j543K713l02k36Q13l320j440L444P13k226n662
5736g581j298O42J623N868L167j53l502K32j389O82k449j445R16J092l718M858
5720b455P8k712n28K411K021J326o3k358k300K701L001J636l129k014n862l772
5704a2019o78L284O072K476j287r73K975k68n60l474l015L360K699k514K331N92
$$ plain form
5688 -999 -1963 -4900 -7356 -4817 -2815 -4067 -4743 -6037 -4607 -5341 -5722 -3145 -3431 -3695 -2712 -163 -1502
5671 -1502 -6098 -9397 -7749 -3570 -6383 -7178 -5064 -5098 -4622 -1621 -1017 -1220 -2068 -3382 -3578 -1564 -1320
5654 -1320 -1401 319 -791 -584 749 1315 4524 4579 1156 -231 2140 318 202 -2194 -2411 377 -4080
5637 -4080 -10103 -5252 302 -2532 -4053 -3285 -5486 -9574 -9967 -11005 -8422 -9356 -5920 -7108 -7121 -3940
5621 -3940 -4482 -6715 -6343 -6099 -7715 -6878 -9092 -10592 -7252 -1050 -404 -2609 -2455 1112 4632 1753
5605 1753 -513 -2503 -300 1560 2932 259 917 -1777 -7846 -8883 -6934 -3631 -5185 -4491 261
5590 261 4243 7059 6298 3892 151 100 2599 -140 -3408 -2062 -2725 -2363 -835 -1358 1513 1486 -753
5573 -753 1712 3081 -1185 -2284 -3808 -4844 -6349 -5944 -5149 -5722 135 1317 825 834 -905 710 213
$$ packed form
5688i99r64k937k456K539K002j252o76j294J430p34l81K577k86k64R83K549j339
5671a502m596l299J648M179k813p95K114l4M76L001O04k03q48j314j96K014K44
5654a320q1J720j110K07J333N66L209N5l423j387K371j822j16k396k17K788m457
5637d080o023M851N554k834j521P68k201m088l93j038K583r34L436j188j3L181
5621c940n42k233L72K44j616Q37k214j500L340O202O46k205J54L567L520k879
5605A753k266j990K203J860J372k673O58k694o069j037J949L303j554O94M752
5590B61L982K816p61k406l741n1K499k739l268J346o63L62J528n23K871k7k239
5573g53K465J369m266j099j524j036j505M05P95n73N857J182m92Rj739J615m97
$$ plain form
5556 213 -3811 -3715 -580 -582 -2994 -3090 -1179 -3721 -1665 -1328 -5855 -5364 -1702 122 2007 -1025 -4678
5539 -4678 -102 -1325 -2532 -5900 -5448 -3429 -2164 -1783 -1691 -2401 -2755 -266 2895 4906 -1434 -7223
5523 -7223 -6300 -5859 -6006 -4693 -5709 -3265 -2582 875 1321 -2404 -4296 -3110 -5370 -2694 -100 805
5507 805 -218 -4046 -6156 -8029 -5333 -1080 -3501 -6600 -3828 -892 -256 518 1887 -720 -1304 -120
5491 -120 -3720 -4259 -4026 -1864 874 938 -3173 -3299 -1400 119 -3697 -5204 -3300 -399 4718 6955
5475 6955 3190 2066 3473 3005 2422 4907 3888 -3602 -4513 -2092 472 -2864 -2209 1834 -1299 -6769
5459 -6769 -7069 -1780 2107 2533 3888 1095 3406 2569 1063 -2374 -4439 -5897 -1104 2192 -731 -649
5443 -649 656 2753 413 7 -963 970 7251 10098 4514 -875 -1659 -3256 -4642 -1683 -1017 -197
$$ packed form
5556B13m024R6L135kk412r6J911k542K056L37m527M91L662J824J885l032l653
5539d678M576j223j207l368M52K019J265L81R2p10l54K489L161K011o340n789
5523g223R23M41j47J313j016K444O83L457M46l725j892J186k260K676K594R05
5507H05j023l828k110j873K696M253k421l099K772K936O36P74J369k607n84J184
5491a20l600n39K33K162K738O4m111j26J899J519l816j507J904K901N117K237
5475F955l765j124J407m68n83K485j019p490r11K421K564l336O55M043l133n470
5459f769l00N289L887M26J355k793K311q37j506l437k065j458M793L296k923Q2
5443f49J305K097k340m06r70J933O281K847n584n389p84j597j386K959O66Q20
$$ plain form
5427 -197 -1830 -4592 -7416 -4396 -5234 -6115 -3433 -1849 -977 1188 4021 858 353 1179 1690 -2070 -3045
5410 -3045 -1503 -2968 -1947 -5115 -5309 601 2389 160 -383 2073 1656 3094 1328 937 729 994
5394 994 -3120 -5735 -4516 -6378 -2390 2933 2139 -1756 -186 583 -3151 -2722 -40 434 -1615 -2994
5378 -2994 -1759 6014 8409 8184 5798 504 -1481 -246 -3697 -5027 -384 -3263 -2810 -5529 -8177
5363 -8177 -6214 -7929 -6776 -6251 -4554 -4121 -999 -1803 -2997 -3663 -4816 -2806 -5102 -5851 -3202 -3753
5347 -3753 -2420 -4490 -7337 -7029 -4964 -3065 -5468 -5739 -5662 -2641 -4828 -3925 -880 819 -185 -2014
5331 -2014 1650 -64 2086 2979 1739 -1424 474 111 1449 818 -353 456 1818 -3134 -4357 -909
5315 -909 1583 -2470 -2986 -2172 1786 2793 3114 644 -4835 -3185 -1513 -1561 -2235 -2551 -1726 1674 4018
$$ packed form
5427a97j633k762k824L020q38q81K682J584Q72K165K833l163n05Q26N11l760r75
5410c045J542j465J021l168j94N910J788k229n43K456m17J438j766l91k08K65
5394I94m114k615J219j862L988N323p94l895J570P69l734M29K682M74k049j379
5378b994J235P773K395k25k386n294j985J235l451j330M643k879M53k719k648
5363h177J963j715J153N25J697M33L122q04j194o66j153K010k296p49K649n51
5347c753J333k070k847L08K065J899k403k71P7L021k187R03L045J699j004j829
5331b014L664j714K150Q93j240l163J898l63J338o31j171Q09J362m952j223L448
5315i09K492m053n16Q14L958J007L21k470n479J650J672m8o74l16Q25L400K344
$$ plain form
5298 4018 5821 5179 2340 -900 -3345 -5964 -10287 -15704 -15679 -8601 -3279 726 3220 3096 4217 5465
5282 5465 2000 -3434 -4204 -3691 -4613 -3269 1797 4425 1308 -86 -1331 2091 3626 1737 1807 3964
5266 3964 8232 8450 2999 2227 317 344 3146 4757 5660 5741 2612 1908 1217 1004 2032 -2332 -3260 -3398
5248 -3398 -5272 -7260 -10609 -10578 -10207 -10966 -7817 -4066 -1120 1511 4224 3972 4130 1334 751 1119 -101
5231 -101 -3620 -5403 -8388 -10061 -6806 -5691 -1994 -1212 -3810 1677 4406 694 -295 -3439 -5020 -2766
5215 -2766 -187 -990 -2340 -1650 1813 3816 6024 9586 5921 1414 -3209 -8288 -9594 -8555 -7701 -8643
5199 -8643 -6484 -4971 -4173 -9561 -12928 -8888 -12146 -15236 -12352 -5426 -2009 -4513 -431 3610 -767
5184 -767 -2244 -4803 -6663 294 3573 2760 226 -897 2461 2083 1502 3627 6924 8761 7723 7008
$$ packed form
5298D018J803o42k839l240k445k619m323n417K5P078N322M005K494j24J121J248
5282E465l465n434p70N13r22J344N066K628l117j394j245L422J535j889P0K157
5266C964M268K18n451p72j910K7K802J611R03Q1l129p04o91k13J028m364r28j38
5248c398j874j988l349L1L71p59L149L751K946K631K713k52J58k796n83L68j220
5231a01l519j783k985j673L255J115L697P82k598N487K729l712r89l144j581K254
5215b766K579q03j350O90L463K003K208L562l665m507m623n079j306J039Q54r42
5199h643K159J513P98n388l367M040l258l090K884O926L417k504M082M041m377
5184g67j477k559j860O957L279q13k534j123L358l78n81K125L297J837j038p15
$$ plain form
5168 7008 3359 -3296 -9760 -12720 -16531 -21356 -25917 -27133 -22991 -15584 -7098 -705 5058 3792 2445
5153 2445 1541 1143 -270 1652 1990 5228 2754 38 -2758 -1088 1214 169 3133 6057 4852 3049
5137 3049 84 1708 -1315 -9567 -12139 -15949 -16332 -5077 2453 10043 14910 16468 12709 12015 5066
5122 5066 -764 -4082 -12354 -16007 -14286 -5612 981 5333 4323 3514 3372 -278 74 2097 228 -2176
5106 -2176 -4389 -2580 -1090 -1619 -1510 -4798 -5241 -6570 -8641 -5869 3551 6818 -1206 -9976 -8664 -8373
5090 -8373 -4989 1849 11697 18514 19179 14494 7189 2504 3069 1255 -4334 -8312 -5486 -756 2345
5075 2345 3828 -1213 -2876 -311 -3463 -3747 -455 -883 -2050 -297 1714 776 -2855 -2346 -6925 -8270
5059 -8270 -6662 -3839 -7321 -10807 -9779 -7692 -2138 586 -519 -2310 -4575 -7086 -10265 -13153 -13617
$$ packed form
5168G008l649o655o464k960l811m825m561j216M142P407Q486O393N763j266j347
5153B445r04l98j413J922L38L238k474k716k796J670K302j045K964K924j205j803
5137C049k965J624l023q252k572l810l83J1255P530P590M867J558l759o94o949
5122E066n830l318q272l653J721Q674O593M352j010q09j42l650L52K023j869k404
5106b176k213J809J490n29J09l288m43j329k071K772R420L267q024q770J312K91
5090h373L384O838R848O817O65m685p305m685N65j814n589l978K826M730L101
5075B345J483n041j663K565l152k84L292m28j167J753K011r38l631N09m579j345
5059h270J608K823l482l486J028K087N554K724j105j791k265k511l179k888m64
$$ plain form
5044 -13617 -12046 -16437 -15563 -11099 -3567 -1641 -1475 -18 1150 5629 9023 12493 8871 3479 399
5029 399 -1330 822 1556 -573 -1411 1828 2192 -3103 -3715 -4399 -7123 -6094 -1854 3463 6217 4610
5013 4610 7453 7836 5878 4988 7259 2807 -3406 -4779 -7458 -8756 -9879 -7484 -4102 -2812 -611
4998 -611 1775 4317 1761 -680 2380 7354 6439 5924 2434 -2743 -3582 296 5073 8062 8004 6030
4982 6030 4159 4854 4426 2491 -855 -4538 -864 -2402 -2503 -1806 575 4005 2782 3086 1841 1294
4966 1294 1547 3213 6148 7711 1873 1211 1502 -754 -1630 -985 -1780 -5551 -6510 -11879 -11007 -8628 -12389
4949 -12389 -13118 -8624 -5661 -2183 1027 3801 4838 3647 2443 2906 2145 2916 1566 -1131 -2541 -4919
4933 -4919 -4697 -4050 1108 2326 -1538 -5375 -5992 1064 205 -2934 -3069 -1986 -2551 -5972 -2669 -1983 -1319
$$ packed form
5044a3617J571m391Q74M464P532J926J66J457J168M479L394L470l622n392l080
5029C99j729K152P34k129q38L239L64n295o12o84k724J029M240N317K754j607
5013D610K843L83j958q90K271m452o213j373k679j298j123K395L382J290K201
4998f11K386K542k556k441L060M974r15n15l490n177q39L878M777K989n8j974
4982F030j871O95m28j935l346l683L674j538j01O97K381L430j223L04j245n47
4966A294K53J666K935J563n838o62K91k256q76O45p95l771r59n369Q72K379l761
4949a2389p29M494K963L478L210K774J037j191j204M63p61P71j350k697j410k378
4933d919K22O47N158J218l864l837o17P056q59l139j35J083n65l421L303O86O64
$$ plain form
4916 -1319 -1440 -2329 -1185 -825 -3523 -8595 -10362 -8754 -5687 -7688 -9408 -8115 -6861 -8839 -6145 1578
4900 1578 41 -7511 -7461 -4474 -1494 947 3668 2182 -551 -897 -316 -460 224 2353 -1517 -4733
4884 -4733 -5688 -6102 -8953 -12152 -7973 -4297 -2517 -3901 -7377 -12443 -8392 -6972 -7552 -4649 -3653 -4856
4868 -4856 -6074 -9446 -6054 -2260 -2576 -3888 -1802 1330 -1494 -2931 -3747 -5617 -8305 -8117 -5699 1881
4852 1881 1298 -495 402 2264 -3540 -6134 -7071 -9168 -6982 -7377 -7721 -11426 -11832 -6285 -4303 -5322
4836 -5322 -2595 -43 -706 -1036 -407 2688 2460 -678 -1254 -1100 -1237 -4141 -7333 -7678 -7673 -5468 -2503 -3111
4818 -3111 -429 -467 -1476 -2819 267 713 -1962 -4500 -778 -219 -865 1135 833 3082 1406 362
4802 362 966 1128 1191 3288 3872 3432 2583 2573 1841 2341 469 4387 4216 3402 366 -2511 -3525 -4302 -821
$$ packed form
4916a319j21q89J144L60k698n072j767J608L067k001j720J293J254j978K694P723
4900A578j537p552N0K987K980K441K721j486k733l46N81j44O84K129l870l216
4884d733r55m14k851l199M179L676J780j384l476n066M051J420n80K903R96j203
4868d856j218l372L392L794l16j312K086L132k824j437q16j870k688J88K418P580
4852A881n83j793Q97J862n804k594r37k097K186l95l44l705m06N547J982j019
4836e322K727K552o63l30O29L095k28l138n76J54j37k904l192l45NK205K965o08
4818c111K682l8j009j343L086M46k675k538L722N59o46K000l02K249j676j044
4802C62O04J62O3K097N84m40q49j0p32N00j872L918j71q14l036k877j014p77L481
$$ plain form
4783 -821 794 2216 2829 1813 -1452 -876 -937 -2144 2896 5398 508 -3570 -4670 -2515 -493 -4114
4767 -4114 -4404 967 2447 2858 2479 -453 -4041 -4656 -1073 -1887 -3600 -2006 597 481 -2396 346
4751 346 1745 1190 5032 7025 6943 4729 4859 5089 -108 1511 2421 -1423 -3180 -1439 -1464 -4 -128
4734 -128 -3089 -2484 -2992 -2606 -1988 -2750 -1273 -2898 -1953 -2594 -2301 -872 -787 -307 -4098 -6204 -3829 -3749
4716 -3749 -6226 -8042 -8379 -3937 -2118 -5458 -6491 -5689 -1077 -1303 -5577 -7778 -6235 -4419 -6188 -4702
4700 -4702 -3173 -2101 3127 2839 -1213 -3834 -642 -864 -3932 -6940 -6943 -8835 -9358 -9378 -9608 -5705 -5411
4683 -5411 -2133 -4819 -5081 -1221 2252 3163 818 -1767 -3585 -1310 924 328 -2651 -4229 -3340 -6080
4667 -6080 -8192 -4488 769 2277 -1400 -2500 -5598 -6114 -5374 -5686 -3923 1826 7890 9346 8459 5172
$$ packed form
4783h21J615J422O13j016l265N76o1j207N040K502m890m078j100K155K022l621
4767d114k90N371J480M11l79k932l588o15L583q14j713J594K603j16k877K742
4751C46J399n55L842J993q2k214J30K30n197J619R10l844j757J741k5J460j24
4734a28k961O05n08L86O18p62J477j625R45o41K93J429Q5M80l791k106K375Q0
4716c749k477j816l37M442J819l340j033Q02M612k26m274k201J543J816j769J486
4700d702J529J072N228k88m052k621L192k22l068l008lj892n23k0k30L903K94
4683e411L278k686k62L860L473R11k345k585j818K275K234n96k979j578Q89k740
4667f080k112L704N257J508l677j100l098n16P40l12J763N749O064J456q87l287
$$ plain form
4651 5172 1666 -2021 -1378 925 246 3825 7046 6955 5853 5638 6930 6754 8269 5156 3171 3274 696
4634 696 2050 4718 1930 -3971 -2785 -2489 -1931 845 2009 3702 8513 11840 11162 9579 8031 4403
4618 4403 -1815 2112 2883 -1253 -2451 -4603 -8118 -6625 -4563 -3900 -1278 -1100 -5657 -5856 -4124 -2201
4602 -2201 -2155 -5689 -6051 -4162 4000 3138 4042 4997 6072 3362 -110 -1022 -2610 -2280 396 2228 2223 -4603
4584 -4603 -5428 -2282 2622 3877 -1623 -4292 -5585 -772 -877 2919 5911 5539 3269 -1837 -2356 3364
4568 3364 5849 7686 5741 6122 6195 368 848 -1883 -3329 -1503 419 5044 5492 492 -1871 -1439
4552 -1439 -1592 1711 3536 4853 8355 9680 3928 1215 234 -2477 -4296 -1876 -2566 -3408 -7243 -5994
4536 -5994 -7353 -6353 -2085 398 1329 807 -1075 -2001 -1102 -207 -4848 -6866 -3102 -2094 -5291 -7762
$$ packed form
4651E172l506l687O43K303o79L579L221r1j102k15J292j76J515l113j985J03k578
4634F96J354K668k788n901J186K96N58K776J164J693M811L327o78j583j548l628
4618D403o218L927P71m136j198k152l515J493K062O63K622J78m557j99J732J923
4602b201M6l534l62J889Q162q62R04R55J075k710l472r12j588L30K676J832no826
4584d603q25L146M904J255n500k669j293M813j05L796K992l72k270n106n19N720
4568C364K485J837j945L81P3n827M80k731j446J826J922M625M48n000k363M32
4552a439j53L303J825J317L502J325n752k713r81k711j819K420o90q42l835J249
4536e994j359J000M268K483R31n22j882r26Q99Q95m641k018L764J008l197k471
$$ plain form
4520 -7762 -6113 -6078 -5878 -8314 -6416 -5056 -3438 -4279 -3679 -3194 -2518 -1561 -1509 534 -2199 -7619 -6751 -683
4502 -683 7204 7249 2957 2095 624 -1532 2970 987 -1870 -2564 -1965 112 -2997 -1624 -694 -1953 -3682
4485 -3682 -5458 -6786 -5286 -641 -1729 -4341 -3844 -4839 -4457 -3443 -3717 -1131 1716 5059 6224 4661
4469 4661 2427 4831 5562 5040 4258 5041 1486 1211 4854 4648 4081 109 -8172 -7773 -3639 -160 3040
4452 3040 5000 4548 2062 -568 -3285 -4836 -565 -3006 -3433 -2310 -2235 -2149 -3830 -3653 -2640 57 576
4435 576 683 -1877 164 8212 8772 1811 -3678 -7552 -5350 -4145 -4807 -4641 -1711 1166 -334 -973
4419 -973 -4028 -2236 -2819 -4412 -3561 -1117 -335 361 -685 -1046 -641 615 -443 2909 635 1720 2059
4402 2059 -353 -4329 -3984 -5002 -2801 93 3225 1728 163 1097 4919 1447 -4231 -3577 -2917 -2133
$$ packed form
4520g762J649L5K00k436J898J360J618q41O00M85O76R57N2K043k733n420Q68O068
4502f83P887M5m292q62j471k156M502j983k857o94N99K077l109J373R30j259j729
4485c682j776j328J500M645j088k612M97r95L82J014k74K586K847L343J165j563
4469D661k234K404P31n22p82P83l555k75L643k06n67l972q281L99M134L479L200
4452C040J960m52k486k630k717j551M271k441m27J123P5Q6j681J77J013K697N19
4435E76J07k560K041Q048N60o961n489l874K202J205o62J66K930K877j500o39
4419i73l055J792n83j593Q51K444P82O96j046l61M05J256j058L352k274J085L39
4402B059k412l976L45j018K201K894L132j497j565R34L822l472n678O54O60P84
$$ plain form
4386 -2133 -5484 -5125 -1968 637 3796 1701 -1965 -2416 -3566 -1076 1695 -286 -740 -188 -1306 770
4370 770 -901 -2391 -4950 -2861 -1559 -2059 -1889 -2983 -3174 -2150 561 1383 -1926 -1931 383 318 610 -2260
4352 -2260 -4711 -4379 -6342 -7591 -7949 -6152 -3024 -3352 -6944 -5192 -520 1068 -1884 -1381 1935 2830
4336 2830 1733 478 353 492 -87 981 4107 1437 -404 774 2018 1976 2474 -1397 -1506 1657 3617
4319 3617 6727 4228 1201 3777 3685 4841 3680 1085 2846 3614 2561 4772 4215 3863 3307 3626 2088
4302 2088 -2699 -1937 -4945 -7620 -6853 -2043 269 -2103 -1361 -4485 -5944 -4344 -2781 190 1074 -5421
4286 -5421 -7850 -1935 -2485 -3808 -1692 -3758 -3971 -801 -240 -2222 -3320 -7398 -7154 -5321 -2231 1085
4270 1085 2394 -2000 -1832 88 1566 179 -2062 310 1407 -215 867 -2652 -6286 -4120 1256
$$ packed form
4386b133l351L59L157K605L159k095l666m51j150K490K771j981m54N52j118K076
4370G70j671j490k559K089J302n00J70j094j91J024K711Q22l309nK314o5K92k870
4352b260k451L32j963j249l58J797L128l28l592J752M672J588k952N03L316Q95
4336B830j097j255j25J39n79J068L126k670j841J178J244m2M98l871j09L163J960
4319C617L110k499l027K576r2J156j161k595J761P68j053K211n57l52n56L19j538
4302B088m787P62l008k675P67M810K312k372P42l124j459J600J563K971Q84o495
4286e421k429N915n50j323K116k066k13L170N61j982j098m078K44J833L090L316
4270A085J309m394J68J920J478j387k241K372J097j622J082l519l634K166N376
$$ plain form
4255 1256 1931 -1394 -2950 -1945 -2428 -2757 -1676 -3975 -7549 -6566 -7398 -7439 -5956 -8995 -8455 -5144 -801
4238 -801 3488 786 -2410 -4341 -4821 -5305 -6383 -5609 -5205 -5466 -9523 -12867 -7908 -3184 -2597 -2361 -4745
4221 -4745 -2676 -3570 -2688 -1433 3075 3747 1570 -451 -4707 -3057 -3009 -4633 -2874 -1596 -801 -585 -2601
4204 -2601 -3295 -2289 -3034 -3270 -251 -225 -3139 -3801 -808 1865 -586 2891 3774 -473 -3990 -4576 -4642
4187 -4642 -5415 -4492 -3245 -4777 -7629 -4592 -1526 459 -1702 -3575 -2960 -1471 1395 -134 -4161 -5570
4171 -5570 916 3036 1098 3501 4125 3682 5321 1873 -2609 -4659 -6361 -2510 59 -1158 -2391
4156 -2391 -2379 -4387 -6444 -5955 -6657 -5904 -3319 3325 5219 2927 2686 5455 4872 -1401 -875 925 -1648
4139 -1648 -1806 -1188 530 117 -2408 -1841 -1788 -2018 -1317 -1395 -2656 -1111 465 -1803 1381 2806 696
$$ packed form
4255A256O75l325j556J005m83l29J081k299l574R83q32m1J483l039N40L311M343
4238h01M289k702l196j931m80m84j078P74M04k61m057l344M959M724N87K36k384
4221d745K069q94Q82J255M508O72k177k021m256J650M8j624J759J278P95K16k016
4204b601o94J006p45k36L019K6k914o62K993K673k451L477Q83m247l517n86o6
4187d642p73R23J247j532k852L037L066J985k161j873O15J489K866j529m027j409
4171e570O486K120j938K403O24m43J639l448m482k050j702L851K569j217j233
4156b391J2k008k057M89p02P53K585O644J894k292k41K769n83o273N26J800k573
4139a648j58O18J718m13k525N67N3k30P01p8j261J545J576k268L184J425k110
$$ plain form
4122 696 -1220 -368 -359 -1436 -1933 -3064 -2442 -419 -1089 -1913 -2045 -346 -611 -4587 -4113 -2993 -6223 -3846
4104 -3846 2561 2427 -115 2098 5210 3622 1412 -1077 -4530 -4867 -3969 -1738 -877 -2216 -2598 -5117
4088 -5117 -4078 -5452 -4073 -6712 -3792 -357 534 -296 -979 2355 2461 -2770 -6387 -5641 -2418 1139
4072 1139 1603 202 583 2309 -45 -6196 -4918 -1206 -2620 -1220 -1585 -2464 -1462 -4396 -4806 -1119
4056 -1119 -2343 -5216 -4957 -7038 -6303 -5463 -2008 -2861 -3658 -1048 -1050 -3207 -3074 -1393 -4274 -4111 -4079 -5941
4038 -5941 -3462 -3852 -9354 -10820 -9078 -3419 -232 280 -756 -5994 -8019 -6054 -3185 4246 5697
4023 5697 3256 4503 4628 4034 3749 297 -4854 -450 3305 4153 2207 1595 2949 2459 451 -1214
4007 -1214 -3629 -4689 -7459 -8522 -6627 -3783 -3898 -589 -112 317 4911 4388 4487 3962 1867 2030 1281
$$ packed form
4122F96j916Q52Rj077m97j131O22K023o70q24j32J699k65l976M74J120l230K377
4104c846O407j34k542K213L112j588k210k489l453l37Q98K231Q61j339l82k519
4088e117J039j374J379k639K920L435Q91q30o83L334J06n231l617P46L223L557
4072A139M64j401L81J726k354o151J278L712j414J400l65q79J002k934m10L687
4056a119j224k873K59k081P35Q40L455q53p97K610kk157J33J681k881J63L2j862
4038e941K479l90n502j466J742N659L187N12j036n238k025J965K869P431J451
4023E697k441J247J25n94k85l452n151M404L755Q48j946o12J354m90k008j665
4007a214k415j060k770j063J895K844j15L309M77M29M594n23R9n25k095J63p49
$$ plain form
3990 1281 570 893 -2175 -4314 -8549 -8194 -6803 -3481 1245 -3852 -10631 -15141 -11736 -10931 -9489 -4249
3974 -4249 -639 657 -1704 -1643 -4511 -6080 -6747 -8699 -5799 -1214 -1451 -3647 -384 4250 2401 173
3958 173 -627 -4866 -3965 -5857 -5074 -2564 -4231 -1653 -1140 1278 139 -1363 -2621 -5124 -4288 -2846
3942 -2846 -909 5220 6113 3024 -894 -2084 -2331 -471 67 -1001 -1495 -1963 -895 464 1504 4788
3926 4788 6886 4376 635 342 -1756 -5644 -5858 -4413 -4272 -4661 -3246 -1773 -3059 -2592 -565 -259
3910 -259 2792 4549 5872 5796 3384 3396 3254 3252 2850 -217 -1602 -2256 -50 -3342 -2389 1363 3901 5395
3892 5395 1458 -2891 -3542 -2203 -4207 -910 -6 1523 -1504 -6262 -6348 -4958 -984 13 99 -885 -725
3875 -725 -3091 -2948 -1159 -2244 -795 5865 9447 7860 5276 3141 4150 5277 2921 2746 -3024 -3666
$$ packed form
3990A281p11L23l068k139m235L55J391L322M726n097o779m510L405Q05J442N240
3974d249L610J296k361O1k868j569o67j952K900M585k37k196L263M634j849k228
3958A73q00m239R01j892P83K510j667K578N13K418j139j502j258k503Q36J442
3942b846J937O129Q93l089l918j190k47J860N38j068m94m68J068J359J040L284
3926D788K098k510l741k93k098l888k14J445J41l89J415J473j286M67K027L06
3910b59L051J757J323p6k412J2j42km02l067j385o54K206l292R53L752K538J494
3892E395l937m349o51J339k004L297R04J529l027m758q6J390L974R97Q6r84J60
3875g25k366J43J789j085J449O660L582j587k584k135J009J127k356j75n770o42
$$ plain form
3859 -3666 869 2667 4104 2421 3246 6989 2727 358 -1105 733 3294 1922 -593 -4934 -3509
3844 -3509 -602 2312 3032 2831 6480 3869 -2411 -7742 -7396 -3214 1476 5428 3604 728 3361 3563
3828 3563 1984 774 1139 393 -65 3560 4191 1749 3838 5185 4027 3228 2664 5403 2857 3818 4211
3811 4211 -508 -4960 -7999 -7692 -5030 -319 -1493 -4223 -4993 -5983 -7605 -5161 -1537 -3946 -3717 -2560
3795 -2560 -303 -467 -1701 -406 2457 1067 4502 8038 3485 584 3415 2026 5852 5500 2643
3780 2643 5131 5840 2820 3416 5345 1636 -2850 -3422 -5817 -8212 -4247 -482 223 160 -5747 -4905 -6122
3763 -6122 -6090 -6807 -5674 -7063 -8407 -7862 -3769 -1413 -3318 -3341 -2422 -999 -2757 -6599 -6426 -1112 -505
3746 -505 -3588 -4142 -5863 -7529 -8261 -7957 -3528 -2153 -3565 -6110 -11434 -14709 -10274 -7956 -5479 -4573
$$ packed form
3859c666M535J798J437j683Q25L743m262k369j463J838K561j372k515m341J425
3844c509K907K914P20k01L649k611o280n331L46M182M690L952j824k876K633K02
3828C563j579j210L65p46m58L625O31k442K089J347j158p99n64K739k546R61L93
3811D211m719m452l039L07K662M711j174k730p70r90j622K444L624k409K29J157
3795b560K257j64j234J295K863j390L435L536m553k901K831j389L826l52k857
3780B643K488P09l020N96J929l709m486n72k395k395L965L765P05o3n907Q42j217
3763f122L2p17J133j389j344N45M093K356j905k3R19J423j758l842J73N314O07
3746e05l083n54j721j666p32L04M429J375j412k545n324l275M435K318K477R06
$$ plain form
3730 -4573 -3306 -2462 -4085 -5796 -5984 -5550 -6129 -5121 -2600 -433 -2537 -1625 -1649 -3342 -1841 1149 5398
3713 5398 6999 4110 4863 3892 5311 3366 -1029 -3612 -2633 -261 312 2086 2042 -1685 -1063 -1807 -3089
3696 -3089 -2995 -1475 361 -1199 -1064 1378 2435 -2191 221 -24 -113 -460 -3133 -6603 -7303 -7254 -6118
3679 -6118 -6516 -5627 -1720 -1711 -1327 -1919 1467 5657 785 -4055 -4601 -3764 -2303 -497 324 1382 3554
3662 3554 5992 5131 -722 -625 1994 -2307 -4103 -1768 -3060 -2387 -3403 -3066 2145 2179 1973 524 1216
3645 1216 1702 3422 2798 2792 10 2388 3167 -1924 -1190 -2729 -6365 -8049 -3845 -203 -2062 -5280 -8937
3628 -8937 -9123 -5471 -2570 -1558 110 117 1191 3431 2721 3081 3210 -753 -3986 -6380 -4853 -2516 -3106
3611 -3106 -4262 -3692 -3042 -3961 -2311 713 -2609 -2520 -1418 497 -2197 -3464 -2651 -1533 1117 1083 1573
$$ packed form
3730d573J267Q44j623j711j88M34n79J008K521K167k104R12k4j693J501K990M249
3713E398J601k889P53r71J419j945m395k583R79K372N73J774m4l727O22p44j282
3696c089R4J520J836j560J35K442J057m626K412k45q9l47k673l470p00M9J136
3679f118l98Q89L907RL84n92L386M190m872m840n46Q37J461J806Q21J058K172
3662C554K438q61n853R7K619m301j796K335j292O73j016L37N211L4k06j449O92
3645A216M86J720o24ok782K378P79n091P34j539l636j684M204L642j859l218l657
3628h937j86L652K901J012J668PJ074K240p10L60J29l963l233k394J527K337n90
3611c106j156N70O50r19J650L024l322Q9J102J915k694j267Q13J118K650l4M90
$$ plain form
3594 1573 4460 1407 525 -1710 -656 457 -1235 -5195 -5119 -2575 -2247 2337 5615 3263 1031 -678
3578 -678 -476 -1405 -3066 -4464 -4847 -4398 -5672 -1754 1401 4458 2420 1449 1414 -1727 -2415 1358 1883
3561 1883 -1681 -1444 -1718 -898 118 -29 784 202 26 -3751 -2853 -44 4265 3780 6859 6857 2092 -2412
3543 -2412 -3664 -5804 -7268 -3366 1376 2068 -770 3024 3477 946 -13 -806 -750 -617 -613 -398 890 2827
3525 2827 1591 -874 -3824 -5142 -1231 2595 4732 6055 8078 6461 5617 6313 6213 5896 4401 2620
3509 2620 1544 1909 1605 3604 6077 5333 5044 -327 -4836 -4453 -1023 -2524 -7318 -2880 1248 4588
3493 4588 2026 -1908 -2982 -3814 -3664 -6048 -3261 1372 1248 1039 -1815 1767 6818 5545 2300 2247
3477 2247 337 -386 -122 1467 4480 7130 8282 6090 5922 3153 1269 315 -5062 -5815 -3431 -1812
$$ packed form
3594A573K887l053q82k235J054J113j692l960P6K544L28M584L278k352k232j709
3578f78K02r29j661j398l83M49j274L918L155L057k038r71l5l141o88L773N25
3561A883l564K37k74Q20J016j47Q13n82j76l777Q98K809M309m85L079km765m504
3543b412j252k140j464L902M742O92k838L794M53k531r59p93N6J33MK15J288J937
3525B827j236k465k950j318L911L826K137J323K023j617q44O96j00l17j495j781
3509B620j076L65l04J999K473p44k89n371m509L83L430j501m794M438M128L340
3493D588k562l934j074q32J50k384K787M633j24k09k854L582N051j273l245n3
3477B247j910p23K64J589L013K650J152k192j68k769j884r54n377p53K384J619
$$ plain form
3461 -1812 -317 1037 -1853 -4541 -3853 -1036 -501 981 2307 1759 -2320 -4186 -1970 -1099 -2671 -1195
3445 -1195 -4512 -3886 171 -4221 -8387 -3883 3066 4311 7084 2272 -4281 -7121 -8005 -7516 -7644 -8515
3429 -8515 -2856 -77 2060 1830 -2873 -2730 -1501 1200 5206 4938 2209 -1888 -4796 -3419 -2698 838
3413 838 3203 -297 3487 1641 -1528 -2410 -4774 -3552 1199 4134 4875 2193 212 252 2712 6406
3397 6406 8197 1077 -3084 1497 876 -3756 -6210 -3713 725 2413 212 -3428 -4316 -1426 -235
3382 -235 129 1043 2810 -2200 -5337 -2662 1298 3898 429 -3206 -2445 -1766 727 325 -4170 -670
3366 -670 3168 -2032 -7215 -9760 -8719 -10364 -6367 -2623 496 -525 384 1703 4537 5899 -28
3351 -28 -1043 -313 -4000 -1794 -982 1172 1679 -699 458 4673 2730 -1239 1440 -635 -2624 -4898
$$ packed form
3461a812J495J354k890k688O88K817N35J482J326n48m079j866K216Q71j572J476
3445a195l317O26M057m392m166M504O949J245K773m812o553k840q84M89j28q71
3429h515N659K779K137k30m703J43J229K701M006k68k729m097k908J377P21L536
3413H38K365l500L784j846l169q82k364J222M751K935P41k682j981M0K460L694
3397F406J791p120m161M581o21m632k454K497M438J688k201l640q88K890J191
3382b35L64R14J767n010l137K675L960K600l469l635P61O79K493m02m495L500
3366f70L838n200n183k545J041j645L997L744L119j021R09J319K834J362n927
3351b8j015P30l687K206Q12K154N07k378J157M215j943l969K679k075j989k274
$$ plain form
3335 -4898 -5850 -8581 -9405 -6029 -1492 -1308 -4571 -7973 -5050 -2279 -207 -303 -483 -2458 -5515 -4902 -5112
3318 -5112 -5359 -4381 -5889 -5892 -7204 -5999 -4713 -2907 -4487 -3327 -2844 -4129 -759 -3065 -2619 195 -1956
3301 -1956 190 1182 53 903 1327 -268 811 4708 5892 4682 2239 684 1155 3739 4731 4266
3285 4266 1837 -202 -3422 -2507 3288 5133 6823 8709 9061 4725 -45 2473 3289 1805 2354 1220
3269 1220 -2305 -5872 -8313 -3805 -3382 -6941 -4824 -2698 -1100 2511 6143 5327 3439 6852 8378
3254 8378 6435 1423 -1626 4173 5449 6858 6974 3642 2485 2120 1954 1252 2820 3476 -545 1954
3238 1954 414 717 170 2370 827 -1986 -18 55 1525 5649 8801 7118 4328 1467 -3028 -2877
3222 -2877 1472 1257 1715 4094 -2373 -3085 -3019 -2438 -1982 -3187 -514 3442 3032 -191 -1154 1760 3835
$$ packed form
3335d898r52k731q24L376M537J84l263l402K923K771K072r6j80j975l057O13k10
3318e112k47R78j508lj312J205J286J806j580J160M83j285L370k306M46K814k151
3301a956K146R92j129Q50M24j595J079L897J184j210k443j555M71K584R92m65
3285D266k429k039l220R15N795J845J690J886L52m336m770K518Q16j484N49j134
3269A220l525l567k441M508M23l559K117K126J598L611L632q16j888L413J526
3254H378j943n012l049N799J276J409J16l332j157l65j66p02J568O56m021K499
3238A954j540L03n47K200j543k813J968P3J470M124L152j683k790k861m495J51
3222b877M349k15M58K379o467p12O6N81M56j205K673L956m10l223r63K914K075
$$ plain form
3205 3835 4444 33 226 1684 603 -3107 -4108 -3776 -2938 -2889 1038 4635 7366 9680 7376 6456 6298
3188 6298 5284 3518 1297 -3093 -3512 -477 1738 6293 6871 8169 10805 11918 9423 4972 2896
3173 2896 4026 3563 1830 1981 6542 7022 4597 1313 1806 2509 2215 2318 2576 5797 6485 5965 2526
3156 2526 -3907 -9291 -5921 -2304 1360 4573 1022 -5217 -5095 -4080 -125 -147 -35 -371 1474 1868
3140 1868 47 -3105 -3354 -2204 229 -474 834 -4659 -5932 -5492 -2276 -1717 -2394 -677 323 1064
$$ packed form
3205C835O09m411J93J458j081l710j001L32Q38M9L927L597K731K314k304r20j58
3188F298j014j766k221m390m19L035K215M555N78J298K636J113k495m451k076
3173B896J130m63j733J51M561M80k425l284M93P03k94J03K58L221O88n20l439
3156B526o433n384L370L617L664L213l551o239J22J015L955k2J12l36J845L94
3140A868j821l152k49J150K433p03J308n493j273M40L216N59o77J717J000P41
$$ [...]
##END NTUPLES=NMR SPECTRUM
##END=
