##TITLE=Analysis number 328009
Compound Code tl 00139
Project Code adrs
Chemist Name fudan
##JCAMPDX= 6.0         $$ Bruker NMR JCAMP-DX V2.0
##DATA TYPE= NMR SPECTRUM
##DATA CLASS= NTUPLES
##ORIGIN= Bruker BioSpin GmbH
##OWNER= nmr
$$ XWIN-NMR		Version 3.5
$$ Wed Apr 25 10:18:29 2007 GMT Daylight Time (UT+1h)  MAYBRIDGE\nmr@NMR_250MHZ
##.OBSERVE FREQUENCY= 250.131544655141
##.OBSERVE NUCLEUS= ^1H
##.ACQUISITION MODE= SIMULTANEOUS (DQD)
##.ACQUISITION SCHEME= undefined
##.AVERAGES= 16
##.DIGITISER RES= 18
##SPECTROMETER/DATA SYSTEM= dpx250
##.PULSE SEQUENCE= zg30
##.SOLVENT NAME= CDCl3
##.SHIFT REFERENCE= (INTERNAL, CDCl3, 0, 16.522)
##AUDIT TRAIL= $$ (NUMBER, WHEN, WHO, WHERE, WHAT)
$$ ##TITLE= Audit trail, XWIN-NMR		Version 3.5
$$ ##JCAMPDX= 5.01
$$ ##ORIGIN= Bruker BioSpin GmbH
$$ ##OWNER= nmr
$$ C:\u/data/dgb/nmr/ADRS/3050/pdata/1/auditp.txt
$$ ##AUDIT TRAIL=  $$ (NUMBER, WHEN, WHO, WHERE, WHAT)
(   1,<2007-04-25 10:18:08.81 +100>,<MAYBRIDGE\nmr>,<NMR_250MHZ>,
      <created by zg, POWCHK disabled, PULCHK disabled
       configuration hash MD5:
       76 6E 9A 78 1E 09 19 81 EC 84 63 8F B0 6A 59 2D
       data hash MD5: 64K
       71 FD 39 9F CC 88 20 0C 22 92 22 BB 10 E9 FA A3>)
(   2,<2007-04-25 10:18:19.92 +100>,<MAYBRIDGE\nmr>,<NMR_250MHZ>,
      <Start of raw data processing
       ef LB = 0.3 FT_mod = 6 PKNL = 1 SI = 32K 
       data hash MD5: 32K
       33 F0 0F 56 CD 38 01 60 7A 62 EF 51 5A 09 A5 16>)
(   3,<2007-04-25 10:18:21.48 +100>,<MAYBRIDGE\nmr>,<NMR_250MHZ>,
      <apk 
       data hash MD5: 32K
       D4 9B 8A 86 62 0B 66 43 59 39 F8 BB CC 14 67 8C>)
(   4,<2007-04-25 10:18:22.18 +100>,<MAYBRIDGE\nmr>,<NMR_250MHZ>,
      <abs ABSG = 5 
       data hash MD5: 32K
       AA 2F 1C 56 FB 2B 39 10 4F 0F FE 46 4A 32 8E E2>)
$$ ##END=
$$ 
$$ hash MD5
$$ AB AC EE C9 DB 92 1D 92 71 08 CC 23 B8 F3 5B 06
##$RELAX= 
##$RELAX= 
##$RELAX= 
##$RELAX= 
##$RELAX= 
##$RELAX= 
##$RELAX= 
$$ Bruker specific parameters
$$ --------------------------
##$DU= <C:\u>
##$EXPNO= 3050
##$NAME= <ADRS>
##$PROCNO= 1
##$TYPE= <nmr>
##$USER= <dgb>
##$AMP= (0..31)
100 100 100 100 100 100 100 100 100 100 100 100 100 100 100 100 100 100 
100 100 100 100 100 100 100 100 100 100 100 100 100 100 
##$AQSEQ= 0
##$AQ_mod= 3
##$AUNM= <au_zg>
##$AUTOPOS= <6 >
##$BF1= 250.13
##$BF2= 250.13
##$BF3= 250.13
##$BF4= 250.13
##$BF5= 500.13
##$BF6= 500.13
##$BF7= 500.13
##$BF8= 500.13
##$BYTORDA= 1
##$CFDGTYP= 0
##$CFRGTYP= 5
##$CHEMSTR= <none>
##$CNST= (0..31)
1 1 145 1 1 1 1 1 1 1 1 1 1 1 1 1 1 1 1 1 1 1 1 1 1 1 1 1 1 1 1 1 
##$CPDPRG= <>
##$CPDPRG1= <>
##$CPDPRG2= <>
##$CPDPRG3= <>
##$CPDPRG4= <mlev>
##$CPDPRG5= <mlev>
##$CPDPRG6= <mlev>
##$CPDPRG7= <mlev>
##$CPDPRG8= <mlev>
##$CPDPRGB= <>
##$CPDPRGT= <>
##$D= (0..31)
0 1 0 0 0 0 0 0 0 0.06 0 0 0 0 0 0 0.0002 0 0 0 0 0 0 0 0 0 0 0 0 0 0 
0 
##$DATE= 1177492687
##$DBL= (0..7)
120 120 120 120 120 120 120 120 
##$DBP= (0..7)
150 150 150 150 150 150 150 150 
##$DBP07= 0
##$DBPNAM0= <>
##$DBPNAM1= <>
##$DBPNAM2= <>
##$DBPNAM3= <>
$$ [...]
##$SUBNAM7= <"">
##$SUBNAM8= <"">
##$SUBNAM9= <"">
##$SW= 20.6930455092707
##$SWIBOX= (0..15)
0 0 3 0 0 0 0 0 0 0 0 0 0 0 0 0 
##$SW_h= 5175.983436853
##$TD= 65536
##$TD0= 1
##$TE= 683.16
##$TE2= 300
##$TE3= 300
##$TEG= 300
##$TL= (0..7)
0 120 120 120 120 120 120 120 
##$TP= (0..7)
150 150 150 150 150 150 150 150 
##$TP07= 0
##$TPNAME0= <>
##$TPNAME1= <>
##$TPNAME2= <>
##$TPNAME3= <>
##$TPNAME4= <>
##$TPNAME5= <>
##$TPNAME6= <>
##$TPNAME7= <>
##$TPOAL= (0..7)
0.5 0.5 0.5 0.5 0.5 0.5 0.5 0.5 
##$TPOFFS= (0..7)
0 0 0 0 0 0 0 0 
##$TUNHIN= 0
##$TUNHOUT= 0
##$TUNXOUT= 0
##$USERA1= <user>
##$USERA2= <user>
##$USERA3= <user>
##$USERA4= <user>
##$USERA5= <user>
##$V9= 5
##$VALIST= <valist>
##$VCLIST= <CCCCCCCCCCCCCCC>
##$VD= 0
##$VDLIST= <DDDDDDDDDDDDDDD>
##$VPLIST= <PPPPPPPPPPPPPPP>
##$VTLIST= <TTTTTTTTTTTTTTT>
##$WBST= 1024
##$WBSW= 4
##$XGAIN= (0..3)
0 0 0 0 
##$XL= 0
##$YL= 0
##$YMAX_a= 419280
##$YMIN_a= -354394
##$ZGOPTNS= <>
##$ZL1= 120
##$ZL2= 120
##$ZL3= 120
##$ZL4= 120
##$ABSF1= 16.522
##$ABSF2= -4.171173
##$ABSG= 5
##$ABSL= 3
##$ALPHA= 0
##$AQORDER= 0
##$ASSFAC= 0
##$ASSFACI= 0
##$ASSFACX= 0
##$ASSWID= 0
##$AUNMP= <proc_1d>
##$AZFE= 0.1
##$AZFW= 0.1
##$BCFW= 0
##$BC_mod= 0
##$BYTORDP= 0
##$COROFFS= 0
##$CY= 12.5
##$DATMOD= 1
##$DC= 0
##$DFILT= <>
##$DTYPP= 0
##$F1P= 14.0000005364418
##$F2P= -0.99999901652339
##$FCOR= 0.5
##$FTSIZE= 32768
##$FT_mod= 6
##$GAMMA= 0
##$GB= 0
##$INTBC= 1
##$INTSCL= 1
##$ISEN= 128
##$LB= 0.3
##$LEV0= 0
##$LPBIN= 0
##$MAXI= 10000
##$MC2= 0
##$MEAN= 0
##$ME_mod= 0
##$MI= 0
##$NCOEF= 0
##$NC_proc= -4
##$NLEV= 6
##$NOISF1= 0
##$NOISF2= 0
##$NSP= 0
##$NTH_PI= 0
##$NZP= 0
##$OFFSET= 16.522
##$PC= 1
##$PHC0= -52.4075
##$PHC1= 7.383844
##$PH_mod= 1
##$PKNL= yes
##$PPARMOD= 0
##$PSCAL= 4
##$PSIGN= 0
##$REVERSE= no
##$SF= 250.13
##$SI= 32768
##$SIGF1= 0
##$SIGF2= 0
##$SINO= 400
##$SIOLD= 32768
##$SREGLST= <1H.CDCl3>
##$SSB= 0
##$STSI= 32768
##$STSR= 0
##$SW_p= 5175.98343685301
##$SYMM= 0
##$S_DEV= 0
##$TDeff= 65536
##$TDoff= 0
##$TI= <Analysis number 999999
Compound Code 99
Book Reference 9
Project Code 9>
##$TILT= no
##$TM1= 0
##$TM2= 0
##$TOPLEV= 0
##$USERP1= <user>
##$USERP2= <user>
##$USERP3= <user>
##$USERP4= <user>
##$USERP5= <user>
##$WDW= 1
##$XDIM= 32768
##$YMAX_p= 308623354
##$YMIN_p= -174557
$$ End of Bruker specific parameters
$$ ---------------------------------
##NTUPLES= NMR SPECTRUM
##VAR_NAME=  FREQUENCY,     SPECTRUM/REAL,   SPECTRUM/IMAG
##SYMBOL=    X,             R,               I
##VAR_TYPE=  INDEPENDENT,   DEPENDENT,       DEPENDENT
##VAR_FORM=  AFFN,          ASDF,            ASDF
##VAR_DIM=   32768,         32768,           32768
##UNITS=     HZ,            ARBITRARY UNITS, ARBITRARY UNITS
##FACTOR=    0.157963299565203, 1,           1
##FIRST=     4132.6476996994, 0,             0
##LAST=      -1043.33573715361, 0,           0
##MIN=       -1043.33573715361, -174557,     0
##MAX=       4132.6476996994, 308623354,     0
$$ Real data points
##PAGE= N=1
##DATA TABLE= (X++(R..R)), XYDATA
$$ [...]
16948a29498N0524P2470K822k7122O19q104L3793L114k7166l539J3671k4687L3595
$$ -129498 -78974 -6504 -3682 -30804 -30185 -38289 -4496 -1382 -28548 -32087 -18416 -43103 -9508
16935i508M0833j0715L9732N888k2629k9141j0886k3489l2712j7209J1482L8222
$$ -9508 31325 20610 60342 66230 43601 14460 3574 -19915 -52627 -69836 -58354 -20132
16923b0132j2797J8924K6870m1768l9130R717k0236N4277L2820j0255J6780J1731
$$ -20132 -32929 -14005 12865 -28903 -68033 -58316 -78552 -24275 8545 -1710 15070 26801
16911B6801p171n6680l6930J5317J0833P644p196k5091m978L8370Q604L430r562
$$ 26801 19630 -37050 -73980 -58663 -47830 -40186 -47382 -72473 -77451 -39081 -30477 -27047 -36609
16898c6609M073J9084M251k9274l0277k6898J0659K2628J0357j8645O0397J7763
$$ -36609 -32536 -13452 -9201 -38475 -68752 -95650 -84991 -62363 -52006 -70651 -10254 7509
16886G509k0829k6677J4749j638L6588J5199m021o5231J3656M9477p28K5041j1385
$$ 7509 -13320 -39997 -25248 -26886 9702 24901 20880 -44351 -30695 18782 18054 43095 31710
16873C1710n9915l2140N4253L0337M2322P413j7936l5338n3999J183L4311K4571
$$ 31710 -28205 -60345 -6092 24245 66567 73980 56044 20706 -33293 -32110 2201 26772
16861B6772J1739O401k3290n2653J197M3393L0720o754J6835j0325n9035k7948
$$ 26772 38511 44912 21622 -31031 -29834 13559 44279 37525 54360 44035 -15000 -42948
16849d2948n615L797J7380K108k6948q889M6094r138j2398k0311J255O6802J4088
$$ -42948 -48563 -44766 -27386 -25278 -52226 -61115 -15021 -24159 -36557 -56868 -55613 11189 25277
16836B5277q048L159m0357m4398j300J9897L2538L7150K2981j8453L0921o124
$$ 25277 17229 20388 -19969 -64367 -65667 -45770 -13232 23918 46899 28446 59367 53243
16824E3243l9781l88K3789N648P207m4893o4725l5102j1155J9916M312L2439K9670
$$ 53243 13462 13074 36863 42511 49718 4825 -59900 -95002 -106157 -86241 -81929 -49490 -19820
16811a9820l1904J7659L4157N5299o297n4137K734K0705m91k5174R886L0328n1452
$$ -19820 -51724 -34065 92 55391 49094 -5043 -2309 18396 17905 -7269 2617 32945 -18507
16798a8507m1611l328P398L8452k129n1629k8152o925L0726M6173O966J4846L3946
$$ -18507 -60118 -63446 -56048 -17596 -19725 -71354 -99506 -106431 -75705 -29532 -22566 -7720 26226
16785B6226k3881m8587l5268K1222L1388j7990j9097O036N4320K2365L6665M342
$$ 26226 2345 -46242 -81510 -60288 -28900 -46890 -65987 -59951 -5631 16734 53399 57741
16773E7741r608r945j5171l0309N5397Q167l8011m859O786J0545k5905n9693L484
$$ 57741 48133 38188 23017 -7292 48105 56272 18261 13402 20188 30733 4828 -54865 -51381
16760e1381K8848K5291N8843j6924l4477Q297L6469j3488j2478M8639m312k3488
$$ -51381 -22533 2758 61601 44677 10200 18497 54966 41478 29000 77639 73327 49839
16748D9839n0743j8120M830O938J0983k6647L2673K6979j1888j8484K2311l816
$$ 49839 -904 -19024 -14194 -7256 3727 -22920 9753 36732 24844 6360 28671 24855
16736B4855l0384K9601J3665j4018l3920l7015R834L9075J3706m1521K1437j5679
$$ 24855 -5529 24072 37737 23719 -10201 -47216 -37382 1693 15399 -26122 -4685 -20364
16724b0364l013M2585M3808p650m5726k057Q523J3701k8973J019q263J3869l62
$$ -20364 -23377 19208 63016 55366 9640 7583 16106 29807 834 1853 -6410 7459 7097
16711G097l0106K964K0576J2137M027j6700K4854J3015o6377k3842K355j1829
$$ 7097 -23009 -20045 531 12668 16695 -5 24849 37864 -28513 -52355 -50000 -61829
16699f1829K8905P4073M4993j1187k1929j8148P27J9867K5944J538n9043q0956
$$ -61829 -32924 41149 86142 74955 53026 34878 35605 55472 81416 82954 23911 -57045
16687e7045K8674K6108q990J1767L5194K737K430n144L3055J2667J8585j5165
$$ -57045 -28371 -2263 -11253 514 35708 38445 40875 35731 68786 81453 100038 84873
16675H4873n1003n1584J8128O7850j8904o725N873j6165L5248M254K9747J1496
$$ 84873 33870 -17714 414 68264 49360 42635 48508 32343 67591 71845 101592 113088
16663A13088p8933p9686K9627J6024M2920L9591R347l8258k0407O367l0473m5707
$$ 113088 34155 -45531 -15904 120 43040 82631 91978 53720 33313 39680 9207 -36500
16651c6500k3245q543L0992K4115p504j2100q992p924r81M4491K457o3796l5386
$$ -36500 -59745 -68288 -37296 -13181 -20685 -32785 -41777 -49701 -50682 -6191 -3734 -67530 -102916
16638a02916L1592N2454J5770R706l377J3288j7182Q838j6093k7062L4399k1679
$$ -102916 -71324 -18870 -3100 6606 3229 16517 -665 8173 -7920 -34982 -583 -22262
16626b2262k8451k2127l43J4428q795L415j1354K1966M8428m3996J5443p949l024
$$ -22262 -50713 -72840 -73183 -58755 -67550 -64135 -75489 -53523 -5095 -49091 -33648 -41597 -44621
16613d4621j9894m0389L4584N7981L8691k3711j182q731R975j3674K2893j6292
$$ -44621 -64515 -104904 -70320 -12339 26352 2641 1459 -7272 2703 -10971 11922 -4370
16601d370k2956k5376J0712K7212L5610j9758n535j2689J175j9500k1619m069
$$ -4370 -27326 -52702 -41990 -14778 20832 1074 -4461 -17150 -15975 -35475 -57094 -61163
16589f1163l7598K6519M6455J6408k3333m165L2840O889P179L4821K594L250N976
$$ -61163 -98761 -72242 -25787 -9379 -32712 -36877 -4037 2852 10031 44852 47446 50696 56672
16576E6672J149R727k1872l6770j0369J0759K0446K694k1258k1198O780J3583
$$ 56672 57821 67548 45676 8906 -1463 9296 29742 32436 11178 -10020 -3240 10343
16564A0343J8066m36m5648j804p840O460J3438k1967j2753N4201O512m3344n5446
$$ 10343 28409 27973 -17675 -19479 -27319 -20859 -7421 -29388 -42141 12060 18572 -24772 -80218
16551h0218o9920N3010j1752J3890K5581L3690L4897J4196N6963o419l8749k0948
$$ -80218 -150138 -97128 -108880 -94990 -69409 -35719 -822 13374 70337 63918 25169 4221
16539D221j0794K1626P2896j7872k0404o5597J1462M5097J3740J0647l5978q373
$$ 4221 -6573 15053 87949 70077 49673 -15924 -4462 40635 54375 65022 29044 20671
16527B0671j1932n712J5030L2674n689J9068L4826O78o7059l4411J5669j2364
$$ 20671 8739 3027 18057 50731 45042 64110 98936 99614 32555 -1856 13813 1449
16515A449P070J4510l4768j8406K3663J9862k6114j6994J0179l390n431L6513
$$ 1449 8519 23029 -11739 -30145 -6482 13380 -12734 -29728 -19549 -22939 -28370 8143
16503H143K3881j7672m6342k370L9077j5153K3160R968p159K7133L8321k339k8273
$$ 8143 32024 14352 -31990 -34360 4717 -10436 12724 22692 15533 42666 80987 78648 50375
16490E0375k9664j2999J2042L8856k0547n4010k3253K2782n337J0200K7821K7454
$$ 50375 20711 7712 19754 58610 38063 -15947 -39200 -16418 -21755 -11555 16266 43720
16478D3720M1499j3115n353j7698l4652k400J5975L4773n4907m3649J6987K8696
$$ 43720 85219 72104 66751 49053 14401 12001 27976 62749 7842 -35807 -18820 9876
16466I876L2998l1735l2753j6298M8670q995k2787j5391L4834K5670J0879N15
$$ 9876 42874 11139 -21614 -37912 10758 1763 -21024 -36415 -1581 24089 34968 35483
16454C5483n870n8668l8808J6206K9256M3180J1622P659k4010o6507J3403N4817
$$ 35483 29613 -29055 -67863 -51657 -22401 20779 32401 40060 16050 -50457 -37054 17763
16442A7763M128l2038k0389J4605k0339r822L0525L2692l7223k9130K5539Q6836
$$ 17763 21891 -10147 -30536 -15931 -36270 -46092 -15567 17125 -20098 -49228 -23689 63147
16430F3147r311m4536l5219O678J846K4546j7976q4687j7637P432P156L2475K5415
$$ 63147 53836 9300 -25919 -19241 -17395 7151 -10825 -95512 -113149 -105717 -98561 -66086 -40671
16417d0671J2282L9664o281J7030j5275J9286K7715k8713R952J2495k1236k8621
$$ -40671 -28389 11275 4994 22024 6749 26035 53750 25037 34989 47484 26248 -2373
16405b373j4430k3559j4577K2012M8888k1629j7548O234j6537M3095J5535m7645
$$ -2373 -16803 -40362 -54939 -32927 15961 -5668 -23216 -16982 -33519 9576 25111 -22534
16393b2534k945k6874J3268k146j8125l5523n9075N9555L5676p674L134M5463
$$ -22534 -25479 -52353 -39085 -41231 -59356 -94879 -153954 -94399 -58723 -66397 -63263 -17800
16381a7800J3039k6108j4846j5967N1169K8068J6447m4972k9088R904M160O205
$$ -17800 -4761 -30869 -45715 -61682 -10513 17555 34002 -10970 -40058 -30154 -25994 -19789
16369a9789J8572m60O385j2985m059O707J4813j0232K1364J1116j5396j3517m9459
$$ -19789 -1217 -1677 4708 -8277 -12336 -5629 9184 -1048 20316 31432 16036 2519 -46940
16356d6940k7123J9874R107N6259K4206j2876M79r934Q571l5776q433q276N984
$$ -46940 -74063 -54189 -45082 11177 35383 22507 22986 13052 21623 -14153 -22586 -30862 -24878
16343b4878Q108j9639K6082N0432J4538j8107Q658j6273M908k4796k2298Q087
$$ -24878 -16770 -36409 -10327 40105 54643 36536 45194 28921 33829 9033 -13265 -5178
16331e178k2003J0516K7448J7214m480K0206Q741k995k1782O132r356k2142n5062
$$ -5178 -27181 -16665 10783 27997 23517 43723 52464 49469 27687 33819 24463 2321 -52741
16318e2741k090M5369J3720j240j8480j7970K1555J1161K2429j7682J6390K210
$$ -52741 -54831 -9462 4258 3018 -15462 -33432 -11877 -716 21713 4031 20421 22631
16306B2631J1123J6960J1847L2287m456l0488r029O708j7347k0688k3593m6362
$$ 22631 33754 50714 62561 94848 90392 59904 50875 57583 40236 19548 -4045 -50407
16294e0407J5709L4237k6440J3873R858j1922k5638m218n641k436N6612M0441
$$ -50407 -34698 -461 -26901 -13028 -3170 -15092 -40730 -44948 -50589 -53025 3587 44028
16282D4028k4433k5816m5920l7438L9898J2866J7295P0947K9041o9473m910L9532
$$ 44028 19595 -6221 -52141 -89579 -49681 -36815 -19520 51427 80468 10995 6085 45617
16270D5617j6147P134J1707j9343j0359K7699J4164j9157l2349k4630J5504L4379
$$ 45617 29470 36604 48311 28968 18609 46308 60472 41315 8966 -15664 -160 34219
16258C4219K8969L2932l8170k4118N7557j9116o2495j3574j2655J0762L1195J1697
$$ 34219 63188 96120 57950 33832 91389 72273 9778 -3796 -16451 -5689 25506 37203
16246C7203N518k5704k7591J5261J237m3363n7901M2886P5413j863k8880n356
$$ 37203 42721 17017 -10574 4687 5924 -37439 -95340 -52454 22959 21096 -7784 -13140
16234a3140K6440Q160k5117L3131J2754l8048j8028r159J1693L3385j2323J8071
$$ -13140 13300 21460 -3657 29474 42228 4180 -13848 -23007 -11314 22071 9748 27819
16222B7819j3594j3152j2973L475j4089k3284J748K9287j2850K2252j0902J6538
$$ 27819 14225 1073 -11900 -8425 -22514 -45798 -44050 -14763 -27613 -5361 -16263 275
16210B75o350j7116K1805O6395j0410k7317n0721K3593j1853j5763J2467K5271
$$ 275 -6075 -23191 -1386 65009 54599 27282 -23439 154 -11699 -27462 -14995 10276
16198A0276j9697j8604k589k2955J9585M8107q47M6231J2604r204K5529o8145
$$ 10276 -9421 -28025 -30614 -53569 -33984 14123 13276 59507 72111 62907 88436 20291
16186B0291m8314j2057Q927k912J3916K8961n2274m0993L2458N930k9924J315
$$ 20291 -28023 -40080 -31153 -34065 -20149 8812 -43462 -84455 -51997 -46067 -75991 -74676
16174g4676K9540M1861k9329m4465K8765L7716j5790k980j8153m1122k6770N2603
$$ -74676 -45136 -3275 -32604 -77069 -48304 -10588 -26378 -29358 -47511 -88633 -115403 -62800
16162f2800N3381l454Q736k0137M0733J5598l9348P536m872J7082O195K4063L1081
$$ -62800 -9419 -12873 -4137 -24274 16459 32057 -7291 245 -4627 12455 18650 42713 73794
16149G3794j7911l8001m6476K1157J1540j3727j2057K2407j494l1003j3029k9140
$$ 73794 55883 17882 -28594 -7437 4103 -9624 -21681 726 -768 -31771 -44800 -73940
16137g3940n604M7906r260k6315N4423K2969Q406Q757m983m6395l0165L7477K2946
$$ -73940 -79544 -31638 -40898 -67213 -12790 10179 18585 27342 22359 -24036 -54201 -16724 6222
16124F222k0017J3837P6753L2411J8748O147j06037k4955l0275j35J2552N6042
$$ 6222 -13795 42 76795 109206 127954 134101 28064 3109 -27166 -27301 -14749 41293
16112D1293p717M099j1519j3151k2365K6879K0008p312n169J8467k710j5076k0661
$$ 41293 33576 37675 26156 13005 -9360 17519 37527 30215 25046 43513 40803 25727 5066
16099E066n6764R812N2021K2748Q692k9036r492M8452j4261p7319l2012j1763
$$ 5066 -51698 -41886 10135 32883 41575 12539 3047 51499 37238 -40081 -72093 -83856
16087h3856k7423K9350K4691K627l8696l7325k6051K4033K1917K744J0778j331
$$ -83856 -111279 -81929 -57238 -54611 -93307 -130632 -156683 -132650 -110733 -107989 -97211 -98542
16075i8542K1621O781l400K2086Q5883M0365m6938p4812k8522J4458N755K0664
$$ -98542 -76921 -70140 -73540 -51454 34429 74794 27856 -46956 -75478 -61020 -55265 -34601
16063c4601M2238L0121J4265J0375q7963M905L7731j225k8837M264l8997J5408
$$ -34601 7637 37758 52023 62398 -25565 -20660 17071 15846 -12991 -8727 -47724 -32316
16051c2316M6358m6473K318L5363o493J5842J0994J0221N0537l9063o9192J7838
$$ -32316 14042 -32431 -30113 5250 -1243 14599 25593 35814 86351 47288 -21904 -4066
16039d066l606j7110j9473K1699p184k181N2298J2757k5226o565L1963m1261k4628
$$ -4066 -7672 -24782 -44255 -22556 -29740 -31921 20377 33134 7908 1343 33306 -7955 -32583
16026c2583J8564l3204P778M4294k2012j108K4678J2990l1244k65K618p896J3519
$$ -32583 -14019 -47223 -39445 4849 -17163 -18271 6407 19397 -11847 -12112 -9494 -17390 -3871
16013c871l9371K3720l2613J2849J7676k495K7474o891k1165j5437o2040L411
$$ -3871 -43242 -19522 -52135 -39286 -21610 -24105 3369 -3522 -24687 -40124 -102164 -98753
16001i8753L1383J9824l513r030M1235J9787m5747k1215M2585L7106k91J2455
$$ -98753 -67370 -47546 -51059 -60089 -18854 933 -44814 -66029 -23444 13662 13371 25826
15989B5826L902n280O737k5708l4794j1219R195k1321n165m277j5184P730L7089
$$ 25826 29728 24448 31185 5477 -29317 -40536 -31341 -52662 -57827 -62104 -77288 -69558 -32469
15976c2469M1746K9990L7684k5875J0616l7451Q041K411L4217j5650l5447J3329
$$ -32469 9277 39267 76951 51076 61692 24241 32282 34693 68910 53260 17813 31142
15964C1142L2681J95k2757J285m1369q79L4960r376m555l0137L2288K8716L5070
$$ 31142 63823 64018 41261 42546 1177 298 35258 25882 21327 -8810 23478 52194 87264
15951H7264m7599o4797n689k6679j2167k6198M3404M0285M2686K0568Q073O121
$$ 87264 39665 -25132 -30821 -57500 -69667 -95865 -52461 -12176 30510 51078 59151 65272
15939F5272q677k7460K7058M864r971k2895J2049j1533m935j6078O779m3949l07
$$ 65272 56595 29135 56193 61057 51086 28191 40240 28707 23772 7694 14473 -29476 -29783
15926b9783N4J9465j3770k2837O874J4486k2071m1567K2686j3642L778L395N1561
$$ -29783 -29729 -10264 -24034 -46871 -39997 -25511 -47582 -89149 -66463 -80105 -76327 -72932 -21371
15913b1371O1333p785k893n408J681K5541j4954p935l3044q393Q145j8126J7068
$$ -21371 39962 32177 29284 23876 25557 51098 36144 28209 -4835 -13228 -5083 -23209 -6141
15900f141J5625J3665r735K9343N0177m4252n8203k3092K4030J9249M760L2292
$$ -6141 9484 23149 13414 42757 92934 48682 -9521 -32613 -8583 10666 15426 47718
15888D7718K0955O590p9424J3290K7990J6558k8718r812j2193J7254j8174r004
$$ 47718 68673 75263 -4161 9129 37119 53677 24959 15147 2954 20208 2034 -6970
15876f970k6462q283L0444M0081k7132O0495P072n1049O3445K4628n4744l2442
$$ -6970 -33432 -41715 -11271 28810 1678 62173 69245 18196 81641 106269 51525 19083
15864A9083m6938Q221K559J218K3595O3299J0878j9171l8604k8315n7644m5708
$$ 19083 -27855 -19634 -17075 -15857 7738 71037 81915 62744 24140 -4175 -61819 -107527
15852a07527L5923P8910M9395m796j1153m2462k6424r104p803K58m287j5808j2511
$$ -107527 -71604 7306 56701 51905 40752 -1710 -28134 -37238 -45041 -44783 -49070 -64878 -77389
15839g7389O5370j736p1344m8239K5463O6162J2072N421j4505J375K0177K1457
$$ -77389 -12019 -13755 -85099 -133338 -107875 -41713 -29641 -24220 -38725 -37350 -17173 4284
15827D284K613m1159l3430n270j5151R759J6576J0950J2335M955M620K6168N2124
$$ 4284 6897 -34262 -67692 -72962 -88113 -78354 -61778 -50828 -38493 -33538 -28918 -2750 49374
15814D9374K8387p489j5732P651j4785q835o424j6274m5012j3784j5679k2903
$$ 49374 77761 70272 54540 62191 47406 38571 32147 15873 -29139 -42923 -58602 -81505
15802h1505L3261L2150M1524l5842p847L6762J6674m8779m3909n2j2438J0405
$$ -81505 -48244 -16094 25430 -10412 -18259 18503 35177 -13602 -57511 -57563 -70001 -59596
15790e9596j3308J7458L5599Q840L8137M519l8048l6892J3966M0310L0398l0516
$$ -59596 -72904 -55446 -19847 -11007 27130 31649 -6399 -43291 -29325 10985 41383 10867
15778A0867l4625l0732L8488p915j3202L0717r410j5882m1516N1749J3555j4285
$$ 10867 -23758 -54490 -16002 -23917 -37119 -6402 -15812 -31694 -73210 -21461 -7906 -22191
15766b2191k9727L1712l0747j8146k0831Q31k5258k3316L3516K8736M7705P108
$$ -22191 -51918 -20206 -50953 -69099 -89930 -89099 -114357 -137673 -104157 -75421 -27716 -20608
15754b0608q81J3180K776k3199J7899M1163k0118J4248m7017m865n904k3581j940
$$ -20608 -21489 -8309 -5533 -28732 -10833 30330 10212 24460 -22557 -27422 -33326 -56907 -58847
15741e8847L5203M1716k5706r7075j9861l911J9417j0231O473M8923k5927j5072
$$ -58847 -23644 18072 -7634 -104709 -124570 -128481 -109064 -119295 -112822 -63899 -89826 -104898
15729a04898K2982j1245p742K3883J746L3594P695p828k2072N6787K7400l985
$$ -104898 -81916 -93161 -100903 -77020 -75274 -41680 -33985 -41813 -63885 -7098 20302 16317
15717A6317j5641L2379K098m353K421m0860m8520J7275K7400j2367j7529j1085
$$ 16317 676 33055 35153 30800 33221 -7639 -56159 -38884 -11484 -23851 -41380 -52465
15705e2465M340J0570j5763P407j9960k3856L2302J2315l415q25J1078J7538M3780
$$ -52465 -48125 -37555 -53318 -45911 -65871 -89727 -57425 -45110 -48525 -49350 -38272 -20734 23046
15692B3046J2901l3012n0886j2875L5558R885l8566k5769k019M0975Q3315j4092
$$ 23046 35947 2935 -47951 -60826 -25268 -15383 -53949 -79718 -81737 -40762 42553 28461
15680B8461k1686O596k5056m8682K0361j5127P1546M7326q0014k7181K9848j6714
$$ 28461 6775 13371 -11685 -60367 -40006 -55133 16413 63739 -16275 -43456 -13608 -30322
15668c0322K7267k391K5178M051j9336m9270j0406M1812k0429L2686K2832n3666
$$ -30322 -3055 -5446 19732 23783 4447 -44823 -55229 -13417 -33846 -1160 21672 -31994
15656c1994l3785J9375N4609n253J2654Q688O2662q956l2094n1749n9749J3760
$$ -31994 -65779 -46404 8205 2952 15606 24294 86956 78000 45906 -5843 -65592 -51832
15644e1832N0168p4542o9221M5944M6892M8943j1338J2754L099j1252L1323L822
$$ -51832 -1664 -76206 -145427 -99483 -52591 -3648 -14986 -2232 867 -10385 20938 24760
15632B4760K3717M603q7737n769P4582N1676J8009q5576k7446K6564k1980o903
$$ 24760 48477 53080 -34657 -40426 34156 85832 103841 18265 -9181 17383 -4597 -11500
15620a1500J5759l2247R952K7052J3948k034k1191O87K5117j3125J4680J9264
$$ -11500 4259 -27988 -18036 9016 22964 20930 -261 426 25543 12418 27098 46362
15608D6362K705p377k9156J2132L961n5465j4772J1364j753k6265j7527J2870
$$ 46362 49067 41690 12534 24666 28627 -26838 -41610 -30246 -31999 -58264 -75791 -62921
15596f2921J3524L6264p248K6022l311l3130Q171P932Q013k6300O0115K6042n8089
$$ -62921 -49397 -13133 -20381 5641 2330 -30800 -22629 -14697 -6684 -32984 27131 53173 -4916
15583d916l0741m621j6411K3404N1960R582k414m0044m5770L070R038m152j5482
$$ -4916 -35657 -40278 -56689 -33285 18675 28257 25843 -14201 -59971 -56901 -47863 -52015 -67497
15570f7497J8445J4643l320j3514k7380j7248L1650n718K4813O1323n1231m9041
$$ -67497 -49052 -34409 -37729 -51243 -78623 -95871 -64221 -69939 -45126 16197 -35034 -84075
15558h4075K5554O0176l863l3385j0150N4418K5292J2907M9803m530l3192j6667
$$ -84075 -58521 1655 -2208 -35593 -45743 8675 33967 46874 96677 92147 58955 42288
15546D2288l2874k8586J1602N421k6087J6837L448K1733j2513j5610l2405K1065
$$ 42288 9414 -19172 -7570 -2149 -28236 -11399 -7951 13782 1269 -14341 -46746 -25681
15534b5681L6404k0634j8550L8778l3782J3298J4714o309J3701n966j6367l3910
$$ -25681 10723 -9911 -28461 10317 -23465 -10167 4547 -1762 11939 5973 -10394 -44304
15522d4304O487K3960j8194l301O440j9296K9082L2349j6041J5632M672J3246
$$ -44304 -37817 -13857 -32051 -35352 -28912 -48208 -19126 13223 -2818 12814 17486 30732
15510C0732o273n5556l9271R303L5841j168j4527k8578K7387r753J0252J6810
$$ 30732 24459 -31097 -70368 -61065 -25224 -26392 -40919 -69497 -42110 -51863 -41611 -24801
15498b4801j0909N7873K6574n4551p3868J4196L1678K591k4656m796K7180k7054
$$ -24801 -35710 22163 48737 -5814 -79682 -65486 -33808 -31217 -55873 -60669 -33489 -60543
15486f0543o403j0635K3233m074M989M1047j6582k927j8469J0261N4489K3627
$$ -60543 -66946 -77581 -54348 -58422 -53433 -12386 -28968 -31895 -50364 -40103 14386 38013
15474C8013K287j8868j8349N598m8919l1266k689L5632M5185J1098J9335j3393
$$ 38013 40300 21432 3083 8681 -40238 -71504 -74193 -38561 6624 17722 37057 23664
15462B3664J2574P399J3411K7375J4499l6576p3198l132M8394j2544j8942O647
$$ 23664 36238 43637 57048 84423 98922 62346 -10852 -13984 34410 21866 2924 9571
15450I571O021Q648k4388l149K657k9336L6517P4211k5265m1529l0021m1845l2876
$$ 9571 15592 24240 -148 -3297 -640 -29976 6541 80752 55487 13958 -16063 -57908 -90784
15437i0784K6585R6379P919j2886M2349n003J0833j0016o2586j6228L1202O888
$$ -90784 -64199 32180 40099 27213 69562 64559 75392 65376 2790 -13438 17764 24652
15425B4652k7417K4558J9986j7015L3721J2934r863k4376J2837l1205J6002j8506
$$ 24652 -2765 21793 41779 24764 58485 71419 61556 37180 50017 18812 34814 16308
15413A6308m2763k2329k1849j0105L6931j473l4332R593k211K6727M3977K0367
$$ 16308 -26455 -48784 -70633 -80738 -43807 -45280 -79612 -70019 -72230 -45503 -1526 18841
15401A8841N9268J0333n6327k8576K9783K9894j2942l3897m6557j8151m472k8131
$$ 18841 78109 88442 32115 3539 33322 63216 50274 16377 -30180 -48331 -52803 -80934
15389h0934P170R6936K995J2064l8607o3699K0412L9764J3515j412j6306j1974
$$ -80934 -73764 23172 26167 38231 -376 -64075 -43663 -3899 9616 8204 -8102 -20076
15377b0076p214j7444K6663n87J6679K365j814k729K2420N733j9843J020L5531
$$ -20076 -27290 -44734 -18071 -18658 -1979 386 -1428 -4157 18263 23996 4153 5173 40704
15364D0704j0272l9429j7879k2180K0082J1555k474J3830K3618K0336m3845l1210
$$ 40704 30432 -8997 -26876 -49056 -28974 -17419 -19893 -6063 17555 37891 -5954 -37164
15352c7164O4646r557k9270J2j888p185K6887J4762K4697l4288l7050k5168Q848
$$ -37164 27482 17925 -11345 -11333 -13221 -20406 6481 21243 45940 11652 -25398 -50566 -41718
15339d1718M1188L4236k1899o069j6603j166M242J0818L2796K0713j3364j652
$$ -41718 -530 33706 11807 5738 -10865 -12031 -7789 3029 35825 56538 43174 41522
15327D1522j3147l2943l7445j3529N5157l138J8808N1403J67m7699l7552k8709
$$ 41522 28375 -4568 -42013 -55542 -385 -3523 15285 66688 66855 19156 -18396 -47105
15315d7105j8225n962O8852l371j7349Q231J2375l7002l969j398j2852N077K5531
$$ -47105 -65330 -71292 -2440 -5811 -23160 -14929 -2554 -39556 -43525 -44923 -57775 -52698 -27167
15302b7167J555k0410J1501J833J4290M0060J7577j2651L1637j316m8968k7843
$$ -27167 -25612 -46022 -34521 -32688 -18398 21662 39239 26588 58225 56909 7941 -19902
15290a9902k7286J0336J2037k0059m838P477N3442K0189j6106R216J2639n332
$$ -19902 -47188 -36852 -24815 -44874 -49712 -42235 11207 31396 15290 24506 37145 31813
15278C1813L1067K2551k7483j1079R654M355q633j7638j3896j7446J1105K2180
$$ 31813 62880 85431 57948 46869 56523 60878 52245 34607 20711 3265 14370 36550
15266C6550l9348J6687J1247k4070j1487K4165K3940L5158j4681o5785r039N9827
$$ 36550 -2798 13889 25136 1066 -10421 13744 37684 72842 58161 -7624 -16663 43164
15254D3164j4935q2243l2824M6414N7511K9037K0180l7274K6145O48n675l9063
$$ 43164 28229 -54014 -86838 -40424 17087 46124 66304 29030 55175 55823 50148 11085
15242A1085j2846K0408j9346j360L126K2627j6828o921M7558K1968m7820l2560
$$ 11085 -1761 18647 -699 -2059 1067 23694 6866 -55 47503 69471 21651 -10909
15230a0909l2578l6144J6103L1385L5651j2128j225K6305m1101j4012J7075p651
$$ -10909 -43487 -79631 -63528 -32143 3508 -8620 -9845 16460 -24641 -38653 -21578 -29229
15218b9229l1263J4162K7569L5806m4676L8402J2709j9087K0694l4530k932J2797
$$ -29229 -60492 -46330 -18761 17045 -27631 10771 23480 4393 25087 -9443 -12375 422
15206D22R398L3405K006M703L3375j3446k4673j8688r219Q756Q16k4472j0168
$$ 422 9820 43225 45231 49934 83309 69863 45190 26502 17283 26039 26855 2383 -7785
15193g785l2947l8412N1438O3945j5654m6717k1153j8128L2867O442N965l963
$$ -7785 -40732 -79144 -27706 36239 20585 -26132 -47285 -65413 -32546 -26104 -20139 -24102
15181b4102n635L0709l0994J1660L8672Q32k9792r742N2228K0039K8379k2136
$$ -24102 -29737 972 -30022 -18362 20310 21142 -8650 -18392 33836 53875 82254 60118
15169F0118j0163Q396K217l7958j2923L9444p843O928O814R77l2433O858M1543
$$ 60118 49955 58351 60568 22610 9687 49131 41288 48216 55030 56007 23574 30432 71975
15156G1975L2165m0846k0810p8411m3566o309M1291J7726L9843O0607O149n9400
$$ 71975 104140 63294 42484 -35927 -79493 -85802 -44511 -26785 13058 73665 79814 20414
15144B0414j9277K5017Q677o144m8619k6163M350M8343J7826J1916N535M531m3106
$$ 20414 1137 26154 34831 28687 -19932 -46095 -41745 6598 24424 36340 41875 46406 3300
15131C300j967m457k8004M234J4734L7440J1729j2650p7682m8137J4155O8532
$$ 3300 1333 -3124 -31128 -26894 -12160 25280 37009 24359 -53323 -101460 -87305 -18773
15119a8773j0252L5514j3495j9426P733l9740O117n4110l138N9918L6613m72L972
$$ -18773 -29025 6489 -7006 -26432 -18699 -58439 -52322 -106432 -109570 -49652 -13039 -13511 -9539
15106i539r397l3742K6714J9485l0679K1002J853j2828n3452k676P6402J3493
$$ -9539 -18936 -52678 -25964 -6479 -37158 -16156 -14303 -27131 -80583 -83259 -6857 6636
15094F636K1274k2091k2842k0775L335J3973N0223J4857J0012j2370k3602j1016
$$ 6636 27910 5819 -17023 -37798 -34463 -20490 29733 44590 54602 42232 18630 7614
15082G614j9227K0234L0647K745J953O396M5356Q91n2215j1208L3771k9301k2454
$$ 7614 -11613 8621 39268 42013 43966 50362 95718 96609 44394 33186 66957 37656 15202
15069A5202j1691N518l0630j1229j9905L5061L3802l9411n8021k4565k7397N9756
$$ 15202 3511 9029 -21601 -32830 -52735 -17674 16128 -23283 -81304 -105869 -133266 -73510
15057g3510K3509J5944K9985m1705j6795K9798L5413L2223l2016q9859l7865J4824
$$ -73510 -50001 -34057 -4072 -45777 -62572 -32774 2639 34862 2846 -87013 -124878 -110054
15045a10054L183P1650L9452J0814j8681N978P483J5974M131k9630j7581L6898
$$ -110054 -106871 -35221 4231 15045 -3636 2342 9825 25799 29930 300 -17281 19617
15033A9617o840q528O806L2035m742j4187J1236j0639J90j1505K8679j2577K1441
$$ 19617 12777 4249 11055 43090 38348 24161 35397 24758 24948 13443 42122 29545 50986
15020E0986L7713J4886l0241l1925j0933n5662O231O488K449j7681M5824R134
$$ 50986 88699 103585 73344 41419 30486 -25176 -18945 -12457 -10008 -27689 18135 27269
15008B7269q662J0139K922j0057K469m2135m666K8387j3513O57K0818J7291j8041
$$ 27269 18607 28746 31668 21611 24080 -18055 -22721 5666 -7847 -7190 13628 30919 12878
14995A2878k84k199N155K2043j5497l8364m4565J0883K3297k8097M1549N124l3452
$$ 12878 12594 10395 15550 37593 22096 -16268 -60833 -49950 -26653 -54750 -13201 -8077 -41529
14982d1529k9496l4750J6079P7438J9498N273m2516R601O527p210M951l0732o9088
$$ -41529 -71025 -105775 -89696 -12258 7240 12513 -30003 -20402 -13875 -21085 -16134 -46866 -115954
14969a15954O572K6151M0016j5088o464k400J1981j1064n537M6747k2656K124
$$ -115954 -109382 -83231 -43215 -58303 -64767 -67167 -55186 -66250 -71787 -25040 -47696 -45572
14957d5572K808M5139K7276L0559k6168l9186r7K6922k5496o0734J0350J0765
$$ -45572 -42764 2375 29651 60210 34042 -5144 -5241 21681 -3815 -64549 -54199 -43434
14945d3434L7204K0430k0031j0968m6614j839L2653K8216R259J4778m850l1244
$$ -43434 -6230 14200 -5831 -16799 -63413 -65252 -32599 -4383 4876 19654 14804 -16440
14933a6440q518M1186O625k4619k182N328P3369K4570l322k7815p450J5581o59
$$ -16440 -24958 16228 22853 -1766 -3948 1380 74749 99319 95997 68182 60732 76313 75654
14920G5654l3616L0797l26l6435N7723k639m0790L4636K164k7827j0547m0492
$$ 75654 42038 72835 72509 36074 93797 91158 50368 85004 87168 59341 48794 8302
14908H302q939K3715k666k1380j1848j2789m7786j8751k295p551j3414L543L8813
$$ 8302 -637 23078 20412 -968 -12816 -25605 -73391 -92142 -94437 -101988 -115402 -111859 -73046
14895g3046P0426N832j0199n629K3086J4290l1357n919l1562J0968N8102M4744
$$ -73046 -2620 3212 -6987 -12616 10470 24760 -6597 -12516 -44078 -33110 24992 69736
14883F9736k1550n3674o182K082j394N4k7470L2648M2656J9986P198p1855o7879
$$ 69736 48186 -5488 -11670 -9588 -10982 -10928 -38398 -5750 36906 56892 64090 -7765 -75644
14870g5644l0917J2628K0269k96k464P7351m461K458M9702K4167k6326m1644L3639
$$ -75644 -106561 -93933 -73664 -73960 -76424 927 -3534 -1076 48626 72793 46467 4823 38462
14857C8462m38p0448n33j7742k1526L4521J6364K5555k0611l9097N5668Q0915
$$ 38462 38024 -32424 -32957 -50699 -72225 -37704 -21340 4215 -16396 -55493 175 81090
14845H1090J7642k0613n6172l0228K282l8601k8961o698J8674J1501M4196M0618
$$ 81090 98732 78119 21947 -8281 -5999 -44600 -73561 -80259 -61585 -50084 -5888 34730
14833C4730P6323N102k3094l6701k9784l5506K2168M3807o816N540K8640j4652
$$ 34730 111053 116155 93061 56360 26576 -8930 13238 57045 50229 55769 84409 69757
14821F9757m49l9191K9636k5928m851K1986L0687m4357l121Q820k2056m9660l9716
$$ 69757 69308 30117 59753 33825 28974 50960 81647 37290 34169 42989 20933 -28727 -68443
14808f8443K6407L3430M4911q185n8177Q393J0972O80m7938J0043q537J2731M9904
$$ -68443 -42036 -8606 36305 28120 -30057 -21664 -10692 -10012 -57950 -47907 -56444 -43713 6191
14795F191N8381m277o0550q987R818J0207J1877n2792m607l5829K0783J5351M2544
$$ 6191 64572 60295 -255 -9242 576 10783 22660 -30132 -34739 -70568 -49785 -34434 8110
14782H110l2171L842q478m0076q636K0474M2144Q226k985j5323n395J1817j7367
$$ 8110 -24061 -20219 -28697 -68773 -77409 -56935 -14791 -6565 -9550 -24873 -30268 -18451 -35818
14769c5818J4807L7458l240K9444m9050j3731J2604L4402K6937k701m9303j6587
$$ -35818 -21011 16447 13207 42651 -6399 -20130 -7526 26876 53813 51112 1809 -14778
14757a4778j0761j5190J1955K9096m8797q665M2650K0146K412j7919R564J4198
$$ -14778 -25539 -40729 -28774 322 -48475 -57140 -14490 5656 8068 -9851 -287 13911
14745A3911J5872l0237j2838N5974p089m1587j0630J7539K099k0289k5052j9518
$$ 13911 29783 -454 -13292 42682 35593 -5994 -16624 915 3014 -17275 -42327 -61845
14733f1845k6267M1548J1864K0791N5808K5383l2689j4157p442k2691l194n0662
$$ -61845 -88112 -46564 -34700 -13909 41899 67282 34593 20436 12994 -9697 -12891 -63553
14721f3553k7948O6504R16l2532j730K8802J4024o504K2915K1744j9175l0967
$$ -63553 -91501 -24997 -24081 -56613 -58343 -29541 -15517 -22021 894 22638 3463 -27504
14709b7504J8178k5799N850O8142K1601j2933j8958j5964m8177J146n920J9988
$$ -27504 -9326 -35125 -29275 38867 60468 47535 28577 12613 -35564 -34418 -40338 -20350
14697b0350j7544M76R425r437K616L6870O166m5015j4338L2130j9659r498J0892
$$ -20350 -37894 -37418 -27993 -37430 -34814 2056 8222 -36793 -51131 -19001 -38660 -48158 -37266
14684c7266j2564J9389P522j8440o849j6838J4240J3217k3469l0997K1634J8418
$$ -37266 -49830 -30441 -22919 -41359 -48208 -65046 -50806 -37589 -61058 -92055 -70421 -52003
14672e2003Q3060K6074l8908m5739n3562O09J7004J0827L0991k3306R378M1299
$$ -52003 31057 57131 18223 -27516 -81078 -80469 -63465 -52638 -21647 -44953 -35575 5724
14660E724P186J635J7181k1035l1604M5368j6689J9713k094N055j2948k6300K5545
$$ 5724 12910 14545 31726 10691 -20913 24455 7766 27479 25385 30440 17492 -8808 16737
14647A6737J02J2111m5836m0317k805L4026L4614M168j2485Q55j4033l3513r33
$$ 16737 16839 28950 -16886 -57203 -60008 -25982 8632 12800 315 1170 -12863 -46376 -47309
14634d7309K1525J740K093n0129j7555M7695P490K651J4167J0925L2397k1012
$$ -47309 -25784 -24044 -21951 -72080 -89635 -41940 -34450 -31799 -17632 -6707 25690 4678
14622D678l8750J6623J8628k5954l2498j2777P967K5531J990l5829K5538k5164
$$ 4678 -34072 -17449 1179 -24775 -57273 -70050 -62083 -36552 -34562 -70391 -44853 -70017
14610g0017O015k9560l6231L6755O0903M7747K5379l950m5946p3207l3221l2829
$$ -70017 -64002 -93562 -129793 -93038 -32135 15612 40991 37041 -8905 -82112 -115333 -148162
14598a48162q4N6234K9950J2849k1009L6965L7926k0653l9175j0509N7704K5786
$$ -148162 -148246 -92012 -62062 -49213 -70222 -33257 4669 -15984 -55159 -65668 -7964 17822
14586A7822m4508K9675l379n6051R193L7077L3567J2033l9868K8950J0475k3618
$$ 17822 -26686 2989 -390 -56441 -47248 -10171 23396 35429 -4439 24511 34986 11368
14574A1368K8050n4672j9168O6200K1699j2787k0626J7175n2393j2248K2869J0711
$$ 11368 39418 -15254 -34422 31778 53477 40690 20064 37239 -15154 -27402 -4533 6178
14562F178k4340m3673j7952M7378p253n602o679m8901K6455O9670O2378q866n540
$$ 6178 -18162 -61835 -79787 -32409 -39662 -45264 -51943 -100844 -74389 -4719 57659 48793 43253
14549D3253J0082m758o799j7302j7161l5321M339O9747K6011N7190l5512m0541
$$ 43253 53335 48577 41778 24476 7315 -28006 -23667 46080 72091 129281 93769 53228
14537E3228J3781k9201k5234o869r616N6645L9240l1571k3545k1827l303j6352
$$ 53228 67009 37808 12574 5705 -3911 52734 91974 60403 36858 15031 11728 -4624
14525d624q176K8212P40m6551O81m634O781N4766P994o072J2417L307k1710n6755
$$ -4624 -12800 15412 16152 -30399 -29718 -34352 -27571 27195 35189 29117 41534 44841 23131 -33624
14511c3624M1587K9086o791j8996l5604j4430J964L7042k804Q36r270K1581k196
$$ -33624 7963 37049 30258 11262 -24342 -38772 -36808 234 -2570 -1734 -11004 10577 8381
14498H381l4008J4703P381n6616p413O2095j640o950l1294p822J3205J726K7688
$$ 8381 -25627 -10924 -3543 -60159 -67572 -5477 -7117 -14067 -45361 -53183 -39978 -38252 -10564
14485a0564L2912K0275l3180k8223j5263k0380K371l2281J5359j4264K5015K7434
$$ -10564 22348 42623 9443 -18780 -34043 -54423 -52052 -84333 -68974 -83238 -58223 -30789
14473c0789j9640K122N6184k3983m3303J6541N089k926o797K604L4807J5819o0813
$$ -30789 -50429 -48307 7877 -16106 -59409 -42868 -37779 -40705 -47502 -44898 -10091 5728 -55085
14460e5085j6287L0295L2457K0660k6714m9318L5360L3104k9369k4273n77L7132
$$ -55085 -71372 -41077 -8620 12040 -14674 -63992 -28632 4472 -24897 -49170 -49747 -12615
14448a2615K5184j394k3859M678j7738m8160k5253L4335M1199j8997j1182l5886
$$ -12615 12569 11175 -12684 -8006 -25744 -73904 -99157 -64822 -23623 -42620 -53802 -89688
14436h9688j5680K0770O0544L975K4742K9489l8968k4222r135m965m0787j117
$$ -89688 -105368 -84598 -24054 -20079 4663 34152 -4816 -29038 -38173 -43138 -83925 -85042
14424h5042P4710L7341m1726l7404Q164J7187L8489J1756k5526k4573K2503J8096
$$ -85042 -10332 27009 -14717 -52121 -43957 -26770 11719 23475 -2051 -26624 -4121 13975
14412A3975k3136J7651N0258o019k7715n7289j8094K6783J1648K5552l0437q157
$$ 13975 -9161 8490 58748 52729 25014 -32275 -50369 -23586 -11938 13614 -16823 -24980
14400b4980M593L2951K8951l0572l3233N8169M0807M601J9940k8966R104m5802
$$ -24980 -20387 12564 41515 10943 -22290 35879 76686 81287 101227 72261 81365 35563
14388C5563J2560K7401k8171k4822l3117K3868K3655k1543m978J7249k2191k5593
$$ 35563 48123 75524 47353 22531 -10586 13282 36937 15394 10416 27665 5474 -20119
14376b0119J2861k8477k5843L9384N328J9691K4449K139J5698K4693j8776K339
$$ -20119 -7258 -35735 -61578 -22194 -16866 2825 27274 29413 45111 69804 51028 53367
14364E3367l2018m3203M227R307k3199l0138P102N3581k9168o844K3397m7967
$$ 53367 21349 -21854 -17627 -8320 -31519 -61657 -54555 -974 -30142 -36986 -13589 -61556
14352f1556k5420n622L1100m582q518j6258L1170N1913m369J7057J0972K0717
$$ -61556 -86976 -92598 -61498 -66080 -74598 -90856 -59686 -7773 -12142 4915 15887 36604
14340C6604k2908K0737K9433m0311k9902k2000o3178J4496L218N0497L2828J7636
$$ 36604 13696 34433 63866 23555 -6347 -28347 -91525 -77029 -73811 -23314 9514 27150
14328B7150K2808k5989j5261J7844r890q034K0737l036o4946j8175L5766M6792
$$ 27150 49958 23969 8708 26552 16662 8628 29365 26329 -38617 -56792 -21026 25766
14316B5766M3044p0743j1268j0791j1510K9290K8850k931P318j8620o6418j2905
$$ 25766 68810 -1933 -13201 -23992 -35502 -6212 22638 19707 27025 8405 -58013 -70918
14304g0918O2562M4865n1857k0015p0J0929O237J8784m8256k2607O7827n0321
$$ -70918 -8356 36509 -15348 -35363 -35433 -24504 -18267 517 -47739 -70346 -2519 -52840
14292e2840l1905M5017Q9201J3512J5399k7251q3684k2260O2189J9818K2937k7326
$$ -52840 -84745 -39728 49473 62985 78384 51133 -32551 -54811 7378 27196 50133 22807
14280B2807L051K9035j4341n1960J3152Q116l0119k0033m891L5320j4072k4558
$$ 22807 25858 54893 40552 -11408 1744 9860 -20259 -40292 -45183 -9863 -23935 -48493
14268d8493J2664j5827j873J3980J9412Q873J8571O567m855M4519K6685m3590
$$ -48493 -35829 -51656 -53529 -39549 -20137 -11264 7307 13874 9019 53538 80223 36633
14256C6633l0195k9259j3940L6880l3915j5586K5410J3923k2988j633l3639K2273
$$ 36633 6438 -22821 -36761 119 -33796 -49382 -23972 -10049 -33037 -34670 -68309 -46036
14244d6036k9344N760L165J090k5468o271P0048L4955k2609l828K218j3632O984
$$ -46036 -75380 -69620 -66455 -65365 -90833 -97104 -27056 7899 -14710 -18538 -16320 -29952 -22968
14231b2968n8901M6826J2419m7577l2683J0501n0262N4943K8031l0412P407o874
$$ -22968 -81869 -35043 -22624 -70201 -102884 -92383 -142645 -87702 -59671 -90083 -82676 -89550
14219h9550J065l52L3307K7315J5839j0978j4021M471K0375J4240j9728M9008
$$ -89550 -88485 -88837 -55530 -28215 -12376 -23354 -37375 -32904 -12529 1711 -18017 30991
14207C0991K6628o1466l6846M3689j9279J3045K6031L0327M1069r287k8855j0457
$$ 30991 57619 -3847 -40693 2996 -16283 -3238 22793 53120 94189 84902 56047 45590
14195D5590J0071l025j3523J1411K1514J8316M7199N1772L8563J9906k9017K1069
$$ 45590 55661 52636 39113 50524 72038 90354 137553 189325 227888 247794 218777 239846
14183B39846N401l2584o2510m4826J7188j277p3907j9373K1338j8587O837j919
$$ 239846 245247 212663 150153 105327 122515 121238 47331 27958 49296 30709 37546 35627
14171C5627L1504p273l2266k6714l2499K7135L7502O7111J2606n195l595m3627
$$ 35627 67131 59858 27592 878 -31621 -4486 33016 100127 112733 107538 103943 60316
14159F0316n2880j6220L373M6121K5026j0151J6323M9693L4198k696M3192J4724
$$ 60316 7436 -8784 -5411 40710 65736 55585 71908 121601 155799 153103 196295 211019
14147B11019J3099l027q8800k9343l0468k5342k2224J2970K4934R042m3875L785
$$ 211019 224118 221091 132291 102948 72480 47138 24914 37884 62818 71860 27985 31770
14135C1770j0278M6115M35o3432L224K4310l1664n163j9704k3302N7586R611k8741
$$ 31770 21492 67607 68042 4610 7834 32144 480 -4683 -24387 -47689 9897 19508 -9233
14122i233J9674K4210J595j7072o1145M4390N9555J5100m7441M204k0329k1853
$$ -9233 10441 34651 36246 19174 -41971 2419 61974 77074 29633 33837 13508 -8345
14110h345J5974M7675j4676l9348l3555J287K3779K7742j0826l7806j8735L9038
$$ -8345 7629 55304 40628 1280 -32275 -30988 -7209 20533 9707 -28099 -46834 -7796
14098g796N5855k2173n1922m1444J9285r682n430k5368L3000K8222K4539J826
$$ -7796 48059 25886 -26036 -67480 -48195 -57877 -63307 -88675 -55675 -27453 -2914 -1088
14086a088j4639l1599j712M5645L8026r484k7767M207J3737l0112J1985o337K483
$$ -1088 -15727 -47326 -49038 -3393 34633 25149 -2618 1589 15326 -14786 -2801 -9138 -6655
14073f655o152K0717j1661j7617K3372L4722J7183m2916k6985L2336K4514J938
$$ -6655 -12807 7910 -3751 -21368 2004 36726 53909 10993 -15992 16344 40858 42796
14061D2796j138l2321m8969l4099n311J1924J1591L3009L2458l4392L2968k240
$$ 42796 41658 9337 -39632 -73731 -79042 -67118 -55527 -22518 9940 -24452 8516 6276
14049F276j8591j8244J2204N9865L2831j4492pl1297m9055K7749O2746O193l7600
$$ 6276 -12315 -30559 -18355 41510 74341 59849 59842 28545 -20510 7239 69985 76178 38578
14036C8578k8372m7255j8389L8348L5216l991M8579j0294J3022r685j4368L6396
$$ 38578 10206 -37049 -55438 -17090 18126 14135 62714 52420 65442 55757 41389 77785
14024G7785K4332m7433J2139K1468o499m2887M286k8147n7629K1591N45L2974
$$ 77785 102117 54684 66823 88291 81792 38905 43191 15044 -42585 -20994 -20449 12525
14012A2525L8426k3188j3226K899p410j5500o248k2680k2436N5900M1411l7378
$$ 12525 50951 27763 14537 17436 10026 -5474 -11722 -34402 -56838 -938 40473 3095
14000C095k586K1412j0548R043k0513J0647j1644k5612N934L2945J0320L5034
$$ 3095 509 21921 11373 20416 -97 10550 -1094 -26706 -20772 12173 22493 57527
13988E7527K8295k2737n8638J4480j01m166l0991m2842j0216L6786O1019Q443
$$ 57527 85822 63085 4447 18927 18826 14660 -16331 -59173 -69389 -32603 28416 36859
13976C6859j6589j5433j4201j0002l8935K4049K6987J6108J5991L8505P63k9190
$$ 36859 20270 4837 -9364 -19366 -58301 -34252 -7265 8843 24834 63339 64102 34912
13964C4912k708K1450L295l7166q4109j4528N1069O258L0516N2702L8619k7521
$$ 34912 32204 53654 56949 19783 -64326 -78854 -27785 -21527 8989 61691 100310 72789
13952G2789l6462m9755l6834J5842K243K7506M1020J8957m3832l5975R763L0161
$$ 72789 36327 -13428 -50262 -34420 -32177 -4671 36349 55306 11474 -24501 -14738 15423
13940A5423O471j3134k2971l8918M0950M6984q664P342Q346k0283l3315N3818
$$ 15423 21894 8760 -14211 -53129 -12179 34805 26141 33483 41829 21546 -11769 42049
13928D2049J1327o9959l0895K0653J1285j8140J8470n1691j6938M0852M4950j4708
$$ 42049 53376 -16583 -47478 -26825 -15540 -33680 -15210 -66901 -83839 -42987 1963 -12745
13916a2745k3644O69L4127r906l6194l1501J3887l94k0672J6390R901r776l844
$$ -12745 -36389 -35720 -1593 -11499 -47693 -79194 -65307 -65701 -86373 -69983 -60082 -69858 -73702
13903g3702P868L4155m648R353M8140j5201l4533k0703q654l093N000J9619L9812
$$ -73702 -65834 -31679 -36327 -26974 21166 5965 -28568 -49271 -57925 -61018 -56018 -36399 3413
13890C413R037N5823l6300o4123j9625p548J9075L5891K511J1099k5069J1738
$$ 3413 12450 68273 31973 -32150 -51775 -59323 -40248 -4357 -1846 9253 -15816 -4078
13878d078r356j2907P939m6973L0321K7354J3781K1578j3099l8509K3742N4429
$$ -4078 -13434 -26341 -18402 -65375 -35054 -7700 6081 27659 14560 -23949 -207 54222
13866E4222j2544m8271j272m0454j4399K7754Q605n646J0134n303K1188K8817
$$ 54222 41678 -6593 -7865 -48319 -62718 -34964 -26359 -32005 -21871 -27174 -5986 22831
13854B2831K773P162R611j8020Q688l2446K0591K6131K591J8703j1172j2323l3714
$$ 22831 25604 32766 42377 24357 33045 599 21190 47321 49912 68615 57443 45120 11406
13841A1406l0853k3992j8657j2302N6805J2609n1002n02P5608M9336k3315k3187
$$ 11406 -19447 -43439 -62096 -74398 -17593 -4984 -55986 -56488 19120 68456 45141 21954
13829B1954m5080K6653K4001J7271r535l7512j4171L81J247Q826K5574O1308P10
$$ 21954 -23126 3527 27528 44799 35264 -2248 -16419 -16038 -14791 -5965 19609 80917 81627
13816H1627j5029m2018P542o490m429j3605m0769j7787k2344N473j4451K5552
$$ 81627 66598 24580 32122 25632 21203 7598 -33171 -50958 -73302 -67829 -82280 -56728
13804e6728L3126k468J4465N4806k8482j7811J2829J7439M264m6834l71K7863
$$ -56728 -23602 -26070 -11605 43201 14719 -3092 9737 27176 31440 -15394 -15765 12098
13792A2098j7311r419N848K9263j3994m0497K0039L5512M759l2625j2893L1419
$$ 12098 -5213 -14632 -8784 20479 6485 -34012 -13973 21539 26298 -6327 -19220 12199
13780A2199l7194l276J424N4778o693l8361k7147J0877N9666J7965k5656p321
$$ 12199 -24995 -28271 -26847 27931 21238 -17123 -44270 -33393 26273 44238 18582 11261
13768A1261P625J9173p405l0541n6543k577m5895l036N3462O0179K8351J0124
$$ 11261 18886 38059 30654 113 -56430 -59007 -104902 -107938 -54476 5703 34054 44178
13756D4178j1033j580j9045q918l111k8608J4873L1665K6852N366l2327l7432
$$ 44178 33145 31565 12520 3602 491 -28117 -13244 18421 45273 50639 18312 -19120
13744a9120J63k0153K3930J2898O861k173N3519k8720l8447k6831J5799n0619
$$ -19120 -18957 -39110 -15180 -2282 4579 2406 55925 27205 -11242 -38073 -22274 -72893
13732g2893n2193k552N6089N1775J2264j7279j043L446K3350n452p5766k6297
$$ -72893 -125086 -127638 -71549 -19774 -7510 -24789 -25832 -22386 964 -4488 -80254 -106551
13720a06551M9398J4782K7150J5971r433k7876M5118O1271j1325j103l4220l3280
$$ -106551 -57153 -42371 -15221 750 -8683 -36559 8559 69830 58505 57402 23182 -10098
13708a0098J6019K1843j9569o4221J1541J9978K1549k6306J0974J617l221j0180
$$ -10098 5921 27764 8195 -56026 -44485 -24507 -2958 -29264 -18290 -16673 -19894 -30074
13696c0074l2834P566K7578j4366l4765M6022L4959J217k5290N75K9879l6638
$$ -30074 -62908 -55342 -27764 -42130 -76895 -30873 4086 5303 -19987 -19412 10467 -26171
13684b6171j6644m6445m5003O5272R1516j541k1346K5185l9644N890Q112r541
$$ -26171 -42815 -89260 -134263 -68991 22525 20984 -362 24823 -14821 -8931 -819 -10360
13672a0360M2880l7092o4123K1479K4322k6555k6788k6757L4222O9506K1274L2172
$$ -10360 32520 -4572 -68695 -47216 -22894 -49449 -76237 -102994 -68772 734 22008 54180
13660E4180n0271n5439M5118K9436j0779J7853K7908Q840l0821p1662j7770K5815
$$ 54180 3909 -51530 -6412 23024 12245 30098 58006 66846 36025 -35637 -53407 -27592
13648b7592m6236J2160L8522L0672L8938M385m2847J1418J9559K6777J6685J6781
$$ -27592 -73828 -61668 -23146 7526 46464 50849 8002 19420 38979 65756 82441 99222
13636I9222K7754M2298P235K4091O3011O7780J29537K39046L13083L91296K21990
$$ 99222 126976 169274 176509 200600 263611 331391 460928 699974 1013057 1404353 1626343
13625A626343j41891j66274j7101J56226J16993j58193l34136k90579j95597j09300
$$ 1626343 1484452 1318178 1301077 1457303 1574296 1416103 1081967 791388 595791 486491
13615D86491j23540r0513o3610o193L1405j0872k8122J8036M762M197k9010l6387
$$ 486491 362951 272438 208828 202635 234040 223168 195046 213082 217844 222041 193031 156644
13603A56644o357m974K6011J3955l7049O572L7637l0612K6315N6059M4186L6313
$$ 156644 150287 145313 171324 185279 148230 154802 192439 161827 188142 244201 288387 324700
13591C24700O6592J04590J61649K25481L81311O21209P79854O90097j619m53090
$$ 324700 391292 495882 657531 883012 1264323 1885532 2665386 3355483 3353864 2900774
13581B900774j57537K18155M23206l9385p12070p84478n42643l35124k03920j02891
$$ 2900774 2743237 2961392 3384598 3345213 2633143 1848665 1306022 970898 766978 664087
13571F64087j07538r9570p7382l6866m6840m2902k9501k6249l5833n0542J7975
$$ 664087 556549 456979 379597 342731 295891 252989 223488 197239 161406 110864 128839
13560A28839j0596j2417J0448K7851n343K1376N5765j3209K2354J0412N1795N2572
$$ 128839 118243 105826 116274 144125 138782 160158 215923 202714 225068 235480 287275 339847
13548C39847N2716K2659P8572J38730K23629L84236M30934J45364j84459j76284
$$ 339847 392563 415222 493794 632524 856153 1240389 1671323 1816687 1632228 1455944
13538A455944P3023K11964N2355k80728m53605l20973k00427j46406o0047k6641
$$ 1455944 1528967 1740931 1793286 1512558 1058953 737980 537553 391147 331100 304459
13528C04459m0650o1646j6933m71K2794l3582j9057k333m7614k0948k0129o144
$$ 304459 263809 202163 185230 184759 207553 173971 154914 152581 104967 84019 63890 57746
13516E7746O603j1953J2514q085m6052m143L8115L4218j4466J0130l8051j5063
$$ 57746 64349 52396 64910 56825 10773 6630 44745 78963 64497 74627 36576 21513
13504B1513K1161M1858P088j1429J7089j9683m1876l2166l7758L8605O5281K9808
$$ 21513 42674 84532 91620 80191 97280 77597 35721 3555 -34203 4402 69683 99491
13492I9491k0298o1217j7407Q934K8074l4559M532M0090L6167m0273l8683o1700
$$ 99491 79193 17976 569 9503 37577 3018 7550 47640 83807 43534 4851 -56849
13480e6849m3482N1101L5817L1601M501k3175j2382l2578n0076K867M5081J0279
$$ -56849 -100331 -49230 -13413 18188 22689 -486 -12868 -45446 -95522 -92655 -47574 -37295
13468c7295P163O094J4020m973L2667n767K2113L5840j8919m4666l3382j9060
$$ -37295 -30132 -24038 -10018 -14991 17676 11909 34022 69862 50943 6277 -27105 -46165
13456d6165M0987j963j8612l98J3878L0369L1286J7975P404P430N488r966l1697
$$ -46165 -5178 -7141 -25753 -26151 -12273 18096 49382 67357 74761 82191 87679 77713 46016
13443D6016j8502j7803J7428M711o3531n293M693J2178O337m889n803k7559O341
$$ 46016 27514 9711 27139 31850 -31681 -36974 -32281 -20103 -13766 -18655 -24458 -52017 -45676
13430d5676O049K8190L2547K0023M0157j0783k5907n9514k8277j1356j1596L8436
$$ -45676 -39627 -11437 21110 41133 81290 70507 44600 -14914 -43191 -54547 -66143 -27707
13418b7707L6485L501J5706j631k3145L6447L246m370K4151m2610j9172J6463
$$ -27707 8778 12279 27985 26354 3209 39656 42902 38532 62683 20073 901 17364
13406A7364l202J8630N2191j3823n0762j8706k688k2960K9466k0282m2178P046
$$ 17364 14162 32792 84983 71160 20398 1692 -996 -23956 5510 -14772 -56950 -49904
13394d9904K3075K171L0073k8190j9373r076j4915r870j0843K4706M6498M193
$$ -49904 -26829 -24658 5415 -22775 -42148 -51224 -66139 -76009 -86852 -62146 -15648 -11455
13382a1455j856L2016M132n3158n7646K390j8932Q176k7232N7693M2612Q919j9173
$$ -11455 -13311 18705 22837 -30321 -87967 -85577 -104509 -96333 -123565 -65872 -23260 -14341 -33514
13369c3514M646N6721k8134j8392J3187J4551K6211J6505j7596m8682j0121M1575
$$ -33514 -28868 27853 -281 -18673 -5486 9065 35276 51781 34185 -14497 -24618 16957
13357A6957J5277j8365J4957J8002j9684j5003j6694L316J2848J1067j3489j0011
$$ 16957 32234 13869 28826 46828 27144 12141 -4553 -1237 11611 22678 9189 -822
13345h22j3181L75J241Q552J9134k3653k214K1680j4867K079k50o539l4271k7387
$$ -822 -14003 -13628 -12387 -3835 15299 -8354 -10568 11112 -3755 -1676 -1926 -8465 -42736 -70123
13331g0123J4457L1271k823l7090J0979P4889k1707J7696L6346l3113m1672j4956
$$ -70123 -55666 -24395 -27218 -64308 -53329 21560 -147 17549 53895 20782 -20890 -35846
13319c5846j6332l5669N0303P6944K0358o2932J7753J3363j7646J2870K5731l9235
$$ -35846 -52178 -87847 -37544 39400 59758 -3174 14579 27942 10296 23166 48897 9662
13307I662n3985k0682L416N3151K9766j0079j9499j0427Q468M527j044K6082J5624
$$ 9662 -44323 -65005 -61589 -8438 21328 11249 -8250 -18677 -10209 -5682 -6726 19356 34980
13294C4980j1689m085l3994l9742L8354L2932J0761J7854O229M932K5780M7750
$$ 34980 23291 19206 -14788 -54530 -16176 16756 27517 45371 51600 56532 82312 130062
13282A30062M7728j6861j5799J0646K9842J9087N6203j2321N663R59k1567j0601
$$ 130062 177790 160929 145130 155776 185618 204705 260908 248587 254250 255209 233642 223041
13270B23041j8657l2925l4410n5176k4513k7080m476M6020K6620K8785L8913L8320
$$ 223041 204384 171459 137049 81873 57360 30280 25804 71824 98444 127229 166142 204462
13258B04462J362q9720m1402J3932k366L4142L1052M2404l0934k629J0061q189
$$ 204462 205824 116104 74702 88634 86268 120410 151462 193866 162932 160303 170364 162175
13246A62175J4779J16928O9867M5939M9999r599J1279J06515L5078K9532R170
$$ 162175 176954 293882 363749 409688 459687 450088 461367 567882 602960 632492 641662
13235F41662q210K6748l5114r3396n7593m2217o8903o4081J9330l0792p2213Q275
$$ 641662 633452 660200 625086 531690 474097 431880 362977 298896 318226 287434 215221 223496
13223B23496L2779l3131J7908l0158K7009L1894j2776l1955o7344q827K3472R831
$$ 223496 256275 223144 241052 210894 237903 269797 257021 225066 157722 148895 172367 182198
13211A82198K64L28L7759M9420O8868R6830P3187Q5936L0162N0791K6870k4441
$$ 182198 182462 182790 220549 269969 338837 435667 508854 594790 624952 675743 702613 678172
13199F78172j6858o3982o5370n8524P617J6748p534l0687j6040p6319p1685L048
$$ 678172 661314 597332 531962 473438 481055 497803 490269 459582 443542 367223 295538 298586
13187B98586J0286k1880J2729n3850n4919q0914m7018J9497L2911Q2964K9271
$$ 298586 308872 286992 299721 245871 190952 110038 63020 82517 115428 198392 227663
13176B27663l5219m181K0837l2611n0545L1526L410l8087m5801J4727P4033R6332
$$ 227663 192444 188263 209100 176489 125944 157470 160880 122793 76992 91719 165752 262084
13164B62084L6686M8436L0519K942N128l0523k8971n8433p584j8588o3995k9151
$$ 262084 298770 347206 377725 380667 385795 355272 326301 267868 260284 241696 177701 148550
13152A48550Q410j1586r857n8227m3403M8831M6984J9013O6955J36621J10970
$$ 148550 156960 145374 135517 77290 33887 82718 129702 148715 215670 352291 463261
13141D63261N7902k1449j33785j24924n6194l2885l4796K7119L199l8126M50J3498
$$ 463261 521163 499714 365929 241005 184811 151926 117130 144249 147448 109322 109772 123270
13129A23270r577J436K4540j6532j8974k6878J9126k1372o907L2977K5035J4324
$$ 123270 113693 115129 139669 123137 104163 77285 96411 75039 68132 101109 126144 140468
13117A40468k4369m7986n4587Q323J3656j3031N217M058P625K2838K9017K6657
$$ 140468 116099 68113 13526 21849 35505 22474 27691 31749 39374 62212 91229 117886
13105A17886J946r8904l417M4324L7956P6978N5805O0328R0892Q0766l0337j10153
$$ 117886 119832 20928 17511 61835 99791 176769 232574 292902 383794 464560 434223 324070
13093C24070p7078o9249k8904l5906K902K703n7806k0134n4118j4582J040N467
$$ 324070 246992 177743 148839 112933 115835 118538 60732 40598 -13520 -28102 -27062 -21595
13081b1595m288M5816N7365l410j6261l8477l1090J4381J4205R300N5985K5225
$$ -21595 -25883 19933 77298 73888 57627 19150 -11940 2441 16646 25946 81931 107156
13069A07156k89k5713j1412P816L2939J5478o8525l7902l6522j0946K1117P566
$$ 107156 106867 81154 69742 77558 110497 125975 57450 19548 -16974 -27920 -6803 763
13057G63J781o491K9598M4413L0279Q1318L1111K3281k827m0883n8813r7238J006
$$ 763 2544 -3947 25651 70064 100343 181661 212772 236053 233226 192343 133530 36292 37298
13044C7298M3133m0830k666L0124K8342J1417k2722K310K4441P802n5461m7775
$$ 37298 80431 39601 36935 67059 95401 106818 84096 86406 110847 118649 63188 15413
13032A5413n6337J7745P2931L6595M976k0495k8178J4190m1875N843L4067n110
$$ 15413 -40924 -23179 49752 86347 91323 70828 42650 56840 14965 20808 54875 49765
13020D9765m7895n703J7957R233k6361m948M0005K4414K2690o614J3621M5215
$$ 49765 1870 -3833 14124 23357 -3004 -7952 32053 56467 79157 72543 86164 131379
13008A31379P833j4710N2488l6093J9719K992K62j0948p0253l1934K1745J7709
$$ 131379 139212 124502 176990 140897 160616 163608 163870 152922 82669 50735 72480 90189
12996I0189K1258l3883k2807J558k1666J9985J8667k267n4900j9981J4456j8647
$$ 90189 111447 77564 54757 56315 34649 54634 73301 71034 16134 -3847 10609 -8038
12984h038k8760k9454R13K8817j726l3772l1263J1214J29J1234Q999J3611K478
$$ -8038 -36798 -66252 -65339 -36522 -38248 -72020 -103283 -92069 -91940 -80706 -71707 -58096 -55618
12971e5618j1327L7218N2367j7716L6163J6947j5989J35n642M4951q637j8047
$$ -55618 -66945 -29727 22640 4924 41087 58034 42045 42180 36538 81489 72852 54805
12959E4805J9477l508m163p302R628j8498L0135K3119m1571j6270m133j7703P44
$$ 54805 74282 70774 66611 59309 68937 50439 80574 103693 62122 45852 41719 24016 24760
12946B4760K9621j4906k4589p297K2341P905k4552l2164J5139k4540M8607M8570
$$ 24760 54381 39475 14886 7589 29930 37835 13283 -18881 -3742 -28282 20325 68895
12934F8895m0469r418Q572p303P60N7210L3574l1363n2695L0936M0999N7112L0534
$$ 68895 28426 19008 27580 20277 21037 78247 111821 80458 27763 58699 99698 156810 187344
12921A87344L6800l3271k9792J7365M5631J4010l1754K3944N0406M6053J0314
$$ 187344 224144 190873 161081 178446 224077 238087 206333 230277 280683 326736 337050
12910C37050n8658m5023m8426k552L3614l471K9710l4543l8124R719L2666K3156
$$ 337050 278392 233369 184943 182391 216005 212534 242244 207701 169577 179296 211962 235118
12898B35118O4304L4971m9078k9892J9132o4409k925L6802O3191J8758k2692J849
$$ 235118 299422 334393 285315 255423 274555 210146 207221 244023 307214 325972 303280 305129
12886C05129K2322K2433J1384J9380N2094J1899J322L0733M9630J7789l285m1099
$$ 305129 327451 349884 361268 380648 432742 444641 445963 476696 526326 544115 540830 499731
12874D99731l4136N6791P2620K5764J7073k675j8710M6598O2769L3806N2393L2944
$$ 499731 465595 522386 595006 620770 637843 635168 616458 663056 725825 759631 812024 844968
12862H44968r7M5135K2499K3604N7426J30497J05500j2050N9038J04363J06939
$$ 844968 844871 890006 912505 936109 993535 1124032 1229532 1217482 1276520 1380883 1487822
12851A487822R6757J23409J43387J50038K28682K29520K40886L03541L93586M74367
$$ 1487822 1584579 1707988 1851375 2001413 2230095 2459615 2700501 3004042 3397628 3871995
12841C871995N70537O63446P60517R29560J152994J358359J664437K125726K754367
$$ 3871995 4442532 5105978 5866495 6796055 7949049 9307408 10971845 13097571 15851938
12832A5851938L463326M282908N299499O135263O478390O015974M295417J589799
$$ 15851938 19315264 23598172 28897671 35032934 41511324 47527298 51822715 53412514
12824E3412514j165340l333775m424081m675829m353272l781819l152748k547267
$$ 53412514 52247174 48913399 44489318 39813489 35460217 31678398 28525650 25978383
12816B5978383k030480j606634j267562r41472o39883l21562p7860P1158K63047
$$ 25978383 23947903 22341269 21073707 20132235 19492352 19170790 19092930 19164088 19427135
12807A9427135N25638P30165J034626J297574J647637K057722K517858L171993
$$ 19427135 19952773 20682938 21717564 23015138 24662775 26720497 29238355 32410348
12799C2410348L962688M797612N774597O900264P960546Q775241Q956933Q313464
$$ 32410348 36373036 41170648 46945245 53845509 61806055 70581296 79538229 87851693
12791H7851693P011905N984001N926934O811667P551675O880972L754437j438387
$$ 87851693 94863598 100847599 106774533 113586200 121137875 128018847 131773284 130334897
12783A30334897o872879j0623353j2066413j1802805j0546890q977315p389645
$$ 130334897 123462018 112838665 100772252 88969447 78422557 69445242 62055597
12776F2055597o027937m856717l850398l046427k401066j839963j386871r34170
$$ 62055597 56027660 51170943 47320545 44274118 41873052 40033089 38646218 37712048
12768C7712048n06635k0915M78476Q86472J249248J830299K448741L119458M038179
$$ 37712048 37205413 37184498 37662974 38549446 39798694 41628993 44077734 47197192 51235371
12759E1235371N134697O358219P837038R470834J1142299J2349018J2529858J0895124
$$ 51235371 56370068 62728287 70565325 80036159 91178458 103527476 116057334 126952458
12751A26952458P075982J768898l245771o294283o843390o103739n451677n860477
$$ 126952458 134028440 135797338 132551567 126257284 119413894 113310155 107858478 101998001
12743A01998001p211102q675109r314058r109386q320965p123095n985412n030532
$$ 101998001 94786899 86111790 76797732 67688346 59367381 52244286 46258874 41228342
12735D1228342m126060l390420k734539k240313j877771j480604j132295r02156
$$ 41228342 37102282 33711862 30977323 28737010 26859239 25378635 24246340 23344184
12727B3344184o72665m04307j62513R2594M00438O73099R70147J407085J881940
$$ 23344184 22671519 22267212 22104699 22197293 22597731 23270830 24240977 25648062 27530002
12718B7530002K415202L075595L766398M505785N169229N478812N037441L572655
$$ 27530002 29945204 33020799 36787197 41292982 46462211 51941023 56978464 60551119
12710F0551119R09581k271826n118961o741480p049762o559674n642370m642605
$$ 60551119 61460700 59188874 54069913 47328433 40278671 33718997 28076627 23434022
12702B3434022l770102l010054k440899j965221j586134j302852j108590r18954
$$ 23434022 19663920 16653866 14212967 12247746 10661612 9358760 8250170 7331216
12694G331216p74615o35327n77352n02533m33099l90395l58991k68812k38038
$$ 7331216 6556601 5921274 5343922 4841389 4408290 4017895 3658904 3390092 3152054
12685C152054k19964k28122j44011j62109j97022r8570m8584m4008q4340o8144
$$ 3152054 2932090 2703968 2559957 2397848 2200826 2102256 2053672 2009664 1925324 1857180
12675A857180l3359o9875n1463l8266o0665o8844n1505m8803l2851J9967j8728
$$ 1857180 1823821 1753946 1702483 1664217 1603552 1534708 1483203 1434400 1401549 1421516 1402788
12664A402788k2469j7704j26089m3118j4180k9974Q818M300l1952p6511j00770
$$ 1402788 1380319 1362615 1236526 1193408 1179228 1149254 1158072 1162372 1130420 1053909 953139
12653I53139o894j0330j1428o7157j5177p790p502m4157p4853l4324N1465j9349
$$ 953139 946245 935915 924487 857330 842153 834363 826861 782704 707851 673527 724992 705643
12641G05643o3578J9302P6923j699m1122m3873m18j8887P158k4895J5702L5129
$$ 705643 642065 661367 738290 736591 695469 651596 651178 632291 639449 614554 630256 665385
12629F65385K4526l2462m4088L3772k0324n0659j5901j786M9182J1316o8032n3432
$$ 665385 689911 657449 613361 647133 626809 576150 560249 558463 607645 618961 550929 497497
12617D97497k1215l0816O5582M6963l1475j7361o1847r152M2709j1458k2675l5837
$$ 497497 476282 445466 511048 558011 526536 509175 447328 438176 480885 469427 446752 410915
12605D10915J2411j1490j9669R36J0304L9959k8457j6637J1638K8588m8621j2248
$$ 410915 423326 411836 392167 393103 403407 443366 414909 398272 409910 438498 389877 377629
12593C77629K4992Q689k6818K1457p415K1695j1011r2530j5842J2013J9834J6185
$$ 377629 402621 411310 384492 405949 398534 420229 409218 316688 300846 312859 332693 348878
12581C48878j9646m122O2021M2807L4012M4554K5572K5525l9116q9254k4900n4011
$$ 348878 329232 325110 387131 429938 463950 508504 534076 559601 520485 431231 406331 352320
12569C52320r92j0088k4175n6695N197K5767l6427m37K3777J3594j9160N0395
$$ 352320 351328 341240 317065 260370 265567 291334 254907 254470 278247 291841 272681 323076
12557C23076R515p8735M18j325L2196j457l0228O358p502J0389m52K2844j2280
$$ 323076 332591 253856 254274 252949 285145 283688 253460 259818 252316 262705 262253 285097 272817
12544B72817m4902k1751K885J7902M125j5947N582M5791N5895n930L9455J16823
$$ 272817 227915 206164 209049 226951 231076 215129 220711 266502 322397 316467 355922 472745
12532D72745Q7845O9560N3321j09911j43662n2874l0396m1539l8729m999k4713
$$ 472745 560590 630150 683471 573560 429898 377024 346628 305089 266360 261361 236648
12521B36648l317J0259o5499J2771K6417O522r856k1678M241m675o242l886M014
$$ 236648 233331 243590 178091 190862 217279 223801 213945 192267 196508 191833 185591 181705 185719
12508A85719J9218m4175j8620M3590m670L335m4704k9231M724L503L7383p254
$$ 185719 204937 160762 142142 185732 181062 184397 139693 110462 115186 118689 156072 148818
12496A48818N872j9864l9395J6309L2474K4876M4973N0623O8980Q909K6764l9543
$$ 148818 154690 134826 95431 111740 144214 169090 214063 264686 333666 342575 369339 329796
12484C29796n7934j02268l2217n2406r198j2080j4753J8905P1467N989q362m027
$$ 329796 271862 169594 137377 84971 75773 63693 48940 67845 139312 145301 136939 132912
12472A32912j7782k0603k5353j418J6034K5430N4742n6562k0215l3257k1390M6844
$$ 132912 115130 94527 69174 67756 83790 109220 163962 107400 87185 53928 32538 79382
12460G9382Q760m3188j3297M8501k1502o2773k4567n936M5972L3536O8884K2849
$$ 79382 88142 44954 31657 80158 58656 -4117 -28684 -34620 11352 44888 113772 136621
12448A36621J2146R51j5819q089K1215m0400l4418k6513j5872k4083K3001K3883
$$ 136621 148767 149718 133899 125810 147025 106625 72207 45694 29822 5739 28740 52623
12436E2623P187J2019P142l9001k6779L6447Q077K8693o341o850j7732J1526l4923
$$ 52623 59810 71829 78971 39970 13191 49638 57715 86408 80067 73217 55485 67011 32088
12423C2088J5364K2011J7173j9122J0395O4849M8605k0663m4219k4888m197k082
$$ 32088 47452 69463 86636 67514 77909 142758 191363 170700 126481 101593 97396 95314
12411I5314J7729r576o710L9951L265n2455l4194j2184M034O4353l0420q000j5221
$$ 95314 113043 103467 96757 136708 139973 87518 53324 41140 45174 109527 79107 71107 55886
12398E5886l0123j5801R260N3676J5462M122O0460O738m8975J3228n3952k9000
$$ 55886 25763 9962 19222 72898 88360 92482 152942 159680 110705 123933 69981 40981
12386D0981K9187J1482m6276J8446K0781L0075L444J7087M5546l505j0173K2097
$$ 40981 70168 81650 35374 53820 74601 104676 108120 125207 170753 167248 157075 179172
12374A79172P661M0331M7854P2885J144j3713K7387L5551L8616r4123m7897p06
$$ 179172 186833 227164 275018 347903 349047 335334 362721 398272 436888 342765 294868 294162
12362B94162j1426o3895l1568R692J1310k3303M849k6254k1216j8755Q807j1120
$$ 294162 282736 218841 187273 196965 208275 184972 189821 163567 142351 123596 132403 121283
12350A21283O239K3465o944k8506P26J9422K8666J9445M1842M8133K9087j1615
$$ 121283 127522 150987 144043 115537 116263 135685 164351 183796 225638 273771 302858 291243
12338B91243O0173M3413J9121L6854O0696O8965N5839K9316L7504O3661L7491
$$ 291243 351416 394829 413950 450804 511500 580465 636304 665620 703124 766785 804276
12327H04276l269l9936n8190l8857r4450p5167l8862k6628n8252O653j7880m9089
$$ 804276 801007 761071 702881 664024 569574 494407 455545 428917 370665 377318 359438 310349
12315C10349l2254n1342K1702K3252P092l7736N576J3015J5832K6779k477p0551
$$ 310349 278095 226753 248455 271707 278799 241063 246639 259654 275486 302265 299788 229237
12303B29237l4315Q4299Q4393J16519Q0629N4650R7724J08438J8093k602m1105
$$ 229237 194922 279221 363614 480133 560762 615412 713136 821574 839667 837065 795960
12292G95960k6593j8356L138j9355j0308k3156k2518m5763q9327l9817j7763n4647
$$ 795960 769367 751011 754149 734794 724486 701330 678812 633049 543722 503905 486142 431495
12280D31495p3043p4904l3546K5707K3272k4028k0244j7558m2721j7034L091J1358
$$ 431495 358452 283548 250002 275709 298981 274953 254709 237151 194430 177396 180487 191845
12268A91845j6250m6845K3290L2066K0101r03j1971j7397K0987Q9490O0177J0966
$$ 191845 175595 128750 152040 184106 204207 203304 191333 173936 194923 284413 344590 355556
12256C55556R295J6287L962m112j588k6998J389m8591m2104m4746l7806j2018
$$ 355556 364851 381138 385100 380988 379400 352402 353791 305200 263096 218350 180544 168526
12244A68526n0398l4654L9447O2222L0390k4510n6701j0867j054k6646l0207k3254
$$ 168526 118128 83474 122921 185143 215533 191023 134322 123455 122401 95755 65548 42294
12232D2294J1049O087J1722l5887O078O1825N377j7646n6991k4237m266m353J4499
$$ 42294 53343 59430 71152 35265 41343 103168 108545 90899 33908 9671 5405 1052 15551
12219A5551j8145P138J8855M0430p411m0219k4792J4996L9926p7J3840L3845j2536
$$ 15551 -2594 4544 23399 63829 56418 16199 -8593 6403 46329 46252 60092 93937 81401
12206H1401k8023k3263k924K5335m516j0744L078N8177j2806m7618l1322K0711
$$ 81401 53378 30115 27191 52526 48010 37266 40344 98521 85715 38097 6775 27486
12194B7486J9609P08j1282K0614r001k9356j2487K4629m197l6968k4834o75K8751
$$ 27486 47095 47803 36521 57135 48134 18778 6291 30920 26723 -10245 -35079 -35754 -7003
12181g003J9024l6450j9921j0357L4819P2852L6961Q896m0386m5141l9618l06
$$ -7003 12021 -24429 -44350 -54707 -19888 52964 89925 98821 58435 13294 -26324 -26630
12169b6630N525L7296O458J7302N2582j5456l2934J0436j7789l1905k0772N401
$$ -26630 -21105 16191 22649 39951 92533 77077 44143 54579 36790 4885 -15887 -10486
12157a0486L5700M203m5791l4773M8590N1815O912j0339k9238p462j8136K8696
$$ -10486 25214 29417 -16374 -51147 -2557 49258 56170 45831 16593 9131 -9005 19691
12145A9691j5800k2620m8089l06M5587K8464j7658j8513R651P328O2211L4238
$$ 19691 3891 -18729 -66818 -67124 -21537 6927 -10731 -29244 -19593 -12265 49946 84184
12133H4184l8575l4096j5846M0815j3901l8879R840M6200L229l6544J7046J4003
$$ 84184 45609 11513 -4333 36482 22581 -16298 -6458 39742 42971 6427 23473 37476
12121C7476Q589l7562M5540j3498m9538m2091J7460J7585L2348k5618J9923l2941
$$ 37476 46065 8503 54043 40545 -8993 -51084 -33624 -16039 16309 -9309 10614 -22327
12109b2327J4029O3394o760k0288O375K2401p053k3764M538j0032K1388P276o633
$$ -22327 -8298 55096 48336 28048 34423 56824 49771 26007 30545 20513 41901 49177 42544
12096D2544n9330m676M4505n322P151k2734j7569J3095k4349L2157R920k4712
$$ 42544 -16786 -21462 23043 17721 24872 2138 -15431 -2336 -26685 5472 15392 -9320
12084i320p479K3559J0516j4616p940j5704k6122r562K3198J9340J6936J0144
$$ -9320 -16799 6760 17276 2660 -5280 -20984 -47106 -56668 -33470 -14130 2806 12950
12072A2950j6638J5194M4619o452L265l813k2312J8275j3799k4328j6872j1811
$$ 12950 -3688 11506 56125 49673 52938 49125 26813 45088 31289 6961 -9911 -21722
12060b1722N1714Q117P132J4143m3585k1667L1752K6170J129J9716l4215J4830
$$ -21722 29992 38109 45241 59384 15799 -5868 25884 52054 53183 72899 38684 53514
12048E3514m248K5548M1662k6873n9027J0656L3659M25j7854o0456p429J2996
$$ 53514 49266 74814 116476 89603 30576 41232 74891 75316 57462 -2994 -10423 2573
12036B573J2880o644L862K4435m1896n2795n5111K4497O5920K240j6635M4609
$$ 2573 15453 8809 12671 37106 -4790 -57585 -112696 -88199 -22279 -20039 -36674 7935
12024G935N7325p2597k4421J6022O7867m320k3218k8342r440P888O622l0008N601
$$ 7935 65260 -7337 -31758 -15736 52131 47811 24593 -3749 -13189 -5301 1321 -28687 -23086
12011b3086K382j0213J6500N362j3196J1171j211m991K8843p4694p856M0706K5516
$$ -23086 -20704 -30917 -14417 -9055 -22251 -11080 -12291 -17282 11561 -63133 -70989 -30283 -4767
11998d767L835l7588L2146j9366j6544K0514M5554m1620O793R485K7449j0779
$$ -4767 -932 -38520 -6374 -25740 -42284 -21770 23784 -17836 -11043 -1558 25891 15112
11986A5112K363J5265K1961k9520o6767k467K3875K9313n2235n557N493L0003
$$ 15112 17475 32740 54701 25181 -41586 -44053 -20178 9135 -43100 -48657 -43164 -13161
11974a3161Q5508k561l9629m9279L46L593Q001J3132J4131j5231n9306P5809J02811
$$ -13161 72347 69786 30157 -19122 -18776 -15183 -7182 5950 20081 4850 -54456 21353 124164
11961A24164q911p8048k9953l2477R88K5348K316r681l4225k3184P1065J0898
$$ 124164 115253 37205 7252 -25225 -24237 1111 3427 -6254 -40479 -63663 7402 18300
11949A8300n286m6114n650J4966J670K8619N2464M1394K3260l0720l5109o9647
$$ 18300 13014 -33100 -38750 -23784 -22114 6505 58969 100363 123623 92903 57794 -11853
11937a1853Q413m502p744j3561K9759K0433q910j8679R747l282n75L3770l0551
$$ -11853 -3440 -7942 -15686 -29247 512 20945 12035 -6644 3103 -179 -754 33016 2465
11924B465J3237J8133l3066n373O666l0935p549J5159l96l412j1961K6572j2026
$$ 2465 15702 33835 769 -4604 2062 -28873 -36422 -21263 -21659 -25071 -37032 -10460 -22486
11911b2486k9793J4744J4783L5179j5211K9981J7653R770J202L1063n2197K3215
$$ -22486 -52279 -37535 -22752 12427 -2784 27197 44850 54620 55822 86885 34688 57903
11899E7903k3874j9730n0036n3414L6683l069L3349k2133j7676K2067M9880m292
$$ 57903 34029 14299 -35737 -89151 -52468 -55537 -22188 -44321 -61997 -39930 9950 5658
11887E658j2690j3267o865j1088k0485K0873L1845j9142k0212j7074M6922L829
$$ 5658 -7032 -20299 -27164 -38252 -58737 -37864 -6019 -25161 -45373 -62447 -15525 -11696
11875a1696l0661l047j8980J1741q840o239k979l3579q081k479m892O2276L3459
$$ -11696 -42357 -45404 -64384 -52643 -61483 -67722 -70701 -104280 -112361 -114840 -119732 -57456 -23997
11862b3997q986Q347k9366j6453m7523j3725P3439Q479K305K9841J5480l8875
$$ -23997 -32983 -24636 -54002 -70455 -117978 -131703 -58264 -49785 -47480 -17639 -2159 -41034
11850d1034Q841r693J9400N60J1317J2570j4816p892j7224K8170K8952K6261l1476
$$ -41034 -32193 -41886 -22486 -21926 -10609 1961 -12855 -20747 -37971 -9801 19151 45412 13936
11837A3936n431k0399j4355J0525P317k948J6940L3860K783m7340m5610N465K5440
$$ 13936 8505 -11894 -26249 -15724 -8407 -11355 5585 39445 42228 -5112 -50722 -45257 -19817
11824a9817L4673l8518K0001O0550k1361Q722L0124j3136r868k4527k1793K3298
$$ -19817 14856 -23662 -3661 56889 35528 44250 74374 61238 51370 26843 5050 28348
11812B8348N341p955L5080r577k1062j5057o425j4347o4360l0355M2799L57j2981
$$ 28348 33689 25734 60814 51237 30175 15118 8693 -5654 -70014 -100369 -57570 -57213 -70194
11799g0194L5956L027m381O9450O201m7503l7055J3234M9645k3987q6298J6592
$$ -70194 -34238 -31211 -35592 33858 40059 -7444 -44499 -31265 18380 -5607 -91905 -75313
11787g5313N4981L7981M432m0302M850J5995l0571j5502L2710j934m3283o059
$$ -75313 -20332 17649 22081 -18221 -13371 2624 -27947 -43449 -10739 -12673 -55956 -62015
11775f2015O3480M6993n4741J5620M193L9510L7434j3352k1040J614p329l8559
$$ -62015 1465 48458 -6283 9337 13530 53040 90474 77122 56082 57696 50367 11808
11763A1808k5449K121K9225Q133l7541J6894j9177M1568J5428p9233k9984L6654
$$ 11808 -13641 -11520 17705 25838 -11703 5191 -13986 27582 43010 -36223 -66207 -29553
11751b9553J4484m0830k6787k0522N094M6176N06L084k4450k874L6455M915r03
$$ -29553 -15069 -55899 -82686 -103208 -98114 -51938 -51432 -48348 -72798 -75672 -39217 -34302 -35205
11738c5205j2174k509j134K1262j0570J4346J1577M6990l044K2729P45R832m8155
$$ -35205 -47379 -49888 -51022 -29760 -40330 -25984 -14407 32583 29539 52268 53013 62845 14690
11725A4690m5369k2039M5617N3013O285L3257L0070n563o5304J673k448m5394
$$ 14690 -30679 -52718 -7101 45912 52197 85454 115524 109961 44657 46330 43882 -1512
11713a512j1837j6957k1997M128k7330k8253j0188l6404k4207L3470R9160K3456
$$ -1512 -13349 -30306 -52303 -48175 -75505 -103758 -113946 -150350 -174557 -141087 -41927 -18471
11701a8471m6059k8188J1164m1502O053L8867J3127N506L5573N8425J0676k3014
$$ -18471 -64530 -92718 -81554 -123056 -117003 -78136 -65009 -59503 -23930 34495 45171 22157
11689B2157m6140L0205Q7565M4473J05373J39107J09763J09069J18585R4588Q8645
$$ 22157 -23983 6222 93787 138260 243633 382740 492503 601572 720157 814745 903390
11678I03390o030j04613j35831j04845j07562j40367j13292o6419k252r517j1520
$$ 903390 897360 792747 656916 552071 444509 304142 190850 124431 122179 112662 101142
11667A01142m182J9046l5774m8897j3638j4826j2505J6909p136P874R416M3599
$$ 101142 96960 116006 80232 31335 17697 2871 -9634 7275 139 8013 17429 61028
11655F1028N1074j6710k8912O9239R9125J8941m9165L3021P6803L1633J14870
$$ 61028 112102 95392 66480 135719 234844 253785 204620 237641 314444 346077 460947
11644D60947J64231J95887J56966K10693J67407R5874j6338q8158p3745j08638
$$ 460947 625178 821065 978031 1188724 1356131 1452005 1435667 1347509 1273764 1165126
11634A165126j78427k47734j76908j60612q5251o471q2741l0332l7768o9816j368
$$ 1165126 986699 738965 562057 401445 316194 309723 226982 196650 158882 89066 87698
11623H7698J6718j7732j1790K7824o700j3928N2559p429p90L1375J2004j2444
$$ 87698 104416 86684 74894 102718 96018 82090 134649 127220 126430 157805 169809 157365
11611A57365K6035M0036j5701O124P1365L0841N9928K2093N4155R4348R8364L1209
$$ 157365 183400 223436 207735 213859 285224 316065 375993 398086 452241 546589 644953 676162
11599F76162J3159N2190j038n0267r2495r2143n1402p9921r7156p8756m9282j2818
$$ 676162 689321 741511 740473 690206 597711 505568 454166 374245 277089 198333 149051 136233
11587A36233J4336p182K0560l9128l2840N5392P974O706m0263n0950J5099K2034
$$ 136233 150569 143387 163947 124819 91979 147371 155345 162051 121788 70838 85937 107971
11575A07971j0210L1091K4935k2304J1260r741K7396L7486L5009J3894J0396M4719
$$ 107971 97761 128852 153787 131483 142743 133002 160398 197884 232893 246787 257183 301902
11563C01902M0211J8733k5016l0033L0200m4771o5303p1315k6028j6100k165j4516
$$ 301902 342113 360846 335830 305797 335997 291226 225923 154608 128580 112480 110315 95799
11551I5799m953j1795N411l4133K1312K2078m4867m3045L0438M2466M9219Q869
$$ 95799 90846 79051 84462 50329 71641 93719 48852 5807 36245 78711 127930 136799
11539A36799k1333m2707M0608M0590r637j2285M281O3280O0782l6083k0383O856
$$ 136799 115466 72759 113367 153957 144320 132035 136316 199596 260378 224295 203912 210768
11527B10768J9651k0135m835j8558o825R13k0647j7779N823n19r553M706O4581
$$ 210768 230419 210284 205449 186891 180066 180979 160332 142553 148376 147857 138304 143010 207591
11514B07591j3767l5270m6884k2596J125r53n631l0556k2652K1313N9066P1847
$$ 207591 193824 158554 111670 89074 90199 89246 83615 53059 30407 51720 110786 182633
11502A82633m366k3865j4737J553l6169l1037L1376M0451M2112M9783K5771J0857
$$ 182633 178267 154402 139665 141218 105049 74012 105388 145839 187951 237734 263505 274362
11490B74362j8959q2451O614L4288K1832j172j02176m187L0948J9479J8934L655
$$ 274362 255403 172952 179566 213854 235686 234514 132338 128151 159099 178578 197512 201167
11478B01167k811m5413l4701Q3373P9616P0814J57079J72040J90154J78387J90711
$$ 201167 198356 152943 118242 201615 281231 352045 509124 681164 871318 1049705 1240416
11467A240416J45281J07699L1197l2539n7820j21212j92333j92645k01489j40389
$$ 1240416 1385697 1493396 1524593 1492054 1434234 1313022 1120689 928044 726555 586166
11457E86166o0572o8972p2885N08m4786q682l031l4619J3533K953j3062p406k3358
$$ 586166 525594 456622 383737 384245 339459 330777 327746 293127 306660 309613 296551 289145 265787
11444B65787k5579l5120r932O174j2877j4406l7226P0293O1868K4432Q0522M5079
$$ 265787 240208 205088 195156 201330 188453 174047 136821 207114 268982 293414 373936 419015
11432D19015O3383J70429K84893K91724L21861L84111M01284L44546K22074J22603
$$ 419015 482398 652827 937720 1229444 1551305 1935416 2336700 2681246 2903320 3025923
11422C025923n214p6123j89918k84446m17845l65907l33916l23719k19270j55593
$$ 3025923 3020709 2944586 2754668 2470222 2052377 1686470 1352554 1028835 809565 653972
11412F53972n2703j0177k4099J1672k8564m4418q343k6558m691L5218l3204q3030
$$ 653972 601269 591092 566993 578665 550101 505683 497340 470782 466091 501309 468105 385075
11400C85075m5540o5742l2683J8605N439j2873K2255K0936K7118J5787N8317O8460
$$ 385075 339535 273793 241110 259715 265154 252281 274536 295472 322590 338377 396694 465154
11388D65154R5962J59635J85130J95970J62417J27381J27299O9355j4641l5734
$$ 465154 561116 720751 905881 1101851 1264268 1391649 1518948 1588303 1573662 1537928
11378A537928q6175j02316j74041j51879j48508j17431j12717p3096l4736J6316
$$ 1537928 1451753 1349437 1175396 1023517 875009 757578 644861 571765 537029 553345
11368E53345l3367n095L979k3422m9723j5909J8790K095j6430K714p635r054k8135
$$ 553345 519978 514883 518862 495440 445717 429808 448598 450693 434263 436977 429342 420288 392153
11355C92153q1610m260p680N3147L5763j5395N556J3244j4320K764M7865P5586
$$ 392153 310543 306283 298603 351750 387513 372118 377674 390918 376598 379362 427227 502813
11343E02813k2957N27N022J9581J0972l1798k5477k3944K0864K4723k2288L9079
$$ 502813 479856 480383 485405 504986 515958 484160 458683 434739 455603 480326 458038 497117
11331D97117J7305J873M9976L2171P5156L4946K8383R0362O8287K8032l6161J8420
$$ 497117 514422 516295 566271 598442 673598 708544 736927 827289 895576 923608 887447 905867
11319I05867L4734j5660N0667L3863K1546r599L3834P9944R6362R9370N8171J26631
$$ 905867 940601 924941 975608 1009471 1031017 1021418 1055252 1135196 1231558 1330928 1389099 1515730
11307A515730J30406J19475J60419J71216K61591K78657L78973M69273N69946
$$ 1515730 1646136 1765611 1926030 2097246 2358837 2637494 3016467 3485740 4055686
11298D055686O90675P52702P78379P75701P25448O98706P82959R16476J191431
$$ 4055686 4746361 5499063 6277442 7053143 7778591 8477297 9260256 10176732 11368163
11289A1368163J745537K688138M044749O178938R349647J3513510J7326975J9779850
$$ 11368163 13113700 15801838 19846587 26025525 35375172 48888682 66215657 85995507
11281H5995507K0405328J8949755J5201737R019136O60244p749864j4208693j8082570
$$ 85995507 106400835 125350590 140552327 149571463 150231707 142481843 128273150 110190580
11273A10190580j9613115j9193951j6972735j3268376r387179o321616m120525
$$ 110190580 90577465 71383514 54410779 41142403 31755224 25433608 21313083
11266B1313083k661013j678624j006206n31605j94273J25751K14110L43328M61707
$$ 21313083 18652070 16973446 15967240 15435635 15241362 15367113 15581223 15924551 16386258
11257A6386258M50578M65275N30526N55724N50195O22783R00305J376498K108399
$$ 16386258 16836836 17302111 17832637 18388361 18938556 19561339 20461644 21838142 23946541
11248B3946541L300017N139449Q111446J2708802J9543569K7787120L4577001
$$ 23946541 27246558 32386007 40497453 53206255 72749824 100536944 135113945
11241A35113945L8613670L8843162L4944488K6422254J3016693l926096j9147630
$$ 135113945 173727615 212570777 247515265 273937519 286954212 283028116 263880486
11234B63880486l0145407l6473611l8164517l6301083l1040622k3441474j6152219
$$ 263880486 233735079 197261468 159096951 122795868 91755246 68313772 52161553
11227E2161553j0753553p146175m783454l155986k039119j340914q84790o43040
$$ 52161553 41408000 34261825 29478371 26322385 24283266 22942352 22057562 21414522
11219B1414522n31350m14768n22915r51082j216955j077241q44593n90377m05275
$$ 21414522 20883172 20468404 19945489 18994407 17777452 16700211 15855618 15265241 14859966
11210A4859966j01253L30380Q91216J596306K594142M182472O483715R816583
$$ 14859966 14758713 15089093 15980309 17576615 20170757 24353229 30836944 40653527
11202D0653527J3590600J6553189J8095932J7755445J5378508J0958920M337340
$$ 40653527 54244127 70797316 88893248 106648693 122027201 132986121 137323461
11195A37323461l598320j0514056j5219556j7664013j8096298j6731959j4013615
$$ 137323461 133725141 123211085 107991529 90327516 72231218 55499259 41485644
11188D1485644j0454090p122231m774333l214075k182237j514026j094448p94834
$$ 41485644 31031554 23909323 19134990 15920915 13738678 12224652 11130204 10335370
11180A0335370o73352n96136n82277o81429p45094p31235o93662o68610o15144
$$ 10335370 9662018 9065882 8483605 7802176 7057082 6325847 5632185 4963575 4348431
11171D348431m80119m12457l18008k49051j71422j63530j66096j36045r6642q9445
$$ 4348431 3868312 3455855 3137847 2888796 2717374 2553844 2387748 2251703 2155061 2065616
11161B065616o7674n9737o0041k0924l7735p5570m9766o4034n5640m22K6703o2013
$$ 2065616 1997942 1938205 1878164 1857240 1819505 1743935 1694169 1630135 1574495 1574073 1600776 1538763
11149A538763J4515k8846o0235p3313l2018j00349p9317m9111k0436l2556l0446
$$ 1538763 1553278 1524432 1464197 1390884 1358866 1258517 1179200 1130089 1109653 1077097 1046651
11138A046651m9591j2673N5994J7998p0605n3399l1186l7743l4731q588R798L6279
$$ 1046651 997060 984387 1040381 1058379 987774 934375 903189 865446 830715 822127 831925 868204
11126H68204m8997l4761J9444L2435j9239p8575L352J4556j7762O7182L4841j6602
$$ 868204 819207 784446 803890 836325 817086 738511 741863 756419 738657 805839 840680 824078
11114H24078K8715M4764j566l2618q4352k3485L2316m5099m6400l6153l3384n2612
$$ 824078 852793 897557 895991 863373 779021 755536 787852 742753 696353 660200 626816 574204
11102E74204l4387j9271L4495N6064L7925l0658J6345P466M747K8425Q458k8171
$$ 574204 539817 520546 555041 611105 649030 618372 634717 642183 646930 675355 683813 655642
11090F55642k9580k9457n397L169m3404j5186O8243P635m5631j7812L5385q706
$$ 655642 626062 596605 591208 594377 550973 535787 604030 611665 566034 548222 583607 574901
11078E74901k5727M4798m072n8565L2281N8238O5850J6357l4527l3108J9061j540
$$ 574901 549174 593972 589900 531335 563616 621854 687704 704061 669534 636426 655487 653947
11066F53947J195j0028k5119r1921o8444p3999k8612M8549J3155J9338J9080J7323
$$ 653947 655142 645114 619995 528074 459630 385631 357019 405568 418723 438061 457141 474464
11054D74464j5775K017J2001k2479l2821K7520N2935N7634l4278k9285j8060J2720
$$ 474464 458689 460706 472707 450228 417407 444927 497862 555496 521218 491933 473873 486593
11042D86593K4319o7038r977P8887J2531n1468p3695m4340r363L5718K4363m856
$$ 486593 510912 443874 433897 512784 525315 473847 400152 355812 346449 382167 406530 401674
11030D01674L2958J0285j6744O222o7735o5867o0963j0533k0714l2998p83K5547
$$ 401674 434632 444917 428173 434395 366660 300793 239830 229297 208583 175585 174802 200349
11018B00349l1155K8334L5610j1314J168N2034n976j3435m4071J2070M7841K2900
$$ 200349 169194 197528 233138 221824 222992 275026 269050 255615 211544 223614 271455 294355
11006B94355l9987O2614M062n21j2765p8691m2776M956L8169n0404j6525j0783
$$ 294355 254368 316982 321044 320523 307758 229067 186291 191247 229416 179012 162487 151704
10994A51704M1681K8282K9217l8515p0243p378M5038j4047k9876J9997J8456m6448
$$ 151704 193385 221667 250884 212369 142126 134748 179786 165739 135863 155860 174316 127868
10982A27868n2706J9128L2838M9520j7164r349q992K7787J3797J9605L4598r951
$$ 127868 75162 94290 127128 176648 159484 150135 141143 168930 182727 202332 236930 226979
10970B26979m3109j547n135j727K3468L877K7727l4255m5928k3100j3141k0223
$$ 226979 183870 182323 177188 175461 198929 202806 230533 196278 150350 127250 114109 93886
10958I3886J0055J5501L2565j0626m2300l7306j1385l1444k7965J7726n497L3820
$$ 93886 103941 119442 152007 141381 99081 61775 50390 18946 -9019 8707 3210 37030
10946C7030o194N6782K0970l2470L2793K777K3131K8196l6067L3890L4305k5234
$$ 37030 30836 87618 108588 76118 108911 111688 134819 163015 126948 160838 195143 169909
10934A69909j4778m214m0948J6291J6607K1813l9327m8641l3688J3007L2608K0031
$$ 169909 155131 150917 109969 126260 142867 164680 125353 76712 43024 56031 88639 108670
10922A08670l59q068l0013J2942K7909j6693j6730J2848L6016J1563m7349j576
$$ 108670 108311 100243 70230 83172 111081 94388 77658 90506 126522 138085 90736 89160
10910H9160L9209o826k5679l9544l6868Q853J5417j629L4204M9171M654l1288
$$ 89160 128369 121543 95864 56320 19452 28305 43722 42093 76297 125468 130122 98834
10898I8834R933j6168l4888M3230M5052l881j2562O815M99j9481K1848k1535k2430
$$ 98834 108767 92599 57711 100941 145993 142112 129550 136365 136864 117383 139231 117696 95266
10885I5266J7386L1270k4516J003K3297J1204P352O8561J19955J27515J08513
$$ 95266 112652 143922 119406 120409 143706 154910 162262 230823 350778 478293 586806
10874E86806P3121Q0792P0143O5112J84m6122o2567o0767j36297r9764j04776
$$ 586806 659927 740719 810862 875974 876158 830036 767469 706702 570405 470641 365865
10863C65865p8704l2729m2045k9076J233P546q952L960j3588M008J437n734M1741
$$ 365865 287161 254432 212387 183311 184544 192090 183138 187098 173510 177518 178955 173221 214962
10850B14962M305l605K8920K7738n7741j0450K2884j1824J204n467K7359N5729
$$ 214962 219267 215662 244582 272320 214579 204129 227013 215189 216393 210926 238285 294014
10838B94014Q6692R3995Q4905J76952J91883K03013J58914J45343J14266o54j26386
$$ 294014 380706 474701 559606 736558 928441 1131454 1290368 1435711 1549977 1549323 1422937
10827A422937j64792j03538j74220k15710j63343j39320o6103o3365k9781q523
$$ 1422937 1258145 1154607 980387 764677 601334 462014 395911 332546 302765 294242
10817B94242j2191j5913Q911M8416R904m6068q3440N077J4017j0854N2074j1090
$$ 294242 282051 266138 275049 323465 333369 287301 203861 208938 222955 212101 264175 253085
10805B53085k8680k4404n2055k1629n418J6041N5105J1894L6142L1961P23R7581
$$ 253085 224405 200001 147946 126317 120899 136940 192045 203939 240081 272042 272765 370346
10793C70346J40102Q1522J9483M4894J02503m4524j02430n7290m9143l7093k5948
$$ 370346 510448 591970 611453 656347 758850 714326 611896 554606 505463 468370 442422
10782D42422q3278o7982m4684M4866N956m2250l7283j0890o973j3203L035J131
$$ 442422 359144 291162 246478 291344 297300 255050 217767 206877 199904 186701 189736 190867
10770A90867R666m7379l3815k3439j9843j1491M2793L930J7389m4376n9121L233
$$ 190867 200533 153154 119339 95900 76057 64566 107359 111289 128678 84302 25181 28414
10758B8414J4521J928J816J6282J6799M5911J6800O396K0856L691o783l2335J5206
$$ 28414 42935 44863 46679 62961 79760 125671 142471 148867 169723 173414 166631 134296 149502
10745A49502K5193q1755j12212K7067Q522J5044N6573O0421J2803J2773j3400
$$ 149502 174695 92940 -19272 7795 16317 31361 87934 148355 161158 173931 160531
10734A60531k5474K3953N5962P4263O6652J19095K66714J52560k36985k35166
$$ 160531 135057 159010 214972 289235 355887 474982 741696 894256 657271 422105
10724D22105j42754p9382r1666j1195j2222o138l5821M5324N2293J9594k3231
$$ 422105 279351 199969 108303 97108 84886 78748 42927 88251 140544 160138 136907
10713A36907l3412k7870K5939J9816l1378M938J9241k4211k5445j1693j5532n850
$$ 136907 103495 75625 101564 121380 90002 94940 114181 89970 64525 52832 37300 31450
10701C1450k9102M8045L2174l173J8608l4323l0925J7391k9149k8147J7886L1705
$$ 31450 2348 50393 82567 79394 98002 63679 32754 50145 20996 -7151 10735 42440
10689D2440k259j1683K0665q307K0167J6316R485R484L178L1267J902k3573m3940
$$ 42440 40181 28498 49163 40856 61023 77339 86824 96308 99486 130753 132655 109082 65142
10676F5142j0805J5992K4102j1604j1979p7447j0581N646P8483K4944m2323J593
$$ 65142 54337 70329 94431 82827 70848 -6599 -17180 -11534 66949 91893 49570 51163
10664E1163j919N0792J6321j6804o416l2833p2864m4829J134M4238J0793q210
$$ 51163 49244 100036 116357 99553 93137 60304 -12560 -57389 -56255 -12017 -1224 -9434
10652i434k1473K1190J7299q730J4170L2511K4905L6264L7724o2692n6888l5792
$$ -9434 -30907 -9717 7582 -1148 13022 45533 70438 106702 144426 81734 24846 -10946
10640a0946j5256M4425J2900p612k9363j8774Q366L8975M3982n96j0533j4970
$$ -10946 -26202 18223 31123 23511 -5852 -24626 -16260 22715 66697 66101 55568 40598
10628D0598N492j4926j332p927k3047J7700L1851O676l428j5786p805R301K514
$$ 40598 46090 31164 29832 21905 -1142 16558 48409 55085 51657 35871 28066 37367 39881
10615C9881n3963j0180J4311K8786l9089k5811N5735K9266j0412l0874k0680N4628
$$ 39881 -14082 -24262 -9951 18835 -20254 -46065 9670 38936 28524 -2350 -23030 31598
10603C1598K9800r621K299j4140o259r5M032J5905N437K873k4977N625K306k2327
$$ 31598 61398 51777 54076 39936 33677 33582 37614 53519 58956 61829 36852 42477 44783 22456
10589B2456j2972l033R957k1008m656L4877M9594j7437j5421p90q745L475l181
$$ 22456 9484 6451 16408 -4600 -9256 25621 75215 57778 42357 41567 32822 36297 33116
10576C3116K4415J1532j5535j1830K5431k1384p976q61O903j2590L565p404J2298
$$ 33116 57531 69063 53528 41698 67129 45745 37769 36908 43811 31221 34786 27382 39680
10563C9680K2091J8982l7985O492l337m676O968j6297n2705j001N1201J7225J2355
$$ 39680 61771 80753 42768 49260 45923 41247 48215 31918 -20787 -21788 29413 46638 58993
10550E8993l3839j3843L2300N6170j5087m2690r217K325l6484l8282L4779K2341
$$ 58993 25154 11311 43611 99781 84694 42004 32787 35112 -1372 -39654 -4875 17466
10538A7466O383L1983K7199n7099k9978p397L327p939N2041P1600R596k2343P924
$$ 17466 23849 55832 83031 25932 -4046 -11443 -8116 -16055 35986 107586 117182 94839 102763
10525A02763l242k5038J0742M9308o9404n2568M604O6073M1475K6841J9993Q6777
$$ 102763 99521 74483 85225 134533 65129 12561 17165 83238 124713 151554 171547 258324
10513B58324P6586q6254j39291o9461Q430l579n8005r329j23j4056K4289J4485
$$ 258324 334910 248656 109365 39904 48334 44755 -13250 -22579 -22702 -36758 -12469 2016
10501B016J7622j6468M832K3110J5034K331n6715j7652J2734J2076L9916j504
$$ 2016 19638 3170 8002 31112 46146 48477 -8238 -25890 -13156 -1080 38836 37332
10489C7332N201L6280P803n3489M462K4276j8743m180M712k1047l5733J08k5507
$$ 37332 42533 78813 86616 33127 37589 61865 43122 38942 43654 22607 -13126 -13018 -38525
10476c8525k4261J8230k313P234O3046L0318l426k1495k5080K1989P989l1762
$$ -38525 -62786 -44556 -46869 -39635 23411 53729 50303 28808 3728 25717 33706 1944
10464A944j6529k908m602K5808O5901M4115n8729r5219K3070K3520J9758m605
$$ 1944 -14585 -17493 -22095 3713 69614 113729 55000 -40219 -17149 6371 26129 21524
10452B1524J5133M075l0632o2560P5J9098L1815p208n347j4880J2845K6560J1098
$$ 21524 36657 40732 10100 -52460 -52385 -33287 -1472 -8680 -14027 -28907 -16062 10498 21596
10439B1596k5839K4497K4291k1756J2222K1845m2932L145O711l5729k6152q210
$$ 21596 -4243 20254 44545 22789 35011 56856 13924 17069 23780 -11949 -38101 -46311
10427d6311N2568K5767k592k6586K6113J1333l446K2093J099p5102M097J1180
$$ -46311 6257 32024 29432 2846 28959 40292 36846 58939 60038 -15064 -10967 213
10415B13l0288k6578J8913L8451N4687M071j6562J5067m637m1504l2030L7668
$$ 213 -30075 -56653 -37740 711 55398 59469 42907 57974 53337 11833 -20197 17471
10403A7471J0257K007J2865k9308j4913k2320j1586J0957O5748l5959j171J5500
$$ 17471 27728 29735 42600 13292 -1621 -23941 -35527 -24570 41178 5219 4048 19548
10391A9548l0234L6179L3867k1181K582j6240K5566n590m4553j45n121m1883L7805
$$ 19548 -10686 25493 59360 38179 40761 24521 50087 44497 -56 -201 -5322 -47205 -9400
10378i400J01052J7497j7084J2918n2361k5280k8941j0364k2597M3124L1375o0379
$$ -9400 91652 109149 92065 104983 52622 27342 -1599 -11963 -34560 8564 39939 -20440
10366b0440n7162P4653P8040k472m9595j5846m4514j8805m1141k66M4428K7558
$$ -20440 -77602 -2949 75091 72619 23024 7178 -37336 -56141 -97282 -97548 -53120 -25562
10354b5562j2657l5795O879N950j8910j4258R863Q35M4303J7459l5489K1255L0785
$$ -25562 -38219 -74014 -67135 -61185 -80095 -94353 -84490 -83655 -39352 -21893 -57382 -36127 -5342
10341e342L2233J4408l3589j9382N2220K0683l3828p5688j0654K9938Q6551l3063
$$ -5342 26891 41299 7710 -11672 40548 61231 27403 -48285 -58939 -29001 57550 24487
10329B4487l6455O354K7928o18J9438j0075j8998k2696P067j3290l26J7107l7426
$$ 24487 -11968 -5614 22314 21696 41134 31059 12061 -10635 -3568 -16858 -17184 -77 -37503
10316c7503j1808O0121O163k7657j2788k2510L6774M2149k6050o828j2570l8266
$$ -37503 -49311 10810 16973 -10684 -23472 -45982 -9208 32941 6891 63 -12507 -50773
10304e0773M1356M7875m6001N904j1738K9466J359J7724n968L4377r969k4020
$$ -50773 -9417 38458 -7543 -1639 -13377 16089 17448 35172 29204 63581 53612 29592
10292B9592p6360l4076K2459K3615K7058j6773L0030K8901j4408j986M15L4560
$$ 29592 -46768 -80844 -58385 -34770 -7712 -24485 5545 34446 20038 18052 18467 53027
10280E3027l8900m8507K5852N0426j5033J294q825l5882O764K7297K2086J4263
$$ 53027 14127 -34380 -8528 41898 26865 28159 19334 -16548 -9784 17513 39599 53862
10268E3862r231o325J7505M048j0874m7272R769L559N4804M2690l0366k1381o0402
$$ 53862 44631 38306 55811 59859 48985 1713 11482 15041 69845 112535 82169 60788 386
10255C86k1998p561N4244N5402J8973J3393l6315l4577m1000m606K5458J1457
$$ 386 -21612 -29173 25071 80473 99446 112839 76524 41947 947 -3659 21799 33256
10243C3256j7299J5309K5518L7261J2713m9377j1034P0545P2140k3890n5553l7675
$$ 33256 15957 31266 56784 94045 106758 57381 46347 116892 189032 165142 109589 71914
10231G1914n7509k8072O6652O2563j0464m8713m470L2293l0610o3163N75k874
$$ 71914 14405 -13667 52985 115548 105084 56371 51901 84194 53584 -9579 -9004 -11878
10219a1878l9135K4475K8760l0325O846O0234L6213j4490l7823J9762l9431R503
$$ -11878 -51013 -26538 2222 -28103 -21257 38977 75190 60700 22877 42639 3208 12711
10207A2711K5731J2557l191l6456m9950m8009q067L7662L0336J580L6321J2675
$$ 12711 38442 50999 47808 11352 -38598 -86607 -94674 -57012 -26676 -25096 11225 23900
10195B3900N2181L2410o5278j6896l7502l9888l6939m598K814J7207K4151O1159
$$ 23900 76081 108491 43213 26317 -11185 -51073 -88012 -92610 -89796 -72589 -48438 12721
10183A2721k544l1157R223L7192m2004n4705J7370K0717o760J590M6996N5669
$$ 12721 10177 -20980 -11757 25435 -16569 -71274 -53904 -33187 -39947 -38357 8639 64308
10171F4308l6450m945J4028J531k6220l6533k6545j49k3501M1928l7700L3282
$$ 64308 27858 22913 36941 38472 12252 -24281 -50826 -50975 -74476 -32548 -70248 -36966
10159c6966N192o415O9461O13p7319O618L7073J808J9099J1347M956N856K4392
$$ -36966 -31774 -38189 31272 31885 -45434 -38816 -1743 65 19164 30511 35467 41323 65715
10146F5715k668m5968l8323m2409j2057R6832J5266j4532L5468P019k2097M992
$$ 65715 63047 17079 -21244 -63653 -75710 21122 36388 21856 57324 64343 42246 47238
10134D7238L773M4220n6245m4272k8592L3148M8452J565K88m5241l3968L6904
$$ 47238 51011 95231 38986 -5286 -33878 -730 47722 49287 49575 4334 -29634 7270
10122G270J6026n4921P363L2823j4619j4642j8568m5202P5052K6597l1708L2228
$$ 7270 23296 -31625 -24262 8561 -6058 -20700 -39268 -84470 -9418 17179 -14529 17699
10110A7699k8457m5747l8727L6062L6350j1361J1713N2136J4221O489q484R15
$$ 17699 -10758 -56505 -95232 -59170 -22820 -34181 -22468 29668 43889 50378 41894 42809
10098D2809k1285L7928L324l7354J5867J3875n7028P601K4423l7993k4903r211
$$ 42809 21524 59452 62776 25422 41289 55164 -1864 5737 30160 -7833 -32736 -41947
10086d1947J612J5554K4977J6448K2920j7476J6023j6528p2573J4873O294J7810
$$ -41947 -40335 -24781 196 16644 39564 22088 38111 21583 -50990 -36117 -29823 -12013
10074a2013N7552R254k1927l1864L5097j6677k9143L0804Q065o2633j415K5604
$$ -12013 45539 54793 32866 1002 36099 19422 -9721 21083 29148 -33485 -34900 -9296
10062i296N2838M355k2128j2180N339J7120O5679L1491O740K9425O343j6067j0063
$$ -9296 43542 47897 25769 13589 18928 36048 101727 133218 139958 169383 175726 159659 149596
10049A49596P142O2908P376O3998J39102J35176J58785K66245M05546P60249J450332
$$ 149596 156738 219646 227022 291020 430122 565298 724083 990328 1395874 2156123 3606455
10038C606455K666708K666122j560547k816533j758381r46827n77059l87511k33231
$$ 3606455 6273163 8939285 7378738 4562205 2803824 1856997 1279938 892427 659196
10029F59196r9809r9466r6328m3035n9367n6982m0061k7124K1153K2136K9113
$$ 659196 559387 459921 363593 320558 261191 204209 164148 137024 158177 180313 209426
10018B09426J5362n9017l5104n100n252L9879o0716l8589k8224j6910N774M945
$$ 209426 224788 165771 130667 125567 120315 160194 99478 60889 32665 15755 21529 26474
10006B6474q381L9556r325J8944K8951K520R048J9008k6917N873J3102N3121P5004
$$ 26474 18093 57649 48324 67268 96219 98739 107787 126795 99878 105751 118853 171974 246978
9993B46978k1658j6588r239l5353n1154k4166K8830r2m5329j4865l2629J1266
$$ 246978 225320 208732 199493 164140 112986 88820 117650 117558 72229 57364 24735 36001
9981C6001K811R757L2319k2574l7808n7155j7634J7675n813M91M328K3830L6154
$$ 36001 38812 48569 80888 58314 20506 -36649 -54283 -36608 -42421 -41930 -37602 -13772 22382
9968B2382L351M873J9947l0075l7360k9215N7132M5690J5861p517P808r046k9881
$$ 22382 25733 30606 50553 20478 -16882 -46097 11035 56725 72586 65069 72877 63831 33950
9955C3950K9862L3652l1907K2307J4325l2489k9468J0204j6816l4257R430M4681
$$ 33950 63812 97464 65557 87864 102189 69700 40232 50436 33620 -637 8793 53474
9943E3474l1207r1903l7545L8240P716L0909J4535L4366l0541m8535p131J3689
$$ 53474 22267 -69636 -107181 -68941 -61225 -30316 -15781 18585 -11956 -60491 -67622 -53933
9931e3933l7151k0663Q2303R3831K7241n084l5186m2072k3379J0441q066o465
$$ -53933 -91084 -111747 -29444 64387 91628 86544 51358 9286 -14093 -3652 -11718 -18183
9919a8183l6501L0730L4036m952l6609M1992L525n1819J273M0943p029J5229K5331
$$ -18183 -54684 -23954 10082 5130 -31479 10513 14038 -37781 -36508 4435 -2594 12635 37966
9906C7966j4996k0345k4272M323J7301m187l1151J4283J5471K8742L9907J0355
$$ 37966 22970 2625 -21647 -17324 -23 -4210 -35361 -21078 -5607 23135 63042 73397
9894G3397p2337k1396k7502j6612N734N1283k1482j180N4470O8320l7308m4640
$$ 73397 1060 -20336 -47838 -64450 -58716 -7433 -28915 -30095 24375 92695 55387 10747
9882A0747m3370j2451l6560R780J7158o651L9209J1228K174N257l2322k6777M0967
$$ 10747 -32623 -45074 -81634 -71854 -54696 -61347 -22138 -10910 -8736 -3479 -35801 -62578 -21611
9869b1611L6390J7878n051L3438N676q5585o2606N1251j561l4630p153N6001O6137
$$ -21611 14779 32657 27606 61044 66720 -18865 -81471 -30220 -31781 -66411 -73564 -17563 48574
9856D8574j3928L3442m2103m0293k5559K1773J0556J5042O2913L4963L1798l6781
$$ 48574 34646 68088 25985 -14308 -39867 -18094 -7538 7504 70417 105380 137178 100397
9844A00397m0278l6032J9866N7126R5548J07735J56562K94028L80600M84077K24116
$$ 100397 60119 24087 43953 101079 196627 304362 460924 754952 1135552 1619629 1843745
9833A843745k31084m70408m16783k57049j64998q0032m9949j8106n0465m0871
$$ 1843745 1612661 1142253 725470 468421 303423 223391 173442 155336 104871 64000
9823F4000m58K020r0074J578L0404l3275L564N0487O6568J1447J8313m6961l7869
$$ 64000 63542 65562 -24512 -22934 7470 -25805 -22241 28246 94814 106261 124574 77613 39744
9810C9744Q054k6039m366L3306L4210n1218r6453L1366L2293k6059L1756L062
$$ 39744 47798 21759 17393 50699 84909 33691 -62762 -31396 897 -25162 6594 9656
9798I656J1360L0406j6938l9535o1002r334J7980j1310m6903l1413M8384J5691
$$ 9656 21016 51422 34484 -5051 -66053 -75387 -57407 -68717 -115620 -147033 -98649 -82958
9786h2958J2630M7439O6509L4524l6714p199N4367k3824p9666j729m6368M918
$$ -82958 -70328 -22889 43620 78144 41430 34231 88598 64774 -14892 -16621 -62989 -58071
9774e8071K3735N755J8126j1034n048l8520o77L169K8672O2490o713N3380n806
$$ -58071 -34336 -28581 -10455 -21489 -26537 -65057 -65734 -62565 -33893 28597 21884 75264 69458
9761F9458l0962J2112n3178Q257L6217p017j3998n8038J401K4392k601J0951l912
$$ 69458 38496 50608 -2570 5687 41904 34887 20889 -37149 -35748 -11356 -13957 -3006 -6918
9748f918j1321J9970O594m5943j0544k6128J0489L915R543J1526m0834k0940m093
$$ -6918 -18239 1731 8325 -37618 -48162 -74290 -63801 -59886 -50343 -38817 -79651 -100591 -104684
9735a04684K5866M460K9767J1393l1266O4870J6387j1975j9217J2388j3419J1527
$$ -104684 -78818 -74358 -44591 -33198 -64464 406 16793 4818 -14399 -2011 -15430 -3903
9723c903K1716J7419J5267J8282N869p5169K2377M149K009k4915J7264m7835k9316
$$ -3903 17813 35232 50499 68781 74650 -519 21858 26007 28016 3101 20365 -27470 -56786
9710e6786L6198K1399K7605M125k1620o3875J4563M4468o514l2349l881l0184
$$ -56786 -20588 811 28416 32541 10921 -52954 -38391 6077 -437 -32786 -36667 -66851
9698f6851J9244N5018o982M280K638k055m0315K2264R2K8999p458L7409M2732
$$ -66851 -47607 7411 429 4709 7347 5292 -35023 -12759 -12667 16332 8874 46283 89015
9685H9015L117l0495j7786m0773K5344J315K1230N775J4179J8681p0663M700k0378
$$ 89015 92132 61637 43851 3078 28422 29737 50967 56742 70921 89602 18939 23639 3261
9672C261k9344P467k4057J2701J924L5535q509k4818j9471q968k2744J9375K5960
$$ 3261 -26083 -18616 -42673 -29972 -28048 7487 -1022 -25840 -45311 -54279 -77023 -57648 -31688
9659c1688J8041j0214l2413P102N573K9583L5445K313O91K0297K2860k9848o5361
$$ -31688 -13647 -23861 -56274 -49172 -43599 -14016 21429 23742 24433 44730 67590 37742 -27619
9646b7619j236M5128K5386j2109q238j0914O047n2453K7868N2276l5489j5132
$$ -27619 -28855 16273 41659 29550 21312 10398 16445 -36008 -8140 44136 8647 -6485
9634f485J9114l0853L378M6583J4971j5884j597m979k9394J34k636l685j0719
$$ -6485 12629 -18224 -14846 31737 46708 30824 29227 24248 -5146 -5012 -7648 -11333 -22052
9621b2052m8416M9265K5895k0111L6189L5832j2075q955j9402n185j0679k1816
$$ -22052 -70468 -21203 4692 -15419 20770 56602 44527 35572 16170 10985 306 -21510
9609b1510j4526L0328K4992J5151j479n687m3051l568K7952L2214k1376j6339
$$ -21510 -36036 -5708 19284 34435 32956 27269 -15782 -19350 8602 40816 19440 3101
9597C101r994o0561K1697K0417N6903J3804m3491o97J6723J4705j6632k2176j2163
$$ 3101 -6893 -67454 -45757 -25340 31563 45367 1876 1179 17902 32607 15975 -6201 -18364
9584a8364O8424j3120j9919l1098L5065O1183J5648l3194k8187m336k9085m4013
$$ -18364 50060 36940 17021 -14077 20988 82171 97819 64625 36438 32102 3017 -40996
9572d0996j4764P3251M9033k5401l0429j2075k8047k3822J5567j772j8365N506
$$ -40996 -55760 17491 66524 41123 10694 -1381 -29428 -53250 -37683 -39455 -57820 -52314
9560e2314L376J7635K3449L6455j4322K4306j1613l7931j0083J3829m8738l8565
$$ -52314 -48938 -31303 -7854 28601 14279 38585 26972 -10959 -21042 -7213 -55951 -94516
9548i4516N6836P0750n2908q3961J6895M9159K6191O157J815K6575j5100R19M0328
$$ -94516 -37680 33070 -19838 -103799 -86904 -37745 -11554 -5397 -3582 22993 7893 8812 49140
9535D9140l1968l0262k9665K1110j5790J6635J8257J7127K2523n1838j2622J1030
$$ 49140 17172 -13090 -42755 -21645 -37435 -20800 -2543 14584 37107 -14731 -27353 -16323
9523a6323N48J6893L2087O142l0535l7840j1208K9287l1341j7097o645k3349k3766
$$ -16323 -15775 1118 33205 39347 8812 -29028 -40236 -10949 -42290 -59387 -66032 -89381 -113147
9510a13147J7766N1555J7919k8392k1180M2754K6362j8143J7110j3414m3529L0819
$$ -113147 -95381 -43826 -25907 -54299 -75479 -32725 -6363 -24506 -7396 -20810 -64339 -33520
9498c3520K5770L3034L0445J0097k6956j358L583k9523n084j4586J3044j0502
$$ -33520 -7750 25284 55729 65826 38870 37512 41095 11572 6488 -8098 4946 -5556
9486e556l7700N9411K6272j4694J7911L7665l8257m3345l657m6253n727M0159
$$ -5556 -43256 16155 42427 27733 45644 83309 45052 1707 -1950 -48203 -53930 -13771
9474a3771J4747o983K2218M6736Q801k1889J586n6040L589m4911l4437J2084N5273
$$ -13771 976 -6007 16211 62947 71748 49859 51445 -4595 -1006 -45917 -80354 -68270 -12997
9461a2997n938k1462J6197L0229j4492Q638Q676L0857M045l9155l5155k8544j8150
$$ -12997 -18935 -40397 -24200 6029 -8463 175 8851 39708 43753 4598 -30557 -59101 -77251
9448g7251Q967k2436j6912N3501R5289K2202o2466j7710k527L2480M2126P020
$$ -77251 -68284 -90720 -107632 -54131 41158 63360 894 -16816 -19343 13137 55263 62283
9436F2283r402K697K5727m357r6634k7342K5992k309O567J1384M6791l1959j6573
$$ 62283 52881 55578 81305 76948 -19686 -47028 -21036 -23345 -16778 -5394 41397 9438 -7135
9423g135K2865K7182K2900n872j1058L5927M874m3583o130L062N2146l6624o5132
$$ -7135 15730 42912 65812 59940 48882 84809 89683 46100 39970 43032 95178 58554 -6578
9410f578L681K6510J0791j7907l5279j4741K1154M7177m7690J3622k767l0031
$$ -6578 -2897 23613 34404 16497 -18782 -33523 -12369 34808 -12882 740 -2027 -32058
9398c2058L2786J0065P836l1864J2415K2253m2401m422K4818J4293O7743j3447
$$ -32058 728 10793 18629 -13235 -820 21433 -20968 -25390 -572 13721 81464 68017
9386F8017J4442Q856J4588j5725j9432L5674O6576k6388n6682j6856n241j5299
$$ 68017 82459 91315 105903 90178 70746 106420 172996 146608 89926 73070 67829 52530
9374E2530j4988J33k3170K1260J9210J7062j9479n7422J2725J9831K5385J3631
$$ 52530 37542 37675 14505 35765 54975 72037 52558 -4864 7861 27692 53077 66708
9362F6708M900O221j1866j4983J9347l1893k2512j8585P450L6336o379J2207L5715
$$ 66708 71608 77829 65963 50980 70327 38434 15922 -2663 4787 41123 34744 46951 82666
9349H2666J4579p0038m7666J2098K0358j8220J4694M0120L6145j5528k2394j2793
$$ 82666 97245 27207 -20459 -8361 11997 -6223 8471 48591 84736 69208 46814 34021
9337C4021J5933K9615j0752k0452k2196l295q780m4183n9488j8289L2621M3639
$$ 34021 49954 79569 68817 48365 26169 22874 14094 -30089 -89577 -107866 -75245 -31606
9325c1606l5319J1100K3499K6030j324K9774K3568p718J7857Q39j4736j7413K9019
$$ -31606 -66925 -55825 -32326 -6296 -7620 22154 45722 38004 55861 56700 41964 24551 53570
9312E3570j3092J2948o0335l4945K0267N3529O768L0740L8859m955k7171m6130
$$ 53570 40478 53426 -6909 -41854 -21587 31942 38710 69450 108309 103354 76183 30053
9300C0053l4427L7328J5221O0746j027K0143j868K6388j4946o561k7087r232K889
$$ 30053 -4374 32954 48175 108921 107894 128037 126169 152557 137611 131050 103963 94731 97620
9287I7620n919L4136n707P060K2743N2855k3870j2393O396N0321M4356j5763k0434
$$ 97620 91701 125837 120130 127190 149933 202788 178918 166525 172921 223242 267598 251835 231401
9274B31401Q3374K1670j6938k3734M8853J8971J362M2092K1968N5861J3765j2047
$$ 231401 314775 336445 319507 295773 344626 363597 364959 407051 429019 484880 498645 486598
9262D86598L5127O1306M2151O4260N6985K5647K4656P4559P7206J01003J39170
$$ 486598 521725 583031 625182 689442 746427 772074 796730 871289 948495 1049498 1188668
9251A188668J28152J45828K14107K65565K83926L18712L85031M90104O17112P56144
$$ 1188668 1316820 1462648 1676755 1942320 2226246 2544958 2929989 3420093 4037205 4793349
9241D793349R58159J230096J552202J856685K197102K289766K025339J280071
$$ 4793349 5751508 6981604 8533806 10390491 12587593 14877359 16902698 18182769
9233A8182769J65757r72631j761524k058726j969452j779453j428307j154855
$$ 18182769 18348526 17375895 15614371 13555645 11586193 9806740 8378433 7223578
9225G223578j024983q10739o41239n25870m31666l06091l38910k81736j58675
$$ 7223578 6198595 5387856 4746617 4220747 3789081 3482990 3144080 2862344 2703669
9216B703669j42137j66510j21527p6343r1740j27761q7276n2871o498o2737m2376
$$ 2703669 2561532 2395022 2273495 2197152 2105412 1977651 1890375 1837504 1831006 1768269 1725893
9205A725893J8614l7217L8767K8697L1178K5684J9863M7973O4037Q5722Q6764
$$ 1725893 1744507 1707290 1746057 1774754 1805932 1831616 1851479 1899452 1963489 2049211 2135975
9194B135975J32568J33810J05627J27065J56382K23329K50813K79785L39509M09703
$$ 2135975 2268543 2402353 2507980 2635045 2791427 3014756 3265569 3545354 3884863 4294566
9184D294566M89573M99974O45859Q36335R27749J114961J316337J546428J835810
$$ 4294566 4784139 5284113 5929972 6766307 7694056 8809017 10125354 11671782 13507592
9175A3507592K256373K767930L279166L812009M318213M602880M513888L919734
$$ 13507592 15763965 18531895 21811061 25623070 29941283 34544163 39058051 42977785
9167D2977785K701902J128361n58562j835772k723925l107886l130944k909311
$$ 42977785 45679687 46808048 46249486 44413714 41689789 38581903 35450959 32541648
9159C2541648k582502k254116j892926j578269j243921r37002o81068m50953k62436
$$ 32541648 29959146 27705030 25812104 24233835 22989914 22052912 21371844 20920891 20658455
9150B0658455l146K81712O03031Q72147J207387J583948K005561K608580L324705
$$ 20658455 20655309 20937021 21540052 22412199 23619586 25203534 27209095 29817675 33142380
9141C3142380M197969N223467O579641Q211256J0046900J1736389J2806685J2356809
$$ 33142380 37340349 42563816 49143457 57354713 67401613 79138002 91944687 104301496
9133A04301496R277014L470466l517584r168174j2195383j2613497j1498638r833404
$$ 104301496 113578510 117048976 113531392 104363218 92167835 79554338 68055700 58222296
9125E8222296q051462o543157n281734m142668l382937k726286k231950j741749
$$ 58222296 50170834 43627677 38345943 34203275 30820338 28094052 25862102 24120353
9117B4120353j343409r92145p05045m62183k27721p739K43775M77994P19915J001385
$$ 24120353 22776944 21784799 21079754 20617571 20389850 20382111 20625886 21103880 21823795 22825180
9107B2825180J306864J583581J964818K342809K626766K847944K944594K678035
$$ 22825180 24132044 25715625 27680443 30023252 32650018 35497962 38442556 41120591
9099D1120591J982699Q51579o11490k138881l279216l959431m140696l984050
$$ 41120591 43103290 43954869 43343379 41204498 37925282 33965851 29825155 25841105
9091B5841105l597667l142887k671604k243440j883884j576254j312224j163740
$$ 25841105 22243438 19100551 16428947 14185507 12301623 10725369 9413145 8249405
9083H249405r36053p93150o76887n96505n56928m39533l75126l34604l01331k30820
$$ 8249405 7313352 6520202 5843315 5246810 4689882 4250349 3875223 3540619 3239288 3008468
9073C008468k00829j91927k26115j57633j33040j59860j14732q6387p4471q0782
$$ 3008468 2807639 2615712 2389597 2231964 2098924 1939064 1824332 1737945 1663474 1582692
9063A582692o3054n9545n3973p2001q6574r2961n3664m1535J3942j8706k7294
$$ 1582692 1519638 1460093 1406120 1334119 1247545 1154584 1100920 1059385 1073327 1054621 1027327
9052A027327k1565l5605m2837l1637m4948q4233K4240N7618m6019o4366q2303
$$ 1027327 1005762 970157 927320 895683 850735 766502 790742 848360 802341 737975 655672
9041F55672n5432K2857K0915J6874n089q208k004P636n3076m6728j9543J8442
$$ 655672 600240 623097 644012 660886 655797 647589 645585 653221 600145 553417 533874 552316
9029E52316J0605j1447j3691k5057K3693l9412k7404k6896q4935O566K5742K9762
$$ 552316 562921 551474 537783 512726 536419 497007 469603 442707 357772 364338 390080 419842
9017D19842O1191L648n108m617q7788M3098J5433M5254M7937K0066k010j5947
$$ 419842 481033 484681 479573 474956 387168 430266 445699 490953 538890 558956 556946 540999
9005E40999q818k5913l3526l2968o542Q084K5593m799l7070l7864j6416k1541
$$ 540999 532181 506268 472742 439774 433232 441316 466909 462110 425040 387176 370760 349219
8993C49219m6370l1422K4983o590J4804J2900N8877J7363r944p967l0547o657
$$ 349219 302849 271427 296410 289820 304624 317524 376401 393764 383820 375853 345306 338649
8981C38649K6179m1586k3988j6830J6964J8932K3162j4772M566J398k0074J5293
$$ 338649 364828 323242 299254 282424 299388 318320 341482 326710 331276 332674 312600 327893
8969C27893K9464n165r766j4382o6183m5558k3925K9473j9324k2037r817l7938
$$ 327893 357357 352192 342426 328044 261861 216303 192378 221851 202527 180490 170673 132735
8957A32735L8558M4206j4198k6973Q874L8898K9772M166k726K9588J1272K4122
$$ 132735 171293 215499 201301 174328 183202 222100 251872 256038 253312 282900 294172 318294
8945C18294L506k8317k7227j0266K7555p874m6432k1531L9184j1575l2727J2326
$$ 318294 321800 293483 266256 255990 283545 275671 229239 207708 246892 235317 202590 214916
8933B14916J3639k955l0714j892L7261J1822q3063o7645M8620L7744K2013k6545
$$ 214916 228555 225600 194886 192994 230255 242077 159014 91369 139989 177733 199746 173201
8921A73201J2906k2962K9986L3338j7713m5637n385J1878J5431K886K7359N0277
$$ 173201 186107 163145 193131 226469 208756 163119 157734 169612 185043 187929 215288 265565
8909B65565j8871j5261J2743o086k4087K401j7102p495k1663K1372L299k7677
$$ 265565 246694 231433 244176 238090 214003 216404 199302 191807 170144 191516 194815 167138
8897A67138m326M3987J4345m7113o9936j9932L658o577J3389J8647q80J6370J990
$$ 167138 162812 206799 221144 174031 104095 84163 87821 81244 94633 113280 112400 128770 130760
8884A30760n7545l2035R281j824K0458P611L9111q578j3490M532l9077J3189K9552
$$ 130760 73215 41180 50461 48637 69095 76706 115817 107239 93749 98281 59204 72393 101945
8871A01945M073M527k3278j9565j8384j0239K7421M999K2047K2385M9960l6386
$$ 101945 106018 110545 87267 67702 49318 39079 66500 71499 93546 115931 165891 129505
8859A29505m8748p479k6393k310J5297K6894K1847P715j3128K5633j8263j1517
$$ 129505 80757 73278 46885 44575 59872 86766 108613 116328 103200 128833 110570 99053
8847I9053L9216l6633k5229j6475j9983K8995O030P214P2475L0998n1038m7140
$$ 99053 138269 101636 76407 59932 39949 68944 74974 82188 154663 185661 134623 87483
8835H7483j1778m2041l0494M0529k3575j4259J191L7625j2459J1413K4639j8520
$$ 87483 75705 33664 3170 43699 20124 5865 7056 44681 32222 43635 68274 49754
8823D9754O609O9607L2019k0362n0672l6266l7228L5561L0964L5700l5290j582
$$ 49754 56363 125970 157989 137627 86955 50689 13461 49022 79986 115686 80396 78814
8811G8814J4203J059K7556N884p09k4958m1118o2264k9327j8932L8788L178k6817
$$ 78814 93017 94076 121632 127516 126807 101849 60731 -1533 -30860 -49792 -11004 -7826 -34643
8798c4643N3812K4427K3944M0826j5180l7418J4543M530O286J0678J1923k3066
$$ -34643 19169 43596 67540 108366 93186 55768 70311 74841 81127 91805 103728 80662
8786H0662q365j1615n1175k5233J3554L9674l32k2669K4794k355j8167l3671j0065
$$ 80662 72297 60682 9507 -15726 -2172 37502 37170 14501 39295 36940 18773 -14898 -24963
8773b4963O6227J2252l7397l1665j9161k5998L6155N1264L3611r887J0286j2085
$$ -24963 41264 53516 16119 -15546 -34707 -60705 -24550 26714 60325 50438 60724 48639
8761D8639j6447K6711K2143J4700J6905J2316j5612r9791j9736K0434L7513j1968
$$ 48639 32192 58903 81046 95746 112651 124967 109355 9564 -10172 10262 47775 35807
8749C5807M1417K8626m156l7920n111k54k2295M3376J160m1512L1141K1636k2991
$$ 35807 77224 105850 101694 63774 58663 58409 36114 79490 80650 39138 70279 91915 68924
8736F8924n2146k8571N963M2678K1629J5845k5204Q048l4365k8703j5558J8937
$$ 68924 16778 -11793 -5830 36848 58477 74322 49118 57166 22801 -5902 -21460 -2523
8724b523J7153L574O892K3602N955Q609L5411J7928R802m6134k7591L5725J4508
$$ -2523 14630 18204 25096 48698 54653 63262 98673 116601 126403 80269 52678 88403 102911
8711A02911q7378k6409q90q094J02054O4132l1567P965K928m0603M41M2638p1324
$$ 102911 15533 -10876 -11766 -19860 82194 146326 114759 122724 125652 85049 85490 128128 56804
8698E6804l9545K6595j1794k1008j6004M5597P0088j8039p4034O629j3285r899
$$ 56804 17259 43854 32060 11052 -4952 40645 110733 92694 18660 25289 12004 2105
8686B105J5787j9097k6839k6539O5525J2990k3315J4091M5338K4266k595K8307
$$ 2105 17892 -1205 -28044 -54583 10942 23932 617 14708 60046 84312 81717 110024
8674A10024N23q453l6872k3951K1105M4178K4116K2223j4467k9011R041j3515
$$ 110024 110547 102094 65222 41271 62376 106554 130670 152893 138426 109415 118456 104941
8662A04941J8729p913l844m669j6380j0062J152l2425p402j029l3169M6353q868
$$ 104941 123670 115757 111913 107244 90864 80802 81954 49529 42127 41098 7929 54282 45414
8649D5414M705L3505M856K7856o298l4345L1580q683K1878Q0021R3089J44061
$$ 45414 50119 83624 88480 116336 110038 75693 107273 98590 120468 200489 293578 437639
8637D37639J80289j6914j42252q3926r1766n0005n283l5795m5771m811l914j9978
$$ 437639 617928 601014 458762 374836 283070 233065 227782 191987 146216 141405 137491 117513
8625A17513k0442m880m575O15j1133M92L298L0215J2757N097j0974n952k0161
$$ 117513 97071 92191 87616 88231 77098 77590 80888 111103 123860 128957 117983 112031 91870
8612I1870p536J9119j468J7758n105K1808K4556K1583J1521L123P531k5400l5704
$$ 91870 84334 103453 101985 119743 114638 136446 161002 182585 194106 197229 204760 179360 143656
8599A43656O6549P2481M3948N2544R6522R7385K45629K89052L8434k75901k41965
$$ 143656 210205 282686 326634 379178 475700 573085 818714 1107766 1146200 870299 628334
8588F28334j58762q7919o5794k5275k7348k7532J0541R024o8257n1622n155N5991
$$ 628334 469572 381653 315859 290584 263236 235704 246245 255269 187012 135390 130235 186226
8576A86226m297k6000l7954K437L0603j2559K3653J5265k0662m6935o406m0482
$$ 186226 181929 155929 117975 120412 151015 138456 162109 177374 156712 109777 103371 62889
8564F2889l8212j4695j0489k0625q862M2996L4357j8707O6992N057k9867J2467
$$ 62889 24677 9982 -507 -21132 -29994 13002 47359 28652 95644 100701 70834 83301
8552H3301k649N9954M5828P9038P0970R0265N4431q4701j36396m4395j04987p7838
$$ 83301 80652 140606 186434 265472 336442 426707 481138 396437 260041 215646 110659 32821
8540C2821N338J0405j6819l5855Q765L5144l8024k0428m09K2036L0575m905N5579
$$ 32821 38159 48564 31745 -4110 4655 39799 1775 -18653 -19062 2974 33549 28644 84223
8527H4223M1989m9702m1205k2807k5554K7459M2812j2410K4537l7389m0968M5247
$$ 84223 126212 76510 35305 12498 -13056 14403 57215 44805 69342 31953 -9015 36232
8515C6232P0220r589J5335K979m215K278k9225O141k8571q14K2955j144m2479
$$ 36232 106452 96863 112198 115177 110962 113240 84015 90156 61585 60771 83726 82582 40103
8502D0103j9463m7527m1956L668M3735j326L5822J982j878K9837J7748M837l976
$$ 40103 20640 -26887 -68843 -65175 -21440 -22766 13056 15038 13160 42997 60745 65582 61606
8489F1606j4857p177J0360Q899j9933M2759q866o1930k6743L6375L5642m8984
$$ 61606 46749 39572 49932 58831 38898 81657 72791 10861 -15882 20493 56135 7151
8477G151k4773J5010M9720N4800J11K0045M679r419j18m8873m2974M6389l856
$$ 7151 -17622 -2612 47108 101908 102019 122064 126743 117324 117206 68333 25359 71748 67892
8464F7892l4674j9637J190K3104N0529R13K665j9511m6181j5770O0026M4624n7427
$$ 67892 33218 13581 14771 37875 88404 89317 91982 72471 26290 10520 70546 115170 57743
8451E7743J5555O5282J5771p6171k7382J6850K190J6009j312q499J897o1627p6040
$$ 57743 73298 138580 154351 78180 50798 67648 69838 85847 84535 76036 77933 16306 -59734
8438e9734R105O7546L0293J2059n219K7536k923q904m867j4262l7846k5830p697
$$ -59734 -50629 16917 47210 59269 54050 81586 78663 69759 64892 50630 12784 -13046 -20743
8425b0743k7251M183L6230J5856n960l4813r327L6948P9624k9210j4498l8341
$$ -20743 -47994 -43811 -7581 8275 2315 -32498 -41825 -4877 74747 45537 31039 -7302
8413g302j3794o729K5700L3738L959l5123K2921M680o3833J4179L6146j3528j0137
$$ -7302 -21096 -27825 -2125 31613 35572 449 23370 28050 -35783 -21604 14542 1014 -9123
8400i123K7585O071k3670K480Q363j6600j7640m6450N3812L9751P005q54m5596
$$ -9123 18462 24533 863 3343 11706 -4894 -22534 -68984 -15172 24579 31584 30730 -14866
8387a4866J3443L3990K0748K1245l0883J3030J9076J5701k0222O171j925j2061
$$ -14866 -1423 32567 53315 74560 43677 56707 75783 91484 71262 77433 75508 63447
8375F3447j4804r502j433p434l651n180j8532J6992k0265n9967k4350K1635K0412
$$ 63447 48643 39141 37708 30274 26623 21443 2911 19903 -362 -60329 -84679 -63044 -42632
8362d2632N5365j7186j6048K0518L5580M1096j4485k6127J2043J2650K3976L8348
$$ -42632 12733 -4453 -20501 17 35597 76693 62208 36081 48124 60774 84750 123098
8350A23098l1499j7251L4248j6017M326k9557m7168j3753J8433Q293m3793L7463
$$ 123098 91599 74348 108596 92579 96905 67348 20180 6427 24860 33153 -10640 26823
8338B6823L5221M2918m8946m5406n3K7538O8939O946k9570m4175P756j2461j425
$$ 26823 62044 104962 56016 10610 10557 38095 107034 113980 84410 40235 47991 35530 34105
8325C4105m262l4435o453J851J3786M5690M7522l2085m8425l632M9974l1251q9410
$$ 34105 29843 -4592 -11045 -9194 4592 50282 97804 65719 17294 13662 63636 32385 -57025
8312e7025K1159k2423J8156M6736L9637j3960L5075k1422m269Q308J765q697n4950
$$ -57025 -35866 -58289 -40133 6603 46240 32280 67355 45933 41664 49972 51737 43040 -11910
8299a1910k0825j8619K5991l3027j3034J7205Q048J7113M1056K8194q730l4734
$$ -11910 -32735 -51354 -25363 -58390 -71424 -54219 -46171 -29058 11998 40192 31462 -3272
8287c272k1184K0561J7961L8931K9036k2716m1780k1901J0784K8857p398m973
$$ -3272 -24456 -3895 14066 52997 82033 59317 17537 -4364 6420 35277 27879 22906
8275B2906P063r130K4654K2763j2779q109J6168J2534j5070j4838J4304O964K966
$$ 22906 29969 20839 45493 68256 55477 47368 63536 76070 61000 46162 60466 67430 70396
8262G0396j3177M666r68q307J3640k4338l2751j7497J2342K0604m747K6446J458
$$ 70396 57219 61885 60917 52610 66250 41912 9161 -8336 4006 24610 19863 46309 47767
8249D7767k0579p662j150m1377K9522N6280J0376q204l7124k6152j2560m0734
$$ 47767 27188 19526 18376 -23001 6521 62801 73177 64973 27849 1697 -10863 -51597
8237e1597J9121K9140M379j0783j9129k4501L1619J4580m930J4295J3636K5554
$$ -51597 -32476 -3336 1043 -9740 -28869 -53370 -21751 -7171 -12101 2194 15830 41384
8225D1384r98m5335j9392K5120J2702p946l676M288j0449L438J0244L1653J3815
$$ 41384 40386 -4949 -24341 779 13481 5535 1859 6147 -4302 -864 9380 41033 54848
8212E4848K735l0085J0357j0042m3693n328J205J9338o083J789J0159k6323l4811
$$ 54848 57583 27498 37855 27813 -15880 -21208 -20003 -665 -6748 -4959 5200 -21123 -55934
8199e5934q0268j7561O8005L3997K025L1870J8214k6307O66O1323J640K9044k1249
$$ -55934 -136202 -153763 -85758 -51761 -49736 -17866 348 -25959 -25293 36030 37670 66714 45465
8186D5465l758r342n046M978J0233J1548j7931o6486n6609l5263K6821O130n228
$$ 45465 41707 32365 27319 32297 42530 54078 36147 -30339 -86948 -122211 -95390 -89260 -94488
8173i4488K2934L0614L5392K1866L5901P13k0004L25j1013l2398j1759L1345l782
$$ -94488 -71554 -40940 -5548 16318 52219 52932 32928 33253 22240 -10158 -21917 9428 5646
8160E646R447J5518k9965M8683P585l3284j7969l7763k3533J9869M2620R131K9228
$$ 5646 15093 30611 646 49329 56914 23630 5661 -32102 -55635 -35766 6854 15985 45213
8147D5213L5482P079p2332l4301n920k5373J5741L8455l9744k1978O4866J5648
$$ 45213 80695 87774 15442 -18859 -24779 -50152 -34411 4044 -35700 -57678 7188 22836
8135B2836J7037m6472j5746K1912N714k7832l816n1550o883j5509j5457j3650
$$ 22836 39873 -6599 -22345 -433 5281 -22551 -26367 -77917 -84800 -100309 -115766 -129416
8123a29416l045N6534L3820M2436j0000k802J3233k1805k9422m558J805q707O380
$$ -129416 -132461 -75927 -42107 329 -9671 -12473 760 -21045 -50467 -55025 -53220 -61927 -55547
8110e5547L2871P7241J519n3310J5923j3810j676J4918K937J1318K566M1904l0522
$$ -55547 -22676 54565 56084 2774 18697 4887 3211 18129 21066 32384 34950 76854 46332
8097D6332j5948p365L0773l890m6914l3040k063K5143j2616J3684O0057k0434
$$ 46332 30384 23019 53792 49902 2988 -30052 -32115 -6972 -19588 -5904 54153 33719
8085C3719j119M677j6847M6788l9165l1052l163K7842J2025L8574J5466o2462
$$ 33719 32600 37277 20430 67218 28053 -2999 -6162 21680 33705 72279 87745 25283
8073B5283q4168J1785P0433J7646J3964p242j5257K4134J248k9762n8982q938
$$ 25283 -58885 -47100 23333 40979 54943 47701 32444 56578 57826 28064 -30918 -39856
8061c9856L4459K830l9087K2943L6372K9068Q919l264m7222j4320M9675J5160
$$ -39856 -5397 -2567 -41654 -18711 17661 46729 55648 52384 5162 -9158 40517 55677
8049E5677k4712J6873J543J2535K0816L036m8871J0884j0540O618K0089J231k681
$$ 55677 30965 47838 49381 61916 82732 85768 36897 47781 37241 43859 63948 65179 62498
8036F2498l0656r804j0848q36j9125j8959O0540L9709K0669j0633o471K9712m692
$$ 62498 31842 22038 11190 10354 -8771 -27730 32810 72519 93188 82555 76084 105796 101104
8023A01104p7245K9787P7334l1083l4689k1517K010N297Q26j8021j5748n932j9658
$$ 101104 23859 53646 130980 99897 65208 43691 45701 50998 51824 33803 18055 12123 -7535
8010g535L403M3765L4186J6564R724k7348K9865L4382J973o8669J6463K9479j4535
$$ -7535 -4132 39633 73819 90383 100107 72759 102624 137006 138979 70310 86773 116252 101717
7997A01717N726L7301m4084J5523j852j8855J3190l3235M2060J1351k3685J04
$$ 101717 107443 144744 100660 116183 114331 95476 108666 75431 117491 128842 105157 105261
7985A05261R4117P6237M4048n7520r4746k7506j6015n0973k790j3665Q380j2854
$$ 105261 199378 275615 319663 262143 167397 139891 123876 72903 70113 56448 64828 51974
7973E1974k4510k3356J8599L1607J1701N042J9620k0090l0500J9320J1032K6185
$$ 51974 27464 4108 22707 54314 66015 71057 90677 70587 40087 59407 70439 96624
7961I6624J8076K277J6337K259K1054N6346K6602L5746N0916k8292L812m5977
$$ 96624 114700 116977 133314 135573 156627 212973 239575 275321 326237 297945 301757 255780
7949B55780n5918p7450p7279L6341N3218j522N3811L6512k2414k2906j7830k1502
$$ 255780 199862 122412 45133 81474 134692 133170 186981 223493 201079 178173 160343 138841
7937A38841n3283j4252K6565k2032l7821j0955l8401N385M6272J8355k4839q705
$$ 138841 85558 71306 97871 75839 38018 27063 -11338 -5953 40319 58674 33835 25130
7925B5130K6901L1626K6166J4058n8204O071k8955o147L4092J7437n9213K8898
$$ 25130 52031 83657 109823 123881 65677 71748 42793 36646 70738 88175 28962 57860
7913E7860L961J9343K951m0470M0542L4643k0003m8314l4570m1474R952N4296
$$ 57860 61821 81164 84115 43645 84187 118830 98827 50513 15943 -25531 -15579 38717
7901C8717J4858K8447J445r308m4412k0663q934n1515K4627O5416K5825J591J1347
$$ 38717 53575 82022 83467 74159 29747 9084 150 -51365 -26738 38678 64503 66094 77441
7888G7441q64o408L0202r21l9205m632k5440j4474m1424K1478J8480j2909m3178
$$ 77441 76577 70169 100371 99450 60245 55613 30173 15699 -25725 -4247 14233 1324 -41854
7875d1854j769M2941j7904j6169n985j1359j3603K4865J4472p997L8854J6091
$$ -41854 -43623 -682 -18586 -34755 -40740 -52099 -65702 -40837 -26365 -34362 4492 20583
7863B0583j1843j8366K1847K084k3112N94l7982K1906L9593K9263j7146k8340
$$ 20583 8740 -9626 12221 14305 -8807 -8213 -46195 -24289 15304 44567 27421 -919
7851i19l5366k8775L7920M875j5060R222L0185J3073K1697R299m7969N5005q13
$$ -919 -36285 -65060 -27140 -22265 -37325 -28103 2082 15155 36852 46151 -1818 53187 52374
7838E2374j6362k3279J270K4297j8597p553m7627l0371n063k2125N6662M3212
$$ 52374 36012 12733 14003 38300 19703 12150 -35477 -65848 -70911 -93036 -36374 6838
7826F838p572m499L2484K0908j7172j3271k2252o0184k1919K063O823N0005L9400
$$ 6838 -734 -5233 27251 48159 30987 17716 -4536 -64720 -86639 -84576 -77753 -27748 11652
7813A1652k7396o764p558p411N3309J2773K6463J2718j9667n235l1773J1598L2680
$$ 11652 -15744 -22508 -30066 -37477 15832 28605 55068 67786 48119 42884 11111 22709 55389
7800E5389j082K7007L1766l9191n8959l0055l53k4496l604k496K403N599k5117
$$ 55389 54307 81314 113080 73889 14930 -15125 -15478 -39974 -43578 -46074 -43671 -38072 -63189
7787f3189k7892k1852N9J5228P4676L5075r631k9560o123J1776J3176R991J5594
$$ -63189 -91081 -112933 -112874 -97646 -22970 12105 2474 -27086 -33209 -21433 -8257 1734 17328
7774A7328J3793k2525k4090j3426J1797R161k370N9752R195j583l1058k6309m360
$$ 17328 31121 8596 -15494 -28920 -17123 -7962 -10332 49420 58615 57032 25974 -335 -4695
7761d695L2861j7198r745R471M9627o209n2486n1159j0693J3702j0568K0743j3421
$$ -4695 28166 10968 1223 10694 60321 54112 1626 -49533 -60226 -46524 -57092 -36349 -49770
7748d9770k4064P3019L6715n1731J936L722Q846R246j1423j3332k3313M296M9361
$$ -49770 -73834 -815 35900 -15831 -13895 -10173 -1327 7919 -3504 -16836 -40149 -35853 13508
7735A3508L0707r456K4070K7954J4604k6627n766o498m3973j8915L0573K0914
$$ 13508 44215 34759 58829 86783 101387 74760 68994 62496 18523 -392 30181 51095
7723E1095K384p694l19J2195j6399k0587j0697M1014P238j4756j5612p707N1198
$$ 51095 53479 45785 45466 57661 41262 20675 9978 50992 58230 43474 27862 20155 71353
7710G1353o651m8776l8666n274J8557M7872P3395R305r4506p1635K9692j1113
$$ 71353 64702 15926 -22740 -28014 -9457 38415 111810 121115 26609 -45026 -15334 -26447
7698b6447J4585j2654j530M6921j0942J890J3864O622p998j6577k4655R460p504
$$ -26447 -11862 -24516 -26046 20875 9933 11823 25687 32309 24311 7734 -16921 -7461 -14965
7685a4965p262m6272K0047l000l1599L1721L1450m910J8405l3555k128N7244l8362
$$ -14965 -22227 -68499 -48452 -51452 -83051 -51330 -19880 -24790 -6385 -39940 -42068 15176 -23186
7672b3186p8030L4026K7769k825K4224K8218J9135K5754l738l9414j3436L6380
$$ -23186 -101216 -67190 -39421 -42246 -18022 10196 29331 55085 51347 11933 -1503 34877
7660C4877K917J0520J071n2530l1098j4172k471K0296N094N890J7728L690k5177
$$ 34877 37794 48314 49385 -3145 -34243 -48415 -50886 -30590 -25496 -19606 -1878 1812 -23365
7647b3365R790J2063Q87r296K492k2194N1275k8832l3132J1J2959l6256O994L1372
$$ -23365 -13575 -1512 -625 -9921 -7429 -29623 21652 -7180 -40312 -40301 -27342 -63598 -56604 -25232
7633b5232N129M6012M0668K1385n4315k9632K514l4245n7793p344P640L6982K4160
$$ -25232 -20103 25909 66577 87962 33647 4015 6529 -27716 -85509 -92853 -85213 -48231 -24071
7620b4071l7230n0877K2663L2103P1830L9718O601L2542l3412k6101m6046j451
$$ -24071 -61301 -112178 -89515 -57412 14418 54136 60737 93279 59867 33766 -12280 -13731
7608a3731L6583N013r359M8642j9933n9290l7675k800J0275L1628L1453o902M289
$$ -13731 22852 27865 18506 67148 47215 -12075 -49750 -52550 -42275 -10647 20806 13904 18193
7595A8193k0249m7383L2223L0156M2186O0355P904m1169j4396l9327l3500K5603
$$ 18193 -2056 -49439 -17216 12940 55126 115481 123385 82216 67820 28493 -5007 20596
7583B0596N7033j5728k7851k1690j1928j902l2756J3098K9291O587M3181k9652
$$ 20596 77629 61901 34050 12360 432 -1470 -34226 -21128 8163 14750 57931 28279
7571B8279l6682J4859J7435j7423n4779k0975q26K8317J0348J0139L700k7118
$$ 28279 -8403 6456 23891 6468 -48311 -69286 -70112 -41795 -31447 -21308 -17608 -44726
7559d4726j7808j0053K8616K1527M013Q467N705L010p674O758l96J4314K4541
$$ -44726 -62534 -72587 -43971 -22444 -18431 -9964 -4259 -1249 -8923 -2165 -2561 11753 36294
7546C6294l7405J7096M476k5452k3675J9460J7117n634l0137j5222K2530K462
$$ 36294 -1111 15985 20461 -4991 -28666 -9206 7911 2277 -27860 -43082 -20552 -18090
7534a8090j134k5033J2798K6178R108k5499k1881j0275M0596j1068k6K6595N123
$$ -18090 -19224 -44257 -31459 -5281 3827 -21672 -43553 -53828 -13232 -24300 -24326 2269 7392
7521G392l158N560M312l0538J8743L2371j8249L231K3680j562n9938n1947j0106
$$ 7392 4234 9794 14106 -16432 2311 34682 16433 19664 43344 41782 -18156 -70103 -80209
7508h0209K0729L5505M6148m4481l9718J8555K8l5347j085K345J6877K2112J465
$$ -80209 -59480 -23975 22173 -22308 -62026 -43471 -43443 -78790 -79875 -77530 -60653 -38541 -37076
7495c7076J5092r619M9983J0588k6748l6461k826J9217n872j4115k0452k6321
$$ -37076 -21984 -31603 18380 28968 2220 -34241 -37067 -17850 -23722 -37837 -58289 -84610
7483h4610M7059R867k8268o637O9974P1585j6776k2090o3586m3647J5932K9862
$$ -84610 -37551 -27684 -55952 -62589 7385 78970 62194 40104 -23482 -67129 -51197 -21335
7471b1335j032K7010N7076L9886L721l9651l2961l515p993k0003j2548l1064k709
$$ -21335 -22367 4643 61719 101605 105326 65675 32714 29199 21206 1203 -11345 -42409 -45118
7458d5118N0948L6153j7223k5113j5928K5326l3641L847J4833r462r276L3410
$$ -45118 5830 41983 24760 -353 -16281 9045 -24596 -20749 -5916 -15378 -24654 8756
7446H756k4325o2803K3356Q5223K1004m5061K0913k1164K4981L818J4865k4087
$$ 8756 -15569 -78372 -55016 30207 51211 6150 27063 5899 30880 34698 49563 25476
7434B5476N772m711n295r763J161m304n1772m848j3063O354M068J5426K0419L6909
$$ 25476 31248 26537 21242 11479 12640 8336 -43436 -48284 -61347 -54993 -50925 -35499 -15080 21829
7420B1829m8170o5632q302k076q775J5899M9073K1243K5319J297l5194j4701L9495
$$ 21829 -26341 -91973 -100275 -102351 -111126 -95227 -46154 -24911 408 1705 -33489 -48190 -8695
7407h695k072l0723J2719N93k3363Q163K361r865K6171L0550k0117J0865K7315
$$ -8695 -10767 -41490 -28771 -28178 -51541 -43378 -41017 -50882 -24711 5839 -14278 -3413 23902
7394B3902O35n244j0765k0769j4618M1732R114J7327N233j2158J8492L452m2423
$$ 23902 24537 19293 8528 -12241 -26859 14873 23987 41314 46547 34389 52881 56333 13910
7381A3910k7934j2802p217K8823k735j7456l9914k4773M616M9023J7826K8644
$$ 13910 -14024 -26826 -34043 -5220 -7955 -25411 -65325 -90098 -85482 -36459 -18633 10011
7369A0011J561J007K1878n5017j5449N505m530M2053M7004k2749l3337j0680j381
$$ 10011 11572 12579 34457 -20560 -36009 -30504 -35034 7019 54023 31274 -2063 -12743 -14124
7356a4124j0665m157k869J0024K7706L7032o253R917K2689o014n3844m0614r796
$$ -14124 -24789 -28946 -31815 -21791 5915 42947 36694 46611 69300 63286 9442 -31172 -40968
7343d0968L5935K5310K3563L9119r446l6688k4447j3391j92J2647M7676K0948
$$ -40968 -5033 20277 43840 82959 73513 36825 12378 -1013 -1205 11442 59118 80066
7331H0066m4915k4176o37J2660L56k0187J2091j7154k4699L1418J1609l0671m1253
$$ 80066 35151 10975 10338 22998 23354 3167 15258 -1896 -26595 4823 16432 -14239 -55492
7318e5492L4660L3618K2075K5352J5158o430j0009R547r811j7788j1140o2253
$$ -55492 -20832 12786 34861 60213 75371 68941 58932 68479 58668 40880 29740 -32513
7306c2513p424N1316j4086O645M6948K7402o4246j9665J5274j3066K768k5486
$$ -32513 -39937 11379 -2707 3938 50886 78288 14042 -5623 9651 -3415 -647 -26133
7294b6133j4754J701K8397k5359l3415k3278K9366N4057M9488o053r147J819j0482
$$ -26133 -40887 -39186 -10789 -36148 -69563 -92841 -63475 -9418 40070 34017 24870 26689 16207
7281A6207R766j9481m0059L3026k9174j0241M7846L5028k542o5715J7519O6763
$$ 16207 25973 6492 -33567 -541 -29715 -39956 7890 42918 40376 -25339 -7820 58943
7269E8943P032j394k5997K2639j5341k8587j9386l549K8894o979J6194K2523J6155
$$ 58943 65975 64581 38584 61223 45882 17295 -2091 -5640 23254 16275 32469 54992 71147
7256G1147q342l2642N99r526P776K5626l4946k9648r672J4118J719j5205J8706
$$ 71147 62805 30163 30762 21236 29012 54638 19692 -9956 -19628 -5510 -3791 -18996 -290
7243b90K2192K4726j2000j7386L082k1434O199K6191m579j7448p669l0056j8926
$$ -290 21902 46628 34628 17242 20324 -1110 5089 31280 26701 9253 1584 -28472 -47398
7230d7398J5338k7176M0791k907j9460k1651n086M9441m6798l2185N3860r33j3906
$$ -47398 -32060 -59236 -18445 -21352 -40812 -62463 -67549 -18108 -64906 -97091 -43231 -44164 -58070
7217e8070K7247l027n1970l0992K7707O2073J9525N5124p402k539m699n060l1603
$$ -58070 -30823 -33850 -85820 -116812 -89105 -27032 -7507 47617 40215 37676 32977 27917 -3686
7204c686j4692L1615l386j4612q3485L1872M6339K3047J3032K2230k530M1337
$$ -3686 -18378 13237 9851 -4761 -88246 -56374 -10035 13012 26044 48274 45744 87081
7192H7081o904r6935l7420M2971K4201k8345k597K1646k0024j3996M08k4441j6506
$$ 87081 80177 -16758 -54178 -11207 12994 -15351 -17948 3698 -16326 -30322 -29914 -54355 -70861
7179g0861q59j88l51k8767j7193R1710J2114k5203j5317K201l5623K1763L4031
$$ -70861 -71720 -71908 -72259 -101026 -118219 -26509 -14395 -39598 -54915 -52714 -88337 -66574 -32543
7166c2543K4240l7104M5125m577L9965k8024p092M8656K0413k9556o3349j5630
$$ -32543 -8303 -45407 -282 -4859 35106 7082 -10 48646 69059 39503 -23846 -39476
7154c9476M4067j0353j6013K4981L761L4863L9625O257n0557p5744j8306M4837
$$ -39476 4591 -5762 -21775 3206 6967 41830 81455 87712 37155 -38589 -56895 -12058
7142a2058M593j2888J3207K0648Q5939m0588m6069k1573m2476j0563L6732J759
$$ -12058 -7465 -20353 -7146 13502 99441 58853 12784 -8789 -51265 -61828 -25096 -23337
7130b3337J5493r556K1823M2995m324J7595l7962n8298p6956L8943O4327J2619
$$ -23337 -7844 -17400 4423 47418 43094 60689 22727 -35571 -112527 -73584 -9257 3362
7118C362k2506m037O8260K8684o2851j3564K0126l0099k5111r460L4244K3058
$$ 3362 -19144 -23181 45079 73763 10912 -2652 17474 -12625 -37736 -47196 -12952 10106
7106A0106K4688K2756k0303n3653o3371m0824N083k5241J9210N7197M0732M1001
$$ 10106 34794 57550 37247 -16406 -79777 -120601 -115518 -140759 -121549 -64352 -23620 17381
7094A7381J931k1620j1908L2012j8195o2327J9800N6342P774m5244k5103K0412
$$ 17381 19312 -2308 -14216 17796 -399 -62726 -42926 13416 21190 -24054 -49157 -28745
7082b8745K6637o278L2647J6708j7067j9151k2406k4965n773l658L7043K9453
$$ -28745 -2108 -8386 24261 40969 23902 4751 -17655 -42620 -48393 -52051 -15008 14445
7070A4445j4886m0742J1720L935J6617N870j3462j8868K7116r24K4342N570m241
$$ 14445 -441 -41183 -29463 -25528 -8911 -3041 -16503 -35371 -8255 -9179 15163 20733 16492
7057A6492J0866n956j353O712j2291L0211l3390k8406K4538m4868m9499N282j934
$$ 16492 27358 21402 20049 26761 14470 44681 11291 -17115 7423 -37445 -86944 -81662 -83596
7044h3596Q2513o865m0865k4595K7396M0946p478L0554L0817l4514J9287K5156
$$ -83596 -1083 -7948 -48813 -73408 -46012 -5066 -12544 18010 48827 14313 33600 58756
7032E8756l0746n5870n7578K5389M1640M8849j3276j0921J9707J6078m149j5630
$$ 58756 28010 -27860 -85438 -60049 -18409 30440 17164 6243 25950 42028 37879 22249
7020B2249k3953K9844M3070j6395k2460l1325k0160O8140K2935j7278j7160j4480
$$ 22249 -1704 28140 71210 54815 32355 1030 -19130 49010 71945 54667 37507 23027
7008B3027K9891N985j4275Q620q547m1044J1210l934j1858m293J9111P613K670
$$ 23027 52918 58903 44628 53248 44701 3657 14867 10933 -925 -5218 13893 21506 24176
6995B4176J707q913K4268N819k8022q219P705L0848r744l2337p445L425J240J6477
$$ 24176 25883 16970 41238 47057 19035 10816 18521 49369 39625 7288 -157 3268 4508 20985
6981B0985n079j1006N0646l9280J6045j0331j0568L3521j9686k4664q756K2169
$$ 20985 15906 4900 55546 16266 32311 21980 11412 44933 25247 583 -8173 13996
6969A3996k407l6414j404K3571k3066K531O0134q232j0907l2091j342L0381J8193
$$ 13996 11589 -24825 -26229 -2658 -25724 -23193 36941 28709 17802 -14289 -15631 14750 32943
6956C2943m4712k0625k3658J0389M4503J1791K262k8047j3618R71N720j917L2852
$$ 32943 -11769 -32394 -56052 -45663 -1160 10631 12893 -15154 -28772 -27801 -22081 -23998 8854
6943H854J8906K3205n3561l3235O3942J7263r266j4640k9292J1271L7430j4640
$$ 8854 27760 50965 -2596 -35831 28111 45374 36108 21468 -7824 3447 40877 26237
6931B6237j00M3163k972k3229K1081m1809l9898K3784r49o943k5426m361L9095
$$ 26237 26137 69300 66328 43099 64180 22371 -17527 6257 5308 -1635 -27061 -31422 7673
6918G673Q278J4080M0035M189l9778k8578M080P216m4063l7698k8706l0222p505
$$ 7673 15951 30031 70066 74255 34477 5899 9979 17195 -26868 -64566 -93272 -123494 -130999
6905a30999K3740K460Q799j231p006N7675J2155m952l9370L4543K7698J3547P336
$$ -130999 -107259 -104799 -96000 -97231 -104237 -46562 -34407 -39359 -78729 -44186 -16488 -2941 4395
6892D395j7300j5180j5014m892j4921r088K9179L1670j4355L6371J5441J0253
$$ 4395 -12905 -28085 -43099 -47991 -62912 -72000 -42821 -11151 -25506 10865 26306 36559
6880C6559o010l708K7752j8485j9205J1028k4193k1929j8040q527J0877K5683
$$ 36559 30549 26841 54593 36108 16903 27931 3738 -18191 -36231 -44758 -33881 -8198
6868h198j3994j0945j0659m3013L236K0025P679R895r477K2859Q396j6655Q046
$$ -8198 -22192 -33137 -43796 -86809 -83573 -63548 -55869 -45974 -55451 -32592 -24196 -40851 -32805
6855c2805K6302J1400M0297l8495k8513k6103j9487M8678N1696p867k3847J1946
$$ -32805 -6503 4897 45194 6699 -21814 -47917 -67404 -18726 32970 25103 1256 13202
6843A3202j7239k2656l2718k8533k5050K6385L3242K6455n0189j3756K0511K9558
$$ 13202 -4037 -26693 -59411 -87944 -112994 -86609 -53367 -26912 -77101 -90857 -70346 -40788
6831d0788J1161J8661p83k7724l858l338J1520R268K0627M867q370J0997j6861
$$ -40788 -29627 -10966 -11749 -39473 -43331 -46669 -35149 -25881 -5254 -387 -8757 2240 -14621
6818a4621J8782j5486j7031M807J7720K2738l399J2137l758J2606m8953n3080
$$ -14621 4161 -11325 -28356 -23549 -5829 16909 13510 25647 21889 34495 -14458 -67538
6806f7538j5198L1616N0817K9248k9220k0565M581L7036O58k0916j5616P967k0479
$$ -67538 -82736 -51120 -303 28945 -275 -20840 -16259 20777 21435 519 -15097 -7130 -27609
6793b7609K737j6526k1061m984l877M425j0245P3834N9306l3561N45m7794K01
$$ -27609 -24872 -41398 -62459 -67443 -71320 -66895 -77140 -3306 56000 22439 22984 -24810 -24609
6780b4609L1520j5745j8180j7419J5379l521M5278N0070M216j4338k1562m3640
$$ -24609 6911 -8834 -27014 -44433 -29054 -32575 12703 62773 66989 52651 31089 -12551
6768a2551l040O7847l2892l5374J7051n3406M1180L6894r985l3725l5683L4486
$$ -12551 -15591 52256 19364 -16010 1041 -52365 -11185 25709 15724 -18001 -53684 -19198
6756a9198K030l2083J4035O0011J1298o6372K5451K2544p232j8645j1622K1463
$$ -19198 -17168 -49251 -35216 24795 36093 -30279 -4828 17716 10484 -8161 -19783 1680
6744A680L9799N6280l8067m2364j7550k6361J045J6757j0730j8496K1185l1829
$$ 1680 41479 97759 59692 17328 -222 -26583 -25538 -8781 -19511 -38007 -16822 -48651
6732d8651M2219L2041m2725k9567l202K8167M0120K7442j3822n8826L375L1347
$$ -48651 -6432 25609 -17116 -46683 -49885 -21718 18402 45844 32022 -26804 -23429 7918
6720G918j8467M3160k705p786O34j9013P110p007j5473Q740k9163J758L244P44
$$ 7918 -10549 32611 29906 22120 22754 3741 10851 3844 -11629 -2889 -32052 -30294 -27050 -26306
6706b6306k9157J0726N8422P104l174R45k4277L213N1350k108q871j9498K3618
$$ -26306 -55463 -44737 13685 20789 17615 18560 -5717 -2504 48846 46738 37867 18369 41987
6693D1987l1416M0074K8378j2224p1178J1443K4954k3760j9593P2541K0037l7625
$$ 41987 10571 50645 79023 66799 -4379 7064 32018 8258 -11335 61206 81243 43618
6681D3618l8182L0889m3699k3216M1744L6285j4250Q18K8355K5817j6522K8152
$$ 43618 5436 36325 -7374 -30590 11154 47439 33189 34007 62362 88179 71657 99809
6669I9809m2131o3755o4789l1750L8203K7760m615J8595L90m9679k0659L7803
$$ 99809 57678 -6077 -70866 -102616 -64413 -36653 -41268 -22673 -22283 -71962 -92621 -54818
6657e4818L4269L8863k023k1622r516J9052k7086K9589L2273K0216l2024o6448
$$ -54818 -20549 18314 16291 -5331 -14847 4205 -22881 6708 38981 59197 27173 -39275
6645c9275n3811k7881O5820N3391L4697j8086Q351K079p496j1812j5929k8691
$$ -39275 -93086 -120967 -55147 -1756 32941 14855 23206 25285 17789 5977 -9952 -38643
6633c8643j7304j7387n5408M3316O8005K8736N3963K5133n0776L537M0302j5381
$$ -38643 -55947 -73334 -128742 -85426 -17421 11315 65278 90411 39635 43172 83474 68093
6621F8093n7161q2246l3788L3471K8503j408n2051m7824R3591O1248j2635k0440
$$ 68093 10932 -71314 -105102 -71631 -43128 -44536 -96587 -144411 -50820 10428 -2207 -22647
6609b2647K660K4370L862N1956k5766l170j1558m7845K0172K5107j7203K812j1345
$$ -22647 -19987 4383 8245 60201 34435 31265 19707 -28138 -7966 17141 -62 2750 -8595
6596h595J623l661l965k1688l9407J3495J0356j965L7604Q484j5391L7989J4849
$$ -8595 -6972 -10633 -14598 -36286 -75693 -62198 -51842 -53807 -16203 -7719 -23110 14879 29728
6583B9728l5438r690j9996k7596j6756J0092n81J0677M5675q290k537K658J6022
$$ 29728 -5710 -15400 -35396 -62992 -79748 -69656 -70237 -59560 -13885 -22175 -24712 -22054 -6032
6570f032l6642k8483j6627M2915K7882Q830j5254k087K4804j2908K1768J934n1504
$$ -6032 -42674 -71157 -87784 -44869 -16987 -8157 -23411 -25498 -694 -13602 8166 10100 -41404
6557d1404k4874j1443o786m692R546J7204P1066K9980k6153o8430k7397N1845
$$ -41404 -66278 -77721 -84507 -89199 -79653 -62449 8617 38597 12444 -55986 -83383 -31538
6545c1538N1984o269J705j7401j4599j6708J2872M166J6441j5779j9658m3565
$$ -31538 20446 14177 15882 -1519 -16118 -32826 -19954 -15788 653 -15126 -34784 -78349
6533g8349J7464J6712J6896J0665p499J6J575k0816j7081m032M2439k254p2350
$$ -78349 -60885 -44173 -27277 -16612 -24111 -24095 -22520 -43336 -60417 -64449 -22010 -24264 -96614
6520i6614l371q177l1977J155Q3219K3027j381K3896m535o193K4349J3690K4137
$$ -96614 -99985 -108162 -140139 -138984 -55765 -32738 -34119 -10223 -14758 -20951 3398 17088 41225
6507D1225p379p054j7940j7551J4071p268j0064J8520j1488J4497J9229N156L2554
$$ 41225 33846 26792 8852 -8699 5372 -1896 -11960 6560 -4928 9569 28798 33954 66508
6494F6508j1043m5477o0261m6653L7094K8110K6864L2672m0740m947J9035J065
$$ 66508 55465 9988 -50273 -96926 -59832 -31722 -4858 27814 -12926 -17873 1162 2227
6482B227k7813l4949M6916O7496k5406J65K3158n9384N299N0533K3604k2311j8159
$$ 2227 -25586 -60535 -13619 53877 28471 28636 51794 -7590 -2291 48242 71846 49535 31376
6469C1376m52j2897j9757l1734L8705L3504L1023J8147l7488k8942k9898j1736
$$ 31376 30924 18027 -1730 -33464 5241 38745 69768 87915 50427 21485 -8413 -20149
6457b0149m6691o200N8651m677k6680k5555J2680m350R641q160j4830K196N9033
$$ -20149 -66840 -73040 -14389 -19066 -45746 -71301 -58621 -62971 -53330 -61490 -76320 -74124 -15091
6444a5091M223j8753O375j1311O459L4231j0988n1328m6218M80K2942J4572K1738
$$ -15091 -10868 -29621 -23246 -34557 -28098 6133 -4855 -56183 -102401 -101921 -78979 -64407 -42669
6431d2669K75J3267J2605l883N6562N2199j6338j6183o2281j6465Q553L5693k5114
$$ -42669 -42394 -29127 -16522 -20405 36157 88356 72018 55835 -6446 -22911 -14358 21335 -3779
6418c779l8416K9712j7082J539K1845k9970N619m370j4532K1009j0925J9404L8917
$$ -3779 -42195 -12483 -29565 -28026 -6181 -36151 -30532 -34902 -49434 -28425 -39350 -19946 18971
6405A8971L4864r163J7178n8465n0343k7240O914k4942M382N4973K2250J5158
$$ 18971 53835 44672 61850 3385 -46958 -74198 -67284 -92226 -87844 -32871 -10621 4537
6393D537n903k6107N460J6975n353J6204Q095o129m5141k8511L1955M0785J3883
$$ 4537 -1366 -27473 -22013 -5038 -10391 5813 13908 7779 -37362 -65873 -33918 6867 20750
6380B0750r22l4991l9649r562o111L0054n287R358O7309k4152M839k3663L5683
$$ 20750 19828 -15163 -54812 -64374 -70485 -40431 -45718 -36360 30949 6797 11636 -12027 23656
6367B3656K2898j4103J4708j1959r722l2054k915L834n734K8401J659j0915j372
$$ 23656 46554 32451 47159 35200 25478 -6576 -9491 -5657 -11391 17010 18669 7754 6382
6354F382l6321Q228l8064M3438J1126j2911J9130Q498L2928j2842l5622j5132
$$ 6382 -29939 -21711 -59775 -16337 -5211 -18122 1008 9506 42434 29592 -6030 -21162
6342b1162R815M759k547L5770k776J6542J2881j2095J1728j7757k5237k8579K4451
$$ -21162 -11347 -6588 -9135 26635 23859 40401 53282 41187 52915 35158 9921 -18658 5793
6329E793K8575M5474l6021l5340m563L2095k0140P189L715j6303L5019P630l6567
$$ 5793 34368 79842 43821 8481 3918 36013 15873 23062 26777 10474 45493 53123 16556
6316A6556m7083L860L4444J3039J6615k0505J3341J1608J2405n7287N4616R292
$$ 16556 -30527 -26667 7777 20816 37431 16926 30267 41875 54280 -3007 51609 60901
6304F0901l2323k6899p8691j0062J0669J4119J9164o881q460l3457o55k6993K8529
$$ 60901 28578 1679 -77012 -87074 -76405 -62286 -43122 -50003 -58463 -91920 -92575 -119568 -91039
6291i1039K7486J3720L1879Q0153l3779J466R606J0161l165k2565J6753K6482
$$ -91039 -63553 -49833 -17954 62199 28420 29886 39492 49653 46488 23923 40676 67158
6279F7158k4333o0538j8906K9423J4888J0848o388J5109K7937M039k4228q426
$$ 67158 42825 -17713 -36619 -7196 7692 18540 12152 27261 55198 59237 35009 26583
6267B6583n99R982j2964l2263M5945J0732m1666k4458k0976K7145M0154k0920
$$ 26583 25984 35966 23002 -9261 36684 47416 5750 -18708 -39684 -12539 27615 6695
6255F695o0068J558O875M7401K8201M320o543J477M4293J6514l8877l178j6959
$$ 6695 -53373 -51815 -44940 2461 30662 34982 28439 29916 74209 90723 51846 48668 31709
6242C1709j8449L840l0793j2850j749M0944N0406n1398j5031Q708J8070j8817
$$ 31709 13260 17100 -13693 -26543 -28292 12652 63058 11660 -3371 5337 23407 4590
6230D590l3927m546M5913p280j9800l0280M615M8668l6382l9761K0444L4554K1322
$$ 4590 -29337 -33883 12030 4750 -15050 -45330 -40715 7953 -28429 -68190 -47746 -13192 8130
6217H130j6722P940l219L746P7614l3748l9260K5170n2196n8821m774l963L6427
$$ 8130 -8592 -652 -3871 -125 77489 43741 4481 29651 -22545 -81366 -86140 -90103 -53676
6204e3676J6375P853l2920L5344N1711j1516k5352n155N238J8651m5109k2157
$$ -53676 -37301 -29448 -62368 -27024 24687 13171 -12181 -17336 -12098 6553 -38556 -60713
6192f0713J3234M1256j5250K3797K3440O384M361l3850j900o3120J4513L3359
$$ -60713 -47479 -6223 -21473 2324 25764 32148 36509 2659 759 -62361 -47848 -14489
6180a4489j3557J1736j1569K0555K4548l1156p335J6145K5627j110q816J5225
$$ -14489 -28046 -16310 -27879 -7324 17224 -13932 -21267 -5122 20505 19395 10579 25804
6168B5804j9946J7511k9360j572p538J221J4885N362j870m1569R003k581J51J4357
$$ 25804 5858 23369 -5991 -7563 -15101 -13880 1005 6367 4497 -37072 -28069 -30650 -30499 -16142
6154a6142K6118J4395R356J3705N101l4774o3095j9753j731m831O7294J2289j8493
$$ -16142 9976 24371 33727 47432 52533 17759 -45336 -65089 -66820 -71651 -4357 7932 -10561
6141a0561r733K6068l0316J5770L1638M445k7273j1505L0404m2046k958j294q393
$$ -10561 -20294 5774 -24542 -8772 22866 27311 38 -11467 18937 -23109 -26067 -27361 -35754
6128c5754J22L0683P347L7863n253j5514n2919l3779K4905k7827k2324K4478M8646
$$ -35754 -35632 -4949 2398 40261 35008 19494 -33425 -67204 -42299 -70126 -92450 -67972 -19326
6115a9326N324l3485l3219J4757j4068j9391j8371L675K1764L9876P9720J8107
$$ -19326 -14002 -47487 -80706 -65949 -80017 -99408 -117779 -114104 -92340 -52464 27256 45363
6103D5363P005M628o851p0225k8708L3196l3059l7319L0328M2746J0621L7451
$$ 45363 52368 56996 50145 -20080 -48788 -15592 -48651 -85970 -55642 -12896 -2275 35176
6091C5176m123J4112J2661k2541K2429k6478J85j573l2920k115J3899L06m3133
$$ 35176 31053 45165 57826 35285 57714 31236 31421 29848 -3072 -5187 8712 9018 -34115
6078c4115j6251m4693P350N283L6180M652N090K1698n290l8601m8061L1394J3430
$$ -34115 -50366 -95059 -87709 -82426 -46246 -41594 -36504 -14806 -20096 -58697 -106758 -75364 -61934
6065f1934P773K863j3177r210K9638M4131j508l655n084M0179O227k4626n8752
$$ -61934 -54161 -51298 -64475 -73685 -44047 84 -1424 -5079 -10163 30016 36243 11617 -47135
6052d7135l3525j8781K2496M6895J7242q315N213m4270j5170K7007M4034j940
$$ -47135 -80660 -99441 -76945 -30050 -12808 -21123 -15910 -60180 -75350 -48343 -4309 -6249
6040f249L9656m063j3152J0927P032n5990j6687K4117r783J2983J8909n4013l0607
$$ -6249 33407 29344 16192 27119 34151 -21839 -38526 -14409 -24192 -11209 7700 -46313 -76920
6027g6920m3561L4730N6757J4457k8256p092M6943k0331M562J9609m70k4369j4891
$$ -76920 -120481 -85751 -28994 -14537 -42793 -49885 -2942 -23273 -18711 898 428 -23941 -38832
6014c8832q279K711J2199K7847q877j352J2819J4629K8753l7950n1272K1957L2431
$$ -38832 -47111 -44400 -32201 -4354 -13231 -14583 -1764 12865 41618 3668 -47604 -25647 6784
6001F784P662j3630P13o022K3436k500Q461k7168Q886k3031k9965K7192K9868
$$ 6784 14446 816 1529 -4493 18943 16443 24904 -2264 6622 -16409 -46374 -19182 10686
5988A0686p234n8985r760O821J4457L1999L9789K5749o3606l1425P320J1640L4190
$$ 10686 3452 -55533 -65293 -58472 -44015 -12016 27773 53522 -10084 -41509 -34189 -22549 11641
5975A1641k9610L304K0247M1056j5400J5814j6329j0486j9690k8642L0074j8844
$$ 11641 -17969 -14665 5582 46638 31238 47052 30723 20237 547 -28095 1979 -16865
5963a6865J8226L2310k4044l9970j267m1908q999K1991K0248L1694n702K1913
$$ -16865 1361 33671 9627 -30343 -31610 -73518 -82517 -60526 -40278 -8584 -14286 7627
5951G627m238k5238n4206M457J2708n656N9471P7303m6548m2291l2207J9530K7205
$$ 7627 3389 -21849 -76055 -71598 -58890 -64546 -5075 72228 25680 -16611 -48818 -29288 -2083
5938b083K7957k55j5502J7317M7946k8361j2496M425o024k7512l0514l1147k5514
$$ -2083 25874 25619 10117 27434 75380 47019 34523 38948 32924 5412 -25102 -56249 -81763
5925h1763N7357P194l7909P957K6605K3213L5998M762j4214l5246k1199K3358
$$ -81763 -24406 -17212 -55121 -47164 -20559 2654 38652 43414 29200 -6046 -27245 -3887
5913c887N949r847l5375o068N1757J686m921L528l0661j2820m0431L1134L9162
$$ -3887 2062 -7785 -43160 -49228 2529 4215 -706 2822 -27839 -40659 -81090 -49956 -10794
5900a0794k1468J184j4728k4632L6362M7419k3765j6251K0326M388j229K1214
$$ -10794 -32262 -31078 -45806 -70438 -34076 13343 -10422 -26673 -6347 -1959 -3188 18026
5888A8026M563k777K5808k8631k7967J4453k5578m4788j4449K8934P6475L2341
$$ 18026 22589 19812 45620 16989 -10978 3475 -22103 -66891 -81340 -52406 24069 56410
5876E6410q133n2628l576L5621k2153k334M840K1581J7835N928k002k2461R261
$$ 56410 48277 -4351 -7927 27694 5541 3207 8047 29628 47463 53391 51389 28928 38189
5863C8189l7932n2065j5514o265K1561N3354o160k4848M85l1207L262M5129N1787
$$ 38189 257 -51808 -67322 -73587 -52026 1328 -4832 -29680 -29195 -60402 -57140 -12011 39776
5850C9776j4478j941J5089K5583K8767n5707l0478J075K1742K2661n7690l6391
$$ 39776 25298 23357 38446 64029 92796 37089 6611 7686 29428 52089 -5601 -41992
5838d1992L0754J2278l5220k8078j9421n968K1761P4352M3633k5051Q462j2723
$$ -41992 -11238 1040 -34180 -62258 -81679 -87647 -65886 8466 52099 27048 35510 22787
5826B2787q09J0051l0071k9517K2628J7629k8018L4447M9149j3386n456k6415
$$ 22787 21978 32029 1958 -27559 -4931 12698 -15320 19127 68276 54890 49434 23019
5814B3019k196M493m7639l5019r253L4940K1945k6299n39r762N8478j959n5234
$$ 23019 20823 25316 -22323 -57342 -66595 -31655 -9710 -36009 -36548 -46310 12168 10209 -45025
5801d5025m5878l3744K1703N2832K418L0884j0067j0733M0672K0037k6341j2042
$$ -45025 -90903 -124647 -102944 -50112 -47694 -16810 -26877 -37610 3062 23099 -3242 -15284
5789a5284o816K5845K9640k1365J3518l1847k5352N9917M083M7423K808n7479
$$ -15284 -22100 3745 33385 12020 25538 -6309 -31661 28256 32339 79762 82570 25091
5777B5091l2967r892o446L1687L87J54M2632k5493m9256k2527K1371K7052K1452
$$ 25091 -7876 -17768 -24214 7473 7860 8014 50646 25153 -24103 -46630 -25259 1793 23245
5764B3245j6059l9719l2495j0896j8245K2963O3099N503j9966k5320r344K150
$$ 23245 7186 -32533 -65028 -75924 -94169 -71206 -8107 -2604 -22570 -47890 -57234 -55084
5752e5084K9622J8660p757N129J5983k5679n3132o5329L1228K7076K0465K4385
$$ -55084 -25462 -6802 -14559 -9430 6553 -19126 -72258 -137587 -106359 -79283 -58818 -34433
5740c4433j981l921j8002r380N391r303K6739L7635K3200l876l1247k4884J9943
$$ -34433 -36414 -40335 -58337 -67717 -62326 -71629 -44890 -7255 15945 12069 -19178 -44062 -24119
5727b4119L2243k0529j5744n249J9482M4684J3701R976n1573r493K3518N0812
$$ -24119 8124 -12405 -28149 -33398 -13916 30768 44469 54445 2872 -6621 16897 67709
5715F7709p367m5832k5155L8132N6835k0278k9125r938l2959Q208K2195L658n667
$$ 67709 60342 14510 -10645 27487 84322 64044 34919 24981 -7978 230 22425 26083 20416
5702B0416l0240l8186O572P579J3010Q487k4892j3273k276k623L8357J3594j0406
$$ 20416 -9824 -48010 -41438 -33859 -20849 -12362 -37254 -50527 -52803 -55426 -17069 -3475 -13881
5689a3881J934J1752J2928j1276m4372Q901K9329k2195k3171N674N5410j0050
$$ -13881 -11947 -195 12733 1457 -42915 -34014 -4685 -26880 -50051 -44377 11033 983
5677I83m4512l354O9764R041k6667l0251o3373j5642N9742Q284M789m3873m3637
$$ 983 -43529 -46883 22881 31922 5255 -24996 -88369 -104011 -44269 -35985 -31196 -75069 -118706
5664a18706M3794M2557r152l3102P310L1046k1921K1954j7593j8945k0941J1289
$$ -118706 -74912 -32355 -41507 -74609 -67299 -36253 -58174 -36220 -53813 -72758 -93699 -82410
5652h2410p951q06N0781M4718K1254j3180k45j8718j5326r43K3101n529M973o18
$$ -82410 -90361 -91167 -40386 4332 25586 12406 12161 -6557 -21883 -22826 275 -5254 -281 -899
5638h99o718J0598o914J2785l0137j1062l4412L772L0572n2747k859J3692K6023
$$ -899 -7617 2981 -3933 8852 -21285 -32347 -66759 -62987 -32415 -85162 -88021 -74329 -48306
5625d8306N6945L2309m506m4017n449o463J4903J4698O603K6992M304j3407k0073
$$ -48306 8639 40948 36442 -7575 -13024 -19487 -4584 10114 16717 43709 48013 34606 14533
5612A4533l2558n9325J4966J1450L7446p298n777J8805k6748n415M9482J3899
$$ 14533 -18025 -77350 -62384 -50934 -13488 -20786 -26563 -7758 -34506 -39921 9561 23460
5600B3460J7308j9147l3529K9422K7662L208m5367k9727P933Q579Pj3997M0869
$$ 23460 40768 21621 -11908 17514 45176 48384 3017 -26710 -18777 -10198 -10191 -24188 16681
5587A6681K9251J3843k5316j6214n269N63n3824o1556O4951L0701o262L3060L0173
$$ 16681 45932 59775 34459 18245 12976 13539 -40285 -101841 -36890 -6189 -12451 20609 50782
5574E0782q868k860K5170m8252p7671r101J653m460L2053K3421l4714j9592j0866
$$ 50782 41914 39054 64224 15972 -61699 -70800 -69147 -73607 -41554 -18133 -52847 -72439 -83305
5561h3305M3022K4176l8975j7205O519K3702J5501L4903J3292M4121j2366k0519
$$ -83305 -40283 -16107 -55082 -72287 -65768 -42066 -26565 8338 21630 65751 53385 32866
5549C2866p607L6371M719m1690j3926r429k0701l5631m3498m295p227L0444K5428
$$ 32866 25259 61630 66349 24659 10733 1304 -19397 -55028 -98526 -102821 -110048 -79604 -54176
5536e4176k519l1375J8464M6588K853j6875k3254k0797j7310M8049O0546k1083
$$ -54176 -56695 -88070 -69606 -23018 -20165 -37040 -60294 -81091 -98401 -50352 10194 -10889
5524a0889j8314M4328P01k740j115K4194j6267R291Q570J4156m792l2978J4208
$$ -10889 -29203 15125 15826 13086 11971 36165 19898 29189 37759 51915 47123 14145 28353
5511B8353J8154L1079l3356o0931j1400J2860P784m1795N9847M575j53j6386J1602
$$ 28353 46507 77586 44230 -16701 -28101 -15241 -7457 -49252 10595 15170 15017 -1369 10233
5498A0233j1866R9j872r498n978j4169j8634L9409k965j5623j6210J4576r694
$$ 10233 -1633 -1534 -3406 -12904 -18882 -33051 -51685 -12276 -15241 -30864 -47074 -32498 -42192
5485d2192k3807j266R615l061l868N546p905K2196P0142m7587l2371N1737J2162
$$ -42192 -65999 -67265 -57650 -60711 -64579 -59033 -66938 -44742 25400 -22187 -54558 -2821 9341
5472I341j0470L8015J0905k7843r482K9981l5223K1160q458R651L1776l5788n354
$$ 9341 -1129 36886 47791 19948 10466 40447 5224 26384 17926 27577 59353 23565 18211
5459A8211O2328J1822o0327p4557l8826K9043O6082J5077O020J6434L1104J3210
$$ 18211 80539 92361 32034 -42523 -81349 -52306 13776 28853 34873 51307 82411 95621
5447I5621j8873J753k1553J2150m3168l9648N626P455r050o313n814k2956N866
$$ 95621 76748 78501 56948 69098 25930 -13718 -8092 -637 -9687 -16000 -21814 -44770 -38904
5434c8904N440Q227L3722q764J6398l903o040l5693k335L4621M378R724j2732
$$ -38904 -33464 -25237 8485 -279 16119 12216 6176 -29517 -31852 2769 7147 16871 4139
5421D139l131n366j1542N797L3116J7351l0742J8341M7138J0640m0403o3800l915
$$ 4139 1008 -4358 -15900 -10103 23013 40364 9622 27963 75101 85741 45338 -18462 -22377
5408b2377J0134J1744m1075K812J0440M1510p434n8007K693P469L014K0561K2374
$$ -22377 -12243 -499 -41574 -38762 -28322 13188 5754 -52253 -49560 -42091 -39077 -18516 3858
5395C858l098O765j4984k0520M0525M175k4270k4576J3168N5481O5285k2211N734
$$ 3858 760 7525 -7459 -27979 12546 16721 -7549 -32125 -18957 36524 101809 79598 85332
5382H5332L512n408m303m1707m6980l511j712k8407j0312K98N8102K1724K068
$$ 85332 88844 83436 79133 37426 -9554 -13065 -14777 -43184 -53496 -53198 4904 26628 28696
$$ [...]
##END NTUPLES=NMR SPECTRUM
##END=
