##TITLE=Analysis number 327364
Compound Code tl 00263
Book Reference 92652
Project Code adrs flro3
Chemist Name jom
##JCAMPDX= 6.0         $$ Bruker NMR JCAMP-DX V2.0
##DATA TYPE= NMR SPECTRUM
##DATA CLASS= NTUPLES
##ORIGIN= Bruker BioSpin GmbH
##OWNER= nmr
$$ XWIN-NMR		Version 3.5
$$ Thu Mar 22 13:17:30 2007 GMT Standard Time (UT+0h)  MAYBRIDGE\nmr@NMR_250MHZ
##.OBSERVE FREQUENCY= 250.131544655141
##.OBSERVE NUCLEUS= ^1H
##.ACQUISITION MODE= SIMULTANEOUS (DQD)
##.ACQUISITION SCHEME= undefined
##.AVERAGES= 16
##.DIGITISER RES= 18
##SPECTROMETER/DATA SYSTEM= dpx250
##.PULSE SEQUENCE= zg30
##.SOLVENT NAME= DMSO
##.SHIFT REFERENCE= (INTERNAL, DMSO, 0, 16.522)
##AUDIT TRAIL= $$ (NUMBER, WHEN, WHO, WHERE, WHAT)
$$ ##TITLE= Audit trail, XWIN-NMR		Version 3.5
$$ ##JCAMPDX= 5.01
$$ ##ORIGIN= Bruker BioSpin GmbH
$$ ##OWNER= nmr
$$ C:\u/data/dgb/nmr/ADRS/1720/pdata/1/auditp.txt
$$ ##AUDIT TRAIL=  $$ (NUMBER, WHEN, WHO, WHERE, WHAT)
(   1,<2007-03-22 13:17:08.24 +000>,<MAYBRIDGE\nmr>,<NMR_250MHZ>,
      <created by zg, POWCHK disabled, PULCHK disabled
       configuration hash MD5:
       49 4B E0 1D 92 C2 6B 37 9F E6 65 BC 52 41 86 1D
       data hash MD5: 64K
       27 93 47 77 FC A2 09 74 EA 4E B9 98 F1 1D 49 F2>)
(   2,<2007-03-22 13:17:20.93 +000>,<MAYBRIDGE\nmr>,<NMR_250MHZ>,
      <Start of raw data processing
       ef LB = 0.3 FT_mod = 6 PKNL = 1 SI = 32K 
       data hash MD5: 32K
       A9 DB 20 D8 5C 9B 1D 25 FB 7C 81 77 5F EE 39 30>)
(   3,<2007-03-22 13:17:22.71 +000>,<MAYBRIDGE\nmr>,<NMR_250MHZ>,
      <apk 
       data hash MD5: 32K
       93 C8 87 F6 33 FE D1 3D 7D 1C A2 04 4A 7D 49 A8>)
(   4,<2007-03-22 13:17:23.54 +000>,<MAYBRIDGE\nmr>,<NMR_250MHZ>,
      <abs ABSG = 5 
       data hash MD5: 32K
       9C AA 76 DE 94 35 4F F2 DE A8 D8 FA B9 A9 B6 44>)
$$ ##END=
$$ 
$$ hash MD5
$$ EF 9B AB 30 62 E9 A8 0B 7C 68 17 2B 3B 71 7F FB
##$RELAX= 
##$RELAX= 
##$RELAX= 
##$RELAX= 
##$RELAX= 
##$RELAX= 
##$RELAX= 
$$ Bruker specific parameters
$$ --------------------------
##$DU= <C:\u>
##$EXPNO= 1720
##$NAME= <ADRS>
##$PROCNO= 1
##$TYPE= <nmr>
##$USER= <dgb>
##$AMP= (0..31)
100 100 100 100 100 100 100 100 100 100 100 100 100 100 100 100 100 100 
100 100 100 100 100 100 100 100 100 100 100 100 100 100 
##$AQSEQ= 0
##$AQ_mod= 3
##$AUNM= <au_zg>
##$AUTOPOS= <31 >
##$BF1= 250.13
##$BF2= 250.13
##$BF3= 250.13
##$BF4= 250.13
##$BF5= 500.13
##$BF6= 500.13
##$BF7= 500.13
##$BF8= 500.13
##$BYTORDA= 1
##$CFDGTYP= 0
##$CFRGTYP= 5
##$CHEMSTR= <none>
##$CNST= (0..31)
1 1 145 1 1 1 1 1 1 1 1 1 1 1 1 1 1 1 1 1 1 1 1 1 1 1 1 1 1 1 1 1 
##$CPDPRG= <>
##$CPDPRG1= <>
##$CPDPRG2= <>
##$CPDPRG3= <>
##$CPDPRG4= <mlev>
##$CPDPRG5= <mlev>
##$CPDPRG6= <mlev>
##$CPDPRG7= <mlev>
##$CPDPRG8= <mlev>
##$CPDPRGB= <>
##$CPDPRGT= <>
##$D= (0..31)
0 1 0 0 0 0 0 0 0 0.06 0 0 0 0 0 0 0.0002 0 0 0 0 0 0 0 0 0 0 0 0 0 0 
0 
##$DATE= 1174569426
##$DBL= (0..7)
120 120 120 120 120 120 120 120 
##$DBP= (0..7)
150 150 150 150 150 150 150 150 
##$DBP07= 0
##$DBPNAM0= <>
##$DBPNAM1= <>
$$ [...]
##$SUBNAM7= <"">
##$SUBNAM8= <"">
##$SUBNAM9= <"">
##$SW= 20.6930455092707
##$SWIBOX= (0..15)
0 0 3 0 0 0 0 0 0 0 0 0 0 0 0 0 
##$SW_h= 5175.983436853
##$TD= 65536
##$TD0= 1
##$TE= 683.16
##$TE2= 300
##$TE3= 300
##$TEG= 300
##$TL= (0..7)
0 120 120 120 120 120 120 120 
##$TP= (0..7)
150 150 150 150 150 150 150 150 
##$TP07= 0
##$TPNAME0= <>
##$TPNAME1= <>
##$TPNAME2= <>
##$TPNAME3= <>
##$TPNAME4= <>
##$TPNAME5= <>
##$TPNAME6= <>
##$TPNAME7= <>
##$TPOAL= (0..7)
0.5 0.5 0.5 0.5 0.5 0.5 0.5 0.5 
##$TPOFFS= (0..7)
0 0 0 0 0 0 0 0 
##$TUNHIN= 0
##$TUNHOUT= 0
##$TUNXOUT= 0
##$USERA1= <user>
##$USERA2= <user>
##$USERA3= <user>
##$USERA4= <user>
##$USERA5= <user>
##$V9= 5
##$VALIST= <valist>
##$VCLIST= <CCCCCCCCCCCCCCC>
##$VD= 0
##$VDLIST= <DDDDDDDDDDDDDDD>
##$VPLIST= <PPPPPPPPPPPPPPP>
##$VTLIST= <TTTTTTTTTTTTTTT>
##$WBST= 1024
##$WBSW= 4
##$XGAIN= (0..3)
0 0 0 0 
##$XL= 0
##$YL= 0
##$YMAX_a= 254205
##$YMIN_a= -283751
##$ZGOPTNS= <>
##$ZL1= 120
##$ZL2= 120
##$ZL3= 120
##$ZL4= 120
##$ABSF1= 16.522
##$ABSF2= -4.171173
##$ABSG= 5
##$ABSL= 3
##$ALPHA= 0
##$AQORDER= 0
##$ASSFAC= 0
##$ASSFACI= 0
##$ASSFACX= 0
##$ASSWID= 0
##$AUNMP= <proc_1d>
##$AZFE= 0.1
##$AZFW= 0.1
##$BCFW= 0
##$BC_mod= 0
##$BYTORDP= 0
##$COROFFS= 0
##$CY= 12.5
##$DATMOD= 1
##$DC= 0
##$DFILT= <>
##$DTYPP= 0
##$F1P= 14.0000005364418
##$F2P= -0.99999901652339
##$FCOR= 0.5
##$FTSIZE= 32768
##$FT_mod= 6
##$GAMMA= 0
##$GB= 0
##$INTBC= 1
##$INTSCL= 1
##$ISEN= 128
##$LB= 0.3
##$LEV0= 0
##$LPBIN= 0
##$MAXI= 10000
##$MC2= 0
##$MEAN= 0
##$ME_mod= 0
##$MI= 0
##$NCOEF= 0
##$NC_proc= -4
##$NLEV= 6
##$NOISF1= 0
##$NOISF2= 0
##$NSP= 0
##$NTH_PI= 0
##$NZP= 0
##$OFFSET= 16.522
##$PC= 1
##$PHC0= 225.1378
##$PHC1= 6.190683
##$PH_mod= 1
##$PKNL= yes
##$PPARMOD= 0
##$PSCAL= 4
##$PSIGN= 0
##$REVERSE= no
##$SF= 250.13
##$SI= 32768
##$SIGF1= 0
##$SIGF2= 0
##$SINO= 400
##$SIOLD= 32768
##$SREGLST= <1H.DMSO>
##$SSB= 0
##$STSI= 32768
##$STSR= 0
##$SW_p= 5175.98343685301
##$SYMM= 0
##$S_DEV= 0
##$TDeff= 65536
##$TDoff= 0
##$TI= <Analysis number 999999
Compound Code 99
Book Reference 9
Project Code 9>
##$TILT= no
##$TM1= 0
##$TM2= 0
##$TOPLEV= 0
##$USERP1= <user>
##$USERP2= <user>
##$USERP3= <user>
##$USERP4= <user>
##$USERP5= <user>
##$WDW= 1
##$XDIM= 32768
##$YMAX_p= 487303768
##$YMIN_p= -325876
$$ End of Bruker specific parameters
$$ ---------------------------------
##NTUPLES= NMR SPECTRUM
##VAR_NAME=  FREQUENCY,     SPECTRUM/REAL,   SPECTRUM/IMAG
##SYMBOL=    X,             R,               I
##VAR_TYPE=  INDEPENDENT,   DEPENDENT,       DEPENDENT
##VAR_FORM=  AFFN,          ASDF,            ASDF
##VAR_DIM=   32768,         32768,           32768
##UNITS=     HZ,            ARBITRARY UNITS, ARBITRARY UNITS
##FACTOR=    0.157963299565203, 1,           1
##FIRST=     4132.6476996994, 0,             0
##LAST=      -1043.33573715361, 0,           0
##MIN=       -1043.33573715361, -325876,     0
##MAX=       4132.6476996994, 487303768,     0
$$ Real data points
##PAGE= N=1
##DATA TABLE= (X++(R..R)), XYDATA
$$ [...]
21737 53679 91057 71197 67465 -21784 -113135 -109235 -124612 -128456 -61716 -22296 -60373 -80216
21725 -80216 -83511 -69883 22642 37558 70296 62941 48133 46683 67022 31042 58215 80167
21713 80167 23822 36976 103673 175353 147127 59200 -59831 -82787 -120814 -39907 2570
21702 2570 71134 168032 87560 -375 -42098 -79866 -17600 19313 -76014 -155758 -116714 -11823
21690 -11823 34505 32112 89561 60634 46944 46165 28108 -33368 -30730 -7511 -1938 17411 -41647
21677 -41647 -56033 -29414 15934 37518 33656 33908 7583 9410 74032 97986 43274 58577
21665 58577 95611 97363 105998 181509 124651 135552 91507 36441 33589 57517 80924 71559
21653 71559 119052 161255 182272 86775 -121348 -92638 -16637 -36483 -21849 -23825 34099 116756
21641 116756 152464 169838 128588 -13949 53232 174247 84910 37533 58129 93843 89745
21630 89745 -17158 -38128 60010 24349 40665 9803 2819 -71906 -115814 -89659 -74394 -25192
21618 -25192 3052 42892 57313 141784 189006 120434 152596 74721 -16874 -3115 -27265 -74693
21606 -74693 -4494 27133 46452 15913 -95946 -29792 82835 11967 -51331 -157304 -237669
21595 -237669 -221461 -90458 -3086 32448 -17477 -67917 -13549 29108 63644 24204 94466
21584 94466 138555 123858 56320 65026 113702 86761 81478 97386 67211 -2003 -11222 -3067
21572 -3067 62248 5962 -50503 -10687 -26135 20654 141337 130058 117908 127959 74759 18033
21560 18033 40272 67143 98406 112315 62780 -64146 -147155 -97475 -31299 -41338 -12441
21549 -12441 -33480 -31767 -49410 -50895 -45796 -7389 43309 25485 -32985 -119837 -91511 -32701
21537 -32701 -27190 -10443 -18752 -27988 23361 79626 98135 69557 57207 -13953 -70796 -163880
21525 -163880 -130035 -32090 61919 104931 114517 82831 50861 -1215 -25392 -13898 37245 50461
21513 50461 90951 81855 128392 87646 73782 5922 -21092 51322 56857 79932 26913 21946
21501 21946 -11204 -52967 -88144 10840 49424 50957 88860 30233 97407 98439 137493 209281
21489 209281 215947 124038 133481 158988 98345 -48849 -81501 -28721 -16356 -50054 -19518 -66024
21477 -66024 -135604 -166068 -46417 -32837 -10372 47079 43872 1501 34147 45678 -23361 -159631
21465 -159631 -69820 -38869 -104122 -142239 -123672 -28682 53556 103786 133959 130599 96662 61211
21453 61211 6369 40150 16371 8978 17970 101759 124509 116613 105893 76871 80269 15844
21441 15844 59522 51796 16697 56291 36568 12580 -8460 607 -5027 28276 -79488 -117269
21429 -117269 -37673 -8380 52997 34886 86651 49006 21737 41631 53788 69837 83579
21418 83579 117839 80556 86021 60596 68564 130599 155228 167743 146565 99656 54324 36321
21406 36321 80691 59334 107301 193245 207650 190344 70898 65494 81816 2880 -99204
21395 -99204 -56619 -8738 34209 24586 1312 -24183 -17421 -10129 -12266 23904 -11098 -52585
21383 -52585 -22709 12199 14923 5773 754 47819 14526 700 31343 48882 7950 -57970
21371 -57970 -123742 -56832 -7229 73713 44713 41281 85338 55513 46816 32932 48255 -6580
21359 -6580 -109028 -90761 -67465 -62605 -34752 26212 52134 92236 36127 -59166 -113689 -109973
21347 -109973 -111712 -97898 -44585 25126 3452 -17656 -70425 -71675 -71922 -52286 -13338 15185
21335 15185 35321 76401 62872 -10939 -82351 -20795 -70403 -125549 -103430 -74403 -41000 -43694
21323 -43694 -86941 -75861 -64481 -77720 -64984 -31635 -29062 -107515 -260809 -230521 -243314 -207083
21311 -207083 -174760 -166547 -116688 -54326 -28598 26537 44263 53101 8387 48546 3736 -93941
21299 -93941 -81620 -52064 -26855 -27406 -61602 -79191 -28225 28911 28088 45421 -16581 -845
21287 -845 46309 35170 37166 4705 -1239 -15225 -28007 -2575 -16490 -4250 -8329 -29887 -50970
21274 -50970 -41513 -55736 -63901 -59882 -80874 -182871 -224631 -273984 -166441 -48498 -22720 -117464
21262 -117464 -56929 53697 98281 147576 146470 35215 33180 17739 -19044 -40753 -66919
21251 -66919 -129128 -83620 -63234 -72564 -50058 39218 68547 44642 66356 59348 55278 7263
21239 7263 3331 31358 70286 52984 -4664 -9042 13926 -2546 -6947 -74206 -140649 -149355 -62921
21226 -62921 4416 -15782 51149 82733 14119 18110 15058 9037 70291 136407 168551 129338
21214 129338 95586 89003 45119 13385 101080 133465 94233 -14284 -28740 -13645 -8865 16135
21202 16135 11379 -16545 -26775 -51241 -68725 -117779 -34994 -27887 -80678 -13530 -48797 -157901
21190 -157901 -132816 -185667 -160409 -104566 -53829 4378 -30058 -39310 9724 85825 133889 48471
21178 48471 44476 90649 -4357 -44695 -21602 17394 -22570 2309 112486 57971 21202 50099
21166 50099 10462 38841 94909 115039 52531 48608 17412 18492 100827 140138 122433 86537
21154 86537 71942 26306 -73711 -226324 -307466 -225163 -111331 -123934 -138885 -120263 -88195
21143 -88195 -85696 -104697 -5770 -37048 -78994 -112549 -134922 29171 111797 121250 11836 -66064
21131 -66064 -70128 -25676 -47740 -59828 -73586 7730 110717 88099 49442 -24999 -29619 -92350
21119 -92350 -93267 -7049 -3576 -30844 -46710 -80109 -66022 -60252 -71582 58109 64555 70462 51798
21106 51798 45327 10575 -23199 -5475 -40908 -120385 -142495 -95167 -134627 -154661 -170633 -95891
21094 -95891 -2155 24223 66278 60188 19962 -17031 -68969 -55904 -45721 8661 19585 -8953
21082 -8953 -2504 83334 136897 131325 34323 -68465 -64046 -33979 -5681 32225 22062 -12702
21070 -12702 -33487 11932 110182 81906 113934 129670 20257 -90791 -45513 14039 -25313
21059 -25313 -47297 -86762 -110533 -69453 -42189 5447 20459 2684 -19356 -26447 -44738 -91664
21047 -91664 -61828 -2647 10161 23676 -8402 -13811 36814 -63812 -106946 -124296 -133932 -63523
21035 -63523 -83065 -69645 -66387 -62064 -73699 13193 17169 -6857 70288 47309 71205 109134
21023 109134 133347 148741 132363 191440 227635 130118 53208 -3557 -26602 14148 45023
21012 45023 48411 -15932 -93818 -102163 -73819 -101753 -65223 17792 33024 -56094 -78936 52375
21000 52375 51857 32261 81833 133574 127081 185180 190645 134279 38959 -59980 -17231 -49249
20988 -49249 -169558 -195152 -57335 52359 116092 105191 171763 111047 86451 129074 165140
20977 165140 143196 76675 -53023 -139533 -135549 -59619 -46289 -68230 -42253 -6696 -17559
20966 -17559 -76550 -31028 18511 97773 135615 127524 96393 14110 20285 16288 43369 63877
20954 63877 21608 -47123 -43313 -21527 -32344 -4968 -47070 -80563 31627 104817 51058 -12342
20942 -12342 58851 -50839 -43461 62411 146706 168996 112253 49187 62373 41694 -29832
20931 -29832 -68628 -63305 -42278 -59813 -12077 114218 133286 55775 13238 -2941 -48345 -81169
20919 -81169 -37631 -21653 -22262 -25846 -38659 15190 3116 -48987 -123668 -67227 2960 77600
20907 77600 50872 32433 -7331 -56684 -52285 -51144 15804 23768 -13597 52708 57548 74817
20895 74817 17315 52375 32428 -39924 -34406 42528 83832 2148 -4933 -19815 440 -2926
20883 -2926 23490 98296 71509 -19041 47054 75201 -4289 -17559 680 60316 29646 -43343
20871 -43343 -34539 -32316 -38153 5269 -26676 -104957 -57507 -36266 -45208 -52474 -123272 -181768 -78913
20858 -78913 -28116 59672 101255 65310 40219 12522 30183 54776 56951 23821 135717 139580
20846 139580 3676 -75239 -47925 -15316 63544 89253 2170 -74183 -90530 -99339 -86641
20835 -86641 -134561 -116644 -99761 -161132 -143935 -130983 -99299 -88813 -99546 -40712 -78719 -141711
20823 -141711 -62284 1691 40112 64750 33330 28853 22360 -29761 -58725 -49911 -71575 -52568
20811 -52568 -90602 -151728 -131180 -170242 -226089 -171397 -39547 22210 51284 -33291 -75717
20800 -75717 -99834 -40732 30895 -9873 -106363 -128460 -11902 80461 99126 44937 -57661
20789 -57661 -85647 -47421 -16769 9794 -16700 40373 26629 -7239 26379 67416 88460 56588
20777 56588 69075 33140 -14375 8577 22295 -34067 -72972 -42828 -21237 19690 65185 99416
20765 99416 86378 79104 43595 78633 78275 53595 51804 -55739 -101021 -43007 -80951 -97110
20753 -97110 -129001 -165875 -151291 -136680 -131727 -90573 -75794 -132033 -134689 -75296 -16544 -27874
20741 -27874 38169 57958 -27559 -75596 -78848 -85442 -143627 -121263 -50295 62636 136995 170925
20729 170925 120381 -40052 -130496 -28226 -53684 -155499 -190390 -147795 -84857 -95253 -107201
20718 -107201 -87370 -98275 -42725 15055 -55069 -117461 -48258 -46021 -67988 -62234 -82532 -62766
20706 -62766 22558 14305 -103302 -130244 -124393 -82697 -83060 -74673 -23778 -29338 -45657 4985 61577
20693 61577 56887 11916 -3654 -278 -9600 -61559 -147284 -214567 -182243 -83738 -29348 51637
20681 51637 8234 -78487 -183813 -158702 -32565 4565 44352 63764 118579 103039 90391
20670 90391 68795 100184 71196 35457 77883 105320 170757 101860 40772 72376 67911 22664
20658 22664 84235 118312 33653 55903 92328 51774 47321 71397 40325 -13192 -52827 -34736
20646 -34736 14521 100591 114948 113877 158433 203814 182136 73754 -27891 -54209 -115249
20635 -115249 -83246 -23592 61734 67234 87210 45034 30152 -62429 -139618 -130118 -41987 -21702
20623 -21702 21323 -16502 18002 -10084 -40951 -76974 -7443 50057 38026 -17132 18291 67151
20611 67151 56819 7816 -47650 -55882 -11299 7773 26848 36331 -10190 -75579 -123898 -128421
20599 -128421 -55387 39964 1611 -24920 -7163 34579 -35442 -74585 -102067 -31133 -57665
20588 -57665 -159459 -143471 -80450 -56755 -14571 -37607 -63617 -34195 -76705 -133216 -170006
20577 -170006 -79882 -92114 -52195 36063 44746 -20456 22955 78091 83615 59537 66125 47415
20565 47415 83847 50622 51128 84588 -14351 -49619 20153 177278 175604 172488 135447 56105
20553 56105 26457 101370 111185 26546 -2536 59884 121646 70616 -19126 31841 3202 40968
20541 40968 73633 115698 68830 -59913 -56132 9936 18613 23325 18805 -31319 5987 70221
20529 70221 73663 124595 90306 23561 -34735 -30005 23279 53582 22077 -36028 -4185 45642
20517 45642 81792 95688 47122 62795 19584 -3617 -58348 -29651 -29613 3755 -9469 -21675
20505 -21675 -7808 36273 115808 106560 61675 67524 47794 54684 95390 39797 -31782 -157263
20493 -157263 -141761 -15298 39769 106191 50061 21440 -13754 -7460 61361 43832 -64024
20482 -64024 -120882 -39014 5770 -210 74477 128479 109052 67664 73786 28658 -75027 -104570
20470 -104570 -44380 -16122 -90401 -76551 -14616 28910 -18129 -39758 -66697 -74688 46883
20459 46883 33076 -25773 -46680 -34031 -25008 -13486 -693 -96811 -84198 41762 96925 99819
20447 99819 -1409 -39701 -3352 42348 -9864 -73714 -39530 43380 10197 -36636 -16317
20436 -16317 32608 -6989 -83356 -40308 -25249 -78639 -101960 -142924 -197965 -231669 -211122 -185233
20424 -185233 -149150 -28515 50707 -9656 -13351 -38833 -42214 -51705 42927 -5736 -60878 -108793
20412 -108793 -102498 -57090 -21098 14415 34962 -11963 -37096 -38669 14510 80421 77946 51442
20400 51442 11760 -49594 -538 -7521 12499 8043 -27106 -8168 -50581 -71609 -37339 35212
20388 35212 76153 -13562 -44064 -10420 -1296 3431 3484 6948 -61692 -56339 -98943 -201623 -182894
20375 -182894 -140076 -189111 -183312 -158280 -197737 -174063 -106865 -56621 22438 44224 -11824 -104244
20363 -104244 -99198 -42645 -16851 9134 38721 40361 41817 8541 -53704 20653 71311 3429
20351 3429 29278 757 -16242 15913 -13265 -82489 -68207 -119362 -140561 -107527 -32992 20604
20339 20604 65950 65431 20034 -42058 -68147 -38679 -16840 24886 54210 162853 138292 29139
20327 29139 33495 31852 21830 -28118 -17337 35569 68054 7219 7978 -24465 -24878 28596 -27294
20314 -27294 -1091 -8658 -69908 -76005 -80766 -73222 -72025 -41911 3191 57662 124394 203406 180174
20301 180174 180569 229692 229828 172275 172496 175093 229426 247745 307016 282723 299616 315656 241533
20288 241533 188560 164114 201589 280336 303526 286127 176071 124769 83024 150580 215647
20277 215647 125938 83456 94011 111090 7045 -65524 -14117 -6294 10055 -13321 -70607
20266 -70607 -108061 -79652 -14212 -15810 5079 -26858 -77460 -16982 -13237 -86830 -126593 -149390
20254 -149390 -93375 -66447 -45297 -39565 -96400 -109124 -113101 -129642 -105776 14840 90336 152016
20242 152016 90255 1254 -76309 -77952 -35467 6262 -34635 -165412 -192804 -174948 -121616
20231 -121616 -75724 -168240 -140782 -94105 -42582 -52590 -175391 -256385 -254769 -211727 -139979
20220 -139979 -84854 -41954 -81992 -181994 -116816 -75453 -49704 9334 49298 156968 192147
20209 192147 117660 18465 -35759 -29587 -23557 -28051 43485 85082 41961 23490 7652 -7744
20197 -7744 -39777 4441 34769 68415 103094 35470 8890 -21189 -37517 7823 4541 -24450
20185 -24450 -50339 -36617 -3803 -48393 -61407 7909 -21690 -60106 -62939 -27491 -62704 -63697
20173 -63697 -60102 -44435 -17122 -386 -81157 -62510 -84296 -100014 -29227 1926 19157 -3051
20161 -3051 -27926 -16278 52579 105953 133355 130977 137057 96957 65027 40136 24013 -27952
20149 -27952 -121667 -118050 -169378 -137716 -97327 -55343 -3394 2542 -59645 -126759 -171619 -129280
20137 -129280 -49027 68034 19707 19898 -25121 -102901 -127986 -118586 -85857 -68998 -56209 -97385
20125 -97385 -77892 -59438 -89740 -97686 -60813 -8089 37901 75612 6563 -725 51826 218513
20113 218513 236207 68070 -44511 -113735 -125930 -218037 -245673 -147724 -110206 -105026 -146395
20102 -146395 -124789 -74925 -58308 -1275 18683 36560 41044 50968 10878 3643 -94548 -151150
20090 -151150 -124947 -88683 4826 65926 103952 14643 40787 39364 36715 10208 -33146 -30625
20078 -30625 63534 161105 180913 118082 37547 36619 99666 86515 42594 37271 88747 82881
20066 82881 61054 101571 151529 235127 331157 331157 249108 162036 218246 137879 60745 117052
20054 117052 130031 165157 188038 107627 85241 102495 81795 53807 7520 -57248 -34618
20043 -34618 20347 -33454 -47699 -58179 -84908 1570 52373 156244 205479 152138 201826
20032 201826 238346 182616 146349 160085 174062 233863 295334 222997 149249 233539 329437
20021 329437 384346 352198 291670 292881 260868 213051 221256 172569 80614 102740 169150 246902
20009 246902 178795 133175 111398 139003 169768 147211 86015 102249 96967 124370 150268 129536
19997 129536 -3641 -16945 -57513 -65344 -85040 -96182 47066 118421 134982 98113 92906
19986 92906 141026 157728 119492 91108 52265 71173 132707 34495 -229 26192 -25409 25199
19974 25199 135085 167488 201902 221553 215548 138416 140128 135558 73556 93492 143380 155799
19962 155799 129004 131936 174585 241949 330340 451159 604408 775643 1019490 1358030 1573490
19951 1573490 1781136 1922287 1895636 1836831 1720019 1592253 1399457 1129900 829788 634915
19941 634915 532295 378793 277573 156375 201583 180675 181726 170102 160503 172480 106351
19930 106351 39280 96489 139035 169432 146991 118970 194253 142583 107309 60450 51037 57839
19918 57839 797 14617 38362 16826 59074 91922 23598 -12680 39963 76205 73932 14903
19906 14903 40530 90223 37372 61804 68783 42254 32760 13475 -31652 -19203 45210 131783
19894 131783 144811 78097 58091 100327 101010 186453 241262 207578 101775 84813 177437 270608
19882 270608 227134 80006 -9073 -56909 -36844 -40530 -37567 34482 59830 117099 118314 9175
19870 9175 -65705 -53793 81876 158151 228892 240711 113424 44212 55559 18689 -18705
19859 -18705 9685 52094 65499 67012 30020 15197 21881 27090 2028 27951 23228 14069 68685
19846 68685 127051 189648 176406 49716 -7030 -3334 20495 38902 52547 71903 90184 86910
19834 86910 79822 69170 -1740 -75642 4437 80602 122432 194146 203089 214993 286571 207781
19822 207781 149113 150501 164153 176637 93544 31239 46231 320 13773 74586 192920
19811 192920 285147 276085 226918 252395 290107 351846 400735 436744 484813 506058 451998 394471
19799 394471 374575 292877 342925 396256 437646 438905 493818 576796 597845 712933 889951
19788 889951 1105984 1283892 1389709 1535621 1680086 1824453 2014370 2209542 2382156 2517464
19778 2517464 2722975 3104858 3474074 3925573 4531813 5416847 6752167 8816061 11680268
19769 11680268 15093895 19160419 24294574 30842162 37496401 42684278 47269334 52044817
19761 52044817 55086582 54868767 53518841 52965221 51978999 49942044 48498740 49783306
19753 49783306 53189201 56195899 57816393 59810371 62072938 61601979 57737588 52927310
19745 52927310 47916971 41599858 34351449 27862966 22701747 18324583 14769105 12200498
19737 12200498 10287051 8775633 7735828 7000593 6315698 5700194 5117238 4691035 4341692
19728 4341692 4052589 3765837 3327596 3009044 2757633 2549572 2407587 2291655 2116717
19719 2116717 1913221 1751655 1631641 1549476 1455722 1420200 1300195 1191853 1062536 974537
19709 974537 853869 759044 788005 892445 887495 871577 812994 831489 802275 680271 612520
19698 612520 661823 659497 616900 495231 532356 568603 533297 603771 681392 589156 488868
19687 488868 493271 534536 482314 483507 591727 677283 647495 636025 691622 670979 637359 650153
19675 650153 747845 848322 808419 706015 621189 611008 560919 388706 359182 456839 535525
19664 535525 483632 411608 376900 206936 132111 190441 212643 224715 205598 203914 240569
19653 240569 325688 312245 266236 263637 239847 187232 246224 334454 352257 341374 312296 282586
19641 282586 269962 249053 282939 345988 386816 376028 280586 231928 336688 363751 418477
19630 418477 451182 453816 450846 455427 344623 258660 260305 278836 271569 299219 326113 339007
19618 339007 400954 385711 319297 265012 150845 123448 76078 125747 225176 250272 267560
19607 267560 221768 190065 138174 102354 98041 157240 188660 160498 177003 244240 175510 69585
19595 69585 101268 174747 201811 237714 246585 230169 187181 117407 141219 139832 142530 190782
19583 190782 210502 179814 178819 215999 237171 227874 186319 275353 335000 331045 327448 399221
19571 399221 434514 406308 458558 537612 552348 607982 660228 716601 863226 1004910 1166574
19560 1166574 1142584 1192954 1338692 1441883 1543114 1695388 1804900 1905666 2239677 2672170
19550 2672170 3321574 4272821 5540501 7585644 10271605 13164296 16311019 20355281
19542 20355281 24749747 27409333 27966995 28227765 28659504 27513726 24815758 22429990
19534 22429990 21317666 20908698 21007463 22013267 24305667 26591966 27331433 26985650 26750763
19525 26750763 25665515 22765294 19039265 15649196 12815994 10342543 8282292 6783399
19517 6783399 5736746 4877327 4303827 3945919 3705639 3498620 3329138 3146876 3071114
19508 3071114 3018555 2953004 2923304 2989112 2945186 2890007 2905119 3008062 3155634 3378888 3694614
19497 3694614 4242332 5036521 6336374 8330383 11168950 14518631 18118586 22270995
19489 22270995 27641179 32429863 34571906 34897061 35535125 35336541 32878710 29570910
19481 29570910 27298006 26322340 26122169 26683725 28779105 32053497 34334949 34460859 33945522
19472 33945522 33429795 31134771 26759332 22074616 18045222 14464606 11345426 8946766
19464 8946766 7296202 6105923 5219255 4573780 4071060 3622249 3331517 3080673 2842078
19455 2842078 2748648 2537934 2299682 2058368 1896357 1822109 1719823 1568775 1444780 1368512
19445 1368512 1277728 1189282 1126612 1060481 1022498 989401 898963 830182 734728 671733 645473
19434 645473 647627 616292 555181 548665 599894 604443 543988 488234 452253 443063 474244 503795
19422 503795 396549 323668 356730 400356 358548 369542 366861 416912 456213 302244 292450
19411 292450 344859 317054 359322 383295 392501 422495 351137 302804 275314 228832 149206 100118
19399 100118 145403 230188 373628 432831 372219 286748 245044 172152 116944 64119 35684
19388 35684 31188 22786 -44904 -66687 -3196 31906 51729 137486 223752 251283 213762 187353
19376 187353 151000 117214 95991 79848 61945 58778 19177 41926 57647 86364 53440 61684
19364 61684 110348 217698 236968 278160 272109 253605 269419 210204 60404 79829 142822
19353 142822 135398 139941 168848 155055 185276 221676 134129 82966 176184 243858 282932 283033
19341 283033 291219 243053 258881 268481 216180 166686 105628 108027 126991 139477 158653 204983
19329 204983 218704 153036 73483 63360 124125 187203 191337 184592 201578 149249 122304 106375
19317 106375 111697 78148 82790 144152 144797 193156 316072 322125 384828 397663 410902 473998
19305 473998 641162 854905 1183978 1447888 1618453 1752008 1732710 1732160 1738030 1682659 1614975
19294 1614975 1503933 1343713 1225546 1015816 831632 695593 530302 481388 461650 382141
19284 382141 260228 191499 238166 325658 273607 248512 303384 329934 325260 275998 298009
19273 298009 277124 264260 225043 234035 304381 414715 485177 520541 512840 523168 626363
19262 626363 725958 827649 960385 1049385 1049788 992163 872209 847542 817359 783617 895906
19251 895906 1059349 1264124 1409319 1394535 1386430 1356088 1207409 1194436 1111703 978255 804330
19240 804330 622060 550559 538054 503599 452586 383804 229249 162198 259131 269556 274603
19229 274603 316218 388194 407884 295658 310973 419270 490322 506160 555783 667957 787816
19218 787816 860900 839207 845932 850116 899923 836368 769215 740287 747483 707786 699464 772994
19206 772994 833386 799859 804067 776638 760134 797966 755737 749970 713268 631326 503023 388764
19194 388764 347771 294681 292181 282481 290313 267211 204974 125634 69507 54186 -948 -15811
19182 -15811 45807 157641 208460 215873 214539 123549 55241 158005 196226 194970 160845 195567
19170 195567 261467 325365 441086 537424 488915 511359 640529 681291 626165 582782 548585
19159 548585 480355 530385 531626 521611 451511 477163 581625 644439 671422 637836 594508
19148 594508 589845 551042 535616 434159 336591 351275 328317 282810 265885 170278 131080
19137 131080 177166 149793 179127 192868 184189 222199 201178 194265 193336 191780 255906 251013 247499
19124 247499 190356 221583 176843 168672 175894 187502 201264 230654 185782 134700 142142 161762
19112 161762 194818 253115 272815 205524 237976 190802 184528 301590 329871 299168 265273
19101 265273 312715 393746 440277 435810 423067 529668 583673 622667 696543 729150 827323
19090 827323 928791 1002728 1009807 1006415 967925 1056084 1152370 1264933 1409225 1508477 1655231
19079 1655231 1797831 1992443 2259279 2445224 2669302 3117746 3878616 4985391 6473301
19070 6473301 8589886 11542525 15192614 19364393 24422925 30744849 37695009 43454339
19062 43454339 47466046 51002133 54235243 55439494 53480998 50088517 46717115 42538754
19054 42538754 36777960 30592924 25208967 20867785 16964819 13475995 10652857 8602169
19046 8602169 7174533 6186440 5416628 4799357 4455666 4148398 3862862 3612060 3462768
19037 3462768 3340564 3256803 3114485 2930130 2827785 2766140 2726899 2742873 2767367 2767926 2707230
19026 2707230 2762004 2822875 2832760 2958963 3208374 3441584 3853965 4477143 5421370 6784688
19016 6784688 8649906 11196904 14238467 17790531 22226783 27614892 33012012 36911125
19008 36911125 39675777 42518874 44792510 44738562 42338086 39477642 36635092 32714795
19000 32714795 27644997 22684276 18831987 15547738 12456241 9772533 7779983 6356356
18992 6356356 5397188 4794495 4289456 3832477 3564273 3327050 3117093 2931242 2775739
18983 2775739 2677000 2478613 2379339 2248332 1985928 1885762 1836350 1795499 1646989 1534085
18973 1534085 1503734 1423922 1235270 1145232 1014084 970322 996866 1011071 977424 884397 840869
18962 840869 815294 755170 758589 751946 778887 685928 600831 549579 580896 621073 549603 452558
18950 452558 350449 346910 392435 413391 344892 287481 262273 289981 323926 369033 272948
18939 272948 290316 397401 493026 427294 339508 369248 465085 448241 325187 332645 390353
18928 390353 399681 382637 342351 354392 345312 312054 246465 274463 341651 360795 299947 165879
18916 165879 129585 200031 189875 133745 96206 125204 264747 341715 327396 366063 461246
18905 461246 618653 652517 781732 785187 741459 797951 966912 1080275 1113217 1083377 1084014
18894 1084014 1107853 1087693 961548 854177 812724 631223 457884 351940 271163 302085
18884 302085 291084 191700 167448 219060 252711 226533 187216 208258 246531 241835 198041 136782
18872 136782 41399 -98448 -128132 -97913 -16425 39501 42745 50281 89584 163586 231155 224934
18860 224934 184288 216223 229123 249786 217778 187582 292008 360114 366546 296399 398571
18849 398571 390879 411504 542641 664464 687670 648524 688966 677257 695571 695393 655863 508233
18837 508233 464343 452166 381455 298754 248304 328030 311210 355683 411540 387217 318548
18826 318548 254718 249072 205510 228463 251119 314495 262350 211524 193638 101552 41742 -11051
18814 -11051 -55092 -44910 -51424 -10166 9804 47854 56656 105483 151249 142027 224357 290863
18802 290863 328850 346677 205991 140968 36131 -14070 55635 45330 51739 126100 152650
18791 152650 164186 162862 121694 166215 251684 302800 316335 168302 49649 34441 67214
18780 67214 103220 29174 -56983 -2550 207463 271978 321859 209415 143537 110559 99032
18769 99032 112948 143866 121305 85901 95713 162945 216337 180380 92220 116419 126932 85500
18757 85500 82152 136623 200545 155264 77395 91296 162131 123464 13863 48163 78268 121414
18745 121414 123863 37406 50963 132318 59629 -30095 30327 120875 192895 192135 149799 113415
18733 113415 52894 57299 96211 144196 137811 142849 112346 134470 163290 187701 186568 196130
18721 196130 241262 196947 71958 18617 -2806 13071 90560 143711 175742 235432 221611
18710 221611 217271 224015 216997 224990 250473 180733 47577 22869 40575 68089 135048 142858
18698 142858 32504 -3709 1038 19223 29165 26070 5008 34896 73947 107338 198679 117221
18686 117221 94636 112771 125365 51270 4615 81368 43151 -29049 -48799 56235 155639
18675 155639 181097 199253 201047 107730 108450 155837 140545 170391 224167 283537 359563 257790
18663 257790 238349 251393 230833 172499 216693 185002 179485 171966 175577 154797 224754 241208
18651 241208 133364 40005 74718 211783 241276 106116 65985 104707 105116 77023 36380
18640 36380 5016 6994 -12242 18823 44196 35523 -85678 -123925 -44884 17134 22935 44329
18628 44329 57815 50787 73583 59796 27587 7438 -16760 16653 117525 81824 61964 9724
18616 9724 -43110 -94721 -81391 -79766 -50788 -25138 -52597 -65189 -67367 -55654 9428 83178
18604 83178 87082 -1468 47636 14138 -26672 -115241 -159337 -210206 -132360 -40788 148034 198120
18592 198120 128282 -37751 -86269 77714 115339 105459 109923 97546 105631 169465 157897 177560
18580 177560 179330 134618 71024 48666 -53223 -43914 -25834 48715 78623 39605 17375 -7407
18568 -7407 84505 68578 64560 17895 -26893 -5137 -37474 -69497 -20279 1093 17166 -26894
18556 -26894 -22922 -22862 -79176 -15383 -10571 12815 29944 50577 14766 -21697 -20418 20852 -22618
18543 -22618 -130795 -170578 -118535 -34516 -8991 -33845 7816 90594 37016 -59263 -47403
18532 -47403 27771 33060 28030 41340 81913 103648 86659 90079 108385 127200 157430 219931
18520 219931 147867 176768 202875 243636 185323 194964 177780 100909 118100 76288 43036 40419
18508 40419 133646 183914 202499 216577 184920 57746 -56111 -71318 17022 62851 74852
18497 74852 64989 33343 74455 39870 30145 144528 239170 137512 101399 111067 52659 120970
18485 120970 155393 105040 83074 52712 -12766 -72152 10701 -13765 66765 146733 154336 70586
18473 70586 151879 181255 208369 196672 187839 193360 281589 368297 372989 320708 197809 104731
18461 104731 110807 156829 152288 91996 73990 -6914 2437 48689 127154 192335 76868 51692
18449 51692 17662 19554 -31019 -38243 20375 -25850 -44055 -20245 -12459 58681 106589 87732
18437 87732 112929 38701 -15009 6750 -29831 -47677 -62214 -94527 -32583 -52968 -76036 -70833
18425 -70833 -119544 -109256 7077 13345 22410 40781 103967 67264 11831 64507 50901 14542
18413 14542 26991 -238 47093 49714 97155 162976 66821 71830 44858 43116 -13763 1888
18401 1888 29592 18934 -72991 -10645 -47193 -61081 -69000 -48338 -72368 -86580 -83826 -143151
18389 -143151 -175392 -201115 -196738 -118892 -111084 -138193 -75590 -50504 -76992 -132068 -177511 -142573
18377 -142573 -17559 54998 3296 -87946 -99753 -34711 52868 81565 -14982 -19898 -57911
18366 -57911 -35117 -14024 102631 129420 120488 84178 79039 31748 -37270 -41235 9196 57078
18354 57078 86302 119860 35484 -82421 -106331 -9687 51605 -25554 -46656 -1215 28997
18343 28997 -9750 1904 -42733 4839 92445 90340 118655 87184 78939 120876 32103 -35580
18331 -35580 -66331 -128731 -108446 -83251 -48152 1063 -9316 40329 51437 -21722 -44776 -63456
18319 -63456 -71118 -48175 104347 -36478 -136350 -26623 -31412 -62669 22254 72212 7679
18308 7679 -66504 -100837 -139137 -151944 -110706 -96425 -70584 -62300 11426 121070 164878 151920
18296 151920 128553 49104 1286 -38455 -51675 -26008 -118387 -195334 -188732 -280289 -172660
18285 -172660 -84392 -96104 -98323 -21297 -85934 -79817 -121147 -195142 -235360 -186952 -59492 -37307
18273 -37307 -66983 -142050 -100054 -81646 -37579 -6636 27998 2273 -21519 -20006 -36111 18612
18261 18612 31970 -35759 17154 -19975 -44472 -42126 -69454 -132647 -165856 -111352 -64540 45854
18249 45854 79900 36077 -17566 -23210 -16962 -83522 -103459 79 34815 -12674 -11206 -8138
18237 -8138 -46883 -24867 -7095 66862 82668 40018 -15732 -74687 -27782 28649 43201 58031
18225 58031 123114 198587 193560 51610 14145 128501 136029 113947 176902 145453 80717 88311
18213 88311 98317 117626 119824 62504 34649 -162 -12968 -24649 -111516 -133707 6611 59861
18201 59861 8900 18140 115035 193396 183237 94320 100796 125790 99657 38935 515 -20317
18189 -20317 29257 5817 -34744 -86130 -37333 9770 -40739 -74817 -110730 -106057 -14802 52019
18177 52019 115034 124387 58283 -53371 -105553 -98501 -111356 -47915 38688 46344 25827 -13639
18165 -13639 -101307 -33777 15704 9429 841 -10119 -39720 16717 42265 55980 5819 -33703
18153 -33703 -19796 104794 103190 67799 19587 -3589 50005 56113 9624 -12466 -68187 -25098
18141 -25098 -14397 -36093 19798 66882 125903 77954 -23468 -40034 -21082 66394 128089
18130 128089 89163 34968 31628 73929 58841 51279 89326 71526 50349 65379 7423 -57873
18118 -57873 -41094 47914 28375 3377 -47956 -15025 38135 -34701 -125955 -81060 -70151 -133481
18106 -133481 -147567 -145289 -165581 -90740 -42627 -29482 29169 67927 -4703 -37913 -17317 -29100
18094 -29100 10585 -27697 -63316 -82903 -40129 -5318 92216 98941 114475 157688 75851 46359
18082 46359 29656 14786 9037 123172 119337 23634 -915 -50681 -84236 -53593 -4207 121861
18070 121861 121665 83422 153993 153369 67781 33067 -9217 -56936 -128463 -58727 -11432 -27462
18058 -27462 2267 -487 -10393 47837 64209 13026 -95115 -31903 -18104 -62110 57684 105604
18046 105604 49140 13737 49563 -33587 -125039 -126012 -94616 -40789 -50171 -42365 -24501 -85651
18034 -85651 -41513 23152 6884 6076 21717 8786 -37721 -45246 -97668 -59741 -28063 26452
18022 26452 68437 61603 59603 40300 57364 75547 2150 57300 93425 101412 37370 9656
18010 9656 46373 -12264 -91773 -106942 -77565 -60330 -79960 -72121 -63873 -49891 -99022 -132759
17998 -132759 -32809 20032 -16466 85602 128165 28573 34013 32540 68903 24272 51586 46550
17986 46550 -40129 31594 102534 136846 98412 108983 103179 52443 32213 36787 33566 88748
17974 88748 53096 -113944 -183956 -145801 -59527 -71310 -83695 -121619 -36727 -74263 -55318
17963 -55318 -65049 -133271 -141410 -47142 -28678 -4211 86202 110745 112916 108884 131804 115050
17951 115050 107474 137929 119995 42631 -38848 -45927 -80012 -112237 -113352 -11008 47250 10370
17939 10370 -40458 -19834 39858 -17235 -114373 -108939 -114121 -67811 -20011 76852 99175 58247
17927 58247 54357 15777 79334 80602 26847 47755 127929 117319 37793 -12959 29250 92546
17915 92546 62321 165608 85517 38915 17654 25102 -60827 -110466 -169830 -198611 -137091 -42461
17903 -42461 42793 -35097 -35837 -73708 -13333 49930 34036 -18390 -42754 -47557 -29151 -47385
17891 -47385 -60243 -12402 24973 44913 71245 69926 -32882 -115549 -120392 -25924 -112954 -136988
17879 -136988 -97908 -65559 -80793 -86482 -108482 -107493 -88924 -32908 45643 43715 -19762 -7177
17867 -7177 -32140 13246 -3464 -83878 -100173 -72812 -92982 -106037 -61834 -14234 -59952 -57231
17855 -57231 7284 31921 -77326 -84167 -43651 -73594 3650 7649 16786 83692 100870 56489
17843 56489 55945 111292 167799 75492 19031 -1797 -62232 -51775 -72260 -128487 -151236 -104406
17831 -104406 -113251 -94947 -45705 -52008 -31144 -32810 7398 23606 -44958 -8999 39720 84957
17819 84957 66552 71975 22192 24100 -3410 7386 -123100 -130867 -164524 -215286 -97970 -60159
17807 -60159 -78135 -39819 -52555 -124507 -161961 -79374 -77682 -78291 -33087 38810 29907 1721
17795 1721 -71698 -90905 -16167 -19814 -20084 5952 7099 -69784 -110947 -148490 -163659 -114990 -27179
17782 -27179 -78639 -158108 -117385 -82783 -132824 -84209 3566 -40153 -5850 -32308 -33000 -31735
17770 -31735 -83836 -44373 24048 37541 -5200 -92511 -118162 -127277 -126400 -128871 -73127 -131797
17758 -131797 -131259 -57531 -23219 6307 45588 -41233 -144425 -44937 -7280 -31703 -64764 -132455
17746 -132455 -140077 -118990 -90250 -146509 -143264 -130798 -153289 -51469 14799 67384 30758 22403
17734 22403 43207 42399 68222 26754 -7215 8378 96923 101615 40580 58761 73775 65193
17722 65193 12307 3954 54258 122341 31049 -69381 -146890 -104562 -58524 18690 50881 1424
17710 1424 -9156 -51349 -101407 -157834 -107001 12003 34141 52182 68840 107003 69282 61
17698 61 -959 24487 26772 -7234 -57105 -66990 -61842 -46698 12640 -148517 -246072 -185513 -115752
17685 -115752 -84144 -40830 -33846 -58878 -63756 -113300 -147340 -166082 -136412 -195123 -178760 -146707
17673 -146707 -179685 -197183 -98606 -106427 -40807 -50942 -104729 -93860 -43707 -23485 -48248 724
17661 724 93004 167545 77735 71345 38468 28280 16184 -63874 -30579 -38683 6986 88179
17649 88179 8950 23745 9359 -28558 -53416 -50718 -42191 -90698 -91729 -50210 -68340 -60530
17637 -60530 -113452 -76814 -123784 -76994 -52738 -72867 -59488 -36257 -3947 -38498 4378 12330
17625 12330 8608 8759 13371 90027 134001 99587 64310 38756 -47292 -66417 -124484 -178425
17613 -178425 -82835 -30975 -91254 -161952 -149197 -95043 -147651 -176650 -141914 -85620 -69250
17602 -69250 -3565 44895 5707 -57756 -8450 23064 20448 4679 -58958 -84795 -60214 10981
17590 10981 40314 -1954 516 -66541 -98597 -37415 -76957 -125763 -90871 -82072 -62672 6549
17578 6549 54977 -1314 36276 53210 19300 -39084 1686 15049 32600 8813 9185 -7811
17566 -7811 -45222 -71716 -91980 -88753 -81741 -87595 -61425 -33642 -85296 -99441 -51043 -53402 -83075
17553 -83075 -124660 -145738 -164423 -186483 -114500 -19961 25007 -16728 -83962 -102926 -50254 8349
17541 8349 63614 2859 16620 54019 74653 13534 -47103 -41554 3825 59454 83498 69301
17529 69301 30188 36675 -24875 -95336 -126981 -72340 -87921 24475 21066 -86771 -36085 -31236
17517 -31236 -157346 -204949 -165689 -141413 -123669 -129516 -116713 -85109 -30125 10748 -114583
17506 -114583 -143980 5116 53961 226296 187307 83676 76485 60813 72678 80371 -7913
17495 -7913 -107250 -130475 -140487 -101082 15842 116940 184060 182323 141504 103259 91426 52547
17483 52547 53206 78580 108605 90602 4389 13593 38696 28246 -10633 -101519 -135892 -141589
17471 -141589 -116294 -14976 54961 35025 -7805 -88699 -78479 -7266 51419 87803 55570
17460 55570 -20558 -43662 23798 27192 -3229 -98342 -215328 -234869 -201042 -239333 -137806
17449 -137806 -48121 -3559 27706 -54034 -145409 -189356 -79187 -51917 -63543 -96188 -74828
17438 -74828 -43867 -99930 -84672 -40949 -63600 -17469 -35498 -30294 -74510 -148634 -119611 -61815
17426 -61815 21409 -44913 -89108 -23023 -36990 -26032 -6107 -18718 -43256 -96534 -25576 50549
17414 50549 115428 65464 4754 -27410 -42483 -98388 -67069 -120407 -192290 -150669 -13166
17403 -13166 73633 83154 79776 91330 21055 19000 -49073 -107348 -76738 -29002 7386 50425
17391 50425 7434 22123 -14458 -104746 -136251 -197226 -134966 -26186 56591 8113 -72209
17380 -72209 -111495 -77983 -73277 -32529 28979 -31157 31393 116863 73084 60367 102425 30289
17368 30289 -64962 -68571 -64511 -18923 -81998 -104559 -37385 92632 93069 80128 113784 142870
17356 142870 132746 82098 20521 -4010 -42699 -86878 -82945 -22266 79259 60544 8701
17345 8701 119334 194333 78019 -11751 -8932 -41766 -46698 -45927 -37038 -21801 -35849 -58148
17333 -58148 -56097 -37690 -101233 -204440 -64275 10227 6386 -31383 67489 77872 87515 41409
17321 41409 -8990 -17541 -19843 78986 71134 10948 6272 7216 -24572 1773 5388 2240 -61802
17308 -61802 -112507 -181475 -196047 -94150 -97193 -131429 -220152 -231122 -167929 -88042 -88248 -85640
17296 -85640 -42519 14126 -50712 -50195 -6686 -57692 43720 164772 137813 2249 -102751
17285 -102751 -100229 -111446 -155370 -170091 -136697 -132673 -45539 -73206 -169355 -162833 -90126 105735
17273 105735 210743 134310 162030 103666 -24727 27309 45697 5548 -10712 -528 45476
17262 45476 -68555 -37883 -14876 -76449 -13356 66151 57383 14212 22823 13241 -27037 -24454
17250 -24454 4171 -58276 -70075 -78319 -106842 -65677 -76060 -105207 -196414 -290293 -138692 -101139
17238 -101139 -145566 -129346 -139788 -51163 -17691 -26587 -620 29085 -24866 -11800 -3400 26696
17226 26696 90751 69220 64302 59051 -3303 -39814 6789 -24385 -103397 -105328 -71840 -70926 -108886
17213 -108886 -127715 -41689 2514 -58447 -40583 31742 3089 -38642 -74106 14517 117338
17202 117338 148802 135432 71209 44291 1725 35122 -26373 -177776 -207743 -151980 -78067
17191 -78067 -9752 -5813 -5954 9477 62699 111316 66554 59287 32255 29854 73251 95285 -16899
17178 -16899 -46274 -104090 1334 42934 -25686 -75152 -24210 73367 143059 178817 108443
17167 108443 -33601 -88602 -12852 39352 2124 -61520 -110392 -76542 21752 23150 -32925
17156 -32925 13859 52245 7333 25772 38563 3912 -34514 125 71881 -25977 -125876 -91418
17144 -91418 -78733 -62673 -49284 -43064 -84360 -111507 -138542 -17192 -66895 -95868 2554 -21225
17132 -21225 -84610 -59939 -87127 -97792 -71106 -70517 -70301 -18718 27760 61311 47589 69414
17120 69414 79053 48735 70285 9533 29858 -16635 -57406 -42406 -65527 -90803 -114874 -14641
17108 -14641 28423 42322 9047 -46096 -46167 68631 54326 38147 -17629 -27069 62715 132801
17096 132801 27384 -30926 23316 39635 -59340 -54976 -44452 -48416 -102340 -86581 -32422 -36032
17084 -36032 -90173 -147054 -24689 8868 5959 -36457 26780 54807 88260 46006 39473 34698
17072 34698 25558 -21992 -43069 -9243 19938 -40637 -65738 -117075 -146567 -140304 -73935 -73265
17060 -73265 -50142 -67405 -108276 -48542 -18080 70953 127076 116816 24827 -92554 -63470
17049 -63470 -15028 -34251 -71703 -37121 -20399 -108977 -191192 -168050 -151519 -19714 15129
17038 15129 -43184 -89432 -97938 -111145 -125528 -91871 -96046 -91142 -7610 46191 25550 51758
17026 51758 96600 92661 70743 65372 -12823 -24742 -35873 -59128 -62650 -78644 -78970 -89769 -89989
17013 -89989 -8644 33203 110475 106438 49040 39944 26148 -22674 -126358 -204640 -148823 -108035
17001 -108035 -58618 -13897 66382 108901 84236 41355 41745 -3199 -57040 -45627 -63065 -73347
16989 -73347 -21117 -43861 -110252 -116187 -93979 -107706 -64064 -76144 -14279 49054 -6713 -4646
16977 -4646 21366 128212 209177 270187 196339 226145 212071 134231 72239 -18182 -92594 -154011
16965 -154011 -225778 -145403 -81830 43241 -3128 -44776 -102024 -102977 -67171 -66159 -89315 -36013
16953 -36013 20439 -8599 -78685 -11897 74888 43036 85001 56241 -1046 -86718 -114246 -108911
16941 -108911 -9474 12586 79761 330 -41929 -14124 -97995 -144737 -154558 -158103 -96507 -36162
16929 -36162 860 34042 89193 99384 67030 -83 59029 -926 -33484 -11711 -48257 -36546
16917 -36546 -92846 -45066 -76136 -153823 -99830 -26538 -21464 -39375 -64715 -42740 -75833 -102416
16905 -102416 -86004 -63261 7181 5409 -46972 -78541 -107922 -147689 -123966 -73654 -18732 -20554
16893 -20554 25338 23024 17529 80004 87440 -19094 -62127 3406 86794 66712 -26892 -98437
16881 -98437 -13107 63334 96537 4826 -70338 12366 -27839 -112079 -97588 -79553 -48564 -21636
16869 -21636 57401 61888 -5630 -42811 -103884 -143241 -149317 -136867 -201184 -247320 -246279 -227712
16857 -227712 -146255 -105568 -133866 -179616 -187447 -109080 -1576 -93872 -117260 -72103 17499
16846 17499 21479 -22839 -75534 -100188 -87610 -129073 -144267 -130695 -71589 -65077 5896 21805
16834 21805 65200 40719 84723 85841 34529 -58951 -40869 -5519 -58054 -24472 -70295 -55490
16822 -55490 10316 -8367 3253 27305 19553 -63282 -67279 -26451 61678 131049 127330 35470
16810 35470 -28517 -29138 -36043 -164822 -178562 -72710 -16869 -96565 -134490 -118836 -67909 -29448
16798 -29448 -47363 -75165 -107130 -86308 -62554 -54447 -102185 -111203 -99844 -136608 -81316 -74451
16786 -74451 -78717 -113559 -103404 -109902 -18008 10556 -12478 -21791 -28246 -82246 -91326 -53723 -53518
16773 -53518 1662 13780 79448 87211 52320 -25449 -55017 -22278 -691 -64538 -93613 -71785
16761 -71785 -53839 -40021 -7693 51059 -10454 5826 47097 7955 -25206 -34080 -103495 -37113
16749 -37113 15680 -57496 -71884 -74386 -78813 -153107 -129754 -73178 17266 40425 30292 80792
16737 80792 47883 21423 11988 47091 30803 2074 -109927 -85082 33482 73303 106344
16726 106344 117801 53134 -46189 -56424 -44700 -44381 -33209 -146600 -178586 -157962 -139957 -152257
16714 -152257 -104547 -79048 -77947 -158928 -129309 -43884 -4841 548 -79318 -89467 -68821 25063
16702 25063 55600 54927 47690 68005 -217 -102772 -112069 -43829 -38448 -80380 -63759 55284
16690 55284 65656 -59370 -185379 -125723 -139739 -155050 -76695 22200 81034 9677 -38460
16679 -38460 -117516 -87368 -59312 -101889 -148183 -156629 -103478 -96535 -61500 -23415 -56727 -92703
16667 -92703 -52146 56599 41898 -41750 -75967 -93458 -76853 -82561 -83715 -19412 -22050 -28162
16655 -28162 -81021 -110824 -116067 -142488 -153222 -92679 -9603 -15691 -49682 -86744 -54644 -8400
16643 -8400 34023 40430 119397 132152 66953 10463 -26099 -16936 16335 22493 17324 -53123 -99649
16630 -99649 -33126 34966 147482 200166 200357 104106 48547 4925 25116 -10691 -58324 -50384
16618 -50384 1516 15065 62687 9651 -79783 -56826 9180 80169 45450 7207 1594 -3212
16606 -3212 -25678 -164316 -218570 -115813 -103925 -159093 -242903 -177747 -17920 -13282 -16802 -41445
16594 -41445 -4879 42336 4249 2397 15795 -111718 -198953 -155222 -46228 12389 29793
16583 29793 32868 -2218 7556 -48397 -74296 -65780 14171 69340 6757 22838 108816 95653
16571 95653 11888 -45378 -7755 3202 -5155 32751 19943 25477 52253 27871 -40132 -34463
16559 -34463 28461 56927 7655 -83065 -37322 -46099 1962 69756 -1897 -61852 -73145 20879
16547 20879 57019 57941 60651 28636 6047 56497 77730 40846 24584 22901 -29164 -14284
16535 -14284 -20867 79974 143089 70088 1371 -65098 -184888 -100956 -81321 -40308 -78481
16524 -78481 -32402 -109372 -145273 -109948 -115537 -107556 -106292 -80780 13683 32898 44649 58305
16512 58305 9418 -121177 -60720 40505 28533 -35231 -96619 -151454 -140003 -128820 -69481
16501 -69481 34498 81457 57893 45599 62967 34866 50185 37893 -85682 -162106 -131930
16490 -131930 -102612 -140235 -115107 -38483 26954 5066 -112215 -184508 -184662 -85056 -84422 -76003
16478 -76003 -59417 13462 40679 40294 51660 42413 15307 -23257 -135834 -90933 -63420 -86060
16466 -86060 -122920 -78181 -46211 -16404 -12571 15027 -27163 -79465 -52311 -133193 -171744 -97661
16454 -97661 -40453 -8352 86827 31381 -10394 -84529 -22080 19580 40992 29675 44002 -25025
16442 -25025 -150411 -160577 -112747 -18388 99203 46293 -46204 -115794 -102667 -77811 -113693
16431 -113693 -158726 -151807 -121945 -41224 -25019 -41086 -101571 -160756 -92261 -756 -59278 -132141
16419 -132141 -105346 -7178 696 32348 112228 25358 -50885 -1166 79084 -8168 -43404 5610
16407 5610 -9240 -48723 -58264 -70488 -130254 -159087 -105558 -98942 -134449 -104333 -54750 -37600
16395 -37600 -2291 35301 49297 11016 -12387 -25505 -32190 -148025 -166503 -130003 -97660 -81405
16383 -81405 -35921 -829 -51213 -1450 60780 85125 79102 98523 97755 87342 180085 135929
16371 135929 93283 60495 63856 91342 30759 -15083 -30760 -48978 -105156 -123365 -111373 -21988
16359 -21988 31542 2585 57578 82402 63437 31221 60576 75346 17123 -16351 -28599 -41041
16347 -41041 -70940 -139148 -87747 -40428 -54944 -80871 -144143 -114698 -112724 -145176 -174158 -208001
16335 -208001 -162680 -128859 -61981 -129620 -173942 -129868 -129031 -107484 -39156 -38412 -47455 -52575 -30496
16322 -30496 45429 33271 -807 -43305 -64600 -58255 5324 3851 -74174 -124869 -86619 -135654
16310 -135654 -74833 -140475 -181514 -210454 -135128 -81966 -39440 -6945 -26714 14894 -30968
16299 -30968 -51641 -59458 -46631 80699 110997 22160 -53261 -114210 -76880 -54421 -74917 -88036
16287 -88036 -35582 -73017 -75953 -94982 -115939 -101015 -84608 -115807 -82594 -65834 -79479 -73875
16275 -73875 7012 118259 142123 78404 23057 -74937 -90487 -74842 35042 80220 46584
16264 46584 101562 116264 119529 81178 12352 -30014 -15392 -62517 -56088 -32363 -10613 47387
16252 47387 76106 123326 142659 126314 105432 -30383 -25389 67868 84057 135099 78195 68065
16240 68065 -6770 -34108 -93992 -95094 -124484 -160516 -168174 -145928 -52176 -9104 -46635 -97962
16228 -97962 -75513 -43748 -11057 44581 68208 -7717 32042 2516 -25217 -57828 12270 -17894
16216 -17894 6099 34378 -61946 18593 -13399 -13959 -12475 -1686 -25238 28648 1805 22444
16204 22444 -37872 -53762 -68848 -46790 -3290 -70112 -55076 9050 -10189 -64101 -84289 -31267
16192 -31267 57452 44099 90844 80707 47409 -30596 -68459 -43049 -45582 12251 47195 23025
16180 23025 -23606 -28875 2505 19877 68134 41359 -50159 -72811 30056 5715 -51578 -48551
16168 -48551 34239 70653 -49538 -33346 -40772 -13156 -15048 -66185 -53536 24136 26468 13757
16156 13757 -60324 -78793 -44859 -60927 -98321 -86966 -90509 -43597 -30384 -9456 -63950 -8983
16144 -8983 -15081 -23346 -40649 -33830 -37501 -58974 -9067 2726 14565 33223 8128 8250 -21713
16131 -21713 -24158 -95197 -183790 -220376 -224359 -194558 -162086 -59651 -4671 -8889 -70019 -47131
16119 -47131 -24085 -1790 -26309 -4430 -31245 -43294 -14537 55191 40227 13401 -32294 -52125
16107 -52125 -56572 -2381 -73036 -76295 -42601 -20673 78471 9837 11647 86651 102973 115842
16095 115842 146633 81280 54002 13720 14012 -193 -72170 -63166 -12344 -20954 -40160 -109882
16083 -109882 -173390 -143499 -86926 -86402 -106887 -129784 -106093 -98215 -153212 -161057 -160521 -88346 -24102
16070 -24102 22223 -19673 -36402 -37191 -29970 27409 -841 10522 -8366 62659 71563 76326 25444
16057 25444 -96295 -177491 -157580 -159815 -136726 -81584 -42771 -4261 -8086 -85296 -110875 -85092
16045 -85092 -38562 42648 53645 43722 23177 -6193 -9316 -72781 -55068 -70781 -39921 49721
16033 49721 62424 38538 102641 110838 39206 -49564 -95066 -131990 -130536 -76510 -38810 -14981
16021 -14981 52765 -23590 -41559 7290 8562 30222 42589 28187 95020 113712 15366 -87953
16009 -87953 -14364 119566 77637 -26708 7800 82251 57257 49409 50136 17685 64587 129122
15997 129122 56026 22364 51657 127911 186581 162814 37378 -53835 -30131 33784 90487
15986 90487 85973 117978 126051 106385 87435 36769 -27695 -17333 13629 14713 6985 5643 -46327
15973 -46327 -123516 -48570 20401 8743 -8353 -65716 13799 106477 83219 33310 -46950 -93028
15961 -93028 -36018 530 33505 -35383 -104356 -135379 -28125 51598 32079 -57553 39134
15950 39134 55597 70893 63669 109136 175539 158085 61380 71374 89541 41414 43396 50220
15938 50220 -18959 -18448 -26624 73586 28720 -84334 -122009 28885 60126 61368 24155 110604
15926 110604 97420 71062 34876 -60778 -62842 4475 49441 20176 28891 92637 28227 -16835
15914 -16835 37048 46715 54366 123871 135050 87889 116181 44960 60633 -4194 -20865 -3035
15902 -3035 99196 164346 118451 42172 27221 43580 65961 -18882 -114420 -19343 51244 87608
15890 87608 48111 20333 10901 -11083 57751 132578 142323 238310 195072 4869 -53497 12900
15878 12900 60026 93144 150722 140382 53267 27037 53982 87839 70584 50516 8454 -67051
15866 -67051 -124596 -137862 -50165 -41042 -19691 -29264 27436 56592 -1605 -46957 -4698 -7612
15854 -7612 -24129 -8448 -81880 -148589 -113537 14390 -23181 -109800 -99809 -73175 -51360 -89092
15842 -89092 -4558 15013 -23414 -66523 -123006 -69322 -70565 -54501 24593 36911 89778 95832
15830 95832 39020 -43170 -93774 -109385 -46490 -14343 -91024 -130520 -114632 -97165 -66341 -131192
15818 -131192 -130984 -73114 -73669 -73048 -101148 -103335 -97969 -125389 -110560 -103867 -57687 60127 47940
15805 47940 -53343 -11876 15562 -43881 -103673 -98320 -76530 -36100 36767 80381 48746 23628
15793 23628 -48945 -40583 28333 -43734 -30344 -49935 -74918 -113952 -153012 -116102 -45283 13082
15781 13082 310 -16701 15476 57195 -23851 -95880 -74915 67921 170521 132823 31303
15770 31303 32982 7297 -38873 -60559 -59622 -97798 -133897 -87188 -41576 -61714 -98417 -101364
15758 -101364 11549 24509 -2574 -4460 11889 -6652 10291 68475 79215 41778 7063
15747 7063 -64979 -60012 -52902 -134820 -128013 3823 84567 144022 137538 96988 77608 108847
15735 108847 108020 65521 31778 -59623 -100806 -39080 23618 50338 -50732 -110380 -100571 -74887
15723 -74887 -75950 -79608 -61608 -28975 25911 88121 91436 26744 63901 36509 -7808 40032
15711 40032 88131 77034 36448 -43479 -55914 -22218 -38934 -46902 -15524 -5544 77387 67913
15699 67913 18823 25862 -18912 -16177 26638 68290 128875 179732 104833 110208 164998 86038
15687 86038 42466 -4655 -6073 -8001 -98968 -138949 -60705 8902 41197 35222 23475 10920
15675 10920 -25270 -19189 -57093 -94052 -136802 -120131 -137127 -73604 -68670 -67801 -65143 -90309 -124431
15662 -124431 -85488 -118885 -140088 -34674 50476 25127 885 -25859 -93810 -77505 14648
15651 14648 54476 73553 30815 -25338 -14351 -991 -34447 8339 87761 93277 82973 45137
15639 45137 -21814 -10149 92528 123658 117005 153054 100156 32390 44703 36615 -40089 -115276
15627 -115276 -72997 10322 60354 23584 -113570 -210005 -166586 -71323 -24350 -12777 -32403
15616 -32403 -5490 -20174 -64043 12152 93806 94823 56709 24009 -14547 -17980 3321 -17126
15604 -17126 -61979 -11134 -7939 -73106 -9787 10945 59511 157359 218265 269754 247689 120862
15592 120862 22805 -25872 -12606 -92632 -72218 -17161 -45906 -94902 -82463 -102882 -104280 -129511
15580 -129511 -102700 -72042 -87037 -24982 -15665 -24398 18037 100881 146622 121537 108622 64306
15568 64306 15743 -11542 -98519 -20505 91023 128721 96823 -35409 -37751 -32357 37892 96990
15556 96990 99607 111214 42057 -7878 7672 9377 -17308 -72788 -48745 18215 -57231 -126292
15544 -126292 -63535 -5962 11796 -4793 -41832 -77678 -23495 26714 -2260 -65746 -23715
15533 -23715 21537 104167 112670 81014 40776 -45326 -79116 -124300 -82376 -49435 -91241 -121499
15521 -121499 -48534 -36548 -68603 -38220 28248 38780 53303 16127 18328 52998 103812 52490
15509 52490 -4321 -60696 -89251 -88895 -12805 39287 39525 -19676 3030 151651 170009 104620
15497 104620 124526 111353 81287 26231 -28078 -112178 -16918 76686 45068 44945 10050 39696
15485 39696 -31305 -47858 -67453 -20483 77684 117632 96947 31766 -20551 57861 24330 51968
15473 51968 35041 -83739 -125754 -76175 -36530 16169 91613 39623 -64076 -30612 52693
15462 52693 103858 119736 145462 62116 57256 22933 13445 -21684 -86760 -54834 -35436 6775
15450 6775 -16348 -31439 -53505 -56094 -7039 -6174 -62851 -116313 -108543 -99659 -109540 11398 -15471
15437 -15471 -81973 -93630 -68334 -82757 -125390 -102574 -73403 -31936 77587 101412 53015
15426 53015 -47020 -107406 -115108 -119736 -96033 -76085 -55389 -41237 10122 35740 50694 79093
15414 79093 64609 35712 38404 70021 54486 -19113 -10943 76905 32930 30850 95331 90386
15402 90386 12795 -16897 -25417 -25994 -74938 -152382 -249345 -225586 -192160 -197203 -236561 -139227
15390 -139227 -21318 23667 -53255 -89805 -121664 -102545 -50105 3650 -25166 58072 89483
15379 89483 -3353 -54559 18911 52414 33634 -15313 -51367 680 53226 67612 48211 56854
15367 56854 27151 31799 7110 -30286 27441 58803 98188 82844 151016 146892 54425 83612
15355 83612 47419 -6956 30433 8814 -102107 -158000 -172248 -105840 -66551 -2413 66013
15344 66013 15212 -42655 -44347 -60523 -53422 -49582 -48528 -73252 -124466 -210955 -114510 -89238
15332 -89238 -139368 -133241 -70362 -3321 -4571 -15421 17620 24655 5271 42391 31960 -29343
15320 -29343 -151586 -144568 -65066 -52367 -34793 27232 64625 -8270 -3121 37317 109591 109489
15308 109489 47875 -29171 -2404 29865 18850 -5480 14645 -25754 -130248 -148244 -123227
15297 -123227 -112144 -123998 -111697 -51765 57237 127151 107958 24486 -32034 -59849 -66221
15286 -66221 -24811 -18898 -85445 -57809 -13656 51010 -18103 -164 30348 15599 -56825 -124989
15274 -124989 -73557 -74402 -57333 -14253 56584 66062 18960 -91251 -109602 -118502 -58139 -24250
15262 -24250 -9959 37441 48831 30398 -50850 -140761 -93580 -106368 -168026 -125645 -84461 -66105
15250 -66105 -116648 -78054 -79313 -40948 -89899 -57468 -51524 -51077 -77427 -101765 -110144 -120451 -100333
15237 -100333 7634 75051 97715 31759 -22789 -91159 -180966 -171607 -204639 -186752 -139714
15226 -139714 -125079 -24704 -19518 -68889 -78127 -113885 -88550 -11950 -574 57589 61398 36613
15214 36613 33728 14504 -11068 -9030 -13135 -112568 -66681 49153 61242 91151 99563 78000
15202 78000 -34378 -36017 -35768 -52414 -37018 32859 116754 95645 -3167 -60306 -20924 50966
15190 50966 63798 73238 22235 -2318 -54002 -51212 54070 75287 101762 48595 -51381 -101149
15178 -101149 -63527 5809 -24443 -56998 -64171 9659 -6562 48628 67380 51002 84174 63719
15166 63719 -67391 -172910 -199540 -147245 -76029 -26150 -22943 -22436 -19781 -8260 59926 24929
15154 24929 38817 63054 120707 36443 -24663 -56228 -51571 29945 10429 68333 84924 -17163
15142 -17163 -109837 -88345 -64871 -49209 -38438 -10763 76651 84030 17707 -13816 32027 71678
15130 71678 124027 33633 -10933 -37130 -34151 26044 -36123 -48727 -85803 -118216 -76570 10079
15118 10079 112502 146762 74989 50877 57726 -18926 -21973 -31612 7059 -57684 -70330 -92317
15106 -92317 2058 28045 -62529 -103388 -85009 -146116 -221055 -112953 -15702 24523 -12098
15095 -12098 -55150 122 2901 -23659 23614 38015 13803 46354 74761 187417 127504 51350
15083 51350 986 -7184 39401 22847 16167 -21625 -35239 -72825 -52931 7603 75960 85628
15071 85628 68864 69141 2553 -24023 -11757 13234 6612 -75682 -59871 -86122 -121887 -75736
15059 -75736 -25368 -61312 -107589 -34031 10175 42452 16237 -4622 65017 140042 94049 13032
15047 13032 -38591 -50626 -47428 -21630 -45774 -80912 -129621 -113383 -89910 -65031 -113006 -51822
15035 -51822 2 70469 53709 -28243 30926 13732 31759 -16210 -42714 -51835 -58356 -63334
15023 -63334 -54421 -21476 -20197 -53928 -91994 -68153 -62091 -53362 27100 42533 -3204 -15222
15011 -15222 66128 145052 125097 -36443 -154565 -147504 -44583 -8700 32407 34675 52291
15000 52291 41153 -11834 -106053 -205909 -101129 -82785 -79426 -36032 -25106 7329 -13328 -61002
14988 -61002 -101847 -112084 -47305 27165 50458 102984 109325 86362 102892 97236 83470 166538
14976 166538 182925 114492 99881 191313 188074 121350 149791 158071 54913 -26208 -77765 -54622
14964 -54622 -56119 -7318 -25308 -34903 -70735 -52026 33183 -2374 -3229 -4924 -35086 -5120 -19694
14951 -19694 -63221 -50347 -34727 -30491 -9971 22278 -40464 -80615 -60752 -93849 -143509 -86362
14939 -86362 -132385 -112039 -73087 -12524 -15805 -108513 -78015 -596 95876 92797 -15122 -24319
14927 -24319 -41424 -28845 2559 35914 -3076 -97097 -105399 -49697 -9303 -659 -63220 -82308
14915 -82308 -61250 -68018 -19251 48954 35296 38882 -51065 -76647 -87910 -46155 -30807 -11395
14903 -11395 5684 -29675 -54267 -82861 -125657 -112234 -88307 -71968 -117806 -188198 -179317 -70252
14891 -70252 22152 56611 11937 -35106 3825 34559 79721 81312 92698 58267 -23714 -152041
14879 -152041 -170985 -109736 -59942 -33697 10154 68830 49111 36965 116467 114656 117960 110829
14867 110829 63273 -14540 15101 27161 38555 104785 142294 161720 187359 135984 44866
14856 44866 17326 -11257 55170 61424 95391 151011 90895 5477 25234 103650 80729 116395
14844 116395 141369 59360 -32223 -57691 -11282 53175 76962 82769 3544 12675 33064 19702
14832 19702 -97247 -180526 -71339 -30442 -140527 -114333 -135359 -86038 -84582 -79523 -100565
14821 -100565 -61810 -58992 -23862 13868 52171 21356 -31974 -144151 -60137 -31029 11471
14810 11471 48372 7511 -37672 -15153 -14784 36305 68221 24125 -41099 -78447 -120981 -117896
14798 -117896 -81167 -56391 1728 -53447 -159 120196 180401 122771 99894 95665 -14944
14787 -14944 -72825 -45877 -34976 -16732 -28547 -37462 -97962 -141928 -136316 -100127 -73556 -80450
14775 -80450 53545 161201 191586 104336 44465 -54180 -90336 -45479 -41292 -19999 61628
14764 61628 74919 9800 -46599 -26620 86042 95888 85756 45610 48675 132306 93591 45928
14752 45928 -10609 -65710 -89878 -90002 -151827 -103116 6140 -34919 -79899 -65012 -123154 -81692
14740 -81692 -107293 -92499 -64764 -32444 38276 29584 33990 94666 118137 30505 -45396 -89513
14728 -89513 -58731 -54020 -90445 -176620 -140005 -163899 -212702 -152950 -135493 -101986 -22174 27522
14716 27522 114271 102289 30257 -12437 -19476 -2912 50598 34437 55417 149310 151755 44590
14704 44590 13692 -21743 -25436 -16513 36943 28082 -25749 -73249 -30202 -3323 -102600 -83819
14692 -83819 -45193 75566 129996 21612 -39735 -27204 -1144 -58071 -31640 31032 44869
14681 44869 61339 -12352 -64965 -13919 12082 58765 23702 44030 51816 48448 17566 29303
14669 29303 51166 15382 38627 -20749 -66953 -58234 -28015 -93433 -130933 -86311 -120755 -92743
14657 -92743 -33419 50526 115485 88848 105433 47429 2046 -17217 57855 119429 163959 194982
14645 194982 96434 -63153 -75586 -2641 -52689 -37524 -21333 39203 15386 -7185 -55158
14634 -55158 -131823 -81026 6792 -74950 -138671 -123996 -98087 -51053 25271 121447 105826 60729
14622 60729 15187 22306 42392 56879 -260 -3857 -31340 -95936 -40990 -91632 -57444 -47976
14610 -47976 -95696 -118231 -92494 -115320 -123583 -91212 -18216 -60543 -19067 53641 50937 43313
14598 43313 7064 -30841 51625 106158 77436 103563 203178 142481 -14365 -75526 -13243
14587 -13243 -6747 -42682 -25868 -40928 -11521 -33230 -50729 24662 85469 114114 71434 75818
14575 75818 58355 33184 36813 47341 41954 19556 -3201 2422 13271 42043 68872 26522
14563 26522 9892 -37555 -132524 -131597 15877 48397 7592 -13141 5850 30343 -80719 -52125
14551 -52125 -6602 -61109 -133695 -163782 -171625 -45351 -987 -29555 -39779 -128850 -154091 -85811
14539 -85811 37512 81541 99006 128931 85999 94286 53942 24253 -15006 -73263 -68326 -39051
14527 -39051 -101404 -107440 83494 101780 37902 5234 -34758 -79809 -84900 -40627 -8975 -11582
14515 -11582 -18666 -51820 -25783 31525 -28367 -8103 -5410 -43307 34685 82582 25839 28998
14503 28998 42553 -22751 -16049 -22203 41349 51979 -66330 -90463 -56073 1375 -16240 -22196
14491 -22196 28146 15890 -22356 16294 -10866 -24440 -3990 -66851 -59063 -79130 -21806 -4604
14479 -4604 30000 -19671 -14651 -73368 -99979 -38703 12967 34668 57998 -5862 -43854 -78297
14467 -78297 -58567 25815 49677 113441 96822 34195 71259 88289 44229 -36963 -64123 -33988
14455 -33988 -33610 -109824 -121555 -42297 -79007 -38168 19232 50971 20042 15758 68318 60497
14443 60497 146979 176039 86321 5944 -68143 -94768 -42719 -3650 -73760 -56340 -104112 -113932
14431 -113932 -137195 -99875 -55265 -19352 -55984 -81915 -91443 -38851 -27666 -6013 86413 160166
14419 160166 138684 -9168 -106144 -63392 33365 99562 59127 33735 40287 -33179 45655
14408 45655 113449 64224 54963 64191 40712 104240 -8890 -71029 9332 104651 134453 110601
14396 110601 80601 72438 -13152 9213 34889 28932 -58822 -117727 -79027 -26697 46909 10206
14384 10206 -67106 -162285 -149141 10006 27518 6728 33093 31105 8624 26829 15837 -38098
14372 -38098 -94484 -110171 -26201 -20545 29855 84092 -6515 4377 -1008 -69669 -108562 -19316
14360 -19316 35314 69967 15545 -70832 -112753 -130715 -142277 -170348 -109698 -38399 25826 38615
14348 38615 60345 53974 9036 -49044 -32091 11380 33091 20559 -62127 -140871 -140380 -80990
14336 -80990 -47180 30187 42270 1060 -115300 -171389 -99513 -17640 -38714 -24640 723
14325 723 -35488 -75210 -20452 -10142 -70252 24065 56335 7493 -11091 54095 87252 21493
14313 21493 -78146 -133816 -91158 -67640 -26433 1214 24740 18832 109435 117878 26708 605
14301 605 46236 -27482 -20912 46728 32700 28695 12585 -54433 -41107 51957 64953 21022
14289 21022 -77201 -84 89707 56918 89336 63377 -12455 -18863 -106885 -85822 -100629 -162703
14277 -162703 -54310 25020 -6056 -135402 -126873 -14993 40779 18837 6814 -3621 -46061
14266 -46061 -61453 -98734 5421 118610 68713 23461 31504 62400 85848 67126 107469
14255 107469 100378 63928 -33763 -116720 -87089 40537 144081 207377 231247 144921 117277
14244 117277 146838 96949 38168 1419 -113536 -31382 36407 -98703 -115090 -106716 -94350
14233 -94350 -35553 76428 58336 -67939 -129192 -29075 -23818 5161 13054 -3041 -34057
14222 -34057 57566 36858 18173 27746 47154 35638 -9991 -69851 -33966 55642 120498 118081
14210 118081 66286 1619 -66672 -93151 -92324 -27837 -25435 2119 28680 29304 53825 55827 -52535
14197 -52535 -76720 -46499 -20506 14758 71369 117232 27906 -30261 22328 35514 -21632 -25341
14185 -25341 22674 150848 133667 36187 -19464 -313 -15390 -63850 -29181 -107251 -68126
14174 -68126 70259 135208 85018 2306 -47486 -8769 39714 84985 79524 68427 23607 -448
14162 -448 19872 -3201 -46441 -74666 -101637 -81236 -53440 -106656 -42467 -56476 -24170 -37446
14150 -37446 -55961 -8111 -37491 -111490 -24271 -27677 -29872 -63938 -56349 -98321 -77284 -7442
14138 -7442 -704 10845 -33142 -93699 -129999 -130450 -152285 -112276 -110259 -17164 6727 48460 138191
14125 138191 99147 71282 27460 -36458 -44858 35716 49665 33685 84882 167869 134802 55038
14113 55038 102085 115623 121565 13451 -35250 23698 30900 -19072 -54161 -54245 -5372 -72176
14101 -72176 -70109 -24002 -131617 -218856 -207534 -171680 -57412 51971 28537 -9956 34693
14090 34693 30412 88301 78147 44513 69291 101204 159328 146214 70592 9251 -60445 -168365
14078 -168365 -153260 -9073 103515 185504 186753 185600 163912 57623 80660 84993 147848
14067 147848 110560 75015 64004 66394 52385 92772 111583 -8490 -42263 -36950 -101671 -73023
14055 -73023 -82957 3763 105272 66453 103051 75061 -8874 -39147 -13040 -69296 -66880 -85192
14043 -85192 -123416 -77623 -23355 -13342 84257 45470 11454 16513 -14932 -6764 -6944 26786
14031 26786 21669 54023 57187 9292 23027 3984 -78311 -95216 -80633 -80246 6711 81824
14019 81824 110489 61664 51194 78101 55341 160886 107067 79203 40094 17399 -39589
14008 -39589 -34936 27208 98930 145295 167150 121582 181375 111748 31120 -15420 -12986 -15718
13996 -15718 -76462 -38003 -40825 -63190 -62716 -42889 -86159 -68983 -125385 -141304 -144060 -159735
13984 -159735 -87694 -31034 -63446 -44896 -93313 -170524 -145951 -107469 -35983 -80169 -61063
13973 -61063 -29899 -29971 12968 32761 -35246 -23088 4839 28482 -10914 7645 45385 -9089
13961 -9089 -46255 -57575 -57946 8884 47848 2165 -29267 -9656 6706 -13040 -43215 -11725
13949 -11725 -10852 -89195 -159803 -75801 52 112077 103092 14601 -18481 -42144 43688 25934
13937 25934 -19027 -34132 -68051 -68591 -631 62603 62265 31911 28825 -9681 -10207 26267 -49509
13924 -49509 -76478 -47562 -33647 -8433 -67081 -26829 -10264 -31407 -93987 -63289 -81534 -123332
13912 -123332 -52834 -17893 -40166 21388 57656 83440 63679 46847 96772 64922 32610
13901 32610 35255 88690 63866 18174 -6204 -1577 -37913 8037 133464 141709 109624 164451
13889 164451 291144 384014 573482 711561 642687 527444 348992 258267 211590 71030
13879 71030 54476 22150 -13628 39423 16378 -25029 -50588 -138611 -120252 -64557 -26466 -9483
13867 -9483 50070 104287 35389 63689 130114 319236 442609 450646 499571 618755 745952
13856 745952 736416 562706 401630 260096 208741 148731 -4924 14688 -10301 -815 11560
13845 11560 9558 69425 84939 41776 1949 -6669 34325 17982 -5072 -41666 -76680 -14175
13833 -14175 49823 96100 76397 -6689 -16230 -98095 -188155 -191440 -129435 -116068 -37099 122681
13821 122681 151884 181373 150624 55764 62262 153040 161194 108799 24848 -24667 -52794 -20560
13809 -20560 44082 34067 -20985 -72398 -99643 -62622 -89133 -154914 -218090 -168875 -38022
13798 -38022 15118 58851 51377 10917 -5021 -79744 -90310 81200 168329 57225 -47107
13787 -47107 -47600 -40541 -20144 22237 -4193 -28543 5782 16257 -38992 -50092 -30979 -21025
13775 -21025 -69991 -113285 -194242 -228438 -173798 -105611 -131118 -112981 -113075 -194842 -180058 -75838
13763 -75838 -93665 -99780 -129473 -84123 21899 31300 -23263 -30217 -8656 -25229 23836 25844
13751 25844 59386 106636 107337 101178 17761 -16050 26567 -31471 -71255 -45388 -60882 -2489
13739 -2489 19581 71877 108157 24340 -89995 -90533 -35556 -44522 -104110 -99754 -102916 -127140 -63226
13726 -63226 -48874 -8807 -107695 -77687 510 58818 31858 69546 71334 63101 24692 47675
13714 47675 70322 53142 23968 69598 148413 141111 76208 24407 28266 -10052 30291 104984
13702 104984 197656 190017 153243 83990 82492 19561 -53969 -54498 31255 128391 143404 67186
13690 67186 40728 81263 112501 112583 110599 110925 15858 -16594 -26499 -35859 6721 -14375 -40923
13677 -40923 -116542 -43489 83286 47408 6521 17545 -21411 -30923 -58789 -20675 -3056 -11979
13665 -11979 -46304 -24236 32773 95668 76971 67909 37445 37133 9482 -17884 28051 62154
13653 62154 92870 97742 63506 44110 -5384 -107066 -160909 -102731 -60924 -29768 -23366 -55306
13641 -55306 -7622 -40102 -61983 -20418 -86122 -83878 -34444 34447 101937 6987 -35494 -28169
13629 -28169 -4314 28621 88754 11345 -35061 -36234 -28690 19943 -19328 -75286 -65130 -63074
13617 -63074 -18466 -34075 -59452 -16399 49171 123008 -37718 -77340 -15916 -40357 60596
13606 60596 54642 -17370 -112564 -119513 -93858 33371 67876 47233 57120 68061 83547 44418
13594 44418 32608 116831 103347 8410 -155600 -199935 -135617 -162757 -228493 -196796 -186572
13583 -186572 -117813 -19808 -63745 -62124 -117895 -141468 -97545 11112 -25054 -109190 -100109 -115758
13571 -115758 -79146 25823 101596 66068 -4765 -14428 33944 4659 -9832 1362 -8356 89174
13559 89174 143922 90482 63224 39923 -13760 26791 57032 39808 -3416 -25702 -8386 22173
13547 22173 10522 33550 57584 13473 36586 125251 210162 256762 167199 91666 29255 -14524
13535 -14524 -65536 -31569 14324 102117 41414 40136 39321 -25103 -76845 -126248 -158704 -189554
13523 -189554 -218672 -188182 -126119 -29639 27545 44929 24930 -13156 18663 36109 46242
13512 46242 54253 97015 68411 -56347 -104307 -55718 14885 73456 57103 80765 153567 191533
13500 191533 197034 224971 213633 88805 -48856 -43233 7566 41150 51654 48479 41045 -18108
13488 -18108 -55237 -43846 -86374 -122131 -40278 81055 141906 85952 17700 -6564 -53321
13477 -53321 -32873 3736 21298 -46664 29537 70090 135065 155751 185966 120549 -36603
13466 -36603 -43355 35920 68112 15102 -135578 -84351 35293 73737 81959 116467 134210 112895
13454 112895 53667 77339 -1454 -57232 27088 26639 -20961 -21658 -22005 -49694 -49377 -18687 -66976
13441 -66976 -68086 -15693 15824 1105 -5814 5149 -13791 -18567 -38941 401 -43875 -59775
13429 -59775 8835 55815 34333 14677 68595 50427 -21541 -29043 -35953 -11745 15325 48940
13417 48940 59287 31797 294 38889 77489 -78 -26660 5698 -20233 -43467 -29195 -19816
13405 -19816 -6680 15082 10531 29346 65504 92285 121325 59974 -15055 -49641 -86893 -137909
13393 -137909 -185741 -254215 -199569 -144350 -15482 78506 68127 83490 55735 4331 -13148
13382 -13148 27272 15238 17241 81527 44919 -31929 -90533 -25175 -28153 5301 62172 6518
13370 6518 49591 34191 -51248 -74003 -131897 -192513 -53325 -28119 23930 78520 106229 87667
13358 87667 23222 -31875 -74812 -25525 -1279 5430 8688 83077 121375 82146 177330 170279
13346 170279 158135 85419 75730 77434 57256 -16116 -59432 -48333 -41955 -31944 4384 18445
13334 18445 647 66345 141339 97149 22539 44018 66389 12943 -76598 -110185 -103553 -30016
13322 -30016 -75474 -115482 -134513 -103389 -88192 -31106 34608 -7971 -41162 -16554 -12408 -17863
13310 -17863 -43178 1156 43075 3363 -1101 -30304 -108634 -93122 -69266 -101497 -77089 -87273
13298 -87273 -70811 -52421 -37361 -50690 10679 35177 22692 -22235 -52108 -31430 -84534 -52823
13286 -52823 -3276 5939 -39385 -28047 -44298 -106555 -109982 -85490 -127773 -155332 -101882 -148513
13274 -148513 -86023 -51924 -100854 -86428 -19726 43736 46536 6479 25434 72006 13019 -54726
13262 -54726 -134821 -121937 -8961 11450 -426 -58273 -149560 -190265 -180465 -80754 -15100 25037
13250 25037 5044 -25722 709 -17256 -54610 -92783 -39936 20715 40301 -2654 -22741 10233
13238 10233 42772 -4828 -43867 -68912 -59774 -91666 -126708 -37267 55383 89770 90665 9561
13226 9561 -30240 -82812 -57241 -34500 -54033 35075 82094 3582 -35255 -70771 -94312 -29894
13214 -29894 6850 16672 66034 35134 27740 48322 66889 77674 34820 -37730 -25189 -97907
13202 -97907 -159180 -222082 -230959 -196925 -120495 -6614 2130 11447 71454 91332 29558 95793
13190 95793 207959 229386 152985 175648 80055 24527 75264 153237 181775 132017 85720
13179 85720 44610 20542 38296 13626 22043 60252 102124 27136 14797 25984 -36755 41626
13167 41626 65870 67328 -11379 -96537 19938 99690 81331 107455 139684 112744 142069 219930
13155 219930 286075 362677 461278 501226 565077 611229 452511 342590 290611 296085 278137
13144 278137 161603 116380 106810 62687 135492 139496 119409 141860 115087 57360 20004 -35725
13132 -35725 -42328 -6876 10178 24512 15460 32043 14895 80072 146262 202882 304563 334224
13120 334224 365383 412487 540219 571097 470358 337598 259739 192469 99744 95630 35390
13109 35390 12585 60794 -20049 -39646 38813 85091 111481 134118 120591 86652 60817 42967
13097 42967 119794 182451 103620 4436 -37187 32410 92134 154267 141501 203010 220622 121624
13085 121624 123825 139148 195375 206965 127996 110857 119176 106363 44398 59561 121511 201950
13073 201950 271737 261300 221181 199655 125975 106033 62065 54348 37600 35331 84533 72172
13061 72172 137359 188133 181432 203235 224329 112369 25105 21228 70883 64534 56594 36498
13049 36498 17599 6262 -31926 -53391 -59785 -32366 28253 75275 22433 41484 24303 100278
13037 100278 29550 -35646 -55964 -54181 31277 35885 46453 83506 114487 88169 20188 -53118
13025 -53118 29323 120526 164023 221194 104174 -5345 -42379 9775 35968 39689 100292
13014 100292 94555 22576 -23689 -46506 -22515 -36633 -61827 -76647 -101787 -185876 -130927 -107800
13002 -107800 -43210 -65377 -74648 -82721 -95912 39033 42670 -5634 -55504 -32623 45823 60093
12990 60093 -11049 35841 104952 121320 100072 73367 55990 55623 -43462 -153785 -190415 -161617
12978 -161617 -16056 17440 19344 42932 16911 -56839 -103682 -104339 -95200 -62138 16081 5714
12966 5714 -37544 39869 74541 43547 -25510 -34300 -38387 -50914 41653 161599 191082 157244
12954 157244 126215 90869 86976 152279 178685 58476 -72055 -4415 35916 -9473 -70499
12943 -70499 -74192 -78429 6174 17573 -28524 -25826 37279 38827 -13053 -16660 5354 19366 81599
12930 81599 112926 26963 -25571 32241 135310 33617 -7234 12948 50091 95265 64230
12919 64230 -7779 13142 32820 49781 77425 54173 37705 23252 29725 11123 -17418 27396
12907 27396 37989 84089 111322 148695 145840 34818 -5838 -30381 -11732 11167 61324 11595
12895 11595 -31972 -40133 16988 38598 72084 49861 -41031 -68026 -49726 -66542 -50702 -31538
12883 -31538 -28312 -87432 -30238 -21381 -19097 -77189 -68046 -72594 -129652 -118983 -64429 -1076 -40874
12870 -40874 289 58225 60130 29382 42775 -5760 -52732 -26984 -29715 1242 -2878 -20642
12858 -20642 -69518 -41425 29447 63599 86361 91518 88127 86366 58465 114652 93849 12945
12846 12945 -44341 -30791 -15955 95155 108323 126518 95851 5711 -25680 61366 103877
12835 103877 103309 54754 19386 40061 133072 153458 108534 44328 -11541 -33243 -9688 63830
12823 63830 79530 72028 20027 11904 61644 77705 34622 59308 15327 -33222 -48998 -368
12811 -368 56957 63476 124233 155205 162951 192021 107368 27552 -94295 -89809 -45052 32870
12799 32870 39550 128965 128509 863 -10558 32232 7853 -62045 11739 52651 95951 132707
12787 132707 115773 76237 67461 89466 37127 8926 -36538 -19719 1768 -1779 28176 54585
12775 54585 55932 33023 10064 -18421 -21293 -9423 -769 -21352 -49041 27079 -48471 -115068
12763 -115068 -50324 13177 61337 -3473 -64349 8561 -27817 -60888 -49085 81763 122326
12752 122326 108599 75265 -34351 -81996 -104723 -139261 -115920 26780 86306 107032 95034
12741 95034 -26023 -124025 -47380 27150 41183 29423 3811 51870 87223 140640 69651
12730 69651 462 -6973 -43310 -40630 23468 103290 49017 -42087 -99953 -88957 -73384 -87405
12718 -87405 -87440 -48689 -73387 -77706 -99605 -52724 152635 246023 157146 145574 142694 20646
12706 20646 -9368 -65678 -74995 -89464 -83709 -9014 69477 83592 56439 90439 92335 -5965
12694 -5965 7061 12505 35618 45215 3150 -53359 23080 53346 45295 16875 -109104 -58515
12682 -58515 7890 -9914 -99032 -94028 -77488 -76573 -82722 -13280 12385 619 -13568 -42824
12670 -42824 95980 150141 188379 188011 15937 -27650 -82247 -84755 -43516 -67371 -138907 -128758
12658 -128758 -89987 -44575 -108654 -96923 35877 -19681 -122249 -139731 -182086 -123602 -47904
12647 -47904 -6859 -17418 3600 38647 111271 90077 115132 74867 16450 58069 100505 33005
12635 33005 2093 -17678 -60721 -95825 -66037 -69479 -52707 65415 75291 16295 81663 83970
12623 83970 -29021 -24735 59712 77349 103812 108194 122777 56097 28531 32747 -10355 29023
12611 29023 -20190 -60624 -89428 -127151 -83733 -74889 -76830 -41630 -88740 -52058 14659 8560
12599 8560 69788 47348 -12733 -15565 23519 42410 74788 53326 65663 19579 -32441 3591
12587 3591 17516 126463 127677 18507 32996 80014 134489 126843 35953 9256 56592 87532
12575 87532 115427 88121 -51924 -86626 -114993 -122246 -98736 -44783 6740 -20057 -60937 36575
12563 36575 174563 153072 83538 3812 49586 60497 9439 37473 52675 127459 167361
12552 167361 101045 129712 152886 78774 17218 11332 3503 -28141 38437 35298 -24923 -35890
12540 -35890 60758 114933 119752 83680 71156 94940 121112 132089 93742 43671 -28104 4284
12528 4284 58814 105763 88399 124758 148534 101386 72534 74119 36967 72622 158002 208035
12516 208035 176888 131844 113522 153592 123718 26082 73250 181565 145258 165891 182724
12505 182724 197870 197588 203731 172607 153775 125970 97386 62272 19788 38548 2418 23641
12493 23641 36236 -4875 -27721 31005 -24549 -66642 -104703 -36696 47098 97243 112603 128963
12481 128963 77182 144808 216114 222734 288080 283735 239593 204126 203484 284404 262386 180516
12469 180516 77555 3341 -13979 19815 104474 169637 154731 109138 5265 -55724 -45825
12458 -45825 36014 118469 76435 4116 -38651 -44977 -63456 -96903 -134319 -66336 11719 23083
12446 23083 64012 54038 50398 -20864 -38657 48458 98428 117919 140219 95356 85307 97974
12434 97974 106062 137184 185333 181780 135496 47146 105156 177666 114954 56171 47999 14594
12422 14594 -10808 -35209 -3022 46463 77444 17465 -12543 -92640 -95480 50121 109038 109264
12410 109264 52491 97380 130959 175364 163512 113396 62349 49016 -24218 -24584 -2848 50988
12398 50988 8654 -110911 -114740 38838 111813 88264 7852 9979 56446 57621 8599 -31969
12386 -31969 -26647 -11022 -24023 -82406 -79940 -13494 277 16244 23626 27825 78682 72895 57017
12373 57017 4598 7934 47010 101157 -11475 -144070 -111195 7222 64514 -72040 -107723
12362 -107723 -109225 -108446 -129637 -71663 -17783 11207 24082 -18233 6276 10572 -12169 33712
12350 33712 28608 -9976 -47057 -35489 -33482 6428 67714 7530 -54508 -53969 -39767 -60817
12338 -60817 -61002 -66666 -84630 -122340 -87670 -56536 -72948 -58045 -8392 -29934 -95844 -88977
12326 -88977 26218 -33450 -77294 -56071 -49822 -29491 -13090 -22678 -46826 -103660 -130164 -179727
12314 -179727 -131377 -45285 -119935 -103336 -49949 3118 26501 6526 582 16133 58564 59362
12302 59362 -32010 -61697 11067 23388 61485 61990 84835 72797 27495 69094 13255 -31026
12290 -31026 -50559 -91999 -101537 -29056 60631 38174 22341 -29053 -45564 -17719 -32686 -21413
12278 -21413 -2470 4125 35409 -3067 -66384 -110335 -147136 -167410 -192621 -201246 -128552 -154305
12266 -154305 -138234 -70737 -98812 -134081 -103386 -99359 -116980 -79634 -44828 -3123 5498 6536
12254 6536 49678 -9811 -97507 -15067 30895 68108 40473 9738 -14660 -101463 -101641 -38131
12242 -38131 -90373 -101095 -68235 42882 139458 221039 192349 128402 7314 -69023 -34577
12231 -34577 2992 66129 113529 54915 45450 49042 47885 115706 42847 -89279 -145404 -134039
12219 -134039 -97172 -19142 -17774 -23857 -113729 -122549 -76993 -79481 -113972 -25659 23153 -7710
12207 -7710 -45723 -37642 -43968 -70706 -72162 23761 2170 85774 169712 186095 161953 171100 134783
12194 134783 119426 100342 163593 190647 217326 208527 163643 105750 35555 62654 -26687 -13415
12182 -13415 44511 -28411 30170 120366 155798 197206 214479 189616 192080 240618 275791 253580
12170 253580 212802 110824 -6046 1774 43620 68731 26616 -18591 -38144 -53847 -71382
12159 -71382 -164864 -182000 -115236 -49296 24084 173862 162011 167563 118020 43527 61204 67254
12147 67254 71349 33695 36430 5183 -54108 -29257 1941 14864 -33054 32148 123625 109541
12135 109541 -37130 -132890 -127202 -43372 52232 96011 87998 51902 -3521 -11392 61369 42556
12123 42556 16647 -32079 -92214 -141874 -226750 -157478 -80563 -25017 48781 122912 149335 172737
12111 172737 252740 239588 128078 93849 116472 181160 234011 261837 267443 158561 141067
12100 141067 101612 12951 -25780 -33225 -46133 -27792 -16748 -18366 -23342 -71120 -36878 37148
12088 37148 19724 -19806 63970 96800 48999 -24164 85068 168904 148488 150735 141650 64015
12076 64015 37231 64660 106176 74614 23244 16644 63894 74948 51690 94512 132225 141905
12064 141905 124307 106993 96855 70872 203525 412426 606535 677034 743200 820046 779885
12053 779885 724379 652550 557969 550875 470103 279481 67741 -22008 -33963 -62370 -9604
12042 -9604 -30000 -44305 -20643 -118724 -172007 -129333 -93121 -95552 57453 139595 97116 51281
12030 51281 135345 144015 119539 96774 106300 55011 3692 10040 49935 -10399 -2760 6065 21294
12017 21294 155173 278031 280706 328050 301587 209827 99723 2222 25901 163501 214339
12006 214339 258683 305048 261037 238215 233532 221875 288312 315218 318987 342054 360999 327322
11994 327322 281435 229952 246577 216493 245246 362925 409193 388035 406798 392819 368227
11983 368227 374905 296897 263043 262766 312559 322169 381389 425080 439930 457713 514096 484528
11971 484528 516810 574621 601193 577808 583330 590236 660572 728418 765644 758413 884893 1043738
11959 1043738 1105430 1173900 1247620 1337973 1392276 1347238 1349720 1500294 1680994 1815100 1829383
11948 1829383 1806891 1963171 2057792 2115603 2279842 2535103 2826075 3122463 3448768 3767138
11938 3767138 4165271 4662321 5183978 5745120 6516508 7317892 8215659 9338123 10639734
11929 10639734 12281103 14272661 16827127 20189863 24611389 30538570 38897043 51057446
11921 51057446 69356584 98282841 145238367 219057292 316603133 397099098 403611667
11914 403611667 331115314 236016936 164178812 118243486 88952526 69467667 55956108
11907 55956108 46195716 38852660 33081064 28556009 24930064 22079003 19700227 17685941
11899 17685941 15843941 14345212 13070881 12109478 11193791 10377405 9737855 9300001 9096442
11890 9096442 8882573 8876366 9055638 9406606 10084977 10966502 11981106 13124399 14307123
11881 14307123 15655209 16953268 18090274 18489171 17953346 16738887 15234411 13722999
11873 13722999 12207429 10779116 9477955 8103931 6933886 5975803 5195004 4594116
11865 4594116 4172673 3754013 3401006 3139380 2836776 2567165 2444502 2350348 2268673 2113845
11855 2113845 2064074 1996141 1913624 1790743 1701438 1601591 1510818 1386012 1327118 1286505 1272128
11844 1272128 1241892 1204942 1132638 1043185 1044183 1043650 1018502 960333 969425 939127 904464 868835
11832 868835 808977 806322 770267 738922 677739 663811 692011 771224 728749 643881 624117 630630
11820 630630 649546 591772 606547 709654 681089 667191 610527 620680 607965 556206 550050
11809 550050 597080 602466 676524 668653 643183 556212 481347 480021 448576 467138 475687 510922
11797 510922 539819 557018 602327 707003 708420 593955 580402 646319 697442 689288 749471
11786 749471 779659 819084 805366 666280 524965 336156 147465 38108 13086 -20242
11776 -20242 -73375 -111640 -18756 81243 100188 225996 417135 530276 603641 618211 652629
11765 652629 849284 1282682 1926020 3169657 4884960 5624017 4790228 3208850 2007552
11756 2007552 1361454 1052888 899509 833169 783357 619511 559209 487264 369692 362839
11746 362839 311222 269942 282521 331543 250399 192259 153117 233358 308653 373229 353353
11735 353353 428501 379903 267611 212359 73843 20314 -56772 -89976 -105226 -80943 -74415
11724 -74415 15099 97345 140265 44458 -3218 54733 84153 91922 183593 183575 149449 119713
11712 119713 161046 194996 200895 195338 222342 203965 204146 236725 217617 131867 52826 60706
11700 60706 178232 240645 307874 352237 240268 148474 131716 73658 11888 59794 52275
11689 52275 -30389 12675 92503 120607 177858 170336 79319 127801 168371 162294 219637 301574
11677 301574 462341 620674 670633 638188 571614 519047 459979 389960 264412 266002 300187
11666 300187 383314 648675 891606 1251955 1663049 2104831 2401850 2313098 2018259 1640797
11656 1640797 1352837 1204789 1012531 855791 714311 584079 493045 437368 463307 463820
11646 463820 501024 578366 583809 545617 509333 603641 688431 859048 1054489 1100982 1135001
11635 1135001 1064067 984712 1002012 1156951 1324759 1601333 2086735 2533459 2766249 2677249
11625 2677249 2232377 1712368 1275333 978497 764267 503475 390228 389056 418913 425513
11615 425513 317573 225384 216565 273289 261367 161157 195332 334323 406538 382570 416654
11604 416654 530623 706546 777471 647928 548041 395211 249197 208074 215424 151735 155926
11593 155926 162522 211073 194533 63784 10184 -18384 -36705 -41020 72539 95312 83039
11582 83039 99833 73468 25988 80157 59330 13763 24520 104707 141494 174541 248144 355031
11570 355031 393776 516495 678299 567037 399603 225020 250269 239623 130250 102724
11560 102724 119957 82611 99373 64398 19344 -11817 -25094 16488 19342 63996 155793 262701
11548 262701 215831 148412 51895 -1533 99342 246320 365839 391727 319421 271107 221499
11537 221499 137863 78568 17067 98715 115612 133673 88316 57548 -24116 -13366 1918
11526 1918 -54565 -25485 38610 4381 -5717 -72362 -163399 -129380 -41939 -17736 -2155 23439
11514 23439 13648 20738 131213 152895 194752 248174 276273 347173 356021 220295 117632 35681
11502 35681 3788 130792 93482 16914 -56587 -37045 -29991 -7391 -7913 -7733 45738 85562
11490 85562 34777 31662 16757 82187 124963 52377 28996 60475 80852 22315 18804 3784
11478 3784 77996 117041 86011 146424 121876 79490 37888 5338 -31332 -119500 -114708 -27147
11466 -27147 -66874 -78467 -30647 -32655 -8088 -76720 -223589 -194127 -139548 -113124 -59573 -107992
11454 -107992 -68451 -82185 -90200 -79302 -101331 -97237 -67202 -1549 -63928 -56237 10843 16541
11442 16541 -38732 51687 39545 15216 16246 25976 46087 157274 174057 94411 28902 -39227
11430 -39227 -37584 -19712 37036 44175 379 -72596 -27030 11405 95601 102353 57866 2156
11418 2156 -56488 -51362 7691 114887 92419 35887 -69910 -89502 -88516 -73900 -34929 20516
11406 20516 37861 52955 19730 -70489 -146697 -112598 -130609 -167876 -106616 -31713 -26756 -4512
11394 -4512 27772 -11443 -27736 -30388 -45414 -90341 -99882 -55650 -51263 -101692 -77984 -17860
11382 -17860 2012 -12694 22194 73199 75092 95694 154201 153034 121032 67947 129968 76740
11370 76740 23548 13487 -75830 -51235 -818 -36747 3476 46780 76791 83762 130983 196758
11358 196758 160691 95167 47252 -20211 -119396 -163812 -126402 -68641 -120942 -174891 -192506
11347 -192506 -120024 -9457 67394 -31150 2492 -24125 -108705 -155506 -66714 5045 35703
11336 35703 32087 -17154 -22455 12615 16993 76180 165582 204375 220451 169261 33414 -46860
11324 -46860 -83391 -59304 -13955 94361 78887 45220 56128 36093 814 -59019 46487
11313 46487 234603 232192 192145 131082 79958 59150 105353 199472 156812 96977 40145 50567
11301 50567 3483 -22817 -38592 -39127 -10863 20289 -39215 -48184 12796 -59550 -66563 18867
11289 18867 -36627 -132193 -110123 -77192 -49601 25224 31137 17175 9626 51957 169427 192644
11277 192644 106688 19983 19872 76465 79368 35111 39372 67978 57361 -49014 -41633 -94583
11265 -94583 -119542 -27183 -45678 -27212 -16872 13515 101244 71856 51583 49635 4937 46359
11253 46359 129022 107527 28010 21165 63998 32614 21071 -72556 -42259 8568 65654 62721
11241 62721 28739 36263 21190 6787 83885 85147 90740 135570 106941 114768 61882 24576
11229 24576 16050 -50707 -32045 -53879 -19581 44440 60807 70023 25459 -12983 -35259 28691
11217 28691 58031 22568 3681 26585 98249 79766 79827 66747 24045 6361 43441 121901
11205 121901 213758 236854 231709 185161 16891 -48836 -53851 -31034 -70290 -50785 45606 31084
11193 31084 -23431 13165 -5356 25352 67708 86343 119839 99645 52819 -1822 -32173 -28347
11181 -28347 -6484 6671 10812 21000 -4067 -20194 -6389 -75818 17075 44149 14472 -73633
11169 -73633 -89889 -84101 -107866 -108798 -30068 -32326 -21355 -40567 -113424 -90188 -67320 -24025
11157 -24025 61082 46252 26329 -15203 -39217 -22215 -3957 -65568 -59118 -59009 -24864 -11945
11145 -11945 18011 106920 87750 73447 35566 -4598 -61365 -109173 -141469 -83029 -56691 -66701
11133 -66701 -80106 -18005 31052 101323 63938 52744 70093 52404 134857 209377 182824 140053
11121 140053 95770 13099 1660 55368 -40501 -74564 -36291 9443 73566 61236 6387
11110 6387 -22779 23202 -50441 -83506 -47005 54032 38232 -51353 30997 165371 164968 125040
11098 125040 134071 96058 116705 23179 -6810 -18219 8709 133510 162194 90382 57968
11087 57968 63123 95684 95347 56013 41236 -9556 -5268 11462 54667 61098 56161 -20130 -9981
11074 -9981 -23412 -55655 -35702 -77703 -74925 -32396 -8832 26473 34129 -68477 -70730 8531
11062 8531 -43546 -92313 -97836 -56130 -9444 -16097 25423 82094 108876 169634 117841 52376
11050 52376 22973 69971 137242 261756 366121 382550 363376 364027 352415 325173 300477 385318
11038 385318 396432 378088 435351 535127 624346 813431 845166 804272 778499 648729 609828
11027 609828 685394 715031 681511 722758 914566 1171782 1326505 1304492 1182743 1018042
11017 1018042 857750 762926 650845 657547 695573 696350 813175 902364 976464 991240 969477
11006 969477 816772 660749 480170 351255 382997 375702 353796 443276 523659 535844 535837 430795
10994 430795 296909 148920 105635 59092 34307 41091 109075 98299 133189 197382 139429
10983 139429 92024 3821 -87609 -45182 40441 -5099 -62275 -91041 -99282 -28058 -9763 -12812
10971 -12812 31696 100244 95477 93809 74648 61067 40098 -12481 90134 75628 23751 -34710
10959 -34710 3168 115118 122877 116132 72417 158736 276137 297815 310437 251422 154336 104232
10947 104232 119867 165505 147833 112375 121034 66195 -4873 25175 75187 37796 12894 -2461
10935 -2461 -50439 -56657 -62952 -78196 -34499 16126 82036 114827 100367 6087 -37651 -182
10923 -182 -11306 -28183 -62904 -122341 -84380 -14084 37175 27987 61967 53549 -29266 57808
10911 57808 39695 30609 -32726 -144061 -154301 -91527 -86330 -1954 84577 71312 37826 5773
10899 5773 -12712 -30545 -26137 -34812 43859 78160 37738 -1743 8953 -23295 -14050 103274
10887 103274 145168 134149 171090 164743 175117 149416 79261 38264 17687 57119 91942 75555
10875 75555 5959 72620 268637 301956 214724 186314 223904 151571 103184 102524 142035 177805
10863 177805 192281 189439 176934 191521 173181 160794 124071 13155 20490 79449 63762 36693
10851 36693 40359 126231 229848 279795 201618 138461 116097 123098 98542 52725 -13065 27523
10839 27523 67325 93019 82312 91489 138330 167307 78302 16287 -21856 64690 58462 53867
10827 53867 69335 79972 129164 174759 173244 116431 49778 8364 -6943 -61041 -15971 52916
10815 52916 96462 -21380 -82820 -33015 -90 41484 82371 77032 31714 -16119 -46717 17538
10803 17538 88332 36192 22611 34705 114484 154571 168796 126469 90916 70717 110319 126973
10791 126973 87606 98834 146683 211489 247007 276346 396534 398594 379701 353189 246577
10780 246577 134415 149167 134574 123869 121118 142791 137053 191225 213386 175476 207190 277095
10768 277095 292369 267484 289124 207001 105163 112305 98299 82711 94189 87674 98442 -41192
10756 -41192 -86539 8379 111955 173010 174867 235376 237155 284481 287931 255231 243736 289467
10744 289467 404562 406267 369983 454766 443083 360146 255092 277292 303994 297695 384741
10733 384741 401377 446045 522347 480277 470424 462420 402467 323086 316078 392843 367111 307760
10721 307760 300217 340565 313838 341484 275246 265625 281741 174720 168999 138711 29013 -86885
10709 -86885 -123289 -144678 -49991 49903 58802 194254 156758 21829 102987 116643 105360
10698 105360 69143 62256 55746 133943 160982 132097 63696 -41717 -33854 70063 44702 -11336
10686 -11336 27378 52212 78348 28739 -20783 7017 45326 113683 192787 235216 195088 172794
10674 172794 235512 235597 225106 177823 180704 267070 228660 220675 228505 141178 149290 211264 217575
10661 217575 357625 331441 357136 456700 524442 559749 560531 642046 726188 729149 734975 669833
10649 669833 732157 805518 827047 884411 989673 995836 1067473 1114285 1192304 1253222 1300973
10638 1300973 1380688 1560907 1815969 2146667 2479022 2879779 3441088 3821726 4080221 4397107
10628 4397107 4699585 5225967 5921469 6689487 7799592 9408528 11636101 14740372 19040428
10619 19040428 24899684 32812601 43061540 54987742 66040697 72566276 73134875 69654800
10611 69654800 65227085 62428274 62518736 66447488 75214327 89788438 110652988 135488730
10603 135488730 157092169 166233222 160019579 144579130 128818364 117877434 113545828
10596 113545828 116337377 126925901 146149252 173716471 205383091 229802738 234279931
10589 234279931 216444320 186952429 158573574 137489517 124645977 119459017 121490378
10582 121490378 130584585 145580892 162410862 172989348 169367324 151533627 127490215
10575 127490215 105543157 89234411 78745995 73300951 71859705 73584093 77501833
10568 77501833 81558172 82504788 77861072 68051865 56097344 44941384 36012115 29321319
10560 29321319 24477310 20905489 18124882 15886632 14067942 12745788 11608842 10545132
10552 10545132 9648453 8890249 8229005 7557641 7003778 6585340 6207831 5733062 5448288
10543 5448288 5120777 4801536 4479254 4274221 4063588 3906861 3651888 3426930 3324514
10534 3324514 3226634 3076104 2949664 2781946 2661645 2517723 2468295 2453636 2405225 2313845
10524 2313845 2189061 2052469 2002422 1919776 1900040 1884798 1814540 1823500 1800832 1728254 1643568
10513 1643568 1570414 1511676 1457365 1392403 1378628 1388148 1350299 1257650 1278793 1284962 1230955 1201076
10501 1201076 1201838 1232828 1160882 1045776 1014763 1041857 973842 885878 873327 907696 1036782
10490 1036782 1088160 1046454 1038997 979626 977636 1058171 1014354 1048738 1077367 1065011 984741 911703
10478 911703 844489 867796 829374 794710 806025 819515 762698 744952 687308 701253 665704
10467 665704 658824 581157 624834 661542 583357 631635 685037 664464 687378 593116 593206 645927
10455 645927 586880 514312 365898 259527 221589 255349 329340 442823 508660 507074 467147
10444 467147 275322 151778 187484 251086 291531 328212 326530 293601 264425 246551 239293
10433 239293 294640 336983 266028 171216 211355 155362 57505 30195 173880 141429 6818
10422 6818 49312 150616 199754 313285 358958 269685 157921 163375 212119 265438 218287
10411 218287 171521 218991 290728 307295 276655 329627 391381 230041 173767 179160 112887
10400 112887 122975 150023 257860 353314 394674 402542 367361 324627 400616 490409 588989
10389 588989 725309 974992 1274723 1611839 2099064 2420257 2306242 1962127 1617535 1366281
10379 1366281 1139492 880657 694483 562060 390565 341086 418543 480124 390282 394847
10369 394847 401637 404985 386192 361112 311814 338036 273738 268731 303724 342607 280678 254099
10357 254099 252593 351278 411222 388643 301039 323652 339561 302238 291742 218284 236241 279198
10345 279198 205221 139631 145818 130076 141840 146327 264346 260248 207007 228873 310953 345231
10333 345231 261404 255531 316075 246856 140016 132201 193051 175847 185587 143326 144789 187917
10321 187917 254686 252385 204867 184042 105000 123642 131663 157068 140633 152082 146323 97043
10309 97043 143966 160426 162749 169443 131100 129099 132106 211692 253455 272460 248770 260445
10297 260445 213007 134104 147357 213548 224606 171334 128689 96202 176448 179932 123921 121259
10285 121259 149979 211857 149519 146895 159487 243286 239129 233581 256847 230994 257519 183311
10273 183311 200001 270307 304235 283923 266191 254175 195818 175248 244524 300063 266857
10262 266857 260419 236919 224399 189604 302037 262306 196752 127497 156153 222038 198432
10251 198432 103713 118450 99170 151457 158130 299332 377077 184306 93519 68979 127079
10240 127079 131565 61320 87715 180492 240453 202888 246405 165395 193475 243835 226180 192078
10228 192078 180508 230123 223052 126967 157498 131835 134213 67998 73517 154457 188695 280095
10216 280095 228762 149888 131123 143058 139265 140748 121564 164588 144148 165207 177264 122427
10204 122427 133201 127741 160758 128252 97623 138954 155908 104084 82431 80901 145269 139425
10192 139425 86972 25440 95964 151739 125881 99739 48333 43451 123070 176493 233278 262026
10180 262026 360559 501173 517660 517163 524974 529031 498131 496698 589807 724550 777695 771280
10168 771280 926295 1068142 1235035 1265246 1214324 1001614 843100 864030 829613 779625
10158 779625 840053 950384 1103958 1287808 1440670 1419687 1347621 1242403 1095310 1015606
10148 1015606 962459 875520 812315 916860 1089410 1115775 1125615 1049573 943644 869229 824711
10137 824711 779808 674616 579699 535197 612614 635336 631165 613928 586524 471331 439298
10126 439298 442705 542100 626169 755101 849619 930626 933142 1012837 1112933 1237353 1119254
10115 1119254 949429 724890 505543 319775 149453 9697 -34631 -34171 47362 167295
10105 167295 241125 231046 194688 156892 186093 279358 374085 334185 258324 237473 230648 255538
10093 255538 282213 288215 258823 258651 259572 251405 271128 383057 390437 331624 325656 351396 384176
10080 384176 405370 371864 389605 458193 484907 477501 519153 549323 539761 569240 556188 625910
10068 625910 756829 764463 754271 757391 790894 834748 849400 715665 697680 730987 715582
10057 715582 762548 916940 1058720 1043333 1013903 972485 981563 969632 989043 1063881 1029479
10046 1029479 976871 1026312 1036397 1003131 930617 1025856 1106596 1177088 1198762 1264413 1353853
10035 1353853 1429429 1462783 1538611 1616686 1690724 1736294 1742328 1815713 2019695 2128914 2234854
10024 2234854 2341602 2423085 2592030 2824924 3042188 3257860 3425312 3718942 4013491 4340879
10014 4340879 4800193 5476330 6285962 7195413 8345372 9760603 11159739 11794845 11549492
10005 11549492 11046246 10918996 11181652 11666942 12468428 13583772 14794329 15764690 16529019
9996 16529019 17533404 18893031 20814436 23459090 26765322 31048543 36788662 44476410
9988 44476410 54937642 69503446 90505924 121447857 167901155 236710311 331088288
9981 331088288 433682895 487303768 450718771 353774605 259865117 192357364 146555653
9974 146555653 115038061 92748189 76595848 64556156 55298679 48136677 42546261
9967 42546261 38184878 34714386 31940627 29630768 27541303 25606438 23977432 22465260
9959 22465260 20950003 19257726 17293656 15495738 14161953 13025471 12031568 11222851
9951 11222851 10450871 9811051 9283851 8734751 8232583 7785400 7380892 7067152 6731890
9942 6731890 6431526 6197376 5958387 5710084 5496230 5373583 5225902 5142301 5022250 4951885
9932 4951885 5044669 5055260 4833826 4504671 4173258 3865360 3727344 3550302 3432317 3457703
9922 3457703 3466074 3272626 3082695 2972522 2816814 2643183 2564935 2545001 2495850 2387074
9912 2387074 2294496 2114825 1979994 1922363 1949004 1936161 1909431 1817541 1772569 1710610 1670713
9901 1670713 1564311 1461376 1425138 1464559 1535665 1518285 1504107 1404879 1373583 1283796 1216984
9890 1216984 1165854 1126834 1068467 1115827 1169696 1158044 1108900 1112587 1134511 1058352 1092523 1166677
9878 1166677 1198088 1222589 1218053 1258363 1163649 1166434 1228083 1236876 1237527 1159324 1063362 1041691
9866 1041691 1019672 1031772 1002589 965974 947151 942302 882196 843024 850645 880230 960839 1022289
9854 1022289 1020628 1065105 1113624 1053005 1126598 1108530 929843 781510 513745 262216 136785
9843 136785 76901 -5089 -99408 -148239 -139546 -45799 90539 191133 314016 380238 403286
9832 403286 430800 456794 549799 530726 528238 425681 358432 267684 251140 258558 393468 488388
9820 488388 457527 352884 419446 430206 394906 350533 345800 252336 226327 203993 144474 217912
9808 217912 222125 207507 209424 141033 202739 229043 264395 207469 157300 155526 194574 212484
9796 212484 171116 212504 172894 105007 31910 -82372 -101017 -73969 47 59582 68128 36185
9784 36185 19737 93037 223390 186047 113976 211087 279779 340274 287693 222326 255671 253352
9772 253352 270434 292992 307082 311424 223447 135916 227215 285213 266551 223913 237220 180070
9760 180070 203174 195608 155601 147781 191930 233480 249044 211502 156447 123884 128715 143183
9748 143183 55047 -35317 4654 106001 156413 214747 216581 195712 70912 46653 82879
9737 82879 94674 131869 176189 180713 206834 220862 185009 239991 201675 143226 95008 89162
9725 89162 99637 138335 181442 146671 115361 69038 72943 176148 276884 252263 268592 336553
9713 336553 332577 253166 104047 110826 189458 187228 208211 269763 312696 258330 265220 215211
9701 215211 204601 165068 124814 81515 92633 97447 77115 95001 85564 22210 50591 65401
9689 65401 167589 266070 263597 241338 260238 227230 274400 287903 241502 245378 178643 44984
9677 44984 -9854 86041 119087 171387 176564 161609 145529 133777 140020 205998 190588 190950 154253
9664 154253 67901 112849 165733 172141 116006 16054 40511 101386 62648 154693 269876 292080
9652 292080 254922 256357 200130 225479 137061 35354 105017 136843 196734 223458 172562 106251
9640 106251 57835 148182 187038 198118 200093 199127 167296 245753 295796 243708 149705 176222
9628 176222 259090 229045 205041 172087 159429 147609 100384 165341 199034 261255 252454 210543
9616 210543 181950 199485 238162 255322 195991 154627 167313 137757 144146 158587 185525 204458
9604 204458 106262 26221 24438 51687 167032 112598 115146 150698 160606 107086 80284 73139
9592 73139 88215 136055 177053 172504 171651 188149 261976 343784 294069 351457 305899 320521
9580 320521 368845 404971 458802 575769 712575 969045 1275828 1682031 2201630 2479711
9570 2479711 2353040 1926822 1480265 1097636 828435 575183 506838 419766 412331 385068
9560 385068 301428 244594 283384 191974 109718 102296 74070 105471 129970 245928 279125 219027
9548 219027 235186 222955 105987 40176 37883 108172 125136 152533 151885 180848 124006 129742
9536 129742 166264 194314 183025 98287 39946 -10836 -26929 33122 38798 126166 181001 200684
9524 200684 194678 173194 129416 87912 79406 159254 218889 175867 82019 99398 109399 51708
9512 51708 51912 127594 109835 38920 -10675 -46532 -83205 -74227 -98193 -109758 -17823 26470
9500 26470 60281 108474 53234 36091 34207 59429 73109 107845 162519 123584 24601 -38219
9488 -38219 -76011 -94762 -62291 -82381 -71118 -38388 -41475 -43855 -10943 38300 82993 120358
9476 120358 218144 246726 233555 184297 141956 111061 196010 326628 344030 198706 83608
9465 83608 121272 99919 101376 135760 201194 209346 190246 89322 -62068 -166742 -93354 56642
9453 56642 50001 -54565 -115123 -24749 84647 71805 71339 134832 144811 115455 75540 90082
9441 90082 129958 191421 184620 93756 14171 -15169 -45176 -89649 -60244 -1266 38667 -61968
9429 -61968 -62542 2785 79264 120615 175456 192426 140772 87967 49725 -28166 2408 16236
9417 16236 -8856 32791 25479 -67093 -133180 -63888 83239 161117 127142 187062 234383 166574
9405 166574 224624 179153 122347 148529 63898 34126 -59920 -21036 65178 116137 65164 99015
9393 99015 52810 -5168 -33705 -3811 5311 86398 107007 86047 23377 109211 147854 45057
9381 45057 7009 19970 110502 96805 54402 5608 -64962 -59847 89805 160410 142161 149416
9369 149416 115296 121610 89346 86163 78715 803 -63636 -26775 -31961 -59900 -77322 -124863
9357 -124863 -118917 -31082 10764 48776 78222 -27976 114235 82329 105596 101437 136536 166639
9345 166639 154719 109561 119076 122317 60416 1780 -29125 -56869 14885 47811 82559 84771
9333 84771 67385 53050 -2242 -109993 -154682 -92900 -1236 -55396 -120762 -52051 -48833 -22649
9321 -22649 95351 150481 140310 143379 96753 56832 21185 -164 -14418 -44930 -12648 34520
9309 34520 -18005 -41525 -32340 -31307 -39703 -47860 -25111 12734 -39530 -65140 -55716 -62311 -48776
9296 -48776 -52380 -93467 2559 65010 40730 48110 25202 75198 161781 145599 128203 41368
9284 41368 10269 76916 103003 62509 -27501 -28333 57619 91913 -6337 -82477 -72134 26212
9272 26212 19731 34003 135710 162822 141702 112653 94419 55416 12220 -47677 -40633 47940
9260 47940 69662 62255 46211 42546 9042 -3477 -34782 -76923 -97076 -66082 -30745 -31050 -21510
9247 -21510 -6676 18006 -4790 -27801 11591 -628 -73214 -26135 37332 -3251 57151 130480
9235 130480 186089 111252 139481 118019 -25006 -108603 -25815 -27240 46078 143066 93241 -14089
9223 -14089 -60 69539 74333 10535 39499 63227 60719 103729 74207 83536 94879 87190 19012
9210 19012 -6144 5827 -59062 -113958 -82146 -53470 31819 -26735 -89467 -64694 -713 -10314
9198 -10314 -62362 -87497 -28324 64237 139463 133824 32658 9796 13886 -13295 -16652 -37575
9186 -37575 -43826 -83967 -62260 -84173 -84637 -10404 -25820 -74437 -74730 -32713 -20467 39805 -12235
9173 -12235 -52228 -59033 -89252 -106926 -114769 -107482 -37951 33326 -31317 -125049 -198410 -186412
9161 -186412 -49075 -23706 52104 118403 -565 -54103 -29688 7014 74160 91391 43270
9150 43270 100019 106509 150197 79450 -1739 -146115 -159187 -120475 -76302 -80848 -136934 -66478
9138 -66478 -2307 487 -3248 39832 13127 54849 74232 22132 16347 -23286 -79423 -75604 -94870
9125 -94870 -157196 -163776 -160279 -106201 -67936 -21792 56541 103470 148737 141227 114809 25932
9113 25932 -48818 -52581 4556 15354 55578 4924 -16131 -13087 36320 48090 -59443 2814
9101 2814 139947 148110 78226 13047 -46607 -116680 -62849 2142 14392 3653 51494 31299
9089 31299 -6431 -31660 23734 177197 200144 96197 32252 63050 130669 27922 -19828
9078 -19828 -50266 -173877 -54369 16941 26351 -18626 -112345 -88709 -82442 -16827 24134 23613
9066 23613 -18147 -78533 -45139 20425 19906 -53008 -96457 -31625 8344 38854 107217 127323
9054 127323 108815 78117 79489 77249 105565 117747 126050 4886 -38999 20443 20948 50209
9042 50209 -13780 -2713 73649 77801 102251 147250 185759 189506 131829 136594 46084 -15951
9030 -15951 3174 102819 67742 88366 109270 67858 -36967 -56026 -40232 -32527 45223 25129
9018 25129 27895 64845 50792 12075 -3993 -41329 -38976 -60371 -72990 -99754 -43216 -379
9006 -379 63507 96559 165323 115075 7177 -31003 6584 36597 38176 51766 45809 27074
8994 27074 28027 22619 -41696 -91658 -167537 -149888 -60588 -1863 30502 21594 75608 35975 -48028
8981 -48028 -67490 17359 -16929 -25358 -1692 4208 -40818 -55285 -52383 -66728 -56687 -27282
8969 -27282 -42025 31482 67058 53582 35258 89056 55919 -70659 -56634 26338 9080 -44101
8957 -44101 -29987 -4183 26385 87498 86444 136935 134928 76641 18955 -71251 -138321 -66515
8945 -66515 3764 -12935 -10535 -1285 -7230 21966 -5753 -29513 -6975 67911 137527 104122
8933 104122 34892 -4311 60095 85482 7296 -42917 -97509 -95009 -82534 -71020 -28729 10972
8921 10972 23251 -10125 1042 23148 23285 53710 -11691 7569 14652 77483 50617 42734 41856
8908 41856 35488 -69211 -86221 -52824 -60075 -756 49059 60069 64731 30655 6159 24546
8896 24546 43693 -77834 -105003 -193119 -168164 -108339 -71863 -119663 -93163 -15319 56842 54159
8884 54159 -17928 -82227 -109296 -63239 -45770 -16026 25702 -24429 5692 82053 66739 112444
8872 112444 95153 -32638 -94742 -123784 -72721 -19250 34047 17169 97762 145112 114254
8861 114254 83520 93402 148187 130872 -16586 -90469 -50712 -13636 -7803 -20892 -127388 -59929
8849 -59929 -8321 18710 102939 155563 120482 62034 97570 159286 73706 -52019 -83052 3232
8837 3232 29473 -34190 -6240 1809 16663 -100709 -123740 -65047 -12744 30464 77456 33019
8825 33019 -5057 -25725 -91402 -53413 -50155 -33729 -68666 -37319 -41650 48201 85474 38857
8813 38857 -39869 -101041 -74237 21905 35875 75449 81717 48548 36646 7032 -34123 -83585
8801 -83585 -103342 -79283 -90129 -113331 -42160 8241 49312 391 -76403 -74398 40942 133991
8789 133991 135841 44444 54767 62883 28304 -22792 -90820 -156664 -153108 -138945 -115848 -44576
8777 -44576 -53696 -74005 -73885 -78136 -107006 -125038 -102657 -44568 -37054 -58896 -12150 87563 57430
8764 57430 61096 139178 132362 154001 94646 42631 15132 64636 102139 119980 117390 84934
8752 84934 46737 -3888 -11131 -19247 97516 88121 53538 76492 60418 85165 99315 12581
8740 12581 22813 89647 144967 174585 170699 135199 84190 54629 49047 15848 4856 -54468
8728 -54468 -154966 -138601 -100477 -84564 -105341 28467 76945 68961 112926 113341 62251 72537
8716 72537 11367 -26093 -66673 -88836 -43060 -54620 -135549 -215466 -132620 -33950 -37791 58633
8704 58633 100419 10177 -103537 -95966 -82745 -103886 -124220 -74285 13632 5045 -37879 -133
8692 -133 -106610 -99842 16298 31089 47082 15396 78225 113576 139514 129027 100693 214904
8680 214904 259110 219741 240812 168663 131454 79708 30878 6011 -28991 14049 61035 102539
8668 102539 82571 21531 -46260 -25463 63539 90862 123469 95220 70562 -18482 16916 28526
8656 28526 117821 101792 75434 61589 -15651 -78980 -98742 -93530 -55780 12492 43862 118144
8644 118144 194359 167409 166297 164109 140979 91784 52515 22305 52039 75176 41702 -57200
8632 -57200 -82625 -58215 33009 -35052 -30405 -14323 9655 -71181 -72567 22982 30499 -10959
8620 -10959 -7785 -17793 9049 -45911 -48061 -4075 36915 -22815 -24385 -15402 -14286 54354 68573
8607 68573 35676 8919 8176 75571 84578 94274 83387 43296 -48227 6979 26984 25415 6368
8594 6368 -10848 37865 2855 25906 78664 49726 23296 -15903 20490 -11170 -22747 36659
8582 36659 138977 115485 91915 38802 48429 57190 53967 -379 4855 47712 -82038 -172520
8570 -172520 -85359 2350 -38518 -70888 -98752 -69777 87854 107636 11600 42699 47862 62455
8558 62455 31379 7641 23056 44525 -7140 5478 23864 49871 72833 40598 -28410 -10228
8546 -10228 69359 15951 -39254 -27347 -14472 11232 44508 94042 85497 53265 3849 -71731
8534 -71731 -128124 -94988 -80234 -102702 -47271 -26592 -35979 -55877 -138013 -190346 -194826 -97457
8522 -97457 11786 75141 124938 143689 52083 8558 -43420 -61073 8105 37617 1582 55
8510 55 35721 -20275 -65037 -85815 -72400 -49280 25783 57074 -23608 -73171 -30458 38695
8498 38695 59108 58249 -18060 -52859 2494 141416 131323 36957 68989 91721 79754 17151
8486 17151 -105722 -173217 -171419 -131819 -91262 -101109 24057 67560 -774 -26184 -73013 -109722
8474 -109722 -108684 -114732 -104260 -25211 105696 85082 15799 -41804 -88609 -120445 -101732 -114319
8462 -114319 -188187 -181488 -115290 12053 97472 135811 97697 40061 -13664 -56127 -13603 74773
8450 74773 118345 168092 141697 100611 78367 201642 171463 140796 143211 137878 83955 99939
8438 99939 141089 95646 39144 106554 184165 122656 3352 -55208 -74666 12733 56222 42356
8426 42356 32751 42959 48286 31897 11655 72113 132076 148809 72704 23235 -56996 -37590
8414 -37590 -47956 -26351 -30904 -49896 -22667 2825 -10855 2301 -18058 -73466 -20976 71310
8402 71310 196428 154289 73683 14915 -13630 -18749 114889 70895 -6068 772 -34834 -89864
8390 -89864 -80210 -10258 33227 6400 -917 17630 -22950 -50717 -58011 -91351 -114900 -139141
8378 -139141 -96786 -4959 74076 -12509 -54885 -48754 -107170 -98107 -19250 87548 69417 32843
8366 32843 -16261 -14783 -48617 -47633 -103227 -94712 -118067 -92270 -65727 -49909 32930 108676 77843
8353 77843 21060 58397 -32814 8153 84809 38822 -37512 -54749 6279 -58140 -103356 -30860
8341 -30860 25856 75795 105565 50819 -6684 -98319 -107105 -83792 -56646 -12150 -12290 -62378
8329 -62378 -88249 -78545 26706 54695 92290 80254 81233 49816 74492 113607 22697 23336 68759
8316 68759 46411 9277 10565 31170 41066 77197 90046 66722 18509 21388 -10187 65124
8304 65124 108275 104030 60500 45104 2802 79232 163513 139015 103204 206690 221570 177601
8292 177601 121086 131912 109996 78267 54967 71689 -753 -10198 -44302 -66026 34890 11709
8280 11709 -34821 -8258 -96774 -111667 -28281 -103901 -104163 -27468 12838 3893 53953 35355
8268 35355 106641 107256 80382 153735 212206 115303 72873 115221 114044 130885 155192 195789
8256 195789 166254 146274 191106 264296 297038 264496 280741 341368 372992 555201 911067
8245 911067 1429301 2002097 2327685 2162050 1593143 1107122 755234 563729 438784 386704
8235 386704 296322 209769 188169 63952 90988 89184 25465 -14679 -22127 34840 104974 101845
8223 101845 30783 31912 122048 111006 64322 179831 241975 148720 73180 39578 -6384 17993
8211 17993 33792 126905 225654 334454 500443 760119 1277199 1831208 2083789 1934301
8201 1934301 1505341 1013678 577574 351835 257293 172515 187649 252311 339326 301599 200836
8190 200836 42632 -23500 58428 74741 29668 36074 110794 125686 128276 75761 -21119 -63623
8178 -63623 12039 23931 7245 69812 30039 29768 27468 28797 8503 -35512 -59537 -37961 -44183
8165 -44183 30055 5379 26487 16138 -67335 -41490 -40741 -48965 -32391 -19263 61854 75156
8153 75156 98237 123470 42432 -35518 -12527 75357 138248 201090 228282 200608 164986 184596
8141 184596 238767 189330 113625 53854 18829 -7305 -9087 -2987 52098 67181 43064 4003
8129 4003 12806 43010 2716 -53917 -60318 -4680 -46622 -67354 -58445 -18007 -2596 -1097 -40132
8116 -40132 -107553 -40635 19488 74506 94453 114015 70679 102932 38259 -71314 -78947 -87022
8104 -87022 -64854 -61962 -59405 1330 -72835 -106276 -80368 -147257 -118414 3798 54994 26219
8092 26219 -7209 -86892 -52115 7093 -25790 -2156 -40371 13215 156849 172181 98813 90730
8080 90730 75199 15731 -26865 -749 13365 51222 42982 -17083 -75056 -130194 -101151 -15303
8068 -15303 49495 69982 36318 -32715 -86382 90170 185111 128175 38419 48637 68762 120091
8056 120091 140253 86937 -7090 -35454 -79972 -96493 -126501 -145276 -150983 -110250 -14516 124382
8044 124382 176875 182947 127748 72529 83034 178142 168598 80404 -25891 -70257 -44659 -24020
8032 -24020 -14315 -66343 -28199 50663 127325 96430 55008 49235 -15442 12987 71738 92933
8020 92933 53346 -43892 -30851 -33485 84562 137174 106211 93631 104289 10830 -69046 -147887
8008 -147887 -213831 -100689 -53098 -33265 -33102 -73691 -98539 -155232 -38884 29348 31439 29767
7996 29767 19042 -30914 -152085 -190915 -153772 -67778 -26713 -25262 28986 62284 68453 94954
7984 94954 46232 -9407 -19810 51442 63233 -10768 -251 -22674 -10611 -30402 -37643 16417
7972 16417 26292 -53512 -12224 23785 -35459 -38904 14123 35801 24618 50392 36935 -19749
7960 -19749 -3699 109862 102926 -7213 -129040 -68713 73275 97873 62888 36414 12166
7949 12166 -60956 -34131 -29495 -13518 1272 -59101 -70489 -59655 -51622 -120955 -71518 28578
7937 28578 31057 72524 110753 146686 141333 82762 83389 48392 29929 97192 126419 42189 47734
7924 47734 -35665 -41811 -19373 10499 23196 20321 18623 52952 152613 142132 -7416 19721
7912 19721 16636 5968 108962 116011 11076 -56516 -136260 -70141 -27336 -38344 -75404 -81384
7900 -81384 -14251 60289 67673 84093 45493 -44198 -42434 -79834 -153447 -89546 -31468 5245
7888 5245 -33198 13846 12577 41543 -14962 -65323 -23812 8791 -14881 -88874 -69199 8089
7876 8089 -18188 -116223 -61115 -63728 -91845 -85421 -79914 -124018 -47954 5608 22829 14260 -5958
7863 -5958 6373 -17168 -24125 -51945 -159013 -174774 -200869 -78017 -3217 31984 76648 63698
7851 63698 28722 -31216 -64001 -24572 21205 -19348 12182 109346 71127 43996 118515 140800
7839 140800 171217 119055 61979 20516 57391 121312 121757 67846 -17179 28152 -36388 -62371
7827 -62371 4835 56453 2981 -33688 -28945 13368 18333 64190 65592 -22969 -91700 -91447 -53803
7814 -53803 14120 28897 53565 14348 -26091 -65550 -37166 -109602 -135882 -160563 -240554 -135796
7802 -135796 -78093 -81651 -73486 -49651 -93633 -100878 -34158 -29149 7450 35894 13230 44756
7790 44756 72056 -2821 -8073 -22123 -15759 24374 68578 40384 -44030 -13969 74842 46871
7778 46871 12933 29069 43905 -18916 53998 161299 220852 166102 129750 99782 63337 -38095
7766 -38095 -45583 -89963 -13584 56239 90160 94484 54715 30976 56466 46781 67539 68363 53315
7753 53315 46472 24373 45079 47817 25795 -57685 -63948 17861 49790 -21866 4932 42153
7741 42153 -22356 -44382 27638 37037 -3689 5149 58755 75061 -33762 -103206 -146454 -61555
7729 -61555 -12678 -5900 -13820 -39286 -29920 -31377 -126263 -59151 1863 42008 874 59222 138518
7716 138518 146904 94895 84481 111837 147809 120435 102666 -19398 -6384 -9398 97118 142192
7704 142192 55769 10900 -95242 -146702 -129966 6223 78085 71613 38765 -27663 -62116
7693 -62116 200 26040 -47205 -98566 -88409 -16047 37751 23657 -73269 -10313 -18755 -25973
7681 -25973 7786 -29707 -40627 -121705 -118288 -137245 -166700 -224094 -197355 -147616 -113781 -87810
7669 -87810 35261 116234 133460 72564 -26918 -55820 -81267 -38702 49674 63301 7763 -54077
7657 -54077 -77200 -2263 74119 73727 103049 116493 104570 52142 29190 48637 20932 -79809
7645 -79809 -78465 -27261 5653 -74389 -132480 -85697 38947 74042 124150 116095 87897 101363
7633 101363 114996 61651 72181 72454 8190 -66976 -19683 -25209 -6677 -66200 -111413 -137898
7621 -137898 -128201 -87906 -120995 -174002 -48859 46948 58061 17345 6907 -524 8114 -29576
7609 -29576 -20732 -19574 -41340 31430 10389 -5325 20578 50487 18140 -7600 -34141 -12817
7597 -12817 42332 53324 73105 47637 -37972 11362 -5376 -87660 -161602 -63892 91329 92982
7585 92982 -15964 -90902 -146581 -175835 -130269 -22030 62982 83988 76279 10519 3060 -9257
7573 -9257 2144 -27731 32457 23826 1609 -51920 1380 -18811 -69128 -79256 -84659 -109411
7561 -109411 43534 76366 42228 66270 31348 50229 24727 21633 49875 97867 80092 81240
7549 81240 33432 -51341 -57634 -38207 50331 56088 11660 -48503 -33287 -64297 -9375 9255
7537 9255 -23589 -12758 -34193 -160102 -186407 -95798 -37246 29442 66739 31743 23154 54600
7525 54600 49810 89513 92365 122330 110543 11856 45091 10444 -17551 34144 93282 53357
7513 53357 26109 84974 114419 -1868 -49617 -95383 -72668 1193 20083 -73200 -137293 -140848
7501 -140848 -124990 -89808 -128839 -146058 -51458 -50780 -40228 -77769 -109144 -101782 -71648 -29491
7489 -29491 -52348 -15248 44370 -12062 -41367 -35873 -47898 -56345 24308 73240 24023 42191
7477 42191 43872 42404 3309 -16738 24445 49682 34289 1015 -88682 -21684 -20440 -20446 58378
7464 58378 96945 -76446 -150563 -10789 69642 47733 -41387 -85164 -104899 -68789 -90666
7453 -90666 -104048 -23694 -26567 -16568 -19429 -90409 -136670 -93012 -18077 -22646 -31685 -27915 14273
7440 14273 -40195 -33380 22805 53611 37711 49863 24276 -20985 -24537 -20473 23208 59510
7428 59510 156649 156092 114818 106959 74837 116301 147195 111157 141114 196017 144588 76762
7416 76762 139601 93232 44314 63941 153757 131790 83178 1716 -60535 -46925 -5535 -1363
7404 -1363 -27865 31500 70780 74557 57172 43800 -40218 -51207 -32315 11218 63079 32976
7392 32976 -45718 -120826 -40814 -17740 26871 37984 26883 17793 -53173 -103575 -51672 -39589
7380 -39589 -8242 1698 -63626 -130499 -141019 -104587 -56108 -6663 -1686 93349 125557 70700
7368 70700 16270 4080 -27321 -44639 -58565 27391 7479 -56167 -106198 -96656 -77017 -54287
7356 -54287 -3213 44357 51719 10765 -39130 -89947 -54779 -36894 -26670 -48545 -88808 -99513
7344 -99513 -70602 -2375 -34600 -17008 25452 39806 90861 127999 61929 76673 34745 52167
7332 52167 18917 15928 25293 16805 24308 3572 -60016 -107706 -112726 -14773 -3340 -58053 -55904
7319 -55904 -22973 -47197 -70171 -22756 7410 -6690 -14911 -56076 -14106 73895 99691 72366
7307 72366 -1429 -67126 152 2711 -85847 -94844 -53141 -50417 -101440 -122618 -163634 -119559
7295 -119559 -86455 -1708 -42508 -55857 -22648 -61897 -42093 -13745 -44078 -21821 23652 -35297
7283 -35297 -74777 -44391 -68579 -47950 -64153 -42118 -27602 -16137 -32852 35560 106074 137752
7271 137752 136277 95695 97869 75851 71083 76948 -18932 -16295 123613 16251 -18226 21480
7259 21480 44480 18727 -3608 -6832 -33817 -52390 -18103 -1942 -41537 -115694 -171891 -172618
7247 -172618 -149149 -83018 -40536 -179386 -268691 -223583 -92967 30595 -22017 -74855 -110819
7236 -110819 -153125 -173788 -140592 -58677 -3876 27339 102139 86042 2007 -24172 28877 9225
7224 9225 -85348 -122405 -96283 -80762 -97845 -87048 -31915 14664 -27160 -95090 -57655 -20798
7212 -20798 -82985 -37044 -20861 -37373 -31461 -10681 -75349 -89279 -69655 -13754 50866 39880
7200 39880 25617 3113 -47086 -41055 -24629 -22795 -51432 -55625 -84943 -100825 -5577 63813
7188 63813 40193 -27545 -35781 -27752 -105896 -171831 -75440 -13135 -70466 -117400 -134332 -124548
7176 -124548 -103176 -82920 -75541 -47000 -10959 15791 -4759 39244 62531 -57730 -50189 15269
7164 15269 -4760 29955 -2527 -13947 -52824 -62847 -48633 54749 76106 46316 -7571 -20828
7152 -20828 40702 24772 -21183 -44731 -78205 -157780 -154480 -159653 -105009 -93674 -81658 -83686
7140 -83686 -124999 -115888 -10858 5804 -24972 -11770 -4346 43848 70105 74240 34695 80023
7128 80023 89188 61972 86842 91041 20827 -73245 -13269 99696 72586 117956 96335 20819
7116 20819 -62580 -85814 -24111 67212 73458 -5066 -96863 -69009 -12930 37522 26452 22953
7104 22953 -76152 -102119 -33259 -31562 26003 8614 17527 -28298 -44523 -50557 40561 53687
7092 53687 43003 1210 53143 80763 38893 24047 -62996 -27771 3887 -8149 -56530 -5662
7080 -5662 -3385 -6771 -43699 -119775 -48595 84451 71263 59610 102278 99289 26884 88250
7068 88250 155467 93491 -36977 -21736 29095 -37906 -64357 11207 32503 15150 70966 66379
7056 66379 -28136 -57731 -40519 -39903 -126875 -135150 -30324 81473 93953 38729 -12053 48617
7044 48617 95633 86444 77648 -22241 -145874 -210897 -142838 -77788 -67771 -12927 5479 26278
7032 26278 24743 28175 70336 107811 65114 -41137 -84120 12560 59142 130499 125735 70010
7020 70010 54877 117630 128719 73399 65917 50811 103877 121610 50485 47971 29156 40845
7008 40845 25908 18254 -10393 -15293 48534 33516 10285 -45281 -70693 -33936 -54146 -41773
6996 -41773 -33814 -37724 -15583 -11136 -34318 -129946 -213079 -162760 -57206 -36408 -14373 -25698
6984 -25698 -83327 -78799 -39055 -118041 -135869 -33133 10682 67762 151436 180759 144548 93184
6972 93184 68192 8468 836 10113 13460 10028 -50850 -77338 -85372 -40200 -26916 1933 -922
6959 -922 -130977 -134974 -57637 -53117 11635 6235 6336 -41014 -29594 14482 30552 63043 56452
6946 56452 -5415 -39093 -92917 -158260 -140025 -56385 -31163 -33731 -45922 -15221 20783 33260
6934 33260 77607 8497 5878 51712 175158 225909 127365 103330 116227 57173 86204 75993
6922 75993 8594 28904 -44683 -22912 -39258 -21703 -44644 -12319 52430 63299 92917 111025
6910 111025 62961 -5539 63981 42880 -4909 20146 -75059 -103053 -101139 -75536 -36131 -41444
6898 -41444 -26390 3085 75714 156135 155329 138754 56412 25192 50484 73009 91289 55797
6886 55797 -36014 -65187 -150405 -113747 -68967 -48731 -66099 -118038 -107121 -40190 55193 73533
6874 73533 131983 89115 46848 6161 -25642 -27398 -18417 -21973 2075 18250 -22968 13782
6862 13782 91518 35498 -61635 -21888 81196 5387 -61068 -65130 45624 63300 1144 36668
6850 36668 32498 -26547 -104289 -66785 49058 -75228 -164909 -132121 -40251 31202 62234 43058
6838 43058 96 -70743 -65393 -22359 -23741 -52381 -54518 -63017 -9848 1425 -62940 -80414 28960
6825 28960 37780 -19850 -33115 13991 9522 -65223 -87241 -94406 -83397 17691 88121 50426
6813 50426 -17624 62748 147252 57085 -6387 -42642 -35881 -76042 -49817 -12152 70145 43672
6801 43672 3075 10152 -14575 -52715 52586 58819 69636 108885 110995 56887 -31906 -34755
6789 -34755 -119586 -166061 -152626 -101300 -88596 -68869 -61494 -65161 -159722 -82523 37714 105029
6777 105029 98821 43749 12917 88549 136892 56593 -73379 -155143 -58726 -42468 -97966 -95555
6765 -95555 -35778 -36179 -104983 -133622 -126633 -77630 -583 -70187 -177515 -171937 -55335 63669
6753 63669 108594 49965 17876 19355 -1193 18093 591 -114325 -200471 -138637 -123796 -152136
6741 -152136 -88588 5824 47140 56404 55770 15991 -53310 4944 30650 65429 -56276 -218550
6729 -218550 -237610 -94611 20743 18413 8573 2148 18879 58984 29299 -119085 -147066 -144696
6717 -144696 -146500 -127407 -86629 -24784 -53999 -115770 -62756 -2573 78968 88579 94876 107931
6705 107931 37972 86391 153224 227533 111815 -11370 -11299 16265 76501 65054 26039 -69742
6693 -69742 -59225 -48091 -102956 -100098 -206 100353 135963 134396 145886 91530 89477 -14672
6681 -14672 -23625 33058 41392 -22879 -53928 -9390 -61616 -9936 55765 83906 105850 90826
6669 90826 40837 5888 85263 65487 71630 71095 -7864 -60478 -36989 39267 11334 3693 -41034
6656 -41034 -67692 -66829 -27758 28377 49160 23203 -33651 -47437 -115446 -142612 -57794 5070
6644 5070 -23476 -89723 -39366 -54334 -123068 -69779 79299 68825 4827 -48575 -103938 -121439
6632 -121439 -65169 38964 108913 104281 32465 -23794 -34367 6410 -22565 -63653 -80875 -79551
6620 -79551 -51659 -100505 -94402 -6423 -33783 -78131 -31165 40442 30878 -935 -31608 -32848
6608 -32848 -15327 -34753 -32504 19452 81525 76148 62125 65461 13465 39988 81211 65946
6596 65946 46083 12763 -8231 -21514 -32534 -94531 -130577 -169049 -154501 -83976 -34739 -4495
6584 -4495 12049 32563 20973 39040 -16842 -22241 -28678 29426 8065 15826 -18963 -38160 -13132
6571 -13132 -24366 55340 64061 65079 59129 61486 64785 39462 -43844 -107471 -129713 -115902 -151153
6558 -151153 -149371 -14041 37760 -24331 9906 27113 -36484 -15558 30451 77238 99026 76870
6546 76870 -63530 -78040 32068 14809 -5176 -41262 34113 18519 13609 -25025 -12629 -88045
6534 -88045 -88394 -14662 51649 118517 159363 183492 202036 147760 56290 25503 -56 -31813
6522 -31813 38673 50443 -7499 -27325 23681 103895 89916 -9589 -71494 -24084 42238 42317
6510 42317 33348 102491 3340 -67423 -90709 -123966 -67890 14551 9932 -2498 -47897 -5782
6498 -5782 -59153 -76508 11347 59475 3090 -1305 56331 56370 76865 45219 -2554 -59004 -39419
6485 -39419 -23756 21205 42439 86961 123368 88266 -30378 -94620 -161795 -194876 -106636 -27733
6473 -27733 11661 -88515 -209313 -120340 22031 32331 3767 14372 -77815 -56767 55429
6462 55429 27318 -45976 -60425 -39050 -18782 -29353 -88928 -101486 -152286 -156044 -54680 58890
6450 58890 55180 96709 61390 50586 60959 87470 52770 -45847 -29509 51817 71557 60057
6438 60057 3470 10688 36120 -34657 -34723 -11775 -20605 -34728 -50488 -27832 16997 -17298 -35192
6425 -35192 -103430 -155919 -97156 -15359 2569 -31709 -119154 -118822 -23160 5233 57524 80314
6413 80314 92703 85865 59505 16855 91785 106150 51020 79544 -7644 -41449 -61770 -38834
6401 -38834 -14852 34981 24841 -1727 274 16211 76374 89456 62640 159536 101871 24817
6389 24817 -54705 -111390 -47831 -8804 37385 69383 152296 131962 67680 24080 -25507 -115074
6377 -115074 -101868 -86407 -6700 50744 -19949 -43290 -36857 -15365 -15399 25990 -69141 -122871
6365 -122871 -52852 -98519 -80159 -28674 -76739 -72766 -105493 -178467 -212052 -191476 -111409 -38002
6353 -38002 -72888 -59526 12756 -13750 -72720 -113562 -67922 -27696 -120513 -97075 -52806 -49775
6341 -49775 -15079 -920 -55005 -44289 -9979 -19376 -36399 -85122 -109069 -83027 -50220 -112362
6329 -112362 -123574 -22064 -70432 -77285 -81219 -113453 -76544 -142842 -136636 -41147 90030 119702
6317 119702 72180 -57575 -76567 -114920 -69033 -66863 -137862 -99429 -109139 -121804 -65510 -30123
6305 -30123 -72582 18096 39972 -8283 -70148 -67732 23562 120146 154182 95503 88001 16569
6293 16569 -8251 -16289 28139 66734 28005 15437 12495 -39423 -41248 30723 8372 3566 74240
6280 74240 92706 18602 6686 -1897 -3713 6270 83594 93608 26075 27396 15015 58226 30955
6267 30955 75360 76313 101079 68933 -16844 1478 -11259 -44917 -26136 -25853 66968 129218 130342
6254 130342 119778 85849 394 -102122 -143921 -145336 -106040 -19720 42001 -16764 -13342 43364
6242 43364 105722 7753 -91234 -141401 -62536 -106955 -61389 -36704 -18920 -46860 -7961 60737
6230 60737 55246 34097 36832 68918 32194 14017 -8785 -17459 -16849 -12844 -69481 -110125 -106905
6217 -106905 -60601 -2785 -62090 -26412 -36095 -44918 -9531 -6120 -30963 -20836 42798 45229
6205 45229 10310 4456 155963 165138 122798 72663 8162 48298 33661 -80452 -125319 -83689
6193 -83689 -42505 -59593 -104042 -39004 -71974 -20883 16656 -29511 -112020 -107158 -139516 -146606
6181 -146606 -129656 -58575 -78480 -82179 -47133 34375 77307 -60974 -117353 -26600 73935
6170 73935 117897 62914 73548 -10587 -540 16933 16508 19489 102344 14430 33477 61616
6158 61616 41023 18046 53496 18850 30139 92466 70971 97922 26937 5209 -36820 -17427
6146 -17427 56367 -5241 -108534 -133728 -177398 -223524 -169841 -92874 -113647 -49286 -26025 -71043
6134 -71043 26508 152704 87410 20626 -12706 -17189 -32555 1850 73926 60796 57494 124240
6122 124240 120985 85311 43703 13578 93744 33812 -73101 -93552 -128579 -110962 -40824 -29596
6110 -29596 -54796 39929 92633 -9628 -43039 13612 -24471 11778 6267 14371 31812 -18617
6098 -18617 -15169 9615 42278 63001 11362 59508 94417 56452 -16689 -124180 -99837 -44782
6086 -44782 -60101 -147455 -130515 -120093 -182125 -115867 -59526 -52920 -42273 -57290 -137835 -224989
6074 -224989 -172306 -133199 -167442 -110666 -27138 -43197 -114967 -32093 -3740 -35043 -16638 -62866
6062 -62866 -16344 -31869 14094 -17055 -39384 -105686 -107000 -162311 -111339 -5102 64314 97880
6050 97880 102292 25877 7883 -16249 -23146 -47599 -36566 -15721 -70869 -69979 -66914 -143702 -163201
6037 -163201 -150845 -99215 -135012 -87351 -54237 -26091 -40548 -102769 -29323 39671 -43713 -39567
6025 -39567 2789 -59140 -116050 14220 128683 88455 8926 -9608 86 65452 -15337 -108133
6013 -108133 -47272 -69192 -91403 -133656 -174706 -142247 -120990 -61118 16641 13211 8367 -24230
6001 -24230 -128262 -140595 -100949 -76281 -127679 -114902 -99612 -88869 -113613 -141419 -106757 -58066
5989 -58066 26286 20900 -24793 -37709 -36355 -79677 -82199 -2252 -12512 22612 56444 9635
5977 9635 -86622 -132533 -113186 -102780 -73407 -93890 -82961 -41 28660 57087 92917 -23809
5965 -23809 -60635 -30231 2336 58042 53901 46577 30461 4664 54913 18849 -21729 -67717
5953 -67717 -68549 -11502 -13887 8033 14635 50604 33719 -23475 -71955 -47767 -26475 -48671 -114597
5940 -114597 -46270 -3139 42041 2320 -616 -1470 -34157 36150 99039 81984 41721 75334
5928 75334 120649 154833 139237 82156 23929 -37675 -48128 -8315 54078 98964 21396 23630
5916 23630 4592 -60753 -81087 -111045 -85411 -54202 341 27737 -40984 -71198 -53614 -58651
5904 -58651 15663 49665 25666 -36305 -92727 -116071 -133644 -150407 -101971 8018 14173 -40330
5892 -40330 -29787 -32230 -43729 -31777 -50269 -103172 -112889 -30298 -7785 12744 -40426 -99933
5880 -99933 -53015 -22109 -38727 -60350 -30239 39738 45082 39085 110539 136274 72910 68486
5868 68486 123795 168553 164989 112700 52987 110660 189875 186044 79434 -32583 -55338 7664
5856 7664 27381 13235 -38553 -79735 -51635 -61856 -36144 -7444 -37346 -74175 -12824 29530
5844 29530 9507 -23977 -71919 -55786 -27706 15435 91208 86147 37092 3067 -61539 -130350
5832 -130350 -119844 -55028 -2620 -483 -27688 -59229 7237 -24857 -85380 -87795 -33064 -27540
5820 -27540 -60508 -39899 -68937 -143019 -66157 5163 -34768 -9525 -13613 -38946 -35073 32557
5808 32557 -28240 -78214 -19799 25288 95154 102628 74803 71250 34157 -17188 -22594 -75378
5796 -75378 -109951 -99312 -92991 -28459 26916 9487 -10815 39122 -45000 -14025 56676 72527
5784 72527 95549 66204 -59413 -86541 -36745 -63818 -106597 -72964 -47408 5258 -63216 -109397
5772 -109397 -142752 -32018 15646 61422 93093 98874 149323 99849 -28159 -77634 -64255
5761 -64255 -31915 8012 -10372 17814 -36037 -133062 -173867 -163861 -168496 -84042 11524 49930
5749 49930 84387 35330 -13774 -53542 1478 -25374 45877 23875 3190 -96288 -111312 697
5737 697 86370 97165 153077 136493 58814 56211 35120 44567 24087 -8663 -12357 -17478 15863
5724 15863 51287 27 -26422 -53562 6147 44591 -15107 -106365 -100500 -104953 -135014 -170154
5712 -170154 -160801 -122239 21880 26477 50861 39421 14240 -6323 -35813 17483 47471 36858
5700 36858 32864 85520 61385 85699 176763 118249 113004 52262 7425 57917 82001 56041
5688 56041 71549 14026 453 54866 91983 65262 -9753 5740 51867 44911 57923 31624
5676 31624 37804 -49324 -102556 -85727 -10186 24700 11543 22093 -20435 -118513 -151970 -201661
5664 -201661 -160435 -64683 -33139 -137420 -221760 -221796 -133577 -130145 -138277 -147803 -119569 -127495 -81663
5651 -81663 -12579 -17757 -1492 -42606 -80792 -81784 -12764 -46946 -60170 -57364 20540 27824 -12550
5638 -12550 21280 13555 -25586 -56712 -106872 -75943 -106718 -74975 -25809 -18640 8864 -24920
5626 -24920 -9665 81514 95050 37557 83794 177291 95725 31674 35043 1194 102311 129239
5614 129239 100110 89450 145061 133730 23965 32369 64027 89454 76042 31534 -31482 -9582
5602 -9582 -5127 11419 50301 63776 5976 -94765 -145144 -132678 -47039 70685 96878 58842
5590 58842 56393 70596 85984 35838 111584 48361 -4466 8688 41233 52054 42176 107949
5578 107949 63859 6500 14663 69874 91646 110019 95878 109481 127404 -23974 -131162
5567 -131162 -82119 -52874 -100348 -64008 33618 14203 -46703 -30034 16521 3786 23735 33287
5555 33287 30163 60862 44417 120133 156926 97898 -17677 -26804 -35010 -96174 -153827 -115346
5543 -115346 -104692 -57467 -44102 -34612 -56705 79260 198027 154546 37399 -71431 -102520
5532 -102520 -23875 -62159 -38417 -6637 -69752 -85331 -22962 12645 -17882 -31090 38815 81899
5520 81899 46969 52454 118273 138022 136922 93519 27557 65745 80672 60567 75642 68159
5508 68159 64135 78829 48622 42367 -13275 -71020 -56245 -5103 -72974 -98968 -83937 -17857
5496 -17857 67835 118874 204879 124279 -44730 -146613 -149088 -114568 -53560 -68386 -120122 -147409
5484 -147409 -151371 -112705 -66742 -65018 -85714 -129015 -94173 -151854 -139002 -51885 -44206 -74936
5472 -74936 -39770 -33049 45305 77385 25460 -9081 -85452 -82548 -40844 -64730 29491 99998
5460 99998 129741 54147 76263 45377 -77779 -128934 -114141 -90262 -35147 -13521 -36838 -29322
5448 -29322 5795 -10046 1972 -1732 -30735 -37150 -43092 -52987 -38079 39652 94545 59593 13988
5435 13988 -61581 -78003 -15359 15708 -17198 14410 97976 115984 62299 4303 79461 143628
5423 143628 138972 133971 160472 234263 214820 184563 124055 160852 127818 103148 136905 126478
5411 126478 20655 43602 89047 132564 174260 186244 126922 54246 -44699 -54135 26008 21805
5399 21805 -11103 -28921 -22299 883 -63866 -58038 -104404 -161281 -170444 -85704 -10246 14134
5387 14134 -57945 -43991 -64991 -35156 11235 72770 104287 100425 55368 -19599 -63236 -12719
5375 -12719 17609 -37723 -28068 -12921 49888 19615 -64016 -40157 -16684 74521 105010 112472
5363 112472 -42539 -136047 -93904 -102648 -97078 -36058 -8002 10543 -42023 8587 70655 80275
5351 80275 66209 84185 18855 -50871 -61474 -73787 -87414 -88091 -114328 -78761 -39389 -18382
5339 -18382 33342 78500 -20343 -36885 12148 21787 -41745 -61162 -46008 -57522 -48342 12295
5327 12295 36951 23051 -30093 -83513 -111859 -115452 -185867 -105976 -78901 -82723 3910 76900
5315 76900 124647 169641 200618 193318 140647 86278 18501 106180 122108 161970 245122 247604
5303 247604 294836 284905 127258 149135 198162 127459 71728 29511 41023 90439 23056 11024
5291 11024 45726 55322 20834 117870 119069 60725 53708 -5579 -68294 -76716 -123038 -86410 -2337
5278 -2337 17270 2906 27671 -11255 -48431 48931 97267 70994 26559 -50245 -45600 -4515
5266 -4515 -46910 -49173 34856 64253 45574 -2866 -43716 -9970 -42326 -65592 10574 54892
5254 54892 129597 72484 -35392 -37152 30826 85921 117756 85791 55130 16098 14778 87034
5242 87034 10546 -15950 -6010 -7999 -12889 38691 116312 90865 158783 182324 181917 201664 74339
5229 74339 -483 92605 37455 17746 65539 44034 11263 -58367 -64399 -64558 28574 -58280
5217 -58280 -50902 -65245 -52619 -8656 42132 97290 63950 79735 -33075 -66383 11805 33195
5205 33195 110315 87228 38573 41658 -35309 -42972 78375 96194 42293 83891 162091 243572
5193 243572 259263 198815 173679 244373 250326 204755 142746 61356 93880 141961 45023 -82815
5181 -82815 -108164 -96801 -129020 -57187 133928 162613 169612 135962 91634 57945 97623 85684
5169 85684 -1728 24952 -31347 -50690 2500 29340 68724 -18220 -65224 -59858 31228 83112
5157 83112 103902 14244 -27133 128 108700 82811 33576 77356 75385 64791 12100 -269
5145 -269 -43552 -166140 -233973 -217520 -220886 -126213 -86425 -49230 -49800 -57884 -12928 13901 -31499
5132 -31499 8387 3858 -32266 1095 66823 17994 20608 78719 71021 43245 39972 -11730 24547
5119 24547 9708 -71400 -40237 6909 34159 25061 26496 45990 107880 26075 31727 20495
5107 20495 8090 -13483 -24477 -23956 -26792 -111498 -168152 -66352 -20272 -119381 -146937 -69096
5095 -69096 -82448 -92702 -58366 -10486 7791 31891 20066 -9477 -47102 38601 60110 5524
5083 5524 16412 63527 71671 120427 72401 43943 105607 125334 89475 79597 115342 112248 53314
5070 53314 9116 11616 -58196 -63619 -42172 -23575 -57699 -45634 -15397 -74777 -107430 -97792
5058 -97792 -115454 -98938 -72745 13182 60161 -5962 -87993 -88821 -75048 -74874 -80201 -28321 32337
5045 32337 96462 83624 125463 157041 105789 50777 34401 71200 96385 41643 38449 14647
5033 14647 32446 102496 63003 28850 -45506 -88998 1692 -3187 40067 89885 107069 109435
5021 109435 62985 -24261 -88218 -53371 27398 -6526 8021 65807 37908 -55866 -24523 -100111
5009 -100111 -102219 -106199 -110189 -55662 -80741 -49593 11202 40075 50274 103675 91139 41113
4997 41113 -27554 -59741 -26428 -55997 -85620 36819 45263 71584 101277 68994 37240 46376
4985 46376 44616 48860 -11945 -113857 -102674 -52392 37165 -24896 -36345 42861 2821 -23402
4973 -23402 -417 80149 67712 66402 67119 23404 -7451 -123877 -116802 -67920 -41561 -15288
4961 -15288 7594 10721 -2312 -34175 -55690 -105854 -146298 -169635 -106579 -61626 -34912 -26949
4949 -26949 -43235 41603 72603 91476 36896 -30520 -14316 -42984 14247 69121 57236 5625
4937 5625 -12885 16746 -11974 -44795 -148703 -203902 -226858 -176401 -170028 -135889 -50647 -64683
4925 -64683 -123156 -70139 5854 34282 17374 -28302 -55338 5791 -45816 -63889 -27188 -22559
4913 -22559 9880 66226 61372 -8513 -25182 -16354 -28151 -52472 -87837 -3407 605 27605
4901 27605 -64849 -108098 -62114 21050 13360 20902 49903 31459 57311 81279 21191 -30383
4889 -30383 -19171 -51719 -57564 3327 -62623 -114369 -100307 -76095 -98400 -60682 28564 -11362
4877 -11362 -22430 44068 49597 20438 -30920 -69139 -48980 -24239 -134462 -134979 -84896 -34875
4865 -34875 -36450 62441 65037 33358 -55318 -69104 -21084 -47928 -24862 -82109 -56747 53954
4853 53954 32901 10290 -26128 -69968 -60737 -32346 -78132 -171624 -190892 -162342 -241196 -204858
4841 -204858 -199627 -192800 -143750 -130999 -118631 -88269 -133428 -68700 -80254 -114345 -88865 64392
4829 64392 114422 84868 20360 -79235 -102492 -7318 -2709 -123047 -81570 88782 89845 75616
4817 75616 49908 23539 49518 99759 83918 42303 -63353 -119754 -69991 -1214 -108004
4806 -108004 -127058 -98500 -35399 13170 10094 28332 -32766 -46846 -17221 -11178 -33991 -12773
4794 -12773 1743 18241 -41440 -68469 -102220 -77780 -6107 17373 -167 -9633 -11952 -9081
4782 -9081 63136 161260 167797 76932 19602 21409 -30731 -6738 2339 -2626 -60934 -97291 -21840
4769 -21840 65602 126212 122239 81164 2046 -31338 -48702 -152192 -161216 -5427 84568 80659
4757 80659 117253 64265 64097 66735 18183 -40511 -15537 -52853 -27294 -3909 -43285 -20893
4745 -20893 14180 -9917 -112194 -100735 -59882 -41246 -12300 -37146 -41138 -50629 -114783 -36329
4733 -36329 50264 71297 88849 104210 -19620 -93579 -1009 23108 -9865 -78080 -30829 29006
4721 29006 74046 67903 -8671 -69132 -12596 52640 135593 52854 -24203 -26706 -26619 -33315 63723
4708 63723 90554 129162 151458 53218 -49211 -138386 -121365 -149226 -164622 -124688 -71555 31308
4696 31308 69022 78348 90605 111437 73287 22293 -21088 1986 78302 41475 -14866 43094
4684 43094 62322 43733 7742 10137 -28794 -1899 -4947 -53283 -85519 -88882 -2316 21284
4672 21284 -21452 -10061 -7321 -75604 -58424 1443 -11530 15718 -18242 -65365 -73500 -40319
4660 -40319 -6761 -13532 -27170 11031 36456 85663 125106 262 72272 78474 47365 103965
4648 103965 66321 9697 -18298 -47653 -61197 -106402 -118929 -148005 -160340 -105946 1748
4637 1748 73976 39513 40410 11390 49 11996 39899 -20402 -80603 -159057 -149887 -96803 -51482
4624 -51482 18192 72288 49217 14231 -39523 -91879 -77601 -40626 -7330 52094 18762 -63590
4612 -63590 -61293 -73160 -80502 -74530 -54654 -37337 -18460 9993 110663 189169 212977 91758
4600 91758 -10945 -24951 -2853 -22500 -78025 -122825 -173571 -114347 23009 24317 -71199 -130759
4588 -130759 -81261 -47919 36565 59898 52548 134050 164334 177489 108407 115795 68804 92073
4576 92073 101590 99600 -86355 -155530 -130140 -156231 -123471 -48055 -37672 -16539 66975 113037
4564 113037 63398 67079 69211 67633 71701 -4124 -20504 -116045 -133773 -128213 -101049 -141705 -82564
4551 -82564 -72 15227 33498 -2050 62263 76466 75927 92022 83788 -36397 -66951 -64469
4539 -64469 -21429 23651 -62705 -110835 -130042 -83058 -80404 -32316 11364 41540 48917 11308
4527 11308 -25761 -50192 -39103 12359 35811 -2176 -42467 -18146 -34396 -40859 -54844 -49436
4515 -49436 -26091 30101 30372 80313 -23720 -116000 -56686 -26270 -19431 92781 191729 156201
4503 156201 55828 -8103 -35839 62844 113003 59776 5525 -66992 -75714 -10498 -50002 -88729
4491 -88729 -164768 -137928 -158209 -131098 -97073 -83995 -111639 -150870 -70854 -60511 -26268 19949
4479 19949 -17015 -105677 -166235 -132949 -72219 -66777 -53682 -134286 -117134 -9421 -4121 -10145
4467 -10145 142809 174793 96323 22028 -44047 -89178 -24581 43079 24735 -24894 -36650 -5524
4455 -5524 45416 63536 899 -19418 65881 -9319 -10495 -26001 -43041 -62537 -64538 -50003
4443 -50003 -17739 28477 -10083 -39780 -25679 -11516 15739 -24539 -43453 -79977 -52925 9111
4431 9111 -417 68348 90520 85154 29166 -3806 9826 -51018 -75447 -107967 -162474 -151032
4419 -151032 -84265 15186 38734 -28969 -89827 -139027 -100653 -117844 -61773 19411 113573 57945
4407 57945 -48176 -35266 -3908 -715 1512 22746 35913 56514 22472 61227 41354 40213
4395 40213 -20461 -75316 -93597 -62343 -59151 -81465 -36976 -75987 -82179 -145256 -133019 -56433
4383 -56433 -122085 -121381 -100105 -140723 -169636 -193758 -126096 -52640 -106876 -136060 -96878 -28618
4371 -28618 -24235 -18118 11562 24862 25169 -50797 -74250 -75036 -106911 -83019 -76590 -47982 -37318
4358 -37318 8402 44129 47152 111709 134878 130393 68365 8668 31067 76378 132815 115303
4346 115303 167687 177435 150705 71062 -8379 -57338 -19244 -53334 -68802 -49014 -27900 -14078
4334 -14078 12664 -89207 -102965 53128 99264 115152 123065 106233 91959 82369 16102 51816
4322 51816 83642 42057 -29494 -41371 -25411 -20110 -39591 -56028 28634 40350 -31555 -67770
4310 -67770 -141504 -162944 -135393 -140284 -204171 -190783 -211615 -182551 -152364 -89303 -100587 -74261
4298 -74261 -68778 -14166 36049 -4432 -93020 -36702 33682 44427 34145 -7034 -38170 -103036
4286 -103036 -154715 -158520 -160398 -177342 -165201 -201264 -196387 -129962 -80008 33947 131269 73241
4274 73241 69951 64284 43565 -13925 -28764 22075 -11368 -33235 -98398 -115778 -90493 -56710
4262 -56710 30095 118152 243807 186363 130905 82647 41913 -69405 -156982 -102308 -26223
4251 -26223 -40925 -141042 -255991 -214464 -146875 -123093 -49247 -64997 -79944 -60335 -33421
4240 -33421 50472 125459 96247 89902 53491 8957 -42353 -67006 -76702 -67907 -38567 -23632
4228 -23632 -25923 46834 94850 93788 82548 48252 29871 11163 13911 10608 -56686 -166176
4216 -166176 -214828 -155326 -65656 -58378 -109806 -59052 -44691 -36373 32294 -36861 -10561 37710
4204 37710 24404 -31697 -37592 -56765 -34141 -113651 -120035 -30006 -66675 -94808 -56433 -53206
4192 -53206 4363 22441 23791 -13057 -47093 -21901 -9268 2904 20088 54803 89901 100807
4180 100807 59343 25586 17841 -6427 -22777 7742 -16649 -98164 -189239 -152688 -50889 49031
4168 49031 25445 -79794 -126524 -93067 -57145 447 -38514 -113779 -76675 -102935 -133087 -61212
4156 -61212 39734 -27573 -76218 -50580 -91413 -131200 -130128 -113582 -47134 3216 -42235 -97940
4144 -97940 -109375 -83984 -62463 -50584 -2328 19953 46774 64136 54088 32185 -20422 -10207
4132 -10207 1614 5094 -36864 -92359 -166769 -152196 -45274 66603 45519 -18273 -109751 -186908
4120 -186908 -126472 -71901 -43528 -27172 -58102 15943 -17276 -119933 -130283 -161592 -81788
4109 -81788 80352 173934 218303 189722 143266 76034 -48720 -141080 -233743 -203118 -125495
4098 -125495 -88363 -72138 -22744 -71236 -57725 -19148 106271 142714 72412 -72469 -137417
4087 -137417 -102044 -61019 -24317 -33233 -29372 -69119 -18124 27207 -78041 -139412 -145144 -93380
4075 -93380 -38558 -25261 -43408 17134 104916 92367 50036 52736 -2436 1913 19851 -17625
4063 -17625 -89473 -162191 -73895 64626 10049 -25173 -70176 -68751 24409 -14748 -21910 -11483
4051 -11483 -25296 -31041 -25488 -68005 -57034 -836 44935 43473 -14679 -67462 -126767 -45303
4039 -45303 -62186 -66251 -52012 57733 5787 -87076 -47140 -39059 33048 93896 41603 115253
4027 115253 224357 209880 213723 143122 95563 47014 28091 42474 46894 19310 -27983 -51528
4015 -51528 -4043 -25489 -22084 45545 39474 -18854 16197 40167 35992 -8370 21180 35658
4003 35658 38671 -19805 -10737 -9000 13579 34281 40750 -3195 -19820 -22489 -100920 -88689 -18119
3990 -18119 -59926 -34721 -16473 -51928 -17271 -14749 15507 19917 24245 22216 42463 147032
3978 147032 119021 14813 56383 56352 42707 -53609 -49341 -22016 -48017 10373 5340 -49899
3966 -49899 -68893 -29175 74884 57347 30451 -27082 -81602 -31828 -7726 36959 34419 -2938
3954 -2938 50944 75422 133780 81374 -42941 -11946 -40572 -67249 -56173 -77719 -114054 18369
3942 18369 79946 150830 90954 54226 107385 96358 93067 57960 -9398 -18716 -31278 -131744
3930 -131744 -98031 48784 77669 25382 40918 30846 102396 60604 -7324 -21207 50221
3919 50221 93264 116774 561 -110866 -184769 -148397 -114308 -175700 -240410 -325876 -272607
3908 -272607 -104134 -24754 -29434 -84859 -74915 4505 23537 -45195 -122360 -17838 9550 34630
3896 34630 79722 82451 162570 233623 199351 113314 75349 104502 118341 47580 50771 1089
3884 1089 66873 103971 112027 7418 -92110 -103906 -84258 -1565 38587 68344 99113 105785
3872 105785 95924 100191 55600 92263 171240 149883 112653 95680 54824 -20967 -56651 -80130
3860 -80130 -39090 -42819 -63186 -63488 -29575 -71260 -85689 -40935 -31074 58533 63002 76232 25361
3847 25361 48465 34860 83220 32417 20407 -60926 -157272 -94111 -30167 -45334 -70970 -37165
3835 -37165 -50486 -72293 -95217 -90429 -43089 -34137 15956 88600 39546 -101813 -149617 -71024
3823 -71024 35968 82898 123595 99266 58854 51876 67388 71650 39655 95979 139435 105233
3811 105233 51649 9825 -16784 7653 45071 84992 -2386 -15184 2098 15930 11041 -12359
3799 -12359 -12814 1922 -59860 -85891 -52430 9113 53218 154687 127325 10823 51835 -12787
3787 -12787 -61079 6734 -7922 -41670 -61615 -77686 -103885 -116480 -133501 -143557 -96442 -18007
3775 -18007 54033 78108 135428 103146 66528 63609 93799 36123 -41944 -59774 -76656 -103590
3763 -103590 -72255 -64902 -83057 -59274 -53997 -34143 -29967 -33794 -9362 -39554 -76429 -82985 19900
3750 19900 72036 131172 136520 61111 13547 -49287 -9563 80404 115306 93141 21579 -17525
3738 -17525 20533 23222 -66308 -76108 -74308 -107307 -115147 -75135 9894 -31259 -35120 -38904 -121697
3725 -121697 -58009 -46898 -110685 -128775 -131454 -112428 -92791 -37453 17890 29016 58367 89766
3713 89766 134635 96275 30458 38879 45359 35924 42156 88354 5545 -80842 -77809 -51008 35004
3700 35004 26824 32225 -28308 -99297 -108608 -92820 -85424 -46613 -45570 -104055 -107258 -101380 -27775
3687 -27775 50763 85253 112148 79976 187729 121714 71876 38872 24969 44456 46679 6574
3675 6574 15151 89588 147547 91538 -4218 -45884 -91954 -77239 -21417 -30750 -39605 -47432 -121507
3662 -121507 -191691 -247090 -172465 -39542 27160 85981 15006 -14527 24989 -8259 -34778
3651 -34778 -27415 -71841 -66997 -52213 22884 -9509 -42093 -9576 -43560 -100146 -128779 -111215
3639 -111215 -32710 -34042 -54041 -56385 -70664 -68790 -40529 -6570 18553 -27989 748 56323
3627 56323 60067 16289 -64481 -54890 -39448 -110609 -114833 -109295 -43363 64797 71966 78000 44638
3614 44638 36255 103578 47955 114906 13920 -19889 -59156 -78092 -87506 -97021 -45904 5426
3602 5426 -38 -33786 -21487 -95659 -178711 -198742 -63554 13770 -11601 20120 80908 128682
3590 128682 44272 83551 46072 10500 -11431 -27485 36808 -17688 -90148 -14605 -772 12166
3578 12166 39649 51685 19035 -36853 25413 59982 -39289 -121861 -107361 -37136 32598 26159
3566 26159 -58355 -27440 -26784 7617 -58313 -10006 16749 -33675 -57426 -25686 24927 -51120
3554 -51120 -70288 -15206 -10188 -10521 45928 9158 36594 79229 79865 35456 -34538 -59072 7838
3541 7838 87979 61873 -37212 -43655 -2494 -5622 -32489 -15937 110543 99259 108749 118149 103118
3528 103118 48861 -31934 -53408 -13128 94849 81866 79759 114181 88863 -24338 -39671
3517 -39671 -53125 -62081 -16800 -49407 -76914 -28992 33658 69054 63579 102882 55977 33236
3505 33236 21889 25066 7252 -24452 -26976 -76514 -58587 -39375 -65443 -83864 -70273 -48015
3493 -48015 -104077 -127153 -83488 -104173 -179675 -185659 -142557 -114144 -29641 31659 1157 -46302
3481 -46302 2811 73587 90113 22695 -41565 -91889 -105702 -52601 41868 29639 -29326 -47492
3469 -47492 159 109255 64078 -17425 -79720 -78205 422 25594 -44054 -165828 -171759 -104915
3457 -104915 -39615 -67073 -16129 27882 52801 169516 175123 129307 125089 28385 25785 25481
3445 25481 34604 115905 80635 81009 132939 200178 124532 87899 59640 -60102 -81704 -26048
3433 -26048 -24009 -24291 -46236 -80004 -149797 -160710 -136116 -81456 -94382 -63277 -32549 -12196
3421 -12196 -63936 -18816 -7808 -40001 -44646 29213 34621 65735 37993 -34994 -94838 -67266
3409 -67266 -84816 -94202 -159843 -197634 -216023 -127157 -81141 -94643 -12439 -22257 -84322 -9661
3397 -9661 73543 52542 17646 81178 71323 24833 27807 -21411 -35730 69519 59194 -50807
3385 -50807 -70022 -107427 -87550 -47114 -123377 -104276 -83673 -141825 -90003 -61490 -6359 -63048
3373 -63048 -29506 22589 -59448 64156 24073 -59775 -49557 -71539 -45614 -93558 -40233 55225
3361 55225 41217 2342 -30648 -60696 -9922 28323 19151 -33456 -62945 25138 -31077 -106089
3349 -106089 -97588 -5633 -25347 -26027 -39151 -23614 33090 -6629 -56121 -76418 -129317 -148983
3337 -148983 -150786 -94207 -15262 38746 97112 36837 3239 57574 -25607 -78435 15334 7513
3325 7513 49176 76832 84985 59641 38729 91617 54555 82080 -7212 -13452 50935 66645
3313 66645 41927 20111 48434 83155 80562 3761 10222 -14091 51468 81003 30844 -16971
3301 -16971 -129886 -95244 -19285 -12166 -2026 17890 -31383 -78196 -81669 -15044 -32177 -12265
3289 -12265 -43273 -2420 42630 105034 96573 33432 -36478 -112675 -67332 25936 32306 5376
3277 5376 38892 82397 133085 45376 -24393 8370 58549 52450 120483 73492 35161 -12883
3265 -12883 -75536 -85169 -59385 -61403 -49945 -35705 6067 114964 76558 49635 -14454 -26542
3253 -26542 47870 68895 83279 82845 69072 60721 2672 -9613 -54622 -28734 2703 28881
3241 28881 -15955 12586 26624 43623 119851 103114 46790 42233 26144 22724 25574 -11375
3229 -11375 24241 -51279 -10386 104599 139693 86379 -29781 -43910 5129 69668 133417
3218 133417 126948 108225 -9697 -47316 44084 -2349 -81559 -93507 -50222 -129916 -7360
3207 -7360 60819 71701 147443 182569 84827 25025 56515 90231 130216 113981 176778 186237
3195 186237 88601 -23401 -114704 -116316 -65800 -105840 -138895 -133141 -111335 -101552 -56607 -53063
3183 -53063 -48532 -20361 -6364 37718 24329 -27665 -33742 10275 5211 54522 93160 66762
3171 66762 78461 32434 -8784 -36068 -19677 -23492 -51771 -90824 -94864 -54734 -63526 -48990
3159 -48990 23568 77698 143582 126195 46549 -27521 -25697 33080 32936 -34102 11983 50083
3147 50083 74640 84662 309 -12737 2306 10671 36717 46475 27154 58726 171882 185459
3135 185459 195734 208774 105701 114235 157534 138683 51116 24147 24379 48628 58259 44286
3123 44286 64789 117481 89530 27072 -93294 -46160 -13925 -54777 -33105 57560 126732 103648
3111 103648 48742 27398 43615 46934 -78388 -123643 -88825 -521 61663 37362 -12837 -84386
3099 -84386 -13645 -32989 -126129 -49745 101680 158783 65049 -45110 -28437 6927 24638
3088 24638 112775 91804 56427 14709 -48501 -117651 -34911 10789 -55298 -75072 -4300 38501
3076 38501 4507 -69126 -47367 -66904 -121608 -186368 -158599 -91437 36749 59400 85417 127447
3064 127447 72382 111958 199724 95056 -115827 -117471 -5288 62028 111380 124561 54009
3053 54009 -33697 -27669 -5565 17357 -4097 11906 -6719 -72757 -12916 85487 74644 -21447
3041 -21447 -58121 -52276 -34909 -74208 -118061 -54168 16933 60121 38478 -4615 10041 -4449
3029 -4449 -15261 -73791 -95247 -106146 -35742 -9364 49343 79997 58541 19179 -78592 -92358
3017 -92358 -76113 -115855 -79211 76983 107603 86299 72022 51298 -28407 1619 85731 146562
3005 146562 92175 92370 107266 167000 201231 26082 -54981 -3259 37824 89766 84490 66304
2993 66304 73481 22354 -71115 -131240 -98141 -41141 -19274 -2307 -69322 -174732 -149534 -130659
2981 -130659 -126218 -188040 -174273 -127338 -100600 -82617 -130581 -199348 -223055 -109499 -43522 -92830
2969 -92830 6053 61503 27804 -9960 7361 -24635 -1016 -19184 51569 42654 -27283 -49506
2957 -49506 -44998 -65834 -54375 -109579 -119091 -59524 18737 60695 112971 192731 199241 74190
2945 74190 30307 29941 80462 56857 47648 92802 112655 142460 75558 -1879 9079 -21579
2933 -21579 51811 169415 77498 4763 31414 -603 -30432 -42753 -41096 -49945 -40730 -42464
2921 -42464 91360 97943 22599 -65252 -124780 -245830 -273334 -215790 -181257 -142984 -146094 -163284
2909 -163284 -147931 -48572 -34570 -34020 -13278 -60800 -64400 -78101 -29996 -52165 -124461 -93734
2897 -93734 15775 -6663 34699 71572 28442 972 -73572 -147824 -142888 -59837 -130901 -112351
2885 -112351 -9718 15720 7625 23032 121297 140451 24977 -94151 -151859 -87555 -20176
2874 -20176 2994 14096 -48445 -30138 46847 55659 48125 15611 21001 71188 59900 5504
2862 5504 44844 14424 13736 40777 30657 18837 16479 -103792 -113093 -101145 -49692 -37320 -2197
2849 -2197 -7747 -40081 -12382 -62642 -124286 -124614 -98074 -87733 -29955 -47940 -54737 48578 51905
2836 51905 5527 9354 11355 62118 116887 89220 10678 -59125 -87645 -137804 -144963 -101594
2824 -101594 -11676 -8121 4010 9184 -91977 -62062 -65563 -24467 178044 235122 138922 75173
2812 75173 109707 51946 -40841 -105750 -163094 -102235 36851 115736 117753 105707 117327 111531
2800 111531 -10443 -23839 -67954 -94229 -48192 -91738 -37119 68644 126592 46220 -38078
2789 -38078 -44563 -10936 -27714 -63334 -8564 -28875 -75392 8410 -43454 -56439 -38368 -59436
2777 -59436 -59641 -81944 -36252 -61746 -69891 -64911 -51144 -86992 -172060 -72325 -19705 -141232
2765 -141232 -187433 -113579 31150 86896 8373 -32161 9173 22427 15226 -74530 -99941 -99426
2753 -99426 -131435 -150902 -94463 36573 96755 58655 28158 4515 -45478 26104 105347 90827
2741 90827 121459 143407 105135 116967 117471 104081 110161 110148 889 -39721 -56849 -91382 -53681
2728 -53681 -118960 -71051 -863 -32909 -89918 -107567 -67990 -80972 -21348 19218 4248 -21337
2716 -21337 -4186 -5681 10529 -54941 -93891 -58369 -40344 -27917 -107032 -49547 21701 41168
2704 41168 48729 -29543 -104383 -32637 46953 85909 78107 102945 56470 20824 79356 103250
2692 103250 123630 140906 96384 43748 19677 53384 82649 41211 -50400 -11319 11658 -7673
2680 -7673 -25039 -56079 -43618 1820 6503 -99520 -124301 -32928 -27828 -49176 -3336 80078
2668 80078 38145 -8905 -145198 -124608 -25648 -12953 48999 3417 -33203 -27777 8933 22556
2656 22556 -43381 -88916 -29719 1497 42765 39349 -22408 -60489 -96457 -107134 -92376 -19157
2644 -19157 12039 44678 29133 -8008 13891 21672 11258 30080 57862 63977 31323 6326
2632 6326 -21072 12736 -19717 15342 31522 26365 47081 22096 -93711 -59944 58640 -516
2620 -516 -112382 -183618 -223642 -83954 -24791 13258 80470 28674 -49656 -72279 -119293 -90229
2608 -90229 -91345 -6242 -32748 -38644 28190 158938 176862 158788 64374 -45962 -27069 -20431
2596 -20431 -85474 -68318 -13724 49795 18148 -34229 -72365 16883 141536 98452 26716 -5721
2584 -5721 30586 -24171 -28273 21304 23950 -80987 -114305 81032 175531 68108 2554 8074
2572 8074 737 -9600 -34937 22443 42547 102072 85789 97365 93641 49423 82451 45646
2560 45646 18779 18513 41464 -19138 -58447 -48433 17989 123338 129693 80708 -1013 -48441
2548 -48441 -95829 -18061 54167 2006 -56744 -90579 -141889 -99327 -28627 65811 98814 92291
2536 92291 51297 -68028 -54866 104454 88475 95594 120294 181899 94794 30210 5789 -28864
2524 -28864 61727 95932 32126 -14072 34223 97616 63442 -18114 -49241 -73045 -5381 37585
2512 37585 -11371 -8453 -11038 -31896 -69963 -99853 -41118 49804 71309 41982 22164 1877
2500 1877 -28940 -115178 -111450 -58984 -52201 -26371 63411 103068 132299 -30126 -105824 23037
2488 23037 77414 -67098 -116955 -113899 -98255 -129723 -107839 -79266 -58430 4851 -9902 2760
2476 2760 -26779 -2341 -49913 -118309 -174499 -99219 -73175 -2631 9510 -20480 -9343 -12323
2464 -12323 -38211 -109066 -112996 -129951 -69425 -37833 -50933 -8614 3933 24586 71464 47105
2452 47105 55227 54484 102063 89894 104590 102453 29012 22326 -5007 -21679 -9089 74077 155995
2439 155995 190581 192967 168479 124009 87421 67703 28601 82086 106397 192123 172609 103154
2427 103154 54720 -5157 8073 19816 26432 54345 123816 146718 120902 112321 72059 9328
2415 9328 -32546 -89479 -54776 -5317 104859 113301 177521 145153 94204 61832 -35529 -41222
2403 -41222 6410 21530 35451 -32611 -62680 -13158 33700 41832 14995 26995 -6116 -11690
2391 -11690 -22665 -51757 -43690 51765 113214 8631 17372 47312 41646 -66266 -49481 8872
2379 8872 8459 50625 66314 147421 222800 83795 -5021 24363 24354 -2717 21142 -48222 -27868
2366 -27868 -33503 -139791 -159846 -88756 -61598 -121575 -39055 15691 35622 93918 153586 207743
2354 207743 156476 158635 174043 89409 7880 52584 188989 254586 178528 64760 52802
2343 52802 44263 55653 42090 5635 -43652 -123093 -172619 -157005 -87814 -66332 -40231 10392
2331 10392 67657 95748 92488 44590 -111487 -94560 -95049 -125416 -101712 -46550 -45080 -48047 12434
2318 12434 39397 78236 45425 -4560 -50582 -84902 -58214 -55255 -76394 -120511 -172406 -127570
2306 -127570 -83558 -19812 97445 145716 20439 -60141 -85073 -88817 -86845 -72077 -8554 67308
2294 67308 -6209 -58027 -86716 -179373 -241218 -273958 -223360 -139321 -10431 14689 29025 -33509
2282 -33509 -107563 -71318 -32928 -89598 -50354 -53729 -113684 -79473 -2413 74317 94889 48962
2270 48962 -28508 -33527 -38603 -2507 -18242 -38221 -23861 -46332 -34219 20868 3278 35569
2258 35569 51294 -41567 15919 33999 52765 65657 80466 32839 -8406 -4901 14196 71059
2246 71059 51853 72389 116286 -2444 -58023 -103422 -230004 -236930 -184686 -130360 -89312 -34873
2234 -34873 59200 53284 -63998 -125637 -102508 -44613 -56579 -31547 -88845 -108870 -162554 -93474
2222 -93474 -18675 68719 55326 -65677 -142980 -179451 -54717 51301 39618 -20228 -45076
2211 -45076 -60372 -52093 -52052 -78952 -80598 -74735 -55032 -58114 -39431 -39192 -51723 -78411 -41189 8508
2197 8508 79223 151533 156650 106843 134876 102843 20562 16578 21651 -13124 37466 38178 -57282
2184 -57282 -83590 8287 64653 51065 84264 18466 -60269 -110134 -91263 -22586 46949 95430
2172 95430 52613 -61297 -164186 -124104 679 93168 141537 100617 -13871 1283 -22442
2161 -22442 -25371 17334 29099 51399 31656 97996 180612 96815 68506 69884 47309 -16478
2149 -16478 -97551 -51176 147 -44922 -74487 -16015 -36212 -75164 -17815 40289 39113 42951
2137 42951 17538 38780 25249 -14218 -57406 -24973 -34835 -75248 -150810 -127885 -68365 -23095
2125 -23095 -27063 -92772 -133398 -26207 17104 -150 -44935 16918 30041 77131 -48722 -171421
2113 -171421 -192567 -95858 -49141 -99883 -3146 44699 -65929 -76157 47989 20767 -866
2102 -866 57682 103936 155916 113611 116195 96153 53402 9389 -39218 -62350 -60055 54584
2090 54584 122007 99999 124728 122490 151649 195103 202836 121737 79315 58575 -10462 -10844 -44048
2077 -44048 -64909 -145809 -180747 -99056 -43502 -45501 -19362 -54654 12420 88029 85353 1927
2065 1927 -26215 -17351 -22180 -132691 -102703 -83030 -76938 -89409 34274 172597 229598 169933
2053 169933 83116 24166 -6705 3578 27079 18313 55954 96955 115424 95835 76644 -21389
2041 -21389 -47786 30421 -7892 -40515 -110624 -151068 -142978 -144840 -102935 29971 87837 11505
2029 11505 6306 -771 -71087 -68077 -38946 -129070 -200594 -190222 -152336 -112719 -35963 -7135
2017 -7135 26589 34901 -17508 -27825 -4964 24627 -117876 -174071 -105132 11345 122373 139114
2005 139114 104564 47581 109262 133313 74053 -34523 -46234 -58842 -44130 8251 43890
1994 43890 102923 136600 103315 52009 57636 -33354 -92483 -78212 -12771 -377 -27322 19264
$$ [...]
##END NTUPLES=NMR SPECTRUM
##END=
