##TITLE=Analysis number 327790
Compound Code tl 00319
Book Reference 49838 a
Project Code adrs flro3
Chemist Name jom
##JCAMPDX= 6.0         $$ Bruker NMR JCAMP-DX V2.0
##DATA TYPE= NMR SPECTRUM
##DATA CLASS= NTUPLES
##ORIGIN= Bruker BioSpin GmbH
##OWNER= nmr
$$ XWIN-NMR		Version 3.5
$$ Tue Apr 10 10:00:34 2007 GMT Daylight Time (UT+1h)  MAYBRIDGE\nmr@NMR_250MHZ
##.OBSERVE FREQUENCY= 250.131544655141
##.OBSERVE NUCLEUS= ^1H
##.ACQUISITION MODE= SIMULTANEOUS (DQD)
##.ACQUISITION SCHEME= undefined
##.AVERAGES= 16
##.DIGITISER RES= 18
##SPECTROMETER/DATA SYSTEM= dpx250
##.PULSE SEQUENCE= zg30
##.SOLVENT NAME= DMSO
##.SHIFT REFERENCE= (INTERNAL, DMSO, 0, 16.522)
##AUDIT TRAIL= $$ (NUMBER, WHEN, WHO, WHERE, WHAT)
$$ ##TITLE= Audit trail, XWIN-NMR		Version 3.5
$$ ##JCAMPDX= 5.01
$$ ##ORIGIN= Bruker BioSpin GmbH
$$ ##OWNER= nmr
$$ C:\u/data/dgb/nmr/ADRS/730/pdata/1/auditp.txt
$$ ##AUDIT TRAIL=  $$ (NUMBER, WHEN, WHO, WHERE, WHAT)
(   1,<2007-04-10 10:00:15.03 +100>,<MAYBRIDGE\nmr>,<NMR_250MHZ>,
      <created by zg, POWCHK disabled, PULCHK disabled
       configuration hash MD5:
       49 4B E0 1D 92 C2 6B 37 9F E6 65 BC 52 41 86 1D
       data hash MD5: 64K
       03 8E 98 B7 4B 58 AA 44 9B 14 5F 4B 59 75 0E DD>)
(   2,<2007-04-10 10:00:26.09 +100>,<MAYBRIDGE\nmr>,<NMR_250MHZ>,
      <Start of raw data processing
       ef LB = 0.3 FT_mod = 6 PKNL = 1 SI = 32K 
       data hash MD5: 32K
       6F 3D 07 B9 10 2C C9 49 03 CA 80 E5 8F 17 3F 0E>)
(   3,<2007-04-10 10:00:27.78 +100>,<MAYBRIDGE\nmr>,<NMR_250MHZ>,
      <apk 
       data hash MD5: 32K
       DB A4 EA B0 64 99 F6 52 E4 35 2D 4A 33 58 C7 23>)
(   4,<2007-04-10 10:00:28.57 +100>,<MAYBRIDGE\nmr>,<NMR_250MHZ>,
      <abs ABSG = 5 
       data hash MD5: 32K
       9C C5 41 6B A0 EA B8 09 F1 71 6B 5E AF 97 07 DA>)
$$ ##END=
$$ 
$$ hash MD5
$$ 35 A5 7C B2 67 77 75 4C 5F 23 80 F1 E1 08 B5 CA
##$RELAX= 
##$RELAX= 
##$RELAX= 
##$RELAX= 
##$RELAX= 
##$RELAX= 
##$RELAX= 
$$ Bruker specific parameters
$$ --------------------------
##$DU= <C:\u>
##$EXPNO= 730
##$NAME= <ADRS>
##$PROCNO= 1
##$TYPE= <nmr>
##$USER= <dgb>
##$AMP= (0..31)
100 100 100 100 100 100 100 100 100 100 100 100 100 100 100 100 100 100 
100 100 100 100 100 100 100 100 100 100 100 100 100 100 
##$AQSEQ= 0
##$AQ_mod= 3
##$AUNM= <au_zg>
##$AUTOPOS= <10 >
##$BF1= 250.13
##$BF2= 250.13
##$BF3= 250.13
##$BF4= 250.13
##$BF5= 500.13
##$BF6= 500.13
##$BF7= 500.13
##$BF8= 500.13
##$BYTORDA= 1
##$CFDGTYP= 0
##$CFRGTYP= 5
##$CHEMSTR= <none>
##$CNST= (0..31)
1 1 145 1 1 1 1 1 1 1 1 1 1 1 1 1 1 1 1 1 1 1 1 1 1 1 1 1 1 1 1 1 
##$CPDPRG= <>
##$CPDPRG1= <>
##$CPDPRG2= <>
##$CPDPRG3= <>
##$CPDPRG4= <mlev>
##$CPDPRG5= <mlev>
##$CPDPRG6= <mlev>
##$CPDPRG7= <mlev>
##$CPDPRG8= <mlev>
##$CPDPRGB= <>
##$CPDPRGT= <>
##$D= (0..31)
0 1 0 0 0 0 0 0 0 0.06 0 0 0 0 0 0 0.0002 0 0 0 0 0 0 0 0 0 0 0 0 0 0 
0 
##$DATE= 1176195613
##$DBL= (0..7)
120 120 120 120 120 120 120 120 
##$DBP= (0..7)
150 150 150 150 150 150 150 150 
##$DBP07= 0
##$DBPNAM0= <>
##$DBPNAM1= <>
$$ [...]
##$SUBNAM7= <"">
##$SUBNAM8= <"">
##$SUBNAM9= <"">
##$SW= 20.6930455092707
##$SWIBOX= (0..15)
0 0 3 0 0 0 0 0 0 0 0 0 0 0 0 0 
##$SW_h= 5175.983436853
##$TD= 65536
##$TD0= 1
##$TE= 683.16
##$TE2= 300
##$TE3= 300
##$TEG= 300
##$TL= (0..7)
0 120 120 120 120 120 120 120 
##$TP= (0..7)
150 150 150 150 150 150 150 150 
##$TP07= 0
##$TPNAME0= <>
##$TPNAME1= <>
##$TPNAME2= <>
##$TPNAME3= <>
##$TPNAME4= <>
##$TPNAME5= <>
##$TPNAME6= <>
##$TPNAME7= <>
##$TPOAL= (0..7)
0.5 0.5 0.5 0.5 0.5 0.5 0.5 0.5 
##$TPOFFS= (0..7)
0 0 0 0 0 0 0 0 
##$TUNHIN= 0
##$TUNHOUT= 0
##$TUNXOUT= 0
##$USERA1= <user>
##$USERA2= <user>
##$USERA3= <user>
##$USERA4= <user>
##$USERA5= <user>
##$V9= 5
##$VALIST= <valist>
##$VCLIST= <CCCCCCCCCCCCCCC>
##$VD= 0
##$VDLIST= <DDDDDDDDDDDDDDD>
##$VPLIST= <PPPPPPPPPPPPPPP>
##$VTLIST= <TTTTTTTTTTTTTTT>
##$WBST= 1024
##$WBSW= 4
##$XGAIN= (0..3)
0 0 0 0 
##$XL= 0
##$YL= 0
##$YMAX_a= 464724
##$YMIN_a= -364628
##$ZGOPTNS= <>
##$ZL1= 120
##$ZL2= 120
##$ZL3= 120
##$ZL4= 120
##$ABSF1= 16.522
##$ABSF2= -4.171173
##$ABSG= 5
##$ABSL= 3
##$ALPHA= 0
##$AQORDER= 0
##$ASSFAC= 0
##$ASSFACI= 0
##$ASSFACX= 0
##$ASSWID= 0
##$AUNMP= <proc_1d>
##$AZFE= 0.1
##$AZFW= 0.1
##$BCFW= 0
##$BC_mod= 0
##$BYTORDP= 0
##$COROFFS= 0
##$CY= 12.5
##$DATMOD= 1
##$DC= 0
##$DFILT= <>
##$DTYPP= 0
##$F1P= 14.0000005364418
##$F2P= -0.99999901652339
##$FCOR= 0.5
##$FTSIZE= 32768
##$FT_mod= 6
##$GAMMA= 0
##$GB= 0
##$INTBC= 1
##$INTSCL= 1
##$ISEN= 128
##$LB= 0.3
##$LEV0= 0
##$LPBIN= 0
##$MAXI= 10000
##$MC2= 0
##$MEAN= 0
##$ME_mod= 0
##$MI= 0
##$NCOEF= 0
##$NC_proc= -3
##$NLEV= 6
##$NOISF1= 0
##$NOISF2= 0
##$NSP= 0
##$NTH_PI= 0
##$NZP= 0
##$OFFSET= 16.522
##$PC= 1
##$PHC0= 220.0017
##$PHC1= 5.751017
##$PH_mod= 1
##$PKNL= yes
##$PPARMOD= 0
##$PSCAL= 4
##$PSIGN= 0
##$REVERSE= no
##$SF= 250.13
##$SI= 32768
##$SIGF1= 0
##$SIGF2= 0
##$SINO= 400
##$SIOLD= 32768
##$SREGLST= <1H.DMSO>
##$SSB= 0
##$STSI= 32768
##$STSR= 0
##$SW_p= 5175.98343685301
##$SYMM= 0
##$S_DEV= 0
##$TDeff= 65536
##$TDoff= 0
##$TI= <Analysis number 999999
Compound Code 99
Book Reference 9
Project Code 9>
##$TILT= no
##$TM1= 0
##$TM2= 0
##$TOPLEV= 0
##$USERP1= <user>
##$USERP2= <user>
##$USERP3= <user>
##$USERP4= <user>
##$USERP5= <user>
##$WDW= 1
##$XDIM= 32768
##$YMAX_p= 522265973
##$YMIN_p= -108503
$$ End of Bruker specific parameters
$$ ---------------------------------
##NTUPLES= NMR SPECTRUM
##VAR_NAME=  FREQUENCY,     SPECTRUM/REAL,   SPECTRUM/IMAG
##SYMBOL=    X,             R,               I
##VAR_TYPE=  INDEPENDENT,   DEPENDENT,       DEPENDENT
##VAR_FORM=  AFFN,          ASDF,            ASDF
##VAR_DIM=   32768,         32768,           32768
##UNITS=     HZ,            ARBITRARY UNITS, ARBITRARY UNITS
##FACTOR=    0.157963299565203, 1,           1
##FIRST=     4132.6476996994, 0,             0
##LAST=      -1043.33573715361, 0,           0
##MIN=       -1043.33573715361, -108503,     0
##MAX=       4132.6476996994, 522265973,     0
$$ Real data points
##PAGE= N=1
##DATA TABLE= (X++(R..R)), XYDATA
$$ [...]
16166e1607k737J9455R996m726L721K0545J5010J0755R097Q484J217j735j0113
$$ -51607 -54344 -34889 -24893 -29619 -25898 -5353 9657 20412 29509 37993 39210 37475 27362
16153B7362m6362k6175J3683L5710K084k7949j1476K0699K2740J1653j3401m982
$$ 27362 -19000 -45175 -31492 4218 6302 -21647 -33123 -12424 10316 21969 8568 3586
16141C586J4044O022l5836O38P750l5183j0008J0483p647J7374O366k475q015
$$ 3586 17630 23652 -12184 -11546 -3796 -38979 -48987 -38504 -46151 -28777 -22411 -24886 -32901
16128c2901R770K9110J5931k3874k761O890k0478j1735k542k457J4628R029R44
$$ -32901 -23131 5979 21910 -1964 -4725 2165 -18313 -30048 -32590 -35047 -20419 -11390 -10446
16115a0446K6408j995j0402l3128R035L0171m002k3907q502l80L5283K1748p757
$$ -10446 15962 13967 3565 -29563 -20528 9643 5641 -18266 -26768 -27148 8135 29883 22126
16102B2126n875N306Q60R128m2215j309J5343M050j995j113K8241j5420L1p15
$$ 22126 16251 21557 22417 31545 -10670 -11979 3364 7414 5419 4306 32547 17127 17158 16443
16088A6443P973k755j1416J4958K052r877j2741j423p018l0860j1731j4720J8882
$$ 16443 24416 21661 10245 25203 27255 17378 4637 3214 -3804 -34664 -46395 -61115 -42233
16075d2233L2741K5069m783m0272J853P935k0151j852J1889P170m2566k4210J2303
$$ -42233 -9492 15577 10794 -29478 -27625 -19690 -39841 -41693 -29804 -22634 -65200 -89410 -77107
16062g7107K3562L1389K0233k1592l4209J9211o330R84J2950N356j381n326K9994
$$ -77107 -53545 -22156 -1923 -23515 -57724 -38513 -44843 -43859 -30909 -25553 -26934 -32260 -2266
16049b266J57m1686J154L7237J6935K2887J959k263k0716o688Q712K3523k5054
$$ -2266 -2109 -43795 -42641 -5404 11531 34418 36377 34114 13398 6710 15422 38945 13891
16036A3891j8031L447N043Q478n955k5361L5018J8704J933o746j7646k241p147
$$ 13891 -4140 -693 4350 12828 6873 -18488 16530 35234 37167 30421 12775 10534 3387
16023C387j3530k7303K5275K7434J1391o321k484J5487j8628O532k2534j194M3731
$$ 3387 -10143 -37446 -12171 15263 26654 20333 17849 33336 14708 21240 -1294 -2488 41243
16010D1243K3881l1700l1749J2290l365k930q679J7221k125r87k141j6061J82
$$ 41243 65124 33424 1675 13965 10600 7670 -1009 16212 14087 13100 10959 -5102 -4920
15997d920K9266j4376q719j6547j2893j3034j0538O499J8449j0078K7743L2562
$$ -4920 24346 9970 1251 -15296 -28189 -41223 -51761 -45262 -26813 -36891 -9148 23414
15985B3414p944M563k7191k7168L724O594j122N995M897O768O247j3055k4919
$$ 23414 15470 20033 -7158 -34326 -30602 -24008 -25130 -19135 -14238 -7470 -1223 -14278 -39197
15972c9197L685J6103l2429qM556J5450j5982n987J6596J4486J396j3587l128
$$ -39197 -35512 -19409 -51838 -51846 -47290 -31840 -47822 -53809 -37213 -22727 -21331 -34918 -38046
15959c8046O01M758j9484K0678K4405k9511j3565J9953K3269Q663j7756q69j0071
$$ -38046 -37445 -32687 -52171 -31493 -7088 -36599 -50164 -30211 -6942 1721 -16035 -16904 -26975
15946b6975J0106j2736M585L4656o138l6303j4300R134K819K1636k960P663K9729
$$ -26975 -16869 -29605 -25020 9636 3498 -32805 -47105 -37971 -35152 -13516 -16476 -8813 20916
15933B0916Q817l462K08J8939l219r442l225P830M693n479m9632J3964J3446J3891
$$ 20916 29733 26271 26479 45418 42199 32757 29532 37362 42055 36576 -13056 908 14354 28245
15919B8245P592j946R951p277k0165j4268J038K7511K3471R880k5296j9445j4175
$$ 28245 35837 33891 43842 36565 16400 2132 3170 30681 54152 64032 38736 19291 5116
15906E116K7883J1951k1640O657J4905k1299r370R758J8679j303j2451l0461j2278
$$ 5116 32999 44950 23310 29967 44872 23573 14203 23961 42640 41337 28886 -1575 -13853
15893a3853K661l2028K1011L449J8624J5949M728q284m4726J9938K9941j802J1977
$$ -13853 -11192 -43220 -22209 -18760 -136 15813 20541 12257 -32469 -12531 17410 15608 27585
15880B7585k0237j5860j2557j1242J7777K424J309K19R507O390k703p925K331
$$ 27585 7348 -8512 -21069 -32311 -14534 -12110 -10801 -10582 -1075 5315 2612 -5313 -2982
15867b982o747o099m538j2150K274R558l816J0699K7704q211m5882j267J8009
$$ -2982 -9729 -15828 -20366 -32516 -30242 -20684 -24500 -13801 13903 5692 -40190 -41457 -23448
15854b3448m219P823r978j1562j6878K5371P388j6107O010K4131R910J5412L5277
$$ -23448 -27667 -19844 -29822 -41384 -58262 -32891 -25503 -41610 -35600 -11469 -1559 13853 49130
15841D9130j2271k0543q975k4806j6576L1466Q953k9211k3972J8776K1622J2713
$$ 49130 36859 16316 7341 -17465 -34041 -2575 6378 -22833 -46805 -28029 -6407 6306
15829F306J0143n971J0292K9538l153l7304R369O147N359P37k8520k6303j9157
$$ 6306 16449 10478 20770 50308 47155 9851 19220 25367 30726 31463 2943 -23360 -42517
15816d2517J1684L8100K846k3315K372J6010J1068J1629J5058j1514l56j6587
$$ -42517 -30833 7267 10113 -13202 -10830 5180 16248 27877 42935 31421 31065 14478
15804A4478m8612j1526R133J6212J7354K2757l0380j7930Q510r23R698J3364J5462
$$ 14478 -34134 -45660 -36527 -20315 -2961 19796 -10584 -28514 -20004 -20927 -11229 2135 17597
15791A7597R281J3266k2033l5075l1522q883Q539L9692O098q983j1236K5152O059
$$ 17597 26878 40144 18111 -16964 -48486 -57369 -48830 -9138 -3040 -12023 -23259 1893 7952
15778G952j810K649M706l2416Q267J3857n074R340r703K181K9155j9108k269J4702
$$ 7952 6142 8791 13497 -18919 -10652 3205 -1869 7471 -2232 -51 29104 9996 7727 22429
15764B2429j6407K745j1118j6570m534K2404K2108j115j7831J7096q0O39j1131
$$ 22429 6022 8767 -2351 -18921 -23455 -1051 21057 19942 2111 19207 19127 19766 8635
15751H635j6493K933q081j9551j1428J8277q411n806J4080M7383J2684p956M009
$$ 8635 -7858 -4925 -13006 -32557 -43985 -25708 -34119 -39925 -25845 21538 34222 26266 30275
15738C0275L397l0989k7192m78J8370j843r05J3907K2234j78k928m94K4418k8504
$$ 30275 33672 2683 -24509 -24987 -6617 -8460 -9365 4542 26776 26598 23670 23176 47594 19090
15724A9090j8718J093k0795K5723L913r341k2356j6054J6102k0021j1087R921
$$ 19090 372 1465 -19330 6393 10306 965 -21391 -37445 -21343 -41364 -52451 -42530
15712d2530n011K2169J4669O421q414j3101k676R035l023J3012j1169r484L2362
$$ -42530 -47541 -25372 -10703 -4282 -12696 -25797 -28473 -19438 -22461 -9449 -20618 -30102 2260
15699B260P059r281k7036J4725J2952L1024N780l7804o183k832n626k2658J2864
$$ 2260 9319 38 -26998 -12273 679 31703 37483 -321 -6504 -9336 -14962 -37620 -24756
15686b4756N1951L863k5288k7929k6632K0224O830O860q782K3337k00Q242L136
$$ -24756 27195 31058 5770 -22159 -48791 -28567 -21737 -14877 -23659 -322 -522 7720 10856
15673A0856k257o749k1527o227J5429J7825j2821k2475j1626j6262J9563J6815
$$ 10856 8599 1850 -19677 -25904 -10475 7350 -5471 -27946 -39572 -55834 -36271 -19456
15661a9456K5815K1282j9332k3132Q685L1772Q657l7473O628k7201k990P056N996
$$ -19456 6359 27641 8309 -14823 -6138 25634 34291 -3182 3446 -23755 -26745 -19689 -13693
15648a3693k971K6717J6272j9626j0014L0682K0602K837p233l0172o092k3952
$$ -13693 -16664 10053 26325 6699 -3315 27367 47969 50806 43573 13401 7309 -16643
15636a6643K4882M1894n502k3632k2018m1308j3016L4796K3303p103j7220K3946
$$ -16643 8239 50133 44631 20999 -1019 -42327 -55343 -20547 2756 -4347 -21567 2379
15624B379K011j4090k6646K6069M997k4162l7508K2890M6052K3180k3636o720
$$ 2379 4390 -9700 -36346 -10277 -5280 -29442 -66950 -44060 1992 25172 1536 -5184
15612e184M691o411m166J7788L1295n344l0047j0598L470J976J4109p677k1872
$$ -5184 -493 -6904 -11070 6718 38013 32669 2622 -7976 -4506 -2530 11579 3902 -17970
15599a7970J1520p031M664m628M3633K2019l5243l4404K3960K3290j4554j8094
$$ -17970 -6450 -13481 -8817 -13445 30188 52207 16964 -17440 6520 29810 15256 -2838
15587b838j513M5120K8747j3595l997m0377k2284j3649J3691O125Q950N960Q392
$$ -2838 -4351 40769 69516 55921 51924 11547 -10737 -24386 -10695 -4570 4380 10340 18732
15574A8732p032o976j8022p260K0873k3220j2225J8374J2469j941J699J0802l4171
$$ 18732 11700 4724 -13298 -20558 315 -22905 -35130 -16756 -4287 -6228 -4529 6273 -27898
15561b7898n160K6413R625K9813J1978J189k0985l9585k5667J9531j5074m543
$$ -27898 -33058 -6645 2980 32793 44771 45960 24975 -14610 -40277 -20746 -35820 -40363
15549d0363L6401J6883M929l0198p280N923J4882N45R657j136k6764p148Q286
$$ -40363 -3962 12921 17850 -12348 -19628 -13705 1177 1722 11379 10243 -16521 -23669 -15383
15536a5383M854K1452m98j8196L1809k327k3761O873k059L201J7398K4405j2572
$$ -15383 -10529 10923 10425 -7771 24038 21711 -2050 4823 2764 5965 23363 47768 35196
15523C5196k5251J4162L0090L583k7454j5880k2449o307J6810J8412R460j1109
$$ 35196 9945 24107 54197 57780 30326 14446 -8003 -14310 2500 20912 30372 19263
15511A9263k9200r374K0197J8749P016j2098L948k145l409J7448m7128j5567o870
$$ 19263 -9937 -19311 886 19635 26651 14553 18501 16356 12947 30395 -16733 -32300 -39170
15498c9170P257M580r701k7276p377J2121K9142L339M140q989k3253J5600J3874
$$ -39170 -31913 -27333 -37034 -64310 -71687 -59566 -30424 -27085 -22945 -31934 -55187 -39587 -25713
15485b5713m176k1207P23N688K6700J738Q296L994j237M413k3494J0454q154o561
$$ -25713 -29889 -51096 -50373 -44685 -17985 -16247 -7951 -3957 -5194 -781 -24275 -13821 -21975 -28536
15471b8536K332j06o798O487R270M726k0476J0555K8473j0466j4007J4095r70
$$ -28536 -26204 -26310 -33108 -26621 -17351 -12625 -33101 -22546 5927 -4539 -18546 -4451 -5421
15458e421j8268M896J4817m429MJ9289N111j693m341J4831r609j7776j0453j4207
$$ -5421 -23689 -18793 -3976 -8405 -8401 10888 15999 14306 9965 24796 15187 -2589 -13042 -27249
15444b7249L507k283k162J709L896J9113Q259q728j2244k6982O786R252q803p594
$$ -27249 -23742 -26025 -28187 -26478 -22582 -3469 4790 -3938 -16182 -43164 -36378 -27126 -35929 -43523
15430d3523j6096L0497K5666j6213K239J1648j2852j0455N663N387m967r729l764
$$ -43523 -59619 -29122 -3456 -19669 -17430 -5782 -18634 -29089 -23426 -18039 -23006 -32735 -36499
15417c6499K12J5187P499j2210j8650M56P812K2721l249k5041j552J0148J3568
$$ -36499 -36287 -21100 -13601 -25811 -44461 -44005 -36193 -13472 -16721 -41762 -43314 -33166 -19598
15404a9598K2253o567l8271j8702J1382J0546L381k857J4900K4746Q123L073l3579
$$ -19598 2655 -3912 -42183 -60885 -49503 -38957 -35576 -38433 -23533 1213 9336 12409 -21170
15391b1170k869j1836l021K2362L886K4486k163l655r02m829k6066q187J5032
$$ -21170 -24039 -35875 -38896 -16534 -12648 11838 9675 6020 5118 289 -25777 -33964 -18932
15378a8932K8634r03l9163N27J5330O927K1272K8175J1759k6614j869j5853q950
$$ -18932 9702 8799 -30364 -29837 -14507 -7580 13692 41867 53626 27012 25143 9290 340
15365C40k0896N292K779j0904Q621J8045J0001J0836n558r036j3264j047J0042
$$ 340 -20556 -15264 -12485 -23389 -14768 3277 13278 24114 18556 9520 -3744 -4791 5251
15352E251J073K457m431j9496j9974K7476L5687R535o499j0713l0675J3120Q323
$$ 5251 6324 8781 4350 -15146 -35120 -7644 28043 37578 31079 20366 -10309 2811 11134
15339A1134J8004m3279j2653L3879j0798k4835l474L1139J6664j6269o037j316
$$ 11134 29138 -14141 -26794 7085 -3713 -28548 -32022 -883 15781 -488 -6525 -7841
15327g841q368J8574k0975k3712J6626J0583P441p896j3587k775j325J5946K0024
$$ -7841 -16209 2365 -18610 -42322 -25696 -15113 -7672 -15568 -29155 -31930 -33255 -17309 2715
15314B715J6706J1187l374r226p607K2808J5096m348k0995p13j2119k249q640
$$ 2715 19421 30608 27234 18008 10401 33209 48305 43957 22962 22249 10130 7881 -759
15301g59j4459L897k1011q600J8283L5988n140M78K597j3043J0307K4620K3375
$$ -759 -15218 -11321 -32332 -40932 -22649 13339 8199 8677 11274 -1769 8538 33158 56533
15288E6533k6946l6384N997j8279o513N525o025J4445M920L57l962J7553N500
$$ 56533 29587 -6797 -800 -19079 -25592 -20067 -26092 -11647 -6727 -6370 -10332 7221 12721
15275A2721o115j9977j7669j2189P216m380J4608J4810j3218J0744l141K954J5307
$$ 12721 6606 -13371 -31040 -43229 -36013 -40393 -25785 -10975 -24193 -13449 -16590 -13636 1671
15262A671J670r249n708k6698J7030K2508K5573K2747R466k7408j3472k183k4823
$$ 1671 3341 -5908 -11616 -38314 -21284 1224 26797 49544 59010 31602 18130 15947 -8876
15249h876R710K3734J7923L235o757J2606j7112k8344j4939J1444J1759L99k3145
$$ -8876 834 24568 42491 45726 38969 51575 34463 6119 -8820 2624 14383 14782 -8363
15236h363n699M0404l466M012j4655j3423j5046o357K3317J9272k3280k5338k8910
$$ -8363 -14062 26342 22876 26888 12233 -1190 -16236 -22593 724 19996 -3284 -28622 -57532
15223e7532Q879R997J1752J345k330M786l265L5559K4883P126j6330m7693k1897
$$ -57532 -48653 -38656 -26904 -25559 -27889 -23103 -26368 9191 34074 41200 24870 -22823 -44720
15210d4720O927J8378P217j24K199j625K7547K8493k078j2049K2973K2684m069
$$ -44720 -37793 -19415 -12198 -12322 -10123 -11748 15799 44292 42214 30165 53138 75822 71753
15197G1753k8086k2199j4758J1362j0126k3875k7534m0027K7828K9059L4006P470
$$ 71753 43667 21468 6710 18072 7946 -15929 -43463 -83490 -55662 -26603 7403 14873
15185A4873K0188K352Q170J3831j6277p023j2878n819k8210R493l0452p773J8290
$$ 14873 35061 37413 45583 59414 43137 36114 23236 17417 -10793 -1300 -31752 -39525 -21235
15172b1235O791n831j2803L5880K1501q850j251J7561J9993K7372j9579n2616
$$ -21235 -14444 -20275 -33078 2802 24303 15453 14202 31763 51756 79128 59549 6933
15160F933k6206N346K9243o577l0772j3413q92N163Q58K2K1149P056K941N284
$$ 6933 -19273 -13927 15316 8739 -22033 -35446 -36338 -31175 -30317 -30295 -9146 -2090 851 6135
15146F135J0140J1892J380l7653j016J7460M0751q369j2334R122k1714k2689P190
$$ 6135 16275 28167 29547 -8106 -9122 8338 49089 40720 28386 37508 15794 -6895 295
15133B95J3163K6214L053j7114l4861p819r464j8447J3897r771O088J302N636
$$ 295 13458 39672 42725 25611 -9250 -17069 -26533 -44980 -31083 -40854 -34766 -33464 -27828
15120b7828K6734K076k5801Q351P596n650k926o044j2018O056J6371j7594j4350
$$ -27828 -1094 982 -24819 -16468 -8872 -14522 -17448 -23492 -35510 -29454 -13083 -30677 -45027
15107d5027J7509J5907J7611J4504j028j0434r040J7392r025k9775j8530L2437
$$ -45027 -27518 -11611 6000 20504 19476 9042 2 17394 8369 -21406 -39936 -7499
15095g499Q756P46J2669k1119J1872L9367m997j3582l9047q641K2586r949k2141
$$ -7499 1257 2003 14672 -6447 5425 44792 39795 26213 -12834 -21475 1111 -8838 -30979
15082c0979J0011N889P007j4290k2537o442K5851J7882k513k1252J7864J942K3227
$$ -30979 -20968 -15079 -8072 -22362 -44899 -51341 -25490 -7608 -10121 -31373 -13509 -11567 11660
15069A1660J0529o070j0996j4377j836K9523j6311j3792p031p539J4849J5242
$$ 11660 22189 16119 5123 -9254 -11090 18433 2122 -11670 -18701 -26240 -11391 3851
15057C851P568o257O334l3233l1908n925j0754L029O028J360K1538J3718j5956
$$ 3851 11419 5162 11496 -21737 -53645 -59570 -70324 -67295 -61267 -59907 -38369 -24651 -40607
15044d0607m599K7572J9031q140q343J7688k753K094O899O658J677n77j3049J7378
$$ -40607 -45206 -17634 1397 -6743 -15086 2602 -151 1943 8842 15500 17177 16600 3551 20929
15030B0929L2259j3132j4937o267j7211J2997K578o59J999m5832n565J6620j8249
$$ 20929 53188 40056 25119 18852 1641 14638 17216 16557 18556 -27276 -32841 -16221 -34470
15017c4470N932N07J0593r747l239J7362N283N258j3605K899n393p823k072l3241
$$ -34470 -28538 -28031 -17438 -27185 -30424 -13062 -7779 -2521 -16126 -13227 -18620 -26443 -28515 -61756
15003f1756N804q464Q716n146j9563j0435J7312J0675K4253J5648L7025m2474
$$ -61756 -55952 -64416 -55700 -60846 -80409 -90844 -73532 -62857 -38604 -22956 14069 -28405
14991b8405q963K2833R671k3968j2452L2869L0882K941j2836k0059k0522J7027
$$ -28405 -37368 -14535 -4864 -28832 -41284 -8415 22467 25408 12572 -7487 -28009 -10982
14979a0982J8883j5494L090J870j4287L545K1677K368N060K2141p149j5464j3540
$$ -10982 7901 -7593 -4503 -2633 -16920 -13375 8302 10670 15730 37871 30722 15258 1718
14966A718l8436L977k476Q940J4081J5189k8762l8423K5439M477j8932K3084L1312
$$ 1718 -36718 -32741 -35217 -26277 -12196 2993 -25769 -64192 -38753 -34276 -53208 -30124 1188
14953A188j0591o552L1571J2889J3476L0682m8834k9875J1924l718n112m63q058
$$ 1188 -9403 -15955 15616 28505 41981 72663 23829 -6046 5878 2160 -2952 -3415 -11473
14940a1473K4740J8369J5751N632k7653m1901j9983l816p592j1173N0495M8819
$$ -11473 13267 31636 47387 53019 25366 -16535 -36518 -40334 -47926 -59099 -8604 40215
14928D0215p63k547j651k3124k7201m7004J1831L8103P47j2028q77K5042O916
$$ 40215 39452 36905 35254 12130 -15071 -62075 -50244 -12141 -11394 -23422 -24299 743 7659
14915G659q507l923o943k3694P873J5108L830j20j2711N257J7751K1963R443j5058
$$ 7659 -848 -4771 -11714 -35408 -27535 -12427 -8597 -8717 -21428 -16171 1580 23543 32986 17928
14901A7928j9766k4847J53L3770L7729J3087k042k2043m335l0796k9848N3734
$$ 17928 -1838 -26685 -26532 7238 44967 58054 56012 33969 29634 -1162 -31010 22724
14889B2724J548j9138l245L0266R196k0513m4152m120K2475M5277K2331J3515
$$ 22724 24272 5134 1889 32155 41351 20838 -23314 -27434 -4959 40318 62649 76164
14877G6164j8089k9126j29k8920l1922J744m110R895o0j6061l4571k329L9929
$$ 76164 58075 28949 28820 -100 -32022 -30278 -34388 -24493 -24553 -40614 -75185 -77514 -37585
14864c7585L2499J2003K1242N639k6177n506K2359J4415k2517j7379j2409m3407
$$ -37585 -5086 6917 28159 33798 7621 2115 24474 38889 16372 -1007 -13416 -56823
14852e6823J3251m197L432l783K7359R795k56k7390R516j412j6843Q888O599K6793
$$ -56823 -43572 -47769 -44337 -48120 -20761 -10966 -11222 -38612 -29096 -30508 -47351 -38463 -31864 -5071
14838e071M4367j0047k1972k4976k8399j1827J5374K036m91L4792m201r886J6974
$$ -5071 39296 29249 7277 -17699 -46098 -57925 -42551 -40515 -41006 -6214 -10415 -20301 -3327
14825c327P731K5258l4953k9819O848J7772j658P467k1490o018Q138j3233j1078
$$ -3327 4404 29662 -5291 -35110 -28262 -10490 -12148 -4681 -26171 -32189 -24051 -37284 -48362
14812d8362O97j6001r318J7940K8352Q901n202j574L168j6381K1783q156O860
$$ -48362 -47665 -63666 -72984 -55044 -26692 -17791 -22993 -24567 -21399 -37780 -15997 -24153 -17293
14799a7293M608O504q237J6090J218j9225K223r115N403K3633m703m2766p079
$$ -17293 -12685 -6181 -14418 1672 2890 -16335 -14112 -23227 -17824 5809 1106 -41660 -48739
14786d8739J1868J4215J9149p072j1996P165L5172J8785k580Q930q812k3323M139
$$ -48739 -36871 -22656 -3507 -10579 -22575 -15410 19762 38547 35967 44897 36085 12762 16901
14773A6901l159l483N659k5492j7596j4154p925J5174P254J1385Q853l2474p24
$$ 16901 13742 10259 15918 -9574 -27170 -41324 -49249 -34075 -26821 -15436 -6583 -39057 -39781
14760c9781r77J0292N606K9027k6551O678k700p878j1255k8706J928J5381K3838
$$ -39781 -40758 -30466 -24860 4167 -22384 -15706 -18406 -26284 -37539 -66245 -64317 -48936 -25098
14747b5098J7639j0505K988L3438N590J0586n57m7881j3187J6660J1871j5612
$$ -25098 -7459 -17964 -14976 18462 24052 34638 34081 -13800 -26987 -10327 1544 -14068
14735a4068J3245J4832O828j4620J1377r529j9214r754L1576j0950r774P058j7791
$$ -14068 -823 14009 20837 6217 17594 8065 -11149 -20903 10673 -277 -10051 -2993 -20784
14722b0784j1377K0300P623P33L640Q221M10m593J4905j9783J4578J6130k2737
$$ -20784 -32161 -11861 -4238 -3505 135 8356 8766 4173 19078 -705 13873 30003 7266
14709G266o881r854J4376o582q949j2203K0741J6717k2563j1448J0801J8895k744
$$ 7266 385 -9469 4907 -1675 -10624 -22827 -2086 14631 -7932 -19380 -8579 10316 7572
14696G572j1376K9813r577j3121L718Q009o695j8710j0112L353J7681J0094K757
$$ 7572 -3804 26009 16432 3311 7029 15038 8343 -10367 -20479 -17126 555 10649 13406
14683A3406j1423j2177j8525N204J6883j0372J5968R198k4330o265Q072J5956
$$ 13406 1983 -10194 -28719 -23515 -6632 -17004 -1036 8162 -16168 -22433 -14361 1595
14671A595K0966o631J1389L1733n548N463j4303k0955m5794j0582j658L835K4787
$$ 1595 22561 15930 27319 59052 53504 58967 44664 23709 -22085 -32667 -34325 -30490 -5703
14658e703N005l166O584o557k3199j3797K2976J2763N382J5556J1401m828K3762
$$ -5703 -698 -3864 2720 -3837 -27036 -40833 -17857 -5094 288 15844 27245 22417 46179
14645D6179N153n748j5035k3004J5931n85j3497K0305j1183j4073k1014j0231
$$ 46179 51332 45584 30549 7545 23476 22891 9394 29699 18516 4443 -16571 -26802
14633b6802l07K1686K2149J4267k976l5438j2205q29j8844J0423K0957k918J9080
$$ -26802 -27109 -5423 16726 30993 28017 -7421 -19626 -20455 -39299 -28876 -7919 -10837 8243
14620H243K056O02j3115j4902J943k8253j5640J7005K1098k610j703K1132j7941
$$ 8243 10299 10901 -2214 -17116 -15173 -43426 -59066 -42061 -20963 -23573 -25276 -4144 -22085
14607b2085r015J8457Q568j8331k9632Q537L1913J1122j2578Q482k720Q956R778
$$ -22085 -31100 -12643 -4075 -22406 -52038 -43501 -11588 -466 -13044 -4562 -7282 1674 11452
14594A1452J6708l045j8956j1837R449m1653k0600j3442N767K7854P585j7664
$$ 11452 28160 25115 6159 -5678 3771 -37882 -58482 -71924 -66157 -38303 -30718 -48382
14582d8382J0467L0471J3925j2361k5255J8330J5835n307J3602O560j4474q863
$$ -48382 -37915 -7444 6481 -5880 -31135 -12805 3030 -2277 11325 17885 3411 -5452
14570e452J7226j83L836q505j0395j1787o377L0339L9601k0543j6872j2600Q155
$$ -5452 11774 11591 15427 6922 -3473 -15260 -21637 8702 48303 27760 10888 -1712 6443
14557F443j1173n907k530Q337J4899O804p224r655j4192j0644J3976l332Q257
$$ 6443 -4730 -10637 -13167 -4830 10069 16873 9649 -6 -14198 -24842 -10866 -14198 -5941
14544e941j0182k449l818m200K9190N159j254O556J2238j2580R327J3783L5306
$$ -5941 -16123 -18572 -22390 -26590 2600 7759 6505 13061 25299 12719 22046 35829 71135
14531G1135J1090K562j1150j1994o024m0899k8329P528q068J5237J8765K799O476
$$ 71135 82225 84787 73637 61643 55619 14720 -13609 -6081 -14149 1088 19853 22652 29128
14518B9128r496K0800J0681l0876r158K573m988O343j2498j5947j5237n996J6017
$$ 29128 19632 40432 51113 20237 11079 13652 8664 15007 2509 -13438 -28675 -34671 -18654
14505a8654M6542l644k5277J5266j2435L060K0925R69n923P000q992K3395J8937
$$ -18654 27888 24244 -1033 14233 1798 4858 25783 26752 20829 27829 18837 42232 61169
14492F1169k0836l0051l7161p870O019L239k0739r055J3869K8146K1943K305J48
$$ 61169 40333 10282 -26879 -34749 -28730 -25491 -46230 -55285 -41416 -13270 8673 10978 11126
14479A1126J857k1890k7391M472J4827J0516L711L943l0595j4480J1963m572O632
$$ 11126 12983 -8907 -36298 -31826 -16999 -6483 -2772 1171 -29424 -43904 -31941 -36513 -29881
14466b9881J2019l187j1120j0943K5418K8401J7621j4515j3370R932k993l9588
$$ -29881 -17862 -21049 -32169 -43112 -17694 10707 28328 13813 443 10375 7382 -32206
14454c2206r20j46J7545K1363K2898K8836O036n3285l6557P587m179l714L8488
$$ -32206 -33126 -33272 -15727 5636 28534 57370 63406 10121 -26436 -18849 -23028 -26742 11746
14441A1746K1242j686J9450Q261k8519j6201o271q400j1098q377o614j2114L63
$$ 11746 32988 31302 50752 59013 30494 14293 8022 -378 -11476 -19853 -26467 -38581 -38218
14428c8218J2971J9273j2056k4627l019K5756K5456k1592k9702o129L4348k0985
$$ -38218 -25247 -5974 -18030 -42657 -45676 -19920 5536 -16056 -45758 -51887 -17539 -38524
14416c8524l424m631L1615L2297L391R24R209N039k1440l1877p624j3781k6943
$$ -38524 -41948 -46579 -14964 17333 20724 21648 30857 35896 14456 -17421 -25045 -38826 -65769
14403f5769l852K3398K311M1487J9096K4991j8377m6399l3160J6274L9915M0550
$$ -65769 -69621 -46223 -43912 -2425 16671 41662 23285 -23114 -56274 -40000 -85 40465
14391D0465l660k3281J3160Q176l0769k721N668K5689M064j6883r122k0740j4085
$$ 40465 36805 13524 26684 34860 4091 1370 7038 32727 36791 19908 10786 -9954 -24039
14378b4039K5596j2340j6268J135N692L8838l911N336J6862J009R608k6933j6000
$$ -24039 1557 -10783 -27051 -25916 -20224 18614 14703 20039 36901 37910 47518 20585 4585
14365D585k795k0958n27l842j6216p745R257k211j7963P422L6787L6007P039k1008
$$ 4585 1790 -19168 -19695 -23537 -39753 -47498 -38241 -40452 -58415 -50993 -14206 21801 28840 7832
14351G832o386K2812p458o607j7511p046N511J0276m615j2853P665L4262K4216
$$ 7832 1446 24258 16800 10193 -7318 -14364 -8853 1423 -3192 -16045 -8380 25882 50098
14338E0098j6598k591j4792l6318j9298l390j0984j6451K7210K7873l507J2941
$$ 50098 33500 30909 16117 -20201 -39499 -42889 -53873 -70324 -43114 -15241 -18748 -5807
14326e807P624R246M85k6766R56j6504M727r655k890j5442J9465J3350N94J6192
$$ -5807 1817 11063 11548 -15218 -14262 -30766 -26039 -35694 -38584 -54026 -34561 -21211 -20617 -4425
14312d425L886j839J2115R052K3036m838p210p001J6207l3314o214j720j3405
$$ -4425 -539 -2378 9737 18789 41825 36987 29777 22776 38983 5669 -545 -2265 -15670
14299a5670j9859P182R446j0773L0406J2847j0497k9055K44K23o792J1026J0016
$$ -15670 -35529 -28347 -18901 -29674 732 13579 3082 -25973 -25729 -25506 -32298 -21272 -11256
14286a1256j3975j9269n129N08J1621J9471J7047J5687K7358K262m041R474j9397
$$ -11256 -25231 -44500 -49629 -49121 -37500 -18029 -982 14705 42063 44325 40284 49758 30361
14273C0361j2678n676J1541R627l1109J7985k097p614K665M490r052k5605J5701
$$ 30361 17683 12007 23548 33175 2066 20051 17954 10340 13005 17495 8443 -17162 -1461
14260a461L543j2651L038K1366l2407j0448L5902J2680J0553q376k6660K3029
$$ -1461 2082 -10569 -7531 13835 -18572 -29020 6882 19562 30115 21739 -4921 18108
14248A8108K8531R068j4476j2205Q11j428k0892j4246L629J1475k1324m629J0362
$$ 18108 46639 55707 41231 29026 29837 28409 7517 -6729 -3100 8375 -12949 -17578 -7216
14235g216J2436J251k9237k0398L202K3439J434q273j7636L954j2328K2393J9481
$$ -7216 5220 6471 -22766 -43164 -39962 -16523 -15089 -23362 -40998 -37044 -49372 -26979 -7498
14222g498j8912k8110J1618J5370p010J0145j4225M087K3331L970q399j370k1042
$$ -7498 -26410 -54520 -42902 -27532 -34542 -24397 -38622 -34535 -11204 -7234 -15633 -17003 -38045
14209c8045l551K3609L4246j7383J715J1851j40j3616l6109r236K0151L3716j3099
$$ -38045 -41596 -17987 16259 -1124 591 12442 12302 -1314 -37423 -46659 -26508 7208 -5891
14196e891J2777N357j3725j7735O118m214o330J4591J6833k591j482N291k2343
$$ -5891 6886 12243 -1482 -19217 -13099 -17313 -23643 -9052 7781 5190 3708 8999 -13344
14183a3344J9744m761l27J7763j1258j4318J6640J3984l3017J5180M262N947p886
$$ -13344 6400 1639 1312 19075 7817 -6501 10139 24123 -8894 6286 10548 16495 8609
14170H609M416N077K5228J1016q267O88j9395r076N19k2184N291M9725L510j5269
$$ 8609 13025 18102 43330 54346 46079 46767 27372 18296 18815 -3369 1922 51647 55157 39888
14156C9888k7229k4984j5815p87K0890J0677j781j3216j8606O344o773L7129P741
$$ 39888 12659 -12325 -28140 -28927 -8037 2640 859 -12357 -30963 -24619 -31392 5737 13478
14143A3478j5711r70m046l910M0435R090r441k1146k067K8823L12l6896j461J6620
$$ 13478 -2233 -3203 -7249 -11159 29276 38366 28925 7779 5712 34535 34847 -2049 -3510 13110
14129A3110m069k7140k8106J3635M8028J9356k454r2L113J741j3027M063J0710
$$ 13110 9041 -18099 -46205 -32570 15458 34814 32360 32268 35381 37122 24095 28158 38868
14116C8868j8401k1355J1227j0133o599J8311q125J2625J049N407L0166n679j6451
$$ 38868 20467 -888 10339 206 -6393 11918 3793 16418 17467 22874 53040 47361 30910
14103C0910k7508K4911J0706J9165j1104l3179r413J0895J2067j2579k5416N366
$$ 30910 3402 28313 39019 58184 47080 13901 4488 15383 27450 14871 -10545 -5179
14091e179j8296k269N396J7302J5145J7795J0517Q229Q822j3957J2334O366k8592
$$ -5179 -23475 -25744 -20348 -3046 12099 29894 40411 48640 57462 43505 55839 62205 33613
14078C3613j2183l656n087l0834o840J5180J9880k8654j4872K806K7491n156p937
$$ 33613 21430 17774 12687 -18147 -24987 -9807 10073 -18581 -33453 -30647 -3156 -8312 -16249
14065a6249j6119o838k1922p065J6579K4739k6663j8039K7069J3713J8282K0311
$$ -16249 -32368 -39206 -61128 -68193 -51614 -26875 -53538 -71577 -44508 -30795 -12513 7798
14053G798o731j6948j7574j6772K3489K3105l675l70r333k7326k1117J5862J7526
$$ 7798 1067 -15881 -33455 -50227 -26738 -3633 -7308 -7678 -17011 -44337 -65454 -49592 -32066
14040c2066J4966J6835j2290l0256J0285L7199L665K524m679j6553K624O991l7697
$$ -32066 -17100 -265 -12555 -42811 -32526 4673 8338 10862 6183 -10370 -7746 -755 -38452
14027c8452m2652J4193P954j9863l912L3086K8802l880m475N464J5093J9183L0668
$$ -38452 -81104 -66911 -58957 -78820 -82732 -49646 -20844 -24724 -29199 -23735 -8642 10541 41209
14014D1209J8525k048j4942J8741j2265n19j2223j5964j7950k4287j2501J6158
$$ 41209 59734 57686 42744 61485 49220 48701 36478 20514 2564 -21723 -34224 -18066
14002a8066k359J551N144J9624p20l3473j7456J3888K8737R550k7818J5572J1661
$$ -18066 -20425 -18874 -13730 5894 5174 -28299 -45755 -31867 -3130 6420 -21398 -5826 5835
13989E835M200J9030p214k6963r851L853Q257J5153N818k4701j9926q92L2906
$$ 5835 10035 29065 21851 -5112 -14963 -11110 -2853 12300 18118 -6583 -26509 -27401 5505
13976E505J8782j2479l0263k3004k0370J2865M7700j216j6015P133J0797k1925
$$ 5505 24287 11808 -18455 -41459 -61829 -48964 -1264 -2480 -18495 -11362 -565 -22490
13964b2490n444K6693M6918k206M66l4015j2742j5588K2277L026M544j5241j1217
$$ -22490 -27934 -1241 45677 43471 43937 9922 -2820 -18408 3869 6895 11439 -3802 -15019
13951a5019J9078n441j0189M137r572q101j9685N031K9864K2419j9210q265P268
$$ -15019 4059 -1382 -11571 -7434 -17006 -25107 -44792 -39761 -9897 12522 -6688 -14953 -7685
13938g685P760k451L953p912J406J8364J1417m903l6446r885J4089J5883K59k1920
$$ -7685 75 -2376 1577 -6335 -4929 13435 24852 19949 -16497 -26382 -12293 3590 3849 -18071
13924a8071k388J5211n041K051l2185J1401k333j640J9935K3365K4286j5974j6852
$$ -18071 -20459 -5248 -10289 -8238 -40423 -29022 -31355 -32995 -13060 10305 34591 18617 1765
13911A765N5727K0001j6032J711k377l5603k3018q675K5406K1398K6126j7646
$$ 1765 57492 77493 61461 63172 60795 25192 2174 -6501 18905 40303 66429 48783
13899D8783k9279j2505k8919p139K3202j8553J1676J1518K3232J4667j2014k8128
$$ 48783 19504 6999 -21920 -29059 -5857 -24410 -12734 -1216 22016 36683 24669 -3459
13887c459k2410j19K4583l6141k6739M1705K3502J4102p330m1420J0905J2284
$$ -3459 -25869 -25988 -1405 -37546 -64285 -22580 922 15024 7694 -33726 -22821 -10537
13875a0537j9833J2695K4641J6572J5621p038q130k3471k1214q322L3276O164
$$ -10537 -30370 -17675 6966 23538 39159 32121 23991 520 -20694 -29016 4260 10424
13863A0424k7469J9313J6035o718j5988L647K6492J0782j3441P516o394j1252
$$ 10424 -17045 2268 18303 11585 -4403 -756 25736 36518 23077 30593 24199 12947
13851A2947j0246J8377p253n21j5279j1417j1225L25j5296j4963M670K5058J2031
$$ 12947 2701 21078 13825 13304 -1975 -13392 -24617 -24292 -39588 -54551 -49881 -24823 -12792
13838a2792p442J6008J2270k1503k0932p596R942j9689J6035L5832R380k8716
$$ -12792 -20234 -4226 8044 -13459 -34391 -41987 -32045 -51734 -35699 133 9513 -19203
13826a9203k8773m15J9241O201J07P018j7836k2605K3433J8027K4024L1477Q525
$$ -19203 -47976 -48391 -29150 -22949 -22842 -15824 -33660 -56265 -32832 -14805 9219 40696 49221
13813D9221j0046J7669k9864m3725k5842J3507R259M3060J4570j7202k6182J3802
$$ 49221 39175 56844 26980 -16745 -42587 -29080 -19821 23239 37809 20607 -5575 8227
13801H227K2475J3292l2685K715j2009J1447j5849k0058m0507j9921P631M1032
$$ 8227 30702 43994 11309 14024 2015 13462 -2387 -22445 -62952 -82873 -75242 -34210
13789c4210J8834r168j1777J3972K1131m193M769n919r427J4295K7434J795j7256
$$ -34210 -15376 -24544 -36321 -22349 -1218 -5411 -642 -6561 -15988 -1693 25741 27536 10280
13776A0280k312K0096n91J5665p742j0751P269K4311k2205k9447j0300O279L550
$$ 10280 7968 28064 27473 43138 35396 24645 31914 56225 34020 4573 -5727 552 4102
13763D102j98j9137k0231p370N15j3862q930K4900J3943L5416l811r633n615K2599
$$ 4102 3904 -15233 -35464 -42834 -42319 -56181 -65111 -40211 -26268 9148 5337 -4296 -9911 12688
13749A2688K2662j8239o467J4869j3677k2260R124J3373O153l06o114K994J453
$$ 12688 35350 17111 10644 25513 11836 -10424 -1300 12073 18226 17920 11806 14800 16253
13736A6253r868k5628j3908J2747L734j1723o460J8663J7702J4005r217P65j1522
$$ 16253 6385 -19243 -33151 -20404 -16670 -28393 -34853 -16190 1512 15517 6300 7065 -4457
13723d457K6213j514K206o042l1286j8070q503P66N510L4312J3111r885Q367N079
$$ -4457 21756 20242 22448 16406 -14880 -32950 -41453 -40687 -35177 -865 12246 2361 10728 15807
13709A5807j367o050j8617j0579L293j0087r148M907J3501L535J0199j306q03
$$ 15807 14440 8390 -10227 -20806 -17513 -27600 -36748 -31841 -18340 -14805 -4606 -5912 -6715
13696f715K7159k027J3393l0886m3274k380K6044q944l138M1242o265l9927l141
$$ -6715 20444 18417 31810 924 -42350 -44730 -18686 -27630 -30768 10474 4209 -35718 -38859
13683c8859J8670J8537K1441j2175k9877J3957J4078k2022j301K9949M3515k3336
$$ -38859 -20189 -1652 19789 7614 -22263 -8306 5772 -16250 -17551 12398 55913 32577
13671C2577k9591j2130L2605K3475O535j5783m5415n160J2820o933r224J1794
$$ 32577 2986 -9144 23461 46936 53471 37688 -7727 -12887 -67 -7000 -16224 -4430
13659d430Q939J5356k6154M33K9089O962J586P010k003J4867P809l5042L5451
$$ -4430 4509 19865 -6289 -5856 23233 30195 31781 38791 36788 51655 59464 24422 59873
13646E9873n511k8236J754J8103p828j7692Q070K2959j5351o652l407J0681J1792
$$ 59873 54362 26126 27880 45983 38155 20463 28533 51492 36141 29489 26082 36763 48555
13633D8555o857J1525K6746n510l6120k9344j8559j0407p759j1227K5757J671
$$ 48555 41698 53223 79969 74459 38339 8995 -9564 -19971 -27730 -38957 -13200 -11529
13621a1529l087Q484J2974J0130l0341n819K0232p456J24K2745j8732k5528j3268
$$ -11529 -14616 -6132 6842 16972 -13369 -19188 1044 -6412 -6288 16457 -2275 -27803 -41071
13608d1071Q187J2362K5199J6334N581J753j8908k0669j1319J672Q017K9372K748
$$ -41071 -32884 -20522 4677 21011 26592 28345 9437 -11232 -22551 -20879 -12862 16510 19258
13595A9258M446n037j3598j7259N846K2297j051m4173j5738M830J8171P349l002
$$ 19258 23704 18667 5069 -12190 -6344 15953 14902 -29271 -45009 -40179 -22008 -14659 -17661
13582a7661j5469J3303K2616K3846q562k4268k627j7801o403J4194J5414M405
$$ -17661 -33130 -19827 2789 26635 18073 -6195 -8822 -26623 -33026 -18832 -3418 987
13570I87l7591J4551K197J4946PN410k47n696j8131l46K4528K3603J2472j4631
$$ 987 -36604 -22053 -19856 -4910 -4903 507 260 -5436 -23567 -23913 615 24218 36690 22059
13556B2059r628j9429j2826J6434L5007p40J5710m452m5938k738J110J428L864
$$ 22059 12431 -6998 -19824 -3390 31617 30877 46587 42135 -3803 -6541 -5431 -4003 -139
13543a39j5386o678J1313N113O911q963J9965J1851k4624k248J7712j4220k3877
$$ -139 -15525 -22203 -10890 -5777 1134 -7829 12136 23987 -637 -2885 14827 607 -23270
13530b3270o336j8264q717q703k674L3450K5398j0941j1092Q900L5991M0352J9056
$$ -23270 -29606 -47870 -56587 -65290 -67964 -34514 -9116 -20057 -31149 -22249 13742 54094 73150
13517G3150L43k0936m1848k8252K9096J291k4275j3074K6387Q729k004j5865J456
$$ 73150 73493 52557 10709 -17543 11553 12844 -11431 -24505 1882 10611 8607 -7258 -5802
13504e802K1137K2138o915q309l4080j3367P882J9126o170l660K1451K092j2528
$$ -5802 15335 37473 30558 22249 -11831 -25198 -17316 1810 -4360 -8020 13431 15523 2995
13491B995K2792J0461j2977n820j0897K786k290J0409J3429K964o559J1788J4238
$$ 2995 25787 36248 23271 17451 6554 9340 7050 17459 30888 33852 27293 39081 53319
13478E3319j7334l9078l0530j9791q262K232j085P783J9709K1329k4722K9653
$$ 53319 35985 -3093 -33623 -53414 -61676 -59444 -60529 -52746 -33037 -11708 -36430 -6777
13466f777K2850j7518j1113j99K0597n592k9034l361j1797J771J4308Q539L5720
$$ -6777 16073 -1445 -12558 -12757 7840 2248 -26786 -30147 -41944 -40173 -25865 -17326 18394
13453A8394j4282j0610j1023K4857P248L379K0571j5638k8036k1276j4354o647
$$ 18394 4112 -6498 -17521 7336 14584 17963 38534 22896 -5140 -26416 -40770 -47417
13441d7417J1054j39R802M1130J6599j6355r772K264j4648j8182j0145J4639K2875
$$ -47417 -36363 -36502 -26700 14430 31029 14674 4902 7166 -7482 -25664 -35809 -21170 1705
13428A705J9183L322j5175k2351R424r517j5741j1494j963K3104L9011M359k901
$$ 1705 20888 24210 9035 -13316 -3892 -13409 -29150 -40644 -42607 -19503 19508 23867 20966
13415B0966R92j6045o690m451K78Q651j220R762j2857O457j0745J6349j78j4835
$$ 20966 21958 5913 -777 -5228 -4950 3701 2481 12243 -614 5843 -4902 11447 11269 -3566
13401c566j0590p75k2784k1581J8121K4746k090j1539K9657J2390L710J1481R999
$$ -3566 -14156 -14931 -37715 -59296 -41175 -16429 -18519 -30058 -401 11989 15699 27180 37179
13388C7179j4402k0502k1080k6955k1005L0252J2586l0419j0438M4370K0040K4338
$$ 37179 22777 2275 -18805 -45760 -66765 -36513 -23927 -54346 -64784 -20414 -374 23964
13376B3964l976J2585R439n287k8514k8257J3332P59m913l3403l3291K797L1911
$$ 23964 19988 32573 42012 36725 8211 -20046 -6714 -5955 -10868 -44271 -77562 -74765 -42854
13363d2854J8938M74L3691K6199m895j4995M481J6708l2866k0662j2848J2870
$$ -42854 -23916 -23442 10249 36448 31553 16558 21039 37747 4881 -15781 -28629 -15759
13351a5759K1934j3589J0384o841J328k1887j8954J7708K5164m3953k3643J7078
$$ -15759 6175 -7414 2970 -3871 -2543 -24430 -43384 -25676 -512 -44465 -68108 -51030
13339e1030J5113K8693J4450j4622r797K0139K6707l572k1492l352j007j7152
$$ -51030 -35917 -7224 7226 -7396 -17193 2946 29653 26081 4589 1237 230 -16922
13327a6922o188J5627K319r242j6859J6846K6051j2858k7926O828P151k0150n016
$$ -16922 -23110 -7483 -5164 -14406 -31265 -14419 11632 -1226 -29152 -22324 -15173 -35323 -40339
13314d0339J9428k648J0399p963K209m106J7054n102J4548p610j1879p461k1799
$$ -40339 -20911 -23559 -13160 -21123 -18914 -23020 -5966 -11068 3480 -4130 -16009 -23470 -45269
13301d5269j312K1139L3067o13k892p19l118J1141j6046n255L406k285k197J5271
$$ -45269 -46581 -25442 7625 7012 4120 3401 283 11424 -4622 -9877 -6471 -8756 -10953 4318
13287D318m81l2912r64J0798J9221l85Q671j333k212j5894n944q22L240N861r591
$$ 4318 3837 -29075 -30039 -19241 -20 -405 8266 6933 4721 -11173 -17117 -17939 -14699 -8838 -18429
13272a8429M4988J7143l0567k623j1868l1296j725K4022J5350M428j5080J3560
$$ -18429 26559 43702 13135 10512 -1356 -32652 -34377 -10355 4995 9423 -5657 7903
13260G903K5911k0325k412j2079j0202K2574J5361o515j6687j204K3819l9404
$$ 7903 33814 13489 11077 -1002 -11204 11370 26731 20216 3529 2325 26144 -13260
13248a3260K0622L0964J485j4297r871k4388M999P257k603r64K4838o915k360
$$ -13260 7362 38326 39811 25514 15643 -8745 -3746 3511 908 -56 24782 17867 15507
13235A5507l0558j4732J3995L6210J1426k992o554k0670j5615O648O539K3056
$$ 15507 -15051 -29783 -15788 20422 31848 28856 22302 1632 -13983 -7335 -796 22260
13223B2260j9331l8038K1866N6803L2943j2729j5739j7835j9776k7719P032j948
$$ 22260 2929 -35109 -13243 43560 76503 63774 48035 30200 10424 -17295 -10263 -12211
13211a2211J3258j9346M549L6745M815j6218j7505p468n150l3436k365J4630J801
$$ -12211 1047 -18299 -13750 22995 27810 11592 -5913 -13381 -18531 -51967 -54332 -39702 -37901
13198c7901K769J0896n201O176k0824j2801Q063J8500K4879P428j4076P210K3597
$$ -37901 -35132 -24236 -29437 -23261 -44085 -56886 -48823 -30323 -5444 1984 -12092 -4882 18715
13185A8715R443Q163r969J757l6132l5566q156K1453L265R787J2921J679Q330
$$ 18715 28158 36321 26352 28109 -8023 -43589 -51745 -30292 -27027 -17240 -4319 -2640 5690
13172E690k275j8520J5577J4056J2209k3792k0325k383%J4085p543j2522J4826
$$ 5690 3415 -15105 472 14528 26737 2945 -17380 -19763 -19763 -5678 -13221 -25743 -10917
13159a0917J3256P228q669k302L722k214Q676j5107j934O299J1549J28O133L5574
$$ -10917 2339 9567 898 -1404 2318 104 8780 -6327 -8261 -1962 9587 9715 15848 51422
13145E1422p870k8177l7564k418R863J2956N726m07l3199k924Q861L362J1365
$$ 51422 43552 15375 -22189 -24607 -14744 -1788 3938 3531 -29668 -32592 -23731 -20369 -9004
13132i004k1779n536R04r565N408K8687Q92N922j8672k7899J369K2960J7635K0531
$$ -9004 -30783 -36319 -35415 -44980 -39572 -10885 -9993 -4071 -22743 -50642 -49273 -26313 -8678 11853
13118A1853Q007j1218k5314J9155K1519j67p064j7469k0479j2971j030k1J4843
$$ 11853 19860 8642 -16672 2483 24002 23835 16771 -698 -21177 -34148 -35178 -35199 -20356
13105b0356J8023R392m625R777j1668J4996j5870m668J145J485P059J0710k8249
$$ -20356 -2333 7059 2434 12211 543 15539 -331 -4999 -3854 -2369 4690 15400 -12849
13092a2849j7136N832L062J3760j2714m324K7456j4874J821j6984l807j991O061
$$ -12849 -29985 -24153 -21091 -7331 -20045 -24369 3087 -11787 -9966 -26950 -30757 -32748 -26687
13079b6687J5934P779J5585k590q914r74k183J603j942J2347J9684J5954l3157
$$ -26687 -10753 -2974 12611 10021 1107 133 -2050 -447 -2389 9958 29642 45596 12439
13066A2439l7109J3369L7220p545P480R007K2047j6743j2902l456k1383j7102
$$ 12439 -24670 -11301 25919 18374 25854 34861 56908 40165 27263 23807 2424 -14678
13054a4678p137j7502j0301K4348O720q305j1369J059J7474j4092O828J6036K2133
$$ -14678 -21815 -39317 -49618 -25270 -18550 -26855 -38224 -37165 -19691 -33783 -26955 -10919 11214
13041A1214O324J8733p973l1117o585K9438K0855l2291k788r975j0391K3614M385
$$ 11214 17538 36271 28298 -2819 -9404 20034 40889 8598 5810 -4165 -14556 9058 13443
13028A3443K539K2210J4426l3199n2616q695J5056K0354m183j092K40j0264K5632
$$ 13443 15982 38192 52618 19419 -33197 -41892 -26836 -6482 -10665 -11757 -11517 -21781 3851
13015C851J2837l634l5828k8582j0284k812o630L1726M6154K6857J9666K580k7873
$$ 3851 16688 13054 -22774 -51356 -61640 -64452 -71082 -39356 6798 33655 53321 55901 28028
13002B8028m7212k0937k994k006J5318J3868J4219j1364q00P312o494m819K1175
$$ 28028 -19184 -40121 -43115 -45121 -29803 -15935 -1716 -13080 -13880 -6568 -13062 -17881 3294
12989C294J0737j9408l1347k3813j189J9433K4870O222k2054k552j0314R786K6683
$$ 3294 14031 -5377 -36724 -60537 -61726 -42293 -17423 -11201 -33255 -35807 -46121 -36335 -9652
12976i652m224J8163K557L51l4785J1101K2649l741l1907J4601O77j7266j6191
$$ -9652 -13876 4287 6844 7195 -27590 -16489 6160 2419 -29488 -14887 -14210 -31476 -47667
12963d7667K316o570J0878j764K7509J2033k1091J5866M2818j4595k0237k222
$$ -47667 -45351 -51921 -41043 -42807 -15298 -3265 -24356 -8490 34328 19733 -504 -2726
12951b726j2879N025M201l5551M412K2671N658N12r864L1212n755N185j6480P752
$$ -2726 -15605 -10580 -6379 -41930 -37518 -14847 -9189 -8677 -18541 12671 6916 12101 -4379 3373
12937C373j3496j3922J9759N8252K907j9604q262m658j5726j5533L949J7308j625
$$ 3373 -10123 -24045 -4286 53966 56873 37269 29007 24349 8623 -6910 -2961 14347 12722
12924A2722K882P663J1625K769j465o861j8620j405L102k8938J6918J5145m663
$$ 12722 15604 23267 34892 37661 36196 29335 10715 9310 12412 -16526 392 15537 10874
12911A0874K3713L2205k9280l5697k4895m518k3408q657P582J3353l870K4084
$$ 10874 34587 66792 37512 1815 -23080 -27598 -51006 -59663 -52081 -38728 -42598 -18514
12899a8514J9552q3j3760k9962n129L1383L4135j9117N949r468L281N448P794
$$ -18514 1038 955 -12805 -42767 -47896 -16513 17622 -1495 4454 -5014 -1733 3715 11509
12886A1509k0897j6055K5688L3974K9586k0453m3637m4551j1342L7553L1917J8247
$$ 11509 -9388 -25443 245 34219 63805 43352 -285 -44836 -56178 -18625 13292 31539
12874C1539p762j3360k7434l3252M773L043J0946K535L376K3059K1595P660K967
$$ 31539 23777 10417 -17017 -50269 -45496 -42453 -31507 -28972 -25596 -2537 19058 26718 29685
12861B9685k2686J0073q882j9768J0283L7845J6137P689j6467j5050k2254j0949
$$ 29685 6999 17072 8190 -11578 -1295 36550 52687 60376 43909 28859 6605 -4344
12849d344J554L0213K1043n011k4596J7243o696j2687m826J6894k390l1169r767
$$ -4344 -2790 27423 48466 43455 18859 36102 29406 16719 11893 28787 26397 -4772 -14539
12836a4539R770K1750j2669P964l32j2148m1051n608j5774p51J7213j283k163
$$ -14539 -4769 16981 4312 12276 11944 -204 -41255 -46863 -62637 -63388 -46175 -47458 -49621
12823d9621J1789r392K2994Q907L956K6493K2327M975K8227k9925l9147P447r933
$$ -49621 -37832 -47224 -24230 -15323 -11367 15126 37453 42428 70655 40730 1583 9030 -903
12810i03l207R008l0212j9651K400j2350k1651L7759j115J4462K0854Q120o332
$$ -903 -4110 4898 -25314 -44965 -42565 -54915 -76566 -38807 -39922 -25460 -4606 3514 -2818
12797b818p708N62j8879K979J5036J860j6322M490K5137K064j2653n937K9452
$$ -2818 -10526 -9964 -28843 -25864 -10828 -8968 -25290 -20800 4337 6401 -6252 -12189 17263
12784A7263J4973j3231p634j9781J0324J8132O118p089j8625q534J2423j553K0025
$$ 17263 32236 19005 11371 -8410 1914 20046 26164 19075 450 -8084 4339 2786 22811
12771B2811J3744M62q140q256j114J5832M476j7869K896l4926j5627J191q052
$$ 22811 36555 37017 28877 20621 19507 35339 39815 21946 24842 -10084 -25711 -24520 -32572
12758c2572K4064J4828J7389N644J9539q535k5640p324j341q277n846L17P977
$$ -32572 -8508 6320 23709 29353 48892 40357 14717 7393 6052 -2225 -8071 -7754 223
12745B23Q332M894N226k0851j0487K751L2541j0374j6223j1302L639j6540k1586
$$ 223 8555 13449 18675 -2176 -12663 -9912 22629 12255 -3968 -15270 -11631 -28171 -49757
12732d9757K8118m498k2362J864L5853M221m372O978L782K0914K2691K8202k4345
$$ -49757 -21639 -26137 -48499 -46635 -10782 -6561 -10933 -3955 -173 20741 43432 71634 47289
12719D7289j4791M772k9110j6933k204O7j4768P797j7165R67K937K7913K7685
$$ 47289 32498 37270 8160 -8773 -10977 -10910 -25678 -17881 -35046 -34079 -31142 -3229 24456
12706B4456k3435N800j046m615j7508q038m415K8086j2823m171J599j6303j6046
$$ 24456 1021 6821 5775 1160 -16348 -24386 -28801 -715 -13538 -17709 -16110 -32413 -48459
12693d8459K2454K2716k063K918J6862k2798j4292j2898Q067K6910Q949M917k9398
$$ -48459 -26005 -3289 -5352 -2434 14428 -8370 -22662 -35560 -27493 -583 8366 13283 -16115
12680a6115n112p244q663L1556L2940l183k0590m328J1275j001J1559O053k6189
$$ -16115 -21227 -28471 -37134 -5578 27362 24179 3589 -739 10536 9535 21094 27147 958
12667I58J8549L5430P216j3929j6731j6658L042N601j8731l867J3926j100q8k288
$$ 958 19507 54937 62153 48224 31493 14835 17877 23478 4747 880 14806 13706 13618 11330
12653A1330Q049J758J201q921J6976k707p474q551J731J5989J8142l0225k8265
$$ 11330 19379 21137 22338 13417 30393 27686 20212 11661 13392 29381 47523 17298 -10967
12640a0967J1591L126j1486P188m744J4121j1k2180n879O824M497L4486O011k5423
$$ -10967 624 3750 -7736 -548 -5292 8829 8818 -13362 -19241 -12417 -7920 26566 32577 7154
12626G154R765q422k5548j4292j879m081n084J7598k9124j9318p623K8748N6677
$$ 7154 16919 8497 -17051 -31343 -33222 -37303 -42387 -24789 -53913 -73231 -80854 -52106 4571
12613D571J02M273M836J0838L878n718M669J8100j3094k0113j5024j0433L970
$$ 4571 4673 8946 13782 24620 28498 22780 27449 45549 32455 12342 -2682 -13115 -9145
12600i145J257J4994M258q372K0313N503k3718P461J5795l787k0125j6069j5430
$$ -9145 -7888 7106 11364 2992 23305 28808 5090 12551 28346 24559 4434 -11635 -27065
12587b7065P021k8338J3042J4921j7518K098J1266J1606m628K838J1878j1412
$$ -27065 -20044 -48382 -35340 -20419 -37937 -35839 -24573 -12967 -17595 -14757 -2879 -14291
12575a4291j649K0548l445j7234J58K1213M763n275l824r208j5236J4388k0147
$$ -14291 -15940 4608 1163 -16071 -15913 5300 10063 4788 964 -8244 -23480 -9092 -29239
12562b9239K2L2160M559K2323R743n4339l783j0868J1277N708j0407k065l68k789
$$ -29239 -29217 2943 7502 29825 39568 -14771 -18554 -29422 -18145 -12437 -22844 -24909 -25277 -28066
12548b8066R005R91j1940J2213J778k0483j226J5318j1171j3797R554K3279K3516
$$ -28066 -19061 -18070 -30010 -17797 -16019 -36502 -37728 -22410 -33581 -47378 -37824 -14545 8971
12535H971J281j9539K266M512J2602K7139J3544J736l1940J7290m13m2111O864
$$ 8971 10252 -9287 -7021 -2509 10093 37232 50776 52512 20572 37862 37449 -4662 2202
12522B202j4447l229m695P619j723p387p291j1531K9232J2565N865K1605Q845
$$ 2202 -12245 -15474 -20169 -12550 -14273 -21660 -28951 -40482 -11250 1315 7180 28785 37630
12509C7630j5362p541j3460R698p435j826j804L739L428n115K9756J0999k3679
$$ 37630 22268 14727 1267 10965 3530 1704 -100 3639 7067 1952 31708 42707 19028
12496A9028P642J1802l1501j042j5920K353k764J5910k1525J9541K0039l3426
$$ 19028 26670 38472 6971 5929 -9991 -7638 -10402 5508 -16017 3524 23563 -9863
12484i863j9974m261n1622N62M3374N3381j1033j910o212M492j0968J1197K0996
$$ -9863 -29837 -34098 -85720 -85158 -41784 11597 564 -1346 -7558 -3066 -14034 -2837 18159
12471A8159M068l3807O040L4339j2305r124N229k3298J3830k4657r412m428L5806
$$ 18159 22227 -11580 -5540 28799 16494 7370 12599 -10699 3131 -21526 -30938 -35366 440
12458D40J0418L831P382J3793j279m8150J1883J0976J3521l0742k3036j8727m390
$$ 440 10858 14689 22071 35864 34585 -13565 -1682 9294 22815 -7927 -30963 -49690 -54080
12445e4080J9919K9552P269k6141l0894K0838j59K1373P296K5753j1610k685p11
$$ -54080 -34161 -4609 2660 -23481 -54375 -33537 -33696 -12323 -5027 20726 9116 6431 5720
12432E720j8456J9342P151Q821n134k8090J7722K7392k437j9529k5055J6540R967
$$ 5720 -12736 6606 13757 22578 17444 -10646 7076 34468 32031 12502 -12553 3987 13954
12419A3954j1610J6629m067J0532j081o921M123j3796J2574K2127k5412l7940
$$ 13954 2344 18973 14906 25438 24357 17436 21559 7763 20337 42464 17052 -20888
12407b0888N4K2635K4152k1787j2350j3945k586J1084r844L4724O372p44o093
$$ -20888 -20834 1801 25953 4166 -8184 -22129 -24715 -13631 -23475 11249 17621 16877 10784
12394A0784O30j9994m360l54N248k3662J183J7586J121k978j0084m921J9523l388
$$ 10784 11414 -8580 -12940 -13294 -8046 -31708 -30525 -12939 -11818 -14796 -24880 -29801 -10278 -13666
12380a3666q230n483K458J3848q340l269J8347J8659j1570k3218m256K5098J5591
$$ -13666 -21896 -27379 -24921 -11073 -19413 -22682 -4335 14324 2754 -20464 -24720 378 15969
12367A5969p925l1110k7802K2498j60J2861J4987J9483m245k1717J1630J9634
$$ 15969 8044 -23066 -50868 -28370 -28530 -15669 -682 18801 14556 -7161 4469 24103
12355B4103k4180j2540L1428J7618j3694J2533j0685j2015j3293j4573O708l713
$$ 24103 -77 -12617 18811 36429 22735 35268 24583 12568 -725 -15298 -8590 -12303
12343a2303p80l2020j8738J9945J5591L733r300p350J7687M268j3330m631K8131
$$ -12303 -13083 -45103 -63841 -43896 -28305 -24572 -33872 -41222 -23535 -19267 -32597 -37228 -9097
12330i097O462K6190j5302j0884P584k6455P111L0080J3168J8731K1288j2986
$$ -9097 -2635 23555 8253 -2631 4953 -21502 -14391 15689 28857 47588 68876 55890
12318E5890P439n754p043k2952j5943m429j14L705K3047J5235O582J8522l2432
$$ 55890 63329 57575 50532 27580 11637 7208 7094 10799 33846 49081 55663 74185 41753
12305D1753j2403J3620Q715m192l3194j5447j7193k0242J5437J3565J8568K8905
$$ 41753 29350 42970 51685 47493 14299 -1148 -18341 -38583 -23146 -9581 8987 37892
12293C7892k36j3431j9324k1486J2476K0012K0127j6410j0828O374j506k4183
$$ 37892 37656 24225 4901 -16585 -4109 15903 36030 19620 8792 15166 13660 -10523
12281a0523j7624J2611J2837M389j57j6473j6470L698L1052J3038J1983l0221
$$ -10523 -28147 -15536 -2699 1690 1533 -14940 -31410 -27712 3340 16378 28361 -1860
12269a860j541K7430J6424k6986p29K1897J6002k3105J0510K792R19k1569M528
$$ -1860 -3401 24029 40453 13467 12738 34635 50637 27532 38042 40834 41753 20184 24712
12256B4712j1750j2081m966J2872j7898j7746q616J5626J1979R659K010j0603
$$ 24712 12962 881 -4085 8787 -9111 -26857 -35473 -19847 -7868 1791 3801 -6802
12244f802j7371J4533N9874J2612l0953l5015J2438M3733K265k6619j3297n930
$$ -6802 -24173 -9640 50234 62846 31893 -3122 9316 53049 55314 28695 15398 9468
12232I468P309k9771k9396k1460K7607J1365J0186L0051P708J4826M217J5031
$$ 9468 16777 -12994 -42390 -63850 -36243 -24878 -14692 15359 23067 37893 42110 57141
12220E7141R698j2021l28L778k447j2897j0609K439k050l7987K012n122J492J3092
$$ 57141 66839 54818 54490 58268 55821 42924 32315 34754 32704 -5283 -3271 -8393 -6901 6191
12206F191m990R381J0052j1823L15J6715L5641j2965k2454j1376J4527J2506P217
$$ 6191 1201 10582 20634 8811 9126 25841 61482 48517 26063 14687 29214 41720 48937
12193D8937O996P160M351j091K192r797o603J0779J0614L6821R953k7189o213
$$ 48937 55933 63093 67444 66353 68545 58748 52145 62924 73538 110359 120312 93123 86910
12180H6910j0955l3699K6859O2327J9426J051q611m642J6572m672j4818k2865
$$ 86910 75955 42256 69115 131442 150868 151919 143308 138666 155238 150566 135748 112883
12168A12883j5151n12L74q876j2086j1800j0574k7383J9157J1544p723p597k530
$$ 112883 97732 97220 97594 88718 76632 64832 54258 26875 46032 57576 49853 42256 39726
12155C9726n140O394M416j2227N656K4277r188k2282j2526J6315J8715J5321L7158
$$ 39726 34586 40980 45396 33169 38825 63102 53914 31632 19106 35421 54136 69457 106615
12142A06615L326l2318j2570n847k8979m674j4357Q654j0034k5351R111J3252
$$ 106615 109941 77623 65053 59206 30227 25553 11196 19850 9816 -15535 -6424 6828
12130F828J7488K834k6560K3631j6537K9134J7013k0176R585l2524r272K1509
$$ 6828 24316 27150 590 24221 7684 36818 53831 33655 43240 10716 1444 22953
12118B2953K8574N064J0101M1603K4958j4463k4170k2177q636j9546j0432K5032
$$ 22953 51527 56591 66692 108295 133253 118790 94620 72443 63807 44261 33829 58861
12106E8861J844p892J3308j7997k7389O028j7658j1442J5041L1524M410p029J2495
$$ 58861 60705 52813 66121 48124 20735 26763 9105 -2337 12704 44228 48638 41609 54104
12093E4104K6466J0024n9343k3000J5046J1689k0314J1122K7314Q281r902K8336
$$ 54104 80570 90594 31251 8251 23297 34986 14672 25794 53108 61389 51487 79823
12081G9823J7322Q137k1090l8534J6076O304j0133L938K967R227L5149K7773j9822
$$ 79823 97145 105282 84192 45658 61734 68038 57905 61843 64810 74037 109186 136959 117137
12068A17137k2729J6905L1453n100r186n062M819o548J5970J2908l068j5125N210
$$ 117137 94408 111313 142766 137666 128480 123418 128237 121689 137659 150567 147499 132374 137584
12055A37584K7574J0594Q818Q911N4012Q5233O2677P7983P6507P7472k6746j48779
$$ 137584 165158 175752 184570 193481 247493 332726 395403 473386 549893 627365 600619 451840
12043D51840j78281j08202q4611k2687k0576J3660J1250k983L314N815K879n425
$$ 451840 273559 165357 80746 58059 37483 51143 62393 59410 62724 68539 71418 65993
12031F5993M571J4524M496j6866j7334O250j666J0741Q661J0531P281j0796O329
$$ 65993 70564 85088 89584 72718 55384 61634 59968 70709 79370 89901 97182 86386 92715
12018I2715J6088M312j973j234k8115K9497J8593k2128q034L7921j0274j5473
$$ 92715 108803 113115 111142 109908 81793 111290 129883 107755 99721 137642 127368 111895
12006A11895L4464R628l014K320p911K3289J0870L2691Q589J1605J9504K7306
$$ 111895 146359 155987 152973 155293 147382 170671 181541 214232 222821 234426 253930 281236
11994B81236k1435j4597k1219n4994O721M4875L2659L0137K5948R075L3017J810
$$ 281236 259801 245204 223985 168991 175712 220587 253246 283383 309331 318406 351423 353233
11982C53233l1619Q367P054P988N9407K0150K6654p831k0843K1398J8822J1781
$$ 353233 321614 329981 337035 345023 404430 424580 451234 443403 422560 443958 462780 474561
11970D74561L0740K0296M0776J7483J8421K4964J2206L2517K1552N5119L3470
$$ 474561 505301 525597 566373 583856 602277 627241 639447 671964 693516 748635 782105
11959G82105M1940N2146J7836L3662L2579O8082O5067M1501Q7452Q3659J23148
$$ 782105 824045 876191 894027 927689 960268 1028350 1093417 1134918 1222370 1306029 1429177
11948A429177J36791J60768J27687J37175J56165J73184J72920K23117K56471
$$ 1429177 1565968 1726736 1854423 1991598 2147763 2320947 2493867 2716984 2973455
11939B973455L12794L47931L98910M35120N15079O19360P12433Q73808J098073
$$ 2973455 3286249 3634180 4033090 4468210 4983289 5602649 6315082 7188890 8286963
11930H286963J380800J752339K247287K958629M015011N653016Q135054J1969024
$$ 8286963 9667763 11420102 13667389 16626018 20641029 26294045 34429099 46398123
11922D6398123J7728303K5865973L5233212L9707232K5548150j0231331l7840431
$$ 46398123 64126426 89992399 125225611 164932843 190480993 180249662 142409231
11915A42409231l9437061k9219452j9587795j3064355q998412o455791m758618
$$ 142409231 102972170 73752718 54164923 41100568 32102156 25646365 20887747
11908B0887747l582944k740204k151573j740889j403038j156360r19770p80779
$$ 20887747 17304803 14564599 12413026 10672137 9269099 8112739 7192969 6412190
11900F412190o48490n60329m70142l90167l72668l21410k89465k72327k21345
$$ 6412190 5763700 5203371 4733229 4343062 3970394 3648984 3359519 3087192 2865847
11891B865847j69937j64971j75569j20568q9363p1638p8531q1825l7675o7413
$$ 2865847 2695910 2530939 2355370 2234802 2145439 2073801 1995270 1913445 1875770 1808357
11881A808357r8705r5493p2212q6891q8222q7722p9065p7871n6461n3387q2709
$$ 1808357 1709652 1614159 1541947 1455056 1366834 1279112 1200047 1122176 1065715 1012328 929619
11870I29619n2732j4035k1157p6027o4485l5676j036l1279j1566j4688r281j8499
$$ 929619 876887 862852 841695 765668 701183 665507 664471 633192 621626 606938 597657 579158
11858E79158l5464k8073j4487P9l0589k8626q328j315K598o49k4442n351K4928
$$ 579158 543694 515621 501134 501213 470624 441998 433670 432355 434953 434304 409862 404511 429439
11845D29439j9792k8935M49P242J1068k6430K113k3332r223k0054j9699k1016
$$ 429439 409647 380712 381161 388403 399471 373041 375154 351822 342599 322545 302846 281830
11833B81830l0011q771J2677q571l3745L3409j4730p127J9199K1863l6252k0766
$$ 281830 251819 243048 255725 247154 213409 246818 232088 224961 244160 266023 229771 209005
11821B09005k2815K4625M0983R645L890M5989J7330l3934J722o098o051m5542
$$ 209005 186190 210815 251798 261443 265333 311322 328652 294718 296440 290342 284291 238749
11809B38749k1886K1938r304M840q562N806q429k2142l0516R802N0739K3981J929
$$ 238749 216863 238801 229497 234337 225775 231581 223152 201010 170494 180296 231035 255016 256945
11796B56945J3075K404K6928j3476n6579j21149j00064m7127j5714j7936N6496
$$ 256945 270020 272424 299352 285876 229297 108148 8084 -39043 -54757 -72693 -16197
11785a6197O0420o15j1167p743l71j5252p703J9670J4194j4671L544M511p370
$$ -16197 44223 43608 32441 24698 24327 9075 1372 21042 35236 20565 24109 28620 21250
11772B1250k919p341l551K9365K3440Q3j3712r716k0M493k5436J0361R784J3193
$$ 21250 18331 10990 7439 36804 60244 60327 46615 36899 36879 41372 15936 26297 36081 49274
11758D9274q187K0304p182J7707L0105R419l3474m6538j4822l203P546K3243M2683
$$ 49274 41087 61391 54209 71916 102021 111440 77966 31428 16606 13403 20949 44192 86875
11745H6875k4929j5473K938P468L936j0476j66q903N88J6514j3225j3560P008
$$ 86875 61946 46473 49411 56879 60815 50339 50173 41270 41858 58372 45147 31587 38595
11732C8595m3529l9277J924P78n433L7684K0415j0044l3397L811K0505L1611J9536
$$ 38595 -4934 -44211 -42287 -41509 -46942 -9258 11157 1113 -32284 -28473 -7968 23643 43179
11719D3179j0558N696K3584P830q138o531j7172o131J3565J0446k7899L23J9215
$$ 43179 32621 38317 61901 69731 61593 55062 37890 31759 45324 55770 27871 28194 47409
11706D7409J6212j6675J1875K1365l5O939q75K0230j846k8281j3206J382k8267
$$ 47409 63621 46946 58821 80186 80151 87090 86215 106445 104599 76318 63112 64494 36227
11693C6227k5155j3057j899l97J8639J984J7898J7912o177k8024m27J6826J4258
$$ 36227 11072 -1985 -3884 -4281 14358 16342 34240 52152 45975 17951 17524 34350 48608
11680D8608P248Q143K0762j5322m245j9569k0047K2102J9224j0442j4880P43l128
$$ 48608 55856 63999 84761 69439 65194 45625 25578 47680 66904 56462 41582 42325 39197
11667C9197K10k2483k2363r506K386L786j5476K23J8844K6518j3582P953K843
$$ 39197 39407 16924 -5439 -14945 -12559 -8773 -24249 -24026 -5182 21336 7754 15707 18550
11654A8550L629M591L37m963j1899l0375J2987J6124k996M736j2307j3551K5580
$$ 18550 22179 26770 27107 22144 10245 -20130 -7143 8981 5985 10721 -1586 -15137 10443
11641A0443L0935r133j2923J3762N474k0469j6976l8768O02L587J4580m765J1443
$$ 10443 41378 32245 19322 33084 38558 18089 1113 -37655 -37053 -33466 -18886 -23651 -12208
11628a2208l930j0257K3287J1089K719j1040M2J7401J8195n493j4488O950N552
$$ -12208 -16138 -26395 -3108 7981 10700 -340 -298 17103 35298 29805 15317 22267 27819
11615B7819k4542O236K0209J6126R6m868J5069j3683m0426p929n907O897O898
$$ 27819 3277 9513 29722 45848 45944 41076 56145 42462 2036 -5893 -11800 -4903 1995
11602A995M1177J9591j0189r956o201j4577N569P595j6998J8962R85j4161o365
$$ 1995 43172 62763 52574 42618 36417 21840 27409 35004 18006 36968 37953 23792 17427
11589A7427K0996l0925k2810L145R34L2691N514q468k0275r892j123J1953L151
$$ 17427 38423 7498 -15312 -12167 -11233 21458 26972 18504 -1771 -11663 -12786 -833 2318
11576B318j5971J0934N62J862r1J2483K8625l124M963o234o209R662N25k6138
$$ 2318 -13653 -2719 -2157 -295 -386 12097 40722 37598 42561 36327 30118 39780 40305 14167
11562A4167N110J1300J2529N049o834l737l0663o313J233L9592K9813n786j9442
$$ 14167 19277 30577 43106 48155 41321 37584 6921 608 1841 41433 71246 65460 46018
11549D6018n615O299j8658k4000L487p732J4370R098Q910j511p072k3129j0506
$$ 46018 40403 46702 28044 4044 7531 -201 14169 23267 32177 30666 23594 465 -10041
11536a0041n301J1809l824l412K0377J3762K856J3385J9554J7194j6868j5741
$$ -10041 -15342 -3533 -7357 -10769 9608 23370 26226 39611 59165 76359 59491 43750
11524D3750j0845n028L0891K4205o655l8064l6227j1413j6688j2760j268N862
$$ 43750 32905 27877 58768 82973 76318 38254 2027 -9386 -26074 -38834 -40102 -34240
11512c4240J6568N124j8172k0693O496K9454L7567j8520M33n423M569j7616j3185
$$ -34240 -17672 -12548 -30720 -51413 -44917 -15463 22104 3584 4017 -1406 3163 -14453 -27638
11499b7638J0181L8358K3472N761l7738j5607L1905j8406j7402J2610j2414k7322
$$ -27638 -17457 20901 44373 50134 12396 -3211 28694 10288 -7114 5496 -6918 -34240
11487c4240j476l395K4384L1092J1099q65J3836Q522l3840j7464J3923K214j116
$$ -34240 -35716 -39111 -14727 16365 27464 26599 40435 48957 15117 -2347 11576 13790 12674
11474A2674q787k867K3938J2866k9285k4185K158K345J1432N852k1006j02q188
$$ 12674 3887 1020 24958 37824 8539 -15646 -13488 -11143 289 6141 -14865 -14967 -23155
11461b3155N125j1142p772J1557L6192J6237J5029J0211r764k9476j3001J6463
$$ -23155 -18030 -29172 -36944 -25387 10805 27042 42071 52282 42518 13042 41 16504
11449A6504K0777k9957n7562k1716J6117K8683j630j4633K6626N4272K5590l5519
$$ 16504 37281 7324 -50238 -71954 -55837 -27154 -28784 -43417 -16791 37481 63071 27552
11437B7552l1027L2680p04r345l2414j5944M5169J0690k1880K1072J8200P500
$$ 27552 -3475 29205 28501 19156 -13258 -29202 15967 26657 4777 25849 44049 51549
11425E1549j3339m781j5073k0771k116J9954J5327K3287K603l6500j6259p666
$$ 51549 38210 33429 18356 -2415 -4531 15423 30750 54037 56640 20140 3881 -3785
11413c785P684Q626j4595l177J3722J4615q860M549r180K53k0428r884K924Q391
$$ -3785 3899 12525 -2070 -5247 8475 23090 14230 18779 9599 9852 -10576 -20460 -17536 -9145
11399i145M699k571K2627J4682j1821P514j0719m533J81j1634j9487j1196J2663
$$ -9145 -4446 -7017 15610 30292 18471 25985 15266 10733 10914 -720 -20207 -31403 -18740
11386a8740Q547j2292K7523k7039M517K0960J9218p91p379K509K6697k2281m0936
$$ -18740 -10193 -22485 5038 -22001 -17484 3476 22694 21903 14524 17033 43730 21449 -19487
11373a9487K023j7049J6044J6760J6729J8705j4642j7429k3994R794M680j4247
$$ -19487 -17464 -34513 -18469 -1709 15020 33725 19083 1654 -22340 -12546 -7866 -22113
11361b2113J9284j452J3326J5965j2136j1705n05K1381l257j803J4558j5286j6383
$$ -22113 -2829 -4281 9045 25010 12874 1169 664 22045 18788 16985 31543 16257 -126
11348a26J1458J442L477p677j4918J3914q410p029N280j0669J9220K0583k941
$$ -126 11332 12774 16251 8574 -6344 7570 -840 -7869 -2589 -13258 5962 26545 23604
11335B3604k6163J7056N023j6022r142Q12J6150j1758J7687M4136k35l2701n3446
$$ 23604 -2559 14497 19520 3498 -5644 -4832 11318 -440 17247 61383 61148 28447 -24999
11322b4999J3379K8941K7066j7875k8573k6699L8289J5562m4702K388K1222Q814
$$ -24999 -11620 17321 44387 26512 -2061 -28760 9529 25091 -19611 -17223 3999 12813
11310A2813N25j6177j3941l561J2761J6213K2008J037p500k1334o784j8999J1330
$$ 12813 13338 -2839 -16780 -20341 -7580 8633 30641 31678 24178 2844 -3940 -22939 -11609
11297a1609J7539j24l5647M682P834R489j2560n159L0249R108J3167k1479r255
$$ -11609 5930 5806 -29841 -25159 -17325 -7836 -20396 -25555 4694 13802 26969 5490 -3765
11284c765P921J2599L658L9069j0523l4243l5317L335m571q067N549o363J6792
$$ -3765 4156 16755 20413 59482 48959 14716 -20601 -17266 -21837 -29904 -24355 -30718 -13926
11271a3926l946j7304J6956l475j8755k1948J1236Q893O219L0784R007k9590l041
$$ -13926 -17872 -35176 -18220 -21695 -40450 -62398 -51162 -42269 -36050 -5266 3741 -25849 -28890
11258b8890K1304L5741k0772k0844l736O317J748O291L3925J1988P669J6750o773
$$ -28890 -7586 28155 7383 -13461 -17197 -10880 -9132 -2841 31084 43072 50741 67491 60718
11245F0718k7288j1642j2546l0381l2077k133J0226R768L6985J9818m647m3030
$$ 60718 33430 21788 9242 -21139 -53216 -55349 -45123 -35355 1630 21448 16801 -26229
11233b6229J1583K5359n846n706r733j614J7366J2502K0552J9850j8248k570k5596
$$ -26229 -14646 10713 4867 -839 -10572 -12186 5180 17682 38234 58084 39836 37266 11670
11220A1670l8625L3272K6867n103j7721n099j8869M402j759k2117J4431J4866
$$ 11670 -26955 6317 33184 28081 10360 5261 -13608 -9206 -10965 -33082 -18651 -3785
11208c785k605r08o746m8J4944k1160J2360K6396K9461K550J3280K206k5231j6734
$$ -3785 -6390 -7298 -14044 -14092 852 -20308 -7948 18448 47909 50459 63739 65945 40714 23980
11194B3980j0329l324J3473k6577j0930j2071K3839R501Q00j3559k4215p882r017
$$ 23980 13651 10327 23800 -2777 -13707 -25778 -1939 7562 8362 -5197 -29412 -37294 -46311
11181d6311L9158L4627j1531j6233j2894K6172N564p905j4624J7029J5029k0809
$$ -46311 -7153 27474 15943 -290 -13184 12988 18552 10647 -3977 13052 28081 7272
11169G272l5371r734K8535L2075K1219J990l7681l8790J2804k339K1553J5176
$$ 7272 -28099 -37833 -9298 22777 43996 45986 8305 -30485 -17681 -20020 1533 16709
11157A6709P553M200K2280o024j2775J9339K3257j2716j4734p648K3095J4989
$$ 16709 24262 28462 50742 44718 31943 51282 74539 61823 47089 39441 62536 77525
11145G7525P84l4068l6239j7761P71L2333J9840j402k1252J6311j4132k0947j5843
$$ 77525 78309 44241 8002 -9759 -8988 23345 43185 41783 20531 36842 22710 1763 -14080
11132a4080K3309K8823L237p835k2288n406q16o736j3186J4809M136O172J3908
$$ -14080 9229 38052 41289 33454 11166 5760 4944 -1792 -14978 -169 3967 10139 24047
11119B4047J95j3943j1554j6487L109l288p490j4377o255n756r465L0855M8236
$$ 24047 24242 10299 -1255 -17742 -14633 -17921 -25411 -39788 -46043 -51799 -61264 -30409 17827
11106A7827M264j0799o008J3438J0640Q237k7920K8405K2206J0171J6447j894
$$ 17827 22091 11292 5284 18722 29362 37599 9679 38084 60290 70461 86908 85014
11094H5014j4803K306K494n0018k9722J0866N2553k5114K1941L618k8834l7758
$$ 85014 70211 72517 75011 24993 -4729 6137 58690 33576 55517 59135 30301 -7457
11082g457o097O641J330O408p946M055o77J0246J2277L1906N8890j2634l0906
$$ -7457 -13554 -6913 -5583 825 -7121 -3066 -3743 6503 18780 50686 109576 96942 66036
11069F6036k9682k5697J6354K1012k2809l0806K015J872j8591j1098l088J6666
$$ 66036 36354 10657 27011 48023 25214 -5592 -3577 -1705 -20296 -31394 -34482 -17816
11057a7816K4090K9585L119l325J3203K6463O311j4706J0092q339R132N0844J7973
$$ -17816 6274 35859 38978 35653 48856 75319 81630 66924 77016 68677 77809 128653 146626
11044A46626r191J698o417l0474l2662R424K3249M0794J3312M0576M942L2964
$$ 146626 137435 139133 132716 102242 69580 79004 102253 143047 156359 196935 201877 234841
11032B34841n085j6894J1321m1797l4076j2314N932J6520J4293J7066N6236N9732
$$ 234841 229756 212862 224183 182386 148310 135996 141928 158448 172741 189807 246043 305775
11020C05775L2952j7793m9496m0287n8033m7348L0047k865K8222L6436J1444N494
$$ 305775 338727 320934 271438 231151 173118 125770 155817 152952 181174 217610 229054 234548
11008B34548p863l7797n4565k0575O550J6703J1681k5645N413L613J2738k6472
$$ 234548 226685 188888 134323 113748 120298 137001 148682 123037 128450 132063 144801 118329
10996A18329l4563k1557k6125j3250M0283J4881l0078j8627J9557J1024k6500
$$ 118329 83766 62209 36084 22834 63117 77998 47920 29293 48850 59874 33374
10985C3374j2972L3152O306k1434j2761j5554j4408j2106n975J293J3622L0556
$$ 33374 20402 53554 59860 38426 25665 10111 -4297 -16403 -22378 -21085 -7463 23093
10973B3093j534J783J7259J1381M396k5499j2622k0629J0103N395m356Q601K5048
$$ 23093 21559 23342 40601 51982 56378 30879 18257 -2372 7731 13126 8770 17371 42419
10960D2419k4747q343M2714M2500j574k6803l4604k6846n656J2015P745j0032
$$ 42419 17672 9329 52043 94543 92969 66166 31562 4716 -940 11075 18820 8788
10948H788j2075J6631J8260N06J6288J266n228o938k2278j3171j9800J3169K5814
$$ 8788 -3287 13344 31604 32110 48398 49664 44436 37498 15220 2049 -17751 -4582 21232
10935B1232J7300k5691k2802L1064K7561j0719l0016j960m780O042k3700M19K4864
$$ 21232 38532 12841 -9961 21103 48664 37945 7929 5969 1189 7231 -16469 -16050 8814
10922H814N2655K4968P642k4912q237j1641M409m736J1095j0434l3161m399K6722
$$ 8814 61469 86437 94079 69167 60930 49289 53698 48962 60057 49623 16462 12063 38785
10909C8785J263j4826J5899K9522J0117M948J953l4750k1286K4944N117k117K565
$$ 38785 40048 25222 41121 70643 80760 85708 87661 52911 31625 56569 61686 59569 62134
10896F2134K978j4442l962J0913j5527n467J4300O003L2407k6411j6651K478P651
$$ 62134 65112 50670 46708 57621 42094 36627 50927 56930 89337 62926 46275 48753 56404
10883E6404j3243Q139P687m3491K278M2361j994l710k3903k0913J9888L3399n086
$$ 56404 43161 51300 58987 15496 17774 60135 58141 54431 30528 9615 29503 62902 57816
10870E7816m3917k62R044M970K279k5435R433L4172N738j3414q93K6903L7012
$$ 57816 13899 13637 22681 27651 29930 4495 13928 48100 53838 40424 39531 66434 103446
10857A03446l1055m2488O91n93j4589O433K3834N074n874J9259K0061k5182o164
$$ 103446 72391 29903 30594 30001 15412 21845 45679 50753 44879 64138 84199 59017 52853
10844E2853K5768o964j8309m447l957m801l01Q372n646P221N343m959j0247P268
$$ 52853 78621 71657 53348 48901 44944 40143 39842 48214 42568 49789 55132 50173 39926 47194
10830D7194l782n235k050K5607r145o855J5999r70j4042k4878j0321P967L2411
$$ 47194 43412 38177 36127 61734 52589 45734 61733 60763 46721 21843 11522 19489 51900
10817E1900J2828m033N695q867O589q80J8041K795j8777j5841K219o206J5896
$$ 51900 64728 60695 66390 57523 64112 63232 81273 84068 65291 49450 51669 45463 61359
10804F1359J6089K3417r175r671R520n05j6438J2694j87j9328j6720k307k283
$$ 61359 77448 100865 91690 82019 91539 91034 74596 87290 87103 67775 51055 48748 46465
10791D6465P25k7218j752K7535j1990m6162P901J9520q137K481L4677K5826O3066
$$ 46465 47190 19972 18220 45755 33765 -12397 -4496 15024 6887 9368 44045 69871 132937
10778A32937J006j4782l0783j1572N925j2724R084j8413j5312j6314M306L1390
$$ 132937 133943 119161 88378 76806 82731 70007 79091 60678 45366 29052 33358 64748
10766F4748Q063j9880l2898k981J7279K488p138K6765L0J5142K8398L531k3090
$$ 64748 72811 52931 20033 17052 34331 36819 29681 56446 56476 71618 100016 103547 80457
10753H0457n605O487q134j5555L970J3405K7706K3380k1523j2635K8054p439P984
$$ 80457 74852 81339 73205 57650 61620 75025 102731 126111 104588 91953 120007 112568 120552
10740A20552K2307r20j8438k062Q171P733k5292J4320L3676K5803J4287o336j9552
$$ 120552 142859 141939 123501 121439 129610 137343 112051 126371 160047 185850 200137 193801 174249
10727A74249l2277l5400R552M6577K0475n87J2875m592K3527M5685L118l6979
$$ 174249 141972 106572 116124 162701 183176 182589 195464 190872 214399 260084 263202 226223
10715B26223m9935l3635q065l3800J2719J230N517K6281K7823J9969j7751k0838
$$ 226223 176288 142653 134588 100788 113507 114737 120254 146535 174358 194327 176576 155738
10703A55738j2942n868o4123p210L3727M7467J0226j0144o473L1020N412k5343
$$ 155738 142796 136928 72805 65595 99322 146789 157015 146871 140398 171418 176830 151487
10691A51487m5518l094L779J375j4862j6233N568q210j8159j6157L3720N2567
$$ 151487 105969 102875 106654 108029 93167 76934 82502 74292 56133 39976 73696 126263
10679A26263K1452K029J7767k7740m0835J0655n632Q244K8632N9N306L2074j8130
$$ 126263 147715 149744 167511 139771 98936 109591 103959 112203 140835 140894 146200 178274 160144
10666A60144k0160P952J4342J8285M1071J5599K0659l2876n3183J6472J1924K4347
$$ 160144 139984 147936 162278 180563 221634 237233 257892 225016 171833 188305 200229 224576
10654B24576L6314J8932M4934O4386J8865J3337M9840K5072j7533m814k232j7320
$$ 224576 260890 279822 324756 389142 408007 421344 471184 496256 478723 473909 471677 454357
10642D54357L974L5005K9712K5055L9567N3688M5205R1058J24222J14546J08323
$$ 454357 458331 493336 523048 548103 587670 641358 686563 777621 901843 1016389 1124712
10631A124712J13881J17221P7934P6341J29742J86396K14712K64110L64356N31162
$$ 1124712 1238593 1355814 1433748 1510089 1639831 1826227 2040939 2305049 2669405 3200567
10621C200567P06037R62493J259069J628787K117770K559728K658968K029053
$$ 3200567 3906604 4869097 6128166 7756953 9874723 12434451 15093419 17122472
10613A7122472P81481m01503r08165p41020j44493O64778J644852K796596M095743
$$ 17122472 17903953 17502450 16594285 15853265 15708772 16373550 18018402 20814998 24910741
10604B4910741N188618N360209L618091J84799k764355l688033k882462j409656
$$ 24910741 30099359 35459568 39077659 39262458 36498103 32810070 29927608 28517952
10596B8517952K33297J904091L740158N589444O905600O541993L386649j939904
$$ 28517952 28751249 30655340 34395498 39984942 46890542 53432535 56819184 54879280
10588E4879280o047755p033020n842698m007047k179703m81106J126650K559346
$$ 54879280 48831525 41798505 35955807 31948760 29769057 29287951 30414601 32973947
10580C2973947L393988K971492O34432k824429n239652n520681m405432l026933
$$ 32973947 36367935 39339427 39973859 37149430 31909778 26389097 21983665 18956732
10572A8956732j791751p78997O5654O73171Q71933N43281m94229j773870k659642
$$ 18956732 17164981 16385984 16451638 17124809 17996742 18540023 18045794 16271924 13612282
10563A3612282k731450k295280j799419j303764r38904p13682n42220m35923l60643
$$ 13612282 10880832 8585552 6786133 5482369 4543465 3829783 3287563 2851640 2490997
10554B490997k76825k36233k14449j70656j31083j17230j26332p8674q9722p0586
$$ 2490997 2214172 1977939 1763490 1592834 1461751 1344521 1218189 1139515 1049793 979207
10544I79207k7255k6081l7684m9245n0315l7818l7183o4055n6278m4721k9893
$$ 979207 951952 925871 888187 838942 788627 750809 713626 649571 593293 548572 518679
10533E18679o381q081M984K410m0597m1559k7173M891l0787l2770k6007j088P362
$$ 518679 512298 504217 509201 511611 471014 429455 402282 407173 376386 343616 317609 316521 323883
10520C23883J3047L660k0917P093J4902j563k9770j4271J9728N580N501p503n0054
$$ 323883 336930 340590 319673 326766 341668 340105 310335 296064 315792 321372 326873 319370 269316
10507B69316l430L861J2130P427R994q831k878J4827n036J7025n383J4991J6853
$$ 269316 265886 269747 281877 289304 299298 290467 287589 302416 297380 314405 309022 324013 340866
10494C40866k7219j5780m552n717j3462n565J1483k1257K00K1798J3416J1685
$$ 340866 313647 297867 293315 287598 274136 268571 280054 258797 258997 280795 294211 305896
10482C05896j5003P020k1439j7702J2998K2288o287j1907n1775p5469L2367O4235
$$ 305896 290893 297913 276474 258772 271770 294058 287771 275864 224089 148620 180987 245222
10470B45222k0290j80j6026k6188K0026L860j0029n832j8726j1072r51J8603J7544
$$ 245222 224932 224752 208726 182538 202564 206424 196395 190563 171837 160765 159814 178417 195961
10457A95961J3153l720M2380M3312L1125J0606K1020K1139N6602N0844O270R905
$$ 195961 209114 205394 247774 291086 322211 332817 353837 374976 431578 482422 488692 498597
10445D98597R333j8685n8089o7818l0321l4134j9177m3683l9490j9812O196L0660
$$ 498597 507930 489245 431156 363338 333017 298883 279706 236023 196533 176721 182917 213577
10433B13577j502K466p293p587K1442J5525k2409k1771k8143k5441J7809o747
$$ 213577 212075 214541 207248 199661 221103 236628 214219 192448 164305 138864 156673 149926
10421A49926l6575K135J5727R724j7354j8793M232K7728k980j7868Q368L5737
$$ 149926 113351 115486 131213 140937 123583 104790 109022 136750 133770 115902 124270 160007
10409A60007R779j0417O020J9593l4239j9897J1077Q098K2819M680k1178K303
$$ 160007 169786 159369 165389 184982 150743 130846 141923 150021 172840 177520 156342 158645
10397A58645J1964o457j4962J965l224K1000Q025j9878j2284J3764M4146M2438
$$ 158645 170609 164152 149190 151155 147931 168931 176956 157078 144794 158558 202704 245142
10385B45142P4372N5519P066k6122P663M274k6659q489k5577k9037k6557o033
$$ 245142 319514 375033 382099 355977 363640 367914 341255 332766 307189 278152 251595 245562
10373B45562j0549k0498P0J268R629N605J4580m076J1094L5036l537j1388j2111
$$ 245562 235013 214515 214585 215853 225482 231087 245667 241591 252685 287721 284184 272796 260685
10360B60685L2025Q128j221P728o522O875J9735L580k947J6600j7698J3929L7862
$$ 260685 292710 300838 299617 307345 300823 307698 327433 331013 328066 344666 326968 340897 378759
10347C78759J3474K4669J031q623N109J9536J9149K5643L3929L0551L4941L3845
$$ 378759 392233 416902 417933 409310 414419 433955 453104 478747 512676 543227 578168 612013
10335F12013J2780K004q221J3528O4857P2274L3642R0928J22203J29734J25654
$$ 612013 624793 626797 618576 632104 696961 769235 802877 893805 1016008 1145742 1271396
10324A271396J83927J94390J68806J06377r627r1143k16500l02088k89120k15029
$$ 1271396 1455323 1649713 1818519 1924896 1915269 1824126 1607626 1305538 1016418 801389
10314H01389j65152j31073q9048j3449m676P545m0063l697J5479j2543k0438j2975
$$ 801389 636237 505164 416116 402667 397991 405536 365473 361776 377255 364712 344274 331299
10302C31299q518K3246J1287M156K0094R050j4691Q719M3178K5677K8724J5787
$$ 331299 322781 346027 357314 361470 381564 390614 375923 384642 427820 453497 482221 498008
10290D98008L1540J9131J4171J5565L2396J9782j0472K2672M1201Q49K1567L3812
$$ 498008 529548 548679 562850 578415 610811 630593 620121 642793 683994 684843 706410 740222
10278G40222M1883R123J2186O2547L773p302K0210J9590k749J9027N9266J7036
$$ 740222 782105 791228 803414 865961 869734 862432 882642 902232 899483 918510 977776 994812
10266I94812L4414K9341N7777N1339N5443O9454J3898O553J6958K1561K6890N9441
$$ 994812 1029226 1058567 1116344 1167683 1223126 1292580 1306478 1313031 1329989 1351550 1378440 1437881
10254A437881L9111N4262M3635N6745M5527O9523R2313Q7212P4181Q9423P2658
$$ 1437881 1476992 1531254 1574889 1631634 1677161 1746684 1838997 1926209 2000390 2089813 2162471
10243B162471J07457J13373J00770R6108J29252J52179J46053J51315J81044J68034
$$ 2162471 2269928 2383301 2484071 2580179 2709431 2861610 3007663 3158978 3340022 3508056
10233C508056J82393K02450K33163K99836L18897L37652L87447M61579M82033
$$ 3508056 3690449 3892899 4126062 4425898 4744795 5082447 5469894 5931473 6413506
10224F413506N04694N13651N50288O25159P46593Q17486R61294J087848J273617
$$ 6413506 6918200 7431851 7982139 8607298 9353891 10171377 11132671 12220519 13494136
10215A3494136J488627J710177J935979K157386K400087K688568K970966L355983
$$ 13494136 14982763 16692940 18628919 20786305 23186392 25874960 28845926 32201909
10207C2201909L961346M845777O085690P864614J0430987J3744520J7958455K3128019
$$ 32201909 36163255 41009032 47094722 54959336 65390323 79134843 97093298 120221317
10199A20221317K9256891L6502652M5826026N7349656O7917581P2229229O1742972
$$ 120221317 149478208 185980860 231806886 289156542 357074123 429303352 491046324
10192D91046324L1219649j1636783n0260939o9869838o9745001o0088521m8813782
$$ 491046324 522265973 510629190 460368251 390498413 320753412 260664891 211851109
10185B11851109l8981827l1453697k5667670k0626914j6233746j2580282r738898
$$ 211851109 172869282 141415585 115747915 95121001 78887255 66306973 56568075
10178E6568075p566054n968790m859272m033710l400018k960153k679197k458480
$$ 56568075 49002021 43033231 38173959 34140249 30740231 27780078 25100881 22642401
10170B2642401k187116j938213j753660j588041j340658j169423j049904r42588
$$ 22642401 20455285 18517072 16763412 15175371 13834713 12665290 11615386 10672798
10162A0672798q13780p00770o12355n27283m33940l99807l63732l20138l44504
$$ 10672798 9859018 9158248 8545893 8018610 7584670 7184863 6821131 6500993 6156489
10153F156489l36478l27248l18208k77141k93877k66993k06559j64894j53650
$$ 6156489 5820011 5492763 5174555 4897414 4603537 4336544 4129985 3965091 3811441
10144C811441j31345j04518j00921j37031j69992j56946j62367j15185o2908o1433
$$ 3811441 3680096 3575578 3474657 3337626 3167634 3010688 2848321 2733136 2670228 2608795
10134B608795r6536q7209n5977p8765j03450p8809o6289m8999r0797p9744o9903
$$ 2608795 2512259 2425050 2369073 2290308 2186858 2108049 2041760 1992761 1901964 1822220 1752317
10123A752317l8312m9863k9223l5377n3390l8634J3191l9798o4183N791m2452
$$ 1752317 1714005 1664142 1634919 1599542 1546152 1507518 1520709 1480911 1416728 1422519 1380067
10112A380067k4706j7803j9352m0584l7155J1839k2123m9380J980m3041k4577
$$ 1380067 1355361 1337558 1318206 1277622 1240467 1252306 1230183 1180803 1182783 1139742 1115165
10101A115165l2235o688J589j7486k7369n583K2352J7558j4174r300l7379k047
$$ 1115165 1082930 1076242 1077831 1060345 1032976 1027393 1049745 1067303 1053129 1043829 1006450 1004403
10089A004403J2469L904J4876O053j455j2021r143m877L420J0318j8386k9658
$$ 1004403 1016872 1020776 1035652 1041705 1040250 1028229 1019086 1014209 1017629 1027947 1009561 979903
10077I79903J744K519M465N896L3006J6591J877J1887j9943k9479q7490j64610
$$ 979903 981647 984166 988631 994527 1027533 1044124 1046001 1057888 1037945 1008466 920976 756366
10065G56366k01655k36863j82906j20923l0087L672L8962M9662N389q669J3976
$$ 756366 554711 317848 134942 14019 -16068 -12396 26566 76228 81617 72948 86924
10054H6924L9928M5333K5590J1833k1525l1630J6424K2576K9919J3512K953O702
$$ 86924 126852 172185 197775 209608 188083 156453 172877 195453 225372 238884 241837 248539
10042B48539p171j9845l953J7244J2810J6901j8777K5397k7680J2555k0892o802
$$ 248539 241368 221523 217570 234814 247624 264525 245748 271145 243465 256020 235128 228326
10030B28326K7912Q901K168r061N525p576l284J5878L3415j2346j4890K449n166
$$ 228326 256238 265139 267307 258246 263771 256195 252911 268789 302204 289858 274968 277417 272251
10017B72251j598K2116R824j5013m4813k0629Q57j64j0208l0383m2253l8870k250
$$ 272251 270653 292769 302593 287580 242767 222138 222995 222831 212623 182240 139987 101117 98867
10004I8867J2376N013Q129m958K0235L1289j0894N686M6153k1403J1211L9390
$$ 98867 111243 116256 124385 119427 139662 170951 160057 165743 211896 190493 201704 241094
9992B41094J5617j4173o96j0114k4K7026K7350j4674l8232k3240P123M779N236
$$ 241094 256711 242538 241842 231728 231704 258730 286080 271406 233174 209934 217057 221836 227072
9979B27072J0059R72q164N411L54k7807K0689N414k7174j2833N080n011R719L2375
$$ 227072 237131 238103 229939 235350 235704 207897 228586 234000 206826 193993 199073 194062 203781 236156
9965B36156K4718k1370j9291k5998m979J1481L526p797l758j2790n1919L4790
$$ 236156 260874 239504 220213 194215 189236 200717 204243 196446 192688 179898 127979 162769
9953A62769M8583j2928m0629m327n339q098J4412J9514K1332J2541l6858k3127
$$ 162769 211352 198424 157795 153468 148129 140031 154443 173957 195289 207830 170972 147845
9941A47845o838J927M600j2485l8919r792L816K2901J2350K074L166M1245L7671
$$ 147845 141007 142934 147534 135049 96130 86338 90154 113055 125405 127479 130645 171890 209561
9928B09561k2837k5998J81l5671R625J3940k953L1026l523k7351j5474p486J9848
$$ 209561 186724 160726 160907 125236 134861 148801 145848 176874 173351 146000 130526 123040 142888
9915A42888n372j4886J7392J6593p96j7741J6505r647j3969L365k016o840k3934
$$ 142888 137516 122630 140022 156615 155819 138078 154583 144936 130967 134332 132316 125476 101542
9902A01542M481O654Q829qk966K6866K2784l399l957l0744k2658j0911j0654j3694
$$ 101542 106023 112677 121506 121498 118532 145398 168182 164783 160826 130082 107424 96513 85859 72165
9888G2165P797l254j3570r394j992K1964K8768o6j2070l2461P389L0116K2710
$$ 72165 79962 76708 63138 53744 51752 73716 102484 102418 90348 57887 65276 95392 118102
9875A18102r588k5155j4259j5174J4220K8666Q701O680K4284K4083J3822l7602
$$ 118102 108514 83359 69100 53926 68146 96812 105513 112193 136477 160560 174382 136780
9863A36780m5751j6778j4579K0780L4710J1990p648j5786j4359J819O762k518
$$ 136780 91029 74251 59672 80452 115162 127152 119504 103718 89359 91178 97940 95422
9851I5422R178J8020K0295k4809k1147l4512J44L651j6173k7848l806L3642M3844
$$ 95422 104600 122620 142915 118106 96959 62447 62591 66242 50069 22221 18415 52057 95901
9838I5901J0410L1419M842k2474j5367Q116j5865n868k0771m454L6606j217j068
$$ 95901 106311 137730 142572 120098 104731 112847 96982 91114 70343 65889 102495 101278 100210
9825A00210j5125k2718K0434o591k3775L1695K8657J4331K3189L5928J1605o552
$$ 100210 85085 62367 82801 76210 52435 84130 112787 127118 150307 186235 197840 191288
9813A91288j0618j2312k0675O659L4194L8439n539L4996L2535l082L6514L3055
$$ 191288 180670 168358 147683 154342 188536 226975 221436 256432 288967 285885 322399 355454
9801C55454M6839J24238J31774J43475J68602J60065J75081K32785K03470J90489
$$ 355454 402293 526531 658305 801780 970382 1130447 1305528 1538313 1741783 1932272
9791A932272J82234R5788K6662o5352j19871j26746j71303k32192k29265j87389
$$ 1932272 2114506 2210294 2236956 2171604 2051733 1924987 1753684 1521492 1292227 1104838
9781A104838j88856j97120j16131n1220o1573p1424n3316l7693m4299n1010l7707
$$ 1104838 915982 718862 602731 551511 489938 418514 365198 327505 283206 232196 194489
9770A94489j9717J9943J3091k5009m3969k5770j4680K788j8513p438Q540K6307
$$ 194489 174772 194715 207806 182797 138828 113058 98378 101166 82653 75215 83755 110062
9758A10062K4656j9218N421K6736l8137k3141j4838j0903r787J7126K3468J9241
$$ 110062 134718 115500 120921 147657 109520 86379 71541 60638 50851 67977 91445 110686
9746A10686K4387p51r874J5711k0869l0432p531j5511M678K6434N267j2986l1079
$$ 110686 135073 134322 124448 140159 119290 88858 81327 65816 70494 96928 102195 89209 58130
9733E8130j0310J5644r137r203O741k2346J7222j4494K3457N30l2856n850j8015
$$ 58130 47820 63464 54327 45124 51865 29519 46741 32247 55704 56234 23378 17528 -487
9720d87P392K3681L2494Q822j4362o464j5416j1108k2643J0516M9612L9946P438
$$ -487 6905 30586 63080 71902 57540 51076 35660 24552 1909 12425 62037 101983 109421
9707A09421q993M043l50l1703l5036k8300J7736L7951p892l9346R562R214M0228
$$ 109421 100428 104471 104121 72418 37382 9082 26818 64769 56877 17531 27093 36307 76535
9694G6535J2402j886j3844l0994j3102l130j8426j825N726Q744R480J4542K7547
$$ 76535 88937 87051 73207 42213 29111 25981 7555 5730 11456 20200 29680 44222 71769
9681G1769J844l5334N822L0819J858l1581O895J5340J810j1052J2615K753j7829
$$ 71769 73613 38279 44101 74920 76778 45197 52092 67432 69242 58190 70805 73558 55729
9668E5729j3856k3742J001K7616J3049j1903j1165P876L6055J0128K596j1762
$$ 55729 41873 18131 19132 46748 59797 47894 36729 44605 80660 90788 93384 81622
9656H1622j6660J4227M7186L6355L8504N0795L0193L9745j8342n7648o0447l7345
$$ 81622 64962 79189 126375 162730 201234 252029 282222 321967 303625 245977 185530 148185
9644A48185j5550l4501n6722j1250m0886K398M3643L949r348j6296O377K3789
$$ 148185 132635 98134 41412 30162 -10724 -8326 35317 39266 29918 13622 19999 43788
9632D3788R174j7547J3566K650j3681k577l203j018J5135J1034J398J2054K2036
$$ 43788 52962 35415 48981 51631 37950 35373 32170 31152 46287 57321 58719 70773 92809
9619I2809J7166j0708k3742J8729P389l6310m7574j2389p459L674J7096J3507
$$ 92809 109975 99267 75525 94254 101643 65333 17759 5370 -2089 1585 18681 32188
9607C2188q531j6864K2407K7351L012Q747m636k4215k6968J6303K2487k3279l7576
$$ 32188 23657 6793 29200 56551 59563 68310 63674 39459 12491 28794 51281 28002 -9574
9594i574j4868J6043N070J2896J2863l137L541K6749M547J1572n060k7752l2930
$$ -9574 -24442 -8399 -3329 9567 22430 19293 22834 49583 54130 65702 60642 32890 -40
9581d0k928l5858j5383L2541K8572K6630M2408k6911k5927K537J2660O163j2996
$$ -40 -2968 -38826 -54209 -21668 6904 33534 75942 49031 23104 25641 38301 44464 31468
9568C1468M753K660N611L4965P097m1336r119K698r26Q479l5353j9080L3348R49
$$ 31468 36221 38881 44492 79457 86554 45218 36099 38797 37871 46350 10997 -8083 25265 26214
9554B6214m141K6916q298r659k877k4534J8284Q218n734p614j3385K207q5J6686
$$ 26214 22073 48989 40691 31032 28155 3621 21905 30123 24389 16775 3390 5597 5512 22198
9540B2198M856J4046n262p335L983M0390J9799J1007N476k0535j3064n011K1401
$$ 22198 27054 41100 35838 28503 32486 72876 92675 103682 109158 88623 75559 70548 91949
9527I1949j232p269l3153k8573Q368K8177J6420j8936Q708r052k3191k8065m510
$$ 91949 90717 83448 50295 21722 30090 58267 74687 55751 64459 55407 32216 4151 -359
9514c59L260p469P333O439m716j2478K115K4128P232J2897j1162o696j5211j0944
$$ -359 2901 -4568 2765 9204 4488 -7990 -5875 18253 25485 38382 27220 20524 5313 -5631
9500e631J6649J6012N872j6997j201K184r757j6435L0133L6023l0788n579L499
$$ -5631 11018 27030 32902 15905 14704 16888 7131 -9304 20829 56852 26064 20485 23984
9487B3984J2867j3740j8268J0518j2088J4609L1422Q117k7867k7122q812K4196
$$ 23984 36851 23111 4843 15361 3273 17882 49304 57421 29554 2432 -6380 17816
9475A7816J1483j6342k304K6174R976l276M414K3615Q402M528N987j6003k2805
$$ 17816 29299 12957 10653 36827 46803 43527 47941 71556 79958 84486 90473 74470 51665
9462E1665l2620j1120J9991J7413m000j8340n471J8812K529l5816j454J8705j6482
$$ 51665 19045 7925 27916 45329 41329 22989 17518 36330 38859 3043 1589 20294 3812
9449C812R430j8015k086R980j654N268K2833m445N458K1747j4218r297j2333L0937
$$ 3812 13242 -4773 -6859 3121 1467 6735 29568 25123 30581 52328 38110 28813 16480 47417
9435D7417j9635j7125K137L3995N226J7656J0804L909j8091m9032j3040l432K1722
$$ 47417 27782 10657 12794 46789 52015 69671 80475 84384 66293 17261 4221 789 22511
9422B2511K1507j9925j4673M1446O655k5672K7355L069k2150M710J0099k0797
$$ 22511 44018 24093 9420 50866 57521 31849 59204 62273 40123 44833 54932 34135
9410C4135m33K3107n712K8233J7070l4133l3400j9528p800r157K9771Q498n146
$$ 34135 33702 56809 51097 79330 96400 62267 28867 9339 1539 -7618 22153 30651 25505
9397B5505J2773n756J4774q74j9315J0998K6569j9716r148j5200J4143K7992j3813
$$ 25505 38278 32522 47296 46422 27107 38105 64674 44958 35810 20610 34753 62745 48932
9384D8932j5611N930j96n449o337J3678J4855m4999m5270o70K3953P639j5095
$$ 48932 33321 39251 39055 33606 27269 40947 55802 10803 -34467 -35137 -11184 -3545 -18640
9371a8640j861j9860k8055K0689L3999M269J7254K9373N046n643J4948j607J0936
$$ -18640 -20501 -40361 -68416 -47727 -13728 -9459 7795 37168 42214 36571 51519 49912 60848
9358F0848L416j244l5472P478J0587q228j4388k088J21k131N31r525L364J8461
$$ 60848 64264 63020 27548 35026 45613 37385 22997 20909 21030 18899 19430 9905 13269 31730
9344C1730R201k0554j9667Q516K430J9731K5215l1421j9611j5262K4273K0451
$$ 31730 40931 20377 710 9226 11656 31387 56602 25181 5570 -9692 14581 35032
9332C5032j4631p682m056l567K3458L4903K2013l2734j7618j7567J0467R1j8592
$$ 35032 20401 12719 8663 5096 28554 63457 85470 52736 35118 17551 28018 28109 9517
9319I517j6249k088Q267l270J2386j95M112O287j0039j0472K083k560J0216K993
$$ 9517 -6732 -8820 -553 -3823 8563 8368 12480 18767 8728 -1744 339 -2221 7995 10988
9305A0988j3723r08j725r001J359J4750J4831J9617J5700j5983j4286m413J8152
$$ 10988 -2735 -3643 -5368 -14369 -13010 1740 16571 36188 51888 35905 21619 17206 35358
9292C5358n195j1184m648m3471k4669K8831L1774o988R337K9176l5702l6826J5389
$$ 35358 30163 18979 14331 -29140 -53809 -24978 6796 -192 9145 38321 2619 -34207 -18818
9279a8818K0527j8251j7658K2883J2745J2924k368j5402j1942j9817j5959K1179
$$ -18818 1709 -16542 -34200 -11317 1428 14352 11984 -3418 -15360 -35177 -51136 -29957
9267b9957L175n360J6844M4350N299K192J3798k8470j7834K0029J565l3633l7531
$$ -29957 -26782 -32142 -15298 29052 34351 36543 50341 21871 4037 24066 25631 -8002 -45533
9254d5533r985K1267L4652L7157O641q83Q453L327M65k2662m5075k2683M4473
$$ -45533 -55518 -34251 401 37558 44199 43316 51769 55096 55561 32899 -12176 -34859 9614
9241I614M5996Q340l1821j8658m189q025M898J5360k2793M0122J8542j8584k6274
$$ 9614 55610 63950 32129 13471 9282 1257 6155 21515 -1278 38844 57386 38802 12528
9228A2528k6251K1998k853r884j4384j8155k690J7628K5301K609l5188K1982L5393
$$ 12528 -13723 8275 5422 -4462 -18846 -37001 -39691 -22063 3238 5847 -29341 -7359 28034
9215B8034j4988N26J551p678j9072J6595j7205j5042J0206K4800N508K7125r922
$$ 28034 13046 13572 15123 7445 -11627 4968 -12237 -27279 -17073 7727 13235 40360 30438
9202C0438k0900K8475K7136j441l1626j0743K9356J1576l8155m837L0975j0379
$$ 30438 9538 38013 65149 63708 32082 21339 50695 62271 24116 19279 50254 39875
9190C9875K117M527Q963j6690k9067r158N30L3023J4751j9706j0063J2072M845
$$ 39875 41992 46519 55482 38792 9725 567 1097 34120 48871 29165 19102 31174 36019
9177C6019R714j2760l0526k067J6813q823J2734K8701n249m3276j2093R184k2997
$$ 36019 45733 32973 2447 380 17193 8370 21104 49805 44556 1280 -10813 -1629 -24626
9164b4626J4852J169L0504l223J3509j5109j2239K879J9783j8809m493J6646N26
$$ -24626 -9774 -8605 21899 18676 32185 17076 4837 7716 27499 8690 4197 20843 21369
9151B1369J7093Q446k3007j0925j827k9555M609M83k172q809n078j2187J9568
$$ 21369 38462 46908 23901 12976 11149 -18406 -13797 -13314 -15486 -24295 -29373 -41560 -21992
9138b1992K5439K8527o229j0146O37N745K6822k906k4305J639K117n199m3777
$$ -21992 3447 31974 25745 15599 16236 21981 48803 45897 21592 23231 25348 20149 -23628
9125b3628m2678J8317O0714N272o436l289K8896O129k4885N15K0773P063J2058
$$ -23628 -66306 -47989 12725 17997 11561 8272 37168 43297 18412 18927 39700 46763 58821
9112E8821M439R923k732l5421n2091j9085j8622J006J7785K558N147R811j0484
$$ 58821 63260 73183 70451 35030 -17061 -36146 -54768 -53762 -35977 -33419 -28272 -18461 -28945
9099b8945n099J1780O073q136J5452R761q68l0260n774J0093R722k521R347l021
$$ -28945 -34044 -22264 -16191 -24327 -8875 886 18 -30242 -36016 -25923 -16201 -18722 -9375 -12396
9085a2396j3199j874k5598N917J8535m591K2027o568r946n792p038J3362K2455
$$ -12396 -25595 -27469 -53067 -47150 -28615 -33206 -11179 -17747 -27693 -33485 -40523 -27161 -4706
9072d706N295k5924NK8840L784N596q90L7103k0675j7825k5024J2125K3906K776
$$ -4706 589 -25335 -25330 3510 7294 12890 12000 49103 28428 10603 -14421 -2296 21610 24386
9058B4386j9442j5380o45K2753J2327o177q426J2267J1162j0074j4550k4234m059
$$ 24386 4944 -10436 -11081 11672 23999 17822 9396 21663 32825 22751 8201 -16033 -20092
9045b0092K1280R765M2228q240J1380l80n131j2441j1514R493L2826k2827j9138
$$ -20092 1188 10953 53181 44941 56321 55941 50810 38369 26855 36348 69174 46347 27209
9032B7209J514K3353k2449m4011n948K1806K441J211J1110O655j4920J8079O362
$$ 27209 28723 52076 29627 -14384 -20332 1474 3915 5126 16236 22891 7971 26050 32412
9019C2412j9645j9190O561m940k8056J5379K2308L6223k663L674j6519j298K1726
$$ 32412 12767 -6423 138 -4802 -32858 -17479 4829 41052 38389 42063 25544 24246 45972
9006D5972l131j4776J0410n829j0332J8050R898l8274J0017j2298k9J3232j3256
$$ 45972 42841 28065 38475 32646 22314 40364 50262 11988 22005 9707 9678 22910 9654
8993I654j3421M5280J1380j0721K1433M326l5501j4481N217J3850j5933j3653
$$ 9654 -3767 41513 52893 42172 63605 67931 32430 17949 23166 37016 21083 7430
8981G430N614K0403R063l1866J9927j4086j0625n226o998l837P444M867n873R675
$$ 7430 13044 33447 42510 10644 30571 16485 5860 634 -6364 -10201 -2757 2110 -3763 5912
8967E912j4495K0697J641m769r406L7900j9143q56L5486j0963k9423j9392J1702
$$ 5912 -8583 12114 13755 8986 -420 37480 18337 17481 52967 42004 12581 -6811 4891
8954D891k0598J0316R571L521K052J714o401R144J1749j2615j1812J9064l6886
$$ 4891 -15707 -5391 4180 7701 9753 11467 5066 14210 25959 13344 1532 20596 -16290
8941a6290k0794K4572K0332l2244Q93J7283j6052j5837L1438M124k0404j5985
$$ -16290 -37084 -12512 7820 -24424 -23531 -6248 -22300 -38137 -6699 -2575 -22979 -38964
8929c8964k9826J1066J2875J5097L0530J4286P065l2729J3806J2858l051O852
$$ -38964 -68790 -57724 -44849 -29752 778 15064 22129 -10600 3206 16064 13013 19865
8917A9865j3784J8112P059k922J9427j551j9970k8971m85J3376j50J1885j9205
$$ 19865 6081 24193 31252 28330 47757 46206 26236 -2735 -3220 10156 10006 21891 2686
8904B686k6413L851M1912K309k2148k6445P08j1486O364O3015o644j4835J5444
$$ 2686 -23727 -19876 22036 24345 2197 -24248 -23540 -35026 -28662 34353 27709 12874 28318
8891B8318k96N528r599n903K931k3083l7377j0872J8477J3094q019J0418J4442
$$ 28318 28022 33550 23951 18048 20979 -2104 -39481 -50353 -31876 -18782 -26801 -16383 -1941
8878a941J1825J1017K8469P692Q172J2474p037k6146j601l571k1537k1141O771
$$ -1941 9884 20901 49370 57062 65234 77708 70671 44525 42924 39353 17816 -3325 3446
8865C446O340K0435J4650k4674j4596j5575P634j8288J6014L8530O361k7582k2325
$$ 3446 9786 30221 44871 20197 5601 -9974 -2340 -20628 -4614 33916 40277 12695 -9630
8852i630m247N442Q740L1594J9803j4086k8313o694j3034j4558J0897k849K4238
$$ -9630 -13877 -8435 305 31899 51702 37616 9303 2609 -10425 -24983 -14086 -16935 7303
8839G303J5624k1264k5033J373l074l4076J9305K1850K7159j3839k3401K6101
$$ 7303 22927 1663 -23370 -21997 -25071 -59147 -39842 -17992 9167 -4672 -28073 -1972
8827a972K4508R084K5026l3653k7270J516N158J05K2337J761N58r870l2356l7286
$$ -1972 22536 31620 56646 22993 -4277 -2761 2397 2502 24839 26600 27158 17288 -15068 -52354
8813e2354J4010R176j2371K8962P1084J223m3714k1404J2376n834q572K0760m6984
$$ -52354 -38344 -29168 -41539 -12577 58507 59730 16016 -5388 6988 1154 -7418 13342 -33642
8800c3642l0460J2373K3981J4349K194j0410j0440N388J6304j0626l9932M550
$$ -33642 -64102 -51729 -27748 -13399 -11205 -21615 -32055 -26667 -10363 -20989 -60921 -56371
8788e6371K7960j298J3125J1595K138k998L5655K313k9499J0096J0093j6622K7447
$$ -56371 -28411 -29709 -16584 -4989 -2851 -5849 29806 32119 2620 12716 22809 6187 33634
8775C3634J8275j135j634j0585k2751k097L202M930k899J112K7463p388j8291
$$ 33634 51909 50774 49140 38555 15804 13707 16909 21839 18940 20052 47515 40127 21836
8762B1836P38N709q274k063p542k212j365j6021l3803J8937N0459m008J228j0886
$$ 21836 22574 28283 20009 17946 10404 8192 6827 -9194 -42997 -24060 26399 22391 23619 12733
8748A2733j1728k3722j853j2782J1660J8802j675J2137J3229R133j3416l2461
$$ 12733 1005 -22717 -24570 -37352 -25692 -6890 -8565 3572 16801 25934 12518 -19943
8736a9943M235p2L898j6505J8310J9501K63O314r340m8912p721O889j3424L3549
$$ -19943 -15708 -15780 -11882 -28387 -10077 9424 9687 16001 6661 -42251 -49972 -43083 -56507 -22958
8722b2958J1011p602Q584r465J8842n997j5895L03k0954O785J9012K406k8589
$$ -22958 -11947 -19549 -10965 -20430 -1588 -7585 -23480 -23177 -44131 -37346 -18334 -15928 -44517
8709d4517R196N422k5639p490M035R373J0862O276j7278K7201K5515L1921R586
$$ -44517 -35321 -29899 -55538 -63028 -58993 -49620 -38758 -32482 -49760 -22559 2956 34877 44463
8696D4463n6669j0930Q621j0596j1199J6637L940K0572K9817j7867k3867r092
$$ 44463 -12206 -23136 -14515 -25111 -36310 -19673 -15733 4839 34656 16789 -7078 -16170
8684a6170q900r029j9939K2780M210N597J9723M2457J9678k2764j4658p733j2358
$$ -16170 -25070 -34099 -54038 -31258 -27048 -21451 -1728 40729 60407 37643 22985 15252 2894
8671B894m632J7429N0894n428l8834k5665M985M943Q40J8310J6735k5966m2136
$$ 2894 -1738 15691 66585 61157 22323 -3342 1643 6586 7426 25736 42471 16505 -25631
8658b5631k5006J834L4028J7817M542j8391p254o981J8297L5503L284K369K495
$$ -25631 -50637 -48803 -14775 3042 7584 -10807 -18061 -25042 -6745 28758 32042 34411 36906
8645C6906K5010j231l3193j7012j4058n327O300P068Q107J7699J0690k9777r694
$$ 36906 61916 60685 27492 10480 -3578 -8905 -2605 4463 12570 30269 40959 11182 1488
8632A488J1388K230p547J1088L2024j7032j2936l82J2956O987m204k4885J3743
$$ 1488 12876 15106 7559 18647 50671 33639 20703 20321 33277 40264 36060 11175 24918
8619B4918J029k5134P876l592l2309j9959J0554K1462K4018K9305J5992j8748
$$ 24918 25947 813 8689 5097 -27212 -47171 -36617 -15155 8863 38168 54160 35412
8607C5412k5926J9198J6656j5341l8806j8978N78K5317n843j1078L2255m15K971
$$ 35412 9486 28684 45340 29999 -8807 -27785 -27207 -1890 -7733 -18811 13444 13029 16000
8594A6000j2163k673R564P48j0799m423M229J9783j5064n600J1557J2172K1856
$$ 16000 3837 1164 10728 11476 677 -3746 483 20266 5202 -398 11159 23331 45187
8581D5187p116j5749p44k394j0109O447K5986j1727j1966l1217p264j547J1657
$$ 45187 38071 22322 21578 19184 9075 15522 41508 29781 17815 -13402 -20666 -22213 -10556
8568a0556k8357p301K6952m002J1711o316j8381P221L8832Q677p255k1057N094
$$ -10556 -38913 -46214 -19262 -23264 -11553 -17869 -36250 -29029 9803 18480 11225 -9832 -4738
8555d738l897r649O4679M024m6644q732k526l298R058M938N257j0960q014m362
$$ -4738 -8635 -18284 46395 50419 3775 -4957 -7483 -10781 -1723 3215 8472 -2488 -10502 -14864
8541a4864J7676K6235k343k5022N954q048r689p996k6909j3536K3499M7319L727
$$ -14864 2812 29047 26704 1682 7636 -412 -10101 -18097 -45006 -58542 -35043 12276 16003
8528A6003j6127o456q699l6822J0121K4728j7740j4721N517J9842p599r688L5441
$$ 16003 -124 -6580 -15279 -52101 -41980 -17252 -34992 -49713 -44196 -24354 -31953 -41641 -6200
8515f200J9397p613J4836j4327j9551J3344P236j979k3722j4258j0383L865J9365
$$ -6200 13197 5584 20420 6093 -13458 -114 7122 5143 -18579 -32837 -43220 -39355 -19990
8502a9990M2885M721n706k682J3644O250j1684j8180o29K3084Q003n428m1682
$$ -19990 22895 27616 21910 19228 32872 39122 27438 9258 8629 31713 39716 34288 -7394
8489g394r863L8839J2806l0216o147L3031K0122Q441j4397q818k174p982m958
$$ -7394 -17257 21582 34388 4172 -1975 31056 51178 59619 45222 36404 34230 26248 21290
8476B1290k8093l623J4305j3017j7875o258l852M6738N5899J1732q331p563k6376
$$ 21290 -6803 -10426 3879 -9138 -27013 -33271 -37123 9615 65514 77246 68915 61352 34976
8463C4976k7759o0092k5559L0330L1585M1627o520J8689R608j4173k1081j9550
$$ 34976 7217 -52875 -78434 -48104 -16519 25108 18588 37277 46885 32712 11631 -7919
8451g919k223N105Q270J6908K500m3688L156L5141j4573j406l211L506J1565K3663
$$ -7919 -10142 -5037 3233 20141 22641 -21047 -17891 17250 2677 1271 -1940 1566 13131 36794
8437C6794J6578J444j9366J1338P916J0106j6036k9714l3442k2154q60k2266J0186
$$ 36794 53372 54816 35450 46788 54704 64810 48774 19060 -14382 -36536 -37396 -59662 -49476
8424d9476K4307J1397P183k4302j7830R313J6129L0087m674l7601k223M6088R925
$$ -49476 -25169 -13772 -6589 -30891 -48721 -39408 -23279 6808 2134 -35467 -37690 8398 18323
8411A8323l6566j4747j061M5159M6027k0690k8920j3253j5264J1141K2410j12
$$ 18323 -18243 -32990 -34051 11108 57135 36445 7525 -5728 -20992 -9851 12559 12447
8399A2447P613p914M477K3068J5655J406k6188J958r885p159j5007J0499J6884
$$ 12447 20060 12146 16623 39691 55346 56752 30564 32522 22637 15478 471 10970 27854
8386B7854l374j7168j6178J1707O295J6200p097K149m566J2853J0788J7184j849
$$ 27854 24480 7312 -8866 2841 9136 25336 18239 20388 15822 28675 39463 56647 54798
8373E4798k3554R45o050O79J4239m73q547J1606K0758m361k9455k4429j5080k8232
$$ 54798 31244 32189 26139 26818 41057 40584 32037 43643 64401 60040 30585 6156 -8924 -37156
8359c7156P456j4596L202L2495K6250R829l150J193j4744j2359P993K3317j35
$$ -37156 -29700 -44296 -41094 -8599 17651 27480 24330 25523 10779 -1580 6413 29730 29595
8346B9595L572K8097l925j2211j2554j1660k2423j1298k1359J2606J9440L9955
$$ 29595 33167 61264 57339 45128 32574 20914 -1509 -12807 -34166 -21560 -2120 37835
8334C7835k5028k6822p65J0880K4524j0616l0277j6678J3248j683J6326J3475
$$ 37835 12807 -14015 -14780 -3900 20624 10008 -20269 -36947 -23699 -25382 -9056 4419
8322D419J6144k3495k5986L1901K4930P781m6749l653K1174j990M303J3392j5756
$$ 4419 20563 -2932 -28918 2983 27913 35694 -11055 -14708 6466 4476 8779 22171 6415
8309F415J255R430m369K1571k8659m8128J0891J4707J6000n452j8949q824q234
$$ 6415 7670 17100 12731 34302 5643 -42485 -31594 -16887 -887 -6339 -25288 -34112 -42346
8296d2346o847q384L03L1232M9627J5231k1343l088J5043l7372k4181K804J5985
$$ -42346 -49193 -57577 -57274 -26042 23585 38816 17473 14385 29428 -7944 -32125 -29321 -13336
8283a3336K2592k844p217r851j0582Q58L1881M048l150j3107p382p55L172L8256
$$ -13336 9256 6412 -805 -10656 -21238 -20380 11501 15549 12399 -708 -8090 -8845 -5673 32583
8269C2583l402l6610j8710k3650J712J2308L1895q232o80k1233j6461L1410J7988
$$ 32583 29181 -7429 -26139 -49789 -48077 -35769 -3874 -12106 -12786 -34019 -50480 -19070 -1082
8256a082j0135J1117J1065m147k9420j9856j2062n103j6211m011M2233K8000K3330
$$ -1082 -11217 -100 10965 6818 -22602 -42458 -54520 -59623 -75834 -79845 -37612 -9612 13718
8243A3718K6299k3218J05k8086j1641K7517j415l6498k1919K5621J4889n511L6304
$$ 13718 40017 16799 16904 -11182 -22823 4694 3279 -33219 -55138 -29517 -14628 -20139 16165
8230A6165O761k9748k1639J9419K4346K8852n45O861j5821m6601n285m075J9525
$$ 16165 22926 -6822 -28461 -9042 15304 44156 43611 50472 34651 -11950 -17235 -21310 -1785
8217a785q119K2650J9672m003l948q289J2638K745l3767j194N246j7788J645K7564
$$ -1785 -9904 12746 32418 28415 24467 16178 28816 31561 -2206 -3400 1846 -15942 -14297 13267
8203A3267n9k1851m0514J6407q81J6699J1187K132k8644k0697K1639K0571J5669
$$ 13267 13208 -8643 -49157 -32750 -33631 -16932 -5745 -3613 -32257 -52954 -31315 -10744 4925
8190D925O16J0088J1486p382r841p55j4960p919Q866J1931j468J1303j0430l5032
$$ 4925 5541 15629 27115 19733 9892 9137 -5823 -13742 -4876 7055 5587 16890 6460 -28572
8176b8572m557L572l9804r875L6954M9029L3754M911j6764j2051R940l6640m0238
$$ -28572 -33129 -29557 -69361 -79236 -42282 6747 40501 45412 28648 16597 26537 -10103 -50341
8163e0341J6333L7888l952K8718J8623j8545l7994k8886L4291K5465j7386j5626
$$ -50341 -34008 3880 -72 28646 47269 28724 -9270 -38156 -3865 21600 4214 -11412
8151a1412l681N844j5515J3450K2516K787J6518j8472j9021n336k2936J1606l036
$$ -11412 -15093 -9249 -24764 -11314 11202 13989 30507 12035 -6986 -12322 -35258 -23652 -26688
8138b6688J7103K3099J5158k9004l4993k6736P828K0112J2332R478j154P999J3666
$$ -26688 -9585 13514 28672 -332 -35325 -62061 -54233 -34121 -21789 -12311 -13465 -5466 8200
8125H200P810N186k1407j4223o73k5780j0735K4888K9997M833k8554j26q231j4615
$$ 8200 16010 21196 -211 -14434 -15107 -40887 -51622 -26734 3263 8096 -20458 -20584 -28815 -43430
8111d3430p713K4860J9415J3628M507L578Rk281q060r230O304j2437J3412L0300
$$ -43430 -51143 -26283 -6868 6760 11267 14845 14854 12573 4513 -4717 1587 -10850 2562 32862
8097C2862J5229k6849p693m306k735O004K5668p102j2292k4551o966J1250k718
$$ 32862 48091 21242 13549 9243 6508 12512 38180 31078 18786 -5765 -12731 -1481 -4199
8084d199L0801p737j6130j4332R727J0893k453k0872K960J7141j2876k5526Q244
$$ -4199 26602 18865 2735 -11597 -1870 9023 6570 -14302 -11342 5799 -7077 -32603 -24359
8071b4359J2287K1226j807l622l850k810q883k8386j0249J0084J7633J5507l02
$$ -24359 -12072 9154 7347 3725 -125 -2935 -11818 -40204 -50453 -40369 -22736 -7229 -7531
8058g531M756k7100k062J6749k8364J6023K9877o480p549j2388n264P965k6925
$$ -7531 -2775 -29875 -31937 -15188 -43552 -27529 2348 -4132 -11681 -24069 -29333 -21368 -48293
8045d8293m943J4129J1148n775J1049L192l6790O193K4218L538o195L706N734
$$ -48293 -53236 -39107 -27959 -33734 -22685 -19493 -56283 -50090 -25872 -22334 -28529 -24823 -19089
8032a9089J781K9397J1004O455K834j1896L556K1384j493j0371J6924k3528l7715
$$ -19089 -17308 12089 23093 29548 32382 20486 24042 45426 43933 33562 50486 26958 -10757
8019a0757j9802n779J9715N7746L6182k5150l1741j0889j7638P54K9819L367J813
$$ -10757 -30559 -36338 -16623 41123 77305 52155 20414 9525 -8113 -7359 22460 25827 27640
8006B7640K1910k5605k3625L829j216P59J512l1210p909L2594J4772l2139k6058
$$ 27640 49550 23945 320 4149 2933 3692 5204 -26006 -33915 -1321 13451 -18688 -44746
7993d4746J2859j354O831J9100L7324J4257o355j4314j5288O625K382n481k1652
$$ -44746 -31887 -33241 -26410 -7310 30014 44271 37916 23602 8314 14939 17321 11840 -9812
7980i812K238j9744Q17l913L984K1088o216M095L2205J4292L0174j509m9602m1345
$$ -9812 -7574 -27318 -26501 -30414 -26430 -5342 -11558 -7463 24742 39034 69208 67699 18097 -23248
7966b3248P90r133J3280K2467K4322j0380j5036k717k3497P160J818K1175j848
$$ -23248 -22458 -31591 -18311 4156 28478 18098 3062 345 -23152 -15992 -14174 7001 5153
7953E153J0527N558j0238p959m942k4844j2081J1964K4033J7507L4644p087l0852
$$ 5153 15680 21238 11000 3041 -1901 -26745 -38826 -26862 -2829 14678 49322 42235 11383
7940A1383q46j8159p822l090j1383k1373k6402N583M8083K5219K4028j7328o926
$$ 11383 10537 -7622 -15444 -18534 -29917 -51290 -77692 -72109 -24026 1193 25221 7893 967
7927I67k6294K898Q336K6352L5473J6646q184o0771j0528K3658K5041l303q759
$$ 967 -25327 -22429 -14093 12259 47732 64378 56194 -4577 -15105 8553 33594 30291 21532
7914B1532j0416O780Q967k2988J4294J3328k0457k8390r733R755L468L6614q111
$$ 21532 11116 17896 26863 3875 18169 31497 11040 -17350 -27083 -17328 -13860 22754 14643
7901A4643j3393R407o668o316j1130j817K0493L9241K3679k5082j3138m133r697
$$ 14643 1250 10657 3989 -2327 -13457 -15274 5219 44460 68139 43057 29919 25786 16089
7888A6089k2223p965j1421N950M0353J0195o328M199R083L861K812o095k1801
$$ 16089 -6134 -14099 -25520 -19570 20783 30978 24650 28849 37932 41793 44605 38510 16709
7875A6709l8647O76k4882j5254N610L3162L9515P17J2263k7181j2949J2842j991
$$ 16709 -21938 -21262 -46144 -61398 -55788 -22626 16889 17606 29869 2688 -10261 2581 590
7862E90k0126j2168J4495L6389P612k4047k3294R195O753L480j5114k454J1019
$$ 590 -19536 -31704 -17209 19180 26792 2745 -20549 -11354 -4601 -1121 -16235 -18689 -7670
7849g670Q233J2466m644K0061k870k7383K777q975R48k9852J2553J0846J432J5377
$$ -7670 563 13029 8385 28446 25576 -1807 970 -8005 -7057 -36909 -24356 -13510 -12078 3299
7835C299J0591j7351k191J5252j5204o691R726K8929j2702J6242j5296j719M803
$$ 3299 13890 -3461 -5652 9600 -5604 -12295 -2569 26360 13658 29900 14604 12885 17688
7822A7688K0554j0595J6648j0251j8918l3894j2786L1613j2278j5782Q600K4547
$$ 17688 38242 27647 44295 34044 15126 -18768 -31554 59 -12219 -28001 -19401 5146
7810E146j3490k5529J1670M112J1752J1358k6443J2966q420j570k5003L3738J1565
$$ 5146 -8344 -33873 -22203 -18091 -6339 5019 -21424 -8458 -16878 -18448 -43451 -9713 1852
7797A852k9850k5079O334J5487R873J394l798Q357J9801J6747j5204O705j488
$$ 1852 -27998 -53077 -46743 -31256 -21383 -19989 -23787 -15430 4371 21118 5914 12619 11131
7784A1131M363N502P466J9886R127l5411k1366p792j2934Q892l3901l799J8426
$$ 11131 15494 20996 28462 48348 57475 22064 698 -7094 -20028 -11136 -45037 -48836 -30410
7771c0410K5593J5338n538k1730m0582K1248N2282M8625j0333n3919k6505J0352
$$ -30410 -4817 10521 4983 -16747 -57329 -36081 16201 64826 54493 574 -25931 -15579
7759a5579N160R800J1433R123M041P556O630r564k1649l2737j926N0651o197j5362
$$ -15579 -10419 -619 10814 19937 23978 31534 38164 28600 6951 -25786 -27712 22939 16742 1380
7745A380O748J4403P821o502j5677k7545J0729K0808j1650K917m892k2306J3209
$$ 1380 8128 22531 30352 23850 8173 -19372 -8643 12165 515 3432 -1460 -23766 -10557
7732a0557J0071R722J8312m390n1692k8199J4945O523o081r1O508J7005J7548
$$ -10557 -486 9236 27548 23158 -28534 -56733 -41788 -35265 -41346 -41437 -34929 -17924 -376
7719c76O062l7072j0631K5839K0898J8391J7285L500j6658k8732K783m728j8513
$$ -376 5686 -31386 -42017 -16178 4720 23111 40396 43896 27238 -1494 1289 -3439 -21952
7706b1952j6131m434L1092m043j3893J8676L596M054L127J0148J0127j8709j2040
$$ -21952 -38083 -42517 -11425 -15468 -29361 -10685 -7089 -3035 92 10240 20367 1658 -10382
7693a0382L279J1373o39n300J5721L3837L4649k3018k6460k5850k3460K3542M5658
$$ -10382 -7103 4270 3631 -1669 14052 47889 82538 59520 33060 7210 -16250 7292 52950
7680E2950j0059l7297k1521R074r295Q12r021j7598J4608j1255K3348n449j5577
$$ 52950 42891 5594 -15927 -6853 -16148 -15336 -24357 -41955 -27347 -38602 -15254 -20703 -36280
7667c6280j1837J6991J3475M630J7775M819L946n411q754N949J0464J3012j5455
$$ -36280 -48117 -31126 -17651 -13021 4754 9573 13519 8108 -646 5303 15767 28779 13324
7654A3324j0828m480j0168p123O872K4775N961J8863k535L6214j4829k8753k3164
$$ 13324 2496 -1984 -12152 -19275 -12403 12372 18333 37196 34661 70875 56046 27293 4129
7641D129j3193K1108j6899j2341J6293J2271K6876k7945l6064q037K4082J6234
$$ 4129 -9064 12044 -4855 -17196 -903 11368 38244 10299 -25765 -33802 -9720 6514
7629F514l4122n388K2973J8364l91J6947j896k4449J1784p598j4716J0540J6951
$$ 6514 -27608 -32996 -10023 8341 7950 24897 23001 -1448 10336 2738 -11978 -1438 15513
7616A5513k069J9522j1678p850j2608j2948R62J1366R628k3552k3150j7788m4182
$$ 15513 13444 32966 21288 13438 830 -12118 -11156 210 9838 -13714 -36864 -54652 -98834
7603i8834p686P994M5446J0527J6466K0134j1600J0566K7927M479q552k1590j6848
$$ -98834 -106520 -98526 -53080 -42553 -26087 -5953 -17553 -6987 20940 25419 16867 -4723 -21571
7590b1571J7130k8502j6238J0917j6668J8485k490J3241r350r061K7081j8636
$$ -21571 -4441 -32943 -49181 -38264 -54932 -36447 -38937 -25696 -35046 -44107 -17026 -35662
7578c5662J037K7492l0936J512o532k1218J6352R578J8647L834j0144O153l30
$$ -35662 -34625 -7133 -38069 -36557 -43089 -64307 -47955 -38377 -19730 -15896 -26040 -19887 -20217
7565b0217L5667j1390j5484k1025l56j1252J4204K4287n766J5197K0296P219k2593
$$ -20217 15450 4060 -11424 -32449 -32805 -44057 -29853 -5566 -11332 3865 24161 31380 8787
7552H787l2544J0401L6471M848k1221l698m419N670L543n092R824m07q933J9144
$$ 8787 -23757 -13356 23115 27963 6742 3044 -1375 4295 7838 2746 12570 12163 3230 22374
7538B2374k2620l6364J2912M4823K6831j3930k7201k6480l8157k648L9873K6351
$$ 22374 -246 -36610 -23698 21125 47956 34026 6825 -19655 -57812 -60460 -20587 5764
7526E764p088K9388K2583K592l4879M686J3524m067l5980m7223k948k8315L1743
$$ 5764 -1324 28064 50647 53239 18360 23046 36570 32503 -3477 -50700 -53648 -81963 -50220
7513e0220M8425K2790K012j4531J0483J0842K5654J8709P636k7664m1179l1312
$$ -50220 -1795 20995 23007 8476 18959 29801 55455 74164 81800 54136 12957 -18355
7501a8355R273j2329j7055J6538j055K6484K0658j0697n732R441O62L3969K7408
$$ -18355 -9082 -21411 -38466 -21928 -22983 3501 24159 13462 7730 17171 17833 51802 79210
7488G9210l5400k6894n273r101j1775K2915j7368o551K917P870J4805J308o590
$$ 79210 43810 16916 11643 2542 -9233 13682 -3686 -10237 -7320 550 15355 16663 10073
7475A0073k7468q59j9319j667J4219P786k34L052j2886k1708l80K2464L5769R081
$$ 10073 -17395 -18254 -37573 -39240 -25021 -17235 -17469 -14417 -27303 -49011 -49391 -26927 8842 17923
7461A7923n8J7547k539J475q596j1673j2060J3959j265j5993N107M842r671N043
$$ 17923 17865 35412 32873 34348 25752 14079 2019 15978 14713 -1280 3827 8669 -1002 4041
7447D041K7252j1495J4744P328j3888J3509j3906p535j7309q44j6140j8082Q112
$$ 4041 31293 19798 34542 41870 27982 41491 27585 20050 2741 1897 -14243 -32325 -24213
7434b4213J9045l449L267K157K3958J8772m3033r630K2462n88j7404L6479J3733
$$ -24213 -5168 -8617 -5350 -3193 20765 39537 -3496 -13126 9336 8748 -8656 27823 41556
7421D1556q838k4680j8044J0672j1866j3721l307J5566J1064J7771j737k067l112
$$ 41556 32718 8038 -10006 666 -11200 -24921 -28228 -12662 -1598 16173 14436 12369 9257
7408I257k5508k0051J2372Q606L72j2599k5264N771Q737K9965L429j3985J968
$$ 9257 -16251 -36302 -23930 -15324 -14952 -27551 -52815 -47044 -38307 -8342 -4913 -18898 -16930
7395a6930j9450J4322J2187L2286O359j494J2040r591j5728j4625J9718j0069
$$ -16930 -36380 -22058 -9871 22415 28774 27280 39320 29729 14001 -624 19094 9025
7383I025k371j2133m970k4571J3865O258Q461k3149k1119L6865J1830k0477j2918
$$ 9025 6654 -5479 -10449 -35020 -21155 -14897 -6436 -29585 -50704 -13839 -2009 -22486 -35404
7370c5404K0910J3120l485P047j9522k504j2680m429O974j5342K877K7614J1827
$$ -35404 -14494 -1374 -4859 2188 -17334 -19838 -32518 -36947 -29973 -45315 -42438 -14824 -2997
7357b997p880k433R023j4080K837Q461L5641J560j2058k1164k7199K6961L2706
$$ -2997 -10877 -13310 -4287 -18367 -15530 -7069 28572 30132 18074 -3090 -30289 -3328 29378
7344B9378K7119m109k9157N634Q147O334k3815j4206j8123K2968K1071j3607k7286
$$ 29378 56497 52388 23231 28865 37012 43346 19531 5325 -12798 10170 31241 17634 -9652
7331i652j1219q269K8743N925q126j8835k1050P612J3714k34J6196K4466O620
$$ -9652 -20871 -29140 -397 5528 -2598 -21433 -42483 -34871 -21157 -21391 -5195 19271 25891
7318B5891k3145P410k657j0371M027m953K0406L335K0206J7651k5875l4949K5887
$$ 25891 2746 10156 7499 -2872 1155 -3798 16608 19943 40149 57800 31925 -3024 22863
7305B2863J5950P932l798n860M0982j3480m8667J1798J8300q306k0620k0316p659
$$ 22863 38813 46745 42947 37087 78069 64589 15922 27720 46020 37714 17094 -3222 -10881
7292a0881k1681O53m57J084J5509j0904j1344K238k500J9760J2814k0682J8146
$$ -10881 -32562 -31909 -32366 -31282 -15773 -26677 -38021 -35783 -38283 -18523 -5709 -26391 -8245
7279h245J0034r330L829K4628l5350k1791k7732L1313K8577L863j3719k6366l607
$$ -8245 1789 -7541 -3712 20916 -14434 -36225 -63957 -32644 -4067 -204 -13923 -40289 -43896
7266d3896k941k2336R056L1437J9919J893m84Q19k3036K1990J0744K0751J0467
$$ -43896 -46837 -69173 -60117 -28680 -8761 -6868 -7352 -6533 -29569 -7579 3165 23916 34383
7253C4383k3549l4236j6040j7503N369J5452M0267J0485N711N024j000j1072k8286
$$ 34383 10834 -23402 -39442 -56945 -51576 -36124 4143 14628 20339 25363 24363 13291 -14995
7240a4995J084j420o297j39l760j0815L1843K3290r130k0286j267R403K2494L8595
$$ -14995 -13911 -15331 -21628 -21767 -25527 -36342 -4499 18791 9661 -10625 -11892 -2489 20005 58600
7226E8600j717k0704j5393l96O152J1044l3300j1618K2589l1986l9175K0221k30
$$ 58600 56883 36179 20786 20390 26542 37586 4286 -7332 15257 -16729 -55904 -35683 -35913
7213c5913r117J1519m352J1434J2691j0955n739P742J3012P596k8798J1322K6179
$$ -35913 -45030 -33511 -37863 -26429 -13738 -24693 -30432 -22690 -9678 -2082 -30880 -19558 6621
7200F621J1995J5362j3800k1617j0525N26J2317K7900O617m0713j1997N689L490
$$ 6621 18616 33978 20178 -1439 -11964 -11438 879 28779 35396 -5317 -17314 -11625 -8135
7187h135j008J0106N194J8464L7472l8902l6028k3037N649Q765O091J3400L5422
$$ -8135 -9143 963 6157 24621 62093 23191 -12837 -35874 -30225 -21460 -15369 -1969 33453
7174C3453L98m0169k3358j4996j6559Q775J0864J7244K7067O17P586j0076r014
$$ 33453 33851 -6318 -29676 -44672 -61231 -52456 -41592 -24348 2719 3336 10922 846 -8168
7161h168j7500R138J167J6969n171j5164l069K0016l742j9851J6951J8257r25
$$ -8168 -25668 -16530 -15363 1606 -3565 -18729 -21798 -1782 -5524 -25375 -8424 9833 8908
7148H908q604J9245K2977k019k7412J4870k6616j8312L4439K0447j1436k1511
$$ 8908 304 19549 42526 40507 13095 27965 1349 -16963 17476 37923 26487 4976
7136D976n0414l9575Q983J2829K6619K5763n670j2884p288j6310l6799j8650K0015
$$ 4976 -45438 -85013 -76030 -63201 -36582 -10819 -16489 -29373 -36661 -52971 -89770 -108420 -88405
7123h8405L5574K6033K2646R300J2005m764l21k4446j6632J8246J1423j620j2776
$$ -88405 -52831 -26798 -4152 5148 17153 12389 12068 -12378 -29010 -10764 659 -961 -13737
7110a3737J6557j2288j5215N490J5291J4663O111l1342k296L737R136l0971m44
$$ -13737 2820 -9468 -24683 -19193 -3902 10761 16872 -14470 -16766 -13029 -3893 -34864 -35308
7097c5308O614j8844K646J459j7030L2645M290J122l4023J9341K3805m057n828
$$ -35308 -28694 -47538 -44892 -43433 -60463 -27818 -23528 -22406 -56429 -37088 -13283 -17340 -23168
7084b3168J0788L365J5341P18l372R155q192O362J2676k078k7390p983m19l2841
$$ -23168 -12380 -9015 6326 7044 3672 12827 4635 10997 23673 21595 -5795 -13778 -14197 -47038
7070d7038k332M8164K3013M1258j3678n698j1213j4703J4676j4711k8197n633
$$ -47038 -49370 -1206 21807 63065 49387 43689 32476 17773 32449 17738 -10459 -16092
7058a6092m254J3030Q554N301j9782k0766Q717K4697j2838k1417r489J9178j3726
$$ -16092 -20346 -7316 1238 6539 -13243 -34009 -25292 -595 -13433 -34850 -44339 -25161 -38887
7045c8887l73L4558J9360P429K98L3051M140q061k7650l234J3084n678m486J1110
$$ -38887 -39260 -4702 14658 22087 22385 55436 59576 51515 23865 20631 33715 28037 23551 34661
7031C4661J5923R840j5869j1223j2745j2073p737k42o258j0927j1652J1418J9083
$$ 34661 50584 60424 44555 33332 20587 8514 777 535 -5723 -16650 -28302 -16884 2199
7018B199J3831J976J0748q531L545j9209k1800k3018P464Q320N213l3154L4312
$$ 2199 16030 18006 28754 20223 23768 4559 -17241 -40259 -32795 -24475 -19262 -52416 -18104
7005a8104M5626j2627p102j2560l865j5787J0634J0475J9103K6602J667k2292
$$ -18104 27522 14895 7793 -4767 -8632 -24419 -13785 -3310 15793 42395 44062 21770
6993B1770j1208l0911j4240K124O468J704J0718p783J3961j6588N618J0825o877
$$ 21770 10562 -20349 -34589 -32465 -25997 -24293 -13575 -21358 -7397 -23985 -18367 -7542 -14419
6980a4419k9994K9728J5354k3263j727N6114kk1408l321N815M790j5475j1885
$$ -14419 -44413 -14685 669 -22594 -24321 31793 31791 10383 7062 12877 17667 2192 -9693
6967i693K7751K2234k72j7360J0642m681J3804M91k6356M126q000m219J3772Q961
$$ -9693 18058 40292 40020 22660 33302 28621 42425 42916 16560 20686 12686 8467 22239 31200
6953C1200J8192k283l2472k9802k2278j0846k8948l1266J6081N5093M4016L1788
$$ 31200 49392 47109 14637 -15165 -37443 -48289 -77237 -108503 -92422 -37329 6687 38475
6941C8475J8476k9435j4702j3152r49J371J3615J281P678n68q301M035J4616J2421
$$ 38475 56951 27516 12814 -338 -1287 84 13699 14980 22658 22090 13789 17824 32440 44861
6927D4861L4422l0831j9043J089K146J605k4081k3068J67L248L6153K4146j2165
$$ 44861 79283 48452 29409 30498 32644 34249 10168 -12900 -12733 -9485 26668 50814 38649
6914C8649j5747j6485k2333k0656j3929L309M1075J6219k4965j6622n596j597
$$ 38649 22902 6417 -15916 -36572 -50501 -47192 -6117 10102 -14863 -31485 -37081 -38678
6902c8678M3938M9818K1247m0177j6688m1329j4172J6040K6850J3949K6662Q037
$$ -38678 5260 55078 76325 36148 19460 -21869 -36041 -20001 6849 20798 47460 55497
6890E5497l1840k5813n545N946J4827n425m137m123j2315j549j9131j2940K4166
$$ 55497 23657 -2156 -7701 -1755 13072 7647 3510 -613 -12928 -14477 -33608 -46548 -22382
6877b2382L5915j2289j636L419j436j4962k8457p077P199K7564J0703j8037J9879
$$ -22382 13533 1244 -392 3027 1591 -13371 -41828 -48905 -41706 -14142 -3439 -21476 -1597
6864a597J9022j3406k2530j3404j7630J3078o917N611k7480j2632L68J7906M796
$$ -1597 17425 4019 -18511 -31915 -49545 -36467 -43384 -37773 -65253 -77885 -77517 -59611 -54815
6851e4815K5439j1035K2067J965M1808n604k3707j5833J2698J7457m908l887j7855
$$ -54815 -29376 -40411 -18344 -16379 25429 19825 -3882 -19715 -7017 10440 5532 1645 -16210
6838a6210j6671j3207M6578M9754k1815k3325j0287j3223P225p769o505r033K0899
$$ -16210 -32881 -46088 490 50244 28429 5104 -5183 -18406 -11181 -18950 -25455 -34488 -13589
6825a3589J2730j3629J1117J7443J500k0469N420l8210k5076K2102K1119J7028
$$ -13589 -859 -14488 -3371 14072 15572 -4897 523 -37687 -62763 -40661 -19542 -2514
6813b514j221j9552j909o305o299R37L1166k320o980q02O714M888j7823K4119
$$ -2514 -3735 -23287 -25196 -31501 -37800 -36863 -5697 -8017 -14997 -15799 -9085 -4197 -22020 2099
6799B099j038k8726O30J3038L0627m061l6146L3451K897j5219k3203M8225j297
$$ 2099 1061 -27665 -27035 -13997 16630 12569 -23577 9874 12771 -2448 -25651 22574 21277
6786B1277l3587j2607J626R910j5470j4025J8651K6704m347p032l477M793j0269
$$ 21277 -12310 -24917 -23291 -13381 -28851 -42876 -24225 2479 -1868 -8900 -12377 -7584 -17853
6773a7853J0010K6252M815m013p32j2264Q796j7104Q366O469j2319j1322O335
$$ -17853 -7843 18409 23224 19211 18479 6215 15011 -2093 6273 12742 423 -10899 -4564
6760d564N969j3416k4817J4536k127L538j4405N228J1174l935K1628J248n839
$$ -4564 1405 -12011 -36828 -22292 -24419 -20881 -35286 -30058 -18884 -22819 -1191 57 -5782
6747e782J4923q118l5408J4601J5800o265J2369n436n8030J0521K5751K0431j9386
$$ -5782 9141 1023 -34385 -19784 -3984 -10249 2120 -3316 -61346 -50825 -25074 -4643 -24029
6734b4029j479n974M990L271j136q850j0457nJ7039P573K5851O910j8297k3234
$$ -24029 -25508 -31482 -26492 -23221 -24357 -33207 -43664 -43669 -26630 -19057 6794 13704 -4593 -27827
6720b7827L892J2262J6264j131R27o876k3123J8050R109L717k3382N237J4621
$$ -27827 -23935 -11673 4591 3460 4387 -2489 -25612 -7562 1547 5264 -18118 -12881 1740
6707A740j324O036k9833J9725M640R226l714l2511L804O177j3060K2964j8012
$$ 1740 416 6452 -23381 -3656 984 10210 6496 -26015 -22211 -16034 -29094 -6130 -24142
6694b4142K2996K6727M367q364m1386P290K038k6524j3216Q648L1155K7975l40
$$ -24142 -1146 25581 29948 21584 -19802 -12512 -10474 -36998 -50214 -41566 -10411 17564 17224
6681A7224l3877l4093L213J5490K6586L3598k6665q585Q601N4726K7284l610k8730
$$ 17224 -16653 -50746 -47533 -32043 -5457 28141 1476 -7109 1492 56218 83502 79892 51162
6668E1162j9895O024J1125j3912K6095k0574m7020l960j2324K770m834R647j157
$$ 51162 31267 37291 48416 34504 60599 40025 -6995 -10955 -23279 -20509 -25343 -15696 -16853
6655a6853L769J2153j8888P780J3975R204O0J9448K551k3052k4185j1126R202
$$ -16853 -13084 -931 -19819 -12039 1936 11140 11200 30648 33199 10147 -14038 -25164 -15962
6642a5962K6861R777N336J8340j2988j7133l3496O311o629p639J028K8175L624
$$ -15962 10899 20676 26012 44352 31364 14231 -19265 -12954 -19583 -27222 -26194 1981 5605
6629E605j3477k2878J202p784j0522J6994K3354J6228k3001m5119M664L7358j9147
$$ 5605 -7872 -30750 -29548 -37332 -47854 -30860 -7506 8722 -14279 -59398 -54734 -17376 -36523
6616c6523j5406M0099O1823k61j2799j2671k7145l5365K2265N4350k1514j2109
$$ -36523 -51929 -11830 49993 49732 36933 24262 -2883 -38248 -15983 38367 16853 4744
6604D744K4021l964n0298j3872J807N62j1124J6659L9536L9596K4841k9059n0351
$$ 4744 28765 24801 -25497 -39369 -37562 -37000 -48124 -31465 8071 47667 72508 43449 -6902
6591f902j8511J1609Q517q608N767P257m480l421J3786J4264p04k9261J1266l5642
$$ -6902 -25413 -13804 -5287 -13895 -8128 -871 -5351 -8772 5014 19278 18574 -10687 579 -35063
6577c5063l559L6734J2963j8441n373k8447O426J9944k4706N853L7971K4631k9670
$$ -35063 -38622 -1888 11075 -7366 -12739 -41186 -34760 -14816 -39522 -33669 4302 28933 -737
6564g37J0801K6584k718j3311J096j1385j3738R747m732M812J6353k881r550m916
$$ -737 10064 36648 33930 20619 21715 10330 -3408 6339 1607 6419 22772 19891 10341 5425
6550E425J2409L3613Q435l5991m6891K5710R842K4256L63j2220R610j1111r231
$$ 5425 17834 51447 59882 23891 -23000 2710 12552 36808 37171 24951 34561 23450 14219
6537A4219J0636K6613j6820p786J5574j8479m3374M450P792L047o074J6218n858
$$ 14219 24855 51468 34648 26862 42436 23957 -19417 -14967 -7175 -4128 -10202 6016 158
6524A58k9187J9496k2670r618R943L1300J2044k863k3054K0292K0110l119j0289
$$ 158 -29029 -9533 -32203 -41821 -31878 -578 11466 8603 -14451 5841 25951 22832 12543
6511A2543o440j2691Q780K2277j293K5089K3437O825k8535J1101j4138j7601l9470
$$ 12543 6103 -6588 2192 24469 23176 48265 71702 78527 49992 61093 46955 29354 -10116
6498a0116Q446N228J747j2742N938J5363O765k538p043j7118L4254J5912j9322
$$ -10116 -1670 3558 5305 -7437 -1499 13864 20629 18091 11048 -6070 28184 44096 24774
6485B4774J704k2067l588J3109K4712J9240k8561l7580K2449L8687J014j3180
$$ 24774 26478 4411 823 13932 38644 57884 29323 -8257 14192 52879 53893 40713
6473D0713r898j222J0048J7644j4568l4272j1738r918Q011L7470q324J78m6805
$$ 40713 30815 29593 39641 57285 42717 8445 -3293 -13211 -5200 32270 23946 24124 -22681
6460b2681p289L0141J247k31j8917K9392n281j1051L1311N67k4211J1830K0014
$$ -22681 -29970 171 1418 1187 -17730 11662 6381 -4670 26641 27208 2997 14827 34841
6447C4841k5211k6166p483O927J136K2383J5488L2740J3170j4974j9839J155K0205
$$ 34841 9630 -16536 -24019 -17092 -15956 6427 21915 54655 67825 52851 33012 34167 54372
6434E4372j0497j9301L414j1991K859j4980j8930J6921R657R959k2793n101r735
$$ 54372 43875 24574 27988 15997 18856 3876 -15054 1867 11524 21483 -1310 -6411 -16146
6421a6146j928J2732J800k7148k3688J4256M8783j4011K0957J8798j5906l7687
$$ -16146 -18074 -5342 -3542 -30690 -54378 -40122 8661 -5350 15607 34405 18499 -19188
6409a9188J3347K6554k3576j6807K8296L0920n005k212l4253k524N209o399K825
$$ -19188 -5841 20713 -2863 -19670 8626 39546 34541 32329 -1924 -4448 761 -5638 -2813
6396b813L004J4281j6455j7967l6761m175J8512L263J5389J4926R948K6074J1189
$$ -2813 191 14472 -1983 -19950 -56711 -60886 -42374 -39111 -23722 -8796 1152 27226 38415
6383C8415O61k6658J1825j2878Q684N359j3015l8583j2024k731Q325K5290J450
$$ 38415 39076 12418 24243 11365 20049 25408 12393 -26190 -38214 -40945 -32620 -7330 -5880
6370e880j8745j6387K5544K6476j122L5063M2063k3695l8819j3753m122l440j3579
$$ -5880 -24625 -41012 -15468 11008 9886 44949 87012 63317 24498 10745 6623 3183 -10396
6357a0396L0351Q008p056k2348M200J1884N97k0105n012j3058P160J6993j0106
$$ -10396 19955 27963 20907 -1441 2759 14643 15240 -4865 -9877 -22935 -15775 1218 -8888
6344h888J1698p492j6040k43N828J6254j444O387k758j2409K0016m538p933K8420
$$ -8888 2810 -4682 -20722 -20965 -15137 1117 -327 6060 3302 -9107 10909 6371 -1562 26858
6330B6858K992l8037k0398L5535j6119j3879k3044j5693M2271P298j5569J5551
$$ 26858 29850 -8187 -28585 6950 -9169 -23048 -46092 -61785 -19514 -12216 -27785 -12234
6318a2234J7525m30J60k5219j0727R562J7072J6030l263j4020J4590N696N00L666
$$ -12234 5291 4861 5021 -20198 -30925 -21363 -4291 11739 8476 -5544 9046 14742 15242 18908
6304A8908n0802J1570N665j0559k845J6060q328p967K6454J9656l943K05k3154
$$ 18908 -31894 -20324 -14659 -25218 -28063 -12003 -20331 -28298 -1844 17812 13869 14074 -9080
6291i080k2229j4808J4986J0202k438L2705L0092l7985j4595O009J9216J8552
$$ -9080 -31309 -46117 -31131 -20929 -23367 9338 39430 1445 -13150 -7141 12075 30627
6279C0627O654J0103m90k944q229j1567l1927J1395j3196l1028m378K7424K2460
$$ 30627 37281 47384 46894 43950 35721 24154 -7773 3622 -9574 -40602 -44980 -17556 4904
6266D904J117j2752N718N365J6015J1870Q784k421O873n498j7531M422J930N7
$$ 4904 6021 -6731 -1013 4352 20367 32237 41021 38600 45473 39975 22444 26866 28796 28853
6252B8853N219J5752J186l8764k0626J0237L311l0099j5069L0896J1438j1319
$$ 28853 34072 49824 51010 12246 -8380 1857 5168 -24931 -40000 -9104 2334 -8985
6240h985l2102J0524P798j6259R340R6j905k6843l5008R050Q927J7300L6160k2400
$$ -8985 -41087 -30563 -22765 -39024 -29684 -29588 -31493 -58336 -93344 -84294 -75367 -58067 -21907 -44307
6226d4307k157J5945j2208M065K5490K4872P757k2227J431K5195o201j0852O425
$$ -44307 -46464 -30519 -42727 -38662 -13172 11700 19457 -2770 -1339 23856 17655 6803 13228
6213A3228m908Q693L1052J786k7779k9761l5164J1241J0512R393K380m885j673
$$ 13228 8320 17013 48065 49851 22072 -7689 -42853 -31612 -21100 -11707 -9327 -14212 -15885
6200a5885o850o035j5069M622K1509J2974j198K805r923n012P101J1667k1936
$$ -15885 -22735 -28770 -43839 -39217 -17708 -4734 -5932 -3127 -13050 -18062 -10961 706 -21230
6187b1230j9865J3024L0320l873q040J732j0016p221L010O603j2393j7447m537
$$ -21230 -41095 -28071 2249 -1624 -9664 -7932 -17948 -25169 -22159 -15556 -27949 -45396 -49933
6174d9933l5431j3255N4220L5558j2620J3614r23l6201M8149P357q933K7326J9874
$$ -49933 -85364 -98619 -44399 -8841 -21461 -7847 -8770 -44971 3178 10535 1602 28928 48802
6161D8802k2010l9372M55L1693J0455k4936J1762k593k1175j4218j7909K651L424
$$ 48802 26792 -12580 -12125 19568 30023 5087 16849 14256 -6919 -21137 -39046 -36395 -32971
6148c2971L301R727K3462K5012j7418j795J3940j1119k1519j4679L367r368k2782
$$ -32971 -29670 -19943 3519 28531 11113 9318 23258 12139 -9380 -24059 -20692 -30060 -52842
6135e2842o677M787k0022j635M4924J9283N592J3264K4482k0465k353j42j1212
$$ -52842 -59519 -54732 -74754 -76389 -31465 -12182 -6590 6674 31156 10691 8338 8196 -3016
6122c016k3378k7024J6630L7384K8229J4380p159q557m616K13Q967M327m9502
$$ -3016 -26394 -53418 -36788 596 28825 43205 36046 27489 22873 23086 32053 36380 -13122
6109a3122l3200j2377m002L5416K8619J006o234L182K0984j684j3226o910k6520
$$ -13122 -46322 -58699 -62701 -27285 1334 2340 -3894 -712 20272 18588 5362 -1548 -28068
6096b8068j173J7812j8847k6982K0766L3693K0516N344P219N024j8989l7462q561
$$ -28068 -29241 -11429 -30276 -57258 -36492 -2799 17717 23061 30280 35304 16315 -21147 -29708
6083b9708j6010J6007J0604J371K4087J2744k0152k4611j8857j1267o029K446
$$ -29708 -45718 -29711 -19107 -17736 6351 19095 -1057 -25668 -44525 -55792 -61821 -59375
6071e9375K7853K4011J77r431J4597K1168j709m266l7372j544J2123K4517n13
$$ -59375 -31522 -7511 -7334 -16765 -2168 19000 17291 13025 -24347 -25891 -13768 10749 10236
6058A0236l3659k896K7063k2422j3477L7096J1958K213m2563j3517M1340M4043
$$ 10236 -23423 -26319 744 -21678 -35155 1941 13899 16112 -26451 -39968 1372 45415
6046D5415O168r874k848k6939m325o777q014R87K9003J4762j23j4567K369N133
$$ 45415 51583 41709 38861 11922 7597 820 -7194 -6207 22796 37558 37435 22868 25237 30370
6032C0370l3531k0537L1338R825l3743J6405K7810k2523l8100n867Q638J1447
$$ 30370 -3161 -23698 7640 17465 -16278 127 27937 5414 -32686 -38553 -29915 -18468
6020a8468K2246P602J5275r482j2703P00j5209k3709Q78J0842K0455J9360J9462
$$ -18468 3778 11380 26655 17173 4470 5170 -10039 -33748 -32870 -22028 -1573 17787 37249
6007C7249N533l1971k103N219J7558M193m758p892j7698R666n098K872k0653j3495
$$ 37249 42782 10811 8708 13927 31485 35678 30920 23028 5330 14996 9898 12770 -7883 -21378
5993b1378R509O041l624k3157J6804K7330n915K5454J5077j8747m159l323j6688
$$ -21378 -11869 -5828 -9452 -32609 -15805 11525 5610 31064 46141 27394 23235 19912 3224
5980C224j3047O361j2377K3486k4007l3451N84K851R720J9648j831K9756K645
$$ 3224 -9823 -3462 -15839 7647 -16360 -49811 -49227 -46376 -36656 -17008 -18839 10917 13562
5967A3562m030O961K2303m2829k0794K4775J2227m533p162k3243n075m743Q10
$$ 13562 9532 16493 38796 -4033 -24827 -52 12175 7642 480 -22763 -27838 -32581 -31771
5954c1771K9382j4887r69O409P74j9043R810J3215J928J553N83P036m038J5542
$$ -31771 -2389 -17276 -18245 -11836 -11062 -30105 -20295 -7080 -5152 -3599 -3016 4020 -18 15524
5940A5524n372k2505N733J3185J5751M812m609r852m4946k0797J5984M268R141
$$ 15524 10152 -12353 -6620 6565 22316 27128 22519 12667 -32279 -53076 -37092 -32824 -23683
5927b3683K0525k0396j3773j2439Q822J2025l624j949N630J3044j4728R807J3894
$$ -23683 -3158 -23554 -37327 -49766 -40944 -28919 -32543 -34492 -28862 -15818 -30546 -20739 -6845
5914f845j1788M125K5594Q182p594k0185j1397J9273p027k8079k315L430K473
$$ -6845 -18633 -14508 11086 19268 11674 -8511 -19908 -635 -7662 -35741 -38056 -34626 -32153
5901c2153k1528J0531J8870j7943M809r368n50n518q613J0659O662K4574K3098
$$ -32153 -53681 -43150 -24280 -42223 -37414 -46782 -47332 -52850 -61463 -50804 -44142 -19568 3530
5888C530j2521Q58J1634l8057k5680R074J8263L4724j2466j4622j2572N138J3994
$$ 3530 -8991 -8133 3501 -34556 -60236 -51162 -32899 1825 -10641 -25263 -37835 -32697 -18703
5875a8703p708j7170l968n271l381p44J5463J2188M9819L1048k7141l7343L67
$$ -18703 -26411 -43581 -47549 -52820 -56201 -56945 -41482 -29294 20525 51573 24432 -12911 -12544
5862a2544K3647j7850m942j7086J4932j385J5844l664P871p313m2770m973J2585
$$ -12544 11103 -6747 -11689 -28775 -13843 -15228 616 -3048 4823 -2490 -45260 -50233 -37648
5849c7648R059j188L25O758Q164J7872j0370j8091J1149k803O984n239K1357J0120
$$ -37648 -28589 -29777 -29452 -22694 -14530 3342 -7028 -25119 -13970 -16773 -9789 -15028 6329 16449
5835A6449q58p521J4716l3921N964K0713l7138l3215J596J7033J0583J6646J955
$$ 16449 15591 8070 22786 -11135 -5171 15542 -21596 -54811 -53215 -36182 -25599 -8953 -6998
5822f998k235Q78j1501K2131J0482L796J4180j5175q904j2011n364M50j860M931
$$ -6998 -9233 -8355 -19856 2275 12757 16553 30733 15558 6654 -5357 -10721 -10271 -12131 -7200
5808g200j841P00R023K7242K6123j8565J1158q522n400L5244P671o339k1865j9794
$$ -7200 -9041 -8341 682 27924 54047 35482 46640 38118 32718 67962 75633 69294 47429 27635
5794B7635j5265l0404J1228J2626j4915k0435L5560J6711j3061l5591K1174P131
$$ 27635 12370 -18034 -6806 5820 -9095 -29530 6030 22741 9680 -25911 -4737 2394
5782B394j4026M403J8309q961M996J6947j7839k2319P254L0156N477l8768R9N533
$$ 2394 -11632 -7229 11080 2119 7115 24062 6223 -16096 -8842 21314 26791 -11977 -11878 -6345
5768f345l4391l1970J6088J8483O020K7408O096j5749j1287J2391j2115j83Q922
$$ -6345 -40736 -72706 -56618 -38135 -32115 -4707 1389 -14360 -25647 -13256 -25371 -25554 -16632
5755a6632j4613j6030J5911k3279l6074k269K1686N661L6056K4785j1464J0326
$$ -16632 -31245 -47275 -31364 -54643 -90717 -92986 -71300 -65639 -29583 -4798 -16262 -5936
5743e936P670j4377K0830N794o293o10R495P718j4882k1514L0539o273m234M805
$$ -5936 1734 -12643 8187 13981 7688 7078 16573 24291 9409 -12105 18434 12161 7927 12732
5729A2732m979j3771L2632N125l3915j5162L1560K0670k3964k6535k1625k5089
$$ 12732 7753 -6018 26614 31739 -2176 -17338 14222 34892 10928 -15607 -37232 -62321
5717f2321J3765M156j9516n61L5374L5648K7932N321k7900J2193M5022O268l8601
$$ -62321 -48556 -44400 -63916 -64477 -29103 6545 34477 39798 11898 24091 69113 75381 36780
5704C6780j1536j62J9876n0931j5980K8633J8059j3782k1096J4767K8434J5400
$$ 36780 25244 25082 44958 -5973 -21953 6680 24739 10957 -10139 4628 33062 48462
5692D8462l2508k7028j5057j9978q705K989J7187k0300M306K5716J3057J7009
$$ 48462 15954 -11074 -26131 -46109 -54814 -51825 -34638 -54938 -50632 -24916 -11859 5150
5680E150j8220Q589O418J5809K5571k19k6417q614l907J7021j8053m308k4833
$$ 5150 -13070 -4481 1937 17746 43317 43098 16681 8067 4160 21181 3128 -1180 -26013
5667b6013m956J6393J3518k796J944n727m5124n785R745N452r960L0714J9502
$$ -26013 -30969 -14576 -1058 -3854 -1910 -7637 -52761 -58546 -48801 -43349 -53309 -22595 -3093
5654c093J8494n962m142M385r813L183J5573r475P626j4563l1047J85k880R081
$$ -3093 15401 9439 5297 9682 -131 3052 18625 9150 16776 2213 -28834 -28649 -31529 -22448
5640b2448K0573Q737N441K2428j9391q521l088j6630P139J8834n551L680k274
$$ -22448 -1875 6862 12303 34731 15340 6819 3731 -12899 -5760 13074 7523 11203 8929
5627H929J3235q631p887j5143k1413o724L1304K3355Q093M165K3735M561k5951
$$ 8929 22164 13533 5646 -9497 -30910 -37634 -6330 17025 25118 29283 53018 57579 31628
5614C1628l1836Q449Q94M465M567J1684q551n774M388J7692j6622m847n085Q504
$$ 31628 -208 8241 9135 13600 18167 29851 21300 15526 19914 37606 20984 16137 11052 19556
5600A9556J184k661k8419n8574r610L3009L6791R033l1873J6814K5780l9424k433
$$ 19556 20740 18079 -10340 -68914 -78524 -45515 -8724 309 -31564 -14750 11030 -28394 -30827
5587c0827R112J4105J3945K407k8353O063L1938K0945m236j0165J6606J876o2422
$$ -30827 -21715 -7610 6335 8742 -19611 -13548 18390 39335 35099 24934 41540 43416 -19006
5574a9006j1908L7351R968o408q15k1977l0006j3295N1154K2034l516o27L286
$$ -19006 -30914 6437 16405 9997 9182 -12795 -42801 -56096 -4942 17092 13576 12949 16235
5561A6235r634P672j5323k5188K9716K841O416r476l3065P178J9052M905j6180
$$ 16235 6601 14273 -1050 -26238 3478 6319 12735 3259 -29806 -22628 -3576 1329 -14851
5548a4851K499m267l640L4676P768k5792k7945K3260j2153k6967M243m961R598
$$ -14851 -12352 -16619 -20259 14417 22185 -3607 -31552 -8292 -20445 -47412 -43169 -48130 -38532
5535c8532K9015J3316j2842q838k214J4090m613Q070J1629O823L792k26p616R011
$$ -38532 -9517 3799 -9043 -17881 -20095 -6005 -10618 -2548 9081 15904 19696 19470 11854 20865
5521B0865K2109l18j7634L98J7307l7398k1327o42J5458n001M704k8687j4864
$$ 20865 42974 42656 25022 25420 42727 5329 -15998 -16640 -1182 -6183 -1479 -30166 -45030
5508d5030K1608J2576J1990J7407p942k5292J875L6246N771j7570J1380l1113
$$ -45030 -23422 -10846 1144 18551 10609 -14683 -12808 23438 29209 11639 23019 -8094
5496h094k1184j5709L460J093Q737J1998K8853J0148k1038j2936m030J6576m820
$$ -8094 -29278 -44987 -41527 -40434 -31697 -19699 9154 19302 -1736 -14672 -18702 -2126 -6946
5483f946k8538L979L443L189J0977J9636J5470L916j5755m061j4527J6332J026
$$ -6946 -35484 -31505 -28062 -24873 -13896 5740 21210 25126 9371 5310 -9217 7115 8141
5470H141j9364J7476K6555J3637M698l8206l4086o80J7465m181N68j708j0166
$$ 8141 -11223 6253 32808 46445 51143 12937 -21149 -21829 -4364 -8545 -7977 -9685 -19851
5457a9851K399J7921K0586q758M898K4247k5783k3415j2742l377N494j196j667
$$ -19851 -17452 469 21055 12297 17195 41442 15659 -7756 -20498 -23875 -18381 -19577 -21244
5444b1244L232L2583j1152j9916O038j5111k5618j867K7276J4214L461P741R349
$$ -21244 -18012 14571 3419 -16497 -10459 -25570 -51188 -53055 -25779 -11565 -8104 -363 8986
5431H986M721K568J3776k2232j7402K518o496k2116J9440L0826K5650J01j5758
$$ 8986 13707 16275 30051 7819 -9583 -7065 -13561 -35677 -16237 14589 40239 40340 24582
5418B4582p567j0028P509j2589l335K2850L469k3576N324P226J8679j7692m492
$$ 24582 17015 6987 14496 1907 -1428 21422 24891 1315 6639 13865 32544 14852 10360
5405A0360o149o60j1544J2149K4705j1436j9417q133j0966j4278J0994J0080K8743
$$ 10360 4211 3551 -7993 4156 28861 17425 -1992 -10125 -21091 -35369 -24375 -14295 14448
5392A4448k4010J9189L8445J9897j4101l5443k1539k4664N842J1662L0245j3082
$$ 14448 -9562 9627 48072 67969 53868 18425 -3114 -27778 -21936 -10274 19971 6889
5380F889m4667j2448J3596l713j884L7373R847K532j1801J1040j0875j8806l1383
$$ 6889 -37778 -50226 -36630 -40343 -42227 -4854 4993 7525 -4276 6764 -4111 -22917 -54300
5367e4300l484N049R176L3516J1781j5239j0597j302K2684j335j5j6953j4209
$$ -54300 -57784 -52735 -43559 -10043 1738 -13501 -24098 -25400 -2716 -4051 -4066 -21019 -35228
5354c5228L6730J3733m940k7195L925k391r247J5483N18P441p156J276J5953J0002
$$ -35228 1502 15235 10295 -16900 -12975 -15366 -24613 -9130 -8612 -1171 -8327 -7051 8902 18904
5340A8904j6594Q58j4445j8769J6259M556r647j6747j254l901J5018K3052k742
$$ 18904 2310 3168 -11277 -30046 -13787 -9231 -18878 -35625 -36879 -40780 -25762 -2710 -5452
5327e452r448k4755J0485j036j9083J602L7860j2717r816N781j2844J1623K057
$$ -5452 -14900 -39655 -29170 -30206 -49289 -47687 -9827 -22544 -32360 -26579 -39423 -27800 -25743
5314b5743P242L6005J0880j1097j190J0233R054O472J7651k1702k3086l3030O761
$$ -25743 -18501 17504 28384 17287 16097 26330 35384 41856 59507 37805 14719 -18311 -11550
5301a1550k4115k4646k1181Q262R230k6265K9112L0044J7159J3487J6661j5840
$$ -11550 -35665 -60311 -81492 -73230 -64000 -90265 -61153 -31109 -13950 -463 16198 358
5289C58K697R894O796R493r055k8196j5857M692j962j6924q304M4197K2561l1544
$$ 358 3055 12949 19745 29238 20183 -8013 -23870 -19178 -21140 -38064 -46368 -2171 20390 -11154
5275a1154j9540j6721Q975R608m048J8088K6448Q990M812j548p643M70J3712k2518
$$ -11154 -30694 -47415 -38440 -28832 -32880 -14792 11656 20646 25458 23910 16267 16737 30449 7931
5261G931k1956O365m217j5510J8980k2755O2L0677J0741k7912j6429J9409K4441
$$ 7931 -14025 -7660 -11877 -27387 -8407 -31162 -31100 -423 10318 -17594 -34023 -14614 9827
5248I827J6466l4457K2944j8662l0272J5942K8710K245j4592r189J0386k2282
$$ 9827 26293 -8164 14780 -3882 -34154 -18212 10498 12743 -1849 -11038 -652 -22934
5236b2934K903l016L4241J5087k1240K8441K6958J0347p626L794m144l8636k5609
$$ -22934 -20031 -23047 11194 26281 5041 33482 60440 70787 63161 66955 62811 24175 -1434
5223a434j0951J7075J3980K0744L414R702l4304l2372j0568L7291L1175j5267
$$ -1434 -12385 4690 18670 39414 42828 52530 18226 -14146 -24714 12577 43752 28485
5211B8485k256O426k2022o568l714Q267K0510K848J757m734K1924Q995o688O554
$$ 28485 26229 32655 10633 4065 351 8618 29128 31976 33733 28999 50923 59918 53230 59784
5197E9784O45l744r599j4222j5443j1499J1792j5624j9706j5405J4893m789j1589
$$ 59784 60429 56685 47086 32864 17421 5922 17714 2090 -17616 -33021 -18128 -22917 -34506
5184c4506P194J5095N95m319J8623J4119j2675q714N435J2734j0980p609o663
$$ -34506 -27312 -12217 -11622 -15941 2682 16801 4126 -4588 847 13581 2601 -5008 -11671
5171a1671R204k6085k1074J879N4395J5067j8268p78J28O141k272L107j6055N280
$$ -11671 -2467 -28552 -49626 -47747 6648 21715 3447 2669 2797 8938 6666 9773 -6282 -1002
5157a002j1878J5118l346j1726O815O516k5550k764L891P105K7370K8236Q619
$$ -1002 -12880 2238 -1108 -12834 -6019 497 -25053 -27817 -23926 -16821 10549 38785 47404
5144D7404k6069k6595j7591L124j5402j723J9259K6187K8047O058j3715J719q175
$$ 47404 21335 -5260 -22851 -19727 -35129 -36852 -17593 8594 36641 42699 28984 30703 22528
5131B2528K2799r589k7663N141K470j5022j6375J5765O561K2751Q617j7819j3987
$$ 22528 45327 35738 8075 13216 15686 664 -15711 54 6615 29366 37983 20164 6177
5118F177j5587r696o493r133l252K2029N347m884P27M925k3937J1172J3151J4792
$$ 6177 -9410 -19106 -25599 -34732 -37984 -15955 -10608 -15492 -14765 -9840 -33777 -22605 -9454 5338
5104E338j4656M375n412l913k9205J651J4093k975L0036J1021k9504J2728K0391
$$ 5338 -9318 -4943 -10355 -14268 -43473 -41822 -27729 -30704 -668 10353 -19151 -6423 13968
5091A3968l212P027N808k2195j2162J8033K1815m453m8441Q82J9340P829j9884
$$ 13968 10756 17783 23591 1396 -10766 7267 29082 24629 -23812 -22930 -3590 4239 -15645
5078a5645R638J7193J5409j0103j6215l1237j0704r677L798P995R524L4117M6158
$$ -15645 -6007 11186 26595 16492 277 -30960 -41664 -51341 -47543 -39548 -30024 4093 50251
5065E0251k4753m9330l0925m30O124q458J765N7708K4168R190m101j8193j120
$$ 50251 25498 -23832 -54757 -55187 -49063 -57521 -55756 1952 26120 35310 31209 13016 11896
5052A1896j1264J2594K140o505J619K6499j793k7568k0469o533J8424K567j4479
$$ 11896 632 13226 15366 8861 10480 36979 35186 7618 -12851 -19384 -960 1607 -12872
5039a2872O315j5545N372K2207J7937j7872k5217J9934m763j783j1420m253L8053
$$ -12872 -6557 -22102 -16730 5477 23414 5542 -19675 259 -4504 -6287 -17707 -21960 16093
5026A6093K0328n071j3216j6369r712N807j2780j2990K315J2958J6849m120r658
$$ 16093 36421 31350 18134 1765 -7947 -2140 -14920 -27910 -25595 -12637 4212 92 -9566
5013i566j3774l5993j0002K2395J9037J7151L047J5567J4552O13M414J2636l13
$$ -9566 -23340 -59333 -69335 -46940 -27903 -10752 -7705 7862 22414 23027 27441 40077 39764
5000C9764j3164l6274j4050K2194P884o11J9742l591Q393M398p241r977r471k637
$$ 39764 26600 -9674 -23724 -1530 6354 5743 25485 21894 30287 34685 27444 17467 7996 5359
4986E359l162J0060K1452j2241k3062q00k2349j4601J8828L9300j0264k8319J0638
$$ 5359 2197 12257 33709 21468 -1594 -2394 -24743 -39344 -20516 18784 8520 -19799 -9161
4973i161L2340j6209j2431J0719M103J0397j9530r696m724j9025k297L3905k2950
$$ -9161 23179 6970 -5461 5258 9361 19758 228 -9468 -14192 -33217 -35514 -1609 -24559
4960b4559o2210M544J4303j3278K5508M0887O229j7126k1334q489J1635J0480
$$ -24559 -86769 -82225 -67922 -81200 -55692 -14805 -8576 -25702 -47036 -55525 -43890 -33410
4948c3410M081o634M107K6919J7285J7449l6494M269J947R922K044p680l6084
$$ -33410 -29329 -35963 -31856 -4937 12348 29797 -6697 -2428 -481 9441 11485 3805 -32279
4935c2279L0371K8785j538j7670l0378j3909J3385k509J4272p378J4504L8066
$$ -32279 -1908 26877 25339 7669 -22709 -36618 -23233 -25742 -11470 -18848 -4344 33722
4923C3722l0438k4358N275L839J5872k4906j0464K1311K1778k1360k173m080o956
$$ 33722 3284 -21074 -15799 -11960 3912 -20994 -31458 -10147 11631 -9729 -11902 -15982 -22938
4910b2938O7O778j6146J1583l988J0759J3457j6741j5189k621q008k040Q75J4718
$$ -22938 -22871 -16093 -32239 -20656 -24644 -13885 -428 -17169 -32358 -34979 -42987 -45027 -44152 -29434
4896b9434j0781p578N664o384L3883k034M172j3195k9313K7169K6106o470j5963
$$ -29434 -40215 -47793 -42129 -48513 -14630 -16664 -12492 -25687 -55000 -27831 -1725 -8195 -24158
4883b4158O778j561r646j7259M295J8902J7082J6343j7655q048m718K9699K346
$$ -24158 -17380 -18941 -28587 -45846 -41551 -22649 -5567 10776 -6879 -14927 -19645 10054 12400
4870A2400n0116n053J5382Q532o185N941J2687J7089M165J934j428j6675l5122
$$ 12400 -37716 -42769 -27387 -18855 -25040 -19099 -6412 10677 14842 16776 15348 -1327 -36449
4857c6449j6497j9242K7977J8889N22J4355M73O660M146P585J026k8604N966R071
$$ -36449 -52946 -72188 -44211 -25322 -24800 -10445 -9972 -3312 834 8419 9445 -19159 -13193 -4122
4843d122j6403o466M1055j3457N034L901J6040o765k1204j0669K3589M797Q317
$$ -4122 -20525 -26991 14064 607 5641 9542 25582 18817 -2387 -13056 10533 15330 23647
4830B3647r971j0499p941l406k4953J0797L7049J4960l841R121j3159q528l178
$$ 23647 13676 3177 -4764 -8170 -33123 -22326 14723 29683 25842 34963 21804 13276 10098
4817A0098j2741j2247k5696o346K6239P100j726J4204l554o440l8526j2019J4949
$$ 10098 -2643 -14890 -40586 -46932 -20693 -13593 -15319 -1115 -4669 -11109 -49635 -61654 -46705
4804d6705J1234M9585l266l3276N592r013K712o480K905J6067J3319J2135j5560
$$ -46705 -35471 14114 10848 -22428 -16836 -25849 -23137 -29617 -26712 -10645 2674 14809 -751
4791g51l0449j6173P31K4108k312Q681K2372p216k4881P501p480N493k060Q418
$$ -751 -31200 -47373 -46642 -22534 -24846 -16165 6207 -1009 -25890 -18389 -25869 -20376 -22436 -14018
4777a4018J3285J5416j119J024k295m139N100K101Q650J2448J9051k2644k5518
$$ -14018 -733 14683 13564 14588 12293 8154 13254 15355 24005 36453 55504 32860 7342
4764G342k1653J9732k655K26n883j2580k0214n288l30J2250j3767P740K7150J070
$$ 7342 -14311 5421 2766 2992 -2891 -15471 -35685 -40973 -41303 -29053 -42820 -35080 -7930 -6860
4750f860l532K9854j0557j7343j418l735o65M818k276R656N688O292K8303j6727
$$ -6860 -10392 19462 8905 -8438 -9856 -13591 -14256 -9438 -11714 -2058 3630 9922 38225 21498
4736B1498O387O049J2675l7768j892q556l075k1684j5909L05J717K0891K3885
$$ 21498 27885 33934 46609 8841 6949 -1607 -4682 -26366 -42275 -41970 -40253 -19362 4523
4723D523j276r424k2791J5739J3229j4182J2723r755j8403O104L0826L782j4298
$$ 4523 3247 -6177 -28968 -13229 0 -14182 -1459 -11214 -29617 -23513 7313 11095 -3203
4710c203j6613j230j1297J661o579O170J2730p389k422K3259R450o125l529p021
$$ -3203 -19816 -21046 -32343 -30682 -37261 -31091 -18361 -25750 -28172 -4913 4537 -1588 -5117 -12138
4696a2138k0388m0675J6982M7749p695o35j3070J6762j0844k0603J0827J4601
$$ -12138 -32526 -73201 -56219 -8470 -16165 -16800 -29870 -13108 -23952 -44555 -33728 -19127
4684a9127K8768K8224J8950L822j202j4884l5819m72j3800j1522r094J6889o809
$$ -19127 9641 37865 56815 60637 59435 44551 8732 8260 -5540 -17062 -26156 -9267 -16076
4671a6076L794J827N438R496J5360J3618K10J0199q163m5269k3711L3449n326
$$ -16076 -12282 -10455 -5017 4479 19839 33457 33667 43866 35703 -9566 -33277 172 -5154
4658e154J4660q966j1855J2483j3330J1240j0554R288J8276j705K7914M114l6282
$$ -5154 9506 540 -11315 1168 -12162 -922 -11476 -2188 16088 14383 42297 46411 10129
4645A0129k3688m2090K1023K8591m568O714L279j567J9607L665J9457K2467k6692
$$ 10129 -13559 -55649 -34626 -6035 -10603 -3889 -610 -2177 17430 21095 40552 63019 36327
4632C6327k7896l0632K410J9257j1227m184L4574K5822j3876j2111q119n228K274
$$ 36327 8431 -22201 -19791 -534 -11761 -15945 18629 44451 30575 18464 10345 5117 7391
4619G391o037j9413L2271K5802l9396r050j1100j543j6298k120J0841L5449K7209
$$ 7391 1354 -18059 14212 40014 618 -8432 -19532 -21075 -37373 -39493 -28652 6797 34006
4606C4006q467L206j6637o615m0285k9912J9505L3331p264J0822O319j3162k2718
$$ 34006 25539 28745 12108 5493 -34792 -64704 -45199 -11868 -19132 -8310 -1991 -15153 -37871
4593c7871n226j8627M5743m243l3482K5833K8822K5056K2532Q825r51k5693k1159
$$ -37871 -43097 -61724 -15981 -20224 -53706 -27873 949 26005 48537 57362 56411 30718 9559
4580I559l5215n054j2004K5548j6362L916M218R136J8802k1347n27j1619o520
$$ 9559 -25656 -30710 -42714 -17166 -33528 -29612 -25394 -16258 2544 -18803 -19330 -30949 -37469
4567c7469K2490J9121r018r882O764P278L3153R097o098k3206q889l6668k338
$$ -37469 -14979 4142 -4876 -14758 -7994 -716 32437 41534 35436 12230 3341 -33327 -35665
4554c5665l514j3838N6592L8825J8043l528m677o670m460j7917R007q63J6035
$$ -35665 -39179 -53017 3575 42400 60443 56915 52238 45568 41108 23191 32198 31335 47370
4541D7370J0222m2332k9285k0617k284J7170J8240m811R587k6500J2886Q714Q655
$$ 47370 57592 15260 -14025 -34642 -36926 -19756 -1516 -6327 3260 -23240 -10354 -1640 7015
4528G015J0007L895J359R900J9262j0755o139j6206K4603N558l2882n244k8955
$$ 7015 17022 20917 22276 32176 51438 40683 34544 18338 42941 48499 15617 10373 -18582
4515a8582j6063p061J4904K6583K6606m19R181K1309j3586l6078j6890Q37K9165
$$ -18582 -34645 -41706 -26802 -219 26387 25968 35149 56458 42872 6794 -10096 -9259 19906
4502A9906O923j3959j8640M353O280J150K5244p547o156J473l434k983l8289j7427
$$ 19906 26829 12870 -5770 -1417 4863 6013 31257 23710 17554 19027 15593 12610 -25679 -43106
4488d3106J9567K1537J0017n402J7435l4816k5541l663q147J7837N344P494J7107
$$ -43106 -23539 -2002 8015 2613 20048 -14768 -40309 -43972 -52119 -34282 -28938 -21444 -4337
4475d337L8533R807r649R172k4484j1436r76n335j8073P034J8350l9252l2476
$$ -4337 34196 44003 34354 43526 19042 7606 6630 1295 -16778 -9744 8606 -30646 -63122
4462f3122J8936K948K6656J8585m262P534J1729k8517n0616Q598J0886L5304O428
$$ -63122 -44186 -41238 -14582 4003 -259 7275 19004 -9513 -60129 -51531 -40645 -5341 1087
4449A087n194k0613J1694K333K6290n624q993K23K343n4740r42L5522j573J9979
$$ 1087 -4107 -24720 -13026 -10693 15597 9973 980 1203 3546 -51194 -52136 -16614 -18187 1792
4435A792O4408J1339n9516j6606k4997r46p182k770K7003M6392N024j4429j5571
$$ 1792 66200 77539 18023 1417 -23580 -24526 -31708 -34478 -7475 38917 43941 29512 13941
4422A3941p484q443M748j2017m977L0625K0763k214J2570q783k4640k3355O796
$$ 13941 6457 -1986 2762 -9255 -14232 16393 37156 34942 47512 38729 14089 -9266 -2470
4409b470m627k6703N754J0616J460j7180n798R616L899K19L779J4436m921k5400
$$ -2470 -7097 -33800 -28046 -17430 -15970 -33150 -38948 -29332 -25433 -25214 -21435 -6999 -11920 -37320
4395c7320j5695J9673J6804K3077o823l7618k1135k4766J271M8093M7642j0564
$$ -37320 -53015 -33342 -16538 6539 -284 -37902 -59037 -83803 -82532 -34439 13203 2639
4383B639r550J6871J5021J0638j6J4547k5309o084J8313k6078k1033K139m1812
$$ 2639 -6911 9960 24981 35619 35603 50150 24841 18757 37070 10992 -10041 -7902 -49714
4370d9714J7087O808J9991j73q734K5119K0441n692R997l0326j6271j9784J5141
$$ -49714 -32627 -25819 -5828 -6001 -14735 10384 30825 25133 35130 4804 -11467 -31251 -16110
4357a6110k053o956l1128j9L2180J9774j9683j782J9826Q351k2178k8204o507
$$ -16110 -18163 -25119 -56247 -56266 -24086 -4312 -23995 -25777 -5951 2400 -19778 -47982 -54489
4344e4489K265J7453K7778J1677J2231j644K289l811r89L551j6041j6566N552
$$ -54489 -52224 -34771 -6993 4684 16915 15271 17560 13749 12760 16311 270 -16296 -10744
4331a0744j6840j0814J2316J396P333q826j881j074R451l3599J507L2146K5399
$$ -10744 -27584 -38398 -26082 -24686 -17353 -26179 -28060 -29134 -19683 -53282 -51775 -19629 5770
4318E770J64l1350l2820m277L6191N37R521m086o113J70q305J2520L5646K098
$$ 5770 5934 -25416 -58236 -62513 -26322 -25785 -16264 -20350 -26463 -26293 -34598 -22078 13568 15666
4304A5666m2326J1023J7601L487j4823K7925J0228j2265m0970j0333J1101L0668
$$ 15666 -26660 -15637 1964 5451 -9372 18553 28781 16516 -24454 -34787 -23686 6982
4292F982M641l1846j4760K5578L1227N95j2209k4314K215j6919l1382J412p391
$$ 6982 11623 -20223 -34983 -9405 21822 22417 10208 -14106 -11891 -28810 -60192 -58780 -66171
4279f6171Q962m60R358L3335L476j1615j082j676j6305J3083n927r202L2353J866
$$ -66171 -57209 -57669 -48311 -14976 -11500 -23115 -24197 -25873 -42178 -29095 -35022 -44224 -11871 -10005
4265a0005J6864J4622j696r446O668k4907j8973Q978J4599k729q423j293K142
$$ -10005 6859 21481 19785 10339 17007 -7900 -26873 -17895 -3296 -6025 -14448 -15741 -13599
4252a3599M973L987J6191K863j8019r071K1328k1057Q782J454l7648J2950J5019
$$ -13599 -8626 -4639 11552 14415 -3604 -12675 8653 -12404 -3622 -2168 -39816 -26866 -11847
4239a1847J9851N191l0833j345Q957M798P018r144o370j7625J3837K0336J4673
$$ -11847 8004 13195 -17638 -18983 -10026 -5228 1790 -7354 -13724 -31349 -17512 2824 17497
4226A7497j1388J5140P954O936K6485n138p154P433J5171o487k6202k9634k2642
$$ 17497 6109 21249 29203 36139 62624 57486 50332 57765 72936 66449 40247 10613 -12029
4213a2029j5169Q546m597j1497K3009k4450k922L929m298m241j9381J9979L8768
$$ -12029 -27198 -18652 -23249 -34746 -11737 -36187 -39109 -35180 -39478 -43719 -63100 -43121 -4353
4200d353J3146K8029N4k101j3758j2842q892J727m052j2033l816P410n985q886
$$ -4353 8793 36822 36876 34775 21017 8175 -717 1010 -3042 -15075 -18891 -11481 -17466 -26352
4186b6352K737P201J11O948j0598k1823J5267J8805Q931N247q003K161L0551L690
$$ -26352 -23615 -16414 -16303 -9355 -19953 -41776 -26509 -7704 1227 6474 -1529 632 31183 34873
4172C4873j0324m2724l6726J8566K3166J8279q131m667J9094K4394k2973R018
$$ 34873 24549 -18175 -54901 -36335 -13169 5110 -3021 -7688 11406 35800 12827 21845
4160B1845p318k4656j5032l401J5094K0442K2189K052J154j0884j204l3571j9939
$$ 21845 14527 -10129 -25161 -28562 -13468 6974 29163 31215 32369 21485 20281 -13290 -33229
4147c3229K9806K3504J1877J7284J3047r943l7097k5636J9747J1084j796Q826
$$ -33229 -3423 20081 31958 49242 62289 52346 15249 -10387 9360 20444 18648 27474
4135B7474J8191j5277N948k5601k4979j547J2115J2842k1111j8024k489J3761
$$ 27474 45665 30388 36336 10735 -14244 -15791 -3676 9166 -11945 -29969 -32458 -18697
4123a8697J0916q453J579J7541j752J111k309j3621J7211R291k2016Q15J2847
$$ -18697 -7781 -16234 -14655 2886 1134 2245 -64 -13685 3526 12817 -9199 -8384 4463
4110D463J2012q409K500K8218j9084m760m555j4854J9296P941K653Q129j686k4070
$$ 4463 16475 8066 10566 38784 19700 14940 10385 -4469 14827 22768 25421 33550 31864 7794
4096G794j8564J2363J5272Q656j0694j8852j1798o582J771j4883L755M979N032
$$ 7794 -10770 1593 16865 25521 14827 -4025 -15823 -22405 -20634 -35517 -31762 -26783 -21751
4083b1751j1288N292K3887J6294J6139J5771j7124m5748k7680J2628O686O377
$$ -21751 -33039 -27747 -3860 12434 28573 44344 27220 -18528 -46208 -33580 -26894 -20517
4071b0517M67j5588K1739K4344J201j3650j2439l1236l0238R588L5779K5078K0718
$$ -20517 -20050 -35638 -13899 10445 11646 -2004 -14443 -45679 -75917 -66329 -30550 -5472 15246
4058A5246K4299m248K17n682j6084j6127j3343k2189L762L054o920L1506K3172
$$ 15246 39545 35297 35514 29832 13748 -2379 -15722 -37911 -34149 -31095 -38015 -6509 16663
4045A6663o619J5116j0947k0707j7434K277k8310J3942K6092q52R00L5803K6504
$$ 16663 10044 25160 14213 -6494 -23928 -21651 -49961 -36019 -9927 -10779 -9879 25924 52428
4032E2428j5816m2842k4571J1945R384k7571k2910q45M3377M1292J4883o638j4525
$$ 52428 36612 -6230 -30801 -18856 -9472 -37043 -59953 -60798 -17421 23871 38754 32116 17591
$$ [...]
##END NTUPLES=NMR SPECTRUM
##END=
