##TITLE=Analysis number 327365
Compound Code tl 00603
Book Reference 43033
Project Code adrs flro3
Chemist Name jom
##JCAMPDX= 6.0         $$ Bruker NMR JCAMP-DX V2.0
##DATA TYPE= NMR SPECTRUM
##DATA CLASS= NTUPLES
##ORIGIN= Bruker BioSpin GmbH
##OWNER= nmr
$$ XWIN-NMR		Version 3.5
$$ Thu Mar 22 13:25:03 2007 GMT Standard Time (UT+0h)  MAYBRIDGE\nmr@NMR_250MHZ
##.OBSERVE FREQUENCY= 250.131544655141
##.OBSERVE NUCLEUS= ^1H
##.ACQUISITION MODE= SIMULTANEOUS (DQD)
##.ACQUISITION SCHEME= undefined
##.AVERAGES= 16
##.DIGITISER RES= 18
##SPECTROMETER/DATA SYSTEM= dpx250
##.PULSE SEQUENCE= zg30
##.SOLVENT NAME= CDCl3
##.SHIFT REFERENCE= (INTERNAL, CDCl3, 0, 16.522)
##AUDIT TRAIL= $$ (NUMBER, WHEN, WHO, WHERE, WHAT)
$$ ##TITLE= Audit trail, XWIN-NMR		Version 3.5
$$ ##JCAMPDX= 5.01
$$ ##ORIGIN= Bruker BioSpin GmbH
$$ ##OWNER= nmr
$$ C:\u/data/dgb/nmr/ADRS/1730/pdata/1/auditp.txt
$$ ##AUDIT TRAIL=  $$ (NUMBER, WHEN, WHO, WHERE, WHAT)
(   1,<2007-03-22 13:24:37.18 +000>,<MAYBRIDGE\nmr>,<NMR_250MHZ>,
      <created by zg, POWCHK disabled, PULCHK disabled
       configuration hash MD5:
       49 4B E0 1D 92 C2 6B 37 9F E6 65 BC 52 41 86 1D
       data hash MD5: 64K
       65 36 34 00 6D E2 65 AB BB E1 97 85 35 8B 99 CB>)
(   2,<2007-03-22 13:24:52.02 +000>,<MAYBRIDGE\nmr>,<NMR_250MHZ>,
      <Start of raw data processing
       ef LB = 0.3 FT_mod = 6 PKNL = 1 SI = 32K 
       data hash MD5: 32K
       8B 40 2A C5 BE AC FE 04 F9 27 8B 64 42 F0 C3 4C>)
(   3,<2007-03-22 13:24:54.29 +000>,<MAYBRIDGE\nmr>,<NMR_250MHZ>,
      <apk 
       data hash MD5: 32K
       00 3B B3 D6 65 9E 24 4B 6B A2 3C 28 62 E8 7C D3>)
(   4,<2007-03-22 13:24:55.35 +000>,<MAYBRIDGE\nmr>,<NMR_250MHZ>,
      <abs ABSG = 5 
       data hash MD5: 32K
       15 43 DE 8D E6 43 82 F6 B1 9D 35 19 34 C0 F5 12>)
$$ ##END=
$$ 
$$ hash MD5
$$ D8 5D 2B AC 28 99 5C FD 15 84 80 32 DA 93 E5 54
##$RELAX= 
##$RELAX= 
##$RELAX= 
##$RELAX= 
##$RELAX= 
##$RELAX= 
##$RELAX= 
$$ Bruker specific parameters
$$ --------------------------
##$DU= <C:\u>
##$EXPNO= 1730
##$NAME= <ADRS>
##$PROCNO= 1
##$TYPE= <nmr>
##$USER= <dgb>
##$AMP= (0..31)
100 100 100 100 100 100 100 100 100 100 100 100 100 100 100 100 100 100 
100 100 100 100 100 100 100 100 100 100 100 100 100 100 
##$AQSEQ= 0
##$AQ_mod= 3
##$AUNM= <au_zg>
##$AUTOPOS= <32 >
##$BF1= 250.13
##$BF2= 250.13
##$BF3= 250.13
##$BF4= 250.13
##$BF5= 500.13
##$BF6= 500.13
##$BF7= 500.13
##$BF8= 500.13
##$BYTORDA= 1
##$CFDGTYP= 0
##$CFRGTYP= 5
##$CHEMSTR= <none>
##$CNST= (0..31)
1 1 145 1 1 1 1 1 1 1 1 1 1 1 1 1 1 1 1 1 1 1 1 1 1 1 1 1 1 1 1 1 
##$CPDPRG= <>
##$CPDPRG1= <>
##$CPDPRG2= <>
##$CPDPRG3= <>
##$CPDPRG4= <mlev>
##$CPDPRG5= <mlev>
##$CPDPRG6= <mlev>
##$CPDPRG7= <mlev>
##$CPDPRG8= <mlev>
##$CPDPRGB= <>
##$CPDPRGT= <>
##$D= (0..31)
0 1 0 0 0 0 0 0 0 0.06 0 0 0 0 0 0 0.0002 0 0 0 0 0 0 0 0 0 0 0 0 0 0 
0 
##$DATE= 1174569876
##$DBL= (0..7)
120 120 120 120 120 120 120 120 
##$DBP= (0..7)
150 150 150 150 150 150 150 150 
##$DBP07= 0
##$DBPNAM0= <>
##$DBPNAM1= <>
$$ [...]
##$SUBNAM6= <"">
##$SUBNAM7= <"">
##$SUBNAM8= <"">
##$SUBNAM9= <"">
##$SW= 20.6930455092707
##$SWIBOX= (0..15)
0 0 3 0 0 0 0 0 0 0 0 0 0 0 0 0 
##$SW_h= 5175.983436853
##$TD= 65536
##$TD0= 1
##$TE= 683.16
##$TE2= 300
##$TE3= 300
##$TEG= 300
##$TL= (0..7)
0 120 120 120 120 120 120 120 
##$TP= (0..7)
150 150 150 150 150 150 150 150 
##$TP07= 0
##$TPNAME0= <>
##$TPNAME1= <>
##$TPNAME2= <>
##$TPNAME3= <>
##$TPNAME4= <>
##$TPNAME5= <>
##$TPNAME6= <>
##$TPNAME7= <>
##$TPOAL= (0..7)
0.5 0.5 0.5 0.5 0.5 0.5 0.5 0.5 
##$TPOFFS= (0..7)
0 0 0 0 0 0 0 0 
##$TUNHIN= 0
##$TUNHOUT= 0
##$TUNXOUT= 0
##$USERA1= <user>
##$USERA2= <user>
##$USERA3= <user>
##$USERA4= <user>
##$USERA5= <user>
##$V9= 5
##$VALIST= <valist>
##$VCLIST= <CCCCCCCCCCCCCCC>
##$VD= 0
##$VDLIST= <DDDDDDDDDDDDDDD>
##$VPLIST= <PPPPPPPPPPPPPPP>
##$VTLIST= <TTTTTTTTTTTTTTT>
##$WBST= 1024
##$WBSW= 4
##$XGAIN= (0..3)
0 0 0 0 
##$XL= 0
##$YL= 0
##$YMAX_a= 471796
##$YMIN_a= -378423
##$ZGOPTNS= <>
##$ZL1= 120
##$ZL2= 120
##$ZL3= 120
##$ZL4= 120
##$ABSF1= 16.522
##$ABSF2= -4.171173
##$ABSG= 5
##$ABSL= 3
##$ALPHA= 0
##$AQORDER= 0
##$ASSFAC= 0
##$ASSFACI= 0
##$ASSFACX= 0
##$ASSWID= 0
##$AUNMP= <proc_1d>
##$AZFE= 0.1
##$AZFW= 0.1
##$BCFW= 0
##$BC_mod= 0
##$BYTORDP= 0
##$COROFFS= 0
##$CY= 12.5
##$DATMOD= 1
##$DC= 0
##$DFILT= <>
##$DTYPP= 0
##$F1P= 14.0000005364418
##$F2P= -0.99999901652339
##$FCOR= 0.5
##$FTSIZE= 32768
##$FT_mod= 6
##$GAMMA= 0
##$GB= 0
##$INTBC= 1
##$INTSCL= 1
##$ISEN= 128
##$LB= 0.3
##$LEV0= 0
##$LPBIN= 0
##$MAXI= 10000
##$MC2= 0
##$MEAN= 0
##$ME_mod= 0
##$MI= 0
##$NCOEF= 0
##$NC_proc= -3
##$NLEV= 6
##$NOISF1= 0
##$NOISF2= 0
##$NSP= 0
##$NTH_PI= 0
##$NZP= 0
##$OFFSET= 16.522
##$PC= 1
##$PHC0= 77.717
##$PHC1= 8.752767
##$PH_mod= 1
##$PKNL= yes
##$PPARMOD= 0
##$PSCAL= 4
##$PSIGN= 0
##$REVERSE= no
##$SF= 250.13
##$SI= 32768
##$SIGF1= 0
##$SIGF2= 0
##$SINO= 400
##$SIOLD= 32768
##$SREGLST= <1H.CDCl3>
##$SSB= 0
##$STSI= 32768
##$STSR= 0
##$SW_p= 5175.98343685301
##$SYMM= 0
##$S_DEV= 0
##$TDeff= 65536
##$TDoff= 0
##$TI= <Analysis number 999999
Compound Code 99
Book Reference 9
Project Code 9>
##$TILT= no
##$TM1= 0
##$TM2= 0
##$TOPLEV= 0
##$USERP1= <user>
##$USERP2= <user>
##$USERP3= <user>
##$USERP4= <user>
##$USERP5= <user>
##$WDW= 1
##$XDIM= 32768
##$YMAX_p= 428489218
##$YMIN_p= -35579
$$ End of Bruker specific parameters
$$ ---------------------------------
##NTUPLES= NMR SPECTRUM
##VAR_NAME=  FREQUENCY,     SPECTRUM/REAL,   SPECTRUM/IMAG
##SYMBOL=    X,             R,               I
##VAR_TYPE=  INDEPENDENT,   DEPENDENT,       DEPENDENT
##VAR_FORM=  AFFN,          ASDF,            ASDF
##VAR_DIM=   32768,         32768,           32768
##UNITS=     HZ,            ARBITRARY UNITS, ARBITRARY UNITS
##FACTOR=    0.157963299565203, 1,           1
##FIRST=     4132.6476996994, 0,             0
##LAST=      -1043.33573715361, 0,           0
##MIN=       -1043.33573715361, -35579,      0
##MAX=       4132.6476996994, 428489218,     0
$$ Real data points
##PAGE= N=1
##DATA TABLE= (X++(R..R)), XYDATA
$$ [...]
24122 14826 12620 7161 1136 -1484 -1738 2582 683 -6262 -9861 -10697 -13038 -11216 -4031 4822 5770
24107 5770 8797 8635 7870 8652 5178 -1165 1391 5537 8245 14734 7480 3770 11640 15897 10242
24092 10242 7328 8956 2252 -1803 3930 5155 6864 10474 10744 8199 5754 2491 1650 -88 1563
24077 1563 -986 4779 680 -8247 -6730 -4796 -8583 998 -1418 -4822 -1962 5283 4528 3578 3437
24062 3437 -1901 952 962 -6231 -6770 -5923 -10012 -8428 -12087 -11394 -1237 -5242 -7444 -7422 -5437 -4032
24046 -4032 -2445 -5350 -1908 -3340 -4301 -219 1852 8075 9720 5505 -1224 -3791 -10481 -3762 4487
24031 4487 7357 2710 -2107 -6441 -262 2265 1266 -2530 -2763 -3616 -6094 -7048 -6997 -1108 -1439 -4393
24015 -4393 -5305 292 -2358 -8472 -9343 -6912 -14285 -15323 -10616 -7523 -9298 -12354 -7354 -2283 3100
24000 3100 3283 3931 -417 -6933 -9918 -9223 -5137 1169 4309 368 -2164 1394 6109 3684 -2347
23985 -2347 -5678 -7574 -7807 -8365 -8984 -5181 -2909 -2961 -2578 2532 7017 4575 1588 -1717 -13321 -17229
23969 -17229 -16551 -13538 -6132 -2619 -2346 -2104 -1937 728 -479 -6930 -3634 4604 10724 8685 1600
23954 1600 -1552 -2739 -1502 2062 7030 8147 4566 -1675 -418 5699 5979 3867 7913 7757 10277
23939 10277 9223 5683 5205 7469 -3359 -5367 -3801 -6641 -2333 4161 3518 1289 -4858 -5476 -9103
23924 -9103 -5139 -2234 910 -1827 -7849 -9694 -12180 -15986 -8027 -3151 -3997 -1455 -2026 1985 1502
23909 1502 -1736 1293 9306 11927 7279 9294 7925 7697 7743 10773 6263 644 -89 -6961 -11354 -10410
23893 -10410 -3277 -2204 -5581 -11576 -3132 3126 3812 5279 2381 -4406 -3854 -230 -4291 -5029 -4682
23878 -4682 1320 6516 5512 2251 7647 11172 11740 5254 -2357 -6818 -3466 -3163 -1925 509 2978
23863 2978 1308 2169 473 -104 4167 10274 12159 7436 6782 9323 16075 15253 9805 5770 5299 3311
23847 3311 2406 6190 6398 2733 -7766 -12864 -5612 3104 3596 5460 7264 6848 3611 508 -8641
23832 -8641 -7596 -2781 -4780 -8741 -11046 -11882 -4868 1088 1547 -133 -9662 -10902 -6587 -2303 -4835
23817 -4835 -6082 -3107 -7660 -926 6700 9454 10631 10205 6517 266 475 2727 1588 3351 -1923
23802 -1923 -3351 1896 3097 3240 -59 -1043 -3305 -6480 -11207 -8835 -6768 4277 4949 1637 1668 -1225
23786 -1225 -2664 3541 6225 5625 4005 4274 4410 3851 7078 3294 -1272 2437 -236 -3125 651 -2671
23770 -2671 -4212 -624 1599 6441 3840 2446 310 898 5762 1128 3282 5545 1562 -3291 7584
23755 7584 7308 -5131 -12632 -9603 -860 5054 10325 3121 -5428 -4133 -2537 -6503 364 5384 8970
23740 8970 11882 7301 2704 1399 2192 2899 7864 10668 6796 -638 -6112 -5500 -2730 -9952 -12733
23725 -12733 -13059 -14135 -11366 -6789 -8669 -8576 -3311 -3237 -9939 -8784 -999 2597 3002 -574 -12 2184
23709 2184 1924 1831 10504 8103 8118 998 -7155 -6835 -2140 -2169 -2206 -278 -1447 1690 9139 10392 10960
23692 10960 12850 10493 5404 -5412 -3774 2429 3250 1357 -3074 -4242 -5921 -6630 -8274 -7467 -6600
23677 -6600 -569 4121 5929 4657 -1450 -7750 -1756 5338 7009 9574 13452 5941 485 3487 5701
23662 5701 6094 399 -6016 -11661 -5156 -4579 1995 5231 2921 -1738 -1954 -4646 -2668 -4705 -6237
23647 -6237 -7370 -182 6736 -570 -5093 -978 -1256 -5033 -6576 773 -152 2111 2371 -1960 4219
23632 4219 12140 9175 7223 -636 4554 8778 9395 4582 1672 3534 801 -2157 -756 -201 -2953
23617 -2953 -2422 -598 4729 2269 3802 4545 3166 5165 8422 8940 8709 12340 11719 7608 6757 1018
23601 1018 -573 -4695 -8944 -6382 -5267 -1817 -1385 -2096 -3517 533 452 -2656 -1784 2043 164 1425
23585 1425 152 -1673 -889 -900 963 1473 7551 7071 3968 -2054 -4693 1930 -569 -2039 456 1851
23569 1851 -4138 -985 -1924 -4468 -603 -2572 -1030 431 87 -2503 -3366 -2857 1497 1599 779 7137
23553 7137 4774 2247 3009 9819 5208 -220 -11138 -7169 3105 8165 -6104 -10711 -7076 -8289
23539 -8289 -8445 -7330 -5279 492 7229 5729 -1731 3177 10388 9078 11508 15487 11125 4390 3097
23524 3097 2046 -3925 -7403 -13028 -9154 -4288 2244 -2175 -8684 -14437 -17288 -13151 -7581 -511 -3605
23509 -3605 -6650 -10094 -2387 -1719 997 2682 9584 12492 14069 15657 11277 4550 2969 5865 3893
23494 3893 335 -1066 5264 5315 1985 931 1006 3251 722 -3093 -1513 -943 -7194 -9184 -10982 -8774
23478 -8774 2643 3874 -2788 -2874 1715 2279 472 -2535 -2621 -5246 -5639 -697 2073 5419 7762 1371
23462 1371 4807 7056 6429 2274 -1286 -1682 -611 -5083 -7010 -305 5264 -399 -3004 -369 -7314
23447 -7314 -8333 -6330 -7115 -10448 -3172 3650 1733 -3078 386 5463 8867 12217 7326 -1118 -6111
23432 -6111 -4785 -260 6040 3672 7604 11544 11429 8355 8847 10007 7269 9716 3265 1500 8565
23417 8565 2884 -1965 233 -3640 -3194 -3291 837 7929 13805 14932 8403 2842 -909 4757 8619
23402 8619 3416 622 -1616 -2458 -2931 -4992 -2653 3518 12272 4787 -1311 -1480 5681 5303 4306 4927
23386 4927 5218 3089 2046 3545 2471 -1365 -5552 -232 2732 -1411 -2870 3161 7420 11041 8142
23371 8142 9660 11125 12182 16694 10947 3985 2951 -2565 -99 2563 -1993 -3609 1362 5101 4677
23356 4677 5596 5795 1556 -7813 -7530 -4910 888 2953 -2539 -4879 -7309 -11095 -13818 -10428 4104
23341 4104 4709 8653 5824 -2074 270 3723 7542 7178 1072 -4546 -4760 -2885 2804 854 -4749
23326 -4749 234 6277 5476 2409 8917 8634 581 -4255 -2212 -2999 -4064 2735 -909 1931 7918
23311 7918 10508 7869 5340 -1396 -6655 -8472 -4747 -5596 -9990 -13811 -2691 4804 12399 8693 4355
23296 4355 6277 7029 10933 4980 1213 819 -714 2336 7612 11918 8761 9120 9981 8332 9061 11216
23280 11216 9094 7179 9509 7922 9500 6260 -10762 -13141 -10110 -2941 5493 3416 467 -1978
23266 -1978 1354 1399 -727 2664 201 3884 3837 3255 5740 1765 975 3957 8924 11607 7816 0
23250 0 1565 3547 -4342 -6299 -2951 159 685 2676 5961 5233 6321 6112 68 -9753 -10808 -3768
23234 -3768 -451 -2426 -1583 -1096 -4292 -4772 911 4115 8089 10410 10666 3022 96 4633 5628 -2632
23218 -2632 -3660 -1685 2571 7332 8567 10483 16909 16127 13347 13048 5615 -3308 340 7175 8195
23203 8195 1666 -8802 -10661 -12501 -7225 -2565 5705 16161 13351 7647 4305 1708 3905 9770
23189 9770 6473 -1054 -3167 471 375 4667 11556 13587 8471 9557 6463 2320 2166 377 2260
23174 2260 1410 -1020 1549 3714 4067 -1474 -1305 -3108 -6081 -1657 56 -4694 -771 1822 6779
23159 6779 7045 4985 5690 5742 -2340 2765 7415 1196 -10002 -13349 -13128 -9882 -7036 1011 2337 5755
23143 5755 5109 -4913 -7021 -4062 -3071 -5271 -1626 1731 -2881 -9740 -14954 -9924 -8252 -10840 -11261
23128 -11261 -6374 -4616 528 5785 2300 -3628 -2296 -1172 -764 730 -1824 -2424 -590 2042 4399
23113 4399 7674 -937 1301 1642 -1558 942 9246 10468 5404 4588 -950 -5405 -11901 -8091 -3310
23098 -3310 5750 12561 10093 3457 -3527 -2940 -4453 -7888 -8417 -11686 -12104 -6816 -5132 4953 11773
23083 11773 10909 11404 3211 -7130 -6241 -1876 509 8646 3517 -6492 -2010 3896 -368 -419 156
23068 156 -930 -6247 -12256 -9766 -3536 -129 3670 3797 2424 -3398 -10754 -11530 -14521 -9307 -9260 -12106
23052 -12106 -6472 -5155 -4134 5797 3540 -4641 -6430 -10972 -14605 -11048 -2360 -3399 -12430 -9685
23038 -9685 -6481 -3979 563 4664 1355 456 5811 9137 4752 2181 7739 2730 -265 2144 -454
23023 -454 -9246 -4086 5341 169 -6641 -8978 -6247 -1940 -612 -407 4106 5107 6553 4784 9871
23008 9871 11473 9544 11476 12588 10327 325 3469 12310 9516 914 -3960 -11139 -14181 -14733 -9282
22993 -9282 -7917 -5323 250 4067 1470 -1329 2702 6490 5410 1313 -5981 -4339 -864 2769 -2245
22978 -2245 -4948 -3048 -6565 -9831 -2833 2772 5623 4130 429 -2840 -5400 -100 2660 -2408 -3252
22963 -3252 -5091 -7583 -9457 -11409 -5232 -8462 -8073 -307 731 106 1675 593 -5469 -8628 -9789
22948 -9789 -4966 3186 7948 2858 -2367 -2951 -5322 -3453 -657 717 7373 5125 6780 7826 3161
22933 3161 2372 -1557 2799 4647 1075 -3821 -2015 -4423 -1900 44 -1677 744 3435 5531 6033
22918 6033 6638 6445 -633 2623 3056 685 -5646 -11286 -8815 -4408 -4932 -4643 -7735 -12134 -6862 -2790
22902 -2790 -6172 -8307 -9097 -3482 -3203 -5239 1519 4966 -1697 -74 9624 7460 5523 7993 7634
22887 7634 758 274 -412 -3892 -458 -5116 -5073 -12603 -12275 -9980 -11988 -4735 1219 1075 492 -1668
22871 -1668 4450 7507 2608 1590 2103 5192 6651 9182 11309 4201 3812 -666 -3196 968 5944
22856 5944 2272 -4572 -3973 -1849 -3536 -5006 -2613 1320 -575 8003 9178 8077 5673 145 -2478
22841 -2478 1770 1206 341 4785 -1016 -3650 -4590 -8499 -6847 4622 10120 12481 2870 249 -4826
22826 -4826 -3036 1831 725 -1279 -5082 -165 -1739 -8238 -12768 -17839 -11312 -5450 -4946 -5720 -605
22811 -605 9681 14718 10068 5162 -613 -2151 1992 -3346 970 9786 6367 3707 5942 6934 1557
22796 1557 -4305 -2558 6693 6878 7260 6697 337 -7535 -5365 -5424 -1411 -4275 -3018 -5436 -7148 -6573
22780 -6573 -5175 -6403 -5124 -6081 -5414 -1431 -4734 -6416 -4022 -9044 -11617 -10537 -11331 -12994 -10817
22765 -10817 -6222 -991 5741 13838 9558 3047 -1357 -4638 -7016 -9540 -10247 -3172 -1449 -354 -3585
22750 -3585 -5588 -3687 -6778 -4332 -3330 1018 5130 335 -3592 -1423 -821 -1766 -6476 -9654 -11079
22735 -11079 -7676 1155 5022 3659 2772 2432 -4175 -8754 -5844 -7143 -4193 -2953 -7149 223 304
22720 304 -1092 2307 2277 -2139 -4708 -1874 1714 -323 2732 6748 11737 8692 9540 8695 8340 7228
22704 7228 6264 4051 7764 4350 1166 -2251 -6453 -2444 -6691 -4243 400 9901 10934 -1668 -5205
22689 -5205 -748 -1713 -6019 -10356 -9025 -3402 4981 10905 9710 7701 5957 3004 2015 -428 5059
22674 5059 10901 9066 7670 3555 2433 2755 1535 2592 4772 2296 6846 10161 5828 -480 2183
22659 2183 1571 -3519 -6907 -3348 3745 6564 -1711 2604 -1054 -1333 72 -2564 1701 4117 137
22644 137 -5643 -4706 -4813 -47 2780 4058 -1411 -2096 -84 -2182 -11202 -10888 -8432 -4654 -3577 216
22628 216 -4285 -13593 -12117 -15950 -20280 -19691 -17335 -8547 -4722 -3262 1529 -3807 3971 2422 -4411
22613 -4411 -4127 -7344 -12878 -15359 -8576 -2095 -4459 -2210 -3859 -4890 -501 -4216 -7605 -5786 -764
22598 -764 5937 9075 5427 5006 8737 12795 11522 9287 4629 -2935 -2649 1896 -4897 -8320 -10545
22583 -10545 -3322 3699 6163 3193 6364 7545 6572 6501 8956 8038 6346 -1726 -9096 -11471 -6203
22568 -6203 -4446 4180 8374 5916 4576 6899 6090 4011 -2907 -1986 -653 -3105 -3207 1795 85
22553 85 -3438 -1200 2607 2962 2059 5409 8421 8446 6891 4886 4577 5228 6712 8749 10392 13317 7448
22536 7448 2744 1058 -1149 -1509 -4082 1159 2116 4268 -67 -3546 -8753 -4994 -5443 -7775 -6513
22521 -6513 -3092 7497 6707 -2269 -2409 -6201 -5071 -8940 -5821 3979 8897 8066 -1012 -5643 -3997
22506 -3997 -7319 -7524 -7208 -9405 1164 -1349 -3152 -7155 -8943 -12380 -17123 -15671 -10334 -8142 -8658
22491 -8658 -8696 -5991 -3929 -3361 -7990 -16020 -17004 -13880 -7505 -2759 -3143 -3171 -6169 -7604 -13454 -16351
22475 -16351 -11026 -9718 -5507 2500 6758 7396 4006 2447 -4444 -7799 -8546 -4238 5217 9775 3890
22460 3890 3831 6056 6615 7281 7523 10808 8134 9555 -1280 -6961 -5187 -5035 -4981 -3335 3305 -1761
22444 -1761 -7544 -10323 -11394 -14945 -10344 -6767 -9125 -2722 -3094 -7689 -2067 -2788 -8677 -11051 -11478
22429 -11478 -10469 -4045 -3980 -8472 -8693 -5217 5995 16117 11960 10372 15236 5809 2903 3901 6794
22414 6794 2637 -3761 -6533 1464 4579 1600 1598 -387 1279 -4196 -9964 -9226 -6840 722 7642 10138
22398 10138 12139 13574 6698 7734 2247 -791 4783 3708 -2763 -10105 -13017 -9509 -1329 457
22384 457 -4846 -3829 -4656 -5954 -1115 6703 8645 10171 6522 4690 1500 813 -877 1617 8501
22369 8501 8732 2509 88 -1960 878 4349 7213 8985 13033 13980 10412 8059 7409 1045 -1333
22354 -1333 -5819 -2540 -6030 2836 5615 4225 2386 2625 1604 1466 3508 -872 2870 786 1043
22339 1043 3574 2976 8767 14680 8400 3942 1108 -3649 -755 7512 14158 10826 7106 5900 1159
22324 1159 1270 -6079 -5790 847 754 430 5802 3839 1355 -6534 -10993 -10752 -5024 -546 -994 7418
22308 7418 11466 8405 3410 -2280 1708 2809 -1478 -949 4591 4021 -114 2405 -1200 -766 -1664 -2938
22292 -2938 -1993 -2140 2220 9223 10235 8248 6638 2969 5389 7160 3823 5259 1916 -315 2184
22277 2184 -638 3934 4984 -6443 -5783 -674 2927 7067 7733 12678 4030 -5308 -7881 -4954 2853
22262 2853 -842 -3951 -5823 -5523 -1901 -7924 -10327 -7887 -7007 -2056 1268 1256 2352 10646 10529 10686
22246 10686 7619 4208 5773 5097 -2487 -6322 -9755 -10336 -5451 -2540 6175 8874 11340 6449 3221
22231 3221 -3593 -671 -2105 -2734 2553 3211 1595 6412 1265 -907 1688 592 9509 12231 17494
22216 17494 14972 11515 14942 18674 14023 6464 -253 -5879 -2361 2395 5596 5740 1561 -716 2779
22201 2779 6238 6911 10254 6074 2857 1711 -540 -6172 -6700 773 1780 722 2202 827 -1064
22186 -1064 -8860 -12581 -4445 2729 6204 2135 -227 -6665 -9193 -5756 -117 -2319 -2243 -4020 -3801
22171 -3801 -4860 -6685 -4264 -6080 -11908 -4463 -871 -494 596 -30 -453 1085 -2461 -4228 -5768
22156 -5768 309 6584 2171 -1972 6826 13413 14205 11523 10747 8261 4278 6817 9971 6482 4534
22141 4534 9022 6501 8219 9044 5562 2033 -2314 832 -638 -8001 -11760 -7289 1525 -645 3433
22126 3433 13612 8903 -1330 -2738 -2596 -2338 -2695 -5645 -1174 1001 2848 924 3309 4763 4229
22111 4229 509 -1032 -123 -732 1207 4677 854 2443 -906 -5213 -3321 -4215 -8058 -8032 -7529 -817
22095 -817 -1734 1368 4223 1637 -1987 4516 11793 9243 -1423 254 4478 11244 17388 16926 11586
22080 11586 12093 14118 10518 5978 6494 12444 9454 8543 6949 2512 4412 2109 -763 -4734 -8825
22065 -8825 -8047 -4667 -1489 -3047 -282 -156 3982 2692 6518 6598 4944 7301 10170 8881 9300 10433
22049 10433 11866 11135 3635 -4464 -5445 -7442 -11399 -9404 -5550 -4762 -3028 -687 2350 5842 8025
22034 8025 10481 2008 -1386 935 3571 580 -315 -2384 3895 3016 -133 -1994 1558 1938 7460
22019 7460 1197 -4211 -9015 -8158 -6670 -6327 -11030 -7082 -5793 -10346 -4595 11251 14535 10000 9064
22004 9064 4454 -37 -464 2334 902 -4750 -6617 -1522 2078 -2039 186 -6966 -7367 -4216 -5694
21989 -5694 -11303 -10553 -3898 -5623 -4025 -3542 -663 -5086 -12578 -15877 -5372 1923 2486 6668 4943
21974 4943 -1099 -1405 -7227 -8824 -2020 2435 -6182 -6076 -2302 2214 333 -590 3423 -2017 -6290
21959 -6290 -7078 -8675 -7632 -2123 4820 12939 11959 5772 2136 818 -2878 1316 -1594 -8566 -10772
21944 -10772 -8271 -3684 1107 5407 4428 -3991 -11217 -11769 -11364 -2913 3371 2677 9030 14473 13841 4045
21928 4045 -1005 -4234 -3160 -4865 -14588 -14143 -5779 -7214 -9693 -10287 -6868 -3091 -2702 562 -333 107
21912 107 4486 4614 -464 -2286 532 -2256 -3780 -7872 -9580 -10231 -9155 -11194 -2019 6283 9386
21897 9386 6574 4051 3724 6613 400 -1688 -5311 -8528 -15339 -15538 -5949 -3357 -8005 -11261 -7238
21882 -7238 -7931 -13340 -12785 -7915 -2331 -1191 -6921 -6196 -2469 -2592 -151 1152 2980 4463 -1012 -6974
21866 -6974 -9874 -2785 1780 -179 -6941 -4148 -4503 -3432 -4437 -5456 -9870 -8599 -7546 -5570 -6328
21851 -6328 -6879 -4697 -10046 -15022 -12533 -8377 -4951 -589 1356 11654 8833 5445 2973 4109 -1450
21836 -1450 -11403 -8931 -802 4625 -474 -1961 -1929 2648 6630 4454 2450 -617 -1882 3085 249
21821 249 -6001 -3072 -1704 -2045 -3442 3341 3920 -2471 -4079 -6452 -12376 -12042 -3523 -6067 -5777 -2059
21805 -2059 -8066 -6650 -8530 -9562 -2634 2114 2010 679 1180 1504 1454 -97 2616 2191 9748 10038
21789 10038 9840 9965 7090 1666 380 1485 5082 1484 4786 7407 12307 7354 4128 -1585 -1550
21774 -1550 4121 7743 2943 1566 -185 -4878 -3263 -7352 -7365 -4441 -3655 2134 6859 1119 -6192
21759 -6192 -5320 -3128 -2835 1821 5693 1784 -1972 -8507 -10237 -7466 -7486 -9559 -7602 -2359 -6999 -8080
21743 -8080 -2855 -957 -1071 -1593 -1047 -338 -1918 825 -4496 -6816 -6045 865 3049 10647 10025 -816
21727 -816 -7812 -12315 -13222 -3400 50 1685 8419 8208 3408 327 2675 3280 2353 -4529 -7758 -4634
21711 -4634 2322 2897 1377 2142 -3102 867 6762 8216 10364 13036 5451 -1145 8792 8032 5187
21696 5187 -7234 -6574 93 -4134 -12425 -12021 -11749 -12956 -11783 -10059 -8554 -10904 -11143 -4998 2244
21681 2244 4663 10590 6984 3448 3583 7823 7017 2683 -10293 -12445 -9323 -1541 2373 5204 7306
21666 7306 7541 3523 -1970 -6790 -4196 -8458 -9154 -8554 -7968 -4176 -2063 1646 1899 -1339 -5480 -6096
21650 -6096 974 -247 -6301 -3677 -4467 -8813 -8159 -11370 -7534 -6994 -7303 -3360 -7857 -9154 -9017 -12986
21634 -12986 -12230 -8541 1240 6791 5878 2999 432 -3691 -8171 -8968 -5734 -4855 -9835 -5425 4618
21619 4618 -2189 -5895 -3519 -3368 221 790 -511 -6111 -5422 5099 7355 3866 162 4202 3644
21604 3644 202 -1954 -940 2577 1110 194 -7487 -13899 -5358 623 -1459 -5467 -8133 876 3983
21589 3983 2614 2002 13856 11141 6972 8060 8717 5809 5104 3523 6350 564 816 1942 -1491
21574 -1491 -7773 -11017 -7918 -3946 -5227 -4321 4017 4598 8447 10416 5843 -2932 -4315 3122 7234
21559 7234 7623 -2775 -7885 -8251 -5036 -2308 -925 -10086 -12762 -5080 1131 280 -942 8247 11992
21544 11992 20923 19996 7117 -5358 -11948 -16807 -11780 -5486 -4658 -3545 -4428 -2025 -3569 -4620 -5639
21529 -5639 -7161 -8700 -3993 -9698 -7722 -8645 -6355 -5955 -6320 2200 9093 5418 6299 2204 684 -3024
21513 -3024 -5178 -5070 -6389 -12239 -11301 -9351 -3478 -2216 -4837 -2861 307 998 3746 6249 6059 1923
21497 1923 -5592 -8779 -3505 4699 7947 6584 -29 -2992 -2204 -2573 -4974 -3369 -3097 -9019 -11075
21482 -11075 -4027 -1347 -3888 -4196 1276 7385 9752 -4511 -15104 -12037 -3418 -1460 170 -1815
21468 -1815 -1643 -1417 1793 1698 -1999 -5092 -715 2500 3963 94 -5642 -6564 -2762 -3772 -279 -2318
21452 -2318 -3868 -2607 3967 -2444 -4923 -1034 3380 4108 -2330 1184 5613 6306 2994 -2198 1246
21437 1246 10723 3904 445 -2369 -4913 1100 2463 6023 5156 696 -1349 -1692 1159 2533 3063
21422 3063 -4614 -5434 1292 1495 -1801 -1579 -625 -862 -9379 -5953 -3415 -3205 2431 1057 -6 -4363
21406 -4363 -1926 1661 4947 9832 7069 2800 389 -2126 -5667 -6753 -2430 843 124 2267 10637
21391 10637 9866 11853 10566 5790 -117 -2344 -5277 539 4047 2887 -193 -937 3755 6695 1908
21376 1908 1077 3472 8115 10731 10292 6985 1408 -5671 -5394 -5169 -5025 -10571 -10994 -4570 -3859 -801
21360 -801 -1833 -4326 -5514 -3393 -4751 -9075 -11732 -6151 -1943 -2456 2263 -1655 1138 1595 -3058
21345 -3058 -5732 610 713 -3571 -5071 -9635 -18952 -14103 -10977 -3843 -2504 -1232 -7015 -10384 -6908
21330 -6908 -8787 -6430 495 -4999 -7798 -693 11638 11609 3404 -3182 -9146 -14760 -17983 -15211 -15685
21315 -15685 -15884 -10324 -11882 -15448 -13662 -10678 -13515 -19596 -15773 -6515 -4010 -12407 -15213 -9019 -6617
21300 -6617 -258 5748 10456 13867 14226 10963 5456 -1985 -12607 -14394 -11214 -11571 -9382 -12514 -17096
21285 -17096 -13620 -8674 1055 -684 -2006 -4513 -1112 5140 3798 -1266 -6707 -6318 -1888 4310 7077
21270 7077 2642 -2334 3393 7431 7120 5599 6346 3129 -1009 -708 -2816 -7940 -8878 -4142 3192 4526
21254 4526 3689 -803 -238 -2600 -7604 -3600 -3432 2338 4314 2317 2805 -3489 -8726 -952 4405 2203
21238 2203 161 -2435 -6849 -5665 -10459 -4827 555 4454 4359 -1323 -2856 -6395 -11202 -7573 911
21223 911 4571 3623 3716 -781 3031 2389 -5669 -4408 -758 -3722 -1584 -3515 -1374 6862 1909 -5438
21207 -5438 -3043 -6368 -6022 -5472 -7466 -7100 -11155 -9451 -2357 3923 6270 2140 -1465 -3545 -935
21192 -935 -3356 -6212 -3766 -1 -770 -157 3511 5045 9134 8567 9002 6824 6168 5127 3692 -776
21176 -776 2045 7840 5438 607 -1699 -901 1968 9111 14538 5419 -1637 4106 11832 5415 -2486
21161 -2486 706 734 -6184 -7225 -6911 -2155 5938 942 3850 4140 1285 -2032 -5818 -5072 -261 6259
21145 6259 932 3700 4812 -568 -4495 -5041 -7137 -7051 -5713 -4538 -9065 -8019 -1615 -96 -1668
21130 -1668 -180 4357 2103 -2553 -3516 -4435 -1414 -1555 -2256 -3028 -1270 -1933 -2375 -4646 -6580 -10727
21114 -10727 -2984 1423 4886 5758 6498 150 1792 5885 8090 4757 4456 6287 5169 546 5827
21099 5827 14650 8398 5663 5407 1480 1115 4948 1329 -1895 2942 7432 1809 1011 3080 7709
21084 7709 1246 -4785 1107 3052 2179 4681 5640 -3291 -4157 -1332 1465 5588 13222 10106 4018
21069 4018 5188 5858 6524 6917 7683 8340 6689 3148 -4637 -5884 -7435 -5728 204 2177 957 6171
21053 6171 4622 1938 975 -4595 -7596 -1719 2178 546 -4266 -3050 -5020 -8788 -523 4636 3194
21038 3194 103 2536 4341 6374 6303 3336 4362 5616 4429 3609 4619 5247 7407 4396 4957 1041
21022 1041 4401 10321 4138 6930 3215 1614 -1866 2292 1906 -4440 -8182 -4485 3163 3631 3758
21007 3758 3174 -1859 -7053 -2295 -4621 -2745 2241 4542 6217 8730 11357 10178 6234 584 -3012
20992 -3012 -3299 -12763 -13892 -2553 2063 4876 5057 4688 4099 4594 2633 1733 -4431 1530 14926 13278
20976 13278 13220 8023 1468 -1166 -4706 -10285 -5884 -2183 1610 3944 -3025 -15169 -13764 -8266 -2377
20961 -2377 -5194 -3292 2924 5649 1591 1203 -1640 -266 -1905 -903 5713 303 -14101 -15829 -5306
20946 -5306 -5570 -799 -1616 -4366 -2840 -11133 -12242 -10819 -13477 -18238 -11777 -7275 -3714 2405 -4237
20931 -4237 -10003 -9650 -10070 -12629 -15256 -19809 -15239 -5148 -1811 -3725 -3059 -5513 -6890 -7557 -6384
20916 -6384 -2921 -5952 -1074 -5 4215 3680 821 266 -188 -2664 -3391 1842 1699 965 -5437 -9011
20900 -9011 -8460 -13126 -13329 -11382 -5663 442 -901 -6727 -12178 -10392 -8011 -5269 -5988 -5439 -3865 -9880
20884 -9880 -10373 -7944 -4895 -12508 -11320 -5002 -3229 -487 -3648 -3239 -2852 -6322 -8229 -8828 -9348 -5967
20868 -5967 1481 7203 4306 -1532 -2587 -6406 -8972 -11090 -11715 -12509 -7438 -5921 -4052 -1271 -2719
20853 -2719 388 -4371 -7337 -6115 -8689 -6733 -5836 -4771 -2642 2659 2045 -992 -5131 -2407 -3066
20838 -3066 2993 10803 11986 7349 7158 4805 3567 -1607 -2412 -1818 -652 597 -1387 -1407 477 1792
20822 1792 4250 3886 3816 1987 449 -8473 -11504 -6551 -65 609 -1761 4273 -1286 -3424 2919 -2489
20806 -2489 -7751 -12212 -5644 912 344 -1070 682 -380 -4209 -877 6201 9666 8591 6349 4203
20791 4203 -145 -3503 -5298 -14634 -17331 -11854 -6254 -3659 -7245 -4052 -3274 -4748 -14912 -14582 -5351
20776 -5351 -1464 -5859 -13306 -16505 -14641 -12624 -18922 -16642 -5620 -7353 -3911 878 5401 4413 -1456
20761 -1456 -8928 371 5156 10415 10865 6229 5734 5129 2746 -4297 -8312 -8008 794 7211 8550 9651
20745 9651 10355 9551 10011 9220 5207 4348 -583 -7286 -5133 -9601 -4643 -4549 -9143 -6283 -6420 2340 1891
20728 1891 -338 2265 2292 4326 1307 -1163 5588 7859 5138 106 -802 -1752 9866 12986 10330
20713 10330 14322 13951 9377 10510 11209 7419 5722 5069 5129 6626 973 -6317 -5969 3304 6405 -689
20697 -689 -9765 -16445 -10563 -9938 -9126 -4702 3854 1375 -2993 692 6953 8823 12841 10633 2380
20682 2380 669 3222 -3921 613 5237 5547 304 -11893 -15339 -12668 -13155 -11708 -6198 5211 4739
20667 4739 3265 -980 309 -1011 -8111 -7038 -1807 655 -669 2056 4212 3333 -65 -890 -759
20652 -759 -3794 -2355 -2234 -4312 -1712 -5088 729 1516 -23 -6495 -12841 -11996 -5896 -4950 -7271 -2535
20636 -2535 -6365 -6413 -4105 -2452 -3216 -3885 -4755 -5463 -3357 -8041 -8344 -11656 -13135 -17136 -11171 -4691
20620 -4691 -2360 -8084 -9057 -3770 -791 -634 -4524 -4461 -8792 -8523 -7265 -5411 -2794 -6805 -8083 -3515
20604 -3515 -3449 -14093 -10982 -6079 -9862 -5836 -940 1111 5042 4761 1796 -5207 -8667 -8997 -3111
20589 -3111 2211 -3422 -845 637 1382 -13666 -17835 -11131 -3916 -4100 -7971 -9368 -11243 -3072 4842
20574 4842 7169 1558 -6573 -2145 8229 9680 5092 6292 9249 13114 12883 5391 640 668 -1205
20559 -1205 -3171 -7471 -14877 -11197 -7665 -6947 932 5388 4934 1875 2592 -771 -8447 -14362 -9985
20544 -9985 -4283 -4264 -4631 531 2666 2698 -6901 -5629 -4439 -6609 -12264 -12341 -6623 -1149 2976 6345
20528 6345 8390 7139 7835 4222 2073 5608 1496 1612 3151 461 -4807 -4314 -2028 -2960 -9630 -11155
20512 -11155 -12301 -11802 -13289 -7569 -5725 -8320 -10717 -11377 -9328 -4107 1365 -7041 -1402 -1209 -1280 -693
20496 -693 -965 -3217 -6156 -2106 -2359 -6761 -12892 -14217 -10331 -5159 -4372 -1970 730 -3196 11 2287
20480 2287 3631 1994 1150 -2019 -8383 -8511 -738 5289 5966 4504 1295 3087 54 -6181 -9382
20465 -9382 -6198 -7267 -4618 -2404 -2583 -9205 -2391 3107 100 -1532 -4466 -13744 -9917 -7947 -8557
20450 -8557 -5400 -6894 -8258 -7764 -9000 -9637 -8396 -9036 -4275 4526 11411 14382 7369 1487 -3479
20435 -3479 -6818 -2291 -8563 -4753 1655 3377 3581 3230 2070 -2172 -135 -450 -2304 -906 3882
20420 3882 7615 -6162 -4229 3213 4594 -1103 -3050 -4573 -2092 -1410 153 2635 -6258 -12589 -14350
20405 -14350 -4578 -4978 -4299 -9843 -10665 -9333 -4174 5190 1744 -4221 -2623 1576 8258 7902 6401
20390 6401 10549 6498 6114 7544 6590 5780 320 -3619 4897 7683 3075 3369 -2873 -2418 1731 4353
20374 4353 -57 2352 6747 6822 3768 1986 5835 7525 7167 7561 5375 9968 2306 -5936 -8649 -7454
20358 -7454 -1550 -1656 -463 -1936 -886 7040 9676 746 -6945 -2530 947 -2960 -8309 -4075 -401
20343 -401 -4193 -6568 -4344 -255 -5266 -3685 -2058 -8330 -7138 -6943 -3555 -5085 -10486 -10142 731
20328 731 7062 8205 3597 998 29 280 6064 7536 7221 1485 1556 -1485 -2651 -1260 -1549 -6908
20312 -6908 -10897 -4340 -2467 -2585 -1063 -5799 -7532 -11858 -13606 -3535 924 984 2396 551 1640
20297 1640 4155 4451 791 -4828 -10428 -13260 -14609 -5545 2639 4284 5206 601 1274 4002 -409
20282 -409 -4378 -5588 -4300 295 2257 -2456 -1800 1880 610 -2458 3208 6139 2607 -3613 -4874
20267 -4874 -5580 -10404 -5241 -11073 -9149 -4642 -8042 -8229 -3445 -7205 -7077 -3121 791 -2862 -7964
20252 -7964 -2544 -4797 -3533 -2327 4292 3422 4739 259 -1785 -3919 -5718 -7443 832 3538 3500
20237 3500 51 -4668 -25 -914 -3964 -1368 -582 -9341 -16666 -13094 -12093 -7994 211 4935 5185
20222 5185 7297 9862 3853 495 -3687 -2818 -3290 -7201 -13383 -12768 -12585 -17734 -10832 -7324 -5252 -2425
20206 -2425 -5378 -4311 -8329 -3149 -8277 -7089 1804 1437 -4900 -8696 -7477 -121 6131 7284 -1375
20191 -1375 -3233 -5039 -5220 -8919 -6826 -3442 198 1851 1715 4454 2256 -3917 -13494 -13337 -7290
20176 -7290 -1933 1786 2601 3847 6292 3212 3355 4594 -1673 -8982 -2470 2535 -2456 -7613 -16727
20161 -16727 -17645 -8773 -1510 6784 1137 -2261 -4235 4655 5276 -772 1087 4997 3094 4535 -1593
20146 -1593 -1887 -2052 -4563 -2064 -2622 -3711 -6819 -12252 -6372 -3941 -8971 -15977 -16112 -11831 -9506 -9524
20130 -9524 -7823 -5073 1601 -343 -1139 -29 -2002 -4631 -2722 -776 -3076 -4676 -2209 -4276 -7073
20115 -7073 -7915 -10878 -5113 -8384 -12222 -12337 -7323 -1471 -4071 -3819 -6285 -8592 -9510 -6438 -5430 -1512
20099 -1512 -5049 -9232 -3916 -4263 -7743 -7183 -6702 -13602 -18762 -14302 -11176 -13016 -12841 -4897 -5290 -2610
20083 -2610 -2386 -10 570 2824 -606 3323 6277 6024 -108 -4256 -8863 -12488 -8130 -2505 -4778
20068 -4778 -10559 -5902 1408 2228 5561 6660 -2248 -5094 -302 -1421 -3953 -4603 -1775 3812 7130
20053 7130 3005 -26 6718 8199 6636 5124 4036 653 -3077 -5618 -803 1101 1690 -2728 -6334
20038 -6334 -175 2928 8088 15069 16584 5606 533 1089 2136 -2706 2192 5370 11726 12689 14243
20023 14243 14913 11976 9631 10553 3984 6272 4417 -1305 -5901 -4012 -2612 -1799 -38 3087 2541
20008 2541 -2022 -7883 -14960 -14174 -12901 -10876 -11267 -6708 -2894 -4757 -5690 -4991 -1174 1834 -543 -1449
19992 -1449 561 1259 37 3874 7528 6387 515 -37 5241 1220 -2128 -793 3779 6512 2496
19977 2496 1345 -86 3884 4751 -3223 -7646 -9346 -5621 -6858 -3365 -2538 -3924 -6119 -4928 75
19962 75 1248 3976 2602 3303 6399 10059 6766 10722 3499 -807 3633 1199 432 5575 8990 8232
19946 8232 -2087 -6863 -7806 -2569 -6457 -5045 2502 5555 4025 143 506 7042 10158 9564 13774
19931 13774 10810 9656 5388 5815 6648 10659 10584 4289 1284 2986 3571 7318 7813 2158 -5240 -12328
19915 -12328 -4957 2071 4649 1077 4020 7104 1529 -3676 -8815 -11107 -10625 -496 989 250 -151
19900 -151 -8163 -15075 -10528 -4989 -2354 -3837 -5094 -7050 -740 -297 -9429 -9367 -7446 -5801 694 -2453
19884 -2453 -198 60 1362 5327 6572 9116 7365 8453 13357 12500 8317 3880 2947 1299 -450
19869 -450 -2190 -1564 -3981 -5355 -9589 -6647 1352 -6 -2578 -6103 -1803 3027 14732 8970 4263
19854 4263 -1182 -1875 1543 -1366 101 -384 -4793 -5377 -10411 -13546 -14135 -11058 -2053 -2027 -832 5693
19838 5693 3555 -1795 -1493 -7253 -13494 -13352 -2712 2202 4754 8423 11662 8642 7320 6518 -3686
19823 -3686 -8499 -16284 -21367 -13698 -4055 -7266 -11111 -15673 -10007 -9213 -7334 -11825 -7171 -2527 541
19808 541 1810 -1025 -2614 -5715 -5160 -2418 -1446 -2260 2279 1181 30 3804 -1119 -10349 -8464 -2928
19792 -2928 -149 -3755 -969 1888 6431 8608 9795 12435 12186 3025 -876 2023 782 -3953 -2562
19777 -2562 4258 1717 -3588 -5171 -194 581 3789 8640 5737 2099 -1721 -3478 -3038 -2741 -2924 -1894
19761 -1894 2993 492 -1785 1166 3630 -585 -5925 -10181 -18891 -15111 -13114 -10383 -8542 -6378 795
19746 795 2573 -6400 -7807 -11656 -7836 -8099 -5343 -3457 -2077 787 -1719 -2547 5708 3784 -2556
19731 -2556 -6433 -12034 -2077 -1231 -1544 -1615 -4430 -1388 -2937 -4176 -1431 -2489 278 -2464 -7945 -3889
19715 -3889 -3803 -3951 -457 -221 -3256 -8902 -8494 -6321 -9541 -6163 -10274 -9300 -2592 -3514 1842 3870
19699 3870 2622 4678 1466 -5105 -1125 4534 700 -6592 -6452 -1925 1700 2531 1664 -145 -5043
19684 -5043 -4882 -1488 4787 5806 8367 9289 10303 6517 7236 7997 447 -2900 1491 2110 -74 455
19668 455 -4090 -1360 1776 4402 6282 3331 2567 1070 -5580 -3770 907 10953 15463 10127 3754
19653 3754 -1280 -1246 4858 9580 9532 -2173 -5924 -3534 -1070 2269 3285 2638 3127 4863 -2114 -6792
19637 -6792 -5865 -927 3242 7745 8083 11599 11129 8055 4312 4911 8771 3742 -1664 6194 10791 12973
19621 12973 9606 5875 544 -6649 -11112 -11543 -849 6403 2804 -945 -853 211 -166 -6785 -13430
19606 -13430 -8067 -4618 -4627 -4564 258 -4036 -9982 -7459 -12495 -16216 -9917 -4094 2036 8177 6758 1391
19590 1391 -981 -2435 1638 5011 1451 -1105 -523 4831 6401 5276 -277 -1802 4828 8291 8814
19575 8814 5966 -2383 -2930 -1548 855 3165 6134 10438 3607 797 3386 7583 924 -3705 -2363
19560 -2363 -974 303 3288 5403 -1444 -1832 -7144 -5228 -1772 2298 488 1064 1025 1249 99 -3631
19544 -3631 1396 5584 10669 15994 8960 898 2797 6274 8468 9349 7741 3760 -5098 -6613 -2845
19529 -2845 -873 8423 14635 14196 6172 -919 -6164 -4451 -2904 -3029 1203 -1962 -5516 2767 -303
19514 -303 -2363 759 -1963 -954 3565 5146 2518 9153 9742 7726 7088 -2880 -7681 -4634 2866
19499 2866 5879 808 -289 -4327 -4641 -4605 -2861 -5280 -3886 6424 3974 1407 4473 7545 6538
19484 6538 661 -17 769 -3296 -4900 -6788 -6211 -2990 -9884 -8024 -9228 -7857 1850 -1204 -4647
19469 -4647 -3320 951 2018 6447 2330 -5963 -6290 7319 16117 9189 3772 604 2775 8148 6731
19454 6731 3374 -3354 -3521 -522 3934 -2008 -2447 -7844 -4470 3430 9364 8348 6922 10493 15960
19439 15960 12835 6077 1554 3895 8601 4129 -2531 -282 -695 -713 7508 13895 6441 7016 13735
19424 13735 11546 6846 -132 -2479 5053 12538 13094 8159 11222 6684 5109 4183 -237 3872 3154
19409 3154 -1361 -2530 -2972 2785 3184 5701 5413 -1809 -6163 -1370 9316 11556 10923 13316 13667 16218
19393 16218 15389 6884 2869 4593 5377 6776 5772 4566 5084 -2912 -4817 -4426 -3159 1346 -1084
19378 -1084 1282 10410 6862 -2760 -4072 588 -1232 -11238 -12494 -2777 -6641 -5801 -974 2870 -2618
19363 -2618 -6838 -10405 -14293 -8458 -7138 -5689 -1109 -4163 -1386 -6496 -5470 -5298 4809 7957 6124
19348 6124 7093 -1911 -13415 -18385 -9571 -9336 -13061 -7665 -8556 -8084 -8821 -4411 569 160 -6797 -7268
19332 -7268 -7692 223 4968 736 2895 -2754 -9524 -4523 35 -10143 -15147 -5601 5746 5427 952
19317 952 -5306 -7919 -6889 -4809 -5654 -3859 -202 3761 2357 -1092 -1577 -844 -4474 -5616 -3495 943
19301 943 2605 2887 6636 10622 6451 6015 6424 -713 847 5307 4209 -2820 -8600 -3825 -2553 1498
19285 1498 278 1427 7280 7817 18956 20272 13262 11457 10566 8030 -1113 -3578 2640 1530 -2598
19270 -2598 -8440 -2792 2435 -1290 1488 3042 7345 4362 -4514 1908 2003 3323 -1387 -6475 -8344
19255 -8344 -4745 -7880 -8273 -1869 -4345 -4926 -4396 -2353 -2347 -1148 4526 -1448 2085 4389 7333 6636
19239 6636 10845 10824 6334 2385 3133 3961 -1311 -1573 -4788 -5352 -3644 -6492 -5231 -3116 -3320 -1979
19223 -1979 -1374 -1867 -1798 -2622 -3686 -6032 -7680 -8143 -6476 -188 1765 438 503 -2494 -8408 -5544 -1986
19206 -1986 -2863 -7197 -6792 -884 1532 1478 1892 5477 7565 8585 10671 10325 3818 -1997 -2714 -2243 5999
19189 5999 6521 2279 -1947 -4386 -2224 -1493 -361 -2407 -7016 -5131 -2078 -7077 -12512 -13410 -9006
19174 -9006 -3352 -841 3979 4674 750 -1530 7336 17580 10075 -1239 -6284 -726 -200 1500 -1957
19159 -1957 -6600 2220 7503 8798 7733 4079 7757 15091 17689 15926 13536 7118 -4671 -797
19145 -797 6411 10587 8260 4071 769 -1351 -82 -1620 -4250 -6559 -3919 -1898 -1763 -1407 -7563
19130 -7563 -14260 -13892 -6476 3088 11369 10379 8529 2276 -587 -5616 -3388 -5858 -4483 -1089 -1658
19115 -1658 3463 3724 -9140 -14348 -11218 -10535 -13715 -14420 -14180 -10128 -8781 -2344 2150 2306 3737 1222
19099 1222 -5174 -3500 197 -1689 -11189 -7139 -9363 -2499 1266 -4552 -4198 -5963 -7771 -5729 -2408
19084 -2408 988 4180 -2145 -481 6598 12159 8019 343 -165 -3609 -3499 -4994 -4911 -6597 -9020 -1952
19068 -1952 245 -5688 -9447 -5152 -1321 -5769 -11195 -14997 -9763 -5549 -2749 -7660 -11692 -7326 -1633
19053 -1633 -6700 -8248 -5777 -10642 -9086 -2321 -2730 -3166 -5883 -5006 -8052 -9715 -1949 -2332 -7095 -6759
19037 -6759 -2160 581 932 -4113 -8080 -7857 -1492 -1059 2296 5967 -2213 -7662 -10248 -10683 -11141 -2646
19021 -2646 730 9508 11052 10899 8345 5171 3926 6354 5876 -264 -4144 -6492 1219 4539 -6
19006 -6 2129 5580 1835 -4413 -2025 -275 1580 3892 -773 -6401 -4564 -7452 -14343 -13328 -12472 -10731
18990 -10731 -11519 -6865 2256 4992 -1812 -7455 -7449 -3153 -2017 118 -9162 -10104 -6703 -8626 -3718 3648
18974 3648 4419 12364 5245 144 -380 -3636 -836 1474 1286 377 -1369 4703 5239 -4337 -9180 -11158
18958 -11158 -11372 -8494 -12629 -11259 -9798 -7075 -3438 4501 7465 5618 4218 -1093 2417 2834 -940
18943 -940 793 1050 5467 10339 9366 499 -1682 1067 -355 432 -8376 -9975 -6682 -8856 -10060 -8000
18927 -8000 -8727 1468 7794 2773 2583 5875 6630 4116 707 -4302 -7710 -12910 -12602 -15214 -14811 -8426
18911 -8426 -1651 7960 6587 1238 291 -4842 -14495 -18157 -13342 -7104 -4745 3013 2458 -10296 -15420
18896 -15420 -11712 -6567 2303 3276 2670 -2583 -1537 -3154 -798 -1191 1539 -79 -3992 -3190 4636
18881 4636 8420 8408 7176 4094 -705 -13773 -16555 -11791 -10082 -10486 -9724 -8215 -6684 -7616 -7684 -5196
18865 -5196 -2929 -2462 736 -8500 -13490 -8328 -6867 -6060 -6449 -4759 -4800 2120 10672 13320 8505 5049
18849 5049 -4562 -4342 -2439 500 -1475 1986 11298 14528 10155 6866 982 3774 5461 9038 6573
18834 6573 3123 7868 11812 13036 9341 -1116 5614 10863 10056 3702 -1953 -1553 -1512 8963 21265
18819 21265 17385 11794 18 5822 7623 5693 9523 7709 9243 6236 410 -8833 -19062 -17399
18805 -17399 -999 8017 9405 9225 6649 4677 13056 18807 8971 9847 12287 5453 -4245 -3961 -3281
18790 -3281 2296 2408 2963 3246 1138 5819 4312 7076 4418 1261 8367 9680 10333 13814 25183
18775 25183 30497 30059 28747 28504 33063 42690 56451 75430 93150 129245 129881 86490 48957 29895
18761 29895 21839 17476 14623 12146 3293 -5110 -561 8810 5494 8530 10469 15213 18272 7373
18747 7373 -551 2345 1674 5792 8449 5696 4798 7183 6801 7038 8733 5942 7175 6811 8909 9286
18731 9286 12133 6385 1939 2589 6549 5425 7827 7017 4924 6714 5972 2550 8250 15951 18007
18716 18007 11175 7310 8743 14299 19304 18539 21861 24769 21925 17895 16432 12927 4669 2071 5741
18701 5741 10589 10986 8165 8818 9874 2717 4125 6457 2922 1433 3480 1363 -1696 917 6516
18686 6516 3707 3433 8532 6502 -316 3917 10132 10263 6481 2332 2045 7114 8075 5658 5868 9286
18670 9286 10421 12586 17907 9998 8205 8967 10668 10690 10876 13019 7536 1926 1729 5914 5903 2461
18654 2461 7194 9355 8424 5474 4795 2413 3716 130 -3864 2177 7549 9457 6187 2809 3513
18639 3513 7783 6179 1354 8492 5771 3030 5223 9840 5187 2688 874 5851 -370 -4711 -2260
18624 -2260 -1002 -6288 -7290 -5394 -2779 -1367 -170 -809 -3125 -1878 3583 3508 -3135 -1612 7037
18609 7037 8428 5897 7464 3724 465 -3129 -2934 2041 4783 7307 9790 8200 6195 5475 4114
18594 4114 2337 3619 -527 -4471 -5990 -12932 -6542 -4318 -7229 -8831 -10839 -11730 -11403 -8044 -4242
18579 -4242 -5901 -6449 -9057 -9208 -3430 -135 7014 12308 10715 2524 565 869 -2706 -928 -3180
18564 -3180 -1426 -3568 3704 8840 3265 -1774 -736 1824 -2678 -8553 -5340 -8503 -11813 -10615 -6082
18549 -6082 -3053 -207 635 -1498 -1436 4124 7295 6027 219 -1600 705 5864 6379 6571 115 38
18533 38 8393 15425 12071 13363 12994 8774 4919 4262 -1866 -3706 1121 8276 8477 5342 -1167 -327
18517 -327 543 1950 596 1906 9619 14191 10492 9812 10950 12171 9922 9112 4803 2685 -1953 2032
18501 2032 3037 2484 4935 10793 12916 5371 2347 5773 10341 10435 17013 18930 10547 7710 12261
18486 12261 16737 19189 18819 19151 20027 14709 11532 8810 7272 8773 6809 4434 2381 1007 -5505
18471 -5505 467 -1807 -3791 4809 5842 2912 1476 4601 10945 10557 7033 11522 17803 16129 10132
18456 10132 4297 -566 -4213 -6994 -3172 5889 6829 1412 499 4715 2195 -2799 3099 4011 4988
18441 4988 6803 3840 -2293 -1886 2550 2939 9813 14462 15137 11388 3787 2008 5440 9483 9176 13080
18425 13080 9121 4230 3871 7626 13760 11462 11781 14890 14728 11857 14161 17117 17009 14094 16155
18410 16155 10586 6618 4685 4767 8139 11016 6528 -294 -260 958 3652 6440 13812 20580 12768
18395 12768 7378 9061 3659 4739 7797 9790 12480 12062 14991 9826 5145 10044 13634 16295 9544
18380 9544 3636 6327 7125 10234 15636 20898 14774 16060 16017 14785 11752 11540 9658 11549 16639 21689
18364 21689 28100 26725 21128 20475 20169 22270 20633 16774 14273 9901 4362 -1102 -2504 -346 10094
18349 10094 11761 6607 10469 18483 16125 17550 14363 4665 403 8833 14531 17851 17758 24124 19812
18334 19812 13621 16589 19760 17635 16943 16240 15853 18138 18649 19859 14405 11543 15510 18381 15261
18319 15261 13672 9438 13521 11159 5233 -40 2386 8302 9731 13162 15688 17192 19428 21705
18305 21705 21125 23797 25445 29270 34324 28653 28646 34213 38941 40406 35686 29392 24334 32883 37710
18290 37710 33630 27305 30977 35472 36422 33915 34499 36505 34823 31677 32698 34963 34492 35759 36047
18275 36047 34850 35008 41017 43071 45408 48924 46866 58462 70533 67706 59854 57081 59088 64748
18261 64748 71037 86157 95346 99820 95330 96858 110039 120806 137162 158161 178286 206977 226446
18248 226446 251456 279724 312926 336465 354936 372808 394162 434450 490142 552179 625561
18237 625561 712513 819608 960964 1141229 1350625 1589208 1885069 2285054 2844249 3787533
18227 3787533 5424324 7646287 9673564 12476505 17187634 16326217 9546231 5065143
18219 5065143 2955106 1942646 1395453 1044770 799876 643524 552401 473481 408717 366120
18209 366120 335937 301486 275399 263035 263073 258496 248510 245618 240919 220149 199556 182262 159056
18196 159056 140653 125308 112953 104628 95610 88415 86470 80751 67793 59113 56159 60104 56469
18183 56469 57276 59046 53886 49568 56869 59040 51349 48455 46521 47060 49955 52478 52316 54367 54654
18168 54654 47656 47130 50422 51394 54112 54111 54665 55941 60390 61587 62481 62343 63453 66095 69310 64502
18152 64502 61474 71628 80574 79627 85400 86159 83739 83360 91451 98933 107044 119477 119419 125036 128474
18137 128474 142321 157959 179961 199922 218371 241352 262307 279975 311850 355056 410694
18126 410694 491733 584787 682973 802434 939385 1087666 1272968 1515450 1809122 2141916
18116 2141916 2544348 3060716 3768919 4849580 6697854 9606443 12902671 16168679 21720226
18107 21720226 26151319 19545418 10720248 5853569 3547380 2381134 1712081 1274877
18099 1274877 972269 779822 640410 533942 457382 402952 346689 293685 257976 228751
18089 228751 199870 176601 156874 133170 112899 97267 84808 69689 58600 61418 61350 56370
18077 56370 55579 55007 52596 51455 44085 42303 41844 32523 30625 22546 15856 20985 26804 28798 23960
18062 23960 14757 7883 4551 10282 19357 26795 28571 23525 16190 15185 16497 12623 11270 6891
18048 6891 1086 -3704 3843 8963 7616 9113 4384 -3707 -5989 -1136 -3091 -6838 -9770 -2784 -3473
18033 -3473 -1118 -2871 -3926 -4797 -777 5977 7742 4474 -9518 -10636 -4648 -3220 1016 1048 560
18018 560 2571 -707 -3289 -2814 58 85 4892 328 -1372 1446 -4217 -4174 2121 2988 -306 -7966
18002 -7966 -11502 -9961 -5786 -9512 -7784 -6870 -1607 -506 -3874 2306 9637 7014 -421 -7183 -6609
17987 -6609 -11119 -9057 -7192 -5142 -3832 -6088 -2341 570 609 -2502 -10620 -12519 -4301 -7091 -4645
17972 -4645 -1075 -7279 -7595 -5212 -10492 -17565 -11658 1111 3929 4420 6691 4946 1103 2568 5722
17957 5722 1567 -4753 -5187 -1051 1889 4210 3494 6636 4940 1424 -1331 -5376 -9655 -14860 -17755
17942 -17755 -5249 -1126 -5761 -6257 -6575 -3040 -2111 -8110 -8471 -5407 840 -6609 -11468 -16212 -13742
17927 -13742 -10832 -11212 -7220 -3705 -7453 -11328 -12152 -13136 -8293 -5721 -10546 -9537 -4441 951 4591
17912 4591 -1002 1072 2587 1797 2238 8185 5195 3763 6185 -664 -3895 -3927 4676 4949 -4917 -9034
17896 -9034 -6002 -6780 -10607 -12926 -14791 -10858 -4798 1524 3612 -143 -4521 -7682 -2375 -90 -3386
17881 -3386 -9541 -12065 -11579 -11783 -14575 -11795 -6086 -2238 5959 4523 690 3538 -900 -2958 1595
17866 1595 4162 4508 3201 -698 -3719 -7965 -9975 -10744 -6239 -2755 -4829 -2608 -6550 -9262 -12745
17851 -12745 -8647 -6918 -11355 -12474 -12634 -11255 -14507 -15144 -18598 -18595 -13829 -3941 -4241 -4326 -7721 -7250 -13579
17834 -13579 -15592 -12496 -4909 -4128 -11036 -12456 -12802 -8979 -4852 -794 2634 2709 -4086 -3281 2055 2932
17818 2932 1133 1136 3126 7455 7428 7169 4460 -4127 -6859 -3817 -9307 -6065 -4817 -2888 6497 5908
17802 5908 -2649 -4129 438 1131 450 -6566 -8849 -2974 -220 -8029 -12780 -13505 -10416 -7088 -3939
17787 -3939 -3368 -4085 -2795 -4736 -3188 -4472 -6558 214 -7077 -14392 -14341 -8916 -2958 -6093 -2369 -2548
17771 -2548 -5440 -2476 4890 8221 1036 3734 5907 3274 2350 -4018 -12651 -9531 -8881 -9789 -9853 -3099
17755 -3099 2372 1654 -1667 -6426 911 9014 7239 1916 895 7628 8122 2693 -3067 -5630 -8589
17740 -8589 -10014 -8609 -8410 -11365 -7749 -2610 -187 -2618 920 -3617 -4454 -7147 -8049 -10259 -13900
17725 -13900 -17482 -16479 -7495 -6961 -1171 -7903 -8329 -5115 -4504 -6567 -5367 3673 4789 -809 294
17710 294 4420 2216 -1919 -957 -331 -10588 -11658 -3902 -6268 -8425 -3592 1300 4428 3397 435
17695 435 -4485 -1392 939 2412 9066 7672 5141 -1184 -826 305 1398 867 -1033 -2532 -4416
17680 -4416 -3531 -10478 -7432 -9718 -9496 -582 2541 -1595 -5901 -3191 -866 1259 -1166 -663 756
17665 756 4146 4261 1836 537 -3545 -2571 -2942 -5977 -785 -1994 -10590 -15484 -14847 -16573 -19279 -17528
17649 -17528 -13532 -14985 -17564 -21261 -13438 -9137 -2319 -4146 -6896 -11288 -9772 -4565 -9181 -12667
17635 -12667 -18197 -16489 -13324 -7844 -1692 1398 -1977 -1306 -4368 -2670 3739 7537 5625 -3702 -7724
17620 -7724 -6407 -3058 -247 -4328 -1893 -5775 -17962 -15069 -10755 -14208 -13530 -10289 -8303 -8520 -12853
17605 -12853 -13937 -11271 -9550 -6841 -6531 -12532 -16631 -14414 -12996 -9822 -7724 -6945 -7172 -11035 -14643
17590 -14643 -12683 -15185 -12643 -9549 -8242 -7474 -3268 -4411 -5062 -1258 -2372 -3285 3008 2820 -4944
17575 -4944 -7770 -5891 -3069 -1316 -8338 -1131 3906 1443 -5944 -12740 -10191 -2907 -1438 -590 -55
17560 -55 -3767 -3137 -5816 -10739 -16334 -15781 -8355 -5181 -4956 -3725 1528 -3998 -1753 3289 -1956 -1795
17544 -1795 269 2021 4193 -1940 -1642 -6037 -10221 -8980 -5966 -4006 -5550 -1735 -932 -199 -2608
17529 -2608 -3134 -2894 -2063 -4154 -1075 -1085 -5087 -8380 -12000 -10415 -18219 -19969 -12764 -12872 -14286 -14449
17513 -14449 -22439 -26695 -16503 -8526 -8871 -15189 -18083 -15287 -11420 -7774 -6735 -12163 -16105 -13578
17499 -13578 -3884 -4037 -11269 -10329 -4575 -1438 1584 261 -2648 -6661 -15248 -12015 -5260 -4707 -6077
17484 -6077 -3020 -3231 -3540 836 -322 -727 -3901 -9773 -12737 -3847 2591 1353 3013 -727 353
17469 353 892 -3924 -6010 -1904 -1349 367 3444 2773 5079 2276 783 3390 5647 11150 12481 11316
17453 11316 15163 16602 13792 14113 14787 18833 26113 34025 43056 53077 66748 86994 118767 127796
17439 127796 79731 43217 24570 16712 11600 8087 6680 15312 15522 10529 11700 4094 933 5233
17425 5233 2574 -1807 -7358 -7913 -6512 -4921 -4808 -928 -1670 -4348 -11790 -14067 -11440 -12388 -16246 -12300
17409 -12300 -11570 -10735 -2823 -4595 -5843 -10943 -5780 -2668 5101 -50 -722 -2424 -6129 -8732 -5958
17394 -5958 -4285 -3729 -6220 -14012 -14793 -19123 -20405 -7257 704 3232 2791 -800 703 597 -3760
17379 -3760 -7487 -4915 -6312 -8354 -12357 -10754 -10802 -5636 -2928 1441 3756 2463 469 261 4855
17364 4855 -5036 -12250 -13388 -4421 85 -2533 -1840 992 -1534 -4379 -600 1248 740 140 -5030
17349 -5030 -4926 -3099 -8354 -10491 -11585 -10002 -5080 -2448 -2649 -6661 -9731 -10489 -11168 -9522 -13381 -14679
17333 -14679 -15228 -12293 -10859 -4793 -9123 -13145 -10359 -7297 -8931 -5542 -4509 -6191 -9428 -7533 -5481
17318 -5481 -12114 -12835 -12459 -7492 -1346 883 -3992 -2884 -251 -9114 -3945 -404 -5143 -10198 -12883
17303 -12883 -10805 -4457 2118 -1514 -5495 -3557 -492 320 2840 928 277 5932 3312 664 13
17288 13 1647 -1498 -5868 -7371 -11444 -3879 -4203 -6058 -8381 -10608 -11298 -2601 -66 -6505 568 3097
17272 3097 -2172 -8175 -10341 -8685 -2486 6074 1970 -4317 -6106 -9190 -13591 -11143 -9580 -2582 -1491
17257 -1491 749 1791 1017 1479 -1599 2762 5045 8517 6245 998 2615 1358 -952 376 -2015
17242 -2015 -8753 -5860 -908 -1808 -6803 -2752 -1838 -3013 -8296 -13262 -5872 -4683 -13944 -19422 -16599
17227 -16599 -11501 -6620 -4322 -8020 -7904 -7972 -9528 -7904 -7532 -11886 -15836 -15548 -16092 -9097 -7462 -9682
17211 -9682 -10631 -6640 -6091 -8068 -4575 2467 1509 4951 2786 2647 1042 -1858 1544 6976 5506 -466
17195 -466 3780 581 3648 6001 459 -2585 2346 -867 -2383 -4066 -2930 -2311 -3151 -5011 -8376
17180 -8376 -8677 -11689 -11318 -5769 -3255 -3240 -4873 -7718 -4575 -730 4239 6274 -829 -6332 -4869 -8162
17164 -8162 -15531 -21294 -23863 -17996 -12856 -7164 -4482 -6257 -2569 1477 -4833 -12096 -14980 -12700 -7777
17149 -7777 -5622 -6153 -8385 -10094 -9262 -10937 -12931 -9919 -5657 -2463 5496 9120 6816 4624 3984
17134 3984 6084 4080 4212 2564 -2289 -7064 -10208 -12204 -9796 -4731 -6659 -7857 -11243 -13185 -20874
17119 -20874 -18739 -10330 -322 -427 -561 -4415 -5955 3785 8828 12823 9997 4066 5860 1370 -2701
17104 -2701 -5360 -5676 -5368 -3032 -9410 -6927 -1027 4199 3275 433 94 -4169 -6998 -8823 -2946 3257
17088 3257 6575 3393 3103 4073 4725 1111 -1193 -2724 -10102 -14293 -10537 -11266 -19080 -21184 -17627 -17203
17072 -17203 -15798 -4775 -2647 -5367 -921 398 -895 3749 2639 -4712 -7933 -5696 -10357 -9043
17058 -9043 -1676 -4761 -8921 -5560 -2909 -7214 -9034 -6741 -9385 -14714 -11985 -8491 -9312 -10605 -5486
17043 -5486 -3756 -8501 -10254 -10245 -12417 -12268 -8438 -4433 -6147 -2029 -6092 -8873 -3205 1861 -915 -2513
17027 -2513 -2818 -7317 -16458 -18483 -11188 -13793 -13184 -9105 -2840 -7071 -7888 -1590 -25 -237 2582 2062
17011 2062 -2298 -629 -4826 -2694 -1444 -1070 283 3354 1942 -2198 -4958 -4128 -5613 1263 -690
16996 -690 -3306 -5766 -12096 -15903 -7972 -3050 -3323 -3611 -1538 1040 -1467 -3079 -144 -1529 189
16981 189 -570 -2904 198 -1183 -5606 -10433 -14484 -12349 -5883 -557 1278 1052 224 -5485 -8853 -8613
16965 -8613 -1643 1946 -3599 -1011 -6729 -9442 -4868 7416 9902 6839 -768 -174 -269 -5032 -8790
16950 -8790 -3858 -9572 -7193 -1481 6711 6029 4590 -2800 -9698 -8649 -4673 -4167 -7339 -9076 -4774
16935 -4774 -7459 -10038 -14949 -16839 -13083 -10314 -2069 2204 7569 11031 5186 -1070 -3312 -2194 -3992
16920 -3992 -3893 849 -2328 -6562 -3554 -5705 -7377 -1891 5739 7112 -4350 -8223 -7954 -8738 -10747
16905 -10747 -13480 -8763 -4138 -1291 2857 1888 836 -4716 -7034 -6549 -3519 -3272 -6242 -4185 -2706
16890 -2706 -3357 -4032 -7178 -6782 -7706 -13270 -12466 -9333 -3272 2515 -2930 -9837 -8303 -8848 -7797 -9220
16874 -9220 -15052 -15088 -7191 -5281 -11377 -12231 -6194 -1961 -6052 -8229 -3051 -1083 2316 466 -5867
16859 -5867 -7927 -5882 977 1357 -1880 -2149 -8564 -12108 -9306 -5672 -9330 -3709 -2777 -5127 -2020
16844 -2020 -1291 -1469 3402 -723 -9903 -10237 -15540 -16571 -13202 -12075 -7826 -5465 -5762 -5534 -1810 3686
16828 3686 6359 8694 9270 9568 12163 5102 -1114 -7425 -10546 -9195 -4596 -3859 -708 -1658 -3910 -8744
16812 -8744 -9109 -13123 -16829 -12140 -10548 -9028 -6499 -7475 -15358 -17276 -15620 -12083 -11846 -12053 -8407 -285
16796 -285 3029 130 -3236 -7053 -8559 -7022 -6501 -7068 -2134 1665 1899 7696 4553 4620 4241 9457
16780 9457 11616 4302 252 -3981 -554 -2599 -2831 907 -11938 -15046 -3317 -966 -3988 -9641
16766 -9641 -16150 -11707 -11649 -10979 -4135 -2577 -2409 -1428 -2586 -2554 -2534 -2569 -2877 1094 4841 3947 -4 2718
16748 2718 7962 2633 -5903 -11212 -13591 -15098 -11524 -6155 -1625 -117 -2820 -6870 -7276 -7365 -5610
16733 -5610 -10136 -9863 -9698 -14336 -17725 -14716 -4852 -3001 -11103 -8728 -4437 -4670 -3311 -1825 -2544 -8166
16717 -8166 -14981 -12810 -4701 -6686 -13838 -17647 -18839 -15672 -15811 -9947 -9066 -7210 -3365 -1615 -306
16702 -306 -10145 -14076 -9733 -5102 2397 728 -116 -1366 2589 2320 -2828 -6369 -4787 -1759 -584
16687 -584 8938 6341 -1865 -5486 -4512 -2934 77 -3599 -5933 -3744 -1824 -764 -860 -4966 -8874 -7195
16671 -7195 -6958 -7388 -13272 -14016 -4719 -21 6949 10991 4274 -3417 -9086 -10086 -7445 1488 3640
16656 3640 4389 -1196 -4084 -5937 -7765 -4922 -4952 -2498 485 6809 5410 6782 7245 43 -3774 -4777
16640 -4777 -3688 -6720 -10512 -7442 -5485 -9756 -9482 -9105 -11976 -10087 -6078 -3479 -1515 -4065 -5010
16625 -5010 -2198 -1267 -2039 -3055 521 2948 5711 6235 2437 2424 -1216 -7472 -5740 96 3375 -2498
16609 -2498 -4315 -5422 -13612 -9894 -6205 2271 -2649 -15151 -14184 -4400 -2029 -3455 -4492 -5554 -2520
16594 -2520 -6366 -15834 -10715 -9299 -4382 327 499 -3959 -4931 -6020 -5883 -9849 -17017 -10223 -7567
16579 -7567 -8106 -3295 -5180 -8039 -5351 -6419 -9254 -10958 -14402 -16317 -14117 -9998 -7761 -890 4834
16564 4834 -813 -4335 294 3991 3056 274 -2806 -2598 79 -1284 -7102 -6476 -5675 -6072 -4519 2687
16548 2687 2953 -8689 -10233 -4133 -1412 -610 4751 10126 7632 6213 -1722 -8449 -9872 -5341 568
16533 568 475 -3212 -4355 -10469 -11293 -7806 -8141 -2040 -4942 -6421 -4856 -1134 369 -4236 -8068 -5483
16517 -5483 -6561 -6879 -5298 -2765 -7195 -11532 -6750 -2550 -3043 -8789 -14786 -19783 -17360 -16482 -16414 -15188
16501 -15188 -15718 -20687 -21711 -20159 -18069 -15747 -6762 -2019 547 79 -3278 -11204 -17051 -9063 -150
16486 -150 -88 -2967 -6095 -7321 -8892 -14813 -20035 -21137 -16202 -10665 -5669 -3239 -8241 -4809 -75
16471 -75 -489 -10781 -13166 -11557 -11641 -12097 -12802 -11253 -10774 -6303 -4503 -2183 4101 2936 -7805 -11782
16455 -11782 -5380 -5137 -7758 -8949 481 4553 -3719 -4037 -3329 -6998 -7074 -723 3791 2616 -1042 -6416
16439 -6416 -7681 -1874 5645 4187 3543 1174 6100 4456 -2312 -7156 -7671 -7911 -12678 -19757 -22293
16424 -22293 -16560 -6344 -4667 -4564 3506 7073 2708 -6142 -6857 4714 9707 6144 -262 -505 2274
16409 2274 -3027 -5635 -9267 -3984 5316 9446 3131 981 1002 8507 10221 7452 5861 7369 1148
16394 1148 2459 -3455 -8172 -4929 -9759 -3311 -15 872 3260 1610 -1411 -3018 -1299 -1439 149
16379 149 -5129 -4647 -3010 -2404 -14142 -13817 -8574 -4307 -732 -4206 -6569 -1707 4857 5073 3439 2630
16363 2630 1012 5052 -2325 -6838 1781 5426 6647 6543 5519 1195 -1192 -2626 -1167 -5774 257
16348 257 7084 9482 1804 -4986 -4206 -3891 -1564 -3676 -8054 -10563 -8049 -5460 -1408 186 -1144
16333 -1144 -5636 -7324 -3770 5352 5640 579 -3876 -1330 -2337 -5433 -9610 -12449 -10576 -6720 1785
16318 1785 4691 4519 6216 8092 2779 3776 2195 -407 1847 411 -5628 -8888 -8890 -7892 -6781 -8905
16302 -8905 -5989 -1275 2661 2142 -641 -2639 -1894 -2484 -1761 1128 -1982 -8208 -5957 -2740 -4653 -7177
16286 -7177 -9544 -5730 1104 1615 1640 -974 -3266 1630 -2724 -4133 2170 1696 -1125 -2700 -7090 -5971
16270 -5971 -9316 -15221 -13361 -11676 -8758 -3646 -6946 -8768 -1164 -3180 -4863 -6974 -10166 -5747 -1381
16255 -1381 -800 -7024 -11551 -13157 -11212 -9359 -5273 -5401 -3033 -656 -6407 -7195 -3401 -255 -8623
16240 -8623 -13062 -10944 -13553 -12492 -8265 729 -588 -5881 -10246 -10464 -5117 -3393 4605 4021 2927
16225 2927 -6681 -11720 -12892 -10036 -9650 -5460 1186 237 -748 -728 -3566 -1165 -2984 -8751 -8203 -6133
16209 -6133 -501 535 4213 2256 -636 -9368 -11558 -6878 -4775 841 5255 3283 2490 -836 4889
16194 4889 3478 -2245 -4490 -2830 -5079 -11944 -10894 -11120 -10894 -8706 -7239 2034 1831 -825 6878
16179 6878 9076 5308 591 -1672 -1704 -3271 -2341 -4425 -4087 -379 -721 349 4417 5353 4183 8603
16163 8603 6126 1123 -4873 -6790 -3526 -1324 -769 1249 7344 5022 -10150 -13512 -6760 -1566 -4360
16148 -4360 -11491 -9414 -5480 -3438 -851 -1419 2350 3250 -2409 1499 -2912 -6599 -3606 -3142 -6976
16133 -6976 -8586 -11265 -2428 -4620 -10899 -14868 -11421 -4968 -4095 -6065 -6382 -4105 -144 -311 -663 665
16117 665 4710 3292 3698 2460 -228 -6519 -3349 -696 2940 1570 431 56 -4508 -6561 -5945 -7982
16101 -7982 -6133 -6771 -4209 -7392 -2005 -1164 -9979 -14555 -11211 -1056 -1047 -7682 -3680 -385 -2219 -6060
16085 -6060 -1051 -4887 -3731 -711 3863 5838 -648 7417 8867 355 560 2279 -3768 -5306 -10575
16070 -10575 -14006 -13907 -7985 -2570 -399 -839 4119 3011 11494 14836 7771 7466 10008 9169 8678 5255
16054 5255 5466 6699 3255 10189 8466 1491 -7559 -9086 -7546 5152 10244 5958 -5043 1658
16040 1658 12675 10383 1570 4736 76 -8712 -11472 -6069 -6989 -6733 -6569 -844 1160 2120 5462
16025 5462 4237 1171 -242 -851 -1002 -5716 -10021 -5073 -7300 -8552 -12392 -13353 -11962 -12758 -9455 178
16009 178 4525 -75 2549 1573 3441 -1417 -17475 -18380 -10611 -3442 -2805 -2947 -2795 -6345 -3829 446
15993 446 -6260 -6617 -7951 -2931 2510 2505 -3657 -5357 -1008 3227 2178 3875 7735 7039 9417 16296
15977 16296 11153 2989 -6408 -7596 -3426 -1603 3338 6456 7200 7244 8454 12298 7593 506 62
15962 62 4732 8233 8570 7553 8089 4255 -1388 -2897 -7019 -8059 -3618 1426 -2496 -4828 -7383 -8846
15946 -8846 -4266 -2595 -7848 -14386 -10150 -9115 -7865 -4083 -7126 -6407 -4092 -1899 3971 4383 427
15931 427 -3039 -978 -1265 -1399 -934 -727 -3793 -8103 -3753 -5193 -5785 -4208 1413 798 2351 -1902
15915 -1902 -3037 -5345 -8696 -9581 -8759 -5916 -3652 -3217 2691 -777 -6412 -10016 -918 3766 671
15900 671 902 -2682 -7997 -6617 2579 7445 3981 4186 4399 1554 1719 7941 7839 3936 5954 11612
15884 11612 7525 4783 2206 -1970 -1768 6280 2717 -6367 -3582 -2229 -1476 -1797 -1010 218 1011 -494
15868 -494 1775 787 -2345 -3774 -2793 -989 -937 -5017 -3607 1355 1045 -207 -3583 -139 -3400 -2879
15852 -2879 -2989 -3561 -2584 -4474 -5314 13 3629 959 -7381 -5341 -4351 -3385 -3785 -9168 -11874 -12606 -11023
15835 -11023 -3510 874 -7198 -14097 -12140 -7143 -3775 -5362 -1526 5862 482 -6391 -10079 -8246
15821 -8246 -10517 -11708 -8910 -8649 -8924 -5767 -6656 -3472 -3635 -8855 -6674 -7598 -4588 -1590 -12 -1562
15805 -1562 -2338 -2989 -2514 1847 -4733 -10418 -6174 -4264 -6016 -12061 -20314 -20164 -14147 -10434 -11706 -12397
15789 -12397 -9014 -2305 2822 4764 -3143 -10134 -8868 -9462 -6243 -4644 -5779 368 6889 4790 4915
15774 4915 9687 4003 900 -2637 -3464 -1580 -6223 -11852 -9268 -2241 1626 1260 -7719 -10515 -2043
15759 -2043 -5988 -7919 -4577 -4231 3247 -805 -936 2046 3498 -1832 2032 9690 5950 -666 -4158
15744 -4158 -5432 -1382 -1131 -6635 -7439 -3523 -658 -2533 -3134 1698 3286 -1926 -1834 -768 2227 3271
15728 3271 4844 1312 -5676 -1263 5032 7235 -97 488 -2012 -2255 -465 1402 8492 10212 7648
15713 7648 2021 -570 -5432 -9512 -7582 -5433 -8335 -8154 -13479 -10611 -4375 1944 245 3615 1878
15698 1878 2553 3183 -230 -4746 -2290 -1840 7466 8695 2720 2068 2660 -4482 -3869 435 3883 4958
15682 4958 1977 2435 -1944 -936 -3335 2987 7636 1794 3646 5518 -6135 -4899 4887 3307 -1210
15667 -1210 -4972 -9342 -9086 -11012 -15567 -13772 -11239 -8391 -13200 -14702 -10253 -5214 -1324 2151 -1252
15652 -1252 -10757 -13520 -7260 3325 4641 3325 -376 5834 11225 7155 4298 2656 52 -1614
15638 -1614 37 920 -4816 -9749 -9465 -13476 -10788 -12058 -14595 -13654 -3848 -4414 -2790 -2292 -10595 -11716
15622 -11716 -11267 -7882 -3898 621 4082 4793 7145 -1337 3721 4381 6744 9999 3552 1376 -385
15607 -385 -1822 -2567 3725 8376 3241 4123 7848 2774 -4291 -7137 -13937 -17290 -14413 -8720 -10370
15592 -10370 -9645 -703 5536 4445 -46 -1974 -1934 -1689 -1296 1543 3528 5481 6868 11085 4155 -4657
15576 -4657 -1368 -1520 -3637 -647 1270 -2522 -8116 -2255 6260 9354 11619 3718 -4557 -3586 1862
15561 1862 4753 4810 3763 824 5827 2640 -3587 -4278 2915 12371 13440 10565 8995 2701 -2132
15546 -2132 1620 -4688 -7307 2771 6396 9926 10497 7874 6149 6162 9785 7160 1460 -1550 -8798
15531 -8798 -9015 -2189 -1050 -625 6619 14343 12257 9589 6888 -1729 -10299 -18218 -26838 -21232 -6405
15516 -6405 -7287 -15233 -11841 -7223 -3478 1012 -3455 -6548 -2185 -4506 -7960 -6933 -8186 -5247 -3202
15501 -3202 -2529 -7624 -11340 -6651 -6124 588 4799 2925 -4937 -10610 -8848 -2408 -5336 -10029 -9478
15486 -9478 -11644 -8954 -6825 -4789 -12610 -8973 -2424 -3298 -276 -6410 -12402 -10427 -10887 -7189 -5710
15471 -5710 -432 -3216 -3439 -3011 -4508 -5931 -2698 288 1033 4597 -1499 -4572 -4710 -5958 -7682 -10077
15455 -10077 -8897 344 8746 6449 -2669 -6734 -7299 -845 1820 966 -874 -11321 -10318 -5784 -5419
15440 -5419 -6049 -2908 -2429 -1953 -1393 4257 2082 2943 -1489 -6030 -12177 -7829 1116 6584 11690 13658
15424 13658 11423 1359 -3742 -12426 -14274 -10573 -2320 3870 8187 5789 3344 4562 2266 1837
15410 1837 -1616 -2948 329 -2318 -2909 7330 15870 7670 4779 1174 191 3697 6064 8455 3109
15395 3109 2090 8056 11883 6694 1686 5163 4988 -6529 -13113 -9077 -4587 -707 -8193 -11919 -6260
15380 -6260 2114 8201 13755 13264 9966 7673 5339 -327 -4601 5274 5565 7068 11467 13630 16769
15365 16769 8298 6410 8567 4213 -577 515 3738 3475 3021 -5709 -7544 2314 6142 2590 -3916
15350 -3916 -1516 7510 12312 15766 10418 13091 8783 4871 1839 -3088 -714 8040 13144 4779 2374
15335 2374 1590 312 -4903 982 2397 4377 7297 3773 1286 145 -3589 -517 728 -4437 -9176
15320 -9176 -4753 -4753 -2635 -7265 -7904 -14269 -8541 -6510 -2306 -764 -2597 -2808 589 -1123 -4301 -2066
15304 -2066 225 -4664 -11372 -7320 -3034 -946 1932 1952 -2419 -7959 -15520 -14874 -8543 -2923 11
15289 11 2639 8244 9613 7048 5510 4305 6458 12268 4510 5637 4751 3586 3928 -990 -6911 -5976
15273 -5976 -3132 -830 9716 17358 16510 7036 -662 2193 6075 7553 8241 8502 1879 -7957 -9859
15258 -9859 -12614 -15756 -17406 -13810 -5949 -2151 -4681 -2635 1655 -3361 -764 2126 1028 2930 234
15243 234 1473 3471 -5487 -13249 -17862 -12822 -6958 -3297 -1634 -1138 1495 -801 -1439 796 572 -1037
15227 -1037 -5048 -1319 2269 7194 5273 3192 -1072 2032 417 -4600 2081 1114 5702 13954 6721
15212 6721 3481 -5869 -10008 -2516 1 3345 970 3163 6386 5951 -2678 -2835 1466 2852 4114
15197 4114 5950 -573 -12159 -17464 -13879 -6681 -4073 -2895 -4802 -4155 -1349 -5847 -14110 -11412 -7205
15182 -7205 -4213 -2437 2537 2646 -2833 1960 3262 676 -3292 -1075 671 6723 12892 9673 7528
15167 7528 6620 8391 5387 6000 1506 -2338 253 4965 5523 4594 3171 1729 3126 7744 5129 1718
15151 1718 522 -118 -1373 -3328 -4146 -1174 -230 -4774 -5505 -7682 -7008 -2449 -3703 -741 3613 -1656
15135 -1656 -5285 -7982 -5378 2411 6889 10603 13418 16771 10897 11572 14547 10296 6673 -107 1535
15120 1535 5484 6298 -2795 -1924 -830 1975 -1776 -7865 -8055 -4125 -2794 -5214 -5651 -2809 -5801 -4432
15104 -4432 -9571 -8010 -6689 -6607 -456 4290 3287 -717 -3575 -6377 217 7178 7390 4691 -2719
15089 -2719 -9083 -3038 1610 6405 1894 -26 4575 3709 2768 2295 4347 1497 1540 421 -2044 -2516
15073 -2516 -2815 -6157 -1402 -1195 -785 -1346 -3995 -7120 -5828 -8081 -4512 -8368 -10708 -7421 -939 -5729
15057 -5729 -10565 -12710 -5041 -2386 -5142 -4107 1500 -1803 -3328 -4596 -1076 1898 1189 2658 1549
15042 1549 -2961 -5177 -3128 -686 1514 4923 1733 3240 -2098 -8330 -323 6094 1495 -6441 -5412
15027 -5412 -2757 -4814 -7075 -7340 -4636 -6662 -2956 -1082 -128 -23 -3980 -9035 -8392 -4328 -7313 -2045
15011 -2045 -2593 -8604 -12218 -10642 -77 6374 3313 727 -3849 -1363 1228 2173 -1217 -4436 -11028
14996 -11028 -5741 2023 12363 15477 11035 7939 15031 17448 11659 9581 2944 -2496 -4315 2727
14982 2727 2253 -1019 -1925 3813 7940 14711 19874 21947 16089 6466 14205 21416 25975 33678 38710
14967 38710 40455 52009 53566 40950 24908 18523 14892 9181 5143 -1768 -5830 -6407 -1767 -5778
14953 -5778 -8002 -5180 -8786 -12210 -5041 4926 8776 7374 7301 7467 5923 2045 6550 3711 2202
14938 2202 2937 -270 -1811 -10695 -12400 -7480 -8022 -11454 -2756 -3576 1900 -4509 -6774 -2908 -2993 -611
14922 -611 -493 1393 4092 669 4993 6864 9650 4915 -3476 -4675 -2222 8247 8190 -3561 -6509
14907 -6509 -650 -765 -297 5038 8394 9738 -2668 -5742 -807 1119 2658 1223 -612 1076 -4636
14892 -4636 -11003 -14446 -12479 -11972 -6870 -3976 178 2874 6380 1468 2562 7253 5545 1479 2380
14877 2380 -983 355 5682 4159 1664 8389 8482 5180 4209 2274 3574 7781 6869 2880 1366 -846
14861 -846 -1025 1634 10457 14660 17055 15618 14151 13983 14295 10229 4408 3323 12491 13309 4444 -2470
14845 -2470 -4501 -1516 5311 6662 1128 -1242 -2144 1100 253 6019 11233 12201 11281 4713 -1028 -2248
14829 -2248 3247 448 4711 -3779 2582 8964 7158 3709 6087 3135 4616 11090 9721 1170 -3088
14814 -3088 370 6368 11537 5181 -3356 -3054 -6130 -8230 -6815 -2631 -8562 -8032 -4155 -7429 -2102
14799 -2102 3556 -1557 203 -3063 -1819 -6186 -1562 -2818 1046 -414 -2717 -1483 331 -4443 -7253
14784 -7253 -8212 -5617 1332 5949 10671 9845 8492 758 -6784 -3466 -2074 2920 4381 2267 5531
14769 5531 1637 -1069 -2383 -5573 -2484 3523 5667 4031 3658 4879 4098 1967 -1550 -4893 -5410
14754 -5410 -6341 -487 3142 -1238 2377 5734 2029 -8145 -8415 427 2259 6382 252 -8117 -8892
14739 -8892 -8248 -6635 -6207 -2049 -680 -4019 -3078 3209 2705 2913 4498 2503 1989 8831 6370 -5567
14723 -5567 -11370 -10203 1845 12457 14131 19913 15346 4675 -2123 -3019 3606 2565 2938 4656
14709 4656 8485 8096 8550 8249 8718 6249 7892 2234 17 1140 3414 4440 4131 -3456 -4161 -8883
14693 -8883 -5947 -1364 -1830 2298 3462 372 -918 -5650 -7882 -5669 -5909 2533 6194 5275 4149
14678 4149 6173 4436 3779 6540 4052 6471 7270 7094 8903 8082 14401 18242 14503 5646 4180 7727
14662 7727 4479 8047 12940 7316 3981 4897 9341 10458 4632 6741 9455 6889 6233 6400 2722
14647 2722 4960 8504 1948 -6959 -10672 -9208 -5152 -3890 1540 6196 5001 4367 7019 8199 7547
14632 7547 4991 501 76 954 3184 -2650 -5414 -8265 -5796 9415 13603 6805 4624 1815 1548
14617 1548 336 3489 3687 759 696 -4722 -3339 1940 4402 5371 4033 -2216 -3615 -2840 1758 -3825
14601 -3825 -7007 -7900 224 4983 5802 -2295 -3967 -1317 2406 468 -3049 -329 -658 -2511 2114
14586 2114 5773 3662 -5495 -11445 -4704 -2486 -347 109 4152 1078 131 -2581 -5675 -3772 -1385
14571 -1385 -2321 2491 3521 1927 3592 4234 -1562 -2191 2146 3176 -1027 1600 3849 1412 503 1455
14555 1455 -6117 -8457 -6503 -497 -1153 906 1798 -1088 1014 -1527 972 11410 9913 8557 5956
14540 5956 8298 13926 16071 10581 4699 4865 3247 234 -796 -1383 -78 880 280 1067 -943 -4277
14524 -4277 4609 10397 11099 8778 7366 7356 5538 1046 -6958 -7195 -2023 -9027 -11134 -9668 -3869 -4608
14508 -4608 -2555 -1976 3440 4432 4729 8596 12302 12576 8552 9900 9716 10398 11087 11514 8271 2338 733
14491 733 1321 3548 4003 171 -167 3537 6688 2147 -2563 2660 3545 6031 3150 -6246 -6408 -1836
14475 -1836 -2414 -1727 4418 4059 5165 6946 8072 5842 8749 8568 6865 313 -4740 -2698 4304 9631
14459 9631 8835 8139 6717 2768 -1466 -4039 -4153 1501 6424 6693 3639 1955 3502 7347 8517 5260
14443 5260 4229 3693 -1416 -7609 -1603 -4016 -3610 3401 3990 5409 6175 4039 -1091 1930 9726 7684
14427 7684 8184 5027 2774 252 1508 6182 6760 5224 5264 8320 9808 4706 4850 5963 3 7905
14411 7905 12767 15058 17146 14015 14595 11766 6332 -81 -3516 -6617 2089 8067 2371 -31 4400
14396 4400 8321 11549 12168 11258 6407 2628 2576 1470 7264 8304 2041 -1806 -4264 -9820 -11848 -7209
14380 -7209 -4002 -3414 -2513 -479 1250 10599 14813 14538 5309 8793 12291 9701 10092 5072 -2839 1595
14364 1595 3073 -4999 -5038 -2304 -583 2062 4575 6881 1036 -7234 -877 7537 2568 -4049 988
14349 988 7252 7669 12784 16719 13379 5822 8797 11104 10924 12709 24538 25887 15412 17744 13179
14334 13179 12981 10291 4629 -1319 1636 -463 -616 851 9105 15859 6212 -4359 -3275 -230 -1319
14319 -1319 -6351 -9850 -11664 -8304 -3498 -4900 -5078 -3350 -1268 2555 3867 7325 7430 7019 8032
14304 8032 10127 7119 5876 8758 16120 16219 11598 13538 13339 15847 14485 13868 5520 -1129 4896 3097
14288 3097 -4964 -4398 -178 -1734 -7459 -12318 -11334 -7380 -5851 -1140 2675 7163 8033 1215 -6053
14273 -6053 -2555 1056 -1831 2293 -2085 -5164 -1444 -544 169 3314 3802 3552 4920 9848 9973 6814
14257 6814 -1441 -3312 988 6756 10326 8625 -253 -7470 -2097 2276 4602 5483 1823 67 197
14242 197 1680 3777 5998 3749 5888 13990 12926 6445 6309 10889 14707 6992 5521 559 -1764
14227 -1764 -1842 6085 12954 12178 11661 2987 -2277 581 5932 7953 -1278 -1699 -3961 -8263 -3923 -1326
14211 -1326 -650 4975 9984 11937 14747 15273 9402 11211 12981 6627 4306 11280 10442 12760 8599
14196 8599 5541 3668 4508 2403 297 -3157 -8002 -3829 -2018 2674 -5883 -6905 -4918 -6221 -5662
14181 -5662 -5129 -9340 -11935 -9304 -6597 -6685 -5689 2006 6591 -1040 -2478 815 5078 6928 11922 14371
14165 14371 8080 6298 3524 7997 18795 27200 40334 41952 26262 14684 5278 4612 5820 8363
14151 8363 8782 4447 4405 3314 4246 2728 2771 821 2728 13242 15229 9107 8000 8382 -3277 -1390
14135 -1390 6109 14761 13519 4343 3104 3919 3389 4596 9797 14482 10159 11171 11903 12616 16389 16050
14119 16050 10173 11709 13503 9436 8910 5419 -806 -1012 1917 4254 5830 12343 10812 6201 5936
14104 5936 3375 -1113 11024 18619 10963 4321 9032 11669 10278 5146 -3627 -6248 -1227 -1479 -2899
14089 -2899 -2068 2564 19713 29052 33341 32142 18485 3315 1551 6580 4422 -1145 5863 12750
14075 12750 7098 2600 3606 1068 -1582 -3216 659 6226 4752 -435 -1843 1572 12782 18608
14061 18608 12444 11939 12657 9704 5871 5167 9371 9823 14476 7260 3659 -1220 -611 607 1702 6758
14045 6758 6192 -183 798 7304 6393 3213 2393 4495 1442 1131 -1019 3013 3055 7804 1355 -2312
14029 -2312 -2993 1176 1607 3231 11955 14834 12039 10263 10617 9826 6433 12361 17089 12058 -128
14014 -128 -1286 -1868 -642 136 -5840 -6877 -5884 -624 610 -711 995 4334 4647 4441 9546 12147
13998 12147 9227 15550 20640 15834 13779 13786 16988 8757 5796 2107 4292 8204 3560 942 -1147
13983 -1147 -3183 -1848 11836 19649 11694 4098 2667 8041 9855 1947 -300 4128 2498 418
13969 418 6206 6659 8819 6858 4301 5328 8310 6176 4753 7672 9895 7959 6856 8208 1958
13954 1958 -1301 -639 -1509 414 -4334 697 7230 10191 11324 12415 16674 16357 13512 5825 6211 13115
13938 13115 15491 6832 1199 1228 -1027 -590 -1085 222 -4001 -6554 -13003 -14051 -3683 7613 14433
13923 14433 6806 4681 6243 8149 9389 10740 12748 12876 10657 2937 2319 -1205 -4506 -959 5190
13908 5190 7322 4892 416 2286 2384 -48 -1029 -2599 -5406 -13711 -18604 -13937 -8237 -6710 -4739
13893 -4739 6245 9528 4503 8401 3599 -687 5345 4309 3969 3732 3500 -1293 2501 13455 14444
13878 14444 13465 13293 2562 -2150 -3272 -2692 7431 3371 -8293 -10237 -2661 10974 16224 11901
13864 11901 8231 5416 3801 6536 6127 8647 8802 3880 7275 5441 -1153 932 968 -3660 -2686 1734
13848 1734 4397 7357 11446 18054 17537 9269 952 -1216 6041 8205 7202 4408 11521 16851 11842
13833 11842 14460 16790 14334 13399 15279 15423 14921 18351 15301 14232 14434 13066 10972 3491 -3022
13818 -3022 -1762 11181 17511 14582 12373 10227 6524 4014 5715 5645 3612 4024 8556 9551 11228
13803 11228 12146 11906 7106 5019 6147 8729 9787 4703 -1133 -8465 -4512 8033 14152 18975 19382
13788 19382 14683 11028 7079 1820 -1329 -5199 -8633 -9320 -3765 4234 4940 9182 12429 13703 7399
13773 7399 6527 3723 -487 1953 10430 10032 4687 4180 12238 20022 25354 23843 19476 18631 17959 10122
13757 10122 5443 7051 11190 12132 9655 5639 8716 17057 11164 11153 18160 17067 15475 11355 9636
13742 9636 9396 9533 16065 16564 15515 18256 11701 6894 9593 10786 10670 9938 6185 1945 3365 1988
13726 1988 3582 5614 1947 3753 9457 9570 5308 2600 -1843 2992 8717 8373 7480 4924 6472
13711 6472 7781 15163 18069 14729 10843 6313 2626 2541 3540 3711 9918 9578 11880 16738 14518 11770
13695 11770 12346 12501 23547 28569 23504 20344 17397 16857 17976 22883 20328 19673 18304 18419 15009
13680 15009 7698 7391 8012 9896 11751 15587 17533 11455 10712 8362 13861 18792 12695 3661 -3521
13665 -3521 1660 5983 2056 -2070 -6117 2902 13048 16788 19510 17288 13605 9513 10794 8374
13651 8374 3329 4275 7404 2661 3429 9725 5687 -3121 -1435 -3992 -3315 -472 768 4453 7613
13636 7613 10831 14094 8487 4702 -1003 -5669 -480 4517 6139 7861 5771 7398 9549 17199 23870
13621 23870 14478 3667 4590 7824 9881 10214 12233 7411 4208 7388 13305 19486 17081 6843
13607 6843 6575 6536 13418 19036 16351 12640 17467 17593 15323 12537 8008 10065 8668 4202 9095 13026
13591 13026 14253 10561 13935 18679 21126 20846 14949 11686 11035 17444 15290 14359 17704 17460 15095
13576 15095 14772 15203 9461 6467 11166 12386 6512 2332 2923 8957 13747 12783 8309 12885 14058
13561 14058 10360 10177 18026 21467 13688 5599 7505 10018 11858 7233 10916 12079 10609 10394 9853
13546 9853 13960 20808 19571 11889 2849 3148 12692 19983 14958 10076 14650 18443 15783 7636 1347
13531 1347 6793 11808 11041 19002 18222 15480 17977 16193 11929 10575 10741 11435 15915 17773 19368 18292
13515 18292 20692 20445 12314 9903 8394 5379 4608 7881 8356 7173 12211 11409 9655 8663 12250 13418
13499 13418 8190 3938 4659 1430 3542 4916 8551 7027 8092 12469 16642 13516 12121 8569 9300
13484 9300 17620 20916 20901 19680 25554 21498 25951 29716 23607 9437 -1195 7201 10834 11475 16467
13469 16467 22016 21904 18764 13540 10922 9994 13300 12912 10517 11715 13860 13089 9305 8591 15585 21984
13453 21984 27563 25716 24311 17647 14156 14847 14885 14632 17018 11942 11875 8475 4120 12244 17128 17843
13437 17843 21524 14654 4826 10967 8964 3465 5706 3986 5010 4455 15054 19233 17000 9485
13423 9485 13177 11262 14367 22741 23311 22175 17031 12934 11985 10639 15460 17131 10316 5987 6547
13408 6547 11000 13114 18689 21602 19130 11837 15683 19045 13246 13850 18092 13395 12739 11502 14925
13393 14925 12409 11902 12467 19355 17114 16168 22668 27294 29309 23290 17396 13075 5482 4903 6553
13378 6553 12165 17835 18087 18462 14491 8768 6236 5393 4131 3197 9643 9816 8956 6775 252 -3693
13362 -3693 -3465 -4084 2009 10367 10458 12863 13358 14710 12994 7858 5428 6149 11139 10296 12754 16386
13346 16386 15283 13794 7952 6366 11516 17292 18275 19749 22453 19666 16736 16913 12671 14357 22063
13331 22063 21098 15447 14059 19630 18184 12145 9596 10509 10576 8112 14143 18555 15504 17451 17218 18128
13315 18128 23385 23756 18106 11689 5234 -909 5233 7909 13615 8301 2369 2108 1965 6911 7294
13300 7294 7816 6769 9650 11357 12418 10224 11703 13268 16914 16432 17188 17521 20196 19342 15085 15061
13284 15061 16687 25645 26966 17161 13384 21914 21154 19989 25545 26153 24433 27050 21292 17514 17438
13269 17438 17907 19399 17140 20766 28322 24008 25258 25281 21131 21549 21874 22348 22200 25504 25107 29336
13253 29336 23405 19967 31687 28349 24624 23392 26475 24354 20369 12081 7599 8016 17023 22003
13239 22003 22750 28465 28405 28737 30258 27734 27570 28072 29563 27334 20195 20646 22285 18490 14155 10067
13223 10067 9064 13229 12217 10382 9419 9907 8005 7983 8390 7780 5573 2517 11345 11642 14900 18489
13207 18489 15941 15488 11080 7790 8959 11931 13653 13215 9969 4586 2501 546 4660 15259 15631
13192 15631 11940 10137 13697 19020 26125 21980 23804 25740 25842 25469 21859 14642 8201 7312 18073
13177 18073 23762 28603 28871 30324 31595 26932 19779 21794 26168 22396 22836 26749 27504 28634 31526
13162 31526 29095 28650 22486 18320 23300 22754 24297 18691 20185 19119 21599 25242 25933 30915 35039
13147 35039 34292 23711 23087 19971 24169 26275 26988 31176 31967 27911 30058 30186 26886 18922 20084
13132 20084 25365 23148 25941 29915 25445 24473 26747 24224 22411 24095 25785 28065 35947 43949 42642
13117 42642 36452 34077 25514 23336 23466 24591 26140 29360 28498 24021 20556 15267 25765 25032 23236
13102 23236 17241 15085 15482 23242 27539 27180 29870 33941 36804 33510 28728 27645 23445 26891 30663
13087 30663 25089 29871 34017 25686 25622 24177 21747 28010 29307 31932 34477 31027 30273 27383 25922
13072 25922 23045 21099 24476 18690 18078 22110 25862 22621 20051 13683 16460 22643 22993 19234 16640
13057 16640 14951 14325 20199 30183 35970 44187 43615 33849 32253 38749 39356 34969 29246 26206 27362
13042 27362 29154 32186 37614 38713 33266 33803 36324 35183 21757 23238 25285 21723 20986 24970 24361
13027 24361 20839 17515 24501 27834 27240 27819 29641 24224 26193 31616 30681 33890 32457 38552 39271
13012 39271 30050 26628 24621 25465 29419 30593 31664 29075 27053 27447 29737 29017 29211 20738 19768 20451
12996 20451 19493 20484 23000 27276 35896 36381 32181 28517 24975 25758 32372 37348 40786 39844 32769 31828
12980 31828 25276 28488 27756 33314 35578 30412 28289 23669 27182 29560 22767 26111 34230 32746 26673
12965 26673 16457 17586 25730 33535 28688 26959 25967 22663 17247 20766 25481 26909 30456 29319
12951 29319 36886 44027 45511 45344 41887 36976 26552 18224 18108 22275 30703 27238 20444 14954 21918
12936 21918 28114 31582 32837 35504 34901 35482 38917 37132 31506 31225 29528 28863 37569 36087 27290
12921 27290 18519 14191 15313 17648 20838 28184 28576 32500 32675 33793 39392 45822 44861 48973 50339
12906 50339 46840 43598 39350 39338 35623 31822 30207 28892 31187 29860 26179 28516 30044 24280 20418
12891 20418 22999 34607 42130 41323 42028 39055 38112 36245 37865 42345 40944 35245 34596 34908 32961
12876 32961 30160 28042 28829 30872 36201 38471 33656 30497 30817 35173 37483 37596 38631 43690 44837
12861 44837 46478 44594 43573 42697 41251 34557 33955 38634 41034 42175 49168 49661 42076 36321 38317
12846 38317 45411 46983 43640 39747 42059 45741 40285 33718 29338 31601 32122 31870 38281 40737 45828
12831 45828 42409 40221 46150 55072 55990 52938 50046 50436 45942 39899 40451 41725 44974 45241 40746
12816 40746 29823 31470 37000 34457 41207 46079 47277 49184 47404 44764 49290 45272 46681 45060
12802 45060 43184 43294 52342 49167 41874 41001 39155 41690 45233 48349 40080 38268 41418 41539 41377
12787 41377 45836 37083 34666 37496 35046 34855 36059 36100 32599 29361 32210 30736 29479 33411 35920
12772 35920 37490 41225 45271 46988 47862 46051 44500 44148 37319 36777 38610 38829 39369 45294 45753 42244
12756 42244 44382 46846 51166 50906 46374 43895 42703 42132 39718 44456 45775 52746 60322 65425 70167
12741 70167 69658 68559 70805 67015 69442 79559 77259 73872 67773 69823 71922 68668 72180 77803
12727 77803 87173 89535 88829 84618 84070 86800 96867 107357 117698 131388 148505 168588 194731
12714 194731 220046 247989 280859 323235 372506 443879 550230 712527 955838 1254903 1610014
12703 1610014 2020160 2368082 2289360 1724461 1102182 689126 459094 328613 257436 209523
12693 209523 166946 139247 128229 117113 113700 110820 104549 95382 87227 88214 84375 80987 80940 80436
12679 80436 79271 81000 82269 78367 76427 73793 78576 81080 74928 74438 73745 80532 79017 79543 75340
12664 75340 72456 65296 67494 69373 67927 68951 60607 61605 61715 61352 63897 61766 58010 61224 66028
12649 66028 62903 55624 53131 51953 52830 61521 64210 59480 61250 64578 67178 64814 58153 66768 73456
12634 73456 65579 65746 69440 71289 69203 62799 62765 73519 84745 85989 88999 83882 75283 75418 73448
12619 73448 80917 85298 81290 76787 79628 78852 76048 72311 70396 79634 80570 75017 76489 69495 68680
12604 68680 75286 77497 75833 65742 67026 67432 66227 78480 79550 74512 59799 56119 66784 70961
12590 70961 74621 74477 78317 82491 80287 80195 77029 72747 65917 63218 62655 68947 69686 69693 72740 71127
12574 71127 66963 70209 76488 78764 80775 75871 72669 69426 65312 57670 55422 53799 51538 52305 57508
12559 57508 67877 77768 82206 83576 77093 74187 70890 71932 80067 83105 88888 95637 95018 95709 98840
12544 98840 103101 112418 120857 123111 116861 112338 114115 134257 147768 153551 157655 166880 177312 190705
12530 190705 200748 212155 214534 212573 202607 199751 202778 197244 182891 169402 167967 169664 165285
12517 165285 164166 161751 152375 153922 162447 171352 176968 181643 187519 186487 183468 185109 184136 177138
12503 177138 167587 160673 147974 135006 128787 126816 123157 113758 118824 117184 124254 128533 135124 140623
12489 140623 144583 140107 134488 124051 118438 114140 120225 132568 149785 162944 173695 172685 158395
12476 158395 147607 145913 143477 142013 142496 140852 139984 141477 147721 152681 157097 164021 166527 167381 172234
12461 172234 173855 178103 178285 177658 178845 178092 185581 195477 193642 203195 227730 252787 283044 309296
12447 309296 331288 366161 410408 441393 452884 471438 507829 550142 580011 575292 535009 478848
12435 478848 430695 395242 361794 331005 300855 293541 291665 290448 292012 294508 296705 287912 286331
12422 286331 282411 277712 275325 273584 276609 277162 279920 288395 295621 309850 323870 343171 357722
12409 357722 365952 361341 358186 365167 368599 368480 370340 375451 382659 387285 395860 395317 400212 411927
12395 411927 428900 454059 475334 523371 609916 707161 786226 839154 898122 989317 1106234
12384 1106234 1225547 1296705 1269182 1167461 1083299 1041221 1021045 1006407 985585 942766 892777
12373 892777 862127 873352 921870 1032670 1227180 1488495 1790830 2118341 2373882 2321993
12363 2321993 1897608 1392640 1012065 777756 643261 565425 515590 482965 456950 448393
12353 448393 446438 444484 436732 429832 424668 425899 422999 410920 396049 389453 386047 397979 421789
12340 421789 434969 448593 457067 457192 451321 454251 472201 495707 516751 533639 540943 528295 517158
12327 517158 518441 519228 520274 530490 558876 585299 603448 614715 623533 633793 637796 628236 630751
12314 630751 634048 658783 688969 704439 703900 697509 702079 716793 741274 769960 792426 822312
12302 822312 860308 882173 902490 952642 1024903 1083885 1140206 1204933 1265515 1317912 1361841
12291 1361841 1407248 1462392 1524467 1594845 1688687 1798630 1914606 2021144 2120369 2216110 2322262
12280 2322262 2460616 2653873 2912781 3221671 3545109 3874098 4224255 4610345 5043022
12271 5043022 5533358 6080788 6728549 7583871 8719848 10168638 11958472 14089289 16621409
12262 16621409 19623061 23122426 27262625 32353108 38408049 45051633 52574766 62258931
12254 62258931 75834445 96081361 127594023 173769910 230881704 294262812 368054761
12247 368054761 428489218 410932550 309246954 196218224 120002118 77438274 53729936
12240 53729936 39548985 30473783 24521469 20611133 17995504 16011330 13974654 11788543
12232 11788543 9854094 8390295 7326349 6516652 5824669 5201906 4627952 4097686 3614122
12223 3614122 3173581 2809018 2549581 2365914 2215224 2088235 1988324 1922683 1867061 1796699
12213 1796699 1695552 1575638 1454107 1349412 1280458 1222576 1177881 1136029 1087807 1030360
12203 1030360 971711 912874 869538 837204 817453 801339 789541 782360 767960 748872 724666
12192 724666 683017 648484 632696 622305 602956 577167 547191 511745 478923 452476 429895
12181 429895 416306 425244 425208 406102 386884 371227 349939 340149 349596 362367 366374 369446 381122
12168 381122 393378 409599 407455 397260 392741 400725 413966 424862 441069 453040 463660 456935
12156 456935 422483 384999 370643 367066 355788 343120 343919 331348 323195 305210 297026 291250 280118
12143 280118 267582 262897 267793 270271 274256 269986 265609 259688 255049 259507 271584 282528 297059
12130 297059 302386 305231 305961 305239 310139 316000 322310 324840 321381 322607 323428 315753 301175 269226
12116 269226 242114 239007 233131 207068 173554 134461 85581 65177 85414 118642 161561 203385
12104 203385 227055 254191 290414 325292 335158 321816 300220 283591 273643 277225 285115 289761
12092 289761 295343 305512 319988 334319 333192 329040 324023 319044 326952 330032 328031 329396 333799
12079 333799 332383 328123 328806 331600 325657 331766 330838 321316 326823 331362 335293 338644 349604 363637
12065 363637 384942 405689 415113 427536 440036 445954 456949 494104 544552 591214 634210 681126
12053 681126 739263 809444 883259 949454 1040843 1151597 1284365 1441073 1645052 1914384
12043 1914384 2263369 2731498 3330537 3955915 4596003 5596451 6330237 5420273 4263655
12034 4263655 3705000 3597147 3752573 4086345 4556252 5155542 5868966 6720486 7712103
12025 7712103 8846005 10181396 11835984 14018923 17031713 21303321 27268555 35034861
12017 35034861 44355276 54549672 63414729 66788146 61974071 51451648 40530891 32385555
12009 32385555 27129859 23700694 21303265 19702796 18806233 18315287 17940003 17712822 17814008
12000 17814008 18193094 18470976 18328149 17907423 17618779 17747911 18379127 19508940 21043184
11991 21043184 22842860 24810066 27000579 29483622 32038279 34199357 35607276 36112175
11983 36112175 35884960 35369007 34736106 33634251 31632406 28737933 25556167 22831243
11975 22831243 20862900 19438628 18279558 17327913 16715218 16592804 17007690 17897976 19112818
11966 19112818 20512176 21910188 22992524 23464744 23471155 23622751 24537845 26443391 29349724
11957 29349724 33495932 39200475 46367442 54147419 60884658 64305156 62141343 53667515
11949 53667515 41360039 29482350 20668449 14925611 11257443 8836693 7180322 6026671
11941 6026671 5194726 4563570 4054511 3627974 3254771 2920872 2626016 2390377 2198317
11932 2198317 2037834 1902312 1770072 1641809 1522508 1427808 1353777 1306987 1266534 1213887
11922 1213887 1135245 1026947 912277 819242 744829 674846 616301 577261 543696 508306 479597
11911 479597 464094 445306 424128 411582 400670 393143 386266 374118 367646 362507 355233 345577 330748
11898 330748 324133 322301 315988 304047 295295 290237 284334 274044 259987 249321 237487 223794 205928
11885 205928 201745 197667 193827 182559 156678 147195 139659 129182 117723 113799 121194 124024 127261
11872 127261 126738 127755 135551 140857 139476 135900 140117 144343 145393 143673 139664 140769 141620 139924 140401
11857 140401 143339 148953 147797 140295 127773 120623 120658 120622 120087 124031 124255 119676 106356 102689 104129
11842 104129 109954 111394 112079 114326 117829 121205 119938 123432 126231 129486 139019 145101 141618 142714
11828 142714 141639 146517 146022 143263 149357 153069 152789 149104 154268 147693 139273 134113 140269 153501
11814 153501 173711 207813 237011 266911 282581 278718 274831 261164 253043 254072 257089 267453
11802 267453 289881 313639 319604 306187 280922 272033 275924 300214 336063 370979 420942 500780
11790 500780 617411 807278 1084447 1407975 1781518 2198518 2402711 2074936 1426975 893100
11780 893100 580323 400118 291733 229604 187381 158559 132475 117307 105827 91097 71112
11769 71112 58137 53189 46088 42478 42998 44411 37746 24072 19992 18157 16648 26463 26979 27196 35596
11754 35596 42687 45288 40165 35972 38297 41788 44211 40159 36450 37233 41323 36739 39136 35959 31191
11739 31191 24057 21337 23823 29267 23597 19192 22628 29201 38961 41712 33877 25489 30033 34195
11725 34195 33759 27875 24368 29126 26956 34458 38471 35999 35543 40121 41383 45821 44819 39873 31343
11710 31343 32208 35520 32384 36122 39134 39456 38882 43575 51714 56925 54620 57772 61496 61742 54540
11695 54540 50369 42168 41204 44076 51117 53950 55733 58116 67374 73642 70340 73225 78773 87187 102303
11680 102303 121461 125976 134972 149446 159972 181369 198061 207271 210069 211000 199697 190271 188666
11667 188666 181044 177977 168590 159066 151751 136923 123368 119844 119286 116194 114119 116690 120474 120378
11653 120378 122274 125208 130255 135247 139160 137924 138527 141149 149988 159478 155510 148622 156794 159194
11639 159194 165406 168096 169639 167982 163832 154737 144021 136644 137955 138649 131401 122371 123652 127887
11625 127887 130900 132005 138641 142459 146851 154578 156592 167510 179897 183363 191683 193336 191094 189055
11611 189055 187204 184744 179649 175863 165774 160054 147625 138990 129236 116827 111762 113984 104572
11598 104572 93530 89218 90909 95673 105736 110901 125152 138630 146153 164939 201174 238925
11586 238925 275992 320326 358960 372082 347974 298566 250620 208993 176265 157670 143873
11575 143873 136939 127124 119450 119013 115840 119233 123606 123207 122896 120245 120318 129556 133413 140158 148178
11560 148178 157182 170813 183080 196478 205419 215699 220961 220316 222083 218511 212223 205454 199180
11547 199180 183519 162367 146855 135355 126927 119120 116526 117442 119168 124863 132156 137447 147259
11534 147259 160227 165296 163527 163052 168596 175031 183341 198879 216683 244014 278630 301523 325258
11521 325258 335384 317163 276395 223184 168435 131973 107969 97983 90412 77224 67594 64186
11509 64186 55844 53894 52506 50241 42503 39585 38409 33948 30298 26200 28610 26181 25671 29997 38958
11494 38958 44812 44017 37843 27786 21214 25042 32285 36984 36705 33323 25092 24480 21464 23464 23140
11479 23140 20330 16817 21277 20789 16711 18978 21351 22678 21778 23976 26565 22644 20796 21678 18235
11464 18235 13359 4150 4042 7164 14908 16589 24271 20187 10308 9103 14016 14181 16779 5212 -969
11449 -969 1870 3370 6949 9647 13867 11531 11885 10729 5414 10272 14330 17030 14073 8036 5318
11434 5318 3444 9964 15848 15606 15528 16579 19229 18573 17037 7641 3335 5585 11027 12453 5025 10195
11418 10195 9105 4413 -651 -1555 -1398 -1897 61 1585 -3304 -1150 -848 -1091 -2595 -5866 -9033 -10291
11402 -10291 -9772 -4583 -7472 -4001 673 -82 -2204 -3583 -5122 -5690 -1532 4813 7157 2138 2445
11387 2445 -1139 -7351 -6162 -11924 -6636 1459 -537 -1909 3743 1342 -2595 -6735 -9134 -9406 -8492
11372 -8492 710 5368 7994 7415 8373 3060 2683 91 -4571 -10316 -9081 -10698 -7148 -2024 -1570 -4911
11356 -4911 -2901 2440 1311 -872 5321 8963 8757 5005 6961 10797 8361 5638 -2082 2329 4565
11341 4565 3743 5456 1955 -2736 1127 -477 -2879 -4312 -1393 5378 3269 408 -2830 -2108 -432
11326 -432 7067 7542 7507 6234 9056 6264 -176 -3636 -6163 -6153 -3122 -2001 -5627 -1985 -4348 -4346 -5266
11309 -5266 357 1866 1892 4543 5320 426 -1806 -2235 -3852 -2032 6488 14227 16569 14744 14055 12527
11293 12527 15173 16914 14382 15878 15385 20597 29541 46550 58673 83794 116012 148000 166490
11280 166490 164145 136136 101015 63837 38969 23172 12806 14457 13299 7806 10051 17137 15895
11267 15895 7730 3176 -2669 2192 4849 -3320 -15807 -8925 -2690 -1922 -2311 -4233 3244 5281 7240
11252 7240 3277 -4389 -4314 -338 -2040 5299 8122 5457 3351 -2927 -4058 1061 5136 3918 6735
11237 6735 9054 1436 -1390 -2054 1788 3560 3998 3062 2509 452 -1675 63 2412 2314 5460 8653
11221 8653 3909 8341 10900 11521 7399 -436 -155 -848 -3954 -1438 3103 5389 -1845 -767 9529
11206 9529 8937 714 -6392 -9013 -746 4519 5732 1733 1992 1442 4456 4538 -860 -6124 -5677 -7807
11190 -7807 -3372 -918 -2406 1900 -3469 805 7660 6935 8948 9619 4563 234 -479 1889 -6655
11175 -6655 -14812 -8868 -1995 1789 7082 3627 5133 7570 9306 6370 4655 7306 9068 9010 11798
11160 11798 15468 2975 -12134 -8503 4092 12770 9929 9070 1872 86 11076 13450 9933 7189
11146 7189 5509 1972 6277 9115 11547 12480 12833 17767 13440 15339 17310 14923 11664 14279 11336
11131 11336 6932 11452 9537 4526 -989 -1339 4214 8998 10140 11173 10817 4892 -92 -58 5223
11116 5223 7273 664 943 6495 12441 5729 1935 2561 4789 3994 1728 3535 7501 8659 5917
11101 5917 7386 6293 2807 58 2018 8287 13480 16843 20286 15070 2305 3924 12032 15231
11087 15231 10343 7391 4680 7096 11246 10316 10732 9803 7221 11453 10546 5246 11485 22017 24457
11072 24457 20810 23331 26526 28455 30948 15729 10603 15738 15340 19555 17301 2937 3279 11137
11058 11137 20023 19026 11415 10097 12207 15198 13646 18161 21180 21493 20607 20677 20885 18623 16432 22451
11042 22451 22043 20978 21463 20487 22208 23493 24586 22721 25041 28590 22632 20608 18638 17055 18135
11027 18135 22124 23795 22800 19687 21082 24915 25226 20646 19694 16361 11554 13760 24377 28294 27655
11012 27655 31632 28866 24693 23755 25036 16663 9461 12094 18203 19794 23638 17751 22293 19478 16102
10997 16102 26782 30203 25695 22018 21787 25624 19878 13684 19144 23313 28696 34313 36380 32334
10983 32334 29687 29524 22271 24333 25079 24355 21848 23651 23289 24688 28696 30921 21235 15148 27696
10968 27696 28078 29520 23617 15715 16214 19392 24998 26050 20800 19881 20720 18322 17212 26886 28851
10953 28851 28424 25454 26969 24537 23588 26511 25221 28095 32382 30823 22148 21265 22475 23529 14100
10938 14100 15093 18064 11223 11606 15613 14760 12059 13734 23664 19440 15880 19179 25766 28428 22975
10923 22975 24087 27910 26889 26643 27242 27036 23616 24879 21194 17289 19957 25572 23453 24364 25523
10908 25523 28958 27530 23621 26420 27652 24301 24129 23364 25191 22272 16868 14833 20304 19478 20912
10893 20912 16369 15931 18211 17607 15160 9336 12673 15929 18097 23008 21842 20704 18905 18073 15405
10878 15405 17129 12710 20097 28397 34248 28193 21807 19578 26501 29442 28699 18507 14934 10735
10864 10735 11997 17058 19525 23252 22068 22042 20112 16181 15509 18190 23145 18859 9660 12108 17556
10849 17556 22274 26349 23844 26127 21006 15797 17304 21356 26964 27774 24943 18966 24452 30047 31816
10834 31816 32592 35275 35370 36543 38058 39446 41049 40618 43770 46849 53178 49852 50258 57074 67053 77807
10818 77807 92557 108853 127808 155722 190101 231167 274031 309593 327992 318241 281300 232842
10806 232842 181747 153685 140163 126860 120158 116057 119164 126490 133214 143991 139305 133415 124456
10793 124456 111671 97601 97594 101853 106370 113240 117652 119566 120871 126596 125076 131002 134780 143496
10779 143496 160375 177516 191471 192082 190834 195357 188748 189421 196768 198229 183358 166186 144330
10766 144330 124632 119923 113135 108598 112376 112119 113784 115062 114702 107591 108418 109764 115131 120714 130250
10751 130250 137666 147191 153277 161613 163487 156839 151202 152368 161703 178777 211261 247741 296323
10738 296323 337664 357448 342622 302641 242530 179035 135579 107409 89930 78738 70958 63797
10726 63797 56883 51757 47508 45432 43542 39513 36266 29152 24997 27871 34448 33564 29562 33883 28700
10711 28700 21550 20415 28287 31453 35794 32679 26331 27452 31157 39249 42810 35960 30711 28812
10697 28812 35046 36985 40277 45495 47645 51893 55979 54494 60323 56117 50942 52152 48485 51215
10683 51215 55404 53828 53201 54311 52954 53193 53310 51078 54292 55978 56367 52800 46382 48544 51752
10668 51752 56587 49811 46977 55125 60926 63023 64360 61503 59464 60496 54739 56681 65106 62337
10654 62337 63907 60941 69072 70293 66804 65052 67293 70400 72700 75662 65120 61441 74498 76972
10640 76972 75852 79970 82368 80108 79295 78812 78815 79846 93813 94139 89186 86198 82231 75782 77474 86772
10624 86772 89292 87353 76421 70989 72476 81754 88292 83610 80893 75444 73799 78092 84845 82561
10610 82561 81622 84922 90966 90878 93039 96633 99913 110235 120423 118659 121990 124080 125457 123460 126511
10595 126511 124397 117898 113829 105659 107219 106033 103011 101695 98627 101231 103314 95631 94521 93455
10581 93455 92546 91786 98675 97869 92617 95819 104433 113000 121013 121853 119502 124733 131933 133839 136723
10566 136723 137734 143224 151320 159259 159951 173482 192187 205029 220294 242975 277642 309828 324363
10553 324363 335562 341515 332117 310844 290497 267035 248283 233888 221608 209926 207523 208055
10541 208055 216079 213871 204158 202650 204603 199807 196678 199605 192617 182498 184416 189560 189873 191703
10527 191703 188982 194259 198531 202078 198171 201855 206461 215272 231621 241203 257051 285015 312317
10514 312317 341424 363251 378796 389240 388647 365019 338826 310435 284555 267907 264074 261301
10502 261301 258089 256827 247257 243390 237985 237299 244284 252221 259072 261105 258834 262695 264836 263133
10488 263133 268989 278236 290158 297088 301346 309134 307340 315528 329623 345358 364707 377718 388451
10475 388451 400368 409978 412300 412089 410706 404068 395633 393570 391393 383650 379618 379711 383825 396496
10461 396496 411736 423342 438096 444646 458211 473449 486514 497637 518707 542612 565929 594693
10449 594693 625189 665693 703141 743245 786116 831611 873424 915141 958111 1002554 1053075
10438 1053075 1100665 1154127 1221407 1304209 1416904 1561865 1736738 1962327 2234634 2533906
10428 2533906 2838155 3147819 3463342 3816569 4236162 4728637 5325993 6063000 6993730
10419 6993730 8164261 9636963 11527051 14038042 17487068 22214444 28403578 35983309
10411 35983309 44598671 53022877 58519452 58266072 51573725 41084182 31078642 23993826
10403 23993826 19776459 17555362 16727317 16903112 17653598 18694365 19953362 21283953
10395 21283953 22285011 22148799 20490210 18167931 16326186 15351159 15094095 15310946 15862475
10386 15862475 16627257 17358739 17849780 18137305 18466790 19153254 20463247 22521943 25172692
10377 25172692 27895586 30064798 31298157 31517127 30989971 30393664 30262808 30335039 29806135
10368 29806135 28146057 25362819 22077255 19227595 17373956 16539044 16422241 16581328
10360 16581328 16645785 16511871 16227867 15911121 15797689 16097198 16786882 17760190 18927938
10351 18927938 20141128 21258974 22415418 23887590 25415500 25992125 25028407 23527914
10343 23527914 23065722 24541162 28226692 34075384 41758547 50655371 59141669 64080210
10335 64080210 62672851 54539757 42274840 30178797 21024793 14968728 11117546 8611334
10327 8611334 6925483 5738224 4874479 4230318 3713179 3288115 2947278 2685194 2493072
10318 2493072 2334378 2190803 2058817 1907611 1730502 1539608 1343565 1183765 1064819
10309 1064819 969752 900455 854684 813825 778950 746219 719314 689308 658931 636141 613523
10298 613523 597767 590056 588039 576219 558609 543905 533780 527608 526485 535401 543387 545237 553308
10285 553308 556676 549283 530977 500611 470302 441525 417301 388170 363182 338952 321648 310889
10273 310889 292059 273436 259809 247544 241244 242180 245643 245229 243378 235910 232934 239244 248253 244928
10259 244928 235919 225507 223082 230831 238544 245095 245879 248115 253632 264884 270685 279321 293830 310459
10245 310459 330388 366777 408824 443944 480413 507356 518345 518128 500110 477413 443150 398828
10233 398828 353958 311879 285995 271416 257567 241981 228071 211738 201372 198726 197142 201756
10221 201756 201309 196913 196257 200978 200552 207174 211046 215081 215096 219565 225683 238518 252536 262618 272630
10206 272630 280355 287596 300056 316347 321978 340316 358270 394917 438591 485453 533534 555293
10194 555293 543020 528507 518993 531151 544032 539746 523800 492824 434402 369965 309106 258414
10182 258414 231197 208383 191488 195172 197783 198967 191497 184239 174616 170371 161880 159696 163790
10169 163790 153421 144053 147200 148443 146514 138515 136707 138424 131053 123010 125040 125567 130113 132432
10155 132432 126250 132984 141507 138655 130375 126922 122531 125400 127092 123629 123338 128100 128570 130472 133979
10140 133979 131830 129688 125865 119624 125733 134371 142216 148566 148879 156043 158294 153044 143940 132034
10126 132034 124008 120301 115005 108994 109302 116526 122887 124124 121113 118071 124153 130704 130974 122067 122164
10111 122164 117617 115877 119811 123935 122462 126394 138569 136826 129560 122686 115432 119791 115688 110970
10097 110970 109097 110810 107549 107664 110259 114751 112151 114199 118751 111104 112633 120386 123393 121569
10083 121569 119883 111151 100973 99723 95635 94829 96034 94261 83449 85699 91954 88260 91350 95078
10069 95078 95158 87110 87582 91050 86564 84061 87227 84597 78673 75241 71835 76996 76391 70887 68331
10054 68331 75229 78852 71119 73593 77642 74990 71907 61455 54784 57493 53721 54736 55479 52344
10040 52344 53751 57268 56483 51471 43576 49891 56699 61311 63201 67335 67893 71377 74329 77722 84897
10025 84897 97547 105997 106830 118406 135286 152485 171113 194256 221963 265227 313359 380392
10013 380392 481924 664272 925015 1177023 1501829 2055457 2078964 1353248 836892 620168
10003 620168 533401 489186 451604 397034 335581 276850 228585 190719 162863 149233 145253 140410
9991 140410 142511 149393 152934 159075 158165 148939 136416 129363 117675 110134 109522 109211 108254 112036 117310
9976 117310 122064 128348 133017 134460 140600 154775 169492 183833 188796 189310 191750 187238 173549 175294
9962 175294 173054 168094 159203 147775 129677 116629 108143 103690 100246 101079 102730 99163 96517 94178
9948 94178 97195 103078 108531 113314 122529 131107 142819 153130 153909 154376 153910 153721 151919 153854 173911
9933 173911 214096 255763 301974 342964 364595 354796 313080 246624 193907 144724 108948 80283
9921 80283 59425 54288 51316 46805 38966 41806 45225 38376 27102 28889 36588 35868 33489 28622
9907 28622 25052 26011 23937 26113 24992 23936 25962 20553 13153 12237 18890 20700 22270 25214 18950
9892 18950 10019 6625 15664 22013 25070 23342 14741 9763 6334 6430 20734 24831 20780 21937 15389
9877 15389 14729 15819 17522 17862 18990 20007 27124 22964 15612 7752 11317 17068 22112 27511 30912
9862 30912 25028 19655 20899 24094 20166 17557 25142 26451 37105 45769 45953 44935 48229 46718 45364
9847 45364 45920 45373 44471 46708 35708 32742 46994 59412 54810 56236 59740 65819 82112 86584
9833 86584 83200 84297 75276 64679 57208 52120 52176 52457 49322 48679 52973 54294 45767 48002 49540
9818 49540 50695 59752 57211 59682 72408 75059 78502 81933 83264 83515 88803 86975 88523 88863 100111
9803 100111 114716 125809 136012 144443 150958 161917 170425 162342 154720 159655 151920 143752 135271
9790 135271 121830 109342 100960 90311 82766 79810 88257 98513 104429 113435 117500 115569 117573
9777 117573 124148 119674 109808 105878 109773 110339 110116 114958 123359 135062 144629 152436 159663 177531
9763 177531 201126 218973 226354 234826 245545 254348 252091 236893 209994 178914 155625 144519
9751 144519 140374 138561 131126 121690 116909 108978 101041 102688 107910 111759 115052 112231 114174 117520
9737 117520 120251 121549 125799 120512 116488 114593 116094 114045 120039 132179 148736 170267 191299
9724 191299 206130 213907 218730 212185 199683 188218 171782 149891 134579 125172 117237 109650 101133
9711 101133 96638 90264 83898 88613 93478 91599 97210 104050 100553 90283 85951 85769 74943 70913
9697 70913 76517 71502 67546 68563 82052 85359 91344 89267 94958 101934 100459 107580 115798 122449
9683 122449 131992 137930 135030 118625 100497 90127 85049 79045 79800 78843 77305 73645 72268 69185
9669 69185 65381 63697 65842 66092 65166 57150 56515 59562 61579 63628 64339 65683 65075 65781 64677 66298
9653 66298 65276 62373 61514 64277 71156 71204 76002 73472 74413 68693 70278 72211 73910 70951 68879 67576
9637 67576 68884 67246 68268 64016 69320 71370 72293 77713 81808 78870 79062 77541 84230 78476 76553
9622 76553 78592 78059 81449 85652 91199 89631 87630 90066 84500 85104 89665 97271 90674 99214 107231
9607 107231 108804 108738 110575 110648 103171 100533 105989 104363 99859 104344 103942 96447 89497 93354 100093 104045
9591 104045 105020 104851 113158 119540 114749 108533 112188 112756 113084 112895 117745 112790 108898 106822 98537 97678
9575 97678 105635 117123 115342 108051 104318 106616 105249 107969 101476 104847 112058 119402 125533 128897
9561 128897 132076 134713 131298 123689 116258 120560 125632 124261 123480 125414 136187 137498 139062 149882
9547 149882 153739 156779 159279 164167 167488 166232 176010 182594 178466 173511 164575 156239 151648 155992
9533 155992 160574 167730 174333 183465 193025 194715 186613 182081 181761 184555 184947 197538 201210 203158 196733
9518 196733 200199 206129 206481 201124 202163 210645 228324 241816 251543 263728 275546 280140 281156 280594
9504 280594 279752 276276 274240 269647 272615 276744 281904 285828 291411 298275 295554 289487 281768 273210 274909
9489 274909 284697 295923 308795 319682 324665 335661 347272 355116 356592 362130 365987 364961 366569
9476 366569 373577 381897 396519 416849 439106 460952 487745 519792 563491 600910 635454 677292
9464 677292 715348 749631 790809 840527 892425 953807 1032031 1132115 1246358 1371441 1529183
9453 1529183 1733202 1990204 2338522 2799105 3382406 4075956 4839628 5513078 5887175 5914257
9443 5914257 5723496 5517081 5467037 5637426 5978833 6331005 6463977 6204112 5585362 4893589
9433 4893589 4398729 4147811 4041992 3937557 3810080 3722955 3739492 3886005 4177561 4611724
9423 4611724 5186645 5903385 6738577 7615085 8403518 8972344 9349063 9686739 10153934 10878891
9413 10878891 11977328 13444535 15060043 16371682 17026339 17057153 16743058 16416116 16382749
9404 16382749 16701898 17134046 17389248 17269058 16719818 15823486 14822396 13947479 13216010
9395 13216010 12490074 11786618 11299984 11227987 11596195 12349905 13391167 14507850 15416772
9386 15416772 15960884 16171305 16150575 15992687 15815905 15707061 15854534 16444191 17491202
9377 17491202 18878298 20488721 22275384 24149911 26036966 27987711 30113312 32416697
9369 32416697 34616205 36328877 37127785 36522402 34426462 31263577 27712526 24455921
9361 24455921 21788323 19736530 18211562 17056756 16176922 15477140 14850639 14251316 13793650
9352 13793650 13623034 13805767 14329480 15117461 16063425 17122241 18137637 18970856 19567375
9343 19567375 19933124 20208256 20464469 20795357 21367622 22463100 24311002 26793451 29477315
9334 29477315 31809536 33329043 33671352 32718687 30674879 27932847 24961918 22191079
9326 22191079 19825335 17857513 16154251 14546639 13082407 11808979 10719237 9976192
9318 9976192 9753085 10036646 10684820 11496276 12228579 12611373 12440772 11768179 10853066 9895642
9308 9895642 9016641 8336257 7917919 7808436 8026277 8565489 9381338 10440104 11741418
9299 11741418 13305390 15107897 16839907 17918641 17938033 16981415 15546313 14068054 12575932
9290 12575932 10929825 9094941 7239906 5652029 4482262 3688607 3159461 2798947 2544195
9281 2544195 2378135 2267096 2191334 2127654 2073181 2028942 1976679 1902613 1816359 1729579 1668540
9270 1668540 1632935 1616542 1620301 1660804 1738100 1838394 1960515 2062996 2055803 1915464 1733160
9259 1733160 1590059 1489136 1415933 1362255 1317820 1289565 1280091 1277550 1269852 1259560 1260734 1268151
9247 1268151 1277455 1281975 1277952 1270100 1276444 1270558 1266762 1271462 1286274 1299901 1317731 1326452 1310393
9234 1310393 1290776 1281479 1273666 1257114 1236085 1210604 1180658 1146740 1116737 1086219 1061431 1041543
9222 1041543 1026106 1027164 1042555 1065776 1091404 1120348 1151131 1180831 1211786 1236576 1236233 1246447
9210 1246447 1262026 1287327 1318395 1343915 1366669 1380531 1360244 1306428 1253384 1220476 1219064 1233981
9198 1233981 1254302 1270894 1288788 1318492 1334275 1341830 1349127 1361627 1376288 1394834 1413946 1431260
9186 1431260 1457623 1487214 1483695 1467616 1461699 1462422 1463843 1458228 1445692 1422182 1396020 1369311 1346071
9173 1346071 1324488 1310975 1301524 1294547 1311223 1350126 1402675 1469663 1551496 1655591 1780284
9162 1780284 1911026 2018340 2067603 2052114 1994900 1947798 1913057 1905085 1907261 1906356 1914712 1934494
9150 1934494 1978397 2046925 2138874 2263623 2420416 2626354 2891536 3208037 3595387 4050288
9140 4050288 4585854 5249369 6135828 7336678 8923937 10906053 13225252 15711928 18044956
9131 18044956 19652076 19917948 19063192 17819821 16428371 14861217 13389984 12360517
9123 12360517 11802987 11597071 11696702 11826054 11527842 10886086 10290180 9978749 9963092 10160382
9113 10160382 10430175 10616977 10798990 11155526 11657311 12219283 12962592 14100711 15753151
9104 15753151 17907926 20380580 22753073 24592323 25695307 26084795 25922812 25434935 24804180
9095 24804180 23987635 22985455 22127020 21702777 21669018 21738065 21723133 21500770 20883431 20023832
9085 20023832 19414412 19286888 19443732 19581783 19494108 19110514 18731320 18685139 19000428 19732171
9075 19732171 21013603 22703871 24542594 26601223 29089614 31753963 33631714 33740904
9067 33740904 32180884 29996018 28089994 26899034 26494137 26656459 26940404 26755307 25937106
9058 25937106 25117235 24804568 24836970 24720316 24121485 23020250 21850974 21244820 21469443
9049 21469443 22394202 24005860 26346249 28915744 30938494 32311588 33149962 33077805 31844677
9040 31844677 29748870 27444253 25747836 25171714 25755402 27331699 29587572 32025120
9032 32025120 33853176 34145485 32838403 30701324 28333085 26116590 24385183 23185417
9024 23185417 22451334 22218222 22416697 22577647 22043353 20671337 18985334 17555011 16701242
9015 16701242 16505660 16922893 17905349 19438791 21639206 24579089 28102546 31689498 34612015
9006 34612015 36281043 36688727 36418058 35849362 35046481 34052742 33071220 32302589 31487418
8997 31487418 30169826 28293313 26490022 25276603 24205589 22440431 20095537 17943297
8989 17943297 16344801 15340367 14987762 15288237 16082373 17034955 17617691 17715359 17655005
8980 17655005 17615536 17770830 18422823 19645239 21403143 23798066 27007024 31012399 35365929
8971 35365929 39576796 43000545 43943839 41444215 36951615 32019158 27452819 23697281
8963 23697281 20798323 18692805 17323293 16517900 16071842 15970823 15984990 15725885 15305792
8954 15305792 14852040 14264542 13703362 13375681 13288933 13490603 14009447 14623412 15064643 15465875
8944 15465875 16044251 16460320 16440841 16441710 16761823 17409813 18345877 19428242 20237076 20230681
8934 20230681 19570039 18750140 17930173 17214302 16714845 16372279 16035767 15580105 14757968
8925 14757968 13384076 11724687 10307320 9405902 8962704 8657380 8130588 7411518 6805466
8916 6805466 6379182 6037237 5833787 5875452 6158545 6648836 7355796 8039306 8228294 7955774
8906 7955774 7493026 6771038 5951368 5426062 5334592 5645291 6279572 7201792 8422741 9795150
8896 9795150 10636750 10529105 9945439 9089061 7703210 5973276 4420112 3335191 2635364
8887 2635364 2161912 1807028 1544953 1351605 1213792 1103627 1011138 926780 857052 794859
8877 794859 741442 698522 664153 636340 599761 560791 529970 501478 471138 446847 433052 413058
8865 413058 392786 374769 366674 360616 354555 340300 333323 325602 318626 318577 320269 321106 327859 331844
8851 331844 340731 352261 362114 366421 352111 331626 308079 285563 271816 259730 248709 238119
8839 238119 234577 230107 236281 239108 235678 232690 238247 250620 258978 270808 292042 310254 329154
8826 329154 341908 334845 312633 286678 262787 243666 237186 241021 231141 222683 215900 218837 220394
8813 220394 219781 217278 218943 222737 220685 219772 220404 223648 225039 225317 225934 226478 229670 225117 224052 228202
8797 228202 238755 245746 248237 255017 266253 275929 282375 278722 264414 241220 227516 213685 198880
8784 198880 187984 180400 174847 165909 161950 164357 163720 158839 151433 159719 168821 175640 175274 177644 180963
8769 180963 185391 182975 187368 189294 188906 190150 186357 178446 182664 186706 191969 199110 205534 209250 203354
8754 203354 203311 203253 205966 215646 229614 240319 232158 210217 187742 175760 163399 151020 148000 143373
8740 143373 145401 152288 155809 165360 170267 175482 183927 195799 200340 189854 178002 168626 165716 161432
8726 161432 154718 144888 139491 141837 135999 137342 137166 133638 124080 119213 116250 122847 127660 131321 141751
8711 141751 152728 152872 156978 153299 158145 164124 173305 185912 194987 203480 204897 203086 201772 193910
8697 193910 190242 182603 180743 183542 181270 175538 170188 167131 157976 159087 160741 158375 157825 161060 159673
8682 159673 152507 145978 136920 132263 133469 144612 143870 145613 159881 172533 185821 204563 221833
8669 221833 223223 216888 199637 188870 183390 184394 183214 179931 178363 188967 199145 201622 191080
8656 191080 165767 148574 138463 133776 128255 120357 121363 125352 128345 131492 135497 145051 149266 147261
8642 147261 149846 159439 157323 164433 177118 188004 192825 192422 188451 185783 181267 183023 180424 171339
8628 171339 166834 163179 149267 143192 141743 144753 141980 134700 120270 112726 116487 115629 113968 108198
8614 108198 102163 104624 106229 107671 110208 115926 126765 142787 149488 155809 168393 186381 196543
8601 196543 200642 207077 208170 223643 223855 222248 210520 198036 181075 167057 149148 136497 128833
8588 128833 123840 109911 105960 103181 100910 97958 92535 79871 81719 95923 107278 113197 112191
8575 112191 106269 106321 105656 112712 122111 128384 147782 173198 187095 206600 223379 252621 269582
8562 269582 261156 229491 187120 161410 140934 121861 119264 114785 107938 103344 103566 98902 100781
8549 100781 93485 85460 81505 78809 71340 73016 75257 78404 82541 82787 86475 94502 103157 115345
8535 115345 109970 104781 109690 119836 119511 122141 129650 131336 121905 120434 118824 115755 102630 92402
8521 92402 85657 77617 62128 53120 52431 43412 36933 38224 39000 40739 43960 40434 37856 40048 48091
8506 48091 51280 50050 51608 57433 54284 56181 58602 60283 53077 51550 49471 44968 43374 50252 52659
8491 52659 59215 69333 75895 72114 65689 57372 46160 33443 22451 21994 23039 25428 22707 17577
8477 17577 12119 10752 12306 12861 8362 9427 9061 13092 12030 16600 15371 11012 8195 9575 5132
8462 5132 -4412 -7955 -8259 -6328 -5337 5097 7355 8195 12873 14572 12632 3550 4259 1814 7012 12273
8446 12273 12550 19017 16060 11661 6802 11158 9263 4381 8590 10989 8924 10913 7668 3125 -3909
8431 -3909 -4353 -1608 2478 5528 7871 15908 21980 13102 10684 10206 4763 378 7341 7601 6410 -918
8415 -918 206 2424 184 -6807 -10616 -12207 -10075 -2867 -5716 -3744 -5708 -1268 -756 -56 993 2445
8399 2445 1415 -1431 -3873 66 3841 6466 5519 11903 10304 18262 18972 7283 4653 7440 5430
8384 5430 -813 3612 1100 -177 -10623 -13804 -8763 -8489 -1032 3796 2584 -1906 -3839 -4037 -2086
8369 -2086 3997 903 1821 2425 -5120 623 4089 -1695 -9033 -9269 -7855 -2999 -7199 -9542 -11143 -12977
8353 -12977 -9488 -6678 -6861 767 4706 6421 10539 5529 -3579 -3056 6051 3661 820 -3 52 -5123
8337 -5123 -4895 -5416 -2446 -5598 -10051 -9121 -6442 1452 1093 1368 689 5889 7733 -2356 -6491 3481
8321 3481 4593 1157 -1932 -7438 -604 -459 2118 -6656 -2870 6935 2182 -3668 -3457 -4598 -2343
8306 -2343 -1865 -1774 -4528 -158 4368 -126 -5381 -4652 -8162 -14155 -18068 -13972 -9269 -3774 -3118 -6780
8290 -6780 -8153 -8811 -3584 -4000 -9210 -7433 -10179 -14783 -9732 -13216 -10096 -10229 -10999 -2740 3660 2383
8274 2383 -942 -5578 -4490 2194 3142 -3675 -7960 -2510 -9588 -15822 -14087 -14297 -8475 -8767 -8591 -2035
8258 -2035 4182 1096 506 -503 -3862 -2124 -1164 -4394 -5363 -7832 -66 6310 3780 -912 -5610 -3826
8242 -3826 -5968 -9433 -2196 1987 2778 2546 -1119 -804 5962 -1086 -3047 -6337 -6710 -4231 2089 309
8226 309 -2263 -5964 -10748 -12970 -7752 -6516 -5159 1986 6030 -806 -3295 -5155 -5780 -16380 -17071
8211 -17071 -6466 -4163 -2975 -1976 -1960 -9430 -14972 -15951 -13605 -11661 -5242 137 -50 -1399 -5151 -6323
8195 -6323 -3695 381 -11 -1304 -5919 -6061 -5099 -7591 -13930 -8701 -7544 -14958 -16010 -6970 418 2642
8179 2642 -676 435 -6049 -7975 -13369 -16981 -8281 -7308 -6100 -7881 -16087 -12787 -9273 -13102 -13426
8164 -13426 -12653 -14384 -13311 -7775 -9176 -6419 -2077 900 742 -5273 -6593 566 2735 -4987 -9909
8149 -9909 -9165 -2726 -6183 -7667 -8523 -6746 -3051 -4479 -12082 -13876 -13321 -11149 -11256 -11718 -11045 -5534
8133 -5534 -5205 -5738 -2901 -289 3034 7344 4453 -4330 -8898 -8814 -12427 -4761 -1514 6271 1220 -1295
8117 -1295 -4914 -5790 5419 8705 10197 4353 -2524 2181 2114 322 2290 3036 -2412 -4380 -9343 -15824
8101 -15824 -14534 -8855 -6406 -8234 -659 6037 6768 5726 5925 2247 -6777 -4622 205 -1466 -3474
8086 -3474 -595 -9 2952 -2682 -3713 -423 3282 4158 1878 4755 9628 6000 4408 435 3850
8071 3850 10715 2155 -9001 -14373 -12863 -6976 -5949 -3180 -5533 -6092 -4747 1239 -2324 -4981 736
8056 736 1534 5060 7045 7456 3986 3708 3075 1488 1277 335 -403 -1421 -5622 -10222 -15253 -18362 -16468
8039 -16468 -7556 1523 2950 5420 5340 -722 -11003 -8043 -1837 872 -2058 -5100 -2435 1315 -185
8024 -185 1815 955 -2806 -4481 -12098 -12767 -6897 -9486 -7925 -6873 -295 5143 1995 3174 7387 4105
8008 4105 770 -548 -3608 -4914 -3875 -441 2501 5676 8699 1298 -5007 -9972 -16030 -8944 -3908
7993 -3908 399 7846 15113 9122 1287 3843 2838 -5409 -6690 -6088 754 3155 65 2137 6765
7978 6765 4410 541 2162 1627 3188 -782 -1070 -2008 -552 -335 -4973 -2972 -422 1656 6731 8077
7962 8077 10790 2300 -1264 -9095 -7899 -5940 -5619 -1918 877 232 1078 2374 6739 7926 2888 -2675
7946 -2675 -11470 -12493 -12781 -14096 -8606 -2782 -100 1488 5262 -888 -3164 -5585 -66 6844 12788
7931 12788 9570 2607 -397 120 3213 2270 1749 3420 4894 -2310 -2779 3983 3447 3834 3694 5502
7915 5502 4611 3981 504 195 2667 9590 11228 11249 14770 19901 13408 6098 3570 7638 12132 9329
7899 9329 227 -3083 -2116 1365 6400 9481 10216 7179 2330 4805 1823 5119 15242 10076 14074
7884 14074 18204 16826 18913 17231 18261 7876 557 -521 6601 5133 4771 -1997 -6053 1665 8779
7869 8779 11425 9567 8737 9570 14454 14693 15296 12589 4430 3310 5812 4065 539 664 3924 8972
7853 8972 11784 10020 7322 5497 3569 -7109 -6348 -5011 -9184 -7062 -2399 1776 774 -1197 -4660
7838 -4660 -1015 -479 -503 1627 -978 -6077 -3056 -7146 -7412 379 4429 6208 6160 -6209 -8316 -6687
7822 -6687 -6082 -6184 -2837 4595 -3072 -2616 -641 5697 6864 3730 -2193 -436 -2587 3102 5808 -873
7806 -873 -5785 -757 1458 -2224 -4237 -6843 -6954 571 3113 -2611 -3827 1388 11559 11817 6461
7791 6461 -109 2066 -1212 -2097 -6564 -11985 -11114 -5410 -5687 -4192 170 292 -8845 -14935 -8287 -2322
7775 -2322 -4323 -3737 -10463 -15983 -16522 -14765 -12026 -15536 -10768 -7095 -10786 -13252 -7404 -2540 -4006
7760 -4006 -5583 -2350 -1775 -3009 -3707 -3282 -4079 -3828 -7860 -10210 -7967 -8051 -9586 -3452 -3915 -12004 -12379
7743 -12379 -4589 -3626 -3869 -2741 452 -1793 -5228 -10298 -11581 -15982 -15575 -15851 -13274 -5439 -2295 -6654
7727 -6654 -9139 -11062 -2896 4110 4174 -259 -10728 -12058 -8814 -8838 -14319 -17365 -21260 -23334 -19013 -6637
7711 -6637 -6153 -4025 -3349 -5590 -7399 -3897 -197 274 -2871 -7715 -9491 -6649 -4056 -4240 -9531 -12012
7695 -12012 -10094 -6053 -7164 -7830 -4297 -2489 -9790 -18115 -17856 -12504 -7891 -3323 -11732 -26113 -30687
7680 -30687 -35579 -22211 -15902 -10261 -11118 -13772 -5071 3950 1339 -3982 -4040 -4932 -10565 -11534 -10477 -8073
7664 -8073 -10245 -14615 -11632 -10450 -8816 -7296 -17022 -13990 -10544 -9233 -11896 -8913 -8214 -12065 -11281
7649 -11281 -3681 1216 4324 1420 -4742 -1363 -2111 -6422 -12070 -9428 -5630 -1597 -710 -7298 -11462
7634 -11462 -12891 -9205 -2440 -4915 -7024 -6427 -6151 -5770 -6287 -11922 -16700 -18277 -13411 -8550 -3890 -924
7618 -924 -3077 -6642 -5526 -9569 -7057 -272 4605 1952 -3849 1007 -6441 -13859 -13730 -13922 -14201 -15542
7602 -15542 -14564 -8545 -1384 7984 4349 -1684 -12552 -12931 -10980 -8801 -5632 -15177 -22093 -17485 -9568
7587 -9568 -7683 -5503 -661 -9231 -11727 -5267 -4529 -8926 -11148 -2242 2627 -4718 -17778 -14267 -6706
7572 -6706 -4722 -9034 -15245 -22268 -15959 -10534 -11977 -13711 -5708 -3980 334 -3149 -4993 -689 -4280
7557 -4280 -9445 -5638 -1631 -3214 -3553 -3740 -5661 -9815 -12201 -11186 -7354 -2012 -4276 -3979 -4136 -2567
7541 -2567 -9422 -20558 -15805 -9205 -3656 -3135 -5997 -4796 2282 1552 -5529 -6378 -3487 -3130 -1767 -3674
7525 -3674 -9856 -10579 472 3431 -3261 -7711 49 -2075 -3519 -2746 868 849 3339 2831 39 -2636
7509 -2636 -7989 -13234 -11105 -12870 -12669 -13229 -10909 -6855 -9133 -5321 -3230 -6072 -3264 -6859 -11996
7494 -11996 -17656 -21595 -16642 -12260 -6487 -7455 -12116 -13786 -11036 -8648 -7960 -3365 -259 10612 12640
7479 12640 4317 1560 1337 2566 1036 -3340 -171 -795 -5439 -7581 518 -1418 -16688 -18657 -9464
7464 -9464 -4831 -4318 -8628 -10972 -5017 -4177 -9884 -10360 -11080 -11223 -13782 -12083 -12071 -5953 -2889 2923 4836
7447 4836 3399 -702 -3705 -7705 -2556 4472 -2331 -5328 -5498 2874 3601 -1765 1489 8559 11034
7432 11034 6167 2168 5550 8976 733 -10602 -18036 -14792 -12363 -10971 -6789 -7018 -13133 -6970 -1089
7417 -1089 -1321 -5104 1530 3965 2497 336 -1983 -2990 -4586 -5758 -2983 -2774 -3525 -970 -4412 271
7401 271 5877 3846 390 -4567 -8392 -9404 -10715 -11017 -10498 -7389 -7221 -6627 -3875 -5738 -7743 -5223
7385 -5223 -3745 -9223 -11965 -9638 -9569 -7142 -9248 -7157 -4294 -683 3840 -5377 -3159 3737 109
7370 109 -2089 -8288 -2614 -142 -3923 -7162 -1838 507 4169 4404 -432 -988 -5271 1010 8260 3754
7354 3754 -4485 -3104 22 -1530 -2892 -1463 -1766 709 2037 -29 -4327 1448 6453 7588 440
7339 440 -6452 -2082 -1828 -7113 -6920 -5600 -9028 -8482 -6627 -2311 -3276 -3564 -2257 824 3813 3243 -2525
7322 -2525 -6993 -4278 4571 11222 11977 -224 -5750 -1194 0 -2274 -4155 -8047 -11684 -4509 -2492
7307 -2492 -722 2897 3435 4892 634 -6578 -8576 -1053 605 10 1686 -881 -6670 -3692 3718
7292 3718 4344 2007 3285 4676 2767 -2947 -2044 5007 11617 9925 1003 6467 5769 5662 -1417 -4942
7276 -4942 -5913 -9146 -14261 -11594 -6065 -5959 -8174 -11281 -18058 -17689 -13751 -12291 -13638 -12655 -2529 5584
7260 5584 2685 -2820 -1433 -6137 -14911 -13441 -5580 -1543 573 -875 42 -3138 -5894 -4690 -6104
7245 -6104 -8345 -14493 -9690 -8811 -11149 -5778 -6201 -8899 -6893 -3481 2342 -1081 -2475 -2384 -5627 -4001
7229 -4001 -410 -5050 -5654 -2208 4060 -727 503 3730 3215 297 -2578 -2305 475 600 -6510 -14544
7213 -14544 -9831 -2935 -2051 -5234 -8671 -4548 98 -1271 -7178 -11384 -7950 -8132 -8298 -1435 -3019
7198 -3019 -1950 502 8 693 5132 1640 4481 4217 1882 -5406 -7582 -7613 -6310 1899 409 -10172
7182 -10172 -9425 -9443 -8720 -5571 -6802 -12494 -6369 -8737 -13704 -17190 -14489 -6935 3595 5690 6390 382
7166 382 820 686 -3103 -7307 -3632 -2808 -2340 660 -1637 -1261 517 -3139 -3734 3116 128 -1521 -9363
7149 -9363 -13684 -6765 -1626 -443 -1017 -971 -1942 -991 6180 3382 -1331 -4773 -5959 -2848 3701 3824
7133 3824 1979 1312 1079 6300 8977 7928 1874 3961 5831 5876 6389 177 -4188 -6393 -1844 2086
7117 2086 1674 -3383 -6312 -1017 7634 3238 -890 -3886 -2527 -6535 -4804 -6665 -13512 -10279 -6348
7102 -6348 -2428 3936 2384 -5892 -10136 -2892 -193 -4311 -11199 -9651 -5985 3586 9029 6137 380
7087 380 -7311 -9709 -8150 -2919 -2015 -13666 -12560 -5872 -5289 -7062 -6906 -6375 -8298 -7107 -8037 -2308
7071 -2308 -46 -6388 -3052 1768 1307 2428 315 -1250 -6439 -8443 -7206 -1508 -511 -3905 -5300
7056 -5300 -4246 -164 2474 -1172 -4855 -2258 -3331 -1954 2319 8794 14878 19355 17361 3217 -2526
7041 -2526 5002 4716 -517 -3998 -9199 -4028 860 1376 5014 8730 -1239 -5977 -3657 -1832 -2372 -5716
7025 -5716 -6314 -819 -2714 -3582 -4929 -901 2114 4351 5093 1178 -8890 -8855 -4667 1921 4808 6090
7009 6090 -943 -3847 -1004 -1185 3542 -580 -8607 -15701 -6682 -6703 -9308 -14780 -17800 -13206 -13404 -10483
6993 -10483 -10478 -5185 1086 -391 1241 783 -6412 -12665 -10347 -16610 -17035 -8475 -5526 -2612 -5153 -6059
6977 -6059 -4175 -6945 -14812 -12780 -3079 -70 1186 683 -4304 -1933 -386 -558 -1509 -6677 -10624 -6389
6961 -6389 -7532 -7298 -8121 -12720 -6227 -1211 199 -12716 -16572 -16252 -14094 -7827 -5240 -10612 -10515 -4015
6945 -4015 5704 6755 2089 -3561 -7152 -4489 -5048 -4094 -3432 -784 2009 -107 -6268 -9555 -8783 -6136
6929 -6136 -11837 -10887 -6926 -8451 -5098 -3406 2773 12966 6603 5743 4897 -1036 -8670 -14014 -7597
6914 -7597 -576 -5749 -6287 -8425 -11396 -10916 -17112 -12318 -7582 -3269 6945 5137 5934 7007 5085
6899 5085 6951 7171 5096 -4287 -9850 -5353 -4702 -7872 -10423 -12533 -6484 -950 1141 4351 4283 -5475
6883 -5475 -6344 -7742 -12651 -11007 -4547 -7779 -9263 784 4027 -2462 -3761 -1126 1135 4394 5602
6868 5602 3591 1786 895 -3414 235 -2787 -7403 -15864 -18713 -19290 -22000 -18421 -18967 -19102 -14217 -6538
6852 -6538 3400 5073 5046 6524 -1347 -2148 2245 15 -6102 -11855 -13349 -11070 -6556 4132 5975
6837 5975 2532 2114 2551 -1835 -6439 -7959 -7716 -4779 -4112 -3180 -2316 -2431 -1394 736 4768 4636 948
6820 948 -6371 -3681 -8526 -12228 -15987 -16666 -21056 -18735 -13549 -14942 -20824 -20779 -13257 -11512 -1226 5363
6804 5363 6304 2366 -1059 -1653 -1063 1964 -2161 -7923 -15917 -14111 -11141 -6929 -7099 -6693 -7019 -9107
6788 -9107 -8342 -3287 1972 3995 589 1186 1152 -2212 -3952 -3500 -2904 -3077 -2039 -462 1023 11797
6772 11797 12984 10496 6109 1508 514 -2785 -493 2305 5527 2998 7299 14294 11444 3268 4068
6757 4068 9284 9570 1434 -2944 -5801 -4600 -8023 -5432 -9112 -11286 -1091 6761 3382 -2946 -3600
6742 -3600 2432 5715 6597 7120 6096 -639 -3309 -9199 -9574 -3858 -6764 -15101 -18429 -12563 -4743 -4448
6726 -4448 -5952 992 6942 6998 2386 -1553 359 2725 1007 603 3536 -265 -213 -4221 -721 1727
6710 1727 3577 -3031 -3993 457 3667 794 5815 12026 11549 17552 20104 17255 16117 12959 11366
6695 11366 10936 10505 7907 7375 10943 12366 16530 22091 19205 21323 22537 30409 42608 55061 74389
6680 74389 94508 110876 122066 116694 90393 56539 27783 10274 6674 9395 8636 9888 10823
6667 10823 14595 7759 2380 2884 4324 12652 18029 17683 10251 2341 414 523 1505 -3151 -3784 7488
6651 7488 11728 5250 -1425 -4364 -5260 2723 9966 3944 -1222 -5913 -3171 2765 3153 8142 4707
6636 4707 -1898 -4965 -2276 1392 -2465 -5020 -4437 -7428 -7365 -4495 1608 3288 3360 -3482 -8068 -6284
6620 -6284 -5207 -1534 -2365 -9043 -8614 -5226 -5839 -4234 -5058 -2063 -3593 -6526 -5770 -745 -1172 3573
6604 3573 9723 7366 3235 4225 7055 6580 6204 9590 5916 159 1449 4385 3643 1854 1587 7308
6588 7308 9386 11891 4922 -2381 -1594 -2372 -450 -1431 -2858 -1380 -4070 1873 1053 -2305 -4737 -3531
6572 -3531 -527 -4000 -9101 -7504 -4139 -7762 -8111 -1559 3084 -1383 -6257 -6210 -4200 -7173 -1816 2083
6556 2083 -95 400 -4467 -7627 -3096 1240 3350 5467 8517 10093 3650 -103 944 2489 9076
6541 9076 13009 1560 -5281 -11598 -7661 -6184 -5126 -5639 -5434 184 -603 -505 -6147 -4759 -4371 -1410
6525 -1410 -3496 -154 7830 9919 8164 6515 2737 6097 3564 7424 8211 1782 2835 2030 -4423
6510 -4423 -2330 707 -858 -106 3104 2558 3847 5523 4327 7950 11323 11816 8778 1744 -8897
6495 -8897 -12881 -7932 -6073 -3260 723 4295 869 699 8468 14525 12487 2051 -121 1035 4651
6480 4651 3771 8608 7959 -1373 -4251 -8226 -3240 -5445 -7710 -543 729 -4350 -1439 -4705 -9449
6465 -9449 -14163 -11375 -6818 -7656 -8932 -10553 -10159 -6375 -260 -846 -4936 -822 -763 -2268 2212 7163
6449 7163 5612 -1649 -564 -2953 -5081 -6888 -1623 -117 -553 2178 -7049 -5881 -11255 -12242 -5669
6434 -5669 -1624 -8045 -11519 -8891 -10289 -12762 -14894 -17538 -11653 1118 -5572 -14272 -9502 -1330 4458
6419 4458 9222 6897 7725 7573 4592 1810 -4012 -1841 151 2870 255 1213 3385 3409 1684 1499
6403 1499 -2444 3492 10386 4218 -537 -172 4643 9613 6246 -2742 -9130 -8787 -4788 -10211 -5358
6388 -5358 14619 15540 10528 13331 425 -11141 -11071 -6544 -9259 -9724 -5315 -11140 -12496 -8627 -10458
6373 -10458 -4661 650 -4062 787 8281 4564 7331 6726 2360 -6738 -7899 -6688 -5352 -12636 -7890
6358 -7890 -3332 -4838 -4914 -1520 -6202 -11566 -7419 -1665 -3951 -352 -763 3174 4251 414 -2694 -4466
6342 -4466 -2604 4394 3141 -1779 -4509 -1857 884 -3180 -2780 -1342 -919 126 -3613 -7724 -16817
6327 -16817 -20610 -18653 -13783 -9043 -13703 -15163 -17617 -15728 -8610 -550 1196 -6022 -8023 -5211 -3541
6312 -3541 -6773 -7229 -9920 -10827 -7035 -5575 -1371 2729 945 -2256 -363 3001 -173 -3242 30
6297 30 1094 -410 -3286 -8635 -8189 508 4629 6166 2930 3487 3802 -656 -904 -6502 -5237 -3816
6281 -3816 -11000 -10940 -5482 -61 3201 4560 -559 -3768 1750 7682 -950 2203 8153 825 -4978
6266 -4978 -1004 236 -6084 -10962 -11331 -12848 -9472 -11238 -5605 -1745 -6497 -3038 -1803 -3097 1766
6251 1766 -2642 -10609 -12736 -9974 -2166 7786 2727 -1613 -9532 -1805 7105 12133 12039 11280 9266 10782
6235 10782 4485 -936 -948 -107 4670 7524 4881 3312 6646 -3969 -7121 -4994 -5090 -5506 -2879 -92
6219 -92 -461 471 -1582 -4317 -6783 -15900 -16784 -13612 -17899 -19947 -14150 -15743 -17719 -12832 -5666 -7344
6203 -7344 -10402 -4582 5049 5745 3581 2581 1940 4026 3557 3598 3919 4962 1722 1348 10355 4720 -5028
6186 -5028 -1609 -5473 -7320 -2287 4693 2240 1490 5735 11845 8381 2781 1972 2873 1362 2980 -1067
6170 -1067 -5573 -4248 -6339 -5454 -3911 2137 1455 1511 1830 -5543 -6652 -8628 -8000 -1211 5476 10492
6154 10492 9255 -2423 -8673 -6773 3174 10031 10309 8448 13527 16999 1559 -8953 -7283 -5577
6140 -5577 -5391 -5335 -7001 -4186 1090 3003 -1679 1160 4695 9550 5533 2778 -746 -2260 6459 8239
6124 8239 4974 0 -476 -700 1806 919 2220 8103 5004 -6350 -7668 -6078 -3785 -1530 -1723 -762
6108 -762 2219 365 -1491 -3674 -130 1989 4229 5764 3249 -1698 -8428 -7519 -2795 479 2208
6093 2208 5082 5753 7491 4194 -7999 -5990 -5838 -4781 -8102 -6904 -2711 2805 -17 -616 -370 1675
6077 1675 7668 5024 -3598 -3585 -2426 6004 10875 8340 8058 6771 4756 1254 -921 -1548 5809 3699
6061 3699 -2838 -5797 -3019 4388 5471 4568 577 -803 1673 1705 536 1988 62 -2581 -2709 5122
6045 5122 3532 -480 -7076 -3094 2222 -1302 -4032 4613 7780 8172 -1215 -9778 -6506 -949 909
6030 909 -1124 -1497 -2819 659 9604 12173 8022 -613 -8593 -2453 -3191 -5763 -6087 2224 9983 10455
6014 10455 13269 4793 -400 -2987 -5755 -1875 2344 1365 2038 1639 2453 3176 3794 357 1012 4550
5998 4550 379 4066 9927 11793 6455 666 802 -3569 -6065 -6288 -2036 4525 0 -7197 -12029
5983 -12029 -7924 -2468 -1317 -1205 1991 2202 1993 2566 -2152 -4695 -5059 -8104 -16777 -14816 -10558 -7096
5967 -7096 48 491 4871 4056 2213 1377 968 4837 -2657 -3926 216 -3474 -7534 -5990 -4861 -3280
5951 -3280 -4460 -1180 3123 5276 3517 4307 -996 -2272 -2465 -2247 -8754 -4720 2675 9205 11623 5206
5935 5206 4207 -955 2094 5522 2427 -280 -3493 -3844 -2608 -6326 -6929 -3761 -1553 -3166 -3251 916
5919 916 975 -2138 256 -5751 -10394 -9141 -4915 634 6334 7486 11967 13355 9719 9790 5391 812
5903 812 262 1023 4056 11260 7834 2375 505 603 -661 1280 5295 6108 -3550 -3501 -2582 -1945 -1402 -22
5885 -22 -833 983 -2497 -5256 2634 8894 8655 8907 3817 1035 159 1760 264 -5149 -4192 -5753 -4743
5868 -4743 -6054 -3750 -1391 4366 13978 6744 275 -4557 -3799 -3655 -6466 -9673 -4424 -3963 -2209 2549
5852 2549 -897 -3950 -7521 -9818 -2752 4804 5443 2512 -2337 -5597 47 2958 3293 911 82 -653
5836 -653 -1501 1380 851 5630 12788 8749 2466 -244 -7432 -10635 -6079 -3624 -2289 -3777 -11182 -6843
5820 -6843 -3108 -5318 -4814 -883 -2435 -2094 2692 4375 6298 5539 2602 5320 5213 4803 6019 3967
5804 3967 -305 -1800 -3461 -2149 -2058 -4089 2142 -2470 -3534 -5557 -9282 -8927 -3243 -2711 -1339 -4009
5788 -4009 -7238 -2359 1261 4552 10848 5848 6904 7384 4663 2963 8482 14317 8826 1067 2148
5773 2148 4076 3179 1509 -2824 -3203 -4379 -4820 -4970 -3497 814 -3634 3733 5894 7787 6499 8668
5757 8668 2373 -1478 -10387 -16288 -15466 -23207 -19152 -13219 -8780 -3534 4162 6744 3518 5988 3322
5742 3322 -698 -2691 -1043 -1604 -4329 3637 4593 -2252 699 5674 7073 -933 -4240 -1564 15
5727 15 -3955 -7846 -3437 -976 3290 7923 3291 -4144 -10558 -4993 -854 2137 -481 -2464 -278
5712 -278 904 1122 -5578 -6866 -2323 1971 170 -6063 -5578 -2701 -5869 -11048 -10497 -6441 -3651 -8166
5696 -8166 -10800 -4466 -9991 -12206 -11030 -7277 -5487 -5674 4005 5786 2562 -2354 -1324 266 -1550
5681 -1550 4665 5067 3062 189 168 5470 4449 3674 -4853 -1865 1593 5533 5540 7407 9919 6736 4412
5664 4412 2705 2489 10091 13695 16247 12043 8348 4262 -544 -1137 -2195 -5266 -3114 -6723 -520
5649 -520 3925 2919 -8167 -10598 -7761 -6958 -10292 -10139 -11158 -11523 -10752 -9838 -6963 -8543 -4760 2225
5633 2225 5400 4142 -1161 3798 8020 10694 8650 -755 -8948 -10681 -3236 2151 613 -792 2043
5618 2043 -551 -787 8323 9790 4487 4127 5435 6647 7009 2259 289 1995 -3024 -743 -635 2924
5602 2924 581 -1167 2761 271 -3594 -6718 -12464 -10276 -8686 -3087 3148 1917 -113 944 -3607
5587 -3607 -2375 1073 -2910 -5754 -8762 -11745 -9441 -3631 -991 -3812 -665 -5764 -6676 99 1013
5572 1013 3870 -291 -4832 -4378 -10733 -13991 -7900 -2252 -2641 -8798 -10562 -12509 -16565 -19427 -12236
5557 -12236 -7644 -6218 -6227 -3513 -3927 -1317 1311 2205 10888 13072 9413 4404 1363 -632 5363 3105
5541 3105 -6581 -11854 -10659 -11571 -10239 -13575 -16972 -10309 -7189 -1100 2438 47 -1058 -4023 -7009
5526 -7009 -15048 -13049 -11286 -8106 -2697 -8066 -10036 -4047 -651 -1074 -10427 -2335 7625 8854 4367
5511 4367 2008 3398 -1682 -5189 -4126 -3955 -5515 -3104 -4258 -6986 -7548 -5761 7018 16234 13504
5496 13504 9427 5054 -867 1509 3014 -3003 -4718 -6297 -8692 -2004 -217 938 -1246 -2119 -3869
5481 -3869 -5109 -9770 -6922 -2560 3054 6944 3942 5294 2203 3538 10494 8065 -1306 -10744 -15568
5466 -15568 -16881 -15116 -9790 -4850 3191 1954 5613 9236 7620 -2272 -2692 -5207 -4581 -6281 -7940
5451 -7940 -9637 -5835 -675 -311 1489 9211 7955 3723 -3404 -8506 -8876 -12775 -8471 -1383 -446 -6830
5435 -6830 -9149 -4386 3299 3140 5014 -324 -3265 1095 2530 328 179 -3345 -6838 -8941 -10028
5420 -10028 -17936 -25003 -23133 -16883 -13645 -15379 -16247 -17626 -23675 -20544 -12592 -10360 -13550 -5694 -2582
5405 -2582 -8437 -12993 -13163 -9403 -2264 1515 3803 3688 2224 1618 6168 6296 3922 74 -5394 -6297
5389 -6297 -3294 -3744 -9960 -6454 -1440 -3285 -1083 -1129 -2050 -1500 7319 6261 -5947 -10236 -10000 -13375
5373 -13375 -12831 -2396 6343 3934 -2036 -6175 -10829 -3691 -4026 -1494 -558 -4774 1481 3321 5427
5358 5427 3094 -405 -6942 -7860 -6559 -6930 4178 11239 8709 5089 4250 4656 4571 1979 7961 16013
5342 16013 17739 16859 10706 7814 6319 -458 -2266 -5372 -3304 335 2794 5251 7326 2874 15
5327 15 -10 -7548 -5808 -4111 -2701 4291 1874 1476 -936 -4369 -8205 -6950 -7234 -6353 -11906 -8197 620
5310 620 -5323 -9154 -8767 -1074 4309 4676 3216 5913 3908 -3534 -12760 -14117 -13301 -6592 2108 6751
5294 6751 5406 -634 -6060 -4772 -6316 -7290 -7235 -3165 -4789 -508 -224 -3180 -7258 -5342 -3331 1999
5278 1999 6757 2505 5862 7845 6573 99 -5968 -3350 -217 4240 2704 -174 -4340 -6713 -2346
5263 -2346 5042 6214 4255 4640 2709 2000 -5090 -2737 -6164 -7937 -9376 -4676 -1586 -10366 -11281 -8270
5247 -8270 -7427 -10613 -16041 -14635 -11465 -6592 -8007 1687 8021 8957 5702 4846 4365 5343 5096 -3060
5231 -3060 -9396 -6558 -888 4491 644 -5847 -1198 2860 -5498 -1585 -3034 -1385 1911 -3089 -12149
5216 -12149 -17814 -16715 -8974 -3108 -2579 -8483 -12798 -8189 -5274 -11126 -5423 -4686 -7269 -4051 -5560
5201 -5560 743 8180 12413 2868 8251 14246 15295 9107 3741 4196 5230 6529 5037 5353 12078
5186 12078 4008 -7684 569 1553 -6059 -2873 3551 4132 4865 1358 3494 5778 4100 803 2889
5171 2889 4435 6234 10934 10842 6740 2397 -268 -3183 -2915 -1109 491 3812 1493 3781 6644 6051
5155 6051 9857 10012 6814 3625 -703 527 6131 10600 6782 7846 5670 3267 7821 8527 4768
5140 4768 -1026 -13995 -16203 -8237 108 4778 5158 15636 14398 6753 4629 698 -2811 -109 -689
5125 -689 -3679 -1183 301 -5823 -8238 -7314 -621 1752 -2994 -1896 -2325 -2777 -2014 -1665 -5598 -4949 -7008
5108 -7008 -4717 -3788 -8685 -13867 -13265 -5687 3352 6361 11018 9810 9527 10995 8278 9105 8693 9720
5092 9720 8898 6851 6492 6528 10730 7972 7040 11366 8712 11600 13420 4495 -4621 -3410 3181 228
5076 228 2411 5580 5347 3081 3619 9061 8202 3714 3021 361 2122 -3965 -2325 6304 2453 156
5060 156 4317 2716 -5415 -7518 -3261 -1519 450 -5339 -3126 4256 6299 7190 6289 8550 10888 12929
5044 12929 6411 9345 11128 12932 6269 -28 -3042 -3644 -293 2247 -541 1302 3399 5617 -5652
5029 -5652 -8898 -13886 -10601 4286 13488 12628 6290 4281 5812 5235 1578 -5102 -7198 -15725 -1963
5014 -1963 8068 6765 2303 -1681 7058 12031 11529 10689 9368 861 -678 960 -3355 -852 1208
4999 1208 388 1103 1281 1109 -1753 -2360 5115 312 -4829 3142 4845 7772 3760 4516 3547 3666 7424
4982 7424 9677 12887 4972 1483 5977 11175 10614 13327 11595 12580 11670 11898 13611 10401 5993 5847
4966 5847 2746 2148 -1525 -4863 296 1548 2500 3409 8111 9049 5796 4772 -4226 -6958 -2010 -3765
4950 -3765 -2972 3915 -587 515 1011 -5156 -2761 -5936 -9188 -8786 -8194 -9846 -8171 -10170 -10007 -5565
4934 -5565 -8296 -492 5879 4476 -4127 -6561 -12744 -12394 -11559 -10452 -6950 -3074 -2953 644 2294 -4202
4918 -4202 -3195 -2563 6766 6891 -4132 -9200 -6544 -8482 -2447 -206 6468 6081 1460 -1010 -1893 -1341
4902 -1341 3640 6771 311 -2022 6401 3714 2575 -4630 -717 10847 10062 6297 7641 4482 757
4887 757 1753 5370 1512 1536 6195 10907 5623 7672 8512 3326 6557 6127 8780 12674 14402 9644
4871 9644 8880 12241 10823 468 -6558 -9275 -10938 -13040 -11896 -10005 -12391 -4945 -1491 -4216 -2243
4856 -2243 4171 125 114 -901 -1665 -1585 -3692 -710 -5151 -5259 -3413 -6283 -3699 -1598 2081 5894
4840 5894 8940 2590 -5883 -8372 -9107 -5988 -8998 -7657 -9262 -15901 -18492 -14857 -15123 -10419 -3967
4825 -3967 -5 -3892 -3300 -4603 -1933 2518 -1537 -3904 -12068 -14262 -8412 -7872 -8020 -2494 2233 4536
4809 4536 3890 -7625 -7189 3306 10543 11987 7647 -1060 -5532 -4455 -4588 -4587 -5566 -2411 -2493 -9986 -9947
4792 -9947 -10642 -11689 -13160 -14500 -3576 -1146 399 5303 2276 4317 4488 1883 -5870 -12391 -11048
4777 -11048 -8763 -1479 1042 1663 -3500 -6655 -7708 -1473 4718 6175 2891 -1080 -1347 1783 8104
4762 8104 7990 844 -6548 -4761 -5623 -8591 -6912 -4264 1926 3539 3629 6836 6362 4526 7848 6474
4746 6474 1984 -1840 -3475 -1008 4314 7541 854 -4397 -4734 1034 -4025 -10170 -14447 -11592 -9997
4731 -9997 -9390 -4963 -4616 -6319 -7879 -2153 -1083 -3554 -4247 -9680 -12085 -7200 -1373 815 -1548 2478
4715 2478 9643 9951 8022 9711 6358 2896 1964 1869 -3029 -5911 -1115 -526 3290 7708 7298 -1510
4699 -1510 -3323 5854 10499 8074 8018 9082 3773 1651 3938 4108 4213 2422 -1915 2385 2561 4303
4683 4303 3454 -1177 -1974 5796 8309 4449 2191 5878 8706 4943 6749 14418 14861 10718 13630 7722
4667 7722 146 -3801 3466 8387 1678 176 4858 -1325 -2821 458 2389 2441 -1517 -434 -1809
4652 -1809 5018 4728 8018 6147 2215 -4022 -2881 -1087 -698 -5826 -9839 -5644 -1019 4455 898
4637 898 -5247 -2203 9766 10091 9009 6149 1327 -4895 -3981 4677 15178 9980 637 -1010 -6091
4622 -6091 -7953 -4911 -1501 411 -3612 -1432 3145 4500 -1441 -1291 -5326 -12601 -8363 1005 2258
4607 2258 -121 -4127 -5697 -2012 -10777 -17505 -11315 373 1958 -4987 -1220 3556 1015 5522 9429
4592 9429 3937 426 -3567 -6532 -4989 -311 5931 6289 4095 -2184 -6571 -4536 -10063 -7356 -217
4577 -217 6388 13654 12474 9282 4642 -2463 -5545 -1563 2443 4920 6869 4404 1889 1862 -7626 -13220
4561 -13220 -7043 -13743 -13305 -11971 -11337 -14773 -10116 -5690 -4087 -2425 2962 2684 -2483 -3038 319 2499
4545 2499 746 3839 -986 -4159 -3532 -6231 -7184 -5873 -9780 -18033 -10678 -2286 -3113 -190 -1991 3734
4529 3734 -197 -9441 -8612 -2314 -1972 -367 4903 8818 11391 10506 8434 5967 8543 8739 5462 4098
4513 4098 2491 -1391 1445 862 4926 8343 6416 3285 329 -566 315 2500 2027 15612 13665 8317
4497 8317 5538 2270 4901 967 -2210 -6617 -3352 -4338 -1404 536 -3269 -13950 -22213 -18559 -10020
4482 -10020 -4447 -3229 -2540 906 507 5940 7070 9571 7139 4312 -778 -2221 -88 -5618 -2684
4467 -2684 188 -1839 5621 2564 376 261 -4997 -7392 -1249 6507 4159 -1493 -3324 -4861 -8081
4452 -8081 -6646 -6993 -4995 -2002 1790 -1595 -11875 -17006 -14505 -5429 350 -211 2385 5967 1273
4437 1273 3648 11703 14326 8883 6394 -485 -1329 -3357 -1590 -543 -773 -4394 -2931 -7307 -4717
4422 -4717 -3186 433 -2897 5140 11316 5928 1172 982 224 -3248 1271 1855 354 -1070 3111 -107
4406 -107 1548 2655 -2013 -2412 -3099 -6457 -2718 5055 7309 10105 6859 4918 738 185 -3860 -4244
4390 -4244 -3753 -7600 -7816 -1487 -1718 -7908 -7923 1307 12322 8501 6541 -4169 -12504 -16388 -12519 -7175
4374 -7175 -6491 -5780 1457 5509 7635 5069 5639 8062 7142 6791 -1768 831 -519 -5122 -4292 2116
4358 2116 1242 -3269 -6916 -6535 -5704 -382 628 -508 412 3632 691 -2823 -8868 -3152 11228 9878
4342 9878 8986 12733 4318 2044 1036 128 3252 -1616 -598 985 -1885 -2279 201 -7390 -8130 -6337
4326 -6337 -4968 -1722 5573 12589 9697 5840 808 -5050 -5167 -3210 -1385 -1434 -1649 61 -3373 -7162
4310 -7162 -5271 -6356 -6131 160 1060 -1452 3952 6823 1765 1049 2112 -2731 -7999 -8436 -7507 -2957
4294 -2957 4955 5859 4245 -3301 -8426 -6720 -3161 -3906 -5066 2730 1696 -2997 -8691 -9808 -7589
4279 -7589 -1001 2038 -448 -3143 -5815 -4999 -6107 248 -1529 -2001 -510 1983 4321 -479 -5927
4264 -5927 1561 2512 2365 -1361 -5549 -6890 -2620 5338 237 2189 1307 -2259 -5210 -4329 -1911 1760
4248 1760 1713 -3172 -4629 -993 -5070 -7264 -2020 523 7268 4788 667 2105 3439 1453 -561
4233 -561 3869 6883 -1775 -2675 -3248 -5702 -1944 137 -2909 -311 554 -1316 -9264 -7228 1499 8688
4217 8688 3068 3935 9417 12509 8412 3325 1178 6617 6213 3268 -2264 -4053 3533 2779 2925 3613
4201 3613 348 3134 4121 2486 2552 9355 13399 6077 1943 3538 -1107 -8209 -3774 2914 5611 350
4185 350 -7006 -5690 -5012 -2753 4751 1617 467 5740 6538 3050 -3670 -3218 -6796 -9497 -3883 3389
4169 3389 -2358 -7522 -5832 -3883 3623 4669 3061 1225 -545 -515 -2899 1579 9759 12805 16623
4154 16623 18856 15148 9669 1274 -2617 -2141 -4515 -4670 -3673 -4238 -7048 -8463 -8248 -1465 2901 1637
4138 1637 -439 1670 4220 395 -975 1836 1972 5638 5767 843 -3296 -4578 4917 303 -7264
4123 -7264 -8094 312 1643 -1506 384 -3032 -5741 959 983 150 -1996 -5345 -15275 -18303 -8673 -6088
4107 -6088 -4392 -3372 -4732 -6943 -9173 -9340 -7047 -11353 -8009 6587 10138 6361 648 3387 5940
4092 5940 7345 -314 -11775 -6842 -3407 3522 5968 7319 6309 1850 -6996 -10726 -7577 -5146 -1805
4077 -1805 2100 4304 6213 3886 8442 13842 9934 59 -7369 -9104 -6176 -1187 1503 -2613 -8944
4062 -8944 -7467 -4747 407 11291 9520 6976 1014 -7626 -11926 -7074 -3894 -2718 -1534 -5271 -866
4047 -866 -3238 -1447 1071 -2214 -415 2385 -3708 -6237 -3149 2715 3373 1771 -4361 -2485 3804
4032 3804 5751 7606 10278 12807 9225 2346 -2806 -4750 -4577 262 6446 6344 2394 823 3285
4017 3285 10025 7199 1837 -2298 -4387 -1141 2477 -5841 -12445 -9112 3662 3850 4103 6887 6638
4002 6638 -6314 -4886 -3134 -8424 -6299 -841 2238 -4923 -4169 -1213 1166 4137 4561 -966 -8102
3987 -8102 -5293 1151 11080 14177 11768 13402 13257 5336 628 -7242 -9409 -8414 -6185 -2608 4032
3972 4032 10167 7639 3236 4633 55 -267 5650 12735 8281 4545 -1103 -4897 -5302 -2999 -2933 -4751
3956 -4751 -4104 -3323 -3132 -3379 -3905 -812 -2533 -2297 -3928 -7308 -4315 -5508 -8393 -8541 -8081 -5304 891
3939 891 4471 2640 8967 12693 14904 9722 10397 6441 1293 -5557 -4477 -1194 468 -581 2509
3924 2509 -5056 -6834 -5925 618 6282 -1514 -37 4312 -1272 -5391 -5388 -7179 -9773 -12368 -12081 -9583
3908 -9583 -12388 -12006 -7902 -970 880 3074 -1590 -3321 958 -5732 -8632 -4261 950 1409 3751
3893 3751 -861 -10602 -8104 -6590 -9086 -4209 -5964 -9725 -9914 -5853 -4845 -12293 -17783 -15514 -9763
3878 -9763 -3634 2038 1960 1384 -3287 -2581 -5840 -3847 -2112 -5245 -1198 1933 9574 6316 -3132 -5704
3862 -5704 -7010 -149 6037 10782 7303 7658 2400 -1760 -2507 -416 -1344 -1055 8423 15983 15546 8490
3846 8490 3285 -1847 -5097 -4066 -354 -946 -4887 -7051 -7091 -6444 -11160 -8186 -4079 919 2277 -6630
3830 -6630 -2723 454 -242 -13941 -14799 -8967 -5385 -6202 -9449 -3275 4588 5066 1798 771 -292 -2217
3814 -2217 1586 -831 619 6128 2894 357 2204 6007 3757 3316 6288 7292 3459 -3414 1626
3799 1626 6430 7808 2030 2439 622 -1224 -7082 -741 4641 -3219 -14420 -9887 -5506 -7951 -3379
3784 -3379 -8016 -7522 -11685 -13271 -7305 -3899 -2182 595 -3355 -5191 -4018 -39 -4166 -5458 -3310
3769 -3310 5719 4181 10222 13720 6597 8212 1409 -1112 -3542 -785 2702 1886 -7050 -5539 3193
3754 3193 1358 4144 5632 1995 1295 -634 -1584 5908 2776 1477 -3247 -4728 -4669 -8092 -6689 -7847
3738 -7847 -3102 -164 -2992 -3172 71 5125 5311 5793 5321 1920 -2058 -5523 -8376 -10755 -11561 -15131
3722 -15131 -9894 -9311 -16223 -16894 -13530 -7577 -618 4616 7639 8164 5274 -280 -2529 -926 1869
3707 1869 9450 8406 4972 3946 8660 8471 7281 3633 3294 914 -1614 -3270 -11137 -6152 -5089
3692 -5089 -3645 2517 8894 6208 4626 -636 -2974 -1210 -5362 -13667 -13157 -10973 -12698 -8401 -6050
3677 -6050 -7400 -3519 -7251 -8947 -5452 -1468 -2715 -5338 1857 3892 -3296 -2378 1900 3829 5103
3662 5103 -716 -2263 2084 4028 -2060 1075 255 181 -1551 5363 -1109 -3314 785 -2406 -4793 -4706
3646 -4706 34 6315 3925 1390 3955 1499 -2126 4026 19739 23205 16186 7168 817 -704 -3954
3631 -3954 -4028 -7770 -16733 -20411 -24775 -20020 -11160 -6742 -5501 -6942 -3062 3722 -598 340 695 -1547
3615 -1547 5241 2443 4644 9502 7356 -681 1021 4547 6350 9481 7875 3921 -1430 -4767 -10254
3600 -10254 -11746 -7484 -9685 -13890 -13280 -4516 -234 -2088 -5421 -8392 -4817 1455 6008 4619 6213
3585 6213 11345 6006 1287 4723 2119 -39 2846 9343 16255 5848 3294 7397 9225 11747 6469
3570 6469 150 -586 1426 -3726 -3270 1301 -344 -3265 -2904 -10787 -8826 -9480 -10624 -7259 -624 6021
3554 6021 1903 -1196 -7228 -6162 -3157 -1537 6104 5491 100 -2179 -5514 -4416 668 -501 -5517
3539 -5517 -5084 -3978 -4946 -5258 2330 1504 -1991 -3074 -4467 -3677 -4143 -3623 -10090 -12007 -8629 -6653 -7960
3522 -7960 -7551 -2315 -3957 -5955 -436 120 -157 -485 51 -673 -722 -3772 2170 7449 6450 8072 8124 6676
3504 6676 -994 1287 6471 10918 12498 13664 10103 4922 7832 12330 13529 12624 8029 7983 12319 4319
3488 4319 -5007 -8882 -13051 -14249 -4978 -5851 -5808 -1106 -6399 -4870 -1049 -1550 5554 9437 1207 2968
3472 2968 3555 5468 8727 7898 4702 3491 -11366 -12325 -7920 -5268 1023 -242 -4918 -7374 -5226
3457 -5226 -3015 -5598 -4048 -1850 -2115 -6421 -777 -2077 1502 9194 15450 14275 2491 -418 -859
3442 -859 -1278 -2184 -361 -3827 -11226 -12813 -4487 2523 5082 1419 3467 5805 3889 490 -1426 -3667
3426 -3667 -5021 -4367 -7038 -5579 -5281 -902 -687 -1233 -1458 -1125 -4277 -4706 -4390 -8170 -6490 -6251 -4398
3409 -4398 -8840 -18203 -16421 -9458 -7300 241 6675 9012 7686 7231 5063 290 -1820 2460 4228
3394 4228 5446 5806 3353 -2495 -2205 -3217 3037 8221 11303 13985 11069 14278 16937 11842 3753
3379 3753 2113 9477 15092 10711 6734 7882 8970 5246 7584 2881 1080 1418 -395 -4805 -9724
3364 -9724 -9372 -5228 -6170 -4069 3918 12587 7112 5493 -1520 -8448 -7264 -1913 -5634 -9951 -11887
3349 -11887 -6116 -3601 -7016 -10523 1 2736 6097 3583 -377 -3653 -5704 -5024 -6838 -8221 82
3334 82 786 -2152 -2400 -310 -2124 -7947 -11152 -8461 -6471 -3327 -3354 1347 5002 10415 12573 13023 4540
3317 4540 -991 -254 114 2873 -759 -467 4287 8023 5762 6770 8660 11924 13428 11921 9257 2048
3301 2048 2390 726 3281 6771 4220 -1357 -3180 2351 1791 1215 1168 -3626 -9397 -6733 1098 3296
3285 3296 4145 -2455 -12215 -9614 -4616 -1668 2332 -1719 -364 4813 9054 7972 8633 7070 3795
3270 3795 -193 -344 -1720 585 1952 6103 -1777 -7433 -11409 -2463 -3938 -6137 -7419 -4155 -4686
3255 -4686 -6905 590 3561 4833 6642 4574 3903 6035 7490 6194 3509 4743 7537 9533 15447
3240 15447 21504 19757 10091 6416 3289 9179 6230 -1003 -6924 -2433 567 1657 6205 8089 6247
3225 6247 10192 9730 10244 8804 7681 2815 -7350 -5609 -1932 -829 8436 6799 6520 10125 7187
3210 7187 4429 1291 -2667 -4198 -3062 -4854 -7474 -4721 -2971 -1131 5528 12288 11675 10448 8107
3195 8107 3197 -2396 918 -2364 1738 -1604 -105 5925 6205 1281 3353 8018 7516 2308 3032 9594
3179 9594 8979 6410 9485 -1119 -5339 -6566 -9676 -13834 -15139 -13018 -3604 3344 2332 -2013 -1400
3164 -1400 -6261 -4878 3066 5995 -2654 -3869 -2443 -1625 -2432 -5551 -1327 1732 9306 9163 4746 1939
3148 1939 5400 4238 4614 -970 -4173 -3508 -6603 -4290 -1167 -4010 -3226 -2974 738 617 1341 2780
3132 2780 -2765 -1340 -1841 -1113 -3587 -8289 -2871 2816 10062 5598 -300 -325 -2243 3967 8289 7627
3116 7627 8445 5103 5463 6856 -778 2375 80 -4687 -2559 790 6948 15620 18283 17263 5453
3101 5453 -2598 954 6280 9894 1268 -5395 3837 3952 3927 6842 4944 2114 997 1350 -1935 -4573
3085 -4573 -6254 -1342 -1053 -3806 -11520 -13828 -12213 -15085 -13020 -4120 -3309 -10008 -8244 1980 269
3070 269 2474 2006 -940 1790 313 -8953 -10926 -11364 -9728 -9452 -2014 1897 2047 -1708 -3747 -671
3054 -671 3856 249 -1064 -2371 -7398 -13984 -16512 -14568 -5591 878 3927 6174 1131 2620 12639
3039 12639 16443 14534 15575 12139 6337 7688 5128 3877 3811 4120 -304 -4474 -7390 -7338 -4974 -1714
3023 -1714 -2317 -5845 -320 119 -5925 -7072 -5760 -6688 -9771 -8044 -3945 1673 5972 5743 -136 3119
3007 3119 2931 8081 5587 3186 3562 3631 6502 6587 3053 -832 6388 6352 3960 8538 10348 10687 1532
2990 1532 -8960 -8374 -2110 1312 1541 -3725 -4699 1062 -2760 520 3267 5348 1731 -2046 1043
2975 1043 8345 11299 6965 992 2147 5558 2954 2873 2211 -2540 -3397 660 2701 5321 5477 -1676
2959 -1676 -5424 -5630 -6167 -2974 -1109 36 -6530 -11038 -8867 -3662 -3361 943 2625 7082 10982 9925
2943 9925 6330 2639 -108 -942 -6121 -9623 -5836 1449 7047 2480 5899 11103 9590 9009 3585
2928 3585 -2183 -6008 -8370 -11912 -12901 -10093 -4877 -6042 -626 9203 5507 5147 12563 9917 2463
2913 2463 -7399 -13100 -14818 -14558 -9373 -7740 -11176 -11844 -4998 986 -669 -2413 872 7425 7858 6527
2897 6527 4165 -2032 -8196 -10668 -5268 956 4813 4150 3799 11125 16422 9360 3366 1840 3289
2882 3289 3615 -4874 -8382 -5468 -5081 -8588 -6640 -2957 -3131 -3427 -4710 -1920 5210 666 -1149 510
2866 510 6187 6204 6910 5027 -2941 -5243 -4360 -1785 695 -1952 1309 3335 5256 3754 9941 13745
2850 13745 13450 15431 16773 11863 5512 5221 1551 3593 11597 3107 -90 3705 9944 8934 8017
2835 8017 6611 -498 -6441 -3356 583 4539 2482 -4953 -5121 -8232 -5422 -5727 -5019 -2624 -2472 1124
2819 1124 571 3574 8492 11000 5726 2005 1255 -4362 -4761 -8061 -1127 4870 447 -4271 -4756 -3904
2803 -3904 -5549 -7759 -2099 3108 5618 822 -591 6367 15751 15504 9005 9506 5309 426 -2758
2788 -2758 -4577 581 -1602 -8458 -7239 -7193 -3912 -4081 -12937 -17247 -15159 -6140 -2302 -7985 -13664 -18461
2772 -18461 -17852 -9055 -5065 -1574 9073 11809 13215 9226 -1601 -5995 -7356 1746 5436 3401
2758 3401 4896 10641 4471 -3054 1496 -216 -9532 -5986 240 -15 -2245 -1788 2156 5200 5840 5392
2742 5392 3411 571 -1462 327 2554 -4107 -7339 -2078 5826 5288 1753 -5387 -4683 -7670 -6630
2727 -6630 -6752 -5198 -2929 -1615 -4889 -1073 -1565 -6583 -3801 1443 -1486 -3967 -2889 -157 549 -1421
2711 -1421 -2495 2675 1144 -576 -3255 -10011 -16699 -12119 -3695 -5749 -5523 -4528 -686 1996 -2166
2696 -2166 1162 -2845 -4663 -10545 -12669 -10320 -8825 -8377 -8271 -3277 3811 -58 -4002 -5373 -5034 -6078
2680 -6078 -6656 1113 10292 9893 2801 1853 8883 18252 20082 12155 8664 6384 10752 10297 4074 685
2664 685 -2769 1700 -1367 -2721 -1164 -1731 -5959 -9744 -4745 1840 3295 423 -2263 -1672 -1465 316
2648 316 3261 2405 1570 3452 4528 1993 3106 4170 2024 -995 1695 4031 478 -88 -2854 243
2632 243 7527 5196 5907 5126 5862 6468 3506 1171 -6488 -11178 -3363 -1209 -4829 -6514 -4529 343
2616 343 1910 -1989 -6565 -5715 4138 5823 12609 12373 18190 13763 12439 18374 17823 11202 8089 4134
2600 4134 7339 6948 738 323 2452 -3049 -8592 -14776 -14942 -6218 -6428 -6423 -2484 5517 7739 6570 3512
2583 3512 -934 3013 12508 13587 14077 14849 13104 6199 11171 10916 10335 7754 3125 12522 20897 12934
2567 12934 11055 9293 4227 1770 690 3096 7053 870 -573 1963 4113 4622 2958 4759 3375
2552 3375 6775 7807 550 -3871 -6594 -6152 -9597 -7930 -6542 -6563 -3150 -1205 -8240 -2994 7830
2537 7830 14460 15282 14124 14000 6681 -3667 -11549 -11000 -3681 -596 -12033 -11853 -5601 -9295 -8425 -6918
2521 -6918 -3953 -2632 -303 4048 10065 13627 15182 6941 3315 574 1994 4825 6810 6460 6059
2506 6059 -623 -3644 -988 118 -539 -3132 976 4486 4064 3972 5029 2960 -2170 -3380 -9688 -9182
2490 -9182 -2306 697 -190 -1557 2398 -404 -6494 812 8981 3357 293 5353 6894 4661 1664
2475 1664 1093 4671 3246 5091 -223 3019 3799 4605 1234 -3344 -585 2205 4052 4871 5319 -230
2459 -230 -3315 -3039 -3303 -4396 -7184 -2882 -87 5900 5146 7926 9059 283 1139 56 1732 -2610
2443 -2610 -7190 -9341 -8144 -5828 -2664 -2945 -538 26 -1286 -1350 107 -1418 -565 4755 7530 12254
2427 12254 12825 -6739 -12345 -1850 1308 2325 -461 4513 8519 6960 6840 8125 12228 14164 6800
2412 6800 7689 1483 1101 5400 4959 6146 -1872 -5068 -3792 -3605 -8187 -11855 -6688 -3174 112 5085
2396 5085 6909 3386 -5500 -15468 -9316 538 5318 1867 -1648 1945 8205 4245 1854 700 1553
2381 1553 5469 6409 1641 1261 3810 1844 644 4029 3150 -3743 163 1430 2917 1839 -4495 -8087
2365 -8087 -9229 -7955 -2241 503 709 -1019 1174 3935 3929 3476 4391 8186 9728 10690 7594 6365 2406
2348 2406 3220 -1142 1510 1395 -3407 -4474 -212 1679 1583 6477 5545 61 -6086 -2136 3209 1239
2332 1239 4843 7829 4056 4641 -2272 -10154 -11867 -1346 5917 4041 -1197 -562 -619 1719 903 962
2316 962 7049 12424 13328 6283 6510 1837 -5122 5475 11597 5946 -1318 -3640 -1832 654 463 -1059
2300 -1059 -352 7836 11260 11028 9288 6063 5348 10435 10784 7165 8351 6852 191 -3500 -161 112
2284 112 -6326 -6665 309 2766 4066 4295 3330 429 5457 8915 6959 461 -6114 -4327 -3682 -3365
2268 -3365 -2912 1443 3928 786 -5193 -5820 -552 -1012 -5852 -8998 -15961 -15058 -8671 -6323 -4955 1046
2252 1046 -2688 -2295 665 -4990 -12162 -10208 -8523 -5814 -4451 2100 5993 9807 8726 6946 7910
2237 7910 3212 1527 5904 9699 11877 8148 12075 4822 -1037 5840 10061 9218 12182 10516 12986
2222 12986 17838 15283 10293 6161 1957 4945 1672 -9619 -9232 -1268 415 4607 8500 12423 13909
2207 13909 15893 18427 16455 10517 3140 1816 5115 2633 -289 -167 1434 5117 7013 381 -1408
2192 -1408 -2681 751 5724 2354 -910 -2483 -1426 4914 6574 6765 6953 5803 12946 5194 -4706
2177 -4706 -2763 10646 13770 11990 12001 9477 6675 4984 9526 10336 12626 8605 6695 5167 5463 9926
2161 9926 10567 -757 -1694 2191 -5494 -10573 -18227 -10506 -1760 635 9067 8800 -21 -7743 -6080
2146 -6080 -4410 -28 2183 -399 -4871 -9368 -4983 -5785 -3879 -5713 -13671 -9512 -5281 -6298 -9968
2131 -9968 -12926 -7496 -3497 -4122 -1462 -3209 -44 2766 4823 4803 4978 5354 5735 7506 7541 12741 16665
2114 16665 5084 -3984 -2956 488 -3495 -5665 -2906 -1381 195 4234 10102 14117 7461 5814
2100 5814 4493 -2208 -4657 -2598 -2432 715 1256 1623 8295 16226 13134 6188 11300 16312 15433 13082
2084 13082 9885 3771 2331 -1872 -5067 -4269 -2304 2170 -2215 -1379 -3995 -6272 -11370 -13167 -10679
2069 -10679 -6427 -4329 1147 3891 2991 4966 6239 2514 -1178 -1570 -1672 -5610 -9172 -10742 1563
2054 1563 3820 6850 11346 7790 442 -973 5584 4847 -1751 -2319 860 -6147 -15541 -11866 -12004 -17992
2038 -17992 -12536 -8293 -4202 3568 727 -9687 -10885 -7292 -4471 1631 1166 6309 12892 11082 3922
2023 3922 1106 3275 1770 1440 1636 -490 233 1761 -3885 -694 -7 2780 7618 10015 9709 10907
2007 10907 8362 8565 6907 6017 1714 -4850 -1358 1416 2541 4941 4338 4356 2288 7693 10015 7495
1991 7495 6431 7171 10124 -326 -2580 5061 5702 -751 -7751 -3601 275 1981 1338 1313 -4757 -4580
1975 -4580 1761 -237 804 4245 7606 6779 3230 1963 527 -5857 -9313 -4701 177 -3735 -1665
1960 -1665 5608 6197 8494 8707 6973 6620 7525 3846 -1244 -5611 -9067 -12801 -12374 -5652 1433 845
1944 845 532 3802 1689 3763 -1377 -8882 -2150 -544 1997 2486 3196 4909 9883 7342 5722 7003
1928 7003 454 4713 7426 11450 5884 2213 -4959 -7977 -9693 -8228 -441 3062 -2031 -5696 -9803
1913 -9803 -8249 -8349 -6195 -3555 -3090 3673 959 -5855 -4021 -372 -821 1434 4891 4646 4715 1646
1897 1646 -670 -4714 -10488 -7597 -2881 -3081 -2666 -2102 1767 1668 -1876 -8890 -11770 -13126 -8480 -2458
1881 -2458 -1621 -411 -11 2000 1673 -9458 -4244 638 2757 1363 1000 -1990 -7007 -14962 -5100 -565
1865 -565 579 -3185 -4474 611 4209 10632 9707 8347 9622 467 -3131 -4748 -7520 -12021 -12229 -8852
1849 -8852 -6623 -1325 -1516 -5855 -2471 2902 1474 -2544 -1875 1976 9014 8921 4105 3587 1600 10363
1833 10363 19133 16505 9813 5288 2252 4708 11097 6547 -3469 -2303 2088 8186 15990 12386
1819 12386 8815 4894 -846 -678 2351 2505 7532 4301 -2370 -957 -137 -5375 -10183 -6256 1600
1804 1600 49 -2313 -9899 -13468 -11743 -9140 -2305 5227 2951 -4397 -4011 51 5316 2994 3007 13643
1788 13643 16691 15702 6404 -216 -326 -192 -6473 -968 6920 553 -4795 126 7721 8805 5675
1773 5675 7876 3525 3340 8879 12045 12310 12318 6670 4030 5870 10664 7873 3619 3463 7684 8155 8755
1756 8755 11020 7050 428 -1676 -3955 -5229 -4036 -2912 -3927 -5245 -2889 -5185 289 3732 -3006
1741 -3006 -7813 -7829 -4888 -1357 4758 5059 -162 -5097 -2483 -5813 -1634 -258 -4714 -6885 -3573 -1977
1725 -1977 610 7299 3514 1457 3553 1561 1843 -227 -963 475 1432 -2709 -1233 2606 5982 11027
1709 11027 13512 15166 8354 5427 -2008 -3321 4281 13735 17361 12050 10693 4551 1369 -2122 -5114
1694 -5114 -10171 -11621 -10011 -5215 -5663 -3899 -9088 -18658 -17430 -10828 -7282 -9483 -8584 -10979 -3739
1679 -3739 -1239 -4800 -1435 1803 -721 1092 431 6610 4277 746 623 -4343 -6435 -4417 -4985 -12014
1663 -12014 -11046 -4713 -5645 -10716 -3137 -2144 -5057 -12356 -4405 2462 304 -1056 -2211 -2405 -8311 -9235
1647 -9235 -13621 -11149 -3240 5963 5435 2167 935 3891 7 -3148 -4666 -7729 -4420 -2129 5851
1632 5851 12432 13065 1961 -6628 -8301 -2044 -6212 -7846 -3672 -6062 -2126 -275 -2548 -2035 675
1617 675 1552 2250 -981 -2325 4215 -1552 -2527 3767 4423 6341 7439 9545 7393 -2609 -12584 -11161
1601 -11161 -4479 265 -688 3667 -91 -3769 4564 8699 5844 3226 133 5558 5037 4611 8186
1586 8186 12816 16218 15973 10064 10078 6744 5060 6269 4783 5352 2177 1125 -1823 -2206 -4472 -4825
1570 -4825 -2097 -5376 -2198 4073 4648 3929 3829 -950 -2944 -402 1281 -2573 -1545 -587 2949 43
1554 43 -3242 -3851 -2074 2172 6928 1455 1527 4108 5963 2110 -3332 -1176 6605 4891 6246 9392
1538 9392 4960 -3851 -3434 -4861 -740 5944 15697 10509 2044 -2952 -2307 3895 3809 2247 -865 -5778
1522 -5778 -9849 -5883 -6629 -5341 713 -586 -3078 -6740 -7614 -4997 4296 6353 8213 7358 8110 12625
1506 12625 2726 -3766 190 5291 4880 -2373 -5319 -3344 24 -2564 -1765 1217 -1571 -534 2123
1491 2123 2431 4633 8425 9220 7152 8871 11898 8830 5388 4208 -1575 -4462 1508 8803 10781
1476 10781 4025 1723 -489 1861 -258 -1691 1216 4688 14799 14583 10569 10304 9493 6075 7528
1461 7528 10032 9173 9910 9779 4199 7434 2313 -1127 -3962 -2929 -846 3329 3223 -272 -1704 7335
1445 7335 8523 3907 5257 4112 -838 -2443 -5783 -2911 2793 -790 6252 14368 17427 11609 5311
1430 5311 -3227 319 680 -4038 -6084 -1204 127 4121 13218 11839 14957 12503 9402 9923 9322 7364
1414 7364 5937 -490 798 -6414 -8054 -6199 -7364 -5658 2395 13657 8434 6191 11131 9001 10306
1399 10306 13793 13593 6197 1820 2224 6829 -68 -1635 5318 6386 -10 -2569 2931 2843 4571 3864
1383 3864 8327 9611 12795 15062 15310 16559 17518 15494 17573 14186 12875 10058 6750 10392 9736 5247
1367 5247 4596 500 -6276 -2317 5873 8715 6213 4889 685 -5822 -15471 -15551 -10019 -1760 1851 126
1351 126 -1897 2315 3572 3402 10658 6300 -663 -4623 -8014 -6891 -4394 258 2360 1293 3220
1336 3220 -592 612 1970 -1266 208 -3677 -2259 2094 -989 6019 10414 11730 13469 10417 9170
1321 9170 5661 3139 2557 3123 4626 2391 -4356 -14949 -16364 -16969 -9587 -755 2790 3314 8285 9767
1305 9767 4158 -4146 -2631 -153 123 3328 3559 1070 -4787 -5959 865 2339 3572 -1539 -8274
1290 -8274 -7511 -9732 -10343 -14523 -14834 -11035 -8902 -7824 -7872 -6064 -7933 -1931 -464 4304 10841 13639
1274 13639 7910 3481 -3002 -3750 1744 4583 -1685 -4414 -8196 -11268 -7878 2419 -2984 -5710 -3805
1259 -3805 5685 10277 3176 -1452 2883 4482 7109 4198 -3906 -3757 336 2245 2415 3417 -403
1244 -403 -8410 -10339 -8813 -6104 -3894 -8090 -8905 -307 6472 7246 448 1833 2680 3929 7674 7541
1228 7541 3373 -3492 -1081 -479 -4200 -11989 -13813 -12281 -11743 -9271 -4491 2637 4359 3648 7897 3304
1212 3304 -924 -2500 -3342 -742 971 2585 -1369 1090 -4139 -9050 -10665 -2880 -506 -6529 -9147
1197 -9147 -6810 -6057 -9763 -12846 -9259 -1213 -7 -3532 -10062 -5120 -1059 3842 2368 -2281 3444
1182 3444 6221 914 352 -1588 -2003 4830 4940 3172 -9857 -16641 -9566 -728 8778 9319 6204 1471
1166 1471 -4027 -5686 -6248 1793 13557 5940 3375 2463 -1637 -114 433 -1004 -1056 150 642 -57
1150 -57 -8222 -8530 -260 1324 4478 7427 3707 4572 11180 6705 -2112 -914 1675 -930 -1059 -1315
1134 -1315 1259 1218 -844 -2434 -3997 -5198 -8001 -7236 -1485 -517 -2220 -4228 351 963 4190 6927
1118 6927 10086 7059 -4152 -661 6783 997 -5603 -12895 -5021 -761 -5371 -7851 -6924 -2175 681
1103 681 5009 7849 6537 11342 4112 -1234 -108 1802 9434 11616 9171 5407 341 -4016 -8395
1088 -8395 -8846 -5564 185 1220 -2521 -4280 81 389 3661 5048 4193 1530 -5131 -1492 8874
1073 8874 10644 1621 -7688 -11182 -9096 -682 -1114 -4091 -221 -1991 1307 4311 6349 6533 1820
1058 1820 5225 -2120 -10784 -11910 -3494 -834 -563 -355 -5273 -3532 3694 6090 2879 -6051 -13455
1043 -13455 -10969 -1832 2072 -3116 1714 4022 102 -2587 -1099 -5033 -14102 -15453 -4336 -1396
1029 -1396 3954 7602 6214 213 -2019 426 -9252 -15094 -12067 -6123 -6663 -14120 -18304 -12066 -2944
1014 -2944 -930 -4128 -5109 -1467 -6715 -4085 -6503 -6574 -2490 63 -3376 97 -451 -1343 -339 2918
998 2918 3372 4489 3970 6716 113 -4864 -12210 -16399 -11058 -1633 -4902 -3781 -4940 -3784 -5215 3845
982 3845 11253 9873 4294 1731 -2947 -6456 -8096 -14485 -13146 -11443 -9944 -7833 -1876 7376 11675
967 11675 12285 5403 4752 5541 3006 4694 4918 564 -561 -3038 -845 2068 4255 5642 1473 -1236
951 -1236 -5053 -9387 -6412 -5917 -8018 -3676 -232 3267 499 101 9491 9890 8843 9436 13235 13714
935 13714 9543 9960 3423 -1518 -6478 -5313 -3443 -5171 -10078 -16146 -10667 -7552 -10654 -12064 -7334
920 -7334 -5000 -479 4632 -703 -4229 -11133 -9833 -9199 -2759 2817 4176 4387 4480 -142 -1499 -5505
$$ [...]
##END NTUPLES=NMR SPECTRUM
##END=
