##TITLE=Analysis number 327706
Compound Code tl 00746
Project Code adrs
Chemist Name aci
##JCAMPDX= 6.0         $$ Bruker NMR JCAMP-DX V2.0
##DATA TYPE= NMR SPECTRUM
##DATA CLASS= NTUPLES
##ORIGIN= Bruker BioSpin GmbH
##OWNER= nmr
$$ XWIN-NMR		Version 3.5
$$ Mon Apr  2 12:37:49 2007 GMT Daylight Time (UT+1h)  MAYBRIDGE\nmr@NMR_250MHZ
##.OBSERVE FREQUENCY= 250.131544655141
##.OBSERVE NUCLEUS= ^1H
##.ACQUISITION MODE= SIMULTANEOUS (DQD)
##.ACQUISITION SCHEME= undefined
##.AVERAGES= 16
##.DIGITISER RES= 18
##SPECTROMETER/DATA SYSTEM= dpx250
##.PULSE SEQUENCE= zg30
##.SOLVENT NAME= CDCl3
##.SHIFT REFERENCE= (INTERNAL, CDCl3, 0, 16.522)
##AUDIT TRAIL= $$ (NUMBER, WHEN, WHO, WHERE, WHAT)
$$ ##TITLE= Audit trail, XWIN-NMR		Version 3.5
$$ ##JCAMPDX= 5.01
$$ ##ORIGIN= Bruker BioSpin GmbH
$$ ##OWNER= nmr
$$ C:\u/data/dgb/nmr/ADRS/160/pdata/1/auditp.txt
$$ ##AUDIT TRAIL=  $$ (NUMBER, WHEN, WHO, WHERE, WHAT)
(   1,<2007-04-02 12:37:24.07 +100>,<MAYBRIDGE\nmr>,<NMR_250MHZ>,
      <created by zg, POWCHK disabled, PULCHK disabled
       configuration hash MD5:
       49 4B E0 1D 92 C2 6B 37 9F E6 65 BC 52 41 86 1D
       data hash MD5: 64K
       6C 92 19 DE A0 04 AF EE 00 68 A3 5E A1 36 6A 79>)
(   2,<2007-04-02 12:37:38.73 +100>,<MAYBRIDGE\nmr>,<NMR_250MHZ>,
      <Start of raw data processing
       ef LB = 0.3 FT_mod = 6 PKNL = 1 SI = 32K 
       data hash MD5: 32K
       64 CD D8 08 B6 BE 20 03 30 54 F0 3E 4F 5F 68 64>)
(   3,<2007-04-02 12:37:40.62 +100>,<MAYBRIDGE\nmr>,<NMR_250MHZ>,
      <apk 
       data hash MD5: 32K
       D7 A4 45 77 33 56 D8 08 2E D5 27 6C EE 27 CF 3D>)
(   4,<2007-04-02 12:37:41.42 +100>,<MAYBRIDGE\nmr>,<NMR_250MHZ>,
      <abs ABSG = 5 
       data hash MD5: 32K
       7D 39 82 2B 9B 26 01 7F 9D 41 5F 72 2D 50 53 84>)
$$ ##END=
$$ 
$$ hash MD5
$$ E8 E2 7A 1F 8A 8D 12 BE 23 03 AB 85 F6 02 CC FF
##$RELAX= 
##$RELAX= 
##$RELAX= 
##$RELAX= 
##$RELAX= 
##$RELAX= 
##$RELAX= 
$$ Bruker specific parameters
$$ --------------------------
##$DU= <C:\u>
##$EXPNO= 160
##$NAME= <ADRS>
##$PROCNO= 1
##$TYPE= <nmr>
##$USER= <dgb>
##$AMP= (0..31)
100 100 100 100 100 100 100 100 100 100 100 100 100 100 100 100 100 100 
100 100 100 100 100 100 100 100 100 100 100 100 100 100 
##$AQSEQ= 0
##$AQ_mod= 3
##$AUNM= <au_zg>
##$AUTOPOS= <25 >
##$BF1= 250.13
##$BF2= 250.13
##$BF3= 250.13
##$BF4= 250.13
##$BF5= 500.13
##$BF6= 500.13
##$BF7= 500.13
##$BF8= 500.13
##$BYTORDA= 1
##$CFDGTYP= 0
##$CFRGTYP= 5
##$CHEMSTR= <none>
##$CNST= (0..31)
1 1 145 1 1 1 1 1 1 1 1 1 1 1 1 1 1 1 1 1 1 1 1 1 1 1 1 1 1 1 1 1 
##$CPDPRG= <>
##$CPDPRG1= <>
##$CPDPRG2= <>
##$CPDPRG3= <>
##$CPDPRG4= <mlev>
##$CPDPRG5= <mlev>
##$CPDPRG6= <mlev>
##$CPDPRG7= <mlev>
##$CPDPRG8= <mlev>
##$CPDPRGB= <>
##$CPDPRGT= <>
##$D= (0..31)
0 1 0 0 0 0 0 0 0 0.06 0 0 0 0 0 0 0.0002 0 0 0 0 0 0 0 0 0 0 0 0 0 0 
0 
##$DATE= 1175513842
##$DBL= (0..7)
120 120 120 120 120 120 120 120 
##$DBP= (0..7)
150 150 150 150 150 150 150 150 
##$DBP07= 0
##$DBPNAM0= <>
##$DBPNAM1= <>
##$DBPNAM2= <>
##$DBPNAM3= <>
$$ [...]
##$SUBNAM7= <"">
##$SUBNAM8= <"">
##$SUBNAM9= <"">
##$SW= 20.6930455092707
##$SWIBOX= (0..15)
0 0 3 0 0 0 0 0 0 0 0 0 0 0 0 0 
##$SW_h= 5175.983436853
##$TD= 65536
##$TD0= 1
##$TE= 683.16
##$TE2= 300
##$TE3= 300
##$TEG= 300
##$TL= (0..7)
0 120 120 120 120 120 120 120 
##$TP= (0..7)
150 150 150 150 150 150 150 150 
##$TP07= 0
##$TPNAME0= <>
##$TPNAME1= <>
##$TPNAME2= <>
##$TPNAME3= <>
##$TPNAME4= <>
##$TPNAME5= <>
##$TPNAME6= <>
##$TPNAME7= <>
##$TPOAL= (0..7)
0.5 0.5 0.5 0.5 0.5 0.5 0.5 0.5 
##$TPOFFS= (0..7)
0 0 0 0 0 0 0 0 
##$TUNHIN= 0
##$TUNHOUT= 0
##$TUNXOUT= 0
##$USERA1= <user>
##$USERA2= <user>
##$USERA3= <user>
##$USERA4= <user>
##$USERA5= <user>
##$V9= 5
##$VALIST= <valist>
##$VCLIST= <CCCCCCCCCCCCCCC>
##$VD= 0
##$VDLIST= <DDDDDDDDDDDDDDD>
##$VPLIST= <PPPPPPPPPPPPPPP>
##$VTLIST= <TTTTTTTTTTTTTTT>
##$WBST= 1024
##$WBSW= 4
##$XGAIN= (0..3)
0 0 0 0 
##$XL= 0
##$YL= 0
##$YMAX_a= 643433
##$YMIN_a= -686223
##$ZGOPTNS= <>
##$ZL1= 120
##$ZL2= 120
##$ZL3= 120
##$ZL4= 120
##$ABSF1= 16.522
##$ABSF2= -4.171173
##$ABSG= 5
##$ABSL= 3
##$ALPHA= 0
##$AQORDER= 0
##$ASSFAC= 0
##$ASSFACI= 0
##$ASSFACX= 0
##$ASSWID= 0
##$AUNMP= <proc_1d>
##$AZFE= 0.1
##$AZFW= 0.1
##$BCFW= 0
##$BC_mod= 0
##$BYTORDP= 0
##$COROFFS= 0
##$CY= 12.5
##$DATMOD= 1
##$DC= 0
##$DFILT= <>
##$DTYPP= 0
##$F1P= 14.0000005364418
##$F2P= -0.99999901652339
##$FCOR= 0.5
##$FTSIZE= 32768
##$FT_mod= 6
##$GAMMA= 0
##$GB= 0
##$INTBC= 1
##$INTSCL= 1
##$ISEN= 128
##$LB= 0.3
##$LEV0= 0
##$LPBIN= 0
##$MAXI= 10000
##$MC2= 0
##$MEAN= 0
##$ME_mod= 0
##$MI= 0
##$NCOEF= 0
##$NC_proc= -1
##$NLEV= 6
##$NOISF1= 0
##$NOISF2= 0
##$NSP= 0
##$NTH_PI= 0
##$NZP= 0
##$OFFSET= 16.522
##$PC= 1
##$PHC0= 231.5796
##$PHC1= 5.407756
##$PH_mod= 1
##$PKNL= yes
##$PPARMOD= 0
##$PSCAL= 4
##$PSIGN= 0
##$REVERSE= no
##$SF= 250.13
##$SI= 32768
##$SIGF1= 0
##$SIGF2= 0
##$SINO= 400
##$SIOLD= 32768
##$SREGLST= <1H.CDCl3>
##$SSB= 0
##$STSI= 32768
##$STSR= 0
##$SW_p= 5175.98343685301
##$SYMM= 0
##$S_DEV= 0
##$TDeff= 65536
##$TDoff= 0
##$TI= <Analysis number 999999
Compound Code 99
Book Reference 9
Project Code 9>
##$TILT= no
##$TM1= 0
##$TM2= 0
##$TOPLEV= 0
##$USERP1= <user>
##$USERP2= <user>
##$USERP3= <user>
##$USERP4= <user>
##$USERP5= <user>
##$WDW= 1
##$XDIM= 32768
##$YMAX_p= 476943271
##$YMIN_p= -14010
$$ End of Bruker specific parameters
$$ ---------------------------------
##NTUPLES= NMR SPECTRUM
##VAR_NAME=  FREQUENCY,     SPECTRUM/REAL,   SPECTRUM/IMAG
##SYMBOL=    X,             R,               I
##VAR_TYPE=  INDEPENDENT,   DEPENDENT,       DEPENDENT
##VAR_FORM=  AFFN,          ASDF,            ASDF
##VAR_DIM=   32768,         32768,           32768
##UNITS=     HZ,            ARBITRARY UNITS, ARBITRARY UNITS
##FACTOR=    0.157963299565203, 1,           1
##FIRST=     4132.6476996994, 0,             0
##LAST=      -1043.33573715361, 0,           0
##MIN=       -1043.33573715361, -14010,      0
##MAX=       4132.6476996994, 476943271,     0
$$ Real data points
##PAGE= N=1
##DATA TABLE= (X++(R..R)), XYDATA
$$ [...]
15966D105j346l280M40L73K448j760k328L30O45j20K020J933j307P86j825Q13
15950A927q65k978K11p16j170J114L108J527j212o97K214j300J309j687j50J101
15934A736J762j121l448k232Q96J345K54q72j555L122P93l303k482K511J567l974
15918e001j625j981L366M285m501P56M940L003K03k478L111J1j977k067K796L054
15902E895k276l322p32m93j805q5p52J544j409l99J369J911k492K149L017j418
15886G02J635q53k091k159r51j234K493L611M027K14l91n2o179k320K092l05K642
15869H81Q09m303m08m05J577L075R75j269K680kj621k920k835M50L393j019k049
15852b991l65J993O3j400J990J618R5R3M53p45P21p75l590k366K349M860L963
$$ y = [4105, 2759, -521, -81, 292, 2740, 980, -1348, -1018, -373, -493, 1527, 3460, 2153, 2939, 1114, 1927, 1062, -1916, -1705, -2421, -3591, -2477, 631, 2158, 946, 249, 2463, 1163, 2472, 785, 635, 1736, 3498, 2377, -1071, -3303, -2407, -1062, -808, -1680, -3235, -113, 680, -2623, -5105, -2594, -1027, -5001, -6626, -8607, -5241, -956, -5457, -4701, 239, 3242, 3445, 967, 4078, 4089, 2112, 45, 2841, 5895, 3619, 297, -435, -928, -2733, -2818, -3570, -2026, -3435, -3834, -2465, -554, -3046, -897, 2120, 702, 2337, 1484, -607, -2766, -3717, -4951, -2458, 1153, 5180, 5394, 5003, 4951, -1228, -3548, -1456, -1761, 881, 1690, -2613, -3021, -3426, -1849, 1226, 2201, 932, 3612, 3610, 1989, -931, -3766, -3316, 77, -942, -2991, -3356, -1363, -1300, -2700, -710, 908, 1003, 1096, 1549, 804, 1525, 750, -2840, -5206, -2857, 2003, 5966]
15835E966O67k333k68M76J453k410k59M22p90m285k601M371J616n25m347p70K718
15818h99L018J781k589q02J642n413l742J693J366J485j30J29J710L37N88r10
15802g36R4l417N0Q59J209K97k602P49q8J566R49k122q37n0l5P62j90J893L241
15783A592j326m226k80k191j544J84J818R84L118L58k724p44l202O7N059Q74K32
15766a951O90L961L32j105j443j293l712J273l50k055L159J350N17r70n75P59
15750a413P42j262J678N35J93j119l056L405K42j110l175q00j596M92O23J488
15734d133p31L837L479m92m49K728l160k956J516M018J319k082k22j075m6p97
15718G54Rk235o29J726L544k09j372l175k727J062M704J610k295J740k71j468
$$ y = [5966, 6633, 4300, 4032, 4508, 5961, 3551, 3292, 3714, 2924, -1361, -3962, 409, 2025, 1500, -2847, -3617, -899, 2119, 3900, 1311, 509, 2151, -3262, -7004, -5311, -3945, -2460, -2590, -2461, -751, -414, 174, -736, -642, -4059, -4009, -3150, -1941, -1644, -4246, -3497, -3585, -2019, -1070, -3192, -4029, -4079, -4114, -3352, -3542, -1649, 1592, 266, -3960, -4240, -6431, -7975, -7791, -5973, -4989, -1871, -1513, -4237, -4981, -8183, -8116, -3057, -2183, -1951, -1261, 2700, 3032, 1927, 484, -809, -4521, -3248, -3598, -5653, -2494, -1144, -627, -1597, -2172, -1413, -671, -1933, -255, 280, 473, -646, -3702, -297, -55, -1165, -4340, -5140, -6736, -6244, -5621, -4133, -4864, -1027, 2452, 1960, 1511, 4239, 1079, -1877, -361, 3657, 4976, 2894, 2672, 1597, 1551, 754, 763, -1472, -2101, -375, 3169, 2960, 1588, -1587, -4314, -3252, 1452, 3062, 767, 2507, 2236, 768]
15702G68J055k104j15L327m300j910O21Q11J311J853Q55p74n98O53j167k562k527
15685d803K897j272j104N04j027j596Q98m05L86m81J158O404K152l088k855K234
15669Bq82k799J54K015O62p73K20N72K392K239k358l055J019K001j277m55K963
15652B640K614m437P61j280r89k532j769l81m545J988M874k960m09L073P384K339
15636F371m420j295L534N91J881L21J758j083k528j376j253q7J039p14J086J477
15620E302j499l68M02k557m425j089p90M061J415N34K36m170n11K331J894j715
15604i49n811N15K421J197R51k253K25N177j857K472q0k975r14J41L029K025J554
15587D868j455j411p10r86J505o830k042q42K966L168O84r79L027j731o03K652
$$ y = [768, 1823, -281, -396, 2931, -1369, -3279, -2658, -1847, -536, 1317, 2172, 1398, 800, 1453, 286, -2276, -4803, -1906, -3178, -4282, -3778, -4805, -6401, -5503, -5908, -5522, -6003, -4845, 1559, 3711, 623, -2232, 2, -880, -3679, -3525, -1510, -848, -1621, -1401, -829, 1563, 3802, 1444, -1611, -592, 1409, 132, -323, 2640, 5254, 817, 1578, 298, -691, -3223, -4992, -5373, -9918, -7930, -3056, -6016, -6425, -3352, 4032, 6371, 1951, 656, 4190, 4781, 6662, 6983, 8741, 7658, 5130, 3754, 2501, 2414, 3453, 2739, 3825, 5302, 3803, 3435, 3837, 1280, -3145, -4234, -5024, -963, 452, 986, 1222, -2948, -3459, -1128, 766, -949, -6760, -6245, -3824, -2627, -1676, -3929, -3704, 1473, -384, 2088, 2008, -967, -1881, -1740, 1289, 3314, 4868, 3413, 2002, 1292, 306, 1811, -5019, -7061, -7903, -4937, -1769, -1085, -2064, 963, -768, -1371, 1281]
15571A281k250l071k393J015k392n07M010O1J786k283J297J561M12l827P57K366
15555b177K605K412L32l531j311J372o80j439m31k881n36L503M359K522m40K655
15539F334L246m372m273o84m188j260P81K861l62j309K290J541n55j809J654J008
15523I03k907l72K070L075j167j752J450k179J124J335j554K81K963Q45j984l192
15507a061j760K543J313o37J309j496l634p51j605K303M60q20L121l07J234Q03
15491A015j388k061L484K867k342j515j487j017K931n35j055k909K358J805j160
15476a009O0J020J437K145r73j618k505p24J149n54J539n82j055l580K2L466K589
15459H27J908q65j23j07j979j794k139K696K997k245N90J031K336K274K138k926
$$ y = [1281, -969, -4040, -6433, -5418, -7810, -8317, -4307, -4246, -2460, -4743, -3446, -1885, -1473, -5300, -4543, -2177, 428, 2840, 3172, -359, -1670, -298, -978, -2417, -2848, -5729, -6265, -2762, 1597, 4119, 3679, 6334, 9580, 5208, 935, 251, -3937, -5197, -4416, -1555, -1917, -3226, -936, 605, 50, -1759, -105, 903, -2004, -2376, -306, 2769, 1602, -150, 1300, -879, 245, 1580, 26, 307, 3270, 4115, 2131, -1061, -2821, -278, 1035, 398, 1707, 211, -3423, -4174, -5779, -3476, -3016, -3836, -715, -1022, 212, 1015, -373, -2434, 1050, 3917, 1575, 60, -1427, -2444, 487, -48, -1103, -4012, -1654, 151, -1009, -949, 71, 1508, 3653, 2680, 1062, -1443, -2167, -1018, -1572, -33, -615, -1670, -5250, -5228, -1762, 827, 2735, 1870, 1747, 1640, -339, -2133, -4272, -1576, 1421, -824, -234, 797, 3133, 5407, 7545, 4619]
15443D619m439k168j162L80J015R50j68r00L995K671K688K365N42l323l596j66
15427C303m25j589m126K615L058j333l774L624o58k381m06J78N12j084J925N173
15411D612M077j229k466j717j308K63J439L810k616j796l61o75L43M81K43k569
15395E31R46p21j782k359j721j62K11j649P54L986O92L414O66P19K232k803k241
15378G13k749o70r91k50O4J069l6L7L208R75q67L52j849j253j372j789LM400j87
15359a192k155j725P48L991j264n92J669j258m59p09o32L892m50m270l051k98
15343g755K684K116m9k734o34L208K934j823m481n64M247o61O25M304J929J262
15327D608Q8l677k65k71K853J973j327k004k446k065L28O66kk009j648L554K446
$$ y = [4619, 180, -1988, -3150, -2770, -1755, -805, -973, -1873, 2122, 4793, 7481, 9846, 10388, 7065, 3469, 3303, 2878, 1289, -2837, -222, 2836, 1503, -2271, 1353, 695, -1686, -2092, -1914, -1402, -2486, -561, 4612, 8689, 7460, 4994, 3277, 1969, 2232, 3671, 7481, 4865, 3069, 2708, 2033, 2376, 2857, 3100, 531, 1477, 756, -1026, -3385, -5106, -5268, -5057, -6706, -5952, -1966, -1274, 2140, 2806, 3525, 5757, 2954, 713, -2036, -2706, -3697, -3947, -3883, -2814, -2850, -2813, 395, 1370, 503, 855, -994, -2247, -3619, -5408, -5405, -1005, -1192, -3347, -5072, -4324, -333, -1597, -2189, -520, -1778, -2237, -2946, -3578, 314, -136, -4406, -7457, -7755, -5071, -2955, -3004, -5738, -6372, -3164, -230, -2053, -6534, -7098, -2851, -3512, -2887, 1417, 3346, 4608, 4696, 1019, 754, 483, 3336, 5309, 3982, 1978, -468, -2533, -2205, -1539, -1541, -3550, -5198, -1644, 802]
15310H02J75M31K368n83m413l394p22M058L430j048j687M89q28L229j042K208
15294C473K072j977p56J610m280k860J28J02J369K316j284j775j063o66M007J208
15278A624l967j809J892P8L707J874J998R99j112k739j598J903K83L001k425m666
15262i57n2J83R15o40k402j461K080J598m61J975j781Q70k48J41j41m99K44j338
15244a974J804j425j142L306L068J748m02j572p80j493QJ856q97l43p10l057k434
15227d439J295j143p92l82P37K059J164O23K371j965k887k112J580K489J38o39
15211a903l17l103K193K264L367K21R3K548m048K629J500m085j677j35Q98Q38
15195A283j026j480J402J619l579k259J441L819J993k119l933j290M051K127L704
$$ y = [802, 977, 1408, 3776, 3193, -1220, -4614, -5336, -1278, 2152, 1104, -583, -94, -922, 2307, 1265, 3473, 5545, 3568, 2812, 4422, 142, -2718, -2590, -2488, -1119, 1197, -87, -1862, -2925, -3591, 416, 1624, -2343, -4152, -2260, -2182, 1525, 3399, 5397, 6396, 5284, 2545, 947, 2850, 3133, 6134, 3709, -957, -1009, -826, 89, -551, -2953, -4414, -2334, -736, -1197, 778, -1003, -133, -381, -240, -381, -880, -636, -1974, -170, -1595, -2737, 569, 3637, 5385, 4983, 3411, 2631, 1138, 1146, 3002, 2105, 1762, 1052, -2005, -4439, -3144, -4287, -5079, -5461, -4724, -2665, -1501, -878, 1493, -472, -3359, -5471, -3891, -1402, -1264, -1903, -2220, -5323, -3130, -866, 2501, 2722, 2815, 5363, 1315, 3944, 5444, 1359, -318, -453, 445, 1283, 257, -1223, 179, 1798, -1781, -4040, -2599, 1220, 3213, 1094, -2839, -4129, -78, 2049, 5753]
15180E753L86l738k324k278M067J09m252K427J767J07m93J182k390l112r52J645
15164b096J915n90K332O44k342n012L38N53J874J164J193K993m31j775l140J02
15148b278J368O04k53o52L516K254J993K79k990k131j744K200l123m70j91l568
15132e186k90m56R53J700J492M83l404n5K131K341k63J277k728K030O99m508j318
15115e102M45p27l20L027J21J336J16m3L528J418o03r87j234k008l478j135Q02
15098d844J933K002N68J884k208j666J103J748Q49j274M05J576k739Q05l741k518
15082f117J506J101m393J378K788q04J828M897N92l1l469l393K028r39Q17Q76
15066a335k91j607p77l527j132J456M420K761q81Q45j615J717j250m622j295P05
$$ y = [5753, 6139, 2401, 77, -2201, 1866, 1975, -2277, 150, 1917, 2024, 1531, 2713, 323, -2789, -3741, -2096, -181, -771, 1561, 2205, -137, -5149, -4811, -4258, -2384, -1220, -27, 2966, 2535, 760, -2380, -2278, -910, -306, -559, -1211, 2305, 4559, 6552, 6831, 3841, 1710, -34, 2166, -957, -1427, -1618, -5186, -5476, -5932, -4979, -3279, -1787, -1304, -4708, -4763, -2632, -291, -554, 723, -2005, 25, 724, -3784, -5102, -4657, -5384, -5704, -2677, -2556, -1220, -1104, -1147, 2381, 3799, 3196, 2209, 975, -1033, -4511, -5646, -4844, -2911, -909, -341, 1543, -665, -2331, -1228, 520, 1369, 95, 500, 2076, -663, 142, -3599, -6117, -4611, -3510, -7903, -6525, -3737, -4541, -2713, 2184, 2776, 2745, -724, -4117, -2089, -3028, -2211, -1335, -1626, -3233, -4010, -7537, -8669, -7213, -2793, -32, -913, -68, -1683, 34, -1216, -5838, -7133, -6428]
15050f428R43j68J40K772M5K517M41k434m11R14r43J152M70J776k261k677j664
15033e816K307K889k35k459J361Q9j601k76J384J309L492J919l827k523j507M08
15017c086k753o0O47j081q42L556J08L126J001j116J055L773O915L856o233l464
15001E402m349l03J111k41k218J584j612M23n49j92J184L62M78J106l477m75j198
14984b964k940Q87J737J399o56j354n06L6n94o0J136R56j406K819J228O50J91
14967E59J679J130J717J747k616k200K379k815k922p36M5L54J2k322j622N462
14951a49M058O2l148r20k152q91n11L998L576J591n009o93L163L616K1m039p504
14934d931k300M055M310k75k387k80K101k688l736J835M128J614ll287k752j747
$$ y = [-6428, -5485, -5653, -5513, -2741, -2696, -179, 262, -2172, -2583, -1669, -2612, -1460, -990, 786, -1475, -4152, -5816, -3509, -620, -855, -3314, -1953, -1864, -3465, -3741, -2357, -1048, 2444, 4363, 536, -1987, -3494, -3086, -5839, -5899, -5252, -6333, -7175, -3619, -3511, -385, 616, -500, 555, 4328, 11243, 15099, 8866, 5402, 1053, 750, 1861, 1620, -598, 986, -626, -203, -752, -944, 240, 602, 1080, 2186, -1291, -1766, -2964, -5904, -5017, -3280, -1881, -2537, -3891, -4397, -4361, -4955, -5015, -3879, -2923, -4329, -1510, -282, 368, 559, 2238, 3368, 5085, 6832, 4216, 2016, 4395, 1580, -1342, -2078, -2033, -1679, -1667, -3989, -5611, -149, 3909, 3971, 823, -97, -2249, -3140, -3651, 347, 3923, 5514, 505, -188, 2975, 6591, 6612, 2573, -4931, -7231, -3176, 1134, 859, -1528, -1808, 293, -2395, -6131, -4296, -168, 1446, 1443, -1844, -4596, -6343]
14918f343K778O04P69OM766k15j424K482j194k294j09J052n12J716J582K450p33
14901E381l943j175J300p27n516k902j440L42P252L568m614m45M35n0K043K063
14885A572R19n5J755P04j732m132M59Q88k262l403J619M900P95J2m95n445J8L825
14867e8L302j542P0j124K17M308Q79l841j197k117l61J913k336j99M719l043j868
14850b278R56L266R15l661J875k803o61L111q31k259j432j617j45l1J890M468
14834G63J485j43p0P83p53p99k870m071l067L913M018J522R90J710J922k086J912
14817E159J29K079j717l324k604K563K176J93k463l410J317J422K506r54m019
14802i47n427J701K367m15K747J538j13L33K171K159r69l227n05J349J873m03
$$ y = [-6343, -3565, -2961, -2192, -2186, 2580, 2365, 941, 3423, 2229, -65, -174, 878, 366, 2082, 3664, 6114, 5381, 1438, 263, 1563, 836, -4680, -7582, -9022, -8680, -1428, 2140, -2474, -2919, -2484, -2534, -491, 1572, 2491, 2436, 4191, 4895, 3163, -969, -510, 378, -1884, -5287, -3668, 1232, 2027, 2039, 1544, -3901, -3883, -58, 3244, 1702, 1772, 648, 865, 5173, 6052, 2211, 1014, -1103, -1464, 449, -1887, -2086, 2633, -410, -2278, -1322, 1944, 2859, -802, 1073, -1730, -2391, 720, -111, -2370, -3802, -5419, -5564, -5595, -3705, 763, 2248, 2105, 2035, 2818, 2065, 1266, -1604, -5675, -8742, -4829, -811, 711, 1701, 3411, 5333, 3247, 5159, 5288, 7367, 5650, 2326, -278, 2285, 4461, 4654, 2191, -1219, 98, 1520, 4026, 3072, -947, -6374, -4673, -2306, -2721, 26, 1564, 1451, 1784, 3955, 6114, 5145, 1918, 1413, 2762, 4635, 4232]
14786D232O52j066k151n04K411M56m011k214P70K791J641j032l455OL656M011
14770F193p74j957L58R03j77R42k666k092j841J511M3m978k644r07J970P863O97
14753B444J212J700j020k525j441L23p4l962j787j862j450L550O29K47k059j491
14737g566J980j591P69K894J224N69k191J98k560K167K943M212L77l242o06k47
14721f70P12j219P29J806L8J116K58m92m997j158M47J113k98J376O85N82l77l113
14703c462R70M744m146k074m09L718L098p50j840n121L279M352J647o34j544J612
14687C440M22m37o292k537M63M548J676l127k44J651l243k194R38J976J929M16
14671f15j546M94k411j238j028L059o1J116j262K79R53k033k313L482M251n70
$$ y = [4232, 4884, 3818, 1667, 1163, 3574, 4030, 19, -2195, -1425, 1366, 3007, 1975, -1480, -1474, 2182, 6193, 5419, 3462, 3820, 4723, 4546, 5488, 2822, 730, -1111, 400, 443, -4535, -7179, -8086, -6116, 1747, 2444, 3656, 5356, 4336, 1811, 370, 693, 619, -3343, -5130, -6992, -8442, -4892, -4263, -4016, -6075, -7566, -5586, -7177, -6408, -3514, -2290, -1721, -3912, -3714, -6274, -4107, -1164, 3048, 3425, 183, -423, -670, 42, -1177, -448, 1358, 1396, 2512, 2770, 2278, -2719, -3877, -3430, -2317, -2615, -1239, -554, 28, -349, -3462, -2492, 2252, -1894, -3968, -4377, -659, 2439, 1689, -151, -5272, -1993, 2359, 4006, 3372, 1828, 3440, 3862, 3425, -2867, -5404, -4941, -393, 1283, -1844, -2088, -437, -3680, -5874, -4936, -2960, -1031, -615, -2161, -1667, -4078, -5316, -6344, -3285, -3346, -2230, -3492, -3213, -2260, -4293, -6606, -3124, 1127, 557]
14655E57j11k852l502k189P75L537J654L399J101m226k046Q61J364n22M51J303
14639d46K722M10m644k486J0J512L026J225l54K77o90k869j025j031j167K036
14623c494J042J879P26l11j968Q45m16L886J593k393k841j238L692J060J140J354
14607D556k092Q40k983k275J097J942m00r55m438J395L114J460k361O63K362m55
14591A470J283K067k062l190k384l1K295J867j602o66j131j218L30j644J957P1
14575b588K226Q35l660k634O779L455j498j63p50l63o71j069J341K573L102K022
14559H937l996n102m696J184O043J324j221L511J931J94N32j046j049K878p17
14544H707o245P6j577j56J408m15J202j712l348J179k122P24k96K972J907k376
$$ y = [557, 446, -2406, -5908, -8097, -7322, -3785, -2131, 1268, 2369, -1857, -3903, -3042, -1678, -2200, -1749, -446, 2276, 2686, -1958, -4444, -4434, -2922, 104, 1329, 975, 1252, 562, -2307, -3332, -4363, -5530, -3494, -2452, -573, 153, -158, -2126, -1281, -1697, 2189, 3782, 1389, -1452, -2690, 1002, 2062, 3202, 4556, 2464, 3304, 321, -1954, -857, 1085, 685, -270, -4708, -3313, -199, 1261, -1100, -437, 1925, 1470, 2753, 4820, 2758, -432, -2816, -2847, -552, 1315, -287, -953, -2084, -3302, -2972, -4616, -2659, -2588, -362, 473, -3187, -5821, 958, 4413, 2915, 2752, 2002, 1639, 968, -101, 1240, 3813, 6915, 8937, 4941, -161, -4857, -3673, 2370, 3694, 2473, 5984, 7915, 8109, 8641, 7595, 6546, 9424, 8707, 2462, 2538, 961, 805, 2213, 1798, 3000, 1288, -2060, -881, -3003, -2279, -2575, 397, 2304, -72]
14528g2k568j822J949L224J451k059j326K191L765R98j558k794q47j873J183K032
14512A874L985J099k597m440k606j737o82j82L837M998P59l097j477j343k392
14497d001q92M100M13j432N83P1J051J718K229m61k508k453k992p93K662J472
14481a233j08R61J350p85q79k60j252R68K172J315K736J19j479r03l507R74K265
14464B454l449Q67P38k655M01J324n1J93m05O18J851K983j593m281j193J181p39
14447a756J066K022O89j87k989o30K243N92k99l96J212J68l155j46j052K63m805
14430g160J537N147J335j163k286M35L166O35L6K975r90l811k282J710K748K349
14414D381l316l282L922o91j216L243L696N706Q525J4360K3846N1294Q2723J9723
$$ y = [-72, -2640, -4462, -2513, 711, 2162, 103, -1223, 968, 4733, 5731, 4173, 1379, 532, -1341, -158, 1874, 5859, 6958, 4361, -79, -2685, -4422, -5104, -5286, -1449, 3549, 4308, 1211, -266, -1609, -4001, -4893, -793, -380, -1812, -1229, -1158, -107, 1611, 3840, 3379, 871, -1582, -4574, -5367, -2705, -1233, -1341, -380, 970, 185, -694, -954, -2206, -1238, 934, 2249, 4985, 5104, 3625, 2722, -785, 189, 2454, -995, -128, 610, -2045, -1644, -320, -371, -178, -583, 35, 1886, 4869, 3276, -1005, -2198, -1017, -1756, -690, 1332, 2021, 1834, -1155, -1785, 458, 1050, 751, 355, 1567, 1735, -1420, -1566, -2618, -2355, -7160, -5623, -476, 859, -304, -2590, -2155, 1011, 1646, 1682, 4657, 3667, -144, -2426, -716, 2032, 4381, 1065, -2217, 1705, 1014, -202, 3041, 6737, 12443, 20968, 35328, 59174, 110468, 193191, 212914]
14400B12914n4289o3118l9451j7253j0467l682n418m787p740o291J501J479k267
14387A131j277j678k768M58K954L444M299j528k298k909j317J635L807K398j269
14372E082l480k384K658J836l230k248J36L285q50k086K03K158m28j683m002m257
14356i290J086J863K05r53K331K963K363j009J98K748m487j361K461J44J866N24
14340A652k545J632K147k586j851j848j652L391L565L60j47P03k45k689j156p67
14324b036k182L20L239j525k074J995O34J243K110n30j539M084J800n50j687j688
14308A614l886k392M08J553j01M271K449J467J31j146m839N0k969k602O237K549
14292B794k564n42K010q45k208R39l060j386o63p25n38P70k033j472J950J409
$$ y = [212914, 158625, 95507, 56056, 38803, 28336, 24654, 19236, 14449, 6709, 418, 1919, 3398, 1131, -146, -1824, -4592, -4134, -1180, 2264, 6563, 5035, 2737, -172, -1489, 146, 3953, 6351, 5082, 1602, -782, 1876, 3712, 482, -1766, -1630, 1655, 805, -1281, -1078, 1080, 652, -1031, -5033, -9290, -8204, -6341, -6136, -7089, -4758, -1795, 568, -441, -243, 2505, -1982, -3343, -882, -738, 1128, 1652, -893, 739, 2886, 300, -1551, -3399, -5051, -1660, 1905, 2265, 2118, 2821, 2576, -113, -1269, -2036, -4218, -3898, -659, -2184, -4258, -2263, -1629, -386, 1724, 1194, -345, 3739, 5539, 4989, 3302, 1614, -2272, -4664, -4256, -2703, -2804, 1467, 3916, 5383, 5514, 4368, -471, -421, -3390, -5992, 245, 2794, 230, -312, 1698, 853, -1355, -416, -3476, -4862, -5525, -6250, -6788, -6018, -8051, -9523, -7573, -6164]
14276f164K885l63J663M27J618j512J162J663J319j923K235j150q65J523Q09k04
14260C123r58j472J450l10J016m43j979R46j140j705K932K489J155P76J002j086
14244E796m353m049j972r48J952l07j557j196j617n34j242K150N137J761K559
14229A580j306m18L073M92L28j355m291q68l8m11k408J657L952J329p67J616l830
14212a665k671M614J619j306J579r79J982M87L091l164m607p56j17K492K697r05
14196B391k112L015P31n434k333j59k155J592j38j496j539K71M550J164J452q
14180b08k60K410j164k763l52j175K38L786J820k72k216q47p31j927n5q59r02
14163e477M51M355K437O32j426r01O23J976j16j344l864L33P32K014K42K401K776
$$ y = [-6164, -3279, -3642, -1979, -1552, 66, -1446, -284, 1379, 2698, 775, 3010, 1860, 995, 2518, 3327, 3123, 2165, 693, 2143, 1833, 2849, 2406, 427, 1373, 233, -1472, 1460, 3949, 5104, 5880, 6882, 5796, 1443, -2606, -4578, -5526, -3574, -3881, -5438, -6634, -8251, -8785, -10027, -7877, -2740, -979, 1580, 274, -144, 2929, 3421, 3749, 2394, -1897, -2765, -2803, -3214, -5622, -3965, -13, 1316, 549, 2165, -1665, -4336, 278, 1897, 591, 2170, 1191, 3173, 3660, 6751, 3587, -1020, -1776, -1893, 599, 3296, 2391, 279, 3294, 4025, -1409, -3742, -3901, -6056, -4464, -4602, -6098, -7637, -7366, -2816, -1652, -200, -208, -468, 1942, 778, -1985, -2337, -3512, -3274, 512, 2332, 2060, -156, -1003, -1734, -3661, -3716, -4575, -5477, -5026, -671, 1766, 2398, 972, 71, 694, 2670, 2554, 1210, -2654, -2321, -1589, 425, 667, 3068, 5844]
14146E844k456p74k010n287p10K901J395J269J837J320k791j329Q40j705K11j641
14130c086k70j20J210j436k719k85J552L119J668P54N26N57r26j84m102j851n45
14113f138K455n00J184J068n72Q61p44j659k354R38K636L112J321N97j190m37
14097E78J91J932J98K578K937l47j077m490m327Q49L877K479j35k675k076k180
14081a688k698j345m73p74L622Q227J085Q49J30j715p62j690k539R26J290j221
14065A224m9q38Q1J600M723M78M23j69r64k172k724J887P77k875O09q13K781L674
14047G653L509m032j196o9p70J060J428Q7l81j01l15k146j638K947L442k75k262
14030F941J423K909j153j371j703k693R71m52P41J798J099J711K594o06O4l813
$$ y = [5844, 3388, 2614, 604, -4683, -5393, -2492, -1097, 172, 2009, 3329, 538, -791, 49, -1656, -1445, -3086, -3356, -3476, -2266, -3702, -6421, -6706, -5154, -2035, -367, 387, 913, 1470, 544, 360, -3742, -5593, -6138, -3683, -4183, -2999, -1931, -2503, -1642, -2386, -4045, -6399, -5461, -2825, 287, 1608, 2205, 1015, 578, 769, 2701, 2899, 5477, 8414, 8067, 6990, 2500, -1827, -978, 2899, 5378, 5243, 2568, 492, -1688, -4386, -5731, -6204, -6978, -3356, 4871, 5956, 6805, 6935, 5220, 4458, 2768, 229, 1155, 2445, 1224, 1175, 337, 418, 2018, 6741, 7219, 7642, 7473, 6509, 4337, 1613, 3500, 4277, 1402, 2011, 1198, 3979, 7653, 11162, 7130, 5934, 5865, 5095, 6155, 7583, 7670, 7289, 7188, 6873, 4727, 3089, 6036, 9478, 9203, 6941, 8364, 11273, 10120, 8749, 7046, 4353, 5324, 4872, 5613, 7411, 8510, 10221, 12815, 12209, 12273, 8460]
14014H460j119Q31K994J480j287J287R31j686O55K397L02q62k170k506P029K331
13998A9067l046p41Q02J418K13M5K928J041k6j372Q82K590n62K839L617j29l129
13981B6437n262Q97j272R96R8M22p88m601j11L122K438j923Q26J25J145j963k87
13964B0299J286k228R79k374K348N476Q78J20Q50q85m98k95Q67j427j623j784
13948B1989q11l96l64K701N15Q6k896k056K510L431n208j93R47R15J352j543j291
13931A9688J297J008J510m46J355m32l22l061o647n16L288J47l61M821j111n155
13915A5063k767L025J993l954R35j003N65K002K55K353k96k457k656K013J135
13900A6206J880J542j682J246l756j698N38J323n01j613N67k778k748j372L04
$$ y = [8460, 7341, 8172, 11166, 12646, 11359, 12646, 13577, 11891, 12546, 14943, 15245, 14383, 12213, 9707, 16736, 19067, 16021, 15280, 16082, 17500, 17713, 17758, 20686, 21727, 21701, 20329, 21211, 23801, 23239, 26078, 29695, 29566, 26437, 21175, 22072, 20800, 21796, 21894, 22316, 21528, 16927, 16816, 19938, 22376, 20453, 21279, 21404, 22549, 20586, 20299, 21585, 19357, 20336, 17962, 20310, 25786, 26664, 26784, 27634, 26749, 26251, 25956, 26823, 25396, 23773, 21989, 21178, 20782, 20418, 23119, 23634, 23720, 20824, 18768, 21278, 24709, 19501, 19308, 20255, 21170, 22522, 20979, 19688, 20985, 21993, 23503, 23057, 24412, 23980, 23658, 20597, 13950, 13434, 16722, 16869, 16508, 21329, 20218, 15063, 12296, 15321, 17314, 13360, 14295, 13292, 13857, 15859, 16114, 18467, 18171, 15714, 13058, 15071, 16206, 18086, 19628, 17946, 19192, 15436, 13738, 14276, 15599, 15098, 13485, 14052, 11274, 8526, 7154, 7458]
13885G458K025J314K426K273j101l357k512l39l39j649O77M094p07m527j767L88
13869D357K494k170l596L25J482J331J734j921m8M61j781l97N038L9j014J958
13853H292J41j498q71J45j858J162L409J534k494k217j421l227n2R9L597k15p50
13836C776J395P15k919o48K30l6N377M47j785K160M6k027J20K423l4k557Q13j504
13818E992M40j160J68K203J932j197K72n20m985n54L71k64J742J368l49j900k424
13801A135l512j16J433o09J627L511M753l344n188k93N184J359k006O58l40k148
13785B104N63J265J558J928j448k233k243j430N14J239J726k925J087l5j987J613
13769A296Q03Q67l793m123L12K966K278k663J617l455P23Q9J045K547J615k509
$$ y = [7458, 9483, 10797, 13223, 15496, 14395, 11038, 8526, 8187, 7848, 6199, 6876, 10970, 10263, 5736, 3969, 4357, 6851, 4681, 1085, 1410, 2892, 4223, 5957, 4036, 3988, 4449, 2668, 2271, 7309, 7348, 6334, 8292, 8433, 6935, 6064, 6209, 4351, 5513, 8922, 10456, 7962, 5745, 4324, 1097, 1045, 1144, 4741, 4526, 3776, 5171, 5886, 2967, 2319, 2549, 2513, 7890, 8337, 6552, 8712, 8758, 6731, 6851, 9274, 9240, 6683, 7496, 5992, 6432, 5272, 5440, 7643, 9575, 8378, 8650, 8130, 3145, 2591, 2962, 2698, 4440, 5808, 5459, 3559, 1135, -2377, -2493, -1060, -1669, -42, 3469, 8222, 4878, -310, -603, 4581, 5940, 3934, 4592, 4252, 2104, 2667, 3932, 5490, 7418, 5970, 3737, 1494, 64, 578, 1817, 3543, 618, 1705, 1670, -317, 1296, 2099, 2966, -827, -4950, -4638, -1672, 606, -2057, -440, -3895, -3172, -3083, -2038, 509, 2124, -385]
13753c85o43k415j936j066M239K929k596n31j480P0J668QL097m96p9J286L118
13736D788J280K555m49o988l48L500K0m399l9k34n02j557K51k015Q51J648L036
13719A398O9j524J978J914P39j556l682J837K373l627n51J870o12M739K73k620
13703C018J665r01l191m596j352K641K826m36N38j678J090k7k438j035K095j23
13687a904k20R74n65k92K4M79R43o17k913k222L424J866j511L068N095M60l486
13670B603q41k096j198K499K182n28k637K511J630r42J426o291N00P14K93Q30
13654F55j995j687M1L05K034J60k953l378M073L593j854j505P6O871J944k869
13638C511k212k033K629j900m196K076K382L784K124n942j133n67M863R84k678
$$ y = [-385, -1028, -3443, -5379, -6445, -2206, 723, -1873, -2404, -3884, -3814, -2146, -2138, 959, 463, 384, 1670, 4788, 6068, 8623, 8174, 1186, 838, 4338, 4358, -41, -80, -314, -816, -2373, -2122, -4137, -3286, -1638, 1398, 1467, -57, 1921, 3835, 4574, 3018, -664, 1173, 3546, -81, -632, 1238, 626, 5365, 5638, 3018, 4683, 3782, 591, -4005, -5357, -2716, 110, -326, 212, -1466, -376, -403, -2841, -3876, -1781, -1904, -2124, -1150, -1715, -2007, -1983, -1504, -561, -1178, -4091, -6313, -2889, -1023, -2534, 534, 5629, 6089, 2603, 1762, -334, -1532, 967, 3149, 2621, -16, 2495, 4125, 3183, 4609, -1682, -1182, -468, -175, 655, -1340, -3027, -2986, -2681, -647, -487, -3440, -6818, -2745, 848, -1006, -2511, -2435, 4436, 6380, 3511, 1299, -734, 1895, -5, -4201, -2125, 257, 4041, 6165, 223, -910, -1477, 3386, 4370, 1692]
13623A692P21r79K061K902m9m103j898l613N03J034K051J996N24j093j993Q06
13607E62K438J371O324M798M539M963k132j2057o669J958k03j626k442k522J856
13592A158N938O806L805k068l588n283n754p74M039J171Q62k467j138R92p35m044
13576a080J178J491M56R14j145R16P94O67K726J477j8n16l496j147K723R91R077
13559A6008J2615J3148J8605N932j2839j6098j0791q401o168l274Q18N57O142
13546A6254O600N820O544n64p330n988n735m139p06o65m41L66L947o29K988K992
13530A9314O013O887J0710J9214L8200O1672N7006k724n1083n4396l6616j9109
13518E5088j0777o585l094J695M666J2233K3155O888j6397j9091j4125q113n418
$$ y = [1692, 2413, 1434, 3495, 6397, 6348, 2245, 347, -3266, -2763, -1729, 322, 2318, 2842, 1749, -244, 562, 3000, 4371, 10695, 15493, 20032, 24995, 22863, 10806, 4137, 6095, 5892, 4266, 1824, -698, 1158, 7096, 13902, 17707, 15639, 12051, 6768, 1014, 240, 4279, 5450, 6312, 3845, 2707, 3699, 2964, -1080, 98, 1589, 2045, 2959, 1814, 2730, 3524, 4191, 6917, 8394, 8376, 7860, 4364, 3217, 5940, 6931, 16008, 28623, 41771, 60376, 66308, 53469, 37371, 26580, 18179, 12011, 8737, 9555, 10112, 16254, 22854, 28674, 35218, 34654, 27324, 21336, 15601, 11462, 10756, 10091, 9650, 10016, 13963, 13334, 16322, 19314, 25327, 32214, 42924, 62138, 100338, 162010, 219016, 216292, 165209, 110813, 74197, 55088, 44311, 37726, 34632, 36327, 40993, 53226, 76381, 83269, 66872, 47781, 33656, 25543, 20125]
13505B0125p62K265J180J723J647L804Q511L575p752o893k869J743l145n87K33
13490B2798L880L176K192Q320J3627J3773J6840L1635N7004J00109J72904K16171
13478F62429N1824j60027j87721j28053p6231m9562k6597j5469n392k699J004
13467F3506J533m344j2512p664p150p027n014k111k060k25k63L83M21M36O298
13452B4207K211j419m110j412K630k298J342N503R796P277J1532N840M873J2868
13438G8840K8712N0997R2746J60168K16490J10725j29093k01136j48470q6458
13428A73521m8965l0080j8033j1343m578o264j0232n528m752l372j271n274k403
13415B1426O15J451j355k947Q84J713l506l836k94r94n20n52N59P40L987n62J385
$$ y = [20125, 19363, 21628, 22808, 24531, 26178, 29982, 38493, 42068, 34316, 27423, 24554, 26297, 23152, 22565, 22798, 26678, 29854, 32046, 40366, 53993, 67766, 84606, 116241, 173245, 273354, 446258, 662429, 714253, 554226, 366505, 238452, 162221, 112659, 86062, 70593, 65201, 62502, 63506, 65039, 60695, 48183, 40519, 33369, 26342, 21328, 19217, 17157, 16932, 16669, 17052, 17473, 17909, 24207, 26418, 24999, 20889, 19477, 22107, 19809, 21151, 26654, 36450, 43727, 55259, 61099, 65972, 78840, 107552, 158549, 251295, 411463, 627953, 738678, 609585, 408449, 259979, 173521, 124556, 94476, 76443, 65100, 60522, 54258, 44026, 38498, 33746, 30374, 29103, 23829, 21426, 22041, 23492, 22137, 19190, 20074, 21787, 18281, 14445, 14151, 13157, 12637, 12085, 12644, 13384, 17371, 16809, 18194]
13398A8194M305L216M259M093M440R588J7010K6306M3980P0302M7611k1422n9105
13385A72777n2414l2354j8206j6280p861j940r12M053M481Q367J1133J1060J1143
13372I3047j308l945o65N710J9146L1943L8360M9791M2559J0715o744P411N5674
13359C41694J47725K94170K97848p4587k98120k61452j57395q4587m7984l0906
13349A26406j9360j4205j1747r663l711k130Q24P152J5311J0075p008j1338q420
13336G2186j2390r979k769J886j316M264R062P305R386J5049J7854K1438K8059
13323A60035N0355P8839J15752J42515J13423k42j08378j33937j10779q3245n4610
13312A69728l4788k3344j2700j0896j4220q608o831n664m789j198K879M008M259
$$ y = [18194, 22499, 25715, 29974, 34067, 38507, 48095, 65105, 91411, 135391, 205693, 253304, 231882, 172777, 120363, 88009, 69803, 53523, 45662, 43722, 42810, 46863, 51344, 59711, 70844, 81904, 93047, 91739, 87794, 87129, 92839, 111985, 143928, 182288, 232079, 274638, 285353, 278609, 286020, 341694, 489419, 783589, 1081437, 1006850, 708730, 447278, 289883, 205296, 157312, 126406, 107046, 92841, 81094, 71431, 67720, 65590, 66414, 73566, 88877, 98952, 91944, 80606, 72186, 59796, 49817, 47048, 48934, 47618, 51882, 60944, 68249, 77635, 92684, 110538, 131976, 160035, 210390, 289229, 404981, 547496, 660919, 660677, 552299, 418362, 307583, 224338, 169728, 134940, 111596, 98896, 88000, 73780, 65172, 58341, 52677, 47888, 46690, 49569, 53577, 57836]
13299E7836O309J5630L3873M5168K1734k4447l9029k8381j7096q468k864j827
13287E8438O271J0129Q975J4340L3953N0119J7409p129M415L1275O6769J08328
13275D03292J42228J21348O479j04397j37024j14206q0706n3446m0760k7661j9767
13264I5380j5132j1423j1573q825m113k296l631l833o68k90L188M69K888M093
13250D4234j771m863o326n547k878j113l011J463L399k66J429N788L531N233P453
13235D6755R276J2299J6119K3883L5248M3446L6898O66l3190m5924l8450k8482
13223G8544k3041j1523j918j920p894p011l260l895M34l64k023o53L58l79K93
13208A5748k544Ok512m614j504l33m37k929J004P73L13J757l36L154K81K86M01
$$ y = [57836, 64145, 79775, 113648, 158816, 180550, 156103, 117074, 88693, 71597, 63129, 60265, 58438, 64709, 74838, 83813, 98153, 132106, 182225, 199634, 192505, 196920, 228195, 294964, 403292, 545520, 666868, 673347, 568950, 431926, 317720, 237014, 183568, 142808, 115147, 95380, 80248, 68825, 57252, 48427, 44314, 42018, 38387, 34554, 33886, 33596, 36784, 37253, 40141, 44234, 42463, 37600, 31274, 25727, 22849, 21736, 18725, 20188, 23587, 23321, 24750, 30538, 34069, 39302, 46755, 56031, 68330, 84449, 108332, 143580, 187026, 223924, 224590, 191400, 145476, 107026, 78544, 55503, 43980, 42062, 40142, 32248, 25237, 21977, 18082, 18516, 18152, 16129, 15476, 15834, 15455, 15748, 13204, 13210, 10698, 6084, 4580, 4247, 3810, 881, 1885, 2658, 2971, 4728, 4392, 7546, 7827, 8113, 8514]
13191H514J023N037J469l958l871r19k256m369k837J4n75L20o56J057J547K982
13175B522K927M848J21l595j966j002L929K214k532k878j250J090k112P4j590
13160H00Q56J668J662k72q89j791P03Q44j824J156L707K690K276j361l826k063
13144D336r95k52J56J072L5J636O16l623l385K656p45m99J720L204O007k810j287
13127G842j261j547l321m444J068M235J456j313q57J111q77k380L65J863m06j009
13111E25K431j73j709q87j152m4K51l907L30R98J006k171j292R71K070N90k849
13094e012N41N324M811M4k587n119J536J297J579J195P88j251R27j727j032k91
13078A023O49K08K219j720k86l353j487K326M022m020k109k671j529Q50j525M850
$$ y = [8514, 9537, 14574, 16043, 12085, 8214, 7295, 5039, 670, -2167, -2153, -2728, -2408, -3064, -2007, -460, 2522, 5449, 10297, 10418, 6823, 4857, 3855, 7784, 9998, 7466, 4588, 3338, 4428, 2316, 2390, 800, 1656, 3324, 4986, 4714, 3825, 2034, 2737, 3581, 1757, 2913, 6620, 9310, 11586, 10225, 6399, 4336, 3341, 3089, 3245, 4317, 4352, 5988, 6604, 2981, -404, 2252, 1507, 1008, 2728, 5932, 11939, 9129, 7842, 6581, 5034, 1713, -2731, -1663, 2572, 4028, 2715, 1858, 2969, 2092, -288, 77, 1940, 1534, 525, 2956, 2783, 1074, 187, -965, -1009, -758, -4665, -4335, -3337, -2331, -4502, -5794, -4823, -2753, -2163, -5012, -4471, 853, 5664, 5708, 3121, -1998, -462, 835, 2414, 3609, 4397, 3146, 4073, 2346, 1314, 1023, 1672, 1880, 4099, 2379, 2093, -1260, -2747, -421, 3601, -419, -2528, -5199, -6728, -5878, -7403, -2553]
13062b553M986J53j816M79l51J024m64l474j037L719l74j192K492P70K137J781
13046F280n59l39l799J031K553K165q19n265P10J977m10J399J710L75l579j018
13030B412j455J306r5j359Q51J935k1o379l492J596K460r31o14L39r32L483J734
13013H38k489m90j007O33N89L805N86k056k274O87P097K374j907l121k940j711
12997a386m3r12L269K26k052m023o62K616J725M088Q05k80l15m334L93j385m991
12980g261k899J044K050K882R47K722k418j737L833K270q88l946m508J75L874
12965c860M645m61k150p31K87L873J393J054R94M32M544K105k557o749l191K317
12949A945j334m77l84L646O72k639j718j268j813o08K801J314j83j13m16k644
$$ y = [-2553, 2433, 2586, 770, 1249, 898, 1922, 1458, -2016, -3053, 666, 292, -900, 1592, 2362, 4499, 6280, 5721, 5382, 1583, 2614, 5167, 7332, 6513, 1248, 1958, 3935, 3525, 4924, 6634, 7009, 3430, 2412, 957, 2263, 2168, 809, 1660, 3595, 3574, -2805, -6297, -4701, -2241, -3172, -3786, -3447, -4379, -896, 838, -1651, -2141, -3148, -2515, -1926, 1879, 2465, 409, -1865, -1178, 5919, 8293, 6386, 3265, 325, -1386, -1429, -2341, 928, 1154, -898, -4921, -5583, -2967, -1242, 2846, 3651, 3371, 3056, -1278, -885, -2270, -7261, -10160, -9116, -7066, -4184, -3237, -515, -2933, -4670, -837, 1433, 545, -3401, -7909, -7734, -3860, 785, 324, -1826, -2557, -2270, 1603, 2996, 4050, 5044, 5476, 10020, 12125, 9568, 2819, -372, 1945, 611, 134, -250, 3396, 4068, 1429, -289, -1557, -3370, -3978, -1177, 137, -46, -159, -575, -3219]
12933c219k717K708L75j076J372J408l73k76j449j978n48J939J82m251J80L764
12917c959K167k628q83L833N663J04L50j347P01k394n18J380l686l826l96N467
12901B8m66l269j04J905K49k04j54K939K860M73l851l59L510p60l318l955k216
12884f692J272n02Q82O87N87o31J78J416L302k455j085M477J421l004k053j158
12868c358P02j91J774K632J69J454k735o48n42J223K465k835l178L61J039M33
12852a235O46q35K04J56k6k78K432K515k340m013P85Q51L02M16j028L264M241
12835F057k632l093j970j162L53J169J93Q6J644l284j571J436m98O34J999K47
12819c92l062P22K125m56k419R63K709J4k562n55J770Q24K108l6o24K606M228
$$ y = [-3219, -5936, -3228, -2853, -3929, -2557, -1149, -1522, -1798, -3247, -5225, -5773, -3834, -3652, -7903, -7723, -3959, -1792, -4420, -5303, -1470, 4193, 4297, 4647, 3300, 4001, 1607, 1089, 2469, -1217, -5043, -5439, 28, -438, -3707, -3811, -1906, -1657, -1861, -2015, 924, 3784, 4257, 406, 47, 3557, 2797, -521, -4476, -6692, -5420, -5922, -5040, -4353, -3766, -4397, -4219, -2803, 499, -1956, -3041, 1436, 2857, -147, -2200, -3358, -2656, -2847, -1073, 1559, 1728, 3182, 447, -201, -743, 480, 2945, 110, -3068, -2707, -1668, -1235, -589, -1424, -1220, -1064, -1090, -1368, 1064, 3579, 1239, -2774, -1989, -1138, -836, -420, -1448, 1816, 6057, 3425, 332, -1638, -2800, -2447, -1278, -1085, -999, 645, -2639, -4210, -2774, -3272, -2638, -639, -392, -3454, -2732, -607, -1063, -3482, -2519, 190, 204, -2358, -2913, -1143, -319, 1789, 1753, 1129, 3735, 7963]
12802G963R89l314l574j521l616j113J525J186Kp48J667j902k022m8j99k03K095
12785b833J374k141M324J225j918K2n122j29J685K306K341k213j482k056k55J599
12769c273R2O92J335m291j037j104k07N92J653l52J452K163m181j116M310J590
12753a682J245K500p60p45j276k590m57j037j873Q43n55J07r76K043J403J925
12737a885L098j222k209L754j385Q70N470j920k036M513O285N801k293q191o702
12722A948j561j709j102J60K033q63k610R47J674N97k707k518k485J665L635m59
12706c355k049J828l43N53K939k292k357m28j120J889N027J384j598k578j202
12691c702J759j36k272j182m35O84k187M304k71J100J314p9Q97j49l68N47Q73
$$ y = [7963, 8952, 5638, 2064, 543, -3073, -4186, -2661, -1475, -1473, -2221, -554, -2456, -4478, -4526, -4725, -4928, -2833, -1459, -3600, 724, 1949, 31, 53, -5069, -5198, -3513, -1207, 1134, -1079, -2561, -4617, -4872, -3273, -3181, -2489, -1154, -5445, -6482, -7586, -7793, -7201, -5548, -5900, -4448, -2285, -6466, -7582, -3272, -1682, -437, 2063, 1303, 558, -718, -3308, -3765, -4802, -6675, -5832, -6387, -6280, -7256, -5213, -3810, -1885, 1213, -9, -2218, 1536, 151, 1021, 6491, 4571, 2535, 7048, 13333, 19134, 16841, 8650, 1948, 387, -1322, -2424, -2264, -231, -1094, -3704, -2757, -1083, -486, -3193, -5711, -8196, -6531, -2896, -3355, -5404, -3576, -3919, -3366, -427, -2719, -5076, -5504, -6624, -4735, 292, 1676, 78, -2500, -3702, -1943, -2079, -4351, -5533, -5968, -5284, -7471, -3167, -3438, -2338, -1024, -1103, -206, -355, -723, -176, 697]
12674F97J62j476j966j103l165j901L629N487L454r69m351l759K231M80l177n13
12658f240r5Q06r87J940P92M161L282k954j48L206K362j948n835l08J970L88J596
12641A988K8k515k181k463K164L919o90k082K279K398N9m183q83j399m99k23j517
12624e800m59L076J427Q33Q46K8j947m263J633M632j059k090j136j851J081J536
12608c513L771O698J332k639J674K417q69k764m19N824K524k564r52k404k612
12593E504K057L185n82n36L377J485Q048K1407J9955J2866n993j8934j6287j0225
12579B5327l440n575p316k865j995j661k574J943k31j01r27L217L495L322O81
12564A1300k06m746l415Q16J591l08J14r92J423M815O547J480k897p168o601P42
$$ y = [697, 859, -617, -2583, -3686, -6851, -8752, -5123, 364, 3818, 2849, -1502, -5261, -3030, -2550, -5727, -6240, -6335, -5529, -6516, -4576, -3784, 377, 3659, 705, 557, 3763, 6125, 4177, -1658, -1966, 4, 392, 1988, 2016, -499, -2680, -5143, -2979, 940, 250, -1832, 447, 2845, 2904, -1279, -2162, -3561, -4060, -4283, -5800, -6259, -3183, -1756, -923, -77, -49, -1996, -6259, -4626, 6, -1053, -3143, -4279, -6130, -5049, -3513, 258, 6956, 8288, 5649, 7323, 9740, 8871, 6107, 5688, 11512, 14036, 11472, 10520, 8116, 5504, 7561, 10746, 10164, 9628, 13005, 14490, 22538, 43945, 63900, 76766, 70773, 51839, 35552, 25327, 21887, 16312, 8996, 6131, 4136, 2475, -99, 1844, 1613, 1512, 585, 3802, 7297, 10619, 11300, 11094, 6348, 2933, 3749, 5340, 5032, 5146, 4154, 5577, 10392, 16939, 18419, 15522, 8354, 1753, 2495]
12548B495o41j925k565r39O159n56l228k306r2L50L872K70K999N017k030n887
12532I93j445J000Q18J027M58K559k115k38k78J828P311N941J850k872l523n066
12516H248l354J647k711j185o42O206Q913K957l960o714k803j422J383Q14j023
12501F354j374l622k736K00k960n07J715Q66J535j84Q49M72q48j274J961J867
12485B314n96l142k197l81J464L6q15N782J2387Q314j071o372r661m265J309j77
12469B929O53J508L819k52l290j527k843M15p10j65m21O11L433K510m81l61r99
12452D829m274j711k499M06J01k118K566L382j622k887k73K356j964J120Q30J348
12436d10K30M362J121l848K835L201k901k753p88J938k979k039j36j564p83j808
$$ y = [2495, 1854, -71, -2636, -3575, 2584, 2028, -1200, -3506, -3598, -3248, 624, 894, 3893, 8910, 6880, 993, -452, 548, 1366, 2393, 2851, 5410, 3295, 3057, 2779, 4607, 11918, 17859, 19709, 16837, 13314, 8248, 4894, 6541, 3830, 2645, 2003, 8209, 17122, 20079, 16119, 9405, 6602, 5180, 6563, 7377, 6354, 4980, 1358, -1378, -1178, -4138, -4645, -2930, -2064, -529, -713, 136, 608, -240, -1514, 447, 2314, 1718, -1424, -3621, -4002, -2538, -2502, -3317, 2465, 14852, 23166, 22095, 15723, 6062, 1797, 3106, 2929, 3582, 5090, 8909, 8657, 5367, 3840, 997, 1412, 702, 537, 116, 727, 4160, 6670, 6189, 5828, 4829, 555, -1156, -3655, -3249, -3148, -5266, -2700, 682, -940, -3827, -4100, -1744, -3708, -2588, -1758, -410, -180, 4182, 5303, 1455, 4290, 7491, 4590, 1837, 1049, 2987, 8, -2031, -2167, -3731, -4514, -6322]
12420f322K487J032j798J02q25o56K18J45j338r98N543L661l062j0J486P21n466
12403e080j520J679l63K173K684k112J792P92L051K736j303m984n39o75j855K5
12387c499L32N61J713P89p80M05j541L60K332n63j1j425M402L009j95n421k287
12370a819r96K839M66N6J579q93l037l115j667K291k110j49L192N429J472k254
12354A284n76j86k748l42Q31j74J98j206R42J517J673j937l987j304L051Q36J627
12337e01J197J906R93k940J36J985j359k526j570k016K276P25n24k33M549J018
12321C116J272Q97r16j003o63J053R82j620m271j616Q37J585o15J336Q65j724
12305d85m34K170J87k412j849K88l905J011L830m7Q41p33j489J533K204Q40k676
$$ y = [-6322, -3835, -2803, -4601, -4499, -5324, -5980, -5762, -5617, -6955, -7953, -2410, 1251, -1811, -1821, -335, 386, -5080, -6600, -4921, -5284, -3111, -427, -2539, -747, 45, 3096, 5832, 4529, -455, -994, -1669, -3524, -3499, -3167, -2606, -893, -104, -884, -479, -2020, -1660, 672, 109, 98, -1327, 3075, 6084, 5889, 468, -1819, -2815, 24, 490, 546, 2125, 1232, -1805, -4920, -6587, -4296, -6406, -6555, -3363, 2066, 3538, 1284, 708, 522, -2226, -2568, -1737, -1911, -1713, -2919, -1977, -460, 1213, -724, -4711, -6015, -2964, -2128, -501, 696, 2602, 3595, 655, 791, 2776, 1417, -1109, -2679, -4695, -2419, -1694, -2218, -2451, 2098, 3116, 4388, 5285, 4369, 3366, 2703, 3756, 4738, 3118, -1153, -2769, -1932, -347, -962, 374, 1239, -485, -919, 1251, 1438, -974, -2823, -2535, -6440, -5429, -1599, -1646, -805, -1538, -3027, -1494, 710, 1550, -1126]
12288a126l305O80K009R9L555M287j996k243k190P22l266n76k75N85j00J545M440
12271B845l130l184J273J429Q57J54n04j29L491K810k706k906K047M53o37p29
12255A434J169k805j982j192j520k188J303K697j52o63J333P68J944Q85J353q21
12239A563k898j474k833k295J031J288J995J100J101l348n963K498J718J707N84
12224d226L82L132p46j691k371n037N56M278K468j23L098j067k053M60p10n50
12208d200J011o65j050M158L579J146j227j772k308p87k208J561K856j255K864
12193A703j075j642k19K392q16j781J094K484J897k569j490J36j15J296J343l656
12177a018l198R79J592j547l368J39k3L083K790J681O51M22p04K143J539k479
$$ y = [-1126, -4431, -3751, -1742, -1643, 1912, 6199, 4203, 1960, -230, 492, -2774, -3350, -3625, -3040, -3140, -1595, 2845, -285, -3469, -2196, -767, 90, 244, -260, -389, 3102, 5912, 3206, 300, 2347, 2800, 2163, 1434, 2603, -202, -2184, -3376, -4896, -7084, -5781, -3084, -3236, -3899, -2566, -1798, 146, 1031, 2384, 1563, -1335, -2809, -5642, -7937, -6906, -5618, -3623, -2523, -1422, -4770, -10733, -8235, -6517, -4810, -4226, -3844, -712, -1458, -3149, -5520, -10557, -10001, -5723, -3255, -3378, -280, -1347, -3400, -2940, -3650, -4200, -3189, -3854, -4904, -746, 2833, 3979, 2752, 980, -1328, -2115, -4323, -2762, 94, -1161, 1703, 628, -1014, -1233, 1159, 343, -1438, -344, 2140, 4037, 1468, -22, 114, -1, 1295, 2638, -1018, -4216, -3237, -1645, -3192, -6560, -6421, -6444, -3361, -571, 1110, 1761, 2183, 1479, 3622, 5161, 2682]
12161B682j774m239k255o7K709K72L543J091j492j846j777j822p9K250J788R2
12145i24M43M71o08J013k934q21J327J5l701J161M828o1K70n80K9m08P93K521
12127B834K670K77m381m40j437J155j126r45Q97N26K166j206k644j368l975K60
12111f737M320L603J377j093q70n06j095m07L37k193k564j694K034M3m326K007
12095g764L905K356J57P13k52k598R64j982j825J930L468K793j003N37J323k043
12079F79k933L08k977J141J560K232R29l630j852j618J651J640o73J135k28n87
12063c223j523K793M29m40J014o78l671N42K998J407n72L260p8k801j517R03m02
12046a559l70K038L022L80n38r69K594J002l189l927J50J140n31k483l365M906
$$ y = [2682, 908, -3331, -5586, -5653, -2944, -2672, 871, 1962, 470, -1376, -3153, -4975, -5054, -2804, -1016, -924, -481, -10, -618, 395, -2539, -3360, -2033, -2018, -5719, -4558, 270, 209, 479, -101, -72, -480, 313, 2834, 5504, 5781, 1400, 960, -477, 678, -448, -1393, -496, 30, 2196, 990, -1654, -3022, -6997, -6737, -2417, 1186, 2563, 1470, 600, 94, -1001, -1408, -1071, -3264, -5828, -7522, -5488, -5445, -9771, -7764, -3859, -1503, -1346, -633, -885, -3483, -2519, -4501, -6326, -4396, -928, 1865, 862, 1399, 2722, 679, -2254, -1946, -4923, -3782, -2222, 10, 939, -2691, -4543, -6161, -4510, -2870, -3543, -2408, -2636, -3223, -4746, -1953, -1524, -1964, -950, -1628, -5299, -4757, -1759, -352, -924, 2336, 2258, -543, -2060, -1157, -1559, -1929, 109, 3131, 3511, 2973, 2004, 4598, 5600, 2411, -1516, -1366, -226, -757, -3240, -6605, -1699]
12030a699K969k427j536l82L771K223k880m238j129K06J695L913M80K80j510m17
12014f81j374m274J178L24p89o47p99K579J488j190J111k002j489J474j554J546
11998e099N607Q0j614N63J308N21p39K097k274J03M85j741j00J259n74j919J351
11981f86K692k514k426M17n49j550J79M138k37j404m92L292J360k883R73J438
11965A748k203n72J443O34J385k949o58j844k016K655J620J64M151k860J279j278
11949F99m435k126p94K739K724Q25M80n543p66N9k60k96K940J989j528K133M315
11932C155l708m798j6j229p37L53K235p9K53J382J154K158j950j055J328L506
11916A952l02O67k053j815j320j775n50L60J542K236J190J94j735l077m9L401
$$ y = [-1699, 1270, -1157, -2693, -3075, 696, 2919, 39, -4199, -5328, -5122, -3427, 486, 966, 1246, -264, -681, -2055, -6329, -5151, -4827, -5616, -6263, -7062, -4483, -2995, -4185, -3074, -5076, -6565, -5091, -6645, -5099, 508, 588, -1026, -463, 845, 1366, 627, 2724, 450, 553, 1038, -703, -803, 456, -118, -2037, -686, 2006, -508, -2934, -2517, -3066, -4616, -4437, -299, -536, -1940, -2432, 860, 2220, -663, 310, 1748, -455, -1027, 416, 1050, 2435, -514, -1172, -3016, -5032, -2377, -757, -593, 3558, 698, 1977, 699, -3736, -5862, -6656, -3917, -1193, -368, 112, -5431, -6197, -6138, -6398, -6694, -3754, -1765, -3293, -1160, 3155, -553, -5351, -5367, -6596, -7333, -6980, -4745, -4824, -4571, -3189, -2035, 123, -1827, -2882, -1554, 1952, 1650, 2317, 264, -1551, -2871, -4646, -5196, -4836, -3294, -1058, 132, 326, -1409, -4486, -4535, -1134]
11900a134J398p091j113L907M072L996N33j519j476k143N03M0J097p67l322K605
11884d14J796n641j649N78K809O53K01K280Q00L497J561m817m050L460o71m222
11868c829m061K35K773O504M335k99k295k257l545L458N004j751Q33j566k066
11853A473J059j960l51m27k156r23K73M767O2j719k613k131j829j035J619J720
11837d171Q9L776q33l399N60j52Q00P18M360k41j051m04J368j594N23k44k622
11820b517J24K342n05j396j385q13j549J439J03M46K91o48m72L238K40j925K439
11803e48J051n361q54L579J79k41K019L71K768k704l063J571j322J625J650Q44
11787A564k512k619k025M27J988J376K449j068O24j155j879P93J17N30Q63j363
$$ y = [-1134, 264, -6827, -7940, -4033, 39, 4035, 4568, 3049, 1573, -570, -67, -27, 1070, 303, -3019, -414, 1382, -4259, -5908, -5330, -2521, -1868, -1667, 613, 1413, 4910, 6471, 1654, -2396, 1064, 393, -3829, -7890, -7655, -4882, 1622, 5957, 5658, 3363, 1106, -2439, 1019, 6023, 4272, 5105, 3539, 1473, 2532, 572, 221, -206, -2362, -3285, -3012, 1755, 1817, 98, -2515, -4646, -6475, -7510, -5891, -4171, -4082, -306, -1139, -4538, -3978, -4130, -3330, -2612, 1748, 1507, 456, 52, 1420, -174, 349, 105, -2517, -2393, -51, -556, -1952, -3337, -4150, -5699, -4260, -4157, -3711, -3420, -4068, -4540, -1302, -1062, -2987, -548, 503, -4858, -5712, -2133, -1954, -2195, -176, 195, 2963, 259, -2804, -1233, -2555, -930, 720, 1564, -948, -3567, -5592, -5165, -3177, -1801, 648, -420, 204, -951, -2830, -2037, -1920, -1390, -527, -1890]
11771a890j722O80l910j233K872J316O09q76l79p05n39j015K813K392L292j85
11755A520j297j426l205l52K441M66Q77o50J77J400j822K064J487k511J429K855
11739C453j082j570j727j794l098pL511J101J191R05k287m27J869M62k476P96
11723a180J754r68J261j086R04o33J145j25k930j536J746J022j838r25j071j358
11707e818M269K447l691j871K847M75j125K264m19k322k91l311M083Q86n002o06
11691g185p29m6L51L963K822K2J539j079m515l991K858K384k781O27L800m24n56
11674b940J584J586n041m480R91O99M538M97k544M401L658k652k102J447k36J652
11658A058J264O79Q83j276j900J259K385j510l904j250o24L724J742l565l131
$$ y = [-1890, -3612, -2932, -6842, -8075, -5203, -3887, -3278, -4154, -4533, -5238, -5777, -6792, -3979, -1587, 1705, 1520, 223, -1203, -4408, -4760, -2319, -1853, -976, -1626, -1449, -49, -1871, 193, 1680, -831, 598, 3453, 2371, 801, -926, -2720, -5818, -5825, -2314, -1213, -22, 883, -1404, -1831, 38, 500, -1976, -1180, 574, -394, 867, -219, 685, 52, 1197, 1072, -1858, -3394, -1648, -626, -2464, -3389, -4460, -5818, -1549, 898, -2793, -4664, -1817, -1342, -2467, -203, -622, -2944, -3235, -6546, -2463, -1577, -6579, -7185, -7914, -7960, -7609, -3646, -824, -802, 737, -342, -4857, -8848, -5990, -3606, -6387, -5760, -1960, -2384, -2940, -1356, 230, -4811, -9291, -8300, -7601, -3063, -2566, -5110, -709, 2949, 297, -1805, -358, -594, 1058, 2322, 3001, 3884, 2608, 708, 1967, 4352, 2842, -1062, -2312, -2936, 788, 2530, -1035, -4166]
11643d166p86qK806K943L096j054m276k952N82P43n70k999L63K35j816J503j020
11626g376k665k596L485K027M252k43j492k222L47k785j748J67k413J494L262
11611h506MJ688J18K007L431k586j132M40P5P3J381l65j125M92j136k32q96n29
11593f798j882q90O84J579Q67n52K996M066J087j061J293J199M18J939j627k466
11577H52l193n65j939k843j926K935N218k07l15n34r7L165J335J81r22j188N40
11560D97M83p46R69K99l055O56q09j43L998j440k734J054j733J26j757J42j30
11543d323K8K456K995K033m97l178l406J244K12Q75N82K78O06q52j693l23l720
11526f683o46Q54J195n27J354K880J517k846q92j52J784N459J450m508n833l88
$$ y = [-4166, -4952, -4960, -2154, 789, 3885, 2831, -1445, -4397, -3815, -3072, -3642, -6641, -6278, -6043, -7859, -6356, -7376, -10041, -12637, -9152, -7125, -2873, -3116, -4608, -6830, -6483, -9268, -11016, -10849, -13262, -11768, -8506, -8502, -6814, -6696, -4689, -1258, -3844, -4976, -4536, -4461, -4388, -3007, -3372, -4497, -4005, -5141, -5373, -6269, -6798, -8680, -9570, -8886, -7307, -6440, -6992, -3996, 70, 1157, 96, 1389, 2588, 3006, 4945, 3318, 852, -2341, -2906, -4845, -7688, -9614, -6679, -1461, -1668, -1983, -2517, -2614, 551, 1886, 2067, 1145, -43, 497, 980, 234, 1203, 1502, -1553, -897, -1706, -1849, 2149, 709, -2025, -971, -2704, -2578, -4335, -4193, -4323, -4295, -1839, 1156, 3189, 2692, -486, -3892, -2648, -2436, -1561, -979, -701, -95, -947, -2640, -2963, -6683, -7329, -6475, -5280, -5807, -4453, -1573, -56, -2902, -3794, -3946, -2162, 3297, 4747, 239, -5594, -5982]
11510e982j673J962M290M09k028k866k332j189K033J917j28K08j628J067M99j615
11494g056K295N774L40k557k606O31J638K279O07m1l817l568j518q0K003L157
11478b519L422R21k276Pl442k131O73M83j70k705k411K680K966L172M87K479j728
11461i2m690J230L507O84j25l25j320j335K089k17j427l033J646J615K622j988
11445a159n293L698K083k320k113j366J117J195P77K342j973j796O51Q37K850
11430d70k86K122K850k384o15k125j495L437r59m048J9j34K796j858j21J06L403
11413B38K094j379Q72R06j769j209j535J271J173p79N60M13k623m38Q63j673k323
11396e338K212N63k058N43J958P08j406k550m30P78K469M330k246o544m516L069
$$ y = [-5982, -7655, -5693, -1403, -994, -3022, -5888, -8220, -9409, -7376, -5459, -5587, -5379, -7007, -5940, -5441, -7056, -4761, 1013, 1353, -1204, -3810, -3179, -1541, 738, 1345, 1304, -2513, -6081, -7599, -7679, -5676, -2519, 903, 1824, -452, -445, -3887, -6018, -5345, -4862, -5032, -7737, -10148, -7468, -4502, -1330, -843, 1636, -92, -4782, -3552, -45, 639, 514, 189, -1131, -2466, -377, -594, -2021, -5054, -3408, -1793, 829, -1159, -6452, -2754, -671, -2991, -5104, -6470, -5353, -4158, -3381, -1039, -3012, -4808, -4157, -3320, -470, -756, 1366, 4216, 1832, 1217, -908, -2403, 1034, 75, -3973, -3954, -4088, -1292, -3150, -3271, -3165, 238, 2332, 953, 1825, 2731, 962, -247, -1782, -511, 662, -117, 443, 856, -1767, -2205, -1342, -3015, -5338, -3126, -2563, -4621, -4078, -2120, -1412, -2818, -5368, -5798, -5020, -2551, 1779, -467, -7011, -11527, -8458]
11380h458j640M469P115N94J818J117j927m512l419L084O41l747r05K989L089
11365C08K05R33J641n090N69j899n85L439R65o682k651K193J936O018K450k339
11349A411K42j880l132l18j48L020Q81M567Q65l440n057R78M855q60O86j804k371
11332a505p05J567o03J222Q99m477l837J549P55K590J590R72k407j052J046M26
11316a970J93q1J859O14j179l687N26N927J514M75j564j842J213K426n33k068
11300A823k104M88J448J559L469j434m847K576K671K410L78k739k160J75j4q10
11284B889J19k146m206k035N25K696N359J245o155j600L246M423k625l146q32
11269b243r47k120K15l716j984K465J834L910K563m99k693J795Q1l07J200L60
$$ y = [-8458, -10098, -5629, 1486, 2080, 3898, 5015, 3088, -1424, -4843, -1759, -1118, -4865, -5770, -2781, 308, 513, 1446, 3087, -2003, -1434, -3333, -3918, -479, 486, -6196, -8847, -6654, -4718, 1300, 3750, 1411, 1653, -227, -3359, -3677, -3825, -805, 76, 4643, 5508, 2068, -2989, -2011, 2844, 1984, 2670, 866, -1505, -2210, -643, -1246, -24, 875, -3602, -7439, -5890, -5135, -2545, -955, 17, -2390, -3442, -2396, -1970, -1777, -1858, 1, 615, -564, -4251, -3725, 2202, 3716, 4191, 2627, 785, 1998, 4424, 3891, 1823, -281, 207, 1655, 3214, 6683, 5249, 402, 2978, 5649, 8059, 8437, 5698, 3538, 3713, 3699, 2889, 3008, 862, -3344, -5379, -4854, -2158, 3201, 4446, -1709, -3309, -63, 4360, 1735, -1411, -2243, -3190, -5310, -5095, -8811, -10795, -8330, -6496, -2586, -23, -522, -3215, -1420, -1339, -1646, -446, -86]
11253h6n02k605j826L342J255k969o67j377l168P63J479J859J08J502K488J538
11237A134J131M6j153n72k133N00J455K589k7l056J735M3q01q0P51j996r68j425
11219b827L51R07l418l086o49M065J396k179K240J765K87L062J223j413r6J144
11203B772j190L26J513j613l058l29L43J030K916l06p4j401J068J28l335J457
11187B47n58j793K447j418r54j639j616M162o49k51k155Q13o09K45k00m01L058
11170a271J836O22J245M11k154l310J342k281j445j00k211j493L837M140j644
11155b476J687K866J079m232l433R53J014l28m85R50J885M79k783j637N1J052
11139c358j491j754K764j241N1j028m45j63L188M854k965j307n96J454O44Q83
$$ y = [-86, -588, -3193, -5019, -1677, -422, -3391, -4058, -5435, -8603, -7840, -6361, -4502, -4394, -2892, -404, 1134, 2265, 2311, 1158, 586, -1547, -1047, 408, 2997, 2970, -86, 1649, 1692, 891, 811, 1562, -434, -1402, -2827, -2476, -1569, -4987, -8073, -8722, -4657, -3261, -5440, -3200, -1435, -1148, 1914, 3137, 1724, 1628, 2772, 1582, 1908, 3421, 1808, -1250, -1579, -1236, -206, 2710, 2404, 2330, 929, 1997, 2125, -1210, 247, -311, -2104, 343, -1075, -2029, -3668, -5284, -1122, -1771, -2022, -4177, -3364, -3973, -3728, -3928, -4329, -1271, 565, 1187, 2432, 2843, 689, -2621, -1279, -3560, -5005, -5105, -7316, -8809, -4972, -832, -2476, -789, 2077, 3156, -1076, -4509, -3556, -2542, -2870, -3355, -2405, -520, -41, -2824, -4461, -4410, -3358, -4849, -6603, -3839, -5080, -5029, -6057, -6502, -6665, -3477, 1377, -1588, -2895, -3491, -2037, -1393, -510]
11123e10R98J686k59l235k878j670m36J769K335M708k572l377j263P48K202J786
11107C2q3j673K097n09n231k313L189K660Ml631j294N84K409J972K707k536j295
11090b911J133k134j839L329K444P6K972Nl008n70P21k41j660l398J662M28l055
11073f046k591N463L118j148j538J23K181J508j027l31J471o49k673J249k523
11058c413J121J271L94k592m535j471k00J407N036J869J887l0k280l370m05K03
11042e108n58n10P16K09j822o92K922k01k629Q74K031L314l090m476j674M94J521
11025h679K433K708N928J091m462k762j645J898j356P92N72k24k21n71j916P88
11009e626L718K627r47k728J123L789k285k294L12L765L097K501j026j101k714
$$ y = [-510, 488, 2174, 1915, -1320, -4198, -5868, -6304, -4535, -2200, 2508, -64, -3441, -4704, -3956, -1754, 32, -51, -1724, 373, -136, -5367, -7680, -4491, -1831, -1827, -5458, -6752, -6168, -3759, -1787, 920, -1616, -2911, -1778, -3912, -5751, -2422, 22, 98, 3070, 3075, 67, -503, 218, -23, -1683, -5081, -3419, -2991, -6046, -8637, -3174, -56, -1204, -2742, -2619, -438, 1070, 43, -288, 1183, 534, -2139, -890, -3413, -2292, -1021, -627, -3219, -7754, -9225, -9425, -8018, -2982, -1113, 774, 744, -1536, -4906, -5311, -5108, -5666, -6176, -5460, -5251, -7073, -7765, -4843, -5044, -7673, -6799, -4768, -1454, -4544, -9020, -10694, -10200, -8679, -6246, -3538, 2390, 3481, -981, -3743, -5388, -3490, -4846, -4054, -3482, -3706, -3927, -4498, -6414, -5626, -1908, 719, -228, -2956, -1833, 1956, -329, -2623, -2311, 1454, 4551, 7052, 6026, 4925, 2211]
10994B211m663O47K126O89J774l877l008k221j459L005K290J939k370J009K039
10979A31j89r01mO12J732K901l345m765m98J757O29k231L75j644n77J813L3J50
10961d021m46k127l23J120J283J094j012j765O26K872j15k86R49M24K482J125
10945A880Q38j612j403J041R37K232k396l94R79k265k637L07K809n89K52r58J698
10928G19J311j639j660j048J548o16j151j237K896L928k81k818O07l96J258m57
10912I64n144j775J770R69K8j226K250J418K08l170j549N381L417j127p52k283
10896f21J738Q27j588J026k058k066K11J73J607j82k304l68J864K265j630l626
10880d732j820r0J877J512L046k017l503K046r00l864J908K990L075J829o74l07
$$ y = [2211, -2452, -1805, 321, 1010, 2784, -1093, -4101, -6322, -7781, -4776, -2486, -547, -2917, -1908, 131, -58, -959, -963, -351, 1381, 4282, 937, -3828, -4326, -2569, -1940, -4171, -3796, -5440, -6017, -4204, -4171, -4021, -4467, -6594, -6917, -5797, -4514, -3420, -4432, -6197, -5571, -2699, -2814, -3100, -2151, -1727, 755, 1880, 2718, 1106, -297, 744, 1681, 3913, 1517, 1123, 2102, -163, -2800, -2493, 316, -273, -21, -979, 719, 2030, 391, -1269, -2317, -769, -1385, -2536, -3773, -877, 3051, 2770, -48, 559, 163, 1421, 964, -4180, -5955, -4185, -3216, -3188, -4414, -2164, -746, -538, -3708, -5257, 124, 3541, 2414, 1662, -621, 1117, 1944, 356, 1382, -676, -2742, -2531, -2358, -751, -933, -3237, -3605, -1741, 524, -1106, -4732, -6552, -6642, -4765, -3253, -207, -2224, -5727, -3681, -4581, -8445, -6537, -3547, -472, 1357, 683, 376]
10864C76J044m444P95k228l374R28N131M234l86j462j227J323j520j372j7J30
10848b069r56j54M17p34L074O06k380m883m21J028L170J600k184J796L312o65
10832E57j289J742J146l227k902k453K885j118p58k253J467J669P43J394K35r36
10816c098q60L179j485j319r12J802O01j014P6l41m217N22K145l52l7J85j154
10799f279K128J31l945K029L421J048j74k482q86K522K579K362m86j23r60N02
10783A387J250j017q69l925m734M0K856K333J214j715k389k83L447M061R80m12
10767B224m14Q40k400J629j552k225O00m01J322K071j546j339k003k373Q2J920
10751c565N760q69J672L40j510k064q56K396K813k305k779M95k41k554J43R33
$$ y = [376, 1420, -3024, -2229, -4457, -7831, -6903, -1772, 2462, 2076, 614, -613, 710, -810, -2182, -2199, -2069, -3025, -3179, -2762, -3496, -422, 184, -2196, -7079, -7500, -6472, -3302, -1702, -3886, -2090, 1222, 557, -732, 1010, 2156, -1071, -3973, -6426, -3541, -4659, -5417, -7670, -6203, -4534, -3791, -2397, -2162, -3098, -3958, -779, -2264, -3583, -4495, -2693, -2092, -3106, -3030, -3371, -7588, -7066, -4921, -5273, -5310, -5125, -6279, -4151, -4020, -7965, -5936, -2515, -1467, -1641, -4123, -5009, -2487, 92, 2454, 1968, 1845, 885, 1387, 2637, 1620, 751, -3174, -7908, -7868, -5012, -2679, -1465, -3180, -5569, -5852, -2405, 1656, 2636, 2224, 1810, 2650, 250, 1879, 327, -1898, -1298, -1699, -377, 1694, 148, -1191, -3194, -5567, -5485, -3565, 2195, 1326, 2998, 3338, 1828, -236, -1092, 1304, 4117, 1812, -967, -472, -713, -3267, -3124, -2191]
10735b191P92QR84J693k813M63K56j021k545q20M286J720J253j996j520K434M031
10718E014K23k575k86r8k359k231L63J833n48k386J944j566j768N24L92O43M96
10701b385J26O5K336j460n06K928q00l407m99k7M164L316J256L64j475k890o41
10684D65j351J021M72J813l53k454m100o82K108K582m02m44j265K130R9J272M13
10667A324n43k663J588k400p86K962K062j282j770j656n36J12K878Q85k853l1
10651b709k9J64k916O33R78j192K931K558J407j43m253k439K843j779J009r79
10635c916Q01J16j352j08N37K015J539m95q47l914j101K340K874L72k16m7o97
10618b099O47j446J495K284m66j414j317J844J885n09K92j683k613l76q0R40j760
$$ y = [-2191, -1399, -1391, -407, 1286, -1527, -1064, -808, -1829, -4374, -5194, -908, 812, 2065, 69, -1451, 983, 5014, 5237, 2662, 2376, 2278, -81, -2312, -1949, -116, -664, -3050, -1106, -2672, -4440, -3916, -3524, -2881, -2385, -2259, -2194, 142, -1318, -1824, 1104, 304, -3103, -3602, -3629, 535, 3851, 5107, 5471, 3996, 1106, 465, -886, 135, 607, 2420, 2067, -387, -4487, -5169, -3061, -479, -881, -1325, -2590, -460, -361, 911, 1324, 781, -1882, -294, -2694, -3480, -518, 1544, 262, -1508, -3164, -3700, -3588, -710, 175, -2678, -2709, -2738, -2574, -5490, -4857, -3879, -5071, -2140, 418, 1825, 1682, -2571, -5010, -2167, -3946, -2937, -3916, -3115, -2999, -4351, -4459, -3922, -1907, -368, -863, -1710, -5624, -6725, -4385, -1511, -1139, -1355, -1402, -2099, -1452, -2898, -1403, 881, 415, -999, -2316, -472, 1413, 904, 1196, -487, -3100, -3476, -3556, -2616, -4376]
10601d376P35p05j590O06L166J72r23k05L249J154K402l515l902J845J1Q22j508
10584b562j89K172K071J644m9m505j992n83k283K00J275m00R90L527L18n92k05
10567a163J705J75mq41j401M346J184l55m166j882j747L24O72k445P05j42K996
10550b039J332K218o01k45J156N97J281j113j0j688k127l309j647j396r96J788
10534f799K163J995j98k13M79Q14J236J142n69M74L87l571k217R24j274p04J045
10517d886n19J854M322M075p60j256m301k100r76O55O26K97l92k924r03K656p74
10500e306Q77N74P95K410N64j276o08L049K007j695j523P94p06j777n198l257
10484a0276O76M367N165O65Q17l102JL072k012j907j681K490J788j530q12r3j00
$$ y = [-4376, -3641, -4346, -5936, -5330, -2164, -1992, -2915, -3120, 129, 1283, 3685, 170, -3732, -1887, -1876, -1054, -2562, -2751, -579, 1492, 3136, 3087, -1418, -3410, -3993, -6276, -6076, -4801, -5201, -4211, -684, -366, -958, -1163, 542, 717, 713, -128, -1529, 2817, 4001, 3646, -520, -2402, -4149, -3825, -3153, -5598, -4893, -5035, -2039, -707, 1511, 910, 665, 1821, 2418, 3699, 2586, 2576, 888, -1239, -4548, -6195, -7591, -8587, -6799, -4636, -2641, -2839, -3052, -2573, -1759, -523, 619, 50, 524, 911, -2660, -4877, -3953, -5227, -5931, -4886, -5405, -3551, 771, 4846, 4086, 2830, -1471, -3571, -4547, -3892, -3266, -2969, -3361, -6285, -7188, -4532, -5306, -4429, -3855, -3060, -650, -86, -1362, -1970, 1079, 3086, 1391, -132, 662, -44, -1821, -7019, -10276, -9600, -5233, -68, 597, 1414, -1688, -1687, 1385, -627, -2534, -4215, -1725, 63, -1467, -2279, -2372, -2472]
10467b472o47l535J299N60J778J332K164m1j705j006J799K055N11j214J28Q88
10451A894j750Q77n07Q68p83j603k840j056J819M6J587K123k905l689L5j543O24
10434f803N46P16k304K567J828l19j355J18J056L185j105R05P44j97N36j256l081
10417d219K167j921j965J454K089J670K957r25N13k260o15J260N18o10P05J73
10401I91O71L276o92l478R11n89k007r44q78j932l905J590J762J582R53J638l027
10384d078J274K812J912M72N7k197J125j453P82p4j841L205k129j401M372K357
10368E195L404K482J823J513R72L26L604J291K36k710K301J2095K0443K4953L1711
10353A09639L0073L5551M1468M1317K9086J1730n22p423j8050k8066m0140l7129
$$ y = [-2472, -3119, -6654, -5355, -4795, -3017, -1685, 479, 438, -1267, -2273, -474, 1581, 2092, 878, 1006, 1894, 144, 1021, 514, 1382, 599, -1004, -3844, -4900, -3081, -3035, -1448, 675, -2230, -5919, -5884, -7427, -6803, -6257, -5541, -7845, -5278, -3450, -3769, -5124, -5006, -3950, -765, -1870, -965, -221, -418, 118, -1138, -4219, -2052, -3973, -5938, -4484, -2395, -725, 2232, 1307, 1820, -440, -1055, 205, 723, 113, 818, 991, 1662, 4938, 4246, 768, 1679, 1090, -917, -1861, -2739, -4671, -8576, -6986, -5224, -3642, -2689, -1051, -4078, -2804, 8, 1920, 2392, 2449, 252, 1377, -76, 706, 632, -1209, 1996, -133, -1534, 2838, 5195, 8599, 11081, 12904, 14417, 15389, 15715, 19319, 20610, 20846, 18136, 20437, 32532, 52975, 77928, 109639, 139712, 175263, 216731, 258048, 287134, 298864, 298342, 290919, 272869, 244803, 204663, 167534]
10341A67534l1300k7897k6443k5314j6899p820p903m171L639r93j282m165l186
10328A3800j557P49j258k337p34r81k771l309k973Q26L122R61N70j993k403J628
10312A340m84R86R05k416J881K79j876l809J085r84K287J595j594K921M557j997
10296D676n64M77j809j974l234J665J610l357j705k269K81K331J31J995q96J991
10280f51M045j08l388k829J418J909r99k94K162j303j101K030K23K744L868p51
10264F975n0k067O86J966m068l590o33k506k488J935J009Q72L042J09p21q13J302
10247I60Q05Q02j17j232q35j309J510o59L822L22l553j491J217K0Q30M91L46l916
10229a987j061J968l184O1K619p77J690L483L83j513j152J890j392J15j230N85
$$ y = [167534, 136234, 108337, 81894, 56580, 39681, 31861, 23958, 19787, 23426, 22433, 21151, 16986, 13800, 12243, 12992, 11734, 9397, 8663, 7682, 4911, 1602, -1371, -545, 2577, 3538, 4108, 2115, -288, 1340, 856, 1842, 2747, 331, 2212, 2491, 615, -3194, -2109, -3093, -806, 789, -805, 2116, 6673, 4676, 4112, 4589, 2780, 806, -2428, -763, 847, -2510, -4215, -6484, -6203, -3872, -3741, -1746, -2642, -651, 3394, 3286, -102, -2931, -1513, 396, -603, -897, 1265, -38, -1139, 891, 1114, 3858, 7726, 6975, 6925, 4858, 5544, 7510, 3442, -148, -781, -3287, -5775, -3840, -2831, -1959, 1083, 1192, 471, -342, 960, 1765, 2567, 2450, 1218, 383, -926, 584, -75, 3747, 4069, 516, -975, 242, 262, 1092, 1583, 1929, -1987, -3048, -1080, -4264, -4203, -1584, -2361, -671, 2812, 3195, 1682, 530, 2420, 1028, 1143, -87, 498]
10213D98J681m49k919j534N7J341k07j315J190J876J191l477n40l99J072O4o60
10196b530M042K567q77l034J159L486k814j445m46k447j968L160K239l06r6N044
10180E734k476l703J302r15J084n47l726K053M033K378o42k58p82j478J467n9
10164C465k238q01o06j189O2K99J843k27j638J053j448n10Q43K51K28l063j318
10147d994q87L394M086L685k102k372k445m015j853K641L822K796K28l423j214
10132b653k095J074L302M166m89l836J49j316k082L93J385k36k750J23K875K076
10116H6Q34K125J523k170j669k15J124P1j312l10k54J125L238j966k300K699o72
10099A957k115J627o22k289n64J207J085J99K464K015L853j368m660k584J810
$$ y = [498, 2179, 1730, -1189, -2723, -2666, -1325, -1532, -2847, -1657, 219, 1410, -2067, -2607, -3006, -1934, -1870, -2530, 1512, 4079, 3202, 168, 1327, 4813, 1999, 554, 108, -2339, -4307, -1147, 1092, 786, 690, 5734, 3258, -445, 857, -58, 1026, 479, -3247, -1194, 2839, 5217, 4575, 4317, 3535, 2057, 3524, 3465, 1227, 426, -180, -1369, -1307, -1008, 835, 608, -1030, 23, -1425, -1935, -1092, -841, -613, -3676, -4994, -5881, -2487, 1599, 5284, 3182, 810, -1635, -5650, -7503, -4862, -1040, 1756, 1984, -1439, -2653, -4748, -3674, -372, 3794, 3305, -531, -382, -1698, -3780, -3387, -2002, -2238, -4988, -4865, -1990, 86, 920, 3045, 4568, 2398, 729, 514, 1638, 1709, 397, 87, -167, 958, 4196, 2230, -70, 2629, 1957, -158, 1469, 847, -1442, -2006, -799, 286, 485, 2949, 4964, 8817, 7449, 2789, 205, 2015]
10084B015k164k17M553K554p18k627j498j440k396j218J166K394J952O372J71
10069H899k537l193L109L105L197N640O315J3846K4802N6347Q7274M945o6077
10056A45672n7496l2705j6659j2578m149k787m770k066J086k682l189m486R64
10043D155j435j053l13M609K024j749o31j533J256j880j683j403j843l18j718
10028c515k92Q63M32M87J789l56K386j136j543P73K220k358J694M266J800l469
10012D041n071k872k380J808K828J190j576k12K726O19J118M258j918o898O94
9997a645K618O86n01M768j248p44m57k495R60J84k354J297n32l026R19N18J735
9980F83K886R07k188k507J760J041j915j581l53J871K601J263m581n983J906K481
$$ y = [2015, -149, -366, 4187, 6741, 6023, 3396, 1898, 458, -1938, -3156, -1990, 404, 2356, 8728, 8899, 6362, 3169, 6278, 9383, 12580, 18220, 24535, 38381, 63183, 119530, 206804, 211749, 145672, 88176, 55471, 38812, 26234, 22085, 19298, 14528, 12462, 13548, 10866, 7677, 3191, 4155, 2720, 1667, 1354, 5963, 7987, 6238, 5607, 4074, 5330, 3450, 1767, 364, -1479, -1797, -3515, -3807, -2944, -2512, -2025, -236, -592, 1794, 658, -885, -112, 2108, -250, 1444, 5710, 7510, 4041, -1030, -3902, -6282, -4474, -1646, -456, -2032, -2244, 482, 1101, 2219, 6477, 4559, -2339, -1645, 973, 1659, 1158, 5926, 4678, 3934, 3477, 982, 1942, 2126, -228, 1069, 537, -2489, -1570, -1052, 683, 3569, 4476, 2288, -219, 1541, 2582, 667, -914, -1267, 604, 3205, 4468, -113, -6096, -4190, -1709]
9964a709r92L361L561j523p0L63o18l213k082k228M834M237J557K071k753j85
9948D611k474m216Q87L107J120L435L360m192l781lK431N37K077L37m026n392
9932b182k849M439j685k464M084J973J294k240p00L39j645Q60M79J28l57L6j424
9915a914r8P42k039M049K767j620J961p73j691J683j706J684N252N367j148l419
9899I097j123k790o39L420j135l822q64P19l116j522O52l234j734L99L133J216
9883a343J521o55k067K434J990J90N32K298M80j509k54k872o37M481n47j223L860
9866F679K112J952K782J783l589k551l710n671M65j260j627j565J332L567K923
9851C622j934j504L2P66L860J802R91j094j561k362N97l106l261J64J056L831
$$ y = [-1709, -2701, 660, 4221, 2698, 2628, 2991, 2373, -840, -2922, -5150, -316, 3921, 5478, 7549, 4796, 4611, 2137, -2079, -1192, 1915, 3035, 6470, 9830, 5638, 1857, 1854, 4285, 4822, 6899, 7236, 3210, -2182, -5031, -592, -2277, -4741, -657, 1316, 2610, 370, -330, 9, -1636, -776, -297, -169, -526, -490, -1914, -2012, -1270, -3309, 740, 3507, 1887, 3848, 3075, 1384, 3067, 1361, 3045, 8297, 13664, 12516, 9097, 7974, 5184, 4545, 7965, 6830, 3008, 2144, 2863, -253, -1775, -1123, -4357, -6091, -5692, -2559, -1343, 178, -477, -2544, -110, 1880, 2070, 2602, 4900, 5380, 3871, 3617, 745, 108, 4589, 4042, 2819, 6679, 8791, 10743, 13525, 15308, 11719, 9168, 5458, -213, 252, -1008, -2635, -4200, -2868, 699, 3622, 1688, 184, 216, 982, 4842, 6644, 7635, 6541, 4980, 2618, 3215, 109, -3152, -2988, -1932, 1899]
9835A899N353o65k830j097J41j626R74J322m46j251J396J469K868J41l121N99
9819E126k043j16j807L675K174m026l976l1L210L307M00j71l04J360l298j671
9803A809p59m07k379p31P02K550K399j23O73O21K299J803j77o53j177P49k593
9786D606r27J512k107j139J558j348j959o60l03j610o37j264n16J191K266p57
9770b094J894K032K079Q70k102j406M46L95P36l414K21J890O12j039k88K270N040
9753H142K410l078n961k673P98J221K446K6J707P13J554k265P12J933L62L64K554
9736A0965j42l773m526j076R6R71L168n24N49l68q64k138j393k746J113L863J687
9719D862l000p8K652J813L690N58n80j464j711p23J760l530K335J70M19j529J463
$$ y = [1899, 7252, 6587, 3757, 2660, 2801, 1175, 2149, 3471, 3025, 1774, 3170, 4639, 7507, 7648, 4527, 5126, 3083, 2967, 1160, 4835, 7009, 2983, -993, -1024, 2186, 5493, 5893, 5722, 5418, 6778, 3480, 1809, 1050, 643, -1736, -2467, -1765, 785, 3184, 3061, 3734, 4355, 6654, 8457, 8280, 7627, 6450, 7199, 4606, 3679, 5191, 3084, 1945, 3503, 2155, 196, -464, -767, -2377, -3014, -4278, -4794, -3603, -1337, -2094, -200, 1832, 3911, 4781, 2679, 1273, 1719, 2114, 2850, -564, -343, 1547, 2159, 1120, 832, 3102, 8142, 10552, 7474, 1513, -1160, -362, 859, 3305, 3331, 5038, 5751, 7305, 5040, 5752, 7685, 8047, 8411, 10965, 10823, 7050, 2524, 1448, 1544, 2515, 5683, 5159, 5708, 5340, 4476, 2338, 945, -1801, -688, 3175, 4862, 1862, 1784, 4436, 6249, 9939, 10497, 9917, 8453, 6742, 6019, 7779, 4249, 6584, 6754, 7173, 5644, 7107]
9702G107N36j646K382j607j242k16N70m535L21K071k3K737l73k623k185K284L543
9685G101m66L19j548O8p29M7R87K291j533k349j037K51M87J245J081p39q37L76
9667E015L83l442k468Q73K991L066l937j327J082J033K644l53K083j455n63K577
9651H202J9P59K204j583K687l68o383n03K10M136K660Q96l098j276J020J587M4
9634A1213J916K457j376K707q81n136k591K062j481n028J677L055J086j992j830
9619E858M26j534O50J368k774n32K092K24j730m112j832K977K843J610O06k066
9603D074l128m44K083N60k180l468m6N175J380k394K578K431l646q10q24n37L395
9586D199R79l54j183L276M236O25k109j273j997k808L640Q72m01l932M4L04K438
$$ y = [7107, 7643, 5997, 8379, 6772, 5530, 5314, 5884, 1349, 1670, 3741, 3718, 6455, 6082, 3459, 1274, 3558, 7101, 6635, 6954, 5406, 5474, 4745, 4792, 5779, 8070, 6537, 4188, 3151, 3402, 3889, 5134, 6215, 5476, 4639, 5015, 5398, 1956, -512, 361, 3352, 6418, 2481, 1154, 2236, 3269, 5913, 5560, 7643, 6188, 5625, 8202, 8221, 8980, 11184, 9601, 12288, 11920, 5537, 5034, 5244, 9380, 12040, 12936, 9838, 8562, 9582, 11169, 11213, 13129, 15586, 14210, 16917, 16036, 10900, 8309, 10371, 8890, 3862, 5539, 8594, 9680, 7688, 5858, 6284, 4750, 5400, 6768, 3994, 3462, 5554, 5778, 4048, -64, -1896, 1081, 3924, 5534, 6140, 4074, 946, 502, 2585, 3145, 965, -2503, -2549, 2626, 4006, 1612, 4190, 6621, 2975, 2165, 1341, 804, 4199, 5178, 4824, 3641, 6917, 11153, 11778, 9669, 8396, 6399, 3591, 7231, 8103, 7702, 3770, 3814, 4118, 6556]
9569F556q35n162k324L275N863K449k813l487m068l161k529L749J801K496K975
9554D785L477K428k699n068l187P08M434k28q00n92J671o09m17j242L23p3j474
9537A437k559J40J128M009N632J337r05k959J475Q01l95j157l028j424J674p99
9521D407J34j20m1l39j358K298L417o31J154j744p71j022j605J070L75j832j552
9504A840j3L285k661r77K711J822K285j165r58m205j28K384m89N75L904R39R71
9487A0120L447M55J7l623n521J690K002l959M71K77K075J739k160j557L09m04
9471E378J192M07J377K018R77j291J554r11l707k436K015k371o00k929o74l76
9455c77N6M643M885j595k188j461k096j655K90K770J307K859K898P12l49l87J66
$$ y = [6556, 5721, 559, -1765, 1510, 7373, 9822, 7009, 3522, -546, -3707, -6236, -2487, -686, 1810, 4785, 8262, 10690, 7991, 2923, -264, 444, 4878, 4650, 3850, 3258, 4929, 4320, 3903, 2661, 2984, 2911, 1437, -1122, -982, 146, 4155, 9787, 11124, 10219, 7260, 8735, 9536, 9141, 7984, 4956, 3532, 5206, 4407, 4541, 4421, 4380, 4041, 2683, 4981, 8398, 7767, 8921, 7177, 6406, 5384, 3779, 4849, 5224, 3392, 1840, 1827, 5112, 2451, 1474, 4185, 6007, 8292, 7127, 6169, 1964, 1836, 4220, 3731, 4306, 8210, 9149, 10120, 13567, 14022, 14039, 10416, 4895, 6585, 8587, 4628, 5099, 5376, 7451, 9190, 7030, 5473, 5782, 5378, 6570, 6977, 8354, 10372, 11349, 10058, 11612, 10701, 6994, 4558, 6573, 4202, 3602, 673, -1, -377, -321, 4322, 9207, 7612, 5424, 3963, 1867, 212, 502, 3272, 4579, 7438, 10336, 11048, 10699, 10312, 10478]
9438A0478n1O4o0O48j938J260k09j648L884R21k719k74K940j45j253J618K386
9421A5902J38p89m918l096j692Q34l79k088L14J002r47m86J46k23J779K126J630
9404I253Q34N236k946l377k11l013K412J626j202P08P97k796j586j713M198N114
9388A3334j706k411Q06p32L70q25k963K120L468m307k87N971j493o97J738l300
9372I086K000J484j304k574N95J249k852q60K92j343l106p22k002r39N656K755
9356G415L091J407K01j852l91O97L033k36J281K310j351j092j492k500n96K734
9340A2659J289q51k630n76r87O62J865l150k378K119N573M268k485l453j965o80
9324I280J384J194J170N936o61j149j23J459J100K793j035p54l433k933j419J680
$$ y = [10478, 10427, 10491, 10431, 11079, 9141, 10401, 10192, 8544, 12428, 13349, 10630, 10356, 13296, 13151, 11898, 13516, 15902, 16040, 15251, 10333, 7237, 5545, 6379, 6000, 3912, 4226, 5228, 4281, 3795, 3941, 3718, 5497, 7623, 9253, 10087, 15323, 12377, 9000, 8789, 5776, 8188, 9814, 8612, 9320, 10117, 7321, 5735, 4022, 8220, 13334, 11628, 9217, 10023, 9291, 9661, 8836, 5873, 7993, 11461, 7154, 6867, 12838, 11345, 10648, 12386, 9086, 11086, 12570, 11266, 8692, 9287, 10536, 7684, 6824, 7116, 5773, 2667, 1945, -57, -996, 4660, 7415, 10506, 11913, 12114, 10262, 9871, 10568, 13601, 13365, 14646, 16956, 15605, 14513, 13021, 10521, 9925, 12659, 13948, 13097, 10467, 9891, 8904, 9566, 11431, 8281, 5903, 8022, 13595, 17863, 15378, 11925, 9960, 9280, 10664, 11858, 13028, 18964, 18303, 17154, 17031, 18490, 19590, 22383, 21348, 20594, 17161, 14228, 12809, 14489]
9308A4489R34j64K00k443K558J749k350m108j821J114J730j30L50q44L68K467
9292A4099j54k540L505O21j812n2J325O33k170Q23p26J158k79l27J759L540J393
9275B0796p64j674J25j541k992l52l328L044n64J280j533J102J6j654q34J524
9259A2651j1j455K245O168J307j238q10j789k741M681R53k09l106K73J038j862
9243A6095K95L44j377L414K667k752m260O80N126L934n66M82P92p88j740N40K061
9226B4947P20k565j180K018k495R62P2n74k468j886J640R49K505p02k679J341
9210B0605K367k63j390j929K704K006m281J325K374K167m38l729r06O99O65o14
9194B1362K95J696N6O891N15j10O254J734p084l066m572k806j067J530N65r16
$$ y = [14489, 15423, 15259, 15459, 13016, 15574, 17323, 14973, 10865, 9044, 10158, 11888, 11758, 12108, 11264, 11632, 14099, 13945, 11405, 14910, 15531, 13719, 13667, 14992, 15625, 13455, 14278, 13552, 14710, 14431, 14104, 15863, 19403, 20796, 20032, 18358, 18483, 16942, 13950, 13598, 10270, 13314, 12750, 14030, 12497, 13599, 13615, 11961, 11127, 12651, 12640, 11185, 13430, 19598, 20905, 19667, 18857, 17068, 14327, 19008, 19961, 19752, 16646, 16919, 17957, 16095, 16390, 16734, 15357, 18771, 21438, 18686, 14426, 15106, 20232, 24166, 23600, 24082, 24874, 24086, 22346, 22886, 24947, 25667, 23102, 21922, 23940, 21445, 22407, 22479, 21905, 19437, 17551, 19191, 20140, 22645, 21943, 19264, 20605, 22972, 22709, 21319, 19390, 22094, 24100, 19819, 21144, 23518, 25685, 25247, 21518, 20612, 21311, 21976, 21362, 21657, 23353, 23409, 30300, 30815, 30705, 36959, 38693, 31609, 28543, 23971, 21165, 20098, 21628, 22193, 21277]
9178B1277j637j575N06p56O55n30j835k673M11L167M969k68n721k166O00J838
9162A6262K451L255k862k191K066j74k783M38K576k82L83L340L991K396J395q30
9146B9431k39k531P849O933N10j493l064k079j896M567L616m622o104k80K281
9131C2879n96q72O072k3k942k985k694J250k204O29J958j130K654J543O41K749
9115C6929K097L817O127l008l163r76L79L901M705J895M070N464K684N785M436
9100G5142j86K206L711L688J0749J1377P519J1506J4641J7993K2199L4058M9186
9087B63789O9127R6595J29775J60826J86578K13079K06623J70410J13409K9776
9077A639987n3039j15249j55659j60014j24147m8693Q4198L39203Q60482J384629
$$ y = [21277, 19640, 18065, 18571, 17815, 18470, 17940, 16105, 13432, 13843, 17010, 21979, 21711, 15990, 13824, 14424, 16262, 18713, 21968, 19106, 16915, 18981, 18807, 16024, 16462, 19038, 18756, 19139, 22479, 26470, 28866, 30261, 29431, 29192, 26661, 34510, 41443, 41953, 40460, 37396, 35317, 33421, 37988, 41604, 36982, 30878, 30598, 32879, 32283, 31411, 37483, 37460, 34518, 31533, 28839, 30089, 27885, 28514, 30472, 29342, 31996, 33539, 34180, 36929, 39026, 42843, 48970, 45962, 42799, 41823, 42202, 46103, 50808, 52703, 56773, 62237, 64921, 70706, 75142, 74956, 77162, 80873, 84561, 95310, 106687, 114206, 125712, 140353, 158346, 180545, 214603, 263789, 332916, 429511, 559286, 720112, 906690, 1119769, 1326392, 1496802, 1610211, 1639987, 1586948, 1471699, 1316040, 1156026, 1031879, 983186, 1067384, 1406587, 2267069, 3651698]
9067C651698N9540j121870j024262n68132k97348j68614j08215p3692n3973m0883
9057B54249k8723k6949k7200j9735j7305j1004l794j1281n690o837l000l437p496
9044H1798p233n476K32J226J186n416r999l027j454l916k430M59L193K330N246
9029E6719Q4j757O4Q7j498k315o41J031l295J346J952K94j086l32J78J061K713
9012E4605M243l47J802L090k027j664J490k948k502j842k613J280N26l420m031
8997D5642j483K877N914N635K818L152M470P75m575O37k255L912O159m356q206
8982F1116j1279m062N68k286j60J964L099J82L31J979J082j043K490Q737R354
8967G2072K028p90j338L392K013l881l029n910j0918p376J136K763K481M211O128
$$ y = [3651698, 3711238, 2589368, 1565106, 996974, 699626, 531012, 422797, 349105, 295132, 254249, 225526, 198577, 171377, 151642, 134337, 123333, 119539, 108258, 102568, 95731, 92731, 89294, 81798, 74565, 69089, 69321, 70547, 71733, 66317, 56318, 53291, 51837, 47921, 45491, 45950, 49143, 51473, 56719, 56803, 55046, 55110, 55197, 53699, 51384, 50743, 51774, 48479, 49825, 51777, 52071, 50985, 50653, 50831, 51892, 54605, 58848, 58501, 60303, 63393, 61366, 59702, 61192, 58244, 55742, 53900, 51287, 52567, 53093, 49673, 45642, 44159, 47036, 52950, 58585, 61403, 64555, 69025, 69800, 65225, 65862, 63607, 67519, 73678, 69322, 61116, 49837, 45775, 46343, 44057, 43897, 45861, 48960, 49142, 49473, 51452, 52534, 51491, 53981, 62718, 72072, 74100, 73310, 71972, 75364, 77377, 73496, 70467, 64557, 53639, 46263, 47399, 50162, 52643, 56854, 62982]
8952F2982L220k800m031o772O44M902N990J0527P421L242N084J8259K7665M6062
8938A82395Q4897J20111P9797j9478j04770j07724n6592l6175k5073j5521j4023
8927H7844j2643o743l921m725j401M422O112Q184R783J3237J8439J8220J0260
8914A47068q51n744m848n579n860M264J3938J8917K0226P733n544j5721j7870
8901A50129j9000j1828m398j687p383p863j0904n77P690J3304J5863q27j8364
8888A04155j1011K408R336J3773P991Q363K7691M9369L4101n347k9113k4968j3175
8875A73573l417R95J7438J4299R359O437J1279J3527J3831J2199J6763K7151M7266
8862C60700P5142J27317J90776J46888m9958j81636j74430j17006p1438m4573
$$ y = [62982, 66202, 63402, 59371, 52599, 53243, 58145, 64135, 74662, 82083, 85325, 90409, 108668, 136333, 182395, 267292, 387403, 467200, 447722, 342952, 235228, 178636, 142461, 117388, 101867, 87844, 75201, 68458, 64537, 59812, 58411, 62833, 68945, 77129, 86912, 100149, 118588, 136808, 147068, 146217, 140473, 135625, 130046, 124186, 128450, 142388, 161305, 181531, 189264, 183720, 167999, 150129, 131129, 119301, 114903, 113216, 105833, 97970, 87066, 86489, 94179, 107483, 123346, 122519, 104155, 93144, 95552, 104888, 118661, 126652, 135015, 162706, 212075, 246176, 240829, 211716, 186748, 173573, 170156, 171151, 188589, 202888, 212247, 218684, 229963, 243490, 257321, 269520, 286283, 313434, 360700, 435842, 563159, 753935, 900823, 850865, 669229, 494799, 377793, 306355, 261782]
8852B61782k8307j9243p520r002q254m644q49J681M492l736n984j3311k0867j8514
8838A27724j1706q406L351R278L80k051p189k833L673L769J226M509P421N476
8824A34622K994O279Q991J7279J7553R823L740M923N061P036Q346L928k5825m3075
8810A61675L4995J49868J02167l0636o4980m9102l1617j6056p135r926o085k050
8798B31118k101k347k636o403l999l386J225N956P141J4459K5908L3752K2443
8785C21130J661r992j5959m328O429R645O974L470l708p626r726j2159m659m03
8771B80749O79J0898J6962J5444J5581J5139J2082J1888P186M99l957o035K164
8758C79279J3535K4729L7160L8360M8120M7643M2887M3064N0814P6160J29084
$$ y = [261782, 233475, 214232, 206712, 197710, 189456, 184812, 183963, 185644, 190136, 186400, 180416, 167105, 146238, 127724, 116018, 107612, 110963, 120241, 120621, 118570, 111381, 108548, 112221, 115990, 117216, 121725, 129146, 134622, 137616, 143895, 152886, 170165, 187718, 197541, 201281, 206204, 211265, 218301, 226647, 230575, 204750, 161675, 196670, 346538, 448705, 418069, 353089, 303987, 272370, 256314, 249179, 239253, 233168, 231118, 229017, 226670, 224034, 217631, 213632, 210246, 211471, 217427, 224568, 239027, 264935, 298687, 321130, 322791, 312799, 296840, 292512, 298941, 308586, 315560, 319030, 315322, 307696, 297970, 285811, 281152, 280749, 281428, 292326, 309288, 324732, 340313, 355452, 367534, 379422, 386608, 387107, 383150, 377115, 379279, 392814, 417543, 454703, 493063, 541183, 588826, 631713, 674777, 725591, 801751, 930835]
8747I30835K12417K48733N2052j40372j33166l5471J8938J2614K863j7497j4635
8736A137311R033M5032R9810J92971K56769J21944p7133j41733j05778o2388k7824
8725A448014J1626M6138P5823J07221J17627J23250J38484J49231J55901J56572
8715B529887J78480K24284K49920K46796K64826L31170M24459N78005Q38306J129531
8705F995664J064173N92824N24140J038353J662874J723395J577545J818122K481728
8696A9478818L228256L399443K271731J115833J925524M367848P543868J1962202
8688E5293523J9536625L2594958N5307464R3472221J31560766Q9177714l5559059
8681D41384212j08987352j07809529p2583128m3367670k5865410j5358700q549439
$$ y = [930835, 1143252, 1391985, 1444037, 1303665, 1170499, 1135028, 1153966, 1166580, 1169443, 1151946, 1137311, 1146344, 1191376, 1291186, 1484157, 1740926, 1862870, 1785737, 1644004, 1538226, 1475838, 1448014, 1459640, 1505778, 1581601, 1688822, 1806449, 1929699, 2068183, 2217414, 2373315, 2529887, 2708367, 2932651, 3182571, 3429367, 3694193, 4025363, 4449822, 5027827, 5866133, 6995664, 8059837, 8652661, 9176801, 10215154, 11878028, 13601423, 15178968, 16997090, 19478818, 22707074, 26106517, 28378248, 29494081, 31419605, 35787453, 43331321, 55293523, 74830148, 107425106, 162732570, 256204791, 387765557, 476943271, 441384212, 332396860, 224587331, 152004203, 108636533, 82771123, 67412423, 58862984]
8674E8862984o335646p110964o219348m056186l291723l893548l926171l281893
8666B0747505k608763k221128j940833j688467j454161j260280j049510q54649
8658G669714o97564n27324l58622l74488n73782n91629m58031l38000k73686k32681
8648C243907j91209j54284j19970q0529j9237P4612J37223J4154k19246l12383
8638B373038k76416j96835j20488p2241n1913p0163r4803j07386j01364q6917
8628A194512p4130o4292m4437k8227l1119k9187k9654l0470l1565l6689l2437
8617G62305l3189l3881k9857j5592j0845l518L378Q404Q485M017k600j6214l1017
8604F09876l6214l1337k1769j6578j1220q334k660o68L93o315m958l495m168J134
$$ y = [58862984, 52527338, 45416374, 39197026, 35140840, 31849117, 27955569, 24029398, 20747505, 18138742, 15917614, 13976781, 12288314, 10834153, 9573873, 8524363, 7669714, 6972150, 6444826, 6086204, 5711716, 5137934, 4546305, 4088274, 3750274, 3476588, 3243907, 3052698, 2898414, 2778444, 2697915, 2678678, 2753290, 2890513, 2904667, 2685421, 2373038, 2096622, 1899787, 1779299, 1707058, 1655145, 1584982, 1490179, 1382793, 1281429, 1194512, 1120382, 1056090, 1011653, 983426, 952307, 923120, 893466, 862996, 831431, 794742, 762305, 729116, 695235, 665378, 649786, 638941, 635423, 638801, 647205, 655690, 659707, 657107, 640893, 609876, 573662, 542325, 520556, 503978, 492758, 484424, 481764, 481096, 481489, 475174, 470216, 466721, 462553, 463687]
8590D63687J6138j8335m8175l6290j6606j0729m081m046l153q491n740k411O75
8577C22443K065l676j0132m256J750j222p930r751j360J645M277M729K30K686
8563C01498J4281K0497J9916J8176K3348M6119O9280N4603r5n6893p8790n8913
8551C73027l6189k0959j0413j0931p077O296J3249p88p078j1489j4010q679n570
8538B59389j0098q760j546Q73p176r600j0099k938M87j243n958j4529j6253j0101
8524A62448j5790j4959o304K655N950O536P391R226J3814R819m097r336j0798
8511A56555r938j1937q479N28L301k781o672o006K67n77j682o835r040j0300K297
8496H8701L394o430p205K987R706J1607O130K815O5M332K0814J5469n948p484
$$ y = [463687, 479825, 461490, 413315, 377025, 360419, 349690, 345609, 341563, 338410, 329919, 324179, 321768, 322443, 324508, 320832, 310700, 306444, 308194, 306972, 299042, 289291, 287931, 289576, 293853, 298582, 298812, 301498, 315779, 336276, 356192, 374368, 397716, 443835, 513115, 567718, 567623, 510730, 431940, 373027, 336838, 315879, 305466, 294535, 287458, 293754, 307003, 306215, 299137, 287648, 273638, 264959, 259389, 249291, 240531, 238985, 239858, 232682, 223082, 212983, 210045, 210532, 209289, 203331, 188802, 172549, 162448, 146658, 131699, 125395, 128050, 134000, 140536, 147927, 157153, 170967, 180786, 176689, 167353, 156555, 146617, 134680, 126201, 126729, 130030, 127249, 120577, 114571, 114838, 114261, 112579, 105744, 96704, 86404, 88701, 92095, 85665, 78460, 81447, 91153, 102760, 108890, 111705, 111770, 116102, 136916, 152385, 146437, 138953]
8482A38953p125j0085o417j112n720k0546j4578m566L721J4070J2651J533n015
8469I5764p724p756k266n910p090j6698j7312j2125p950m141J0574J7236K0280
8456E4882J3320P85j3936j5988r590k857q57J0241J6596J3987J2031J0794J2140
8443A01548Q378p96p613l155j841o180n080l253m861L058N238L409K70Q964J7701
8428A15787J2603j0945j7513j0598m641q168k981o73N099L3k824p40l236o311
8414F4892k944l738l446m06M145K998l340m591r260n737J959j4J104l029l192
8399C5401l067j73K859J516k343J74P84K952L894P87M707J523N262k716l300p667
8383D0593n746o352l756k371k147k8K620m357n903k851J718M615P025M651J779
$$ y = [138953, 131828, 121743, 115326, 114214, 108494, 87948, 73370, 68804, 72525, 86595, 99246, 100779, 95764, 88040, 80284, 78018, 72108, 65018, 48320, 31008, 18883, 10933, 6792, 17366, 34602, 54882, 68202, 68987, 55051, 39063, 29473, 26616, 25759, 36000, 52596, 66583, 78614, 89408, 101548, 109926, 109130, 101517, 98362, 96521, 90341, 85261, 82008, 77147, 80205, 85443, 88852, 89122, 98086, 115787, 128390, 117445, 99932, 89334, 84693, 76525, 73544, 72871, 77970, 78003, 75179, 74439, 71203, 64892, 61948, 58210, 54764, 54358, 58503, 61501, 58161, 53570, 44310, 38573, 40532, 40518, 41622, 38593, 35401, 32334, 32161, 35020, 36536, 34193, 34367, 35151, 38103, 41997, 42784, 47491, 49014, 54276, 51560, 48260, 40593, 34847, 28495, 24739, 22368, 20221, 20193, 22813, 18456, 12553, 9702, 11420, 16035, 23060, 27711, 29490]
8368B9490N092j955r67j78j260l826j04J77j692o600m303j284K584J709K516K413
8352B1812R74J605L248j7k565j544J252M605M515J219n00P57J912J14j975j716
8336C3696K387l547Q23j013j383M315K993j046J20K58k190N58r35l79M24k993
8320C2088n391K022j457L602K623L534L468L138K234j067k334K860O381q97M251
8305E5055N868N665K224M316L654M225O435O888Q856J6889J2598J7196J7459K5641
8291A92969L8153N6733Q7436J18318J54493J86601K12516K08993J75641J14656
8281A546509K1677o5023j31960j84269j99525j85355j63601j29460j00475p6087
8271C32431n5349l9318l2483k4853j9516j5307j3937j1283j1934j1790j2351l911
$$ y = [29490, 34582, 32627, 31660, 31482, 30222, 26396, 26292, 26469, 24777, 18177, 13874, 12590, 15174, 16883, 19399, 21812, 22786, 24391, 27639, 27622, 25057, 23513, 24765, 29370, 33885, 35104, 34604, 35361, 37273, 37387, 35412, 33696, 36083, 32536, 33359, 32346, 30963, 35278, 38271, 37225, 37345, 37603, 35413, 35971, 35036, 34657, 35081, 32088, 26697, 28719, 27262, 30864, 33487, 37021, 40489, 43627, 45861, 44794, 42460, 45320, 51701, 50804, 55055, 60923, 66588, 68812, 73128, 76782, 81007, 87442, 94330, 103186, 120075, 132673, 149869, 167328, 192969, 231122, 287855, 375291, 493609, 648102, 834703, 1047219, 1256212, 1431853, 1546509, 1568186, 1503163, 1371203, 1186934, 987409, 802054, 638453, 508993, 408518, 332431, 277082, 237764, 205281, 180428, 160912, 145605, 131668, 120385, 108451, 96661, 84310, 80399]
8259H0399r185r980o282l226l567m985n618J600o68k489j234j407k026k071O94
8244B9955k172j133J418L154K525p93m106K009M32k824k364k570o145m073j617
8229A1696J26j649l440J53K567J784j588j915o99M730M530L955K72l271o04L242
8213A9889k306M92M00l5K991l7m047m015j196N490j13j952k040j540j295K160
8197A2846M50M486L981J063q90l197l21k862m167K136M259k72P77K129j457M3
8181A9004J98k715R65k694n538r5J963J324R21j754k060J552m96J178K7j936K73
8164A0117J482l33j872j286K336K85k92L59Q89K892j856Q18L348j44o757m601
8148E385J309l89j114P82j845p28P2l85O53J187J763Q67q14j533n37J16K241J078
$$ y = [80399, 71214, 61234, 54952, 51726, 48159, 43174, 37556, 39156, 38488, 35999, 34765, 33358, 31332, 29261, 29955, 27783, 26650, 28068, 31222, 33747, 32954, 28848, 30857, 31289, 28465, 26101, 23531, 17386, 13313, 11696, 11822, 10173, 6733, 6886, 9453, 11237, 9649, 7734, 7035, 11765, 16295, 20250, 20522, 17251, 16647, 19889, 17583, 18075, 18475, 18440, 21431, 21394, 17347, 13332, 12136, 17626, 17513, 15561, 13521, 11981, 10686, 12846, 13296, 17782, 21763, 22826, 21936, 18739, 18418, 15556, 11389, 13525, 17784, 17512, 18289, 20418, 18961, 19004, 19202, 16487, 17452, 14758, 9220, 9125, 11088, 12412, 13333, 11579, 9519, 11071, 10575, 11753, 11780, 9844, 10117, 11599, 11266, 9394, 8108, 10444, 10729, 10437, 10796, 11685, 14577, 12721, 13539, 16887, 16743, 9986, 5385, 6694, 6305, 5191, 5973, 4128, 3400, 3472, 3087, 3740, 4927, 6690, 7557, 6743, 5210, 4673, 4789, 7030, 8108]
8130H108L405K637p2j039r40N82j14P1l173j139K082L578L942j55k21Q98m262
8113A4188n297k695J195O91J717J353L534P10J55j064m076m237r60K444J3k161
8097E510k367L237L943o13q90k359K360k09k546p70M18K169K733n91k299k026
8081E700M32O3j258J317PN38RK91j975j044L009M77n46n478k239L268J694Q39
8063E104L964N02m943j246K552J8j440J351J405q32n61p72k750J4R39J897m87
8046D715j698L641Q50K363k00j767k197r90L069J459k708j884j006k416j935P348
8030F644O367K394K473l892o108l281j192L771N86L77O0L020j003j15J415j246
8014A0270K299O24n03n58m80j869m34l55L984j382k867K153J68j958N33o3k832
$$ y = [8108, 11513, 14150, 14078, 13039, 12099, 12681, 12567, 12638, 9465, 8326, 10408, 13986, 17928, 17773, 17552, 18450, 14188, 8891, 6196, 7391, 8082, 9799, 11152, 14686, 15396, 15551, 14487, 10411, 6174, 5214, 7658, 7671, 5510, 3143, 6380, 10323, 9710, 8820, 6461, 8821, 8612, 6066, 5296, 5714, 7883, 10616, 10025, 7726, 5700, 6132, 6195, 4937, 6254, 6261, 6799, 6808, 7099, 5124, 4080, 7089, 7566, 7020, 1542, -697, 2571, 4265, 5104, 9068, 9570, 4627, 3381, 5933, 5951, 4511, 5862, 7267, 6435, 5874, 5102, 2352, 2366, 3305, 5202, 4715, 3017, 6658, 7508, 9871, 9671, 7904, 5707, 4717, 7786, 9245, 6537, 4653, 3647, 1231, -704, 6644, 13011, 15405, 17878, 13986, 7878, 4597, 3405, 7176, 7762, 8139, 8199, 11219, 10216, 10101, 11516, 10270, 12569, 13193, 12690, 12132, 11652, 9783, 9349, 8994, 12978, 11596, 8729, 10882, 11050, 9092, 9625, 9562, 6730]
7997F730k302L050k230l667J525M118L354l418o033j14L845M400o76K155j962
7982H775K317L879K089j928N42l422l578M391K715J01J517j570j627l89K680j767
7966A4725k331n51j800l028J032K022M87j838q65M182K069o10K03l449k261j767
7950F220l032L364O44j965L319J329L292L555R64j140j69k026k163o55O25Q90
7934A3052M60N72N007N53q274k482k22k37P3q30j484l14j564P82k2N73J734l780
7916C597n2M552K391R08R43j2J034q86j651L446k802m726j721J539j587J362J766
7899H101K026J833k659j881J758l0p62K442J239o247j770K015j224J178N07N57
7883G083K447r19p86l766J542j270k156M554J964k871l174m893K093K260M460
$$ y = [6730, 4428, 7478, 5248, 1581, 3106, 7224, 10578, 7160, 1127, 1013, 4858, 9258, 8582, 10737, 8775, 11092, 14971, 17060, 15132, 15674, 12252, 8674, 13065, 15780, 15881, 17398, 15828, 14201, 13812, 16492, 14725, 12394, 11843, 10043, 7015, 8047, 10069, 10556, 8718, 7853, 12035, 14104, 13494, 13697, 10248, 7987, 6220, 3188, 6552, 7196, 5231, 8550, 9879, 13171, 16726, 17690, 16550, 16381, 14355, 12192, 11537, 12162, 13052, 13512, 14084, 19091, 19644, 11370, 8888, 8666, 8429, 8502, 7672, 6188, 5874, 4310, 5092, 5070, 5643, 7377, 3597, 3545, 8097, 10488, 11396, 12339, 12327, 13361, 12475, 10824, 14270, 11468, 6742, 5021, 6560, 4973, 6335, 8101, 10127, 11960, 9301, 7420, 9178, 9148, 8386, 10828, 12067, 5820, 4050, 6065, 4841, 6019, 6526, 7083, 9530, 8611, 7825, 4059, 5601, 4331, 2175, 6729, 8693, 5822, 2648, -2245, -152, 2108, 6568]
7868F568O895k668o046j125K057J303q98q13k660j554n15J239K636k077l108j008
7852a774J723k06L308K586r80N11k230k799M80J527L609N08j683k95O31k32J751
7835F435J580q68q40Lj425K29l069L48J451j180j854n8M575p06q22K808k501k272
7817A834j360j370J328J440R51J547j154o622k773O7L014N481J618j686o643K164
7801b164L332n643j934K09K186L701L103M37J149J401M42j008P03J54k492j892
7785A684P60L251j390p26o10p20l76J476R20l225l539j154O06L845L093j476l56
7768B063K630K360J013J653j597n068l036M9K747K134J472P94r44n04j282n49
7752C935l375j417N8J35K005k89j277L058J244l04M443k925l928m0j268j789Q46
$$ y = [6568, 13463, 10795, 4749, 3624, 5681, 6984, 6086, 5273, 2613, 1059, 544, 1783, 4419, 2342, -766, -1774, -51, -257, 3051, 5637, 4657, 5168, 2938, 139, 619, 2146, 5755, 6263, 4580, 4285, 4916, 4684, 6435, 8015, 7147, 6307, 6310, 4885, 5114, 2045, 2393, 3844, 2664, 810, 752, 5327, 4621, 3799, 6607, 4106, 1834, 474, -896, 432, 1872, 2823, 4370, 3216, -3406, -6179, -6112, -3098, 2383, 4001, 2315, -4328, -2164, 1168, -4475, -6409, -6200, -4014, -313, 2790, 3227, 4376, 5777, 6219, 5211, 5914, 6068, 3576, 1684, 2444, 5695, 4305, 3579, 2969, 2249, 1873, 3349, 4269, 1044, -2495, -3649, -3043, 802, 3895, 2419, 2063, 4693, 7053, 8066, 9719, 8122, 3054, 18, 67, 2814, 4948, 6420, 7214, 6270, 5766, 4484, 3935, 560, -857, -799, -664, 1341, 1052, -225, 2833, 4077, 3773, 8216, 5291, 1363, 1323, 55, -1734, -888]
7735h88l660j379P072N383K26n318%p27j856N59N41m74k913K66K170j000j512
7718c510K26L70K468M208P61j062k259k746o52R83J670J84k105N1J910J924K420
7701D841o9M73q526j758P92K027J074K848L199L157P0k793K470n011J221L504
7685G519l356P6n07k908J394J97n23k076q15k793l069K670K901R12K149M348M91
7668F610k834k302J895j689l640Q89K659k0J810j12L15k454k851J330L074M67
7652C147M41P47k19k775l255l03M31K37j491N493j233n026K273K500M6N55j003
7635E65r95p0o35o29J898J931l246L07J048M630L03k285j609J498pJ35m62j435
7617I42m9R9K08J422J872o46k718k97K585Q1Q24j436K113J382k783K73j818j301
$$ y = [-888, -4548, -5927, 1145, 6528, 6754, 1436, 1436, 709, -1147, -588, -47, -521, -3434, -3168, -998, -1998, -3510, -3284, -2914, -446, 3762, 4523, 3461, 1202, -1544, -2196, -1213, 457, 641, -1464, -1413, 497, 2421, 4841, 4772, 5245, -3281, -5039, -4247, -2220, -1146, 1702, 4901, 8058, 8128, 5335, 7805, 2794, 4015, 7519, 4163, 4239, 3732, 824, 2218, 2415, 1892, -184, -999, -3792, -6861, -4191, -1290, -378, 1771, 6119, 6610, 3776, 1474, 3369, 1680, -1960, -1071, 1588, 1568, 3378, 3266, 3581, 1127, -1724, -394, 2680, 3147, 3588, 4335, 4116, 1341, -1914, -2217, -1786, -1549, -3040, 2453, 1220, -3806, -1533, 967, 1013, 1568, 565, -430, -500, -1135, -1764, 134, 2065, -1181, -874, 174, 4804, 5107, 2822, 1213, 2711, 2704, 2839, 2377, 942, 893, 992, 1200, 2622, 4494, 3848, 1130, 833, 3418, 3499, 4323, 2887, 5000, 6382, 3599, 3872, 2054, 753]
7599G53Q34j134l11q45n90M316K024j097q8O76N99k155o11K83O54M94m356k479
7581c033l72K271M033j066j236J031K645k327l070l744N54L025K203J184j19K98
7565B277J762J489m87j052M46J171j62l759L32j402k573P58Q10l757l24K314O35
7548a522j074l05M778L264m763n53j202j08j524j658j006K525K602K726J462j245
7532B397j481L295M70l012l802M00Q09j091K90M97Q33K473L299k78l828N86K639
7515D496N34l25j324j301R77J13Q2j475k419m97K835o11m85J956l24k22j027j456
7497d73J40J656L91J996J778k434l116j095K382L94j900L366J162N12q67k78k038
7480A576q93k235k225L007P12k322l71K137j333j195N57K892J172k633Q18K089
$$ y = [753, 1587, 453, 142, -703, -1293, 3023, 5047, 3950, 3862, 4538, 5137, 2982, 2371, 2654, 3308, 3802, -554, -3033, -3405, -1134, 2899, 1833, 597, 1628, 4273, 1946, -1124, -4868, -4314, -1289, 914, 2098, 1979, 2277, 4039, 5528, 5041, 3989, 4435, 5606, 5444, 1685, 2017, 615, -1958, -1200, -390, -4147, -4471, -2157, -1522, -2596, -2901, 1877, 5141, 378, -175, -1377, -1485, -3009, -4667, -5673, -3148, -546, 2180, 3642, 2397, 916, 4211, 4681, 1669, -2133, -1733, -924, -2015, -1725, -1228, -395, 2078, 5377, 5099, 1271, 1857, 4496, 5030, 4705, 3381, 2080, 3057, 3170, 3252, 1777, -642, -1139, 1696, 1085, 600, 2556, 2232, 2010, 983, -473, -333, 1323, 1714, 3710, 5488, 3054, -62, -1157, 1225, 1619, -281, 3085, 4247, 4759, 3892, 3614, 1576, 683, -1552, -3777, -770, -58, -2380, -2751, -614, -1947, -3142, -2585, 307, 1479, -1154, -336, 1753]
7464A753M86J80R5k100j837l402j311J958j938L65J81M82K309J213O31n40K832
7447A357n67n43n64j602m1r74J847L56J717K21n462k868K009K293j499N720R32
7430B332l324j577o51j80K395J542l028O86J365J586K32j123m953m432K487L321
7414c322J72j075K798j86J312n39n25R61L77n276J088K175J360K744j602m425
7398c963N39r35Q86Q95P9J792K99Q41l506lK209l79j262k534J625K624M158K283
7380E648M93l856m214N26j02l266J760L763L037K336K894m529n150R86K184j845
7364F65k489L76N024k319M49l006N90K801l60k015L209M30k954k27N53j464k518
7347c255J799J707j863j691J494O5J75J396J47n15k669O4j01R22Q43K365J474
$$ y = [1753, 2239, 2419, 2514, 414, -1423, -4825, -6136, -4178, -6116, -5751, -5570, -5088, -2779, -1566, -935, -1475, 1357, 790, 247, -317, -1919, -1960, -2934, -1087, -731, 986, 1207, -4255, -7123, -5114, -2821, -4320, 1400, 2332, -992, -2569, -3220, -3400, -1005, 537, -2491, -1805, -440, 1146, 1378, 255, -4698, -9130, -6643, -3322, -3150, -4225, -1427, -1613, -301, -840, -1365, -404, -27, -5303, -4215, -2040, -680, 2064, 462, -3963, -3424, -4359, -3473, -2578, -2499, -707, -408, 433, -3073, -3076, -867, -1246, -2508, -5042, -3417, -793, 3365, 5648, 6141, 2285, -1929, -1403, -1505, -4771, -3011, 752, 3789, 6125, 9019, 4490, -660, 326, 2510, 665, -1824, -1448, 3576, 1257, 1706, -1300, -710, 2091, 1731, -284, 2925, 3355, 401, 174, 727, -737, -3255, -1456, 251, -1612, -3303, -1809, -1744, -1569, -173, -26, -541, -3210, -3146, -3247, -2325, -1482, 883, 2357]
7330B357l397j921m428N45J646K660M913q67k019O65M505l16j626n23q30k784
7314a420j660m3M040k50n08n64K409P15R77l788k201J312N84M592k173n952j540
7297e470N37j029L612K054m66l554j352M468J25l11r14J940k45q10O97L270l758
7280a206j385L432j511l388j962N501K485l308l488K086J147R55j013J659K911
7265B915j035P9j307j273o01N61q64J842K420O35P38j665j860k214o76J710K429
7248A834j856l934J52j195p53L831L573j951l508J52Q62M177k6l543l91L573J949
7231B946l5j714k831L73M91L389m66j967M229K64k669m323l210P02L075J188p97
7214a355m46k959r78K769j862j817M675Q59K426l005k917K678j324l037J503L127
$$ y = [2357, -1040, -2961, -7389, -6844, -5198, -2538, 2375, 1508, -511, 154, 4659, 4343, 2717, 2194, 1364, -1420, -3080, -3123, 917, 667, 159, -405, 2004, 2719, 3696, -92, -2293, -981, -397, 4195, 2022, -3930, -5470, -4933, -5962, -2350, -296, -762, -4316, -5668, -1200, -1075, -1386, -2300, -360, -605, -1415, -718, 2552, -1206, -2591, 841, -670, -4058, -6020, -519, 1966, -1342, -4830, -2744, -1597, -642, -1655, 4, 2915, 1880, 1959, 652, -621, -1222, -661, -1525, 317, 2737, 3372, 4110, 2445, 585, -1629, -2305, -595, 1834, -22, -3956, -3804, -4999, -5752, -1921, 1652, -299, -3807, -3655, -2793, 1384, 1358, -2185, -2576, 997, 2946, 2911, 1197, -1634, -1261, -770, 2619, 2153, 186, 4415, 4679, 2010, -2313, -5523, -4821, -1746, -558, -1355, -1801, -4760, -5738, -2969, -4831, -6648, -1973, -1114, 1312, -1693, -4610, -1932, -3256, -6293, -4790, -1663]
7198a663O609j428j305j348k784q46J277J349J649K615K70m607o267j249J776
7183e952J936j551k525J110K124L809p74K763r69K121p25k840m99j085L205Q94
7167A042j803Q60N49M41P83N18O63o38N74j512n91m092k508q59L35K083L065L871
7149B781K516l237k90k291m174L01k548J824K837N49Q38P09J689q25N78J939O96
7132C892m852n181j95L701K818K587J521k590j424K559j350J834L138p04j789
7117C965m380n32p93J026j81r26J462J260K311p06k191j545K065M9k59l085m284
7100f744k042L887O250K751N74k408m578o53L29k483J600J522K846N99m99J927
7084B878j313k153k145j610J118K196J682J918j554j609K060M741K94k529k159
$$ y = [-1663, 4946, 3518, 2213, 865, -1919, -2765, -1488, -139, 1510, 4125, 4395, -212, -6479, -7728, -5952, -4016, -5567, -8092, -6982, -4858, -1049, -1823, 940, -29, 2092, 1367, -1473, -1972, -3057, 148, 1042, -761, 99, 648, 1089, 1872, 2390, 3053, 2415, 2989, 1477, 886, -3206, -5714, -6573, -6238, -4155, -1090, 2781, 5297, 2060, 1770, -521, -4695, -4394, -6942, -5118, -2281, -1732, -894, -185, 1504, 679, 1257, 3196, 3892, -960, -6141, -6336, -2635, 183, 2770, 4291, 1701, 277, 2836, 1486, 3320, 6458, 5754, 3965, -415, -947, -1740, -714, -895, -1821, -359, 901, 3212, 2506, 315, -1230, 835, 884, 625, -2460, -6744, -8786, -4899, 1351, 4102, 4676, 2268, -2310, -2963, -2634, -5117, -3517, -1995, 851, 1450, 951, 2878, 1565, -588, -2733, -4343, -3225, -1029, 653, 2571, 1017, -592, 1468, 6209, 6503, 3974, 1815]
7069A815j274K05J521o49l962m29J459o29j297j446j577M707O477j202j642O56
7053B733k215j515j289Q81k134J24J47J939K244m0k571l26R29j803m647P96M619
7036b128L055J957K550k600N71J437j367l404j132j275j44Q77j345l571K356L289
7020h74j781p11M001j147j638j155K216J003R38J20L163n33j115l225J35K127
7004A524m24J09M291k95n867k046m72Q86R87L029K89n70l212j258K112M893j418
6987B558k302j534l742k920K539L158O96K70J41J142K61M615L751m33r63j262
6971E975j952k551j252J104l60m89J312n98m041k487O37L395j476J848l39J309
6955C5m49J963o46m23m34k3q28k752K946q9o29N7p67J81p8k235j205K26J422R14
$$ y = [1815, 541, 746, 2267, 1618, -2344, -2773, -1314, -1943, -3240, -4686, -6263, -1556, 4921, 3719, 2077, 2733, 518, -997, -2286, -1405, -3539, -3415, -3268, -1329, 915, 875, -1696, -2022, -1093, -2896, -7543, -6747, -2128, 927, 2884, 5434, 2834, 3405, 4842, 3475, 71, -1061, -2336, -2480, -1603, -2948, -6519, -4163, -874, -2655, -3366, 635, -512, -2150, -3305, -1089, -86, 852, 972, 4135, 3602, 2487, -738, -603, 1524, 1100, 1209, 5500, 5205, -662, -2708, -3180, -2294, -1307, 1722, 2011, 1441, -1771, -3029, -917, 3976, 2558, 256, -1278, -5020, -7940, -5401, -2243, -1547, -1277, -1136, 6, 267, 4882, 8633, 8200, 7237, 5975, 4023, 1472, 220, 1324, 964, 475, 1787, 1189, -2852, -5339, -4702, -1307, -2783, -935, -1274, 35, -414, 1549, 903, 480, 46, 23, -805, -3557, -611, -700, -1329, -1272, -2039, -1858, -1936, -4171, -5376, -5150, -3728, -2814]
6935b814P60p6J303l194j887J581O457K324m551n25j756k935p45K243K880M966
6919D031K639j001N21Q6J882m39q30O5n57L123N68k220j136j765j886j915o77
6902D89j345j731N52J958j015k885p78M239N357J450P56j413j577K974L403j201
6886I233k551j323j475j617k391j449K394Nj169o96j887j642l02M06K52j26N822
6869A484J496k287k079J28L239L372L848L51k103l058p89p4m180n7K15K51m83
6852g26k93k249J137J256M032j006l990l70o49r47q73P98K539J127k371N304J344
6835D063k227l429l334j058J120L866Mj144J657M23k193K46j48k79j019m67J618
6818b301L527j070l290k299k805r23L231M608r54j535K041P0N18P52o58K768P74
$$ y = [-2814, -2054, -2130, -827, -4021, -5908, -4327, 2130, 4454, -97, -622, -2378, -5313, -6058, -3815, -935, 4031, 6670, 5669, 6190, 6276, 8158, 7719, 6889, 6954, 6397, 9520, 10088, 7868, 6732, 4967, 3081, 1166, 489, -856, -2587, -2035, -77, -1092, -3977, -4755, -516, 4841, 6291, 7047, 5634, 4057, 7031, 10434, 9233, 6682, 5359, 3884, 2267, -124, -1573, 821, 826, -343, -1039, -2926, -4568, -4870, -4464, -4212, -4338, 1484, 2980, 693, -1386, -1258, 1981, 5353, 9201, 9552, 7449, 4391, 3602, 3528, -652, -709, -494, -243, -726, -1019, -3268, -2131, -875, 3157, 2151, -1839, -2209, -2858, -3805, -4678, -3880, -1341, -214, -2585, 2719, 4063, 1836, -1593, -4927, -5985, -4865, -999, -995, -2139, -482, -59, -2252, -2006, -2154, -2433, -3452, -3919, -2301, 1226, 156, -3134, -5433, -8238, -9161, -5930, -1322, -2276, -3811, -1770, -1700, -1182, -430, -1088, 1680, 2454]
6801B454r62m704K507L411K000J874k612j837l037m96l37Q20p06K017J290l741
6785b059o17L482r68k774M93J333K663o8j274l4K547k014L80j187O6j16o2j516
6767a725l003q56L047J208o51j2K94J32M44q71J44l95K439L073K611J927J710
6750I516j789k995l79q94J777j451p66N07k574k50K868Q354O422L381k136o933
6734A2658l692J12l436m857k239J683J241n79J415j041j101J608j059j107j098
6719a492K079K67j911L524K576k912l311Q07j686o44L599j28l194k730L357L355
6703A556J378m703LJ786qk394r09K950J80k159J208P73k217J382O61n92j870J282
6685a693J0J136J49k421J83K291J786K012j208l554k718k08J420k312J12K505
$$ y = [2454, 1492, -3212, -705, 2706, 4706, 6580, 3968, 2131, -906, -1402, -1739, -919, -1625, 392, 1682, -2059, -2676, 806, -162, -2936, -2443, -1110, 1553, 1485, 211, 177, 2724, 710, 1090, -97, -31, -147, -209, -1725, -4728, -5584, -2537, -1329, -1980, -1992, -1698, -1566, -1122, -1993, -1849, -2244, 195, 3268, 5879, 7806, 9516, 7727, 4732, 4353, 3459, 5236, 3785, 3019, 3526, 952, 702, 3570, 11924, 18346, 21727, 19591, 12658, 8966, 9078, 5642, 785, -1454, 229, 1470, 891, 2306, 1265, 164, 1772, 713, -394, -1492, 587, 854, -1057, 2467, 5043, 2131, -1180, -373, -2059, -2703, 896, 768, -2426, -5156, -1799, 1556, 2934, -1769, -1766, 20, 12, -2382, -3291, -341, -161, -2320, -1112, -339, -2556, -1174, -513, -1105, -2975, -1693, -1683, -547, -398, -2819, -2636, -345, 1441, 3453, 2245, -1309, -4027, -4235, -2815, -5127, -5015, -2510]
6669b510M506J657k996p77K694L727L69l448j950l157k109L092L058o01l052J600
6653A03J114Q43M38j309n72q83M41P69K003p68K058j601j778J201J19M7l102J093
6635B16M478o96m004n632R63J074M10r83P44R34K602j372m346l35O314K690n59
6618B498j200r16J284K504q78k72K05k50r55q76J786N43l41l976j527mJ806J995
6600A426N20J521K225n69l424m118J582k108l231K554K459J768K539J142l389
6585H97k797J070L163K353j114j854r18k820j477J370q02l394K120L134l97K751
6569A285M48k448J732J600K225j543J390K027j698m682j8K260K739j432K7j060
6553B852k72k355N78p8N5l65K87O29j745j528P00j687j837J788j278j179K9K395
$$ y = [-2510, 1996, 3653, 657, -120, 2574, 6301, 6670, 3222, 1272, -1885, -3994, -902, 2156, 1555, -1497, 103, 1217, 2060, 2498, 1189, 617, -266, 175, 944, 2947, 2179, 4237, 2636, 858, 2059, 2178, 2225, -877, 216, 4694, 3998, -6, -5638, -4675, -3601, -3191, -4174, -3430, -2496, 106, -1266, -5612, -5947, 367, 3057, 2498, 1298, 382, 1666, 4170, 3292, 3020, 3225, 2975, 2020, 1144, 2930, 3473, 3132, -844, -2371, -2375, -569, 1426, 1946, 3467, 5692, 5123, 1699, -2419, -837, -2945, -6176, -3622, -1163, 605, 3144, 4286, 897, -1900, -830, 2333, 4686, 3572, 1718, 800, -2020, -3497, -2127, -2929, -6323, -4203, -1069, -1466, 1285, 1733, -715, 1017, 2617, 4842, 3299, 4689, 6716, 5018, 336, 318, 2578, 5317, 3885, 3912, 2852, 2580, 225, 803, 725, 780, 415, 702, 1331, -414, -1942, -1242, -2929, -4766, -2978, -4256, -5435, -5406, -3011]
6535c011K928n92j291J127k272O18J009j080k114r62K113Q9L839j963k184M25
6519c321K045P93j047J956M15Q59K006k156k693l486L79J247J906J111j748J668
6503f6m75K918L656k390j175m623j293K426j309J033J691Q46q42j014K665J142
6487C190l415M49J512L534O81j546j839J414l282k476K46l91R94M76r47j378j462
6470d240J003K239j10K795L52j451J63j117J674m79K329j198J478j96j922j490
6454a70k029q74j437J199J298L05j267j336M557J202k284J917N92k720k529K812
6438g64J313j78m01j195R04O54M4L946j459k07K427N62k711k918j929J413J041
6421E42p61p30Q6j58k074q93j27K109K632L4l283j182o0M66L40O76J768l912k523
$$ y = [-3011, -83, -675, -1966, -839, -3111, -2493, -1484, -2564, -4678, -5640, -3527, -3438, 401, -1562, -3746, -3321, -1276, -483, -1530, 426, 841, 1700, 3706, 1550, -1143, -4629, -4250, -3003, -1097, 14, -1734, -66, -541, 2377, 6033, 3643, 2468, -2155, -3448, -1022, -2331, -1298, 393, 1239, 397, -617, 2048, 3190, -225, 224, 1736, 5270, 5951, 4405, 2566, 3980, 698, -1778, -1532, -1923, -929, -453, -1400, -2778, -4240, -3237, -998, -1108, 1687, 2039, 588, 751, -366, 1308, 829, 3158, 1960, 3438, 3242, 1320, -170, -2199, -3073, -4510, -3311, -2013, -1708, -2975, -4311, 246, 1448, -836, 1081, 1673, -1047, -3576, -764, 549, 371, -30, -1225, -321, 333, 377, 4323, 2864, 2657, 5084, 5646, 2935, 17, -1912, -499, 542, -219, -949, -863, -1021, -3095, -3988, -4115, -2006, 626, 660, -2623, -3805, -3865, -3399, -3059, -2383, -615, -4527, -7050]
6402g050J752K958M727N49l26j543L01P49k319N9M84k02n040j587K997O389J680
6385D578j896k484m940K02K299P08j452J998L166o86J082K358l294k868k339k84
6369c852K576j222m230k389r5P04L460L352N70L86j256J260L391k859l726J021
6353b909o59K62J013J605o00m566N59M079K457l330j062k477j160k622L964L922
6337a524J329J257K558l927l720J753J423Q01k120k593j394K04L484L329K225
6322C085J947j134k857n91J984k018p5j26k472K598M493O89j700k560l952k421
6306e110J249J510J608J454J259j263k050L240R25j944j603l870L333M260N42
6291C540j191P5j248q31K293N51j737j439m870R83J94J470K258N20O90j194k407
$$ y = [-7050, -5298, -2340, 2387, 2936, 2610, 1067, 1368, 2117, -202, -143, 341, 139, -4901, -6488, -3491, 2898, 4578, 2682, 198, -4742, -4540, -2241, -1533, -2985, -987, 2179, 1493, 2575, 4933, 1639, -1229, -3568, -3852, -1276, -2498, -6728, -9117, -9212, -8508, -5048, -1696, -1126, -740, -1996, -736, 2655, -204, -3930, -2909, -3568, -3306, -2293, -688, -1288, -5854, -5295, -1216, 1241, -2089, -3151, -5628, -6788, -9410, -5446, -1524, -195, 1062, 3620, -307, -4027, -2274, -851, -50, -2170, -4763, -6157, -5953, -2469, 860, 3085, 5032, 3898, 1041, 450, 2434, 416, 341, 215, -2257, 341, 4834, 5523, 3823, 1263, -2689, -5110, -3861, -2351, -743, 711, 1970, 707, -1343, 1897, 2822, 878, -725, -4595, -1262, 2998, 3540, 2349, 2424, 1176, 345, 2638, 3189, 1452, 13, -4857, -3874, -3680, -2210, 48, 568, 1258, 64, -2343]
6274b343j410M96J490J767m61j623M250J37j720k538j361r8p77j3K013J376n17
6257a332M12Q32J26J759J366N63J509k574l010k290k074M23J741J017m03L48Q78
6240g09P07Q34J017K60r00J234J913l223m238q58L583Q12O03k22J088j180j338
6223f17J534m45K853K292j645J293K87k485j253J175R54j200q7J003k663l393
6207b397k064J363L320Q10K066P27k146N04j497q75J182l994m261R09K701J060
6191b592J295j486R50Q64j050P74k562J134J93k781j432L139M200r10J498O47
6175A881J169k222j260N63j38K010J455j65n140j444j304J211N60p07P99M148
6159A416r44N1J78M0J193j695J961q49l00L217j569j807k188j104M05J302M656
$$ y = [-2343, -3753, -3257, -1767, 0, -461, -2084, 2166, 2303, 583, -1955, -3316, -3414, -4191, -4204, -2191, -815, -1332, -920, -88, 38, 1797, 3163, 3726, 5235, 2661, -349, -2639, -4713, -4290, -2549, -1532, -1935, -1587, -709, -2, 832, 1849, 2109, 1209, 2443, 4356, 1133, -3105, -3963, -380, 432, 1035, 813, 1901, 721, -617, 917, 472, 3325, 5617, 3972, 5265, 5552, 3067, 1814, 2989, 3943, 2743, 2656, 3659, 996, -2397, -4461, -3098, 222, 1032, 3098, 3825, 1679, 2183, 686, -189, 993, -3001, -7262, -6353, -3652, -2592, -1297, -2783, -1833, -969, -2019, -1245, -3807, -2673, -2480, -5261, -6693, -3554, 646, -264, 1234, 1881, 3050, 828, -432, 131, -7, 2003, 3458, 3293, -1847, -3291, -4595, -3384, -2824, -3531, -2732, 1416, 472, 523, 701, 741, 1934, 239, 2200, 1351, 1051, 4268, 2699, 892, -1296, -2400, -1995, -693, 3963]
6142C963L131n326l903J262O97K13j806j90j57l699J444O067K130q29J450p19
6126C728K077J386m654k341r22K441N60l558m442r56J150K007J690L0J198K10
6110c96J166M11p1r19j013j662J847J240q50j967l16J226j790q60r78j900L44
6093f488L028K404r74J524K524L238j258J381J06j675l956q96j710p05J255K78
6077a924l408o58j02j31J374M047k06k001N19o32K254j85j17J235K396J041L510
6060G012J665j58k265p143j186J456J229k375j922N42J289j202J121M207R41P2
6044C283J459K63J28p65k639m222Q91J892J761R18L041p41j804k059k138j174
6028a906N26P31J30K677j829p61K057l18j13j085N21j603j195M51R02J099R14
$$ y = [3963, 7094, 1768, -2135, -873, -176, 37, -1769, -1959, -2116, -5815, -4371, 1696, 3826, 2997, 4447, 3728, 5805, 7191, 2537, 196, -726, 1715, 2275, -1283, -5725, -6681, -5531, -3524, -1834, -1804, -606, -396, 770, 1181, 1110, 191, -822, -2484, -637, 603, -247, -2214, -2530, -1304, -3094, -3954, -4932, -6832, -6488, -3460, -1056, -2030, -506, 2018, 5256, 3998, 5379, 5485, 3810, -146, -1042, -2752, -3457, -2202, -1924, -5332, -5990, -6092, -6223, -4849, -802, -1008, -3009, -2490, -3122, -868, -1053, -1170, 65, 2461, 3502, 7012, 8677, 8519, 6254, -889, -2075, -619, 610, -1765, -3687, -3145, -1856, -3058, -1937, 2270, 3211, 3283, 4742, 5005, 5133, 4368, 1729, -2493, -1602, 290, 2051, 2969, 6010, 5269, 3465, 1406, -732, -1906, -1380, -649, -519, 2158, 329, -432, 1625, 1307, 1194, 109, 630, -973, -2168, -1717, -815, 284, 1198]
6011A198J493Q05n443m036M301L708j499N69J044p54J58j492J035l286J155L890
5995B846J095K383p81k230j763q66L215j075j408kr44N90l50k435k53M94J783
5978B99m641k244J574K97j6L049N392N73l334r49n14l297K626J467k800Q22J282
5961d14N98r9o58L77Q77q14P86J843j002j042J095J192n491K4J328J30L44k198
5943c124p92j71K514K921N81O45j309k352p03J936P82k03m81j995J337J939k326
5926h01J297J004r09J807K749K618l617m455j272L4P48J347J682K166j061k90
5910C047k32L555J088k784l460k933p35L590K944K16M41k071j413K42q09k346
5894a660k652r15J442K055J635L35J366l63O53J42J037l34k190N43j671K009n34
$$ y = [1198, 2691, 3496, -1947, -5983, -1682, 2026, 527, 1096, 2140, 1386, 1544, 52, 1087, -2199, -1044, 2846, 3941, 6324, 5543, 3313, 1550, 684, 3899, 2824, 1416, 1414, 470, 1060, 710, -1725, -1978, -1484, 299, -4342, -6586, -5012, -4715, -4731, -1682, 3710, 4283, 949, 0, -514, -3811, -1185, 282, -2518, -1696, -414, 184, 85, -573, -196, 681, -133, 653, 2496, 1494, 452, 1547, 2739, -2752, -2728, -1400, -1270, -926, -3124, -3916, -4087, -1573, 1348, 1929, 2574, 1265, -1087, -1790, 146, 928, 725, 244, -1751, -414, 1525, -801, 496, 1500, 591, 2398, 5147, 7765, 4148, -307, -1579, -1545, -797, 550, 2232, 4398, 3337, 3047, 2815, 6370, 7458, 4674, 1214, -1719, -2454, 1136, 4080, 4296, 4737, 2666, 1253, 1495, 686, -1660, -4312, -5227, -3785, -1730, -95, 240, 1606, 1243, 1896, 2038, 3075, 2741, 551, 1094, -577, 1432, 898]
5877H98k139L62k015k838K123J530J661J965l398j037L563L078m55j179l198j869
5861b948Q97L438M105M08j653n82K03j191l090l92K300K898k686j871J609J684
5845C129l863j414K7j726j568J183K935p86k992R25K026o14j262j077Q23K499
5829a755r78k21J770n59j20K031K58R65l086k492L133k836J561K861p40l033m82
5812c723L157l37l77o66k413k63P04L161l00l167k93M724K118j590j022K03k15
5795b99j378l376L904L677k206j254j766K09o3n51J689L309j383k064l549j372
5779f473o65M691N328o52l46R71k229k897J333j96J204J421j34J868J06o78k08
5762B444J598j13j263k799k154j332K639J18K37p55l20J50K957j025j553j276
$$ y = [898, -1241, -879, -2894, -5732, -3609, -2079, -418, 1547, -1851, -2888, 675, 3753, 3298, 2119, -1079, -2948, -2051, 1387, 5492, 5900, 4247, 3665, 3868, 2677, -413, -805, 1495, 4393, 1707, -164, 1445, 3129, -734, -2148, -2121, -3847, -5415, -4232, -1297, -2083, -5075, -4150, -2124, -2738, -4000, -5077, -4254, -1755, -2733, -2954, -1184, -1743, -1863, 168, 426, 1391, -1695, -4187, -1054, -3890, -2329, 532, -208, -3241, -3723, -566, -903, -1280, -1946, -4359, -4622, -3918, -757, -1057, -4224, -4517, 207, 2325, 735, -287, -84, -299, -1677, -5053, -1149, 2528, 322, -932, -2698, -2489, -2552, -3103, -1414, 1895, 512, -1552, -5101, -6473, -7138, -2447, 2881, 2229, 1883, 2854, 625, -2272, -939, -1135, 69, 1490, 1356, 3224, 3330, 2652, 2444, 4042, 3929, 2666, -133, -2287, -3619, -980, -862, -625, -1380, -1700, -1550, 1407, 382, -1171, -2447]
5746b447P28r32N52M51j31k666M863J192k071k623k518J044M435k07k573L570
5730F67n79O58J601j918l33K270k768l555k702K792K261l42p61O058J678m415
5714F12n14K840n4j285J15k33L005N35k690K38j512P3K715o0j512r38K05J050
5696B590j927m472o14J600M43Q60n57q57l067K699N514P61j114K995K65m365l089
5679b335l613K767Q306K664J47j504m407j166p74n54J826K056q79j492j422Q77
5663D97J915M56R64j73l653k158K07r3R29J36M9M428K044j407j121o5J575K69
5645D799l151j187L35j96Q71J673J800K507Q2j937l717m177l29M142k054j108
5629a647O8P25j687Q46K160K21j595K227k025n43P57L51K265J84k268k757K375
$$ y = [-2447, -1719, -2651, -2099, -1648, -1779, -4445, 418, 1610, -461, -3084, -5602, -4558, -123, -330, -2903, 667, 88, 746, 2347, 429, 96, 2366, -402, -3957, -6659, -3867, -1606, -1948, -2709, 3349, 5027, 612, 98, 2938, 2884, 1599, 1714, 1481, 4486, 5021, 2331, 2569, 1057, 1130, 3845, 3785, 2273, 1335, 1540, 2590, 663, -3809, -4423, -2823, -2380, -1520, -2077, -2934, -6001, -3302, 2212, 2973, 1859, 4854, 5119, 754, -2335, -5948, -3181, 5125, 7789, 7936, 6432, 2025, 859, 85, -469, 1357, 3413, 2534, 1042, -380, 497, 2412, 2868, 3832, 3659, 6, -2152, -1945, -2038, -1109, -973, -924, 3504, 5548, 4141, 3020, 2955, 4530, 4799, 1648, 461, 796, 600, 1471, 3144, 4944, 7451, 7533, 5596, 1879, -2298, -2627, 1515, -539, -1647, -1579, -854, -2541, -1695, 465, 686, -909, 1318, -707, -1250, -493, -142, 2123, 2307, 39, -2718, -343]
5612c43L081j129J661k61j499P74J068J936j53l252m639J807J706J705j375r07
5596A80m208N26O64j360j188J195l548r8M133K577j498L25J615K199o10j961l4
5579a091K327k699J38n91K163P88J152K295P59m57k190k800k595J234M046J673
5563D152l697l209l359o3K592L091j238l524L076j258k070k754L722O558k029
5548a0m252k145P08M494J408q67l173N30K102o3l682l156k044K041M077K132L503
5531A603Q19L0j934l063k791P08K988J826k699j049L550R4M05k096p35K093N39
5514B88l504L4J308j436k116p00L838Q55j849l28J703L361J502m511k180J281
5498b454j4J149q17q91k523k331K002M111J975m05J048K181j124j388k055m942
$$ y = [-343, 2738, 1609, 3270, 3009, 1510, 2284, 3352, 5288, 5135, 1883, -2756, -949, 757, 2462, 1087, 180, -4028, -3502, -2838, -4198, -5386, -4191, -7739, -7837, -3704, -1127, -2625, -2300, -685, 1514, 904, -1057, -1091, 1236, -1463, -1325, -1916, 247, 1035, 2187, 4482, 5241, 4784, 2594, -206, -2801, -1567, 2479, 4152, 455, -2754, -6113, -6176, -3584, -493, -1731, -5255, -2179, -3437, -5507, -8261, -4539, 2019, -10, -4262, -6407, -5699, -1205, 203, -664, -3837, -3307, -1205, -1268, -4950, -8106, -10150, -8109, -4032, -1900, 1603, 2422, 2452, 518, -2545, -5336, -4628, -1640, 186, -2513, -3562, -12, 82, 487, -1609, -2344, -251, 288, -3216, -3182, -1874, -3310, -5426, -6126, -2288, -1433, -3282, -3610, -1907, 1454, 2956, -1555, -3735, -2454, -2468, -1319, -2136, -3027, -5550, -7881, -5879, -1768, 207, -198, 850, 3031, 1907, 519, -1536, -6478]
5482f478k89L848N884K750j690n24k995J09n41j707j61K707j162o7j524j683L031
5465d92J775J580K95k887l4J138L96j856j976k073K357j815N09O308M778k887
5449E116n922k941J796Q69l92P23p21j869j93k506K619J451n33l178j75Q77K197
5432b782L331P50j88k479O98k626j741q94l03K017j659K49K409L388N528L8j225
5415D511m16j49j126p34K01o26K797K005k363n624R74n48L089K346J103l830j756
5398a46K513j196q44j351M78n90k452J500M266J930j184k985N62J560o35j723
5382b97j147n474J576K664R89q63j305J219L683N45k864j79J343k193r91K996
5366b98J607L291R38k338j283N8J013k538j774o21J117n15M97J168J665K96n76
$$ y = [-6478, -6767, -2919, 2965, 5715, 4025, 3501, 506, 615, 74, -1633, -1794, 913, -249, -316, -1840, -3523, -492, 1283, 2863, 3158, 271, 237, 1375, 1771, -85, -2061, -4134, -1777, -3592, -3083, 3225, 8003, 5116, -806, -3747, -1951, -1082, -1474, -751, -1472, -3341, -3534, -6040, -3421, -1970, -2503, -5681, -5856, -4979, -2782, 549, 1299, 1111, -1368, -670, -3296, -5037, -5931, -6234, -4217, -5876, -5627, -3218, 170, 5698, 5736, 4511, 4095, 3946, 2820, 2086, 2287, 1661, 4458, 6463, 4100, -1524, -550, -1098, 1991, 4337, 5440, 1610, -146, 2367, 1171, 327, -1024, -546, -1136, -3588, -2088, 2178, 4108, 2924, -61, 501, 2061, 1426, -297, -1444, -6918, -5342, -2678, -1689, -2552, -3857, -2638, 1045, 1590, -1274, -1453, -110, -2303, -3294, -298, 1309, 4600, 5538, 3200, 1917, 1975, 2988, 450, -1324, -1945, -828, -1343, -846, 322, 1987, 2283, 1707]
5349A707L12k41j534m333K354J647q48J725l72J988j097k823K431J814P41m5L741
5332G167O81o208k582q05K989p97r62K233j208J475J319j300k76l47J236l171
5316e56j77J995P21M23l59l05r88l355K252L591L110q33k131q29Q39j478k099
5299a79r3j966j031j91n92O74K974r4m398L13O56J21M09j05L138K302k24j889
5281a75o66J851Qj69J187n59N01Q15j178k214m580j621M386L334R62j050k678
5264a846K997r6P00j54k434q66O2m08m71j144n55J131m22L15q33J505K541M09
5246D31j234R3K339n42j50j691k047K268M186P22l685j481J471L60J59l83k444
5229a628k075R54K513J359j807j342m92m15K014K166L834j03m895m86l049l105
$$ y = [1707, 2019, 1778, 244, -4089, -1735, -88, -936, 789, 417, 2405, 1308, -1515, 916, 2730, 3471, 3426, 7167, 7848, 1640, -942, -1747, 1242, 445, -517, 1716, 508, 1983, 3302, 2002, 1726, 1379, 2615, -556, -733, 1262, 1983, 2406, 2047, 1742, 754, -2601, -349, 3242, 6352, 5519, 3388, 2559, 3398, 1920, -179, -272, -2238, -3269, -3460, -4052, -3378, -404, -498, -4896, -4583, -3927, -3806, -3397, -3502, -364, 1938, 1714, -175, -841, 1010, 1018, 849, 2036, 1477, 1978, 2793, 1615, -599, -5179, -6800, -2414, 920, 1882, 832, -1846, 1151, 1055, 1755, 1601, -833, -1699, -1637, -2045, -2516, -3660, -4215, -3084, -3506, -3191, -4024, -2519, 22, 431, -803, -710, 1629, 1087, 937, -754, -2801, -533, 3653, 4375, 690, -791, 680, 1040, 1199, 816, -1628, -3703, -2749, -236, 1123, -684, -2026, -2518, -2933, -919, 1247, 5081, 4978, 83, -403, -3452, -6557]
5213f557K775K367k17p31j06Q97Q9j78K467k491r32j33k46l273R93L340J732j001
5195a205j497P7L171o65k000o84J543k95K287J385K70K554J71r08m385k323j802
5178d306p04J774K212M54M56j797j355Q89j009K271M004M36K028K76j663J220
5162E186l416m541l070r44J817j247p62K816J052P56K766j301m090m79L586L095
5146A224j7j951l766r71N928R02n416O06M297k63J017j14m770k461o99J311Q19
5129d324J78K891j184J845K940j623K21J678l933k01K601L97l795o35R85r28k001
5112d888L686l71k823m58K086J954P08M05k11q62J548O80L85j008m2J161J83P10
5094B843j834j66r9M38j153j439k660K4J061N02l337l245L331M195J243Q68K992
$$ y = [-6557, -3782, -1415, -1632, -2363, -2469, -1572, -1483, -1661, 806, -1685, -2617, -2750, -2996, -6269, -5276, -1936, -204, -1205, -2702, -2625, 546, -119, -2119, -2803, -1260, -1555, 732, 2117, 2387, 4941, 5112, 4204, -181, -2504, -4306, -5010, -3236, -1024, -570, -114, -1911, -3266, -2377, -3386, -1115, 2889, 3325, 5353, 5629, 3966, 5186, 1770, -2771, -5841, -6785, -4968, -6215, -6977, -4161, -3109, -2353, 413, -888, -4978, -5457, -1871, 1224, 1207, -744, -4510, -5481, 447, 1349, -4067, -3461, 836, 573, 1590, 1476, -3294, -5755, -6454, -5143, -4324, -4146, -1255, -2439, -594, 2346, 723, 944, 2622, -1311, -1512, 1089, 1486, -2309, -2944, -1959, -2887, -4888, -1202, -1573, -4396, -4854, -2768, -814, -106, 299, 88, -774, 774, 1454, 1839, 831, 789, 1950, 2133, 2843, 1009, 843, 744, 1182, 29, -1410, -4070, -4046, -2985, -2483, -5820, -9065, -5734, -1539, -296, 572, 3564]
5077C564k43l468j515Q43O95J97j42k439m60Q31K218K950k758k898j26M258l507
5060b000k822j080p51J313L016J769J661K825k694l350j558J122M06L40k355R51
5044c207n68L044J425N07l958J941J718N22N50k249P45N24j854k110K198J88k179
5027b763l8L000L035j217l701n65L223j979q52J164J663N00p66J030r05k168J16
5010a223J943r74j81Q01J658p4q19l717j852K844K608j192Q2j342j64K417K058
4993B873K368J428K192l939m469n04j412QL88k86l557L19m64O83L014j715k936
4976f009J91j037L294L543P94o58q05J535L08J677m16L083J61j796o633P62R11
4959a095q2J07J20J009p18l066J425j696k015KM47q47J383J839L370K280j482
$$ y = [3564, 3321, -147, -1662, -819, -124, 73, -69, -2508, -2968, -2137, 81, 3031, 273, -2625, -2751, 1507, -2000, -4822, -5902, -6653, -5340, -2324, -555, 1106, 3931, 1237, -2113, -3671, -2549, -2143, -1803, -4158, -3207, -3775, -731, 694, 1201, -2757, -816, 902, 1424, 1974, -275, 470, 994, -860, -2970, -772, -584, -2763, -2801, 199, 3234, 2017, -1684, -2249, 974, -1005, -1857, -693, 970, 1470, 704, 1734, 829, -1339, -1223, 720, -254, -435, 366, 2024, 1950, 1131, -2586, -4438, -1594, 1014, -178, -96, -1438, -1602, 815, 2873, 5241, 6669, 8861, 4922, 453, -51, -1463, -1455, -1067, -1353, -4910, -4591, -5055, -4372, -1358, -3073, -6009, -5818, -6855, -3561, -18, 776, 118, -687, 848, 1156, 2833, 2417, 5500, 5661, 3865, -2768, -2006, -1095, -1177, -1070, -950, 59, -659, -3725, -2300, -3996, -6011, -6009, -5562, -6409, -5026, -3187, 183, 2463, 981]
4942I81l032J165k85R62J465n0O61J599J363m557l687M98j016l44M04J742l43
4925b474R18m12j444J178L134K031J2K105J158p97l415P5K736jL62m925l405j94
4907c358J924N22J800K985K13j931m411k433Q9L32P14M3J316r26k434J616M83
4890c456j817K400J082K1L312K54k397r79r98q61k68O13j564J748L543J911o36
4873A908k780l885j578J432K017L300L133q25k995j151j584m72j410N49q47J038
4857d150j33q50L810J372j476j402P43j106l95K005k031k424J219O878M496l559
4841B997n191j019J840j607j604J46K056M72P12J499M366M752J333k953p94l067
4825C938m383o19k079J877J24J207K672j193J55l91k509p42K110n95k436J655
$$ y = [981, -2051, -886, -1171, -209, 1256, 1206, 1867, 3466, 4829, 272, -3415, -2917, -3933, -4277, -3873, -2131, -2474, -1556, -1968, -3412, -2234, 900, 2931, 2943, 5048, 6206, 5409, 1994, 2069, 4805, 4804, 5166, 241, -3164, -3358, -1434, -912, 888, 3873, 4086, 2155, -2256, -4689, -4600, -4268, -3554, -3511, -2195, -3121, -5555, -3939, -3456, -5273, -2873, -1791, -1770, 1542, 1796, -601, -1580, -2578, -3439, -3707, -3094, -4658, -2910, 633, 2544, 1908, -872, -4757, -6335, -4903, -2886, 414, 3547, 2722, -273, -1424, -3008, -3480, -4890, -4341, -5188, -4150, -4283, -5133, -1323, 49, -1427, -2829, -2086, -3192, -3587, -1582, -3613, -6037, -4818, 2060, 6556, 2997, -2194, -3213, -1373, -2980, -4584, -4438, -2382, -1910, -1198, 301, 4667, 9419, 10752, 7799, 7005, 3938, -445, -1064, -3143, -1266, -1142, 65, 2737, 1544, 1699, 1308, -1201, -1943, 167, -428, -2864, -1209]
4809a209m81K597m57J502j393L9K279L71j869J657r15j91L521M294k917m051J887
4792D664m61l050j939m109K155L846k19K826N09j37O66L413k998j341m18l808
4776d01j112O91k524k289K373J673N88L340l30j987J68k153K52P74J447J811K37
4759B558o68k429j796K965O70m240j091K496J583p79j636J981K872l45P71L6L671
4742F619M506l52o77o70l826k874l5J416K437o01k010j989J148M57J614o15L16
4725D864n95l076j744L17l88n52k301j114j20K8L375j53q43J336L154M899K28
4708G315k933k89R8q78J457o91l713Q66K435k665J11J525l05l01O47M84m201p78
4690a816J639j207J656Q48j563k703j015J233L32j932o06r92K276J562k121L07
$$ y = [-1209, -1690, 907, 450, 1952, 559, 598, 2877, 3248, 1379, 3036, 2121, 1930, 5451, 9745, 6828, 2777, 4664, 4203, 1153, -786, -4895, -2740, 1106, 887, 3713, 4222, 4085, 4751, 8164, 5166, 3825, 3407, -401, -1513, -822, -3346, -5635, -3262, -1589, -1001, 2339, 2009, 22, 190, -1963, -1711, -937, 510, 2321, 2558, 1890, -539, -2335, 630, 1300, -2940, -4031, -1535, 48, -731, -2367, -386, 2486, 2141, 2912, 2948, 6619, 11125, 10773, 10096, 9426, 5600, 2726, 2691, 4107, 6544, 5943, 3933, 1944, 3092, 3549, 5163, 4548, 4864, 4269, 1193, -551, -234, -622, -1174, -3475, -4589, -4709, -4681, -1306, -1459, -2302, -966, 2188, 7087, 7315, 4382, 4093, 4191, 3313, 4770, 4079, 366, 1232, 3667, 1002, 1113, 2638, 2333, 2032, 2679, 3163, -1038, -1816, -177, -1384, 272, 1120, -443, -3146, -4161, -2928, -2596, -4528, -5134, -6126, -3850, -2288, -4409, -4102]
4674d102M8j57j103k120J365k00j305k18K255k47J701M177O36k127l41K305j670
4657a103m070k38L327l87n41M610J870N73J178l572l656K226O57k833j176K235
4641i00L07j763r9K094m78l223J20j062J87M619O025j996o14P61k752l853L471
4624H44r18M82K72K44Q02l374m107k289L435K354J191L81P62P14M3L38k00q97
4606G7j631n390K290L587J642J070m77j838M19J94P80K64J242J720J31o38n555
4589b113j298L224k388q36Q13j041J917J873K55o04j355K621j01R34m3j047j412
4572f01k096k46K017R43p1M34lL12L61k342j206K556n36j781q75l796M381J982
4554e67m184J935J274k33J430J263k575j760j600j636J601L828K862k558j340
$$ y = [-4102, -4054, -4211, -5314, -7434, -6069, -6269, -7574, -7792, -5537, -5784, -4083, 94, 730, -1397, -1738, 567, -1103, -5173, -5411, -2084, -2471, -3012, 1598, 3468, 4041, 5219, 1647, -2009, 217, 874, -1959, -3135, -900, -593, -2356, -2455, -361, -839, -4062, -3942, -5004, -4817, -198, 5827, 3831, 3217, 3978, 1226, -2627, 844, -74, 408, 680, 924, 1726, -1648, -5755, -8044, -4609, -2255, -1064, -683, 79, 793, 836, 1174, 974, 77, -1554, -6944, -4654, -1067, 575, 1645, 1168, -670, -251, -57, 723, 987, 2229, 3949, 4080, 3442, -2113, -3411, -187, -2575, -3411, -2598, -3639, -1722, 151, 406, -198, -1553, 1068, 967, 1901, 1858, 811, -601, -2697, -2943, -926, 17, -54, 380, 377, 689, 1050, -1292, -2498, 58, -478, -2259, -3134, -6930, -2549, -567, -4751, -2816, -1542, -1775, -345, 918, -1657, -3417, -5017, -6653, -5052, -1224, 1638, -920, -2260]
4539b260k682L56Q43J295K039J255J405N50J694k77M58n5l281k00k060N09K614
4522B203q36l284M924K911N53J240m252n282j865J648J087J826J619p82m479q91
4506c660K014O47k885l47L560K511O37m454J943J487n12j555r8N15N93K43J080
4489A719j825k005L864O37j138j892n90j301L785K734l114j186Q28L919K320n30
4473F225k472k670l18l84P29O28L71p79K448n83k739L8p13j331J867Q2L22J300
4455B021j525j743J798J500K580k264m015J458K423K934j584k829k514m189j92
4440f141L972j036L15j354J065j228J730P09R23j108J326K338r8J75j462K548
4424B674O31j835p30q16J28Q88k396j184M09L435j34p14l34o95l41P93K170n66
$$ y = [-2260, -4942, -4586, -3743, -2448, -409, 846, 2251, 2801, 4495, 4218, 4676, 4621, 1340, 1140, -920, -411, 2203, 1367, -1917, 3007, 5918, 6471, 7711, 3459, -1823, -3688, -2040, -953, 873, 2492, 1710, -2769, -3660, -1646, -999, -3884, -4231, -671, 1840, 2477, -1977, -34, 1453, 941, -614, -712, -197, 396, 639, 1719, -106, -2111, 1753, 2390, 1252, -640, -1230, -2531, 1254, 3988, 874, -312, 516, 4435, 6755, 6225, 3753, 1083, 765, 381, 1110, 1738, 2109, 1330, 3778, 3195, 456, 494, -219, -1550, 317, 399, 721, 2021, 496, -1247, 551, 2051, 4631, 2367, -1648, -190, 2233, 5167, 3583, 754, -1760, -5949, -6141, -2169, -3205, -2890, -4244, -3179, -4407, -2677, -1968, -1045, -2153, -827, 1511, 1413, 1588, 126, 2674, 3305, 1470, 740, -76, 52, 940, -1456, -2640, -2231, 1204, 1070, 356, 22, -673, -1014, -221, 1949, 1383]
4406A383j678J690K46j60k960r43K14O79J110j079k546l184N394N237o77k228
4390D98k501Q56K449J303k117l53k329j83Q0Q52K746M478k862k336l067j672j875
4373f033J279p43Q65N622N41l78k108k123L247O10R80K259k786m646J809J016
4357e89J662J805J913k356j877J535L328k862l75J247P98j189j212L153r35p79
4341C267J245J748r23p446k430n29J361K695M402J632l94k199k72K307R95k05
4325E254j544o87j33j621l20J830P58l96j094j972l22j633N89n20j523r96L24
4308d006J359K215K140m407l051K375R38M29R5J695L340J151J74l4j179Q41R42
4291E017L06J547k046m260J998M754j698k566m58J317k237n06k025K310P90k230
$$ y = [1383, -295, 1395, 1641, 1481, -1479, -2422, -2208, -1529, -419, -1498, -4044, -7228, -1834, 3403, 2726, 498, -2003, -1147, 1302, 2605, 488, 135, -2194, -2377, -2297, -1445, 1301, 5779, 2917, 581, -2486, -4158, -6033, -4754, -5497, -4632, 990, 1531, 1153, -955, -3078, 169, 779, 1759, 4018, 1232, -3414, -1605, -589, 1073, 2878, 4791, 2435, 558, 2093, 5421, 2559, 2184, 3431, 4229, 3040, 1828, 4981, 4046, 3267, 4512, 6260, 5337, -2109, -4539, -5068, -3707, -1012, 3390, 5022, 4628, 2429, 2157, 4464, 5459, 5254, 3710, 3023, 2890, 1269, 949, 2779, 3537, 3141, 2047, 75, -247, -1880, -1291, -1811, -3334, -4330, -4006, -2647, -432, 1708, -2699, -5750, -3375, -2437, -2008, -1913, -218, 3122, 4273, 4447, 4413, 3234, 4075, 5017, 5323, 6870, 4824, 564, 2562, 7316, 5618, 3052, 2594, 3911, 1674, 1168, -857, 1453, 2243, 13]
4275A3k087Q94K988Q01k245j660J186m661j03L308J38j974j426j509j32M970M429
4258B930r89j303K52l293j520o13q15K42P58r37M45L403K534k334O99O16l622
4241c547l810J202L508M005k819n098o02r17j371r19J16L665O099J747N66lk90
4224A532K222Q33p95j378q57M1kk240q14j00m70M07K485j359r34o51P2j40K928
4205G80L007k225k669R60K456l555l448j482J528K146o07N03J104K632L912l292
4189A750m911j518O88L228K343J224k237L28J818M66k163k306J343M193n277m056
4173e087k149K408L493j39j232L42p28j102K613J908L386J70m736j821K306m04
4157g72p34Q06O68k21l179o16r32l394M55M291L180O28J152K601l525k256L16
$$ y = [13, -2074, -1180, 1808, 2609, 364, -1296, -110, -4771, -4874, -1566, -1428, -3402, -4828, -6337, -6469, -1499, 2930, 1941, 638, 890, -2403, -3923, -4536, -5351, -5109, -4351, -5288, -4843, -1440, 1094, -1240, -541, 75, -3547, -7357, -6155, -2647, 1358, -1461, -6559, -7161, -8078, -9449, -10368, -10252, -6587, -488, 1259, 1825, 1822, 1532, 3754, 4587, 3792, 2414, 1557, 1598, 1596, -644, -1458, -1558, -2028, -1621, 864, -495, -1429, -2080, -2008, -2148, 780, 3787, 1562, -1107, -147, 2309, -1246, -4694, -6176, -4648, -2502, -3109, -2606, -1502, 1130, 5042, 1750, -3161, -4679, -3991, -763, 1580, 2804, 567, 895, 2713, 3179, 1016, -1290, 53, 4246, -1031, -5087, -7236, -4828, -1335, -1474, -2706, -2364, -3092, -4194, -1581, 327, 3713, 3883, -853, -2674, -368, -772, -1506, -700, -32, -253, -3432, -4048, -4980, -8374, -7919, -3628, -448, 180, 1332, 3933, 408, -1848, -1532]
4140a532m66j102L486m08k268n17J347o60J405P42k12j787K005L305j111p74j013
4123D40j339O63O00K88Q2j422j97k050N24p24o08J25n10j225R61j04j140K46J606
4104c784J383O36j552J773J244J809k00K6j183k648Q20J187l97K094K60k223K613
4087A858j87j835L887L05j101l019J896K458k951k681j36N61Q34J592K307N17
4071D305k406j503j295K28M89R60K888J296j298P95j222k008j543L547J788K287
4055G308J746j888l874k095o28L35J40l299j694L43J842P22O40N35O47K748N33
4038D061j072l803k275J325K567J390j325J194l96k35L939J418k108l24N02n31
4022D327J537k50l156J282J146o246k809L566M411J682k656J717N81j297o87j823
$$ y = [-1532, -1998, -3100, 386, -22, -2290, -2807, -1460, -2120, -715, 27, -185, -1972, 33, 3338, 2227, 1453, 440, -899, -236, 364, 652, 734, -688, -885, -2935, -2411, -3135, -3743, -3618, -4128, -5353, -4392, -4496, -5636, -5390, -3784, -2401, -1765, -3317, -1544, -300, 1509, 1309, 1335, 152, -2496, -1676, -489, -886, 1208, 1468, -755, 1858, 1671, -164, 3723, 4028, 2927, -92, 1804, 4262, 1311, -1370, -1506, -945, -111, 1481, 3788, 4305, 1899, 396, -899, -671, -182, 778, 3666, 4962, 3664, 4459, 3237, 1229, -314, 3233, 5021, 7308, 9054, 7166, 3292, 1197, 569, 904, 1044, -2255, -3949, -3606, -1764, -1042, -402, 133, 780, 3528, 4061, 2989, -814, -3089, -1764, 803, 2193, 868, 2062, 1666, 1431, 5370, 6788, 4680, 4356, 4858, 4327, 5864, 5614, 2458, 3740, 4886, -1360, -4169, -603, 3808, 5490, 2834, 4551, 5132, 3835, 3148, 1325]
4006A325q69L853j74k693r43J166j874n1K010j306n002k265K069J891k200n17
3990e580j248Q01M133L496J280l99m542k684K194L290J548L884o82j827J979K024
3974G667j354m231m552l51L227M92m402k90J472J725m4K496P12j737k901n007
3958g078l77j025M839J934k696J084K479K020R72k35O3K368k342n52J889j524
3942A819j125K973J011k439k86P63l321k161Pj19l773r85J620L150M154l44j185
3925b41q72o32J580j573l098j424N073K401j674j963K762M051q94l358J114L010
3909D262j602j781n76Q49k307l809J858K001k47j86m90k313k371L072K26M075
3893F61m16P36L572k575j837L356n18k204P7j880j7K166J001p44J792k326n661
$$ y = [1325, 456, 4309, 4135, 1442, 499, 1665, -209, -260, 1750, 444, -4558, -6823, -4754, -2863, -5063, -5580, -6828, -6027, -1894, 1602, 2882, 2483, -2059, -4743, -2549, 741, 2289, 6173, 5491, 3664, 5643, 7667, 6313, 2082, -2470, -2821, 406, 898, -3504, -3794, -2322, -597, -641, 1855, 2567, 830, -2071, -7078, -7455, -8480, -3641, -1707, -4403, -3319, -840, 1180, 2152, 1917, 1980, 4348, 2006, 1454, 3343, 1819, 694, 3667, 4678, 2239, 1953, 2716, -605, -2766, -2759, -2878, -6651, -7636, -6016, -2866, 1288, 944, -241, -1113, -1745, -165, -1738, -4836, -6260, -1187, 1214, -460, -2423, 339, 4390, 3496, 138, 1252, 4262, 2660, 879, 303, 1152, -1155, -4964, -3106, -1105, -1352, -1538, -2028, -4341, -6712, -3640, -3414, 661, 245, 981, 4553, 1978, 141, 3497, 2979, 775, 852, -1028, -1045, 1121, 2122, 1378, 3170, 844, -4817]
3876d817P97L341r76R52M40K029N030j283l850Q0k46k627j959J761J722P40R13
3859B047j904k98k159J304L0J295M83K346k370R3K341J297j508J172p77K325J757
3842G474j603l83l276m424L600J078j92n54L09j882m15q65K26j92l632j007O39
3825e099R50K98n91k31k534L211J912P62O99J416L104k945k05q53k995M156J926
3808B981N96P18j283Q95k559j2J620J60M89j742j209j111k447N34L333J164j403
3791G24j132J585J17J99j075K203n11l151k763R64M705N45j55m294l285L262L749
3774A687k671j432J319k269k835q39P31r60k129r68K214J837O72K050O74j920
3758d839q1K976K339j605l611l502K597M305J484q5m77j387j427k06M197L661
$$ y = [-4817, -4020, -679, -1655, -703, -263, 1766, 6796, 5513, 1663, 1743, 1497, -1130, -3089, -1328, 394, 1134, 2047, 143, -155, -2314, -1010, -980, 315, 798, 3144, 774, 867, 3208, 4505, 2997, 4169, 3392, 5717, 7474, 5871, 5488, 2212, -2212, 1388, 2466, 2274, 1720, 2029, 147, -268, -1133, -907, -1099, -4731, -5738, -5099, -4149, -3851, -4442, -4673, -7207, -3996, -2084, -1322, -623, 793, 3897, 952, 747, -106, -3101, 1055, 2981, 3577, 4295, 3012, 3907, 1348, 1336, 2956, 3116, 3605, 1863, 654, -457, -2904, -2370, 963, 2127, 724, -408, 1177, 1294, 1493, 418, 2621, 2110, -1041, -3804, -2840, 1865, 2410, 2255, -2039, -5324, -2062, 1687, -984, -2416, -1097, -3366, -6201, -7040, -6309, -7269, -9398, -10366, -8152, -6315, -5643, -3593, -2919, -4839, -4920, -1944, 395, -1210, -4821, -8323, -5726, -1421, 63, -22, -499, -1886, -3313, -3519, 678, 4339]
3742D339K97j706k354r59K95K362K269l26R93j951L40J519j636m797j215k017
3726d547M88J365K614L31l110j81M679K662j317m680l20j766n12K449J487k213
3710b571n423R27J103J432q66J788L737j520N76M59r88K147J79k035k105j003
3694d163j86l50Q97J930l1K152j52L873k615l599J499O70q95k226L17L458K518
3677C097L33j913J322O98K37j7l311l148j945J758L740J860R83k257j529K058
3661A966l91m264j694P38K625L69J389J033j893j582L409J513m918k557q16J473
3645c600K103p02j359k895J334o61m19J476M06L916J017K69j08n63n61K360j109
3628I04j262M48L652L38L78m11m194Q66p51k472K263K178p90m71L268K229k906
$$ y = [4339, 4636, 2930, 576, -383, -88, 2274, 4543, 4217, 5210, 3259, 3599, 5118, 3482, -1315, -2530, -4547, -4059, -2694, -80, 251, -2859, -3040, 1639, 4301, 2984, -1696, -2016, -3782, -4294, -1845, -358, -2571, -7994, -7067, -5964, -4532, -5398, -3610, 127, -1393, -817, -358, -1346, 801, 980, -1055, -3160, -4163, -4349, -4699, -3802, -1872, -1903, 249, 97, 3970, 1355, -2244, -745, -75, -970, -3196, -2879, 579, 3097, 3430, 1517, 2839, 3537, 3774, 3757, 446, -2702, -4647, -2889, 851, 2711, 3694, 1437, -92, 1966, 1575, -2689, -4383, -3645, -1020, -651, 738, 1771, -122, -1704, 1705, 3218, -1700, -4257, -5073, -3600, -1497, -2199, -3558, -6453, -5119, -5780, -6199, -4723, -4317, -401, 616, 885, 777, 214, -347, 2013, 904, -358, 90, 3742, 4080, 4458, 4047, -147, 719, -32, -2504, -241, 1937, 1147, 676, 3944, 6173, 3267]
3611C267n571L50n66L831J236p62k277O62j504o92o26j03l176K078r76l09J613
3594c525l04K77P86J037K143L755j383j834K446L595or57j09l053k439q0L353
3577C702O14r25lr50m174K274J189r43j275M97M71m45J152q31l108o42J542k608
3559d463q86K609J445m391N51K243J648j418R03M164M447n82j498l231l503j227
3543c189R20L60r17n66j590k214J82J243o34P29J528K588m63K72q89J457L911
3526B728J143j501J717r66l040m141Q16K259N5K015K435n32o98J475J060J421
3510F246j71k075j035r66j546L33M571k190m820k18k323Q26L874L591m194l158
3494c255J091K100J913j451q9l260l206K432M846K663K2j869n29J346K131o15
$$ y = [3267, -2304, -1954, -2520, 1311, 2547, 1785, -492, 170, -1334, -2026, -2652, -2755, -5931, -3853, -4829, -5138, -3525, -3829, -3552, -2766, -1729, 414, 4169, 2786, 952, 3398, 6993, 6987, 6030, 5921, 2868, 429, 349, 3702, 4316, 3391, 3388, 2438, -1736, 538, 1727, 784, -491, 6, 477, 32, 1184, 353, -2755, -3397, -1855, -4463, -5349, -2740, -1295, -5686, -5135, -2892, -1244, -2662, -1759, 2405, 6852, 6270, 4772, 1541, -1962, -3189, -2269, -1909, -2826, -3392, -4982, -7196, -7014, -5771, -6405, -5676, -4148, -1560, -2023, -1751, -2640, -1183, 2728, 3871, 2370, 4087, 3121, 81, -4060, -3244, -985, -930, 1085, 3520, 2988, 2290, 3765, 4825, 6246, 6075, 4000, 2965, 1999, 453, 786, 5357, 3167, -1653, -1871, -4194, -3368, 506, 4097, -97, -3255, -2164, -64, 1849, 398, 309, -2951, -6157, -3725, 1121, 3784, 3806, 1937, 1408, 2754, 4885, 4270]
3478D270j520r76j7k199j137J27j897j96L087L217Q51j027k831j889K441Q02k25
3461H81J364q45o74q90j469p01q78J686k297K734N211N66J59p33q15k176l330
3444b207J107N038L318j801n24j129j266J343k05j809l1q15J152r48k741l90K245
3427C37n6j271J774k242m53K341J67k965M48m2O79O45j620j73j029J653j428o77
3409c912j145n85J714k403P11J645K249j475K400N72l595k881K732K991j267J004
3393a245K66j242k432j632L527L17K072J002L13j331O74r73k153mJ511j646Q6
3376b890N247m05l703j486j479N64L364K762L115J002L6j470J309j503k470m393
3360b400m083M53L153m86j314k70K748p43j661J212L454k567j904K743J21L83
$$ y = [4270, 2750, 1774, 1757, -442, -1579, -1452, -3349, -3545, -458, 2759, 3610, 2583, -248, -2137, 304, 1106, 881, 2245, 1400, 726, -164, -1633, -2334, -3212, -1526, -3823, -1089, 4122, 4688, 4847, 4114, 3299, 1123, -2207, -1100, 3938, 7256, 5455, 4931, 3802, 2536, 3879, 3674, 1865, 1834, 1019, 2171, 1223, -1518, -1908, 337, 281, -990, 784, -1458, -1911, 430, 597, -2368, -1920, -1962, -1283, -638, -2258, -2431, -3460, -1807, -3235, -3912, -5057, -5642, -3928, -6331, -5620, -3975, -1726, -3201, -801, -229, -3824, -6705, -3973, -982, -2249, -1245, -979, -2221, -4653, -6285, -2758, -2441, -369, 633, 946, -385, 289, -684, -2837, -2841, -1330, -2976, -2890, 2357, 1952, -1751, -3237, -4716, -4152, -788, 1974, 5089, 6091, 6127, 4657, 5966, 4463, 1993, -2400, -6483, -6030, -2877, -3363, -4677, -4947, -2199, -2942, -4603, -3391, 63, -2504, -4408, -1665, -1544, -1161]
3344a161k991k226J931L393L051l515k504J653J676K76k196J266L42Q42k344k393
3328d900P96N652J289r83P69j423K698M590J25l579m95k476m672q05L151L435
3312C172j069J422l518l078K123J490M93L022j982l506j912r14k376K598o94J38
3296d591J54R57j098j19R97J572M64k62m579M29K604Q14k996k35J296K639K356
3279D02j739l183J738K365O13K40r80J967K008R03J020k437Q7N56R46k473j243
3262G90O23L8p94j231J123L336l559P59L6o225k333J529K295k77m120j747L763
3245e994K786J066q43j531j105K1K069K456j027k440J199J626N43j648j191K409
3229a604K492P24l077o99K087K034k32j976O9k209R19q03M01J782j797J264n27
$$ y = [-1161, -4152, -6378, -4447, -1054, 1997, -1518, -4022, -2369, -693, -417, -2613, -1347, -1005, -163, -2507, -4900, -4104, 1548, 2837, 1854, 2623, 1200, 3898, 8488, 8613, 5034, 4539, 2063, -2609, -3414, -263, 3172, 2103, 3525, 7, -3071, -948, 542, 1035, 4057, 2075, -1431, -3343, -4257, -6633, -4035, -4729, -4591, -4437, -3480, -4578, -4697, -3700, -2128, -1664, -1926, -6505, -6076, -3472, -2658, -5654, -5889, -4593, -1954, 402, -1337, -4520, -2782, -417, 196, 436, -544, 1423, 3431, 4334, 5354, 2917, 3004, 3560, 4506, 2033, 790, 1413, 1451, 657, -574, 549, 3885, 326, 1085, 1121, -5104, -7437, -5908, -3613, -3890, -8010, -9757, -5994, -3208, -2142, -2985, -4516, -5621, -5600, -3531, -1075, -2102, -4542, -3343, -1717, -1174, -2822, -4013, -1604, 888, 1612, -1465, -2164, -77, 1957, 1725, -251, -182, -2391, -1472, -2275, -1874, -92, -1889, -625, -1152]
3212a152J017k792p63o86Q27K893R41n49k547J451L096k092j456J597k463J75
3196b503L692L418L003k745o763k240M959L877n93q25Q59j53m472j686J708J779
3180A315l433Q73J251J549l025k373L301N681O66m826m853J284K284k57j575k363
3164d501K73L097L956L733k059l682m272j842j273J543J546L956N35P81l26l516
3148b051n66J290l75l21O24P61J6J114J636m09k126m95k893k074Q10K988k90L382
3130A021J573J643m34o4l311J261r20J286L456J241j844k39k069k785M28p56k308
3113b821j33n99k15n89O517K048j980nl156k317O73J526J078J712l585K26L450
3096A830J33K83j49J760l656k90K286J886q99j193J14L324J260l618Q16m68k443
$$ y = [-1152, -135, -2927, -3690, -4376, -3549, -656, 285, -264, -2811, -1360, 1736, -356, -1812, -215, -2678, -2503, 1189, 4607, 7610, 4865, -1898, -4138, 821, 4698, 4105, 3280, 4139, 3986, -486, -2172, -464, 1315, -2118, -1245, 6, 1555, -1470, -3843, -542, 5139, 5805, 979, -3874, -2590, -306, -563, -2138, -4501, -4228, -1131, 2825, 6558, 4499, 817, -3455, -5297, -6570, -5027, -3481, 475, 1010, 1791, 1465, -2051, -2617, -1327, -1702, -2023, -1399, -638, -622, 492, 2128, 1719, -407, -902, -3795, -5869, -5059, -2071, -2361, 1021, 2594, 4237, 3803, 3739, 428, 1689, 769, 2055, 5511, 6752, 4908, 4669, 2600, -185, 243, -513, -2821, -2954, -3553, -3768, -4357, 2160, 4208, 2228, 2223, -933, -3250, -2577, -1051, 27, 1739, -1846, -1620, 1830, 1963, 2246, 2097, 3857, 201, -89, 2197, 4083, 3184, 1991, 2105, 5429, 6689, 3071, 3887, 3419, 976]
3079I76n51J198q29L157N349l456n772k810K534J937P05k460J129K73k121j818
3063b559M89J110m15k094J139J404j660j848O33k078N72M15l180K595o06Q83J238
3046c962K901J857j892j327l90j557p99j935P15K447J371J851K027l73L156J483
3030E573k664j566K758J821r84j657j439k256j742P82K968p36j693j768j947j775
3014f325O38L361j204J730M276k219o9M30j631q48k806j490L97J409K43J049L059
2997@j751O8J336k67M89r70J549j000j939j159K849K303k436l415j21K470K567
2980E73R52L95L27J780K536k768k397n58j048n41k491M926K120j531L95l771l64
2963a465L50j705k60J976L128j498l336J590J60q79J941j366k75J856j512Q55
$$ y = [976, 425, 1623, 794, 3951, 9300, 5844, 72, -2738, -204, 1733, 2438, -22, 1107, 1380, -741, -2559, -2070, -960, -1375, -3469, -2330, -926, -2586, -4434, -3801, -5879, -5307, -4892, -8072, -5477, -6083, -5200, -3962, -1061, 796, -1096, -2423, -2813, -4370, -5169, -7104, -6389, -3942, -2571, -720, 1307, 934, 4090, 5573, 2909, 1343, 4101, 5922, 4938, 3281, 1842, -414, -2156, -1374, 1594, 858, -835, -2603, -4550, -6325, -5687, -2326, -3530, -1800, 2476, 257, 188, 618, -1013, -1861, -4667, -6157, -5760, -4351, -4108, -3059, 0, -1751, -1683, -347, -614, -125, -1095, 454, -546, -2485, -3644, -795, 1508, -928, -4343, -4464, -1994, 573, 1525, 1920, 2247, 4027, 6563, 3795, 1398, 840, -208, -749, -3240, 1686, 3806, 2275, 2670, -1101, -1465, -1115, -2820, -3080, -1104, 2024, 526, -2810, -1220, -1060, -1939, 2, -1364, -1639, 217, -1295, -440]
2947d40K040R73q7j046p63k218j439R89J495k968m16J074r08O65J628P38M60L988
2929C765R24j664j659K66j123j202J81L282R08K62j413j734j354p55j216nK424
2912a13K133l230k95K04J553j801J541R01J928q91l929J022j313J35J805M51k021
2895a920o309R45K609K85r47l99L531J173p14j496j90O483P51m730q33j27Q66
2878a022J364l87J605J551P63O14j781J13l7O52J496j145K52J742N11j852j546
2861B893n54j190m45k154k035R44n46L55M31m09J584R55j198J525p4o3j361l5
2843a377J26l38n3q97l95J371J16q98L089J389J901P44l285k53j585j94K41j672
2825a970j211j572l02J714R65K621J505K08j530J458K183o77K24J491K004N85
$$ y = [-440, 1600, 2573, 2486, 1440, 677, -1541, -2980, -1991, -496, -3464, -3880, -2806, -3714, -3049, -1421, -683, -223, 3765, 4689, 3025, 1366, 1632, 509, -693, -512, 2770, 3678, 3940, 2527, 793, -561, -1316, -2532, -2537, -113, 2020, -1210, -1505, -1301, 252, -1549, -8, 893, 2821, 1930, -1999, -977, -2290, -2155, -350, 101, -1920, -8229, -7284, -4675, -4390, -5337, -5736, -2205, -1032, -1746, -3242, -3432, 3051, 3802, -928, -1761, -1888, -1022, 342, -45, 1560, 3111, 3874, 4488, 2707, 2820, 2783, 3435, 4931, 3786, 4038, 5780, 6291, 4439, 2893, 2339, 1149, 704, -1450, -3485, -2541, -3087, -2732, -2301, -2710, -1126, -171, -1369, 156, 82, 19, -1342, -1377, -1251, -1589, -1642, -2539, -2934, -1563, -1447, -2345, 744, 2133, 4034, 4778, 1493, 1240, -345, -539, -298, -1970, -3181, -4753, -5055, -3341, -2376, 245, 1750, 1958, 428, 1886, 4069, 3392, 3616, 5107, 7111, 7696]
2809G696l019m883j19m14K957N40j030p0K182M234j979m021q98p12K11J567n50
2792A692J076n98L48M67P13M08l779l092J091P12k198j068m88N887M523J237o487
2775D44k167J134l476m254k97j46K778O108K979j864j471m019p33R64M73M45q07
2758c909K90k5L323p2j342j177n49J486J450K694J071j605j922J354m4K210L497
2741F730k53k198j772p96k26r19N92K00l76J478j509k269j317J599J117J75j069
2724h13n66L98J159N34j329Q43k549k015J039K192L012J99k90r12l457j079R18
2707b716M106L368o20k545m93J834J432J636j961j214K922L441k702j741m99j209
2691C039o69o26R79j701m801O48k53j224m6K762K090M73l6l012k745j848L513
$$ y = [7696, 4677, -206, -325, -739, 2218, 2758, 1728, 1658, 3840, 8074, 6095, 2074, 1176, 464, 675, 2242, 1692, 2768, 2170, 2518, 2985, 3698, 4106, 327, -2765, -1674, -962, -3160, -4228, -4716, 1171, 5694, 6931, 444, -1723, -589, -4065, -8319, -8616, -8762, -5984, 124, 3103, 1239, -232, -4251, -4984, -4020, -3547, -3102, -3909, -3619, -3644, -321, -393, -1735, -2912, -3461, -1975, -525, 2169, 3240, 1635, -287, 1067, 1023, 3233, 6730, 6477, 4279, 2507, 1711, 1485, 566, 1158, 1358, 982, 2460, 951, -1318, -2635, -1036, 81, 256, -813, -1379, -981, 178, 712, -617, 226, -2323, -4338, -3299, -1107, 1905, 2104, 1814, 902, -2555, -3634, -2716, 1390, 4758, 4138, 1593, 1100, 2934, 4366, 6002, 4041, 2827, 5749, 9190, 6488, 4747, 4248, 3039, 2370, 1744, 2723, 1022, -3779, -3131, -3384, -4608, -4654, -1892, 198, 671, 635, -2377, -5122, -6970, -3457]
2674c457O763M921m07l483j850n7k58k82j703k028j517J262R94J234J009J211
2658B352l96k949m58k018J938q08K077O06J299k072j659K093R90j909J204N001
2642E291K790r21j177l413m303k30J448k938l00K589Q52k55O8p88j703K96L096
2625D02K919j991j514J523J289R79k077r56J456l078K508N4Q31p29k077J41K455
2608B135P4m26J851N31k515k967L29N05J76M69P91L75J963j901j301J421M687
2591F197k957m692q22k739J363L655P26m12L128p96m070k361J182k06n1K682R65
2574G92m35j29K870r97l454J9k564o97K923L087R71j09J447N07l386k465L370
2557A750q78r34k818Q74J827L90J123J775j491m539r69J36m82L186N348J890p62
$$ y = [-3457, 3306, 8227, 7820, 4337, 2487, 2430, 2172, 1890, 187, -1841, -3358, -2096, -1102, 132, 1141, 2352, 1956, -993, -1451, -3469, -1531, -2339, -262, 344, 1643, -429, -2088, 5, 995, -914, 290, 5291, 8081, 7160, 5983, 2570, -1733, -1963, -515, -3453, -3753, -1164, -312, -567, -499, -1287, -2990, -2694, 402, 3321, 1330, -184, 1339, 2628, 3607, 1530, 574, 2030, -1048, 1460, 1514, 2345, 1616, -461, -320, 2135, 2209, 1783, 3634, 4165, 1650, -1317, -988, -483, -307, 162, 953, 1328, 3291, 1390, 89, 1510, 6197, 3240, -1452, -2274, -5013, -3650, 5, 731, 319, 3447, 2651, -1419, -3780, -2598, -2804, -2855, -173, 792, 357, 228, 3098, 2101, -1353, -1334, -3898, -4595, -1672, 1415, 2386, 2277, 3724, 4231, 845, -1620, 1750, 872, -62, -2880, -2006, -179, 211, 1334, 3109, 1618, -2921, -3890, -3754, -4236, -1050, 4298, 6188, 5426]
2540E426k990m97K487k159o215k53J200j857k442K5R66p70K646K69Oq08k66K724
2522b508L959J036p74r41l01j416J301J28j154J101J330o06l990n75j429k888
2506g727l45r10K957M302K646Q11j565O02K18K582J365m321k738M597K199j236
2490C437l861k949J34J117j214J328l41K211j019n01l00k69N91m95j941j510k272
2473g854O00L045K212N0k993q5O73M10L536K324J637n02l977m48M16r5R52K014
2455A915o68K52j287M018j058l642Q52K302Q25K277J260k001K38k77j176j335
2439B495L267j456j361J529j141K602K828J302r01j026j372k269l83k301l819
2424b006m793j98j512R43K57K743K075Q95j536J154L78P19J54j647k353n18K317
$$ y = [5426, 2436, 1939, 4426, 2267, -3948, -4201, -3001, -4858, -7300, -7275, -6309, -7079, -4433, -4164, -4158, -4966, -5232, -2508, 1451, 2487, 1713, 772, 471, -945, 356, 484, -670, 431, 1761, 1155, -2835, -3410, -4839, -7727, -8072, -8982, -6025, -1723, 923, 1734, 169, 771, 989, 3571, 4936, 615, -2123, 2474, 4673, 3437, -424, -3373, -3239, -2122, -3336, -2008, -2349, -138, -1157, -1658, -1958, -2227, -1636, -2131, -4072, -5582, -7854, -7254, -4209, -1997, -1947, -4940, -5025, -4352, -3942, -406, 1918, 3555, 3053, -924, -1372, -956, -1051, -99, 1915, 1247, 1499, 212, 4230, 3172, -470, 382, 2684, 3509, 5786, 7046, 5045, 5283, 5006, 3830, 2495, 5762, 4306, 2945, 4474, 3333, 5935, 8763, 10065, 9164, 8138, 6766, 4497, 4114, 1813, -2006, -6799, -6997, -8509, -7566, -7309, -4566, -2491, -1596, -3132, -1978, -1600, -881, -727, -2374, -4727, -5245, -2928]
2407b928m74j298J649K971J726L531K904m858l348j570o95J975K788l414k148
2392c189K179o49J400q00j591Q41l88M583P49K181j489k710l127J760L331O34
2376C715o66k444q86k401J391Q84K800j94J039J033k684K07J12J733K049j048
2360D640k690O35K48j579K691J02k757j934m21j698K989N062N72q08k010j243
2344A799J661J570P10j909l564J073J823M582K26m027m131k598J771K666J471
2329C123p44j755j870K993J615p8N5J128j252J176j148k933m377K525j350j198
2313d090J508J627m580L336J299L02l05j66N076K88k956l88q93j390k742K020
2297b054K911q02q02q06L154k330k047M760l81l183l674O28N71K58q57J681K610
$$ y = [-2928, -3402, -4700, -3051, -80, 1646, 5177, 8081, 3223, -125, -1695, -2390, -415, 2373, -1041, -3189, -1010, -1659, -259, -1059, -2650, -1809, -2197, 2386, 3135, 5316, 3827, 1117, -2010, -250, 3081, 3715, 3049, 605, -281, -2682, -1291, -407, 2393, 2199, 3238, 4271, 1587, 1794, 1906, 3639, 5688, 4640, 1950, 2585, 2833, 1254, 3945, 4047, 1290, -644, -1065, -2763, 226, 5288, 5860, 5052, 3042, 1799, 3460, 5030, 5740, 3831, 267, 1340, 3163, 7745, 7971, 3944, -187, -2785, -1014, 1652, 3123, 2379, 624, -1246, 1747, 3362, 3284, 3339, 4467, 3215, 4391, 3243, 310, -4067, -1542, -2892, -4090, -2582, -955, -5535, -2199, -900, -598, -903, -1069, 4007, 4295, 1339, 951, 58, -1332, -4074, -2054, 857, 55, -747, -1553, 1601, -729, -2776, 1984, 1603, -1580, -5254, -4626, -4055, -3797, -4654, -2973, -363]
2280c63K437R77l96k385r67m961k143L030J893P90J218k55K405K814k723K60K256
2263C887k598o48J849M93J962p44m633j43l84L68K382m869k950q96L09N77P69
2246e269N68M026r18M25j120m608O22J727K989J441K570J624j875K92J811N58
2230D863j402j218j430J844L756j121l202j034k155j3K212K147K092k032j688
2215A619k754j187n57J219J569M36j965p4R72L156K473j735m022K063L87l82k739
2198a521K07J571rK136k534L23K175N34l409p13O28P35j453J280R68j94O23J020
2180B367K8j005r82k309N74N434q13m584k995K130K601K038j449k999q92J723
2164a133n01J065j931k66K874L691N88k790l312K99J86J41M906K025m915m722
$$ y = [-363, 2074, 3051, 2655, 270, -697, -5658, -7801, -4771, -2878, -2088, -870, -1125, 1280, 4094, 1371, 1631, 3887, 1289, 641, 2490, 2983, 4945, 4201, -432, -575, -959, -591, 1791, -3078, -6028, -6924, -6615, -6038, -5269, -4701, -675, -1593, -1168, -2288, -6896, -6274, -4547, -1558, -117, 2453, 4077, 2202, 2494, 4305, 4863, 3461, 2243, 813, 2657, 6413, 5292, 2090, 1056, -1099, -1112, 1100, 3247, 5339, 3307, 1619, -1135, -2322, -2879, -1660, -91, 345, -1620, -1694, -722, 2434, 4907, 3172, -850, 1213, 1600, 1218, -1521, -1314, 257, 248, 2384, -150, 173, 2348, 2882, -527, -1240, -612, 123, -1330, -50, 918, 724, 1347, 2367, 2395, 1390, 408, -1901, -1327, 4107, 3294, -1290, -4285, -2155, 446, 2484, 1035, -1964, -2856, -1133, -1634, -569, -2500, -2766, 108, 3799, 4387, 1597, -1715, -1416, -1230, -1089, 3817, 5842, 927, -3795]
2148c795j087J020p43K01J752j101L895M821l46k261j454m751j613J859K941R55
2132B93P00J0r37j478k204Q48l3j627J598j424J012N73J83L004m40m255J833K334
2114a0k881j70p51Q98j18k3K773j70K218R02m375k845M002L912o57k686k579j421
2096c981r94J397j173j860J202N753K511k089Ml21l41j83k535L77R1L108j874
2079i08J894j435r73L542J453l499j856o1r35L045Rj81L7J973L149p88n54j485
2061B427N13O94r18j756O07L445n5j898J76k087N07L48j857j811K485O351j51
2044G020j75m754l769k99Q94K959K740J999M02l236j840J205L619J047L1j315
2028F528l048l125Q51K209j48j116l213M61j712R15p49j721k366n00N216M325
$$ y = [-3795, -4882, -3862, -4605, -4404, -2652, -3753, 142, 4963, 4617, 2356, 902, -3849, -5462, -3603, -662, 293, 993, 1003, 66, -1412, -3616, -2768, -2801, -4428, -2830, -4254, -3242, -2669, -2486, 518, 78, -4177, -2344, -10, -2891, -3061, -3812, -2914, -3032, -3055, -282, -452, 1766, 2668, -1707, -4552, -550, 3362, 2705, 19, -2560, -3981, -4975, -3578, -4751, -6611, -5409, 344, 2855, 766, 770, 449, 108, -75, -2610, -2233, -2142, 966, -908, 986, -449, -1422, 2120, 3573, 74, -1782, -1843, -2778, 267, 276, 95, 132, 2105, 5254, 4466, 3912, 2427, 2940, 3634, 2716, 960, 1567, 5012, 4957, 3059, 3235, 1148, 1655, 2003, 146, -1665, 820, 7171, 7020, 6845, 2091, -1678, -1977, -1083, 1876, 4616, 6615, 7017, 3781, 1941, 3146, 6765, 7812, 7843, 6528, 3480, 355, 1206, 3415, 3267, 2151, -1062, -601, -2313, -1398, -2147, -3868, -6234, -6734, -1518, 2807]
2012B807J843k775K694O30k887m256j599K62J920J730J698l544m23J972J982j947
1996A07k454K857J650n657K13k573j307L998O148K251j876r3J72j859k279q08
1980a510J871K056K483P66k279m652l49k87P57J958K082J968K999m196l853N3
1964a33r26R60J661j43k679Qj819J933M856o34m075J356L001J306l178j518n02
1947e26j137K392L723J187J518J847j099m284n288P39P91q42J382K266O78R96
1931D343k13l788K92J059j36j890j712K259j00K758j967j489K555p26k439m63
1915a657Q30r32O59J232p7J669k136l702p80J123J928M24M00j850k68J601K554
1898A018j594o24J881j057j991M4n02N5J93k520J282K453k20R64Q74l10K075Q63
$$ y = [2807, 4650, 1875, 4569, 5199, 2312, -1944, -3543, -3281, -1361, 369, 2067, -1477, -1900, 72, 2054, 107, -2347, 510, 2160, -3497, -3284, -5857, -7164, -3166, 2982, 5233, 3357, 3264, 3436, 1577, -702, -1510, 361, 2417, 4900, 5666, 3387, -1265, -1614, -1901, -1144, 814, 2896, 4864, 7863, 3667, -186, -133, -1059, -99, 1562, 1419, -1260, -1252, -3071, -1138, 3718, 3084, -991, 365, 3366, 4672, 1494, -24, -526, -1663, 729, 4452, 5639, 7157, 9004, 7905, 3621, -1667, -928, -137, -979, 403, 2669, 3347, 4343, 4130, 342, 634, 1693, 1557, -333, -2045, 214, 114, 2872, 905, -584, 1971, 1245, -1194, -1657, -827, -1759, -1100, 132, 55, 1724, -412, -4114, -4894, -3771, -1843, -1419, -1019, -2869, -3137, -1536, 1018, -576, -1200, 681, -376, -2367, -2323, -2825, -2770, -2577, -5097, -3815, -1362, -1582, -618, 256, -54, 2021, 2884]
1880B884l31j242r1P52j84l660j21K981J316M707J789k31l529n614p97j651k20
1863c242L762J031j670Q99O79k978o54o6J207J599R68k360k81K736J096k243m511
1846d028j089K059P87l32j466j527m88K552K568o49L265J192p14j012k877m329
1830f088j267J296O99nP66J986L192J979j63L43q3j560K774O10J44J998o90l394
1812B537l174k020j868J927M408k728k370J162P46k076J963L369J50m34J694O45
1796C931O87l466j729J793J329k3M438j611n905k738K94q92k05Q54J071K573L780
1779D181L012r10m002k689J345k414J562L00n66j443P29L688L709K112k016k546
1763D052R73j114l438J549R59j64j962k271k124Q90J130m196j031p8l51J270M551
$$ y = [2884, 2553, 1311, 1220, 1972, 1788, -1872, -1993, 988, 2304, 7011, 8800, 8569, 5040, -574, -1371, -3022, -3242, 520, 1551, -119, 780, 1459, -1519, -2173, -2239, -1032, 567, 1535, -825, -1106, 1630, 2726, 483, -4028, -5117, -3058, -2271, -2603, -4069, -5596, -6084, -3532, -964, -1613, 1652, 2844, 2130, 1118, -1759, -6088, -7355, -6059, -5360, -5365, -4599, -2613, 579, 2558, 2395, 2738, 2655, 1095, 3869, 4479, 4623, 6621, 5931, 2537, -637, -2657, -4525, -2598, 1810, -918, -3288, -2126, -1380, -3456, -1493, 1876, 2026, 1592, 3286, 3931, 4618, 1152, -577, 1216, 2545, 2522, 6960, 5349, -556, -3294, -3000, -3892, -4097, -3243, -2172, 401, 4181, 7193, 6283, 2281, -408, 937, -1477, 85, 385, -181, -1624, -895, 2793, 6502, 8614, 6598, 4052, 5025, 3911, 473, 2022, 2981, 2817, 855, -1416, -3540, -2650, -1520, -5716, -6747, -6825, -7176, -5906, -1355]
1746a355M671O69J232n284k279M1RK778K197K241j933l155j220K408J316k589
1730b53l410J575K413Q80m52n93K18K728Q84j573J375k210j200O29k438J069L178
1713B820l00j972P19K509j056l528j637K968m55K211K587j157j400K473J122k690
1697C214j795j879j497L121L494N70j543l61k43J372m379k428j653J238Q96L869
1681A996j666k8P21j92O58Q82J24l871k428J88J998K163K029J504P46J773K95
1664F892k074k097r68l76j628j178j965J026J699J432J854Q25r02k476m753M63
1648d226M250j49J347j92O87J270L17j846j363j783J419L122M29N48l684j589
1632a443M60L649L526L121rn314m082j135p77j83n07j894L313K731K353p85q47
$$ y = [-1355, 3316, 3985, 5217, -67, -2346, -2305, -2296, 482, 2679, 4920, 2987, -168, -1388, 1020, 2336, -253, -3663, -2088, 325, 1205, 753, 160, 378, 3106, 3990, 2417, 3792, 1582, 382, 1011, -1427, -358, 2820, 2520, 548, 1267, 3776, 2720, -808, -2445, 523, 68, 2279, 4866, 3709, 2309, 4782, 5904, 3214, 1419, -460, -1957, 1164, 4658, 5228, 3685, 3324, 3081, 4453, 74, -2354, -4007, -2769, -1873, 1996, 330, 302, 1023, 831, 1489, 2371, 2495, -1376, -3804, -3616, -1618, 545, 2574, 4078, 4824, 6597, 6892, 4818, 2721, 1753, 1377, -251, -1429, -3394, -2368, -669, 763, 2617, 3442, 2540, 64, -4689, -4226, 24, -125, 1222, 1030, 1717, 2987, 3304, 1458, 95, -1688, -269, 2853, 3282, 3830, 146, -1443, -983, 2666, 6192, 9313, 9304, 3990, -92, -1227, -2004, -2187, -2694, -4588, -1275, 1456, 3809, 3024, 2177]
1615B177o84r81K335k727k967l004Q06Q94K880J842M96n86J536j490k293K866
1599A100o46k988n0L298m30m40j307Q45j689J658l325J79K757L170K586J551J171
1582G440k429o213j947Q47L928L729m59m043k895k165j958J37K6K943L381J397
1566A719j93j348J018l76L328j69n324k725J422K088j59L501L700l26m243k402
1550d89j120p94J288r42O45K431K663R51L075L453l703j668L515l07l705o017
1534g24l708n18J876K336L04N68j258k696j118j221k491J100K635L987M469n12
1518C029J593Q6n430n48L585J397k294K376m065k047J574M203m930l487K417J473
1502a068m87J30M54J573M270L79m249j9j046m15k569j911l211o65K905K575j143
$$ y = [2177, 1493, 512, 2847, 120, -2847, -5851, -5045, -4151, -1271, 571, 1067, 481, 2017, 527, -1766, 1100, 454, -2534, -2584, 714, 284, -156, -1463, -618, -2307, -649, -3974, -3795, -1038, 2132, 4718, 6269, 7440, 5011, -1202, -3149, -2302, 1626, 5355, 4896, 853, -2042, -4207, -6165, -6028, -6002, -3059, 322, 1719, 1526, 178, 1196, 820, 4148, 3979, -1345, -4070, -2648, -560, -719, 2782, 6482, 6156, 1913, -489, -1609, -2403, -1115, -2057, -1412, 1019, 3682, 4633, 7708, 11161, 7458, 5790, 9305, 8998, 5293, -724, -4432, -4950, -3074, -738, -434, 134, -1124, -3820, -4938, -6159, -8650, -7550, -4915, -928, 3541, 3029, 4622, 4708, -722, -1270, 2315, 3712, 1418, 3794, -271, -2318, -744, 3459, -1471, -4958, -2541, -1068, -1555, -1425, -971, 602, 4872, 5251, 1002, 983, -63, -478, -3047, -4958, -8169, -8834, -5929, -3354, -4497]
1485d497J450L307L150M086r84m553k876J281M299J753Q22K931l975n619m805
1470d230p14L317k41j76j046k376l83L548K701L261J783k146j47J933j281J608
1454E411J281l3o198k481J062P76K121O71P91K510j869k989l803N26L892K290
1438C958J218J176l325k513R99L608k765k338k48K568K104j506l147r58o9L63
1422h75L09K253m26N53K416J680q86k871K563J46n79k836n52M28j213r72l23j904
1404c089j8J368j356n52K50j878J036L959K430l79p21K704O93P82j119R32k173
1387B869m94j86n232N12o46L010O49J121N56j647m656M090K388N30k04J112l215
1370E57J771N30J444j088m668l265J063R08K027J255j578n23l13J727J682R8j713
$$ y = [-4497, -3047, 260, 3410, 7496, 6512, 1959, -917, 364, 4663, 6416, 7238, 10169, 6194, 575, -4230, -4944, -1627, -1868, -2044, -3090, -5466, -5849, -2301, 400, 3661, 5444, 3298, 3151, 5084, 3803, 5411, 6692, 6659, 461, -2020, -958, -182, 1939, 2610, 3401, 5911, 4042, 1053, -2750, -2224, 1668, 3958, 5176, 6352, 3027, 514, 1513, 5121, 2356, 18, -230, 2338, 4442, 2936, -211, -1169, -1238, -875, -566, 1687, 1261, 1814, 4230, 5910, 5024, 2153, 4716, 4862, 4283, 1447, 895, 1323, 110, -862, -1185, -3089, -3107, -1739, -3095, -3647, -3397, -5275, -4239, -280, 2150, 1771, 1050, 3754, 4447, 5229, 4110, 5042, 2869, 2375, 2189, -3043, -2531, -3177, -167, 482, 1603, 2159, 512, -4144, -54, 2334, 2864, 2660, 3772, 557, 2328, 2858, 4302, 3214, -1454, -4719, -3656, -2748, -721, 534, -1044, -1567, -1880, -153, 1529, 1627, -86]
1353h6l087k499N61J214k167J286L576K264k83M5J589r75N42k690k663k54L196
1336d31J833j402p29K578J040J857k06k545j276j624J644L561k401k932r03L012
1320A076M99l075j258j351j274L623L32J524J08J635k611j681J112Q56J373N88
1304A476l361k044K808M790J965L69m038J58k552k240l50J15j1J542K186j24k269
1287a580J08L656k25k335r50l35K496O86j094k880m669M03m9K57K673nP1J917
1269a855o70K615j936o94K526L78M84q99n36m682j43J858k90L39L561N709j484
1252D281m558m129r18L376K8m67k812k451N157M623j126q0J200l90j950P89J284
1235A857j704J430K967k76l999j346K022o93j728m42K581J568r3j965j639L2j195
$$ y = [-86, -3173, -5672, -5111, -3897, -6064, -4778, -1202, 1062, 779, 824, 2413, 1438, 1980, -710, -3373, -3627, -431, 1402, 0, -729, 1849, 2889, 4746, 4540, 1995, 719, -905, 739, 4300, 1899, -1033, -1936, 1076, 1575, -1500, -2758, -4109, -5383, -1760, -1428, 96, 204, 1839, -772, -2453, -1341, -485, 888, 1476, -1885, -3929, -1121, 3669, 5634, 6003, 1965, 2123, -429, -2669, -3019, -2904, -2915, -1373, 813, 689, -1580, -1472, 2184, 1959, -376, -1326, -1661, 835, 1521, 427, -2453, -7122, -6719, -6768, -6511, -3838, -3843, -3772, -1855, -2525, 90, -1846, -2540, -14, 364, 848, -51, -587, -5269, -5412, -3554, -3844, -3505, 56, 5765, 4281, -277, -4406, -5324, -1948, -1920, -2387, -5199, -7650, -2493, 2130, 1004, 924, 2124, 1734, -216, 573, 1857, 153, 1583, 4550, 4274, 275, -1071, 951, 258, -1470, -1912, 669, 2237, 2144, 179, -1460, -1428, -2623]
1218b623o00L431l78j510j693n22L892K807k851j844L56L48m89q39J146q40n1
1201b260j762M616M9j698L20j359R34o89L978M939o31m361j241J18l23k008Q57
1184e21L444n22K96j126l724J143K246q76J051L53j25l03k496J328L773J313l37
1167D917L893l03k546j153j523j885p35j341J529J413N762m99l105k969j875k800
1151c220O85q93n58k99R98q4J518J309o84k765l170J549M389L081j341l402j465
1134d352k007M693N258k195l390j880j249l84J587K396J036m432J922j079l36
1119d412N97J476J031K210k036R22k91j892k91L991J892l631L92J485j034J391
$$ y = [-2623, -3223, 208, -170, -1680, -3373, -3895, -3, 2804, -47, -1891, -1535, -1187, -1676, -2515, -1369, -2209, -2260, -4022, 594, 643, -1055, -735, -2094, -1160, -1849, 2129, 7068, 6437, 2076, 835, 953, 630, -1378, -521, 2923, 2401, 2697, 1571, -2153, -1010, 1236, 360, 1411, 1764, 1639, 1336, -1160, 168, 3941, 5254, 4917, 8810, 8507, 5961, 4808, 3285, 1400, 665, -676, 853, 2266, 8028, 7529, 4424, 1455, -420, -3220, -2535, -3428, -3986, -4285, -3287, -3371, -1853, -544, -1228, -3993, -7163, -5614, -1225, 1856, 515, -2887, -4352, -6359, -1666, 3592, 1397, -1993, -3873, -5122, -5506, -3919, -1523, -487, -4919, -2997, -4076, -4412, -3815, -2339, -1308, 902, -1134, -212, -503, -2395, -2686, 1305, 3197, -434, -42, 1443, 409, 1800]
$$ [...]
##END NTUPLES=NMR SPECTRUM
##END=
