##TITLE=Analysis number 327901
Compound Code tl 00869
Project Code adrs
Chemist Name aci
##JCAMPDX= 6.0         $$ Bruker NMR JCAMP-DX V2.0
##DATA TYPE= NMR SPECTRUM
##DATA CLASS= NTUPLES
##ORIGIN= Bruker BioSpin GmbH
##OWNER= nmr
$$ XWIN-NMR		Version 3.5
$$ Tue Apr 17 08:53:05 2007 GMT Daylight Time (UT+1h)  MAYBRIDGE\nmr@NMR_250MHZ
##.OBSERVE FREQUENCY= 250.131544655141
##.OBSERVE NUCLEUS= ^1H
##.ACQUISITION MODE= SIMULTANEOUS (DQD)
##.ACQUISITION SCHEME= undefined
##.AVERAGES= 16
##.DIGITISER RES= 18
##SPECTROMETER/DATA SYSTEM= dpx250
##.PULSE SEQUENCE= zg30
##.SOLVENT NAME= DMSO
##.SHIFT REFERENCE= (INTERNAL, DMSO, 0, 16.522)
##AUDIT TRAIL= $$ (NUMBER, WHEN, WHO, WHERE, WHAT)
$$ ##TITLE= Audit trail, XWIN-NMR		Version 3.5
$$ ##JCAMPDX= 5.01
$$ ##ORIGIN= Bruker BioSpin GmbH
$$ ##OWNER= nmr
$$ C:\u/data/dgb/nmr/ADRS/1540/pdata/1/auditp.txt
$$ ##AUDIT TRAIL=  $$ (NUMBER, WHEN, WHO, WHERE, WHAT)
(   1,<2007-04-17 08:52:37.36 +100>,<MAYBRIDGE\nmr>,<NMR_250MHZ>,
      <created by zg, POWCHK disabled, PULCHK disabled
       configuration hash MD5:
       49 4B E0 1D 92 C2 6B 37 9F E6 65 BC 52 41 86 1D
       data hash MD5: 64K
       AE 0B 74 3B 8C A7 6A 67 85 11 6E 0C 5F CF 6E 32>)
(   2,<2007-04-17 08:52:54.77 +100>,<MAYBRIDGE\nmr>,<NMR_250MHZ>,
      <Start of raw data processing
       ef LB = 0.3 FT_mod = 6 PKNL = 1 SI = 32K 
       data hash MD5: 32K
       7A 91 E9 E5 DB 2B AC 52 3F 78 52 1C 9B 3E 5D 03>)
(   3,<2007-04-17 08:52:56.61 +100>,<MAYBRIDGE\nmr>,<NMR_250MHZ>,
      <apk 
       data hash MD5: 32K
       A2 CA BD E3 EB 15 2F 6A 74 92 DF 7E 55 C3 5E 64>)
(   4,<2007-04-17 08:52:57.45 +100>,<MAYBRIDGE\nmr>,<NMR_250MHZ>,
      <abs ABSG = 5 
       data hash MD5: 32K
       76 4C 9C ED 09 B8 0D CF 71 B9 AD 90 68 41 54 D1>)
$$ ##END=
$$ 
$$ hash MD5
$$ 96 35 06 21 23 AD 9F 35 21 3A 8D 7A 64 44 7B 05
##$RELAX= 
##$RELAX= 
##$RELAX= 
##$RELAX= 
##$RELAX= 
##$RELAX= 
##$RELAX= 
$$ Bruker specific parameters
$$ --------------------------
##$DU= <C:\u>
##$EXPNO= 1540
##$NAME= <ADRS>
##$PROCNO= 1
##$TYPE= <nmr>
##$USER= <dgb>
##$AMP= (0..31)
100 100 100 100 100 100 100 100 100 100 100 100 100 100 100 100 100 100 
100 100 100 100 100 100 100 100 100 100 100 100 100 100 
##$AQSEQ= 0
##$AQ_mod= 3
##$AUNM= <au_zg>
##$AUTOPOS= <2 >
##$BF1= 250.13
##$BF2= 250.13
##$BF3= 250.13
##$BF4= 250.13
##$BF5= 500.13
##$BF6= 500.13
##$BF7= 500.13
##$BF8= 500.13
##$BYTORDA= 1
##$CFDGTYP= 0
##$CFRGTYP= 5
##$CHEMSTR= <none>
##$CNST= (0..31)
1 1 145 1 1 1 1 1 1 1 1 1 1 1 1 1 1 1 1 1 1 1 1 1 1 1 1 1 1 1 1 1 
##$CPDPRG= <>
##$CPDPRG1= <>
##$CPDPRG2= <>
##$CPDPRG3= <>
##$CPDPRG4= <mlev>
##$CPDPRG5= <mlev>
##$CPDPRG6= <mlev>
##$CPDPRG7= <mlev>
##$CPDPRG8= <mlev>
##$CPDPRGB= <>
##$CPDPRGT= <>
##$D= (0..31)
0 1 0 0 0 0 0 0 0 0.06 0 0 0 0 0 0 0.0002 0 0 0 0 0 0 0 0 0 0 0 0 0 0 
0 
##$DATE= 1176796355
##$DBL= (0..7)
120 120 120 120 120 120 120 120 
##$DBP= (0..7)
150 150 150 150 150 150 150 150 
##$DBP07= 0
##$DBPNAM0= <>
##$DBPNAM1= <>
##$DBPNAM2= <>
##$DBPNAM3= <>
$$ [...]
##$SUBNAM7= <"">
##$SUBNAM8= <"">
##$SUBNAM9= <"">
##$SW= 20.6930455092707
##$SWIBOX= (0..15)
0 0 3 0 0 0 0 0 0 0 0 0 0 0 0 0 
##$SW_h= 5175.983436853
##$TD= 65536
##$TD0= 1
##$TE= 683.16
##$TE2= 300
##$TE3= 300
##$TEG= 300
##$TL= (0..7)
0 120 120 120 120 120 120 120 
##$TP= (0..7)
150 150 150 150 150 150 150 150 
##$TP07= 0
##$TPNAME0= <>
##$TPNAME1= <>
##$TPNAME2= <>
##$TPNAME3= <>
##$TPNAME4= <>
##$TPNAME5= <>
##$TPNAME6= <>
##$TPNAME7= <>
##$TPOAL= (0..7)
0.5 0.5 0.5 0.5 0.5 0.5 0.5 0.5 
##$TPOFFS= (0..7)
0 0 0 0 0 0 0 0 
##$TUNHIN= 0
##$TUNHOUT= 0
##$TUNXOUT= 0
##$USERA1= <user>
##$USERA2= <user>
##$USERA3= <user>
##$USERA4= <user>
##$USERA5= <user>
##$V9= 5
##$VALIST= <valist>
##$VCLIST= <CCCCCCCCCCCCCCC>
##$VD= 0
##$VDLIST= <DDDDDDDDDDDDDDD>
##$VPLIST= <PPPPPPPPPPPPPPP>
##$VTLIST= <TTTTTTTTTTTTTTT>
##$WBST= 1024
##$WBSW= 4
##$XGAIN= (0..3)
0 0 0 0 
##$XL= 0
##$YL= 0
##$YMAX_a= 383612
##$YMIN_a= -355983
##$ZGOPTNS= <>
##$ZL1= 120
##$ZL2= 120
##$ZL3= 120
##$ZL4= 120
##$ABSF1= 16.522
##$ABSF2= -4.171173
##$ABSG= 5
##$ABSL= 3
##$ALPHA= 0
##$AQORDER= 0
##$ASSFAC= 0
##$ASSFACI= 0
##$ASSFACX= 0
##$ASSWID= 0
##$AUNMP= <proc_1d>
##$AZFE= 0.1
##$AZFW= 0.1
##$BCFW= 0
##$BC_mod= 0
##$BYTORDP= 0
##$COROFFS= 0
##$CY= 12.5
##$DATMOD= 1
##$DC= 0
##$DFILT= <>
##$DTYPP= 0
##$F1P= 14.0000005364418
##$F2P= -0.99999901652339
##$FCOR= 0.5
##$FTSIZE= 32768
##$FT_mod= 6
##$GAMMA= 0
##$GB= 0
##$INTBC= 1
##$INTSCL= 1
##$ISEN= 128
##$LB= 0.3
##$LEV0= 0
##$LPBIN= 0
##$MAXI= 10000
##$MC2= 0
##$MEAN= 0
##$ME_mod= 0
##$MI= 0
##$NCOEF= 0
##$NC_proc= -2
##$NLEV= 6
##$NOISF1= 0
##$NOISF2= 0
##$NSP= 0
##$NTH_PI= 0
##$NZP= 0
##$OFFSET= 16.522
##$PC= 1
##$PHC0= 219.3098
##$PHC1= 4.693779
##$PH_mod= 1
##$PKNL= yes
##$PPARMOD= 0
##$PSCAL= 4
##$PSIGN= 0
##$REVERSE= no
##$SF= 250.13
##$SI= 32768
##$SIGF1= 0
##$SIGF2= 0
##$SINO= 400
##$SIOLD= 32768
##$SREGLST= <1H.DMSO>
##$SSB= 0
##$STSI= 32768
##$STSR= 0
##$SW_p= 5175.98343685301
##$SYMM= 0
##$S_DEV= 0
##$TDeff= 65536
##$TDoff= 0
##$TI= <Analysis number 999999
Compound Code 99
Book Reference 9
Project Code 9>
##$TILT= no
##$TM1= 0
##$TM2= 0
##$TOPLEV= 0
##$USERP1= <user>
##$USERP2= <user>
##$USERP3= <user>
##$USERP4= <user>
##$USERP5= <user>
##$WDW= 1
##$XDIM= 32768
##$YMAX_p= 354462662
##$YMIN_p= -250817
$$ End of Bruker specific parameters
$$ ---------------------------------
##NTUPLES= NMR SPECTRUM
##VAR_NAME=  FREQUENCY,     SPECTRUM/REAL,   SPECTRUM/IMAG
##SYMBOL=    X,             R,               I
##VAR_TYPE=  INDEPENDENT,   DEPENDENT,       DEPENDENT
##VAR_FORM=  AFFN,          ASDF,            ASDF
##VAR_DIM=   32768,         32768,           32768
##UNITS=     HZ,            ARBITRARY UNITS, ARBITRARY UNITS
##FACTOR=    0.157963299565203, 1,           1
##FIRST=     4132.6476996994, 0,             0
##LAST=      -1043.33573715361, 0,           0
##MIN=       -1043.33573715361, -250817,     0
##MAX=       4132.6476996994, 354462662,     0
$$ Real data points
##PAGE= N=1
##DATA TABLE= (X++(R..R)), XYDATA
$$ [...]
15216h666P63M021J689j305K319M244M51K572j2487m109L634J1719j015K816r877
15201c231r776P578O45l847l684K193M401K657K547m856m910j014j736N94j459
15186a3898l817l334j946J0409L862j781L073P176P510n526o424n05O306n488
15172d383q011J870j263J454Q552P637R58l673m306N138M245l806k098P353n079
15157D588j7190J067N385o4J674r07l913M27K23m549N231j733j949R418n796j2804
15141b0892l26J3623L115n362j033J018O519P05M793Q596K903n915k066N31l573
15126B636l175p5j248J146n869P505O316r717m840q249R001L182q83J558j371
15111d083O16J619O80%l209o086k983m500n527j67J8276J041N812J565N94L155
$$ plain form
15216 -8666 -7903 -3882 -2193 -3498 -1179 3065 3516 6088 -6399 -10508 -6874 4845 3830 6646 -3231
15201 -3231 -13007 -5429 -4784 -8631 -12315 -10122 -5721 -3064 -517 -5373 -10283 -11297 -13033 -12439 -13898
15186 -13898 -17715 -21049 -22995 -12586 -8724 -10505 -7432 -256 7254 1728 -4696 -5201 1105 -4383
15172 -4383 -12394 -10524 -11787 -10333 -1781 5856 6814 3141 -1165 3973 8218 4412 2314 9667 4588
15157 4588 -12602 -11535 -6150 -6214 -4540 -5447 -9360 -8933 -8710 -13259 -8028 -9761 -11710 -2292 -8088 -20892
15141 -20892 -21218 -7595 -4480 -9842 -10875 -9857 -3338 -2633 2160 10756 13659 7744 5678 6209 2636
15126 2636 -539 -614 -1862 -716 -6585 920 7236 -2481 -7321 -15570 -6569 -3387 -4270 -2712 -4083
15111 -4083 -3467 -1848 -1168 -1168 -4377 -10463 -13446 -17946 -23473 -23640 -5364 -4323 1489 3054 3648 6803
15095F803N995N155j1469j0009l562k127M281J142n200%N349q105K009R879m136
15080c995m532K574R36j507l689M747P914j0338J753m96n833q51J1095J0027L119
15065A0924n376m710k326q62o160j216K602K871J5690k44n763j620l00J100N897
15050A0507j0828p719M029R4M028L010J38J038m049M245j471k107lJ493J752j5051
15034a0894O58L692K898L668O449l041K162P21j3310l866J8792m452J29m9j760
15019A797M477k408j740j7470m532l921q03J1788O098J782J1223J1508p594j2733
15005b528k488J136J3323J791q002J4137n420j0307j1276K244O633n648K648Q034
14991D277J840p159J138Q905J1690r501j871L55r075L857p591k755N006l891k623
$$ plain form
15095 6803 12798 17953 6484 -3525 -7087 -9214 -4933 -3791 -8991 -8991 -3642 -11747 -9738 141 -3995
15080 -3995 -8527 -5953 -5017 -6524 -10213 -5466 2448 -7890 -6137 -6633 -12466 -13317 -2222 7805 10924
15065 10924 5548 838 -1488 -2350 -8510 -9726 -7124 -4253 11437 11193 5430 3810 3510 4610 10507
15050 10507 -321 -8040 -4011 -3917 111 3121 3259 4297 248 4493 3022 915 912 2405 4157 -10894
15034 -10894 -10236 -6544 -3646 22 6471 3430 5592 6313 -6997 -10863 7929 3477 3606 3557 1797
15019 1797 6274 3866 2126 -15344 -19876 -23797 -24600 -12812 -6714 -4932 6291 17799 10205 -2528
15005 -2528 -5016 -3880 9443 11234 3232 17369 11949 1642 -9634 -7390 -757 -6405 -3757 4277
14991 4277 6117 -1042 96 9001 20691 11190 9319 9674 599 4456 -3135 -5890 -884 -4775 -7398
14976g398P144M959j0075m115J2487J0080r95k787L072j2659k43Q047j740k195
14962C582r01l207n981O827Q199M784k051j2501p985j648q773j092J1473J916
14948g358m170K997Q319R57J802P926o536o524K952l337k848L776n163r218k075
14933a8500J17N89P839p72J876k373P529l019M313N906P60K110K460n138j0122
14918f425n519J1316K108o086p647m927m639K152Q670J2330J0343q42l62m849
14904E623J488k956j1035j957J0605M986k629o250k199K339j035R867P20q886
14890a319j0373l820P534M885m5j139M279L229J2305M68R28r894p463j0364l893
14875a4682J1160p46L33N849l22m524L555l418n072P811r214J669R454L703M733
$$ plain form
14976 -7398 -254 4705 -5370 -9485 3002 13082 12087 9300 12372 -287 -530 7517 5777 3582
14962 3582 2681 -526 -6507 320 8519 13303 11252 -1249 -9234 -10882 -19655 -20747 -9274 -7358
14948 -7358 -11528 -8531 -212 745 2547 10473 3937 -2587 365 -2972 -5820 -2044 -7207 -16425 -18500
14933 -18500 -18383 -17794 -9955 -10727 -8851 -11224 -3695 -6714 -2401 3505 4265 6375 8835 3697 -6425
14918 -6425 -11944 -628 1480 -4606 -12253 -17180 -21819 -19667 -10997 1333 11676 10834 10472 5623
14904 5623 7111 4155 -6880 -8837 1768 6754 4125 -2125 -4324 -1985 -3020 6847 7567 -1319
14890 -1319 -11692 -15512 -7978 -3093 -3138 -4277 2 3231 15536 16004 16932 7038 -425 -10789 -14682
14875 -14682 -3522 -4268 -3935 1914 1592 -2932 623 -2795 -7867 -56 -9270 -7601 1853 5556 10289
14860A0289n802j0443o69J1295P628j195m198l155m57J734M186m115l926N476
14846F648K856j344M26l815q850l554L753P566L776j972O151R829j2088j0767
14832a385J346k43J0487L797p800m740R06L216K085P246m872j413p058J36J0878
14817A2586l589j3666q20O722N062n959n820L096M362k207R74l094K481j775l650
14802e297O27K987J144J233M24q59p994L542j411O544M603O334l902n966j82M042
14786E869o515q780l420J082O949N957l462m027R395j789oj306l408k283K416
14771c328j755L712P0n396n174k480j228J2895N637j613j6189k112K604M659P023
14756b675j352q348L078M128m903n526J738Q023L342k132j527M52n613N542J564
$$ plain form
14860 10289 4487 -5956 -6625 4670 12298 11103 6905 3750 3293 5027 9213 5098 1172 6648
14846 6648 9504 8160 8586 4771 -4079 -7633 -3880 3686 7462 5490 11641 21470 9382 -1385
14832 -1385 -39 -282 10205 14002 6202 1462 2368 5584 7669 14915 10043 8630 1572 1708 12586
14817 12586 8997 -4669 -5489 1233 6295 336 -5484 -2388 1974 -233 741 -2353 128 -1647 -5297
14802 -5297 -4670 -1683 -539 694 1118 259 -7735 -4193 -5604 940 5543 11877 7975 2009 1827 5869
14786 5869 -646 -9426 -12846 -11764 -4815 1142 -2320 -6347 3048 1259 1253 -53 -3461 -5744 -3328
14771 -3328 -5083 -1371 -1301 -6697 -11871 -14351 -15579 -2684 2953 1340 -14849 -16961 -14357 -9698 -2675
14756 -2675 -4027 -12375 -9297 -5169 -10072 -15598 -13860 -5837 -2495 -4627 -6154 -5702 -11315 -5773 -4209
14741d209K916m066n354Q05m447n446K510J5312J0441j731L252O593O83r828j0797
14726c366K241k235l924n069O85J453N877m059N819O156K871r314j0284Q96N17
14711a1736m246M545L451K844o385k800K307P834o851m938l441J364R392Q99n266
14696a3027o414k43M503L957L613M620M690j554K784P893L839o211p017m368L756
14681H21J966K686K699L207o91l894r474m644K959O176J403q025q19j347l837
14666a0814k581N368J0959L383J007O240q604P92O935q453k765R488O388q584
14652H759j0051K50L679J701o88n150R63J2137Q49j528J866K84R33l214N55k309
14636I036K340j693l786O767M308n373L821Q3p296M06J1134p208j2142O647n348
$$ plain form
14741 -4209 -1293 -5359 -10713 -9908 -14355 -19801 -17291 -1979 8462 6731 9983 16576 17259 7431 -3366
14726 -3366 -1125 -3360 -7284 -12353 -11668 -10215 -4338 -8397 -2578 3578 6449 -2865 -13149 -12253 -11736
14711 -11736 -15982 -11437 -7986 -5142 -11527 -14327 -12020 -4186 -11037 -15975 -19416 -18052 -8660 -7761 -13027
14696 -13027 -19441 -19684 -15181 -11224 -7611 -2991 1699 145 2929 10822 14661 8450 1433 -2935 821
14681 821 2787 5473 8172 11379 10688 6794 -2680 -7324 -4365 1811 3214 -4811 -5630 -6977 -10814
14666 -10814 -13395 -8027 2932 6315 7322 13562 4958 5750 12685 4232 1467 10955 17343 8759
14652 8759 -1292 -1042 2637 4338 3650 -1500 -537 11600 12449 10921 12787 13071 14004 10790 11345 9036
14636 9036 11376 9683 5897 12664 16972 11599 15420 15503 8207 8613 19747 12539 397 7044 1696
14621A696m386o793K244J1600K810j361l419k241j642l075L786k509n881J0215
14607A044J1264r360p954K230J1642M492n980j2078m688l800j426O820P147QK817
14592B178j208k463p254r434L029P488O124m498o428m23J2138L665k411k977M319
14577A845P897K120p073n028l075o399L373N211M191O08J370J994K613j2025j3991
14562a6369m712Q742Q278M173n19r26m681K018m702M135L19q286L686N371l629
14547g102J967N457r100j891M244N843M708k379M305L437k932j693n905l627m473
14532i141J454Q69J490J357k561L117L336M508J176K116l353m946j198O10l324
14517d490j993r26m32l703M673Q434R888l715o786r121M458N583L126J027o956
$$ plain form
14621 1696 -2690 -9483 -7239 4361 7171 5810 2391 150 -1492 -4567 -781 -3290 -9171 1044
14607 1044 12308 2948 -5006 -2776 8866 13358 7378 -4700 -9388 -13188 -14614 -7794 -647 -639 2178
14592 2178 970 -1493 -8747 -18181 -15152 -7664 -1540 -6038 -12466 -12889 -751 2914 503 -2474 1845
14577 1845 9742 11862 4789 -239 -3314 -9713 -6340 -1129 3062 3670 5040 7034 9647 -2378 -16369
14562 -16369 -21081 -12339 -4061 112 -407 -1333 -6014 -3996 -8698 -4563 -4244 -12530 -8844 -3473 -7102
14547 -7102 -5135 322 -8778 -10669 -6425 -582 4126 1747 6052 9489 6557 4864 -1041 -4668 -9141
14532 -9141 -7687 -6818 -5328 -3971 -6532 -3415 -79 4429 5605 7721 4368 -578 -1776 -1166 -4490
14517 -4490 -6483 -7409 -7841 -11544 -6871 1563 11451 7736 950 -8171 -3713 1870 4996 6023 -933
14502i33m786N689m220q190N475P450J1804q226j5389J262K795N494p109N01L649
14487d734j618n667L842M045Q962M587o389Q38p27J642K359n676n99p0Q214M2
14471I051n545k802p110J2391M108j335M929n534j0896r530O103N081Q51l633
14457c871l459n317j198J0177Q88n872K48O679k999L71j377O324N803L350K449
14442A2196j485q887r30K657j923J652N008q328L298m552k973o696o86Q629l079
14427f099K643J905k974M614J1296J77j6j353k095m390Q80J82N379l929L10p03
14411E827K002n727J2785o110q263j798n233p744m315K659R991J0396M826j708
14397G588n764M653p571L387J4556J891k747l866n844R348M994n348l853j4250
$$ plain form
14502 -933 -5719 -30 -4250 -12440 -6965 485 12289 4063 -11326 -10064 -7269 -1775 -8884 -8383 -4734
14487 -4734 -6352 -12019 -8177 -4132 4830 9417 3028 3866 3139 4781 7140 1464 865 795 9009 9051
14471 9051 3506 704 -6406 5985 10093 8758 13687 8153 -2743 -12273 -6170 -1089 -238 -3871
14457 -3871 -7330 -12647 -13845 -3668 -2780 -8652 -8404 -1725 -4724 -4353 -5730 594 6397 9747 12196
14442 12196 10711 1824 894 3551 1628 3280 8288 -40 3258 -1294 -4267 -10963 -11649 -3020 -6099
14427 -6099 -3456 -1551 -4525 89 11385 11562 11546 10193 8098 3708 4588 4770 10149 6220 6530 5827
14411 5827 7829 2102 14887 8777 514 -1284 -6517 -14261 -18576 -15917 -5926 4470 9296 7588
14397 7588 1824 6477 -1094 2293 16849 18740 15993 12127 6283 15631 20625 15277 11424 -2826
14383b826P91R961K467P921k021M87J042o623m254j333M19N464R21j4144j0968
14368a2696N341J8572j141j784o450j0247n533L828P649R600j539n47K658q35
14354F876o749p143N500O102o43M401l441M71L205o627j830Q209N474m735m944
14339D126k245n313R928k091J42l658j3302j889N237K985K006K236K520o9P61
14324A374j466Q332q861j0706l722R257Q931L250M270O828M66q623k938K489R997
14309A8878P89l012O977k269j0802L16L909o159K111J608q910M530N003o904r980
14294c915q167J845J2224M510K334M129q615j486K913o312K931J489k931J090
14280B039n208k02j413J770l938J0902P536L2q38K28l261j0146K149R832o97k819
$$ plain form
14383 -2826 -2035 7926 10393 18314 16293 16780 17822 11199 6945 5612 6031 11495 12416 -1728 -12696
14368 -12696 -7355 11217 10076 8292 1842 -8405 -13938 -10110 -2461 7139 5600 5053 7711 6876
14354 6876 127 -7016 -1516 4586 3943 8344 4903 5374 8579 1952 122 8331 13805 9070 4126
14339 4126 1881 -3432 6496 4405 4547 889 -12413 -14302 -9065 -6080 -4074 -1838 682 613 1374
14324 1374 -92 8240 -621 -11327 -15049 -5792 3139 6389 10659 17487 17953 9330 6392 8881 18878
14309 18878 19667 16655 23632 21363 10561 10877 14786 8627 10738 12346 3436 7966 12969 6065 -3915
14294 -3915 -12082 -10237 1987 6497 8831 12960 4345 2859 5772 -540 2391 3880 949 2039
14280 2039 -3169 -3371 -4784 -3014 -6952 3950 11486 11518 10680 10908 7647 -2499 -350 9482 8785 5966
14264E966Q231J606l594n669n299j542J181N215n580k634J77K959P215M060O522
14249A8814M71p866r521k053J0116l600q914j696N005J529N891J3446M212K952
14235B8786r148n60o379p355o957q692P437J604m925R039M241m394J029L86n136
14220a024k318P718m531l010K976K1314J3117p95j2680q599N76j642m541J135
14206G696n333J098K744m889o645M690O666N248K86k677q006o438J0149P4K946
14191G609O430J434r327j0969k574j352p065l107J2777O426K233P595J499j2962
14177a353n828j409M660M739M521P106p45l238k091p416L718l676l364J742N913
14162C279L639j552P20N389k559l745j786J0220q382n697K029O744n050o495j900
$$ plain form
14264 5966 14197 15803 12209 6540 1241 -301 880 6095 515 -2119 -1942 1017 8232 12292 18814
14249 18814 19285 11419 1898 -155 9961 6361 -2553 -4249 756 2285 8176 21622 25834 28786
14235 28786 19638 19078 12699 5344 -1613 -10305 -2868 -1264 -6189 2850 7091 2697 3726 4112 -1024
14220 -1024 -3342 4376 -155 -3165 -189 21125 34242 33447 20767 12168 12744 11102 6561 7696
14206 7696 2363 3461 6205 1316 -5329 -639 6027 11275 11561 8884 878 -5560 4589 4663 7609
14191 7609 14039 15473 6146 -4823 -7397 -8749 -15814 -18921 -6144 282 2515 10110 11609 -1353
14177 -1353 -7181 -8590 -3930 809 5330 12436 11691 8453 6362 -1054 2664 -1012 -4376 -2634 3279
14162 3279 6918 5366 6086 11475 8916 5171 3385 13605 5223 -474 1555 8299 3249 -3246 -5146
14147e146J5525P241m014j2705n643J868M417Q5P637P823N584k06n003j1994m312
14132A157O94N364J4861K570l191o860j4859m937k501N119J5505O088p684p880
14118C446j47J956M176N082q31r988N857K192Q177N071p606m708r90P878l863
14103A5702j0691k831m414L645L335p282L46O519o824n293P048M727P961O75n84
14088A2039k117k421p672N801N97m87L170j762J770N98R74J652k191j492n148
14073C311J81k19p292J160k938K807P417m102L175Q623M046P041m960j756J0571
14058B7065p188n815j4672L089P945m177k280J037n915K806J776j2243M478M927
14044H33N518K629J1305M262k889k871O13j012k511j3024m434L902Q383R185j1182
$$ plain form
14147 -5146 10379 17620 13606 901 -4742 -2874 1543 1628 9265 17088 22672 22466 17463 5469 1157
14132 1157 1851 7215 22076 24646 21455 14595 -264 -5201 -7702 -2583 12922 19010 11326 3446
14118 3446 3299 5255 9431 14513 13682 3694 9551 11743 19920 24991 17385 12677 11687 19565 15702
14103 15702 5011 2180 -2234 1411 4746 -2536 -2190 4329 -2495 -7788 -740 3987 11948 12623 12039
14088 12039 9922 7501 -171 5630 6227 5740 8910 7148 8918 9516 10490 12142 9951 8459 3311
14073 3311 3492 3273 -4019 -2859 -5797 -2990 4427 325 3500 12123 16169 23210 18250 16494 27065
14058 27065 19877 14062 -610 2479 10424 6247 3967 5004 -911 1895 3671 -8572 -4094 833
14044 833 6351 8980 20285 24547 21658 18787 19400 18388 15877 2853 -1581 2321 10704 19889 8707
14029H707r385k61P096M142K948N990k706n182q781l961J0859K794p910J0074
14015A4424r49K473m981j940M193O101j1865q822Q357Q313L076q245P933O243
14001B4311p665n672p029k100j535J178n38L036j937j511J421L105J7806K379
13987B5249q762m243M048O230j0917j398R068L068n128o699k028L71m988Q869
13973A2740N919p332q496J22M861O591l047l8O424K99p417M63l149j74K964L216
13957A3946l05K717l24q199K291K99Q33o844o93L792L804N258Q550j090j051O429
13941B9413n349l951q839M518m660r334o897N037O243K839M948k659J4082M236
13927B9627o903l924M732l062n18J593m587j475J0326N995n606o095m542j293
$$ plain form
14029 8707 -678 -939 6157 10299 13247 19237 16531 11349 2568 -1393 9466 12260 4350 14424
14015 14424 13475 15948 10967 9027 13220 19321 7456 -1366 6991 15304 18380 10135 18068 24311
14001 24311 16646 10974 3945 1845 310 1488 950 3986 2049 538 1959 5064 22870 25249
13987 25249 16487 12244 16292 22522 11605 10207 19275 22343 17215 10516 8488 8859 3871 12740
13973 12740 18659 11327 2831 2953 7814 14405 11358 11320 17744 18043 10626 11089 7940 7766 10730 13946
13957 13946 13641 16358 16034 7835 10126 10425 11258 4414 3721 7513 11317 16575 25125 24035 22984 29413
13941 29413 24064 20113 11274 15792 11132 1798 -5099 -62 6181 9020 13968 11309 25391 29627
13927 29627 22724 18800 23532 20470 19952 21545 16958 15483 25809 31804 26198 20103 15561 14268
13913A4268M50o031K981M792M938M163j0016o465M312N051Q242j981l174r151
13899A2379l116J786K668O766J078o97p385q141j931J1717O5n622j736o404Q084
13884I511M080M755J6432j1031p296k769n245L045K260O142r346q313M672Q752
13870A5649q83K630O492L638n280o248Q082k73j0678j909J2143M093J990K549
13856C1995K740n567r700q370J1036O431j449m696m696K895o83P33l738j661K856
13841A8126j0785O55O112l670l244N875J0113j821j818M057m624n571ol013J494
13826A1880R871k041o996J011M616l490Q284N304J295p843n913l59M581M227M682
13811B9109o080j0500l572P891O382J049j954q477l140k254k218j772n65J681
$$ plain form
13913 14268 14718 8687 11668 16460 21398 25561 15545 9080 13392 18443 26685 24704 21530 12379
13899 12379 9263 11049 13717 20483 21561 20864 13479 5338 3407 15124 15189 9567 7831 1427 9511
13884 9511 13591 18346 34778 23747 16451 13682 8437 11482 13742 19884 10538 2225 6897 15649
13870 15649 14766 17396 23888 27526 22246 15998 24080 23807 13129 11220 23363 27456 29446 31995
13856 31995 34735 29168 19468 11098 22134 28565 27116 22420 17724 20619 19936 20669 16931 15270 18126
13841 18126 7341 7996 14108 10438 7194 13069 23182 21361 19543 23600 18976 13405 13399 10386 11880
13826 11880 21751 19710 12714 13725 18341 14851 23135 28439 29734 21891 15978 15619 20200 24427 29109
13811 29109 23029 12529 8957 16848 23230 24279 22325 13848 10708 8454 6236 4464 3899 5580
13797E580P09k557L938R887M738N696o271j5940n100P09J2014P806r72o460j2092
13782A685L898J0687L407l663l218L649j532o634K490K584J2429M991j1467p872
13768A1434O756p00J08q50o87Q75J5J474j559J916o404J79l986M48N282o708j291
13751F302J0535K042R188K906j3171k477M016j88M134L64q102n347R762L049K752
13736B5765n21J445K684q676p133J330P351l190L923L22j1387K733J4094O315
13722C5055J409M328k041j2664k309P254L569j417k56r39o34P143M19q855j1854
13707A8208J574o532J916L583J415P175M021n597q472R213J237J486O468J068
13693C6763n289J952L176o176N71j028n415j637k909q166j330J55N520J0300k255
$$ plain form
13797 5580 6289 3732 7670 17557 22295 27991 21720 5780 680 1389 13403 21209 20237 13777 1685
13782 1685 5583 16270 19677 16014 12796 16445 14913 8279 10769 13353 25782 30773 19306 11434
13768 11434 18190 17490 17598 16748 16061 16936 16951 18425 16866 18782 12378 12557 8571 9019 14301 7593 6302
13751 6302 16837 18879 28067 30973 17802 15325 19341 19153 23287 23651 15549 10202 19964 23013 25765
13736 25765 25244 26689 29373 20697 13564 14894 22245 19055 22978 23300 11913 14646 28740 35055
13722 35055 36464 40792 38751 26087 23778 31032 34601 33184 32928 31989 31355 38498 38917 30062 18208
13707 18208 19782 13250 15166 18749 20164 27339 31360 25763 17291 26504 27741 29227 35695 36763
13693 36763 31474 33426 36602 30426 30997 29969 24554 22917 20008 11842 10512 10667 16187 26487 24232
13678B4232o46L149j0011k91p1j447L374K728l366p66R96O184J802r817l242m125
13662H683l072N124k42M570M528M541L667L620p043q900j2061k97K314N264J575
13647A2271m004K773N353J1621Q238N225p638l107j967k807M920R435J645L056
13633D5014q073j0438r330M07J0432L325K600L388q447m345J361j124n292R474
13619B8952P677n421O720K389j204o526l615j0921n255J0503j637j1484J412J2822
13605B4412O431J57m139l863k023j94l702p466l47p526r57P721J1172K210n067
13590A6819P954M495j004m79k302J061O0M686m447k838J809l17K324k261r095
13575A6465k979L498K881K205M98R369N743O133m132o743j259L94K506l580k223
$$ plain form
13678 24232 23586 26735 16724 16433 16362 14915 18289 21017 17651 16885 17881 24065 25867 16050 12808 8683
13662 8683 5611 10735 10493 15063 19591 24132 27799 31419 24376 15476 3415 3118 5432 10696 12271
13647 12271 8267 11040 16393 28014 36252 41477 33839 30732 28765 25958 30878 40313 41958 45014
13633 45014 36941 26503 17173 17580 28012 31337 33937 37325 28878 24533 25894 24770 19478 28952
13619 28952 36629 31208 37928 40317 39113 32587 28972 18051 12796 23299 21662 10178 11590 24412
13605 24412 30843 31000 26861 22998 20975 20781 17079 9613 9266 1740 783 8504 19676 21886 16819
13590 16819 24773 29268 28264 27785 25483 26544 26604 31290 26843 24005 25814 25497 27821 25560 16465
13575 16465 13486 16984 19865 22070 22568 31937 37680 43813 39681 32938 31679 32073 34579 30999 28776
13560B8776M691N604J772m216j270M070m618j2243j970O953O457J443k833K65
13546C2881R751P261K84j2418j4655k125M788K406j107n50n329N447O448k137
13532C0945P58n434R37M163K75j892J745j291j022l636J310K894M697L945j3010
13517B5384j186Q96J3722J4248k678j1355r359p436M393O190Q962P58O31j0116
13503C3054m31k139q06o625k111N108P542M867o47l164L059k708R637J3298l648
13488E4286j1203m360k401m513Q945j319l672K82M932O603n058j1091J56n243
13474B6344N901P339N813l087j2753Q096l163R11j165P246K44j914o06J1257o169
13459D4294j4527N420R608l045K990n569q234L45n124J234k957k84J033P957L294
$$ plain form
13560 28776 33467 39071 40843 36627 35357 39427 34809 22566 20596 27549 34006 35449 32616 32881
13546 32881 42632 49893 50177 37759 23104 20979 25767 28173 27066 26516 21187 26634 33082 30945
13532 30945 31703 26269 27206 31369 31644 29752 31497 30206 29184 25548 26858 29752 34449 38394 25384
13517 25384 24198 25094 38816 53064 50386 39031 29672 22236 26629 32819 41781 42539 43170 33054
13503 33054 32623 30484 29678 23053 20942 26050 33592 38459 37812 34648 37707 34999 44636 57934 54286
13488 54286 43083 38723 36322 31809 40754 39435 35763 36045 40977 47580 42522 31431 31587 26344
13474 26344 32245 39584 45397 42310 29557 37653 34490 35401 34236 41482 41726 39812 39206 50463 44294
13459 44294 29767 35187 44795 41750 44740 39171 30937 31282 26158 27392 24435 24151 25184 33141 36435
13444C6435k411N946M04L34Q007K115J392P35m140j1584l860M184J02k552J818
13429C6925Q577M71n766j442q223L155l383K401K423N315R181n30L443M828K523
13414E9898l603r675J466r0J587m569M46M929N152j0914r480O305J638Q696Q929
13399F0715l31j1425j5538P774J3330q021p602P802K137N277K411K446o60l794
13385E4521m409l571n987J1726k650l367p000N781R074o850p972m77M380K671
13371D5870k037o267J106J299j0316o756Q445P534P027L747O13m576q104r522
13357B8063m717P408L615J0644L840m614l897k295P721R708l421l489N647L315
13343E7528o462R393N379M474M587J753l398j3906j0608r120j4882Q247P730L494
$$ plain form
13444 36435 34024 39970 40374 40708 48715 50830 52222 52957 48817 37233 33373 37557 37659 35107 36925
13429 36925 45502 45973 40207 38765 30542 33697 30314 32715 35138 40453 49634 49104 52547 57375 59898
13414 59898 56295 46620 48086 47996 49583 45014 45460 50389 55541 44627 35147 41452 43090 51786 60715
13399 60715 60384 48959 33421 41195 54525 46504 38902 46704 48841 54118 56529 58975 58315 54521
13385 54521 50112 46541 40554 52280 49630 46263 39263 45044 54118 47268 39296 38819 43199 45870
13371 45870 43833 37566 38672 39971 29655 22899 31344 38878 45905 49652 50265 45689 37585 28063
13357 28063 23346 30754 34369 45013 48853 44239 40342 38047 45768 55476 52055 48566 54213 57528
13343 57528 51066 60459 65838 70312 74899 76652 73254 59348 48740 39620 24738 32985 40715 44209
13329D4209J349J0874l0P42r843p318q88J806j222Q90J503L711M155J3465K613
13314F6016r092o275l60n165k830P696N492j452l423l483N099N716j573P009N969
13299F9344M372n30j1937L193M734n120l531q848k672N776j7158m220J1617J1164
13285E6184p030L748R459l76R16p160o485o400M810J033L563J567O827n458L457
13270E8655M459q538p102K670J0892o93N47o00m284n234l796n45L433M805k516
13255E2153J371j514n032l433P184O762n29RJ924J36p955J674p895l946l38L583
13239D4154K63J257O767L788O45l486J906J133K818P057L711l36j091p457r468
13224E1661l159K905K562L967o099R127N933o172L200o06m275L475K078j058K926
$$ plain form
13329 44209 45558 56432 56402 57144 47301 39983 39095 40901 39679 40569 42072 45783 49938 63403 66016
13314 66016 56924 50649 50289 45124 42294 49990 55482 54030 50607 47124 52223 57939 56366 63375 69344
13299 69344 73716 73186 61249 64442 69176 64056 60525 51677 49005 54781 37623 33403 45020 56184
13285 56184 49154 52902 62361 61985 62901 55741 49256 42856 47666 48699 52262 53829 60656 55198 58655
13270 58655 63114 54576 47474 50144 61036 60343 60890 60290 56006 50772 46976 46431 49864 54669 52153
13255 52153 53524 52010 46978 43545 50729 57491 56962 56971 58895 59031 51076 52750 44855 40909 40571 44154
13239 44154 44417 45674 52441 56229 56874 53388 55294 56427 59245 66302 70013 69677 68586 61129 51661
13224 51661 48502 51407 53969 57936 51837 60964 66897 60725 63925 63319 59044 62519 64597 63539 66465
13209F6465l584k451k98M96q248k251J3150J3554K611k036p332l837J3007R369
13195H8615K85n456l635q513o9L715l990j382J465J604j636J47R36k635P623J81
13179G7255n019l754o499j34J0053K351J774J131m974m09m890m810R726o573K354
13164F7582n576j617P149K910N529L794o430k138Q67Q093p40k491N295K925n554
13149G9598N000k007N41K445n101o035L839L141M439m614m479N013N221j2126
13135G4875k677L344J4292j47o486j817P573J3750n471p027l349o777J209m360
13121G6932p194P855N465M652J747N135J084N06k930o474o231Q964R426l720p511
13106H7706j536K232L054n409K889J845J720k62j215K653p727m018r768n749j384
$$ plain form
13209 66465 62881 60430 60132 60628 52380 50129 63279 76833 79444 77408 70076 66239 79246 88615
13195 88615 88900 83444 79809 71296 71227 74942 70952 69570 71035 72639 71003 71150 72086 69451 77074 77255
13179 77255 72236 68482 61983 61849 71902 74253 76027 77158 72184 71775 66885 62075 71801 65228 67582
13164 67582 62006 60389 67538 70448 75977 79771 73341 71203 72070 80163 79423 76932 82227 85152 79598
13149 79598 84598 82591 83132 85577 80476 74441 78280 81421 85860 81246 76767 81780 87001 74875
13135 74875 72198 75542 89834 89687 83201 81384 88957 102707 97236 90209 86860 80083 81292 76932
13121 76932 69738 77593 83058 87710 89457 94592 95676 96182 93252 86778 80547 89511 98937 95217 87706
13106 87706 86170 88402 91456 86047 88936 90781 92501 92239 91024 93677 85950 81932 72164 66415 65031
13091F5031O618K802P218L925P525M641l104j0247j3930n716R766L078J097N152
13077H3856k416K348L608m463j496O476M829l868o031m458P946J3386M456q860
13063I5313p218J4161P998j2923l002M935q022N977M401k137M755M688k159q002
13049I8765m001l086M304j933m675J734Q249j580j3666N588J1892M111J748M177
13035A11627k799p174k645P479R472N201M482q695j7032j707j576K127k14r45
13021I7601j944J071J1083N538p582o454q707K769J127J0201n54p937M365p104
13007I3473Q55m460L217J0764P897P953j1214P76P149m488l595J822%j087p303
12992A01759l374Q111M951l089N078R275m025n398Q408k345k400j424n8l755q020
$$ plain form
13091 65031 71649 74451 81669 85594 93119 97760 94656 84409 70479 64763 74529 77607 78704 83856
13077 83856 81440 83788 87396 82933 81437 87913 92742 88874 82843 78385 86331 99717 104173 95313
13063 95313 88095 102256 110254 97331 94329 99264 91242 97219 101620 99483 104238 108926 106767 98765
13049 98765 94764 91678 95982 94049 89374 91108 99357 97777 84111 89699 101591 105702 107450 111627
13035 111627 108828 101654 99009 106488 115960 121161 125643 116948 99916 98209 96633 98760 98546 97601
13021 97601 95657 96728 107811 113349 105767 99313 90606 93375 94502 104703 104149 96212 100577 93473
13007 93473 94328 89868 93085 103849 111746 119699 108485 109261 116410 111922 108327 110149 110149 109062 101759
12992 101759 98385 106496 111447 108358 113436 122711 118686 113288 121696 119351 116951 115527 115469 111714 103694
12977A03694L041J1808L235j071l950N64l69K023L111J968j24k324j0006j601
12963A09999Q265o21j278M867N759n434r675p214R701L098R987J5579Q526m904
12949A46655o850o251r930N30J2967M134p422L076K954m381J098j651N33l349
12935A32113j0584J240p43J0251N339J39Q576j115j5921j1583K673L991j681j498
12921A21197j99J1108k06L786M520j065K998Q717J37j5073n755R38M920l36j435
12906A34252M078K671R531P457l060j0182n303j191J0164N050k730p524j982o081
12892A35150j1498Q271J0028O165P82K516M695J644p112j0327k368M632J204M599
12878A48381O962j0055m854J0125Q036J4308K90J240J008K590j1517p063J295
$$ plain form
12977 103694 106735 118543 121778 120707 116757 117321 116952 118975 122086 124054 123930 121606 111600 109999
12963 109999 118264 117643 116365 121232 126991 121557 111882 104668 114369 117467 127454 143033 151559 146655
12949 146655 139805 133554 123624 124154 137121 141255 133833 136909 139863 135482 136580 134929 135462 132113
12935 132113 121529 122769 122026 132277 137616 137755 146331 145216 129295 117712 120385 124376 122695 121197
12921 121197 120998 132106 131900 135686 140206 139141 142139 150856 150993 135920 130165 131103 136023 135687 134252
12906 134252 138330 141001 150532 157989 154929 144747 139444 138253 148417 153467 150737 143213 141231 135150
12892 135150 123652 131923 141951 148116 148898 151414 156109 157753 150641 140314 137946 142578 143782 148381
12878 148381 155343 145288 140434 150559 158595 172903 173193 174433 175441 178031 166514 159451 160746
12865A60746m240o287O533j719K207N477N398o37P65p74J537o143j221n748N366
12850A61260Q344n860N137K59l157k734m482k461O110M312l1l509j422P807N632
12835A75205k703R78j201n938P92L419K049O512K656M765M256N897m187k752N208
12820A94956l419m227k638j753l430j543m013j649k823K537R849m495j924M73
12806A75901L464J499Q812n170j251K804m683Q56J728K106R720K996j449L419
12792B00752j982M844Q413k738o816q181P650k392n64q795j014O625k84r172Q356
12777A94702R442K803l198L610M672K395m237j2602j01M509M968K094J138J0473
12763B20668K349J300L274k286L1l284N326P976Q218k625m585n677k663r308P469
$$ plain form
12865 160746 156506 150219 156752 155033 157240 162717 168115 167478 168243 167469 169006 162863 161642 155894 161260
12850 161260 169604 163744 168881 169140 165983 163249 158767 156306 162416 166728 166697 163188 161766 169573 175205
12835 175205 172502 173480 172279 166341 167133 170552 172601 179113 181769 186534 190790 196687 192500 189748 194956
12820 194956 191537 187310 184672 182919 179489 177946 173933 172284 169461 171998 181847 177352 175428 175901
12806 175901 179365 180864 189676 184506 183255 186059 181376 182232 183960 186066 195786 198782 197333 200752
12792 200752 198770 203614 212027 209289 202473 194292 201942 199550 198986 190191 189177 195802 195518 186346 194702
12777 194702 204144 206947 203749 207359 212031 214426 210189 197587 197486 201995 206963 209057 210195 220668
12763 220668 223017 224317 227591 225305 225336 222052 227378 235354 243572 240947 236362 230685 228022 218714 226183
12748B26183N346M31o878m397j073L724J6570O762M406J41j1195N023j188j648
12734B42207O304K752j845k388j878m030P379m127j869O650O387j45p497J178
12720B49078j665q147n230J2926J469K206m603m285k204O235J0347J309K535N087
12706B65058m54m382Q401O143L755p847O10o218r554n161N811L902K742l671Q631
12691B67766J353l199j112j871j12L047M230r35R912P523K346o602N289L148r096
12676B81687o753n859N551j365P231J2952r265o863P703N549R040J427M114O059
12662C11208j3238j7059j488J4471J1657R673N868n994l397l427k577K354M110
12649C12161J833k13j36R087O102M812n941o111J395l593m511k98R55j4037j072
$$ plain form
12748 226183 231529 231960 225082 220685 219612 223336 239906 246668 251074 251215 240020 245043 243855 242207
12734 242207 248511 251263 249418 247030 245152 241122 248501 244374 242505 249155 255542 255397 247900 249078
12720 249078 247413 239266 234036 246962 248431 250637 246034 241749 239545 245780 256127 257436 259971 265058
12706 265058 264604 260222 268623 274766 278521 270674 271284 265066 255512 250351 256162 260064 262806 259135 267766
12691 267766 269119 265920 264808 262937 262825 265872 270102 269167 279079 286602 288948 282346 287635 290783 281687
12676 281687 274934 269075 274626 273261 280492 293444 284179 277316 285019 290568 299608 301035 305149 311208
12662 311208 297970 280911 279423 293894 305551 315224 321092 315098 311701 308274 305697 308051 312161
12649 312161 313994 313781 313645 322732 328834 333646 327705 321594 322989 319396 314885 314587 315542 301505 300433
12634C00433J1685J0215n223j081N493n53N845L913L165k600q050P126k05p31
12620C29432k524j151k34n33O331o58P007K503j194j0323K285R249m48J560K881
12605C44183k119K537L065k466N16O073J3829q675m876O07K89R801j846k411p687
12590C50820J1165P620J1222L879n252m739j091J2078O286l406k066m1M217j2773
12576C77919p531R362O570k722M098j889k776K048L344m894p02n477O814N085
12562C89249j576p499l70j119J3909Q311n848n536l019R797Q449N140J0155Q194
12548D28237j634k127j1125n763o363P001Q102J0341J0571M811l806l86j4939
12535D22920r750K76L104L244J1637J6328n97m972L758p240p701k742p4N431J0911
$$ plain form
12634 300433 312118 322333 317110 316029 321522 320969 326814 330727 333892 331292 323242 330368 330163 329432
12620 329432 326908 325757 325523 324990 331321 330663 337670 340173 338979 328656 330941 340190 339742 341302 344183
12605 344183 342064 344601 347666 345200 345716 351789 365618 356943 352067 352674 352963 362764 360918 358507 350820
12590 350820 361985 369605 380827 384706 379454 374715 373624 385702 391988 388582 386516 386475 390692 377919
12576 377919 370388 379750 386320 383598 387696 385807 383031 385079 388423 383529 382827 377350 384164 389249
12562 389249 387673 380174 379804 378685 392594 400905 395057 389521 386502 396299 404748 409888 420043 428237
12548 428237 426603 424476 413351 407588 401225 408226 416328 426669 437240 442051 438245 437859 422920
12535 422920 413170 413446 416550 419794 431431 447759 447162 442190 445948 438708 431007 428265 428191 433622 444533
12520D44533j1926n00Q045p68J896L791O156O646k566n927p095K189K765p141
12506D40098K354P330L054j276m477L735L574M494L043k015q29K219L238O443
12492D70985j01K907K583j701p392Q144N901N647P049q983n582m3j222L00L440
12477D81932M853p287j32M55j81l223j330N444O026N309j569K057J807M358L186
12462E01705O603p890k25J5685Q234N060p019m68j048o423l387L739J2836K6J890
12447E29318l506q522k734k59j252k935Q322N561m688J117L1N713J0755P885p051
12432E37755r707l958P642p55Q96N010Q265N830j6931r385N383R20L754q014M48
12417E27153r3j804P201J847m18J1181N70l746n117k78o76o35J947j62M527m715
$$ plain form
12520 444533 432607 432107 440152 439384 441280 445071 451227 457873 455307 449380 442285 444474 447239 440098
12506 440098 442452 449782 452836 451560 447083 450818 454392 458886 461929 459914 459085 461304 464542 470985
12492 470985 470884 473791 476374 474673 467281 475425 481326 486973 494022 485039 479457 479414 478192 478492 481932
12477 481932 486785 479498 479366 479821 479640 476417 475087 480531 486557 491866 490297 492354 494161 498519 501705
12462 501705 508308 500418 500193 515878 524112 529172 522153 521685 520637 514214 510827 514566 527402 527428 529318
12447 529318 525812 517290 514556 514297 513045 510110 518432 523993 519305 520422 520453 526166 536921 544806 537755
12432 537755 528048 524090 531732 530977 531873 536883 545148 550978 534047 524662 530045 530965 534719 526705 527153
12417 527153 527060 525256 532457 534304 533886 545067 545637 541891 536774 536496 535820 535185 537132 536970 541497 536782
12401E36782o271M08k692K572P825k340l843K397R487K102r73M555J189L443o381
12386E48260o068O15k490J582q78p80o52n769l124L565Q705P271J124l669n317
12371E42375J056j675R994J1200m316p571J988o349m787J61n144O029K094M798
12357E49853R99M355p225j1399o377O878M293n581K034k434M703L545M565L059
12343E51268J323o022L344n136L68m4n919p947Q801R634J238k221n596n969n518
12328E31604J980p28L494P780P587O50o577Q58l08k653M262O812M521k846q724
12313E47712j2666k008r09j562n095L195Q026R03O714m057l593N159J489K826
12299E46134o340l610o734p325q688n516M285Q774M974J9306M371l616j7320j2644
$$ plain form
12401 536782 530511 530919 528227 530799 538624 536284 532441 534838 544325 546427 545454 550009 551198 554641 548260
12386 548260 542192 542807 540317 541899 541021 540241 539589 533820 530696 534261 542966 550237 551361 547692 542375
12371 542375 543431 541756 551750 562950 558634 551063 553051 546702 541915 542076 536932 542961 545055 549853
12357 549853 550852 555207 547982 536583 530206 537084 541377 535796 537830 535396 540099 543644 548209 551268
12343 551268 552591 546569 549913 544777 545145 545101 539182 531235 540036 549670 550908 548687 543091 537122 531604
12328 531604 533584 532856 536350 544130 551717 552367 545790 546648 546340 543687 547949 554761 559282 556436 547712
12313 547712 535046 533038 532129 530567 525472 528667 536693 537596 544310 540253 536660 541819 543308 546134
12299 546134 539794 536184 529450 522125 513437 507921 512206 520980 525954 545260 549631 546015 528695 516051
12285E16051k446j711k709n930L728k848J2692P973K43j141r04k110j2486m248
12271E04154J4643M674O19m666n996k953q098j131L328K701J543k134K65n119
12257E01830j887J024r22m2J627l047k460J53k522q872P303O090o400j1274j0929
12242D69672J2909R689k690l027l693r33Q113L052k254j1841L126k21p104m511
12228D70287j516L711K033l032J166M631m813l444m064O20o374q280j699J549
12214D50775j564l692O216k51q014K152J37l182l763M552K685j825n944q446l082
12199D26754K177J0698m842j3206r982K846N458R10P944k991o174O205p565j084
12185D17148m05j605J1694P011r282o873J407l362o240j0337j6511m875Q158R246
$$ plain form
12285 516051 513605 511894 509185 503255 506983 504135 516827 524800 525043 523902 522998 520888 508402 504154
12271 504154 518797 523471 524090 519424 513428 510475 502377 501246 504574 507275 508818 506684 506949 501830
12257 501830 499943 500967 500045 500003 501630 498583 496123 496276 493754 484882 492185 498275 491875 480601 469672
12242 469672 482581 492270 489580 486553 482860 481927 490040 493092 490838 478997 482123 481902 474798 470287
12228 470287 468771 472482 474515 471483 472649 477280 472467 469023 464959 465579 459205 450925 449226 450775
12214 450775 449211 445519 451735 451484 443470 445622 445759 442577 438814 443366 446051 444226 438282 429836 426754
12199 426754 428931 439629 434787 421581 411599 414445 419903 420813 428757 425766 419592 425797 418232 417148
12185 417148 416743 415138 426832 433843 424561 417688 419095 415733 409493 399156 382645 377770 385928 395174
12171C95174K564J0311J410j462j6630o349j771m018o629L049P259L919J263J021
12157C89111r135N220J509n797k440M298P072K380p102p717P498j887m870m826
12143C73314R746Q002J6535K5496L7387M8220O1072M3601N255n5840p3419n7860
12131D41509k6451k4404r402m68j7620q722L328M205O761m704k0300L741o769
12118C40704m530Q269j2915K547J3495J104P53L493q66O46o721r303lR775L84
12103C46832m843k16J0343J6627K2901K8540K9788L4003Q1929J41312J96812K02881
12091A106909P8248j26487k37671j89184j11195o1336m3202j9065n593j5080r374
12080C66970j1404n342j68j547j0014j5518K745j080l867p346k937j487J563k541
$$ plain form
12171 395174 397738 408049 409459 407997 391367 385018 383247 379229 372600 375649 382908 386827 388090 389111
12157 389111 379976 385196 386705 380908 378468 382766 389838 392218 385116 377399 384897 383010 378140 373314
12143 373314 383060 391062 407597 433093 470480 518700 579772 623373 628628 572788 499369 441509
12131 441509 415058 390654 381252 380784 363164 354442 357770 361975 368736 364032 343732 347473 340704
12118 340704 336174 344443 331528 334075 347570 348674 349427 352920 352054 352700 345979 336676 336673 346448 346832
12103 346832 341989 341773 352116 368743 391644 420184 449972 483975 565904 707216 904028 1106909
12091 1106909 1185157 1058670 820999 631815 520620 459284 416082 397017 391424 376344 366970
12080 366970 355566 350224 350056 348509 338495 322977 325722 324642 320775 313429 310492 309005 310568 308027
12066C08027m307L47N097L612K480Q073K801J578k912m146M301J7811K1045L2789
12052C96596M3233O7872J27504J93119K11443J30198q1681k43963k19463j32628
12042D92230p0387m0602l4194k3870j6099k1813l594P241L77k515J018k91j6925
12029B70576p230K311l217l025J96l92j333J145k896P032N467j47j261O61j0898
12014B56989l229J880q948k460P608O629J2999K3805M4532O3421Q4632N0826j0078
12001E28606p2956q0425n3734l9184k0061r356m080j907k196j271J838n713K074
11988B41635o933j0698n707K490n499J30l027o173J14M116Q48j856j1640K521
11974B00321P330N212J985J649k948P794l293q900o896L280o243q857r42N625
$$ plain form
12066 308027 303720 304067 309164 312776 315256 323329 326130 327708 324796 320650 324951 342762 363807 396596
12052 396596 439829 507701 635205 828324 1039767 1169965 1088284 844321 624858 492230
12042 492230 421843 381241 347047 323177 307078 285265 281671 288912 289289 286774 287792 287501 270576
12029 270576 263346 265657 262440 259415 259611 259219 257886 259031 256135 263167 268634 268487 267226 267887 256989
12014 256989 253760 255640 246692 244232 251840 258469 271468 295273 339805 403226 487858 538684 528606
12001 528606 455650 375225 321491 282307 262246 252890 248810 246903 244707 243436 245274 239561 241635
11988 241635 234702 224004 218297 220787 215288 215418 212391 206218 206332 210448 211296 209440 197800 200321
11974 200321 207651 212863 214848 216497 213549 221343 218050 209150 202254 205534 199291 190434 189492 195117
11960A95117M06K955J032M71o533j1148o72Q755k930m190K909m864M680Q715l197
11945A91506l138R61j1088k603m660K045R132M917k37n280l358k034o6l134M427
11930A77390L158n524k777q805m086N605J102K095l125k125m05L517M551K756
11916A73327O185j0794k496j538p016r995PK802Q862L935n919m311J132k501R425
11901A61105k326k857l17J056j292m12R266o511p65M348M124M86o793L3K848N302
11885A67295j441j7191n736K784n772N918r76k485O618J63j84q597r102l537n067
11870A22690P281k867o724N974J1446L585M070r528p94P847j82l380p127L63j949
11855A30705o268N854K380L246n008o613o490R822K0669P19o087q863J101l771
$$ plain form
11960 195117 195523 198478 199510 199981 193448 182300 181628 190383 187453 183263 186172 181308 185988 194703 191506
11945 191506 188368 189329 178241 175638 170978 173023 182155 187072 186835 181555 178197 176163 176097 172963 177390
11930 177390 180548 175024 172247 163442 159356 164961 166063 168158 165033 162908 162503 166020 170571 173327
11916 173327 179512 168718 166222 164684 157668 147673 147680 150482 159344 163279 157360 153049 154181 151680 161105
11901 161105 158779 155922 155605 156661 155369 154957 164223 157712 156947 161295 165419 165905 159112 159145 161993 167295
11885 167295 165854 148663 142927 145711 139939 145857 144881 142396 149014 149177 148993 140396 131294 127757 122690
11870 122690 129971 127104 120380 126354 137800 141385 145455 135927 135133 142980 142798 139418 132291 132654 130705
11855 130705 124437 130291 132671 135917 130909 124296 117806 127628 148297 149016 142929 134066 135167 131396
11841A31396j6423J82J1336P251O28q43J697m904k753j228O627l831l053Q962
11827A35044o696j1123M142J408q241m809P467O96q412m292j58j249j283J0j0375
11812I2129n303M793M145K187P559L652N908l31m928l89kM572N561J0925o432
11797A24046j2523q462j48p83l715m310j734P487M83P916K888n394q21J826j1701
11782I5055p587L656Q988j293J258J0258m466p775k310n710J0736K629n348k461
11768I5630M738q503J02O33J940m028j08P972J498m620L099L554M970n01M028
11753A10404r846r458J46m889P262N519q587o494P533L410k014j423o575j1376
11739G3612P079R256q489k662J3490O788K434l200L976k313j6244n418J630k402
$$ plain form
11841 131396 114973 115155 126491 133742 134370 133527 135224 130320 127567 126339 132966 129135 126082 135044
11827 135044 128348 117225 121367 122775 114534 109725 117192 117888 109476 105184 105026 103777 102494 102504 92129
11812 92129 86826 91619 95764 97951 105510 109162 115070 114739 109811 109422 109420 113992 119553 130478 124046
11797 124046 111523 103061 102913 102130 98415 94105 92371 99858 100341 108257 111145 105751 104930 106756 95055
11782 95055 87468 91124 100112 98819 100077 110335 105869 98094 95784 90074 100810 103439 98091 95630
11768 95630 100368 91865 91967 92600 94540 90512 90404 98376 99874 95254 98353 101907 106877 106376 110404
11753 110404 100558 91100 91246 86357 93619 99138 90551 84057 91590 95000 92986 91563 84988 73612
11739 73612 80691 89947 81458 78796 92286 99074 101508 98308 102284 99971 83727 78309 79939 77537
11725G7537j539k410j00p146k778j883n306P391J1085N257J708l029r461J136
11711G0462J325n11k745m862l475N171k67L44k105n801R777N180l796P753O290
11696H2740K371J613k620m214n795l250q990l428N934M827o52O681l580j1686
11682E9951l140Q849J982Q313L04n241j752j0079p789k322k522M551J0138O343
11668F7586P90K30j70j334k533M475r860L587l645q843K237M962P092J4883o685
11653G2772m943K49l720j169l761N20J673J753J184L922n610O978M669q685r54
11638F4878O762K720M355J002k573p860J428r383q714P2m154j472L458Q12q31
11623E0500O540P273J161m130R2j481j1872p2M19Q351J715m07J0196m254q701
$$ plain form
11725 77537 75998 73588 73488 66342 63564 61681 56375 63766 74851 80108 81816 78787 69326 70462
11711 70462 71787 71276 68531 63669 60194 65365 65098 65442 63337 57536 67313 72493 68697 76450 82740
11696 82740 85111 86724 84104 79890 74095 70845 61855 58427 64361 69188 68536 75217 71637 59951
11682 59951 56811 65660 67642 75955 76259 71018 69266 59187 51398 49076 46554 51105 61243 67586
11668 67586 68376 68606 68436 67102 64569 69044 59184 62771 59126 50283 52520 57482 64574 79457 72772
11653 72772 67829 68078 64358 63189 59428 59948 61621 63374 64558 68480 62870 69848 74517 65832 64878
11638 64878 71640 74360 78715 79717 77144 69284 70712 61329 52615 52687 48533 47061 50519 51331 50500
11623 50500 57040 64313 65474 61344 61436 59955 48083 48011 48430 56781 58496 58089 68285 64031 55330
11608E5330O20O040K046j792l168N85l726Q68K088R715R31j0945o326k063K358
11593E2561O831k72p11K775o456p900k970N393Q292P343K540k070l829n49j0231
11578E0747j67K11L90N259L708m142p939l249K518j212N39L902j177J344o968
11563D3764j986Q330k738J01k452J738q617R33J1642K147l006m775J812l551L863
11548D7205J1487l672m655n056M406j375nK776J1364M52l207p723n53p113j2846
11533C1485N166J0235J402r01M328k342n480K458j1180j0338M960n644l531p31
11519A9887P397O841K975k49k793J0330M219m411J836N632n125K344O585p129
11505D8339r293M337P609J739N38q184j1217n196L864K4L348p820n3J1798K78
$$ plain form
11608 55330 55950 61990 64036 62244 59076 59661 55935 56803 58891 68606 69537 58592 52266 50203 52561
11593 52561 59392 59120 58409 61184 54728 46828 43858 49251 57543 64886 67426 65356 61527 60978 50747
11578 50747 50580 50791 51181 56440 60148 56006 48067 44818 47336 46124 46663 50565 49388 50732 43764
11563 43764 41778 50108 47370 47471 45019 46757 38140 39073 50715 52862 49856 45081 46893 43342 47205
11548 47205 58692 55020 50365 45309 49715 48340 48335 51111 62475 62927 59720 51997 51444 44331 31485
11533 31485 36651 46886 48288 47387 51715 49373 43893 46351 35171 24833 29793 24149 20618 19887
11519 19887 27284 34125 37100 36851 34058 44388 48607 44196 46032 51664 46539 48883 55468 48339
11505 48339 39046 43383 50992 52731 53269 45085 33868 28672 32536 32560 35908 28088 28035 39833 40111
11490D0111k582k596J824J460j995m270p893K061O394P223L465K633N7o248o751
11475C2893J456N586j002l181K6K486o961m411O329J754k153L780L385N436m950
11460D0473n607L663k544J958M546J264L705L502k039l853m610o150l726J538
11446C2120Q469N883k646o188M38m188K741M600J150r149q051L75J1005q6m122
11431C2351K529j81o774m56L773j549P57n629j2004m448L584R543J0263K174q15
11416C3118j0547j710j281K092j440J84L637k551k400l068J0514P622l906L25
11402C0589j926J470R38l170k154J372K398K489r69o086n455Q296O186r992k081
11387B1905j024K833J338m601j832j64j098J656J06M895P459N457k373q248k197
$$ plain form
11490 40111 37529 34933 36757 38217 36222 31952 24059 26120 32514 39737 43202 45835 45892 39644 32893
11475 32893 34349 39935 38933 35752 35778 38264 31303 26892 33221 34975 32822 36602 39987 45423 40473
11460 40473 34866 38529 35985 37943 42489 43753 47458 50960 48921 45068 40458 34308 30582 32120
11446 32120 40589 46472 43826 37638 38076 33888 36629 41229 42379 33230 25179 25554 36559 36473 32351
11431 32351 34880 34699 27925 27469 31242 29693 30450 24821 12817 8369 11953 21496 31759 33933 33118
11416 33118 22571 20861 19580 21672 20232 20416 24053 21502 19102 16034 26548 34170 30264 30589
11402 30589 28663 30133 31071 27901 25747 27119 29517 32006 31037 24951 19496 27792 33978 23986 21905
11387 21905 20881 23714 25052 20451 18619 18455 17357 19013 19119 24014 31473 36930 34557 26309 24112
11372B4112k966n978j595N002J941l717k640k263j964k417M822M579k848n53M065
11357A7580M851k933O921j0017m552M383O459k850K147K814j0226j921O069O782
11343B5507O319o107j5475m067J0321m19M26K644p987J2M762j490j5406N73J5352
11328A4965J0217Q541m59k116j16j1015p042J2272k091k928j332q405j67N977
11314A6301N426Q844k149j019j65N303k237r767q679N214q492j122R677K462J804
11299B1401r39K541j404n27n084k092R112J1789k433r397l846O518M321j955n248
11284B2757n824O705R996k523m868q145Q02L200r002n076N690J288m358L380M496
11269A8518L390j124r722N696O84l928j112k28l931L989J3048K190p338m132j506
$$ plain form
11372 24112 21146 15168 13573 18575 20516 16799 14159 11896 9932 7515 12337 16916 14068 13515 17580
11357 17580 22431 19498 26419 16402 11850 16233 22692 19842 21989 24803 14577 12656 18725 25507
11343 25507 31826 25719 10244 6177 16498 16079 16505 19149 11162 11174 15936 14446 -960 -387 14965
11328 14965 25182 33723 33264 31148 31032 20017 12975 25247 23156 20228 18896 10491 10324 16301
11314 16301 21727 30571 28422 27403 27238 32541 30304 20537 11858 17072 8580 7458 17135 19597 21401
11299 21401 20462 23003 21599 21072 15988 13896 23008 34797 32364 22967 19121 25639 29960 28005 22757
11284 22757 16933 23638 33634 31111 26243 18098 18900 22100 13098 8022 13712 15000 10642 14022 18518
11269 18518 21908 20784 11062 16758 17442 13514 12402 12174 8243 12232 25280 27470 20132 16000 14494
11254A4494k856O932k470r857q36L422L377j996j2067o146O495P555L878k891
11240G034P892j957j6150N182N181q89K516k14l386j650l707m109K091N790O828
11225A0452R374k288p03L330j12k528r66M860l495q573n464L074R55m421K008
11210E503R183P196j0048k142J2092K808m996k239O456L525Q44L612m753n627
11196B1414J606K698O61o709j60j0728m432p967M591L721k745N691L848m203J132
11181H418K333J356M408n55M059n152j2661k620J4522K555n054J868j582p051
11167D844n841O284O114k38o030l189P583j546n79q64O449P13k173j1806P728
11152G449P628N482O91k85o603K732J0841N111K0816J2473o04j815k672q602q520
$$ plain form
11254 14494 11638 18570 16100 6243 5407 8829 12206 10210 -1857 -8003 -1508 6047 9925 7034
11240 7034 14926 12969 -3181 2001 7182 6293 8809 8595 5209 3559 -148 -4257 -2166 3624 10452
11225 10452 19826 17538 16835 20165 20053 17525 16559 21419 17924 9351 3887 6961 7916 3495 5503
11210 5503 14686 21882 11834 9692 21784 24592 19596 17357 23813 27338 28182 31794 27041 21414
11196 21414 23020 25718 26379 19670 19510 8782 4350 -3617 974 4695 1950 7641 11489 7286 8418
11181 8418 10751 12107 16515 15960 20019 14867 2206 -414 14108 16663 11609 13477 11895 4844
11167 4844 -997 5287 11401 11163 5133 1944 9527 7981 7402 6538 12987 13700 11527 -279 7449
11152 7449 15077 20559 21250 20965 14362 17094 27935 33046 53862 66335 65731 63916 61244 52642 44122
11137D4122m464j0751p605j993L307K302j7462J62J1816K794n709r38k66m141
11123A1174J119J223m546r76k073K93p188K685m146K01J406J3685K550q050k913
11108D444M05j6649J1656J0747N706n058R852N217q736j0276Q29m261L963N778
11094A3617k117j1241r34o50P616M615L390m086m344k600M460n103L954P323n839
11079H061r936l911Q126N35J167O623j012k94j0083K362Q84m810L513p2O359J67
11063G679J449l959m768J3222M835j4030J405M849j1951m720N931Q020l045l470
11049A447J8136Q034L172Q4K711K417j954j252j2190K358O840J597j126l171N610
11034C2713J3457J6435J0552k955j1234q370j758l226L088q48J2416J4414M358
$$ plain form
11137 44122 39658 28907 21302 19309 22616 24918 7456 7618 19434 22228 16519 15581 15315 11174
11123 11174 12293 13516 8970 7994 5921 6214 -974 1711 -2435 -2234 -828 12857 15407 7357 4444
11108 4444 4849 -11800 -144 10603 16309 11251 21103 26320 17584 7308 8137 3876 7839 13617
11094 13617 11500 259 -675 -1325 6291 10906 14296 10210 5866 3266 7726 2623 6577 13900 8061
11079 8061 -1875 -5786 2340 2875 4042 10665 9653 9359 -724 1638 2522 -2288 1225 1153 7512 7679
11063 7679 9128 5169 401 13623 18458 4428 5833 10682 -1269 -5989 -58 7962 4917 1447
11049 1447 19583 27617 30789 30873 33584 36001 34047 32795 20605 22963 29803 31400 30274 27103 32713
11034 32713 46170 62605 73157 70202 58968 50598 48840 45614 48702 47854 60270 74684 79042
11021G9042M893K141o443j718j7299j809O624o580l45j442J6400J4120j044j4662
11007G1878j484j1343k2003o654K155N134l107p260p821n302J8500J103o941l820
10993B3035L237n361J803m399k004J671l6j124l059j665R76q854N331Q075n74
10978A7052p118j026n367j905l255J017Q028N466n707p920L941O07q750m143K81
10963h799R105O681n866j92L411N201m106r359p12k358L115R803N925j379J050
10948A1520J1994L646k552j1720n459n91j430n981Q85Q616L582q83n300J138r33
10933F532K445k991N49O022r45m97j13o628n544q965j121P415n167n51M163O421
10917A025m655l071N668Q517j927n474m444O556k017o441O629Q396j863j1458
$$ plain form
11021 79042 83935 86076 79633 77915 60616 58807 65431 58851 58506 57064 73464 87584 86540 71878
11007 71878 70394 59051 37048 30394 32549 37683 34576 27316 19495 14193 32693 33796 26855 23035
10993 23035 26272 20911 22714 18315 16311 17982 17946 16822 13763 12098 13074 4220 9551 17626 17052
10978 17052 9934 8908 3541 1636 -1619 -602 7426 12892 7185 -735 3206 3813 -4937 -9080 -8799
10963 -8799 306 6987 1121 929 4340 9541 5435 -3924 -4636 -6994 -3879 5924 11849 10470 11520
10948 11520 23514 27160 24608 12888 7429 6838 5408 -573 312 8928 12510 11627 6327 7465 6532
10933 6532 8977 5986 6535 12557 11612 11115 11002 4374 -1170 -10135 -11256 -3841 -9008 -9559 -5396 1025
10917 1025 -3630 -6701 -1033 7484 5557 83 -4361 2195 178 -6263 366 8762 6899 -4559
10903d559J27P18P833J980q828j0299l252K513J54M576K437j376O43L105o199
10888a0427m73L375J933L340O513K490m372N240p50j0084n333j70K919M253N59
10873i87j94J140P679j4954o098J364J1814Q744m190q715M093J0452N234m610
10859A0772j0554rN66n91p008m382J1523K171n694l080J760P555J478K693N281
10844A2481k410K727Q395K082k326j988k782L269k130k262j0216n867J0864o176
10830C661R362L958r814r680m184N742J2488j1118N809K46j1841P72J317O105
10816B823O958L344q869r498l129l940m108K898p57P938P788R73N386l406l097
10801A304j346O62J09q461L509l112M380K635K65p798R55M709J212N590L705m927
$$ plain form
10903 -4559 -4432 -3714 4119 6099 -2729 -13028 -16280 -13767 -13613 -9037 -6600 -7976 -7333 -4228 -10427
10888 -10427 -10900 -7525 -5592 -2252 4261 6751 2379 7619 6869 -3215 -8548 -8718 -5799 -1546 -987
10873 -987 -1181 -41 7638 -7316 -13414 -12050 -236 8508 4318 -4397 -304 10148 15382 10772
10859 10772 218 209 775 184 -6824 -11206 317 2488 -3206 -6286 -4526 3029 4507 7200 12481
10844 12481 10071 12798 21193 23275 20949 18961 16179 19448 17318 15056 4840 -1027 9837 3661
10830 3661 13023 16981 7167 -2513 -6697 -955 11533 415 6224 6470 -5371 -4599 -3282 2823
10816 2823 9781 13125 4256 -5242 -8371 -12311 -16419 -13521 -14278 -6340 1448 2421 7807 4401 1304
10801 1304 -42 620 729 -7732 -4223 -7335 -2955 -320 -55 -7853 -6898 -2189 -977 4613 8318 3391
10785C391k102n882r95M185k824l592L105M192k349j0663j386L55N439M007k295
10770g414N208k065p653j088K640m923P450R194L388K575l736p191j0054j608
10756a5277o628r318P193P013K2J4111J848o251n046m319q508r641O814p2Q482
10741a9577J0698l327j3969K481K106J356K562Q410l299m19J420K383q203m494
10727b1872P580K298L936R845J750n831j2252j4721M063L650M135K085o22o6L356
10712a2666J1624P145L770o331j0821j104K13k986O55P062L371j752q508M960
10698e368P719j005k639L458R901J187n001j2771J770J1186M955Q487K054j2002
10684A1931l549Q470l86P774j788l631J792k797J533K401K898m684r933l538M376
$$ plain form
10785 3391 1289 -4593 -5588 -1403 -4227 -7819 -4714 -522 -2871 -13534 -14920 -14565 -9126 -5119 -7414
10770 -7414 -2206 -4271 -11924 -13012 -10372 -15295 -7845 1349 4737 7312 3576 -3615 -13669 -15277
10756 -15277 -21905 -31223 -24030 -17017 -16995 -2884 -1036 -7287 -12333 -16652 -25160 -34801 -27987 -28059 -19577
10741 -19577 -8879 -12206 -26175 -23694 -21588 -20232 -17670 -9260 -12559 -12978 -11558 -9175 -17378 -21872
10727 -21872 -14292 -11994 -8058 1787 3537 -2294 -14546 -29267 -25204 -21554 -17419 -15334 -15956 -16022 -12666
10712 -12666 -1042 6103 9873 3542 -7279 -8383 -8170 -11156 -10501 -3439 -68 -1820 -10328 -5368
10698 -5368 2351 1346 -1293 2165 12066 13253 8252 -4519 -2749 8437 13392 21879 23933 11931
10684 11931 8382 16852 16466 24240 22452 18821 20613 17816 19349 21750 24648 19964 10031 6493 10869
10669A0869M219r293P140L983K71J0407j44L295K197N3K267J1296l33M614J1392
10654F2233O57J0095M403Q332R859N772J1697N88j0650j54o340l702R641Q394
10640A10825Q690J0243J5565J2919J5057K5108K7795L0262M5522M8726L3069K6689
10628D10470L3133M3872N1773O3044Q7577J23025J66018K25236L09661M10712
10618A924521N27381O56214P60985P54604N72806K29691q2626k14748j59793M761
10608D973796K43479N55981R14778J265198J534246J459810R05305R556p47474
10599A1114675r92817p89574m05921O0610N73839J129899J642817J928291J673257
10590A5935076P11464o29302j650701j921532j612358j096470n64794m5627M15055
$$ plain form
10669 10869 15088 5795 12935 16918 17189 27596 27452 30747 32944 32997 35264 46560 46227 50841 62233
10654 62233 62890 72985 77388 85720 95579 101351 113048 113636 102986 102832 96492 92790 102431 110825
10640 110825 119515 129758 145323 158242 173299 198407 226202 256464 301986 350712 383781 410470
10628 410470 443603 487475 539248 602292 689869 812894 978912 1204148 1513809 1924521
10618 1924521 2451902 3108116 3869101 4623705 5196511 5426202 5343576 5128828 4969035 4973796
10608 4973796 5217275 5773256 6688034 7953232 9487478 10947288 11852593 11862149 11114675
10599 11114675 10121858 9332284 8926363 8986973 9560812 10690711 12333528 14261819 15935076
10590 15935076 16646540 16017238 14366537 12445005 10832647 9736177 9171383 9125756 9540811
10581I540811Q02888R87542P35389K1333q60169j465508j545854j266164q87156
10572F063112n30578k39189M180J65347K00323P3866k22788n52462p62374p79052
10562C420385o60811n02442l62147k57927k18551k11059j80353j39980j06771
10553G80344q4816o9357n8660m8618m3293l8560m1298l2898k5378k2028j9733
10542B95705j8163j6562j4608k0368n983q576j2330j4578q231n931j1197j9187
10530A39991o775j063n765q522p56j24M637J26L263p317j6919j3443R66L139Q38
10515I2276K886n560m2p899M424J388l827r14K432n048k480k621o102j4143l994
10500E0776Q277O62j569M907k922j568O619M796q404p02j986J191J3027J507q412
$$ plain form
10581 9540811 10343699 11331241 12066630 12087963 11227794 9762286 8216432 6950268 6063112
10572 6063112 5532534 5293345 5297525 5462872 5663195 5737061 5514273 4961811 4199437 3420385
10562 3420385 2759574 2257132 1894985 1637058 1418507 1207448 1027095 887115 780344
10553 780344 695528 626171 567511 518893 475600 437040 395742 362844 337466 315438 295705
10542 295705 277542 260980 246372 226004 220021 211445 199115 184537 176306 170375 159178 139991
10530 139991 133216 132153 126388 117866 117110 116986 121623 121749 125012 117695 100776 87333 88299 91438 92276
10515 92276 95162 89602 89560 81661 86085 87473 83646 82732 85164 80116 77636 75015 68913 54770 50776
10500 50776 59053 59715 58146 63053 60131 58563 65182 69978 61574 60872 58886 60077 73104 74611 66199
10485F6199r54O567j250j0855r622L486Q550q56L69k191l693l443m088Q788K161
10470E9168j1556n728J3915J5597Q470j2810J14J974r669j1530m378M068P684
10457E5319j006q94J745k018o975K1245N841j2275r981q023j12M943n083K978
10443D5704R357K533p714m57K54J408l817r510l807J526L51q269j2282M850O635
10428B6762M907N305n846n570J67m380J707p787j157L025R19L494M392l823m135
10413A7980K201m400n086L980q230j0201p52J2731N706N739n185j2839j2748J5510
10399D406R891r415m654k83P82J0320J2231l82j3840o7L238Q334o186n67j0178
10384C630m216N681O687O341j992j260o198r632k570J931M869M793r336j357N901
$$ plain form
10485 66199 65245 71812 70562 59707 50085 53571 62121 61265 61634 59443 55750 52307 48219 57007 59168
10470 59168 47612 41884 55799 71396 79866 67056 67170 69144 59475 47945 43567 47635 55319
10457 55319 54313 53419 55164 53146 46171 67416 73257 60982 51001 42978 42866 47809 42726 45704
10443 45704 55061 57594 49880 49423 49677 51085 47268 37758 33951 35477 35828 27559 15277 20127 26762
10428 26762 31669 36974 31128 25558 25725 21345 23052 15265 14108 17133 18052 21546 25938 22115 17980
10413 17980 20181 15781 10695 14675 6445 -3756 -4508 8223 13929 19668 14483 1644 -11104 4406
10399 4406 14297 4882 228 -55 727 11047 23278 22896 9056 8989 12227 20561 14375 13808 3630
10384 3630 -586 5095 11782 18123 16131 14871 8673 -959 -3529 -1598 3271 8064 -1272 -2629 3272
10369C272M455j950k659K631l663M02m394l830M887L351k611N785j940j0073K35
10354f102O157L099k409J0527P051o476n449Q110Q15m458m257r101l02N462k912
10339b45L761P270j337q256l675L050k91o609K548K797l12j658j272N828N962
10324G561m480p314o424l971O499j401Q85J699Q385Q196O535L637n805j5424p613
10309i035J471L652L198K738l098p987J1015O641r60O96K640P418j637o262k107
10294H383o644q2k240k826M380m731N049N42l852N333k124L170J761J692J0644
10279A8455p981p183O97r796N884M336k081q80O701M455j784j2575m370K859Q809
10264E546J3017J1565Q886N634l466j0186n295p330j1374J564K318p056l271M909
$$ plain form
10369 3272 7727 5777 3118 5749 2086 2488 -1906 -5736 -849 2502 -109 5676 3736 -6337 -6102
10354 -6102 55 3154 745 11272 18323 11847 6398 14508 15323 10865 6608 -2493 -2795 2667 -245
10339 -245 3516 10786 9449 1193 -2482 568 277 -6332 -3784 -987 -1299 -2957 -4229 1599 7561
10324 7561 3081 -4233 -10657 -14628 -8129 -9530 -8645 -6946 1439 9635 16170 19807 14002 -1422 -9035
10309 -9035 -7564 -3912 -714 2024 -1074 -9061 1954 8595 7635 8331 10971 18389 16752 10490 8383
10294 8383 1739 1657 -583 -3409 971 -3760 1289 1831 -2021 3312 1188 4358 6119 7811 18455
10279 18455 10474 3291 3988 -5808 76 4412 2331 1451 8152 12607 10823 -1752 -6122 -3263 5546
10264 5546 18563 30128 39014 44648 41182 30996 25701 18371 6997 8561 10879 3823 552 5461
10250E461M496p44l951L524p159q276j711M07K51L362R084l86r76q830p813O002
10234g259M50r146J426P641q31o6O746k131m117j811j179R377J091N691m753q724
10218g595p746q49M576K679q702J634M924K768l561j362P612K550j045r019Q719
10203d417J2732J5992j667j1621p362o969P27J9384N601J232L610j3812q692M941
10189I679k38r307n603l751K898K117O548J204N145l053L561o87N863q583M718
10174A0511J6642P976r634m368O989J1123L400R768J1288J2986m774q358j2009
10161E1540j2229p71P100L67P448K0809J5834L972K150J841j1107k3902j4658
10148D8394n623m283l823L267p61J5489J1015l996l619O67n288j2051o345K960
$$ plain form
10250 5461 9957 9213 5262 8786 1627 -6649 -8360 -7953 -7702 -4340 4744 4358 3382 -5448 -13261 -7259
10234 -7259 -6809 -15955 -14529 -6888 -7719 -7785 -1039 -3170 -7287 -9098 -10277 -900 191 5882 1129 -7595
10218 -7595 -15341 -16190 -11614 -8935 -17637 -16003 -11079 -8311 -11872 -13234 -5622 -3072 -4117 -13136 -4417
10203 -4417 8315 24307 22640 11019 3657 -3312 -2585 16799 22400 23632 27242 13430 4738 9679
10189 9679 9441 134 -5469 -9220 -6322 -4205 2343 3547 8692 5639 9200 8513 14376 5793 10511
10174 10511 27153 35129 25495 21127 28116 39239 42639 52407 63695 76681 71907 63549 51540
10161 51540 39311 38540 45640 46007 53455 74264 90098 94070 96220 98061 86954 63052 48394
10148 48394 42771 38488 34665 37932 37171 52660 63675 59679 56060 56727 51439 39388 33043 36003
10134C6003k074K271l142l343L72J156L799l481j0687k837o105m541K461K749
10120A2601L656r466p624k390k379J1728L783j752J475k149p094j1150M012J1670
10106D921M333q516r389q10L938M406n140n232J498J872J633m631k507R49N072
10091g603N130K539L621n176n294M768P972L162j6974n619J2167j977J056K147
10077h1j615m700k068J3754L59m776J955p759q88J425j1732n878O378j3522K126
10062b7022R894N250n122J451L293Q82l170J874M480Q11P3k487M16O366L067o477
10046f421K990L169p260L43M294L319k440p992M348J624j0617m75L538P527p259
10031a1312q075L207N794J3182M063n974o122L078L28l446n277j467l197j608
$$ plain form
10134 36003 33929 36200 33058 29715 30087 31243 35042 31561 20874 18037 11932 7391 9852 12601
10120 12601 16257 6791 -833 -3223 -5602 6126 9909 8157 9632 7483 389 -10761 -6749 4921
10106 4921 9254 738 -8651 -9461 -5523 -1117 -6257 -11489 -9991 -8119 -6486 -11117 -13624 -12675 -7603
10091 -7603 -2473 66 3687 -1489 -6783 -2015 5957 9119 -7855 -13474 -1307 -3284 -2228 -81
10077 -81 -1696 -6396 -8464 5290 5649 873 2828 -4931 -5819 -4394 -16126 -22004 -15626 -29148 -27022
10062 -27022 -17128 -11878 -17000 -15549 -12256 -11374 -14544 -12670 -8190 -7379 -7306 -9793 -9377 -3011 56 -6421
10046 -6421 -3431 -262 -7522 -7179 -2885 434 -2006 -9998 -5650 -4026 -14643 -15118 -11580 -4053 -11312
10031 -11312 -19387 -16180 -10386 2796 6859 885 -5237 -2159 -1831 -5277 -10554 -12021 -15218 -16826
10017a6826J543j490K200L231L528L996l943j992q234K516L051M356m359m663
10003a7086j097Q878M526j747m604j280j000J0609P1n638k475N703j0279j589
9989a7008m16k050m135J0997M769j847j2573m744J2738O864J004n73M899R342
9975G267q090q948j3609J399J4216J546J856m796n289p611j962O044o6K582k555
9960a8016L967J6320k304J37M998m941l95n340k396l717J513O34K742M690p44
9945b852l740l903R28l832l307O632P648N373L249j0693q03J949l887o975n551
9930a9764O846O245L743R738J2903n948o341k885m166k167P583J178J48L105l138
9915G080j3416j2090M430p647J632J8776K060n909l298n1j33Q98l035p431j410
$$ plain form
10017 -16826 -15283 -16773 -14573 -11342 -7814 -3818 -7761 -9753 -17987 -15471 -12420 -8064 -12423 -17086
10003 -17086 -18183 -9305 -4779 -6526 -11130 -12410 -13410 -2801 -2730 -8368 -10843 -5140 -15419 -17008
9989 -17008 -17424 -19474 -23609 -12612 -7843 -9690 -22263 -27007 -14269 -7405 -6401 -6974 -2075 7267
9975 7267 -823 -9771 -23380 -21981 -7765 -6219 -4363 -9159 -14448 -22059 -24021 -17977 -18043 -15461 -18016
9960 -18016 -14049 2271 -33 104 5102 161 -234 -5574 -7970 -11687 -10174 -9540 -6798 -2108 -2852
9945 -2852 -6592 -10495 -9567 -13399 -16706 -10074 -2426 2947 6196 -4497 -5300 -3351 -7238 -14213 -19764
9930 -19764 -12918 -6673 -2930 6808 19711 13763 7422 4537 371 -1796 5787 6965 7113 10218 7080
9915 7080 -6336 -18426 -13996 -21643 -20011 -1235 825 -5084 -8382 -8433 -8566 -7668 -10703 -18134 -19544
9900a9544M506R984R62o044j44j271l939N447K189l685k466j1821o225p356K86
9885c9121O726K110M755m46K248K05J535l207J382K752J1224K934n415p126k568
9870b2012J0070Q841R264n257r883Q49n869k393P914L963J69p174l811M847K17
9855a0265o246n713J879J792O716p125j111O901L469j864o249r210k271P864Q379
9840a3054Q167j183n879k910Q570R111L20M31R52M343p283q891J452Q307l638
9825a185j0890J549J390l870l855J0428J2862j44j4015j1962j0071K328L466Q015
9811a5954K206j1102P612J1162l85J953o297q855P526J7179o53N53r96K36P765
9796A1950l236p40n91n970n804o29n575O909J290n896j764n100k241O83J545J346
$$ plain form
9900 -19544 -15038 -5054 -4092 -10136 -10280 -11551 -15490 -10043 -7854 -11539 -14005 -25826 -32051 -39407 -39121
9885 -39121 -32395 -30285 -25530 -25976 -23728 -23523 -21988 -25195 -23813 -21061 -9837 -6903 -12318 -19444 -22012
9870 -22012 -11942 -3101 6163 906 -8977 -8128 -13997 -16390 -8476 -4513 -4344 -11518 -15329 -10482 -10265
9855 -10265 -16511 -22224 -20345 -18553 -11837 -18962 -20073 -13172 -9703 -11567 -17816 -27026 -29297 -21433 -13054
9840 -13054 -4887 -6070 -11949 -14859 -6289 2822 3142 3573 4525 8868 1585 -7306 -5854 2453 -1185
9825 -1185 -12075 -10526 -9136 -13006 -16861 -6433 6429 6285 -7730 -19692 -29763 -27435 -23969 -15954
9811 -15954 -13748 -24850 -17238 -6076 -6461 -4508 -10805 -19660 -12134 5045 4392 4945 3949 4185 11950
9796 11950 8714 7974 7383 1413 -4391 -5020 -10595 -3686 -2396 -8292 -10056 -15156 -17397 -16714 -15169 -13823
9780a3823n822p038N166R642P591j33j09l932R156J102p160r816p889M925M940
9765a3200M973P180N62m794j184L79j743J658n673M146l137l272J277m589l168
9750b0585N537L385k005j253j740P266K322m701N110o780j090n257p383j551K995
9735b5730R535P96j0073P611R232p265p207J2760K258M220N37O387R459j705l119
9720G696n245M59j260n026K405q90j060m324L564Q181J474n089M482P104Q542
9705B1013j072L658R237P374K1047K3456K1656K6190R031j7563j8750k2185j4546
9692F8546j6358j2639j8958j0633o815l063j190L552m857m52l080O419L765j641
9678B596l408J878j1693l217M779n868j4994K670O992J4698J854j0092N011M915
$$ plain form
9780 -13823 -19645 -26683 -21517 -11875 -4284 -4417 -4526 -8458 698 1800 -5360 -15176 -23065 -18140 -13200
9765 -13200 -8227 -1047 -485 -5279 -6463 -6084 -7827 -6169 -11842 -7696 -10833 -14105 -12828 -17417 -20585
9750 -20585 -15048 -11663 -13668 -14921 -16661 -9395 -7073 -11774 -6664 -13444 -14534 -19791 -27174 -28725 -25730
9735 -25730 -16195 -15399 -25472 -17861 -8629 -15894 -23101 -10341 -8083 -3863 -3326 3061 12520 10815 7696
9720 7696 2451 2910 1650 -3376 -971 -1861 -2921 -7245 -3681 4500 5974 885 5367 12471 21013
9705 21013 19941 23599 32836 40210 61257 84713 106369 132559 141590 124027 105277 83092 68546
9692 68546 52188 39549 20591 9958 3143 80 -1110 2442 -2415 -2867 -5947 472 4237 2596
9678 2596 -812 1066 -10627 -13844 -9065 -14933 -29927 -27257 -20265 -5567 -3713 -13805 -8794 -3879
9664c879j105M326K362q411k49m674k165q0K212N041J0986J3009J2789K7448J7130
9649G4740o524j8370o718j4237j8889j0679j2065j0700J146P319m703k353l969
9636b6002L208O105L981J082l519o969J698J0034K706r576q223K19P831O330K595
9621h500N371L915J276o924m690M178P898P42j567J760K17J34r16M930P450p361
9605G913q986j284J357n939M073M798P82K489r001l060J3689L846n364K079O804
9590A4196J0499M942M465J6495K3488K5048J8747J0325N483p384j4941j7399j7657
9577G6307p592j7482j0913j4843j0926M164l547n294r146l932N609Q024P790n225
9563A2994m459o419q356l422K61M695K864m579K419Q23Q392k478n993J908m622
$$ plain form
9664 -3879 -4984 -658 1704 -6707 -6956 -11630 -13795 -13875 -11663 -6622 4364 17373 30162 57610 74740
9649 74740 68216 49846 43128 28891 10002 -677 -12742 -23442 -22296 -14977 -19680 -22033 -26002
9636 -26002 -22794 -16689 -12708 -11626 -15145 -22114 -20416 -10382 -7676 -17252 -25475 -25256 -17425 -11095 -8500
9621 -8500 -3129 786 2062 -4862 -9552 -5374 2524 3266 1699 3459 3676 3810 2894 7824 15274 7913
9605 7913 -1073 -2357 -1000 -6939 -2866 1932 2714 5203 -3798 -6858 6831 10677 5313 7392 14196
9590 14196 24695 29637 34102 50597 74085 99133 117880 128205 133688 126304 111363 93964 76307
9577 76307 68715 51233 40320 25477 14551 18715 15168 9874 728 -3204 2405 10429 18219 12994
9563 12994 8535 2116 -6240 -9662 -9401 -4706 -1842 -6421 -4002 -3179 5213 2735 -3258 -1350 -5972
9548e972j859M46q77o10o54O408Q095Q26m598l102O303J180o779j1233j3489m123
9532c0038L957N015K661J3441K400q07l288K952o336o544kP012K978m646o568
9517a7813O778M910q71n899k686q225P496J833p540N81n364L198J3639R077J186
9502C00n496j53l352j2553p714O362Q116P821p570j098L053M697K653o69m076
9487i679K937K500P775j829O41k100j1749n896L795P91l020O291K638q91m448
9472a2244L521m90M889P715J080j1254n330q807l10N134L49o314j258j565o84
9457b5568R998j703r406M002J3207J660k159l730l63J087J142o6O45L206l72l888
9441a2308j048k897m034k963K480N410j508p13J000j094K37K091M717K260n406
$$ plain form
9548 -5972 -7831 -7385 -8262 -8872 -9526 -3118 4977 5803 1205 -1897 4406 5586 -1193 -12426 -25915 -30038
9532 -30038 -26081 -21066 -18405 -4964 -2564 -3371 -6659 -3707 -10043 -16587 -16589 -9577 -6599 -11245 -17813
9517 -17813 -11035 -6125 -6996 -12895 -15581 -23806 -16310 -14477 -22017 -21436 -26800 -23602 -9963 -886 300
9502 300 -5196 -5349 -8701 -21254 -28968 -22606 -14490 -6669 -14239 -15337 -12284 -7587 -4934 -5603 -9679
9487 -9679 -6742 -4242 3533 1704 2345 245 -11504 -17400 -13605 -12814 -15834 -9543 -6905 -7796 -12244
9472 -12244 -8723 -9213 -4324 3391 4471 -6783 -12113 -20920 -21230 -16096 -15747 -22061 -23319 -24884 -25568
9457 -25568 -15570 -17273 -26679 -22677 -9470 -7810 -9969 -13699 -14062 -12975 -11833 -11899 -11254 -8048 -8420 -12308
9441 -12308 -13356 -16253 -20287 -23250 -20770 -15360 -16868 -17581 -16581 -17675 -17438 -15347 -10630 -8370 -13776
9426a3776r132J059L160R418r95Q047l776n590R10O262P48p709k522n615N957
9411a3554J787J442Q736J0001j683m43j0517r816p543o913j182L711Q972n02o443
9396b3947Q619Q725J895l301j630q23n876Q07n934p94r004l899M269K789N679
9381b2425J588J300m822r8R055m268K763O884m611k967k463n486J318M195j75
9366b0212k314O075n625l758K519J946j910J991M609P889K608m230l567R145j320
9351f154j0941R86K619k800L164Q343l19q201m224P345J397j44N929m514L958
9336c556J335l379o112M643P885J4025q962j0134k689k530N859M56L993j653O058
9321E239k068l706j627l595K664k95n35m163m527O095L264j919o856M002P270
$$ plain form
9426 -13776 -22908 -21849 -18689 -9271 -10266 -2219 -5995 -11585 -10675 -4413 -3665 -11374 -13896 -19511 -13554
9411 -13554 -11767 -10325 -1589 8412 6729 6286 -4231 -14047 -21590 -28503 -29685 -25974 -17002 -17504 -23947
9396 -23947 -15328 -6603 -4708 -8009 -9639 -10462 -16338 -15531 -21465 -22259 -31263 -35162 -30893 -28104 -22425
9381 -22425 -20837 -19537 -24359 -24457 -15402 -19670 -16907 -10023 -14634 -17601 -20064 -25550 -24232 -20037 -20212
9366 -20212 -22526 -16451 -22076 -25834 -23315 -21369 -23279 -21288 -16679 -8790 -6182 -10412 -13979 -4834 -6154
9351 -6154 -17095 -16109 -13490 -16290 -13126 -4783 -5102 -13303 -17527 -10182 -8785 -8929 -3000 -7514 -3556
9336 -3556 -2221 -5600 -11712 -7069 816 14841 5879 -4255 -6944 -9474 -3615 -3159 834 -819 5239
9321 5239 3171 -535 -2162 -5757 -3093 -3388 -3923 -8086 -12613 -6518 -3254 -5173 -12029 -8027 -757
9306g57r11j0490p922O25L863N988M719M441p956k071j170p472o135J634L31l749
9290b7032l951L886O592K936K66R7k6l191j184P155O84N618O006n391j623j0107
9274a9265q017M144J3192k989m226M278K604L445N254q715m795Q351j338p87O430
9259b434J85j881n267M998k770q589J30O304M944l739k401L82n587j319m592O957
9243a4679o219J708M649L658L832P550q9m405j753P669J802M593o525n537M126
9228C80n14M153j0331j4672M202J3726n160J073K95L268r39j079j549j828q150
9213a7125p682K427N932L111r31J179N83K545n99L368P944l53q52p941L176J1151
9197E933J3655j438l364j2259k0812Q926P446n359p764m132N479N025k901L034
$$ plain form
9306 -757 -1668 -12158 -20080 -19455 -15592 -9604 -4885 -444 -8400 -10471 -11641 -19113 -25248 -23614 -23283 -27032
9290 -27032 -30983 -27097 -20505 -17569 -17303 -17206 -17232 -20423 -21607 -14452 -13768 -8150 -2144 -7535 -9158 -19265
9274 -19265 -27282 -23138 -9946 -12935 -17161 -12883 -10279 -6834 -1580 -10295 -15090 -6739 -8077 -8864 -2434
9259 -2434 -2249 -4130 -9397 -4399 -7169 -15758 -15628 -9324 -4380 -8119 -10520 -10138 -15725 -17044 -21636 -14679
9243 -14679 -20898 -19190 -14541 -10883 -7051 499 410 -3995 -5748 1921 3723 8316 1791 -3746 380
9228 380 -134 4019 -6312 -20984 -16782 -3056 -8216 -7143 -6848 -3580 -4519 -5598 -7147 -8975 -17125
9213 -17125 -24807 -22380 -16448 -13337 -14268 -13089 -12506 -9961 -10560 -7192 752 399 -453 -8394 -5218 5933
9197 5933 19588 18150 14786 2527 -18285 -9359 -1913 -7272 -15036 -19168 -13689 -8664 -11565 -8531
9183h531P31K355R807l505o945k764k913m019M346Q499k88J633J068j0758n200
9168a6484r47l88j525M422L946Q75O532K280j378j4129m618J540N982Q070J53
9153e669m112J900o74k34L358O61L984Q27o017j210N85j273n567L768M251N359
9137f3K010m413q207n314j085J1439N639q963n684J535j604Q889J3281O415o55
9122A3220L565q482m580k529j114L151o366o98o075l112J752j475J125l600m193
9107a9411J0756j87n211l051k549R71n521J0M376J1177J6167K262q00n601j0776
9092g388l191m824K749M809m120J358P601N773j388j0407R29Q2q476K658n819
9077a9654l36J555J1396J732N33R107j800J692k970Q764P70O34j354J3183J3474
$$ plain form
9183 -8531 -7800 -5445 4362 857 -6088 -8852 -11765 -15784 -11438 -2939 -3227 -1594 -526 -11284 -16484
9168 -16484 -17431 -17819 -19344 -14922 -10976 -10101 -3569 -1289 -2667 -16796 -21414 -19874 -13892 -5822 -5669
9153 -5669 -9781 -7881 -8555 -8789 -5431 -4770 -786 41 -5976 -7186 -6601 -7874 -13441 -9673 -5422 -63
9137 -63 1947 -2466 -10673 -15987 -17072 -5633 6 -8957 -14641 -13106 -14710 -5821 7460 13875 13220
9122 13220 16785 8303 3723 1194 80 3231 -3135 -3833 -9908 -13020 -11268 -12743 -11618 -15218 -19411
9107 -19411 -8655 -8842 -14053 -17104 -19653 -18682 -24203 -24193 -19817 -8640 7527 9789 8989 3388 -7388
9092 -7388 -10579 -15403 -12654 -7845 -11965 -10607 -3006 2767 1379 -9028 -8099 -8017 -16493 -13835 -19654
9077 -19654 -19990 -18435 -7039 -5307 -4774 4333 2533 4225 1255 10019 10789 11423 10069 23252 36726
9062C6726L524L754J2659J2118n827q374r002o54J3823R392M521L704n102m124
9048F7138l012m600l1N96j1968j171J584M04Q764J0432K111M753J3759O253O110
9033A01122J0152J5858J0784J7955K5552K4846M6182M2184N1048P4378R6255J10606
9021F26922J27493J35517J37470J22306O5835J9420l6642p3506j10134j25526
9011H89155j35248j21200j13346r6871p5266m6618m3517l2383j8972j6503j5611
9000A73620j6706j6436j4738n211r242k3139j1561j1515j0563L31Q01l805Q53
8987E2689J491j087p304L864j272l941l260J909o69R49j654k118m988j0151m349
8972B0109N916j318L391L159k818p453k191k102j700J431J4349Q575m975j6230
$$ plain form
9062 36726 40250 44004 56663 68781 62954 54580 45578 44924 58747 68139 72660 76364 71262 67138
9048 67138 64126 59526 59495 60091 48123 46952 48536 48940 57704 68136 70247 75000 88759 95012 101122
9033 101122 111274 127132 137916 155871 181423 206269 252451 294635 345683 420061 516316 626922
9021 626922 754415 889932 1027402 1149708 1215543 1234963 1198321 1124815 1014681 889155
9011 889155 753907 632707 519361 422490 347224 300606 257089 224706 205734 189231 173620
9000 173620 156914 140478 125740 120529 111287 88148 76587 65072 54509 54840 55641 51836 52689
8987 52689 54180 53093 45789 49653 48381 44440 41180 43089 42420 43369 41715 39597 34609 24458 20109
8972 20109 26025 24707 28098 31257 28439 20986 18795 16693 14993 16424 30773 39348 34373 18143
8958A8143j1226r207K647L315N87L795M453j393o421N950P254J139k688J255k312
8943A5291m002q988n027q975J894J4276R841n254j0293l683o813l554p47J2805
8929c229Q330R094P675M516O41N494J410m375P99Q476O113k130M837L747m213
8914D7185j0970J065P114Q125o052j2075K83J37O276K1060P164j0808q309j076
8900D9119l01M695o66Q596J8720J0731K827P033R189J506J858j665M053J0312
8886A26007O878J2391Q770K508Q235K29j762O657M965j205n738l469q451j1999
8872A44016O305K0097n1j8952j8662j4226r582R28k348j1042o222J0894R297L43
8858A10795j0598j4398j5477k5426j1802j5801M064J1144J4409J2893J0271P057
$$ plain form
8958 18143 6917 -2290 357 3672 4259 8054 12507 11114 4693 10643 17897 19036 16348 17603 15291
8943 15291 11289 2301 -2726 -11701 -9807 4469 14310 9056 -1237 -4920 -11733 -15287 -16034 -3229
8929 -3229 5101 14195 21870 26386 27027 32521 33931 29556 30355 38831 44944 42814 47651 51398 47185
8914 47185 36215 37280 44394 52519 46467 34392 34675 34812 41088 62148 69312 58504 50195 49119
8900 49119 48818 53513 52847 61443 80163 90894 93721 100754 109943 111449 113307 111642 115695 126007
8886 126007 132885 145276 154046 156554 164789 165018 163256 169913 174878 173673 167935 164466 156015 144016
8872 144016 150321 170418 170367 151415 132753 118527 108945 109873 107525 96483 90261 101155 110452 110795
8858 110795 100197 85799 70322 44896 33094 17293 21357 32501 46910 59803 70074 77131
8846G7131N448R391M715r72l642R4l801j3088k018J2236O663n598N624J0802Q04
8831A03789M148k238N285j379M595j488q315q469n693q330J113m233p91q74q261
8816F8859j3314K163J0694L076Q346j2445j0289j38k442Q684J6174J1462J4105
8803A04935M420p707r363k635M64M143M338J4122P043J1673J5614J5623O087J7472
8789A86229J9971J5151M130L463k741m747j2465q489k5566p0136r4886j06402
8777i6488r8993n5336N955L4386L3903K9016L3397L1253K3684J0932J1017J1402
8765b5872J1963J4405J6474J5909J6659J6439K373O127J0825K8393L7768N2667
8753B04130N4341K8328j1021m2258o7317o0962l3341L286L7599O0982N6105M4407
$$ plain form
8846 77131 82579 91970 96685 95713 92071 92165 88364 75276 73258 85494 92157 86559 92183 102985 103789
8831 103789 107937 105699 110984 109605 114200 112712 104397 95928 90235 81905 83018 78785 77994 77120 68859
8816 68859 55545 57708 68402 71478 79824 67379 57090 56952 54510 63194 79368 90830 104935
8803 104935 109355 101648 92285 89650 90114 94257 98595 112717 119760 131433 147047 162670 168757 186229
8789 186229 206200 221351 225481 228944 226203 221456 208991 200502 174936 104800 9914 -96488
8777 -96488 -195481 -250817 -244862 -210476 -176573 -147557 -114160 -82907 -59223 -48291 -37274 -25872
8765 -25872 -13909 496 16970 32879 49538 65977 68350 74477 85302 113695 151463 204130
8753 204130 258471 286799 275778 233520 166203 105241 71900 75186 112785 173767 229872 274279
8741B74279L3046K6213L1399L5450L0833K2508j745k8330l9996k5632j058n586
8729C51381j435J9516K7674L0032L929m675k612L20o958k541R575K1438J9502
8716D65146J7274J8448K2324K3778K5409M8655O0078N4801K9954p313k2886j6428
8704G19240j2638J2759L2525L3385J4287Q431j4471k9976k5725j2419j383k30
8692G23785J0947K8821M4818M4593M3779M5476L4127K5133L0934M0284M0273M6904
8680A159874O6922O9275N5118O5584P9758Q1578Q6749J13426J32408J55637J74298
8669B240627J94272K07102K25148K76015L61994M92736O75560R58251J400974
8660G032679K103311L066306L756808L175699P11247k290100l538661k931686
$$ plain form
8741 274279 307325 333538 364937 400387 431220 453728 451983 423653 383657 358025 356967 351381
8729 351381 349946 369462 397136 427168 431097 426422 423810 424130 417172 414631 424206 445644 465146
8716 465146 482420 500868 523192 546970 572379 621034 681112 735913 765867 758554 735668 719240
8704 719240 706602 719361 751886 785271 799558 807989 793518 763542 737817 725398 724015 723785
8692 723785 734732 763553 808371 852964 896743 942219 976346 1001479 1032413 1072697 1112970 1159874
8680 1159874 1226796 1296071 1351189 1416773 1496531 1578109 1664858 1778284 1910692 2066329 2240627
8669 2240627 2434899 2642001 2867149 3143164 3505158 3997894 4673454 5631705 7032679
8660 7032679 9135990 12202296 15959104 19134803 19846050 17555950 14017289 11085603
8652A1085603j908260j115211n74705k08331L8656K30612L70910M70117N67341
8643H956732P18508R33239J188499J452352J678286J854094K086738K451214K884742
8634B4204404L261294L538372L928836M931227O912621R966356J4370738K0917996
8626I2031844L0822454M4878430O0533207O7622471N1199723P374533m2175392
8619C12287270o6972839o2217353m6456868l2449850k2536902j5839519j1275156
8612E4538783q082110n819547m299159l512851l260732l157634k941166k621537
8604B0844047k294484k008348j768186j524173j282442j079788q93627p33936
8596I259063n91675n25210n39176n55773n31167m76601m28760l88854l44383l09739
$$ plain form
8652 11085603 9177343 8062132 7487427 7279096 7317752 7548364 7919274 8389391 8956732
8643 8956732 9675240 10608479 11796978 13249330 14927616 16781710 18868448 21319662 24204404
8634 24204404 27465698 31004070 34932906 39864133 46776754 56743110 71113848 92031844
8626 92031844 122854298 167732728 228265935 295888406 347088129 354462662 312287270
8619 312287270 245314431 183097078 136640210 104190360 81653458 65813939 54538783
8612 54538783 46456673 40637126 36337967 32825116 29564384 26406750 23465584 20844047
8604 20844047 18549563 16541215 14773029 13248856 11966414 10886626 9992999 9259063
8596 9259063 8667388 8142178 7603002 7047229 6516062 6039461 5610701 5221847 4877464 4567725
8586D567725k80380k58159k40533k10440j88718j77000j54820j20944j06402q7982
8576B742347n8872l9248k0525l8857q6109j32637j57421j32226j08857r2665r4023
8565A780907p2354m1065l3688l1496m0723l4685k5164k0860l1850l0226k4925
8554A393871k9657k4926k2443k1726k6267k6254k9191m9470n7414m7101l9346
8543A020076k3177j7816k5022k4807j6531l6772k8184j117j5038k0639j2757j9523
8531G78693k2092r581J474l998l637L161J2564J3309L210j8492l1083k1453j3298
8518F88777k4137j7686j6774q102r675J613r049j7164j2791m116M476n297n011
8505E65064O079J1206K4788N2017N7122N3061L7899N698k3037m1340n6572n0774
$$ plain form
8586 4567725 4287345 4029186 3788653 3578213 3389495 3212495 3057675 2936731 2830329 2742347
8576 2742347 2683475 2644227 2623702 2584845 2498736 2366099 2208678 2076452 1967595 1874930 1780907
8565 1780907 1708553 1667488 1633800 1602304 1561581 1526896 1501732 1480872 1449022 1418796 1393871
8554 1393871 1364214 1339288 1316845 1295119 1268852 1242598 1213407 1163937 1106523 1059422 1020076
8543 1020076 996899 979083 954061 929254 912723 875951 847767 846650 831612 810973 798216 778693
8531 778693 756601 747020 748494 744496 740859 744020 756584 769893 773103 754611 723528 702075 688777
8518 688777 664640 646954 630180 622078 612403 614016 604967 587803 575012 570896 575372 570075 565064
8505 565064 571143 582349 607137 659154 716276 769337 807236 812934 789897 748557 691985 641211
8493F41211k8692j4827o401K2532L3353K3749J3103m687j8625k2116j2556p471
8481F18573j733N719q282l783q259j7922o161P713O837O986K3024K8041L7104
8468F87857K8959R235l7840r9299j31041j15285p3594l7578j9302j9412j6031
8457A76669J576M206k942j645J4266N977P996J3777J0536P293L633l56k435n076
8443B33475j202j917l781p066j751P981J6240K1012K4596N492j2350j9736q410
8430B52583M346J946k580n506k1481j9806j2253r038J6753J4337j1376q262j494
8417A98169J896L289m518J5419J1627J1454L4701L4943N1798N4816N4318K8813
8405D96725k5759o0729o2213n5518m2177k9626l362r15m8p487j4935N885J8724
$$ plain form
8493 641211 612519 597692 591291 613823 647176 670925 684028 679341 660716 638600 626044 618573
8481 618573 616840 622559 614277 610494 602235 584313 578152 585865 592702 599688 622712 650753 687857
8468 687857 716816 726051 688211 588912 457871 342586 268992 231414 212112 192700 176669
8457 176669 178245 182451 179509 177864 192130 198107 206103 219880 230416 237709 241342 240986 238551 233475
8443 233475 232273 230356 226575 219509 217758 225739 241979 262991 287587 293079 280729 260993 252583
8430 252583 256929 258875 256295 250789 229308 209502 197249 188211 204964 219301 207925 199663 198169
8417 198169 200065 203354 198836 214255 225882 237336 272037 306980 358778 413594 467912 496725
8405 496725 470966 410237 348024 292506 250329 220703 217341 216426 216378 208891 193956 199841 218565
8392B18565J9289L37m152J0800J0808P967j345j6080j6576j4488p981j746o85
8379B04713l019r059m432n58j78P70J575J60k431l059M977J162q675l104q138
8364A70704j0879o10o337n098K399J938J300o19k696r675p131k943M103R038J0573
8349A54067N976r55N297M838J0422K8228L5694M1495Q9115J52120K14866K09356
8337I50519O5104j57340k44841j77468j05762p2026n5378k8475r431q760p588
8326A48554j2377l983O138j507n872q089Q317R210M657j369N529J4369O488m852
8312A65213j1831K384L107O288p73M098N865Q349J2540J4135J7495J9906L4750
8299B81526N3818R0635J58213K67502M28393N04086K80176k05315n14374m23751
$$ plain form
8392 218565 237854 238191 234039 244839 255647 263614 262269 246189 229613 215125 207144 205398 204713
8379 204713 201694 192635 188203 187645 187467 188237 189812 189972 187541 184482 189459 190621 181946 178842 170704
8364 170704 159825 159215 152878 147780 150179 152117 153417 152798 150102 140427 133296 130353 134456 143494 154067
8349 154067 160043 159088 164385 169223 179645 207873 243567 285062 374177 526297 741163 950519
8337 950519 1015623 858283 613442 435974 330212 258186 202808 174333 164902 156142 148554
8326 148554 136177 132194 138332 136825 130953 122864 131181 140391 145048 143679 149208 163577 170065 165213
8312 165213 153382 155766 158873 165161 164388 168486 174351 182700 195240 209375 226870 246776 281526
8299 281526 335344 425979 584192 851694 1280087 1784173 2064349 1859034 1344660 920909
8289I20909k52945j56094j14938p7353m9438l4472k8869j5269j3397r945r832
8278A58357j6565m243m088j0935p487J262O856l162j934J265j110N508J1255q57
8264A34122K723N665N272N060J7120Q120M618N921J4570K6990M2685O1133R9416
8251D33415J67701K21428J70201k7830k14741k24944j34466o7319m9994l2228
8241B41223j0880o754M86L451k146J5115J2048R286J6612L3619M9939M4563O8836
8228D75398R3820J07737J25998J46105J43799J20190P2068K4805k3304q1267j16306
8217A089043j23242j33175j27848j08061j00457p9656n5097m7122m0587l8139
8207B35659k6596j3101j8531j9215j2149o300K328K161p052j7302p340k792k691
$$ plain form
8289 920909 667964 511870 396932 319579 270141 235669 206800 191531 178134 168189 158357
8278 158357 141792 137549 133461 122526 115039 116301 123157 119995 118061 119326 118216 123724 134979 134122
8264 134122 136845 142510 147782 152842 169962 178082 182700 188621 203191 230181 272866 333999 433415
8251 433415 601116 822544 992745 964915 750174 525230 390764 323445 273451 241223
8241 241223 230343 223589 224075 227526 225380 240495 252543 261829 278441 312060 361999 406562 475398
8228 475398 569218 676955 802953 949058 1092857 1213047 1285115 1309920 1286616 1205349 1089043
8217 1089043 965801 832626 704778 596717 496260 416604 361507 314385 273798 235659
8207 235659 209063 195962 177431 158216 146067 139767 142095 144256 137204 119902 112562 109770 107079
8194A07079o750j1122M50j129n70k754m760k480j6427q403o136L259Q756M705
8180F3718m013N804J1796l060p95k130M42N136j0804j2215p81J0486l7k901K735
8165F3381M178L103J0326J235j2644J11O109l967o629K633R13l969K426L190n049
8150F5347m138p410K992Q36J483k146q584m7O835k280M226K864P340N159n860
8135F6617j4604r074J593N683o811k973l684K402M531l319k367J679m208M557
8121D0022L285J512m487k944L001m99J604p124o857P804R936J529J723k69j5641
8106C2595n528J1554N623l714J539Q869j648j0902p048L601M225q398o766n164
8092A8838J0722N725p91K1n978J51J5197Q500K900q458q601J3440m222r053L539
$$ plain form
8194 107079 100329 89207 89657 88528 87958 85204 80444 77964 61537 53134 46998 50257 59013 63718
8180 63718 59705 65509 77305 74245 73450 71320 71762 76898 66094 53879 53098 63584 63547 60646 63381
8165 63381 67559 70662 80988 82223 69579 69690 75799 71832 65203 67836 68749 64780 67206 70396 65347
8150 65347 61209 53799 56791 57627 59110 56964 48380 48333 55168 52888 57114 59978 67318 72477 66617
8135 66617 52013 42939 44532 50215 43404 40431 36747 39149 43680 40361 37994 39673 35465 40022
8121 40022 43307 44819 40332 37388 40389 39890 41494 34370 27513 35317 45253 46782 48505 48236 32595
8106 32595 27067 38621 44244 40530 42069 50938 49290 38388 31340 34941 39166 30768 24002 18838
8092 18838 29560 35285 34494 34515 28537 28688 43885 52385 55285 46827 38226 51666 47444 38391 41930
8077D1930L51K347q71L07j0306m722l473m249M309N038N979j128K284K479N302
8062D5577p404l354n294J810J4408m954m664M133L788j649l515m713N25l140j203
8047C0351k27k87M191m74j3107J086P218R216O304L226n442j734m063o723q03
8032B8732l04Q849j592n687N300J1864j498k82k371O786k531j078p274p044N525
8017C7395J074j625O648k575L221M93J545M587n784r369L106M904N646l181l851
8002D2234m72o548n261J81O368j11l218K150K616n473j0348J943M054n178l192
7987A9745m396P505m575K568N419j628m545n919N958J0847J477N635k891L38p100
7972B8438J2026J0117j888P24m376o258j700O920m069Po910j534K595L119q018
$$ plain form
8077 41930 42281 44628 43757 44064 33758 29036 25563 21314 25623 30661 36640 35512 37796 40275 45577
8062 45577 38173 34819 29525 31335 45743 40789 36125 40258 44046 42397 38882 34169 34694 31554 30351
8047 30351 30124 29837 34028 33554 20447 21533 28751 37967 44271 47497 42055 40321 36258 29535 28732
8032 28732 28428 37277 35685 29998 35298 47162 45664 45382 43011 49797 47266 46188 38914 31870 37395
8017 37395 38469 36844 43492 40917 44138 44631 46176 50763 44979 35610 38716 43620 49266 46085 42234
8002 42234 41762 35214 29953 30134 36502 36391 33173 35323 37939 32466 22118 24061 28115 22937 19745
7987 19745 15349 22854 18279 20847 26266 24638 20093 14174 20132 30979 32456 38091 35200 35538 28438
7972 28438 40464 50581 48693 49417 45041 38783 37083 44003 39934 39941 33031 31497 34092 37211 29193
7957B9193J104P196n042L142J2268R298q729l642j534q029N010J3800K309k09
7943E6135l895o344j098l618q65K93j0837l144L16r96J934p252l169o501L628
7928A4587J086j49O847O323J024K2m373J345m867n478l193N204k19l03J1379P950
7912C7185j19n585j0431L586J1557m535K261k171l438J72o422q226J471M496L691
7897B3492J2743R526M432j0929p705o070o938N405L191K744O842l815p016n805
7883B0097M310L453l423R197M183J19r847j1413L710R9o968L341o227j639K721
7868A1713j684q81P4Q769J5831k498j4497M232J649J79m114o011N110M757P139
7853B9768q633K711J887L38j1426l719p595K546M27R067J954L507n966J764K671
$$ plain form
7957 29193 30297 37493 32451 35593 47861 57159 48430 44788 43254 35225 40235 54035 56344 56135
7943 56135 52240 45896 44798 41180 40315 40608 29771 26627 26943 25947 27881 20629 17460 10959 14587
7928 14587 15673 15524 22371 28694 29718 29740 25367 26712 21845 16367 13174 18378 18159 17856 29235 37185
7912 37185 37066 31481 21050 24636 36193 31658 33919 31748 28310 28482 22060 13834 15305 19801 23492
7897 23492 36235 45761 50193 39264 31559 25489 18551 23956 27147 29891 36733 32918 25902 20097
7883 20097 24407 27860 24437 33634 37817 37936 28089 16676 20386 20485 13517 16858 10631 8992 11713
7868 11713 10029 9148 9222 17991 33822 31324 16827 21059 22708 22887 18773 12762 17872 22629 29768
7853 29768 21135 23846 25733 26071 14645 10926 3331 5877 6304 15371 17325 20832 14866 16630 19301
7838A9301o707o703l794k90Q344k696L25J915J355J297j70n789j585N703l322
7823G184J393J836M865K244K927l027j0247q413n017k870R126M069L709j2659
7809d880n166M510P947j186J511L913M680O453o791M1O939m644l706r991N561
7794E191N288N216N086q507m225L381R209L965k028q686o156o261J208J535j832
7779B384J077j736j26R580J61p421j27j0475o017N471J5667m32m651o116p10R621
7763F150R854J900K169m622l384J295K475n959j1388m238o344K231K321n7J2108
7748D511n322P516M290K576J103N428O23l081J840p459p048M578O107L283m727
7733A4218q760L243M5n520O620N00R932M986q789l769n192J830K107K079j19P243
$$ plain form
7838 19301 12594 5891 2097 1807 10151 7455 7780 9695 11050 12347 12177 6388 4803 10506 7184
7823 7184 8577 10413 15278 17522 20449 17422 7175 -1238 -6255 -9125 1 4070 7779 -4880
7809 -4880 -10046 -5536 2411 1225 2736 6649 11329 17782 10991 11032 17971 13327 9621 -370 5191
7794 5191 10479 15695 20781 12274 8049 11430 20639 24604 22576 13890 7734 1473 2681 4216 2384
7779 2384 3461 1725 1599 11179 11340 3919 3792 -6683 -12700 -7229 8438 8006 3355 -2761 -3471 6150
7763 6150 16004 17904 20073 15451 12067 13362 15837 9878 -1510 -5748 -12092 -9861 -7540 -7597 4511
7748 4511 -811 6705 10995 13571 14674 20102 20725 17644 19484 12025 4977 9555 15662 18945 14218
7733 14218 5458 8701 8746 3226 9846 10346 20278 25264 16475 12706 7514 9344 11451 13530 13411 20654
7717B0654L07p080k79l156m69N783O67q847K570O513p392O28Q188k91o093m329
7701G374J006N98K00j2474r774l851L801R355K0254k582m923K635p673L85L124
7686G455R815l902o602m708N270k234J0745Q254n292l716k068K545M487k23n15
7671A9311p63L333O01J1088k105m999p713l377J194j3866K972J4820r653r532
7657A311K508R799J1473j1413j7390n043J3308J0580K476n237J34Q027l706j658
7643A5169j0620K300N200l802p981j716P70j808P906J2653l212K348N68L658M582
7628B6015p000o882m327M294m383o025m969Q97l134l352N752Q172j286M235P137
7613A5144k29j0417NO571j573R222L453j299p297m451j064J738R038J230m248
$$ plain form
7717 20654 20961 13881 13602 10446 9977 15760 16427 7580 10150 16663 9271 9899 18087 17796 11703 7374
7701 7374 8380 8978 9178 -3296 -13070 -16921 -13120 -3765 16489 13907 8984 11619 3946 4331 7455
7686 7455 17270 13368 6766 2058 7328 5094 15839 24093 18801 15085 13017 15562 20049 19826 19311
7671 19311 18548 21881 22482 33570 31465 26466 18753 15376 16570 2704 5676 20496 10843 1311
7657 1311 3819 13618 25091 13678 -3712 -8755 4553 15133 17609 12372 12506 20533 16827 15169
7643 15169 4549 6849 12049 8247 266 -1450 -680 -2488 5418 18071 14859 17207 17775 21433 26015
7628 26015 19015 12133 7806 12100 7717 1692 -3277 -2380 -5514 -8866 -3114 5058 3772 8007 15144
7613 15144 14915 4498 4503 11074 9501 18723 22176 20877 13580 9129 8065 9803 18841 20071 15823
7598A5823p438r84J473L999j707L86J2404O553j376j1639o496P42r8K410M354
7583A8406k665j0022l675L393M187k419j27m922q37j555k900l2R965Q377k962
7568A2212P73K630j303j105q56k15Q358m826o553j2507j1678Q362R384L873l61
7553F188j3776o603P60K323O977J71M358oN00P359J0230K454l897j377J424r945
7537G140m751K934On3n20n050m089J0305L31r75M561L602l147k281o198p784J088
7520d881K727O118p749K188J775q39O255J032l903J449Q4J775L475J2137p789
7505A3854q097o395M0R89K308J998Q512N825L418K109p955p722j037m720n725
7490b598J542Q825O12p658k964J0796N691k560l731N622j777m916O409m335r634
$$ plain form
7598 15823 8385 7401 8874 12873 11166 11552 23956 30509 29133 17494 10998 11740 11642 14052 18406
7583 18406 15741 5719 2044 5437 9624 7205 7078 2156 1319 -236 -3136 -3168 6797 15174 12212
7568 12212 12985 15615 14312 13207 12351 12136 20494 15668 9115 -3392 -15070 -6708 2676 6549 6188
7553 6188 -7588 -14191 -13431 -11108 -4131 -3960 398 392 892 8251 18481 20935 17038 15661 17085 7140
7537 7140 2389 5323 5329 5276 4756 -294 -4383 5922 6253 5278 9839 13441 10294 8013 1815 -5969 -4881
7520 -4881 -2154 3964 -3785 -1597 178 -661 5594 6626 2723 4172 4256 6031 9506 21643 13854
7505 13854 5757 -638 -598 391 2699 4697 13209 19034 22452 24561 16606 8884 7847 3127 -2598
7490 -2598 -1056 7769 8381 723 -2241 8555 14246 11686 7955 13577 11800 6884 13293 8958 -676
7475f76L77N626MN926n594j590M105r06K676l470N231j360j621L614o58k147p781
7458A756m974N794k346R92M554n989J0510J365o174l210k747q28J511O212M079
7443A0505l848j171K193M802M738J233k910k999R82o94j149N812P16j602r683
7428F925j0835l618K732K811J082m436K464L719m471K323J807m10n25J805R199
7413A0572L273N204J218q671m300p607M220P122k47M231N84j158K325Q061N071
7398B9898l189j3854j0644p67n147p15N555q64R5O257j234M137M645o626J536
7383I083Q158K521j2478J32j1443L376J05L440J14r218N211M770Q845l496n113
7368D007j187l59j525K646J324P864r511n908M136k73j902L917M07k542P601R94
$$ plain form
7475 -676 -299 5327 5331 11257 5663 4073 8178 7272 9948 6478 11709 10349 8728 12342 11684 9537 1756
7458 1756 -3218 2576 230 1222 5776 -213 10297 11662 5488 2278 -469 -1297 214 6426 10505
7443 10505 6657 5486 7679 12481 17219 18452 15542 12543 13525 12831 11682 17494 18210 16608 6925
7428 6925 -3910 -7528 -4796 -1985 -903 -5339 -2875 844 -3627 -1304 503 93 -432 1373 10572
7413 10572 13845 19049 20267 11596 7296 -311 3909 11031 10784 15015 15599 14441 16766 24827 29898
7398 29898 26709 12855 2211 1444 -3703 -4418 1137 273 368 6625 5391 9528 14173 7547 9083
7383 9083 17241 19762 7284 7416 -4027 -651 -546 2894 3008 -6210 -999 3771 12616 9120 4007
7368 4007 2820 2461 936 3582 4906 12770 3259 -2649 1487 1214 -688 3229 3636 1094 8695 9689
7352I689o743n155K737K331j815N95P561n154L198J430M365n105l799N122J967
7337A1224o582J435m02L115n654o217N703M916j1539q692M378L955q758r950j004
7322b4072J0008J3552J0596l442K74n41j357n341m650j487j601O659J768N959
7308F325O700r795Q42k082N586l975j879k917m316q117q527J4988J2740R339m35
7293A4477o80L33o087m539K524l52k54Q346l284j2247k920L056n006N51M982l959
7277e059k497l007L352L398M21l624K81k098M694J842j215O05K868l803j908N173
7261e77J5174M916r501j5219K164P053L087M916K651l543j6063o62J0904j794
7247C506K359Q13l949L558j746n578j0414l326J3362J7247K551o331k407p006
$$ plain form
7352 9689 2946 -2209 528 2859 1044 1639 9200 4046 7244 8674 13039 7934 4135 9257 11224
7337 11224 4642 6077 5675 8790 3136 -3081 2622 7538 -4001 -12693 -8315 -4360 -13118 -23068 -24072
7322 -24072 -14064 -512 10084 6642 6916 6375 5018 -323 -4973 -6460 -8061 -1402 366 6325
7308 6325 13025 3230 4072 1990 7576 3601 1722 -1195 -5511 -13628 -22155 -7167 5573 14912 14477
7293 14477 13797 14130 8043 3504 6028 5676 5422 13768 10484 -1763 -4683 -1627 -6633 -6082 -1100 -5059
7277 -5059 -7556 -10563 -7211 -3813 -3392 -7016 -6735 -8833 -4139 -2297 -3512 -2907 -39 -3842 -5750 -577
7261 -577 14597 19513 10012 -5207 -3043 4010 7097 12013 14664 11121 -4942 -5604 5300 3506
7247 3506 5865 6678 2729 6287 4541 -1037 -11451 -14777 -1415 15832 18383 12052 9645 2639
7233B639l182Q605J0117M546n904n954k393l345N41K442M484N725q32o361o87
7218A0441q232n115k31n717K565J2121l881q578k698R155L383M73L002n264O77
7203B101j365N545N020n443j3547j2105l666K986l481k332M805R107P911k930
7189g394j286J1912JK289P291q419m997M785L352K15P13K732K281R844j1794r366
7173B159j233o045m1M898K063N063m799k644M712O475L520j021n07n296p012j634
7157a342J506P748J600n667j779r61M706R25j182q50o652m375M844Q370P393p04
7141A3580j0755l115n00J558J0026O504l305m055J185p212q871K08L737J12J437
7126E34q308R239J3151L861o682m547j608n203K911k766R136O008m956j2235o525
$$ plain form
7233 2639 -543 8062 18179 22725 16821 10867 8474 5129 5670 8112 12596 18321 17489 11128 10441
7218 10441 2209 -2906 -3137 -8854 -6289 5832 1951 -6627 -9325 -170 3213 3686 6688 1424 2101
7203 2101 736 6281 11301 5858 -7689 -19794 -23460 -20474 -23955 -26287 -21482 -12375 -4464 -7394
7189 -7394 -8680 3232 3233 5522 12813 4394 -603 4182 7534 7749 8462 11194 13475 23319 11525 2159
7173 2159 926 -5119 -5160 -262 1801 6864 2065 -579 4133 10608 14128 13107 12600 7304 292 -1342
7157 -1342 164 7912 9512 3845 2066 1105 5811 6736 5554 4704 -1948 -6323 -1479 6891 14284 13580
7141 13580 2825 -290 -790 768 10794 17298 13993 9938 11123 3911 -4960 -4752 -1015 -903 534
7126 534 -7774 1465 14616 18477 11795 7248 5640 437 3348 582 9718 15726 10770 -1465 -7990
7111g990L187J6094q02N072j418m566j0299q647J1723Q48O78j352l125q706M392
7096d911P189p58R584M998L925K289J8n094r988q030m443r13n917M810J3488O980
7080A3227m578jl065J9Q041l834j0324n977O070j122q089O864Q658J221m710j193
7064A207n262j0898K76L929J0311R133N577L942j1701q379n004O384k734N164
7050A945P305r031q238P859P365k142j685j378Q13j223R260n324k229p296o132
7035a0131m763Q767O526n582P543K646M907p62n002J506L173O107J171m444j069
7020A0593j1768j0671R995o2k890M971R255q519j1227L988K305J357N622J373
7006D322P726j583q22J231m065r35j924r989j700R758oj0733l125R842R456L871
$$ plain form
7111 -7990 -4803 11291 10489 15561 14143 9577 -722 -9369 2354 3202 3880 2528 -597 -9303 -4911
7096 -4911 2278 1520 11104 16102 20027 22316 22334 17240 7252 -778 -5221 -6134 -12051 -7241 6247 13227
7080 13227 8649 8648 5583 5602 13643 9809 -515 -6492 -422 -1544 -9633 -2769 5889 7110 2400 1207
7064 1207 -4055 -14953 -14677 -10748 -437 8696 14273 18215 6514 -1865 -6869 -485 -3219 1945
7050 1945 9250 219 -8019 -160 7205 5063 3378 2000 2813 1590 10850 5526 3297 -3999 -10131
7035 -10131 -14894 -6127 399 -5183 2360 5006 9913 9151 4149 5655 8828 14935 16106 11662 10593
7020 10593 -1175 -11846 -1851 -1913 -4803 168 9423 904 -10323 -6335 -4030 -2673 2949 4322
7006 4322 12048 10465 9643 10874 6809 5874 3950 -6039 -7739 2019 2013 -8720 -11845 -2003 7453 11324
6990A1324M053J39J377q19j4559r449L353j302Q684N09j0321K926J3633l014m658
6975A876j314J844n284l151j0830m232M980R136p338P004J0047M974l483m354
6961a25L2p283m363K926J782Q784j000j051K579m405P23P686K047n832n093J386
6945a207j447r501R056J0393J0506p811q369k452J009K721j612l116P448P033
6931A2651L414j7341Q678J956q583M043r42J814m990n507o02J168N281P570m524
6916D086J823l03Q048o746L684j0267n403N925J66k309O641j885J163O278m258
6901F643K668N505p043o46r502k85J076l697n681L566N94J885Q843N123M538o398
6885G189j0587k083k028j3688R562R502j781O625K759o025p924M15j109q206Q718
$$ plain form
6990 11324 15377 15516 16893 16074 1515 -7934 -4581 -5883 2801 3310 -7011 -4085 9548 6534 1876
6975 1876 562 2406 -2878 -6029 -16859 -21091 -16111 -6975 -14313 -7309 2738 7712 4229 -125
6961 -125 -93 -7376 -11739 -8813 -7031 1753 753 -298 2281 -2124 -1401 6285 8332 2500 -2593 -1207
6945 -1207 -2654 -12155 -3099 7294 17800 9989 1620 -832 177 2898 1286 -1830 5618 12651
6931 12651 16065 -1276 7402 9358 775 4818 3876 5690 700 -4807 -5409 -4241 1040 8610 4086
6916 4086 5909 5606 13654 6908 10592 325 -5078 847 1013 -1296 5345 3460 4623 10901 6643
6901 6643 9311 14816 7773 7127 -2375 -2660 -1584 -5281 -10962 -7396 -6802 -4917 3926 9049 13587 7189
6885 7189 -3398 -5481 -7509 -21197 -11635 -2133 -3914 2711 5470 -555 -8479 -8064 -9173 -17379 -8661
6870h661M465N486m853o12r683Q193r875q632J2990J4519o395l70k244R805J2848
6855A6981q49L075j0982n812m897M742l13j684M562l583l539M087J4O283N862
6840A3947J070l484q643M184m121J245P133m989L421k931L970m254r363n974m046
6825a2835L172M847R88J82K808k002K02N413R991L880n258l016q465m034K650
6810a477M030m599k589q331n227J0252K822K180R193o416l715Q209K84p640o205
6795i229K590J0671j015k202J347L869O216J4716l903o231J61r58r822q526p052
6780i368M652L347P75o136r78j259j315N36K980k2M984O737n96K163n426O600
6764G674N894o237j7711Q30J8238P661n271M87j768L382M715n350q635m184J0556
$$ plain form
6870 -8661 -4196 1290 -3563 -4175 -13858 -5665 -15540 -24172 -11182 3337 -3058 -3428 -5672 4133 16981
6855 16981 16132 19207 8225 2413 -2484 2258 1945 261 4823 1240 -2299 1788 1802 8085 13947
6840 13947 15017 11533 2890 7074 2953 4198 11331 6342 9763 6832 10802 6548 -2815 -8789 -12835
6825 -12835 -9663 -4816 -3828 -3646 -838 -2840 -2638 2775 12766 16646 11388 8372 -93 -4127 -1477
6810 -1477 2553 -2046 -4635 -12966 -18193 -7941 -5119 -2939 6254 -162 -3877 4332 4616 -3024 -9229
6795 -9229 -6639 4032 3017 815 2162 6031 12247 26963 23060 16829 16990 16032 6210 -2316 -9368
6780 -9368 -4716 -1369 -594 -6730 -7708 -8967 -10282 -9746 -6766 -6788 -1804 4933 4337 6500 1074 7674
6764 7674 13568 7331 -10380 -9550 8688 16349 11078 11565 9797 13179 17894 12544 3909 -275 10281
6749A0281P961k07N471Q92j0284n796P038L433l103J0245L597Q649l739o183j0712
6734A7543j454P74M925p549j0823l830M82k800J887M545L379M934L744L281j826
6719A7212P62m46j2442K723Q696K21j1085k243K52L80J0712Q23k997P825r280
6704A1113p301m64j618l031K657M66o30M663L306j0038j797M356Q393n771j3230
6689h926O842M408J282l726l277n62L759j009o139J485l333M101P849j208m154
6674b608p969l209O183M825j834q56l529L136j713j0377j48L066k367j064K901
6659a5563Q072P11l497J3814M884j950l598l955p184o83Q449r47P719J421N28
6644H221k262k41l63P499j111O00j006J757P720M04j940j637l777n750r934j288
$$ plain form
6749 10281 18242 18035 23506 24398 14114 8318 15356 18789 15686 25931 29528 38177 34438 28255 17543
6734 17543 16089 16863 21788 14239 3416 -414 68 -2732 -845 3700 7079 12013 15757 19038 17212
6719 17212 17974 17528 5086 7809 16505 16726 5641 3398 3650 4030 14742 15565 12568 20393 11113
6704 11113 3812 3348 1730 -1301 1356 1822 1192 5855 9161 -877 -2674 1682 10075 4304 -8926
6689 -8926 -2084 2324 3606 -120 -3397 -3959 -200 -1209 -7348 -5863 -9196 -5095 2754 1546 -2608
6674 -2608 -10577 -13786 -7603 -2778 -4612 -5468 -8997 -5861 -7574 -17951 -18099 -15033 -17400 -18464 -15563
6659 -15563 -7491 -6780 -10277 3537 8421 6471 2873 -1082 -8266 -8949 -500 -1447 6272 7693 8221
6644 8221 5959 5718 5355 12854 11743 12343 11337 13094 20814 21218 19278 17641 13864 8114 -1820 -3108
6628c108J426M281J502K233M336m867q894m590Q087J0152n696M01n468M86k054
6613a773j867J79O01O343J119j627N034j193m981l748K959J1126r17o036r56j070
6597C193k768l019j34J995P551J284K71K065l017q554N223O258O488L138j248
6582A8726j939o76M88j802j3526j0246l977P114N662N366j1359m830J952l408
6568a2455P722J6842J3492q899l27r60o096k075j224k607j410j549o579N84J0026
6553D485j052j2083M263Q458j155K160M107M405N488k685R73m613q099J861K551
6538I064L550j166l770J648K974K020q141m540J351R31P86L956O481K193p171
6523A0166K500N12k272L144j741j319r922n764P05m68J30j786Q25n277L160J608
$$ plain form
6628 -3108 -1682 2599 4101 6334 10670 5803 -3091 -7681 406 10558 4862 5263 -205 281 -1773
6613 -1773 -3640 -3461 -2860 3483 4602 2975 8009 6816 1835 -1913 1046 12172 11255 5219 4263 3193
6597 3193 425 -2594 -2728 -733 6818 8102 8373 10438 7421 -1133 4090 10348 16836 19974 18726
6582 18726 16787 16111 16599 14797 1271 -8975 -12952 -5838 -176 5190 -6169 -10999 -9047 -12455
6568 -12455 -4733 12109 25601 16702 16375 15415 9319 7244 6020 3413 2003 454 -6125 -5541 4485
6553 4485 3433 -8650 -4387 4071 2916 5076 9183 13588 19076 16391 17364 12751 4652 6513 9064
6538 9064 12614 11448 7678 9326 12300 14320 6179 1639 2990 3921 4707 8663 15144 17337 10166
6523 10166 12666 13178 10906 14050 12309 10990 1068 -4696 -3991 -4459 -4329 -6115 -5290 -10567 -7407 -5799
6507e799q09j933l296J2547M498n354j453k150N506K064r72k845l78p595o717
6492a4686o190K901M40K967J0124O735m90l730k683k223L450k132r02J177J412
6477c830R628Q756k09j0527j5655k362L952J1908P019j365p884l221P11k20p561
6462a0860o253J1266J3381l08j1502N849m153p31q56k942J262N625J0785K273
6448A2836k152O763N325r716o345r160j1906k961Q591J3781M046Q87l750p921
6434a682o169M123N514L673q032k604M275K743l581m675K729p416P245R57j585
6419d485O594j656O990N804j341m637j328m8J23L395q014k483Q97R4k138L900
6403A667J1331n236j118k073m410l2N035l249l480r463k948K52R955J2794J032
$$ plain form
6507 -5799 -6608 -8541 -11837 710 5208 -146 -1599 -3749 1757 3821 2849 4 -374 -7969 -14686
6492 -14686 -20876 -17975 -17535 -14568 -4444 2291 1801 -1929 -4612 -6835 -3385 -5517 -6419 -5242 -3830
6477 -3830 5798 14554 14345 3818 -11837 -14199 -10247 1661 8680 7315 -569 -3790 -3079 -3299 -10860
6462 -10860 -17113 -5847 7534 7226 -4276 1573 -2580 -3311 -4167 -7109 -5847 -222 10563 12836
6448 12836 10684 17447 22772 13056 6711 -2449 -14355 -17316 -8725 5056 9102 9989 6239 -1682
6434 -1682 -7851 -3728 1786 5459 -2573 -5177 -902 1841 -1740 -6415 -3686 -11102 -3857 -2900 -4485
6419 -4485 2109 453 7443 13247 11906 7269 5941 5893 6016 9411 1397 -1086 -189 -95 -2233 1667
6403 1667 12998 7762 6644 4571 161 129 5164 1915 -1565 -11028 -13976 -13724 -3769 9025 10057
6388A0057J496p621O00J1878k109j0642m167J223q349q279J5384Q840n243l215
6374a47J525J249j1316r29l35L100k177M388J002R36j433M486L454R76K780j662
6358E897l376l779j402K392L198K772M477n32P116j3752j4012J410R641P784K836
6343A0670k088l228j174m71L387K532L752L350m723j0992N44k753J44k469o296
6328i815L720k026K652n751l448M954o417K47k78L315O174p87L466N259M809p404
6312a330j208K495J92P092O404m080K378K32k418j8983j506R080m729o358O449
6297f290K998n396J630k550K968M813N699O478l524l592M350O011n333r150n058
6282e946m335l439M812N891J2280M234o966p893L57P339m050j0300L090O680L30
$$ plain form
6388 10057 11553 3932 4532 16410 14301 3659 -508 715 -7634 -15913 -529 8311 3068 -147
6374 -147 1378 2627 -8689 -9618 -9953 -6853 -9030 -4642 -3640 -2704 -4137 349 3803 4779 7559 5897
6358 5897 2521 -1258 -2660 -268 2930 5702 10179 9647 16763 3011 -11001 -9591 50 7834 10670
6343 10670 8582 5354 4180 3709 7096 9628 13380 16730 12007 1015 1559 -1194 -1050 -3519 -9815
6328 -9815 -6095 -8121 -5469 -11220 -14668 -9714 -16131 -15884 -16162 -12847 -6673 -7460 -3994 1265 6074 -1330
6312 -1330 -2538 -43 149 7241 13645 9565 11943 12175 9757 -9226 -10732 -1652 -6381 -12739 -6290
6297 -6290 -3292 -8688 -7058 -9608 -6640 -1827 3872 10350 6826 3234 7584 13595 8262 -888 -5946
6282 -5946 -10281 -13720 -8908 -3017 9263 13497 6531 -1362 -1005 6334 2284 -8016 -4926 1754 2084
6267B084l001k615p836k682Q188J0586N025N47r47q844J09J427O798P085J822
6252A7746l620K213j0457q306m696P7L275K92P167j293o431j3219l421N742J8799
6237C868K143j574O599j455o779l657m598l392M961n273p816P415J1482Q179l495
6222F608m954p853M969N777n030j526L631k767K740m597R036Q10j094o184K833
6207B399R477m756l551J509k85K705K30o844l540l756J472L728L284j237L665
6192D500o722j2480j694O51O67N267J0280J654k476j568k94J147L07L242K784
6177E265j3903p013M550P833K69o99P446K528q702q876K961q63p493j076O303
6162a1470r2j197Q032J2100R79r415r146Q670O349l959o260n672R048R015N132
$$ plain form
6267 2084 -917 -3532 -11368 -14050 -5862 4724 9749 10296 9349 505 614 2041 8839 15924 17746
6252 17746 14126 16339 5882 -2424 -7120 -7043 -3768 -3476 3691 2398 -4033 -17252 -20673 -14931 3868
6237 3868 6011 4437 11036 9581 2802 -855 -5453 -8845 -3884 -9157 -16973 -9558 1924 10103 6608
6222 6608 1654 -6199 -1230 4547 -483 -2009 1622 -1145 1595 -3002 6034 6844 5750 -434 2399
6207 2399 11876 7120 3569 5078 4793 7498 7728 884 -2656 -6412 -4940 -1212 2072 835 4500
6192 4500 -2222 -14702 -16396 -15745 -15078 -9811 469 2123 -353 -1921 -2215 -1068 -761 2481 5265
6177 5265 -8638 -15651 -11101 -3268 -2999 -3698 3748 6276 -2426 -11302 -8341 -9204 -16697 -17773 -11470
6162 -11470 -11562 -12759 -4727 7373 8352 -1063 -10209 -1539 4810 851 -5409 -11081 -2033 6982 12114
6147A2114M734m882L428J535j311k975K436n489q016p897M916M424K285k9N273
6132A0546l530o708M207N242l169l658m388l057j693L012l191r734n464R909J4951
6117C275J0507k073l062o024l225N791J482o601r881j10L607N882R101j3534r10
6102e775K268K161P324P06L466m311n869L454l732K262r465r562K840O081L762
6087d390R635j474m527j3415O378J1019l56j745j222o23o531J709m681N119Q734
6072C630Q02o283j0799o99J099O045P292K485n687J827J2280q93j0991k837J325
6057a404p755J548K325N66Q305K041l387j2277J68k606k309J086R509J6550Q04
6042A3164q173l030R596J222r229l195L844l013K629o442L579K426l895O871L993
$$ plain form
6147 12114 16848 11966 15394 16929 15618 12643 15079 9590 1574 -6323 -1407 3017 5302 5273 10546
6132 10546 7016 308 4515 9757 6588 2930 -1458 -4515 -6208 -3196 -6387 -16121 -21585 -11676 3275
6117 3275 13782 11709 8647 2623 -602 5189 6671 70 -9811 -9921 -6314 -432 8669 -4865 -5775
6102 -5775 -3507 -1346 5978 6684 10150 5839 -30 3424 -308 1954 -7511 -17073 -14233 -8152 -4390
6087 -4390 5245 3771 -756 -14171 -7793 3226 2870 1125 -97 -720 -7251 -5542 -10223 -5104 3630
6072 3630 4432 -1851 -12650 -13349 -12250 -6205 1087 3572 -2115 -288 11992 11099 108 -2729 -1404
6057 -1404 -9159 -7611 -5286 -4720 3585 5626 2239 -10038 -9870 -12476 -14785 -13699 -4190 12360 13164
6042 13164 4991 1961 11557 12779 3550 355 4199 1186 3815 -2627 952 3378 -517 6354 10347
6027A0347j3777m263j192k574K280r70n305J072M568P631N123j80L209l696j634
6012F39j750l891l837J697l956J850N89K005j303m593N834L349p859K61L590j170
5996h545O959J9941K364q552r908m838l13n115L504L235l518j0350J228P090J2676
5981E858M700j159N022K98q724q402n394r30R713M186L636l842n833o212L702
5966c381M483k63J488L770L541j089P090r96p869M514m912j0397j4086N508M638
5951g961M992K437N264l446O48L289Q368r099k066J962P396R174j1006r922j456
5936a426K499k492M108k841n87M83l873N26l201K302r939l249J5163R356K165
5921H994K785j1871m897N217p81n109J56P915J378k548q12N623L700O359j418
$$ plain form
6027 10347 -3430 -7693 -8885 -11459 -9179 -10149 -15454 -14382 -9814 -2183 2940 2760 5969 2273 639
6012 639 -1111 -5002 -8839 -7142 -11098 -9248 -8659 -6654 -7957 -12550 -6716 -3367 -11226 -10965 -7375 -8545
5996 -8545 -1586 18355 20719 12167 2259 -2579 -2892 -8007 -4503 -1268 -4786 -15136 -13908 -6818 5858
5981 5858 10558 9399 14421 14719 5995 -2407 -7801 -8731 982 5168 8804 4962 -871 -7083 -3381
5966 -3381 1102 839 2327 6097 9638 8549 15639 14643 6774 11288 6376 -4021 -18107 -12599 -7961
5951 -7961 -2969 -532 4732 1286 1934 5223 13591 4492 2426 4388 11784 20958 9952 30 -1426
5936 -1426 1073 -1419 2689 -152 -739 -256 -4129 -3603 -6804 -4502 -14441 -17690 -2527 6829 8994
5921 8994 11779 -92 -4989 228 -553 -5662 -5506 2409 3787 1239 427 6050 9750 16109 14691
5906A4691k949P439p375J296q003m621K770K277j789M791J1008r733j1437m354
5892e989k905l822k152M542J835n310O792L681j2212j490O640J001Q462P965j075
5877E963K60l153L815M161j1498p43O020J244M911j170m70N661j048j3536O36
5862A053k529J881n203n775O59o20M797o175l134L426J3555K027N695Q059j643
5847A6073K185m610j0420L106k367k988P395m592r966l752k5Q657l59l74M01J038
5831e98j948j294Q980L051n148p640L974N538p47j2350J550J2088l237o424K477
5816a728P19j494L247p942j0793N323J1956J379n842m441O728l278m209P57K276
5801g342j80L93o573j0021K481R713J2659M538K66N708P833k669j2137l460O004
$$ plain form
5906 14691 11742 19181 11806 13102 5099 478 3248 5525 3736 8527 19535 9802 -1635 -5989
5892 -5989 -8894 -12716 -14868 -10326 -8491 -13801 -7009 -3328 -15540 -17030 -10390 -9389 -927 7038 5963
5877 5963 6223 3070 6885 11046 -452 -1195 4825 6069 10980 9810 9340 15001 13953 417 1053
5862 1053 -1476 405 -4798 -10573 -9914 -10534 -5737 -11912 -15046 -11620 1935 3962 9657 17716 16073
5847 16073 18258 13648 3228 6334 3967 979 8374 3782 -6184 -9936 -9961 -1304 -1663 -2037 -1636 -598
5831 -598 -2546 -3840 5140 8191 3043 -4597 -623 4915 4168 -8182 -6632 5456 2219 -4205 -1728
5816 -1728 -1009 -2503 744 -7198 -17991 -12668 -712 667 -5175 -9616 -2888 -6166 -10375 -9618 -7342
5801 -7342 -7522 -7129 -13702 -23723 -21242 -11529 1130 5668 5934 11642 19475 16806 4669 1209 7213
5786G213L511o040K936m215j380J660m228j89O293L846o361J273k616p927J3770
5771G546J533o70l062M451j1300r512J0198J5970j762l812r919n668o822j0854
5757b3683k946J2175J1850o598K238L385o695l934Q776Q35j0959Q730J2095j1006
5743e737n930k744l471Q871j203l19M771K283l261k098N512l581N654N278o03
5728C422l170p86L518n118r638o736K389J1504J3562l927o384m129P301O718N407
5713A3933l905N83K007l438K22L519j2478n750L911M24J061q531j1012M688N436
5698i330J322l139P292l85j882J104Q675j139n167P77k706n498j969O896L021
5683b128M806J3653J75j0613n989m199l9J12Q86o97P329P261j899r692J973P340
$$ plain form
5786 7213 10724 4684 7620 3405 2025 3685 -543 -732 5561 9407 3046 4319 1703 -6224 7546
5771 7546 9079 8409 5347 9798 -1502 -11014 -816 15154 13392 9580 -339 -6007 -12829 -23683
5757 -23683 -26629 -14454 -2604 -9202 -6964 -3579 -10274 -14208 -5432 -4597 -15556 -6826 5269 -5737
5743 -5737 -11667 -14411 -17882 -9011 -10214 -10533 -5762 -3479 -6740 -8838 -3326 -6907 -1253 4025 3422
5728 3422 252 -534 2984 -2134 -11772 -18508 -16119 -4615 8947 5020 -1364 -5493 1808 8526 13933
5713 13933 10028 10611 12618 9180 9402 12921 443 -5307 -1396 -972 89 -8442 -19454 -14766 -9330
5698 -9330 -8008 -11147 -3855 -4240 -6122 -5018 3657 2518 -2649 -1872 -4578 -10076 -12045 -5149 -2128
5683 -2128 2678 16331 16506 5893 -96 -4295 -4334 -4222 -3336 -4033 3296 10557 8658 -1034 939 8279
5667H279j565n255o296O38J709N48N32L354q77J1266j40n557l853k558k576j787
5651d138j842l951M06P051R307Q392k192m178l285L762l397M324M806K756l043
5636A4778m337l844K00j3798n293K347R757J5012m421n926r31k568M962J33j491
5621D580j121R895o078K855l731l406j1776M071Q112l480P742k09k064J277L558
5606A0225l36o046J045M071N361J00L72j27r377j0284l794J139M699L680m055
5591c327l180K468l916k01Q881O687k753j0619K223k619m596q946q18J1013P396
5576b307L467r46J950j2495q896K915o14R979L947n783l628l490k449j97j973
5561b0520P024L206j1266K486J0933J397K74n882j3369J632K852j073m645j007
$$ plain form
5667 8279 6714 1459 -4837 -4199 -2490 -1942 -1410 1944 1067 12333 12193 6636 2783 225 -2351 -4138
5651 -4138 -5980 -9931 -9525 -2474 6833 15225 13033 8855 5570 9332 5935 10259 15065 17821 14778
5636 14778 10441 6597 6797 -7001 -12294 -9947 -190 14822 10401 4475 3544 976 5938 6071 4580
5621 4580 3459 13354 7276 10131 6400 2994 -8782 -4711 3401 -79 7663 7454 5390 6667 10225
5606 10225 9889 3843 4888 8959 14320 14420 14792 14665 5288 -4996 -8790 -7651 -2952 728 -3327
5591 -3327 -6507 -4039 -7955 -8156 725 7412 4659 -5960 -3737 -6356 -10952 -19898 -20716 -9703 -2307
5576 -2307 1160 214 2164 -10331 -19227 -16312 -16926 -6947 -3000 -8783 -12411 -15901 -18350 -18547 -20520
5561 -20520 -13496 -10290 -21556 -19070 -8137 -6740 -6466 -12348 -25717 -24085 -21233 -22306 -26951 -27958
5547b7958o31P280L182J1868Q779J883J897o568m136n149O031l642l057k632P268
5532e585M695P360P461p464r434R111J1254O20o235j3305o278K778l576P53j968
5517i813K222K405O535M525p764n642n116L718M64n943n26J338N242O603M30M859
5501C537O18r778m103l205N648J3447n994m890p369j6011K57L318L093N987M844
5486a0601L374P348K363M248k977J902p144m180m558O77K998M225m74O23k257
5471d433p584K634M009L282O056L469q63j625r582K531J356j108o103n095K846
5456a0210J5489L097l197n325O429K106J2214J383n144m601r711K288n733j200
5442b115o002q172L417Q052O96j881l539N611k477K990J134P959P927j410j0054
$$ plain form
5547 -27958 -28589 -21309 -18127 -6259 2520 4403 6300 -268 -4404 -9553 -3522 -7164 -10221 -12853 -5585
5532 -5585 -890 6470 13931 6467 -2967 6144 17398 18018 11783 -1522 -7800 -5022 -8598 -7845 -9813
5517 -9813 -7591 -5186 1349 5874 -1890 -7532 -12648 -8930 -8466 -14409 -14935 -13597 -8355 -1752 -1322 3537
5501 3537 4155 -5623 -9726 -12931 -7283 6164 170 -4720 -12089 -28100 -27843 -24525 -21432 -15445 -10601
5486 -10601 -7227 121 2484 6732 3755 5657 -1487 -5667 -10225 -9548 -6550 -2325 -2799 -2176 -4433
5471 -4433 -12017 -9383 -5374 -2092 3964 7433 6570 4945 -4637 -2106 -750 -1858 -7961 -13056 -10210
5456 -10210 5279 8376 5179 -146 6283 8389 20603 21986 16842 12241 2530 4818 -915 -2115
5442 -2115 -8117 -16289 -12872 -4820 -4124 -6005 -9544 -3933 -6410 -3420 -2286 5673 13600 12190 2136
5427B136j0799p655P06L664M182j153l481R71m671l309N235r13n90R987J707p56
5411d739L834L425l529O38O899O83P976k933r510o065m635N493K641o291J628
5396d485M789L759n184n815J1658P016o298j4093r60M125m065M133N022j733j132
5381c263j256K156q1J26l014l817L73L920N015P023J070J622L474k259k913N24
5365H700Q922J247n786n463r69M456L353N343n874q471m016j091L183k929j249
5350f44J144J314l972O634p85m656J227P974M97l394n56L264R07J669m343J118
5334G398n44L118P238M39k819p305p272K830Jj0568k130L876L339o25J401m744
5318f367j473l70N456N064J1096Q859o409p569j5685J214N33Q115O398n634q293
$$ plain form
5427 2136 -8663 -16318 -15612 -11948 -7766 -8919 -12400 -11429 -16100 -19409 -14174 -15087 -15677 -5690 -3983 -4739
5411 -4739 -905 2520 -1009 -371 6528 7211 15187 12254 2744 -3321 -7956 -2463 178 -6113 -4485
5396 -4485 304 4063 -1121 -6936 4722 11738 5440 -8653 -9613 -5488 -9553 -5420 -398 -2131 -3263
5381 -3263 -4519 -2363 -2444 -2318 -5332 -9149 -8776 -4856 159 7182 8252 9874 13348 11089 8176 8700
5365 8700 17622 18869 13083 7620 6651 11107 14460 19803 13929 5458 1442 351 3534 605 -644
5350 -644 500 1814 -2158 4476 3691 -965 262 8236 8733 5339 4783 8047 8954 10623 6280 7398
5334 7398 6854 9972 17210 17649 14830 7525 253 3083 3084 -7484 -9614 -5738 -2399 -3024 -1623 -6367
5318 -6367 -7840 -8210 -2754 2310 13406 22265 15856 8287 -7398 -6184 -5651 2464 8862 3228 -5065
5303e065j014p44k188N691Q798j680J247k427J5276M794l124q570j0422l900Q065
5288D737J0259n275l996k534m378k714j293L175M869P42R081L834m246n468q461
5273a668l166M956m831K067O797K825m070k152J253j80p111k14N564j26k818j047
5257c921p918n231J925N17N163L667J008J3113L140m50j647J318p509K026l160
5242B041j531m094J525l954L159L146o00k810o527K419O397J845o063o230P731
5227c546P362L322R93K964L308n569o68m961j4082p79J8048O693K55M736L037
5212B1113l972o125l528k498K644N459j150N673L426j845j1223p237o173L74M709
5197c53M597p423p254o8Q106k851o951N65O326L387j032J0429m003l042Q221Q529
$$ plain form
5303 -5065 -6079 -6823 -9011 -3320 5478 3798 5045 2618 17894 22688 19564 10994 572 -3328 4737
5288 4737 14996 9721 5725 3191 -1187 -3901 -5194 -2019 2850 3592 12673 16507 12261 6793 -1668
5273 -1668 -4834 122 -4709 -2642 4155 6980 2910 758 2011 1831 -5280 -5494 70 -56 -2874 -3921
5257 -3921 -11839 -17070 -15145 -14628 -9465 -5798 -4790 8323 11463 11013 9366 10684 3175 5201 2041
5242 2041 510 -3584 -2059 -6013 -2854 292 -308 -3118 -9645 -7226 -829 1016 -5047 -11277 -3546
5227 -3546 3816 7138 8131 11095 14403 8834 8166 3205 -10877 -11656 6392 13085 13340 18076 21113
5212 21113 17141 11016 7488 4990 7634 13093 11943 17616 21042 19197 7974 737 -5436 -5062 -353
5197 -353 4244 -3179 -10433 -10501 -2395 -5246 -12197 -11632 -5306 -1919 -2951 7478 3475 433 8654 17183
5181A7183l820q158L933n703K485R061q160j101R805O069j2887o665J773L7p70
5166C082J111n070K823R544r08k194q746O580m334m138J139j828K653P146j460
5151E400L862K329l222n835j0897p314j812j2241Q941J7406j82o304n687M570
5137a0986N4L848O847J2274q42q641j3742m6J3621O454Q798m364j3411L127n671
5122b680p050K149M410Q04o162n56L041O811K341r46j204K729M234r768k642k378
5106f867n239l311j898J1913P997M501R67p976q660J404J2886J1609l777q4j289
5091A2176n312j0804m938l544q413J3078J0947l949M311K603j102k549J151l019
5077F36m565p95M419M328l684k452N34o400m642n175O209k313J769n156J733J0293
$$ plain form
5181 17183 13363 5205 9138 3435 5920 14981 6821 5720 15525 21594 8707 2042 3815 3852 3082
5166 3082 4193 -877 1946 11490 10582 8388 -358 6222 1888 -2250 -1111 -2939 -286 6860 5400
5151 5400 9262 11591 8369 2534 -8363 -15677 -17489 -29730 -20789 -3383 -3565 -9869 -15556 -10986
5137 -10986 -10932 -7084 -237 12037 11195 2554 -11188 -11234 2387 8841 17639 13275 -136 2991 -2680
5122 -2680 -9730 -7581 -3171 -2367 -8529 -9085 -6044 767 3108 2162 958 3687 7921 -1847 -4489 -6867
5106 -6867 -12106 -15417 -17315 -5402 2595 7096 8063 87 -8573 -7169 5717 17326 13549 13465 12176
5091 12176 6864 -3940 -8878 -12422 -20835 -7757 3190 -759 3552 6155 5053 2504 3655 636
5077 636 -3929 -4724 -305 4023 339 -2113 -1579 -7979 -12621 -17796 -11587 -13900 -12131 -17287 -15554 -5261
5061e261o088p363l136J937O338k86k043J848J1753L443m654k392J0108O21J626
5046F451m665m805J161J063J290o406K099N077J124j1420O369P810j550j0698
5032g100L521M89j552p993m243Q489J1009l437o370N703J0591k960j3645k750
5018a0248P461N895L85p568r943j917Q0P156P991K11j726p422j224k461K982L510
5002f838P338R688m936j5675k487J5249j826k35L946n390j2431P90N082J1871
4988D146p243J665L628j0283m87N008J156q480J65M434J090m880j539j466P530
4973e556N872l891O725m562j2376n233J882J036N506J664P97J097j483M267N385
4958A130O481N59p433o589o763o323J582J6585L607p642r140l638N946R302J77
$$ plain form
5061 -5261 -11349 -18712 -21848 -19911 -13573 -13859 -15902 -14054 -2301 1142 -3512 -5904 4204 4825 6451
5046 6451 1786 -3019 -1858 -795 495 -5911 -3812 1265 2389 -9031 -2662 5148 3598 -7100
5032 -7100 -3579 -3090 -4642 -12635 -16878 -8389 2620 -817 -7187 -1484 9107 6147 -7498 -10248
5018 -10248 -2787 3108 3493 -4075 -14018 -15935 -15855 -8699 -708 -497 -2223 -9645 -10869 -13330 -10348 -6838
5002 -6838 500 10188 5252 -10423 -12910 2339 513 278 4224 -1166 -13597 -12807 -7725 4146
4988 4146 -3097 -1432 2196 -8087 -8574 -3566 -2410 -10890 -10725 -6291 -5201 -10081 -11620 -13086 -5556
4973 -5556 316 -3575 3150 -1412 -13788 -19021 -17139 -16103 -10597 -8933 -8136 -7039 -8522 -4255 1130
4958 1130 7611 8170 737 -5852 -12615 -18938 -17356 -771 2836 -4806 -13946 -17584 -11638 -2336 -2159
4943b159j562L801K195k949n093J2088L179p136p293K771o170j58P479N488O543
4928A1024K817m496p350J137j379p697k239k117m542m293k311O200K4093N553
4914A4400r520j1786K086O049j039J823q971p019o86o01K997R669O157m499K983
4899B043P791j702p151L323l509L014j862l126K334O879R210J364q075k105j0907
4884b479l661J5069P970j1410r540L14P231O12n391l204l087j649P80R646M324
4869E525q693j5557N116N804R702O018j0100K234N222m895n875J168j162r21J0257
4854C843O87K612q54k466K941j734j866o82K381m121j349Q094n505P67l037j349
4838a638J0014O682P95r608q628k06K364O898k437k568o523l66R254N358K893
$$ plain form
4943 -2159 -3721 80 2275 -674 -5767 6321 9500 2364 -4929 -2158 -8328 -8486 -1007 4481 11024
4928 11024 13841 9345 1995 3132 1753 -5944 -8183 -10300 -14842 -19135 -21446 -15246 8847 14400
4914 14400 4880 -6906 -4820 1229 190 2013 -6958 -13977 -14663 -15264 -12267 -2598 3559 -940 2043
4899 2043 9834 8132 981 4304 795 3809 1947 -1179 1155 8034 17244 18608 10533 8428 -2479
4884 -2479 -6140 8929 16899 5489 -4051 -3737 3494 4106 -1285 -4489 -7576 -9225 -8445 1201 5525
4869 5525 -3168 -18725 -13609 -7805 1897 7915 -2185 49 5271 376 -5499 -4331 -5493 -6414 3843
4854 3843 4530 7142 6288 3822 6763 5029 3163 2481 4862 741 -608 7486 1981 2748 -289 -1638
4838 -1638 8376 15058 15853 6245 -2383 -2589 -225 6673 4236 1668 -4855 -5221 4033 9391 12284
4823A2284k830q728j497l640m829k35J1469O546n158p111P524l43k560N363l128
4808C127j2069n336J423N508P354q34j351P190P435M568j1849N236N189J819p833
4793I577n367q164o22N573J0321N214m990j459m294k452k609j521N495P266L28
4778A2296n347k68q782k607K313J1704r478j003R80L62j2996k276P877K434L920
4763h71P235K309K902L715R52m451l304m632o003L931M305J070m884m529m660
4748f915J0058m57o621l469J0633J908k912p32N32L898k773k915k087P650j290
4733D508j949k288j25J724j4684q297R308M668J900P830K759L960L481k261j88
4718A0346O581m97j2929r475M158K856o316O47j230J570M285M413k938q144k129
$$ plain form
4823 12284 9454 726 -771 -4411 -9240 -9475 1994 8540 3382 -3729 3795 3452 892 6255 3127
4808 3127 -8942 -14278 -12855 -7347 7 -827 -2178 5012 12447 17015 5166 10402 15591 17410 9577
4793 9577 4210 -3954 -4576 997 11318 16532 11542 10083 5789 3337 728 -793 4702 11968 12296
4778 12296 6949 6681 -2101 -4708 -2395 9309 -169 -1172 -192 170 -12826 -15102 -7225 -4791 -871
4763 -871 6364 8673 11575 15290 16242 11791 8487 3855 -2148 1783 6088 7158 2274 -2255 -6915
4748 -6915 3143 2686 -3935 -7404 3229 5137 2225 1493 2025 5923 3150 235 -1852 5798 4508
4733 4508 2559 271 146 1870 -12814 -21111 -11803 -7135 -5235 2595 5354 9314 12795 10534 10346
4718 10346 16927 16430 3501 -5974 -1816 1040 -5276 -4629 -5859 -4289 -4 4409 1471 -6673 -8802
4703h802L990K375k133L265R72o079J013R066O749N608n928r959l804L75J3243
4688I951P714J784j4760j1736P2K348N517N09L364l924j1594K77j311K958P58
4673h073J0980K197M558j478j3009k946M073m27j4432q129J0930J7121lj3104
4659a1742r176r013L352J3702J0147K348l16l246j1775j0440j052R371N053p22
4645a3509M882K180N363o255P783R694m669p28m193M773P022k729k605P043M637
4630A8689j472J096J573j500l086j0447p830L344k496K646L937J2730l324r090
4616D770k229J05M931l608j2139n842K618N865J0745p717m559N093l945J071M818
4601b3R781K309r93j184P74n724r428r477o012K821P83Q943N323l792J726R68
$$ plain form
4703 -8802 -4812 -2437 -4570 -1305 -333 -6412 -5399 3667 10416 16024 10096 137 -3667 -3292 9951
4688 9951 17665 19449 4689 -7047 -6975 -4627 890 1399 4763 839 -10755 -10478 -11789 -8831 -8073
4673 -8073 2907 5104 9662 8184 -4825 -7771 -3698 -4125 -18557 -26686 -15756 1365 1362 -11742
4659 -11742 -20918 -29931 -26579 -12877 -2730 -382 -698 -3944 -15719 -26159 -27211 -17840 -12787 -13509
4645 -13509 -8627 -6447 -1084 -7339 444 10138 5469 4741 548 5321 12343 9614 7009 14052 18689
4630 18689 17217 18313 19886 18386 15300 4853 -2977 367 -2129 517 4454 17184 13860 4770
4616 4770 2541 2646 7577 3969 -8170 -14012 -11394 -5529 5216 -2501 -7060 -1967 -5912 -4841 -23
4601 -23 9758 12067 11074 9890 10664 4940 -4488 -13965 -19977 -17156 -16373 -7430 -2107 -5899 -4173 -3205
4585c205jo632q839O697P523j006m375P720k550p757n251M185K344j963n302p335
4569b5747L147J6223J2234j0900J696M705L634K200k807k327L520J339M29K79
4555G625k368l409n036o2p71M879N866q815j2735n614Q456Q713o053o008k864
4540a8196P813L782J6470p634j2335J724N785j525O408P779n975o810K847L108
4526C241r034m253p93l149K647L184J069j494l427K393m991M252J2849n8o829
4511d393O098K79m204J482Q18J172o03m662L931j067J320j155L091O91m761o801
4495h764j0626n890P724O405M772p794j617P3O329K894Q307o90m621m137J1769
4480D134O82n05l052k602j616j828n906R11m528J703N216O659K57L157n972O358
$$ plain form
4585 -3205 -3206 -9838 -18677 -11980 -4457 -5463 -9838 -2118 -4668 -12425 -17676 -13491 -11147 -13110 -18412 -25747
4569 -25747 -22600 -6377 5857 -5043 -3347 1358 4992 7192 4385 2058 5578 6917 7346 7625
4555 7625 5257 1848 -3188 -3250 -4021 858 6724 -2091 -14826 -20440 -11984 -3271 -9324 -15332 -18196
4540 -18196 -10383 -6601 9869 2235 -10100 -8376 -2591 -4116 2292 10071 4096 -2714 133 3241
4526 3241 -5793 -10046 -10839 -13988 -11341 -8157 -7088 -8582 -12009 -9616 -14607 -10355 2494 2436 -4393
4511 -4393 1705 1984 -2220 -738 80 1252 649 -4013 -82 -1149 171 -984 2107 2798 -1963 -8764
4495 -8764 -19390 -25280 -17556 -11151 -6379 -14173 -15790 -15717 -9388 -6494 1813 1123 -3498 -7635 4134
4480 4134 4816 4311 1259 -1343 -2959 -4787 -10693 -9782 -14310 -12607 -7391 -732 -475 2682 -3290 3068
4464C068Q542r221q738L789O722J899k018m928Q50K240J227O572J700l40n082
4449F282J189l158o743n384j182N364K453O684j416q113p86m127o398L723N386
4434f226r385l413m95J61L943K833k847Q167J002Q595M715L87n300Q99r071P34
4418e301Q491R404k652o232M029k425J442r79N975j438K353n21j1342q732J3524
4403E596M214l316R153l218m786j012k356o757R79j741n690p77M134K640M461
4388A524j123n283j893R017Q140q995k800q74M764J773k214l418O797m341K314
4373C388q394l253R799K147L355j3196m789O135j240J092J717J3014m024l877
4359A874q667n420j476N486j198p31j461j344J443O471N566k120k599k182r19
$$ plain form
4464 3068 11610 2389 -6349 -2560 4162 6061 4043 -885 -35 2205 3432 10004 11704 11364 6282
4449 6282 7471 4313 -2430 -7814 -8996 -3632 -1179 5505 4089 -4024 -4810 -8937 -15335 -11612 -6226
4434 -6226 -15611 -19024 -19519 -19358 -15415 -12582 -15429 -7262 -6260 2335 7050 7437 2137 3036 -6035 -5301
4418 -5301 3190 12594 9942 3710 7739 5314 6756 5777 11752 10314 12667 12146 804 -7928 5596
4403 5596 9810 6494 15647 12429 7643 6631 4275 -2482 -1503 -3244 -8934 -9711 -5577 -2937 1524
4388 1524 401 -4882 -6775 2242 10382 1387 -1413 -2287 2477 4250 2036 -1382 5415 1074 3388
4373 3388 -5006 -8259 1540 3687 7042 -6154 -10943 -4808 -6048 -4956 -3239 9775 5751 1874
4359 1874 -6793 -12213 -13689 -8203 -9401 -10132 -11593 -12937 -11494 -5023 543 -1577 -4176 -6358 -7277
4344g277k183P792R686O214n839J102n111p692j0182n945J1546M064r680j438
4330a4943M21N396K666L662L430J526j1274l194M107O970J72K241K441j0605l331
4315a0315Q383J176J878j951M070O085n486r82J746j0437k641R401j615l705L10
4300d083Q258N240m132J618K973j1838n131M871R901J277l292j19m483j2094M283
4285f751N543n154M742P969m538m816n99N055j092N115j159K901L466p19k531
4270G432n549p418l290O239j459L247K708j190o272n362L500K825k954L497O61
4255c385J545P350k915o941r69j700k066J301m604P210J8165o102j0760J103Q99
4240a869L84m31M993K170p938l15K291J721m492L228Q284l93k161k995k243n431
$$ plain form
4344 -7277 -9460 -1668 8018 14232 8393 9495 4384 -3308 -13490 -19435 -7889 -3825 -13505 -14943
4330 -14943 -14522 -9126 -6460 -2798 632 2158 -9116 -12310 -8203 -1233 -1061 1180 3621 -6984 -10315
4315 -10315 -1932 -756 1122 -829 3241 9326 3840 2858 4604 -5833 -8474 927 -688 -4393 -4083
4300 -4083 4175 9415 5283 6901 9874 -1964 -7095 -2224 7677 8954 5662 5543 1060 -11034 -6751
4285 -6751 -1208 -6362 -1620 6349 1811 -3005 -3604 1451 359 5474 4315 7216 10682 9963 7432
4270 7432 1883 -5535 -8825 -2586 -4045 -798 1910 720 -5552 -10914 -7414 -4589 -7543 -4046 -3385
4255 -3385 -1840 5510 2595 -4346 -5315 -7015 -9081 -7780 -12384 -5174 12991 6889 -3871 -2768 -1869
4240 -1869 -1485 -1916 3077 5247 -2691 -3006 -715 1006 -3486 -258 8026 7633 5472 2477 234 -5197
4224e197r053n52q682j40J1165J0771J140j272K411P55P450m60q201P000J222
4209H357m283l565K146m262R648O348l420p247k86O282J0823M499K9j5924m546
4194D599k748o289M453P510l84K432J141J883m212K025L942n230j1911j0400j615
4179a4804k617M383R525m271p324J3496K469j575M321L870m261k755J229L265
4165D951J2836n878j9436p737R121J1799K752j717r265Q264R985m682o527q40
4151C626p255m156r31k695L163k41L775L347j192P911o255r653K311K070M639
4136a536q41q39n369M758L215n79K35M343J041m052M015n25n825m807L645R406
4120F285m040n341N862J3054l586m602M457O70r404N586J2659j3985j2783l051
$$ plain form
4224 -5197 -14250 -14802 -23484 -23624 -12459 -1688 -548 -1820 591 1346 8796 8336 135 7135 8357
4209 8357 4074 509 2655 -1607 8041 14389 10969 3722 3436 9718 20541 25040 25069 9145 4599
4194 4599 1851 -4438 15 7525 7141 9573 10714 12597 8385 10410 14352 9122 -2789 -13189 -14804
4179 -14804 -17421 -13038 -3513 -7784 -15108 -1612 857 -718 3603 7473 3212 457 1686 4951
4165 4951 17787 11909 -7527 -15264 -6143 5656 8408 6691 -2574 5690 15675 10993 4466 3626
4151 3626 -3629 -7785 -8716 -11411 -8248 -8489 -4714 -1367 -2559 5352 -903 -10556 -8245 -6175 -1536
4136 -1536 -2377 -3216 -8585 -3827 -612 -1191 -956 3387 4428 376 4391 3866 -1959 -6766 -3121 6285
4120 6285 2245 -3096 2766 15820 12234 7632 12089 12759 3355 8941 21600 7615 -5168 -8219
4106h219P97J0178O253j1140k981R47O187P35l562l385l526L357L828k27N385
4091D627L148N734j155j0837m2p219L93L800J5381j00o053p932r604o806M936
4076a1729O631p781K794Q378j423M325N950K81J498l895n453N669K110P421J238
4061A6014n609q274o339o774p92k775R594N06k467N149r33r815L011J2723P709
4046A0928r028j0834k840q907j065J5232J1220k709L268J967R252k658j1228m949
4032b351n197n83q78M694L479J965m188r263J923O037O79m556P863k839m022J704
4016e533j468k146M096P275O55K046J631m483j052n477r943K732O222J503r45
4001d887Nm831k727l049J476L062k707L037J0245L616j489M594p249r803N030
$$ plain form
4106 -8219 -7422 2756 9009 -2131 -5112 -4165 2022 2757 -805 -4190 -7716 -4359 -531 -758 4627
4091 4627 7775 13509 12354 1517 1475 -5744 -5351 -1551 13830 13730 7677 -255 -9859 -16665 -11729
4076 -11729 -5098 -12879 -10085 -1707 -3130 1195 7145 7426 8924 5029 -424 5245 7355 14776 16014
4061 16014 10405 2131 -4208 -10982 -11774 -14549 -4955 -4449 -6916 -1767 -2700 -12515 -9504 3219 10928
4046 10928 1900 -8934 -11774 -20681 -21746 -6514 4706 1997 5265 7232 16484 13826 2598 -2351
4032 -2351 -7548 -8131 -9009 -4315 -836 1129 -3059 -12322 -10399 -4362 -3683 -8239 -376 -3215 -7237 -5533
4016 -5533 -7001 -9147 -5051 2224 2879 4925 6556 2073 1021 -4456 -14399 -11667 -5445 -3942 -4887
4001 -4887 -4882 -9713 -12440 -15489 -14013 -10951 -13658 -10621 -376 3240 1751 6345 -904 -10707 -5677
3986e677k676K61K953p829p426O231l351N403O064m527k787J22K95J751m668n653
3970b1514j261P667R124O212M333L265Q95j04O737n606m331K019n241M34N725
3955H354p246p207M446N244J415P727J110j831n059m442K12J0323n905r986Q71
3940a974K509L476J691K693j837r452M212Q584n989q899K186O93l401K263J1524
3925H279R86m71M620k007r473N072m628j5088l468K67K375j084q548J004J4266
3910g898m368M425K086q26J665j95k910J1048J979j0733K609l2k621p908J256
3895a2423J2497kL596m375q192M169K635J348k164J2962K057m596N23m289n233
3880a487j0028K450J6055O663N644O006k173j4120n636J813j603o922m142j600
$$ plain form
3986 -5677 -8353 -8092 -5139 -12968 -20394 -14163 -17514 -12111 -6047 -10574 -13361 -13239 -12944 -11193 -15861 -21514
3970 -21514 -22775 -15108 -5984 228 4561 7826 8721 8617 15354 9748 5417 7436 2195 2629 8354
3955 8354 1108 -6099 -1653 3591 5006 12733 13843 12012 6953 2511 2723 13046 7141 -2845 -1974
3940 -1974 535 4011 5702 8395 6558 -2894 1318 9902 3913 -4986 -2800 -2107 -5508 -3245 8279
3925 8279 9265 8794 13414 11407 1934 7006 2378 -12710 -16178 -15911 -13536 -14620 -23168 -22164 -7898
3910 -7898 -12266 -7841 -5755 -6581 -4916 -5111 -8021 3027 5006 -5727 -3118 -3150 -5771 -13679 -12423
3895 -12423 74 72 3668 -707 -8899 -4730 -2095 -747 -2911 10051 12108 7512 8035 3746 -1487
3880 -1487 -11515 -9065 6990 13653 19297 25303 23130 9010 3374 5187 3584 -3338 -7480 -9080
3866i080J25M422K325N178m306o917k251l493K350N005R820J1550m784j0227j105
3851a388M613N605L014k719j480L521j4835m307L459L994j219k304J0020j190
3837D784K144k060r66J033Q78n108o143p90L222J549m127N107P493j143N862l744
3821G991n193o01m797O684p188J477M767L539N83k923J398j874P831N511J21K620
3805A9946n674q553N739O111J780n626l268O50J653r53l928j2797q94p572n515
3790a8901K178K589N01K973J553O391K675J801L122K967L688j08r983n460J513
3775b501p131L56n93m209m884l94R226J1738l870o960l405L608J1334P792j1705
3760a598p746J935O454K550J607M997K480j0566o906L377O478L030j343l894K545
$$ plain form
3866 -9080 -8955 -4533 -2208 2970 -1336 -8253 -10504 -13997 -11647 -6642 3178 14728 9944 -283 -1388
3851 -1388 3225 8830 11844 9125 7645 11166 -3669 -7976 -4517 -523 -1742 -4046 5974 4784
3837 4784 6928 4868 3902 4935 5813 705 -5438 -6228 -3006 -1457 -5584 -477 7016 5873 11735 7991
3821 7991 2798 2197 -2600 4084 -3104 -1627 3140 6679 7262 4339 5737 3863 11694 17205 17326 19946
3805 19946 14272 5719 11458 17569 19349 13723 10455 11105 12758 11805 7877 -4920 -5814 -13386 -18901
3790 -18901 -16723 -14134 -13633 -10660 -9107 -2716 -41 1760 4882 7849 11537 11429 1446 -4014 -2501
3775 -2501 -9632 -9276 -9869 -14078 -18962 -19356 -10130 1608 -2262 -9222 -12627 -9019 2315 10107 -1598
3760 -1598 -9344 -7409 -955 1595 3202 8199 10679 113 -6793 -3416 3062 6092 4749 855 3400
3745C400k227n304L479o579J35Q150N208K719p740m009J339L800k397l945o4R184
3729E149p92N653P008N236j3415r523j13J309j417n940M9L449o430p322L153P787
3713f159R464j080l214p08R215n131m996P426K466k044l118r8M862l057m711N621
3697D738K955m204m583o44L825J5988L428k255n241k576L888j0502p869M011K729
3682C688J344J023o485J638m83K016L13m998O2k48R273O465o045J685l842o160
3666g54O620L1p24j541K942n29j1490M901J6277K299q468M894m552k393Q52l743
3650D622j185J93j778k930l00j126k662j637m133Q289J730o015n019r78o777N23
3634a9183L608M070J3433L252K123K89n183j1127R383J0317p938j0367M41Q301
$$ plain form
3745 3400 1173 -4131 -652 -7231 -7096 1054 6262 8981 1241 -2768 -1429 2371 -26 -3971 -4035 5149
3729 5149 4357 10010 17018 22254 8839 -684 -797 512 -905 -6845 -6796 -3347 -9777 -17099 -13946 -6159
3713 -6159 3305 2225 -989 -1697 7518 2387 -2609 4817 7283 5239 2121 2023 6885 3828 -883 4738
3697 4738 7693 3489 -1094 -1738 2087 18075 21503 19248 14007 11431 15319 4817 -3052 959 3688
3682 3688 5032 6055 -430 1208 725 2741 3054 -1944 -1882 -2130 7143 13608 7563 9248 5406 -754
3666 -754 5866 5897 5173 3632 6574 6045 -5445 -544 15733 18032 9564 14458 9906 7513 8365 4622
3650 4622 3437 3630 1852 -1078 -1378 -2504 -5166 -6803 -10936 -2647 -917 -6932 -11951 -12929 -19706 -19183
3634 -19183 -15575 -11505 1928 5180 7303 7592 2409 -8718 665 10982 3044 -7323 -6882 1419
3620A419J605K040K403N513M382P98j0947n425q142M257j530n454M433J1391q33
3605E910J713R750p072q220L662k877j4547m016J1365M726P662M574k315m739
3591E576j0505k633R435M535p450o464N34O777p07J2043J1816j763k935l170j0235
3576D854p346p841M213L690L794l254o049O184j186r852r78L038k29r02J098L551
3560g215N273j339J808m855J0343O87m290L096O063N097m701j0424o514J0350
3546C379k42m147L546r20L944m274r241n196O669Q918o762p659R761J0725j24
3531H377k609m111j2356N79k777q891O372J3082n578r308J0164R906o21J48j702
3516F75n810k356O76P253o91J31M828m393o797L820J0875k638L892r94m941O081
$$ plain form
3620 1419 3024 5064 7467 12980 17362 18160 7213 1788 -6354 -2097 -3627 -9081 -4648 6743 5910
3605 5910 7623 17373 10301 2081 5743 2866 -11681 -15697 -4332 394 8056 12630 10315 5576
3591 5576 -4929 -7562 1873 6408 -1042 -7506 -6972 -195 -902 11141 22957 21194 18259 15089 4854
3576 4854 -2492 -10333 -6120 -2430 1364 -1890 -7939 -1755 -2941 -12793 -13771 -10733 -10962 -11864 -10766 -7215
3560 -7215 -1942 -3281 -1473 -6328 4015 4702 412 3508 9571 14668 9967 -457 -6971 3379
3546 3379 3137 -1010 2536 1616 5560 1286 -7955 -13151 -6482 2436 -4326 -11985 -2224 8501 8377
3531 8377 5768 1657 -10699 -10120 -12897 -21788 -15416 -2334 -7912 -17220 -7056 2850 2229 2377 675
3516 675 -5135 -7491 -6815 438 -253 -122 4706 313 -6484 -2664 8211 5573 9465 8471 3530 9611
3500I611k517j981R69j57l331q174n254n869pl281L50R077J3008N117l234k193
3484B134o927j1220l83K974n624N505O378l502L236P893N020r459l790P659Q505
3469H399p19o598j397O481j2706q896K259j342K917l855l758l678M379L904o698
3454b1308M820L943K092P655K78L572m224q21R88N091l286j362R98j1962N00K1492
3438H466Q111J479l881j0841N649P240j2611n589K536n510l78N332J48o698m481
3423a1028J2894P092J041p995j1866l671m332N254j065o753K608n49J0175J6709
3409H514j087n06J6p685j721M888k576j661n18r7K61R624J1414q615m863L358
3393H746o202p169N475M973j128L56k948J971M88k924j0043p019k365j111J1025
$$ plain form
3500 9611 7094 5113 6082 5925 2594 -5580 -10834 -16703 -16710 -19991 -19641 -10564 2444 7561 4327 2134
3484 2134 -4793 -16013 -16396 -13422 -19046 -13541 -7163 -10665 -7429 464 5484 -3975 -7765 -106 8399
3469 8399 7680 1082 -315 6166 -6540 -15436 -13177 -14519 -11602 -15457 -19215 -22893 -18514 -14610 -21308
3454 -21308 -16488 -12545 -10453 -2798 -2520 1052 -3172 -3993 -3005 2086 -1200 -2562 -1564 -13526 -13026 8466
3438 8466 16577 18056 14175 3334 8983 16223 3612 -1977 559 -4951 -5329 3 151 -6547 -11028
3423 -11028 1866 8958 9999 2004 -9862 -13533 -17865 -12611 -13676 -20429 -17821 -18370 -8195 8514
3409 8514 7427 6921 6937 -748 -2469 2419 -157 -1818 -2336 -2433 -2172 7452 18866 10251 5388 8746
3393 8746 2544 -4625 850 5823 4695 5051 2103 4074 4562 1638 -8405 -15424 -17789 -18900 -7875
3378g875Q440l788j0637L633J1627K17l577M24r09k335l818K5l330J591J0827
3363E15J2291P59k587j29j2414o225P540O490L080m353O888M689q713n632P72
3348B971q487j267K527J0840M201N601J5091k388j4033J759J383j738j434q297
3334F729q762J142Q31k965M396m410j577r4O022L507j1012l495J484K869m250
3319i585n287J0105j047l270Q730l018P019O850j663m578K44J699J249n988j739
3304b79l636j1607n523O917K595n70M431O377N911R380R800o157j0974n042k106
3289d83J0466k42r666J855m66k893l553M893j655j1630j1041J574R970L407k146
3274a1610O996R542j459M293m330M061n090o581J989J260J004K449N237k456M550
$$ plain form
3378 -7875 565 -3223 -13860 -10227 1400 1617 -1960 -1536 -2445 -4780 -8598 -8573 -11903 -10312 515
3363 515 12806 13565 10978 10849 -1565 -7790 -250 6240 9320 4967 11855 16544 7831 2199 2971
3348 2971 -5516 -6783 -4256 6584 10785 16386 31477 29089 15056 16815 18198 16460 15026 6729
3334 6729 -2033 -891 -60 -3025 1371 -3039 -4616 -4710 1312 4819 -6193 -9688 -8204 -5335 -9585
3319 -9585 -14872 -4767 -5814 -9084 -354 -3372 3647 10497 8834 4256 4500 6199 7448 1460 -279
3304 -279 -3915 -15522 -21045 -14128 -11533 -12103 -7672 -1295 4616 13996 23796 17639 6665 1623 -483
3289 -483 9983 9741 75 1930 1464 -1429 -4982 -89 -1744 -13374 -24415 -22841 -12871 -9464 -11610
3274 -11610 -4614 4928 3469 7762 3432 7493 2403 -4178 -2189 -929 75 2524 7761 5305 9855
3259I855N355q55k279n752L257R08m261l066L123l168J700K203L349p131M863
3244H101L851j44l855l059k199j917Q670j0628j0935r956j14P714Q240L710q82
3229c403M92l694m921l234O392l369j48L941J736K764j573l528J4416l273j046
3214A552J984K126J777l405l803L608k048L574N008j8071o417J601J2302P911
3200G699L872n835j0115k881j853j299l784J377J249L053m18J589O780q16O1k123
3184c444q072j169Q63J51R01N971K626N454l469l635o19J597r931L6M218j448
3168i970M560M330K097k471Q08m123j929j547O468O447o908l797m464L827J331
3153e341m090m191k92J2142Q62m086r6O021j3641M531J0046N657J26N098m274
$$ plain form
3259 9855 15210 14355 12076 6324 9581 10489 6228 3162 6285 3117 4817 7020 10369 3238 8101
3244 8101 11952 11808 7953 4894 2695 778 9448 -1180 -12115 -22071 -22185 -14471 -6231 -2521 -3403
3229 -3403 -2911 -6605 -11526 -14760 -8368 -11737 -11885 -7944 -6208 -3444 -5017 -8545 5871 2598 1552
3214 1552 3536 5662 7439 4034 231 3839 1791 5365 10373 -7698 -14115 -12514 -212 7699
3200 7699 11571 5736 -4379 -7260 -9113 -10412 -14196 -12819 -11570 -8517 -8935 -7346 -566 -1382 -1321 -3444
3184 -3444 -11516 -12685 -11822 -11671 -10770 -4799 -2173 3281 -188 -3823 -4442 -2845 -12776 -12740 -8522 -9970
3168 -9970 -5410 -1080 1017 -1454 -646 -4769 -6698 -8245 -1777 4670 -2238 -6035 -10499 -6672 -5341
3153 -5341 -9431 -13622 -13914 -1772 -910 -4996 -5092 929 -12712 -8181 1865 7522 7648 12746 8472
3138H472o068k820L405j887R47l126l967J0035q55K121k609k899L451J67n496
3123a129j0119l530L471J0333Q391l791n136P613k324J77k591m728j705M89n854
3108a0433J153o77k780J1338M758N527J0748o24q539j8989l128M360M785J4160
3094A1659J098J339k580j7032l309o641j560L903N164M162J38J997N600J6637
3080B0575l764j3143n574L061j042j193J087n665N131P757l520o520J087M826
3066C103N152M27m512m52p367j0442j0974P13O449J3201J2997k89n503o628j0744
3051a4869l063m878Q877N11O666J072o627l74k996O38R013m99n468j102k547O781
3035h865J0470O242m466k484o942j0404n258L912J3842M486m555n858J921L964
$$ plain form
3138 8472 2404 -416 2989 1102 2049 -1077 -5044 4991 4136 6257 3648 749 4200 4367 -1129
3123 -1129 -11248 -14778 -11307 -974 7417 3626 -1510 6103 3779 3956 1365 -3363 -5068 -4579 -10433
3108 -10433 -9280 -9957 -12737 -1399 3359 8886 19634 19010 10471 -8518 -11646 -7286 -2501 11659
3094 11659 12757 14096 11516 -5516 -8825 -15466 -17026 -13123 -7959 -3797 -3659 -1662 3938 20575
3080 20575 16811 3668 -1906 1155 113 -1080 7 -5658 -527 7230 3710 -2810 -1723 3103
3066 3103 8255 8682 4170 3718 -3649 -14091 -25065 -24352 -17903 -4702 8295 8006 2503 -4125 -14869
3051 -14869 -17932 -22810 -13933 -13422 -6756 -5684 -12311 -12685 -15681 -15043 -6030 -6529 -11997 -13099 -15646 -8865
3035 -8865 1605 7847 3381 897 -6045 -16449 -21707 -17795 -3953 533 -4022 -9880 -7959 -3995
3021c995j10j174J032R507J0067M16j764j2858j4939Q932N199M255R82J028J568
3006H146L128n009p394p565n766O886J2817N258k600j502o084l83K130J156J152
2991D370p452j2204R329J0347m697l020n000l240l037J053L810O441J0757M147
2977A1604l300j1072L60K170K160P916n041r707j97j377o133Q21R18l074O523
2962g429K866l373O022K367J095m875l682Q243l980n767P95o630K27J130J09J1718
2946a164m18l857L598Q44O746L959j344J725n514r742k715J1345J3657N142j934
2931B0328n813j2157n811M949j954n677m182K420P308R62m806l216O176L57L541
2916B425j204K856N07m191r11o321J857Q36L813P264q219j2989L399R645P249
$$ plain form
3021 -3995 -4105 -5279 -4247 5260 15327 15743 13979 1121 -13818 -4886 313 4568 5550 6578 8146
3006 8146 11274 6265 -1129 -8694 -14460 -7574 5243 10501 7901 6399 315 -68 2062 3218 4370
2991 4370 -3082 -15286 -5957 4390 -307 -3327 -8327 -11567 -14604 -13551 -9741 -3300 7457 11604
2977 11604 8304 -2768 -2408 -238 1922 9838 4797 -4910 -5107 -6484 -12617 -11796 -10878 -13952 -7429
2962 -7429 -4563 -7936 -1914 453 1548 -3327 -7009 1234 -2746 -8513 -7718 -14348 -14121 -12991 -12882 -1164
2946 -1164 -1582 -5439 -1841 -997 5749 9708 8364 10089 4575 -5167 -7882 3463 17120 22262 20328
2931 20328 14515 2358 -3453 1496 -458 -6135 -10317 -7897 -589 373 -4433 -7649 -1473 -1116 2425
2916 2425 1221 4077 4584 393 -518 -6839 -4982 -4146 -333 6931 -1288 -14277 -10878 -1233 6016
2901F016m98k474j0795m264N165N286L389q569j255K233n546n756K919J1148J1083
2886H082N266j691J370L362j2494j380r09m559r05m236P677L060q64j951m325
2871d497J0343N297J56m766r658k272J994n4L356K604q641j0702m811l93N028
2856a7016J0832J51M416J72l892J1665N623k606o140p723J5418n78n278j095m988
2841a039o283L268N795l536J740j585N770M024r167k689J704K477k130m075j1185
2826a6911n40L394l036J4744J0539N426k064J89O415n026q199n143n955j1776
2812a7943k392J6550J6263m068m504m038o544j783M148L307L704K494N447o17
2798A0024L540M746j585m739q428r582k24m358q839N821O930L521P941J734m022
$$ plain form
2901 6016 5518 3044 -7751 -12015 -6850 -1564 1825 -6744 -7999 -5766 -11312 -17068 -14149 -3001 8082
2886 8082 13348 11657 13027 16389 3895 2515 1606 -2953 -3858 -8094 -417 2643 1779 -172 -4497
2871 -4497 5846 11143 11299 6533 -3125 -5397 -3403 -3457 -101 2503 -6138 -16840 -21651 -22044 -17016
2856 -17016 -6184 -6033 -1617 -1445 -5337 6328 11951 9345 3205 -4518 10900 10322 5044 3949 -1039
2841 -1039 -7322 -4054 1741 -1795 -55 -1640 4130 8154 -1013 -3702 -1998 479 -1651 -5726 -16911
2826 -16911 -17451 -14057 -17093 -2349 8190 13616 11552 11741 18156 13130 4931 -212 -6167 -17943
2812 -17943 -20335 -3785 12478 8410 3906 -132 -6676 -8459 -4311 -1004 2700 5194 10641 10024
2798 10024 13564 18310 16725 11986 3558 -6024 -6248 -10606 -19445 -13624 -6694 -3173 4768 6502 2480
2783B480l995K135k703J545k728q878O344K526K277J1906l443l401k481K578k713
2768A449L553M973m568L336O713K383j2079o445N914J202l138M301n996j6873
2754a5275L099J3352n972K419M100n051j072O141j538L888l73q23r161q113N261
2739i118J0873k628n147J103O728P807N059M335l132l851r017j0133J0047P557
2725A0483o505L182p01K900j24p806p138P033J123m574j931j384N130N627J14
2710E429l3K65R97P109k912m594o711K637o498r289J0498K550L128l90l200j1265
2694a2279Q993R300J313l077k546q283J393M214N802L202J882m067r317k794L567
2679b697P293m637K707j874k562K610J9L119q034l793l826J758J1685L862j3815
$$ plain form
2783 2480 -1515 620 -2083 -538 -3266 -12144 -5800 -3274 -997 10909 7466 4065 1584 4162 1449
2768 1449 5002 9975 5407 8743 15456 17839 5760 -685 5229 6431 3293 7594 1598 -15275
2754 -15275 -12176 1176 -4796 -2377 1723 -3328 -4400 1741 203 4091 3718 2895 -6266 -14379 -9118
2739 -9118 1755 -873 -6020 -4917 1811 9618 14677 19012 15880 12029 3012 -7121 2926 10483
2725 10483 3978 7160 6459 9359 9235 1429 -5709 1324 2447 -2127 -4058 -5442 -312 5315 5429
2710 5429 5396 5661 6658 13767 10855 6261 -450 2187 -4311 -13600 -3102 -552 2576 2186 -1014 -12279
2694 -12279 -3286 6014 7327 4250 1704 -6579 -5186 -972 4830 8032 9914 5847 -3470 -6264 -2697
2679 -2697 4596 -41 2666 792 -1770 840 859 3978 -4056 -7849 -11675 -9917 1768 5630 -8185
2664h185l128M286J0366R86l503k998J569p218n777k226j846L761O544J0750R797
2649A3178p753r885m564K706K544p816q995K767O855M074k189P16o01L630q22
2634f155N905Q656m269n513k888j306J0001J2706p476j5815q699J3805L505K791
2620E248L936n775m639o809M581M218j1208j266M026M158P957J1610k638m022
2606I377L106k605j0282M791K1L18r57p879o261J186k92P037Q295l294o162L104
2590d97O440r619o124O234N182K555o885j128P085J0195k313p645o371o791J889
2575g793P814p928M080L995j0919M079J831J847K988K250p574k633J426M130K589
2560A82P041K374k441j0973L746N173O512k879m648j6821O58Q102N766j04J017
$$ plain form
2664 -8185 -11313 -7027 3339 4325 822 -2176 -607 -7825 -13602 -15828 -17674 -13913 -7369 3381 13178
2649 13178 5425 -4460 -9024 -6318 -3774 -11590 -20585 -17818 -10963 -6889 -9078 -8362 -8963 -5333 -6155
2634 -6155 -250 8406 4137 -1376 -4264 -5570 4431 17137 9661 -6154 -14853 -1048 2457 5248
2620 5248 9184 3409 -1230 -8039 -3458 760 -10448 -11714 -7688 -3530 4427 16037 13399 9377
2606 9377 12483 9878 -404 4387 4408 4726 3769 -4110 -10371 -9185 -9477 -2440 5855 2561 -3601 -497
2590 -497 5943 -3676 -9800 -3566 1616 4171 -2714 -3842 3243 13438 11125 3480 -2891 -9682 -7793
2575 -7793 21 -7907 -3827 168 -10751 -6672 -4841 -2994 -6 2244 -5330 -7963 -6537 -2407 182
2560 182 7223 9597 7156 -3817 -71 5102 11614 8735 4087 -12734 -12076 -3974 1792 1688 2705
2545B705M153Q95l627m317J963Q05N54o66l745n662M813K222n694K934m691Q714
2529A356L358Q79l804k426n080J577L69L073J3217J4298k909o876n957K127K593
2514A5795K81j2868r070l184J643J0052n040l036J0719o29p090o555L232M45k976
2499h281m235P88J6011k227j1593L388L953J36p597J2709k68M703q403q915r28
2484a0759L834N79O772m740o571K334k04P4P948r32j1006J545J1183k503m726
2469g172m162M312K34l777J382R786O538p352M642k702r080k568M120R789O771
2454A0761j217o346k486J418k965K036k919pk443q515M300L221k096N16R646k018
2438H86M203n782q683R29o1P890l775j1233k447O10O004O415k822n84o852J42
$$ plain form
2545 2705 6858 7753 4126 -191 1772 2577 3131 2465 -1280 -6942 -2129 93 -5601 -2667 -7358 1356
2529 1356 4714 5593 1789 -637 -5717 -4140 -3771 -698 12519 26817 23908 17032 11075 13202 15795
2514 15795 16076 3208 -5862 -9046 -7403 2649 -2391 -5427 5292 4663 -2427 -8982 -5750 -5305 -8281
2499 -8281 -12516 -11728 4283 2056 -9537 -6149 -2196 -2060 -9657 3052 2784 7487 -916 -9831 -10759
2484 -10759 -6925 -6346 426 -4314 -10885 -8551 -8755 -8681 -733 -1665 -12671 -11126 57 -2446 -7172
2469 -7172 -11334 -7022 -6788 -10565 -9183 603 7141 -211 4431 1729 -7351 -9919 -5799 3990 10761
2454 10761 9544 3198 712 2130 -835 1201 -1718 -1725 -4168 -12683 -8383 -5162 -7258 -6742 2904 886
2438 886 5089 -693 -9376 -8447 -8508 -618 -4393 -15626 -18073 -17463 -11459 -5044 -7866 -8450 -15302 -15160
2422a5160R721o4m267n528J079O316k173J408J648N1J968r70K434Q09l377o867
2406a2972N024M217k561L51M404R764J268j2694r094J2566J2400m454j0316m918
2392g015p294q03J2481M571l005N42N125j633O50o137N265K585k514J558L729
2377H105Q19q416k478J836N565L138r82j0932j1783P765O43M131m892R96O538
2362E3r15K674n92r858j49R840O960j2355j0519N755O453J0895J65o619K80K356
2346D424p50K905k457p212o825l725L721l009q549l056L829R437K980J3548O667
2331A1928o792l554M684M208k361r00L185J845m161L41k688q469j0447P860N825
2316E04j270M756p83K375Q892m103L190N637j7675j0343j034j601n417o295N674
$$ plain form
2422 -15160 -5439 -5503 -9770 -15298 -14219 -7903 -10076 -8668 -7020 -6969 -5001 -5971 -3537 -2728 -6105 -12972
2406 -12972 -7948 -3731 -6292 -5941 -1537 8227 9495 -3199 -12293 273 12673 8219 -2097 -7015
2392 -7015 -14309 -15112 -2631 1940 -1065 -523 4602 2969 3619 -2518 2747 5332 2818 4376 8105
2377 8105 8924 508 -1970 -134 5431 8569 7587 -3345 -15128 -7363 -6720 -2589 -7481 -6485 53
2362 53 -862 1812 1220 -8638 -8787 1053 8013 -4342 -14861 -9106 -2653 8242 8407 1788 2068 4424
2346 4424 3674 6579 4122 -3090 -9915 -13640 -9919 -12928 -21477 -24533 -20704 -11267 -8287 5261 11928
2331 11928 5136 1582 6266 10474 8113 7213 10398 12243 8082 8423 5735 -2734 -13181 -5321 504
2316 504 -766 3990 3207 5582 14474 10371 13561 19198 1523 -8820 -9854 -11455 -16872 -23167 -17493
2301a7493J845J1226L742j05O84K627M77j908J612n681j277Q242M682O257l006
2286A1924n232m601L358j778L318O031p124k072M796o089l165n529J824N872l232
2271a699l630j1980r38N069K983K808R23N011M964l299n758l26P363L191R51r83
2255D650k368n601L723M460m529p443o51Q164L740l570o975L462K35Q961m657
2240A601j1455o651J521k006j743J163P723Q788K887J129q386M372R712Q66m009
2225E512m566k269K168J937K493Q07o327J452P130J639p84L622n012o21L592q145
2209B628r193n753r301O750Q968R043J31n285M597M476k510m012K443m685k008
2194c711m510n056R056J006O465l683r53R47K16j675O01J4583n789j3772j036
$$ plain form
2301 -17493 -15648 -4422 -680 -785 -101 2526 3003 1095 2707 -2974 -4251 3991 8673 14930 11924
2286 11924 6692 2091 5449 3671 6989 13020 5896 3824 8620 2531 -634 -6163 -4339 1533 -1699
2271 -1699 -5329 -17309 -18247 -13178 -10195 -7387 -6464 -1453 3511 212 -5546 -5872 1491 4682 5633 4650
2255 4650 2282 -3319 404 4864 335 -7108 -7759 405 4145 575 -6400 -2938 -2703 6258 1601
2240 1601 -9854 -16505 -14984 -16990 -18733 -17570 -9847 -1059 1828 2957 -5429 -1057 8655 9521 5512
2225 5512 946 -1323 845 2782 5275 6082 -245 1207 8337 9976 9192 12814 7802 7181 10773 2628
2209 2628 -6565 -12318 -21619 -14869 -5901 3142 3273 -2012 2585 7061 4551 539 2982 -1703 -3711
2194 -3711 -8221 -13277 -4221 -3215 3250 -433 -1386 -439 -223 -1898 -1297 13286 7497 -6275 -7311
2179g311P228Q15m04P577o690L319J404J177o308l257J864L431P440q121p359
2164e195p155r314O670J1619n178J941O061r75m334J553N840l368M955J571r39
2149C752J759m79k931M657K083L727r492j8352p481j854R182O660O67M961L750
2134F09J668k825q6l588o276K402N452r08K990m00r321L756M768M612n081N064
2118B836M118j208p8J0547J015k781j1201r474K529L194M28K727K622o984j2753
2103a4463P62R236R799L24L011r64K514K988l505l202K732K485J020o392m622
2088A723m604J306j716L431k44j584n402J1082L938K535l629O603L094q47l937
2073A1749m644j832O574r0o063J746J390M105j619M83k38J206K160k004n260o235
$$ plain form
2179 -7311 -83 732 328 7905 1215 4534 5938 7115 807 -2450 -586 2845 10285 2164 -5195
2164 -5195 -12350 -21664 -14994 -3375 -8553 -6612 -551 -1526 -5860 -4307 1533 -1835 3120 4691 3752
2149 3752 5511 5032 2101 6758 8841 12568 3076 -15276 -22757 -24611 -15429 -8769 -8102 -3141 609
2134 609 2277 -548 -634 -4222 -10498 -8096 -2644 -3552 -562 -962 -10283 -6527 -1759 2853 -2228 2836
2118 2836 6954 5746 5668 16215 17230 14449 3248 -6226 -3697 -503 -75 2652 5274 -1710 -14463
2103 -14463 -13701 -4465 5334 5658 8669 7705 10219 13207 9702 6500 9232 11717 12737 6345 1723
2088 1723 -2881 -1575 -3291 140 -104 -1688 -7090 3992 7930 10465 6836 13439 16533 15686 11749
2073 11749 7105 5273 11847 11757 5694 7440 8830 12935 11316 11799 11561 12767 14927 12923 7663 1428
2057A428k455m436n09P797M604K435K548n042l896K375P631n385m455K147r842
2042e055l697J4358J534l078o305j5972j382J2958O489M389Q245j61M66o266J0242
2027A6765L688p813j465K282j1959q453j173P218K259L361j448j2969M3O884P374
2012D594P72n30l853Q74O959M335l787q536p994l738q82N322M803L198j2425o190
1996a7078N020J0909r61K903k219Q200j99j6365K89N249M604P85J60L728R18N864
1980A1807m075N08K874L344k871o796l770p434K191M666l766o078N479O635L665
1965F379j789m755o249m811N383l174m288j521J0033O243P12J3194k728k0490
1951g861L14L075k961P821N898n605j082r42j970K761l895j902m2Q309n367m275
$$ plain form
2057 1428 -1027 -5463 -5972 1825 6429 8864 11412 6370 2474 4849 12480 7095 2640 4787 -5055
2042 -5055 -8752 5606 7140 4062 -2243 -18215 -19597 -6639 -150 4239 12484 12323 12789 6523 16765
2027 16765 20453 12640 11175 13457 1498 -6955 -8128 -910 1349 4710 3262 -9707 -9664 -2780 4594
2012 4594 5366 4836 983 1857 8816 13151 9364 828 -7166 -10904 -11786 -6464 -1661 1537 -10888 -17078
1996 -17078 -12058 -1149 -2110 793 -1426 6774 6575 -9790 -9501 -4252 352 1137 1297 5025 5943 11807
1980 11807 7732 8240 11114 14458 11587 4791 1021 -6413 -4222 444 -3322 -9400 -3921 2714 6379
1965 6379 4590 -165 -6414 -11225 -5842 -9016 -13304 -14825 -4792 1451 2163 15357 12629 -7861
1951 -7861 -7547 -4472 -7433 388 6286 681 -401 -1343 -3313 -552 -4447 -6349 -6391 1918 -3449 -7724
1935g724O206R513n255j0991N78J4057n361l343O205m335m958J0144P89j0308
1921d783n259o057K135J0804K931J793r554l523M528l811J381J1054M574L870
1907A0083J651Q841k891r452j4576q098R523m273L03J343O14O213j514j976R836
1892E627M735n611K933j971q354l368l175J614Q380L774k450J474k648j868J669
1877G61R24J0121O072L97J712l154q286l95N140j0571k606J0394n072j0124p525
1862a2212j034R372J250M36j164k583m71k401M290k299K982m084l601L114k825
1847a1230P110P384K227k90l984m182m655N553J1193j637M035n711k796j2492
1833i475r009J0702J3139N745M29q104p525j693L535J4519K154N45p405j47k918
$$ plain form
1935 -7724 -1518 7995 2740 -8251 -7673 6384 1023 -2320 3885 -450 -5408 4736 5525 -4783
1921 -4783 -10042 -16099 -13964 -3160 -229 1564 -7990 -11513 -6985 -10796 -9415 1639 6213 10083
1907 10083 11734 20575 17684 8232 -6344 -14442 -4919 -9192 -8889 -7546 -6932 -719 -2233 -4209 5627
1892 5627 10362 4751 7684 5713 -2641 -6009 -9184 -7570 810 4584 2134 3608 960 -908 761
1877 761 1685 11806 17878 18275 19987 16833 8547 8152 13292 2721 115 10509 5437 -4687 -12212
1862 -12212 -13246 -3874 -2624 -2188 -3352 -5935 -6406 -8807 -4517 -6816 -3834 -7918 -11519 -8405 -11230
1847 -11230 -4120 3264 5491 5201 1217 -2965 -7620 -2067 9126 7489 11524 5813 3017 -9475
1833 -9475 -18484 -7782 5357 11102 11531 3427 -4098 -5791 -2256 12263 14417 14962 7557 7410 4492
1818D492r619n705K562p544k105M68P589P204o531L546J388M89k220K699l23Q870
1802E260Q930n782j412k385l862L740J289o478k652l446M554N43m795K455O460
$$ plain form
1818 4492 -5127 -10832 -8270 -15814 -17919 -17451 -9862 -2658 -9189 -5643 -4255 -3766 -5986 -3287 -3610 5260
1802 5260 14190 8408 6996 4611 749 4489 5778 -700 -3352 -6798 -2244 -1701 -6496 -4041 2419
$$ [...]
##END NTUPLES=NMR SPECTRUM
##END=
