##TITLE=Analysis number 327826
Compound Code tl 00898
Book Reference 174527
Project Code adrs flro3
Chemist Name jom
##JCAMPDX= 6.0         $$ Bruker NMR JCAMP-DX V2.0
##DATA TYPE= NMR SPECTRUM
##DATA CLASS= NTUPLES
##ORIGIN= Bruker BioSpin GmbH
##OWNER= nmr
$$ XWIN-NMR		Version 3.5
$$ Wed Apr 11 16:21:36 2007 GMT Daylight Time (UT+1h)  MAYBRIDGE\nmr@NMR_250MHZ
##.OBSERVE FREQUENCY= 250.131544655141
##.OBSERVE NUCLEUS= ^1H
##.ACQUISITION MODE= SIMULTANEOUS (DQD)
##.ACQUISITION SCHEME= undefined
##.AVERAGES= 16
##.DIGITISER RES= 18
##SPECTROMETER/DATA SYSTEM= dpx250
##.PULSE SEQUENCE= zg30
##.SOLVENT NAME= CDCl3
##.SHIFT REFERENCE= (INTERNAL, CDCl3, 0, 16.4503)
##AUDIT TRAIL= $$ (NUMBER, WHEN, WHO, WHERE, WHAT)
$$ ##TITLE= Audit trail, XWIN-NMR		Version 3.5
$$ ##JCAMPDX= 5.01
$$ ##ORIGIN= Bruker BioSpin GmbH
$$ ##OWNER= nmr
$$ C:\u/data/dgb/nmr/ADRS/1030/pdata/1/auditp.txt
$$ ##AUDIT TRAIL=  $$ (NUMBER, WHEN, WHO, WHERE, WHAT)
(   1,<2007-04-11 16:21:14.56 +100>,<MAYBRIDGE\nmr>,<NMR_250MHZ>,
      <created by zg, POWCHK disabled, PULCHK disabled
       configuration hash MD5:
       49 4B E0 1D 92 C2 6B 37 9F E6 65 BC 52 41 86 1D
       data hash MD5: 64K
       CB FF E8 72 C5 FC 81 B8 C6 F4 23 5D 4B 47 9D D6>)
(   2,<2007-04-11 16:21:27.08 +100>,<MAYBRIDGE\nmr>,<NMR_250MHZ>,
      <Start of raw data processing
       ef LB = 0.3 FT_mod = 6 PKNL = 1 SI = 32K 
       data hash MD5: 32K
       DC 6B E4 25 71 19 A2 AA 7E A0 08 60 80 21 EE 7C>)
(   3,<2007-04-11 16:21:28.78 +100>,<MAYBRIDGE\nmr>,<NMR_250MHZ>,
      <apk 
       data hash MD5: 32K
       D4 C5 E3 65 F0 2D 23 EA 4D 3E 6A D8 98 36 D4 CA>)
(   4,<2007-04-11 16:21:29.45 +100>,<MAYBRIDGE\nmr>,<NMR_250MHZ>,
      <abs ABSG = 5 
       data hash MD5: 32K
       49 C0 BE 3C C1 4E 29 B4 10 4C 72 2A 61 B7 FE 65>)
$$ ##END=
$$ 
$$ hash MD5
$$ 5F C7 D5 96 E0 E7 2F 79 28 19 14 D5 4E 18 5C 7A
##$RELAX= 
##$RELAX= 
##$RELAX= 
##$RELAX= 
##$RELAX= 
##$RELAX= 
##$RELAX= 
$$ Bruker specific parameters
$$ --------------------------
##$DU= <C:\u>
##$EXPNO= 1030
##$NAME= <ADRS>
##$PROCNO= 1
##$TYPE= <nmr>
##$USER= <dgb>
##$AMP= (0..31)
100 100 100 100 100 100 100 100 100 100 100 100 100 100 100 100 100 100 
100 100 100 100 100 100 100 100 100 100 100 100 100 100 
##$AQSEQ= 0
##$AQ_mod= 3
##$AUNM= <au_zg>
##$AUTOPOS= <43 >
##$BF1= 250.13
##$BF2= 250.13
##$BF3= 250.13
##$BF4= 250.13
##$BF5= 500.13
##$BF6= 500.13
##$BF7= 500.13
##$BF8= 500.13
##$BYTORDA= 1
##$CFDGTYP= 0
##$CFRGTYP= 5
##$CHEMSTR= <none>
##$CNST= (0..31)
1 1 145 1 1 1 1 1 1 1 1 1 1 1 1 1 1 1 1 1 1 1 1 1 1 1 1 1 1 1 1 1 
##$CPDPRG= <>
##$CPDPRG1= <>
##$CPDPRG2= <>
##$CPDPRG3= <>
##$CPDPRG4= <mlev>
##$CPDPRG5= <mlev>
##$CPDPRG6= <mlev>
##$CPDPRG7= <mlev>
##$CPDPRG8= <mlev>
##$CPDPRGB= <>
##$CPDPRGT= <>
##$D= (0..31)
0 1 0 0 0 0 0 0 0 0.06 0 0 0 0 0 0 0.0002 0 0 0 0 0 0 0 0 0 0 0 0 0 0 
0 
##$DATE= 1176304873
##$DBL= (0..7)
120 120 120 120 120 120 120 120 
##$DBP= (0..7)
150 150 150 150 150 150 150 150 
##$DBP07= 0
##$DBPNAM0= <>
##$DBPNAM1= <>
$$ [...]
##$SUBNAM7= <"">
##$SUBNAM8= <"">
##$SUBNAM9= <"">
##$SW= 20.6930455092707
##$SWIBOX= (0..15)
0 0 3 0 0 0 0 0 0 0 0 0 0 0 0 0 
##$SW_h= 5175.983436853
##$TD= 65536
##$TD0= 1
##$TE= 683.16
##$TE2= 300
##$TE3= 300
##$TEG= 300
##$TL= (0..7)
0 120 120 120 120 120 120 120 
##$TP= (0..7)
150 150 150 150 150 150 150 150 
##$TP07= 0
##$TPNAME0= <>
##$TPNAME1= <>
##$TPNAME2= <>
##$TPNAME3= <>
##$TPNAME4= <>
##$TPNAME5= <>
##$TPNAME6= <>
##$TPNAME7= <>
##$TPOAL= (0..7)
0.5 0.5 0.5 0.5 0.5 0.5 0.5 0.5 
##$TPOFFS= (0..7)
0 0 0 0 0 0 0 0 
##$TUNHIN= 0
##$TUNHOUT= 0
##$TUNXOUT= 0
##$USERA1= <user>
##$USERA2= <user>
##$USERA3= <user>
##$USERA4= <user>
##$USERA5= <user>
##$V9= 5
##$VALIST= <valist>
##$VCLIST= <CCCCCCCCCCCCCCC>
##$VD= 0
##$VDLIST= <DDDDDDDDDDDDDDD>
##$VPLIST= <PPPPPPPPPPPPPPP>
##$VTLIST= <TTTTTTTTTTTTTTT>
##$WBST= 1024
##$WBSW= 4
##$XGAIN= (0..3)
0 0 0 0 
##$XL= 0
##$YL= 0
##$YMAX_a= 431408
##$YMIN_a= -357497
##$ZGOPTNS= <>
##$ZL1= 120
##$ZL2= 120
##$ZL3= 120
##$ZL4= 120
##$ABSF1= 16.45035
##$ABSF2= -4.242823
##$ABSG= 5
##$ABSL= 3
##$ALPHA= 0
##$AQORDER= 0
##$ASSFAC= 0
##$ASSFACI= 0
##$ASSFACX= 0
##$ASSWID= 0
##$AUNMP= <proc_1d>
##$AZFE= 0.1
##$AZFW= 0.1
##$BCFW= 0
##$BC_mod= 0
##$BYTORDP= 0
##$COROFFS= 0
##$CY= 12.5
##$DATMOD= 1
##$DC= 0
##$DFILT= <>
##$DTYPP= 0
##$F1P= 14.0000005364418
##$F2P= -0.99999901652339
##$FCOR= 0.5
##$FTSIZE= 32768
##$FT_mod= 6
##$GAMMA= 0
##$GB= 0
##$INTBC= 1
##$INTSCL= 1
##$ISEN= 128
##$LB= 0.3
##$LEV0= 0
##$LPBIN= 0
##$MAXI= 10000
##$MC2= 0
##$MEAN= 0
##$ME_mod= 0
##$MI= 0
##$NCOEF= 0
##$NC_proc= -4
##$NLEV= 6
##$NOISF1= 0
##$NOISF2= 0
##$NSP= 0
##$NTH_PI= 0
##$NZP= 0
##$OFFSET= 16.45035
##$PC= 1
##$PHC0= 230.0218
##$PHC1= 8.045358
##$PH_mod= 1
##$PKNL= yes
##$PPARMOD= 0
##$PSCAL= 4
##$PSIGN= 0
##$REVERSE= no
##$SF= 250.130017919998
##$SI= 32768
##$SIGF1= 0
##$SIGF2= 0
##$SINO= 400
##$SIOLD= 32768
##$SREGLST= <1H.CDCl3>
##$SSB= 0
##$STSI= 32768
##$STSR= 0
##$SW_p= 5175.98343685301
##$SYMM= 0
##$S_DEV= 0
##$TDeff= 65536
##$TDoff= 0
##$TI= <Analysis number 999999
Compound Code 99
Book Reference 9
Project Code 9>
##$TILT= no
##$TM1= 0
##$TM2= 0
##$TOPLEV= 0
##$USERP1= <user>
##$USERP2= <user>
##$USERP3= <user>
##$USERP4= <user>
##$USERP5= <user>
##$WDW= 1
##$XDIM= 32768
##$YMAX_p= 301072947
##$YMIN_p= -224524
$$ End of Bruker specific parameters
$$ ---------------------------------
##NTUPLES= NMR SPECTRUM
##VAR_NAME=  FREQUENCY,     SPECTRUM/REAL,   SPECTRUM/IMAG
##SYMBOL=    X,             R,               I
##VAR_TYPE=  INDEPENDENT,   DEPENDENT,       DEPENDENT
##VAR_FORM=  AFFN,          ASDF,            ASDF
##VAR_DIM=   32768,         32768,           32768
##UNITS=     HZ,            ARBITRARY UNITS, ARBITRARY UNITS
##FACTOR=    0.157963299565203, 1,           1
##FIRST=     4114.72629220006, 0,            0
##LAST=      -1061.25714465295, 0,           0
##MIN=       -1061.25714465295, -224524,     0
##MAX=       4114.72629220006, 301072947,    0
$$ Real data points
##PAGE= N=1
##DATA TABLE= (X++(R..R)), XYDATA
$$ [...]
15885c37l814L575l018m5696J1280J3141J3835q109J2468J4829j6997k9631L2822
15872e652J7052L4843p039m6603n464K0199k2678n0477l782j0947o108j3263N4880
15859d5039M1044K1350m1720j8564j0780J7974l9451M5013K0457J2177J1345n5966
15847d2160l4565Q261Q525L9454M2348j821J9515l5467M2719l3337m3583P674
15835b2437O5077O1607J7417k3037p1379m3671J0713N5997p933o0285n4551J5225
15823e7257R665J6786N7086r07K1987q1592K108P6188P0327Q26q7300p2249l3138
15810g7470j4528Q66o656j2671J4652J04590M2309k8814K7097K3889L4040J4685
15798A21989m9317p6764q3282L1126M9134O197L98L4662J118m681M3410Q394l9612
$$ y = [-337, -4151, -576, -3594, -49290, -38010, -24869, -11034, -19143, -6675, 8154, -8843, -38474, -5652, 11400, 46243, 39204, -7399, -12863, 7336, -15342, -65819, -69601, -80548, -86656, -99919, -45039, -3995, 17355, -24365, -42929, -53709, -35735, -75186, -30173, -9716, 2461, 13806, -42160, -76725, -68464, -59939, -20485, 21863, 20042, 39557, 4090, 46809, 13472, -30111, -22437, 42640, 104247, 121664, 98627, 27248, -16423, -5710, 50287, 42354, -17931, -72482, -57257, -47592, -30806, 26280, 25373, 47360, -34232, -32124, 44064, 114391, 115217, 27917, -44332, -77470, -91998, -91132, -97788, -110459, -95807, 8783, 51092, 22278, 49375, 73264, 107304, 121989, 72672, -4092, -87374, -56248, -7114, -917, -519, 34143, 35261, 30580, 73990, 82384, 42772]
15785D2772n196q409J2554m6936j4938K7986J8847k9259m9737k2396J1448K1580
15773d1684J2057K7465m258M8687m3832m6389N1272m7415L2617M0439k4859j8992
15761a4892N2182J2204q987l8601O7626k830J2381p091l8859j7876Q4753m9207
15749E0803p8892k0004k7425M9585K5015k682L0983m279J1663j5970m2744J1602
15737a2345K1293M9314Q0734J4910n5710r5706n2296m4249l4474Q1684N0035K908
15725F098p789m6620k4791J7742j7031N760N0881q39l9135J3520n7166j4855m6488
15712a60713o127O6435O5520M6459j2763r523k6620N3363j0956j6116M7864l6168
15700F55o4889M4253M1058l6318J1421J9401Q033L9550j9418l0041n2000l3078
$$ y = [42772, 37576, 29167, 41721, -5215, -20153, 7833, 26680, -2579, -52316, -74712, -63264, -41684, -29627, -2162, -6420, 42267, -1565, -47954, 3318, -44097, -11480, 28959, 4100, -14892, 37290, 49494, 40507, 1906, 69532, 66702, 79083, 71992, 33133, 15257, 100010, 50803, -28089, -48093, -75518, -25933, -918, -3600, 27383, 23104, 34767, 18797, -23947, -12345, 8948, 58262, 138996, 153906, 98196, 2490, -49806, -94055, -128529, -46845, 3190, 6098, -1691, -48311, -73102, -55360, -72391, -66631, -15750, -16589, -55724, -42204, -99370, -114225, -160713, -166840, -100405, -34885, 11574, -1189, -10712, -37332, 16031, 5075, -11041, 36823, 655, -64234, -19981, 21077, -15241, -3820, 15581, 23614, 63164, 43746, 13705, -38295, -71373]
15688g1373p106N7508R4391L3985k5403p138L2282k0665k8643o8500j3277M858
15676a9081O3339j1282J98K1974M4941L017o434m2125k3005K729n5872n0011k5827
15663i7439M9539K1011l4552P6101L0789m9181l0383J5357O73l5621j7098K6919
15651d3885L5318Q3475M3819K0503m1471o1827n0069K5331k3669K3089N0083j3756
15639D6941L571m3087n73l9593J156r517P777L4346L056j9850o431k4941k0235
15626f7380L4153K1786k3680n3274N6860P2109n730j4918k4424K1353O1255Q669
15614H6779m4726j07045l6005m5341J7844Q4072N9403m8948J5010l0070K0918
15603b8109J0792l9914j4752K4381K4419L8095r745M622K1574j5306J7492q110
$$ y = [-71373, -78479, -20971, 73420, 107405, 82002, 74864, 107146, 86481, 57838, -10662, -23939, -19081, 44258, 32976, 33174, 55148, 100089, 103106, 96672, 54547, 31542, 34271, -21601, -71612, -97439, -47900, -26889, -61441, 14660, 45449, -3732, -34115, -18758, -18085, -53706, -70804, -43885, -8567, 74908, 118727, 139230, 97759, 35932, -14137, 11194, -12475, 10614, 60697, 46941, 50512, 7425, 6852, -32741, -31585, -41102, -33325, 1021, 4077, -15773, -22204, -47145, -67380, -33227, -11441, -35121, -88395, -31535, 40574, 34844, 19926, -4498, 16855, 78110, 86779, 42053, -64992, -100997, -146338, -128494, -44422, 14981, -33967, -18957, -49027, -28109, -17317, -57231, -71983, -47602, -23183, 14912, 5167, 9789, 31363, 16057, 33549, 25439]
15591B5439K2662m8651n9313m898N6172K1487O961J9525K2465l0723j3840l9345
15579b2059M8754m020K7018m6997m2662J1709j0117N6194Q424M7141k9288l973
15567D0124l0057m3971l7921Q693n111l5549k0736J00367Q582K9806k3647K9607
15555B0187M6860J3809L0355p1630m5767o0367M742L649L6734N4627k6773l0004
15543b3578k6493J3046L0174P561K6619k3650k4253L1839N0368n2288p9349J5219
15531e4785M3365l9628n0910K6224J3396L6714Q517j1313m8791l7693j474R233
15519a07145J3952j9964J3899N2253o291K7936N3682J0244n6970o902L3730K8565
15507C6989J06j8788L6089K3620l0054k8839m4699m4374k318J4433N3816k8203
$$ y = [25439, 48101, -550, -59863, -64761, -8589, 12898, 19859, 39384, 61849, 31126, 17286, -22059, 26695, 22675, 49693, 2696, -39966, -28257, -38374, 17820, 26244, 73385, 44097, 40124, 10067, -33904, -71825, -63132, -68243, -103792, -124528, -24161, -15579, 14227, -9420, 20187, 67047, 80856, 111211, 39581, -6186, -66553, -61811, -58162, -21428, 33199, 6426, -23578, -50071, -37025, -6851, 710, 27329, 3679, -20574, 11265, 61633, 9345, -70004, -54785, -11420, -51048, -101958, -75734, -62338, -25624, -17107, -28420, -77211, -114904, -116378, -107145, -93193, -113157, -99258, -47005, -53296, -25360, 28322, 38566, -18404, -25306, 8424, 36989, 37095, 18307, 54396, 78016, 47962, 19123, -25576, -69950, -72268, -57835, -4019, -32222]
15495c2222J2045P1300J6140o5267p0622M38J00869P0520J7210n8517n8795m9438
15483d6339q747M8085P0362k8431o3195O8035R1607l8365n868l5347n7434r5081
15471a00718k5613M4433J16206J2017m5862n5097J024J3447k8695q74M3109M0459
15459A3836j7067k316M0654O1284l9885m3172J0794L8193J0066l3065M109k0090
15447B3341L5348p201K3165K914n0849q912m9450k6726K3409N0389P274q197k3787
15434i282k8710L2827K3668l7067p195l499l055O0388M2220l5002r2204q387K7470
15421c7828J7499k5974j0075J2651J7969M0624J8516K0454J4394l3101j9297m2750
15409b6918K1833M1692j1840k4651k3741K0037N3193J1759o1559k8801J7354O346
$$ y = [-32222, -20177, 51123, 67263, 1996, -68626, -68188, 32681, 103201, 120411, 61894, 3099, -46339, -55086, -7001, 63361, 34930, -28265, 39770, 131377, 93012, 87144, 51797, -5637, -100718, -126331, -81898, 34308, 46325, 463, -54634, -53610, -40163, -68858, -69732, -26623, 13836, -3231, -5547, 35107, 96391, 56506, 13334, 24128, 62321, 72387, 39322, 43431, 23341, 58689, 51488, 74653, 77567, 26718, 17806, -31644, -58370, -34961, 15428, 22702, 14505, -9282, -37992, -5165, 18503, -18564, -25759, -29258, -32313, 28075, 70295, 35293, -56911, -65298, -37828, -20329, -46303, -56378, -43727, -25758, 14866, 33382, 53836, 68230, 35129, 15832, -26918, -5085, 36607, 24767, 116, -23625, -3588, 49605, 61364, -195, -28996, -11642, -5296]
15397e296R352q460M7499J9243j0740j876L0120k9446j0734r102K4602J52K5545
15384H0859N006l5174o3967L5902M4510j7674j1309m9668L1928L1693K3441n8593
15372A6954n5164j2464l5883L7842M6501M4058P669K2129r909o2285p6341j454
15360g8347L4095Q154K9878J9142O5053N2686l4547n3432K6762j5071l5295K8746
15348D7824l6990l368J2069k8965J2715l3989j7320K915L0861J0503J5715m3140
15336c1170p3014k3359n751O0263N5761n0197k0724M5475L2261J4151O1977j6354
15324D9319p7935k2571o111P623O053M4665Q2110j1426m7765Q408p2008m1669
15312h1307m9209j0387k6697M0082O1478L7433k2525P8014P9526P17r817l9411
$$ y = [-5296, 4056, -4404, 43095, 62338, 51598, 49722, 79842, 50396, 39662, 30560, 55162, 55314, 80859, 85865, 50691, -13276, 22626, 67136, 49462, 38153, -11515, 20413, 52106, 75547, 16954, -38210, -50674, -86557, -48715, -2214, 41844, 49513, 71642, 61733, -552, -76893, -78347, -44252, -36098, -6220, 12922, 77975, 130661, 96114, 42682, 69444, 54373, 19078, 47824, 10834, 7466, 19535, -9430, 3285, -30704, -48024, -45109, -14248, -3745, 11970, -31170, -104184, -127543, -133294, -73031, -17270, -67467, -88191, -42716, -10455, 3696, 65673, 49319, -28616, -51187, -57298, -49675, -43622, 1043, 83153, 71727, 23962, 32370, -39638, -81307, -130516, -140903, -167600, -127518, -66040, -28607, -51132, 26882, 106408, 107125, 97308, 57897]
15300E7897m0874k1295M0173J4806K7151J1862m3150l8536m1929l5328M9455n31
15288b0299L7769j3823o5602l9051K4375J6031J6017K8907P3188R449k0502k7791
15276A8668m8081r338N5638J2206n990o0806k1131o0655J6009J22034L3032j6705
15264C4881j421j5376k809k4030L5749J3993k1137n0381k649j6692j3208K9553
15252c3527N9585L4520K6504R463k8735J2714K1884k2926j004m5049j2861j2530
15240H038J7473o4901P173O0708N208R835J4256M9481n7072l5883j0210M801N6974
15227F5881l7574p4817J3217k3319l4614M6126N659k3588l4300J5306O6439J2498
15215c086K1409K2561L060m2079P2246l6041k9725l1151o709P258l6414k5437
$$ y = [57897, 17023, -4272, 35901, 50707, 77858, 89720, 46570, 8034, -33895, -69223, -19768, -20299, 17470, 3647, -61955, -101006, -76631, -60600, -44583, -15676, 57512, 66961, 46459, 18668, -29413, -38751, 16887, 29093, 23103, -37703, -58834, -119489, -103480, 18554, 51586, 34881, 33460, 18084, 15275, -8755, 26994, 40987, 19850, -30531, -33180, -49872, -63080, -33527, 26058, 60578, 87082, 96545, 67810, 80524, 102408, 79482, 78478, 33429, 20568, 8038, 25511, -39390, -32217, 28491, 33699, 43534, 57790, 107271, 50199, 14316, 4106, 8907, 65881, 28307, -46510, -33293, -56612, -91226, -45100, -39441, -63029, -97329, -82023, -15584, -3086, 18323, 40884, 43944, 1865, 74111, 38070, 8345, -22806, -29515, -22257, -58671, -84108]
15203h4108p673P386P7535O3048M724m1210m4358K153J4748j2816P5051J148l8670
15190A6958j6922J4866L0516L1562J7378j9187l7371m0866k802P165J4691K7363
15178D3351m509k8453j2120k1370O800l8392k6758K820J0676L7332J5734O21O871
15165g397k6116K859n085L2407J683p4781k5933Q0002j1874n4275k5220J2965
15153a00765N0167j2460N0004K1916n1961l8269K1016K0301o645k3402J9085o068
15141e7081j1301J6089L1597j4331n9904J6087L1892J9525J9622j6846J3722l6552
15129d7481l8744M8653L4934K9019M669p400J81L0571J8614o8055j0778j8007
15117b3824j2056p517o0521J6313O0760M8823l2917K4636k2758n2810L0982K2676
$$ y = [-84108, -91781, -84395, -6860, 56188, 60912, 19702, -24656, -22503, -7755, -20571, 54480, 55628, 16958, 36, 14902, 45418, 76980, 94358, 75171, 37800, -3066, -5868, 1297, 15988, 43351, 38842, 10389, -1731, -23101, -16301, -54693, -81451, -78631, -67955, -30623, -14889, -14268, -7397, -33513, -30654, -35739, -3332, -1649, -76430, -102363, -22361, -34235, -88510, -113730, -100765, -50598, -63058, -13054, 8862, -43099, -81368, -60352, -40051, -46696, -70098, -51013, -57081, -68382, -52293, -20696, -35027, -94931, -78844, -46952, -27427, -7805, -24651, -10929, -47481, -86225, -37572, -2638, 26381, 31050, 23650, 23831, 54402, 73016, 4961, -5817, -23824, -35880, -43397, -103918, -87605, -26845, 21978, -10939, 13697, -9061, -61871, -30889, -8213]
15105h213J0072l3365N5254k4110n8192j7927L2026L8774M305j5934L1732L3768
15093D8190L6884o211n4994P043R212m5263l4787n5321J3747K1030L1789L7909
15081I228K2960l815m598m4332j3045R409k9511J0363L019J5524m869M1228K7577
15068C9138L1288j078m0669q240l1035L7117L7760J0059J3975k6675q0949m5310
15056f4619J4767j8587J1574O2951M9377M6446j9249j5994n696l3142m9873k4481
15044d6526n107J2887J65k3229L3932R951K0938k7068l5988L2592O9719N4341
15032I6607k3929K5833p2882n6934K2632L5185L2678j1286M3951N9846k2109l1964
15020I7628K4955k2065p177j8570k9825o1047J1167N6176k244n9952m3600J2101
$$ y = [-8213, 1859, -31506, 23748, -362, -58554, -76481, -44455, -5681, -1376, -17310, 14422, 48190, 85074, 78863, 23869, 30912, 40124, -5139, -39926, -95247, -81500, -60470, -28681, 9228, 32188, 28373, 23775, -20557, -33602, -24193, -53704, -43341, -40322, -24798, -29667, 11561, 39138, 70426, 69348, 28679, 20439, -10596, 26521, 64281, 74340, 88315, 61640, -19309, -64619, -49852, -68439, -56865, 6086, 55463, 101909, 82660, 66666, 60970, 27828, -22045, -46526, -51633, -38746, -38581, -61810, -27878, -17927, 3011, -24057, -60045, -27453, 42266, 96607, 72678, 98511, 25629, -31305, -8673, 26512, 59190, 47904, 91855, 151701, 129592, 97628, 122583, 100518, 93341, 74771, 44946, -16101, -4934, 51242, 48998, -10954, -54554, -42453]
15008d2453j8498n0083J3230K3472j5496l242J0698M004M3611K4647m5719j5291
14996g1120R104L2717M3063K580j1264o963n0547n660q602M9048J4629N874P054
14983I913l0171j5713K4704J7999K20K9752M4266n3414n1562J4700J8295M0162
14971D9151m8055n2032J0219q286J6997j3354l368N882O394J0882L7370J8k5948
14958a4130J0989J0954O526j1032k2583k3439R495P865k4067L2042M0054l9222
14946a6548o9735n8410r255J14964L2543L6204J2221l8068p8561L5797J565N342
14934c1941l6820K9082L6456o834K634N2768k9825o9023m895M9872P861j9643
14922b0308k1794O2367l0215l3047P079K0688m7228r5881L0502N9842l6869m2659
$$ y = [-42453, -60951, -111034, -97804, -74332, -89828, -93070, -82372, -78368, -34757, -10110, -55829, -71120, -62016, -29299, 13764, 16344, 5080, -1883, -52430, -58090, -66692, -17644, -3015, 2859, 9913, -20258, -35971, -11267, 6732, 6952, 36704, 80970, 27556, -24006, -9306, 8989, 49151, 1096, -50936, -40717, -49003, -32006, -45360, -48728, -42846, -36452, -25570, 11800, 11818, -14130, -3141, 7813, 14339, 3307, -19276, -42715, -33220, -25355, -49422, -17380, 22674, -16548, -86283, -144693, -153948, -38984, -6441, 29763, 41984, 3916, -74645, -38848, -37283, -31941, -68761, -39679, -3223, -10057, -7423, 45345, 15520, -53503, -58398, -8526, -665, -20308, -42102, 20265, -9950, -42997, -35918, -15230, -62458, -158339, -127837, -67995, -104864, -147523]
14910a47523k3674j049N4238J9960M4128N9858O5737M3058N91o5032k8431K9355
14898E1216L6077q389o2942j2835k0313L2925K500p743k3303M3488J9117M9848
14886I9646k6908o0800k5910k0033m6962J5511l286L1749k1262K0711J1040k0406
14874d6910m0778k8171l0614M2497O2127K3069k536r4939J4612J28010L8831k0918
14862D4280m3670n1205o2791J6977L8314Q712j0346R139J6768P8358J5273J1461
14850G1270k6284j1177n1689k084J8283k8014k1602O024M0817k1007M5020K0841
14838D0398L0553k6938m6967k5762K382P1068M6749l4491q9235K5974J1499K1012
14826B6242l0027l5205p5879k1323K8313K8107Q099J70O0895p378J7346N2491
$$ y = [-147523, -171197, -172246, -118008, -98048, -53920, 5938, 71675, 114733, 115324, 50292, 21861, 51216, 87293, 78904, 15962, 3127, -17186, 15739, 18239, 10496, -12807, 30681, 49798, 99646, 72738, 11938, -13972, -34005, -80967, -65456, -68742, -36993, -58255, -37544, -26504, -46910, -87688, -115859, -146473, -103976, -41849, -18780, -21316, -116255, -101643, 26367, 65198, 44280, 610, -50595, -113386, -96409, -58095, -49383, -59729, -50590, -33822, 44536, 59809, 71270, 44986, 33809, -17880, -19964, -1681, -29695, -51297, -45273, -4456, -25463, 19557, 40398, 70951, 44013, -2954, -28716, -26334, 44734, 91483, 56992, -32243, -6269, 5230, 26242, -3785, -38990, -114869, -136192, -107879, -79772, -71673, -71503, -10608, -17986, -640, 51851]
14814E1851r377n0369J0472q548p833k9549N8212J9883k0875L1120l5705K4474
14802C3756N3678l1956k6356m1565j2761K1213n780k3776K5782R5280R0313j04181
14790G3647q371O5313K7108J0423n3281o7392k280j2023j0337l1384m0062j8693
14778f7332J3230P4379L7065j3756k8223k2079M5302Q270q488r269n0985K0204
14766a682R9353R159j4279J0856o2473o9629j5951l9220M7773K2429J3639K2556
14754B2531K460k2821k6848L4325m6042j02737J3187L4168J7059J2798k6742N1340
14742c7322M1887Q946j9073n0035l0612J3390L1823L302j9601N3460N5594l4409
14730A7350m6657P3464J135n7392K5246P5226j2084l4811j0274j7233j9636l3705
$$ y = [51851, 42474, -7895, 2577, -5971, -13804, -43353, 14859, 34742, 13867, 44987, 9282, 33756, 87434, 55478, 29122, -12443, -25204, -3991, -9771, -33547, -7765, 87515, 177828, 73647, 65276, 130589, 157697, 168120, 114839, 47447, 45167, 33144, 22807, -8577, -48639, -67332, -54102, 20277, 57342, 43586, 15363, -6716, 38586, 46856, 38368, 29099, -21886, -1682, 97671, 106830, 92551, 103407, 40934, -28695, -44646, -83866, -36093, -13664, -25, 22531, 24991, 2170, -24678, 9647, -36395, -139132, -125945, -91777, -74718, -61920, -88662, -37322, 4565, 13511, -5562, -55597, -86209, -72819, -40996, -37694, -57295, -3835, 51759, 17350, -29307, 44157, 45292, -12100, 13146, 88372, 76288, 41477, 31203, 13970, -5666, -39371]
14718c9371k2281P4232j9952k7840r750n5108N9412L6515Q211J6182j9597M141
14706D794k1038M549R049M718M6542K3891l1812j4863M95j2306J4456K0092p279
14693D1288l8363N4581m2855j722J5432o25J4857L6280J389j1728n5423M396n3058
14680c5551O666j5894K5762n8800j8352K3018j4370K5949K2065l5110J7279m238
14668f1576K6400P3133L4430k3424N2006k100k1791l7432L7321Q109r112q732
14656F7232k3502n5578n8514J7612K0188K9860k4933N0522K6288j0884m254R316
14644D3353J0722j7946J2999L5672n5424o3115m5602j598j397L2420k0912K0409
14632e0419J7235Q287k0837k7247j1115K6250K1273o593k0844m9349P8448M7798
$$ y = [-39371, -61652, 12580, -7372, -35212, -44962, -100070, -40658, -4143, 4068, 20250, 653, 4794, -16244, -11695, -2646, 2072, 48614, 72505, 40693, 25830, 26325, 14019, 28475, 48567, 41288, 2925, 57506, 14651, 12929, 28361, 27736, 42593, 78873, 80262, 68534, 13111, 17507, -35551, -28885, -44779, -19017, -77817, -96169, -73151, -87521, -61572, -39507, -74617, -57338, -61576, -35176, 37957, 72387, 48963, 100969, 98869, 77078, 39646, 76967, 85076, 75964, 67232, 43730, -11848, -70362, -52750, -32562, -2702, -27635, 22887, 49175, 38291, 34037, 43353, 54075, 36129, 49128, 84800, 29376, -33739, -79341, -80939, -82336, -49916, -70828, -50419, -33184, -24897, -45734, -72981, -84096, -57846, -36573, -43166, -64010, -113359, -34911, 12887]
14620A2887k1961p4881j7391k1431L5173M1788K5378L1456R321J5955J2776n8413
14608i343J8564P3298j9710j8990J5262l8134M972K5086l7061m138J8213k2021
14596E998j4094L8048L965k1453m0211n4976m2103M4222R9533R430o8106L0071
14584i676K7407K9911k3707o717j7994k7838L0203N3077J2598l9945o936n2294
14572c1911Q372N3700K0055j349n6431P632J6653J0545p113l014n2524O9142P0922
14559A04679j5702m6008j6593J8191K1967j1689m6466m3896j0099L6275k884L329
14547h896J2395K276l816l2087n2927J0915L5044M1593K1568o0076J6128J8432
14535E49m802n4601O320J2723K0712k9727p8435k2635L2166L5942O7775L9206
$$ y = [12887, -9074, -83955, -101346, -122777, -87604, -45816, -20438, 11018, 20339, 36294, 49070, -9343, 9221, 82519, 62809, 43819, 59081, 20947, 25919, 51005, 13944, 9806, 28019, 5998, -8096, 29952, 33917, 12464, -27747, -82723, -124826, -80604, 18929, 28359, -39747, -9676, 17731, 47642, 23935, 17218, -776, -28614, 1589, 54666, 67264, 27319, 20383, -31911, -23539, 30161, 50216, 48867, -7564, 68, 16721, 27266, 20153, 17139, -35385, 33757, 104679, 88977, 42969, 26376, 44567, 66534, 54845, 8379, -35517, -45616, -9341, -12225, -8896, 3499, 5775, 1959, -30128, -83055, -72140, -37096, 4497, 26065, -34011, -17883, 549, -4253, -58854, -52534, -39811, -19099, -48826, -127261, -149896, -117730, -81788, -14013, 25193]
14523B5193k6129n0734l2176J0685L3264P7752l4938p711m4442k2453J3294M3728
14511a4667O540k6691j9680L2842o209L5260O1860n7560K0131K8539j6181k6317
14499A7867j792l5655k7051L0020P8325L2457o436Q36p35l0946p3131o559J6860
14486e940J1693L0058L9833l0768m3580L8307N1945q271m2288k3303O55m283K5641
14473C9699l3581q279J0615J4311j8201P201K1612j0371K0406Q660J5190o669
14461F0593q3640J0259L6988K854l121k1364m2668k8708j190L6569O7669J4919
14449D9160q2324j6106M3567L6554l9810j3739L7446j3487j287K1297k9435j0857
14437a9021J1856r377m322k9250L7599K2934L301J2815k2911l7536O650k2148
$$ y = [25193, -936, -51670, -83846, -73161, -39897, 37855, 2917, -4794, -49236, -71689, -58395, -14667, -8127, -34818, -54498, -21656, -27865, 7395, 69255, 11695, 31826, 60365, 44184, 17867, 16075, -19580, -46631, -16611, 61714, 94171, 87735, 88571, 87836, 56890, -16241, -22800, -5940, 5753, 35811, 75644, 44876, 1296, 39603, 91548, 83277, 40989, 17686, 18341, 14058, 39699, 6118, -2161, 8454, 22765, 4564, 11765, 33377, 23006, 43412, 52072, 67262, 60593, -23047, -12788, 24200, 27054, 23933, 2569, -40099, -68807, -69997, -33428, 34241, 49160, -33164, -49270, -5703, 30851, -8959, -22698, 14748, 1261, -26, 21271, -8164, -19021, -7165, -16542, -20864, -50114, -12515, 10419, 13720, 26535, 3624, -33912, -27262, -49410]
14425d9410k9392K5888R292L4454N5119r740p500n8409j6394Q4793J9852m3617
14413A4936l1874j0725K1624L3314K0919L6509J928m3941l933p1760K9498P7208
14401G3703J4339p042j5313o0850m5817k5297k6095J3124M1952M2217K1350n2770
14389b6499l1490K0011O129K4927l7470l454M3761Q9410k7892k9656l7061n0120
14377e9404O8824J2230J86L0655N450n3490k8479M0957J0250n3874j150M7343
14365A9498k8477q5230j160L2997L0886K3410N3248k3290n63K2553k7396O7664
14353H4140P66l2095k5423j9709M0494k198m3213j8036J4958p5640J2166L9672
14341b4118K1011j2476k830K3548j091r38N580m3263o3900Q506N2876k3283l8811
$$ y = [-49410, -78802, -52914, -43622, -9168, 45951, 36211, 28711, -29698, -46092, 38701, 58553, 14936, -16938, -27663, -6039, 27275, 48194, 84703, 86631, 42690, 38757, -33003, -3505, 73703, 88042, 81000, 65687, 4837, -40980, -66277, -92372, -79248, -37296, 4921, 26271, -26499, -57989, -37978, -31849, -6922, -44392, -47846, -4085, 85325, 57433, 27777, -9284, -59404, 9420, 21650, 21836, 52491, 57941, 4451, -24028, 16929, 27179, -26695, -27845, 19498, -8979, -94209, -95369, -62372, -31486, -8076, 45172, 21882, 21319, 43872, 16476, 84140, 84906, 52811, 27388, 7679, 48173, 45975, 2762, -15274, -316, -75956, -63790, -24118, -3107, -15583, -18413, 5135, 4044, 3106, 8686, -34577, -98477, -89971, -37095, -60378, -99189]
14328i9189Q5911N3840L8056N399l6788k0551k2309N979P0467j4683n3006J9572
14316C2698L311k0876N737l2535k986K3693J0088k1580J0593m7905n144J4753
14304c0153L9330m360J5363k52M0439k1472l5307j6428j2583j3813p699M0401
14292f534N5600j5311l4610N861l1133k8611M6119P7520j7853o2327p055j7993
14280c6327M4749M2797m5570L5807M382k875j2846n0737J6706L0787m0839l4077
14268d8043j378N9951j4930L7339P88n965o376K4583L2611l7579M0625L9047o7276
14255E3397o4838K9560K8313k4939n062k9210o3751n596L0208l9849J6704L7179
14243c7884J00l9595J8357J8403K9024K8218J7732J5224r827k5580q85K8755j1676
$$ y = [-99189, -13278, 40562, 78618, 84017, 47229, 26678, 4369, 10348, 80815, 66132, 13126, 32698, 36009, 15133, 20870, -11665, -14651, 9042, 19130, -2450, 8143, -39762, -44906, -30153, 9177, 4817, 20180, 19928, 60367, 38895, 3588, -12840, -25423, -39236, -46935, -6534, 49066, 33755, -855, 5006, -26127, -54738, -8619, 68901, 51048, -11279, -18334, -36327, 8422, 51219, 5649, 41456, 45838, 42963, 30117, -20620, -3914, 26873, -13966, -48043, -49421, 10530, -4400, 32939, 33727, 27762, 21386, 45969, 78580, 41001, 81626, 120673, 53397, -11441, 18119, 46432, 21493, 16431, -12779, -76530, -82126, -51918, -91767, -75063, -37884, -37784, -77379, -59022, -40619, -11595, 16623, 34355, 49579, 39752, 14172, 13287, 42042, 30366]
14230C0366k4162J6400m3543j4008l953Q134M7544l071j5745l390L4676l8559
14218i311q701R146m220L3840m4032Q308J1421r300M8152M0767k9707J242J0137
14205E7742n2522n4713j7081N6220N0821j2618k9841l3815L2424k2925L3854o929
14193F17j5110j6614K6034J7856j0337K1188K7815k3407l0592P7489J5573J9011
14181A09523Q794m2403n1431n4618l7775J0817M936K2522j3738k9249K6393m5570
14169i1799J0180j1758M6396M0587M829L6978q33L3422K243J6402k590j8043M0823
14156A06837l6238l77K4900k1199k3688K0155l593l8297l4036m8287j6489K4121
14144d6191M21k4702O5110M7609j0066k5906O5337K7573k2183m4132l3158P5841
$$ y = [30366, 6204, 22604, -20939, -34947, -38900, -30766, 16778, 13707, -2038, -5428, 29248, -9311, -18012, -8866, -13086, 20754, -23278, -14970, -3549, -12849, 35303, 76070, 46363, 47605, 57742, 5220, -49493, -66574, -10354, 40467, 27849, -1992, -35807, -3383, -26308, 7546, 617, -14493, -31107, -5073, 12783, 2446, 23634, 51449, 28042, -2550, 74939, 90512, 109523, 118317, 75914, 24483, -30135, -67910, -57093, -52157, -29635, -43373, -72622, -46229, -91799, -81619, -93377, -46981, -6394, -1565, 35413, 34580, 68002, 70245, 86647, 84057, 66014, 106837, 70599, 70222, 95122, 73923, 50235, 70390, 66797, 28500, -5536, -53823, -70312, -46191, -45770, -70472, -5362, 42247, 32181, 6275, 71612, 99185, 77002, 32870, -288, 75553]
14132G5553J9168j08004J8643J7514k3739o323j4625Q658l1923j9527o564K8583
14120d2586j434K665k0941J7411l4792l9157N7453P7393J5015r0580m025J9092
14108d4486J3656J0056L2499k8337l1706N8542O9254K0301k6680k7212m067M5917
14096H7737j2259n9188k4756K5895N144L2858k4959m1444M2730P2035l3280m3157
14084B7356l2428m646k8174R847K7885J3373N669l3891K2352M0032j0202j7380
14072A9793K8028k0368K6872n797J3039q6472j6150K1395j7963M4975L3006m0941
14060e83l1205m0525Q768J6854J4524J2916J8352J5824m872p5226j0064M6121
14048b9116J4146L2433K9967L23J927L8711j643l3636l2176L8914o913p339M0528
$$ y = [75553, 94721, -13283, 5360, 22874, -865, -7188, -21813, -13155, -45078, -64605, -71169, -42586, -44020, -41355, -62296, -44885, -79677, -118834, -61381, 16012, 31027, -59553, -63578, -44486, -30830, -20774, 11725, -16612, -48318, 10224, 79478, 99779, 73099, 45887, 41820, 87737, 75478, 16290, -8466, 17429, 22573, 55431, 30472, -10972, 31758, 103793, 70513, 27356, -5072, -9718, -37892, -28045, -160, 13213, 18882, -15009, 7343, 47375, 37173, 19793, 47821, 27453, 54325, 48528, 61567, -24905, -41055, -19660, -37623, 7352, 40358, -583, -31788, -72313, -63545, -46691, -32167, -19251, -899, 14925, 10053, -65173, -75237, -29116, -14970, 17463, 47430, 47753, 49680, 88391, 86748, 53112, 20936, 59850, 52937, 45598, 86126]
14035H6126k6855q624j8303n1039k3808l581M2967K6454j1681n3211p927N5175
14023E693P7310r452m5126l9835k4806M3820R5091j1604J3483k1461p5700q7042
14011g9629K5550Q5734l6498p4599L2036j9640j1686K4959j7889k3891Q106K8613
13999e8834P2988L0151L1745q7925k6809Q652j4387m4873J3615R608M3654O5283
13987D2868o950K6305J769o4107n0767K4121L3843J4295r795l2980J186l109P177
13974a6144P5007o736p01n3419M7559k044N964m2018J3609J6791l882m3346m0021
13961d9381L0319M2494O773L3884K9578p128k5979k2716K9233K4478l89k8357
13949F2809m0008q045j2913k759n4252p963K1095N2529K4784O733k1200k8707
$$ y = [86126, 59271, 50647, 32344, -18695, -42503, -46084, -3117, 23337, 11656, -41555, -49482, 5693, 83003, 73551, 28425, -11410, -36216, 7604, 102695, 91091, 104574, 83113, 7413, -79629, -54079, 31655, -4843, -79442, -47406, -67046, -78732, -53773, -71662, -95553, -87447, -58834, 14154, 44305, 76050, -11875, -38684, -30032, -44419, -89292, -75677, -66069, -22415, 42868, 35918, 62223, 63992, -115, -50882, -26761, 7082, 21377, 11582, -21398, -20212, -23321, -16144, 58863, 52127, 51426, -1993, 45566, 43522, 49486, 7468, 21077, 37868, 33986, -9360, -49381, -19062, 23432, 30205, 64089, 93667, 86539, 60560, 37844, 67077, 91555, 91166, 62809, 22801, 14756, 1843, -916, -55168, -63131, -42036, 10493, 35277, 42010, 20810, -7897]
13937g897O5354P8457q5155l5966j4091J1015J7557p6662l5787P5382K0205J6123
13925B8535K8510m6497j1450R9L3659L5453j6568l913N9801M976k7343n6333k4042
13912D887O834j8982J7380m8011K825J1585M0099K5657l592n8961p854N1130L6780
13899E9777p646k4379J6734J4217n8168L061n7036j1116m548J0839J9041J2547
13887b6677L7890P080n3773o408L246n0798k2441J721L3280L30j7752K9830Q8571
13874B4099K7583n0479m1075k2908k5230m815P1371J8259l4574K9949K2682J5046
13862B9908k0044l470m8507Q459j1348j6823J731j5883Q048J4182n119Q6602L5822
13849F3558m8745k4280r2653l7660L5972r152O826O7852m3517j6973Q6512k9539
$$ y = [-7897, 57457, 135914, 50759, 14793, 702, 11717, 29274, -47388, -83175, -7793, 12412, 28535, 57045, 10548, -902, -803, 32856, 68309, 51741, 47828, 107629, 112605, 85262, 28929, 4887, 11721, -7261, 10119, -37892, -35067, -23482, 16617, 42274, 38682, -20279, -28133, 22997, 59777, 52131, 27752, 44486, 58703, 535, 3596, -53440, -64556, -69104, -58265, -39224, -26677, 11213, 18293, -35480, -41888, -38642, -89440, -111881, -110160, -76880, -76550, -94302, -64472, 24099, 51682, 1203, -39872, -62780, -88010, -92825, -21454, -3195, -37769, -7820, 14862, 29908, 9864, 6394, -42113, -33654, -45002, -61825, -60094, -75977, -67929, -53747, -58866, 27736, 63558, 14813, -9467, -102120, -139780, -103808, -112960, -106134, -38282, -81799, -98772, -12260, -41799]
13837d1799R133M8498K6331k3408l5114l5761j0966J8028J730J4322p333m6886
13825h3225L9877L3221l7920n8346K3281M7895p362K453j0057J1716M0637L9599
13813D1769M2152j6200r5089l131M5540J6189M743N406j4184J1277j6892k0287
13801A293j0404j7826K0641l1539k2158P1940N270j0793M0276l4948o2773j0792
13789f1813K8141K2224L1525K768j713l9337L096J095M054J4775j4164J0309P7789
13776G8749N370j2899j7937l6175r471n083p2886k8954O2627Q2521J360l5613
13764A1609n3034o3520J3440M710j3540J2853J7709J5246J3734m4399K6023L9379
13752a9790j8730q948K1066p127m837J9001J4890K2692l4451j432m6892k3783
$$ y = [-41799, -32666, 15832, 42163, 18755, -16359, -52120, -63086, -45058, -43328, -29006, -36339, -83225, -43348, -10127, -48047, -106393, -83112, -35217, -42579, -40126, -50183, -38467, 2170, 41769, 83921, 67721, -27368, -30499, 15041, 31230, 35973, 41379, 27195, 38472, 21580, 1293, -9111, -26937, -6296, -37835, -59993, 11947, 17217, 6424, 46700, 11752, -51021, -61813, -33672, -11448, 20077, 22845, 21132, -18205, -15109, -14014, -9960, 4815, -9349, 960, 78749, 84119, 71220, 53283, 17108, 7637, 2554, -70332, -99286, -36659, 45862, 47222, 11609, -41425, -104945, -91505, -86795, -100335, -87482, -69773, -54527, -40793, -85192, -59169, -19790, -38520, -47468, -26402, -33529, -38366, -19365, -4475, 18217, -16234, -17666, -64558, -88341]
13740h8341L069N2098K8953j0892n232J5429M247l6491k3001K8857L8823J1077
13728A8596K7105L0886m1285l6576m9943L7788P3740k8876l6085m648J8956k5957
13716a6299M0409N781J9914K4225q683L2465Q570l5253J3641j495L4110k6939
13704I0446l5518O2253l1354m4999l8640l3783K1474l933M864j9783q9483M6730
13692g1726K4980k2638N2594L5150K4657M3793m7269j13761L6958M6853k5534
13681a5943L5055L3219l5522J1937K5298R260M5843N0146l1258o1245k2736j4778
13669B9276j341j9875n381m609P167j0082R061k3822m3523j2736K8381N2969j9372
13656a3887k3203J2472M651k7158l7911N037k083P5490J05706M6437k5769l2670
$$ y = [-88341, -85272, -33174, -4221, -15113, -20345, -4916, -669, -37160, -60161, -31304, 7519, 18596, 45701, 76587, 35302, -1274, -51217, -13429, 60311, 31435, -4650, -9298, 9658, -16299, 24110, 29891, 49805, 74030, 65347, 97812, 106382, 71129, 84770, 83275, 117385, 90446, 54928, 117181, 85827, 40828, 2188, -31595, -10121, -14054, -9190, -28973, -118456, -71726, -46746, -69384, -16790, 18360, 43017, 86810, 39541, -74220, -37262, 9591, -15943, 19112, 52331, 16809, 28746, 54044, 63304, 109147, 159293, 128035, 66790, 44054, 29276, 27935, 8060, 2679, -1930, 5237, -4845, 4216, -19606, -63129, -75865, -47484, 5485, -13887, -37090, -24618, -19967, -47125, -85036, -79999, -82082, -6592, 99114, 145551, 119782, 87112]
13644H7112m0765q4339p3736J6170J4091q890l1698p1425j7222L5363P6688O6659
13632c1992J7891j5798k7156k6711L4823P6411m5638m1663M185K0780K564L6950
13620D646M720l5209M8437L11J8401j902L2460P732J1724n9612l2453k3112K6456
13607B599K3172j9613j8038k0559l2983k033L9956J8422j3639K569K4546j7403
13595a3004R628N3958J7712L858l6324M7797N981n4847l6323L5526K3946l7322
13583B0586l6175n7628M02J2371M2439O6485K2315k1494j7643o0898o0378l2743
13571a22361J0519k1271j2498J13871M7844l0405k3082j2846L5385l317l8503
13560e6664J5644P7692N499o3741l970k1072K153j0771M1432M9068j511J2685
$$ y = [87112, 46347, -37992, -111728, -95558, -81467, -90357, -122055, -193480, -210702, -175339, -98651, -31992, -14101, -29899, -57055, -83766, -48943, 27468, -18170, -59833, -55648, -34868, -32304, 4646, 9366, -25843, 22594, 22905, 41306, 39404, 71864, 79596, 91320, 31708, -745, -23857, 2599, 25771, 6158, -11880, -32439, -65422, -67455, -27499, -9077, -22716, -20147, 4399, -13004, -3376, 50582, 68294, 72152, 35828, 83625, 89606, 34759, -1564, 33962, 57908, 20586, -15589, -73217, -72815, -60444, -18005, 48480, 70795, 49301, 31658, -29240, -89618, -122361, -111842, -133113, -145611, -31740, 16104, -14301, -37383, -50229, -14844, -18161, -56664, -41020, 36672, 42171, -21570, -25540, -46612, -44459, -55230, -13798, 35270, 33759, 46444]
13548D6444K8334k6316n0887o444N881o5463l2011J8008j0597K8501j8304L4332
13536d8522N326K4790N741K1781J441n191j3604l9439j0599j134J8524J3204k2270
13523d9952k3468Q1631Q982M632L4374j1112K1992J1114L7916p4005j05275L5340
13511b7831N9177N094j01220l3639K8980k174j4025K3387J413O3355N4244o5914
13499i153Q271L4285P006n7312R597L7073j0695r568N4700K7778n7638o5638n6956
13486h8250m266L9430M3005k2207K5918K3197N8639j6302k3908J4280K1346k9545
13474D1337o1221n4107j9946P6967M9310K3397Q475J363o925K7372o9390p3559
13462e6927J5585N1070j720J9391J429n6087j1973L8129K1335J2997Q274n3872
$$ y = [46444, 74778, 48462, -2425, -8869, -2988, -68451, -100462, -82454, -93051, -64550, -82854, -48522, -43196, -18406, -12665, 9116, 10557, 5366, -8238, -47677, -58276, -59410, -40886, -27682, -49952, -73420, 8211, 17193, 21825, 56199, 45087, 67079, 78193, 116109, 42104, -63171, -27831, 31346, 36440, -64780, -98419, -69439, -71613, -85638, -62251, -60838, 2517, 56761, -9153, -882, 33403, 40409, -16903, -7306, 29767, 19072, 9504, 64204, 91982, 34344, -31294, -88250, -92516, -53086, -10081, -32288, -6370, 16827, 75466, 59164, 35256, 49536, 70882, 41337, -19884, -73991, -93937, -16970, 32340, 55737, 64212, 65575, 58650, 86022, 16632, -56927, -41342, 9728, 8008, 27399, 28828, -27259, -39232, -1103, 20232, 33229, 41503, -12369]
13450a2369L7795m692J4532k4269j1940M7225k7795n7514n864N0910l0523q65
13438b5369L4950M0226Q457l5533l4576j3100j7272M4009J0266j0136J2285K5232
13426C9439L995p4395l5534M8826o570N8882m0556j0832l9882L593O963l1335
13414g7406k735m2176L4145P5875J0349j4025K7318l2751j9966k2878L6886M5232
13402A7868k5931j7841K8862J4102l4058L6988N4308L3452k4212q0965j9636N1834
13390C4771J9968P07m9563m3814O86p538j4640J937O1582K8802k4290J3314L9366
13377F1288j5749j281l803n6246l3679R193n5833R942K1357P7287M2285O0571
13365A15332r434m7731k3606J668l7394j8617O1726R7609m1304p3131p3222j951
$$ y = [-12369, 25426, 20734, 35266, 10997, -943, 46282, 18487, -39027, -44891, 6019, -24504, -25369, 9581, 49807, 58264, 22731, -11845, -24945, -42217, 1792, 12058, 1922, 14207, 39439, 43434, -30961, -66495, -17669, -24239, 34643, -5913, -16745, -56627, -53034, -46071, -77406, -80141, -122317, -88172, -12297, -1948, -15973, 11345, -21406, -41372, -64250, -27364, 17868, -8063, -25904, 2958, 17060, -16998, 19990, 74298, 107750, 83538, 2573, -17063, 34771, 54739, 55446, 5883, -37931, -37245, -44783, -59423, -57486, 4096, 32898, 8608, 21922, 61288, 45539, 44258, 40455, -15791, -49470, -40277, -96110, -86168, -64811, 12476, 54761, 115332, 105898, 58167, 34561, 36229, -1165, -19782, 41944, 139553, 98249, 25118, -48104, -50055]
13353e0055P5093J3249k480m4975r389j4412R784j6257j3642M3968m3054n648
13341e7818M2643J0950k0733J2084J0975m1591L311M2585K782J8796N5175J5080
13329I4239j6032l7844j8748k0332j2934L7288l1423K1420K5756n1445j4766k0222
13317d5043K6113O5714k7086n813k9603p1439k717l5469J1440L0204L0410O7262
13305A3973L8623M106L9139k6716l5430m729p0472m1475J3851N43l6218l128M8097
13292e9836M7677J7021m6634Q418K9937L7679j339K6418M0726n0197j6531K6984
13280F0323m4651J0984J0968n0132l9824k2813N4909L7809M411l8258r216J1765
13268a3725L7889J9190J6473m781m919r6823n5289N4187M4295O0094m1566j385
$$ y = [-50055, 25038, 38287, 35807, -9168, -18557, -32969, -23185, -39442, -53084, -9116, -52170, -57818, -15175, -4225, -24958, -12874, -1899, -43490, -40179, 2406, 5188, 23984, 79159, 94239, 78207, 40363, 21615, 1283, -11651, 25637, -5786, 15634, 41390, -10055, -24821, -45043, -18930, 46784, 19698, 13885, -15718, -87157, -89874, -125343, -113903, -83699, -53289, 13973, 52596, 56702, 95841, 69125, 33695, 28966, -41506, -82981, -69130, -68587, -104805, -107933, -59836, -12159, 4862, -41772, -33354, -3417, 34262, 32923, 59341, 100067, 49870, 33339, 60323, 15672, 26656, 37624, -12508, -52332, -75145, -20236, 17573, 21984, -16274, -25490, -13725, 24164, 43354, 59827, 55046, 50127, -46696, -101985, -47798, -3503, 56591, 15025, 13640]
13256A3640L2187j1267k2205J9716n8969o5339J8967O9721J6382J5025N48p3935
13244d5529j6667r949N8487O1301n9089j05598m5058N9975O5495N4113j8058l6841
13232c7418J6392j9380j4341N6613K22M2562N18j0016n693k9923J2183P3624M6498
13219A31841N990l7641l2402q732J0567j3985J0893j2332m7593m2886n628M11
13207d1497k6013N149j836J9054O1669K3398l377q501K5620P057K6059J0424m1838
13194E5368n2473K0786L6857J351m2189l1023K3416O3025M7010k3006j4814j9001
13182F5307l0358n1351j3625J1027k3272m5305N795L6848K2185M4630J4927n9504
13170b2696n134o449M5267L2024j9832o1775m2073K124L3722l1935O184P1841
$$ y = [13640, 45827, 34560, 12355, 32071, -26898, -92237, -73270, -3549, 12833, 27858, 28406, -45529, -62196, -72145, -13658, 47643, -11446, -117044, -162102, -102127, -36632, 17481, -577, -37418, -21026, -40406, -54747, 1866, 2088, 44650, 45168, 35152, 29459, -464, 11719, 85343, 131841, 137831, 100190, 67788, 59056, 69623, 55638, 66531, 54199, 6606, -36280, -41908, -41497, -67510, -62361, -64197, -45143, 16526, 39924, 36547, 28046, 53666, 60723, 86782, 97206, 55368, 2895, 23681, 60538, 61889, 19700, -11323, 12093, 75118, 122128, 99122, 84308, 65307, 34949, -16402, -30027, -19000, -42272, -87577, -81782, -44934, -22749, 21881, 36808, -22696, -27830, -34279, 10988, 43012, 23180, -38595, -80668, -78544, -44822, -76757, -70573, 1268]
13158A268Q0160o6826j3553k2170n5957L097K0579J3208L1003J0247m797o410
13146a0151k2750k490O3930J7639M661m0214j7758k0744J9933l3457j04R1375
13134D9870M6808m5435n7245m1024k3859M2308O6173N749j1432J203q035M5972
13122G1053O975p029j1943j1322j9840o8114Q145K7035L3642m0855k5802N508
13110c2547k1502j737n314R11J1132O274j1918k7056L5436P1507L1970j7571k7645
13097A1940o168k7755J2879P3580m0670o2620l3714J5365J0126P3478N1798m7595
13085C0644p813L299n3937J9226K030m8884J6783M1061P758n7644O1249k4308
13073a0536k8432P1409k7399l2314n4268L8233L031j538J6068L1918k1424r027
$$ y = [1268, 81428, 14602, 1049, -21121, -77078, -73981, -53402, -40194, -9191, 1056, -3741, -10151, -32901, -35391, 28539, 46178, 50839, 10625, -7133, -27877, -7944, -41401, -41505, 49870, 96678, 51243, -6002, -47026, -70885, -28577, 37596, 43345, 31913, 33116, 25081, 71053, 78028, 70999, 59056, 47734, 27894, -40220, -32075, -5040, 28602, -12253, -38055, -32547, -54049, -55786, -61100, -60189, -49057, -42783, -54701, -81757, -46321, 25186, 57156, 39585, 11940, 5772, -21983, -9104, 64476, 23806, -38814, -72528, -57163, -47037, 26441, 78239, 30644, 22831, 26130, -27807, -8581, -6551, -55435, -38652, 2409, 10167, -47477, 13772, -10536, -38968, 32441, 5042, -27272, -81540, -43307, -40276, -41814, -25746, 6172, -15252, -24279]
13061b4279K0095N6061M2543j06022m3040M8337m583k4029K2184m167J8577O496
13049H173o0059j5453K00j3592j1755L2457K3104K9219k6472k7607k0109P935
13037g3959J8109K8958j1181j1166N559J6451l8433l2048M5902K8606l0688j2721
13025f6611p9526l5932M8433l9400O6945J23628K0678k2030q4521m6959J2309
13014a02986K062r002L2692n4233n847K3250N9716N3153R054K7877j5362K5599
13002D5973m5383j2453L660j2115l6571O052M115k5967O417K7239j8835l042L7197
12989b3713J4859L9552J8527k0744p030P890j3577k2593q1069J9673J02556J9976
12977E4307k8027n905J007m0519K4106K8188j8782q984l261J1670K3426L6264
$$ y = [-24279, -4184, 51877, 94420, -11602, -54642, -6305, -10888, -34917, -12733, -16900, 1677, 8173, -51886, -67339, -67139, -80731, -92486, -60029, -36925, -7706, -34178, -61785, -81894, -73959, -55850, -26892, -38073, -49239, -43680, -27229, -65662, -97710, -51808, -23202, -53890, -66611, -146137, -182069, -133636, -173036, -106091, 17537, 38215, 16185, -68336, -115295, -102986, -100924, -109926, -77234, -131467, -137314, -114064, -54348, -1195, 7859, 35736, 20374, 45973, 590, -11863, -8203, -20318, -56889, -50837, -46722, -72689, -66272, -39033, -57868, -60910, -23713, -8854, 30698, 49225, 28481, 21451, 29341, 15764, -6829, -87898, -68225, 34331, 54307, 26280, 20375, 21382, -19137, 4969, 33157, 14375, 5391, 2130, 13800, 37226, 73490]
12965G3490l8249m2983l3953m1556l2492K153P1677P1405j8398n7254P846l4265
12953g2579j3751Q260L5566K7419K9133M1348l6925j2944J7274l7726L62J4959
12941C96k1226N7m541Q906J8307J6948K1407L9045j6314n6034p6648j5356N1932
12928c3121O5003j6858j6023K9135J5252k6935K8347L4119r130k9751n9470q4632
12916a04064j9318O2191Q485j512j424o106J3013o825Q3662L8692j0215m7865
12904H714M5465L564l49j5170k3613m6611j1712m0499K5369R403N5165P1378o8824
12891A2280m0469J9753J4028l6726M458O4983O286J9294k5277n9583q7919m304
12879a13196N1644K3741K2094n9284N0181j528J6448q520o494M4874P5250K3015
$$ y = [73490, 35241, -7742, -41695, -83251, -115743, -113590, -41913, 29492, 11094, -46160, -38314, -72579, -86330, -78070, -42504, -15085, 14048, 55396, 18471, 5527, 22801, -14925, -14563, 396, -20830, -20773, -25314, -16408, 1899, 18847, 40254, 79299, 62985, 6951, -69697, -85053, -33121, 31882, 15024, -999, 28136, 43388, 16453, 44800, 78919, 69789, 40038, -19432, -104064, -123382, -61191, -52706, -54218, -55642, -61748, -48735, -55560, 28102, 66794, 56579, 8714, 54179, 57743, 57394, 42224, 18611, -28000, -39712, -80211, -54842, -45439, 9726, 81104, 12280, -28189, -8436, 5592, -31134, -26676, 38307, 44593, 63887, 38610, -20973, -108892, -113196, -61552, -37811, -15717, -75001, -24820, -26348, -9900, -18420, -24914, 19960, 95210, 118225]
12867A18225N3528r39j444L037p3512k3126k2989M251m3773K2838n4690J6199
12855b395k2982p0140J0580P8042J0902p221q4k1N6704k9616n4190n2554l4507
12842a17482j1020R15N1208R68l9898Q026J379k9049Q865M4914M0063j6020j1733
12829f8864J2618m840p346j1361L6186k1463M1409Q329M6673J7788j4382o902
12817B7845O1678l3033m5127m4333n1767M6861N9055P168l1506K4035k7252J6753
12805A0377M6750L3084J0305k9611n6633o7232k8113Q54J2704N299O5720L9303
12793D2807M6997q3002n5718K4442K1585k1894J5494J6778r748Q022N40J8018
12781B4321j2098k6167n364N9504J2447k1915m2675k7721L8864j6570l0608K5275
$$ y = [118225, 171753, 170814, 169370, 172407, 98895, 75769, 52780, 57031, 13258, 36096, -18594, -2395, -25377, -95517, -84937, -6895, 4007, -3214, -3298, -3319, 53385, 23769, -30421, -82975, -117482, -128502, -127587, -76379, -75411, -115309, -107283, -105904, -134953, -126088, -81174, -41111, -57131, -68864, -56246, -61086, -68432, -79793, -43607, -65070, -23661, -15332, 31341, 49129, 34747, 27845, 89523, 56490, 11363, -32970, -84737, -37876, 21179, 28347, -3159, 20876, -6376, 10377, 57127, 90211, 100516, 70905, 14272, -52960, -81073, -80219, -67515, -62216, 3504, 42807, 89804, 6802, -48916, -24474, -2889, -24783, -9289, 7489, -2259, 5763, 6303, 24321, 12223, -13944, -19308, 40196, 52643, 30728, -11947, -39668, -804, -17374, -47982, -22707]
12769b2707n150J8762j4725m3842n2103m0160L2971M5447M6194M2936J5932l2511
12757h956o274O5072K9572l3221J5456j0731K8204J3084l325m7984o828K9133
12745F3202m2857k2269L0094m578m0087q302o7528k7974K4078O3759O3629M160
12733C5327l9752n1827N0175M8851r628l8308P868N1105J6187o4201l7030l9314
12721g0547j9958J0657M9642J190J0129o6912P333O9713L4790m7607n2880K6890
12709d7560M4424k1780m287Q767j554O6379j0652o781l883n6709R487N1814M1671
12696F9336l2970J6287k4053m0103k5411k607q797j754R7993j8952j9352n3108
12684d3491k7738K7287L7317R087K453m7570O9520P0974l6486o2239K6828N8992
$$ y = [-22707, -27857, -9095, -23820, -67662, -119765, -159925, -126954, -81507, -35313, 7623, 23555, -8956, -15230, 49842, 79414, 46193, 61649, 50918, 79122, 92206, 88881, 40897, 34069, 63202, 20345, -1924, 28170, 23592, -16495, -24797, -92325, -120299, -96221, -32462, 31167, 35327, -4425, -56252, -6077, 42774, 33146, -5162, 2706, 53811, 69998, 5797, -31233, -70547, -90505, -79848, -30206, -29016, -18887, -85799, -78466, -8753, 26037, -21570, -74450, -47560, -3136, -24916, -29203, -20436, -21990, 44389, 33737, 26956, 23073, -33636, -24149, 27665, 69336, 36366, 52653, 28600, -11503, -36914, -39521, -48318, -50072, 47921, 28969, 9617, -43491, -71229, -43942, -6625, 2462, 4915, -42655, 26865, 97839, 61353, -886, 25942, 84934]
12672H4934k0239N9675j9205J6460j2131o6075o7160j5641j1261L4596M5988o7863
12660c7922k5457K2776M5020L6765l3311m1221j6315J902J1417j7108k4277l8568
12648a16299K1448N3556K6181L8242L5953L7245k8883q0916m5960O2739k6418
12637b3112l349K8491q296K5299q933l1936k5460l387k4006R373J1569M9336L8649
12624C4238k2302l1191J0585O3577j6372l4048m7904K3080J5929K2239q922k1202
12612a2293j6191j9529N187k026j9132N6949k9478j1648O0696q448L8596L7551
12600H0234n3506j2551M0157n1071r5291o8356Q8280Q4553L6620j7430j1361p868
12588A2410J9228M132m3634k0739K0168m0939p8410J0443O6479J7008R434m1226
$$ y = [84934, 64695, 124370, 105165, 121625, 109494, 43419, -23741, -39382, -50643, -16047, 29941, -37922, -63379, -40603, 4417, 41182, 7871, -33350, -49665, -47763, -36346, -53454, -77731, -116299, -94851, -41295, -15114, 23128, 59081, 96326, 67443, -13473, -59433, 3306, -23112, -26461, 2030, -6266, 19033, 10100, -21836, -47296, -50683, -74689, -65316, -53747, -4411, 34238, 11936, -19255, -8670, 54907, 38535, 4487, -43417, -20337, -4408, 17831, 8909, -12293, -28484, -48013, -42826, -44852, -63984, -7035, -36513, -48161, 12535, 4087, 42683, 80234, 26728, 14177, 54334, 3263, -92028, -160384, -72104, 12449, 49069, 31639, 20278, 12410, 31638, 35770, -7864, -28603, -8435, -49374, -127784, -117341, -50862, -33854, -24420, -65646]
12576f5646M0970O5704Q098k8570l2337M662K3190k0161n268L6419L9003m9528
12564A6536n9949R644J3550M5346j0369m6110J4859M5440J9941p698j4723o4618
12552c8151k2535L2845N8374l8586j6360J9058J2234j5874j9568K5259j0910k5249
12540c9463O488k5194J6129K1217k7477M7494K6376J5630m5546j2634n6897k3835
12528i7712k765Q7901m0961k8616L0718Q35j3621j2976l125n7882R8595k421m8934
12515i0964l4320K652L5255N9790J3582J9224M0862k0921o551r447n6335j0647
12503e7820P179O8123r439j9386r38l4681P139q787L8050K9058j1716p516k0860
12490b1594J3824M3730l4412k3478J1466r786K8304L1257K8330m1979n6870J1487
$$ y = [-65646, -24676, 41028, 49126, 20556, -11781, -7119, 16071, -4090, -9358, 27061, 66064, 16536, -43413, -33769, -20219, 25127, 14758, -31352, -16493, 28947, 48888, 41190, 26467, -38151, -60686, -27841, 30533, -8053, -24413, -5355, 6879, -8995, -28563, -3304, -14214, -39463, -32975, -58169, -42040, -20823, -48300, -806, 25570, 41200, -4346, -16980, -73877, -97712, -100477, -12576, -53537, -82153, -51435, -50600, -64221, -77197, -80322, -138204, -39609, -42030, -90964, -125284, -122632, -87377, -27587, -14005, 5219, 46081, 25160, 18609, 9162, -47173, -57820, -50641, 17482, 8043, -11343, -12281, -46962, -39823, -48610, -10560, 18498, 6782, -734, -21594, -7770, 35960, 1548, -21930, -10464, -20250, 8054, 39311, 67641, 25662, -31208, -19721]
12478a9721j8940L0082O7119K4906j9035n8034l7220j7725O0220Q586r631p730
12466B877L8104l4977O082M7205K8653j9373o0817n5590n5333K0825Q191K6175
12454d7978j0969k3218M886J181L6497J8235R031k8895M5769J2754p599p440J5677
12441A7931p618n3993q931L705r828l8828J117O0894K0952L8772J1456J0980n1537
12428d928O448m3017J7593L9991l4299n8198q637J4480j8138J0611P77j4285K9554
12415f2048M0844K1586K3871K0560k0796K7651k8250m0247J1428P5071k5723m7762
12403c815o100k6368J4819o27J2453l901P719K0786m0221q0913M9878K2422M9528
12390A5660K0009k0610Q221R886k6382l4717L9061l6500n091r775K4838Q1696
$$ y = [-19721, -38661, -8579, 58540, 83446, 64411, 6377, -30843, -48568, 11652, 20238, 10607, 2877, 40981, 6004, 12086, 59291, 87944, 68571, 7754, -47836, -103169, -82344, -74153, -47978, -58947, -82165, -77279, -76098, -39601, -21366, -12335, -41230, 4539, 17293, 9694, 2254, 17931, 10313, -43680, -52611, -48906, -58734, -97562, -96445, -35551, -14599, 24173, 35629, 46609, -4928, 1520, -41497, -23904, 16087, -18212, -76410, -85047, -70567, -88705, -78094, -77317, -91602, -62048, -21204, 382, 24253, 44813, 24017, 51668, 23418, -16829, -5401, 69670, 43947, -3815, -9915, -36283, -21464, -22091, -9638, -13539, -5820, 14966, -25255, -106168, -56290, -33868, 15660, 35669, 15059, 23280, 33166, 6784, -27933, 11128, -25372, -30463, -40238, -15400, 66296]
12378F6296M8920l8931p6339m8013R740K6320K8906l6536n0944L4742K2962L0120
12366A7243m4956o1283J9355J393n067K5426P2258o342k3022M5155j5394l0454
12354e688l7677L307j1815Q606j5285J9188N578l0224L330L2305j3631K610J1700
12341b7696O696j6955j3021l234q03l1880r120k2838P798N1113N9189J9980n100
12328A4129l5427P2236J0064j4422j3754m4009J4221l4891L2024l1493j2948n0017
12316i4287L9215L5771J3488K8875r044j0098m8031L787M6492M2890j1099n8308
12304b0349k5148J0625N634o240j2217j985j458q3593J9900N7217O9443L782m67
12291A5144j9473j7828L105K5183j463l6672l0908k7182M5103n835m1287P8869
$$ y = [66296, 115216, 76285, -54, -48067, -38327, -12007, 16899, -19637, -70581, -35839, -12877, 17243, -27713, -88996, -69641, -68248, -73315, -47889, 24369, 18027, -4995, 40160, 24766, -5688, -43365, -40058, -51873, -43267, -58552, -39364, -33786, -64010, -60680, -28375, -42006, -39396, -27696, -21000, -37955, -50976, -54210, -55013, -86893, -96013, -118851, -111053, -59940, -751, 19229, 14129, -21298, 50938, 61002, 46580, 32826, -11183, 3038, -31853, 171, -31322, -44270, -94287, -55072, -19301, -5813, 23062, 14018, 3920, -44111, -40324, 6168, 49058, 37959, -20349, -45497, -34872, -29238, -35478, -47695, -49680, -51138, -134731, -114831, -57614, 11829, 15611, 15144, -4329, -22157, -19052, 6131, 4668, -32004, -62912, -90094, -44991, -50826, -92113, -13244]
12279a3244J5391o502n5874J341n0423j7638K5287J6909l0069L1977M4520N0433
12267A2108q3471l8326K9229N3594J6459r900K342K2184j1156J3969n069k4215
12255b2252l8453k1097k0470L0215L6949L1339J1895j2623p454k4314n076J8071
12243b3270J3896K0363l1198l9296j3310j3642N6783N60L4459j6862J9257M3092
12231E0832p3300o1851J4468L2663j4331k2894K8044J7516o0318k55O811K6810
12219e5805K9752K7906j8769J2739n7249n5683L0209J9832K7523j2667K0441M421
12207b7350O6231j8682j7585R05L3m1352p0114O77M9944j0261O3874N6438j9755
12194C3003j8200l3649K4548R3074J0856j24149n4798L4641J3113q872n7102J649
$$ y = [-13244, 2147, -4355, -60229, -58888, -109311, -126949, -101662, -84753, -114822, -82845, -38325, 12108, -71363, -109689, -80460, -26866, -10407, -20307, -17965, 4219, -6937, 7032, 1963, -22252, -60705, -81802, -102272, -72057, -35108, -3769, 8126, -4497, -11951, -36265, -41341, -23270, -9374, 10989, -20209, -59505, -72815, -86457, -29674, -29114, 5345, -11517, 7740, 50832, -22468, -84319, -69851, -37188, -51519, -74413, -46369, -28853, -89171, -89426, -82615, -55805, -26053, 1853, -16916, -4177, -61426, -117109, -86900, -67068, -39545, -52212, -31771, -27350, 38881, 20199, 2614, 3519, 3552, -37800, -107914, -107237, -57293, -67554, -3680, 52758, 33003, 14803, -18846, 5702, 98776, 109632, -14517, -69315, -34674, -21561, -30433, -87535, -85886]
12182h5886K8834L3814K3094o6834k6083N8018J2485N4868m7993N115j5578j0709
12170c6855k0294J8936j1297l338L2204k9060L2722L5650l0675j9288L1968j4536
12158a3863n3945l944K2023L9930O968P8524J9742l2365r5666m1788M3295J1582
12146a9507K08l766j8638j0611J3613l3139k6276K7320L9724K6091O647J4243
12134A5909M5413j5189n560N230k671l8391r2148n089O8677L7095L5953M1878
12122I1107j0721O867L984J0050j4585L5043P617m4146q369n2269l8287L0025
12110A6316l6959n4029M2432K1711l4469l2187k9054o3554l2990J35303P3111
12099E631j6458L4307M1475J3600j8919p180K2266K334n5495k7284m8729k0334
$$ y = [-85886, -57052, -23238, -144, -66978, -93061, -35043, -22558, 32310, -15683, -10568, -26146, -36855, -57149, -38213, -49510, -52848, -20644, -49704, -16982, 18668, -12007, -31295, 673, -13863, -67808, -71752, -49729, -9799, -2831, 75693, 95435, 63070, -32596, -74384, -31089, -19507, -19299, -23065, -41703, -52314, -38701, -71840, -98116, -70796, -31072, -4981, 1666, 15909, 61322, 46133, 40573, 45803, 43132, 4741, -87407, -92496, -23819, 13276, 49229, 91107, 80386, 87253, 91237, 101287, 86702, 121745, 129362, 85216, 76847, 24578, -13709, 16316, -20643, -74672, -32240, -10529, -44998, -77185, -106239, -169793, -202783, -67480, 5631, -10827, 23480, 64955, 78555, 59636, 52456, 74722, 77056, 21561, -5723, -54452, -74786]
12087g4786N1493O637J3083o453k1085N5702L4469q72O7687j2812m7849m0631
12075B4583J6773l9152n4791K8532j40p8684M4069P5132M4968o195p7401m9299
12063g1605j9922M2115M4287K1278k8949l3526J9337m4022N9700R6105M8549j9335
12051A14012q3087r4343k3315Q4127P5020j898l6617m4998J8591K2413J9031k1781
12039B7155k9313K1380M4817l4783o8634m121K2506k4305j7032P7400l5516p0830
12027i1276O7062K9242M0888J7158j7777j9291l811J8046k8046p190L834l8808
12015b9969l9758l444n0313M7989L1614r019J6522P670K4570n849l2329j7792
12003f0108k8802k9737J5286M4412J5307K3015j7626P595N590j787K8647J4101
$$ y = [-74786, -23293, -16656, -3573, -10026, -31111, 24591, 59060, 58188, 125875, 113063, 65214, 24583, 41356, 2204, -52587, -24055, -24195, -102879, -58810, 16322, 61290, 55095, -22306, -71605, -91527, -49412, -5125, 16153, -12796, -46322, -26985, -71007, -11307, 84798, 133347, 114012, 30925, -63418, -86733, -2606, 72414, 70516, 33899, -11099, 7492, 29905, 48936, 27155, -2158, 19222, 64039, 29256, -39378, -43499, -20993, -45298, -62330, 15070, -20446, -91276, -24214, 5028, 45916, 63074, 45297, 26006, 22195, 40241, 12195, 5005, 8839, -29969, -69727, -73171, -123484, -75495, -43881, -52900, -36378, -28708, -4138, -9987, -42316, -60108, -88910, -118647, -103361, -58949, -43642, -20627, -38253, -30658, -25068, -26855, 1792, 15893]
11991A5893n3896L0031M0747m2210m8189j6484k8250j4020K6411P7006Q055j96
11979e102J6253k2195k7802R47j9819n4275K5792J8408O5260K5923K4791k3192
11967B4989k3142N0978K5456p4068k8290j978j8072j0684j0902J3514k0583j0175
11955h2957m196n7715O791O1162q922J352k7799M5103K0801l9504J1772P5749
11943A637M8429p1770j2850J4923k1670n5343L5300M0383j4471l820n0227n5628
11931a45107Q9005J8077m4456O7803N949l7026K6390N9940P060j1862J6791l2602
11919A9962n8132l8176K8496J3399j8036n225N4727K9156j0086j8818k1501J1287
11907a2947j4879k9394K0445J3677j4247K7232Q125j4397M7865l9514l8609j7984
$$ y = [15893, -38003, -7972, 32775, -9435, -57624, -74108, -102358, -116378, -89967, -12961, -4906, -5102, 11151, -11044, -38846, -37899, -57718, -111993, -86201, -67793, -2533, 23390, 48181, 24989, 1847, 52825, 78281, 4213, -24077, -26055, -44127, -54811, -65713, -52199, -72782, -82957, -87153, -144868, -138077, -76915, -85837, -84485, -112284, -67181, -46380, -85884, -74112, 1637, 50066, -21704, -34554, -19631, -41301, -96644, -61344, -20961, -35432, -39252, -89479, -145107, -56102, -38025, -82481, -14678, -8729, -45755, -19365, 40575, 47635, 35773, 52564, 19962, -38170, -76346, -47850, -34451, -52487, -57712, -2985, 26171, 16085, -2733, -24234, -12947, -27826, -57220, -36775, -23098, -37345, -10113, -1988, -16385, 31480, -8034, -46643, -64627]
11895f4627Q862m3044k5873N8516J7438M078m9994L094N5169L1221J347M6762
11883D2949N328p0134k8276J7324j5209j4119M7250M5367J2433j461n9486q7046
11871a05080o969M3076R8162J3166j7129o1233n696J7733M1449M6513K3031k1650
11859F5373m2390l4797k7554J4412N3600J2503J5707L2216P407j8534l4502l2913
11847A0528K032O0059O9089l6459l6076p697k3354m4376n0753N2399L6877k644
11835B9625l1979l2537k4930m4610K0775K6837M712r974q549Q841P4213p533l2407
11822b7516p373L0247k0821o902K8956o028r4160n3125K6993O5688J32485k8000
11810D0444m8372P902n8454m4244L1519N3580o193n0883R327m6246J8883M4144
$$ y = [-64627, -55765, -98809, -124682, -66166, -48728, -44650, -94644, -91550, -36381, -5160, -3813, 42949, 48277, -21857, -50133, -32809, -48018, -62137, -14887, 30480, 42913, 41452, -18034, -105080, -112049, -68973, 29189, 42355, 25226, -36007, -41703, -23970, 17479, 63992, 87023, 65373, 22983, -11814, -39368, -24956, 28644, 41147, 56854, 89070, 96477, 77943, 43441, 10528, 12560, 72619, 141708, 105249, 69173, 61476, 38122, -6254, -57007, -4608, 32269, 29625, -2354, -34891, -59821, -104431, -83656, -56819, -52107, -62081, -70630, -61789, 12424, 4891, -27516, -34889, -4642, -25463, -32365, -3409, -9437, -103597, -156722, -129729, -64041, 68444, 40444, -7928, -26, -58480, -102724, -71205, -17625, -23818, -74701, -65374, -111620, -92737, -48593]
11798d8593j616N8389K6591Q9610l0908m7186M2410p249n6438k3376r952m9947
11786e8265k2593R677K4957N307J7014L2940Q8127j5430p6836M67J0526K1851
11774C7742l9056j0117O3239J2031k2653o142k5913M6629j9968m340j8922l6645
11762b4115j9293j8137J1792j4492l8176J8697J0237N4939k5241o1861j3402M2584
11750g6468L7418J8448J6852N870p860P31J4208n9318m3605O9703J4980j7673
11738b6714K8041l2254M0627N8079j995k1918k4032m2319j5482M0519K6324l7877
11726i001n8368O801L1132O924K7132r9568k5206K3259j0493K7422n524K5430
11714f0060P7905P9194j7026n8427m0044K5437k4486L2543K9055j6357j9603n2339
$$ y = [-48593, -50209, 8180, 34771, 124381, 93473, 46287, 88697, 81448, 25010, 1634, -8318, -58265, -80858, -71181, -46224, -40917, -23903, 9037, 97164, 81734, 4898, 5365, 15891, 37742, -1314, -11431, 51808, 63839, 41186, 35044, 9131, 55760, 35792, 31452, 12530, -24115, -43408, -61545, -49753, -64245, -102421, -83724, -73487, -18548, -43789, -105650, -119052, -76468, -39050, -20602, -3750, 2120, -5740, -5009, 9199, -50119, -93724, -24021, -9041, -26714, 1327, -30927, 9700, 67779, 65784, 43866, 19834, -22485, -37967, 2552, 28876, -9001, -67369, -60568, -29436, -22512, 4620, -94948, -120154, -96895, -107388, -79966, -85490, -60060, 17845, 97039, 80013, 21586, -18458, 6979, -17507, 15036, 44091, 27734, 8131, -44208]
11702d4208k9230M5295J1178m5444k2065j5153m036R932J8358M4946Q0713P279
11690E7565l0976n7523k5710m3913J5821M0078J1146M436m192n2057K5957O0286
11678I18R150L6491J8101m9976r2165J2785K1474k2571J4094J3002J1793L1610
11666D706L6328l493m217l5450l5536L699J2058Q400J8835k1008k000k8172K9377
11653a6473J9603j0304K2069J4202J6304j7694l4117n9221R424N7815K0686R272
11641C1566k5020l9061K9729J2565m1750J1212k52J3589o813k7019p2928m7597
11629a61779J043O5646Q6152M6761k2492m4257l8925m7611O1004O3991L2098k5294
11617A6337l924Q3537K2592n2182k5617j7452M275K9131q907J2845n0370j5724
$$ y = [-44208, -73438, -28143, -16965, -62409, -84474, -99627, -103663, -93731, -75373, -30427, 50286, 57565, 26589, -30934, -56644, -100557, -84736, -44658, -33512, -29076, -33268, -85325, -59368, 918, 10068, 46559, 64660, 14684, -77481, -64696, -43222, -65793, -51699, -38697, -26904, 4706, 41034, 37541, 33324, -2126, -37662, -33963, -21905, -13505, 5330, -15678, -17678, -45850, -16473, 3130, -7174, 14895, 29097, 45401, 27707, -6410, -65631, -56207, 1608, 22294, 31566, 6546, -32515, -2786, 9779, -31971, -20759, -21011, -7422, -14235, -41254, -114182, -161779, -160736, -95090, -8938, 37823, 15331, -28926, -67851, -115462, -54458, 9533, 41631, 16337, 12413, 95950, 118542, 66360, 40743, 23291, 27566, 56697, 47790, 60635, 10265, -5459]
11605e459L9470q049l2931n744m9664j7079N080K1852O3986K0644L1838M4291
11593A08235p3216o3076J4026j3508n0327m7451K5378M0403m4875m6267P3947
11582g6731P8506K1665Q669j1525K550J4031l0507O6219J0024n4900m0698k620
11570a5317K7659K7395n194K9263j1451p1192n4781j4727k17N2227k7942k4913
11558h9190M8300R036k8536m391K0732L0226O3139k5758O162l8283Q204L6916
11546C6557n2456k5077P484L8461n110p393L4798O561j8579j174L0092M1386j3407
11533G2143m2403k0631k649O6107N1198j6305q8934M002J488n6491j995L2909
11521a561J0959l9783K1432n107m1520J2173J5736N717J0884j0517m47l1506M0981
$$ y = [-5459, 34011, 25962, -6969, -12713, -62377, -79456, -74376, -52524, 11462, 32106, 63944, 108235, 35019, -28057, -14031, -27539, -77866, -125317, -99939, -59536, -104411, -150678, -76731, 1775, 23440, 32109, 20584, 23134, 37165, 6658, 72877, 82901, 28001, -12697, -15317, 12342, 39737, 34543, 63806, 52355, -18837, -73618, -88345, -88562, -36335, -64277, -89190, -40890, -31854, -60390, -64781, -44049, -13823, 49316, 23558, 29720, -8563, -359, 36557, -15899, -40976, -33492, 4969, -141, -7534, 27264, 33825, 15246, 14072, 44164, 85550, 72143, 29740, 9109, 6460, 72567, 123765, 107460, 18526, 22528, 24016, -32475, -34470, -1561, 9398, -30385, -8953, -14060, -55580, -43407, -27671, -21954, -11070, -21587, -22034, -53540, -12559]
11508a2559K9642K0315l4811r609j010l7650o9640J1126M8693M4157L0126L1139
11496D9919L5022q6635j2059L1469J4040l1503N0437N4889m4752k4206Q88O1413
11484I8922m6328l4467M2171o0340r971N715Q2097j2305l6722k4118P0428K3402
11472I8484j0091m598p119m5443L0003N5346k6734p8395J876R18k496K1166k8080
11459D837j14M1026l0105L8329m4406p058L9983J0166p2933k8106J127k1785k0912
11446h9951L2142Q2272K7113M750K359l1310J2556k3859K0321L1305k3931k4036
11434A9731o226n6684J435L9221q994j4352K9926L8340O7376l6901k4397m9523
11422a048l8829P842m2160m1763K6340L7985K9705o955j6765K0403J601J6179
$$ y = [-12559, 17083, 37398, 2587, -7022, -8032, -45682, -115322, -104196, -55503, -11346, 18780, 49919, 84941, -1694, -13753, 17716, 31756, 253, 50690, 105579, 60827, 36621, 37509, 98922, 52594, 18127, 60298, -42, -10013, -4298, 77799, 65494, 28772, 4654, 75082, 98484, 88393, 83795, 76676, 31233, 61236, 116582, 89848, 11453, 13329, 14247, 11751, 32917, 4837, 4723, 45749, 15644, 53973, 9567, 2509, 42492, 52658, -20275, -48381, -47254, -69039, -89951, -57809, 24463, 51576, 56326, 58685, 27375, 39931, 16072, 36393, 67698, 43767, 19731, 13505, -43179, -41744, -2523, -11517, -25869, 4057, 42397, 109773, 72872, 48475, -1048, -39877, -32035, -74195, -115958, -89618, -51633, -21928, -28883, -45648, -25245, -23644, -7465]
11410g465N6938J8795q283j1929j2573L1206j9168p9840m7700n4868M4502M7677
11398d2708O7711N3709K3582l5721M6774j1742m8929n6054j2211K9559J0503l7131
11386a2658L974J3781J8465K7277K0388K4620n061k8054m8213j9272N801K730
11374C778j7776l5519j9829J6973L9741l8173j1221J0132p872K2067R300J2604
11362a5795j8442J8336P974K502o7153q487n505N0613J09j0537j0331J671Q144
11349d6901j5533J1455K9021K7462q075k0348K5638k5091n589O7877J8497k9059
11337B9354J2155n794k4915Q244K8477j6668L3628j5247m5825p8269k0595N4776
11325d0679J0171m0022l5091k8380K3150M1519j0415j199q037L9594K9128l2617
$$ y = [-7465, 49473, 68268, 59985, 48056, 35483, 66689, 47521, -32319, -80019, -134887, -90385, -42708, 25003, 78712, 102294, 66573, 113347, 101605, 52676, -3378, -15589, 13970, 24473, -12658, -8684, 5097, 23562, 50839, 71227, 95847, 90786, 62732, 14519, -4753, 1048, 3778, -13998, -49517, -69346, -52373, -12632, -50805, -62026, -51894, -59766, -37699, -28399, -15795, -34237, -15901, -7927, -5425, -72578, -81065, -86570, -35957, -35848, -46385, -56716, -55045, -46901, -62434, -50979, -21958, 5504, -2571, -22919, 2719, -22372, -27961, 39916, 58413, 29354, 41509, 35715, 10800, 19044, 47521, 30853, 64481, 49234, 3409, -74860, -95455, -40679, -30508, -70530, -105621, -134001, -110851, -69332, -79747, -80946, -88983, -49389, -20261, -52878]
11313e2878n8732K6866O7449P1284J3469l6818J1950k8369J725J2524m6778n3120
11301g1428J5051O9362J6840k1659L0381K9399l370K4543o569L132O042l5999
11289E5725p5644k6280N6495K4284J2916q976j3561J490r178m3562n673j9129
11277e1093r579m635K2210j1178n727N0053N3521m9526p1925K3660K256M6140
11265e823M8151O343L65L6006j6641m8147R386q161p5554o264K9286k6455l1450
11252h8958o0949L0675N4271L4710L6377k6731k289M9136J4997j8786k3760J260
11240d7K8600j3600M0696M683M1212n547k3006l4312l6399O7669J8120p1197N963
11227B2835M4827J2451o322P100k0931j2197l9489o7690j4953l2347m5854K9241
$$ y = [-52878, -111610, -84744, -17295, 53989, 67458, 30640, 42590, 14221, 15946, 28470, -18308, -71428, -56377, 12985, 29825, 8166, 38547, 67946, 64576, 89119, 82550, 85682, 91724, 55725, -19919, -46199, 10296, 34580, 47496, 38520, 24959, 26449, 17271, -26291, -31964, -51093, -60672, -65307, -43097, -54275, -60002, -9949, 43572, -5954, -77879, -54219, -51963, -5823, 42328, 48671, 49036, 85042, 68401, 20254, 29640, 21479, -54075, -60339, -31053, -57508, -88958, -149907, -119232, -64961, -30251, 6126, -20605, -22894, 26242, 41239, 22453, -1307, -47, 28553, 14953, 55649, 60332, 101544, 95997, 72991, 38679, 2280, 69949, 88069, 16872, 22835, 67662, 80113, 73791, 80891, 59960, 47763, 8274, -59416, -74369, -106716, -152570, -123329]
11215a23329L2013O3793n106k946L6238q748N5598N3813K1071n610m0178J4089
11203I0698K5298L158k7180m2048o9178N6847O1148n6602r3696k6080P3858J0013
11191F236J9113R5987k7935p3822j4878l766j365l6305o090l4016J3195M6357
11179a7289L4076P626l2787m517K3303m217k0226m523K0008R333M1111j0781k1847
11166A9270m9134k1138J7875n687L58K5114L5878K9008r707J4266K15p3945K9515
11153A1888j4702k8122J6915o052m7110m6632o32R0467K6513l2465L623n6380
11141h2689P9190O3666m4694n0430J8666P7241P7923j6163j19389n2559l061O2167
11129I868K0625m881p703m6239j4695N6723j5800J4702j4416p4472N6739M7609
$$ y = [-123329, -91316, -27523, -32629, -35575, 663, -8085, 47513, 101326, 122397, 116787, 76609, 90698, 115996, 119154, 91974, 49926, -19252, 37595, 98743, 42141, -51555, -77635, -3777, 6236, 25349, 121336, 93401, 19579, 4701, 935, -430, -36735, -42825, -76841, -63646, -17289, 16787, 24413, -8374, -12891, 10412, 6195, -14031, -18554, 1454, 10787, 51898, 41117, 19270, -29864, -51002, -33127, -38814, -38456, -13342, 22536, 51544, 41837, 56103, 56318, -17627, 11888, -2814, -30936, -14021, -20073, -67183, -113815, -114447, -23980, 2533, -29932, -26309, -82689, -3499, 60167, 15473, -34957, -16291, 60950, 138873, 122710, 3321, -49238, -52299, 9868, 30493, 25612, 17909, -28330, -43025, 13698, -2102, 12600, -1816, -76288, -19549, 28060]
11117B8060k8986r834K4526M4609l7070p8532J0917P694K163J5947P124k9037
11105d2419k6513n4840l7369Q07N5188N544m9846M7912M2977J1667J6626K2795
11093g471j7969o0853P761N6372K2909k9730K3496k9337l7329P1549L9077j91
11081C8284J1823j9850n557J6948l5916L8352O649m0534M7402m6416n0849L553
11069c6111k714N0497N5224j0318p9951j3096o340k425o111j2104l2150M6421
11057d9178P6851l3616o6736K4048K5843K7540M2079k3002k8288m2119K9880K1378
11045D680l7875p0793k6260M2793L1314K3258l7107o527N9255M6957O6196P402
11033A03293k8313p7753j2735k2617M6931J5082l6043R564J7839l0875n4012j3993
$$ y = [28060, -926, -10760, 13766, 58375, 21305, -57227, -46310, -38616, -36453, -20506, -13382, -42419, -68932, -123772, -161141, -160334, -105146, -99602, -149448, -101536, -58559, -46892, -30266, -7471, -25440, -86293, -78532, -22160, 749, -28981, -5485, -34822, -72151, -602, 38475, 38284, 50107, 30257, 24700, 41648, 5732, 44084, 50733, 10199, 57601, 11185, -39664, -36111, -38825, 11672, 66896, 56578, -23373, -36469, -42809, -45234, -51345, -63449, -95599, -49178, 27673, -5943, -72679, -48631, -22788, 4752, 46831, 23829, -4459, -46578, -16698, 4680, -33195, -103988, -130248, -87455, -56141, -32883, -69990, -76517, -17262, 29695, 95891, 103293, 74980, -2773, -15508, -38125, 8806, 23888, -12155, -2591, 15248, -15627, -69639, -83632]
11021h3632O4835N939m0663n927j1236k0882k1700J7053m834K588M3323P1893
11009A6757j8341K3942P9342J6294L0553q8202n6406K5862K1634P6070j1003j7185
10997I9317l8492K4462K8198j6461l9027n2113N520J2882n1987p429M2302J9542
10985B6714k168L5472J978m7542O207M0581O8920Q3379l0817j03409n6330l0290
10973g305L8060O1084J0857k7753q6271k9048L3666R6044J8736j3752K712L0839
10961A27869L6646k6012l1726n6491J2805J7849J4898m9477l538K4861l5837m0107
10949h260l7490L1999M7163Q773J3805n315m1675M7153O734n9443j9837L4985
10937A8592P897r716j9422j2936j7169N7043N713m9039M6014j083j136J0964r487
$$ y = [-83632, -18797, -12858, -53521, -59448, -70684, -91566, -113266, -96213, -101047, -98459, -55136, 16757, -1584, 22358, 101700, 117994, 148547, 60345, 3939, 29801, 51435, 127505, 116502, 99317, 60825, 85287, 113485, 97024, 57997, 5884, 11404, 24286, -27701, -35130, 7172, 26714, 24546, 60018, 61996, 14454, 20661, 61242, 130162, 213541, 182724, 79315, 22985, -7305, 30755, 91839, 102696, 74943, -11328, -40376, -6710, 89334, 108070, 94318, 97030, 127869, 164515, 138503, 106777, 50286, 63091, 80940, 95838, 46361, 42823, 67684, 31847, -8260, -45750, -13751, 33412, 42185, 55990, 50675, 9000, 56153, 62887, 3444, -16393, 18592, 26489, 16773, -2649, -15585, -32754, 24289, 30002, -19037, 26977, 25894, 24758, 35722, 26235]
10924B6235j2421j650N4067M7413k5512J9380j0728j4861k4583q3272j1993J333
10912c6592n903l285m1677O526J8732j345L0041L536J4921r182j6809j385J5709
10899b6713J4158M5231J3637q095J0669o0001m2663L3329J2850J6750p4906k6117
10887i1871L7257K0847L8855K0001p944j5920K4182L2813J1507k1745l1407q2310
10875f5735K0900k2226k4700l0316J0603J6928K2135P7343L059J451J905m7375
10863c6028m255L3114M1276k9654L9324N9681N5791n9237m3176o2638k0361L5420
10851I257P696k797L5899k7181n3347j0746L8982L017m7193J0743L2054K6233
10839B2617j3980M4799K5091p772k6846M6816j3591k2785j2850q303P3355l349
$$ y = [26235, 13814, 12164, 66231, 113644, 88132, 107512, 96784, 81923, 57340, -25932, -37925, -36592, -42495, -45780, -87457, -80931, -62199, -63544, -33503, -29967, -15046, -24228, -41037, -42422, -26713, -12555, 32676, 46313, 38218, 48887, -11114, -53777, -20448, -7598, 9152, -65754, -91871, -54614, -33767, 5088, 25089, 17145, 1225, 25407, 58220, 69727, 47982, 16575, -65735, -44835, -67061, -91761, -122077, -111474, -94546, -72411, 4932, 7991, 9442, 11347, -36028, -40283, -7169, 34107, 4453, 43777, 103458, 159249, 100012, 56836, -5802, -26163, 9257, 16953, 14156, 50055, 22874, -30473, -41219, -2237, 780, -46413, -35670, -3616, 22617, 8637, 53436, 78527, 70755, 43909, 90725, 77134, 54349, 41499, 33196, 106551, 103202]
10827A03202j7025p123j0877r1347l6772P1289N8118J4607k5700p579l7626K923
10815A6090K4271J6907k6929k3411j8119R516M6388J3475j4248n4188R497L3264
10803C2513j4845p020L279k0405n5438J2959N1164L8975m000m443m901o8239k5132
10790f5533Q0871L4578J4208j8868L020J3880m496l3634J2952K991j3330j2144
10778A4495J560N220N0460J1541K8806K2955k240O074j8650l1430k0926m0896
10766B6969n8208j1200O4439K1456k3699J5625K0239J1655k5070j4549J1570p917
10754C1310L3156K9720j6119K2706J337q3167m4404L5728O5254L4213q811m3465
10742E7458j3528l9834L6138J8307j1996p180K4174K5136l0153m7954O774K8788
$$ y = [103202, 86177, 79054, 68177, -23170, -59942, 11347, 69465, 84072, 58372, 50793, 13167, 16090, 40361, 57268, 30339, 6928, -11191, -1675, 44713, 58188, 43940, -10248, -751, 32513, 17668, 10648, 13927, -6478, -61916, -48957, 2207, 41182, 37182, 32739, 27838, -40401, -65533, 15338, 49916, 64124, 45256, 48276, 62156, 57660, 24026, 36978, 39969, 26639, 14495, 16055, 21275, 71735, 83276, 112082, 135037, 132797, 138871, 120221, 88791, 67865, 26969, -31239, -42439, 22000, 43456, 19757, 35382, 55621, 67276, 42206, 27657, 39227, 31310, 64466, 94186, 78067, 100773, 102110, 18943, -25461, 10267, 75521, 109734, 100923, 57458, 43930, 4096, 40234, 58541, 46545, 39365, 63539, 88675, 58522, 10568, 17342, 46130]
10730D6130K2585j0553l474r202J4912l5731n9056Q770Q907k2745N7865j123l1073
10717a3788m054m243j0937n8998j7855L1427L8515M7651m3760L2013J3987P940
10705A7898K3672R184Q3837l5693k8830m4465l4992l8144j361L3772J6709L8910
10693D0497J2528j8186m693K0621L3055p0425l0821l4366N7473K388L5946K0683
10681F4700O0324k7132m860K4075J021j1396j2249j1982L3139R71j9678l5730
10669F1203o887j0977k3571K9066R394J5654M8160P925M285J6697m2996j2282
10657I5671L6170j7057j6058j6917O9950M3596k7473n0413j8127Q6161k0309k5452
10645A39742j2821M4718k514n2047m3065p0179n5862P446K2739L2407N7074m1709
$$ y = [46130, 68715, 58162, 54688, 45486, 60398, 24667, -34389, -25619, -16712, -39457, 18408, 17285, -13788, -17842, -22085, -33022, -92020, -109875, -78448, -39933, 7718, -36042, -4029, 9958, 17898, 41570, 50754, 134591, 98898, 70068, 25603, -9389, -47533, -48894, -15122, 1587, 40497, 53025, 34839, 30146, 50767, 83822, 13397, -17424, -51790, 5683, 8071, 44017, 64700, 125024, 97892, 93032, 117107, 118128, 106732, 94483, 82501, 115640, 116611, 96933, 61203, 54316, 43339, 19768, 48834, 58228, 73882, 122042, 129967, 134252, 150949, 107953, 95671, 131841, 114784, 98726, 81809, 151759, 195355, 167882, 117469, 99342, 185503, 165194, 139742, 126921, 171639, 169125, 117078, 74013, 3834, -52028, -44582, -21843, 10564, 67638, 25929]
10633B5929L2913p977J1169k2823n5689L872K6880q360l3615Q8498N5157m8312
10621F7642j6241M2058K9404o4039j4178J8069N2173q642J7446J776j0128L1042
10609A46382m7322j4343N6392L31M166m014o2723n0218p550p093K2522K8249J9152
10596H3931L2252O1139O801n8n4254m4858l4628J7790l4449M092J2337j6524m5333
10583a1762l7157Q531N5814N1464K2005L7755J9980j8404m4027m905K3228L2112
10571A34634Q8920j2582p3177r154K6043l7323k8183M3045m483J6191K6995K60
10559A71186K2032j9255L3675O4119k6140l2165O7927L2833M6862L8507M171L6507
10547D40259J8834n250L0819Q4743L3416N9000J5477O3106Q6309J05904J19060
$$ y = [25929, 58842, 50865, 62034, 39211, -16478, -12606, 14274, 5914, -27701, 60797, 115954, 67642, 51401, 93459, 122863, 58824, 44646, 62715, 114888, 106246, 123692, 125468, 115340, 146382, 99060, 84717, 141109, 141440, 145606, 141592, 78869, 28651, 21101, 14008, 36530, 64779, 83931, 116183, 177322, 184123, 184065, 129811, 84953, 50325, 68115, 33666, 37758, 50095, 33571, -11762, -48919, -40388, 15426, 66890, 88895, 126650, 146630, 128226, 84199, 79294, 102522, 134634, 223554, 210972, 137795, 128641, 154684, 117361, 89178, 132223, 127740, 143931, 170926, 171186, 193218, 173963, 207638, 271757, 245617, 213452, 281379, 314212, 361074, 399581, 403752, 440259, 459093, 453843, 484662, 569405, 602821, 661821, 677298, 740404, 826713, 932617, 1051677]
10536A051677J47759J46281J19864J23492J21498P5859k1187l6192q617o2928
10526A657506j79902j21755p8172j15110j13119j03999j31522j03887n2256n6229
10516F01555n2847J5915K4395l2908p1404l5955J4161o7942K3943L0442m9855
10505C99500k6559L5654k664j6779L3229R2306P7660k315j518N4186L9115J37809
10493H19624J17867Q2241L6219P4108J11019O9937O2172R3728Q4021J9566j4013
10482A556489l369p1992n5961j28006j61561j75326j37392j5260n0409p4411k6838
10471F55964j05025m5346M0516j7321q4347p770l2740l8928j6074q722J4268Q601
10459C63076M3397l2215m5969r951J0561J9033k688k874m4429j6369l618L1168
$$ y = [1051677, 1199436, 1345717, 1465581, 1589073, 1710571, 1786430, 1765243, 1729051, 1720434, 1657506, 1477604, 1355849, 1277677, 1162567, 1049448, 945449, 813927, 710040, 657784, 601555, 548708, 564623, 589018, 556110, 484706, 448751, 462912, 394970, 418913, 449355, 399500, 372941, 408595, 405931, 389152, 422381, 514687, 592347, 590032, 588514, 642700, 681815, 819624, 937491, 1019732, 1055951, 1130059, 1241078, 1311015, 1373187, 1466915, 1550936, 1570502, 1556489, 1553120, 1481128, 1425167, 1297161, 1135600, 960274, 822882, 807622, 757213, 682802, 655964, 550939, 505593, 546109, 528788, 444441, 436671, 403931, 365003, 348929, 340207, 354475, 363076, 406473, 374258, 328289, 318338, 328899, 347932, 345244, 342370, 297941, 281572, 277954, 309122]
10447C09122Q9535K9671p6005k508Q843L8999J7155j7661K9240J3977l6535k3680
10435C80153m4495K114O7175O5074L3544n9146q5480n2396m7267o4546j0700P1588
10423B55618N0897J9208N8041l6626r4356o028K9644Q886M8987O6369q819o2340
10411C29481o8523L3004L8785M9576M2678l4314K8032L1773l1824m4363L0970
10400D05275j4035l5680J2151R276M278P4673r052N4255k1539j9920j7294L3832
10388D76220K8989j0152m9425j8446M1813K1040j9895l9439j4350J3709j8783
10377D11281n1352K4640K3878j6146k1345k7614R703j7469j442L9061L3458m8380
10365C58273k64M3040k084J1824m4092o8950J2119L1305K3869K4452L8855p922
$$ y = [309122, 398657, 428328, 352323, 349815, 358658, 397657, 414812, 397151, 426391, 440368, 403833, 380153, 335658, 337772, 404947, 470021, 503565, 444419, 358939, 306543, 259276, 194730, 184030, 255618, 306515, 325723, 383764, 347138, 252782, 246754, 276398, 285284, 334271, 400640, 391821, 329481, 260958, 293962, 332747, 382323, 425001, 390687, 418719, 450492, 418668, 374305, 405275, 391240, 355560, 367711, 376987, 381265, 455938, 446886, 501141, 479602, 459682, 442388, 476220, 505209, 495057, 445632, 427186, 468999, 490039, 470144, 430705, 416355, 430064, 411281, 359929, 384569, 408447, 392301, 370956, 343342, 353045, 335576, 334134, 373195, 406653, 358273, 358009, 401049, 398965, 410789, 366697, 297747, 309866, 341171, 365040, 389492, 428347, 420425]
10353D20425l5725m096o1713o4K2106O6894M0933Q812j2986j4515K1422j0316
10341D41177J4151j0005L7856Q1968k0928p2164n7030L6844j3894N0261L4806
10330E23042k4749N9548k606p3364q4878K1574Q3982Q0189M3242M1135j162k8962
10318F36991M3169K7346o892l8621l503R211m667Q135M0254J7728K6925N6413
10306H12489J743K0584K0175l8768O0528P0109O752m1987O966K1548J9782P9514
10294A039435J6953J3907M0199M690K0249j8026Q202N2098O4338K4193Q0997N1964
10282A399199N0150R1025r48K8551N6867Q3711P5565K3267J12748K3024j6420
10271A926739J1058L8661J6478l908l4974J6187q837m2782k0984J0059k6839m2069
$$ y = [420425, 384700, 380604, 318891, 318827, 340933, 407827, 448760, 457572, 444586, 430071, 451493, 441177, 455328, 445323, 483179, 565147, 544219, 472055, 415025, 451869, 437975, 488236, 523042, 498293, 557841, 555235, 481871, 396993, 418567, 502549, 582738, 625980, 667115, 665953, 636991, 680160, 707506, 700614, 661993, 658490, 667701, 663034, 671169, 711423, 729151, 756076, 812489, 814232, 834816, 854991, 816223, 876751, 946860, 953612, 911625, 918591, 940139, 959921, 1039435, 1056388, 1070295, 1110494, 1115184, 1135433, 1117407, 1125609, 1177707, 1242045, 1266238, 1347235, 1399199, 1449349, 1540374, 1539426, 1567977, 1624844, 1708555, 1784120, 1807387, 1920135, 1943159, 1926739, 1937797, 1976458, 1992936, 1989028, 1954054, 1970241, 1961404, 1918622, 1897638, 1907697, 1880858, 1838789]
10259A838789n7881n9114J1j5445o1329l2430J1746J5338K8380M887K5218N1003
10247A749173O7194O3702M6741j4163q529M6945K9801L3825P3836R1921N5021
10236B235467N6868M6468L9397J49897J06071O0222Q0564Q9644J14863J12357
10226C091818R1932J05663J20859Q6017R1890J00498Q8728M8328J12174J23658
10216D061565N2310N5194J16663M0608N7911J04143L9800L2787R8880J3964J20905
10205D794730J33781J05969J18666J06257J64852J69413J43606J48041J49783
10196F035098J65703K24107K28014K20842K41317J60685J94743J96136K46999
10187G913644K75321L61742K83309L35943L29531K18010L14480L47894L25104
$$ y = [1838789, 1780908, 1721794, 1721805, 1706360, 1645031, 1612601, 1624347, 1639685, 1668065, 1672952, 1698170, 1749173, 1816367, 1880069, 1926810, 1912647, 1904118, 1951063, 1980864, 2014689, 2088525, 2180446, 2235467, 2292335, 2338803, 2378200, 2528097, 2634168, 2694390, 2774954, 2864598, 2979461, 3091818, 3183750, 3289413, 3410272, 3496289, 3588179, 3688677, 3777405, 3825733, 3937907, 4061565, 4113875, 4169069, 4285732, 4326340, 4384251, 4488394, 4528194, 4560981, 4659861, 4673825, 4794730, 4928511, 5034480, 5153146, 5259403, 5424255, 5593668, 5737274, 5885315, 6035098, 6200801, 6424908, 6652922, 6873764, 7115081, 7275766, 7470509, 7666645, 7913644, 8188965, 8550707, 8834016, 9169959, 9499490, 9717500, 10031980, 10379874, 10704978]
10178A0704978L39894L60542L51499M41780M23532M76419N02383N03515M51213
10169A4555755N00636O25245O59585P13264Q37436R50755R61854J012304J149246
10160B1966080J285177J457645J635727J707596J933584K193897K496953K794069
10152C7470728L107006L491775L792486M240601M654060N255739N912095O708472
10144G4632962P707004Q881810J0428616J2175277J4253618J6526245J8763990
10137A63369522K0688545K2091878K2524047K1769829J9444830J5677660J0700989
10130B96267300M805647j641728q023182j3621242j8187447k1430433k3104371
10123B15064544k3207185k2188446k0296521j7831480j5173164j2571612j0145583
$$ y = [10704978, 11044872, 11405414, 11756913, 12198693, 12622225, 13098644, 13601027, 14104542, 14555755, 15056391, 15681636, 16341221, 17054485, 17891921, 18842676, 19804530, 20816834, 21966080, 23251257, 24708902, 26344629, 28052225, 29985809, 32179706, 34676659, 37470728, 40577734, 44069509, 47861995, 52102596, 56756656, 62012395, 67924490, 74632962, 82339966, 91221776, 101650392, 113825669, 128079287, 144605532, 163369522, 184058067, 206149945, 228673992, 250443821, 269888651, 285566311, 296267300, 301072947, 299431219, 291408037, 277786795, 259599348, 238168915, 215064544, 191857359, 169668913, 149372392, 131540912, 116367748, 103796136, 93650553]
10116I3650553q227246o714084n382639m301140l503566k788471k275949j809725
10108E8647733j252878q18746m06455K0364M19160R01582J360573J837933K290922
10099F3000188K830146L433051M087465M685615N617740O650629P752347R063456
10091A07120637J0603910J2325799J4251289J6271149J8119379J9744369K0495030
10084B18931562J9810978J7412208J3171000P115064k5921p456270j3918972j8441930
10076B36597719k0879868k1219040k0039452j8202244j6101086j3911854j2016254
10069A14227921j0197382q698372p529782o424546n406825m616682m044427l609279
10061F3700626l226213k804425k443608k255912k003489j770248j560262j353466
$$ y = [93650553, 85423307, 78709223, 73326584, 69025444, 65521878, 62733407, 60457458, 58647733, 57394855, 56576109, 56169654, 56190018, 56609178, 57510760, 58871333, 60709266, 63000188, 65830334, 69263385, 73350850, 78036465, 83654205, 90304834, 98057181, 107120637, 117724547, 130050346, 144301635, 160572784, 178692163, 198436532, 218931562, 238742540, 256154748, 269325748, 276440812, 276414891, 268958621, 255039649, 236597719, 215717851, 194498811, 174459359, 156257115, 140156029, 126244175, 114227921, 104030539, 95332167, 87802385, 81377839, 75971014, 71354332, 67309905, 63700626, 60474413, 57669988, 55226380, 52970468, 50966979, 49196731, 47636469, 46283003]
10053D6283003j161740r04737o37470k59357J63831Q42272J801333L175149L703893
10044E3006177K386897J129499N3475k208926p450733o948206l990289k560780
10036C3417114j864456j426342j218761j119272r36482q11172o63545o08930o33611
10027B4134543n04541m78925m90423m00375l76662m03713l50181l39706l08353
10018B0481664k95103k79625k99541k39940k17694k52821k05528j96798k43404
10009A8251210k83660j89351j23455j09291j47585j18746j74660j96881k31472
10000A6676109j87190k14920j35142j53870k93258k92633l40898l52819l60775
9991A4344604k98637l66322l93032l39723l02713l71421l84606l04137l17730
$$ y = [46283003, 45121263, 44216526, 43579056, 43319699, 43483530, 44325802, 46127135, 49302284, 53006177, 55393074, 56522573, 56576048, 54367122, 46916389, 39968183, 35977894, 33417114, 31552658, 30126316, 28907555, 27788283, 26851801, 26040629, 25377084, 24768154, 24134543, 23630002, 23151077, 22660654, 22260279, 21883617, 21479904, 21129723, 20790017, 20481664, 20186561, 19906936, 19607395, 19367455, 19149761, 18896940, 18691412, 18494614, 18251210, 17967550, 17778199, 17654744, 17545453, 17397868, 17279122, 17104462, 16907581, 16676109, 16488919, 16273999, 16138857, 15984987, 15691729, 15399096, 15058198, 14705379, 14344604, 14045967, 13679645, 13286613, 12946890, 12644177, 12272756, 11888150, 11584013, 11266283]
9982A1266283k87070k68986l41212k48105k43931k73819k00886j70239k07646
9973I024389k20166k18971j68186j42905j42286j47445j78040j72336j54847r3792
9963G385415j07183n2737j09782j42759j39776r0363q8130j20992j50478j38491
9953F244724j20074j64866j51756r1189n3179j40798k37483j14493r5936r3152
9943D981798p0665j31264j04814j62940j71221j54713j16997p8326o4657q4077
9933C842124q6840n7306j02160j11485o0764p6721q0242j23525p6823p1774m4341
9922B950143o0882p3736j2518K2130K1228l7626m3372m2430j27473o7252j631
9911B526581J9276O59j17290o1561o5714j9843J5932j1572l1802k4196j1182k8834
$$ y = [11266283, 10979213, 10710227, 10369015, 10120910, 9876979, 9603160, 9402274, 9232035, 9024389, 8804223, 8585252, 8417066, 8274161, 8131875, 7984430, 7806390, 7634054, 7479207, 7385415, 7278232, 7225495, 7115713, 6972954, 6833178, 6742815, 6654685, 6533693, 6383215, 6244724, 6124650, 5959784, 5808028, 5716839, 5663660, 5522862, 5285379, 5170886, 5074950, 4981798, 4911133, 4779869, 4675055, 4512115, 4340894, 4186181, 4069184, 3990858, 3926201, 3842124, 3755284, 3697978, 3595818, 3484333, 3423569, 3346848, 3266606, 3143081, 3066258, 2994484, 2950143, 2889261, 2815525, 2803007, 2825137, 2846365, 2808739, 2765367, 2722937, 2595464, 2528212, 2526581, 2545857, 2546516, 2429226, 2367665, 2301951, 2282108, 2298040, 2286468, 2254666, 2230470, 2219288, 2190454]
9899B190454L6595K0001n4897o3313N0839Q7638o7590j2463K6476O5861N2763
9888B332364k5085q5766o6101J6958O1357L6534l4970M080m4247p6589J2735M9026
9876B180296M964k3200M7373L1623k7424p2788L476j6798k0142L5888K925K6577
9864B172770J3469l6015l7355L326K1371J628J4033K7724n1682p43j4832j6037
9852B097657o7907J5131J6389k6652k2816k418r117M229j444n846j4698J1879
9840A994387j9714p475K0773l5872k3688n860l2257k2122k5214k9675j3711j923
9828A797649L0865j8032m2766l6326q047k9420J0626p725k7097M3409J3362M166
9816A730664M435n3299P091P27J7335N932O7953j6391o4467L3960o5708p5529
$$ y = [2190454, 2227049, 2247050, 2192153, 2128840, 2179679, 2267317, 2199727, 2187264, 2213740, 2279601, 2332364, 2307279, 2221513, 2155412, 2172370, 2233727, 2270261, 2235291, 2239371, 2195124, 2118535, 2131270, 2180296, 2185260, 2162060, 2209433, 2241056, 2213632, 2140844, 2144320, 2127522, 2107380, 2143268, 2146193, 2172770, 2186239, 2150224, 2112869, 2116195, 2137566, 2139194, 2153227, 2180951, 2129269, 2128526, 2113694, 2097657, 2029750, 2044881, 2061270, 2034618, 2011802, 2009384, 2000267, 2004496, 2003052, 1997206, 1982508, 1994387, 1974673, 1967198, 1987971, 1952099, 1928411, 1922551, 1890294, 1868172, 1842958, 1813283, 1799572, 1797649, 1828514, 1810482, 1767716, 1731390, 1723343, 1693923, 1704549, 1696824, 1669727, 1713136, 1726498, 1730664, 1735099, 1681800, 1688891, 1689618, 1706953, 1712885, 1780838, 1764447, 1699980, 1733940, 1668232, 1592703]
9804A592703j7448J2596p3283k3241O1452O3121k4984j22942k2453j8985j0770
9793A415766K707n4204m0607M3881N3612n9941l1838J0125j4128j7993k9988K887
9781A280279j3800p170J8887L1922K8434l4003r6833o0011M2017M8766P1470J7664
9769A327622K6333J281L2837k2012k7237k6146k1357q013Q3910M952j5357q043
9757A348770J9299P3270J9128n01J0856l4842j1645o548L3338R2035K1796K7655
9745A592611q910n3778N7654P8251N727j3749N9648P1513j2353J05332J60886
9734B042832J08338J29782Q1086J23412R7889Q8912J18446J14526J34394J49068
9724C188685L616j25500q8901k4915n6902j04124j00498j43992j20037j08823
$$ y = [1592703, 1575255, 1587851, 1514568, 1491327, 1552779, 1615900, 1590916, 1467974, 1445521, 1426536, 1415766, 1418473, 1364269, 1323662, 1367543, 1421155, 1361214, 1329376, 1339501, 1325373, 1307380, 1277392, 1280279, 1266479, 1259309, 1278196, 1310118, 1338552, 1304549, 1207716, 1147705, 1189722, 1238488, 1309958, 1327622, 1353955, 1355236, 1388073, 1366061, 1338824, 1312678, 1291321, 1283308, 1367218, 1372170, 1356813, 1348770, 1368069, 1441339, 1460467, 1459966, 1470822, 1435980, 1424335, 1417787, 1451125, 1543160, 1564956, 1592611, 1583701, 1529923, 1587577, 1665828, 1671555, 1657806, 1717454, 1788967, 1776614, 1881946, 2042832, 2151170, 2280952, 2362038, 2485450, 2583339, 2672251, 2790697, 2905223, 3039617, 3188685, 3192301, 3066801, 2977900, 2952985, 2896083, 2791959, 2691461, 2547469, 2427432, 2318609]
9714B318609p8236n2764r7491m1650k1927J8612l0699J1656m0792k0944K4971
9703A989345o1281m7757Q119L3849L6622O0751O9933J2080l710R575j5842o646
9691B085038M5961J3558K5270K4261Q4217K0422J23334J05295N981O2927J37721
9680B733985J37784R6583N7363J26930J33188J24034N7180j8080K994M1961O1049
9669C554971q9744k08950j05279j17573p4426M0259l1466p2812n1024l7864k989
9658B803103M353n3348n3549R59J00552N4095L8682k4308N3530Q8322l3352m4388
9646B934651K1021N9537M4810Q9063M4756J7207J3737q451J9836J8409K6266M4892
9634C325734R190j641P6172P6653K5583N5133m392m7342j8208M9944N0603R0670
$$ y = [2318609, 2240373, 2187609, 2090118, 2048468, 2026541, 2045153, 2014454, 2026110, 1985318, 1964374, 1989345, 1928064, 1880307, 1888426, 1922275, 1958897, 2019648, 2089581, 2101661, 2097951, 2107526, 2091684, 2085038, 2130999, 2144557, 2169827, 2194088, 2278305, 2298727, 2422061, 2527356, 2533337, 2596264, 2733985, 2871769, 2968352, 3025715, 3152645, 3285833, 3409867, 3467047, 3448967, 3451961, 3493922, 3554971, 3465227, 3256277, 3150998, 3033425, 2958999, 2999258, 2967792, 2894980, 2843956, 2806092, 2803103, 2807456, 2754108, 2700559, 2701518, 2802070, 2856165, 2894847, 2870539, 2924069, 3012391, 2979039, 2934651, 2955672, 3015209, 3060019, 3149082, 3193838, 3211045, 3224782, 3216331, 3236167, 3254576, 3280842, 3325734, 3334924, 3333283, 3409455, 3486108, 3511691, 3566824, 3562432, 3515090, 3496882, 3546826, 3597429, 3688099]
9622C688099Q2634O6281R0596K2125L2847M421P003M3316Q8549L0591Q409K7804
9610D192675O5442K7514N3207O6525k0108L5630M8457L9969M0908N2744O0443
9599D663406Q6108L9426N789K3401J117P623J0307j4987n5281q2852Q6377L0947
9587D801381j7863K106j594k8129n0985l1204n3718j21342k7236j1676p6621k9885
9575D353234k905r234k3989r3363m3914p2829p1401p3946o1871p5489n4521o714
9563C763058n0199p9476m3518p629j3925o2498l7657p256p7061q8557l3604n6417
9551C205261r5083p8288n0781l2403q0498M733m8070j0391j1635p2952j27572
9540B602321n8228L9839k0265o7276o193m5467j3151o7921o7441r8689o0821N9255
$$ y = [3688099, 3770733, 3837014, 3927610, 3949735, 3982582, 3987003, 3994006, 4037322, 4125871, 4156462, 4164871, 4192675, 4258117, 4285631, 4338838, 4405363, 4385255, 4420885, 4469342, 4509311, 4550219, 4602963, 4663406, 4749514, 4788940, 4794729, 4818130, 4819247, 4826870, 4837177, 4822190, 4766909, 4684057, 4770434, 4801381, 4783518, 4785624, 4784030, 4755901, 4704916, 4673712, 4619994, 4498652, 4471416, 4459740, 4383119, 4353234, 4350329, 4341095, 4317106, 4223743, 4179829, 4107000, 4035599, 3961653, 3899782, 3824293, 3769772, 3763058, 3712859, 3633383, 3589865, 3582236, 3568311, 3505813, 3468156, 3460900, 3383839, 3295282, 3261678, 3205261, 3110178, 3031890, 2981109, 2948706, 2868208, 2872941, 2824871, 2814480, 2802845, 2729893, 2602321, 2544093, 2583932, 2563667, 2496391, 2490198, 2444731, 2431580, 2363659, 2296218, 2197529, 2136708, 2195963]
9528B195963m246l5427m994p525o7010o4629j06989q0555l4494k9351j020j5408
9516A744315q851k4595k3698K9729J924j6157p0230j0557O443o5975j590J6950
9504A577708n8779m3213R932j6800j4732o5625j6190n363j8268J0739l5954j13557
9492A209898k745j1045q640p169k9250l9175l2907p4605m3638M1335O1480J7321
9480A080860M3559r894m5130P73j5734m3747j7683k8236k5909k0213n7053M100
9468H65693k1582k3910M5913M1310l5414o3395j7962J9879K0341K6761P587q7239
9456G77982p8729O636M4725K6327l4311Q92m777n4088l3133K909L4974J1683L26
9443G01416J3051k020l9021l3359q7598j697m818L8247J4264l1318m8664R055
$$ y = [2195963, 2191717, 2156290, 2151296, 2143771, 2076761, 2012132, 1905143, 1824588, 1790094, 1760743, 1759723, 1744315, 1735464, 1710869, 1687171, 1716900, 1718824, 1702667, 1632437, 1621880, 1628323, 1562348, 1560758, 1577708, 1518929, 1475716, 1485648, 1468848, 1454116, 1388491, 1372301, 1366938, 1348670, 1359409, 1323455, 1209898, 1207153, 1196108, 1187468, 1180299, 1151049, 1111874, 1078967, 1004362, 960724, 1002059, 1063539, 1080860, 1124419, 1114525, 1069395, 1070168, 1054434, 1010687, 993004, 964768, 938859, 918646, 861593, 865693, 844111, 820201, 866114, 907424, 872010, 808615, 790653, 810532, 830873, 857634, 865221, 777982, 699253, 705889, 750614, 776941, 742630, 743522, 738745, 684657, 651524, 654433, 689407, 701090, 701416, 714467, 712447, 673426, 640067, 552469, 550772, 545954, 584201, 598465, 567147, 518483, 527538]
9431E27538L4425q597o152j0812k0292m2014m9655R5496M0461m2678J5649J7435
9419E50804N2921j4177m7797j2744k7477P676K0656n7636o3056p64J5986O1896
9407D86288K2871j684q1505m4336K8173K9713k9015p1463o186L7849R2900J9162
9395D82767j4863j7500k5300m833J4799J1335M8642j7442j6861q5688o6545j3107
9383B95404l1164K9543J9329l5726M9459M7499n156L2772k3873J380L7910M991
9371D22368n2081J9149M1438j1606k5798q245n639j3913P47K9335M213J4482J7929
9358D32379l70l9077J6637k38j161K1149n502k0862n6669k3697M6505O9652L2312
9345D71058j7497k4239k9153m5695J3726Q988m1376P250j6364l6759k6938J0927
$$ y = [527538, 561963, 553366, 547214, 536402, 516110, 474096, 424441, 519937, 560398, 517720, 533369, 550804, 603725, 589548, 541751, 529007, 501530, 509206, 529862, 472226, 409170, 408406, 424392, 486288, 509159, 507475, 425970, 381634, 409807, 439520, 410505, 339042, 332856, 370705, 463605, 482767, 467904, 450404, 425104, 420271, 435070, 446405, 495047, 477605, 460744, 375056, 308511, 295404, 264240, 293783, 313112, 277386, 326845, 374344, 369188, 401960, 378087, 379467, 417377, 422368, 370287, 389436, 430874, 419268, 393470, 385225, 379586, 365673, 366420, 395755, 399968, 414450, 432379, 432009, 392932, 409569, 409331, 408170, 429319, 423817, 402955, 346286, 322589, 369094, 438746, 471058, 453561, 429322, 400169, 354474, 368200, 377188, 335812, 343062, 326698, 289939, 263001, 273928]
9333B73928L9858n6839L9087K2249j6181j6519j0643P3162j074j4795j6588j0240
9321C05405o230k2673K462j8911M07k3904J7869q940n450N2261m1727j2264O359
9308B44664P199l173j7538M7772M4205K0112M4109L7377l9945j7691k917O8505
9296D32679k5060r6010l8225m8492K2910N0287J978q014L69J6524m0578n4715
9284B13653O644J1359J0905L8884J7467j3835J3858M7451J9222N4882j4196n6965
9272C49329O995L7936J3821j0126J3527k8259n273n590K3721K9619p832j7126
9260D00742K3805m9042J2948J30258P1996J3535J9203l0188m3648L1439O9396
9249F50444m2360j058R610j3490J5635J16491O9984J4716J6924K2845P4172K2700
$$ y = [273928, 313786, 256947, 296034, 318283, 302102, 285583, 274940, 348102, 347028, 332233, 315645, 305405, 299175, 276502, 278964, 260053, 260460, 236556, 254425, 245485, 240035, 292296, 250569, 238305, 244664, 251863, 248690, 231152, 278924, 323129, 343241, 387350, 424727, 384782, 367091, 364174, 432679, 407619, 311609, 273384, 224892, 247802, 298089, 300067, 292053, 292422, 308946, 268368, 213653, 220297, 231656, 242561, 281445, 298912, 285077, 298935, 346386, 365608, 420490, 406294, 349329, 356324, 394260, 408081, 397955, 411482, 383223, 377950, 372360, 396081, 425700, 417868, 400742, 424547, 375505, 388453, 518711, 590707, 604242, 623445, 593257, 549609, 581048, 650444, 608084, 607026, 616636, 603146, 618781, 735272, 805256, 819972, 836896, 859741, 933913, 956613]
9237I56613j1086Q3952J23490J16108P4332N5337P7486R8407P3679J32368Q4512
9226A865198K31321L02026K73987K91105K54547L32227M18759M81963M58821O02966
9216E512920P45052R11914J037504J184353J348675J521642J574336J515667J323071
9207A6675134R12273L34367k46764q55134j368387j616622j619743j598446j417974
9198I198704j165525r44281p62200o90417o09194m89683m12638l37958l77926
9189C408882k86390k71382j73567j24405q9542j14661j33999j35632o8709j5351
9179A995244j27459j20649j28501q8876m6890l3587k7719l9633j32110k6887K8161
9168A251094J3505K3383m4940K1177l2994m2584J124o2237n8165O6510J2395k4251
$$ y = [956613, 945527, 1029479, 1152969, 1269077, 1343409, 1398746, 1476232, 1574639, 1648318, 1780686, 1865198, 2096519, 2398545, 2672532, 2963637, 3218184, 3550411, 3969170, 4451133, 4909954, 5512920, 6257972, 7169886, 8207390, 9391743, 10740418, 12262060, 13836396, 15352063, 16675134, 17587407, 17921774, 17675010, 16819876, 15451489, 13834867, 12215124, 10616678, 9198704, 8033179, 7088898, 6326698, 5636281, 5027087, 4537404, 4124766, 3786808, 3408882, 3122492, 2851110, 2677543, 2553138, 2463596, 2348935, 2214936, 2079304, 2010595, 1995244, 1867785, 1747136, 1618635, 1529759, 1482869, 1449282, 1421563, 1381930, 1249820, 1222933, 1251094, 1264599, 1287982, 1243042, 1264219, 1231225, 1188641, 1189765, 1127528, 1069363, 1135873, 1148268, 1124017]
9156A124017m6936l0958J9504N528o373k8252o9737j4542q087j5213L5914M7624
9144A012489k8521j8902m1553j9454k7286j9842J2826P66J895m4613K2319L264
9132H53388j9656l9070N5260M8302l0042l9440n9824L5653o925k2667q8183j3210
9120F73586L5584P0410M7314q8930o1393l1612P821m6354l0309j6138k6772m3039
9108D90168J2735L8455J1010J9552o1542p7629n0202k062J2921R127N9830N0939
9096E13302p3080j1783n6793l1409P3955N1363J6223j0706j5140j1675L7335m364
9084D77228K798l5479q0502n6319N480J7467J1811L2810k5194o7632l2775K5965
9072B75658r028J4836J16836O655r9098q1918o6977r826K6249r396J5113M0194
$$ y = [1124017, 1077081, 1046123, 1065627, 1071155, 1064782, 1036530, 966793, 952251, 944164, 928951, 964865, 1012489, 983968, 965066, 923513, 904059, 876773, 856931, 869757, 870523, 872418, 827805, 850124, 853388, 833732, 794662, 849922, 898224, 868182, 828742, 768918, 804571, 797646, 774979, 686796, 673586, 709170, 779580, 826894, 737964, 676571, 644959, 652780, 606426, 576117, 559979, 533207, 490168, 502903, 541358, 552368, 571920, 510378, 432749, 382547, 380485, 393406, 402533, 462363, 513302, 440222, 428439, 371646, 340237, 414192, 465555, 481778, 471072, 455932, 444257, 481592, 477228, 480026, 444547, 364045, 307726, 313206, 330673, 342484, 375294, 350100, 282468, 249693, 275658, 266630, 281466, 398302, 404957, 305859, 223941, 156964, 147138, 173387, 163991, 179104, 219298]
9060B19298J1068L0807P82m0639K5105k0470K6274N799q7p5133k6355P5091j0636
9047B20904j0357j4934l3290k8776q983j0891J9035n469m2916N701J1873O7498
9035A69395K1609L2528N343n114p0888p5379n8488k9N8099O8603p8061k2225O7928
9022A13321M1085L6381O448Q13K3217l8331K0771m6685q6420l9314p514m2455
9010a8683N2084J20414Q511K76J4761l3796k4425k8601q026n264n7977K8614j5226
8997C2662P0182K5779m4112k9467J5787o8l3417J7512P2327K1109k3771o6592
8985E7931L0866Q5331k4075q5692N5032j3284j7304k4382r409o0229M3533N6627
8973I4945n313J749M3287M5108M9375J6344k1015j990J384N043j0839Q829o834
$$ y = [219298, 230366, 261173, 261955, 221316, 246421, 225951, 252225, 258024, 257937, 182804, 156449, 231540, 220904, 210547, 195613, 162323, 133547, 124564, 113673, 132708, 127239, 84323, 90024, 101897, 169395, 191004, 223532, 228875, 223761, 152873, 77494, 19006, 18977, 77076, 145679, 67618, 45393, 113321, 154406, 190787, 197235, 198048, 221265, 182934, 203705, 157020, 70600, 31286, 23772, -18683, 33401, 153815, 162326, 162602, 177363, 143567, 119142, 90541, 82515, 77251, 19274, 47888, 32662, 102844, 128623, 84511, 55044, 70831, 70763, 37346, 54858, 127185, 148294, 124523, 57931, 88797, 174128, 150053, 64361, 119393, 106109, 88805, 64423, 55014, -5215, 38318, 94945, 89632, 91381, 134668, 179776, 229151, 245495, 224480, 222490, 223874, 228917, 218078, 226907, 220073]
8960B20073k0243j7287k3575J7615J8144n7458J5908Q5821J3358j376q4890j8678
8948A47412k2316l2551j8330l701J063m5169j2406J0912O7961K5809m0824m0671
8936C7189M2956K1367k5039J266O239n80P2231K9946M846m1764p1021m8109L2376
8923F1903m7297j5893N4343O2077L3011j9350R132l3674k3456p9670o1368J01364
8911D1122N3658k0424K9602j1161J0137k3931K3480N191m5536j0307L3698M4331
8899A29860q859j9603k3518j1915R978n9358L0165J1277m4403n3073k958N7494
8887A5087M7388l4693l633J00410j6679k6689j2866K3967L7117J1546p2189l5019
8875C3747N3063M6144l2408j6938n2352n4929n705P7781K0532n0543J641L9421
$$ y = [220073, 199830, 182543, 158968, 176583, 194727, 137269, 153177, 238998, 252356, 250980, 166090, 147412, 125096, 92545, 74215, 70514, 71577, 26408, 14002, 24914, 92875, 118684, 77860, 37189, 80145, 101512, 76473, 77739, 83978, 83398, 155629, 185575, 190421, 148657, 77636, 29527, 61903, 14606, -1287, 53056, 115133, 148144, 128794, 137926, 104252, 80796, 1126, -60242, 41122, 94780, 74356, 103958, 92797, 102934, 79003, 102483, 107674, 62138, 51831, 85529, 129860, 121001, 101398, 77880, 65965, 75943, 16585, 46750, 58027, 13624, -39449, -42407, 15087, 62475, 27782, 24149, 124559, 107880, 81191, 68325, 92292, 129409, 140955, 68766, 33747, 86810, 132954, 100546, 83608, 31256, -23673, -29378, 48403, 68935, 18392, 20033, 59454]
8863E9454q323L2930M8672m9705o7059Q444q735J3538M3059k6909O5328J0291
8851A20985K2712l9464m7199n0728K0884O0593J859J0856J8709n359J7749J0824
8839A42421L7082j4525l4513K190m0701k1922K8286M4416q018P3P271q184O715
8826A40591N7979J641p256J1589l7720m8753J3031P519k4370n983m8469n8324
8814A475m183Q3076K2300j9522k2218L838j6344p424J9069K1436O757m2663l1307
8801A4290j0977j4420N9189l773j1206k5892m9298L473M9845O4603l9885n9081
8789b3132l9538J5438M9102M1514L3644l4246j6595J2434L6893j3041n8691j5968
8777a2186O2376R2208K1078m3002l4151n2367q935O426p016m3430j977K2292M4134
$$ y = [59454, 51131, 84061, 132733, 83028, 15969, 24413, 15678, 29216, 72275, 45366, 110694, 120985, 143697, 104233, 57034, 6306, 27190, 87783, 89642, 100498, 119207, 113848, 131597, 142421, 179503, 164978, 130465, 132655, 91954, 70032, 98318, 142734, 134716, 134789, 142060, 133876, 140591, 198570, 200211, 192955, 204544, 166824, 118071, 131102, 138621, 114251, 108268, 59799, 1475, -2708, 80368, 102668, 83146, 60928, 64766, 48422, 40998, 60067, 81503, 88260, 45597, 14290, 3313, -11107, 48082, 44309, 33103, 7211, -42087, -38614, 11231, 75834, 35949, -23132, -62670, -47232, 1870, 43384, 77028, 42782, 26187, 38621, 75514, 62473, 3782, -12186, 50190, 142398, 163476, 120474, 86323, 33956, 25021, 31447, 24431, -18999, -20976, 1316, 45450]
8764D5450o028L5798N129j4266j6868j7455r446l3291m2234L6960L7684M5038
8752F6471n640j6393K4679O349N554l8173j1715P3035J4111l2117j6723m563J4203
8739G9078m7994p0490K0600K7524P5565N9799l8714l9614J0714m8789j1515K6624
8727D2788k7114p5465L2400R1578l989m2322j0349K6556K4103K030l1426r3339
8715f4549L6661P4956K0169k1997L92j2378O870l1166p6202j0963L5887N5068
8703A2748J03564M1544L386j086k9483n4001n9436N7071j5995J0903P3529Q7574
8691B30318m5011r0810k1336m5745P504l6671K0778N1645J9421j3917m913j6758
8679E4505j8841L8976N7040k1330k9759n2059m3233N5352O7927q912P888M0771
$$ y = [45450, 39422, 75220, 80349, 66083, 49215, 31760, 22314, -10977, -53211, -16251, 21433, 66471, 60831, 44438, 69117, 75466, 81020, 42847, 31132, 104167, 118278, 86161, 69438, 64875, 79078, 31084, -39406, -18806, 8718, 84283, 144082, 105368, 65754, 76468, 27679, 16164, 42788, 15674, -59791, -27391, 64187, 60198, 17876, 7527, 34083, 58186, 60216, 28790, -64549, -27888, 47068, 67237, 45240, 45632, 33254, 40124, 8958, -67244, -78207, -42320, 12748, 116312, 157856, 161242, 160156, 130673, 76672, 17236, 74307, 58312, 69215, 142744, 230318, 185307, 94497, 73161, 27416, 34920, -1751, 19027, 70672, 90093, 76176, 71263, 54505, 35664, 74640, 131680, 110350, 80591, 28532, -14701, 40651, 108578, 99666, 107554, 148325]
8667A48325l0235j24164n646N5556M276K9601O980K8998m31m7608j8808k1719
8655B5125P194p386M4524L1657N934m591l8505k5979k9709K0004K6871K5083q83
8642G9339J1098N5194l5636O0997O2377j640m4245p8001N2259k766j1907L619
8630A50688o0985k0099M6769r264n4659j9471N7198N3616P1408m9826l6844k0003
8618A08528J5986L162K2756K6940m7552N2981J6095j6600L105k116k3263K5134
8606A85156k9592k0422O8625P2578O3972J3881l9379K719N7754O5374j4849P6647
8594E02464L3287o671p2747m0697L6236K5724k1819j17131r185m2207k7187m9017
8582B11050m5085K9078R715o102j2977L555M6288l6166M3431n7839n5079K4306
$$ y = [148325, 118090, -6074, -11720, 43836, 48112, 77713, 84693, 113691, 113260, 65652, 46844, 25125, 32319, 24933, 69457, 101114, 107048, 102457, 63952, 37973, 8264, 28268, 55139, 80222, 79339, 90437, 145631, 109995, 170992, 233369, 231729, 187484, 109483, 161742, 158976, 147069, 150688, 89703, 69604, 116373, 107109, 52450, 32979, 90177, 143793, 215201, 165375, 128531, 108528, 124514, 127676, 150432, 177372, 129820, 182801, 198896, 182296, 185401, 183285, 160022, 185156, 155564, 135142, 203767, 276345, 340317, 354198, 314819, 317538, 375292, 440666, 425817, 502464, 535751, 529080, 456333, 415636, 451872, 477596, 455777, 338646, 329461, 287254, 260067, 211050, 165965, 195043, 204758, 198656, 185679, 189234, 235522, 199356, 242787, 184948, 129869, 154175]
8570A54175K3523o4587L869J1127j0288j7592j9830o4478j6474P2458M9588K497
8558A23988j7968m7964N1444N60o1678l4007L1045J00789J2451n232o859K8892
8546A75461o6207n6173J743O272m2658J8500N2830j3582n627j0631O334L5941
8534A02203l2968l4055j7858L2417J1643l9081m35N704K659L2219j6776j4608
8522C1064K6845n902M5568K7466n2921o5318n6129K1541j2312L6676O6292K3301
8510H6171k3382K0938m511M3707j2771l6601J0982L1038q546m1050O361k7250
8498D5086k7385l8445L7673M5976J8362N449M433K2046n2017l7545N270m8047
8486a9144o719Q086K8724O0165O914l5676M281o258n835j5543J1423J8989J4604
$$ y = [154175, 177698, 113111, 116980, 128107, 117819, 100227, 80397, 15919, -555, 71903, 121491, 123988, 106020, 58056, 109500, 110060, 48382, 14375, 45420, 146209, 158660, 153428, 146569, 175461, 109254, 53081, 54824, 61096, 18438, 36938, 89768, 76186, 70559, 59928, 66262, 102203, 69235, 35180, 17322, 49739, 61382, 22301, 21866, 27570, 30229, 62448, 45672, 31064, 57909, 52007, 97575, 125041, 72120, 6802, -49327, -27786, -40098, -3422, 62870, 86171, 62789, 83727, 79216, 122923, 110152, 73551, 84533, 115571, 107025, 65975, 72336, 45086, 17701, -20744, 16929, 62905, 81267, 86716, 91149, 113195, 61178, 23633, 28903, -19144, -25863, -17777, 10947, 71112, 78026, 42350, 46631, 40373, 34538, 18995, 30418, 49407, 64011]
8473F4011j9828n232P1477J4496l4418k8373k330M2725J7042p5620J2756K931
8461E9637K9635q279j4926R237L5102L0130m9109N023j4693L4303j216j8635k1929
8448G4280J4129M8956n99j5351j2393k3004k4717k7543N87J8547M5184o487m6880
8435D4709n351l051J7316m4395L383O190L9288K2042o0057K9777p172n3067m585
8422a4973J7152J5399L4260J8163n5696k3330m4867K7722O9333J686m8654K4651
8410B0846K6232J7175N665O724O930m7315p421K0010K1908l4319m1347K3705L0316
8397D9109L210m6369j4727p347M5153J8235m6110m6548K0389L3378K0869m9134
8385a9892J9738J3818J1985m682j5651l8307p2481J5339M8726K0374N4156k5161
$$ y = [64011, 44183, 38951, 110428, 124924, 90506, 62133, 59803, 102528, 119570, 43950, 56706, 59637, 89272, 80993, 66067, 75304, 110406, 140536, 91427, 96450, 81757, 116060, 114844, 96209, 74280, 88409, 137365, 136766, 121415, 109022, 86018, 61301, 33758, 34345, 52892, 98076, 91589, 44709, 39358, 36307, 53623, 9228, 12611, 18801, 58089, 80131, 20074, 49851, 42679, -10388, -14973, 2179, 17578, 51838, 70001, 14305, -9025, -53892, -26170, 43163, 44849, -3805, 20846, 47078, 64253, 69918, 76642, 83572, 36257, 28836, 48846, 70754, 36435, -4912, 18793, 49109, 52319, 5950, -8777, -16124, 29029, 47264, 1154, -45394, -25005, 8373, 29242, -19892, -154, 13664, 25649, 20967, 5316, -32991, -105472, -90133, -41407, -21033, 33123, 7962]
8373G962n1505k6470K9912M6314K768L349K3328o2688R502M27K0989m740o2347
8360f3199k1258K9968n2483n8058K4110N5541P2405Q0213j951j3509l2892k4137
8348e250L4036L8952n8811k409O0986O3821l1160Q223k4892m1009m5162k7666
8336c0341K9712J4834J356M5679L8810l233n1497j5582n2450R461L4091K6121
8324D6961p886o5857m9695j4115P6251K1165l4355l2076j1493O9611q306l7053
8312d6848N1841O055q5805l6970M1149K0445K60k4768j1883o570k3901K8033P2466
8299a6496N8562N2914j057K7672l9316r2043K4186M7767n0425l9639J0117j4938
8287c2696m3005M7392N3223k1384L7750K8544r4995J778P0454j144J0018j2509
$$ y = [7962, -43543, -70013, -40101, 6213, 8981, 12330, 35658, -27030, -17528, -17101, 3888, -852, -63199, -84457, -54489, -106972, -165030, -140920, -85379, -12974, 67239, 65288, 51779, 18887, -5250, 28786, 67738, 8927, 6518, 67504, 131325, 100165, 108388, 83496, 42487, -2675, -30341, -629, 14205, 15561, 61240, 100050, 96817, 45320, 29738, -22712, -13251, 20840, 46961, 39075, -26782, -76477, -90592, -14341, 6824, -27531, -59607, -71100, -1489, -9795, -46848, 4993, 11048, -74757, -111727, -70578, -50133, -49873, -74641, -86524, -93094, -116995, -88962, -16496, 42066, 94980, 93923, 121595, 82279, -9764, 14422, 62189, 11764, -27875, -17758, -32696, -75701, -28309, 24914, 3530, 41280, 69824, -25171, -23393, 47061, 45917, 55935, 43426]
8275D3426N7102j0679J1041l5139L9836l0622o0307m451J9100M9626K3113m2532
8263E9514m2836o049L6502O380M3285O420l2594o5405j27001K5981K7012M0412
8251b8379R4955O643j0915k5271l2683L8695L5766J4147K3726M836P1226m7386
8239A45360j18308l1455J922k1890N4153J8927l988j5809l7854q0556K6719M4059
8227a8720R749O0533L1495l1646q5712R73O2896P168j6163k4089L2437M4412k4985
8214D8348j733R196J8335Q807k7988j8430k7957j1225N8059L8089l531J2014n7961
8201D4023j9479j9921j1272L3011j6890K1992p0832o1891N4393M2269P786Q239
8189A1428J2163j8912j7128O1690J761o3205K9870r25j1291K7016L0063K0852
$$ y = [43426, 100528, 89849, 100890, 65751, 105587, 74965, 14658, 10207, 29307, 78933, 102046, 59514, 16678, 10629, 47131, 53511, 96796, 103216, 70622, 5217, -121784, -95803, -68791, -28379, 66576, 73219, 62304, 37033, 4350, 43045, 78811, 92958, 116684, 121520, 192746, 145360, 27052, -4403, -2481, -24371, 29782, 48709, 44721, 28912, -8942, -89498, -62779, -18720, -8971, 51562, 83057, 51411, -34301, -33328, 29568, 36736, 20573, -3516, 28921, 73333, 48348, 46615, 55811, 74146, 82953, 54965, 36535, 8578, -2647, 55412, 93501, 89970, 101984, 44023, 24544, 4623, -6649, 26362, 9472, 31464, -39368, -101259, -46866, -4597, 3189, 11428, 23591, 4679, -12449, 49241, 51002, -12203, 17667, 16742, 5451, 32467, 62530, 83382]
8177H3382J7520l1646o5088k3621k2417P030L8149j4692k0576Q640J6813J8332
8165A1826Q764Q75j3284j5672L7651K9923j6350n9135L39L8017N2064J9007N0997
8152A45022J7889k9908j03016l1135j9524j3343q143M3436K4669J7734M0570j1345
8140G2906j45791m5131P6160P0245l2548j9483M1474J3399L717K9993M7855l2027
8128H0769p6910k4953N1631L250J0164J7029k6780m3766K4828l822l430K0136
8116B8146j9227m142j010O0570l6837n0082L8727N5736o948K3206j123n9648l6176
8103h808M4644P0860n095n6610k4503j9765k2785L0781Q2980m341l9318J8401
8091F6441N5522m9213k7024k5298j4287k3688J5393q531l211j8450J8210K6000
$$ y = [83382, 100902, 69256, 4168, -19453, -41870, -34840, 3309, -11383, -31959, -23319, -6506, 11826, 20590, 21465, 8181, -7491, 30160, 60083, 43733, -15402, -15063, 22954, 75018, 94025, 145022, 162911, 133003, 29987, -1148, -20672, -34015, -42158, 1278, 25947, 43681, 84251, 72906, -72885, -118016, -41856, 28389, -4159, -23642, 17832, 31231, 34948, 64941, 112796, 80769, 3859, -21094, 30537, 33787, 43951, 60980, 34200, -9566, 15262, 11440, 8010, 28146, 8919, 4777, 3767, 64337, 27500, -22582, 16145, 71881, 64933, 88139, 87016, 27368, -8808, 35836, 106696, 101601, 44991, 20488, 723, -22062, 8719, 91699, 87358, 48040, 66441, 121963, 72750, 45726, 20428, 6141, -17547, -2154, -10685, -13896, -32346, -14136, 11864]
8079A1864M1823m593j9335J3409Q0215o45m6813L3492M526N023o6843o0597J4233
8066E759j8267j6326J2547N6759m1106o6414L6309m6606j6527M4123O3593O5112
8054G8956M7667J3809K134m8377j4341L7395J4681n2430k3834l4535M0852J6642
8042G8619m7067R433l777M1679L5769J5504j5337p414K5213r171k5261p4078j7620
8029F492L6773j6664j4257K791q1101j6009M7060K2469O8820L0217J9190j7517
8017H8264j2180K7505K252k7673O949J687J6707j2601J8141K0199K0p0127J1231
8004G0374K9351j9390j7717k2099j987m6484k4552L7134J0577O67N6419j2218
7992F0075J1144K5881M6007o2356n0978K4513J7306o662N056l1770l855R430k1553
$$ y = [11864, 53687, 49094, 29759, 43168, 123383, 122738, 75925, 109417, 113943, 118966, 52123, -8474, 5759, -12508, -28834, -16287, 40472, -634, -67048, -30739, -77345, -93872, -49749, 13844, 78956, 126623, 140432, 142566, 94189, 79848, 117243, 131924, 79494, 55660, 21125, 61977, 78619, 31552, 40985, 37208, 78887, 114656, 130160, 114823, 107409, 132622, 123451, 98190, 24112, 6492, 43265, 26601, 12344, 15135, -65966, -81975, -34915, -12446, 56374, 86591, 105781, 88264, 76084, 103589, 105841, 78168, 85117, 86804, 103511, 90910, 109051, 129250, 129270, 59143, 70374, 99725, 80335, 62618, 40519, 38532, -7952, -32504, 4630, 15207, 15874, 72293, 60075, 71219, 97100, 143107, 80751, 29773, 54286, 71592, 64930, 69986, 38216, 34361, 43791, 22238]
7979B2238n65J4655K6094K8010N2617k9071m6943k159L1440L0760L3602k1520
7967A39158p2380n154j1707L4842L0275k6760K0230L3449k7248R237n684J8916
7955A37174j5368m7362l2320L8104M9971n085m8478L1414N8019K2975p0804k4928
7943I3312j0274j7670J5142m2365k9189M904Q073K5499r233J4720J4766Q140k3811
7930E2014j532J2616R097K659q1519O44Q2980J6760M9812L0971P018q0434q7495
7917A3591J0492n2556K8859M4553l3055N590j6609j0774M6148O8276M2394p0424
7905G6485n1570n6336L7746L5671L238K7892j9060k7445K4336k5649J2633M8314
7893H6255j8459l1300o5124k3206P5785M4022K7477k5605n1214L0301j7719l1894
$$ y = [22238, 21673, 36328, 62422, 90432, 143049, 113978, 67035, 64876, 96316, 127076, 160678, 139158, 66778, 61624, 49917, 84759, 115034, 88274, 108504, 141953, 114705, 123942, 118258, 137174, 121806, 74444, 42124, 80228, 130199, 125114, 76636, 108050, 166069, 189044, 118240, 93312, 83038, 65368, 80510, 38145, 8956, 13860, 21933, 47432, 38199, 52919, 67685, 75825, 52014, 50482, 63098, 72195, 74854, -6665, -6021, 76959, 93719, 143531, 174502, 181520, 101086, 13591, 24083, -28473, 386, 44939, 11884, 17474, 865, -9909, 36239, 104515, 146909, 76485, 24915, -31421, 6325, 41996, 45234, 73126, 54066, 26621, 50957, 25308, 37941, 86255, 67796, 36496, -28628, -51834, 23951, 67973, 95450, 69845, 18631, 48932, 31213, -681]
7881f81J4771l3072J2431M7084M9142k1114K944k7913K4039o456l0601j9185l2082
7868b0693K3762O8942K4462l9803n5705r624j1148M4707k8189j1495k160l4216
7856e1160J8157P2531M2010m029J1406m1894m3564L3501L9789l5663m585P154
7844D3653N4700m3262m0977K5131M1665k4162n2279k0191l2422l0207M4232J7856
7832a6263M968k1269l2187j0862O8177K4827K8123L5345K823l0081m0238r548
7820C815n769k9426O7557k1334r112m5213j4126Q5788O8304k2853m3032l4438
7808A61m8128K1002R1381m0583j8474L3744j4378l1466m2051m8553l2802J202
7796a28945P6856M7731O858o057n551L1384k3608Q79j2240N295j5852j03928o1038
$$ y = [-681, 14090, -18982, -6551, 40533, 89675, 68561, 71505, 43592, 67631, 61175, 30574, 11389, -20693, 3069, 72011, 96473, 56670, 965, -8659, -19807, 24900, -3289, -14784, -16944, -51160, -33003, 39528, 81538, 77509, 88915, 47021, 3457, 36958, 76747, 41084, 36499, 43653, 98353, 55091, 14114, 39245, 80910, 56748, 4469, -15722, -48144, -78351, -34119, -16263, -11295, -32564, -64751, -75613, -7436, 17391, 45514, 80859, 83682, 53601, 13363, 3815, -1954, -31380, 36177, 14843, 5731, -39482, -53608, 32180, 100484, 77631, 34599, 161, -47967, -26965, 64416, 23833, 5359, 39103, 24725, -6741, -48792, -97345, -130147, -128945, -52089, -4358, 2500, -3557, -9108, 22276, -1332, -453, -12693, -7398, -23250, -127178, -188216]
7783a88216L5886P5733P1039M4884J2164K715q140K35j6906k5786K0247P9653
7771A03508K1855M8318m638m4741M807n1940k1821r080K3764J508j5584o2089
7759f133M1860R215m8056K3181J9945m9067j6056l922P2916m0545k7860M7081
7747B2559k0425l6090J1224J7669P8536L4893n2426O636n9146j9538K5102K0089
7735B9083L4341J2480l9506j018K4679M560l0226l7845J9312j9257K1004K5765
7723D3372M5541j4846m3968J2971M2419J4235J0099k6541k2371r1588p0212k4601
7711a25490k1763K3034M4539N1580K5841L9095K214k0501j1910k9657K2906K006
7699A894j8409l133K8974J03927M2384j05061r3506k8416O4386K1199k0698k5245
$$ y = [-188216, -152330, -76597, -5558, 39326, 51490, 54205, 46065, 46300, 29394, 3608, 23855, 103508, 125363, 173681, 169043, 124302, 129109, 77169, 55348, 46268, 70032, 71540, 55956, -6133, 35727, 44942, -3114, 20067, 40012, -9055, -25111, -29033, 43883, 3338, -24522, 22559, 2134, -33956, -22732, -5063, 73473, 108366, 55940, 62576, 3430, -16108, 8994, 29083, 63424, 75904, 36398, 35380, 60059, 64619, 34393, -3452, 15860, -3397, 17607, 43372, 88913, 74067, 30099, 43070, 85489, 99724, 109823, 83282, 60911, -30677, -100889, -125490, -147253, -124219, -79680, -28100, -2259, 36836, 39050, 18549, 6639, -23018, -112, 1894, -16515, -19648, 9326, 113253, 155637, 50576, -42930, -71346, -6960, 14239, -6459, -31704]
7687c1704K1734J04775J1173o8469l0161l6482L2525P694p5035n692K1103M5269
7675c270P3518K8741O739r875M64k0135J719Q730M1329n7404n4186l2146k8300
7662d4076N3547K7496r017j0193K1841P0150M1028k4662k0070K0938n9365m2073
7650B5544o0538m2025J7748Q5488l926r2529n3347k3182l0487P9090K8436j8012
7638h7740j1407K4415K4396N1284M8336k4577k2097K7787J0810K0209J1235m3704
7626B8947Q511N2989k7962m8009o5561j705Q1432R659m6754k90K1669Q8049j9397
7613H1578p1160M1301j4501r803k8463K9863K0931R606o557L8345k9052l0716
7601C1372p0718K0348M5541O359n1029j596M1619O5023Q404l6165l4668j0595
$$ y = [-31704, -9970, 94805, 105978, 37509, 7348, -29134, 3391, 11085, -63950, -69642, -48539, -3270, 70248, 98989, 105728, 95853, 96317, 76182, 77901, 86631, 127960, 70556, 16370, -15776, -44076, 9471, 36967, 27950, 17757, 39598, 109748, 150776, 126114, 106044, 126982, 67617, 25544, -34994, -77019, -59271, 26217, 22291, -70238, -123585, -146767, -177254, -98164, -69728, -87740, -99147, -74732, -50336, 948, 49284, 24707, 2610, 30397, 41207, 61416, 72651, 28947, 37458, 90447, 62485, 14476, -51085, -52790, 28642, 38301, -8453, -8743, 12926, 100975, 81578, 10418, 51719, 37218, 27415, -1048, 28815, 49746, 59352, 52795, 91140, 62088, 31372, -39346, -18998, 26543, 32902, -18127, -19723, 21896, 86919, 95323, 59158, 24490, 13895]
7589A3895j1651l6974L1293N6460N201j8422O957l2305n135P32Q617p37J790k2795
7575c074M9551j4835K1937L6213K1064m2861k0139p927L707N0651K6465k4170
7563I6582p7644j2880K62j1340m0941M36M6269K2409j6360r288q8680k0138Q2033
7550b9280L1914M1069L88o5183K4832j0886j0396j1155l7388L8776k2570K226
7538d7653n709N3475L8687k1435k2502j0060M5462R34n7351o8494N9053L2629
7526b964J8399J1969q620N686p059L3444j3385j8570M0900M6250l6284n9620k8033
7513a7887J0079K1191l4242j090L930N560j6765J7721M267l9579K600m4342l5586
7500a24143m2837j7737M0328P2131K1775l916n3016j7526M4459O1454j5187j3911
$$ y = [13895, 2244, -34730, -3437, 53023, 58224, 39802, 46759, 14454, 9319, 10051, 18668, 17931, 19721, -3074, 46477, 31642, 53579, 89792, 110856, 67995, 47856, 39929, 43636, 94287, 120752, 96582, 18938, 6058, 6320, -5020, -45961, -45525, 744, 23153, 6793, -2495, -91175, -111313, -29280, 2634, 43703, 44091, -21092, 3740, -7146, -17542, -28697, -66085, -27309, -49879, -47653, -53362, 113, 38800, 17365, -5137, -15197, 30265, 31199, -26152, -94646, -35593, -2964, 15435, 27404, 18784, 24470, 17411, 50855, 37470, 18900, 59800, 106050, 69766, 10146, -17887, -7808, 13383, -20859, -21949, -18019, -12459, -29224, -11503, -7236, -46815, -44215, -88557, -124143, -166980, -184717, -144389, -72258, -50483, -54399, -107415, -124941, -80482, -19028, -34215, -48126]
7488d8126N7830M3729k4516j1891j7508J6256O568k7719J89l8261O0523L5808
7476E2882l3645o3451r34N727M6325J5483q176k9311l2652K0941M0602J1411L5201
7463F0403m1629K1415K2851k19p2553O448K1313K2574J3340m5812l1722M2172
7451A8581K3709p589o2042N96k832M026j2510l8182L2388r851n833M915m199L210
7437e5613k0948M3293J03482k5028j23178p1652J7740Q6682Q0759L0670n2411
7426A3796l9237M0750J0726r913m6506R215J09o824K4215K3363k4666L1829K1941
7413D8798Q060K4032L448k4139j6918J8976Q106J75l4959K3472K2802n5810p306
7400A8737O387j2171o6069j6593Q324K024j8676M7007N907j1495j0249j935j485
$$ y = [-48126, 9704, 53433, 28917, 17026, -482, 15774, 22342, -5377, -5188, -43449, 17074, 52882, 19237, -44214, -45148, -39421, 6904, 22387, 14211, -15100, -47752, -26811, 13791, 25202, 60403, 18774, 40189, 63040, 62821, -9732, -3284, 18029, 40603, 53943, 8131, -23591, 18581, 42290, 34701, -27341, -26745, -29577, -25551, -38061, -76243, -43855, -53706, -59539, -54624, -58823, -55613, -76561, -33268, 70214, 45186, -77992, -149644, -131904, -45222, 35537, 66207, 13796, -25441, 15309, 26035, 16122, -30384, -21169, -21060, -27884, -3669, 19694, -4972, 26857, 48798, 56858, 80890, 84338, 60199, 43281, 62257, 70363, 70538, 35579, 59051, 81853, 26043, 18737, 25124, 12953, -53116, -69709, -61385, -59361, -78037, -31030, -25123, -36618, -46867, -48802, -50287]
7387e0287M7867Q787m2988M1967L4876m3600k775N4169K9430j1036R33p877m0879
7374A8587o8459m0900j1136P6174K5007K900l060n0138l8520o171J9175l7787
7362a14328Q3705O151n236k884j8338M951j2652r670L4489K0607p618l086K8852
7349D943k5598m5830P353J2401K932j614J5267K5656k8253R118K1908R283Q1266
7336H8832o913k7854m2551l6537P641K1643K580l4687K4121r881j3578L0912M3208
7323D6936n8348l1793r922J0878K9837K8124Q7633L0026q0006j25837k7666M5684
7311e4454l0137l128M6387K2542L61k2517J6010K5479k8452J9415L9293k6989
7299C810j5881N7249M066m7379p9805l279K7056l0515J4381L4739M3510j2232
$$ y = [-50287, -2420, 6367, -36621, 5346, 40222, -3378, -6153, 48016, 77446, 66410, 67343, 59466, 18587, -49872, -90772, -101908, -25734, -727, 2173, -887, -51025, -89545, -95716, -76541, -114328, -30623, -24472, -29708, -32592, -50930, -45979, -58631, -68301, -33812, -13205, -20823, -23909, 4943, -20655, -66485, -59132, -46731, -43799, -45413, -30146, -4490, -32743, -23625, -1717, 7566, 88832, 81919, 54065, 11514, -25023, -17382, 4261, 6841, -27846, -3725, -13606, -27184, 3728, 46936, -11412, -43205, -53127, -42249, -12412, 15712, 103345, 133371, 53365, -72472, -100138, -54454, -84591, -87719, -41332, -18790, -18429, -40946, -24936, 543, -27909, -8494, 30799, 3810, -12071, 45178, 49244, 1865, -77940, -81219, -54163, -84678, -70297, -35558, 7952, -4280]
7287d280J7889M6712K9740l4803o7734J4464J9631O392L7310L6088L971q5319
7275B0061o0146L7746M5232J5814n3285k0459m282l0383L2583j8499K1099q77
7263a5396Q067j0960l7511l1538L1797P8555Q244l6324L8928N6433m4699j9040
7251B6556k2250M3572L0528q3677j5717K6283n949k2248L5234R307j31K9546L273
7238E4327k3921j0645L6162r534k5101n3530J4101K6062l7738n1111k9876J2353
7226i8451O236k1631K4078O0446R5910l6863n2345m1121K5306o167j4637L1783
7214b7456N4156K4384o0076L120N680N204O997M5734j5426n5998K8154P0062l2695
7201E1840k4111J0385K460N187M4862R15n5970m6931m77N9645K4006l7193M7979
$$ y = [-4280, 13609, 60321, 90061, 55258, -12476, 1988, 21619, 28011, 65321, 101409, 105380, 20061, -40085, -2339, 42893, 58707, 5422, -15037, -19319, -49702, -17119, -35618, -14519, -15396, -7329, -18289, -55800, -87338, -55541, 23014, 31258, -5066, 33862, 90295, 45596, 26556, 4306, 47878, 78406, -5271, -20988, 5295, -654, -22902, 12332, 21639, 21508, 51054, 54327, 30406, 19761, 55923, 46389, 21288, -32242, -18141, 7921, -29817, -80928, -110804, -98451, -92215, -113846, -89768, -29322, 66588, 29725, -22620, -63741, -38435, -44602, -59239, -27456, 26700, 51084, -8992, -5872, -192, 5012, 12009, 57743, 42317, -13681, 14473, 84535, 51840, 27729, 38114, 40574, 45761, 90623, 91538, 35568, -11363, -11840, 47805, 71811, 34618, 82597]
7188H2597R6468l6153r8150q6754J9592M4205j0213k8361M9114k0673n6118j3204
7176e7650K2815L0481l753M3278K9881k8835j5544J2565M157k8727K3537K705
7164C4910o5098k1200m5404o249m3477P1605L5876K5322k4285n5881N8986N1663
7152A6768L5158k8378J3673J3148k7073L8586n2923k3424L3770m085l1139j6334
7140c2253K4292R092J6636P933k0485L2855j3917j548N4608J9689J2020o5418
7128D3504l0994L5143R995o7697j2690K647m5878J1126k336L9168j9868l9701
7116g7581L4133M4501P49m059p276K3057p974L4261J9881p687m3171k0209p434
7103a8809J1664M2309N679j6028k5479q551l378J0496Q881L2121k6113n1386l4605
$$ y = [82597, 179065, 142912, 44762, -41992, -22400, 21805, 11592, -16769, 32345, 11672, -44446, -57650, -34835, -4354, -8107, 35171, 65052, 36217, 20673, 33238, 37395, 8668, 32205, 34910, -30188, -51388, -96792, -103041, -146518, -74913, -39037, -13715, -38000, -93881, -34895, 16768, 51926, 23548, 37221, 50369, 23296, 61882, 8959, -14465, 19305, 15220, -15919, -32253, -7961, 1131, 17767, 25700, 5215, 38070, 24153, 22605, 77213, 96902, 108922, 43504, 12510, 47653, 57648, -10049, -22739, -20092, -65970, -54844, -57180, -18012, -37880, -77581, -43448, 1053, 1802, -2257, -9533, 13524, 5550, 39811, 59692, 52005, 8834, -11375, -18809, -7145, 35164, 40843, 24815, -664, -9215, -12593, -2097, 6784, 38905, 12792, -38594, -73199]
7090g3199m9926l6100M8036p32O089l9080P6678J20563R753J9140m6825m2385
7078g988M5029j2944j026j0552m833q423j2017K171l968O5632k2659n0377K0419
7065a536k1623L835j6669m9847l747j2201k0770j0269M973L5243M051l435R456
7052h2539M5817J2765m8926o701J1884N0229l1200n3650m847p833N335R267Q212
7039i2187R149Q649j562K6159J5299p0348J5817O7310n285j4193L1715K2605j0946
7026B182o0934K2728O844n4367m803L9370L4534K3675J6534m6253J6642N7141
7014E3293j3700m7077k8551k035q927L4894L4941k8815l4230J8375J6345J2521
7002G034N0956J9188K5119k8972k5818j1614n37L5938j2095l7422k6392j9825
$$ y = [-73199, -123125, -159225, -111189, -111921, -105832, -144912, -68234, 52329, 62082, 81222, 34397, -7988, 37041, 24097, 23071, 12519, 7686, -737, -12754, -10583, -14551, 51081, 28422, -21955, -1536, -23159, -19324, -35993, -85840, -89587, -101788, -122558, -132827, -127854, -92611, -88560, -91995, -82539, -36722, -23957, -72883, -79584, -67700, -17471, -48671, -102321, -107168, -115001, -109666, -100399, -92187, -83038, -74389, -75951, -49792, -34493, -104841, -89024, -21714, -26999, -41192, -9477, 13128, 2182, -58752, -36024, -29180, -83547, -88350, -48980, -14446, 9229, 25763, -20490, -3848, 53293, 39593, -7484, -36035, -38070, -46997, -12103, 22838, -5977, -40207, -21832, -5487, 7034, 57990, 77178, 102297, 73325, 47507, 35893, 35356, 71294, 59199, 21777, -4615, -24440]
6990b4440j5435J161j7620q933j4049Q399j4325L4990L8664K6655K2391N345m7056
6977d253p8630n542k3053M4009J06425J8440k2621K669l7421l2981K0100l0364
6965d3222o0868m5202N7484J4446o271K4599o228Q7534P463m7773J8316P1374
6953G1652j7009p009k8515K5662L3988K7397j5656p4883m4970L2370O8902P747
6941G9676m9730l1611j804J5255N637j02457J2437K7947n808k7323j2413K3911
6929f6283m0552j7779O5041K3781O2121J6015N891l5391k5870l0033j6281J6316
6917d3024m606k2987M0225M3524K9487K9925j4536m7701n9823j8066l1247j0145
6905a08974K1639J00009L0543k6265J7024k4700n9398M6411K1713n1664p6176
$$ y = [-24440, -39875, -38714, -56334, -65267, -79316, -70917, -85242, -50252, -11588, 15067, 37458, 42803, -4253, -82883, -88425, -111478, -67469, 38956, 57396, 34775, 37444, 23, -32958, -12858, -43222, -104090, -149292, -91808, -77362, -83633, -59034, -65262, 22272, 29735, -18038, 278, 71652, 54643, 47634, 19119, 44781, 78769, 106166, 90510, 15627, -29343, 3027, 71929, 79676, 29946, -1665, -3469, 11786, 17423, -85034, -72597, -44650, -50458, -77781, -90194, -66283, -106835, -124614, -59573, -35792, 26329, 42344, 48235, 12844, -13026, -43059, -59340, -43024, -47630, -70617, -30392, 13132, 42619, 72544, 58008, 10307, -49516, -67582, -98829, -108974, -87335, 12674, 43217, 16952, 33976, 9276, -50122, -3711, 18002, -33662, -109838]
6894a09838m73O9971J4715R265L7919O356j0106l668n7037J6723N490k0006J233
6881c9456J2991j2499q629k9290N6796K0847l1090k8735J9026j4424J7173l2444
6869f9734L7900M0309j3652r1693k6819N4850L5225J0599j7590j5778m9603K2756
6857h3230j1977N0338L987j7615p550J0442o2553l2088M0048N0634J6120k5605
6845f9049K8951n927L3192N7954o274k4907j17N032k9184n9184k3527K9331O0051
6832c658J242n8122k1788j2282K7368K6538R577k511J628L6757J7280j0569J2197
6819B3657J6078j819J7314M5188j5119j27238l3343J2621R483M8150K7347k9493
6807g174r0950m4827J4368Q8459j04j9291M7031P6042l8074m2787p1890j3860
$$ y = [-109838, -110311, -40340, -25625, -16360, 21559, 27915, 17809, 14141, -42896, -26173, -20683, -40689, -39456, -26465, -38964, -47593, -76883, -20087, 760, -30330, -59065, -40039, -54463, -37290, -69734, -31834, 8475, -5177, -96870, -123689, -68839, -33614, -23015, -40605, -56383, -105986, -83230, -95207, -44869, -40882, -58497, -66047, -55605, -118158, -150246, -110198, -59564, -43444, -69049, -40098, -46025, -12833, 45121, 38847, 13940, 13823, 18855, -10329, -69513, -93040, -63709, -3658, -2416, -60538, -82326, -94608, -67240, -40702, -31125, -33636, -32008, 4749, 22029, 11460, 23657, 39735, 37916, 55230, 100418, 85299, -41939, -75282, -62661, -53178, -5028, 22319, -7174, -98124, -142951, -128583, -40124, -40228, -59519, -12488, 63554, 25480, -17307, -89197, -103057]
6795a03057M5747P246n2413k6473J00756J02052m254q0039q3028J5769M9206M4486
6783A5998M0515p3912J8516k1383n4765q1821l9126P8662K9879K1807K3382J0044
6771c2204k3196J6479P0611k5511m4536L5746Q825k2102n1894k6524J4509O1606
6759a8191L8614P848K902n5533q122l2851j1246M7209O3848j5855J3790L6211
6747F8624p417p3507k8009N5279N8576L7396j5481M20M3937K2695m6125n3146
6735F3242M9116L6108m3026k5599j3778N693J1707Q495L9411K6460J7368K8464
6723B03661P0871J08529J47870R1700O8980n974l2699l492n8451j48556j61341
6712B81098r3928o6720r3668o6956L323P6306j6445l0831J10k001l5425m8635
$$ y = [-103057, -57310, -50064, -102477, -128950, -28194, 73858, 69604, -10435, -93463, -77694, -28488, 15998, 56513, -17399, 1117, -20266, -75031, -156852, -195978, -117316, -87437, -65630, -42248, -32204, -55400, -38921, 31690, 6179, -38357, -2611, 6214, -15888, -67782, -94306, -79797, -18191, 20423, 28271, 31173, -24360, -32482, -65333, -76579, -29370, 34478, 18623, 32413, 68624, 61207, -12300, -40309, 14970, 73546, 110942, 95461, 95881, 139818, 162513, 116388, 63242, 112358, 148466, 105440, 79841, 66063, 71756, 83463, 91958, 131369, 157829, 175197, 203661, 274532, 383061, 530931, 622631, 691611, 685637, 652938, 649446, 590995, 442439, 281098, 187170, 120450, 26782, -40174, -36851, 39455, 23010, -7821, -7711, -9712, -45137, -93772]
6700i3772J115L3335M8963K3440m9256r2L1609M4126Q528l6039k160L5665p542
6687C7920J0004L1146j0L2311K1652j3061K374O2987m810J2774l2675p9898p3642
6674G072o1830o688L1627j2558K9908L7827N7941p364J4807L4121j2510n227p619
6661I9507l8962l1222n1259k0931M2374K1655M5962J0895p94m5715o6444j0390
6649d5324L3417L7435M048M5782p362j6096r9713Q313K6543K3857K6460k8117
6637I243J9090L8923Q80j6864p3038l4844j1758N4295K5069m2135m9387k3619
6625a04145K0781M2189O1451M9650j8077o4863o1166j102M7124L2908n420l2075
6613c2745M4650M0503P969j5582j6565M5766K156m7803p603p2077k9344N2886
$$ y = [-93772, -92657, -59322, -10359, 13081, -36175, -36267, -4658, 39468, 47996, 11957, 9797, 45462, 37920, 47924, 79070, 79060, 111371, 133023, 119962, 122336, 185323, 180513, 193287, 160612, 80714, 7072, -54758, -61446, -29819, -42377, -12469, 25358, 83299, 75935, 90742, 124863, 112353, 107126, 99507, 60545, 29323, -21936, -42867, -493, 21162, 67124, 78019, 77225, 31510, -34934, -45324, -11907, 25528, 29576, 75358, 67996, 51900, -47813, -39500, -12957, 10900, 37360, 9243, 28333, 67256, 68136, 51272, -21766, -56610, -68368, -14073, 10996, -31139, -80526, -104145, -83364, -41175, 20276, 69926, 51849, -13014, -74180, -75282, -28158, 4750, -670, -32745, 11905, 52408, 60377, 44795, 28230, 73996, 76152, 28349, 20746, -51331, -80675, -27789]
6601b7789R1145P9020L2148j06754o1717m6852J2253p825J2425m150J6908K9829
6589A8641k971N375L7237k0059k3544n8616J630j6345K9654R278p617n004n678
6576c8019N4493J9588J6136j7556M983J4828N1895L5893n6553n2765k6079m4284
6564c7440j5984O906K7736N091J7025o22M8537J5177o103l1181k0897j5126m2817
6551d9698j3061M0246L9749N352j6510L0499m1427l4873L2808j509l1846R847
6539c0423J7508N8599N4742j6834L7629j6909k3041o0090j895m7919K790J1122
6527a4721M0087n8583m6839K8669K4662J1752O865M6471L564o2979k7532l341
6515e1925m095j7453M1433O4613K5049n867l0213l9485K3740N7935m8011n0436
$$ y = [-27789, 63356, 142376, 174524, 67770, 6053, -40799, -28546, -36371, -23946, -28096, -11188, 18641, 15670, 21045, 58282, 38223, 14679, -43937, -42307, -58652, -28998, -19720, -27337, -32341, -38019, 16474, 36062, 52198, 34642, 39625, 54453, 106348, 142241, 85688, 32923, 6844, -37440, -53424, -46518, -18782, -13691, 3334, 2712, 51249, 66426, 60323, 29142, 8245, -6881, -49698, -62759, -22513, 17236, 22588, 6078, 36577, -4850, -39723, -6915, -8424, -40270, -30423, -12915, 45684, 100426, 83592, 121221, 104312, 81271, 21181, 19286, -28633, -25843, -14721, 25366, -33217, -80056, -51387, -26725, -14973, -8108, 38363, 41927, -21052, -48584, -51925, -56020, -73473, -32040, 32573, 57622, 51755, 21542, -17943, 5797, 63732, 15721, -34715]
6503c4715q1790r296Q4323M7087l017k7116K6491O555K7068N1110p527l1122l216
6490D4835k2521J994l2032k4087l3728l3794N2668O3432O609o5985n1892K696
6478i1805k3197n770O603K6445N0684K6269l2497k1419M481J6152N0122l2681
6466b6613k8205J6636L5264L3277Q659l2415Oj2627L960K2282n3052M315K4297
6453d216m106k2974m4614o7666m079M7670N8011O4676M917o1267j2702L787K3915
6440a8648J5198L7954J6280k3971m9635k591J5724K4786M0331l5091p4903o4929
6428a19495K6377O5892M0773k5359k0611Q790N9852N6410l7231n5587k8697L0106
6416A220j4349L5437J6056K6896n8434j5764P9662M0786l4956p119j0931p7866
$$ y = [-34715, -116505, -125801, -41478, 5609, 2592, -24524, 1967, 8522, 35590, 86700, 79173, 48051, 44835, 22314, 24308, -7724, -31811, -65539, -99333, -46665, 16767, 23376, -42609, -94501, -91805, -115002, -120772, -114169, -87724, -37040, -10771, -43268, -64687, -60206, -44054, 6068, -26613, -54818, -38182, -2918, 30359, 39018, 6603, 6609, -6018, -2058, 20224, -32828, -28513, -4216, -8322, -31296, -75910, -143576, -147655, -99985, -41974, 22702, 27619, -33648, -46350, -42563, -18648, -3450, 34504, 50784, 26813, -22822, -25413, -9689, 15097, 55428, 20337, -54566, -119495, -93118, -27226, 13547, -11812, -32423, -23633, 36219, 92629, 55398, -189, -28886, 1220, -13129, 22308, 38364, 65260, 6826, -8938, 70724, 111510, 76554, 69435, 58504, -19362]
6404a9362j0517M131j4829Q502j3755o061O3858J0536p002m1581L1692j0214O937
6391B335n8178l5492m623n012k5197O251J6150N6696L3675k6670K4343J1327j1828
6378a6223k3122o145M8849l6502l5053K8995M4732k2011l3400k461P393J2819
6366c2129N6069J747l3431j3204O012J8253M0984M4169l3593J8678J2535l2704
6354E3386o9705r065L2925N2630N4604M3359n6341o1049J4758N111k6546k7693
6342F374k9167K950K5729M978n2528R737j049J468J4402R774Q3401N6381m4538
6329H7912p095N759N4172J2327o9239j1126n7919o3170K8579k238n7410p84K7426
6316e2806q185l6476K7938J241N898j2530Q859O3504M5788m1143m7502j1290L2637
$$ y = [-19362, -29879, -25748, -40577, -32075, -45830, -51891, 11967, 22503, 15501, -26080, 5612, -4602, 2335, -55843, -91335, -95958, -100970, -126167, -119916, -103766, -47070, -13395, -40065, -15722, -4395, -16223, -39345, -45490, 3359, -33143, -68196, -39201, 5531, -16480, -49880, -52341, -44948, -32129, 23940, 25687, -7744, -20948, -14936, 3317, 44301, 88470, 54877, 73555, 86090, 53386, -16319, -25384, 7541, 60171, 114775, 158134, 101793, 40744, 55502, 60613, 34067, 6374, -22793, -19843, 5886, 10864, -41664, -31927, -32976, -31508, -17106, -7332, 76069, 132450, 87912, 80817, 86576, 140748, 153075, 83836, 72710, 14791, -48379, -19800, -22038, -79448, -80232, -52806, -60991, -97467, -69529, -68288, -62390, -74920, -66061, -2557, 43231, 2088, -45414, -56704, -24067]
6303b4067R224k3744j4543r569M4727N6290M5283J1221k1737Q591p0089k588J7910
6290B6909k1472l3708n7968M3929L3262J0860M2496M2446k1057R358j4342m0569
6278B0144L7055K1178j9335n0046j7418j1035J8067R57k9783m4779L2520j3357
6266e5832k1830K7949Q5180K0416K5396k1380m1107n8227j5082J0016n853P0822
6254B0468K207m455p708p1297o3692j1297N4125L8384m2912k8588K4944R3462
6242C641J5391N271K3080J2186n9330l513R1850r59q3156m9422N367N180M9966
6229A5552L467J0694K6959J9876j8070m4199l7259O5872L4506j3954q4054k5715
6217d6325J6220N2810M4517m1490k2538l9360l7534N3734Q974l0842k2795N6351
$$ y = [-24067, -14843, -38587, -53130, -62699, -17972, 38318, 83601, 94822, 73085, 81676, 11587, 8999, 26909, 5437, -28271, -86239, -42310, -9048, 1812, 44308, 86754, 65697, 75055, 60713, 20144, 57199, 78377, 59042, 8996, -8422, -19457, -1390, -433, -30216, -74995, -42475, -55832, -77662, -49713, 35467, 55883, 81279, 59899, 18792, -39435, -54517, -44501, -50354, 20468, 22675, 18220, 10512, -60785, -124477, -135774, -81649, -43265, -86177, -114765, -89821, 3641, 19032, 24303, 47383, 59569, 239, -3274, 88576, 87617, 4461, -44961, -39594, -34414, 15552, 19019, 29713, 56672, 76548, 58478, 14279, -22980, 42892, 77398, 63444, -20610, -46325, -30105, 22705, 67222, 25732, 3194, -36166, -73700, -19966, -10992, -41834, -64629, -8278]
6205h278J9331O304q610l6476m4530l4880K3679P73J9821N927O275J982q185m280
6191f1147N7586Q810j4269j8130m2953j8629M0598l303k6658O889o444m2912N0043
6178g0519K1414J6502k0567k2064J003j7266m6588K2746J3920L7891L2286M5750
6166A4508L067j0503j7039J3033J9146n6960n1616J9188l4568K5297J9855q774
6154f5366J2116p166j1222k969K7586l3174j782K0153K2980O5715K7484m2642
6142A1713m0971J8898j1585j0537k2451l5952p294J4367L9899K2234P55o3938
6130h4862j3593Q0978L591J6443l7347j6611M207j7342r572j1857M4712J5580
6118b5673o6865o279L9821K5552j3489l553Q072p028N134q961K5297Q85l1293
$$ y = [-8278, 11053, 17357, 8747, -27729, -72259, -107139, -83460, -82687, -62866, -56939, -50664, -48682, -56867, -61147, -3561, 5249, -9020, -27150, -70103, -88732, -48134, -51437, -78095, -71206, -77650, -120562, -70519, -49105, -32603, -53170, -75234, -74231, -91497, -138085, -115339, -101419, -63528, -31242, 14508, 17575, 7072, -9967, 3066, 22212, -34748, -86364, -67176, -101744, -76447, -56592, -65366, -53250, -60416, -71638, -74607, -47021, -80195, -81977, -61824, -38844, 26871, 54355, 11713, -29258, -10360, -21945, -32482, -54933, -90885, -98179, -83812, -43913, -21679, -20924, -84862, -98455, -17477, -13886, 2557, -34790, -51401, -47194, -64536, -74108, -85965, -41253, -25673, -92538, -98817, -58996, -33444, -46933, -50486, -42414, -49442, -44308, -53269, -27972, -27087, -58380]
6105e8380n37P1108k1139O049M4892k2566m4036m5863M3384J3408J8119k8725
6093b4286R070o088J4727l8909K5410l9594N852N1912M0478K948p9025m5611K0676
6080f2440J1405l7140J8355r820m5131J4935M6811R1209k676m1866K7200J8075
6068B8917j2969o4n9518k4342L9732q331m7654l8420J4552M9938K9220N4914M1470
6055F7445J1676o8247p6705j2071j7423M4550j8853n8836Q073K7099K2391M4312
6043b6589K0542j8535K2581L1512Q222k3708l5805K0531p974q459m3783J4689
6031d6776J3731j3939K7638K6437J9979p1246m2925J2681K0692J4288K5911J16633
6019A03104M8382L0495l6499k9743l0056n1283n9639N303K3084l4443j8377K6212
$$ y = [-58380, -58917, 12191, -8948, -2899, 41993, 19427, -24609, -70472, -27088, -13680, 4439, -24286, -15216, -21304, -6577, -45486, -20076, -59670, -53818, -1906, 38572, 41520, -37505, -83116, -62440, -51035, -88175, -69820, -79640, -124771, -109836, -63025, 28184, 25508, -16358, 10842, 28917, 15948, 15884, -43634, -67976, -28244, -36575, -84229, -122649, -108097, -58159, -28939, 25975, 67445, 79121, 10874, -65831, -77902, -95325, -50775, -69628, -128464, -120391, -93292, -70901, -26589, -6047, -24582, -2001, 29511, 37733, 14025, -21780, -1249, -9223, -17682, -61465, -46776, -33045, -46984, -19346, 7091, 27070, -44176, -87101, -74420, -53728, -39440, -13529, 103104, 151486, 181981, 145482, 115739, 85683, 34400, -25239, -19936, 3148, -31295, -49672, -23460]
6007b3460K762k3941j8977L6163M487P816O4556m0800j6817j3187N3566K7500
5995E9668m9286j6807L0538P0271L5383n421n0747j4560R780J1827K66k5880J7219
5982G2251K7337k8851j4620k2848k8432l3047M000K117k4635K9849K6262m844
5970D539j676n3594J675J4100J0517M1071K6291K1332Q88j9140m1J7708o492m2959
5956A4219o0825m1958q671N6463J5645q972K4474m0090l695L2750K7019k9935
5944b3576K9964P011l5621M0612Q013M873k349J0930n629n5164J396N1829j4813
5931A7476l8957Q004J3110j836j3360l0154l888N7450N5237n8230j5427l9127
5919d9702L4275L9847j4395l6957Q444l3336p740J8889k0803R718L6820M5866
$$ y = [-23460, -20698, -44639, -63616, -27453, -22966, -15150, 49406, 8606, -8211, -21398, 32168, 59668, 10382, -6425, 24113, 94384, 129767, 124346, 73599, 59039, 68819, 80646, 80912, 55032, 72251, 99588, 70737, 56117, 33269, 4837, -28210, -24210, -22093, -46728, -16879, 9383, 4539, 2863, -50731, -49056, -34956, -24439, 16632, 42923, 64255, 65143, 46003, 45962, 63670, 57178, 14219, -46606, -88564, -97235, -40772, -25127, -34099, -9625, -49715, -53410, -20660, 6359, -23576, 6388, 13399, -22222, 18390, 26403, 31276, 28927, 39857, 34228, -20936, -19540, 32289, 17476, -21481, -13477, -367, -2203, -15563, -45717, -49605, 7845, 63082, 4852, -10575, -49702, -15427, 24420, 10025, -26932, -18488, -51824, -59564, -40675, -61478, -51760, -14940, 30926]
5907C0926j0532m7402L2128L9259Q209j7427l8240l8079J0682O0361M4884l0752
5895D4017N0258Q5496k7382m5877M846J5239k7745o3640l0014J9144k8766m7322
5883e1746m1299M0847L2198q140K5072k0788o083P4243k0915n0806r126L3205
5871c338L526K5072m2738k11L30O5619M4466K4741O2214m4364j58663l9766L306
5858e9806P6454L3419o4194K0627K3093J2008m0357O3227M3178k4862j05271j7802
5846d0286L5269k8890J864J0839J9842K0989P7856J6838K7887j689r4504p6017
5834c0002K1219M1231K0614P004K2548n1225n730P484R565l1553Q345K9710j7032
5821C2178m6092j5062K4642R002R003O049J5266R120p327l52j5595l9212q7638
$$ y = [30926, 20394, -27008, 5120, 44379, 52588, 35161, -3079, -41158, -30476, 29885, 74769, 44017, 94275, 179771, 152389, 106512, 111358, 126597, 98852, 35212, 5198, 24342, -4424, -51746, -93045, -52198, -20000, -28140, -3068, -23856, -29939, 44304, 23389, -27417, -36543, -3338, 188, 25260, -17478, -17689, -17359, 48260, 92726, 117467, 179681, 135317, -23346, -63112, -59806, 16648, 50067, -14127, 6500, 29593, 41601, 1244, 64471, 107649, 82787, -22484, -40286, -5017, -33907, -32043, -21204, -1362, 19627, 97483, 114321, 142208, 140519, 46015, -30002, -8783, 32448, 53062, 60066, 82614, 31389, 25659, 33143, 42708, 11155, 19500, 49210, 32178, -13914, -28976, -4334, 4668, 13671, 19720, 34986, 44106, 36779, 36427, 20832, -18380, -106018]
5808a06018M3003J7619J0740O522M5245J3856k5833m8960O14k492l877r642M1393
5795a7830p1376J2980N2655K1773L775K1068j9502j8975L2398J6003J8769J424
5783E3162n3008k0467o2739L1867M0482J5434j9279J7599J939n2725j1240m521
5771f3496l9229M8333R2089l8562k7627J1444K1976J9205j6061K4407l3405o2796
5759f3722L2735N3222j9223j2206k8490j9090o9948l3958M7811K6932l636o950
5747i6523K6553K0954K0202R016J6517l9548j251p636O0876k339L3322P3306K0498
5734A33947n2018k0580L07L8546P163m3385L3310M9614R849m1299l5724j242l0383
5721D8105o7765J5245K3367k3616J9898M6791P6468o6164m0554k7703l1517K9792
$$ y = [-106018, -63015, -45396, -34656, -28134, 17111, 30967, 5134, -43826, -43212, -45704, -49581, -59223, -17830, -89206, -76226, -23571, -1798, 1977, 23045, 3543, -15432, 16966, 32969, 51738, 53162, 154, -20313, -83052, -51185, -10703, 4731, -14548, 3051, 4990, -47735, -58975, -63496, -102725, -54392, 37697, -865, -28492, -17048, 4928, 24133, 8072, 32479, -926, -63722, -30987, 22235, 3012, -9194, -37684, -56774, -126722, -160680, -112869, -85937, -89573, -96523, -69970, -49016, -28814, -19798, -3281, -42829, -44080, -51716, 9160, 6821, 40143, 113449, 133947, 81929, 61349, 61656, 100202, 107365, 63980, 97290, 146904, 156753, 115454, 79730, 78488, 48105, -19660, -4415, 18952, -4664, 15234, 62025, 138493, 72329, 31775, 4072, -27445, 2347]
5709B347M6944j6812o9233J3484n8959K8410Q0334j9405o8127J95K4271R777J5872
5696a0902M977j4437J4465J3912m83j6716K6924m916K6535L404J2671k734m3261
5683I439L9122j1204J403R871n4633p0119O464j9743j2555l4429L7423L9667P397
5670e1897l9161K7273P6974J5322l631n294l1169J5023j9895K3697J5219l161
5658A9300m9554m3579L4249P5145L6989R282k8999l6407k3394l6467J2265j6709
5646d7879k2262K2446J2700K2791L5576K5155l4522J686l0365J3961L2014K0573
5634E1874j281O43M257o03j2081o626K3795J3384l376K88l1401m6998j9298K8722
5620A299J0705q922j0906O384k8281K5670j0945p7801J638J9358K9281K3380P984
$$ y = [2347, 49291, 32479, -36754, -23270, -82229, -53819, 26515, 7110, -61017, -60822, -36551, -26774, -10902, -5925, -20362, -5897, 8015, 7532, -9184, 17740, 12824, 39359, 42763, 55434, 52700, 9439, 48561, 37357, 38760, 48631, -6002, -76121, -69657, -89400, -101955, -136384, -98961, -59294, -51897, -91058, -63785, 13189, 28511, 24880, 19586, -11583, 3440, -16455, 7242, 22461, 19300, -30254, -73833, -39584, 35561, 72550, 81832, 52833, 16426, -6968, -43435, -31170, -47879, -70141, -47695, -34995, -12204, 23372, 48527, 14005, 15691, -14674, -713, 31301, 51874, 50593, 51236, 55493, 54890, 42809, 36183, 59978, 73362, 69986, 70274, 38873, -8125, -27423, 1299, 12004, 3082, -7824, -1440, -29721, -4051, -14996, -92797, -91159, -71801, -42520, -19140, -11156]
5607a1156k8404M6123L8312j3848j5311r3906l6055N1699N189J9440L1020L3868
5595B6971j9141L1244j0609l7380O208O9703J7786L041o427q4095j6366n6392
5583g5457r1552J6844N6333M0964l6080k2569K7836M3976K4199K8751R50n2277
5571c8082n333K3935L5478j6564m9336n166J5939m5161L3419P126l667N7970L9116
5558D9674k0781l4909N2928l5248p3197j879k8401J805O7913N3149J9391j5210
5546C5235l4129k3104J8546L0962O6786J1099n7446p2245L9495R848l781k6808
5534e542K1121K6014p5587l3544J200j3636L0547K7257j807K5743j596M355j6582
5521a2057M1972m0573l5429j1798k0979O2107N8812n1723J5461N8861L9711l7244
$$ y = [-11156, -39560, 6563, 44875, 31027, 15716, -78190, -114245, -62546, -57357, -37917, -6897, 26971, 7830, 39074, 28465, -8915, -2707, 66996, 84782, 87823, 81396, -2699, -19065, -75457, -167009, -150165, -93832, -52868, -88948, -111517, -83681, -39705, -15506, 13245, 14195, -38082, -43415, -19480, 15998, -566, -49902, -55068, -39129, -84290, -50871, -43745, -47412, 10558, 49674, 28893, -6016, 46912, 11664, -61533, -63412, -91813, -90008, -22095, 31054, 50445, 35235, 1106, -21998, -3452, 27510, 94296, 105395, 47949, -24296, 15199, 25047, 21266, -5542, 15579, 41593, -33994, -67538, -66338, -79974, -49427, -22170, -23977, 1766, 170, 4525, -12057, 29915, -10658, -46087, -57885, -78864, -16757, 42055, -9668, 5793, 64654, 104365, 67121]
5509F7121r0000k7769J3374J7580k9248K4041O2735k3574q2848l4015j5587J5980
5497a02210O186l4461k5038R615P7721P5942j3619m6293J1578O730Q4377K7695
5485G8223j8488l8499n413R173l8406J5993j5799j2206J4958L8169M6453J6972
5473I1130o8696m5876L8251j6356j3065j6215L7753J0984o7331l9267P6513n260
5461a7435o176P4925J3686j00953j8354J5569q96j9523K0085N8609J4047k9907
5449C677n092j5949j3530m0698l8362J64M6074N2084k8731k5011O867k3352l1880
5436a13739L6093M7014m3627n9231k9403L1879M2679k5442k1147l0729J7670P1413
5424g6570J2173k6307k3486R091L7238l470n0216P231Q8069m768n8149j647J19624
$$ y = [67121, -22879, -50648, -37274, -19694, -48942, -24901, 37834, 14260, -68588, -102603, -118190, -102210, -96024, -130485, -155523, -145908, -68187, 7755, -5864, -52157, -40579, -33849, 50528, 78223, 59735, 21236, 15823, 24996, -13410, 2583, -13216, -25422, -10464, 27705, 74158, 91130, 22434, -23442, 14809, -1547, -14612, -30827, 6926, 17910, -49421, -88688, -12175, -17435, -23611, 51314, 65000, -35953, -54307, -38738, -39634, -59157, -39072, 19537, 33584, 3677, -1415, -17364, -30894, -71592, -109954, -109790, -63716, -11632, -40363, -65374, -58507, -81859, -113739, -77646, -30632, -74259, -133490, -162893, -131014, -88335, -113777, -134924, -165653, -147983, -76570, -64397, -90704, -114190, -105099, -67861, -71331, -121547, -114316, -26247, -31015, -89164, -90811, 28813]
5411B8813K2775j742m0909m4189M4301K6515l174R892n3219l0479J9667J6937
5399d812K9607K8995j43l4553m0611p9405L4239n175L0007j2288j9795J5830O1975
5386C871L3057P013m8100l4712j6420k3257j2781n947Q0871R731l7072K2085O3816
5373D2155j1430m1465M2822K3388m6188n5440M1894K7694j3997o4248l6479l3684
5361a24978M6316L28m0693k6006O5085M3497K6836J6236l8800o5207J9051M4068
5349c4267p705k6256L704n4680K4648R5660j6763l9376M0932P9366m3346k2764
5337h47n3660m6374L3609L0847J4417j477n008M5192K5133J116L2709K6141m6505
5324E5293k8732K6485K8403q862k1125o572K2285J3749k6275m0366m8895r587
$$ y = [28813, 51588, 49846, 8937, -35252, 9049, 35564, 32390, 42282, -10937, -41416, -21749, -4812, 24795, 53790, 53647, 19094, -21517, -100922, -66683, -71858, -41851, -54139, -73934, -58104, 3871, 36928, 43941, -4159, -38871, -55291, -78548, -91329, -97276, -16405, -6674, -43746, -21661, 42155, 30725, -10740, 32082, 55470, 9282, -46158, -4264, 23430, 9433, -54815, -91294, -124978, -78662, -78334, -119027, -145033, -79948, -36451, -9615, 6621, -32179, -97386, -78335, -34267, -41972, -68228, -64524, -119204, -94556, 1104, -15659, -55035, -14103, 65263, 21917, -847, -54507, -100881, -67272, -36425, -22008, -23485, -28493, 16699, 41832, 42948, 75657, 101798, 55293, 26561, 53046, 81449, 72587, 51462, 44890, 67175, 80924, 54649, 14283, -34612, -44199]
5312d4199j2036J5874L8792l3176o8946L5590k913J3488L4744k4079r642K8028
5300b8475M0337k383o029K3964l7243L2134J2012o5428m2724P002L6232K5647
5288d954k413k7373j469n353l6051k7419j2631j5871M2745K7730K2430k7017Q0012
5275A2366O5741N8872m2828m793j9621l9562n0492l4233L5872O2442L7661m1205
5263D0220p4673P703o872O97j3498M7223N5918k8321j2324l3339l8572O182M404
5250d5252k3426n021O554j635N54M1304K1064L9466p4998l6518O734J5326j6048
5237g1896l033L0219Q2262J9225m2283k6252j507j9528o4170L8903P6420N205
5225B3565m2023l221J1085L2782J7848n5075k2825L9589Q3884N7151l2099o3607
$$ y = [-44199, -56235, -40361, -1569, -34745, -103691, -68101, -71014, -57526, -22782, -46861, -56503, -28475, 11862, 9479, 3450, 27414, -9829, 22305, 34317, -31111, -73835, -66833, -30601, -4954, -7367, -34740, -36209, -41562, -77613, -105032, -117663, -133534, -90789, -63059, -40629, -67646, 12366, 78107, 136979, 94151, 89358, 69737, 30175, -20317, -54550, -18678, 43764, 81425, 40220, -34453, -26750, -33622, -32925, -46423, 800, 56718, 28397, 16073, -17266, -55838, -49656, -45252, -68678, -73699, -67145, -68780, -68226, -26922, -5858, 33608, -41390, -77908, -71174, -55848, -71896, -74929, -44710, 37552, 56777, 14494, -11758, -13265, -32793, -96963, -58060, 18360, 23565, -18458, -21679, -10594, 22188, 40036, -15039, -37864, 1725, 85609, 142760, 110661, 47054]
5213D7054m8424o878M0520o1346l2039K9455L7878K2160P2388k1819j3445l6987
5201B8517j7663N49L8706m6077n5101J7212Q894k4233m358O1215K0343J6032o671
5188C7365J9622N0341k6J722Q416l4512J4510l4042K5314k9496j0653l4198m8515
5175c4152k5838N7733P0951k2695R73L0416k0450m2828m1755k700M4371J4851
5163B8877m5705l9695m0902k0038r896J4795J5269n181L7825J4136J89M9994L3883
5150C3551J388J9802J1039m2875p1532k5818l5759L275M0544P892l3899K1745
5138g0647M6952K8643p791l025J0351M5214l1470m6878J7471M0982K1856j4224
5126C7434k2862K9858o9864m3431L7603N4997K1227l6851j2246J8832J3388l2212
$$ y = [47054, -1370, -8248, 32272, -29074, -61113, -31658, 6220, 28380, 100768, 78949, 65504, 28517, 10854, 11403, 50109, 4032, -51069, -33857, -24963, -49196, -53554, 7661, 28004, 44036, 37365, 56987, 107328, 107302, 109024, 117440, 82928, 97438, 63396, 88710, 59214, 48561, 14363, -34152, -59990, -2257, 68694, 45999, 46972, 77388, 56938, 14110, -27645, -30345, 14026, 28877, -16828, -56523, -97425, -117463, -127359, -112564, -97295, -102476, -64651, -50515, -50326, -332, 33551, 34939, 54741, 65780, 22905, -48627, -74445, -110204, -106929, -66385, -58493, -92392, -70647, -23695, 4948, -2843, -5868, 4483, 49697, 18227, -28651, -11180, 29802, 51658, 37434, 14572, 44430, -25434, -68865, -31262, 23735, 44962, 8111, -4135, 14697, 28085, -4127]
5114d127k8789l3677k7719l4850K848K4392J3486K6896L4647L293L9164M6213
5102F1777m4493m183K5796j5661L8135j788K2039J5100k3719M332j3244j03J5079
5089G9067L3328J5520o321k0703n3308l7036k8897J1961M6449P3006k3295L3298
5077A23069o2232m8267l8864j1254M3229J4915k8219k3946n133O9028K0528l1779
5065B1075o5229l2673j3103l1785R841O3045M8114M4064K0596j1788k2510j9689
5053I958r196K1134n4337K8795k9602M122M2685o744j8568M780m3563k5635J1888
5040f4283K2315j4815l1422o6011P2622K6860K4015M6455N4013j7392l8227j8956
5028d826m7039l5588K2548J8135M1882N7327m0832m0685L2204M2747J0208k1682
$$ y = [-4127, -32916, -66593, -94312, -129162, -126314, -101922, -88436, -61540, -26893, -23600, 15564, 61777, 17284, 13101, 38897, 23236, 61371, 59583, 81622, 96722, 73003, 77335, 64091, 63988, 79067, 112395, 127915, 121594, 100891, 47583, 10547, -18350, -6389, 40060, 113066, 89771, 123069, 60837, 12570, -26294, -37548, 5681, 20596, -7623, -31569, -36702, 32326, 52854, 21075, -44154, -76827, -89930, -121715, -111874, -48829, -715, 43349, 63945, 52157, 29647, 9958, 762, 21896, -32441, -3646, -33248, -29126, 13559, 6815, -11753, -6973, -50536, -76171, -64283, -41968, -56783, -88205, -154216, -81594, -54734, -30719, 15736, 69749, 52357, 14130, -4826, -51865, -87453, -64905, -46770, -4888, 52439, 11607, -29078, 3126, 45873, 56081, 34399]
5016C4399L6088L2289j38889k4761N8532Q657j5174J1551l2050o0930l722J3161
5004h0849L180J2849M6405L1703j7244j0363L1691M4125k3202j3881J3570j5997
4992B1987k7475L86O0443J5467n2666k9121L4766J0638m187l050M4052m4213j92
4979B6835o4399p1416m1648J8195J1188K9281K1009N3579M298M0273p229j9791
4967A75m6873M9261J4493m0434n144J0590k4034K6735J6962j8467j0006j1594
4955c8336j881K0696K4K0712J2582J8697o0093m0259J1332J6930J1219q242J7675
4942a8944K7392o414N610j3008l5942J895l6436Q0450O1523K4306k3129j6677
4930E0626j6974R830m1634k6146p6119n1632j262J2447M864M0663Q9203L4031
$$ y = [34399, 70487, 102776, -36113, -60874, -2342, 6315, -8859, 2692, -29358, -90288, -94010, -80849, -77669, -64820, -18415, 13288, -3956, -14319, 17372, 61497, 38295, 24414, 37984, 21987, -5488, -5102, 55341, 70808, 18142, -10979, 23787, 34425, 30238, 27188, 71240, 27027, 26835, -37564, -108980, -150628, -132433, -121245, -91964, -70955, -17376, -13078, 27195, 19966, 175, -46698, 2563, 17056, -23378, -28522, -17932, -41966, -15231, 1731, -16736, -26742, -38336, -40217, -19521, -19497, 1215, 13797, 32494, -27599, -67858, -56526, -39596, -28377, -36619, -18944, 8448, 2034, 7644, -5364, -41306, -39411, -75847, 4603, 66126, 90432, 67303, 50626, 33652, 43482, 1848, -24298, -100417, -152049, -153311, -140864, -136000, -95337, -6134, 27897]
4918B7897m6903k8399N452K8106P110J2772J4655R811j5668O7826m7404K099k6255
4905A1099n7731l7549J4991K2099M4578J758m8863p459o966k0047L1409K1187
4893c1494N7736L864n4200l9657j2450m4433l6573J02453M326k6942N171j3302
4881h5501N4728K1997k5247K5631M1229k212j7982L8662j2458K89o9k772L8903
4868G5198o033l1216K0795J115k8384l5181k4182J0241L6548L0852k568L329J5519
4855F6033J4673k026p350n7920m0289n6006P479K3121K0470r342k783O1835N4908
4842G2803l5112l0148k9313p590o377O6505N9489j8304l9845k1292m5640k2415
4830e7239K4957O2958M6922K4090M230l44J1209M7985k5552o2623j7906m7635
$$ y = [27897, -19006, -47405, -41953, -13847, -6737, 6035, 20690, 30501, 14833, 82659, 35255, 37354, 11099, -46632, -84181, -69190, -47091, -2513, -755, -49618, -57077, -64043, -84090, -52681, -31494, 26242, 30106, -24094, -63751, -76201, -120634, -157207, -54754, -50428, -77370, -72199, -85501, -30773, -8776, -34023, -8392, 32837, 30625, 12643, 51305, 38847, 39136, 39067, 36295, 75198, 69165, 37949, 58744, 59859, 31475, -3706, -27888, -17647, 18901, 49753, 47185, 50514, 66033, 80706, 78680, 71330, 13410, -26879, -82885, -75406, -52285, -31815, -41157, -43940, 17895, 72803, 37691, 7543, -21770, -29360, -35737, 30768, 90257, 71953, 32108, 10816, -34824, -57239, -32282, 30676, 77598, 101688, 105918, 105574, 116783, 164768, 139216, 76593, 58687, 11052]
4818A1052o5516k4872K609J4689K6127q9271l7585j4992P521O2802K3835K2913
4806f0688J3781M3383J4247L2906l2248m6744J8274o139o3958l7015j102P2035
4794e3268O3053K9002K644j7743j8166o0394j520M0242O9771K6364j5923k4851
4782C9211L870L5008k1127l9865j3171O9537n194j5465k2437k4140m0995k7875
4770f2643J0616n8691j1021L1527J00507O8250J0884k3672O362m5643k886L2884
4758E6474m7180n4420L3849Q651L8942j5335m8105j158R537L8928O3061J7012
4746A00256l7731n6868k155K2911k7682j4288o11J4909l0782r172Q2911j5597
4734B6101n0645l636M773Q402K6716O7102L6247r6410n5614L315L816M8848l3685
$$ y = [11052, -54464, -79336, -76727, -62038, -35911, -125182, -162767, -177759, -170238, -107436, -83601, -60688, -46907, -3524, 10723, 43629, 11381, -35363, -17089, -23228, -87186, -124201, -125303, -53268, 9785, 38787, 41431, 23688, 5522, -54872, -56392, -16150, 53621, 79985, 64062, 39211, 43081, 78089, 56962, 17097, 3926, 73463, 68269, 52804, 30367, 6227, -34768, -62643, -52027, -110718, -121739, -90212, 10295, 78545, 89429, 65757, 72119, 26476, 23590, 56474, 9294, -45126, -11277, -2626, 36316, 20981, -27124, -28282, -18745, 20183, 83244, 100256, 62525, 5657, 3502, 26413, -1269, -15557, -16168, -1259, -32041, -41213, 41698, 26101, -24544, -28180, -23407, -15005, 11711, 78813, 115060, 18650, -36964, -33649, -29833, 19015, -14670]
4721a4670M172K1957J2287j5453J1422M6177p4366k9044q0784J0422J7768J1241
4709g8871N7315J1561k6228k3770R070j588L5225k3592p697K2468k6114R980L1035
4696a1206j9371l646J0640J6285j0742l4207J4420m5896n9866L3495O452J9194
4684h4448R1516R454l3925l0881K5392o011j2275O0508j5821J7270p5154m9399
4672a03774o581l0100m008L1960L7276j3554J1751L407K313K1954K3459J608k9412
4659e3701K5165L0195j7249j6444M6855P69j7789J0047o602N3613m8934k2146
4647a6221J3488K0719m041o7316l7480P454R0440M1322J0215L1323j9762j3250
4635E6891p3096q81P759M2993j1478k2404l5300K8514K9949p4449k885N4723k8663
$$ y = [-14670, -10498, 11459, 23746, 8293, 19715, 65892, -8474, -37518, -118302, -107880, -90112, -78871, -21556, -9995, -36223, -59993, -50923, -52511, -17286, -40878, -48575, -26107, -52221, -42241, -11206, -30577, -34223, -23583, -7298, -18040, -52247, -37827, -83723, -143589, -110094, -103642, -84448, 7068, 16522, -17403, -48284, -22892, -28903, -41178, 19330, 3509, 20779, -54375, -103774, -110355, -140455, -144463, -112503, -75227, -88781, -77030, -73623, -71310, -49356, -25897, -24289, -53701, -28536, 1659, -15590, -32034, 14821, 15590, -2199, 7848, 1246, 54859, 5925, -16221, -2733, 17986, 13945, -53371, -90851, -83397, 7043, 48365, 58580, 89903, 70141, 56891, -16205, -17086, -9327, 33666, 22188, -216, -35516, -7002, 22947, -51502, -54387, 336, -28327]
4622b8327j1193n2142J3973l174n2479P2057Q2100N1088n8448j6301L5761j7683
4610A5232K3573J1074j1075l2021N929O6372K8613l7665n5068j3399J9243N136
4598B5944L513j8897j7917k116L7126O2264q344j6624l4294l6570k1009J2146
4586a4778L0626k4507M3030j7469l5060J8862R485j5057J5916n2704o3367k685
4574a07708K1075K0874K3594m907l0335M3694o190K3900L583m296J4249O0622
4562E8155N7472n7260l6092n5054m1139J1367Q8032M1930J5031l0657o1128j1382
4550b0725M5377j5805l9046m6088O223M3343n677N7381N7155n2434l7565K0413
4538A2552j5866P884J4638K4343J1254M1042j5924j9102K4857m024m7186k3804
$$ y = [-28327, -39520, -91662, -77689, -80863, -133342, -61285, 20815, 71903, 13455, -2846, 32915, 15232, 38805, 49879, 38804, 6783, 12712, 79084, 107697, 70032, 14964, 1565, 20808, 25944, 29457, 10560, -7357, -9473, 27653, 89917, 81573, 64949, 30655, -5915, -26924, -14778, 15848, -8659, 34371, 16902, -18158, 704, 10189, -4868, 11048, -41656, -105023, -107708, -86633, -65759, -42165, -47072, -77407, -33713, -39903, -16003, -12420, -16716, -2467, 58155, 115627, 58367, 22275, -32779, -73918, -62551, 25481, 67411, 82442, 51785, -9343, -20725, 24652, 8847, -30199, -76287, -70064, -26721, -32398, 24983, 82138, 29704, -7861, 12552, -3314, 4570, 19208, 43551, 54805, 95847, 79923, 60821, 85678, 81654, 34468, 10664]
4526A0664M1463J768n1437j5618k3338l045J0632N096q040L5364K0064k2339k5253
4513b4019l4258k5823J9616J8292Q009M270K1472q1P9165p7441o3420K2118k2142
4500g4242J7113P1010J6118k7978L1982k9582j8968l0937l094N5159j5006l8130
4488d6555j5484j0596K3361Q8380P541o6302Q682P150R781L5534N761j7379L139
4475C3013k9932m2593k1498N500J0916L1339K7231k4569q039M5877J9010R408
4463E5663K1319K7819O756n3248p903J7663j0701n7788O4493j1390n1855k3207
4451b2379k5680M9045L4893K4436j9301l0548N871p1826m2978l8641L1448Q4141
4439b1519L0655L6910K7560K614L10m6128q306J8358R987l2146j9240m625o6609
$$ y = [10664, 52127, 53895, 2458, -13160, -36498, -39543, -28911, -23815, -31855, 3509, 23573, 1234, -24019, -58277, -84100, -64484, -46192, -38183, -33913, -12441, -12522, 66643, -10798, -74218, -52100, -74242, -57129, 13881, 29999, 2021, 34003, 4421, -14547, -45484, -48578, 6581, -8425, -46555, -62039, -72635, -49274, 39106, 46647, -19655, -10973, -3823, 5958, 41492, 47253, 29874, 33013, 3081, -39512, -61010, -55510, -44594, -13255, 13976, -10593, -18632, 27245, 46255, 55663, 76982, 104801, 111557, 58309, 50406, 68069, 57368, -420, 64073, 52683, 828, -22379, -48059, 986, 35879, 60315, 41014, 10466, 16337, -55489, -98467, -137108, -105660, -21519, 9136, 46046, 73606, 76220, 76530, 30402, 22096, 40454, 50441, 18295, -945, -5570, -72179]
4426g2179k6765M5490M2598M0196m241l0827l1004k7719M058l3269J1934M5991
4414c5737K0411J4442k7018m0119m14K2149j1267N0191k7503k2864p362j5543
4402h0634k7536J3707L0843J7833K2642K057N123P5445K9876q4777l2918k549
4390c0888J5165L3949P5556k4916m2364k9602K5030J5156j3257k7442k2906q979
4378c5498o2697M2084R2754O487m0651j2698l5685m662N098q390K9512K1837M3358
4365D0849N9161o4952j7680p412L762n3638j8668N3453k894l3760j2344k609K1323
$$ y = [-72179, -98944, -53454, -10856, 29340, 25099, -5728, -36732, -64451, -60393, -93662, -81728, -35737, -15326, -884, -27902, -68021, -68435, -46286, -57553, -7362, -34865, -57729, -65091, -80634, -108170, -94463, -63620, -45787, -23145, -21088, -15965, 59480, 89356, 4579, -28339, -30888, -15723, 18226, 93782, 68866, 26502, -3100, 21930, 37086, 23829, -3613, -26519, -35498, -98195, -56111, 36643, 43130, 2479, -10219, -45904, -50566, -45468, -53858, -24346, -2509, 40849, 100010, 35058, 17378, 9966, 13728, -39910, -58578, -5125, -8019, -41779, -54123, -56732, -35409]
$$ [...]
##END NTUPLES=NMR SPECTRUM
##END=
