##TITLE=Analysis number 328604
Compound Code ac 35896
Project Code adrs
Chemist Name chemcollect
##JCAMPDX= 6.0         $$ Bruker NMR JCAMP-DX V2.0
##DATA TYPE= NMR SPECTRUM
##DATA CLASS= NTUPLES
##ORIGIN= Bruker BioSpin GmbH
##OWNER= nmr
$$ XWIN-NMR		Version 3.5
$$ Wed Jun 20 09:37:57 2007 GMT Daylight Time (UT+1h)  MAYBRIDGE\nmr@NMR_250MHZ
##.OBSERVE FREQUENCY= 250.131544655141
##.OBSERVE NUCLEUS= ^1H
##.ACQUISITION MODE= SIMULTANEOUS (DQD)
##.ACQUISITION SCHEME= undefined
##.AVERAGES= 16
##.DIGITISER RES= 18
##SPECTROMETER/DATA SYSTEM= dpx250
##.PULSE SEQUENCE= zg30
##.SOLVENT NAME= DMSO
##.SHIFT REFERENCE= (INTERNAL, DMSO, 0, 16.5102)
##AUDIT TRAIL= $$ (NUMBER, WHEN, WHO, WHERE, WHAT)
$$ ##TITLE= Audit trail, XWIN-NMR		Version 3.5
$$ ##JCAMPDX= 5.01
$$ ##ORIGIN= Bruker BioSpin GmbH
$$ ##OWNER= nmr
$$ C:\u/data/dgb/nmr/ADRS/1230/pdata/1/auditp.txt
$$ ##AUDIT TRAIL=  $$ (NUMBER, WHEN, WHO, WHERE, WHAT)
(   1,<2007-06-20 09:37:31.81 +100>,<MAYBRIDGE\nmr>,<NMR_250MHZ>,
      <created by zg, POWCHK disabled, PULCHK disabled
       configuration hash MD5:
       76 6E 9A 78 1E 09 19 81 EC 84 63 8F B0 6A 59 2D
       data hash MD5: 64K
       8B 1F D4 90 4D 3E C7 39 38 B3 18 0D 47 53 D7 5C>)
(   2,<2007-06-20 09:37:47.18 +100>,<MAYBRIDGE\nmr>,<NMR_250MHZ>,
      <Start of raw data processing
       ef LB = 0.3 FT_mod = 6 PKNL = 1 SI = 32K 
       data hash MD5: 32K
       C6 49 50 86 E7 DD 40 41 62 CF 32 68 60 79 18 81>)
(   3,<2007-06-20 09:37:49.04 +100>,<MAYBRIDGE\nmr>,<NMR_250MHZ>,
      <apk 
       data hash MD5: 32K
       0F CC 8E A8 DF B6 4F 26 F4 EB BA 7F 1F 2B 19 80>)
(   4,<2007-06-20 09:37:49.96 +100>,<MAYBRIDGE\nmr>,<NMR_250MHZ>,
      <abs ABSG = 5 
       data hash MD5: 32K
       AE C4 6D 4A AD 98 B0 74 36 21 8E 57 60 67 6C 85>)
$$ ##END=
$$ 
$$ hash MD5
$$ 9F BC EF 29 B5 CD F4 37 71 94 66 54 A3 59 35 BF
##$RELAX= 
##$RELAX= 
##$RELAX= 
##$RELAX= 
##$RELAX= 
##$RELAX= 
##$RELAX= 
$$ Bruker specific parameters
$$ --------------------------
##$DU= <C:\u>
##$EXPNO= 1230
##$NAME= <ADRS>
##$PROCNO= 1
##$TYPE= <nmr>
##$USER= <dgb>
##$AMP= (0..31)
100 100 100 100 100 100 100 100 100 100 100 100 100 100 100 100 100 100 
100 100 100 100 100 100 100 100 100 100 100 100 100 100 
##$AQSEQ= 0
##$AQ_mod= 3
##$AUNM= <au_zg>
##$AUTOPOS= <3 >
##$BF1= 250.13
##$BF2= 250.13
##$BF3= 250.13
##$BF4= 250.13
##$BF5= 500.13
##$BF6= 500.13
##$BF7= 500.13
##$BF8= 500.13
##$BYTORDA= 1
##$CFDGTYP= 0
##$CFRGTYP= 5
##$CHEMSTR= <none>
##$CNST= (0..31)
1 1 145 1 1 1 1 1 1 1 1 1 1 1 1 1 1 1 1 1 1 1 1 1 1 1 1 1 1 1 1 1 
##$CPDPRG= <>
##$CPDPRG1= <>
##$CPDPRG2= <>
##$CPDPRG3= <>
##$CPDPRG4= <mlev>
##$CPDPRG5= <mlev>
##$CPDPRG6= <mlev>
##$CPDPRG7= <mlev>
##$CPDPRG8= <mlev>
##$CPDPRGB= <>
##$CPDPRGT= <>
##$D= (0..31)
0 1 0 0 0 0 0 0 0 0.06 0 0 0 0 0 0 0.0002 0 0 0 0 0 0 0 0 0 0 0 0 0 0 
0 
##$DATE= 1182328650
##$DBL= (0..7)
120 120 120 120 120 120 120 120 
##$DBP= (0..7)
150 150 150 150 150 150 150 150 
##$DBP07= 0
##$DBPNAM0= <>
##$DBPNAM1= <>
##$DBPNAM2= <>
$$ [...]
##$SUBNAM7= <"">
##$SUBNAM8= <"">
##$SUBNAM9= <"">
##$SW= 20.6930455092707
##$SWIBOX= (0..15)
0 0 3 0 0 0 0 0 0 0 0 0 0 0 0 0 
##$SW_h= 5175.983436853
##$TD= 65536
##$TD0= 1
##$TE= 296.16
##$TE2= 300
##$TE3= 300
##$TEG= 300
##$TL= (0..7)
0 120 120 120 120 120 120 120 
##$TP= (0..7)
150 150 150 150 150 150 150 150 
##$TP07= 0
##$TPNAME0= <>
##$TPNAME1= <>
##$TPNAME2= <>
##$TPNAME3= <>
##$TPNAME4= <>
##$TPNAME5= <>
##$TPNAME6= <>
##$TPNAME7= <>
##$TPOAL= (0..7)
0.5 0.5 0.5 0.5 0.5 0.5 0.5 0.5 
##$TPOFFS= (0..7)
0 0 0 0 0 0 0 0 
##$TUNHIN= 0
##$TUNHOUT= 0
##$TUNXOUT= 0
##$USERA1= <user>
##$USERA2= <user>
##$USERA3= <user>
##$USERA4= <user>
##$USERA5= <user>
##$V9= 5
##$VALIST= <valist>
##$VCLIST= <CCCCCCCCCCCCCCC>
##$VD= 0
##$VDLIST= <DDDDDDDDDDDDDDD>
##$VPLIST= <PPPPPPPPPPPPPPP>
##$VTLIST= <TTTTTTTTTTTTTTT>
##$WBST= 1024
##$WBSW= 4
##$XGAIN= (0..3)
0 0 0 0 
##$XL= 0
##$YL= 0
##$YMAX_a= 212650
##$YMIN_a= -174346
##$ZGOPTNS= <>
##$ZL1= 120
##$ZL2= 120
##$ZL3= 120
##$ZL4= 120
##$ABSF1= 16.51022
##$ABSF2= -4.182953
##$ABSG= 5
##$ABSL= 3
##$ALPHA= 0
##$AQORDER= 0
##$ASSFAC= 0
##$ASSFACI= 0
##$ASSFACX= 0
##$ASSWID= 0
##$AUNMP= <proc_1d>
##$AZFE= 0.1
##$AZFW= 0.1
##$BCFW= 0
##$BC_mod= 0
##$BYTORDP= 0
##$COROFFS= 0
##$CY= 12.5
##$DATMOD= 1
##$DC= 0
##$DFILT= <>
##$DTYPP= 0
##$F1P= 14.0000005364418
##$F2P= -0.99999901652339
##$FCOR= 0.5
##$FTSIZE= 32768
##$FT_mod= 6
##$GAMMA= 0
##$GB= 0
##$INTBC= 1
##$INTSCL= 1
##$ISEN= 128
##$LB= 0.3
##$LEV0= 0
##$LPBIN= 0
##$MAXI= 10000
##$MC2= 0
##$MEAN= 0
##$ME_mod= 0
##$MI= 0
##$NCOEF= 0
##$NC_proc= -5
##$NLEV= 6
##$NOISF1= 0
##$NOISF2= 0
##$NSP= 0
##$NTH_PI= 0
##$NZP= 0
##$OFFSET= 16.51022
##$PC= 1
##$PHC0= -65.67292
##$PHC1= 13.76903
##$PH_mod= 1
##$PKNL= yes
##$PPARMOD= 0
##$PSCAL= 4
##$PSIGN= 0
##$REVERSE= no
##$SF= 250.130002945103
##$SI= 32768
##$SIGF1= 0
##$SIGF2= 0
##$SINO= 400
##$SIOLD= 32768
##$SREGLST= <1H.DMSO>
##$SSB= 0
##$STSI= 32768
##$STSR= 0
##$SW_p= 5175.98343685301
##$SYMM= 0
##$S_DEV= 0
##$TDeff= 65536
##$TDoff= 0
##$TI= <Analysis number 999999
Compound Code 99
Book Reference 9
Project Code 9>
##$TILT= no
##$TM1= 0
##$TM2= 0
##$TOPLEV= 0
##$USERP1= <user>
##$USERP2= <user>
##$USERP3= <user>
##$USERP4= <user>
##$USERP5= <user>
##$WDW= 1
##$XDIM= 32768
##$YMAX_p= 352381034
##$YMIN_p= -1516399
$$ End of Bruker specific parameters
$$ ---------------------------------
##NTUPLES= NMR SPECTRUM
##VAR_NAME=  FREQUENCY,     SPECTRUM/REAL,   SPECTRUM/IMAG
##SYMBOL=    X,             R,               I
##VAR_TYPE=  INDEPENDENT,   DEPENDENT,       DEPENDENT
##VAR_FORM=  AFFN,          ASDF,            ASDF
##VAR_DIM=   32768,         32768,           32768
##UNITS=     HZ,            ARBITRARY UNITS, ARBITRARY UNITS
##FACTOR=    0.157963299565203, 1,           1
##FIRST=     4129.70127066257, 0,            0
##LAST=      -1046.28216619044, 0,           0
##MIN=       -1046.28216619044, -1516399,    0
##MAX=       4129.70127066257, 352381034,    0
$$ Real data points
##PAGE= N=1
##DATA TABLE= (X++(R..R)), XYDATA
$$ [...]
23299b28711j00526Q2317J46300O4751p368K7883j48125m7497J27868J28521j10617
23288f5204N556r965q0040n1067j7643P485P052n8095K5900O4340J6502J7849
23276a37330N2940O9002j05903j12616J07571Q9733P4175n5314N8097J0286p0156
23265a9515L5046P7003k0111p7767J00833j9702j45614J4739N9474J24060L1216
23254A59662o6976r8462M8445L5574j0250p8548p0058q9235p4599n219N8751J93512
23242B597J06080L7884j3153l9179k9073K2461k56018j39763J48368R8040o5794
23231a27550J21175J19073j9872J4310n6357l1201Q6257M5766m6718q8895L2585
23220D8573K3564j37636q812N2090R888o015N8777k00322k02094N0683l6593J28377
$$ y = [-228711, -329237, -246920, -100620, -35869, -43237, -15354, -163479, -210976, -83108, 45413, -65204, -59648, -69613, -149653, -200720, -218363, -210878, -203826, -261921, -236021, -171681, -155179, -137330, -84390, -15388, -121291, -233907, -126336, -36603, 37572, -17742, 40355, 50641, -19515, 15531, 92534, 72423, -5344, 95489, 75787, -69827, -55088, 4386, 128446, 159662, 92686, -5776, 42669, 78243, 67993, -10555, -80613, -169848, -244447, -249666, -190915, 2597, 108677, 146561, 133408, 94229, 65156, 87617, -168401, -308164, -159796, -61756, -127550, -6375, 112698, 92826, 107136, 50779, 19578, 105835, 151601, 104883, 15988, 48573, 72137, -65499, -74311, -22221, -12333, -18348, 40429, -159893, -361987, -311304, -347897, -219520]
23208b19520J80791o8892j0632j8812o342N8664P9348j33156p4124J71996L3449
23197g230j332n073k1105l0351m6678k1888k4825o469K577O1479K7942N6415L9514
23184B2976L7945L7908K7279J09790K7570j01307k08949j62574N6343L2499r8089
23173b18609r8907J37604J04702k8324j47205P53J36011j2089j06234k6762J08496
23162a50564j0612o7945k4738L7075J79565K625j07502N8273R8806L9467L2133
23151H6583j4580J103j78016j39041M8856r9299k9362J17657J22532J89522P3651
23140A79606r1375N5411K6063j27050r4743q6311J2558p482j37563J29933J03480
23129c7473j02443k42416r7130J39458J45984R6581j360r9803J07411N2874j11056
$$ y = [-219520, -38729, -107621, -118253, -137065, -143407, -84743, -5395, -138551, -212675, -40679, -7230, -8562, -13635, -34740, -65091, -111769, -133657, -158482, -164951, -162374, -100895, -72953, -16538, 22976, 60921, 98829, 126108, 235898, 263468, 162161, -46788, -209362, -153019, -120520, -218609, -317516, -179912, -75210, -103534, -250739, -249986, -113975, -126064, -232298, -259060, -150564, -161176, -229121, -253859, -216784, -37219, -34594, -142096, -83823, 14983, 54450, 86583, 72003, 73106, -104910, -243951, -195095, -294394, -323756, -206099, -83567, 105955, 179606, 88231, 143642, 169705, 42655, -52088, -138399, -125841, -133323, -270886, -140953, -37473, -139916, -382332, -479462, -340004, -194020, -97439, -98799, -198602, -91191, -38317, -149373]
23118a49373M3629P1900J06781L313j47734j03032L4276P3642J35576j88257l740
23107a23019L8645L8094l8777R412l0946O0543M3938N7550R2353K855j63190j4782
23095b7324j9780k20206m7964J20295k214m8503Q005J48688J13873K6297q1245
23084c0078r2608j22629j9356L0203L6086j04182O0583J02729M5315o4907K7851
23073a30993L9918M9870M5555o4700q7787j6897r1622L1394J02101J01328P5605
23062E3772p0993O4425J24003l2346q4374r1638j0410p854p6970m8346J83749
23051C018J19704O3333q9747m1965M3769J9939o0033J7860L7371j59298j71778
23040b17827L7188J5011j8390J25126N4025l5427j10391K5040l1209j3106R3387
$$ y = [-149373, -105744, -33844, 72937, 76250, -71484, -174516, -140240, -66598, 68978, -119279, -123019, -84374, -46280, -85057, -75645, -106591, -46048, -2110, 55440, 147793, 150648, -12542, -27324, -47104, -267310, -315274, -194979, -197193, -245696, -237691, -89003, 24870, 51167, -30078, -122686, -245315, -264671, -234468, -198382, -302564, -241981, -139252, -93937, -158844, -130993, -91075, -41205, 4350, -60350, -148137, -165034, -256656, -225262, -123161, -21833, 53772, -17221, 47204, 171207, 138861, 54487, -37151, -47561, -55415, -132385, -180731, 3018, 122722, 186055, 96308, 54343, 98112, 118051, 58018, 75878, 113249, -46049, -217827, -180639, -165628, -184018, -58892, -4867, -40294, -150685, -125645, -156854, -169960, -76573]
23029g6573j02360j74380L5977J16048J49417o8116j03048M4218N1965j08465
23019b35317M8712J10461p0503p0640J71867n4978O717J85342O8896j12208j03481
23008e5132k4390o2297L6897N1185M4844L4360n4608q2084o8957R0990K10694
22997A21502l3882p9909j51229j71959R4320N1589J47857l4336J1140J12511k6180
22986D1424j60118r8427O5448J30537J5329q4974M9417O0436K4789j2093M3185
22975G4953p3067j79844K8485p4174Q9869Q3606l4274j33704O4908M2824j9660
22964a30078k2475J07125J18876o5800k01988p7914J07974J4898m0625o521Q547
22953a87981N6499m1488l0953k28363n9484M6922K322L8949o6391Q5627K28533
$$ y = [-76573, -178933, -353313, -317336, -201288, -51871, -119987, -223035, -178817, -126852, -235317, -186605, -76144, -146647, -217287, -45420, -100398, -93681, 91661, 160557, 48349, -55132, -79522, -141819, -104922, -53737, -8893, 25467, -29141, -111225, -180182, -89192, 121502, 87620, 7711, -143518, -315477, -221157, -169568, -21711, -56047, -44907, 67604, 41424, -118694, -217121, -151673, -21136, -5807, -90781, -41364, 19072, 43861, 31768, 74953, 1886, -177958, -149473, -223647, -133778, -50172, -84446, -218150, -153242, -110418, -130078, -152553, -45428, 73448, 7648, -194340, -272254, -164280, -149382, -190007, -196528, -187981, -131482, -172970, -203923, -432286, -491770, -444848, -442526, -403577, -469968, -384341, -155808]
22942a55808r665j1797o7707N2109K670p8252O1287J04934p401n4102r8896K07751
22930e4877J62111p0781m0252m0701j04955J49843J73990q404n2576j23587N8533
22919D8344o7410r5223k4860k580l4887J33988J67403M7353p0218j2951j47152
22908e8193p5106l7239l4895N8900K9537J4556J33046K1252j36020l4329N630
22897a12861J80956N6660l4178r4338n6979l7671n3775o4807j04628Q3789M7125
22886a90707j0157k1147j9848K431J2165O8397O7155M8914q7605n3210l8073j36219
22874c57904n7170J01508J79540K521J37897J37598l2119m0232p0270j29790O7533
22863f0888J37979L8453R3494l9559k8560n1646j43442J6379l8776j4066p0623
$$ y = [-155808, -165473, -177270, -244977, -192868, -190198, -268450, -207163, -102229, -109630, -163732, -262628, -54877, 107234, 36453, -3799, -44500, -149455, 388, 174378, 165974, 113398, -10189, 48344, -19066, -114289, -139149, -141729, -176616, -42628, 124775, 172128, 101910, 88959, -58193, -133299, -170538, -205433, -146533, -116996, -102440, 30606, 51858, -84162, -118491, -112861, 68095, 124755, 90577, -3761, -60740, -98411, -152186, -216993, -321621, -237832, -190707, -200864, -222011, -241859, -239428, -227263, -158866, -91711, -42797, -130402, -183612, -221685, -357904, -415074, -313566, -134026, -131505, 6392, 143990, 111871, 71639, 1369, -128421, -60888, 77091, 115544, 209038, 169479, 140919, 89273, -54169, -37790, -76566, -90632, -161255]
22852a61255j40645O2956J59584J67843K6532n9885M3173r9654J02874O7314K128
22841A70965J01868K5870j29605J7950j06607M278J42623j06856j05792m4989
22831c0295j4368p4476N6828O1320Q5357J01103n9405r4904q4134Q3524n9912
22820b9362j91598j27428K1060R4753J35926o8123j00486q4900l4824J55958J08575
22809a20449n3057n4770M0064K6460m4288N0737M8846N5930j07321l6646j04533
22798b99027p2918N9604J93632K09619J03498p5689Q6184q8703l4244m3519l8788
22787c51J6289N437K294O8057M824j9253J39687l7419j42644j9399K3834j36521
22775i5165J2921N467q6751J4310J70815o5203j5829J6320j79339j77989k0370
$$ y = [-161255, -301900, -238944, -79360, 88483, 115015, 55130, 98303, -1351, 101523, 168837, 170965, 272833, 298703, 169098, 187048, 80441, 84719, 227342, 120486, 14694, -30295, -44663, -119139, -62311, -991, 84366, 185469, 126064, 31160, -52974, 30550, -29362, -220960, -348388, -327328, -232575, -96649, -164772, -265258, -350158, -384982, -229024, -120449, -173506, -228276, -188212, -161752, -206040, -155303, -106457, -50527, -157848, -194494, -299027, -371945, -312341, -118709, 90910, 194408, 118719, 204903, 116200, 81956, 38437, -351, 15938, 21375, 23669, 91726, 96550, 77297, 216984, 179565, 36921, 17522, 41356, -95165, -82244, -76777, -163528, -149218, 21597, -43606, -59435, -43115, -222454, -400443, -420813]
22764d20813J4474J44853Q3923J54204P8365m8016j43059k8182L6504R9088n3078
22753h1737Q1725q1456j43872p1347P3657L3516J03988R9574J0732r2824j42936
22742b10980j5253J35113N3984q990j65625k9118K7061M8770r5315j06800Q1862
22731b85291L1862M3851O812L9870P3354M5970j35018j2140Q2219K543K2237K808
22719h0923n5465R6359M5232K4872o3353o1023J61394O0106n3787J0977Q2675
22708A67064O2647j40914p4751m3634M524N997j08041q4100R8523R5786r3870
22697a10769j86959L6168J05775J4954k7746O376M5576q3421K486O9012L5435
22686i3113q95J5514K0921j1518J03972Q4729n7533m6441O2k6541n4792P5192
$$ y = [-420813, -406339, -261486, -177563, -23359, 55006, 6990, -136069, -164251, -127747, -28659, -81737, -12, -81468, -225340, -296687, -223030, -189514, -85526, 14048, 24780, -68044, -210980, -226233, -91120, -37136, -46126, -211751, -240869, -213808, -165038, -260353, -367153, -285291, -253429, -209578, -202766, -162896, -89542, -43572, -178590, -190730, -108511, -105968, -83731, -80923, -136388, -40029, 5203, 30075, -33278, -94301, 67093, 127199, 73412, 84389, 167064, 229711, 88797, 14046, -29588, -25064, -19067, -127108, -211208, -112685, -16899, -110769, -297728, -261560, -155785, -140831, -168577, -162201, -116625, -200046, -197560, -128548, -93113, -94008, -78494, -57573, -69091, 34881, 119610, 62077, 15636, 15698, -10843, -65635, 9557]
22674I557J2256l4589o8341j45556o1205k2331J21112J49380J64901r6195k37225
22663b08236M9559J24818J7407j13125M7194O9843j65791k7228p132M0858L8664
22652a33169j04898m6142O0506N7423J00984J28732p0650L8380q534m4584P5324
22641E3372o662j0698p8036j8398K8698n5038j62850n0195R9602J06314K4785
22630f9106K0042R703j39320q7656L3304J66792J44025O3210q385q6395k16256
22619a70042l7782Q9734J19505J7570q064K7227Q06J4306o6683J3609n9982j07891
22607a67687j1858p3042Q2185q4036Q1401L4937J9972M2324n9268k9761K0722
22596a44111m5998J3587Q9418K9038j9466m4976l5996J9413K7373O942n7423P5387
$$ y = [9557, 21813, -12776, -81117, -226673, -287878, -310209, -189097, -39717, 125184, 28989, -208236, -158677, -33859, -16452, -129577, -82383, -12540, -178331, -205559, -212691, -171833, -133169, -238067, -284209, -223703, -166280, -65296, 63436, -7214, 31166, 22632, -21952, 53372, 46710, 36012, -42024, -60422, -31724, -86762, -249612, -299807, -200205, -93891, -69106, -49064, -39361, -178681, -266337, -233033, -66241, 77784, 140994, 132609, 46214, -170042, -207824, -118090, 1415, 18985, 10921, 38148, 38954, 53260, -13423, 186, -59796, -167687, -179545, -252587, -170402, -254438, -173037, -138100, -118128, -75804, -135072, -164833, -144111, -190109, -176522, -87104, -58066, -77532, -122508, -158504, -139091, -111718, -104776, -162199, -86812]
22584h6812N0283O9649N8813l1683K5885j2974q242K0850m9580J7116N6068l4332
22572G5041o3325j14347l4890J00432J355k06980o1456J14304Q2492N919O0907
22561d0548J16023N3463N741O7581Q6253M6842j93280k05586k9951k8022q9709
22550b11193j00212L1751P9543J31038L4040k6424O766M7251k2478K3245N150
22539a523J4401m7802q7490j6387m5546M1178M3558r5492o8033J84023m830P859
22527g6084l254J1676N5691j06181j2606Q9766Q1595n6770q9769j50034M5786
22516b10184J67460J35373K4193j10076o493j29421j30857N4600J60231Q4613
22506C9439m2029q1315j25535j2236O1710R476Q3967j3577L3043l5311r2406m7049
$$ y = [-86812, -36529, 33120, 91933, 60250, 86135, 73161, 64919, 85769, 36189, 53305, 109373, 75041, 11716, -102631, -137521, -37089, -35734, -242714, -304170, -189866, -107374, -101455, -40548, 75475, 128938, 134679, 202260, 288513, 335355, 142075, -63511, -93462, -121484, -211193, -311405, -279654, -200111, -69073, -35033, -61457, -54691, -7440, -29918, -6673, -1523, 12878, -34924, -122414, -138801, -184347, -143169, -99611, -195103, -263136, -79113, -83943, -76084, -79338, -67662, -11971, -118152, -130758, -40992, 40603, -16167, -105936, -255970, -210184, -42724, 92649, 116842, 6766, 273, -129148, -260005, -205405, -45174, 39439, -2590, -83905, -209440, -221676, -159966, -150490, -66523, -80100, -47057, -82368, -174774, -221823]
22494b21823K5320K2561m5712J2052L5357r397k8827J05936P8125j23431P2800
22483g7039p0902l0038l6615j1582J5819K30015J22559q1920j10999l8790k321
22472i1813P2379K8690M1913j0871j2475l3829o1077p8592q582J15909M7978j15314
22460a05684K551J2302L2790R4483J4770o0265m6081j46175j25836L6779J94387
22449i5979P0145L0319K4829M5100K9446J9382R341k3856j23096R610K61j59441
22437a63939l8986R4307J30112Q8o0455p4045j7182R7434k4363j29813q0988O482
22425b61348J83763P5339m79O054j10355o154R4099M9002q2362j02579j3024L6281
22413a31763q8939p3067J8496k7642o6721n8788P8793K23065P7621r0758p1628
$$ y = [-221823, -196503, -173942, -219654, -207602, -172245, -181642, -210469, -104533, -26408, -149839, -77039, -147941, -177979, -214594, -226176, -210357, 19658, 142217, 60297, -50702, -89492, -91813, -19434, 9256, 51169, 40298, 27823, -6006, -67083, -145675, -154257, -38348, 9630, -105684, -103133, -90831, -58041, 36442, 51212, -9053, -55134, -201309, -327145, -290366, -95979, -25834, 4485, 29314, 74414, 103860, 123242, 132583, 108727, -14369, -4759, -4498, -163939, -202925, -108618, 21494, 21582, -38873, -112918, -130100, -32666, -57029, -186842, -267830, -261348, -77585, -2246, -2725, 3329, -107026, -113180, -19081, 29921, -52441, -155020, -168044, -131763, -220702, -293769, -275273, -302915, -369636, -428424, -349631, -126566, -48945, -139703, -211331]
22402b11331Q4418R8125P307n0947n9460n9270J90375l3748j28228K978P3748
22391h6033J02999m209j50464j21650j368n4449J13958Q6947n0926Q1768k0010
22380a03437n8005J2254M7127J349l902j3751K1067j4267j5365J17667K7780l5613
22368a7096m6435q1269J6879n814R0859P5485j78208j52P6828O6169L1949J16612
22356A45807j34839j88263j45729R131K16721J4086J23584p9225k03099j1375
22346b53201P6377r2154k2156p356Q3536J7344p1183K818Q2788R9623K1709O3444
22334A589q435m17k9525N8035l2444j03405l3156Q8218m6769p7531q764o4272
22322b56876K4474J13755M0815L1253n3353M0776o1536j25066j32508m818J81457
$$ y = [-211331, -126913, -28788, -21481, -72428, -131888, -191158, -783, -34531, -162759, -159781, -86033, 16966, 12757, -137707, -259357, -260725, -315174, -201216, -114269, -165195, -83427, -103437, -161442, -149188, -102061, -100712, -104614, -118365, -97298, -111565, -126930, -9263, 18517, -17096, -63531, -144800, -127921, -133735, -42876, 32609, -145599, -145751, -68923, -2754, 29195, 145807, 10968, -177295, -323024, -313893, -97172, -83086, 40498, -38727, -241826, -253201, -176824, -268978, -291134, -298490, -214954, -197610, -268793, -265975, -183187, -83564, -61855, 1589, -6846, -7263, -36788, 21247, -11197, -114602, -147758, -59540, -106309, -183840, -192604, -256876, -232402, -118647, -77832, -46579, -99932, -59156, -120692, -245758, -378266, -383084, -201627]
22311b01627J89310N4455o515m1165R4884k4427j10829O5402r2448q4986L7519
22300a20427K0570j17126l8851M7640O1984m6563J36645K485p8119k6499l4674
22289a92935L0053J08146K5836j02287m4125k6893r1969L4270J28989j58557L1120
22278b58352Q0790J4911K17639q7480j07382j3325N515P6260K8254L6503Q4617
22267G7950l1581p8867M0710J17193j00171j02163N4287o8910o3867l9274Q754
22256a85939j53757L5116J8627m3911j396J86683M2820j59095N7986K8215j4171
22245a88822O6417J411j00759J27404J16721j15753j6554M1225j26747J4841J20198
22234f0418J45446J8179j38420r3287K23519m3238j82697L6436j6288o3778L5064
$$ y = [-201627, -12317, 42138, 35623, -5542, 89342, 64915, -45914, 19488, -72960, -157946, -120427, -99857, -216983, -255834, -208194, -146210, -192773, -56128, -53643, -131762, -158261, -192935, -162882, -54736, -28900, -131187, -175312, -202205, -294174, -259904, -130915, -289472, -258352, -177562, -162651, 54988, -32492, -139874, -153199, -147684, -71424, -43170, -6667, 77950, 46369, -32498, 8212, 125405, 25234, -76929, -22642, -91552, -155419, -194693, -185939, -339696, -304580, -285953, -329864, -331260, -144577, -101757, -260852, -202866, -174651, -188822, -122405, -120994, -221753, -94349, 22372, -93381, -109935, -68710, -195457, -180616, -60418, 85028, 103207, -35213, -128500, 95019, 51781, -130916, -94480, -110768, -174546, -139482]
22223a39482n2326M2522j13185K2688Q5530J08042O2409K4029J3457n2497l1238
22212c0051p8894q0596R810o646M7491O0698p4869Q3928p0702J8547L1053p4548
22200a64779k4469P1598J85081o5046j31863j03472P0349J68376n1105m9635K0440
22189g4525J1568j70709j08728l2329o6582J28282J26297o1315J37901j01638
22179b11778j8111q9642N2652J07539J30635O0715j44972o5922O478k7160q8543
22168b88109m3980J11599J35121n3045q6738J08504R0065L7179P2683k8886j15093
22157f0700l1900k53204j60999N6529O1760J35052J73178J25243O97R587n7325
22146b082j07776p8787Q8995J21132O411j24982k474p3277p0210j8227P4264p3977
$$ y = [-139482, -191808, -149286, -262471, -239783, -154253, -46211, 16198, 40227, 53684, 1187, -30051, -108945, -189541, -179731, -186377, -138886, -78188, -153057, -69129, -139831, -121284, -90231, -164779, -189248, -117650, 67431, 2385, -129478, -232950, -162601, 5775, -45330, -94965, -74525, -62957, -233666, -342394, -374723, -441305, -313023, -186726, -248041, -110140, -211778, -229889, -319531, -266879, -159340, -28705, 32010, -112962, -178884, -172406, -199566, -288109, -332089, -220490, -85369, -138414, -225152, -116648, -26583, 10596, 83279, 54393, -60700, -92600, -345804, -506803, -450274, -388514, -253462, -80284, 44959, 45656, 55243, -2082, -109858, -188645, -99650, 21482, 27893, -97089, -99563, -172840, -243050, -261277, -187013, -260990]
22134b60990l5384k4112J51904J16505j3526o6435N5575K04793j80011j44376
22124a96057J19143M6583J24536M819j49532n564j08083r5581J37461J59718m7806
22113a0363q5265P9215k1909L860P1700M3490J1J008j85266P0034N3153m0267
22101b0599J72402k3678n9385j13902l6402M5298n8853k4761Q0614n5971J47664
22090E2427O3335j14071p6492j24873J07975J00704P9392o7030o1393Q2441R20
22079D3335L6908m6914j27775o8592K27749K4290o0011p8771P4491l1122j75382
22068a81794N4168K10032L1706K1256k0127k11593j41012l382p1953J85296L4270
22057i3133q2995J00268K5906j14140J1828n5904J15376J06335j8511n6242q8897
$$ y = [-260990, -296374, -320486, -168582, -52077, -65603, -132038, -76463, 128330, -51681, -196057, -76914, -30331, 94205, 99024, -50508, -56072, -164155, -259736, -122275, 37443, -10363, -95628, -16413, -38322, -34462, 37238, 80728, 80739, 81747, -103519, -33485, 19668, -20599, 151803, 128125, 68740, -45162, -81564, -36266, -95119, -119880, -39266, -95237, 52427, 115762, 1691, -74801, -199674, -91699, 9005, 88397, 21367, -40026, 42415, 43335, 80243, 33329, -94446, -163038, 64711, 89001, 28990, -49781, 24710, -6412, -181794, -127626, 82406, 114112, 135368, 115241, -96352, -237364, -240746, -312699, -127403, -93133, -176128, -75860, -49954, -164094, -152266, -208170, -92794, 13541, -4970, -61212, -150109]
22046a50109N2835M7928O7669K5155n7427j3903N3333n3602l2471N4840L8288
22035C2536j03122K5473j00516j28390P5147R3098l0280J12473P0560m8869Q0329
22024G8439L1987m6726n2830j72047j24591L2363L259J01508J70875m8177k05988
22013b31928j30902J40493J21421q5274o6297L1673J15396P3097r1236p4465n6931
22002b54953J0194O6997J90754L7630r4976o2593p4410o0941l1544j460M2134
21991b33168N4117L2258J61874L418k14758l6543J14378N3855L9117L9366l1336
21980a7422j19939j8297M3692K5907K984O4069J1881J28153j8520m8591q3884
21969b9967k1751k03719J246J57593P6942J22480K2325J26560n0370q009k6368
$$ y = [-150109, -97274, -49346, 18323, 43478, -13949, -27852, 25481, -28121, -60592, -5752, 32536, -70586, -45113, -145629, -274019, -198872, -105774, -136054, -23581, 46979, -1890, 78439, 110426, 63700, 10870, -161177, -285768, -253405, -250146, -148638, 22237, -25940, -231928, -362830, -222337, -100916, -186190, -252487, -220814, -105418, -32321, -123557, -198022, -254953, -244759, -177762, 12992, 50622, -44354, -106947, -181357, -242298, -273842, -275302, -233168, -179051, -146793, 15081, 18499, -196259, -232802, -118424, -64569, -25452, 13914, -17422, -137361, -155658, -111966, -86059, -83075, -19006, -7125, 121028, 102508, 53917, -29967, -51718, -255437, -254191, -96598, -19656, 102824, 125149, 251709, 201339, 193330, 166962]
21958A66962p3059r3844J1506J27111J0764j77141P795J54271k9185j69966j13968
21947a78754Q2533J58621K3244K800k9189n8974R7558O9426k2253o2151m4552
21936C8309k8866m0635j06360p8926K3766J00198q0570j3346J82054J09075j27533
21925b2834o5336L6917p3169l0350J58780J30224p3170j36474l7080k5625K1876
21914a16241J03058J521j01060l0046m812L0013J48028J27260q2053n6636P3114
21903I2146M6555q3345m1089L8736k4425n0944O4942j09118j48577k8997M4784
21892a99332Q965L6101K4386R1633n3378j14339m2597k9566J0879j54267L3639
21881c87876J78153J44737K5026O844q8198l393O097q4180O2826K655L7404J02155
$$ y = [166962, 93903, 59, 11565, 138676, 149440, -27701, -19906, 134365, 105180, -64786, -178754, -96221, 62400, 85644, 88444, 59255, 281, 97839, 167265, 145012, 82861, 38309, 9443, -31192, -137552, -216478, -192712, -92514, -173084, -186430, -4376, 104699, -22834, -88170, -51253, -124422, -154772, 4008, 134232, 61062, -75412, -112492, -138117, -116241, -13183, -11662, -112722, -142768, -147580, -117567, 30461, 157721, 75668, 19032, 92146, 138701, 55356, 14267, 53003, 28578, -22366, 42576, -66542, -215119, -244116, -199332, -190367, -154266, -129880, -38247, -91625, -205964, -248561, -278127, -267248, -421515, -387876, -209723, -64986, -39960, -33116, -121314, -124707, -118610, -202790, -139964, -137309, -99905, 2250]
21869B250J2032Q4830J483k16632m444Q949K5246r2173L1988K4881L2003j23417
21857b13004Q5957K1611J65864m6882j55864Q9679J58843P3350l4434p9228n0816
21846A5076n062L1376N5766l8403p6944k2835R0131P3007j70873k7109O8015j4554
21834b2409j46665n7617j1189R2747J40159j1709m8444M1284Q8322l8063r2117
21823f5701K4014J0920j27354j9247J23348L4948K627m4926J6656j38338n8953
21812b42006K17311M2568j08622o4603K6918J1909K3183O7681l751n0723J06989
21801B6854j3346p5514j7896j88638L800J66361J0746J9989O6594p829j07893
21790a16772q2015j89136j13106J30283N1211N2664j888j0698n0183M2570J16936
$$ y = [2250, 14282, 99112, 100595, -116037, -120481, -111532, -86286, -178459, -146471, -121590, -89587, -213004, -127047, -105436, 60428, 13546, -142318, -52639, 106204, 179554, 145120, 65892, 15076, 10014, 41390, 97156, 58753, -18191, -41026, 49105, 122112, -48761, -75870, -7855, -22409, -169074, -226691, -237880, -145133, -4974, -16683, -65127, -23843, 64479, 26416, -65701, -41687, -30767, -158121, -177368, -54020, -19072, -16445, -61371, -44715, -183053, -242006, -24695, 17873, -90749, -155352, -128434, -116525, -93342, -25661, -29412, -80135, 26854, 13508, -62006, -79902, -268540, -264740, -98379, -87633, -67644, -1050, -8879, -116772, -198787, -387923, -501029, -370746, -319535, -266871, -268759, -279457, -329640, -287070, -170134]
21779a70134J12559l9192j15678n2521J7763L1329J18682J3853J7869K6026M4045
21768D601L207j9852k9965j48154Q6715Q7914m3310k5544J3510M74N8111O8271
21756E5978p888n1583j06480m1799r7232j44379m3980J60888K08866Q9912O018
21745B8321O8357j24010j5492q5908o4244l699j44828j07080J47665P2683J52097
21734g6138J1105O5990L7112o0740K0193j3706N463n5821j96606L6377J21006
21723a05765j14291o1519q529J7542N3871N2072n603O2593o1995o2887P034J12689
21711a14788o6047J196J16056J95373O3344l4065j02447j24311n0975K5842Q1961
21700h861J47617j2898q6844o8163O3234N11l4507Q0385j2102o6819o40J01165
$$ y = [-170134, -57575, -96767, -212445, -264966, -247203, -215874, -97192, -83339, -65470, -39444, 4601, 7808, -12044, -42009, -190163, -103448, -15534, -58844, -84388, -70878, -70404, -12293, 55978, 48090, -3493, -109973, -151772, -249004, -393383, -437363, -276475, -67609, 22303, 28321, 96678, -27332, -42824, -128732, -192976, -196675, -341503, -448583, -300918, -228235, -76138, -65033, 957, 38069, -22671, -2478, -16184, -10721, -66542, -263148, -226771, -105765, -220056, -281575, -290104, -272562, -218691, -166619, -172222, -109629, -171624, -234511, -227477, -114788, -180835, -179639, -63583, 131790, 195134, 161069, 58622, -65689, -116664, -90822, -8861, 138756, 125858, 39014, -29149, 34085, 34596, 89, 80474, 68372, 1553, 913, 102078]
21688A02078J3414p5265n5372p2319m1384j248M445j9415m039k3747Q8456R448
21676g4948M4239K0562j08093j68327o5224J17193l0681j5317J5419J9129N9658
21665a86390l4328l08L9693J03256K4365l7609j28748Q0558k2449p27J7818q1390
21653b26259J30108K04514J94363l9516j16190o7293p4384j41325j8154J51747
21643b389k5637o2298m8081j8077n1426M1344L6760m4573o218L5409N4707j5266
21631a05745j1123j47005L0354Q2756J7810n4940k4003J39831N136j00924L6658
21620a31195o9682N129Q4593Q4796p527p4930o8614j93987J3072J25171P7285
21609a55889j7245K787J04636K5175j6090j11458j10736J44748L7851k6685K2695
$$ y = [102078, 115492, 40227, -15145, -87464, -128848, -130096, -125651, -145066, -149105, -172852, -84396, -74948, -30709, -10147, -118240, -286567, -351791, -234598, -265279, -280596, -265177, -246048, -186390, -220718, -221026, -181333, -78077, -53712, -91321, -220069, -139511, -161960, -162687, -144869, -226259, -96151, 108363, 302726, 263210, 147020, 79727, 5343, -135982, -154136, -2389, -28026, -90324, -138405, -156482, -207908, -166564, -129804, -174377, -180595, -145186, -90479, -105745, -116868, -263873, -233519, -150763, -132953, -187893, -211896, -72065, -66929, -167853, -131195, -200877, -195748, -111155, -26359, -33886, -108816, -177430, -371417, -358345, -233174, -155889, -173134, -170347, -65711, -40536, -56626, -168084, -278820, -134072, -96221, -122906, -100211]
21598a00211P5998J2829n0192J78900m3880m8939J8193L8203n3163j60241k00235
21587c32738m5764J7564J969P3945k8021J63592J8886L8203L2623L3181n0248
21576g6808n1430R2979j95631R5628J06944K9030m1347m8111J5382N2041n4229
21565g5552l4031J03702J5511o8727O8365P5820l5067p6829J70531M303k6180
21554A21846j9392p8550l4248L7590j2526j06231r448J34820j44786j18654p0170
21543b99749L5079J45791J66010n9257o6400N8579L2862q3781n3721k7352l4134
21532a86073j09028m9138P2038L4901M4870O0047m5562M3678R9384M8052j73881
21521a60712j05522K5696R4346J40475j3100j51776r8149k78K6290J00555J45
$$ y = [-100211, -24213, -11384, -61576, 117324, 73444, 24505, 42698, 80901, 27738, -132503, -332738, -378502, -360938, -358969, -285024, -313045, -149453, -130567, -92364, -59741, -26560, -76808, -128238, -35259, -230890, -135262, -28318, 712, -40635, -88746, -73364, -21323, -75552, -109583, -5881, 9630, -59097, 9268, 85088, 50021, -26808, 143723, 148026, 121846, 102454, 23904, -10344, 27246, 14720, -91511, -100959, 33861, -110925, -229579, -299749, -264670, -118879, 47131, -12126, -78526, -19947, 12915, -70866, -124587, -151939, -186073, -295101, -344239, -272201, -237300, -192430, -132383, -177945, -134267, -34883, 13169, -160712, -266234, -240538, -146192, -5717, -18817, -170593, -268742, -269020, -242730, -142175, -142030]
21510a42030o1595K3517p5847N5941k680K3398p3719j4J69294J29315N8623j99921
21498i5718j41986J02507J15998J04759j18335k34091N1017J25455R3145k1244
21488a8493K8511n3480r3637j2420m0198l1111J32490Q4801K4580J133p0658R6837
21476D8355O2359n4343j12620n6977P6407k4432K8552m0554l0014j0457N7892
21465e5832L4307p0157O8386Q0552J23317r3154j54756j8206n6596l8121Q8696
21454i1564o2968l4241N8195J82620R5821q6517j09978N0822K8095j69553j27323
21443b66591q4458J71168J32539Q0120n4318p8931q9262j8388P5656J52048j0610
21432H973j07646l8510Q8411J2883N1087K1216J75903K3047p8572q5554q0885
$$ y = [-142030, -203625, -180108, -255955, -200014, -202694, -179296, -253015, -253029, -83735, 45580, 104203, -95718, -237704, -135197, -19199, 85560, -32775, -266866, -215849, -90394, 2751, -18493, 10018, -43462, -137099, -149519, -189717, -220828, -88338, -3537, 21043, 22176, -48482, 48355, 110714, 56371, -56249, -113226, -36819, -61251, -32699, -73253, -103267, -113724, -55832, -21525, -91682, -23296, 57256, 180573, 87419, -67337, -85543, -142139, -180260, -91564, -154532, -188773, -130578, 52042, 147863, 61346, -48632, 2190, 30285, -139268, -266591, -351049, -179881, -47342, 32778, -21540, -100471, -189733, -208121, -132465, 19583, 8973, -98673, -137183, -48772, -35889, 15198, 36414, 212317, 235364, 156792, 71238, -9647]
21421i647n3078M6343o4878j63486p8083k4783K5611Q7922J74898M4732J9427
21410D978M0512J1553r0119m7915r4358M4298Q1187j94403l5084R3947K2840J02519
21398f0045m0624q4203K8631J32632J6364n1088M5891N5818o1440p7979N6628
21387c9415Q2655J07245M0456p3675j16357J6557r6812n6676O5208o4497N0073
21376h5238J28986J01854q4852r1927M0582r0649j1500O7406O0894p644l6825
21365h913r2558k3027J27200O6060j17587p0731M5678J10801J70743j03842o7018
21354C6806j57288n8060J2415J6306r1345j35002M1535L2675J76314J82703n6583
21343D76m2231P2548J35216j48279J6387L5315M3833P0692Q148j51869n9827k5271
$$ y = [-9647, -62725, -16382, -81260, -244746, -322829, -347612, -322001, -234079, -59181, -14449, 4978, 45490, 57043, -33076, -80991, -175349, -131051, -49864, -244267, -279351, -185404, -162564, -60045, -100669, -184872, -156241, -23609, -7245, -58333, -12442, 43376, -18064, -96043, -39415, 43240, 150485, 190941, 117266, 909, 17466, -79346, -136022, -70814, -135311, -85238, 43748, 145602, 60750, -31177, 9405, -81244, -92744, -25338, 35556, 27912, -8913, -101471, -124498, 2702, 68762, -48825, -119556, -73878, 36923, 207666, 103824, 36806, -120482, -178542, -166127, -149821, -241166, -376168, -334633, -301958, -125644, 57059, 476, -41755, 30793, 166009, 17730, 34117, 69432, 113265, 183957, 192105, 40236, -19591, -44862]
21331d4862j63492l5115L0272o4902R8716N7865P286J2689l9498p4920N5922O00
21319a59439m5663N7701J17317L2474R5267j1028m6460o4415N0917K402L6677
21308F5750q4352j2400r6824o2247J7583R2768J14287O7614J43837j1616r7540
21297A36860m6368j93389L4440J86374n2180o8709N835m1934m0754p3406O5794
21286h7437O3322R9601L5761l9824o9633J40496K2053P1929r7505j08964M4432
21275G4231r2811j10098q751J8139n0035r2853O9486o2193J13053R9881n800k6661
21263g4412o3333n1274l3888K12517J12057O8602k4595o0859K2889k3952j16924
21252c3172L2329j3572o932N3276P3483p0391q3079K4347K4093R4657m187q8625
$$ y = [-44862, -208354, -243469, -213197, -278099, -179383, -121518, -114232, -101543, -141041, -215961, -160039, -159439, -205102, -147401, -30084, 2390, 97657, 86629, 40169, -24246, 26671, 29073, 65750, -18602, -31002, -127826, -190073, -172490, -79722, 34565, 102179, 246016, 234400, 136860, 90492, -102897, -68457, 117917, 65737, -2972, 2863, -39071, -79825, -153231, -87437, -24115, 75486, 111247, 71423, 1790, 142286, 164339, 236268, 138763, 29799, 74231, -18580, -128678, -137429, -119290, -169325, -262178, -192692, -254885, -141832, -41951, -47751, -74412, -137745, -189019, -222907, -10390, 101667, 170269, 145674, 84815, 107704, 83752, -33172, -843, -14415, -21347, 31929, 105412, 35021, -48058, -23711, 382, 95039, 90852, 2227]
21240B227M8923O7848n5230p2384j17021O3855N2297K6635q4650O5376J38375
21229A36251k13959k6095k2296j09142n7352P094J87858J68846R5749M7742K5043
21218B39739K7504k2820q1520p0552M0452O4783J32564q570l0145r8933m5118
21207A47384m8196j76681j27947N6264J001M5114n198R6327J34775m882j23932
21196e971l7214n5467r1512K259J04157P0480j4632N9185J53j33172L0629O8270
21184b835M0455o3615j6175O4643j0719p5060p7344k0033O62J04703J38398P4010
21172A57090o8934N6848K1599j26174j17989J6524R480m8602J8604k7597k8689
21161a37840j27065R7472N1010N2091k2242J0993J02897K02132J01789L2709j05078
$$ y = [2227, 51150, 118998, 63768, -8616, -125637, -61782, -9485, 17150, -67500, -2124, 136251, -77708, -103803, -126099, -235241, -292593, -285499, -97641, 71205, 166954, 214696, 239739, 267243, 244423, 162903, 92351, 132803, 197586, 330150, 321580, 291435, 192502, 147384, 99188, -77493, -205440, -149176, -148175, -103061, -108259, -11932, 122843, 117961, -5971, -43185, -98652, -190164, -187905, -83748, -13268, -27900, 31285, 31438, -101734, -71105, -2835, 37620, -25995, -42170, 22473, 11754, -63306, -140650, -160683, -160021, -55318, 83080, 157090, 88156, 145004, 166603, 40429, -77560, -61036, -51556, -100158, -81554, -109151, -137840, -264905, -167433, -116423, -64332, -86574, -75581, 27316, 229448, 331237, 363946, 258868]
21150B58868j44571M3873r9012k7163q2941n9597j23224Q9560J29912l9433n2324
21139a06052J7666J80471M7079M6489j19292o7905j7335J4241O5566L5454J0261
21128A06643j02669j08778L7052O2213j0187p108l9356L7016N7238k6419K9562
21117C5207M2847p3039p9229L75O2054J11227P7998j8588r4202m9161j14389q6641
21105a85541Q5788P3627k8585l4003P9362O148m31L7315q6797O0589R8494o1535
21093D4431l9780j29103o48m9502j13156l7535K32260K04808n2462r1185Q189
21082b3683l99k0979n0350O0061O6209J23826j3944o4706J22724N9804k1762j20494
21070A16307r8804K1148p1111l5121N5903K55477J9332j35606j78398j70586l0197
$$ y = [258868, 114297, 158170, 59158, 31995, -50946, -110543, -233767, -144207, -14295, -53728, -106052, -88386, 92085, 139164, 185653, 66361, -1544, -18879, -4638, 60928, 96382, 106643, 3974, -104804, -67752, -5539, -15726, -22834, -62190, -25174, 32064, 5645, 35207, 78054, 5015, -74214, -73839, -11785, 99442, 177440, 158852, 64650, 15489, -98900, -185541, -99753, -26126, -54711, -88714, -9352, -3204, -3635, 33680, -53117, 7472, 105966, 44431, 4651, -124452, -125100, -174602, -287758, -325293, -93033, 111775, 59313, -31872, -23683, -24082, -45061, -95411, -35350, 30859, 154685, 140741, 76035, 198759, 258563, 236801, 116307, 17503, 38651, -32460, -67581, -11678, 243799, 263131, 127525, -50873, -221459, -251656]
21059b51656N7411j4518J86211P3810l9162k7250l3605q5137R5428n8566j5246
21048a12280o3966n4794L1552N6902L4556p8637m6447R8153J07243k8855r126
21037f5699k1959l1070J0108L139Q129l2079m5881Q9294N0095q1879N6035j2589
21025g4356j9627k3790j17329P6952J03257m2073L4538O9605n4708l9209k3073
21014a09813K8994L1160n1890J52539O5883o233n9011n9784j8053j11928K3988
21003a14148K0302Q4353Q3615n245j29739j66074N8601J35073k1337o8352P5033
20992d7918P4929k4050P7942J2813L8299M0182j95513K3727J48950k3369q0968
20981D5024n6304m2140Q1495J24873l9060J3886j10170o9894J13196N3527j96494
$$ y = [-251656, -194245, -208763, -22552, 51258, 12096, -15154, -48759, -133896, -38468, -97034, -112280, -176246, -231040, -199488, -142586, -108030, -186667, -233114, -134961, -27718, -56573, -65699, -87658, -118728, -108620, -105481, -97352, -129431, -175312, -86018, -35923, -117802, -61767, -74356, -93983, -117773, -235102, -158150, -54893, -96966, -62428, 7177, -47531, -86740, -109813, -80819, -49659, -101549, 50990, 116873, 110640, 51629, -8155, -26208, -138136, -114148, -93846, -9493, 74122, 68877, -60862, -226936, -168335, -33262, -54599, -122951, -47918, 27011, 2961, 80903, 93716, 132015, 172197, -23316, 411, 149361, 125992, 45024, -11280, -53420, 28075, 152948, 113888, 127774, 17604, -52290, 60906, 114433, -82061]
20970h2061J1375Q2218J16038L1239n3389j02594j14735j7864P9636L3731M5498
20959B9092J34799J9762r6238k11585j5863P9180R8224J6232k0311j64673m4866
20948a76247K26234P5155k8988J5771J17658Q6956k4481k36448j29773Q5701J07003
20937A18541J3946l9770r5291r3661k7984L3969M0081K2197o0779q5649Q755P3949
20925i1696J05156J3235o471o1692k6798k9113K5265L3028N1587K6166m0010j04650
20913a05993p880J86656l8363l4669J894r518J6528m3926K4652J68716J02459
20902B60556l0144j23002O7299M129R5331m1628P4384R501k25996o6701Q2561
20891A06290q8477k4879j03953m2575O9403R8251L9603J9840O0703J30349l239
$$ y = [-82061, -70686, 11532, 127570, 158809, 105420, 2826, -111909, -129773, -50137, -16406, 29092, 163891, 183653, 87415, -124170, -140033, -60853, 37371, 53603, 33292, -131381, -176247, 49987, 125142, 96154, 111925, 229583, 316539, 292058, 55610, -74163, 11538, 118541, 132487, 92717, -2574, -96235, -124219, -90250, -50169, -27972, -88751, -174400, -165645, -91696, 13460, 26695, 20224, -41468, -68266, -97379, -72114, -39086, 12501, 38667, -1343, -105993, -113873, 72783, 34420, -249, 1645, -7873, 8655, -35271, -10619, 158097, 260556, 230412, 107410, 174709, 178838, 274169, 232541, 306925, 316426, 90430, 23729, 106290, 17813, -7066, -111019, -153594, -84191, 14060, 53663, 73503, 134206, 264555, 261316]
20880B61316j26848O9668j02944o3343N8381j53334l7279j26892J1370J39588
20870g0317o0957j11370P0419J55245L9804L8655P8792l2226j0359j3112l3669
20859E0905j3933L2227J69741J75540n6373n3021q1729j8140L331K6074N1170
20848B85792j11953m9088p9311J64752J21920j8782j1381j3391j31013j13964
20838D3581m9107M9640N1939j30985q3720J8173J22662J33384M1932J24876L5169
20827C57544o2083q6173n1531K4522o9796k5919M3126q7695n1220j5538O1688
20816C6925J6694J8134n0922J1083K699Q8139J2527P3972J13400J2962p4264q1950
20804A79399o1257j02651j14291q7663l7303N0925J75498J65510J12717O3206
$$ y = [261316, 134468, 204136, 101192, 37849, 96230, -57104, -94383, -221275, -209905, -70317, -131274, -242644, -172225, -16980, 22824, 61479, 140271, 108045, 97686, 84574, 50905, 36972, 69199, 238940, 414480, 358107, 305086, 223357, 205217, 208548, 234622, 285792, 173839, 124751, 45440, 210192, 332112, 313330, 301949, 288558, 157545, 43581, -5526, 44114, 96053, -34932, -118652, -100479, 22183, 155567, 197499, 322375, 357544, 295461, 209288, 157757, 182279, 112483, 86564, 129690, 41995, -9225, -24763, 36925, 53619, 71753, 20831, 31914, 34613, 122752, 135279, 209251, 322651, 335613, 261349, 179399, 118142, 15491, -98800, -186463, -223766, -172841, 2657, 168167, 280884, 344090]
20794C44090J0165j33686j25806j4369l8451M994R7262J34350p7699J0881M6772
20783B58503L884j00694q8452r3979p6472L286j3899R3973P7360M1043k8936m3362
20771C2255K3791M3432J10866J49823M6967j46538m7056J39422J24600o0451j60937
20760B56174K4752L5028n4048j37442l4256m1074K233J23528k04115L1958Q8357
20749I1095m7367J15662Q4166M7833r4402R361j6299L6343R7862r3r9498J04139
20737C28802q8153k6147K3320M0739p2954p6784p0477O9010M2517o9798q836n7893
20725C3346o8904R161Q0213k5122p776n7124k8433K3423N7876O4219L7747l8057
20713H0569j16920O2433J89099j199P2050K8610P519p2394r2567J8988j0207j23363
$$ y = [344090, 354255, 220569, 94763, 80394, 41943, 46937, 144199, 278549, 200850, 211731, 258503, 262387, 161693, 73241, -20738, -97210, -93924, -107823, -13850, 63510, 104553, 75617, 32255, 56046, 99478, 210344, 360167, 407134, 260596, 213540, 352962, 477562, 417111, 256174, 280926, 315954, 261906, 124464, 90208, 49134, 51367, 174895, -29220, 2738, 91095, 43728, 159390, 243556, 291389, 196987, 206348, 190049, 226392, 324254, 324161, 224663, 328802, 240649, 214502, 237822, 278561, 205607, 128823, 58346, 127356, 169873, 100075, 91239, 33346, -35558, -26397, 53816, 28694, 20918, -36206, -64639, -41216, 16660, 80879, 118626, 80569, -36351, 26082, 215181, 213982, 286032, 314642, 322161, 249767, 157200, 176188, 165981, 42618]
20701D2618j05470M3263L8305O2077J05118M2636J2988j13441M7835J17525M1927
20690C35381l7337k3307j5686m1034n6780O7121J5336q0409r898M9499K29092
20679D31978J16461k5764j37090l3621J09053j2561l4542l745j43466j57133Q01
20668A10371J06393j74307n8295R8419R9697l9403m9307P320J14379J52041M4196
20657D11504j38628q2776k3525J04193L9322R996K3966n7232n3833n6895n5427
20646A20665k5436N3415M0913P3780j24893L253p7361m5545J44835K4885O6103
20635B54614q039j68098l4144J29290J433J7279k8762k9046K7234R7152p7288
20624A81625l5479j05317L0535J93449L3155j0888K3781o4913r704J9968l6105
$$ y = [42618, -62852, -19589, 18716, 80793, 185911, 228547, 241535, 128094, 175929, 293454, 335381, 298044, 274737, 259051, 218017, 161237, 228358, 243694, 163285, 153387, 202886, 431978, 548439, 522675, 385585, 351964, 461017, 448456, 413914, 410169, 266703, 109570, 110371, 216764, 42457, -15838, 82581, 182278, 142875, 93568, 100888, 215267, 367308, 411504, 272876, 190100, 166575, 270768, 310090, 320086, 344052, 286820, 232987, 176092, 120665, 95229, 148644, 189557, 263337, 138444, 141697, 64336, 18791, 163626, 188511, 254614, 246575, 78477, 44333, 173623, 175056, 192335, 163573, 134527, 161761, 258913, 181625, 146146, 40829, 71364, 264813, 297968, 287080, 310861, 245948, 236244, 256212, 220107]
20613B20107P8288n8110l5010l8163L1024P0136P675o9987k2728j14967l9518
20602B8747R682J45025J17864L8142J13063k255l1799j9954Q2996k2271m7729
20591D11511j13174j73096N4954j1370j3226J18380J63247N9735R4150r8189k49675
20580B43247r7673N0232k41R1412J24253m8667N610k7816j6510m4071j5673l7363
20568B26740L5886J11955Q5333o3318n1776R2988Q5637j09927l9636m3473j24215
20557B06194J0709J02154N9674K7039L5316p0523k480L7186l7090J12196j2722
20546D67653M3905P6615o5529L534k14015j41196J79211R9678Q060o983M0454
20535D91387J46661m274j08608k3200j88563L4588N189K7991l025j78751J01118
$$ y = [220107, 298395, 240285, 205275, 167112, 198136, 268272, 275947, 205960, 183232, 68265, 28747, 38429, 183454, 301318, 339460, 452523, 450268, 418469, 398515, 481511, 459240, 411511, 298337, 125241, 180195, 168825, 155599, 273979, 437226, 496961, 591111, 492922, 243247, 145574, 195806, 195565, 286977, 411230, 362563, 368173, 340357, 323847, 279776, 264103, 226740, 262626, 374581, 459914, 396596, 344820, 437808, 523445, 413518, 373882, 330409, 206194, 216903, 319057, 378731, 405770, 441086, 370563, 368083, 405269, 368179, 480375, 467653, 511558, 588173, 522644, 526178, 312163, 170967, 350178, 449856, 457916, 450933, 491387, 638048, 633774, 525166, 501966, 313403, 347991, 353180, 381171, 378146, 199395, 300513]
20524C00513K25680j8934P0095j09019J9202j46078j6057J7335R5982L465O3887
20513E06071p448R199p4228q3294j7466j0620k5681R5184J07355j17606l6557
20502C44909O8431l7262J3695J02822O4041r9092l5818o2646J10873M6887j29216
20491C87624l4764M3184P0224p7281R1812J32580L1920l3613j14188r3563J08668
20480E12603Q6142J08278j22k23598J0557L8767K4031P9948L8114o9458J9365
20469F24627j71324p7480R5343J7232q7926o3075q4626j1287J54095R7851p77
20458D92653m2332r7583k8294L0877L6428O5489J2980J1041j19023j0137J95218
20447E47317K32183Q1261m3380j00473m1725l1623O1116o5825j69966j20788Q3371
$$ y = [300513, 526193, 507259, 577354, 468335, 487537, 341459, 325402, 342737, 438719, 442184, 506071, 498623, 507822, 433594, 350300, 332834, 322214, 296533, 391717, 499072, 381466, 344909, 413340, 376078, 389773, 492595, 556636, 457544, 421726, 359080, 469953, 516840, 387624, 352860, 396044, 466268, 388987, 480799, 613379, 645299, 611686, 497498, 403935, 512603, 598745, 707023, 706901, 483303, 493860, 532627, 556658, 636606, 674720, 605262, 624627, 453303, 375823, 471166, 488398, 400472, 337397, 252771, 241484, 395579, 493430, 492653, 450321, 352738, 324444, 355321, 391749, 457238, 470218, 481259, 362236, 352099, 547317, 779500, 860761, 817381, 716908, 675183, 643560, 704676, 638851, 468885, 348097, 431468]
20436D31468N4052O9388j9524R2283L9574K756j76522L6914J01917m981n1901
20425E75424o0715J46671Q907q5278J36906K04196j40679p9216P0127N2584j10989
20414G17938k7320l0275Q0536k4399J2282J3615k4367N547K0984K3581R4413m0916
20402H21619m585n6311j7400l2562J05147n1421j05884k355K4001o9802N9952
20391F70399M2860o4651M5265M2413O5645l4956p5258O1337l9023M4956J36211
20380H95198n4530j45766J1046k3577j9906N9871L221Q2409K839N0551L9450K792
20368I03598R080q8406J9210L1146K6579j39303k9737J50872R7101j23973j40425
20357G15742M1766K03393k5356j00469N061j49075j1734J05609R769K2363K4559
$$ y = [431468, 485520, 554908, 535384, 627667, 667241, 669997, 493475, 530389, 632306, 627325, 575424, 514709, 661380, 670287, 585009, 721915, 926111, 785432, 706216, 776343, 828927, 717938, 690618, 660343, 740879, 716480, 728762, 742377, 718010, 723557, 744541, 768122, 862535, 821619, 817034, 760723, 743323, 710761, 815908, 764487, 658603, 656248, 680249, 610447, 670399, 713259, 648608, 693873, 736286, 801931, 766975, 691717, 753054, 714031, 758987, 895198, 840668, 694902, 705948, 682371, 662465, 722336, 725557, 807966, 810805, 861356, 900806, 903598, 912678, 824272, 843482, 874628, 901207, 761904, 732167, 883039, 980140, 856167, 715742, 757508, 960901, 935545, 835076, 840137, 691062, 679328, 784937, 794706, 817069, 841628]
20346H41628k9951q168J33380O5451k1057j935O7576j9488K788J6854m9874M2350
20334A039554K3468j24714k856J6443o2282N1305L4119m0661k3371K06694l5707
20323A081992j33274J2861j712O2261K34258N6798o548r273l2215j17186j26203
20312A021759n8411J44922J35467J8790n6429r6890M0375J88638M5837q4538j87905
20301A111615j34303o9740J26396M1966J06243l8485o0418n7739k7752o4999J40152
20290A072936Q2863l1776j7497p656J83084m1436j1779k6993K6423J08390k890
20279A333669o4372j6660N5550n6523r1348M3248K03147K9758p4525L659J2662
20268A378265l1519O730J2812k9728p187R4874j30549k5356J63863M9615P472
$$ y = [841628, 811677, 803509, 936889, 1002340, 981283, 979348, 1046924, 1027436, 1030224, 1047078, 997204, 1039554, 1063022, 938308, 935452, 951895, 889613, 940918, 975037, 934376, 911005, 1117699, 1081992, 948718, 961579, 959867, 1022128, 1256386, 1313184, 1306636, 1297363, 1265148, 1147962, 1021759, 963348, 1108270, 1243737, 1262527, 1206098, 1109208, 1149583, 1338221, 1384058, 1299520, 1111615, 977312, 907572, 1033968, 1075934, 1182177, 1143692, 1083274, 1025535, 997783, 932784, 1072936, 1155799, 1124023, 1106526, 1098870, 1281954, 1240518, 1228739, 1201746, 1228169, 1336559, 1333669, 1269297, 1252637, 1308187, 1251664, 1160316, 1203564, 1406711, 1436469, 1361944, 1365603, 1378265, 1346746, 1353476, 1366288, 1336560, 1329373, 1424247, 1293698, 1268342, 1432205, 1481820, 1489292]
20257A489292j3050j42636j3636J00440r179P243j00964M0030R5578N4000l7197
20246A469921p4598P768K5150Q8796m8694k03080N2017R8745J46025Q3892L4650
20235A680592k1126k4509m744p173L8269J52688M4035j23824l7732J44686J8554
20224A859716j06729P3295L195l2041N9549P430r3263K4418N5412Q0904J03669
20213B035555o785J01618N8821n8908n0135n9899j71659p737l724m9208J7995
20202A805934R8882n2341K1448Q0653J74597m0476m9127J7028P9545k5675L1123
20191B141591Q9340R8018J5181n1040L4487o8131j03366p5406P5818O3512O5820
20180B285824k7353k3993J10674L6201l2679K3573N2853j7239o038l6783M090
$$ y = [1489292, 1476242, 1333606, 1319970, 1420410, 1411231, 1418474, 1317510, 1357540, 1453118, 1507118, 1469921, 1395323, 1403091, 1428241, 1517037, 1468343, 1265263, 1317280, 1416025, 1562050, 1645942, 1680592, 1659466, 1634957, 1630213, 1623040, 1661309, 1813997, 1858032, 1734208, 1696476, 1841162, 1859716, 1752987, 1826282, 1829477, 1797436, 1856985, 1864415, 1771152, 1795570, 1850982, 1931886, 2035555, 2028770, 2130388, 2189209, 2130301, 2080166, 2020267, 1848608, 1840871, 1837147, 1787939, 1805934, 1904816, 1852475, 1873923, 1954576, 2129173, 2088697, 2039570, 2056598, 2136143, 2110468, 2141591, 2230931, 2328949, 2344130, 2293090, 2327577, 2259446, 2156080, 2080674, 2156492, 2220004, 2285824, 2258471, 2234478, 2345152, 2381353, 2348674, 2372247, 2425100, 2407861, 2401823, 2365040, 2369130]
20169B369130J29240r6132J4984K52856K38164J403j16031j31312L042J4886q3390
20158B596840K2539O4253J3002m4965Q0298O6521m1509l3036k3720p185J7447
20147B710485N6402J53037J56653M7609K8031p182j47322O0120Q2473j32718m4933
20136B962655J27425L7147J76538J71382o6131j5253o4363J26850Q1561R1487
20126C629298J7961m9183j51722j1933N4978O6859J06300l4499j09335Q533J09100
20115C636357J57155K9549r3681J8018p804Q929R8665K05099Q7597k5174k8550
20104D086160j17526j17097R2454J64981J96686K1804J9946P2832Q8912k711j33056
20093D373385N446J37783P7823L5518N8229M9704O1166J1223O1860m8681Q721
$$ y = [2369130, 2498370, 2402238, 2417222, 2670078, 2908242, 2909645, 2793614, 2662302, 2665344, 2680230, 2596840, 2619379, 2683632, 2696634, 2651669, 2731967, 2798488, 2756979, 2723943, 2700223, 2693038, 2710485, 2766887, 2919924, 3076577, 3124186, 3152217, 3145035, 2997713, 3057833, 3140306, 3007588, 2962655, 3090080, 3127227, 3303765, 3475147, 3409016, 3393763, 3329400, 3456250, 3537811, 3629298, 3647259, 3598076, 3446354, 3434421, 3489399, 3556258, 3662558, 3628059, 3518724, 3527257, 3636357, 3793512, 3823061, 3729380, 3747398, 3739594, 3748523, 3847188, 4052287, 4139884, 4114710, 4086160, 3968634, 3851537, 3943991, 4108972, 4305658, 4327462, 4347408, 4420240, 4509152, 4506441, 4373385, 4378831, 4516614, 4594437, 4629955, 4688184, 4737888, 4799054, 4810277, 4872137, 4823456, 4832177]
20082D832177J15426J60007M8625L6377J6603M9781M3581K4876k8210m7992Q1153
20071E332404N3791r9890J33768J45530N6958R9031n9757P3255J3363J2663j5298
20060E745818M1062P8981l6249L5890P7299J15297J5183J60353L5478l7675L6212
20049F267649J27093M7729J02915O8888J31806J08583M0664J52557j7972N1642
20039G081554q024q8313J33202P5542r2419J91362K97287K8157Q4369N5964K7051
20028G785732q1894L6465J7361K68179K50863j138Q0363Q5500K32710N3977j4401
20017H713717p9014K4586N1107K26070J33922P4872J14911k0867J88803Q1972
20007I510079M1585L16619M9964M4765J4680J29471J27369J86115R8695Q9937
$$ y = [4832177, 4947603, 5107610, 5156235, 5192612, 5209215, 5258996, 5302577, 5327453, 5299243, 5251251, 5332404, 5386195, 5286305, 5420073, 5565603, 5622561, 5721592, 5661835, 5735090, 5748453, 5761116, 5745818, 5786880, 5865861, 5829612, 5865502, 5942801, 6058098, 6073281, 6233634, 6269112, 6231437, 6267649, 6394742, 6442471, 6545386, 6614274, 6746080, 6854663, 6895327, 7047884, 7029912, 7081554, 7073530, 6985217, 7118419, 7193961, 7101542, 7292904, 7590191, 7618348, 7702717, 7758681, 7785732, 7703838, 7740303, 7757664, 8025843, 8276706, 8275568, 8355931, 8441431, 8674141, 8728118, 8713717, 8634703, 8659289, 8710396, 8936466, 9070388, 9145260, 9260171, 9239304, 9428107, 9510079, 9551664, 9868283, 9918247, 9963012, 9977692, 10107163, 10234532, 10420647, 10519342, 10609279]
19997A0609279p808L3815J42706J40989J48483J34702O3057J43287K04511J89441
19987A1802462K24666R5184L9709J27136K24976K12809Q2146J24834J10283Q8236
19977A3132441J95183K43411N8348K3150R9725P6369K06010J62511K27824L15621
19967A4740593K62529J28221J7184J34959J52254J31554K09761L22973K75396
19958A6375424K00613J34889Q0082J54970K62728K64551K16467R5479J46986J69897
19948A8102086L71480K31072R6091J74801K50084L24042K20761j7744K02194L65335
19938B0320202K50688K83755J39105J80042L63545K42800Q5693K51015K06283
19929B2323128K29189L27878J11387P1936K56700L37607L00386K74655K75904
$$ y = [10609279, 10601471, 10635286, 10777992, 10918981, 11067464, 11202166, 11265223, 11408510, 11613021, 11802462, 12027128, 12122312, 12162021, 12289157, 12514133, 12726942, 12809088, 12933922, 13044205, 13132441, 13327624, 13571035, 13629383, 13652533, 13752258, 13828627, 14034637, 14197148, 14424972, 14740593, 15003122, 15131343, 15148527, 15283486, 15435740, 15567294, 15777055, 16100028, 16375424, 16576037, 16710926, 16791008, 16945978, 17208706, 17473257, 17689724, 17785203, 17932189, 18102086, 18473566, 18704638, 18800729, 18975530, 19225614, 19549656, 19770417, 19752673, 19954867, 20320202, 20570890, 20854645, 20993750, 21173792, 21537337, 21780137, 21865830, 22116845, 22323128, 22552317, 22880195, 22991582, 23063518, 23320218, 23657825, 23958211, 24232866, 24508770]
19920B4508770K93844K61801L21496K66038J68137L06412K92092L18451J82601
19911B6919642J08074L02605R4447K01317K71145K51471L36822K09063L69724
19902B9064310K99403J10506K10591K42028K19553J84992J83658M6883K29587
19893C0791511K02174K65052K73316K67021J28725Q1326L09316J91647Q4138J15232
19883C2709458J80236Q9809R1687Q8063J01334J29097J11627K4950K21248K88350
19873C4035859J56270q9934o1520Q3487M1721K0925n2486j08713L2543Q1003P0064
19862C4209219J9125J95530k1598m1151j24038n0952q7622k057M384o3900j60924
19851C3876016j21998L9447r6072k08196j93753j77845k85671m5000k8066o0799
$$ y = [24508770, 24802614, 25064415, 25385911, 25651949, 25820086, 26126498, 26418590, 26737041, 26919642, 27027716, 27330321, 27424768, 27626085, 27897230, 28148701, 28485523, 28694586, 29064310, 29363713, 29474219, 29684810, 29926838, 30146391, 30331383, 30515041, 30561924, 30791511, 30993685, 31258737, 31532053, 31799074, 31927799, 32009125, 32318441, 32510088, 32594226, 32709458, 32889694, 32979503, 33071190, 33159253, 33260587, 33389684, 33501311, 33526261, 33747509, 34035859, 34192129, 34102195, 34040675, 34124162, 34165883, 34186808, 34134322, 34025609, 34058152, 34139155, 34209219, 34228344, 34423874, 34402276, 34361125, 34237087, 34186135, 34098513, 34096456, 34100840, 34036940, 33876016, 33754018, 33793465, 33697393, 33489197, 33295444, 33117599, 32831928, 32786928, 32758862, 32698063]
19841C2698063k64556j26128j20199j92998j75138p1672j42770k70982l26407
19832C1007213l97910l58440j82006j51432k12367j17510j14135l15405l97942
19823B8760066j60047j87162j45724n3491k40896l19676k37928l73140k66615
19814B6775387j58759j49066k14049k25235k62690j91291l2242k75235l74880
19805B4891940k68490l60181j19471k31519l60826l23438j14256r1993r1075l69339
19795B2561352l22226k89734k08281k46933k01493j35469k67345k25354k52431
19786B0412086k06470j73118k96763k48139p6510j04401j75712l25543j75781
19777A8629649q4138k43440k71025k48826k29928j03410j36629j15956k16410
$$ y = [32698063, 32433507, 32307379, 32187180, 31994182, 31819044, 31747372, 31604602, 31333620, 31007213, 30609303, 30250863, 30068857, 29917425, 29705058, 29587548, 29473413, 29158008, 28760066, 28600019, 28412857, 28267133, 28213642, 27972746, 27653070, 27415142, 27042002, 26775387, 26616628, 26467562, 26253513, 26028278, 25765588, 25574297, 25542055, 25266820, 24891940, 24623450, 24263269, 24143798, 23912279, 23551453, 23228015, 23113759, 23021766, 22930691, 22561352, 22239126, 21949392, 21741111, 21494178, 21292685, 21157216, 20889871, 20664517, 20412086, 20205616, 20032498, 19735735, 19487596, 19411086, 19306685, 19130973, 18805430, 18629649, 18545511, 18302071, 18031046, 17782220, 17552292, 17448882, 17312253, 17196297, 16979887]
19768A6979887k25911j30741j45814k39416j52747j75276k67931j98764p2137
19759A5371150n4847k07639j82483k52525k64366m7552j20961r6791j76805l0614
19749A3936567P0149k05120q8634j81850j50913k71417j51589j97602j01667j28858
19739A2529066r2494j61178k10204q0779j35001k55513j48219O2977o9755j64846
19729A1274054j95748n5600K9010p3375j51464j82180k08367j03905K57476M7626
19719A0637527k90816k06846j80995j39643J9373M9273p8545j03463k74437k12658
19709I218770j98055M7992L3152o1246j5491o3067P153p0233k66425o9200j9840
19698H543510j47070j64917l2702j21994j09180o0886j16920p8541l0741K6387
$$ y = [16979887, 16753976, 16623235, 16477421, 16238005, 16085258, 15909982, 15642051, 15443287, 15371150, 15316303, 15108664, 14926181, 14673656, 14409290, 14361738, 14240777, 14143986, 13967181, 13936567, 14006716, 13801596, 13712962, 13531112, 13380199, 13108782, 12957193, 12759591, 12657924, 12529066, 12436572, 12275394, 12065190, 11984411, 11849410, 11593897, 11445678, 11508655, 11438900, 11274054, 11078306, 11022706, 11051716, 10978341, 10826877, 10644697, 10436330, 10332425, 10589901, 10637527, 10346711, 10139865, 9958870, 9819227, 9838600, 9887873, 9809328, 9705865, 9431428, 9218770, 9020715, 9068707, 9101859, 9040613, 9025122, 8962055, 8969208, 8898975, 8632550, 8563350, 8543510, 8396440, 8231523, 8198821, 8076827, 7967647, 7906761, 7789841, 7711300, 7680559, 7706946]
19688G706946n1658J0577j19326o4265j39567j52906l1317j8812m3771r4862j00063
19677F900976l4350j30807m3775l3761q9428k6715m7612J25138k3997j90178k0704
19666F384787r7533r6293j6316m731j7925j12240r9703j38990q1432P8869n0326
19655E748167j29844O598P8875O894n7896J5317j1377j44159r2059K5907o6767
19644E379656j51626k3502q7709p6540q9900l8914M1820M8672j3454O563N5666
19633E050732L9321p9066j57404j31101m5801N5310j566l3369p8259M044j11081
19622D511760j37350J446p6456P537P8111M6382N675l0957o4221j71728m4774
19611D125425j5053O7549m6951o6438L7107r742l2894J50996m4829n1428o401
$$ y = [7706946, 7655288, 7665865, 7546539, 7482274, 7342707, 7189801, 7158484, 7139672, 7095901, 7001039, 6900976, 6866626, 6735819, 6692044, 6658283, 6568855, 6542140, 6494528, 6619666, 6595669, 6405491, 6384787, 6287254, 6190961, 6174645, 6169914, 6151989, 6039749, 5940046, 5801056, 5719624, 5798493, 5748167, 5618323, 5624921, 5703796, 5710690, 5652794, 5668111, 5656734, 5512575, 5420516, 5446423, 5379656, 5228030, 5204528, 5116819, 5040279, 4950379, 4911465, 4953285, 5001957, 4988503, 4995066, 5050732, 5090053, 5010987, 4853583, 4722482, 4676681, 4731991, 4730425, 4697056, 4618797, 4622841, 4511760, 4374410, 4375856, 4299400, 4306937, 4385048, 4431430, 4437105, 4406148, 4341927, 4170199, 4125425, 4110372, 4177921, 4130970, 4064532, 4101639, 4091897, 4059003, 4209999, 4165170, 4113742, 4107341]
19600D107341r5901L6416j27886j94423j37003Q1532O4380o9824l4716N6979k2313
19589C664582m0505q340R421n9194q2193O616J21346o934o2774j8500o6394N899
19577C463030L7115Q9430m9651j34453P0130r2549r0741Q8837o9055j06401l0099
19566C175593J2217n0365k00440j26050J83271J2150O6086j6071k2783q4154n3161
19555B896293m2412R6965J9561j93446j03428J18628N2620L7712l1293j88808
19545B662392j01956K1274R0558Q8500j5921j78247n4819J07293j3455l4102R4953
19534B666470n1060j35957p570L5523m2690m8730p9125R1450R2515M3281j51314
19523B412793q2917N1384N8383Q543m8540m4246q7012j4900J11530j3822M3940
$$ y = [4107341, 4011440, 4047856, 3919970, 3725547, 3588544, 3670076, 3734456, 3664632, 3629916, 3686895, 3664582, 3624077, 3615737, 3625158, 3565964, 3483771, 3490387, 3611733, 3604799, 3542025, 3523525, 3457131, 3463030, 3500145, 3589575, 3539924, 3405471, 3475601, 3383052, 3292311, 3381148, 3312093, 3205692, 3175593, 3187810, 3137445, 2937005, 2810955, 2994226, 3006376, 3072462, 3056391, 3033608, 2949454, 2896293, 2853881, 2950846, 2970407, 2776961, 2673533, 2792161, 2844781, 2882493, 2851200, 2662392, 2560436, 2581710, 2672268, 2760768, 2744847, 2566600, 2511781, 2619074, 2605619, 2571517, 2666470, 2615410, 2479453, 2471883, 2507406, 2464716, 2415986, 2336861, 2428311, 2520826, 2564107, 2412793, 2329876, 2381260, 2439643, 2448186, 2399646, 2355400, 2268388, 2253488, 2365018, 2351196, 2395136]
19512B395136J40441L5981L5540K7531Q1058j59205k01726q9694p0609j71949
19502B022504J6333M4441p6995r2255r026L5873m203r6103R0746K7735k4006m1479
19490A893565o2001l608M4669Q0749J29254r7889m8140j68003M0169J66618l6461
19479A938922p1014m8681Q4160R5833L9665Q7152P3170j89434j72415j5643M1565
19468A863280J89777j12325j4899Q4082l2069J9741j76930p1811j4152J9820N5757
19457A810271J10911P1334j00812j86579r6751L7877N536j518k458k21170O2521
19446A489162J1363K2515J26218o1300j43171R836j06588n1687R2870R2195N2768
19435A534181o9726M7550J5399J88800j13519j56230K1550q8964M0586N8167J4620
$$ y = [2395136, 2535577, 2571558, 2607098, 2634629, 2715687, 2556482, 2354756, 2265062, 2194453, 2022504, 2038837, 2083278, 2006283, 1914028, 1905002, 1940875, 1936672, 1840569, 1931315, 1959050, 1935044, 1893565, 1831564, 1827956, 1872625, 1953374, 2082628, 1984739, 1936599, 1768596, 1808765, 1975383, 1938922, 1867908, 1819227, 1903387, 1999220, 2038885, 2126037, 2199207, 2009773, 1837358, 1821715, 1863280, 2053057, 1940732, 1925833, 2009915, 1977846, 1997587, 1820657, 1748846, 1734694, 1754514, 1810271, 1921182, 1992516, 1891704, 1705125, 1608374, 1646251, 1651787, 1650269, 1647811, 1426641, 1489162, 1500525, 1523040, 1649258, 1587958, 1444787, 1454623, 1348035, 1296348, 1389218, 1481413, 1534181, 1464455, 1512005, 1527404, 1716204, 1602685, 1446455, 1468005, 1379041, 1419627, 1477794, 1492414]
19424A492414J8052P8060N5309K5436q2314m0877o9997o3900l4243Q6318p5278
19413A388980m3166L3585j0018l3107N7659o3738l4995Q9045N0111m6094L887
19402A392149J3561P172l3918O3167K2389N4622N4356q0765m1332n6043j46887
19391A248471j5600M8007j9842o1406J18581J09449J2981J4107k0470n0259k5634
19380A358385k4949N1211q6422j78305l0858k1981P4677J6428j15876j55826n6159
19369H30325n0154J06953J63718J17782O5287K8444k1729j49341N828K3406j50943
19358I69576r1489J6199J12538J56214R526j08538M83r3461r1446N4265J4017
19347I47884K9327l5809J17175N3453o9477p595O7497J25544j7746n3653q4829
$$ y = [1492414, 1510466, 1588526, 1643835, 1669271, 1586957, 1546080, 1476083, 1412183, 1377940, 1464258, 1388980, 1345814, 1379399, 1369381, 1336274, 1393933, 1330195, 1295200, 1384245, 1434356, 1388262, 1392149, 1405710, 1412882, 1378964, 1442131, 1464520, 1519142, 1573498, 1492733, 1451401, 1395358, 1248471, 1232871, 1280878, 1261036, 1199630, 1318211, 1427660, 1440641, 1454748, 1434278, 1384019, 1358385, 1333436, 1384647, 1298225, 1119920, 1089062, 1067081, 1141758, 1158186, 1042310, 886484, 830325, 780171, 887124, 1050842, 1168624, 1233911, 1262355, 1240626, 1091285, 1097113, 1120519, 969576, 878087, 894286, 1006824, 1163038, 1172564, 1064026, 1064509, 971048, 879602, 933867, 947884, 977211, 941402, 1058577, 1112030, 1042553, 1034958, 1102455, 1227999, 1210253, 1156600, 1071771]
19336A071771J6322p3428K1889k24j31959L5621K07057K9779R0256j0457j36634
19325A119993r5101n5325L3989j04719N3432j32328j7630L1375J35881m1265j35687
19314G92615K6720q629j00649J65009J06865K6942m6614q1438j06577r7513J39580
19303H16311J11128M4561k06686L4651M9332m1335K5268Q4645K4346L166l5290
19292I10097M616N8984R010r8824r5316j5408P5050P180L5618Q1585n1951j05117
19280H15524M0443O3470p0578K5171l407j67599j21953K4014P9585J57865j21359
19269G21176r791O8012p4438O1994L014J2547l8944j14794j64415J4709J61232
19258F40302O2653M2185N837N053n0111q9720K0096P0990P5641k04602j19641
$$ y = [1071771, 1088093, 1014665, 1036554, 1036330, 904371, 939992, 1147049, 1176828, 1267084, 1256627, 1119993, 1024892, 969567, 1003556, 898837, 952269, 819941, 802311, 833686, 969567, 928302, 792615, 819335, 810706, 710057, 875066, 981931, 1008873, 962259, 880821, 774244, 676731, 816311, 927439, 972000, 765314, 799965, 849297, 807962, 833230, 917875, 942221, 945387, 910097, 914713, 973697, 982707, 883883, 788567, 773159, 848209, 855389, 891007, 972592, 920641, 815524, 855967, 919437, 848859, 874030, 870623, 703024, 581071, 605085, 684670, 842535, 721176, 711385, 779397, 704959, 766953, 769967, 782514, 743570, 628776, 464361, 479070, 640302, 702955, 745140, 750977, 756030, 705919, 616199, 636295, 707285, 782926, 578324, 458683]
19247D58683k7878N6497R7351J20101k6008r5988j14469O171J49161J12194n7038
19236F78777m8612Q2594K8199M8779r403j54946N5336P2950p0987j39318L5543
19225E78912J35505Q8090M7100k19657j63972Q7124N1879j02862O1103J50490
19215G13712O919m8194o3511M8739O6044J79651P6017j41214p3080l6389n1268
19204F77426J27072O6498m0861j03197k5498o9861p7179m7267n9346n6344Q3125
19193D74568N5595J7822K4281N0141N7079q5564L6548R3282q8818q8003K4504
19182E71435q3218o709q9630q265J63884M5809R0238K1152j24670j20950p9610
19171C79466Q8013o1148J634P8664p7159M3775M7767N1360Q1209l762j26387m1547
$$ y = [458683, 430805, 487302, 584653, 704754, 678746, 582758, 468289, 474460, 623621, 735815, 678777, 630165, 712759, 740958, 789737, 780334, 625388, 680724, 753674, 682687, 543369, 578912, 714417, 802507, 849607, 629950, 465978, 553102, 604981, 502119, 563222, 713712, 720631, 672437, 608926, 657665, 723709, 903360, 979377, 838163, 765083, 728694, 677426, 804498, 870996, 830135, 726938, 701440, 631579, 554400, 507133, 447787, 391443, 474568, 530163, 547985, 572266, 622407, 679486, 593922, 630470, 723752, 634934, 546931, 571435, 488217, 481508, 391878, 383613, 547497, 593306, 683544, 704696, 580026, 459076, 379466, 467479, 406331, 407965, 486629, 409470, 453245, 501012, 552372, 633581, 629819, 503432, 461885]
19159D61885J3800j3963J07159Q4337P1576j09456j66347l2543O2878R0970j73488
19148C96808j1846k5733m9880J09005l4850j53324l3730J485l5945k1456J34680
19137B75214N1447K7138R2487K073n8342j9016K4134J36562J5126r3821o3033
19126C89969O22O9691k698J25480R4469J8217o6937m8847q5171K2349L2289J3529
19114E62962K0000R1707J32952r4570q9158L6708o5854q9157m9326l6302k2533
19103C97429j3438O7125K2553Q6817P354J24364M6210k10496j4607R7700N5117
19092F66128l8202j98579j2736k1380k4118Q3604k3889l065J26415k0301j64768
19081C69109P6J41774o2188K2491l0702r0924l7012q1729J40715J28618O239q8662
$$ y = [461885, 475685, 461722, 568881, 653218, 724794, 615338, 448991, 416448, 479326, 570296, 396808, 384962, 359229, 309349, 418354, 383504, 230180, 196450, 197935, 161990, 140534, 275214, 326661, 353799, 446286, 448359, 390017, 371001, 395135, 531697, 546823, 453002, 389969, 390591, 460282, 457584, 583064, 677533, 695750, 628813, 579966, 494795, 517144, 549433, 562962, 582962, 674669, 807621, 713051, 623893, 660601, 594747, 505590, 456264, 419962, 397429, 383991, 451116, 473669, 560486, 567840, 692204, 738414, 527918, 513311, 611011, 666128, 627926, 429347, 416611, 395231, 371113, 454717, 430828, 427763, 554178, 533877, 369109, 369185, 510959, 448771, 471262, 440560, 349636, 312624, 230895, 371610, 500228, 506467, 417805]
19069D17805p1763J60331P5877n4761r6823p0730n7840n623R3952J20930J36728
19058F48083j1202r1209j60521L0334J14689R4789o9271j00010l9087M4000j22429
19047C38166N427k9732J66387j2823k08334j9990n09o7224J34943J92524N9460
19036E58295Q0261K9527r4001m4934m7789l3049n14M7761o0267J03823k7357J5693
19024E27449Q8256r4702M5949J08832p7983R9512J43348J64954J56812J86543
19014A348970Q7887j20920o4793p3356j79280r0708J6716j23054k52236l7687
19004E11539o9488K3264j5110Q3312K907q9991R902J32872K43049J59705J51181
18993A143142J43425K62725J9602j349k18736k39638k52466j64045Q1386J7716
$$ y = [417805, 346042, 506373, 582250, 527489, 430666, 359936, 302096, 296473, 390425, 511355, 648083, 636881, 545672, 385151, 415485, 530174, 624963, 555692, 455682, 416595, 460595, 338166, 343593, 313861, 480248, 467425, 259091, 239101, 238592, 171368, 306311, 498835, 558295, 638556, 668083, 574082, 529148, 481359, 448310, 447796, 495557, 435290, 539113, 511756, 527449, 615705, 521003, 566952, 675784, 597801, 697313, 840661, 1005615, 1162427, 1348970, 1436857, 1315937, 1251144, 1177788, 998508, 907800, 924516, 801462, 549226, 511539, 442051, 465315, 450205, 533517, 536424, 446433, 456335, 589207, 832256, 991961, 1143142, 1286567, 1549292, 1568894, 1567545, 1348809, 1109171, 856705, 692660, 774046, 791762]
18983G91762j14266M6909j3536j74714k6188N8716o7415P948j8630j46194M7582
18972C91974K8942L5858N3163k7075R3711K0089o1061j4790l8915k9789j26930
18961C25177K1980p5524l6508k1867K541r050j65911M1834J90592K09K5152N4492
18949C53117M3989m9049j33047m9498K5034P6325k3622j21400j7829Q2172M0790
18938B26982m6774n119n9930M0634L0580P710J00112O1850q9723M7416K5134m317
18926C34555M2361m7926j57252J01848J27167r9905l4438k0761J28190J1561j22170
18915B63230o3456n5252q8939P7556O4441m7293n3225M281N7009R0917J1748N92
18903B61609J92873m411j0031l2569k724K08146K17002N5851j12688j30829o3539
$$ y = [791762, 677496, 724405, 710869, 536155, 509967, 568683, 501268, 509216, 490586, 344392, 391974, 420916, 456774, 509937, 482862, 576573, 596662, 535601, 520811, 481896, 452107, 325177, 347157, 271633, 235125, 213258, 215799, 206749, 40838, 82672, 273264, 273473, 298625, 353117, 397106, 348057, 215010, 165512, 190546, 266871, 243249, 121849, 104020, 186192, 226982, 180208, 175089, 115159, 155793, 186373, 194083, 294195, 356045, 266322, 313738, 338872, 334555, 376916, 328990, 171738, 273586, 400753, 300848, 266410, 245649, 373839, 385400, 263230, 199774, 144522, 55583, 133139, 197580, 150287, 97062, 101343, 158352, 249269, 261017, 261609, 454482, 450071, 440040, 407471, 404747, 612893, 829895, 885746, 773058, 642229, 578690]
18892E78690q4701k9010R9713L6092J30566k05489j66658q4463L9668M7616P703
18881C69727j36399L687P888p3503J4018l167J14650N3149n175j2375P314L3778
18869C73592P8878N823J28147J19694O4260N1372j70430j76467R176Q9864j77060
18858C96849j66422R396j6887L3694P3846k4371l5820J4703k7645j0169q7105
18847A60069k9225J08506L3580R4195J09928j43832l1780K7659r4968k7024l1268
18836A75840J4968N9681J2958j09531l1871q2961O7857Q7022r3215n7032Q772
18825E2488Q9527K6839J41153N5832r5806P6026R3001o6234l9417K4908n9659
18814B98658P118k8460j46442m1581o4680p1630j4658M2898N8423n0304l0041
$$ y = [578690, 493989, 464979, 564692, 600784, 731350, 525861, 359203, 274740, 314408, 362024, 369727, 233328, 237015, 244903, 171400, 185418, 182251, 296901, 350050, 344875, 332500, 339814, 373592, 452470, 458293, 586440, 706134, 770394, 821766, 651336, 474869, 484045, 573909, 396849, 230427, 239823, 222936, 256630, 330476, 306105, 270285, 284988, 257343, 247174, 160069, 130844, 239350, 272930, 367125, 477053, 333221, 301441, 329100, 234132, 207108, 175840, 190808, 250489, 263447, 153916, 122045, 39084, 106941, 193963, 100748, 43716, 52488, 142015, 168854, 310007, 365839, 270033, 346059, 439060, 372826, 333409, 358317, 298658, 305776, 277316, 130874, 89293, 24613, -47017, -61675, -18777, 39646, -10658, -40699]
18803d0699J00410J01060J23408m5781L9287J93828R1756o3008P2954R2091n345
18792F59961j04549l8068m2136Q8350J35408q3644j60413L939k3645q5264j67632
18781A82307j4376J95984O3675O1501L5491O5089L9394j254J24626J41799j40674
18770G53562k14798j00639M2634P1838J32365P5832j87658j33833j51899m7005
18760B40399j18825K9642M6438Q7777J6861K8537M7224j4290K8690n6792j47641
18749A88020K12571J53236j67070j37515j47443N2641J70684j2315j22181k9664
18739A60964K7113J64547J41737M6288j34954m1279O3514J3392q7500j01815k4341
18728B27666m9512j30052k4484L8159J00330N0602O6783k7830k7643M7415p3825
$$ y = [-40699, 59711, 160771, 284179, 238398, 277685, 471513, 563269, 500261, 573215, 665306, 659961, 555412, 517344, 475208, 563558, 698966, 615322, 454909, 458848, 435203, 349939, 182307, 167931, 363915, 427590, 489091, 524582, 589671, 629065, 627811, 752437, 894236, 753562, 538764, 438125, 480759, 552597, 684962, 760794, 573136, 439303, 287404, 240399, 121574, 151216, 197654, 285431, 302292, 330829, 378053, 363763, 392453, 335661, 188020, 400591, 553827, 386757, 249242, 101799, 154440, 325124, 312809, 190628, 160964, 188077, 352624, 494361, 540649, 405695, 364416, 427930, 441322, 353822, 252007, 227666, 178154, 48102, 23618, 61777, 162107, 212709, 279492, 251662, 224019, 271434, 197609]
18717A97609n367N4310p4480r9740J36554J30624Q0085L0201j2839J615j21191
18706C17381j09612L3044R6073j9892j21813J2410m1075p3043N9869j7476J7884
18695A53750J72028p6989k25726K2220R8866n7875p3602q7596M1107K1965O6559
18684E4707J07604n4477p5103j3608J40602R1833l1628r7512p1942P3585P3499
18673A97560J00351m0768j21748M7627M297J224J6431Q7996J7253r9618J36219
18662C46824J08269k1786m6316p8185N392L6967J01995J41579K10102P0814j68517
18651G07138j66756j47661M8643K65185J10087J63431K07104J42342K6476j70996
18641A184993m1383k07526l08009k20052N3469J40426J10220k33187j36770p7403
$$ y = [197609, 192242, 246552, 172072, 72332, 208886, 339510, 419595, 449796, 436957, 438572, 317381, 207769, 240813, 336886, 316994, 195181, 207591, 166516, 93473, 153342, 135866, 153750, 325778, 248789, 23063, 45283, 144149, 86274, 12672, -74924, -33817, -11852, 54707, 162311, 107834, 32731, 19123, 159725, 251558, 219930, 122418, 50476, 124061, 197560, 297911, 257143, 135395, 183022, 187319, 188543, 204974, 292970, 310223, 210605, 346824, 455093, 433307, 386991, 308806, 314198, 351165, 453160, 594739, 804841, 875655, 707138, 540382, 392721, 441364, 706549, 816636, 980067, 1187171, 1329513, 1355989, 1184993, 1143610, 936084, 628075, 408023, 461492, 601918, 712138, 478951, 342181, 264778]
18631B64778P1139J80994J38050o3705m7943N6834R8225J65663L58670L43989
18621A566694J55648J44955k26520j87607j12662q5545k87756j38402j31379j075
18611F96351J209j87987l6307o2022j21439K1492J1424o622n3320o4474j64574
18600C3731j30869m8366J74961J46856O7828L1302o2744J463J99279J25969L2873
18589E72283j13149j74579j17335j34740o2440q5465O1515k2827M3804J17904
18579H4971L9919o8494r2529J12186J64126N0757n1491P2259o5859l4272Q020
18568B19593j05323L7080J39661J06625m4791n0646q1184k2720N3778K53070N874
18557E11017j5279N3841M7996j85583j07592l6432m3767k46767p4267M9480L8372
$$ y = [264778, 335917, 516911, 654961, 591256, 543313, 600147, 698372, 864035, 1222705, 1566694, 1722342, 1867297, 1640777, 1453170, 1340508, 1254963, 967207, 828805, 697426, 696351, 697560, 509573, 473266, 411244, 289805, 311297, 322721, 316099, 262779, 198305, 33731, -97138, -145504, 29457, 176313, 244141, 275443, 212699, 214162, 413441, 539410, 572283, 459134, 284555, 167220, 32480, -29960, -115425, -53910, -76737, -32933, 84971, 124890, 56396, -36133, 76053, 240179, 290936, 239445, 311704, 245845, 211573, 219593, 114270, 151350, 291011, 397636, 352845, 302199, 221015, 198295, 252073, 505143, 511017, 495738, 549579, 597575, 411992, 304400, 267968, 224201, -22566, -96833, -47353, -8981]
18546h981J18345J49907K29100J20489J4610j86663J6769N95j64926j07460K81719
18535D63504K58351m730n0298J93815K78734K74934M22231K68148j45219l20170
18525A639300k69215j00157j0265O093j18271M287P0539j76396J43164K99137
18515A488216L57483L66454M28735N09056L53597J33253N2050J14493L06513N58645
18505D668495O07872J50687n0859q5417J74573N01379M21632L75057M14877O62760
18495G841056J091122J205244J757689K518872L539686M975965P229749J1024936
18487D1184319J7097347K7383134M4369499O6384326P1157904K4040920l5752524
18480B55864925o3375868o1227858m1792971k5252198j5452232r838598o365165
$$ y = [-8981, 109364, 259271, 488371, 608860, 623470, 436807, 453576, 454171, 289245, 181785, 463504, 721855, 717125, 666827, 860642, 1139376, 1414310, 1836541, 2104689, 1959470, 1639300, 1370085, 1269928, 1259663, 1265756, 1147485, 1151772, 1222311, 1045915, 1189079, 1488216, 1845699, 2212153, 2640888, 3149944, 3503541, 3636794, 3688844, 3803337, 4109850, 4668495, 5276367, 5427054, 5376195, 5290778, 5465351, 5966730, 6388362, 6763419, 7178296, 7841056, 8932178, 10137422, 11895111, 14413983, 17953669, 22929634, 30159383, 41184319, 58281666, 85664800, 130034299, 196418625, 267576529, 291617449, 255864925, 192489057, 131261199, 89468228, 64216030, 48763798, 38925200, 32560035]
18473C2560035m001588k358872j266747j33970P88175K084399L930531O359295
18465C7961258J0541162J7569849K8800841M7250610P1745380Q1616644L5545303
18458C31031047l4858765p0289726p1995597n0957696l1089721j9075202j1825807
18451D0938533p851713n802293m449302l479677k530017j939158j822396j538913
18443A1525064j102217q54799o30264k71452j45977p7175q7976m02686q37483
18434G115035q23481p01032n08826l48417L570J37942K06616k41103n31578n69982
18424C738744l22601k88016m9705j71749j28147j9074P0418J10317K17588K42888
18414C400663k2437j11435k65537n36466m11241k29317j55358M4450K6909K0055
$$ y = [32560035, 28558447, 26199575, 24932828, 24798858, 25587033, 27671432, 31601963, 37961258, 48502420, 66072269, 94873110, 142123720, 213869100, 295485744, 331031047, 296172282, 225882556, 153886959, 102929263, 71839542, 52764340, 40938533, 33086820, 27284527, 22835225, 19355548, 16825531, 14886373, 13063977, 11525064, 10422847, 9568048, 8937784, 8666332, 8520355, 8443180, 8355204, 7952518, 7115035, 6291554, 5590522, 5081696, 4733279, 4736849, 4874791, 5081407, 4840304, 4308726, 3738744, 3416143, 3128127, 3078422, 2906673, 2778526, 2759452, 2829870, 2940187, 3157775, 3400663, 3378226, 3266791, 3001254, 2464788, 2053547, 1824230, 1668872, 1713322, 1740231, 1760286]
18404A760286j6612k39530j30827m4972p6404P4326O2259j8528n2043n6700l3279
18393A227976L4218o7262m817j65726j80868j04999p1561j78335N7161M7830j9737
18382E73880R9411K3990N4567q199N737j16432q4053N6370O0186q2404K0940o4336
18370E39657k5501L1846o022L6957J03641P1973k3276K3997m0689J29717J69145
18359A011445n685q2002J08271J71502P7935k9409k65342j32960j9501j79298
18349F54956n2715P4451J6431M3326J03490Q4472K3381N0087J7586m7317k9817
18338I38331j13201o3249J618P9715J44049J45903q0016r3433n6238j04954j44033
18327F54492j36935m5483J477k5435J46010n198k1986M2411M0256o0099l0505
$$ y = [1760286, 1743674, 1504144, 1373317, 1328345, 1251941, 1326267, 1388526, 1369998, 1317955, 1261255, 1227976, 1262194, 1194932, 1190115, 1024389, 843521, 738522, 666961, 488626, 545787, 593617, 573880, 673291, 697281, 751848, 743649, 749386, 632954, 548901, 605271, 665457, 583053, 603993, 539657, 514156, 546002, 539980, 576937, 680578, 752551, 729275, 753272, 712583, 842300, 1011445, 1005760, 923758, 1032029, 1203531, 1281466, 1252057, 986715, 853755, 834254, 654956, 602241, 676692, 693123, 736449, 839939, 924411, 947792, 997879, 1015465, 968148, 938331, 825130, 761881, 763499, 843214, 987263, 1133166, 1053150, 959717, 903479, 798525, 654492, 517557, 472074, 473551, 448116, 594126, 588928, 566942, 609353, 649609, 589510, 559005]
18316E59005K1341o1907j37392N449l2450P6987O5936M3065j5201k2401r3347
18305D09085j17333k4578m6537l1025L3120K3204j4191J8305R2409J27243l0280
18294D39422O4068j571p9554r3230j4706Q9756r3790j41472l4051Q3216N0765
18283B68853J2613N0846l9548r9327j49017J23430j300j33961l1513P1785R3870
18272A66731l0417m3489P9488J7937J49153R7139l1691m7906m0180r7589q0590
18261A38586K8587R7745o7249J12129J5066p9582j34816M8835J28341N349M1989
18250C34980M3601O5245M6382P494j29899J3939L1203l6191k0912q3638l1664
18239B40540J61886L6077q1073Q1405R9134O1780j06780k1629R1060M3967R0372
$$ y = [559005, 580346, 518439, 381047, 386496, 354046, 431033, 496969, 540034, 524833, 502432, 409085, 291752, 267174, 220637, 189612, 222732, 245936, 231745, 250050, 342459, 469702, 439422, 503490, 501919, 422365, 329135, 314429, 404185, 310395, 168923, 134872, 218088, 268853, 281466, 332312, 292764, 193437, 44420, 167850, 166550, 32589, 1076, 72861, 166731, 136314, 92825, 172313, 190250, 339403, 436542, 404851, 356945, 316765, 219176, 138586, 167173, 264918, 197669, 309798, 324864, 245282, 110466, 159301, 287642, 292991, 334980, 378581, 443826, 490208, 497702, 367803, 381742, 412945, 376754, 355842, 272204, 240540, 402426, 438503, 357430, 438835, 537969, 599749, 492969, 471340, 562400, 606367, 696739]
18228F96739P7958k17147k59085q9446J04272J30546J33402j0661r1105K818N3439
18217E31730M5869M1175J12987J44774j33282O2921J49872Q8696J49722J34561
18207A329025J73251K42986O0638J82957O7066j3976J57533K5239J5628m8525
18197B191822j41601j17533j14283m8058j18284j01418m2403k637M8992J49022
18187A703619J86320M7773R2052J99211K40690K07423K71153L23451L56265J02071
18177C730028q0066m2041l4203M61j83241r9440j95042j71408k17511m11357k70109
18166B026071k71952k23280k06182j52871j86330l2419o520q5126M8078L7610
18156I47079O2004m6344n004p3508j43111M4539R0050R5253J8362L2871k9269
$$ y = [696739, 774697, 557550, 298465, 209019, 313291, 443837, 577239, 566578, 475473, 478291, 531730, 577599, 618774, 731761, 876535, 743253, 806174, 956046, 1044742, 1194464, 1329025, 1502276, 1745262, 1805900, 1988857, 2055923, 2041947, 2199480, 2224719, 2240347, 2191822, 2050221, 1932688, 1818405, 1770347, 1652063, 1550645, 1508242, 1505605, 1554597, 1703619, 1889939, 1937712, 2029764, 2228975, 2469665, 2677088, 2948241, 3271692, 3627957, 3730028, 3649962, 3607921, 3573718, 3574179, 3390938, 3291498, 3096456, 2925048, 2707537, 2296180, 2026071, 1754119, 1530839, 1324657, 1171786, 985456, 953037, 946517, 861391, 909469, 947079, 1009083, 962739, 957735, 884227, 741116, 785655, 875705, 970958, 989320, 1022191, 992922]
18145I92922q5815j05022R3724o6158m6445K3726P8948O3671q4515j01552J67263
18134I30747J72904L4483J36334J27485J61970L22575O13783O86157L27596l7633
18124C476401j70506r5164n3278N6101J87927L84817N31657N79587R01875J030258
18114F829675Q92524Q84886J145111J369279K048032L094129M347898N696462
18106B6307996P991630J2669918K1170092L5307043N9380865R1734210R0423320
18099C44985074P395960o3100779q6755108p1422857m3055973k4517952j4394766
18092D9133599q747088n256837l191073j854517j356127o72640O33467J898992
18084C0587776L291076N336684R038748J6113758K8468594M9189113P7839709
$$ y = [992922, 907107, 802085, 895809, 829651, 783206, 806932, 885880, 949551, 865036, 763484, 930747, 1103651, 1138134, 1274468, 1401953, 1563923, 1886498, 2500281, 3186438, 3514034, 3476401, 3305895, 3210731, 3157453, 3213554, 3401481, 3786298, 4317955, 4897542, 5799417, 6829675, 7722199, 8607085, 9752196, 11121475, 13169507, 16263636, 20611534, 26307996, 34299626, 46969544, 68139636, 103446679, 162827544, 254561754, 344985074, 352381034, 289280255, 202525147, 131102290, 88046317, 63528365, 49133599, 40386511, 35129674, 31938601, 30084084, 28727957, 28055317, 28688784, 30587776, 33878852, 39215536, 48254284, 64368042, 92836636, 142025749, 219865458]
18077B19865458Q2933866J4905152n3059592p7206084o6674433m1431371k3809161
18070E5523835j4431342r102327n996738l751023k461097k177236k006247j745556
18062A3852269j453440j365077j211319r66444r37599q10565o38630l53218k82086
18053E833891k24290j25569J75116J04114l96245n09124n57419n07453m14821
18044C378200l62123k02037l0437j52020k60254j90049n9539n1202J35140J38114
18034B343793j34957j44415o6816l3092k00433j87250j37694q9067M4522N9511
18024A454102n3328M8308q12K660m1148j32271p3183o0497j7540N5248P9360n2934
18012A207965p7853M8944J0801k0375n1038j31673q981N7616J559J59241O1081
$$ y = [219865458, 302799324, 317704476, 264644884, 187438800, 120764367, 79332996, 55523835, 41092493, 31990166, 25993428, 22242405, 19781308, 17604072, 15597825, 13852269, 12398829, 11033752, 9822433, 8855989, 7918390, 7107825, 6469195, 6115977, 5833891, 5609601, 5484032, 5659148, 5763262, 5367017, 4857893, 4300474, 3793021, 3378200, 3016077, 2814040, 2783603, 2631583, 2371329, 2181280, 2121741, 2070539, 2205679, 2343793, 2208836, 2064421, 1997605, 1964513, 1764080, 1576830, 1439136, 1350069, 1394591, 1454102, 1400774, 1449082, 1448270, 1450930, 1409782, 1277511, 1204328, 1143831, 1126291, 1181539, 1260899, 1207965, 1130112, 1179056, 1189857, 1169482, 1118444, 986771, 977790, 1035406, 1036965, 1196206, 1257287]
18001A257287L529k6682j6573k7054m074r1437p6863n3606K6277K4941J42363
17990A158108J23113j7779j22632R8531l7713J37754J39396J57300K05833M13750
17980B255661N73183P46001P88289N28244L55507O1619m09494l93559n47905o45224
17970C312322n74993m21681j46418n5957j08849k12398n721j3224N6082K16062
17960B045225M65989O07317O83995P83764Q41379R94381P32012L7665n10979o40587
17950F040161o87913p00840o83836n34843m78429k47166j16759N084j7565k16461
17940B361433k27924k80782l08373j73022q1293k13935j63560m2151j2791l8582
17930H19020P947j8851P1116P4957m6050j3505N7454p3335J76303N327M2457K6671
$$ y = [1257287, 1260816, 1234134, 1217561, 1190507, 1186433, 1094996, 1018133, 964527, 990804, 1015745, 1158108, 1281221, 1263442, 1140810, 1239341, 1201628, 1339382, 1478778, 1636078, 1841911, 2255661, 2828844, 3574845, 4363134, 4891378, 5246885, 5308504, 4899010, 4505451, 3957546, 3312322, 2737329, 2315648, 2169230, 2113273, 2004424, 1792026, 1786305, 1773081, 1829163, 2045225, 2511214, 3118531, 3802526, 4586290, 5427669, 6422050, 7154062, 7191727, 6680748, 6040161, 5352248, 4651408, 3967572, 3432729, 2954300, 2707134, 2590375, 2595459, 2577894, 2361433, 2133509, 1852727, 1544354, 1371332, 1290039, 1076104, 912544, 870393, 857602, 819020, 826967, 808116, 879232, 954189, 908139, 894634, 952088, 878753, 1055056, 1060383, 1102840, 1129511]
17918A129511k218j15814j4492j4281j78455j85470J1408m2966R5921J13460o1508
17907G35096j1318M3211j6364Q929p722j14679Q1349J55746J86984R7521J33706
17896A292459L26782J92526J86694M56514L08848K38614M76169N24305P31622
17887D734533L62341Q3968k80806n37210n14054n52875l46443l39602k14675k45431
17877B149746l69320j26880P725o6280J473K16889J07172J17536K97393J67037
17867B502491L09274M03586K35858K09640r2635l78115l82595l77741k51093l20321
17857A858349j98173j36692k04791k36297j83816n1766M253j79710K7433L7278
17847G36068r2253j4288j0056P0848p7687k31492j7899Q4896m6523L8395p0485
$$ y = [1129511, 1127293, 1011479, 996987, 982706, 804251, 618781, 630189, 587223, 683144, 796604, 735096, 723778, 766989, 750625, 759554, 751832, 637153, 718502, 874248, 1061232, 1158753, 1292459, 1619241, 1811767, 1998461, 2454975, 2763823, 3002437, 3478606, 4002911, 4734533, 5096874, 5180842, 4900036, 4362826, 3848772, 3295897, 2949454, 2609852, 2395177, 2149746, 1780426, 1653546, 1661271, 1594991, 1596464, 1813353, 1920525, 2038061, 2335454, 2502491, 2811765, 3215351, 3451209, 3660849, 3568214, 3190099, 2807504, 2429763, 2178670, 1858349, 1660176, 1523484, 1318693, 1082396, 898580, 846814, 851067, 671357, 698790, 736068, 643815, 629527, 619471, 690319, 612632, 381140, 363241, 448137, 401614, 440009, 369524]
17836C69524l5344j4635j12377n9918J55357K0823l9652k191o5102k0863N2964
17825B48586k8698O3285j0324j30289p935o1935j05392N2118Q0066J16258q951
17814B06789k1100Q4761M5380Q4869p1473j14024o9776j06332n6034J1837J13876
17803A08773J32749K9594R3061M7022k3584l0059j08743j81655k9485M9077N4686
17792A41436J35152O8966j48399p963q78n5259Q4557J55235J43852j59501k17889
17781A39309k7281J20566P8867p3228L3908J0905m1111j19376K453p344N4801
17770A72469n368k7337j05425N2579Q0145L4831O3168n6807j34538Q5494m0489
17759A18722L3653L7470q025J3814R2964m9757L84K5131j0820r3489M5784K2457
$$ y = [369524, 334180, 319545, 207168, 147250, 302607, 323430, 283778, 281587, 216485, 195622, 248586, 219888, 283173, 272849, 142560, 134625, 72690, -32702, 19416, 99482, 215740, 206789, 185689, 270450, 315830, 400699, 329226, 215202, 145426, 39094, -16940, -5103, 108773, 241522, 271116, 364177, 411199, 387615, 357556, 248813, 67158, 37673, 86750, 141436, 276588, 345554, 197155, 189192, 188314, 133055, 217612, 372847, 516699, 357198, 139309, 112028, 232594, 311461, 238233, 272141, 283046, 241935, 122559, 125012, 117668, 172469, 167101, 139764, 34339, 86918, 167063, 201894, 265062, 208255, 73717, 159211, 118722, 152375, 189845, 181820, 195634, 288598, 238841, 239225, 264356, 253536, 160047, 205831, 228288]
17747B28288K8146J6394L3396N2717J00381J63041K06572K24732p0293j88071
17737G95303j02656o7021j54958o2265j01264l9103J6238k6929n1655j67428n9410
17726b1148J2477R4985Q6200Q0496J98415J54243K09626J56076r2724j27001q5227
17715F66418k39707j25923n1505k314j6532q744N5252N9129J67773j6223k8161
17704D59463k00191j40855r3196n5267J4044L4766L4473N8775R8903J26553j9997
17693C17471q0364k3527j01046j18841K4247R1393l4170Q2968O8479O6502O6065
17682C59177Q263j26452l6275j29058L1162L0305k047J9281M8499J57034K02831
17671E62720P1355j8768j46505j82672O0876p3864j53088j51466M6476J21997
$$ y = [228288, 256434, 272828, 306224, 358941, 459322, 622363, 828935, 1053667, 983374, 795303, 692647, 625626, 470668, 408403, 307139, 268036, 284274, 257345, 205690, 38262, -21148, -8671, 86314, 172514, 253010, 451425, 605668, 815294, 971370, 878646, 751645, 666418, 426711, 300788, 249283, 246969, 230437, 221693, 276945, 336074, 503847, 487624, 459463, 259272, 118417, 25221, -30046, -16002, 18764, 53237, 112012, 210915, 337468, 317471, 237107, 213580, 112534, -6307, 17940, 109333, 75163, 158131, 226610, 293112, 359177, 367440, 240988, 204713, 75655, 106817, 137122, 135075, 154356, 202855, 359889, 562720, 634075, 615307, 468802, 286130, 347006, 273142, 120054, -31412, 15064, 137061]
17661A37061j53599j76174O1357J21096N0915k8941o770n1571K2165O5403Q7329
17650A28271R9753J13566N2946N1586l5972q5192l4593q7899m1761N2370O8166
17639B81241k1513j06449Q9798k1976L7578m9622j19971Q189J24250M8082r20
17628B68687o6588m6402O4520r3489j75785O7486r073N2653j27637j416J65965
17617I8921L0720M5384N7348L521L7442k0039j9543l4174r4107n4355J73816M4418
17605B69352r464l6871r6556m0847J0163j4614K00693P2014j14748j8854O0839
17594B81107j48637M257J04363j283k2435q6951N4970M6303M2756m085k42335
17583B8030j34553L0959J19401k8400K0511O5973J24508K07746l0135j23377p0947
$$ y = [137061, -16538, -192712, -131355, -10259, 40656, 11715, 4945, -46626, -24461, 40942, 128271, 228024, 341590, 394536, 446122, 410150, 324958, 290365, 202466, 160705, 213075, 281241, 259728, 153279, 243077, 221101, 258679, 209057, 89086, 97275, 221525, 269607, 268687, 202099, 155697, 220217, 126728, -49057, 18429, 9356, 62009, -65628, -67044, 98921, 129641, 175025, 232373, 235894, 273336, 253297, 233754, 199580, 105473, 51118, 224934, 269352, 259888, 223017, 126461, 85614, 95777, 81163, 281856, 353870, 239122, 220268, 281107, 132470, 136727, 241090, 239807, 217372, 130421, 185391, 231694, 274450, 270365, 28030, -106523, -75564, 43837, 15437, 35948, 101921, 226429, 434175, 404040, 280663, 209716]
17572B09716N4929n0594J4866L909r4658J482Q3784j66846j00331J21523J45907
17561B23687K5776K7870p6025Q3379Q5025Q0847J80431J08604J25166K40750K57024
17550A362534J48492p6290j62272k62383j54202j18328m7448P281o1066j36215
17540E00103j98889k85o175q1845Q4627J55687k6821J67390J78439L0194N3829
17529H56254J47676J95115J10518m50m9974j11109k62006k20702k57823p2042
17519C35457J53868n044p9848J19448m2176q9146m7096p9942j86464O7193Q7871
17508B34121M7059l8816K6475J17038l5342o043R1008o8240r2137j096N7981q5783
17496B46225j63697q6787J02459k05746j22839P6808P2624J58752p6988n795K4986
$$ y = [209716, 264645, 214051, 228917, 232826, 138168, 139650, 223434, 56588, -43743, 77780, 223687, 249463, 277333, 201308, 284687, 369712, 450559, 630990, 739594, 864760, 1105510, 1362534, 1511026, 1434736, 1272464, 1010081, 855879, 737551, 690103, 697384, 636318, 500103, 301214, 300929, 294754, 212909, 297536, 453223, 426402, 593792, 772231, 802425, 856254, 1003930, 1199045, 1309563, 1309113, 1259139, 1148030, 886024, 665322, 407499, 335457, 489325, 484281, 404433, 523881, 481705, 392559, 345463, 265521, 79057, 146250, 234121, 281180, 242364, 268839, 385877, 350535, 344492, 435500, 367260, 275123, 274027, 332008, 246225, 82528, -4259, 98200, -107546, -230385, -153577, -80953, 77799, 811, -4984, 20002]
17485B0002J34754P4334k34363j11700O3942R8083L1212O7893l1718P6024K19
17474A88682r8311L033M0997j43303K6600J45936m3821j15085N6543Q0979L1676
17463A73926k8642p7486R9567N2495J2188k6377p4447J1332m9955j2156J05128
17452A85573L2884j14636L3068N4738q2224q742q1651L9018J28663P5182N0449
17441C12322j84998j60931r8295j37427q6684J22798K10387n276N323q0208L1190
17430g1799L28L7603j7815R1797N8197r7216n2990R3198p933l6873L6577J12206
17418A45280J18787n8782q6600J05995J01680J00113m6240o8009j05384k4009
17408A82831P0401K6783j36302p5839J7018k1442m455J2480l3675k2143R9260
$$ y = [20002, 154756, 229090, -5273, -116973, -53031, 45052, 76264, 144157, 112439, 188463, 188682, 90371, 93404, 134401, -8902, 17698, 163634, 119813, 4728, 61271, 142250, 173926, 145284, 67798, 167365, 219860, 232048, 205671, 131224, 142556, 92601, 80445, 185573, 218457, 103821, 136889, 191627, 109403, 100661, 19010, 58028, 186691, 261873, 312322, 127324, -33607, -131902, -269329, -356013, -233215, -22828, -28104, -22781, -102989, -71799, -71471, -33868, -51683, 40114, 98311, 1095, -51895, 41303, 33370, -3503, 33074, 145280, 264067, 205285, 118685, 224680, 326360, 426473, 380233, 312224, 206840, 182831, 253232, 280015, 143713, 67874, 84892, 63450, 58995, 71475, 37800, 15657, 114917]
17397A14917J0091j8358L491O9375j3160N4761m2787Q4519j29420L2178l0391
17386A35216j2154q4037m4102Q8004O1511j03417q1353J30554J81531J05962O258
17375C83973J07861R2896J57528j03793N284j01341j95854l7948j13798n5895
17365A38913n0636N3208J124l5508j4374K7037M2799p0947J22378J18342K9128
17354C61464J50063O5507N4064J7772j9213m4532j44897j02587J00112J7144M440
17343D59337o1816j08405k58748J62379R143j07892O5544L403p0307O5507P8729
17332B36874P6230o5638j22870J62047R2759m6768j34545m174O5856k1353Q782
17321B47200n6832P6105J08205k7719j56770j13092n4866j66036L4585J6775O4262
$$ y = [114917, 125008, 106650, 110141, 179516, 166356, 221117, 178330, 262849, 133429, 165607, 135216, 123062, 39025, -5077, 82927, 144438, 41021, -40332, 90222, 271753, 377715, 383973, 491834, 584730, 742258, 638465, 643749, 542408, 346554, 308606, 194808, 138913, 88277, 141485, 142609, 107101, 92727, 119764, 162563, 91616, 213994, 332336, 361464, 511527, 577034, 631098, 648870, 629657, 585125, 440228, 337641, 437753, 454897, 459337, 397521, 289116, 30368, 192747, 201890, 93998, 159542, 162945, 92638, 158145, 236874, 313104, 247466, 124596, 286643, 379402, 332634, 198089, 193915, 259771, 238418, 247200, 190368, 266473, 374678, 346959, 190189, 77097, 22231, -143805, -109220, -92445, -28183]
17310b8183k4939p2396L3448J36076L1729N1206M7417n3268n6264j07927l1564
17299g4665P4772J5551Q1264M3064r9375j07828M7779Q9054Q6337k1721J0652
17288A44884q736j8288j72597R9118M2492J5057j4712n501K8977k0350l681j6874
17276F9789Q4921Q8536o9194q2110k1349M9542O7431O9485R944p8145j6872j6541
17264A55437K859K3510P3128l2554n2657j53079o6079K08367j8458q5513N0058
17253A05019N8536J67848K4246k20244K5414N9925J63879n0388j14343j23518
17243I6374k1109q6629O7140Q2201K7781P0716j2651j66644n1044L3569R411R0897
17231A40012J405J4919m2056J4418J2923M7306Q2906Q4467O094J37237l1326p7198
$$ y = [-28183, -53122, -125518, -92070, 44006, 75735, 126941, 174358, 121090, 64826, -43101, -74665, 107, 15658, 96922, 139986, 40611, -67217, -19438, 69616, 155953, 134232, 144884, 136148, 117860, -54737, 44381, 86873, 101930, 87218, 81717, 110694, 90344, 86663, 69789, 154710, 243246, 174052, 91942, 70593, 120135, 187566, 257051, 266995, 188850, 171978, 155437, 158296, 181806, 254934, 222380, 169723, 16644, -49435, 158932, 140474, 54961, 105019, 163555, 331403, 355649, 135405, 160819, 220744, 384623, 334235, 219892, 96374, 75265, -11364, 55776, 137977, 165758, 236474, 223823, 57179, 6135, 39704, 49115, 140012, 141417, 156336, 114280, 128698, 141621, 188927, 271833, 356300, 362394, 499631, 468305, 391107]
17219C91107r1070k12032M142P2959P1349j6918p2374j03855q6397q460n2676
17208a04225J09128J01545N7257j25015J9839O3631M6993J05283m667p4947j23755
17197G1067M268M8254R331m3738j19349O1056M4009l4515p4935m9580N9210J14884
17185H9962R2946M2851p0636O1667J17428K4263o9523j3413m1829O0772j37438
17174A57050k08857N244j18955O075M6868J52860J63605J21813J77660l7632j14075
17163C51656r6980L0829P6080j07390M0310L3308M7380m5931k37229n3056J67822
17152B06799J09326K6067k2317r1678j77170q164K129M4340J6194J164J0397L4360
17140A51447J21960l3725l4634j8654l4712j70524l400J75879J26592m6696p1118
$$ y = [391107, 300037, 88005, 92147, 165106, 236455, 219537, 147163, 43308, -43089, -51549, -104225, 4903, 106448, 163705, 38690, 58529, 122160, 169153, 274436, 269769, 194822, 71067, 75335, 123589, 132920, 89182, -30167, 30889, 74898, 40383, -34552, -84132, -24922, 89962, 182908, 225759, 155123, 216790, 334218, 358481, 288958, 275545, 233716, 294488, 157050, -51807, -46563, -165518, -159443, -112575, 40285, 203890, 325703, 503363, 465731, 351656, 254676, 285505, 361585, 254195, 294505, 327813, 375193, 329262, 92033, 38977, 206799, 316125, 342192, 319875, 228197, 51027, 42863, 44992, 89332, 105526, 106690, 117087, 151447, 273407, 239682, 205048, 186394, 151682, -18842, -22242, 153637, 280229, 233533, 162415]
17129A62415j21212q5250P5943L07389L5590j80042j45184q6346J47463j9344
17119I1422m3484n4063P0960N9648M4291Q9513J34699J7586N8844Q51o5486n7473
17107C47308q1167k2726l0293n3849R7867j3507j7281l5391K8356J7434N4276
17096B91027J6708L6280k2710o5007p6976o5450m2210L0317J35469k2345j1986
17085B03117q3806J0226p595R1194J28561r196r4598j4891q603J8814p6468Q441
17073A65196J33856n7628n9099n1675N9458q6203L567O7731n8602O48N2110o123
17061A63236j24833j36036j5985N6641N9861J13936J49954n0723k7714J5157k7119
17050A76375p1860P7444o7664J7158n316j1777J26674Q6264q7082j42161j219
$$ y = [162415, 41203, -44047, 31896, 339285, 374875, 194833, 49649, -36697, 110766, 91422, 47938, -6125, 64835, 124483, 168774, 258287, 392986, 410572, 469416, 470267, 404781, 347308, 266141, 243415, 213122, 159273, 257140, 243633, 226352, 190961, 219317, 236751, 291027, 307735, 344015, 321305, 256298, 179322, 113872, 71662, 101979, 237448, 215103, 203117, 119311, 129537, 121942, 213136, 341697, 332501, 237903, 223012, 214409, 233223, 156755, 165196, 299052, 241424, 182325, 130650, 190108, 103905, 107472, 175203, 116601, 117249, 169359, 163236, 38403, -97633, -113618, -56977, 2884, 116820, 266774, 216051, 188337, 203494, 176375, 104515, 181959, 114295, 131453, 126137, 114360, 241034, 327298, 240216, 98055, 96836]
17039I6836J21652J10334r2880j9056m5564m6374k3940K28447Q8960q6969o5126
17028B66320l3713k8777n3632m049J3571O0816J34239N5734p2908j8977m7888
17017B70736N6082l525j11695p5962J09684J42463j16356p2892N778J60886J2916
17006C78115m8095n7366k6088p6414q0223o7217P9597P013N0008o994j6684J5077
16994A50729Q5884J44735l258n8283M3404L9108j74312p7931P4348o9353j96934
16983d1863l4533J43518O6386K2405p0912o6187k7263M1800N5945R0560K2026
16972B01882Q8340q7180j36205j5497J4041J77870q933j04041O203M323j00934
16961C9869n3430m0608R8871L8646L3111m2219Q4772J83563k636k00247n5087
$$ y = [96836, 218488, 328822, 235942, 216886, 171322, 124948, 101008, 329455, 418415, 331446, 266320, 232607, 203830, 150198, 146149, 159720, 220536, 354775, 410509, 337601, 318624, 270736, 326818, 323293, 211598, 135636, 245320, 387783, 271427, 198535, 204313, 365199, 378115, 330020, 272654, 246566, 170152, 89929, 22712, 102309, 109322, 159330, 152336, 135652, 150729, 236613, 381348, 378090, 319807, 363211, 402319, 228007, 150076, 224424, 155071, -41863, -76396, 67122, 133508, 155913, 85001, 18814, -8449, 33351, 89296, 179856, 201882, 290222, 203042, 66837, 51340, 65381, 243251, 234318, 130277, 136480, 140803, 39869, -13561, -54169, 44702, 83348, 116459, 74240, 159012, 342575, 339939, 139692, 84605]
16950H4605J5054p706J50917N1494m1195j24791O9772L6084r9869j03286n5869
16939b4790r5960o939J27573J25530O6220K4266M2873j6011M3886j49284O3218
16928B00582j8215o261J15602K3426j48391q1783J14078Q284q0815J14334J05887
16917C46728P0802k3863j30348p1007l3748J22167M6194j18893j33995k2574L0952
16906H2415j51574n2173L5992J74535k0100j47045r7067J33301M4408J5647j0263
16895H076l4617k0942M8032J01486j1964o3274M166J04317K6519l6612P5420K345
16883B02952N1686j00422n1976k1837m2045J5075N4549q5088p5806R1081q4482
16872d6313j2977J72495K31291j28207k30882n0448J26530L9348J9880J1158k32570
$$ y = [84605, 99659, 91953, 242870, 294364, 253169, 128378, 198150, 234234, 134365, 31079, -24790, -120750, -127689, -116, 125414, 191634, 215900, 258773, 242762, 286648, 137364, 200582, 182367, 176106, 291708, 315134, 166743, 84960, 199038, 207322, 126507, 240841, 346728, 417530, 393667, 263319, 192312, 158564, 280731, 326925, 208032, 74037, 51463, 82415, -69159, -121332, -85340, 89195, 69095, -77950, -175017, -41716, 2692, 18339, 8076, -26541, -47483, 549, 102035, 90071, 26797, 30963, 135280, 161799, 125187, 200607, 202952, 254638, 154216, 102240, 80403, 38358, 53433, 107982, 22894, -52912, 38169, -46313, -59290, 113205, 344496, 216289, -14593, -65041, 61489, 100837, 120717, 131875, -100695]
16861a00695J6419Q1149R7751m935l9095K47623M367k5587j08964m2400j07443
16850A8190m1350P9369J39739J7933q8460l9978n303j11057L5150L399J520M6351
16838E5503J53413J25566m849P5808m5500j36666j4095l5986k1943J0246N8421
16827B19918j76153n9476J00699J35871l2934p718k9395k0650J11902J51831r3305
16816C00590J383R547o9537p3815J29131o5848j35237n7682J05015m0155j61605
16805e8213m5812k582o7603J75017J02231P3701M8857K7128J24059J1084j35960
16794B51907j736Q1350J22992r6931k31619m0551r4380J3296J08049L7388j6492
16783A33273r3734k2699N2137k9223o1456K2867k5453P8471K6222m6722j08545
$$ y = [-100695, -84276, -3127, 94624, 89689, 50594, 298217, 302584, 276997, 168033, 125633, 18190, -23160, 56209, 195948, 213881, 125421, 85443, 80140, -30917, 4233, 7632, 9152, 55503, 208916, 334482, 329633, 405441, 359941, 223275, 209180, 173194, 151251, 161497, 219918, 43765, -15711, 84988, 220859, 187925, 180207, 150812, 130162, 242064, 393895, 300590, 301973, 311520, 241983, 168168, 297299, 231451, 96214, 38532, 143547, 103392, -58213, -104025, -106607, -174210, 807, 103038, 176739, 225596, 252724, 376783, 387867, 251907, 250171, 331521, 454513, 357582, 125963, 85412, -8968, 4328, 112377, 149765, 133273, 39539, 16840, 68977, 39754, -21702, 1165, -24288, 54183, 80405, 33683, -74862]
16772g4862k8370J69710J89121J370l7113m2571o0759l5590K2007k3257j560Q1319
16760A59445N7937K835n8219l4463m5935P7075l099j44113M4839J07489L3894
16749A97685Q2869J8316J2441j05372r6588j56167j6965q4523l7457J28511J99847
16738A42597R3120j40146j21329n1934J20117J67014Q0220o5822j65287M2858
16728A01408J51774J18629j10188l476K0971M3684l5668m0984k1482M2661J64981
16717D32310J8808r5234N5164j0307r8497j02677j74978q578J85300N3801p5062
16706A80050l6888J17977J10603m8474j56273m8928j41080o6171J56930J09419
16696A77165r2963j16659M3458N0253L7232K584J24738L3357j14354l8702J16872
$$ y = [-74862, -103232, 66478, 255599, 256969, 219856, 177285, 116526, 80936, 102943, 79686, 78126, 159445, 217382, 220217, 161998, 127535, 81600, 158675, 155576, 11463, 56302, 163791, 197685, 280554, 298870, 311311, 205939, 109351, -46816, -63781, -148304, -185761, -57250, 142597, 235717, 95571, -25758, -77692, 42425, 209439, 289659, 223837, 58550, 101408, 253182, 371811, 261623, 258147, 279118, 322802, 287134, 246150, 224668, 267329, 432310, 451118, 355884, 411048, 400741, 302244, 199567, 24589, 16011, 201311, 255112, 180050, 143162, 261139, 371742, 323268, 166995, 118067, -23013, -89184, 67746, 177165, 84202, -32457, 11001, 61254, 98486, 101070, 225808, 259165, 144811, 106109, 222981]
16685B22981P7165k0360j14453P9037J11401o1655k8709j21364l0957N9059K069
16674A74214P255n8780o8449Q333M6464J79051J52517n5379m4908j04402k56319
16663b0403Q6823R6946m347j42p8622R9799k4396o772j17079Q221J05433j06884
16651C8577J54561J09586q7563l9941n2881k2163K23323j5066j21929o9798l2067
16640H4639m431P514o968j7497K2113M6079L0411m2505j10287L683J9548K6779
16628E9078R2233Q9776Q7412j3158o2013o1589j39989q3806J32970N3424j12585
16617D1753k1873J49357Q5067M6190j8385K744p186o5771j72822n9618n0438j4938
16605h5920R0491k0304P9215m944K4755J07850L6570m3647J5156Q6660j46329
$$ y = [222981, 300146, 279786, 165333, 244370, 355771, 294116, 265407, 144043, 113086, 172145, 174214, 181469, 122689, 54240, 62573, 109037, 288088, 440605, 385226, 340318, 235916, -20403, 66420, 163366, 159019, 158877, 80255, 180054, 155658, 148886, 31807, 40028, 145461, 38577, 193138, 302724, 215161, 175220, 122339, 100176, 323499, 308433, 186504, 116706, 84639, 80208, 87722, 80754, 63257, 85370, 131449, 161860, 119355, 9068, 12751, 32299, 59078, 151311, 241087, 328499, 315341, 253328, 191739, 51750, -32056, 100914, 154338, 41753, 19880, 169237, 254304, 300494, 282109, 284853, 277667, 211896, 39074, -20544, -70982, -85920, 4571, -15733, 63482, 58538, 83293, 191143, 227713, 184066, 199222, 285882, 139553]
16594A39553n4971o5366l7347N5460l9064K3258J32388M741k1178r0690l5055
16583A1729L818m3416p6312L8111q4385n4946M7032P8586J02616l2919n195l6450
16571e1731L7186q8818o9315M8961J14059J560M678j52061K7008J35841N7166
16560F4534j28621J70925J11883m8233K0925j34047j63134L3719L2832N5936q7257
16549g0538J2568J38948q5942p5292L6884J54413J3481J21693O193m2377n1962
16538A58069j19110o2469J17798j8202m3123N1911O9504M4196l3891j41373l5925
16527a2615M1852m1034K6518o8270l4910R9722n7720j53228P7095M6532L8393
16516c7665J81297J8482o1308O194Q614j20230j23837K8977J6726m2588J08080
$$ y = [139553, 84582, 19216, -18131, 37329, -1735, 21523, 153911, 158652, 137474, 46784, 11729, 15547, -27869, -104181, -66070, -150455, -205401, -158369, -79783, 22833, -10086, -15281, -51731, -14545, -103363, -172678, -123717, -9658, -8098, -3420, -155481, -128473, 7368, 64534, -64087, 106838, 218721, 170488, 191413, 57366, -105768, -72049, -39217, 16719, -70538, -57970, 80978, -4964, -80256, -43372, 111041, 124522, 246215, 252408, 210031, 158069, 38959, -23510, 94288, 76086, 32963, 84874, 154378, 198574, 164683, 23310, -12615, 29237, -11797, 14721, -53549, -88459, 11263, -46457, -199685, -122590, -76058, -37665, 143632, 162114, 100806, 107000, 115614, -4616, -128453, -99476, -82750, -125338, -17258]
16505a7258J31473K4730N0486m3703k2o3457o906J01214q4789j24571n3339J76287
16493I0145R8124m5189j16213K0442M8978j19677p5669Q7604J27035Q2572j54415
16482D3737o2179K9291p0894J14580O3567P9466L4420j21842r5647k4910r8455
16471a08866o1476J01367O9764o2462M4889l7211O9896M1778R3755K09010j29168
16460B31276j82508j31055J13230P1410J7249K9802q28R0955j9451o8686o0649
16449I0745N4090l3441Q3546o8469m7698N7463j3529l1853p2702K3813m1984J1141
16437A1122O8975O8549O5348m5571p2077j57709K4512Q985N8532J46215Q665N530
16425A91076p5592K1209J82185O2396j24360j53862l7362J49082J11649J4587
$$ y = [-17258, 114215, 138945, 189431, 145728, 145706, 82249, 75343, 176557, 91768, -32803, -86142, 90145, 188269, 143080, 26867, 47309, 96287, -23390, -99059, -11455, 115580, 198152, 43737, -18442, 10849, -60045, 54535, 118102, 197568, 231988, 110146, 14499, -10411, -108866, -170342, -68975, 789, -61673, -16784, -53995, 15901, 57679, 151434, 360444, 231276, 48768, -82287, 30943, 102353, 119602, 149404, 148576, 239531, 220080, 151394, 90745, 144835, 111394, 194940, 126471, 78773, 136236, 122707, 90854, 18152, 41965, -19, 11122, 80097, 148646, 213994, 168423, 96346, -61363, -36851, -27866, 30666, 176881, 185546, 191076, 115484, 136693, 318878, 381274, 256914, 103052, 65690, 214772, 326421, 341008]
16415C41008j36040j27235j08111m2823J4313n3048j3510N6352J249N6648J05645
16404I4448k8921p6328n8206K4832j43148N093R8246j08559m722o1852m6849J799
16392c04167J45410J86252J48462J14107j4007j25253p0433k4736j0682j2167
16382C2786m1362N5077J76872m6376P733J22352l64l7538r6523p7047j3559m8323
16370C3728l0286j2231N8415Q5572J6334j4723O0802P1401j33157k3907p1884
16359D0064n8710K9856j04129m6266L3847K7315Q4062N7993K4931j19099r8860
16348a28996q006J73056J24406j18754J34315m2300J9515r5967j50702n395k1008
16337a19836K4343J08552K6330k3598K4770J54709m6887n9235k47807M6740J75181
$$ y = [341008, 204968, 77733, -30378, -73201, -58888, -111936, -125446, -69094, -67845, -11197, 94448, 65527, -10801, -69007, -44175, -187323, -182230, -83984, -192543, -197265, -259117, -305966, -304167, -158757, 27495, 175957, 290064, 276057, 150804, 80371, 55635, 44953, 32786, -8576, 46501, 223373, 176997, 184730, 307082, 306718, 269180, 172657, 95610, 82051, 33728, 3442, -8789, 49626, 135198, 151532, 136809, 197611, 269012, 135855, 111948, 40064, -18646, 11210, -92919, -139185, -105338, -78023, 6039, 64032, 88963, -30136, -128996, -137002, 36054, 160460, 41706, 176021, 133721, 153236, 57269, -93433, -98828, -119836, -95493, 13059, 39389, 15791, 40561, 195270, 148383, 89148, -158659, -111919, 63262]
16326F3262J08921k7557m9212q7057j9382k084m2437o5593J5932R8071L5892r2988
16314f4232Q656j2890o3924n6428N7457l802k9403j184m2946R5870K4912O9945
16302a7969m2507J9139L8542Q872J02415j76243j35678J07036J09848P4050Q6231
16291A73736r9071k20340j32778J2307J65897J5831n4850P7759l7377k9363M3526
16280h4723m6844l8708j1856O0233O1352J00826K1183j3942O9154o9926q1099
16269c4350P4030Q6713m5766p6881l5288K8706q6450j06421J18004J17836j18623
16258g8490q5378o4520Q9962J00048J3299J08412O0159j7799l4j02175j22390
16247i8906j03971J2769L7703M2340Q2544P7867m8977j56133L0137J91319o2919
$$ y = [63262, 172183, 144626, 95414, 8357, -11025, -13109, -55546, -121139, -105207, -7136, 28756, -64232, -55576, -68466, -132390, -188818, -131361, -135163, -164566, -165750, -208696, -112826, -87914, -17969, -60476, -41337, -2795, 6077, 108492, -67751, -203429, -96393, 13455, 87505, 173736, 74665, -145675, -278453, -266146, -100249, -84418, -139268, -61509, -98886, -128249, -84723, -131567, -170275, -182131, -121898, -60546, 40280, 61463, 47521, 116675, 46749, -34350, 39680, 126393, 80627, 3746, -31542, -2836, -89286, -195707, -77703, 40133, -78490, -163868, -228388, -138426, -38378, -25079, 83333, 143492, 125693, 125659, 23484, -98906, -202877, -190108, -152405, -110065, -27521, 50346, 1369, -154764, -124627, 66692, 3773]
16236C773r119k327q8666j1113J23869j3417K16472J6051j36149N13L1373k9642
16224A01618p0298n8688J2593P0486N1356j00809o0081N7648J05202P0140r0137
16213H9030l2645M2441n0492J00281n07j14878J5760n6671J9179M03j00749J5585
16201g3263R3102j10026l986K95816R4033j05663o302J0620k7566j36994j17678
16190h7907j27085n951K9889N0760o0675j1314J18977J18168M4348J25806O0044
16179B55060n6160j14338j40012J11649O5551L9270N3304L4358j30270j46301
16169b7889R1502O5004Q1129j0453j13175j75026J9718J16656O1276O1898L0414
16158B01054n1624j59059J4394K6643J23948k9040j24836k4910P4183m7528j45127
$$ y = [3773, -5346, -7673, -96339, -107452, 16417, 3000, 219472, 235523, 99374, 99887, 131260, 101618, 31320, -27368, -14775, 55711, 107067, 6258, -53823, 3825, 109027, 179167, 89030, 56385, 98826, 48334, 148615, 148108, 33230, 48990, -7681, 11498, 11901, -88848, -73263, 19839, -90187, -94173, 201643, 295676, 190013, 183711, 194331, 166765, 29771, -87907, -214992, -220943, -191054, -140294, -200969, -212283, -93306, 24862, 69210, 195016, 255060, 198900, 84562, -55450, 56199, 121750, 161020, 214324, 248682, 118412, -27889, 63613, 128617, 209746, 199293, 86118, -88908, -69190, 47466, 108742, 170640, 201054, 149430, -9629, 4765, 31408, 155356, 126316, 1480, -23430, 50753, 3225, -141902]
16147a41902P2908m4858L7697J03767N8067M5432R586r2102m6324o0626n2522
16136a10877M7540J37499l1746m7931q1686p6382O2931L3478q701R9911P6023
16125A00059j7644P076q4913o2746k4759l369o4861J33606J5110k8551N050P3716
16113D7774m4992j1130K909p5457k7324L2832o0567J199j1657O9235O8739l0577
16101c9016p5851R6084R1767q3600j01139N737R2420J13431K5322p1110o7227
16090a3182l943M8551j81747j63133N2304J72685J35450N8102q2022n0292n534
16079c2761o8256j05231r7119l2418M9184J13511j1142Q9868O3603L1661n3678
16068e2778m9904k173j3316K989R9898J44366N3684p3135k34693m838J59209J2502
$$ y = [-141902, -68994, -113852, -76155, 27612, 85679, 131111, 140697, 48595, 2271, -58355, -110877, -63337, 74162, 42416, -5515, -87201, -163583, -100652, -67174, -75875, 24036, 100059, 82415, 89491, 4578, -58168, -82927, -86296, -151157, -17551, -2441, -30992, -25942, 47774, 2782, -8348, -5439, -80896, -108220, -75388, -135955, -134756, -146413, -77178, -8439, -39016, -114867, -18783, 72984, -10616, -111755, -106018, -13598, 99833, 125155, 54045, -13182, -17125, 31426, -150321, -313454, -261150, -88465, 46985, 105087, 23065, -27227, -32761, -101017, -206248, -303367, -335785, -286601, -173090, -184232, -94364, -30761, 900, -52778, -102682, -104855, -118171, -115182, -15284, 129082, 182766, 109631, -125062, -129900, 29309, 41811]
16056D1811k1216R1635q1697K9727K6370r3814j87522j3904k3409r7265J05382
16045b23902R2987j34641l3311M8760R9115J34672M3967L5882j38825j09506o844
16034a91646J67207j3150j08873l8292Q7643R2298o5693J4153K05569j6801j8000
16023A14415M1945q7056j22719J8429M4885J7423k4751m1180j39496N7226k0640
16012a41519q97j75894q862J19371J45315J42934L5872j62215K0328M3243M3329
16001F1005n0130n3472n5949k2407j2907j9895O0643M0533J8057j43221P0203
15990a07540L8084J31970N1275K3748P337j60040j37933P9226P914j20039j49579
15979c35577J23727q1662N6855J93054R6529r7925n1362O5155J45486M456j14001
$$ y = [41811, 20595, 112230, 30533, 60260, 86630, -7184, -194706, -208610, -232019, -329284, -223902, -130915, -265556, -298867, -250107, -150992, -16320, 27647, 63529, -75296, -184802, -191646, -24439, -37589, -146462, -184754, -97111, -4813, -70506, -56353, 149216, 132415, 114415, 156360, 69304, -53415, -34986, 9899, 27322, 2571, -38609, -178105, -120879, -141519, -142416, -318310, -327172, -207801, -62486, 80448, 116320, -45895, -25567, 17676, 61005, 10875, -42597, -98546, -120953, -133860, -153755, -93112, -52579, -34522, -177743, -107540, -69456, 62514, 113789, 137537, 144874, -15166, -153099, -73873, -65959, -185998, -335577, -211850, -293512, -236657, -43603, 52926, -44999, -96361, -31206, 114280, 118736, 4735]
15968D735q625J62142p8686m3391J00882k5138j06770j67323o0328J81139J18208
15957G6845o7180j36927Q6993o7546l1751N8490Q482N4005K17322j03217q7357
15946H159j6520o2516J339M2948q0822o1689n494k2638R161K19845J49096m585
15934A76284r4832l1272k7704j0622l0249m5978j55497o6548K2691J39965N9237
15923f4525q317L1871M419L9832k770n4878j03527Q2350Q6674N4956j54499o605
15911i5019Q2821J38201q168q0061K8313L9992j1811k8447j09372J31935L895
15900I2279p1042j2796j7912k8709J26829j0224Q2586J5879r8432j08112O159
15889b3495J0953O8492r8648L5273Q205L4622m0771L2639L4363M1842l2007j31325
$$ y = [4735, -3890, 158252, 79566, 36175, 137057, 111919, 5149, -162174, -222502, -41363, 76845, 9665, -127262, -40269, -107815, -139566, -81076, -72594, -18589, 198733, 95516, 8159, -8361, -70877, -69538, -26590, -107412, -169101, -174595, -197233, -188072, 31773, 180869, 176284, 81452, 50180, 22476, 11854, -18395, -64373, -219870, -286418, -263727, -123762, -64525, -72842, -40971, -36552, 3280, 510, -54368, -157895, -75545, 11129, 66085, -88414, -95019, -12198, 126003, 117835, 37774, 66087, 106079, 94268, 65821, -43551, 88384, 92279, 21237, 8441, -9471, -38180, 88649, 78425, 161011, 176890, 78458, -29654, -23495, -12542, 55950, -42698, -7425, 780, 35402, -5369, 27270, 61633, 103475, 71468, -59857]
15877e9857k6576q3337Q0841P3535K3430o6490P0908M0311j1103k0961J15591
15866A36292j12772N3511j1940n1631n3144Q297j23857m4651m9718K822J41459
15855a05332J24345O0848l8703p4396l6338N520j03377q4020M1483m3049M402
15844b48617K4296Q6472N5347r4699q5235l5222P0068j0813P1889N2558R9836
15833a4120M9845p594j47333j11877J05574J65444r734m6595M7748j16169q2215
15822a67026p610Q1484m3214J71870K13449N0111q8382j05612Q1779k3569j94554
15811c1274j8026j4673M3193J29829L2371k5123l8616K1685Q6819N7798m0677
15800B03306p802p7948j58644j62022p9110L2798J38671J68120j11732j27323
$$ y = [-59857, -86433, -169770, -88929, -15394, 8036, -58454, 12454, 52765, 41662, 20701, 136292, 23520, 77031, 65091, 13460, -39684, -31387, -155244, -199895, -249613, -246791, -105332, 19013, 79861, 41158, -33238, -69576, -64056, -167433, -251453, -209970, -253019, -248617, -224321, -137849, -82502, -177201, -262436, -297658, -227590, -238403, -166514, -113956, -14120, 35725, 28131, -119202, -231079, -125505, 39939, 30205, -16390, 31358, -84811, -167026, -174636, -93152, -136366, 35504, 248953, 299064, 210682, 105070, 186849, 163280, -31274, -49300, -63973, -20780, 109049, 141420, 116297, 77681, 99366, 186185, 243983, 203306, 195504, 117556, -41088, -203110, -282220, -249422, -110751, 57369, -54363, -181686]
15790a81686j31388k206J74518r5492j64897o756J29081O8337O3769N232K9872
15779a11616O4490l8491n2890p2289R7289M6697r7392J1250J19076Q7394O2492
15768A16010r5708r4890J6803J4398o787Q1444m8155n8412j45721o0551J0594
15757b70975P6397J22161o4033o8232k6675J2196K1329n0835L3709o5042J0435
15746b69565N8773M5565J893r3811K078N7680J0470n3261N0878p46M6143J4786
15734a29117k7251J2988K2446o423L9022J06723j736j03128j07019J3201K3860
15723a56434J82386L2854p0702L9447J112q5193J2639o9564q6717J4682K04409
15712A8919J21185n6206j24168n2631J62415j06657j42341j28K0469J57142J5577
$$ y = [-181686, -313074, -315280, -140762, -236254, -401151, -407907, -278826, -210489, -146720, -141488, -111616, -47126, -85617, -138507, -210796, -113507, -66810, -164202, -152952, -33876, 53518, 116010, 20302, -74588, -57785, -43387, -50174, 31270, -16885, -75297, -221018, -281569, -270975, -194578, -72417, -136450, -204682, -231357, -219161, -197832, -248667, -214958, -280000, -269565, -210792, -165227, -163334, -257145, -255067, -197387, -186917, -240178, -189300, -190046, -143903, -129117, -156368, -143380, -120934, -127357, -88335, 18388, 16652, -86476, -193495, -180294, -156434, 25952, 58806, -11896, 27551, 28663, -56530, -43891, -113455, -200172, -185490, 18919, 140104, 83898, -40270, -92901, 69514, -37143, -179484, -179612, -159143, -2001, 13576]
15701A3576k469q2445p2281l5911J16966J44734N4039j59101j93665r669K67374
15690D1148N3528n4520j25995j73402P360R9518P3977O6011J6198J2285n9765
15679d3657L3245r6462j23278J5088M1401P0452J11040M5367l5663j21541O0768
15668d3240J50376o9475k00066j08968Q2524R4709J78890k7951k5295J1058q5626
15657d3064Q4230o123j14968o434j33634l1735p6049o3059O525J36764J34999
15646a12548K01240K5504l3234j11309P6971n969j70856o145O8849N0497o9477
15635h6477K2126K0884k1262j59582n3410J22109R1702K12139l9893n5243j43146
15624i0053q3593l0585J55962J58246o5908p711J28965O1355m1598j39345k27558
$$ y = [13576, 11107, -71338, -143619, -179530, -62564, 82170, 136209, -22892, -216557, -226226, 41148, 94676, 40156, -85839, -259241, -251881, -152363, -78386, -12375, 3823, 16108, -43657, -10412, -106874, -230152, -215064, -173663, -103211, 7829, 53196, 17533, -104008, -43240, 107136, 37661, -162405, -271373, -188849, -94140, 84750, 56799, 31504, 42562, -43064, 41166, 35043, -79925, -86359, -219993, -251728, -327777, -390836, -384311, -247547, -112548, 88692, 114196, 80962, -30347, 46624, 40655, -130201, -136346, -67497, -17000, -86477, -64351, -43467, -64729, -224311, -277721, -155612, -63910, 148229, 108336, 53093, -90053, -173646, -204231, -48269, 109977, 44069, 36358, 165323, 226678, 185080, 45735, -181823]
15613a81823j70453K0697R2274O2969J64665J52355M4282k1786K4626l0534M5434
15602B02706r5420j6132j03808j48802k256J1497j7153k1248R8087j0787J06550
15591C234N723l9058k6218k945o4758j0929L5699o4216r4254J01425N2999o467
15579a09765L9078O5005K3438m0049p7364N1960l0728j9785N6978M8023m5594
15568c8803M3499k711m2746N5826P844p2028o0096m7673j8487l444l1694P5182
15556a35331R3518k9316n8777j1021m2649J07360P3711j41656j40978M6794K7089
15545b11256R9100O8420P306k21999P3390J89118p256n6675o8756n4036O0677
15534a21967J55619n7762j62646n2080J40190M8205P1625n2937q5750l1271K3898
$$ y = [-181823, -352276, -331579, -239305, -176336, -11671, 140684, 184966, 163180, 187806, 157272, 202706, 107286, 91154, -12654, -161456, -163712, -152215, -169368, -190616, -92529, -103316, 3234, 8957, -30101, -56319, -59264, -124022, -134951, -99252, -163468, -257722, -156297, -103298, -109765, -70687, -5682, 17756, -22293, -99657, -47697, -78425, -98210, -41232, 6791, -38803, 4696, 1985, -40761, 15065, 22909, -49119, -109215, -156888, -175375, -178819, -210513, -135331, -41813, -71129, -129906, -140927, -183576, -76216, -2505, -144161, -285139, -238345, -211256, -112156, -43736, -36430, -258429, -185039, 4079, -3177, -59852, -128608, -182644, -121967, 33652, -24110, -186756, -238836, -98646, -50441, 21184, -31753, -117503, -148774, -124876]
15523a24876K1760J14592O0810l6156j74796m1539O4962n242K268Q0498J74957
15512A37238M2106j01821k1274m8570r5166j14145O056N7339j18085j8359l202
15501b77883O0489J65057L3811n415l8992Q0193m8666n5359L9551N4568R0014
15490I7368r7332k7455R1047r3416j16728M8404N3786O5622n04Q0104O6006Q0701
15478B47603j09101J3589j1547j04016j12965l3515l870J02103j14942j7657j4739
15467a59057J01663o9710p6444o4184j9697P8155N8802J72842J19718o431n9903
15456G5754q8575j25377K5872m2363r4354j5153k3704Q4340J34662Q9094p1919
15445e1723j89058m2865J96062J13449R0317O5953l8839k10484K6418K1817j17145
$$ y = [-124876, -103116, 11476, 72286, 36130, -138666, -180205, -115243, -120485, -118217, -37719, 137238, 179344, 77523, 56249, 7679, -87487, -201632, -195576, -138237, -256322, -274681, -277883, -217394, -52337, -18526, -23941, -62933, 17260, -31406, -86765, -47214, 7354, 97368, 36, -27419, 63628, -29788, -146516, -98112, -44326, 21296, 20792, 100896, 166902, 247603, 138502, 152091, 140544, 36528, -76437, -109952, -113822, -11719, -126661, -144318, -159057, -57394, -127104, -203548, -267732, -287429, -209274, -150472, 22370, 142088, 135657, 75754, -12821, -138198, -112326, -154689, -249043, -264196, -287900, -203560, -68898, 20196, -51723, -240781, -283646, -87584, 25865, 116182, 182135, 143296, -67188, -40770, -18953, -136098]
15434a36098p1790m9676L8729q3264J31675J53715n89j47424L9379P7719Q8360
15423D0736k810r9103p756q845L0849J5568P1529q4648J1675j3848n5740k3892
15411a26285O1198J98481P8925L4551k3440j26618m6057j47337k4652K3929M1312
15400e5993r9920j05871l2076J22119k2907J0205P1972n0053O0644N2461j8786
15389f8205n3712N9172m084J17950m3016o4304l6740R8066j27598j13797L731
15378b32537J74562M6223j35909m2425M5350Q2147n517N5714K0830j10036J06941
15367E343J61153L1513q8168k2517o096o9379j35042r165P5751L4095J2537Q6273
15355G6298P1644n5710j71558q0597J06273J52364L7795o9409j36228P3745l3376
$$ y = [-136098, -207888, -257564, -218835, -302099, -170424, -16709, -17298, -164722, -125343, -47624, 40736, 37926, -61177, -68933, -77778, -46929, -31361, 40168, -44480, -32805, -46653, -102393, -126285, -65087, 133394, 212319, 246870, 223430, 96812, 50755, -96582, -121234, -97305, -55993, -155913, -261784, -293860, -171741, -194648, -184443, -112471, -162524, -101880, -49419, -68205, -121917, -62745, -66829, 51121, 8105, -56199, -92939, 5127, -122471, -236268, -232537, -57975, -11752, -147661, -190086, -144736, -62589, -68106, -12392, 8438, -101598, 5343, 166496, 198009, 109841, 87324, 81228, 11849, -123193, -132358, -56607, -22512, -9975, 76298, 147942, 92232, -79326, -159923, -53650, 98714, 136509, 67100, -69128, 4617, -28759]
15344b8759n3295j34617P7905O4235N6641L9424K8362p1045j7420n221j42166
15333a85956J33759J29505k4701k9645o1236o271j45039l5454R1249K7634O259
15322i9896j3952J8004j93479j6168o1313k8052J58760O6012P994Q0094l565M9427
15310c6134J44189M9594j09402j09781p0228r550r07m1878n2107J41507K00364
15299A05667J3421r6874m3368N6458p8944j56414O7117O1083l6842n0612P9942
15288g9366m4635K3484O9013j08574k3665q967J28543N4446J1926K1045l784o6663
15276b7197j15460J0584J32964K1078o2077K5088l7408j60669l7244J34347j4110
15265a30104N8635R4071M716K1628m8781q0180L7261L9216o2233O1687m3972q7514
$$ y = [-28759, -82054, -216671, -138766, -74531, -17890, 21534, 49896, -21149, -38569, -43790, -185956, -52197, 77308, 52607, 22962, -38274, -44545, -189584, -225038, -133789, -106155, -99896, -113848, -95844, -289323, -305491, -366804, -394856, -236096, -170084, -162090, -81996, -85561, -36134, 108055, 157649, 48247, -61534, -131762, -141312, -142219, -184097, -236204, -94697, 105667, 119088, 22214, -21154, 35304, -43640, -200054, -132937, -71854, -108696, -159308, -79366, -124001, -100517, -31504, -140078, -163743, -172710, -44167, 10279, 22205, 43250, 39466, -27197, -142657, -132073, 891, 21969, -40108, -15020, -52428, -213097, -250341, -115994, -130104, -71469, 22602, 27318, 48946, 165, -80015, -42754, -3538, -65771, -4084, -48056, -135570]
15253a35570Q2882J7341M3651Q680M4509R2587M5986J34802q3858j34297l957
15242A12756N943p3368P2204J24540R7280M5291k28685k29839L5779J96007L3375
15231A91283q1841m2154n3735q270j11218j7737O2620m9798l3592J46044N4606
15220E6208p7424k9692m061J38201m7966j86002j1080J17800j63775n7330J03536
15209a61585J08192p5619n8289J47538J30279n0137j27502p2892k8043J0241Q4754
15198i3063m0179j08293K5694o673M9596q1R9700J46309Q8053l1006j03764j02470
15186g6177R1139j0081r0166n6247O1502O081r455K7325p7313n9596K3526P6640
15174i2822J1579j8856R2083m6015K3082o2012L2100m7769R881l7039k5751R6390
$$ y = [-135570, -52688, -35347, 8304, 16984, 61493, 154080, 200066, 334868, 251010, 116713, 112756, 118699, 45331, 117535, 242075, 339355, 384646, 155961, -73878, -38099, 157908, 191283, 109442, 67288, 13553, 5283, -105935, -123672, -61052, -110850, -144442, 1602, 56208, -21216, -50908, -54969, 83232, 35266, -150736, -161816, -44016, -207791, -265121, -161585, -53393, -129012, -187301, -39763, 90516, 40379, -87123, -160015, -188058, -177817, -93063, -133242, -241535, -215841, -222514, -172918, -172999, -73299, 73010, 161063, 130057, 26293, -76177, 14962, 4881, -85285, -141532, -80030, -73949, -83404, -56079, -133392, -192988, -169462, -92822, -81243, -100099, -8016, -54031, -30949, -92961, -60861, -108630, -98749, -135788, -161539, -65149]
15162f5149J4283r6728L9729J08319J4656J22760L553p2966k34566j68418p0426
15151d04953J23492M7315n4827J31643J59931l1560P167M2479L6968M2965J9733
15140A20353p1556j7991k7394j8186j2031R8649M4735m9338l2031N8497J04055
15129A97762k274q4579j91087K5156r3154o840j1665P2871j49324j74889n0280
15118d68303P757P4500J65824k693M6741L3970K0867P0284R2953q1441K5568j00132
15106a14105j50663P4506O7986j31757P4076J68333k0700K176P0617q1541j68773
15095b09845r2254M928L8072J84435Q554n9250K5610J24166K08290P6309j46335
15084A62680q9047K956J8885k04173j04089J04699J3080k6964M6578J55227j68780
$$ y = [-65149, -50866, -147594, -107865, 454, 15110, 137870, 141423, 68457, -166109, -334527, -404953, -281461, -234146, -288973, -157330, 2601, -28959, -21792, 20687, 57655, 100620, 120353, 48797, 30806, 3412, -14774, -26805, 71844, 116579, 67241, 35210, 93707, 197762, 195488, 110909, -80178, -55022, -148176, -155016, -166681, -93810, -243134, -418023, -468303, -460546, -386046, -220222, -222915, -176174, -142204, -121337, -51053, 41900, -39541, -13973, -114105, -264768, -190262, -122276, -254033, -179957, -11624, -32324, -30148, 40469, -41072, -209845, -302099, -297171, -259099, -74664, -66110, -125360, -99750, 24416, 232706, 309015, 162680, 73633, 76589, 95474, -108699, -212788, -108089, -95009, -121973, -75395, 79832, -88948]
15073h8948j84992j9381K5307N5558l6029n2804j7605L2251K07756J13364N0457
15062H4934K8604n2645j25768j31212Q1512P481L4401K7937K4088q899o3692l8179
15050a31438Q2891O1726p2578L2112J14438j0968p638j9100p0175r6077J522M3349
15038g1936J16298L6611m9871l545P9899J2430n3033j58984l1675J91397l191
15027F4400j18090j18511j1063O0145o2455J02708N095m1758P0004n0798n8046
15016a58369j9222l346Q2515O2775L087q6638l3197j86763q1940k0404N5081K6969
15004c59452J00669J68283k5551m8278N1739Q776q6724l7325n8190L7879N0285
14993a97889P3566N8484j00623p2567Q900R9990R8636L5582m064j583J21461M2699
$$ y = [-88948, -273940, -293321, -268014, -212456, -248485, -301289, -318894, -286643, -78887, 34477, 84934, 113538, 60893, -64875, -196087, -114575, -107094, -72693, -44756, -20668, -29567, -93259, -131438, -48547, 13179, -59399, -27287, 87151, 76183, 68545, 49445, -20730, -116807, -115285, -71936, 44362, 80973, 31102, 27557, 107456, 119886, 66853, -92131, -123806, 67591, 64400, -53690, -172201, -183264, -123119, -185574, -82866, -77771, -119529, -49525, -100323, -158369, -177591, -180937, -98422, -35647, -32560, -119198, -152395, -339158, -421098, -441502, -386421, -359452, -258783, -90500, -116051, -164329, -112590, -103814, -190538, -227863, -286053, -248174, -197889, -124323, -65839, -166462, -239029, -230129, -130139, -31503, 4079, 15, -1568, 119893, 162592]
14981A62592K956J0047r0261R4528O3568j33293j78739K5933J897j1572k2845
14970g5189o5269K8227J92163K3445L4526K1807j33380j28826n201L9820p0684
14959a38561R1191K23189K3226n255j36715j60559j03551R2833N0746o0589n3256
14948a77301r9842Q925n6606q6092Q5572O5290J54811J13554J5808j12588O7165
14937b1304Q8582K7787j13317r3554J9499J881j1694M5756k9362j75149q7607
14926c48482J31164J213J62234l462N7384O0413n200j51350j74970k6883K38809
14915e9130J358l8198J04777k9905L2980l0054J04190R175j00442n7428N8326
14904d351J32864N8484J107l9426k25189j45862J23567P4673P7381q4842j24810
$$ y = [162592, 165548, 175595, 85334, 179862, 243430, 110137, -68602, -42669, -40772, -52344, -75189, -140458, -112231, 79932, 103377, 137903, 159710, 26330, -102496, -107697, -67877, -138561, -47370, 175819, 199045, 193790, 57075, -103484, -207035, -114202, -63456, -124045, -177301, -277143, -268218, -324824, -410916, -325344, -260054, -105243, 8311, 24119, -88469, -21304, 67278, 95065, -18252, -111806, -92307, -90426, -102120, -56364, -85726, -260875, -348482, -217318, -216105, -53871, -57333, 51, 60464, 55264, -96086, -271056, -297939, -59130, -57772, -95970, 8807, -21098, 11882, -18172, 86018, 95193, -5249, -62677, -4351, 128513, 186997, 188104, 148678, -76511, -222373, -98806, -24133, 53248, -31594, -156404]
14893a56404L5529J8189L5509J00540J27476l4220l1199o6291j9740j7502J9206
14882A1093j55237O047j17128q1861k6806M702P5477J84301J8412M9076l8800
14871g0724p8411m1554J11640J06940O0882m3588k33885j580K3281p989L8042
14860a36946M733k414O5640K7678j27763l8790l3656P7019K34322o626k7807J6498
14848E1888M642q4384l7455q7025r6913P3059J23134K4680P9724o8612j08753
14837a26015P221J1309K3154j5856J7636J42498m5699j30541J079m1585K2631
14826a34168J21703P7030P818n1139n5126K7616J11614R909k25139j26305J27291
14815a08896j561L1736j2484j7276Q5302K1582R018r0919N921M7233N6085n227
$$ y = [-156404, -120875, -102686, -67177, 33363, 160839, 126619, 95420, 29129, 9389, -8113, 11093, -144144, -138097, -255225, -337086, -363892, -359190, -283713, -99412, -81000, -31924, -70724, -149135, -190689, -79049, 27891, 88773, 45185, -188700, -190280, -166999, -174988, -136946, -132213, -134627, -68987, -41309, -169072, -207862, -241518, -164499, 69823, 63197, 35390, 51888, 56530, -27854, -65309, -152334, -249247, -176188, -53054, -28374, 51350, -17262, -126015, -118794, -107485, -84331, -100187, -82551, 59947, 14248, -116293, -115214, -156799, -134168, -12465, 64565, 72383, 21244, -33882, -6266, 105348, 115257, -109882, -236187, -108896, -110457, -78721, -91205, -108481, -23179, -1597, 7421, -83498, -77577, -30344, 25741, 20514]
14803B0514n0889P803J47286j05083J8263N2085J4811l7971j72636j02386j43736
14792c51939q7282K99011R3132L346L5249j35965J31465N3749o0441K4707k0045
14781a5013q8250r1072l435j28686j30164J18929J65174Q9033J03347r4672j0046
14770h4855K2096k9955P2527N2578J731j72066P790J10004N774K952j22264J6096
14758a17592J55441M8206n7420J2555O5466q8580j40325j9663K3688O0431K5275
14747c2518n5162j1471M1010j60696j39025J06808l58O8655L0008M6611L3173
14736g2965M6932j2328m4700j7752l1784j6430K2943J36355J0033j11868M3364
14725d8200j9323M0996J4208l554P0848N9982O6771r6654r842O7158n7140j1670
$$ y = [20514, -30375, -22572, 124714, 19631, 37894, 89979, 104790, 66819, -105817, -208203, -351939, -439221, -140210, -47078, -43732, -8483, -144448, -12983, 40766, -19675, 5032, -15013, -103263, -194335, -197770, -326456, -456620, -337691, -172517, -83484, 19863, -74809, -84855, -62759, -92714, -20187, 32391, 34122, -137944, -130154, -20150, -14376, -11424, -133688, -117592, 37849, 86055, 28635, 41190, 106656, 18076, -122249, -141912, -118224, -57793, -32518, -87680, -99151, -58141, -218837, -357862, -251054, -251412, -182757, -152749, -106138, -72965, -26033, -38361, -83061, -100813, -132597, -149027, -126084, 10271, 20304, -91564, -48200, -67523, -26527, -12319, -15873, 54975, 114957, 181728, 85074, 75232, 142390, 85250, 73580]
14713G3580r9047j9271P0523r6035r5418M3816p5500M4845j04951M4078n1393
14702b64773J12550r2352j71825n2123O9197J60939k097j00454J48677m5782n230
14691b43273J1573n8048J419m0434J14495P2328Q0425O0488l947k3408j03673
14680a32055j18606J1629R1807J29101K9429q6611P481j3265L1811l520L7377
14669a5422O3790P4191J0358p3381j06068j9759k8264p4613o1629K350M6254m5136
14657b27329m6906J04460N3702j3621N854L4685L4755J31058P9583J9289P9336
14646B54866m7057k44693r2921j00295J55109N1971n1908q974N6132O4790m1128
14635d108M9614K7806O8351n7668O6426r840j98826r5554m8390P6318P2907k7245
$$ y = [73580, -25467, -44738, 25785, -70250, -165668, -121852, -197352, -152507, -257458, -213380, -264773, -152223, -244575, -416400, -468523, -399326, -238387, -240484, -340938, -192261, -238043, -243273, -231700, -289748, -288329, -328763, -214268, -141940, -61515, -1027, -4974, -28382, -132055, -250661, -239032, -147225, -18124, 11305, -75306, -67825, -81090, -49279, -52799, -15422, 48368, 122559, 132917, 59536, -46532, -66291, -94555, -169168, -230797, -228447, -182193, -227329, -274235, -169775, -116073, -129694, -123840, -89155, -54400, 76658, 156241, 175530, 254866, 207809, -36884, -129805, -230100, -74991, -23020, -74928, -83902, -27770, 37020, -4108, 45506, 73312, 141663, 83995, 150421, 140581, -58245, -153799, -202189, -125871, -52964, -80209]
14623h0209n7400p8876p9101O8928J11422P0334r4643n2001J3561J6356J2689
14612a48940J9856r451J34457J39985j864R353j02956n4147o626n0391n536P8649
14600B389N8541K8291N9096K4911l1462o5715K341q7908o7220N3884K1387m3188
14588d4653q2253K3403k16j73512k1068Q7016J80730Q666j76528o1332k0155K7355
14576b52547O7501N4116q808Q1854J14072J8530j27529q0773R2566J00130m3151
14565A5961m393J0078N6817P0919O9737j36076K7952k1414j6941q1422j9391J31656
14553A03483M7528j32340j76884j16008j8557l4136N7147O1729N3780R2825r82
14542f2415k4298k0450J19462j2542L8607m721R708l7540m0415R2444j95349j29191
$$ y = [-80209, -137609, -216485, -295586, -226658, -115236, -44902, -139545, -191546, -177985, -161629, -148940, -129084, -138535, -4078, 135907, 134043, 143396, 40440, -13707, -20333, -70724, -76260, 2389, 60930, 89221, 148317, 173228, 141766, 76051, 78392, -9516, -76736, -22852, -1465, -44653, -126906, -103503, -103719, -277231, -298299, -211283, -30553, -21887, -198415, -259747, -279902, -252547, -185046, -130930, -139738, -57884, 56188, 74718, -52811, -133584, -41018, 59112, 15961, 11568, 21646, 78463, 149382, 219119, 83043, 110995, 89581, 72640, -8782, -28173, 103483, 151011, 18671, -158213, -274221, -292778, -326914, -269767, -208038, -154258, -61433, -62415, -86713, -107163, 12299, -243, 38364, 33643, 43351, 5811, -34604, 57840, -137509, -266700]
14530b66700L0113J6309M9824K5600L8003k2175O9674J39477k3949j16932l8218
14519i8974k6866p7040k072l1653m9950j6565J39367p010L3991N1390j47450m9711
14507b82543J27046M8598j4369J1476P7022M9366j0904j46594r9337k1473L4254
14496b27458J16898R6504J13230o5349l6745n1009m0484J94318j320o6988j64132
14485a32535p8398j17916K4150J7120R6079L6462j2530L8200Q3873j13718R4479
14474f4734J10459N9275j22571n2373M71N1670p8235M4419R6991j4376k1807k2071
14462a2882K4466M7280l3661L2239m0597j31q403p0849l182J33275j4693j8011
14450C4851j05538j2682L3065R8380l3760m5888j2292n5390J188m1298L1903J57851
$$ y = [-266700, -236587, -220278, -170454, -144854, -106851, -129026, -59352, 80125, 56176, -60756, -98974, -125840, -202880, -204952, -236605, -286555, -303120, -163753, -170763, -136772, -85382, -232832, -282543, -155497, -106899, -121268, -109792, -32770, 16596, 5692, -140902, -240239, -261712, -227458, -110560, -14056, 99174, 33825, -2920, -53929, -94413, 99905, 98585, 31597, -132535, -210933, -328849, -304699, -287579, -191500, -155038, -167568, -129368, -45495, -159213, -64734, 45725, 105000, -17571, -69944, -69473, -17803, -96038, -51619, 45372, 30996, 9189, -12882, 11584, 58864, 25203, 57442, 16845, 16714, 8311, -62538, -65720, 67555, 52862, 34851, -70687, -83369, -50304, 48076, 14316, -31572, -43864, -99254, -98066, -139364, -107461, 50390]
14438E0390K648R0645o3279o3630L6883J04993L1181j6472n4439j91636j91485
14427b64201M1867J3273n7861L6347J0547m9339k48J56395O7841j9126k5558P6615
14415a3448R1757n2991j09111j6453L9341L8368R1893J29689L0293k714l4990
14404A91634j53343j08655m4191n1908k4246O7655K5142N2887n4713o9016Q0963
14393h7791r7770q5988J3125o2099p0116o2100J5615O1552J53075M6576K5691
14382a50230J9986m0991l2021K2100J19048J3199n701r1941J03326N7547J1992
14371B6314j20749o7591Q3468l5027M2240Q3243N712r6853P729l9317O1473O1857
14359A2499J6503L6106J19404J25289N9878J7529r9405j53536q6024l1982p3339
$$ y = [50390, 53038, 143683, 80404, 16774, 53657, 158650, 189831, 173359, 118920, -72716, -264201, -222334, -209061, -266922, -230575, -220028, -269367, -269615, -113220, -45379, -64505, -90063, -13448, 78309, 25318, -83793, -100246, -60905, -22537, 69356, 199045, 229338, 226624, 191634, 38291, -70364, -114555, -166463, -190709, -123054, -97912, -45025, -99738, -168754, -87791, -185561, -271549, -258424, -320523, -390639, -452739, -437124, -375572, -222497, -175921, -150230, -130244, -171235, -203256, -181156, -62108, -48909, -54610, -146551, -43225, 14322, 26314, -94435, -162026, -78558, -113585, -71345, 11898, 17610, -79243, -71514, -110831, -49358, 12499, 29002, 65108, 184512, 309801, 369679, 387208, 287803, 134267, 48243, 16261, -57078]
14348e7078r4117L8504p995J4639m794N3546L1057Q7393p3358k2392J463L8633
14336E501J73832Q1605m0841j00765m0131j00134P804J5518n7797j54428k584
14325b12420j7309l5258J34050O1327K421q553J37109J01389K6336J9739o4687
14314A44144k22722k5210R4206J03672M7553M4712q0943j06004j22269m7940K2278
14303a48523J2129J21324o7862j2800J3005p4416p3159P9521J69468L9680p5492
14292a7125j09187P6735R9748J23369k3109K3364j31473j89036j75412o1666K9731
14281c54061J50718o9023L8435R0769m5104j02544o2769l0453J03433J72300J68982
14270F0683J5551q7904r685J20645p5855j53203m5968J15012K4287j7223j27532
$$ y = [-57078, -151195, -112691, -120686, -106047, -110841, -57295, -26238, 61155, -12203, -34595, -33132, 5501, 179333, 260938, 220097, 119332, 79201, -20933, -13129, 2389, -55408, -209836, -212420, -229729, -264987, -130937, -69610, -67189, -75742, 61367, 162756, 189092, 208831, 144144, -78578, -103788, -9582, 94090, 141643, 186355, 105412, -592, -122861, -170801, -148523, -136394, -15070, -82932, -95732, -82727, -157143, -230302, -150781, 18687, 58367, -17125, -126312, -49577, 50171, 173540, 150431, 173795, 42322, -146714, -322126, -383792, -354061, -203343, -272366, -233931, -143162, -188266, -290810, -353579, -384032, -280599, -108299, 60683, 76234, -11670, -21355, 99290, 23435, -129768, -175736, -60724, -36437, -53660, -181192]
14259a81192J506L7987J04293M8381j3501n6401J6870j03193q5252p8021J03370
14248b05153L4483J17811M2284o4104j74246M3566J24852J15016O3767o4728l8764
14237e216R896O4038m6525j52379j21493K8848O3552k5538P2204J08114m5744
14226e0243O1261j8513j04953K5317K3577M2648K4687R3645M3987o5371l8986
14215C7056L9050k6747n9613K6883M528O6398o7699j14666o8454n9897J18576
14204a04585J54369l992o7873K1059j07447o6211L5208n2580j22440N7651K12485
14193d4356J07405k6637O9205n3687j16154n0783N5835Q7760j873r144O2446K9141
14181A09158j8923M9408P7363l7218r2131J0921n7795L8383J0651L5865m2638
$$ y = [-181192, -179686, -141699, -37406, 10975, -2526, -58927, -42057, -145250, -230502, -308523, -205153, -170670, -52859, -10575, -74679, -248925, -205359, -80507, 34509, 98276, 33548, -5216, 4680, 68718, 22193, -130186, -251679, -222831, -159279, -184817, -112613, -4499, -50243, 11018, -7495, -112448, -87131, -63554, -20906, 3781, 97426, 141413, 76042, 37056, 76106, 49359, -10254, 16629, 21157, 87555, 19856, -94810, -163264, -223161, -104585, 49784, 45792, -22081, -1022, -108469, -174680, -139472, -192052, -314492, -256841, -44356, 63049, 36412, 105617, 51930, -64224, -115007, -59172, 28588, 26715, 17571, 80017, 109158, 90235, 139643, 217006, 179788, 87657, 98578, 40783, 79166, 89817, 125682, 83044]
14170H3044K7707p6190r5995o0025l5697J05080Q713M297Q1699L0971j00339m9197
14158g5932p708P7774L1630P013j23885j34587p6349m7553J04926o5387N2029
14147b58029J48434K5646j42053N6574J7084P6014K48137j32371M9608J50397
14137B39441J4013r8691j74514k8804l2929K9310k8775L2922m0176M0238P3315
14126B5350L407O8812m7814r0075K4203Q1129j35870J0304p3745K9075L5400N9087
14114a0737n210l0860O6023P1862J9844j55516l0827k7947K7786p671j08429J6964
14102a74718J25160J89409k0407j14987P0009k3583o6631K5499j27801n2001J4425
14091a55626M8765N9432L7369N5744J08563p6224j19579q2028j37093J72013R9280
$$ y = [83044, 110751, 34561, -61434, -121459, -157156, -52076, -43363, -39066, 42633, 73604, -26735, -75932, -83640, -5866, 25764, 32777, -91108, -225695, -302044, -349597, -244671, -310058, -258029, -109595, -83949, -226002, -169428, -152344, -76330, 171807, 39436, 89044, 239441, 253454, 154763, -19751, -48555, -81484, -52174, -80949, -48027, -88203, -47965, 25350, 28757, 97569, 49755, -40320, -16117, 65012, -70858, -60554, -134299, -105224, -69824, -10737, -15947, -46807, 19216, 91078, 110922, -44594, -75421, -103368, -75582, -83253, -191682, -174718, -49558, 139851, 119444, 4457, 74466, 50883, -15748, 9751, -118050, -170051, -155626, -106861, -47429, -10060, 45684, 154247, 78023, -41556, -123584, -260677, -88664, 10616]
14080A0616J2856l1341L3864p138J0927j2601J19348N6811j56253j36237j1586
14069a10734j3474n1061N721N308l1328L5919O2903q587r2315R6193R6948N1928
14057D7421m8627n8482k940n3215j07741Q2428J08791K5327p6554j17108r6505
14046b97205P9796N2085Q056j2584L3692L5974l1428L9799O1330N1296j3187N6377
14034F4001Q2721Q694l3353j083o0325r5978K2405l750P8162K06634o6731n6340
14022A45057j0990j0156r884r9138M3117M7830j02965j06885J9955m629q064K9614
14010f7138J85398J8220k07310n7908J22614o8997Q4873n4734M4545o081o9165
13999g5683k3965O7959M9986m9415L1406R6387K7746q5331j3669K889k5132n7739
$$ y = [10616, 23472, -7869, 25995, 18857, 29784, 17183, 136531, 193342, 37089, -99148, -110734, -124208, -175269, -169548, -164240, -195568, -159649, -96746, -105333, -197648, -101455, -4507, 47421, -1206, -59688, -62628, -115843, -223584, -141156, -32365, -7038, -83592, -200700, -297205, -217409, -165324, -157268, -169852, -136160, -100186, -131614, -91815, -30485, 20811, 7624, 64001, 146722, 155416, 122063, 120980, 60655, -35323, -12918, -16668, 61494, 268128, 201397, 145057, 134067, 123911, 114027, 14889, 58006, 105836, 2871, -104014, -84059, -88688, -96752, -67138, 118260, 136480, -70830, -128738, -6124, -75121, 9752, -44982, -437, -6518, -75683, -99648, -31689, 18297, -31118, 288, 96675, 124421, 39090, 25421, 28310, 3178, -54561]
13987e4561l0559K7781O8403Q6418o0681j08843N4327j5370j6166j9959J13018
13976D3808j83206k4396R5399q1881n2536P401J31602Q2677j92684r5298J707
13965b67407M5632k2221Q7979K3876m1960j8425R7766K19864l3626m7941Q4607
13954A28144J0188n0440M2077J38737P06m1456J32131j39158j52665r3799Q3740
13943E8205J0798j07339L0624J12764l7154R9951j7853j91307O2049L6292j26974
13932f9944j137J05468j4915q7105K878J15035k2710K935N3570M7418o0353m9280
13920B1860o8480J67541M8287j24778o9792o2005M955N5567k8389O0362O8354
13909G3482m1850r209J16231j6421o9372j11825o0228l1001l5012j9986m7145
$$ y = [-54561, -85120, -57339, 11064, 97482, 36801, -72042, -17715, -33085, -49251, -69210, 43808, -139398, -163794, -68395, -150276, -202812, -195411, -63809, 18868, -173816, -269114, -267407, -221775, -243996, -156017, -132141, -174101, -192526, -94760, 125104, 91478, 43537, 128144, 138332, 87892, 129969, 268706, 269412, 227956, 360087, 220929, 68264, -25535, 58205, 69003, -38336, -7712, 105052, 67898, 167849, 149996, -41311, 20738, 57030, -69944, -71081, 34387, 19472, -67633, -64755, 50280, 27570, 30505, 84075, 131493, 71140, 21860, -46620, 120921, 169208, 44430, -25362, -87367, -82412, -26845, -55234, 5128, 73482, 31632, 22423, 138654, 122233, 52861, -58964, -119192, -150193, -185205, -205191, -252336]
13898b52336M1913M1062k1472p1434K9147J54527N1117j4185R7676K6457j4096
13887F8376j14380o5865J6349R1143M5685K860k4556o8312J34785L1329n0014
13876F7400o6912L6884q0805O0805Q9840L431n9571q6583L2275J01978M6037l100
13864A41679k5905K6851m6611j20113L1061J16084J6382j87891O2155J9210K0505
13853E3407p834r6739J0482J70587j10209r5573R1406O435o3573M4679k6134J5079
13841g987J08078j69909j54309P2446L7296K4768Q6314O7421p3867n5498Q9668
13830B4421n1952j629r9418q6719J72900J47716R1588O4005L629j88841j81343
13819a05643j03368O2654K06598J23585j06546L5195K0094j31724p4845J67231
$$ y = [-252336, -210423, -169361, -190833, -262267, -233120, -78593, -27476, -41661, 56015, 82472, 68376, -46004, -111869, -95520, -4377, 41308, 44168, 19612, -48700, 86085, 117414, 67400, 488, 37372, -43433, 17372, 107212, 110643, 51072, -35511, -3236, 98742, 144779, 141679, 115774, 142625, 96014, -24099, 6962, 123046, 139428, -48463, 13692, 32902, 53407, 45573, -51166, -40684, 129903, 19694, -75879, 15527, 21962, -41611, 3068, -23066, -7987, 100091, -69818, -224127, -151681, -114385, -89617, -3303, 64118, -9749, -65247, 24421, -27531, -29160, -128578, -215297, -42397, 105319, 196907, 260912, 264541, 75700, -105643, -209011, -146357, 60241, 183826, 77280, 112475, 132569, 845, -74000, 93231]
13809I3231P7K9151l3442O4203k3363j21517M1917p4379k08563m755O6627J04043
13797f6770p1153k5065O1096p1283M5645J41579N6425m5129J4634k5220n7638
13786d2879j9710P1594K5221J265R1643M3211M3763j71289j43625n6981N408J05743
13774d6636J96914O9257k4405j77184p996j04755m9841P0062R3306J7306Q7240
13763A23268J42960j19742r4936q519K9469o0832p1915K6750P2692J38109K6378
13752B03682j5495j14464o2183q1781N465K5207p3234K9105J07936P4080J0817
13741A09135p5459l8435M2188k239l3934K9471P0249m686j5968O7549Q3342k5697
13729B05516j80220l9095O6237K240L2683J3467J1877o3201j8244P0306N3540
$$ y = [93231, 93308, 122459, 89017, 153220, 129857, 8340, 50257, -24122, -232685, -237440, -170813, -66770, -137923, -162988, -101892, -173175, -127530, 14049, 70474, 25345, 39979, 14759, -42879, -62589, 9005, 34226, 35491, 127134, 170345, 214108, 42819, -100806, -157787, -152379, -46636, 150278, 219535, 195130, 17946, 9950, -94805, -144646, -74584, 18722, 36028, 123268, 266228, 146486, 51550, 43031, 72500, 11668, -60247, -33497, 39195, 177304, 203682, 188187, 73723, 11540, -70241, -64776, -39569, -112803, -83698, 24238, 98318, 109135, 33676, -4759, 37429, 35190, 1256, 30727, 100976, 96290, 80322, 147871, 231213, 205516, 25296, -13799, 52438, 54678, 87361, 100828, 112705, 49504, 31260, 101566, 155106]
13718A55106j8871J10516o3360p7539r6559j2852P3051k3113M0515N3884j06240
13707C4538j34189p7410O5856m7141P7410J09984m3648O3287k7940j2168J0292
13696A8871l9134l9933q6456o9869J8262P5927J1255O2610j153m1947m8347R9857
13684d0057j5993N5413P3340K9391N9944n0391q7273O2808l6025K703J10584p5829
13672H8615O5669N1699q8879j15244j73515P8729P6369J2082j6856J37961N4644
13661A71274J5086N0837j72885j9679J131o816P8002p9230j4236J98979O0321
13650B82784q5721j15459P7691o2454j40069n8548k7044K1430O5651M3362o7279
13639f5656l228J10286L356q8657O5344J18618k7446j69728j27242n6818K44530
$$ y = [155106, 136235, 246751, 183391, 105852, 9293, -3559, 69492, 46379, 86894, 140778, 34538, -99651, -177061, -111205, -158346, -80936, 29048, -14600, 48687, 20747, 8579, 18871, -20263, -60196, -146652, -216521, -198259, -122332, -111077, -48467, -49620, -91567, -139914, -40057, -56050, -637, 72703, 102094, 162038, 111647, 24374, 87182, 51157, 53860, 164444, 88615, 154284, 205983, 117104, 1860, -171655, -92926, -16557, -4475, -21331, 116630, 171274, 186360, 237197, 64312, 44633, 45764, 38948, 116950, 37720, 23484, 222463, 282784, 197063, 81604, 159295, 96841, -43228, -101776, -128820, -107390, -41739, 1623, -65656, -68884, 41402, 44758, -43899, 21445, 140063, 112617, -57111, -184353, -241171, 3359]
13628C359N7520n7930P7596J02899J9980j10119q5978n0169N3695K2776k3227
13617A0402q3091K9606p5664J47411R9469K4597J9510R990Q3643k7172n5573q1676
13605A01452O1595j8392j45915k0513N0051M5358Q6597J00003N1211p6085L5502
13594B70864K113j10593n2140m2374l3384j09399N8620N2647m147p8318O125n6419
13582i6405K4181K08815O7824J03739j118j24416j67375l8748P0885L2806o5256
13571A4932n2653K6332n946P630j0990j8255j4840K3442k4209l6798K07855J28762
13559B45262k5970j00732j11819j3420M3256j114n8356m1184l5009L0627Q9178
13548B0719N4635j71852j26039J36584L1453N1542R609p943p7067j61596O254
$$ y = [3359, 60879, 2949, 80545, 183444, 203424, 93305, 7327, -42842, 10853, 33629, 10402, -72689, -43083, -118747, 28664, 128133, 152730, 172240, 182230, 265873, 238701, 183128, 101452, 163047, 144655, -1260, -21773, 28278, 73636, 160233, 260236, 311447, 235362, 270864, 272977, 162384, 110244, 67870, 34486, -74913, -16293, 36354, 32207, -46111, -39986, -96405, -72224, 136591, 204415, 308154, 307036, 182620, 15245, -23503, 47382, 80188, 14932, -37721, -11389, -17335, -9705, -20695, -38950, -53790, -30348, -54557, -91355, 116500, 245262, 219292, 118560, 6741, -6679, 36577, 35463, -22893, -64077, -99086, -68459, 20719, 75354, -96498, -222537, -85953, -54500, -2958, 6651, -1292, -78359, -239955, -233701]
13537b33701l5913J3016J16931k6753j6554K60649O1001j2702j29449M0957n640
13526C1842J5869M0241j3815j18100N0956K2327O9656O151j2085j34351o9895
13515a11204j901j0981p0954M3638J9107Q1896k768K9477J06440J67773j2351
13504B38172j16148k7557j657r5301k39110M9303P2672q531R2646n7408r9145
13493a92064J2234K9270Q0717R13N7950P2038j10151K434m0325L4257J91313N4742
13481A93328j37830R7107J0922l715J8214l6579k5609J7223n5893K2956J320j15379
13469a3935N1269J52272l6875m7319n2129l8946n1368O3410k7588j53181p3455
13458b27845K4995Q573O5030J04332K4248J78025J23270j95m9177J9985l8348
$$ y = [-233701, -269614, -256598, -139667, -166420, -182974, 77675, 138676, 125974, -3475, 37482, 31842, 47711, 87952, 74137, -43963, 6993, 29320, 98976, 105127, 93042, -41309, -111204, -113105, -124086, -195040, -151402, -132295, -50399, -53167, -23690, 82750, 250523, 238172, 122024, 94467, 92810, -2491, -241601, -192298, -119626, -128157, -35511, -92919, -192064, -179830, -150560, -69843, -68930, -10980, 61058, -49093, -46659, -86984, -52727, 138586, 193328, 55498, 152605, 163527, 159812, 178026, 141447, 115838, 133061, 77168, 100124, 101444, -13935, 37334, 189606, 152731, 105412, 53283, 14337, -37031, 26379, -1209, -154390, -227845, -202850, -194277, -129247, -24915, -667, 177358, 300628, 300433, 251256, 271241, 232893]
13447B32893Q9711M942q4162q8721k27321j00366J28248K42147J19608q8535m7355
13436A81089K8563l6853k1601J24057Q8954r826n545j63991j45325q1026P8337
13425C6833R701j02798n7742N8627M0305r7015M0323K08143L969K1120j01738
13414E9728j02009j5747J77000J61955j59333q8153J19643J01026p7260k7969
13404A48881l8081L2206J02393k690o0122p6005J11479j9879L1984n8659k30424
13393e8917k8069R4202R4481p5608m7395J18453J9244O3688o7695k1297o840j30727
13381d6480l9387J44500P2006k971L5861n1975q0530oJ13399J22485j15478o7603
13369H3821M4340K4784k0061j66550n8646P5085J39362j54320r3156m3874Q6575
$$ y = [232893, 322604, 327546, 243384, 154663, -72658, -173024, -44776, 197371, 316979, 228444, 181089, 209652, 172799, 151198, 275255, 364209, 354383, 348838, 184847, 39522, -41504, 36833, 46534, -56264, -114006, -55379, -15074, -112089, -71766, 136377, 140346, 161466, 59728, -42281, -58028, 118972, 280927, 121594, 33441, 153084, 254110, 176850, 148881, 110800, 143006, 245399, 242709, 182587, 106582, 218061, 198182, 230166, 171507, -58917, -86986, 7216, 101697, 26089, -21306, 97147, 116391, 180079, 112384, 91087, 84247, -46480, -85867, 58633, 130639, 127668, 163529, 111554, 31024, 31018, 144417, 266902, 151424, 83821, 128161, 152945, 132884, -33666, -92312, -17227, 122135, -32185, -125341, -169215, -82640]
13358h2640J56968J24669l0110P167L0861N6890L458j04232K3335Q1271L7644
13347C05281j76128N506J37810N1518l7009j24246j80728j04631P966K71452J05615
13336B62406N4482m7068n4192m7065j1613o5676l4568K6746J8336O7084k9700
13325A39172o1609L9457K4373L5568q8630j94742K61382J34518o5871r8836j58069
13314c3287J26523P1798p3782q1520Q066l2419N4159N1040J13469R2100o5046
13303B31101j7509J3131J12530j7756j09686M6776J9070o7874p5130l198N8133
13292A89588J12847Q2316l0709k32150K749K0239j1106Q4050n9626j52024m6828
13281d0654Q2042j19128l1340R3067R4830l4034J2984R7336k03139q1018J35589
$$ y = [-82640, 74328, 198997, 168887, 176054, 206915, 263805, 267263, 163031, 186366, 267637, 305281, 129153, 134659, 272469, 323987, 286978, 162732, -17996, -122627, -114661, 156791, 262406, 316888, 269820, 215628, 168563, 156950, 91274, 56706, 83452, 101788, 168872, 139172, 77563, 117020, 141393, 176961, 88331, -106411, 154971, 289489, 223618, 124782, -33287, 93236, 165034, 91252, 9732, 17798, -14621, 39538, 90578, 204047, 296147, 231101, 213592, 226723, 339253, 321497, 211811, 258587, 277657, 209783, 134653, 131455, 189588, 302435, 384751, 354042, 121892, 124641, 144880, 133774, 217824, 158198, 6174, -40654, 41388, -77740, -109080, -16013, 78817, 44783, 57767, 155103, -48036, -129054, 6535]
13270F535K47884r081j12626j26842J3926J44585P22p599J2875K59769L8621j28224
13258C40545m8400j04860k6829K19471L8616l938L8324n8250j02853l3440j83428
13247G4958j53167k2883J44271J36470J6729j0325K5202j88593k10806J21444
13237f6700Q3316q8814O936l915j4595J74440J45457l0865L3721Q5089j19480
13226B04590k04623m8533J34680R6050L2321J3201m8063N8868j60799j4544R5070
13215A58218k1708o1196n3673J5820P3496N5256P6027j0084r2845r7849N9156
13204A00618N9354n0113l1935J7586L9970l2799k2933P6768k390r0591J06404
13193A69939p726K5558o0483n0898J2986J4730P6443M6418O4426J61173o8239
$$ y = [6535, 254419, 245338, 132712, 5870, 19796, 164381, 165103, 157504, 170379, 430148, 468769, 340545, 292145, 187285, 160456, 379927, 418543, 414605, 452929, 394679, 291826, 258386, 74958, -78209, -101092, 43179, 179649, 196378, 186053, 211255, 22662, -188144, -66700, 16616, -72198, -65262, -69177, -83772, 90668, 236125, 205260, 238981, 324070, 204590, -33, -48566, 86114, 182164, 214485, 227686, 179623, 238491, 77692, 63148, 158218, 136510, 75314, 21641, 37461, 110957, 166213, 242240, 232156, 139311, 41462, 100618, 159972, 109859, 77924, 95510, 135480, 102681, 79748, 156516, 154126, 63535, 169939, 162213, 187771, 127288, 76390, 89376, 104106, 180549, 226967, 291393, 452566, 384327]
13182C84327o3480o0083j33198K5678k273q9207j4887J82379L9811n2975j13905
13171A02187j3912l8476J40155L5495j16596j5851n758p6658j2603J39043j9069
13160A17957J067L9210L3892q6931M3044J79370O6154K1024j33847j01703j8737
13149A60500Q716Q3159k6162j7353l841R6911J71287l1950j00555j06909j7059
13138B16744j6044L1516N6024J7000N278r9566o3071q445M3870j49102l5722J10679
13126A09161P5012j4533j08708M6388Q1586l1306N2316n1854j6116J55400P1723
13115C69069j16318j13820j06606j35921M9318J47143M2592j43679l4447O8485
13105B5816J25411J45586j7940k5037l5689q8485N2246J14380M6157l3783N0476
$$ y = [384327, 320847, 260764, 127566, 153244, 150971, 61764, 46877, 229256, 269067, 216092, 102187, 88275, 49799, 189954, 225449, 108853, 93002, 87244, 10586, -2017, 137026, 117957, 119024, 158234, 192126, 105195, 148239, 327609, 393763, 414787, 280940, 179237, 160500, 169216, 252375, 226213, 208860, 205019, 301930, 473217, 441267, 340712, 233803, 216744, 200700, 232216, 288240, 305240, 310518, 210952, 147881, 139436, 183306, 34204, -1518, 109161, 184173, 169640, 60932, 107320, 188906, 157600, 209916, 158062, 141946, 297346, 369069, 252751, 138931, 32325, -103596, -54278, 92865, 135457, -8222, -42669, 25816, 151227, 296813, 278873, 253836, 218147, 129662, 181908, 296288, 342445, 308662, 359138]
13094C59138n3504j60693k8687K3882O9489N1877j9244p709j47235K7444N3076
13083A67834J6634R134K1800l7147J78064R5571N5185P7340n5208k2542j80290
13072C26375o314k2018Q881J1300K41858p9411j06058q1579o1312K7447J25840
13061C85009o4060j12281J9983l177j23670l7165J19022K2195k0304r9849J18942
13050B04645M766p8640q434J49289O6664J0173Q8961M1911j1118j13550j8356
13039C36311l5700N9594J12280q9744r3664o6972J1855N1174R6346P9283j12971
13028C47792j26637k0976K4120m7403M8061l5653o4043Q0073J86566O1524q7318
13017C66106k6353K941q3741m3523o8690O2661O1227K9453m1598p949m0517n9777
$$ y = [359138, 305634, 144941, 116254, 140136, 209625, 261502, 242258, 234549, 87314, 114758, 167834, 184468, 193602, 215402, 178255, 356319, 451890, 507075, 584415, 529207, 506665, 326375, 320061, 298043, 306924, 318224, 560082, 480671, 374613, 293034, 231722, 259169, 385009, 320949, 208668, 228651, 225474, 101804, 64639, 183661, 205856, 185552, 85703, 204645, 209411, 130771, 122337, 271626, 338290, 348463, 437424, 479335, 468217, 354667, 336311, 300611, 360205, 472485, 382741, 289077, 222105, 233960, 285134, 381480, 460763, 347792, 221155, 200179, 224299, 176896, 224957, 189304, 125261, 205334, 391900, 453424, 366106, 339753, 342694, 258953, 215430, 146740, 209401, 270628, 300081, 258483, 250534, 210017, 150240]
13005A50240j5744O5543M3933O6807J49384k6477n3233j06897j1448N7068R5364
12994D14540j01875o6284J46558R5762N2978m2672l6387J5397j3759r2373j67106
12983B04779L9639J6843J14106P1092q9728P1086J91205N859j96713j16734r533
12972C01901j91705l3122J29725J41268n534j48147J10711m7224k2170K25506
12962D61209R5757k743m3430m949K4470k9153n9359K1734p4419r26P6333M9492
12950E14016j02428j38385P2109j18401j08886J82298K07762o661J45051K6984
12940F73459j58816P188p372o2459j54351p664J99787Q9853R299k34021J9395
12929C74298j1477J7316M5882K4767r4980K2415M0520j0928j14573l0796M9168
$$ y = [150240, 134496, 200039, 243972, 310779, 460163, 433686, 380453, 273556, 262108, 319176, 414540, 312665, 246381, 392939, 488701, 541679, 499007, 462620, 478017, 464258, 371885, 204779, 244418, 261261, 375367, 446459, 356731, 427817, 619022, 624881, 428168, 311434, 301901, 110196, 77074, 206799, 348067, 342533, 194386, 305097, 257873, 235703, 461209, 556966, 554223, 510793, 505844, 530314, 501161, 441802, 463536, 389117, 388191, 464524, 514016, 411588, 273203, 345312, 226911, 118025, 300323, 508085, 501424, 646475, 673459, 514643, 521831, 514459, 452000, 297649, 289985, 489772, 579625, 588924, 354903, 374298, 362821, 380137, 426019, 450786, 355806, 378221, 418741, 407813, 293240, 262444, 311612]
12918C11612L1804J06592j9336K8191l5313j26722j37758L3191J0768R954R3168
12907C06151J08267j04899k7068k3491N8680J18351O3908j8222p3267N3328R4287
12896E56025O2388j16602j42181j55848q6909J06933J42213J3199Q3865J62949
12886F26032J9174o2154k2273m5625j5840n3078j55045K0388M0458L9091L312
12875C94440Q5907Q0660p2120m7026Q1775P3342l273j5486q3984p4973k8504J26600
12863E17358M539n0105P9879L0224l9048P4706M7501L7781j29844p9140q3392
12852D10459k3328j49714j06219J55663O7964L9663o4920Q6693Q0611K0836j13466
12841D04242M3211l6606l8051J4880J63557O9269m9046R9491k9637j87109J1174
$$ y = [311612, 343416, 450008, 430672, 458863, 423550, 296828, 159070, 192261, 203029, 212983, 306151, 414418, 309519, 282451, 258960, 317640, 435991, 499899, 481677, 408410, 461738, 556025, 618413, 501811, 359630, 203782, 116873, 223806, 366019, 379218, 463083, 626032, 645206, 583052, 560779, 515154, 499314, 446236, 291191, 311579, 352037, 391128, 394440, 480347, 561007, 488887, 441861, 523636, 596978, 593705, 578219, 494235, 419262, 390758, 517358, 521897, 471792, 551671, 581895, 542847, 617553, 665054, 702835, 572991, 493851, 410459, 387131, 237417, 131198, 286861, 354825, 394488, 329568, 416261, 496872, 517708, 404242, 447453, 410847, 372796, 387676, 551233, 620502, 571456, 670947, 641310, 454201, 465375]
12830D65375M6662q2395P5357J27847n2769k30251j9601M497L7857M5300M6293
12819D64172J14326J18111p8673k7020p8175n9687n4068Q0569J05198J30845o1428
12808F54170p2678O8966O8303k2684o0127M0268j57479j7826J0172P6635Q8127
12797F75847r271K7350N8876j13323q3765n7200M2449O5950J12562L0641o1325
$$ y = [465375, 512037, 429642, 504999, 632846, 580077, 349826, 330225, 334722, 372579, 417879, 464172, 578498, 696609, 617936, 590916, 512741, 453054, 398986, 479555, 584753, 715598, 654170, 581492, 650458, 718761, 696077, 635950, 676218, 518739, 500913, 511085, 587720, 675847, 666576, 693926, 752802, 639479, 555714, 498514, 540963, 606913, 719475, 750116, 688791]
$$ [...]
##END NTUPLES=NMR SPECTRUM
##END=
