##TITLE=Analysis number 328652
Compound Code ac 35941
Project Code adrs
Chemist Name cuschem
##JCAMPDX= 6.0         $$ Bruker NMR JCAMP-DX V2.0
##DATA TYPE= NMR SPECTRUM
##DATA CLASS= NTUPLES
##ORIGIN= Bruker BioSpin GmbH
##OWNER= nmr
$$ XWIN-NMR		Version 3.5
$$ Tue Jun 26 08:47:43 2007 GMT Daylight Time (UT+1h)  MAYBRIDGE\nmr@NMR_250MHZ
##.OBSERVE FREQUENCY= 250.131544655141
##.OBSERVE NUCLEUS= ^1H
##.ACQUISITION MODE= SIMULTANEOUS (DQD)
##.ACQUISITION SCHEME= undefined
##.AVERAGES= 16
##.DIGITISER RES= 18
##SPECTROMETER/DATA SYSTEM= dpx250
##.PULSE SEQUENCE= zg30
##.SOLVENT NAME= DMSO
##.SHIFT REFERENCE= (INTERNAL, DMSO, 0, 16.5086)
##AUDIT TRAIL= $$ (NUMBER, WHEN, WHO, WHERE, WHAT)
$$ ##TITLE= Audit trail, XWIN-NMR		Version 3.5
$$ ##JCAMPDX= 5.01
$$ ##ORIGIN= Bruker BioSpin GmbH
$$ ##OWNER= nmr
$$ C:\u/data/dgb/nmr/ADRS/1820/pdata/1/auditp.txt
$$ ##AUDIT TRAIL=  $$ (NUMBER, WHEN, WHO, WHERE, WHAT)
(   1,<2007-06-26 08:47:12.25 +100>,<MAYBRIDGE\nmr>,<NMR_250MHZ>,
      <created by zg, POWCHK disabled, PULCHK disabled
       configuration hash MD5:
       76 6E 9A 78 1E 09 19 81 EC 84 63 8F B0 6A 59 2D
       data hash MD5: 64K
       AC F5 F6 43 AC 97 66 E6 31 52 EB 3A A8 A2 0A D5>)
(   2,<2007-06-26 08:47:31.25 +100>,<MAYBRIDGE\nmr>,<NMR_250MHZ>,
      <Start of raw data processing
       ef LB = 0.3 FT_mod = 6 PKNL = 1 SI = 32K 
       data hash MD5: 32K
       67 89 E9 0F CA 9C A2 45 60 59 7A 9C C0 DE D3 A5>)
(   3,<2007-06-26 08:47:33.50 +100>,<MAYBRIDGE\nmr>,<NMR_250MHZ>,
      <apk 
       data hash MD5: 32K
       36 3C 56 44 50 46 E7 4A 13 7F 03 21 32 DF ED FA>)
(   4,<2007-06-26 08:47:34.60 +100>,<MAYBRIDGE\nmr>,<NMR_250MHZ>,
      <abs ABSG = 5 
       data hash MD5: 32K
       09 FE 5B 30 4F DC 6E 6C 29 53 21 7B B0 03 4A 25>)
$$ ##END=
$$ 
$$ hash MD5
$$ A7 7E A9 6E 92 66 F3 7D DD 88 A5 14 30 2E A5 4E
##$RELAX= 
##$RELAX= 
##$RELAX= 
##$RELAX= 
##$RELAX= 
##$RELAX= 
##$RELAX= 
$$ Bruker specific parameters
$$ --------------------------
##$DU= <C:\u>
##$EXPNO= 1820
##$NAME= <ADRS>
##$PROCNO= 1
##$TYPE= <nmr>
##$USER= <dgb>
##$AMP= (0..31)
100 100 100 100 100 100 100 100 100 100 100 100 100 100 100 100 100 100 
100 100 100 100 100 100 100 100 100 100 100 100 100 100 
##$AQSEQ= 0
##$AQ_mod= 3
##$AUNM= <au_zg>
##$AUTOPOS= <1 >
##$BF1= 250.13
##$BF2= 250.13
##$BF3= 250.13
##$BF4= 250.13
##$BF5= 500.13
##$BF6= 500.13
##$BF7= 500.13
##$BF8= 500.13
##$BYTORDA= 1
##$CFDGTYP= 0
##$CFRGTYP= 5
##$CHEMSTR= <none>
##$CNST= (0..31)
1 1 145 1 1 1 1 1 1 1 1 1 1 1 1 1 1 1 1 1 1 1 1 1 1 1 1 1 1 1 1 1 
##$CPDPRG= <>
##$CPDPRG1= <>
##$CPDPRG2= <>
##$CPDPRG3= <>
##$CPDPRG4= <mlev>
##$CPDPRG5= <mlev>
##$CPDPRG6= <mlev>
##$CPDPRG7= <mlev>
##$CPDPRG8= <mlev>
##$CPDPRGB= <>
##$CPDPRGT= <>
##$D= (0..31)
0 1 0 0 0 0 0 0 0 0.06 0 0 0 0 0 0 0.0002 0 0 0 0 0 0 0 0 0 0 0 0 0 0 
0 
##$DATE= 1182844031
##$DBL= (0..7)
120 120 120 120 120 120 120 120 
##$DBP= (0..7)
150 150 150 150 150 150 150 150 
##$DBP07= 0
##$DBPNAM0= <>
##$DBPNAM1= <>
##$DBPNAM2= <>
$$ [...]
##$SUBNAM7= <"">
##$SUBNAM8= <"">
##$SUBNAM9= <"">
##$SW= 20.6930455092707
##$SWIBOX= (0..15)
0 0 3 0 0 0 0 0 0 0 0 0 0 0 0 0 
##$SW_h= 5175.983436853
##$TD= 65536
##$TD0= 1
##$TE= 295.16
##$TE2= 300
##$TE3= 300
##$TEG= 300
##$TL= (0..7)
0 120 120 120 120 120 120 120 
##$TP= (0..7)
150 150 150 150 150 150 150 150 
##$TP07= 0
##$TPNAME0= <>
##$TPNAME1= <>
##$TPNAME2= <>
##$TPNAME3= <>
##$TPNAME4= <>
##$TPNAME5= <>
##$TPNAME6= <>
##$TPNAME7= <>
##$TPOAL= (0..7)
0.5 0.5 0.5 0.5 0.5 0.5 0.5 0.5 
##$TPOFFS= (0..7)
0 0 0 0 0 0 0 0 
##$TUNHIN= 0
##$TUNHOUT= 0
##$TUNXOUT= 0
##$USERA1= <user>
##$USERA2= <user>
##$USERA3= <user>
##$USERA4= <user>
##$USERA5= <user>
##$V9= 5
##$VALIST= <valist>
##$VCLIST= <CCCCCCCCCCCCCCC>
##$VD= 0
##$VDLIST= <DDDDDDDDDDDDDDD>
##$VPLIST= <PPPPPPPPPPPPPPP>
##$VTLIST= <TTTTTTTTTTTTTTT>
##$WBST= 1024
##$WBSW= 4
##$XGAIN= (0..3)
0 0 0 0 
##$XL= 0
##$YL= 0
##$YMAX_a= 364680
##$YMIN_a= -223739
##$ZGOPTNS= <>
##$ZL1= 120
##$ZL2= 120
##$ZL3= 120
##$ZL4= 120
##$ABSF1= 16.50861
##$ABSF2= -4.184563
##$ABSG= 5
##$ABSL= 3
##$ALPHA= 0
##$AQORDER= 0
##$ASSFAC= 0
##$ASSFACI= 0
##$ASSFACX= 0
##$ASSWID= 0
##$AUNMP= <proc_1d>
##$AZFE= 0.1
##$AZFW= 0.1
##$BCFW= 0
##$BC_mod= 0
##$BYTORDP= 0
##$COROFFS= 0
##$CY= 12.5
##$DATMOD= 1
##$DC= 0
##$DFILT= <>
##$DTYPP= 0
##$F1P= 14.0000005364418
##$F2P= -0.99999901652339
##$FCOR= 0.5
##$FTSIZE= 32768
##$FT_mod= 6
##$GAMMA= 0
##$GB= 0
##$INTBC= 1
##$INTSCL= 1
##$ISEN= 128
##$LB= 0.3
##$LEV0= 0
##$LPBIN= 0
##$MAXI= 10000
##$MC2= 0
##$MEAN= 0
##$ME_mod= 0
##$MI= 0
##$NCOEF= 0
##$NC_proc= -6
##$NLEV= 6
##$NOISF1= 0
##$NOISF2= 0
##$NSP= 0
##$NTH_PI= 0
##$NZP= 0
##$OFFSET= 16.50861
##$PC= 1
##$PHC0= -62.77706
##$PHC1= 12.56521
##$PH_mod= 1
##$PKNL= yes
##$PPARMOD= 0
##$PSCAL= 4
##$PSIGN= 0
##$REVERSE= no
##$SF= 250.130003347403
##$SI= 32768
##$SIGF1= 0
##$SIGF2= 0
##$SINO= 400
##$SIOLD= 32768
##$SREGLST= <1H.DMSO>
##$SSB= 0
##$STSI= 32768
##$STSR= 0
##$SW_p= 5175.98343685301
##$SYMM= 0
##$S_DEV= 0
##$TDeff= 65536
##$TDoff= 0
##$TI= <Analysis number 999999
Compound Code 99
Book Reference 9
Project Code 9>
##$TILT= no
##$TM1= 0
##$TM2= 0
##$TOPLEV= 0
##$USERP1= <user>
##$USERP2= <user>
##$USERP3= <user>
##$USERP4= <user>
##$USERP5= <user>
##$WDW= 1
##$XDIM= 32768
##$YMAX_p= 515286208
##$YMIN_p= -1682311
$$ End of Bruker specific parameters
$$ ---------------------------------
##NTUPLES= NMR SPECTRUM
##VAR_NAME=  FREQUENCY,     SPECTRUM/REAL,   SPECTRUM/IMAG
##SYMBOL=    X,             R,               I
##VAR_TYPE=  INDEPENDENT,   DEPENDENT,       DEPENDENT
##VAR_FORM=  AFFN,          ASDF,            ASDF
##VAR_DIM=   32768,         32768,           32768
##UNITS=     HZ,            ARBITRARY UNITS, ARBITRARY UNITS
##FACTOR=    0.157963299565203, 1,           1
##FIRST=     4129.29861746342, 0,            0
##LAST=      -1046.68481938959, 0,           0
##MIN=       -1046.68481938959, -1682311,    0
##MAX=       4129.29861746342, 515286208,    0
$$ Real data points
##PAGE= N=1
##DATA TABLE= (X++(R..R)), XYDATA
$$ [...]
$$ plain form
15632 -405801 -538076 -547170 -401544 -415030 -445766 -176887 -196954 -494343 -469015 -259063 -81796
15621 -81796 6866 -19567 -158717 -227819 -378492 -317133 -330508 -477041 -436289 -198949 -203606
15610 -203606 -313909 -297360 -163768 -158059 -15074 -139230 -187256 -176748 -252254 -335830 -279960
15599 -279960 -97560 35670 178744 3350 -106192 68272 119933 307167 509386 196327
15589 196327 -1572 -73863 -261654 -174181 81666 -29167 -79846 35723 -107650 -132784
15579 -132784 29081 23539 -215995 -142619 3208 318890 47199 -248770 -338430 -255601
15569 -255601 -353661 -589376 -576993 -333924 -175619 -153493 -177386 -276932 -311642 -51930 -123678
15558 -123678 -158449 -241552 -308555 -324590 -237149 -148410 22217 176921 142505 127467 146976
$$ packed form
15632d05801j32275r094J45626j3486l0736K68879k0067k97389K5328K09952J77267
15621h1796Q8662k6433j39150o9102j50673O1359j3375j46533M0752K37340m657
15610b03606j10303J6549J33592N709J42985j24156m8026J0508p5506q3576N5870
15599b79960J82400J33230J43074j75394j09542J74464N1661J87234K02219l13059
15589A96327j97899p2291j87791Q7473K55847j10833n0679J15569j43373k5134
15579a32784J61865n542k39534P3376J45827L15682k71691k95969q9660Q2829
15569b55601r8060k35715J2383K43069J58305K2126k3893r9546l4710K59712p1748
15558a23678l4771q3103o7003j6035Q7441Q8739J70627J54704l4416j5038J9509
$$ plain form
15547 146976 263743 78714 -75938 67273 -17000 -119186 32941 150281 25948 -185642
15537 -185642 -290240 -157853 -176539 -150036 -200846 -78891 -59794 33612 203898 169619 105430
15526 105430 -7148 -85132 113200 72777 -54942 -45268 -33782 -78728 -36935 -140505 -236271
15515 -236271 -188201 -105212 -126521 -151199 -101329 -87169 50294 -143575 -181579 -59313 -123284
15504 -123284 105618 175899 -219701 -381968 -561385 -534964 -540232 -553208 -432371 -421866 -375442
15493 -375442 -258975 -338106 -403263 -501761 -498029 -378395 -380392 -557341 -521104 -379161 -324353
15482 -324353 -482584 -459204 -292961 -420078 -537114 -603836 -467789 -347595 -515762 -534879
15472 -534879 -453920 -340068 -197443 -213803 -253717 -357219 -409214 -278864 -267905 -256989 -369111
$$ packed form
15547A46976J16767j85029j54652J43211q4273j02186J52127J17340j24333k11590
15537a85642j04598J32387j8686K6503n0810J21955J9097R3406J70286l4279o4189
15526A05430j12578p7984J98332m0423j27719R674J1486m4946M1793j03570r5766
15515b36271M8070Q2989k1309k4678M9870J4160J37463j93869l8004J22266o3971
15504a23284K28902P0281l95600j62267j79417K6421n268j2976J20837J0505M6424
15493c75442J16467p9131o5157r8498L732J19634j997j76949L6237J41943N4808
15482c24353j58231K3380J66243j27117j17036o6722J36047J20194j68167j9117
15472e34879Q0959J13852J42625j6360l9914j03502n1995J30350J0959J0916j12122
$$ plain form
15461 -369111 -309611 -145979 -138778 -325180 -359286 -249713 -204655 -119203 -245206 -326272 -361257
15450 -361257 -254648 -309926 -315916 -268792 -349488 -258417 -35526 -108788 -205029 -513523 -541500
15439 -541500 -491778 -494974 -271448 -80865 -65637 90732 351989 252363 -64999 -249788
15429 -249788 -136293 -69217 -218027 -147532 120529 203666 35960 -61232 -38939 -248876
15419 -248876 -521781 -605132 -523119 -493696 -372374 -334168 -302851 -280066 -508493 -442730 -401191
15408 -401191 -154162 69693 21164 42543 162725 44182 22485 34095 -33487 -127022 6399
15397 6399 -134632 -395533 -519456 -475474 -478222 -442526 -125254 -84641 -88000 94116 -172245
15386 -172245 -410343 -377264 -167775 33004 -100140 -280868 -239573 -144517 -167190 -142872
$$ packed form
15461c69111N9500J63632P201j86402l4106J09573M5058Q5452j26003q1066l4985
15450c61257J06609n5278n990M7124q0696R1071K22891p3262r6241l08494k7977
15439e41500M9722l196K23526J90583J5228J56369K61257r9626l17362j84789
15429b49788J13495O7076j48810P0495K68061Q3137j67706r7192K2293k09937
15419b48876k72905q3351Q2013K9423J21322L8206L1317K2785k28427O5763M1539
15408d01191K47029K23855m8529K1379J20182j18543k1697J1610o7582r3535J33421
15397F399j41031k60901j23923M3982k748L5696L17272M0613l359J82116k66361
15386a72245k38098L3079K09489K00779j33144j80728M1295R5056k2673K4318
$$ plain form
15376 -142872 -171377 -304943 -297151 -210629 -76137 34261 350713 323858 327247 225114 63532
15365 63532 93602 117267 -73915 -93290 -241713 -139387 2988 193457 138565 38842 10239
15354 10239 164346 157574 98383 -1470 -217505 -91188 -46721 139839 174492 69968 -67451
15343 -67451 121595 237932 157132 230942 307039 331679 111010 -158063 -141539 54696 54845
15332 54845 23626 148423 262171 2914 43358 115137 124234 -229927 -472738 -326443 -30312
15321 -30312 30134 101954 141015 159305 232027 45705 -209144 -296997 -372229 -385273 -476065
15310 -476065 -239317 169777 157334 -75821 32332 163910 324544 395381 87811 -360575
15300 -360575 -655173 -694818 -639592 -418777 -232799 -206740 -189460 -151349 -34604 12287 40382
$$ packed form
15376a42872k8505j33566P792Q6522J34492J10398L16452k6855L389j02133j61582
15365F3532L0070K3665j91182j9375j48423J02326J42375J90469n4892r9723k8603
15354A0239J54107o772n9191r9853k16035J26317M4467J86560L4653j04524j37419
15343f7451J89046J16337q0800P3810P6097K4640k20669k69073J6524J96235J49
15332E4845l1219J24797J13748k59257M0444P1779R097l54161k42811J46295K96131
15321c0312O0446P1820L9061J8290P2722j86322k54849q7853p5232j3044r0792
15310d76065K36748M09094j2443k33155J08153J31578J60634P0837l07570m48386
15300c60575k94598l9645N5226K20815J85978K6059J7280L8111J16745M6891K8095
$$ plain form
15289 40382 -36407 -69800 -78536 -59352 2617 -413751 -492334 -45799 256174 15425 -61717
15278 -61717 -69462 -4134 -124574 -162950 -230701 -268482 -169040 -231197 -151047 -94340 61092
15267 61092 -63176 -170216 -189033 -262398 -160972 -125393 -98215 56941 364008 470137
15257 470137 174486 -175770 -179403 -181274 -71335 -45394 -138338 -222015 -181674 -180028 -135851
15246 -135851 18779 58091 -113159 -285441 -255295 -297902 -416292 -513226 -629103 -315224
15236 -315224 -209203 -88320 -30501 -147104 -91206 2234 -21897 -1730 11071 -163067 -31669
15225 -31669 25519 47719 -127024 -141742 -117521 -189021 -191512 -163398 -98544 -163605 -34272
15214 -34272 32092 -33287 -133736 -142690 164121 224004 181474 156418 -76326 -89717 -155570
$$ packed form
15289D0382p6789l3393q736J9184O1969m16368p8583M46535L01973k40749p7142
15278f1717p745O5328j20440l8376o7751l7781R9442o2157Q0150N6707J55432
15267F1092j24268j07040j8817p3365J01426L5579K7178J55156L07067J06129
15257D70137k95651l50256l633j871J09939K5941r2944q3677M0341J646M4177
15246a35851J54630L9312j71250j72282L0146m2607j18390r6934j15877L13879
15236c15224J06021J20883N7819j16603N5898R3440k4131K0167J2801j74138J31398
15225c1669N7188K2200j74743j4718K4221p1500k491K8114O4854o5061J29333
15214c4272O6364o5379j00449q954L06811N9883m2530k5056k32744j3391o5853
$$ plain form
15203 -155570 -191337 -54625 -48377 10814 -32588 -34387 -141906 -137221 -10642 333260 386042
15192 386042 202540 143339 -4999 -125227 -35205 -61168 -77039 -266885 -363311 -359812 -388163
15181 -388163 -336265 -58803 114628 275508 146476 89725 121571 196618 217643 456345
15171 456345 478521 451218 32071 -221048 -233148 -192793 -166815 8153 102561 -10846 -261154
15160 -261154 -249091 -98292 178541 394110 350820 353674 20139 -191546 -222452 -157092 120281
15149 120281 346339 416256 391470 372885 278275 52847 -202036 -124446 -273249 -173045
15139 -173045 -84327 -13579 -250671 -248729 -180195 -205643 -77238 -92220 -76420 7074 100334
15128 100334 20806 -64306 175654 307237 187954 212161 44582 -254306 -351361 -274431
$$ packed form
15203a55570l5767J36712O248N9191m3402j799j07519M685J26579L43902N2782
15192C86042j83502n9201j48338j20228R0022k5963j5871j89846r6426L499k8351
15181c88163N1898K77462J73431J60880j29032n6751L1846P5047K1025K38702
15171D56345K2176k7303m19147k53119j2100M0355K5978J74968R4408j13407k50308
15160b61154J2063J50799K76833K15569m3290K854l33535k11685l0906O5360K77373
15149A20281K26058O9917k4786j8585r4610k25428k54883P7590j48803J00204
15139a73045Q8718P0748k37092J942O8534k5448J28405j4982J5800Q3494R3260
15128A00334p9528q5112K39960J31583j19283K4207j67579k98888r7055P6930
$$ plain form
15118 -274431 76424 119526 175236 51753 -32764 154024 162927 21041 -77274 89285 154314
15107 154314 372755 356435 378512 38293 -41855 165810 163833 24008 -291141 -305836 -145796
15096 -145796 74782 9717 -259557 -198460 -94895 13096 51078 -91469 -267827 -326359
15086 -326359 -248185 -216278 -354498 -457969 -254835 -147494 -226293 -329937 -217277 -194221
15076 -194221 -386578 -402547 -311490 -237703 -305630 -288938 -161983 -251219 -440783 -546239 -412899
15065 -412899 -237802 -348279 -370634 -391784 -381996 -325090 -352481 -167788 -33208 -106289 -344032
15054 -344032 -224500 -423 88844 250716 538025 542545 631849 686331 380983 103798
15044 103798 -14622 -45121 -92626 -208225 -178325 -135893 -154593 -119363 61312 -30996 -4242
$$ packed form
15118b74431L50855M3102N5710j23483q4517J86788Q903j41886r8315J66559O5029
15107A54314K18441j6320K2077l40219q0148K07665j977j39825l15149j4695J60040
15096a45796K20578o5065k69274O1097J03565J07991L7982j42547j76358n8532
15086c26359P8174L1907j38220j03471K03134J07341p8799j03644J12660K3056
15076a94221j92357j5969R1057P3787o7927J6692J26955q9236j89564j05456J33340
15065d12899J75097j10477k2355k1150R788N6906k7391J84693J34580p3081k37743
15054c44032J19532K24077Q9267J61872K87309M520Q9304N4482l05348k77185
15044A03798j18420l0499m7505j15599K9900M2432j8700L5230J80675r2308K6754
$$ plain form
15033 -4242 -80576 -317511 -374271 -219900 -286565 -258090 8587 -86936 -213763 -157769 254436
15022 254436 195759 -13738 -74221 134186 207942 -33135 -49685 -82355 -26737 102015 12169
15011 12169 -189419 -217156 -113617 -124718 -177057 -429309 -240766 44826 127401 -121858
15001 -121858 -337668 -404726 -411750 -418533 -349338 -259775 -46404 -20282 57869 18907 178525
14990 178525 279071 -377 -349547 -279266 -200225 -35415 -54886 -71998 -81531 -307129 -421526
14979 -421526 -517748 -542274 -433636 -258257 -295645 -251625 -345772 -194319 45848 41035 167113
14968 167113 147459 70149 115574 130510 121484 238982 336769 196625 -40397 -256198 -431767
14957 -431767 -245995 -146795 -350287 -677676 -529223 -499009 -321009 -175827 109915 219128
$$ packed form
15033d242p6334k36935n6760J54371o6665K8475K66677r5523j26827N5994M12205
15022B54436n8677k09497o0483K08407P3756k41077j6550l2670N5618J28752q9846
15011A2169k01588k7737J03539j1101n2339k52252J88543K85592Q2575k49259
15001a21858k15810o7058p024o783O9195Q9563K13371K6122P8151l8962J59618
14990A78525J00546k79448l49170P0281P9041J64810j9471j7112r533k25598j14397
14979d21526r6222k4526J08638J75379l7388M4020r4147J51453K40167m813J26078
14968A67113j9654p7310M5425J4936r026J17498R7787j40144k37022k15801j75569
14957d31767J85772R9200k03492l27389J48453L0214J78000J45182K85742J09213
$$ plain form
14947 219128 13193 -358533 -408282 -371335 -265322 -124803 -71703 -66995 -252936 -451524
14937 -451524 -459748 -242469 -410174 -439921 72124 272514 315421 254085 43157 -4747 2204
14926 2204 -6332 36824 80768 -131484 -186634 -112076 -213315 -166255 -46581 -78715 -305606
14915 -305606 -408672 -385434 -118569 32901 75040 2534 -164714 -153596 -73220 -121794 -23023
14904 -23023 59500 -140102 -263042 -126679 -84908 -220643 -184441 -402567 -412087 -196252 -43043
14893 -43043 22479 78932 -66387 -366286 -294191 -298984 -338518 -273150 -153337 101587 61588
14882 61588 -37236 -56998 -336715 -425111 -204850 -151656 -44079 87177 -16733 -219038
14872 -219038 -361060 -354241 -306118 -315307 -300801 -159624 -233551 -472125 -493576 -268943 -134254
$$ packed form
14947B19128k05935l71726m9749L6947J06013J40519N3100M708j85941j98588
14937d51524q224K17279j67705k9747N12045K00390M2907o1336k10928m7904O951
14926B204q536M3156M3944k12252n5150P4558j01239M7060J19674l2134k26891
14915c05606j03066K3238K66865J51470M2139p2506j67248J1118Q0376m8574R8771
14904b3023Q2523j99602j22940J36363M1771j35735L6202k18126r520K15835J53209
14893d3043O5522N6453j45319k99899P2095m793l9534O5368J19813K54924l9999
14882F1588r8824j9762k79717q8396K20261N3194J07577J31256j03910k02305
14872b19038j42022O819M8123r189J4506J41177p3927k38574k1451K24633J34689
$$ plain form
14861 -134254 -155300 -297938 -403753 -218910 -289367 -390481 -319847 -358074 -106598 80696
14851 80696 42633 -44386 17544 99798 209471 32556 -76315 64850 -61926 -276952
14841 -276952 -190707 -46789 107751 297064 413740 303299 490353 692944 502970 295404
14831 295404 139064 156889 -38603 -69202 -346711 -469112 -476939 -469208 -497880 -608952 -680209
14820 -680209 -666524 -417131 -220789 -21194 157 -100878 73131 321658 170855 -120433
14810 -120433 54007 141840 33813 92632 98012 -70372 117722 332285 361195 463755
14800 463755 290930 -35324 -83424 -111083 93494 110356 76362 191736 182636 -6527 -302391
14789 -302391 -324397 -344804 -228980 176616 222786 68324 -41515 -111795 -95755 -229188
$$ packed form
14861a34254k1046j42638j05815J84843p0457j01114P0634l8227K51476J87294
14851H0696l8063q7019O1930Q2254J09673j76915j08871J41165j26776k15026
14841b76952Q6245J43918J54540J89313J16676j10441J87054K02591j89974k07566
14831B95404j56340J7825j95492l0599k77509j22401p827P731k8672j11072p1257
14820f80209J3685K49393J96342J99595K1351j01035J74009K48527j50803k91288
14810a20433J74440Q7833j08027N8819N380j68384J88094K14563K8910J02560
14800D63755j72825l26254m8100k7659K04577J6862l3994J15374r100j89163k95864
14789c02391k2006k0407J15824M05596M6170j54462j09839p0280J6040j33433
$$ plain form
14779 -229188 -397716 -201322 206893 179148 59308 134173 119925 6754 -46436 33266
14769 33266 -118168 -417094 -196753 47948 344327 415757 218777 114519 -32941 64007
14759 64007 124235 221557 313495 122436 179904 -13151 -233481 -172771 23528 71400 66051
14748 66051 78292 -13643 -71897 56487 100928 167782 279836 120117 -40943 -478501 -389565
14737 -389565 -109536 -83763 205511 285462 152239 46244 -214812 -466233 -445865 -411862
14727 -411862 -203262 -79127 -167332 -106586 -16839 -15839 -470052 -307708 -297646 -490690 -460804
14716 -460804 -355124 -255266 -291770 -200917 113287 384612 139078 -96011 -238659 -56643
14706 -56643 -275825 -390954 -187865 8242 98494 -38945 -53873 -25112 -19509 77862 101023
$$ packed form
14779b29188j68528J96394M08215k7745j19840P4865j4248j13171n3190P9702
14769C3266j51434k98926K20341K44701K96379P1430j96980j04258j47460R6948
14759F4007O0228R7322R1938j91059N7468j93055k20330O0710J96299M7872n349
14748F6051J2241r1935n8254J28384M4441O6854J12054j59719j61060m37558Q8936
14737c89565K80029K5773K89274P9951j33223j05995k61056k51421K0368L4003
14727d11862K08600J24135q8205O0746Q9747J000m54213J62344J0062j93044K9886
14716d60804J05680R9858l6504R0853L14204K71325k45534k35089j42648J82016
14706e6643k19182j15129K03089J96107R0252j37439j4928K8761N603R7371K3161
$$ plain form
14695 101023 -141677 -188725 -97569 157494 120885 -2239 -189915 -454718 -337410 -187816
14685 -187816 -288911 -388994 -54763 130341 -89674 -386016 -338972 -243455 52175 137363
14675 137363 -80133 -191906 -16693 54001 193509 222875 257580 90907 -84414 58959
14665 58959 169719 -79770 -207756 -210388 -90973 113482 90106 62184 20889 116875 34647
14654 34647 161969 412074 281197 17950 -29434 116890 162705 162259 -215302 -55913 43432
14643 43432 100049 -125823 -99460 -22403 -116891 -50581 -73697 -70633 -116821 -193560 -157384 52884
14631 52884 -96959 -208382 29350 99780 -130013 -225186 -328069 -277914 -250736 -241751 -156786
14620 -156786 -172997 -118579 -151780 -106743 -101887 54002 189208 206350 15529 -208446 -510700
$$ packed form
14695A01023k42700m7048R1156K55063l6609j23124j87676k64803J17308J49594
14685a87816j01095j00083L34231J85104k20015k96342M7044R5517K95630Q5188
14675A37363k17496j11773J75213P0694J39508K9366L4705j66673j75321J43373
14665E8959J10760k49489j27986k632J19415K04455k3376k7922m1295R5986q2228
14654C4647J27322K50105j30877k63247m7384J46324M5815m46l77561J59389R9345
14643D3432N6617k25872K6363P7057r4488O6310k3116L064m6188p6739L6176K10268
14631E2884j49843j11423K37732P0430k29793r5173j02883N0155K7178Q985Q4965
14620a56786j6211N4418l3201M5037M856J55889J35206J7142j90821k23975l02254
$$ plain form
14609 -510700 -528434 -323514 -165635 -51532 127867 43061 -113416 -130943 -139955 -16878
14599 -16878 83909 62530 104274 -18639 -148208 -165521 -119239 224107 290977 -148704 -292110
14588 -292110 -240614 -266169 -367093 -384302 -180850 -254620 -242737 -129125 11638 -149288
14578 -149288 -128382 -158221 -118900 268210 31482 -350321 -250632 -343850 -180688 17843
14568 17843 183579 93941 26323 -106224 -367874 -454057 -230834 187007 259529 175241 -19166
14557 -19166 -208711 -65251 -30946 -213678 -253619 -285546 -177010 -166352 -331134 -322828 -205799
14546 -205799 -67082 -18182 -43639 -66918 -39177 80329 260895 52815 -153702 -469811
14536 -469811 -594194 -389829 -142269 -137180 -189256 -116031 -67868 61222 86618 -32117 629
$$ packed form
14609e10700j7734K04920J57879J14103J79399q4806j56477j7527r012J23077
14599a6878J00787k1379M1744j22913j29569j7313M6282L43346O6870m39681j43406
14588b92110N1496k5555j00924j7209K03452p3770J1883J13612J40763j60926
14578a49288K0906k9839L9321L87110k36728l81803R9689r3218J63162J98531
14568A7843J65736q9638o7618j32547k61650q6183K23223M17841P2522q4288j94407
14557a9166j89545J43460L4305j82732l9941l1927J08536J0658j64782Q306J17029
14546b05799J38717M8900k5457k3279K7741J19506J80566k08080k06517l16109
14536d69811j24383K04365K47560N089n2076P3225M8163J29090K5396j18735L2746
$$ plain form
14525 629 83614 -134233 -419343 -285636 -92487 -217171 -271521 -197659 -31189 79701 114383
14514 114383 -150125 -167875 -316854 -404050 -275941 -61153 187205 129448 196279 18896
14504 18896 8970 -43838 -191506 -232479 -110406 87997 286719 435820 502725 390811 355858
14493 355858 408974 556620 569060 396343 359618 96867 -255701 -302738 -196570 -154773
14483 -154773 -4513 54595 -41325 -91569 -31794 125462 236412 189856 56358 -217146
14473 -217146 -201018 -55551 -234776 -291318 36961 35256 -104983 -154961 72167 44344 -48898
14462 -48898 -153323 -334658 -160415 2003 88305 100992 38377 148490 225331 254582 156914
14451 156914 -205547 -285833 -273968 -166625 118718 66894 226547 240637 199936 -57498
$$ packed form
14525F29Q2985k17847k85110J33707J93149j24684n4350P3862J66470J10890L4682
14514A14383k64508j7750j48979q7196J28109K14788K48358n7757O6831j77383
14504A8896r926n2808j47668m0973J22073J98403J98722J49101O6905j11914l4953
14493C55858N3116J47646J2440j72717l6725k62751l52568m7037J06168M1797
14483a54773J50260N9108r5920n0244N9775J57256J10950m6556j33498k73504
14473b17146J6128J45467j79225n6542L28279j705j40239m9978K27128k7823r3242
14462d8898j04425j81335J74243J62418Q6302J2687o2615J10113P6841K9251r7668
14451A56914l62461q0286J1865J07343K85343n1824J59653J4090m0701k57434
$$ plain form
14441 -57498 -116804 293 108569 226462 311036 367819 134203 40968 -73178 56991
14431 56991 105390 146889 -5764 -6936 274710 240687 101626 51661 -17768 -30524 60772
14420 60772 75452 -77535 -223779 -539347 -377568 -69353 -79552 -88884 -81333 44989 208177
14409 208177 198025 69575 -71300 -125457 -190431 -208646 -164290 -298821 -246870 -215774 -85465
14398 -85465 -70722 -229838 -323974 -234868 -81219 69658 -51058 -510944 -871869 -557758
14388 -557758 -208023 -143230 -245018 -368068 -267428 -243300 -380119 -584055 -476055 -473133
14378 -473133 -282221 -239072 -448960 -688935 -418515 -112872 -174025 -335209 -424521 -190499
14368 -190499 -9246 5961 -77832 987 -52903 -162056 39442 14557 -182525 -225388 -16519
$$ packed form
14441e7498n9306J17097J08276J17893Q4574N6783k33616r3235j14146J30169
14431E6991M8399M1499j52653j172K81646l4023j39061m9965o9429j2756R1296
14420F0772J4680j52987j46244l15568J61779L08215j0199r332P551J26322J63188
14409B08177j0152j28450j40875n4157o4974j8215M4356j34531N1951L1096J30309
14398h5465J4743j59116r4136Q9106J53649J50877j20716m59886l60925L14111
14388e57758L49735O4793j01788j23050J00640K4128j36819k03936J08000K922
14378d73133J90912M3149k09888k39975K70420L05643o1153j61184q9312K34022
14368a90499J81253J5207q3793P8819n3890j09153K01498k4885j97082m2863K08869
$$ plain form
14357 -16519 307430 465968 92814 -204082 -476330 -488460 -495295 -369997 -420465 -348011 -123757
14346 -123757 113244 207917 85777 -33367 -17866 -152074 -250427 -107715 49753 250866
14336 250866 -107783 -218110 -215960 -63609 185343 138286 -93980 -48670 42262 -58466
14326 -58466 -42768 -146696 -241638 -326623 -405639 -629032 -692772 -825696 -769683 -467556 -283367
14315 -283367 -338398 -294877 -160401 99526 123211 -12946 -32256 175521 377920 267559
14305 267559 148774 -35641 -160344 -268634 -240812 83493 316015 128876 134219 218807
14295 218807 209380 20305 -59668 -256199 -416052 -477466 -409756 -162883 -42999 -120837 -319052
14284 -319052 -150309 86792 -35298 -43158 -201925 -309522 -315592 -184118 2946 61115
$$ packed form
14357a6519L23949J58538l73154k96896k72248j2130o835J25298n0468P2454K24254
14346a23757K37001R4673j22140j19144J5501j34208r8353J42712J57468K01113
14336B50866l58649j10327K150J52351K48952m7057k32266M5310R0932j00728
14326e8466J5698j03928r4942q4985p9016k23393o3740j32924N6013L02127J84189
14315b83367n5031M3521J34476K59927K3685j36157j9310K07777K02399j10361
14305B67559j18785j84415j24703j08290K7822L24305K32522j87139N343Q4588
14295B18807r427j89075p9973j96531j59853o1414O7710K46873J19884p7838j98215
14284c19052J68743K37101j22090p860j58767j07597o070J31474J87064N8169
$$ plain form
14274 61115 -20639 -125912 -360463 -308082 -304581 -255298 -350236 -432680 -289616 -111968 -37268
14263 -37268 136865 128212 12574 -148413 -165146 -120797 -93145 -94417 -8894 81763 -144236
14252 -144236 -123392 41488 -32700 -70340 -5343 330905 340521 10437 -186423 -205117 -414890
14241 -414890 -368114 -8620 130194 14918 211132 188813 -95972 -312594 -273042 -81831
14231 -81831 -81523 -53883 18039 173791 27244 -202989 -101760 -25112 -34582 -46775 -161683
14220 -161683 -203021 -34893 -66592 -139374 -342681 -474223 -344077 -215749 -428450 -382753
14210 -382753 -3973 702 -180047 -234529 -123320 109718 169631 7098 -235930 -154891
14200 -154891 75773 260757 63259 -1118 22257 -185368 -260309 -302559 -143084 -53104
$$ packed form
14274F1115q1754j05273k34551N2381L501M9283r4938q2444J43064J77648P4700
14263c7268J74133q653j15638j60987j6733M4349K7652j272Q5523R0657k25999
14252a44236K0844J64880p4188l7640O4997L36248R616l30084j96860j8694k09773
14241d14890M6776L59494J38814j15276J96214k2319k84785k16622L9552J91211
14231h1831L08K7640P1922J55752j46547k30233J01229P6648r470j2193j14908
14220a61683m1338J68128l1699p2782k03307j31542J30146J28328k12701M5697
14210c82753L78780M675j80749n4482J11209K33038N9913j62533k43028Q1039
14200a54891K30664J84984j97498o4377K3375k07625p4941m2250J59475Q9980
$$ plain form
14190 -53104 -32767 201467 245013 154988 78015 71847 230981 780 156086 400753 479369
14179 479369 345007 294974 377989 384863 413538 308814 73518 -135271 -226091 -190036 -270886
14168 -270886 -181518 -210285 -52734 -214044 39234 -6501 -407808 -446577 -189304 -203479
14158 -203479 -237302 -152775 29186 101525 34277 -102063 -69046 12767 -18979 -184237 -319751
14147 -319751 -142256 -4766 -6682 -341314 -413911 -322881 -328565 -496921 -557016 -502178 -400852
14136 -400852 -409075 -459744 -415916 -264291 -142575 -84101 -95109 -138117 57187 231750 305044
14125 305044 258097 159256 77381 146678 90007 -12091 -154526 -196861 -137111 17553 116036
14114 116036 69990 -186145 -90425 193340 249936 223137 94764 123017 75027 85071 159454
$$ packed form
14190e3104K0337K34234M3546r0025p6973o168J59134k30201J55306K44667P8616
14179D79369j34362n0033Q3015O874K8675j04724k35296k08789r0820L6055q0850
14168b70886Q9368k8767J57551j61310K53278m5735m01307l8769K57273j4175
14158b03479l3823Q4527J81961P2339o7248j36340L3017Q1813l1746j65258j35514
14147c19751J77495J37490j916l34632p2597R1030n684j68356o0095N4838J01326
14136d00852q223n0669M3828J51625J21716N8474j1008m3008J95304J74563P3294
14125C05044m6947r8841q1875O9297n6671j02098j42435m2335N9750J54664R8483
14114A16036m6046k56135R5720K83765N6596k6799j28373K8253m7990J0044P4383
$$ plain form
14103 159454 273959 289587 301589 308376 264644 211312 57463 -34703 -223396 -334025 -256439
14092 -256439 -180114 57944 56402 -70212 -146599 -32869 272722 177390 -82941 -243696
14082 -243696 -338672 -406729 -124061 -69725 -78237 15590 137020 265338 359326 283238 205166
14071 205166 282989 97134 -100591 -111410 129183 217444 106798 162381 76902 -93079
14061 -93079 -57727 148233 298558 240034 184903 141910 229343 174326 202029 170636 200092
14050 200092 28052 -23354 -51275 59445 106037 109145 418731 578824 499888 464142 433420
14039 433420 537968 596186 406601 487830 495121 445651 349053 181246 111960 361803 322763
14028 322763 165820 11969 -33624 -108090 -108903 -78713 -6341 -121955 -211455 -149582 -133662
$$ packed form
14103A59454J14505J5628J2002O787m3732n3332j53849r2166j88693j10629P7586
14092b56439P6325K38058j542j26614p6387J13730L05591r5332k60331j60755
14082b43696r4976o8057K82668N4336q512R3827J21430J28318R3988p6088p8072
14071B05166P7823j85855j97725j0819K40593Q8261j10646N5583q5479j69981
14061i3079L5352K05960J50325n8524n5131m2993Q7433n5017K7703l1393K9456
14050B00092j72040n1406k7921J10720M6592L108L09586J60093p8936l5746l0722
14039D33420J04548N8218j89585Q1229P291m9470r6598j67807o9286K49843l9040
14028C22763j56943j53851m5593p4466q13L0190P2372j15614q9500O1873J5920
$$ plain form
14017 -133662 73766 169659 229691 270485 244932 73807 64319 86492 124683 185556 151125
14006 151125 436513 622104 409282 39105 -176245 -415634 -277777 -9327 -60901 -103495
13996 -103495 -113175 114812 246904 27128 -18977 146401 319721 682794 864837 771144
13986 771144 434183 297403 275911 -42396 1634 3220 74749 211758 -48445 145748
13976 145748 126455 132595 50183 -114763 -121230 -80281 16493 57051 75130 121595 -4239
13965 -4239 68749 214077 336174 296898 156472 -27206 83312 89633 124611 166631 167940
13954 167940 99027 126417 26824 -99277 -86361 -125494 -40317 168725 121436 149164 157731
13943 157731 -257381 -261827 -45767 -291245 -202464 20573 -169400 -140870 7960 46906
$$ packed form
14017a33662K07428R5893O0032M0794k5553j71125r488K2173L8191O0873l4431
14006A51125K85388J85591k12822l70177k15350k39389J37857K68450n1574m2594
13996a03495r680K27987J32092k19776m6105J65378J73320L63073J82043r3693
13986G71144l36961j36780k1492l18307M4030J586P1529J37009k60203J94193
13976A45748j9293O140q2412j64946o467M0949R6774M0558J8079M6465j25834
13965d239P2988J45328J22097l9276j40426j83678J10518O321L4978M2020J309
13954A67940o8913K7390r9593j26101J2916l9133Q5177K09042m7289K7728Q567
13943A57731m15112m446K16060k45478Q8781K23037j89973K8530J48830L8946
$$ plain form
13933 46906 -120156 -178464 73721 88273 -38724 -69491 -192855 -183092 54913 126271 -10001
13922 -10001 -184856 7056 137777 111777 144368 320336 331493 317147 306603 30126 -42927
13911 -42927 188863 272339 357041 365522 665146 702831 293088 -145764 -60520 117639 338828
13900 338828 319340 130435 6733 -295820 -453495 -497713 -319196 23861 175893 -31435
13890 -31435 -220170 32980 201276 201970 285043 199159 -33903 -12126 164943 122575 116654
13879 116654 290280 377068 215758 157915 -25984 41115 175277 -13013 -86729 -136979
13869 -136979 -173809 3121 369960 304932 161841 214412 290675 198008 88941 83348 -57407
13858 -57407 -113896 -15567 -20994 51998 328868 289280 238704 302974 111897 250148 358394
$$ packed form
13933D6906j67062n8308K52185J4552j26997l0767j23364R763K38005P1358j36272
13922a0001j74855J91912J30721k6000L2591J75968J1157j4346j0544k76477p3053
13911d2927K31790Q3476Q4702Q481K99624L7685m09743m38852Q5244J78159K21189
13900C38828j9488j88905j23702l02553j57675m4218J78517L43057J52032k07328
13890c1435j88735K53150J68296O94Q3073q5884k33062K1777J77069m2368n921
13879A16654J73626Q6788j61310n7843j83899O7099J34162j88290p3716n0250
13869a36979l6830J76930L66839o5028j43091N2571P6263r2667j09067n593j40755
13858e7407n6489R8329n427P2992K76870l9588n0576O4270j91077J38251J08246
$$ plain form
13847 358394 209271 230400 133980 -283268 -94096 -1327 -29603 233 -35724 200706 344470
13836 344470 305252 -157755 -365357 -301740 -328145 -323507 -367106 -356932 -351727 -177130 -175925
13825 -175925 87233 320060 238840 309027 314433 74590 130269 129265 253016 134985 106027
13814 106027 51323 151936 24655 -155540 -225314 -123709 -88987 29155 110621 181625
13804 181625 -78970 -45405 -2616 -41409 -148061 -261582 -132423 190848 127127 -140290
13794 -140290 -153283 -164932 -298673 -211853 -3053 17950 -133317 -346814 -344138 -212770 -131905
13783 -131905 65464 68519 161690 378567 587773 356350 213426 238179 161357 92049 -37290
13772 -37290 -17808 27986 47775 -138733 -76388 188537 14553 -408589 -414392 16145 21903
$$ packed form
13847C58394j49123K1129r6420m17248J89172R2769k8276K9836l5957K36430J43764
13836C44470l9218m63007k07602O3617k6405M638m3599J0174N205J74597J205
13825a75925K63158K32827q1220P0187N406k39843N5679j004J23751j18031k8958
13814A06027n4704J00613j27281j80195o9774J01605L4722J18142Q1466P1004
13804A81625k60595L3565M2789l8793j06652j13521J29159L23271o3721k67417
13794a40290j2993j1649j33741Q6820K08800K1003j51267k13497K676J31368Q0865
13783a31905J97369L055R3171K16877K09206k31423j42924K4753p6822o9308j29339
13772c7290J9482M5794J9789j86508O2345K64925j73984m23142n803M30537N758
$$ plain form
13761 21903 -86586 55047 263090 331596 157775 73638 119789 -79464 -269979 32193
13751 32193 41736 -139238 -93277 -45913 -46941 184471 257497 206284 -8754 -146834 45736
13740 45736 56140 -14529 33246 100976 98583 22373 265445 208471 -206637 -369902 -339239
13729 -339239 -215457 75988 133592 73240 193764 247617 242139 -86488 -236653 -160492 177623
13718 177623 387485 18218 -272105 -84822 107107 -3527 -128610 -150204 -133487 -253985
13708 -253985 -201222 -208138 -187599 73405 268702 288633 24886 73189 199594 126853 -118098
13697 -118098 -112014 -102820 -154852 -94773 -14656 -43194 23376 325570 290549 66644 164973
13686 164973 208827 136822 50678 97799 -72017 -335582 -307792 -330966 -230626 67572 206698
$$ packed form
13761B1903j08489J41633K08043O8506j73821q4137M6151j99253j90515L02172
13751C2193R543j80974M5961M7364j028K31412P3026n1213k15038j38080J92570
13740D5736J0404p0669M7775O7730k393p6210K43072n6974m15108j63265L0663
13729c39239J23782K91445N7604o0352J20524N3853n478l28627j50165P6161L38115
13718A77623K09862l69267k90323J87283J91929j10634j25083k1594J6717j20498
13708b53985N2763o916K0539K61004J95297J9931k63747M8303J26405p2741k44951
13697a18098O084R194n2032O0079Q0117k8538O6570L02194l5021k23905R8329
13686A64973M3854p2005q6144M7121j69816k63565K7790k3174J00340K98198J39126
$$ plain form
13675 206698 269005 342675 173304 -33904 -127965 27338 -97291 -87352 -19407 -34327 -77911
13664 -77911 -1774 261198 120670 123254 199296 61787 163114 224293 90121 -32690 116636
13653 116636 460075 526590 478314 247457 -25589 -105292 -96392 -234720 -398769 -316026 -182398
13642 -182398 -124153 -245834 -440144 -193953 -180420 -270434 -67801 33247 45756 -89562
13632 -89562 -143082 -142951 23265 110102 329857 647584 626329 459839 151340 -131647 -320936
13621 -320936 -404114 -168650 -102807 18372 -44296 -106557 -133250 -102917 -22501 139613 331480
13610 331480 316802 239056 121443 -22231 21700 168052 67795 150567 271465 325797
13600 325797 359177 373890 502765 489870 372114 104040 -119230 -70469 -32221 206666
$$ packed form
13675B06698O2307P3670j69371k07208r4061J55303j24629R939O7945j4920m3584
13664g7911P6137K62972j40528K584P6042j37509J01327O1179j34172j22811J49326
13653A16636L43439O6515m8276k30857k73046p9703Q900j38328j64049Q2743J33628
13642a82398N8245j21681j94310K46191J3533r0014K02633J01048J2509j35318
13632h9562n3520J31J66216Q6837K19755L17727k1255j66490l08499k82987j89289
13621c20936q3178K35464O5843J21179o2668o2261k6693L0333Q0416J62114J91867
13610C31480j4678p7746j17613j43674M3931J46352j00257Q2772J20898N4332
13600C25797L3380J4713J28875j2895j17756k68074k23270M8761L8248K38887
$$ plain form
13590 206666 346398 93574 -61585 -20344 -76644 -179800 -207344 -243524 -130393 104880
13580 104880 165369 282712 84978 -5626 -50393 142710 263241 51047 11901 -121784
13570 -121784 -262690 -168853 -121651 -359750 -402608 -213221 -201144 -347129 -403876 -373279 -242215
13559 -242215 -99971 90752 83858 262867 486988 304612 -1836 106224 392037 408889
13549 408889 345337 180386 286407 184255 -29893 -126684 -253845 -250106 -138830 -97154
13539 -97154 21738 -166515 -138995 -131416 -79665 134675 170581 106178 193633 387117 460311
13528 460311 610025 447423 197287 35350 33812 111910 227957 -68186 -186461 -98281
13518 -98281 130919 337402 310254 266884 69297 -94528 -313093 -341617 -248256 17422
$$ packed form
13590B06666J39732k52824j55159M1241n6300j03156k7544l6180J13131K35273
13580A04880O0489J17343j97734r0604m4767J93103J20531k12194l9146j33685
13570a21784j40906R3837M7202k38099m2858J89387J2077j45985n6747L0597J31064
13559b42215J42244J90723o894J79009K24121j82376l06448J08060K85813J6852
13549D08889o3552j64951J06021j02152k14148r6791j27161L739J11276M1676
13539i7154J18892j88253K7520P579N1751K14340L5906o4403Q7455J93484P3194
13528D60311J49714j62602k50136j61937j538P8098J16047k96143j18275Q8180
13518i8281K29200K06483k7148m3370j97587j63825k18565k8524R3361K65678
$$ plain form
13508 17422 175285 169684 272614 441707 432037 442866 419678 234949 256873 194889 35437
13497 35437 -280542 -293839 -395051 -450019 -403625 -294086 -188054 -85511 -265363 -135703
13487 -135703 100123 212185 187259 181742 336880 206679 -95323 -147216 125999 241472
13477 241472 184162 103088 221580 209964 59141 -175550 -280078 -120766 33745 -36780
13467 -36780 4939 169477 181268 251715 65402 -72264 -182706 -87265 111004 304136
13457 304136 325747 -30983 -179215 -78438 54659 254606 214581 78858 165866 286858
13447 286858 148848 25751 96026 155507 255922 171737 -23097 -199241 -157808 -93394
13437 -93394 48830 10873 45269 14259 25317 35264 215328 522705 548722 330263 241336
$$ packed form
13508A7422J57863n601J02930J69093r670J0829k3188j84729K1924o1984j59452
13497C5437l15979j3297j01212n4968M6394J09539J06032J02543j79852J29660
13487a35703K35826J12062k4926n517J55138j30201l02002n1893K73215J15473
13477B41472n7310q1074J18492j1616j50823k34691j04528J59312J54511p0525
13467c6780M1719J64538J1791P0447j86313j37666j10442R5441J98269J93132
13457C04136K1611l56730j48232J00777J33097J99947m0025j35723Q7008J20992
13447B86858j38010j23097P0275N9481J00415q4185j94834j76144M1433O4414
13437i3394J42224l7957L4396l1010J1058R947J80064L07377K6017k18459q8927
$$ plain form
13426 241336 268333 44419 -96071 134168 445718 441924 346110 183616 242430 341987 534860
13415 534860 277019 105068 76768 39179 -107340 -98432 31112 389225 297680 174177
13405 174177 231208 327078 460675 331897 196349 76053 104199 24474 -88567 -141406
13395 -141406 170734 337467 162219 -38378 52850 -32662 -128425 -39723 115277 218909
13385 218909 106433 -52337 -220579 -171289 -159175 -124176 -290471 -362508 -327925 19716
13375 19716 -43301 493 -101576 -142388 -73969 110046 334400 269092 319413 309122 261779
13364 261779 179360 173303 211645 204635 192722 330105 292891 118608 128360 43307 -66244
13353 -66244 13083 120021 366624 242382 44294 59911 -86009 84206 49727 -144150
$$ packed form
13426B41336K6997k23914j40490K30239L11550l794r5814j62494N8814R9557J92873
13415E34860k57841j71951k8300l7589j46519Q908J29544L58113r1545j23503
13405A74177N7031R5870J33597j28778j35548j20296K8146p9725j13041n2839
13395a41406L12140J66733j75248k00597R1228q5512r5763Q8702J55000J03632
13385B18909j12476j58770j68242M9290J2114L4999j66295p2037L4583L47641
13375A9716o3017M3794j02069m0812O8419J84015K24354o5308N0321j0291m7343
13364B61779q2419o057L8342p010j1913J37383l7214j74283R752q5053j09551
13353f6244P9327J06938K46603j24242j98088J5617j45920J70215l4479j93877
$$ plain form
13343 -144150 42563 134023 171135 47483 -79342 -109819 32947 192789 80167 32099
13333 32099 109506 56605 -83464 148640 203907 295402 484083 438818 428399 549996 482786
13322 482786 376205 236828 205899 194229 227090 162090 116967 220413 200551 106331 213153
13311 213153 384663 476821 243105 301531 344290 256589 371694 437173 283607 -5008
13301 -5008 -209062 -149173 200919 316428 212044 104883 24576 10602 -741 102258 601408
13290 601408 702742 375216 7353 -190941 -318077 -263906 -268416 -199397 -25859 273434
13280 273434 300393 110066 70047 144981 328317 206659 241706 226164 57287 -30648 63675
13269 63675 308751 321948 59770 347830 394139 318666 120946 108888 -99241 138514
$$ packed form
13343a44150J86713R1460L7112j23652j26825l0477J42766J59842j12622m8068
13333C2099P7407n2901j40069K32104N5267R1495J88681m5265j0419J21597o7210
13322D82786j06581j39377l0929j1670L2861o5000m5123J03446j9862r4220J06822
13311B13153J71510R2158k33716N8426M2759q7701J15105O5479j53566k88615
13301e008k04054N9889L50092J15509j04384j07161q0307j3974j1343J02999M99150
13290F01408J01334l27526l67863j98294j27136N4171m510O9019J73538K99293
13280B73434K6959j90327m0019P4934J83336j21658L5047j5542j68877q7935R4323
13269F3675K45076J3197k62178K88060M6309p5473j97720j2058k08129K37755
$$ plain form
13259 138514 250004 262974 240861 173795 -67499 -18624 107823 142500 347440 663768
13249 663768 719174 794601 720104 362999 139085 54019 44077 91894 -19859 -136028 -38325
13238 -38325 -50194 -191 -55480 -224814 120540 319027 211823 167109 132019 -79554 12819
13227 12819 100219 71535 -158126 -79404 -244429 -245821 319158 432471 148923 177104 230157
13216 230157 385697 216178 135578 285112 146916 -58546 -434568 -425217 -366037 -310028
13206 -310028 -173626 -257980 -76987 226863 289979 278706 152768 -6404 -156153 -206810
13196 -206810 -251013 100427 46231 -31353 123309 496479 652036 530494 481796 293705
13186 293705 269393 590088 468969 55771 24144 3275 -69130 -32295 137178 381513
$$ packed form
13259A38514J11490J2970k2113o7066k41294M8875J26447L4677K04940L16328
13249F63768N5406P5427p4497l57105k23914q5066r942M7817j11753j16169R7703
13238c8325j1869N0003n5289j69334L45354J98487j07204m4714l5090k11573R2373
13227A2819Q7400k8684k29661P8722j65025j392N64979J13313k83548K8181N3053
13216B30157J55540j69519q0600J49534j38196k05462l76022R351N9180N6009
13206c10028J36402q4354J80993L03850O3116j1273j25938j59172j49749n0657
13196b06810m4203L51440n4196p7584J54662L73170J55557j21542m8698j88091
13186B93705k4312L20695j21119m13198l1627k0869p2405L6835J69473K44335
$$ plain form
13176 381513 333193 203003 258907 244952 261672 58209 -45138 35359 149904 110257 52322
13165 52322 148181 194450 -59266 -10938 151349 93830 5501 84881 319449 469745 593375
13154 593375 760263 735719 424853 111963 110149 236138 210101 240059 270902 280899 17409
13143 17409 -137307 -21430 2117 44306 27853 -142657 -59809 186168 246389 219770 40144
13132 40144 140076 132802 264305 309040 240886 299594 157021 27902 90324 212336 43471
13121 43471 49957 66123 127871 417982 495893 383959 456128 341696 206698 343892 670443
13110 670443 480156 309172 86221 -140560 -119319 -84430 -76100 134688 140752 9038 138339
13099 138339 186785 155748 70663 13214 37959 147621 44808 -2184 -45830 169314 309879
$$ packed form
13176C81513m8320j30190N5904j3955J6720k03463j03347Q0497J14545l9647n7935
13165E2322R5859M6269k53716M8328J62287n7519q8329P9380K34568J50296J23630
13154E93375J66888k4544l10866l12890j814J25989k6037K9958L0843R997k63490
13143A7409j54716J15877K3547M2189j6453j70510Q2848K45977O0221k6619j79626
13132D0144R9932p274J31503M4735o8154N8708j42573j29119O2422J22012j68865
13121D3471O486J6166O1748K90111P7911j11934P2169j14432j34998J37194L26551
13110F70443j90287j70984k22951k26781K1241L4889Q330K10788O064j31714J29301
13099A38339M8446l1037q5085n7449K4745J09662j02813m6992m3646K15144J40565
$$ plain form
13088 309879 105037 -263587 -145414 -133635 -26527 197876 311101 348731 344730 584293
13078 584293 620531 506851 820155 1354190 2003205 2462889 2626913 2481070 1911105 1311332
13068 1311332 910883 800235 807328 520781 253411 405696 613938 551104 424722 264178
13058 264178 197021 26159 54838 97451 175494 147217 49028 -4296 189081 457333 258010
13047 258010 196881 447543 281745 261993 304493 257963 50797 128433 484050 557175 631368
13036 631368 737876 992650 1141686 1355380 1794904 2939099 4292825 5960056 7221270
13027 7221270 7150337 6124285 4375990 2955590 1964989 1238018 776989 670240 449493
13018 449493 482624 388601 335821 534967 681893 819287 693760 759705 789782 517009
$$ packed form
13088C09879k04842l68624J18173J1779J07108K24403J13225L7630m001K39563
13078E84293L6238j13680L13304N34035O49015M59684J64024j45843n69965n99773
13068A311332m00449j10648P093k86547k67370J52285K08242o2834j26382j60544
13058B64178o7157j70862K8679M2613P8043k8277r8189n3324J93377K68252j99323
13047B58010o1129K50662j65798j9752M2500m6530k07166P7636L55617P3125P4193
13036F31368J06508K54774J49036K13694M39524J144195J353726J667231J261214
13027G221270p0933j026052j748295j420400r90601p26971m61029j06749k20747
13018D49493L3131r4023n2780J99146J46926J37394j25527O5945L0077k72773
$$ plain form
13008 517009 520214 476586 542603 502975 227572 -41614 -29893 140327 427990 629381 847970
12997 847970 989076 844612 908901 884682 785638 881578 861318 1027873 1245947 1415783
12987 1415783 1739429 2614529 4148747 5960916 7491794 7783341 6860922 5446876 3721976
12978 3721976 2614436 2195284 1730765 1356348 1117131 931788 835196 467126 275551
12969 275551 205279 137519 552451 644241 603365 566829 515284 508092 618380 703969 527399
12958 527399 538054 625974 585232 484650 351006 479072 585358 470658 545036 848796
12948 848796 836342 575750 498336 543928 732026 838765 908023 1197418 1896897 2863513
12938 2863513 3461801 3770534 3612580 2980879 2481930 2056679 1528323 1237639 1165749 841462
$$ packed form
13008E17009L205m3628O6017l9628k75403k69186J1721J70220K87663K01391K18589
12997H47970J41106j44464O4289k4219r9044R5940k0260J66555K18074J69836
12987A415783L23646Q75100J534218J812169J530878K91547r22419j414046j724900
12978C721976j107540m19152m64519l74417k39217j85343r6592l68070j91575
12969B75551p0272o7760M14932R1790m0876l6536n1545p192J10288Q5589j76570
12958E27399J0655Q7920m0742j00582j33644J28066J06286j14700P4378L03760
12948H48796j2454k60592p7414M5592J88098J06739O9258K89395O99479R66616
12938B863513N98288L08733j57954o31701m98949m25251n28356k90684p1890l24287
$$ plain form
12928 841462 719865 817924 838483 936602 1063947 1041385 968941 821155 635108 658631 761092
12917 761092 716626 607439 417144 352455 106068 -42197 161454 272136 476868 567133
12907 567133 600719 411849 559101 677599 561082 680948 705022 630455 786503 768254
12897 768254 746406 773210 549306 633124 984448 936069 850693 1100131 1124159 832976 1023114
12886 1023114 1045728 993237 968222 810353 582255 558090 645354 683378 619249 678621 780363
12875 780363 833077 737970 719016 809416 918163 1164743 1173284 1060482 949268 937684 789814
12864 789814 708069 402822 272595 614566 779131 647411 516086 678146 622819 591800
12854 591800 418968 243400 256328 450770 666165 737302 589291 706901 993062 1184871
$$ packed form
12928H41462j21597R8059K0559R8119J27345k2562p2444j47786j86047K3523J02461
12917G61092m4466j09187j90295o4689k46387j48265K03651J10682K04732R0265
12907E67133L3586j88870J47252J18498j16517J19866K4074p4567J56048j8249
12897G68254k1848K6804k23904Q3818L51324m8379q5376K49438K4028k91183J90138
12886A023114K2614n2491k5015j57869k28098k4165Q7264L8024o4129N9372J01742
12875G80363N2714r5107j8954R0400J08747K46580Q541j12802j11214j1584j47870
12864G89814q1745l05247j30227L41971J64565j31720j31325J62060n5327l1019
12854E91800j72832j75568J2928J94442K15395P1137j48011J17610K86161J91809
$$ plain form
12844 1184871 1158112 837977 1003619 886276 574307 911100 895805 720908 767206 748345
12834 748345 550349 441570 378795 421026 383889 418410 562940 368429 301662 482187
12824 482187 511843 352655 550529 889449 918262 1084123 1048098 762743 603327 607389
12814 607389 463506 211392 456628 768273 680350 465617 408314 385771 212604 156514
12804 156514 543827 663895 794822 860543 642983 358266 245727 339921 448625 641078
12794 641078 714879 630268 723274 758933 653790 554256 558293 486496 424228 448499 561865
12783 561865 524623 497811 505876 363651 438014 506328 898572 999591 768787 720334 754900
12772 754900 744575 709327 411871 309515 333471 539172 755635 836058 964586 795635
$$ packed form
12844A184871k6759l20135J65642j17343l11969L36793j5295j74897M6298j8861
12834G48345j97996j08779o2775M2231l7137L4521J44530j94511o6767J80525
12824D82187K9656j59188J97874L38920K8813J65861l6025k85355j59416M062
12814F07389j43883k52114K45236L11645q7923k14733n7303k2543j73167n6090
12804A56514L87313J20068J30927O5721k17560k84717j12539R4194J08704J92453
12794F41078P3801q4611R3006L5659j05143r9534M037p1797o2268K4271J13366
12783E61865l7242k6812Q065j42225P4363O8314L92244J01019k30804m8453L4566
12772G54900j0325l5248k97456j02356K3956K05701K16463Q0423J28528j68951
$$ plain form
12762 795635 887683 683582 689843 842678 876935 932947 841984 634145 611744 612976 641533
12751 641533 555714 427281 382331 412884 526204 659244 785938 892540 921626 930816 1012712
12740 1012712 861014 751964 531535 585604 816155 1001876 976800 768396 452733 293433
12730 293433 497726 762990 753601 719334 741888 712761 956815 1139419 1055684 933512 1028901
12719 1028901 1033844 913228 801999 865959 938441 978790 1091276 1059791 879403 972308 1132023
12708 1132023 1125839 965995 834838 860234 672149 747659 947514 1013221 1105209 959611
12698 959611 854265 927712 1525581 1669505 1368588 1110253 909459 990659 829904 601281
12688 601281 952624 1027050 975707 931785 970379 1060503 1113796 1009840 972769 1150213 1084195
$$ packed form
12762G95635R2048k04101O261J52835L4257N6012r0963k07839k2401J232K8557
12751F41533q5819j28433m4950L0553J13320J33040J26694J06602K9086R190Q1896
12740A012712j51698j09050k20429N4069K30551J85721k5076k08404l15663j59300
12730B93433K04293K65264r389l4267K2554k9127K44054J82604q3735j22172R5389
12719A028901M943j20616j11229O3960P2482M0349J12486l1485j80388R2905J59715
12708A132023o184j59844j31157K5396j88085P5510J99855O5707R1988j45598
12698I59611j05346P3447N97869J43924l00917k58335k00794Q1200j60755k28623
12688F01281L51343P4426n1343m3922L8594R0124N3293j03956l7071J77444o6018
$$ plain form
12677 1084195 896262 827316 833574 885589 1086662 1061534 755124 811724 963887 883130 651198
12666 651198 634915 641717 534903 774635 1107841 1140124 956854 913635 1042399 1179338
12656 1179338 1248650 1057883 1106250 987905 1011294 1116950 1236639 1145859 976888 893967
12646 893967 699675 749273 932735 943249 804977 923308 940306 716559 855503 1090193
12636 1090193 988077 939614 1282187 1315416 1022468 881385 746045 886143 1011678 985221
12626 985221 963711 970625 1097520 1041090 854844 701246 712689 824535 1040611 1224176
12616 1224176 1020270 848713 740864 990587 954777 830028 909997 1229155 1137054 1066497
12606 1066497 1286601 1441558 1635570 1519254 1473375 1492787 1420439 1179465 1125584 1307399
$$ packed form
12677A084195j87933o8946O258N2015K01073k5128l06410N6600J52163q0757k31932
12666F51198j6283O802j06814K39732L33206L2283j83270m3219J28764J36939
12656A179338O9312j90767M8367j18345K3389J05656J19689r0780j68971q2921
12646H93967j94292M9598J83462J0514j38272J18331J6998k23747J38944K34690
12636A090193j02116m8463L42573L3229k92948j41083j35340J40098J25535k6457
12626I85221k1510O914J26895n6430j86246j53598J1443J11846K16076J83565
12616A224176k03906j71557j07849K49723l5810j24749P9969L19158r2101p0557
12606A066497K20104J54957J94012j16316m5879J9412p2348k40974n3881J81815
$$ plain form
12596 1307399 1375756 1361922 1249654 1069346 1058318 1141229 1143742 1169025 1127556 1013110 972681
12585 972681 1165968 1274394 1353147 1220686 1158399 1097760 1082388 1269650 1223436 964913
12575 964913 932687 1144813 1079089 1248082 1145025 1210310 1120604 1081704 875261 855571 965849
12564 965849 1122311 1091524 1237580 1515282 1716968 1480992 1395485 1490164 1511902 1107773
12554 1107773 959224 1221884 1239458 1130998 1292501 1214211 1050076 1015695 896361 1047490
12544 1047490 1381106 1549536 1406986 1412705 1505021 1328585 1352655 1390038 1569502 1646235
12534 1646235 1462288 1306766 1254418 1327528 1584731 1533872 1494415 1591270 1631209 1845466
12524 1845466 1839192 1808516 1631779 1533632 1500921 1469804 1525791 1621724 1572904 1691755 1764427
$$ packed form
12596A307399O8357j3834j12268j80308j1028Q2911K513K5283m1469j14446m0429
12585I72681J93287J08426P8753j32461o2287o0639j5372J87262m6214k58523
12575I64913l2226K12126o5724J68993j03057O5285q9706l8900k06443j9690J10278
12564I65849J56462l0787J46056K77702K01686k35976q5507R4679K1738m04129
12554A107773j48549K62660J7574j08460J61503p8290j64135l4381j19334J51129
12544A047490L33616J68430j42550N719R2316j76436K4070L7383J79464P6733
12534A646235j83947j55522n2348P3110K57203n0859l9457R6855L9939K14257
12524A845466o274l0676j76737r8147l2711l1117N5987R5933m8820J18851P2672
$$ plain form
12513 1764427 1750149 1781689 1729178 1359846 1189059 1283324 1455635 1628599 1720584 1862145
12503 1862145 1915256 1812998 1628821 1665256 1592897 1492017 1451127 1556816 1764950 1690651
12493 1690651 1534104 1462108 1589645 1516557 1632247 1843900 1922872 1800329 1806607 1777002
12483 1777002 1812463 1889671 1777980 1772388 1890944 1967672 1998286 1792059 1635170 1628754 1747944
12472 1747944 1639693 1522275 1510504 1511250 1576918 1669253 1497705 1506769 1768638 1862220 1745800
12461 1745800 1751493 1768392 1983852 2135729 2222181 2239932 2357053 2194076 2024045 1895108
12451 1895108 1864959 1957432 2102579 2054012 2305872 2377582 2070519 2011269 2118418 2062802
12441 2062802 2321988 2460850 2448744 2228651 2107979 2336165 2473760 2729319 2919199 2887981
$$ packed form
12513A764427j4278L1540n2511l69332j70787R4265J72311J72964R1985J41561
12503A862145N3111j02258j84177L6435p2359j00880m0890J05689K08134p4299
12493A690651j56547p1996J27537p3088J15690K11653P8972j22543O278k9605
12483A777002L5461P7208j11691n592J18556P6728L0614k06227j56889o416J19190
12472A747944j08251j17418j1771P46O5668R2335j71548R064K61869R3582j16420
12461A745800N693J6899K15460J51877Q6452J7751J17121j62977j70031j28937
12451A895108l0149R2473J45147m8567K51860P1710l07063n9250J07149n5616
12441B062802K59186J38862j2106k20093j20672K28186J37595K55559J89880l1218
$$ plain form
12431 2887981 3071468 3066623 2636782 2366269 2388610 2404563 2109648 2329831 2522703 2404147
12421 2404147 2355007 2366634 2308578 2334794 2442211 2379718 2476438 2672687 2594151 2547564 2731758
12410 2731758 2711845 2543390 2263005 2313025 2442808 2346780 2353363 2254802 2084130 2046421 2397328
12399 2397328 2628779 2439178 2255431 2423286 2419325 2514675 2612097 2516208 2508828 2720178 2690041
12388 2690041 2646483 2725917 2791372 3015816 3023746 2953084 3001133 2731829 2845102 2684091 2401757
12377 2401757 2394035 2593350 2769594 3057851 3095380 2994338 2962343 3085331 3059302 3079708
12367 3079708 3086530 3036677 2908619 2904786 2883610 2962572 3099053 3135110 3134323 3023563 2954932
12356 2954932 3044578 2897098 2775326 3001443 3038525 3149848 2944141 2941634 2975629 3015316
$$ packed form
12431B887981J83487m845m29841k70513K2341J5953k94915K20183J92872j18556
12421B404147m9140J1627n8056K6216J07417o2493R6720J96249p8536m6587J84194
12410B731758j9913j68455k80385N0020J29783r6028O583r8561j70672l7709L50907
12399B397328K31451j89601j83747J67855l961R5350R7422r5889p380K11350l0137
12388B690041m3558P9434O5455K24444P930p0662M8049k69304J13273j61011k82334
12377B401757p722J99315J76244K88257L7529j01042l1995J22988k6029K0406
12367C079708O822m9853j28058l833k1176P8962J36481L6057p87j10760o8631
12356B954932Q9646j47480j21772K26117L7082J11323k05707k507L3995L9687
$$ plain form
12346 3015316 3091057 3212664 3236492 3437418 3468772 3455731 3285456 2993222 2986015 3201662
12336 3201662 3330121 3385988 3247438 3099375 3019307 3295261 3303579 3299568 3613323 3770718
12326 3770718 3694274 3633683 3526481 3613182 3602612 3450941 3503182 3550525 3514798 3765359 3946239
12315 3946239 3873461 3733601 3931678 3982173 3848192 3777753 3643031 3664021 3744345 3558845
12305 3558845 3343964 3452985 3657660 3608019 3642038 3684789 3702773 3733895 3705678 3643563 3727072
12294 3727072 3791422 3790643 4004725 4157668 4345103 4035500 3963958 4298662 4272630 4503581
12284 4503581 4603115 4645913 4479520 4326075 4320019 4354643 4228243 3971173 3768143 4038051
12274 4038051 4187173 4260873 4417680 4463260 4467408 4388807 4711540 4697440 4417091 4391826 4628824
$$ packed form
12346C015316P5741J21607K3828K00926L1354j3041j70275k92234p207K15647
12336C201662J28459N5867j38550j48063q0068K75954Q318m011L13755J57395
12326C770718p6444o0591j07202Q6701j0570j51671N2241M7343l5727K50561J80880
12315C946239p2778j39860J98077N0495j33981p0439j34722K0990Q0324j85500
12305C558845k14881J09021K04675m9641L4019M2751J7984L1122k8217o2115Q3509
12294C727072O4350p79K14082J52943J87435l09603p1542L34704k6032K30951
12284D503581R9534M2798j66393j53445o056L4624j26400k57070k03030K69908
12274D038051J49122P3700J56807M5580M148p8601L22733j4100k80349k5265K36998
$$ plain form
12263 4628824 4779991 4976671 4825890 4610565 4300120 4153004 4093209 4330964 4269256 4169503
12253 4169503 4313276 4323432 4377617 4413479 4544630 4827184 5049984 5181526 4986870 4744926
12243 4744926 5029951 5169234 5001229 4703431 5008823 5223317 5177025 5036124 4905126 4728821
12233 4728821 4878815 4874016 4987931 5123292 5262068 5174015 5142266 5007660 4895599 5002529
12223 5002529 5239186 5249888 5298429 5459499 5407749 5230981 5361436 5495016 5513117 5481508
12213 5481508 5397930 5315417 5424552 5500409 5420985 5297840 5440043 5337784 5384384 5353322
12203 5353322 5399421 5433977 5479213 5606303 5656794 5584484 5571017 5438728 5246538 5222213 5276553
12192 5276553 5386264 5534931 5726555 5878629 5844626 5869246 5810615 5729131 5774379 5734237
$$ packed form
12263D628824J51167J96680j50781k15325l10445j47116n9795K37755o1708r9753
12253D169503J43773J0156N4185L5862J31151K82554K22800J31542j94656k41944
12243D744926K85025J39283j68005k97798L05392K14494m6292j40901j30998j76305
12233D728821J49994m799J13915J35361J38776q8053l1749j34606j12061J06930
12223E002529K36657J0702M8541J61070n1750j76768J30455J33580J8101l1609
12213E481508q3578q2513J09135P5857p9424j23145J42203j02259M6600l1062
12203E353322M6099L4556M5236J27090N0491p2310j3467j32289j92190k4325N4340
12192E276553J09711J48667J91624J52074l4003K4620n8631q1484M5248m0142
$$ plain form
12182 5734237 5717130 5926953 5958315 5899405 6111603 6185637 6179660 6239391 6268447 6209424 6061641
12171 6061641 6062612 6130866 5974027 5997584 6046853 6183277 6160721 5900830 5964693 5806017 5663652
12160 5663652 6053451 6111148 6110726 6395411 6445502 6266895 6306861 6427451 6629148 6615161 6570292
12149 6570292 6877937 6984787 6919447 6695281 6696093 6896019 7082387 7140854 7134549 6953924 6727776
12138 6727776 6737525 6664273 6729282 6771872 6684893 6833996 7009142 7069391 6949443 6860517 6652284
12127 6652284 6578943 6655288 6582198 6553731 6545431 6641285 6930677 6995105 6881525 6685354 6728757
12116 6728757 6795537 6951673 6908463 6858074 7114218 7283469 7138819 6913086 6867684 6979891
12106 6979891 7283367 7448216 7353690 7764217 8213413 8676571 9033713 9345153 9112469 8777842
$$ packed form
12182E734237j7107K09823L1362n8910K12198P4034n977N9731K9056n9023j47783
12171F061641R71O8254j56839K3557M9269J36424k2556k59891O3863j58676j42365
12160E663652L89799N7697m22K84685N0091j78607L9966J20590K01697j3987m4869
12149F570292L07645J06850o5340k24166Q12J99926J86368N8467o305j80625k26148
12138F727776R749p3252O5009M2590q6979J49103J75146O0249j19948q8926k08233
12127F652284p3341P6345p3090k8467q300R5854K89392O4428j13580j96171M3403
12116F728757O6780J56136m3210n0389K56144J69251j44650k25733m5402J12207
12106F979891L03476J64849r4526M10527M49196M63158L57142L11440k32684l34627
$$ plain form
12096 8777842 8083024 7660705 7399518 7376699 7379531 7328030 7188656 7008597 7161660 7514603
12086 7514603 7525780 7443341 7334651 7237197 7193509 7273655 7239802 7083758 6869138 6960346 7185836
12075 7185836 7250401 7024224 6874186 7038681 7235599 7527129 7370227 7339167 7340059 7134299
12065 7134299 7048312 6986708 6993776 7282464 7490457 7289427 7466915 7780537 8370493 9133774
12055 9133774 9593434 9278429 8734922 8261005 7985157 7642121 7272380 7062478 7147681 7241275
12045 7241275 7267345 7194965 6950591 6630811 6776595 6967628 6689042 6488846 6584991 6913648
12035 6913648 7110548 7084004 7031745 7102285 7340802 7390930 7313473 7320667 7056021 6793904 6873826
12024 6873826 6995143 7174577 7133942 6886041 6849468 6641349 6671276 6804949 6980716 7031033
$$ packed form
12096H777842o94818m22319k61187k2819K832n1501j39374j80059J53063L52943
12086G514603J1177q2439j08690r7454m3688Q0146l3853j56044k14620R1208K25490
12075G185836O4565k26177j50038J64495J96918K91530j56902l1060Q92k05760
12065G134299q5987o1604P068K88688K07993k01030J77488L13622N89956P63281
12055I133774M59660l15005n43507m73917k75848l43036l69741k09902Q5203R3594
12045G241275K6070p2380k44374l19780J45784J91033k78586k00196R6145L28657
12035F913648J96900k6544n2259P0540K38517N0128p7457P194k64646k62117P9922
12024F873826J21317J79434m0635k47901l6573k08119K9927J33673J75767N0317
$$ plain form
12014 7031033 7109698 7066086 7141619 7273517 7279225 7233029 6972661 6769434 6688135 6746170 6674011
12003 6674011 6684228 6830544 6986703 6922534 6665066 6611324 6662925 6887259 6871382 6752108
11993 6752108 6631994 6553879 6597264 6549043 6584455 6628697 6612672 6608855 6624219 6469564 6050790
11982 6050790 5917626 6192291 6272768 6193198 6170527 5985364 6065726 6305725 6317149 6246942
11972 6246942 5989933 6059733 6209470 6021040 6020384 6063078 5914916 5840579 5903348 5985341 6008492
11961 6008492 6029033 5815553 5746025 5835736 5838872 6053374 5955710 5556589 5372298 5609021
11951 5609021 5695121 5907250 6174049 6166847 6209934 6180804 6067173 5886093 5877840 5839709 5827091
11940 5827091 6097563 6128590 5693897 5551590 5579924 5516266 5445150 5459139 5452281 5442572 5513538
$$ packed form
12014G031033P8665m3612P5533J31898N708m6196k60368k03227q1299N8035p2159
12003F674011J0217J46316J56159o4169k57468n3742N1601K24334j5877j19274
11993F752108j20114p8115M3385m8221L5412M4242j6025l817J5364j54655m18774
11982F050790j33164K74665Q0477p9570k2671j85163Q0362K39999J1424p0207
11972F246942k57009O9800J49737j88430o56M2694j48162p4337O2769Q1993K3151
11961F008492K0541k13480o9528Q9711L136K14502r7664l99121j84291K36723
11951E609021Q6100K12129K66799p202M3087k9130j13631j81080q253l8131j2618
11940E827091K70472L1027m34693j42307K8334o3658p1116J3989o858r709P0966
$$ plain form
11929 5513538 5510596 5651146 5708660 5558490 5234054 5168068 5160512 5284401 5109608 4975875
11919 4975875 4978484 5133160 5091914 4897539 5094144 5082247 4892109 4977339 5292609 5263512
11909 5263512 5077892 5065557 5417289 5233843 5028229 4916184 4873993 5170476 5174692 5075033
11899 5075033 4957800 4784009 4924220 4985845 4749813 4804948 4653738 4862129 4812897 4491386
11889 4491386 4433887 4710350 4885072 4903750 4702359 4532028 4345703 4173003 4229683 4404827
11879 4404827 4246865 4284252 4449277 4522174 4341046 4378783 4591443 4466379 4284360 4277102
11869 4277102 4244445 4164467 4044381 4078593 4034770 4023106 3833844 3834747 3848027 3988999 3806157
11858 3806157 3787606 3908507 4139454 4343192 4212693 3904920 3890439 4050867 4099951 4200606
$$ packed form
11929E513538k942J40550N7514j50170l24436o5986p556J23889j74793j33733
11919D975875K609J54676m1246j94375J96605j1897j90138Q5230L15270k9097
11909E263512j85620j2335L51732j83446k05614j12045m2191K96483M216r9659
11899E075033j17233j73791J40211O1625k36032N5135j51210K08391m9232l21511
11889D491386n7499K76463J74722J8678k01391j70331j86325j72700N6680J75144
11879D404827j57962L7387J65025P2897j81128L7737K12660j25064j82019p258
11869D277102l2657p9978j20086L4212m3823j1664j89262R03J3280J40972j82842
11858C806157j8551J20901K30947K03738j30499l07773j4481J60428M9084J00655
$$ plain form
11848 4200606 4100998 4134918 3803508 3858618 3973295 4003515 3828102 3510168 3357597 3474840
11838 3474840 3618042 3440331 3423176 3403774 3546527 3611386 3541997 3495556 3583065 3735397
11828 3735397 3611695 3580497 3635915 3790284 3744212 3448197 3471143 3474645 3437027 3518451 3342882
11817 3342882 3173259 3245237 3381621 3542244 3566156 3330530 3361256 3232617 3271568 3492247
11807 3492247 3506542 3234086 3204951 3344831 3390595 3332796 3386397 3306318 3151471 3044088
11797 3044088 3305875 3477299 3415853 3236411 3174773 3157023 3051733 2904766 2761497 2644477
11787 2644477 2483299 2134138 2093056 2113996 2268046 2539554 2434315 2403038 2488157 2607522
11777 2607522 2815338 2765780 2815098 2865301 2773721 2715602 2646342 2755550 2990802 2970336 2814093
$$ packed form
11848D200606r9608L3920l31410N5110J14677L0220j75413l17934j52571J17243
11838C474840J43202j77711j7155j9402J42753O4859o9389m6441Q7509J52332
11828C735397j23702l1198N5418J54369m6072k96015K2946L502l7618Q1424j75569
11817C342882j69623P1978J36384J60623K3912k35626L0726j28639L8951K20679
11807C492247J4295k72456k9135J39880M5764n7799N3601q0079j54847j07383
11797C044088K61787J71424o1446j79442o1638j7750j05290j46967j43269j17020
11787B644477j61178l49161m1082K0940J54050K71508j05239l1277Q5119J19365
11777B607522K07816m9558M9318N0203r1580n8119o9260J09208K35252k0466j56243
$$ plain form
11766 2814093 2483252 2605070 3068758 3156060 2717903 2430359 2628464 2561134 2521161 2570691
11756 2570691 2604866 2612301 2616266 2611162 2640748 2405231 2377780 2426701 2482047 2374713 2519294
11745 2519294 2841580 2921842 2558415 2494910 2514827 2409956 2386759 2348361 2279397 2374006 2539484
11734 2539484 2393002 2162835 2284813 2330334 2180654 1999645 1824744 1915630 2019916 1957639
11724 1957639 1951438 1848374 2010374 2150381 2136332 1991749 1965359 2143352 2183375 1980689
11714 1980689 1860350 1891772 2046324 1961288 2066165 2145395 1960123 1761367 1763544 1911047
11704 1911047 2011536 1955921 1979491 2182897 2103964 2007605 1959492 2042449 2275111 2053529
11694 2053529 2000547 1987154 2142627 1950161 1922129 1961213 2024850 2186169 2051047 1673923
$$ packed form
11766B814093l30841J21818M63688Q7302m38157k87544J98105o7330l9973M9530
11756B570691L4175P435L965n104K9586k35517k7451M8921N5346j07334J44581
11745B519294L22286Q0262l63427o3505J9917j04871k3197l8398o8964R4609J65478
11734B539484j46482k30167J21978M5521j49680j81009j74901R0886J04286o2277
11724A957639o201j03064J62000J40007j4049j44583k6390J77993M0023k02686
11714A980689j20339L1422J54552q5036J04877P9230j85272j98756K177J47503
11704A911047J00489n5615K3570K03406p8933r6359m8113Q2957K32662k21582
11694B053529n2982j3393J55473j92466k8032L9084O3637J61319j35122l77124
$$ plain form
11684 1673923 1289964 1380738 1574546 1745648 1963936 2240550 2109123 2063700 2054717 1971836
11674 1971836 1948898 2121832 1931569 1702726 1507677 1438197 1353551 1348908 1382155 1167672
11664 1167672 1046205 1098189 1041582 1245309 1314396 1319842 1414858 1383443 1392569 1677232 1762607
11653 1762607 1854383 1858827 1685751 1709199 1640957 1414043 1298263 1435656 1547358 1697251
11643 1697251 1598379 1474017 1226675 1222535 1295422 1304155 1326064 1546581 1813393 1894324 1772638
11632 1772638 1642345 1613415 1705142 1890394 1798288 1769306 1524888 1530784 1331732 1291971 1324103
11621 1324103 1329379 1454072 1426908 1290072 1013218 728529 811055 1066667 1453058 1647796
11611 1647796 1544667 1479066 1414277 1338936 1153433 856217 863053 1063005 1068437 902941 1047871
$$ packed form
11684A673923l83959R0774J93808J71102K18288K76614j31427m5423q983q2881
11674A971836k2938J72934j90263k28843j95049o9480q4646m643L3247k14483
11664A167672j21467N1984n6607K03727O9087N446R5016l1415R126K84663Q5375
11653A762607R1776M444j73076K3448o8242k26914j15780J37393J11702J49893
11643A697251r8872j24362k47342m140P2887Q733K1909K20517K66812Q0931j21686
11632A772638j30293k8930R1727J85252r2106k8982k44418N896j99052l9761L2132
11621A324103N276J24693k7164j36836k76854k84689Q2526K55612L86391J94738
11611A647796j03129o5601o4789p5341j85503k97216O836J99952N432j65496J44930
$$ plain form
11600 1047871 1122795 1088719 1016174 1007695 1185566 1416144 1432152 1123905 1070817 704574 376074
11589 376074 410954 860590 1005037 988605 904193 1059946 1189800 1337132 1146888 1051178
11579 1051178 815277 830548 1131976 1080098 933141 845020 630764 425404 456332 491041
11569 491041 516923 572320 625255 930127 1056679 1051953 855984 814108 887457 918176 1171828
11558 1171828 1332327 1353226 1319164 1093862 1023456 927807 892648 807543 574496 615852 576734
11547 576734 745102 957141 935823 1206030 1085531 1014357 868609 783769 745500 807547
11537 807547 671826 448870 627150 662695 684664 654983 600725 567836 683046 838419
11527 838419 754045 1113832 1048269 1074504 888576 537974 427469 629522 760890 705208
$$ packed form
11600A047871P4924l4076p2545q479J77871K30578J6008l08247n3088l66243l28500
11589C76074L4880M49636J44447j6432q4412J55753J29854J47332j90244r5710
11579A051178k35901J5271L01428n1878j46957q8121k14256k05360L0928L4709
11569D91041K5882N5397N2935L04872J26552m726j95969m1876P3349L0719K53652
11558A171828J60499K0899l4062k25302p0406r5649l5159q5105k33047M1356l9118
11547E76734J68368K12039k1318K70207j20499p1174j45748q4840l8269O2047
11537H07547j35721k22956J78280L5545K1969k9681n4258l2889J15210J55373
11527H38419q4374L59787o5563K6235j85928l50602j10505K02053J31368n5682
$$ plain form
11517 705208 841290 862849 693781 788024 1007277 817881 700320 479295 370546 654559
11507 654559 889047 702286 599259 496275 395777 229008 353055 500275 501624 447722
11497 447722 758694 822432 881166 809298 650462 707057 778659 576488 462425 642209
11487 642209 744589 873686 851923 604546 566850 422534 471185 472237 482718 526719 646246
11476 646246 554946 683438 680327 791988 569068 351391 54630 173820 452230 521416
11466 521416 735750 610312 358244 652621 728976 814937 820069 922105 791458 654089
11456 654089 436723 227136 427110 550594 743918 703578 667526 660918 810038 877367
11446 877367 803287 999230 1107984 915750 750350 649149 595767 389074 550503 889962
$$ packed form
11517G05208J36082K1559j69068R4243K19253j89396j17561k21025j08749K84013
11507F54559K34488j86761j03027j02984j00498j66769J24047J47220J349n3902
11497D47722L10972O3738N8734p1868j58836N6595P1602k02171j14063J79784
11487F42209J02380J29097k1763k47377l7696j44316M8651J052J0481M4001J19527
11476F46246r1300J28492l111J11661k22920k17677k96761J19190K78410O9186
11466E21416K14334j25438k52068K94377P6355Q5961N132J02036j30647j37369
11456F54089k17366k09587J99974J23484J93324m0340l6052o608J49120O7329
11446H77367p4080J95943J08754j92234j65400j01201n3382k06693J61429L39459
$$ plain form
11436 889962 865311 758565 818637 765039 595615 467464 43861 -164164 -74562 189293
11426 189293 285625 419262 423265 288614 459057 398283 212000 255751 513242 419985 278701
11415 278701 185354 103801 193626 458613 414473 349293 374984 315600 391362 587443 835243
11404 835243 907120 887264 846323 754091 530336 181918 239693 337151 283503 245522 351835
11393 351835 411931 260421 550547 823928 631209 498273 265354 220682 231190 283994
11383 283994 358097 497751 322550 186185 329604 315318 366098 345523 223371 237656
11373 237656 454671 394702 409118 416679 365733 455257 314634 188291 30621 105447 459848
11362 459848 190965 63559 25911 86657 486947 523620 387867 413301 229274 -119437
$$ packed form
11436H89962k4651j06746O0072n3598j69424j28151m23603k08025Q9602K63855
11426A89293R6332J33637M003j34651J70443o0774j86283M3751K57491r3257j41284
11415B78701r3347q1553Q9825K64987m4140o5180K5691n9384P5762J96081K47800
11404H35243P1877j9856m0941r2232k23755l48418N7775R7458n3648l7981J06313
11393C51835O0096j51510K90126K73381j92719j32936k32919m4672J0508N2804
11383B83994P4103J39654j75201j36365J43419j4286N0780k0575j22152J4285
11373B37656K17015n9969J4416P561n0946Q9524j40623j26343j57670P4826L54401
11362D59848k68883j27406l7648O0746M00290L6673j35753K5434j84027l48711
$$ plain form
11352 -119437 17516 170528 195956 179725 251698 135545 235746 353723 561688 531852
11342 531852 635038 703413 520381 330170 551466 487142 579079 650495 633806 571441 629092
11331 629092 696248 417723 443982 472039 496261 478724 575218 535534 480843 215163 -6072
11320 -6072 27816 136633 285553 229918 177937 -66346 -18093 97487 196432 212761 396116
11309 396116 568879 619450 428433 414131 244140 377036 212696 -13016 -60826 -140629
11299 -140629 -87242 121447 301199 308079 20052 74891 128342 173811 321879 291686 251832
11288 251832 208832 203548 128265 177552 183158 73603 -20743 56751 181395 404419 358097
11277 358097 63822 -36855 -279430 -314723 -56644 215249 213914 -31444 -336123 -84134
$$ packed form
11352a19437J36953J53012K5428j6231P1973j16153J00201J17977K07965k9836
11342E31852J03186O8375j83032j90211K21296o4324R1937P1416j6689o2365N7651
11331F29092O7156k78525K6259K8057K4222j7537R6494l9684n4691k65680k21235
11320f072L3888J08817J48920n5635n1981k44283M8253J15580R8945J6329J83355
11309C96116J72763N0571j91017j4302j69991J32896j64340k25712m7810p9803
11299a40629N3387K08689J79752O880k88027N4839N3451M5469J48068l0193l9854
11288B51832m3000n284p5283M9287N606j09555r4346P7494J24644K23024m6322
11277C58097k94275j00677k42575l5293K58079K71893j335k45358l04679K51989
$$ plain form
11267 -84134 232365 -62573 -61514 220249 282131 85710 -75783 149281 286072 98915
11257 98915 48620 82456 284763 331379 164087 8134 27240 155341 -16155 83552 481612
11246 481612 385874 187217 366078 470307 402281 369462 480306 378353 154945 164096
11236 164096 180227 64764 126587 22199 84639 199497 189661 19128 -156909 -30988
11226 -30988 17026 136196 -10703 -156071 -183615 -432843 -554179 -301758 46910 178539
11216 178539 175358 80927 20134 117719 95554 -69098 -160431 -108124 227167 356024 73998
11205 73998 -384556 -330421 -65417 213546 364496 346700 293726 240398 52735 213876
11195 213876 133673 -105814 -96829 -81985 45043 -108689 -235880 -220807 -516818 -573512 -374655
$$ packed form
11267h4134L16499k94938J059K81763O1882j96421j61493K25064J36791j87157
11257I8915n0295L3836K02307M6616j67292j55953J9106J28101j71496R9707L98060
11246D81612r5738j98657J78861J04229o8026l2819J10844j01953k23408R151
11236A64096J6131j15463O1823j04388O2440J14858r836j70533j76037J25921
11226c0988M8014J19170j46899j45368k7544k49228j21336K52421L48668J31629
11216A78539l181r4431o0793R7585k2165j64652r1333N2307L35291J28857k82026
11205G3998m58554N4135K65004K78963J50950j7796n2974n3328j87663J61141
11195B13876q0203k39487Q985J4844J27028j53732j27191J5073k96011n6694J98857
$$ plain form
11184 -374655 -67068 59308 -49947 -201236 23582 -66878 36172 190789 311150 183450
11174 183450 -151455 -271901 -93868 46342 64211 -254539 -368307 -242675 -137321 43921
11164 43921 97337 -111466 -96229 -292992 -392603 -255134 -191488 -133692 -170564 -398278 -349945
11153 -349945 -201378 -268097 -119504 -91597 -135062 -86735 -62904 -49703 -242354 -201482 -67064
11142 -67064 51901 24126 21094 44356 -49042 -258549 -395007 -391114 -398813 -235039 -97532
11131 -97532 -57511 -111451 -128944 -115400 -275913 -460536 -119816 141546 251039 63117
11121 63117 -165395 -284388 -242117 -267026 -390418 -487860 -312436 -122331 -289453 -179586
11111 -179586 -13146 -87977 -217686 -191627 -101231 -181307 -207685 -233420 -80695 -80816 -133704
$$ packed form
11184c74655L07587J26376j09255j51289K24818r0460J03050J54617J20361j27700
11174A83450l34905j20446J78033J40210J7869l18750j13768J25632J05354J81242
11164D3921N3416k08803J5237j96763r9611J37469O3646N7796l6872k27714M8333
11153c49945J48567o6719J48593K7907m3465M8327K3831J3201j92651M0872J34418
11142f7064J18965k7775l032K3262r3398k09507j36458L893p699J63774J37507
11131i7532M0021n3940j7493J3544j60513j84623L40720K61362J09493j87922
11121F3117k28512j18993M2271k4909j23392r7442J75424J90105j67122J09867
11111a79586J66440p4831j29709K6059R0396q0076k6378k5735J52725j21n2888
$$ plain form
11100 -133704 221044 187726 -102320 -263080 -139940 490 106749 74067 -39617 -182817
11090 -182817 -25869 -83991 -51963 -107729 -143506 -63712 -175332 -199984 -213848 -358788 -321752
11079 -321752 -318432 -381397 -199825 -145512 -124294 -234572 -214217 -81413 110501 231745 325249
11068 325249 -201200 -571964 -554250 -593814 -440168 -477402 -645034 -662792 -490570 -284446
11058 -284446 -455723 -330343 -326483 -197181 124608 320533 22490 -50072 -110981 -18830
11048 -18830 -19132 -210496 226556 524613 608110 776226 816681 742284 791606 865255 828472
11037 828472 842130 925861 1026742 1640963 1776278 1857591 1983775 1864667 1629832 1593592
11027 1593592 1340679 999304 1053794 1450997 2072125 2370056 2860583 3154217 2977036 2400979
$$ packed form
11100a33704L54748l3318k90046j60760J23140J40430J06259l2682j13684j43200
11090a82817J56948n8122L2028n5766l5777P9794j11620k4652j3864j44940L7036
11079c21752L320o2965J81572N4313K1218j10278K0355J32804J91914J21244R3504
11068C25249n26449l70764J7714l9564J53646l7234j67632j7758J72222K06124
11058b84446j71277J25380L860J29302L21789J95925k98043p2562o0909R2151
11048a8830l02j91364M37052K98057Q3497J68116M0455p4397M9322P3649l6783
11037H28472J3658Q3731J00881O14221J35315Q1313J26184j19108k34835l6240
11027A593592k52913l41375N4490L97203O21128K97931M90527K93634j77181n76057
$$ plain form
11017 2400979 2034733 1923351 1665110 1366737 1296136 1225014 1297233 1642899 1833293 1927086
11007 1927086 1771319 1586315 1217331 1024614 918484 617507 542241 709430 695337 477477
10997 477477 440280 396976 372977 417518 233695 159037 361871 402674 352836 324246 303036
10986 303036 249882 338229 364698 127196 -104027 100484 370792 141777 -241848 -441478
10976 -441478 -486956 -732770 -843048 -820443 -905624 -750981 -667127 -390160 -319225 -482973
10966 -482973 -471137 -537144 -660075 -602678 -341100 -76480 -215439 -187704 -163601 -177398 -154410
10955 -154410 -134510 -116503 -109176 -181207 -364686 -499240 -445651 -394174 -459696 -554782 -579039
10944 -579039 -672261 -737680 -623566 -308745 -172383 -264243 -275573 -392204 -325924 -357370 -337396
$$ packed form
11017B400979l66246j11382k58241k98373p0601p1122P2219L45666J90394R3793
11007A927086j55767j85004l68984j92717j06130l00977p5266J67189j4093k17860
10997D77477l7197m3304k3999M4541j83823p4658K02834M0803m9838k8590k1210
10986C03036n3154Q8347K6469k37502k31223K04511K70308k29015l83625j99630
10976d41478m5478k45814j10278K2605q5181J54643Q3854K76967P0935j63748
10966d82973J1836o6007j22931N7397K61578K64620j38959K7735K4103j3797K2988
10955a54410J9900J8007P327p2031j83479j34554N3589N1477o5522r5086k4257
10944e79039r3222o5419J14114L14821J36362r1860j1330j16631O6280l1446J9974
$$ plain form
10933 -337396 -285716 -257944 -212185 -90733 -215779 -428114 -446855 -364953 -296570 -263599 -385589
10922 -385589 -582893 -413172 -354071 -283334 -88217 -168387 -226454 -139886 -201824 -190628 -158214
10911 -158214 -229369 -373889 -302810 -352504 -685064 -526250 -338534 -383881 -634215 -596162
10901 -596162 -558761 -591783 -362764 -336218 -630584 -783996 -663570 -591292 -563617 -510429 -525733
10890 -525733 -826672 -948901 -914332 -747966 -754837 -554538 -514729 -494972 -509336 -496225 -511323
10879 -511323 -526781 -667455 -694349 -465830 -619062 -614083 -494746 -416614 -211717 56231
10869 56231 8864 -349405 -282860 -25161 40701 36458 24206 -176735 -258330 -30370 -66950
10858 -66950 -323523 -442575 -639719 -719201 -582611 -484039 -575052 -807535 -739655 -429375
$$ packed form
10933c37396N1680K7772M5759J21452j25046k12335j8741Q1902O8383L2971j21990
10922c85589j97304J69721N9101P0737J95117q0170n8067Q6568o1938J1196L2414
10911a58214p1155j44520P1079m9694l32560J58814J87716m5347k50334L8053
10901e96162L7401l3022K29019K6546k94366j53412J20426P2278K7675N3188j5304
10890e25733l00939j22229L4569J66366o871K00299L9809J9757j4364J3111j5098
10879e11323j5458j40674k6894K28519j53232M979J19337P8132K04897K67948
10869E6231m7367l58269O6545K57699O5862m243j2252k00941q1595K27960l6580
10858f6950k56573j19052j97144p9482J36590R8572r1013k32483O7880L10280
$$ plain form
10848 -429375 -408654 -495292 -521406 -359542 -411198 -368376 -292742 -300970 -387063 -375572 -142536
10837 -142536 63158 -43796 -297832 -258942 -175825 -301000 -594316 -428190 -224461 -365325
10827 -365325 -456391 -653925 -550813 -604827 -608507 -583716 -546247 -393665 -455471 -666806 -804298
10816 -804298 -571821 -736444 -918669 -1044097 -781794 -579493 -474510 -727511 -831534 -746986
10806 -746986 -681979 -791067 -726886 -521610 -553620 -653450 -672152 -782819 -1047443 -936882
10796 -936882 -698398 -838459 -972962 -972564 -1048733 -842454 -619713 -626899 -471412 -231854 -220406
10785 -220406 -488430 -435458 -216802 -353329 -281175 -531964 -677171 -693705 -662535 -833592
10775 -833592 -704799 -631059 -802740 -971855 -922602 -542084 -439878 -565720 -505580 -433388
$$ packed form
10848d29375K0721q6638k6114J61864n1656M2822P5634q228q6093J1491K33036
10837a42536K05694j06954k54036L8890Q3117j25175k93316J66126K03729j40864
10827c65325r1066j97534J03112n4014l680K4791L7469J52582o1806k11335j37492
10816h04298K32477j64623j82225j25428K62303K02301J04983k53001j04023Q4548
10806g46986O5007j09088O4181K05276l2010r9830j8702j10667k64624J10561
10796i36882K38484j40061j34503L98p6169K06279K22741p186J55487K39558J1448
10785b20406k68024N2972K18656j36527P2154k50789j45207j6534L1170j71057
10775h33592J28793P3740j71681j69115M9253L80518J02206j25842O0140P2192
$$ plain form
10765 -433388 -356032 -690232 -1024613 -911040 -769972 -740939 -934252 -982013 -898215 -900441 -752640
10754 -752640 -841555 -839237 -1007720 -978241 -1146617 -1198321 -809838 -506435 -442196 -420884 -337343
10743 -337343 -395891 -695927 -726778 -691599 -854821 -945352 -842386 -753559 -797371 -600335 -466064
10732 -466064 -541166 -516453 -755617 -982186 -1031851 -1085509 -851911 -753173 -990348 -1053029 -1056863
10721 -1056863 -972911 -710453 -472610 -592838 -699057 -773324 -694632 -410667 -522932 -654738
10711 -654738 -638066 -886596 -1018164 -953800 -682437 -589165 -730174 -961112 -1004067 -1034764
10701 -1034764 -1063502 -980083 -1065492 -1311306 -1629772 -1682311 -1599876 -1452903 -1397032 -1411405 -1273513
10690 -1273513 -1230266 -1353379 -1509846 -1604450 -1614325 -1494316 -1286759 -1295551 -1219040 -1162205 -1258979
$$ packed form
10765d33388P7356l34200l34381J13573J41068K9033j93313m7761Q3798k226J47801
10754g52640q8915K318j68483K9479j68376n1704L88483L03403O4239K1312Q3541
10743c37343n8548l00036l0851L5179j63222r0531J02966Q8827m3812J97036J34271
10732d66064p5102K4713k39164k26569m9665n3658K33598R8738k37175o2681l834
10721a056863Q3952K62458K37843j20228j06219p4267P8692K83965j12265j31806
10711f54738J6672k48530j31568O4364K71363R3272j41009k30938m2955l0697
10701a034764k8738Q3419q5409k45814l18466n2539Q2435J46973N5871j4373J37892
10690a273513M3247j23113j56467r4604r875J20009K07557q792P6511N6835r6774
$$ plain form
10679 -1258979 -1467306 -1674345 -1597006 -1468648 -1518266 -1330961 -1357107 -1483332 -1547508 -1428936
10669 -1428936 -1297285 -1260091 -1427599 -1294750 -1124524 -1170928 -1090569 -1090340 -1305211 -1392898 -1276778
10658 -1276778 -1288419 -1362750 -1365407 -1517232 -1555578 -1410343 -1390097 -1429416 -1464250 -1665260 -1640896
10647 -1640896 -1568516 -1288162 -1019352 -887611 -739023 -603482 -441501 -588474 -536102 -364278
10637 -364278 -180578 31811 330499 769429 1520219 2463598 3635893 4724213 5378828
10628 5378828 6174884 6953780 7607061 8965759 10770181 13340319 17051667 22414936 29741738
10619 29741738 40145812 54604084 74212485 98970137 125770878 147782826 158445198
10612 158445198 156732588 147482905 137985930 133041423 135112293 146646187 169790160 207206595
$$ packed form
10679a258979k08327k07039P7339J28358m9618J87305k6146j26225o4176J18572
10669a428936J31651L7194j67508J32849J70226m6404Q0359K29k14871q7687J16120
10658a276778j1641p4331k657j51825l8346J45235K0246l9319l4834k01010K4364
10647a640896P2380K80354K68810J31741J48588J35541J61981j46973N2372J71824
10637c64278J83700K12389K98688M38930P50790R43379J172295J088320O54615
10628E378828P96056P78896O53281J358698J804422K570138L711348N363269P326802
10619B9741738J0404074J4458272J9608401K4757652K6800741K2011948J0662372
10612A58445198j712610r249683r496975m944507K070870J1533894K3143973L7416435
$$ plain form
10604 207206595 257783892 313087773 354496317 364593710 343721885 307917645 274590884
10597 274590884 252811346 246454971 256907981 286352554 336044893 403055930 472159033
10590 472159033 515286208 509805888 461019786 394511594 334003739 289742946 264136522
10583 264136522 256452979 265829922 291092326 327316392 362940923 378521724 360851433
10576 360851433 316296505 263083394 216486504 182751827 161865271 151932547 151123505
10569 151123505 157305892 167506555 175812437 174850013 161297341 137595901 111053915
10562 111053915 87523338 69119696 55300371 44917174 37313267 31686120 27573061
10555 27573061 24565044 22005575 19948766 18388158 16906886 15426785 14202424 13098081
$$ packed form
10604B07206595N0577297N5303881M1408544J0097393k0871825l5804240l3326761
10597B74590884k1779538o356375J0453010K9444573M9692339O7011037O9103103
10590D72159033M3127175n480320m8786102o6508192o0507855m4260793k5606424
10583B64136522p683543R376943K5262404L6224066L5624531J5580801j7670291
10576C60851433m4554928n3213111m6596890l3734677k0886556r932724q09042
10569A51123505O182387J0200663Q305882r62424j3552672k3701440k6541986
10562A11053915k3530577j8403642j3819325j0383197p603907n627147m113059
10555B7573061l008017k559469k056809j560608j481272j480101j224361j104343
$$ plain form
10547 13098081 12009911 11381741 10758102 10278411 9674440 9247464 9070044 8707502 8295708
10538 8295708 7888334 7482018 7207068 6629394 6195094 6146000 5998073 5992293 5707144 5587181
10528 5587181 5394596 5317968 5253238 5160645 4723120 4683833 4759733 4716347 4660214 4678733 4421504
10517 4421504 4212255 4149018 4034770 3779068 3477649 3172842 3101207 3101314 3313231 3590330
10507 3590330 3585819 3213645 3112240 3095046 3034531 2861661 3040607 2967523 2646721 2531933
10497 2531933 2685568 2866061 2748054 2698403 2464474 2599405 2547884 2556083 2753716 2601156
10487 2601156 2569991 2401917 2402639 2515626 2603067 2315383 2367560 2433194 2452445 2288232 2216562
10476 2216562 2160268 2247639 2461685 2572042 2690167 2499701 2382600 2143457 2247383 2318321
$$ packed form
10547A3098081j088170o28170o23639m79691o03971m26976j77420l62542m11794
10538H295708m07374m06316k74950n77674m34300m9094j47927n780k85149j19963
10528E587181j92585p6628o4730r2593m37525l9287P5900m3386n6133J8519k57229
10517D421504k09249o3237j14248k55702l01419l04807p1635J07K11917K77099
10507C590330m511l72174j01405j7194o0515j72870J78946p3084l20802j14788
10497B531933J53635J80493j18007m9651k33929J34931n1521Q199J97633j52560
10487B601156l1165j68074P22J12987Q7441k87684N2177O5634J9251j64213p1670
10476B216562n6294Q7371K14046J10357J18125j90466j17101k39143J03926P0938
$$ plain form
10466 2318321 2332316 2101019 2180248 2235627 2129538 2119762 2223205 1975144 1624850 1565767
10456 1565767 1575392 1497576 1567809 1608834 1848669 2083662 2136726 2008611 1886624 1661450
10446 1661450 1613335 1879498 1850896 1564743 1355597 1197971 1454218 1669074 1588682 1356163
10436 1356163 1374519 1329663 1064346 798260 912383 990549 1050564 1221187 1183098 1169348
10426 1169348 1425400 1221999 1117020 1145240 1250843 1416304 1645648 1397221 1251068 1207052
10416 1207052 1080234 1056382 989362 984671 987441 839111 888041 935365 1092281 1192495 1149821
10405 1149821 1146396 1299848 1341303 1257705 1006707 816841 664948 822595 1107692 1124452
10395 1124452 753530 528310 540150 569207 773796 775097 665962 730012 812799 668137
$$ packed form
10466B318321J3995k31297P9229N5379j06089r776J03443k48061l50294n9083
10456A565767R625p7816P0233M1025K39835K34993N3064j28115j21987k25174
10446A661450m8115K66163k8602k86153k09146j57626K56247K14856q0392k32519
10436A356163J8356m4856k65317k66086J14123P8166O0015J70623l8089j3750
10426A169348K56052k03401j04979K8220J05603J65461K29344k48427j46153m4016
10416A207052j26818k3852o7020m691K770j48330M8930M7324J56916J00214m2674
10405A149821l425J53452M1455q3598k50998j89866j51893J57647K85097J6760
10395A124452l70922k25220J1840K9057K04589J301j09135O4050Q2787j44662
$$ plain form
10385 668137 532449 749157 735155 720874 879752 956560 1087979 1409537 1624352 1635945
10375 1635945 1541874 1317619 1286816 1373874 1133053 1058999 942830 940986 917026 942155 813542
10364 813542 673647 684324 747336 619056 513790 420181 351507 348163 554852 669804 922638
10353 922638 849400 817914 944771 1009309 914601 726108 623474 536430 678713 906924
10343 906924 943925 920217 815398 728186 804508 725804 530432 641430 1042238 1060549 779508
10332 779508 795430 1077806 879005 935084 927377 1062647 1126898 1044909 715617 419286 278927
10321 278927 277076 397566 294881 202535 287349 409027 462394 545443 751831 795496 906837
10310 906837 723022 685791 553531 413087 264490 226403 367595 378648 422228 501456
$$ packed form
10385F68137j35688K16708j4002j4281J58878P6808J31419L21558K14815J1593
10375A635945r4071k24255l0803Q7058k40821p4054j16169j844k3960K5129j28613
10364H13542j39895J0677O3012j28280j05266r3609o8674l344K06689J14952K52834
10353I22638p3238l1486J26857O4538r4708j88493j02634q7044J42283K28211
10343I06924L7001k3708j04819q7212P6322p8704j95372J10998M00808J8311k81041
10332G79508J5922K82376j98801N6079p707J35270O4251q1989l29292k96331j40359
10321B78927j851J20490j02685r2346Q4814J21678N3367Q3049K06388M3665J11341
10310I06837j83815l7231j32260j40444j48597l8087J41192J1053M3580P9228
$$ plain form
10300 501456 681549 793556 832132 967406 798700 620963 504855 612342 560631 620520
10290 620520 825034 944786 867289 642669 636801 681104 776575 909191 950074 696081 590328
10279 590328 643734 547454 405662 630884 724673 581361 423685 295274 311235 482542
10269 482542 613511 575800 313483 303359 454892 324899 -53173 -36094 222897 352444
10259 352444 444967 537132 490621 550589 483721 623346 853256 612608 369289 212121
10249 212121 24262 174142 114721 318466 190693 201342 331746 410801 551647 687630
10239 687630 776051 581555 494109 525296 450539 380538 528936 907067 862671 754410 711710
10228 711710 578099 735470 679785 542735 490217 691570 807831 780936 543706 320173
$$ packed form
10300E01456J80093J12007L8576J35274j68706j77737j16108J07487n1711N9889
10290F20520K04514J19752p7497k24620n868M4303R5471J32616M0883k53993j05753
10279E90328N3406r6280j41792K25222R3789j43312j57676j28411J5961J71307
10269D82542J30969l7711k62317j0124J51533j29993l78072J7079K58991J29547
10259C52444R2523R2165m6511N9968o6868J39625K29910k40648k43319j57168
10249B12121j87859J49880n9421K03745j27773J0649J30404P9055J40846J35983
10239F87630Q8421j94496q7446L1187p4757p0001J48398L78131m4396j08261m2700
10228G11710j33611J57371n5685j37050n2518K01353J16261k6895k37230k23533
$$ plain form
10218 320173 87622 171333 233577 234808 269066 188337 236551 514908 590649 471475 427821
10207 427821 153449 233408 484353 600231 427295 346742 213844 189926 250123 271761
10197 271761 271141 415441 476397 421936 584723 490979 459922 576622 547817 453645 530296
10186 530296 564296 585393 515144 448569 539304 666126 892786 913082 1129342 1321971 1105099
10175 1105099 912719 1009522 1167289 1276297 1105991 1284688 1583238 1876835 2360613 2602129
10165 2602129 2638814 2675653 2473000 2107583 1934193 1642850 1447546 1689530 2035699 2285034
10155 2285034 2788567 3146743 3168315 2976361 2648082 2315973 2089477 2067331 1968081 1726507
10145 1726507 1671171 1801785 1873354 2198698 2265346 1884969 1664499 1420879 1216537 1200718
$$ packed form
10218C20173k32551Q3711O2244J231L4258q0729M8214K78357P5741j19174m3654
10207D27821k74372P9959K50945J15878j72936q0553j32898k3918O0197K1638
10197B71761o20J44300O0956n4461J62787r3744l1057J16700k8805r4172P6651
10186E30296L4000K1097p0249o6575R0735J26822K26660K0296K16260J92629k16872
10175A105099j92380R6803J57767J09008j70306J78697K98550K93597M83778K41516
10165B602129L6685L6839k02653l65417j73390k91343j95304K41984L46169K49335
10155B285034N03533L58176K1572j91954l28279l32109k26496k2146r9250k41574
10145A726507n5336J30614P1569L25344O6648l80377k20470k43620k04342j5819
$$ plain form
10135 1200718 1214338 1169795 1300815 1354822 1137251 1163215 922090 892898 951347 665581
10125 665581 436906 124271 67135 212305 397789 293472 408919 502507 724072 675484
10115 675484 589023 657507 624324 551842 188503 78314 434762 775271 749998 657909 624580
10104 624580 296769 -43303 -163606 26318 130339 37325 243074 273765 351335 364492
10094 364492 324678 295809 387593 448835 416254 320809 91954 93468 182347 95445 121037
10083 121037 404704 469248 370642 302150 230720 326475 511470 481829 486949 646356 697539
10072 697539 692970 691119 557250 434502 486344 526302 213814 -48316 -133701 -260085 -43661
10061 -43661 89429 175672 -51325 49266 381639 415771 406699 483687 348862 -38548 -28602
$$ packed form
10135A200718J3620m4543J31020N4007k17571K5964k41125k9192N8449k85766
10125F65581k28675l12635n7136J45170J85484j04317J15447R3588K21565m8588
10115F75484q6461O8484l3183p2482l63339j10189L56448L40509k5273r2089l3329
10104F24580l27811l40072j20303J89924J04021r3014K05749L0691P7570J3157
10094C64492l9814k8869R1784O1242l2581r5445k28855J514Q8879q6902K5592
10083A21037K83667O4544r8606o8492p1430R5755J84995k9641N120J59407N1183
10072F97539m569j851j33869j22748N1842L9958l12488k62130q5385j26384K16424
10061d3661J33090Q6243k26997J00591L32373L4132r072P6988j34825l87410R946
$$ plain form
10050 -28602 309766 369699 558946 437039 145057 38143 68122 -66112 36562 -1381
10040 -1381 65955 80074 47430 270104 226077 229001 257804 954 -97009 -176685 -57635
10029 -57635 257243 260730 269285 254408 210525 428353 219229 195621 418317 274930 202033
10018 202033 233347 174660 285657 387790 351688 311674 383731 556507 412245 135899
10008 135899 219221 125432 13377 -58701 65770 -15329 62641 82974 18330 81370 166812
9997 166812 33490 297391 488086 313352 297587 431551 287786 18491 -83499 -49324
9987 -49324 -10218 161058 116109 109336 82541 203141 268960 356587 280726 279144 187758 11687
9975 11687 55584 247473 537342 440070 351455 225077 154929 126716 125403 -50793 42614
$$ packed form
10050b8602L38368N9933J89247j21907k91982j06914K9979j34234J02674l7943
10040a381O7336J4119l2644K22674m4027K924K8803k56850r7963p9676J19050
10029e7635L14878L487Q555j4877m3883K17828k09124k3608K22696j43387p2897
10018B02033L1314n8687J10997J02133l6102m0014P2057J72776j44262k76346
10008A35899Q3322r3789j12055p2078J24471q1099P7970K0333o4644O3040Q5442
9997A66812j33322K63901J90695j74734j5765J33964j43765k69295j01990L4175
9987d9324L9106J71276m4949o773k6795J20600O5819Q7627p5861j582r1386j76071
9975A1687M3897J91889K89869r7272q8615j26378p0148k8213j313j76196R3407
$$ plain form
9964 42614 69771 44378 69066 138348 98704 -71152 18333 68311 -13169 94231 238231
9953 238231 201558 667 165218 272686 117301 33712 2826 -62623 50961 30831 -76183
9942 -76183 243327 254368 36241 -90350 -34995 -144754 -198306 10906 233745 355990
9932 355990 538794 581249 531751 457412 473237 458290 183030 240424 342356 220130 -161106
9921 -161106 31051 261439 212818 -62485 -70854 -124839 -139615 -136608 -172197 -125449 -81232
9910 -81232 -121375 -195397 -96658 12439 101881 273281 387040 551285 482156 424668 309082
9899 309082 483468 617585 542043 465290 467973 300072 -17851 -98480 -184732 -218307 -105169
9888 -105169 19228 -65039 -207362 -42616 22881 70286 132667 178414 41853 26369 53730
$$ packed form
9964D2614K7157k5393K4688O9282l9644j69856Q9485M9978q1480J07400J44000
9953B38231l6673k00891J64551J07468j55385q3589l0886o5449J13584k0130j07014
9942g6183L19510J1041k18127j26591N5355j09759n3552K09212K22839J22245
9932C55990J82804M2455m9498p4339J5825j4947k75260N7394J01932j22226l81236
9921a61106J92157K30388m8621k75303q369n3985j4776L007l5589M6748M4217
9910h1232m0143p4022R8739J09097Q9442J71400J13759J64245o9129n7488j15586
9899C09082J74386J34117p5542p6753K683j67901l17923q0629q6252l3575J13138
9888a05169J24397q4267j42323J64746O5497M7405O2381M5747j36561j5484K7361
$$ plain form
9877 53730 150538 229811 320195 356147 -223876 -578689 -480888 -202472 -40440 -102795 110210
9866 110210 213142 221570 45453 -32694 -41397 -29904 89745 31318 78695 150859 240179
9855 240179 139244 -79933 64879 128494 -10878 -18214 101827 60675 256909 112406
9845 112406 90107 173230 72676 76380 100682 -58673 -226677 -172353 114512 155724 -24430
9834 -24430 -85410 -232543 -233247 -270052 -311130 -65773 -124078 -199509 -448612 -678746 -332292
9823 -332292 -273850 -372283 -57399 37967 41768 61215 19960 -21919 -23445 51939 243687 42155
9811 42155 -123480 -224004 -128177 41844 2313 -172432 -306068 -442490 -308995 -151273
9801 -151273 72789 211004 408399 417399 306023 209568 255627 350716 347207 395654 72720
$$ packed form
9877E3730R6808P9273R0384L5952n80023l54813R7801K78416J62032o2355K13005
9866A10210J02932Q428j76117p8147q703J1493J19649n8427M7377P2164Q9320
9855B40179j00935k19177J44812O3615j39372p336J20041m1152J96234j44503
9845A12406k2299Q3123j00554L704K4302j59355j68004N4324K86865M1212j80154
9834b4430o0980j47133p04l6805m1078K45357n8305p5431k49103k30134L46454
9823c32292N8442r8433L14884R5366L801J9447m1255m1879j526P5384J91748k01532
9811D2155j65635j00524R5827J70021l9531j74745j33636j36422J33495J57722
9801a51273K24062J38215J97395R000j11376r6455M6059R5089l509M8447l22934
$$ plain form
9790 72720 51648 107367 243661 195737 610999 1041798 1590004 2030279 2971436 5264572
9780 5264572 9295379 16051327 25125300 32301512 32092937 25400036 16928835 10460135
9772 10460135 6515641 4512437 3371712 2357424 1634490 1195904 872134 774080 691616
9763 691616 755717 812740 709652 496836 468075 527027 368316 260036 451831 777032
9753 777032 674888 717408 571279 552416 469124 480062 548516 723448 563943 513519 458045
9742 458045 282650 181181 -83954 -241162 -99358 80166 163678 81481 -204976 -39835
9732 -39835 118615 406301 291324 248838 369172 121110 -147901 -55789 23041 -82382
9722 -82382 -205587 -160425 -142794 -132965 7334 13894 18635 7391 113314 24129 208905 253161
$$ packed form
9790G2720k1072N5719J36294m7924M15262M30799N48206M40275R41157K293136
9780E264572M030807O755948R073973P176212k08575o692901q471201o468700
9772A0460135l944494k003204j140725j014288p22934m38586l23770r8054q2464
9763F91616O4101N7023j03088k12816k8761N8952j58711j08280J91795L25201
9753G77032j02144M2520j46129j8863q3292J0938O8454J74932j59505n0424n5474
9742D58045j75395j01469k65135j57208J41804J79524Q3512q2197k86457J65141
9732c9835J58450K87686j14977m2486J20334k48062k69011R2112P8830j05423
9722h2382j23205M5162J7631R829J40299O560M741j1244J05923q9185J84776M4256
$$ plain form
9710 253161 142350 18360 63685 217390 185472 203835 229251 266107 199531 -44094 -48716
9699 -48716 21752 -88669 74058 284492 262636 282034 36365 -115414 -25209 13662 -103401
9688 -103401 -200667 -185246 -236092 -235911 -136150 -246716 -138376 121511 178731 -9625 -4593
9677 -4593 155856 70502 80078 111322 1841 -49444 119273 236307 174775 82000 -21822
9666 -21822 -78730 85080 590988 917626 1123985 1071479 1015686 1288905 1950520 3027504
9656 3027504 4988418 8254512 13277526 17142101 15925812 11266264 7216345 4845062
9648 4845062 3477628 2404791 1862656 1546569 1234233 1091926 880213 834215 496017
9639 496017 408006 602857 594355 377618 294684 492774 492628 315693 216097 187099 207815
$$ packed form
9710B53161j10811j23990M5325J53705l1918J8363K5416L6856o6576k43625m622
9699d8716P0468j10421J62727K10434k1856J9398k45669j51779R0205L8871j17063
9688a03401r7266J5421n0846J81R9761j10566J08340K59887N7220j88356N032
9677d593J60449q5354R576L1244j09481n1285J68717J17034o1532r2775j03822
9666b1822n6908J63810N05908L26638K06359n2506n5793K73219O61615J076984
9656C027504J960914L266094N023014L864575j216289m659548m049919k371283
9648D845062j367434j072837n42135l16087l12336j42307k11713m5998l38198
9639D96017q8011J94851q502k16737q2934J98090j46j76935r9596k8998K0716
$$ plain form
9628 207815 207613 300213 223225 396193 422979 291780 75511 -111355 184379 524688 585768
9617 585768 483882 481702 590966 379965 -48292 -276575 -292537 -129421 110055 84809
9607 84809 -42365 -133101 -8648 20499 93749 139484 -15535 -89476 105764 214839 138406
9596 138406 97586 -10337 -242653 -438731 -413808 -361011 -411983 -110266 7747 16808 -63822
9585 -63822 -124848 -149642 -230144 -104610 -38862 98333 295846 380581 255589 -3780 -315168
9574 -315168 -299289 -129477 96508 353811 346927 210231 166298 261024 141126 53939 -31785
9563 -31785 -14231 -33387 -182268 90705 132941 17722 168939 335667 317367 231688 109964
9552 109964 194462 270946 318218 339486 227412 -247817 -278314 -133576 -26249 -29109 -10629
$$ packed form
9628B07815k02R2600p6988J72968K6786j31199k16269j86866K95734L40309O1080
9617E85768j01886k180J09264k11001m28257k28283j5962J63116K39476k5246
9607H4809j27174r0736J24453K9147P3250M5735j55019p3941J95240J09075p6433
9596A38406m0820j07923k32316j96078K4923N2797n0972L01717J18013R061q0630
9585f3822o1026k4794q0502J25534O5748J37195J97513Q4735j24992k59369l11388
9574c15168J5879J69812K25985K57303o884j36696m3933R4726j19898q7187q5724
9563c1785J7554j9156j48881K72973M2236j15219J51217J66728j8300q5679j21724
9552A09964Q4498P6484M7272K1268j12074m75229l0497J44738J07327k860J8480
$$ plain form
9541 -10629 -371132 -199372 -185224 -346078 -241050 54083 106762 120179 -117786 -335423
9531 -335423 -444399 -284973 -165517 -139282 -3923 -64418 47215 -35585 -153628 -258074
9521 -258074 -323011 -310910 -335079 -228989 -386597 -385634 -247090 -177436 -58885 -106907 -263383
9510 -263383 -238992 -318124 -324468 -200379 -249941 -286464 -507758 -493767 -411047 -286025 -230660
9499 -230660 -238745 -213537 26006 28552 -6054 -105438 45902 -85202 -49509 5590 -59667
9488 -59667 -92603 -17338 47152 155177 183570 33665 242270 388783 151333 -107798 -233670
9477 -233670 -375610 -547364 -469307 -176980 -133894 -336060 -366563 -376547 -179250 -123472 -112342
9466 -112342 166058 118299 -11396 -140639 -273226 -208448 -321597 -519764 -382982 -169740
$$ packed form
9541a0629l60503J71760J4148j60854J05028K95133N2679J3417k37965k17637
9531c35423j08976J59426J19456K6235J35359o0495J11633q2800j18043j04446
9521b58074o4937J2101k4169J06090j57608R63J38544O9654J18551m8022j56476
9510b63383K4391p9132o344J24089m9562l6523k21294J3991Q2720J25022N5365
9499b30660q085K5208K39543K546l4606r9384J51340j31104L5693N5099o5257
9488e9667l2936P5265O4490J08025K8393j49905K08605J46513k37450k59131j25872
9477b33670j41940j71754P8057K92327M3086k02166l0503r984J97297N5778J1130
9466a12342K78400m7759j29695j29243j32587O4778j13149j98167J36782K13242
$$ plain form
9456 -169740 -164895 8150 293946 151806 70319 134987 193906 386491 230428 28264 144149
9445 144149 288714 348008 332101 298985 200054 181803 77400 136424 103688 -11657 -27018
9434 -27018 14034 -10447 19135 71286 121374 69602 225161 324665 242472 168081 366215
9423 366215 358049 462655 253057 101848 246416 182591 24737 15620 -59591 -158868 -172161
9412 -172161 -271927 -259773 -19971 159822 377689 484021 625019 389412 -35071 -76686
9402 -76686 -62434 -42450 -63295 200278 426994 130341 -123244 -166810 -279437 -222986 -109091
9391 -109091 -65576 98392 213490 110809 -2767 -37294 -185729 -137893 339123 271956
9381 271956 -41580 -205612 -147951 636 -113065 -67268 -74123 -222799 -138317 89155 159521
$$ packed form
9456a69740M845J73045K85796j42140q1487O4668N8919J92585j56063k02164J15885
9445A44149J44565N9294j5907l3116r8931j8251j04403N9024l2736j15345j5361
9434b7018M1052k4481K9582N2151N0088n1772J55559R9504q2193p4391J98134
9423C66215q166J04606k09598j51209J44568o3825j57854r117p5211r9277j3293
9412a72161r9766J2154K39802J79793K17867J06332J40998k35607m24483m1615
9402g6686J4252J9984k0845K63573K26716k96653k53585m3566j12627N6451J13895
9391a09091M3515J63968J15098j02681j13576l4527j48435M7836M77016o7167
9381B71956l13536j64032N7661J48587j13701M5797o855j48676Q4482K27472P0366
$$ plain form
9370 159521 231116 250168 25598 -329771 -246571 -250796 5561 146284 190175 250589 398687
9359 398687 553869 349269 126825 1021 -103324 -37447 47478 146904 18000 -48528
9349 -48528 -223650 -166493 -132085 41674 215940 133203 118036 199204 269965 357029 205662
9338 205662 91842 169192 216820 22544 42811 158881 140460 159702 83073 -20211 115577
9327 115577 193861 81128 3625 212339 -24579 -209468 -192581 -223271 -188194 37640 267857
9316 267857 256759 278791 303005 144252 -91507 -135087 -86501 -42964 92243 28503 -19495
9305 -19495 98102 50306 -265859 -390531 -247844 -430174 -540398 -435544 -443177 -401327 -227474
9294 -227474 -217940 -309647 -337205 -379901 -300466 -75206 80890 72971 64444 -62866 -177360
$$ packed form
9370A59521P1595J9052k24570l55369Q3200m225K56357J40723M3891O0414J48098
9359C98687J55182k04600k22444j25804j04345O5877Q4925R9426j28904o6528
9349d8528j75122N7157L4408J73759J74266q2737j5167Q1168P0761Q7064j51367
9338B05662j13820P7350M7628j94276K0267J16070j8421J9242p6629j03284J35788
9327A15577P8284j12733p7503K08714k36918j84889J6887l0690L5077K25834K30217
9316B67857j1098K2032K4214j58753k35759m3580M8586M3537J35207o3740m7998
9305a9495J17597m7796l16165j24672J42687j82330j10224J04854p633M1850J73853
9294b27474R534r1707k7558m2696P9435K25260J56096p919q527j27310j14494
$$ plain form
9283 -177360 -320917 -291097 -37488 134327 10998 137537 232362 442766 439178 314431
9273 314431 127029 -21090 -35421 -228638 -326712 -264992 -401890 -481074 -435591 -128544 -14113
9262 -14113 -178844 -46722 90725 31451 80078 80447 -32444 -99115 -93082 -137983 -52316 -11453
9250 -11453 16745 -30560 194045 157811 113191 49744 221661 144761 212901 230532 81131
9239 81131 168738 91084 -101533 -265375 -165987 -169118 -318752 -232002 -10312 -130695 -201660
9228 -201660 -286542 -319023 -339711 -363415 -262780 97892 132038 -116141 -334376 -465179 -129122
9217 -129122 60766 -207743 -138982 99552 106525 1310 -155069 -11906 246572 363664
9207 363664 300721 348274 168362 23883 133056 98468 -100331 199599 733 -377387
$$ packed form
9283a77360j43557K9820K53609J71815j23329J26539R4825K10404l588j24747
9273C14431j87402j48119j4331j93217r8074O1720j36898p9184M5483L07047J14431
9262a4113j64731J32122J37447n9274M8627L69j12891o6671O033m4901Q5667M0863
9250a1453K8198m7305K24605l6234m4620o3447J71917p6900O8140J7631j49401
9239H1131Q7607p7654j92617j63842R9388l131j49634Q6750K21690j20383p0965
9228b01660q4882l2481k0688k3704J00635L60672L4146k48179k18235j30803L36057
9217a29122J89888k68509O8761K38534O973j05215j56379J43163K58478J17092
9207C63664o2943M7553j79912j44479J09173l4588j98799K99930j98866l78120
$$ plain form
9197 -377387 -390104 -187151 -128280 -45906 73739 232302 355489 407246 505729 527025 406226
9186 406226 223358 -3632 75769 41083 143315 64977 -123551 50783 127514 13528
9176 13528 107897 -56153 -64275 -113714 -51019 -44025 128167 192374 72916 133338 34094 -49662
9164 -49662 -198001 -195047 -206017 -239538 -103506 -72606 199499 312380 115939 -15469 -54164
9153 -54164 -283166 -621637 -556725 -281214 -395036 -308372 -164643 -220313 -204030 54704 60931
9142 60931 25464 -71417 -43137 96104 243223 155237 115923 -20429 -115221 -310158 -251664
9131 -251664 -109387 -35179 121326 19736 -83373 -220814 9054 68730 -66998 75676
9121 75676 17498 -104941 -171398 -186854 -330879 -465114 -364952 -185613 -196517 -346241 -470556
$$ packed form
9197c77387j2717K02953N8871Q2374J19645J58563J23187N1757R8483K1296j20799
9186D06226j82868k26990P9401l4686J02232p8338j88528J74334P6731j13986
9176A3528R4369j64050q122m9439O2695O994J72192O4207j19458O0422r9244q3756
9164d9662j48339K954j0970l3521J36032L0900K72105J12881j96441j31408l8695
9153e4164k29002l38471O4912K75511j13822Q6664J43729n5670J6283K58734O227
9142F0931l5467r6881K8280J39241J47119q7986l9314j36352r4792j94937N8494
9131b51664J42277P4208J56505j01590j03109j37441K29868N9676j35728J42674
9121G5676n8178j22439o6457j5456j44025j34235J00162J79339j0904j49724j24315
$$ plain form
9110 -470556 -340900 -99012 57348 3537 10664 22970 -134320 -383227 -446662 -353521 -286465
9099 -286465 -61107 -77937 -291068 -358116 -350548 -363152 -6844 137648 -41644 83201 382358
9088 382358 359475 155221 161820 113848 104696 185853 472462 376563 255413 398394 203564
9077 203564 -259370 -435452 -445002 -326150 -348876 -486194 -297911 4310 -9131 -157852
9067 -157852 -332281 -96652 242482 314248 390233 398026 282256 361193 243044 354032 521486
9056 521486 318244 44185 9004 73446 179831 292199 259928 145962 -179111 -134265
9046 -134265 -32260 196121 62497 -73760 -31330 -79164 -29185 -19687 -4682 104246 155989
9035 155989 147441 217579 170568 371442 436591 457632 311239 118656 82783 233231 235711
$$ packed form
9110d70556J29656K41888J56360n3811P127J2306j57290k48907o3435R3141O7056
9099b86465K25358j6830k13131o7048P568j2604L56308J44492j79292J24845K99157
9088C82358k2883k04254O599m7972r152Q1157K86609r5899j21150J42981j94830
9077B03564m62934j76082r550J18852k2726j37318J88283L02221j3441j48721
9067a57852j74429K35629L39134P1766P5985P793j15770P8937j18149J10988J67454
9056E21486k03242k74059l5181O4442J06385J12368l2271j13966l25073M4846
9046a34265J02005K28381j33624j36257M2430m7834M9979R498J5005J08928N1743
9035A55989q548P0138m7011K00874O5149K1041j46393j92583l5873J50448K480
$$ plain form
9024 235711 168704 139100 66713 302634 309318 -966 -208045 -310360 -377626 -461304 -496313
9013 -496313 -498779 -331368 -277757 -403455 -406208 -201187 82973 221724 81279 51846 32046
9002 32046 -221412 -256711 -220462 -172499 12264 -4151 -107224 -4944 -17584 -119201 -225029
8991 -225029 -105624 -40431 -139346 -94755 -92905 -161197 -289692 -225360 -237658 -90768 22880
8980 22880 117438 -10973 -377546 -683412 -740490 -589565 -186794 -154228 -246765 -228083 -83042
8969 -83042 -204530 -117289 5857 -132219 41052 -32949 -236786 -248356 -275071 -300009 -349382
8958 -349382 -122053 129384 114844 99331 -32856 -88367 65171 4055 169745 396979
8948 396979 389193 219805 -13725 -128106 -162567 847 86252 107564 240111 126155 18389
$$ packed form
9024B35711o7007k9604p2387K35921O684l10284k07079j02315o7266q3678l5009
9013d96313k466J67411N3611j25698k753K05021K84160J38751j40445k9433j9800
9002C2046k53458l5299L6249M7963J84763j6415j03073J02280j2640j01617j05828
8991b25029J19405O5193r8915M4591J850o8292j28495O4332j2298J46890J13648
8980B2880R4558j28411l66573l05866n7078J50925M02771L2566r2537J8682J45041
8969h3042j21488Q7241J23146j38076J73271p4001k03837j1570k6715k4938m9373
8958c49382K27329K51437j4540j5513j32187n5511J53538o1116J65690K27234
8948C96979p786j69388k33530j14381l4461J63414Q5405K1312J32547j13956j07766
$$ plain form
8937 18389 14445 66150 170672 233467 138786 27786 -83660 -148907 -3153 -62045 -163683
8926 -163683 -278098 -80262 125927 -74904 -12946 122148 -50186 -207205 -249385 109136
8916 109136 -64621 -258453 -381843 -239180 -165560 -148224 -56405 76095 134906 114413 -98717
8905 -98717 -299311 -441655 -330267 -379034 -537230 -708039 -529209 -316678 -214964 -261639
8895 -261639 -256322 -299324 -439652 -465332 -494998 -518641 -370503 -334246 -232724 -8328 -53279
8884 -53279 -196700 -177415 -152388 -189583 -226828 -374416 -454423 -322383 -101955 -119780 -27608
8873 -27608 -26854 -22359 -167569 -180556 -2253 -53702 -151102 -327754 -148404 -24167 -141271
8862 -141271 -382604 -630459 -749298 -734494 -520650 -220411 -117145 -65332 51354 196910
$$ packed form
8937A8389l944N1705J04522O2795r4681j11000j11446o5247J45754n8892j01638
8926a63683j14415J97836K06189k00831O1958J35094j72334j57019m2180L58521
8916A09136j73757j93832j23390J42663P3620J7336R1819J32500N8811k0493k13130
8905i8717k00594j42344J11388m8767j58196j70809J78830K12531J01714m6675
8895b61639N317m3002j40328k5680k9666k3643J48138L6257J01522K24396m4951
8884e3279j43421J9285K5027l7195l7245j47588q0007J32040K20428j7825R2172
8873b7608P54M495j45210j2987J78303n1449r7400j76652J79350J24237j17104
8862a41271k41333k47855j18839J4804K13844L00239J03266N1813J16686J45556
$$ plain form
8852 196910 75244 -52510 -100233 -116808 -79389 -83378 41504 -51158 116858 242679 263558
8841 263558 224648 301534 149113 -357320 -340140 -211840 -139490 146569 154916 -69169 156768
8830 156768 208570 190048 -58579 153854 -766 -239890 -359006 -309413 -351864 -535139
8820 -535139 -563302 -393788 -324231 -376952 -446933 -525708 -635686 -392622 10041 52725 -202550
8809 -202550 -325227 -430532 -541232 -562485 -355889 -306222 -392739 -522508 -517442 -385575 -137881
8798 -137881 -221982 -159066 -33497 -137759 -409399 -428503 -585416 -517979 -209772 -163353 -25122
8787 -25122 -103448 -309509 -220998 626 -105886 -108690 -338077 -495943 -274220 -90008 -64138
8776 -64138 -19701 -168611 -224245 -126916 -117079 159142 174524 162283 264442 377622 90565
$$ packed form
8852A96910j21666j27754m7723j6575L7419l989J24882r2662J68016J25821K0879
8841B63558l8910P6886j52421n06433J7180J28300P2350K86059Q347k24085K25937
8830A56768N1802j8522k48627K12433j54620k39124j19116M9593m2451j83275
8820e35139k8163J69514O9557n2721o9981p8775j09978K43064M02663M2684k55275
8809b02550j22677j05305j10700k1253K06596M9667q6517j29769N066J31867K47694
8798a37881q4101O2916J25569j04262k71640j9104j56913O7437L08207M6419J38231
8787b5122p8326k06061Q8511K21624j06512k804k29387j57866K21723J84212K5870
8776f4138M4437j48910n5634R7329R837K76221J5382j2241J02159J13180k87057
$$ plain form
8765 90565 76189 66005 124405 -1631 -171831 -101056 184293 173436 -15478 -216707 -149571
8754 -149571 -54491 -85227 40372 88330 51751 53627 105378 -91640 -134756 -180213 -323266
8743 -323266 -366529 -107421 5868 50501 77006 99380 267532 164207 176263 41506 180232
8732 180232 379700 412445 269699 318049 307791 199600 190858 -68769 -101629 8196 128786
8721 128786 274606 237669 154043 98306 38604 89817 318353 347170 293737 160596 110204
8710 110204 115860 48523 -85974 -63868 29590 116835 296602 439995 592320 574279 276857
8699 276857 365814 703386 1052644 1108478 887012 642000 534137 420159 226614 189061
8689 189061 186332 32282 -186468 -323150 -289090 -19530 27156 59231 -64381 -123183 -183000
$$ packed form
8765I0565j4376j0184N8400j26036j70200P0775K85349j0857j88914k01229O7136
8754a49571R5080l0736J25599M7958l6579J876N1751j97018m3116m5457j43053
8743c23266m3263K59108J13289M4633K6505K2374J68152j03325J2056j34757J38726
8732A80232J99468L2745j42746M8350j0258j08191q742k59627l2860J09825J20590
8721A28786J45820l6937q3626n5737n9702N1213K28536K8817n3433j33141n0392
8710A10204N656o7337j34497K2106R3458Q7245J79767J43393J52325j8041k97422
8699B76857Q8957L37572L49258N5834k21466k45012j07863j13978j93545l7553
8689A89061k729j54050k18750j36682L4060K69560M6686L2075j23612n8802n9817
$$ plain form
8678 -183000 -214200 -174443 -107155 117671 449497 353895 119410 -148840 18506 152273
8668 152273 109845 -142421 -375813 -262276 -145372 191552 282721 329147 269173 281502 310274
8657 310274 268173 265180 535777 687061 721625 824533 828712 617427 436861 177551 -79120
8646 -79120 -122431 -332501 -415346 -104787 196278 226405 258558 270511 201500 282151 210529
8635 210529 245739 372910 485030 292503 286452 523635 458086 556025 304414 318125 251328
8624 251328 261411 346752 341546 309693 367988 484494 736424 837915 789785 782376 728432
8613 728432 618770 419591 451365 578111 539248 769486 953263 801170 863784 924548
8603 924548 896695 699982 801811 839187 915442 860775 897020 1223232 1461579 1504108 1699480
$$ packed form
8678a83000l1200L9757O7288K24826L31826r5602k34485k68250J67346J33767
8668A52273m2428k52266k33392J13537J16904L36924R1169M6426n9974J2329K8772
8657C10274m2101k993K70597J51284L4564J02908M179k11285j80566k59310k56671
8646g9120m3311k10070q2845L10559L01065L0127L2153J1953o9011Q0651p1622
8635B10529L5210J27171J12120j92527o051K37183o5549R7939k51611J3711o6797
8624B51328J0083Q5341n206l1853N8295J16506K51930J01491m8130p409n3944
8613G28432j09662j99179L1774J26746l8863K30238J83777j52093O2614O0764
8603I24548k7853j96713J01829L7376P6255n4667L6245L26212K38347M2529J95372
$$ plain form
8592 1699480 1707918 1656326 1629444 1743742 1877323 2099637 2273867 2382477 2453197 2936570
8582 2936570 3408210 3363660 2995449 2993025 2800736 2646419 2556117 2158396 2324457 2466379
8572 2466379 2512772 2404961 2519341 2418193 2030650 1871688 1234406 1063869 1074646 1285266
8562 1285266 1172383 1151568 1216928 883846 750203 601607 362076 266057 478932 612813
8552 612813 426510 424207 581049 585984 614276 588714 416745 301883 423247 612967 698944
8541 698944 926732 1006430 1056637 1061739 1115140 1213213 1661185 2668208 3806042 5885724
8531 5885724 8688752 9803861 8595934 6536175 5074550 4406320 4111406 3396949 2849276
8522 2849276 2070912 1533444 1305498 1062346 1028044 1098091 1282057 1284847 1048953 600774
$$ packed form
8592A699480Q438n1592k6882J14298J33581K22314J74230J08610P0720M83373
8582B936570M71640m4550l68211k424j92289j54317r0302l97721J66061J41922
8572B466379M6393j07811J14380j01148l87543j58962o37282j70537J0777K10620
8562A285266j12883k0815O5360l33082j33643j48596k39531r6019K12875J33881
8552F12813j86303k303J56842M935K8292k5562j71969j14862J21364J89720Q5977
8541F98944K27788P9698N0207N102N3401R8073M47972J007023J137834K079682
8531E885724K803028J115109j207927k059759j461625o68230k94914p14457n47673
8522B849276p78364n37468k27946k43152l4302P0047J83966K790k35894m48179
$$ plain form
8512 600774 528498 583846 533962 696278 858601 912088 766491 407469 359465 427226 375682
8501 375682 385462 601332 477940 653967 746834 618669 612374 664720 745798 1037138 1669446
8490 1669446 2349149 3593405 5760615 9717556 15637141 18619294 16029514 11515468
8482 11515468 7908068 5198875 3906740 3155384 2318093 1659947 1327902 1282736 1136672
8473 1136672 831855 660884 772574 950384 911414 659485 476885 408883 454877 415877
8463 415877 496892 258780 338081 389041 534254 511724 388536 386312 352718 400724 442168
8452 442168 451584 604292 949707 735753 580794 641599 781910 1211966 1896773 3085596
8442 3085596 5008166 7611140 9208656 8194025 5749979 3643936 2318913 1861423
$$ packed form
8512F00774p2276N5348m9884J62316J62323N3487j45597l59022m8004O7761n1544
8501C75682R780K15870j23392J76027R2867j28165o295N2346Q1078K91340O32308
8490A669446O79703J244256K167210L956941N919585K982153k589780m514046
8482A1515468l607400k709193j292135p51356q37291o58146l32045m5166j46064
8473A136672l04817j70971J11690J77810l8970k51929j82600o8002M5994l9000
8463D15877Q1015k38112P9301N0960J45213k2530j23188k224l3594M8006M1444
8452D42168R416J52708L45415k13954j54959O0805J40311M30056O84807J188823
8442C085596J922570K602974J597516j014631k444046k106043j325023m57490
$$ plain form
8434 1861423 1752156 1463743 1113907 856849 618080 530670 477718 446318 288294 153542
8424 153542 483994 440784 237758 263015 237949 259088 258047 266876 361641 330697 137832
8413 137832 180237 134801 143720 221210 228004 9194 62598 89724 53320 -112975 -100228 80728
8401 80728 178754 -18852 -373962 -316540 -123645 181552 270079 322266 228793 -136447 -305399
8390 -305399 -217513 -27577 89396 103109 301620 376883 87514 -80852 43715 302734
8380 302734 329607 326352 155635 70283 -59988 -47065 116349 226511 420938 446385 419629
8369 419629 371426 347855 406117 596308 675297 536092 573261 587869 501989 607252 553803
8358 553803 491150 242767 102432 111059 275881 402239 429233 716656 692236 575843 671884
$$ packed form
8434A861423j09267k88413l49836k57058k38769q7410n2952l1400j58024j34752
8424A53542L30452m3210k03026K5257k5066K1139j041Q829R4765l0944j92865
8413A37832M2405m5436Q919P7490O794k18810N3404K7126l6404j66295J2747J80956
8401H0728R8026j97606l55110N7422J92895L05197Q8527N2187r3473l65240j68952
8390c05399Q7886J89936J16973J3713J98511P5263k89369j68366J24567K59019
8380C02734K6873l255j70717q5352j30271J2923J63414J10162J94427K5447k6756
8369D19629m8203k3571N8262J90191P8989j39205L7169J4608q5880J05263n3449
8358E53803o2653k48383j40335Q627J64822J26358K6994K87423k4420j16393R6041
$$ plain form
8347 671884 1141836 1661759 2239759 2543844 2044304 1566555 1056086 559819 166950 243102
8337 243102 301599 301971 206566 224218 302830 125678 -104060 -56492 -94331 -30556 -177989
8326 -177989 -315890 -282481 -277325 -274006 -416060 -314180 -95491 -3243 -5537 -54052 -67732
8315 -67732 -200435 -390249 -222376 139451 220731 401528 451564 286837 198209 442913
8305 442913 412813 853944 1734475 2614160 3814515 4741049 4087855 2833721 1765962
8296 1765962 997285 595758 446079 448908 442553 243996 56576 144261 -18882 225387
8286 225387 412721 307272 74562 -72444 203702 263299 194078 227160 139978 88028 4283
8275 4283 -183493 -337431 -477229 -386356 -54857 219220 100444 50177 -148344 -451737
$$ packed form
8347F71884M69952N19923N78000L04085m99540m77749n10469m96267l92869P6152
8337B43102N8497L72r5405J7652P8612j77152k29738M7568l7839O3775j47433
8326a77989j37901L3409N156L319j42054J01880K18689R2248k294m8515j3680
8315f7732j32703j89814J67873L61827Q1280J80797N0036j64727q8628K44704
8305D42913l0100M41131Q80531Q79685J200355R26534o53194j254134j067759
8296A765962p68677m01527j49679K829o355j98557j87420Q7685j63143K44269
8286B25387J87334j05449k32710j47006K76146N9597o9221L3082q7182n1950q3745
8275D283j87776j53938j39798R0873L31499K74077j18776n0267j98521l03393
$$ plain form
8265 -451737 -503348 -295557 99223 227465 292060 540729 656248 989378 1742385 2199133
8255 2199133 2242998 1817196 1334563 958984 658252 370254 324587 126281 167554 201971
8245 201971 147179 82696 -53527 -160414 168496 210074 186044 366074 344841 312833 34642
8234 34642 -196993 -213396 -395854 -577410 -521046 -408520 -380444 -116291 -18520 -99966 -89907
8223 -89907 -32747 239971 180650 -50436 -144747 -81592 -343952 -438685 -354440 -113598 -182855
8212 -182855 -236879 -60040 -48871 -31548 -107417 -360883 -156226 133064 -116419 -217192
8202 -217192 -64223 -74435 -173865 -460203 -459015 -178405 180317 29933 -37135 -46799 196966
8191 196966 508676 399083 210672 -76237 -261314 -154101 -128325 -197152 -191989 -88014
$$ packed form
8265d51737n1611K07791L94780J28242O4595K48669J15519L33130P53007M56748
8255B199133M3865m25802m82633l75579l00732k87998m5667j98306M1273L4417
8245B01971n4792o4483j36223j06887L28910M1578k4030J80030k1233l2008k78191
8234C4642k31635j6403j82458j81556N6364J12526K8076K64153R7771q1446J0059
8223h9907N7160K72718n9321k31086r4311O3155k62360r4733Q4245K40842o9257
8212a82855n4024J76839J1169J7323p5869k53466K04657K89290k49483j00773
8202b17192J52969j0212r9430k86338J188K80610L58722j50384o7068r664K43765
8191A96966L11710j09593j88411k86909j85077J07213K5776o8827N163J03975
$$ plain form
8181 -88014 229951 467977 338452 369831 331131 461598 565954 559970 756880 705148 505067
8170 505067 412783 724803 908997 1047561 1194121 1330736 1741231 2058151 2617516 3408166
8160 3408166 4414136 5968640 8643234 12165764 15820088 18365061 18679632 16689696
8152 16689696 13409023 10199201 7902557 6499430 5643133 5088202 5013761 5348051 6113896
8143 6113896 7694468 10502394 14454092 18973787 22238499 21563767 17775834 13450197
8135 13450197 9711503 7120283 5537927 4493269 3790403 3294542 2818334 2459027 2209019
8126 2209019 2111195 2033459 2026351 1984621 1859675 1697675 1759308 1747789 1585510 1435873 1354240
8115 1354240 1423679 1295958 1434761 1878652 2261542 2877512 3708733 4807639 5929563
$$ packed form
8181h8014L17965K38026j29525L1379l8700J30467J04356n984J96910n1732k00081
8170E05067r2284L12020J84194J38564J46560J36615M10495L16920N59365P90650
8160C408166J005970J554504K674594L522530L654324K544973L14571j989936
8152A6689696l280673l209822k296644j403127q56297n54931p4441L34290P65845
8143F113896J580572K807926L951698M519695L264712o74732l787933m325637
8135A3450197l738694k591220j582356j044658p02866m95861m76208l59307k50008
8126B209019r7824p7736p108m1730j24946j62000O1633j1519j62279j49637q1633
8115A354240O9439j27721J38803M43891L82890O15970Q31221J098906J121924
$$ plain form
8106 5929563 5994674 5284606 4117162 3012148 2297932 1792993 1518651 1224458 903732
8097 903732 618392 366613 498024 313412 447702 498935 410385 479358 514726 569420 513055
8086 513055 534446 564826 548982 482969 489014 758697 779176 640623 288743 257163 583021
8075 583021 612405 578304 483091 133285 -112364 -7910 72753 -27655 -312990 -277366 -244849
8064 -244849 -79269 53422 129462 334798 360225 350179 373687 303106 388147 444083 176444
8053 176444 309210 123984 -250381 -157538 30635 82692 332530 244203 -143574 -274979
8043 -274979 -54194 144168 16996 233657 387676 163168 155569 386761 221416 299339
8033 299339 459203 365650 316425 490512 584882 797460 629154 417964 412466 426334 474604
$$ packed form
8106E929563O5111p10068j167444j105014p14216n04939k74342k94193l20726
8097I03732k85340k51779J31411j84612J34290N1233q8550O8973L5368N4694n6365
8086E13055K1391L0380j5844o6013O045K69683K0479j38553l51880l1580L25858
8075E83021K9384l4101r5213l49806k45649J04454Q0663j00408k85335L5624L2517
8064b44849J65580J32691P6040K05336K5427j0046K3508p0581Q5041N5936k67639
8053A76444J32766j85226l74365R2843J88173N2057K49838q8327l87777j31405
8043b74979K20785J98362j27172K16661J54019k24508p599K31192j65345P7923
8033B99339J59864r3553m9225J74087R4370K12578j68306k11190n498J3868M8270
$$ plain form
8022 474604 604207 525532 563811 828098 1400727 2079725 2724796 3265898 3906630 4163798
8012 4163798 3758135 3184027 2543604 2190627 1867010 1649441 1591111 1397606 1086301 932833
8002 932833 887350 902033 939896 973411 978680 1045658 1260998 1220977 1239931 1402096 1526235
7991 1526235 1421058 1378617 1501143 1820382 2043564 2013192 2450258 3205337 4516344 6266863
7981 6266863 7593703 8114976 8054739 8561113 9813123 11219062 10815987 8716529 6365811
7972 6365811 4850857 4147144 3646916 3467838 3429726 3723708 4853848 6775147 10095541
7963 10095541 13948731 15110910 13178356 9757560 6770183 5141626 4071893 3379709
7955 3379709 2727074 2323282 2325921 2122240 1708464 1668600 1696006 1836589 1833142 1982079 1929400
$$ packed form
8022D74604J29603p8675L8279K64287N72629O78998O45071N41102O40732K57168
8012D163798m05663n74108o40423l52977l23617k17569n8330j93505l11305j53468
8002I32833m5483J4683L7863L3515N269O6978K15340m0021J8954J62165J24139
7991A526235j05177m2441J22526L19239K23182l0372M37066P55079J311007J750519
7981F266863J326840N21273o0237N06374J252010J405939m03075k099458k350718
7972F365811j514954p03713n00228j79078l8112K93982J130140J921299L320394
7963A0095541L853190J162179j932554l420796k987377j628557j069733o92184
7955C379709o52635m03792K639k03681m13776l9864K7406J40583l447J48937n2679
$$ plain form
7944 1929400 1908797 1901868 1606093 1542734 1555078 1349319 1373060 1346028 1284909 1244321 1104349
7933 1104349 845498 686027 733580 818917 1132254 716463 482314 403500 414581 403187
7923 403187 377776 279859 373731 544992 499843 373324 286682 273230 389637 318476 393955
7912 393955 641416 579655 365191 225487 97169 287231 707444 805856 799447 673477
7902 673477 568493 480960 345701 205871 222348 15072 -136139 -3205 175791 291620
7892 291620 320038 385186 346331 52078 81780 189871 267761 445131 373697 364309 406509
7881 406509 315572 298066 374550 304977 243791 280437 271204 423750 473667 341435 91860
7870 91860 -147266 -121108 2599 251168 199949 161390 261058 208372 79646 187371 386364
$$ packed form
7944A929400k0603o929k95775o3359J2344k05759K3741k7032o1119m0588j39972
7933A104349k58851j59471M7553Q5337L13337m15791k34149p8814J1081j1394
7923D03187k5411r7917R3872J71261m5149j26519q6642j3452J16407p1161P5479
7912C93955K47461o1761k14464j39704j28318J90062M20213R8412o409j25970
7902F73477j04984q7533j35259j39830J6477k07276j51211J32934J78996J15829
7892B91620K8418O5148l8855k94253K9702J08091P7890J77370p1434r388M2200
7881D06509r0937j7506P6484o9573o1186L6646r233J52546M9917j32232k49575
7870I1860k39126K6158J23707K48569n1219l8559R9668n2686j28726J07725J98993
$$ plain form
7859 386364 330152 182044 13090 1752 -137104 45728 30109 95689 -30028 -194620
7849 -194620 60167 286490 113202 -118418 -54776 115878 433770 381815 376252 457126 244523
7838 244523 258387 106114 -52229 -20979 -85050 -99608 -116245 -115217 264623 161454 -141469
7827 -141469 -124138 -97593 -95067 -62960 -50336 60715 -92336 -63937 -103194 -193636 -303495
7816 -303495 -195703 120470 235560 279973 354127 209311 147850 144485 50720 91433 358481
7805 358481 450098 359330 328513 51780 -106528 -120208 -284930 -309342 -199768 -97642 -61814
7794 -61814 -142299 -169949 -84518 42527 28145 1419 70981 114658 32577 -37083 -80692 -235913
7782 -235913 -185289 -122671 10700 191631 315920 248332 405282 265317 -5924 -212656
$$ packed form
7859C86364n6212j48108j68954j1338j38856J82832j5619O5580j25717j64592
7849a94620K54787K26323j73288k31620O3642J70654L17892n1955n563Q0874k12603
7838B44523J3864j52273j58343L1250o4071j4558j6637J028L79840j03169l02923
7827a41469J7331K6545K526L2107J2624J11051j53051K8399l9257r0442j09859
7816c03495J07792L16173J15090M4413P4154j44816o1461l365r3765M0713K67048
7805C58481R1617r0768l0817k76733j58308j3680j64722k4412J09574J02126L5828
7794f1814q0485k7650Q5431J27045j4382k6726O9562M3677q2081o9660m3609j55221
7782b35913N0624O2618J33371J80931J24289o7588J56950j39965k71241k06732
$$ plain form
7772 -212656 -306475 -400195 -410754 -361285 -379179 -384309 -318915 -117008 102230 119795 159277
7761 159277 -4179 -292573 -192573 -429010 -385337 -114897 85752 104520 -8134 -133676
7751 -133676 107345 141568 -134408 -286408 -330241 -450012 -353195 -363817 -327243 -281148 -172602
7740 -172602 -190025 -342573 -313140 -219446 -215286 94361 -30471 -228504 -358430 -185434 112001
7729 112001 291583 -182794 -394005 -290780 -162005 -179813 -320864 -246063 -30873 1685
7719 1685 221184 293583 2900 -41596 146650 64315 -34690 54230 111271 -80736 -332326
7708 -332326 -548049 -613648 -582183 -619395 -425763 -310991 -191775 40466 4481 -154187
7698 -154187 -205671 -128231 -130616 -206079 -130962 -20365 25730 -197145 -415455 -507944 -185935
$$ packed form
7772b12656r3819r3720j0559M9469j7894n130O5394K01907K19238J7565L9482
7761A59277j63456k88394J00000k36437M3673K70440K00649J8768j12654j25542
7751a33676K41021L4223k75976j52000m3833j19771R6817j0622L6574M6095J08546
7740a72602j7423j52548K9433R3694M160L09647j24832j98033j29926J72996K97435
7729A12001J79582m74377k11211J03225J28775j7808j41051P4801K15190L2558
7719A685K19499P2399k90683m4496J88246q2335r9005Q8920N7041j92007k51590
7708c32326k15723o5599L1465l7212J93632J14772J19216K32241l5985j58668
7698a54187n1484P7440k385p5463P5117J10597M6095k22875k18310r2489L22009
$$ plain form
7687 -185935 149313 310164 236814 -70941 154947 30439 -32724 75093 17673 7344
7677 7344 -59237 145 -106423 -11837 153005 179143 -81786 -222825 -207281 -90255 138940
7666 138940 -40547 -42019 -54754 -128813 152032 91238 105037 -17991 -103949 9238 37473
7655 37473 -159483 -477515 -563562 -490090 -364273 -367424 -361965 -329280 -492028 -425921 -210120
7644 -210120 -419269 -452830 -267155 125803 112149 35758 -88899 -236489 -216570 -270994 -319770
7633 -319770 -371546 -346539 -195292 32935 -37079 -215953 -332050 -262652 -185402 -295589 -293009
7622 -293009 -419964 -207797 170608 22553 -210715 -167754 16668 80889 -16304 -25450 -96285
7611 -96285 -127445 -81030 -45452 -80698 -194752 -334454 -278344 -314342 -283723 -134717 -169011
$$ packed form
7687a85935L35248J60851p3350l07755K25888j24508o3163J07817n7420j0329
7677G344o6581N9382j06568R4586J64842K6138k60929j41039J5544J17026K29195
7666A38940j79487j472j2735p4059K80845o0794J3799j23028q5958J13187K8235
7655C7473j96956l18032q6047P3472J25817l151N459L2685j62748O6107K15801
7644b10120k09149l3561J85675L92958j3654p6391j24657j47590J9919n4424m8776
7633c19770n1776K5007J51247K28227p0014j78874j16097O9398P7250j10187K580
7622b93009j26955K12167L78405j48055k33268M2961J84422O4221r7193r146p0835
7611i6285l1160M6415L5578l5246j14054j39702N6110l5998L0619J49006l4294
$$ plain form
7600 -169011 92695 105347 -95251 -167000 -171146 -137518 98622 133673 -216455 -309196 -133462
7589 -133462 -121748 -85554 -370494 -616449 -429731 -371831 -278714 -251688 -222639 -160464 -139811
7578 -139811 -25672 160451 53248 11773 -149418 -340162 -390477 -202735 -51493 -209783
7568 -209783 -184006 -418892 -156995 -147541 -153964 -330939 -415086 -501187 -592893 -435611 -100744
7557 -100744 -49182 -183557 -335868 -365240 -272854 -143856 -212415 -333328 -299068 -53951 44546
7546 44546 58535 51134 -37296 -131333 -59669 -321850 -177487 119010 101167 -12484 -70054
7535 -70054 -147675 51044 -118969 -425413 -396648 -111298 -70679 -225615 -310306 -165223 -179764
7524 -179764 183499 375222 315321 97436 103590 442253 387600 132775 82518 11902 58139
$$ packed form
7600a69011K61706J2652k00598p1749m146L3628K36140L5051l50128r2741J75734
7589a33462J1714L6194k84940k45955J86718N7900R3117K7026K9049O2175K0653
7578a39811J14139J86123j07203m1475j61191j90744n0315J87742J51242j58290
7568b09783K5777k34886K61897R454o423j76975q4147q6101r1706J57282L34867
7557a00744N1562j34375j52311k9372R2386J28998o8559j20913L4260K45117R8497
7546D4546J3989p401q8430r4037P1664k62181J44363K96497j7843j13651n7570
7535g0054p7621J98719j70013l06444K8765K85350M0619j54936q4691J45083j4541
7524a79764L63263J91723n9901k17885O154L38663n4653k54825n0257p0616M6237
$$ plain form
7513 58139 -19469 -154712 -323721 -134468 86373 98320 -59256 -5228 38328 19538 -167629
7502 -167629 -222130 -197931 -24837 67945 102799 149701 -31546 -108263 -79711 -358740 -611899
7491 -611899 -866018 -635918 -473050 -621118 -432932 -288661 -216277 -58930 115399 281616
7481 281616 256917 176882 181544 95751 -11414 -67683 -279233 -198670 -140722 -240950 -161743
7470 -161743 -1216 31067 8648 -29645 -93705 293368 355114 168814 8994 51000 -60854
7459 -60854 -220694 -32632 116503 49018 -163691 -240981 -299654 -446033 -402363 -253057 -93950
7448 -93950 -138344 -298053 -622800 -464889 -355871 -331966 -305362 -29244 43061 -115341 -78387
7437 -78387 -98423 -77307 -269134 -525097 -429343 -252031 -326860 -298195 -243943 -106993 -183029
$$ packed form
7513E8139p7608j35243j69009J89253K20841J1947j57576N4028M3556j8790j87167
7502a67629n4501K4199J73094R2782L4854M6902j81247p6717K8552k79029k53159
7491f11899k54119K30100J62868j48068J88186J44271P2384J57347J74329J66217
7481B81616k4699q0035M662q5793j07165n6269k11550Q0563N7948j00228P9207
7470a61743J60527L2283k2419l8293o4060L87073O1746j86300j59820M2006j11854
7459f0854j59840J88062J49135o7485k12709p7290n8673j46379M3670J49306J59107
7448i3950m4394j59709l24747J57911J09018K3905K6604K76118P2305j58402L6954
7437g8387k0036K1116j91827k55963R5754J77312p4829K8665N4252J36950p6036
$$ plain form
7426 -183029 -119892 -112065 -165325 -30422 113589 1581 -64349 -263959 -145349 -172858 -84630
7415 -84630 -9721 -30573 123266 6255 -49030 17652 153419 106480 -36060 -415457 -582552
7404 -582552 -502748 -243044 -232430 -224282 -288664 -474437 -660243 -375402 -183696 -204747 -286454
7393 -286454 -384869 -200883 98844 96933 88371 148198 245332 72076 -6632 -181257 -374927
7382 -374927 -363096 -230939 -349479 -262565 -90818 -118595 -66507 -124292 -264790 -227508 -345224
7371 -345224 -476223 -375881 -459559 -308324 -172656 -148861 256260 373682 313663 270528
7361 270528 341610 322486 178470 102840 -151464 -168041 -77606 -246643 -254460 -246786 -205032
7350 -205032 -219369 -211868 -132749 -94513 -94422 -191741 -177348 -109965 -52475 -5650 -252032 -497789
$$ packed form
7426a83029O3137P827n3260J34903J44011j12008o5930j99610J18610k7509Q8228
7415h4630P4909k0852J53839j17011n5285O6682J35767m6939j42540l79397j67095
7404e82552P9804K59704J0614Q148o4382j85773j85806K84841J91706k1051q1707
7393b86454r8415J83986K99727j911q562N9827R7134j73256p8708j74625j93670
7382c74927J1831J32157j18540Q6914J71747k7777N2088n7785j40498L7282j17716
7371c45224j30999J00342q3678J51235J35668K3795M05121J17422o0019m3135
7361B70528P1082j9124j44016p5630k54304j6577R0435j69037p817P674M1754
7350b05032j4337P501P9119L8236R1r7319J4393O7383N7490M6825k46382k45757
$$ plain form
7338 -497789 -334257 -294449 -323595 -317343 -323295 18757 316958 399902 482435 338022 199538
7327 199538 63941 -46988 -93561 -317626 -166220 -16142 -136687 -18437 61573 273325
7317 273325 107405 4728 187425 249268 286830 317918 229457 248489 242718 77348 20466
7306 20466 37369 -179133 -225010 -113983 45538 56453 -24518 688 44618 36442 100798
7295 100798 276674 127896 64452 142635 109173 160294 117336 32837 -167308 -374702 -202488
7284 -202488 -236436 -418709 -312801 -477491 -427539 -273997 -116925 -151024 -231438 -80992
7274 -80992 23064 -51441 -32382 26147 56339 120073 -99097 -221589 -9581 -40969 -149893
7263 -149893 -105033 30651 109334 215681 326243 281136 261425 77929 -19742 191169 364837
$$ packed form
7338d97789J63532L9808k9146O252n952L42052K98201Q2944Q2533j44413j38484
7327A99538j35597j10929m6573k24065J51406J50078j20545J18250Q0010K11752
7317B73325j65920j02677J82697O1843L7562L1088q8461J9032n771j65370n6882
7306B0466J6903k16502m5877J11027J59521J0915q0971K5206M3930q176O4356
7295A00798J75876j48778o3444P8183l3462N1121m2958q4499k00145k07394J72214
7284b02488l3948j82273J05908j64690M9952J53542J57072l4099q0414J50446
7274h0992J04056p4505J9059N8529L0192O3734k19170j22492K12008l1388j08924
7263a49893M4860J35684P8683J06347J10562m5107j9711j83496r7671K10911J73668
$$ plain form
7252 364837 240743 323499 220671 151959 93154 86981 -50235 -9198 -52530 -35522 -331999
7241 -331999 -458717 -286610 -286621 -51175 -241221 -176157 -83372 -131890 -195353 -150368 -313170
7230 -313170 -528058 -528321 -296835 -378418 -459590 -315223 -305042 -336749 -342441 -161375 -144604
7219 -144604 -163427 -167700 -249642 -362989 -295950 -188986 -30410 40050 -98914 -306811 -459146
7208 -459146 -403492 -464422 -430597 -63051 37040 -116145 -531424 -563813 -391105 -301868 -202407
7197 -202407 -78492 -162421 -291195 -310078 -368565 -413819 -279607 -207002 -212743 -74160 154683
7186 154683 10585 -314073 -86539 -100283 -156006 -130365 -343707 -510965 -423517 -225386
7176 -225386 185384 255581 31374 -150518 -187347 -250984 -148518 -144862 -105550 -31978 122551
$$ packed form
7252C64837j24094Q2756j02828o8712n8805o173j37216M1037m3332J7008k96477
7241c31999j26718J72107j1K35446j90046O5064R2785m8518o3463M4985j62802
7230c13170k14888k63K31486q1583q1172J44367J0181l1707n692J81066J6771
7219a44604j8823m273q1942j13347O7039J06964J58576P0460j38964k07897j52335
7208d59146N5654o0930L3825L67546J00091j53185m15279l2389J72708Q9237R9461
7197b02407J23915q3929j28774j8883n8487m5254J34212P2605n741J38583K28843
7186A54683j44098l24658K27534j3744n5723K5641k13342j67258Q7448J98131
7176b25386M10770P0197k24207j81892l6829o3637J02466L656L9312P3572J54529
$$ plain form
7165 122551 176637 262706 170736 49600 -656 126110 193371 73990 -23488 -26971 29342
7154 29342 -120097 -28821 -21984 -5949 61532 67146 -112211 -227822 -213347 -310227 -305209 -67578
7142 -67578 238771 99178 -75152 -108268 -117404 35065 162160 107956 111406 -51449 72023
7131 72023 48768 -40569 -46608 -60960 -113831 -97154 -206423 -127854 33297 104961 129140 -170798
7119 -170798 -303426 -362884 -304251 -401368 -363081 -109023 26786 -70914 -242414 -134291 86142
7108 86142 55981 22232 -203967 -417310 -149596 -78507 -108154 -254564 -256104 -163249 17478
7097 17478 152306 -120535 -375878 -410771 -414218 -355428 -170089 24087 -24368 -80372 -90231
7086 -90231 -156408 -176950 -131566 98380 29396 -33411 -64266 -138364 -246391 -500429 -607329
$$ packed form
7165A22551N4086Q6069r1970j21136n0256J26766O7261j19381r7478l483N6313
7154B9342j49439R1276O837J6035O7481N614j79357j15611J4475r6880N018K37631
7142f7578L06349j39593j74330l3116r136J52469J27095n4204L450j62855J23472
7131G2023k3255q9337o039j4352n2871J6677j09269P8569J61151P1664K4179k99938
7119a70798j32628n9458N8633r7117L8287K54058J35809r7700j71500J08123K20433
7108H6142l0161l3749k26199k13343K67714P1089k9647j46410j540R2855J80727
7097A7478J34828k72841k55343l4893l447N8790J85339J94176m8455n6004r859
7086i0231o6177k0542M5384K29946o8984o2807l0855p4098j08027k54038j06900
$$ plain form
7075 -607329 -396642 -482183 -491100 -322565 -549678 -388800 -118200 -202721 -307672 -403602 -348773
7064 -348773 -400935 -303354 -241938 -323477 -194907 -10192 63236 -94144 -11583 -16176 -62435
7053 -62435 2871 -161976 -379945 -381547 -291623 -235044 -153298 -176541 -189386 -193949 -215495 -393
7041 -393 -124572 -112619 -242973 -133471 -49009 -766 -2480 52168 12173 30312 -155529 -72865
7029 -72865 157475 -13507 -282899 -314566 -295992 -62477 -20827 -45280 120051 -105639 -422027
7018 -422027 -440004 -419126 -405266 -209069 -341349 -199897 -247586 -147514 84598 38601 -92211
7007 -92211 -234791 -292431 -427662 -325762 12452 264961 352905 556108 495911 591142 695839
6996 695839 665722 487194 361054 209317 -59448 -178017 -128941 -307131 -148002 46812
$$ packed form
7075f07329K10687q5541q917J68535k27113J60878K70600q4521j04951r5930N4829
7064c48773n2162R7581O1416q1539J28570J84715P3428j57380Q2561m593m6259
7053f2435O5306j64847k17969j602Q9924N6579Q1746k3243j2845m563k1546K15102
7041c93j24179J1953j30354J09502Q4462M8243j714N4648l9995J8139j85841Q2664
7029g2865K30340j70982k69392l1667J8574K33515M1650k4453J65331k25690l16388
7018d22027j7977K0878J3860J96197j32280J41452m7689J00072K32112m5997j30812
7007i2211j42580n7640j35231J01900L38214K52509Q7944K03203o0197R5231J04697
6996F95839l0117j78528j26140j51737k68765j18569M9076j78190J59129J94814
$$ plain form
6986 46812 -116826 -79444 -112735 -180106 -27271 312127 534503 509116 460188 96709 -34434
6975 -34434 265722 397331 374720 276351 137407 -28922 -190660 -111476 -56995 -157131 -101469
6964 -101469 279753 731418 893937 664233 503277 404814 611713 706219 690016 497506
6954 497506 458517 376440 511259 462280 176642 165947 283789 623025 773720 842731 1232757
6943 1232757 1709852 2343624 3178101 4733587 6782000 9988079 13280227 14502294 12858725
6934 12858725 9753000 6775873 4920948 3775498 2826000 1988274 1297162 1097391 1196277
6925 1196277 1177895 1187434 1134781 1172522 1143541 952832 1036827 1073962 1051840 1069472 1124437
6914 1124437 1054416 981593 1262026 1631540 2142606 2974092 4130779 5987421 8807699
$$ packed form
6986D6812j63638L7382l3291o7371J52835L39398K22376k5387m8928l63479j31143
6975c4434L00156J31609k2611r8369j38944j66329j61738P9184N4481j00136N5662
6964a01469L81222M51665J62519k29704j60956r8463K06899R4506j6203j92510
6954D97506l8989q2077J34819m8979k85638j0695J17842L39236J50695O9011L90026
6943A232757M77095O33772Q34477J555486K048413L206079L292148J222067j643569
6934A2858725l105725k977127j854925j145450r49498q37726o91112j99771R8886
6925A196277j8382R539n2653L7741k8981j90709Q3995L7135k2122J7632N4965
6914A124437p0021p2823K80433L69514N11066Q31486J156687J856642K820278
$$ plain form
6905 8807699 12078291 15453483 18617214 18868311 15482767 11225450 7949448 5667038
6897 5667038 4052634 2925208 2366716 2010376 1532775 1202979 980722 873965 1051563
6888 1051563 1010863 1072001 1056625 1105028 1358068 1410596 1266391 1093033 821409 574196
6878 574196 577919 494510 282457 410871 437356 233053 207327 428262 724756 761123 544620
6867 544620 532607 325185 31345 -245093 -52828 -2742 -210007 -304576 -57346 -77371
6857 -77371 -51169 -52046 52472 200005 -43826 -208810 -165509 -232396 -54011 -55735 -61554 82452
6845 82452 111640 122666 60514 -36900 -61927 -61984 -269995 -368748 -586036 -599494 -520474 -278165
6833 -278165 -49390 76378 56746 -87581 -369098 -418390 -264222 -165677 -239386 -217205 -113942
$$ packed form
6905H807699L270592L375192L163731K51097l385544m257317l276002k282410
6897E667038j614404j127426n58492l56340m77601l29796k22257j06757J77598
6888A051563m0700O1138j5376M8403K53040N2528j44205j73358k71624k47213
6878E74196L723q3409k12053J28414K6485k04303k5726K20935K96494L6367k16503
6867E44620j2013k07422k93840k76438J92265N0086k07265r4569K47230k0025
6857g7371K6202q77J04518J47533k43831j64984M3301o6887J78385j724n819J44006
6845H2452K9188J1026o2152r7414k5027n7k08011r8753k17288j3458P9020K42309
6833b78165K28775J25768j9632j44327k81517m9292J54168R8545p3709K2181J03263
$$ plain form
6822 -113942 -114491 -222714 -34136 -16331 40455 227213 -14641 -184883 -132589 -57974 4773
6811 4773 158792 99112 -104754 -195767 -414544 -540484 -450813 -350189 -355055 -188705 -190502
6800 -190502 -272847 -141519 -227699 -135426 -138009 -276759 -75109 -79600 -240766 -322264 -369411
6789 -369411 -244610 -451825 -314355 -218676 -262013 -272694 -363300 -405406 -179118 -15806 42509
6778 42509 18853 189387 510429 511456 258184 380666 650981 795043 1570186 2463016
6768 2463016 2812799 2702988 2164638 1424159 771943 542946 483762 402498 174541 64229
6758 64229 6772 -38430 70065 165456 47794 111541 26660 -182682 -318676 -267411 -242625
6747 -242625 -197445 -112588 -79903 -137148 -62532 -139517 -164196 -87823 -100694 -3217 -30269 10014
$$ packed form
6822a13942n49j08223J88578J7805N6786J86758k41854j70242N2294P4615O2747
6811D773J54019n9680k03866r1013k18777j25940Q9671J00624m866J66350j797
6800a90502q2345J31328q6180R2273k583j38750K01650m491j61166q1498m7147
6789c69411J24801k07215J37470R5679m3337j0681r0606m2106K26288J63312N8315
6778D2509k3656J70534L21042J027k53272J22482K70315J44062P75143Q92830
6768B463016L49783j09811n38350p40479o52216k28997n9184q1264k27957j10312
6758F4229n7457m5202J08495R5391j17662O3747q4881k09342j35994N1265K4786
6747b42625M5180Q4857L2685n7245P4616p6985k4679P6373j2871R7477k7052M0283
$$ plain form
6735 10014 -82100 -322662 -584097 -407226 -297258 -149468 -134031 -243198 -441937 -287118
6725 -287118 -113423 -8160 52518 39764 171501 170281 103104 -78586 -283861 -433006 -355290
6714 -355290 -369607 -478544 -348456 -330196 -296393 -317481 -595342 -530487 -275786 -227138 -243569
6703 -243569 -350892 -539841 -499657 -160425 119084 499048 785670 944827 1052121 1027278
6693 1027278 929615 642288 188490 -23135 -62368 -79616 -74106 -143042 18789 292504 448802
6682 448802 175741 137777 597745 1413982 2298505 3410367 4085506 3619881 3295143 2650178
6672 2650178 2181100 1836350 1267358 817079 463147 234061 333557 781240 945600 843217
6662 843217 749352 511709 548421 821635 1127838 1756655 2782227 4150693 6207525 7865725
$$ packed form
6735A0014r2114k40562k61435J76871J09968J47790J5437j09167j98739J54819
6725b87118J73695J05263O0678j2754J31737j220o7177j81690k05275j49145P7716
6714c55290j4317j08937J30088J8260L3803k1088k77861O4855K54701M8648j6431
6703b43569j07323j88949M0184L39232K79509L79964K86622J59157J07294k4843
6693A027278r7663k87327m53798k11625l9233j7248N510o8936J61831K73715J56298
6682D48802k73061l7964M59968Q16237Q84523J111862O75139m65625l24738o44965
6672B650178m69078l44750n68992m50279l53932k29086R9496M47683J64360j02383
6662H43217r3865k37643L6712K73214L06203O28817J025572J368466K056832J658200
$$ plain form
6652 7865725 7625111 6442751 5799403 6411750 8098079 8421311 7170817 5125544 3484783
6643 3484783 2641226 2389472 2371097 2781077 3239224 4061915 5191778 6815301 9147547
6634 9147547 12264241 16733225 22667952 32770820 53212100 94521640 171631909 264234418
6626 264234418 278310163 212192083 132992564 81026534 53597410 38854281 29789824
6619 29789824 23471262 18771101 15293216 12360491 10150159 8674499 7413890 6521703
6611 6521703 5990812 5729359 5632631 5832334 7179801 9475894 9960412 8318157 6077078
6602 6077078 4793448 4187743 3951866 3235124 2792069 2621985 2422957 2369028 2102811 1794328
6592 1794328 1711493 1798117 1737313 1464184 1455577 1538541 1691365 1621616 1551390 1711191 1637260
$$ packed form
6652G865725k40614j182360o43348O12347J686329L23232j250494k045273j640761
6643C484783q43557k51754j8375M09980M58147Q22691J129863J623523K332246
6634I147547L116694M468984N934727J0102868K0441280M1309540P7110269R2602509
6626B64234418J4075745o6118080p9199519n1966030k7429124j4743129r064457
6619B9789824o318562m700161l477885k932725k210332j475660j260609q92187
6611F521703n30891k61453r6728J99703J347467K296093M84518j642255k241079
6602F077078j283630o05705k35877p16742m43055j70084j99028n3929k66217l08483
6592A794328q2835Q6624o0804k73129q607Q2964J52824o9749p0226J59801p3931
$$ plain form
6581 1637260 1233177 1144763 1314888 1106170 948376 892816 765297 972950 1024492 846156
6571 846156 959278 1565937 1979773 2176650 3075350 4935726 7681579 10375196 10451653
6562 10451653 8120116 5523485 3602834 2600228 2032079 1655405 1463674 1595663 1428772
6553 1428772 1286195 1271263 1209749 1186466 917586 883853 824662 679619 839674 1104314
6543 1104314 1225506 879593 712170 613472 506981 597208 565942 836638 744093 834277
6533 834277 851237 591258 421118 541471 704294 674391 461281 481242 504715 425044 275578
6522 275578 79396 220110 353241 281953 357117 334258 402960 457658 408412 315266 15133
6511 15133 -149672 -35676 51996 108975 240144 236271 207115 281514 311889 196655 39038
$$ packed form
6581A637260m04083q8414J70125k08718j57794n5560j27519K07653N1542j78336
6571H46156J13122O06659M13836J96877Q98700J860376K745853K693617P6457
6562A0451653k331537k596631j920651j002606n68149l76674j91731J31989j66891
6553A428772j42577j4932o1514k3283k68880l3733n9191j45043J60055K64640
6543A104314J21192l45913j67423r8698j06491R0227l1266K70696r2545R0184
6533H34277J6960k59979j70140J20353J62823k9903k13110J9961K3473p9671j49466
6522B75578j96182J40714J33131p1288P5164k2859O8702N4698m9246r3146l00133
6511A5133j64805J13996Q7672N6979J31169l873k9156P4399L0375j15234j57617
$$ plain form
6500 39038 166218 445804 315499 356910 373490 333067 335962 284983 298445 380784 206373
6489 206373 -72274 -101932 -70615 -52771 49475 180188 254541 324808 166201 314031 539288
6478 539288 303194 141646 -61469 180477 307968 129001 115894 121709 57828 -37741 -131733
6467 -131733 82517 -5215 -129330 -311088 -235540 45186 123618 -15237 -155407 -28039
6457 -28039 39112 189004 331494 511173 430896 237017 185596 -171022 -272805 -199278 -79577
6446 -79577 84540 286753 378657 320161 401449 526933 428246 627186 601618 517816 505087
6435 505087 334745 37428 -216787 -158377 11242 4498 50094 109814 261446 260022 261277
6424 261277 198219 161427 193485 -23469 -34055 -79315 80869 -34066 27270 -58145 -65619
$$ packed form
6500C9038J27180K79586j30305M1411J6580m0423K895n0979J3462Q2339j74411
6489B06373k78647k9658L1317J7844J02246J30713P4353P0267j58607J47830K25257
6478E39288k36094j61548k03115K41946J27491j78967j3107N815o3881r5569r3992
6467a31733K14250q7732j24115j81758P5548K80726P8432j38855j40170J27368
6457b8039O7151J49892J42490J79679q0277j93879n1421l56618j01783P3527J19701
6446g9577J64117K02213R1904n8496Q1288J25484r8687J98940k5568q3802j2729
6435E05087j70342k97317k54215N8410J69619o744M5596N9720J51632j424J255
6424B61277o3058l6792L2058k16954j0586m5260J60184j14935O1336q5415p474
$$ plain form
6413 -65619 -32588 -33543 78898 323495 247893 -62039 -249665 -186712 -73890 82594 212586
6402 212586 136336 88428 140231 158693 309751 -1161 -243551 42989 188909 321792
6392 321792 728956 745661 546081 304647 164061 -116791 -146991 149595 209231 -22246
6382 -22246 -62979 6738 -155115 -155873 -157848 -101372 31067 -70565 -209246 85883 382208
6371 382208 188887 158188 125179 112246 323265 361230 268268 -77519 -113265 -20573 -380
6360 -380 -153315 -353564 -173449 -3356 11079 -281830 -233237 -213125 -83317 33317 22458
6349 22458 -290716 -316147 -145038 21171 -1070 94071 237967 -171938 -214160 -52010 290106
6338 290106 145034 -189817 -340371 -199567 160356 173292 -24165 -21732 -54895 -41360 60486
$$ packed form
6413f5619L3031r55J12441K44597p5602l09932j87626O2953J12822J56484J29992
6402B12586p6250m7908N1803J8462J51058l10912k42390K86540J45920J32883
6392C21792M07164J6705j99580k41434j40586k80852l0200K96586N9636k31477
6382b2246m0733O9717j61853p58j975N6476J32439j01632j38681K95129K96325
6371C82208j93321l0699l3009j2933K11019L7965r2962l45787l5746R2692K0193
6360c80j52935k00249J80115J70093J4435k92909M8593K0112J29808J16634j0859
6349B2458l13174k5431J71109J66209k2241R5141J43896m09905m2222J62150L42116
6338B90106j45072l34851j50554J40804L59923J2936j97457K433l3163J3535J01846
$$ plain form
6327 60486 -23952 80176 87475 245100 232187 284103 297822 100104 -158558 -293032 -5188
6316 -5188 220267 185585 123251 -22592 90054 149166 279725 140563 -18384 -88044 -16309
6305 -16309 55614 120359 95391 150794 410561 360569 191402 216838 168402 69453 201607
6294 201607 230112 209754 287981 335409 226973 54507 -197500 -90224 -141230 -215599 -192143
6283 -192143 -154199 -116650 -225491 -129189 -68853 -379740 -384230 -545999 -452934 -206990 -134749
6272 -134749 -48813 -135676 -121246 -106226 89588 -3377 85217 117364 37545 193996 162349
6261 162349 158922 -21066 98307 67997 198526 260781 383773 594170 789184 911001
6251 911001 1079111 1180230 1249538 1152607 1016298 788410 443465 318449 257517 194876
$$ packed form
6327F0486q4438J04128P299J57625j2913N1916J3719j97718k58662j34474K87844
6316e188K25455l4682o2334j45843J12646N9112J30559j39162j58947o9660P1735
6305a6309P1923O4745k4968N5403K59767m9992j69167K5436m8436r8949J32154
6294B01607K8505k0358P8227M7428j08436j72466k52007J07276n1006p4369K3456
6283a92143L7944L7549j08841R6302O0336l10887m490j61769R3065K45944P2241
6272a34749Q5936q6863J4430J5020J95814r2965Q8594L2147p9819J56451l1647
6261A62349l427j79988J19373l0310J30529O2255J22992K10397J95014J21817
6251I11001J68110J01119O9308r6931j36309k27888l44945j25016o0932o2641
$$ plain form
6241 194876 -99774 -142631 -104372 -57236 -168689 -309257 -298192 -218325 -116880 -106818 -48133
6230 -48133 -17000 -191127 -325152 -154585 -38941 -25602 -13161 32157 -38844 -176778 93581
6219 93581 273140 273408 -67890 -217121 5578 60862 96602 94429 122389 -61009 -24003
6208 -24003 -180142 -246346 -69609 123546 -143994 -138492 -25962 94104 194983 214709 500650
6197 500650 481436 198037 -166390 -170226 95899 224725 224753 209023 261469 388573 476268
6186 476268 420007 417952 40044 -101388 -3642 49821 218424 187745 45976 -7898 -344585
6175 -344585 -343372 -393808 -381149 -266858 -343014 -215311 -15640 139279 16355 -125647 -90262
6164 -90262 -104940 -81234 -22966 251920 411187 244300 113425 -63658 -89688 -204108 -345017
$$ packed form
6241A94876k94650m2857L8259M7136j11453j40568J1065P9867J01445J0062N8685
6230d8133L1133j74127j34025J70567J15644J3339J2441M5318p1001j37934K70359
6219I3581J79559K68l41298j49231K22699N5284L5740k173K7960j83398L7006
6208b4003j56139o6204J76737J93155k67540N502J12530J20066J00879J9726K85941
6197E00650j9214k83399l64427l836K66125J28826K8j5730N2446J27104Q7695
6186D76268n6261k055l77908j41432R7746N3463J68603l0679j41769n3874l36687
6175c44585J213n0436J2659J14291p6156J27703J99671J54919j22924j42002L5385
6164i0262j4678K3706N8268K74886J59267j66887j30875j77083k6030j14420j40909
$$ plain form
6153 -345017 -244551 -204812 -255929 -300462 -324844 -136904 48168 351864 305112 62702 -62730
6142 -62730 63063 116319 74960 -107010 -322506 -615113 -468186 -356929 140616 236781
6132 236781 325322 377481 256399 233682 95613 3609 161390 261092 164797 61508 13160
6121 13160 131589 -8729 -115053 -367425 -377683 -141338 158282 176657 123377 130563 222015
6110 222015 123695 -6449 114576 241089 169754 59451 -65385 -158226 -58739 -355 113515
6099 113515 55815 -120588 43107 209572 489355 498130 338434 204930 52261 -332526
6089 -332526 -478342 -510623 -527823 -569313 -93003 179431 107287 130327 186581 69727 -245483
6078 -245483 -165663 -47323 25498 193586 251381 30759 -168229 -197766 124227 331407
$$ packed form
6153c45017J00466L9739n1117m4533k4382J87940J85072L03696m6752k42410j25432
6142f2730J25793N3256m1359j81970k15496k92607J46927J11257M97545R6165
6132B36781Q8541N2159j21082k2717j38069r2004J57781R9702r6295j03289m8348
6121A3160J18429j40318j06324k52372j0258K36345K99620J8375n3280P186R1452
6110B22015r8320j30144J21025J26513p1335j10303j24836r2841R9487N8384J13870
6099A13515n7700j76403J63695J66465K79783Q775j59696j33504j52669l84787
6089c32526j45816l2281j7200m1490M76310K72434p2144K3040N6254j16854l15210
6078b45483P9820J18340P2821J68088N7795k20622j98988k9537L21993K07180
$$ plain form
6068 331407 320590 261481 152056 65770 163947 247657 353139 435332 541705 507651 312526
6057 312526 94432 -180686 13673 101365 -34710 -123029 -372420 -342461 -276909 -220931 -279307
6046 -279307 -78140 64838 87655 -30783 296048 381257 331794 211478 163777 206885 10264
6035 10264 -28880 -119714 -54866 -97709 -214388 -128675 -67225 -9675 -35442 -104257 -177774 -316419
6023 -316419 -187285 -123855 -194776 -95310 -69756 -81377 113613 -74251 -255053 -12666 15097
6012 15097 52106 262502 273886 180312 133940 -17988 -186960 -35545 -153399 -255847 -201089
6001 -201089 -410247 -563044 -370465 -243799 -138680 -25939 30732 119781 72376 109434
5991 109434 190203 389120 345837 167866 126776 118603 -63799 -76250 -210496 -112503 79165
$$ packed form
6068C31407j0817n9109j09425q6286R8177Q3710J05482Q2193J06373l4054j95125
6057C12526k18094k75118J94359Q7692j36075q8319k49391K9959O5552N5978n8376
6046b79307K01167J42978K2817j18438L26831Q5209m9463j20316m7701M3108j96621
6035A0264l9144r0834O4848m2843j16679Q5713O1450N7550k5767o8815p3517j38645
6023c16419J29134O3430p0921R9466K5554j1621J94990j87864j80802K42387K7763
6012A5097L7009K10396J1384r3574m6372j51928j68972J51415j17854j02448N4758
6001b01089k09158j52797J92579J26666J05119J12741N6671Q9049m7405L7058
5991A09434Q0769J98917m3283j77971m1090q173j82402j2451j34246R7993J91668
$$ plain form
5980 79165 125250 -9704 97648 -93519 -374167 -513785 -476987 -334555 -174670 -20199
5970 -20199 -118535 -135162 -334065 -391832 -435385 -325213 -165767 59505 -2062 -159662 -31300
5959 -31300 -40605 -38324 -97239 -211012 -198394 -160485 -18240 24067 92534 289616 210655 77528
5947 77528 -155032 -314356 -244728 54956 74517 37020 -64099 -145638 -206189 -102375 -138524
5936 -138524 -3820 219451 258935 169960 163916 443818 307368 350040 383558 313854 372494
5925 372494 -36327 -236823 -51008 -25355 91663 286196 122083 86260 32789 -64190
5915 -64190 31820 98050 -21340 -134743 -284954 -376359 -310514 3618 -16735 305293 332136
5904 332136 208962 297980 359391 377102 268696 96511 228640 242955 74224 54895 235359
$$ packed form
5980G9165M6085j34954J07352j91167k80648j39618L6798J42432J59885J54471
5970b0199r8336j6627j98903n7767m3553J10172J59446K25272o1567j57600J28362
5959c1300r305K281n8915j13773J2618L7909J42245M2307O8467J97082p8961j33127
5947G7528k32560j59324O9628K99684J9561l7497j01119q1539o0551J03814l6149
5936a38524J34704K23271L9484q8975o044K79902j36450M2672L3518o9704N8640
5925C72494m08821k00496J85815K5653J17018J94533j64113l5823n3471r6979
5915f4190R6010O6230j19390j13403j50211r1405O5845L14132k0353L22028K6843
5904C32136j23174Q9018O1411J7711j08406j72185J32129J4315j68731j9329J80464
$$ plain form
5893 235359 302525 245707 398475 315032 170973 11441 -60214 -77554 -393966 -268548 12955
5882 12955 94566 179377 362996 232777 398093 521086 222715 239985 440388 378607 334064
5871 334064 339148 297223 104868 -66472 -314477 -321934 -226129 -181805 -160940 82451 155844
5860 155844 262510 263907 199719 148159 186282 88831 -157639 -197899 -248625 -276766 41758
5849 41758 -46280 -276340 -269194 -50532 -254963 -494901 -361611 -34768 127075 -16666
5839 -16666 57245 -21829 -72603 -18280 140025 365985 470759 409507 377796 564679 324440
5828 324440 -72236 -211411 -34333 175492 207583 120076 255422 228826 145583 -4719
5818 -4719 -112927 -260713 -338638 -315168 -283845 -380848 -471731 -288927 -37233 379410 202755
$$ packed form
5893B35359O7166n6818J52768q3443j44059j59532p1655j7340l16412J25418K81503
5882A2955Q1611Q4811J83619j30219J65316J22993k98371J7270K00403o1781m4543
5871C34064N084m1925j92355j71340k48005p457R5805M4324K0865K43391P3393
5860A55844J06666J397o4188n1560L8123r7451k46470m0260n0726k8141L18524
5849D1758q8038k30060P146K18662k04431k39938J33290L26843J61843j43741
5839a6666P3911p9074n0774N4323J58305K25960J04774o1252l1711J86883k40239
5828C24440l96676j39175J77078K09825L2091q7507J35346k6596q3243j50302
5818d719j08208j47786p7925K3470L1323r7003r0883J82804K51694M16643j76655
$$ plain form
5807 202755 -7193 -32816 209419 197865 69348 153501 211047 35086 -118888 -86704 -153440
5796 -153440 -179019 35185 420300 440019 193317 -157965 -406738 -314230 -208096 -338714
5786 -338714 -392019 -163097 -34906 190188 -45103 -192078 -135835 -1798 42107 -143901
5776 -143901 -27448 100876 -183751 -403068 -138641 -34518 152633 -12793 -134914 -3816
5766 -3816 246019 188763 74782 -28925 -27336 146174 193770 197050 124419 2951 -65788
5755 -65788 -178661 -353 41045 22730 53148 -2514 -201974 -45260 -234274 -592520 -560454
5744 -560454 -448815 -323852 -91676 81512 71040 89699 -6942 104749 251258 215378
5734 215378 269833 114170 -120102 -36350 14133 62571 198876 256726 342671 90125 -131963
$$ packed form
5807B02755k09948k5623K42235j1554j28517Q4153N7546j75961j53974L2184o6736
5796a53440k5579K14204L85115J9719k46702l51282k48773R2508J06134j30618
5786c38714n3305K28922J28191K25094k35291j46975N6243J34037M3905j86008
5776a43901J16453J28324k84627k19317K64427J04123J87151j65426j22121J31098
5766c816K49835n7256j13981j03707J589J73510M7596L280p2631j21468o8739
5755f5788j12873J78308M1398j8315L0418n5662j99460J56714j89014l58246L2066
5744e60454J11639J24963K32176J73188j0472J8659r6641J11691J46509l5880
5734B15378N4455j55663k34272Q3752N0483M8438J36305N7850Q5945k52546k22088
$$ plain form
5723 -131963 -103736 -147096 40921 33070 -40218 -39192 -116006 -278080 -254839 -206971 -213160 -271316
5711 -271316 -190028 -173174 -35499 18406 44212 50003 238854 142100 176608 288164 283847
5700 283847 -51636 -159760 -112048 -155267 -28683 65552 240295 224492 40755 1141 -182751
5689 -182751 -160204 -391646 -495183 -503012 -262887 -16360 41942 -230647 -484936 -490284 -394961
5678 -394961 -279018 -81164 28546 -229531 -57495 76435 -116410 46973 179412 167740
5668 167740 323273 194607 82964 186353 254807 84896 -149935 -101725 172675 84141
5658 84141 -40315 -26505 -25843 18993 190979 120280 -27755 -97387 -90039 -85091 -30893 -168436
5646 -168436 -218214 -211914 -372126 -390694 -356410 -215560 -224731 3254 203459 252611 148197
$$ packed form
5723a31963K8227m3360J88017p851p3288J026p6814j62074K3241M7868o189n8156
5711b71316Q1288J6854J37675N3905K5806N791J88851r6754L4508J11556m317
5700B83847l35483j08124M7712m3219J26584R4235J74743j5803j83737l9614j83892
5689a82751K2547k31442j03537p829K40125K46527N8302k72589k54289n348R5323
5678c94961J15943J97854J09710k58077J72036J33930j92845J63383J32439j1672
5668A67740J55533j28666j11643J03389O8454j69911k34831M8210K74400q8534
5658H4141j24456J3810O62M4836J71986p0699j48035o9632P348M948N4198j37543
5646a68436m9778O300j60212j8568L4284J40850r171K27985K00205M9152j04414
$$ plain form
5635 148197 -237141 -143600 44824 37549 -98712 246798 364781 161478 -53573 -220588
5625 -220588 -9115 74309 20153 -56715 -94380 -90794 -124566 -195980 -18538 -93115 -174654
5614 -174654 -25172 -106719 -297263 -280068 -215471 17358 -182650 -201222 -198564 -138687 157968
5603 157968 432262 346284 10248 -93458 -73420 -14688 -32532 -33009 -385863 -463062 -294329
5592 -294329 -205140 -115343 -16390 247123 155529 56792 179103 192511 60157 -6767 -199466
5581 -199466 -131610 40476 104229 99464 69264 -55350 -119602 -168282 62852 14892 -23902
5570 -23902 163350 187778 103777 215863 181538 171912 235487 309507 302805 278389 154061 57504
5558 57504 94065 48128 159316 163667 -67412 -204701 99881 323324 158295 110650 503764
$$ packed form
5635A48197l85338R3541J88424p275j36261L45510J17983k03303k15051j67015
5625b20588K11473Q3424n4156p6868l7665L586l3772p1414J77442p4577q1539
5614a74654J49482q1547j90544J7195O4597K32829k00008j8572K658N9877K96655
5603A57968K74294q5978l36036j03706K0038N8732j7844m77l52854p7199J68733
5592b94329Q9189Q9797R8953K63513r1594r8737J22311J3408j32354o6924j92699
5581a99466O7856J72086O3753m765l0200j24614o4252m8680K31134m7960l8794
5570b3902J87252K4428q4001J12086l4325r626O3575P4020o702k4416j24328r6557
5558E7504L6561m5937J11188M351k31079j37289L04582K23443j65029m7645L93114
$$ plain form
5547 503764 348548 135980 177110 1867 -57400 -16001 -314730 -434948 -360584 -201857
5537 -201857 -62653 -83270 -174298 -254157 -331220 -384813 -512719 -576501 -606406 -324395 -275558
5526 -275558 -396492 -300328 -4448 2917 -100332 -225120 -314442 -296031 -229810 17370 78372
5515 78372 44956 62704 66711 240843 264689 271813 325254 234378 215885 -18768 -99400 176879
5503 176879 337817 364207 420706 319417 398383 411795 171693 -67217 95422 69582 42612
$$ packed form
5547E03764j55216k12568M1130j75243n9267M1399k98729j20218P4364J58727
5537b01857J39204k0617r1028p9859p7063n3593j27906o3782k9905K82011M8837
5526b75558j20934R6164K95880P365j03249j24788q9322J8411O6221K47180O1002
5515G8372l3416J7748M007J74132K3846P124N3441r0876j8493k34653q0632K76279
5503A76879J60938K6390N6499j01289P8966J3412k40102k38910J62639k5840k6970
$$ [...]
##END NTUPLES=NMR SPECTRUM
##END=
