##TITLE=Analysis number 328102
Compound Code btb 06460
Book Reference lab3 b
Project Code adrs 
Chemist Name stores
##JCAMPDX= 6.0         $$ Bruker NMR JCAMP-DX V2.0
##DATA TYPE= NMR SPECTRUM
##DATA CLASS= NTUPLES
##ORIGIN= Bruker BioSpin GmbH
##OWNER= nmr
$$ XWIN-NMR		Version 3.5
$$ Wed May  2 12:18:15 2007 GMT Daylight Time (UT+1h)  MAYBRIDGE\nmr@NMR_250MHZ
##.OBSERVE FREQUENCY= 250.131544655141
##.OBSERVE NUCLEUS= ^1H
##.ACQUISITION MODE= SIMULTANEOUS (DQD)
##.ACQUISITION SCHEME= undefined
##.AVERAGES= 16
##.DIGITISER RES= 18
##SPECTROMETER/DATA SYSTEM= dpx250
##.PULSE SEQUENCE= zg30
##.SOLVENT NAME= CDCl3
##.SHIFT REFERENCE= (INTERNAL, CDCl3, 0, 16.522)
##AUDIT TRAIL= $$ (NUMBER, WHEN, WHO, WHERE, WHAT)
$$ ##TITLE= Audit trail, XWIN-NMR		Version 3.5
$$ ##JCAMPDX= 5.01
$$ ##ORIGIN= Bruker BioSpin GmbH
$$ ##OWNER= nmr
$$ C:\u/data/dgb/nmr/ADRS/260/pdata/1/auditp.txt
$$ ##AUDIT TRAIL=  $$ (NUMBER, WHEN, WHO, WHERE, WHAT)
(   1,<2007-05-02 12:17:55.11 +100>,<MAYBRIDGE\nmr>,<NMR_250MHZ>,
      <created by zg, POWCHK disabled, PULCHK disabled
       configuration hash MD5:
       76 6E 9A 78 1E 09 19 81 EC 84 63 8F B0 6A 59 2D
       data hash MD5: 64K
       EE 6E 85 F0 2A 1A FA 17 4D A5 AE 0E 2B 2E 86 22>)
(   2,<2007-05-02 12:18:06.83 +100>,<MAYBRIDGE\nmr>,<NMR_250MHZ>,
      <Start of raw data processing
       ef LB = 0.3 FT_mod = 6 PKNL = 1 SI = 32K 
       data hash MD5: 32K
       53 19 96 4C A6 3F D2 80 3E 44 0B 82 2C D0 E6 EB>)
(   3,<2007-05-02 12:18:08.44 +100>,<MAYBRIDGE\nmr>,<NMR_250MHZ>,
      <apk 
       data hash MD5: 32K
       7E 06 7F B7 29 F1 B2 CD D2 53 8D 0C 76 D8 96 E4>)
(   4,<2007-05-02 12:18:09.17 +100>,<MAYBRIDGE\nmr>,<NMR_250MHZ>,
      <abs ABSG = 5 
       data hash MD5: 32K
       71 79 78 FC 2F B7 E5 4D 4E 1D BA 96 AC B1 A6 61>)
$$ ##END=
$$ 
$$ hash MD5
$$ 52 D9 70 9E F2 61 DF E1 9C 10 50 F2 F8 62 7D 31
##$RELAX= 
##$RELAX= 
##$RELAX= 
##$RELAX= 
##$RELAX= 
##$RELAX= 
##$RELAX= 
$$ Bruker specific parameters
$$ --------------------------
##$DU= <C:\u>
##$EXPNO= 260
##$NAME= <ADRS>
##$PROCNO= 1
##$TYPE= <nmr>
##$USER= <dgb>
##$AMP= (0..31)
100 100 100 100 100 100 100 100 100 100 100 100 100 100 100 100 100 100 
100 100 100 100 100 100 100 100 100 100 100 100 100 100 
##$AQSEQ= 0
##$AQ_mod= 3
##$AUNM= <au_zg>
##$AUTOPOS= <22 >
##$BF1= 250.13
##$BF2= 250.13
##$BF3= 250.13
##$BF4= 250.13
##$BF5= 500.13
##$BF6= 500.13
##$BF7= 500.13
##$BF8= 500.13
##$BYTORDA= 1
##$CFDGTYP= 0
##$CFRGTYP= 5
##$CHEMSTR= <none>
##$CNST= (0..31)
1 1 145 1 1 1 1 1 1 1 1 1 1 1 1 1 1 1 1 1 1 1 1 1 1 1 1 1 1 1 1 1 
##$CPDPRG= <>
##$CPDPRG1= <>
##$CPDPRG2= <>
##$CPDPRG3= <>
##$CPDPRG4= <mlev>
##$CPDPRG5= <mlev>
##$CPDPRG6= <mlev>
##$CPDPRG7= <mlev>
##$CPDPRG8= <mlev>
##$CPDPRGB= <>
##$CPDPRGT= <>
##$D= (0..31)
0 1 0 0 0 0 0 0 0 0.06 0 0 0 0 0 0 0.0002 0 0 0 0 0 0 0 0 0 0 0 0 0 0 
0 
##$DATE= 1178104674
##$DBL= (0..7)
120 120 120 120 120 120 120 120 
##$DBP= (0..7)
150 150 150 150 150 150 150 150 
##$DBP07= 0
##$DBPNAM0= <>
##$DBPNAM1= <>
$$ [...]
##$SUBNAM7= <"">
##$SUBNAM8= <"">
##$SUBNAM9= <"">
##$SW= 20.6930455092707
##$SWIBOX= (0..15)
0 0 3 0 0 0 0 0 0 0 0 0 0 0 0 0 
##$SW_h= 5175.983436853
##$TD= 65536
##$TD0= 1
##$TE= 683.16
##$TE2= 300
##$TE3= 300
##$TEG= 300
##$TL= (0..7)
0 120 120 120 120 120 120 120 
##$TP= (0..7)
150 150 150 150 150 150 150 150 
##$TP07= 0
##$TPNAME0= <>
##$TPNAME1= <>
##$TPNAME2= <>
##$TPNAME3= <>
##$TPNAME4= <>
##$TPNAME5= <>
##$TPNAME6= <>
##$TPNAME7= <>
##$TPOAL= (0..7)
0.5 0.5 0.5 0.5 0.5 0.5 0.5 0.5 
##$TPOFFS= (0..7)
0 0 0 0 0 0 0 0 
##$TUNHIN= 0
##$TUNHOUT= 0
##$TUNXOUT= 0
##$USERA1= <user>
##$USERA2= <user>
##$USERA3= <user>
##$USERA4= <user>
##$USERA5= <user>
##$V9= 5
##$VALIST= <valist>
##$VCLIST= <CCCCCCCCCCCCCCC>
##$VD= 0
##$VDLIST= <DDDDDDDDDDDDDDD>
##$VPLIST= <PPPPPPPPPPPPPPP>
##$VTLIST= <TTTTTTTTTTTTTTT>
##$WBST= 1024
##$WBSW= 4
##$XGAIN= (0..3)
0 0 0 0 
##$XL= 0
##$YL= 0
##$YMAX_a= 534131
##$YMIN_a= -453949
##$ZGOPTNS= <>
##$ZL1= 120
##$ZL2= 120
##$ZL3= 120
##$ZL4= 120
##$ABSF1= 16.522
##$ABSF2= -4.171173
##$ABSG= 5
##$ABSL= 3
##$ALPHA= 0
##$AQORDER= 0
##$ASSFAC= 0
##$ASSFACI= 0
##$ASSFACX= 0
##$ASSWID= 0
##$AUNMP= <proc_1d>
##$AZFE= 0.1
##$AZFW= 0.1
##$BCFW= 0
##$BC_mod= 0
##$BYTORDP= 0
##$COROFFS= 0
##$CY= 12.5
##$DATMOD= 1
##$DC= 0
##$DFILT= <>
##$DTYPP= 0
##$F1P= 14.0000005364418
##$F2P= -0.99999901652339
##$FCOR= 0.5
##$FTSIZE= 32768
##$FT_mod= 6
##$GAMMA= 0
##$GB= 0
##$INTBC= 1
##$INTSCL= 1
##$ISEN= 128
##$LB= 0.3
##$LEV0= 0
##$LPBIN= 0
##$MAXI= 10000
##$MC2= 0
##$MEAN= 0
##$ME_mod= 0
##$MI= 0
##$NCOEF= 0
##$NC_proc= -4
##$NLEV= 6
##$NOISF1= 0
##$NOISF2= 0
##$NSP= 0
##$NTH_PI= 0
##$NZP= 0
##$OFFSET= 16.522
##$PC= 1
##$PHC0= -51.72569
##$PHC1= -0.1452425
##$PH_mod= 1
##$PKNL= yes
##$PPARMOD= 0
##$PSCAL= 4
##$PSIGN= 0
##$REVERSE= no
##$SF= 250.13
##$SI= 32768
##$SIGF1= 0
##$SIGF2= 0
##$SINO= 400
##$SIOLD= 32768
##$SREGLST= <1H.CDCl3>
##$SSB= 0
##$STSI= 32768
##$STSR= 0
##$SW_p= 5175.98343685301
##$SYMM= 0
##$S_DEV= 0
##$TDeff= 65536
##$TDoff= 0
##$TI= <Analysis number 999999
Compound Code 99
Book Reference 9
Project Code 9>
##$TILT= no
##$TM1= 0
##$TM2= 0
##$TOPLEV= 0
##$USERP1= <user>
##$USERP2= <user>
##$USERP3= <user>
##$USERP4= <user>
##$USERP5= <user>
##$WDW= 1
##$XDIM= 32768
##$YMAX_p= 432382365
##$YMIN_p= -145450
$$ End of Bruker specific parameters
$$ ---------------------------------
##NTUPLES= NMR SPECTRUM
##VAR_NAME=  FREQUENCY,     SPECTRUM/REAL,   SPECTRUM/IMAG
##SYMBOL=    X,             R,               I
##VAR_TYPE=  INDEPENDENT,   DEPENDENT,       DEPENDENT
##VAR_FORM=  AFFN,          ASDF,            ASDF
##VAR_DIM=   32768,         32768,           32768
##UNITS=     HZ,            ARBITRARY UNITS, ARBITRARY UNITS
##FACTOR=    0.157963299565203, 1,           1
##FIRST=     4132.6476996994, 0,             0
##LAST=      -1043.33573715361, 0,           0
##MIN=       -1043.33573715361, -145450,     0
##MAX=       4132.6476996994, 432382365,     0
$$ Real data points
##PAGE= N=1
##DATA TABLE= (X++(R..R)), XYDATA
$$ [...]
29799 -35124 -40395 -39674 -4887 -697 11971 19418 24799 20168 6912 -13226 -13571 -35232 -31953 3470
29785 3470 -22034 -64854 -22458 5072 13600 251 -360 7939 -15545 1004 11669 18513 7214
29772 7214 -13706 -38969 -24357 11196 8701 17033 8134 22650 58450 57237 33735 15491 32044
29759 32044 58462 27838 -16289 -40457 -54204 -10177 -34993 -49899 -13671 -27298 -27696 -43935
29747 -43935 7899 46053 12314 26255 27425 6055 -3379 13595 7612 7129 18163 19987 43138
29734 43138 37698 51539 32331 755 30365 56948 56317 33452 -13410 -26572 12194 56839
29722 56839 56457 -2077 -9745 -10820 -18422 25254 67146 94591 83627 66715 95152 81282 57215
29709 57215 51335 44024 10448 22602 12419 22307 33699 28452 -12154 -24601 -40519 -9418
29697 -9418 -36684 -74544 -62907 -3882 65025 95010 56492 37759 49175 66274 73491 15657
29685 15657 -5820 23675 35708 25860 57646 65607 23531 9088 -4462 -1745 18250 -12785
29673 -12785 -55028 -6719 8752 -2235 2477 47856 58970 36660 46888 30637 10308 30113
29661 30113 26467 414 -26209 -33680 -34639 -52553 -72106 -58952 -15340 -3212 -25489 -37046
29649 -37046 -16339 -21907 -15333 21172 -1777 -16321 -21956 -7217 -825 19878 39909 42324 22485
29636 22485 -2541 -9523 11220 -6270 27788 45555 25322 3697 -18734 -8783 -25416 -23344
29624 -23344 -31614 -77541 -68040 -24414 -839 -18862 -54455 -57515 -45879 -31146 -34698 -37556 -3249
29611 -3249 13505 3631 -19386 -15218 -8894 1635 4134 1842 -11316 -33272 -33681 -1570 -30210
29598 -30210 -19300 5243 -16499 -16235 7926 17081 18409 27249 -3618 -3748 -6339 -3272 -1816 16917
29584 16917 34345 31640 -3178 6161 49635 34610 10694 8800 -1281 -24418 -54559 -56302
29572 -56302 -20270 -15639 -23203 -10367 32925 4585 -17430 -6749 -27531 -51335 -44312 -20961
29560 -20961 -2963 11749 -8784 -33193 -14124 -20519 -25122 2584 32328 23558 16971 9638 -10576
29547 -10576 4612 18488 -17877 -22361 -30701 -4655 -10065 -22352 -33336 -57263 -35004 -4698
29535 -4698 -20730 -34709 -51415 -69037 -71438 -59323 -54186 -23375 317 -4364 -1406 -33436 -46301
29522 -46301 -56772 -85392 -120479 -100732 -74587 -35237 28980 27801 180 -35372 -17996 4154
29510 4154 6411 38106 31422 -17372 5511 25660 34466 12225 -35916 -14308 8592 2939 18332
29497 18332 23797 14165 -4235 -2642 5709 -42747 -64153 -46955 -36324 -5188 -15170 -20081 2643
29484 2643 -8257 -6780 -26603 -39132 -27594 -1983 -23141 -46178 -40044 -42832 507 27877
29472 27877 14932 37768 45943 42182 42802 30889 32423 -1821 -12706 6100 -320 4573 8965
29459 8965 39259 28836 14672 7588 -33080 -39720 -21902 -25809 -47875 -51553 11622 31275 -16816
29446 -16816 -29249 2211 734 18434 -298 -24226 -64214 -96951 -62676 -24846 -4627 10669
29434 10669 27235 56903 72074 73029 33054 21550 -2319 16005 41571 55167 53734 22843
29422 22843 30417 30341 38167 41689 31844 43473 23562 -17465 -31073 -38835 -54920 -59862 -48829
29409 -48829 -21762 -4719 1313 1665 -2068 27664 41356 27053 18755 15647 7658 -21722 -34869
29396 -34869 -11102 -2752 19808 16292 31056 24391 -4641 44 21850 15005 -14032 -14295 -26134
29383 -26134 -7146 -21612 -25119 -31169 -16666 6950 49063 38370 51273 30328 19292 35830
29371 35830 26573 4794 -14026 -24609 -30843 -8554 -14718 10018 39906 41868 35840 35383 47904
29358 47904 38850 16245 40040 42087 34531 919 33 -16201 -55805 -38827 8191 3372 -32281
29345 -32281 -36839 -11290 1065 15218 25868 -1276 -13665 -13329 -8613 -2531 -3802 -7329 -43551
29332 -43551 -82414 -77177 -63911 -62617 -69830 -49987 -60306 -22681 27511 45362 40798 16103
29320 16103 43248 62876 27008 24434 13786 26730 961 -38257 -45425 -41992 -31403 -27088
29308 -27088 -46139 -79238 -75913 -50576 -24487 17580 51525 17556 -48934 -49146 -32400 -12758
29296 -12758 24177 61059 38762 24274 -28993 -56910 -43616 -32878 -9448 -35054 -78177 -100434
29284 -100434 -109071 -75487 -65469 -67156 -32476 -60315 -22963 41025 38539 14683 10403 -7541
29272 -7541 -38176 -32602 -56326 -58806 -36738 -48944 -82794 -59184 -58183 -53120 -46881 13234 36643
29259 36643 37659 32160 9105 -7634 -10734 -9557 -18056 -36574 -43347 -19262 -16995 -15601 -35932
29246 -35932 -22428 4197 14374 1176 4242 13659 -20786 -29378 -28018 -39435 -34244 -19867 -8226
29233 -8226 11992 -17765 -32797 -31123 7297 -16971 -13508 -12930 -27354 -20231 40 2784 -36105
29220 -36105 -18308 5839 -7403 -45721 -13853 25904 22985 12819 11153 21252 44189 68860
29208 68860 31307 3708 26199 16079 -1296 10018 -39395 -82560 -42976 -24736 -21570 -37997
29196 -37997 -68397 -78155 -50450 -46781 -35554 -9548 6027 31012 74798 38862 8455 -12109
29184 -12109 -26729 -42399 -5069 -2390 11159 44147 31606 26351 15307 25217 41200 45314
29172 45314 37267 39271 41281 36514 31126 10387 1296 18078 29856 11588 -26869 -32126 -36673
29159 -36673 -38630 -15147 6795 -8960 -27845 -8420 -14895 3193 37809 43027 31836 28189
29147 28189 1497 -13291 -37137 -43967 -18440 32279 28430 47072 6166 -2634 24336 -3191
29135 -3191 -30471 -31572 -21676 -10230 -4474 15045 24736 57653 99453 115163 56589 -7436 -21276
29122 -21276 -9123 -5427 1527 15865 16301 22787 25961 20733 9628 50512 22419 34696 2981
29109 2981 399 21560 -15102 -1569 13671 21999 36405 3597 -25603 -46070 -34559 -35887
29097 -35887 -53823 -27773 38316 80868 72745 35358 11043 12358 -10549 -36193 -3929 36802
29085 36802 26283 -8115 -41155 -56528 -24951 -10571 -21249 -1859 8055 6698 14941 -4175
29073 -4175 -28349 -21030 -8961 -21 5048 -906 12436 10195 24335 4423 5150 -12238 8005
29060 8005 12554 48360 27833 10765 -489 -50286 -72065 -35688 -14639 56744 79306 70909
29048 70909 38532 61755 30296 -12941 -34167 -49791 -22814 -24975 -25802 -10586 -3809 -3743 -8581
29035 -8581 -10854 -20564 11711 28542 5146 1630 -248 -19343 -15418 -11246 -3213 18116 34474
29022 34474 53717 5776 -24586 -11819 -7299 -4779 -13290 2967 1567 19399 18204 19668 45598
29009 45598 56496 27481 21425 9461 39677 15314 12270 6182 2096 17757 -8256 -20765
28997 -20765 -20790 -19302 -13156 17012 25928 64796 91299 94883 73417 54679 40682 21270 9987
28984 9987 13320 21351 63572 57491 17374 7772 -23377 -24311 6398 2462 -9452 12758 23398
28971 23398 36075 27773 17145 20162 28407 38253 38391 45310 95546 92171 80510 38379 7942
28958 7942 10235 36977 69765 66831 21951 -17908 -50766 -45863 -30622 -851 20081 -7989
28946 -7989 -3837 51225 55817 22716 -3253 16290 16296 16308 -18050 -20129 -26478 -36060 -23268 24325
28932 24325 41222 -9306 7620 32809 6046 3097 9207 4502 19593 10427 -3949 1453 -9875
28919 -9875 24855 38770 38951 42483 34942 43246 51277 44093 24465 18283 -8979 -34152 -18003
28906 -18003 -5867 25252 30870 10855 -3395 3339 31839 49749 58829 62805 45552 -1997
28894 -1997 -13682 7919 -3453 8715 -12978 -41663 -39828 5095 27514 27900 -6515 16075
28882 16075 43247 31767 33147 42965 51929 74774 74970 38050 6757 -19093 -3065 6985 13990
28869 13990 872 -15414 -13685 -6197 15823 4911 5794 -26296 -66253 -38967 -27203 -54594
28857 -54594 -66079 -56758 -48091 -51818 -47212 -45138 -38780 -30748 29263 22183 10372 -294 -28904
28844 -28904 -43257 -10499 37290 43542 22269 -3731 -32397 -23265 -34642 -51457 -18478 -1882
28832 -1882 59238 70921 69144 63286 36524 15995 -715 -11569 -35963 -93340 -91043 -51474
28820 -51474 -48097 -53569 -39744 -11722 20178 20511 6452 -3598 -15217 -20133 -19379 -11859 -5936
28807 -5936 6723 -18692 -47696 -9335 35685 45264 58652 50546 42031 22516 -3102 -21873
28795 -21873 -18983 -8842 15695 17438 2967 23682 27679 33293 49167 19718 12368 23657 24975
28782 24975 14641 -16244 -33764 -19450 -22324 -20935 9324 -2338 -27646 -32658 -49374 -71630
28770 -71630 -43589 1773 -16456 -58308 -51300 -47620 -57193 -67919 -43049 -25555 -1417 37116
28758 37116 63262 35337 5385 14240 22366 19653 -16763 -8009 -9137 -20230 -10130 -22083 -7552
28745 -7552 -14401 -27474 31496 39725 45227 71824 55253 27763 12432 36983 26941 9036
28733 9036 -18914 24034 43966 48841 32931 33294 22139 27119 7895 -15445 -33503 -37207 -20781
28720 -20781 -9091 8254 25808 42490 37493 11075 -10341 -27813 -33178 -24515 -41617 -20159
28708 -20159 -51636 -45348 -21922 -13149 11424 -10185 -39963 -57751 -17229 -1959 -1593 -13099
28696 -13099 6810 -163 27353 15096 3986 39187 30118 3575 15774 2864 -6536 14957
28684 14957 6871 16273 31313 2794 -27538 -11048 -4003 10159 7001 25174 38618 45344 10627
28671 10627 3252 10319 -16038 -39897 -28359 -20594 -8227 9925 3094 20569 33764 24949 8206
28658 8206 19404 40547 45441 -15957 -26894 7860 26340 58333 39208 -8402 -50541 -41746
28646 -41746 12333 42353 29954 11858 -44155 -47974 -13653 30292 17089 13245 22083 23268
28634 23268 38916 38178 68877 58851 19676 2975 32576 25559 25658 48268 45250 37976 24516
28621 24516 11588 -17372 -10759 -29400 -53862 -42655 -28866 -12684 8401 -17323 -27756 6711
28609 6711 33462 10223 -22013 -10452 8004 69556 61416 54181 28046 -1029 -14579 3186
28597 3186 -23838 -23908 -1216 19581 -2022 -20057 -42665 -49834 -23542 -10865 -40517 -44200 -36571
28584 -36571 -47216 -19916 -17899 2029 -13835 -18427 6636 24998 32575 40768 51513 29837
28572 29837 -20276 -18159 23141 31838 59686 89803 79910 57922 38456 27548 -6079 -1741
28560 -1741 -50552 -66809 -39938 -27312 -7676 13630 -9286 3351 6090 -14608 -6184 1241
28548 1241 15795 23573 42899 27441 933 12724 20159 44385 49633 43712 53078 13332 -11842
28535 -11842 12202 40917 56582 83613 96338 84387 74339 52773 53171 16768 -12184 12537
28523 12537 50432 69693 49570 19428 30390 33345 32245 30660 33978 24709 37450 53120 55900
28510 55900 31167 -521 25430 18197 -12029 -5092 25694 19240 -13432 -52307 -79175 -66867
28498 -66867 -47568 -44721 -51095 -22905 -8709 7800 16477 24383 30029 17477 -7203 -20695 -53634
28485 -53634 -44455 -4097 12688 9881 -14410 -21766 -1780 10200 -27187 -29304 -341 15723
28473 15723 29343 14167 11490 -16383 -15603 25286 13123 10524 13599 20999 14151 53577 61929
28460 61929 40628 33118 -1948 5578 28951 56671 44824 4236 23851 22988 -13783 -33806
28448 -33806 -77950 -63261 -81580 -41991 -7007 28349 12920 -5487 -24929 -47704 -33443 -43277
28436 -43277 -30031 -23429 -43168 -7292 17118 13827 -4281 -57697 -8924 -17009 -23120 -30549 -41368
28423 -41368 -26096 -49746 -52013 -37833 -34412 -39445 -18983 -23811 9745 18128 45388 43114 38959
28410 38959 5230 -2912 -4614 -212 -2022 22730 31788 22940 52382 80989 52550 39956 24122
28397 24122 -20047 -59377 -43242 -22824 40899 48201 28447 33893 35420 41174 44278 75716 60149
28384 60149 28023 37854 55227 47957 11475 -13314 636 38827 22687 25406 33029 6816
28372 6816 5155 1692 19911 19123 -16067 -5579 20013 7091 -17107 3587 1817 1941 -1443
28359 -1443 -4979 -25240 469 7938 -11215 -387 -4554 -40634 -32044 11659 48848 38779 47943
28346 47943 41870 18847 -8757 -47105 -63766 -36779 469 -3732 -12697 -21846 -23833 -31368 -18035
28333 -18035 -7444 -1020 -19911 2421 -1745 15045 2209 3102 -3914 14531 52210 44025 9555
28320 9555 -16381 8582 -6519 -19924 -48902 -64086 -33931 -38400 -27029 17070 35575 38686
28308 38686 12629 -1154 -6569 -6451 8901 -6694 5492 -7392 -32130 -20681 13476 3838
28296 3838 28483 59352 32610 -8552 -1359 1799 -940 -9676 -29387 -27315 -50910 -30740 -47375
28283 -47375 -51939 -18724 -20342 -5682 36385 44387 28044 30780 62813 34407 -20611 -42092
28271 -42092 -23557 -35749 -30685 -18068 -14266 -3907 30466 -10459 373 11354 24842 30033
28259 30033 24351 34606 -6782 -37668 -86 -7784 8755 -12898 5195 32183 19302 -6699
28247 -6699 -6309 -27870 -14526 17903 6151 -11133 -43787 -59483 -43518 -16060 -15318 -11317 -36213
28234 -36213 -30111 16138 47050 23373 24179 -8177 -7359 18144 23626 17841 -11946 -32485 -18027
28221 -18027 -24755 -14976 -4131 27681 35974 37427 26795 11735 32218 50334 49144 54384 67585
28208 67585 44688 23355 34918 21464 -23 -4671 -13460 -49643 -51752 -36999 13460 1844
28196 1844 1898 -9098 -3434 15567 -4970 -27016 2452 7260 22294 45751 24871 33106 34171
28183 34171 39641 33841 28605 35687 71633 68680 77494 70753 85676 36119 22668 44976 27876
28170 27876 9928 -24947 -22570 53251 32897 -1869 2076 8169 13360 22026 27092 -5484 -5115
28157 -5115 12672 59345 86739 46920 7193 34424 22211 -24217 -8415 -5988 13760 -17781
28145 -17781 -70635 -82485 -34970 -28818 -32225 -31479 -13458 4387 -2842 -21625 -30003 -29849 -27743
28132 -27743 -12879 -20652 12604 31665 -29632 -8484 47156 66258 59755 -1165 -7819 414
28120 414 -32436 -46222 -36327 -20429 -16804 -33713 -43148 -42406 -65943 -36778 -20759 -6834 -8271
28107 -8271 -18999 -10194 -1481 11143 -495 25159 34487 41718 42947 36066 5710 1771 3193
28094 3193 -11378 -17829 6869 -21516 -37578 -20248 3944 20531 6428 -14856 -8744 20121
28082 20121 39633 18077 30577 11777 -21348 -21397 -46827 -35017 -42308 -51090 -43726 -10404 6332
28069 6332 18673 15350 -8378 -1500 41265 55 -56507 -49243 -6291 -9230 -5553 -7570 -7938
28056 -7938 -4200 -4098 -47792 -60554 -25842 39665 41800 25851 24101 9061 11927 -20701 -36303
28043 -36303 -65852 -78993 -20354 21399 48234 36654 48299 31897 1356 -8998 -23597 -24716
28031 -24716 -35197 -19283 -13176 -11799 7299 21669 32440 36210 39988 37069 41226 31217 59226
28018 59226 67958 35880 38946 6833 -1296 21177 61775 77469 51030 38713 25645 21084
28006 21084 -2084 -8931 17837 12746 -22529 -43246 -28885 -20487 -3003 -26256 -24994 12964
27994 12964 37882 36308 5483 -2917 36834 53748 26993 19785 44858 27720 266 14701
27982 14701 18542 35767 16887 -28430 -40730 -32336 3996 -15088 -20569 29738 38374 45349 16762
27969 16762 -9074 -20174 -21814 -25649 -22613 -47137 -24649 2188 -14199 -13889 -12723 -21712 7197
27956 7197 18695 36351 41581 -12652 -41752 -28113 -21568 -13727 -3889 1287 -2296 -14218 -34061
27943 -34061 -368 28621 32565 47459 69464 45065 19439 46861 60883 62520 22777 6740
27931 6740 3409 -4044 9705 -21561 -38243 -25700 3850 -8300 -20328 -339 3810 -22158
27919 -22158 -39326 -38089 -21501 15128 22793 -42395 -92957 -58568 10302 14435 -16793 -2144
27907 -2144 33472 74287 46399 18861 7041 -8916 -19259 -24185 -7302 11999 52233 41619
27895 41619 -941 -26203 -13435 -14601 -1258 -1995 625 14278 21460 44079 68636 67735 54505
27882 54505 29540 45785 66350 69841 70544 33049 -16523 -13076 9923 -25205 -68024 -36944
27870 -36944 -69257 -116422 -90973 -48494 -42637 -14961 3847 5531 10917 8197 848 -23322 -35095
27857 -35095 -50647 -18823 8040 4746 44990 42410 46739 53942 71161 73776 14632 -21976 -17089
27844 -17089 -17309 -13857 -28913 -22554 26513 16745 23541 -12007 -56468 -20176 20910 28567 24873
27831 24873 40751 77600 112933 134645 111605 81674 70847 64324 28233 28362 2735 -31401
27819 -31401 -37927 -15774 21366 10939 15102 32337 30513 11523 -19532 -27720 3186 28378
27807 28378 8067 -18284 -39061 -20712 -22066 -22042 -5176 57357 79227 53228 14244 5721 50110
27794 50110 47639 22082 31958 66833 55636 76179 28337 5013 39058 39317 30416 30716 6236
27781 6236 11446 -5694 -17645 12745 1937 -41058 -78828 -57980 -22431 -13208 -36730 -32065
27769 -32065 -3103 6850 13831 40057 57339 27036 -16524 -54521 -65227 -67992 -55930 -29407
27757 -29407 -30976 -34149 12260 24859 -22372 -7489 30648 4643 -5671 -9911 -11346 -11633 20304
27744 20304 30264 42495 -7679 -21432 -15928 -4266 -14226 -4004 19058 17321 -10213 -11067 -17473
27731 -17473 -40166 -47989 -35991 -29574 -26948 8567 32912 57235 75883 54876 72390 80007
27719 80007 78584 88274 106360 81994 74221 35486 -1847 -10331 -4897 15340 46553 31032 -18019
27706 -18019 -3508 -21891 -41019 -65261 -63357 -26184 -20420 -48284 -55855 6049 57085 69356
27694 69356 31961 -6177 -9859 -8053 -45138 -32645 9971 -6976 19274 17172 33892 6949
27682 6949 153 -8502 -16543 -14782 -27610 7398 24986 40650 19347 15023 23119 9525 21057
27669 21057 22734 -5952 -25232 -29193 -37551 -25316 -56846 -49933 -61116 -65868 -27405 -73890 -123478
27656 -123478 -144636 -133002 -112283 -83613 -54115 -26515 -12411 -8752 -1683 -41968 -33001 -19573
27644 -19573 21937 21920 22194 -34 5035 -4774 -44550 -27433 -4389 -21904 -16886 24530 38216
27631 38216 30276 47212 40349 72377 73637 52148 84540 71774 73921 68242 71921 49713 39528
27618 39528 46669 33831 6121 -25212 -50049 -62887 -68735 -31392 33627 52217 44807 21538
27606 21538 24162 19343 -31452 -33062 23604 40126 21152 20197 -1617 14960 38281 51995 47945
27593 47945 36274 20037 37639 60562 29713 -14547 -15750 -22441 2759 23041 11765 17019
27581 17019 15896 11031 -23598 -62413 -72653 -18144 -9388 1785 23642 49699 33654 38473
27569 38473 -7143 -28784 1291 -13957 -26970 -41836 -55973 -46096 -49064 -61645 -71822 -46371
27557 -46371 -42137 9219 38872 18677 34102 17849 -13498 -54568 -30223 10690 2044 8297
27545 8297 12106 -4497 -19689 -1328 -7191 -11887 -28158 -5958 20542 40781 18863 -27332
27533 -27332 -62641 -78441 -34913 -18536 -13421 -21871 -18540 -50745 -51691 -57686 -82448 -46906 -51244
27520 -51244 -63603 -67862 -55528 -43654 -25534 -26216 -51406 -547 22647 30484 28811 -26972 -38161
27507 -38161 9109 5241 -59761 -79654 -44421 -21156 -25300 -49318 -33455 -19175 -13905 -12831
27495 -12831 -2246 -12856 -28792 -32602 -8276 1492 -26484 -33787 -46700 -54589 -20559 -8864
27483 -8864 27138 30967 12922 31755 41882 27591 54583 23520 13759 17636 5178 -8009
27471 -8009 6638 -1219 -23148 -1510 30504 55759 54154 39243 28896 30549 32222 26777 -14711
27458 -14711 -41481 -7263 21446 13628 -1984 17984 51238 54138 3664 -38389 -57667 7309
27446 7309 23504 -14950 -58607 -67343 -49293 -30598 -22680 -68089 -44672 -39720 -38491 -24117 -5228
27433 -5228 49263 37702 -19373 -40200 -30515 -2810 13397 9509 11750 19549 -1283 4454 34368
27420 34368 4789 -923 -5606 -10260 -35558 -48261 -38303 -18793 -7183 -26647 -12715 18866
27408 18866 16453 -46301 -60322 -60726 -75995 -28870 -3431 -10365 -44061 -43214 -19310 -26519 12059
27395 12059 27374 -3557 -8461 2098 21908 26068 6117 29016 28871 -13 -1160 -12239 -29735
27382 -29735 -5570 18072 8095 -9243 -23593 -12678 -10521 3122 -26940 -25641 8514 18161
27370 18161 1845 -18604 -25731 -46087 -27392 19118 34327 48514 27741 -899 19904 26492
27358 26492 62751 47158 46765 45899 59639 31870 -5920 -11102 16501 11288 1527 -17648 -22608
27345 -22608 15181 7780 -61919 -16900 817 -32833 -85645 -96883 -40493 19101 -25456 -61172
27333 -61172 -68372 -31337 -12018 -2685 -6058 -2925 -49175 -24172 -20588 -14991 -25725 -23875 -14092
27320 -14092 29013 62820 56273 31437 26151 16368 30417 12310 11976 17539 8313 21796 25153
27307 25153 7382 15921 21609 35524 -4166 -35647 -44749 -56367 -57951 -14580 32735 35499 21973
27294 21973 -35421 -47985 -9339 -1244 9628 14230 -972 27717 39695 2822 -23124 -29287
27282 -29287 -49226 -59702 -79266 -47319 -16460 13440 -29165 -12643 -4155 -39708 -43088 -25021
27270 -25021 -170 -3361 -14599 -30541 -46990 -27521 -15218 -25859 16070 -8422 -46034 -84573
27258 -84573 -83357 -41130 -27722 3092 -10048 -6979 6491 -1826 -26422 -37242 -7327 6730
27246 6730 -9178 -15123 -4339 -17867 -54414 -36377 -14112 -6337 18700 29121 -1137 6117
27234 6117 34754 48419 31759 8184 23126 31218 49849 48046 18268 3187 -9635 -15470
27222 -15470 -40898 -57260 -65047 -13198 16315 52771 45740 36523 32216 15726 29549 15461
27210 15461 -48182 -45696 -24716 -35012 -8026 11688 51023 48431 27680 -7012 -33621 -39914
27198 -39914 -17011 -8874 -53007 -55722 -53230 -73261 -68512 -19682 -36803 -28743 27525 23334 -7530
27185 -7530 -102 25504 -16784 -30806 -42053 -27106 -10152 16800 53367 48083 2843 -34940
27173 -34940 -44416 -14228 8943 6772 -16369 -44822 -17608 6140 26690 27133 2148 8096 11208
27160 11208 21623 2103 16697 47704 26968 18419 -6052 22773 29478 -9756 -33544 -42753
27148 -42753 -60801 -42054 -10227 -8027 -15682 15592 14558 9434 3966 -13859 6900 9002 -4122
27135 -4122 17904 15318 8964 -15030 -43937 -14298 3638 38866 80244 66573 46397 39332
27123 39332 17603 -20158 -9480 13537 3842 5947 -3083 -30032 -48760 -80296 -71241 -17113
27111 -17113 23272 23120 31345 43779 52623 49833 14881 -14176 -24877 893 3673 -7394 -16369
27098 -16369 -379 -1803 9568 33049 1317 -5610 19382 -1150 -20720 -11184 -496 30666
27086 30666 47329 17507 3778 -2102 -32532 -30792 -58142 -16896 2308 805 -2275 -15264
27074 -15264 -24989 -45332 -32023 -33999 -17488 -26108 -46182 -63946 -36838 5746 16955 39820
27062 39820 41099 -16888 -45121 -18670 -16704 18438 74974 61918 21404 10869 16407 3378
27050 3378 8749 -57 1757 16732 -1883 14731 58827 84913 57328 28828 36039 27562 27178
27037 27178 20828 3521 -32178 -47086 -23761 -19002 -12288 20172 46852 25571 24452 21562 48534
27024 48534 59492 19170 5075 4881 23117 37224 43135 65306 81048 60174 24365 22195
27012 22195 39280 66911 63470 69189 59696 13661 1073 31294 70961 58345 52554 52263 54230
26999 54230 40627 1001 28284 38390 51136 20543 -33314 -29863 -33562 -63009 -12543 11247
26987 11247 -4394 -15896 1490 11618 -27599 -40418 -26570 8368 15264 8901 8584 29867
26975 29867 3499 -25518 -17047 -5516 -12602 -38503 -52933 -12561 16198 19798 52924 36624
26963 36624 38522 19975 38891 69616 77773 68212 47020 -5738 -43170 -29720 -40282 -17562
26951 -17562 -2010 -46472 -60760 -22673 -9103 -5788 2372 35595 63872 50699 18174 -28908
26939 -28908 -39004 -31821 -220 -11248 -13694 22901 72048 66661 36800 14731 -7779 4479
26927 4479 -1541 -26203 -26719 -12808 1302 8791 21876 -6153 1090 15105 13874 -15149 -27041
26914 -27041 -22922 12263 27870 19978 -5392 18729 20056 26112 -14937 -20341 4353 11035 35212
26901 35212 39446 34821 12183 373 -22169 -32768 -15817 -14338 -24596 -27182 -29423 -24747 -17227
26888 -17227 -8306 133 7001 -1179 14344 43076 20568 35748 36469 13555 11487 -2548 -6004
26875 -6004 -22593 -23093 -26562 14198 29553 -11967 -23670 -45029 -31950 31242 22225 -6956 -31906
26862 -31906 -48890 -60361 -25935 -2696 7455 40515 65945 36629 -19510 -36615 -55352 -66198
26850 -66198 -51561 -36034 -39215 -41930 -20066 -61037 -37621 -32822 -22364 -51443 -54965 -29646
26838 -29646 -519 17241 8267 -4711 -2091 32385 56999 64820 46080 -103 -39606 -44039
26826 -44039 -22754 -9705 -37939 -45382 -23662 -38277 -18520 -24950 -59493 -46811 4197 22991
26814 22991 -902 -267 9610 32949 21019 29511 18336 15339 41287 48346 18654 41091 53492
26801 53492 67211 23765 -21691 -29317 -17979 2416 15840 39026 15469 720 -33552 -42422
26789 -42422 8242 29015 -2791 -221 10418 -16277 -20672 -14663 -8801 13151 -8582 -10514 -30258
26776 -30258 -40246 -25992 17391 41270 -20832 -7448 5128 -20607 -16729 14525 5318 14346
26764 14346 51679 44906 42567 32301 28856 6561 -48857 -68007 -61814 -42437 -2005 46587
26752 46587 60354 71100 24042 2270 -18732 -27835 -38867 -27013 -40285 -36774 7928 36918
26740 36918 3134 -8147 -26366 -48179 -34190 -15822 -49854 -43655 7426 15031 4319 -30920
26728 -30920 -47078 -27580 23861 61762 48793 21393 3245 -29388 -28617 -13202 -5752 39993
26716 39993 42761 35264 15246 -2712 -3230 419 -16646 -45583 -36632 -28213 -29338 -491 -5301
26703 -5301 29688 25399 -19557 -30736 -25535 14172 33350 32157 -6739 -11714 5468 -8181 -15201
26690 -15201 -3916 -10105 -35637 -35034 -15311 -4313 44246 80699 59360 16425 -21328 -9279
26678 -9279 -15529 18324 40048 28938 54180 70560 67460 28961 23054 8261 17307 58819 76458
26665 76458 17102 -6846 -30341 -29446 -49062 -68293 -26508 -58441 -59079 -53292 -45167 -8027 18472
26652 18472 28103 13629 -5314 -44279 -48842 -49472 -17349 -19619 -28813 -5876 -19406 -38615 -42117
26639 -42117 -15727 -8929 21287 13887 -19339 -44271 -31432 4049 19701 25192 46371 41168
26627 41168 3803 -17200 -18958 -30232 -28626 -12671 15319 -960 -13886 -14719 -9375 10700 5493
26614 5493 -27601 -4809 29612 30050 7055 -4623 50783 49493 1283 -25908 -35459 -33830 6941
26601 6941 28641 41496 16757 6867 19277 27625 51517 87521 60617 6067 -13968 10091
26589 10091 -3364 35178 34423 -3476 -21817 -23268 -40785 -42874 -46028 -20596 35916 87104 72352
26576 72352 41040 -2016 -11506 -19539 -45749 -64515 -54422 -50120 -26566 -50001 -58664 -40204
26564 -40204 -28815 -31787 -40968 -11452 -6047 -31382 -38283 -12061 -31297 -30061 6102 59167 64303
26551 64303 38754 9075 -18624 -31151 -67111 -78655 -45032 10057 11055 -15034 -31728 -70100
26539 -70100 -81044 -52557 2670 30157 36330 28543 15864 3592 5362 22459 32477 7788
26527 7788 14825 8048 37230 28749 2450 -12428 -12264 21213 36131 27630 -3493 -6906 -9069
26514 -9069 3208 11797 12449 -18032 -26356 -6690 -11459 -35307 -41806 -25798 -31868 -27241 -50602
26501 -50602 -60709 -49355 -50230 -68868 -81948 -84286 -44073 10850 -8353 3391 53883 35480
26489 35480 -11856 -18810 8553 56687 41236 9858 -13800 -37313 -44440 -52001 -62588 -42580
26477 -42580 10900 45272 55952 58066 17839 12572 -7644 29180 62323 72701 32301 -13549
26465 -13549 11181 5601 17761 16335 -16719 -24062 -23903 -9421 22429 13435 10095 -9951 -25033
26452 -25033 -48925 -53091 -23743 25721 50379 34694 71354 54933 27080 52201 64671 32196
26440 32196 -9348 6857 1243 -23747 -16403 -18883 517 39446 53622 38752 -3134 -12058
26428 -12058 -4379 25263 -5753 -19504 -8079 -39267 -48244 -29940 -17512 20679 23727 37512
26416 37512 61170 62904 16753 14177 30826 55863 24857 -24268 -89690 -107943 -84852 -64073
26404 -64073 -52493 -22615 -19949 29469 14172 40089 29993 14800 18027 26255 44897 64198
26392 64198 24009 -43022 -65350 -17061 -7353 -15927 -26761 -33473 -25649 -22233 3796 -6477 -13747
26379 -13747 -18994 -61698 -81272 -75821 -55795 -24201 20338 10561 4019 -259 6257 2765 -23124
26366 -23124 5859 42918 56307 46093 74342 83270 58582 18253 9417 7441 -7109 -39927
26354 -39927 -1715 29542 -30635 -48337 -57205 -35273 -44375 -53915 2626 4959 -3456 -16551 -43933
26341 -43933 -46508 -53278 -31366 -20294 -10410 -10465 -12288 39686 52946 26000 5013 -25962 -44981
26328 -44981 -23508 -33878 -56216 -72264 -72876 -43286 -45288 -49642 -45135 -39916 -43429 -17594 -8807
26315 -8807 1320 -37824 125 18255 -8637 -29644 -11778 -9253 -11297 16295 8040 -7004
26303 -7004 -2091 1033 9108 -3675 -18649 -7273 7300 -18269 -61180 -66766 -79958 -31742 11195
26290 11195 14897 37691 41426 1064 6564 37664 35921 56548 54477 52196 37773 22766 8595
26277 8595 15505 25718 -5750 3433 5702 21608 -346 -8221 23043 12754 -15132 -41820 -57074
26264 -57074 -48245 -22486 -24795 8082 34541 40606 17614 5861 -33033 -64019 -41153 -35921
26252 -35921 -22047 -30527 5738 17931 19232 -1752 -32114 -26123 2940 -509 -6332 15070 16420
26239 16420 6195 -7858 -1213 -14489 -3666 32335 10190 30744 13196 -11499 -31532 -77267
26227 -77267 -75177 -43185 -46564 -35571 -16154 -33361 -24847 -8973 11702 13338 -15520 -17635 -48300
26214 -48300 -70233 -24503 -27179 22650 111967 100999 39869 19720 39503 67364 55188 42490
26202 42490 5521 16367 14739 8567 37169 29043 23605 42132 15791 -16677 -83564 -82260 -63113
26189 -63113 -64790 -82126 -47387 14662 55293 53790 7316 -5607 9838 18607 28755 -1780
26177 -1780 16283 -3714 -27901 -19670 -4971 -2943 -8819 -1257 13486 5681 -17942 -16994 121
26164 121 -18450 -60946 -94279 -55784 -36777 16722 39425 22843 -17545 -33604 -765 17738
26152 17738 12969 -4474 -6455 -6183 -37697 -73748 -70830 -38619 -21508 -26191 -22777 43131 51910
26139 51910 6180 791 47031 79505 82015 82849 44850 2179 -60308 -92565 -74021 -29124
26127 -29124 -4138 17579 23078 7057 -5049 -39399 -59359 -60908 -58638 -67005 -39624 17623
26115 17623 57169 46145 51755 43035 32522 20853 -7886 23210 51632 76855 46758 9343
26103 9343 32409 60746 62153 60779 45356 52770 62089 48372 48432 22577 41519 43142 34916 24368
26089 24368 11721 -16268 -15666 -6371 -28380 3370 26333 7916 7881 12049 40649 40727 -1604 -13288
26075 -13288 56143 102499 86234 59910 10453 10218 -23185 -26118 29839 17270 8167 42131
26063 42131 40092 10941 -2237 14566 31708 25662 21156 17438 34165 30017 37060 -14907 -65420
26050 -65420 -40756 13353 39149 36362 11294 -1003 -16019 11689 4591 -5913 -41396 -51948
26038 -51948 -40448 -26542 -20993 -48637 -24923 21099 8918 -47457 -48079 10315 48435 32007
26026 32007 15894 -7886 -67401 -37928 -19991 -47905 144 40335 5776 -27234 -8442 1746
26014 1746 -6032 -3476 -348 900 -3878 -7537 8892 -20406 -929 30188 7449 -16396 1785
26001 1785 4676 42194 69410 70133 57314 37407 53983 699 -30950 -19643 -940 25710
25989 25710 -1068 2580 19793 56464 40702 -19614 -11012 -21873 -14902 13095 38396 33944
25977 33944 -5252 -8404 -8705 8027 46479 24301 18153 40425 17700 -5068 -2289 21665 4649
25964 4649 -48465 -99574 -98978 -85431 -85112 -79554 -58885 -24115 1096 3284 -27260 -52851 -49689
25951 -49689 -17007 8159 23709 18275 4092 14624 41004 62392 67808 15965 30236 39154
25939 39154 28989 5937 20003 53746 55610 42460 52579 50232 40999 760 -19163 27639
25927 27639 56215 80364 73571 57470 70405 68096 24990 14067 -6980 -28501 -36371 -49624
25915 -49624 -26890 8341 18721 13130 26971 53134 20707 -49455 -58568 -21578 -5015 4648
25903 4648 20943 17052 27007 26676 34541 -4895 -42391 -36374 -21412 2857 49632 60026 41130
25890 41130 6920 -9414 -4351 21191 39698 64358 53222 21962 53792 70104 82354 70688
25878 70688 49883 7184 6264 1566 4695 19115 -11233 -15282 2235 -20831 -22343 -10276 -3230
25865 -3230 -6055 7341 11464 15086 1131 -29950 -15016 -17620 -31527 -3036 31253 -6286 -19518
25852 -19518 -38028 -60872 -48115 -28994 308 10822 -3172 -41048 -31564 -24473 -47145 -48628
25840 -48628 -38059 -18711 9250 23899 -3180 -18245 -20718 -54258 -41659 -18478 -32334 -1034
25828 -1034 -24497 -30615 5513 32880 33910 21854 38831 42005 23078 -21137 -21983 -30008 -10137
25815 -10137 -4335 -1915 -3071 -28696 5866 29658 5351 4442 4614 8524 3313 3043 -15667 -6553
25801 -6553 -9325 -28378 -61898 -38297 -27703 -20278 -4085 -33973 -33412 -38224 -39771 -14379 -9814
25788 -9814 -2084 6172 -10697 -27412 -29355 -40415 -34790 -20437 -20212 -9413 35841 65230 72040
25775 72040 30218 23185 10224 -16774 -39079 -46556 -23581 -13474 34028 11261 27811 17706
25763 17706 1712 -15626 -21934 -7974 -15084 12313 -3602 30959 53813 29497 -4100 -21072
25751 -21072 -32048 -38409 -9464 -13682 -17352 6779 2446 10520 11224 17154 3696 25248 32541
25738 32541 13197 4826 -5050 -37827 -65457 -24496 -10711 14629 38350 45101 34431 7404
25726 7404 -11293 18255 22525 -1039 -30744 -69255 -61987 -11943 -30155 -44746 -2456 16298
25714 16298 23510 -27504 -29425 -16472 -26876 -48947 -44683 -38803 -48925 -49688 -7994 41518 39223
25701 39223 -6272 -33430 -29029 10737 28131 -6642 -532 -12202 5137 24967 28890 13292
25689 13292 59412 33372 18314 45965 15927 8278 -8363 -40138 -77543 -83938 -46363 -39007
25677 -39007 -51162 -39555 -53032 -52666 12256 42279 39270 22497 -21559 -42458 -10389 11823
25665 11823 -10579 28403 23922 14619 17289 -4073 6761 28782 1875 -17808 22024 28798
25653 28798 28659 14182 19497 12738 8994 4785 6833 21738 29969 18453 14274 25405 419
25640 419 3135 3523 6455 11367 -6951 -26738 -34709 -6749 184 -9659 281 -38190 -25339 -1975
25626 -1975 -20634 -34551 -1861 41394 13678 -35511 -48203 -29472 -35800 -50747 -52281 9122
25614 9122 12790 -23383 -31129 -27679 -13174 -6441 -33236 -84496 -84107 -30275 -22650 -20320 10660
25601 10660 3661 -9767 26447 18484 521 -22341 -33883 -22455 -21694 -31169 -25251 -18365 14409
25588 14409 63603 56912 9585 21694 10157 -42026 -38 29787 18842 23087 12066 5254
25576 5254 -661 -276 -17117 20270 26910 -9435 3161 21565 20107 48747 49719 25165 40983
25563 40983 40737 2637 -9868 29744 52655 54882 36484 36270 -15744 -22868 6513 39074 14892
25550 14892 -15174 -12302 -1573 15541 45078 69514 24275 -2341 -24865 -73558 -48810 -1895
25538 -1895 -9804 -28680 -31685 -22022 -49775 -14419 25278 29012 12487 -2610 14708 45135 31191
25525 31191 30735 5125 -13125 -30602 -14629 -15755 -28190 -40844 -43744 -32550 20970 13113 4988
25512 4988 -25296 -50117 -62895 -35346 -28849 -32507 -22492 -34035 -45069 -38152 -27496 -21778 -27539
25499 -27539 -49150 -31102 14021 56798 79711 73312 50446 62450 39331 1249 -7228 -9841
25487 -9841 -5252 -16675 19490 64848 48648 17377 -16699 -33760 -57684 -51347 -27865 -40080
25475 -40080 -64820 -3187 61701 54815 27362 39141 48216 14725 457 11484 16916 -2018
25463 -2018 44941 54111 35217 -15514 -29495 -53937 -53384 -28471 -40107 -25963 -2308 -11818 -6618
25450 -6618 -10217 -23770 -35638 -28263 -6770 -13464 -3566 37504 41738 1837 -7118 -11485 -20882
25437 -20882 -22804 -65204 -29370 7317 9144 -3113 -27000 -53795 -56184 -24424 33002 33514 16247
25424 16247 26117 -14464 -33865 -31062 625 51638 14669 -1068 1139 742 14058 10522 21745
25411 21745 15835 -16070 20602 36364 18387 10598 41692 54217 45005 33846 16377 23422
25399 23422 -1428 -18032 -34889 6794 27563 -10107 -32723 -58385 -68551 -76480 -39863 -8203
25387 -8203 -29412 3900 56566 46527 -6525 -40312 -9127 19736 34208 25488 977 -12623
25375 -12623 3368 2981 26049 16160 21082 1575 -13934 13078 17340 22185 27764 13274 -11367
25362 -11367 -20665 8372 1241 -1371 -17084 -7335 -6977 -29391 -11455 12070 -7672 -14412 -43176
25349 -43176 -27408 28271 46717 39235 2289 -23371 -39874 -29489 -28820 -65628 -85248 -46148
25337 -46148 -12522 24784 34863 4956 -34044 -78577 -77854 -31091 -3634 11226 6464 -13047
25325 -13047 -40861 -30869 -9066 -37787 -69412 -81630 -69840 -46106 -33491 -21898 -53470 -25808
25313 -25808 -25334 -29450 -21082 -14597 -16091 -6792 12797 43538 44341 59338 66013 33340 30358 31796
25299 31796 46852 44492 33522 52633 43333 17746 25906 30591 26750 9043 10718 26110 51646
25286 51646 48668 18443 15421 7997 28685 25221 -13914 -31376 16164 60744 78471 59423
25274 59423 23950 11435 -2043 -4871 16492 58554 76517 39164 2455 -4535 8189 -5089
25262 -5089 -40777 -45778 -30116 -40848 -25486 -1521 9312 20630 17278 37351 41854 21419
25250 21419 -9616 -1448 16191 53065 47421 31708 -19055 -39795 -17862 17581 22776 -14329
25238 -14329 -13189 -23814 -30632 -40173 -59710 -60237 -59339 -38233 18636 26423 -1479 6893 26815
25225 26815 21592 24763 16517 -24114 -6302 -9294 -4329 -16331 1780 32471 61430 41664 15456
25212 15456 12598 31241 23725 18444 -4575 -18231 -7063 -914 14435 24173 15053 36224 10199
25199 10199 -10202 -18048 52444 62945 31831 23012 11069 -16117 -55850 -47982 -50150 -23414
25187 -23414 -764 5851 -16571 -12264 -30031 -14796 9107 12080 50685 52893 34772 44478 54331
25174 54331 29002 12956 -4953 9994 13444 -4690 -2183 21999 -3723 -29628 -49522 8891
25162 8891 23232 21538 -8852 -36400 -12507 4818 31013 18604 37968 15881 1791 1860 -21127
25149 -21127 -62933 -76175 -73608 -59619 -49011 -49880 -24908 2426 46750 52170 46329 48839 -7747
25136 -7747 14256 5326 -7886 32611 25816 -1047 3394 6188 8133 21796 -8293 -11246 -15431
25123 -15431 285 13172 20075 40260 34842 3740 16153 18993 -40574 -46730 -27526 -7194
25111 -7194 -4091 11451 -1679 4169 -10726 -18905 12160 -13520 -25065 -34193 -33747 -7942 -3899
25098 -3899 -20920 -39550 -42517 -53431 -50158 -52402 -23127 -18868 -19132 10635 23078 38007 35802
25085 35802 5650 -621 -7078 -3098 -57 -8993 1036 -14507 -34044 -11790 -270 -11376 -36748
25072 -36748 -32732 -20604 -32364 -16413 -18263 16003 57946 65241 36409 -1419 -9833 4901
25060 4901 9991 17911 51550 22284 23631 21647 31718 35138 30264 1432 35996 34819 -2780
25047 -2780 -27447 -43809 -35121 -35938 -39255 -69771 -61791 -17316 -16790 -55257 -40083 -27579 -11592
25034 -11592 -12221 -22322 -5537 31167 34123 12991 -25158 -29939 -19306 15129 19887 -12321 -6496
25021 -6496 -5561 1526 8005 4352 21960 55911 52708 23220 27819 8487 -8508 -8283 -12826 -9717
25007 -9717 21426 39084 35758 25626 5636 -836 -8012 -4724 12626 -3343 -5526 179 -6195
24994 -6195 -36149 -37793 -27296 -48673 -44000 -12714 9968 3634 -9824 -39732 -14165 -2582
24982 -2582 -6882 -30746 -39964 -37869 10833 36939 65893 76115 94052 105415 29588 -23360
24970 -23360 -23684 -22155 10750 25472 21882 57679 26490 -1007 -20471 -26385 -1116 14028 35198
24957 35198 45779 28096 -40483 -59869 -44055 -26721 6076 22644 35742 8380 -14362 -8104
24945 -8104 8029 -12470 -4890 10914 8791 3932 1505 16513 32879 47685 13214 -14761 -5257
24932 -5257 497 25067 7102 -23347 -28615 -53112 -51458 -81509 -39403 9745 -8808 -34716
24920 -34716 -32308 -37665 -35380 -13755 2943 1403 -16397 -25222 -8029 -30413 -54768 -70765 -41502
24907 -41502 25229 25689 31394 7847 -10269 13813 6347 -42550 -65346 -49414 -6131 11688
24895 11688 1343 -15992 633 -8361 -11845 -29631 -64319 -70957 -52194 -48152 -22927 -10700
24883 -10700 6194 881 1586 4550 -2570 2589 12626 16010 34881 1009 -10248 -36881 -49518
24870 -49518 -19504 6316 20309 38435 49123 31907 3201 30869 49545 90697 94565 86931
24858 86931 52145 40503 6032 960 25949 1242 1796 29861 36199 15741 10346 20028 44883
24845 44883 33714 3430 -22638 -29081 -36614 -30262 -31480 -16203 10331 42130 36478 12682 -21692
24832 -21692 -47452 -83307 -58640 -40748 -52381 -46228 -36932 -6892 -21575 -23963 6821 3728
24820 3728 -24687 -33487 30095 76049 45923 22501 13994 -17641 -50849 -26724 9532 -18901
24808 -18901 -12688 9653 26487 1047 -56660 -45116 -21895 -6804 -4631 23767 20651 -4434
24796 -4434 -35850 -23857 3213 26366 -5228 -68027 -84555 -37686 -6755 -9696 -4015 -12759
24784 -12759 -36955 -27859 -17693 -8580 -23239 -24068 -14620 -34738 -28199 -63094 -62572 -48179 -37362
24771 -37362 -30548 -30933 13551 63305 78737 90023 61036 -17291 -6927 16222 15271 13741 -4540
24758 -4540 -25337 -36298 -42452 -18502 -968 -2712 3123 -9587 -7002 -688 -15203 -35993 -16331
24745 -16331 -8581 1435 18628 48682 5600 117 21123 -409 27291 45302 29170 10836
24733 10836 -37628 -47923 -75073 -74111 -69674 -62054 -47698 -40568 -50069 -26839 -13725 -15074 -20120
24720 -20120 -7161 262 -26460 -10815 -475 -14561 -7478 -5380 -26991 -15204 33781 22213
24708 22213 8242 8218 -13786 -8686 -29202 -41660 -33297 -35656 -32014 -4733 6348 3572 12545
24695 12545 -18659 -37152 -2162 -14766 -32594 -28734 -57911 -75597 -22923 49079 82222 12383
24683 12383 -29091 -23673 -11503 6364 10496 -4691 -33625 -36143 -2034 49126 44768 44929 59000
24670 59000 56944 16865 -25263 -50884 -14766 41226 37195 38685 64542 70765 45133 30442
24658 30442 12067 -6833 -13100 47481 51771 15149 -2523 -40097 -46950 -51913 -66416 -49321
24646 -49321 -21864 -11192 5317 44708 74989 47924 2158 -18 37019 49092 41723 13672
24634 13672 -2018 -34422 -63276 -74242 -60066 -37843 -10188 -3814 -38848 -23867 -26235 -40325
24622 -40325 -47811 -45903 -29245 -44177 -38113 -13386 -11998 821 19780 28505 -1928 -173 -5622
24609 -5622 -18901 -39531 -28653 -18164 354 5387 11165 56545 20566 8667 -4912 -26229
24597 -26229 -56611 -66906 -36907 16861 20474 37020 23930 17435 35344 35029 44963 10229 2531
24584 2531 8735 9289 23407 37273 -7344 -30220 -16880 4296 21930 5908 -3404 4691 26163
24571 26163 24919 19627 34299 42027 37509 38425 51384 51301 55219 27092 -16014 -14233 8633 19089
24557 19089 -4742 -42489 -24732 7216 45056 61503 13814 32246 27537 31262 1447 -16764
24545 -16764 -27112 -6238 859 -22899 -47182 -43105 -28124 214 15406 11555 11060 47234 83534
24532 83534 66296 10485 -26617 -58679 -87708 -72861 -25615 2942 26485 34978 47582 29666
24520 29666 10278 -33688 -47485 -14657 -20467 -29613 -39898 -61577 -42263 4646 20669 30549
24508 30549 30814 -4325 -67095 -78921 -23084 -11603 -40402 -57452 -49200 -53808 -38825 -41725 -57416
24495 -57416 -67251 -18366 13973 17059 13806 31939 19175 57203 84396 66501 57141 28300
24483 28300 6061 -23247 -51296 -94304 -79700 -56253 -12689 3128 -13824 18722 19396 -6214
24471 -6214 -61754 -30676 -13761 -18629 -31068 -31748 -42275 -37545 -18969 -28480 -17168 -44989 -20486
24458 -20486 19554 41208 6387 -20929 -17660 -10545 -23775 -13151 1696 -22640 -3731 30827
24446 30827 23157 32394 23326 -1868 -7622 3493 14271 18602 -35684 -50867 1397 50865 43230
24433 43230 12684 32479 14819 8520 33868 47199 44366 36094 -5864 -43810 -48297 -64790
24421 -64790 -47977 -35621 -22058 -57574 -37995 -46377 -65578 -28867 -38829 -27528 -48967 -34960
24409 -34960 -24158 -9951 24628 23783 22364 45450 35174 21001 -15076 -57751 -52371 -1385
24397 -1385 30983 25385 26553 -6414 -16902 3328 30961 48005 59126 33444 34909 65508
24385 65508 90421 70720 68662 45058 27292 26122 -7595 -27143 -5961 -17023 -30181 -35181
24373 -35181 -30479 -41286 -49105 -28378 -27864 -35244 -61757 -45641 -10701 313 -21967 -40278 -44968
24360 -44968 -63613 -81411 -87254 -53721 -34231 -65998 -63187 -90559 -67125 -1839 -3014 -2661 53347
24347 53347 67765 49074 49861 36589 21934 -20578 -5777 35967 25345 5173 25567 66429
24335 66429 18662 -17734 -1698 7851 241 -25041 -45812 -37277 -42165 -49131 -9705 -299 -3540
24322 -3540 -32166 -60183 -80565 -57381 -9929 12630 5209 28022 -7239 -17094 -21985 -28498 -3357
24309 -3357 -1593 13064 -16481 -25884 -23757 -25670 -12559 13331 25066 7684 27593 59285 63567
24296 63567 31152 22032 24785 -5350 4231 13636 24457 20984 11325 10990 35277 14571 24376
24283 24376 65103 88378 98735 45597 -10506 -9209 -13977 -17066 -40810 -36241 -22658 -38091
24271 -38091 1585 21130 -47047 -41947 9993 56543 60715 36046 22810 36219 9300 -26952
24259 -26952 -23695 3108 49760 62157 31260 -18045 -59199 -57594 -22107 -3693 -5341 -35759
24247 -35759 -63529 -39441 -4595 -17996 -6953 27174 52250 39008 9438 17253 31808 23723
24235 23723 -1262 -11132 -1618 9465 28857 3668 -23679 11605 10850 -11999 -66972 -48604
24223 -48604 -86446 -79328 -15158 32547 33092 31255 44670 28958 -1687 -5930 8184 -31586 -54915
24210 -54915 -43782 -15983 44230 59382 53305 22677 15079 3354 -10680 -15758 -23826 -60254
24198 -60254 -74652 -27739 1979 -29977 -42892 -4562 -8985 3187 23019 30836 13847 -19979
24186 -19979 -21130 -2012 7930 -3338 -34748 -71944 -102642 -63402 -32387 -29301 -51212 -16538
24174 -16538 -35774 -43115 -4698 19192 -6684 -22793 -25049 -36810 -12210 -6572 -8514 16844
24162 16844 23262 16512 6224 3015 24315 28095 47365 59635 38774 21025 -21528 -20612 -9080
24149 -9080 -44621 -45105 -48629 -70341 -95103 -75727 -55350 -9772 47088 62677 68607 20463 -24680
24136 -24680 -38471 -5869 43544 98185 99403 71708 73882 82866 70496 45160 58930 44795
24124 44795 6431 -23501 -45898 -6320 4524 -21190 -11823 -16903 193 -1704 -13578 14387
24112 14387 38765 37084 -26734 -66794 -42340 14686 51619 64739 60182 57763 53850 9109
24100 9109 -14836 -15914 12298 15088 10437 6211 32925 44820 21307 12815 -29904 -68007 -81960
24087 -81960 -82526 -74710 -94720 -107934 -103701 -94032 -51584 -5677 42388 46543 32216 10274 -14924
24074 -14924 -35222 -24993 -10151 10048 28907 5525 -24921 -13472 -11652 -54942 -80941 -59353
24062 -59353 -29036 -48219 -64927 -23417 -4003 7718 49805 52968 63364 60384 40484 13721
24050 13721 -13600 -20904 -11116 30007 65747 67890 71995 81898 126171 92867 43984 10177 14674
24037 14674 28805 44164 29460 20254 6819 -23595 -55375 -21520 -7979 -14294 -11411 -57622
24025 -57622 -53638 -35881 -46162 -28823 -870 22243 34662 12382 -14054 -41671 -19261 14834
24013 14834 11110 -29321 -40281 -34403 -34460 -26126 11329 6260 -8306 -2647 -16993 -13130 -36309
24000 -36309 -44843 -54793 -67089 -24029 -28206 -45348 -55962 -16516 29749 3118 -29775 -25516
23988 -25516 -4051 24927 5761 -14510 -3401 -23000 -49739 -29073 -4555 -13215 -25096 -20648
23976 -20648 -12872 -34224 -65094 -26494 29564 10411 -33984 -44530 -81916 -79483 -50719 -36876
23964 -36876 5472 28434 34923 6961 -40819 -63857 -58369 -65488 -79095 -49846 -25882 -7973
23952 -7973 27207 44975 -10644 -16317 -14226 -1851 15883 18357 -13283 -2998 -4186 -12502 -26357
23939 -26357 -69498 -72653 -54910 -31514 -16543 -29616 -38351 -20407 -50600 -78184 -99005 -67413
23927 -67413 -30770 -6620 14355 -2 -17758 -38348 -29487 -10079 -23973 -9565 -13847 -64220
23915 -64220 -83842 -59378 -17182 14336 -3496 -16622 -26952 -8574 -6889 -21438 -28343 -29016
23903 -29016 732 1096 -12351 -331 -10376 15338 53448 31465 15989 27185 38295 -10975
23891 -10975 -18028 -21502 -18179 -4482 -12915 -37163 -29760 -17362 -41259 -52612 -63214 -43940 -40467
23878 -40467 -55351 -18376 24812 33776 8857 -11153 -13026 12457 35189 12390 7867 38669
23866 38669 49139 59541 82732 31381 -62430 -88841 -54560 -29537 18525 42920 58272 48479
23854 48479 20872 -1595 7198 61259 73923 42993 9830 4426 23113 18719 43288 49084
23842 49084 9280 -23114 -20325 -9840 -30451 -38392 -26633 -4124 32908 51122 28009 -11087
23830 -11087 -8908 684 1600 8269 20980 -9442 3144 7033 -1219 -6315 -10552 10977 -13084
23817 -13084 -14958 -30845 -53426 -41535 8254 9119 -24433 -26586 -4149 7763 16768 19988 -12532
23804 -12532 -11511 -1471 12263 -13212 -24116 10647 47094 57727 83508 50993 35220 29439
23792 29439 35790 -449 29894 37671 40089 37606 4354 12537 55424 75855 55568 44633 19669
23779 19669 12155 44698 9580 9293 -1257 47440 40531 8456 -6196 16853 2435 -134 -17659
23766 -17659 -52852 -96787 -68805 -38024 -31612 -17825 -552 6474 -32445 -53324 -55960 -46022
23754 -46022 -24272 -18773 -1581 14161 22670 20283 11810 8292 -14058 -32458 -6139 5177 -34585
23741 -34585 -59854 -78464 -71514 -43809 -20490 -26320 -51325 -68234 -31665 -2064 4533 -1578
23729 -1578 1300 -3037 -3310 15906 7711 -48507 -70760 -102503 -103268 -72331 -21469 10558 3021
23716 3021 14440 -7198 -30689 -53848 -50412 -44526 -26011 -59514 -52529 -8842 8788 -15447
23704 -15447 -9093 -718 -10935 -2637 46058 4823 -53570 -53729 -62167 -38268 -32726 -28897 2683
23691 2683 20077 -11720 -41597 -30788 -12223 22850 32864 -2406 -32176 -64964 -56666 -1706
23679 -1706 98 -33792 -41453 -58933 -60288 -11057 -875 8375 64156 48407 24516 22015 3277
23666 3277 6671 -22260 5331 49846 64194 48453 16076 -28558 -29658 -2812 -27359 -20850
23654 -20850 -1281 1640 7712 47 -19748 -39064 -49603 -36608 9372 -12084 -20468 -26014 -14078
23641 -14078 -17405 -80367 -74770 -2176 33192 52493 36944 16224 7427 10442 596 12392 -3968
23628 -3968 10236 29631 25107 12583 945 2242 -18353 -24875 -48468 -31354 -718 16220
23616 16220 16592 1927 -1686 2304 622 9135 -11683 -1957 -10092 -1909 8456 13878 56758 91468
23602 91468 57426 26026 4540 -11237 10046 50955 36160 15552 -2196 -8819 6216 53040
23590 53040 37625 27255 10780 -8065 -16624 6875 15669 14880 -19160 -40158 -52679 -52371 -45923
23577 -45923 -48035 -24700 -41034 -31839 -27319 -44024 -26789 -34512 -27097 -37640 11509 26696 -6310
23564 -6310 -44594 -50709 -20069 9512 5822 707 16208 -3723 32347 61693 51031 61149
23552 61149 24808 -4754 14448 40310 6071 -20986 -24234 -32831 -18607 16023 56383 37929
23540 37929 -867 -22536 -22124 15206 9563 5648 -12547 -52950 -57204 -30604 -40563 -34794 -9742
23527 -9742 -6243 3796 -972 -25964 -36759 -31835 -38338 -32439 21065 35870 53108 7555 -31198
23514 -31198 -30967 5919 26521 12824 33981 29349 -21329 -41516 -27321 -30262 -2880 15669
23502 15669 45186 57633 67158 44243 51043 48597 81413 107031 94628 30291 -10001 -39503
23490 -39503 -19245 -21847 -45869 -32591 -10506 15478 27746 11073 -11542 2117 11991 -12717
23478 -12717 -34396 9621 53862 50288 58737 12524 4525 28452 1443 -65769 -61320 -31112
23466 -31112 -18152 -51436 -50891 -31776 -72033 -93939 -86535 -91337 -77003 -35675 -55482 -49870 -57772
23453 -57772 -63005 -63504 -80286 -78091 -50863 16843 40740 33219 39239 46173 21869 695 24522
23440 24522 11664 32130 56259 101176 104257 95962 38674 994 36396 79712 53137 22050
23428 22050 25751 43656 44246 61735 41626 9589 3072 20515 6996 5332 29773 26483 3421
23415 3421 11528 17052 21990 28837 31475 8953 -12605 8378 22053 20520 3728 2603 8685
23402 8685 24807 42840 32957 -4385 -32279 7742 29404 18939 -14958 -31934 -37225 -10382
23390 -10382 -30066 -18826 -31141 -54321 -90504 -106883 -87246 -67804 -39395 -9833 -32177 -41561
23378 -41561 -17443 22456 33546 22987 7643 -14752 -10163 -27987 -7612 -13448 -36436 -57225
23366 -57225 -67133 -34944 -20299 -14661 11449 2374 -23468 -67974 -72415 -79367 -52848 -33406 -1084
23353 -1084 11159 30566 27811 19701 5176 -18219 -7549 10173 15282 -25117 -17453 -3471 -5335
23340 -5335 14315 -48598 -59101 -23601 -14378 -17286 -20822 24571 12445 -6871 -57070 -76490
23328 -76490 -82378 -87124 -92632 -64990 -102779 -101778 -79503 -53022 -27414 10363 27125 24784 48093
23315 48093 31158 5292 -12138 -16520 -6049 -21423 -25526 25166 59722 60417 66818 40978 22075
23302 22075 -2229 -1758 -1121 16503 34086 22275 -9082 -2595 12376 -20040 -34833 -53794 -74217
23289 -74217 -24948 -14609 963 32014 35781 33481 -5607 -32854 -49714 -62101 -68178 -70359
23277 -70359 -61334 -16479 12987 28762 18492 -34617 -22957 -13057 -28118 -30846 -12459 -30977
23265 -30977 -34473 -33083 -19548 -31293 -42814 -15867 39408 27614 25634 5190 -3841 -3169 21019
23252 21019 78979 79822 43517 -13789 -34057 -9019 16191 5267 5257 -3003 -19003 -30599 -45900
23239 -45900 -31050 -42982 -21636 18093 14069 -7809 3922 1247 3527 -5327 -7543 -17549 -32705
23226 -32705 -34264 -26495 -38604 -37489 -20840 -42027 -62841 -77041 -58323 -49212 -74016 -45533
23214 -45533 -14056 25388 41467 42321 43332 36472 19218 13921 58075 65693 50970 23014 21546
23201 21546 24568 -1461 -40957 -37492 9060 843 -11760 -4535 13699 7571 5339 -4783 -30857
23188 -30857 -44821 -21409 -14742 -15014 -18889 -44635 -68322 -77972 -56254 3228 42883 38712 44396
23175 44396 35639 25571 26196 5574 17702 9545 4590 17148 41992 77983 34092 -17601 -25119
23162 -25119 -24907 -26741 -29336 -28720 -18752 -56570 -76846 -80717 -73868 -50602 -45639 -96016 -89456 -55407
23148 -55407 -39395 -15019 12519 39916 37388 39185 11890 -6758 -34016 -17438 806 -20630
23136 -20630 -87223 -85911 -61761 -40343 -10841 -49222 -65790 -50129 -22664 -6401 -13745 -25276
23124 -25276 -16449 26899 57394 23580 230 -29343 -14798 -3068 3164 182 10653 -14587
23112 -14587 -37772 -29641 -5532 13483 30447 22939 -428 22982 24156 16509 31001 49440
23100 49440 9051 28293 35874 9950 -7383 3560 -4921 -18956 -55173 -44254 -37811 -92022
23088 -92022 -112501 -80439 -36814 -24595 -37892 -69342 -73554 -68620 -82606 -46098 -19438 -919
23076 -919 5219 33123 86183 88118 71983 27578 11075 30247 38123 19451 38162 22413 8584
23063 8584 -14470 1185 -34463 -47922 -2573 27674 13744 -17872 -17795 -247 2202 -50771 -43029
23050 -43029 9388 38302 3264 -37760 -24726 10020 25520 21502 -18828 -39637 -21552 -18593
23038 -18593 -43552 -27448 -30289 -52357 -42628 -17078 22219 1452 2901 -4096 -22896 -23342 -23749
23025 -23749 -13679 -23749 -25613 -5051 26102 10756 1138 -14515 10631 25441 33251 25449
23013 25449 -11519 -31993 -19621 7626 -6391 -18183 -12760 -10470 19199 13271 19522 46871
23001 46871 66536 58902 36001 66 -22899 -44800 -37821 -22959 -31050 -10840 -12048 -20181 -14426
22988 -14426 -28981 -34758 -18343 -36184 -43228 -27704 -43858 -10878 2394 16767 33081 26275
22976 26275 29659 24839 7706 26988 5087 4462 44214 70052 51755 7040 7358 -17865 -29073
22963 -29073 -28372 -32175 -21901 -12098 5918 23699 11177 -19363 -34492 -21487 -6562 -9996 -14004
22950 -14004 -8363 -116 -11377 -38208 -29298 -37058 -38439 -14150 5952 10359 12295 48174 17209
22937 17209 -17283 -9644 -15947 -27807 -10958 -36614 -26078 -15487 12521 55475 50859 36224
22925 36224 538 445 -5849 -29203 -27675 -26931 -21705 5296 268 -6313 -16411 -22657 -23723 63949
22911 63949 81201 54427 5249 -12990 -15614 8787 3307 18474 17325 18375 -22843 -47299
22899 -47299 -24678 -42074 -69793 9941 36949 3348 -8410 -1962 -29594 -61901 -72592 -90395
22887 -90395 -82241 -52956 -60294 -61478 -51470 -12480 11113 -21794 -40713 -79292 -99137 -83531
22875 -83531 -46523 -6708 20950 5427 10236 -8198 -50756 -67880 -38215 -26028 3222 16131
22863 16131 22953 38014 46718 58781 68131 7212 -21872 -36520 -7871 12622 -21340 -14923
22851 -14923 -9500 -25716 -39568 -2746 20223 23214 29465 9208 -4785 -14045 -19112 -20623 -34120
22838 -34120 -22781 -11109 -43943 -59025 -83459 -98896 -56304 -5619 24965 -13525 -33861 -27670
22826 -27670 -32086 -23738 -10833 -7918 -1428 29962 19358 -18690 -13257 -21921 -11296 -50956 -45100
22813 -45100 2221 -23846 -50123 -39906 -32981 -39627 -13981 -434 -17129 -30589 -32949 -45923
22801 -45923 -55803 -13430 -17037 -31983 -57368 -46044 -23043 -23333 -16582 -32113 -11168 -17284 -13344
22788 -13344 -25105 -27989 -30180 -3336 -17676 -28007 -44271 -46468 -1109 34998 20737 13804
22776 13804 -13858 -6327 -1381 1964 31009 6844 7652 11729 37365 35685 24779 -798 -33296
22763 -33296 -16534 7380 22770 44571 29840 19158 -1468 -5807 30753 18373 -55623 -43645
22751 -43645 -3110 6696 31322 46909 21443 33004 36478 3525 -60926 -76521 -40538 -9848
22739 -9848 -13336 -20972 18401 -27561 -33331 -40509 -34198 24660 68503 101791 82606 36827 24734
22726 24734 6060 -5509 -16186 -37678 -58149 -61641 -71699 -61513 -37888 -48380 -59088 6324
22714 6324 54870 40339 -658 -11717 -13554 -42185 -58662 -27049 -20315 -5740 -15103 -44160
22702 -44160 -45625 -43070 -68542 -81463 -79766 -88702 -61130 -56974 -38620 -49812 -50029 -41761 -22878
22689 -22878 3760 26233 22587 2964 6517 9524 14713 -7908 3033 -40633 -22502 14862
22677 14862 8036 39187 4741 -43292 -37081 -7833 -10453 25 11240 19258 15098 -8820 -10210
22664 -10210 -18034 -22246 -24763 -28858 -14333 3269 9561 18860 -4541 -26991 -44854 -47633 -122
22651 -122 5069 -29176 -18062 -16373 -66858 -92006 -87423 -62479 -53905 -58954 -42470 -27773 -35135
22638 -35135 -37666 -16808 15061 11313 2354 -3025 -11146 5188 7168 20692 13351 43314 57515
22625 57515 7217 -21901 -36976 -56858 -64811 -53902 -37965 -17597 -20701 -27646 -13353 -57293
22613 -57293 -56954 -17144 -45857 -46158 -36406 -20959 -9191 13519 11352 32272 58578 11160 -7203
22600 -7203 42900 45434 29903 41595 67349 27445 -21032 -50577 -54189 -22749 -23425 -19563 -6459
22587 -6459 -4242 -12974 20055 8107 -14390 -17873 1342 50116 85384 77407 66748 37822 35619
22574 35619 53811 40017 32808 52678 -1172 -45701 -60333 -42903 -42337 -60126 -39326 -9562
22562 -9562 -3981 -36707 -30114 -35897 -20185 -17944 -12 20310 -9729 -54488 -35528 -50417 -71086
22549 -71086 -20238 15096 -31718 -70158 -93954 -89096 -47748 -41575 -42946 -58100 -67359 -44156
22537 -44156 3605 -29275 -58018 -45891 -48905 -24452 -41921 -32333 -28463 -51232 -90305 -88729
22525 -88729 -71761 -25305 -28351 -36648 -18563 -14035 -5191 -33328 -5105 4848 -31638 -76990 -80748
22512 -80748 -51919 -21710 -13533 -23831 -12032 -7467 -20648 -27150 -28194 -25514 -33920 -45342 -25047
22499 -25047 -3947 12312 20431 29377 38716 35206 48543 51734 -22682 -73226 -8602 4522 -8308
22486 -8308 18655 3673 -3011 8856 25589 38466 53716 17434 3424 9811 36242 11681
22474 11681 14987 5975 -3960 2702 14986 15551 6005 -24519 -15060 13060 16233 -11639 -41429
22461 -41429 -59907 -53222 -42632 -13253 -15389 -36475 -76306 -58566 -39297 -28759 3559 -11146
22449 -11146 -9093 -19868 -21355 -14850 18052 24903 47277 7409 -5621 9448 5755 -287 -26860
22436 -26860 -37593 -58205 -23738 970 11496 -18932 -22522 -30109 -1677 1168 5980 -3204 -38338
22423 -38338 -41487 -39335 -15746 -13111 14750 41704 47926 48123 16661 34796 2888 14647 37924
22410 37924 44865 9438 -21629 -8687 22574 -7964 -29484 -39790 -72668 -59390 -23368 -8122
22398 -8122 -66 20997 9707 -16570 -41392 -13105 -30159 -63367 -48182 -4630 -13667 7853
22386 7853 -36310 -82606 -84978 -37401 -26847 -79974 -67684 -30885 -6537 -15712 -18837 -24780 -51203
22373 -51203 -47450 -64241 -119519 -118390 -111144 -93339 -76916 -76381 -40146 -769 10344 5296 -10601
22360 -10601 -42047 -61414 -67092 -22264 15984 6361 -4417 -14144 -20449 -30007 -18002 -7544 -5080
22347 -5080 -35990 -15960 -6998 -15233 -12803 20923 51966 31467 2107 -18969 -4586 24803
22335 24803 1501 -24671 -57289 -34938 7324 11402 21231 26375 19915 8048 24553 49250
22323 49250 24669 -1967 -10875 -5930 -6060 20347 60550 64162 44252 -13039 -39683 -31019 -18090
22310 -18090 -27657 -18318 -27973 -23025 -3397 -13218 -10439 -25751 -26051 -4409 32641 22778 21492 11439
22296 11439 -18056 3034 -12037 -18763 -7141 15372 13859 41353 15956 38817 41773 61763
22284 61763 62728 12040 -13227 -27117 -22899 -8684 8667 -6634 -48503 -53716 -39599 -15429
22272 -15429 21941 19563 5426 -38650 -53801 -19529 9506 9694 33278 -4089 2914 19974
22260 19974 -1913 -30843 -25290 -18478 -600 31058 45508 41371 7198 31898 5288 -22747
22248 -22747 -17564 -38118 -51328 -29455 -14995 -12357 -1623 -2925 16258 22798 6326 -17417
22236 -17417 -4432 -1313 -19155 -19334 -15023 23170 25543 30711 19611 -17964 -1253 -39259 -51915
22223 -51915 -16412 17341 -15374 -39360 -75250 -52254 -33748 23357 21220 -21688 -20565 3656
22211 3656 10767 2735 -11638 -33932 -45699 -38244 -80205 -78365 -28103 12134 14814 5431 9418
22198 9418 12198 32562 35035 53264 30800 56649 27430 32517 20851 13454 -6198 -33027 -7810
22185 -7810 13817 24108 26689 5763 32397 14190 24940 29108 36178 57243 38726 18030
22173 18030 23010 3136 -32215 -56805 -23597 -22724 -13564 26447 22021 24157 2431 3278 3212 6903
22159 6903 22196 26859 14038 16377 16903 69568 67807 51456 72036 93617 67076 81640 112688
22146 112688 79747 35151 8788 32094 75941 74556 40398 8056 16714 22237 15078 7353
22134 7353 10201 -7675 -2712 2146 549 17760 10479 2578 23309 -3826 -5337 -5633 -19282 12003
22120 12003 -12291 -18484 -23111 -10413 -29537 -34473 -37404 -37641 -47154 -44317 -23636 -22951 -8131 1046
22106 1046 -7411 13941 34625 31291 26265 58019 50872 56799 21110 16116 63023 80348 56286
22093 56286 34230 16673 54850 54556 40031 26843 6317 48458 39040 14889 30467 21467
22081 21467 -2011 -5690 -3403 3957 -21072 -32049 -6044 23623 74355 68423 71611 54328 6962
22068 6962 19183 -12534 -12321 -10031 -6386 -25294 -45735 -9441 24316 10938 -17697 9740 47080
22055 47080 34128 15627 22015 64738 83610 36779 -3990 19284 4981 -41963 -65487 -48298
22043 -48298 -37450 -38427 -24418 -994 -7345 -18596 18772 68555 116000 116925 99547 70633 63379
22030 63379 47597 43385 45575 23547 18425 19230 -23101 -69530 -89314 -25204 -14365 7500 1019
22017 1019 9628 40413 70381 71725 25904 48458 22693 1589 -14048 -11687 -16636 -28740 20990
22004 20990 44594 44624 83157 89847 53073 10088 10667 12513 19543 62277 59937 61794 43440 16054
21990 16054 -30564 -54618 -43206 -7734 13244 16215 4128 31298 43201 28515 33843 7932
21978 7932 -29695 -41526 -49956 -37970 -31921 9219 26724 -33380 -63201 -74252 -58937 -5844
21966 -5844 45009 12795 -43839 -50376 -63390 -87881 -84024 -26829 6848 11091 4446 4994 -18014
21953 -18014 -27488 -26390 19687 19390 -5732 -4693 -12202 -25088 -34239 -30157 -35689 -33964 -16884 -46357
21939 -46357 -51157 -43249 -9142 33664 43647 24734 8066 -2685 27310 58981 55498 50906 16603
21926 16603 -27585 9616 34831 37899 20097 51591 34358 -27467 -54811 -41737 -68290 -33367
21914 -33367 -3981 8151 23896 21554 972 32910 2179 -65600 -47901 -12316 -35014 -39288
21902 -39288 -39409 -44692 -34263 -31675 -25407 34008 78084 35060 4586 4146 22042 17575 -8641
21889 -8641 24122 34214 10785 40939 62667 45175 30746 52375 9628 -17558 -11054 -491
21877 -491 -7986 5531 17814 4400 -4634 10902 15071 41373 40165 59038 41561 32948 48855
21864 48855 44165 41897 32845 958 8029 40515 42904 17729 -2473 3730 28560 16028 23713
21851 23713 13881 10671 25123 38909 17367 -8772 -27805 -37503 -4195 4827 13241 -16011 -8766
21838 -8766 9235 38363 64308 75723 57362 38656 4535 -23269 -22107 -6900 -28434 -13371
21826 -13371 1563 -18559 -16138 5912 25585 51008 30305 -12986 -26353 -26246 -42064 -30125
21814 -30125 -31382 -26171 -9025 3695 -1096 -13737 -7589 -6860 -12629 -22086 -6251 10188 33785
21801 33785 22323 17783 30019 25182 -12911 -56459 -66834 -54662 -41988 -11299 7223 35361
21789 35361 33079 -19422 -44272 -6692 -29536 -79811 -82068 -65706 -71053 -57317 -64545 -29532
21777 -29532 -23174 -23336 -43346 -39474 -4183 -26013 -48027 -19773 -15927 -26360 -15339 7163 11845
21764 11845 25803 46136 27927 -22610 -22319 -8961 -49002 -63768 -12318 41313 72110 65961
21752 65961 75567 69664 76488 108103 79076 35312 4639 -15864 367 25687 -10612 -29072
21740 -29072 -64147 -85796 -40714 28374 11837 -26342 -14355 19470 58495 11221 -1449 13551
21728 13551 33690 25204 13530 19729 8199 -1291 -17987 -7364 -9826 6996 16029 29719 43367
21715 43367 40555 19389 21053 39865 33849 8276 -14295 8475 2465 -64056 -43369 -21548
21703 -21548 -9396 3378 23793 -11030 -66066 -64927 -45255 -25420 437 17432 31707 18307
21691 18307 -3207 -1985 33959 30421 4505 -17557 5187 6309 -26320 -72104 -78397 -47483
21679 -47483 -21834 -25936 -14750 17384 35340 28728 -5170 -18137 -2753 -6365 -30884 -11724
21667 -11724 19390 -3611 -21097 -29526 622 42673 28191 -16576 2800 9236 -21504 -58921
21655 -58921 -76544 -61725 -58165 -24585 9152 25522 46482 35728 -3282 -24271 -7083 11505
21643 11505 -32221 -39886 -6151 29196 2736 -25672 -2280 1786 5336 14859 5015 5691 1618
21630 1618 -14073 -32796 -34019 -18501 21456 49807 51646 35721 48237 23390 4618 -8008
21618 -8008 -9784 -21617 -18248 -17017 -28952 -15517 16401 8481 -9203 7533 -3016 -27400 -49335
21605 -49335 -61611 -80537 -19850 66603 90777 102195 87433 74359 33261 -694 -6289 -8183
21593 -8183 9323 24702 30612 47175 56041 30026 35327 17011 9995 -2068 -33062 -74909 -64194
21580 -64194 -40493 -30442 -27425 -23905 7532 6980 -9408 19621 6738 -8461 11708 14836 31537
21567 31537 15512 821 12706 33484 27294 76450 57743 39902 16431 -15499 -23290 -4551
21555 -4551 -9792 11152 9009 -1103 -17915 -43133 -50188 -43460 -22366 -21360 18016 12533 -24119
21542 -24119 -43518 -26346 -724 11344 20856 51952 39252 25451 -2987 6317 -11249 -20482
21530 -20482 -1262 -16199 -6074 -7479 24996 1340 -56542 -52151 -29873 -30376 -35814 -4263 -6784
21517 -6784 -20077 -16919 -29759 660 26853 32038 16971 -1598 -564 6946 10375 33305 59630
21504 59630 40787 33455 26138 26289 41090 9576 -22237 -15904 -15886 8268 11672 -5510 -18545
21491 -18545 -23752 -5043 37215 43552 37965 56593 74170 35649 44017 38362 -4147 -44926 -57781
21478 -57781 -30852 -3660 8680 8506 -10879 -1214 -9953 -6992 -11724 -49397 -21557 2218 3252
21465 3252 2279 -1978 -15727 -9972 -16190 -27061 -65130 -40908 -12798 -15290 -14833 -41422 -24456
21452 -24456 -13246 -77124 -72792 -20952 25838 56054 37509 -8684 9219 28079 -4862 -1899
21440 -1899 26544 18778 40215 55744 36816 24608 29358 54651 77119 80623 73883 58394 37353
21427 37353 11930 -32855 -31937 -13001 -13469 -17566 16015 26773 28702 -15347 -21831 -24869 -8399
21414 -8399 -41167 -13800 -6545 -1638 -3980 -46211 -57472 -21910 39036 95499 70112 64293 58027
21401 58027 35028 24814 43213 44301 38490 57505 36795 53946 56478 71585 94120 84999
21389 84999 32373 -8164 6371 -4580 19290 11088 -14497 -28509 -38024 -34924 -26293 1582
21377 1582 17938 -14870 -45310 -39908 -34041 -32956 8343 33728 8801 10221 21658 -1189 -42821
21364 -42821 -27642 8432 23942 64075 43853 33611 60668 36192 33009 12041 -772 29184
21352 29184 56307 29292 -6743 -7563 15127 3571 -36484 -32260 8580 35604 18075 27107
21340 27107 63443 69976 49812 25105 19289 5829 -19363 -6634 -16053 -21304 -30675 -32065 -29002
21327 -29002 15317 39776 4490 -8713 14700 28762 37637 26821 9976 -6700 -26809 -22967
21315 -22967 -33560 -47493 -57175 -31819 7338 8280 -7310 -15401 -9112 -2477 -25382 -7332 -25266
21302 -25266 -42371 3378 39014 24195 2736 6968 15749 26314 18806 6122 -6320 -34880
21290 -34880 -68454 -27633 29506 31722 4070 -46891 -59887 -30226 -23265 -36044 -24461 28344
21278 28344 80509 78076 51431 29736 11848 -3638 18431 67038 72633 59853 54933 43442
21266 43442 34729 44844 38854 46763 23562 -5014 6869 23662 18568 27741 59981 49000 7272
21253 7272 2834 -24493 -32670 -20519 -55443 -60329 -47069 -49689 -42587 -45007 -35544 -20830 24373
21240 24373 35949 29197 22391 12122 -30438 -57602 -33172 -18042 -20306 4998 12303 24297
21228 24297 -1174 -3428 9922 38983 31915 -4438 -13071 -8083 19598 24600 17925 -4486 -3286
21215 -3286 -7893 -16768 1633 33934 34344 45031 21385 20003 7395 -28521 -53106 -21257 -16462
21202 -16462 -25466 -1066 -468 -10398 -3840 12992 18825 36822 44071 18937 -7447 -35688 -50354
21189 -50354 -45061 -13175 -17237 -20640 -37570 -45754 -18480 -7212 34701 22724 -17817 -22819 30596
21176 30596 50811 59104 40895 -13292 -29491 -25284 -58617 -78033 -69670 -77236 -38552 -35677 -38855
21163 -38855 -24796 13347 45390 52988 37718 7075 -19237 -52406 -29915 -577 2323 -7640
21151 -7640 -19137 -26328 -52615 -65829 -57798 -26821 253 38420 -5781 8761 17633 3330
21139 3330 -15628 -4720 -8802 -9766 -3808 3888 -11089 -1398 -32244 -14232 -4214 -11788 -37346
21126 -37346 -27284 -21605 -13487 -51532 -31366 -7048 -15124 -49554 -15467 15550 -7683 -18700
21114 -18700 -2891 11113 -15970 -24760 -34193 9008 40329 15679 -22035 1094 26815 24245
21102 24245 36536 45550 52525 51236 67101 74039 106062 79880 76911 60180 43862 17827 -3937
21089 -3937 15786 -753 -25575 4085 22465 19039 15258 -8086 -41999 -76736 -77578 -89422 -87719
21076 -87719 -60059 -49169 -52627 13118 -609 -3004 7160 790 -16024 -38833 -8585 -21986
21064 -21986 -32453 -33681 5257 8083 3638 22369 39054 37099 7576 -13427 -15327 -12994 2164
21051 2164 -3434 -48641 -70798 -76773 -58904 -48271 2536 20689 18954 45374 33645 22010
21039 22010 -9550 -2447 36300 65164 38590 11080 8038 6317 -22940 -31940 -59755 -14791
21027 -14791 -14176 16843 23376 34018 39621 24416 -4983 -47131 -80297 -65303 -68346 -44917 -11877
21014 -11877 45 30916 34049 4481 -24116 -51545 -19322 -27856 -11607 39127 44159 25261
21002 25261 -1990 15846 10192 12791 34960 67901 72474 52305 10865 8067 29178 17938
20990 17938 -1020 -7070 -5714 -23790 -64035 -49068 -35868 -40343 1732 17853 26463 4643
20978 4643 -41927 -24539 -49282 -44704 -24778 -13020 -40209 -35152 -19271 -11575 -34549 -51008
20966 -51008 -44865 -28737 11055 1778 -13575 -58220 -24909 67000 96620 89647 39503 45469
20954 45469 75147 82737 81200 48606 50965 18347 28602 43554 47531 71161 33298 -5212
20942 -5212 52127 64718 51100 85979 96600 107098 120107 61893 27014 23418 23777 26826 21028
20929 21028 4373 16694 36832 36422 54055 42134 28593 43529 33332 14028 27738 27636
20917 27636 41653 45246 57246 40823 1820 18416 28537 31859 50502 17769 -20717 7535
20905 7535 50737 55861 78330 102487 78682 13350 -8684 -2214 52739 20352 6090 501
20893 501 2393 22158 50741 45556 8491 -333 5201 5606 48108 39374 26464 48679 46899 7875
20879 7875 38153 35491 10387 34924 35138 -2615 19713 16398 19610 18332 -4595 9845 34810
20866 34810 8024 -7231 -2146 -9753 27539 31597 58568 64590 44237 49448 26124 -26885 -50343
20853 -50343 -34645 -12398 58838 62984 72662 103862 69014 28558 -1687 -14384 -3899 -8483
20841 -8483 15747 -6025 7910 37660 55066 30980 22868 103 -12912 19237 29271 26685
20829 26685 23632 46005 60804 61516 39134 16886 21621 -42860 -87654 -88837 -88744 -65173 -8120
20816 -8120 34093 15749 2693 -7012 -21406 -1625 -17241 -41598 -23135 -15198 -30726 -5688
20804 -5688 -8951 -12818 -46853 -75842 -42353 -24529 1149 62039 81792 63809 71023 73835 62085
20791 62085 55990 51676 59625 33867 17009 19970 28325 18760 21623 52577 36158 2096 9670
20778 9670 34572 33841 47555 52441 2926 22116 52876 30166 26248 18999 13370 -10133 -58289
20765 -58289 -45021 -921 3608 5508 -22845 -54353 -27837 22543 50008 55794 -3911 -8131
20753 -8131 -181 36984 53544 33698 3572 305 4062 -3965 -1216 15408 -206 -29882 -20888
20740 -20888 -7684 -29218 -36367 7456 11283 24306 20651 34099 64477 53645 77824 101403
20728 101403 58280 35536 17334 12831 -4150 14504 47274 91760 87467 51785 25231 -10633
20716 -10633 -2054 14956 41194 26878 24165 -1734 11711 38227 7299 3052 13829 6225
20704 6225 12751 49907 66428 27231 -26845 -39153 7757 53414 85794 109026 106623 30423
20692 30423 12548 -2522 10540 38458 49331 3454 -33265 -45990 -48770 -33204 24023 86160
20680 86160 115100 76372 88752 81996 46584 16217 46221 62051 69927 48264 42160 55815
20668 55815 67545 71692 40532 16296 -3060 20082 39560 35243 18552 44364 38227 65544
20656 65544 61198 60830 87694 96125 78218 90551 59011 23992 23722 4692 8520 65385 99463
20643 99463 99943 59432 39890 24709 29269 44010 36586 8183 -10886 28582 79577 57705
20631 57705 91517 115448 102084 108877 95193 97779 97472 105208 75360 63437 74778 92749 77521
20618 77521 62265 28475 -15171 -29370 -26479 -18305 -1339 2542 9101 68 -12595 -25754 -18270
20605 -18270 -19 19860 -945 -7906 -2780 -24409 -3439 26857 47886 62397 62834 62830 51239
20592 51239 35710 56223 49813 25126 25724 50609 41350 44223 26147 11015 28497 27980 40810
20579 40810 61274 40787 25825 13166 -14221 -28339 -7516 28470 56475 73315 37014 -23091
20567 -23091 -6029 38525 33498 40747 8314 18957 8552 -5394 851 5679 31424 40393 52171
20554 52171 39571 21317 4804 23431 22558 60210 78922 89825 79464 58393 56762 34532
20542 34532 6623 -2110 3321 27022 30599 19636 58145 78921 106872 74486 48155 71640
20530 71640 93029 69129 19107 -9620 12740 36058 28847 24901 23050 -3632 -17605 25550
20518 25550 30060 35645 -9497 -23635 -1309 38768 44935 56951 85493 84606 91770 66653 42539
20505 42539 31742 38724 33858 41919 40890 37210 26458 3736 -26190 -21584 1253 14662 21093
20492 21093 12647 -24213 10294 50100 48402 23063 1910 26402 18421 16017 1572 -12506
20480 -12506 -18104 8293 19918 27920 22675 9705 7576 9307 5920 -8444 -13810 -34805 -19640
20467 -19640 -8801 -16383 6944 23521 64086 40242 26351 20032 36906 19457 25573 40382
20455 40382 48097 56429 41527 47676 55240 45649 44838 52846 55659 59932 57930 27486 870 8301
20441 8301 -2916 15643 45629 37015 18888 28725 41310 11338 53628 124911 127908 114975
20429 114975 78293 105607 119952 116783 104490 128761 115827 98044 59208 70479 60104 69796
20417 69796 70370 46550 44632 75965 68593 45773 28672 45994 65943 52007 82558 95259
20405 95259 67617 53249 66342 31533 16175 11479 6674 25273 46831 62836 44677 20248
20393 20248 1224 26198 57617 91996 76609 60032 51699 29059 19293 26974 7124 -6054
20381 -6054 -2141 27510 27995 49815 54654 45955 27334 14317 5008 6816 33122 68884 60750
20368 60750 12571 9156 8175 48106 56769 15388 4784 4394 10864 51081 49236 44293 6311
20355 6311 -29572 17514 14075 13904 21310 20732 2053 28965 34791 26952 -16503 -17977 15813 2658
20341 2658 5270 -20726 -23232 14311 5595 -5644 5860 11309 8625 19913 51932 65058 44564
20328 44564 34402 16698 -24540 -11311 24701 45290 48848 33928 45776 56682 82540 48017
20316 48017 25685 40714 68255 73613 64461 51947 43818 76988 74320 102742 85764 81083 81715
20303 81715 32218 12853 -29434 -28567 31600 81623 52317 47494 48858 21474 29807 48696 -1172
20290 -1172 -20191 -703 -8631 -13410 21913 41896 18693 32695 69893 131888 111861 52576
20278 52576 25215 2868 14400 41609 65362 67388 48467 43741 43230 41848 67195 76608 74362
20265 74362 24719 11454 44566 97638 74358 42330 21810 50473 58319 51116 -7030 -13206
20253 -13206 13816 21425 22037 7551 -26035 -25353 -60 19141 6366 19816 9627 38344 18944
20240 18944 -20693 14226 74825 80646 63522 47256 23884 34808 42944 47308 72617 100231
20228 100231 107669 78737 68306 86207 49778 35162 58809 69644 72412 57674 49233 55218
20216 55218 87170 99105 62710 13869 -32246 -19478 -10704 5475 6949 -34373 -43821 -21852
20204 -21852 7440 9825 32313 48272 71033 89561 81262 31147 7154 23555 36629 26008
20192 26008 17035 2458 6112 25726 57487 61335 47510 32004 -3887 -18796 31251 68805
20180 68805 72365 97168 66071 29400 52578 50362 68216 70682 77418 59981 41074 51325
20168 51325 33178 36193 52117 74015 46044 47036 39992 4948 -1689 2442 -1997 -20465 -28603
20155 -28603 7181 27217 49311 82001 96601 60520 24531 -12714 -8291 53403 55300 62547
20143 62547 94575 117298 114088 95524 47017 52474 80944 81386 73081 71398 77045 63178 84795
20130 84795 103879 95206 94488 80478 70217 64111 34542 66048 65633 57604 66256 33343 36031
20117 36031 86653 118125 81772 59554 99211 90671 57457 44886 93008 135735 112740 78190
20105 78190 75524 88771 69471 34727 25139 50054 75198 89329 71537 49572 47369 50906
20093 50906 66821 47616 57794 79533 69849 70027 59284 75974 63841 100026 139508 143051
20081 143051 150150 132526 90507 73612 60771 30939 20069 35392 20354 51522 82852 38226
20069 38226 49406 85316 110317 124442 120224 103462 86685 83189 95776 103497 45287 4784
20057 4784 27916 60001 76240 78301 47913 -1863 -2677 8040 10765 52639 87894 77368 69841
20044 69841 72212 95763 79253 84951 77174 82277 89938 70189 23931 -3301 -3602 18458 11468
20031 11468 38853 68939 84886 84284 52921 42199 24015 27362 52209 55459 59008 62687 41318
20018 41318 65806 132317 170470 148094 115385 111426 61091 14211 -4210 33586 82939 93619
20006 93619 105622 67744 15883 337 66762 112149 100911 94728 123285 125912 94410 107555
19994 107555 100207 75780 87606 92241 87254 89076 100220 87221 75565 56224 39738 44963
19982 44963 75763 100648 94571 79213 45206 27655 52024 47739 47119 12055 -14103 -5706 19646
19969 19646 38297 68857 72150 104856 147592 142082 134211 120233 113079 111869 105624 103417 74159
19956 74159 72059 105869 110300 86952 99111 126805 115226 127067 141079 100215 115769 109463
19944 109463 106964 99104 89597 82555 85133 89220 74673 127313 147307 137670 113005 138938 140971
19931 140971 129601 148879 169544 168405 158745 126343 121651 104513 121656 94497 76609 95904
19919 95904 75938 69528 59319 67788 96958 90636 60876 84951 114893 138591 146770 112864
19907 112864 75298 78816 101036 92791 83822 77164 90378 106126 105700 89818 97055 113418 144217
19894 144217 159725 168410 134177 106717 120370 117738 159586 194113 231898 239252 256469 309722
19882 309722 417391 507174 688573 946779 1179368 1279204 1300408 1185961 949269 785921
19872 785921 660644 639471 715506 912339 1293243 1797180 2293478 2562889 2574687 2379800
19862 2379800 1872083 1334648 996945 839454 755691 733288 824051 1019015 1296555 1457805
19852 1457805 1499115 1462125 1282716 947113 664901 486473 390891 350903 311279 263199
19842 263199 200138 168348 184370 200181 155087 165631 205446 171409 136697 103875 115982
19831 115982 120776 136391 133738 112889 115173 132960 155392 138994 130451 108033 133431 164340
19819 164340 140796 139861 197921 194069 203180 212979 150885 97140 105977 112103 131879 146564 134394
19806 134394 160705 166551 202350 218638 197633 200733 191029 148809 146763 142290 101377 91399 103507
19793 103507 95330 100886 114586 109420 123420 127740 134075 159268 168266 130312 96065 97689 94134
19780 94134 60171 60673 74232 153502 177324 200986 206439 187201 179931 174863 160078 138714 142064
19767 142064 169474 182189 243872 257002 289850 302939 304180 352206 529904 773705 901417
19756 901417 855285 734329 656610 695933 837730 1002065 1043887 935119 828633 887230
19746 887230 1038249 1125545 1038755 890875 780016 770494 848507 991448 1049651 942062 738764
19735 738764 558400 418335 360816 344446 351252 340579 291730 269026 259491 274128 264671 232843
19723 232843 224578 243396 226577 226134 232072 217784 240548 250954 270794 267876 274635 340361 409337
19710 409337 476184 580470 766768 925372 923127 805990 700844 684536 763997 971586
19700 971586 1142739 1103823 998264 968252 1079535 1184379 1101869 882101 696633 698801
19690 698801 813856 986948 1078624 977100 760649 594933 459986 352556 329547 301577
19680 301577 280097 302010 319101 279687 238150 188210 164407 133824 116038 138232 166484
19669 166484 213093 225312 194460 186773 189716 173674 179651 188906 243854 248550 197560 170225
19657 170225 168991 199873 229487 216734 203285 172882 191368 229689 246461 222347 170694 130596
19645 130596 109676 88237 88523 111427 187638 220420 194099 160945 181002 171673 123347 127055
19633 127055 115580 120796 122675 138464 114779 65466 53528 70991 80918 71407 114356 142926
19621 142926 150522 164849 181740 209435 234124 248375 185651 126255 138574 201588 237219 268921
19609 268921 275094 281885 295461 310915 286762 299754 294288 265411 216715 258724 263055 248272
19597 248272 237051 276245 286242 310272 279485 262217 286288 255554 256660 302057 336236 336595
19585 336595 334080 355534 341607 329288 351317 322497 274908 290231 312354 307290 319768 348661
19573 348661 350710 379530 388812 401970 433160 475584 471620 400363 337001 361063 381144 375015
19561 375015 363932 323735 303085 305809 347984 380835 399027 404719 361479 298352 319128 396979
19549 396979 436920 403294 388066 349243 340683 359845 367479 348467 352262 312252 250768 232276
19537 232276 269485 298702 315484 318838 300253 273860 262584 238547 212209 217163 204004 197125
19525 197125 252798 304488 337994 326767 329019 342367 361153 367036 356377 311511 271034 290215
19513 290215 346656 384460 355026 318656 315841 358057 438121 452556 444752 450122 406962 413859
19501 413859 413361 386321 420288 439391 364392 327657 346263 391341 442260 448108 417014 363591
19489 363591 355542 304569 304459 327028 275427 280538 366685 423320 440553 446549 428003 409591
19477 409591 379061 378197 397056 427285 482360 550705 529142 505845 474870 495002 515854 542849
19465 542849 623070 659995 668942 679988 716022 776896 742694 722307 717771 662421 650351 655820
19453 655820 719840 789729 872109 868309 906405 930324 894000 889476 826582 742663 705683 678305
19441 678305 649561 687529 710586 733866 752719 790239 868977 881968 852540 795306 767060
19430 767060 706342 685621 644680 643954 656596 675495 692979 681321 716974 772646 819060 832722
19418 832722 839023 852221 872327 895859 913474 933099 963244 993248 1007803 1009737 1046232 1066779
19406 1066779 1106799 1160849 1290230 1490615 1648675 1651449 1515165 1427482 1440600 1490385 1606783
19395 1606783 1689744 1701241 1684045 1750003 1928396 2222442 2557268 2674944 2546387 2401950
19385 2401950 2391722 2546076 2742414 2754359 2600359 2496182 2374861 2193624 2090574 2067683
19375 2067683 2078850 2155283 2260468 2382208 2464033 2477918 2454879 2409799 2359137 2473766 2595872
19364 2595872 2725757 2865618 2986196 3105006 3278335 3471903 3666478 3876480 4132509
19355 4132509 4414377 4841669 5410259 6120659 7124778 8217485 9139627 9973807 10787937
19346 10787937 11552805 12621207 14334568 16613492 19090714 21723836 25236712 31079476
19338 31079476 40676794 56632816 84828351 130745664 177951971 201347398 208455219
19331 208455219 205186523 175410456 132853533 105098092 94689089 99173766 120093379
19324 120093379 166000235 249639894 352322615 416290988 432382365 424875315 373005903
19317 373005903 278451269 193570139 141247599 113815870 104382770 112150918 142786472
19310 142786472 198644203 247141255 260650829 256940544 237370531 185614772 126818343
19303 126818343 86785507 62027669 46504303 36334082 29405336 24544419 20968920
19296 20968920 18434236 16857804 15748350 14618938 13428017 12310388 11252884 10243861
19288 10243861 9406314 8926426 8839462 8597428 7858664 6958750 6172383 5446960 4831133
19279 4831133 4332534 4017106 3764254 3590297 3573445 3646568 3805017 3870519 3723442 3405999
19269 3405999 3100633 2877565 2703263 2600011 2541465 2522052 2493080 2455414 2443459 2490216
19259 2490216 2527996 2531337 2526992 2499470 2494465 2513119 2554068 2639110 2667395 2741911 2854838 3060319
19247 3060319 3386407 3794650 4161969 4426998 4720449 5061488 5343132 5715435 6075663
19238 6075663 6178980 6146239 6325523 6874580 7821599 9031755 10273732 11581429 13269172
19229 13269172 15551039 17994950 20657814 24379346 30805573 42881720 65925965 105723009
19221 105723009 148377582 156193378 127452320 99212414 89391064 99854780 133275449
19214 133275449 174376035 181537340 152162563 129202144 134632344 152898643 149008426
19207 149008426 118560936 90290497 77942375 81866075 103626422 132692145 135170556
19200 135170556 104431262 70295378 48708169 36267293 28953987 24006324 20283017
19193 20283017 17680867 16234422 15932532 16276543 16227624 15402628 14475243 13974909 14110504
19184 14110504 14924923 15918862 16452221 16408741 16435409 17453353 19852937 23590294 28681709
19175 28681709 36415939 49897862 74997610 118399863 168035017 181848509 152410211
19168 152410211 119286701 106564398 116510960 151616852 197845348 210419080 181799666
19161 181799666 156524176 163362964 186248691 183051097 146929231 112254159 97021279
19154 97021279 101563763 127339660 162033522 165743966 129484845 87693519 60409697
19147 60409697 43994811 33975422 27163080 21932650 17928901 15068115 13076268 11525162
19139 11525162 10229118 9072634 8066774 7325063 6926715 6740065 6360226 5641362 4949503
19130 4949503 4427383 4082565 3872933 3747699 3549961 3239909 2900367 2598493 2358923
19121 2358923 2185184 2092224 2027406 1908293 1742752 1626108 1582605 1571152 1572114 1548583 1483961
19110 1483961 1357789 1299807 1306542 1286363 1263734 1253710 1226066 1238730 1277352 1306110 1317302
19099 1317302 1337051 1309898 1257078 1236078 1268354 1259126 1211567 1144144 1070979 1039049 1001326
19088 1001326 938344 911266 880303 886120 841631 825077 827483 870515 940048 953563 908461 874285
19076 874285 845880 831071 812202 777323 729105 715590 767581 764427 747593 748153 767151 759031
19064 759031 725757 684240 707935 729693 713781 741289 720208 715192 704506 684223 688744 672038
19052 672038 676553 676568 674500 671621 696029 719298 693247 700002 741680 761580 723889 695018 706142
19039 706142 659945 652209 621339 616401 550501 518850 535956 587121 589616 591211 590030 589133 584691
19026 584691 563297 537164 538538 504823 437910 414242 418259 450886 521346 621411 688243 678101
19014 678101 690734 700640 648316 627906 613375 608443 575560 577573 592771 648963 715160 715496
19002 715496 701583 716280 700412 649608 627662 644088 599473 545636 585572 625790 630760 596707
18990 596707 567832 530522 539610 558079 584186 565906 516147 476940 451221 498476 532085 525160
18978 525160 511211 499970 547856 637002 789025 958138 1054611 1022718 898024 750319 670393
18967 670393 614197 591467 594097 600505 611844 605215 563882 573591 626436 621894 629452 713524 772789
18954 772789 813786 830484 846620 832079 831200 839350 847543 881294 943678 939986 885615 884358 915772
18941 915772 939890 914690 865397 828807 852301 869392 841086 831734 797525 765297 761685 774923
18929 774923 793114 831729 901778 968126 1020629 1066374 1066954 1078351 1116295 1133131 1123299 1128682
18917 1128682 1146651 1186930 1215034 1221606 1284993 1398701 1492626 1521745 1557344 1626702 1671501
18906 1671501 1743395 1897468 2065014 2212848 2382079 2685560 3020207 3201527 3225315 3211961
18896 3211961 3301775 3476395 3789211 4246312 4578552 4688227 4788243 5006270 5514852 6247827
18886 6247827 7038729 7874610 8783764 9817323 11241737 13513807 16844107 21824969 30135638
18877 30135638 45341027 72575143 107698552 122341182 105604549 81684117 70819093
18870 70819093 74921793 96084543 128768296 141865956 122642790 97662180 91384050
18863 91384050 105598030 126346636 125045556 100031839 77158640 68160291 73463522
18856 73463522 94471091 121061568 122889410 95127523 64796509 45422449 33572390
18849 33572390 26044286 21009320 17619964 15484490 14092234 13212424 12686350 12483698
18841 12483698 12434490 12319270 12208901 12424899 13017616 13678281 14316834 15149894 16373944
18832 16373944 18039872 20483135 24261154 29730656 37695802 50786762 74745294 118151983
18824 118151983 178046507 209853980 186930928 143359909 118882159 118217226 143146193
18817 143146193 188156591 212790824 192303688 157860632 149840008 175566042 216780650
18810 216780650 222403663 180965896 135534961 112939353 113977574 139724796 178601362
18803 178601362 186844720 149567951 102033960 69884491 49828246 36937117 28554581
18796 28554581 23206226 19563553 16813676 14906433 13409974 11981221 10654348 9645072
18788 9645072 8821747 7876055 6956509 6326182 6067027 5971517 5782456 5572953 5596608 5764527
18778 5764527 5553264 4865768 4214382 3778669 3549722 3476262 3688851 4067539 4281418 4250009
18768 4250009 4236242 4315532 4105162 3601678 3035713 2614160 2363915 2292736 2356597 2551700
18758 2551700 2673893 2675944 2610372 2577177 2535971 2442464 2361938 2375207 2398468 2282097 2129334
18747 2129334 2052884 2024209 1916443 1747696 1626450 1521745 1445608 1355056 1317795 1357482
18737 1357482 1460855 1542598 1563149 1545098 1536979 1567103 1548018 1509850 1522007 1585813 1623113
18726 1623113 1584397 1565126 1550313 1538534 1559515 1541994 1592289 1672632 1737901 1774472 1864935
18715 1864935 2021058 2277514 2670312 3273736 3930983 4503163 5070943 5428787 5387667 5238206
18705 5238206 4916294 4407566 4060242 3952009 3946936 4021678 4183540 4479533 4932381 5418167
18695 5418167 5829831 6145214 6419708 6791171 7372322 8186955 9156647 10371845 11996156
18686 11996156 14217594 17342144 21794562 28074829 37016481 50931551 74596601 116626597
18678 116626597 184655506 254935139 287856993 294038800 286439936 238284965 164433356
18671 164433356 108020967 73368998 52167489 38832991 30360935 24935732 21200901
18664 21200901 18383793 16321317 15053633 14246946 13666848 13257702 12763897 12028992 11184404
18655 11184404 10284605 9457056 8906637 8808801 9274303 10131228 10935792 11114861 10869479
18646 10869479 10843571 11445969 12584810 14157204 15708813 16301736 16189488 16151528 16643719
18637 16643719 18022393 20371936 23637308 28260249 35221035 45512244 61049001 86167719
18629 86167719 130376359 206386867 304270414 379046335 408533752 407074191 367182144
18622 367182144 282827971 192303920 127471973 87352330 62299134 46375394 36121334
18615 36121334 29270683 24517132 21105288 18621843 16865750 15504505 14220176 13062573
18607 13062573 12089024 11249409 10299802 9066676 7849424 6973689 6389247 6015961 5801438
18598 5801438 5732182 5860040 6238740 6884667 7656069 8410662 9047070 9291502 9099390 8749455
18588 8749455 8377936 8142266 8339075 9079747 10300616 12027911 14619574 18595654 24759785
18579 24759785 35216678 54167805 87033178 127243878 150469067 155495561 153296379
18572 153296379 131103804 91611916 59324280 39469308 27441924 19935604 15159760
18565 15159760 12069293 9957306 8479674 7339581 6431346 5706758 5072590 4524017 4085558
18556 4085558 3715734 3430404 3184348 2944916 2657722 2441084 2258052 2146456 2045275
18547 2045275 1981769 1951573 1996864 2159670 2370163 2601869 2798067 2782621 2579596 2289043
18537 2289043 1934046 1578230 1300753 1140711 1009592 929899 840707 793688 733851 634939
18527 634939 625861 642404 654169 643442 598189 580974 554909 532750 521073 508395 482255 461808
18515 461808 500835 544703 547553 550351 563941 559592 514416 595715 677339 723389 725280 736952
18503 736952 736391 661550 579727 567759 596150 579432 484052 404414 333665 270474 261650 291712
18491 291712 320888 312942 306972 322924 309558 323711 353104 345332 278866 227960 184791 189699
18479 189699 204961 193050 183945 191140 180043 193429 193648 237111 274042 325427 349877 311586
18467 311586 257184 225795 232436 224109 257708 277519 271232 247594 254802 253596 262850 269756 243903
18454 243903 230776 296601 320133 296224 262365 248796 237550 206741 148191 140800 139103 127398
18442 127398 121170 151923 135426 106786 70028 66741 135350 159128 190006 191735 180080 173136
18430 173136 183400 193090 192208 206001 207935 165043 171432 180274 157500 160796 164496 152062 141604
18417 141604 108177 67575 18732 31108 51925 79508 118176 134600 98029 108628 112443 124156
18405 124156 138697 131852 140943 193513 262379 251317 181306 129805 106829 69765 68145 50477
18393 50477 44130 72937 87675 108984 100258 90005 95391 140821 147891 147559 117497 101767 86113
18380 86113 55301 31797 60561 49894 18856 11593 42584 62587 104209 109971 121886 133326
18368 133326 128020 137255 150168 166733 157342 106704 74425 93485 112835 93889 99345 80513
18356 80513 86186 51668 63042 110632 144140 134125 91819 73923 69528 62750 84165 106248
18344 106248 139509 176176 146773 167657 195015 225629 299576 411006 592696 851922 1045304
18333 1045304 1021284 883586 792712 755677 845077 1047365 1142339 1015116 835698 743074
18323 743074 817266 1063812 1211035 1186212 1043138 889985 838105 930187 1077371 1083479 939472
18312 939472 692889 503707 378282 317767 261300 234167 234320 209730 187194 141621 111934
18301 111934 115537 146299 166733 156320 137034 120219 153123 179457 204226 189049 193774 182197
18289 182197 193341 229223 265394 329155 450524 634024 746687 744023 688006 618014 572233
18278 572233 621310 799366 904019 807245 666807 620477 628112 787963 998241 1033067 955408
18267 955408 875580 822877 867021 997878 1073171 1049269 944421 797450 699369 626090 543160
18256 543160 505905 560737 630992 686371 676309 665987 626403 548444 467818 428065 458804
18245 458804 445739 345422 261624 251368 302923 384925 381219 324711 273332 233593 215944
18234 215944 183844 193861 179041 144901 162837 149873 113968 109596 145410 210982 220020 194623
18222 194623 152697 88789 67125 83914 135495 138294 123548 92890 110701 105765 123180 141085
18210 141085 115094 130524 134019 113008 93079 70022 63243 46773 36956 20580 6609 -40736
18198 -40736 -27581 -9871 15486 18708 12633 15381 -4565 -12905 35597 75179 72568 94072 125444
18185 125444 172696 197849 241583 244578 242286 223016 212874 210372 197909 218081 224751 203545
18173 203545 172022 120047 112686 135614 109652 83143 103722 134943 119024 94564 115008 167523
18161 167523 163745 137486 135877 192479 245519 230214 178543 151758 190413 279133 374718 434051
18149 434051 597600 866136 1185616 1415439 1490149 1418909 1226360 947027 717648 577261
18139 577261 525466 497395 472483 412923 380399 408102 473927 543415 613871 638931 668397
18128 668397 697869 761100 851942 908559 953531 1033812 1136670 1330499 1542090 1754240 2047478
18117 2047478 2503024 3114606 3982050 5205675 7013879 10092934 15785976 27030834
18109 27030834 48282543 73982583 78518487 57811512 35331102 21902699 14252554
18102 14252554 9791091 7092733 5506156 4634342 4202880 4135609 4293905 4294071 4057663
18093 4057663 3687417 3129411 2410274 1867790 1512886 1286821 1108173 915240 792760
18084 792760 745282 729459 727471 678167 623278 649546 648573 593382 548191 537420 564143 653136
18072 653136 777306 896938 995747 1240542 1763847 2588653 2956872 2473116 1802742 1399036
18062 1399036 1278711 1364907 1573603 2019531 2743868 3152127 2726171 1900816 1267895 893102
18052 893102 671122 539704 472232 471711 497874 658451 917285 1169977 1257472 1255668 1192733
18041 1192733 987472 703668 536131 439222 361281 327833 312283 319874 302231 265249 241115
18030 241115 179985 103782 73423 58423 50941 46178 -4693 -16750 31019 81786 85209 92246
18018 92246 51931 29391 11981 7624 -4698 -17162 -8637 2388 41273 78210 6892 -9480
18006 -9480 9915 -12853 -41036 -4471 554 419 -25705 -5927 38713 39281 31660 13198 39322
17993 39322 66921 55334 67318 89662 62214 73501 88004 101334 119978 108308 92971 107107
17981 107107 78122 43446 61510 67464 6882 -13620 15777 72362 71912 54181 34330 13368
17969 13368 -13527 16164 53142 53295 26746 8467 5241 28290 26624 -5136 27442 65657
17957 65657 15435 -11927 -49428 -54985 -20445 -24398 -41281 -17423 6764 43697 50992 2278
17945 2278 -14619 -25625 -53779 -60770 -47440 -56237 -54764 -40051 -11952 68487 125277 93201
17933 93201 79695 88258 68588 59472 64825 43332 -14355 -59716 -54473 -58707 -88416 -114453 -80612
17920 -80612 -54718 -45537 -25743 4067 13814 -27540 -31905 9784 26351 15540 -19758 -39658
17908 -39658 17736 37701 14551 34086 15742 -1473 -33538 -9225 -41967 -40475 -25266 1830
17896 1830 22767 17369 -2963 -55280 -90234 -87452 -50706 -10082 -9888 46901 73467 69214 78903
17883 78903 81702 81726 67358 53586 32615 17020 8316 16623 -1556 8650 41920 60380 18158
17870 18158 -10583 -18208 26579 18786 1833 3465 -2354 -4621 -9956 8156 37927 60445 23789
17857 23789 531 -4318 -31041 -17981 11775 22856 17176 4499 -23511 -27456 -11923 -965
17845 -965 18372 -37905 -62501 -6201 45801 44023 55843 22336 -7704 3177 285 -55526
17833 -55526 -92574 -62327 -41434 -53113 -24307 12163 725 -2505 40695 7492 -3085 -14089
17821 -14089 -50359 -60636 -39525 -9753 1384 7001 16263 -4566 -4517 15872 -31388 -50627 -58052
17808 -58052 -6266 1043 -21496 -54592 -47524 -22959 24000 25316 -1463 -147 6622 -10490 -27439
17795 -27439 -53063 -85472 -77684 -35409 -51812 -59035 -28633 4543 -17760 -50433 -82659 -61475
17783 -61475 -43894 -31465 -32246 -30588 -54127 -85113 -48279 -16122 -27564 -17114 -2391 9279
17771 9279 21502 7190 -42351 -41700 -29211 -35311 -48219 -105829 -104885 -64385 -30488 -7587 10835
17758 10835 -38542 -72525 -23261 4529 13784 -4468 -27515 -25527 -18573 -6161 -19108 5088
17746 5088 37866 18032 16763 31371 48080 34323 23145 46720 62244 36971 12816 23796
17734 23796 40958 41397 32852 70662 84668 50058 48413 75918 56990 70376 91207 92117 68526
17721 68526 72906 71031 11901 -10655 10705 28642 -19644 -21754 -26904 -26500 -7255 -10955 -38303
17708 -38303 -49050 -53262 -64800 -55684 -30066 -19942 -7705 8183 27406 32248 34299 40504 -9844
17695 -9844 -47371 -35549 -24214 9794 47297 59924 75126 81109 81100 53158 14934 4995 25808
17682 25808 20791 22102 153 -16289 -5222 -9823 -13074 3136 -9381 3384 1910 -32729 -55148
17669 -55148 -38087 -63958 -74452 -70736 -61623 -23360 -34588 -37250 -56788 -43001 -26358 -13846
17657 -13846 -27707 -53859 -63133 -66503 -55453 -46160 -18277 -8276 -33869 -38460 -60489 -39515
17645 -39515 -36142 -59998 -62131 -28474 -51744 -79522 -78427 -43847 -33641 -35052 12955 27975
17633 27975 39923 73278 48335 15314 28463 59429 12906 152 10630 -4421 -17125 -56398
17621 -56398 -25389 -4183 24639 27264 23172 15553 36091 51894 31957 1612 13056 62065
17609 62065 47962 -5252 -22256 -13023 6632 4281 -29683 -24744 -12128 -39657 -51930 -43269
17597 -43269 -82441 -89712 -76240 -39886 -2947 12416 -1596 -15448 -35981 -45013 -29062 -14573
17585 -14573 -39530 -20867 -36686 -39410 -44262 -25561 13191 48304 67129 62716 62862 52849 59546
17572 59546 55340 41991 54288 44491 28315 4520 16623 58896 41716 77670 60846 39996
17560 39996 41213 52472 60896 63070 43768 26629 -32862 -35261 -44367 -45347 -40069 -15479 -11702
17547 -11702 -9290 15186 10518 38046 43404 57582 87545 69428 42468 8556 -24107 -28771
17535 -28771 9575 6316 -3397 3910 18892 33293 19050 13748 37614 11391 1838 47257 60554
17522 60554 29006 -29789 -15172 19029 32723 13327 -24011 20923 36178 2313 25336 64169
17510 64169 53507 48417 73410 91431 107275 78529 43422 33854 29448 26705 53792 52583 -41913
17497 -41913 -110644 -78173 -40614 -474 3329 -17783 -41803 -10756 9819 21114 39866 32721
17485 32721 19522 18465 17374 -11689 -43669 -50076 -63999 -71779 -48186 -10657 -31200 -53160
17473 -53160 -33999 -7317 23007 36435 44072 37513 44676 42433 17069 9594 18473 40230 71904
17460 71904 112227 101262 76155 89275 138851 155531 175730 168276 162522 144731 106961 53208
17448 53208 11158 -23421 20044 72476 106910 222584 384794 507631 456305 306009 209405
17437 209405 109218 50139 2444 -21951 -39379 -34617 -26645 -42258 -61757 -61765 -44432 -34588 -71874
17424 -71874 -91929 -108426 -86752 -40678 -20742 -20719 -11644 23349 36078 45943 26162 -20238 -40034
17411 -40034 -33484 -16138 3872 -15652 -35453 -29309 2236 27442 4524 -23104 -16165 -37516
17399 -37516 -51782 -41261 -78387 -76190 -10775 33703 65253 37479 6741 24160 52507 103536
17387 103536 75347 -806 -37698 -50283 -54430 -83692 -99341 -70076 -66425 -48460 -34054 -27545
17375 -27545 -7653 5139 6901 -30955 -32643 -34033 -21773 7188 18809 36072 33482 16334
17363 16334 76 4122 3762 -38787 -49859 -45570 -43865 -58305 -51992 -69371 -40601 -23020 -4942
17350 -4942 5603 -13430 -31037 -42545 6861 20433 33531 30454 44640 42043 33926 28939 -5597
17337 -5597 -20833 -7355 -1042 18923 -31614 -74944 -107638 -73870 -31456 -8855 -2773 -21204
17325 -21204 -2208 -18362 -42047 -57812 -71535 -73804 -70856 -22946 -22933 -19954 -2474 -28317 -62203
17312 -62203 -35917 -627 -3953 -18369 -41866 -88842 -75758 -83657 -67014 -25172 -20642 -44230
17300 -44230 -30274 -15492 -752 29806 36534 34510 9134 -24048 -17497 11655 33089 42911
17288 42911 12819 -36015 -17344 34387 75168 69727 27829 37483 82425 72039 46043 48964
17276 48964 52863 34445 950 3866 23360 39629 50321 42427 32081 26986 8566 -847 1820
17263 1820 12003 -6463 -10907 -38990 -57041 3389 30327 -10658 -16860 -20035 3621 -19253
17251 -19253 -31930 -49024 -3386 4672 -22246 -17312 -26438 -51539 -69489 -39399 -8201 15640
17239 15640 16667 61120 58758 61941 43045 40444 40455 15588 -17861 -23628 10785 65489 68929
17226 68929 41293 30347 35453 13971 -13912 -11423 4875 34787 33323 39117 40469 24641 11126
17213 11126 22117 37541 -15309 -24981 487 -3975 -14813 -51677 -52241 -38381 -48550 -18557
17201 -18557 -5339 8019 12983 10020 6458 -51557 -83994 -74048 -65945 -60352 -60024 -45568 -68177
17188 -68177 -91417 -83520 -44450 -44108 -39338 -15521 25813 54552 42410 17212 39560 9705
17176 9705 10073 1652 -36433 -50098 -54772 -62206 -53593 -40078 -41857 -32576 -55052 -46523 -32679 -49286
17162 -49286 -54214 -43059 -29676 -21543 -11164 22181 17651 -7871 -4573 -19025 -25409 -35381 -27505
17149 -27505 -12385 15559 -936 -13889 -24731 -5866 15022 32052 16153 -6072 18278 32148
17137 32148 19079 12473 -2509 -11661 -28052 29112 49691 32008 42263 28824 19031 31547
17125 31547 15971 -17215 -34898 -47758 -49388 -56606 -71603 -36285 -23995 -28808 515 -11817
17113 -11817 -27720 -75435 -59195 -10783 1921 21014 9556 5620 2574 4457 -31306 -60145
17101 -60145 -80160 -72915 -23767 7064 -9625 8331 27243 43472 -30556 -61578 -21513 10292
17089 10292 9239 20853 2428 3954 4332 9848 -35776 -62713 -61206 -19614 17149 65344 75523
17076 75523 45848 20651 11240 910 -16418 -35616 -27110 -7072 -18645 -21674 26747 36876
17064 36876 22183 7969 -16138 -22265 -10162 2862 57180 59403 56812 19366 -3588 -42655
17052 -42655 -42522 -37459 -51244 -52798 -36687 -53127 -38254 2676 9834 -13138 -20534 -8383 16863
17039 16863 12924 -26523 -50094 -77061 -39134 -25460 -18957 18379 50555 17374 -29020 -29208
17027 -29208 -28708 -38638 -16796 -16640 -1051 39018 58666 58501 63609 25742 -10609 22503 49550
17014 49550 11002 -32102 -52543 -53898 -89065 -75319 -42272 -3168 -17936 -29355 -603 -1284
17002 -1284 -33100 -48417 -16070 -7079 -23643 -65868 -10807 36762 12157 -8894 -39543 -46401
16990 -46401 -34886 -15847 -16545 -8179 -18796 -7362 -33890 -34757 -30289 -22954 -28634 -22552 -53728
16977 -53728 -94440 -63285 -18703 -21037 -25334 -59729 -52767 -21247 29090 -6877 -5386 40574
16965 40574 39962 14959 -379 -1410 -27980 -29619 -33691 -32944 -9584 14384 23011 7452 1840
16952 1840 -24091 -66620 -27749 -37091 -33994 -1190 -12369 -29731 -62538 -65169 -39136 -2555
16940 -2555 -23409 -14881 -34666 -55067 -59069 -66871 -87916 -67281 -77963 -94929 -84730 -43910
16928 -43910 -85083 -71838 -41104 -59022 -53724 -38510 -72358 -91915 -71899 -67254 -57936 -84339
16916 -84339 -49605 -35011 -26281 -4878 18831 34910 9918 -49202 -47595 -68873 -71617 -76327
16904 -76327 -56974 -76890 -80022 -57306 -23981 -6233 24159 47027 56756 76099 63888 5384
16892 5384 -36749 -41035 -36325 12407 39505 22879 -9799 1179 -148 -7667 -28475 -31960 -71542
16879 -71542 -60104 -37093 3621 25169 -16724 -30563 7737 11669 -5143 -10194 -12944 -55298
16867 -55298 -58509 -49085 -64093 -39100 -76863 -84392 -63536 -66891 -28279 -1771 -25894 -71535
16855 -71535 -74643 -62090 -31430 -4571 -6769 15611 20403 30557 40873 35958 24534 24823 33007
16842 33007 4902 -3136 12565 -4801 -13067 -42877 -17468 -11766 -22258 -25763 -41529 -29385
16830 -29385 -29708 -44118 -39614 -20875 -38580 -42854 -42511 -24492 -45263 -37512 -35117 -33651 -23622
16817 -23622 -28312 -35443 -32735 -17863 -16630 -38888 -62526 -117072 -118940 -93298 -75989 -70442 -65113
16804 -65113 -86563 -69511 -83692 -94552 -81801 -38693 -20503 -23707 -43144 -64181 -47364 -55607
16792 -55607 -30554 -24683 -18180 -5990 -5351 -5270 10152 -11956 -38368 -23256 -17792 -26977 -37780
16779 -37780 -10583 -458 -2308 -16390 -14350 -6917 -31784 -57394 -65899 -48786 -31869 -19533
16767 -19533 -39203 -3657 -20650 -26547 -4403 -25007 -42655 -36665 -9066 1957 10698 -9281
16755 -9281 -28901 -7974 18927 29265 -4879 20 36695 18339 37918 44510 29443 1743
16743 1743 -26991 -18036 3970 -64355 -102389 -86022 -80996 -92365 -78928 -67007 -87305 -109891
16731 -109891 -99891 -57605 -35424 -22504 1748 -8240 -40246 -83813 -76460 -40962 -22456 -27471
16719 -27471 -26973 -31488 -28667 -20408 -21241 -37901 -27867 -6150 3611 37870 44829 47762 29748 32366
16705 32366 871 -13431 -2979 -22773 -15863 3450 5195 15023 32601 3626 24166 38952
16693 38952 23916 -23727 -21618 -18229 5158 24610 15618 39997 24776 -5763 -11680 -1246
16681 -1246 7125 -8362 -23332 -14579 2357 8290 10805 -41059 -68063 -50660 -26985 -3263 -16100
16668 -16100 -24845 -12891 22335 11290 -21863 -33284 -32392 -52653 -67340 -83350 -78166 -50121
16656 -50121 -34915 -7927 22844 16974 -8077 15218 33793 40929 38211 -20668 -39799 -21466
16644 -21466 -15905 -37727 -48639 -14623 20945 -9953 -33058 -36541 -24530 19749 44691 7443
16632 7443 -18356 -36469 -24660 -51035 -49774 -48205 -87320 -46043 33591 49848 27750 39824
16620 39824 62359 26173 -9305 12659 1749 -27506 -23918 -13121 -29959 -36608 -29409 19926
16608 19926 16191 -23471 -43682 -20087 -45115 -29605 -15065 -62516 -98749 -64234 -34398 -46147
16596 -46147 -55974 -48116 -26950 -12076 -52213 -84091 -68290 -38586 -26786 -88651 -107115 -80136
16584 -80136 -53212 -57240 -49153 -63796 -83325 -44051 -22904 -34327 -22461 -16513 -42789 -27123
16572 -27123 3771 -2575 -12132 26478 42582 5090 -48138 -37875 12624 14888 -10107 -25143
16560 -25143 -26615 -19899 -39513 -22009 -20563 -30361 -56926 -44277 -12819 33460 33866 -2941 -36916
16547 -36916 -67938 -73045 -82322 -53672 -40839 -10979 -7984 -14462 -22839 -18971 -54939 -46197 -1920
16534 -1920 -16702 -32422 -35107 -40714 -57358 -44067 -27442 -38120 -63592 -79258 -85671 -84186 -86309
16521 -86309 -92598 -36054 -813 32306 41788 25271 3065 -19131 -12319 -9606 -24903 -13525
16509 -13525 -45402 -57840 -44595 -33042 -22624 -9823 -23275 -58992 -35340 -24994 10079 13257
16497 13257 -13956 -41583 -10236 15599 28881 12810 -16326 -36670 -43504 -36337 -2619 31376
16485 31376 8883 -24868 -48973 -58391 -57443 -29227 -13530 -15699 -43190 -37512 -42200 -70084 -34240
16472 -34240 -11032 -20355 -56802 -61824 -40598 -16666 19692 23470 15877 19282 7150 -8006 -13320
16459 -13320 -27867 -21858 -20481 -6850 -308 18091 -25484 -36806 -19911 3929 -1076 -28779
16447 -28779 -28182 -53080 -67808 -51241 -15257 -21805 -25939 21236 31733 22560 5243 1266 -9424
16434 -9424 -26655 -26359 -39646 -21375 -16064 7801 35303 14305 19263 46324 46947 40831 34229
16421 34229 -12051 -16359 -16509 707 180 10441 34711 -11587 -15286 41377 53694 74017 80094
16408 80094 81196 38705 37354 4618 -27399 -28895 -16732 -39338 -55817 -58917 -31877 -39633 -38607
16395 -38607 14741 28923 20543 8372 5604 -10199 -43203 -44817 -39871 -23240 -24733 -20790 -18293
16382 -18293 -8682 -28663 -31441 -50697 -75659 -83671 -44120 4505 28930 21907 -14240 -34267
16370 -34267 -27792 -37933 -56881 -47862 -38270 -41456 -35200 -9832 -14325 -31878 -60599 -80192 -46258
16357 -46258 -41676 -34020 -25631 -5967 -9064 3227 -2575 -11434 -23483 -48453 -35758 -23263 -68657
16344 -68657 -40035 -9671 -8933 -60490 -55848 -22403 -1097 8580 -6855 -13563 -25439 -23920 -9007
16331 -9007 -20655 -34024 -47169 -41344 -23922 -2182 28534 42965 -5434 -47466 -45894 -59814
16319 -59814 -53162 -29181 -39022 -334 25314 25019 9964 -39647 -55773 -60095 -44922 -28092 -30001
16306 -30001 -48125 -51863 -39996 -12121 23381 23665 -37547 -52459 1879 -2787 -33512 -8165
16294 -8165 7164 47365 62792 27255 35699 39551 42244 30692 -32377 -59856 -41458 2065
16282 2065 9075 5977 -7656 -36589 -24234 -1543 -10921 -16691 -35915 -25373 -15463 2060 -9603
16269 -9603 -31241 -28257 -81159 -84023 -57210 -41606 -13139 -21514 -10739 24409 13298 -24362
16257 -24362 -11056 -13016 -9976 -3532 -51413 -46138 -14852 -2939 1867 11002 11669 -20923 -41004
16244 -41004 -64203 -17269 2107 13102 13995 13456 21713 46657 56071 54919 48818 26243 -9734
16231 -9734 19117 40903 20868 -2594 -42910 -47509 -38132 6070 27485 20592 14456 22485 8190
16218 8190 22244 -38768 -84896 -35748 -34084 -38566 -12231 -37073 -65856 -33358 -28038 -2491
16206 -2491 19502 30923 27131 33010 19938 -17958 -59170 -46541 -19251 -24143 -55768 -35316
16194 -35316 -37915 -19429 -43931 -59166 -47403 -22794 -4210 5784 12901 -7179 -13588 -24340
16182 -24340 -51388 -32248 -19770 -12611 -9455 -16666 19002 27004 -20893 -27753 14578 27497 13560
16169 13560 -9034 -13705 -17053 -1177 18923 33826 47538 41606 36340 34801 50825 49313 30228
16156 30228 68954 38755 -6975 -18477 -32843 -15295 -30013 -20330 -39662 -36239 -28752 -46195
16144 -46195 -64749 -112272 -86425 -50665 -71538 -86469 -52663 -72324 -87104 -35140 -2087 3721
16132 3721 1811 -1993 31753 29804 18270 -8623 -19689 -35197 -42079 -53379 -54699 -67376 -61808
16119 -61808 -48146 -26997 3879 14012 23715 1816 7523 27911 42875 15915 -2380 -12873
16107 -12873 3059 -27048 -22981 -13415 2971 12162 -28155 -63819 -44636 -17434 662 3694
16095 3694 -3678 -16628 -3913 11823 20491 4669 532 -6778 -14603 41029 57734 14420 -35212
16082 -35212 -57566 -74319 -48670 -6155 34699 36528 33572 8749 -8218 -8546 -8208 -10282 -19353
16069 -19353 6531 70467 46169 10366 -24737 -9394 8627 10189 2707 17940 29189 11681
16057 11681 15727 62081 79822 62779 49369 41974 -2620 -28791 -21130 -10858 -38845 -42305
16045 -42305 3199 48421 54037 15124 30579 17057 -22678 -7138 -57134 -100647 -87422 -67437
16033 -67437 -25661 821 -13305 -16098 7958 9269 3132 -11707 -25753 -19935 -25278 -54467 -48840
16020 -48840 -53265 -81446 -63610 -55343 -38813 -14211 18301 8776 -25870 -28122 13620 18811 31159
16007 31159 28498 6243 22372 19817 5540 549 -6496 23970 24855 -13445 -25244 -30275 -3531
15994 -3531 38216 23534 21007 23303 10178 2238 -1271 10725 -20054 -10700 16352 37851 25067
15981 25067 25323 -3307 -23209 1923 6730 -12305 5175 36926 34152 36260 3572 -4053 3979
15968 3979 -5329 -1618 -2492 -12933 -24675 -42718 -4888 2421 -38235 -28676 -61255 -12430 -18998
15955 -18998 -55218 -23617 15522 10355 14423 4390 8698 -6515 -5350 15769 21351 17676 -8755
15942 -8755 -24779 -13406 5281 -39476 -77633 -65787 3724 64320 32931 1269 -33673 -31279
15930 -31279 -19471 -13611 -31146 -43821 -4427 5748 16543 -17437 -43357 -34406 -28306 3461
15918 3461 7900 3651 3867 -45467 -94355 -127154 -84445 -27368 -18445 -31859 -23388 9752 9022
15905 9022 -15802 -41385 -65796 -56518 -12118 -5214 -28021 -33620 -21175 -31120 -24049 -16548 -21722
15892 -21722 -18120 -12569 9943 26985 -24241 -22541 25558 46592 29325 30269 5311 -37204 -57215
15879 -57215 -29993 -12567 -44185 -57041 -26039 -437 3427 1003 47664 56578 -10936 -54914
15867 -54914 -34722 -12846 2247 4509 -7541 1976 -18530 -6920 -22461 -26747 11218 6209
15855 6209 12594 23951 5816 13126 23271 9079 -22869 -31252 -36190 -56405 -53610 -25553 -1852
15842 -1852 -6741 -12430 -19323 -16230 -35405 -46550 -49482 -39573 -31882 -32629 -38568 -37957 -60689 -78060
15828 -78060 -38066 -13028 11138 9525 29989 21020 -17678 -12047 -10441 -37349 -50331 -39759
15816 -39759 -12406 16093 3321 -20876 -78337 -112426 -76743 -50545 -32429 3830 1682 -20517
15804 -20517 -17010 -17721 -65443 -54660 -23327 -18491 -13602 47739 41883 29730 43800 31567 2587
15791 2587 -35555 -32461 -28901 5144 45496 60938 92743 23525 -5795 -203 -30089 -31745 -33681
15778 -33681 -9444 5033 -14755 -20522 -45179 -68444 -34897 28047 30944 -10906 -33801 -51207
15766 -51207 6585 56608 37321 925 7861 44441 23518 -10601 -35459 -32686 -56121 -48209
15754 -48209 3742 40101 44979 -29847 -52637 -28689 -12459 -20084 4310 7572 7504 8027 -34980
15741 -34980 -62164 -69631 -78427 -68017 -7713 21887 -4055 -998 1679 -4394 -21389 -39913 -21591
15728 -21591 -34818 -16149 -30896 -31401 -22010 -47640 -66572 -52679 -78254 -68904 -105888 -116946
15716 -116946 -74240 -42403 -54794 -53362 -1690 22484 18754 8453 30890 31093 27319 36287 31430
15703 31430 54238 27911 8816 -15374 9207 14237 14588 18295 -4152 -6899 -6806 -14519 -32661
15690 -32661 -30457 28660 22124 25892 39228 41032 -3949 -15813 9057 7151 -17927 -19980 -33183
15677 -33183 -13201 16356 35818 15477 14859 49973 25409 -12621 7556 23029 29003 29008 13881
15664 13881 17385 29746 16352 24690 33266 38905 11761 14722 16263 27601 2677 11263 35025
15651 35025 -2689 -30355 -12436 -26233 -24787 -11522 17073 40479 29548 25701 46246 59413
15639 59413 77788 83669 68154 46825 42488 15616 10189 21701 2569 -31337 -38039 -12788
15627 -12788 -6267 38372 -5605 -40528 -45915 -10664 9947 21015 39096 44101 47753 34204
15615 34204 47278 67413 49283 45628 24855 44513 51493 32958 2375 9009 16290 -13337
15603 -13337 -13650 7337 24602 33447 63546 36434 19394 -8836 -46916 -31966 -7001 21399
15591 21399 16059 53258 3291 -20093 -29542 -11295 22830 27893 39682 -13902 -25676 -28449
15579 -28449 -28516 -6043 10217 16300 -13860 -22976 -48951 -48254 -31083 6532 33979 52041 50200
15566 50200 7207 -44613 -70368 -63619 -36505 -57291 -50603 -30049 -1167 -8678 -18739 -27118
15554 -27118 -28343 -49148 -1870 26085 2182 14557 -3977 2907 11281 2689 -3358 -12412 -13002
15541 -13002 -1708 -16140 -43656 -44491 -15405 1463 30834 51604 60925 29199 2878 -28674
15529 -28674 -29202 -15565 -19862 -26958 -46267 -61697 -31460 -9355 7493 3837 -28319 -48609 -28663
15516 -28663 -39313 -51469 -42281 -65710 -28320 53520 65362 62993 64677 39342 30989 51285
15504 51285 77546 72198 59057 7679 -40280 -59268 -78037 -57290 -44425 -35603 -13088 -23502
15492 -23502 -43563 549 4537 -2504 -32688 -36836 -13548 -31392 -11332 -19674 -60070 -75449
15480 -75449 -65189 -47759 -41432 -23273 -18303 -31054 -49877 -78676 -45251 -47476 -33838 4767
15468 4767 -26129 -54324 -24275 -15571 -1868 -3898 -32325 -28738 -2962 2483 278 -25822 -31531
15455 -31531 -40169 -27669 -3783 11278 27216 19231 -12798 -17751 -12049 -3640 2528 -13267 2525
15442 2525 6266 -6344 1364 16839 37435 68351 28981 12475 29215 12368 -1341 -34257
15430 -34257 -51488 -35888 -45874 -25984 320 31949 6854 20646 37570 13517 20356 -1918
15418 -1918 1904 8125 1823 -16394 -13304 -42359 -44131 -16813 -6620 12837 -16947 -17255 -7501
15405 -7501 -13266 -40559 -24019 4779 14609 4985 -10173 -21704 -27994 -7956 1620 12787 24497
15392 24497 2045 -22962 -60353 -74814 -81186 -64016 -25768 8626 4224 4700 42379 49974 44749
15379 44749 10709 -20704 -32568 -2767 39578 2218 -5965 18059 -10570 -57335 -72716 -60172
15367 -60172 -47809 9365 10710 -13695 -38698 -59138 -43918 11809 38262 49202 12169 9519
15355 9519 -5565 -11473 6245 27125 29601 19904 53363 40991 1519 -10707 -14066 -42541 -14616
15342 -14616 8851 -3263 -44052 7452 19665 9031 20341 24373 14912 28557 31052 14289
15330 14289 15226 -5426 -14768 -6063 20951 19946 -18356 -43539 -21625 -16761 -1655 13002 -338
15317 -338 -15194 -1667 5800 1069 -11395 -15680 -2669 -33956 -49914 -62299 -91686 -89224 -57642
15304 -57642 -26191 -46132 -23085 9472 61146 86013 60823 134 -18549 32494 94074 95131
15292 95131 51570 22281 31379 31104 -6777 -7128 10840 8664 26878 62805 57938 43000 88892
15279 88892 44248 -44267 -52034 -52220 -67020 -62914 -60184 -26874 -6816 28736 26934 12812 17319
15266 17319 12416 -28503 -14325 -8373 -18058 -41910 -32096 -10074 5770 5249 8951 -5787 -29166
15253 -29166 -40767 -21311 -5531 -17862 -28939 -26787 -30054 -44035 -70625 -42755 -15923 15851
15241 15851 21966 60502 42303 -5189 9095 -2614 -29972 -77300 -50043 -8647 20482 34838
15229 34838 -10869 -40731 -17636 -16616 -2349 17359 38364 33265 13722 -1708 -17211 -23464
15217 -23464 -17733 -16727 -23405 -13168 17812 18641 23894 5268 6853 43499 56884 11609 -9876
15204 -9876 -18304 -23862 -1502 26470 25338 1591 22397 22956 35273 30480 -9673 -20802 -27890
15191 -27890 -44018 -70327 -55569 -13314 -16303 -23173 -44713 -30184 -2469 -14230 2271 33524
15179 33524 22747 56379 76806 74873 57375 50181 71448 40257 19949 32653 18670 -1036
15167 -1036 12729 1233 1254 -12516 -8419 51806 68067 36593 22567 -6652 1159 5482 25320
15154 25320 46362 54829 37368 12209 -11894 -19149 -18428 -16546 2282 -1743 -22398 -30710 -62199
15141 -62199 -48682 -4864 -10749 -26622 -27036 10260 33919 -15495 -25260 -9570 -16559 -28577 -19926
15128 -19926 693 7325 8051 13242 1079 1758 25248 5983 -25051 -44162 -37366 -8817 22326
15115 22326 22793 20406 10928 16266 12063 28130 33856 22517 -30086 -61424 -59153 -50072 -42727 -45390
15101 -45390 -68216 -60815 -60319 -54309 -42926 -49065 -40338 -47341 -50924 -48987 -32363 -24896 -38223 -37470
15087 -37470 11184 21848 -1869 -12918 -30138 -51463 -35137 -9235 -783 -8495 -3622 58899
15075 58899 36373 37458 38139 61838 82412 59706 47312 -4911 -17740 -45708 -38940 -20708
15063 -20708 -18217 -23008 13011 19984 8739 30895 36415 67597 60417 16096 -33690 -26031 -11287
15050 -11287 -31272 -42956 -24160 29067 33563 24037 19479 -1414 9646 40767 38369 -21508
15038 -21508 -46305 -61829 -32496 -12798 -29532 -53126 -49905 -39386 -55825 -20867 44966 60998
15026 60998 40358 13943 -14597 -14552 -39290 -68433 -59651 -39436 -9301 -41624 -81425 -28531
15014 -28531 -13025 -16888 2912 -23367 -63659 -27145 15555 13933 -7211 -566 9193 -10156
15002 -10156 -41622 -38325 -88483 -60795 -28291 -23946 -53096 -80606 -42068 -12834 3205 26634
14990 26634 47939 31664 30477 42840 48965 54594 37271 6743 -4687 -17059 25377 27848
14978 27848 22563 6398 -29748 -14034 -32506 -40991 -22251 1562 21080 28127 13006 -4196
14966 -4196 -21683 17904 37667 20232 15703 12034 -3738 -35818 5632 25178 -5034 -11090
14954 -11090 -21278 -42607 -31015 -19823 -29898 -38556 -17211 -12646 7305 4877 -16666 -9165
14942 -9165 -21704 -10264 -3478 -16370 -30634 -7688 20820 9275 663 30137 55772 18916
14930 18916 -19659 -7992 -4227 9115 -7161 -40373 -38301 -46052 -25701 3040 21057 19546
14918 19546 -32007 -48854 -38121 -40208 -36760 7148 7726 -37674 -25116 -5682 -6936 -37257 10377
14905 10377 39989 37728 45542 29634 56539 62351 44808 33537 50097 24996 7698 -1463
14893 -1463 24984 19845 -25371 -38849 -3811 30053 8600 -35846 -78797 -80328 -49006 -14555
14881 -14555 -10071 -9213 -37411 -56826 -37703 -7413 -61381 -68053 -22057 -38239 -14349 -5794 533
14868 533 -1737 -7949 -32900 -32430 -20647 -26576 -42698 -4849 -12449 -7245 13006 14453 -9599 -8259
14854 -8259 -13647 -47129 -59012 -54300 -61164 -18253 44974 65988 68940 42997 16234 20467 12893
14841 12893 63024 78970 52496 28959 5414 6856 3995 -29745 -28198 21710 33108 23133
14829 23133 -1990 5401 41044 42349 27478 18263 23045 26931 -4975 9542 34532 44709 53290
14816 53290 17546 1378 4336 -15544 -40249 -37849 -47799 -47741 -25245 -10407 4042 -1492 9480
14803 9480 -794 21879 29675 49885 37716 24150 25950 71069 55013 9715 -8989 7226
14791 7226 14488 45251 7115 -27281 -10589 -28670 -14491 26616 65114 84483 75550 41427
14779 41427 8964 -13333 43279 82783 68843 49574 29760 -2614 14567 30752 18522 -9412
14767 -9412 7523 7244 -2985 -30096 -33296 34430 34744 -3530 -5467 -12390 -9708 -63222 -44665
14754 -44665 -38432 -13991 -22688 -11981 -28805 -28146 -22140 -54177 -24084 -13130 -5853 -16997 -36032
14741 -36032 -35327 -22312 4041 22004 30441 10864 -10304 -16167 -6821 -4761 -40727 -56941 -59726
14728 -59726 -29891 -33600 -63811 -67180 -45858 -42093 -50903 -37030 -11243 -29739 -7625 14916
14716 14916 31296 37523 20377 7471 13594 32862 52502 54351 67567 68769 35025 187
14704 187 -26561 -20088 4578 39389 74033 67073 36589 26082 61007 30642 5369 -6592
14692 -6592 -6571 -27999 -38915 -53700 -25214 10454 56366 41558 7648 20434 32343 23565 20962
14679 20962 343 -16015 -28724 -67957 -73942 -26469 11713 30112 26181 13747 16300 22693
14667 22693 16180 -6784 -41052 -31141 -17627 -12473 18882 10696 2035 34962 54249 42585 31481
14654 31481 13296 11124 29161 -4621 -31474 -36286 -9289 -13666 -16891 44349 88701 65058
14642 65058 26088 44717 51284 45767 46243 55284 22722 12111 -17402 8253 15462 27017 33455
14629 33455 39598 27787 -1390 9627 9113 -7190 20030 17757 -8963 -19685 -19998 -8228 -16168
14616 -16168 -30162 -32210 -22249 -6695 -30329 -79222 -69622 -59646 -9431 25212 -768 -33780
14604 -33780 -35948 -32067 8203 36424 19466 -6609 -31204 -57221 -57629 -57327 -48385 -52140 -70433
14591 -70433 -44545 -28425 -15040 21316 32128 12663 -2062 2604 -2759 5882 50822 74946
14579 74946 77965 33116 16755 28933 23903 6911 14915 24959 12997 5552 -26179 -635
14567 -635 24651 18088 39251 43245 68072 46573 8117 6579 32493 16442 5046 -22282 -10597
14554 -10597 41429 71818 73745 60042 24662 23366 50714 36893 10982 -26780 -46535 -24129
14542 -24129 -15726 3086 72276 71638 36774 35548 43669 24654 11736 10395 -14863 -9273 -28494
14529 -28494 -21487 -18976 -43991 -14984 3004 43899 52977 30795 21972 -18903 -65579 -45106
14517 -45106 1323 -26410 -13093 20231 -824 -61803 -57665 -45977 -75530 -51621 11726 8074
14505 8074 12862 37563 20285 -17887 -59311 -84159 -59692 -45038 -41839 15532 29502 33510
14493 33510 19783 9153 14411 35098 49843 35366 25529 53058 45949 10609 -5604 -20059
14481 -20059 -7503 -4820 4890 12798 32306 26230 5641 37823 60262 72340 49831 29510
14469 29510 17759 -25991 -56749 -33950 -22452 10865 56746 55964 16238 464 -1658 5282
14457 5282 5956 495 3828 -30386 -54861 -33041 -798 10532 34320 18697 374 15422 23187
14444 23187 27185 23767 -342 26862 49276 62117 48464 52178 36736 29062 35947 21351 14746
14431 14746 7327 26102 44511 23806 -22125 -52461 -34288 102 48495 44625 26208 29172
14419 29172 40235 22533 31522 23576 14825 -16196 -45114 -52541 -88191 -88789 -49284 -31482 7141
14406 7141 27119 1185 -8820 12074 -2296 -4186 4912 -370 -26563 -29500 -16329 -10841 -21701
14393 -21701 -42606 -27852 -785 -963 -11339 -22507 -9723 2081 -26551 -16022 18393 24341
14381 24341 -847 5124 61491 30656 19446 19244 5481 28564 11043 -23116 -59225 -47984
14369 -47984 -9035 11663 9732 26078 29517 32466 29170 929 -20702 -14163 -4368 -5415 -20106
14356 -20106 1129 19559 21974 -1179 -23961 -34903 -18777 -20719 -55070 -44736 -18500 13075
14344 13075 40189 36402 21546 12833 29301 38955 71338 70470 7916 -19246 -37093 -44603 -37554
14331 -37554 5495 24647 23694 52618 53983 31506 50805 73445 41367 18373 22161 -9594
14319 -9594 -14855 -21198 -36581 -13891 -20775 -39863 -41710 -49715 -52573 -25229 -14735 -29450 -1346
14306 -1346 10329 33078 77206 90218 64872 39558 11508 -30393 -15577 -4270 42865 57859
14294 57859 44515 9516 13008 19218 1201 -10183 -14941 -1831 5753 -3516 -11158 2830 28290
14281 28290 20834 38734 20482 -21409 -28454 -16857 -26210 -40985 -6635 40298 32556 16023
14269 16023 42863 19887 19949 53622 51153 4560 -16772 -689 -5497 19679 49568 55931 54878
14256 54878 23108 6036 -16241 7567 12561 13614 20971 7590 38536 5476 4253 -18736
14244 -18736 -7123 -3328 -3452 10853 20124 13116 9629 15453 9699 22075 -11052 -32243 -30386
14231 -30386 -11237 6737 17779 31993 44861 38702 13400 4022 -21169 -15831 4862 30200
14219 30200 55992 49827 137 11705 13943 -3178 -27335 -44678 -38954 -19657 5572 34773
14207 34773 76948 68038 48478 49615 36007 59302 74293 73519 41960 26326 -581 17542
14195 17542 67675 74669 54173 61851 52849 52829 45633 33745 28831 21056 17722 14858 -22176 -47250
14181 -47250 -24331 -8471 13547 9612 42289 43215 14662 10216 36175 62002 53708 7123 24760
14168 24760 54992 41490 46749 57654 56383 58165 33149 14897 17343 -29402 -51671 -22824
14156 -22824 -40957 -7262 5166 19478 18809 26394 50955 58244 84010 66667 33384 17173
14144 17173 -12800 -47585 -34427 2278 22905 46221 67524 59297 95621 99407 81271 48328
14132 48328 11873 12827 1554 10754 7638 2792 18890 36870 76793 122912 133903 68233 31901
14119 31901 42023 8988 -24047 -26875 -60129 -56085 -13305 24017 169 -36516 -38494 -1180
14107 -1180 -17728 -14016 -458 28659 40268 22167 209 -14612 -4495 -12748 -11962 8734 -12314
14094 -12314 -12532 4639 15972 11784 3201 -2315 20371 70427 92848 61788 19692 26445 39230
14081 39230 82775 100257 76585 19359 19533 16160 7378 3620 -13851 -22051 -26099 -13571 -1522
14068 -1522 -7579 -35882 -46958 -18461 20898 15762 14821 34797 100 23247 57592 88402 80229
14055 80229 53624 9919 -24655 -51279 -47525 -48403 -17356 -10132 -26116 -49822 -37844 8073
14043 8073 56971 35020 -5310 6228 -1100 30548 57720 44480 60981 39584 33372 21976
14031 21976 1146 21390 9152 -13556 -28087 -13132 49666 36593 27304 6833 -11060 -23644
14019 -23644 -32274 -1671 19361 19640 18666 2402 -1376 -4663 -24050 787 8724 5536 9142 27873
14005 27873 28938 22162 5202 -51903 -34722 -29550 933 38768 48573 48098 6840 12631 11271
13992 11271 8520 10486 -17737 -32354 -27878 -50753 -74168 -53520 -14738 -6265 -2065 21325 24513
13979 24513 14299 5836 9411 39192 59716 42248 5704 9932 14175 -29756 -18489 14733
13967 14733 -18215 -33970 -15281 -5920 -27385 2919 18907 8418 -20400 -39351 22130 49306
13955 49306 22986 -10784 -21531 -12066 13862 28954 18753 -38460 -41254 -30718 -21637 -16907
13943 -16907 -5545 11546 47139 70039 59845 32602 15728 -2089 -8165 11147 4468 -20428
13931 -20428 -7691 -21715 -40430 -59005 -61871 -23295 18694 5230 -12384 -63215 -80208 -66016
13919 -66016 -4699 39699 66343 57962 17329 18405 -8144 -5861 -15726 -3597 16432 26253 34198
13906 34198 41733 57530 47560 6206 -21803 10454 25303 51599 63626 43470 3407 11036
13894 11036 52427 49368 51153 57383 53257 18496 14014 -6270 36419 64765 72629 53350 41294
13881 41294 38559 16751 13288 15727 8190 -11785 -2646 -21251 5883 -449 -23998 -28306 -23104
13868 -23104 -7289 -12086 -33879 -26091 -15526 -17740 -28072 -393 17530 26786 23720 17134 5503
13855 5503 -20253 -14306 9883 39836 59582 49116 40552 49574 34083 36135 23357 25166 35171
13842 35171 35429 4646 -40814 5956 25288 -13614 -15836 17992 -12165 -27612 -27693 -15983 -12705
13829 -12705 -26830 -18478 7170 8368 5534 -29578 -37638 -19758 -21339 14502 47736 74792 51060
13816 51060 32992 10423 -35270 2193 32109 41859 66747 70853 44868 24200 -27251 2848
13804 2848 32517 17132 -21503 -39259 -28580 -42576 -20186 -31442 -18708 17682 34117 49651
13792 49651 43208 18884 4682 13411 25394 13286 29477 59660 66121 59758 53953 56649 50994
13779 50994 44878 -17572 -18452 5375 -3501 22134 7599 8185 29702 6394 17230 1580 -8829
13766 -8829 1799 -1622 12350 27501 18190 1628 9566 -18854 -48365 -32202 -32045 -15846 -35281
13753 -35281 -32956 -15645 572 -2362 17599 35112 3378 16598 -9440 -56549 -61154 -20548
13741 -20548 -815 -24848 -52570 -50158 -11054 17214 -1666 -6872 -2983 -795 -12734 -20024 -8303
13728 -8303 35540 5281 -39433 -12744 -2624 21809 57436 50057 30214 -10419 -52654 -45133
13716 -45133 -46239 -37836 -34192 -31958 -46236 -23403 -8124 -40385 -29831 26497 24784 17075 18852
13703 18852 30028 11288 555 -12470 -9848 -4867 -21555 -30979 -50890 -65149 -12968 11949
13691 11949 26038 30603 53040 8446 -23121 16864 33338 31087 19291 3863 29831 24655
13679 24655 -34690 -36182 17069 33036 11713 15544 43474 25831 15666 -18365 -41658 -34876
13667 -34876 2099 35523 32843 2562 -14382 -23799 -39659 -39242 -22487 -5494 23601 46698
13655 46698 33779 18281 -5269 25568 36272 28477 20282 -8231 23512 47013 49320 28322
13643 28322 -14841 -41676 -55234 -39220 -7081 -18081 -15319 -11547 -19678 -47875 -29361 3137
13631 3137 -4060 -8155 22731 15870 33346 38939 -5389 -2882 82153 76393 49944 6184 -21420
13618 -21420 -14217 -15881 23034 34159 52283 75297 88189 75094 57866 67001 44737 27751
13606 27751 30252 -7335 -16160 -32604 -18997 -26286 -5916 45067 64002 34137 2960 -30049
13594 -30049 -24691 7434 42502 16329 26260 15206 -12450 9637 -97 6383 17141 22515 19317
13581 19317 6280 18247 23410 46620 6047 -440 -7198 46085 60487 35590 13006 5379
13569 5379 5782 18766 20639 -2525 -9967 -28016 -23602 -22530 -21694 -16772 -22608 -30945 -46637 -53385
13555 -53385 -37698 8264 41535 39103 13824 -31108 -25564 -1263 36695 48191 34960 54724
13543 54724 66510 35371 39393 9127 7088 7598 -18892 -11241 7692 17400 -11639 -56082 -38440
13530 -38440 9118 -12037 -22824 682 30996 -2276 -21594 -26555 -14951 -5886 6480 34199
13518 34199 8177 -23712 -16538 21235 33585 34620 41330 40770 69275 51497 -1988 -41711 -60760
13505 -60760 -61728 -41979 -21735 -14744 -30890 -67440 -51814 -51811 -75464 -71882 -6198 -17917 -57779
13492 -57779 -72410 -53597 -63076 -62599 -30293 -11016 -10819 2574 5738 32167 10268 -80 -22035
13479 -22035 -66866 -81187 -47209 -30264 -9579 -5015 -6463 -14367 -35054 -48613 -11827 -2961
13467 -2961 -54 -9111 -31038 24409 43355 16313 10963 26957 23600 18294 6430 -17630 -21178
13454 -21178 -12910 -11730 14183 42875 49011 13357 -5046 15173 20580 9826 -6823 -12479 -11983
13441 -11983 -12732 -23429 -14562 23378 31755 9914 -6886 11960 10844 9244 21319 -20632 -55801
13428 -55801 -65007 -15488 -13529 -37940 -23498 -36517 -46292 -56651 -72565 -68593 -56383 -39070
13416 -39070 -9633 -15062 -57975 -36466 -10161 -35003 -17792 -4304 -1552 -5874 -43912 -51751
13404 -51751 -10626 -7862 -6348 1043 16558 36887 48299 29645 -9916 -32050 -19980 -24813
13392 -24813 -34491 -46744 -8323 23851 52408 27437 14628 22105 12177 27483 -6355 -18219
13380 -18219 -23871 -16379 -30704 -27881 -18330 -17567 -5765 5788 35705 53736 47046 45437 17431
13367 17431 -14322 19067 53118 33513 52662 2390 -11436 -3213 5142 53392 56993 29658
13355 29658 2777 -18221 -18464 10172 12116 15158 9547 1261 4367 6909 7600 2054 -19047 -7063
13341 -7063 28738 33990 14745 8978 32521 32607 31533 20975 13848 230 20937 5835 -22767
13328 -22767 -59020 -31875 -32958 -46057 -24067 14633 67845 25219 -33928 -47828 -53754 -22329
13316 -22329 25205 65356 34617 -12172 -15675 7503 -16319 -28517 -21506 -11818 1530 -9004
13304 -9004 -56459 -55498 -14031 -7886 -13915 -7644 -19025 -28781 -25737 -20138 -13607 -38367 -7148 41603
13290 41603 41674 31973 56807 48635 26560 -63151 -89020 -66634 -65336 -62805 -37502 -51737 -79458
13277 -79458 -61599 -39353 -34891 -55235 -68049 -43017 -5592 -12321 -31895 -26264 -37348 -12879
13265 -12879 -1736 13561 26157 56439 37218 -8352 -59031 -34052 -47871 -44947 -64027 -50674
13253 -50674 -44499 -19933 -7195 7904 -1356 -27360 -22284 -36914 -14951 -9123 2702 29934
13241 29934 64311 19850 -35554 -51439 -42952 -32929 -35194 -50655 -20154 -18849 9429 10206 10315
13228 10315 40269 15231 -4937 -63912 -87074 -77912 -56025 -41319 -37240 -25157 8446 50249
13216 50249 70163 84900 77279 32373 22498 37244 35427 24318 54 -9686 -6843 21968 41949
13203 41949 31784 6486 17467 42525 43781 23125 36199 14855 28408 75508 79044 41106
13191 41106 -8570 -14182 -5734 13811 12068 16926 43268 36597 -11336 -26961 -2036 175 19479
13178 19479 24653 55389 48917 53577 36748 -5924 -17209 -15270 25801 23127 7089 20106 -6099
13165 -6099 -3584 1135 12874 42559 67156 49053 15764 16999 -9763 -28185 -19590 -1553 -8388
13152 -8388 -22769 -5433 -5725 -19286 4571 16324 5017 24290 -2284 -40395 -51153 -35650
13140 -35650 -53733 -49018 -46311 -18277 -2236 16065 59215 61868 31665 9271 -18252 -28456
13128 -28456 -20857 -48356 -59737 -47528 -15951 -10882 4930 20635 -4949 -16351 9037 6595
13116 6595 496 -19424 -32828 -65228 -75301 -65348 -52668 -68122 -66388 -40256 1520 15424
13104 15424 -18561 -37792 -52026 -54951 -81081 -58251 -19769 -25955 -34642 -625 11784 35715
13092 35715 30164 48624 44268 8332 -28560 -28763 -17642 17642 19863 -6738 -8493 -12396 -31419
13079 -31419 -51280 -67142 -53854 -45861 -39567 -8554 12748 31425 23525 24473 -6832 -24072 -25099
13066 -25099 -78419 -76196 -45172 -55311 -70070 -46269 -38664 -58734 -47774 6140 19042 10996
13054 10996 9149 -1354 19599 60296 49886 19695 2219 -16544 14780 27175 28273 23997
13042 23997 5089 -840 4403 33353 55973 61541 35916 56865 68517 42981 -7240 -17488
13030 -17488 26498 76081 53498 44558 27823 19647 1730 -29212 -12954 -42133 -18861 -15067
13018 -15067 -21734 -37136 -27667 -32336 -23314 6072 6601 15066 15656 26662 7947 1105 11370 -19421
13004 -19421 -35709 -10595 18151 37169 3918 -3323 25829 39546 33818 8680 -810 -8471
12992 -8471 20142 -10674 -21965 -9289 -1922 -30611 -36541 -39415 5528 20808 -7935 -6665 -27020
12979 -27020 -25186 -21154 -14344 -10816 8172 11384 -1125 15080 14837 -7824 -8759 11934 50323
12966 50323 46670 18352 -9760 14074 53519 27139 -12224 -39356 -33927 -43156 -19865 -6116
12954 -6116 -22159 -2120 781 -36623 -46373 -26329 -33594 -9027 -19902 -65533 -38024 -13912
12942 -13912 15053 64189 74323 48837 27451 -10823 -48723 -16095 13234 21503 16775 33333
12930 33333 76017 54070 -5552 13710 29787 42096 22443 12011 6083 6207 2032 -32406
12918 -32406 -35990 -17665 -26088 -35369 -23144 -7530 -40513 -47997 -14539 -16495 -9768 20304 13919
12905 13919 1905 -13095 -28377 15383 7791 4271 23531 41221 33965 53522 23334 31413
12893 31413 21798 166 29836 86862 104463 60208 30912 32795 58778 42048 40680 36108
12881 36108 68893 66026 32320 6015 25457 11817 5271 -14838 -20567 16342 41627 38392
12869 38392 65240 105345 62558 29700 -21577 -61982 -24514 20890 58045 69256 30358 -10892
12857 -10892 -26201 -3411 32654 44238 26325 15846 18909 53113 42842 -9642 -1805 6958
12845 6958 36565 48453 -7368 -17860 5553 37330 -13343 -22036 33013 54295 31855 4261
12833 4261 -45826 -68181 -115610 -73095 -13222 11389 35452 42842 28805 32653 31799 21332 12518
12820 12518 14833 -9536 -7402 -37040 -1146 55059 13870 -23413 -26412 -10093 -13938 -16772 -6265
12807 -6265 -13546 -18916 -10881 -5454 -5693 1023 -20712 -11312 25988 36316 14527 -5593 -5263 -2595
12793 -2595 24452 31025 34342 13580 10356 18792 17218 11464 14713 1742 -40712 -54569 -24110
12780 -24110 -19755 -26134 -10662 11649 17053 16299 -14343 -32646 -48583 -41941 28359 23393 37360
12767 37360 11200 -6146 -15935 -52749 -53708 -24922 20044 19100 14550 -6878 -28504 10588 12210
12754 12210 -26237 -13679 36143 56280 -4944 -35517 -34183 9747 50653 69271 65761 51692
12742 51692 30887 43813 60134 48190 26345 13993 3483 -38856 -18162 -8492 27600 66628
12730 66628 54518 -10825 -36471 -54087 -42346 16850 20175 766 3249 18410 3896 -21892
12718 -21892 -31731 -31773 -8463 3451 -5553 -880 5293 20953 49277 36502 7861 34548 78106
12705 78106 92593 45815 3223 -28209 -7844 -10455 11221 29036 2731 24811 38852 66242
12693 66242 28707 12859 19534 34880 36805 49691 8166 -47355 -62433 -48814 7019 45458
12681 45458 45545 34712 -19919 -11013 23528 10152 -5057 -28111 -40534 -50829 -33084 -11657
12669 -11657 -6861 20811 7494 2511 14607 -12894 -1047 -31156 -72549 -53966 -56399 -38209
12657 -38209 -25842 -44939 -49491 -55996 -21955 -9267 13261 19836 20351 25377 -10923 -27074 -33985
12644 -33985 -52937 -47037 -2865 -113 725 19613 38766 54573 34246 -1060 -23144 -51513
12632 -51513 -62348 -38443 -11312 26131 66698 67413 -13322 -45047 -37161 -17858 4396 10210
12620 10210 -17445 -13947 -7867 -18290 -56454 -53735 -56125 -47842 -15605 -34575 -40843 -12924 -23358
12607 -23358 18747 39080 -4812 -13745 1840 44970 51231 66644 39618 -19303 -11539 5068
12595 5068 36562 34522 61539 21720 -23241 -50486 -33177 -35520 -51318 -55300 2092 -20790
12583 -20790 -94121 -40935 2007 21674 9899 -16741 -20098 -44483 -73631 -51909 -49063 -75743
12571 -75743 -82732 -57657 -26037 -21199 8871 35827 14968 3399 -6970 9853 16616 303
12559 303 -11954 -1745 63060 68126 50492 -910 -39191 -79289 -101774 -84665 -40211 624
12547 624 -5773 -28087 653 1359 -5920 -9795 -19070 -28031 -27607 -4902 12713 3820 -336 17390
12533 17390 30532 5938 -20300 -55097 -62534 -40309 9604 3966 -3930 5084 -17549 -39768
12521 -39768 -35467 -39556 -22949 10450 47189 29570 25695 14286 904 -16195 499 10516
12509 10516 28678 59411 46737 62380 73480 34818 2140 -15219 12509 9760 -23791 -16436
12497 -16436 -7216 -1865 16058 35453 18414 -9448 -3038 28107 13011 47510 63044 58129
12485 58129 1771 -18093 -41915 -35227 -56856 -62075 -73487 -76604 -22367 -35659 -35798 -43516 -49510
12472 -49510 -29891 -19729 -6423 -7745 -16306 -33886 -21631 -37366 -55859 -37439 -18574 14773
12460 14773 25573 11327 23365 2592 -11308 -11920 -18986 -34076 7684 60516 52285 54552 48490
12447 48490 11545 16875 39611 8223 -6022 40525 61127 32522 17691 5464 -11922 -21662
12435 -21662 9199 5467 -33968 -44730 -5571 12331 -26848 -48095 -21091 -18587 -17273 -21796
12423 -21796 -16269 -52641 -75937 -34199 7349 23102 54220 43005 34085 18804 23797 44493
12411 44493 45934 -3625 -30522 -5695 2001 -1980 -8312 -26331 -15727 -1072 -15863 -22424 4848
12398 4848 2330 -10886 -15029 1195 40860 69370 82994 46898 -3614 -6953 -7904 -16157 -7896
12385 -7896 12629 9546 -9657 -6199 -10086 -9372 3083 16842 6005 -2261 4944 -16189 -50285
12372 -50285 -57094 -52715 -57966 -50836 -62794 -77448 -70069 -62587 -55392 -35858 -8750 10710 6135
12359 6135 22271 44504 29778 31692 30848 3290 10183 -6257 -22291 -2200 -30238 -58896 -63896
12346 -63896 -36648 -26737 -2413 32115 66911 71267 33950 38089 44434 35946 10864 -8555 -20247
12333 -20247 -26543 -45871 -69463 -82548 -50482 -27779 5727 -18482 -33379 -34006 -20885 5573
12321 5573 -20292 -26286 23469 41548 29947 43018 16013 -22545 -42001 -23851 -7242 8356
12309 8356 23649 -7004 -40832 -21460 -16735 -32363 -19973 27424 36237 -748 -7152 -34375
12297 -34375 -73113 -87524 -48640 -3548 6953 -2116 -12422 -18988 -9487 -5783 2484 26930 36314
12284 36314 20861 24251 885 -12354 -37095 -17742 31531 54009 -789 -53587 -57959 -27459
12272 -27459 -29476 -42353 -77663 -99730 -100577 -78903 -54291 -48889 -10118 26192 78892 92354
12260 92354 43329 30611 12502 -12082 -2013 21124 24667 37100 8274 7004 19930 36700
12248 36700 59704 16358 5035 4426 15411 -8313 -30100 -43175 -34955 -51819 -19711 2940
12236 2940 22492 11003 -4150 -8103 -26404 -39660 -30353 -24700 -57084 -47541 -31486 -32361 -40757
12223 -40757 -11197 -4365 -36820 -40744 -15588 10165 4508 25771 -20928 -54060 -7902 15960
12211 15960 6307 -2715 12310 39049 47644 33452 19108 18026 5667 24459 3550 20149
12199 20149 22146 -610 2370 -5927 -8089 1535 33595 33419 24909 -26272 -52780 -29808 -23093
12186 -23093 -58511 -76957 -64189 -43012 -9254 43348 41504 14101 -9054 -3019 34452 68429
12174 68429 99023 74824 56034 48850 40986 36024 17884 27194 54028 27970 13254 -11021
12162 -11021 -24674 -8198 5281 2945 -21814 -15924 6750 32363 21656 -39546 -64151 -4784
12150 -4784 -11844 -32714 -41977 -57501 -27526 72 -12426 -42773 -49038 -25828 -2425 -2781 -13162
12137 -13162 -19232 -12529 2466 -1474 -24619 -22732 3529 27781 44886 51263 55823 -2318 -9704
12124 -9704 14800 68 664 30449 26554 20566 48709 33921 14145 28984 29083 16556 18147
12111 18147 8275 25041 53558 61168 71636 38389 31305 63679 27251 24929 38060 44677 21241
12098 21241 11433 2749 -9912 -5195 -7351 -19284 -4542 44048 68009 58126 63933 62894 25807
12085 25807 30094 20663 -5916 2894 7979 31005 6385 -31780 -29412 -46285 -41512 -38127 -27728
12072 -27728 -8310 -109 -6398 19519 23321 -410 -30846 -83186 -92114 -46740 -24649 -11600
12060 -11600 5463 6437 -38808 -83160 -56261 -35226 -18422 -6706 -26419 -47138 8309 15438
12048 15438 3531 21537 1814 -11711 -11098 5301 -12294 -22367 -73802 -100535 -52863 -4493
12036 -4493 17640 22215 18799 6733 3931 7397 -4032 -297 11097 16126 9158 -91 -15715
12023 -15715 10530 18830 -18221 -48393 -59278 -47054 -28618 -26066 28083 50623 39700 36964
12011 36964 25011 31517 39805 24993 -9411 -33794 -48018 -47565 -39364 -31254 -35790 -43073 -17351
11998 -17351 -5394 -23858 -64465 -53334 -11280 -24640 -24853 29080 -978 -16502 -37665 -32503
11986 -32503 -12849 -8420 -19464 -40383 -35247 -17078 -36883 -75045 -70814 -54467 -32053 -591
11974 -591 18354 50008 70603 60350 30138 44312 7257 -43017 -45340 -13047 -10221 17883
11962 17883 52489 42714 8611 -10440 6728 16039 -18971 8196 26438 31607 22853 29709 6588
11949 6588 -21676 -21510 21292 33564 30846 5009 19500 4538 17250 14543 2377 1198 14002
11936 14002 6047 17505 -6841 -36848 -10066 291 -5051 -9350 5945 3911 -13423 -32372
11924 -32372 -13859 16434 5843 -11166 -51071 -46885 -59088 -63767 -57053 -56517 -58806 -50083 7594
11911 7594 -30186 -54250 -64565 -54153 -23229 -17372 -14393 -31467 -27783 16927 10680 4677 -8679
11898 -8679 -41625 -28051 -141 17404 14202 39191 39907 21294 13877 47047 47180 8084 -21742
11885 -21742 -24733 -42508 -33508 -37930 -18828 10573 4101 15506 45704 45619 41613 53358 65113
11872 65113 34109 -17054 -21282 9978 24719 18391 -10959 -63829 -80437 -43423 -22504 8669
11860 8669 29936 22653 -25972 -46171 -49281 -32872 -22257 -17081 -33988 -51193 -19141 -5953
11848 -5953 12437 28512 22369 42710 18998 29006 46783 39422 -14047 -26125 5711 45412
11836 45412 62134 28093 -20073 -56269 -31427 -24322 -20262 -2810 24616 17801 25412 26374 34581
11823 34581 12287 -28879 -17642 14539 -3016 -40329 -62408 -12825 9509 -5512 -33177 -12382
11811 -12382 13380 17876 34220 23902 -4290 -29076 -13700 -4471 -10793 -24012 -28621 -26401 -20791
11798 -20791 -36135 -36327 -40296 -66804 -63216 -28381 -36584 -36264 -49918 -55887 -6552 19115 9683
11785 9683 -3829 -9766 -18812 5123 -16251 -26774 -24403 -2712 14421 -4606 -5388 -13942 -15519
11772 -15519 -21186 12511 13305 3120 -6307 7838 11103 39743 31909 19658 41503 55512 32060
11759 32060 -19943 -19500 -17329 1064 39101 83438 65752 -49 -23067 -13531 9652 10143 31032
11746 31032 44558 32238 19611 -4890 -37131 -25309 -7725 -20244 -22603 -42224 13729 39549
11734 39549 43187 50558 49583 49666 44012 26465 -21851 -49179 -45929 -6759 48146 44633 -2202 -2729
11720 -2729 30176 32400 49931 33100 10078 46881 15016 -20151 -14213 12528 2158 -4366
11708 -4366 -3991 18436 12780 -13166 -34026 -35167 -2387 13457 19310 12870 -17321 -28367 -23464
11695 -23464 -19361 5063 -5481 6099 -4263 -10002 -12905 -20099 -12841 24436 33279 22907 -11117
11682 -11117 7854 -5152 -43571 -4222 44839 41605 17519 14013 14163 -6265 10962 -17657
11670 -17657 -39180 -39270 -74585 -81031 -35904 -43373 -59573 -75816 -79711 -31143 -22804 -27526 -41355
11657 -41355 -24555 7284 2402 24069 22143 28977 27544 -3775 -4498 -4398 39813 68364 99165
11644 99165 79056 66587 43393 27555 33319 12956 -16529 -37878 -239 -6476 14691 14048
11632 14048 -45594 -55354 -15252 15296 30769 1206 -41199 -23190 -5368 -35835 -37636 -25170
11620 -25170 -18346 11594 3204 12926 14965 1731 -23555 -16557 -58323 -82161 -72644 -40347 8497
11607 8497 27101 19630 -11800 -13426 -8312 -1191 36921 5708 -7155 -16184 5343 12073 -23401
11594 -23401 -36771 -16344 1226 40934 26341 18268 -6327 -19484 19427 26507 12355 -15396
11582 -15396 -3064 32979 32125 10412 -16290 -10504 -23231 -90665 -75656 -16114 -1298 8997
11570 8997 30391 13086 -5160 3529 34741 36025 -1665 2145 -13524 -28467 -11254 3409
11558 3409 9864 17690 23903 11123 -34583 -33272 -12036 -38161 -21547 -18923 -15991 -15852 -33488
11545 -33488 -49535 -42893 -40270 -19655 -23356 -35220 -68979 -49894 -49283 -31812 -25542 -18106 -13675
11532 -13675 -1021 -16820 -28127 -43353 -30933 -23703 -20659 13579 -3376 -22982 -39434 -61333
11520 -61333 -25404 -1114 43085 60110 6522 -40782 -46086 -42914 -22550 -854 12113 14307
11508 14307 9209 -32660 -20620 -19853 -6325 39694 53715 27943 5805 18757 21850 -18933
11496 -18933 -40348 -234 17259 16943 -19409 -34332 -15263 -8920 -28401 -53214 -65885 -17212
11484 -17212 -5394 -10823 3313 -46843 -46366 -37178 -27306 -33147 -23466 1845 -5355 21577 20854 -5364
11470 -5364 8305 28048 48058 56299 43027 7580 -59785 -12902 30028 13227 16074 32812
11458 32812 38620 25446 38124 18802 30971 48732 67571 55517 28165 58019 57207 43605
11446 43605 13339 -9794 2714 17682 19869 -7774 4666 49139 43975 36557 59398 72530
11434 72530 72320 85903 66872 36388 32247 14841 10904 23814 41468 19838 -933 4263 11170
11421 11170 40234 45137 67548 40990 -6426 19255 9256 -28890 8905 9204 31814 35187 42647
11408 42647 56218 58108 60444 65787 44301 26580 14840 15589 1668 -22431 -14485 -1837 -10738
11395 -10738 4404 28945 68924 78764 51689 25901 -6465 -8687 24686 12208 16607 12959
11383 12959 15925 -23425 -45591 -15674 -7575 -22832 -45961 -58345 -77032 -122580 -98441 -52746
11371 -52746 -43909 -31474 -16816 -5982 -24912 -77576 -57851 -11382 -29263 -63280 -107395 -117449
11359 -117449 -62544 -55654 -18966 -6444 -11530 -12510 -19037 -21428 1276 -3799 -48788 -72681 -84357
11346 -84357 -64134 -30560 838 437 15343 8045 -33902 -40285 -22663 14787 -15808 -46872
11334 -46872 -57979 -39855 -49882 -49131 -53246 -79741 -60347 -47955 -60474 -66938 -7434 37907
11322 37907 40369 40375 13951 -27411 -58484 -40109 -18054 -10080 14583 14353 4743 -7517 -36908
11309 -36908 -24890 -43392 -38824 -3999 4040 711 17703 14254 28069 40287 -5325 -33948
11297 -33948 -32143 -9157 -9115 -13010 13312 28122 43357 -10507 -69142 -41530 -15865 2622 20560
11284 20560 11317 14379 -7207 -8972 -8457 -13943 -19143 -67040 -58895 -40548 -6935 -23733 -25610
11271 -25610 -34414 -31652 189 13281 37258 68143 60275 46626 -1276 -29977 -4607 49802
11259 49802 80753 39342 24967 -12733 -33163 -19006 -28827 3182 32871 56663 118918 98403
11247 98403 83617 99955 78871 51685 11005 7874 23894 -11459 -49914 -47801 -77527 -67210
11235 -67210 -24486 -10664 -53054 -13081 -35356 -54938 -49477 -27356 -20327 -27155 -11215 -20338
11223 -20338 -25645 -7164 -15994 -4827 14828 30468 19931 6916 -21656 -34895 -69243 -59818
11211 -59818 -44079 -35349 -24409 -51092 -52383 791 30194 -1006 -12953 -30749 -63954 -66922
11199 -66922 -12331 -2263 -44459 -40505 -26244 -14334 -17601 -4609 23429 -17046 -61900 -96863
11187 -96863 -115411 -92517 -26915 -17223 -44516 -45463 1222 34503 21614 19293 31395 87
11175 87 -741 -38105 -85867 -45702 -36582 -66750 -46328 -2894 -7860 -18418 -2497 -8206 -11165
11162 -11165 25858 40695 62047 44555 7351 -55279 -76047 -32052 -51982 -45680 -37880 -7311
11150 -7311 17984 12457 930 -9067 -29361 -35939 10280 41225 3102 -20515 -15499 -28358 -12571
11137 -12571 -26718 -51762 -41928 -49892 -26568 -11432 -10265 -27928 -33457 -23205 -32428 -45882 -33518
11124 -33518 -33248 -36178 -34000 -3130 8771 -6481 -36184 -21405 -10565 -21592 -9506 16083
11112 16083 24603 20138 28504 31089 25728 -2688 -19179 -25417 -7370 1964 -3837 11592 46258
11099 46258 69549 36454 20902 36965 53496 44767 46803 22201 13007 -19275 -20986 -11536 -51067
11086 -51067 -68669 -4348 11148 -14252 -45852 -67393 -60344 -39766 -41899 -12057 -376 -23159
11074 -23159 -32763 -27352 -12993 -5444 -34761 -10365 15864 14113 873 -1118 -29847 -56127 -19819
11061 -19819 24558 37698 48701 54668 45725 32165 -18082 -43898 -40884 -29771 -17082 7899
11049 7899 32224 34729 9200 25199 -9792 -60429 -52077 873 -24821 -61172 1156 54239
11037 54239 21388 30208 24416 31125 33852 22028 7994 15731 -6380 -30228 -26915 -23262 -21481
11024 -21481 11409 9504 -37941 -27313 -15886 -49117 -26090 39522 49587 42848 19704 16971
11012 16971 -21083 -70406 -80949 -57565 -29278 -7385 -16521 -9184 -26439 -54982 -67788 -73522
11000 -73522 -19584 1878 -3590 -2652 -11812 -43209 -53800 -18543 27034 14766 18509 10004 -13147
10987 -13147 -15086 -7759 -41834 -37594 -8541 16802 -27295 -21765 6513 1937 -33895 -38685 -50554
10974 -50554 -31336 -54996 -82061 -73307 -29453 -4869 15536 49532 64272 35806 17853 18821
10962 18821 -243 -31017 -14836 28656 60091 28817 20513 -26159 -39298 -22443 65 42276
10950 42276 79040 85449 83940 50819 32045 11466 -1983 -1446 -8095 -15783 -851 27348 65219
10937 65219 56470 30526 22904 13253 -861 -12553 -7242 30544 39781 -15318 -32016 -25017 -10644
10924 -10644 13295 36932 39102 15990 -14761 -9459 32981 50967 76475 82723 83579 57559 30758
10911 30758 11319 13046 11570 2840 30100 33712 19517 42665 69923 79873 42680 41906 48325
10898 48325 12896 -13892 3949 -25357 -26090 -42533 -24631 21510 3728 -14749 -20332 15130
10886 15130 21594 -6184 4484 -5713 1121 61005 30565 6838 -22274 -35829 -20753 -923
10874 -923 30487 53768 67538 74828 66237 57547 102325 115676 74366 45922 53922 58690 71744
10861 71744 45265 -11159 -29076 -25049 -1641 -13213 -58828 -65465 -80096 -73463 -56160 -48833
10849 -48833 -28416 -62999 -85446 -81797 -36745 10467 41666 24962 195 -9204 16822 33388
10837 33388 24661 -196 -18968 -18886 -40761 -12859 1645 14595 -7116 -18120 -11030 -12193 -11765
10824 -11765 -14947 -7529 -2278 -5441 13583 7629 -1679 -25153 -85091 -91523 -68230 -23458 -27560
10811 -27560 -2905 12550 14955 -26915 -30905 -23336 -26362 -11690 -1520 1083 -24388 -24695 -26038
10798 -26038 -14155 -9166 -8114 7392 45916 47639 28734 -15912 -42213 -48104 -48780 -41827 -44547
10785 -44547 -61980 -73792 -54513 -52171 -60765 -38209 -34736 -31922 23108 51081 50628 19433 11110
10772 11110 25975 35407 36682 56930 63563 44960 27867 22556 52274 78252 52504 87
10760 87 -38570 -40100 -68768 -83410 -70901 -54337 -37597 -43588 -53412 -23434 -12051 -11217 13278
10747 13278 18364 47747 42499 44549 47247 50110 43100 14091 40625 45367 38525 -18459 -64637
10734 -64637 -77777 -89183 -88587 -63053 -36299 -29712 -15832 -23161 -47990 -29705 -21268 -26729 -35324
10721 -35324 6172 14291 93 -9267 7537 13070 11148 31472 44031 3041 -19796 -46371
10709 -46371 -44622 -26315 -20172 -15518 -28985 -63849 -49065 -20005 18462 15664 30086 49459
10697 49459 30178 26309 22249 -2662 -26473 -32395 17249 25115 2999 -7797 -21973 -1509
10685 -1509 12311 -8806 -18748 14285 7304 -14321 -31522 -29718 -35986 -16426 -13758 -1486 21053
10672 21053 49267 36160 1892 27502 46479 28712 19983 22227 17480 -14424 -21811 -24314 2931
10659 2931 41010 25136 8717 -18973 -6944 -3172 -4253 -49904 -53360 -39604 -24111 -3184
10647 -3184 16888 5386 -52776 -52365 -17905 -1288 -13614 -17283 -30859 -66362 -54607 -21814
10635 -21814 36016 19615 4648 12073 4606 1690 -1715 -9060 128 -1728 -25520 -65848 -80958
10622 -80958 -75539 -23246 -41005 -84903 -105359 -111581 -114838 -104358 -80017 -55342 -34724 -18472
10610 -18472 -61 6537 -12531 -23456 5857 28741 38420 28357 -8540 -52247 -52566 -8755
10598 -8755 15043 7592 14199 24564 35182 -22229 -4502 1060 30654 21217 -20981 -14032 36110
10585 36110 39298 -32933 -32365 11290 11541 6359 49793 86827 60010 8667 -5264 12906 -8101
10572 -8101 -2749 44064 71797 44777 46501 20701 24365 -546 2607 9057 15903 45621 38517
10559 38517 -4167 5461 30003 2835 42126 97325 144786 122406 82936 73591 68481 54038
10547 54038 45287 16959 -15962 -31247 19661 60057 105881 66956 53993 55790 57150 42628
10535 42628 11465 17554 26872 31495 26578 32803 15849 -4259 692 45158 44972 27232 -8936
10522 -8936 -11123 4944 -2891 7086 7027 7788 -8847 -3743 -33604 -46002 -26796 12827 -6714 1504
10508 1504 286 -6497 -1285 3437 9663 28483 22457 -19108 -52308 5480 11952 -5588 914
10495 914 12613 13924 2863 -52109 -63107 -48183 -10681 778 -16380 -7133 14113 23112 -8723
10482 -8723 818 13783 9338 1621 -26606 7530 44428 42259 8845 -1247 -13608 -2056 7708
10469 7708 42044 61068 57335 28725 6237 -20805 -32396 -35134 -65134 -56495 -51072 -48304 18949
10456 18949 58804 40541 33470 69054 80581 62136 19739 -15562 11810 4497 26259 72643
10444 72643 48627 12432 -12426 -18370 10185 -2411 -7943 13443 24337 -2731 -11585 -24642
10432 -24642 -27567 -5945 -8885 -43466 -58106 -54956 -50504 -56854 -41999 -47966 -56577 -40443 -4123
10419 -4123 -23801 -41055 -37870 -21750 9518 680 10320 5044 -23327 -11775 -2595 36630 19827
10406 19827 16145 43979 48528 3524 15258 54337 73897 40173 22419 5797 1081 -15843
10394 -15843 -20216 -45228 -44931 -4793 15956 37989 31700 4457 -24959 -35231 -19300 -16981 -19978
10381 -19978 -4088 -24845 -11444 -28833 -19938 17939 -15780 -54640 -47133 -29690 -25385 4495
10369 4495 1892 12250 36068 68746 68569 46591 36304 13188 14430 12333 14187 15343 70450
10356 70450 60064 33804 20768 8136 -25301 -44389 -43625 -41360 -14469 50737 63294 37449
10344 37449 2496 27736 33992 14185 -21594 -31505 15909 26340 -9310 -23797 -17555 -7223
10332 -7223 -13816 -32544 -43235 -42012 -42186 -41570 -20548 -9846 -15822 -44286 -24556 7397 49549
10319 49549 34063 10169 -9373 6600 33225 -6890 -40522 -14250 12060 -3855 -11054 42561
10307 42561 66616 75989 40989 28260 33157 46016 49020 39914 16793 18210 -20197 -53093 -65996
10294 -65996 -64975 -17858 -24752 -12719 -7149 -18730 19769 21479 17321 4493 37734 56565 4421
10281 4421 -4846 -11413 -9473 -21917 -23603 -47414 -57409 -10480 48855 67008 87908 45780 12777
10268 12777 -23600 -10942 27548 12212 14532 40196 57432 39981 15472 6994 27513 27505 -3845
10255 -3845 -29464 -35268 -1739 -24935 -28894 -37176 -18877 1272 16489 46759 44860 29252 1443
10242 1443 26178 20923 6091 -1455 34436 45718 11272 14622 21632 6987 10758 57183 34082
10229 34082 19189 -15016 -18891 -22099 -33933 -45695 -20815 -320 2316 25812 35446 22005
10217 22005 -14279 -39943 -20531 -20261 -29939 -21564 -3255 -24900 -28703 -46669 -56766 -41489 353
10204 353 19837 13408 -6052 -6112 12280 5944 -25685 -60007 -64910 -64894 -39593 -47081 -62767 -50850
10190 -50850 -37144 48035 60775 771 -39350 -32403 -31676 -22310 -50143 -39355 -44898 -39705 -35238
10177 -35238 -682 10562 2168 -26968 -45862 -39825 -3558 -28951 -46551 -47475 -6773 16771
10165 16771 -6458 -4809 -24766 -38967 -70446 -68560 -68732 -17399 19011 15642 32285 61252 65728
10152 65728 55856 67860 41579 33430 8417 -11908 -39824 -55188 -59903 -36100 13280 41641
10140 41641 25290 -17922 -42259 -64491 -59971 -58430 -52762 -3210 20479 42026 65068 32632
10128 32632 13686 40432 28113 33821 26796 1189 -25335 -36178 -43414 -16578 -5277 7932
10116 7932 11963 8624 22845 57301 40121 35126 47628 87892 103986 76364 62870 95082
10104 95082 76025 2474 -66439 -80516 -72917 -43966 -65710 -47919 -26541 -23310 -31660 -14319
10092 -14319 12969 14873 5730 -19490 -58895 -75091 -11293 30079 36230 29180 24232 -21339 -23011
10079 -23011 -18182 -706 24151 34509 15230 28376 23330 42076 57692 67468 80264 55348
10067 55348 23536 33550 37487 17569 -10724 -69723 -82139 -72706 -47086 -12016 2081 34823
10055 34823 17202 19925 35241 99609 133740 183270 178037 139570 111600 90151 18896 -27355
10043 -27355 -27191 -7417 -16812 -41118 -48276 -42286 -34071 -44281 -39316 -6651 8842 32696 -1140
10030 -1140 -58525 -66779 -67021 -7531 49376 57546 24616 13669 -1656 -24694 -51647 -40529 -10480
10017 -10480 40853 58719 25824 -2689 6033 24428 52363 93028 106772 82513 77283 37748
10005 37748 -21446 -56331 -49528 -37217 -54577 -26384 -895 -6866 11897 -9860 -7408 -93
9993 -93 16911 45769 49990 65713 59758 21959 -3131 9495 18863 10870 -17798 -25383 506
9980 506 26875 39218 26858 -5181 8491 1537 3406 14516 31735 29210 43802 46344 31325
9967 31325 43768 57409 62512 75716 48996 57997 49426 57854 32926 4524 30630 57329 77466
9954 77466 63267 24974 22735 34317 47603 49038 23663 22396 35633 78863 167617 267536
9942 267536 415434 582162 676328 592117 438638 324685 230455 173051 125122 87093 92694
9931 92694 90173 92503 84810 112227 110978 61398 75516 55098 6790 29604 87775 41515 -15065
9918 -15065 -70674 -67294 -50060 -61663 -61314 -55614 -76012 -62111 -50296 -40903 -52816 -43061 -30754
9905 -30754 -21723 -18590 -363 31822 42994 46356 15560 -4456 34886 37371 43492 33558 28889
9892 28889 68364 88743 81814 36813 25527 35675 24246 4841 13933 -10181 -21391 -19730
9880 -19730 -46088 -38062 3996 14002 -9928 -13424 -10262 184 47793 26688 -19333 -14751 -13933
9867 -13933 -6347 1206 -20163 -24780 -46341 -54747 -60061 -57911 -47634 -44513 -31831 -16195 4644
9854 4644 43977 74842 136062 181147 156522 78955 50735 55711 42802 51284 60909 61425 49328
9841 49328 33173 28066 21457 5745 34979 1132 -25542 -24214 31 36589 66756 69238 39729
9828 39729 5466 2316 15905 19521 16635 54897 65612 59802 46804 11044 -2188 -5415 -34272
9815 -34272 -34787 -9441 9259 -7577 -16218 46235 23229 -12601 -23141 9579 8040 13658 -12720
9802 -12720 -20975 912 -2847 17431 22242 38665 38606 17729 48462 66722 56556 21770 4068
9789 4068 -14730 -12836 -1731 38033 37506 23858 1396 -4030 -15388 13549 43033 15973 -2286
9776 -2286 -5512 23891 46788 13862 1461 7040 -32676 -62263 -59917 15394 51436 50745 27723
9763 27723 5987 9771 54620 52942 42641 40991 78080 83494 46775 9688 14689 55371 83995
9750 83995 78645 71540 68522 35607 20290 27585 42498 42167 16755 24689 22190 59782 43344
9737 43344 33694 32812 32401 28537 16818 18672 50215 62865 19249 -3270 35688 64884 80858
9724 80858 82777 55825 47185 26853 -4088 -59248 -47633 -53086 -34202 -53043 -55335 -47481 -18783
9711 -18783 18321 3604 -16987 -2316 17503 50238 74385 51384 27745 -6746 -28111 -19609
9699 -19609 -32930 3525 12476 -21806 -26991 -28428 7211 25474 36211 42056 43230 51826 33699
9686 33699 42846 35165 23198 22923 27767 37656 58706 48722 13559 27607 35584 2036 -31490
9673 -31490 10775 23128 41415 26475 3777 -34790 -11473 15546 -7400 -12921 23743 16256
9661 16256 1519 -1025 21605 10886 32081 70848 75429 36121 33610 38349 60812 92086 100255
9648 100255 81306 54607 13058 -2759 19804 -19380 -44474 -12805 -22225 -20186 774 -2666
9636 -2666 13972 26824 33527 38011 30680 35753 17052 7484 26429 34166 43111 74836 128367
9623 128367 135305 135387 124057 58256 82789 84807 75470 98062 97605 85976 45789 46501 49899 69887
9609 69887 42829 42687 58306 44042 16892 10394 10461 19701 32796 31469 34868 47132 52148 69512
9595 69512 95929 59568 24333 45652 25616 37245 64061 84037 80593 86260 90779 105433
9583 105433 121541 109397 66806 48407 40688 31136 40990 76062 84853 89437 84605 24761 14389
9570 14389 47235 70999 76690 69399 78308 87521 70750 62105 62698 61607 44548 21389 43529
9557 43529 62241 31691 45357 35534 31107 54575 58339 101929 99110 80585 50753 60886 125438
9544 125438 141229 127565 132980 115095 84778 96451 105315 116740 122633 86109 76852 100682
9532 100682 103343 102900 96475 115986 142300 135920 68953 33001 54489 69014 69527 51759 71893
9519 71893 58493 62672 81717 69726 101622 99803 78057 75543 61207 41552 32795 55260 82399
9506 82399 100657 132367 141839 133601 117242 111245 117242 123344 90042 99776 111755 107968 127116
9493 127116 144258 158888 203417 210929 214337 202799 181072 142219 142007 103453 101589 144347 195700
9480 195700 187055 147111 111597 125392 121626 138228 131135 117975 133662 155054 138999 140569
9468 140569 146600 152146 141839 128665 145060 157875 133298 132034 129136 110228 107568 144338 188244
9455 188244 162531 196736 223688 225619 233495 211856 201184 213172 229470 228226 210636 198941
9443 198941 150784 158142 216928 244045 200251 201492 213152 211231 177889 204340 209415 234899
9431 234899 227743 219508 228791 288582 311710 294618 316048 305184 294802 322592 328593 325981 333042
9418 333042 322095 307296 341709 352512 343225 317119 346370 335937 350678 349040 331146 345027
9406 345027 329903 350213 385170 414024 369310 368830 383100 386248 431630 452287 481459 483508
9394 483508 456355 464442 490717 504951 466647 475871 525219 537617 546521 565964 560567 556860 583854
9381 583854 610947 629899 626651 597350 602382 656232 653736 639852 659061 677148 661386 650882
9369 650882 695393 726124 742029 772809 803653 823071 833561 812467 868720 924940 968811 991247
9357 991247 998852 1005283 1025047 1022081 1024133 1063763 1089511 1117530 1141054 1189090 1231985 1285167
9345 1285167 1308464 1315348 1342027 1390786 1399632 1418627 1449484 1500407 1528548 1571220 1564084 1564676
9333 1564676 1597673 1624539 1674668 1700442 1740481 1791036 1798221 1800385 1827626 1873897 1925371 1923703
9321 1923703 1961227 1985490 2041835 2043676 2051934 2031425 1999400 2015392 1995154 2002489 2001631 2028700
9309 2028700 2058922 2048221 2032904 2023296 2015753 2031236 2001795 1944534 1894834 1881763 1902697 1876919
9297 1876919 1878765 1849574 1780333 1730323 1706917 1685005 1665606 1615021 1580885 1555574 1531795 1500210
9285 1500210 1506970 1466803 1420015 1388925 1335867 1281719 1250339 1204171 1170416 1163471 1128810 1130197
9273 1130197 1148007 1130465 1067153 1037480 1015826 986090 955617 943685 920978 875946 831895
9262 831895 833677 822527 804279 786356 784495 759713 752266 777722 779379 722038 664795 636312
9250 636312 640942 624990 616090 602455 587791 608083 610212 564725 551911 571761 574065 561018
9238 561018 563504 568483 510563 454673 414768 447339 450373 450224 453404 399375 413612 439679 416224
9225 416224 382182 363708 360451 384330 394784 384491 397800 401681 404429 398862 355546 341588
9213 341588 322527 299842 312093 330632 336254 352454 355112 316475 289635 260884 220407 214246
9201 214246 209610 245782 256885 247168 250627 253597 211433 193001 214403 219662 202087 179188 175405
9188 175405 166304 219185 246871 253998 218176 194582 190151 197608 181454 177316 213253 244771 233451
9175 233451 162493 137336 104578 113550 109921 146543 135753 127439 153288 180223 161535 134703
9163 134703 163159 159214 172115 173241 142051 109279 87654 106552 98827 123864 148902 167480
9151 167480 159050 149483 151962 150599 132384 109641 107971 94255 63923 53987 70267 76889 72897
9138 72897 92120 108600 80867 86311 132626 134287 102479 109256 96029 86741 92617 86741 40123
9125 40123 -7294 2132 41456 46260 73819 92578 87216 30312 30092 38060 72785 81749 91239
9112 91239 61305 57721 89338 126475 89948 64195 76138 93908 98367 52746 43657 89755
9100 89755 99526 66357 54075 50512 70348 76252 50054 34073 19417 44635 36122 26965 33681
$$ [...]
##END NTUPLES=NMR SPECTRUM
##END=
