##TITLE=Analysis number 328100
Compound Code btb 08722
Book Reference lab3
Project Code adrs
Chemist Name stores
##JCAMPDX= 6.0         $$ Bruker NMR JCAMP-DX V2.0
##DATA TYPE= NMR SPECTRUM
##DATA CLASS= NTUPLES
##ORIGIN= Bruker BioSpin GmbH
##OWNER= nmr
$$ XWIN-NMR		Version 3.5
$$ Wed May  2 12:02:49 2007 GMT Daylight Time (UT+1h)  MAYBRIDGE\nmr@NMR_250MHZ
##.OBSERVE FREQUENCY= 250.131544655141
##.OBSERVE NUCLEUS= ^1H
##.ACQUISITION MODE= SIMULTANEOUS (DQD)
##.ACQUISITION SCHEME= undefined
##.AVERAGES= 16
##.DIGITISER RES= 18
##SPECTROMETER/DATA SYSTEM= dpx250
##.PULSE SEQUENCE= zg30
##.SOLVENT NAME= DMSO
##.SHIFT REFERENCE= (INTERNAL, DMSO, 0, 16.522)
##AUDIT TRAIL= $$ (NUMBER, WHEN, WHO, WHERE, WHAT)
$$ ##TITLE= Audit trail, XWIN-NMR		Version 3.5
$$ ##JCAMPDX= 5.01
$$ ##ORIGIN= Bruker BioSpin GmbH
$$ ##OWNER= nmr
$$ C:\u/data/dgb/nmr/ADRS/240/pdata/1/auditp.txt
$$ ##AUDIT TRAIL=  $$ (NUMBER, WHEN, WHO, WHERE, WHAT)
(   1,<2007-05-02 12:02:28.94 +100>,<MAYBRIDGE\nmr>,<NMR_250MHZ>,
      <created by zg, POWCHK disabled, PULCHK disabled
       configuration hash MD5:
       76 6E 9A 78 1E 09 19 81 EC 84 63 8F B0 6A 59 2D
       data hash MD5: 64K
       CE FC 34 69 2A C7 25 78 C6 F5 38 9D F6 2B 50 E4>)
(   2,<2007-05-02 12:02:40.52 +100>,<MAYBRIDGE\nmr>,<NMR_250MHZ>,
      <Start of raw data processing
       ef LB = 0.3 FT_mod = 6 PKNL = 1 SI = 32K 
       data hash MD5: 32K
       5A 7F 21 48 49 75 A1 75 AA E0 3C 83 FE 19 1F 24>)
(   3,<2007-05-02 12:02:42.13 +100>,<MAYBRIDGE\nmr>,<NMR_250MHZ>,
      <apk 
       data hash MD5: 32K
       F6 2F BC 0D 1B 69 E0 1C 3F C6 7D D7 AD 71 90 8E>)
(   4,<2007-05-02 12:02:42.88 +100>,<MAYBRIDGE\nmr>,<NMR_250MHZ>,
      <abs ABSG = 5 
       data hash MD5: 32K
       D8 DC 0D E7 EE 1E 6B 4A 97 17 7C F0 C9 82 D5 2B>)
$$ ##END=
$$ 
$$ hash MD5
$$ 01 45 0C 13 65 7C 89 50 82 2E 9B 62 10 38 4F 63
##$RELAX= 
##$RELAX= 
##$RELAX= 
##$RELAX= 
##$RELAX= 
##$RELAX= 
##$RELAX= 
$$ Bruker specific parameters
$$ --------------------------
##$DU= <C:\u>
##$EXPNO= 240
##$NAME= <ADRS>
##$PROCNO= 1
##$TYPE= <nmr>
##$USER= <dgb>
##$AMP= (0..31)
100 100 100 100 100 100 100 100 100 100 100 100 100 100 100 100 100 100 
100 100 100 100 100 100 100 100 100 100 100 100 100 100 
##$AQSEQ= 0
##$AQ_mod= 3
##$AUNM= <au_zg>
##$AUTOPOS= <20 >
##$BF1= 250.13
##$BF2= 250.13
##$BF3= 250.13
##$BF4= 250.13
##$BF5= 500.13
##$BF6= 500.13
##$BF7= 500.13
##$BF8= 500.13
##$BYTORDA= 1
##$CFDGTYP= 0
##$CFRGTYP= 5
##$CHEMSTR= <none>
##$CNST= (0..31)
1 1 145 1 1 1 1 1 1 1 1 1 1 1 1 1 1 1 1 1 1 1 1 1 1 1 1 1 1 1 1 1 
##$CPDPRG= <>
##$CPDPRG1= <>
##$CPDPRG2= <>
##$CPDPRG3= <>
##$CPDPRG4= <mlev>
##$CPDPRG5= <mlev>
##$CPDPRG6= <mlev>
##$CPDPRG7= <mlev>
##$CPDPRG8= <mlev>
##$CPDPRGB= <>
##$CPDPRGT= <>
##$D= (0..31)
0 1 0 0 0 0 0 0 0 0.06 0 0 0 0 0 0 0.0002 0 0 0 0 0 0 0 0 0 0 0 0 0 0 
0 
##$DATE= 1178103748
##$DBL= (0..7)
120 120 120 120 120 120 120 120 
##$DBP= (0..7)
150 150 150 150 150 150 150 150 
##$DBP07= 0
##$DBPNAM0= <>
##$DBPNAM1= <>
$$ [...]
##$SUBNAM7= <"">
##$SUBNAM8= <"">
##$SUBNAM9= <"">
##$SW= 20.6930455092707
##$SWIBOX= (0..15)
0 0 3 0 0 0 0 0 0 0 0 0 0 0 0 0 
##$SW_h= 5175.983436853
##$TD= 65536
##$TD0= 1
##$TE= 683.16
##$TE2= 300
##$TE3= 300
##$TEG= 300
##$TL= (0..7)
0 120 120 120 120 120 120 120 
##$TP= (0..7)
150 150 150 150 150 150 150 150 
##$TP07= 0
##$TPNAME0= <>
##$TPNAME1= <>
##$TPNAME2= <>
##$TPNAME3= <>
##$TPNAME4= <>
##$TPNAME5= <>
##$TPNAME6= <>
##$TPNAME7= <>
##$TPOAL= (0..7)
0.5 0.5 0.5 0.5 0.5 0.5 0.5 0.5 
##$TPOFFS= (0..7)
0 0 0 0 0 0 0 0 
##$TUNHIN= 0
##$TUNHOUT= 0
##$TUNXOUT= 0
##$USERA1= <user>
##$USERA2= <user>
##$USERA3= <user>
##$USERA4= <user>
##$USERA5= <user>
##$V9= 5
##$VALIST= <valist>
##$VCLIST= <CCCCCCCCCCCCCCC>
##$VD= 0
##$VDLIST= <DDDDDDDDDDDDDDD>
##$VPLIST= <PPPPPPPPPPPPPPP>
##$VTLIST= <TTTTTTTTTTTTTTT>
##$WBST= 1024
##$WBSW= 4
##$XGAIN= (0..3)
0 0 0 0 
##$XL= 0
##$YL= 0
##$YMAX_a= 384893
##$YMIN_a= -277936
##$ZGOPTNS= <>
##$ZL1= 120
##$ZL2= 120
##$ZL3= 120
##$ZL4= 120
##$ABSF1= 16.522
##$ABSF2= -4.171173
##$ABSG= 5
##$ABSL= 3
##$ALPHA= 0
##$AQORDER= 0
##$ASSFAC= 0
##$ASSFACI= 0
##$ASSFACX= 0
##$ASSWID= 0
##$AUNMP= <proc_1d>
##$AZFE= 0.1
##$AZFW= 0.1
##$BCFW= 0
##$BC_mod= 0
##$BYTORDP= 0
##$COROFFS= 0
##$CY= 12.5
##$DATMOD= 1
##$DC= 0
##$DFILT= <>
##$DTYPP= 0
##$F1P= 14.0000005364418
##$F2P= -0.99999901652339
##$FCOR= 0.5
##$FTSIZE= 32768
##$FT_mod= 6
##$GAMMA= 0
##$GB= 0
##$INTBC= 1
##$INTSCL= 1
##$ISEN= 128
##$LB= 0.3
##$LEV0= 0
##$LPBIN= 0
##$MAXI= 10000
##$MC2= 0
##$MEAN= 0
##$ME_mod= 0
##$MI= 0
##$NCOEF= 0
##$NC_proc= -5
##$NLEV= 6
##$NOISF1= 0
##$NOISF2= 0
##$NSP= 0
##$NTH_PI= 0
##$NZP= 0
##$OFFSET= 16.522
##$PC= 1
##$PHC0= -66.73331
##$PHC1= 14.54824
##$PH_mod= 1
##$PKNL= yes
##$PPARMOD= 0
##$PSCAL= 4
##$PSIGN= 0
##$REVERSE= no
##$SF= 250.13
##$SI= 32768
##$SIGF1= 0
##$SIGF2= 0
##$SINO= 400
##$SIOLD= 32768
##$SREGLST= <1H.DMSO>
##$SSB= 0
##$STSI= 32768
##$STSR= 0
##$SW_p= 5175.98343685301
##$SYMM= 0
##$S_DEV= 0
##$TDeff= 65536
##$TDoff= 0
##$TI= <Analysis number 999999
Compound Code 99
Book Reference 9
Project Code 9>
##$TILT= no
##$TM1= 0
##$TM2= 0
##$TOPLEV= 0
##$USERP1= <user>
##$USERP2= <user>
##$USERP3= <user>
##$USERP4= <user>
##$USERP5= <user>
##$WDW= 1
##$XDIM= 32768
##$YMAX_p= 424961220
##$YMIN_p= -574265
$$ End of Bruker specific parameters
$$ ---------------------------------
##NTUPLES= NMR SPECTRUM
##VAR_NAME=  FREQUENCY,     SPECTRUM/REAL,   SPECTRUM/IMAG
##SYMBOL=    X,             R,               I
##VAR_TYPE=  INDEPENDENT,   DEPENDENT,       DEPENDENT
##VAR_FORM=  AFFN,          ASDF,            ASDF
##VAR_DIM=   32768,         32768,           32768
##UNITS=     HZ,            ARBITRARY UNITS, ARBITRARY UNITS
##FACTOR=    0.157963299565203, 1,           1
##FIRST=     4132.6476996994, 0,             0
##LAST=      -1043.33573715361, 0,           0
##MIN=       -1043.33573715361, -574265,     0
##MAX=       4132.6476996994, 424961220,     0
$$ Real data points
##PAGE= N=1
##DATA TABLE= (X++(R..R)), XYDATA
$$ [...]
23688A20560q2061k2257r2017K0309J38546K059J5446P3956K31j47766n4998k8648
23676e6640l3283L8540J4213L6639K7316Q2923M6464J19246j35198q4181M5105
23665A01144j40825p3746N910N106N4244O7747J04587J5589j62242p8330o983
23654a07799n3019L6209J025r6727m9796R1589N1045O4846R1905L9955k7347N3157
23642I5043l0113M951M877P400N3065j33355p3299K6704p3160j21097j2719K37091
23630a4612P7269n4080n9961n1284j21746q5491P2515J23621P8824J02261O254
23619G3570J4304Q2380o6587n2017m7986q111L6298Q5960k0377k6037O8227O2696
23607B02320q2457m68N8845l1261j3448j00150n43L0241m2054M8183K5843M1640
$$ y = [120560, 38499, 16242, -75775, -55466, 83080, 85139, 100585, 174541, 174772, 27006, -27992, -56640, -89923, -51383, -37170, -531, 26785, 109708, 156172, 275418, 140220, 56039, 101144, -39681, -113427, -107517, -102411, -48167, 19580, 124167, 139756, -22486, -100816, -107799, -160818, -124609, -123584, -220311, -270107, -178518, -127473, -62627, 29278, 69233, 41886, 95043, 64930, 69881, 74758, 82158, 135223, 1868, -71431, -44727, -117887, -238984, -251703, -14612, 62657, 8577, -51384, -102668, -224414, -309905, -237390, -113769, -34945, 67316, 73570, 87874, 170254, 103667, 51650, 3664, -4447, 31851, 117811, 97434, 71397, 139624, 202320, 119863, 119395, 178240, 146979, 133531, 33381, 32838, 63079, 21025, 69208, 95051, 136691]
23595A36691m4944j22366j6935J4056P54J6998Q3073N8980j18767J02176N9696
23584A69412r995q321J9906o0046p9738m0985J3831R1574K267o1253M7153j9081
23572F4724q7277o3607J334N9505L3540N3755q4k5928L6283K2155j5275j01174
23560b2049R376O7284j9735K5480p8670r6329J7731l1527m2080J7456P4268M8796
23548b9999J7390j7748j4086Q6646O8135q9653j46345o0190L7886K9090N8419
23537f0455R7640R4793k1369P7918P8893n5498j04418n5039r7494M2169Q5994
23526H3134P9039l2191p2213J5235j47402r4584K7684m1832R1007J77003j6911
23515F7969j11172N0570J38329o2829j08561k9036P315L4301J5403M6931O3225
$$ y = [136691, 91747, -30619, -47554, -33498, -32744, -15746, 67327, 126307, 7540, 109716, 169412, 159417, 151096, 171002, 110956, 31218, -9767, 4064, 95638, 97905, 36652, 83805, 64724, -22553, -86160, -84826, -25321, 8219, 61974, 61890, 35962, 72245, 94400, 79125, -22049, -12673, 54611, 34876, 60356, -18314, -114643, -96912, -128439, -170519, -153063, -78795, -29999, -12609, -30357, -44443, 42203, 110338, 20685, -125660, -185850, -147964, -118874, -60455, 37185, 131978, 110609, 188527, 267420, 211922, 107504, 52465, -45029, -2860, 83134, 162173, 129982, 57769, 73004, -74398, -168982, -141298, -183130, -92123, 84880, 67969, -43203, 7367, 145696, 82867, -25694, -54730, -47415, -13114, 2289, 49220, 112445]
23504A12445j7224j60318J606n4578N3154O0613J766R278Q5747m4884k7563K829
23492B2871r8914m608l994o4812L6896P4238O1420l0811k8264r0261o1061N2156
23480a35144j9139R3011J18580q9118j9161j442j05058J7096R319J19134l405
23469a5327l202k2359P3135K05490k7816k45196j23297J02686Q6895r943L1629
23458E2695Q8912j7363k7931m9819j29887r650J31899L2882p8159o0786P5150
23447G943k7140j2178L5671j2056j9235K4172r001j27698o388q3429j7015J59431
23435h6923O8620Q3729k3331L2174o4500o9453l6948K0946J40265O3077q6996
23424D0660N1556O2248J3260n1003j09241L3761m1711l4624m3839q8027J07254
$$ y = [112445, 95221, -65097, -63491, -118069, -64915, -4302, -2536, 6742, 92489, 47605, 20042, 22871, -76043, -80651, -84645, -149457, -112561, -38323, 23097, -7714, -35978, -126239, -187300, -135144, -154283, -61272, 57308, -31810, -50971, -52413, -157471, -140375, -131056, -11922, -15327, -18529, -40888, 32247, 237737, 209921, -35275, -158572, -55886, 31009, 21066, 52695, 141607, 124244, 96313, 46494, -83393, -93043, 38856, 71738, -6421, -67207, 7943, -19197, -31375, 4296, -7760, -26995, -2823, -11824, -139522, -145910, -229339, -246354, -86923, -18303, 65426, 42095, 74269, 9769, -59684, -96632, -75686, 64579, 127656, 40660, 92216, 154464, 167724, 116721, 7480, 41241, -470, -35094, -78933, -166960, -59706]
23413e9706J129p8028r8578N8393m42Q5457J33059j0257j09681n5098M3550K0807
23401f9395J9785K9260m0765n9647j1432j03200J3899J5421N8448Q6295r7600
23390a58931J64415N2670o3882q7896K3464l8869n6334L64j8965K10974R0537
23379A17547q1783K5812M3614n302m5941o5660l1083l5885n2173j40153Q6869
23368a84138N0116k0506M854K9121R5505J0353J12046O3852K4098R566k4597K8119
23356A98389m2445q7116o1712l0587L4131j1037L1850O8674R728L9880k3891m0395
23344H5469K559o2083k960k6780k4433K7190n5705p7525R448P4818m5255q2637
23332a77894L4805J75337k8425p6852j07619k7084O9406N3267r0889L2248P4231
$$ y = [-59706, -58577, -136605, -235183, -176790, -177232, -91775, 41284, 31027, -78654, -133752, -90202, -69395, -49610, -20350, -61115, -120762, -132194, -235394, -221495, -206074, -147626, -61331, -158931, 5484, 58154, -5728, -93624, -70160, -109029, -165363, -164999, -183964, 27010, 117547, 35764, 61576, 105190, 99888, 53947, -11713, -42796, -78681, -130854, -271007, -184138, -134022, -154528, -149674, -120553, -25048, -14695, 97351, 161203, 185301, 194867, 170270, 198389, 155944, 68828, 7116, -23471, 10660, -377, 31473, 100147, 109875, 149755, 125864, 85469, 88028, 25945, 22985, -3795, -28228, -1038, -56743, -134268, -124820, -50002, -95257, -177894, -143089, 32248, 3823, -73029, -180648, -207732, -138326, -85059, -175948, -143700, -69469]
23321f9469M8568L2533J4077O271J2081M7780r6713m6367M685o5387N780p8813
23309a84974p381P1843P0963K0202J41982M1950r4180r7509K8348k9509m2857
23298h1122r573J10568J26365o7284j75144m4188L8142q5773p159J0820n4167
23287b38515J07446J80781R8402K3160p1491p3522O394L7539P4101p569k1781
23276A14945m1642O048q692r6347j08351N3885M9340k0773M3938o7955k8527K8411
23264g5720o7931j2150R7294J23661L132K1697l6367m4151j51574r9571R4320
23253a47360N0704j12000m3761P8732M4371l0972R437L1673N1450o7034O7626
23242f7134L3205m8633j2636O2868P3918J32990K609l4711j15079o9612l0470
$$ y = [-69469, -20901, 11632, 25709, 31980, 44061, 91841, -4872, -51239, -46554, -111941, -106161, -184974, -192355, -120512, -49549, -29347, 112635, 154585, 60405, -37104, -8756, -38265, -81122, -90695, 19873, 146238, 78954, -96190, -140378, -102236, -188009, -195168, -184348, -238515, -131069, 49712, 148114, 171274, 99783, 26261, 32655, 70194, 144295, 136726, 114945, 73303, 79351, 70659, -25688, -134039, -80154, -30814, -51587, -7649, -75604, -104131, -75720, -143651, -155801, -58507, 65154, 68286, 89983, 53616, 9465, -142109, -241680, -147360, -96656, -208656, -252417, -173685, -129314, -160286, -150849, -119176, -67726, -134760, -67134, -33929, -82562, -95198, -32330, 41588, 174578, 177187, 142476, 27397, -42215, -72685]
23231g2685K335k3356K5339J6705L6762P2815M3770O2986R2087p0442p9502j03641
23219C173k5592K4355K4815n9112M8299k2870j13058n1162J34451N1208o9105
23208e4598j4813j22749Q6500J16890L695L2994l575j06904q3420R0097K4852
23197c1031Q194M035m0773N9945O0436j02332m2399M6389M6746P5967J5375K380
23185A02932r7256r740K8982r7846n4914O764j3162R831j23189o829O7044J0665
23173a76718Q2684K9017K9223Q622m4107j07556O4808J7246J6783N1523p2682
23162a01157J5621O1646o3061J7953J46841L0071n8281j05685q0492j17217Q0100
23151a73661N0216M8778k6711Q7916M9881k8699q6848j09867L9527J0459O7720
$$ y = [-72685, -70350, -93706, -68367, -51662, -14900, 57915, 101685, 164671, 256758, 186316, 106814, 3173, -22419, 1936, 26751, -32361, 15938, -6932, -119990, -171152, -36701, 14507, -54598, -69411, -192160, -105660, 11230, 14925, 47919, 44344, -62560, -145980, -55883, -31031, -22837, -18802, -59575, 370, 60806, -41526, -83925, -37536, 9210, 85177, 100552, 102932, 5676, -4064, 24918, -72928, -127842, -121078, -134240, -124409, -247598, -254427, -187383, -176718, -94034, -65017, -35794, -27172, -71279, -178835, -114027, -96781, -79998, -28475, -101157, -85536, -23890, -86951, -68998, 77843, 107914, 49633, -56052, -136544, -253761, -173661, -123445, -74667, -101378, -13462, 36419, 7720, -79128, -188995, -149468, -139009, -71289]
23140g1289J35088p3267j29346q015k5442L8054J87704M9107m4833N81n1896m7901
23128d1455J22890J8084l2191J5629o1341j29700K8603N9289n7304k4777J01177
23117a096O7410k3985q3553k9280K9350P1637P8066Q1870L0417j1024n6406n9041
23105I4365k5558r3223j90740L5876Q0938M6641J04564j5878m7231R3558P957
23094I1269j46626o6191M7342P2407k3749M8338J9031m7442j02382J04412M2150
23083C8559R370M2465j1791J8035j4575q2247l7781k9297J26899j1222q9956m2502
23071h4043m9899L6933j12089k9789J24800J24323K6493Q8105o2023j64125j64017
23060b65331K4789M9879r612Q9177N5281K2854q1197k1659J1207m9289o0027q3291
$$ y = [-71289, 63799, -9468, -138814, -146829, -172271, -134217, 53487, 102594, 57761, 58342, 6446, -41455, 81435, 99519, 67328, 82957, 21616, -108084, -79481, -20192, -77496, -102273, -1096, 66314, 42329, -41224, -70504, -41154, 30483, 108549, 190419, 220836, 209812, 153406, 94365, 68807, -24416, -215156, -179280, -98342, -51701, 52863, 36985, -10246, 83312, 91269, -55357, -121548, -74206, -1799, -25548, 22790, 41821, -5621, -108003, -3591, 38559, 47929, 90394, 78603, 96638, 82063, -184, -37965, -67262, 59637, 48415, -41541, -84043, -133942, -97009, -209098, -238887, -114087, 10236, 36729, 124834, 62811, -101314, -265331, -240542, -190663, -200275, -111098, -55817, -32963, -114160, -135819, -124612, -173901, -233928, -317219]
23048c17219K6284J63091J04171j16773j11488N7123K9760q9395J14943J15824
23038b3679J3844n957j517L3351j04589k3549Q5520L6676o6507j37478j95799
23027c89684R4531J14674N5797J8096j4917p1651o720J9030M3872M0755J15546
23016A9329n8297M9453p3504o8806M6909J5283q309N7378J5185n6740r9839L4396
23004a27562L4508q574k1234j2860p0613n7192L0408k4842o7692L9609J68838
22993a17206J4102M3359L4213q2958m1555j5707k7689P3402P1313J7211N7395
22982B5880J02599M2102J98M8439J3649j2159k2089o7237p1634n6880N6015J8043
22970G6926j31256j12990J22551J02160o5012R2347Q8789j9598n5480k1304Q4609
$$ y = [-317219, -290935, -127844, -23673, -140446, -251934, -194811, -165051, -254446, -139503, -23679, -9835, -15792, -17309, 16042, -88547, -112096, -26576, 10100, -56407, -193885, -389684, -295153, -180479, -124682, -106586, -121503, -193154, -199874, -180844, -136972, -96217, 19329, -38968, 10485, -63019, -131825, -84916, -69633, -77942, -20564, -5379, -62119, -161958, -127562, -93054, -101628, -122862, -135722, -206335, -263527, -233119, -257961, -325653, -286044, -117206, -103104, -59745, -25532, -108490, -150045, -165752, -193441, -120039, -48726, -31515, 25880, 128479, 170581, 170779, 219218, 232867, 220708, 198619, 131382, 59748, 2868, 58883, 76926, -54330, -167320, -44769, 57391, -7621, 84726, 173515, 153917, 98437, 77133, 161742]
22959A61742q3954K9349l7995j9850L2892j08028j80243P4441J07234r5095r3895
22948b13402J19865M6842L6329k988l8012O431K3305J8803p8135p953P7105J5126
22936C316j28394n401L2697R9697Q3834n3683J4434R7948M5760j01681q6231k8950
22924b6654j243p2914o9355Q160J35697O9808m0942O2678J4699J2476p3293p4394
22912e5277k8212L5476R0260J34057J5051r2522O742m94p8468M5907j43624m7261
22900a18365J40167K09866j7574l913p1730m5829J7623p9953j48742J2532O5122
22889d0796l194P4721J35366r2795j36828P607L1017P5780N2397L4946o1432k6642
22877E0147o9543o6403O4294j9759r1881p1337n4866l0265m6702O2888K28024
$$ y = [161742, 77788, 107137, 69142, 49292, 82184, -25844, -206087, -131646, -24412, -119507, -213402, -93537, -46695, -10366, -13354, -51366, -44935, -21630, -2827, -80962, -88915, -11810, 3316, -125078, -130479, -97782, 1915, 85749, 32066, 46500, 144448, 190208, 88527, 2296, -26654, -27897, -100811, -170166, -162006, -26309, 43499, 2557, 65235, 79934, 92410, 19117, -55277, -83489, -48013, 42247, 176304, 191355, 98833, 105575, 105081, 26613, 72520, -71104, -118365, 21802, 231668, 214094, 210181, 138451, 92622, 110245, 30292, -118450, -105918, -40796, -43990, 30731, 166097, 73302, -63526, -55919, -24902, 50878, 103275, 138221, 76789, 50147, -19396, -85799, -21505, -41264, -133145, -204482, -259348, -289613, -336315, -273427, -45403]
22866d5403J76722n3776l7953J2419M2230r7699j87131j3482J72382J03026o2045
22855I290m3553K8908J76388m8278j8536m9801Q68J6109q9343p2061P9410Q646
22843a953j4546K269J035n2673k5323m3092R586N6213O1732J2556o694k7712K3502
22830e100r8137j5457O0282k3453q9691K7727k0713Q0486M9281J18087J5258k506
22818I6064M4625n3090j56501r1472r0691R3560k0244M4625J37546Q616n4804
22807d1766q3115J19813O3382K4938O3466m6770r1686K0572O1044Q1260j62162
22796H976j44990k7888m1744n1544O7624M0932P7231r578M1042Q1484r204P6028
22784A08369j04660j07321J9016k5631m2101j38150l594j8699K9945K24885O8531
$$ y = [-45403, 131319, 77543, 39590, 52009, 94239, -3460, -190591, -204073, -31691, 71335, 9290, -34263, -5355, 171033, 122755, 104219, 54418, 55286, 71395, -17948, -90009, -10599, -1953, -16499, -14230, -13195, -65868, -91191, -134283, -124697, -68484, -6752, 5804, -890, -28602, -5100, -103237, -118694, -58412, -81865, -171556, -143829, -164542, -84056, -34775, 83312, 98570, 96064, 140689, 87599, -68902, -160374, -251065, -157505, -177749, -133124, 4422, 13038, -41766, -124881, -5068, 58314, 83252, 146718, 99948, 8262, 28834, 89878, 171138, 8976, -136014, -163902, -205646, -257190, -189566, -148634, -71403, -80981, -39939, 41545, 32341, 108369, 3709, -103612, -84596, -110227, -152328, -290478, -294072, -312771, -282826, -57941, 10590]
22773A0590O162j3863j3918p0632j2869O3915j05335j5877j1409m4373K5653P0562
22761a11394J0415m5151o3074q8737J59170J10177r70p5600j35274K0301m861
22750b24998l0108Q8738O8607m7633r0187l4645J5377O1722J40371J09265j4083
22739D2426n6956o7719m561N9790J8623j7952P7118j1475L4089n238P317j36875
22727f1413j5812l4121J1792M1560k0641r6176j8757N0228K9787J39245q0130
22716e4438m1113R7678K5591L1557o4641o0196j3965M9597J18159K2130K638m6969
22704F6028j36863o0462O0272J37961k4136n2402M3104j03522k8021j3536r319
22693a20896L4230N9825J30205m4813m1436K4691l7550m2146n1871l5512k3967
$$ y = [10590, 16752, 2889, -11029, -81661, -94530, -30615, -135950, -151827, -163236, -207609, -181956, -111394, -100979, -146130, -209204, -297941, -138771, -28594, -29564, -105164, -240438, -220137, -224998, -255106, -166368, -97761, -145394, -235581, -270226, -254849, -193127, -52756, 56509, 42426, -14530, -82249, -86810, -27020, -8397, -26349, 50769, 39294, 73383, 68145, 75462, -61413, -77225, -111346, -99554, -57994, -78635, -174811, -193568, -143340, -113553, 25692, -54438, -95551, 2127, 27718, 59275, -5366, -65562, -79527, -29930, 88229, 110359, 112997, 66028, -70835, -131297, -71025, 66936, 42800, -9602, 33502, -70020, -98041, -111577, -120896, -86666, -26841, 103364, 58551, 17115, 41806, 4256, -37890, -89761, -125273, -149240]
22682a49240O457O7467n2903P9978N014N1199L0776m9683q6250n7488j3160o1220
22670b29053N3879L7584k4392L2021O5090R285R7790J01134p5368j17555m1222
22659i0807N7897J02572j11431j49949n1991Q0309K5301R560L5488P394L2791
22648e2866M1843o125j2503n1581K8315R606J07170L8666O1087j73146j94665
22637b04199k9450m971k832n953k9415O8301N4913J04674L8800j3951N4544J06050
22625A36511l7738M4149L1667r585q3279l2805J01488p7004k0779j25506l6058
22614a08939K76N458J31741L8847P3248J02747r4875o1600q3478m3653K0374J266
22602a8588j7668Q5030k6334k3372O2459j0370m9010l7006j1186p3507M485O4376
$$ y = [-149240, -142783, -75316, -128219, -48241, -43227, 7972, 38748, -10935, -97185, -154673, -167833, -229053, -175174, -137590, -161982, -129961, -64871, -55586, 42204, 143338, 67970, -49585, -90807, -32910, 69662, -41769, -191718, -243709, -163400, -138099, -128539, -93051, -85657, -52866, -11023, -17148, -29651, -81232, -52917, -43311, 63859, 102525, 163612, -9534, -204199, -233649, -238620, -241452, -247405, -276820, -208519, -153606, -48932, -10132, -24083, 30461, 136511, 98773, 142922, 174589, 165004, 81725, 48920, 150408, 73404, 52625, -72881, -108939, -108663, -103205, 28536, 67383, 140631, 243378, 148503, 86903, 3425, -40228, -19854, -18588, -36256, 48774, 22440, -932, 61527, 51157, 2147, -34859, -46045, -119552, -115067, -50691]
22590e0691R3614Q9471n9024P8025R3810q0721k16699r1054M4333l9941q4764
22579b23641j7356J33302Q1806m8862Q941J4307n9436r5231N2019P3890q2884
22568a63145P7186J34272o0364j2758M6913j6695j06676J1987J50672K2446K5066
22557A08904K1653j03955l0250o5253q0959l126k0582l6948J41239P9423J133
22546A1279p8953n7284m4702L6026K4645m2781J8199L0361m6440j6212o3012j2158
22534b41032O3181j8916q999p112J20254M6641q7390o8515p710J4706N9176L6604
22522i9112q732n0999k4749J13338O3890L4484N4747j15609j14628j13744K3566
22511b37548J14981m9102p544J69210k7397j67410q9507Q4748K86110P9638o4254
$$ y = [-50691, 42923, 132394, 73370, 151395, 245205, 164484, -52215, -143269, -98936, -138877, -223641, -240997, -107695, -25889, -74751, -65810, -51503, -110939, -206170, -154151, -80261, -163145, -85959, 48313, -12051, -24809, 22104, 5409, -101267, -89280, 61392, 83838, 108904, 130557, 26602, -3648, -68901, -149860, -152986, -173568, -210516, -69277, 10146, 11279, -67674, -124958, -169660, -133634, -108989, -151770, -133571, -103210, -149650, -165862, -228874, -241032, -177851, -196767, -205766, -212878, -92624, -45983, -133373, -201888, -209598, -194892, -135716, -99112, -107844, -158843, -183592, -70254, -6364, 28120, 82867, -32742, -147370, -261114, -237548, -122567, -171669, -179213, -10003, -37400, -204810, -294317, -209569, 76541, 156179, 91925]
22500I1925M4070j0135k8030p8368j08639K993M4683n6708M2621k0499N2715j8625
22488d1997j19048q1784N7524K6468l2032r8260o4900K1792Q8019M6103k2305
22477b20420J07760P1069j505O2598m3232j2383j00612l7896K1201J1621r699
22466a51498L5708j45127L7126Q3433N6538o8557N9829J12812K3185m7749l2091
22455c6391J22075q1677l8091P0036J12154k3029o5301n3761n2520o5498K811
22444a09192Q5683K3017q6851j1722j0808j04170j22250j29271K51107J50986
22434f3471r0049p1969P4913k0418Q1401q367O6002Q1348o000o0072j4154k3939
22422e4775l7874p2321n1707J03034J33429N8298k2404o5744M5726o2575J7283
$$ y = [91925, 135995, 125860, 97830, 19462, -89177, -86184, -41501, -98209, -55588, -76087, -23372, -41997, -161045, -242829, -185305, -158837, -190869, -289129, -354029, -332237, -244218, -198115, -220420, -112660, -41591, -43096, 19502, -23730, -36113, -136725, -174621, -153420, -141799, -151498, -115790, -260917, -223791, -140358, -83820, -152377, -92548, 20264, 43449, -4300, -36391, 85684, 4007, -34084, 35952, 148106, 125077, 59776, 6015, -46505, -112003, -109192, -23509, -492, -87343, -99065, -109873, -214043, -336293, -465564, -214457, -63471, -153520, -225489, -150576, -170994, -89593, -97960, -31958, 49390, 43390, -16682, -30836, -54775, -92649, -164970, -216677, -113643, 19786, 78084, 55680, -10064, 35662, -26913, -9630]
22411i630R3360Q1213l4850l8479p5137k3644K5693K1351l8129j8376J7470J5729
22399A6571J1823n7577N093m607r4168l698m4846j1002n6182J04472K17366M6440
22387A29685K7266l4916j38926j20140O5142O2414l6874n1578J10461J22111R9039
22376B33684q4398j23974j0761p0305o6310l9191n2360O8975J11062M891N5337
22365B6650m9953j03398O4979o123m5658l7289M1284j01212M1955J28269J72626
22354A32130N3045k7586j50545q9883J6353k7921K4980K06769k1470K6229j40312
22343A789j55465j1781R9399J69819l4614n9778o5791L7436L0777J8504P630j12106
22331g4181j88259O6320J17465N9243j9100j2264M1855j59292K1237p2139O0798
$$ y = [-9630, 83730, 164943, 130093, 91614, 16477, -7167, 18526, 39877, 1748, -16628, 842, 16571, 28394, -29183, -24090, -28697, -122865, -126563, -171409, -182411, -238593, -134121, 83245, 129685, 156951, 122035, -16891, -137031, -71889, -9475, -46349, -97927, 12534, 134645, 233684, 149286, 25312, 14551, -55754, -122064, -161255, -213615, -144640, -33578, -28687, 26650, -23303, -126701, -61722, -67845, -113503, -150792, -109508, -210720, -168765, -40496, 132130, 185175, 157589, 7044, -82839, -66486, -94407, -69427, 137342, 115872, 142101, 1789, -153676, -165457, -66058, 103761, 69147, 9369, -56422, -18986, 11791, 30295, 37925, -74181, -262440, -196120, -78655, -19412, -38512, -50776, -8921, -168213, -146976, -219115, -158317]
22320a58317J12739k7228n9307K6073l8675p8864N1184L8696N6401K7401k7669
22309g7566k397o269M3422m832l3830q712J44471k8666j18366m8082j8048Q0592
22297g8283R4650o7152j54126j42646K310J98R916Q2701N4685P70k9122J19874
22285a06225O1644o0452k6776p9356k027n452L1318O8069O0367m8476J6935m705
22273i5136P7350p5685n6324m6687N4463K4245J26665j1748r2100j13294N3519
22262a54732N2579N9751O3700j12445L0783J18103k3999r8498m4929k219m4938
22251a56844n5042J21216r123j14788L0674J1459j29964L2076L6883P3529o8320
22240b28244J8252J0209J41399J6098L9065M2161j33011J2109J8041N6758l6173
$$ y = [-158317, -45578, -72806, -132113, -106040, -144715, -223579, -172395, -133699, -77298, -49897, -77566, -79963, -86232, -42810, -47642, -81472, -90184, 54287, 25621, -92745, -140827, -158875, -78283, 16367, -50785, -204911, -347557, -345247, -345049, -335133, -252432, -197747, -196977, -226099, -106225, -44581, -105033, -131809, -211165, -213192, -218644, -187326, -119257, -58890, -107366, -90431, -95136, -17786, -93471, -149795, -196482, -142019, -117774, 8891, -2857, -94957, -208251, -154732, -102153, -42402, 21298, -91147, -60364, 57739, 33740, -64758, -109687, -111906, -156844, -211886, -90670, -99793, -214581, -183907, -172448, -302412, -270336, -233453, -159924, -228244, -209992, -199783, -58384, -42286, -3221, 38940, -94071, -81962, -63921, -7163, -43336]
22229d3336P2043j7403J6389r0088p0702J4794M3031J8915M7860j09326l065O237
22217a14651j00758Q0048R3777l4446j2873K4033J14575m2120k6150r178j38073
22206a65816j00245R0516R1444k283n0565P3453O2886N4128k2228m6677l0691
22195d6078J3344R3452L6114j35865k08950N5260J76468P3972j92671J1463K466
22184a21025l9505Q3440J5435L2799q5642O4174L3488n2208l9525m7069K0220
22173a35418J12499Q8060j46023j19901J2490J04138J35339j01387Q4075k7394
22163F478o005K8202p414K3533J9015n0649o647n0219j26503j6060Q1299O8223
22151c6747j5013m5606N466J29054N657k0216Q2766m7496j51584K7449k9072r4941
$$ y = [-43336, 28707, 11304, 27693, -62395, -133097, -118303, -75272, -56357, -8497, -117823, -120888, -114651, -215409, -135361, -41584, -76030, -88903, -64870, 49705, 7585, -18565, -27743, -165816, -266061, -175545, -84101, -86384, -136949, -63496, -610, 53518, 31290, -15387, -46078, -32734, 60718, 96832, -39033, -247983, -192723, -16255, 57717, -134954, -123491, -121025, -160530, -77090, -61655, -28856, -114498, -50324, -16836, -69044, -108569, -155638, -135418, -22919, 65141, -80882, -200783, -188293, -84155, 51184, -50203, 33872, 6478, 473, 28675, 21261, 44794, 63809, 13160, 6513, -43706, -170209, -186269, -104970, -36747, -51760, -97366, -91900, 37154, 42811, 22595, 105361, 57865, -93719, -66270, -95342, -190283]
22139a90283K1999R8224J61250k6535j19142J5434K6575J27218k1993r3814m8145
22128d9212R766j63868m783j2614l7574J01766R5355m4995L6082n5732j08518
22117b34327m0353J42632J3130m400j4473j3604k7583M4966J02598j3998k9549
22106g4961j605J14984L5856j2940q6316K8083l9178o1979r9173j7965J53908
22095f1286k5448J9419R0515q8305j24237O0708l5597N0070R9294R156j05038
22084a10749m3157Q5816R575P7204M1928O7033k7199j19187r4902M2308P4868
22073C538Q308L9613o7133J5152j8775k3878j0865M2746L2049Q8207P2480M1817
22061B23259n5460j36339j08281J10904o801p0155k5741j256L016k4335l2247
$$ y = [-190283, -168284, -70060, 91190, 64655, -54487, -39053, -12478, 114740, 92747, -1067, -49212, -39446, -203314, -208097, -220711, -258285, -156519, -61164, -106159, -70077, -125809, -234327, -274680, -132048, -118918, -123318, -137791, -151395, -178978, -134012, -31414, -45412, -74961, -76566, 38418, 74274, 61334, -24982, 3101, -36077, -98056, -197229, -215194, -61286, -86734, -67315, 23200, -65105, -189342, -128634, -164231, -114161, -14867, -5711, -110749, -153906, -68090, -58515, 18689, 60617, 127650, 100451, -18736, -113638, -71330, 3538, 11846, 51459, -15674, -522, -19297, -43175, -54040, -11294, 20755, 108962, 181442, 223259, 167799, 31460, -76821, 34083, 27282, -42873, -68614, -69870, -66854, -91189, -123436]
22050a23436O9787j0410O3076J33739n9293n9595p6572Q3362R5279l7615j69760
22039i1438o442J4907j38630P4358O7442j03790R3250M7275n8430L2026J8362
22028e1110l3846p8980m5623P8481L1246R4684J683J0759J19037J9168l7062k8998
22016G9439O944j7151P4350m4678m4298N127k333k4383j22023K8935O6060O9550
22004G5539N2829k2707j29825m0672N5502o955j5619p0607n051P8236O6705P0569
21992A07944j5729j36275m2741P6690p827k7587K453J1293J6949R0737n7754n8734
21980d0581K0582R027N9411k6104k5405J26570k4389J0272J34972L9411j19012
21969A64754j07406p3819j19305r0437M0937J63671J37100J0638j3738O7499N0414
$$ y = [-123436, -53649, -64059, -983, 132756, 73463, 13868, -62704, 20658, 115937, 78322, -91438, -97880, -82973, -221603, -147245, -79803, -183593, -90343, -43068, -101498, -69472, -51110, -84956, -163936, -209559, -131078, -99832, -5148, -3465, 7294, 126331, 145499, 108437, 79439, 86383, 69232, 143582, 98904, 54606, 59733, 57400, 33017, -89006, -60071, 5989, 75539, 128368, 105661, -24164, -64836, -9334, -16289, -31908, -102515, -107566, -29330, 37375, 107944, 92215, -44060, -86801, -10111, -17938, -45525, -43072, -31779, -14830, 75907, 18153, -40581, -19999, -10972, 48439, 22335, -3070, 123500, 99111, 109383, 244355, 283766, 164754, 57348, -16471, -135776, -226213, -185276, -21605, 115495, 126133, 112395, 179894, 230308]
21958B30308j41744q3672M7987m3233R970q5236r3492K9581J40696n7734K4241
21947b2328N5807j2162r9154o5962j0903J00655m623j72804j32464J06011L7512
21936b20415M030L5445Q0697l9983J16218Q0643P187r128o4334j30496m6521m3258
21924b29915K7358M9739M2152R9465k065J5665j212P0052O966j08148q7664M8951
21912f8656q2339n4655N7271N2869J14532K5310m1613l5087j20450o2768n2213
21901b67799J06251N6938L9368l7483k1417L0542j52440n6759K06227K46402k2790
21890A27040j35219j9720o42J1882O2252K2140j02173n6296N9947l715J3851o1849
21878h2502o4455L0984K5873q2848P3390J00456k4115m7426M4199L9047L0125
$$ y = [230308, 88564, 4892, 52879, 9646, 19616, -65620, -159112, -129531, 11165, -46569, -22328, 33479, 21317, -77837, -143799, -154702, -54047, -58670, -231474, -363938, -257927, -220415, -216385, -180940, -100243, -140226, -24008, 56635, 63822, 54694, -9640, -140136, -186657, -229915, -202557, -152818, -110666, -11201, -13266, 2399, 1187, 71239, 78205, -29943, -117607, -68656, -150995, -205650, -148379, -95510, 19022, 44332, 2719, -32368, -152818, -215586, -267799, -161548, -104610, -65242, -102725, -124142, -93600, -246040, -302799, -96572, 149830, 127040, -8179, -27899, -28541, -16659, 45593, 67733, -34440, -90736, -30789, -34504, -20653, -82502, -146957, -115973, -90100, -172948, -99558, 898, -23217, -70643, -26444, 12603, 42728]
21867D2728j54111R449Q4918l8995m2503J17169j5268p4376o7L740q7802m9200
21855b04318L8491J86078M922J7193j31993M6896l3221j66037N767J4530k6305
21844b47997O2108m7202J1453O2967M6198R1927q4473r063m5228r34N9339K5118
21832g5787r5603J033J09354K7562K4059r8240n630J03646O7235l0163j0842K65
21820A6889m285l9222j9031n7748N9872j390N9661p4882l2695J23699l7805q6087
21808i3024P2255n5867J01657K9460m4515q0314j7830Q5733J3579k1286m2770
21797e2922N1867K9988m7790k0258J6604k9487j4372k2365j4501K7570J4480n2520
21785a13706p5165O3498K1231L1937j160P1203J04937N6382j09511K9020j9607
$$ y = [42728, -111383, -101934, -17016, -56011, -98514, 18655, 3387, -70989, -71056, -67316, -155118, -204318, -165827, 20251, 25173, 42366, -89627, -42731, -75952, -241989, -236222, -221692, -247997, -185889, -233091, -221638, -158671, -112473, -20546, -105019, -114082, -159310, -160244, -100905, -75787, -171390, -170357, -61003, -33441, -9382, -107622, -113252, -9606, 57629, 27466, 16624, 16889, 12604, -26618, -45649, -103397, -43525, -44915, 14746, -60136, -92831, 30868, -6937, -93024, -20769, -76636, 25021, 54481, 9966, -70348, -88178, -2445, 11134, -10152, -52922, -1055, 28933, -18857, -39115, -22511, -51998, -66370, -88735, -103236, -75666, -61186, -113706, -188871, -125373, -104142, -72205, -73365, -2162, 102775, 159157, 49646, 78666, 59059]
21774E9059N1093j9697j06277r1743N863P1041M4818j8470k0494Q6486o6289p1369
21762g5979n7177l2970N0120O4176j02022m8368P9814J7O7420n0541k2185M2958
21750h4737m4731p2022N0527O384q1579k8806P6889J45918N088k6776P5731R9836
21738A21722L4529j9355M979O7847K0413j30290q1491Q3782j45115j57731J6695
21727a84015k9253m188l5133K1308N5110k0339J1655J5557J35126J25681r4891
21716c382p2358k5158Q381O2256M6497L9199l5288q9143j48693p2131j1356J31137
21704a70039L7328l3572P1094R2177J5036j3986j34440l7667J7069Q9047L635
21693f4318r8001l2397k9395k9937Q0313P1174K1778m6642O7086k5775m2975O4728
$$ y = [59059, 110152, 90455, -15822, -107565, -101702, -30661, 14157, -4313, -24807, 61679, -4610, -75979, -133156, -166126, -116006, -51830, -153852, -202220, -122406, -122389, -54969, -105510, -127695, -84737, -129468, -201490, -150963, -144579, -226158, -254964, -178075, -32157, -27069, -53845, 21886, 121722, 156251, 136896, 141875, 209722, 230135, 99845, 18354, 102136, -42979, -200710, -184015, -213268, -217456, -252589, -231281, -176171, -196510, -184855, -169298, -34172, 91509, -3382, -75740, -100898, -92517, -30261, 16236, 55435, 20147, -68996, -217689, -289820, -301176, -170039, -132711, -166283, -95189, -3012, 12024, -1962, -136402, -174069, -157000, -67953, -64318, -162319, -194716, -224111, -254048, -173735, -102561, -80783, -127425, -60339, -86114, -129089, -64361]
21681f4361K7462p4193J9996l944n9200K1246M565Q6291M1954j37770Q3595Q3756
21669B9397j77817k989Q0729O9852n4525n3780q2730N5903R0691K5469N6381j05678
21657f9097l0391O5454N9129O5486n332N027O3331k9457j10880n7557m1281l4086
21645a19654K5860m645P4812J55433j1305k0096k9183l0616o7828o5544M1074
21634e1692J18572k4308j65742p4241l3321j17124m0696J00236J52829O0990j0010
21623h4507k0477p6529K0631J0304l6820M9588J09622J33823m6755r7601j20222
21612a58943M2463j3550p5023N2040P0211m3095m5041J03378j03383j4943k476
21601a88362l0714P4960J09072J13274j9207o8170j24803R561O394o657J5779
$$ y = [-64361, -36899, -111092, -91096, -95040, -154240, -132994, -128429, -42138, -184, -137954, -54359, 29397, -148420, -151409, -70680, -828, -55353, -109133, -191863, -135960, -45269, -19800, 36581, -69097, -99488, -34034, 25095, 90581, 85249, 90276, 153607, 124150, 13270, -44287, -85568, -119654, -93794, -98439, -23627, 131806, 120501, 100405, 71222, 40606, -27222, -92766, -51692, 66880, 42572, -123170, -197411, -230732, -347856, -388552, -288316, -135487, -74497, -84507, -104984, -181513, -160882, -150578, -187398, -137810, -28188, 105635, 58880, -38721, -158943, -116480, -130030, -205053, -153013, -82802, -125897, -170938, -67560, -170943, -185886, -188362, -219076, -144116, -35044, 78230, 59023, -9147, -133950, -124389, -117995, -124652, -108873]
21590a08873N4703k3967r9810N4127M4878j8174k1153K144o6160J2740o38K8792
21578a41391P1248L9467r62L6238K9546N2582m3921q3707P927L4248j19933j22387
21566b41045m5682O8810R9640O6451o1353o8975n2265K4453O6930R0970R9995
21555D7929q8880j0868k9997j11275N7780P4576O4953L229J8030M3241M8742j8237
21543I9223j26864r8902J6807J03092O1485L0363j13822p0034n1574J00328Q5728
21532C5830p2447j38679r3924N7660J26230R9744Q2764m6016Q5513p9551j38190
21521h1066n8527P9332J11082J5582n2795l2536k7333j58213k7352J60971J72021
21510A01166r444j85504k8213L339M6563l0735o0264P755N0360q0032m3480J7219
$$ y = [-108873, -54170, -78137, -177947, -123820, -78942, -97116, -118269, -116125, -182285, -169545, -170183, -141391, -70143, -30676, -31638, 4600, 34146, 86728, 42807, -40900, -32973, 1275, -118658, -241045, -286727, -217917, -118277, -51826, -113179, -182154, -234419, -209966, -143036, -52066, 47929, -40951, -51819, -81816, -193091, -135311, -60735, 4218, 7447, 25477, 68718, 117460, 99223, -27641, -126543, -109736, -6644, 54841, 85204, -28618, -98652, -150226, -49898, 35830, -36617, -175296, -269220, -211560, -85330, 14414, 97178, 51162, 136675, 57124, -81066, -139593, -60261, 50821, 66403, 13608, -18928, -46261, -204474, -231826, -70855, 101166, 91722, -93782, -121995, -118656, -72093, -102828, -163092, -155337, -104977, -185009, -228489, -211270]
21498b11270J40590O1358l2333k0732j33816q9616J6595O6538m3677m1901p182
21487b95446p9623K2915J60705M2460l2240l1890K15K2790k7500n0216R861K4464
21475b33505R9652J16044o577R387N6830P6908j08838j15993J0855r1271j8997
21464b05505j07779J39529N4031R5626M0910l9903j13856m688j56184m5239J71982
21453a71076O6670p4447j2734Q0762L2965O1900Q9812J2799n7462Q1010j7500
21442I2699j22948p700m6481R907Q9030q4047r0078K3550j3953M158O2375K0120
21430f3368N0868J26231j14932j27742J12922P8225n1834m0273K4593K6354L5761
21419E6805r8171q8709J7821j0154o8463K7031K8598K6910K2836l8379K5454n7768
$$ y = [-211270, -70680, -9322, -41655, -62387, -196203, -285819, -269224, -202686, -246363, -288264, -295446, -375069, -352154, -191449, -148989, -181229, -213119, -212904, -190114, -217614, -267830, -257969, -233505, -133853, -17809, -24386, -14999, 41831, 118739, 9901, -106092, -95237, -186508, -205505, -313284, -173755, -119724, -24098, 16812, -23091, -136947, -141635, -297819, -343058, -171076, -104406, -178853, -191587, -110825, -77860, -15960, 73852, 86651, 29189, 110199, 92699, -30249, -37949, -84430, -74523, 14507, -69540, -159618, -136068, -150021, -145863, -83488, -63368, -12500, 113731, -1201, -128943, -16021, 62204, 10370, -29903, -5310, 21044, 56805, -41366, -130075, -112254, -122408, -190871, -163840, -135242, -108332, -85496, -123875, -98421, -156189]
21407a56189J20100R4240j9039n4243j39260p1042j374Q3445P4170J442j09116
21396a76866j31326p4333J25457O0199L9841J25237J8536J08695K3919l1050k9606
21385E8703q071q4547o9483J2126j6271J0665Q739M7704n460l6410r1552o279
21373a80136L2688j096Q7453K2891j09919K3499O359R9545l9656j07778k9465
21362a95615l7250N8804K0968K4491L6666K8845M4036m8442o5348Q0636M3688
21351h521p3590k8662K1769P8052J4788m2616p5476R786N4355k5262L1675M6689
21339B987o6997n4024p2581o1748J8952p780R1936k4045N3176N8721m1792M9564
21327e3631K163N3951o8245j58121N276n6220O8237N9002j056O200q4141J45981
$$ y = [-156189, -36089, 58151, 39112, -15131, -154391, -225433, -226807, -143362, -69192, -67750, -176866, -308192, -382525, -257068, -196869, -157028, -31791, -13255, 95440, 119359, 88309, 58703, 50632, -33915, -103398, -91272, -107543, -96878, -88139, -40435, -45895, -82305, -173857, -180136, -147448, -148544, -61091, -38200, -148119, -124620, -118261, -18716, -58372, -166150, -195615, -232865, -174061, -153093, -128602, -91936, -63091, -19055, -67497, -132845, -52209, -8521, -82111, -110773, -89004, -10952, 3836, -38780, -114256, -104470, -50115, -75377, -43702, 2987, -64010, -118034, -190615, -252363, -233411, -241191, -149255, -173300, -120124, -61403, -103195, -53631, -51468, 2483, -65762, -223883, -218607, -274827, -206590, -147588, -148644, -142444, -226585, -80604]
21315h0604J00487m9727o6758j01728n4213q9304q3493J20143J35949n2515R947
21304b11816M3069K1311M15n912j2838r9137L4023R2529N986q962N7932j13801
21292a97201k7119P2409J16753J1511q5101q5997l4905Q4824m5804Q6252j8765
21281a23143L1818M110j38308J06280J07134p5446o6747n0933J11712j53399m5005
21270b91927Q9927R5448l7423r329j4154l6421J6883l99l6269Q4042M6983j9972
21258a12611m0381k753K2211N8546L0581p502r6194L2072J1525j693N793k06M9728
21245e0884L1277p3022M3512o0431n1449J07540k69j57607j20121j0493l4756
21234c76703l0707J41403J53465j64051O663Q7512L9852O6733j6468r0818j00298
$$ y = [-80604, 19883, -29844, -96602, -198330, -252543, -341847, -425340, -305197, -169248, -221763, -211816, -168747, -147436, -147021, -152933, -165771, -264908, -230885, -138356, -132370, -141332, -83400, -197201, -224320, -151911, -35158, -23647, -108748, -194745, -229650, -144826, -190630, -104378, -123143, -91325, -87215, -225523, -119243, -12109, -87555, -154302, -205235, -93523, -246922, -291927, -202000, -106552, -143975, -153304, -167458, -203879, -186996, -187395, -223664, -139622, -92639, -112611, -152992, -155745, -133534, -74988, -44407, -51909, -148103, -116031, -104506, -106199, -100406, -100612, -50884, -19607, -92629, -49117, -109548, -160997, -53457, -53726, -211333, -331454, -341947, -376703, -407410, -266007, -112542, -276593, -269930, -182418, -142566, -75833, -92301, -183119, -283417]
21223b83417k918o1819r410O4701j4107l9633L8271p909m46O2689p0293m9543
21211c73834R5811J11673j27414p4939o093O1247j0126M0520J46856L5358m9677
21200a50618Q0363N7261j07511K1570Q1088p707j1085R7197J86202j22247k03195
21189g8682o0362O6184K9419L3585O5153p5275k5777n458K6003j23069l7845p541
21177a93665r279L598N7659L1096O9844K9963Q6541j35999o8636M975K4023J7604
21165h2276j65683j7432P2856P5418k0887L8764L5900P0148Q4449M4321r1161
21154D4417j45971R654L9889o6980o629o103K6196l0071k2959P657J1506J7568
21142a21826l4317l063q4351p3146r83L0910k7196J11944Q9642J2956P6888M4568
$$ y = [-283417, -286335, -348154, -357564, -292863, -306970, -346603, -308332, -316241, -316687, -253998, -324291, -373834, -278023, -166350, -293764, -368703, -374796, -313549, -323675, -283155, -136299, -100941, -150618, -70255, -12994, -120505, -98935, -17847, -25554, -36639, 60558, 246760, 124513, -78682, -139044, -72860, -43441, -9856, 55297, -19978, -45755, -51213, -25210, -148279, -186124, -193665, -202944, -199346, -141687, -110591, -40747, -10784, 75757, -60242, -128878, -123903, -99880, -82276, -247959, -265391, -192535, -117117, -138004, -99240, -63340, 6808, 91257, 135578, 44417, -101554, -91900, -52011, -118991, -125620, -131723, -105527, -135598, -158557, -150900, -139394, -121826, -156143, -159206, -243557, -316703, -317686, -286776, -313972, -202028, -112386, -99430, -22542, 22026]
21130B2026J062n7224o7679Q093n705O0579N3699j02068J5353K7484j18089p186
21118a69655R0133n0853p926n6793n7528N6212r3828j24974k7314J11999J32369
21107a98158m9561j17827m7174J62713l894o7919L7584k0899J1347J87803K8517
21096g7468n2136K7890O9482l6656J2478N2629j9661k3396O6761K9453j30279
21085h0903n5907J4246L4494n5383n6457Q211J31334m9866j5752N7254O1540n5448
21073f2637k1924O1310j89387p8761J1792J63726N240m2700P9168J65834j03398
21062a1737k9435o2612p2126M3019k4760O1610k8055n6273o0993j02074J58156
21051a85280O7241n8721R6765J02297j5683j48369j12490L5053M1567P2580l4709
$$ y = [22026, 23088, -34136, -101815, -93722, -99427, -38848, 14851, -87217, -71864, -44380, -162469, -169655, -79522, -130375, -138301, -195094, -252622, -196410, -290238, -415212, -442526, -330527, -198158, -247719, -365546, -412720, -250007, -253901, -321820, -284236, -305135, -293788, -105985, -77468, -129604, -101714, -32232, -68888, -56410, -3781, -23442, -46838, 19923, 49376, -80903, -136810, -122564, -88070, -143453, -199910, -191699, -60365, -110231, -125983, -68729, -7189, -62637, -84561, -23251, -212638, -291399, -279607, -115881, -110641, -153341, -74173, 91661, -11737, -41172, -103784, -175910, -132891, -157651, -96041, -124096, -180369, -241362, -343436, -185280, -118039, -176760, -79995, 22302, 6619, -141750, -254240, -219187, -177620, -105040, -139749]
21040a39749N2062P7837r330M1002K4263p4185q0937p2859J7107l566Q2524m15
21028h6246O4577P9933q4142k8693K8680p8256j24694q4649Q1670K7507J12838
21017i1475j8632j1277N4218L9276l345j48529l5630J32172M2364j1196N4508
21006B454Q9499L2127j19841L8952m4998p8933j20391L042R4494k8513j14855
20995b46963L7135N5037N2830M365k7203l7699M5831M4026k2308p9966m839J03635
20983g6119K0610k7236P5882K6161j01294j9304M0889J02831J50793j03912p1994
20972A7307l6809j11585K9462k0007J41353O0916j015j9091j4477l7586j94125
20961a85657n9710L6223J19762O9652l2269K2633J3125J4811Q7652K489o2289
$$ y = [-139749, -87687, -9850, -19180, 21822, 46085, -28100, -109037, -181896, -164789, -168355, -85831, -86246, -21669, 58264, -25878, -54571, -25891, -104147, -228841, -313490, -231820, -204313, -91475, -110107, -121384, -67166, -27890, -31235, -179764, -215394, -83222, -40858, -52054, 2454, 91953, 124080, 4239, 43191, -1807, -80740, -201131, -198089, -103595, -132108, -246963, -209828, -154791, -101961, -97596, -124799, -162498, -116667, -72641, -94949, -174915, -179754, -76119, -55509, -82745, -6863, 19298, -81996, -101300, -60411, 42420, 193213, 89301, 17307, -19502, -131087, -101625, -121632, 19721, 80637, 79622, 60531, 46054, 8468, -185657, -245367, -209144, -89382, -19730, -51999, -29366, -16241, -1430, 86222, 88711, 26422]
20950B6422m8555n1161L6758L6944k6233m9161M077K8958J5583j12326K7025k574
20938a14243L8367o1905m0802O527K6712j584l6777L3265J33512K2110N901P575
20926A8658k4536r2699R530L4093k7195M2428N38n0851n2991L7739L4658O8382
20914b246q7401r9277j341k2119k5144Q3270M1308m4258K1950P9376n6509O2815
20902d9576L5438p6372R5782J21213j12712j7392L991m0470l3082K2758j8684
20891f9106J18487L7306j22168k2508K2531L4217j775m42J2949p7809l337l745
20879g5400m6902n323m586K6257k9303L5959P0977K8506j37378N5805p1094J0177
20867a42305M7639o4791j06218P5213J37643Q9089j3717q6329n8695q027M0097
$$ y = [26422, -22133, -73294, -36536, 408, -25825, -74986, -70909, -41951, -26368, -138694, -111669, -114243, -75876, -137781, -178583, -172056, -145344, -146928, -183705, -150440, -16928, 5182, 11083, 18658, -5878, -98577, -89047, -54954, -82149, -39721, -39183, -90034, -143025, -105286, -70628, -2246, -89647, -188924, -190265, -212384, -237528, -154258, -112950, -157208, -135258, -55882, -112391, -49576, -14138, -90510, 5272, 126485, 13773, -3619, 372, -40098, -73180, -50422, -69106, 49381, 86687, -35481, -57989, -35458, -1241, -3016, -3458, 9491, -68318, -71655, -75400, -122302, -127625, -132211, -105954, -135257, -99298, -28321, 185, -137193, -81388, -152482, -142305, -94666, -159457, -265675, -190462, -52819, 36270, 22553, -63776, -122471, -130498, -90401]
20856i0401p5652l8426M0557O440K9907J6398M9431l305j4617j9653Q4428K1982
20844G089p1631J59518P3201O895l6432o2186q4052p8972m1712j17584k5259L3690
20832b37435J41521Q6188r8247j6574o4271R9825J80660J7341o838J8856j35785
20821a4759j29873J2658L9718j01534J5810M7006M2288K5923O3603P531p9423
20810g1052J37977N7153j20701n8954l0638r4767Q2731Q4371P0707j15234l4819
20799i3226o4116q1382p536l833J4456M2954P7199J4634M9313j6446L4028o3750
20787i7705j6822m3005o1033L5748k6339M2629M1311N0717j24275j05313M7189
20776b56898N4381N5910k9488M5591J97003k281j05214J1392Q6824M7397J2163
$$ y = [-90401, -166053, -204479, -163922, -157482, -127575, -111177, -61746, -65051, -79668, -99321, -14893, 7089, -64542, 94976, 168177, 175072, 138640, 76454, -7598, -86570, -128282, -245866, -271125, -237435, -95914, -9726, -107973, -124547, -188818, -88993, 91667, 109008, 102170, 121026, -14759, -144632, -131974, -92256, -193790, -177980, -130974, -88686, -62763, 840, 8371, -71052, 66925, 124078, 3377, -55577, -86215, -180982, -98251, -13880, 56827, -58407, -93226, -157342, -238724, -246260, -250093, -235637, -192683, -115484, -100850, -51537, -67983, -33955, -97705, -114527, -157532, -218565, -182817, -209156, -166527, -125216, -74499, -198774, -304087, -256898, -202517, -146607, -176095, -130504, 66499, 64218, -40996, -29604, 57220, 104617, 116780]
20765A16780P6609L9462J0194l9990j56768k4672j6806R1126M0953j19827l50
20754A6711R6170n0488O583l6802l1228k895P6001l8421o7392M0758m402K3021
20742B7616P47l7894m5483j87319l3690J58989R9103q6256l8920O2518K3616N0091
20730f882k5302O2848Q6928M7795o5934j32711j37320O651J08808M7045j2889
20719b0963q3334r8306M3480j8829K7083R6512n1606M7240R0787o8404j4611J6240
20707c4711l0861j26669J55927J11258l8363o9091J86271M2978m0552m8071o7514
20696D0602j80922L450Q533p38J1888J19788N4995k2681j46022m0040P8733R7964
20684B5550R9282J29335j21963j26299m8493J7417J0445l6448J07436o5242k8329
$$ y = [116780, 193389, 232851, 243045, 203055, 46287, 21615, 4809, 95935, 136888, 17061, 16711, 112881, 62393, 68976, 32174, 946, -1949, 74052, 35631, -31761, 8997, 4595, 27616, 28363, -9531, -55014, -242333, -276023, -117034, -17931, -104187, -143107, -80589, -56973, -6882, -32184, 30664, 117592, 165387, 99453, -33258, -170578, -163927, -55119, -8074, -20963, -104297, -202603, -159123, -177952, -150869, -54357, -105963, -58723, 32064, -36340, -50951, -34711, -65572, -192241, -36314, 74944, 36581, -32510, 153761, 196739, 156187, 108116, 40602, -140320, -136870, -128337, -129075, -117187, 2601, 57596, 34915, -111107, -151147, -72414, 25550, 124832, 254167, 132204, 5905, -42588, -25171, -14726, -51174, 56262, -8980, -37309]
20673c7309j81791k642R8143P2660n1202p7941R7486M7529o1303q1287k1956Q0176
20661a19437J90134L7378j1501j52654j11984l3911M4939j721R526o0124K9876
20650a79479N7478j0116J6329P0106M493J814j3991j18294o5104o370J88031L7587
20638a7516j88743p8637J36187O3876M9784L0773P109j12276q307m1674N2900
20627a06524K4875m7308j19603M7511P3336P6460J21375l6671r2926K4183r9700
20616a34992P109J6449P1393K3995M5620M6690k8545m6379r7171O4173P9744j06527
20604e8441n7511m1766R3393K6550j09489j34753K8447L2704O2069k0145n9687
20593b38629P134J01143M9922n699j44346Q3113j6096M8419J50859m9250j15515
$$ y = [-37309, -219100, -221742, -123599, -50939, -102141, -180082, -82596, -35067, -96370, -177657, -199613, -119437, 70697, 108075, 96574, -56080, -168064, -201975, -157036, -158757, -149231, -209355, -179479, -122001, -132117, -115788, -45682, -41189, -39375, -53366, -171660, -236764, -243134, -55103, -17516, -206259, -284896, -148709, -84833, -35049, -4276, 2833, -109443, -117750, -159424, -106524, -81649, -128957, -248560, -201049, -127713, -51253, 70122, 33451, -59475, -35292, -134992, -127883, -111434, -40041, -16046, 29574, 76264, 47719, 1340, -95831, -31658, 48086, -58441, -115952, -157718, -64325, -37775, -147264, -282017, -253570, -220866, -158797, -178942, -238629, -231495, -130352, -80430, -86129, -230475, -147362, -163458, -115039, 35820, -13430, -128945]
20582a28945j8150J25761R3691J34312m1266l4013r4480q4452n976N942P1579
20571B4003N5378L8067j27165j7729M7383j26696j17465n8466N0463n671j6510
20560b54408M1491J24668Q1330n4517j7425k4457j9573J6634N0237j75932m4636
20549b76588n934J30224m533M9694k6181j657Q3176O4108q0052N0534M2113m3156
20537a8252n5014Q226J19824P2144p7615j03553N697q3926L7118J72202j03263
20526b6412r3438L6396o4475p5814N8096N2893M7630J19676N5057j11952p2945
20515g5288J03174R9344l0990L293K8654k318J92721J44653l4040j9259m5261
20504C64683R116o0558p5678R6294J01698L438n2212O692k5381o8634p8608O362
$$ y = [-128945, -147095, -21334, 72357, 206669, 165403, 131390, 36910, -47542, -53518, -47576, 24003, 79381, 117448, -9717, -27446, 19937, -106759, -224224, -282690, -232227, -237898, -254408, -212917, -88249, -6919, -61436, -78861, -103318, -122891, -106257, -56020, -231952, -276588, -282522, -152298, -156831, -107137, -133318, -134975, -51799, 12309, -67743, -17209, 24904, -18252, -73266, -65040, 54784, 126928, 49313, -54240, -48543, -132469, -95351, 76851, -26412, -119850, -83454, -147929, -223743, -165647, -112754, -65124, 54552, 109609, -2343, -75288, 27886, 127230, 96240, 99533, 128187, 125869, 318590, 463243, 429203, 409944, 364683, 373799, 313241, 237563, 333857, 435555, 438993, 386781, 393473, 368092, 299458, 220850, 227212]
20492B27212J15143J39218Q8023j55234j02188K4174j17377q3270j5531O7123
20482A87293L2647N2510m1806M8715J09382P4688j1666Q49k9553N1410J677p8127
20470C98019q8109m1744M9740k800l9973J3652J26885J03938j09795j76496N8388
20459B91705l9108q1941q1803P0281N8732k6698m9933o3714k04857l3648J0623
20448a50361N3290M7669l7425r6700k1990Q9343J9624J6141L1922M4911P449m1105
20436c7232j3474K2064O0193j16953o9902k0490k1516O5538O8017k2836r2744
20425a79335j0915J10338M6437N5133m22Q8025q9649j04041K3144K1993p5206
20414a14498n7243l8158O2656O3146K07892q9501m9082P958r1378l8595n2446
$$ y = [227212, 342355, 481573, 569596, 414362, 312174, 336348, 218971, 135701, 120170, 187293, 219940, 272450, 230644, 279359, 388741, 463429, 451763, 452612, 423059, 474469, 476146, 398019, 309910, 268166, 317906, 315106, 275133, 288785, 415670, 519608, 409813, 233317, 291705, 252597, 170656, 88853, 159134, 217866, 191168, 141235, 77521, -127336, -160984, -150361, -97071, -49402, -86827, -183527, -205517, -116174, -96550, -80409, -48487, -3576, 3873, -37232, -50706, -28642, 31551, -85402, -155304, -175794, -197310, -131772, -63755, -86591, -179335, -190250, -79912, -33475, 21658, 21236, 109261, 19612, -84429, -61285, -39292, -114498, -171741, -209899, -147243, -84097, 123795, 34294, -14788, -6830, -98208, -136803, -189249]
20403a89249j64739k16565J53057R9970m6339r735J55180J27367R9295p148J6355
20392A7449j35049l7211K9629P4623K4129l4885k2447J5725l168K8717J78519
20381A36031O0543j19611j78367n6443Q3560P5336J0504N3792m4776o213n0730
20370c6374j5353j4429k3927p054O5515r451j15455N5308Q1126K7483n8539r5321
20358a46471L9249K3499J8907M2973p9257j53551K9681L8654j6279P710Q2632
20347a12253j3823M5319k9287j0567L9406r0263j9156J36117J2362j4585j8523
20336g5253j7597L2362r7496l9920M9364J58119L9395N8592q240j18936J2997
20325f613J2691J1665j607L6416j17227l2902L6123L0056K8480M2771k0354K8215
$$ y = [-189249, -353988, -570553, -417496, -317526, -363865, -373600, -218420, -91053, 8242, 1094, 17449, -117600, -154811, -125182, -50559, -26430, -61315, -83762, -68037, -71205, -42488, 136031, 196574, 76963, -101404, -157847, -74287, 1049, 11553, 65345, 20569, 14356, -36374, -51727, -66156, -90083, -97137, -31622, -41073, -156528, -101220, -20094, 7389, -51150, -146471, -107222, -83723, -64816, -21843, -101100, -254651, -224970, -186316, -202595, -194885, -112253, -126076, -80757, -110044, -120611, -81205, -171468, -190624, -54507, -42145, -56730, -75253, -92850, -60488, -157984, -197904, -148540, 9579, 48974, 107566, 99326, -19610, -6613, 6078, 17743, 16136, 52552, -64675, -97577, -61454, -31398, -2918, 39853, 19499, 47714]
20313D7714N86j11994j42222p8348J22574J03947p4670P8975M9513m3302m6663
20302i3890K1834K1819N0359K4154k516K8586l2786N4263r4434r1170J368J8675
20290i3738o2467J17699P9095m789O4163j7142o0434n7368M150o144r1969j3939
20278a42883j2937P2791J37232k161r3976m3779q351N4388J05356J3462m7505
20267C1637L7451n0771j06153o9276J7321k798n8580M888o5976m1379J0852J87126
20255a05658N4437r5144l9761P5222o0632M9349K8646o1245r5226j6123J04209
20244a61926K8981l0615L7606n0900R068J00299O135j26465K3399L6373R2529
20233c5516P5459P6105M6672k7886n7838j11262r3634K7235M8120J02597J17489
$$ y = [47714, 48300, -63694, -205916, -284264, -161690, -57743, -132413, -53438, -3925, -47227, -93890, -72056, -50237, 122, 24276, 21760, 50346, 17560, 71823, -22611, -113781, -112413, -93738, -156205, -38506, 40589, 35800, 99963, 82821, 22387, -34981, -30831, -36975, -128944, -142883, -155820, -83029, 54203, 52042, -41934, -85713, -94064, -39676, 65680, 79142, 31637, 69088, 18317, -87836, -157112, -139791, -142589, -201169, -196281, -262257, -303636, -292784, -105658, -51221, -146365, -186126, -110904, -171536, -122187, -93541, -154786, -250012, -266135, -161926, -132945, -163560, -125954, -176854, -167786, -67487, -61352, -187817, -164418, -128045, -35516, 39943, 116048, 162720, 134834, 76996, -34266, -127900, -100665, -52545, 50052, 167541]
20222A67541Q2409l0101m7819L4587J16625J38841N7977m9878k4794k4943k1270
20211C99175N7675k212J1030m9699R2193M5494J4048k3233m47p8634q6588l3124
20199C45678p2731r2442n4872n3792R3826Q5072j8891j11860r629j42151n8892
20188i0684J38127P2374O8706R7075L1136r6935m5292j53382J2467n890k4272
20177C430P5442M8451N724N3206R2605M9648K8691J96537J58558j01993j16578
20166D93721J7553o6796j21053m3394J07914M6349k3984m1346J20365J22398J21179
20155G32906L7026j01266n3675k0921p2510q963L4935j01983j34400J9634L4936
20144C65719l9691o6529r6863r8538q0081o9865m420J0019k9290L0514L0608J11737
$$ y = [167541, 249950, 219849, 172030, 206617, 323242, 462083, 520060, 470182, 445388, 420445, 399175, 456850, 454638, 465668, 415969, 508162, 553656, 567704, 544471, 544024, 465390, 378802, 345678, 272947, 180505, 125633, 71841, 165667, 250739, 231848, 119988, 110359, -31792, -90684, 47443, 119817, 188523, 285598, 316734, 219799, 174507, 21125, 33592, 27702, 3430, 78872, 127323, 133047, 186253, 278858, 328506, 357197, 553734, 712292, 610299, 493721, 511274, 444478, 323425, 280031, 387945, 434294, 410310, 368964, 489329, 611727, 732906, 769932, 668666, 614991, 594070, 521560, 512597, 547532, 445549, 311149, 330783, 365719, 326028, 259499, 162636, 64098, -15983, -85848, -90268, -80249, -109539, -79025, -48417, 63320]
20132F3320O0791k2185M1620k0522O3574j20039n5584M8129o5757q176J26383
20121A11554M2437O7582M5985j44619j08780Q3079K2566p0235j685r2105m1360
20110h5581J9721Q3981J27302P5640k1379l0316j60717q71N2892o1877l5383p498
20098d4086r2255n4528j1526j04121K1378k1388O2437J60702M3239o8513n3539
20087a62200L5144M3034M1751L0549k9693J06048P7303m0614n5283N9874J32155
20076B38068k2387q9105M9924n1351m6086j2323j35710l3416J54592j5616m2192
20065e602l437K5240J27092J60152j7943m8135p0081o3221m8626l7884J2355M1958
20053G1868k6052m2507N3386J1894O8089l6026J2384n9259O930q5460M8241M2638
$$ y = [63320, 124111, 101926, 143546, 123024, 186598, 66559, 10975, 59104, -6653, -14829, 111554, 153991, 221573, 267558, 122939, 14159, 97238, 119804, 49569, 47884, -44221, -85581, -65860, 18121, 145423, 221063, 199684, 169368, 8651, 7780, 60672, -1205, -36588, -44086, -136341, -190869, -202395, -306516, -285138, -306526, -244089, -83387, -40148, -108661, -162200, -127056, -84022, -42271, -11722, -41415, 64633, 141936, 101322, 46039, 105913, 238068, 215681, 126576, 176500, 125149, 79063, 66740, -68970, -102386, 52206, 36590, -5602, -9039, 16201, 143293, 303445, 285502, 237367, 167286, 104065, 55439, 17555, 29910, 71868, 45816, 3309, 56695, 68589, 136678, 100652, 113036, 53777, 60707, -24753, 23488, 66126]
20041F6126K4768L470L3818M2008P5866n7168j60404j6934J14123k3584K4260
20030A26349R8064k8753Q5726K1519j8243N5436p61l9849K7349m3128J8847J2273
20018C14829Q4045j47384j62708k2178j1027O016J8418N2220P7181J2874j2583
20007B09703Q9371q6961l0347K9985J2228Q685K1707N4263L1323J4175j3171L52
19995C41313l6737R0622J01568N4318J2434p2647L610M7919O6029J33062j00218
19984F41273o2806R0702Q3435Q1114N0768J69230L4356L0241Q2936J68222K26159
19973A595630M4099m2577N988m0495L2578q432r3622J80129L38892M04911L40003
19962B757104M27978J78317J6333M1781m6111l5487R6226J86290K40903L15849
$$ y = [66126, 90894, 94364, 128182, 170190, 246056, 188888, 28484, 11550, 125673, 102089, 126349, 224413, 195660, 281386, 302905, 284662, 340098, 339337, 299488, 326837, 283709, 302556, 314829, 398874, 251490, 88782, 66604, 55577, 61593, 80011, 132231, 209412, 222286, 209703, 299074, 212113, 181766, 211751, 223979, 232664, 254371, 308634, 339957, 354132, 340961, 341313, 304576, 395198, 496766, 551084, 563518, 490871, 494481, 542400, 608429, 741491, 641273, 578467, 669169, 752604, 833718, 884486, 1053716, 1088072, 1118313, 1201249, 1369471, 1595630, 1639729, 1597152, 1603140, 1562645, 1595223, 1586791, 1493169, 1673298, 2012190, 2417101, 2757104, 3185082, 3363399, 3379732, 3421513, 3375402, 3339915, 3436141, 3622431, 3863334, 4179183]
19952D179183K75199K16660M14761O15877P41167P57056J015168J309501J575840
19943A1100412J810771K232852L067622M501317O540110J0222097J5886995K4587748
19935G9949924L3259704L0034119N634280k0803976k8178442k1537533j2969191
19928F5388885n770778L82587O963389J5622686K7383636L8067829L0225865n726976
19920A72537123l6616193l8889979k7484722j7332992j0795135o702496l929085
19913C0786521j782446j39984J305553L325782O067455J0381246J7499155K7896617
19905I5339899L8797244L2767205o53616l0638611l3823319k3114595j2612352
19898F6061855n009148J619447Q940897J7731920K8629874L5583657K2040957
$$ y = [4179183, 4454382, 4671042, 5085803, 5701680, 6442847, 7199903, 8215071, 9524572, 11100412, 12911183, 15144035, 18211657, 22712974, 29253084, 39475181, 55362176, 79949924, 113209628, 143243747, 148878027, 128074051, 99895609, 78358076, 65388885, 59618107, 60000694, 66964083, 82586769, 109970405, 148038234, 178264099, 172537123, 135920930, 97030951, 69546229, 52213237, 41418102, 34715606, 30786521, 29004075, 28864091, 30169644, 33495426, 39562881, 49944127, 67443282, 95339899, 134137143, 166904348, 166250732, 135612121, 101788802, 78674207, 66061855, 61052707, 62672154, 71613051, 89344971, 117974845, 153558502, 175599459]
19891A75599459j2526467l7029350l6779942k6222242j7091411j1125334p386649
19884B7438064m923779l458071k618107k080304j766396j549883j225625r23607
19876H892292q31731p74866o64343n14053m66805l60150l38983l84106k76883
19867D280372l2696L116N899l7562P722k56091m85126m22114k75636k61653r6907
19856B429324j29846N7372J25138J51251J31324j47111l05694l17338j90040j87439
19846A616941k46991j9715o2803j8620o9037j0181n6454j35984o3527j06634j7344
19835H09651k8781L3575K5901N6901k2606J217j30800q03m647k640M9645K8448
19823H15061L6207q3107p3108o4410l2555Q0010J57951K9110r0565m6474R411
$$ y = [175599459, 163072992, 126043642, 89263700, 63041458, 45950047, 34824713, 27438064, 22514285, 19056214, 16438107, 14357803, 12591407, 11041524, 9815899, 8892292, 8060561, 7285695, 6621352, 6107299, 5640494, 5280344, 4941361, 4557255, 4280372, 4247676, 4250792, 4256691, 4219129, 4226851, 3970760, 3485634, 3063520, 2787884, 2526231, 2429324, 2299478, 2356850, 2481988, 2633239, 2764563, 2617452, 2311758, 1994420, 1804380, 1616941, 1369950, 1350235, 1287432, 1268812, 1199775, 1189594, 1133140, 997156, 933629, 826995, 809651, 780870, 814445, 840346, 897247, 874641, 875858, 745058, 744255, 739608, 736968, 786613, 815061, 851268, 768161, 695053, 630643, 598088, 678098, 836049, 865159, 774594, 728120, 737531]
19812G37531J3474J00863M9541n7971j49006q7590J25362J3453J196Q1959o6260
19801G62552q9081m3311j8954j05469r6937J47538J29465k0490N1469J3545o8441
19790F61886q8953k495p3865q5176o7370K3142n485N3518m8513M0942M7049L3911
19778D88591J39478J72798J34411k8141k07369j12517k1050J42717O8369r3587
19768F83700n6077K0422M2351J7196J1571j1926k7456j35299J5793K3539k5742
19757E58072m3561L0608Q7692M9159k8004l637O0903O7257m4350m2475O04r557
19745F82711R9083j871q3338l801o4963M7913L4580K009J14143J20807N1445j90786
19733H07932j20234K04879R8083N445J6751Q1024K35795J18470K0180O9366m4549
$$ y = [737531, 751005, 851868, 901409, 843438, 694432, 606842, 732204, 745657, 746853, 828812, 762552, 673471, 630160, 611206, 505737, 408800, 556338, 685803, 665313, 716782, 730327, 661886, 572933, 570438, 496573, 411397, 344027, 367169, 361684, 415202, 366689, 407631, 454680, 488591, 628069, 800867, 935278, 907137, 699768, 587251, 566201, 708918, 777287, 683700, 627623, 648045, 690396, 707592, 719163, 707237, 679781, 544482, 560275, 583814, 558072, 514511, 545119, 632811, 681970, 653966, 650329, 711232, 778489, 734139, 691664, 692268, 682711, 781794, 779923, 696585, 692784, 627821, 675734, 710314, 712323, 826466, 947273, 998718, 807932, 687698, 892577, 990660, 996105, 1012856, 1093880, 1329675, 1448145, 1468325, 1537691, 1493142]
19722A493142J00994K01220J15099R6680J43313K58804M16352M81305M10398K87812
19712D005119O4495M7413K48945L54533L10862N39769P42493Q72980J039927J120217
19702I346753J230279J416346J865740K538418L507427N232009Q077007J2407850
19694D5621829J8950629K7395493L3572789K5723807k85855k3882467k8949784
19687I8146441k2172446j3599984o458445k69229O405872J4596135K4536456L1443364
19679A32628164K1126561q401744l0749744l2079573k3283930j5414215j0107888
19672C3717631o672353m548940l021930j866734j345408j127520q47285o47265
19664A3640196q44930q98335q19709m29586j19707K5003L28794N53678O53954
$$ y = [1493142, 1594136, 1795356, 1910455, 2007135, 2150448, 2409252, 2825604, 3306909, 3717307, 4005119, 4069614, 4117027, 4365972, 4720505, 5031367, 5571136, 6313629, 7186609, 8226536, 9346753, 10577032, 11993378, 13859118, 16397536, 19904963, 25136972, 33213979, 45621829, 64572458, 91967951, 125540740, 151264547, 150978692, 127096225, 98146441, 75973995, 62374011, 55915566, 55646337, 62052209, 76648344, 101184800, 132628164, 153754725, 145352981, 114603237, 82523664, 59239734, 43825519, 33717631, 27045278, 22496338, 19474408, 17607674, 16262266, 15134746, 14287461, 13640196, 12795266, 11896931, 11077222, 10647636, 10527929, 10552932, 10881726, 11435404, 12089358]
19655A2089358O18204O62647Q02829J056455J481930K125587L277272N200709
19647B7314991P981047J2500863J9624225K9833956L9784699L4384405K746474
19640A74170660k9064775l6091145k6782085j5944782p354798l66139O399893
19633F4966829J4352265K3534667K9929368K1448686n373771k8269127l2012792
19626H8576125k5024140j6946478j1276289p523119m983858l470597k335403j869727
19618A5146514j806853j556590j466574j138869r97126q55555o89547m55869k74633
19609E904898l40028k64082k98480m59689m61473l53949l94503l18289k94017
19600B720388j01610k8748q6041j16188k03588n8243O222j18560k17988j33770
$$ y = [12089358, 12707562, 13370209, 14173038, 15229493, 16711423, 18837010, 22114282, 27314991, 35296038, 47796901, 67421126, 97255082, 137039781, 171424186, 174170660, 145105885, 109014740, 82232655, 66287873, 58933075, 58566936, 64966829, 79319094, 102853761, 132783129, 154231815, 148858044, 120588917, 88576125, 63551985, 46605507, 35329218, 27806099, 22822241, 19351644, 17016241, 15146514, 13339661, 11783071, 10316497, 9177628, 8180502, 7324947, 6635400, 6179531, 5904898, 5564870, 5300788, 5002308, 4542619, 4081146, 3727197, 3332694, 3014405, 2720388, 2618778, 2590030, 2503989, 2387801, 2184213, 2125970, 2132192, 2013632, 1795644, 1661874]
19590A661874j09804p2534J03819n4116j35987l7449j96379j98047m750L8503
19580I95130r9712m5055j2177k8937n3804O1983N4844P3064k3400j77463r8471
19569F46002q610J18818M2478n7345n4117M4139O8184l606j41594j63171r3570
19558C97608j11401J30090J13405J9858l3782N672l9922K1130k6270k933j0957
19547D62498J9883J49M1730j4477q8669p5800O0101n5900J1578J25304L2064N191
19535E23652J138K9756j72522q8522K0458q3039p0608Q250J02094J02520n5354
19524C17823l2985J49579P8381o7738L6067J03037J1618k50398K1343R7587K2836
19513D87150O027j17675l6917q4717j09358q6711k8843L217P7836J07948K20937
$$ y = [1661874, 1552070, 1479536, 1583355, 1529239, 1393252, 1355803, 1159424, 961377, 956627, 995130, 895418, 850363, 838186, 809249, 755445, 817428, 872272, 945336, 921936, 744473, 646002, 637392, 756210, 798688, 741343, 687226, 731365, 799549, 795943, 654349, 491178, 397608, 286207, 416297, 529702, 549560, 515778, 521450, 481528, 502658, 476388, 473455, 462498, 482381, 482530, 524260, 509783, 421114, 345314, 405415, 349515, 361093, 486397, 518461, 523652, 524790, 554546, 382024, 293502, 313960, 230921, 160313, 168563, 270657, 373177, 317823, 284838, 434417, 512798, 445060, 481127, 584164, 595782, 345384, 366727, 464314, 487150, 493177, 375502, 338585, 253868, 144510, 57799, 28956, 32173, 110009, 217957, 438894]
19502D38894j8121o6168j9244J899O041R0571O2816j31052j54585r2609M3503
19491A61945N3745N7115J3999P833O1235O171j44186j64272l0510J38373K17249
19480C78697R7734J6735j42920k12026m4354j6649J0535J49467J32089p7187o2160
19469B29961p8591l3804l670Q2173Q8111m8784j85299r9329o2379L8901N0147
19458b2563L5076o3892P1626N9755J9478R825l3570Q8820J35454j8371k3566j21251
19446A36821j00396J6342K4246P792M9224o4510j7128l6999j9459P1428q0845
19435a3484M6480o5463P2673J34519J00403k6382j27639j25758j25108p1901o035
19424b07695j7577R3316J65223P2199J06444q24r0647l1949o76l2183P255J05122
$$ y = [438894, 420773, 354605, 335361, 337260, 343301, 433872, 496688, 365636, 211051, 118442, 161945, 215690, 272805, 286804, 294637, 355872, 362043, 217857, 53585, 23075, 161448, 378697, 476431, 493166, 350246, 138220, 93866, 77217, 87752, 237219, 369308, 292121, 229961, 151370, 117566, 113896, 196069, 284180, 235396, 50097, -49232, -111611, -72710, -22563, 12513, -51379, 20247, 80002, 99480, 109305, 75735, 164555, 300009, 281638, 258072, 136821, 36425, 52767, 77013, 84805, 134029, 69519, 52391, 15392, -4067, 67361, -13484, 32996, -32467, 40206, 174725, 275128, 248746, 121107, -4651, -129759, -201660, -207695, -225272, -131956, 33267, 105466, 211910, 211086, 120439, 88490, 87814, 55631, 62886, 168008]
19412A68008J4380K2640j4052j29441j01376L9243p2709m3624L6574P3716R854
19401C213j1304L8552P2296L5805p5279j60626l7578L5710N3330k0799j632J19531
19389E1219M9187K0187n830N666P0752P6234n6446K8542j3372j27550o4185L0536
19377F4940k1036p1655n670M0022Q5830Q6384J2164o3901p6682m0317j87346j19019
19365b96286Q4501K71398J17526J21895P3297L2234j5116j0151K1390M6412R3626
19354E40726P3352n946j51097l5592K6314m5979p1672l2531N4791R7173R752j3016
19342D46275m2313r911M956m2899m3828q5825L4247P4873l9235J1832k6757K6514
19330C07929J01528J56908J18033N0267r6P5719o0408J234p4012l4852r7780j86013
$$ y = [168008, 182388, 205028, 190976, 61535, -39841, -598, -73307, -116931, -80357, -6641, 3213, -8091, 30461, 102757, 138562, 63283, -97343, -134921, -99211, -45881, -66680, -68312, 51219, 100406, 120593, 114763, 120429, 191181, 267415, 210969, 239511, 226139, 98589, 34404, 64940, 43904, -27751, -33421, 6601, 92431, 178815, 190979, 127078, 50396, 10079, -177267, -296286, -211785, 59613, 177139, 299034, 372331, 404565, 389449, 379298, 400688, 447100, 540726, 614078, 608132, 457035, 421443, 447757, 401778, 330106, 297575, 352366, 449539, 459291, 446275, 403962, 394051, 399007, 356108, 312280, 226455, 260702, 335575, 296340, 308172, 281415, 307929, 409457, 566365, 684398, 734665, 734569, 810288, 749880, 751114, 677102, 642250, 544470, 358457]
19318C58457K7618J11637M7768J1617j2189J12372p6698q1833q8290l4194j13838
19307B62427r3189K9250j17407J631J2485O5629r0254p2432j21612q9591J48008
19296f5055O3723M5768P2363L735o0112O1846O1865j12050j18431j8844L3587
19285c1605J91423k6918j08664K8818Q6084j8086j82465o8494j5278M249N4132
19274h6804J54640K9073p9563J8249M749q8808L1115k3977l6312J5641O87k0791
19262h2101k8071j14430K0247J31752Q4937j7630m8663J06324k2182l9649m115
19251a3581M2769K9067n008J5004N362j15289K2285k4220p8593o267p8261k4487
19239b31219O3657Q2196q9960m5596J75733J02767o8585O6992k5202m898n0929
$$ y = [358457, 386075, 497712, 545480, 557097, 544908, 657280, 580582, 498749, 410459, 376265, 262427, 169238, 198488, 81081, 82712, 95197, 160826, 70572, -1860, -123472, -213063, -65055, -1332, 44436, 116799, 120534, 60422, 122268, 184133, 72083, -46348, -65192, -31605, 159818, 132900, 24236, 53054, 139138, 121052, -61413, -129907, -145185, -140936, -86804, 67836, 96909, 17346, 35595, 40344, -48464, -17349, -41326, -77638, -61997, -61310, -82101, -110172, -224602, -204355, -72603, 12334, -5296, -53959, 52365, 30183, -9466, -13581, 29188, 58255, 53247, 68251, 73613, -41676, -19391, -43611, -122204, -128471, -206732, -231219, -167562, -85366, -175326, -220922, -45189, 57578, -11007, 55985, 30783, 25885, -25044]
19228b5044J7772L4496P5374j8995n8841l7552n1161R724J69467P4771K769j56297
19216C6483j8617p9930n6719r271L2492O3900J01078j6412M5259p43k0347m0660
19204C6513o9118m8509k5660j7797N7916j01443q348k1167m030P0376J07253l1150
19192e5164M0084J7297M4612K2971q3217m8174m0466M5351q114j0428o8332K2673
19180a20907J70263k861k09612j7153J79056J13282j03358o1972L7789J1402P3893
19169F9822k0356j31395n717J00513Q3501P4141J00071J18152K0411P1255J22869
19158F03267M535j87926o7548o1015L776J2441N816J4232L8668J7174k1574p0328
19146B91518j59330j8445J49639J9563k03858k6317N2618J1868L2967O0918j37509
$$ y = [-25044, -7272, 27224, 102598, 83603, 24762, -12790, -63951, -54227, 115240, 190011, 192780, 36483, 17866, -62064, -118783, -128054, -95562, -31662, 69416, 53004, 98263, 97520, 77173, 36513, -32605, -81114, -106774, -124571, -66655, -168098, -176446, -197613, -201643, -131267, -24014, -55164, -15080, 2217, 46829, 69800, -13417, -61591, -102057, -56706, -64820, -75248, -143580, -120907, 49356, 46495, -163117, -180270, -1214, 112068, 8710, -53262, -15473, -4071, 69822, 49466, -81929, -87646, 12867, 96368, 170509, 270580, 388732, 409143, 480398, 603267, 607802, 419876, 352328, 291313, 295089, 307530, 313346, 327578, 366246, 383420, 361846, 291518, 132188, 113743, 263382, 282945, 79087, 52770, 105388, 117256, 150223, 211141, 73632]
19135G3632p4031j2311j06773M7045M7762P5822j759o105m6289j42327k7414l8668
19123b11416N860N383R0553Q6446J4407J62854N4132P9588J01173N4858P3738
19112E17576K7995l2303l5903k0997j242m8497r6805l0324O3667N2833N3551o43
19100D48908J13659m9617l8591j08511j09111L700j7321r1503j13365o1949J5045
19089h656j3737q1213K6596J12469L1762m9702M1993K5496R99n5367M6524N559
19077H2723r6096N4798r3384j2274Q1087J6192j24337K5587K0306l5467j14827
19066a95692K2994O2726O1495J07770J56055J14976N0851q1679o3012k0010P8761
19055B95235k697q5594j71386j11722J16412R0790N1953n8651j8921R6714m3108
$$ y = [73632, -399, -12710, -119483, -72438, -24676, 51146, 49387, 43282, -3007, -145334, -172748, -211416, -205556, -200173, -109620, -23174, -8767, 154087, 208219, 287807, 388980, 443838, 517576, 545571, 513268, 477365, 456368, 455126, 406629, 309824, 279500, 343167, 396000, 449551, 448908, 562567, 512950, 474359, 365848, 256737, 260437, 243116, 151613, 38248, -23701, -8656, -22393, -103606, -77010, 35459, 67221, 17519, 59512, 85008, 86007, 30640, 77164, 82723, -13373, 41425, -51959, -64233, 16854, 33046, -91291, -65704, -45398, -80865, -195692, -172698, -109972, -48477, 59293, 215348, 330324, 381175, 299496, 236484, 216474, 295235, 292538, 206944, 35558, -76164, 40248, 131038, 182991, 124340, 105419, 202133, 159025]
19044A59025J1021j3569K857P1075L2971R7339k207L4723N2074Q4979O2363N0534
19032F43185J82234o4275j02270r6532j55916o9790k2982P2698K4595O3941J28247
19021F03135Q4546O7987p0698j57121k2916R0387P336j934l8419p9870m1421l9947
19009D01065l5646Q2843P2591N5981n4041M4441N3074M3659N4944J16977M4005
18998H79893J22205p727j563L9915k3573j45380j73565j69275j15179m2954M8972
18987D11769m3557O8006L7121R4016J24172J19969j12293j07926k1927o6782m5954
18976D56614j424l6918P172O6383O9514J30127l6185q0538o4488L4610r0178m9069
18964D05620m459M5454K3524N3481J761k9139m448q1428J08357m5752r9294l5891
$$ y = [159025, 170046, 156477, 159334, 230409, 263380, 360719, 358512, 393235, 445309, 530288, 592651, 643185, 825419, 761144, 658874, 562342, 406426, 336636, 313654, 386352, 410947, 474888, 603135, 687681, 755668, 684970, 527849, 504933, 595320, 602656, 600722, 562303, 482433, 441012, 401065, 365419, 448262, 520853, 576834, 522793, 567234, 620308, 663967, 718911, 835888, 879893, 1002098, 994371, 992808, 1032723, 1009150, 863770, 690205, 520930, 405751, 362797, 411769, 368212, 436218, 473339, 567355, 691527, 811496, 699203, 591277, 569350, 502568, 456614, 455190, 418272, 425444, 491827, 561341, 691468, 655283, 574745, 510257, 544867, 454689, 405620, 401161, 446615, 470139, 523620, 525381, 496242, 491794, 410366, 518723, 472971, 373677, 337786]
18952C37786n4501k2212q1071M278O0448M8044J48301O0806k4278K5756M8725
18941E52082l8669k938j09000r8627l2023n6425K5735j4731J27663J40582R4859
18930E88508R139l8924j34454m3098N9319P9129M1715k1825K827o8014o2823O5139
18918D76638J9446K3875O9808K6821K7042P4220J9263J2450p6855P0359J06278
18907H49345o3461L2621P4670R5748J30870m6206j4866j07774j62068p7880P1523
18896G82522L3819o4027l5422J00700J41827n9307j24919j06496m0715l5758q9936
18885E02288m3368J19703l9264o2904M2257r6332n2622N2774J16516K0402r2807
18874D66643o251J9222L0460J08211o7653o6981l6326J01642L4411r3907q4536
$$ y = [337786, 283285, 261073, 180002, 184280, 244728, 292772, 441073, 501879, 477601, 503357, 552082, 513413, 510475, 401475, 302848, 270825, 214400, 240135, 225404, 353067, 493649, 588508, 597647, 558723, 424269, 381171, 440490, 519619, 561334, 539509, 542336, 474322, 411499, 476638, 496084, 519959, 589767, 616588, 643630, 717850, 737113, 749563, 672708, 743067, 849345, 785884, 818505, 893175, 988923, 1119793, 1073587, 1058721, 950947, 788879, 710999, 782522, 816341, 752314, 716892, 817592, 959419, 900112, 775193, 668697, 627982, 592224, 502288, 458920, 578623, 539359, 476455, 518712, 422380, 369758, 422532, 539048, 559450, 466643, 460392, 479614, 510074, 618285, 550632, 483651, 447325, 548967, 583378, 489471, 404935]
18863D04935L540K4882n6350l3436j5747j6630K6103P1538k0695K5312M9013Q0475
18851E42940N9151L8961O7832O3311j23100j22632p9610j39306r5541n7835j9392
18840A34779N066j5511j468m2472m9054l3969j03227N8919J23002Q3419p7002
18829H2482J3086M6268j9427l1624o5080n7382J12123j21454p6497L961J00221
18818a3323k793j09312J4336n252k5555r398j6343K0978J11342R8257O7922O3044
18806A93903j72297j1419M342K9808J28201j20413j12624j9303K4203O990k1118
18795f9727K2468M0179m2336J7993p5336n2377k4399R256k7898j69278Q1798R2978
18783a96679J991J37914J13536L9381p1157m502k6909P943r304O1433o9368r6006
$$ y = [404935, 408475, 433357, 377007, 343571, 327824, 311194, 337297, 408835, 388140, 413452, 462465, 542940, 602091, 641052, 708884, 772195, 649095, 526463, 446853, 307547, 212006, 154171, 134779, 139845, 124334, 122866, 80394, 31340, -2629, -105856, -46937, 76065, 159484, 82482, 95568, 141836, 122409, 90785, 25705, -31677, 80446, -41008, -117505, -113544, -13323, -16116, -125428, -111092, -116344, -141899, -151297, -167640, -146662, -35320, 62937, 130859, 193903, 21606, 10187, 14529, 44337, 172538, 52125, -60499, -79802, -55599, -48609, -69727, -47259, -7080, -49416, -31423, -106759, -159136, -183535, -174279, -202177, -371455, -289657, -196679, -194688, -56774, 56762, 96143, 24986, 20484, -6425, 1518, -7786, 53647, -15721, -111727]
18771a11727j7341N3131K615j3178J33885O1111q7971n8705J07645O1336j59484
18760b8683j56554j2740J65179J59000N43n0335j46787p5904R2213J62971J8633
18749A27536K3486n5544o1376O3961J42081l0563j3319q437j59909j51721r8202
18738b22007p8178J33024L8092o817J33625R1491L0210K7840k6011p9534n3692
18727a1957o9772M3071K30878k597j11541j13440O3652N198M7721L7254p8660
18716C9807k0635o0960N6199L7512M2414J16537r3990k9519j03910l5659K8739
18705b3465m3445R5514J08242Q329o6177L5309L2239n1064q7106N2693J4136o7088
18693H117q9910R4364j411r9508j23917O4424J51043R3304n6004j1984J61283
$$ y = [-111727, -129068, -75937, -73322, -86500, 47385, 108496, 20525, -38180, 69465, 130801, -28683, -185237, -197977, -32798, 126202, 126745, 76410, -70377, -146281, -54068, 108903, 127536, 151022, 95478, 34102, 98063, 240144, 209581, 196262, 187825, 27916, -123805, -222007, -300185, -167161, -129069, -135886, -2261, 89230, 119440, 147280, 121269, 41735, -11957, -81729, -38658, 192220, 189623, 78082, -35358, 28294, 33492, 81213, 118467, 39807, 19172, -41788, 14411, 51923, 94337, 210874, 116884, 87365, -16545, -52204, -23465, -66910, 28604, 136846, 145175, 78998, 114307, 146546, 95482, 8376, 61069, 75205, 8117, -81793, 12571, 11160, -88348, -212265, -147841, 3202, 96506, 40502, 28518, 189801]
18682A89801Q4460R8616j16726j21889o3598M6416K4683N0134k1252P9020Q5203
18671C34868j06616J9652J18502P4453l7884n5542l9809n388n3285r688J50758
18660C90021P2001J3453N899L9982n327n6696l6967J05152J11030m9127l2727
18649E56694J2286O0322m5628q2465o5786K6960j2519n4853N4673J69335o5280
18638E53739J0147J90712J05297o14O1586l1213j66898k09085p4194K904o9806
18627C72575O9773Q3002j0212j03900k9636Q7995k5599l7126Q4418J8854l5453
18616D74691q0642n6694L2998J29662L4217P4095P6070q8146r2411J23513K73972
18605I01325J25948O485p6953j11210r7056o9021k5827Q7767N9162j52368j58843
$$ y = [189801, 274261, 372877, 256151, 134262, 70664, 117080, 141763, 191897, 170645, 249665, 334868, 228252, 247904, 366406, 440859, 402975, 347433, 307624, 302236, 248951, 239263, 390021, 462022, 475475, 481374, 521356, 516029, 459333, 422366, 527518, 638548, 589421, 556694, 568980, 629302, 583674, 501209, 435423, 462383, 449864, 395011, 449684, 619019, 553739, 563886, 754598, 859895, 859281, 920867, 889654, 722756, 513671, 439477, 442381, 372575, 442348, 525350, 515138, 411238, 381602, 469597, 443998, 406872, 491290, 510144, 474691, 394049, 337355, 370353, 500015, 534232, 608327, 684397, 596251, 503840, 627353, 901325, 1027273, 1033758, 956805, 845595, 748539, 679518, 653691, 741458, 800620, 648252, 489409]
18594D89409n4995R5660J44731m822J27759J64773N7586n1309M5709J29986L1934
18583A176421n1845r3710q2701o5375L5751J5555k935n0052M0415Q3697N5808
18572A061029R4315L4200L9687R3468K73266L07029K72911K04231K20614Q6771
18562B687521l0175J5693K27600N27794P53095R32885J265288J334902R87018
18553H701621Q9838o05447q92212p29648m34470p4045K07446L00931P24782J428423
18543H717219J895979K182757K143939J724310Q37993M05416J217129K863226
18535B1987968M772415N965114O622095Q877504J3088302J4547826P734791m703448
18527G8892567j2207230j0816772o591614m118021l067531j154847K263610O738654
$$ y = [489409, 434414, 530074, 674805, 669983, 797742, 962515, 1020101, 968792, 1014501, 1144487, 1176421, 1124576, 1030866, 948165, 882790, 918541, 934096, 931161, 881109, 921524, 1005221, 1061029, 1155344, 1189544, 1229231, 1322699, 1595965, 1902994, 2175905, 2380136, 2600750, 2687521, 2657346, 2673039, 2900639, 3428433, 4181528, 5114413, 6379701, 7714603, 8701621, 8791459, 8186012, 7293800, 6564152, 6129682, 6055637, 6263083, 6564014, 7288796, 8717219, 10613198, 12795955, 14939894, 16664204, 17502197, 17907613, 19124742, 21987968, 26760383, 32725497, 39347592, 48225096, 61313398, 75861224, 83596015, 78892567, 66685337, 55868565, 49276951, 45158930, 42091399, 40936552, 43200162, 49938816]
18519D9938816J0610258J0159206M530302R7704J75910k10890k211624j637546
18511G1452136L584136J2157348K1281367K2371843Q063618q657754j4323851
18504A15928843j2437233p408082j288364J178922j705134l587176R01945Q251294
18496I9835015J1881670P386566q26514p732689j0653863p950053j265409P068453
18488I7743176J6834783K7051281K8682537J7033093M235784o264560j9285932
18481A66030162k5474735j9262607p400831N454589J7151365J9835862N009963
18474A61343768j2026196j2568265m03202J4265820K6772064L4999538L6327770
18467B48711297K5781063N424768j8597128l7614471m1846972l2536750j9101893
$$ y = [49938816, 60549074, 70708280, 75238582, 75336286, 75512196, 75301306, 73089682, 71452136, 75036272, 87193620, 108474987, 130846830, 138910448, 130252694, 115928843, 103491610, 96083528, 94795164, 95974086, 94268952, 90681776, 91583721, 99835015, 111716685, 119103251, 118276737, 110544048, 99890185, 91940132, 90674723, 97743176, 114577959, 141629240, 170311777, 187344870, 191580654, 185316094, 166030162, 140555427, 121292820, 113891989, 119346578, 136497943, 156333805, 161343768, 149317572, 136749307, 136346105, 150611925, 177383989, 212383527, 248711297, 274492360, 279917128, 261320000, 223705529, 181858557, 149321807, 130219914]
18460A30219914r154205o855042q592600p724752l358798j460734n024594r073889
18452G8975300q066268l824978j833334l343343l909787r91209L527229P511429
18444F8045039R227346P060593J959212m415887p673331n766516j826636J680612
18436F8290432O028087J1639876J5343158J1863681N211473J08709o401214j2042855
18428A00041347j1796979o651468J09500P888364J7186443K7220360L1515322
18421A65512889J9617215O43864m927006J812070O396617J1066247K4843141M5109586
18413B70074623N6577083M9471129L3379635J5458750o008684k6357218m2125885
18406C50469433m8482738l8925127k0234511p039426p547165j3022475j2264241
$$ y = [130219914, 121065709, 114210667, 105618067, 97893315, 94534517, 93073783, 88049189, 78975300, 70909032, 67084054, 65250720, 61907377, 57997590, 57006381, 60533610, 68045039, 77272385, 84332978, 86292190, 81876303, 74202972, 68436456, 66609820, 68290432, 74318519, 85958395, 101301553, 113165234, 118376707, 118485416, 112084202, 100041347, 88244368, 81592900, 81702400, 89590764, 106777207, 133997567, 165512889, 185130104, 185773968, 180846962, 182659032, 189055649, 200121896, 224965037, 270074623, 326651706, 376122835, 409502470, 424961220, 418952536, 392595318, 350469433, 301986695, 263061568, 242827057, 235787631, 228240466, 215217991, 202953750]
18399B02953750r735395q960391l628254O538454J5575891J8801696J8183943
18392B39729694J7929014J9422574K3155933J8771681n140431l3277404m2198395
18385B38392666l0719712j3819635l996511k635785j870538M11296o606350k1407036
18377A57748395k7440477k1509889j2566087m280073L542566J2897254K6194529
18370A34586218M2768992N1863484K7216673k3745206n2444052m6753746l0279694
18363A03212669j6565092p636875l494667k738894j676491m62131m037943r949772
18355E6650804j1102885q346558n337714l175982j718451j013871p41372j50440
18347B5063531O01781O18221n10227j768132k451766k404815k211859j801648
$$ y = [202953750, 193218355, 184257964, 180629710, 187168164, 202744055, 221545751, 239729694, 257658708, 277081282, 300237215, 319008896, 313868465, 280591061, 238392666, 207672954, 193853319, 189856808, 187221023, 185350485, 185761781, 179155431, 157748395, 130307918, 108798029, 96231942, 91951869, 95494435, 108391689, 134586218, 177355210, 229218694, 256435367, 232690161, 180246109, 133492363, 103212669, 86647577, 79010702, 75516035, 72777141, 71100650, 70638519, 66600576, 56650804, 45547919, 37201361, 31863647, 28687665, 26969214, 25955343, 25213971, 25063531, 25665312, 26283533, 25773306, 24005174, 21553408, 19148593, 16936734, 15135086]
18339A5135086j558515j335059j088026p70825n23863n03569o96204p22191n87697
18330G349137m99657l89007l18446k91038k63216j59126j34934j10795j28616
18321E054302j43174R882j00207r2597j21769j68236q5172p9253p2460o4390j62898
18310C974028r6492r6835j59957l9539N1987j68203j15549j70026j77215o8559
18300B933640j13388l4507J8018p8649j68467n919J46303K7602k4017j16180n5311
18289B529125N2645N306N340P691m6724o0960j05215k3570L867r667j48978m5545
18277B163315L7516o9180j31993R0155K09075M6954j15007j06326o4550n1412
18267B008547k3192o639j7053M769r5173j29361L0335R421m8666k2590K8775o3375
$$ y = [15135086, 13576571, 12241512, 11153486, 10382661, 9858798, 9355229, 8659025, 7936834, 7349137, 6849480, 6460473, 6142027, 5850989, 5587773, 5428647, 5293713, 5182918, 5054302, 4911128, 4921010, 4820803, 4728206, 4606437, 4438201, 4353029, 4273776, 4201316, 4136926, 3974028, 3877536, 3780701, 3620744, 3581205, 3633192, 3464989, 3349440, 3179414, 3002199, 2933640, 2820252, 2785745, 2803763, 2725114, 2556647, 2550728, 2697031, 2724633, 2700616, 2584436, 2529125, 2581770, 2587076, 2592416, 2600107, 2553383, 2492423, 2387208, 2363638, 2367505, 2357838, 2208860, 2163315, 2200831, 2131651, 1999658, 2089813, 2298888, 2345842, 2230835, 2124509, 2059959, 2008547, 1985355, 1978716, 1961663, 1966432, 1871259, 1741898, 1772233, 1781654, 1732988, 1710398, 1739173, 1675798]
18255A675798q1690o0981O4981Q5125j41851j71377o4931M4657M6747j3724O1515
18244A444269p8203K2431J26775O1493p907j14219j03216l8775k399l640j00222
18233A206387j29458P5131P4122N7678R8134K9433j90386p5991q835m5290p2251
18222A018674O2792O4304p2269l1076R8749j10692j01437k5157k6624K5869j9628
18211H83505l1153J97790L6471j15531n4765n1963J24944M7157r2023l1915R1872
18200A004389m6313j4048L2846l1186j2202j5022l8047L796p9522K4869j8900
18189H10660M7266j855n7128p0662n5543O8575L8802P3276J58012J1500n2290
18178I70613J8404M6942p3954j24565P6498j0229l2958j45301M4958J02515l3599
$$ y = [1675798, 1594108, 1533127, 1598108, 1683233, 1541382, 1370005, 1305074, 1349731, 1396478, 1382754, 1444269, 1366066, 1388497, 1515272, 1576765, 1568858, 1454639, 1351423, 1312648, 1310249, 1306609, 1206387, 1076929, 1152060, 1226182, 1283860, 1381994, 1411427, 1221041, 1145050, 1136215, 1090925, 1018674, 1081466, 1145770, 1073501, 1042425, 1141174, 1030482, 929045, 903888, 877264, 903133, 883505, 852352, 1050142, 1086613, 971082, 916317, 864354, 989298, 1036455, 944432, 912517, 1004389, 958076, 944028, 976874, 945688, 933486, 918464, 880417, 884213, 804691, 829560, 810660, 857926, 856071, 798943, 728281, 672738, 741313, 780115, 853391, 1011403, 1022903, 970613, 989017, 1035959, 962005, 837440, 913938, 903709, 870751, 725450, 770408, 872923, 839324]
18167H39324J626O8583q7430n018n5213M3675J39089J38479P0944o1293k2035
18156A070731q3957p3820K7736O2277M8094O0351m035K3238O1788M1019n8374
18145A175048q563Q8944J20461m6383n1040N5312J69910m3739M7699N2297P3135
18134A633081J31392J2071J1952J11946J86111K29235L04722L64783K45323K57714
18124C488330K46163J43225N5795J30978K55276M41142N59546O93746Q21854J021222
18114G857277J370413J878398K436874L456875N102247P575386J1577842J8117729
18106E9373041K8036963L8496723L4733214L459421k9471804l7252409k8712417
18099F8662732j8894999j2152784p988930n322914l679887k724079j987326j429082
$$ y = [839324, 840950, 909533, 822103, 817085, 761872, 805547, 944636, 1083115, 1154059, 1092766, 1070731, 986774, 912954, 940690, 1002967, 1051061, 1111412, 1107377, 1130615, 1192403, 1233422, 1175048, 1166485, 1255429, 1375890, 1329507, 1278467, 1333779, 1503689, 1459950, 1507649, 1559946, 1633081, 1764473, 1776544, 1788496, 1900442, 2086553, 2315788, 2620510, 2985293, 3230616, 3488330, 3734493, 3877718, 3933513, 4064491, 4319767, 4760909, 5320455, 6014201, 6836055, 7857277, 9227690, 11106088, 13542962, 16999837, 22102084, 29677470, 41255312, 59373041, 87410004, 125906727, 160639941, 164099362, 134627558, 97375149, 68662732, 49767733, 37614949, 29626019, 24303105, 20623218, 17899139, 15911813, 14482731]
18091A4482731j147161n72508k82272r5499L6500K99789P96029J217974J703036
18082A6438619K377143L291843M973129P614377J1827363J8767967K8417681L6983898
18074A30692020K9648692k026668l0403331l4767872k5847068j6823780j0755712
18067C9716281o890339m240709k485777j089342K74401J719947L498696N836991
18059C6340149R438250J5287459K4338975L4463338L3264060O534038k5528139
18052A34138130l5629387k8452455j9158814j2405762q089504n449830l738549
18045B1213829k807052k123289j435119r27136o71539n37447m94161j77533K51724
18036A2292277O99264J002484J371642K026980K840330M286240O540233J0290232
$$ y = [14482731, 13335570, 12763062, 12480790, 12385291, 12421791, 12721580, 13517609, 14735583, 16438619, 18815762, 22107605, 27080734, 34695111, 46522474, 65290441, 93708122, 130692020, 160340712, 158314044, 127910713, 93142841, 67295773, 50471993, 39716281, 32825942, 28585233, 26099456, 25010114, 25284515, 27004462, 30503158, 36340149, 45778399, 61065858, 85404833, 119868171, 153132231, 159666269, 134138130, 98508743, 70056288, 50897474, 38491712, 30402208, 24952378, 21213829, 18406777, 16283488, 14848369, 13921233, 13249694, 12712247, 12218086, 12040553, 12292277, 12991541, 13994025, 15365667, 17392647, 20232977, 24519217, 31059450, 41349682]
18028D1349682J6647767K6306398L6451542L1990516P56514l0386279l5899455
18021H7216685k6584437j7228447j1134169p322666m941860l454637k572730j879926
18013A2097813j450841j193620j034378p52715n43919m06106l73583k33352j65626
18004E943673k17626m20764l79306k57706l08121l58782j80265j54367j46951
17995C519785L441j59672j72795k02133n7872n6718j94403j21493K6903n2977
17985B532066k6005q4001J67785P314K7715j73319j857J0778K326m3106j78522
17974B241174j64432N8712P2870j76523k21567J46291J73409J3320j03603k43226
17964A796425p0083k4120l0308J10220M1848m4430p1069n5812n0031K8719q4222
$$ y = [41349682, 57997449, 84303847, 120755389, 152745905, 153502419, 123116140, 87216685, 60632248, 43403801, 32269632, 24946966, 20005106, 16550469, 13977739, 12097813, 10646972, 9453352, 8418974, 7666259, 7122340, 6716234, 6342651, 6109299, 5943673, 5726047, 5305283, 4925977, 4668271, 4360150, 4001368, 3821103, 3666736, 3519785, 3523226, 3363554, 3190759, 2988626, 2930754, 2874036, 2679633, 2558140, 2585043, 2532066, 2506061, 2422060, 2589845, 2597159, 2624874, 2451555, 2449698, 2460476, 2462802, 2419696, 2241174, 2076742, 2135454, 2208324, 2031801, 1810234, 1956525, 2129934, 2143254, 2039651, 1796425, 1726342, 1702222, 1671914, 1782134, 1823982, 1779552, 1708483, 1652671, 1602640, 1631359, 1547137]
17953A547137n9165k8193J25318J77320P999J763J13424K9062j16608l5646L7887
17942A800298k9129r4856Q219j9335k2083R5068M4475R9554L8947p4156m7259
17931A799743p3202r800q1726j19757o2972n1529n085K5713O49k2658m9729m0748
17919A308899O1163r480j06326o0700L9556N0212o3666P361k0903J12140J80389
17908A498645J10415r8166j38582k9252J1358p5818j10843p2562J96138n7764
17898A233569r8838M0469O6788L8084j25109K2732J35891L9782R0186P7418P2047
17887A593019Q4831Q873M3782M0107m2687J06893K6115m8514N7543o136k00325
17876A663501k21123j28448q7383j22464p1233P121L6725L9638J39336J37532
$$ y = [1547137, 1487972, 1459779, 1585097, 1762417, 1770416, 1772179, 1885603, 1914665, 1798057, 1762411, 1800298, 1771169, 1676313, 1684532, 1665197, 1643114, 1738182, 1782657, 1882211, 1921158, 1847002, 1799743, 1726541, 1716741, 1635015, 1515258, 1452286, 1400757, 1395672, 1421385, 1422034, 1399376, 1349647, 1308899, 1370062, 1360582, 1254256, 1193556, 1233112, 1283324, 1219658, 1227019, 1206116, 1318256, 1498645, 1609060, 1510894, 1372312, 1343060, 1354418, 1278600, 1167757, 1095195, 1291333, 1233569, 1134731, 1175200, 1241988, 1280072, 1154963, 1177695, 1313586, 1353368, 1443554, 1520972, 1593019, 1677850, 1686723, 1730505, 1770612, 1727925, 1834818, 1860933, 1812419, 1869962, 1863826, 1663501, 1442378, 1313930, 1226547, 1104083, 1032850, 1039971, 1076696, 1116334, 1255670, 1393202]
17866A393202j9836q6870J0908J1478p9681p5514q8537K3546K569n8080R1225
17855A124410J11115r7676j88181p5891q7167l9735K4835L979o2087J04886K36976
17844A055464J36316j5055o7997r9817q92j25615r2236l4170O5853l8020j6190
17833G67641K0399N9697N7257J6406J11001k2953l4097l8745n4158k3387P8453
17822I37514K4090j64451k50521o1731k1287j6116L0729n46n9736k7649K5289
17811D15585O0368k3090K9693k1058o3532m6341J655l2102L5044l8878j34865
17800A82479k1993L6598J22461J9833J425J5261n5036q264J06312N1373Q5354
17789E35803L4213j9120l523n2981r5245p0469K7668L1807k8281N9650q05p7810
$$ y = [1393202, 1373366, 1286496, 1297404, 1308882, 1229201, 1153687, 1065150, 1088696, 1091265, 1033185, 1124410, 1235525, 1137849, 949668, 873777, 786610, 746875, 771710, 775689, 713602, 818488, 1055464, 1191780, 1176725, 1108728, 1008911, 1008019, 882404, 790168, 755998, 821851, 783831, 767641, 788040, 847737, 904994, 921400, 1032401, 1009448, 975351, 936606, 882448, 859061, 937514, 961604, 797153, 546632, 484901, 463614, 447498, 478227, 477681, 417945, 390296, 415585, 475953, 452863, 482556, 461498, 397966, 351625, 353280, 321178, 356222, 317344, 182479, 160486, 197084, 319545, 339378, 340803, 356064, 301028, 292764, 399076, 450449, 535803, 570016, 550896, 547373, 494392, 399147, 328678, 356346, 388153, 359872, 419522, 418717, 340907]
17777C40907r9072L744R195O5170j4778l0116n2813J13834j11695l9123k7284
17766A57969Q7001P5013M5798m8548m5409q3598o5342o8921L4015Q1762p73K9605
17754A98572K861k3703R2125R7602p54j45590n4373J58184J24826J6712j03485
17743C62977j10525j6693Q4985R6117K3314j31135n9776O6225M1797L5735J8031
17732D11052r3183j55180p9960k3880K7499l705L9565O401R720M6386P2582m9032
17720B08265k2352Q4229N347J6021Q8920K1203N141n3637k3605o3004P1618m3163
17708B94983q2947m3838R776J2222n0950j9644n8955R3739P7185O9859j01577
17697A99853j10587n1528P4705N3466m1646K3141N4622L332M3797n7163Q5261
$$ y = [340907, 241835, 245579, 254774, 319944, 305166, 275050, 222237, 336071, 224376, 185253, 157969, 244970, 319983, 365781, 317233, 271824, 188226, 122884, 53963, 87978, 169740, 168967, 198572, 201433, 177730, 269855, 367457, 366703, 221113, 166740, 324924, 449750, 466462, 362977, 252452, 235759, 320744, 416861, 440175, 309040, 249264, 315489, 357286, 393021, 411052, 317869, 162689, 82729, 58849, 86348, 82643, 122208, 128609, 138329, 184715, 257297, 208265, 185913, 270142, 275489, 291510, 380430, 401633, 406774, 353137, 329532, 266528, 338146, 294983, 212036, 168198, 177974, 190196, 139246, 119602, 60647, 154386, 231571, 301430, 199853, 89266, 37738, 112443, 165909, 124263, 147404, 202026, 205358, 249155, 191992, 277253]
17686B77253J14034l858p9299J9436L9792Q0931j12398j36035j2527L0146O9979
17675B87454L0286n6570o9017q4595L393O241L3575m5947m450O7989N5759n5540
17663A68578r2078n0412J11372N7787q0462R6719J38340J5126p4588j95691K9844
17652A24535M2455N1394P327r0616K5610k0972o889k17K8899J1814N3476L4455
17640B61271J4146j64301j23467K3943J45543J04793n7786j4904K5704q7954r5969
17629C1019P6254L7546Q7712P8840j13080k0154M3463l0636K14431o5974j96701
17618A42720n7867p0616j00995l2731J30514J50125K7451O5444m5184O8306R000
17607B86167j8137J1176N471n6100j12476q4547J0224K2745K0711J6005J08442
$$ y = [277253, 391287, 387429, 308130, 327566, 367358, 448289, 335891, 199856, 187329, 217475, 287454, 317740, 261170, 192153, 107558, 110951, 117192, 150767, 104820, 100370, 168359, 224118, 168578, 76500, 26088, 137460, 195247, 114785, 211504, 349844, 364970, 290382, 94691, 124535, 166990, 218384, 225711, 135095, 160705, 139733, 132844, 132627, 161526, 173340, 226816, 261271, 275417, 111116, -12351, 11592, 157135, 261928, 204142, 189238, 214942, 126988, 31019, 107273, 144819, 232531, 311371, 198291, 178137, 221600, 190964, 405395, 339421, 142720, 84853, 14237, -86758, -119489, 11025, 161150, 188601, 254045, 208861, 277167, 286167, 268030, 279206, 284677, 228577, 116101, 31554, 41778, 64523, 85234, 101239, 209681]
17596B09681o6608J1157J23772K6860j02062r7194Q7796L2567q0204j32800m179
17585H786N5302M0634J40024R7214k5797j9455N606J04988k6353n5530j7733J0249
17573C17935P4236R0849O3555j27469J10271J32063N593m2262o9051K267J1096
17562E69083j45067j90193k705Q5503n095p1335k9281m8426p5006n231Q1459L9316
17550B03022J33725R4431J7321l2468j99789j4368O2726j919J07620J42063O5838
17539E78202r196L3771J01027J5815q1406n4692m1649j36865R0303J23249r2344
17528E26215p8579P2483j39354p6946M0901P9953Q6794J31717R185N2019K0424
17517G24812M0914J3429n1063j01876M4471p5274j07456r1738j27886l512l04
$$ y = [209681, 143073, 154230, 278002, 304862, 202800, 105606, 193402, 225969, 145765, 12965, 8786, 64088, 104722, 244746, 341960, 316163, 296708, 302314, 407302, 380949, 325419, 307686, 317935, 392171, 483020, 546575, 419106, 529377, 661440, 667033, 624771, 555720, 557987, 569083, 424016, 233823, 231118, 316621, 311526, 240191, 210910, 162484, 87478, 82247, 163706, 203022, 336747, 431178, 448499, 416031, 216242, 201874, 264600, 262681, 370301, 512364, 578202, 569006, 602777, 703804, 719619, 638213, 583521, 541872, 405007, 495310, 618559, 526215, 447636, 520119, 380765, 303819, 344720, 424673, 511467, 643184, 652369, 704388, 724812, 765726, 779155, 728092, 626216, 670687, 595413, 487957, 396219, 268333, 264821, 264517]
17506B64517K2674J8188P355O6819J8809m7148J7894M1589R991q1053p0657M7006
17494C15984K5479P4713P2610O9864R0055L8673k9112p060m7116o0431j67482
17483C76177j89389N9571m6954j4705Q1454k1816r4560j6920N5018J05131N4749
17472C47756j56561M598j1944M4748n5539p667l0864O2624o0718O1846L9511J0814
17460B48604j13241l5701J4666K9903l8143J01442l5463j93R1065l1712r8407
17449A32820r2045L0414L1571N7739P8321j7822j01453m5348n9680L4930r2196
17438d2749J1472P1473l0145q4916j3869O5920J55505J69562o3580n8925m8201
17427A31547l8166K1634K2702j9193j4668R9134k5207m3661Q199j9926o1635O6324
$$ y = [264517, 287191, 305379, 312734, 379553, 398362, 351214, 369108, 410697, 420688, 339635, 268978, 315984, 341463, 416176, 488786, 558650, 648705, 687378, 658266, 651206, 604090, 543659, 376177, 186788, 246359, 199405, 184700, 266154, 244338, 149778, 132858, 187876, 293007, 347756, 191195, 195793, 183849, 228597, 173058, 165391, 134527, 197151, 136433, 198279, 237790, 248604, 135363, 99662, 114328, 144231, 106088, 207530, 172067, 171874, 262939, 231227, 132820, 40775, 71189, 102760, 160499, 238820, 220998, 119545, 74197, 14517, 49447, -42749, -31277, 40196, 10051, -74865, -88734, -22814, 132691, 302253, 238673, 179748, 131547, 93381, 115015, 137717, 118524, 103856, 202990, 177783, 134122, 142321, 122395, 60760, 127084]
17415A27084N2820K1104K7398l4047K0277q2055N5206p263k0802N2639R4521j3891
17403B92991l3262p098J0057j11657M0138N2857J32647P4305r8929j71403l1469
17392A49177O2184k8949k3511Q1754N6866j36874m4776Q1863L1584j02906n8018
17381F8394N8840J391J6737j2436r890l09n0742n6951N329P4653O1055o3869R64
17368I3166J59160J03193j00391j06639j41992k8066Q7475O4656j2311P8119K3150
17357B19520k9908q6286J9695L8872k8698L800K3936K131j0961O7064L0842k3142
17345B26865p2070K2720P222M9972q5167j2528N8231r9970j3779J0303M7875K0276
17333A59950K6705K4874j19292j29088J2662J11223Q2533k4904n0345p9771j44008
$$ y = [127084, 179904, 201008, 228406, 194359, 214636, 132581, 187787, 180524, 159722, 212361, 306882, 292991, 259729, 252631, 262688, 151031, 191169, 244026, 376673, 450978, 352049, 180646, 149177, 211361, 182412, 158901, 240655, 297521, 160647, 115871, 197734, 229318, 126412, 68394, 127234, 128625, 145362, 132926, 123036, 122727, 71985, 15034, 20363, 95016, 156071, 92202, 93166, 252326, 355519, 255128, 148489, 6497, -21569, 65906, 130562, 118251, 196370, 219520, 189612, 103326, 123021, 161893, 133195, 136995, 160931, 163062, 152101, 219165, 250007, 226865, 154795, 177515, 184737, 234709, 149542, 137014, 195245, 95275, 81496, 91799, 139674, 159950, 186655, 211529, 92237, -36851, -24189, 87034, 169567, 144663, 94318, 14547, -129461]
17322a29461j45867K2893k2045R6245J46160J01807J16991l8139o4310J3954L6135
17311A34363L5436n7349L3857J8915j75182J8034J6951P5012k6501q5135n0943
17300f2542L427L8394N5926o421K3849M9836j0847N8409l7853o6957N0498J6408
17288A12127j17225P894O3052J45289q1057O5885L9942m1939p371o832n8224k4729
17276I6812M2033O3058k377m117m4734K9875o0709j12738m0295l3881N2022J14394
17264I9343R756m767m9523j64016m0681m6008R1469j0143M8916J26101P9o5576
17252e050N383J20112L6552l8128R6093M5455J4214l9948r6227j07647m7076L9420
17240B3153j3899n15k8597L7227k7883j02237m0409k4231J53587J66273n8338
$$ y = [-129461, -275328, -252435, -274480, -178235, -32075, 69732, 186723, 148584, 84274, 98228, 134363, 169799, 112450, 146307, 165222, -9960, 8074, 25025, 100037, 73536, -11599, -62542, -59115, -20721, 35205, 28784, 52633, 102469, 91622, 150031, 112178, 45221, 95719, 112127, -5098, 2796, 65848, 211137, 130080, 195965, 235907, 193968, 186597, 179765, 121541, 96812, 138845, 201903, 199526, 195409, 150675, 180550, 119841, 7103, -33192, -67073, -15051, 99343, 109099, 104332, 54809, -109207, -149888, -195896, -104427, -114570, -65654, 60447, 60526, -5050, 333, 120445, 156997, 118869, 214962, 260417, 274631, 234683, 138456, 30809, -16267, 23153, 9254, 8739, -19858, 17369, -10514, -112751, -153160, -177391, -23804, 142469, 84131]
17229H4131j18860k8567R1173K4700N0695O0749p1611J0177J70298n314j00975
17218A66596M995n1598p4426l8630J28295J7371j19981j13966N7093L3822J35718
17207A45289M9565n0179j8201O3563l8681q913l5317L8372o1987K9655J67360
17196B80526O4789k02732k1674O1143l7644l2758N4444n8124r6320n1161N1584
17185A2073J2138k2564J42499o3231n3838O3741j13397J2345l8735O2095m9646
17174c6520J04637J416L5120R2743p8580Q910n2474j2041p0332m1285J10528N0825
17162A12947k5630J8559k4011m7196l2385J4457J08365N7376j41580k1084L0562
17151E0380m2294M8839k0117o5169O23o1422M2834k8195M8703k10473l038J60281
$$ y = [84131, -34729, -63296, 27877, 52577, 103272, 164021, 92410, 102587, 272885, 267571, 166596, 171591, 119993, 45567, 6937, 135232, 152603, 32622, -81344, -24251, 9571, 145289, 194854, 144675, 126474, 190037, 151356, 142443, 107126, 145498, 83511, 113166, 280526, 345315, 142583, 120909, 182052, 144408, 111650, 166094, 107970, 11650, -39511, 12073, 24211, 1647, 144146, 80915, 27077, 90818, -22579, -10234, -48969, 13126, -36520, 68117, 69533, 104653, 197396, 118816, 127726, 75252, 63211, -7121, -48406, 62122, 112947, 87317, 105876, 81865, 34669, 2284, 16741, 125106, 182482, 40902, 19818, 50380, 8086, 56925, 36808, -28361, -27738, -89160, -46326, -74521, -25818, -236291, -239329, -79048]
17139g9048J19059L4730R6718n5454j97358J4541l8954P247N067P4309n0902r567
17127g9612m180O3506p0750J01197J28017j89342q2127k6740J77924P1659o9770
17116A9782K9249J4213j024J8354J09134l9p1557o2542n1767p4492M0244L0063
17104c82p830P8684J6450M728O3614R3530o1767L2091q3116j15648j33176o7065
17092a79887Q8937J23523N1968l8950Q5790n416n3042M1070M5302r5689k07646
17081a44040J5549K9928l9866J47921J47276q0092q2632j17098K4102k7354J06258
17070b0048O5437Q6214Q0954o4185j57444r5460m5713K9473j3424J3974N0892
17059f9330K775P0032L8026L1884Q1860q1168L335j0176M9460J8693R1087n6682
$$ y = [-79048, 40011, 74741, 171459, 116005, -81353, -66812, -105766, -98519, -93452, -19143, -70045, -79612, -83792, -20286, -91036, 10161, 138178, -51164, -133291, -160031, 17893, 89552, 19782, 49031, 63244, 62220, 80574, 189708, 189669, 118112, 55570, 3803, -70689, -30445, -382, -8212, 70472, 86922, 91650, 155264, 248794, 187027, 219118, 136002, 20354, -112822, -179887, -90950, 32573, 84541, 45591, 131381, 125965, 72923, 113993, 159295, 63606, -144040, -128491, -98563, -138429, 9492, 156768, 76676, -5956, -123054, -98952, -126306, -20048, 45389, 131603, 212557, 148372, -9072, -104532, -150245, -120772, -134196, -120222, -69330, -66555, 3477, 41503, 73387, 155247, 74079, 77414, 67238, 116698, 135391, 226478, 169796]
17047A69796j6664N349j49638r5170N6166Q8851O9705n111p6928j01345j2816
17036f7805M605L4200L2315M1998P300j6052J6642o6767p668L4900N1823P646
17024G3137M9545Q9057q353q7388q1277j05072J4968L1304M0676J2421R5403J4148
17012A38569q8993k6088K711j723P0904l745l3069j24056M9703Q3568Q7999j1801
17000A43979j06391M6126P133j09984Q1106R7685J10833n9763k2843l6376m620
16989A46885K1606n0585m0229P5076l1281L800Q4537j2065j42549k8728j2521
16978A3946l1773l440P0594R8950J06561j18864k12182L6209J48333O1103m879
16967A64558K4340k6157j40170j11096K9575P3792O6002J4051k2426N9282L0769
$$ y = [169796, 153132, 158481, 8843, -86327, -30161, 58690, 128395, 123284, 46356, -54989, -67805, -63200, -29000, 3315, 45313, 52613, 36561, 53203, -13564, -21232, 13668, 65491, 73137, 122682, 211739, 203386, 115998, 34721, -70351, -55383, -24079, 16597, 29018, 124421, 138569, 49576, 23488, 26199, 24476, 95380, 91635, 58566, -65490, -15787, 67781, 155780, 143979, 37588, 83714, 90847, -19137, 61969, 159654, 270487, 210724, 187881, 151505, 146885, 168491, 117906, 77677, 152753, 121472, 125272, 209809, 197744, 55195, 26467, 13946, -17827, -21267, 49327, 148277, 254838, 135974, -76208, -39999, 108334, 169437, 164558, 188898, 162741, 22571, -88525, -58950, 14842, 80844, 94895, 72469, 131751, 162520]
16956A62520L2033j1487o6406j06988o322R2017m8700n1365L0546R5211K3359
16945A44418n6175L4137l9761m5115m5173j8122J04233o1936k2205r2976N3411
16934d5264J50666m7097J925K17971J8685r8536j24150q09j41831P7674Q7303
16923I6537M1876l0662J0872P2129n0387p2718k5185N6109J68679L8606j0491
16912B95365o4808p7673j00050J0692K0773o6331r542O4489p5998m6202J8504
16901c0781J49223N7075K529L2305p2998K6384R1863p6263k000L7343l8964q8323
16889H7393q8564L1024O2550o245n8635p4638K8075j5170O716n8909J60995K5607
16877A00199o2003l7074l9619p2709L1030J8887O2868j15043j4000k4933m8660
$$ y = [162520, 194553, 183066, 116660, 9672, 3350, 95367, 46667, -4698, 25848, 121059, 144418, 88243, 122380, 82619, 37504, -7669, -25791, 78442, 16506, -5699, -98675, -45264, 105402, 58305, 60230, 278201, 296886, 198350, 74200, 73391, -68440, 9234, 96537, 138413, 107751, 118623, 190752, 140365, 67647, 42462, 98571, 267250, 305856, 295365, 230557, 152884, 52834, 63526, 84299, 17968, 8426, 72915, -3083, -49285, -30781, 118442, 175517, 178046, 210351, 137353, 163737, 255600, 179337, 177337, 214680, 175716, 87393, -1171, 29853, 92403, 86158, 27523, -47115, -19040, -34210, -27494, -86403, 74592, 100199, 38196, 1122, -38497, -111206, -80176, -61289, 1579, -113464, -127464, -152397, -201057]
16866b01057Q8675J19848N0992j4176j39834j55114J75008J21945M8878n3305
16856D1860n3127M7897Q1762R723p8245p9636j4136n8284m2053P4093K40560O2952
16844B33366r4608m38M4235j30884k18923p5370L6743j13408J1765J38194J78446
16833I118j35959j79984J5780Q214J45131N7286o1665O5531J6912j19564l2340
16822b11540Q5707K00227O9883j08211j4119m1687N7170M5928o7693l1093J25145
16811A09717K0815l3955J23103j2409r7278l5537q381K4784P7829J15743k0455
16800B63976p9455j55124k5859n69K8092L1194p9326o7244k8872O0783K5822M8133
16788B1551M0632Q0499M7297o3435N3828N7847j75221k2121R2468j05405m3664
$$ y = [-201057, -112382, 7466, 58458, 44282, -95552, -250666, -75658, 46287, 95165, 41860, -11267, 36630, 118392, 128115, 49870, -29766, -43902, -102186, -144239, -70146, 170414, 233366, 138758, 138320, 182555, 51671, -167252, -242622, -205879, -319287, -307522, -169328, 9118, -126841, -306825, -291045, -282831, -137700, -80414, -142079, -76548, -59636, -179200, -211540, -125833, 74394, 144277, 36066, 21947, -19740, 37430, 83358, 15665, -15428, 109717, 130532, 96577, 219680, 207271, 109993, 74456, 66075, 90859, 168688, 284431, 263976, 184521, 29397, 3538, 2969, 31061, 62255, -17071, -84315, -113187, -52404, -26582, 21551, 62183, 142682, 189979, 126544, 180372, 238219, 62998, 40877, 133345, 27940, -15724]
16777a5724o8862L1478j1384O9774m2823l8032r5528j1905J34704R6365p606m9417
16765h960P8657L9743p2754n9617p3683L6581k0559l7252M1767J44187k170n6769
16753I171Q4940m6468k8660j5576k748M8495R84j16097L3086J12402m1340j16801
16741g8612k4838n5457r5300k2424N8422J17869J1574M3641M3891q8948q3526
16730a73708P8937J6479q2674j01498M737J06885J10908J24292k1333j05684q8991
16719a31650k2972J2350R074m2127p1670N0728Q8617J15145M1493j6339J900j37204
16707a02655J7237R7658O8234Q3644n1959j03950K0796p088J72836R9781r3667
16696B00867n1354j17568l0714o9487j06172m3569N2899K22Q6480L4344K6042
$$ y = [-15724, -84586, -53108, -64492, 5282, -37541, -75573, -171101, -183006, -48302, 48063, 40457, -8960, 69697, 109440, 36686, -22931, -96614, -60033, -80592, -117844, -76077, 68110, 65940, 9171, 94111, 47643, 18983, 3407, 659, 49154, 50138, -65959, -32873, 79529, 38189, -78612, -103450, -158907, -254207, -276631, -218209, -100340, -88766, -45125, -1234, -90182, -173708, -94771, -78292, -160966, -262464, -257727, -150842, -39934, 84358, 63025, -42659, -131650, -154622, -142272, -133198, -175325, -246995, -196267, -107650, 7495, 48988, 32649, 34549, -102655, -85418, 12240, 80474, 164118, 112159, 8209, 29005, 21917, 194753, 294534, 200867, 149513, 31945, 1231, -68256, -174428, -217997, -165098, -164876, -78396, -44052, -18010]
16685a8010J3000l870o8811p5470l3524J35337Q766N8246O2192M9006P4302L0629
16673B31793j00085r0508L1578M1338l9190n6346J23158Q1844j0502l9502j05758
16662F7820r3554o8155l14Q562R7585J27243o6285j22811o6257J45956M8235l589
16650G4436O5509R3381p4789j7014j815n3833l9791j18416q0015J4981O1245J56615
16638H0494Q0643m620j01117l0337l4226n0952K1155J0016j76000L1590L9772
16627a33582N6205J28550j4234j28241o1574N2790l7372j12904j1552k5644j0773
16616b98331N0763p9597R7447J55584J37098J0874q7513j23797m4278J34617O3541
16605A6408q3593J12167J17358J7183L242j13181o7805k4115P2282N0808k1393
$$ y = [-18010, -5010, -8880, -77691, -153161, -186685, -51348, -42582, 15664, 77856, 126862, 201164, 231793, 131708, 41200, 72778, 114116, 74926, 18580, 141738, 223582, 213080, 173578, 67820, -25734, -93889, -94203, -85641, 11944, 139187, 72902, -49909, -116166, 29790, 78025, 74436, 139945, 233326, 158537, 141523, 139708, 85875, 46084, -72332, -152347, -137366, -76121, 80494, 161137, 156517, 55400, 25063, -9163, -60115, -38960, -28944, -204944, -173354, -133582, -77377, 51173, 36939, -91302, -152876, -100086, -137458, -250362, -261914, -287558, -298331, -247568, -327165, -229718, -74134, 62964, 73838, -13675, -137472, -181750, -47133, 16408, -67185, 44982, 162340, 179523, 182765, 69584, 1779, -22336, 49946, 100754, 79361]
16594G9361j09874j2172k7949J5300R9454J2808l5973N0016N8585m0814N5318
16583A44060n3533j6588J7852k8110l4528j7704l684n553p3327L4557L4862j20639
16571a22335L6423O2135P8407O7376M09N8342j29446r2866K5308L6314l1530m3877
16559e5340l9295L8668o7649P1605j552r7888J1100R4973J35157l1173Q6157l8859
16547A05904j14232m2795l627n3226J01316Q502q2274k6580M1350j46m3362N3963
16535e5207M5900K2005M1623J979K6252o1303j8626L0423J19120O5005o3587p7513
16523G6071j04116K0829J42201O7585j78674j71996M4591J1471J41625L8240m0012
16512D7815P6688L1032j8040j01464j46722J61275O3752n9085L2610L3972J02903
$$ y = [79361, -30513, -42685, -70634, -55334, 44120, 56928, 20955, 70971, 129556, 88742, 144060, 90527, 73939, 91791, 63681, 29153, 11449, 7765, 2212, -71115, -36558, -1696, -122335, -85912, -23777, 54630, 122006, 122415, 180757, 51311, -41555, -16247, 20067, -11463, -55340, -94635, -55967, -123616, -52011, -53563, -151451, -140351, -45378, 89779, 58606, 144763, 105904, -8328, -51123, -54750, -107976, -6660, 1842, -80432, -107012, -65662, -65808, -109170, -55207, -9307, 12698, 54321, 56300, 82552, 21249, 2623, 33046, 152166, 217171, 153584, 76071, -28045, -7216, 134985, 202570, 23896, -148100, -103509, -92038, 49587, 87827, 47815, 124503, 155535, 137495, 36031, -110691, 50584, 114336, 55251, 87861, 121833, 224736]
16501B24736Q6324m8732r3248l0252n2753K3301n2691K6467K7229m0726m8125
16490B1530L3332j4888j84216j4828J55574J1188m6509Q6254K5884r9410r2689
16479a18778M4262J03540L0441r4243m6599Q4233P8032N4544J8469j43020l8620
16468b7739J27067k0994r5252j8508K2931K3473j23535n3967N9016j4932n8606
16457a81046J35470L3379n1407O4227N3941N4795l7101j20979J0221j31640n6968
16446b27108J50946J09197J9267O7027j60267j20733J2126J65284P4446l0924
16436E9261k6912j07957J30619J17591Q429L4577o0043j49667J1893P7988l5778
16425F0001l8618M2769M6430K3627J4908P2978r9817K8011Q6552l2449n3269K9812
$$ y = [224736, 311060, 262328, 169080, 138828, 86075, 109376, 56685, 83152, 110381, 69655, 21530, 54862, 39974, -144242, -159070, -3496, 7692, -38817, 47437, 73321, -26089, -118778, -74516, 29024, 59465, -34778, -81377, 2856, 80888, 135432, 153901, 10881, -27739, 99328, 78334, -16918, -35426, -12495, 10978, -112557, -166524, -107508, -122440, -181046, -45576, -12197, -63604, 623, 54564, 109359, 72258, -48721, -38500, -170140, -227108, -76162, 33035, 52302, 119329, -40938, -161671, -149545, 15739, 90185, 59261, 32349, -75608, 55011, 172602, 181031, 215608, 155565, 5898, 17791, 95779, 60001, 21383, 64152, 110582, 134209, 149117, 222095, 122278, 150289, 236841, 204392, 151123, 180935]
16413A80935m5389p6451j4752M4615J05113O124q0931K1337l6180m6648j37144
16402g9371k6130J4912N4452J01119l0446l564r2020q0862P8312O8548m1318N6411
16390B0043Q1613n0504J8326j49153N4168R9903K1272m8391m0253R2294K3859
16379A23177n9152l0724j6379N7624J24358k0809j9465m8746q8522o3774K5704
16368a6708q9684j1905Q1860N7312p7668m1900N5052J14347J72887j9616j22444
16357A01533j13030O4244J8157j0887m6987O8836r3737L675n817r1339M0886J18830
16345E4364o5210o0O0177Q2562n6473p0381m2062L5637j2869j1570K0648O0424
16333E5187p196q3414K9357J798k9444j9979m5471K9029O6442j16520q7286J3095
$$ y = [180935, 135546, 59095, 44343, 88958, 194071, 200195, 119264, 140601, 104421, 57773, -79371, -105501, -90589, -36137, 64982, 34536, 30972, -61048, -141910, -63598, 4950, -36368, 20043, 101656, 51152, 69478, -79675, -25507, 74396, 95668, 47277, 7024, 99318, 123177, 64025, 33301, 16922, 74546, 198904, 178095, 158630, 109884, 21362, -42412, -16708, -106392, -118297, -36437, 20875, -56793, -98693, -43641, 70706, 243593, 223977, 101533, -11497, 52747, 70904, 60017, 13030, 81866, -11871, -8196, -14013, -105352, -64466, 54364, -10846, -10906, 49271, 131833, 75360, 4979, -37083, -1446, -14315, -25885, -5237, 55187, 47991, -35423, -6066, -4268, -33712, -53691, -99162, -70133, -3691, -120211, -207497, -194402]
16321a94402o296P4881L9434k1034q2847J01973R7695P2688N8106l4946J3006
16310A18258P2476R7843l4025j38719j72292M9150P8434J10945o9062j03047q8810
16299g8849n0063J5877M5779P6105J11201n457k6177j4305L8638M8965m1745j71393
16287e1424j33637N3570L2104p882J0906J50157O3367J9877M2407N746j97331
16276a2140j8415n647m4523N2153J56891J8920j17518j39508q894N6735l874k01963
16264b67783O7585J10572L3984r0692j7079M3209O7079R5734P9317J0229P1094
16253B03249j3467k27145j75459R915J17665P6544L9490O9055n9910M0597l9439
16242D1095r6502k9428P3584n2197N2494P6953J2714l9118o0675J9976m2318j3763
$$ y = [-194402, -200698, -125817, -86383, -107417, -190264, -88291, 9404, 82092, 140198, 105252, 118258, 190734, 288577, 254552, 115833, -56459, -7309, 71125, 182070, 113008, 9961, -78849, -128912, -113035, -67256, 8849, 120050, 114593, 88416, 74111, 112749, 161714, 119969, -51424, -185061, -131491, -99387, -107269, -96363, 53794, 117161, 137038, 179445, 185191, -12140, -30555, -36202, -80725, -28572, 128319, 147239, 29721, -109787, -118681, -61946, -65820, -267783, -200198, -89626, -55642, -146334, -163413, -120204, -53125, 42609, 121926, 132155, 203249, 189782, -37363, -212822, -202907, -85242, -8698, 30792, 99847, 39937, 80534, 41095, -55407, -84835, -11251, -63448, -10954, 65999, 78713, 39595, -21080, -1104, -43422, -57185]
16230e7185O1504J04230M8970o5318N5289Q2364n0103j3389j59842j40312J21633
16219a2159R2401R284j0902n8518l9413J4695l81M1028m0332n2673j30727J01935
16207h5762Q9543p3320j51718P707Q1336q5266R1440P1716K0327j3975m0447l0851
16195a19270M5292j5278K5382O1838q1400n8848m548L5602J13647K5070K9183
16184E6670J05228m8856j8321P9042K9685j18147j26038q6505R1864J26133P7297
16173A68052r4021k5114r6245n5608J44796R13q0096L1914K5806j0809o0366j09718
16161a60496R7157N648m247J15261O5118r8457q0549J9472l808J7245Q875Q0242
16149F1461n354N698J8474r721n7871p6625p3182J77902o823l4530L7139n0355
$$ y = [-57185, 4319, 108549, 157519, 92201, 147490, 229854, 179751, 166362, 6520, -133792, -12159, 80242, 89526, 78624, 20106, -19307, -4612, -4993, 36035, -4297, -56970, -187697, -85762, 3781, -69539, -221257, -213550, -132214, -217480, -126040, -54324, -33997, -47972, -88419, -119270, -73978, -89256, -63874, -2036, -83436, -142284, -146832, -111230, 2417, 27487, 56670, 161898, 113042, 94721, 173763, 203448, 85301, -40737, -127242, -35378, 90755, 168052, 74031, 48917, -47328, -102936, 41860, 42773, -37323, -5409, 20397, 9588, -50778, -160496, -63339, -57691, -61938, 53323, 118441, 19984, -60565, -41093, -44901, -27656, -18781, 61461, 56107, 61805, 80279, 70558, 12687, -63938, -137120, 40782, 33959, -571, 36568, -13787]
16137a3787j23752M7J2525R2555M7007j7019o9659p0263n7127L8692K9158P6968
16125e4655Q1226K401l0770m1184j09720O0221J33275k3229o7804q259J9824j68263
16113b06937K237L1449J37596L0389l9192L0840J23957K302j04367q2691n3147
16102a27564p7194K4750R6970Q3729m6836m3946K4132k2598k4817M4518j1853
16091h0709r9325Q2295M7580K6183j4814J8821M5953M5948J5755J5795r4034p8561
16079f9113J19321J15789L2228r7438j94134k4445J04942P1002r7031m5809o8501
16068a53189O6165O1584r218P60N313J56613j1616o1076j67625o6630M5076K9692
16056a04151L5981R9668K6089k5155r790o3617N9933L5468K1756J8244j5094r0096
$$ y = [-13787, -137539, -137492, -124967, -32412, 14595, -2424, -72083, -142346, -199473, -160781, -131623, -54655, 26571, 28972, -1798, -42982, -152702, -92481, 40794, 17565, -50239, -58498, -38674, -206937, -204700, -173251, -35655, -5266, -44458, -13618, 110339, 112641, 8274, -74417, -127564, -204758, -180008, -83038, 691, -46145, -90091, -65959, -88557, -113374, -68856, -80709, -180034, -97739, -50159, -23976, -38790, -19969, 25984, 71932, 87687, 103482, 9448, -69113, 50208, 165997, 198225, 100787, -93347, -117792, -12850, 58152, -38879, -84688, -153189, -87024, -25440, -34658, -33898, -28585, 128028, 116412, 55336, -112289, -178919, -133843, -104151, -68170, 31498, 57587, 32432, 22642, -40975, 18958, 54426, 76182, 94426, 79332, -10764]
16044a0764j7299N3136q4483j16524j39379P3657J49097J7862j1541M1319L2671
16033a2248k5309J6041M3033O5488m1150P7872L9074j03877q665j36446l4200
16022a20387q0937o8338J50249J35756j2542Q786q5632N829M049p3535m655J89185
16010D7828J31473n6309j78494m2682J8513J10052n0698j4046P0003N4860q0937
15999I563q4515o186j7526q2520J13502K9208j1107J09476k9851j16938K7918
15988e8976L6526N2502k1806m2025l4885J44267k289j03734j6815J1586J0556
15977b5093J1055k0365N5810R7745j9973j0693j2765N07P7975L1681j13570j51778
15965g9464l5973j633n4673J1981p545l9858Q9675j9320m7240L9622J07757O064
$$ y = [-10764, -28063, 25073, -59410, -175934, -315313, -241656, -92559, -74697, -86238, -44919, -12248, -37557, -21516, 21517, 87005, 45855, 123727, 162801, 58924, 50259, -86187, -120387, -201324, -269662, -119413, 16343, 3801, 12587, -73045, -67216, -63167, -136702, -141357, 47828, 179301, 122992, -55502, -98184, -79671, 30381, -20317, -34363, 35640, 90500, 9563, -74952, -81138, -98664, -181184, -67682, -38474, -49581, 59895, 30044, -86894, -58976, -22450, 30052, 8246, -33779, -68664, 75603, 73314, -30420, -47235, -35649, -25093, -14038, -34403, 21407, 119152, 99179, 88486, 75721, 76228, 154203, 185884, 72314, -79464, -115437, -117070, -171743, -159762, -167307, -207165, -117490, -136810, -184050, -144428, -36671, -30607]
15953c0607o7216j360n4222M5688K7835p0455n3571J17144Q6764M7613N3355o074
15941I4894K3307o1535K9709j00429O0470J6026j31057j08584n315J23616K09830
15930A50932q5495q9946j571o582n9271J08034M1174p7349n9571n5390p68M7215
15918h8588N7087O2589m8155j36080J7474O3060n9867J10017L6914j23284j8657
15907a27490J7102l1268j4744Q6200K3992m648M1933O8437M6905p6040N1574J44688
15895B26641k2240j10471j01876r019K5917k4303n0476K1354J01445O7331J0626
15884A34929j8334l1736n9643J7942Q2298Q8904J5684j09266j17555l5578L2525
15873A70q6818k44677N9564K19406M6476l8817j3891O9980N0450k1253k22881
$$ y = [-30607, -97823, -99183, -153405, -107717, -79882, -150337, -203908, -86764, 0, 47613, 100968, 94894, 118201, 56666, 86375, -14054, 46416, 62442, -68615, -177199, -182514, -58898, 150932, 65437, -24509, -26080, -32662, -91933, 16101, 57275, -20074, -79645, -135035, -135803, -88588, -31501, 31088, -17067, -153147, -135673, -72613, -132480, -22463, 14451, -108833, -127490, -110388, -141656, -156400, -70200, -46208, -50856, -8923, 59514, 106419, 30379, 81953, 226641, 204401, 93930, -7946, -16965, 8952, -15351, -65827, -44473, 56972, 124303, 134929, 116595, 84859, 25216, 43158, 125456, 214360, 230044, 120778, 3223, -32355, 170, -86648, -331325, -271761, -52355, -5879, -44696, -58587, 11393, 61843, 40590, -182291]
15862a82291k002J21136P3769M0919j6015O662j5749r7901q18J41241L7860r2109
15850A4702j45461p6405k2882J25942j2123J24987P2739m4764n6002J4671n1611
15839e6207P5306J23904J7431o6873l0376P737J7236l1296n6540r6538o887L0473
15827g2630Q8042L9663L2547q7042k9465k5087L2255j04497J623J16197P4987
15816F6593l5258p9931o4153J6662M5000L0301M2975L6080j5301n5239P5965R9746
15804A63440O0667j00163r4565r9834j10959m657K961O6709J16318K5913j18666
15793i2836K3467m0352m849O4119o5682K537J08455M1840N1666L5091m3835m9138
15781C0483N4989M3094j11045J0134K1196M5366j68652P515J29908j0086M309
$$ y = [-182291, -184293, -63157, 10612, 51531, 35516, 42178, 26429, -71472, -72290, 68951, 106811, 14702, -130759, -207164, -230046, -104104, -116227, 8760, 81499, 36735, -19267, -4596, -56207, 19099, 143003, 160434, 93561, 63185, 70922, 88158, 56862, 322, -96216, -103103, -72630, 15412, 55075, 87622, 580, -28885, -53972, -21717, -126214, -124591, -8394, 66593, 31335, -48596, -112749, -96087, -51087, -20786, 22189, 58269, 42968, -12271, 63694, 163440, 224107, 123944, 29379, -70455, -181414, -186071, -183110, -116401, -83, 25830, -92836, -69369, -109721, -114570, -50451, -116133, -113596, -5141, 36699, 88365, 123456, 79621, 30483, 85472, 128566, 17521, 27655, 48851, 94217, -74435, -66920, 62988, 52902, 57211]
15770E7211p276M8515R5220j1540k28100r5367O2639L0074J3l9342j7536k05536
15758c11025l0388J02731O7632J24476j0933O3559K5706o2438P6493j10236l4002
15747i8425J9732Q3894R3515M3187l4038j20260r3180o3084L6059R531k5319K1189
15735a27199R1713l1944j06238q4127J88237J57450k1679r2894l9176j3909L0106
15724d9660J36231P895j89646r4784k1868L8588R0585K2377p4126r917l5773J051
15712a79047J82037Q8404m2829j7464n3389p7493n271j2398M3580J12221O786
15701D5137o7724J9818J24929J30220J2044j03609j37183j11574l1980p5481J17401
15690g8002N5114q043J6224L9029J4662n0097j59861m7527O7057J30052m1406
$$ y = [57211, 49935, 98450, 193670, 182130, -45970, -141337, -78698, -48624, -48611, -87953, -105489, -311025, -341413, -238682, -171050, -46574, -57507, 6052, 31758, -30680, 45813, -64423, -98425, -78693, 5201, 98716, 141903, 107865, -12395, -105575, -168659, -132600, -123069, -148388, -127199, -35486, -67430, -173668, -257795, -69558, 87892, 66213, -26681, -65857, -79766, -49660, 86571, 94466, -95180, -189964, -211832, -173244, -82659, -60282, -134408, -144325, -180098, -179047, 2990, 91394, 48565, 31101, -22288, -99781, -105052, -117450, -73870, 38351, 45137, -22587, -2769, 122160, 252380, 264424, 160815, 23632, -87942, -119922, -195403, -78002, -22888, -30931, -14707, 24322, 38984, -11113, -170974, -218501, -151444, -21392, -62798]
15679f2798O9371J36846J14893j5171j38999P0098j5622o5346j8493P2118n222
15668A41675J5606p6077O8776q5222j05986n3467J44976R5398n0952j33093o6705
15657a05071j4652K3820l8825R2729k5494q8488M9866J01244J34978j37526o2444
15646f9863K3978o1470J01370M2426o2768K3871L6853k6351N5663J8173l6339
15635D5543r751l3208k4693Q5003j1251j79422j35604J36256J50797o1958j5914
15624e4202Q0680J0129l6131r255k6089N106j8388j5561O961m7444m8680L121
15612a49753R3828N9748R9330J13407Q646k41664q0038k9510M3140m9875N084
15601a27657P119J40557K5032j53748L1345K31050p3225L075j3745p6759R446
$$ y = [-62798, 6573, 143419, 258312, 243141, 104142, 174240, 158618, 93272, 74779, 146897, 141675, 157281, 81204, 149980, 64758, -41228, -94695, 50281, 145679, 94727, -38366, -105071, -119723, -95903, -134728, -41999, -67493, -155981, -106115, -4871, 130107, -7419, -69863, -45885, -107355, -5985, 36441, -26327, -2456, 34397, 8046, 63709, 81882, 45543, 35792, 2584, -22109, 62894, 51643, -127779, -263383, -127127, 23670, -38288, -54202, 26478, 36607, 476, -8779, -34868, -29762, -48150, -63711, -56750, -104194, -152874, -149753, -55925, 3823, 103153, 216560, 225206, -16458, -96496, -126006, -82866, -132741, -127657, -120538, 20019, 45051, -108697, -77352, 153698, 80473, 83548, 69803, -6956, 2490]
15590B490k4884j1093J7705l4364j22317j19530R0278J55619m6149K3473J2248
15579e6524o7315l4264j091N010k5528K8303M8816q1305N4375L8586M5347j75
15567d5765J9531O9557q3161j02191J47423J12486N8946j96794j19741J8455J10856
15556a0398q2746p3999n5448N780J9897J03452J51208K1396l1149r5426m2236
15545h9669J46816J02457n2558p6376m4735o3168Q2183P5223j3529M9028L070
15534A18742j4973o1608n348j8619Q7613J6173j41275k9845j122K7544J5027L2250
15522B4559p3956K7622j5186j7597p3490J32342J46701m5236j5305r7124K2453
15511A5783J9580k9399k23599j58599K4027R2476J47553O2723K4245k7886k5411
$$ y = [2490, -22394, -33487, -15782, -50146, -172463, -291993, -201715, -46096, -92245, -68772, -56524, -123839, -158103, -159194, -154184, -179712, -151409, -102593, -183898, -129523, -90937, -45590, -45765, -26234, 43323, -39838, -142029, 5394, 117880, 176826, -19968, -139709, -121254, -10398, -93144, -167143, -222591, -216811, -196914, -93462, 57746, 79142, 47993, -47433, -89669, 57147, 159604, 107046, 30670, -14065, -77233, 4950, 80173, 66644, 115672, 118742, 103769, 42161, 36813, 18194, 105807, 121980, -19295, -49140, -50262, -22718, -7691, 24559, -49397, -21775, -36961, -54558, -128048, 4294, 150995, 105759, 90454, -6670, 15783, 35363, 5964, -217635, -376234, -352207, -259731, -112178, -49455, -25210, -53096, -78507]
15500g8507l6164P2283K6085l2270O2820K8489K282J9542k9646k1355q2026M8654
15488a9813p0910m9446J43607J44203m8396R195j5025m1931o6224N0812N6517
15477I2589O760o3991K1608n9160m4361K3681j9236R2204p995m0685j04867k0846
15465a24299R4393j1782p1325J3748N1399o887m3768Q69Q7918Q2448J1890r4074
15453i470p2684N0509o8J2066J18265k8289p0189n5772r7701J1892k5375J50375
15441a6441K2152O4011J9536l1652K836j17680l5916N4771L825j04167n3875N9631
15429a32969J09604O9186N5581r8205M4495N2055K0385o7513o7924M3043O2473
15418I0211K717n9926n5009o8732Q8102M3669j60894j05322R3015K9422M3043
$$ y = [-78507, -114671, -42388, -16303, -48573, 14247, 42736, 45018, 64560, 34914, 13559, -68467, -19813, -90723, -140169, 3438, 147641, 99245, 108440, 93415, 51484, -14740, 36072, 92589, 99349, 35358, 56966, -2194, -46555, -22874, -42110, 50094, 42099, 1414, -103453, -124299, -29906, -41688, -113013, -99265, -47866, -54753, -98521, -97652, -9734, 72714, 84604, -9470, -82154, -31645, -31713, -19647, 98618, 70329, 140, -55632, -153333, -141441, -166816, -16441, 5711, 69722, 89258, 57606, 60442, -57238, -93154, -38383, -34558, -138725, -192600, -132969, -23365, 45821, 101402, 3197, 47692, 99747, 120132, 52619, -15305, 27738, 90211, 92928, 33002, -22007, -90739, -2637, 41032, -119862, -225184, -132169, -102747, -59704]
15407e9704q4498r9683N1815J68811J47051m5197n3803o2234J17084O8769J0162
15396A58573q4594j1517Q2550K8856o8218j4906m9603p7951n8831N4032j675L1838
15384a1446Q87L5245J38428R5195K7196j01941j86503O7255m3845m8138r3395
15373a21062L1665J60926o9421k9209m0029m2260K1342L8560m7950P0422J40577
15362A13561l1887k6578j1872o7943l4313L4568m0967j620l3377m8800J26558
15351b2670k6265P3921M2108L3276r7063j47104J6196K4322K6162K25481k7346
15340A21018j95360j13851K9208P6222k7959Q3604J30640L8340q5210j65814M7648
15329f1514Q3293L3995m6057M2064n5613j21381M1742J34853o9851j5030J1202
$$ y = [-59704, -144202, -243885, -192070, -23259, 123792, 78595, 24792, -37442, 79642, 148411, 158573, 73979, 62462, 145012, 173868, 105650, 90744, 41141, -36810, -95641, -41609, -43284, -11446, -10559, 24686, 163114, 258309, 285505, 183564, -2939, 64316, 20471, -27667, -121062, -89397, 71529, 2108, -27101, -67130, -109390, -88048, -49488, -97438, -27016, 113561, 81674, 55096, 43224, -24719, -59032, -24464, -65431, -67051, -100428, -149228, -22670, -48935, 24986, 67094, 100370, 3307, -143797, -127601, -103279, -77117, 148364, 121018, -74342, -188193, -158985, -82763, -110722, -27118, 103522, 141862, 56652, -109162, -61514, 21779, 55774, 9717, 51781, -3832, -125213, -83471, 51382, -18469, -33499, -22297]
15318b2297L7180K7806m0171k5096m2533Q1250Q4140l9265j01089j7325J38436
15307H1036r25r8574j14665P0857P8763K9244n1534J0224q8439J9871m716N6750
15295a2108L4205j23153l3034L3328q024r521K1137J4474o9538o4866J17663J66451
15283F7014K5850l0652r2635P7526J7746j9995m7143p4185J20876l2530j35923
15272a24051J33936J31004k1851n3718J890o4609P912j0978R3024K6716j13654
15261E621m8888j5146k1294n3446M8072R867j2487P954J6665j1985O4891J6338
15249F162n5273k7983r773Q280M2434k5953r1834m2557J08659N0993l4150o9487
15237a40482l8581M8253K8648L714K4786N4877L4359Q876J6822m3715R5177R8223
$$ y = [-22297, 14883, 42689, 2518, -22578, -65111, 16139, 100279, 61014, -40075, -57400, 81036, 80111, -18463, -133128, -62271, 16492, 45736, -5798, 4426, -84013, -64142, -68858, -12108, 22097, -101056, -134090, -100762, -108786, -118307, -97170, -82696, -152234, -217100, -99437, 67014, 92864, 62212, -30423, 47103, 64849, 44854, -2289, -76474, 44402, 11872, -124051, 9885, 140889, 119038, 65320, 67210, 2601, 10513, -465, 92559, 119275, 5621, -43267, -58413, -79707, -133153, -85081, -75214, -87701, -79747, -63082, -75067, -10176, 6162, -49111, -77094, -86867, -78587, -36153, -62106, -153940, -196497, -87838, -36845, -70995, -140482, -179063, -130810, -102162, -98448, -73662, -18785, 15574, 24450, 41272, -2443, 92734, 190957]
15225A90957r6206P0659L362m7835j12603j3337K7660n0026l7703m3738R2538
15214a6272L49j6101P9305O1150q7101l5533Q3476N0704o3820n8693j03001n5771
15202a61308Q6663J06975J1228o274R391L1121P1403j9370m4002l0222J05731
15191A61336L9337j36570j31994Q7668M4096o102J9493P4736q8739j10587J26266
15180G8940n1559p8094r4259J58110O9474p9384j06919K6611O3642j9805o2796
15169i6039m3833J1636O9224Q2070J9683l7174M036l4365m2431Q3579r170M7980
15157E5196n7133L5756q41m4815O3450N088j4632l0529o626j1583K6755J82957
15145B03043J31436j51287j24785k8148J6673q94l0809l0129N5652q418j55227
$$ y = [190957, 94751, 165410, 168772, 120937, 8334, -5003, 22657, -27369, -65072, -108810, -16272, -15923, -32024, 47281, 108431, 21330, -14203, 69273, 119977, 56157, -2536, -105537, -161308, -74645, 32330, 43558, 37284, 46675, 77796, 149199, 129829, 85827, 55605, 161336, 200673, 64103, -67891, 19777, 63873, 57771, 77264, 152000, 63261, -47326, 78940, 27381, -50713, -144972, 13138, 82612, 3228, -103691, -77080, -13438, -33243, -96039, -139872, -128236, -59012, 23058, 42741, 5567, 9603, -24762, -67193, 16386, 7216, 55196, -1937, 33819, 32978, -11837, 51613, 56701, 42069, 11540, 4914, -6669, 20086, 203043, 334479, 183192, 58407, 30259, 46932, 46038, 15229, -14900, 40752, 32334, -122893]
15134a22893O6274P12q9115m2590J03310J09585L0451n479m7490j01541j43680
15123b42456l0346Q0632J13266R3534M9110l7041j08647L9342R419n7199l734
15112i4120L9371M2688m2247o0468n0187j43859O7821O1938M2323N3593O2397
15101b0750o531Q1050K8083j14037q2392N3216P4766m1408k0654l5493L2327J00652
15089D8829M0055p0230o5932j3353J2020j18165j27068j50419l3443P1363J17335
15078b89008J01685n3156Q531K59463K07947r2553j52871o9968j65214l5085P2746
15067b07483N1174L256n2297J3904J58647J17319N6158j65678k2001K6164j0280
15056c1117O9259R7690K6591o5735p7054j40208L7030L7861o9258l2656O7753
$$ y = [-122893, -56619, -55907, -145022, -187612, -84302, 25283, 55734, 50255, 2765, -98776, -242456, -272802, -192170, -78904, 14630, 63740, 26699, -81948, -42606, -33187, -90386, -94120, -54749, -12061, -54308, -114776, -164963, -308822, -241001, -179063, -136740, -83147, -20750, -27281, 53769, 81852, -32185, -114577, -61361, 13405, -28003, -48657, -84150, -51823, 48829, 88884, 18654, -47278, -60631, -48611, -166776, -293844, -444263, -477706, -406343, -289008, -187323, -240479, -231948, 27515, 235462, 142909, -9962, -79930, -245144, -280229, -207483, -156309, -153053, -205350, -191446, -32799, 84520, 140678, -25000, -47001, -20837, -31117, 38142, 135832, 162423, 96688, 19634, -120574, -83544, -45683, -114941, -147597, -79844]
15045g9844R032J3888M703q533M6914l4928o1381K9222L4949M0480j8908K7262
15033B856J15236m6187P154k6121l5881k5333q9778o6928M94J8944m1412P2863
15021a14093Q9729m0576L4582K0991N9514r625J4998j15221n5763q1898o3074
15010b60436L9924Q784O917O7224N0037O9600l3659j15415O7359k0736K8969M9507
14998d1925p0714q94P8356N9177Q4719j9202p2704r6034j9349Q7332j10936j11549
14986b33723L2126N9719q4107o6549K69031J06970r5135q0416J45105J22727K1607
14975A97355m1237p9860M2115q347k9990N9123j080p1203J0739n9953k4270j11115
14963a17723M3056k96j1131K8780L5002l2885R4662P7037n2030k6966l8799J23666
$$ y = [-79844, -70812, -56924, -52221, -60754, -13840, -48768, -110149, -80927, -45978, -5498, -24406, 2856, 118092, 71905, 79059, 52938, 17057, -8276, -98054, -164982, -164488, -145544, -186956, -114093, -24364, -64940, -30358, -9367, 50147, 40522, 55520, -59701, -115464, -197362, -260436, -220512, -211728, -204811, -137587, -87550, -17950, -51609, -167024, -99665, -120401, -91432, -41925, -112639, -113533, -35177, 24000, 108719, 89517, 16813, -79221, -98570, -11238, -122174, -233723, -201597, -141878, -225985, -292534, -23503, 83467, -11668, -92084, 53021, 175748, 197355, 156118, 76258, 118373, 110026, 80036, 139159, 138079, 66876, 77615, 17662, -6608, -117723, -74667, -74963, -86094, -57314, -22312, -55197, 39465, 116502, 64472, 37506, -1293, 122373]
14951A22373l8509l5709k9863P5160j24150j28965M9604O9181J38470O1582k7625
14940A31549o0603n1694l4746J16477J4273j42304q2683J5789J0161M2644N9153
14929A8016M241k0782N7262O8351K3033j47712k4025k1576k0695j7922N7660Q670
14917a5479j03589N6441J16865J25125m0867o1491J5379k5817Q6171l2615P4462
14906A94585j9925n1281o3861l4198N2639o3499L3811m1119J30901M2871j20123
14895F0801n4913m7966M6563O1356j56585j83185L1457J16696J32354n6501P5827
14884B5904O2842J114N019O7009p9979L178j8287L6832M5247n5997j68609k0232
14872i5959o667N3695J22990m2367m6454M5806l4235m8676N7570L0124K150J01052
$$ y = [122373, 83864, 48155, 18292, 93452, -30698, -159663, -110059, -40878, 97592, 159174, 131549, 70946, 19252, -15494, 100983, 115256, -27048, -109731, -93942, -83781, -41137, 18016, 22257, 1475, 58737, 127088, 150121, 2409, -21616, -43192, -63887, -81809, -24149, -15479, -119068, -62627, 54238, 179363, 138496, 77005, 92384, 66567, 152738, 120123, 194585, 174660, 123379, 59518, 25320, 77959, 14460, 48271, 7152, 138053, 180924, 60801, 5888, -42078, 4485, 65841, -90744, -273929, -242472, -125776, 6578, -49923, 25904, 88746, 89860, 94879, 161888, 81909, 85087, 66800, 103632, 148879, 92882, -75727, -95959, -102626, -48931, 74059, 31692, -14762, 31044, -3191, -51867, 5703, 35827, 37977, 139029]
14860A39029J27458j10729p7016l9021o1380M399J01288m083J09457j545j58690
14849B9167r5570P9134J04590M7645j18428N1642M0622l9888l8900J8928m1182
14838C7760r316l6144m7275m1417k9245j17185J47225j4111J5865R8602l1521
14827b6762j23329n1250P1469R9522m8593n3282J8155M0948k7119l7003P9982
14816e7262M9033j11931P681j4493J1141J10126j3104j20121M8654L6592M1772
14805a1912J35352q4995j05954L6426J7287J7597M1762k6481J19919j1543j1785
14794A15673q2503L2257j5759j21045l3921m1541J14596K520O8148P0610l7133
14783G1902q9529j37545m1050O147N7677J11652o794m9540m722L5374m1755K5842
$$ y = [139029, 266487, 155758, 78742, 39721, -21659, -17260, 84028, 79945, 189402, 187857, 29167, -66403, 12731, 117321, 164966, 46538, 98180, 138802, 98914, 60014, 78942, 37760, 28444, -7700, -54975, -96392, -125637, -242822, -95597, -109708, -93843, 4759, -26762, -150091, -201341, -129872, -30350, -78943, -132225, -114070, -73122, -100241, -137244, -57262, -8229, -120160, -112479, -126972, -115831, -5705, -18809, -138930, -90276, -53684, -11912, 123440, 38445, -67509, -31083, -13796, 3801, 45563, 19082, 139001, 127458, 115673, 33170, 65427, 49668, -71377, -105298, -146839, -32243, -29723, 38425, 109035, 71902, -17627, -155172, -196222, -190075, -132398, -20746, -27540, -77080, -81802, -46428, -88183, -62341]
14771f2341P6818P2993m884m1778J20516j06454j75829j6187m2994N8460L9466
14760h2214K421J1808J07607m074p6860j8723m578q6398N593J59480J95176j5132
14748A94106p032N129P4011k3620p2898j6355n4944m6945o7590j06018K4455l0591
14736a28292p7941J1271J15536P2975N0274j0888M3831N6246j01688m7375L4787
14725A8736l3158j6528K5333P451k9829j48907j46205K9929K36136J21293j2559
14714E1692j74229m5034J67033r829q7928P367P3406p118p438Q0975j09256p9937
14702a40296p0832p6089P4610K19687O8916n3667K4271J8393N973l3085o2299
14691b4418r9055l4321j8733N1887l2405L3765N5440j4390j18059j5619J03817
$$ y = [-62341, 14477, 87470, 82586, 40808, 161324, 54870, -120959, -137146, -180140, -121680, -82214, -79793, -67985, 39622, 35548, -41312, -60035, -64613, -151011, -145418, 14062, 209238, 194106, 187074, 192203, 266214, 242594, 169696, 153341, 98397, 51452, -16138, -122156, -97701, -128292, -206233, -194962, -79426, -6451, 43823, 32935, 76766, 133012, 31324, -16051, 18736, -14422, -30950, -5617, 1834, -27995, -176902, -323107, -293178, -57042, 64251, 51692, -122537, -167571, -538, -10367, -98295, -90928, -17522, -24640, -32078, 48897, -60359, -140296, -211128, -287217, -212607, 7080, 75996, 22329, 46600, 64993, 70966, 37881, -24418, -123473, -157794, -176527, -124640, -157045, -123280, -67840, -82230, -200289, -215908, -112091]
14680a12091J10330m16m5883l5852J21601J03426n1043j00423j08373l2922K3113
14669a28533N1252j24361m9126R2670n1473K8076J2676l5018J5374j912J14286
14658g6089k0616R8144N1945k1548p0597j44773j7911m303J17930J30246Q5666
14647A28094o3215l2023k1357j7378R4052p675j18839N0233N8788p1418l4222
14636c4960K8946K4732O4198j2818p1784m1962O6575P736m3384k1185N1566J5476
14624C3136o1491k9384J1944M3356P3163o3198q1855k1184m8585J1542Q3027J61915
14612A12386J22132n2219p093n6252j27082p0861Q9224L1974j1707L8386P6207
14601A45095l821j36108q7190o9155J9233J14522r43k5984P6016J48003R9308
$$ y = [-112091, -1761, -2177, -48060, -83912, 37689, 141115, 90072, -10351, -118724, -151646, -128533, -77281, -201642, -250768, -158098, -209571, -181495, -168819, -203837, -188463, -190375, -76089, -96705, 1439, 53384, 31836, -38761, -183534, -201445, -205748, -87818, 42428, 128094, 64879, 32856, 11499, -5879, 88173, 80498, -38341, 11892, 70680, -738, -34960, -6014, 18718, 82916, 70098, -1686, -43648, 22927, 30663, -12721, -33906, 17660, 33136, -28355, -57739, -45795, -2439, 70724, 7526, -74329, -95513, -144098, -132556, -49529, 112386, 234518, 182299, 175206, 118954, -8128, -78989, 10235, 42209, 30502, 68888, 145095, 141274, 5166, -82024, -151179, -131946, -17424, -18367, -44351, 31665, 179668, 278976]
14590B78976j16589p0116J48178l9208j44972j07094q3901J9311J13751J03553
14580A01889J9064m8913n9992R315n3181q580l9905P9375P8268K1994r366j4226
14568G5742j08858n5483j0096j16427j3137R2238N1903J21931J27373j0722k21798
14557f7334r2562L3100J62479P8487k7492o1689n880J9067j5492j1972n170r630
14545d088M6375k4840J1200L1873L8718p0683N289L2852Q5459k3608j07785j5033
14533E729J0897o0042n3339n5632O8918L2758M9262M9796l4554J02048m6971q0112
14521a1242l5444l4953m6561P5919J34589L0033J6229k6109n2156q9956j30070
14510a69721l6069J5169J88790P7172j7164l0609o0024k7946J03933P4744p2273
$$ y = [278976, 162387, 92271, 240449, 201241, 56269, -50825, -134726, -115415, -1664, 101889, 120953, 72040, 12048, 21363, -31818, -40398, -80303, -928, 77340, 99334, 89968, 75742, -33116, -88599, -98695, -215122, -228259, -136021, -84118, 37813, 165186, 154464, -67334, -159896, -126796, 35683, 114170, 86678, 24989, 19109, 38176, 22684, 10712, 5542, -4088, 42287, 17447, 28647, 60520, 99238, 28555, 33844, 66696, 152155, 128547, 20762, 5729, 16626, -43416, -96755, -152387, -83469, -50711, -1449, 48347, 13793, 115841, 68870, -11242, -46686, -81639, -128200, -52281, 82308, 112341, 128570, 102461, 50305, -39651, -169721, -205790, -190621, -1831, 75341, 58177, 27568, -32456, -60402, 43531, 118275, 46002]
14499D6002o6765j01123J03996M7718j23572n7131J60134P8007p8471j23841L67
14488a14679N3852k7828k4035N0820J02188R8080k7814l2408o6215L9695J7980
14477F9636n7034n089Q5123O3608r692j1229L4158L9343P8305J8848k1974j24576
14465A59427k0720M3621q9525j46979n9366r7314j1561J20491L7005L467N3594
14454g860J11199P24j58549o4582p010k6821m9177J38232R9895m8681L059K9964
14442B0393J2790L8978j0878j2656O835j31776k1900L7472o22K6083R3570O8289
14430A26578P2733j5129k5757k703r296m5715K4420l467p6550J05944j1120m8619
14418I1319p998j41187l197M7023k3479N521o3412J4775O8665Q922J8745O8617
$$ y = [46002, -20763, -121886, -17890, 29828, -93744, -150875, 9259, 87266, 8795, -115046, -114679, -60827, -88655, -112690, -61870, 40318, 138398, 110584, 78176, 11961, 51656, 69636, 12602, 7513, 92636, 156244, 146552, 135323, 169481, 208824, 287129, 305977, 284003, 159427, 138707, 182328, 92803, -54176, -113542, -210856, -222417, -101926, -64921, -61454, -7860, 103339, 104063, -54486, -119068, -126078, -152899, -202076, -63844, 36051, -12630, -9571, 20393, 33183, 72161, 61283, 48627, 55462, -76314, -98214, -60742, -61364, -35281, 58289, 126578, 199311, 184182, 158425, 155722, 146426, 100711, 125131, 121664, 45114, 151058, 139938, 91319, 83321, -57866, -61063, -14040, -37519, -31998, -95410, -80635, -11970, -3048, 15697, 84314]
14406H4314k8993n0237J283m6502q7009p1370J46579p7361O9425J61447M8631
14395A50207o8977k3631N0347l8007J16099o7254j91670m1263J37398J57855M8444
14384B29548j51966j50773L6392O0087j0383l2955R349j01774n0470J52288J4532
14373C875j65820J5819N6071m7195p1871K4984m1272J32798J13367R7524O795
14362A25075l8275n0626m1482o0311J10396J8277L9548k1749k7469l8436m2905
14351b7957k1293O132J838j3109n5000N5759N4721L2214r9676n7763M9846N8601
14339a5687R205j3116p222o3859N1048n5155m9862R8900J6470j53584L534R3634
14327h5694m6178l903R3133P8896r7397j34613M9885J60761P9313m2168j71306
$$ y = [84314, 55321, 5084, 6367, -40135, -127144, -198514, -51935, -129296, -59871, 101576, 150207, 81230, 57599, 107946, 69939, 186038, 118784, -72886, -114149, 23249, 181104, 229548, 77582, -73191, -36799, 23288, 12905, -20050, -10701, -112475, -162945, -10657, 3875, -161945, -146126, -90055, -137250, -209121, -184137, -225409, -92611, 20756, 118280, 125075, 86800, 36174, -5308, -65619, 44777, 63054, 102602, 80853, 53384, 14948, -27957, -49250, -43118, -41280, -54389, -109389, -53630, 1091, 33305, -66371, -124134, -74288, -15687, -6482, -19598, -26820, -90679, -39631, -94786, -144648, -45748, -29278, -182862, -179328, -85694, -131872, -135775, -42642, 36254, -61143, -195756, -145871, 14890, 94203, 52035, -119271]
14316a19271l9319J6528m1638M5677p5041K6773J62187J02661k1168m8890J6494
14305B4993J9190r1921m6222j04832O7542Q8851r624Q5158M3278j38791k5429
14294h7807j0685j615l2550m7602R3352P0257n738k8313L6858J21199J9500o5372
14282F1484r5235M4550J58735j2884p3771j9039l7520r7915m1666L2712k3269
14271a03818Q079n6204m6950Q0919J08348k026J3055j00212o5328j14949J28256
14260a50830J42696O7888m4037M1854L1894m1922j21350k8105R813o0845m180
14249a57124P808j1663P523n2028P5917J34291P1697q9062j45695J5200N1757
14238i1379n5946n0875M1484J78058L1184k8465M8977Q880r0224j3963j37387
$$ y = [-119271, -158590, -142062, -183700, -138023, -213064, -186291, -24104, 78557, 57389, 8499, 24993, 44183, -47738, -93960, -198792, -131250, -42399, -52023, 33135, 76413, -62378, -87807, -98492, -100107, -132657, -180259, -86907, -16650, -22388, -50701, -13843, 107356, 126856, 61484, -33751, 10799, 169534, 156650, 82879, 63840, 26320, -71595, -113261, -80549, -103818, -95739, -151943, -198893, -117974, -9626, -11652, 1403, -98809, -164137, -279086, -150830, -8134, 59754, 15717, 57571, 89465, 47543, -73807, -101912, -92099, -152944, -157124, -149316, -160979, -153456, -205484, -129567, 4724, 76421, -12641, -158336, -143136, -91379, -147325, -198200, -156716, 21342, 52526, 24061, 73038, 81918, -8306, -22269, -159656]
14227a59656P7326J29590K1712K1862K4660n8158p8918n913Q1299J6105m870p0313
14215e274j47352p611Q0450K02588K2459k11524j25899m2385J33580L1774k4813
14204i4007J0554K9904J03684o4749o8149j8746N8677J32759J9281l0088j32026
14193e2906j3211J25012P6660q1484q8628J5297L8674j0845P68o4898L634L05
14181e1622j17072N423K4295J7924k6596R6669K3623k0595L5569K8730p2479k6453
14169h2584J65551K10699l9115k3737j68517N233J27268N3912j760q6842q4102
14158G6006j9278n6186O93M1882j21999N772R1048M5615J9799O4959k7993m9218
14146G1100J3314j62416k4393j4242J02014M1864l344k0025n9770L0088R0631
$$ y = [-159656, -82330, 47260, 68972, 90834, 115494, 57336, -21582, -27495, 53804, 69909, 65039, -5274, -152626, -160237, -79787, 122801, 145260, -66264, -192163, -234548, -100968, -69194, -94007, -83453, -53549, 50135, -14614, -82763, -101509, -42832, 89927, 109208, 79120, -52906, -66117, 58895, 135555, 54071, -34557, -19260, 19414, 8569, 9337, -55561, -51927, -51622, -168694, -163271, -138976, -121052, -147648, -50979, -27356, -47951, -12382, 16348, -56131, -82584, 82967, 293666, 254551, 230814, 62297, 67530, 194798, 248710, 246950, 160108, 76006, 56728, 542, 1235, 43117, -78882, -73110, 17938, 63553, 83352, 148311, 120318, 71100, 84414, -78002, -102395, -116637, -14623, 27241, 23897, 3872, -55898, -25810, 64821]
14135F4821L4561j3510r7484j28226O7053m9067L7571J2702K4910o7835P277Q8631
14123a8596O4862l1809j51684j10208M4715J6499m9799P690J28462L0029L4879
14112c4960j3558J8960J15231J4741o2954p4960n6356K9677O6848k0279L8103
14101B0493N6676N3634k0466l1154L922j0428r94K6687j1860K6331p7788M0154
14089G5207n9999p3400j2786j898N7790N9287n054L870P3984k3904Q7496M3078
14077B23671q8188p3443p6427J9146o231o5783r6679q2518M6591J09130O6324
14066b4407J28996K4905q7678r9799l4007n2281P5758M2894o1086O7890R4719
14055G5904r2499l5980O3947n5231j9382J64212J8815O9390j6967m2139k3851
$$ y = [64821, 99382, 85872, -11612, -139838, -72785, -121852, -84281, -71579, -46669, -114504, -107227, -18596, 46266, 14457, -137227, -247435, -202720, -186221, -236020, -228330, -99868, -69839, -34960, -48518, -29558, 85673, 100414, 37460, -37500, -93856, -64179, 2669, -17610, 20493, 77169, 130803, 110337, 79183, 83105, 72677, 71683, 98370, 86510, 112841, 35053, 75207, 15208, -58192, -70978, -72876, -15086, 44201, 39147, 43017, 117001, 93097, 180593, 223671, 135483, 62040, -14387, 4759, -1472, -67255, -163934, -246452, -199861, -90731, -24407, 104589, 129494, 41816, -57983, -91990, -144271, -68513, -25619, -86705, -18815, 75904, -16595, -52575, 11372, -43859, -63241, 100971, 119786, 189176, 172209, 130070, 106219]
14044A06219m7933l750L2274m3292l4170k1007K9403Q2019p2034r6225j2456j3520
14032i4472l7917l2621O0316Q4887Q410n0389J0366Q4812P5403m7045L8343J9539
14020A19632m2707J9076Q60J0271L9087Q5209o0854q1852j42724O568J1794P5266
14008C9626l8275J904P3990o0044o7273p14l2588M7734R2987O0663r3538j18469
13996i3997n8153l5642K8193O142K6094N5587N8997k5645M6876n5958M8503P7767
13984G8764J07880o7092r9094j12550l1621m6409L9638N8588R6349J1102j06891
13973g1336M7270M5783J99273L4541o1666o7133l9540P7644J5788m2160m0323
13962I8141l8238n6857n6209K9758M3358M9308o5763K9356k3695m6518k8178n7025
$$ y = [106219, 58286, 54536, 86810, 43518, 9348, -11659, 17744, 99763, 27729, -68496, -80952, -94472, -132389, -165010, -104694, -19807, -11397, -61786, -51420, 33392, 108795, 61750, 100093, 119632, 76925, 96001, 96861, 107132, 146219, 231428, 170574, 88722, -54002, -47434, -35640, 39626, 1351, 3255, 77245, 17201, -50072, -50786, -83374, -35640, 57347, 118010, 24472, -93997, -152150, -187792, -159599, -153457, -127363, -71776, -12779, -38424, 8452, -47506, 997, 78764, 186644, 119552, 20458, -92092, -123713, -170122, -130484, -71896, 24453, 35555, -71336, -24066, 21717, 220990, 255531, 193865, 126732, 87192, 164836, 180624, 138464, 98141, 59903, 3046, -53163, -23405, 19953, 69261, 3498, 32854, 9159, -37359, -65537, -122562]
13950a22562O4328O7978P5499L0196j35962p1782Q197J02508O7922N1843R3896
13939B32061K1279j23710j90410J838J80212j135o474j2294j34840l8683J17870
13928D5714J12806J04296J0721j65819m2140p249J1320q5451r2170L3908P0067
13917c997J8484p9495m5691M0346R5973M1276p5935R2337O4928o9178j4294l2811
13905C1943k10928m225R8372R4698j1805o905m3225K596N9512N2984M5464j0645
13893I7836j49858j06830l027L3420n5953Q812J13824K4136r8788N201M3660Q0987
13881f580J7303Q5638l3372n1335l6507J2121p7332n2950m3173J38066L1970j3938
13869c0089k8796J4112J9013k8821J9628k7078Q960n1132j2197O008Q3476O1707
$$ y = [-122562, -58234, 9744, 85243, 115439, -20523, -92305, -84108, 18400, 86322, 138165, 232061, 253340, 129630, -60780, -58942, 121270, 120135, 113661, 101367, -33473, -72156, 45714, 158520, 262816, 273537, 107718, 65578, 58329, 69649, -15802, -107972, -74064, -3997, 14487, -65008, -110699, -70353, 25620, 66896, -9039, 83298, 148226, 79048, 64754, 31943, -178985, -183210, -84838, 9860, -1945, -8850, -52075, -49479, 10033, 63017, 108481, 97836, -52022, -158852, -161879, -128459, -184412, -175600, -61776, -37640, -136428, -131227, -87567, -6580, 10723, 96361, 62989, 11654, -24853, -12732, -90064, -143014, -186187, -48121, -16151, -30089, -58885, -44773, -25760, -54581, -34953, -62031, -53071, -104203, -116400, -110392, -26916, 34791]
13857C4791j02838n8884J24094O2443o6851l3680K2090K3880j6377m1198J054
13846e1476J7372n8335j8250n583J32115N6105j91536r0622M4962J37031M2506
13835A4289J634N4788k5984j47595K9611J99214q1213m9693N6198Q6388J268q8639
13823E0266j0562o3898j35476m3476J25710M1708L0710R2081M3238l1549o1833
13812C6919j18286L4979j09693j58296J4421J26035N41q3479R9762M7278J4060
13801i5759J02352q326K039j00932j16710k6251M0660n8973Q2653J45632P1747
13790C8132P4446l2778j29433j15461j6393P1030M2939Q791n0217M7788J33059
13779G1903R463k1806N4041L8063l8390m5754K7211j26548l6886J8121P8770J04562
$$ y = [34791, -68047, -126931, -2837, 59606, -7245, -40925, -18835, 5045, -11332, -52530, -51476, -34104, -92439, -110689, -116272, 15843, 71948, -119588, -210210, -165248, -28217, 14289, 15923, 70711, 44727, -102868, -73257, 125957, 44744, -4949, 51249, 137637, 138905, 50266, 39704, -24194, -159670, -203146, -77436, -35728, -5018, 87063, 130301, 98752, 36919, -81367, -46388, -156081, -314377, -299956, -173921, -173380, -256859, -157097, -109819, -95759, 6593, -1733, 306, -100626, -217336, -243587, -202927, -261900, -179247, -33615, 38132, 112578, 79800, -49633, -165094, -181487, -110457, -67518, -58727, -108944, -61156, 71903, 81366, 59560, 113601, 151664, 113274, 67520, 94731, -31817, -68703, -50582, 28188, 132750]
13767A32750P1686o4831p1453r6499n0634Q3515L1165l0793j0740Q1395k4251
13756E1310j9425K1280J4648R1131l7826Q9430J130o5624j18232j18375Q640O0505
13744b1408r083N9016P1884J7329M6618l4821k5098n0848j8947j4339j2597m45
13732G261L6837l3293Q81J4744p5788m6043L4527n1173L3490J18330m975J04857
13720A39655o7860j29618m0920L5693K5965P7842J25349Q4977l4254p8998L3783
13709A71614j6883j78464q8244K3065J04996O5141j60726o1647J5714n5543R5441
13698h5536J08709J1526j16157M1961m522M6099J9454k6810J2978o2734j34460
13687a89492Q6823M1077O3361L1748j0016m4638p3190O8183M3063q3382N3483
$$ y = [132750, 204436, 139605, 68152, -28347, -78981, 4534, 35699, 4906, -5834, 75561, 51310, 31885, 53165, 67813, 158944, 121118, 210548, 211678, 146054, 27822, -90553, -81913, -21408, -30491, 28525, 100409, 117738, 164356, 129535, 104437, 53589, 34642, 20303, 7706, 7261, 44098, 10805, 11686, 26430, -49358, -95401, -60874, -112047, -78557, 39773, 34798, 139655, 71795, -57823, -98743, -63050, -37085, 40757, 166106, 251083, 216829, 137831, 171614, 154731, -23733, -111977, -88912, 16084, 81225, -79501, -141148, -125434, -180977, -85536, 23173, 34699, -81458, -39497, -44019, 2080, 21534, -5276, 7702, -55032, -189492, -102669, -61592, 1769, 33517, 23501, -21137, -94327, -26144, 16919, -66463, -12980]
13676a2980J35145L4389J9728l1128n1774p8818m4612N4606L0203n5856k1248
13665b2345O7302K5793q485O6009k1766o7873j12503l7509p7954l0768M7088J0003
13653a63008N3868P4507k5138M4747P9491J30521l519r1064j26447q2749N686
13642a03105J59015L1704O6794K5054j8527L3357o2179j36847R00k1497K4015
13631a316O9280L5434l9433j144O6741j40831j32844N6199J76505J22747J07025
13620C18363l1713k9395J3567j27840j84977j51709R576P6468J14225J17313L4119
13609A57997j37665j10626R543J39926O3166n3991p8687p8318k7351j3282R5622
13598c3666R4111p968j7035k4207L921J8912L8822j9510o6525j4769m0213R285
$$ y = [-12980, 122165, 156554, 176282, 145154, 93380, 14562, -30050, 24556, 54759, -1097, -22345, 44957, 70750, 62265, 128274, 106508, 38635, -73868, -111377, -189331, -220099, -173011, -163008, -109140, -34633, -59771, -15024, 64467, 194988, 191469, 100405, -26042, -108791, -103105, 55910, 87614, 154408, 179462, 160935, 194292, 132113, -4734, -3834, -25331, -1316, 67964, 103398, 63965, 62821, 129562, -11269, -144113, -87914, 88591, 211338, 318363, 286650, 257255, 270822, 142982, -41995, -193704, -184128, -107660, 6565, 123878, 157997, 20332, -90294, -80751, 59175, 122341, 68350, -10337, -88655, -116006, -129288, -33666, 60445, 52477, 35442, 11235, 15156, 34068, 72890, 53380, -13145, -27914, -68127, -58842]
13586e8842O9627j4281J3957P8739N5464N608m6267o9340L3288r4076J8062L9763
13574C1702K6816p424k8014L0673J20845k8027o7196j09442n7673M8667K2229
13563a6844m9329Q1691O4414q6269m9386J1638j4021k0230k7041J55957J9152
13552F9732n882J8071j6460j14565j3116M3610M2390L9193l8366o696n4103j89603
13540b25795J20780M9108K2721Q7539J04105K7488m1932p8515q9108M658P1780
13529E2829p4338n6000L0157Q3207k5321k0163o7615j21278P8511R3988K4093
13518a930P8583k5134j03188n6134L1663K7955m711M7268K5776J00421q1672q0716
13506d1819O4451L3781k1421k1370L360m1060k9829J21242J328j16251M2867l6732
$$ y = [-58842, 10785, -3496, 10461, 89200, 144664, 150272, 104005, 34665, 67953, -26123, -8061, 31702, 58518, 51094, 23080, 53753, 174598, 146571, 79375, -30067, -87740, -39073, -16844, -66173, 15518, 79932, -6337, -55723, -44085, -58106, -78336, -105377, 50580, 69732, 63850, 81921, 65461, -49104, -62220, -18610, 23780, 62973, 24607, 17911, -36192, -225795, -105015, -55907, -33186, 54353, 158458, 185946, 144014, 65499, -23609, -18951, 52829, -21509, -77509, -47352, 35855, 10534, -9629, -77244, -198522, -120011, -26023, -1930, 76653, 51519, -51669, -107803, -76140, -48185, -52896, -5628, 20148, 120569, 38897, -41819, 22632, 56413, 34992, 13622, 16982, -24078, -53907, 67335, 68663, -47588, -4721, -41453]
13494d1453j01362L5337Q9098J01444o3605o034J02948J16208j5417j22504m8614
13483D6046j3885o7162j6258j16439o4145K4645J21864N9253L7230N6357N4971
13472A22477j34348j99045k748R3374L2210o2146R8517R8673K9444M7011K306
13461A25725j1798j00393K2934J31634j21387q1575L0865o0353J9026O3451k0142
13450b013p6623J5622J21347J24074j23152j18329k0668J7134j4474L3427K07995
13439A64340P9245l2011r9463R160K8445n6214M9741J09152q4939m6713N5838
13428A76581o2221n8445J1746K535K3277k6239r205Q7160J8465q4273K8311j3768
13416I3924m2028Q1640N9059N2223m2510j00845j79329l4136k6591N4787P4719
$$ y = [-41453, -142815, -107478, -18380, 83064, 19459, 13425, 116373, 232581, 217164, 94660, 46046, 32161, -35001, -51259, -167698, -231843, -207198, -85334, -26081, 11149, 67506, 122477, -11871, -210916, -213664, -120290, -88080, -150226, -51709, 46964, 76408, 123419, 125725, 113927, 13534, 36468, 168102, 46715, -34860, -3995, -64348, -45322, 18129, -2013, -78636, -63014, 58333, 182407, 59255, -59074, -79742, -62608, -77082, -43655, 164340, 243585, 211574, 112111, 121271, 149716, 93502, 143243, 252395, 167456, 120743, 176581, 114360, 55915, 67661, 70196, 93473, 67234, 58029, 145189, 163654, 79381, 107692, 93924, 51896, 133536, 192595, 244818, 202308, 101463, -77866, -112002, -138593, -83806, -9087]
13405i087j17078r2336L8359P3656J01590P4876L8372j4091p5608m9826J6621
13394a4552J06413J8283m5817j15528o7166R2813R9726n3047L849m2330j1582
13383b8938M0659j9343r5414q4617p908n165L6463Q7461P8679P470q2909J6066
13371e7496k8397J23164J05975n0265j22117j04497P7010J05297P0929m0832p5495
13360C276J1012N892q0930M8565L1804M1447j07998j08953q3088R3313J03332
13349d2328m7726o7017J04333J01025M3851M7394n5163J9831o8319l4861M3943
13338D4963J40013M4493j11360n1021k0766m4182o8448Q1652N5499k2986n9495
13327a1638K4725m1386M2086N1334J9229l9640R33M0647k4459M2320j5455n1899
$$ y = [-9087, -126165, -218501, -180142, -106486, -4896, 69980, 108352, 94261, 18653, -31173, -14552, 91861, 110144, 64327, -51201, -118367, -25554, 74172, 21125, 24974, -17356, -28938, 11721, -7622, -103036, -187653, -195561, -200726, -164263, -76802, 1877, 9347, -73562, -57496, -85893, 37271, 143246, 92981, -29136, -133633, -56623, 48674, 119603, 78771, 3276, 14288, 20180, -60750, -12185, 19619, 61066, -46932, -155885, -238973, -145660, -42328, -90054, -157071, -52738, 48287, 92138, 139532, 84369, 104200, 35881, 1020, 44963, 184976, 229469, 118109, 67088, 46322, 2140, -66308, 15344, 70843, 47857, -11638, 13087, -28299, 13787, 65121, 84350, 44710, 45643, 86290, 61831, 104151, 88696, 36797]
13315C6797k9778p9206M4494N1115n5689R0618J6259o2186L791p1062j3426L3564
13303c4709N786R8728k998n83q1379J9801N215N4562J7785L6397O5122k7450n8556
13290I7721q5056r2966J4424R6870Q1736L3743m8688r2052M6252L0408j4537N3137
13278A20992L2523J021N9452J5810p3793m7337p1278j4144P0766n7544m1924l2867
13266c8323J7059K6653J27325j9938K1835q1361r6618k941m4013M728J04107J44056
13254A62569J65800q9298n9118n7444K8700J45241L0492m5824j02488n296p3944
13243I9390m051L3541K6865j13639o2361n1186J75334M7733k9956j0244P838j04660
13231A4604m1408R2290P4913q5324k770J21791l2773P291J069n4592K8826n236
$$ y = [36797, 7019, -72187, -27693, 23422, -32267, 58351, 74610, 12424, 16215, -54847, -68273, -34709, -28923, 69805, 66807, 66224, -15155, 4646, 9861, 64423, 82208, 118605, 183727, 156277, 97721, 12665, -80301, -65877, 30993, 112729, 146472, 97784, 5732, 51984, 82392, 67855, 120992, 153515, 154536, 213988, 229798, 156005, 108668, 37390, 23246, 94012, 36468, -5456, -38323, -21264, 5389, 132714, 112776, 134611, 53250, -43368, -46309, -90322, -85594, 18513, 162569, 328369, 239071, 179953, 122509, 151209, 296450, 326942, 281118, 178630, 173334, 99390, 95339, 128880, 155745, 42106, -20255, -71441, 103893, 151626, 121670, 111426, 119264, 14604, -26804, 65486, 140399, 55075, 52305, 174096, 141323, 148614, 149683, 95091, 123917, 118681]
13219A18681q78r334O5871l1356j25493K2693Q4206L4347M1779M7079r7643r8188
13207E1764M4224J13619q7140l8053j6840n727N532R2724R998n1909j10707J2218
13195A9703P5454K0697q1578j0182R3022L1512n6500k8357p7457J6630Q574O8499
13183H0017M7866N2762j59237r9288N21J30191k3170J1170Q4L9060J24117L8842
13171B42935j16549j5638Q1848o2079o5740m6543P139L8586j0473L1261N5715
13160A40462M5768K2559K953o5524j50243j39072o3990J40783Q7939R7559M4578
13149A63772j03626o1058j0173Q4288l6173P1307K08m6465j3481J22945M0257
13138B11801r1101o445o7451q5747L3756M7019K9215M1063O7950Q6494rk1057
$$ y = [118681, 117803, 108469, 174340, 142984, 17491, 40184, 124390, 158737, 200516, 247595, 149952, 51764, 95988, 209607, 122467, 84414, 67574, 61847, 67379, 160103, 170101, 118192, 7485, 19703, 95157, 115854, 34276, 24094, 117116, 148628, 92128, 63771, -13686, 2944, 11518, 80017, 127883, 180645, 21408, -77880, -77359, 52832, 29662, 40832, 40916, 79976, 204093, 242935, 126386, 110748, 192596, 130517, 64777, 18234, 25373, 63959, 53486, 84747, 140462, 186230, 208789, 211742, 146218, -4025, -143097, -207087, -66304, 21635, 119194, 163772, 60146, -912, -11085, 73203, 37030, 108337, 108545, 62080, 48599, 171544, 211801, 120700, 114255, 46804, -38943, -5187, 41832, 71047, 112110, 180060, 266554, 266545, 245488]
13126B45488r9378q2409l4225N8819j6929j8589j6637J31172P2277p9151j6538
13115A43900q3564m5018j1632O2153N2971m1945P4406N7876J4216q7290j2145
13104A23928o0569k0851J16317m2883n6056k6311L2657J1169K3672J17758O9594
13093B88425M6220r7185n2474j88037j3752P9890L0871J07231O8972J573R8224
13082C69958l3884o91j17079o9359l3540j2197K5370P4652J2512N2754J64694
13071D33190J65588M1509q6882j55293q5364r6355q2503r2921K4045Q4212M8514
13060A97740R009q4325l1588K9948O7826M057p0353q460O1895j5288M6669M627
13048B11757m8430O1851J0274n7235q4232j37914R3843Q6103l0944Q262O5701
$$ y = [245488, 146110, 63701, 29476, 88295, 71366, 52777, 36140, 167312, 239589, 160438, 143900, 60336, 15318, 3686, 65839, 118810, 76865, 151271, 209147, 223363, 136073, 123928, 63359, 42508, 158825, 115942, 59886, 33575, 66232, 77401, 101073, 218831, 288425, 334645, 237460, 184986, -3051, -16803, 63087, 93958, 201189, 270161, 271734, 369958, 336074, 335383, 218304, 148945, 115405, 103208, 128578, 203230, 215742, 268496, 433190, 598778, 640287, 553405, 398112, 312748, 216393, 133890, 40969, 65014, 149226, 197740, 206749, 122424, 90836, 120784, 188610, 192667, 122314, 113854, 175749, 160461, 207130, 211757, 163327, 225178, 235452, 178217, 93985, -43929, 49914, 136017, 105073, 113335, 179036]
$$ [...]
##END NTUPLES=NMR SPECTRUM
##END=
