##TITLE=Analysis number 328519
Compound Code btb 09100
Project Code adrs
Chemist Name stores
##JCAMPDX= 6.0         $$ Bruker NMR JCAMP-DX V2.0
##DATA TYPE= NMR SPECTRUM
##DATA CLASS= NTUPLES
##ORIGIN= Bruker BioSpin GmbH
##OWNER= nmr
$$ XWIN-NMR		Version 3.5
$$ Tue Jun 12 13:25:40 2007 GMT Daylight Time (UT+1h)  MAYBRIDGE\nmr@NMR_250MHZ
##.OBSERVE FREQUENCY= 250.131544655141
##.OBSERVE NUCLEUS= ^1H
##.ACQUISITION MODE= SIMULTANEOUS (DQD)
##.ACQUISITION SCHEME= undefined
##.AVERAGES= 16
##.DIGITISER RES= 18
##SPECTROMETER/DATA SYSTEM= dpx250
##.PULSE SEQUENCE= zg30
##.SOLVENT NAME= CDCl3
##.SHIFT REFERENCE= (INTERNAL, CDCl3, 0, 16.522)
##AUDIT TRAIL= $$ (NUMBER, WHEN, WHO, WHERE, WHAT)
$$ ##TITLE= Audit trail, XWIN-NMR		Version 3.5
$$ ##JCAMPDX= 5.01
$$ ##ORIGIN= Bruker BioSpin GmbH
$$ ##OWNER= nmr
$$ C:\u/data/dgb/nmr/ADRS/750/pdata/1/auditp.txt
$$ ##AUDIT TRAIL=  $$ (NUMBER, WHEN, WHO, WHERE, WHAT)
(   1,<2007-06-12 13:25:20.56 +100>,<MAYBRIDGE\nmr>,<NMR_250MHZ>,
      <created by zg, POWCHK disabled, PULCHK disabled
       configuration hash MD5:
       76 6E 9A 78 1E 09 19 81 EC 84 63 8F B0 6A 59 2D
       data hash MD5: 64K
       9E 91 1D D7 92 8A 8E 29 3B 0F D8 F2 F1 91 D2 C9>)
(   2,<2007-06-12 13:25:32.95 +100>,<MAYBRIDGE\nmr>,<NMR_250MHZ>,
      <Start of raw data processing
       ef LB = 0.3 FT_mod = 6 PKNL = 1 SI = 32K 
       data hash MD5: 32K
       51 E7 61 9F DF 06 3E DF F8 82 17 4F 73 F0 2E 03>)
(   3,<2007-06-12 13:25:34.67 +100>,<MAYBRIDGE\nmr>,<NMR_250MHZ>,
      <apk 
       data hash MD5: 32K
       F0 E9 33 8E 32 69 21 C9 25 C2 3A C8 82 B1 49 1E>)
(   4,<2007-06-12 13:25:35.38 +100>,<MAYBRIDGE\nmr>,<NMR_250MHZ>,
      <abs ABSG = 5 
       data hash MD5: 32K
       B8 3F E6 C4 F5 93 C5 32 48 83 C5 68 99 69 47 E3>)
$$ ##END=
$$ 
$$ hash MD5
$$ 39 78 CC E3 0B 30 5D 0B 94 09 38 07 E2 7C 73 5C
##$RELAX= 
##$RELAX= 
##$RELAX= 
##$RELAX= 
##$RELAX= 
##$RELAX= 
##$RELAX= 
$$ Bruker specific parameters
$$ --------------------------
##$DU= <C:\u>
##$EXPNO= 750
##$NAME= <ADRS>
##$PROCNO= 1
##$TYPE= <nmr>
##$USER= <dgb>
##$AMP= (0..31)
100 100 100 100 100 100 100 100 100 100 100 100 100 100 100 100 100 100 
100 100 100 100 100 100 100 100 100 100 100 100 100 100 
##$AQSEQ= 0
##$AQ_mod= 3
##$AUNM= <au_zg>
##$AUTOPOS= <24 >
##$BF1= 250.13
##$BF2= 250.13
##$BF3= 250.13
##$BF4= 250.13
##$BF5= 500.13
##$BF6= 500.13
##$BF7= 500.13
##$BF8= 500.13
##$BYTORDA= 1
##$CFDGTYP= 0
##$CFRGTYP= 5
##$CHEMSTR= <none>
##$CNST= (0..31)
1 1 145 1 1 1 1 1 1 1 1 1 1 1 1 1 1 1 1 1 1 1 1 1 1 1 1 1 1 1 1 1 
##$CPDPRG= <>
##$CPDPRG1= <>
##$CPDPRG2= <>
##$CPDPRG3= <>
##$CPDPRG4= <mlev>
##$CPDPRG5= <mlev>
##$CPDPRG6= <mlev>
##$CPDPRG7= <mlev>
##$CPDPRG8= <mlev>
##$CPDPRGB= <>
##$CPDPRGT= <>
##$D= (0..31)
0 1 0 0 0 0 0 0 0 0.06 0 0 0 0 0 0 0.0002 0 0 0 0 0 0 0 0 0 0 0 0 0 0 
0 
##$DATE= 1181651119
##$DBL= (0..7)
120 120 120 120 120 120 120 120 
##$DBP= (0..7)
150 150 150 150 150 150 150 150 
##$DBP07= 0
##$DBPNAM0= <>
##$DBPNAM1= <>
##$DBPNAM2= <>
$$ [...]
##$SUBNAM7= <"">
##$SUBNAM8= <"">
##$SUBNAM9= <"">
##$SW= 20.6930455092707
##$SWIBOX= (0..15)
0 0 3 0 0 0 0 0 0 0 0 0 0 0 0 0 
##$SW_h= 5175.983436853
##$TD= 65536
##$TD0= 1
##$TE= 297.16
##$TE2= 300
##$TE3= 300
##$TEG= 300
##$TL= (0..7)
0 120 120 120 120 120 120 120 
##$TP= (0..7)
150 150 150 150 150 150 150 150 
##$TP07= 0
##$TPNAME0= <>
##$TPNAME1= <>
##$TPNAME2= <>
##$TPNAME3= <>
##$TPNAME4= <>
##$TPNAME5= <>
##$TPNAME6= <>
##$TPNAME7= <>
##$TPOAL= (0..7)
0.5 0.5 0.5 0.5 0.5 0.5 0.5 0.5 
##$TPOFFS= (0..7)
0 0 0 0 0 0 0 0 
##$TUNHIN= 0
##$TUNHOUT= 0
##$TUNXOUT= 0
##$USERA1= <user>
##$USERA2= <user>
##$USERA3= <user>
##$USERA4= <user>
##$USERA5= <user>
##$V9= 5
##$VALIST= <valist>
##$VCLIST= <CCCCCCCCCCCCCCC>
##$VD= 0
##$VDLIST= <DDDDDDDDDDDDDDD>
##$VPLIST= <PPPPPPPPPPPPPPP>
##$VTLIST= <TTTTTTTTTTTTTTT>
##$WBST= 1024
##$WBSW= 4
##$XGAIN= (0..3)
0 0 0 0 
##$XL= 0
##$YL= 0
##$YMAX_a= 413180
##$YMIN_a= -406792
##$ZGOPTNS= <>
##$ZL1= 120
##$ZL2= 120
##$ZL3= 120
##$ZL4= 120
##$ABSF1= 16.522
##$ABSF2= -4.171173
##$ABSG= 5
##$ABSL= 3
##$ALPHA= 0
##$AQORDER= 0
##$ASSFAC= 0
##$ASSFACI= 0
##$ASSFACX= 0
##$ASSWID= 0
##$AUNMP= <proc_1d>
##$AZFE= 0.1
##$AZFW= 0.1
##$BCFW= 0
##$BC_mod= 0
##$BYTORDP= 0
##$COROFFS= 0
##$CY= 12.5
##$DATMOD= 1
##$DC= 0
##$DFILT= <>
##$DTYPP= 0
##$F1P= 14.0000005364418
##$F2P= -0.99999901652339
##$FCOR= 0.5
##$FTSIZE= 32768
##$FT_mod= 6
##$GAMMA= 0
##$GB= 0
##$INTBC= 1
##$INTSCL= 1
##$ISEN= 128
##$LB= 0.3
##$LEV0= 0
##$LPBIN= 0
##$MAXI= 10000
##$MC2= 0
##$MEAN= 0
##$ME_mod= 0
##$MI= 0
##$NCOEF= 0
##$NC_proc= -2
##$NLEV= 6
##$NOISF1= 0
##$NOISF2= 0
##$NSP= 0
##$NTH_PI= 0
##$NZP= 0
##$OFFSET= 16.522
##$PC= 1
##$PHC0= -56.69695
##$PHC1= 10.79873
##$PH_mod= 1
##$PKNL= yes
##$PPARMOD= 0
##$PSCAL= 4
##$PSIGN= 0
##$REVERSE= no
##$SF= 250.13
##$SI= 32768
##$SIGF1= 0
##$SIGF2= 0
##$SINO= 400
##$SIOLD= 32768
##$SREGLST= <1H.CDCl3>
##$SSB= 0
##$STSI= 32768
##$STSR= 0
##$SW_p= 5175.98343685301
##$SYMM= 0
##$S_DEV= 0
##$TDeff= 65536
##$TDoff= 0
##$TI= <Analysis number 999999
Compound Code 99
Book Reference 9
Project Code 9>
##$TILT= no
##$TM1= 0
##$TM2= 0
##$TOPLEV= 0
##$USERP1= <user>
##$USERP2= <user>
##$USERP3= <user>
##$USERP4= <user>
##$USERP5= <user>
##$WDW= 1
##$XDIM= 32768
##$YMAX_p= 403483449
##$YMIN_p= -57191
$$ End of Bruker specific parameters
$$ ---------------------------------
##NTUPLES= NMR SPECTRUM
##VAR_NAME=  FREQUENCY,     SPECTRUM/REAL,   SPECTRUM/IMAG
##SYMBOL=    X,             R,               I
##VAR_TYPE=  INDEPENDENT,   DEPENDENT,       DEPENDENT
##VAR_FORM=  AFFN,          ASDF,            ASDF
##VAR_DIM=   32768,         32768,           32768
##UNITS=     HZ,            ARBITRARY UNITS, ARBITRARY UNITS
##FACTOR=    0.157963299565203, 1,           1
##FIRST=     4132.6476996994, 0,             0
##LAST=      -1043.33573715361, 0,           0
##MIN=       -1043.33573715361, -57191,      0
##MAX=       4132.6476996994, 403483449,     0
$$ Real data points
##PAGE= N=1
##DATA TABLE= (X++(R..R)), XYDATA
$$ [...]
##PAGE= N=2
##DATA TABLE= (X++(I..I)), XYDATA
21286 349138 343979 357393 359383 358294 359508 372261 392230 377696 367201 361567 351351 348966 348418
21273 348418 346655 344061 329068 324989 338148 338436 343679 343608 345110 344679 337363 330617 337075 350730
21259 350730 347865 347077 358152 351423 342207 349362 365200 377361 372895 359710 354477 363572 358149
21246 358149 350301 344175 351211 368813 383020 376058 367546 371203 368176 366241 360156 357531 360273 365390
21232 365390 363179 365223 364984 355658 358946 365201 387225 386829 382853 380563 394594 400384 388698 375324
21218 375324 376211 376765 358773 347244 346472 354095 358396 361106 370133 384206 374912 360044 346884 346979
21204 346979 350838 339727 344194 376126 372516 361130 367064 353367 353911 367908 368690 352017 346209
21191 346209 350905 343543 355326 368370 381873 378452 369591 369965 362527 348347 352243 364492 362581
21178 362581 361696 353617 339863 344559 351516 348080 353046 358977 367523 365513 367497 369676 363968 352812
21164 352812 350533 342294 347361 350246 355742 353561 343666 348722 346178 346841 360017 371736 378485 362206
21150 362206 374857 375435 359363 342782 338619 334736 352139 357404 368309 375025 369027 366937 364702
21137 364702 365138 354407 361903 358827 368047 365502 356330 362493 380532 378964 378269 386089 389704 388698
21123 388698 383623 380066 377280 386191 381697 375526 368884 365435 360220 361202 366657 362145 370787 382083
21109 382083 365844 358801 353993 359491 386833 392120 404366 407721 388358 363859 365884 358961 359728
21096 359728 366209 368494 359820 373925 381529 358577 364919 365258 368792 359017 350014 352333 367955 366579
21082 366579 356596 348580 358354 359067 355173 362749 355439 351524 370223 380039 375229 378651 371565 365939
21068 365939 376637 372050 363250 372871 377547 374396 375371 374567 367123 365131 353039 361068 360900 363771
21054 363771 364270 350697 348593 354422 361998 377019 384948 377723 364692 368280 375076 384342 370371
21041 370371 366794 382718 374448 372659 379710 378710 385649 385156 379063 358681 349669 345796 352278 365342
21027 365342 385256 389038 377088 367258 369126 370969 370742 359098 367956 373457 375733 364570 381999
21014 381999 384624 387408 378616 361902 362361 370555 389457 388089 384036 388546 387207 395026 393809 398098
21000 398098 408034 414076 407971 389368 380832 385337 386169 379014 377696 374870 377699 385333 370254 353570
20986 353570 357007 374401 376222 378341 380952 368200 366017 372955 372456 348628 356797 380149 383172
20973 383172 382855 395587 409160 378011 362341 367484 372117 372100 380868 392000 387605 396800 391769 385048
20959 385048 374257 363513 359346 369075 373789 369719 369284 380643 383748 374300 375125 372353 375198 374882
20945 374882 368903 368752 362031 367546 388153 390644 401454 404201 398568 408550 400937 381747 373846 371785
20931 371785 367265 370077 375577 375763 373716 362080 349154 353182 343808 351281 360165 359915 356941 340285
20917 340285 347881 373299 378071 367789 362316 365181 370257 356544 363062 371951 373536 375864 378918
20904 378918 374625 378044 392053 394311 392101 390626 387183 383128 382143 379408 369610 354025 353616 356189
20890 356189 361763 371314 388513 382166 387699 393298 385376 390201 402464 395168 386026 376213 373385 383850
20876 383850 395821 382386 384865 388768 376667 373631 379097 380823 365376 368559 387335 401513 398191
20863 398191 384398 386210 399103 404549 399962 386791 385987 382104 383434 387645 399967 387666 382134
20850 382134 386882 388765 389454 386272 367990 360086 360197 380082 377683 374044 379866 375093 358522 366288
20836 366288 379427 390636 396172 387697 383664 379619 368211 380359 404032 408392 401151 397864 399138
20823 399138 388370 385884 376941 382383 400329 401338 379630 365978 371490 375030 377741 384250 383224
20810 383224 388643 387768 370180 357051 356686 363654 368352 355640 360802 384215 405937 411420 411441 401314
20796 401314 388374 389053 397770 390283 406201 399640 393691 392590 383130 379765 395098 407089 408214
20783 408214 402550 390576 394467 388039 383286 386510 381202 378957 392693 402104 399803 401224 390854
20770 390854 388443 399580 408725 403990 405930 398528 387090 381815 388745 389475 392628 402106 410876 414738
20756 414738 412092 403155 392430 384110 382524 381189 383429 379953 377459 380558 388331 404188 404944 402607
20742 402607 409705 413032 410234 397248 376790 371960 392262 398625 402480 395371 388674 393670 385117
20729 385117 382461 386090 383082 397245 404903 392473 393563 412009 404117 391596 384884 393654 400616
20716 400616 394733 387735 377485 370198 377316 391053 402058 395475 391184 381881 378083 377243 387337
20703 387337 388959 388504 388454 393238 384952 384524 387168 381953 392616 394357 388209 390600 412861 412452 401728
20688 401728 398888 412710 402902 408431 408058 404964 398362 395077 396972 403912 407724 409066 406165 385706
20674 385706 383940 381562 371438 367749 375577 377942 383321 389191 385668 397868 401483 398974 401537 413414
20660 413414 422833 416770 412573 409739 404596 402955 400133 401116 415961 416325 414673 402709 393165 409324
20646 409324 401002 386462 382008 395569 410002 403393 398941 395009 395829 405429 400082 394447 392258 396548
20632 396548 381953 367612 369412 379583 385444 398570 405440 409499 411801 414118 411285 410145 417532
20619 417532 405893 399126 415686 417304 413171 405478 400364 390552 372332 373550 380566 383924 394872
20606 394872 397226 386739 392292 397856 378890 387712 395517 401027 386318 382714 403924 404061 411278
20593 411278 428642 430186 425369 410387 387453 380029 381579 381558 385260 393162 390391 400705 405661 397290
20579 397290 390463 378243 385490 386521 384535 389468 391062 407798 412384 416143 414342 397475 391392
20566 391392 388698 391448 393727 401475 398721 387046 385528 407384 424553 415086 423511 416458 405796
20553 405796 401032 404661 405978 388988 376102 355260 370465 380675 379064 377440 375082 390940 407953
20540 407953 405615 402014 415450 410202 405877 413917 404094 393005 396790 406390 427254 409498 395743
20527 395743 394118 397740 396016 388052 393104 387930 385750 388511 399848 409536 415682 423924 432201 436369
20513 436369 418194 389698 381072 372427 376658 370520 377338 393501 387985 371660 370138 376019 382305
20500 382305 377009 366938 375121 386243 414827 436405 430616 417865 404198 394585 399980 400245 383091
20487 383091 370864 381016 386885 387028 389935 403729 401635 394766 385642 384000 393387 388246 382569 393647
20473 393647 408472 419314 419312 419448 411299 402625 399376 402606 398422 391543 393156 399566 403742 405700 389571
20458 389571 397599 409171 414775 419701 403096 393651 391539 391245 392410 397100 405192 395946 385357 393133
20444 393133 390023 391665 378949 383670 401846 403223 395701 407794 416186 423002 408895 384498 383477
20431 383477 394261 404706 404316 406539 407823 415087 435124 426193 406433 402811 400171 400963 394057 393486
20417 393486 408539 424426 434296 432081 425775 414199 421019 418315 412094 410822 406900 417868 416887
20404 416887 417356 419111 410338 401523 399936 404313 413672 417939 411541 409583 414275 416028 417843 418293 444215
20389 444215 444523 424278 416783 412260 412351 421437 412189 415657 403745 398462 407707 407956 416468 421804 434275
20374 434275 437378 425470 430048 444523 444957 428647 429572 443415 437869 424966 430904 428700 420673
20361 420673 427197 432101 425588 414272 393801 380185 390222 389551 395084 412772 415968 414997 415838 418431
20347 418431 422952 430632 433018 443004 436183 431433 438838 429225 410221 392868 385072 390183 399297 390576
20333 390576 408888 430258 420726 412552 416460 404564 408956 416333 410866 398844 398891 392940 398080 411208
20319 411208 423614 436040 436682 434219 429109 410430 403766 414354 421952 421043 433111 426177 414748
20306 414748 404756 420837 412531 411465 411244 404366 415713 438271 435488 430907 411759 398490 396306
20293 396306 405317 408008 418770 411124 398802 400808 400533 401456 413135 418356 415994 412098 411141 403569
20279 403569 407552 417606 430431 423374 407274 411028 414277 412426 410347 421986 414452 425266 427475
20266 427475 414577 421188 412657 414068 400096 413119 421194 421825 422321 417734 417789 420054 426674 429273
20252 429273 438494 438680 429377 434066 428177 421199 414197 414455 421321 410092 410859 417698 414423 402937
20238 402937 406230 418854 417893 409023 403841 417756 420316 430055 431178 421957 413622 409364 415124 421185
20224 421185 426013 418282 419576 415666 414173 423670 422474 414567 419700 424743 434188 431400 431033 430461 434729
20209 434729 430629 415115 417822 421539 406277 396114 402251 413911 418471 421584 428078 414699 422573
20196 422573 424547 410134 404940 401622 404461 408441 406655 418154 411352 405871 408226 427921 434495
20183 434495 433546 437700 450941 440329 436915 438132 424055 426697 416083 405798 396955 394163 399724
20170 399724 399575 407004 417506 419001 412107 399464 401272 415085 426691 435926 445805 450826 445831
20157 445831 437409 437763 424082 416002 415441 414011 423622 439146 447107 441311 426959 412885 418962 424645
20143 424645 417348 424081 426468 433202 445492 442340 425228 433624 436205 437103 425728 415979 401352
20130 401352 390236 385038 396318 405354 416654 414151 422553 432386 438321 431078 423312 428253 426296
20117 426296 431701 451042 447173 451717 446748 436158 440087 441565 430404 420897 424326 438321 441747
20104 441747 442882 428107 414753 408833 409996 417925 423897 426393 429794 431205 428310 428969 417204 410441
20090 410441 417925 425742 436402 441865 438480 424656 439933 460821 466180 467109 462782 446578 430063
20077 430063 417058 428004 442865 445489 439714 437745 440719 434632 434448 439242 433113 435716 450072
20064 450072 466244 455676 440928 442117 438955 435931 445489 445989 449939 459324 462765 462654 451545 457145
20050 457145 441034 415505 403270 411880 423822 436382 428782 419776 418310 430259 425808 414237
20038 414237 406444 417082 403375 417376 440275 440087 434278 418787 422996 432327 437791 433291 440902
20025 440902 441530 436549 433802 435414 428584 440187 443004 444419 450218 441286 449452 450511 443861 433890
20011 433890 436294 454408 457462 434932 435365 449264 456524 451700 450979 443364 441542 446081 450318 443683
19997 443683 431462 435800 430603 432709 414966 416899 435957 446579 439088 442353 446838 440292 442065
19984 442065 438931 441322 447406 443421 435116 445068 451995 455580 458871 457804 448802 441396 441882 456834
19970 456834 462317 457402 452380 439424 425806 420665 431307 446400 434744 434483 441615 434600 444814
19957 444814 446970 444942 444189 449015 446214 460541 469572 471617 460486 448399 440179 444094 455671
19944 455671 445340 445198 429963 422335 427521 433620 441434 437208 411426 412025 423994 431249 426007 414686
19930 414686 417980 438654 452266 454465 453671 442791 438498 436620 435443 427716 431433 443932 456191
19917 456191 455436 449199 454104 451242 439284 429509 432286 428458 439328 449581 437789 431204 436990
19904 436990 436171 426542 442466 452545 451818 450693 450550 454788 449014 458346 454494 446334 461148 465615
19890 465615 458783 444091 438966 428888 427925 440732 440380 439534 443626 451625 455906 454369 450713 446781
19876 446781 451965 446136 440268 443657 448107 459925 460987 455809 451546 462007 463976 452663 437038
19863 437038 422031 418408 439565 444539 439497 437367 438760 433880 436807 448344 456121 448704 454741
19850 454741 451061 453235 456980 460243 463548 448481 438795 435418 433684 439571 441500 443695 453014 436759
19836 436759 436675 455274 447682 424656 422935 440520 440069 437217 447086 459193 461364 453572 456061 444881
19822 444881 430423 429691 428006 441096 439907 450759 457816 439692 428263 433297 446928 456115 454141
19809 454141 459845 468079 456563 451355 445389 430230 438751 457666 456181 451350 461241 459873 461510
19796 461510 469633 474210 475547 481390 485615 477957 472195 474885 477265 468269 447248 433038 436174 445663
19782 445663 454449 451531 444144 458004 463997 472557 469972 454314 442142 448875 454254 457219 458645
19769 458645 455450 449356 461325 452557 438919 442426 440315 447783 449997 464479 463628 454461 464023 465253
19755 465253 465719 462836 449555 442124 445938 452185 460270 447946 430048 428963 432903 443538 450930
19742 450930 451033 449626 451692 453341 465235 479748 487847 479508 461786 455688 466378 472891 478668
19729 478668 486473 475753 467525 464740 468084 474263 472913 477014 498798 505742 487441 470826 460052
19716 460052 465975 465294 479907 495117 496104 479842 466073 457839 463299 477055 490854 473494 470325
19703 470325 471227 466588 467997 470973 474229 480607 484448 467599 468685 477433 483387 474959 476027 483208
19689 483208 475319 469025 467253 467330 453799 455093 462126 472519 474686 478489 478583 462108 458482 479995
19675 479995 473054 463199 463145 462336 461535 471204 474693 462557 469456 476208 461437 449691 457011 460086
19661 460086 467069 475812 470935 454144 454615 459292 464520 447329 432784 437276 445483 470249 470346 449249
19647 449249 442440 448321 448044 456156 453564 457247 458642 466010 474024 477472 487176 502508 497078 488777
19633 488777 490149 490350 491721 472622 469901 465774 471377 476936 463643 467756 477633 465571 464475 466705
19619 466705 464547 466871 468605 463501 445623 440703 451448 470058 490809 498201 484976 479067 491921
19606 491921 483337 472127 459433 473006 471827 459910 472911 475462 474581 465206 464766 473483 464359
19593 464359 468147 472562 479293 474070 467713 460283 483986 487871 488192 507251 503262 497240 501486 492720
19579 492720 492580 481679 479884 481829 481015 482246 494553 502085 505476 504311 493620 484435 479757 483051
19565 483051 479994 484607 485961 479298 467134 464551 474762 489134 488263 483580 476222 472188 465470 476913
19551 476913 483423 475120 464834 464792 472567 481016 484311 477548 467089 477448 478525 493067 492632 504349
19537 504349 519767 511794 499508 486508 485301 487048 488948 489267 491161 491510 483641 488025 492894 485894
19523 485894 470376 468787 483770 483681 486889 477427 476395 487850 489482 488716 489993 484577 490667 490416
19509 490416 489120 486575 481421 481814 489517 487721 487161 480380 481415 484321 495770 486651 480802 486945
19495 486945 487252 492745 496700 500284 487072 488605 490102 475512 469670 472134 473367 478045 489841 494244
19481 494244 475712 463218 464719 460473 467974 480732 486124 479242 472297 475469 484816 490668 488956
19468 488956 489905 499525 497758 486577 481963 478688 505963 513385 497062 495268 508531 509816 490643
19455 490643 490433 505958 494114 482108 481757 496624 491135 487255 489209 489612 500827 507016 507388 504272
19441 504272 497820 501693 499333 498315 520997 527417 514282 510893 508872 504577 512624 510104 507065 509425
19427 509425 508665 506385 502995 509487 514457 510450 519444 520032 521944 520026 509660 510921 503756 500239
19413 500239 483534 496409 512382 523035 537026 531643 539048 524344 509383 513175 510400 512889
19401 512889 520847 524090 528526 536684 525301 510241 510558 505373 520708 515221 501791 505862 511373
19388 511373 509976 519145 514932 522705 519998 518133 526816 526228 529130 529671 522872 516349 519590 534943
19374 534943 525876 529230 516771 519881 525533 517233 500351 488745 497797 487767 499806 507533 514584
19361 514584 512219 505847 500148 501345 504012 499934 497836 501800 499820 505633 511969 508486 510807 510110
19347 510110 517783 521940 515797 510050 499333 497286 494933 501905 500450 496868 507043 511525 514467 529761
19333 529761 525768 517216 510516 515325 526172 520454 511904 517304 529219 521449 510677 519561 531097
19320 531097 540955 544189 525509 495622 489048 513825 519020 509873 515813 515998 509229 509629 521534 526348
19306 526348 510107 515049 522686 526214 516699 516894 532124 536761 534035 520314 523146 534983 555673
19293 555673 571678 565041 547284 526564 526212 523697 520871 530122 544032 538332 524802 535064 541414
19280 541414 526670 527562 529510 523817 516649 516979 515898 529331 536373 531043 522897 515651 517188 519113
19266 519113 523496 514602 495787 497460 502228 494356 495768 493168 504640 493645 483590 502469 515741
19253 515741 498719 494281 497266 498855 512266 513510 517859 528371 527628 522775 529045 542895 552418
19240 552418 565373 554163 549556 534005 524639 521378 509419 507745 516011 531206 523282 505817 505078
19227 505078 515290 528137 525521 531603 540341 538624 551916 555072 544875 539429 536852 537626 534851
19214 534851 528885 527684 531223 529222 529393 530365 527637 507016 512668 521860 517075 517968 519855 531448
19200 531448 544867 546434 537037 537859 542670 541745 537208 533105 517425 517338 526488 529005 526935 552587
19186 552587 575025 569171 561569 550259 541949 530912 527099 526290 529852 533155 540996 545676 537326 525806
19172 525806 515163 516338 536154 546311 541198 534681 544965 554601 549491 540019 535993 551437 559468
19159 559468 561002 558788 551198 553629 552867 559387 558317 549188 547020 540663 539882 542457 533242 532558 541748
19144 541748 546408 548261 537800 526281 520134 533673 553733 555125 536662 535869 537907 529557 529128
19131 529128 538156 525615 526619 522262 529219 541608 532776 524419 525040 544214 542811 542710 559666 562749
19117 562749 573778 575918 568225 548063 540235 530740 518437 524891 530844 538314 547091 552154 547433
19104 547433 535681 526644 529439 533563 544701 550741 565617 556275 547322 549976 550030 548094 530939 521252
19090 521252 528734 530765 546155 548800 552056 550914 538038 539847 538621 540991 535063 519498 521565
19077 521565 538142 539175 547616 544408 541963 540111 535527 541285 545366 552559 546526 537796 546599 552197
19063 552197 546953 553311 540100 524479 542850 544706 548616 560917 567615 576626 563199 555506 563590
19050 563590 575177 562575 561097 560853 544651 551445 556425 541623 537783 536190 547802 555410 548133
19037 548133 543083 549342 556653 561963 572969 575254 570355 561215 569382 576348 587976 589818 593306 586123
19023 586123 573010 576290 561720 555975 561497 570769 565129 563272 560946 557560 541570 536986 545693
19010 545693 549798 562491 576294 573670 565077 556166 554528 548261 557398 563310 565980 571757 561389
18997 561389 558123 555947 551486 551370 543871 540534 561738 568267 554921 545090 548363 552864 557270 560988
18983 560988 566054 573032 571003 565699 576409 590376 597948 591645 594291 590728 575393 576899 581290
18970 581290 566108 545995 551378 548674 554561 561919 565923 572151 554739 541663 544066 547832 544642
18957 544642 548153 549245 550328 555670 563157 556456 553869 558556 556427 551677 545001 567160 581982 577608
18943 577608 573355 563805 564136 564103 575247 585291 586735 579374 577765 583737 592380 597373 588877 569210
18929 569210 561128 575603 582110 580619 574328 573097 581286 575749 559732 554862 564333 566835 565801 565999
18915 565999 567022 565001 579577 603846 613015 602899 583160 577959 581017 578430 576892 577116 561398
18902 561398 558370 574942 597924 613928 612383 597477 575762 577408 593438 588468 572269 572753 577059
18889 577059 576271 585503 599912 602622 600143 592266 586919 580844 582868 585473 580402 580771 594859 592694
18875 592694 595024 593911 597646 592262 582520 608147 622984 626466 599793 599781 599270 575411 560835 566693
18861 566693 577129 577224 584560 592012 611837 607254 607315 615177 614410 598973 588122 591437 610477 609804
18847 609804 610834 622538 628907 636461 617488 601395 590026 575169 570859 570001 568611 579154 591471
18834 591471 589876 595367 599334 610781 602139 582443 566495 562504 556816 579704 594058 594228 597715
18821 597715 601099 595004 599699 608926 608709 591384 583201 596315 614735 623510 638405 650201 649617
18808 649617 645601 615855 602034 594824 594868 611654 614499 622448 632563 616040 617793 613021 617825
18795 617825 622497 611245 618490 612813 616688 616011 614315 616975 624023 616396 611449 611455 630910 626023 617493
18780 617493 628749 638767 630859 634994 644512 653307 666995 657261 659549 668211 685588 687568 701880
18767 701880 692855 646664 582283 544356 532685 538141 558081 566754 579304 591992 607782 609623
18755 609623 609662 603542 612208 622625 618724 594073 593598 598832 595857 609759 626334 629618 611788 599854
18741 599854 594670 601022 615786 615491 629160 627287 626229 621486 612669 620824 617155 618923 618828 624126
18727 624126 627340 616269 603464 614565 626410 628066 636304 630066 613891 609169 612957 610211 618399
18714 618399 621160 630929 624978 637267 637218 630324 627000 628951 630807 616073 609081 621367 631224 628252
18700 628252 622248 602090 604655 606959 616707 638346 641449 640513 633346 633731 635713 634639 637561 656622
18686 656622 665778 646786 633828 632612 634240 636430 642426 630293 618905 624558 625673 620708 622600
18673 622600 627712 638039 650818 645530 638905 644246 654798 651607 644564 630267 629425 644967 658361
18660 658361 655446 641815 629518 640595 656563 666055 655726 651923 652117 654405 648727 656848 661878
18647 661878 659697 657641 657469 655693 659571 647111 638192 641387 643248 653553 653345 641138 637308 660479
18633 660479 679163 670527 653735 666884 668278 665293 666328 657501 657874 655790 657416 661451 647683
18620 647683 643120 662678 661325 665106 687465 680049 676691 676335 675841 684421 685167 670748 667274 687246
18606 687246 700097 696213 682149 657506 642769 642043 652864 655743 647410 659414 668996 667515 659112
18593 659112 659448 670407 671544 664185 671053 664128 669917 671941 670748 666159 652674 654463 663883 677507
18579 677507 692514 677457 676659 675987 676231 687935 686771 671509 672542 681451 679092 691853 695128 681246
18565 681246 683666 689292 676440 689697 685850 679880 680185 687580 690303 711764 705796 686151 673336
18552 673336 677090 689229 705931 724458 703278 705047 697341 698026 689974 683542 674719 681745 689118
18539 689118 682525 683495 679317 679809 690397 703953 696615 704412 703991 706069 703612 699370 691214 687136
18525 687136 697400 708364 713407 717904 718342 716126 716688 720005 699672 689717 688367 685174 688231 689906
18511 689906 695780 695217 695343 701065 710194 714027 717062 711604 719812 737663 749530 745164 730972 730708
18497 730708 732111 733677 717861 707613 710144 712323 717507 732389 731549 734885 736732 744809 741947 737441
18483 737441 725928 718111 738372 741798 746860 744343 746147 753360 760813 749127 736906 733779 731189
18470 731189 719236 725064 724339 724292 728253 748151 754165 749842 750777 750023 758606 773939 773694 774573 778533
18455 778533 768237 760121 747604 746511 741438 761646 772029 769179 772026 776934 773150 766112 765610
18442 765610 773680 772838 770221 766265 767298 757276 763000 771626 776600 773420 778480 768018 759697 750095
18428 750095 763194 771282 774160 779482 775056 761940 757926 776431 772140 755692 752262 752075 749908
18415 749908 753331 766976 796790 795263 796988 797701 805259 799063 788902 786879 786553 779858 782867 798847
18401 798847 798342 782164 781601 788413 790133 786164 800798 815091 813799 805758 795318 790257 793705 795300
18387 795300 813677 835196 858583 837968 815292 801889 806241 807806 806044 807211 818892 836568
18375 836568 841820 842420 846807 841124 839952 844006 861539 865373 857208 861737 873896 876434 854599 840917
18361 840917 835207 838292 841591 827006 831703 840346 840989 846155 856045 855741 851357 842583 835544 830762
18347 830762 827955 828220 845674 861019 863765 858632 864709 867594 879311 875900 867276 865055 873415 873564
18333 873564 877341 885666 893804 889236 869245 858215 860674 863315 863901 877321 892101 887006 899909
18320 899909 895793 879117 883525 891462 897731 911446 901002 904453 922266 926381 914956 906644 906582
18307 906582 921518 923636 915892 925216 928713 928350 931023 934927 942943 949844 941823 933955 946162 947387
18293 947387 951640 948646 953132 963132 954076 947402 950176 963606 977605 979719 978801 976542 980326 970046
18279 970046 975451 978559 977247 968768 973133 978872 972740 970031 980252 984678 990616 995877 992303 995737
18265 995737 982939 982814 1005071 1024104 1025841 1036673 1034445 1032249 1031760 1044034 1045096 1050366 1046722
18252 1046722 1033314 1040576 1055913 1071354 1082412 1084067 1083563 1086861 1112209 1117454 1110104 1120652 1123160
18239 1123160 1124039 1124018 1121166 1129698 1135007 1143180 1159666 1151265 1136536 1124150 1115804 1140882 1156357
18226 1156357 1164619 1177403 1181546 1177202 1177944 1175139 1172881 1175323 1184992 1188068 1187579 1203124 1213043 1228269
18212 1228269 1231749 1224727 1218971 1213429 1216053 1223318 1229158 1243509 1267499 1269218 1265011 1281239 1288089
18199 1288089 1300960 1310549 1339610 1354380 1357906 1357158 1368242 1386115 1395557 1408644 1403675 1394973 1408261
18186 1408261 1436099 1442155 1452016 1465302 1470855 1471991 1489434 1519147 1529339 1542586 1551578 1591990
18174 1591990 1611684 1619165 1637314 1648497 1644786 1650055 1674208 1709364 1730484 1748816 1791707 1823010
18162 1823010 1835350 1853005 1877153 1902813 1928816 1951203 1979041 2017067 2028501 2049764 2076464
18151 2076464 2112409 2158286 2179999 2199385 2237800 2284201 2328721 2370253 2419503 2478283 2544699
18140 2544699 2618020 2679265 2728021 2801344 2866943 2943795 3039567 3150318 3240942 3344334 3477832
18129 3477832 3610229 3753803 3920714 4106986 4316154 4535253 4775450 5048932 5343051
18120 5343051 5701249 6133507 6618156 7176615 7850294 8695256 9745725 11066128 12723228
18111 12723228 14614090 16014645 15242047 9586437 -2909365 -12886329 -15370053 -14430019
18103 -14430019 -12545652 -10705186 -9182254 -7992950 -7057170 -6296056 -5658582 -5116564 -4693264
18094 -4693264 -4323170 -3968670 -3663501 -3410759 -3165042 -2962969 -2784674 -2636222 -2483974
18085 -2483974 -2325992 -2212287 -2100325 -1979992 -1882078 -1788167 -1705556 -1622164 -1550876 -1470331
18075 -1470331 -1403782 -1339884 -1276873 -1236358 -1199855 -1142031 -1081004 -1015920 -976235 -929336 -880843
18064 -880843 -843057 -816325 -787656 -775868 -760659 -735891 -717296 -707850 -676476 -645771 -618184 -594723
18052 -594723 -565505 -556205 -545476 -523802 -498740 -479580 -457793 -437921 -418183 -410375 -396205 -384695
18040 -384695 -370095 -347570 -329356 -327852 -325966 -296267 -276421 -277273 -274942 -263541 -242080 -233728 -233516
18027 -233516 -214108 -181256 -160698 -140507 -117502 -111029 -103729 -100462 -103396 -81375 -68285 -69741
18015 -69741 -53987 -42949 -26367 -15186 -18222 -23269 -19052 -8403 -8557 9840 19129 24838 40250
18002 40250 51347 61462 53703 52598 67563 79324 83798 73290 58166 64171 72978 78617 80792
17989 80792 71867 56690 59327 66070 73974 73421 74366 72977 73951 64186 54065 64210 84178 99661
17975 99661 103712 110391 116082 113975 116380 121024 115123 131599 152087 170465 173798 158398 165113
17962 165113 179457 182087 192352 201845 209108 232056 231285 216522 219776 213607 201719 206448 214875
17949 214875 211466 209823 203987 200948 199169 208106 226412 225951 223385 212557 212408 218515 241690 245714
17935 245714 237604 243678 230075 224050 229556 233440 231215 236501 239218 253710 270624 275660 277547
17922 277547 277754 267221 271881 275032 263743 256622 263895 269682 283569 291426 302147 301784 299298 302367
17908 302367 304436 293612 289593 282976 287613 278522 290119 308944 324574 334059 343827 327706 331913
17895 331913 329238 330567 337429 345927 336474 317873 325891 329297 329349 328535 333178 338671 346572 356227 363037
17880 363037 353098 358373 373247 374676 376214 380750 377573 375144 368564 370726 376400 362493 370192 373845
17866 373845 375701 388657 387820 391617 388379 388132 407597 411811 399033 383296 383315 386272 392549 389750
17852 389750 392303 383396 379021 377126 383114 390621 385939 388452 388679 395614 398705 414730 419501 411884
17838 411884 417913 421635 430199 434892 425413 421953 429705 415693 413817 405331 405858 422657 428023 433716
17824 433716 440372 443243 416590 406412 415565 423769 440426 445826 430045 423632 428899 423702 418271
17811 418271 424462 422752 432683 451365 450361 438196 443936 444389 440917 437290 442290 444655 451453 436062
17797 436062 420115 424804 423939 425756 439435 449517 455850 451443 452999 461010 466070 467074 468983 467668
17783 467668 457420 463947 476534 482308 485511 492955 487268 477566 472311 456048 465195 460567 466514
17770 466514 478748 490842 498780 497176 493416 491167 491687 508904 520762 506944 503666 507911 507425
17757 507425 505565 506979 513347 509615 509349 497935 491255 495532 502769 509327 499819 509930 506632 510572
17743 510572 513548 511211 511043 501932 497699 510507 520339 519585 501538 493330 509686 513534 512777 509611
17729 509611 520501 527430 517963 497785 493698 501281 497169 495354 492098 498812 517300 539820 544816
17716 544816 548317 549489 548914 528760 526060 526269 513556 504403 517803 527797 524718 527231 537019 541058
17702 541058 536534 516640 508090 505284 512253 515403 519391 520118 521520 533327 556442 565198 567821 564094
17688 564094 553847 540851 530590 520382 512883 520164 528574 537504 546894 555041 552926 562833 572208
17675 572208 555607 539391 548981 560988 581731 574977 568858 577342 571627 563872 560122 559592 566222
17662 566222 560174 543611 556841 556419 550405 551131 564447 572686 586308 597960 587300 576352 575365
17649 575365 572607 571380 572922 569924 565748 565127 566464 568915 573837 582594 579274 583079 570785 560844
17635 560844 570527 585253 588413 596233 590614 582514 569366 574927 584408 598122 598592 593186 605973
17622 605973 606010 602893 599416 604452 587892 584662 599717 605976 591989 591807 608284 617125 617267 599918
17608 599918 588180 593589 596614 587393 590187 607851 610914 607112 606916 616829 620734 614068 610993 611250
17594 611250 605454 607390 613961 624347 625222 619036 628951 624934 604877 620714 631433 631975 626746 623257
17580 623257 620144 615702 615913 617238 611386 614602 627245 627050 614935 600335 607472 597872 596659 602538
17566 602538 615135 615006 612284 618024 620853 619124 598704 589028 590953 595481 612283 627839 642430
17553 642430 643328 639045 627771 618372 619866 630747 636699 640521 651839 666386 662949 655892 639110
17540 639110 648951 646473 636657 646251 665116 662532 654975 638566 636643 645301 644231 627402 625565
17527 625565 631225 644923 646492 642195 653173 665571 663213 660837 650408 632619 633195 650261 654064
17514 654064 652088 660568 665308 665063 675328 670827 667583 655598 639856 644283 662258 654237 664618
17501 664618 672678 666444 664483 676183 680245 687608 684239 670349 652147 656071 675449 678673 689157
17488 689157 677084 673855 664571 668238 659437 659346 664308 667185 666010 679061 686523 688932 689362 697675
17474 697675 706149 698966 680662 672084 687061 695390 709454 714880 698262 693079 688128 692531 691626
17461 691626 686424 700554 714776 728675 739488 728411 715414 725665 737043 732137 730802 735464
17449 735464 736489 723539 729086 748937 773159 775730 747345 736529 686377 636555 609398 608227
17437 608227 610958 622341 632871 656241 657133 652699 648145 659428 658601 656257 653437 648873 653977 663880
17423 663880 673021 669272 670760 680829 688548 688285 687920 699338 707268 702866 704390 706612 704669 684642
17409 684642 673873 674171 686019 699734 707165 712356 709742 705442 695348 689811 689450 683616 670648
17396 670648 671972 676616 698792 718816 710663 709432 711377 700438 694811 704505 711313 708762 720378
17383 720378 726739 727750 733479 733007 730487 715431 718426 729016 731164 726239 725162 726008 738728 746479
17369 746479 750502 741419 742023 740962 736744 726363 716207 710967 715807 722974 736605 731512 720079
17356 720079 726504 733596 726052 728215 732096 721113 710183 696335 687390 697516 710354 718484 718319
17343 718319 721757 729732 738236 743723 755888 752032 744136 724633 731942 744419 765952 758412 749790
17330 749790 755465 768205 765845 758301 754028 771454 772378 768052 777020 779480 776904 775151 756189 741047
17316 741047 735990 754752 771431 771959 761049 767192 767258 775863 763599 757205 755146 778103 798445
17303 798445 795947 790612 802319 811447 822228 816657 815125 810813 811725 797180 767473 752795 741328
17290 741328 744227 757440 787254 794766 801955 797136 790063 781932 771121 761758 761422 769908 770386 765696
17276 765696 769044 767104 763785 770003 776053 774446 781508 782549 786329 772193 779355 798860 799383 796313
17262 796313 799196 793401 785102 787499 786031 773318 781804 796035 790430 782134 791078 808532 811580
17249 811580 802173 804365 808547 825015 824947 817756 800970 810172 817831 818260 821063 819957 815884 818217
17235 818217 813797 807585 813708 822336 820798 826308 825382 817745 822429 826490 826907 817737 819664 814039 798602
17220 798602 797702 815662 822619 817136 819628 846762 851879 833572 828900 832631 820435 828242 829138 824424
17206 824424 837496 849715 852008 846102 845347 844802 839743 845514 860346 862797 861605 859801 850023 849927
17192 849927 845240 834108 836583 833367 846200 853967 859199 869190 864919 872834 880716 876601 866173
17179 866173 878530 897265 887231 862307 846037 848851 857166 859383 869400 879924 889928 886177
17167 886177 894175 894754 889245 880206 866801 869274 881688 885943 892801 881363 873660 857893 858971
17154 858971 874404 895476 895462 884518 873789 873740 870902 863549 870176 889373 890020 900298 891621 896728
17140 896728 889518 887929 882141 883115 885033 881016 878447 876367 900281 914027 905818 893300 895366 877569
17126 877569 870813 880390 876730 867302 880730 903952 900950 905178 913219 912738 903900 897647 887804 890218
17112 890218 899538 893962 906777 905672 895921 904352 914931 918786 910688 891606 913286 928261 942450
17099 942450 947325 947578 947488 939878 932321 912933 904301 909628 927164 920943 912399 910302 908198 917857
17085 917857 917363 915187 918739 927112 946126 960998 947149 939500 939779 948339 953866 972719 984967
17072 984967 970918 967496 970653 937413 931109 948470 963537 962708 971877 966314 956718 959596 969330
17059 969330 983071 968392 955382 957001 951951 954052 969566 969379 963679 962008 962635 965507 976817
17046 976817 978407 960006 967438 978955 977708 982624 991653 985827 970415 961687 965591 967975 981345
17033 981345 993528 990924 1004169 1007073 1012511 1002769 992957 993647 1005505 1010795 1022395 1027712 1037255
17020 1037255 1025842 1010583 1011323 1014470 1005948 1023254 1027585 1030786 1016527 1015343 1016286 1005460 994655
17007 994655 1000303 996485 1007665 1005051 1002431 1019403 1030721 1032137 1037612 1037176 1039914 1047258 1049034 1040940
16993 1040940 1038328 1042360 1032716 1029808 1028355 1026513 1034144 1030588 1025882 1030219 1034951 1033529 1036625 1027014
16979 1027014 1026688 1044643 1054677 1041075 1041311 1044591 1041906 1043380 1060902 1060787 1069694 1063373 1066164 1086657
16965 1086657 1081514 1067017 1066937 1064645 1062461 1058843 1059816 1075979 1099443 1112440 1102475 1110594 1118612 1106231
16951 1106231 1094342 1094711 1093389 1102683 1095533 1104231 1115491 1109379 1114623 1116565 1111337 1121050 1128383 1142071
16937 1142071 1149692 1147376 1130333 1133117 1143098 1137226 1118993 1112617 1122248 1143148 1150587 1143985 1141169
16924 1141169 1149697 1156143 1158633 1177908 1181583 1170294 1168830 1176771 1171295 1167918 1165355 1168009 1170953
16911 1170953 1167148 1155125 1175912 1184223 1198898 1193412 1197230 1219337 1230649 1240660 1257418 1279972
16899 1279972 1288845 1303773 1308484 1314091 1315339 1334264 1354378 1369162 1359965 1335643 1280993 1201267
16887 1201267 1131015 1086364 1077614 1098320 1117594 1143390 1155757 1176972 1209011 1229578 1241634
16876 1241634 1260551 1243732 1204812 1147963 1071221 1013488 978013 967752 973993 982604 1004559 1023777
16864 1023777 1049545 1059710 1074493 1084548 1092515 1103522 1111955 1110007 1112202 1114462 1126617 1136309
16852 1136309 1156132 1169485 1168504 1161090 1156092 1170940 1184011 1190085 1183673 1184957 1188752 1188941 1173606
16839 1173606 1181836 1183398 1182893 1207142 1220270 1222857 1221663 1218921 1213666 1210304 1212715 1218224 1215731 1211849
16825 1211849 1219902 1227504 1235540 1230087 1225831 1237890 1245855 1253196 1255688 1257662 1244832 1244296 1239871 1238836
16811 1238836 1241501 1254538 1258740 1267435 1274749 1275537 1282519 1279771 1290209 1300764 1310803 1308671 1312121
16798 1312121 1313714 1313315 1304842 1311052 1310733 1304231 1304872 1315300 1311706 1308030 1316815 1333023 1341282 1348413
16784 1348413 1353795 1340492 1324614 1322083 1325208 1321373 1335858 1350085 1361311 1364796 1351348 1349305
16772 1349305 1349465 1348404 1357619 1376154 1378442 1376619 1379307 1386622 1392297 1401772 1400121 1396860 1398950 1391012
16758 1391012 1391013 1407282 1404862 1407472 1406679 1404684 1422032 1430184 1427575 1433595 1445927 1444402 1433928 1437450
16744 1437450 1446064 1468677 1466901 1470971 1483833 1490051 1483404 1488264 1486632 1487061 1489712 1485243 1479919 1495988
16730 1495988 1513088 1510156 1521548 1516306 1517959 1519915 1526893 1525797 1524870 1527145 1538587 1539421 1534538 1524231
16716 1524231 1512918 1506103 1531079 1564182 1570759 1575560 1582912 1584248 1575937 1570679 1575888 1566291 1568130
16703 1568130 1574349 1576203 1585489 1594026 1595970 1603849 1609962 1610491 1609117 1623451 1620173 1618846 1632039 1639067
16689 1639067 1631074 1640417 1649122 1661522 1652749 1655137 1660322 1670207 1676533 1687127 1685333 1686185 1693188 1691352
16675 1691352 1688151 1685133 1697728 1711364 1720113 1723260 1719170 1726818 1724588 1740324 1755220 1766546 1758123
16662 1758123 1772587 1764222 1767313 1793545 1809616 1813872 1834036 1833790 1821262 1812584 1813248 1828882 1832912
16649 1832912 1828319 1849862 1870325 1873047 1875730 1889549 1903638 1901106 1911838 1908214 1909601 1894158
16637 1894158 1867351 1841052 1833819 1842875 1873170 1884488 1896403 1894165 1902209 1914849 1928505 1935308
16625 1935308 1942039 1944085 1948059 1970131 1980992 1982141 1979414 1986880 2000057 1995688 1996760 2008168 2021506
16612 2021506 2036672 2046666 2043524 2041924 2052411 2068163 2091217 2107253 2120172 2121770 2118505 2135164
16600 2135164 2142587 2135266 2134466 2146891 2154998 2163607 2179870 2190702 2200008 2220718 2245796 2260897 2275673
16587 2275673 2279819 2276889 2268659 2262029 2278165 2285586 2296943 2312930 2303980 2292188 2303780 2328573
16575 2328573 2344803 2335294 2327267 2347363 2389620 2412605 2417540 2425365 2440224 2449652 2475980 2474527
16563 2474527 2462937 2466280 2487717 2505829 2522409 2521701 2539792 2548345 2573491 2574320 2599024 2621857
16551 2621857 2632651 2628166 2630876 2645912 2678401 2693414 2707360 2713411 2723299 2737612 2748406 2748812
16539 2748812 2747311 2777338 2818856 2864523 2884635 2888903 2886913 2897551 2923712 2939471 2961848 2965405
16527 2965405 2971141 2987114 3022165 3049898 3060533 3072598 3087809 3118763 3140748 3161855 3179667
16516 3179667 3207958 3244814 3290664 3309017 3325568 3348224 3375596 3375824 3386572 3382566 3391210 3391198 3385670
16503 3385670 3389793 3399885 3432938 3480805 3519147 3559539 3587453 3596034 3627732 3658081 3692556 3727332
16491 3727332 3751643 3766695 3787750 3816408 3863498 3911453 3963015 3990101 4012473 4046108 4070433
16480 4070433 4105148 4152386 4205234 4244580 4278313 4320035 4369126 4415822 4469058 4515871 4559957
16469 4559957 4607248 4658717 4706033 4752293 4805785 4863012 4912659 4967406 5024636 5084863 5145521
16458 5145521 5201127 5262218 5335559 5413152 5475081 5536371 5623503 5717636 5787451 5854580 5909102
16447 5909102 5997976 6078586 6155295 6274651 6381900 6491648 6609544 6739427 6848483 6962461
16437 6962461 7091651 7215654 7328882 7448876 7600708 7748934 7901125 8070054 8243379
16428 8243379 8439924 8623155 8805572 9001823 9212502 9407402 9619343 9859113 10123471
16419 10123471 10415085 10723739 11046910 11390438 11751140 12123926 12522761 12943822 13410594
16410 13410594 13913815 14432640 14965021 15515135 16119793 16763417 17448252 18158530 18935410
16401 18935410 19826628 20872509 22045553 23331659 24787563 26501358 28566655 31062290
16393 31062290 34038353 37521554 41657552 46627103 52573468 59145901 64598082 64980734
16385 64980734 54475347 29195713 -6564757 -40040331 -60237430 -66011173 -62853450
16378 -62853450 -56329190 -49582745 -43762437 -39012135 -35159710 -31968264 -29210761 -26800399
16370 -26800399 -24699245 -22903842 -21427688 -20219462 -19246202 -18419784 -17663438 -16968190 -16287201
16361 -16287201 -15617790 -14977793 -14387178 -13840624 -13316135 -12808779 -12311134 -11835492 -11377677
16352 -11377677 -10966461 -10583243 -10223188 -9906807 -9616772 -9347782 -9084467 -8827248 -8575334
16343 -8575334 -8328712 -8083901 -7861120 -7662327 -7473018 -7276477 -7098167 -6944961 -6799217
16334 -6799217 -6648263 -6490247 -6351607 -6224639 -6107122 -5975620 -5851963 -5739203 -5627506
16325 -5627506 -5515028 -5404440 -5306945 -5215561 -5115797 -5037577 -4958249 -4871458 -4795067 -4715795 -4649458
16314 -4649458 -4574826 -4506408 -4446459 -4372373 -4287935 -4219909 -4146556 -4072219 -4008721 -3957336 -3894877
16303 -3894877 -3842782 -3796097 -3743090 -3695874 -3642221 -3582445 -3530814 -3485541 -3433502 -3375504 -3333492
16292 -3333492 -3314058 -3293065 -3259003 -3217236 -3178001 -3147461 -3105968 -3057315 -3023956 -2990218 -2947858
16281 -2947858 -2904203 -2861675 -2830545 -2803025 -2788310 -2779922 -2746545 -2705982 -2672228 -2644165 -2619063
16270 -2619063 -2591742 -2547538 -2517875 -2484613 -2454728 -2426618 -2388895 -2352055 -2322380 -2292970 -2268425
16259 -2268425 -2230347 -2205359 -2198260 -2200254 -2195390 -2192038 -2171578 -2148662 -2116732 -2091174 -2080611 -2062657
16247 -2062657 -2053242 -2029038 -1996437 -1986186 -1977510 -1970187 -1956847 -1941014 -1924152 -1894059 -1875118 -1846766
16235 -1846766 -1811851 -1794905 -1774459 -1752664 -1744420 -1757950 -1777710 -1785105 -1782110 -1767081 -1738108 -1714833
16223 -1714833 -1702760 -1685958 -1676896 -1657605 -1632332 -1624945 -1620221 -1609411 -1588656 -1579883 -1566414 -1553811
16211 -1553811 -1528192 -1513726 -1500296 -1497900 -1491283 -1482070 -1476195 -1460863 -1437438 -1411401 -1391087 -1389734
16199 -1389734 -1372974 -1363694 -1367428 -1379125 -1369106 -1341846 -1338398 -1342105 -1320873 -1293984 -1261218 -1257812
16187 -1257812 -1248238 -1241038 -1246331 -1259895 -1269022 -1263691 -1256057 -1220495 -1200781 -1200536 -1183447 -1153665 -1148937
16174 -1148937 -1146738 -1134487 -1130114 -1124077 -1116231 -1105401 -1079421 -1060134 -1050413 -1051965 -1055744 -1047446 -1041838
16161 -1041838 -1039133 -1036382 -1021078 -1024950 -1020107 -1012477 -996864 -987869 -961808 -942724 -946186 -941313 -933747
16148 -933747 -940749 -949018 -934801 -914727 -911623 -914662 -906440 -896304 -871839 -870867 -874913 -864603 -866094
16135 -866094 -870868 -863422 -845375 -838736 -831593 -828436 -826231 -828949 -817828 -808574 -802804 -807679 -811556 -794844
16121 -794844 -772738 -749589 -745362 -745043 -745426 -737551 -743012 -751777 -745203 -733237 -716722 -717939 -709261 -700106
16107 -700106 -700493 -721477 -729794 -720441 -706153 -689085 -673633 -664670 -671487 -672102 -658445 -642043 -637658
16094 -637658 -643564 -650517 -659930 -651202 -648764 -652547 -637980 -644348 -635744 -623639 -616210 -614579 -603897
16081 -603897 -591822 -591375 -595301 -596053 -594614 -601057 -609910 -604536 -584576 -561621 -551076 -553787 -536233
16068 -536233 -512112 -509346 -521871 -525918 -534489 -533160 -523436 -519022 -517071 -518431 -515107 -515300 -525362 -533499
16054 -533499 -527919 -505873 -496380 -495495 -491676 -496105 -499605 -502436 -507405 -504611 -493175 -474789 -446109
16041 -446109 -423727 -424306 -439284 -444134 -442570 -439845 -420749 -407467 -405335 -397625 -402156 -394738 -394118 -399085
16027 -399085 -375284 -372702 -388351 -401992 -399862 -390653 -389383 -378839 -380601 -378565 -373474 -360841 -353785
16014 -353785 -354705 -347999 -354313 -353379 -346447 -343273 -356067 -355307 -339822 -334725 -335075 -344957 -342594 -332751 -340593
15999 -340593 -342729 -343476 -335303 -327103 -317151 -308684 -316786 -320001 -323064 -317189 -305158 -287529 -288336 -276957
15985 -276957 -270587 -277500 -280516 -289769 -298732 -292183 -283045 -284384 -278563 -270116 -267657 -276343 -269266 -241381
15971 -241381 -241830 -248455 -250057 -245548 -241873 -238943 -241673 -248222 -247744 -239528 -232768 -233790 -233533 -220727 -216996
15956 -216996 -227955 -228629 -221287 -212153 -203107 -193284 -193562 -205868 -212509 -204342 -192689 -185297 -180158 -191327
15942 -191327 -178189 -171089 -184769 -190307 -191965 -184391 -179218 -165739 -150733 -155082 -166932 -161084 -156780
15929 -156780 -147447 -143121 -146151 -148965 -138686 -132800 -138725 -126912 -117453 -120151 -113951 -122178 -116073 -104805
15915 -104805 -116127 -119649 -112938 -109701 -115505 -109237 -91177 -85964 -75914 -74189 -59259 -37922 -25787
15902 -25787 -23654 -8818 149 7111 14987 31155 54581 71457 74889 85621 99069 74280 44820
15889 44820 -17563 -77626 -117711 -144533 -155960 -149988 -145696 -131316 -115905 -113268 -101897 -62617
15877 -62617 -43560 -30046 -38879 -80456 -141824 -203491 -252239 -269923 -276402 -277701 -280805 -259110
15865 -259110 -238942 -229582 -219886 -205447 -183254 -164026 -157060 -154436 -164239 -172068 -164420 -154082 -142340
15852 -142340 -128741 -120303 -109529 -117421 -117319 -124574 -124171 -112759 -110351 -109985 -101820 -91038 -91252 -83023
15838 -83023 -72465 -75664 -81129 -87856 -83059 -68702 -55054 -51750 -48580 -29726 -36731 -39571 -33226
15825 -33226 -32235 -41132 -37025 -37688 -41217 -35939 -23257 -23656 -35483 -30883 -19240 -32403 -37139 -35832
15811 -35832 -31384 -26892 -24651 -6084 -1745 -5023 13113 11560 17338 22406 9230 -1466 3311
15798 3311 6880 -3386 -13437 -7270 -7320 -3080 -10594 -9969 6188 25904 29779 27822 14311 10869
15784 10869 23218 30047 18733 9497 28974 26423 26107 26535 33237 40154 44965 49377 38628 23289
15770 23289 24335 12484 9864 15541 20463 18113 13627 13165 20290 47709 75365 80036 66481 65109
15756 65109 74749 80942 71505 58064 58129 54866 53323 58558 71286 71023 64328 66290 70840 68831 67771
15741 67771 80423 89009 84293 80262 82819 82515 81610 76449 76156 81679 86118 73688 58739 53257
15727 53257 64113 71728 73479 92916 104222 92464 73416 78884 78579 72473 82246 101617 118858
15714 118858 125248 122410 113118 115877 113442 109003 123474 118125 109826 91891 93409 96254 99400 98030
15700 98030 96196 99819 120806 128326 131049 140599 149029 141057 154610 133761 107105 109350 120298
15687 120298 123875 122366 135534 143136 132240 121960 124720 133699 135732 143771 152038 150077 149460 142216
15673 142216 131969 127312 128673 132450 136118 127639 113660 129634 151037 154110 145041 130504 131715
15660 131715 141850 150844 151971 158636 164851 162883 155408 158603 179169 158321 146530 147261 149173
15647 149173 150788 147665 162138 164885 166359 179139 173641 182556 194260 203404 194298 187249 183418
15634 183418 183370 183425 171673 170619 177415 186201 182112 174266 166655 168440 165943 171763 183107 166948
15620 166948 169184 185972 177921 170176 185853 185030 185342 190143 176992 179096 183009 181027 174835 188438
15606 188438 200267 202423 205238 201982 196420 199780 214208 223404 217635 217494 221102 219302 224713 232755
15592 232755 237400 215924 225338 221770 208491 225246 232335 248863 231483 214746 208789 210916 216004
15579 216004 236350 230653 224701 215067 200606 204804 202220 211100 212541 225948 232975 224285 221971
15566 221971 233260 243946 241970 240500 250215 256425 247545 243487 249488 251225 226952 210861 221162
15553 221162 229010 222903 221756 221061 228479 235731 252786 254286 253093 265486 277464 272776 271807 264702
15539 264702 251060 233200 224349 229738 233153 232127 241888 248154 250534 257383 273913 259699 249411
15526 249411 251535 255407 250798 269460 276086 273565 277420 285146 288654 279613 244995 234425 251098
15513 251098 269447 281663 292369 287893 280348 279538 268051 283398 284764 282122 271143 267123 264220
15500 264220 272297 283341 287106 290411 296876 273467 265005 270683 280783 282651 290939 286609 290921
15487 290921 302975 295112 301748 304531 292148 294967 296564 298196 304242 299873 287714 290048 305999
15474 305999 306790 328223 308732 290934 295841 295262 294993 290604 287642 301136 313125 315198 304121
15461 304121 285190 287179 291144 294252 302462 309783 323450 335315 324096 319843 329462 334824 330807
15448 330807 344481 352931 344446 327169 332500 335331 323290 329483 332251 327598 337500 347499 354695
15435 354695 346331 334374 328317 323502 313340 307189 311498 318426 329783 327981 326166 350632 359788
15422 359788 361955 358103 353195 339035 344276 340801 335152 334490 345980 336509 339989 340611 327336 325678
15408 325678 327978 333683 348128 349592 357735 358670 361405 362649 365877 350007 343580 347028 360448 364242
15394 364242 369331 381338 387091 397149 387645 370746 372305 365160 369309 366335 372728 382997 393703
15381 393703 396652 395430 382225 379690 375864 378006 384825 367942 356875 353677 344417 344020 362657
15368 362657 369050 377001 380819 374505 390047 397628 395430 383914 372674 365516 371156 373541 356275
15355 356275 355806 359488 358296 362523 368395 358925 360254 362946 375644 375051 382471 399546 399933 385765
15341 385765 387273 394795 394496 395322 399308 393756 390515 391331 396117 401158 414850 413619 415949 421736 410450
15326 410450 394686 392062 400027 411037 404456 401204 389615 385123 393731 403373 403322 411287 404850 388859
15312 388859 395153 403167 406101 402096 403922 411235 426710 425229 432131 413487 408824 418522 427084 436460
15298 436460 421775 420552 432300 432130 421047 420393 420443 426336 434930 437528 439999 430477 448400 441498
15284 441498 445265 445065 433649 419767 413808 414119 413070 421573 430450 431775 444134 454497 444738 435376
15270 435376 435523 430657 437508 436381 428665 431271 442382 445871 451920 452062 448977 442408 453821 449935
15256 449935 439378 423262 426603 437213 444227 447755 444421 445517 433369 435372 447857 450864 437849
15243 437849 441677 447575 445082 465359 484637 482008 470397 460484 449376 443937 444253 455851 471627
15230 471627 464672 464523 471633 461281 461258 470893 482400 471646 471122 472049 466213 472360 470620 461790 458173
15215 458173 455213 467220 471407 474488 469166 460486 450354 453977 461416 451699 453305 453057 451020 447734
15201 447734 460409 459198 449473 446857 446733 454712 464289 463560 467794 475475 472617 458961 455683 456764
15187 456764 459600 470559 474044 478404 469037 471600 467841 466813 474348 487841 488951 485091 491454 492768
15173 492768 486136 488330 496769 487472 491935 485344 489198 501807 499242 483961 488899 506475 498537
15160 498537 491212 484095 485842 496079 490643 480116 480009 466706 466348 476191 490894 493982 485970 490507
15146 490507 498442 491937 496463 511143 518621 508027 503299 506749 508945 510839 508233 511616 522008
15133 522008 519268 527950 525661 522271 510516 517136 528428 516540 504429 507133 498139 503810 505887
15120 505887 508600 526475 532645 530028 524620 510577 504380 499046 510361 514908 518156 504015 487807
15107 487807 500400 517388 508559 507063 519026 498178 500585 522845 533692 527650 520641 530566 534446
15094 534446 532253 521921 515038 511699 522401 520881 527879 542217 546906 542263 553262 547275 552417
15081 552417 550444 555399 561650 561240 547198 519512 521259 519185 534543 550889 545542 538869 526316
15068 526316 522558 527479 527855 540929 533705 518251 517840 519223 527495 538769 547521 550384 551729 558062
15054 558062 560334 551742 544554 549429 552267 542617 549766 543048 535329 540040 556254 563239 564385 563063
15040 563063 571869 567452 561295 570017 577412 569505 561863 555257 546878 555812 558077 553750 557465 572383
15026 572383 566660 567452 569484 569272 563325 559647 558408 564371 585029 586953 572507 576860 577344 577485 588144
15011 588144 583152 579248 562252 567030 563514 563438 582488 581306 576518 564968 565234 578312 587982 584591
14997 584591 585788 585763 599665 599190 588068 576612 584681 578075 575340 578932 581671 587319 586368 595559
14983 595559 600006 600214 608699 605786 603728 590233 586490 594040 599851 589026 583647 583684 597645 608513
14969 608513 597712 599166 618310 631765 641196 619680 597744 589349 590724 592864 615059 612154 597836
14956 597836 601077 607859 626982 623829 605930 597128 601283 605257 603507 596721 595486 604944 609321 610411
14942 610411 611382 609596 600968 599505 592846 593228 606577 620850 615836 611664 619719 634122 633754 628514
14928 628514 614603 596135 599618 619434 645440 654152 644528 637511 620298 616432 607602 622730 638673
14915 638673 625914 624822 632391 633941 629095 642809 656826 638104 641183 654043 667607 666111 650522
14902 650522 639667 632635 605119 601645 606097 600432 611789 619666 616106 616273 628846 629160 637052 629210
14888 629210 640190 646324 634873 624241 630057 638348 646071 649405 657718 663050 668287 663399 663903 667660
14874 667660 663276 654458 664051 658980 653450 632870 642244 650331 661508 664005 672857 670888 658146
14861 658146 649401 653647 670193 675827 662257 643546 628234 618415 626242 638496 642918 656174 651696
14848 651696 641419 657033 659856 660024 665126 667984 674851 693892 690325 671231 672895 672443 684720
14835 684720 678203 664097 655112 666052 665145 673185 676651 661669 659933 656999 645681 660347 662635
14822 662635 657907 654680 645733 654629 674716 669776 677593 683034 681361 689451 691149 685510 688572 692705
14808 692705 694155 694329 683076 674971 674604 682329 699425 697894 687312 669902 662922 668756 675310 672884
14794 672884 668543 664292 664196 669516 683958 699637 709436 711668 693532 684580 671419 657503 669639
14781 669639 689552 708127 720332 717994 720893 691617 700483 717482 722315 718558 697884 690436 698128
14768 698128 700999 713110 725149 718207 717554 707948 702346 699615 706044 712311 723341 720491 713975 716862
14754 716862 706391 707179 718005 719361 717768 730870 734299 732428 725761 718764 714143 710630 699595
14741 699595 696103 713453 728163 728770 740190 738028 739518 746877 756602 745561 736150 738195 733893
14728 733893 732302 736564 731656 728331 723006 720693 727886 734513 734154 724763 737483 743952 729988 737864
14714 737864 746803 748698 746421 759496 761125 758482 764297 763087 757735 755519 758309 744329 746870 736777
14700 736777 732818 730461 736440 745423 735375 730233 735953 754712 757813 744320 737591 731628 729041
14687 729041 745706 764474 766313 743006 743137 750308 766065 773789 776334 772683 767103 765334 774579
14674 774579 763398 763999 771556 778353 776250 777886 770749 759931 774070 774029 772293 765126 764701 758305
14660 758305 751847 763132 774650 771540 771794 767741 783934 786322 785234 777044 789475 796982 804432
14647 804432 803030 786550 789531 776950 763570 768344 768317 784135 782634 781061 781111 791692 780736 775670
14633 775670 772593 790580 800867 811198 812039 807523 816020 819352 828277 830148 805275 800712 793255
14620 793255 814101 815632 808446 807085 802255 805451 825964 827330 815938 808425 805118 807852 810340
14607 810340 812742 829590 825981 812764 823767 839337 841782 837199 828900 837920 836711 825595 820495
14594 820495 811303 818638 836709 828952 817045 819510 817883 814735 817368 838420 850052 859757 848818
14581 848818 828927 829384 833839 846196 847413 865023 874180 870205 858655 851266 845289 838770 838217 844328
14567 844328 842951 847173 850720 842517 828100 829337 842300 849182 847919 834175 831677 842312 858883
14554 858883 880269 869769 864364 854710 850195 848574 843997 841381 848536 842615 837963 827297 827714 834438
14540 834438 837661 839007 850411 865127 873971 852012 843140 848224 858737 853682 843702 838475 831516
14527 831516 846094 865962 864242 854584 836471 830153 851434 871164 863424 858776 849913 853373 858984
14514 858984 857668 848971 838795 843521 855123 845940 851246 868537 871488 874747 884787 887148 869142
14501 869142 861646 866613 863192 866794 859981 858261 868346 866247 860111 865802 874902 874554 884014 894485
14487 894485 889098 888235 906067 918215 920416 920286 908360 894572 898874 907754 910685 896137 887131
14474 887131 876853 862609 870354 891459 898346 866321 856520 862408 859245 856073 864648 877976 874950
14461 874950 886520 901324 896870 879266 880696 893025 891104 891392 902490 900150 898895 897332 907501
14448 907501 909932 905971 902886 906260 907264 900145 901968 899590 893788 897018 900452 902981 897515 894021
14434 894021 899737 919365 929132 916399 910150 920783 935245 948262 942665 938465 933637 929216 929148
14421 929148 938875 923630 924557 934040 932153 936990 930797 927931 942887 928252 926571 931317 922639 918525
14407 918525 926529 928177 932292 935165 944137 952676 947386 946897 961655 958511 933261 926593 935454 953024
14393 953024 945625 939983 937453 932692 933922 923114 918304 908957 914294 924477 934264 942833 942750 942197
14379 942197 946713 950450 967268 976946 974958 966383 964718 974391 976527 975133 980843 978646 967956 984255
14365 984255 974179 980435 985970 976594 968373 951775 947281 972603 990080 993530 992384 992566 984177
14352 984177 974487 980899 977041 978956 996311 1004070 998785 1003299 1010218 1012470 1022736 1009798 1003933
14339 1003933 1003365 1002923 997671 988122 993371 977991 973396 979653 985218 992764 1015967 1018739 1020048 1013588
14325 1013588 999165 996069 993613 1003946 1023717 1029276 1028833 1025856 1025869 1018644 1021509 1019607 1020478 1012280
14311 1012280 1018498 1020127 1000286 993632 999357 996406 977251 976282 974736 979667 997563 1017861 1020897
14298 1020897 1012659 1012835 1015882 1014314 1011119 1022138 1021845 1011912 1014593 1011600 1024189 1033110 1044560 1040204
14284 1040204 1036354 1027336 1029378 1033659 1041371 1037579 1033201 1046296 1033753 1027432 1029625 1032365 1047372
14271 1047372 1047766 1034650 1037546 1046402 1052799 1034266 1021972 1023919 1052172 1052527 1056667 1058342 1063835
14258 1063835 1050179 1045811 1061709 1065923 1060944 1058235 1062280 1068118 1056628 1059045 1064570 1055756 1046504
14245 1046504 1058345 1067315 1061155 1068747 1072058 1082267 1076669 1061954 1059529 1049115 1031904 1044850
14233 1044850 1063690 1066427 1059968 1057664 1062929 1064848 1069493 1088761 1094292 1090730 1079392 1066526 1075752
14220 1075752 1083876 1090547 1103952 1103292 1105182 1093399 1088321 1088272 1091905 1096559 1098222 1085163 1078382 1091320
14206 1091320 1098429 1110751 1116488 1124641 1116643 1085693 1086065 1099386 1090473 1090080 1092649 1093405 1106265 1113705
14192 1113705 1118139 1114488 1099033 1095652 1090846 1092375 1091818 1093125 1097557 1105978 1108449 1102840 1106241 1117500
14178 1117500 1130782 1122042 1116102 1114405 1124700 1131130 1135505 1124440 1119122 1129033 1125259 1117973 1126621
14165 1126621 1128973 1121106 1115254 1122677 1132107 1128985 1132413 1135006 1133309 1130082 1133201 1133557 1147002 1159754
14151 1159754 1166964 1162602 1137677 1125426 1135401 1144200 1154689 1153135 1149302 1148580 1143606 1139227 1137349
14138 1137349 1148389 1163476 1158848 1156436 1169999 1169986 1159518 1158528 1164917 1169517 1178419 1187215 1187409 1188934
14124 1188934 1187397 1169551 1173411 1172335 1172521 1180217 1160667 1160771 1170332 1193743 1202753 1197700 1184727
14111 1184727 1188614 1196549 1193920 1181860 1171220 1167218 1164140 1156472 1165338 1176483 1194416 1213325 1209021
14098 1209021 1193904 1174811 1188594 1201167 1191791 1186693 1187337 1197990 1205293 1208334 1200287 1205054 1206107
14085 1206107 1220305 1210909 1204564 1212446 1218833 1234844 1247913 1233659 1228158 1233725 1236128 1238351 1233239
14072 1233239 1238473 1238951 1229735 1227856 1220986 1234162 1230116 1215477 1205805 1221033 1222636 1219907 1227799
14059 1227799 1246724 1238678 1238647 1247657 1252435 1251823 1238596 1231874 1235903 1246345 1238280 1249708 1253334 1233111
14045 1233111 1230900 1237480 1243525 1247888 1252539 1254059 1258897 1262018 1234699 1221798 1235452 1251477 1257728
14032 1257728 1271068 1293982 1288100 1277645 1280319 1279723 1277360 1266688 1260750 1272449 1259643 1246646
14020 1246646 1245113 1253251 1264633 1274668 1270198 1263958 1260011 1256676 1265586 1271063 1253534 1242914 1243554
14007 1243554 1252177 1262987 1278756 1283148 1287236 1281713 1288066 1294661 1291848 1287914 1292165 1301754 1300209
13994 1300209 1295838 1286551 1304079 1309536 1309188 1313087 1306720 1292578 1291309 1307102 1302962 1296735 1293409
13981 1293409 1300591 1302461 1317959 1313695 1331617 1337405 1326752 1320243 1318113 1322042 1317568 1319737 1323331
13968 1323331 1331131 1330045 1317928 1306489 1294395 1293281 1313308 1349865 1366586 1354872 1333057 1342694
13956 1342694 1363918 1361218 1331447 1330716 1343787 1353816 1346258 1344096 1334964 1340249 1339049 1333387 1331304
13943 1331304 1333532 1350838 1369231 1370284 1353402 1346551 1348717 1352015 1337873 1336846 1341655 1342180 1349963
13930 1349963 1365881 1365455 1371378 1374694 1389835 1382982 1389306 1392515 1395430 1376181 1370121 1362963 1368194
13917 1368194 1383710 1380004 1380519 1389666 1395848 1399354 1419087 1424148 1413556 1406809 1411608 1415795 1418819
13904 1418819 1418005 1419327 1416768 1402391 1403640 1413133 1413731 1418868 1420881 1427977 1442653 1445290 1441232 1425769
13890 1425769 1420665 1411973 1406201 1415303 1423106 1423458 1422842 1431267 1427676 1430682 1416392 1408010 1409328 1428787
13876 1428787 1442938 1442138 1440036 1437733 1432562 1438641 1440234 1424583 1432124 1456687 1459010 1445210 1443059
13863 1443059 1448754 1447160 1450897 1451792 1447700 1441111 1443803 1457229 1466536 1466230 1462769 1452930 1455482 1464478
13849 1464478 1474433 1474854 1476227 1476065 1479222 1474094 1474254 1481770 1475018 1461790 1460392 1480501 1491052 1499206
13835 1499206 1495914 1486054 1483081 1482101 1483341 1503252 1494822 1495846 1489284 1496639 1509356 1522214 1525557
13822 1525557 1529938 1534373 1511824 1503123 1500906 1504206 1506121 1511080 1518337 1526435 1513625 1520663 1527542
13809 1527542 1525662 1519103 1528786 1552663 1562331 1567405 1562247 1568205 1558807 1557851 1556753 1556929 1562201 1562914
13795 1562914 1569362 1555110 1545498 1545860 1556323 1566000 1572320 1571604 1565907 1558261 1540908 1557116 1566915
13782 1566915 1577275 1580706 1576146 1578412 1575698 1567573 1559370 1552036 1552931 1546140 1561867 1570182 1582086
13769 1582086 1585301 1588465 1588058 1594620 1603843 1600753 1590482 1594330 1611569 1617982 1606018 1606596 1620939
13756 1620939 1620151 1609237 1605636 1598155 1595160 1609031 1615192 1615862 1619483 1619573 1621884 1634298 1623278 1613828
13742 1613828 1608519 1602627 1616783 1624970 1624952 1637618 1648600 1647937 1647944 1629036 1636446 1658582 1676993 1674430
13728 1674430 1679605 1671096 1655386 1653901 1659217 1669078 1675473 1665604 1655260 1644291 1635668 1651010 1660001
13715 1660001 1670222 1674054 1680095 1692885 1691169 1685508 1676748 1678576 1689193 1700026 1704743 1698451 1693711
13702 1693711 1693150 1699017 1704511 1708960 1710531 1707469 1716962 1725646 1712223 1716949 1725598 1711737 1717567 1731476
13688 1731476 1725757 1720226 1732531 1738062 1730611 1722267 1717261 1731248 1742505 1740971 1746003 1750505 1744116
13675 1744116 1738035 1729134 1722980 1743541 1763968 1770084 1778216 1769183 1762893 1762079 1769867 1759724 1760465 1785602
13661 1785602 1794983 1785328 1784082 1790322 1784487 1790158 1787608 1780522 1781487 1778774 1774836 1765487 1780098 1796421
13647 1796421 1796576 1791387 1790780 1800067 1808479 1795868 1793280 1808836 1801337 1804347 1814145 1820320 1822600 1818607
13633 1818607 1821720 1816965 1826289 1819770 1819390 1849164 1875808 1872853 1850513 1838875 1836917 1849877 1856560
13620 1856560 1850810 1865207 1859707 1856472 1855147 1848562 1842369 1828403 1834087 1847157 1860864 1854962 1859147
13607 1859147 1865948 1863012 1864583 1861368 1866870 1874784 1871804 1872447 1880632 1884334 1893362 1901154 1906677 1892049
13593 1892049 1872637 1879184 1896753 1913066 1916541 1919584 1925596 1930762 1920999 1923566 1917371 1929738 1928165
13580 1928165 1915375 1913797 1938684 1945236 1940354 1945256 1941625 1953046 1954711 1956124 1957042 1963653 1958970
13567 1958970 1951452 1956690 1973457 1971137 1973186 1982902 1992019 1988009 1998712 1995409 1991544 1988404 1992765
13554 1992765 2002424 2005037 2012898 2006477 1996524 2004283 2008507 2010177 2010244 2014789 2017654 2031692 2040739 2054127
13540 2054127 2057327 2050151 2023126 2013523 2038265 2053145 2052298 2058663 2074984 2071089 2067038 2079270 2086321
13527 2086321 2060317 2038728 2048579 2060008 2064245 2072770 2073354 2071933 2076725 2086429 2101687 2104880 2099850
13514 2099850 2107950 2116622 2112238 2113425 2126383 2131362 2132679 2129869 2112940 2114359 2116452 2099991 2090125
13501 2090125 2091937 2102203 2108877 2110502 2119374 2134242 2127613 2124750 2118607 2119667 2127079 2123208 2122360 2136825
13487 2136825 2157260 2163145 2157349 2157490 2150439 2161661 2180141 2192076 2187562 2177365 2172222 2174745 2174102
13474 2174102 2185264 2208012 2216741 2221861 2232143 2236322 2233829 2237340 2228463 2216408 2208529 2212899 2231061
13461 2231061 2242585 2239741 2228894 2232350 2236114 2239921 2245301 2244675 2254157 2253503 2245171 2250518 2258174 2267656
13447 2267656 2280860 2281655 2264378 2265344 2282247 2292809 2302525 2294092 2288306 2296060 2300309 2310335 2308263
13434 2308263 2299985 2298014 2303191 2311731 2319720 2326351 2320101 2315491 2325547 2342863 2350012 2361018 2361369
13421 2361369 2362195 2358327 2360057 2359729 2358473 2372814 2381203 2370847 2380476 2404769 2413576 2398971 2390542
13408 2390542 2396091 2392964 2388398 2389819 2402357 2405255 2411256 2408409 2405437 2414686 2433083 2449207 2440440
13395 2440440 2431667 2441377 2441113 2448656 2462461 2476088 2482772 2474037 2471490 2466442 2456998 2451212 2451081 2461595
13381 2461595 2474764 2470773 2467599 2474024 2486221 2490981 2492184 2499616 2506731 2522596 2519179 2510292 2517966
13368 2517966 2525751 2521995 2527999 2547410 2551100 2538360 2548201 2556041 2562729 2565584 2565073 2573860 2578889 2576824
13354 2576824 2580742 2577384 2578851 2593468 2609619 2623084 2630572 2635866 2622033 2616589 2642819 2649250 2652147
13341 2652147 2655548 2636705 2653147 2664541 2661059 2667065 2667152 2648819 2634519 2637071 2645048 2655554 2662146
13328 2662146 2667243 2676305 2686104 2690760 2701769 2709553 2714987 2725268 2745272 2767116 2766861 2778219 2769969
13315 2769969 2761245 2767559 2767034 2759651 2760845 2767091 2771952 2770859 2774327 2776145 2786008 2795070 2794300 2790428
13301 2790428 2784810 2788790 2794841 2810892 2814092 2816649 2813791 2826229 2847094 2857614 2861869 2875109 2880790
13288 2880790 2881388 2869529 2881088 2906377 2915394 2908927 2905766 2907384 2906551 2910193 2922570 2925199 2937321
13275 2937321 2935045 2937760 2953323 2964513 2970263 2972675 2967976 2950160 2945287 2952210 2976472 2987478 3004605
13262 3004605 3020625 3015974 3014886 3014612 3012807 3018359 3017385 3036151 3040514 3032089 3030827 3049736 3065245
13249 3065245 3065588 3059777 3056083 3068380 3084768 3094375 3090758 3096970 3108136 3132330 3149110 3157195 3166731
13236 3166731 3174410 3157286 3143499 3148315 3160913 3177145 3182253 3180740 3183793 3191546 3197217 3207981 3215896
13223 3215896 3223948 3230277 3227597 3230117 3245394 3256718 3273253 3287466 3292576 3296750 3293423 3304781 3322078
13210 3322078 3311124 3307248 3311962 3322249 3332207 3348365 3350989 3358759 3368958 3383283 3383968 3385269 3392065
13197 3392065 3380018 3396024 3424027 3438281 3445058 3451854 3443769 3428765 3420449 3427369 3439395 3437993
13185 3437993 3435069 3457921 3497496 3532869 3551900 3547915 3543745 3546907 3567626 3578882 3571058 3580279
13173 3580279 3587159 3593937 3597317 3613982 3627535 3642290 3662495 3671760 3676375 3680646 3701117 3731006
13161 3731006 3757826 3776172 3783530 3780961 3794643 3830137 3864309 3884889 3897796 3920334 3945762 3972183
13149 3972183 3999224 4011490 4050154 4112541 4192877 4257592 4338264 4449660 4566598 4692323 4768612
13138 4768612 4712275 4405070 3815865 3174761 2777753 2680917 2728997 2839758 2953461 3058108
13128 3058108 3144303 3208054 3271073 3327502 3359777 3393875 3435730 3452675 3472205 3505664 3537221
13117 3537221 3557431 3571778 3595905 3629534 3653664 3658004 3676817 3711529 3732569 3743147 3757995
13106 3757995 3767895 3769039 3771590 3774870 3796598 3825972 3830132 3822840 3826698 3846424 3860573 3879690 3894675
13093 3894675 3914325 3934531 3951885 3979830 3997156 3992793 4010746 4038445 4044186 4050848 4057826 4078376
13081 4078376 4092681 4089930 4088416 4101824 4112557 4132401 4150750 4178713 4208481 4229671 4244796 4243452
13069 4243452 4237815 4257518 4275929 4288135 4305228 4329171 4340589 4354680 4366968 4367570 4381655 4398389
13057 4398389 4409554 4433603 4452329 4442521 4438739 4457178 4489346 4522119 4562185 4578837 4571547 4584130
13045 4584130 4610115 4649444 4686755 4716630 4740106 4765590 4795732 4829042 4850653 4838460 4859376
13034 4859376 4900176 4946863 5016912 5099225 5173392 5173141 5033367 4760153 4421510 4207230 4156081
13023 4156081 4203236 4260463 4323809 4388175 4433577 4482238 4545026 4581833 4617723 4649882 4681005
13012 4681005 4708436 4729491 4750918 4757939 4765571 4794791 4817037 4838388 4855386 4876841 4883291 4887371
13000 4887371 4912574 4923747 4930437 4932073 4943379 4960319 4985559 4993160 5005482 5033670 5063704 5117355
12988 5117355 5148140 5152273 5169962 5204757 5241145 5271423 5290396 5308542 5321909 5352091 5377884
12977 5377884 5396301 5411250 5409655 5413545 5444547 5494278 5510918 5524218 5530523 5532141 5550220 5579563
12965 5579563 5604549 5626973 5659675 5685990 5710930 5712897 5732753 5767825 5790233 5803540 5820687
12954 5820687 5838930 5853710 5875689 5895583 5928549 5956050 5991067 6034136 6055172 6089650 6112042
12943 6112042 6136334 6167636 6196054 6185919 6151092 6087771 5994339 5948564 5947036 5986794 6046865
12932 6046865 6090040 6120478 6159339 6196304 6213889 6242904 6280796 6297047 6321914 6346068 6383544
12921 6383544 6401630 6428761 6447917 6484176 6542516 6585399 6608565 6636606 6678505 6695161 6688124
12910 6688124 6700725 6732018 6789681 6839739 6882936 6904645 6928987 6962462 6985999 7000321 7024572
12899 7024572 7054845 7079182 7110846 7169548 7216833 7250276 7276030 7307346 7338081 7363262 7378130
12888 7378130 7397851 7405598 7419311 7443898 7487789 7560281 7641926 7714439 7760012 7767692 7771351 7770932
12876 7770932 7764261 7771201 7816759 7878075 7931944 8003978 8080001 8136164 8185509 8218311 8240424 8282511
12864 8282511 8306510 8331603 8384973 8428981 8460067 8506127 8549345 8590585 8633157 8676388 8720551
12853 8720551 8758478 8811446 8854116 8896260 8952574 9005586 9047416 9093123 9134466 9185656 9242499
12842 9242499 9280077 9317635 9388136 9493463 9633420 9769432 9861145 9931847 10000127 10028333 10031649
12831 10031649 10014197 10007855 10014980 10049196 10120237 10200218 10268550 10345762 10427494 10497168 10596380
12820 10596380 10695203 10778230 10874630 10968456 11062621 11167598 11261586 11350168 11427187 11475157 11525861
12809 11525861 11575977 11570555 11542618 11572193 11646782 11737616 11833097 11925189 12034287 12148090 12262242
12798 12262242 12366372 12457745 12554353 12652944 12754089 12855715 12945007 13017071 13103117 13231368
12788 13231368 13385059 13544083 13668547 13774440 13888036 13998341 14112354 14245656 14374289
12779 14374289 14517585 14660856 14795468 14915919 15077090 15235817 15392258 15560869 15719963
12770 15719963 15889777 16070109 16222259 16350805 16493916 16665646 16852592 17042193 17238411
12761 17238411 17461223 17672740 17869927 18045206 18211699 18357135 18538525 18763974 19021895
12752 19021895 19310657 19597670 19870042 20147203 20430518 20719633 21020786 21348623 21693829
12743 21693829 22042474 22404803 22771597 23130794 23499591 23904137 24322651 24726350 25112990
12734 25112990 25534945 26007544 26542703 27114230 27691870 28260135 28828714 29418416 29991772
12725 29991772 30545371 31127893 31760276 32461972 33241550 34084977 34991206 35959541 36962356
12716 36962356 38003978 39094937 40248957 41494936 42844754 44288404 45861512 47572395
12708 47572395 49427684 51440845 53650912 56075758 58714011 61616809 64751169 68104710
12700 68104710 71750642 75748948 80122287 84937335 90549992 97452228 105959188 116264455
12692 116264455 128666695 143694919 161906199 183199640 204603310 216373024 199200437
12685 199200437 128230351 1639144 -124587979 -192483600 -205305977 -191503917 -169951625
12678 -169951625 -148967592 -131026159 -116181943 -103878052 -93621913 -85137404 -78202326
12671 -78202326 -72594173 -67853654 -63481720 -59371300 -55588120 -52134514 -49043901 -46279893
12663 -46279893 -43791256 -41503047 -39395375 -37439749 -35587543 -33859969 -32258532 -30748942
12655 -30748942 -29341710 -28023834 -26781154 -25611329 -24530260 -23518154 -22551155 -21631724
12647 -21631724 -20748167 -19870398 -19001247 -18172486 -17377156 -16604943 -15852656 -15140842 -14450325
12638 -14450325 -13766251 -13117168 -12494874 -11901248 -11293011 -10685181 -10089297 -9503252 -8936198
12629 -8936198 -8385718 -7845188 -7302408 -6760355 -6209200 -5653174 -5113521 -4573444 -4027427
12620 -4027427 -3489886 -2963054 -2473405 -1972234 -1429519 -875943 -287588 348052 993049
12611 993049 1673461 2381870 3093015 3835318 4592993 5384015 6220681 7093076 8002491 8979125
12601 8979125 10041308 11195590 12425485 13761910 15219219 16801997 18537153 20425699
12593 20425699 22449891 24563341 26756056 29216492 32237376 35985654 40511249 45905989
12585 45905989 52392784 60289628 69950369 81456049 93433768 100830516 93080543 55702941
12577 55702941 -12780016 -80179749 -114388957 -118914147 -110213797 -98242789 -87021467
12570 -87021467 -77634856 -69980135 -63685165 -58438345 -54042321 -50368398 -47358849 -44919273
12562 -44919273 -42780948 -40748412 -38820634 -37030224 -35460319 -34139716 -32952771 -31793843
12554 -31793843 -30683432 -29641353 -28686664 -27803985 -26987415 -26231010 -25548679 -24899491 -24270557
12545 -24270557 -23669109 -23111503 -22593068 -22088868 -21611561 -21146660 -20689525 -20255290 -19822379
12536 -19822379 -19378369 -18951316 -18570498 -18242099 -17956620 -17710786 -17486880 -17253878 -17020997
12527 -17020997 -16762879 -16475423 -16205944 -15948234 -15711226 -15485436 -15275433 -15076083 -14877132
12518 -14877132 -14693928 -14505890 -14324614 -14151492 -13964873 -13789710 -13624354 -13463833 -13294140
12509 -13294140 -13142002 -13019122 -12902932 -12753982 -12595906 -12438055 -12270609 -12110859 -11984627
12500 -11984627 -11846961 -11736249 -11644852 -11545512 -11449164 -11359389 -11262249 -11139734 -10996250 -10849451
12490 -10849451 -10708539 -10575166 -10467428 -10378322 -10312347 -10255711 -10188735 -10125539 -10041897 -9958348
12480 -9958348 -9873964 -9770024 -9670646 -9560057 -9452351 -9349203 -9277914 -9216574 -9169070 -9121992
12470 -9121992 -9053150 -8985735 -8893952 -8774354 -8675189 -8603555 -8530774 -8457919 -8408499 -8350634 -8264885
12459 -8264885 -8199306 -8125700 -8041342 -7949066 -7886478 -7819255 -7761508 -7728514 -7699497 -7714957 -7736823
12448 -7736823 -7680826 -7613510 -7554068 -7497872 -7444308 -7385209 -7319509 -7266729 -7212710 -7167045 -7107650
12437 -7107650 -7059499 -7023208 -6976908 -6923201 -6870883 -6806919 -6743833 -6699725 -6660329 -6605300 -6552795
12426 -6552795 -6499395 -6458771 -6450457 -6448309 -6421855 -6407460 -6381508 -6346450 -6320527 -6272664 -6219504 -6168360
12414 -6168360 -6110377 -6075182 -6026861 -5978885 -5933333 -5892554 -5868624 -5835969 -5794581 -5750946 -5710307
12403 -5710307 -5682274 -5649113 -5594664 -5554928 -5518463 -5473846 -5419305 -5372184 -5331563 -5296708 -5266554
12392 -5266554 -5224893 -5206946 -5197612 -5182060 -5160842 -5137764 -5104713 -5055007 -5022957 -4974469 -4940690
12381 -4940690 -4901908 -4879618 -4874911 -4887062 -4883457 -4861714 -4828574 -4780400 -4725470 -4678456 -4618275 -4574653
12369 -4574653 -4536945 -4511623 -4488246 -4466275 -4450794 -4425678 -4377987 -4329850 -4280687 -4240583 -4222442
12358 -4222442 -4192444 -4158574 -4126728 -4103546 -4080514 -4065698 -4028364 -4011082 -3969508 -3927914 -3886171
12347 -3886171 -3849210 -3818555 -3804554 -3786428 -3760399 -3733569 -3700957 -3677663 -3646756 -3615982 -3591192
12336 -3591192 -3562000 -3532324 -3487922 -3457983 -3436386 -3402228 -3387336 -3374164 -3354353 -3329225 -3311326
12325 -3311326 -3291225 -3279049 -3257428 -3254893 -3239474 -3192716 -3146315 -3118091 -3089417 -3058044 -3030023
12314 -3030023 -3014724 -2997118 -2972171 -2943373 -2907604 -2860490 -2841935 -2839113 -2814773 -2779158 -2736037
12303 -2736037 -2695598 -2668593 -2624412 -2596644 -2585034 -2557167 -2523286 -2483694 -2450491 -2411961 -2380451
12292 -2380451 -2366020 -2348200 -2303973 -2263759 -2234453 -2215604 -2174495 -2144491 -2118244 -2081010 -2050769
12281 -2050769 -2030238 -1997563 -1965928 -1941922 -1901992 -1875168 -1850040 -1829293 -1796453 -1759268 -1733850
12270 -1733850 -1713306 -1678357 -1639095 -1596044 -1562099 -1529906 -1498381 -1449145 -1412769 -1386324 -1356472
12259 -1356472 -1312080 -1276626 -1239925 -1190536 -1136669 -1102701 -1069320 -1028181 -999084 -959072 -910470
12248 -910470 -868096 -825859 -756403 -684108 -631004 -586254 -526857 -475242 -420745 -355332 -292861
12237 -292861 -203923 -109736 -26744 55515 150671 251515 347328 466163 607662 739637 782777
12226 782777 594186 85958 -562140 -1006216 -1137942 -1087677 -964166 -814123 -655558 -513621
12216 -513621 -386512 -278567 -193849 -114088 -21993 60686 140401 226720 298743 372582 440439
12205 440439 520255 587352 638814 697761 768744 848842 910318 962939 1012282 1067770 1138233
12194 1138233 1209193 1262737 1332605 1392331 1450801 1505300 1559613 1612230 1656652 1704348 1752841
12183 1752841 1807927 1852215 1893049 1937585 1979874 2018663 2051451 2079322 2088401 2100129 2121868
12172 2121868 2126703 2125469 2128301 2120299 2096662 2062458 2025355 1976183 1913758 1855752 1770378 1666524
12160 1666524 1552942 1412489 1255149 1083262 920425 735147 531955 319825 77459
12151 77459 -184303 -434510 -689091 -959539 -1254818 -1564426 -1887913 -2209993 -2534926 -2869977
12141 -2869977 -3183161 -3497361 -3809724 -4116640 -4409039 -4680149 -4938385 -5183629 -5406460
12132 -5406460 -5617149 -5798989 -5949643 -6102531 -6288072 -6528132 -6886005 -7353402 -7844565
12123 -7844565 -8206938 -8451820 -8718565 -9085297 -9472848 -9710154 -9778120 -9770520 -9723333 -9660840
12113 -9660840 -9602463 -9537432 -9479196 -9431744 -9372390 -9324769 -9279655 -9224325 -9185878 -9144951 -9094620
12102 -9094620 -9046067 -8997658 -8926184 -8846553 -8793908 -8742378 -8694192 -8633780 -8571211 -8520034 -8470196
12091 -8470196 -8421797 -8375817 -8326863 -8273637 -8214984 -8165514 -8109756 -8050750 -7992034 -7940380 -7886168
12080 -7886168 -7836947 -7765955 -7695718 -7643523 -7609166 -7558449 -7510133 -7463041 -7424579 -7383924 -7323304
12069 -7323304 -7267064 -7233274 -7194573 -7154673 -7106759 -7068064 -7030224 -6999217 -6953954 -6890636 -6849040
12058 -6849040 -6788881 -6756007 -6731637 -6698373 -6648508 -6609933 -6581291 -6541975 -6497987 -6463279 -6435484
12047 -6435484 -6408465 -6369402 -6319910 -6287116 -6260412 -6211161 -6180767 -6170541 -6135396 -6099628 -6066193
12036 -6066193 -6026790 -6000659 -5982366 -5960673 -5924684 -5901348 -5880906 -5852178 -5821915 -5776343 -5746463
12025 -5746463 -5734496 -5709718 -5663632 -5632400 -5609366 -5593806 -5575255 -5558012 -5520525 -5491193 -5468306
12014 -5468306 -5450238 -5429752 -5408054 -5391345 -5381158 -5360325 -5324223 -5308461 -5289993 -5270547 -5253490
12003 -5253490 -5226327 -5190578 -5165915 -5150906 -5136206 -5115757 -5084109 -5056878 -5049310 -5036301 -5011946
11992 -5011946 -4990001 -4974618 -4952837 -4923279 -4908756 -4920948 -4907159 -4887473 -4878744 -4857846 -4817014
11981 -4817014 -4791781 -4790014 -4784303 -4765469 -4745201 -4734860 -4721788 -4707180 -4690803 -4675544 -4667971 -4646157
11969 -4646157 -4629436 -4613918 -4599340 -4570815 -4552074 -4549077 -4547656 -4524442 -4507734 -4488504 -4470382 -4470732
11957 -4470732 -4474693 -4455887 -4432918 -4423770 -4417235 -4400358 -4389795 -4369787 -4351202 -4333042 -4321060 -4302993
11945 -4302993 -4294097 -4280698 -4270634 -4261272 -4237629 -4221919 -4208460 -4187680 -4184305 -4186800 -4175640 -4164695
11933 -4164695 -4156609 -4143619 -4130044 -4113964 -4093573 -4074499 -4061909 -4074643 -4060318 -4066576 -4068327 -4051975
11921 -4051975 -4030913 -4020077 -4005485 -3994336 -4005178 -3994020 -3980447 -3969462 -3973414 -3970200 -3949120 -3913680
11909 -3913680 -3898172 -3889820 -3884329 -3872229 -3866577 -3858477 -3836761 -3821450 -3819580 -3822537 -3813752 -3801242 -3798142
11896 -3798142 -3796587 -3796835 -3793394 -3787677 -3768057 -3761566 -3758599 -3746558 -3732672 -3724800 -3713854 -3703739 -3703167
11883 -3703167 -3694246 -3681505 -3660700 -3646528 -3645442 -3646948 -3641357 -3628685 -3609872 -3588887 -3591296 -3588569
11871 -3588569 -3572962 -3562191 -3550014 -3548602 -3545086 -3540181 -3538653 -3545414 -3530316 -3519182 -3504895 -3475113
11859 -3475113 -3448698 -3456007 -3460132 -3456235 -3443346 -3423995 -3411433 -3402182 -3411143 -3398323 -3390762 -3389009 -3384374
11846 -3384374 -3371423 -3369969 -3379679 -3373228 -3368180 -3359013 -3351292 -3342261 -3340762 -3336052 -3324627 -3305308 -3307933
11833 -3307933 -3302688 -3309464 -3303705 -3288451 -3288320 -3264057 -3238517 -3238778 -3236276 -3247931 -3258690 -3250802 -3238710
11820 -3238710 -3239519 -3223228 -3214228 -3208785 -3204699 -3211277 -3211892 -3216115 -3204438 -3173686 -3162794 -3156705 -3150945
11807 -3150945 -3142405 -3141409 -3132905 -3130980 -3133267 -3137619 -3135441 -3126224 -3112842 -3099145 -3090660 -3094771 -3097214 -3093823
11793 -3093823 -3089580 -3094275 -3074977 -3059951 -3053475 -3054292 -3049479 -3044248 -3039743 -3035936 -3026539 -3020531 -3021738 -3023512
11779 -3023512 -3015399 -3012475 -2989916 -2976497 -2972710 -2965290 -2956386 -2965011 -2978630 -2980678 -2976953 -2981615 -2976439
11766 -2976439 -2964052 -2952748 -2940741 -2935132 -2932660 -2924480 -2920181 -2912402 -2902415 -2898638 -2892583 -2879454 -2868546
11753 -2868546 -2872985 -2866290 -2867441 -2870236 -2859874 -2859374 -2859409 -2856225 -2852707 -2849494 -2836526 -2825351 -2814945 -2817282
11739 -2817282 -2828941 -2832195 -2828666 -2820497 -2799012 -2784930 -2773413 -2778076 -2770211 -2765065 -2769071 -2766139 -2758266
11726 -2758266 -2756164 -2742384 -2735355 -2720309 -2724147 -2728301 -2723237 -2719744 -2709141 -2705435 -2722151 -2728241 -2725830
11713 -2725830 -2724445 -2723908 -2710387 -2698521 -2696761 -2697056 -2683561 -2683680 -2689766 -2684245 -2682398 -2677621 -2678980 -2690624
11699 -2690624 -2692771 -2678017 -2655163 -2640976 -2631132 -2629012 -2625781 -2619851 -2619609 -2614744 -2612104 -2615706 -2616876
11686 -2616876 -2604280 -2595514 -2579014 -2584428 -2589956 -2579132 -2567441 -2571901 -2574747 -2562318 -2557236 -2562056 -2552111
11673 -2552111 -2554622 -2557823 -2547942 -2538596 -2538348 -2528339 -2514651 -2512574 -2525600 -2531560 -2519859 -2520887 -2508796
11660 -2508796 -2499259 -2511786 -2510538 -2504630 -2494461 -2500259 -2500309 -2497982 -2496251 -2500565 -2507738 -2492713 -2471673
11647 -2471673 -2465664 -2466979 -2470634 -2469521 -2480419 -2484097 -2470849 -2459478 -2474253 -2478129 -2477563 -2464834 -2461367
11634 -2461367 -2446958 -2427674 -2431141 -2429035 -2419804 -2418621 -2434759 -2430775 -2426099 -2419044 -2409025 -2390024 -2383993
11621 -2383993 -2398724 -2401888 -2391123 -2384057 -2362959 -2354899 -2364442 -2365455 -2377161 -2387114 -2373610 -2365168 -2363131
11608 -2363131 -2360725 -2356338 -2352106 -2349358 -2346224 -2350265 -2353929 -2354851 -2353640 -2358606 -2354783 -2341864 -2347153 -2337054
11594 -2337054 -2324928 -2338024 -2335896 -2315062 -2306894 -2300622 -2302726 -2301307 -2304466 -2307867 -2303489 -2278502 -2267798
11581 -2267798 -2281364 -2283723 -2263038 -2248707 -2234373 -2248138 -2256741 -2245261 -2237095 -2235896 -2232516 -2248783
11569 -2248783 -2249319 -2241399 -2234616 -2232888 -2237519 -2234843 -2237973 -2239357 -2225912 -2220001 -2211153 -2222683 -2225996 -2213462
11555 -2213462 -2197914 -2191771 -2199510 -2204000 -2200006 -2195003 -2197070 -2199747 -2196625 -2200330 -2199917 -2192523 -2191007 -2187816
11541 -2187816 -2167173 -2161470 -2145371 -2145226 -2165118 -2155053 -2133046 -2130257 -2128046 -2129565 -2142837 -2157085
11529 -2157085 -2158175 -2145431 -2152691 -2141989 -2133950 -2121536 -2113866 -2123978 -2129698 -2125380 -2116821 -2099712 -2091653
11516 -2091653 -2083496 -2093510 -2101106 -2085107 -2101257 -2115615 -2113198 -2118230 -2109555 -2091166 -2081108 -2083946
11504 -2083946 -2082717 -2079560 -2079294 -2071780 -2063458 -2070172 -2062138 -2057848 -2064143 -2057968 -2059517 -2065639 -2064196 -2055056
11490 -2055056 -2059075 -2059507 -2048240 -2050270 -2064064 -2056319 -2033120 -2015828 -2009240 -2018857 -2030717 -2033435 -2041193
11477 -2041193 -2053306 -2052617 -2062246 -2051394 -2031133 -2032963 -2028262 -2025368 -2034148 -2037545 -2016688 -1999265 -2017596
11464 -2017596 -2011327 -2000045 -1986463 -1975574 -1968717 -1981010 -1991167 -1993021 -1988852 -1985037 -1982574 -1974360 -1979437
11451 -1979437 -1975667 -1976898 -1978415 -1972916 -1959446 -1954412 -1959576 -1958565 -1938628 -1933060 -1930810 -1938449 -1944673
11438 -1944673 -1950947 -1961112 -1959504 -1953468 -1938467 -1936329 -1937270 -1935743 -1937884 -1942541 -1940733 -1929945 -1934239
11425 -1934239 -1937771 -1929579 -1922467 -1926315 -1925175 -1922363 -1924193 -1928926 -1932833 -1931888 -1926978 -1918102 -1905541 -1897757
11411 -1897757 -1904959 -1909599 -1900940 -1891739 -1891072 -1895612 -1903768 -1895191 -1890616 -1896773 -1904959 -1902497 -1898917 -1894354
11397 -1894354 -1889892 -1893339 -1895268 -1891670 -1871146 -1869818 -1867934 -1867969 -1861139 -1855528 -1859301 -1860887 -1862591 -1851673
11383 -1851673 -1853694 -1860299 -1866072 -1865289 -1866765 -1863658 -1845366 -1830360 -1817014 -1823473 -1839133 -1834000 -1817243
11370 -1817243 -1802162 -1809274 -1837024 -1839419 -1823306 -1806090 -1807397 -1812800 -1813896 -1822275 -1830171 -1832491 -1817833
11357 -1817833 -1808397 -1820015 -1824339 -1825752 -1814591 -1810604 -1797187 -1793809 -1785812 -1780847 -1776487 -1786139 -1796205
11344 -1796205 -1785410 -1787610 -1795065 -1783593 -1771161 -1772818 -1781856 -1791636 -1785857 -1775039 -1764912 -1767115 -1794514
11331 -1794514 -1792323 -1777218 -1768679 -1756136 -1743925 -1744528 -1747381 -1756094 -1765812 -1762442 -1748909 -1728417 -1726417
11318 -1726417 -1734577 -1734844 -1753489 -1753384 -1747153 -1746950 -1732199 -1725562 -1722662 -1717117 -1724410 -1729005 -1726794 -1724105
11304 -1724105 -1735859 -1734697 -1727530 -1709998 -1723365 -1724822 -1738870 -1737729 -1740789 -1733288 -1728037 -1730551 -1718437
11291 -1718437 -1708889 -1698944 -1702020 -1710428 -1714679 -1706485 -1710513 -1707509 -1699854 -1693702 -1684254 -1677080 -1696409 -1709211
11277 -1709211 -1706148 -1689017 -1685654 -1684988 -1685838 -1684666 -1689628 -1697610 -1692752 -1679837 -1670118 -1686529 -1690037 -1679714
11263 -1679714 -1669021 -1655612 -1659547 -1666076 -1665712 -1663970 -1656967 -1653681 -1658915 -1639160 -1622140 -1633419 -1639255
11250 -1639255 -1635472 -1629967 -1637063 -1652092 -1658965 -1649710 -1640549 -1636710 -1633478 -1634223 -1623057 -1630046 -1649589
11237 -1649589 -1658811 -1635257 -1629860 -1624718 -1632071 -1624307 -1624612 -1627755 -1628611 -1640480 -1620246 -1614085 -1611071 -1611215
11223 -1611215 -1608311 -1629928 -1634887 -1623910 -1626069 -1606359 -1584827 -1581082 -1584655 -1588326 -1584772 -1592542 -1613610
11210 -1613610 -1614417 -1612583 -1595831 -1574723 -1564441 -1596830 -1622710 -1622827 -1608470 -1591908 -1583950 -1569159
11198 -1569159 -1566017 -1572364 -1563960 -1558519 -1570067 -1573936 -1564611 -1549384 -1538656 -1557841 -1566411 -1567986 -1574700
11185 -1574700 -1564250 -1553078 -1558998 -1562144 -1567334 -1566526 -1563818 -1559519 -1566515 -1567430 -1551114 -1547604 -1548149 -1551091
11171 -1551091 -1554351 -1566826 -1570469 -1568164 -1557451 -1545994 -1539430 -1524340 -1533321 -1530499 -1517394 -1517226 -1504088
11158 -1504088 -1509980 -1525460 -1532400 -1531893 -1540078 -1527661 -1524629 -1540161 -1529554 -1526762 -1525146 -1534098 -1538654
11145 -1538654 -1526645 -1535193 -1536727 -1544823 -1538014 -1537252 -1541747 -1536431 -1539271 -1530243 -1525456 -1528781 -1539090 -1530002
11131 -1530002 -1524448 -1537096 -1545056 -1545658 -1529612 -1515203 -1512612 -1516073 -1516807 -1510988 -1500463 -1494173 -1488004
11118 -1488004 -1488898 -1499259 -1503075 -1511295 -1516231 -1510944 -1492026 -1469907 -1454403 -1456437 -1454986 -1451907 -1455700
11105 -1455700 -1469432 -1483580 -1484029 -1476980 -1484130 -1479111 -1473306 -1484716 -1478826 -1470754 -1477517 -1482728 -1482250 -1464172
11091 -1464172 -1461310 -1465057 -1452567 -1436736 -1441678 -1438028 -1422436 -1425054 -1416633 -1413317 -1430067 -1428762 -1422593
11078 -1422593 -1432005 -1450358 -1455855 -1442572 -1445752 -1446228 -1446183 -1431041 -1427832 -1427683 -1432674 -1443827 -1445277 -1429859
11064 -1429859 -1439598 -1442540 -1427330 -1429321 -1428301 -1415195 -1416720 -1411495 -1413611 -1403720 -1398295 -1416397 -1430241
11051 -1430241 -1437163 -1435409 -1434371 -1440867 -1435659 -1422971 -1412821 -1406506 -1410142 -1406256 -1406017 -1398830 -1398456 -1396795
11037 -1396795 -1406468 -1399756 -1405088 -1405713 -1395267 -1398681 -1407886 -1416532 -1412663 -1400526 -1393012 -1385701 -1372347
11024 -1372347 -1382292 -1387492 -1375337 -1368437 -1369204 -1377265 -1389627 -1381638 -1376556 -1381578 -1369719 -1363243 -1355585
11011 -1355585 -1365211 -1359466 -1353358 -1358228 -1381217 -1409028 -1409421 -1400645 -1385864 -1365709 -1355698 -1363542 -1359817
10998 -1359817 -1365214 -1383881 -1382839 -1382796 -1381191 -1370563 -1362112 -1355804 -1352313 -1351711 -1364053 -1364134 -1355305 -1353629
10984 -1353629 -1356580 -1347801 -1349393 -1347663 -1356149 -1363405 -1364732 -1366771 -1359655 -1351476 -1346941 -1356054 -1370050 -1359816
10970 -1359816 -1343846 -1348964 -1335026 -1323789 -1326649 -1330435 -1333174 -1334432 -1333380 -1326919 -1332891 -1342156 -1353229
10957 -1353229 -1361571 -1357707 -1347009 -1336952 -1345593 -1338339 -1322901 -1316912 -1308231 -1313527 -1315908 -1332237 -1337850
10944 -1337850 -1326971 -1312409 -1320620 -1321951 -1307856 -1304507 -1292223 -1288422 -1292857 -1307679 -1315204 -1322692 -1329221
10931 -1329221 -1317156 -1294035 -1296511 -1301436 -1306086 -1319011 -1311975 -1302654 -1303129 -1297581 -1296357 -1293561 -1284749
10918 -1284749 -1280943 -1276627 -1274957 -1289935 -1321612 -1336137 -1327601 -1323201 -1310863 -1309690 -1307921 -1290332 -1277897
10905 -1277897 -1263683 -1269979 -1266200 -1270603 -1286063 -1268943 -1273292 -1278468 -1275185 -1280958 -1259134 -1259187 -1259789 -1263307
10891 -1263307 -1267169 -1266095 -1276764 -1269772 -1253922 -1247254 -1263976 -1266934 -1272105 -1261112 -1260671 -1245590 -1255965
10878 -1255965 -1264422 -1252112 -1257163 -1262112 -1257166 -1261613 -1254198 -1256077 -1259705 -1265998 -1259396 -1267579 -1275834 -1267471
10864 -1267471 -1257561 -1248308 -1223880 -1228280 -1250819 -1276876 -1283482 -1282985 -1293730 -1296538 -1288938 -1280010 -1273209
10851 -1273209 -1265205 -1253765 -1239136 -1232772 -1230169 -1246043 -1254137 -1255817 -1250912 -1240871 -1241020 -1240996 -1240199 -1246996
10837 -1246996 -1263684 -1273607 -1256578 -1226144 -1212627 -1218921 -1214106 -1210997 -1223404 -1232913 -1223935 -1223513 -1234888
10824 -1234888 -1232184 -1214505 -1213757 -1216423 -1224408 -1228829 -1237500 -1240249 -1224808 -1231824 -1231960 -1211518 -1216829 -1220137
10810 -1220137 -1213457 -1203311 -1201891 -1199821 -1202931 -1203492 -1198698 -1200006 -1207572 -1206794 -1199161 -1200778 -1205784 -1213897
10796 -1213897 -1209740 -1202609 -1168216 -1153717 -1156490 -1164706 -1165486 -1178020 -1185856 -1189693 -1178490 -1187781 -1200634
10783 -1200634 -1203925 -1196783 -1184561 -1178806 -1173442 -1178195 -1194984 -1193203 -1177206 -1185438 -1194150 -1173942 -1151476
10770 -1151476 -1145540 -1152480 -1171112 -1176805 -1177297 -1178558 -1191122 -1188411 -1183597 -1188693 -1195514 -1186388 -1190566 -1192454
10756 -1192454 -1186925 -1190937 -1182054 -1178971 -1176157 -1176200 -1169445 -1170216 -1175249 -1180531 -1189119 -1186000 -1172076 -1170362
10742 -1170362 -1176008 -1179657 -1175655 -1167713 -1160988 -1163870 -1166796 -1166960 -1189665 -1180643 -1166805 -1162331 -1154619 -1148066
10728 -1148066 -1151975 -1163578 -1151702 -1146861 -1153267 -1156688 -1162140 -1165523 -1155656 -1139487 -1127826 -1125863 -1126847
10715 -1126847 -1127252 -1147101 -1147968 -1146961 -1161426 -1153644 -1157139 -1148956 -1159995 -1169339 -1143261 -1141659 -1147120
10702 -1147120 -1125488 -1117288 -1111858 -1117247 -1127871 -1134913 -1131250 -1139671 -1139072 -1136342 -1137078 -1142710 -1136829 -1116661
10688 -1116661 -1098543 -1100121 -1111134 -1117217 -1112570 -1113657 -1110583 -1111545 -1123745 -1129084 -1120256 -1115519 -1121233
10675 -1121233 -1125845 -1128243 -1118732 -1109270 -1108763 -1108454 -1114945 -1112866 -1099589 -1099772 -1101469 -1093099 -1097424 -1116828
10661 -1116828 -1135086 -1136864 -1140397 -1146562 -1138263 -1132491 -1117338 -1103929 -1093633 -1099368 -1116928 -1111631 -1092885
10648 -1092885 -1080027 -1073988 -1097035 -1113243 -1102932 -1103223 -1113560 -1112822 -1096104 -1101494 -1094889 -1081800 -1065872
10635 -1065872 -1074852 -1081270 -1087674 -1094785 -1085984 -1080766 -1067080 -1070462 -1087309 -1092944 -1077888 -1082030 -1091628
10622 -1091628 -1087251 -1097152 -1108969 -1099241 -1085044 -1063006 -1051663 -1070449 -1092125 -1100886 -1091145 -1085149
10610 -1085149 -1088066 -1081602 -1084877 -1079745 -1063270 -1054291 -1059600 -1070521 -1077710 -1075057 -1083977 -1095538 -1090246
10597 -1090246 -1096336 -1104442 -1084180 -1071109 -1056372 -1037772 -1044344 -1060672 -1057112 -1048666 -1046871 -1050994 -1061888
10584 -1061888 -1073872 -1067274 -1064774 -1066916 -1060417 -1053287 -1061134 -1058598 -1047658 -1046756 -1037873 -1017038 -1028979
10571 -1028979 -1050009 -1048280 -1043190 -1054432 -1064576 -1082795 -1074777 -1038911 -1029637 -1050186 -1071374 -1073319
10559 -1073319 -1066725 -1068821 -1061950 -1052960 -1045114 -1039368 -1047800 -1048419 -1028798 -1021044 -1033088 -1044221 -1041020
10546 -1041020 -1044819 -1056014 -1053261 -1047718 -1050947 -1050536 -1039477 -1033519 -1030389 -1026999 -1025053 -1027004 -1042956
10533 -1042956 -1049818 -1048259 -1044809 -1059844 -1055706 -1049318 -1044948 -1055407 -1062456 -1059523 -1040993 -1019548 -1035364
10520 -1035364 -1041107 -1040865 -1033989 -1037293 -1033741 -1021601 -1016876 -1013447 -1012227 -1017533 -1027614 -1019820 -1016346 -1014122
10506 -1014122 -1018160 -1033604 -1019342 -996863 -1000987 -1010236 -1014387 -1013612 -1016953 -1015976 -1007819 -1011199 -1001486 -988488
10492 -988488 -987399 -991540 -984157 -991760 -985460 -982499 -992380 -992227 -988630 -988478 -988312 -1003363 -1008229 -992882
10478 -992882 -987377 -990416 -991779 -993147 -975208 -967075 -967100 -971304 -991493 -1007945 -1005330 -1007570 -1007882 -1001728
10464 -1001728 -993280 -993146 -981647 -977274 -979398 -1000488 -1014895 -1021781 -1009125 -992422 -976078 -975156 -992691
10451 -992691 -1004380 -1004082 -1001716 -1003971 -1005646 -993469 -997668 -987965 -979349 -974703 -967568 -967292 -948741 -943510
10437 -943510 -956799 -969060 -965189 -954953 -961904 -969024 -962317 -973448 -993029 -994420 -992808 -991042 -977807
10424 -977807 -981545 -962495 -946510 -948713 -952955 -950360 -957817 -955745 -943136 -932653 -940922 -943297 -935107
10411 -935107 -945744 -955788 -955248 -956654 -949959 -943460 -944080 -942828 -938307 -947820 -959815 -957409 -949595 -940009
10397 -940009 -929937 -935926 -928981 -930360 -927967 -919848 -908133 -911866 -929944 -940763 -942104 -934013 -933779
10384 -933779 -931525 -934250 -918671 -926035 -935498 -925463 -929091 -938915 -949691 -943718 -927734 -929691 -923336
10371 -923336 -937765 -936673 -933138 -923894 -924543 -920007 -916530 -913077 -905017 -906053 -904564 -904152 -909153 -908680 -885140
10356 -885140 -862812 -867867 -879464 -871527 -870248 -861856 -845539 -835737 -826355 -827246 -823804 -820690 -825856 -856001
10342 -856001 -893410 -920662 -951143 -988244 -1017913 -1045481 -1057485 -1061251 -1068257 -1073784 -1079820 -1062615
10330 -1062615 -1050701 -1034910 -1027274 -1028296 -1025044 -1012252 -989191 -974787 -973082 -973874 -970800 -978204 -988800
10317 -988800 -985403 -988592 -987407 -974737 -972056 -954341 -937267 -931424 -934782 -949036 -953730 -960754 -956360
10304 -956360 -959468 -956596 -956652 -959206 -952572 -946674 -947396 -948773 -948793 -934612 -932590 -935956 -941549 -945057 -942829
10289 -942829 -929664 -923729 -937508 -947075 -937648 -923976 -942147 -948889 -934341 -917135 -920617 -919686 -921261
10276 -921261 -931857 -928155 -912827 -905258 -907964 -900094 -897001 -911150 -922735 -921021 -925218 -907951 -897052
10263 -897052 -907111 -916177 -912073 -915427 -918125 -912357 -912064 -914351 -908979 -899432 -891474 -890995 -915802 -930586
10249 -930586 -914855 -887948 -900622 -916942 -914405 -907964 -905593 -903440 -898190 -895968 -895932 -901834 -898436 -896774
10235 -896774 -891996 -904874 -908670 -889781 -875155 -883401 -871475 -856739 -864915 -882304 -884113 -880255 -886938
10222 -886938 -894586 -899011 -902749 -891748 -882663 -881173 -876361 -875306 -874876 -876109 -869332 -860455 -861968 -870222
10208 -870222 -857965 -854633 -861299 -877555 -861525 -847718 -842626 -841361 -836211 -841741 -860518 -874375 -884751
10195 -884751 -874936 -858988 -854083 -857331 -865770 -867501 -872547 -870081 -857648 -859597 -880595 -875965 -866269
10182 -866269 -861973 -866166 -868936 -873046 -867682 -857520 -852115 -857169 -861941 -850563 -850973 -840362 -823021
10169 -823021 -832542 -855589 -856017 -846641 -836133 -840945 -852283 -850871 -860809 -872107 -858174 -846116 -846022
10156 -846022 -840003 -827208 -824179 -825933 -827897 -830050 -829491 -830607 -828820 -826681 -826429 -836814 -849579 -841174
10142 -841174 -843439 -837860 -817060 -820674 -841119 -841658 -837463 -845865 -859153 -852886 -837757 -844990 -848194
10129 -848194 -837080 -846886 -853588 -844595 -823465 -823385 -825661 -833735 -835751 -832291 -832907 -824097 -815983 -817765
10115 -817765 -821173 -817389 -818512 -813110 -810365 -803356 -789887 -787433 -805245 -817003 -821760 -822790 -829000
10102 -829000 -821088 -804663 -799360 -816751 -839687 -847334 -828714 -827932 -828487 -830458 -815232 -822610 -820033
10089 -820033 -814267 -795289 -796335 -785312 -776173 -783156 -791430 -803922 -805164 -800788 -789624 -786497 -774762
10076 -774762 -769624 -777893 -785280 -783925 -772215 -756055 -755869 -770402 -776303 -763581 -754129 -747686 -750024
10063 -750024 -739459 -730796 -726731 -701133 -689668 -670705 -665646 -660353 -636666 -604545 -576225 -553907
10051 -553907 -506958 -485135 -533617 -695548 -966881 -1124576 -1135340 -1089369 -1047179 -1017279 -1008134
10040 -1008134 -988303 -944857 -911428 -898871 -907042 -908540 -910663 -905548 -901811 -900820 -893945 -882689 -877726
10027 -877726 -868473 -865973 -865816 -858891 -858847 -857499 -849899 -856781 -859028 -855925 -859827 -854440 -836472 -826740 -812388
10012 -812388 -807640 -815766 -803294 -797782 -798192 -810112 -830142 -850231 -856007 -825101 -807476 -803250 -814096
9999 -814096 -819364 -836577 -835720 -830969 -830824 -822311 -818233 -814839 -820411 -830688 -814767 -806126 -806357 -812348
9985 -812348 -810376 -814187 -824637 -816423 -815313 -818309 -807537 -806652 -800264 -786549 -778934 -787271 -785901 -794609
9971 -794609 -804875 -806684 -790909 -781609 -790124 -793809 -807904 -818790 -819435 -796282 -795211 -802711 -815321
9958 -815321 -815258 -803435 -795194 -807650 -809765 -815023 -808167 -789654 -789840 -802977 -806815 -799162 -794592 -806242
9944 -806242 -816893 -814817 -808513 -804457 -803439 -789480 -783374 -762939 -764876 -766827 -766797 -759337 -755603 -765393
9930 -765393 -769658 -767844 -764801 -755606 -770663 -785107 -786277 -785798 -771760 -758932 -772717 -765482 -774487
9917 -774487 -786939 -784848 -778203 -767730 -771040 -773883 -766857 -759294 -764439 -765176 -757025 -751818 -763426 -765873
9903 -765873 -768273 -755760 -745773 -749378 -751855 -761275 -767759 -756566 -751335 -756604 -765910 -767655 -769299 -768793
9889 -768793 -770576 -763832 -773245 -769697 -770270 -748322 -746298 -760163 -750360 -736411 -731208 -739730 -744580 -742900
9875 -742900 -756867 -761664 -762558 -755144 -747042 -742300 -745979 -739285 -737724 -755159 -752313 -745458 -748241 -744607
9861 -744607 -745340 -742839 -748379 -747627 -741336 -731753 -733969 -731295 -722986 -711985 -729507 -734206 -734888 -738511 -751713
9846 -751713 -751272 -745485 -751907 -750751 -737876 -733791 -740607 -724982 -728878 -739860 -740692 -733414 -737645 -738231
9832 -738231 -741438 -729521 -725318 -729870 -735209 -725516 -734812 -750207 -733967 -725540 -717692 -722097 -710441
9819 -710441 -701877 -703443 -710693 -717303 -718909 -717195 -706430 -701556 -712852 -718868 -732238 -729899 -727668 -733358
9805 -733358 -718961 -713521 -709054 -708765 -728602 -738516 -733263 -729765 -724866 -727680 -706235 -692103 -690219 -696848
9791 -696848 -707618 -720706 -714412 -699070 -707514 -717243 -714031 -714600 -725705 -716679 -701346 -708611 -692585
9778 -692585 -686335 -697621 -688478 -695080 -694108 -705706 -714418 -735101 -741540 -733851 -736258 -719329 -701874
9765 -701874 -696209 -700994 -694371 -685207 -696883 -706829 -707101 -699412 -692456 -699876 -699311 -703106 -715289 -725571
9751 -725571 -725718 -720042 -725422 -723519 -713432 -706778 -704098 -702311 -717424 -707541 -696788 -682833 -683037 -696538
9737 -696538 -707397 -712947 -718063 -715870 -704930 -705130 -691735 -687615 -691753 -698542 -706628 -704065 -700831 -694437
9723 -694437 -690057 -684130 -682413 -681259 -682235 -683463 -686653 -688671 -695389 -697749 -693967 -686077 -682784 -678556 -677963
9708 -677963 -675305 -676658 -670979 -669677 -667004 -660908 -654885 -660034 -669149 -665785 -666093 -661976 -671142 -694571
9694 -694571 -701665 -684475 -679908 -683916 -677288 -664623 -643509 -652537 -673998 -683164 -658926 -642167 -631350
9681 -631350 -630816 -635818 -631440 -634959 -645505 -653617 -661867 -667047 -660612 -639642 -636083 -650165 -656058 -656891
9667 -656891 -642072 -643410 -656486 -655078 -661058 -666847 -670096 -658535 -647756 -646586 -643607 -652646 -656425
9654 -656425 -654037 -647543 -655035 -654529 -651683 -662466 -648317 -636567 -643414 -648633 -642840 -631605 -645068
9641 -645068 -639370 -635045 -635900 -638904 -638657 -643692 -630146 -616775 -623810 -627212 -629823 -630461 -621420 -621477 -630356
9626 -630356 -644328 -657217 -656095 -657174 -647049 -628126 -616301 -612840 -621773 -625347 -629252 -626145 -628730
9613 -628730 -635625 -632588 -631616 -642805 -623622 -601625 -593383 -584334 -584408 -602237 -617591 -625775 -629055 -616971
9599 -616971 -618877 -613224 -615275 -616287 -612700 -610596 -619418 -622195 -607779 -616348 -618334 -603171 -600876 -600276
9585 -600276 -588465 -578468 -577283 -588790 -606568 -620487 -632374 -633352 -628061 -629755 -616913 -606655 -607889
9572 -607889 -606839 -606452 -597227 -589907 -592609 -600327 -626121 -628794 -623734 -614991 -615585 -619315 -630542 -622255
9558 -622255 -613174 -619917 -619673 -600131 -586115 -584949 -572555 -579610 -587283 -588975 -590460 -580597 -577092 -580192
9544 -580192 -575458 -570261 -563402 -560073 -568543 -576049 -572011 -569065 -576304 -596417 -593464 -590999 -592195 -585762
9530 -585762 -591008 -583456 -585781 -591008 -581389 -579755 -582572 -577063 -567916 -563238 -554402 -548906 -552041 -552979 -572664
9515 -572664 -569675 -547583 -548665 -582363 -588117 -560158 -543369 -533565 -536045 -558451 -557508 -556864 -558341 -558434
9501 -558434 -545638 -533732 -525370 -512226 -524257 -541948 -551530 -547175 -531456 -551025 -562936 -560379
9489 -560379 -566991 -563621 -556025 -561078 -562992 -544216 -538984 -555925 -552625 -544601 -537704 -544680 -542423 -539129
9475 -539129 -524083 -515737 -519226 -524934 -525971 -516964 -519055 -522408 -523291 -526833 -533801 -535286 -539005 -545296
9461 -545296 -542234 -539604 -537598 -532938 -539373 -535637 -524913 -512454 -498955 -517918 -538656 -529564 -516143
9448 -516143 -525329 -523312 -511033 -512365 -518792 -516248 -504548 -513194 -505853 -500485 -497457 -489680 -502231 -508846
9434 -508846 -505905 -501535 -505408 -509412 -511161 -499729 -485209 -485988 -487775 -490123 -484837 -495389 -495617 -492350
9420 -492350 -485998 -481947 -475706 -469508 -471350 -476809 -491756 -473993 -485611 -484541 -489506 -477286 -474140
9407 -474140 -465471 -465970 -482812 -475741 -460385 -467153 -477354 -472444 -461460 -463999 -476746 -458801 -459440
9394 -459440 -449024 -435581 -433319 -438659 -436414 -436951 -445291 -438631 -439724 -443413 -441059 -440063 -440605 -432468 -427118
9379 -427118 -424194 -429817 -449368 -459177 -452289 -435980 -440369 -438986 -440215 -447347 -440310 -438698 -423071 -415835
9365 -415835 -408938 -428948 -450549 -436261 -418164 -412877 -408670 -407369 -407669 -413144 -420161 -424128 -421415 -419870
9351 -419870 -408437 -410940 -410494 -405810 -391414 -385338 -382913 -364892 -356918 -359035 -372976 -387789 -397037
9338 -397037 -388515 -372612 -359749 -365453 -372330 -375783 -390275 -382529 -382286 -383715 -370381 -365391 -371083 -363035
9324 -363035 -356914 -342583 -342586 -347157 -349415 -342788 -342926 -353304 -349070 -350420 -340381 -355716 -358077 -348205
9310 -348205 -325056 -321629 -326143 -336893 -335350 -337383 -338497 -334987 -343865 -346143 -323226 -321948 -318180 -306539
9296 -306539 -297647 -294140 -281665 -280555 -294772 -286684 -281877 -282118 -278528 -288745 -290951 -260790 -250434
9283 -250434 -256810 -266314 -242011 -220085 -219488 -234256 -240547 -244620 -244456 -245560 -245928 -237320 -232934 -223795
9269 -223795 -226730 -222346 -213336 -199102 -217479 -224666 -219937 -213767 -212172 -205641 -196105 -188354 -178373 -179320
9255 -179320 -166969 -157769 -169258 -192175 -178853 -160774 -156359 -164270 -160659 -156729 -165349 -157246 -151609
9242 -151609 -140889 -134646 -146959 -140180 -126732 -129764 -136128 -136287 -124753 -128789 -135960 -136568 -128372 -120099
9228 -120099 -109076 -99779 -110728 -122541 -110647 -117439 -135566 -120119 -117703 -127408 -108734 -115288 -128511
9215 -128511 -135349 -150987 -147519 -143095 -143792 -150802 -147554 -132054 -133082 -145046 -151863 -148756 -165719 -188127
9201 -188127 -192675 -183180 -199747 -216152 -223055 -236409 -254965 -270419 -287145 -289608 -293335 -310135 -332325
9188 -332325 -366136 -375808 -385181 -403306 -400101 -406858 -428153 -462672 -489006 -511529 -518071 -523095 -544189
9175 -544189 -571801 -596282 -608887 -623720 -660000 -690768 -700557 -716057 -743667 -757274 -769284 -772880
9163 -772880 -782214 -811346 -851971 -871007 -890421 -910853 -928400 -943564 -954631 -972488 -997906 -1022253
9151 -1022253 -1047489 -1066434 -1067313 -1059448 -1072234 -1098208 -1112136 -1124505 -1130569 -1146702 -1158276 -1166236
9139 -1166236 -1168478 -1174931 -1183509 -1206248 -1206701 -1211951 -1200523 -1193786 -1204759 -1213237 -1220225 -1220607 -1223878 -1224769
9125 -1224769 -1224097 -1230374 -1220754 -1212333 -1202807 -1202366 -1202309 -1204876 -1209168 -1207633 -1206717 -1213094 -1214221 -1208549 -1205783
9110 -1205783 -1205325 -1204113 -1207026 -1210025 -1195309 -1185733 -1198517 -1205511 -1204812 -1188216 -1184263 -1176630 -1162399 -1158924
9096 -1158924 -1163304 -1180324 -1192051 -1184045 -1163445 -1157659 -1150542 -1138358 -1149394 -1147154 -1136811 -1141485 -1151116
9083 -1151116 -1165863 -1156500 -1147562 -1131725 -1120114 -1118601 -1111362 -1107333 -1121199 -1120971 -1113987 -1111677 -1108632
9070 -1108632 -1085138 -1064611 -1057095 -1052037 -1043518 -1048691 -1053054 -1059812 -1057721 -1066063 -1070898 -1072793 -1088308
9057 -1088308 -1086947 -1078110 -1072532 -1055014 -1042496 -1028370 -1046771 -1051622 -1044871 -1031230 -1023763 -1024918 -1025491
9044 -1025491 -1017253 -1007978 -1003475 -1007245 -1019931 -1017146 -1004318 -1000123 -991583 -997726 -997596 -1009397 -1010839 -1003439
9030 -1003439 -995689 -996564 -999027 -996065 -987795 -981794 -980064 -982391 -980189 -980655 -1002436 -1000020 -993781 -993632 -982979
9015 -982979 -986883 -989704 -993058 -998391 -990122 -976622 -964600 -958693 -942912 -937252 -939004 -941241 -943699 -948970
9001 -948970 -943788 -936864 -930142 -933389 -933745 -933777 -926115 -931758 -938450 -933460 -917326 -910299 -915965 -913613 -908544
8986 -908544 -909056 -908629 -924442 -934978 -932462 -918212 -925158 -925525 -921689 -920258 -915319 -915135 -901573 -889140
8972 -889140 -879754 -880631 -891421 -884888 -891861 -898716 -892334 -874298 -876909 -884838 -882872 -877139 -879002 -877365
8958 -877365 -868660 -876988 -895987 -894716 -873837 -874887 -883092 -878526 -858943 -853690 -855995 -868762 -871294
8945 -871294 -863023 -872876 -870682 -865823 -878388 -879259 -855899 -847444 -846634 -856602 -850048 -841216 -835648 -846176
8931 -846176 -835016 -816916 -807954 -821183 -833633 -836243 -835366 -833743 -844260 -855908 -836034 -830704 -838066
8918 -838066 -838918 -842546 -828060 -806992 -797826 -805668 -806757 -796422 -798903 -809144 -810684 -808982 -795889
8905 -795889 -799558 -804445 -792238 -809430 -811336 -820077 -834885 -832102 -823439 -812681 -818907 -814482 -799553
8892 -799553 -800760 -814245 -819555 -812942 -803964 -803652 -807693 -796619 -795694 -803462 -797736 -793815 -790935 -796910
8878 -796910 -815726 -822269 -818879 -799538 -793465 -807956 -808060 -796209 -779918 -780077 -796745 -787648 -771365
8865 -771365 -778134 -797304 -794846 -783183 -785241 -792183 -789097 -784146 -781406 -779115 -772279 -767189 -763729 -775845
8851 -775845 -799382 -802187 -785420 -767467 -782115 -786209 -778035 -774501 -766770 -770540 -763548 -750846 -761401
8838 -761401 -769136 -764814 -773008 -778838 -794001 -793759 -784723 -776649 -767657 -758951 -757031 -769937 -764932 -749155
8824 -749155 -738915 -735766 -751134 -753365 -770527 -765598 -740222 -713819 -710639 -717017 -736244 -754589 -763270
8811 -763270 -762915 -750331 -731889 -739449 -758749 -771624 -761245 -756021 -755263 -746121 -749291 -737990 -738520 -738383
8797 -738383 -737337 -743077 -733328 -735358 -743557 -745785 -745966 -744259 -740668 -740307 -741877 -729950 -735800 -746523
8783 -746523 -738595 -750976 -739683 -728962 -736889 -736088 -729312 -734677 -748165 -739302 -733491 -730803 -731225 -743423
8769 -743423 -744416 -739615 -747292 -747635 -746705 -723958 -717017 -718300 -713408 -713941 -714772 -724898 -738809 -731735 -726172
8754 -726172 -722265 -716728 -728063 -723139 -703007 -697273 -708008 -720232 -728242 -727625 -736105 -739004 -726618
8741 -726618 -720437 -697924 -685917 -696995 -700203 -708331 -712746 -710161 -722374 -711198 -709236 -709966 -704493
8728 -704493 -709651 -705665 -691186 -697010 -712292 -725202 -736281 -735977 -726230 -706102 -699735 -701022 -702308
8715 -702308 -694191 -703205 -716598 -716122 -705634 -696533 -693669 -683675 -663047 -663938 -680180 -689728 -686414 -676286
8701 -676286 -672127 -666508 -679861 -691960 -701160 -697477 -687747 -693100 -696365 -695999 -695886 -702605 -701741 -702887 -703806
8686 -703806 -703404 -693775 -672352 -675278 -691332 -680996 -673312 -671921 -680156 -672420 -668815 -678682 -679752 -683119
8672 -683119 -686618 -684404 -674738 -659485 -651543 -672445 -674362 -675801 -685635 -690121 -691277 -672823 -655814
8659 -655814 -657519 -650780 -654894 -651738 -648536 -659566 -661426 -659314 -669114 -665196 -675726 -668024 -658664 -673844
8645 -673844 -684348 -684631 -669640 -662191 -665312 -672734 -671684 -673933 -659457 -649931 -661584 -673057 -674435
8632 -674435 -666079 -674710 -682837 -685421 -677236 -647615 -647062 -647828 -649185 -654246 -653847 -648868 -654636 -667269 -665590
8617 -665590 -658313 -643962 -633345 -634000 -654582 -654878 -650973 -651096 -645403 -643296 -650474 -655897 -657602 -652871
8603 -652871 -653474 -661761 -679633 -676059 -665039 -656447 -658564 -669224 -666246 -669145 -668570 -678928 -681161 -672987
8589 -672987 -683013 -683171 -670500 -663367 -659405 -656806 -663769 -657970 -651526 -650757 -657847 -660735 -663018 -670571
8575 -670571 -664672 -665651 -672038 -682293 -692331 -691391 -677263 -663988 -650968 -658181 -667883 -667387 -677815 -673709
8561 -673709 -664266 -653005 -648726 -647306 -659995 -667275 -655978 -645956 -635475 -640137 -653568 -647519 -645604
8548 -645604 -652603 -651315 -658271 -670941 -663624 -657641 -667526 -665584 -649184 -652041 -660309 -661338 -669049 -683094
8534 -683094 -675751 -672257 -662784 -642400 -650523 -655607 -651317 -643142 -658067 -672181 -679702 -678001 -651225
8521 -651225 -638138 -639492 -642648 -653174 -669846 -674450 -663911 -655033 -659444 -647763 -640444 -629109 -642369
8508 -642369 -649961 -654941 -657804 -642492 -641978 -638887 -635918 -639812 -639237 -630502 -636769 -653184 -659400 -647109
8494 -647109 -636024 -625205 -626328 -630794 -639941 -644530 -641455 -628716 -615517 -619237 -628995 -619163 -622045
8481 -622045 -632202 -636837 -626220 -615193 -621752 -621427 -635489 -653542 -656382 -649882 -646991 -648040 -640981
8468 -640981 -649093 -646978 -641604 -632068 -624147 -629290 -641541 -651180 -655189 -647838 -633148 -635782 -638327 -639545
8454 -639545 -643289 -650412 -649542 -646046 -642776 -642978 -634851 -625495 -624438 -623866 -625674 -622798 -625202 -628506 -629013
8439 -629013 -641936 -637508 -627179 -607930 -605798 -603069 -609568 -610210 -603729 -590556 -589444 -608665 -618560
8426 -618560 -608226 -595034 -593154 -589126 -603362 -613886 -615423 -605191 -618126 -635917 -662866 -661662
8414 -661662 -647494 -640670 -642021 -646758 -650613 -640170 -630704 -625412 -607700 -611079 -622029 -611158 -609131
8401 -609131 -606174 -625045 -627509 -618831 -609220 -611578 -612707 -627004 -638051 -634564 -629945 -621399 -608740
8388 -608740 -601072 -595072 -604495 -601940 -599559 -597823 -602119 -611071 -613466 -618308 -628055 -625836 -628801 -619455
8374 -619455 -612374 -601787 -625094 -646020 -636847 -619888 -618951 -613492 -601808 -601049 -607630 -617500 -605848
8361 -605848 -612125 -613158 -618202 -610530 -610860 -613494 -611792 -618491 -619840 -620648 -627570 -609307 -610832 -618991 -616590
8346 -616590 -621184 -619459 -609691 -595665 -592933 -585327 -595772 -604187 -612060 -614077 -621246 -599973 -601871 -606013
8332 -606013 -592772 -582030 -593518 -601855 -618401 -618500 -604864 -597093 -583697 -575408 -581473 -591849 -589986
8319 -589986 -564856 -537866 -531328 -551591 -587061 -594855 -587069 -579925 -581247 -579257 -593704 -594268 -597641
8306 -597641 -593012 -602519 -612754 -613216 -619306 -614231 -617842 -605388 -597892 -593890 -583796 -597060 -606556 -604028
8292 -604028 -613581 -622424 -624320 -625396 -610935 -612767 -612173 -610090 -608081 -602465 -593835 -596313 -596606 -587537 -586247
8277 -586247 -579581 -580390 -589569 -581063 -570506 -577035 -601228 -604734 -600577 -598293 -617854 -611799 -597326 -588182
8263 -588182 -599245 -611278 -608397 -600130 -584460 -577216 -582885 -579001 -589179 -588304 -594922 -593781 -570848
8250 -570848 -568180 -571959 -589070 -591665 -584978 -596949 -601491 -586957 -582127 -582870 -578265 -580114 -587045 -586179
8236 -586179 -595901 -589911 -580562 -572109 -579669 -583684 -589367 -592747 -587627 -581579 -574571 -564520 -558865 -555768
8222 -555768 -567837 -566147 -560500 -581095 -607197 -606950 -595180 -592821 -585908 -582904 -593950 -586429 -585091
8209 -585091 -598573 -585143 -581755 -597109 -591114 -587128 -594387 -607013 -615088 -600507 -592088 -594248 -611461
8196 -611461 -605173 -596416 -597426 -595151 -591561 -589161 -586308 -588160 -589245 -592947 -602393 -606046 -590045 -590580
8182 -590580 -578936 -572447 -559889 -566370 -566147 -566052 -576236 -576586 -571489 -570907 -573125 -576058 -580193 -586814 -591393
8167 -591393 -583360 -583411 -579058 -588776 -599426 -602160 -595198 -593810 -604718 -609320 -610227 -594041 -590340 -586613
8153 -586613 -584622 -588193 -593035 -593927 -591508 -583642 -572884 -571247 -569761 -575142 -569870 -567887 -574245 -567785
8139 -567785 -560444 -570596 -575255 -583178 -579200 -572475 -568824 -568340 -561074 -577307 -587308 -586958 -582067 -585459
8125 -585459 -584041 -589206 -585551 -589639 -601577 -596236 -591993 -586304 -577770 -574373 -578044 -597403 -599618 -590837
8111 -590837 -587534 -593948 -599959 -590353 -569283 -562747 -575322 -592494 -587799 -575836 -574362 -571577 -575204
8098 -575204 -579318 -574626 -566426 -557123 -559078 -553028 -551739 -561547 -566078 -573679 -568449 -549436 -544699 -543537
8084 -543537 -549177 -552081 -551683 -549165 -541367 -548060 -555878 -551388 -549923 -563378 -566965 -563289 -574254 -569502
8070 -569502 -562063 -554452 -551331 -548018 -554142 -564955 -565039 -571244 -574408 -561363 -552698 -561392 -555792 -551460
8056 -551460 -545975 -541058 -547719 -539954 -539444 -556610 -563567 -560788 -569630 -571406 -578390 -578996 -564703 -550068
8042 -550068 -555790 -561709 -547346 -543878 -530392 -526239 -544001 -550429 -553440 -553706 -560872 -573417 -574716 -567110
8028 -567110 -567892 -569676 -569320 -576230 -569906 -559791 -552709 -550340 -543322 -545469 -550035 -554841 -556596 -555265 -548237
8013 -548237 -552957 -549425 -548534 -559162 -561446 -549804 -554870 -552604 -558528 -558821 -547634 -547398 -546930 -543097 -545447
7998 -545447 -552216 -552868 -559286 -556707 -551727 -558679 -563028 -566357 -567852 -573939 -565143 -570829 -577499 -569390 -555159
7983 -555159 -559421 -569719 -564931 -560480 -553185 -549210 -559257 -565502 -552144 -554420 -549701 -534678 -532286
7970 -532286 -555976 -556565 -541083 -526035 -531139 -539504 -529215 -524138 -535132 -543707 -557720 -566252 -563741
7957 -563741 -562362 -551217 -542808 -550957 -556775 -558035 -575895 -580381 -587761 -582926 -568836 -567845 -567017 -553404
7943 -553404 -547224 -561298 -571375 -570085 -552864 -536566 -528224 -539817 -549152 -537145 -551824 -561689 -557550
7930 -557550 -558439 -562828 -559956 -544876 -545101 -546211 -543738 -538741 -544944 -549444 -550685 -558609 -566108 -552926
7916 -552926 -546047 -546426 -534700 -537018 -548072 -557138 -561655 -561872 -561667 -546043 -546808 -553934 -559115 -559094 -560370
7901 -560370 -546488 -535352 -538070 -543951 -547265 -536648 -532379 -525027 -532889 -538975 -540063 -538929 -533561 -541861
7887 -541861 -546317 -547396 -546585 -534294 -512960 -522124 -546841 -541428 -532444 -542893 -553888 -542545 -553758
7874 -553758 -566115 -556090 -555341 -561922 -556565 -555608 -555195 -542480 -528226 -527563 -542641 -553128 -553228 -551149
7860 -551149 -547167 -544458 -537830 -534240 -536394 -539711 -538816 -540072 -544261 -561719 -554155 -528362 -537132 -538005
7846 -538005 -519300 -518353 -514415 -534149 -548494 -557075 -542765 -536507 -515750 -512407 -529156 -529671 -533834
7833 -533834 -533632 -533643 -528070 -536732 -547916 -549718 -549073 -535428 -537838 -534573 -556837 -570994 -548618 -543483
7819 -543483 -559035 -567418 -561195 -549703 -534879 -547305 -554240 -538773 -535465 -544474 -546086 -542715 -541586
7806 -541586 -543805 -539265 -542753 -529046 -523709 -532648 -552897 -552933 -547770 -540907 -543156 -541742 -526595 -527931
7792 -527931 -531754 -540755 -535243 -539301 -545632 -537792 -523071 -512830 -525782 -535302 -537335 -536083 -528055 -535457
7778 -535457 -533347 -535904 -542090 -549315 -556043 -534117 -530507 -533249 -536467 -539891 -535373 -524497 -523280 -515526
7764 -515526 -514645 -519639 -514419 -510630 -528813 -532466 -530726 -531204 -522429 -524539 -517731 -535717 -541699 -531705
7750 -531705 -523562 -524894 -539995 -535316 -525241 -507217 -513076 -522556 -532361 -526673 -521558 -533098 -516499
7737 -516499 -505129 -507969 -526429 -523874 -519561 -508576 -510944 -514299 -518141 -534295 -530200 -512458 -504465
7724 -504465 -510207 -517920 -525968 -521801 -526548 -506366 -483244 -476031 -485182 -495104 -507304 -507447 -509486 -518297
7710 -518297 -514907 -516811 -513698 -513580 -525871 -537719 -525041 -518582 -525509 -537175 -544032 -538769 -525836
7697 -525836 -521699 -531007 -537504 -532826 -529962 -516313 -517853 -526263 -506512 -507950 -517168 -518887 -526011 -518479
7683 -518479 -515255 -530210 -527120 -522345 -538424 -535711 -525321 -525243 -519937 -524425 -519085 -533310 -530869 -526074
7669 -526074 -525610 -518539 -521947 -524587 -514874 -512386 -499086 -512101 -506962 -494831 -484999 -489217 -506184 -500378
7655 -500378 -506849 -513522 -516194 -515190 -528451 -536802 -512402 -505548 -514724 -509349 -516030 -503078 -495469 -490039
7641 -490039 -489316 -502080 -514907 -527015 -536965 -546574 -527149 -502957 -512306 -523778 -514209 -504897 -499392
7628 -499392 -494956 -488365 -492157 -496093 -497751 -499404 -497116 -509466 -500815 -486463 -488893 -494194 -484331 -474437
7614 -474437 -481637 -487529 -480233 -479216 -479412 -482183 -480833 -491903 -491352 -493308 -480548 -485178 -485915 -474704
7600 -474704 -487611 -501715 -493860 -489222 -476304 -463180 -474136 -495130 -511524 -515367 -515722 -511141 -501875
7587 -501875 -493682 -491992 -499561 -510319 -513551 -515174 -503213 -494125 -488587 -478770 -483037 -494798 -509041
7574 -509041 -503633 -508678 -504397 -498804 -493580 -482235 -491328 -497398 -497109 -511618 -514149 -501400 -493564 -490376
7560 -490376 -470267 -480003 -491501 -500515 -496410 -482934 -492381 -496835 -501026 -509143 -502483 -497877 -495630 -501715
7546 -501715 -506710 -494980 -491108 -488867 -502601 -502699 -487623 -489175 -485189 -480842 -474121 -471832 -478904 -486739
7532 -486739 -492253 -491741 -496784 -505279 -504424 -493597 -510992 -513396 -489545 -491932 -507142 -500037 -487562 -495520
7518 -495520 -506273 -498992 -504250 -513602 -521095 -514447 -500029 -495976 -499607 -505101 -498296 -481456 -476295 -488033
7504 -488033 -488950 -495397 -488800 -483558 -483105 -481476 -487807 -489486 -499629 -492726 -478467 -464655 -476802 -476801 -462478
7489 -462478 -466039 -462928 -462081 -466023 -459363 -447414 -456922 -471276 -477481 -471306 -475864 -475300 -480180 -498080
7475 -498080 -503154 -500605 -510545 -515802 -498822 -489441 -490829 -503291 -493913 -473533 -480832 -492727 -475124
7462 -475124 -460313 -462832 -485231 -504309 -498756 -503644 -498194 -490728 -485996 -486523 -483458 -476760 -465848 -474059
7448 -474059 -466624 -463610 -454312 -455971 -465508 -482732 -495676 -492027 -505615 -492059 -480196 -478041 -468094
7435 -468094 -473150 -485694 -488523 -490525 -482584 -493349 -493100 -490956 -495705 -504820 -494988 -484965 -483892 -481486
7421 -481486 -473921 -466675 -467198 -471801 -481538 -484114 -478512 -478705 -470320 -474222 -471980 -466259 -469154 -474868 -463756
7406 -463756 -460640 -458610 -451306 -462363 -480879 -489351 -488386 -481837 -478335 -487239 -488436 -499683 -501692 -496624
7392 -496624 -500911 -488106 -473341 -465797 -468853 -458510 -454489 -464954 -472199 -470567 -464084 -460404 -471299
7379 -471299 -463494 -465118 -472921 -470512 -476906 -485229 -477641 -478826 -478581 -491857 -489381 -473573 -485618 -494650
7365 -494650 -512603 -502566 -494446 -487964 -489714 -487720 -502300 -507888 -503601 -493145 -497699 -495488 -498399
7352 -498399 -484348 -479370 -475253 -464443 -457914 -470433 -473041 -465960 -470189 -468256 -474595 -484215 -492205 -490478
7338 -490478 -489381 -494321 -496052 -490111 -484635 -468648 -475581 -489144 -480031 -458683 -460482 -481584 -490042
7325 -490042 -486722 -478387 -486079 -472580 -464139 -463439 -465412 -460944 -463751 -469288 -474996 -493231 -485594 -468549
7311 -468549 -463659 -465927 -474140 -452852 -458609 -473919 -482868 -484651 -482077 -474408 -482064 -472777 -454819 -443590
7297 -443590 -448673 -451690 -458432 -465660 -474791 -475102 -474909 -457073 -444499 -454820 -460030 -470366 -465372 -461280
7283 -461280 -459734 -464713 -467019 -470089 -460437 -467722 -463961 -460619 -461638 -453332 -456735 -464272 -474591 -473501
7269 -473501 -472077 -477162 -474987 -480611 -487209 -489409 -484266 -483817 -481119 -490143 -486892 -475438 -459222 -461089
7255 -461089 -476328 -485567 -475731 -471859 -483869 -479748 -465399 -468165 -471330 -478014 -480720 -474163 -474140 -486136
7241 -486136 -477119 -463780 -457998 -462407 -463791 -463956 -459360 -459648 -454863 -470773 -479886 -473818 -468639 -466562
7227 -466562 -471336 -476907 -480387 -482564 -466752 -454993 -443550 -432173 -421162 -428943 -448000 -455282 -459592
7214 -459592 -465210 -455614 -450898 -454930 -456516 -455108 -459057 -457200 -445984 -439907 -447183 -439221 -444779 -449631
7200 -449631 -446991 -439569 -438740 -455440 -468637 -464440 -465333 -458069 -439774 -434427 -449338 -465356 -464081 -443227
7186 -443227 -439387 -431679 -436354 -434660 -429198 -431360 -431715 -436644 -451750 -464237 -462065 -453370 -454424 -457260
7172 -457260 -463631 -464779 -458993 -454648 -455639 -456022 -457766 -457448 -446422 -458949 -483533 -490109 -467784 -460538
7158 -460538 -457899 -463068 -457038 -464320 -473334 -481992 -469231 -447682 -447296 -471938 -491128 -480625 -472971
7145 -472971 -475209 -475503 -468005 -459786 -467478 -464950 -464920 -470586 -468378 -456431 -455372 -463743 -463708 -459845 -462814
7130 -462814 -467459 -462024 -468189 -486123 -484528 -473373 -469897 -478761 -485617 -473823 -459325 -460568 -463462
7117 -463462 -457040 -453293 -439292 -438713 -442440 -445421 -446482 -442927 -441687 -437145 -437331 -442800 -451766 -452398 -448390
7102 -448390 -446938 -451280 -458112 -455519 -448825 -447776 -448975 -441130 -434354 -447858 -472216 -469612 -466388 -454017
7088 -454017 -439236 -446221 -449128 -453839 -445394 -453975 -449010 -446302 -455519 -456481 -453290 -458332 -456451 -457689
7074 -457689 -454029 -469584 -476198 -467873 -455863 -469982 -470059 -456244 -453814 -459696 -458853 -461442 -450245 -439917
7060 -439917 -420629 -423320 -437034 -448158 -436763 -442820 -462833 -459390 -450341 -426688 -423951 -436113 -450035
7047 -450035 -436885 -437400 -437139 -446764 -444626 -439058 -449324 -459451 -457954 -444918 -438939 -444653 -443259 -450954
7033 -450954 -452601 -441846 -426786 -425473 -425149 -422554 -432240 -445890 -446232 -446270 -444599 -439370 -430351 -439196 -452332
7018 -452332 -454484 -454611 -449897 -438381 -438415 -454740 -451954 -439349 -429305 -434614 -441727 -453945 -458266 -451239
7004 -451239 -442545 -442973 -435518 -424564 -439196 -450387 -448944 -444818 -436619 -438524 -450322 -451827 -449677 -455013
6990 -455013 -443159 -435286 -433125 -441884 -441879 -442793 -440342 -437514 -434570 -437077 -447542 -451029 -428289 -425395 -440962
6975 -440962 -451115 -450332 -425261 -409949 -407254 -420603 -434960 -433097 -426815 -436863 -444799 -449472 -459297
6962 -459297 -468388 -458584 -443123 -425134 -416526 -417634 -402081 -426340 -445165 -448976 -430033 -436990 -453095
6949 -453095 -466600 -472719 -471734 -470222 -464724 -453822 -434752 -426512 -428190 -439390 -445554 -450985 -451502 -452238
6935 -452238 -441021 -425797 -424441 -425862 -429592 -443188 -454637 -446940 -445171 -433409 -420601 -427004 -419111
6922 -419111 -419457 -446384 -462869 -471477 -473765 -455415 -437631 -430510 -432637 -437923 -439984 -432573 -424786 -442970
6908 -442970 -444834 -443802 -436007 -437448 -450202 -460679 -468218 -454168 -441967 -419979 -410750 -422440 -427324
6895 -427324 -444299 -457818 -450245 -436336 -435135 -430598 -428848 -443005 -442904 -435421 -430607 -428278 -426673 -420825
6881 -420825 -426498 -435870 -420124 -421042 -419447 -419347 -417087 -417951 -419269 -422099 -427460 -423648 -421090 -426527 -423078
6866 -423078 -433809 -446754 -458989 -450235 -439583 -433607 -431724 -423491 -422943 -426841 -419594 -426155 -430240 -430331
6852 -430331 -424271 -419653 -437280 -438975 -443613 -435457 -449187 -453106 -439033 -433788 -445895 -438896 -442931
6839 -442931 -441555 -428603 -421016 -421834 -426270 -419433 -422240 -431228 -445086 -443481 -433357 -436611 -426567 -422567
6825 -422567 -426613 -438884 -447130 -453953 -445947 -449732 -446931 -444870 -440850 -444603 -437659 -440539 -434796 -441400
6811 -441400 -443299 -428582 -410701 -419216 -427247 -423093 -423174 -433037 -433112 -427369 -427601 -421902 -404481 -401751 -417020
6796 -417020 -421749 -419054 -429054 -422917 -419266 -429426 -435912 -428241 -419559 -424967 -430032 -431959 -424282 -426514
6782 -426514 -442027 -442886 -427932 -422505 -420052 -426413 -427879 -420598 -424734 -428053 -433933 -442121 -435994 -420322
6768 -420322 -406068 -404813 -403175 -413382 -425649 -430940 -434236 -421500 -419018 -416434 -430896 -443960 -437924
6755 -437924 -445936 -437573 -434674 -445532 -444903 -440715 -438781 -430083 -406133 -404407 -410845 -413316 -385421 -384741
6741 -384741 -408209 -418444 -416426 -413255 -411003 -409261 -409957 -427887 -440725 -430230 -426030 -431300 -430162
6728 -430162 -431259 -438689 -433047 -443199 -441309 -442313 -456700 -443084 -435374 -452576 -449669 -444592 -442730
6715 -442730 -436605 -432655 -439027 -441683 -432053 -427677 -431038 -429120 -440365 -424963 -417037 -418871 -426290 -411050
6701 -411050 -417906 -421460 -416722 -414843 -429836 -432218 -424054 -402080 -407338 -417556 -417864 -418245 -423068 -423447
6687 -423447 -412922 -404013 -406714 -406956 -412695 -425188 -414363 -426043 -438893 -435546 -426101 -415343 -410252
6674 -410252 -408462 -405071 -389821 -387524 -412954 -424379 -425129 -422385 -416888 -429872 -434090 -446232 -444189
6661 -444189 -437950 -432365 -420037 -431784 -430731 -410271 -407544 -423416 -421855 -429030 -432257 -425171 -425617 -425796
6647 -425796 -418650 -404432 -401076 -410368 -412496 -420474 -432653 -425160 -410217 -403711 -403332 -406477 -421244 -419806
6633 -419806 -415807 -417732 -413221 -427373 -441972 -444156 -424248 -412812 -409565 -413877 -405816 -415638 -425617
6620 -425617 -421384 -404348 -395771 -402718 -413005 -425987 -423143 -426741 -432336 -424211 -413913 -423331 -429111
6607 -429111 -432792 -435869 -444517 -430123 -421078 -413859 -427987 -432038 -423596 -420903 -414363 -408048 -410534 -417434
6593 -417434 -409805 -404070 -405915 -401757 -409606 -435389 -434274 -411780 -427172 -426004 -416877 -404831 -401156
6580 -401156 -397154 -397419 -417541 -425646 -421887 -429923 -441806 -442435 -438764 -430643 -438933 -447756 -439912 -427580
6566 -427580 -411101 -396988 -395332 -401465 -412967 -423253 -425499 -415627 -417774 -414385 -418447 -419858 -406350
6553 -406350 -406894 -397439 -396886 -401444 -394550 -394409 -403404 -412192 -426489 -426550 -426957 -426476 -434941 -430945 -420362 -407076
6537 -407076 -376429 -373865 -397690 -392306 -408838 -420785 -417153 -403290 -413537 -396701 -391489 -397531 -396958
6524 -396958 -395333 -402691 -415015 -416868 -406330 -409246 -424097 -428187 -405556 -385461 -383921 -389327 -390991
6511 -390991 -398800 -392745 -388393 -404671 -418683 -409631 -410024 -401513 -402712 -419280 -422556 -406928 -388422
6498 -388422 -391239 -402013 -405418 -409821 -412612 -400762 -388738 -389977 -397479 -405548 -415402 -415709 -409034 -411696
6484 -411696 -405387 -392456 -389182 -376238 -376995 -396735 -408425 -408845 -397870 -399685 -402499 -409370 -403391 -411040
6470 -411040 -423156 -413911 -401854 -396102 -393607 -389163 -395327 -399169 -380529 -383596 -389789 -382356 -380494 -385816
6456 -385816 -387456 -386135 -389128 -397411 -390560 -403940 -424624 -419825 -397155 -395715 -404082 -421815 -406087
6443 -406087 -397414 -402103 -399552 -408245 -402578 -403011 -410668 -400996 -398608 -411486 -415252 -420884 -422944 -408075
6429 -408075 -403989 -406641 -409925 -403642 -393472 -392855 -396003 -385307 -383418 -374798 -364413 -382080 -402215
6416 -402215 -408787 -397937 -386468 -388615 -384277 -399040 -408296 -406330 -410952 -408890 -393652 -384427 -394204
6403 -394204 -404492 -406328 -398256 -386120 -386373 -406266 -413849 -421857 -442200 -435819 -427407 -428178 -415611 -400463
6389 -400463 -402289 -410228 -414213 -413940 -430222 -439735 -439661 -439577 -424565 -421183 -413502 -396457 -396124 -410680 -417230
6374 -417230 -411372 -395917 -396936 -400475 -407388 -411127 -401035 -388287 -392466 -411777 -427957 -425291 -411928
6361 -411928 -403084 -399817 -407180 -397053 -381844 -374117 -381247 -387949 -396849 -397403 -400185 -402805 -390113 -386643
6347 -386643 -384702 -387244 -396687 -388339 -388858 -389399 -393587 -402965 -405006 -392664 -392813 -404864 -411661 -410755 -396124
6332 -396124 -388295 -377035 -371129 -376018 -388169 -392519 -381118 -381377 -390575 -394787 -392806 -384373 -375505 -367585
6318 -367585 -375268 -385692 -376621 -371560 -370124 -372547 -376262 -380879 -380703 -381101 -374329 -377220 -374001 -385954
6304 -385954 -393229 -394995 -389151 -388400 -405801 -411574 -405473 -389312 -371782 -373163 -375538 -375838 -374477 -374603
6290 -374603 -374855 -377962 -378035 -389360 -395310 -400028 -416529 -433879 -428083 -403236 -404033 -400577 -413880 -427091
6276 -427091 -406602 -388490 -386429 -401178 -399325 -401101 -403302 -402152 -395732 -411499 -413864 -422285 -408443
6263 -408443 -383422 -375373 -374095 -377782 -392546 -386462 -382444 -373945 -367677 -372278 -378704 -392795 -389935 -388387
6249 -388387 -400303 -398095 -396751 -394994 -411657 -411842 -394166 -398059 -411934 -393176 -401580 -399460 -377785
6236 -377785 -359524 -364993 -374238 -366707 -374168 -368417 -357266 -375632 -399496 -403904 -413456 -391458 -371129
6223 -371129 -364337 -368329 -377659 -385146 -373224 -369583 -379618 -395404 -404510 -402466 -397656 -397742 -396569 -392233
6209 -392233 -398986 -399045 -400971 -402407 -402090 -404301 -397471 -392925 -390657 -396462 -386484 -389231 -392441 -391356 -390653
6194 -390653 -385594 -389137 -377346 -383922 -385800 -388617 -394804 -407536 -401248 -399213 -396089 -401365 -405075 -399647
6180 -399647 -405311 -414305 -411742 -419854 -408510 -401200 -389432 -383599 -392367 -403500 -400117 -389148 -384707
6167 -384707 -395264 -397638 -400307 -395615 -406724 -405713 -403627 -391759 -377419 -379392 -381853 -385414 -374195
6154 -374195 -367213 -362269 -374078 -362454 -364273 -365165 -368249 -385292 -381398 -380456 -394294 -392306 -389198 -374142
6140 -374142 -371925 -380522 -372552 -369008 -369127 -371474 -366222 -370984 -380833 -367509 -365277 -379477 -381574 -374120
6126 -374120 -361906 -370161 -367795 -378799 -382987 -389896 -402342 -410428 -402233 -392747 -394660 -395781 -389895 -390796
6112 -390796 -388335 -380774 -377911 -388305 -389798 -390702 -385222 -396429 -404082 -400492 -387634 -379237 -373304 -362539
6098 -362539 -354912 -355448 -358126 -365485 -378268 -379199 -371573 -378383 -387587 -382936 -378202 -372157 -377672 -386556 -377744
6083 -377744 -357465 -363868 -373334 -380563 -381426 -394761 -404117 -401595 -396903 -404139 -404985 -388288 -385981 -391565
6069 -391565 -394234 -395851 -390591 -373809 -383961 -395472 -416360 -431897 -428757 -412329 -394153 -368773
6057 -368773 -367489 -383077 -394795 -383372 -373754 -375699 -377314 -393320 -382474 -366300 -348193 -345406 -368102
6044 -368102 -389846 -397766 -379274 -362352 -362970 -379816 -366131 -352429 -352335 -368436 -376275 -368979 -368644 -375491
6030 -375491 -374724 -377038 -375620 -371497 -373775 -352384 -335297 -343268 -358859 -356843 -372294 -379241 -375091 -383564
6016 -383564 -376231 -363057 -366562 -369417 -370926 -366750 -363160 -348828 -339513 -343884 -365654 -376590 -384724
6003 -384724 -384336 -375890 -386191 -390413 -377705 -368262 -392784 -397487 -393989 -379435 -361601 -369207 -376546
5990 -376546 -363530 -380821 -385015 -363318 -348129 -347134 -357091 -365454 -365509 -368494 -365383 -361023 -354561 -355066
5976 -355066 -370237 -372604 -379236 -384698 -389478 -388562 -394740 -386742 -381735 -389139 -393599 -380315 -361608 -359060
5962 -359060 -372262 -365707 -370071 -367439 -368843 -378143 -375167 -384859 -387920 -383548 -380880 -377733 -371697 -354648
5948 -354648 -360334 -384236 -385650 -383915 -394020 -396394 -392913 -397871 -386029 -363998 -358260 -362666 -356783
5935 -356783 -356635 -370949 -396097 -381168 -377897 -380623 -383768 -388413 -387896 -388217 -386674 -378333 -375045 -365079
5921 -365079 -353820 -355808 -342561 -345686 -341893 -356341 -370034 -378609 -372807 -357972 -353277 -362007 -363188
5908 -363188 -359854 -355223 -352283 -362559 -354096 -353192 -360933 -366310 -365122 -357081 -353337 -368858 -383017 -387147
5894 -387147 -385637 -381874 -385022 -375287 -369812 -360436 -355106 -352400 -362951 -382143 -391768 -393812 -392400 -378565
5880 -378565 -365375 -371599 -372227 -367507 -359785 -344771 -345686 -365876 -380022 -383261 -367622 -373366 -375392 -373065
5866 -373065 -388948 -386200 -369515 -370387 -363755 -352951 -347380 -365827 -378450 -371731 -382580 -386340 -383045
5853 -383045 -373909 -370274 -357211 -361249 -360302 -352451 -349552 -352666 -365914 -372124 -372850 -377499 -381173 -372440
5839 -372440 -353185 -350054 -360688 -365079 -363048 -361965 -362182 -367764 -364858 -366620 -367746 -364336 -367304 -364527
5825 -364527 -351781 -343152 -346601 -359813 -370339 -376944 -371822 -365418 -359569 -370054 -377868 -373571 -367602
5812 -367602 -368282 -362716 -355659 -358378 -367550 -346546 -348292 -347556 -338951 -331411 -356404 -368466 -366116 -363333
5798 -363333 -359861 -361839 -362579 -365667 -350679 -352111 -364430 -366114 -354762 -358437 -350591 -355475 -356590 -356733
5784 -356733 -364969 -373123 -368294 -361598 -364131 -363121 -356733 -351517 -363801 -372869 -386485 -377028 -366702 -367507
5770 -367507 -356148 -347708 -352906 -346413 -333730 -334864 -345490 -357786 -362705 -352782 -343423 -339465 -345307
5757 -345307 -336552 -342061 -354827 -383914 -389649 -378618 -370846 -359891 -358156 -347023 -352972 -358031 -355258
5744 -355258 -365775 -373196 -378460 -370043 -353579 -362729 -365422 -364402 -365608 -355332 -356512 -350790 -361424
5731 -361424 -364683 -368505 -368563 -362375 -351008 -341599 -348342 -347859 -349373 -346285 -348652 -352145 -375693 -391817
5717 -391817 -381140 -363845 -363264 -349541 -345638 -341520 -348418 -349498 -345175 -343636 -350580 -355115 -352958 -350121
5703 -350121 -359586 -370581 -373238 -380287 -366632 -353343 -366253 -358446 -359205 -371693 -380378 -377698 -379064
5690 -379064 -378485 -363028 -359756 -357712 -349729 -356880 -365179 -371375 -367343 -366170 -356763 -344650 -358303 -354843
5676 -354843 -333539 -336099 -343584 -344258 -351031 -359058 -371164 -389475 -388584 -370332 -361672 -369172 -354734 -344437
5662 -344437 -356383 -359344 -356311 -352211 -352649 -364874 -370747 -375745 -382269 -377373 -366923 -356096 -344019
5649 -344019 -345829 -355215 -359321 -353653 -360760 -356791 -346030 -337405 -326174 -322625 -333105 -346798 -346552 -348786
5635 -348786 -370358 -359351 -362392 -370310 -365251 -362715 -357172 -358922 -338170 -333973 -344291 -351815 -354070
5622 -354070 -346906 -346530 -354426 -370267 -374023 -357961 -351864 -345475 -342182 -349242 -357311 -357740 -361826 -353644
5608 -353644 -349832 -348205 -353287 -357446 -343519 -329274 -341176 -352224 -354885 -364644 -359268 -342499 -337137
5595 -337137 -326579 -320163 -313529 -323197 -332180 -340166 -345248 -350882 -346406 -350476 -346802 -352780 -359634 -354370
5581 -354370 -341871 -341319 -342666 -348884 -360057 -364376 -338464 -339828 -350212 -348267 -346442 -336081 -348245
5568 -348245 -359468 -354709 -357674 -376561 -372048 -364679 -375430 -372588 -360022 -354050 -361701 -359693 -350197
5555 -350197 -343827 -344057 -355574 -358292 -354170 -343572 -348862 -338792 -324921 -328265 -325251 -318814 -323969 -324675
5541 -324675 -332602 -343732 -349226 -337818 -341304 -341308 -347086 -351407 -347174 -347234 -354961 -367904 -357274 -344043
5527 -344043 -363793 -358976 -363715 -386012 -379105 -371599 -366160 -348134 -345516 -335109 -337655 -344365 -344294 -346922
5513 -346922 -350749 -351652 -351987 -350162 -335730 -321588 -330097 -340852 -347845 -345674 -344693 -346140 -350258 -345204
5499 -345204 -342094 -345086 -338912 -327662 -331748 -347166 -351425 -360708 -355933 -348824 -357244 -358355 -349891 -346100
5485 -346100 -336232 -339024 -345390 -340725 -334904 -335099 -351584 -356850 -353542 -331852 -328799 -338360 -342275 -357578
5471 -357578 -351461 -340297 -349648 -341860 -345575 -346245 -349404 -341640 -321330 -318765 -332197 -331183 -337507 -345400
5457 -345400 -355560 -354240 -362160 -368781 -347640 -329909 -335839 -329300 -324068 -316116 -317262 -330664 -352861
5444 -352861 -352442 -338678 -336103 -345252 -356415 -352465 -330121 -331246 -339952 -336081 -332994 -337609 -351188 -354302
5430 -354302 -343865 -353497 -347692 -350599 -347076 -340724 -339910 -353068 -351505 -338423 -322084 -324360 -338957
5417 -338957 -357144 -358332 -355254 -343572 -340505 -341573 -342627 -345868 -351517 -352043 -335398 -329740 -330858 -337248
5403 -337248 -351453 -345273 -350807 -353507 -343686 -322791 -319560 -319351 -312263 -327799 -349362 -343412 -340253 -350730
5389 -350730 -339401 -325194 -323801 -326535 -334496 -345793 -345074 -344883 -346250 -351244 -353424 -366939 -358902 -348411
5375 -348411 -339446 -322773 -330294 -339559 -348455 -349281 -339247 -331403 -325239 -322098 -344813 -361085 -362471 -357851
5361 -357851 -351207 -345477 -350867 -348236 -344632 -350962 -364738 -359108 -342064 -330772 -341261 -347972 -349985
5348 -349985 -346530 -355900 -347113 -333852 -332460 -323744 -329076 -349514 -356701 -362184 -362275 -371122 -367968 -358569
5334 -358569 -358869 -372245 -360536 -340430 -328248 -331234 -341625 -348446 -344133 -348738 -347016 -354323 -346943
5321 -346943 -323273 -324658 -331139 -336662 -338572 -343302 -348449 -358511 -367829 -363438 -350377 -342871 -343292 -351444
5307 -351444 -355567 -356990 -343062 -329945 -342089 -359438 -351455 -335239 -327766 -321288 -331836 -347082 -339944
5294 -339944 -350201 -368607 -364249 -354108 -344324 -335835 -337651 -339707 -336229 -335935 -325672 -311305 -323278
5281 -323278 -336903 -344199 -339325 -325322 -316470 -329124 -328115 -330259 -336908 -337324 -327220 -338011 -339821
5268 -339821 -336679 -330082 -332632 -344247 -349054 -340146 -338823 -344772 -340047 -333456 -314400 -295051 -303388 -326753
5254 -326753 -333767 -325427 -323881 -323862 -318575 -299817 -304750 -322578 -333499 -334745 -334716 -339504 -340013 -345477 -338736
5239 -338736 -326756 -320065 -318556 -313170 -332808 -353316 -352034 -346829 -341807 -322699 -315070 -322697 -319828
5226 -319828 -326137 -322522 -318289 -321932 -331823 -346502 -352110 -346476 -335663 -314305 -324850 -337548 -336517
5213 -336517 -327214 -341132 -347392 -329414 -311248 -310956 -316362 -331432 -338206 -359659 -360777 -357090 -352195
5200 -352195 -341497 -336534 -329598 -320121 -327254 -335779 -330212 -317573 -315043 -319729 -328663 -337446 -349365 -353903
5186 -353903 -354871 -347737 -339482 -344604 -339269 -325334 -309090 -304390 -318729 -332116 -336219 -345171 -357187
5173 -357187 -339877 -324452 -337225 -345913 -351136 -354611 -359785 -354521 -348995 -333375 -331436 -325955 -314365
5160 -314365 -317496 -319197 -317578 -324100 -333107 -321782 -316546 -326015 -329303 -327464 -333207 -337418 -347127 -338333
5146 -338333 -332325 -324081 -316739 -329418 -327797 -330729 -334161 -333990 -331456 -345753 -359129 -354358 -345592 -347776
5132 -347776 -342845 -350445 -352254 -353827 -360763 -361221 -345611 -351998 -364174 -365567 -357110 -353658 -346657 -329892
5118 -329892 -321913 -325294 -337896 -343230 -335622 -327825 -330486 -328910 -320091 -323067 -313233 -300316 -310572 -334451
5104 -334451 -336121 -334920 -335064 -331090 -330989 -344573 -360361 -370821 -371186 -341410 -327118 -325138 -323825 -331736
5090 -331736 -335426 -324149 -315537 -309825 -323416 -344268 -350279 -332971 -328789 -321277 -320629 -317417 -311602 -334084
5076 -334084 -342539 -334286 -321834 -316185 -309454 -306569 -308861 -326532 -341871 -351482 -335709 -311996 -312721
5063 -312721 -308823 -306053 -322283 -332403 -344629 -335104 -320742 -319296 -314134 -314134 -310903 -316958 -311490 -319361
5049 -319361 -327356 -320181 -305310 -301671 -304188 -304504 -299216 -320061 -337102 -345176 -348827 -336771 -324795
5036 -324795 -341061 -353450 -341592 -333957 -335171 -350333 -347466 -343826 -361672 -357323 -346989 -333217 -329626
5023 -329626 -341929 -349027 -337263 -316223 -314877 -325387 -323928 -318939 -320523 -342189 -361221 -361286 -360343 -352530
5009 -352530 -340050 -334393 -321148 -323279 -312228 -298945 -309970 -320861 -318540 -320463 -318084 -317775 -315837
4996 -315837 -315322 -312975 -310888 -311858 -314542 -318779 -326330 -343428 -347441 -326442 -321127 -332750 -331821 -331674 -322404
4981 -322404 -313929 -314007 -313659 -301126 -303571 -302566 -296351 -306052 -315248 -319536 -305550 -305637 -316286 -328695 -329045
4966 -329045 -342529 -349628 -332586 -331850 -342136 -345627 -335342 -318120 -321664 -325772 -318730 -320822 -323518
4953 -323518 -319467 -314385 -314559 -328318 -333670 -335719 -335948 -329824 -311032 -301474 -307802 -310261 -331787 -347736
4939 -347736 -351026 -329939 -315499 -318123 -332483 -342854 -331282 -319527 -323303 -335298 -358235 -352708
4927 -352708 -326421 -317655 -318409 -314292 -321797 -331737 -324946 -324996 -319334 -318849 -322142 -331076 -332409 -330206 -332450
4912 -332450 -346536 -343027 -344376 -353552 -351317 -348176 -337474 -328730 -331422 -334931 -325251 -320774 -314130 -321291
4898 -321291 -334769 -341624 -335777 -331009 -328185 -330549 -329019 -320061 -320820 -338144 -339117 -327448 -323555 -320119
4884 -320119 -325902 -330862 -314875 -304934 -317470 -329624 -317365 -306777 -315620 -319576 -327518 -323687 -324130
4871 -324130 -323905 -332581 -337002 -336596 -346589 -336820 -337462 -330964 -325217 -327107 -324252 -328388 -324058 -327441 -328183
4856 -328183 -325106 -326314 -325198 -316241 -305998 -298713 -293384 -291152 -312928 -327008 -335722 -337926 -335758 -319006
4842 -319006 -317100 -310663 -297462 -294223 -307322 -318527 -325434 -332350 -337961 -334625 -329741 -327062 -333073 -343081
4828 -343081 -350164 -343335 -341465 -336212 -330702 -326271 -311266 -306551 -309682 -295176 -285456 -291957 -297344 -304678
4814 -304678 -302194 -307395 -320363 -313221 -319893 -323311 -323740 -323185 -312222 -301490 -315106 -324448 -313652 -301904
4800 -301904 -314653 -308414 -319633 -336142 -338006 -330113 -323213 -322455 -320045 -314193 -332713 -342372 -340673 -336470
4786 -336470 -330188 -325173 -320216 -330886 -338704 -339926 -323509 -306637 -312224 -316604 -317488 -309753 -312457 -325409
4772 -325409 -330414 -315757 -318596 -310848 -306196 -315204 -315786 -322192 -324103 -313483 -304138 -303363 -304815 -308540
4758 -308540 -309164 -297058 -289849 -303833 -327960 -327931 -316487 -305439 -317481 -312981 -303838 -291431 -285920
4745 -285920 -280525 -286439 -289529 -298109 -311220 -319758 -327490 -326245 -320376 -323824 -322520 -312202 -310039 -314145
4731 -314145 -315748 -314050 -314077 -314820 -321556 -314362 -309045 -310095 -302049 -319190 -331119 -330383 -337578 -329961 -314546
4716 -314546 -313124 -315833 -315090 -320735 -307974 -287869 -289564 -298959 -299253 -299852 -295158 -297642 -294750 -282289
4702 -282289 -293109 -306663 -317470 -316690 -313063 -318289 -297896 -284137 -283459 -299261 -305098 -304318 -295672 -306865
4688 -306865 -305653 -312047 -311426 -296286 -289593 -306293 -298804 -277911 -280520 -287896 -297960 -304998 -311473 -326188
4674 -326188 -336121 -329405 -320241 -323090 -305585 -287676 -292814 -305081 -315480 -326716 -331370 -323041 -305632
4661 -305632 -307434 -297091 -295486 -318906 -319091 -309454 -323167 -324541 -327585 -337485 -331637 -336723 -337857 -324586
4647 -324586 -315584 -315170 -323206 -315483 -320556 -318797 -322994 -317871 -305742 -317836 -323499 -316941 -314296 -314847
4633 -314847 -324221 -312821 -315061 -315783 -312848 -308916 -305839 -321228 -320287 -329143 -323892 -325860 -341763 -346377
4619 -346377 -327495 -322973 -315777 -305835 -322535 -314772 -301952 -307782 -302209 -302559 -308544 -303844 -303275 -305977
4605 -305977 -297016 -299253 -307873 -312344 -299446 -290524 -298974 -306365 -309562 -319924 -319143 -317564 -322609 -318666
4591 -318666 -309548 -311351 -308899 -309874 -309511 -319255 -310804 -303405 -317480 -323315 -330948 -336940 -334668 -324672 -306800
4576 -306800 -300172 -301102 -284247 -278676 -281033 -279464 -287271 -294105 -303884 -310129 -294240 -276048 -281354 -287774
4562 -287774 -294145 -285377 -293091 -306819 -303617 -303712 -293493 -297318 -306131 -303211 -304812 -306618 -310736 -307777
4548 -307777 -305549 -316742 -321283 -315379 -307488 -313392 -310199 -305544 -308831 -303528 -311349 -322957 -320118 -320740
4534 -320740 -326327 -321778 -310362 -298289 -293535 -298645 -301617 -292622 -292304 -289878 -306494 -307749 -306019 -295483
4520 -295483 -296378 -308542 -315810 -312130 -317921 -310751 -305465 -307481 -310483 -308647 -300653 -299428 -291805 -295986
4506 -295986 -295396 -291778 -302893 -300448 -304067 -295787 -288367 -287884 -296166 -301402 -306833 -301840 -297024 -292346 -281259
4491 -281259 -291302 -297660 -305376 -312581 -321784 -313884 -308598 -315488 -313845 -309189 -308676 -315620 -322735 -322806 -313685
4476 -313685 -295834 -302389 -310768 -317551 -311221 -305414 -304207 -298920 -297297 -300509 -304159 -301704 -300266 -300255 -283542
4461 -283542 -282125 -303427 -311778 -313942 -318652 -320387 -321265 -304850 -308242 -308223 -301581 -302497 -296198 -296879 -290740
4446 -290740 -285507 -283527 -280909 -283093 -275703 -283486 -296876 -302813 -298474 -300475 -298792 -307924 -310049 -298776
4432 -298776 -281923 -282326 -288637 -296123 -307530 -313865 -314184 -308918 -325216 -339239 -339694 -318420 -321752 -321899
4418 -321899 -311546 -287577 -282560 -295889 -293952 -296596 -317266 -328966 -315949 -304027 -299371 -296121 -292215
4405 -292215 -302220 -314575 -309469 -297652 -290241 -283520 -297606 -307127 -311184 -304185 -288836 -289286 -304837
4392 -304837 -313165 -313746 -308078 -308725 -284142 -282697 -282894 -289244 -299727 -311402 -316855 -305490 -298248 -295661
4378 -295661 -301896 -320020 -335027 -339975 -323744 -309136 -310803 -321401 -304555 -298915 -308252 -307408 -301476
4365 -301476 -306312 -300734 -301327 -301138 -290345 -297504 -312489 -320415 -313796 -323524 -308958 -294525 -301583 -323019
4351 -323019 -319886 -303715 -299258 -295015 -300567 -299376 -294799 -295802 -289320 -290710 -302806 -308919 -316804 -325505
4337 -325505 -305810 -289444 -288509 -293877 -279417 -273415 -270589 -285502 -305850 -314123 -311134 -310726 -302188 -292692
4323 -292692 -289555 -291400 -291857 -295591 -304313 -312133 -316983 -313659 -300649 -313691 -333344 -324022 -298270 -274869
4309 -274869 -274490 -283182 -291390 -297856 -291549 -284818 -289310 -304395 -307826 -279268 -278204 -284964 -297042 -302368
4295 -302368 -300238 -293001 -302967 -311473 -311167 -289649 -292091 -302864 -310760 -305682 -291843 -292367 -305000 -300716
4281 -300716 -302112 -299376 -298303 -302990 -306921 -293459 -280803 -268066 -260997 -279683 -303071 -324774 -324138
4268 -324138 -309185 -317659 -313348 -305087 -298187 -294397 -299854 -290617 -287854 -284819 -286483 -301124 -312079 -322113
4254 -322113 -329191 -327570 -302234 -286574 -288844 -289949 -299991 -313535 -327496 -318166 -297988 -298176 -300372
4241 -300372 -295838 -292623 -300984 -305662 -311153 -316491 -309254 -304696 -313858 -320027 -315932 -304129 -303854 -296969
4227 -296969 -288611 -290535 -290632 -289643 -295047 -309665 -315166 -311068 -304190 -305785 -309669 -307196 -301663 -285680 -279943
4212 -279943 -275080 -271690 -275741 -277792 -291408 -294665 -290597 -289179 -297987 -296155 -294455 -299258 -299844 -283710
4198 -283710 -284823 -278149 -280671 -280874 -274327 -272083 -275959 -285473 -278649 -275186 -272992 -277678 -285853 -302075
4184 -302075 -293705 -285087 -296297 -310880 -302177 -318064 -316927 -308399 -299968 -300602 -295228 -296143 -296705 -288832
4170 -288832 -279102 -275154 -272328 -275923 -288406 -282981 -284449 -297990 -287818 -276438 -286041 -302582 -279735
4157 -279735 -253593 -269813 -280752 -284748 -298391 -312948 -310806 -308785 -306354 -294886 -296965 -302906 -301715
4144 -301715 -297526 -291568 -281831 -289631 -292985 -296010 -286706 -274884 -285918 -295433 -300497 -299483 -294341 -296367
4130 -296367 -292397 -295992 -284138 -277200 -293690 -289687 -285280 -293889 -286970 -282776 -269227 -271197 -270929 -272133
4116 -272133 -265387 -265826 -282796 -292396 -290933 -287425 -287685 -288637 -292560 -302262 -300190 -289268 -297752 -317970
4102 -317970 -322983 -301507 -277891 -268475 -280170 -284555 -281826 -292071 -298959 -301628 -297547 -280752 -279974
4089 -279974 -294830 -309438 -309329 -310922 -299602 -285762 -272475 -269772 -268176 -270790 -282743 -274791 -276841
4076 -276841 -280209 -288227 -295810 -300712 -284589 -279064 -270912 -262944 -260391 -276541 -278929 -274107 -271500 -279828
4062 -279828 -277052 -273007 -274641 -291945 -296769 -300090 -294644 -286869 -285940 -270839 -274836 -279505 -270705 -271365
4048 -271365 -279079 -294225 -296990 -285268 -276105 -288653 -303839 -306704 -308081 -299349 -294509 -293564 -296193 -273540
4034 -273540 -259828 -263817 -275313 -298385 -289421 -279467 -285890 -286368 -287933 -286112 -292423 -289043 -279725 -277396
4020 -277396 -288100 -303900 -310512 -299035 -298651 -298791 -294240 -305457 -303941 -291641 -292571 -298592 -297922 -288931
4006 -288931 -284745 -289485 -288143 -281294 -282725 -274738 -271080 -278900 -281746 -282193 -278192 -274859 -273669 -283607 -289084
3991 -289084 -289195 -293621 -293668 -296808 -299142 -289240 -299374 -309903 -301111 -284674 -273290 -259068 -252526 -261015
3977 -261015 -274555 -296108 -313900 -306034 -296043 -288447 -301799 -312034 -295496 -289988 -280084 -281447 -287918
3964 -287918 -288098 -289643 -276401 -270195 -288324 -292114 -276796 -271264 -270387 -272152 -289646 -303155 -304669 -296531
3950 -296531 -299844 -308660 -302308 -281691 -281581 -284743 -283763 -272908 -267159 -268285 -271972 -283911 -286528 -291061
3936 -291061 -289227 -296628 -300018 -299018 -276034 -263927 -282895 -290819 -290228 -281425 -281401 -278815 -275996 -285281
3922 -285281 -298382 -290527 -263171 -255230 -277679 -291118 -289915 -283775 -282590 -290884 -290646 -287603 -277056
$$ [...]
##END NTUPLES=NMR SPECTRUM
##END=
