##TITLE=Analysis number 328103
Compound Code btb 09402
Book Reference a
Project Code adrs 
Chemist Name stores
##JCAMPDX= 6.0         $$ Bruker NMR JCAMP-DX V2.0
##DATA TYPE= NMR SPECTRUM
##DATA CLASS= NTUPLES
##ORIGIN= Bruker BioSpin GmbH
##OWNER= nmr
$$ XWIN-NMR		Version 3.5
$$ Wed May  2 13:11:55 2007 GMT Daylight Time (UT+1h)  MAYBRIDGE\nmr@NMR_250MHZ
##.OBSERVE FREQUENCY= 250.131544655141
##.OBSERVE NUCLEUS= ^1H
##.ACQUISITION MODE= SIMULTANEOUS (DQD)
##.ACQUISITION SCHEME= undefined
##.AVERAGES= 16
##.DIGITISER RES= 18
##SPECTROMETER/DATA SYSTEM= dpx250
##.PULSE SEQUENCE= zg30
##.SOLVENT NAME= CDCl3
##.SHIFT REFERENCE= (INTERNAL, CDCl3, 0, 16.522)
##AUDIT TRAIL= $$ (NUMBER, WHEN, WHO, WHERE, WHAT)
$$ ##TITLE= Audit trail, XWIN-NMR		Version 3.5
$$ ##JCAMPDX= 5.01
$$ ##ORIGIN= Bruker BioSpin GmbH
$$ ##OWNER= nmr
$$ C:\u/data/dgb/nmr/ADRS/270/pdata/1/auditp.txt
$$ ##AUDIT TRAIL=  $$ (NUMBER, WHEN, WHO, WHERE, WHAT)
(   1,<2007-05-02 13:11:30.89 +100>,<MAYBRIDGE\nmr>,<NMR_250MHZ>,
      <created by zg, POWCHK disabled, PULCHK disabled
       configuration hash MD5:
       76 6E 9A 78 1E 09 19 81 EC 84 63 8F B0 6A 59 2D
       data hash MD5: 64K
       F4 ED CC BD 11 8F AF 92 F3 C4 F4 6F A0 F1 3A 0C>)
(   2,<2007-05-02 13:11:45.14 +100>,<MAYBRIDGE\nmr>,<NMR_250MHZ>,
      <Start of raw data processing
       ef LB = 0.3 FT_mod = 6 PKNL = 1 SI = 32K 
       data hash MD5: 32K
       F5 C1 73 14 63 9D 2F 8F 51 16 DB 6D DF B1 A8 6A>)
(   3,<2007-05-02 13:11:46.91 +100>,<MAYBRIDGE\nmr>,<NMR_250MHZ>,
      <apk 
       data hash MD5: 32K
       27 7A C1 B9 32 AA E4 C6 DF 2B 88 20 04 85 94 2B>)
(   4,<2007-05-02 13:11:47.67 +100>,<MAYBRIDGE\nmr>,<NMR_250MHZ>,
      <abs ABSG = 5 
       data hash MD5: 32K
       26 78 CF 30 AD 14 0B D1 0D 2F 73 C2 0F 43 A1 F2>)
$$ ##END=
$$ 
$$ hash MD5
$$ 8C 85 0C 2B A3 9C 28 5F A8 74 9B 42 16 5C 27 D6
##$RELAX= 
##$RELAX= 
##$RELAX= 
##$RELAX= 
##$RELAX= 
##$RELAX= 
##$RELAX= 
$$ Bruker specific parameters
$$ --------------------------
##$DU= <C:\u>
##$EXPNO= 270
##$NAME= <ADRS>
##$PROCNO= 1
##$TYPE= <nmr>
##$USER= <dgb>
##$AMP= (0..31)
100 100 100 100 100 100 100 100 100 100 100 100 100 100 100 100 100 100 
100 100 100 100 100 100 100 100 100 100 100 100 100 100 
##$AQSEQ= 0
##$AQ_mod= 3
##$AUNM= <au_zg>
##$AUTOPOS= <23 >
##$BF1= 250.13
##$BF2= 250.13
##$BF3= 250.13
##$BF4= 250.13
##$BF5= 500.13
##$BF6= 500.13
##$BF7= 500.13
##$BF8= 500.13
##$BYTORDA= 1
##$CFDGTYP= 0
##$CFRGTYP= 5
##$CHEMSTR= <none>
##$CNST= (0..31)
1 1 145 1 1 1 1 1 1 1 1 1 1 1 1 1 1 1 1 1 1 1 1 1 1 1 1 1 1 1 1 1 
##$CPDPRG= <>
##$CPDPRG1= <>
##$CPDPRG2= <>
##$CPDPRG3= <>
##$CPDPRG4= <mlev>
##$CPDPRG5= <mlev>
##$CPDPRG6= <mlev>
##$CPDPRG7= <mlev>
##$CPDPRG8= <mlev>
##$CPDPRGB= <>
##$CPDPRGT= <>
##$D= (0..31)
0 1 0 0 0 0 0 0 0 0.06 0 0 0 0 0 0 0.0002 0 0 0 0 0 0 0 0 0 0 0 0 0 0 
0 
##$DATE= 1178107889
##$DBL= (0..7)
120 120 120 120 120 120 120 120 
##$DBP= (0..7)
150 150 150 150 150 150 150 150 
##$DBP07= 0
##$DBPNAM0= <>
##$DBPNAM1= <>
$$ [...]
##$SUBNAM6= <"">
##$SUBNAM7= <"">
##$SUBNAM8= <"">
##$SUBNAM9= <"">
##$SW= 20.6930455092707
##$SWIBOX= (0..15)
0 0 3 0 0 0 0 0 0 0 0 0 0 0 0 0 
##$SW_h= 5175.983436853
##$TD= 65536
##$TD0= 1
##$TE= 683.16
##$TE2= 300
##$TE3= 300
##$TEG= 300
##$TL= (0..7)
0 120 120 120 120 120 120 120 
##$TP= (0..7)
150 150 150 150 150 150 150 150 
##$TP07= 0
##$TPNAME0= <>
##$TPNAME1= <>
##$TPNAME2= <>
##$TPNAME3= <>
##$TPNAME4= <>
##$TPNAME5= <>
##$TPNAME6= <>
##$TPNAME7= <>
##$TPOAL= (0..7)
0.5 0.5 0.5 0.5 0.5 0.5 0.5 0.5 
##$TPOFFS= (0..7)
0 0 0 0 0 0 0 0 
##$TUNHIN= 0
##$TUNHOUT= 0
##$TUNXOUT= 0
##$USERA1= <user>
##$USERA2= <user>
##$USERA3= <user>
##$USERA4= <user>
##$USERA5= <user>
##$V9= 5
##$VALIST= <valist>
##$VCLIST= <CCCCCCCCCCCCCCC>
##$VD= 0
##$VDLIST= <DDDDDDDDDDDDDDD>
##$VPLIST= <PPPPPPPPPPPPPPP>
##$VTLIST= <TTTTTTTTTTTTTTT>
##$WBST= 1024
##$WBSW= 4
##$XGAIN= (0..3)
0 0 0 0 
##$XL= 0
##$YL= 0
##$YMAX_a= 522170
##$YMIN_a= -580632
##$ZGOPTNS= <>
##$ZL1= 120
##$ZL2= 120
##$ZL3= 120
##$ZL4= 120
##$ABSF1= 16.522
##$ABSF2= -4.171173
##$ABSG= 5
##$ABSL= 3
##$ALPHA= 0
##$AQORDER= 0
##$ASSFAC= 0
##$ASSFACI= 0
##$ASSFACX= 0
##$ASSWID= 0
##$AUNMP= <proc_1d>
##$AZFE= 0.1
##$AZFW= 0.1
##$BCFW= 0
##$BC_mod= 0
##$BYTORDP= 0
##$COROFFS= 0
##$CY= 12.5
##$DATMOD= 1
##$DC= 0
##$DFILT= <>
##$DTYPP= 0
##$F1P= 14.0000005364418
##$F2P= -0.99999901652339
##$FCOR= 0.5
##$FTSIZE= 32768
##$FT_mod= 6
##$GAMMA= 0
##$GB= 0
##$INTBC= 1
##$INTSCL= 1
##$ISEN= 128
##$LB= 0.3
##$LEV0= 0
##$LPBIN= 0
##$MAXI= 10000
##$MC2= 0
##$MEAN= 0
##$ME_mod= 0
##$MI= 0
##$NCOEF= 0
##$NC_proc= -2
##$NLEV= 6
##$NOISF1= 0
##$NOISF2= 0
##$NSP= 0
##$NTH_PI= 0
##$NZP= 0
##$OFFSET= 16.522
##$PC= 1
##$PHC0= 153.9935
##$PHC1= 5.08579
##$PH_mod= 1
##$PKNL= yes
##$PPARMOD= 0
##$PSCAL= 4
##$PSIGN= 0
##$REVERSE= no
##$SF= 250.13
##$SI= 32768
##$SIGF1= 0
##$SIGF2= 0
##$SINO= 400
##$SIOLD= 32768
##$SREGLST= <1H.CDCl3>
##$SSB= 0
##$STSI= 32768
##$STSR= 0
##$SW_p= 5175.98343685301
##$SYMM= 0
##$S_DEV= 0
##$TDeff= 65536
##$TDoff= 0
##$TI= <Analysis number 999999
Compound Code 99
Book Reference 9
Project Code 9>
##$TILT= no
##$TM1= 0
##$TM2= 0
##$TOPLEV= 0
##$USERP1= <user>
##$USERP2= <user>
##$USERP3= <user>
##$USERP4= <user>
##$USERP5= <user>
##$WDW= 1
##$XDIM= 32768
##$YMAX_p= 356375633
##$YMIN_p= -16713
$$ End of Bruker specific parameters
$$ ---------------------------------
##NTUPLES= NMR SPECTRUM
##VAR_NAME=  FREQUENCY,     SPECTRUM/REAL,   SPECTRUM/IMAG
##SYMBOL=    X,             R,               I
##VAR_TYPE=  INDEPENDENT,   DEPENDENT,       DEPENDENT
##VAR_FORM=  AFFN,          ASDF,            ASDF
##VAR_DIM=   32768,         32768,           32768
##UNITS=     HZ,            ARBITRARY UNITS, ARBITRARY UNITS
##FACTOR=    0.157963299565203, 1,           1
##FIRST=     4132.6476996994, 0,             0
##LAST=      -1043.33573715361, 0,           0
##MIN=       -1043.33573715361, -16713,      0
##MAX=       4132.6476996994, 356375633,     0
$$ Real data points
##PAGE= N=1
##DATA TABLE= (X++(R..R)), XYDATA
$$ [...]
##PAGE= N=2
##DATA TABLE= (X++(I..I)), XYDATA
15604C72926k691n737m961K193j977J01k35J44M613n62j950l667j231j809O472
15589C61629K684K818M268m57J249n03j596k867k619o12L854L632K257P07J031
15574C75475J596j775l054q67k269K976M303K869l302j065L296j844J292J244
15560C78875O73J105P35K917O2k332l89M91l650J64K096j552L777K513j03j314
15544C84068m499l825J073J842K098J64j70K03L93m04j108k064L359N295L031
15529C89456j593k355m552j902M31N991O572j749n301k479m684K003L200n27j909
15514C80602M616n30k753l07N04J47q97Q88P555R07L766j380L03J667K032K093
15498C99213J553l055k310k157j781K295J939J589K519k284l642j324k07j63J4
$$ y = [372926, 370235, 364498, 359537, 361730, 359753, 359854, 359619, 359763, 364376, 363814, 361864, 358197, 356966, 355157, 361629, 364313, 367131, 371399, 370942, 372191, 371688, 370092, 367225, 364606, 363994, 367848, 371480, 373737, 374444, 375475, 377071, 375296, 372242, 371375, 369106, 372082, 376385, 379254, 375952, 374887, 378183, 376339, 377631, 378875, 379548, 380653, 381388, 384305, 384367, 382035, 381646, 382137, 378487, 378651, 380747, 379195, 382972, 385485, 385382, 384068, 379569, 375744, 376817, 378659, 380757, 380921, 380751, 380954, 381347, 380943, 379835, 377771, 381130, 386425, 389456, 387863, 385508, 380956, 379054, 379485, 385476, 392048, 390299, 384998, 382519, 377835, 379838, 383038, 382511, 380602, 385218, 384688, 381935, 381628, 382132, 382279, 381382, 382270, 389825, 390732, 394498, 393118, 393421, 395088, 397120, 399213, 400766, 397711, 395401, 393244, 391463, 393758, 395697, 397286, 399805, 397521, 393879, 392555, 392348, 392185, 392199]
15483C92199R5q58J633L12J290J844M048K632M80j992J851j350K5o24k817K298
15467D01066M743j693m813L46P84k331L786J763m67q83k4K496K53j56j796j888
15451D01186L71j774j952M205N912J71k66r54j696k457J492J13m92M598L857K435
15435D14749l753k506o38q63q75J61L585p80l404m13J702J204J632M405L707K529
15419D20442k720l249N37j489j688K75n17o156k189P139O932M386N39j798K825
15404D23269L445m288n724k290j439N678P102l600l051K782M492K133n073o159
15390D17277O50R05j794j190K688K545O39L424l500l874q0Q98J217r01j467M185
15374D21622J885j192j921n110Q20L640J800j609j123L310N669K422K563O28l700
$$ y = [392199, 392294, 391436, 393069, 393381, 394671, 396515, 400563, 403195, 403675, 401683, 403534, 402184, 402209, 401585, 398768, 401066, 405809, 404116, 399303, 399649, 400433, 398102, 401888, 403651, 403184, 402301, 402277, 404773, 405026, 404870, 403074, 401186, 401557, 399783, 397831, 402036, 407948, 408119, 407853, 406899, 405203, 402746, 404238, 404351, 403859, 408457, 412314, 414749, 410996, 408490, 407852, 406989, 406114, 406275, 409860, 409080, 405676, 405263, 406965, 408169, 409801, 414206, 417913, 420442, 417722, 414473, 415010, 413521, 411833, 412108, 411591, 405435, 403246, 410385, 417317, 421703, 422242, 420444, 423269, 426714, 422426, 416702, 414412, 412973, 418651, 425753, 422153, 419102, 421884, 426376, 428509, 423436, 417277, 417927, 418832, 417038, 415848, 418536, 421081, 421720, 425144, 421644, 417770, 417690, 418588, 419805, 418904, 417437, 421622, 423507, 422315, 420394, 415284, 416104, 419744, 421544, 419935, 418812, 422122, 427791, 430213, 432776, 433404, 429704]
15359D29704L679J693P94m202k206K096l229j31K364k308K012R48j257L545j88
15344D33314q46J968l974j36M266K019J50P19m68k544j721j125j931n67J245k304
15328D28065K570J009j3l062J757M161M726L915k47l481l133l985k507J728K457
15313D33960N127K086j492k752N58m62J317l654M191P292j44P29l32J300K366
15298D50090r99q06k497O58j435K169M470J733k165P8p11k577l576J313J447r07
15282D46285J806K096P83K436J085K554r71O89m04J925j837l478j50L163p57m457
15266D50768o42N296K72l922r1p87J977M365n99K154P2j079k416o3k3p20M08K0
15248D54990L446j179M174l56j092q38J670K597o18j936l452j320K301L088l700
$$ y = [429704, 433383, 435076, 435870, 431668, 429462, 431558, 428329, 428198, 430562, 428254, 430266, 431214, 429957, 433502, 433314, 432468, 434436, 430462, 430326, 434592, 436611, 436761, 437480, 437012, 434468, 432747, 431622, 429691, 429124, 430369, 428065, 430635, 431644, 431631, 428569, 430326, 434487, 439213, 443128, 442881, 439400, 436267, 432282, 429775, 431503, 433960, 439087, 441173, 439681, 436929, 437487, 437025, 438342, 434688, 438879, 446171, 446027, 446756, 446424, 447724, 450090, 449091, 448285, 445788, 446446, 445011, 447180, 451650, 453383, 451218, 451296, 450585, 448008, 444432, 445745, 447192, 446285, 448091, 450187, 450970, 453406, 454491, 457045, 456074, 456763, 456359, 458284, 456447, 452969, 452819, 455982, 455225, 450768, 450126, 455422, 455694, 451772, 451681, 450894, 452871, 457236, 456637, 458791, 458863, 457784, 455368, 455305, 455282, 454562, 454970, 454990, 458436, 457257, 461431, 461075, 459983, 459145, 460815, 463412, 462794, 460858, 457406, 456086, 458387, 461475, 457775]
15233D57775J03L904j931K563j983J209K478m021k02Q06K43J796l13M57l284J88
15217D59788o35K550M34M239K753l459M555j035j174R02j271m788l110J684j901
15202D59532M771M76m284q09L813L570J859O037Q54L288k205r317j276L335M257
15187D73901J786o701k903J343J311o88J274M165L949J581O12K857J611k40k235
15172D81623l009m418n073M9J0254P836j013p89m696j778L002J534J246J514j143
15157D85139M00o12l899K477N654m207j688k92K556Pl484l42J321J186k743L134
15141D84607M988j565j790k235K811O91l773j522J521k152K890L583j056M13L131
15126D90542K564j307K34j811l368k977k900K927j371q45L990M387J255J539l936
$$ y = [457775, 457878, 461782, 459851, 462414, 460431, 461640, 464118, 460097, 459895, 460701, 460944, 462740, 462427, 462884, 459600, 459788, 459153, 461703, 462137, 466376, 469129, 465670, 470225, 469190, 468016, 468918, 467647, 462859, 459749, 461433, 459532, 464303, 464779, 460495, 459686, 463499, 467069, 468928, 474965, 475819, 479107, 476902, 467585, 466309, 469644, 473901, 475687, 468986, 466083, 467426, 468737, 468049, 469323, 473488, 477437, 479018, 479630, 482487, 484098, 483858, 481623, 478614, 474196, 469123, 469172, 479426, 487262, 486249, 485460, 480764, 478986, 481988, 483522, 484768, 486282, 485139, 485539, 484927, 481028, 483505, 489159, 484952, 483264, 482972, 485528, 485535, 482051, 481709, 483030, 484216, 481473, 484607, 489595, 488030, 486240, 484005, 486816, 487507, 483734, 482212, 483733, 481581, 484471, 488054, 486998, 487411, 490542, 493106, 491799, 492033, 490222, 486854, 483877, 480977, 483904, 482533, 481688, 485678, 490065, 491320, 492859, 488923]
15111D88923J690L092J525K067q4k0l876j330l778m036L215O075J135n52l395
15096D90651K903L587J221J641k77Q18k625l010P91M816L259j505m999l02k201
15081D94768K241n80o52J750K043K657j569m57J905K473n04j066K119L153O21
15066E08902k771K6k067l410L908L391j924j779J072O11n305j933R55j09K005
15051E01572K505j931K79L205J443K056l077R77K453k215K20M445J636L384j080
15036E15872k842K997J600k188K81m071j499k322J795L889r14l953m80J235j009
15021E08391K242J436K701n42m928l132N87M568K726j341j774L160J871J316k75
15006E17006K119L521M16q54J699k212n327k955K566N309j336j968R54K998K776
$$ y = [488923, 490613, 493705, 495230, 497297, 497213, 497193, 493317, 491987, 488209, 484173, 487388, 493463, 494598, 494046, 490651, 493554, 497141, 498362, 500003, 499726, 500544, 497919, 494909, 495700, 500516, 503775, 502270, 497271, 496969, 494768, 497009, 496429, 495777, 497527, 499570, 502227, 500658, 500201, 502106, 504579, 504075, 503009, 505128, 508281, 508902, 506131, 506157, 504090, 500680, 504588, 507979, 506055, 504276, 505348, 505959, 500654, 498721, 499676, 499567, 501572, 504077, 502146, 502425, 505630, 507073, 509129, 506052, 507029, 509482, 507267, 507487, 511932, 513568, 516952, 515872, 513030, 516027, 517627, 515439, 515720, 511649, 510150, 507828, 509623, 513512, 512598, 508645, 508165, 509400, 508391, 510633, 512069, 514770, 514228, 509300, 506168, 506755, 511323, 514049, 512708, 510934, 514094, 515965, 517281, 517006, 519125, 522646, 523062, 522208, 523907, 521695, 516368, 513413, 515979, 521288, 519952, 517984, 518938, 521936, 524712]
14991E24712l575N42J250k949j542O53r93J488N88J423K161j468Q71j358k879
14976E18924k08J863R63K564K52J239r88J603p06j27K235q62L13k274k117m94
14960E22180j98J125p74L26J041j506l468O98K552J431K426P44J639o03o58N960
14944E32915K495l803n700k812L726J128K506J949K782K491M399M643j764n433
14930E39522j372j856P67j189j348j909J806Q14L19J818J458m211J793J33J496
14915E38041R28K493j646k778J62L798l04p59J04O90k67j819M04O71J020J159
14899E41897k00K13J265j056K948L039l130r87J992L533K294L259L003J304l043
14884E56331j136k829o284k039N48J175Q050L795j975o027l497K118N800q25p43
$$ y = [524712, 521137, 521679, 522929, 519980, 518438, 519091, 518098, 519586, 520174, 521597, 523758, 522290, 523161, 521803, 518924, 518716, 520579, 521542, 524106, 524358, 525597, 524609, 526212, 525506, 525379, 527614, 526752, 527065, 524791, 522674, 522180, 521982, 523107, 522333, 522659, 523700, 522194, 518726, 519424, 521976, 523407, 525833, 526577, 528216, 527613, 526955, 532915, 535410, 531607, 525907, 523095, 526821, 527949, 530455, 532404, 535186, 537677, 542076, 546719, 544955, 539522, 538150, 536294, 537061, 535872, 534524, 532615, 534421, 535235, 535554, 537372, 538830, 534619, 536412, 536545, 538041, 538969, 541462, 539816, 537038, 537200, 540998, 540694, 539935, 540039, 540729, 540462, 538643, 539047, 539718, 540738, 541897, 541697, 541910, 543175, 542119, 545067, 548106, 544976, 543989, 545981, 549514, 551808, 555067, 558070, 559374, 556331, 555195, 552366, 546082, 544043, 544591, 545766, 553816, 557611, 555636, 549609, 546112, 548230, 554030, 553205, 552462]
14869E52462L996m82j540q16j747l956J92o11N274K750L08n56k551J551J313l389
14853E52198j960L97N093N302j547n471j990J961N251j125r10K399M294J134j084
14838E63942J079K886K935l884P25L648n20p744l58K567j408l979j801J678K122
14823E61888M17P36P67L97P62k1K928j178j331O4M143O73j264M10J002M959J431
14806E76783l306m222k800O8J128Q80K218j100N28M059K919J557m960j140L299
14791E75911r74j891K03p83O05L418j373L128P25J839K597o240n025l354J941
14776E70727K019K046L329K641m848n638J899K325k73r94M65j83q62j315K176
14761E73514o02j231L094M194J258l156L308L296j976L441J55J587r54J075L409
$$ y = [552462, 556458, 555976, 554436, 553620, 551873, 547917, 548109, 547498, 552772, 555522, 555830, 555274, 552723, 554274, 555587, 552198, 550238, 550635, 555728, 561030, 559483, 554012, 552022, 553983, 559234, 558109, 557199, 559598, 563892, 565026, 563942, 565021, 567907, 570842, 566958, 567683, 571331, 570811, 563067, 562709, 565276, 563868, 559889, 558088, 559766, 561888, 562305, 563041, 563808, 564205, 564967, 564946, 567874, 566696, 565365, 565429, 569572, 570245, 568981, 569391, 570393, 575352, 576783, 573477, 569255, 566455, 566523, 567651, 568531, 570749, 569649, 570177, 574236, 577155, 578712, 573752, 572612, 575911, 574937, 573046, 573249, 572466, 573071, 576489, 575116, 578244, 578969, 580808, 583405, 577165, 572140, 568786, 570727, 572746, 574792, 578121, 580762, 575914, 570276, 572175, 574500, 574227, 573233, 573698, 573515, 572653, 571338, 573514, 572912, 571681, 574775, 578969, 580227, 577071, 580379, 583675, 581699, 585140, 585295, 586882, 585928, 587003, 590412]
14746E90412r36K576P056j080l893l417m101K052M022J90j300m310j122K681L375
14731E92205J21l416m29j42n0M441L610j387l244m239j547Q14q86M95J279K59
14715E87884J480M65J483K595K438j695J616L613K199k111m57K571o30k990l863
14700E94598K60O559K093l457l915l652K551J749J248k090k593J982N922N21j635
14685F00141L343P39K57o04K434m02Q69j115l476O29R74l260N74M883J952J005
14669F08943j996j334k213j220M073L95j90L577L448k730m691K502L756L466q04
14654F14982j460o38o48Q15k422K991K570j8j201n658j492J623L278k091J24K98
14638F11053l219K18r99k583L518L845n17L756K247q40k601L731m22j081L967
$$ y = [590412, 589476, 592052, 599108, 598028, 594135, 590718, 586617, 588669, 592691, 592881, 591581, 587271, 586149, 588830, 592205, 592326, 588910, 588481, 588339, 588289, 592730, 596340, 594953, 591709, 587470, 585923, 586737, 585851, 586346, 587625, 587884, 589364, 589829, 591312, 593907, 596345, 594650, 596266, 599879, 602078, 599967, 599510, 602081, 601451, 598461, 594598, 594858, 601417, 603510, 600053, 596138, 592486, 595037, 596786, 598034, 595944, 593351, 595333, 601255, 601776, 600141, 603484, 604223, 604480, 603876, 606310, 605908, 606777, 605662, 602186, 602815, 603789, 600529, 601103, 605986, 607938, 608943, 606947, 605613, 603400, 602180, 606253, 606648, 606458, 610035, 613483, 610753, 606062, 608564, 612320, 615786, 614982, 613522, 612884, 612236, 613051, 610629, 613620, 616190, 616172, 614971, 609313, 607821, 609444, 612722, 610631, 610755, 611053, 607834, 608052, 607053, 604470, 607988, 611833, 611316, 615072, 617319, 616479, 613878, 617609, 617187, 616106, 620073]
14623F20073j147m088l22L185r61J434N69k692k737L227P14j826n45K088N142
14608F22114j848k339J738L321O74k4k08n85o67J682M56K411j310m710K247L066
14592F26018P81L46k115l20J24J505M004J600l155j7q37l523r24o93N582O385
14576F34761j991n91n47j978k494K635j50K969L475J650l845K64J777j593k616
14561F31726M786L421L57M74j26J775K173k190j261J147j338j836l011K970K56
14546F39323j934O78M84M49K10K5J823K841P40j355k396j158K388k143M093L373
14530F47441J459p55M443L143l185n623m360J15K30L397J854L023n00j824M90
14515F49348k726K127K681k257Q89O42K352p44j524N173j890k465J231j487R04
$$ y = [620073, 618926, 614838, 614516, 617701, 616740, 618174, 618743, 616051, 613314, 616541, 617255, 615429, 614884, 616972, 622114, 620266, 617927, 619665, 622986, 623660, 623636, 623428, 622843, 622176, 623858, 624314, 626725, 625415, 620705, 622952, 626018, 626799, 627145, 625030, 624710, 624834, 626339, 630343, 631943, 628788, 628771, 627934, 624411, 623487, 622794, 628376, 634761, 632770, 632179, 631632, 629654, 627160, 629795, 629645, 632614, 636089, 637739, 633894, 634158, 635935, 634342, 631726, 636512, 639933, 640290, 640764, 640638, 642413, 644586, 642396, 641135, 642282, 640944, 639108, 636097, 639067, 639323, 637389, 638067, 638551, 639000, 639210, 639235, 641058, 643899, 644639, 643284, 640888, 639730, 642118, 639975, 644068, 647441, 648900, 648145, 652588, 655731, 652546, 646923, 642563, 642678, 642908, 646305, 648159, 651182, 650682, 648858, 649348, 646622, 648749, 651430, 649173, 650062, 650704, 653056, 652312, 650788, 655961, 654071, 651606, 652837, 651350, 652254]
14500F52254M461J560j484J809M799k656Q5O54k375l84j224k886M639M676k517
14485F61411J898K115J0m086J502J337L69J279L081k879l290m938j043J555K889
14470F61210j198l002J582J902K993K401K37K455j037l063m387J017P727J376
14456F70213j73p92R27L445M324o19l348l076m929j449K418K273L028L401j095
14441F74548l216k882j099K480K304J298M429j390n448P31N70L713L330J925k425
14426F78868J558j078r16M291j274m518j961J749M240J183L961L402j616J775
14412F89664J421J85j529m953J478K231N80j015j100l148K479K335P20M148j368
14397F92128j603J258k111P75N88L0k262j306N19P66J721Q82J31j544k63L867
$$ y = [652254, 656715, 658275, 656791, 658600, 663399, 660743, 660828, 661482, 659107, 658723, 657499, 654613, 659252, 663928, 661411, 663309, 665424, 665434, 661348, 662850, 664187, 664556, 665835, 668916, 666037, 662747, 657809, 656766, 658321, 661210, 660012, 657010, 658592, 660494, 663487, 665888, 666125, 668580, 667543, 664480, 660093, 661110, 668837, 670213, 670040, 669248, 670175, 673620, 677944, 677325, 673977, 670901, 665972, 664523, 666941, 669214, 672242, 675643, 674548, 671332, 668450, 667351, 669831, 672135, 673433, 677862, 676472, 671024, 671755, 672325, 676038, 679368, 681293, 678868, 680426, 679348, 678432, 682723, 681449, 676931, 674970, 676719, 680959, 682142, 686103, 689505, 687889, 689664, 691085, 691270, 689741, 684788, 686266, 688497, 689077, 688062, 686962, 683814, 686293, 688628, 689348, 693496, 692128, 690525, 691783, 689672, 690447, 691035, 691065, 688803, 687497, 688016, 688782, 690503, 691385, 691516, 689972, 689709, 693576]
14381F93576J079L315K676m962l992L664j704j239P892N475j59J52j263j471j412
14366G01627j212l304m06K021R01L514J180r01M01k620l223K184L247j663o62
14351G01084O114M168L046K100J135K329L534K960q850k194K165m712k204J429
14337G12104M03m85K345M372k034k779j714K280M944n19J523J903j449P48J174
14322G22816J995J776m48n000j402L209L989L171J34r55j215K96J386N54m193
14307G26113j625O664N28K98j680M12Q51j019J94L209K071K462R77J595o32r32
14291G39486p53L44r97n386K15N773J930K8J705P42O344M235k49m202J832r97
14275G50050J384k782J856L141j268n90M555K541p39j978j808j00m409k994K055
$$ y = [693576, 694655, 697970, 700646, 695684, 691692, 695356, 693652, 692413, 700305, 705780, 705621, 705773, 704510, 703039, 701627, 700415, 697111, 696705, 698726, 699627, 703141, 704321, 703420, 703821, 701201, 697978, 700162, 703409, 701746, 701084, 707198, 711366, 714412, 716512, 717647, 719976, 723510, 726470, 717620, 715426, 717591, 712879, 710675, 712104, 712507, 712022, 714367, 718739, 716705, 713926, 712212, 714492, 719436, 718917, 720440, 722343, 720894, 721642, 722816, 724811, 726587, 726139, 721139, 719737, 722946, 726935, 730106, 730240, 729285, 728070, 728366, 729752, 730306, 726113, 724488, 731152, 731680, 731978, 730298, 730710, 731561, 730542, 730736, 733945, 736016, 738478, 739455, 741050, 740418, 739486, 738733, 739077, 738080, 732694, 732909, 738682, 740612, 740640, 742345, 743087, 749431, 753666, 753417, 749215, 751047, 750050, 751434, 748652, 750508, 753649, 752381, 751791, 756346, 758887, 758148, 756170, 754362, 754262, 749853, 746859, 748914]
14260G48914j823k917n13K670k183m891j31j22L98k604Q05K243l426k903k32R90
14244G34275j252j498k673n881n928n138J496J998j753j596l050m549l513l819
14230F97119j2864l247O051K603K51l3l025m502o8K197l5q71j380k248j596l999
14214F74353k138J488J774l39k877j664j937j531K230M833J849L746l3m157o66
14199F74931K120K475J976m703l469K38J252M021n00P12m15K051K681O06J071
14184F85047L001K904K606k472k333Q0q0O56R27J936k435l30K163K149L273p57
14168F96335k44k50K71O97j60j862J446k68M63p50J899O45K033p3J467K121N467
14151G09237j718j740l261o73j991k60K831M467J463k30j194K657L364k449N85
$$ y = [748914, 747091, 744174, 743661, 746331, 744148, 739257, 739126, 739004, 739402, 736798, 737603, 739846, 736420, 733517, 733285, 734275, 733023, 731525, 728852, 722971, 717043, 711905, 713401, 715399, 713646, 712050, 709000, 704451, 700938, 697119, 684255, 681008, 687059, 689662, 689913, 689880, 686855, 682353, 682285, 684482, 684447, 683576, 682196, 679948, 678352, 674353, 672215, 673703, 675477, 675138, 672261, 670597, 668660, 667129, 669359, 674192, 676041, 679787, 679754, 675597, 674931, 677051, 679526, 681502, 676799, 673330, 673568, 674820, 678841, 678341, 679053, 678638, 680689, 683370, 683976, 685047, 688048, 690952, 693558, 691086, 688753, 688833, 688753, 689409, 690336, 692272, 689837, 689507, 691670, 693819, 697092, 696335, 696091, 695841, 696112, 696809, 696649, 694787, 696233, 695965, 696428, 695678, 697577, 698222, 700255, 700182, 701649, 703770, 709237, 707519, 705779, 702518, 701845, 699854, 699594, 702425, 706892, 708355, 708125, 706931, 709588, 712952, 710503, 711088]
14136G11088L722K803K901j955p98J815k73Q6l069j761M33K30j617J495M889L241
14120G23230J375m904l40J834L511k322k138M029L658j356O51J292J64J282K402
14105G32368L44J056j485j974J698K272K464l898m344K105K546k899Q87n24n62
14090G30054k527L609O266q21j135R05j68O76j754R62K401M402L405k022l607
14075G40646l675q54J201K077M320O20K132j247K6m755P23P264K267K525k407
14060G50863J412m48p80k434k147L85j884K489R15o60K125K529j606K23l318Q84
14044G48548L066J500j393J137m961q60l35J204K847K799N43K295l53J364M988
14029G62389O90l519J012L502k658j626P22L275k767J880N34k06n18R98j600r19
$$ y = [711088, 714810, 717613, 720514, 718559, 717761, 719576, 719303, 719389, 716320, 714559, 714992, 715222, 713605, 715100, 719989, 723230, 724605, 719701, 719361, 721195, 724706, 722384, 720246, 724275, 727933, 726577, 727228, 728520, 728684, 729966, 732368, 732712, 733768, 732283, 730309, 732007, 734279, 736743, 732845, 728501, 730606, 733152, 730253, 731140, 730616, 730054, 727527, 731136, 737402, 736581, 735446, 736351, 736183, 736859, 735105, 736067, 738468, 742870, 746275, 744253, 740646, 736971, 736117, 737318, 739395, 743715, 744335, 746467, 745220, 745246, 740491, 741214, 748478, 750745, 753270, 750863, 752275, 751827, 751047, 748613, 746466, 746851, 744967, 747456, 748371, 747711, 749836, 752365, 750759, 750982, 747664, 748548, 751614, 753114, 751721, 752858, 747897, 747037, 746702, 747906, 750753, 753552, 754095, 756390, 756037, 757401, 762389, 763079, 759560, 760572, 764074, 761416, 759790, 760512, 763787, 761020, 762900, 763434, 763228, 762710, 763708, 762108, 761189]
14013G61189q36J506L600J373L442J996K723k705l454j601L557q52k158k58J833
13998G69355L408J817l038J2L673M699n79l177L1J837J471k374j68j347k740K994
13982G75874m34P25K242J990L99l590k669m60J292P038K22j576O09j938j546L788
13966G81966L855j664K029P50j337k341m70k069L695N116K038J467j166k270j491
13951G88108m24O150K02l957p55r04J056M81j890k943J208O939N372J472j581
13936G98534j846k106L829k56m486j869K234N600N92o56n90l83l20J077k504k820
13920G94030P70L924n10l132o16L359j639O97L218O2q91k897J877L210J586p88
13904H02260J384L697J440l212L91J508l498K43M246N01k720K623R057k653m824
$$ y = [761189, 760353, 761859, 765459, 766832, 770274, 772270, 774993, 772288, 768834, 767233, 770790, 769938, 767780, 767522, 769355, 772763, 774580, 771542, 771554, 775227, 779926, 779347, 776170, 776201, 778038, 779509, 777135, 776967, 775620, 772880, 775874, 775440, 776165, 778407, 780397, 780796, 777206, 774537, 774077, 775369, 782407, 782629, 781053, 781662, 779724, 778178, 781966, 785821, 784157, 786186, 786936, 785599, 783258, 782788, 780719, 784414, 789530, 791568, 793035, 791869, 789599, 788108, 787684, 793834, 794036, 790079, 789324, 788420, 789476, 789957, 788067, 785124, 786332, 793271, 798643, 800115, 798534, 796688, 794582, 798411, 798155, 793669, 791800, 794034, 799634, 800226, 799570, 798980, 798597, 798277, 799354, 796850, 794030, 794800, 798724, 798214, 795082, 794466, 797825, 796186, 796883, 800101, 800163, 799272, 796375, 798252, 801462, 803048, 802260, 803644, 807341, 808781, 805569, 805960, 807468, 803970, 804213, 808459, 808960, 806240, 808863, 817920, 815267, 810443]
13889H10443J469K710j216l589p41K198L843j701l747k429K205o03J025N037M412
13874H19316K504j490J288l79m442J055Q80n06M87j798K352Q8J075M58L81J882
13858H23151M245L204j029m636j078l469j685J07M102K496o10M7J605k57P70K428
13842H29391o83p63m62N59K324j766k808l97K599J230k919L01N161M309J64k144
13826H34096k844k484L862M073J252l557M453J325K87j672j132J389K704L69k427
13811H39694m91P54J033l408j398L261K422l33j503l279K7J819K371J651N013
13796H47633J342j608R26j457m73j882k533k498O234P396j975n318K51l6R37k400
13780H44539q30L053J561J710j142N71M580l086k440j219L39R41K094M392K055
$$ y = [810443, 811912, 814622, 813406, 809817, 809076, 811274, 815117, 813416, 809669, 807240, 809445, 808842, 809867, 814904, 819316, 821820, 820330, 821618, 821239, 816797, 817852, 818732, 818226, 818713, 816915, 819267, 819355, 820430, 820888, 821269, 823151, 827396, 830600, 829571, 824935, 823857, 820388, 818703, 818810, 822912, 825408, 824798, 824845, 826450, 826193, 826963, 829391, 828708, 827945, 827483, 828042, 830366, 828600, 825792, 825395, 827994, 829224, 826305, 826606, 831767, 836076, 836240, 834096, 831252, 828768, 832630, 836703, 837955, 834398, 838851, 840176, 840463, 838791, 837659, 839048, 841752, 842121, 839694, 839203, 839957, 840990, 837582, 836184, 839445, 841867, 841534, 840031, 836752, 836779, 838598, 840969, 842620, 847633, 848975, 847367, 848293, 846836, 846363, 844481, 841948, 839450, 845684, 853080, 851105, 845787, 846038, 846002, 846939, 844539, 843709, 846762, 848323, 850033, 848891, 849462, 854042, 850956, 848516, 847297, 847636, 848577, 850671, 855063, 857118]
13765H57118L893k244k603p94Q23K234L277j066j984J997L926Q29O75r14O68k404
13749H63431j025n02J678M36j066q19J607M897k755l560k450q1L425K472L45J910
13733H67943J430K052J992m196k200K047L9j684J013L510K020q83j815r7K258
13718H73429K903j136m79k696o42N204K95R99n698Q24L699q45k365K418M895Q59
13702H81664N469n705m999L134M569K078m400k781J135M064K998L40k313l448
13688H81805r16M281L513K57j300k763n31K019K60m164r19k329J812M518M300
13673H89843O099O26j066M237J559p48J39Qk148l064J53n19P56P38N15J503l300
13656H95331k289L626J281j119r87j076K302K279l088J243N099J902l225K713
$$ y = [857118, 861011, 858767, 856164, 855370, 856193, 858427, 861704, 860638, 858654, 860651, 864577, 865406, 866081, 865167, 865835, 863431, 862406, 861904, 863582, 864018, 862952, 862133, 863740, 868637, 865882, 862322, 859872, 859791, 863216, 865688, 866033, 867943, 869373, 871425, 873417, 869221, 867021, 869068, 869107, 867423, 868436, 871946, 873966, 873083, 871268, 871171, 873429, 876332, 875196, 874717, 872021, 871379, 876583, 876878, 877877, 872179, 873003, 876702, 875857, 873492, 875910, 880805, 881664, 887133, 881428, 876429, 879563, 884132, 886210, 881810, 879029, 880164, 884228, 887226, 887566, 885253, 881805, 880889, 885170, 888683, 888940, 887640, 884877, 884346, 886365, 886625, 882461, 881542, 879213, 881025, 885543, 889843, 895942, 896568, 895502, 899739, 901298, 900550, 900689, 900697, 898549, 895485, 895638, 895119, 895875, 896613, 897128, 898631, 895331, 893042, 896668, 897949, 896830, 895843, 894767, 897069, 899348, 896260, 897503, 902602, 904504, 901279, 903992]
13642I03992l64k925O39J400m19J77L396J298l827l914P36K639J528K94M05J612
13626I06667R13j285L369p23J478L319p96k769j38K735L58k656J004K996n04J551
13610I15519M73P26M952m74K34j575j367j016K860K650R27l249l091M518J122
13595I23209J141L043K363j062q4n290l48M856M97j199R77R77L840J668l348k149
13579I29091K017j894m765k932L027L242m58L247K14J453J158K379K038j879Q70
13564I36808k714l114N58N381K505K745k714k033J772K808P05j047n834L589k026
13549I37389l463J098K082M608L788J57l416J204L833j97j303j405k875J628K497
13534I45625k42M167N504K247L44j015k457J571l019k552j292R79M482J457K05
$$ y = [903992, 903628, 900703, 901342, 902742, 902323, 902500, 905896, 907194, 903367, 899453, 900189, 902828, 904356, 904650, 905055, 906667, 907580, 906295, 909664, 908941, 910419, 913738, 912942, 910173, 910035, 912770, 913128, 910472, 911476, 914472, 913968, 915519, 915992, 916718, 921670, 921196, 921430, 919855, 918488, 917472, 920332, 922982, 923909, 920660, 917569, 922087, 923209, 924350, 927393, 929756, 928694, 928610, 923320, 922972, 927828, 928325, 927126, 928103, 929080, 932920, 934588, 931240, 929091, 931108, 929214, 924449, 921517, 924544, 927786, 927328, 930575, 930789, 932242, 933400, 935779, 937817, 935938, 936808, 934094, 930980, 931538, 936919, 939424, 942169, 939455, 937422, 939194, 942002, 942707, 941660, 935826, 939415, 937389, 933926, 935024, 937106, 941714, 945502, 945659, 942243, 943447, 947280, 947083, 945780, 944375, 941500, 943128, 945625, 945383, 949550, 955054, 957301, 957645, 956630, 954173, 955744, 952725, 950173, 948881, 949860, 954342, 955799, 956004]
13519I56004MJ509p65j923o66J732J431K059n66l438j348j7K942M856K74k915
13503I59173l95J451J584J610j823k706k987K608K367M933O434J752K917k333
13489I74585m655l719J486K515r18J727k814l043K36K782l533N33L304P71k765
13474I66492j022M848L649l66m68N75J912L574j251j444q96k65m135m91L592O191
13458I80495L884J472j437l778k197M825j943m65k34m41j7j548K145K636k48k286
13442I80863q65L078L785m395l500O636L230O229L220j479n467k537J949j002
13428I89745r36L499K5q90%j158j501r24L266N419J860k123r3P44p59m139l530
13411I88505K617K789M181N56l073p9l65M037N416N325k25k96K266o83k888j590
$$ y = [956004, 956008, 957517, 956752, 954829, 954163, 955895, 957326, 959385, 958819, 955381, 954033, 954016, 956958, 961814, 962088, 959173, 958778, 960229, 961813, 963423, 961600, 958894, 955907, 958515, 960882, 965815, 972249, 974001, 976918, 974585, 969930, 966211, 967697, 970212, 969294, 971021, 968207, 965164, 965400, 968182, 964649, 965182, 968486, 969257, 966492, 965470, 970318, 973967, 973601, 973133, 973708, 975620, 979194, 977943, 976499, 975603, 975338, 971203, 970712, 974304, 980495, 984379, 985851, 984414, 980636, 978439, 983264, 981321, 980856, 980622, 980181, 980164, 978616, 980761, 983397, 983149, 980863, 979998, 983076, 986861, 982466, 978966, 985602, 988832, 995061, 998281, 996802, 991335, 988798, 990747, 989745, 988809, 992308, 992333, 991443, 991443, 990285, 988784, 987860, 991126, 996545, 998405, 996282, 996189, 996933, 996174, 992035, 988505, 991122, 993911, 998092, 998648, 995575, 995496, 995131, 999168, 1004584, 1009909, 1009684, 1009388, 1011654, 1010971, 1008083, 1006493]
13395A006493m379n75N373Q40j816k921L659L797R53K187J120l563j096K310K61
13380A012643m833j324M681n15p66L735K235m275L56L479M516N714p73j566j192
13365A022115n04n40j682Q46J543k524J470j590m52M499j90J18P72L153M66J077
13349A028577n562m902N588L481M803J902Q36J2Q12K474R54j651k720o20j552
13334A032432o915L220K577K358j547k142j023K559J966Q89O62K282M552j797
13320A040073l802j836L67P10P602K685J964J188J461k054m727k024l66L780J331
13305A046352J396J120m105j763L679J198J036M852J74q51j546J016K457j921
13291A053094l926J613J910J833K443J274J324j664J25J533K297O3J183k214M916
$$ y = [1006493, 1002114, 1001539, 1006912, 1007752, 1005936, 1003015, 1006674, 1010471, 1011424, 1013611, 1014731, 1011168, 1010072, 1012382, 1012643, 1007810, 1006486, 1011167, 1010652, 1009886, 1013621, 1015856, 1011581, 1011937, 1015416, 1019932, 1025646, 1024873, 1023307, 1022115, 1021611, 1021071, 1019389, 1020235, 1021778, 1019254, 1020724, 1019134, 1018682, 1023181, 1022991, 1023109, 1023881, 1027034, 1027500, 1028577, 1023015, 1018113, 1023701, 1027182, 1031985, 1033887, 1034723, 1034735, 1035547, 1038021, 1038975, 1037324, 1034604, 1033984, 1032432, 1025517, 1028737, 1031314, 1033672, 1032125, 1029983, 1028960, 1031519, 1033485, 1034374, 1035036, 1037318, 1041870, 1040073, 1036271, 1034435, 1034802, 1035512, 1043114, 1045799, 1047763, 1048951, 1050412, 1048358, 1043631, 1041607, 1041241, 1045021, 1046352, 1047748, 1048868, 1044763, 1043000, 1046679, 1047877, 1048913, 1053765, 1053939, 1053088, 1051542, 1052558, 1055015, 1053094, 1049168, 1050781, 1052691, 1054524, 1056967, 1058241, 1059565, 1057901, 1058026, 1059559, 1061856, 1061919, 1063102, 1060888, 1065804]
13276A065804L223J276K6l257J84N35l183m329J405L76q93J613L654O188o31N74
13260A072565J681M272N52j915k670K032O80K249j267m615q08K07K230L280J267
13245A079740M93q18j82K447k05j866p6n86K60L525K389K49j640L592L915K34
13229A091471K623j004j970l018q89j931J957Q39M5p79J500l47J156L465R15m627
13213A089406j462j047N363L176J316J712O03K89l664J924K271O39k974M20L52
13198A098324J169J380J722N44J700m49j844k221K146O416K669j106L45K9L251
13183A114075k32k562j742K32O95L793J966o22k097N31J633j31l37M090J91m628
13167A114855k841O036O636j947p42o61J008K341Q79j168j9k78R21p6m135l52
$$ y = [1065804, 1069027, 1070303, 1070329, 1067072, 1067256, 1067791, 1064608, 1060279, 1061684, 1062060, 1061167, 1062780, 1066434, 1072622, 1071991, 1072565, 1074246, 1078518, 1079070, 1077155, 1074485, 1076517, 1077197, 1079446, 1078179, 1073564, 1072756, 1072963, 1075193, 1078473, 1079740, 1080233, 1079415, 1079233, 1081680, 1081475, 1079609, 1079533, 1078947, 1079207, 1082732, 1085121, 1085370, 1083730, 1087322, 1091237, 1091471, 1094094, 1093090, 1091120, 1088102, 1087213, 1085282, 1087239, 1088078, 1088123, 1087344, 1088844, 1088497, 1089653, 1093118, 1094033, 1089406, 1087944, 1086897, 1092260, 1095436, 1096752, 1098464, 1099067, 1099356, 1095692, 1097616, 1099887, 1100526, 1097552, 1097972, 1098324, 1099493, 1100873, 1102595, 1103139, 1104839, 1104390, 1102546, 1100325, 1102471, 1108887, 1111556, 1110450, 1110795, 1110824, 1114075, 1113843, 1111281, 1109539, 1109771, 1110466, 1114259, 1116225, 1115603, 1113506, 1114037, 1115670, 1115539, 1115202, 1119292, 1119483, 1114855, 1112014, 1118050, 1124686, 1122739, 1121997, 1121336, 1122344, 1124685, 1125564, 1124396, 1124377, 1124099, 1125020, 1124944, 1120809, 1120457]
13151A120457L667K103l569K68J467K005l70p37l13J609m58K344k105k172k81
13136A123915R008M794J085j613l05k05k972L228K080r28J296k928N11O77J452
13121A139095L15k31J87M378L922m16l503l064j658k753j72L961L957K564J143
13106A147725K881J250l861k919L904P27J922K302k0J315j348j721L685l537k287
13091A150018N230L819K442J578L437L722l540m803m223L282L659J004N94o79
13077A165540l086l575j932J571O174L417P27P9M32n57q32l453j604J979K487
13062A167367J352L519J24K392J397k343r58L078k66K032Q05L636J86J690L645
13047A187656q26k623r02j389l201N82L85o42l04J594K018Q54R38N811N666J262
$$ y = [1120457, 1124124, 1126227, 1122658, 1122926, 1124393, 1126398, 1126028, 1125291, 1124978, 1126587, 1126129, 1128473, 1126368, 1124196, 1123915, 1132923, 1137717, 1138802, 1137189, 1136884, 1136679, 1133707, 1136935, 1139015, 1138087, 1139383, 1136455, 1136966, 1137643, 1139095, 1139410, 1139179, 1139366, 1143744, 1147666, 1147250, 1143747, 1140683, 1139025, 1136272, 1136100, 1140061, 1144018, 1146582, 1147725, 1150606, 1151856, 1147995, 1145076, 1148980, 1149707, 1151629, 1153931, 1153911, 1155226, 1153878, 1152157, 1155842, 1152305, 1150018, 1155248, 1159067, 1161509, 1163087, 1166524, 1170246, 1166706, 1161903, 1157680, 1160962, 1164621, 1165625, 1166219, 1165540, 1162454, 1158879, 1156947, 1158518, 1164692, 1168109, 1168836, 1168915, 1169347, 1168790, 1167958, 1164505, 1162901, 1164880, 1167367, 1168719, 1172238, 1172362, 1174754, 1176151, 1173808, 1172850, 1175928, 1175662, 1177694, 1178499, 1182135, 1182321, 1184011, 1187656, 1186830, 1184207, 1183305, 1181916, 1178715, 1179297, 1179682, 1179040, 1178736, 1180330, 1182348, 1183202, 1184140, 1189951, 1195617, 1196879]
13031A196879l020O26k076K54J696j991P71J540M290J999j736j853p44Q12Q15
13016A198262K465J198o34K174O87j295L177l464j04j098J825K488J895k107m67
13001A205002J639K754r74J984K428k38K027m037J490L370J565r71j719j32l43
12986A213845k872N142M038K23J081k84k229L630N550k425q68K053K751J558N744
12971A236937j981k751l583K08J360L76J218K920K223k679k395K380N13L632K035
12956A240413M30k079M043K788l955r24N22j290K312K496j048l057O8L671J497
12941A245887O23J299o02r59p37K981k263l56J004L940N703J03j965j678l957
12926A249023J459J853q83K944K743j621p47Q49L322l404K869O140J433L725N921
$$ y = [1196879, 1193859, 1194485, 1192409, 1192663, 1194359, 1192368, 1193139, 1194679, 1198969, 1200968, 1199232, 1197379, 1196635, 1197447, 1198262, 1200727, 1201925, 1201291, 1203465, 1204152, 1202857, 1206034, 1202570, 1202466, 1201368, 1203193, 1205681, 1207576, 1205469, 1205002, 1206641, 1209395, 1208421, 1210405, 1212833, 1212595, 1214622, 1210585, 1212075, 1215445, 1217010, 1216039, 1214320, 1214188, 1213845, 1210973, 1216115, 1220153, 1220376, 1221457, 1221173, 1218944, 1222574, 1228124, 1225699, 1224831, 1226884, 1229635, 1231193, 1236937, 1234956, 1232205, 1228622, 1228830, 1230190, 1230566, 1231784, 1234704, 1236927, 1234248, 1231853, 1234233, 1234746, 1238378, 1240413, 1240843, 1238764, 1242807, 1245595, 1241640, 1240716, 1241238, 1239948, 1242260, 1244756, 1243708, 1240651, 1240719, 1244390, 1245887, 1246510, 1247809, 1247207, 1246248, 1245511, 1248492, 1246229, 1245873, 1246877, 1250817, 1256520, 1256623, 1254658, 1252980, 1249023, 1250482, 1252335, 1251452, 1254396, 1257139, 1255518, 1254771, 1255620, 1258942, 1255538, 1258407, 1264547, 1265980, 1269705, 1275626]
12911A275626j74j451j942o52Q2O7l017J430K54j694k699L17K476M365J311M494
12895A278793M815J897J856k172o232J778K028p17k479k701J340N434K142l877
12881A281905k74L61L449K840L264k253R37j217K400L619k05M29m348j86K207
12866A292928M857N772M145M239L022k713n966o63k484k663J230j635j110K672
12852A301631j324j208J990J512O02m70L224j622j489L563N35L69K175M356K123
12837A315967K797J076P89p1j13J848M8J532j211l4K092R25J305J139j134m554
12821A322401k222K35L086L353J821k390p89K112L884j064M04J75J085J575J341
12806A335007O75K484N3o38M46K70L234M668J397k802k977L107L954q66J050Q85
$$ y = [1275626, 1275452, 1274001, 1272059, 1271407, 1271489, 1271556, 1268539, 1269969, 1270223, 1268529, 1265830, 1266147, 1268623, 1272988, 1274299, 1278793, 1283608, 1285505, 1287361, 1285189, 1278957, 1280735, 1282763, 1282046, 1279567, 1276866, 1278206, 1283640, 1285782, 1281905, 1281631, 1281992, 1285441, 1288281, 1291545, 1289292, 1290229, 1289012, 1291412, 1295031, 1294826, 1295255, 1290907, 1290721, 1292928, 1297785, 1303557, 1307702, 1311941, 1314963, 1312250, 1306284, 1305621, 1303137, 1300474, 1301704, 1300069, 1298959, 1301631, 1300307, 1299099, 1301089, 1302601, 1303203, 1302733, 1305957, 1304335, 1302846, 1306409, 1306944, 1307313, 1309488, 1313844, 1315967, 1318764, 1319840, 1320629, 1320558, 1320445, 1322293, 1322341, 1323873, 1322662, 1322628, 1324720, 1325645, 1326950, 1328089, 1326955, 1322401, 1320179, 1320414, 1323500, 1326853, 1328674, 1326284, 1325495, 1327607, 1331491, 1330427, 1330831, 1331006, 1332091, 1333666, 1335007, 1335682, 1338166, 1338219, 1337581, 1338027, 1338297, 1341531, 1346199, 1347596, 1344794, 1341817, 1344924, 1348878, 1348012, 1349062, 1349947]
12790A349947k545j218J173O37R50j843M35L524K470K30L483O191R24o294L57
12775A358421j766j967L28p87J743K832L44O286M581O13K988r8m022j007j355
12760A367134k004j079M879K324J519m7J175L266O68L314L902J6k662P39K887
12745A386031j247J332L228R05m383j812o03M57J697K804m061m207R78N930K842
12730A389891N076J95l61O59j284L15K16l76N31k68J263K534R20K91L495L128
12714A406225k12j955K492J515J071L467M420m034m089J836M25m17J735L648L928
12699A420055P24k400l523l189J118L33O07m6P26n34J617N873J021k539l849o02
12683A415392O535K203M277j323J76O08L857K002J633R63n40M553K547j84r42
$$ y = [1349947, 1347402, 1346184, 1347357, 1347994, 1348944, 1347101, 1347536, 1351060, 1353530, 1353760, 1357243, 1363434, 1364358, 1358064, 1358421, 1356655, 1354688, 1355016, 1354229, 1355972, 1358804, 1359148, 1365434, 1370015, 1370628, 1373616, 1373518, 1369496, 1368489, 1367134, 1365130, 1364051, 1368930, 1371254, 1372773, 1372726, 1373901, 1377167, 1377835, 1381149, 1385051, 1385067, 1382405, 1383144, 1386031, 1384784, 1386116, 1389344, 1390249, 1385866, 1384054, 1383451, 1383908, 1385605, 1388409, 1384348, 1380141, 1381119, 1387049, 1389891, 1394967, 1395162, 1394801, 1395460, 1394176, 1394491, 1394707, 1394331, 1394862, 1394594, 1395857, 1398391, 1399311, 1399602, 1403097, 1406225, 1406013, 1404058, 1406550, 1408065, 1409136, 1412603, 1417023, 1412989, 1408900, 1410736, 1411161, 1410744, 1412479, 1416127, 1420055, 1420779, 1418379, 1414856, 1411667, 1412785, 1413118, 1413725, 1413679, 1414405, 1413871, 1415488, 1421361, 1422382, 1419843, 1415994, 1415392, 1421927, 1424130, 1428407, 1427084, 1427260, 1427868, 1431725, 1433727, 1435360, 1436323, 1435783, 1440336, 1442883, 1442699, 1441757]
12668A441757k814K060M079o4j105o45L882M557m95j02P45J949J064J585p52j175
12652A454526K843J44k827j446K512j163J688M450L118L988k940m262M459J609
12638A466699k422K724J888K237j812J166J951K468K814j889Q76o59m113R11P073
12623A479912L074L34j51l049l573j01K218L208P349K220l266k881j965L686M213
12608A491228J631K818L59J376J072K752k854j822J522P60o29Q27K652M77k40
12593A501929L15R35N240M474m53n463O2L015J63l545L97K9K31N610N302j708
12577A516533J649K049L552J579K79O53Q52m036J234K236l30j13n67J993Q88N995
12561A534446L545L787n82J654j395j124j160N87P94J408L628m40K818P76J568
$$ y = [1441757, 1438943, 1441003, 1445082, 1445018, 1443913, 1443268, 1447150, 1451707, 1451212, 1451110, 1451855, 1453804, 1454868, 1456453, 1455701, 1454526, 1457369, 1457513, 1454686, 1453240, 1455752, 1454589, 1456277, 1460727, 1463845, 1467833, 1464893, 1460631, 1465090, 1466699, 1464277, 1467001, 1468889, 1471126, 1469314, 1470480, 1472431, 1474899, 1477713, 1475824, 1476700, 1476041, 1471928, 1472839, 1479912, 1482986, 1483320, 1483169, 1480120, 1476547, 1476446, 1478664, 1481872, 1489221, 1491441, 1488175, 1485294, 1483329, 1487015, 1491228, 1492859, 1495677, 1496036, 1497412, 1498484, 1501236, 1498382, 1496560, 1498082, 1498842, 1498213, 1499040, 1501692, 1502169, 1501929, 1502244, 1503179, 1508419, 1512893, 1512440, 1506977, 1507039, 1510054, 1510217, 1506672, 1507069, 1507098, 1507329, 1512939, 1518241, 1516533, 1518182, 1520231, 1523783, 1525362, 1525641, 1526294, 1527146, 1523110, 1524344, 1526580, 1526250, 1526137, 1525570, 1527563, 1528451, 1534446, 1537991, 1541778, 1541196, 1542850, 1541455, 1540331, 1539171, 1539758, 1540552, 1541960, 1545588, 1545148, 1547966, 1548742, 1550310]
12546A550310j680o20L721J675K404l390k433L238k057L240j12J574P85M348K387
12531A563390K915J907m35m041r36P008K748j869M46L669nk965N880m95J161Q93
12515A579271j30o95N55M159N92J287m0k227r61K493L14L181L968m76Q36j376
12499A590751o25O2L874M573K195L455J032J848J559K95j60k215q12j812j991
12484A602029K594K008J809P5L666K181l629L796j283k022L900N744K909L275
12470A627052K806O38L53J801j385r68O82k597o6O36k086J052M235j037J162L234
12454A635512J799J122R12J228N057J725J924O03J043q53P27k532L173j345k80
12439A649815K866j86j023K319J154R04L29L88j591J064L358K875L497J987J194
$$ y = [1550310, 1548630, 1548010, 1551731, 1553406, 1555810, 1552420, 1549987, 1553225, 1551168, 1554408, 1554296, 1555870, 1556655, 1561003, 1563390, 1566305, 1568212, 1567777, 1563736, 1562800, 1569808, 1572556, 1570687, 1571133, 1574802, 1574797, 1571832, 1577712, 1577217, 1578378, 1579271, 1579141, 1578446, 1579001, 1583160, 1583752, 1585039, 1584999, 1582772, 1581811, 1584304, 1584618, 1587799, 1591767, 1591291, 1592127, 1590751, 1590126, 1590188, 1594062, 1598635, 1600830, 1604285, 1605317, 1607165, 1608724, 1609019, 1608859, 1606644, 1605832, 1604020, 1602029, 1604623, 1606631, 1608440, 1608515, 1612181, 1614362, 1610733, 1614529, 1613246, 1611224, 1615124, 1620868, 1623777, 1627052, 1629858, 1630496, 1630849, 1632650, 1631265, 1630297, 1630979, 1628382, 1628316, 1628952, 1626866, 1627918, 1632153, 1631116, 1632278, 1635512, 1637311, 1638433, 1639345, 1640573, 1645630, 1647355, 1649279, 1649882, 1650925, 1650072, 1650799, 1648267, 1651440, 1650095, 1649815, 1652681, 1652495, 1651472, 1653791, 1654945, 1655849, 1656178, 1656566, 1654975, 1656039, 1659397, 1662272, 1665769, 1667756, 1668950]
12424A668950L698j756k414L050L592K274j551K34M961k35j395l978N56K466O33
12409A679085k56R27K53O003J0307N232m144n247n94M370J196m95M451L196j006
12394A703278J21J430K933L112r96q66N21J392k43j751J672O92J65M426P27M13
12378A717026K871R17J583R24J639L737M113J244m82K103k929j95M11K285J64
12363A735411J462K345l89r03O218N870k207j297Q12J258j483K677k712L699L924
12348A754685J53q36Q591J196l16Q2J986j611r82j383M364M499J316K742L85q13
12332A774058J871K549J24j663K818M324K748j624R74J180L341K535l928j869
12318A787438M108Q129K526M06k858j264L867K414K16j180j353j591K95N687Q144
$$ y = [1668950, 1672648, 1670892, 1668478, 1671528, 1675120, 1677394, 1675843, 1676077, 1681038, 1680803, 1679408, 1675430, 1675986, 1678452, 1679085, 1678829, 1679756, 1680009, 1686012, 1696319, 1701551, 1697407, 1692160, 1691566, 1695936, 1697132, 1696637, 1701088, 1704284, 1703278, 1703399, 1704829, 1707762, 1710874, 1709878, 1709012, 1709533, 1710925, 1710682, 1708931, 1710603, 1711295, 1711460, 1715886, 1716613, 1717026, 1719897, 1720814, 1722397, 1723321, 1724960, 1728697, 1732810, 1734054, 1733572, 1735675, 1732746, 1732551, 1732962, 1735247, 1735411, 1736873, 1739218, 1738829, 1737926, 1744144, 1750014, 1747807, 1746510, 1747322, 1748580, 1747097, 1749774, 1747062, 1750761, 1754685, 1754838, 1754002, 1762593, 1763789, 1763473, 1763555, 1765541, 1763930, 1762948, 1761565, 1765929, 1770428, 1771744, 1774486, 1774871, 1774058, 1775929, 1778478, 1778602, 1776939, 1779757, 1784081, 1786829, 1785205, 1786179, 1787359, 1790700, 1793235, 1789307, 1787438, 1791546, 1799675, 1802201, 1802607, 1799749, 1798485, 1802352, 1804766, 1804982, 1803802, 1802449, 1800858, 1801153, 1806840, 1814984]
12303A814984k88p0J407j411K712L04K6N995K646k063M73M20J981J309R76J592
12287A830993P0N7n20O41J200J441K397L141J925J077K908K990K305J889P32M98
12271A853744J534K342J424r55L79j126r98Q854J188K389n6j312O99n81K580J249
12255A871354n96N67M680K138Q2k89m551L591Q005K306R15K169O86J237J642K129
12239A896065K791j103J185M127L003k230n36j96K237L648M413L483R77K468L110
12224A923442l9J956P47k518R19j692r53P21Q59K547N98L09L221M633M205j153
12208A937802J142M515J583j304J353M409Q97J017M624K242Q88M567j525j188
12194A961022j551j723O056K283k672J945J455K98L576M396L958L601p91j64j226
$$ y = [1814984, 1814696, 1814626, 1816033, 1814622, 1817334, 1817638, 1817664, 1823659, 1826305, 1824242, 1824715, 1825135, 1827116, 1828425, 1829401, 1830993, 1831063, 1831120, 1830600, 1831241, 1832441, 1833882, 1836279, 1839420, 1841345, 1842422, 1845330, 1848320, 1850625, 1852514, 1853246, 1853744, 1855278, 1857620, 1859044, 1858089, 1858468, 1857342, 1856344, 1865198, 1866386, 1868775, 1868719, 1867407, 1868106, 1867525, 1870105, 1871354, 1870758, 1871325, 1876005, 1878143, 1878225, 1877936, 1873385, 1876976, 1884981, 1887287, 1888202, 1890371, 1891057, 1892294, 1893936, 1896065, 1898856, 1897753, 1898938, 1903065, 1906068, 1903838, 1903302, 1903106, 1905343, 1908991, 1913404, 1916887, 1917864, 1920332, 1923442, 1923403, 1925359, 1926106, 1923588, 1924507, 1922815, 1921862, 1922583, 1923442, 1925989, 1926587, 1926896, 1930117, 1934750, 1938955, 1937802, 1938944, 1943459, 1945042, 1943738, 1945091, 1949500, 1950397, 1951414, 1956038, 1958280, 1959168, 1963735, 1962210, 1961022, 1959471, 1957748, 1963804, 1966087, 1963415, 1965360, 1966815, 1967113, 1970689, 1975085, 1979043, 1982644, 1981853, 1981689, 1980463]
12179A980463O34L897j18q26J210L467j612q06M164L969O85K151O798K711L562
12164B010349j260L640k64j778K405K974N797j908M757M930R72r58k356L713K655
12149B033668l225q74M650N704K043n21O413J224J081n565L524J056L402L756
12135B056336L018M360K52j550j514M05k788K905O968K639j633J962K915J869
12121B076144l962K860M775J124K092J972J526L330M650J285N255J671m159j783
12107B096780J935L307r94N83J136M251O190Q27K349q65n94l015K316N110M156
12092B123472m600J105L681J027J754J221O611K201j926J315O959L341o39J615
12078B147137L124J001K09o73Q74L727O835M218L199J340Q96L124m259k65O755
$$ y = [1980463, 1981097, 1984994, 1984876, 1984050, 1985260, 1988727, 1987115, 1986309, 1990473, 1994442, 1995127, 1997278, 2004076, 2006787, 2010349, 2009089, 2012729, 2012465, 2010687, 2013092, 2016066, 2021863, 2019955, 2024712, 2029642, 2030614, 2029656, 2027300, 2031013, 2033668, 2030443, 2029569, 2034219, 2039923, 2041966, 2041445, 2047858, 2049082, 2050163, 2044598, 2048122, 2049178, 2052580, 2056336, 2059354, 2063714, 2063966, 2062416, 2060902, 2061307, 2058519, 2061424, 2068392, 2071031, 2069398, 2071360, 2074275, 2076144, 2072182, 2075042, 2079817, 2080941, 2083033, 2085005, 2086531, 2089861, 2094511, 2095796, 2101051, 2102722, 2098563, 2096780, 2098715, 2102022, 2101028, 2101611, 2102747, 2106998, 2113188, 2114015, 2116364, 2115499, 2114905, 2111890, 2114206, 2119316, 2123472, 2118872, 2119977, 2123658, 2124685, 2126439, 2127660, 2134271, 2136472, 2134546, 2135861, 2142820, 2146161, 2145522, 2147137, 2150261, 2151262, 2151471, 2150798, 2151672, 2155399, 2162234, 2166452, 2169651, 2170991, 2171887, 2175011, 2170752, 2170487, 2177242]
12063B177242o98K306P668j890k102n16j357r7N596O883M256L122J977J542J864
12048B205796Q53k362KO096O688j665j432K786M038K158R45L206J537j435k09
12033B227002N020J806O55L761J673R900M866j78o45M761M943M21q35m298L067
12018B261919M266M153P45l629k18L956M235K642K556J011N969L248K554L122
12004B296529K004K475K522o27k956O580j135J373J612O875K468O95K276N528
11990B326219K12Q16M328P429J700l567J457K887K495M187L655L252K257n16J448
11975B358259K120j28M46O118N051r51J001k619j687M05L154N276J790r88Q66
11960B378113L871L286Q556M486m55M052J691k011q99K159J860M750Q857O97J312
$$ y = [2177242, 2176544, 2178850, 2186518, 2184628, 2182526, 2182010, 2180653, 2180556, 2186152, 2193035, 2197291, 2200413, 2202390, 2203932, 2205796, 2206649, 2204287, 2204289, 2210385, 2217073, 2215408, 2213976, 2216762, 2220800, 2222958, 2223903, 2227109, 2228646, 2227211, 2227002, 2232022, 2233828, 2234483, 2238244, 2239917, 2249817, 2254683, 2254505, 2253860, 2258621, 2263564, 2263985, 2263150, 2258852, 2261919, 2266185, 2270338, 2271083, 2267454, 2267236, 2271192, 2275427, 2278069, 2280625, 2281636, 2287605, 2290853, 2293407, 2296529, 2298533, 2301008, 2303530, 2302903, 2299947, 2306527, 2305392, 2306765, 2308377, 2315252, 2317720, 2318415, 2320691, 2326219, 2326431, 2327247, 2331575, 2339004, 2340704, 2337137, 2338594, 2341481, 2343976, 2348163, 2351818, 2355070, 2357327, 2356811, 2358259, 2360379, 2360251, 2360697, 2366815, 2371866, 2370915, 2371916, 2369297, 2367610, 2368015, 2371169, 2376445, 2378235, 2377247, 2378113, 2381984, 2385270, 2393826, 2398312, 2397857, 2401909, 2403600, 2401589, 2400690, 2402849, 2404709, 2409459, 2418316, 2419013, 2420325]
11945B420325Q244J556j685K501N551L696R91M24L932L340K491O173N193K417
11931B465149j08m85J281J944K822o52p66N79K276K742M174K090L919K937L220
11916B491122N28M189L778K81O798M685Q37m009K793O856R644K968K083Q33J437
11901B534823L905J599J744J892J874N821L305N660M049K52j63l434L299M609
11887B569235J179j343k771Q61O241J0439Q504N284N81l837l247K06q35j685K455
11872B591267K939J46L267N474N464Q246N984N08j066N743J997K996N817K485
11858B641267L9L888M615J065K040N361m90L831P521J951J266J417o83L736P207
11843B684031M494l14q95j806R77N777K008J076O716M577l28M812O937L811M647
$$ y = [2420325, 2428569, 2430125, 2428440, 2430941, 2436492, 2440188, 2441179, 2441603, 2445535, 2448875, 2451366, 2457539, 2462732, 2465149, 2465041, 2464556, 2465837, 2467781, 2470603, 2469951, 2469185, 2469764, 2472040, 2474782, 2478956, 2481046, 2484965, 2487902, 2491122, 2491650, 2495839, 2499617, 2499898, 2506696, 2511381, 2512218, 2508209, 2511002, 2517858, 2527502, 2530470, 2532553, 2533386, 2534823, 2538728, 2540327, 2542071, 2543963, 2545837, 2551658, 2554963, 2560623, 2564672, 2564924, 2564761, 2561327, 2564626, 2569235, 2570414, 2569071, 2566300, 2567161, 2573402, 2583841, 2592345, 2597629, 2598210, 2594373, 2591126, 2591332, 2590497, 2588812, 2591267, 2594206, 2594352, 2597619, 2603093, 2608557, 2616803, 2622787, 2623295, 2622229, 2627972, 2629969, 2632965, 2638782, 2641267, 2641306, 2645194, 2649809, 2650874, 2652914, 2658275, 2657785, 2661616, 2669137, 2671088, 2672354, 2673771, 2673088, 2676824, 2684031, 2688525, 2688211, 2687316, 2685510, 2686487, 2692264, 2694272, 2695348, 2702064, 2706641, 2706313, 2711125, 2718062, 2721873, 2726520]
11828B726520O868M548N068N843L948M85Q13J293j94J48L017N175K084L429N951
11813B774996M693K531J703r9N082J0080P724Q16N075L206j296J404Q180L109
11799B827204N72l46K41M598O956P892L770K896K218k654J200P103N421j118P944
11784B873897M803J584m89K127M858R634N722J966J308K518L191P448L824J338
11770B923729j707N968N823L224M395L109K663K559P067L898q22K361J0318O067
11756B978652L952J145J90L839K970O657N769J800j056K273N045L060M120O392
11742C024808J796L470P792K467P26O469O461N857N188M779J890L968L974K471
11728C082116L047M150L505L956J177J792P691P095R099L785M492M078M310M847
$$ y = [2726520, 2733388, 2737936, 2743004, 2748847, 2752795, 2753280, 2754093, 2755386, 2755192, 2755340, 2758357, 2763532, 2765616, 2769045, 2774996, 2779689, 2782220, 2783923, 2783824, 2788906, 2798986, 2806710, 2807526, 2812601, 2815807, 2814511, 2815915, 2824095, 2827204, 2827776, 2827430, 2827671, 2832269, 2839225, 2847117, 2850887, 2853783, 2856001, 2853347, 2854547, 2861650, 2867071, 2865953, 2873897, 2878700, 2880284, 2879795, 2881922, 2886780, 2896414, 2902136, 2904102, 2905410, 2907928, 2911119, 2918567, 2922391, 2923729, 2922022, 2927990, 2933813, 2937037, 2941432, 2944541, 2947204, 2949763, 2956830, 2960728, 2959906, 2962267, 2972585, 2978652, 2982604, 2983749, 2983939, 2987778, 2990748, 2997405, 3003174, 3004974, 3003918, 3006191, 3011236, 3014296, 3018416, 3024808, 3026604, 3030074, 3037866, 3040333, 3041059, 3047528, 3053989, 3059846, 3065034, 3069813, 3071703, 3075671, 3079645, 3082116, 3085163, 3089313, 3092818, 3096774, 3097951, 3099743, 3107434, 3114529, 3123628, 3127413, 3131905, 3135983, 3140293, 3145140]
11714C145140P367K343L667L367M826N444L961J799M289Q375O924M077L033K281
11700C206893P162M610L231J582L238O130L042M646N592L241K618P384L515J209
11686C264093N481P351K983L591N417N807Q318J0557L901L823M444L466O055Q036
11672C343323N252N008M613M530R587P711O979P595P134L900L187M047R208P066
11658C429140J409P847P587N391P830P579O745L000Q205O425L664Q664N734R644
11644C518864Q080N459J1235J0557R557P540O85K150N346j695j779j374k982j574
11630C570069n588n636j756j288n97p41J03K914P844J1144N527M360J0963Q931
11616C606249R861J0630J1759Q601J722Q241J4883J1171J0092R781P833J2078
$$ y = [3145140, 3152507, 3154850, 3158517, 3161884, 3166710, 3172154, 3176115, 3177914, 3182203, 3190578, 3197502, 3201579, 3204612, 3206893, 3214055, 3218665, 3221896, 3223478, 3226716, 3232846, 3235888, 3240534, 3246126, 3249367, 3251985, 3259369, 3262884, 3264093, 3269574, 3276925, 3279908, 3283499, 3288916, 3294723, 3303041, 3313598, 3317499, 3321322, 3325766, 3329232, 3335287, 3343323, 3348575, 3353583, 3358196, 3362726, 3372313, 3380024, 3387003, 3394598, 3401732, 3405632, 3408819, 3412866, 3422074, 3429140, 3430549, 3438396, 3445983, 3451374, 3459204, 3466783, 3473528, 3476528, 3484733, 3491158, 3494822, 3503486, 3509220, 3518864, 3526944, 3532403, 3543638, 3554195, 3563752, 3571292, 3571977, 3574127, 3579473, 3577778, 3575999, 3574625, 3571643, 3570069, 3564481, 3558845, 3557089, 3555801, 3555204, 3554463, 3554566, 3557480, 3565324, 3576468, 3581995, 3586355, 3597318, 3606249, 3616110, 3626740, 3638499, 3647100, 3648822, 3657063, 3671946, 3683117, 3693209, 3702990, 3710823, 3722901]
11604C722901J0273P327J0814J4467J1955R632J5737J3919R887J0553J1420J1654
11592C860539P361N771J155J691l55o322n108p824j3666j4748j2981o867p456
11579C801190j1391p788o620Q3M179J0675Q851R246R203J6822K0183J1507J4038
11566C880178J7564K1500J5519J1532J6159J3874J0154J1948J5754J5341J6229
11555D045752J2570N732N601L598q21l955j434j810L34O13l181k805M824Q564
11541D073582O745Q972N241O69M316L470J229J639K545m187o682P259J0248P934
11527D122980O415J0773J6140J1940J3596J9206J3542J7524J3222J1493J6575
11516D273406J9211K0499J7043J8865J8906J7874J4789J4781J0563N433M447k73
$$ y = [3722901, 3733174, 3740501, 3751315, 3765782, 3777737, 3787369, 3803106, 3817025, 3826912, 3837465, 3848885, 3860539, 3867900, 3873671, 3874826, 3876517, 3876162, 3869840, 3864732, 3856908, 3843242, 3828494, 3815513, 3808646, 3801190, 3789799, 3782011, 3775391, 3775474, 3779653, 3790328, 3799179, 3808425, 3817628, 3834450, 3854633, 3866140, 3880178, 3897742, 3919242, 3934761, 3946293, 3962452, 3976326, 3986480, 3998428, 4014182, 4029523, 4045752, 4058322, 4064054, 4069655, 4073253, 4072432, 4068477, 4067043, 4065233, 4065567, 4066180, 4062999, 4060194, 4065018, 4073582, 4080327, 4089299, 4094540, 4095209, 4099525, 4102995, 4104224, 4105863, 4108408, 4104221, 4097539, 4104798, 4115046, 4122980, 4129395, 4140168, 4156308, 4168248, 4181844, 4201050, 4214592, 4232116, 4245338, 4256831, 4273406, 4292617, 4313116, 4330159, 4349024, 4367930, 4385804, 4400593, 4415374, 4425937, 4431370, 4435817, 4435544]
11504D435544o277j1663j6258j4897q670n928r244p492j585J417L677J0258J4122
11491D383004J0497J1320J7242K0785K1351J9931J5719J4602J0372J1682J3763
11480D550268J6246J7239R226J3289J1562Q144J0044J2059J5279J6428J6206J7104
11468D713094J2466K0512J7364J2729J5350K2271J3526J3928J4088J4078R863
11457D879269R969Q20j641J563J856j272n053j935P529N924P025Q479J3018J4929
11443D940480J4871J8714K0799J7192J6537K0270J8189J3877J3475J2246O919
11432E113569J6912J8900J1483J5588J4069J6221J3963J1883J3543J4280J7493
11421E277904J8897J7352J8852J9377J4217K0301J8148J4601J3241J8304J7780
$$ y = [4435544, 4429267, 4417604, 4401346, 4386449, 4377779, 4371851, 4362607, 4355115, 4353530, 4354947, 4358624, 4368882, 4383004, 4393501, 4404821, 4422063, 4442848, 4464199, 4484130, 4499849, 4514451, 4524823, 4536505, 4550268, 4566514, 4583753, 4592979, 4606268, 4617830, 4625974, 4636018, 4648077, 4663356, 4679784, 4695990, 4713094, 4725560, 4746072, 4763436, 4776165, 4791515, 4813786, 4827312, 4841240, 4855328, 4869406, 4879269, 4889238, 4890058, 4888417, 4889980, 4891836, 4890564, 4885511, 4883576, 4891105, 4897029, 4904054, 4912533, 4925551, 4940480, 4955351, 4974065, 4994864, 5012056, 5028593, 5048863, 5067052, 5080929, 5094404, 5106650, 5113569, 5130481, 5149381, 5160864, 5176452, 5190521, 5206742, 5220705, 5232588, 5246131, 5260411, 5277904, 5296801, 5314153, 5333005, 5352382, 5366599, 5386900, 5405048, 5419649, 5432890, 5451194, 5468974]
11410E468974J6830J8378K2646K7911K1340J7703K1161K0324J6728J9093J8817
11399E689905J6412J6611J7073J6581K0087J6759J5441J7122J6047J5681K2632
11388E880351K0989K2546J9598J7882J8905J2007J3667J5053K2229K7066K7330
11377F097623K7304K5253K2157K0620K2865K0030K5282K6860K3865K4413K5800
11366F362072K5817K3760K1057K4518K8652L1384K8887K5719K6030K7580K7698
11355F653174K1618K4323K6486L2103K5375K0195K7049K6632K2734K3057K3920
11344F926666K6068K8462K6530K8131K9272L1919L2023L4954L4730K9659K9451
11333G257865L0867L5377L4762L9990L9333L7287L8201L7617L8725M0024M2375
$$ y = [5468974, 5485804, 5504182, 5526828, 5554739, 5576079, 5593782, 5614943, 5635267, 5651995, 5671088, 5689905, 5706317, 5722928, 5740001, 5756582, 5776669, 5793428, 5808869, 5825991, 5842038, 5857719, 5880351, 5901340, 5923886, 5943484, 5961366, 5980271, 5992278, 6005945, 6020998, 6043227, 6070293, 6097623, 6124927, 6150180, 6172337, 6192957, 6215822, 6235852, 6261134, 6287994, 6311859, 6336272, 6362072, 6387889, 6411649, 6432706, 6457224, 6485876, 6517260, 6546147, 6571866, 6597896, 6625476, 6653174, 6674792, 6699115, 6725601, 6757704, 6783079, 6803274, 6830323, 6856955, 6879689, 6902746, 6926666, 6952734, 6981196, 7007726, 7035857, 7065129, 7097048, 7129071, 7164025, 7198755, 7228414, 7257865, 7288732, 7324109, 7358871, 7398861, 7438194, 7475481, 7513682, 7551299, 7590024, 7630048, 7672423]
11322G672423L9345L5370M4787M4582M0440M8446M6883M6083M7324M6010M4580
11311H156273N1811N3254M8465M3939M8408N1147N1925N3234M8357M5493N0052
11300H702358N7647N2473N2630N2466N4082N7461N4641N8860O2481O8346P0895
11289I344340O9387P3379P3976O9568P3813P4309P7794Q1122Q2060Q0728Q5695
11278A0186171R4641R4139R3239R5430R4516J01515J06335J03932J07991J09821
11268A1187730J14689J13867J22240J27015J31796J35581J40998J47844J55768
11259A2377528J57741J63720J70963J82898J89173K00531K11256K23928K40986
11250A4118724K46972K65837K88460L09533L26966L49717L80547M15683M50698
$$ y = [7672423, 7711768, 7747138, 7791925, 7836507, 7876947, 7925393, 7972276, 8018359, 8065683, 8111693, 8156273, 8208084, 8261338, 8309803, 8353742, 8402150, 8453297, 8505222, 8558456, 8606813, 8652306, 8702358, 8760005, 8812478, 8865108, 8917574, 8971656, 9029117, 9083758, 9142618, 9205099, 9273445, 9344340, 9413727, 9487106, 9561082, 9630650, 9704463, 9778772, 9856566, 9937688, 10019748, 10100476, 10186171, 10280812, 10374951, 10468190, 10563620, 10658136, 10759651, 10865986, 10969918, 11077909, 11187730, 11302419, 11416286, 11538526, 11665541, 11797337, 11932918, 12073916, 12221760, 12377528, 12535269, 12698989, 12869952, 13052850, 13242023, 13442554, 13653810, 13877738, 14118724, 14365696, 14631533, 14919993, 15229526, 15556492, 15906209, 16286756, 16702439, 17153137]
11241A7153137M95244N44063N91446O35351O74854P02417P04281O72375N73063
11232B2746231M31337K57738L2590k75938o45879j004690j297392j555965j802011
11223A6886021k009696k092977k009625j823137j601494j356200j037253o53427
11215D302212k72715M4100K92360M99174O72907P87698Q35475Q52191Q47129Q21341
11205I681872P88775P58096P36141P26004P25429P28715P53500P93061Q30830
11196A6522423Q78677R45791J025861J108990J183020J253427J295375J310455
11188B5524019J263193J127610R17688O39899L00708j46744p01477j292484j864541
11179B5767871k393834k880560l302279l574132l673102l644070l511257l253802
$$ y = [17153137, 17648381, 18192444, 18783890, 19419241, 20094095, 20796512, 21500793, 22173168, 22746231, 23177568, 23435306, 23467896, 23191958, 22546079, 21541389, 20243997, 18688032, 16886021, 14876325, 12783348, 10773723, 8950586, 7349092, 5992892, 4955639, 4302212, 4029497, 4073597, 4365957, 4865131, 5538038, 6325736, 7161211, 8013402, 8860531, 9681872, 10470647, 11228743, 11964884, 12690888, 13416317, 14145032, 14898532, 15691593, 16522423, 17401100, 18346891, 19372752, 20481742, 21664762, 22918189, 24213564, 25524019, 26787212, 27914822, 28832510, 29472409, 29773117, 29626373, 28924896, 27632412, 25767871, 23374037, 20493477, 17191198, 13617066, 9943964, 6299894, 2788637, -465165]
11171d65165k815873k243480j654336j111018o06513r3121M24087Q41547J118778
11162f605094J290658J419201J520322J566564J560669J531555J502642J481714
11154E268231J468229J453387J446646J472394J512747J528685J476627J362817
11146A6989763J196267R70833O81398K85403k07922p36554j209633j571963j849052
11137A4548540k074288k244275k322438k348504k333132k242458k055334j885754
11129b957643j859244j889588j780524j504997j215392j023572q30249n12793
11121a3574002j08847K56338N44084P75998R80297J150336J268463J341105J385130
11112e981098J404749J413615J419296J445678J492196J564486J661466J770698
$$ y = [-465165, -3281038, -5524518, -7178854, -8289872, -8896385, -8989506, -8565419, -7723872, -6605094, -5314436, -3895235, -2374913, -808349, 752320, 2283875, 3786517, 5268231, 6736460, 8189847, 9636493, 11108887, 12621634, 14150319, 15626946, 16989763, 18186030, 19156863, 19838261, 20123664, 19915742, 19179188, 17969555, 16397592, 14548540, 12474252, 10229977, 7907539, 5559035, 3225903, 983445, -1071889, -2957643, -4816887, -6706475, -8486999, -9991996, -11207388, -12230960, -13061209, -13574002, -13682849, -13426511, -12882427, -12106429, -11126132, -9975796, -8707333, -7366228, -5981098, -4576349, -3162734, -1743438, -297760, 1194436, 2758922, 4420388, 6191086]
11104F191086J887576J989022K013430J871972J514362R85380L87456j95123p89191
11095A5855970j521103k442104l397653m160962m566665m650590m505279m222459
11087a3610845l809463l262899k627646j918844j141612l50652L52068Q49928
11079b5519965J128221J246290J309369J358323J382208J371372J312448J216291
11071a5195443J103724J009573R29754Q57825P78556P03937O44576O14472O19359
11062g933667O51570O92402P30743P86860Q67533R65843J076993J177564J237050
11053B52891J236212J136560R30580O35667K45551k29151q13423j491544k156103
11044b52760k673758k972355l079182l071341k962650k675242k177536j526471
$$ y = [6191086, 8078662, 10067684, 12081114, 13953086, 15467448, 16452828, 16840284, 16645161, 15855970, 14334867, 11892763, 8495110, 4334148, -232517, -4883107, -9388386, -13610845, -17420308, -20683207, -23310853, -25229697, -26371309, -26721961, -26369893, -25519965, -24391744, -23145454, -21836085, -20477762, -19095554, -17724182, -16411734, -15195443, -14091719, -13082146, -12152392, -11294567, -10516011, -9812074, -9167498, -8553026, -7933667, -7282097, -6589695, -5858952, -5072092, -4204559, -3238716, -2161723, -984159, 252891, 1489103, 2625663, 3556243, 4191910, 4437461, 4208310, 3394887, 1903343, -252760, -2926518, -5898873, -8978055, -12049396, -15012046, -17687288, -19864824, -21391295]
11036b1391295q61334k96985J29860M66781P33103R11771R81673R62184Q89782
11027a7474460Q07326P21717O44083N85639N33601M86335M51154M22315L91333
11018a2430957L61776L42318L27258L06423K86676K72677K58043K44724K33786
11009i797276K19794K12191K04666J94438J86666J76387J69300J63570J55860
11000h114404J49525J42721J31643J31592J29275J21854J21253J16265J12478
10991f957798J05080J05354J08395J01881J00956J03159R6693R2213R3502R1694
10981e958871R5197Q8902Q1664Q4041Q5017P7253P7711P6759P4297P3546P3563
10970e070921P2249O5280O4911O7501O2790O3753N9703N5098N7102N2268N8620
$$ y = [-21391295, -22252629, -22549614, -22419754, -21952973, -21219870, -20308099, -19326426, -18364242, -17474460, -16667134, -15945417, -15301334, -14715695, -14182094, -13695759, -13244605, -12822290, -12430957, -12069181, -11726863, -11399605, -11093182, -10806506, -10533829, -10275786, -10031062, -9797276, -9577482, -9365291, -9160625, -8966187, -8779521, -8603134, -8433834, -8270264, -8114404, -7964879, -7822158, -7690515, -7558923, -7429648, -7307794, -7186541, -7070276, -6957798, -6852718, -6747364, -6638969, -6537088, -6436132, -6332973, -6236280, -6144067, -6050565, -5958871, -5863674, -5774772, -5693108, -5609067, -5524050, -5446797, -5369086, -5292327, -5218030, -5144484, -5070921, -4998672, -4933392, -4868481, -4800980, -4738190, -4674437, -4614734, -4559636, -4502534, -4450266, -4391646]
10959d391646N3489N3429N8440N3136N1198M9947M5079M9833N4074M8303N4629
10948c820089N2425N0908M7673M5955M6156M7313M2527L9571M1936M7677M6201
10937c311747M0717L9735M5604M4059L8027L7320M2406L8327L6842L8250M2054
10926b868406M1337L6759L8033L9960L8659L7962L4589L4399L3468L1732L7394
10915b464114L0369K5565K7760K5831K1948K3938K9163K3954K6269K2620K5775
10904b180922L0525L0104K6280K9804K9224K9116K9617K5769K6032K6881L1535
10893a866035L2502K7151K6167K7450K7591K8582L2164K3744K3631K2411K4899
10882a569743K0956K2836K5318L1737K7484K0374K4902L0750K3558K2047K6889
$$ y = [-4391646, -4338157, -4284728, -4226288, -4173152, -4121954, -4072007, -4026928, -3977095, -3923021, -3874718, -3820089, -3767664, -3716756, -3669083, -3623128, -3576972, -3529659, -3487132, -3447561, -3405625, -3357948, -3311747, -3271030, -3231295, -3185691, -3141632, -3103605, -3066285, -3023879, -2985552, -2948710, -2910460, -2868406, -2827069, -2790310, -2752277, -2712317, -2673658, -2635696, -2601107, -2566708, -2533240, -2501508, -2464114, -2433745, -2408180, -2380420, -2354589, -2332641, -2308703, -2279540, -2255586, -2229317, -2206697, -2180922, -2150397, -2120293, -2094013, -2064209, -2034985, -2005869, -1976252, -1950483, -1924451, -1897570, -1866035, -1833533, -1806382, -1780215, -1752765, -1725174, -1696592, -1664428, -1640684, -1617053, -1594642, -1569743, -1548787, -1525951, -1500633, -1468896, -1441412, -1421038, -1396136, -1365386, -1341828, -1319781, -1292892]
10871a292892K2479K1083K6694K9552K7705K3259K5000K0585K2148K5154K5939
10860a023294J8410K0228K0563J9625K3911K0055J5159J8703J6564K1404J9110
10849h09562K0521K0994J7297J5790K2425K2394J8012J8478J8716J5880J8130
10838f00925K3491K3974J9115K1089K2467K0984J9034K7937K3339K1003K1232
10827c57260K3941K1491K0121K4653K2286K4117K6133K1006J8411J7051J7688
10816a20362K0137J4364J0682J3752J5232J0126M974M589O344Q415O532Q893P371
10803A1049P993Q914O897J2363J1140J4021J8660J9468J9818J8964K1403J9762
10791A90452K4191K4400J7959J9565K5637J6009J8505K0823K6027K6064K5409
$$ y = [-1292892, -1270413, -1249330, -1222636, -1193084, -1165379, -1142120, -1117120, -1096535, -1074387, -1049233, -1023294, -1004884, -984656, -964093, -944468, -920557, -900502, -885343, -866640, -850076, -828672, -809562, -789041, -768047, -750750, -734960, -712535, -690141, -672129, -653651, -634935, -619055, -600925, -577434, -553460, -534345, -513256, -490789, -469805, -450771, -422834, -399495, -378492, -357260, -333319, -311828, -291707, -267054, -244768, -220651, -194518, -173512, -155101, -138050, -120362, -100225, -85861, -75179, -61427, -46195, -36069, -31095, -26506, -20162, -11747, -5215, 3678, 11049, 19042, 27956, 34853, 47216, 58356, 72377, 91037, 110505, 130323, 149287, 170690, 190452, 214643, 239043, 257002, 276567, 302204, 318213, 336718, 357541, 383568, 409632, 435041]
10780D35041K1247K2620K2792K1704K6579K5128K0041J5525J8104J4916J3081
10769F56778J5199R249K479k256J541k910p330l251l863j090k456k822j418L174
10755F61024J3096J2441J0934J3915J5799J9810K1962K3185K3530J8074J8102
10744H51872K3949K1692J8353J8948K4661K8499L2040K7747K7044K2612K6210
10733A123627K6831K3454J7725K0266J3994J2431J5611K1161J5411P560J665o62
10721A299074q280j9151j6859K488J9474J9998K0747P454O773M715O297O157Q095
10708A356982J2452J9239K1022K1103K5699K2753K2611K4409K7057J8182K1551
10697A593060L1649L0855K7820K5638K3750K3649K9002K9971K1299K6812K7721
$$ y = [435041, 456288, 478908, 501700, 523404, 549983, 575111, 595152, 610677, 628781, 643697, 656778, 671977, 681226, 683705, 681449, 682990, 680080, 672750, 669499, 665636, 664546, 662090, 659268, 657850, 661024, 674120, 686561, 697495, 711410, 727209, 747019, 768981, 792166, 815696, 833770, 851872, 875821, 897513, 915866, 934814, 959475, 987974, 1020014, 1047761, 1074805, 1097417, 1123627, 1150458, 1173912, 1191637, 1211903, 1225897, 1238328, 1253939, 1275100, 1290511, 1298071, 1299736, 1299074, 1290794, 1271643, 1254784, 1257272, 1276746, 1296744, 1317491, 1324945, 1331718, 1336433, 1342730, 1348887, 1356982, 1369434, 1388673, 1409695, 1430798, 1456497, 1479250, 1501861, 1526270, 1553327, 1571509, 1593060, 1624709, 1655564, 1683384, 1709022, 1732772, 1756421, 1785423, 1815394, 1836693, 1863505, 1891226]
10686A891226L2145L2930L7246L6620L3245L7247L5330L8293M0261M2788N3894
10675B311225O0594O9730Q8797J21432J37278R0151j18959o26292q80919m96700
10665G56337k42J57247J61822J33148J09488R1389P4859O4060N5318M9023M6172
10654A698621M3368M1118M0283L4464L2732L0696L0049K7193K3643K1212J8567
10643B041946K6384K5074K6384L0057K7714K7995L0746L5108L0309K9240K2745
10632B353702K1829J8437J9209J5886J1873P141N116J027n605r68J0450J3304
10620B471401R663J3053J6834J8150J5611K7371K6780K6919K4665K3967K5416
10609B699830K8055K5597K1815K5055K9950K9410K4882K5919K6054K0481L0098
$$ y = [1891226, 1923371, 1956301, 1993547, 2030167, 2063412, 2100659, 2135989, 2174282, 2214543, 2257331, 2311225, 2371819, 2441549, 2530346, 2651778, 2789056, 2879207, 2760248, 2133956, 1253037, 756337, 756095, 913342, 1075164, 1208312, 1317800, 1409189, 1484048, 1548108, 1603426, 1652449, 1698621, 1741989, 1783107, 1823390, 1857854, 1890586, 1921282, 1951331, 1978524, 2002167, 2023379, 2041946, 2068330, 2093404, 2119788, 2149845, 2177559, 2205554, 2236300, 2271408, 2301717, 2330957, 2353702, 2375531, 2393968, 2413177, 2429063, 2440936, 2448077, 2453193, 2454220, 2448615, 2447647, 2458097, 2471401, 2481064, 2494117, 2510951, 2529101, 2544712, 2572083, 2598863, 2625782, 2650447, 2674414, 2699830, 2727885, 2753482, 2775297, 2800352, 2830302, 2859712, 2884594, 2910513, 2936567, 2957048, 2987146]
10598B987146L4688L5961L3257L5694L4947L9293M6123M5492M9383N4897O1274
10587C458155N9540N2511M1421K5030l066l2502o2574r6932j10132j17520j14597
10576C099334j03746q4481n4820j4451J7256M1019O6421P8996P9756N2536o835
10565C170985l8971l0043R990L5224N6966O0490M7033L3593K2699J8480K1080
10554C407526K4170L0828K3824K8580K8791K5775L3243L3673K3951K1299K1098
10543C702758K3978L0496L3324L0026K8634K8119L0566K6664K1882J9252K9517
10532D005216K9580K6350K3953K3162K8888L3138L5432L4365K8951K5614K3634
10521D318283J3175J1320J8111J9734K0012K8074L6032K0676J1529J5927L2674
$$ y = [2987146, 3021834, 3057795, 3091052, 3126746, 3161693, 3200986, 3247109, 3292601, 3341984, 3396881, 3458155, 3517695, 3570206, 3611627, 3636657, 3633591, 3601089, 3538515, 3441583, 3331451, 3213931, 3099334, 2995588, 2911107, 2856287, 2841836, 2859092, 2900111, 2966532, 3045528, 3125284, 3177820, 3170985, 3132014, 3101971, 3111961, 3147185, 3204151, 3264641, 3311674, 3345267, 3367966, 3386446, 3407526, 3431696, 3462524, 3486348, 3514928, 3543719, 3569494, 3602737, 3636410, 3660361, 3681660, 3702758, 3726736, 3757232, 3790556, 3820582, 3849216, 3877335, 3907901, 3934565, 3956447, 3975699, 4005216, 4034796, 4061146, 4085099, 4108261, 4137149, 4170287, 4205719, 4240084, 4269035, 4294649, 4318283, 4331458, 4342778, 4360889, 4380623, 4400635, 4428709, 4464741, 4485417, 4496946, 4512873, 4545547]
10510D545547L2846K9819L0401K5158K2504P915P774J6620K6660K7582L6185M0622
10498D849633M0250L8110L5377K9909K4128K4576K4693K4047K3243J4646J6211
10487E144823K3553J8712K3413K4373J6421J1778J7549K8289L3900L4794L6682
10476E414287L2453L2267L3260L1420L1000K5189K9388K8310L7285M5034L9163
10465E779056M6423M4970M2942M4048L5847J8725K3670K5653K8729M4159M7464
10454F181686M5699L4229K6166J6352J8261J6384K3532L1593L3491M4947N6346
10443F528686N9733N6127N9600N5409M6497L3221K2724L0551L0826K9525L5140
10432F988039M8536M6879M8890M6168L8619L6995L4471L4189L9038M4669M5970
$$ y = [4545547, 4578393, 4608212, 4638613, 4663771, 4686275, 4694190, 4701964, 4718584, 4745244, 4772826, 4809011, 4849633, 4889883, 4927993, 4963370, 4993279, 5017407, 5041983, 5066676, 5090723, 5113966, 5128612, 5144823, 5168376, 5187088, 5210501, 5234874, 5251295, 5263073, 5280622, 5308911, 5342811, 5377605, 5414287, 5446740, 5479007, 5512267, 5543687, 5574687, 5599876, 5629264, 5657574, 5694859, 5739893, 5779056, 5825479, 5870449, 5913391, 5957439, 5993286, 6012011, 6035681, 6061334, 6090063, 6134222, 6181686, 6227385, 6261614, 6287780, 6304132, 6322393, 6338777, 6362309, 6393902, 6427393, 6472340, 6528686, 6588419, 6644546, 6704146, 6759555, 6806052, 6839273, 6861997, 6892548, 6923374, 6952899, 6988039, 7036575, 7083454, 7132344, 7178512, 7217131, 7254126, 7288597, 7322786, 7361824, 7406493, 7452463]
10421G452463M3214M3365N3983O4707O4523N0420M9561O6276P7283P6805Q2968
10410H125568P9865P0479M1336L3103L5402L7921M7796N6673O2758O0209N1060
10399H702170L0674K1082L1770N1634P6384P8732P9193O0979L8528M8837Q7816
10388I307799J01708P5667P2671J02836R4097O1857N8544L5791K8865L6484L6143
10377A0012462O5177Q6888R1579Q9998R0039Q8239R2440J01907J06399R5409R0125
10366A1010662R9045J09881J22124J26687J17595J05689J01614J06018J01972
10357A2001287J01298J05603J13383R8957P7385Q3940R0618R9257J00302J07389
10347A2979419J21727J38780J55053J50543J53543J64084J66911J59602J52353
$$ y = [7452463, 7495677, 7539042, 7593025, 7657732, 7722255, 7772675, 7822236, 7888512, 7965795, 8042600, 8125568, 8205433, 8275912, 8317248, 8350351, 8385753, 8423674, 8471470, 8528143, 8590901, 8651110, 8702170, 8732844, 8753926, 8785696, 8837330, 8913714, 8992446, 9071639, 9132618, 9171146, 9219983, 9307799, 9409507, 9485174, 9557845, 9660681, 9754778, 9816635, 9875179, 9910970, 9939835, 9976319, 10012462, 10077639, 10164527, 10256106, 10346104, 10436143, 10524382, 10616822, 10718729, 10825128, 10920537, 11010662, 11109707, 11219588, 11341712, 11468399, 11585994, 11691683, 11793297, 11899315, 12001287, 12102585, 12208188, 12321571, 12420528, 12497913, 12581853, 12672471, 12771728, 12872030, 12979419, 13101146, 13239926, 13394979, 13545522, 13699065, 13863149, 14030060, 14189662, 14342015]
10338A4342015J57881J62214J73291J79629J83286J70924J61252J78695K06965
10329A5916152K23486K20274K15028K16827K13971K14437K12470K32401K59441
10320A7924487K72762K75652K81406K86855K87446K93775L02946L04082L01846
10311B0531257L07580L28660L65142L93800M00042L97266L89852L80743L80927
10302B3875269M03199M36333M77510N13070N48829N76232O14949O80422P47116
10293B8872929P82787Q05929Q33596Q81523R22052R94503J095222J178207J256826
10284C7623574J364616J444210J414336J107722P87146J223392K056662K552109
10276D9573767K806859L088778L434261L880115M494080N251772O189739P329761
$$ y = [14342015, 14499896, 14662110, 14835401, 15015030, 15198316, 15369240, 15530492, 15709187, 15916152, 16139638, 16359912, 16574940, 16791767, 17005738, 17220175, 17432645, 17665046, 17924487, 18197249, 18472901, 18754307, 19041162, 19328608, 19622383, 19925329, 20229411, 20531257, 20838837, 21167497, 21532639, 21926439, 22326481, 22723747, 23113599, 23494342, 23875269, 24278468, 24714801, 25192311, 25705381, 26254210, 26830442, 27445391, 28125813, 28872929, 29655716, 30461645, 31295241, 32176764, 33098816, 34093319, 35188541, 36366748, 37623574, 38988190, 40432400, 41846736, 42954458, 43741604, 44964996, 47021658, 49573767, 52380626, 55469404, 58903665, 62783780, 67277860, 72529632, 78719371, 86049132]
10268H6049132Q773035J0815062J3516345J7159471K1813059K5012573J8515120
10261B01653797j1115027q6018465j49190615j12758141k5464722K0720973K5657579
10254a36514621K1265133J6724186J3168420J0551612Q625317P162595N978969
10247e3038389N121783M450803L908858L496771L166745K890721K633955K393505
10239b4975248K169157J918096J338186P88709R67078J451301J601223J516570
10231a3224928J412114J350388J304543J235707J163349J110805J057952J023387
10223c566683J016637J047225J067596J068642J077828J084507J096322J117706
10215E009780J149963J174904J181690J192437J217159J264745J335034J430552
$$ y = [86049132, 94822167, 105637229, 119153574, 136313045, 158126104, 183138677, 201653797, 190538770, 104520305, -44670310, -157428451, -182893173, -162172200, -136514621, -115249488, -98525302, -85356882, -74805270, -66179953, -59017358, -53038389, -47916606, -43465803, -39556945, -36060174, -32893429, -30002708, -27368753, -24975248, -22806091, -20887995, -19549809, -18761100, -17794022, -16342721, -14741498, -13224928, -11812814, -10462426, -9157883, -7922176, -6758827, -5648022, -4590070, -3566683, -2550046, -1502821, -435225, 633417, 1711245, 2795752, 3892074, 5009780, 6159743, 7334647, 8516337, 9708774, 10925933, 12190678, 13525712, 14956264]
10207A4956264J517350J591129J664375J741335J819109J911895K038156K198877
10199B9438490K404726K689948L073191L583518M242758N046417N967997O900546
10191F3347591P533193P388775O133698L766207N98688l641812r039704j4864024
10183F1222612j9325313k2170102k3450972k3589067k2562571k0061025j5948211
10176h5884649j0485088m942859n79896K642636N058697O586640O993525O529046
10168g4081948N657535M762483L989382L360551K877490K506269K238624K026463
10160d6663151J859799J732239J627412J537025J450496J374222J302413J231368
10152c4548177J164580J104788J030037R55107Q82890Q30417P83438P39061P04543
$$ y = [14956264, 16473614, 18064743, 19729118, 21470453, 23289562, 25201457, 27239613, 29438490, 31843216, 34533164, 37606355, 41189873, 45432631, 50479048, 56447045, 63347591, 70880784, 78269559, 84403257, 88169464, 88768152, 85126340, 76086636, 61222612, 41897299, 19727197, -3723775, -27312842, -49875413, -69936438, -85884649, -96369737, -101312596, -101892492, -99249856, -94191159, -87604519, -80610994, -74081948, -68424413, -63661930, -59672548, -56311997, -53434507, -50928238, -48689614, -46663151, -44803352, -43071113, -41443701, -39906676, -38456180, -37081958, -35779545, -34548177, -33383597, -32278809, -31248772, -30293665, -29410775, -28580358, -27796920, -27057859, -26353316]
10143b6353316O77080O54333O38314O49646O54557N99511N06127M38157M30516
10134b1105075M04275M02704M04354L88843L68217L72172L93977L79828L58688
10125a7632017L47723L39504L27875L11197K99394K94213K98180K92485K85536
10116a4835910K82692K88474K93305K95536K91471L01433L19036L32236L04554
10107a2127173K93137K87476K83330K41802J61515P4179j5474j04793j69040k01168
10097a1276209k14927k02986j58154q3612O165J10567K06071K61198K87360K76670
10087a0787857K55069K40491K38501K34459K31325K21771K16171K01642J77158
10078h771270J60981J57072J61135J55783J58181J68096J80422J88913J95080
$$ y = [-26353316, -25676236, -25021903, -24383589, -23733943, -23079386, -22479875, -21973748, -21535591, -21105075, -20700800, -20298096, -19893742, -19504899, -19136682, -18764510, -18370533, -17990705, -17632017, -17284294, -16944790, -16616915, -16305718, -16006324, -15712111, -15413931, -15121446, -14835910, -14553218, -14264744, -13971439, -13675903, -13384432, -13082999, -12763963, -12431727, -12127173, -11834036, -11546560, -11263230, -11021428, -10859913, -10785734, -10801208, -10906001, -11075041, -11276209, -11491136, -11694122, -11852276, -11935888, -11929723, -11819156, -11613085, -11351887, -11064527, -10787857, -10532788, -10292297, -10053796, -9819337, -9588012, -9366241, -9150070, -8948428, -8771270, -8610289, -8453217, -8292082, -8136299, -7978118, -7810022, -7629600, -7440687, -7245607]
10069g245607J96601K09667K08027K08770K11829K08118K00912K03018K11036
10060e387629K33248K39723K45535K47079K38545K31978K31339K54342K66535
10051c199305K75023L14270L83714M63324N37129O08803O76189O65965M65410
10042A190522p1270r49521j652797j716683j671353j900211j668586p19418J96644
10033h962673O15091O99552O62199N88744N06785M47735M12037L95322L94741
10024d240467M04819M34409M50248M54632M31260L45511J56731n1092p4645J36026
10014a552568L72204M97938N29774N33242N57715O02112O45215O49422O66374
10005C501428P31759Q42675R64600J094454J258749J399495J365448Q98084l30624
$$ y = [-7245607, -7049006, -6839339, -6631312, -6422542, -6210713, -6002595, -5801683, -5598665, -5387629, -5154381, -4914658, -4669123, -4422044, -4183499, -3951521, -3720182, -3465840, -3199305, -2924282, -2610012, -2226298, -1762974, -1225845, -617042, 59147, 725112, 1190522, 1119252, 169731, -1483066, -3199749, -4871102, -6771313, -8439899, -9159317, -8962673, -8347582, -7648030, -6985831, -6397087, -5890302, -5442567, -5030530, -4635208, -4240467, -3835648, -3401239, -2950991, -2496359, -2065099, -1719588, -1562857, -1613949, -1688594, -1552568, -1180364, -682426, -152652, 380590, 938305, 1540417, 2185632, 2835054, 3501428, 4233187, 5075862, 6040462, 7134916, 8393665, 9793160, 11158608, 12056692, 11726068]
9996A1726068j944749k127043n65292O08155k80740l171396o505233q135310p120009
9987a7515549l876686m26354J468650J958404J888627J685991J472128J261202
9979a2083587J072384R36763Q72183Q80355R25336R26281Q04856M42524r6465
9970e319370k49037Q3026L29120L19485L93775O33022Q25483R03350R23499R39804
9960b17843R51973R60523J010697J126033J301737J467320J508043J287283M68841
9951I864607m24694j27002P45251J132621J253603N96396k273009p314135j0844894
9942g391256r454479n536460l345245k941095j691960M77985J921390K273336
9934b5687784K089230J745586J404350J188813J093281J038454R85209R39551
$$ y = [11726068, 9781319, 7654276, 7088984, 7697139, 7416399, 4245003, -2260230, -10395540, -17515549, -21392235, -21818589, -20349939, -18391535, -16502908, -14816917, -13344789, -12083587, -11011203, -10074440, -9202257, -8321902, -7396566, -6470285, -5665429, -5222905, -5319370, -5568407, -5485381, -5156261, -4836776, -4443001, -3809979, -2984496, -2081146, -1157647, -217843, 734130, 1694653, 2705350, 3831383, 5133120, 6600440, 8108483, 9395766, 9864607, 9439913, 9312911, 10058162, 11190783, 12444386, 13040782, 10767773, 3453638, -7391256, -16845735, -22382195, -25727440, -28668535, -30360495, -29882510, -27961120, -25687784, -23598554, -21852968, -20448618, -19259805, -18166524, -17128070, -16142861, -15203310]
9926a5203310R33738R36226R27463Q65791O90437L14736k10955l71724j1384L20585
9916a0808397L82579M62900O16381P34349P88693P95581P76587P72895Q17502
9907d660930Q88939R30315J080757J334616J584401J587045J020501m48247k270246
9898A047151l013064l064130l642063m869130n841682n052361k540557o8472J247813
9889b5796495J599309J512952J316057J130128R59827P97267O69595N89411N78726
9880a6643223N88207N91613N86156N53697M77485L27392N9410j66661r0096J74055
9870a3541965L46064L90249L84936L51798L21275L03886K97877K93250K86524
9861a0566106K81883L03900L39757L83671M27633M72163N15451N29805M48673
$$ y = [-15203310, -14269572, -13333346, -12405883, -11540092, -10849655, -10534919, -10745874, -11117598, -11128982, -10808397, -10425818, -9962918, -9346537, -8612188, -7823495, -7027914, -6251327, -5478432, -4660930, -3771991, -2841676, -1760919, -426303, 1158098, 2745143, 3765644, 3317397, 1047151, -1965913, -5030043, -8672106, -13541236, -19382918, -24435279, -26975836, -27044308, -25796495, -24197186, -22684234, -21368177, -20238049, -19278222, -18480955, -17811360, -17221949, -16643223, -16055016, -15463403, -14877247, -14323550, -13846065, -13518673, -13459263, -13625924, -13716020, -13541965, -13195901, -12805652, -12420716, -12068918, -11747643, -11443757, -11145880, -10852630, -10566106, -10284223, -9980323, -9640566, -9256895, -8829262, -8357099, -7841648, -7311843, -6863170]
9852f863170J63775l84325r54648j072684r21685j216691j924592j903655q09891
9843a5887566K50795O15782O13756N31454M34835L62265L12704K63745K25034
9834a2277196K02926J98760J95738J86594J75521J64793J50994J40767J33221
9825a0727882J27577J20095J10988J02726R5915R7821R6417R0004Q8039Q1470
9815i716830P9341P8206P7193P1424O7566O9838O9752O2231O0001O0695O3194
9804h957389O0227M7796K9017L7963O0155P4627Q1419P4980O9433O8188O4822
9793h288762O6383P0419O9698P4125Q2668Q6327Q2328P3840O4171M2245J4806
9782g561752k0408n6273q6186r5580j00917r6846q6714o5643m0565n768J6952
$$ y = [-6863170, -6699395, -7083720, -8038368, -9111052, -10032737, -11249428, -13174020, -15077675, -15887566, -15636771, -15020989, -14407233, -13875779, -13440944, -13078679, -12765975, -12502230, -12277196, -12074270, -11875510, -11679772, -11493178, -11317657, -11152864, -11001870, -10861103, -10727882, -10600305, -10480210, -10369222, -10266496, -10170581, -10072760, -9976343, -9886339, -9798300, -9716830, -9637489, -9559283, -9482090, -9410666, -9343100, -9273262, -9203510, -9141279, -9081278, -9020583, -8957389, -8897162, -8849366, -8820349, -8782386, -8722231, -8647604, -8566185, -8491205, -8421772, -8353584, -8288762, -8222379, -8151960, -8082262, -8008137, -7925469, -7839142, -7756814, -7682974, -7618803, -7576558, -7561752, -7582160, -7638433, -7724619, -7820199, -7921116, -8017962, -8104676, -8170319, -8210884, -8216652, -8199700]
9771h199700L1232M5836N9657P3210P1765O2183N3209M8903M5072M1772L8659
9760g628202K6093K6962L3239L8347L9108M2445L9012L5508M0043L6236L3726
9749g237483L4125L3861L5223L4077L5195L3958K5034K3476K6114K9439K4709
9738f902272K2178K4512K4268K2222K0845K6961K7566K6805K6138K0476J4501
9727f645800J4540J8321J8057J7335J7813J4695J7043J7156J9947K0779K6015
9716f444099K6741K3896K2306J7708J7305J8386J4672J5884J9909J6101J7407
9705f233784J9165J8423J4956K2896K3955J5553J6478J7092J4593J8950J5899
9694f035824J4379J6558J3114J6783J6158J8816J4946J5714J1053J4070J9799
$$ y = [-8199700, -8168468, -8122632, -8062975, -7989765, -7918000, -7855817, -7802608, -7753705, -7708633, -7666861, -7628202, -7602109, -7575147, -7541908, -7503561, -7464453, -7422008, -7382996, -7347488, -7307445, -7271209, -7237483, -7203358, -7169497, -7134274, -7100197, -7065002, -7031044, -7006010, -6982534, -6956420, -6926981, -6902272, -6880094, -6855582, -6831314, -6809092, -6788247, -6761286, -6733720, -6706915, -6680777, -6660301, -6645800, -6631260, -6612939, -6594882, -6577547, -6559734, -6545039, -6527996, -6510840, -6490893, -6470114, -6444099, -6417358, -6393462, -6371156, -6353448, -6336143, -6317757, -6303085, -6287201, -6267292, -6251191, -6233784, -6214619, -6196196, -6181240, -6158344, -6134389, -6118836, -6102358, -6085266, -6070673, -6051723, -6035824, -6021445, -6004887, -5991773, -5974990, -5958832, -5940016, -5925070, -5909356, -5898303, -5884233, -5864434]
9683e864434K1431K0439J7238J3474J1982J2913J6175J3533J2108J4600J7804
9672e692737J7112J2518J3932J3465J3980J5447J9491J5090J3642J0666J1188
9661e536206J3076J2607Q836J6531J4484J0751J1534J6830J1398J2834J0388Q565
9649e388372J1752J7255K0067J7216J2208J5495J2663O556N576Q448J4467K1040
9637e225629K2312J9815J0719J1999J5465J5030J3257J5629P777R850J1418Q336
9625e064022R045O325L798l648k164j19K082J3957J6439J3763J4400J4781R091
9612d966272R552J1906J3025J1533J4691J1313J2681J1263L959Q458J4746J1602
9600d831543Q077J0562N671O858J0255J2769J2511J4906J7132J5027J7014J5613
$$ y = [-5864434, -5843003, -5822564, -5805326, -5791852, -5779870, -5766957, -5750782, -5737249, -5725141, -5710541, -5692737, -5675625, -5663107, -5649175, -5635710, -5621730, -5606283, -5586792, -5571702, -5558060, -5547394, -5536206, -5523130, -5510523, -5501687, -5485156, -5470672, -5459921, -5448387, -5431557, -5420159, -5407325, -5396937, -5388372, -5376620, -5359365, -5339298, -5322082, -5309874, -5294379, -5281716, -5275160, -5269584, -5261136, -5246669, -5225629, -5203317, -5183502, -5172783, -5160784, -5145319, -5130289, -5117032, -5101403, -5093626, -5083776, -5072358, -5064022, -5054977, -5048652, -5044854, -5048502, -5050666, -5050785, -5048703, -5034746, -5018307, -5004544, -4990144, -4975363, -4966272, -4956720, -4944814, -4931789, -4920256, -4905565, -4894252, -4881571, -4870308, -4866349, -4857891, -4843145, -4831543, -4823466, -4812904, -4807233, -4800375, -4790120, -4777351, -4764840, -4749934, -4732802, -4717775, -4700761, -4685148]
9588d685148J4851J5024J8762J8106R445R714J3280J2461N819j966L019J0050
9576d556583O31n456j9881l2597l0610k1310l543J1990K2940K5086J5919J2224
9564d581190J5294J8918J2079J1212J2628J2701Q523R510J2049J0042L784Q257
9552d446193J2343O505Q074J2557R936R982J0226J2568J1457J4577J7319J4280
9540d306369J2206J2370J3372J5886J2189J1850Q774P063O954Q190Q905K500j5186
9527d201296m2057n0668l1631j2910m304j2396m342P631J6601J6948J7800J6960
9515d283664J5482J3088J4608J5321J4450J5371J0798P867J1894J1280R884O110
9503d137511P429Q606R335L462N729J1446J1886R024J2793J0395O983R565O643
$$ y = [-4685148, -4670297, -4655273, -4636511, -4618405, -4608960, -4599246, -4585966, -4573505, -4567686, -4569652, -4566633, -4556583, -4555952, -4561408, -4581289, -4613886, -4644496, -4665806, -4669349, -4657359, -4634419, -4609333, -4593414, -4581190, -4565896, -4546978, -4534899, -4523687, -4511059, -4498358, -4489835, -4480325, -4468276, -4458234, -4454450, -4446193, -4433850, -4427345, -4419271, -4406714, -4396778, -4386796, -4376570, -4364002, -4352545, -4337968, -4320649, -4306369, -4294163, -4281793, -4268421, -4252535, -4240346, -4228496, -4219722, -4212659, -4205705, -4197515, -4188610, -4186110, -4201296, -4243353, -4294021, -4325652, -4338562, -4342866, -4355262, -4359604, -4351973, -4335372, -4318424, -4300624, -4283664, -4268182, -4255094, -4240486, -4225165, -4210715, -4195344, -4184546, -4176679, -4164785, -4153505, -4143621, -4137511, -4130082, -4121476, -4112141, -4108679, -4102950, -4091504, -4079618, -4070594, -4057801, -4047406, -4040423, -4030858, -4024215]
9490d024215R012J6905J4030Q314J0902J0082O807j259k696k804j2690j9564k3379
9477d010555k7858j8758m205N232J1721J7622J3805J0173J2908J1716J2080R580
9465c956539Q379J2471R557R028O798P613P970R807J0600N836J445O608O841N546
9451c848040P305M686Q397Q470Q730M076K093Q408O184R734P254Q650Q763P663
9437c747627L197M392L991M682J514m574q394n774j399M560P434R554O880R969
9423c711595R041K655M253J0130R501O383O807M225P409N215L036P549Q787Q257
9409c618347N596K865N570O665M434N395M570q98M638M149L153P354Q132N112
9395c551612N897K750J34O179K639K799P911P864N880M633K490J569M601Q171
$$ y = [-4024215, -4015203, -3998298, -3984268, -3975954, -3965052, -3954970, -3948163, -3949422, -3952118, -3954922, -3967612, -3987176, -4010555, -4038413, -4057171, -4061376, -4056144, -4044423, -4026801, -4012996, -4002823, -3989915, -3978199, -3966119, -3956539, -3948160, -3935689, -3926132, -3917104, -3910306, -3902693, -3894723, -3884916, -3874316, -3868480, -3867035, -3860427, -3853586, -3848040, -3840735, -3836049, -3827652, -3819182, -3810452, -3806376, -3804283, -3795875, -3789691, -3779957, -3772703, -3764053, -3755290, -3747627, -3744430, -3740038, -3736047, -3731365, -3729851, -3734425, -3742819, -3748593, -3749992, -3745432, -3737998, -3728444, -3721564, -3711595, -3702554, -3699899, -3695646, -3685516, -3676015, -3669632, -3662825, -3658600, -3651191, -3645976, -3642940, -3635391, -3626604, -3618347, -3612751, -3609886, -3604316, -3597651, -3593217, -3587822, -3583252, -3584150, -3579512, -3575363, -3572210, -3564856, -3556724, -3551612, -3545715, -3542965, -3542831, -3536652, -3534013, -3531214, -3523303, -3515439, -3509559, -3504926, -3502436, -3500867, -3496266, -3488095]
9381c488095J1474N945L232M640N143M527O29M733M826Q431L970K366M620J670
9367c421889K82R110K781M247N818M059N597J1694N552j579K998M540J441M546
9353c360803O623O388J729j858M778P165Q061Q064L487L109Q01L077L230N804
9339c300345L657J849P457L917L970O818K364P00J981N669N581M288M358N880
9325c241856O472L07M114N783L782M400K313K543M405P521P97J745R05k305n41
9310c199615M827P15K893R315P890K168N136O052L254L732M565O294L938L920
9296c134916M716N422J549Q260L776o65L061L338L893M253O819O52J863M228M101
9281c079650O136O841N299L182L193O652M047K221M260J09K071P39L756M872J007
$$ y = [-3488095, -3476621, -3470676, -3467444, -3462804, -3457661, -3453134, -3452505, -3447772, -3442946, -3434515, -3430545, -3428179, -3423559, -3421889, -3421607, -3412497, -3409716, -3405469, -3399651, -3395592, -3389995, -3378301, -3372749, -3374328, -3371330, -3366790, -3365349, -3360803, -3354180, -3347792, -3346063, -3347921, -3343143, -3335978, -3327917, -3319853, -3316366, -3313257, -3312456, -3309379, -3306149, -3300345, -3296688, -3294839, -3287382, -3283465, -3279495, -3272677, -3270313, -3269613, -3267632, -3261963, -3256382, -3252094, -3247736, -3241856, -3235384, -3235077, -3230963, -3225180, -3221398, -3216998, -3214685, -3212142, -3207737, -3200216, -3199419, -3197674, -3196769, -3199074, -3199615, -3194788, -3194073, -3191180, -3181865, -3173975, -3171807, -3166671, -3160619, -3157365, -3153633, -3149068, -3142774, -3138836, -3134916, -3130200, -3124778, -3123229, -3114969, -3111193, -3111858, -3108797, -3105459, -3101566, -3097313, -3090494, -3089842, -3087979, -3083751, -3079650, -3073514, -3066673, -3061374, -3058192, -3054999, -3048347, -3044300, -3042079, -3037819, -3037710, -3035639, -3034900, -3031144, -3026272, -3025265]
9266c025265n48M798N565K664L874M337L053J615J889N520Q626N297J11L047N334
9251b970083K187L954j144M243O866R659N290J857J046L105J029L225L995L883
9237b920888M858n2L589K389K784N731L040N624R694N062K692L812K391L578L930
9222b861766O545M137O735L532k213J130O931O177N01j024N9M424O767O159N646
9207b806260K944L920J945J089K818P772N082J717L433O163J727J609P62L338
9193b761941M398K476J727J70J859k251L246J785M041j004P70K209K758j559k68
9178b741584M794O09J425J63j251k091q92l425o14j984j780j719m589q789r075
9163b770802j946N699n562o169k181j351n034n413p29n77k477r46J287n378l526
$$ y = [-3025265, -3025813, -3021015, -3015450, -3012786, -3008912, -3004575, -3001522, -2999907, -2998018, -2992498, -2983872, -2978575, -2978464, -2975417, -2970083, -2967896, -2963942, -2965086, -2960843, -2953977, -2944318, -2939028, -2937171, -2936125, -2933020, -2931991, -2928766, -2924771, -2920888, -2916030, -2916082, -2912493, -2910104, -2907320, -2901589, -2898549, -2892925, -2883231, -2878169, -2875477, -2871665, -2869274, -2865696, -2861766, -2855221, -2851084, -2844349, -2840817, -2843030, -2841900, -2834969, -2828792, -2828291, -2829315, -2829256, -2824832, -2818065, -2811906, -2806260, -2803316, -2799396, -2797451, -2796362, -2793544, -2785772, -2780690, -2778973, -2775540, -2769377, -2767650, -2766041, -2765279, -2761941, -2757543, -2755067, -2753340, -2753170, -2751311, -2753562, -2750316, -2748531, -2744490, -2745494, -2744724, -2742515, -2739757, -2741316, -2741584, -2736790, -2736181, -2734756, -2734593, -2735844, -2737935, -2738827, -2742252, -2742866, -2744850, -2746630, -2748349, -2752938, -2761727, -2770802, -2772748, -2767049, -2772611, -2778780, -2780961, -2782312, -2787346, -2792759, -2793488, -2794065, -2796542, -2797488, -2796201, -2801579, -2805105]
9148b805105m008K343j007m230j911k823J158L825N749q05k00J01K788m14K010
9133b802529M065L317L938M99k03j794J885Q796M388M488K354J805K380N558M52
9118b760601R47J431M107j823k173m25N745R530N865K259J984Q135J510j573L13
9103b724769P365J0683K780k061j893J969L716P984N953M027K294R95M43L733
9089b676781L300J069J176L814M685L640m678K279M908P794M235J14N417O540
9075b632488j989m286P73O26Q74O964P034J663J768N749N973K744j048J071L410
9060b601162L776J911J909N581N181M464L186j39k27k4M640M216Q13L883L07p79
9044b562464K832K205N415L435J601K674N109K896l04k728L034K705k913M670
$$ y = [-2805105, -2809113, -2806770, -2807777, -2812007, -2813918, -2816741, -2815583, -2811758, -2806009, -2806814, -2807014, -2806913, -2804125, -2804539, -2802529, -2798464, -2795147, -2791209, -2790710, -2790913, -2792707, -2790822, -2782026, -2777638, -2773150, -2770796, -2768991, -2766611, -2761053, -2760601, -2759654, -2758223, -2754116, -2755939, -2758112, -2758537, -2752792, -2743262, -2737397, -2735138, -2733154, -2725019, -2723509, -2725082, -2724769, -2717404, -2706721, -2703941, -2706002, -2707895, -2705926, -2702210, -2694226, -2688273, -2684246, -2681952, -2680957, -2680514, -2676781, -2673481, -2672412, -2671236, -2667422, -2662737, -2659097, -2663775, -2661496, -2656588, -2648794, -2644559, -2644445, -2639028, -2632488, -2634477, -2638763, -2637990, -2637364, -2636490, -2629526, -2622492, -2620829, -2619061, -2613312, -2607339, -2604595, -2605643, -2604572, -2601162, -2597386, -2595475, -2593566, -2587985, -2582804, -2578340, -2575154, -2575293, -2575520, -2575544, -2570904, -2566688, -2565875, -2561992, -2561685, -2562464, -2559632, -2557427, -2552012, -2548577, -2546976, -2544302, -2539193, -2536297, -2536601, -2539329, -2536295, -2533590, -2536503, -2531833]
9030b531833N330O875M684J376J229J075K724j61m38K544NK48K808M203L104K076
9014b494151M927K872K421K080k236K454R729M269J042m701O28L475N824J0068
9000b451299L567j677l91K70J756M492J311j139l88J692O56k383J66k437N339
8985b440465O060K118M380M239K769L606M658J828M93K959L209p37K679J391M164
8970b396649L700L800M331J487j023j192L085L074n36n60k03J7O820J41m491p40
8954b378939O347O334n68J455K965L018L728L673K402j268K849M140P138K274
8940b334452l749j280J27N2N879O400j602k591k689J73Q887J118r04N546Q517
8925b310568K205q99K20M521J753n43M208P384J451P47M61Q75J235j340m60Q49
$$ y = [-2531833, -2526503, -2519628, -2514944, -2513568, -2512339, -2511264, -2508540, -2508701, -2509139, -2506595, -2506590, -2506342, -2503534, -2499331, -2496227, -2494151, -2489224, -2486352, -2483931, -2481851, -2484087, -2481633, -2471904, -2467635, -2466593, -2471294, -2470666, -2467191, -2461367, -2451299, -2447732, -2449409, -2449800, -2449530, -2447774, -2443282, -2441971, -2443110, -2443498, -2441806, -2441150, -2443533, -2443367, -2445804, -2440465, -2434405, -2432287, -2427907, -2423668, -2420899, -2417293, -2412635, -2410807, -2410314, -2407355, -2404146, -2404883, -2402204, -2400813, -2396649, -2392949, -2389149, -2384818, -2383331, -2384354, -2385546, -2382461, -2379387, -2379923, -2380483, -2380686, -2380669, -2373849, -2373708, -2378199, -2378939, -2372592, -2366258, -2366826, -2365371, -2362406, -2359388, -2355660, -2351987, -2349585, -2350853, -2348004, -2343864, -2336726, -2334452, -2338201, -2339481, -2339354, -2339302, -2333423, -2327023, -2328625, -2331216, -2333905, -2333732, -2324845, -2323727, -2324631, -2319085, -2310568, -2308363, -2309262, -2309042, -2304521, -2302768, -2303311, -2299103, -2291719, -2290268, -2289521, -2289060, -2288185, -2286950, -2288290, -2288750, -2287901]
8909b287901K412K751L598k837J376J900k10N920N231N75J101K595J861j462K839
8894b260251J500j844O09O138J479M293n90J250L63L340L692J594J030J864M732
8879b230801J36J046L316L490k16M49k013m035K66L864N024J767M510N855k37
8864b207579R46j79J272J008M399J159L052J997J684L172J672K335L746o65J07
8849b181874j268K101M905L165l211j87R17L331J581k04k761M077M202M808N748
8834b154670L96j736l471P72L444K353K031L466K833j796j743L50K040M951K812
8819b137968K584M145o40j031j365R88M537J580N598L397L210L424L71j7l849
8804b115036J582P215j602Q56K498J72K030L585K967J826L14L821J187k291J335
$$ y = [-2287901, -2285489, -2282738, -2279140, -2281977, -2280601, -2278701, -2278911, -2272991, -2267760, -2267185, -2266084, -2263489, -2261628, -2263090, -2260251, -2258751, -2260595, -2259986, -2253848, -2252369, -2248076, -2248666, -2247416, -2247053, -2243713, -2240021, -2238427, -2237397, -2235533, -2230801, -2230665, -2229619, -2226303, -2222813, -2223029, -2222580, -2224593, -2228628, -2228362, -2224498, -2219474, -2217707, -2213197, -2207342, -2207579, -2206633, -2206812, -2205540, -2204532, -2200133, -2198974, -2195922, -2193925, -2192241, -2189069, -2187397, -2185062, -2181316, -2181981, -2181874, -2183142, -2181041, -2176136, -2172971, -2176182, -2176369, -2175452, -2172121, -2170540, -2170744, -2173505, -2169428, -2165226, -2160418, -2154670, -2154274, -2156010, -2159481, -2158709, -2155265, -2152912, -2150881, -2147415, -2144582, -2146378, -2148121, -2147771, -2145731, -2140780, -2137968, -2135384, -2131239, -2131879, -2132910, -2134275, -2133287, -2128750, -2127170, -2121572, -2118175, -2114965, -2111541, -2111170, -2111187, -2115036, -2113454, -2106239, -2107841, -2106985, -2104487, -2104315, -2102285, -2098700, -2095733, -2093907, -2093593, -2089772, -2088585, -2090876, -2089541]
8789b089541J756K014J115l56M75j552N11K567O433K773l97Q25P451K369K6L188
8773b060343M02n28j506k143p22O171L883k349L141O731L742J061m032o075K858
8758b049709M173K748l88J515O198M109j359J08L557J992j791J11M280O366P17
8743b017373j350j493j706j89L226M867J289K794K52L232j798j005K936K496j356
8728b005178l98L38M092P876Q49Q07J050l160p77P89L122L580K112J176M149o81
8712a980254j79l149J718j873l212P97M003L301L906L549K480L98J661J329J989
8697a963536J875o2J513O412J348k784J274K907K210M906J491m329K85j90L143
8682a943537L493M09j189l80j862r79N150N864L618P46P78l858J620N676N524
$$ y = [-2089541, -2087785, -2085771, -2084656, -2085012, -2084537, -2086089, -2085578, -2083011, -2076578, -2073805, -2074202, -2073377, -2065926, -2063557, -2063531, -2060343, -2059941, -2060469, -2061975, -2064118, -2064840, -2058669, -2054786, -2057135, -2053994, -2047263, -2043521, -2042460, -2046492, -2052567, -2049709, -2045536, -2042788, -2043176, -2041661, -2035463, -2031354, -2032713, -2032605, -2029048, -2027056, -2028847, -2028736, -2024456, -2018090, -2017373, -2018723, -2020216, -2021922, -2022111, -2018885, -2014018, -2012729, -2009935, -2009683, -2006451, -2008249, -2009254, -2006318, -2003822, -2005178, -2005576, -2005238, -2001146, -1993270, -1992421, -1991614, -1990564, -1993724, -1994501, -1993712, -1990590, -1987010, -1984898, -1983722, -1979573, -1980254, -1980433, -1983582, -1981864, -1983737, -1986949, -1986152, -1982149, -1978848, -1974942, -1971393, -1968913, -1968515, -1966854, -1965525, -1963536, -1961661, -1961723, -1960210, -1953798, -1952450, -1955234, -1953960, -1951053, -1948843, -1943937, -1942446, -1946775, -1946490, -1946680, -1943537, -1940044, -1939635, -1940824, -1941204, -1943066, -1944045, -1938895, -1933031, -1929413, -1928667, -1927889, -1931747, -1930127, -1924451, -1918927]
8667a918927M409r93j0046n268O410L069J406K216N328J257K644K95j208j484
8653a910892O32k340O9J815M390J909M389L202q12J762K441l949j431K025M521
8638a892269K442k246Q88n287j042L058k126j075K919K077l322K82L505M637N652
8623a881907O512K292m080P61K375o264k216J532K811o89K555J785L686J816P84
8608a868247J359O345J54K702J091k738L756N612J351M404L119K444k817l28N91
8593a841202n434k655K394o72o7M255k24L319P92M189M956K978l551r80k601P04
8577a833799k813K562J788L365O050K430k552j065J798R56N451K938L873K54m615
8562a813379K020K017L340J369kM231J931L204K197k3k185o46J496o0J509j426
$$ y = [-1918927, -1914518, -1915511, -1925557, -1930825, -1924415, -1921346, -1919940, -1917724, -1912396, -1911139, -1908495, -1908200, -1909408, -1910892, -1910260, -1912600, -1912531, -1910716, -1906326, -1904417, -1900028, -1896826, -1897638, -1895876, -1893435, -1897384, -1898815, -1896790, -1892269, -1889827, -1892073, -1891185, -1896472, -1897514, -1894456, -1896582, -1897657, -1894738, -1892661, -1895983, -1895701, -1892196, -1887559, -1881907, -1875395, -1873103, -1877183, -1876422, -1874047, -1880311, -1882527, -1880995, -1878184, -1878873, -1876318, -1874533, -1870847, -1869031, -1868247, -1866888, -1860543, -1860389, -1857687, -1856596, -1859334, -1855578, -1849966, -1848615, -1844211, -1841092, -1838648, -1841465, -1841793, -1841202, -1846636, -1849291, -1846897, -1847569, -1847636, -1843381, -1843605, -1840286, -1839494, -1835305, -1830349, -1827371, -1830922, -1831902, -1834503, -1833799, -1836612, -1834050, -1832262, -1828897, -1822847, -1820417, -1822969, -1824034, -1822236, -1821280, -1815829, -1812891, -1809018, -1808764, -1813379, -1811359, -1809342, -1806002, -1804633, -1804635, -1800404, -1798473, -1795269, -1793072, -1793095, -1795280, -1795926, -1794430, -1794490, -1792981, -1794407]
8546a794407j227k457Q6L573N171j536n41N17K298M403K126k675Q09J887P123
8531a774850M65m77j187l034l854J929L789O89M357O885l67K954j108k173J614
8516a764368J852M306K26k98K490K496J040K190J038m486k092L843J437Q92n03
8501a749937k906J304L734K446k741j486k564k163K205L549q91j657N159J78L188
8486a742582K878L451M19N280j300j815j188K777L865r25O34l186m33M053M763
8471a723309J472J580K837M96L270P80k893J786J756n619k594M319J380J659K218
8456a710862N83k164k417l901P46J198M905N323K326j847l082L126J617k787K983
8441a704253M345K373J183l349n10L483K569K501m70p95K181J801j90j861J165
$$ y = [-1794407, -1795634, -1798091, -1798005, -1794432, -1789261, -1790797, -1791338, -1790821, -1788523, -1784120, -1781994, -1784669, -1783860, -1781973, -1774850, -1774385, -1774862, -1776049, -1779083, -1782937, -1781008, -1777219, -1776530, -1772173, -1765288, -1765655, -1762701, -1763809, -1765982, -1764368, -1762516, -1758210, -1757984, -1758282, -1755792, -1753296, -1752256, -1750066, -1749028, -1753514, -1755606, -1751763, -1750326, -1749434, -1749937, -1752843, -1751539, -1747805, -1745359, -1748100, -1749586, -1752150, -1754313, -1752108, -1748559, -1749450, -1751107, -1745948, -1745770, -1742582, -1739704, -1736253, -1735834, -1730554, -1731854, -1733669, -1734857, -1732080, -1728215, -1729140, -1728506, -1731692, -1732125, -1728072, -1723309, -1721837, -1720257, -1717420, -1716924, -1713654, -1712874, -1715767, -1713981, -1712225, -1717844, -1720438, -1716119, -1714739, -1713080, -1710862, -1710279, -1712443, -1714860, -1718761, -1718015, -1716817, -1711912, -1706589, -1704263, -1706110, -1709192, -1706066, -1704449, -1707236, -1704253, -1699908, -1697535, -1696352, -1699701, -1700211, -1696728, -1694159, -1691658, -1692128, -1692923, -1690742, -1688941, -1689131, -1690992, -1689827]
8426a689827J739N343J375K789J893m014j924J666M74P83K587j448J171K221J792
8411a673380K261j575J322L6L000K914j141L00l48k171m33j673l982J891L419
8396a669560K998M65L344O987L955k031r54L322J156L187K894j35j508J48L16
8381a645416q7L398N544J351j119J248J588R31j03J240J577l491k434l862nL662
8365a635978L123J063N371K459j732q80K419j075J92P51p01n35rJ594r20J835
8349a623023L745N170Q55P82m567j096J938j646j92R966K205m342k574J976K31
8334a610572O783K692J252L573j202j207m675M04O53J229K100Q69K327N47M44
8319a594783k84J077j87M421M048M854J638k315j047j148l1n55L721O062J630
$$ y = [-1689827, -1688088, -1682745, -1681370, -1678581, -1676688, -1680702, -1682626, -1680960, -1680486, -1679703, -1677116, -1678564, -1677393, -1675172, -1673380, -1671119, -1672694, -1671372, -1671336, -1668336, -1665422, -1666563, -1666263, -1666611, -1668782, -1669215, -1670888, -1674870, -1672979, -1669560, -1666562, -1666097, -1662753, -1655766, -1651811, -1653842, -1654796, -1651474, -1650318, -1647131, -1644237, -1644372, -1645880, -1645732, -1645416, -1645503, -1642105, -1636561, -1635210, -1636329, -1635081, -1633493, -1632562, -1632665, -1631425, -1629848, -1633339, -1635773, -1639635, -1639640, -1635978, -1632855, -1631792, -1626421, -1623962, -1625694, -1626574, -1624155, -1625230, -1625038, -1624287, -1624988, -1625523, -1625532, -1623938, -1624858, -1623023, -1619278, -1614108, -1613253, -1612471, -1617038, -1618134, -1616196, -1617842, -1618034, -1608068, -1605863, -1610205, -1612779, -1610803, -1610572, -1603789, -1601097, -1599845, -1596272, -1597474, -1598681, -1603356, -1602952, -1602299, -1601070, -1598970, -1598101, -1595774, -1595227, -1594783, -1595067, -1593990, -1594177, -1589756, -1585708, -1580854, -1579216, -1581531, -1582578, -1583726, -1583757, -1584312, -1580591, -1574529, -1572899]
8304a572899j010L1l312L775L591l259n75P16O46j593r41L144K519K910L112J985
8288a561160J917k342l89K080L665O91K403K074p27O97J073m314k277L91Q63L285
8272a552070J200K852M400K014J62j737J029N377M042J447j37L93o72j086o54
8257a533440O633M008L982n5J38Q236J0254N870L940L226l369n303j7360k2462
8243a535702j8271r604j413Q071K612l959J224L765Q170Q381O327L75n759n430
8229a541213L761J357J702N820M956m319J661O493K173k756M53P07l717j034N627
8214a518329O722M21K49L785O145O651N102N583L821L855l385r991j5751j9485
8200a524607j4660n197p43L672O844N528L884J683J474K860P64J839P81l10m156
$$ y = [-1572899, -1573909, -1573878, -1577190, -1573415, -1569824, -1573083, -1573658, -1572942, -1572296, -1573889, -1574830, -1571686, -1569167, -1566257, -1563145, -1561160, -1559243, -1561585, -1561974, -1559894, -1556229, -1555538, -1553135, -1551061, -1551788, -1551091, -1550018, -1554332, -1556609, -1556218, -1555355, -1552070, -1550870, -1548018, -1543618, -1541604, -1541442, -1543179, -1542150, -1536773, -1532731, -1531284, -1531421, -1531028, -1531700, -1532786, -1533440, -1526807, -1522799, -1518817, -1518872, -1518734, -1510498, -1500244, -1494374, -1490434, -1487208, -1490577, -1495880, -1513240, -1535702, -1553973, -1563577, -1564990, -1556919, -1554307, -1558266, -1557042, -1553277, -1545107, -1536726, -1530399, -1530024, -1535783, -1541213, -1537452, -1536095, -1534393, -1528573, -1523617, -1527936, -1526275, -1519782, -1517609, -1520365, -1519912, -1519205, -1522922, -1523956, -1518329, -1511607, -1511186, -1510937, -1507152, -1501007, -1494356, -1489254, -1483671, -1479850, -1475995, -1479380, -1489371, -1505122, -1524607, -1539267, -1544464, -1545207, -1541535, -1534691, -1529163, -1525279, -1523596, -1522122, -1519262, -1518498, -1516659, -1515878, -1516188, -1520344]
8185a520344j337N64M703J639n1q32k685o01J618K308K382J774K825J150l14m95
8169a507696L947N289k828J303N166J432j439j714J310j56r50M10J421N941J665
8154a486899l782K35N197L944j068P33M20J33k81j136J291P46K854k964p16O310
8138a474983K898n168r81l614o20K181O213O177K637j906J645J051J3K862L032
8123a458563j709R67M479k215K668m21j979k062N44j296M225J965Q60O27n96m53
8107a452959K350J173o14j866J130j510J836J160P09K180M10N20p52l230K302
8092a447161M542J49K701J692K597k660k00J138O66p64j303l937J530K634K856
8077a435520K271J536N15K989L239M88P42r29J981N028k397K84q23M140J956L298
$$ y = [-1520344, -1521681, -1521117, -1516414, -1514775, -1514826, -1515658, -1518343, -1518944, -1517326, -1515018, -1512636, -1510862, -1508037, -1506887, -1507201, -1507696, -1503749, -1498460, -1501288, -1499985, -1494819, -1493387, -1494826, -1496540, -1495230, -1495386, -1496336, -1495926, -1494505, -1488564, -1486899, -1490681, -1490446, -1485249, -1481305, -1482373, -1481640, -1481220, -1481087, -1481368, -1482504, -1481213, -1480467, -1477613, -1480577, -1481293, -1474983, -1472085, -1477253, -1478234, -1481848, -1482468, -1480287, -1474074, -1467897, -1465260, -1467166, -1465521, -1464470, -1464457, -1461595, -1458563, -1460272, -1459305, -1454826, -1457041, -1454373, -1454794, -1456773, -1458835, -1458291, -1459587, -1455362, -1453397, -1452537, -1451910, -1452506, -1452959, -1450609, -1449436, -1450050, -1451916, -1450786, -1452296, -1450460, -1449300, -1448591, -1446411, -1446001, -1445481, -1446233, -1449463, -1447161, -1442619, -1442470, -1439769, -1438077, -1435480, -1438140, -1438340, -1437202, -1436536, -1437300, -1438603, -1442540, -1441010, -1438376, -1435520, -1433249, -1431713, -1431198, -1428209, -1424970, -1424482, -1423740, -1424669, -1422688, -1417660, -1420057, -1419773, -1420596, -1416456, -1414500, -1411202]
8061a411202j51l115j645k878n01R96J239k79K86q6J022J411q57j875j349K215
8045a416769K319L787k25l544J239L192j62K540L455J061k858k948O61Q345P186
8030a392721k312k478l94j063j71L326O01r68J864P26l532K645L213K852J147
8015a387265k513k000Q10L592o40R0J756p21m0k45j256n573K444M21j877L55L98
7998a392264N653K179K539N63l714j903K650K785k315L395K442l82m078k291L167
7983a381574N301Q05l700k184K495M805O37q02M414j116j608Q06M54K792P63k811
7967a370523L296Q2l722J48j144M67M509J541K227j072l90L606J264k166n102
7952a366979N68K846L138L476L179k460j492L959j861L72J726J112K224M78J020
$$ y = [-1411202, -1411353, -1414468, -1416113, -1418991, -1419492, -1418496, -1417257, -1417536, -1417250, -1417336, -1416314, -1414903, -1415760, -1417635, -1418984, -1416769, -1414450, -1410663, -1410888, -1414432, -1413193, -1410001, -1410163, -1407623, -1404168, -1403107, -1405965, -1408913, -1408252, -1399907, -1392721, -1395033, -1397511, -1397905, -1398968, -1399139, -1395813, -1395212, -1396180, -1394316, -1393590, -1397122, -1394477, -1391264, -1388412, -1387265, -1389778, -1391778, -1390968, -1387376, -1388016, -1387926, -1386170, -1386891, -1386931, -1387176, -1388432, -1394005, -1391561, -1391140, -1393017, -1392662, -1392264, -1386611, -1384432, -1381893, -1381330, -1385044, -1386947, -1384297, -1381512, -1383827, -1380432, -1377990, -1378372, -1382450, -1384741, -1381574, -1376273, -1375468, -1379168, -1381352, -1378857, -1374052, -1373415, -1374217, -1369803, -1370919, -1372527, -1371721, -1371267, -1368475, -1367712, -1370523, -1367227, -1367145, -1370867, -1370719, -1371863, -1371396, -1366887, -1365346, -1363119, -1364191, -1364581, -1360975, -1359711, -1361877, -1366979, -1366411, -1363565, -1360427, -1356951, -1353772, -1356232, -1357724, -1353765, -1355626, -1355254, -1353528, -1352416, -1350192, -1349714, -1348694]
7937a348694J843L427j351k579N42k90J953M82J858j709k482N99J681l903o726
7922a355349j071J612N634K313L17J913K408q07j796k455j741R31K103j159J716
7907a345431K274n26k65J956j518Q44Q31j940N043J647p58O292M680M068K072
7892a320731k255k446j076P21L420N27N28K214K654j678k399L7m009J043J919
7877a321531k635j623J217k248J072L440L20J47J300J051j330K446K764R28j982
7862a316664P52j44K013M347L095j128l387j495O30O39j126J897r2j938M743k449
7846a310307j51J053O40K622K425k754j963J758N83L262L866K075o07n826j263
7831a304587O011N154j947j434J546L287J362J31k347J549J560J055O71q06m650
$$ y = [-1348694, -1346851, -1343424, -1344775, -1347354, -1346812, -1347102, -1345149, -1344667, -1342809, -1344518, -1347000, -1346401, -1344720, -1348623, -1355349, -1356420, -1354808, -1349174, -1346861, -1346544, -1344631, -1342223, -1343030, -1344826, -1347281, -1349022, -1348091, -1345988, -1347147, -1345431, -1343157, -1343683, -1343948, -1341992, -1343510, -1342666, -1341835, -1343775, -1338732, -1337085, -1337843, -1331551, -1326871, -1322803, -1320731, -1322986, -1325432, -1326508, -1325787, -1322367, -1321840, -1321312, -1319098, -1316444, -1318122, -1320521, -1320484, -1324493, -1323450, -1321531, -1324166, -1325789, -1324572, -1326820, -1325748, -1322308, -1321988, -1321841, -1320541, -1319490, -1320820, -1318374, -1315610, -1314682, -1316664, -1315912, -1316056, -1314043, -1309696, -1306601, -1307729, -1311116, -1312611, -1311981, -1311342, -1312468, -1310571, -1310663, -1312601, -1307858, -1310307, -1310458, -1309405, -1308765, -1306143, -1303718, -1306472, -1308435, -1306677, -1306094, -1302832, -1298966, -1296891, -1297498, -1303324, -1304587, -1298576, -1293422, -1295369, -1296803, -1295257, -1291970, -1290608, -1290477, -1292824, -1291275, -1289715, -1288660, -1287989, -1288795, -1293445]
7816a293445J846M369M574l641n156N444J780j649R18L600M943K38l445k316j539
7801a283479k67J342N24M289k97m479J544M056J975o89R30L121J802M501J289
7786a263838j306l094K54k752k005L811Q75m735J475L252K267K78m09j156K15
7771a266868J57O22J56K104J855J237j804p66j377n49j490L669K858J66K250L298
7755a254482q82p01n54J097R10J591K533m724R7J661J44m30k128j0N44L09J687
7738a253338K397l45L210P840J30K3n61k057m327j623j820l01K174j531j42N870
7722a244401Q69m4O12R13K5k164J674M979L541M184L30n19j265K85r32N08J016
7705a230389m931O91k592p19L307L782J598l131n795K237O118M965j839k178j343
$$ y = [-1293445, -1291599, -1287230, -1282656, -1286297, -1291453, -1286009, -1284229, -1285878, -1284960, -1281360, -1276417, -1276179, -1279624, -1281940, -1283479, -1283746, -1282404, -1281880, -1277591, -1277888, -1282367, -1280823, -1276767, -1274792, -1275481, -1274551, -1271430, -1269628, -1265127, -1263838, -1265144, -1268238, -1267984, -1270736, -1272741, -1268930, -1268055, -1272790, -1271315, -1268063, -1265796, -1265518, -1265927, -1267083, -1266868, -1266711, -1266089, -1265933, -1263829, -1261974, -1260737, -1262541, -1263307, -1264684, -1265233, -1266723, -1263054, -1260196, -1260030, -1257780, -1254482, -1255364, -1256065, -1256619, -1255522, -1254612, -1253021, -1250488, -1255212, -1255115, -1253454, -1253310, -1253740, -1255868, -1255878, -1255334, -1255025, -1253338, -1250941, -1251286, -1248076, -1240236, -1240106, -1240083, -1240644, -1242701, -1247028, -1248651, -1250471, -1250772, -1248598, -1250129, -1250271, -1244401, -1243532, -1243576, -1242964, -1242051, -1242026, -1244190, -1242516, -1237537, -1233996, -1229812, -1229482, -1230001, -1231266, -1230981, -1231913, -1231405, -1230389, -1235320, -1234629, -1237221, -1237940, -1234633, -1230851, -1229253, -1232384, -1238179, -1235942, -1229824, -1224859, -1226698, -1228876, -1230219]
7690a230219O09J090o31J989P86J624K75m762l227P197P277K522l421K294l380
7675a219977j987R97J096O8J583J187L04K735l73m303L410J18j064Q14N809j369
7659a210952k487j096j661k226K143K546k449k187P114R641K004k029o8q0j762
7644a203549j210O27k285R06Q74K591J963j471N47L220J30m015k258K506J594
7629a199830L49n033n272N549P268L480L31q82m23K499m910l596k789Q4K479J864
7613a198832K92j298N111K428K125L044M701r40m701k687O64R79N29L816L941
7598a180828j90j590J430l192L524N295j055O41J739m622j914r5K88k23K784l58
7582a178366J174O60k918M40K753o43k949J049L584N76J340J494k576p353N71
$$ y = [-1230219, -1229610, -1228520, -1229151, -1227162, -1226376, -1224752, -1224477, -1229239, -1232466, -1225269, -1217992, -1215470, -1218891, -1216597, -1219977, -1221964, -1220967, -1219871, -1219803, -1218220, -1217033, -1216729, -1213994, -1214367, -1218670, -1215260, -1215142, -1216206, -1215392, -1209583, -1210952, -1213439, -1214535, -1216196, -1218422, -1216279, -1213733, -1216182, -1218369, -1211255, -1201614, -1199610, -1201639, -1201707, -1201787, -1203549, -1204759, -1204132, -1206417, -1205511, -1204637, -1202046, -1200083, -1201554, -1201007, -1197787, -1197657, -1201672, -1203930, -1201424, -1199830, -1199481, -1204514, -1209786, -1204237, -1196969, -1193489, -1193158, -1194040, -1194463, -1191964, -1196874, -1200470, -1203259, -1203175, -1200696, -1198832, -1198540, -1199838, -1194727, -1192299, -1190174, -1187130, -1182429, -1183369, -1188070, -1190757, -1190093, -1189114, -1188585, -1184769, -1180828, -1181018, -1182608, -1181178, -1184370, -1180846, -1175551, -1176606, -1175965, -1174226, -1178848, -1180762, -1180857, -1180569, -1180792, -1178008, -1178366, -1177192, -1176532, -1179450, -1179010, -1176257, -1176900, -1179849, -1178800, -1175216, -1174640, -1173300, -1171806, -1174382, -1181735, -1181164]
7567a181164O180J971m65L106K754j594p19J886L80j033j597k441j320j662j45
7552a175863L102J913k903M216L496k040L723M601O65o81k15k522k485M578J451
7537a158964m144m753M266K611K895J275M642L71j574m109L078R42K687M714l09
7522a146372K472n28q353j270K457Q96j440J906K435K79n297n193J057N784M104
7507a147063J881k990M56j16l438k91J829O572J868n961n172p61L328L163K667
7492a144028L170K796K342J242j61j902k321L018M221J428j93k297k933j096J084
7477a135630j670P22M197k840k492M032K773o56J556J857N44M010K207q09K705
7462a119494k865j016K02p78m299m075J226j673R78L507J941j81l269L89j462
$$ y = [-1181164, -1174984, -1173013, -1173478, -1170372, -1167618, -1169212, -1169931, -1168045, -1167665, -1168698, -1170295, -1172736, -1174056, -1175718, -1175863, -1172761, -1170848, -1173751, -1169535, -1166039, -1168079, -1164356, -1159755, -1159090, -1159771, -1159986, -1162508, -1164993, -1160415, -1158964, -1163108, -1167861, -1163595, -1160984, -1158089, -1156814, -1152172, -1151801, -1153375, -1157484, -1154406, -1153464, -1150777, -1146063, -1146372, -1143900, -1144428, -1152781, -1154051, -1151594, -1150698, -1152138, -1150232, -1147797, -1147518, -1152815, -1158008, -1156951, -1151167, -1147063, -1145182, -1148172, -1147716, -1147832, -1151270, -1151561, -1149732, -1143160, -1141292, -1147253, -1152425, -1153186, -1149858, -1146695, -1144028, -1140858, -1138062, -1135720, -1134478, -1134639, -1136541, -1138862, -1135844, -1131623, -1130195, -1130388, -1132685, -1135618, -1136714, -1135630, -1137300, -1136578, -1132381, -1135221, -1137713, -1133681, -1130908, -1131564, -1130008, -1128151, -1127607, -1123597, -1121390, -1122199, -1119494, -1122359, -1123375, -1123173, -1123951, -1128250, -1132325, -1131099, -1132772, -1131794, -1128287, -1126346, -1126527, -1129796, -1129407, -1130869]
7447a130869L798M957m868j982J111J564K863j324l731Q138N869l168M94j040
7433a118188j254k385K261j616k329J440L284M812j844K31L89M41O79J440m7O28
7417a112058M23L86R82k269k208L649L069Q03k521l509q6M832j689j887K80L303
7401a108500k499J329l517n03K970Q01j205K419K503k633j350J760J488K417J840
7386a102680N723J928p270k985M696k011l096m44L603K976j354r78J740J013j225
7371a100364j625k697K065R634J136l702L53J786K69J319R52P66k01j864m937
7356a097110J985M55o71L54K392J936Q69l641j226P75J221O05O17L310L106n13
7340a085536M64J966J896k006j117L625j350J004Q038K230n147j528L47l109k537
$$ y = [-1130869, -1127071, -1122114, -1126982, -1128964, -1127853, -1126289, -1123426, -1124750, -1128481, -1120343, -1114474, -1117642, -1117148, -1118188, -1119442, -1121827, -1119566, -1121182, -1123511, -1122071, -1118787, -1113975, -1115819, -1115588, -1115199, -1114758, -1114079, -1112639, -1112686, -1112058, -1111635, -1111249, -1110267, -1112536, -1114744, -1111095, -1108026, -1107223, -1109744, -1113253, -1113339, -1108507, -1110196, -1112083, -1111803, -1108500, -1110999, -1109670, -1113187, -1113690, -1110720, -1109919, -1111124, -1108705, -1106202, -1108835, -1110185, -1108425, -1106937, -1104520, -1102680, -1096957, -1095029, -1102299, -1105284, -1100588, -1102599, -1105695, -1106139, -1102536, -1099560, -1100914, -1101892, -1100152, -1099139, -1100364, -1101989, -1104686, -1102621, -1092987, -1091851, -1095553, -1095200, -1093414, -1093145, -1091826, -1090874, -1090108, -1090309, -1092173, -1097110, -1095125, -1094670, -1095341, -1094987, -1092595, -1090659, -1089790, -1093431, -1094657, -1093882, -1092661, -1092056, -1091439, -1088129, -1085023, -1085536, -1085072, -1083106, -1081210, -1083216, -1084333, -1080708, -1082058, -1081054, -1073016, -1070786, -1075933, -1077461, -1077114, -1080223, -1082760]
7325a082760M17J074J710k685l915K081L017K170K457L082K805M91J380L18n100
7310a073458o032N61O930O060M61j066Q75K550o324n334N062p49m676K720K961
7295a069459J910m879m88N640N96o817M601O954r2o31J512j210k862m016P40k992
7279a071493k321K973L437L71K581L37M62k378K051M62K07M670j049k057o65L17
7263a062095n87J835M471N113L959l930l109J07M45K49J886j152j543j279p7j106
7247a056813L174K183J388J742r24l18M35J244J670o70j050j588k717r07M492
7232a048659N004l253l113J196L172j502k938o72j507J270J927K917O31j656L05
7217a046878N762J722j088k127J540r29j384J61k555q27K454K984K674K333J696
$$ y = [-1082760, -1082343, -1081269, -1079559, -1082244, -1086159, -1084078, -1081061, -1078891, -1076434, -1073352, -1070547, -1070056, -1068676, -1068358, -1073458, -1079490, -1078929, -1071999, -1065939, -1065478, -1066544, -1065669, -1063119, -1069443, -1074777, -1069715, -1070464, -1075140, -1072420, -1069459, -1067549, -1072428, -1072916, -1067276, -1066680, -1073497, -1068896, -1061942, -1062034, -1062665, -1061153, -1062363, -1065225, -1069241, -1068501, -1071493, -1073814, -1070841, -1067404, -1067033, -1064452, -1064115, -1063653, -1066031, -1063980, -1063518, -1063311, -1058641, -1059690, -1061747, -1062412, -1062095, -1062682, -1060847, -1056376, -1051263, -1047304, -1051234, -1054343, -1054236, -1053791, -1053542, -1051656, -1052808, -1054351, -1055630, -1055707, -1056813, -1053639, -1051456, -1050068, -1048326, -1049250, -1049568, -1049133, -1047889, -1046219, -1046889, -1047939, -1049527, -1052244, -1053151, -1048659, -1043655, -1046908, -1050021, -1048825, -1045653, -1047155, -1050093, -1050765, -1052272, -1051002, -1049075, -1046158, -1045527, -1047183, -1046878, -1041116, -1039394, -1040482, -1042609, -1041069, -1041998, -1043382, -1043221, -1045776, -1046603, -1044149, -1041165, -1038491, -1036158, -1034462]
7202a034462k689k048J145K215Q32k764n528J4K109J84K245Q57P94L625J725N20
7186a031226m27l696j601P49l602K491J738L029K299J502m911o52K524R63J627
7171a029193J228j344j30N242M16j87l347J167L777K747J485j315m125Q84r7K9
7155a022763n83j683N46L746k361l616j306J301K272J683l3o79l805j459o35L10
7139a029065N270K255J900l55L02J325k081m897L343L880K570J659J366J692j802
7124a012638k14N26l105j260J368K256L82j202O08k13L24k604j505M283J289j984
7108a013689J59K482J806k16K767o79j297k069k750o18k3N529O429K509q36j672
7092a002168K645k017o6J361k005k313n17L412L83l581Q57L402K934r26J953r23
$$ y = [-1034462, -1037151, -1039199, -1038054, -1035839, -1035007, -1037771, -1043299, -1043285, -1041176, -1040992, -1038747, -1037890, -1037096, -1033471, -1031746, -1031226, -1031653, -1035349, -1036950, -1036201, -1039803, -1037312, -1035574, -1032545, -1030246, -1028744, -1033655, -1034307, -1031783, -1030820, -1029193, -1027965, -1029309, -1029439, -1024197, -1023781, -1023968, -1027315, -1026148, -1022371, -1019624, -1018139, -1019454, -1023579, -1022695, -1022792, -1022763, -1023346, -1025029, -1024483, -1020737, -1023098, -1026714, -1028020, -1026719, -1024447, -1022764, -1022797, -1023476, -1027281, -1028740, -1029375, -1029065, -1023795, -1021540, -1019640, -1019995, -1019693, -1018368, -1020449, -1025346, -1022003, -1018123, -1015553, -1013894, -1012528, -1010836, -1012638, -1012852, -1012326, -1015431, -1016691, -1015323, -1013067, -1012685, -1013887, -1013279, -1013492, -1013168, -1015772, -1017277, -1012994, -1011705, -1013689, -1013530, -1011048, -1009242, -1009458, -1006691, -1007370, -1008667, -1010736, -1013486, -1014104, -1014127, -1008598, -1002169, -999660, -1000496, -1002168, -999523, -1001540, -1001606, -1000245, -1002250, -1004563, -1005080, -1001668, -1001285, -1004866, -1004009, -1000607, -997673, -998599, -996646, -997569]
7076i97569l333K070J463N59N52n19k02K138k905m98P74J794M144j647K081o52
7060i91750l553k098K352K745j245K542K434k472k787O24L33O7j620r36K048L742
7044i89574k492j583L314M625R22l159j229K299O74J128L199K375J312m6n364
7029i83599j988J869m07j049m48J34m17n98Q33n76K467M029K192k342l378J643
7013i81635K310J865k479j667N83j47j14K582J061j947j601L613J685Q97o9j024
6997i76087l761J005P30k114J298k04j829J550J420L130j322k109N103n06L434
6982i70262k94l031m140L069K910J553o865L68L552P284j233l75K735J73q588
6967i73144j355K318M7L255j146N33j640j734j43M550K337k844k118L208P10Q97
$$ y = [-997569, -1000902, -998832, -997369, -996810, -996258, -996777, -996979, -994841, -997746, -998244, -997470, -995676, -991532, -993179, -991098, -991750, -995303, -997401, -995049, -992304, -993549, -991007, -988573, -991045, -993832, -993208, -992875, -992808, -994428, -995364, -993316, -989574, -992066, -993649, -990335, -985710, -984788, -987947, -989176, -986877, -986203, -985075, -981876, -979501, -978189, -978235, -983599, -985587, -983718, -984125, -985174, -985622, -985488, -985905, -986503, -985670, -986246, -983779, -979750, -977558, -979900, -983278, -981635, -979325, -977460, -979939, -981606, -981023, -981170, -981284, -978702, -977641, -979588, -981189, -977576, -975891, -974994, -975063, -976087, -979848, -978843, -978113, -980227, -978929, -979133, -980962, -979412, -977992, -974862, -976184, -978293, -973190, -973696, -970262, -970556, -973587, -977727, -974658, -971748, -970195, -977060, -976692, -973140, -965856, -967089, -967464, -964729, -964556, -973144, -974499, -972181, -972134, -968879, -970025, -969492, -971132, -972866, -973009, -968459, -966122, -968966, -971084, -967876, -967166, -966269]
6951i66269m244J83N207J238J530O194L35j872j830k454j052k286l575L281N624
6936i59990J941j136R92J325k327j538N15J577k43k827J989N669Q20l35L28k620
6920i55860l08L175L497j82J275n53l923R08J929J900J046J918l644m75k323j97
6904i51817K262J550K003l58k461J879J145m154k683K159K778J254j24q79J205
6889i46241k477J875J699K294j57j607j956O87k277j413r16j184J369J667K658
6874i45979N24j997J185L041r84j022M031M172K28P1l930K168J049k893J978M246
6858i34112j676N00K64k552j931M418L17q48k945K645j34o1L986m39q431j860
6842i42859L817M672M91j841j839k044M24j529J223L112J605K68K257K317N40
$$ y = [-966269, -970513, -970330, -965123, -963885, -962355, -956161, -955826, -957698, -959528, -961982, -963034, -965320, -968895, -965614, -959990, -958049, -959185, -958193, -956868, -959195, -960733, -960218, -958641, -958884, -961711, -959722, -954053, -953233, -953568, -953240, -955860, -956168, -952993, -949496, -949678, -948403, -948956, -952879, -951971, -950042, -948142, -947096, -945178, -948822, -949297, -951620, -951817, -949555, -948005, -946002, -946360, -948821, -946942, -945797, -949951, -952634, -950475, -947697, -946443, -946567, -947446, -946241, -948718, -946843, -945144, -942850, -943007, -944614, -946570, -945883, -948160, -949573, -950489, -951673, -950304, -948637, -945979, -945455, -947452, -946267, -943226, -944210, -945232, -941201, -937029, -936801, -936730, -940660, -938492, -937443, -940336, -938358, -934112, -935788, -935288, -935024, -937576, -939507, -935089, -934772, -935620, -938565, -935920, -936054, -936115, -932129, -932568, -940999, -942859, -939042, -934370, -933879, -935720, -937559, -939603, -939179, -940708, -939485, -936373, -934768, -934500, -932243, -929926, -929386]
6827i29386M444k874k301K407m191l255J117M433M56L83m40J047J372J325k701
6812i28164j335j775Q43N479J541l217k216J672N2J750N41n075l779N917M614
6797i23152l55J066K748r54l065k85k597p90J508L363L357P49o95N70L99k121
6781i20254K582M096K519k846m044k280l098P02O56j234k572M00N785P534Ol062
6765i15110l082J133l37R31l902j011O65K43L380L443j505j268q06R59j468k336
6749i20071M511J303j294M255J72j630L672Q59n296J779M60k702k2Q26j123l09
6733i14610L275K63j06M807j289m012K554J146J714R99J74j554j956n12J013J603
6717i06491n242l126j843Q18l455M832N496K013J943p81j56K043M482l683m84
$$ y = [-929386, -924942, -927816, -930117, -927710, -931901, -935156, -934039, -929606, -929150, -928767, -929207, -928160, -926788, -925463, -928164, -929499, -931274, -930431, -924952, -923411, -926628, -928844, -927172, -927120, -925370, -924829, -929904, -933683, -927766, -923152, -923507, -922441, -919693, -920647, -923712, -923997, -926594, -927384, -925876, -922513, -919156, -918407, -919102, -918532, -918133, -920254, -917672, -913576, -911057, -913903, -917947, -920227, -923325, -922623, -921967, -923201, -925773, -925373, -919588, -912054, -912048, -915110, -918192, -917059, -917396, -916465, -920367, -921378, -920713, -920470, -917090, -913647, -915152, -916420, -917226, -916267, -917735, -920071, -915560, -914257, -915551, -911296, -911124, -912754, -909082, -908223, -913519, -911740, -911280, -913982, -914004, -913178, -914301, -914610, -911335, -911072, -911178, -906371, -907660, -911672, -909118, -907972, -906258, -905259, -905085, -906639, -908595, -909107, -908094, -906491, -911733, -914859, -916702, -915884, -919339, -914507, -909011, -906998, -905055, -905836, -905992, -903949, -899467, -903150, -903634]
6702i03634N690J55j427K63r45l60M181k043m728k234K824M257l137p08Q21M535
6686h96490M6J141PJ893N30j243k981j147J986N45k012L021J934L204l750n026
6670h98342j068N178K399k752l373l59j215M0L471R00L914K787j977l31K073n447
6654h94102L34K187J110O779K841M08l201n130j704P03J200K932P66N11q31m470
6638h89667l64L392M627R75j478k653k594K848L038j249r85o94k415J37K919M12
6622h83751l697n220N044L991j593M903L725l175k46O92p03r26K324J766k144
6607h79010k431M201M914j395k665l354J832K667K727J89L490j291j209N56L678
6592h67101j234k668O00K819l543o10L656K691m621n304K181L69R86k478j258
$$ y = [-903634, -897944, -897789, -899216, -898953, -899898, -900258, -896077, -898120, -902848, -905082, -902258, -898001, -901138, -901846, -901025, -896490, -896444, -895303, -895296, -893403, -892873, -894116, -897097, -898244, -896258, -895713, -897725, -894704, -892770, -889566, -893316, -898342, -899410, -894232, -891833, -894585, -897958, -898317, -899532, -899492, -896021, -895121, -891207, -888420, -890397, -890728, -888655, -894102, -893768, -891581, -890471, -883692, -880851, -880443, -883644, -888774, -890478, -889775, -888575, -885643, -884877, -884366, -885197, -889667, -890031, -886639, -882012, -881037, -882515, -885168, -887762, -884914, -881876, -883125, -884110, -884804, -887219, -887082, -884163, -883751, -887448, -892668, -887624, -883633, -885226, -880323, -876598, -879773, -880019, -879327, -880030, -880956, -878632, -876866, -879010, -881441, -877240, -872326, -873721, -876386, -879740, -877908, -875241, -872514, -872325, -868835, -870126, -871335, -870779, -867101, -868335, -871003, -870403, -867584, -871127, -871737, -868081, -865390, -870011, -875315, -873134, -872765, -871779, -874257, -875515]
6577h75515k409r84j214N78J554r64q0R58K231j299l474L302K035P55J102J668
6561h71756J2n61j240L164Q74j292J198J119J64J412m09j251M745J565o03K234
6545h60625J940k664J125j814l424j913J394K210M225k744k580l022Q86j752J101
6530h67657M36r13M131O706K256n398k764n614k186L484L634l741J72O155N676
6515h55623J859m754j665L141O88O94J726j681LJ171j153J49k574M37K270N20
6499h54792J69j615K932K15K411k783O07R7j68m30K822l228l417l79J510K91J461
6482h54297P40K357L337m962L613L435O92J545j569p318m225K973N52M523M292
6467h44312m02k908l52K218j46j190K652j204K127n85N76K9o357l430M263M190
$$ y = [-875515, -877924, -878908, -880122, -879544, -877990, -878954, -879034, -878076, -875845, -877144, -880618, -877316, -875281, -874526, -873424, -871756, -871744, -872305, -873545, -870381, -869507, -870799, -869601, -868482, -868318, -866906, -867315, -868566, -863821, -862256, -862859, -860625, -858685, -861349, -860224, -862038, -865462, -867375, -865981, -863771, -859546, -862290, -864870, -867892, -867006, -868758, -867657, -867221, -868134, -864003, -857297, -855041, -860439, -863203, -868817, -871003, -867519, -863885, -867626, -867454, -861299, -855623, -853764, -858518, -860183, -857042, -856354, -855660, -853934, -855615, -855612, -854441, -855594, -855445, -858019, -857582, -855312, -854792, -854623, -856238, -853306, -853091, -850680, -853463, -852856, -852759, -852927, -853357, -850535, -853763, -857180, -857559, -856049, -855758, -854297, -853557, -851200, -847863, -852825, -849212, -845777, -845085, -843540, -845109, -852427, -856652, -853679, -853127, -848604, -844312, -844714, -847622, -847974, -845756, -845902, -847092, -844440, -845644, -843517, -844102, -843526, -843497, -849854, -853284, -849021, -844831]
6451h44831J280J810K693k6k150k336J577o587Q14N941L591j168j5Q29J950P84
6435h35844K24k488k873J630J221j094J01n234m27O337L371j98n238r0L127l468
6419h40943N36K411M771L322l666k923o4k157j128J962K278q1Q0k188j581q1R27
6402h38525M330K311n99K838j276N98J168l473j023J292q7j742J02J013J394k056
6386h33735J183K847L251j908l264o70J351m26J618l442j600M74p1J980J951K222
6370h28239j242l916J109N180J647J00J082j509J646o58p2q27p21J554J819J590
6354h21457l423l89J291K128M039j707o62J956j072k987j288k596j846N55J619
6339h25839j225K746R92J067j245k891J532L092q07r43J023K298M881n19l239
$$ y = [-844831, -843551, -841741, -839048, -839074, -841224, -843560, -841983, -848570, -847756, -841815, -838224, -839392, -839407, -838578, -836628, -835844, -835620, -838108, -840981, -839351, -838130, -839224, -839123, -844357, -844784, -838447, -835076, -835274, -840512, -840602, -837475, -840943, -840407, -837996, -833225, -829903, -833569, -836492, -836556, -838713, -839841, -837879, -835601, -835682, -835602, -837790, -839371, -839452, -838525, -834195, -831884, -832483, -829645, -830921, -830323, -829155, -832628, -833651, -832359, -832446, -834188, -834086, -833073, -831679, -833735, -832552, -829705, -826454, -828362, -831626, -832296, -830945, -831371, -829753, -833195, -834795, -834321, -834392, -832412, -830461, -828239, -829481, -833397, -832288, -827108, -825461, -825361, -824279, -825788, -824142, -824800, -824872, -825699, -826420, -824866, -823047, -821457, -824880, -825269, -823978, -821850, -817811, -819518, -820180, -818224, -819296, -822283, -823571, -826167, -828013, -827458, -825839, -827064, -824318, -823326, -822259, -823504, -826395, -824863, -821771, -822578, -823521, -822498, -820200, -815319, -815838, -819077]
6324h19077j458j495j5L19j875l49K996R99M637J908k689q39j052K428l3Q48M51
6307h14296k73K465M87j342j82o09j676K841K618k302J707n06j880l94j019J423
6291h12938M49k642J327K127J891q75m17K439k316k165J087J073j354M289M406
6276h03619j926n907k835M011O178O4o321k612j158R54J564J140l48R04j586K08
6260h11289J356J611K547K880J162l96k763m14l272J95q25j261L760j902K31M767
6244h03613K738k953o253M32l218o78K933K740O87M1J168L393M105k357m634j29
6228h05598L358J493J110j878L1j086L475K44n187M81L020J149J556J742R50r70
6212g96110k18q80N03J861j607j151J927p98j879K643L56m34M86J716Q68r92N68
$$ y = [-819077, -820535, -822030, -822045, -821726, -823601, -823950, -820954, -819955, -815318, -813410, -816099, -816938, -817990, -815562, -815595, -814747, -814296, -814569, -812104, -811617, -812959, -813141, -813750, -815426, -812585, -809967, -812269, -810562, -811068, -812948, -813342, -814361, -812938, -812489, -815131, -813804, -811677, -809786, -810661, -811078, -808639, -810955, -813120, -812033, -810960, -812314, -808025, -803619, -805545, -811452, -814287, -810276, -804098, -804034, -810355, -812967, -814125, -813171, -811607, -810467, -810815, -809911, -811497, -811289, -809933, -808322, -805775, -802895, -801733, -802129, -804892, -805306, -808578, -808383, -809208, -810469, -806709, -808611, -808380, -803613, -800875, -803828, -810081, -809649, -812867, -813545, -810612, -807872, -807185, -807144, -805976, -802583, -798478, -800835, -805469, -805598, -802240, -800747, -799637, -801515, -801484, -802570, -799095, -798851, -804038, -803557, -800537, -799388, -797832, -796090, -795140, -796110, -796328, -797208, -796705, -794844, -796451, -797602, -795675, -796473, -798352, -795709, -795353, -795787, -795301, -793585, -792717, -793709, -793141]
6195g93141L83j328j61L032K255l196k541J473L967J614l53l097k486l86J677
6180g92288j548K060j54L706K054L08K081q62j651k962k757q98j574J555L358
6165g89572l042j381L217j837o09M48l52j229M015M665K818J918j171k632K422
6150g82322J893K073n580k7L837j603m941m993p91M387k882L50J685j862O47K027
6134g88102O480J647k055M197J470n00M82o39k764m961n00K627k714j913k434
6119g89679N081L227L617k54j021o46k819l446j939J769K374K584M906K197n281
6104g79330l069K767K365l982o88K200L434L460l53K7K255j865j779l081L212
6089g74427r43k624l024K246L076l589J338L190j846K078M15q14k895q23N07N93
$$ y = [-793141, -792758, -794086, -794247, -791215, -788960, -792156, -794697, -793224, -789257, -787643, -787996, -791093, -793579, -793965, -792288, -793836, -791776, -791930, -788224, -786170, -785862, -783781, -784643, -786294, -789256, -792013, -792911, -794485, -792930, -789572, -792614, -793995, -790778, -792615, -793224, -792776, -793128, -794357, -790342, -785677, -782859, -780941, -782112, -784744, -782322, -780429, -778356, -783936, -783963, -780126, -781729, -786670, -791663, -792454, -788067, -790949, -790599, -788914, -790776, -790129, -788102, -781622, -779975, -782030, -777833, -776363, -776863, -776381, -777020, -779784, -784745, -785245, -782618, -785332, -787245, -789679, -784598, -781371, -777754, -778008, -779029, -779675, -782494, -785940, -787879, -786110, -783736, -781152, -776246, -774049, -779330, -782399, -779632, -777267, -781249, -781937, -779737, -776303, -772843, -773196, -773169, -770914, -772779, -774558, -777639, -774427, -775370, -777994, -781018, -778772, -775696, -779285, -777947, -774757, -776603, -774525, -774110, -774924, -777819, -778642, -778135, -777542]
6073g77542K584K714r82k805q77q01J032M405P37k124k068M60L858L907O2m788
6057g72228L757Q42j014N33J272M756N26k247l720K9L122J102j551K93J25j987
6041g66390j642K39O44M544Q8n10j733k282m55J868N89k378l224j375J638L735
6025g66644R5k086o59N52M324J086M39k082K076K447K335j263j280j458J203j933
6009g62848j352K074p33r91p69j327J614J280J515k39P59K455L50Q43p98p12k106
5992g60985r55O08J662M244k95K513j805j851p66k382l574L50N127J24k059N09
5976g59535J770M68K899J090J820j558J086K076j093n197j376J73p69M775k008
5961g55379k705j05J0K393J912j554j682K647m38j152J926K280L54k71N8q83j477
$$ y = [-777542, -774958, -772244, -773226, -776031, -776908, -777709, -776677, -772272, -771535, -773659, -775727, -775267, -771409, -767502, -767440, -772228, -768471, -767629, -768643, -768110, -766838, -762082, -761556, -763803, -767523, -767494, -764372, -763270, -764821, -764528, -764403, -766390, -768032, -767793, -767149, -762605, -762517, -763027, -764760, -767042, -767497, -765629, -765040, -767418, -770642, -772017, -770379, -766644, -766549, -768635, -769294, -768742, -764418, -763332, -762893, -764975, -762899, -760452, -758117, -759380, -760660, -762118, -760915, -762848, -764200, -762126, -762859, -763850, -764619, -765946, -764332, -763052, -761537, -761776, -761017, -758562, -758212, -757369, -758167, -758879, -760985, -761940, -761332, -759670, -755426, -755721, -753208, -755013, -756864, -757630, -760012, -763586, -763236, -758109, -757985, -760044, -759535, -757765, -757297, -754398, -753308, -751488, -753046, -751960, -749884, -750977, -756174, -757550, -757377, -758146, -753371, -755379, -758084, -758189, -758179, -755786, -753874, -755428, -757110, -754463, -754901, -756053, -754127, -751847, -751493, -751764, -751706, -752589, -754066]
5944g54066j663m023j964J792j090M148K502K371M558O48J35l739p31n30M253
5929g47399K899l160p51M267J284l507K84k11O70k482J681j311J489K439O383
5914g37425K719n295l585l220j295J778J033J696J705O74J005pk197j233q43j691
5898g46181L491J59k529m234R12r10L949K815r23L632m58q39j401M28k436k769
5882g47294K595J993L28j293k191O68K444J476k55K391rJ814o28l82n07L323L48
5865g35179k915m107o02n53J749K62k590j781l296J319K884P09O84M352j148K239
5849g37973L102M345o62L526n326l186k194n161K799L578M072L554o53O46o88
5834g30221J713r48j727k298L046J06k266q70L856N370J750J752l994n844p5k808
$$ y = [-754066, -755729, -759752, -761716, -759924, -761014, -756866, -754364, -751993, -747435, -746787, -746652, -750391, -751122, -751652, -747399, -744500, -747660, -748411, -744144, -742860, -746367, -746083, -746294, -745624, -748106, -746425, -747736, -746247, -743808, -737425, -734706, -740001, -743586, -746806, -748101, -746323, -745290, -743594, -741889, -741215, -740210, -740217, -742414, -743647, -744490, -746181, -742690, -742531, -745060, -749294, -748382, -749292, -745343, -742528, -743451, -739819, -740277, -741116, -742517, -742089, -744525, -747294, -744699, -742706, -742378, -743671, -745862, -745194, -742750, -741274, -741529, -739138, -739147, -737333, -737961, -738343, -738850, -735527, -735179, -738094, -742201, -742803, -743356, -741607, -741345, -743935, -745716, -749012, -747693, -744809, -744100, -743416, -739064, -740212, -737973, -734871, -730526, -731188, -727662, -732988, -736174, -738368, -743529, -740730, -737152, -733080, -729526, -730179, -729533, -730221, -728508, -729456, -731183, -733481, -730435, -730329, -732595, -733465, -729609, -724239, -722489, -720737, -724731, -730575, -730650, -733458]
5818g33458L95r97k919o44P36J905o76K629L884m108l579M146J725K681m209k521
5802g35010j442L450M152L488l85l07r12m240J138J940j201j735k30M411L572
5787g23311j838J7j252k15o47K695J511R4K123m230p009R91L471l51P17K690M984
5770g19560R25q0k887k902m267m01M237L585k001l538l139K624M869L13J004j195
5754g22413K041J867l520l890q36m92o96L306L142J514L367l551j549j727M413
5739g19024L687j365j805n136Q34L854P35k132m299J508j093k21m25P218L646
5724g14018j831J319J824r91J369K735k145j383K351j713l129o36j946k054N74
5709g19674j17J750L540L785m62j046l900l271K1K537J653P45J572m149k736J786
$$ y = [-733458, -733063, -734060, -736979, -737623, -736887, -734982, -735658, -733029, -729145, -733253, -736832, -732686, -730961, -728280, -732489, -735010, -736452, -733002, -728850, -725362, -725747, -726054, -726966, -731206, -730068, -728128, -729329, -731064, -731294, -726883, -723311, -725149, -725132, -726384, -726599, -727246, -724551, -723040, -722946, -720823, -725053, -732062, -731071, -727600, -727951, -727234, -724544, -719560, -718635, -718715, -721602, -724504, -728771, -729172, -724935, -721350, -723351, -726889, -730028, -727404, -722535, -722222, -721218, -722413, -720372, -718505, -722025, -725915, -726751, -727243, -727939, -724633, -721491, -719977, -716610, -720161, -721710, -723437, -719024, -715337, -716702, -718507, -723643, -722809, -718955, -718220, -720352, -724651, -723143, -724236, -724457, -724882, -717664, -714018, -715849, -714530, -712706, -713697, -712328, -709593, -711738, -713121, -710770, -712483, -715612, -716248, -718194, -720248, -719674, -719791, -718041, -714501, -710716, -711178, -712224, -716124, -719395, -719374, -716837, -715184, -714439, -712867, -717016, -719752, -717966]
5693g17966J402k351o72M44L030K087k057P08K571l287q22L271M155K271k030
5678g09246l592o056j383K347L463K403M62o66l665L019K224k02P1m58J295l414
5662g13398j722n623P82L607K656K005M873L63J246J548l259k955J078Q8L358
5647g05353Q4k995r20Q54L632J803j387M031j641j919m235k462k550j566j434
5632g16058L305L707J820K751L80j93j347L601P33m703Q66k37M629j44k833M17
5616g03306p43L071j734J020J080K405J634J073K72j551m35k416l401j17N435
5601f97713J254m278j403L916K929k541k979L346K805K939j32k354n232k734L60
5586g01817L06k415N081L221l908N53J309Q43J441J769K199m15n281o869J679
$$ y = [-717966, -716564, -718915, -719587, -719143, -716113, -714026, -716083, -715375, -712804, -716091, -716913, -713642, -709487, -707216, -709246, -712838, -718894, -720277, -717930, -714467, -712064, -711602, -712268, -715933, -712914, -710690, -710892, -710821, -711279, -709984, -713398, -715120, -720743, -719961, -716354, -713698, -711693, -706820, -706457, -705211, -703663, -706922, -709877, -708799, -708711, -705353, -705269, -708264, -709184, -708330, -704698, -702895, -704282, -700251, -701892, -703811, -708046, -710508, -713058, -714624, -716058, -712753, -709046, -707226, -704475, -704095, -704288, -705635, -702034, -701301, -706004, -705138, -705375, -700746, -700890, -703723, -703306, -704049, -700978, -702712, -701692, -700612, -698207, -696573, -695500, -695228, -696779, -697214, -699630, -703031, -703148, -697713, -696459, -700737, -702140, -698224, -695295, -697836, -700815, -697469, -694664, -691725, -691857, -694211, -699443, -702177, -701817, -701511, -703926, -698845, -695624, -699532, -698979, -697670, -696827, -695386, -693617, -691418, -691833, -697114, -703983, -702304]
5571g02304M016K820n61K474M423M768J201m716k788K038P65M51r62r78k6j089
5555f90468k027j182P74K076K736k225p67k901k024K460K831L60K172j056R37
5540f88304J51L488R05k877r51j440J65j10J67K118J280p80r27j512k354P95K097
5523f88089R65R99K722m7p52j032J466P13l852j720j390k76K395j468k364n605
5507f97335O07N654M42M012K797j379l471J161N603O417j742J696k554n574k497
5492f86163l06J09k834k791M049j177p38L406K886P57m931j733J747K000m23J699
5476f84443J087J029n34n412k119O079M141k52r40J175L490K020j226l42l083
5461f79330k823J273O48j667R38K361L139j267j965o7p1j25J695J278K187k278
$$ y = [-702304, -698288, -695468, -696029, -693555, -689132, -684364, -683163, -687879, -690667, -688629, -687864, -687413, -688375, -689353, -689379, -690468, -692495, -693677, -692903, -690827, -688091, -690316, -691083, -693984, -696008, -693548, -690717, -690357, -688185, -689241, -688304, -688153, -684665, -683760, -686637, -687588, -689028, -688863, -688973, -688806, -686688, -685408, -686188, -687115, -688627, -690981, -690186, -688089, -687124, -686125, -683403, -683450, -684202, -685234, -683768, -683055, -686907, -688627, -690017, -690293, -687898, -689366, -691730, -697335, -696728, -691074, -690632, -686620, -683823, -685202, -688673, -687512, -681909, -675492, -677234, -675538, -678092, -683666, -686163, -686469, -686360, -689194, -691985, -687936, -689113, -689851, -686445, -683559, -682802, -687733, -689466, -687719, -685719, -686142, -684443, -683356, -682327, -682861, -688273, -690392, -684313, -680172, -680424, -681364, -680189, -676699, -674679, -675905, -676247, -679330, -682153, -680880, -680232, -681899, -680961, -678600, -675461, -676728, -678693, -678760, -678831, -678956, -677261, -675983, -673796, -676074]
5445f76074L67k317J350L598n8m33Q38l487J750Q37p18J793j410j403q64K44r45
5428f76932J568k78L031M463L251k499l453k923k553k612l088J160K711J665q44
5413f77333M183N339m061k696J052j06N73n56k291L97j708J34J683L797L888j159
5397f68864l771N00L485j41r84J885M243j190m575j10k66L09j968l67m130J706
5381f74238M832J506r62j759k301J874M201n43m102K023K725j950r71J969K261
5366f65435K617K540J325L73m296k160O53P37K240k088o46j955k934j079J984
5351f68124J317N35J192K119M000J892J133k197m828l90L08j515J582K107N828
5336f55041L806k390l808j099k976j756K041R09j427k289K81k349K886M139J115
$$ y = [-676074, -675707, -678024, -676674, -673076, -673134, -673567, -672729, -676216, -674466, -673629, -674347, -672554, -673964, -675367, -676231, -675987, -676932, -675364, -675642, -672611, -668148, -664897, -667396, -670849, -673772, -676325, -678937, -682025, -680865, -678154, -676489, -677333, -673150, -667811, -671872, -674568, -673516, -673622, -673049, -673605, -675896, -675499, -677207, -677073, -675390, -671593, -667705, -668864, -672635, -672135, -668650, -668791, -669775, -667890, -663647, -664837, -669412, -669522, -669788, -669479, -671447, -671814, -675944, -674238, -669406, -667900, -668862, -670621, -672922, -671048, -666847, -667390, -671492, -669469, -666744, -668694, -669665, -667696, -665435, -662818, -660278, -658953, -658580, -662876, -665036, -664383, -663646, -661406, -663494, -664140, -666095, -669029, -670108, -668124, -666807, -666272, -665080, -662961, -658961, -657069, -655936, -658133, -662961, -663351, -663043, -664558, -662976, -660869, -655041, -651235, -653625, -657433, -658532, -661508, -663264, -661223, -660314, -661741, -664030, -663749, -666098, -663212, -659073, -657958]
5321f57958J169j226j894J155k897P89K78j072l425k460K994O024j939J943k75
5306f58794j588J316K326L82N32k366l269l885j168K10J007J469J358L716q39
5291f59593m127r17L529J114L159L533j871M08l151j42K439j744j840k72R01J074
5275f57500K973k248l59L781J979O51K53j343l097K687K168j063j832k35j217
5260f54402P96o88J026k461r98L658j08m296j340r81K020M443N320J270n07K472
5244f44776k845n641k9M127J879k946K132K9k485j579j329P22N497J643n245k39
5228f51085M27J267q16J25Q54J499j76n664l772k595%J806K324L781j507l856
5212f57388L376q12j319j688L929L084J959j558Q22L760L284O09N7j339j852l19
$$ y = [-657958, -656789, -658015, -659909, -658754, -661651, -660862, -660584, -661656, -665081, -667541, -664547, -658523, -660462, -658519, -658794, -660382, -659066, -656740, -656358, -655826, -658192, -661461, -665346, -666514, -666304, -665297, -663828, -662470, -658754, -659593, -663720, -664637, -661108, -659994, -656835, -653302, -655173, -654765, -657916, -658058, -655619, -657363, -659203, -659475, -658574, -657500, -654527, -656775, -657134, -653353, -651374, -650723, -650470, -651813, -654910, -652223, -650055, -651118, -652950, -653185, -654402, -653606, -654294, -653268, -655729, -656727, -653069, -653177, -657473, -658813, -659794, -657774, -653331, -648011, -646741, -647248, -644776, -647621, -653262, -653291, -649164, -647285, -650231, -648099, -648070, -650555, -652134, -653463, -652741, -647244, -645601, -650846, -651085, -650658, -649391, -650207, -650082, -649228, -647729, -647905, -653569, -657341, -659936, -659936, -658130, -655806, -652025, -653532, -657388, -654012, -654824, -656143, -657831, -653902, -650818, -648859, -650417, -649595, -645835, -642551, -641942, -641885, -643224, -645076, -645395]
5196f45395j8P24K851J696k014q66j626J444J358O44k62k606j299k325J713O81
5180f45300k367n51J940k219L089J259L759j470l947K575j85o1p71P54q17k248
5164f46560M204O70o211k16P656M436J076M964l846l444m059j343L494M98k197
5149f40878Q56j229Q12j671K656m23J477M411J708k208r32j685k703j014J753
5134f39070L242J087J424K641l358k470q30K490L26j56J365j21n247j326M77M80
5118f39046J033l16M353k466M92O88m304J646J034N71J701j188r56L155P2k343
5102f35874L645P314J741m142m257k47q25o51N64k839M05L740l051k324J181J644
5086f33976J301j423k513q03r6J939n223M59M901N839J751j436R12R09j268j930
$$ y = [-645395, -645413, -644689, -641838, -640142, -642156, -643022, -644648, -643204, -641846, -641202, -641464, -644070, -645369, -647694, -645981, -645300, -647667, -648218, -646278, -648497, -645408, -644149, -640390, -641860, -645807, -643232, -643417, -643478, -644249, -643495, -644312, -646560, -642356, -641686, -647897, -648113, -640457, -636021, -634945, -629981, -633827, -637271, -641330, -642673, -639179, -638681, -640878, -640022, -641251, -640439, -642110, -639454, -639877, -638400, -633989, -632281, -634489, -635421, -637106, -639809, -640823, -639070, -635828, -634741, -633317, -630676, -634034, -636504, -637334, -634844, -634518, -634674, -633309, -633430, -638677, -640003, -639526, -639046, -638013, -638329, -633976, -636442, -635950, -635262, -639566, -637920, -636886, -636315, -634614, -635802, -636758, -633603, -633531, -635874, -632229, -624915, -623174, -627316, -631573, -631820, -632645, -633296, -632732, -635571, -635166, -631426, -634477, -636801, -635620, -633976, -632675, -634098, -636611, -637414, -637510, -635571, -640794, -640335, -635434, -629595, -627844, -629280, -628368, -627459, -628727, -630657]
5070f30657j888P42K83J487L206K812J592j867J46J317k438k633o231k641P63
5055f36007K350K728J845p8K673k276j420l053j322J804K262q63O82L06L817O49
5039f25903l067l363Q29J271l950k251L181J513j845l903R84L020O641K002l684
5024f28525m059q57J91K2M08M83j253r46M1j52K552O033N659N09R95o289m792
5007f29980r9M105M217J394K452k397j844l85M693j08m081j832n07j365k13L686
4991f22264P26k111N160J74k610m994k865L601k12r42K527J451K816K912N42j878
4975f17967l584k608R93J628l350l540r68K647M137J989K00n37K449j537m549
4960f24597K681K349k716k198L903K23K811K633k45k098J61j18K60o84j926m892
$$ y = [-630657, -632545, -631803, -631520, -630033, -626827, -624015, -622423, -624290, -624144, -622827, -625265, -627898, -634129, -636770, -636007, -633657, -630929, -629084, -629162, -626489, -628765, -630185, -633238, -634560, -632756, -630494, -631357, -630675, -630369, -626552, -625903, -628970, -632333, -631504, -630233, -634183, -636434, -633253, -631740, -633585, -637488, -636504, -633484, -626843, -624841, -628525, -632584, -633441, -633250, -633228, -632820, -632337, -633590, -634536, -634495, -634647, -632095, -626062, -620403, -619894, -618899, -625188, -629980, -630079, -625974, -621757, -620363, -617911, -620308, -622152, -622537, -617844, -617952, -622033, -623865, -624372, -625737, -625950, -622264, -621538, -623649, -618489, -618315, -620925, -625919, -628784, -625183, -625395, -626337, -623810, -622359, -619543, -616631, -616089, -617967, -621551, -624159, -623166, -621538, -624888, -628428, -629396, -626749, -622612, -620623, -620423, -620960, -618511, -620048, -624597, -621916, -619567, -622283, -624481, -620578, -620355, -617544, -614911, -615156, -617254, -617093, -617211, -616951, -617635, -619561, -624453]
4944f24453j296L813K902K522M334j180k87L524j606l70J585k736m206j44Q88
4929f16710o55M073J032j67q07Q0l930m870K679K650J361J439L337L042j265n139
4913f13850k205O26k433K015r7q71j03K190M437N82j970k496J322J46N6j94O53
4896f12192K10K927j668N19K851j34Q77k388l034k68r38m9J826j00j566O50J629
4879f10848j112L17j002M43K352q66J6K315o50Q88J290J293m10j126q11j556r15
4862f10382L412K263j484l476j718j56o23k666K849l18j133M97M002j250qM855
4846f05336j156k084n21k289M024L440n24M36l43K738M060k292j885n37j34l616
4830f06019k287l315k270J77N661L42k349M062N270k699m210J658J977j773p18
$$ y = [-624453, -625749, -621936, -619034, -616512, -612178, -613358, -613645, -610121, -611727, -612097, -610512, -613248, -617454, -617598, -616710, -617365, -613292, -612260, -612427, -613234, -613154, -617084, -621954, -619275, -616625, -615264, -613825, -610488, -607446, -608711, -613850, -616055, -615429, -617862, -615847, -615944, -616815, -616918, -614728, -610291, -609709, -611679, -614175, -612853, -612707, -612651, -612845, -612192, -611982, -609055, -610723, -610204, -607353, -607487, -606610, -608998, -612032, -612300, -613238, -613287, -611461, -611561, -613127, -612477, -610848, -611960, -611643, -612645, -612202, -609850, -610716, -610700, -608385, -609035, -608147, -606857, -605564, -605974, -607100, -607911, -609467, -610382, -606970, -604707, -606191, -609667, -611385, -611541, -612164, -614830, -611981, -612299, -613432, -612935, -608933, -610183, -610191, -605336, -606492, -608576, -609097, -611386, -607362, -603922, -604446, -604010, -604353, -601615, -597555, -599847, -601732, -602269, -602403, -606019, -608306, -611621, -613891, -613714, -608053, -607711, -610060, -605998, -600728, -603427, -607637, -605979, -604002, -605775, -606493]
4815f06493J042L073Q93j247j692n88j47q88L157L968j65l782O84l162r71K597
4799f03721J174N499m55l960R19j319l503J512q29m420k45L279J773K23M621Q91
4783e98561k746j98j252N71J228Q99R15K498j135j407J429j886l389j530L50P976
4767e96238P54k376j674k890L283M995r73l774O49k108k888J322K047q70L47N28
4751e99866j193K84j034k192J914K169K486q02P33M048J607P55l990k808J110
4736e96779K331n324Q66L721j347j82j926n6K169J128J552K494L05j661R04J561
4720e90244O35r06Q36l690l40N3J516J073K581n53k576K86j962l417l012K915
4704e96805K884L16m29j172J668J820j216j768j13L059K631K92k856N23J715j44
$$ y = [-606493, -605451, -602378, -601485, -602732, -604424, -605012, -605159, -606047, -602890, -598922, -599087, -602869, -602185, -605347, -606318, -603721, -602547, -597048, -597503, -601463, -600544, -601863, -605366, -603854, -604683, -609103, -609348, -606069, -604296, -604073, -599452, -598561, -601307, -601505, -602757, -602186, -600958, -600059, -599144, -596646, -597781, -599188, -597759, -599645, -603034, -604564, -604214, -596238, -595484, -597860, -599534, -602424, -599141, -594146, -595119, -598893, -598244, -600352, -603240, -601918, -599871, -600741, -600394, -599866, -601059, -600775, -601809, -604001, -602087, -599918, -597432, -598234, -597501, -593453, -591846, -591091, -595081, -597889, -596779, -594448, -599772, -598906, -595185, -596532, -596714, -598640, -598696, -596527, -595399, -593847, -591353, -591048, -592709, -591805, -590244, -589609, -590515, -589679, -593369, -593709, -593656, -592140, -591067, -588486, -589039, -591615, -591329, -593291, -596708, -599720, -596805, -593921, -593605, -594034, -595206, -593538, -591718, -592934, -594702, -594815, -591756, -589125, -588833, -591689, -591166, -589451, -589595]
4688e89595M423K109n047n425j115L051J699l85k147k259J49J500L228N829Q61
4673e83124l122l88l027J365J116R49J22L444q46k884j762r22l42J568J4n24l586
4656e91949k911J792O099O964J675k610j060j319k172j694l212m70J633K240J294
$$ y = [-589595, -585172, -583063, -588110, -593535, -594650, -591599, -589900, -590285, -592432, -594691, -594542, -593042, -589814, -583985, -583124, -586246, -586634, -589661, -588296, -587180, -586231, -586109, -582665, -583511, -586395, -588157, -589079, -589421, -587853, -587839, -588363, -591949, -594860, -593068, -586969, -580005, -578330, -580940, -582000, -583319, -585491, -587185, -590397, -590867, -589234, -586994, -585700]
$$ [...]
##END NTUPLES=NMR SPECTRUM
##END=
