##TITLE=Analysis number 328563
Compound Code btb 10370
Project Code adrs
Chemist Name asdi
##JCAMPDX= 6.0         $$ Bruker NMR JCAMP-DX V2.0
##DATA TYPE= NMR SPECTRUM
##DATA CLASS= NTUPLES
##ORIGIN= Bruker BioSpin GmbH
##OWNER= nmr
$$ XWIN-NMR		Version 3.5
$$ Tue Jun 19 09:35:00 2007 GMT Daylight Time (UT+1h)  MAYBRIDGE\nmr@NMR_250MHZ
##.OBSERVE FREQUENCY= 250.131544655141
##.OBSERVE NUCLEUS= ^1H
##.ACQUISITION MODE= SIMULTANEOUS (DQD)
##.ACQUISITION SCHEME= undefined
##.AVERAGES= 16
##.DIGITISER RES= 18
##SPECTROMETER/DATA SYSTEM= dpx250
##.PULSE SEQUENCE= zg30
##.SOLVENT NAME= CDCl3
##.SHIFT REFERENCE= (INTERNAL, CDCl3, 0, 16.522)
##AUDIT TRAIL= $$ (NUMBER, WHEN, WHO, WHERE, WHAT)
$$ ##TITLE= Audit trail, XWIN-NMR		Version 3.5
$$ ##JCAMPDX= 5.01
$$ ##ORIGIN= Bruker BioSpin GmbH
$$ ##OWNER= nmr
$$ C:\u/data/dgb/nmr/ADRS/1020/pdata/1/auditp.txt
$$ ##AUDIT TRAIL=  $$ (NUMBER, WHEN, WHO, WHERE, WHAT)
(   1,<2007-06-19 09:34:36.14 +100>,<MAYBRIDGE\nmr>,<NMR_250MHZ>,
      <created by zg, POWCHK disabled, PULCHK disabled
       configuration hash MD5:
       76 6E 9A 78 1E 09 19 81 EC 84 63 8F B0 6A 59 2D
       data hash MD5: 64K
       7F 3C 09 72 66 3C C4 A6 A0 DF C4 84 DF E8 08 A2>)
(   2,<2007-06-19 09:34:50.68 +100>,<MAYBRIDGE\nmr>,<NMR_250MHZ>,
      <Start of raw data processing
       ef LB = 0.3 FT_mod = 6 PKNL = 1 SI = 32K 
       data hash MD5: 32K
       7A B6 57 50 FA ED 23 FA F0 81 5F DE BA 63 C6 34>)
(   3,<2007-06-19 09:34:52.51 +100>,<MAYBRIDGE\nmr>,<NMR_250MHZ>,
      <apk 
       data hash MD5: 32K
       BE 5F 44 81 58 8D 97 D8 58 9B 93 93 D3 9C 69 AA>)
(   4,<2007-06-19 09:34:53.37 +100>,<MAYBRIDGE\nmr>,<NMR_250MHZ>,
      <abs ABSG = 5 
       data hash MD5: 32K
       07 37 A7 93 ED BF D3 CA E4 BD 9A 7C 8E 08 CD 43>)
$$ ##END=
$$ 
$$ hash MD5
$$ DB E6 DD 4E FC 24 FB 6F BF BD E0 7D 55 33 6A CC
##$RELAX= 
##$RELAX= 
##$RELAX= 
##$RELAX= 
##$RELAX= 
##$RELAX= 
##$RELAX= 
$$ Bruker specific parameters
$$ --------------------------
##$DU= <C:\u>
##$EXPNO= 1020
##$NAME= <ADRS>
##$PROCNO= 1
##$TYPE= <nmr>
##$USER= <dgb>
##$AMP= (0..31)
100 100 100 100 100 100 100 100 100 100 100 100 100 100 100 100 100 100 
100 100 100 100 100 100 100 100 100 100 100 100 100 100 
##$AQSEQ= 0
##$AQ_mod= 3
##$AUNM= <au_zg>
##$AUTOPOS= <51 >
##$BF1= 250.13
##$BF2= 250.13
##$BF3= 250.13
##$BF4= 250.13
##$BF5= 500.13
##$BF6= 500.13
##$BF7= 500.13
##$BF8= 500.13
##$BYTORDA= 1
##$CFDGTYP= 0
##$CFRGTYP= 5
##$CHEMSTR= <none>
##$CNST= (0..31)
1 1 145 1 1 1 1 1 1 1 1 1 1 1 1 1 1 1 1 1 1 1 1 1 1 1 1 1 1 1 1 1 
##$CPDPRG= <>
##$CPDPRG1= <>
##$CPDPRG2= <>
##$CPDPRG3= <>
##$CPDPRG4= <mlev>
##$CPDPRG5= <mlev>
##$CPDPRG6= <mlev>
##$CPDPRG7= <mlev>
##$CPDPRG8= <mlev>
##$CPDPRGB= <>
##$CPDPRGT= <>
##$D= (0..31)
0 1 0 0 0 0 0 0 0 0.06 0 0 0 0 0 0 0.0002 0 0 0 0 0 0 0 0 0 0 0 0 0 0 
0 
##$DATE= 1182242075
##$DBL= (0..7)
120 120 120 120 120 120 120 120 
##$DBP= (0..7)
150 150 150 150 150 150 150 150 
##$DBP07= 0
##$DBPNAM0= <>
##$DBPNAM1= <>
##$DBPNAM2= <>
$$ [...]
##$SUBNAM7= <"">
##$SUBNAM8= <"">
##$SUBNAM9= <"">
##$SW= 20.6930455092707
##$SWIBOX= (0..15)
0 0 3 0 0 0 0 0 0 0 0 0 0 0 0 0 
##$SW_h= 5175.983436853
##$TD= 65536
##$TD0= 1
##$TE= 296.16
##$TE2= 300
##$TE3= 300
##$TEG= 300
##$TL= (0..7)
0 120 120 120 120 120 120 120 
##$TP= (0..7)
150 150 150 150 150 150 150 150 
##$TP07= 0
##$TPNAME0= <>
##$TPNAME1= <>
##$TPNAME2= <>
##$TPNAME3= <>
##$TPNAME4= <>
##$TPNAME5= <>
##$TPNAME6= <>
##$TPNAME7= <>
##$TPOAL= (0..7)
0.5 0.5 0.5 0.5 0.5 0.5 0.5 0.5 
##$TPOFFS= (0..7)
0 0 0 0 0 0 0 0 
##$TUNHIN= 0
##$TUNHOUT= 0
##$TUNXOUT= 0
##$USERA1= <user>
##$USERA2= <user>
##$USERA3= <user>
##$USERA4= <user>
##$USERA5= <user>
##$V9= 5
##$VALIST= <valist>
##$VCLIST= <CCCCCCCCCCCCCCC>
##$VD= 0
##$VDLIST= <DDDDDDDDDDDDDDD>
##$VPLIST= <PPPPPPPPPPPPPPP>
##$VTLIST= <TTTTTTTTTTTTTTT>
##$WBST= 1024
##$WBSW= 4
##$XGAIN= (0..3)
0 0 0 0 
##$XL= 0
##$YL= 0
##$YMAX_a= 555461
##$YMIN_a= -497191
##$ZGOPTNS= <>
##$ZL1= 120
##$ZL2= 120
##$ZL3= 120
##$ZL4= 120
##$ABSF1= 16.522
##$ABSF2= -4.171173
##$ABSG= 5
##$ABSL= 3
##$ALPHA= 0
##$AQORDER= 0
##$ASSFAC= 0
##$ASSFACI= 0
##$ASSFACX= 0
##$ASSWID= 0
##$AUNMP= <proc_1d>
##$AZFE= 0.1
##$AZFW= 0.1
##$BCFW= 0
##$BC_mod= 0
##$BYTORDP= 0
##$COROFFS= 0
##$CY= 12.5
##$DATMOD= 1
##$DC= 0
##$DFILT= <>
##$DTYPP= 0
##$F1P= 14.0000005364418
##$F2P= -0.99999901652339
##$FCOR= 0.5
##$FTSIZE= 32768
##$FT_mod= 6
##$GAMMA= 0
##$GB= 0
##$INTBC= 1
##$INTSCL= 1
##$ISEN= 128
##$LB= 0.3
##$LEV0= 0
##$LPBIN= 0
##$MAXI= 10000
##$MC2= 0
##$MEAN= 0
##$ME_mod= 0
##$MI= 0
##$NCOEF= 0
##$NC_proc= -3
##$NLEV= 6
##$NOISF1= 0
##$NOISF2= 0
##$NSP= 0
##$NTH_PI= 0
##$NZP= 0
##$OFFSET= 16.522
##$PC= 1
##$PHC0= -52.50568
##$PHC1= 6.829298
##$PH_mod= 1
##$PKNL= yes
##$PPARMOD= 0
##$PSCAL= 4
##$PSIGN= 0
##$REVERSE= no
##$SF= 250.13
##$SI= 32768
##$SIGF1= 0
##$SIGF2= 0
##$SINO= 400
##$SIOLD= 32768
##$SREGLST= <1H.CDCl3>
##$SSB= 0
##$STSI= 32768
##$STSR= 0
##$SW_p= 5175.98343685301
##$SYMM= 0
##$S_DEV= 0
##$TDeff= 65536
##$TDoff= 0
##$TI= <Analysis number 999999
Compound Code 99
Book Reference 9
Project Code 9>
##$TILT= no
##$TM1= 0
##$TM2= 0
##$TOPLEV= 0
##$USERP1= <user>
##$USERP2= <user>
##$USERP3= <user>
##$USERP4= <user>
##$USERP5= <user>
##$WDW= 1
##$XDIM= 32768
##$YMAX_p= 349047318
##$YMIN_p= -56584
$$ End of Bruker specific parameters
$$ ---------------------------------
##NTUPLES= NMR SPECTRUM
##VAR_NAME=  FREQUENCY,     SPECTRUM/REAL,   SPECTRUM/IMAG
##SYMBOL=    X,             R,               I
##VAR_TYPE=  INDEPENDENT,   DEPENDENT,       DEPENDENT
##VAR_FORM=  AFFN,          ASDF,            ASDF
##VAR_DIM=   32768,         32768,           32768
##UNITS=     HZ,            ARBITRARY UNITS, ARBITRARY UNITS
##FACTOR=    0.157963299565203, 1,           1
##FIRST=     4132.6476996994, 0,             0
##LAST=      -1043.33573715361, 0,           0
##MIN=       -1043.33573715361, -56584,      0
##MAX=       4132.6476996994, 349047318,     0
$$ Real data points
##PAGE= N=1
##DATA TABLE= (X++(R..R)), XYDATA
$$ [...]
19428A3684o009M30J614r015k669k472m047J3866P758l926J615J000j0964l732
19414b867j73k899P685J489J28p69l189J0883j2255j8429J1058O702L321L794
19400D479L900L508J270n738j3124j0977K760p89J0258J7350J5868m280p237m261
19386A2987O814J976j7995j9365J0889L792j8804j637N838P42J1516N024j788
19373a1q834m184r252j153M94M952J5458J026K1100O434L772m438p498O024j10
19358B3780q847j9712j3815J544O797O576J1438J0723O110j0207q341J406J043
19345H495o170j3032P332M145K3K933J881K812J3796o114N881O962j445j1496
19331A6003j2273R445m241j7519j1192r147K1563K4836J2377j1584L67p83j8162
$$ plain form
19428 13684 7675 8105 9719 704 -1965 -4437 -8484 5382 13140 9214 10829 11829 865 -2867
19414 -2867 -3040 -5939 1746 3235 3363 2594 -595 10288 -1967 -20396 -9338 -2636 685 4479
19400 4479 8379 11887 13157 7419 -5705 -16682 -13922 -14711 -4453 12897 28765 24485 17248 12987
19386 12987 19801 21777 3782 -15583 -4694 -902 -19706 -21343 -15505 -14763 -3247 1777 -11
19373 -11 -8845 -13029 -22281 -23434 -22940 -17988 -2530 -1504 19596 26030 29802 25364 17866 23890 23780
19358 23780 14933 -4779 -18594 -17050 -10253 -3677 7761 18484 24594 14387 6046 7452 8495
19345 8495 2325 -10707 -3375 770 793 3726 5607 8419 22215 16101 21982 28944 27499 16003
19331 16003 3730 13175 8934 -8585 -19777 -28924 -7361 17475 29852 18268 18635 17852 -310
19318c10k227K776K400j016o898m840N91L639M980N552j005p56j62M792L843j1487
19302a28m712N680M966K164o310L503l065P37M513q869j0828Q873j085j4414J3058
19287e917l791K063K707p425o407p936o24L535R678L291J119Q951N695M215J2200
19272B1354M814L419j6317q722L367K982J1757O376l700M988j1498j55p093j2176
19258f04n864N66K0851Q079n463j1755O262j797j731J2174O761L788O38j0375
19244B1530p247l62J36k543N671J4557l724M771J041j6025k3015n260j344j3183
19230b4997J4329N770j849J3101J8617L982L950J782j1380q434j1000p206o910
19217a0245N18K2386J323q216k050k582k099o617q325R731J1412r16J0711p691
$$ plain form
19318 -310 -2537 239 2639 1623 -5275 -10115 -9524 -5885 -905 4647 3642 2886 2724 7516 11359 -128
19302 -128 -4840 840 5806 7970 1660 5163 2098 2835 7348 -1521 -12349 -3476 -4561 -18975 -5917
19287 -5917 -9708 -7645 -4938 -12363 -18770 -26706 -27330 -23795 -14117 -10826 -9707 -756 4939 9154 21354
19272 21354 26168 29587 13270 4548 7915 10897 22654 29030 25330 30318 18820 18665 11572 -604
19258 -604 -6468 -5902 14949 23028 17565 5810 12072 10275 8544 20718 27479 31267 31905 21530
19244 21530 14283 13921 14057 11514 17185 31742 28018 32789 33830 17805 -5210 -10470 -11814 -24997
19230 -24997 -10668 -4898 -6747 6354 24971 28953 32903 34685 23305 14871 3871 -3335 -10245
19217 -10245 -9727 12659 13982 5766 3716 1134 -965 -7582 -15907 -6176 5236 4320 15031 7340
19203G340q170n863j3067l973J0112j009P456K0425K239J4184n381k4288l419
19190c414O165M660O177k310M019O700L837n795M414p044j458O605p758j4194
19176F04J2532R027j2125J968R613M479N02J4284J179m5j1287N322L024l362j1943
19161B3772j1805j1835q32Q13j6456N593R93q089J0126J7246k981J062k698N318
19147A0227L860O596L845r215o177N39j5229r362O225L640K434P968k692J4372
19133A7031L024q421k508Q969j381k131P278l595J507j6369o687K801N855k128
19119C245j3841k216J96j2028j317k22J4005K812P342O448j841o800J4763R598
19105B0144j1341j8712k8L273K487J737N674j47o491o526R870K5631P669j4729
$$ plain form
19203 7340 -830 -6693 -19760 -23733 -13621 -14630 -7174 13251 15490 29674 24293 5 -3414
19190 -3414 2751 7411 13588 11278 15297 21997 25834 20039 24453 17409 15951 22556 14798 604
19176 604 13136 22163 10038 12006 21619 26098 26600 40884 42063 42018 30731 36053 39077 35715 23772
19161 23772 11967 132 -700 113 -16343 -10750 -9757 -17846 -7720 9526 6545 7607 4909 10227
19147 10227 14087 20683 24528 15313 9136 9675 -5554 -14916 -8691 -5051 -2617 5351 2659 17031
19133 17031 20055 11634 9126 18095 16714 14583 21861 18266 19773 3404 -3283 -482 5373 3245
19119 3245 -10596 -12812 -12616 -24644 -25961 -26183 -12178 -9366 -2024 4424 2583 -4217 10546 20144
19105 20144 8803 -9909 -9937 -6664 -4177 -2440 3234 3087 -3404 -9930 -60 25571 33240 18511
19091A8511o576n586o550J4734J1127j6669q361J3517P297r723n962K770r46O527
19077A4110j7395o305J4588N862l424n541P862N385j3437O17R160O919l918K034
19063A6517j061K35j403q936Q728R338L764P756q576n478j1298J3049N18o563
19049A6590p888k679m096M693O126P459L00k281n747n043n586M679J2514k104
19035A6937r498r311r019q12M419J0241J1985J2300P410j1929j46J3463L44n705
19021C0679j003r043j3590P781n34j0623j457k32Q23n071J0433J4775k853J2688
19007C2773K315j3500R97M609N992K319j2812q309n82Q473n276K092n726p044
18993F321M573l15J0479n568r110P65P968Q312O097n372l750l142M034j0546l501
$$ plain form
19091 18511 11935 6349 -201 14533 25660 8991 630 14147 21444 11721 5759 8529 7583 14110
19077 14110 -3285 -9590 4998 10860 7436 1895 9757 15142 1705 2322 11482 18401 14483 16517
19063 16517 15456 15691 14288 5352 14080 23418 27182 34938 26362 20884 9586 22635 23153 16590
19049 16590 8702 6023 1927 6620 12746 20205 20505 18224 12477 7434 1848 6527 19041 16937
19035 16937 7439 -1872 -10891 -11703 -7284 2957 14942 27242 34652 22723 22577 36040 36384 30679
19021 30679 29676 20633 7043 14824 14290 3667 2210 1978 2801 -2270 8163 22938 20085 32773
19007 32773 35088 21588 22585 27194 33186 35505 22693 14384 13802 22275 16999 19091 13365 6321
18993 6321 10894 10579 21058 15490 6380 7145 15113 23425 29522 24150 20400 17258 21292 10746 7245
18978G245r261P229J5420k925j5880K217J9565Q43k729j763p068m780M377M074
18964A6564N70k318q898J1924J0550N264k656k48n711J053J061L680L537j1247
18950B3125k854m834L163L384K557l471j0043J0379J2924P946l0q346j1725K352
18936B4527O130R597j5359j2048N797k84j3568q288P17J7556J197N11k39k808
18922A3438L916p978m134J1997N621Q533q954j554j304O101J4895P126K789q265
18908D2227k566l293J0855R817J2593r587j7750J83l120R752N326q86q407r414
18894C5730j1852r367j705l700M854J7661J9950P432q354j2982q072J569R155
18881D0319k47m97J123N073q393n604n830q934J3835J2739l807j3771L696O698
$$ plain form
18978 7245 -2016 5213 20633 17708 1828 4045 23610 24453 21724 19961 12893 8113 12490 16564
18964 16564 17134 14816 5918 17842 28392 33656 31000 30752 25041 26094 27155 30835 34372 23125
18950 23125 20271 15437 18600 21984 24541 21070 11027 21406 34330 42276 42246 33900 22175 24527
18936 24527 30657 40254 24895 12847 18644 18360 4792 -3496 -2779 14777 15974 16485 16246 13438
18922 13438 17354 9376 5242 17239 22860 31393 22439 20885 19581 25682 40577 47703 50492 42227
18908 42227 39661 36368 47223 57040 69633 60046 42296 42479 39359 49111 54437 53551 45144 35730
18894 35730 23878 14511 12806 9106 13960 31621 51571 59003 50649 37667 29595 31164 40319
18881 40319 40072 39575 40698 45771 37378 31774 25944 17010 30845 43584 39777 26006 29702 36400
18867C6400J994L861P660P418K61N079O477K490m114r682j0986L674K4596J8320
18853I3448Q050J9652M3306O1480M9585J9634rQ584K7021J5271N09P48K1020L092
18839C71391J1972K8999R871k2060l4476k2384q398r428l938O968N557l357N783
18826C36500o753j4337j3239j7176j4098k3012m999J4818j6183l0659k4429k2356
18814A64077k307l857o626q898J2451J6141K2480L5292M8504L8849J0363R806
18802C36275J648m1r340J2176K1265M581j7214o6J0500J4818M160M899K2344N5060
18788D61065M1868J2592K0571O696k4150n8595n3220k2582j5885m2475l0294j4914
18776B80677o401k3137m3910l0931j8326j8128o000J1991J8167N0784O2237J5091
$$ plain form
18867 36400 38394 42255 49915 57333 57594 62673 69150 71640 67526 57844 46858 50532 75128 93448
18853 93448 101498 121150 164456 225936 275521 295155 295146 303730 330751 346022 346531 347279 368299 371391
18839 371391 383363 412362 422233 400173 365697 343313 334915 325487 321549 328517 334074 330717 336500
18826 336500 329747 315410 302171 284995 270897 247885 242886 257704 241521 210862 186433 164077
18814 164077 161770 157913 151287 142389 154840 170981 193461 228753 277257 316106 326469 336275
18802 336275 337923 337882 328542 340718 361983 366564 349350 349284 359784 374602 378762 383661 406005 461065
18788 461065 502933 515525 536096 542792 518642 460047 406827 384245 368360 325885 295591 280677
18776 280677 274276 251139 207229 176298 157972 139844 133844 145835 164002 214786 277023 292114
18764B92114m5331m0925l0773J004J9922J6134K2245L1807q889k3838k0893k1432
18752A91145Q015M5225M6376N0673M0533J2632l6726o5001o9795n1897l0143j9487
18740A21550j3967R10J380m06r72K757J9540J952l403k1827j477L210m045l679
18726A01523q699j3133j636J455L901q19M22R566J8115K0906L2394M6959N7423
18713B68377P0182O8930N0008Q82j4672j6739J7600L9890O4076Q8933N0421k4619
18701F63269n2344o5041p0207o2039l7802J481K8758N4334L3712j0567n4579p0133
18689C58842p3820o1495l9169k7980l2215j3367l4896m014J3603P332M916O271
18677A04008m008j570k80J0111k024J2008J2107M184J7777L4760L8869K0451r419
$$ plain form
18764 292114 246783 205858 175085 176089 196011 212145 234390 266197 257308 233470 212577 191145
18752 191145 199160 244385 290761 341434 381967 394599 357873 292872 223077 171180 141037 121550
18740 121550 107583 108493 109873 109467 108495 111252 130792 132744 129341 107514 106037 109247 105202 101523
18726 101523 92824 79691 78055 79510 83411 82592 83014 92580 110695 131601 163995 210954 268377
18713 268377 338559 407489 457497 458379 443707 426968 444568 484458 548534 637467 687888 663269
18701 663269 610925 545884 475677 413638 375836 377317 406075 460409 494121 483554 428975 358842
18689 358842 285022 223527 184358 156378 124163 110796 75900 71886 85489 92821 97737 104008
18677 104008 100000 98430 98150 108261 106237 118245 130352 134536 152313 187073 225942 246393 236974
18664B36974r493O357K2133N5258P3466P1070L5127j4644m3735o6943l5220j5813
18652C14537J27K7027M1827N1437K6169K1687q141l7166l9234k3468k1578j5947
18640C37277N290L4841P5958J37802K16739K67918K56314J72908n814j78045k44586
18629A076602k48710k19315j55870r8522p9266l7765l2537l0261o574q267l169
18618A56346k0843m839P499n753j0032N923R691L0584K2044J44J055Q050P319
18605B07188M753P123K9534J5819J8389K5178M2002N0565K6005K541k4874j6588
18593C87635l4704l3896k8923j3390Q007l131j7688j1753j2191k5757j2769L41
18581B01781j3981k8101p810j2643k2725j3668p73L33j2533Q351J5789k832J8448
$$ plain form
18664 236974 227481 233838 255971 311229 384695 455765 490892 476248 432513 365570 330350 314537
18652 314537 314664 341691 383518 434955 461124 482811 474670 437504 398270 374802 353224 337277
18640 337277 342567 377408 453366 591168 807907 1075825 1332139 1505047 1499233 1321188 1076602
18629 1076602 827892 608577 452707 354185 274919 237154 204617 174356 167782 159515 156346
18618 156346 135503 130664 138163 132410 122378 128301 137992 168576 190620 190764 191819 199869 207188
18605 207188 211941 219064 248598 264417 282806 307984 349986 400551 426556 429097 404223 387635
18593 387635 352931 319035 290112 276722 284729 281598 263910 252157 239966 214209 201440 201781
18581 201781 187800 159699 151889 139246 116521 102853 102080 102413 89880 98231 114020 111188 129636
18568A29636J3709J0035J989N562K3466P429J7595J4079O509N011o045M872K4717
18555B58564J8937L2352L7604L8588J8950j088k4242l4734k6864k3698j0020J2061
18543B96410K81K4629M684k3400k0175k9794l9185l0254k6357j2482j3034l36
18531A30987k395K243l801O338j1767j9563p619Q92J844k389j585m747n082O516
18517H9872R135O464O50J1607m575r689O284J5405O097R549K4116J7390J1898
18504A94203r472O95R884l151m143m274k304K018J2407J0912j595j3794M77o605
18490A85258j955j2949j6981j956r662J0658J2113Q936m937j2990m825R545n65
18477A59690q984j790k997R752J3593J2871O639j145K1679K1173J0350L872n153
$$ plain form
18568 129636 143345 153380 155369 160931 184397 191826 209421 223500 230009 235020 228975 233847 258564
18555 258564 277501 309853 347457 386045 404995 403907 379665 344931 318067 294369 284349 296410
18543 296410 296691 321320 326004 302604 282429 252635 213450 183196 156839 144357 131323 130987
18531 130987 128592 130835 127034 133372 121605 102042 94423 95315 97159 94770 93185 88438 83356 89872
18517 89872 99007 105471 106121 117728 113153 103464 109748 125153 131250 140799 164915 182305 194203
18504 194203 184731 185426 195310 192159 188016 183742 181438 183456 195863 206775 205180 191386 191863 185258
18490 185258 183303 170354 153373 151417 141755 152413 164526 173462 168525 155535 150710 160255 159690
18477 159690 150706 148916 145919 155671 169264 182135 188774 187629 209308 230481 240831 244703 239550
18464B39550j124J2171J732J4719K7485J9034N766L772N439n624K648J5655J1016
18451C52239p231k2000j5011k0108k5724k1633n633J3691j472J0174K2243L116
18439B82651J624J6950l967j6056O922L66R217j963P047J5565l419Q852K4616
18426C48405K8045Q498j0813m839J8197J2258m779K435K6586K4508L1608N3804
18414E33913K8973l0624n4020l9897m0229k3972O14J8385J0966J655J3760J0591
18402D30115J9723J6386J5138r365k8538j4797J996K1421J3169l82J3468M0326
18390E18660J3777J7036K6349J4492K6155L6239L6564L8779M9135M7845N6748
18379H81779P9682Q0039Q9448J11671R4276J09580J10675J18421J29376J18780
$$ plain form
18464 239550 238426 250597 252329 267048 294533 313567 319333 323105 328544 322920 325568 341223 352239
18451 352239 345008 323008 307997 287889 262165 240532 234899 248590 247118 257292 279535 282651
18439 282651 284275 301225 297258 281202 288124 288490 297707 295744 302791 318356 314937 323789 348405
18426 348405 376450 384948 374135 369296 387493 399751 394972 397407 423993 448501 480109 533913
18414 533913 562886 532262 478242 438345 398116 374144 374758 393143 404109 405764 419524 430115
18402 430115 449838 466224 481362 471997 443459 428662 430658 452079 465248 464866 478334 518660
18390 518660 532437 549473 575822 590314 616469 652708 689272 728051 777186 825031 881779
18379 881779 961461 1041500 1130948 1242619 1336895 1446475 1557150 1675571 1804947 1923727
18369A923727J28706J46887J76197J97787K42829L01370L70815M83212O96154
18360D667684J073616J588056K257482L126873M427569O090223O635789N359881
18352C5227173M531883M123674R11531l134516l749782k500146j840325l14425
18344C3255067L340614O675323O589861N468756N903362L682849k186925o045141
18336E6683766o636597o685006o188842n210353m440661k927900j044338l34225
18328B3215844m55684Q3813Q97861K2359j745350k050947j592043j698568j804763
18319A4872522j337105m45252M97725J300717K241622L875943N698133O064198
18311C2768503N306141N983871O998620N096860J717256R75080L313081N320390
$$ plain form
18369 1923727 2052433 2199320 2375517 2573304 2816133 3117503 3488318 3971530 4667684
18360 4667684 5741300 7329356 9586838 12713711 17141280 23231503 29867292 35227173
18352 35227173 39759056 43882730 44794261 41659745 37909963 35409817 33569492 33255067
18344 33255067 36595681 43271004 49860865 55329621 61232983 64915832 62728907 56683766
18336 56683766 50047169 43362163 37173321 31962968 27522307 24594407 23550069 23215844
18328 23215844 22760160 22843973 23741834 23764193 22018843 19967896 18375853 16677285 14872522
18319 14872522 13535417 13090165 13587890 14888607 17130229 21006172 26704305 32768503
18311 32768503 38074644 44058515 51057135 56153995 57871251 58846331 62159412 67479802
18303F7479802N607678O857157R060883R208341Q817853P551276K277620l402893
18295A13457717l167366M80417N33254j595781j02687L407512K880135k921025
18287A12972176r221361j2949185j4293631j4242480j3791969j2118224q712221
18280B7643105n057044k342462o10626J60401O13566R93417K8024j777480k325414
18271A7325487k150531k284358k124154j491219r15568o45176n00989l40512j48989
18262F723991M8692K73245O10373J147357K040838L623978O474144J0934449J4629854
18253D6506921J0751254j801475j1495720j1204001n965221o16510M344384Q765583
18245C9285215J0928330R824959O472085J207414o095326j2062060j3108088j0278434
$$ plain form
18303 67479802 73087480 79944637 89005520 98213861 107031714 114582990 116860610 113457717
18295 113457717 110290351 110770768 111304022 109708241 109605554 113013066 115893201 112972176
18287 112972176 103750815 90801630 76507999 62265519 48473550 36355326 27643105
18280 27643105 22586061 20243599 19632973 19793374 20406940 21400357 21428381 19650901 17325487
18271 17325487 15174956 12890598 10766444 9275225 8359657 7714481 7213492 6872980 6723991
18262 6723991 6772683 7045928 7656301 8803658 10844496 14468474 20942618 31877067 46506921
18253 46506921 57258175 55456700 43960980 32756979 26791758 26175248 30519632 39285215
18245 39285215 50213545 60038504 66510589 67718003 61622677 49560617 36452529 26174095
18237B6174095o626384l790545j847356l71766R14539K275294L686378M103731
18229B4517986J977742j884893m432337m350563k841296j327110l44659o2309
18221A1252561j32530Q1700P86723J921435L553920N358799N577504K250382j746203
18212B8904291k252056l01523K007258N393124J0777420J6702639J8750569J3142173
18204I3123895M144931J626806R874284K0878865J9517161M71137k2305360l2327658
18196I5004061k8317380j8787780j0295773m125220O56904M793310P237766N469909
18188E1635797m7767m932887o561614o415243o360028n916506m827278l378941
18180A3195533k057233j191933p00830m25620l50310l25019j79920K1807J81719
$$ plain form
18237 26174095 19547711 15757166 13909810 13538044 14452583 16727877 20414255 24517986
18229 24517986 26495728 24610835 20178498 15827935 12986639 11659529 11314870 11252561
18221 11252561 11120031 11201731 11988454 13909889 17463809 22822608 28400112 30650494 28904291
18212 28904291 26652235 26350712 28357970 33751094 44528514 61231153 79981722 93123895
18204 93123895 97268826 98895632 108769916 129648781 149165942 149637079 127331719 95004061
18196 95004061 66686681 47898901 37603128 33477908 34134812 38928122 46165888 51635797
18188 51635797 51588030 46655143 40093529 33678286 27318258 21401752 16574474 13195533
18180 13195533 11138300 9946367 9245537 8819917 8469607 8144588 7964668 7986475 8168194
18171H168194L44004P00290J277212K149908L594088N864559Q375148Q462782
18163C8936185L368904l645076o192617l626410J037522O309914J0777050J1220280
18155E8185752O754417K432201J114510k67639j441974j222234m238379j0619029
18147E0697625j3299956j0547266o445810l465800j617556j79067J477479L588455
18139B0208104N968085P380132O607767M149628k08649m621017o397228n929166
18131B7157656l761717n82737L007302P128369J1009610J2640385J0382663K654666
18123F9636197o840796j2027186j2536032r830199n627168j638936J856705M315776
18115B7308361M990879L543004m71233l948590m390515k087532L293936R258577
$$ plain form
18171 8168194 8512198 9212488 10489700 12639608 16233696 22098255 30473403 38936185
18163 38936185 42305089 38660013 32467396 28840986 29878508 36188422 46965472 58185752
18155 58185752 64940169 67372370 68486880 68219241 66777267 65555033 61316654 50697625
18147 50697625 37397669 26850403 20404593 16938793 15321237 15142170 16619649 20208104
18139 20208104 26176189 33556321 40164088 44313716 44105067 39484050 33086822 27157656
18131 27157656 23395939 22813202 25820504 32948873 43958483 56598868 66981531 69636197
18123 69636197 62795401 50768215 38232183 28401984 22774816 21135880 22992585 27308361
18115 27308361 32299240 35842244 35371011 31422421 27031906 24944374 28238310 37496887
18107C7496887M672226p636614j0440147n039679p09539J178981J767175J124089
18099B2413379j039568k678180l133893l085583k352091j337539n09340J41212
18091H418397P66227J498279K513526L698138M744303N806240O625479O969600
18083D1040189P051324O226617L131977k182434o105289p196989p062716o159969
18075B8742710n030148l959433k778769j429572O9689J763283L921630P096713
18067B8396103J2442455K2298438L8442471N0809974M8095453M7274438K5080891
18060B72840223k2905336m3519908m8182103n1019182l8261662k2820380j3379699
18053C2751953q115387n173067l374459j984942p79084J37122N71002L64980n27790
$$ plain form
18107 37496887 42169113 34532499 24092352 19052673 18343134 19522115 21289290 22413379
18099 22413379 21373811 18695631 15561738 12476155 10124064 8786525 8277185 8418397
18091 8418397 9184624 10682903 13196429 16894567 21638870 27445110 34070589 41040189
18083 41040189 48091513 54318130 57450107 55267673 49162384 41965395 34902679 28742710
18075 28742710 23712562 19753129 16974360 15544788 15614477 17377760 21299390 28396103
18067 28396103 40838558 63136996 101579467 152389441 200484894 247759332 272840223
18060 272840223 249934887 206414979 158232876 107213694 68952032 46131652 32751953
18053 32751953 24636566 19463499 16089040 14104098 13325014 13462136 14033138 14398118 13870328
18044A3870328j371486j536050j116480k40721R47635J898915K250298J731757
18036A6434196J49749j606123k595563k663412k045867j121970k29462M22993
18028F744541P01023O24630k3885q40783j221858j294960j074848p30320m55289
18019B428251k98148k10992j65473j35012j03028p5999o1830o0026n6614n8146
18009A202983o6317o1474n5206l9525l8636m0441m4312l0177l2507r138q027p48
17997G76475j4352k7549l8493l4085k2220j6603r293j1334j3232L437j0268j6544
17985E65939k1401k2152k7434j3433n523J5556R448k897j0579k1145k413Q819
17973D72785N482O19l870J074k141j2633j4131r650r942J417q093j5676k1772
$$ plain form
18044 13870328 12498842 10962792 9846312 9605591 10553226 12452141 14702439 16434196
18036 16434196 16583945 14977822 12382259 9718847 7672980 6551010 6321548 6744541
18028 6744541 7445564 8070194 8046309 7205526 5983668 4688708 3613860 2883540 2428251
18019 2428251 2130103 1919111 1753638 1618626 1515598 1439599 1377769 1317743 1261129 1202983
18009 1202983 1136666 1075192 1019986 980461 941825 901384 857072 826895 794388 785250 777223 776475
17997 776475 762123 734574 696081 661996 639776 623173 613880 602546 589314 592751 582483 565939
17985 565939 544538 522386 494952 481519 475996 491552 501000 498103 487524 466379 463966 472785
17973 472785 478267 478886 475016 476090 473949 461316 447185 437535 427593 429010 420917 405241 383469
17960C83469j0679N716K0991P040j8452r487J0705J5273j618o669p174m284j4255
17947C70576o681j2108j1751j475K1181K2930m259j786J5803K5714J1013J2174
17935D41331L7746J6466k8081l1208n0863o6498l2435k3592j6209O732M518q62
17923B57045j139q546j7067j8869k965J5863k112O698O53K756j4963j7485m056
17910A95813L040O49Q531l613j6857r858J2053P988M520J3849J4631k554o285
17897B21907k2047j0573L25k027o436L940j1529p726P170n445o334J2889j737
17884A72377r324P053P024L158j1419j0712M080N125q005L714j746k0711j2608
17871A28006K502N258q63p599l043J2687l655j4913M058j5572k671J1666J8099
$$ plain form
17960 383469 372790 378506 399497 406537 388085 378598 389303 404576 402958 396289 389115 384831 370576
17947 370576 363895 351787 340036 338561 359742 382672 378413 376627 392430 418144 429157 441331
17935 441331 479077 495543 467462 436254 385391 318893 286458 262866 246657 253389 257907 257045
17923 257045 255906 247360 230293 211424 208459 224322 222210 228908 229561 232317 217354 199869 195813
17910 195813 198853 199502 208033 204420 187563 177705 189758 197746 202266 216115 230746 228192 221907
17897 221907 199860 189287 189612 187585 181149 185089 173560 165834 173004 167559 161225 174114 172377
17884 172377 163053 170106 177130 180288 168869 158157 162237 167362 159357 163071 161325 140614 128006
17871 128006 130508 135766 134903 127304 124261 136948 133293 118380 122438 106866 104195 115861 133960
17858A33960k960p222J3197K8886J7401j129o053J4816L2162L7156M1666M1864
17846C43744K0736L5165L4426P95Q462L1858K7800K2751J1661Q983K1060L4534
17834F01975J1722j4714l576p822p627O479J8497J0549l5031l4855j6345l5131
17822D94121p5743o2522l4843n2367m1045j8199j1131r335O049L1957P665q541
17810B26066j2601n974j3629j5297q718j0510R198J7664K6542J0512K9602L8867
17798B91722L2754K7646J0524J2188K6465K0639r32j6961K393J4403J9887Q57
17786D41585R88L0953J5111j3028k5149k6644m0673l9502m0929k2108j0858j1070
17774B58676o368M628J2353N440k3762k3887k1704k6060k4194j7811j1591j0310
$$ plain form
17858 133960 131000 123778 136975 165861 183262 182133 176080 190896 223058 260214 301880 343744
17846 343744 364480 399645 434071 434866 443328 475186 502986 525737 537398 546381 567441 601975
17834 601975 613697 598983 595407 587585 579958 586437 604934 615483 580452 545597 529252 494121
17822 494121 418378 355856 321013 268646 227601 209402 198271 188936 194985 226942 234607 226066
17810 226066 213465 207491 193862 178565 169847 159337 168535 186199 212741 223253 252855 291722
17798 291722 324476 352122 362646 374834 401299 421938 421006 404045 406438 420841 440728 441585
17786 441585 442573 473526 488637 475609 450460 423816 383143 343641 302712 280604 269746 258676
17774 258676 252308 256936 269289 274729 250967 227080 205376 179316 155122 137311 125720 115410
17762A15410M403J0623k378l651N278L057J401O044n946l378M720k45m150j779
17748A29409O414L0835M8916N5369N6064K3413n554k4978n177K2807J4712M601
17736C56831o081O365K3675L1959K0146k1038o5892o5379n9443n4304l0179n531
17724A31129j4382j1831q078j3491j6269O27M865J3143J0104K4237L0590J1819
17712A62463o577J310j1612k7687j7625p513j408L1858K5784J6960L2082O5465
17700B63500P6190Q3086O3612L4973r449k1294l242J3210J5527o995l4338j8965
17688D55815n47m582n2862p0821l9302q772J8845M2012L1552j9092l9793m8435
17676B64018n3322n3717k7358j5874l919K5380O768j4933k1134k0243j1069o399
$$ plain form
17762 115410 119813 130436 128058 124407 129685 132742 134143 140187 134241 130863 135583 135338 131188 129409
17748 129409 135823 166658 215574 270943 327007 350420 344866 319888 314711 337518 352230 356831
17736 356831 350750 357115 380790 412749 432895 411857 345965 280586 221143 166839 136660 131129
17724 131129 116747 104916 96838 83347 67078 67705 72570 85713 95817 120054 150644 162463
17712 162463 155886 157196 145584 117897 100272 92759 91351 123209 148993 165953 198035 263500
17700 263500 339690 422776 486388 521361 511912 490618 487376 500586 516113 509118 474780 455815
17688 455815 455268 450686 397824 327003 287701 278929 297774 339786 371338 352246 312453 264018
17676 264018 210696 156979 129621 113747 109828 135208 141976 127043 105909 85666 74597 68198
17664F8198k853j4013j448L706L103J3701R173P410J8018K0275M2719M4840L3649
17651B46478Q195N81J7358J0653j0724l2779m5428n4073k8867m312J0564J3511
17639A31157L8672M7837P2051P2584M3936o133n6513o1481n3617l3702J478J3936
17627B10205K3016K6205L149k3849j9606k7769l8439k6329o830r731J4898K0438
17615A45358J7616j3219j9410m539k3606k0864j5373q956j1713P609O090M332
17603F3325l12o786j1807j3326Q231M210J608L2415J7513L2822L2667J4014N378
17590A79952P244o145k2248R34J332N793L7960N0711L7870K4922k087j7793k8853
17577B69592k4860l6678k1104P267K310o560o539j4384J503l879l0139j9446k3484
$$ plain form
17664 68198 65345 51332 49884 53590 56693 70394 79567 86977 104995 125270 167989 212829 246478
17651 246478 254673 255254 272612 283265 272541 239762 194334 140261 111394 107082 117646 131157
17639 131157 169829 217666 289717 362301 406237 400104 343591 282110 228493 194791 196269 210205
17627 210205 233221 259426 262575 238726 219120 191351 152912 126583 119753 110022 124920 145358
17615 145358 162974 149755 130345 125806 102200 81336 65963 57007 45294 52903 58993 63325
17603 63325 63013 56227 44420 31094 39325 43535 45143 77558 95071 127893 160560 174574 179952
17590 179952 187196 181051 158803 159737 161069 166862 204822 255533 293403 318325 316238 298445 269592
17577 269592 244732 208054 186950 194217 196527 189967 183428 169044 170547 166668 136529 117083 93599
17564I3599k1502q433J378q017l152n955p988K166l746p602k800n845m848J7363
17550C4618J4246J9086J6074J1819J2245J7443r656j8902j8736o252P61K1433
17538I4179L4509K3476J9828L802p985l1275k9946j8702j7496q017m010Q169J9367
17525H5899J2576r168q785j5423j2056o619k0702r082K3330J1320k0730j0819
17513A9741J184R626m904p958J6800J6862n937j5289j8290j0473J3248L1449q64
17500D5195m897o98M491L904m276J198J4846J2444K8055N0891M6678O7689J30150
17487C95670K13354K49228K38203K09928Q5186j16348k29500k59983k46088j87329
17477C52321j10122o5324m9553l6055j5990o693k2873k5190N784J9834m803j2293
$$ plain form
17564 93599 72097 63664 65042 57025 53873 47918 39930 42096 38350 30748 27948 22103 17255 34618
17550 34618 48864 67950 84024 95843 108088 125531 115875 96973 78237 71985 72746 94179
17538 94179 128688 152164 171992 175794 167809 136534 106588 87886 70390 62373 58363 66532 85899
17525 85899 98475 89307 80522 65099 53043 46424 25722 16640 39970 51290 30560 19741
17513 19741 20925 30551 25647 17689 34489 51351 45414 30125 11835 1362 14610 46059 45195
17500 45195 40298 39600 44091 47995 43719 44917 59763 72207 100262 151153 197831 265520 395670
17487 395670 609024 858252 1096455 1306383 1391569 1275221 1045721 785738 539650 352321
17477 352321 242199 176875 127322 91267 75277 68584 45711 20521 26305 46139 41336 29043
17465B9043J0067K924r604p234N890Q974n759J0460k941j5785j3176P76L764r52
17451A6447m311M318L527k324J8983J2630q528P76K6152O7026N0671j1583m6362
17438A27422m6701l0621r567j1522m800R518J397o228r606j2122Q123L512p982
17425A0823k608L082l201O853J0383J0268j2371n681j226k601J0008m652r367
17412I710j0945k078m943j2166L762J5672N696R47l564J904J2067k094o921l244
17398C803j60J0737m567m667M528R261Q307m247r498L912l859M74N147L165J944
17383B4280j0770k039K572P211L417O862j2285o066J2486O951l206j2924Q90o306
17369A1073j3593M150R414N688L958R91j2415L638r149n88L471k83o158P929j353
$$ plain form
17465 29043 39110 42034 32430 25196 31086 40060 34301 44761 41820 26035 12859 13635 17399 16447
17451 16447 12136 16454 19981 17657 36640 49270 40742 41518 67670 134696 185367 173784 127422
17438 127422 80721 50100 40533 29011 24211 33729 35126 28898 19292 7170 15293 18805 10823
17425 10823 8215 11297 8096 14949 25332 35600 23229 17548 16322 13721 23729 19077 9710
17412 9710 -1235 -3313 -8256 -20422 -16660 -988 4708 5655 2091 3995 16062 13968 7047 3803
17398 3803 3643 14380 9813 5146 9674 18935 27242 22995 13497 17409 13550 14024 19171 22336 24280
17383 24280 13510 11471 14043 21254 24671 31533 19248 13182 25668 32619 29413 16489 17379 11073
17369 11073 -2520 1630 11044 16732 20690 21681 9266 12904 3755 3167 6638 6355 197 8126 6773
17354F773J715J841q826n704L84O793q28j2896P88P63m149M25k673J1984J2143
17339H533J2407m605n757J711p40k348P26o964l015o388J1707j130k265J28R592
17324A1592N118l880m471l76L256K782K1149O321j2026l270m001J569j769j489
17310B0505j622j695n275j5756j342j390p642n482J391K104K0571J2923j5776
17297A514m422N727m433j973M5q265J007J1364M29n219M108J0502o272m723M736
17282D125r990p677P533p444o983K802k214J3432M224M888L91J2116N537j2932
17268G808j5152L028p11J0903n245j261M208j247J250M336l162j732J814l324
17254A513j349j4355j4422P746J3706P128M243N897J7019q992o717q513m201l167
$$ plain form
17354 6773 8488 10329 1503 -4201 -3817 2976 2148 -10748 -9960 -9197 -13346 -12921 -15594 -3610 8533
17339 8533 20940 16335 10578 12289 11549 9201 9927 2963 -52 -6440 5267 4137 1872 2000 11592
17324 11592 16710 12830 8359 7983 11239 14021 35170 41491 29465 26195 22194 23763 21994 20505
17310 20505 18883 17188 11913 -3843 -5185 -6575 -14217 -19699 -18308 -16204 4367 17290 1514
17297 1514 -2908 2819 -1614 -3587 -3542 -11807 -10800 564 993 -4226 -118 10384 4112 -611 4125
17282 4125 -5865 -13542 -6009 -13453 -20436 -17634 -19848 -6416 -2192 2696 3087 15203 20740 7808
17268 7808 -7344 -4316 -5027 5876 631 -630 3578 2331 3581 7917 4755 3023 4837 1513
17254 1513 164 -14191 -28613 -20867 -7161 -33 4210 10107 27126 18134 11417 2904 -1297 -4464
17240d464J5495j4510j0989J1920K154K838k895P307J094n20l41M623L384j4985
17226A11O832J9058j656r09M121k4705j0679j1887p17Q758K0p518J319M552m367
17211a7667l449R952J3636j919r846J624N909m992J857O526N502q825j859m611
17197h162J41Q902P208n48M015Q474K053k5410j2494j302P172P381J0230J3700
17183B1360n543q58O5o676l427j618r15j284P524Q421j7730j0080J6471J0604
17169A6314R237j4175l519l669r689m705o304m221J2714J2343J3093O25j2406
17156E638j2021j5374L820K841N527j20n997K006O969J2555l454o972k134O660
17142e6m719n366m140l92J8937M964j101p404q731P958J2673Q575l846k0870M1
$$ plain form
17240 -4464 11031 -3479 -14468 -2548 -394 2444 -451 6856 7950 7430 7089 11712 15096 111
17226 111 6943 26001 24345 23436 27557 2852 -7827 -19714 -20431 -11673 -11653 -19171 -17852 -13300 -17667
17211 -17667 -21116 -11164 2472 553 -9293 -7669 -1760 -6752 -4895 1631 7133 -1692 -3551 -8162
17197 -8162 -8021 881 8089 7541 11556 20030 22083 -3327 -15821 -17123 -9951 -2570 7660 21360
17183 21360 15817 14959 15024 8348 4921 3303 2388 1104 8628 17049 -681 -10761 5710 16314
17169 16314 25551 11376 7857 4188 -5501 -10206 -16510 -20731 -8017 4326 17419 18044 5638
17156 5638 -6383 -21757 -17937 -15096 -9569 -9689 -15686 -13680 -6711 5844 2390 -4582 -6716 -56
17142 -56 -4775 -10141 -14281 -14673 4264 9228 8127 723 -8008 -50 12623 21198 17352 -3518 -3477
17127c477J1952N761Q221j8245j4525j348M995p35J961J0022J6637n598k8852
17114a3231l763K0127k530Q419q099o243K665K909r060J8069J290j0195k028j0551
17100a2221p690J308R399J0308R638n236p504J145K078O43p133j7998j3382Q399
17086b8246J9028O161J2991k447q822n316L311m360M392n367m149Q868K907m270
17072e319Q20Q646O17O255k739m900L152O335j569K765M999k67k05l192j5793
17057c95L93L843k771L059j307O439L022m59o482j198J9718L970j1988j0422O634
17042A2056L682l859j2106N04j868j423R840J7274l326Q28Q925J9699L6114M4106
17028A30446N6500N4323J713l2503l9644m7068m1288j9094m0640j7456q964M937
$$ plain form
17127 -3477 8475 14236 22457 4212 -10313 -11661 -6666 -7401 -5440 4582 21219 15621 -13231
17114 -13231 -16994 3133 603 9022 923 -5320 -2655 254 -8806 9263 10553 358 -1670 -12221
17100 -12221 -19911 -18603 -9204 1104 10742 5506 -1998 -853 1225 1868 -5265 -23263 -36645 -28246
17086 -28246 -9218 -3057 9934 7487 -1335 -6651 -3340 -7700 -3308 -8675 -12824 -3956 -1049 -5319
17072 -5319 -4499 4147 4764 11019 8280 3380 6532 12867 11298 14063 19062 18795 18590 15398 -395
17057 -395 -2 3841 1070 4129 2822 9261 12283 11824 5342 4144 23862 27832 15844 5422 12056
17042 12056 15738 11879 -227 277 -1591 -3014 6826 24100 20774 21602 30527 50226 86340 130446
17028 130446 186946 241269 242982 210479 170835 123767 82479 63385 22745 5289 -3675 1262
17016A262J9991J295j6272r953R728K3940k55n098n340K26M541k697N633j6485
17002A0516k0281q343k96K472K5417J0982j4131k0527L210J174J6079O259j571
16989A0960l862k134L410k976J4268P165N991J5444J8069K3901K7992J4094J3922
16976A46244q991l5496l2595l2104k4080k473P659Q747l1o382j2876J440J2058
16963B1120N990j922k403k447J193r87n519o642q661J171J8249O235M734p463
16949B2648n256k630l551j1365q85o327L540o689j3360P99J6832l137L250M464
16935a667p412l55J08m912p697J3020L358q715n89L468J800j95R49M768N014j2011
16919a1068J001m400O716J1490j467m516m270J0366p846n923J8968k75k770J085
$$ plain form
17016 1262 21253 22548 6276 -3677 6051 29991 29736 24638 19298 19524 24065 21368 27001 10516
17002 10516 -9765 -18108 -18404 -15932 9485 20467 6336 -14191 -10981 -9807 6272 12531 10960
16989 10960 7098 4964 8374 5398 19666 26831 32822 48266 66335 90236 118228 132322 146244
16976 146244 137253 101757 69162 37058 12978 10505 18164 26911 26880 20498 7622 9062 21120
16963 21120 27110 25188 22785 20338 21531 20544 15025 8383 -278 893 19142 25377 30111 22648
16949 22648 17392 14762 11211 -154 -1039 -7366 -3826 -10515 -23875 -23076 -6244 -9381 -6131 -1667
16935 -1667 -9079 -9434 -9326 -14238 -21935 -8915 -5557 -14272 -14861 -11393 -9593 -9788 -8839 -4071 943 -11068
16919 -11068 -10067 -14467 -7751 3739 2272 -2244 -6514 3852 -3994 -9917 9051 8776 6006 7091
16905G091l9K292m456j1182J460O835J4180K346J2347o970m706N476J5358J6662
16891E6694L2227J6558l219j1755j6284k3030k5812q479l016j2843m1Q655p060
16878B595Q95m702k529o717k0278N8m846l233R59n08K0064J6985J1655J861J1445
16863B3704J5656m483k669m752M369J833P137J902r599j140p218l457k3534k051
16849d302J0871n517k038K569q88K781j4610j1789J218P764J0160l661O79Q289
16835A526K844j1743j1396J6298R948K869N294j3333m182J1720L892q714n274
16822b51q840j6335j728J7645O894J082P099M074j5680J903n17q248R408J5321
16808A1827K962r20J115O779q946k3071J968J0161P177k990j1380o991L248M699
$$ plain form
16905 7091 7052 9344 4888 -6294 -4834 2001 16181 18527 30874 23904 19198 24674 40032 56694
16891 56694 88921 105479 102260 90505 74221 51191 25379 16900 13884 1041 1000 9655 2595
16878 2595 3490 -1212 -3741 -10458 -30736 -30678 -35524 -38757 -37798 -38306 -18242 -1257 10398 12259 23704
16863 23704 39360 34877 32208 27456 31825 33658 40795 42697 33098 31958 24740 21283 -2251 -4302
16849 -4302 6569 1052 -986 1583 695 3476 -11134 -22923 -21705 -13941 -3781 -7442 -6763 1526
16835 1526 4370 -7373 -18769 -2471 7477 10346 15640 2307 -1875 9845 13737 5023 -251
16822 -251 -9091 -25426 -27154 -9509 -2615 -1533 5566 9640 -6040 -4137 -4654 -12902 -3494 11827
16808 11827 14789 13869 14984 21763 12817 -10254 -8286 1875 9052 6062 -5318 -12309 -9061 -4362
16794d362P595R69n522r646j2315N926O839N646Q865p229L632P219J0378m888
16780A3107o829k991r72J344o01K1219k305j1790q438K313J7556l783j5044o199
16766c413o991p865J1880M738K923P416P683k037M9k261r420J908Q601M666j267
16751A6610j1557j3634M20N639N479K260M190m690j1388m870J5653K4613l28K839
16737C1236l375L798k3m281k882m275j314m75P307K1772K9689K6088M8137N5704
16723B07106L7988O6166L5864k5802m5230n3748o2673n4637m1968k6029j0907
16712B6130p7Q610J463j8448p719n375k706m317K832j047M374k21j1786r049l554
16697b0890J2347J6501N412R205J010p550j5168p264j1316J3529L458J665j3540
$$ plain form
16794 -4362 3233 4202 -1320 -10966 -23281 -17355 -10516 -4870 3995 -3234 398 7617 17995 13107
16780 13107 6278 3287 2315 3659 3058 24277 21972 10182 1744 4057 21613 17830 2786 -3413
16766 -3413 -10404 -18269 -6389 -1651 1272 8688 16371 14334 14383 12122 2702 4610 13211 17877 16610
16751 16610 5053 -8581 -8161 -2522 2957 5217 9407 4717 -6671 -11541 4112 28725 28397 31236
16737 31236 27861 31659 31636 27355 24473 20198 18884 18409 25716 47488 77177 103265 151402 207106
16723 207106 245094 311260 347124 321322 276092 222344 159671 105034 63066 37037 26130
16712 26130 26053 34663 36126 17678 9959 4584 1878 -2439 393 -654 3720 3499 -8287 -17336 -20890
16697 -20890 -8543 7958 13370 22575 23585 16035 867 -6397 -17713 -4184 -726 939 -12601
16684a2601m128R204J0394P135j3727P014O527k3027j9579J3139Q923l276Q203
16671e799N40n471j70K770O144j6294L983J1177O858l940K901r76J119L943M182
16656A0967k659k2357L657j867p525p952J1850L493O093j0399n336R888k384N671
16642h860N552M449o112L199o86j0711j0960j0222J7525O488n497L465P902N521
16628A053k088j2938N7O685P120J324o565K764P099O357J764j493j5655r555K687
16613a1384K522J1446J658j0054j0006n439q236p64R261k249J3720J1098J6481
16600A8054L609j8733l71P837j4429l337M961m44J2646m086k857J3606N488p121
16586A4823p93P014l872p353l567R29k948R943j810O050k489r827j6523q014P116
$$ plain form
16684 -12601 -16729 -7525 2869 10004 -3723 3291 9818 -13209 -32788 -19649 -10726 -14002 -5799
16671 -5799 -5259 -10730 -10900 -8130 -1986 -18280 -14297 -3120 3738 -202 2699 1723 2842 6785 10967
16656 10967 8308 -14049 -10392 -12259 -19784 -27736 -15886 -12393 -6300 -16699 -22035 -12147 -14531 -8860
16642 -8860 -3308 1141 -4971 -1772 -2458 -13169 -24129 -34351 -16826 -10338 -15835 -12370 -4468 1053
16628 1053 -1035 -13973 -13916 -7231 -111 1213 -5352 -2588 4511 10868 12632 11139 -4516 -14071 -11384
16613 -11384 -8862 2584 4242 -5812 -15818 -21257 -29493 -30257 -20996 -23245 -9525 1573 18054
16600 18054 21663 2930 2559 10396 -4033 -7370 -2409 -2853 9793 5707 2850 16456 21944 14823
16586 14823 14030 21044 17172 9819 6252 7181 4233 14176 12366 18416 15927 6100 -10423 -18437 -11321
16571a1321J3117L984k5671k18J7127j2188p688P187O842k159J2323J192O725
16558I252n723j751o874Q442Q553n261L457k753J219j5634o992L590J4302m084
16544b57M933J7153Q829k0511j3662J1680j563n407k1034Q95j064M427R953J4560
16530H932Q206M149K191R211j0672n017L42q715j2191N812j0888j5394j866N334
16516b0566J9328l318p037Q356N370K986P321K33j3227J257q678r189L54k177
16502a8987L416j6458R292J3371J3844J7358j5666q853j538j534M362P20J1505
16489A0832O577o997p133n199l561M828l223J0131Q701j44j1068k0358p737J0111
16475a4240r77N943J1929J2473n349m707J071J0084L931J6036k161k1508k1730
$$ plain form
16571 -11321 1796 5780 -19891 -20109 -2982 -15170 -22858 -15671 -8829 -10988 1335 2527 9252
16558 9252 3529 1778 -5096 3346 11899 6638 10095 7342 8561 -7073 -14065 -10475 3827 -257
16544 -257 4676 21829 30658 10147 -3515 8165 6602 1195 -19839 -18944 -20008 -15581 -5628 8932
16530 8932 17138 21287 23478 32689 22017 17000 17342 8627 -3564 2248 -8640 -24034 -25900 -20566
16516 -20566 -1238 -4556 -11593 -3237 2133 5119 12440 12673 -554 703 -7975 -17164 -16810 -18987
16502 -18987 -15571 -32029 -22737 -9366 4478 21836 6170 -2683 -4221 -5755 -1393 -673 10832
16489 10832 17409 10412 3279 -1920 -5481 -653 -3876 6255 14956 14812 3744 -16614 -24351 -14240
16475 -14240 -15217 -9274 2655 15128 9779 5072 6143 16227 20158 36194 34033 12525 -9205
16462i205o300m954J45l506P37N43K738J5820Q671j2208r852o143J3606J1463
16448A555P834j1050Q127j674P737j4178L419l489n331j2344j4916R199M956J2135
16434h020l81j9008M234J6197m677j8266p719Q34q666Q351N535Q345J1370M497
16420g374q444J420m834J2229J9179J782j08j0797j5030N242Q251Q877q926o615
16406e148k227k874Q590j244M035p893j4441J542R191P451J0715J35j2173n560
16392i901L206J457L012P26J0769p109j6857k069M605K260N631N460N875o333
16378G32j1202O328N679J2303j6007p877L630m058j3202P250R308L254L370k129
16364b621J2522L866m857j5017l046L792P251O065l80j0352j1349J582j601O859
$$ plain form
16462 -9205 -15505 -20459 -20314 -23820 -23083 -22540 -19802 -3982 4689 -7519 -17371 -23514 -9908 1555
16448 1555 9389 -1661 6466 4792 12529 -1649 1770 -1719 -7050 -19394 -34310 -25111 -20155 -8020
16434 -8020 -8401 -27409 -23175 -6978 -11655 -29921 -37640 -36806 -45472 -37121 -31586 -23241 -11871 -7374
16420 -7374 -15818 -14398 -19232 -7003 12176 13958 13850 3053 -11977 -6735 1516 10393 1467 -5148
16406 -5148 -7375 -10249 -1659 -2903 1132 -6761 -21202 -19660 -10469 -3018 7697 7832 -4341 -9901
16392 -9901 -6695 -5238 -2226 -1500 9269 2160 -14697 -16766 -12161 -9901 -4270 1190 7065 732
16378 732 -10470 -4142 1537 13840 -2167 -10044 -6414 -10472 -23674 -16424 -7116 -3862 -492 -2621
16364 -2621 9901 13767 8910 -6107 -9153 -5361 1890 7955 7575 -2777 -14126 -12544 -14145 -7286
16350g286J739j2646j4055O221J4659J7985Q9r609K664L088k964J1850j4997o897
16336a0159q753J4266J5771n175k895n155k769K3895J0834q245j5961J623m618
16323B659r650J8717p219j695n099M297J0524K550j165q570j0983l338Q743j096
16309a325J3107K330o411K179j186k2917r476L583J1099O071r470p495k95J3088
16295g118P263J2755P12j0619j1834J653N968N027J717O552o542o215o284k648
16281i613J8771Q631j1417r542M407J2841N274K092r862R0K180j676K338n047
16267I467r879m698K171j293L193P310K358L59j3935r627J778J652p040r920O037
16252b2067J1235o813P647O623j828J1956l747j2521q455p87N028J3575N606J0234
$$ plain form
16350 -7286 -5547 -18193 -32248 -26027 -11368 6617 6706 -2903 -239 2849 -115 11735 -3262 -10159
16336 -10159 -18912 -4646 11125 5950 3055 -2100 -4869 19026 29860 21615 5654 7277 2659
16323 2659 -6991 11726 4507 2812 -2287 2010 12534 15084 13919 5349 -5634 -8972 -229 -1325
16309 -1325 11782 14112 7701 9880 8694 -14223 -23699 -20116 -9017 -2946 -12416 -19911 -20206 -7118
16295 -7118 145 12900 13612 2993 -8841 -7188 -1220 3807 5524 12076 5534 -681 -6965 -9613
16281 -9613 9158 17789 6372 -3170 1237 14078 19352 21444 11582 11672 13852 12176 14514 9467
16267 9467 -412 -5110 -2939 -4232 -1039 6271 8629 8988 -4947 -14574 -12796 -11144 -18184 -28104 -22067
16252 -22067 -10832 -17645 -9998 -3375 -5203 6753 3006 -9515 -17970 -18757 -13729 -154 5452 15686
16238A5686l604l685R18j105M76k935n734k725J0300O91K529r315k69R580R049
16223A9857j2862j1516P418j700M208N171k2411M027p7l741o967l115J0083J0183
16209a442M087l125j0962J790n11K182J4272O251K504q253j0700K383L915k966
16195e75o276M159O895k140O686o805j1084L359P139J5611J637j2920J0930L732
16181B0348p666n065l159M549R756l844j3346j3775M92J6649Q018j576j187M548
16167A4742k7768m099m559J218Q946n722J617M996p49j2978J2500K4124j759J082
16153A1591K610j1270j4170k505J9864P345j2452J0394r296j2548J277j191N543
16140d808L0621N724j0291L575r903o799L577K019Q501J0954k728j6021j6565
$$ plain form
16238 15686 12082 8397 9315 8210 8686 5751 17 -2708 7592 8283 10812 1497 1228 10808 19857
16223 19857 6995 -4521 2897 1197 5405 10576 -11835 -7808 -7885 -11626 -18593 -21708 -11625 -1442
16209 -1442 2645 -480 -11442 -9652 -10163 -7981 6291 12542 15046 6793 -3907 -1524 2391 -575
16195 -575 -6851 -2692 4203 2063 8749 1944 -9140 -5781 1358 16969 18606 5686 16616 20348
16181 20348 12682 7617 4458 9007 18763 14919 1573 -12202 -11710 4939 12957 11381 10194 14742
16167 14742 -13026 -17125 -21684 -20466 -11520 -17242 -15625 -10629 -11378 -24356 -11856 12268 10509 11591
16153 11591 14201 2931 -11239 -13744 6120 13465 1013 11407 2111 -10437 -9160 -10351 -4808
16140 -4808 25813 31537 21246 24821 14918 8119 11696 13715 22216 33170 30442 14421 -2144
16127b144j746O572o192o402J21J1735L729P547J5171o955Q523O614j1651k1470
16113C452l917J5398l744j2408P094N713j625o829o20Q708L717L850l916M12N469
16098B0754q928q240K282o237J87L324q516j3607M270K0062l477m939m382p920
16084a5367j3645k281J1144N782k290M512O387n944m998K870M720K348q100J2229
16070b633J1802k307k982o343m406r26o411o383k537l369k315R290J3260J182
16056e078L781m554n706j003N072R087j346r375N32Mn31p38Q935L71J0662P733
16040A7846K633p288j4851L581r784j0060l154J1676L696Q431N541p14l838j8901
16026a5186n443O301J0449P816r658j610J6180P150p003r788o36K673j1008j0227
$$ plain form
16127 -2144 -3890 2682 -3510 -9912 -9791 1944 5673 13220 28391 21436 29959 36573 24922 3452
16113 3452 -465 14933 11189 -1219 5875 11588 9963 3134 2514 11222 14939 18789 14873 15285 20754
16098 20754 11826 3586 5868 -369 -182 3142 -5374 -18981 -14711 5351 1874 -3065 -7447 -15367
16084 -15367 -29012 -31293 -20149 -14367 -16657 -12145 -5758 -11702 -16700 -13830 -9110 -6762 -14862 -2633
16070 -2633 9169 6862 3880 -2463 -6869 -7795 -14206 -20589 -23126 -26495 -28810 -19520 -6260 -5078
16056 -5078 -1297 -5851 -11557 -12560 -7488 1599 253 -9122 -8590 -8586 -9117 -9855 -920 -549 10113 17846
16040 17846 20479 13191 -1660 1921 -7863 -17923 -21077 -9401 -5705 2726 8267 7553 3715 -15186
16026 -15186 -20629 -14328 -3879 3937 -5721 -7331 8849 15999 8996 -792 -1428 1245 -9763 -19990
16012a9990j595n345J0826K170R4o077J556j080K346K716J8775K056q588k4612
15998b6748n777J1981N459J526N302n413J842O856J6505k625n769o573j0715j2714
15984b6863n710k8N259J7027K229j246l083R886Q470N40J8O556j325j348r137
15969A245m889L081R265p791j6248j1536J073J2137l941r45R905J081m857k932
15955a5352P05J0148R180r219n936M286q411l52m503k282R562k380J734K030j9352
15940c0142l432m01J7321j619J2512K0654J1484p236j0620j07q773o448P02p5
15926f180M752J0583k715K474K002r775j6713K754O667l230q419J007J141R39
15912a4713m946L401J317n775N471J3005k692j3934J61m22K611L026m915n058
$$ plain form
16012 -19990 -21585 -26930 -16104 -13934 -13840 -19917 -18361 -19441 -17095 -14379 4396 6452 -2136 -26748
15998 -26748 -32525 -20544 -15085 -13559 -8257 -13670 -11828 -4972 11533 8908 3139 -3434 -14149 -26863
15984 -26863 -32573 -32601 -27342 -10315 -8086 -9332 -12415 -2529 5941 6481 6499 13055 11730 10382 1245
15969 1245 -3644 -563 8702 911 -15337 -26873 -25800 -13663 -17604 -18549 -8644 -7563 -12420 -15352
15955 -15352 -14647 -4499 4681 -4538 -10474 -6188 -14599 -14951 -19454 -21736 -12174 -14554 -12820 -10790 -30142
15940 -30142 -33574 -33975 -16654 -18273 -5761 14893 26377 19141 8521 8414 -359 -6807 -6105 -6180
15926 -6180 -1428 9155 6440 8914 10916 1141 -15572 -12818 -6151 -9381 -17800 -16793 -15652 -14713
15912 -14713 -19659 -16258 -14941 -20716 -15245 -2240 -4932 -18866 -18705 -19127 -16516 -13490 -18405 -23463
15898b3463R810o646l620J0190J2782l560j4560m571K033J6002N922L72K355j2950
15884i904j2782J5813N511L307j0074j7748J3677J0844l688j0900j0389K687K1441
15871b205M233j4957l172L423K191l768p68L390L630j0472n13N057J3941o333
15857f323j1350L67J1991M625j4459J807J2788R842q819k125K552r62Q458n837
15843B555p901j700K401k121j1983r143P021M743J4M81J3026R60M410J659j574
15828B848O568j3252m448n305k031L486Q275J3165m19J045Q295q884J187o91j3758
15813c919o367J767l090J0033O815j0443j0498O563J2476J7234O359p970o506
15800A2454K959j0850j0517l583K549n739J8834P875j7070j754Q464N21n021j0846
$$ plain form
15898 -23463 -13653 -20299 -23919 -13729 -947 -4507 -19067 -23638 -21605 -5603 319 691 3046 -9904
15884 -9904 -22686 -6873 -1362 1945 -8129 -25877 -12200 -1356 -5044 -15944 -26333 -23646 -2205
15871 -2205 2028 -12929 -16101 -12678 -10487 -14255 -15023 -11633 -8003 -18475 -18988 -13931 10 -6323
15857 -6323 -17673 -17306 -5315 -690 -15149 -13342 -554 9288 469 -1656 896 -66 8392 2555
15843 2555 -5346 -7046 -4645 -6766 -18749 -27892 -20871 -16128 -16114 -15633 -2607 -1647 2763 4422 2848
15828 2848 9416 -3836 -8284 -13589 -15620 -12134 -3859 9306 8887 9932 18227 9343 10530 9839 -3919
15813 -3919 -10286 -8519 -11609 -1576 5239 -5204 -15702 -9139 3337 20571 26930 18960 12454
15800 12454 15413 4563 -5954 -9537 -6988 -12727 6107 13982 -3088 -4842 3622 4143 -878 -11724
15786a1724K63R044J0972K965l391l610J14m888R172O783K711J894J251p860R387
15771B3083K296j8610j3218J8079J971j3727o742n480J5927J7829r219q127o374
15758b312k080p960O263J8474n62q16o116J584j597o471l914J755j0356j2320
15744b6428J8651P036J882l435l666J487R90p360J0735J5051l989k724j0655o497
15730h922J2110J720o261J716J890P922o956o330N649k0021m959J4967R040J515
15716C080j1138p967o875R698L5K558l932p040R343O694k971l004J1979L438J0721
15701A4619Q460r516j7299q615K364K834J1103j059q191N451j3123J1J1272P112
15687E423O906l492j1697K534P974j1653K06Q559l51j0914l275N277l562J4730
$$ plain form
15786 -11724 -11461 -2417 8555 11520 8129 4519 4633 -255 8917 15700 18411 20305 21556 13696 23083
15771 23083 25379 6769 -6449 11630 13601 -126 -6868 -12348 3579 21408 12189 4062 -2312
15758 -2312 -4392 -12352 -6089 12385 11823 11007 4891 6475 4878 -1593 -5507 -3752 -14108 -26428
15744 -26428 -7777 -741 1141 -2294 -5960 -4473 -3483 -10843 -108 14943 10954 8230 -2425 -8922
15730 -8922 3188 4908 -1353 363 2253 10175 3219 -3111 2538 -17483 -22442 -7475 1565 3080
15716 3080 -8058 -16025 -22900 -13202 -13167 -10609 -14541 -21581 -12238 -5544 -8515 -11519 460 3898 14619
15701 14619 23079 13563 -3736 -12351 -9987 -7153 3950 2891 -5300 151 -12972 -12961 -1689 5423
15687 5423 12329 8837 -2860 -326 7648 -4005 -3799 4760 4409 -6505 -9780 -4503 -8065 6665
15673F665K833j1178O792q486o562M730J4745p00j2426R599O518q462n930Q410
15659F548o886n956l080m079p177m780j0464l372J0878Q577k439O598J2094L961
15645D23J6236L020k245N31j2050j6997M256M877k598M327J0447j3345o037L512
15631e643N316n327J784J9300Q442k6265j5145K535K0992K532k558l927j090l823
15617b877L037M029j461R60P110J2210O116j6479j7044M364P764J1239l827j8919
15603c778m241j041J110J05L841l019q331J9070M751n771J2254J3451J129j3767
15589A5763n656J010N410p556M011k543o35j839P151p556o454o484J410O810M231
15574G073j1768m448q714J974L632J450L9L117J9569J0243j3350j2505j4296K230
$$ plain form
15673 6665 9498 -1680 5112 -3374 -9936 -5206 9539 8839 -3587 6012 12530 4068 -1862 6548
15659 6548 -338 -6294 -9374 -13453 -20630 -25410 -35874 -39246 -28368 -19791 -22230 -15632 -3538 423
15645 423 16659 19679 17434 17965 5915 -11082 -6826 -1949 -4547 -220 10227 -3118 -9155 -5643
15631 -5643 -327 -5654 -3870 15430 23872 -2393 -17538 -15003 5989 8521 5963 2036 946 -2877
15617 -2877 160 4189 2728 3688 10798 23008 29124 12645 -4399 -35 7729 18968 15141 -3778
15603 -3778 -8019 -9060 -7950 -7845 -4004 -7023 -15354 3716 8467 2696 14950 28401 29530 15763
15589 15763 10107 11117 16527 8971 12982 10439 9804 7965 15116 7560 1106 -5378 -3968 2842 7073
15574 7073 -4695 -9143 -17857 -15883 -12251 -10801 -10762 -7645 11924 22167 8817 -3688 -17984 -15754
15560a5754j730m688N430j3203N029Q535R894J1890p566o12Q663L644J67j488
15546H211J513k819j2554L07O439K169j7144o716J1332Ll218r264K859N132k492
15531a6242P398J3755K164m858m339N775p275j2917O813j836Q874l409J503r613
15517a4207O465K0176P147j051j3894o777m210j6409j9221O185K0898Q386Q689
15504B177K982q118n63K663m837M595J1721n270n541R847K485k3915o047P172
15490a0649j772m963Q465m064L01J895L967m413n199K382L125J182R167N082N00
15475E006k896P893M722n379o075Q451p145j7100J316O154K602P444k583l920
15461a510k866R985l038j2098L80n594J216Q730J625n984P797J5319J375l682
$$ plain form
15560 -15754 -17484 -22172 -16742 -29945 -24916 -16381 -6487 5403 -2163 -2775 5888 9532 9699 8211
15546 8211 9724 6905 -5649 -5342 1097 3266 -13878 -20594 -9262 -9259 -12477 -21741 -18882 -13750 -16242
15531 -16242 -8844 4911 7075 2217 -2122 3653 -3622 -16539 -9726 -11562 -2688 -6097 -4594 -14207
15517 -14207 -7742 12434 19581 18530 4636 -2141 -6351 -22760 -41981 -35796 -14898 -6512 2177
15504 2177 5159 -2959 -3522 -859 -5696 -1101 10620 5350 -191 9656 12141 -11774 -17821 -10649
15490 -10649 -12421 -17384 -8919 -12983 -12682 -10787 -6820 -11233 -16432 -14050 -10925 -9743 -576 4506 5006
15475 5006 2110 10003 14725 9346 3271 11722 4577 -12523 -11207 -5053 -2451 4993 2410 -1510
15461 -1510 -4376 5609 2571 -9527 -9147 -14741 -13525 -4795 -3170 -9154 -1357 13962 15337 11655
15447A1655M663o393r210j2732r144j1325J0602K0104Q144n986j1163j7894P047
15434b1632J4031Q645m465j0005O29J60N046O933L162l570J6888K223j0193j3519
15420e667J689K04J1052K330L173J392J1721j021l207p787p162l392K546j7143
15406a1272o993J0200K966P379J406n409O985K25J0895j3575j9723M000o01p178
15392b0695k379J4427o57j300J1422j3588r689Q010J532m72j05l632J4274J5664
15378A2812k35q144j786m046n423Q989J0942L474N490r474j495j763M405M891
15364A8637l204q063J129p691k37l8j194J8723o978j0764m408N376k683k938N669
15349A336J2239J0963N249o686k0607j0803J0676j919n748P424N123k44q559j528
$$ plain form
15447 11655 16318 9925 715 -12017 -21161 -32486 -21884 -1780 6364 378 -10785 -28679 -21632
15434 -21632 -7601 1044 -3421 -13426 -12797 -12637 -7591 -658 2504 -1066 15822 18045 7852 -5667
15420 -5667 -3978 -3774 7278 9608 12781 14173 25894 24873 21666 13879 6717 3325 5871 -11272
15406 -11272 -18265 -8065 -5099 2280 3686 -1723 5262 5487 16382 2807 -16916 -12916 -13517 -20695
15392 -20695 -23074 -8647 -9304 -10604 818 -12770 -22459 -14449 -12917 -13389 -13494 -17126 -2852 12812
15378 12812 12577 4433 2647 -1399 -6822 2167 13109 16583 22073 12599 11104 9341 13746 18637
15364 18637 15433 7370 8499 808 571 533 -661 18062 11084 320 -4088 1288 -1395 -4333 1336
15349 1336 13575 24538 29787 23101 2494 -8309 2367 448 -5300 2124 7247 7003 -1556 -3084
15335c084J5782N096M654k01q095j1314N899Q042q614K561N742j852J318J803
15321A7737p586K350J317n84K260p883J5M917L22k416k846j3883L413j01r018
15306a1986j2619R748M335J3902R781r100n420k38j1948l95l893j664L005P111
15292i381K58J3817K4253o800j0731R526l058p518r185P041O905j1401q723P601
15278B604R894K963j0116P175Q667m4p499m379j0135J349J6892n511m873M459
15264A1446N518R600q616j7125n054N373J3531R766j2307j3524P147q814j4405
15251a7464L81q05N134m884J4673L248M371Q024P559J447p3p237l202j00j915
15236I157J72R858L706l056j7968j082j1790j0400O231L0236P812k443j0278l494
$$ plain form
15335 -3084 12698 17794 22448 22247 14152 2838 8737 16779 8165 10726 16468 14616 15934 17737
15321 17737 10151 12501 13818 13234 15494 7611 7626 12543 12865 10449 7603 -6280 -2867 -2968 -11986
15306 -11986 -24605 -14857 -10522 3380 13161 4061 -1359 -1597 -13545 -13940 -17833 -19497 -16492 -9381
15292 -9381 -9123 4694 28947 22147 11416 20942 17884 10366 1181 8222 15127 3726 -4997 2604
15278 2604 12498 15461 5345 12520 21187 21143 13644 9265 -870 479 17371 11860 6987 11446
15264 11446 16964 26564 17948 823 -4231 1142 14673 24439 12132 -1392 5755 -3059 -17464
15251 -17464 -17083 -17888 -12754 -17638 -2965 283 4654 12678 20237 21684 21611 14374 11172 11072 9157
15236 9157 9329 19187 22893 19837 1869 787 -11003 -21403 -15172 15064 22876 20433 10155 6661
15222F661M648J912j934k0876q978J7999L071j2097J1187J3444n570j5540j97
15209f270P145j143r303l414J0604K5780K3107j4106k6996j9039o241J0897M872
15196d107J0704J7317j0527j7246K904k052l6R559j1641m369K121q144k866P490
15182a0893Q848n868k8942J1084J4508P427J787R414K767n913L552J7117J2957
15169C7845j4301j7015n315O335J2207J1047p611k1170j4403O871J3245k277m719
15156G39j950q458l119P28R024P833l762o605r67L770q209J0961Q877O540O268
15141B1670n897p148m651l071Q167K964K807j214K748L05N664J198p877r248J902
15126H319q738q826O168O89N246J9517n883j5946L843K344K23M118O96m323o46
$$ plain form
15222 6661 11309 13221 11287 -9589 -18567 -568 2503 -9594 1593 15037 9467 -6073 -6270
15209 -6270 875 -268 -9571 -12985 -2381 23399 46506 32400 5404 -13635 -19876 -8979 -4107
15196 -4107 6597 23914 13387 -3859 -955 -3007 -3043 6516 -5125 -9494 -7373 -15517 -18383 -10893
15182 -10893 -2045 -7913 -36855 -25771 -11263 -3836 -2049 7365 10132 4219 7771 24888 37845
15169 37845 23544 6529 1214 7549 19756 30803 23192 2022 -12381 -5510 7735 5458 739
15156 739 -1211 -9669 -12788 -12060 -3036 4797 1035 -5570 -6537 -2767 -10976 -15 8862 15402 21670
15141 21670 15773 8625 3974 903 9070 12034 14841 13627 16375 16680 22344 23542 15665 6417 8319
15126 8319 -419 -9245 -3077 -2388 2858 22375 16492 546 4389 6733 6956 11074 11770 7447 6801
15111F801k437M51J525J0815k531j1863L479P121L362K489j2910n306M412l000
15097B408l265p269J1529K694r534O305J849k49M000l511Q594P498O937j3817
15083A4169k6434l132O908M632q61k918Q843O891J4834j3323j6301j2037K399
15070a6330J3224o37j0790j0207L156J0038J0951o908N89O073M827J7237J6378
15057C7601j499m266k0844L919P203k983q748J239K448j1823r140n659K393J3420
15043C261k151M235r98Q551j625n789n77J3829N600n508J986l574k883j5408l975
15028e026j0833j997J486N484p783N227k722L093O257N777q796k07R882P44l424
15013b838k10K847L965q356P35l305J306Q727L467r930M157J4099l22j448J2463
$$ plain form
15111 6801 4364 4815 6340 17155 14624 2761 6240 13361 16723 19212 6302 996 5408 2408
15097 2408 -857 -8126 3403 6097 -3437 2868 4717 4468 8468 4957 13551 21049 27986 14169
15083 14169 -12265 -15397 -8489 -3857 -4718 -7636 1207 8098 22932 9609 -6692 -18729 -16330
15070 -16330 -3106 -3743 -14533 -24740 -21584 -11546 -595 -7503 -6914 -841 3986 21223 37601
15057 37601 36102 31836 10992 14911 22114 19131 10383 11622 14070 2247 -6893 -12552 -10159 3261
15043 3261 1110 5345 4347 12898 11273 5484 4907 18736 24336 18828 20814 17240 14357 -1051 -5026
15028 -5026 -15859 -17856 -16370 -10886 -18669 -13442 -16164 -13071 -6814 -1037 -9833 -10040 -158 586 -2838
15013 -2838 -3048 -201 3764 -4592 -3857 -7162 -5856 2871 6338 -3592 565 14664 14342 12894 25357
14998B5357l360j808j0013O44l341l643M560N847J313k917m240q76n236q591k0660
14983b6964Q38K909Q773J4297P064J25J5354N624p296J506m6k1714j2236J523
14969a0243J1920j0343O06M981l586p635N466J1290k97r975O999N216j0246J410
14955d437O908j569q184N790l596j1361l792M455P601o059K357J3779m491j4738
14941a7337q817M448J3160N271N024N784M505o475p748o826j7879J1531J3739
14928a620j632O175j5933O412J0597L990j1424j1818q811O571O017m000j228Q681
14914h023J9228K628K706o383k45q422J929Q28o273j020J5795O920o722p267p22
14899D957o221r628j3033K97K70J4246Q567Q28j139l048j0624j5093Q030R239
$$ plain form
14998 25357 21997 20189 10176 10820 7479 3836 8396 14243 15556 12639 8399 7523 2287 -6304 -26964
14983 -26964 -26126 -23217 -14444 -147 6917 7042 22396 28020 20724 22230 22184 470 -11766 -10243
14969 -10243 1677 -8666 -8060 -3079 -6665 -14300 -8834 2456 2159 -7816 -817 4399 -5847 -4437
14955 -4437 2471 902 -7282 -1492 -5088 -16449 -20241 -15786 -8185 -14244 -11887 1892 -2599 -17337
14941 -17337 -26154 -21706 -8546 -3275 1749 7533 12038 5563 -2185 -9011 -26890 -15359 -1620
14928 -1620 -3252 2923 -13010 -6598 3999 7989 -3435 -15253 -24064 -17493 -11476 -15476 -16704 -8023
14914 -8023 11205 13833 16539 10156 9911 1489 3418 4246 -2027 -3047 12748 19668 12946 5679 4957
14899 4957 -1264 -10892 -23925 -23628 -23358 -9112 -545 283 -856 -3904 -14528 -29621 -21591 -12352
14885a2352R385M393J6256R295j2499m533J0041J1912r146J564n998j0403M214
14872A2129J3884j1550j769L349J0791K54l746n976n084l054N07k62M674j000
14858A3147p634P117N292J143k37j1160j384q539j5853j275M264J896J6642M87
14844C906j4604m815K840L908M469J126K32j0590r06M390l96j4509N969k246j48
14829b1374K0351J155p976j3335M180J5007P506n804j1555n03J0902o988k626
14816a1060q405R157J1603K873l018N116J6268M306j1382j4652J7o604n904O951
14802d734K689L758O835L416j4516r233J3104j1003j4298J4053J3296J6122p170
14789A2319m171J1985O494n741l069k998o046m158k365j799o70O143j1650j646
$$ plain form
14885 -12352 -2967 1426 17682 26977 14478 9945 19986 31898 22752 24316 18318 7915 12129
14872 12129 26013 14463 12694 16043 26834 27088 23342 17366 12282 9228 9735 9473 14147 13147
14858 13147 5513 12630 17922 19065 18828 7668 6284 -2255 -18108 -19383 -15119 -13223 3419 3906
14844 3906 -10698 -15513 -12673 -8765 -4296 -3170 -2938 -13528 -14434 -10044 -10440 -24949 -18980 -21226 -21374
14829 -21374 -1023 132 -7844 -21179 -16999 -1992 5514 -290 -11845 -12348 -1446 -8434 -11060
14816 -11060 -19465 -10308 1295 4168 1150 6266 22534 26840 15458 806 823 -5781 -11685 -4734
14802 -4734 -2045 1713 8548 11964 -2552 -11785 1319 -9684 -23982 -9929 3367 19489 12319
14789 12319 8148 20133 26627 20886 17817 14819 8773 4615 2250 451 -219 5924 -5726 -7372
14775g372J4905P544j1081l525J4859j0346J691L294q683r429n865L035N188N038
14761g47K701j995J0584M474M439N250o168r690M946j0740j0738k352R560n95
14747a071r833J3857J6580n887q473p535j1540O34l130O291O074Q753j0042r739
14733a5061R383O541o091r600M687Q802M823P850K076j816j1047j7840q275M917
14719b0651J9074M057j773j611p560p326L708O296J698J1283L337o299J3195J984
14705A9412n729o480m680P601k6090k6263K53K5185J5569J843k887M223n182q642
14691a1867q405Q396O754P597q174L545K587j9210j3949K084K0265R976O456P478
14677A3533j0521j900O166N079Q92m292k0748n742j112r362nK59J2755J9911k634
$$ plain form
14775 -7372 7533 15077 3996 471 15330 4984 6675 9969 1286 -8143 -14008 -10973 -5785 -747
14761 -747 1954 -41 10543 15017 19456 24706 18538 8848 13794 3054 -7684 -10036 -476 -1071
14747 -1071 -10904 2953 19533 13646 5173 -2362 -13902 -13268 -16398 -10107 -4033 4720 -5322 -15061
14733 -15061 -5678 863 -5228 -14828 -10141 -1339 3484 11334 13410 11594 547 -17293 -25568 -20651
14719 -20651 -1577 2480 707 -904 -8464 -15790 -12082 -5786 -4088 7195 10532 4233 17428 19412
14705 19412 13683 7203 2523 10124 -15966 -42229 -41976 -16791 -1222 621 -2266 1957 -3225 -11867
14691 -11867 -20272 -11876 -5122 2475 -5699 -2154 433 -18777 -32726 -30642 -10377 -401 6055 13533
14677 13533 3012 1112 7278 12357 13249 8957 -11791 -17533 -18645 -28007 -28012 -27753 -14998 4913 2279
14662B279p485l597P781K523j1056m683Q689N600Q753K316M600k573j5396j1794
14648a4043n033N786R678J1874o040l343k517L363J6765r886q926O584K778k266
14634D774n171J4351j4474l558j599k704O788j927J189Q101J507N865M264r074
14620H332j4939j337J8379o70r29l5n396Q044J699J1368K823j5195j15l063K311
14605A1277l938p313Q306j40o260o287q833j526j825P822N3J0166J6583P463j2674
14590A2874o512J639j5396j3280M301O391m552L718J4663J2399J2273k1795j0868
14577d145J0709J216o465P493R790N570r231Q509N284m740r963m035j81l81J143
14562A0573O244J81k5008q786J5220p337j1048o621O731O684k395M30P082J0157
$$ plain form
14662 2279 -5206 -8803 -1022 1501 -9555 -14238 -5549 51 8804 11120 15720 13147 -2249 -14043
14648 -14043 -19076 -13290 -3612 8262 2222 -1121 -3638 -275 16490 6604 -2322 4262 7040 4774
14634 4774 -397 13954 -520 -4078 -5677 -8381 -1593 -3520 -2331 5770 7277 13142 17406 8332
14620 8332 -6607 -7944 10435 9765 8836 8801 3405 11449 13148 24516 27339 12144 12029 8966 11277
14605 11277 7339 26 8332 8192 1932 -4355 -13188 -14714 -16539 -8717 -8664 1502 18085 25548 12874
14590 12874 6362 8001 -7395 -20675 -16374 -9983 -14535 -10817 3846 16245 28518 6723 -4145
14577 -4145 6564 7780 1315 8808 18598 24168 14937 23446 28730 23990 14027 9992 9811 9430 10573
14562 10573 16817 16998 -8010 -16796 -1576 -8913 -19961 -26582 -19851 -13167 -15562 -15132 -8050 2107
14548B107K90r302O82k355J2155P237J0170j226j4113n543K203M448O122o777
14534F098M892N386k720l065r56r835l253N384J599M738J807L123o336j4178o808
14519a4124R536O628l521L141Q148J706j443J790p512l643p593k041Q47R586P568
14504I073M507j494m535p727q122P231k450o632J3801L624k530p867M822J862
14490C563N21j2030k15M957J1065J459o659L631r43j9721J43R823R795j095r540
14475e246m50P504L035J831m167j0360n692M542K800O246O46m660r641l858J1417
14460f053R124N312l587j2309L24m581n062N276n043j0990K763j297M428M454
14446a7241m550m677J758J2220K314k211R231R153O5k281m705p899m752J1011
$$ plain form
14548 2107 2397 -6905 -6223 -8578 3577 10814 20984 19758 5645 102 2305 6753 12875 6098
14534 6098 10990 16376 13656 10591 9635 -200 -3453 1931 3530 8268 10075 13198 6862 -7316 -14124
14519 -14124 -4588 2040 -1481 1660 9808 11514 10071 11861 4349 706 -6887 -8928 -8081 1505 9073
14504 9073 13580 12086 7551 -176 -8298 -1067 -3517 -10149 3652 7276 4746 -3121 1701 3563
14490 3563 4084 -7946 -8161 -3204 7861 9320 2661 6292 5349 -14372 -14229 -4406 5389 4294 -5246
14475 -5246 -5696 1808 4843 6674 2507 -7853 -13545 -9003 -6203 43 689 -3971 -13612 -17470 -6053
14460 -6053 3071 8383 4796 -7513 -7189 -11770 -16832 -11556 -16599 -27589 -24826 -26123 -21695 -17241
14446 -17241 -21791 -26468 -24710 -12490 -10176 -12387 -3156 5997 6062 3781 -924 -8823 -13575 -2564
14432b564n763m183J1059j989p046Q325R545o003R56R86p342j4097P296J3406
14418B586J0775j448j6945q805j0881q257J3803J3980O042l737J3271Q003K702
14405B1089o125j8085p379L667J2019n132j824l438p371n284J1205L838l61L2
14391c149n958j1406R39J0418J9023k446j3590k897j529M339J211O455k744o466
14377g800o185J256K1952J944l646K401M026m778k656n025j7680p717l76J5583
14363h701k116j1088J0132M083N861K238O545k150k492q224j0019J1564L125m624
14349e866j0056l162J0415k671K560K111O84J2096J2305O1j2569p497R518Q804
14335A6733m747L744k212j8321k795j1263o945O813J1925P24j1333j0486J2599
$$ plain form
14432 -2564 -8327 -12510 -1451 -3440 -10486 -2161 7384 1381 2337 3323 -4019 -18116 -10820 2586
14418 2586 13361 11913 -5032 -13837 -24718 -32975 -19172 -5192 850 -2887 10384 18387 21089
14405 21089 14964 -3121 -10500 -6833 5186 54 -1770 -5208 -12579 -17863 -6658 -2820 -3181 -3149
14391 -3149 -9107 -20513 -19574 -9156 9867 7421 -6169 -9066 -10595 -6256 -5045 1410 -1334 -7800
14377 -7800 -13985 -12729 9223 11167 7521 9922 13948 9170 6514 1489 -16191 -23908 -24284 -8701
14363 -8701 -10817 -21905 -11773 -7690 -1829 409 6954 4804 2312 -5912 -15931 -4367 -1242 -5866
14349 -5866 -15922 -19084 -8669 -11340 -8780 -6669 -5985 6111 18416 18477 5908 -1589 7929 16733
14335 16733 11986 15730 13518 -4803 -7598 -18861 -25806 -18993 -7068 -6344 -17677 -28163 -15564
14322a5564J3047k789j6154M575q72j4953J508J3297k12L064k812o002k988R46
14308b5909l969N159R605J6810J5347Q447M836m174L77p930j3691q482J802n977
14294g749M758m521R00J9308M565j2654k710n174n326j156j12J1044l176O197
14280D194j344O788m905L581N274o252j279k228j2023R154J1245N03j641P799
14266A8866j613p699n243n837o60k304O228J6327N50p387n770j164l07O631o457
14251D161n317J4583R729j4168j6350J0094J0316o918j9942M833R700R793r95
14238I519q834M006Q909K270r786J241m70J495K451Q02M330N833n665k5718o81
14223a0298J503l051j84o439J0464j2646j039N152N910J0478J653K873r602P630
$$ plain form
14322 -15564 -2517 -5306 -21460 -16885 -17757 -32710 -31202 -17905 -18117 -15053 -17865 -23867 -26855 -25909
14308 -25909 -29878 -24719 -15114 1696 17043 25490 30326 26152 26529 18599 4908 -3574 -1772 -7749
14294 -7749 -2991 -7512 -6612 12696 17261 4607 1897 -3277 -8603 -9759 -9871 1173 -2003 4194
14280 4194 2850 9638 4733 8314 13588 7336 6057 3829 -8194 960 12205 12708 11067 18866
14266 18866 17253 9554 4311 -1526 -2186 -4490 1738 18065 18615 11228 5458 4294 3987 10618 4161
14251 4161 -1156 13427 23156 8988 -7362 2732 13048 6130 -13812 -8979 721 10514 9519
14238 9519 685 4691 13600 15870 6084 7325 6855 8350 10801 11603 15933 21766 16101 -9617 -10298
14223 -10298 -8795 -11846 -12030 -18469 -8005 -20651 -21690 -16538 -10628 -150 1503 4376 -5226 2404
14209B404M886n274p42M037N259j4512k981N506J0944J882p110j222p694J530
14195c087j4743n781K894K007M598R826L975o582J83L487J946K093J305N168M956
14180A2245r689j0910J361J8916M164j1533l199j3960R377L131l559p55p682M026
14166h067R462O237J011o037O947M662j1244j4659K895Q828j133L767K183n017
14152a65l850m260l458o021P97Q111j81R23J0028j0878O390o564L203R75K329
14137b621k855M676L192o141M585o658j686Q848J2749K522O742l741J85k563j0879
14122F355l784M796q080m259j103R324m992j2360o383j279q152J2991K4093N310
14108A2477l412m429j4013p034n052j9506J4246M385n399R892J161J0400K2391
$$ plain form
14209 2404 7290 2016 1274 5311 10570 -3942 -6923 -1417 9527 11409 4299 3077 -4617 -3087
14195 -3087 -17830 -23611 -20717 -18710 -14112 -4286 -311 -6893 -6710 -3223 -1277 816 2121 7289 12245
14180 12245 2556 -8354 -6993 11923 16087 4554 1355 -12605 -3228 -97 -3656 -4411 -12093 -8067
14166 -8067 1395 7632 8643 2606 9553 14215 2971 -11688 -8793 35 -1098 2669 4852 -165
14152 -165 -4015 -8275 -11733 -17754 -16957 -8846 -9027 -8104 1924 -8954 -2564 -9128 -5925 -4950 -2621
14137 -2621 -5476 -800 2392 -3749 836 -5822 -7508 1340 14089 16611 23353 19612 19797 17234 6355
14122 6355 2571 7367 -713 -4972 -6075 3249 -1743 -14103 -20486 -21765 -29917 -16926 7167 12477
14108 12477 9065 4636 -9377 -16411 -21463 -40969 -26723 -22338 -27737 -17845 -16684 -6284 16107
14095A6107P516M8j4973j163m444K619N406m390j4623j7741N41K8365J1687p11
14081A4244l452n612J2784J1239j8877j7058K71P454J4317M618j1288N655R959
14068B4254N509j430j551J285k689p59M276p92L022j844l867q780N615q936M240
14053A7553m973p354j1159P100K736q741P344J9199j4152k7941M380J662J844
14040a2502P311J1454n777O356J631j1957J1898L841j8694j0703N808J115K447
14027g772J2823k434J1591P081j1255k637l780j1169k25Q931K309j984L56J76
14013B011J3040P550j0849j992J2015j230j0461K400l378N131n262j1959n199
14000h183p882J628N646r12J1462R196J502q28j408J4944P178j462o62q409o54
$$ plain form
14095 16107 23623 23671 8698 7535 3091 5710 11116 6726 -7897 -25638 -25097 3268 14955 14244
14081 14244 10792 5180 17964 29203 10326 -6732 -6461 993 15310 19928 8640 14295 24254
14068 24254 29763 28333 26782 28067 25378 24619 28895 28103 31125 29281 25414 16634 22249 13313 17553
14053 17553 12580 5226 -5933 1167 3903 -4838 2506 21705 7553 -20388 -16008 -14346 -12502
14040 -12502 -5191 6263 486 6842 8473 -3484 8414 12255 -6439 -17142 -11334 -10219 -7772
14027 -7772 5051 2617 14208 21289 10034 7397 3617 -7552 -7777 1154 3463 1479 1835 2011
14013 2011 15051 22601 11752 9760 21775 20545 10084 12484 9106 14237 8975 -2984 -8183
14000 -8183 -16065 -14437 -8791 -9703 1759 10955 12457 11629 10221 25165 32343 30881 30219 21810 21156
13985B1156L380N398M726J6147M840K214j6714q550K667J34p561o623r29R794
13971C0079l65n790p81l734l642J80k454k3720p354R526l489J6165J3579q573
13957I627k1490r361J4426J6628J466j4132K959J1678p13O69p961j704J539O676
13943A0307N900O22j5518j0894P904l60q685J0901R93J0072l899n530j223j0653
13929a0063q524J0308J116n8p891J6646P468o25j618j1503m228q565j0203m497
13915c2237J0059o201L457M565N626J9456O676j357j0250j81L561j437K480J611
13901E828l4K682M416J1054pq906j3604j740Q379N418M419j831O784oj8248n435
13885h31m398L846O276J298J6677J0042l373j0361j3043n845M334m684M044l344
$$ plain form
13985 21156 24536 29934 34660 50807 55647 57861 41147 32597 35264 35398 27837 21214 20285 30079
13971 30079 29714 23924 23143 19409 15767 15947 13493 -10227 -17581 -8055 -11544 4621 18200 9627
13957 9627 -11863 -21224 -6798 9830 11296 -2836 123 11801 11088 11757 3796 2092 3631 10307
13943 10307 16207 16829 1311 -9583 -1679 -2039 -10724 177 1170 11242 7343 1813 590 -10063
13929 -10063 -18587 -8279 -7163 -7221 -15112 1534 9002 8377 6759 -4744 -8972 -17537 -27740 -32237
13915 -32237 -22178 -28379 -24922 -20357 -14731 4725 11401 10044 -206 -387 3174 1737 4217 5828
13901 5828 5794 8476 12892 23946 23939 15033 1429 -311 8068 13486 17905 16074 22858 22852 4604 -831
13885 -831 -5229 -1383 4893 6191 22868 32910 29537 19176 6133 288 4622 -62 3982 638
13871F38K205O638M075p742N391j0255j896J898J6731M926o12j891L9J1803p9
13856C1869m196j254m590J10j6818p337k615k003J767J777J056Q222M723q7l509
13841G115K113m447l534j855K840l670O134j244J905O051N990l869P680k38o190
13826A4781N06o41M183j1063j3346q583J1954R381R44j710J2940n899k670J3776
13812B4553J5257n227q105l117r188K932k39o2o859n925O271j0185j4959K617
13798a2236J2920q70J169Q835P075p390o415K646Q73l705L358O888r393k455o439
13783e139O394J3286J208j4067j1113J3593J7358J7336n303j1869r535N70J0013
13770B2732r834r551K116p022J989J0046n123J965Q615j041P81P523p635m426
$$ plain form
13871 638 2843 9481 13556 5814 11205 950 -946 952 17683 22609 21997 20106 20145 31948 31869
13856 31869 27673 26419 21829 21939 5121 -2216 -4831 -6834 -5067 -3290 -2234 5988 10711 10624 7115
13841 7115 9228 4781 1247 -608 2232 -1438 4696 3452 5357 11408 17398 13529 21209 20971 14781
13826 14781 15287 14646 18829 7766 -5580 -14163 -2209 7172 8116 6406 19346 13447 10777 24553
13812 24553 39810 34583 26478 23361 14173 17105 16866 16804 9945 4020 10291 106 -14853 -12236
13798 -12236 684 -186 983 9818 16893 9503 3088 5734 6607 2902 6260 13148 3755 1300 -5139
13783 -5139 1255 14541 15749 1682 -9431 4162 21520 38856 33553 21684 12149 12719 22732
13770 22732 12898 3347 5463 -1559 430 10476 5353 7318 15933 14892 15673 23196 15561 11135
13756A1135N316J2882j0194p242J1786r568j2113K487P936P113K639j227m994
13743A5956L722L093J2907K1587J101j3023R674P556n444K757l99j386J9659L028
13729H0788L262J350k944J8212J6313J9112K7730M6772P0353J08721J57557J98730
13717G45956K21843K27642K26937J92234J38674O0932l8981j29096k00759k35700
13707A209682k35992k16062j67318j38071j14515o9636m5313m0434l8972j6365
13697A27004p236l175j2367n024o661q180J7160o529j5389j2586j1669O176j88
13684F1336q396j3786P741m923m842M393o907k318R85p673p041L132N292p982
13670A9011m937k490Q343p512k339N958J9614P992N228R273P778j4817j2072j434
$$ plain form
13756 11135 16451 29333 19139 11897 23683 14115 2002 4489 12425 19538 22177 20950 15956
13743 15956 19678 22771 35678 57265 58366 45343 55017 62573 57129 59886 59487 58101 77760 80788
13729 80788 84050 85400 82456 100668 116981 136093 163823 210595 280948 389669 547226 745956
13717 745956 967799 1195441 1422378 1614612 1753286 1814218 1775237 1646141 1445382 1209682
13707 1209682 973690 757628 590310 452239 337724 268088 222775 182341 143369 127004
13697 127004 119768 116593 104226 99202 92541 84361 101521 94992 79603 67017 55348 61524 61336
13684 61336 52940 39154 46895 41972 37130 41523 34616 32298 33283 25610 18569 21701 26993 19011
13670 19011 14074 11584 19927 12415 10076 16034 35648 43640 48868 58141 65919 51102 39030 37596
13656C7596Q41J8040L26j2641o195l912L771k08j8034k1207J3496M151j0236q903
13642c115M49J3715Q114R355J3834R471j0596M858R489j2305j2423L577j7986
13629A6437j2110M085J695o680K194L258q457M244r251O167J7097O649N688J2337
13615D3353n826j2240j2445K26n116l607M217Q493p309o32J2814O280p35m821
13601B2652o117m011K2468P049M979m665K424K4538L7439L0249L1587J4691j4483
13588A68800n3219n2165l2302K696J6310J2063n330M057j0253p316p503l201j741
13575C0896L368K851p980j8951J2423M943M786R071J3101R346O234J3376J8554
13562A02018J4574K5518K0354L5774M5623M6952J4563K988J2256p183k0576l2610
$$ plain form
13656 37596 38437 56477 56803 44162 37967 34055 37826 37618 19584 -1623 11873 16024 5788 -3115
13642 -3115 -2666 11049 19163 28518 42352 51823 41227 46085 55574 43269 30846 34423 16437
13629 16437 4327 8412 10107 3427 5621 8879 422 4666 -4585 1582 18679 25328 31016 43353
13615 43353 37527 25287 12842 13068 7952 4345 8562 17055 9746 9114 21928 28208 27473 22652
13601 22652 16535 12524 34992 42041 47020 42355 44779 69317 106756 137005 168592 183283 168800
13588 168800 115581 63416 31114 33810 50120 62183 56853 60910 50657 43341 35838 32637 30896
13575 30896 34264 37115 29135 10184 22607 27550 32336 41407 54508 63854 70088 83464 102018
13562 102018 116592 142110 162464 198238 243861 290813 305376 308364 320620 313437 292861 260251
13550B60251k7365l1858l4525O650K4316N102l7409m0376k7538k8565l1619k1967
13538A5097o576n055o659Q955o31L636p462j7472k482K262n43l643j634J694l66
13523b0879k272L155J1195J5340P476J0492K110k127L890J422J432k793L971Q281
13509D0693K5858K752R46P165M741J1452L275L530O904M007j0104k1713j7463
13496F2043r994O098j1736j5185o300p391o592N107Q856P161r500O667N052j520
13482C2766M669p534j8282r091j250J1947J2604P240l072Q730J0666m742l306
13469D1345N339P795J8384J948k328l264j3073n704L914J3117N889j095J5037
13456H7304l897P38P077j547o725o029p312J002P041J8265K6362K7580N852L030
$$ plain form
13550 260251 232886 201028 166503 173153 197469 202571 165162 124786 97248 68683 37064 15097
13538 15097 8521 3466 -3193 5762 5131 8767 1305 -16167 -18649 -16387 -16930 -20573 -22207 -20513 -20879
13523 -20879 -23151 -19996 -8801 6539 14015 24507 26617 24490 28380 29802 31234 28441 32412 40693
13509 40693 66551 69303 70249 77414 82155 93607 96882 100412 107316 111323 101219 79506 62043
13496 62043 52049 58147 46411 31226 24926 17535 10943 16050 24906 32067 22567 29234 34286 32766
13482 32766 37435 29901 11619 2528 1278 13225 25829 33069 29997 38727 49393 44651 41345
13469 41345 46684 54479 72863 74811 72483 69219 56146 50442 54356 67473 73362 72267 87304
13456 87304 83407 84145 91222 89675 82950 76921 69609 70611 77652 95917 122279 149859 155711 158741
13442A58741J091P461R044M192J460J5760R785J9905L4841L6423K2160K8063J2540
13429C61466K6260j133l3972m0784l2808l7859l3188l7047l8054k4251j5826j6003
13417G6801j8934k400J3257J5400k348m250J3791J1059K3328P286J1072J0218
13405A54280l627n75L359J733R117P7K625J3127N754k02L818O923J3842n500J0456
13390B15207O377J9887J1842j1470J8170K0080L135L1963K9333R333K4377J8790
13378C97024J6219J6881L395n459o657J839q376n368q896O760K7996J2138K3751
13365D71247L5550L0600J2719M516K4514L4167K4710K3881L3000M0078L2409K8812
13353G96203J7081K4333L8895M6266M4807K9983K5854L1688M3537O9690Q1805
$$ plain form
13442 158741 159832 167293 176337 180529 181989 197749 207534 227439 262280 298703 320863 348926 361466
13429 361466 387726 386593 352621 311837 279029 241170 207982 170935 132881 108630 92804 76801
13417 76801 57867 55467 68724 84124 81776 77526 91317 102376 125704 132990 144062 154280
13405 154280 150653 150078 153437 155170 164287 164364 166989 180116 185870 185668 189486 196409 210251 204751 215207
13390 215207 221584 241471 253313 241843 260013 280093 283228 315191 344524 353857 378234 397024
13378 397024 413243 430124 433519 428060 421403 423242 414866 409498 400602 407362 435358 447496 471247
13365 471247 506797 537397 550116 554632 579146 613313 638023 661904 694904 734982 767391 796203
13353 796203 813284 837617 876512 922778 967585 997568 1023422 1055110 1098647 1168337 1250142
13342A250142Q3361J18666J34154J44247J56145J62435J98184K40496K87831L48377
13332C124038M33424N44993O57996P56410Q30460Q76987R15985R02308Q66836
13323I909437Q39604Q11416Q11786Q23992Q99042J075588J350610J791544K552646
13314B0865665L801537N839912R261912J4852205K2890267L1795620L9818624
13307A49125742M6569366M9368456M5314984L5340274K0823872K504624j6172088
13300C32875230l1695830m2411518m7366242m6470058m1076013l3359496k4810614
13293F5685459j6893460j0923245p075275m757856l344772k442359j877953j505850
13285A6864689j271377j102222r97943r11255q47135q31179q26442q57487q70762
$$ plain form
13342 1250142 1333503 1452169 1586323 1730570 1886715 2049150 2247334 2487830 2775661 3124038
13332 3124038 3557462 4102455 4760451 5516861 6347321 7224308 8140293 9042601 9909437
13323 9909437 10749041 11560457 12372243 13196235 14095277 15170865 16521475 18313019 20865665
13314 20865665 24667202 30507114 39769026 54621231 77511498 109307118 149125742
13307 149125742 195695108 245063564 290378548 325718822 346542694 349047318 332875230
13300 332875230 301179400 258767882 211401640 164931582 123855569 90496073 65685459
13293 65685459 48791999 37868754 30793479 26035623 22690851 20248492 18370539 16864689
13285 16864689 15593312 14491090 13493147 12581892 11734757 10903578 10077136 9219649 8348887
13276H348887q57866q61586p93925p09528o23768n07666m08056l21936k58826
13267C005730k08426j75797j31975j08352j07984r7148j08372j06026r7962r3493
13257A770195q9873r9636r0760p6041o0643n4467n0068m6533m6698n6361m3289
13246A055826m5178l2927k1570l4518l8502j6281j6992j7204j9155k7227l6308
13235G49964j0251j3326l2500k9315k7544k6571l5645j9935k035j0441r354J595
13223E34642m562K463j643j086j912j1712j1851q247r73m080P801L389O433n876
13209E02786q874o394j0578j7397p768j2592K018L545J7375J2917K3532L1884
13197E30454J7440N668K641P443M420o528j3471q376k0480j9616j3424p993j450
$$ plain form
13276 8348887 7491021 6629435 5835510 5125982 4502214 3994548 3586492 3264556 3005730
13267 3005730 2797304 2621507 2489532 2381180 2273196 2176048 2067676 1961650 1863688 1770195
13257 1770195 1680322 1580686 1489926 1413885 1353242 1298775 1248707 1202174 1155476 1099115 1055826
13246 1055826 1010648 977721 956151 921633 883131 866850 849858 832654 813499 786272 749964
13235 749964 739713 726387 693887 664572 637028 610457 574812 554877 552842 542401 533047 534642
13223 534642 530080 532543 530900 529814 527902 516190 504339 496092 495119 491039 498840 502229 508662 502786
13209 502786 493912 487518 476940 459543 451775 439183 441201 444746 462121 475038 498570 530454
13197 530454 547894 553562 556203 563646 568066 561538 548067 539691 519211 499595 486171 478178 476728
13184D76728R50N194K1442J6931J7252J5535K5632R288M652k2992j8902q511l255
13171E39944j0612j0387J8775K1386O883j2898j6015k0243l2130l2589m8310m9041
13159C54763m8164k4821j7031j6255j1010r951L32O377l401K075P894N097K228
13146B48133J8055K5112L3795L6749J6143M457m087n384l406k4730k2794k0867
13134C01176k0357j7936j6599j203k1823k1905k610K756M397J637n005j0136l968
13121A88424j452J934m913j3884k8845o84J5577K605p07q651O013m275j8658q932
13107A23552j5105r545j0972r110r405p109N513j030N426Q059j8116j820K0419
13094H0757J6120R596O670o296j0210o065O883Q348N972P296R810J0858J786n708
$$ plain form
13184 476728 477678 482872 504314 521245 538497 554032 579664 588952 593604 570612 551710 543199 539944
13171 539944 529332 518945 537720 559106 565989 553091 537076 516833 484703 452114 403804 354763
13159 354763 306599 281778 264747 248492 237482 227531 227863 234240 230839 232914 240808 245905 248133
13146 248133 266188 291300 325095 361844 377987 382444 378357 372973 369567 344837 322043 301176
13134 301176 280819 262883 246284 245081 223258 201353 198743 201499 205896 207533 202528 192392 188424
13121 188424 186972 188906 183993 170109 141264 140580 156157 158762 158055 149404 155417 151142 132484 123552
13107 123552 108447 98902 87930 78820 69415 62306 67819 66789 72215 80274 62158 60338 80757
13094 80757 96877 106473 113143 106847 96637 90572 97455 105803 111775 119071 128881 139739 141525 135817
13080A35817K6825J8184l712o784L562p854j2584j6143j545J889J233R38M748
13067A44574p414n797l963j6934p211q502j1306m477o939R320K595L629J1387
13054I8962J1827l564J00M94j8237k139j705o700K730j919O584J3274J5508J4676
13040A29891n232j5193q201l639l909o764L833r401q860j4257j1781k2126k8N372
13026B9705N356J4759N669j2132j3396M034J1658K710J2674O199J537p363L080
13013F4490N571k541p212m397J94O868J419p762k93O560J8907R706m849j5956
12999G0705j0530L475M345m057j3033R152R523n757J751L62N595j8713k9626K239
12985B5431J5804N343J090Q906J353P348m704j2929N771M01L597J4282N996k247
$$ plain form
13080 135817 162642 180826 177114 170330 173892 166038 153454 137311 135766 137655 138888 139826 144574
13067 144574 137160 131363 127400 110466 103255 94753 83447 78970 72031 81351 83946 87575 98962
13054 98962 110789 107225 107325 107819 89582 87443 85738 79038 81768 79849 86433 99707 115215 129891
13040 129891 124659 109466 101265 97626 93717 86953 90786 81385 72525 58268 46487 24361 24333 29705
13026 29705 35061 49820 55489 43357 29961 33995 45653 48363 61037 67236 68773 61410 64490
13013 64490 70061 67520 60308 55911 56105 62973 64392 56630 56337 62897 81804 91510 86661 70705
12999 70705 60175 63650 67995 63938 50905 60057 69580 63823 65574 65936 71531 52818 23192 25431
12985 25431 41235 46578 47668 56574 57927 65275 60571 47642 53413 53814 57411 71693 77689 75442
12971G5442j30J725R618k664j431K5950N484r154l345J04l858O467J1612J9748
12957A35568L8266M1914N3406P1296P7598O4016L5088k695Pl1267m2410n2652
12945C88135o5016n4572m4761m6363k9471k3641l3842j3618L260N148l44p364
12933G7551j858J1000j200j035o900k0311N701J272k951p875o802P809o202M109
12919E2308K767j2924M955J4322K295K0130N88p413Q518J0172J718l765L720J4740
12905A12131J2425J0961m639J591J3041J0965J5155J5563M2240Q8155J35539J63318
12893F16445K19043K39574K61098K49174J93523J08117J9546q3202j62538k37854
12883A422926k44644k29248k06207j72495j26450j00200p1283k5023k2110k3954
$$ plain form
12971 75442 75312 77037 86655 83991 82560 108510 113994 104840 101495 101599 97741 104208 115820 135568
12957 135568 173834 215748 269154 340450 418048 482064 517152 514457 514464 483197 440787 388135
12945 388135 323119 268547 223786 177423 147952 124311 90469 76851 80111 85259 84915 77551
12933 77551 75693 86693 85493 84458 77558 57247 62948 64220 61269 53394 46592 54401 48199 52308
12919 52308 55075 42151 47106 61428 63723 83853 84441 77028 85546 95718 97436 93671 97391 112131
12905 112131 124556 135517 130878 132469 145510 156475 171630 187193 229433 317588 453127 616445
12893 616445 835488 1075062 1336160 1585334 1778857 1886974 1906520 1823318 1660780 1422926
12883 1422926 1178282 949034 742827 570332 443882 343682 272399 247376 225266 201312
12873B01312j7396j2716n560P295R451J0019M8116J08387J95589K96954J84257
12862A025708j38055l14013k21964j26702m8275k2511k8676k7700j2812r348q805
12851F6847J744n012P835l067j6978j069m529j086l06Q978R761j134j051l920
12837E7013j2054j6230p186K711L407k499K709J54j081k158l464O089J833j595
12823B7649J4357J697r554p43O047N804p95J035l66r714K419N799n46j1391q509
12808B3189J227Q668J3211P543r769j3332j134J060m84O996p917r22m069J901
12794B6168N65P44P129k616r12R743k496p900J985J2457M30q410O47j137o071
12779C0326j1957j1443j980Q534n221J1394Q463j314o216q980P753J2893j51l358
$$ plain form
12873 201312 183916 171200 165640 172935 182386 192405 240521 348908 544497 841451 1025708
12862 1025708 887653 573640 351676 224974 176699 154188 125512 97812 85000 75652 66847
12851 66847 68591 63579 71414 68347 51369 50300 45771 44685 44379 53357 63118 61984 60933 57013
12837 57013 44959 28729 21543 24254 27661 25162 27871 28025 26944 24786 21322 27411 29244 27649
12823 27649 42006 43703 34149 33406 39453 45257 44462 45497 45131 35417 37836 43635 43089 31698 23189
12808 23189 24416 33084 46295 53838 44069 30737 29603 30663 30179 37175 29258 28336 24267 26168
12794 26168 26733 27477 34606 31990 31078 40821 38325 30425 32410 44867 45297 36887 37534 36397 30326
12779 30326 18369 6926 4946 13480 8259 19653 28116 26802 20586 11606 19359 32252 32101 28743
12765B8743K696M913q661o657R564k955k485K57K806p849o071J5338Q837j4036
12751B4440J558L97L552N657l166n230r266j0694m732J0826j407L699P180j5034
12737G780n673J4827l646j7997J2605M012p308J793O36J0931J5322J524P974N95
12723D3375j6701j4649m921J0921Q237n18o536j2183J2871J4863m255k2955k3147
12710a5598j473N208J4487L177J9867O237j9202p80K438J0448N388j1652p499
12697A1046K610l298J1273O563O656r077r46J98m014j0609Q170R63K888j852P042
12682B7613J943M324o836j3056r833j6343N995j072J0656K062o713j590K652J2121
12668A1923j773P92j2335p729M378J5996P235K22m474o027R83L569o391j982M039
$$ plain form
12765 28743 31439 36352 27691 21034 30598 27643 25158 25415 28221 20372 14301 29639 38476 24440
12751 24440 25998 26395 29947 35604 32438 27208 17942 7248 2516 13342 11935 15634 22814 7780
12737 7780 2107 16934 13288 -4709 7896 11908 4600 6393 7029 17960 33282 34806 42780 43375
12723 43375 26674 12025 7104 18025 26262 25744 19208 7025 19896 34759 30504 7549 -15598
12710 -15598 -17071 -11863 2624 5801 25668 31905 12703 11923 14361 24809 30197 18545 11046
12697 11046 13656 10358 21631 28194 34850 25773 24827 25025 21011 10402 18572 19535 22423 20571 27613
12682 27613 29556 33880 27044 13988 4155 -12188 -6193 -7265 3391 5453 -1260 -2850 -198 11923
12668 11923 10150 10942 -1393 -9122 -4744 11252 18487 18709 14235 8208 9191 12760 6369 4387 8426
12653H426q783L091R562O778n618J571J400J3459j0422q462j0531R947R085M894
12639B4397P587O432j0724j3446q814o533J0026j686j403K0651J3992Q838Q08
12626E0125o649q355j4810j2948j144p12M691o191R77k082K24k834L498O597M543
12611A4930p695k528J096j554J7474R673r739o09q271l001J965k07M699L735r66
12596A9002p150o806m110J421J3407L589k469m882j462R067m911j160N60P435
12582B1531q647k108J4158J4379j5991j0782J3228J2449L871j3449p866O244O287
12569C3304L153O928J0390n863Q91K1309R598L92m493P720J5738J3634K6991N6470
12555A96162R1644J48111J81773J83664K04668J98510J19046K0128j4827k2814
$$ plain form
12653 8426 -357 2734 12296 19074 13456 15027 16427 29886 19464 11002 471 10418 19503 24397
12639 24397 31984 38416 27692 14246 5432 -1101 8925 7239 5836 26487 40479 49317 50125
12626 50125 43476 35121 20311 7363 6219 5507 10198 4007 4984 2902 3126 292 3790 10387 14930
12611 14930 7235 4707 5803 4249 21723 31396 21657 21048 12777 9776 11741 11534 16233 19968 19002
12596 19002 11852 5046 936 2357 15764 19353 16884 12002 10540 19607 14696 13536 14096 21531
12582 21531 12884 10776 24934 39313 23322 12540 25768 38217 42088 28639 20773 27017 33304
12569 33304 36457 43385 53775 47912 48803 70112 79710 80102 75609 83329 99067 112701 139692 196162
12555 196162 287806 435917 617690 801354 1006022 1204532 1323578 1343706 1328879 1306065
12545A306065j30508j90393j85268j47749j32560j23532r9701p9599m6602l5940
12535A34213j4412j3459k3272j3076n351j3617o797o638p876O22L149j0451q205
12522A4830R931J0406J886J163Q927J207n510p123M711J789m996r894n996P895
12508B9226N92j0516J575m274p38M439O519J6760n430q514M004k2000q137J5512
12494A9018J2297N489j3091p125M30l365P38Q882j442j5082J9059M217m957J811
12480B6879m597j1639M514J0150N194p946L208J1919K2570J9351M428k672k6354
12467E5005j9099J302L452q481j2448J2384J0685R304K866r88k338J1189K9124
12454I1957M7813R2755J44954J80493J57366Q2921K1285k5614r7184j32045j06002
$$ plain form
12545 1306065 1175557 985164 799896 652147 519587 396055 296354 216755 170153 134213
12535 134213 119801 106342 83070 69994 64643 51026 44229 37591 29715 30337 33486 23035 14830
12522 14830 24761 35167 37053 38216 47143 48350 42840 35717 40428 42217 37221 27327 21331 29226
12508 29226 29818 19302 20877 16603 15865 20304 26823 43583 38153 29639 33643 11643 3506 19018
12494 19018 31315 36804 23713 16588 17018 13653 14391 23273 21831 6749 25808 30025 25068 26879
12480 26879 22282 10643 15157 25307 30501 22555 25763 37682 60252 79603 84031 81359 55005
12467 55005 35906 37208 40660 32179 19731 32115 42800 52104 54970 53982 51644 62833 91957
12454 91957 139770 232525 377479 557972 715338 798259 819544 793930 696746 564701 458699
12443D58699q9309j03375q2015n3988k9560n510j3115k6622k4839r685N732J3176
12431C9589L170o108q452J524J5104J5308o218j6537j3392p795M126p714l893
12418H712J189R059J0503n830j4973m216Q958M83j2789o774L863K1531O996q019
12404A8693K974K044n51n860R289k19J838q796j5261j1249J666J4317J2143q58
12390B0170o053j7514n316L125O085l699J3931J0405m529m646k59P290L887J0116
12376C2993J6798k164o040j5595q884q602P95Q47n768m375r530O83J3243q11l015
12361E75O740j663n450k808l048J2578J3754j483P692J3406m68p433l164o661
12347B2567r98n00j4532r244J4229J3231l760o57M414j0112j9576L37l90Q548
$$ plain form
12443 458699 369390 266015 184000 130012 100452 94942 81827 55205 30366 20681 26413 39589
12431 39589 42759 36651 28199 29723 44827 60135 53917 37380 23988 16193 20319 12605 8712
12418 8712 9901 18960 29463 23633 8660 4444 13402 13885 1096 -5678 -1815 19716 26712 18693
12404 18693 21667 23711 23160 17300 26589 26370 28208 19412 4151 -7098 -5432 8885 21028 20170
12390 20170 14117 -3397 -8713 -5588 497 -3202 10729 21134 16605 11959 11700 18990 22877 32993
12376 32993 49791 47627 41587 25992 17108 8506 9301 10148 4380 5 -9525 -8842 4401 3590 575
12361 575 7315 5652 202 -2606 -5654 6924 20678 19195 26887 40293 39825 32392 29228 22567
12347 22567 21569 21069 6537 -2707 11522 24753 20993 20336 24750 14638 -4938 -4601 -4991 3557
12333C557L702M298K904J119l079r269j1097j813P895J4508Q071j62j263K6580
12319D5951L1095R472M221K864l355P10j1682j9446j9723N161P74q926j1420n385
12305B0311L927O226K1702K9000K6102J5494J8203J3201l006k6749o704j4165
12293A03542l073m1105k0938l406k1392k143J0038J202j2625l706m871o385R218
12280D356J9815K3276q174k1623m077m308J0712P045J0160r520j6852p907M97
12267C400O087l057j899j246L001k363J0587R811l470R50J792k661o897Q304O407
12252B8746O308k504p268j3984N336Q374m307j2840j0730j381K696O324J860J3159
12238A9789j2532j0330r508J889M643j3352J6763n109L902J1595L534n776k993
$$ plain form
12333 3557 7259 11557 14461 15580 12501 3232 -7865 -9678 -1783 12725 20796 20634 19371 45951
12319 45951 77046 86518 90739 93603 90248 90958 79276 59830 40107 45268 46042 37116 25696 20311
12305 20311 24238 30464 52166 81166 107268 122762 140965 154166 151160 124411 117707 103542
12293 103542 100469 59364 38426 35020 13628 11485 21523 22725 10100 6394 1523 -4862 4356
12280 4356 24171 47447 39273 17650 13573 9265 19977 27022 37182 27662 10810 2903 3400
12267 3400 9487 6430 4531 3285 6286 3923 14510 24321 20851 21801 23593 20932 14035 22339 28746
12252 28746 35054 32550 25282 11298 16634 25008 20701 7861 -2869 -4250 -1554 4770 6630 19789
12238 19789 7257 -3073 -12581 -10692 -6049 -19401 -2638 -7747 -3845 7750 11284 5508 2515
12225B515j784r698J203L409O404M714L635P834M981j2561j7029k537N565p18
12211d067M661J7061J2416j6536r871P88p882j0810O459J2523K583p863J470l15
12197F17N560K13k806j266j078J023l277k979N306J3480J0624j4605o373K978
12183G417J356r526o439j478N746J6204P723q868J013m378j782p784R890o436
12169B658j7281N84J6731J4435n824q76O095Q751j6328j0871J143o186j3885J1074
12155i780K5470R965n508N118J985j2265j3796K228j6016j0882M449Q023K292
12142h717O240n376J2623r662R846J1115l321N755K475p385o266L179J58O77m041
12127G300n82L47K327P060j1010P868R020J7443J358j3630p660p647o688k328
$$ plain form
12225 2515 731 -8967 -7764 -4355 2049 6763 10398 18232 23213 10652 -6377 -8914 -3349 -4067
12211 -4067 594 17655 30071 13535 3664 4452 -3430 -14240 -7781 4742 7325 -538 932 617
12197 617 6177 6390 3584 2318 1240 2263 -1014 -3993 1313 14793 25417 10812 4439 7417
12183 7417 8773 -753 -7192 -8670 -2924 13280 21003 12135 13148 8770 6988 -796 9094 2658
12169 2658 -14623 -14039 2692 17127 11303 10427 16522 25273 8945 -1926 -783 -6969 -20854 -9780
12155 -9780 15690 25655 20147 25265 27250 14985 1189 3417 -12599 -23481 -19032 -11009 -8717
12142 -8717 -2477 -7853 4770 -4892 4954 16069 12748 18503 20978 13593 7327 10506 10664 11341 7300
12127 7300 6718 7065 9392 16452 5442 13310 22330 39773 41131 27501 19841 12194 5506 3178
12113C178M177k256p547p013k450O223P405J799J0167R225j3988j0975P486K0140
12099B5571j4945r683k503m334o701J2065O90N107K319K439M98o071l511N904
12085F845j8646j2661J391O331O532K2R432Q61M448P704j7672p499J0062N478
12071B628J0733r57k1645M640Q840l054P591J8004k69J636q378M423j2405j3835
12057b048J1169L350J0603j694j7222j9175l568N171Q908J4607o5P290J0272j4704
12043A2894r301j2587l952L40L171J1633L419J7963M267j3609l732l254K401n881
12029C772K726q785m285L799P800J9566N336l731j1380o77P866o193m294l175
12015H345J1968N134l032Q312K489q87N712j1437j3243K1026J5444N437k893j2193
$$ plain form
12113 3178 7355 5099 -2448 -9461 -11911 -5688 1717 3516 13683 22908 8920 -2055 5431 25571
12099 25571 10626 943 -1560 -5894 -12595 -530 160 5267 7586 10025 10523 4452 941 6845
12085 6845 -11801 -24462 -23071 -16740 -10208 -10186 -754 107 4555 12259 -5413 -12912 -2850 2628
12071 2628 13361 12404 -9241 -4601 4239 1185 8776 26780 26511 28147 19769 24192 11787 -2048
12057 -2048 9121 12471 23074 21380 4158 -15017 -18585 -13414 -4506 10101 10036 17326 27598 12894
12043 12894 3593 -8994 -12946 -12606 -9435 2198 5617 23580 27847 14238 10506 7252 9653 3772
12029 3772 6498 -2287 -6572 -2773 5027 24593 29929 26198 14818 14141 22007 15814 11520 8345
12015 8345 20313 25447 22415 30727 33216 32329 38041 26604 13361 34387 49831 55268 52375 40182
12001D0182O082K9494K2111K5124N2325P7113N8968K1230m2338p4193p6823n9021
11989H0254l4779j9555j310Q274L4m749k0865J819K741n97j594o804r660o618
11975a3409M87m666J3408J3697r447q869l137k412J658p502M514J4273J4660O25
11961A3880l735j086r650l605Q962r287j3382P308l138j4757k381Q489J1993J5907
11947E518j5848l768j1039Q819J1505k288K49J3022K029L151k561q126j5021n250
11933a9608N157J381k00j973m162N907J3164J5207J0594J4135m296q849p88q13
11919B4856r772r155j0851K385k714J2251l56Q838L18n506q284J641n774J1738
11905I615J6792j2809q986K818o470j999J188j2179n379j2918k143k35K505J7691
$$ plain form
12001 40182 46264 75758 97869 122993 175318 252431 311399 332629 290291 216098 139275 80254
11989 80254 45475 25920 24610 32884 32918 28169 7304 9123 11864 11267 9673 2869 -6791 -13409
11975 -13409 -12922 -17588 -4180 9517 70 -8799 -11936 -14348 -12690 -20192 -15678 -1405 13255 13880
11961 13880 10145 9059 -591 -4196 4766 -4521 -17903 -10595 -13733 -28490 -30871 -22382 -10389 5518
11947 5518 -10330 -14098 -25137 -16318 -4813 -7101 -6852 6170 8199 11350 8789 663 -14358 -19608
11933 -19608 -14451 -13070 -13270 -15243 -19405 -13498 -334 14873 25467 39602 35306 26457 25669 24856
11919 24856 15084 5929 -4922 -2537 -5251 7000 6644 15482 15800 10294 2010 3651 -2123 9615
11905 9615 26407 13598 4612 7430 960 -1039 149 -12030 -17409 -30327 -32470 -32705 -30200 -12509
11891a2509J0774J8596K202q012j2173J1644J4249m709p788L0N251J984n567o621
11877G351n116N683j6386j3718Q752J8456m696o032M18m991l599L997J2808J725
11863D652J3370Q069N84j0930m876n425m338L552Q55n785K061n207j2512j4745
11849c0675N635K100R238K347N046M228J1968K0403l384n765m603o057j0115j425
11835a059j812J2704J5614N381j4354j5055o399J1025K371j1556q21n111L526
11822e546K115R733q78l793p91j165j902J0077Q155M463m330n082l689o990N771
11807F148j6490j1583M133K4914L570o419n641o109k006j621l809J1008J8850
11794A4945R38m211K806P629j8345j9867J290J4205o424m418L538J0660J564J0582
$$ plain form
11891 -12509 -1735 16861 19063 11051 -1122 10522 24771 20062 12274 12304 17555 19539 13972 7351
11877 7351 2235 7918 -8468 -22186 -13434 5022 326 -5706 -5288 -10279 -13878 -9881 2927 4652
11863 4652 18022 26091 26675 15745 10869 5444 1106 4658 5513 -272 1789 -3418 -15930 -30675
11849 -30675 -25040 -22940 -13702 -11355 -6309 -2081 9887 30290 26906 21141 16538 10481 366 -1059
11835 -1059 -2871 9833 25447 30828 16474 1419 -4980 6045 8416 -3140 -3961 -9072 -5546
11822 -5546 -3431 6302 5424 1631 840 -325 -2227 7850 16005 20468 16138 11056 7367 377 6148
11807 6148 -10342 -21925 -17792 7122 10692 4273 -1368 -7477 -9483 -11104 -14913 -3905 14945
11794 14945 15883 11672 14478 22107 3762 -16105 -14815 -610 -7034 -11452 -7914 2746 4310 14892
11780A4892k738m933o56R93k465Q962P444p302p882m955K312O13j2328k452L570
11765f925Q171o586r105M785q105Q388O895J617l010M513J2082M605p661j2843
11751c179L557K1404J7027j3238j7192J030J3854K847k61j3503j5907J737L403
11738A579o225j718l075j2516N891J6302j646q691j7176L589R301k404M026O054
11724f709M415M634k650j0834l699J6020R450O011J13j1038j0012Q273J018j0046
11710e054o1j236k191j6268N316O27J832N579j0091L628J4729J6378q24j6346
11696c982j435o282j0638R321R786J0934q241j2620n550p612L022Q285J2250J2230
11682I468J6679o507k279q232M87o149q276N152r174O805k921N644J639j1284
$$ plain form
11780 14892 12154 7221 6565 7558 5093 14055 21499 14197 6315 1360 3672 4285 -8043 -10495 -6925
11765 -6925 1246 -5340 -14445 -9660 -17765 -9377 -2482 -865 -3875 638 12720 17325 9664 -3179
11751 -3179 378 21782 38809 25571 8379 9409 23263 26110 25849 12346 -3561 -1824 1579
11738 1579 -4646 -6364 -9439 -21955 -16064 238 -1408 -10099 -27275 -23686 -14385 -16789 -12763 -6709
11724 -6709 -2294 2340 -310 -11144 -14843 1177 10627 16638 16751 5713 -4299 3974 4992 -5054
11710 -5054 -5115 -6351 -8542 -24810 -19494 -18867 -17035 -11456 -21547 -17919 -3190 13188 12364 -3982
11696 -3982 -5417 -11699 -22337 -13016 -3230 7704 -537 -13157 -18707 -26319 -23297 -15012 -2762 9468
11682 9468 26147 19640 17361 9129 9616 3467 -4809 343 -8831 -2026 -4947 697 2336 -8948
11668h948k1196j2028k531J7192J2286M899p713L440J5868r244p277p432J505
11655b1179K828R310M975J0479n402L831O739o964j3876j5667L169j0997K789
11642b9965J2055O35q996O868M189m473L987J2031M319M625r027n159P064l503
11628e350O62M768P710N268j2903j776N133O904K184p719p861p169N067M764n24
11613h42J827j9799k1437P070j552M107k919M964K197j2494l592J6848J033m987
11599b9576J5965K2716m557j69r188O558j652m705L558n639j1472l343m349j810
11585b7663j161m78k155n980M578R664n216L023k536K2503J4787j3815m237J340
11571g346j179n455p183p303R620M583J0876K499R966m581l356J954L550r855
$$ plain form
11668 -8948 -30144 -42172 -44703 -27511 -15225 -10326 -18039 -14599 1269 -7975 -15252 -22684 -21179
11655 -21179 -18351 -9041 -4066 6413 1011 4842 11581 4617 -9259 -24926 -21757 -32754 -29965
11642 -29965 -17910 -17275 -26271 -19403 -15214 -19687 -15700 -3669 650 5275 -3752 -8911 -1847 -5350
11628 -5350 -4688 80 7790 13058 155 -1621 3512 10416 12600 4881 -2980 -10149 -5082 -318 -842
11613 -842 985 -18814 -40251 -33181 -34733 -30626 -33545 -28581 -26384 -38878 -42470 -25622 -24589 -29576
11599 -29576 -13611 9105 4548 4379 -4809 1749 97 -4608 -1050 -6689 -18161 -21504 -25853 -27663
11585 -27663 -28824 -29302 -31457 -37437 -32859 -23195 -28411 -25388 -27924 -5421 9366 -4449 -8686 -7346
11571 -7346 -8525 -13980 -21163 -28466 -18846 -14263 -3387 -888 9078 4497 1141 3095 6645 -3210
11557c210l437o335J275L641m528l758r431J1457P433P721K252k577l066j9855
11543b2418J983J6065k001l10o919j587M281j765n544J7644N090M197q719M055
11529D052J0567O956j953K533J330r075p669L370j068p717Q36j335O82m570j148
11514d209j1691r963Q446Q758M030j6031J821M932K337m271N11L029j6819j6973
11500d6093J3808J6631P400N076M234m470k629J703J919j0486J1830q416k0583
11487c0076j2684R505R524J4175M478k82m731j269L4439N726m470o788j918l234
11473A2395j2021l259O505n011J691k109l807j2899K01j38k877J5024K661M321
11459F77K387j6597N122n476m947J702J3550J0445Q662m191m559q591j1637j2069
$$ plain form
11557 -3210 -6647 -12982 -11707 -8066 -12594 -16352 -25783 -14326 -6893 828 3080 503 -2563 -22418
11543 -22418 -20435 -4370 -6371 -6681 -13600 -15187 -10906 -12671 -18215 -571 4519 8716 -3 4052
11529 4052 14619 21575 19622 22155 23485 14410 6741 10111 9043 1326 2162 827 1509 -3061 -4209
11514 -4209 -15900 -25863 -17417 -8659 -4629 -20660 -18839 -13907 -11570 -15841 -15330 -12301 -29120 -46093
11500 -46093 -32285 -15654 -8254 -3178 1056 -3414 -6043 -4340 -2421 -12907 -1077 -9493 -30076
11487 -30076 -42760 -33255 -23731 -9556 -5078 -5360 -10091 -11360 23079 28805 24335 17547 15629 12395
11473 12395 374 -2885 3620 -1391 300 -1809 -5616 -18515 -18314 -18452 -21329 -6305 -3644 677
11459 677 3064 -13533 -8411 -13887 -18834 -17132 -3582 6863 15525 11334 6775 -1816 -13453 -25522
11445b5522J0769Q751R551p35l330K039P231r8N751j299m557p526n298m886j750
11430a0909Q228R583q280n386J186L196N416N936j0020N129N612o93J034j2187
11416b155n310l36o367J2155K1330k752j3605q249R75M230N170J531J0415k118
11402A4914j6813l596K697J1667j1584m575R259k253m20Q459J098k804J9721K9471
11388E5241M4711P3161L0028l9527p2115l3653p579j6265j2013j231p212q012
11376E534p586l117O762J0250j4807l919R558K2055m353j9613j5679L077K0225
11363H387J475m883j197n919J0230o485j7090L668R670j505L706J1164j0261n049
11349d089p242q104q456J3318N360j938n630L29r707J7594J0419j4637j1830J1247
$$ plain form
11445 -25522 -14753 -6002 3549 2814 -516 1523 8754 8656 14407 13108 8551 1025 -4273 -9159 -10909
11430 -10909 -2681 6902 -1378 -6764 -5578 -2382 3034 8970 -1050 4079 9691 8998 10032 -2155
11416 -2155 -7465 -7801 -14168 -2013 19317 16565 2960 -5289 -4314 -84 5086 6617 17032 14914
11402 14914 -1899 -5495 -2798 8869 -2715 -7290 1969 -284 -704 7755 8853 6049 25770 55241
11388 55241 99952 173113 203141 163614 91499 57846 50267 34002 21989 20758 13546 5534
11376 5534 -2052 -5169 1593 11843 -2964 -6883 2675 24730 20377 764 -14915 -11838 8387
11363 8387 9862 4979 3782 -2137 8093 1608 -15482 -11814 -2144 -3649 57 11221 960 -4089
11349 -4089 -11331 -19435 -27891 -14573 -9213 -11151 -16781 -16452 -26159 -8565 1854 -12783 -24613 -13366
11335a3366J5185P465N730r766n559q93j3224n809J0980J8961Q310j0073k5064
11322a7123J034J42O351J1103j534L018j2604o632M514J5098r04q716l992J3566
11308C321J3688P476J2380J298q881j3108r736n93l42j5171r124J452N416M969
11294f955L267o672k293m201q488L606J5542L148M860R067p074r224J9070j244
11280A2409P857j1698j463J1319o00j0974n256N426n476p579M308M118k522j302
11266a433j481O073J1512J118j1627L880R60L118K114m766j4805l619p203j2795
11252b8954J9476J9926o118j7437j1305K590K878J373J0876J3549o117j1024k649
11239a2936m364j826K9735L002l749j708K930m45J568n171r240L617l607o496
$$ plain form
11335 -13366 1819 9284 15014 5248 -311 -1204 -14428 -20237 -9257 9704 18014 7941 -17123
11322 -17123 -16089 -15947 -9596 1507 -27 2991 -9613 -16245 -11731 3367 2463 -6253 -10245 3321
11308 3321 17009 24485 36865 38163 29282 16174 6438 5845 5503 -9668 -18792 -17340 -11924 -6955
11294 -6955 -3688 -10360 -12653 -16854 -25342 -21736 -6194 -3046 1814 10881 3807 -5417 13653 12409
11280 12409 20266 8568 7105 18424 17824 6850 1594 7020 1544 -6035 -1727 2391 -131 -1433
11266 -1433 -2914 3159 14671 15789 4162 8042 9002 12120 14234 9468 -5337 -8956 -16159 -28954
11252 -28954 -9478 10448 4330 -13107 -24412 -21822 -18944 -17571 -6695 6854 737 -10287 -12936
11239 -12936 -17300 -19126 10609 13611 9862 8154 11084 10639 12207 7036 -2204 1413 -2194 -8690
11225h690j3551m763J0213N517R361O017r731p963J9994m03m548K951m763P82
11211D23J0164K465N09l907p180o652j4556j444p116Q298J2271J3687j2381j1430
11197a6849L289O503R86J0082L085o236m307J6128J4687K188p376N925m490j2236
11183A1379l708j650L624j739o566M6O169k910j3921j0720R189m050l006O527
11169a1336J293j1475J1992J8177M36q404j0343J0583M144K760j224j746o229
11156a372r227J924J528Q097l907r147J9258J2608m54j5289k986j570l31p677
11142h545j0937k50O589R098P330L522k076j4092p396O92n00R104n237o320L023
11127a5995P000O776M066m507K755k921m915k573k594N92m90j164O692R769J1319
$$ plain form
11225 -8690 -22241 -27004 -16791 -11274 -1913 4104 -5627 -13590 6404 6001 1453 4404 -359 423
11211 423 10587 13052 13561 9654 2474 -4178 -18734 -20178 -27294 -18996 -6725 6962 -5419 -16849
11197 -16849 -13560 -7057 -6071 4011 7096 860 -3447 12681 27368 29556 22180 28105 23615 11379
11183 11379 7671 6021 9645 7906 1340 1386 7555 4645 -9276 -19996 -10807 -14857 -17863 -11336
11169 -11336 -10043 -21518 -9526 8651 9087 683 -9660 923 5067 7827 6603 4857 -1372
11156 -1372 -10599 -8675 -7147 950 -2957 -12104 7154 19762 19308 4019 1033 -537 -868 -8545
11142 -8545 -19482 -19732 -13143 -4045 3285 6807 4731 -9361 -16757 -16065 -16565 -7461 -12698 -19018 -15995
11127 -15995 -8995 -2219 1847 -2660 95 -2826 -7741 -10314 -12908 -12316 -12806 -13970 -7278 2491 13810
11112A3810P855p640n335N348j888m009j0352l376l470l897O517M859m764j3075
11098a9417K268J2753j639l79L724J367j425l782J169M099J063m127l685M976
11084c035L146J873N560N911O243j205j6858j0629R15Q650L377j3174o28N97R03
11069h354O758P222N724l413M144l369p518J2602O380Q50l950j33N290Q96r40
11054B2189j6406k5331J4665J7196J352j6745j5252n983k096J5957K2338o287
11042E597q587L603J906r745M322J5697M488j4373m805L745n579j2114J958m970
11028a8857l658J0990J829j080m99j6725n138O783J7683K555j4682l355R777J4108
11014b69Q188L725j9005n447P459M292P247Q806j6471p255p918O607J6386O656
$$ plain form
11112 13810 21665 14025 8690 14038 12150 8141 -2211 -5587 -9057 -12954 -6437 -1578 -6342 -19417
11098 -19417 -17149 -4396 -6035 -6414 -2690 -1323 -2748 -6530 -5361 -1262 -199 -4326 -8011 -3035
11084 -3035 111 1984 7544 13455 19698 18493 1635 -8994 -8079 571 3948 -9226 -9854 -9257 -8354
11069 -8354 -1596 5626 11350 7937 12081 8712 1194 13796 20176 21026 17076 16943 22233 23129 22189
11054 22189 5783 -19548 -4883 12313 13665 -3080 -18332 -24315 -26411 -10454 11884 5597
11042 5597 -2990 613 2519 -7226 -2904 12793 17281 2908 -1897 1848 -3731 -15845 -13887 -18857
11028 -18857 -22515 -11525 -9696 -10776 -11275 -28000 -33138 -26355 -8672 -6117 -20799 -24154 -14377 -269
11014 -269 7919 11644 -7361 -12808 -5349 -1057 6190 14996 -1475 -8730 -16648 -10041 6345 13001
11000A3001j2161j533J2680N155O855L70o038J387j1842j166K864q315l482n589
10986g814J4734R474j0712q947L862O354j2722j380R735J840K98N326k104n071
10972B873K72q83J943J3613K361N58r713r768j1874m685Q384M210j103j2674O638
10957i848l022j4624O358Q038O121J3210l134p741M293N889R176l754K357j8087
10943d768k043M708R267l543j6177k224J4021p171J0332m710k269p582l114J0878
10929d395j02j405K83j2528n384k200J2705M814J737J7560J9912M256j5397j2476
10915G380N282P69k090j3978j5207J627R669L553R302O229m120k69j7202q279
10901a7334J7839L314N827M566q019j3761o291p70O639R750q816q083J4358K3809
$$ plain form
11000 13001 840 -693 11987 17142 23997 24367 18329 19716 7874 6708 9572 1257 -2225 -7814
10986 -7814 6920 16394 5682 -3265 597 6951 -5771 -7151 2584 4424 4722 10048 7944 2873
10972 2873 3145 2262 4205 17818 20179 20737 11024 1256 -10618 -15303 -6919 -2709 -3812 -16486 -9848
10957 -9848 -12870 -27494 -21136 -13098 -6977 6233 3099 -4642 -349 5540 14716 10962 13319 -4768
10943 -4768 -6811 -2103 7164 3621 -12556 -14780 -759 -7930 2402 -2308 -4577 -12159 -15273 -4395
10929 -4395 -4497 -5902 -5619 -18147 -23531 -25731 -13026 -8212 -6475 11085 30997 35253 19856 7380
10915 7380 12662 13431 11341 -2637 -17844 -16217 -6548 -2995 6307 12536 8416 8147 -9055 -17334
10901 -17334 505 3819 9646 14212 6193 -7568 -13859 -14629 -7990 1760 -7056 -15139 -781 23028
10887B3028m076J266j438p639j1273M766O484k269n316q40k146O416m025j9136
10873a6198l80M200R44q398m332N471J8945K741L775K91j3j0131m328J758m493
10858a0148j7578m972O078K762l783N631J1390J9881O349j3028j3047j3041M346
10845a9160J5572Q527J4144O220o166k1586j7223r700J148Q204J2710l24l848
10832a1482R292J5262L761j7170P822P947k1883K786J0537P40j8915j776J5072
10819A993R427M326M125J0528p007r093J6929j5249j7682L891j358j0671k755
10806a2596j2864K949K4871O572J955j533Q87K015l102j0915j848o018q117j766
10792a9510n719R606P901M96M233L21M760o943r995p129J0893J6854J4256n658
$$ plain form
10887 23028 18952 20218 18780 11141 -132 4634 11118 8849 3533 2693 547 6963 2938 -16198
10873 -16198 -16578 -12378 -11434 -19832 -24164 -18693 252 2993 6768 7059 7046 -3085 -7413 -5655 -10148
10858 -10148 -27726 -32698 -26620 -23858 -27641 -22010 -10620 9261 15610 2582 -10465 -23506 -19160
10845 -19160 -3588 4939 19083 25303 19137 -2449 -19672 -29372 -28224 -20020 -7310 -7634 -11482
10832 -11482 -2190 13072 16833 -337 7485 15432 -6451 -3665 6872 7612 -11303 -13079 1993
10819 1993 11420 15746 19871 30399 23392 14299 31228 15979 -1703 2188 830 -9841 -12596
10806 -12596 -25460 -22511 2360 8932 10887 9354 10241 12256 9154 -1761 -3609 -9627 -17744 -19510
10792 -19510 -25229 -15623 -7722 -7226 -2993 -2672 2088 -4855 -14850 -21979 -11086 5768 20024 14366
10778A4366q5O817m960j4619j0897r04N021L461q343j55M566J283O040K115k817
10763H89m915o008q036j0739o54J4018L555J5571K905j1013r279k13L064O2R101
10748a692P713n188j808o363l734k587J4668l28j0302m763J2589o242l986R331
10734b692L161R865l713j5661j5563O790R958j662m085j8959k945J0216Q373L051
10720a3866L216L242O542l09l207j575l824L875O362o014q335O513K825k742m560
10705a1857O630k041N281R485k890k2981j0408J929N572N94j0601R697J4684M999
10691a907q930K214O646m493n541N340N054l606n951l379o907j942R261J0736
10677c405J3789q91j2653j5614N063m19k429k62L527J2953l636k1977m815J8506
$$ plain form
10778 14366 14281 21098 16138 1519 -9378 -10282 -5261 -1800 -10143 -10298 -5732 -4449 1591 3706 889
10763 889 -4026 -10034 -18070 -28809 -29463 -15445 -11890 3681 6586 -4427 -13706 -13919 -10855 -10793 -1692
10748 -1692 6021 833 -975 -7338 -11072 -13659 1009 681 -9621 -14384 -1795 -8037 -12023 -2692
10734 -2692 469 10334 6621 -9040 -24603 -17813 -7855 -9517 -13602 -32561 -35506 -25290 -16917 -13866
10720 -13866 -10650 -7408 -866 -1175 -4382 -5957 -9781 -5906 456 -5558 -13893 -7380 -4555 -7297 -11857
10705 -11857 -5227 -7268 -1987 7498 4608 -18373 -28781 -26852 -21280 -20686 -31287 -21590 -6906 -1907
10691 -1907 -10837 -8623 -1977 -6470 -12011 -6671 -1617 -5223 -11174 -14553 -21460 -23402 -14141 -3405
10677 -3405 10384 9493 -3160 -18774 -13711 -14130 -16559 -16821 -13294 -341 -3977 -25954 -30769 -12263
10663a2263M569K63N396k688O518M146r460k281m228j5918n073J0863M463L524
10649a2169p983R770j505K544L386m230j6451q665J6099j368k51J6353j1028n802
10635b1300J0992L841k670m182j0785Q538N211Q20m79J15p844Q706m536J1063
10621b510L681o194J3713J437o850L11R442K2561o357j7211j754k138o615n634
10607d118o185j8270j135k250P205R507l477l40j2236R030J3468M228J1057p318
10593h34p628q31Q656L368J11J037j6344k1486O996J726Q172O917n668o133n912
10578b7853J4121J5423o536J2260P241m393L253k774m164n312n808m470Q205M094
10564C287R06J2381J0575r548m177J611Q298q866k550q039q411L70J6658J1781
$$ plain form
10663 -12263 -7694 -7431 -2035 -4723 1795 5941 -3519 -5800 -10028 -25946 -31019 -20156 -15693 -12169
10649 -12169 -20152 -10382 -11887 -9343 -5957 -10187 -26638 -35303 -19204 -20572 -20823 -4470 -15498 -21300
10635 -21300 -10308 -6467 -9137 -13319 -24104 -15566 -10355 -9535 -10014 -9899 -17743 -9037 -13573 -2510
10621 -2510 1171 -5023 8690 10127 3277 3588 13030 35591 29234 12023 10269 8131 1516 -4118
10607 -4118 -10303 -28573 -29708 -31958 -24753 -15246 -18723 -19063 -31299 -22269 -8801 -4573 6484 -834
10593 -834 -8462 -9293 -637 2731 2842 3879 -12465 -33951 -26955 -25229 -17057 -10140 -15808 -21941 -27853
10578 -27853 -13732 1691 -4845 7415 14656 10263 13516 10742 6578 1266 -4542 -9012 -807 3287
10564 3287 4193 16574 27149 17601 13424 15035 23333 14467 11917 3878 -4533 -4163 12495 24276
10550B4276J8592O89j2065j6367R275p09k0980o169j9017k925J1781M908N857
10537b854J0519K122p77q629J2228P926O922q326j5407l6n008j0785j921N494
10523h532J2761P087j0691k674m291n90j0080k793L836l475j727n639R35P36K0855
10508d282O793K489k809q678r023k591m769Q568o808l984O906Q562J977n722j522
10493a4893N02Q378Q700N222r55l725r675o305o971p461K147J6385Q727q006p194
10478a5124o258p418J3604n329j350J3526j167M109J330J2208N792r795j4419
10465a0291P327k219q808Q244l995l210P557J1186j917M637K261p720J35m909
10451a722J7768J9405M698J261j958o140m36n693o654O822j4458n116J767r375
$$ plain form
10550 24276 42868 43557 31492 15125 24400 23691 2711 -3458 -22475 -25400 -13619 -8711 -2854
10537 -2854 7665 9787 9010 381 12609 20535 27457 19131 3724 3688 -1320 -12105 -14026 -8532
10523 -8532 4229 11316 625 -2049 -6340 -6930 -17010 -19803 -15967 -19442 -21169 -26808 -25873 -25137 -4282
10508 -4282 2511 5000 2191 -6487 -15510 -18101 -22870 -14302 -21110 -25094 -18188 -9626 -7649 -13371 -14893
10493 -14893 -14391 -6013 2687 7909 6954 3229 -6446 -12751 -19722 -27183 -25036 -8651 76 -7930 -15124
10478 -15124 -21382 -28800 -15196 -20525 -21875 -8349 -9516 -5407 -4077 8131 13923 4128 -10291
10465 -10291 -2964 -5183 -13991 -5747 -9742 -12952 -5395 5791 3874 8511 10772 3052 3187 -1722
10451 -1722 16046 35451 40149 41410 39452 33312 32876 27183 20529 27351 12893 7777 9544 169
10437A69L375J50J1520o478k0228j0213N41N110N451Q648p285j8747l410j721
10423c3118p726J7780J754n906M630J0712K462n869m393j968J672J387O398L580
10409h605J9967j750n797k605N706k5j4031j0848n065j57p689j179L255J084p262
10394c5001J1308K7850J967p477m779l028J441j098q053o264L012J3093J6834
10381I805J2445R84j203j6118k503P480J71j5894k1149O861P023R50O676k287
10367f759j5362m096L279O413J0732K299q625m486K689l077N432J1856K958j1547
10353h294j4601N223R485j979n52j1957j900K038N60L744m819k189J8735J437
10339e069l612N520R828k149p43j21N776m47N115j563j7221r410r572Q12P902
$$ plain form
10437 169 3544 3694 15214 8736 -11492 -21705 -21164 -16054 -10603 -1955 -9240 -27987 -31397 -33118
10423 -33118 -40844 -23064 -21310 -27216 -22586 -11874 -9412 -15281 -19674 -21642 -19970 -18583 -12185 -8605
10409 -8605 11362 9612 3815 1210 6916 6891 -7140 -17988 -23053 -23210 -30899 -32078 -28823 -27739 -35001
10394 -35001 -23693 4157 6124 -1353 -6132 -9160 -7719 -8817 -16870 -23134 -20122 -7029 9805
10381 9805 22250 23234 22031 5913 3410 10890 11061 -4833 -25982 -19121 -12098 -11148 -4472 -6759
10367 -6759 -22121 -26217 -22938 -16525 -5793 -3494 -12119 -16605 -13916 -16993 -11561 295 3253 -8294
10353 -8294 -22895 -17672 -8187 -10166 -10718 -22675 -24575 -22537 -21977 -18233 -23052 -25241 -6506 -5069
10339 -5069 -8681 -3161 6667 4518 3775 3654 9430 8983 14098 12535 -4686 -14096 -23668 -22856 -14954
10324a4954M446J4022M066J0540m936j3651o634M559K567J2436L69k685l422j7407
10310a0684N396l382j81K129K834j984o748l705J7827O244m596j89r731K644J3190
10295I064m940r057j325P539L866k1259p646Q324M333J1838J5228M40j1335q396
10281c326o649r134O042J1582J9635l441n491J824J0703L12j1196j7942R01J8861
10267A2681N417j0367j592L00j1748K067Q144J0119j9541R10J2486O33l812K354
10253H051j3140j7912J1985P208J810J752Q173j572j0348p482m439K868m228l741
10239b1015R727K130J669R133m372k988K736j5j375m07Q368n521J041k99M094
10224B906K211m025J4747l367j9376q663K5121J6668j1319o536n044n790p794
$$ plain form
10324 -14954 -10508 3514 7580 18120 13184 -467 -7101 -2542 25 12461 12830 10145 6723 -10684
10310 -10684 -5288 -8670 -8851 -6722 -3888 -5872 -12620 -16325 1502 7746 3150 2961 -6770 -4126 9064
10295 9064 4124 -4933 -6258 1281 5147 -16112 -23758 -15434 -11101 737 15965 16405 5070 -3326
10281 -3326 -9975 -19109 -13067 -1485 18150 14709 9218 11042 21745 22057 10861 -7081 -6180 12681
10267 12681 18098 7731 6139 6439 -5309 -3242 4902 15021 -4520 -3610 8876 9509 5697 8051
10253 8051 -5089 -23001 -11016 -3808 -1998 -246 7927 6355 -3993 -11475 -15914 -13046 -17274 -21015
10239 -21015 -11288 -9158 -7489 1644 -2728 -5716 -2980 -2995 -4370 -4777 3591 -1930 -889 -1188 2906
10224 2906 5117 1092 15839 12472 -6904 -15567 9554 26222 14903 8367 3323 -2467 -10261
10211a0261K001J131L229K343M923N387K158o233R8m459j556N537N37M236J2832
10196B1903L258k0146K522L706R422n912p691R642J275q088o645j3828Q021J854
10182g07K974L568p740l411j1500p718M377K159J6785M844o653q126l092m901
10168a9141R068K114J3L694J1359m092p831l599j515Q232L767J101Q266M283q069
10153G650k124J300n075o349N8M379n197m982k298M436Q99k948J832L373l546
10138h592O15K79K030J2724P462J361p583j0097q529o320J3789L313q248j096
10124h892J0173N91l87Q034J0068j0600j0049o817O130j0011j898O043M076k168
10110e707M926L208j1194j1365q169R507K851P68K882o017r440R586Q81k25J8746
$$ plain form
10211 -10261 -8260 -7129 -3900 -1557 3366 8753 10911 4678 4776 317 -1239 4298 4835 9071 21903
10196 21903 25161 5015 7537 11243 20665 14753 7062 16704 17979 9891 3246 -10582 -2561 -707
10182 -707 2267 5835 -1905 -5316 -16816 -24534 -20157 -17998 -1213 3631 -3022 -11148 -14240 -19141
10168 -19141 -10073 -7959 -7946 -4252 7107 3015 -4816 -8415 -9930 -1698 2069 3170 11436 15719 7650
10153 7650 5526 6826 1751 -4598 -4540 -161 -5358 -10340 -12638 -8202 -7303 -10251 -8419 -5046 -8592
10138 -8592 -7977 -7698 -5668 7056 14518 15879 8296 -1801 -10330 -16650 -2861 452 -7796 -8892
10124 -8892 1281 1872 1485 9519 19587 8987 -1062 -7879 -1749 -11760 -13658 -7615 -3539 -5707
10110 -5707 -781 2427 -8767 -20132 -28301 -18794 -15943 -15175 -12293 -18310 -27750 -18164 -17283 -17508 1238
10095A238j526j2280P049N293j1395L983K201L71r295M305K657n233j1946p529
10081c2107J0347J6882M387j0228l639L033n562m25J1715m03r188J2792P096m661
10067C9J2727K32k598n551m643J945J2711Q206l882n495p748M741m580m340j0813
10052i049j3778J4646P131k981j639N033J4225L78p738P51O800r386l776P190
10038G807Q733l304k670j612l422o85J043K030l349q984n410O992K943R607L263
10023A2982L252j0190m516m829k814k515K722L97K215j146j1358l582P724J6529
10009D871j552j2309Q13M753k299j543O522K0564K838l830K488m541j3893j820
9995A062m420j0215L80Q212K10J2440j5694o315r547l946N376J3542m48O440m623
$$ plain form
10095 1238 -288 -12568 -5519 -226 -11621 -7638 -5437 -5066 -14361 -10056 -7399 -12632 -24578 -32107
10081 -32107 -21760 -4878 -491 -10719 -14358 -11325 -16887 -17312 -5597 -6000 -15188 -2396 4700 39
10067 39 12766 12998 10400 4849 206 2151 14862 23068 19186 13691 5943 10684 6104 1764 -9049
10052 -9049 -22827 -8181 -1050 -4031 -5670 -637 13588 13966 6228 6979 13779 4393 617 7807
10038 7807 16540 13236 10566 8954 5532 4847 5890 7920 4571 -4413 -9823 -2831 112 9719 12982
10023 12982 16234 6044 1528 -3301 -6115 -8630 -5908 -5511 -3296 -4442 -15800 -19382 -11658 4871
10009 4871 3319 -8990 -8177 -3424 -5723 -7266 -744 19820 22658 18828 21316 16775 2882 1062
9995 1062 -3358 -13573 -13193 -4981 -4771 7669 -8025 -14340 -23887 -27833 -22457 -8915 -9363 -2923 -7546
9980g546L481K46j2293j3769L635Q726J028p110J0294l296J12l872L988J8745
9966B369J122p835k342L432J2970K57m958K004K894j1344R076L200l365j7043
9952i563m173Q168R270J9698J6111K307j3540j5138p771K414j8095p721L45Q635
9938i053O997N953j519n241K987j606J474J1923J355p646K65M031j0728o514K839
9923d483Q659k850K754N766M363k662j833Q613O982o969O867J4252j9322j0575
9909I562j2426R03L119j3368n197J7924J9969J287l862m860q955K649J4545o835
9895A4455P487J6360o517k031m90j1944k1902m418L737Q371o758M534L299j1564
9881g381N218M168p782l225K455J3550Q236n314q259N542M495J103O949K134q995
$$ plain form
9980 -7546 -4065 -3819 -16112 -29881 -26246 -17520 -16492 -23602 -13308 -16604 -16492 -20364 -16376 2369
9966 2369 3491 -4344 -6686 -3254 9716 9973 5015 7019 9913 -1431 7645 10845 7480 -9563
9952 -9563 -13736 -5568 3702 23400 39511 41818 28278 13140 5369 7783 -10312 -18033 -17688 -9053
9938 -9053 -2056 3897 2378 -2863 124 -1482 -8 11915 13270 5624 5889 9920 -808 -7322 -4483
9923 -4483 4176 1326 4080 9846 14209 11547 9714 18327 25309 18340 25207 39459 20137 9562
9909 9562 -2864 -1961 1158 -12210 -17407 517 20486 21773 17911 13051 4096 6745 21290 14455
9895 14455 21942 38302 31785 29754 29264 17320 -4582 -9000 -5263 3108 -3650 884 4183 -7381
9881 -7381 -2163 2005 -5777 -9002 -6547 7003 15239 9925 1666 7208 11703 12806 19755 21889 12894
9866A2894m271k861N650K527R06K138R045K0885o058n684j3577j3723p08j7773
9852a0610L794J3264L997n437P607L031p85k96J0832r079r730j5038L893O638
9838B081L81M927N428L697K471r784k1266o846P934M028K964J2774K300p445q63
9823B781l628j5012L408L905k615R91O383N226j863q064q198J3590J5535O335
9809A8774o335o032k475J230K974l683J6144J5857k373r821k518L295m234j1888
9795H915R894J060r582j0497k642Q785Q299Q112P926o418O32O15l847L332N045
9780B9629j0778j0769j962L503R626Q095l612L437O837p845m216j99J194n5r939
9765A2946r335J0438n47j9133j799j670O734K915j088j2620j1495p430J3745Q784
$$ plain form
9866 12894 8623 5762 11412 13939 14845 16983 26028 46913 40855 35171 21594 7871 7163 -10610
9852 -10610 -6816 6448 10445 5008 12615 15646 14861 14565 25397 16318 6588 -8450 -4557 2081
9838 2081 2462 7389 12817 16514 18985 9201 -12065 -18911 -10977 -6949 -3985 8789 11089 3644 2781
9823 2781 -847 -15859 -12451 -8546 -11161 -10170 -3787 1439 -424 -8488 -16686 -3096 12439 18774
9809 18774 12439 6407 3932 5162 8136 4453 20597 36454 34081 24260 21742 25037 20803 8915
9795 8915 18809 19869 10287 -210 -2852 5933 14232 22344 30270 23852 24484 25099 21252 24584 29629
9780 29629 18851 8082 6120 9623 19249 27344 23732 27169 34006 26161 21945 21746 22940 22885 12946
9765 12946 3611 14049 13502 -5631 -7430 -9100 -2366 549 -539 -13159 -24654 -32084 -18339 -9555
9751i555r699j607m502O802K1294K023L361R374j252r084o153O443J44j130k863
9736C596m029N860o308L422L630J668M95j0887N761J1627L19J952j735j0336o107
9721a072k1163m623O326K560J8416J2351K893l932j5186k916L034k154j221J0929
9707D242J8051R625m618j1134l793Q578M170m115j808J18L307m156J68p782j403
9692I450L743p885k234Q363M82J886M064m457J192r170M559r961K934L037R569
9677A5572J2134o906j4477l978p89L191M633j897j659r909P523J996m310N455
9663F579r79r46l406p840L211J5524L065l157K127k787n331r54m231N249j517
9648D607J904Q696J1611L556N416J935k49j2644j2896J818K027J1973q134l962
$$ plain form
9751 -9555 -19254 -20861 -25363 -18561 2733 4756 8117 17491 16239 7155 1002 7445 7589 6459 3596
9736 3596 -433 5427 -881 2541 6171 7839 8334 -2553 3208 14835 15154 17106 15371 5035 -1072
9721 -1072 -22235 -26858 -20532 -17972 444 12795 15688 11756 -3430 -6346 -3312 -5466 -6687 4242
9707 4242 22293 31918 27300 16166 12373 20951 25121 21006 19198 19316 22623 18467 18635 10853 9450
9692 9450 13193 5308 3074 11437 11919 13805 17869 13412 14604 5434 9993 32 2966 6003 15572
9677 15572 27706 20800 6323 2345 1556 4747 9380 7483 5824 -4085 3438 5434 1124 6579
9663 6579 5600 4654 1248 -6592 -3381 12143 15208 12051 14178 11391 6060 5106 875 6124 4607
9648 4607 6511 15207 26818 30374 35790 37725 37476 24832 11936 13754 15781 27754 19620 15658
9634A5658j4685j5684J4184J2949o691m1J551N909J1440k787r776J165j635l610
9620G947l750K787J4901J999m830L522k256o746q09J735p686m81K078J0902N097
9605B4410Q663o45o588l897K445N361k073Q907j001j0612j0071O352J871O273
9591B9395l935N903J823n802O186j1904q363q189J1681P102j426l822o495q74
9577A1280M250P073o19q834P733J9158Q624k0574p984N110M858K206j0733q894
9563A2654m266q828k486N000P805n337P235J4560J1409q003k4185P699M767q020
9549A0004J486R726J686j4395O623J519j550J374J277J1952M410k293m584R315
9535C6550R804k327k184j3344J250r238j008K590m230p955P73K354M802J6493
$$ plain form
9634 15658 973 -14711 -527 12422 5731 5690 7241 13150 24590 21803 12027 13192 11557 7947
9620 7947 4197 6984 21885 23884 19054 22576 20320 13574 12765 14500 6814 6333 8411 19313 24410
9605 24410 33073 32428 25840 21943 24388 29749 27676 36583 35582 24970 14899 21251 23122 29395
9591 29395 25460 31363 33186 27384 33570 21666 13303 5114 16795 23897 22471 18649 12154 11280
9577 11280 15530 22603 21984 13150 20883 40041 48665 28091 20107 25217 30075 32281 21548 12654
9563 12654 8388 -440 -2926 2074 9879 4542 11777 26337 37746 29743 5558 13257 18024 10004
9549 10004 11490 21216 22902 8507 15130 16649 15099 16473 17750 29702 34112 31819 27235 36550
9535 36550 46354 44027 41843 28499 29749 20511 19503 22093 17863 9908 10681 13035 17837 34330
9521C4330J2619k654L285l222o701p625m996r649Q473J3334M048m879r188j804
9507B5371K062L155q163j956Q854K91j740J1601m241q636k448O10j770k36p063
9492A5691J138J1331kj085r542N872J3609J7968j4121k103k502Q744j939Q305
9478E1364k552J80N476j4366r143O100J3306N894j4174j110J883p589n180j592
9464B8497o155j573Q824O633k418j1945N19k162N444L781P148k954j1057K485
9450B5067J9774J3373k16o116L055R584L741k4514o642M934L261q755O737L624
9436D6907J7769m290K984M56j1951J235m53Q466k325n08K0235O5l609R256q238
9421G5999j827n405m175k874J234l296L326l375k375J514J9250k226j1051Q83
$$ plain form
9521 34330 46949 44295 47580 44358 37657 30032 25036 15387 23860 37194 41242 36363 27175 25371
9507 25371 27433 30588 22425 20469 29323 29614 27874 39475 35234 26598 24150 24760 22990 22754 15691
9492 15691 16829 28160 28158 27073 17531 23403 37012 54980 40859 38756 36254 44998 43059 51364
9478 51364 48812 48992 54468 40102 30959 37059 50365 56259 42085 40975 42858 35269 30089 28497
9464 28497 22342 20769 29593 36226 33808 21863 22382 20220 25664 29445 36593 33639 22582 25067
9450 25067 44841 58214 57998 51882 54937 64521 68262 43748 37106 42040 45301 36546 43283 46907
9436 46907 64676 60386 63370 63826 51875 53110 52657 61123 58798 58290 78525 78590 74981 84237 75999
9421 75999 74172 68767 64592 61718 62952 59656 62982 59607 57232 58746 77996 75770 64719 65602
9407F5602Q693J565k1536L444J0417o371r128J3197L015O386K273N319N230r86
9393H7120J185l13k410j037l8k024p3k0332n588J2401R86P193J0376P395N23P911
9377A03275M405o07l031j0604j3564q162K4496J1145j018K258J585K19M499q365
9363A06531Q144l791j667l496J543L382J6382L973j0541N945m075j0621K420k249
9349A11880j7075J2299J7806J2182J1142p462K224K036j534n990L389J0057n063
9336A45891K81M254R963J6598R76j4574r166j8882J1801K7874M278p94l965J5670
9322A90205P261j3880j2897K321q1J560l284J0263K441M649Q693O946j248N661
9308B08610R240q784j2441j500n65k260k015N701J1077P989P270m433n019M423
$$ plain form
9407 65602 74295 75860 54324 57768 68185 61814 52686 65883 68898 75284 77557 82876 88106 87120
9393 87120 88305 87992 85582 84545 84507 82483 82410 62078 56490 68891 69877 77070 87446 94841 95364 103275
9377 103275 107680 107073 104042 93438 79874 71712 96208 107353 106335 108593 110178 110397 114896 106531
9363 106531 114675 110884 109217 105721 107264 110646 127028 131001 120460 126405 122330 111709 114129 111880
9349 111880 94805 107104 124910 137092 148234 140772 142996 145032 143498 137508 140897 150954 145891
9336 145891 146172 150426 160389 176987 177963 163389 154223 135341 147142 175016 179294 178500 174535 190205
9322 190205 197466 183586 170689 173010 172929 174489 171205 181468 183909 188558 197251 204197 202949 208610
9308 208610 217850 209066 196625 195125 194560 192300 190285 195986 207063 215052 222322 217889 212870 217293
9294B17293J6971m98j7696j743J6507r28k203L485R719Q767P202o197j2660N764
9280B43783K6470n843J032L017o057k383L003L122R314j870M22K348O535l865
9266B79028J1706M342M028N382l124k452k198o933O005J189L897N939O745J2j153
9251C12413m075n474Q613R792M901k2831m705m34L105J132J006K516j354n814
9237B98791L243M451J068j904M035R47l194o108K971K196L932n619l540j3336
9223B87933j984K995J1628J5195P458j6785j4480k165M332p84M687L731R891M691
9209C16343q447j2581P178P128r530p547P44k200o237o955j959p668n451O09P474
9194B70901K240N93j2974j2739n15m705n219P259O574j2239n757o632k696m158
$$ plain form
9294 217293 234264 233766 216070 214327 230834 229906 227703 231188 240907 249674 256876 250679 238019 243783
9280 243783 270253 264410 265442 268459 262402 260019 263022 266144 275458 273588 274010 276358 282893 279028
9266 279028 290734 295076 299104 304486 301362 298910 296712 289779 295784 296973 300870 306809 313554 313566 312413
9251 312413 308338 302864 311477 321269 326170 303339 298634 298200 301305 302437 303443 305959 304605 298791
9237 298791 302034 306485 307553 305649 309684 310631 307437 301329 304300 306496 310428 304809 301269 287933
9223 287933 285949 288944 300572 315767 323225 306440 291960 289795 294127 293343 298030 301761 311652 316343
9209 316343 307896 295315 302493 309621 300091 292544 293288 291088 284851 277896 275937 268269 262818 263427 270901
9194 270901 273141 273734 260760 248021 247506 242801 237582 244841 251415 239176 233419 226787 224091 219933
9180B19933J0111O208R056M318n686k8387q139L639J402j629P216Q856j5146r080
9166B02672K207l380k735r472j4636L054K405k287k44P075O898J210j0450m489
9152A77828o359n123q237j4555M206J9724J285o363j795j7492o346J1514J693
9139A49980p648k3982L531j418N19P096m791n695N29M482J025j0507j650N954
9125A17425J0953P562J2970j2014r552j955q3q865N438Q372K404p407k2890o363
9111I5995N060j55J598K0242P614q865j4656K369m132q025N655o545L502O293
9097A05950q230o803l75J0490J1216q938j8930r180L029m178j650N142J6224Q342
9083A02109l870j1782J143l794K927l041j370R315O114j5911L751N066p397j4007
$$ plain form
9180 219933 230044 236252 245308 249626 243940 215553 207414 211053 212455 210826 218042 226898 211752 202672
9166 202672 204879 201499 198764 189292 174656 177710 180115 177828 177584 184659 191557 192767 182317 177828
9152 177828 171469 166346 158109 143554 147760 167484 168769 162406 160611 143119 136773 148287 149980
9139 149980 142332 118350 121881 120463 120982 128078 123287 117592 118121 122603 123628 113121 111471 117425
9125 117425 128378 135940 148910 136896 127344 125389 125306 116441 121879 130251 132655 125248 102358 95995
9111 95995 101055 100900 102498 122740 130354 121489 106833 109202 105070 97045 102700 96155 99657 105950
9097 105950 97720 90917 90542 101032 112248 103310 84380 75200 78229 74051 72401 77543 93767 102109
9083 102109 98239 86457 87600 83806 86733 83692 82322 91637 97751 81840 85591 90657 83260 69253
9069F9253l548p676m886K02L192o321M52J2332J5156J338q12j3904j0568n902
9055D8308L844q19R809p878n834K426J9959M70N657j4097o471k386M003Q422k535
9040F2878m708l006L525M283o356j2061n187K877J6673O432j8852j5678j495r50
9026B8375m510J0425R841J0530J865P35m620j0226p395o627J2983K1365M010K844
9012F9595N281m2j9317K888m838j2008j054O001P799J3199N675j548j4888p937
8998D8806J12k482l105N121p937n773j313J2238m54l994o792l914m168O864l594
8983B9615K036l669n950M680M709J7043p835K212P086j515j2486m952r1n828j6832
8968H223J0922L179k38J2627k634o038J0930p140R410J1050L603p68J546q386
$$ plain form
9069 69253 65705 58029 53143 53345 56537 50216 50668 63000 78156 79494 78682 64778 54210 48308
9055 48308 52152 51333 61142 53264 47430 49856 69815 70285 75942 61845 55374 52988 56991 65413 62878
9040 62878 58170 55164 58689 62972 56616 44555 39368 42245 58918 65350 46498 30820 29325 28375
9026 28375 23865 34290 44131 54661 56526 57261 52641 42415 35020 28393 41376 62741 66751 69595
9012 69595 74876 74834 55517 58405 53567 41559 40505 46506 54305 67504 73179 71631 56743 48806
8998 48806 48918 46436 43331 48452 40515 34742 33429 45667 45213 41219 34427 30513 26345 33209 29615
8983 29615 31651 27982 22032 26712 31421 48464 40629 42841 49927 48412 35926 30974 30883 25055 8223
8968 8223 19145 22324 22086 34713 32079 26041 36971 29831 39241 50291 53894 53126 54672 46286
8954D6286o0k640m571l265m04O023M946q701j2122K062M454J230O362j5112k522
8939B1966J0003N216N876m260j7629L99J2880M389k099K836N321j1527O884p606
8925C2649k316j3141K381J1211K0184j3079j3724J546n522p921j3988j406J2489
8912I363J2524O714J3188J0186j207K729k0305j1719p037j8124J729J4944Q906
8899B1891P641J0050p272q277L489J1020M447j2067J288L94j934p33L272L066
8885C6275r867K295j0812J101P071k622j7911r667l025L649J7909q20m009P678
8871A7245M4j2049K956J3841P451o044K407N485r191k896p01o774j2602K6107
8857B5279n08q133l104j752K652P425j1337j4505Q051O313N542k905r885j744
$$ plain form
8954 46286 46226 43586 39015 35750 35346 41369 46315 37614 25492 27554 32008 33238 39600 24488 21966
8939 21966 31969 37185 43061 38801 21172 21571 34451 38840 36741 39577 44898 33371 40255 32649
8925 32649 30333 17192 19573 30784 50968 37889 24165 25711 20189 12268 -1720 -3126 9363
8912 9363 21887 28601 41789 51975 50768 53497 33192 21473 14436 -3688 -1959 12985 21891
8899 21891 29532 39582 32310 24033 27522 38542 42989 30922 32210 32604 30670 29937 33209 36275
8885 36275 26408 28703 17891 18992 26063 23441 5530 -4137 -7162 -3513 14396 13576 9567 17245
8871 17245 17289 5240 8196 22037 29488 23444 25851 31336 22145 19249 18548 11774 -828 25279
8857 25279 24771 16638 13534 11782 14434 21859 10522 -3983 4068 10381 15923 13018 3133 1389
8843A389l35L77Q491L876j325N224M717j1322L913j953q000N466k129J0842J2357
8828C1588n080m704K5881N45p060j8798j9887M92J5421r93j2807K359m4N432R451
8813B1796l736m802j0806N46M477Q996K395k577j1188J980O785K336M840K2754
8799D3796K405j7233P481j109K423L1330M1117L2075J251k5576k8833j7815k938
8786F8374q652n271j2580R23J0527O570m359L17m744q191j7008j1368r708p697
8772b867L619M182J707J3035N531j0809j1332L221O484l961k434R970R057L320
8758B8723J434L288j545o665L777J3921J7667J4536J7839M8108R4167Q3707O000
8745C24957q0178r0972o3486k2150p588k2087j8449l697K78O032P15N925Q08N490
$$ plain form
8843 1389 1054 1431 9922 13798 12473 17697 22414 11092 15005 13052 5052 10518 8389 19231 31588
8828 31588 26508 21804 47685 48230 41170 22372 2485 2977 18398 17405 4598 6957 6913 12345 21796
8813 21796 18060 13258 2452 2998 7475 16471 18866 16289 5101 7081 13866 16202 21042 43796
8799 43796 46201 28968 36449 35340 37763 69093 110210 142285 143536 117960 89127 71312 68374
8786 68374 59722 54451 41871 42794 53321 59891 55532 55849 51105 42914 25906 14538 4830 -2867
8772 -2867 752 4934 6641 19676 25207 14398 3066 6287 12771 8810 6376 16346 25403 28723
8758 28723 30157 33445 31900 25235 29012 42933 60600 75136 92975 141083 235250 318957 324957
8745 324957 244779 153807 90321 68171 60583 38496 20047 16350 16628 22660 23375 29300 30108 35598
8731C5598k2m118j2223k079O408L713n229O278K937R737Q658j5580j1314m84O848
8716B9128M674M243K297n588p268j2253j499J1603N037J5228P802J3442L4929
8703A01775M0488K2079j1198k9316j5938k3775k0901j6844q525q185L919r182
8691B4397j445JN800p151l32r944m152M521m308p833j10nl773K2931K1000m342
8675C5255j4894O454O755L583o318J4303k747j1520j490J989J418K57R579J2911
8661E5535J650o693q617N076L996l051k550k519Q058L152J4819j4466j9295q566
8647B6529J412N022M168O662J1591k87j2348Q291M994J299R652M7l806J0402K0753
8632I4381J4012J0675k10O401J5798J5953K2366J3363J4456K2235J8406Q95q286
$$ plain form
8731 35598 35576 31458 19235 17156 23564 27277 22048 28326 31263 41000 49658 34078 22764 22280 29128
8716 29128 33802 38045 40342 34754 27486 15233 13734 25337 30374 45602 53404 66846 101775
8703 101775 142263 164342 153144 123828 107890 84115 63214 46370 37845 29660 33579 24397
8691 24397 22952 22953 28753 21602 21270 11326 7174 11695 7387 -446 -556 -561 -4334 18597 39597 35255
8675 35255 20361 26815 33570 37153 30835 45138 42391 30871 29381 31370 32788 33045 42624 55535
8661 55535 57185 50492 41875 46951 50947 47896 45346 42827 50885 54037 68856 54390 35095 26529
8647 26529 27941 32963 37131 43793 55384 55097 42749 51040 56034 57333 66985 67032 63226 73628 94381
8632 94381 108393 119068 118858 125259 141057 157010 179376 192739 207195 229430 247836 248731 240445
8619B40445p737j4724k6255j6870j8865k9199j8415j8474n560j152j588J706p186
8606G6126j1965K277l594j7523j7519J05O827r965k997J8639J4694m04j349R194
8592F2546J8637K7929N3437R4875M3307m7696o2630n3550k3876r579j7227j7158
8580F9015j5614j1119k897N921m405j296n064L987q797m798R21J7333J0864J7342
8566G1393J1187N538P376N978J7121M6163P8435J02791L2146q9702j06542o2703
8554A19181l0822r731J4866K9256P0658R2480M090o5424m6545k8080j2574q318
8542A29037k7511l4377k7798j0474L595O513K466j5587p805k648j262j296K840
8529A5693R872M203L497J3060K2015P653K6412N9878Q2372J12607J0830r9432
$$ plain form
8619 240445 232708 217984 191729 174859 155994 126795 108380 89906 84346 83194 81606 83312 76126
8606 76126 64161 66438 62844 45321 27802 27907 34734 24769 21772 40411 55105 54701 53352 62546
8592 62546 81183 109112 162549 257424 300731 253035 190405 136855 112979 103400 86173 69015
8580 69015 53401 42282 39385 45306 40901 39605 34541 38528 29731 24933 25854 43187 54051 71393
8566 71393 82580 88118 95494 101472 118593 164756 243191 345982 378128 288426 181884 119181
8554 119181 88359 78628 93494 122750 193408 285888 289978 224554 178009 149929 137355 129037
8542 129037 101526 67149 39351 28877 32472 38985 41451 25864 18059 15411 14149 12853 15693
8529 15693 25565 29768 33265 46325 68340 75993 102405 162283 244655 357262 368092 268660
8517B68660r2900p4309n5852k1335M3l703k766M646k311n316l08K531J6753J5026
8503D8859J3217j2655r764k1314j4783L606j919N155K1361q18j2411j5551j435
8490A548J0943J2695O020j4597j5602o374Q413l894m027J7044O704j2216n335
8477A322p9L159J753J1753J096k0752P430J1489m061j5365l153O724N479O992
8463A3787Q157m312k026r117m585O445K019k203J785R889P707J358k2172j137
8449E595Q253K946j539J894k384J984o609N128k930j679J2313M89j0218m948r371
8434a076r147J2077J9194O768l089n639k005Q947R059l19M724o102n394k668P898
8419C3228r929R3Q421p577j2730O210k860k056n025J0901J6306J6571j0711j8536
$$ plain form
8517 268660 175760 101451 45599 24264 24307 20604 17838 22484 20173 14857 14549 17080 33833 48859
8503 48859 62076 49421 39657 18343 3560 7166 5247 10402 31763 30945 18534 2983 1548
8490 1548 12491 25186 31206 16609 1007 -5367 3046 -848 -4875 12169 18873 6657 1322
8477 1322 1243 4402 6155 17908 19004 -1748 5682 17171 13110 -2255 -5408 1316 6795 13787
8463 13787 21944 17632 15606 6489 1904 8349 10368 8165 9950 19839 27546 28904 6732 5595
8449 5595 13848 16794 15255 17149 14765 16749 10140 15268 12338 10659 22972 23461 13243 8295 -1076
8434 -1076 -10223 1854 21048 27816 24727 19088 17083 26030 35089 34770 39494 33392 27998 25330 33228
8419 33228 23299 23392 31813 24236 11506 17716 14856 12800 7775 18676 34982 51553 40842 22306
8405B2306j1624J702J1881o525j2146J1186J8222M496p747n184j450j0312n920
8392H885J063n983j35J775N244l66Q011P753r13o206n150j185N469L566P299J3142
8376D2269L071P095n898j3370n864p550o844q065r086J1124L00j1096j292N445
8362B39J0713J2195n016q053J2902k432j7260j0952J2703Q707j4868j0848M016
8349g954Q848N2j776o107O132R982n881L558P982r85L440n65p090J870j8759o720
8333a3973j361Q759J3711o798k138Q383N672L40j0093O917M162N528j1287q144
8319c22J2942J049q167m785K124Q766R577p24p190P475k0215l576N353n61J932
8304C678J054J5498K2395j1228j0043m519j2788k3685r439J0509O666J1926k137
$$ plain form
8405 22306 10682 12384 24265 17740 5594 16780 35002 39498 31751 26567 25117 14805 8885
8392 8885 9948 3965 3830 5605 10849 10483 18494 26247 25334 19128 13978 12793 18262 21828 29127 42269
8376 42269 45340 52435 46537 33167 27303 19753 12909 4844 -4242 6882 7182 -3914 -5206 239
8362 239 10952 23147 18131 10078 22980 20548 3288 -7664 5039 13746 -1122 -11970 -7954
8349 -7954 894 946 -830 -6937 -805 9177 3296 6854 14836 13851 17291 16726 9636 11506 -7253 -13973
8333 -13973 -15334 -6575 7136 338 -1800 6583 12255 12595 2502 9419 13581 19109 7822 -322
8319 -322 12620 13669 5502 717 2841 11607 21184 20460 13270 20745 530 -3046 2307 1746 3678
8304 3678 4732 20230 42625 31397 21354 16835 4047 -19638 -29077 -18568 -11902 24 -2113
8291b113o713k91N955j0615r699l21J2026N700J2075n079M714J0059j0714M292
8277I276n339m271J0199j40o848J1065L533q910Q792O80o088O069l83o47l850
8262A3138Q094k215j5039P132Q831K692j4522j5269j412L333J685K724M881k283
8248A770j62J1154R603j2462k0095n499M228K1292N525N84Q08r914n677o442l736
8233i023l228P700R138K049j0293k3478k232J247J3060O383J988Q207Q322o95
8219I145j1148k558Q181n845j3708P576R629q603m45M997j156N986K0225q554
8205A3722q26M87N154P945j6013p397K727O666o31r36m287j958j0271q730j048
8190a5396N513M064M922N005o119j4494M709Q131m5j751l214o358l527k08K533
$$ plain form
8291 -2113 -8826 -9117 -3162 -13777 -23476 -23797 -11771 -6071 6004 925 5639 15698 4984 9276
8277 9276 3937 -334 9865 9725 2877 13942 17475 8565 17357 18037 11949 18018 17635 16988 13138
8262 13138 21232 19017 3978 11110 19941 22633 8111 -7158 -8570 -5237 -3552 -828 4053 1770
8248 1770 1608 12762 22365 9903 -10192 -15691 -11463 9829 15354 15938 16746 6832 1155 -5287 -9023
8233 -9023 -12251 -4551 4587 6636 -3657 -27135 -29367 -28120 -15060 -8677 -6689 1518 9840 9145
8219 9145 -2003 -4561 3620 -2225 -15933 -8357 1272 -7331 -7776 -2779 -3935 2051 22276 13722
8205 13722 12896 13383 18537 26482 10469 3072 5799 12465 11834 10898 6611 4653 -5618 -14348 -15396
8190 -15396 -9883 -5819 -897 4108 -2011 -16505 -11796 -3665 -3710 -5461 -8675 -15033 -18560 -18768 -16235
8175a6235R451K114O507k341j383j5592j0533j452P053J0040M917p083J077M584
8161h876O867J3243J2339j8482p184P448J1112J1404j964j2358j4192Q053j1415
8148d005o979J6954P688k574r206r887L310K825J833M141q773k9R4m753O665m345
8132g041P872P442k720r619j0374o664J3766J0154q31Q562k328L178l216m639
8118C542L678l711m063j961k284K87p218M080P418J2543j460m375j0487j0431
8104a4442k373P10O921K094J6562j836L16j0682L642l556q29J614J2048J4794
8090B4983K721j6453p645m357j7097k137J5154J8474K731q951J981p558r239L854
8076c539Q555K80l341j1275K799o031m132J0325M888L46J625O457j35k930Q419
$$ plain form
8175 -16235 -6784 -4670 1837 -504 -1887 -17479 -28012 -29464 -22411 -12371 -7454 -14537 -13460 -8876
8161 -8876 -2009 11234 23573 5091 -2093 5355 16467 27871 25907 13549 -643 7410 -4005
8148 -4005 -10984 5970 13658 11084 1878 -8009 -4699 -1874 -41 4100 -4673 -4702 -4608 -9361 -2696 -7041
8132 -7041 831 8273 5553 -4066 -14440 -21104 -7338 2816 1985 10547 8219 11397 8181 3542
8118 3542 7220 3509 -554 -2515 -4799 -4512 -11730 -7650 -232 12311 10851 6476 -4011 -14442
8104 -14442 -16815 -16105 -9184 -7090 9472 7636 7952 -2730 912 -2644 -3473 -1859 10189 24983
8090 24983 27704 11251 3606 -751 -17848 -19985 -4831 13643 16374 7423 9404 1846 -7393 -3539
8076 -3539 5016 5296 1955 -9320 -6521 -12552 -16684 -6359 -1471 -1125 500 6957 6822 3892 12311
8061A2311N949r782j1735L252N576Q875n876m808j200J4432O889L94q540k567
8047A3170O042J898L014Q705j1687o336K104J2069P351l524j2889K436O801o825
8033B2329j931m254K017J2987J2325m410m199q979J4153J3447j668p614j1306
8020C2897J480q54o709L248M312pJ1370M344j6909p186K195M553J580p448q074
8005A8792r925j929K327N351K500K280J0521n120M256K502l178l78n308L248l502
7990B2437n398J0834J2803p903p167N895Q044J0246r778k4699o382Q106K6310
7977D3348K845n620J42O052L964j1056j1661m818j1673k433N128N943l915K359
7963A8605L718L790r829k242O999m714M329K1808K946j7883j4001n181J587R853
$$ plain form
8061 12311 18260 8478 -3257 -5 5571 14446 8570 3762 2562 16994 23883 24277 15737 13170
8047 13170 19212 21110 24124 32829 21142 14806 16910 28979 36330 32806 19917 22353 29154 22329
8033 22329 20398 16144 18161 31148 43473 39063 34864 25885 40038 53485 51817 44203 32897
8020 32897 34377 33523 26814 30062 34374 34367 45737 50081 33172 25986 28181 32734 34314 26866 18792
8005 18792 8867 6938 9265 14616 17116 19396 29917 24797 29053 31555 28377 27999 22691 25939 22437
7990 22437 17039 27873 40676 32773 25606 31501 39545 49791 40013 15314 8932 17038 43348
7977 43348 46193 40573 40715 46767 50731 39675 28014 23196 11523 9090 14218 20161 16246 18605
7963 18605 22323 26113 16284 14042 21041 16327 20656 42464 45410 27527 13526 8345 9932 19785
7949A9785J0576J719k119r634p865M834n813m151O418R583n116n280J7985L053
7935C3975O95n666n238o771K173q42q216q204j396P317m616N447k555N112q11
7920A0404k472N373P389O472l062P49j2121o918n218n97r840k611N087p261p422
7905b2048P834L707r521l104Q563J9650O138k1897l247L267N255o450o864L24
7891a8393R305P317l124r480k71j281o551M736P324L55j17k926O294j088o68J1457
7875B889K098o997j2623J1906P642M077P737K882o52j3696K119l009j1777O570
7861h34L479j1542r502Q759P979k845q065j0164R739L3561O338q030j833o591
7847A0449p243N81j462m365j135P406K693r485Q061l112O44J728M161m613j5872
$$ plain form
7949 19785 30361 32080 29961 20327 12462 17296 11483 7332 13750 23333 18217 12937 30922 33975
7935 33975 34670 29004 23766 16995 19168 18326 10110 1906 510 7827 3211 8658 6103 11215 10404
7920 10404 7932 13305 20694 27166 24104 24853 12732 5814 596 -1 -9841 -12452 -7365 -14626 -22048
7905 -22048 -14214 -10507 -20028 -23132 -14569 5081 11219 -10678 -13925 -10658 -5403 -11853 -18717 -18393
7891 -18393 -9088 -1771 -4895 -14375 -14646 -15927 -22478 -17742 -10418 -10063 -10180 -13106 -6812 -7900 -8568 2889
7875 2889 4987 -2010 -14633 -2727 4915 8992 16729 19611 18959 5263 7382 4373 -7404 -834
7861 -834 2645 -8897 -18399 -9640 -1661 -4506 -12571 -22735 -12996 20565 26903 18873 17040 10449
7847 10449 3206 3787 2325 -2040 -3175 4231 6924 -2561 5500 2388 3032 4760 8921 4308 -11564
7832a1564O70L975J2395J5074L923n882p797k0892k4173j728K2126J8482R178
7819A3787p919n740N289j651j5874L758j966m170J058J2346J2013p319j9862o997
7805b3247J5853k589o152J643r9r199j1687J8246J7085l180k753j1370K503Q602
7791f344O050J0099K770o885k18j1758M67J868R073k09R220l675k137J788j1400
7776a291j2217j95M629K1998l571k455J2394j4883P100O208q289r196l623j515
7762d906M262O12j1648j0140J4653J3582q658o380o731O112l70n180N793L614
7748e385k713j2058K368L007j256N723J5820M521j3924j1294R5J0716L459j2536
7734a3457j6608O326M287j5507m072O860K0210R685j1268J3916J430r283m531
$$ plain form
7832 -11564 -10894 -6919 5476 20550 24473 18591 10794 -10098 -34271 -35999 -13873 4609 13787
7819 13787 5868 128 5417 3766 -12108 -8350 -10316 -14486 -13428 -1082 10931 3612 -16250 -23247
7805 -23247 -7394 -9983 -16135 -14492 -14591 -23790 -35477 -17231 -146 -3326 -6079 -17449 -14946 -6344
7791 -6344 -294 9805 12575 5690 5472 -6286 -5819 -3951 5122 4913 14133 10458 8321 10109 -1291
7776 -1291 -13508 -13703 -9074 12924 9353 6898 19292 4409 11509 17717 9428 232 -3391 -4906
7762 -4906 -644 -32 -11680 -21820 -7167 6415 -2243 -8623 -15354 -9242 -9612 -14792 -8999 -5385
7748 -5385 -8098 -20156 -17788 -14781 -16037 -10314 5506 10027 -3897 -15191 -15096 -4380 -921 -13457
7734 -13457 -30065 -23739 -19452 -34959 -39031 -32171 -11961 -2276 -13544 372 1802 -7481 -12012
7721a2012K316M316j8365M021Q270J0609K607P461M698q227j4292m770Q17J4M284
7706h253o706k309k037J3653J3712K397j5336n481q079m256J0630L899M909p681
7692a0938k3423L397K1867J0325J3277N457j0102j4987p115L499J3705J3176p917
7679A0221N422k865j1275q128K468J492j349p24K68j498R513k368r753l275o255
7664a8106k974k509L358J436m404k037Q479N651p540p560Q69J2308j0099n788
7650b8916J7318M000R936P067J925n882j46n279p89n082r260j1900O429J4401
7636f178N136J998Q324K060K757k404r010r489K974K782P077J114N002j0450p071
7621e378m709K932O675n463k806n752p526L690o189O924L552Q227M705J3554Q545
$$ plain form
7721 -12012 -9696 -5380 -23745 -19724 -11454 -845 1762 9223 13921 5694 -8598 -13368 -12551 -12537 -8253
7706 -8253 -14959 -17268 -19305 -5652 8060 10457 -4879 -10360 -18439 -22695 -12065 -8166 -3257 -10938
7692 -10938 -34361 -30964 -9097 1228 14505 19962 9860 -5127 -12242 -8743 4962 18138 10221
7679 10221 15643 12778 1503 -6625 -4157 -2665 -4014 -4738 -4470 -5968 3545 1177 -8576 -11851 -18106
7664 -18106 -21080 -23589 -20231 -18795 -23199 -25236 -16757 -11106 -18646 -26206 -25337 -13029 -23128 -28916
7650 -28916 -11598 -7598 2338 9405 11330 5448 5302 23 -766 -5848 -15108 -27008 -20579 -6178
7636 -6178 -1042 956 9280 11340 14097 11693 2683 -6806 -3832 -1050 6027 7141 12143 1693 -5378
7621 -5378 -10087 -7155 -480 -5943 -8749 -14501 -22027 -18337 -24526 -17602 -14050 -5823 -1118 12436 20981
7606B0981N2j8712j2835Q929M363q752j4831J1787J552K04p748o282J0829R660
7592h03N427r85j0295m045p045J806P11k739o173p599J0648J4316J5367P365j1844
7577D112j1201r346p347K135K937J5650K632j458Q862o879j089L526l158j470
7563b094N048J751J317o61J899q604k18Q662N807m652o482m184l62Q31j8090J85
7547a9847J4782M308p26N214J226J4958N367j1758j2847o603J2026M37L036M400
7533A3973r765j3455n532l841J551J850N227J188J0634M962Q981J1284o854j834
7519A8369o301o855k796l726J219k0991n870J2207K1248O428k0343j2882M580
7506a5713J5618k005k213N015P196O696J0674p554j6622J3635J1584P484K446
$$ plain form
7606 20981 21033 2321 -10514 -1585 2778 -5974 -20805 -9018 -7466 -7262 -15010 -21292 -10463 -803
7592 -803 4624 3639 -6656 -10701 -17746 -15940 -15229 -17968 -24141 -31740 -21092 -6776 8591 15956 4112
7577 4112 -7089 -16435 -23782 -21647 -18710 -3060 -428 -1886 6976 97 -992 2534 -624 -2094
7563 -2094 2954 4705 6022 5361 7260 -1344 -1562 7100 12907 8255 1773 -2411 -2773 -1942 -20032 -19847
7547 -19847 -5065 -757 -1483 3731 4957 19915 25282 13524 677 -5926 6100 6537 9573 13973
7533 13973 4208 -9247 -14779 -18620 -17069 -15219 -9992 -8804 1830 6792 15773 27057 20203 18369
7519 18369 12068 5213 2417 -1309 -90 -21081 -26951 -14744 6504 12932 -7411 -20293 -15713
7506 -15713 -95 -2100 -4313 702 7898 14594 25268 17714 1092 14727 26311 33795 36241
7493C6241j992l838N231j0931j1265j7003l733n900P17R576J86Q668q6j516L799
7478H154K272r035j4701k203j410K320O572J0823j768M112q321j0m633J1252p83
7463B641p874p194Q933Q53r966j0314j2666M752J1493J4076J2181q335p058M098
7449d380k942n963P209R063q476n756K582p698J490P487L191J7314q884j2025
7435g788n766J3700p424q293Q56M71J6620q898j0408p34M137K689J093O402J150
7420b193P026K387m78K276K087l303j1841N295n852L366J8012k38j0575M489L848
7405A4306n945j7381k639M97j3845O469K6748j725j1157j069J0090P072K082l492
7391A0011n078j2424m689J664J506o06q46L892J5198n713j4663k230N904N115
$$ plain form
7493 36241 34249 30411 35642 24711 13446 -3557 -7290 -13190 -12473 -2897 -2711 5957 5871 4355 8154
7478 8154 10426 1391 -13310 -15513 -16923 -14603 -8031 2792 1024 5136 -3185 -3195 -7828 3424 2641
7463 2641 -5233 -12427 -3494 -2641 -12607 -22921 -35587 -30835 -19342 -5266 6915 -1420 -8478 -4380
7449 -4380 -7322 -13285 -6076 2987 -5489 -11245 -8663 -16361 -14871 -7384 -4193 13121 4237 -7788
7435 -7788 -13554 146 -7278 -15571 -14715 -14244 2376 -6522 -16930 -17664 -13527 -10838 -9745 -3343 -2193
7420 -2193 4833 7220 6742 9018 11105 7802 -4039 1256 -4596 -1230 16782 16544 5969 10458 14306
7405 14306 8361 -9020 -11659 -11162 -25007 -18538 8210 6485 -4672 -5741 4349 11421 13503 10011
7391 10011 4933 -7491 -12180 -10516 -9010 -9616 -10462 -6570 8628 2915 -11748 -13978 -8074 -2959
7377b959j5527P677M706J249j2146k710L757m311J2155J8214J358M572J383j8199
7363g81P74M442q446m53l684q190j49K940J0735j7086N77J9133J406n327r54K60
7347d803Q379M543J901q87l467O265O889l82k0918m128N799o528Q150M727m696
7332H44K053N940L655n374j5337n655l050P125R412J0433k402k205o805r664j252
7317a2282N119J4904J152N06n634q893m370j4470J2125O204j1993J1085m072m146
7303a4765J0451K683q707R576j1235J4601K425o990n979O845n931l15J2449m122
7289I86j4475N131J7762o245j9658q19O24n528J3644J0215j642m704K745Q758
7275F794N229O239j6969j1938Q709J535k643J186K627m268L495J1633j1748j2292
$$ plain form
7377 -2959 -18486 -10809 -6103 -4854 -17000 -19710 -15953 -20264 -8109 10105 11463 16035 17418 -781
7363 -781 -7 4435 -4011 -4464 -8148 -16338 -16487 -13547 -2812 -19898 -19321 -188 1218 -4109 -5063 -4803
7347 -4803 3576 8119 10020 9133 5666 11931 18820 18438 -2480 -6608 -809 -7337 813 5540 844
7332 844 2897 8837 12492 7118 -8219 -13874 -16924 -9799 -387 10046 7644 5439 -1366 -11030 -12282
7317 -12282 -7163 7741 8893 9399 3765 -5128 -9498 -23968 -11843 -5639 -17632 -6547 -10619 -14765
7303 -14765 -4314 -1631 -10338 -762 -11997 2604 5029 -1961 -7940 -1095 -7026 -7341 5108 986
7289 986 -13489 -8358 9404 3159 -16499 -17318 -16694 -22222 -8578 1637 -5 -4709 -1964 6794
7275 6794 12023 18262 1293 -10645 -1936 -401 -3044 -1858 769 -3499 -4 11629 -119 -12411
7261a2411l485R87O395L80r099r59p73J1559M822J2706Q123j5683j3527Q369P330
7246D734P25K475j0972n4n380n486J2933O265o506O034J1195m599n885q520q298
7231a1339L845J565q825N108P82q240O204M377J806l330j487P490J6520r589M527
7216I414o059l081k782J1085M462k161l864j087j0198r181Q084J3901N273j2924
7202H82j5123j0658J0873J7362n39j9547j240J4447k441j0671n87O198Q286J599
7188a159j5619o778J4035q68j9009J0058J2453l31j270P467J0942l003L516r653
7174G81Q22M282J596O140O354N494L200m544k858r463k410r615K100k299k3839
7159b4259O670J2436O023M220J976n607j099J172k806N88n961j6197j1916J4057
$$ plain form
7261 -12411 -15896 -14909 -8514 -8134 -17233 -18192 -18965 -7406 -2584 10122 18245 2562 -10965 -2596 4734
7246 4734 5459 7934 -3038 -3092 -8472 -13958 -1025 5240 -1266 4768 15963 11364 5479 -3041 -11339
7231 -11339 -7494 -5929 -14754 -9646 -8864 -17104 -10900 -6523 -4717 -8047 -9534 -2044 14476 4887 9414
7216 9414 3355 274 -2508 8577 13039 10878 7014 5927 -4271 -13452 -5368 8533 13806 882
7202 882 -14241 -24899 -14026 3336 2797 -16750 -17990 -3543 -5984 -16655 -17242 -11044 -2758 -1159
7188 -1159 -16778 -23556 -9521 -10389 -29398 -19340 -6887 -7218 -8488 -1021 9921 6918 10434 781
7174 781 1603 5885 7481 13621 19975 25469 28669 24125 21267 11804 9394 -221 1879 -420 -24259
7159 -24259 -17589 -5153 870 5090 7066 1459 360 1532 -1274 -686 -6647 -22844 -34760 -20703
7145b0703R171O478r51N903l44N833Q131O275j0022j2621j1615J7371k181j2799
7131a2074j2255l621P229J0562M511j107Q782m204n061M26k518Q709k282M988
7117B085l832m627m389L469P529n047l290n501M020R647O99L843L583n093M304
7102G400K931n368j2861j2795o089J209J9957M374m841M207Q550oJ2556o12o228
7087A2384r959m877k233R267n094m374O523m571o365O660M679R30M595L777j1133
7072B09k184L940p66n105J991L765m987O300o119N889l084j4580r475O333R535
7057h338J1417j0530J130o557k1605N43J6705J5365Q557n909o000m664J0357l642
7043c171L282m19k1590p888J6153J4863j2606l117O579M098r17m7l111N77P399
$$ plain form
7145 -20703 -11532 -5054 -6005 -102 -446 5387 13518 19793 9771 -2850 -14465 2906 725 -12074
7131 -12074 -24329 -27950 -20721 -10159 -5648 -6755 2027 -2177 -7238 -6812 -9330 -621 -2903 2085
7117 2085 -1747 -6374 -10763 -7294 235 -4812 -8102 -13603 -9583 64 763 4606 8189 3096 7400
7102 7400 10331 4963 -7898 -20693 -26782 -25573 -5616 -1242 -6083 -1876 6674 6668 19224 18612 12384
7087 12384 2425 -2452 -4685 4582 -512 -4886 1637 -2934 -9299 -2639 2040 2970 7565 11342 209
7072 209 -1975 1965 1199 -3906 -1915 1850 -3137 3163 -2956 2933 -151 -14731 -24206 -17873 -8338
7057 -8338 3079 -7451 -6321 -12878 -34483 -33940 -17235 -1870 6687 778 -5222 -9886 471 -3171
7043 -3171 111 -308 -21898 -29786 -13633 1230 -11376 -14493 -7914 -3816 -4733 -4780 -7891 -7314 85
7028H5Q389J63j9727k661J607K829R476k260R96R509o932l723j5381k546Q6N535
7012a4555N109k856L967K545j123l707J4866J1585N421r085j7480K776J6344J1826
6998B5633q043m792P86p583p067K117M668l99M282o270N821k102p824J1200j923
6983H504m23n359o1m618R315Q664j1258l882j209M091q003L600M313M884n859
6968B699K315J0490O638K373k500m912M674k2593P531J0541n581j0823l140j5143
6954a7431o902n6J1149J100j0805M287J541o804j2620L06J0890n752P342J7955
6940e800J0175O574K123L798j1533K507J686j3003o588N236k108j8125j9803J2467
6926c2394K3217J1855j2155j969k115K67q46o854K025L711j525J0515J2370J543
$$ plain form
7028 85 8474 8637 -11090 -13751 -12144 -9315 161 -2099 -1103 8406 1474 -2249 -17630 -20176 -20090 -14555
7012 -14555 -9446 -12302 -8335 -5790 -6913 -10620 4246 15831 21252 12167 -5313 -2537 13807 25633
6998 25633 17590 12798 13584 6001 -1066 1051 5719 5320 9602 3332 9153 7051 -773 10427 8504
6983 8504 8081 2722 2661 -1957 7358 16022 4764 882 -327 3764 -4239 -639 3674 8558 2699
6968 2699 5014 15504 22142 24515 22015 17103 21777 -816 6715 17256 11675 852 -2288 -17431
6954 -17431 -24333 -24389 -13240 -12140 -22945 -18658 -17117 -23921 -36541 -36235 -25345 -31097 -23755 -5800
6940 -5800 4375 10949 13072 16870 5337 7844 9530 -3473 -10061 -4825 -6933 -25058 -44861 -32394
6926 -32394 -9177 2678 -9477 -11446 -13561 -13294 -14140 -20994 -18969 -15258 -16783 -6268 6102 7645
6912G645o753M324P414j7168m353j0141J458J929n429M000J1304M199N037O648
6898A0114o754n926j104j5799k501R400k687J3623K471r823j6599q084P929J0326
6884a5414P094J4948r385m690N238j0856r752O82N538J4539j914j1960j3460n91
6870b9983l245j0960o97K063Q795J4643N083L547q185l126p44M275P883q708q885
6855b8244J082k045K200L661q66J0691p94l213q382K34J6555J0318j163j7041
6841a7007o36J0834R046l728q402m335l359R012J0485J21j401j2248j8964j2751
6827d3333R481J1279R112J2898J4882p494k586R043J615j5598j8027p756J1600
6814a4884l746p173J1732J1331L474j917j2835l611J0337J6632p636j5699p449
$$ plain form
6912 7645 892 5216 12630 -4538 -8891 -19032 -17574 -15645 -21074 -17074 -5770 -1571 3466 10114
6898 10114 3360 -2566 -3670 -19469 -21970 -12570 -15257 -1634 837 -8986 -25585 -33669 -25740 -15414
6884 -15414 -8320 6628 -2757 -7447 -2209 -13065 -22817 -22135 -16597 -2058 -3972 -15932 -29392 -29983
6870 -29983 -33228 -44188 -44885 -42822 -34027 -19384 -14301 -10754 -18939 -22065 -22809 -18534 -10651 -19359 -28244
6855 -28244 -27162 -29207 -27007 -23346 -24212 -13521 -14315 -17528 -25910 -25676 -9121 1197 34 -17007
6841 -17007 -17643 -6809 2237 -1491 -9893 -14228 -17587 -8575 1910 2031 630 -11618 -30582 -43333
6827 -43333 -33852 -22573 -13461 -563 14319 6825 4239 13282 14897 -701 -18728 -26484 -14884
6814 -14884 -18630 -25803 -14071 -2740 734 -1183 -14018 -17629 -7292 9340 1704 -13995 -21444
6801b1444j086N06K830J6460k116k639n51j856m226o60n919J837J5514J8090j2736
6786B004j1637j3322Q414J2785j1046R448j0163k193R698K450o627R678L14m336
6772d533Q989k889R050m056O351j866j2992k34l25M304M660L197J0223R632j014
6757B8497o987J2634K201k9114p925L41J247r891o974R537J4047j56J858J042
$$ plain form
6801 -21444 -22530 -22024 -19194 -2734 -4850 -7489 -8040 -9896 -14122 -14782 -20701 -18864 -3350 14740 2004
6786 2004 -9633 -22955 -14541 -1756 -12802 -3354 -13517 -15710 -6012 -3562 -10189 -511 -197 -4533
6772 -4533 4456 1567 10617 6561 12912 11046 -1946 -2180 -2505 1799 6459 9656 19879 29511 28497
6757 28497 21510 34144 36345 7231 -694 -353 894 -8997 -15971 -6434 7613 7457 9315 10357
$$ [...]
##END NTUPLES=NMR SPECTRUM
##END=
