##TITLE=Analysis number 313520
Compound Code cc 00271
Project Code adrs
Chemist Name stores
##JCAMPDX= 6.0         $$ Bruker NMR JCAMP-DX V2.0
##DATA TYPE= NMR SPECTRUM
##DATA CLASS= NTUPLES
##ORIGIN= Bruker BioSpin GmbH
##OWNER= NMR
$$ XWIN-NMR		Version 3.5
$$ Mon Sep 12 16:36:27 2005 GMT Daylight Time (UT+1h)  MAYBRIDGE\NMR@NMR_250MHZ
##.OBSERVE FREQUENCY= 250.131544655141
##.OBSERVE NUCLEUS= ^1H
##.ACQUISITION MODE= SIMULTANEOUS (DQD)
##.ACQUISITION SCHEME= undefined
##.AVERAGES= 16
##.DIGITISER RES= 18
##SPECTROMETER/DATA SYSTEM= dpx250
##.PULSE SEQUENCE= zg30
##.SOLVENT NAME= CDCl3
##.SHIFT REFERENCE= (INTERNAL, CDCl3, 0, 16.522)
##AUDIT TRAIL= $$ (NUMBER, WHEN, WHO, WHERE, WHAT)
$$ ##TITLE= Audit trail, XWIN-NMR		Version 3.5
$$ ##JCAMPDX= 5.01
$$ ##ORIGIN= Bruker BioSpin GmbH
$$ ##OWNER= NMR
$$ C:\u/data/dgb/nmr/ADRS/9340/pdata/1/auditp.txt
$$ ##AUDIT TRAIL=  $$ (NUMBER, WHEN, WHO, WHERE, WHAT)
(   1,<2005-09-12 16:36:07.55 +100>,<MAYBRIDGE\NMR>,<NMR_250MHZ>,
      <created by zg, POWCHK disabled, PULCHK disabled
       configuration hash MD5:
       62 19 C7 07 E1 42 D1 B7 37 6C 3D D0 77 39 F9 E6
       data hash MD5: 64K
       08 4D 0C A3 B4 D8 97 4D 8B B0 48 7D 5B 71 34 11>)
(   2,<2005-09-12 16:36:18.71 +100>,<MAYBRIDGE\NMR>,<NMR_250MHZ>,
      <Start of raw data processing
       ef LB = 0.3 FT_mod = 6 PKNL = 1 SI = 32K 
       data hash MD5: 32K
       FE 4F 85 45 0C C0 34 92 95 A2 64 69 B2 EF 56 96>)
(   3,<2005-09-12 16:36:20.52 +100>,<MAYBRIDGE\NMR>,<NMR_250MHZ>,
      <apk 
       data hash MD5: 32K
       CB BE C8 D3 06 13 B0 01 C3 A0 24 7A 7D 49 B4 93>)
(   4,<2005-09-12 16:36:21.27 +100>,<MAYBRIDGE\NMR>,<NMR_250MHZ>,
      <abs ABSG = 5 
       data hash MD5: 32K
       D2 54 38 5A 2D 9E A9 7B 78 F7 47 80 59 A8 B2 C1>)
$$ ##END=
$$ 
$$ hash MD5
$$ 7E A1 62 38 7A 78 12 EF ED 8E 26 EB ED 82 B8 26
##$RELAX= 
##$RELAX= 
##$RELAX= 
##$RELAX= 
##$RELAX= 
##$RELAX= 
##$RELAX= 
$$ Bruker specific parameters
$$ --------------------------
##$DU= <C:\u>
##$EXPNO= 9340
##$NAME= <ADRS>
##$PROCNO= 1
##$TYPE= <nmr>
##$USER= <dgb>
##$AMP= (0..31)
100 100 100 100 100 100 100 100 100 100 100 100 100 100 100 100 100 100 
100 100 100 100 100 100 100 100 100 100 100 100 100 100 
##$AQSEQ= 0
##$AQ_mod= 3
##$AUNM= <au_zg>
##$AUTOPOS= <50 >
##$BF1= 250.13
##$BF2= 250.13
##$BF3= 250.13
##$BF4= 250.13
##$BF5= 500.13
##$BF6= 500.13
##$BF7= 500.13
##$BF8= 500.13
##$BYTORDA= 1
##$CFDGTYP= 0
##$CFRGTYP= 5
##$CHEMSTR= <none>
##$CNST= (0..31)
1 1 145 1 1 1 1 1 1 1 1 1 1 1 1 1 1 1 1 1 1 1 1 1 1 1 1 1 1 1 1 1 
##$CPDPRG= <>
##$CPDPRG1= <>
##$CPDPRG2= <>
##$CPDPRG3= <>
##$CPDPRG4= <mlev>
##$CPDPRG5= <mlev>
##$CPDPRG6= <mlev>
##$CPDPRG7= <mlev>
##$CPDPRG8= <mlev>
##$CPDPRGB= <>
##$CPDPRGT= <>
##$D= (0..31)
0 1 0 0 0 0 0 0 0 0.06 0 0 0 0 0 0 0.0002 0 0 0 0 0 0 0 0 0 0 0 0 0 0 
0 
##$DATE= 1126539366
##$DBL= (0..7)
120 120 120 120 120 120 120 120 
##$DBP= (0..7)
150 150 150 150 150 150 150 150 
##$DBP07= 0
##$DBPNAM0= <>
##$DBPNAM1= <>
##$DBPNAM2= <>
$$ [...]
##$SUBNAM7= <"">
##$SUBNAM8= <"">
##$SUBNAM9= <"">
##$SW= 20.6930455092707
##$SWIBOX= (0..15)
0 0 3 0 0 0 0 0 0 0 0 0 0 0 0 0 
##$SW_h= 5175.983436853
##$TD= 65536
##$TD0= 1
##$TE= 295.16
##$TE2= 300
##$TE3= 300
##$TEG= 300
##$TL= (0..7)
0 120 120 120 120 120 120 120 
##$TP= (0..7)
150 150 150 150 150 150 150 150 
##$TP07= 0
##$TPNAME0= <>
##$TPNAME1= <>
##$TPNAME2= <>
##$TPNAME3= <>
##$TPNAME4= <>
##$TPNAME5= <>
##$TPNAME6= <>
##$TPNAME7= <>
##$TPOAL= (0..7)
0.5 0.5 0.5 0.5 0.5 0.5 0.5 0.5 
##$TPOFFS= (0..7)
0 0 0 0 0 0 0 0 
##$TUNHIN= 0
##$TUNHOUT= 0
##$TUNXOUT= 0
##$USERA1= <user>
##$USERA2= <user>
##$USERA3= <user>
##$USERA4= <user>
##$USERA5= <user>
##$V9= 5
##$VALIST= <valist>
##$VCLIST= <CCCCCCCCCCCCCCC>
##$VD= 0
##$VDLIST= <DDDDDDDDDDDDDDD>
##$VPLIST= <PPPPPPPPPPPPPPP>
##$VTLIST= <TTTTTTTTTTTTTTT>
##$WBST= 1024
##$WBSW= 4
##$XGAIN= (0..3)
0 0 0 0 
##$XL= 0
##$YL= 0
##$YMAX_a= 559085
##$YMIN_a= -523147
##$ZGOPTNS= <>
##$ZL1= 120
##$ZL2= 120
##$ZL3= 120
##$ZL4= 120
##$ABSF1= 16.522
##$ABSF2= -4.171173
##$ABSG= 5
##$ABSL= 3
##$ALPHA= 0
##$AQORDER= 0
##$ASSFAC= 0
##$ASSFACI= 0
##$ASSFACX= 0
##$ASSWID= 0
##$AUNMP= <proc_1d>
##$AZFE= 0.1
##$AZFW= 0.1
##$BCFW= 0
##$BC_mod= 0
##$BYTORDP= 0
##$COROFFS= 0
##$CY= 12.5
##$DATMOD= 1
##$DC= 0
##$DFILT= <>
##$DTYPP= 0
##$F1P= 14.0000005364418
##$F2P= -0.99999901652339
##$FCOR= 0.5
##$FTSIZE= 32768
##$FT_mod= 6
##$GAMMA= 0
##$GB= 0
##$INTBC= 1
##$INTSCL= 1
##$ISEN= 128
##$LB= 0.3
##$LEV0= 0
##$LPBIN= 0
##$MAXI= 10000
##$MC2= 0
##$MEAN= 0
##$ME_mod= 0
##$MI= 0
##$NCOEF= 0
##$NC_proc= -2
##$NLEV= 6
##$NOISF1= 0
##$NOISF2= 0
##$NSP= 0
##$NTH_PI= 0
##$NZP= 0
##$OFFSET= 16.522
##$PC= 1
##$PHC0= -79.78542
##$PHC1= 6.168003
##$PH_mod= 1
##$PKNL= yes
##$PPARMOD= 0
##$PSCAL= 4
##$PSIGN= 0
##$REVERSE= no
##$SF= 250.13
##$SI= 32768
##$SIGF1= 0
##$SIGF2= 0
##$SINO= 400
##$SIOLD= 32768
##$SREGLST= <1H.CDCl3>
##$SSB= 0
##$STSI= 32768
##$STSR= 0
##$SW_p= 5175.98343685301
##$SYMM= 0
##$S_DEV= 0
##$TDeff= 65536
##$TDoff= 0
##$TI= <Analysis number 999999
Compound Code 99
Book Reference 9
Project Code 9>
##$TILT= no
##$TM1= 0
##$TM2= 0
##$TOPLEV= 0
##$USERP1= <user>
##$USERP2= <user>
##$USERP3= <user>
##$USERP4= <user>
##$USERP5= <user>
##$WDW= 1
##$XDIM= 32768
##$YMAX_p= 418511645
##$YMIN_p= -58850
$$ End of Bruker specific parameters
$$ ---------------------------------
##NTUPLES= NMR SPECTRUM
##VAR_NAME=  FREQUENCY,     SPECTRUM/REAL,   SPECTRUM/IMAG
##SYMBOL=    X,             R,               I
##VAR_TYPE=  INDEPENDENT,   DEPENDENT,       DEPENDENT
##VAR_FORM=  AFFN,          ASDF,            ASDF
##VAR_DIM=   32768,         32768,           32768
##UNITS=     HZ,            ARBITRARY UNITS, ARBITRARY UNITS
##FACTOR=    0.157963299565203, 1,           1
##FIRST=     4132.6476996994, 0,             0
##LAST=      -1043.33573715361, 0,           0
##MIN=       -1043.33573715361, -58850,      0
##MAX=       4132.6476996994, 418511645,     0
$$ Real data points
##PAGE= N=1
##DATA TABLE= (X++(R..R)), XYDATA
$$ [...]
17503A2621j1647p63k322j2322N88J6132M467p845j4114r570j108o291J1384J1104
17489i686j1399O628J3436p173k767J920K478k663r353j224K851K0752J6924M069
17475B4793q994j2209r777O413Q221j4870j4691l59l54Q6J3493J0779R53N593
17461I077j0604Q789J0797O554k453j0399q395N386J6440K577j5370M705K2165
17448C9269J713m8q014j380J4533P991r716J43L0945O917l596J313j4398j6855
17434D8817o984j6079j7640j9571l69L527L986M367l725j0465N235O728R216M04
17420G447j144l963M944k308j9758l009j96m139J4744O311J1238j339j1026k5819
17406b8017L36J5744J4897J2035j870p409n394l189m152L971m429j539j0283q222
$$ y = [12621, 974, 211, -2111, -14433, -13845, 2287, 6754, -1091, -15205, -24775, -25883, -32174, -20790, -9686, -21085, -14457, -1021, -8194, -10961, -9041, -6563, -9226, -18579, -19803, -16952, 3800, 20724, 24793, 15799, 3590, -6187, 226, 8447, -6423, -21114, -21473, -21827, -21741, -8248, 2531, 3484, 9077, -1527, 7262, 18059, 24613, 22160, 11761, 3366, 8752, 25192, 27769, 12399, 17104, 39269, 40982, 40934, 32920, 31540, 46073, 54064, 44348, 44491, 75436, 82353, 78757, 80070, 65672, 48817, 41833, 25754, 8114, -11457, -11826, -8299, -4313, 54, -3671, -14136, -8901, -2173, 7043, 7447, 6303, 2340, 7284, 4976, -14782, -17791, -17987, -22126, -7382, -1071, 10167, 8828, -2198, -28017, -27681, -11937, 2960, 14995, 13125, 5716, 322, -2867, -7019, -3048, -7477, -9016, -19299, -27521]
17392b7521K0674Q652P04j4656n8K214R565O098j2086o811o976J4882L173j5036
17378a7182n874J0030J2729P48N155k485J971j2039Q340N45j7013p681k661J2942
17364a2475k659M409N314j584j7489R028o125o123J3864L236j1656j6643L739
17351c5164J7301J488j4470P161J4815p067J571J2834K837m504n179j7029o243
17338c1649J669P771O231K3997L3j0293l987j094R661o10k571J092M806J3327
17324A8383m639j4719K133j5363M306P537q774k427r131N886K0426P306q284j6497
17310a3857r33O978J9556K146k325o657j1792j7009R394J0880k748J725j2482
17297a7124j5313m268J0408J0896k438k405L075J1579J2040l752J8164R344j7952
$$ y = [-27521, -6847, 1805, 2509, -12147, -12205, -9991, -426, 5672, -6414, -13225, -20201, -5319, -2146, -17182, -23056, -13026, -297, 451, 5606, 3121, 5092, -6947, 1393, 1938, -15075, -22756, -25417, -12475, -15134, -10725, -5411, -6995, -24484, -15456, -21581, -27704, -13840, -10604, -22260, -38903, -35164, -17863, -16375, -30845, -23684, -8869, -15936, -14365, -1531, 1306, -3198, -8377, -25406, -31649, -29980, -22209, -15978, 8019, 8052, -2241, -6228, -7322, 2339, 1729, -842, 250, 5056, 18383, 13744, -975, 1158, -14205, -9899, -2362, -11136, -13563, -22694, -16808, 3618, 10924, 2640, -13857, -14790, -7812, 11744, 13890, 11565, 4908, -6884, -23893, -14499, -3619, -6367, -4642, -17124, -32437, -36705, -26297, -15401, -17839, -20244, -17169, -5590, 6450, 2698, 20862, 30206, 12254]
17284A2254l054O544J770J9627k761k3292k669N875N719o571j1614j369n802j273
17270f616L109j675l900K745o529M080K6775J2387j7727k2172j3259L236P2M755
17256a4719j1080l836M016p79r29l004j7923N746R80n547J5654J7413m859n558
17242b4425M818J769L466j676q750O483O792P168K502l768j1714l153L394J0710
17228f384L142j3166r034k987l614N571J2440J867J0211K197J3327M508j8551
17215d73j0400O46o216j440L553N401j1749r70J715J6187P478N924R34r063q038
17200f511k630Q674j415p668j8N919M109O533m828M12j5763l23M923O976M127
17185B517N362l581k0050k896P753j2280q105J1788J5190M356Q379k082k0365
$$ y = [12254, 9200, 15744, 17514, 37141, 34380, 11088, 8419, 14294, 20013, 13442, 1828, 459, -5343, -6616, -3507, -5182, -9082, -6337, -12866, -8786, 17989, 30376, 12649, -9523, -22782, -19546, -19474, -14719, -25799, -29635, -25619, -26398, -27327, -30331, -48254, -42508, -41528, -47075, -31421, -14008, -18867, -24425, -19607, -17838, -14372, -16048, -24798, -18315, -11523, -4355, -1853, -5621, -17335, -20488, -17094, -6384, -3242, -16408, -25442, -28429, -32043, -26472, -14032, -12165, -1954, 243, 13570, 18078, -473, -10873, -10227, -16443, -17883, -14330, -8929, -20678, -21648, -19933, -3746, 3732, 9656, 10590, 1527, -6511, -9141, -467, -1882, -9550, -9568, -3649, 460, 6993, 2165, 2577, -13186, -13509, -8586, -1610, 2517, 7879, 4298, -15752, -18648, -10895, -23175, -31280, -19492, -4302, 54, 8433, 6351, -14014]
17172a4014r927J2178J5164P388m10j5703j0387q624J0832K361k700j0050L092
17159b0800P587O114O139j395m586n869J5640n432L52L356J3659n817j3545k054
17145f651L814L412k222o370k146j1287N884k480N145J3070P902n634j35j636
17131F66j1859N15J739J4075K792M121N787N077o287l388N826R359M012k4270
17117H165k4837L450n584j0383j107R585J0704m933P891M960l492j3060q959N318
17103b2282J4840R549jj999J0148k178J719n150q585j1676M929J90P479J2486
17089I469J112m761J3O476L756J0421P61j2221m108J2087M971k453k256J3401
17075C6668M484l283N401P223j1995r559p346k187L880m609J480J589r392q172
$$ y = [-14014, -23941, -11763, 3401, 10789, 10379, -5324, -15711, -24335, -13503, -11142, -13842, -23892, -20800, -13213, -7099, -960, -2355, -6941, -12810, 2830, -2602, -2250, 1106, 14765, 8948, -4597, -6651, -2837, 575, -1647, -8017, -10163, -21450, -15566, -18046, -12901, 169, 8071, 2437, 2302, 666, -11193, -10678, -8939, 5136, 7928, 12049, 17836, 22913, 16626, 13238, 19064, 28423, 32435, 8165, -16672, -13222, -18806, -29189, -30296, -20711, -10007, -14940, -7049, -2089, -5581, -18641, -27600, -22282, -7442, 2107, 2106, 107, 10255, 8077, 9796, 4646, -3939, -15615, -10686, -10496, -3017, 9469, 10581, 5820, 5833, 12309, 16065, 26486, 27247, 15026, 10918, 23005, 27976, 25523, 23267, 36668, 41152, 37869, 43270, 50493, 38498, 28939, 21593, 19406, 23286, 18677, 20157, 21746, 12354, 4182]
17061D182o342p610O134K9126J9215o79K1454J4443J2067K8166L4538L9267P4910
17048B68871Q4028P5012M4989K1655L8555N6279R4563Q6851o1462j35333j35886
17037D38122j08886q5435q0200n2172m4326j6872j1197j7377m740j1467J1692
17026A7142O799L57l229r648l803j831m007J4806O790l54N273l688j1866k0614
17012g873k3157p068P771J3490M770j501M752N61M69p028k6722Q90k305N027J4531
16997b3393O573k247R567J4258p193q440q201J7210J34j0454O149k195n685j204
16983a5121R439l042r73K569j531K239J3304K2916m52r053j2398o430j4173j60
16969a2866J3790L425o133r120l153K986N209J4000q71r5m642o896O263R369p504
$$ y = [4182, -2160, -9770, -3636, 25490, 44705, 44026, 65480, 79923, 91990, 120156, 154694, 193961, 268871, 352899, 427911, 472900, 494555, 533110, 589389, 683952, 770803, 709341, 574008, 438122, 329236, 243801, 163601, 111429, 67103, 50231, 39034, 21657, 16917, 5450, 17142, 23941, 24298, 21069, 11421, 7618, 5787, 1780, 16586, 23376, 23022, 28295, 24607, 12741, -7873, -31030, -38098, -30327, -16837, -12067, -13568, -8816, -8255, -7786, -14814, -41536, -40646, -42951, -37924, -23393, -16820, -19067, -9500, 4758, -2435, -10875, -19076, -1866, -1732, -12186, -6037, -8232, -13917, -15121, -5682, -8724, -9697, -7128, -8659, -6420, 6884, 29800, 29348, 20295, 7897, 1467, -12706, -12866, 924, 4349, -1784, -10904, -14057, -11071, -5862, 8138, 7267, 7172, 2530, -4366, 1897, 11266, 3762]
16954C762k5113n267K419O01P272Q47J2083k107p421j6507q290R342J5955L97
16940a2027M53q69K399M05J880J4348O994o628l351j0087k29j528O92l409MJ3802
16924B849M425j9091j3352k418M117J1710j596q218J00N794Q82J6557l784j3529
16910a5554k905p558Q345M69O434K05J8536m267j8491o911r58J41M152J2742N137
16895d83j7625j5134J2093J1813J5806P92l918k695o69l700p002K193N79Q72q288
16880a5366M484J5847J2242p631j0886k3802r885R347K1193l294m777Q012k670
16867g186l291K543p092m089l919k06P945J3628j683j7284J3535P607J3300O529
16853B0337j1908M025J1659p408j6207j3837J3700Q938m7P75r125j6670q841j681
$$ y = [3762, -21351, -26618, -24199, -23598, -16326, -15479, -3396, -5503, -12924, -29431, -37721, -28379, -12424, -12027, -11574, -12443, -10044, -9639, -7759, 6589, 13583, 6955, 3604, -6483, -6712, -8240, -7548, -10957, -10953, 2849, 7274, -11817, -25169, -27587, -23470, -11760, -13356, -21574, -21474, -15680, -14798, 1759, -2025, -15554, -18459, -26017, -17672, -17203, -10769, -10564, 7972, 3705, -14786, -21697, -22655, -22514, -18362, -5620, -483, -18108, -33242, -21149, -9336, 6470, 7262, 3344, 649, -20, -3720, -10722, -8529, -7950, -7078, -15366, -10882, 4965, 17207, 9576, -1310, -25112, -34997, -25650, -4457, -7751, -12528, -4516, -7186, -10477, -7934, -15026, -19115, -23034, -23240, -15295, -1667, -3350, -20634, -7099, 508, 13808, 20337, 8429, 12454, 24113, 16705, 498, -13339, 361, 9299, 9252, 10027, 902, -15768, -24609, -26290]
16839b6290L848m91n642R247l102N887k967R2R767K047r465p412Q896O503N480
16824c602J679q321j3611r721J876K3731K4200o68j0780j763K6m2J876r92L96
16809D284M614p825q117l212Q887l882j206r984o646J0415J7472M345K221N707
16795A7073m53j8386q793O725j1287R331K326r825r700Q209Q374q464M897J4979
16781E006J426P460k402r211k2133j7403K287O487O733Q989R773J0097n032j9263
16767a7186J0023O178R935M194P022m398j5195L042j871p16J601K731k078q730
16753e448J229M948M714J0478Q91j2326r875j7188N016Q869N5j06J7599p214j1622
16738i980r05M775n787J0110K1545o39j0317j1578J349m63O506J1352M551l835
$$ y = [-26290, -22442, -22933, -28575, -19328, -22430, -16543, -19510, -19418, -9651, -7604, -17069, -24481, -15585, -9082, -3602, -1923, -10244, -23855, -33576, -31700, -7969, 16231, 15563, 4783, 3020, 3046, 3004, 4880, 3888, 4284, 8898, 1073, -7044, -10256, -1369, -5251, -6457, -16441, -23087, -12672, 4800, 9145, 11366, 17073, 16620, -1766, -10559, -3834, -15121, -5790, -3464, -13289, -22989, -14780, -6406, -14870, -9973, 5006, 6432, 13892, 11490, 2279, -19854, -37257, -34970, -28483, -21750, -12761, -2988, 7109, 2077, -17186, -7163, -985, 8950, 13144, 20166, 15768, 573, 3615, 1744, 1028, 2629, 5360, 3282, -5448, -4219, 729, 5443, 15921, 16812, 4486, -5389, -22577, -17561, -8692, -8637, -8743, 8856, 1642, -9980, -10885, -6110, -11897, -1787, 19758, 19119, 8802, -2776, -1427, -1890, 4616, 15968, 20519, 16684]
16724A6684o95R738r599j2269L685O834k5927j5475r877K1874J0611l184o41m080
16710a2321O513N062J343j796M801O235O043J67m602j0752q047L023l29l835r888
16695a8383r897J4278J4483j0954q914J0179l86n281R792J593J0830l9O396j0506
16681C191J941k965J778K254J1144L530k1576o561Q558J0716M551R224j6029L352
16667A3108J0196l496k795j1391k778K379r644m242K0158q593j5669K780R773
16654b14J3282L374j9469l815p297q377J6359Q516n413j0801Q743k334l905k930
16640a4281L804J6610k994K478L929j6214j4864N315J6667L714j515k442m147
16627c940J875O510p42J0456j791j907q985r744m008l339k104J0313J5208n869
$$ y = [16684, 15989, 25727, 16128, 3859, 7544, 14378, -11549, -27024, -36901, -15027, -4416, -7600, -8241, -12321, -5808, -746, 597, -1199, 3602, 9837, 15880, 16047, 11445, 693, -7354, -4331, -4660, -8495, -18383, -28280, -14002, 481, -10473, -19387, -9208, -9594, -14875, -5083, -3490, 7340, 7301, 13697, 3191, 5132, 2167, 3945, 6199, 17343, 20873, -703, -7264, 1294, 12010, 16561, 25785, 9756, 13108, 23304, 19808, 17013, 5622, 2844, 5223, -4421, -8663, 11495, 2902, -12767, -9987, -214, 13068, 16442, -3027, -6842, -14139, -22516, -6157, 2359, -3054, -13855, -5112, -7446, -11351, -14281, -10477, 6133, 3139, 5617, 9546, -6668, -21532, -16217, 450, 4164, 2649, 207, -3940, -2065, 4445, 3703, 14159, 12368, 10461, 1476, -8268, -12276, -15615, -17719, -7406, 7802, 1933]
16613A933l961r208K749k423j28J7992j065K302K630m143j2755L328O601j109
16599B743j5141l346K889K727M664q577J845j0391O948N448m236l270j179J9484
16585F08R873K889k57q75j0507p367r775M100Q426m815k986J0157O874N229P098
16570A8672j2536n721m320j0510l055N137N023J10m059j3624J61P002J6660j0169
16556a1229k2302N663J9173J4321M110j2178k471L162k569q88o856j2243N300
16543a9007J6566N67r76j4443r33J5598J8733m885k3456j8123p344J0037J8238
16530i428J2255k335m89J2811M141j5806Q89j2537j640j0981N555K633l654J4150
16516d436m462j5592N125n533n410r378l677K5295J4171j2863m228O024J0980
$$ y = [1933, -2028, -11236, -8487, -10910, -11038, 6954, 5889, 8191, 10821, 6678, -6077, -2749, 3852, 2743, -12398, -15744, -12855, -10128, -5464, -14041, -12196, -22587, -15639, -10191, -14427, -17697, -18876, 608, 10481, 13370, 13113, 12238, 1731, -5636, -15411, -11311, -2885, -7700, -10686, -529, 6345, 11574, 18672, 6136, 415, -3905, -14415, -17470, -12333, -7310, -7200, -11259, -24883, -24722, -17720, -1060, -11229, -33531, -27868, -8695, 5626, 9736, -2442, -4913, -1751, -4320, -5208, -12064, -24307, -19007, -2441, -1874, -2850, -17293, -18226, -2628, 16105, 11220, -12236, -30359, -37703, -27666, -9428, 2827, 492, 3, 12814, 16955, 1149, 2038, -10499, -12139, -23120, -17565, -14932, -18586, -4436, -8898, -24490, -19365, -24898, -30308, -39686, -43363, -18068, -3897, -16760, -20988, -14964, -3984]
16503c984J7790o411j730r495m011M192j2953m779o18K362M288J916J3855O98
16489A120r045j1756M623J804R579l803P752K38n135m426K0272K179j717m4n775
16474E866j19r663j2528R47M738J1719O346n542N828j899P278n500j0181k998
16460e708q225n345J5635l697J099L680o212M309N961j134r028j8142O366R759
16446a0682n428K153L647R663M536j3823K043L631J0709M84K414l711j3224K72
16432g316N439r611N335Q183j854p864K724J5766M96m07l164J825k369L812P607
16417A8602j2117j9611K225O094P100J4614M850M299j3245K480J0736J717r58
16404B6786N462j1315j4433m516J0736P800n349m658q902M965m384m099J760P167
$$ y = [-3984, 13806, 7395, 5665, -3830, -7841, -3649, -16602, -21381, -21999, -19637, -15349, -13433, 422, 1120, -7925, -19681, -15058, -13254, -3675, -7478, 274, 512, -4623, -9049, 11223, 13402, 11685, 11641, 5866, 5747, -3916, -16444, -15497, -10759, 960, 7306, 1764, 7592, 5693, 12971, 7471, -2710, -5708, -13933, -19278, -3643, -7340, -6241, -2561, -8773, -4464, 1497, 363, -8665, -26807, -20441, -10682, -16110, -13957, -10310, -647, 3889, -9934, -7891, -4260, 6449, 6933, 9347, 5636, -7588, -7316, -1877, -11488, -6153, 2030, 176, -7688, -4964, 10802, 11298, 10891, 7727, 9552, 7183, 10995, 18602, 6485, -13126, -10901, -4807, 2293, 16907, 21757, 26056, 12811, 15291, 26027, 27744, 26786, 32248, 20933, 6500, 1984, 12720, 20520, 15171, 10513, 1611, 6576, 2192, -1907, -147, 7020]
16390G020O404J4375k71j4573j9969q63p766r997j516m634Q29L180L523M295P751
16375a2212Q913R179J67j2923J0516J8166n748j3700o767m368k736m348Q034R576
16361A749K271o832r269l213J3207R434J1669O567j7818k338k817L549j643j921
16347B595O137J1616l32j3556L010M703n590J125J086n460j0179k24Q750J9530
16333B3211j718j4884m872j2M715n868O913M376q160Q892N591j3917m447j8785
16319a8965l651j43Q726J3765J1902M478O911j3109q431j4728r5J971M690J2564
16305E885N179o331l562k058j477k388j611J609o385r80q03K505J2793J5354Q707
16290B6437Q256K635J977k848j9429q313N491k053p435m233n114j6614J6101r73
$$ y = [7020, 13424, 27799, 27528, 12955, -7014, -7877, -15643, -25640, -27156, -31790, -30961, -27781, -24258, -19963, -12212, -3299, 5880, 6047, -6876, 3640, 21806, 16058, 2358, -4409, -8777, -11513, -15861, -7827, 1749, 4020, -2812, -12081, -15294, -2087, 7347, 19016, 25583, 7765, 5427, 2610, 6159, 4516, 2595, 8732, 20348, 20016, 6460, 9470, 14173, 8583, 9708, 10794, 5334, -4845, -5069, 3681, 23211, 21493, 6609, 1737, 1725, 6440, 572, 7485, 11861, 3701, 12593, 18184, 4267, -180, -18965, -22616, -22759, -14033, -268, 11634, 16112, 23023, 9914, 1483, -13245, -13340, -11369, -6679, 5885, 11064, 4733, 1171, -887, -2364, -4752, -6363, -4754, -11139, -12119, -12922, -10417, 2376, 17730, 26437, 34693, 37328, 39305, 36457, 17028, 8715, 14206, 12153, 4718, 485, -4629, -21243, -5142, -6115]
16276f115M45O218N889j549j52n565p943J2836P159J1692P53r787j0871l454n674
16261f118j3298N440k784p528n861n0k860K35P187K081Q121J3887J4183o474j8109
16246a1948j1628J888K3991J6048K508j2502j2976j6568N542J7148p875O54L093
16233b625M693M616m52n085q359M53r82K60n926R051M716M269n305J035K645j0750
16217g746k330m164n04k334K0305O433k186k538k4737j6148l190J4607K4342R382
16203I192P153N445l488j6984r962p628r43J792k944n449M560R184M474J388l714
16188g924j8372o187Q072O888j518L158J1348K182Q701j4128j2283L663O555P835
16174b010O592Q78p870l670N261O060r213p682J900L558O084j5305j5006J3388
$$ y = [-6115, -5670, 548, 6437, 4888, 4736, -829, -8772, 4064, 11223, 22915, 23668, 13881, 3010, -444, -6118, -19416, -13976, -16760, -24288, -30149, -30199, -33059, -32824, -25637, -23556, -15435, -1548, 12635, 6161, -11948, -23576, -21688, 2303, 18351, 20859, 8357, -4619, -21187, -15645, 1503, -6372, -5718, -2625, 2068, 6684, 6232, 1147, -7212, -6759, -7741, -7481, -13407, -4356, 360, 4629, -676, 359, 3004, -7746, -10076, -14240, -14744, -17078, 3227, 9660, 7474, 4936, -19801, -35949, -39139, -24532, -190, 9192, 16345, 21790, 18302, 1318, -8644, -16272, -17215, -15423, -18367, -23816, -19256, -10072, -5598, -4210, -7924, -26296, -32483, -24411, -17523, -19041, -15883, -4535, -2353, 6348, -7780, -20063, -16400, -9845, -2010, 4582, 5460, -2410, -6080, -819, 5241, -3972, -11654, -9754, -6196, -112, -15417, -30423, -17035]
16160a7035O659O831k825j2740j8477k829n115l601K3802J8825J8081R05j155
16147A1326j8332M2m662Q196P525N025J9037q699r732O093j4746j5705Q916J8863
16133A3147L195q594j2192J0658J2336l180k6146j4057L359Q005J2121o398o949
16120a4695q36R661J6544n573M492K404q89n522K738o445q777o713M83n534j55
16105a8817K098M727J8207L2247m17j1738j3823J600m686J747N328K240J1603
16092C0316J7271m933j667Q733Q857K6551K772M111J0163K3677L6240K5975r926
16079A78140J5478N058L4051M2130O608k6065m194J7676K1210J0788K117l737
16067B99260n535j4447O82k315k6586k1374j9014j0342j7864k4541k2616k2678
$$ y = [-17035, -10376, -3545, -6370, -19110, -37587, -40416, -45531, -49132, -25330, -6505, 11576, 12481, 11326, -7006, -6964, -11626, -3430, 4095, 9120, 28157, 19458, 9726, 15819, 1073, -14632, -5716, 13147, 16342, 7748, -4444, 6214, 18550, 15370, -10776, -24833, -21474, -13469, -1348, -7746, -14695, -15531, -5870, 10674, 5101, 9593, 11997, 11108, 5586, 8324, 1879, -6898, -13611, -13128, -18662, -18817, -16719, -11992, 6215, 38462, 38045, 26307, 12484, 14084, 9398, 11145, 16473, 18713, 30316, 47587, 42654, 40987, 49720, 58577, 85128, 87900, 92011, 102174, 125851, 162091, 188066, 178140, 193618, 198676, 232727, 274857, 281465, 255400, 251206, 268882, 290092, 300880, 302997, 299260, 293725, 279278, 279960, 277645, 251059, 229685, 210671, 200329, 182465, 157924, 135308, 112630]
16055A12630j559j0825o794j1228j2259n388K674j8035k5114P22L310m230N382
16042B9286N382k605j5612j6004p188j674k312O529r013q01J1053Q492k97Q539
16028A3775O501m276j8357j3516r030j1650n012J3559L6682q077q428P051M835
16015D057Q733n081k865J4126O700n106k8691p824N017J4409L492N327n183M896
16001A2007J3843j952j0141k3424j1898J142m003J1159k80M050Q607J4448r480
15988D078l943r325J192M264P542Q88p300j5055j6040M765J4052M660N604m118
15974h736j515J0874J8575O505j3843q712k210j1348n591J473l645J2232Q448
15961B507l891J3496K450k165j051k2335L125K500l772N118p656q96J3914l882
$$ y = [112630, 111071, 100246, 93452, 82224, 69965, 64577, 67251, 49216, 24102, 24824, 28134, 23904, 29286, 34668, 32063, 16451, 447, -6741, -8415, -10727, -4198, -13211, -14012, -2959, 5533, 5236, 13775, 20276, 16000, -2357, -15873, -24903, -36553, -41565, -28006, 8676, 599, -7829, -778, 4057, 12790, 7709, 4844, 18970, 25670, 20564, -8127, -15951, -10934, 3475, 6967, 12294, 7111, 12007, 25850, 23898, 13757, -9667, -21565, -20423, -24426, -13267, -13547, -9497, -890, 13558, 4078, 135, -9190, -7998, -3734, 3808, 4696, -2604, -17659, -33699, -28934, -14882, -10222, -4618, -8736, -10251, 623, 19198, 25703, 11860, 3148, 938, -10410, -16001, -14528, -18173, -5941, 2507, -1384, 12112, 14562, 12397, 11346, -10989, -7864, -5364, -9136, -4018, -11674, -12570, 1344, -2538]
15947b538L631q80o904J305J1766L881P484R66j3926p622j4913n040M310J0326
15933h154L699P949L888L45j480L084N961R360j826M178j9270p454J4632M328
15919A9240J812P089n238j6704p625J5936n546j2563j7277k923J247R59o268j4933
15905d2794M825J0620L670J3096J1457j1059k5120J3013J0682j1903j999L738
15893b1774K207J4764P266N275L088m197j5553J4397P030K109n561m545r350J0899
15879F055J4698m515o571K605K225l041o787r674j0498K357K584Q970Q800j0925
15865c717r439j36Q89Q382R134k49k500P621l445n560R925o559r339j2554J0904
15850f643j1595L037Q113O467K251j0504O185j337J2389P919o277N193K541j5514
$$ y = [-2538, 1093, 213, -6691, -5386, 6380, 10261, 17745, 18711, 4785, -2837, -17750, -22790, -18480, -8154, -4455, 3494, 7382, 7727, 6247, 9331, 15292, 24652, 22826, 27004, 7734, 280, 14912, 19240, 21052, 28141, 22903, 6199, -1426, 14510, 8964, -3599, -20876, -23799, -22552, -21593, -27861, -42794, -37969, -27349, -23679, -10583, 874, -10185, -35305, -22292, -11610, -23513, -25512, -21774, -19567, -4803, 2463, 7738, 10826, 6629, -8924, 5473, 12503, 14612, 9051, 4506, -4844, 6055, 20753, 16238, 9667, 12272, 14497, 11456, 4669, -5005, -15503, -13146, -10562, -1592, 7208, -3717, -13156, -13292, -12403, -4021, 5113, 4864, 2364, 9985, 6540, 980, 10905, 4346, -4993, -17547, -6643, -18238, -15201, -7088, -621, 1630, -8874, -2689, -4026, 8363, 16282, 10005, 15198, 17739, 2225]
15836B225k0191J896P869M253j943N275O12o337k601R621j235l503O349j2775
15822a0485j7686N834N554K460J0967P243k0729M277J4766J24l282r32N181r913
15808f621k494k226J0520J0305j1593M94k78j4132R040M710J6703n153p904K55
15794A626J0139m277J774p554N459r148p388K000N810n2p054n051p200L864O235
15779a0817n24j038L043J7160j3485J565Q092n746r676J1767J2016j424q563K49
15765B619m410r026m991N0l619M050J3759Q198l251j0811j0493N446R207K623
15751f49R13o037O75O202N348j532m677j671l025l931J0603J1487p816j7246q647
15736b0003J6911j906l048m459J988J4535Q692k324m646j289r650j3880K241r756
$$ y = [2225, -17966, -16070, -8201, -3948, -5891, -616, -4, -6341, -8942, 679, -556, -4059, 2290, -10485, -28171, -22337, -16783, -14323, -3356, 3887, -16842, -12565, 2201, 2325, -957, -1889, 3292, -6621, -9115, -11341, -821, 9484, -2109, -1615, -1893, -16025, -6985, -2275, 14428, 9275, 1371, 1626, 11765, 7488, 9262, 1708, 7167, -1981, -9369, -7369, -1559, -1611, -8665, -13716, -20916, -17052, -10817, -11341, -12379, -9336, 7824, -5661, -4096, 3996, -1750, -11426, 341, 12357, 10933, 2370, 2619, -1791, -10817, -15808, -15758, -19377, -15327, -1568, 6630, 3379, -7432, -17925, -12479, -3272, -649, 264, -5773, -5098, 1104, 6452, 4920, 243, -1428, -4453, -8384, 2219, 13706, 5890, -11356, -20003, -3092, -4998, -8046, -12505, -10517, 4018, 12710, 10386, 5740, 4451, -5199, -19079, -16838, -26594]
15722b6594o584O38J5958J278P812O223r240p001Q614J904J0198J8391q411M982
15708A8168Q737Q388j1495j1616J3469o725k710m795r985K120Q377K129j2698
15695A364n365J470N461O736j0901P351L213j2070r375O12j0984R74q762K846
15681b7430Q626l984J4163J9357N010k635m310K92j0131p972k900r31p152K267
15667a7730L4M080J6632l812o571J0153J7654q057j6921q60n175L092J803l663
15653i341Q314k803J3138j099Q380L655q049j7586n969l369Q045J1637m862k989
15639b898j0698o448l412L719L689n156K757M809j531M647M067M505p614r257
15625a8821k670o569k63n486K778Q233n754k141n574k72k670J62J2681J0600J72
$$ y = [-26594, -33178, -32540, -16582, -15304, -7492, -1269, -10509, -17510, -8896, -6992, 3206, 21597, 13186, 18168, 26905, 35293, 23798, 12182, 25651, 18926, 16216, 11421, 1436, 3556, 11933, 14062, 1364, -4001, -2531, 2930, 9666, -1235, 6116, 9329, -2741, -12116, -11504, -22488, -21514, -30276, -27430, -18804, -22788, -8625, 10732, 15742, 13107, 8797, 9089, -1042, -9014, -11914, -12845, -19997, -17730, -17696, -13616, 3016, -796, -7367, 2786, 20440, 12383, -4538, -5398, -10573, -7481, -5678, -9341, -1027, -3830, 9308, 8209, 16589, 20244, 12195, -5391, -11360, -14729, -6684, 4953, 91, -2898, -13596, -20044, -23456, -19737, -16048, -21204, -18447, -13638, -15169, -10522, -6455, -1950, -9564, -18821, -21491, -28060, -28323, -33809, -31031, -22798, -28552, -30693, -36267, -36539, -39209, -39047, -26366, -15766, -15594]
15610a5594J4971J731O731Q056L797n779j0157j4231Q889j3687r013J745K713
15597a9828J3015Q8k471j837o026l4M527O406J6095l460j8537l79J1289j6667
15583a7819P889j137j3165n744L079L380n379P360J2972J0447j6238p089L985
15570a7459J1067k358J319j316k889N381p615p658n939J1868P660K0542m676j9542
15556a1615j0617J9532J538P279M33j8700n326R59K3752K793j3188p204l021J1024
15542b361K582O072r457M838j0829j3687m518J2769J2243j256o255J0954p760
15529f665q728J985n895j7195q533m590R923O667j0910m40K1687R512l284Q426
15515h040P15j4792p350L65J7114k354j1149O075J6298J4745L737L629r508j2231
$$ y = [-15594, -623, 1108, 7839, 15895, 19692, 13913, 3756, -10475, -1586, -15273, -24286, -22541, -19828, -6813, -6725, -9196, -11033, -17059, -17093, -12566, -6160, 9935, 6475, -12062, -12441, -1152, -17819, -9930, -11067, -24232, -29976, -26897, -23517, -28896, -21536, -8564, 1883, -14355, -21444, -17459, -6392, -8750, -7431, -8747, -11636, -6255, -13870, -21528, -27467, -15599, -7939, 12603, 7927, -11615, -22232, -2700, -1162, 6117, 6550, -12150, -17476, -16517, 7235, 10028, -3160, -10364, -13385, -2361, 221, 6293, -3164, 1674, -9155, -22842, -27360, -14591, -2348, -3604, -9859, 1095, -6665, -15393, -13408, -19303, -36498, -45031, -49621, -39698, -33031, -43941, -44381, -22694, -13182, -16466, -8040, -7325, -22117, -29467, -29102, -11988, -14342, -25491, -19416, -3118, 11627, 15364, 18993, 9485, -2746]
15501b746M173M974L181n978Q588r917j0604K690O973M145N487N15p133l761j5493
15486a4906p715k310P97J3130O178m244j327R200Q910n150j5768o858n012R972
15472a5103O689K596j2486j3311j762Q553m3O915J3264J1388p224l749n967l757
15458a3997p776O945o768j678K666K519l757k157R287l241m377J994n476J912
15444b3904M260q555o636O626O915P232j565q02r94o443P801M063p995R58J8354
15429f85J4568L022j1244j6679p318N123o498R227l399r04K0019N547j5849r77
15415f047O070o193n933j789K640O477K0804K408l628m338p343J793n144m054
15401d277n680l124J1084K3j1308k83J1306j3312J6181J6557L254q446Q366O308
$$ y = [-2746, 1427, 6401, 9582, 3604, 12192, 2275, -8329, -5639, 1334, 5479, 10966, 11481, 4348, 587, -14906, -22621, -24931, -24134, -11004, -4826, -9070, -10397, -1197, 7713, 2563, -13205, -20063, -25075, -15103, -8414, -5818, -18304, -31615, -33377, -24824, -24867, -17952, -4688, 6700, -524, -4273, -10240, -13997, -21773, -14828, -21596, -23274, -20608, -18089, -21846, -24003, -14716, -17957, -22334, -20340, -25816, -23904, -19644, -28199, -34835, -28209, -21294, -14062, -15627, -16429, -17423, -23866, -16065, -12002, -19997, -19039, -685, 13883, 16905, 5661, -11018, -18336, -13213, -19711, -10484, -13883, -14787, 5232, 10779, -5070, -6047, 23, -6170, -12103, -13892, -11252, -4775, 16029, 18437, 14809, 10471, 3128, 4921, -223, -4277, -9957, -13081, -1997, -1974, -13282, -13565, -2259, -15571, 610, 17167, 20421, 11975, 20341, 26649]
15387B6649o176o438p278o698j0558p847J0027J1131j274J6690n339k0827j6691
15374b4629J990K433o537p277K501R028O042L443p461j0372L25k425K1362J5472
15360C895Q533p63L154L120j7743K90M328j0787K0085N781q166k0910J034J6764
15346H615j9109p360J4406J4744L484N903j6104j8315p434J0349J3915M779K901
15333A0774L938n412o95J90q345j7657O469N987N297k042O780M933q875o775L703
15318a730J3262j257j4875q988j827o526N613Q596M623P434k732j1017o035Q799
15304f660P799o960N457o324L737j993L304L031L489L022p560r89J493K824k396
15289A274O779O935N539j8276k1842q675R899J4387L534M559J2382o147j9304
$$ y = [26649, 20473, 14035, 6757, 59, -10499, -18346, -8319, 2812, 1538, 18228, 12889, -7938, -24629, -22639, -20206, -26743, -34020, -31519, -22491, -16449, -13006, -20467, -30839, -30514, -32939, -11577, 3895, 12428, 11665, 14819, 17939, 196, 486, 4814, -5973, 14112, 19893, 11727, -9183, -8149, 8615, -10494, -17854, -3448, 11296, 14780, 20683, 4579, -13736, -21170, -10821, 3094, 7873, 10774, 14712, 9300, 8605, 8795, 450, -17207, -10738, -4751, 546, -1496, 5284, 10217, 1342, -5433, -1730, 11532, 10275, -4600, -13588, -15415, -21941, -16328, -7732, -3109, 4325, 1593, -9424, -15459, -6660, 1139, -5821, -364, -6688, -2951, -4944, -1640, 1391, 4880, 7902, 342, -647, 846, 3670, 1274, 8053, 14988, 20527, 2251, -19591, -28266, -18367, -3980, -446, 4113, 16495, 10348, -8956]
15276h956m047K316p156O703P699N615P191j4159j1702J0590J4088J716K245j3594
15262a451p730M705Q302j0132J888o325k4892r13J0736J5330K2498o576j9282
15249a3842k706Q051P575K671n017m432o248k832k437J3940J9881N79k1846k4026
15235c0689j7427L240J0847Q635K9862R909j1634j3186O782O740k316k435n27
15222b199r948l316M771J664r359k954l993j624l502J685L112J4108Q967L106
15208E18r413Q945j912r665L271L515L712Q964k563j4341n850p32K69n403m185
15193b4870J396J594m164j441o303N389N208J129L482J4362P362k0937n362j1559
15179c4714j0126L064J5811J4718O880p882M664O737K240O963j0114q932j9445
$$ y = [-8956, -13003, -10687, -17843, -11140, -3441, 2174, 9365, -4794, -16496, -5906, 8182, 9898, 12143, -1451, -9181, -4476, 3826, -6306, -4418, -10743, -35635, -36548, -25812, -10482, 12016, 5440, -13842, -16548, -8497, -922, 1749, -3268, -7700, -13948, -16780, -19217, -5277, 14604, 15183, -6663, -30689, -48116, -44876, -34029, -25394, 4468, 14377, 2743, -10443, -3661, 3079, 763, -1672, -2199, -12147, -15463, -10692, -9028, -18387, -21341, -25334, -26958, -30460, -28775, -25663, -11555, -2588, 518, -8895, 50, -1862, -11527, -8256, -4741, -1029, 7935, 5372, -8969, -14819, -15551, -15282, -20685, -24870, -23474, -21880, -26044, -27485, -33788, -28399, -23191, -22062, -18580, -4218, 3144, -17793, -23155, -34714, -44840, -41776, -25965, -11247, -4367, -12249, -7585, -848, 1392, 8355, -1759, -10691, -30136]
15166c0136k4389J2611J8239N615j527L753N726J5250n034q140P234J2474r090
15153B586j2882q070J1666J3722j2198P52P357o006j815N536R021m251l766j1802
15139a0150m735l020M279L0146O722k797k0399J2056P192p894N346r069o422m109
15125b854q370j567J9003J484j0039O338k187K627M997j7814p948M651J1684J4216
15111A4221j300j016j4274k0099R2L562M998J047j800r89O417P703n993J873J3780
15096H222J1610p292o046M155j0457l987q191O418M334j5558k949J0154n781p955
15082b3323j018P676r90m940P122m518n603o010N344J6117k405r276J3191P144
15068a489L911M472N935n050m817N310o633r590J4347m834j0353R993J8323q096
$$ y = [-30136, -54525, -41914, -23675, -18060, -19587, -15834, -10108, 5142, 108, -8032, -798, 11676, 2586, -10296, -18366, -6700, 7022, -5176, -4424, 2933, -3073, -4888, 648, 9669, 5418, 1652, -10150, -14885, -17905, -13626, 16520, 23242, 20445, 46, 12102, 19294, 11400, 16746, 7677, 1255, -2854, -11224, -12791, 6212, 7696, -2343, 3995, 1808, 4435, 9432, -8382, -16330, -11679, 5, 14221, 12921, 11905, -2369, -22468, -22376, -18814, -13816, -12769, -14569, -15558, -9141, -1438, -7431, -5558, 8222, 19832, 12540, 6494, 10649, 192, -3795, -11986, -5568, -1234, -16792, -19741, -9587, -15368, -23323, -24341, -16665, -17655, -22595, -15473, -19991, -25594, -31604, -26260, -10143, -12548, -21824, -8633, -1489, 2422, 6894, 12829, 7779, 2962, 8272, 1639, -7951, 6396, 1562, -8791, 1202, 19525, 11429]
15054A1429j2624L323j1574j2868q397L774K1298Q065l814P112k712p844M987
15041A55l179l600J2167k409L307J2463M582k796l063q620j1538j195o679j420
15027a1825N388k389q693J1412m861n610k640p934O236L076m480J1259J0406J9600
15013A8945m733j4064j5585k07q929R026p657m40J4995N736R350K144K130j988
14999H723l816j2131o974L204j0777J1430P614Q178j703o006R260k2j3266j4744
14985b1030n826Q477J4666O885p212r341m215K085J6286o60l399p506k216J3062
14971E6R492r968J973j2191n823J518R041N327J064o219k1492J341K2302q646
14957a2225P83M001O845K102J0813J8678r917p07r664n431p692j7616j791J8159
$$ y = [11429, -1195, 2128, -9446, -22314, -30711, -26937, -5639, 2426, -1388, 5724, 3012, -4832, 155, -3024, -6624, 5543, 3134, 6441, 18904, 23486, 20690, 17627, 9007, -2531, -3726, -10405, -11825, -6437, -8826, -17519, -6107, -10968, -16578, -19218, -27152, -20916, -17840, -22320, -11061, -655, 18945, 14212, 148, -15437, -15644, -24573, -15547, -23204, -23644, -8649, -2913, 6437, 8581, 10711, 8723, 4907, -7224, -14198, -10994, -21771, -10341, -2727, 5451, 3748, -2258, 7002, 6980, -6286, -21030, -26856, -18379, -3713, 3172, -4040, -13381, -17596, -15511, 775, 115, -3284, -10790, -13006, 56, 9548, -420, 1553, -10638, -16461, -14943, -5902, -575, 489, -5730, -27222, -25881, -3579, -12225, -11442, -7441, -596, 1506, 12319, 30997, 21080, 20373, 10709, 5278, -2414, -20030, -21821, -3662]
14943c662M840l576M16N084o138k156q087j4389M040R359J2775L957n009j3177
14929a5723L389k104N93r689J825O258LQ221l304M463J762M743J667o057J2288
14914H335k73n850N654J786j4784L445N847n010n442M849L426j452j957j8169
14900a9595k986K944J2511K641O504P279o758o212m891m165J498L775M352O950
14886C847J2140m229l790j8962j514O736J994j620j3945p189K0157J8767k059
14873A0333l79O256j1026j1653j1344J6889J9429P470j9303j7728p257m269J4745
14860g837R075m215L523M882n373L154J0514r411k8680p538L806L45m419r53J8736
14845a4391J7897K896O840j2167q626m905J0188J4043l263j7927J433J2623R7
$$ y = [-3662, 1178, -2398, -1982, 3102, -3036, -5192, -13279, -27668, -23628, -14269, -1494, 2463, -2546, -15723, -12334, -14438, -13845, -23534, -21709, -15451, -15448, -7227, -10531, -6068, -4306, 437, 2104, -3953, 8335, 8062, 2212, 7866, 9652, -5132, -1687, 4160, -850, -6292, -1443, 1983, 531, -1426, -19595, -22581, -19637, -7126, -4485, 2019, 9298, 2540, -3672, -8563, -12728, -11230, -7455, -3103, 3847, 15987, 11758, 7968, -10994, -12508, -5772, -3778, -5398, -19343, -26532, -6375, 12392, 10333, 9954, 16210, 5184, -6469, -17813, -924, 18505, 25975, 6672, -11056, -18313, -22582, -7837, 1238, -2977, 546, 5428, 55, 3209, 13723, 4312, -24368, -31906, -28100, -27755, -32174, -33127, -14391, 3506, 6402, 13242, 1075, -7551, -12456, -2268, 11775, 8512, -9415, -7982, 4641, 4738]
14832D738Q46K374o014M054J0824p403q899j1609j1214n822j941j1270O862J2683
14818b1791J9243m55K311k156M878Q95l690m274J976j1013J477K413J553P84r63
14803h812n46l95O678J595L987k772j1227J2966m650P9K352J444p768k0364L92
14788b7041J9914J9276K563n514o315r411R98m485j0609j2502J93J3848J1111
14775g974P48N23J6164r250o750Q964M207k917M720r747r957m026M673Q438q197
14760a0381j4462n81n291Q003J9120q651r97R194P60k503n293p047j225K595K524
14745a4235J2490R865k465p042p070M152J1342J2114p976r53R551K507M354k943
14731B3691o193q032M899K645j406P422n067j7524j1938r463L970J7831q86m957
$$ y = [4738, 5584, 7958, 1944, 5998, 16822, 9419, 520, -11089, -22303, -28125, -30066, -41336, -34474, -21791, -2548, -3003, -692, -2848, 2030, 2925, -765, -5039, -3063, -14076, -12599, -10186, -8633, -7849, -8812, -9358, -9753, -3075, -1480, 2507, -265, -11492, 1474, -3176, -3097, -745, 699, -7069, -27433, -27041, -7127, 12149, 14712, 9198, 2883, -6528, -5530, -10015, -20624, -33126, -32933, -19085, -7974, -7226, -6703, 9461, 211, -6539, 2425, 6632, 3715, 8435, -1312, -11269, -15295, -10622, -2184, -10381, -24843, -25424, -30715, -22712, -3592, -12243, -13240, -4046, -3286, -5789, -11082, -18129, -19354, -16759, -14235, -1745, 8120, 5655, -1387, -8457, -4305, 7037, 19151, 11175, 10222, 19773, 22280, 26634, 23691, 17498, 9466, 14365, 17010, 15604, 23026, 17959, 435, -11503, -20966, -16996, 835, -51, -5008]
14717e008M857k473J6163o069n031n703k177J918J8808j007r523j2301L365j0800
14703a4981n768O665q946n07J1875J5525j62n308Q968m079L726j2268n304j527
14689a2091K653j787n586J271M099R2J0409L019p59p280K37O697J0944q218N333
14674I033k525n325L860m504N75N875O494m828n184M603m335m589N584l034L541
14659E241j99J7458Q507O736P78J643o556l805j4339j6599j2530N765L400K683
14645a817r650j6115J0200Q198J866j375N612O859O521n63j4974J231O867P102
14631I962Q533j4097k0634R019J0843L163l344j1731j351p409K446r601q557J9828
14617a2930K452m931K684Q176j368j1400J395q67j8681R231J4435R275Q041J188
$$ y = [-5008, -151, -2624, 13539, 7470, 2439, -3264, -5441, -3523, 15285, 14278, 4755, -7546, -4181, -14981, -20749, -14084, -23030, -23537, -11662, 3863, 3701, -1607, 7361, 3282, 7008, -5260, -10564, -12091, -9438, -11225, -16811, -15540, -11441, -11349, -940, 2079, 1320, -5960, -5723, 974, 11918, 3700, 9033, 6508, 1183, 5043, 539, 1114, 6989, 13483, 8655, 3471, 8074, 3739, -850, 4734, 1700, 5241, 5042, 22500, 31007, 37743, 38521, 40164, 33608, 29803, 15464, -1135, -13665, -7900, -4500, -1817, -11467, -27582, -17382, -9184, -7318, -8693, -3081, 3778, 10299, 9736, -5238, -4007, 2860, 9962, 18495, 4398, -16236, -7217, 3626, 6789, 3445, -8286, -9637, -17046, -14600, -24201, -32758, -12930, -10478, -15409, -12725, -4549, -5917, -17317, -15922, -16789, -35470, -26239, -11804, -2529, 5512, 6700]
14603F700j060L649R77o469p986J533O272j0085K865P525K324J3915M656j5215
14589I601j3392j887R39K589J2803M902J077P35j3444k7163j2484N372N654R895
14575a4803P376j3385j3943K461k355J3351P962J1096L022J0170J6900L616j5151
14562A6317j2410M862l480N229n318l037l6J1254o07m677l522k867P25l440j3071
14547a4078p717O400K66n899q07j3965J8389J4726j822P799j162j1063l22L786
14533e469O947P664l929K280p507j1574K497J2495L538k022m735l203l028K431
14519c615O523m654L403j3176j2854J437j576O959Q405J1442j491Q561j72o484
14505B708j0943J8288j581q550R814q515j3648K704j810L251J3171O9j26k320
$$ y = [6700, 5640, 9289, 10266, 3797, -4189, -2656, 3616, -6469, -3604, 3921, 6245, 20160, 24816, 9601, -3791, -5678, -4739, -2150, 10653, 15555, 16632, 17367, 3923, -23240, -35724, -30352, -24698, -14803, -7427, -20812, -34755, -32294, -34649, -21298, -13336, -2240, 782, 10952, 27852, 31468, 16317, 3907, 8769, 5289, 10518, 5200, 2163, 2127, 13381, 12774, 8097, 4575, 1708, 2433, -1007, -14078, -21795, -15395, -15129, -21028, -21835, -35800, -17411, -2685, -4507, 3292, 2130, -8933, -9255, -5469, 1478, 9142, 5213, 7493, -14, -11588, -9091, 3404, 6942, 4920, 185, -3018, -6046, -3615, 2908, -1746, 1657, -11519, -24373, -22936, -24512, -17553, -9148, 2294, 803, 9364, 9192, 2708, -8235, 10053, 8472, -78, 9736, 1221, -12427, -9723, -11533, -8282, 4889, 4958, 4832, 2512]
14491B512M90K012m486r56J844J0053J454j2085r211L150m653o112L389P704J0113
14476E218J5591o984p019m223r1j6160o368Q222o055K093J8667k1o612j056m025
14461h823Q749M816k717p852l284k050j0854j262J1398K843Q31r056j011J0310
14447g962J324n982J1579Q970m846j1042J955O230M919N474M119l773k3085K636
14433i484j841q33M177R219p694q392J0368Q99j3322j432K1575J4248l145j599
14419A2744K636j0710j0933n370M118r1L887j1276p571J0290J5003R57n066j8384
14405a9766K361M108L838n67Q399Q784k859J0550j946j4211o762J8251R957K747
14391B2884p220m351j3196j1747J1282J3194K202j4068q300N35j929P183P017
$$ y = [2512, 3002, 5014, 528, -428, 1416, 11469, 12923, 838, -8373, -5223, -9876, -15988, -12599, -4895, 5218, 20809, 13825, 6806, 2583, 2492, -13668, -20036, -11814, -17869, -15776, 2891, 2870, -3742, -4798, -8823, -74, 4742, 2025, -5827, -9111, -11161, -22015, -23277, -11879, -9036, -8205, -17261, -18272, -7962, -6638, -12620, -1041, 7929, 3083, -7959, -6004, 226, 5145, 10619, 14738, 10965, -12120, -9484, -11325, -12158, -7981, 1238, -6456, -14848, -4480, -3581, -16903, -18335, 3240, 17488, 14343, 12744, 15380, 4670, -6263, -11633, -7515, -7606, -3719, -14995, -22566, -12276, 2727, 3684, -1382, -19766, -17405, -13297, -9459, -10026, -1627, 7157, 4298, 14848, 12902, -1309, -8071, 10180, 20137, 22884, 15664, 11313, -1883, -13630, -2348, 10846, 13048, -1020, -9320, -8785, -10714, -3531, 3486]
14378C486k659m325l56M322o501q100L881L455O656q96o2O047J5K281R85r492
14362a263k573M09M9m313o317Q781L981j638K250q641j358k730n99Q638R516L756
14346G948J598j6439n206L596R328N323n632l370j6253K704j276P08K458Q600
14332e913q94L774N468J4656M96M989J2403j1843j6689J5296j3482j9870j2939
14319b4548J4340L2785J4320j083j5679q827j0992m842K10R976j978k856J1991
14306A2817O511r838Q095M272p499J487n125m640n614M347j022J560o911j7208
14292a8768M054J0442P035Q933Q915n572m063J627j831j1695L068R337q820K667
14278E329l169n085O32j1798r706J1138N368M274k295K522q94p631P73N983n90
$$ y = [3486, 827, -3498, -3854, 468, -6033, -14133, -10252, -6797, -141, -1037, -1099, 4948, 4963, 7244, 8229, -1263, -3836, -3427, -3378, -7691, -14008, -5227, -1246, -2884, -634, -9275, -10633, -13363, -13962, -5324, 4192, 7948, 9546, -6893, -12099, -8503, 825, 6148, 516, -2854, -19107, -16403, -17679, -16971, -14513, -5913, -6807, -3033, 2435, 17091, 17587, 22576, 34979, 23136, 6447, 21743, 8261, -11609, -24548, -10208, 22577, 36897, 35814, 20135, 11308, 316, -4526, -4316, 5660, 3682, 826, 12817, 19328, 9490, 17585, 21857, 14358, 15845, 10720, 6080, 466, 4813, 3791, 5351, -1560, -18768, -14714, -4272, 2763, 11696, 20611, 15039, 10976, 12603, 10772, -923, 2145, 11482, 2662, 5329, 2160, -2925, -2293, -14091, -23797, -12659, -7291, -3017, -5312, -2790, -3684, -11315, -10542, -4559, -5149]
14263e149J910l020O882O628k0656K953k598J033p131p0r214O186K2462N027P810
14248A3053o52k1660l007J1107m077J0763J1357j791m154m890Q900k333q298k249
14234B069M450l995p947M45J8224q407j2818J1879q14J824Q028L320J0234K187
14220B8679j2174l252N653R788o752j5746L117J4094n065l511M427J241k4l987
14206A6488o160J182n628r559Q822n00m20Q25j3851m015R411J0088j2481l583
14192i381J581j243J232k34K189j0134j747K905o693k522n11N566K1400N88o649
14177c653j4776k674J3247J4422q179m845j2285m742r1N701K1033l625j2922j185
14163a4574o077j959R678J0581O705K417J853J959o639o229P421J7998l091O337
$$ y = [-5149, -3239, -6259, 623, 7251, -13405, -10452, -13050, -12017, -19148, -19218, -28432, -22246, 216, 5243, 13053, 12401, -9259, -12266, -1159, -5236, 5527, 16884, 15093, 10939, 6049, 14949, 12616, 4318, 2069, 6519, 2524, -5423, -4978, 13246, 4839, -7979, 3900, 3086, 4910, 12938, 16258, 26492, 28679, 16505, 13253, 18906, 28694, 21942, 6196, 9313, 23407, 18342, 14831, 19258, 20499, 20475, 16488, 10328, 11510, 5882, -3677, 5145, 4645, 4225, 5050, -8801, -12816, -3405, 6683, -5798, -9381, -7800, -9043, -7811, -8045, -5856, -15990, -17737, -14832, -21525, -24047, -24558, -18992, 2408, 2996, -3653, -18429, -21103, -7856, 6566, -1613, -6458, -18743, -23485, -23576, -17875, 3158, -467, -13389, -14574, -20651, -22610, -12932, -2351, 4354, 6771, 8624, 10583, 3944, -2285, 5136, 23134, 20043, 26380]
14149B6380j1021j0590k734P805j921R099p424N666O1o904j4397j050P805J7276
14135A8051O147M825l273j0364J072j1739L187R095O522j2291j40Q676p608j3475
14121a315j963M770j8707p638N625J6549J8479K284K072r328M515J0332N202J7564
14107D8441l253j694p358j0931j6958q84o171o382q779J2374M119j740L689J764
14093F237j4894K097L338n376K117J5611M727N528p788j0810j56N337o785j4975
14079a5792Q311J1052N234n396l016M945j4396n429l812j4236N356o79J3612P279
14065f967L130l763n967m306N475k202J0175J837j523J1684K289j4223j4381O31
14051a8111P974J1364p928k1716m536P888J7367n223l134N916P739K327J644M312
$$ y = [26380, 15359, 4769, 2035, 9840, 7919, 17018, 9594, 15260, 15321, 8417, -5980, -7030, 775, 18051, 24198, 29023, 25750, 15386, 16458, 4719, 7906, 17001, 23523, 11232, 11092, 19768, 12160, -1315, -3278, 1492, -17215, -24853, -19228, -2679, 15800, 18084, 20156, 10828, 15343, 25675, 30877, 48441, 45188, 43494, 36136, 25205, 8247, 7363, 1192, -5190, -13969, -1595, 2524, 784, 4473, 6237, -8657, -6560, -3222, -8598, -6481, 9130, 13857, 19385, 11597, 787, 631, 5968, -817, -15792, -7481, 3571, 8805, 3409, 393, 5338, -9058, -14487, -18299, -32535, -27179, -27858, -14246, -6967, -3837, -7600, -13567, -17873, -12398, -14600, -4425, -2588, -4111, 7573, 9862, -4361, -18742, -18111, -10137, 1227, -6701, -28417, -32953, -25065, -7698, -12921, -16055, -10139, -2400, -73, 1571, 5883]
14037E883K031K524l150l88n889r240M301J9815k230k0053Q1o387L072J4057J2249
14022A6676k891o699q208K495J0295j767M326N413M723N143p107j2032k4907Q759
14008e781O89j2553J7601J4568m328q328k1385j156P251J5337J784J9007J1617
13995C4323q533p082j0432O812p513R256R612J8410Q511j4987k2144j0102o983
13982h52j6005M55J1532L568j4569J7436L896M899M245n004m34q222l154l10J5237
13967A2718p64N094J4550P076J768l059K905j5597j2022J1198j0547r153j1233
13954g066j9965q325K304N374J5691O235M546Q571p791j9641k381l144J5699R105
13940g88P590K834K957l166K263K250l464o730J8694K182L51m091p693r624M1
$$ y = [5883, 7914, 10438, 7288, 6900, 1011, -8229, -3928, 15887, 13657, -6396, -6315, -12702, -9630, 4427, 16676, 13785, 7086, -1122, 1373, 11668, 9901, 14227, 19640, 24363, 29506, 22399, 10367, -14540, -5781, -5092, -17645, -44, 14524, 10196, 1868, -19517, -20673, -13422, 1915, 3699, 22706, 34323, 25790, 18708, 8276, 15088, 7575, 16831, 26443, 44853, 53364, 38377, 16233, 6131, -852, -16857, -16402, -4870, -1302, -15871, 1565, 5461, 10360, 14605, 9601, 9167, 945, -2209, -2519, 12718, 11954, 17048, 31598, 38674, 40442, 37383, 40288, 24691, 12669, 23867, 13320, 4167, -7066, -27031, -35356, -33052, -27678, -11987, -5752, -1206, 7365, -426, -20067, -22448, -25592, -9893, -788, 6802, 9636, 12593, 9427, 11690, 13940, 10476, 3746, 22440, 24622, 24973, 20882, 13189, 3565, 3606]
13925C606j2413K170J2398J0094m522j9184j5175P794R383k728K814l059L790
13912e032j659R528M71r58J1164P039O464k217r33j9861K601K735j9759j0845
13898b1262N689N972m083n13l769Q168l495R220R046Q570N185o890k898j153p735
13883E2l108l707R150j5179l111Q260j314n457N361n963k48J604q59j1203L49
13868b5373K437n171k532P298k738M476K627k091M764O996M396j723l076J9492
13854I782O481p686l641l645M784m510J0590p545j2747P037O47K772M53J288p234
13839c174j3269N672P676n045o378O485P648k846j754J2488J0843N033O02o457
13825A7524j968j2900L158J4608k232q454k0395j6704L214j968R453N392M30j0800
$$ y = [3606, -8807, -6637, 5761, 15855, 11333, -7851, -23026, -15232, -5849, -8577, -5763, -8822, -5032, -6691, 2837, 3308, 2350, 13514, 20553, 27017, 24800, 23867, 4006, 6607, 9342, -10417, -21262, -15573, -9601, -13684, -14197, -17966, -9798, -13293, -4073, 4973, 13543, 18728, 11838, 8940, 7787, 52, -3056, -6763, 2387, -12792, -15903, -7643, -8957, -14414, -9053, -15016, -15264, -13660, -14519, -25722, -25373, -22936, -28107, -30639, -23341, -26079, -21603, -18976, -21067, -16303, -9307, -4911, -6634, -9710, 9782, 16263, 8577, 4936, 1291, 6075, 1565, 12155, 4610, -8137, -1100, -453, 2319, 2772, 4060, -3174, -16443, -10771, -3095, -8140, -14518, -8033, -385, -3231, -4985, 7503, 18346, 23379, 23981, 17524, 15556, 2656, 5814, 20422, 18190, 9736, -10659, -27363, -24149, -26117, -16664, -11272, -10842, -21642]
13811b1642J1278R262k840j8212j4128N739J3016J3204P286k085O235r269q577
13798a0733L859Q845R469n918M347O401j4327M63J0540R595M065j501J995j1048
13784A6052j3691N502o175j3004q869M626R774P14o804J685N694o690o014o242
13770b3442O027N793J4712J0076m54p888j9933j920J4337J160K62j670J321J628
13756IP933J4730J639l425r327j0608Q317N817L800j30j1354O544J895j2790n107
13741b057j68o243L742j68M542O687N424n443k464k45P748N025j4683j7764O644
13726i423k143r63J1233J914p776r969J809L178q67K184J0789P186r037j1011
13712a2896k905K353N046O191N760J0926j168k388Q637P895r334j0553M905L484
$$ y = [-21642, -10364, -1102, -3942, -22154, -36282, -30543, -17527, -4323, 2963, 878, 7113, -2156, -10733, -6874, 1971, 11440, 5522, 9869, 16270, 1943, 2406, 12946, 22541, 26606, 25105, 27100, 16052, 2361, 7863, 1688, -11316, -20185, -15559, -5785, -5071, -11875, -10190, -4496, -11186, -17200, -23442, -17415, -11622, 3090, 13166, 12712, 4824, -15109, -17029, -2692, -1532, -1270, -2940, -1619, 9, 7942, 22672, 24311, 20886, 11559, 951, 9268, 15085, 18885, 18755, 7401, 13945, 15840, 3050, -2057, -2225, -8468, -4726, -4894, -352, 6335, 11759, 6316, 3852, 3607, 11355, 16380, 1697, -16067, -9423, -11566, -12529, -1296, 618, -7158, -17127, -15318, -12140, -13007, -10823, -34, 7152, -1885, -12896, -15801, -13448, -8402, -2211, 3549, 14475, 13307, 10919, 19556, 27451, 18117, 7564, 12469, 15953]
13698A5953N008L635j2776J071P8L237j4833j6092M025K5312n959j9382k193O070
13684f846N994n956J353p961m335R13k568N589J2043l232P776J0l716L437L395
13669E896M292j485j4326r426L050Q237k880Q570O423m045j5872o230M219M850
13655h727J136M75l266j8891Q932K1012Q601n527l957m9l683n019m514J4662l285
13640b100M841m625k621j4582k470K4183J9530M85l996m397l212l922N97j1716
13626d005r257m003J2118n56N160J4231m225n237p211p543j0302n709l796K4253
13612f082P919m117j2826j073J3974J4483J21j833L165M642L732j1002q588j0538
13598h023J001j573o269p310L565R271L434r780l312m119J0949L57p923M913L890
$$ y = [15953, 20961, 24596, 11820, 12891, 12969, 16206, 1373, -14719, -10694, 14618, 8659, -10723, -12916, -6846, -852, -6808, -5455, -13416, -17751, -16838, -19406, -13817, -1774, -5006, 2770, 2780, -936, 2501, 5896, 10188, 8703, -5623, -15049, -11999, -3762, -6642, 1928, 8351, 4306, -11566, -17796, -13577, -8727, -7591, -7116, -10382, -29273, -20341, 671, 9272, 3745, -212, -261, -3944, -8963, -13477, 1185, -2100, 2741, -1884, -4505, -19087, -21557, 2626, 22156, 22641, 18645, 14248, 11036, 7114, 7711, -4005, -13262, -17265, -5147, -5703, -543, 13688, 9463, 4226, -2985, -10528, -20830, -26539, -30335, -6082, 1837, -2280, -15106, -16179, -2205, 12278, 12399, 10566, 13731, 18373, 22105, 11103, 2515, -8023, -7022, -8595, -14864, -22174, -18609, -9338, -5904, -15684, -18996, -23115, -12166, -11809, -19732, -14819, -10929]
13583a0929j4509J0450j0198l569P489Q591J7359J4816r052j2074p132k206N349
13570e615R59j2442J6321J7343q048M485J4775k604k96R055l993K691K468r75
13556C4124j3297j2566o926j3746j145l595L92m785M681J6023J1759o43j0755
13543d79r327n238J8807J2236r526O667M20q058J72K548N35j0119j8770J123J9295
13528B86r036j116N416J980q231k948L029Q624K153j09L914j538P77n189q16N300
13512B496q056l639l027Q567J6998K911p375R500L1026o228p757J3719m371j213
13498D3551k0099j2531J6047J3021P226l531o9j642K675Q254j0650j2405J4743
13485D4590l33q64k4535j4969N902r967r793L945J3075P103j8004j7419R422p805
$$ y = [-10929, -25438, -14988, -25186, -28755, -21266, -12675, 4684, 19500, 10448, -1626, -8758, -10964, -5615, -4656, -17098, -777, 16566, 8518, 13003, 27778, 25174, 24878, 33933, 29940, 32631, 35099, 34124, 20827, 8261, 1335, -12411, -13556, -17151, -16759, -21544, -16863, -840, 10919, 10276, -479, -9806, -15044, 3763, 15999, 6473, 13140, 13560, 5502, 5674, 8222, 8757, -1362, -20132, -19009, 286, -8750, -9866, -4450, -2470, -10701, -13649, -10620, -1996, 157, 48, 3962, 2424, 3201, -1988, -2804, 2496, -5560, -9199, -12226, -3659, 13339, 16250, 8875, 18375, 49401, 43173, 35416, 49135, 44764, 43551, 23452, 10921, 26968, 39989, 47215, 43684, 43615, 41973, 44648, 52902, 42252, 29847, 44590, 44257, 43393, 18858, 3889, 9791, -176, -9969, -6024, 7051, 14154, -3850, -21269, -11847, -19652]
13471a9652n612K1247J5456M252n257j478j3324n348K173l001r407J0399N584
13458c968K1246o687k0328r977O932J2510M379k551Kk487O841k803k110j2511
13444a1512r408J849j955J566mK737P147P850M560j647m16N154o2R007j309l138
13428A0419j4644J268j7232p52Q302J1015M761m495k035K443l089R14l408m377
13414a0910R680M31N59R550o023J8751O308j1392K733Q166p818j8849q120N029
13400a905M36j2331j0733N633J6471k552k76q702p079J4621J6371P053j3307Q975
13386A2675Q511j2732M853J6071m494j3076r708J120r21K155l52P157Q41K189
13372A4289k113j0646J2485K8j1118L181q86n687K515P311J1934Q893J188L372
$$ y = [-19652, -25264, -4017, 11439, 15691, 10434, 8956, -4368, -9716, -7543, -10544, -19951, -9552, -3968, 17278, 10591, -9737, -19714, -12782, -272, 4107, 1556, 1558, -929, 5912, 3109, 999, -11512, -20920, -19071, -21026, -19460, -19464, -16727, -9580, -1730, 2830, 1183, 767, 5921, 5859, 14866, 13557, 10419, -4225, -2957, -20189, -20941, -12639, -1624, 3137, -1358, -3393, -950, -4039, -3125, -6533, -10910, -1230, -799, -240, 9310, 3287, 22038, 28346, 16954, 19687, 27853, 20035, 1186, -6934, -1905, -1469, -13800, -24533, -18900, -2429, -4981, -5257, -13959, -21038, -6417, 9954, 17007, 3700, 12675, 21186, 8454, 13307, 29378, 24884, 11808, 2100, 3220, 2299, 4454, 4102, 11259, 12100, 14289, 12176, 1530, 14015, 14043, 2925, 6106, 5220, -467, 2048, 9359, 21293, 30186, 31374, 34746]
13358C4746j6942j7697R491P236Q321J0418j0306n206L673O748k737j2289m210
13345A1246K273O962j0172m032r754J2199p138q964J0810J0887K65J1133L480
13332B9195K998j64M05q707k460P119J5109J2649Q540j1578q211q862o511J5280
13318D4802k675k744q833j5821j2442K449R650o713q439K138K618J817k1022j199
13304a6414L293j681j431K5511J8947m903j2256m378k01J389l264j1681j1474
13291a8543J2881Q666l205N67k0757L441J0899N94l085Q304L344J1886O111q204
13277A2899k829M626j0334j3144j7543K985J5029P115L733l862j7014J1377P593
13264F31j2369p861J339J6908Q791r652j1596j4665P038M984J2967K1j182O928
$$ y = [34746, 17804, 107, 9598, 16834, 25155, 35573, 25267, 20061, 23734, 30482, 27745, 15456, 11246, 13519, 20481, 10309, 6277, -3477, 8722, 1584, -7380, 3430, 14317, 14582, 25715, 29195, 32193, 32029, 32434, 23727, 21267, 28386, 43495, 56144, 64684, 53106, 44895, 36033, 29522, 44802, 42127, 39383, 30550, 14729, 2287, 4736, 14386, 7673, -766, 1372, 3990, 5807, -15215, -16414, -13121, -14802, -16233, 9278, 28225, 23322, 11066, 6688, 6487, 7876, 4612, -7069, -18543, -5662, 3004, -201, 366, -20391, -16950, -6051, -5457, -8542, -238, 3106, 14992, 21103, 12899, 10070, 14696, 4362, -8782, -26325, -23340, -8311, -1196, 2537, -1325, -18339, -6962, 631, -11738, -19599, -18260, -1352, 7439, -2213, -13809, -28474, -21436, -16452, -3485, -3464, -4646, 2282]
13250B282O412K077r442m401r208Q766P456M639J0090n463q963k177R888k568
13236I388j6885j1746o316Q631R616O935Q108N986r246l816p118r170j502n295
13222b2430p667O894M82P425q85J0786J5465j5915q150M649Q138O038M172k205
13208F797j578k875m576l295J6808K2378K593p166j2088q572M828M814q418P69
13194A0419P134K302r010n986Q829m825r224q851k074n297P468J5486P79P680
13180A4830O307R518J517N71o613p834K12N751k5042j2528l882o536n425N919
13166b3235J0640P426J0658Q761r62j0754K265J2690L933j5235m071J0666N243
13153A8025k1395j8731R583M378r9Q297J3392m453L26N73J4493p843k5039o710
$$ y = [2282, 8694, 10771, 1329, -3072, -12280, -3514, 3942, 8581, 18671, 13208, 4245, 2068, 11956, 9388, -7497, -19243, -25559, -16928, -7312, -377, 7731, 13717, 4471, 655, -6463, -15633, -17135, -22430, -30097, -23203, -22721, -15296, -16181, -5395, 10070, -5845, -13995, -9346, -1208, 4830, 9002, 6797, 5219, 2344, -2232, -5527, 11281, 33659, 36252, 29086, 16998, 8426, 13254, 18068, 9650, 10419, 17553, 19855, 10845, 4859, 13688, 8863, -361, -9212, -11286, -16583, -9115, 6371, 7150, 14830, 21137, 30655, 32172, 32743, 26130, 18296, 18508, 24259, -783, -13311, -17193, -23729, -29154, -23235, -12595, -5169, 5489, 14250, 13288, 2534, 4799, 17489, 21422, 6187, 2116, 12782, 18025, -3370, -22101, -12518, -8140, -8239, 58, 13450, 8997, 9323, 9896, 24389, 16546, -8493, -15203]
13139a5203M780l654O914p452n888P336P176N882O425J3592r115r860L530O410
13125A0873O087K680j1318p040L656R738Q492J910j226l992o862L165p620r019
13111d76J2758O266j4726j917N354P999J4831j0549j168j2802k601J1136j107
13098A2998M014j497J1128J6035p950j1664o135p398j0940K305J93p364j3130
13085a9405O72K3922J2528Q551J0395j9717j4028r757l418j9366m388P795K2940
13072c276K1814N899p157q627k691r081p693m653J0973o242J574Q250n142j025
13058g077J0012J0547l211j0907Q850P877l089N844J353J2831k738j2476l17J3732
13044C1231j949j2365j9617j7625k550J2523P235p662j2623o534J2140P419N75
$$ y = [-15203, -10423, -14077, -7163, -14615, -20503, -13167, -5991, -109, 6316, 19908, 10793, 933, 4463, 10873, 16960, 19640, 8322, 1282, 4938, 14676, 23168, 25078, 23852, 19860, 12998, 16163, 8543, -476, 12282, 18548, 3822, 1905, 7259, 15258, 30089, 19540, 18372, 5570, 2969, 14105, 12998, 17012, 15515, 26643, 42678, 34728, 23064, 16929, 9531, -1409, 896, 1089, -6275, -19405, -18733, 5189, 17717, 26268, 36663, 16946, 2918, -6839, -10257, -29623, -34011, -26216, -3276, 18538, 24437, 17280, 8653, 5962, -3119, -10812, -15465, -4492, -10734, -9160, -910, -6052, -7077, 2935, 13482, 10271, -636, 8214, 16091, 13002, 18846, 20199, 33030, 30292, 17816, 17499, 31231, 29282, 16917, -2700, -20325, -22875, -10352, -3117, -10779, -23402, -29936, -17796, -10377, -9802]
13031i802j484L789M314J996n741J533q22j3490K402K5084J0817P169J1031q850
13017B7946j8948n088j0861j551O878N016n821L990p49Q47o260k960N606N801
13003C846j582p000O88L310J0343N238m012O061J0707R536k015j0453o770O177
12989B4074q753r314l57n628j017Q913k2328k5003J0669J606J0451M604j0390
12976b2473J9931J6476J2n619O333r398j0865o791O640M41j1592j5239N552J9306
12962g286K5881k693n379m194o233K166J6995K974Q564m892j7236k806k0609j5437
12948c0185M897M766O779J4340J0859M97O75j8379J2422L633j1906p621l31J2353
12934B799m626n212J233l494J2122J366M364N610J5750J6261j1479k4622r441
$$ y = [-9802, -11286, -7497, -3183, -1187, -6928, -5395, -6217, -19707, -17305, 7779, 18596, 25765, 36796, 27946, 8998, 3910, -6951, -8502, -1624, 3392, -2429, 1561, 812, 1659, -4601, -7561, -1955, 3846, 2264, -4736, -4048, -738, 9605, 14843, 10831, 16892, 27599, 37135, 35120, 24667, 17897, 24074, 15321, 6007, 5650, 22, -995, 7918, -14410, -39413, -28744, -27138, -16687, -12083, -22473, -2542, 13934, 13946, 8327, 14660, 5262, -5603, -12394, -5754, -5313, -16905, -32144, -26592, -7286, 18595, 15902, 10523, 6329, 96, 2262, 19257, 22231, 30795, 25903, 8667, 5861, -14748, -30185, -25288, -20522, -13743, 597, 11456, 11953, 12628, -5751, 6671, 10304, -1602, -9223, -9554, 2799, -1827, -7039, -5806, -9300, 2822, 4188, 8552, 14162, 29912, 46173, 34694, 10072, 631]
12921F31q021q362o42N685J4316r763O480J2652o403L835N590j704q28j2254P774
12906H986R251N986N36q881j8086o327J4129J1335Q161j6854Q751O949k820l882
12892A7234j384n609M211j349k959j0859j2129j2677l859J2808J5080N04R98J2749
12878A2759L903j1886O478K741J8550L935k0117j6587n611j308L693J8216J4215
12865B8981j4748o387r076j3307p684R203J3811J2547j476l074L484o323k346
12852C605O244j62p469Q607l74j1906J759J4497k865j0280j1983K559J3585N237
12838A1054O225r862O379N393m363l580j0091k2155j2898N588J5941K3896p871
12825C656p051k526M743l531j932R500l480m367J1312M484Q728m243k1326n355
$$ y = [631, -7390, -15752, -16394, -10709, 3607, -6156, 324, 12976, 6573, 10408, 15998, 14294, 13466, 1212, 8986, 18237, 24223, 24759, 15878, -2208, -8535, 5594, 16929, 25090, 8236, 16987, 23936, 21116, 17234, 15850, 10241, 14452, 13103, 10144, -715, -12844, -25521, -29380, -16572, -1492, -988, 10, 12759, 16662, 4776, 11254, 13995, 32545, 36480, 16363, -224, -5835, -7143, -3450, 14766, 28981, 14233, 7846, -1230, -14537, -22221, -13018, 793, 13340, 11864, 8790, 12274, 5951, 3605, 9849, 9687, 2218, 10825, 10451, -1455, 304, 14801, 11936, 1656, -10327, -7768, 5817, 11054, 17279, 7417, 13796, 19189, 14826, 11246, 1155, -21000, -33898, -28310, -12369, 11527, 3656, -3395, -5921, -1178, -4709, -6641, 2859, -621, -4988, 6324, 10808, 19536, 15293, -6033, -11388]
12811a1388J1996K870R363o636n529Q112o976l230Q754p872o277k43J0942L055
12797F941n230l221P157J1280R397j1862o127q79j3993j2493q564J1057N058m38
12783a1917m6K466P974O554j6325J993J3186P194J1909o834j6228M636M159j547
12769G174J2576J3168J0019O216o982j2046j3874L492L367r862p729J0641j036
12756A5124j5864J8645j713j6962K300J9893P924K86O155J870k0384o988O618
12743A6904j6256j0779K417J3263n228N390K944m144Q085O802j959n69r871l067
12729C932J0649J2498q107k0232Q246L832J2211L031k114N893n148M685O483j3820
12715B2039j8151k753Q350J067o076M972R844J317k296j5935p897N831n581J3749
$$ y = [-11388, 608, 3478, 12841, 6205, 676, 8788, 1812, -1418, 7336, -536, -6813, -7056, 3886, 6941, 1711, -1510, 5647, 16927, 26324, 14462, 8335, 7456, -6537, -19030, -27594, -16537, -11479, -11917, -11963, -9497, -1523, 5031, -11294, -9301, 3885, 11079, 22988, 16154, -74, 4562, 8721, 7174, 19750, 32918, 42937, 49153, 42171, 30125, 16251, 19743, 23110, 13248, 5519, 16160, 15124, -740, 17905, 16192, -770, 1530, 21423, 29347, 29633, 35788, 37658, 17274, 10286, 16904, 648, -10131, -7714, 5549, 321, 5711, 8655, 4511, 12596, 19398, 17439, 16870, 6999, 3932, 14581, 27079, 18972, -1260, 6986, 10818, 23029, 26060, 23946, 29839, 24691, 29376, 35859, 22039, 3888, 1135, 9485, 10552, 4476, 9448, 19292, 20609, 18313, 2378, -5519, 312, -5269, 8480]
12701H480N700Q058k293p905j2105J193J754j1106k5952R420K5943R944J828o599
12687F360k825o045j2233j779Q396Q032K738L339N560P510j0251k575j1052M521
12673c04J5938O57j5928k4721P361l437Q582L419Q816j911m467K004L804n804
12659e991j392l203K355J486M545j4130P619J1534J1896J843Q01q817K632o168
12645E010j0424K292q050j5199M833M749P911J4265o779P57J0082n800P848Q683
12631B0178K403n088k0949j0317J5469j359m345P817o049j0117Q654K06J1090
12618G593P096n702n062m155L484K987j96j036p880j912N298K217o462j746r438
12603a4914K158J6002J0043p953k449O366q651J954l785K452p24j4881L977J3946
$$ y = [8480, 14180, 22238, 19945, 12040, -65, 1128, 2882, -8224, -34176, -24756, 1187, 11131, 12959, 6360, 3535, -2510, -14743, -16522, -8126, -94, 2644, 5983, 11543, 19053, 8802, 6227, -4825, -304, 15634, 16291, 363, -24358, -16997, -20434, -11852, -8433, 383, -1528, -5995, -3991, -187, -5991, -7383, -10586, -8231, -6745, -2200, -16330, -8711, 2823, 14719, 16562, 17363, 8546, 11178, 5010, -5414, -3122, -11172, -26371, -21538, -16789, -8878, 5387, -1392, -635, 9447, 3647, 11495, 20178, 22581, 17493, -3456, -13773, 1696, 337, -4008, 3809, -2240, -12357, -3703, -3497, 7593, 14689, 8987, 3925, -230, 3254, 6241, 6045, 5009, -2871, -4783, 515, 2732, -3730, -5476, -14914, -12756, 3246, 13289, 5336, 2887, 9253, 602, 2556, -1229, 1223, 499, -14382, -10405, 3541]
12589C541J1940N605Q221K669o196j1821n835J082K639l722K213P884L940k4211
12575b051j3058J1456R000j196l9m535k167M323N812n430k2738Q235N648P348
12561F08N06L041O127p961p320J0343p787p100l616j5958N811J9681P469k710
12547A134O953J2413p496q539j1427n476R052L762j335M699R194k552j780J3009
12533B1611L293p245n834m766L485j1945j7915p368N273q004j0226P168K1825
12520a0648J7496q79N425p111l773J1509N618J0930K704q796p921N964R894n389
12506B5023j5788n048J804j2717j486J1403l137l508N75m962n521j0700Q000O705
12492i357n296M029J1456J6001L764m097j4892j0262J916N530J8236K172j397
$$ y = [3541, 15481, 21086, 29307, 31976, 25780, 13959, 8124, 9206, 11845, 8123, 10336, 18220, 22160, -2051, -15109, -3653, 5347, 4151, 4112, -423, -2590, 1733, 7545, 2115, -20623, -12388, -6740, 608, 1114, 4155, 10282, 2321, -4999, 5344, -2443, -9543, -13159, -29117, -23306, -3625, 3844, 1134, 8087, 20500, 13004, 4465, -6962, -12438, -3386, 376, -959, 3740, 12934, 10382, 8602, 21611, 24904, 17659, 11825, 7059, 10544, -1401, -19316, -26684, -21411, -29415, -39641, -32473, -10648, 6848, 5969, 11394, 4283, 510, 12019, 17637, 28567, 31271, 22475, 14554, 20518, 30412, 25023, 9235, 4187, 5991, -6726, -8212, 3191, 54, -3454, -2879, -7841, -13362, -24062, -16062, -9357, -14653, -10624, 832, 16833, 20597, 16500, 1608, -8654, -6738, -1208, 17028, 19200, 17803]
12479A7803P364p3k943R598J0923n388K351n886j2268k933r152K4712M579j0813
12465B7874k501o337K26k34j3447j259J724O09r442L018N554J0160n441j0542
12451c8J0256R969O706l527l743L31j0231r613j5787N130M804o976K722K0528
12437A0531J3301j394m780q490K841O075R309J570m888l037J055m588M861p039
12423A5327q020k712R05J1764j2731j5488J4645K304N394l731r611J9463J3086
12410C0595L022o973k26O680j1229j3396J208M646R274O428l280o458n416L259
12396A8134L990r729J805k2219j1068J7181J1009P609j526O195O241M239m22r250
12382B2189j8016Q981P800n286j8161M76P874J3007J1388q040k0350N829K775
$$ y = [17803, 25167, 25094, 22151, 31749, 42672, 37284, 39635, 33749, 21481, 18548, 9396, 34108, 38687, 27874, 25373, 19036, 19262, 19028, 5581, 4322, 6046, 6655, -2787, 231, 5785, 15945, 10504, -38, 10218, 20187, 26893, 23366, 19623, 19954, 9723, 110, -15677, -10547, -5743, -12719, -9997, 10531, 23832, 22438, 17658, 9168, 12009, 18084, 27393, 28963, 24075, 21038, 22093, 17505, 22366, 15327, 7307, 4595, 5500, 17264, 4533, -10955, 3690, 5994, 11388, 7657, -1954, 17509, 30595, 33617, 26644, 26418, 33098, 21869, 8473, 9681, 14327, 23601, 30029, 26749, 20291, 14875, 18134, 22124, 12395, 14200, -8019, -19087, -1906, 9103, 16712, 15186, 21381, 27622, 31861, 31439, 22189, 4173, 13154, 20954, 15668, -2493, -2017, 5857, 18864, 30252, 22212, 1862, 7691, 10466]
12369A0466M997P124O349k996L045o134r611M629Q748l362j4782j1263J709L839
12355B758L970M538p97k104l413p651m520n014m729J4226Q311P734J1370l468
12341B1211j2597K488O059K507M174j076K458k3267q531k293j845P95L939N978
12327@L387k370K027l474l190q699O008K065O782L855L46k077O487o669l9K5513
12311B9952o160j2707O273L275m175m084r88N136r868n765l976k138K35p174p083
12296a9247R244O389j0800J202K0717j300p983J7230O055j4338m444q322L828
12283a769Q045J3248J0625L580o201o603J0952j2806o933O907k593O994L064M30
12269B6940q907n081j370J896K393O576j4405k1169q303J8128r37j0170J1997
$$ y = [10466, 15463, 22587, 28936, 25940, 28985, 22851, 13240, 17869, 26617, 23255, 8473, -2790, -1081, 2758, 6728, 11266, 10469, 8365, 4952, -2699, -7219, -12233, -16962, -2736, 5575, 13309, 24679, 21211, 8614, 11102, 17161, 19668, 23842, 22766, 25224, 1957, -6574, -8867, -10712, -9917, -5978, 0, 3387, 1017, 3044, -430, -3620, -12319, -6311, -4246, 2536, 6391, 6737, 4660, 11147, 4478, 4439, 29952, 23792, 11085, 17358, 20633, 16458, 12374, 11386, 16522, 6654, 889, -3087, -5225, -4990, -12164, -19247, -10003, -3614, -14414, -13212, 7505, 6205, -1778, 15452, 21507, 7169, 2725, -5597, -1769, 6276, 19524, 30149, 33729, 27528, 20925, 31877, 19071, 12138, 19045, 16452, 23446, 26510, 26940, 18033, 12952, 11582, 13478, 15871, 22447, 8042, -13127, -21430, -3302, -4239, -14409, -2412]
12256b412M20O0o34r87J812P661J503k503L862j4273l531R723R290K2783k359
12241C0415n293j140p29m417J296J0843M502j9438j6687l170N71J872Q886K3292
12227C0803O009p944l849j139q027j9140p182P266o241N021P443n944j524N943
12213A495K0392J3694k0719j8677M498L886K103K227j1050m885k662N738J5874
12200A1914J6395n304L109O813o776l982o06l23j221N452k432j6826O613K0534
12186C3360J754j4042p233Q233J2733R34j1653M320n060m115J3345n260q138J336
12172B0514L933k4276k2715J632Q445j675M715M247J5638K0141r47J2954J160
12159D3766j0484p738J0771P326J70r579k2490P34J6298o326L334J4251K621J2762
$$ y = [-2412, -1992, -1932, -2566, -3553, -1741, 5920, 7423, 4920, 8782, -5491, -9022, 701, 9991, 32774, 30415, 25122, 23982, 23253, 18836, 20132, 30975, 35477, 16039, -648, -3818, -3247, -1375, 7511, 30803, 36812, 28868, 25019, 23880, 15853, -3287, -10469, -3203, -9444, -4423, 3020, -2924, -4448, 1495, 21887, 35581, 14862, -3815, 683, 4569, 6672, 8899, -2151, -7036, -9698, -3960, 11914, 28309, 23005, 26114, 32927, 26151, 22169, 21563, 21240, 20019, 25471, 23039, 6213, 12826, 33360, 35114, 21072, 13839, 22072, 34805, 35739, 24086, 28406, 23346, 19231, 32576, 27316, 19178, 20514, 24447, 171, -22544, -20912, -12467, -14142, -9427, -5180, 10458, 30599, 29652, 42606, 43766, 33282, 25544, 36315, 43641, 43811, 34232, 11742, 12476, 28774, 22448, 25782, 40033, 42654, 55416]
12145E5416l378j6933p781p733J50M864n118j1033N667p87m866J2407K2579J5188
12131E8642p772q469J0114j4939j3615k1573N78K0556O173k041j0166K090K0332
12118C9910J4021J2924J8774K2181N203o776j957J693O184o976n602j4758j5535
12105F9286j3303n886R56o677j0116r309m722P199J386j1610M893J0963n78k0554
12091A1928o604O210J5473m003k2358L124M711M744J4540j2320j6156M225O144
12078I658J1365m973p74j3814N608J1771R690p373p248K292K553l912j971N936
12064A8808J0115N362L078m80o376j7855r396K532P601J5419L459o800J268L335
12050C0070p13N008M366k1828l55k258k856J4385P228o62N025p909j7461j0972
$$ y = [55416, 52038, 35105, 27324, 19591, 19741, 24605, 19487, 8454, 14121, 13334, 8468, 20875, 43454, 58642, 50870, 42401, 52515, 37576, 23961, 2388, 2966, 23522, 29695, 27654, 17488, 19578, 39910, 53931, 66855, 85629, 107810, 113013, 106237, 104280, 105973, 112157, 105181, 99579, 84821, 69286, 55983, 50097, 51053, 44376, 34260, 24951, 20229, 27428, 28814, 17204, 22097, 33060, 32482, 11928, 5324, 11534, 27007, 23004, 646, 3770, 8481, 13225, 27765, 15445, -711, 3514, 9658, 21023, 16050, 15276, 1462, 7070, 18841, 28531, 21158, 13910, 16202, 18755, 14843, 12872, 18808, 28923, 34285, 37363, 36883, 30507, 12652, 3256, 5788, 13389, 28808, 32267, 25467, 26735, 30070, 29357, 34365, 38731, 16903, 16548, 14290, 11434, 25819, 33047, 32385, 37410, 29501, 12040, 1068]
12036A068Q490j1822J4900J3869J3419M206l291k217n253M533n88K094J0113k0254
12022B9267p421O261M0k041P117j3484r668p558m850l042J6247N720J4299n360
12008B5527J812j081j018k458j125o853Q663k343o255K102l825k776O442L648
11994B0460j5976p506J2398o487j681J1316n874r920J2782N478m746k552O345
11981A4037o639K560J1052m202k865p149R745k591q289j99O233L206P795q542
11967A4152j3600n062l654K0197O779L043J3730Q252r284K958Q360j8745p306
11954A9820j0794j606N757P19O05m31O336L080O262p53q0q007q044R1J252J335
11938A5542q009N090j2911j1089M933O086K942J2666j382j4483K426P416k407
$$ y = [1068, 9558, -2264, 12636, 26505, 39924, 44130, 40839, 38622, 33369, 37902, 37314, 39408, 49521, 29267, 21846, 28107, 28147, 26106, 33223, 19739, 10071, 2513, -2337, -5379, 10868, 16588, 30887, 25527, 27339, 26258, 25240, 22782, 21657, 14804, 23467, 21124, 14869, 16971, 13146, 10370, 16812, 20460, 4484, -3022, 9376, 2889, 1208, 12524, 6650, -3270, 9512, 14990, 10244, 7692, 14037, 7398, 9958, 21010, 16808, 13943, 6794, 16539, 13948, 5659, 5460, 11693, 14899, 22694, 14152, 552, -4510, -8164, 12033, 18812, 21855, 35585, 43837, 34553, 37511, 45871, 27126, 19820, 9026, 7420, 13177, 13896, 14501, 14070, 20406, 23486, 29748, 28995, 28915, 20908, 12864, 12955, 14207, 15542, 7533, 12623, -288, -11377, -6444, -358, 2584, 15250, 13868, -615, 1811, 9227, 6820]
11925F820M117Q933l202O856J4870L385R454r050n838P669o082n137p193Q17J4389
11910D0808L116p678r695j3471J0011J7506O495p045j3487R630j2496m463j492
11897A7739k000P416P559K652O79j7108j3081J425l250J7838J3659j2710p277
11884A3541o074p250M6J6480P50j5762k352N555L635j125N326J4152L530k2006
11870H446j1526j175K726j2348M107J9426J3600J3510k185j4703J803J3631n987
11857B9325j8023L425M319P746J9755P063r458j3988o743j690n598Q358J1955
11844C6446O833j5602N65l624j860N176p500j1226L3J396n513l697M394Q560N557
11829A9938P73p65p316n068Q45N297j072m6J0913J1103n726k565k279o52L621
$$ y = [6820, 10937, 19870, 16668, 23524, 38394, 41779, 51233, 42183, 36345, 44014, 37932, 32795, 25602, 26419, 40808, 43924, 36246, 26551, 13080, 23091, 40597, 47092, 40047, 26560, 36190, 23694, 19231, 17739, 15739, 23155, 30714, 33366, 34045, 16937, 3856, 5281, 2031, 19869, 33528, 20818, 13541, 7467, 217, 263, 16743, 17493, 1731, -621, 4934, 8569, 7444, 12770, 26922, 30452, 8446, -3080, -4255, -1529, -13877, -9770, 9656, 23256, 36766, 34581, 19878, 21681, 35312, 29325, 11302, 14727, 19046, 26792, 46547, 53610, 44152, 30164, 23421, 21731, 16133, 24491, 36446, 43279, 27677, 28242, 24618, 22758, 27934, 20434, 9208, 9241, 10637, 5124, 1427, 5821, 14381, 19938, 20711, 19946, 12630, 7562, 8407, 13704, 12632, 12586, 23499, 34602, 28876, 26311, 24032, 23380, 27001]
11814B7001r15l733o413k947O70Q575N424Q812R772j2170j9539o679k547k634
11800B677J3793J6671n45N718J0719k165o469M87j1126k6983q743Q809p426k81
11786d864J3865M653o843L179O482K2874p117k167J366M885Q138O268r789j5025
11772B5905M11o86r490j848l514J794J0162r397q9M488L334P566J7445q080O605
11757D4606k085o995J2032N377p867j3034q100n674M647l691R598J8285O572o047
11743D7624j044n151m488l020j5221j2761P142O928K1822l596n750m395j814r458
11729A6818P869q521J5967J3803Q443r859o232M47j1835k987P341j0053j3117
11716H084M8o878Q735N033K291p988m691o53J8836l032L8J1498P206K018O709
$$ y = [27001, 26086, 22353, 15940, 12993, 13663, 22238, 27662, 36474, 46246, 34076, 14537, 7858, 5311, 2677, 16470, 33141, 32596, 38314, 49033, 46868, 40399, 40886, 29760, 2777, -5966, 2843, -4583, -4864, 9001, 13654, 6811, 9990, 16472, 39346, 32229, 30062, 31428, 36313, 44451, 50719, 40930, 25905, 26316, 25630, 16140, 14292, 10778, 12572, 22734, 13337, 13248, 17736, 21070, 28636, 46081, 38001, 44606, 42521, 35526, 47558, 52935, 45068, 32034, 23934, 18260, 22907, 19216, 28814, 47099, 53671, 47624, 46580, 41429, 36941, 33921, 18700, 5939, 13081, 20009, 41831, 38235, 32485, 28090, 26276, 16818, 24687, 16166, 32133, 45936, 54379, 44520, 38288, 38735, 26900, 23913, 31254, 21201, 8084, 8132, 1254, 9989, 15022, 17313, 9325, 4634, 3981, 22817, 19785, 19823, 31321, 38527, 40545, 47254]
11701D7254N559m699k8809l65l438k455L420J7457R727m666r624p249j264J2129
11687C2977K2128J1940k8797p080n718J553N090N122L264J4109J609k929j8097
11674C5171j4515k05l292N842K7565j007n55j962j8880j2266J914J4319J100K312
11660C5541N672o016o340n588j3011m907R257J1926J175n632O68l82J0960J6738
11646E0061J551j1019M066j6738m947k476N675J545q08q760K157K3739R354j390
11632E2010l079M47l358Q0j0021L549j1601K292L834O279O156M835j646j2076
11618C7701j309o599J812J1244P630n264Q37j4341q409M457K668r948p969m371
11604H139R885K616J2815j3759Q184J9157N529p925n642Q697k10r701M091p092
$$ y = [47254, 52813, 48114, 19305, 18940, 15502, 13047, 16467, 33924, 43651, 38985, 29361, 22112, 20848, 32977, 55105, 67045, 38248, 31168, 25450, 27003, 32093, 37215, 40479, 54588, 56197, 53268, 35171, 20656, 20451, 17159, 23001, 50566, 49559, 49004, 47042, 28162, 15896, 17810, 32129, 33229, 35541, 41213, 35197, 28857, 23269, 10258, 5351, 14608, 26534, 27709, 22077, 22745, 22363, 33323, 50061, 51612, 40593, 44659, 27921, 22974, 20498, 26173, 27718, 26910, 18150, 20307, 44046, 53400, 52010, 48931, 49378, 46020, 46100, 36079, 39628, 28027, 30319, 34153, 40432, 46588, 51423, 49777, 37701, 36392, 29793, 31605, 42849, 50479, 45215, 46052, 31711, 23302, 27759, 30427, 20479, 12510, 8139, 18024, 20640, 33455, 19696, 27880, 47037, 52566, 44641, 38999, 47696, 47486, 37785, 41876, 34784]
11590C4784P972J0122j1804q09L190j1817K385K4417J9682J266r391k09n108j652
11576F3028r995M938r264q954P886M186O138m303j0764Q453M009k614J2238O497
11562G1479q294k005P62o77K517q75j8631q181N93J168J5374P491q652J5292Q854
11547G6215j1467o956n796j7836o04n359l845p324J4259J0239M095j780q569K776
11533C8048J82K868M290J8755N316l310Q170J065n418j3025j60N786Q340K74J71
11518G1352J701l474j1798L921J7815R125J7920n065o624r204p766R225J9882
11505A07010m78L554J0601p293r578m17L1978J5478L246k1001j2749P701K118
11492A30170J1897J6827N99P168J8510J4527Q025J7118K4621K8969M0358Q0716
$$ y = [34784, 42756, 52878, 41074, 40265, 43455, 31638, 34023, 58440, 78122, 79388, 69997, 69788, 64680, 63028, 53033, 57971, 48707, 39753, 47639, 51825, 57963, 53660, 42896, 51349, 55358, 52744, 64982, 71479, 63185, 61180, 61942, 61265, 63782, 62907, 44276, 36095, 36688, 37856, 53230, 60721, 52069, 67361, 76215, 64748, 57792, 51996, 34160, 33556, 28197, 24352, 17028, 31287, 41526, 45621, 43841, 35272, 38048, 38230, 41098, 45388, 64143, 69459, 66149, 74319, 75384, 69966, 56941, 56781, 62567, 70907, 71181, 71352, 73053, 69579, 57781, 61702, 79517, 88642, 106562, 101497, 94873, 85669, 77903, 87128, 107010, 106532, 110086, 120687, 113394, 103816, 103399, 135377, 150855, 154101, 133100, 120351, 128052, 130170, 142067, 158894, 159493, 166661, 185171, 199698, 207723, 224841, 249462, 278431, 318789, 399505]
11480C99505R9685J24648J52718J74805J94796J88816J70693K01127K32379K34394
11470B173566J88452q984j12072p0384p3424k17165l43289l45644k60028k05621
11460G25407j67899j19613r3584o3761n0301k9329k2382k27j455j5163k4533j4682
11448A22478l06n744m775m589L694J2619J6541L205m0382q143K553j0203N17J0748
11434I8213j608q332m931M458L817k321j3304j1337M70J0407m240N11p65o600
11420F4438m441Q230J768J2255p778m240J3454p590k0984j2019M202L731q730
11407D2296o980M270J0891L353M918M714M878K866J0806P051Q063R356l555j961
11393A00966P925K847K200o261P887j2135q60J4780q493j3876M588J0940l176
$$ y = [399505, 499190, 623838, 776556, 951361, 1146157, 1334973, 1505666, 1706793, 1939172, 2173566, 2362018, 2353034, 2240962, 2170578, 2097154, 1879989, 1536700, 1191056, 931028, 725407, 557508, 437895, 344311, 280550, 230249, 200920, 178538, 178311, 176856, 161693, 137160, 122478, 122172, 116428, 111653, 107064, 110758, 123377, 139918, 143123, 102741, 94598, 97151, 86948, 87465, 98213, 96605, 88273, 83342, 87800, 91617, 89296, 75992, 64655, 65125, 75532, 71292, 71803, 71038, 64438, 59997, 68227, 69995, 82250, 74472, 70232, 83686, 76096, 55112, 43093, 47295, 51026, 42296, 35316, 39586, 50477, 53830, 58748, 63462, 68340, 71206, 82012, 89063, 97126, 106482, 102927, 100966, 108891, 111738, 113938, 107677, 115564, 103429, 102569, 117349, 108856, 94980, 99568, 110508, 107332]
11380A07332k509j6855l351J0325R791j4809j2098Q943N980M281M680J2192J8514
11367A32416j083n032O823k895L848j4079J146L638j5057j2630j8180k2133r381
11354D7401j2886j7169k1250p929L623j37m648J2265J2120M936m371J0278p535
11341A4698K691j618R941J3257q37m759Q315p524J6882J9892J4561K6097L117
11328A14713l961N458O150o785m352J6480K8450J8889R22J7050J7718J6405M213
11315B31350J1485L511j3241J0482K3560K4745k217q200n876O423J1100q452l2122
11302B52548j3298K904q263J384j0274k9509j5998K089j609j7291q39K200Q026
11289A72070k061j6004j531k872Q019N076j7870j5077L862M923j0423j9650j3040
$$ y = [107332, 104823, 87968, 84617, 94942, 104733, 89924, 77826, 86769, 92749, 97030, 101710, 113902, 132416, 131333, 126301, 133124, 130229, 134077, 119998, 121144, 124782, 109725, 97095, 78915, 56782, 47401, 34515, 17346, -3904, -11833, -8210, -8347, -12995, -730, 11390, 16326, 11955, 22233, 14698, 17389, 15771, 25712, 38969, 38132, 33373, 41688, 34164, 51046, 70938, 85499, 111596, 114713, 110752, 116210, 122360, 115575, 111223, 127703, 156153, 175042, 175964, 193014, 210732, 227137, 231350, 242835, 246346, 233105, 243587, 267147, 291892, 289675, 281475, 275599, 282022, 293122, 284670, 252548, 239250, 242154, 233891, 235275, 225001, 195492, 179494, 181583, 179974, 162683, 161844, 164044, 172070, 170009, 154005, 152474, 149602, 157621, 162697, 144827, 129750, 133612, 138535, 128112, 108462, 95422]
11276I5422j6921k2682j507L294J6086J7712P667q50p413L998k908j5055j2667
11263F4176j6011P051k503O875p20P81J4001l462K964P641L567k2698l0344J7177
11249D8495K4661p416j9987l907R693q75j5091n333O807j3294k971N443J3111
11236C9336K7171J5709n00P237J4469M254j8436n714K5275J4076J7071M506P178
11223A51632K599J307J054J003J1910O160K1192J5599K2607J1092M048K3356K373
11210B75932L555K4461L4153J9001q045m069k940O78n314n422m812k3653j9334
11197B84191j3010j7349q623R215k2857k7879p821J0028J1506J7959j056J9269
11185B53573K7338K2136J5061P220L7582N0151M3922L5782L1480L9925M7561M4201
$$ y = [95422, 78501, 55819, 54312, 57606, 73692, 91404, 99071, 98221, 90808, 94806, 91898, 76843, 64176, 48165, 55216, 52713, 59588, 58868, 59649, 73650, 70188, 73152, 80793, 84360, 61662, 31318, 48495, 73156, 65740, 45753, 41846, 51539, 50664, 35573, 30240, 37047, 23753, 20782, 26225, 39336, 66507, 82216, 81716, 88953, 103422, 107676, 89240, 83526, 108801, 122877, 139948, 144454, 151632, 154231, 155538, 156592, 157595, 169505, 175665, 196857, 212456, 235063, 246155, 250203, 273559, 275932, 279487, 303948, 338101, 357102, 349057, 344988, 342048, 342726, 337412, 331990, 327178, 303525, 284191, 271181, 253832, 245209, 254424, 231567, 203688, 195867, 205895, 217401, 235360, 234304, 253573, 280911, 303047, 318108, 325328, 362910, 413061, 456983, 492765, 524245, 564170, 611731, 655932]
11173F55932L0847J4061J112K4063K9347O392M085M170j0929j2654p872k5720
11161G12834j6101j1328m190j4729N276J0237j3977q781r552K196j3503m480K8919
11148F62821K2575J7484J354j6445p569J3157J0144O174J7501K8761L1246J4552
11136H01755M1065N4286M6892K6107K8589M1993M7396N0666L8839M7140M8910
11125A273638K0746K8396M7463M4235M5211M8894O6897P9543O4378O8185P4494
11114A862080Q7811Q4845R8474J12925J41200J54528J34795J39128J82229K20714
11104C218729K28215K52103K75023L04149L31209L55718L84360L92043M52575
11095F194124N13423N46965N92715O15637O50142O94586P09051P24108P60876
$$ y = [655932, 686779, 700840, 701952, 726015, 755362, 761754, 765839, 770009, 759080, 746426, 738554, 712834, 696733, 685405, 681215, 666486, 671762, 681999, 668022, 659241, 649689, 651885, 638382, 633902, 662821, 685396, 702880, 704234, 687789, 680220, 693377, 703521, 709695, 727196, 755957, 787203, 801755, 842820, 897106, 943998, 970105, 998694, 1040687, 1088083, 1138749, 1177588, 1224728, 1273638, 1294384, 1322780, 1370243, 1414478, 1459689, 1508583, 1575480, 1655023, 1719401, 1787586, 1862080, 1949891, 2034736, 2133210, 2246135, 2387335, 2541863, 2676658, 2815786, 2998015, 3218729, 3446944, 3699047, 3974070, 4278219, 4609428, 4965146, 5349506, 5741549, 6194124, 6707547, 7254512, 7847227, 8462864, 9113006, 9807592, 10516643, 11240751, 12001627]
11086A2001627P83312P91045Q14446Q48840Q80900Q89311R06018Q76002Q75514
11077A9667015R13924R78161J053433J075581J018586J194743J591528K102860
11069B9595831K689417L347514M176513N473568P464797J0226725J4205347K0168030
11061I7347742K6896989L2279365L6105220L4564000L1287770L3335301M1027588
11054C32843975M4308263L5691225N668182k0430523j7506479r506988k8394685
11047C42672970n8604000o0368849m9395423m1790816l4399812k5029733j7526821
11040E5557516j2326341q877259o672126n112986l833390k824195k105557j537060
11032A2268602j123707q04987o32812n88015o56278o09255m68938m66370o01681
$$ y = [12001627, 12784939, 13575984, 14390430, 15239270, 16120170, 17009481, 17915499, 18791501, 19667015, 20580939, 21559100, 22612533, 23688114, 24706700, 25901443, 27492971, 29595831, 32285248, 35632762, 39809275, 45282843, 52747640, 62974365, 77179712, 97347742, 124244731, 156524096, 192629316, 227193316, 258481086, 291816387, 332843975, 377152238, 412843463, 418511645, 398081122, 380574643, 371067655, 342672970, 284068970, 223700121, 174304698, 132513882, 98114070, 73084337, 55557516, 43231175, 34353916, 27681790, 22568804, 18735414, 15911219, 13805662, 12268602, 11144895, 10339908, 9707096, 9119081, 8462803, 7853548, 7384610, 6918240, 6316559]
11023F316559o39009n63186n17474m47298l72393l33357k91686k20701k04155
11014B727300k03019j93003j75857j56399j34579j03131q3570o7370n9107n5420
11004A495845n4124m9645n1304m7251n1487l5896m2252m6664m7976n0010l7640
10993I81596m8595n2346l8005l9320n2403l2026j4543j3373k9721m0676j9826
10982F00762n786k6503l6756l0072k8097m784j0026j0428L159o356K911q643o534
10969D32847K3922M656M361O712n774j8623k0935j3238j1804j5040j3307o223
10957C67554j5185j2298k5532k8095j6220o479j6300l4110l9709j9630j4429k3179
10945A16388j8845j3806j0833j7977j4667p20M515j0978j2752q03J1716K4530
$$ y = [6316559, 5677550, 5114364, 4596890, 4149592, 3777199, 3443842, 3152156, 2931455, 2727300, 2524281, 2331278, 2155421, 1999022, 1864443, 1761312, 1677742, 1610372, 1551265, 1495845, 1441721, 1392076, 1340772, 1293521, 1242034, 1206138, 1163886, 1117222, 1069246, 1019236, 981596, 933001, 880655, 842650, 803330, 750927, 718901, 704358, 690985, 661264, 620588, 600762, 594976, 568473, 531717, 501645, 473548, 468764, 458738, 448310, 451469, 445113, 448024, 439381, 432847, 456769, 461425, 465786, 472498, 466724, 448101, 427166, 413928, 402124, 387084, 373777, 367554, 352369, 340071, 314539, 286444, 270224, 263745, 247445, 213335, 173626, 153996, 139567, 116388, 97543, 83737, 72904, 54927, 40260, 39540, 44055, 33077, 20325, 19522, 31238, 55768]
10933E5768K6294K5326R689m39Q576J5545K8719M8458K2063K2829K0549j675K2081
10920C03783L5932O133j970l282M721j1140k4974j2180o438j1436k3695k8169
10908B27285k6400l9704k8156j2637j6248j5554o550j1052k3456j1848M25J373
10896C7478J3276j435m746L626Q703J8999J3337J7683K0384L136q232j014j3146
10883A08049R03R632l47k652n169J3582J9108j5121j7065O709P1n459l964j3244
10869I5033K2837L7226K5115J751j602K1846J9591m837r027Q931J4517R787j988
10856B39180m477J1264J0359k902n244J095L810J5308N938j6814j4342j9453k5719
10843A98003o544M511N508k1257j1908q740k8905r852j823J5389m841j0646j2047
$$ y = [55768, 82062, 107388, 117077, 116638, 125214, 140759, 169478, 217936, 239999, 262828, 283377, 281702, 303783, 339715, 345848, 343878, 340596, 345317, 334177, 309203, 297023, 290585, 279149, 255454, 227285, 200885, 161181, 133025, 120388, 104140, 88586, 82036, 70984, 47528, 35680, 36105, 37478, 50754, 49319, 44573, 48199, 56902, 75901, 89238, 106921, 127305, 130441, 122209, 121195, 108049, 108952, 118584, 118237, 115585, 110416, 123998, 143106, 127985, 110920, 117629, 117700, 112241, 108277, 95033, 117870, 155096, 180211, 181962, 180360, 202206, 221797, 216960, 207933, 216864, 231381, 241168, 239180, 234703, 245967, 256326, 253424, 248180, 249275, 253085, 268393, 274331, 257517, 243175, 223722, 198003, 191459, 195970, 201478, 180221, 168313, 159573, 130668, 120816, 118993, 134382, 129541, 118895, 106848]
10830A06848j9895m866J8691J7002j0495L869n692k6858j4222Q451m368n400j0822
10817E2243L821N324r965j4119P279J1135p592k8455o337k091j1470m235J8180
10804A3718J8877L414j019o019r06R972Q608O509j7878o595K683j374L213j064
10790C2139j1377Q712M821P806m10k432m549j2620o765J1071J8528l243j6885
10777B4796j351J7951m260j5026O251J5312O07J0545j989Q610m51k008J260Q446
10763F8693l191l574J8797K792o578r464K427m887q856K0793K3804R234q319r851
10749I1820o797r207k9722l2766k6822j6601Q48j454j0217m921K732J6797J8150
10736h160R85R824J5266L392n736J3412j0955j1188l306j3984K474M835J2151
$$ y = [106848, 86953, 82087, 100778, 117780, 107285, 111154, 105462, 78604, 64382, 72833, 68465, 63065, 52243, 56064, 61388, 51423, 37304, 44583, 55718, 48126, 19671, 13334, 11243, -227, -4462, 13718, 32595, 36009, 34990, 28971, 28065, 38037, 46645, 53154, 35276, 28681, 31364, 29990, 33203, 32139, 20762, 29474, 34295, 42101, 41691, 39259, 34710, 22090, 15325, 26396, 44924, 41681, 24796, 23445, 41396, 37136, 22110, 28361, 43673, 44280, 54825, 52836, 61446, 60995, 58987, 60247, 68693, 65502, 61928, 80725, 83517, 76939, 67475, 69902, 65015, 56159, 76952, 100756, 109990, 101671, 91820, 85023, 75816, 46094, 13328, -13494, -30095, -29247, -30701, -40918, -45839, -43107, -26310, -8160, -7175, 2649, 17915, 21307, 15571, 28983, 18028, 6840, 3534, -10450, -7976, -3141, 9010]
10723I010l60r696p7n019j8936J102J0482Q687j915l07J2987J8533J1182J5559
10709E1232P897J2351J1848K084l043N566R53j1439j356q526p044j7150j0353
10696C3020J2174r15j4825k082l456j2521J3472j356m692j4803J418O273L831
10683A5538m420l315n771j5255J8933J0488J7520Q133n023P382K304j0787K517
10670C8244K979R204J1987J6794n575r449J434r934m049P407Q497L8942J9272
10657A25753j2830m077j041K029J185O672N757R49j2133M121K2157J1927K2721
10644A73190K6187K2333M2654N6433P7195J03390J53927J84601K05000J90793
10634A235703J78864J95175K29918K44569J98571K6709j15494r9894o4157j71581
$$ y = [9010, 8650, -1046, -1123, -6142, -25078, -23976, -13494, -4807, -6722, -7029, 5958, 24491, 35673, 51232, 59129, 71480, 83328, 85412, 82369, 87935, 88888, 77449, 76093, 67567, 60523, 43373, 33020, 45194, 44279, 29454, 27372, 23916, 11395, 24867, 23511, 18819, 4016, 5434, 11707, 15538, 11118, 7803, 2032, -13223, 5710, 16198, 33718, 41851, 36828, 44210, 46514, 35727, 38244, 41223, 50427, 62414, 79208, 73633, 64184, 65618, 55684, 51635, 59042, 67539, 106481, 125753, 112923, 108846, 107805, 109834, 111019, 117691, 123448, 124397, 112264, 116385, 138542, 150469, 173190, 199377, 221710, 264364, 320797, 397992, 501382, 655309, 839910, 1044910, 1235703, 1414567, 1609742, 1839660, 2084229, 2282800, 2309509, 2194015, 2094121, 2029964, 1858383]
10624A858383l19596l10392k75008k53341j87174j29047q4085o4995l5202k8779
10614A70764l2937k0035k8445o565j758q468q185r141q064J2737O329J850r296
10601E8786j0927k531N188l710k397j0199l227j4864j901o901L667R51J624N150
10587A8709Q890n079Q248j253Q386q120r342k1998q050J7961O099K313r872q865
10573a973l66n719m48N446M56K439L813k094J30j6304J4227J7783q746O083M18
10558A5145Q396R252K195J2151Q874M349r009R46p786q779J3526M630n94j6313
10544C6983q801q70j7423n578K754J556M74l774n27p564j099N500j383p487M790
10529b449J7517J2274L304O721P187O094R811L325j0954j1472r889j756J1625
$$ y = [1858383, 1538787, 1228395, 953387, 700046, 512872, 383825, 299740, 234745, 199543, 170764, 137827, 117792, 89347, 82782, 81024, 72556, 64371, 55230, 47166, 59903, 66232, 68082, 58786, 47859, 45328, 50516, 46806, 44409, 34210, 30983, 16119, 14218, 7317, 10984, 11935, 13559, 18709, 27599, 22520, 30768, 29515, 37901, 29781, 20439, -1559, -9609, 8352, 14451, 16764, 6892, -1973, -2339, -8058, -8506, -3060, -2604, -165, 3648, 1554, 1684, -14620, -393, 17390, 8644, 14727, 15145, 23541, 32793, 34988, 47139, 56013, 60362, 51353, 52299, 44513, 35734, 49260, 53890, 53296, 36983, 28182, 27312, 9889, 4311, 7065, 8621, 9095, 5321, 4794, -2770, -3869, 1631, 248, -7239, -2449, 15068, 27342, 30646, 37367, 44554, 50648, 60459, 63784, 52830, 41358, 31469, 29713, 41338]
10516D1338J5347l904O973K0446J749N017J798p229Q830O673K2004J7010K651
10503A38703n693J4827J5688K6605K7673N5963O9289P8272R6922J10815J06367
10492G35431J19461J47901J52632J14003L2374K4645N7393O2458k5799j18064
10482A302435j47722j22643j13375j09592j42526j47559r3365r1293q8891o5355
10472A80114m2861l8114o218j6914l5213j0126O0k276Q954L582n855j3582j4525
10459G026m929R081P691R867N165J764m266r386j415Q509J9196J2353L317m028
10445E9945k299j3065k904J1787M664j2973o047J200K054L790j0336j4099Q614
10432C0331P701P670M994j6705N032K1612J2689o830P14k452m512r198K609K753
$$ y = [41338, 56685, 52781, 59754, 80200, 81949, 86966, 88764, 81535, 90365, 97038, 119042, 136052, 138703, 133010, 147837, 163525, 190130, 217803, 273766, 343055, 421327, 518249, 629064, 735431, 854892, 1002793, 1155425, 1269428, 1301802, 1326447, 1383840, 1446298, 1420499, 1302435, 1154713, 1032070, 918695, 809103, 666577, 519018, 425653, 334360, 245469, 180114, 137253, 99139, 92921, 76007, 40794, 30668, 30728, 28452, 37406, 40988, 35133, 21551, 7026, 2097, 11178, 18869, 28736, 33901, 35665, 31399, 22013, 20598, 29107, 48303, 60656, 63973, 59945, 57646, 44581, 41677, 53464, 58128, 45155, 39108, 40308, 42362, 46152, 35816, 21717, 30331, 38032, 45702, 50696, 33991, 39023, 60635, 73324, 66494, 67208, 64756, 60244, 51046, 53655, 56408]
10418E6408j0670j7163p412j3183m847l661N741q051J0092j444r645n494J3773
10405D444r627j8085k818J6879K2209k224O372j0631r618m351J0061O373l773
10392E211j1206r770o520J1452j362L88l726M505J9280k741J3744n63p481k550
10378H661q667k2998j0488P319j402j621J4219L342J098P00k369p427m163j240
10364b5036M553n151L310R905J672j972L094O738M141n052M579k039Q103K1466
10350B8311L2149J2670j453Q820J9026r04n510J5422J3424N704K691j9825k4215
10337H6310l2055k6084r91j8129p122o356n305m54J7116J1239j797j4094n986
10324c708k868J984Q510K181J0482N575J673L913L226J8804J9816K791O33j2818
$$ y = [56408, 45738, 28575, 21163, 7980, 3133, -528, 5213, -2838, 7254, 5810, -3835, -9329, 4444, -5183, -23268, -26086, -9207, 13002, 10778, 17150, 6519, -3099, -7450, 2611, 8984, 5211, -5995, -15765, -22285, -10833, -12195, -11807, -15533, -11028, 8252, 5511, 19255, 18692, 11211, 8661, -6, -23004, -33492, -26173, -27575, -29196, -14977, -11635, -10537, -9837, -12206, -19633, -23796, -25036, -20483, -25634, -22324, -12419, -10747, -12719, -9625, -2887, 1254, -3798, 781, -1258, 6845, 28311, 60460, 73130, 71677, 80497, 99523, 98619, 93109, 108531, 121955, 127659, 130350, 110525, 86310, 54255, 28171, 27180, 9051, 1929, -4427, -9732, -10186, 6930, 18169, 16372, 2278, -3708, -6576, -4592, 3918, 6099, 16581, 22156, 23829, 27742, 30968, 49772, 69588, 72379, 73012, 60194]
10310F0194j2750l830r182j0272j0771K663n180k5748O262J975L850Q070j719
10297C562p838j0596M867j758o187p893Q595J6827N066n79j0853K561J093r246
10283a2379j5062J2353K6376q361j1492l701j412J0456K18p824o607O218m59J848
10269i828L809Q934K300p192j1887j0473o000K1493L545p224O159J0050l612j8970
10255a8896j846J4991J700n053m398o146K686N17k447O072j772J171L590k350
10241a2181m330n547j8254P714J5862j39n609J9692O570n554M940L077M703O800
10227A7744o812j770r37j4897J907O995j190p90Q910P604q604p319K520j0814
10213g453N652p714p890N270j0257Q177j0m630p392Q794rj2172L847K773M96k332
$$ y = [60194, 47444, 43614, 34432, 24160, 13389, 16052, 10872, -14876, -8614, -6639, -2789, 5281, 3562, -4276, -14872, -10005, -11763, -17950, -25843, -17248, -421, 4645, 4066, -6787, -4226, -3133, -12379, -27441, -15088, 11288, 2927, -8565, -12266, -13678, -3222, -3004, -10828, -17435, -11217, -11676, -9828, -6019, 2915, 5215, -1977, -13864, -24337, -30337, -8844, -5299, -12523, -6364, 3686, 74, -18896, -20742, -5751, -4051, -9104, -13502, -19648, -16962, -16445, -18892, -12820, -14592, -13421, -9831, -12181, -16511, -22058, -40312, -32598, -16736, -16875, -22484, -2792, 3778, -1776, 3164, 6241, 10944, 17744, 10932, 9162, 8225, -6672, -4765, 2230, 1040, 250, 9160, 16764, 8160, 841, 3361, -7453, -1801, -9515, -17405, -12135, -22392, -14215, -14225, -18855, -26247, -17453, -17462, -29634, -25787, -23014, -22518, -24850]
10197b4850J6285Q522o53m924R806J0563N312n922m633N731j0987o943q312j839
10183a2844P339m319j261q621l070m434J2663K3553Q431j6156r524j4235L615
10170a8863r95N809J4150j204j6643j713n054j428K3004r061o015M726l713K048
10156a4952L017l067m613N075j518P705J4054n814o025J4172P860k5395j8843
10143b8344N803K800J1906P941P417r503N051M468J108j611o942O766k87k639
10129C934l784R89L923J7230m715j8119j4934R063J001o278j623J3689m425k209
10115f258l137j0865k935L365Q433L689q387j1733O099Q799k66o512j313J7462
10101c559P576m700K833L804k919q17l343j7265p374q267m673K0615J9385N473
$$ y = [-24850, -8565, -43, -696, -5620, 4186, 14749, 20061, 14139, 9506, 15237, 4250, -2693, -11005, -12844, -5505, -9824, -11085, -19706, -22776, -27210, -14547, 9006, 17437, 1281, -8243, -22478, -18863, -19858, -14049, 101, -1103, -17746, -19459, -24513, -25941, -2937, -11998, -18013, -13287, -17000, -14952, -11935, -15002, -19615, -14540, -16058, -8353, 5701, -113, -6138, 8034, 15894, -9501, -28344, -22541, -19741, -7835, 106, 7523, -1980, 3071, 7539, 8647, 7036, 94, 6860, 6573, 3934, 150, 1139, 5062, 22292, 17577, -542, -15476, -6413, -5412, -11690, -13313, 376, -4049, -6258, -9395, -20260, -23195, -19830, -11397, -7708, -16095, -27828, -21729, -12930, -13196, -19708, -21021, -3559, 4017, -683, 2150, 5954, 3035, 2218, -1125, -18390, -25764, -34031, -38704, -18089, 1296, 6769]
10087F769j3776p302J2538J7789L211P348O38n878j493o228Q63M887K880j4786
10073G460l255k382M989J5717K1248L942j6371k185L49j1367k484q071k423m461
10059G06J3257J578l856K816J389K691k2734j5421J5368K3506J1230k560J3498
10046D1468J6257M379K799M309Q153O873Q719J8130N693j7441l2858k0492n682
10033D0307p281j9350K84m000k588L207n286P49k7435k81K038K980J4437K2224
10019B0005P122j7121q926l567O73M265p226q39J3695l7n871m606K304P417p24
10004F564j4239p888J1763J1266J333j5217R589K3083R047j6746q05O4j0815l849
9990C150p808k87J3692K234j4251k2986K905M991L760J0185r56l568j452J082
$$ y = [6769, -7007, -14309, -1771, 16018, 19229, 26577, 27215, 21337, 19844, 13616, 14479, 19366, 22246, 7460, 4205, 1823, 6812, 22529, 43777, 47719, 31348, 29163, 29512, 18145, 15661, 7590, 5167, 706, 13963, 15541, 11685, 14501, 15890, 18581, -4153, -19574, -4206, 19300, 30530, 27970, 41468, 57725, 62104, 64903, 69212, 77365, 84238, 92957, 111087, 116780, 99339, 66481, 45989, 40307, 33026, 13676, 13960, 9960, 7372, 10579, 5293, 6042, -21393, -21674, -19636, -16656, -2219, 20005, 27127, 10006, 1080, -2487, -1814, 2451, -4775, -5614, 8081, 8044, 2173, -2433, -129, 7288, 6564, -7675, -15563, -3800, 7466, 8799, -6418, 3171, 26254, 35301, 18555, 17750, 17814, 6999, 3150, -4658, -4945, 8747, 10981, -3270, -26256, -23351, -18360, -14600, -4415, -5371, -8939, -10391, -9309]
9976i309L539J075K04L078M190j019O884R621L342o087K283J0606o753m747n166
9961A1741j941R43m941o691O182Q273O47k4279o510k931Q561K90K529K676K43
9946e208J0455J2959N892Q55l543j1219J2014O022l854k1657o409K1083J4237
9933C1627M496K464J3782J6365J9820j158O067K3935K0334M920k7275k9436l6498
9920D9443k9984O645K816J235O920j8649j0174o571r556j3411l89K591J9040J7450
9906A7406Q507j0832j2401P488J8461j5607j6408J3328K800K778j5630j08j855
9893b073r269M298K019Q990M892j2671l15J9554J1190Q133p935j819j527m761
9879A8706l909o300k925q712j4458l249R215j831j4763P524J0775M849p41J460
$$ y = [-9309, -5770, -4695, -4491, -1413, 2777, 1758, 8642, 18263, 21605, 15518, 17801, 28407, 21654, 16907, 11741, 9800, 10743, 5802, -889, 5293, 13566, 14213, -10066, -16576, -19507, -10946, -10656, -8127, -5451, -5208, 5247, 18206, 24098, 24953, 21410, 10191, 22205, 28227, 24373, 2716, -3693, 17390, 31627, 36123, 38587, 52369, 68734, 88554, 87396, 93463, 117398, 137732, 142652, 115377, 85941, 49443, 19459, 26104, 28920, 30155, 37075, 18426, 8252, 1681, -7875, -21286, -21675, -19084, -44, 17406, 25913, 15081, 2680, 10168, 28629, 13022, -3386, 9942, 12742, 15520, -110, -218, -2073, -11342, -7044, -5025, 3965, 8857, -3814, -4129, 15425, 26615, 34748, 26813, 24994, 23467, 18706, 14797, 8497, 5572, -3140, -17598, -20847, -11632, -13463, -28226, -20702, -9927, -5078, -5819, -4359]
9865d359J586k63N624k6p147P30q910n720N476N32R558m581K757k07J3574m114
9849D510o611k269M692m364O020L826p034k0412P206J2301K207M0n923L610j558
9834c759j26m828K078P122n473r416N470l636K20r532K267M237m847Q980J5780
9819D537l215p672O133P75j4501J509O948j5142K144M365J7365J6257r255j3530
9805c282k2149p786N972J2835k438k852m301O70J4760N746O329m170j2563m575
9791a7804Q054J8010J2406o345j0471j1606R898J5447j1745j221J3057J0183n864
9778B1999k656o018j1703q822j319J7939J555L91j0651J5648K07j1904J0814m058
9764A1422j0565J506n848r875J0617k564j0812j0993J574K2364J0897L452j7720
$$ y = [-4359, -2773, -3036, 2588, 2562, -4585, -3855, -12765, -18485, -13009, -12477, -2919, -7500, -4743, -4950, 8624, 4510, -2101, -4370, 322, -4042, 1978, 5804, -1230, -21642, -14436, -2135, 72, 112, -5811, -2201, -3759, -3885, -8713, -6635, 487, -4986, -14402, -8932, -12568, -12348, -21880, -19613, -15376, -20223, -11243, 4537, 1322, -6350, -217, 558, -13943, -12434, -5486, -20628, -18484, -14119, 3246, 19503, 10248, -3282, -25431, -33217, -27245, -14410, -16848, -19700, -24001, -23331, -8571, -2825, 3504, -666, -13229, -17804, -9750, 8260, 20666, 14321, 3850, -7756, 2142, 17589, 5844, 4623, 17680, 27863, 21999, 19343, 13325, 1622, -7200, -8519, 9420, 10975, 11366, 715, 16363, 16570, 4666, 15480, 11422, 857, 2363, -3485, -13360, -2743, -5307, -16119, -27112, -25538, -3174, 7723, 11175, -6545]
9751f545j4884p657O293Q127P580j2921J9485Q276k839m917k97P842p490r108
9737i055J285j2239O433M829Q045r889o127j3637k840J8564J3446l363Q337J2104
9723A5893p007j6749j722k144L15L750p327j7108J5925K2107L774L7l900o156
9709c12L202k107j7122M163O11O185K761r355j2905j033J0902k90N52j0830k498
9694b8076N423J0591l834k081J0382J6010p19N070L090j4667j3814m745P219M147
9680f004r7q013M210N144O917j925j0381l1J4141J3468l419m625Q291k464k736
9665A2476J380j4833j2267L89P918m083q44L888J0893R161R153k430j3439l501
9651C861r094o820P003Q462J3890j6949K162J1735J3831j468j1138j471R656R453
$$ y = [-6545, -21429, -29086, -22793, -14666, -7086, -20007, -522, 7754, 4915, -2, -299, 7543, 53, -9055, -7770, -20009, -13576, -8747, -702, -10591, -16718, -30355, -33195, -14631, -1185, -4548, 3789, 15893, 8886, -7863, -9585, -11729, -11414, -7664, -14991, -32099, -16174, 5933, 9707, 9744, 5844, -312, 2890, 783, -16339, -12176, -11565, -5380, -2619, -11974, -24879, -25912, -15010, -15300, -14748, -25578, -28076, -22653, -12062, -15896, -17977, -7595, 8415, 7696, 12766, 15856, 1189, -12625, -17370, -10151, -6004, -6101, -14114, -9904, -4760, 2157, 232, -10149, -10180, 3961, 17429, 14010, 9385, 17676, 15212, 12476, 13856, -977, -13244, -12855, -4937, -9020, -9864, -5976, 4917, 14078, 23231, 20801, 7362, 3861, -5233, -12053, -5050, 3412, 17302, 353, 2515, 14250, 28081, 26613, 15475, 14004, 23660, 33113]
9637C3113n171j0788M777P711l001L333p215j0724l181m684l085n55j0437J3666
9623C759n616L012j2334l158M224O418J0227N587r285j5534P239N893R346n929
9609C849k3873j3121J7520J4971j1184j286l680o827m318j839K892J6573J1203
9596H80N699K459m741k614j4733k242J5284J8579N898o464K923r800j6458o192
9582a1522j4897L347K573J4390M723P159k791j0614K299R8o125q218r104J5022
9568a3660J4197O089N101M696j364j943j5830j0846m523J071o026P128J0458k16
9554e668P288J249Q579j2213p770O720J0643q214m314l417Q577P221k002J426
9540H105P283P84j2477M275l818k228j083J832j416M253N465J2037J273N617Q49
$$ y = [33113, 27942, 17154, 21931, 29642, 26641, 29974, 22759, 12035, 8854, 4170, 1085, 530, -9907, 3759, -1857, 1155, -11179, -14337, -10113, -3695, 6532, 12119, 2834, -12700, -5461, 432, 9778, 3849, -20024, -33145, -15625, -654, -11838, -13124, -16804, -23631, -27949, -29788, -26896, -10323, 880, 6579, 9038, 4297, 1683, -13050, -15292, -8, 18571, 24469, 18005, 20928, 11128, -5330, -11522, -26419, -23072, -20499, -6109, -1386, 5773, 2982, -7632, -5333, -5235, -11360, -19578, -28682, -13660, 537, 6626, 11727, 16423, 15059, 13116, -2714, -13560, -18083, -17012, -23038, -15910, -5452, -5668, 1620, 2869, 11448, -765, -8535, -1815, 8828, 614, -3700, -7117, 1460, 8681, 6679, 8105, 15388, 16172, 3695, 7970, 4152, 1924, 841, 2673, 1257, 5510, 10975, 23012, 24285, 29902, 30751]
9525C0751j3567m602J6580l63n811k877p829m955L343O156k245Q49k827M047j621
9510A5029j79k009q291j876N074R27Q700J2115o902m426n017J6377N560k039j0473
9495B2570R077P622N88j8842P462J0871o858K40j0004k446j928P17m787M079q255
9480A0106p483n320j1488M265K0305o287r698n259P446J703P034J205q698o338
9466h507O288M052l7L210J5136L968j7248j4984J6056J815j0207j2090M152J1617
9452C221K1940p892k2667Q767J3607J563J1155J3421j1763K516J647O219j544
9439D0190r558r91l813k206J0710q062o346j860p036j2733o417R122J7062R886
9425B7948r688L110P096J081k045M251l1963p771J6594l405j457N462j372j1958
$$ y = [30751, 17184, 12582, 29162, 28799, 22988, 20111, 12282, 7327, 10670, 16826, 14581, 15430, 12603, 16650, 15029, 14850, 12841, 4550, 2674, 7748, 8675, 17375, 29490, 22588, 18162, 13145, 29522, 35082, 33043, 22570, 31647, 39269, 39857, 21015, 28477, 39348, 32490, 32730, 22726, 20280, 18352, 19069, 14282, 18361, 10106, 2623, -2697, -14185, -9920, 10385, 4098, -5600, -10859, -3413, -1710, 5324, 6529, -2169, -8507, -2219, 1833, 1796, 5006, 20142, 24110, 6862, -8122, 7934, 9749, -458, -12548, -8396, 3221, 25161, 17269, -5398, 3369, 16976, 18539, 29694, 43115, 31352, 33868, 35515, 41734, 40190, 30632, 29641, 25828, 23622, 34332, 26270, 19924, 18064, 11028, -1705, -8122, 1000, 18062, 27948, 18260, 21370, 28466, 29547, 27502, 31753, -210, -7981, 8613, 5208, 3751, 9213, 7841, -4117]
9411d117O132o219j794N569O880j896P916N59L945N542j7928l809R517R497r692
9396A0102n552l293Q827J320J1191Q506l969m299J995L499Q217N298n401l393
9382C3048N684O266l292n415q78J0124k102L896j2071r751q702P613J4259o146
9368C2533r493n54J7730J386j1227l301K4232J6695o474j1159p895J039K462R641
9354E5615M30n763j093M954j632N231q089o501j3119j3J4263m270l284Q065P302
9339E2096Q697K2164l842k580R134J5313o97o708l627j3939l930l692l276L768
9325F8881R793J9128J6957n733n902k879J0798k211j5121J674J0693P471R15j717
9311A12747J5905N195j1769o388Q341n872O655L512l525K476P855O852P388L091
$$ y = [-4117, 2015, -4204, -5998, -429, 6451, 4555, 12471, 13030, 16975, 22517, 4589, 780, 10297, 19794, 10102, 4550, 1257, 10084, 11404, 22595, 31101, 27132, 22833, 24828, 28327, 36544, 41842, 36441, 33048, 38732, 44998, 41706, 36291, 35413, 45537, 43435, 47331, 35260, 25509, 16807, 24420, 38679, 32533, 23040, 22486, 40216, 41602, 30375, 27074, 51306, 68001, 61527, 50368, 42473, 43512, 45974, 55615, 56045, 50282, 49189, 54143, 52511, 57742, 49653, 43152, 30033, 30020, 44283, 40013, 36729, 44794, 52096, 60793, 82957, 79115, 76535, 85669, 100982, 100285, 93577, 89950, 76011, 72081, 68389, 65113, 68881, 78674, 97802, 114759, 109026, 103124, 100245, 111043, 108832, 93711, 95385, 106078, 113549, 114464, 112747, 128652, 133847, 122078, 115690, 124031, 118159, 124814, 128326, 124801, 127277, 135132, 141984, 149372, 152463]
9297A52463K070o09R828k931j1094m50J0894J7253N940o1J104Q879Q615J1822
9283B13723K4495J1843o336J4612P479J5569J2486K1289m002O02J4128J3131J6480
9270C55499L456J7043K1058J8013K2121J6286J2700J9932K4670M7774L0794R076
9258E98422M558K3923L4944K8427J6640L5948K7315M9455M9381L6183M7270O2015
9246A014481L3509K4578N5405P2273N3325O9081O0212O5170Q9184Q1210Q1752
9235A700180P8217P4526Q0097Q5129R4236R3413P5613O9196N9049P0801O2308
9224B542765M5929M1291K1458r532l1880l4040n5953m3343m8790p4032p2878q0612
9212B200383r4373r6540q7427j03703p7164r2020j08409r6075o4963o1568p4146
$$ y = [152463, 154533, 153924, 163752, 160821, 149727, 149277, 160171, 177424, 183364, 183303, 184407, 193286, 201901, 213723, 238218, 250061, 243725, 258337, 265816, 281385, 293871, 315160, 311158, 311760, 325888, 339019, 355499, 358955, 375998, 397056, 415069, 437190, 453476, 466176, 486108, 510778, 558552, 589346, 598422, 602980, 626903, 661847, 690274, 706914, 742862, 770177, 819632, 869013, 905196, 952466, 1014481, 1047990, 1072568, 1127973, 1200246, 1253571, 1322652, 1382864, 1448034, 1537218, 1618428, 1700180, 1778397, 1852923, 1933020, 2018149, 2112385, 2205798, 2281411, 2350607, 2409656, 2480457, 2542765, 2588694, 2629985, 2651443, 2641911, 2610031, 2575991, 2520038, 2476695, 2427905, 2353873, 2280995, 2200383, 2106010, 2009470, 1922043, 1818340, 1741176, 1649156, 1540747, 1444672, 1379709, 1318141, 1243995]
9201A243995p9526p1676m4239n4789m7081m6454n0508l7630m3728m8803m8167
9190F71394m3736j7258k4593k1765k6525l0189l8866k6194j8856o519q084j3546
9178C95263l5666j9777p866j3733j3107L370l982o719k0782k1092o177j2161j0100
9165B27471l727Q323j5163l285n306M84j209k555J071j8594k0062q567q337j1788
9151A38756N936M874m44L483j0305j0089j5690j571J679N02L17n84l047L26j281
9136A12862l43j2355m839K153q807R162J3984J397o719k3284n161J2284q399j8314
9122F3621p020K2547J3105k5266l882m160o265J480q242j7517K0053K4237m966
9109F7725k988M247j353j3975K782J2906J5941o445j6312k710r059P574j815o417
$$ y = [1243995, 1164469, 1092793, 1048554, 993765, 946684, 900230, 849722, 812092, 768364, 719561, 671394, 627658, 610400, 585807, 564042, 537517, 507328, 468462, 442268, 423412, 416893, 408809, 395263, 359597, 339820, 331954, 318221, 305114, 308484, 304502, 297783, 277001, 255909, 249732, 237571, 227471, 223744, 232067, 216904, 213619, 208313, 208797, 207588, 205033, 206104, 187510, 167448, 158881, 150544, 138756, 144692, 149566, 149122, 152605, 142300, 132211, 116521, 114950, 116629, 117131, 117448, 116864, 113817, 114143, 112862, 112519, 100164, 95325, 97478, 88671, 97833, 111817, 113214, 106495, 83211, 78050, 90334, 81935, 63621, 56601, 79148, 92253, 66987, 63105, 58945, 52680, 54160, 45918, 28401, 48454, 72691, 67725, 64737, 68984, 67631, 53656, 56438, 69344, 85285, 78840, 62528, 59818, 50759, 58333, 56518, 50101]
9095E0101J6096j546k1559N180L529q471m545J146l777m629J3749P402q294J254
9081D5636q081j4829R168O733n122L620o79k1088m934J4230J7975J0270l828j4487
9067C4584M537L034j6063k0549o662Q359j3288j157M544P799J1583L821o216K001
9053A6327l125N443j369K089O649J0176J1141J799N350j669j9366k4208r0J6945
9039B6092k793j3629p558j1684J0748J4482J1713r958M899J808N810j0433m936
9026A4561P974j239K827j601k32K403l638j771J316J9548J1145m430q622n429
9012C2812l079o18n120r468j313r158q63Q071N118j0048l321P413J8060l496m029
8997B0961j117l993j7638j3783J2023J8850P225j3193m392j3552M403J5561P676
$$ y = [50101, 66197, 64651, 43092, 48272, 51801, 43330, 38785, 39931, 36154, 31525, 45274, 52676, 44382, 45636, 37555, 22726, 31894, 38627, 33505, 37125, 36446, 15358, 10424, 24654, 42629, 52899, 49071, 34584, 39121, 42155, 26092, 5543, -1119, 7240, -6048, -7205, -2661, 5138, 16721, 20542, 14326, 16327, 13202, 18645, 17276, 19365, 26014, 36190, 47331, 49130, 54480, 52811, 33445, 9237, 9147, 26092, 23299, 9670, 2112, -9572, 1176, 15658, 27371, 17413, 22312, 24120, 29930, 19497, 14561, 22535, 21296, 24123, 22522, 22290, 24693, 21055, 19284, 20600, 40148, 51293, 46863, 38241, 32812, 29733, 29115, 23995, 14527, 13214, 4056, 3193, 11264, 16382, 6334, 3013, 10426, 28486, 24990, 20961, 19844, 15851, -1787, -15570, -3547, 15303, 22528, 9335, 4943, -8609, -4206, 11355, 19031]
8984A9031j9086o630O882K595J985k374k930l279j112J839K3972N188k0762p154
8970a835n948k925Q685m668o406O353J2202j872r082J2638R013P763l197k7026
8956f305J483J6755J817j694M176p325k65n021J652N399J2654J0165p042l291
8942B3158o957L60O79n87M476j3472k884J0638r947J575O024j1851l798O349J1363
8927A5126j2498k979R326O166J1679L771k0342k2253N026J0852J7000K002J572
8914B4448r339n439L421m603m342M089J0934K33j1026p697O326O381k488n684
8900E214O647J0381k357k2827P753L040j769J91J725K757n972j741J0244n364
8886G922o784o57K289K461o374j488J7232P07n214j737r15P329m099N956m43N971
$$ y = [19031, -55, -6685, 197, 2792, 4777, 2403, -527, -3806, -4918, -3079, 20893, 26081, 5319, -1835, -7783, -10708, -2023, -6691, -13097, -6744, 5458, 3586, -5496, 7142, 16155, 23918, 20721, -6305, -4822, 11933, 13750, 12056, 16232, 8907, 8642, 3621, 5273, 10672, 23326, 33491, 26449, 23158, 16201, 16561, 17240, 16653, 21129, 7657, 4773, 15411, 5464, 7039, 13063, 1212, -2586, 3763, 15126, 2628, -351, 8975, 15141, 26820, 30591, 10249, -12004, -6978, 3874, 20874, 22876, 24448, 15109, 9670, 13091, 8488, 4146, 8235, 19169, 19402, 8376, 679, 7005, 13386, 10898, 5214, 11861, 22242, 19885, -2942, 4811, 7851, 6082, 6273, 7998, 10755, 4783, 3042, 13286, 7922, 1138, 481, 2770, 5231, -1143, -2631, 14601, 15308, 10094, 8357, 7442, 14771, 10672, 16628, 16185, 22156]
8870B2156j1934l297K054P05p168j0196j7886L921L829N523Q063J3250R413n336
8856A3097j4475l696O901q4m968n294J6775N373m965J651Q750J0520m548r32o618
8841A7487J754k997j0356M373l812J964J8318n148j5501N606J420q624m279K552
8827B757M530Q430J2437q634j0305j4093J433J4792J2306j559m469r852n411j0895
8813h533K485J4707K431N17P822n651J010J0806q036j3456j5116j281J2499R39
8799A143m812o872N628l748j978L038L483k713j1483J5830M560q820q962J3112
8785b594J6876j316j0633j9966j5643j4279j864K2560l72m185J1016J8122J511
8772g67m869j8716j211p355l414J9190J5301J9147M923r109o175M573j0218J03
$$ y = [22156, 10222, 6925, 8979, 9684, 2516, -7680, -25566, -21645, -17816, -12293, -4230, 9020, 18433, 13097, -1378, -5074, 1827, 1743, -3225, -8519, 8256, 13629, 8664, 10315, 19065, 29585, 25037, 24105, 17487, 19241, 16244, 5888, 10261, 6449, 8413, 26731, 21583, 6082, 11688, 13108, 4484, 205, 2757, 7287, 15717, 28154, 19520, 9215, -4878, -3445, 11347, 23653, 22094, 17625, 7773, 2362, -8533, -6048, 8659, 11090, 11607, 19429, 13778, 14788, 25594, 17558, 4102, -11014, -12295, 204, 1143, -3669, -10541, -4913, -8661, -10639, -7601, -4118, -6831, -18314, -2484, 2076, -6744, -15706, -2594, 14282, 12966, 2333, -17633, -33276, -47555, -49419, -26859, -27231, -31416, -20400, -2278, -767, -5636, -24352, -25563, -32918, -36332, -17142, -1841, 17306, 22229, 13120, 6945, 11518, 1300, 1403]
8758A403O793q478J347J8537n57j6153j2788n219J672J0053Q605l59L358M021
8744A2235K309N820k378n183n522K3255j643j5156p554j1030P313n119R80M545
8730B872p227k804J0627J2131j2922j1223p600J1282J7836J733l987L307N581
8717A9606L292m951k162K678r968M41m395K369K6798k988P653j2545m542O476
8703B7762r33j5033J179P490J2404q500Q0p246j2993O708M043J1248L118j1004
8689A8323j9376p395R367Q045j4796M793O535J7953o929R166J316r89N499n736
8675B5776m169o553j2091J409J8309N68N670k823j0344m700O965p967N276Q73
8661A6199O968j397o077O63k78p923J1264J9960M253o48n266n067k797m88P145
$$ y = [1403, 8196, -282, 1065, 19602, 19045, 2892, -9896, -15115, -13443, -3390, 5215, 4856, 8214, 12235, 14544, 20364, 17986, 12803, 7281, 30536, 28893, 13737, 6183, -4847, 2466, -2653, -1673, 2872, -4355, -7159, 3468, 15599, 2677, -8546, -16146, -4864, 12972, 14705, 10718, 14025, 19606, 22898, 17947, 15785, 18463, 8495, 8936, 4541, 6910, 33708, 30720, 38373, 25828, 21286, 27762, 26829, 11796, 12975, 20465, 32869, 24369, 24449, 17203, 4210, 10918, 14961, 26209, 29327, 18323, -1053, -8448, 919, 8964, -5832, -1039, 5496, 23449, 16520, 25686, 27002, 26013, 31512, 25776, 21607, 15054, 2963, 4372, 22681, 23249, 28919, 26096, 15752, 11052, 18017, 10050, 15326, 16199, 23167, 21770, 15693, 16356, 16078, 8155, 19419, 39379, 43632, 42984, 37718, 32651, 29854, 29366, 36511]
8646C6511K858k190j088J407P135j4322j7981O449J2466j2606j0148J3161J9555
8633D1207P054K3770J5955o234j6813m171j0502j3816K443P874P785R087J3205
8620G6844M045p617o69L037l705j85K276N471R379J2140N766l847J4460J3359
8606A30754j151j57L975J8776J8617J9620J1430L050J3537K2425K4104K6165L6204
8593C27349M5887K9701L3969N8196P7097Q4495P2486P1801O2704O3410M0153L1321
8581I98569J5369n886k9832n9882q3501j21114j21118j09259r9193q6449o3031
8570B34673m1112l0265k8657j7123j4021N135q308k7665j3960o154j6996P650
8558D3197J5959K427J739J115j4413j9117r952N92M514J260m739J1126o026n345
$$ y = [36511, 39369, 37179, 36091, 37498, 44633, 30311, 12330, 18779, 31245, 18639, 8491, 21652, 41207, 48261, 72031, 87986, 81752, 64939, 60768, 50266, 36450, 38893, 46767, 54552, 63639, 76844, 80889, 73272, 72603, 75640, 71935, 71750, 74026, 79497, 88876, 101016, 106782, 102935, 117395, 130754, 129603, 129446, 133421, 152197, 170814, 190434, 201864, 204914, 218451, 240876, 264980, 291145, 327349, 373236, 402937, 436906, 495102, 572199, 656694, 729180, 800981, 863685, 927095, 967248, 998569, 1013938, 1008052, 978220, 918338, 834837, 713723, 592605, 483346, 384153, 297704, 234673, 193561, 163296, 134639, 117516, 103495, 108630, 100322, 72657, 58697, 52543, 35547, 43197, 59156, 61583, 63322, 64437, 50024, 30907, 20955, 21547, 26061, 27321, 22582, 33708, 27682, 22337]
8544B2337j083m777N315k1840j9027L213J9504J8878j9796j1300K495J4611J232
8531I762j0011R761J3162l680P648l598J617M236p017j4602M504J4804k82o76
8517B5628j7815j5816r328J2177J2540l010M496R374j6944m504R856o669K940
8504B925n702l727J1949M605O64Q133j636o898j0671j4350M809J123M34j503j679
8489a1524M310m768j1711J0511J526R731Q078o157m111p981j4771K873r34J847
8475b3081L837L088O890N110m285J3169L323q006P35k513j4223j3833J160J5578
8461a3051J3242L725p481K537o568l262J0304K611R633M273j7568q563O33j285
8447a0820O043R112j1225L906K1977J758j8357q85n719N777O908Q923l550L95
$$ y = [22337, 21254, 16477, 21792, -48, -19075, -15862, 3642, 22520, 2724, -8576, -6081, 8530, 9762, -249, 9512, 22674, 18994, 26642, 23044, 24661, 28897, 21880, 7278, 11782, 26586, 26304, 25628, 7813, -8003, -17331, -5154, 7386, 4376, 8872, 18246, 1302, -3202, 6654, -15, 2925, -2777, -6504, 5445, 10050, 10714, 18847, 17211, 10313, -358, -14708, -9899, -8776, -8342, -9845, -11524, -7214, -11982, -23693, -13182, -11656, -1925, 6153, -4, -4115, -12096, -26867, -23994, -24928, -23081, -19244, -16156, -9266, -4156, -8441, 4728, 8051, 45, 780, -1733, -15956, -29789, -28629, -13051, 191, 3916, -3565, -1028, -7596, -10858, -554, 2057, 11690, 15963, -1605, -10168, -9535, -10820, -4777, 4335, -6890, -2984, 18993, 20751, 2394, 1509, -4210, 1567, 8475, 17398, 13848, 14243]
8433A4243q653M864N653N1M876j2911q979j5902j5771J1282R599P536l199m27
8419g738M327j4582m494L26M538J886P738q062L677J5107n247o404Q119P539M449
8404A1179j712j0344r791J2863j393j2944j4468m941K880o760m708K7168J3547
8391E76o799m00N448J688J1984L343j0189j6622L908J7067o042q908N966P830
8377H850p609K523j0173n350J719J0888P615l346m378j638N357n820L10R431R507
8362A7886M270p488o978j003M676M129j4957q188J253o98j0102R989P416J819
8348B024k261j4710j3187m722R850J5018J7805Q333J429r9J511o219J638J1259
8334B7669K336o274k473O268l553n598j835j116K064o744O8j4226J57K2288n890
$$ y = [14243, 5590, 10454, 16107, 16158, 21034, 8123, -856, -16758, -32529, -21247, -11648, -4112, -7311, -7738, -3411, -17993, -22487, -22161, -17623, -15737, -7999, -16061, -12384, 2723, -2524, -8928, -809, 6730, 11179, 9467, -877, -10668, 2195, 802, -12142, -26610, -31551, -28671, -35431, -40139, -12971, 576, -6223, -6623, -1175, 513, 12497, 15840, 5651, -10971, -7063, 10004, 3962, -4946, 1020, 8850, 1241, 3764, -6409, -11759, -10040, 848, 8463, 5117, 739, -899, 4458, -1362, -1052, 8379, 17886, 22156, 14668, 7690, 6687, 11363, 15492, 535, -7653, -6400, -7098, -17200, -7211, 205, 2024, -237, -14947, -28134, -32856, -23006, -7988, 9817, 18150, 19579, 19480, 20991, 14772, 16410, 27669, 30005, 23731, 21258, 27526, 23973, 18375, 16540, 15424, 17488, 10744, 10812, -3414, -3257, 19031, 13141]
8319A3141J828J6406l671n881j330p91n708M823n618q821J50J195K772R373k242
8304A5626M057o010p228r527P572K098j6530j0874m200P854R938K784K402Q469
8290F431j712K538m946m853J428l279L324l342O335r240L778P176L913O955k250
8275A2256r327R79m484o435O50n429o334J0251N121M347M415j6843J440j2830
8261b2223n336J3330N039q983K223o038L250J2484J2072P505j348q85l528L006
8247A0568j4709j9723o065J0342N848j460l142P111k023q478K674J7043o98j0677
8233a3389K0437r49K321p288J376O988p415j0540K899J2650o88M108M766r640
8219E636j4147r851P919J8244R591j6556O70k219m882p202K093j971q501J713
$$ y = [13141, 14969, 31375, 27704, 21823, 20493, 19702, 13994, 18817, 13199, 4378, 4528, 5723, 8495, 17868, 15626, 19683, 13673, 6445, -3082, 4490, 6588, -9942, -20816, -25016, -17162, -7224, -4440, -2038, 6431, 4719, 7257, 2311, -2542, -1114, -4393, -1069, -4411, 1924, -7316, -3538, 3638, 7551, 14506, 12256, 2929, 3908, -576, -7011, -6361, -11790, -18124, -7873, -2752, 1595, 6010, -10833, -9393, -22223, -27559, -14229, -9190, -18173, -15950, -21988, -18738, -6254, 5818, 13323, 11975, 11090, 7562, 10568, -4141, -23864, -29929, -19587, -13739, -15199, -18341, -11230, -13253, -21731, -19057, -2014, -2712, -13389, 7048, 6099, 8420, 1132, 2508, 9496, 2081, -8459, -5560, 7090, 6402, 10510, 15276, 5636, -8511, -18362, -10443, 7801, 17392, 836, 1506, -713, -5595, -12797, -10704, -12675, -21176, -19463]
8205a9463M766k085N856k736q204j1330N98J0898P154k353J3880O926Q425q331
8191D001r926M428n585K870n919K211N787P526Q460P646j0932N7j545p937N46
8176A688J1262J31r117J615n5M732L136p767k371J881j1187j8467j7797K344J5489
8161b4483Q187O549N973o759P099P425p047q005J787P517J187Q138k528n499P20
8146B61P298k442p242j2310M975O783r176K045O483J800p281j4764p338l353N946
8131b8315K3729O953L024J2265p883j637K582M29R353J387r582Q77k685p057n772
8116b332K560N110k803l935j0032J057j1728L650L549J516J4289P675j0389J5964
8102A4151m384j2408n106k484J3677L673M046K496q528l568j953p146L719L534
$$ y = [-19463, -14697, -16782, -10926, -13662, -21866, -33196, -32598, -21700, -14546, -16899, -3019, 3907, 12332, 4001, -5925, -1497, -7082, -4212, -10131, -7920, -2133, 5393, 13853, 21499, 10567, 10624, 9079, 1142, 1688, 12950, 13081, 3964, 5579, 5524, 10256, 13392, 5625, 3254, 5135, -6052, -24519, -42316, -39972, -24483, -16296, -9747, -3774, -10533, -3434, 3991, -3056, -11061, -9274, -1757, -570, 7568, 5040, -459, 261, 7559, 5117, -2125, -14435, -9460, -2677, -11853, -9808, -3325, -1525, -8806, -23570, -30908, -34261, -28315, -4586, 2367, 5391, 17656, 9773, 8136, 10718, 11147, 20500, 21887, 12305, 13182, 10497, 3440, -2332, 228, 5338, 2535, -1400, -11432, -10375, -22103, -18453, -14904, -13388, 901, 8576, -1813, 14151, 9767, -2641, -7747, -10231, 3446, 7119, 11165, 13661, 5133, 1565, -388, -7534, -3815, -281]
8088b81k223j5828N808K1916R39n323r19r418p185k533j541J1701J9872L222q961
8073I246k931J1283K600j3776j0973J1535J3633L869j7241m002L720n001q23L65
8059A504P277L505J907R150m412m188j3821p21J1501M255O79O690o765j2585Q882
8044A2858L991l127j1221P05N190J7076J983m788j6388k736P967J2419j558J3102
8030C5473R168J260j0777M017K085j1954j248N090q987j0075J2722K842m821P430
8016C2225J3r542j3079L396J0904J0679q405j2502n319N702J3686Q185j2828j5216
8002G899L078P527q735J466L996N771J569M618K0361J1216l484j626J2133N021
7988G0810k427p625q607m816o518J0346m38p427R105j212q707k776p342j3140
$$ y = [-281, -2504, -18332, -12524, 9392, 10331, 5008, 4089, -5329, -12514, -15047, -16588, -4887, 14985, 18207, 9246, 6315, 17598, 20198, 6422, -4551, 6984, 20617, 24486, 7245, 3243, 6963, 1962, 1139, 1504, 8781, 12286, 14193, 23343, 18931, 14743, 922, 201, 11702, 15957, 16636, 23326, 16561, 3976, 12858, 16849, 13722, 2501, 3206, 8396, 25472, 27455, 22667, 6279, 3543, 11510, 23929, 22371, 35473, 44641, 45901, 35124, 39141, 41226, 29272, 28024, 33114, 24127, 14052, 26774, 29616, 24795, 32225, 32238, 22696, 9617, 13013, 23917, 34596, 26191, 13689, 8370, 14072, 27758, 35943, 23115, 7899, 10977, 18504, 9769, 11235, 15231, 21002, 22571, 27189, 47550, 58766, 55282, 53656, 65789, 70810, 68383, 60758, 52151, 47335, 40817, 51163, 50725, 43298, 52403, 51191, 42484, 39708, 32366, 19226]
7974A9226j8910J707N892M078j207l553J0971J1868j053j1686j458K620P725q781
7960A7439L862r474J0948J619J3292L461o30J098j1849n696j1667J231P485J0281
7946C1400j599r525m086l52J1391J8388j18r374j0454m384L846L291L490N327
7932C7241p177j0718j0669m997k952Q576N01k357O946k512j445N722r155L128
7918A0132L413j269j1719M539J4473M506j4120o312N461k85L49l737j530o258
7904b357j2796P956M385Q841q720m140R047j3080p440l76J4558J0058M780M72
7890A1188k761N898J2316j112j3993q812j7612k63Q76J710J0461O786K155J775
7876H612M169p180j501J2846J1988r356j3128O406l662O40N550q232n131J1015
$$ y = [19226, 316, 2023, 7915, 11993, 10786, 7233, 18204, 30072, 29019, 17333, 15875, 18495, 26220, 17439, 21301, 11827, 22775, 24394, 37686, 41147, 40517, 41615, 29766, 24070, 12403, 13634, 21119, 31400, 29801, 20276, 16190, 15838, 27229, 45617, 45499, 36125, 25671, 21287, 25133, 28424, 31914, 37241, 30064, 19346, 8677, 3680, 728, 9304, 9805, 7448, 14394, 11882, 10437, 16159, 7004, 10132, 13545, 12276, 557, 5096, 19569, 24075, 9955, 3643, 9104, 8819, 9168, 5431, 3901, -2357, -15153, -7197, -2812, 6029, -2691, -6831, 2216, -10864, -18304, -18680, -4122, 5936, 10716, 11188, 8427, 14325, 26641, 25529, 11536, 2724, -14888, -15151, -14275, -12565, -2104, 4682, 6837, 8612, 12781, 5601, 4100, 16946, 28934, 19578, 6450, 12856, 9194, 9834, 15384, 7152, 2021, 13036]
7862A3036J6309j158j9946j3825L695J572J1274R41o15k88r158M0o231J44R933
7847E723K466m506J0842m449j2870n277r970J2948J8171R68j2607j1093o626m075
7833b0355N274K7066j6920j5566K299N11N227J2999j2080q737K3908J54k6341
7820b2561Q922J1430j9962K627O904J772l932r33K62N731J1843l37n208J1310
7806G868Q171n817K380r288j4715m659J1298O148J2700N962Q51j8059o764O409
7792B485o23P979Q204n062j6078K350l040j2677M77k031N359L579m589n677K676
7777a6668J7230J5901j1217q529r907j0923r167J886M31Q210N696J8841J2745
7764A4529q042K68L495o869n201k98k567J161K141L147o3l795J96M653O176k40
$$ y = [13036, 29345, 28187, 8241, -5584, -1889, -317, 10957, 11898, 11283, 10995, 1837, 1877, -4354, -4210, 5723, 8189, 3683, 14525, 10076, -2794, -8071, -18041, -5093, 13078, 14046, 1439, -9654, -16280, -20355, -15081, 11985, -4935, -20501, -18202, -17691, -12464, 535, -11545, -20282, 3626, 3780, -22561, -13639, -2209, -22171, -19544, -12640, -10868, -14800, -15733, -15471, -9740, 2103, 1766, -3442, 7868, 16039, 10222, 12602, 3314, -11401, -16060, -4762, 1386, 14086, 20048, 20899, 2840, -3924, 2485, 1862, 9841, 18045, 12983, -3095, -745, -3785, -16462, -15985, -18016, -12657, -9078, -13667, -19344, -16668, 562, 16463, 5246, -3283, -13190, -24113, -33280, -31394, -30963, -22753, -17057, 1784, 14529, 6487, 6755, 10250, 3381, -1820, -2118, -4685, -3524, -1383, 1764, 1701, -2094, -1898, 2755, 8931, 8691]
7748H691J818Q810K326q713O294k3271j6707q200J0677K7541N350j880k4760k0189
7734c2213J4544J6692J5280P855l97p977m020l881O95N324j618L547L595m024
7720A3402j799j91N155P625p303k556l020j3124m818R980J524m093m002o637j16
7705i973K0674n995p395o694L016m426m122k731R955J390J1723J1395R137m903
7691B1051n202k918q789k0443K195J0469R693q465k061p299l34J3027r85R745
7677I684K77P83Q385n545j7795O299k839l396l956K83Q620l454K825P624N929
7662A3724k638j2027j3327k819j340M682J272j5589P569q112K9236K3295r828
7649A4098K115n8j470J048j361o998K63N684P842j1663o99P184j4600k51k0064
$$ y = [8691, 10509, 19319, 21645, 12932, 19226, -4045, -20752, -28952, -18275, 9266, 14616, 12736, -12024, -32213, -17669, -977, 14303, 22158, 21761, 13784, 9764, 5883, 6578, 11902, 10284, 13831, 17426, 13402, 11603, 11412, 16567, 24192, 16889, 14333, 11313, -1811, -6629, 3351, 4875, 782, -3220, -9857, -9973, 10701, 4706, -2689, -9383, -6367, -10793, -14915, -17646, -7691, -6301, 5422, 16817, 25954, 21051, 15849, 12931, 4142, -16301, -14106, -3637, 6056, -2409, -4470, -11769, -12103, 924, -61, 9684, 9961, 10744, 19129, 13584, -4211, 2088, -751, -4147, -8103, -7820, 800, -2654, 171, 7795, 13724, 11086, -941, -14268, -17087, -18427, -13745, -12473, -28062, -20493, -28605, 631, 23926, 14098, 16213, 16155, 14685, 15733, 14372, 7374, 7637, 13321, 21163, 9500, 8801, 15985, 1385, 1134, -18930]
7634a8930j4003j2627N549J3542J7366k849R326l524P875Q231j6507j0168J1184
7621e535J1639P103j0264j3925L03n21J1909N857m969l526k843J616J1704o22
7607G926j2134o700J942q258N662N119J0651R446K238j072j2266j3463j2341N045
7593a8205N524j2067K838J8557J8038r133m773Q204k854o358o253q853k073Q912
7579h496K215P591P384l09M312q800l773o472J101J6185r898j3262O870J2965
7565G613R620p709l933J2088o642p47J6202K807k947j0726j1208J1053j985N127
7551A8613J1324p900j254o777j437m766l849n696q630n213L4M083J1727n445j2902
7536a8088J514L058Q930j2658K30J2321k824n610Q226l290P981O44P404q56R609
$$ y = [-18930, -32933, -45560, -40011, -26469, -9103, -11952, -2626, -6150, 1725, 9956, -6551, -16719, -5535, 6104, 13207, 2943, -10982, -10679, -11200, 709, 6566, 1597, -1929, -4772, -3156, 8548, 7926, -4208, -10908, -8966, -17224, -11562, -6443, 4208, 13654, 15892, 14820, 2554, -10909, -23250, -18205, -12681, -24748, -21910, -3353, 14685, 5552, 779, 8983, 6129, -229, -6482, -15335, -17408, -8496, -6281, 1310, 8694, 8385, 12697, 3897, 124, -6348, -5247, 10938, 1040, -12222, -5352, 7613, 17233, 9524, 5591, 17679, 11037, 10290, 26492, 29299, 26352, 15626, 4418, 15471, 13486, 18613, 29937, 22037, 20783, 14006, 12569, 7803, 3954, -1742, -10372, -15585, -15551, -11468, 259, -5186, -18088, -16574, -13516, -4586, -17244, -17014, -4693, -7517, -13127, -4901, -8191, -210, 434, 7838, 6982, 16591]
7521A6591m477n090l723P33N964J0385O207J160o881l967p822j8836j1182P150
7507a3788M078k590J3443P650o834O48R799q981r036P046O889j3795p137l076
7493a5684J297O992Q990O205j858j1643j3894l885J7076J3559J5622k139j7076
7480C562k442j3767n850p254O444K1966Q66n055r544m721P936R828k317k1519
7466b1867l703J3045J458j1792m127K2445N323j3867m995n003J0568J4133L330
7453D948M251o278j142J4095r152j5579r311J3418R520l175L778N574M719r236
7439F430o377o817K218j0779j6745L592J2058L606j7500J45J345M182J0835J2457
7425a350Q067p335j3966J6702l446q994Q180J980J194N526L165R749J1600o116
$$ y = [16591, 12114, 7024, 3301, 4034, 9998, 20383, 26590, 27750, 20869, 16902, 9080, -9756, -20938, -13788, -9710, -12300, 1143, 8793, 1959, 2607, 12406, 3425, -5611, 1435, 8324, -5471, -12608, -15684, -14387, -7395, 1595, 7800, 5942, -5701, -19595, -23480, -6404, 7155, 22777, 20638, 3562, 1120, -12647, -18497, -25751, -19307, 2659, 3525, -1530, -11074, -15795, -7859, 1969, -348, -21867, -25570, -12525, -11067, -22859, -26986, -4541, 782, -13085, -18080, -23083, -12515, 1618, 4948, 9199, 2921, 1779, 15874, 6722, -8857, -18168, -4750, 4770, 1595, 5373, 10947, 15666, 6430, 53, -6764, -4546, -15325, -32070, -28478, -16420, -12814, -30314, -30169, -28824, -24642, -13807, -1350, 6717, -618, -14584, 2118, -1328, -10322, -2142, -162, 1032, 6558, 9723, 19472, 31072, 24956]
7411B4956j4938j6112p674l689J2903J2596j2235k0885L908o253O649K5649J0293
7398A5168o747j8507r260Q527P970l396L404m953O501J170l043J552j4078N645
7384a0047J405o543J5379R381J02j4262o53m475n212o449Q63Q315L975m653r894
7369b2768J173J789R116Q893L045l47m795r563J0817K4151q4j5490j3024N630
7355a457O577M366p848k3237o234J3609k848J1460J4250M973n726p171M346m906
7341A54p797n106n836l356r03n527Q472N183n545n538k5404l88Q733J8480K7050
7326B672Q496o909j4119m538J1266N712l302L344n99J1367M189j4943j968L997
7312D665q176o539q120J4932P19j8536j4941j0330N596K3036O999l77P020O795
$$ y = [24956, 10018, -6094, -13768, -17457, -4554, 8042, -4193, -25078, -21170, -27423, -20774, 4875, 15168, 8421, -10086, -19346, -10819, -2849, -6245, -2841, -7794, -1293, -123, -3166, -1614, -15692, -10047, -8642, -15185, 194, 9575, 9677, -4585, -5238, -9713, -14925, -21374, -20511, -12196, -8221, -12874, -22768, -21595, -19806, -10690, -1797, 1248, 901, -3894, -13457, -2640, 21511, 21427, 5937, -7087, -1457, 5120, 9486, 1638, -21599, -27833, -14224, -17072, -5612, 8638, 13611, 7885, 714, 5060, 154, -7643, -12749, -18585, -21941, -22844, -28371, -19899, -14716, -20261, -25799, -51203, -51591, -42858, -24378, 2672, 11168, 4259, -9860, -14398, -3132, 2580, -722, 2622, 2023, 13390, 17579, 2636, 668, 4665, -3511, -10050, -18170, -3238, -2519, -21055, -35996, -46326, -40730, -17694, -10695, -11072, -4052, 2743]
7298B743q513k732R064r236J3931R24M998L520k778j7080j0951o330O158J192
7284a5090n014K851J4164l777n103J607j3021m982k047J8153K5723o176j1472
7271d184L909M803j2267K849R665R50j093q126k063j0332K426Q768N398k049q639
7256i985J125J0586q63l887l091r509L691k736n776L743K229R640p573q212N322
7241a5296M876L562Q860N986l571j2021j3322J1353Q906q07j55k743P847p482
7227d007p730J183K02Q484K589K824j1268l825J3072m675K067L888j3q215j1044
7212a6468l533M755J0524p80K806q37j3596j074J4085l258p982J0030K8P58K115
7197b427M803K08q984O322M727j953j3488j249l413j130Q776R715m035J1848J716
$$ y = [2743, -5770, -8502, 562, -8674, 5257, 6181, 11179, 14699, 11921, -5159, -16110, -22440, -16282, -15090, -20104, -17253, -3089, -6866, -11969, -10362, -23383, -28365, -30412, -12259, 13464, 7288, -4184, -275, 4528, -7739, -4890, 4775, 5725, 4632, -3494, -5557, -15889, -13463, -4695, 703, -1346, -9985, -8860, 1726, 863, -3024, -6115, -15624, -11933, -14669, -20445, -16702, -14473, -4833, -12406, -20618, -15296, -10420, -6858, 2002, 7988, 4417, -7604, -20926, -9573, -667, -1474, -1629, -4372, 3475, -4007, -11737, -10554, -10352, -1868, 721, 3545, -7723, -11548, 1524, -3151, -1084, 2804, 2791, -5424, -16468, -20001, -15246, -4722, -5502, -2696, -3533, -17129, -18203, -4118, -7376, -15358, -5328, -5300, -4542, -2427, 2376, 2584, -6400, -78, 4649, 2696, -10792, -12041, -15454, -16584, -7808, 1907, -2128, 9720, 11436]
7182A1436j5651q439p435M124J873O746O774K646M00L898p802o493r991J2757
7168e157O294M66j778p335q410j6151J619J7147R532l35l282o022j0585L370o251
7153b6878L567j305K81Q044J5978K471p038n249R547P731k288j0370N300k288
7139b497j680J5526k729K640k645q868L41R883j7461n097M898K228j75M714n538
7124f460l783m607K039O474Q35J155k147Q943J1548j1776q281k164j807M159Q979
7109C107k25j756J2047J5302o37n912M056J2148n342l2151n20m198J17J0106j5020
7094h878P154J9181Q756k366q825p159j4548k703k038n923J842P976J9549N704
7080A7722r358k340j45K660j4533j5297J855o121L420L294p498J5691J3486p486
$$ y = [11436, -4215, -12654, -20089, -15965, -14092, -7346, -572, 2074, 2474, 6372, -1430, -7923, -17914, -5157, 1137, 1603, -175, -7510, -15920, -32071, -30452, -13305, -3773, -4108, -7390, -13412, -23997, -20627, -26878, -23311, -24616, -24335, -16291, -313, 2158, -4880, -10129, -582, 7149, 4861, -5509, -209, -2497, -4177, 11349, 8620, 11260, 8615, -253, 88, 9971, -7490, -12587, -7689, -5461, -5636, -922, -6460, -10243, -14850, -12811, -6337, -5502, -4347, -6494, 2449, 13997, 2221, -6060, -8224, -10031, -5872, 3107, 2882, 1126, 13173, 28475, 27838, 21926, 25982, 38130, 32788, 637, 117, -4081, -3964, 6142, -8878, -1724, 17457, 26213, 23847, 15022, 7863, -6685, -9388, -11426, -17349, -15507, -7531, 12018, 17722, 8364, 6024, 5879, 8539, -5994, -21291, -19436, -25557, -22137, -18843, -26341, -10650, 2836, -4650]
7066d650p786J568J2037J5414m833K518p720j2882j3523R863j6458m054k706N817
7052b7395J1474Q400m454N171N156o158k96M169N954p901N104N025J1833M980
7038B1062k005n940j1504k078j8009q996J3986J2242K598m084m217L970J1292
7025H317n339l911j2742j4697J0915L683K180j966p012K07l967K016L540j414
7011b0190n092J98J4191O072Q28K1173Q440q654L63o821k348j1561j5626Q921
6997a0106J5307j964k924j148K344q151n012J282Q906q448m907j1784o338P230
6983b5713J5261K052J0751J4044j546n380P327j1306l008r227o423j005p949j431
6969b3553J097P937Q401O923k808K857O460j465M55R73M621J039j9202n666j6446
$$ y = [-4650, -12436, -10868, 1169, 16583, 11750, 14268, 6548, -6334, -19857, -9994, -26452, -30506, -33212, -27395, -15921, -7521, -11975, -6804, -1648, -7806, -8102, -3933, 2021, -5880, -776, 4249, 16082, 21062, 19057, 13117, 1613, -465, -18474, -27470, -13484, -1242, 1356, -2728, -6945, -2975, 8317, 2978, -933, -13675, -28372, -17457, -13774, -11594, -13560, -20572, -20365, -24332, -22316, -18776, -20190, -25282, -25084, -10893, -4821, -3993, 17180, 25620, 16966, 17329, 10508, 8160, -3401, -19027, -10106, 5201, 3237, 313, -835, 1509, -6642, -11654, -10372, -1466, -9914, -14821, -26605, -32943, -25713, -10452, -8400, 2351, 16395, 14849, 9469, 16796, 5490, 2482, -6745, -13168, -14173, -22122, -23553, -22456, -14519, -6118, 805, -2003, 854, 7314, 5849, 6304, 7277, 11898, 12937, -6265, -11931, -28377]
6954b8377j054L145J1356J673l011Q7r894m805l730K1932K8978J384m211o69n141
6939G663k1165P532J5676l528o737q281j2650j986J1041K5877M271J301j9009
6926Ek6528J1041O087J1209J974j1505k544J3526O047j2176j5300l724R838J457
6912a0593L011o43r808J600j069o673n745O926R23K3828J0908k081m268p298J5330
6897A4348j3344j1576O878K8635n145j1669j4394p707k415r12J936L735j859J6342
6883B853J6921p728j4316M17k978m736Q204o873q986M506l019M165J373q631p34
6868a9562M625J1499m38l063R274R490j4410k0321N880P041j3870J4901O204m480
6854g230L600n858M94N258j505k003k892j1937Q895J3016pO542K824q30M320o583
$$ y = [-28377, -29431, -26286, -14930, -13257, -16268, -16181, -26075, -30880, -34610, -12678, 16300, 17684, 13473, 12804, 7663, -13502, -5970, 9706, 6178, -559, -8840, -21490, -23476, -12435, 13442, 17713, 19014, 5, -26523, -15482, -9395, 1814, 3788, -7717, -10261, 3265, 9312, -2864, -18164, -21888, -12050, -10593, -7582, -8225, -18033, -16433, -17502, -24175, -29920, -22994, -22071, 1757, 12665, 10584, 6316, -982, 14348, 1004, -10572, -3694, 24941, 19796, 8127, -6267, -13974, -16389, -17301, -15365, -11630, -13489, 2853, 19774, 12046, -2270, -1853, -4831, -9567, -1363, -8236, -17222, -12716, -15735, -11570, -10197, -18828, -19562, -14937, -3438, -3876, -6939, 2335, 11825, -2585, -22906, -17026, -9985, -23855, -8954, -2750, -7230, -3630, -9488, -8994, -3736, -5241, -7244, -10136, -22073, -13178, -162, -169, 6373, 9197, 8367, 12687, 6104]
6838F104j0680q686o84j147N561M020n236N83J00N776m40N656kj698N870j5655
6822a0558j7204j066n799J1230N756J2328J0814J2326M516j2917n13m102l621
6809A190j6160k1892N901j853l975K094J0199K0642rm178j197j748j821M159R787
6794A139j2325k043J6236K581q835L097l901L751J0113M499n76j2966j0712J1583
6780A641R468q397q580J589J3892Q28j5273j022R392L90J743O790R723K247p262
6765A7169j5257j1260l865J4434J5622J0269P856j5028j8206J385j5038j2392
6753b4311P567Q111M542J2756o493q088n859J4919J5017k852j840j4351O530q648
6739c000j5082J948k893L362j467n772M260J6682O375o460n209j5575J0242Q177
$$ y = [6104, -4576, -13262, -13946, -15093, -9532, -5512, -10748, -10165, -10065, -4289, -4729, 927, 925, -773, 5097, -10558, -27762, -28828, -34627, -23397, -17641, -5313, 5501, 17827, 22343, 9426, 8913, 4811, 1190, -14970, -36862, -30961, -32814, -36789, -34695, -24496, -3854, -3863, -8041, -9238, -10986, -12807, -8648, 1139, -11186, -13229, 3007, 5588, -3247, -150, -4051, -300, 9813, 14312, 13736, 770, -9942, 1641, 11109, 2712, -5868, -4279, 9613, 10441, -4832, -5854, 3538, 3928, 5671, 12461, 22184, 24431, 17169, 1912, -9348, -13213, 1221, 16843, 27112, 34968, 19940, 1734, 3119, -11919, -24311, -16744, -8633, -4091, 8665, 2172, -5916, -11775, 3144, 18161, 15309, 13469, -882, 5648, -3000, -18082, -16134, -19027, -15665, -17132, -22904, -18644, -1962, 4413, -2047, -7256, -22831, -12589, -4412]
6725d412R252P453o84L896m064j2506j4809q134K849O814Q245j4830j4138O679
6711b8389Q093m70n970Q50p44L442P757J1264L837O065o633r796p604m27L50N863
6695a2512O400o672N829n289M076R64N11j4290J2344J8607m28J833L920J688J0050
6680B7031r171j467o973r630k424K393K1614m948n767o668O682J536j991j410
6666H807j1278j185k912o259N216j1550O431J0624j0906l013m416q822R676j970
6652b1557L166n605J0461p458K131l248J2203O324R502N689j5692j7440N800J8171
6638B447J2174j3478n145N725j3797r927n021Q010J1667J6073L372o923j6370
6625a1193k972M479K843Q273k372m692j3489p495P562K438J3992j3663p315P887
$$ y = [-4412, 4840, 12293, 11609, 15505, 11441, -1065, -15874, -24008, -21159, -14345, -6100, -20930, -35068, -28389, -20296, -20766, -26736, -25886, -26630, -23188, -15431, -4167, -330, 5735, -898, -10694, -18298, -18725, -18375, -12512, -6112, -12784, -6955, -12244, -8168, -7204, -6693, -20983, -8639, 9968, 9540, 11373, 15293, 16981, 27031, 17860, 16393, 9420, -210, -2634, -241, 21373, 16425, 10658, 3990, 10672, 12208, 10217, 8807, -2471, -3656, -6568, -12827, -7611, -19161, -12730, -2106, -13012, -16025, -20441, -29263, -19587, -21557, -18391, -23996, -13535, -20993, -18862, -22110, -9907, -3583, 5919, 11608, -4084, -21524, -15724, 2447, 14621, 1143, -4002, 1723, -12074, -22001, -27022, -19012, -7345, 8728, 12100, 5177, -11193, -14165, -9686, -6843, 1430, -942, -5634, -19123, -26618, -19056, -16618, -2626, -16289, -23604, -15717]
6611a5717J0463q622k168Q724K693j871Q880q542j4701R538R335j180k265m807
6597a0240P697K4755o543p729j351n305n893k61M417l633p996J7085P203m031
6583H175j2926m975R735m793n138J1168p383O808L15j1311m967K785N444o882
6569a3945k511l35j7082M499J7475R515j0365K048N936M378p895j472J4417q007
6555c344j5088J713o185j4848o444J2377K0967R719O550p743p668J0510M609K178
6541G303j4920j1789j910M850J3210K239L384J3958J9899j4850r090R597m833
6528A7048j1260n927p666O684Q462J770M283k533n98j437l903j6832M789k787
6514i907o928n77k732k78J6874K788l477L541M051O968o646J890r936J0088J8894
$$ y = [-15717, -5254, -13876, -16044, -7320, -4627, -6498, 2382, -6160, -20861, -11323, -1988, -3168, -5433, -10240, -2543, 22212, 15669, 7940, 6589, 1284, -4609, -4870, -453, -4086, -12082, 5003, 12206, 8175, -4751, -9726, 9, -4784, -9922, 1246, -6137, 671, 986, -10325, -15292, -12507, -7063, -13945, -16456, -16791, -33873, -29374, -11899, -2384, -12749, -10701, -4765, -387, -8282, -9754, 4663, -3344, -18432, -16719, -22904, -37752, -44196, -31819, -10852, -1133, 5417, -2326, -9994, 516, 5125, 7303, -7617, -19406, -21316, -16466, -3256, -1017, 2367, 16325, 36224, 21374, 12284, 21881, 17048, 5788, -139, -7805, -1121, 7341, 9111, 13394, 10861, 10263, 8826, 4923, -11909, -7120, -9907, -16835, -17412, -20144, -20422, -3548, -760, -4237, -696, 3355, 10323, 3677, 5567, -4369, 5719, 24613]
6499B4613l288r628O462Q213q602j0538j3966O451L930K159n710q431k835m701
6485a5871l535J707q445K933J835N904n108P437l916J3534J9842n82j2854n086
6471b205N431m441n423M23Q77k984L586L474k126R455K581L625j4261q665M37
6456a0216P147n555J2091O441O018O163L272l648p157q665j556k7933j4366Q45
6442c7119O871J3091R793Or794K028n1o479J2543P947j426j0499j601J360N783
6427g547O93J0794M394j3161J3068R759j1782r733L115N887q2M678Q336j2636
6413E783j1775k1007R394J8745o508q948k374K2853J3006n658n780j3098j890
6400g257J59N819J2044M70j0894j0408P787P295Q105K56j3596K341J2122j752
$$ y = [24613, 21325, 11697, 18159, 26372, 17770, 7232, -6734, -283, 3647, 5806, 96, -8335, -11170, -15871, -19406, -17699, -26144, -23211, -21376, -15472, -20580, -13143, -17059, -3525, 16317, 15735, 2881, -2205, 3226, -1215, -6638, -6215, -5338, -8322, -4736, -1262, -3388, 6067, 8648, 12273, -1988, -10653, -10216, -3069, -8624, 3467, 9908, 15926, 22089, 25361, 21713, 14556, 5891, 4335, -23598, -37964, -37119, -30248, -17157, -7364, -7358, -17152, -15124, -15175, -21654, -9111, -1164, -2590, -13089, -14690, -13330, -7547, -6854, 3940, 8334, -4827, 8241, 18000, 6218, -3515, -400, 5487, 5405, 10083, 18419, 5783, -5992, -26999, -17605, 1140, -5368, -14316, -16690, 6163, 19169, 13511, 7731, -5367, -7257, -7098, -1279, 10765, 11235, 341, -10067, -2280, 5015, 13120, 13376, -220, 2121, 14243, 12491]
6386A2491O32M345m293o080j506P44J998p34p955j7994o55Q999J2655J1029m907
6371H769j3716r318L07k761J3654K733j325n76j0257o705k689J0871O588l067
6357g492j038p659n371K243J6201k762M42L907q02m443L527Q320r461j5565L652
6342a6301J4652J2572j722r885p259m589J3137O288m672l615J0674J4354J609
6329B5243k650m160P41l146m061r103o910P789J3484o232L49k340r629K585k415
6314d55K83n433J404k086K361j404J1164J4852j45r205r388o927J0934r542j2407
6299a5994N057J0534o099j3930J5163K2679p511q208m396j557L258j9804k287
6286b3095J1394j115O536J082K540l227n135j2324J165J7982L357j6601n556M88
$$ y = [12491, 13123, 17468, 13175, 7095, 5589, 6333, 8331, 7597, -358, -18352, -19007, -10008, 2647, 13676, 8769, -4947, -14265, -13958, -16719, -3065, -332, -1657, -2233, -12490, -19195, -21884, -11013, -4425, -7492, -8530, -16189, -21560, -19317, -3116, -5878, -5436, -1529, -2331, -6774, -3247, 5073, -4388, -19953, -16301, -1649, 10923, 9201, -684, -7943, -12532, 605, 6893, 2221, -1394, 9280, 23634, 25243, 22593, 18433, 19174, 16028, 11967, 2864, -4046, 3743, 17227, 10995, 11344, 9004, -625, 1960, -455, -172, -5605, -4201, -6287, -3926, -5330, 5834, 20686, 20541, 11336, 1948, -4979, 5955, -3587, -15994, -10937, -403, -6502, -20432, -5269, 17410, 9899, 1691, -2705, -4262, -1004, -20808, -23095, -11701, -12816, -6280, -5198, -2658, -5885, -11020, -23344, -22179, -4197, -840, -17441, -22997, -22509]
6272b2509l311K5054J9527n945p447q756k203J2825r673p983Q581K0981K683j3512
6258H312j0290J0961J456J0218r197o173R482L379j417k3861j134J1159J0508
6245A3403L410J360j8330K236J898N873o626j4841K306l773M700P781o310p025
6231a3938J6248P569J098q979K035M405j027q191P898J086Q043J3519K835k756
6217B9845j9152r694L602j8078J2036J4037m357j294N969l3j6850j2629J7129
6204E31J431o356j0593r93o980j989R109N210J6494J9086j1049o299P624k018
6190A3208q035P696l299j4538k044Q233K463k0085Q017k930M186N032J24M70p150
6175h652L272M699l58o319L324J6890Q234m957n514j4931r147k114j5840R074
$$ y = [-22509, -25820, -766, 18761, 12816, 5369, -3387, -5590, 7235, -2438, -10421, -1840, 19141, 21824, 8312, -1978, 8983, 10439, 20657, 11460, 5287, 14769, 18148, 16731, -7130, -8264, 2895, 13403, 16813, 18173, -157, 2079, 3977, 9850, 3224, -11617, -9311, -13084, -8384, -603, -6913, -13938, 2310, 9879, 10977, 1998, 4033, 8438, 7411, -780, 7118, 8204, 16247, 29766, 32601, 29845, 10693, 999, 4601, -13477, -1441, 12596, 8239, 6945, 12914, 12881, -3969, -16598, 531, 1962, -4394, -14987, -15980, -22960, -24949, -15840, -10630, 5864, 24950, 13901, 7602, 15226, 13208, 5173, 12869, 9570, -4968, -7012, 1221, 3684, -16401, -8384, -11314, -7128, -2096, -1972, -1502, -8652, -5380, -681, -1039, -7358, -4034, 12856, 21090, 16133, 10619, -4312, -13459, -15573, -31413, -22339]
6161b2339K9325O411p373k1407k7241Q898Q647J0708J2979Q818N126p686p485
6148b619N804Q81j1324j0520J322j963o126L447N296O237o784R107Q300j1766
6134a0708L86J876j458Q76O395l633Q274j3447j360J636R49J2354m360j7002R618
6119i604p426n545l624Q141L827J0475n266K19O461r915O019L341q793j1749q183
6104c1622L922R15j0087L120R11J6293K2793m175j2079j1542j915K556J5870K1598
6090A6558L217j5668j5638j0918O410n066K136m778R598j33p91K873j0955j4592
6076c7747K5385J6443k411j3098M443Q667r206r835J0365O568K414J2709J640
6063A6337j4133p004K110p716M830J2151r349k3929L676P170J7046R834k263K126
$$ y = [-22339, 6986, 13397, 6024, -15383, -42624, -33726, -25079, -14371, -1392, 7426, 12552, 4866, -2619, 3185, 4066, -7258, -17778, -16456, -18419, -24545, -21098, -15802, -9565, -16349, -7242, 1058, -10708, -10322, -8446, -9904, -9028, -2633, -6266, 2008, -11439, -12799, -11163, -10214, 2140, -2220, -19222, -9604, -17030, -22575, -26199, -18058, -14231, -3756, -9022, -8803, -2342, -12257, -6238, -2897, -11690, -23439, -31622, -27700, -26785, -36872, -33752, -32841, -16548, 6245, 2070, -10009, -21551, -23466, -20910, -5040, 16558, 19775, 4107, -11531, -22449, -16039, -21105, -18969, -23747, -14149, -14282, -15073, -12200, -23155, -37747, -12362, 4081, 1670, -11428, -6985, 1682, -7524, -17359, -6994, -426, 1988, 14697, 16337, 2204, -4800, -2690, -10406, -5576, 6575, -2774, -26703, -23027, -15857, 1189, 11023, 8760, 10886]
6049A0886j25k664R63n354j1274j3556M728K99J1714r332o046P857J1046k511
6035c369m705k941M669M308l855p385j3737n162J8030J5788n102j4215J0929O968
6021B21K660o028j3576q402M876Q375J1157Q103P682j0386j7924j0929j3419J1524
6007b6066J7756j0177N284J3866j3940q098Q612M030M381k549J1748l112p432
5994e697j0343N218J4387j8167q775p392m759P5J3444K8099J2752j1296Q900m813
5980A1633L342Q395L172j8033j2004p412l213J266K019J0190o509M011N835j2294
5966i602K380Q08R66J748K8226l198j5338k554M39m945n922n562L098L783N298
5951c75N835K883j7957m360P829J855O876n730j004p419j0389N878O888K503j321
$$ y = [10886, 10761, 8097, 9060, 3706, -7568, -21124, -16396, -16097, -4383, -13715, -19761, -11904, -858, -3369, -8074, -11015, -6346, -2038, -5893, -13278, -27015, -32177, -14147, 1641, -3461, -17676, -6747, 221, 2881, -3147, -16723, -25125, -20249, -11874, -717, 7386, 15068, 4682, -13242, -24171, -37590, -26066, -8310, -18487, -13203, 663, -13277, -21375, -12763, -8733, -4352, -6901, 4847, 1735, -5697, -16040, -10822, 3565, -14602, -23377, -30769, -35528, -35453, -22009, 6090, 18842, 7546, 16446, 11633, 14975, 23370, 26542, 8509, -3495, -10907, -14120, -12854, -10835, -645, -7154, -3143, 2692, -9602, -7222, -6414, -5448, -3700, 24526, 21328, 5990, 3436, 3875, -1070, -6992, -12554, -9456, -5673, -375, 5460, 8343, -9614, -13974, -6145, -4290, 2586, -3144, -4148, -11567, -21956, -16078, -9190, -6687, -8008]
5936h008n782J428J0282L082J170l689J0071J7866q190k1980K128K1929p683M076
5922A6700o421k1234n806J0284P806J597N203KJ922J1822J866m652r22j4041k355
5907A771Q451n258j1647K100M696M589O667q076j7250k525J642J151k067O106
5893i650R568p867r403j2709K528L961N858Q441P512K422o28J8610Q935o45j4386
5878A2547j5404j1373K921N382L283P617j0419j4232j509o04p386j160K1148J5674
5864F485M326j5736m092k568J536L616j0606k852l380J0600R358n061p651O357
5850i668k448K853m693J0773N157Q403j0719j0463k111P070k441l350k08j0658
5836b2503J271J909J4051P162n08L33k5624r097P652J5773L030L830j2027R113
$$ y = [-8008, -13790, -12362, -2080, 1002, 2172, -1517, 8554, 26420, 18230, -3750, -1622, 20307, 12624, 16700, 10279, -10955, -16761, -6477, 1329, 2926, 8129, 8131, 10053, 21875, 23741, 19089, 18167, 4126, 1771, 10222, 4964, -6683, -4583, 113, 4702, 11369, 3293, -13957, -16482, -14840, -13689, -15756, -9650, -82, -7949, -17352, -30061, -27533, -23572, -17714, -9273, -1761, 661, 33, 18643, 27578, 26933, 12547, -2857, -14230, -11309, -5927, -2644, 4973, -5446, -19678, -21187, -21791, -29177, -30337, -9189, 6485, 10811, -4925, -9017, -11585, -10049, -6433, -17039, -19891, -23271, -12671, -3313, -8374, -16025, -9668, -12116, -9263, -13956, -3183, 1974, 10377, -342, -10805, -12916, -5846, -8287, -11637, -11845, -22503, -21232, -19323, -5272, 1890, 1382, 1715, -23909, -33006, -25354, -9581, -6551, -2721, -14748, -5635]
5822e635M932N030K636j1526j0023N309L623L208n23r757k0019K2856K3270j906
5808A1475k3229q398M399O885j3663q55J036Q211M842m120M170j637n952M719
5794a2117J8119j1113l080k029O328p051m715Q418O388P608K65m060j857j4553
5780a3449k1287J736K5469J712l03M553j2419J0166J6148K472l351M556L468N485
5766B4956N87q428q149J247p983n082N333J646m381j0462k121k093j350O005j816
5751a2091q95p98q699J635L125O317O659q614Q357J4685j3001p307j2681o788
5737c0096L662j127L898J2578J4803K680j4626K921Q134p328J906J909j3966J0628
5723d024N727p119J166M223M456j6009j364J6874J389j2723r10O315r506j6869
$$ y = [-5635, -703, 4327, 6963, -4563, -14586, -9277, -5654, -2446, -2969, -12726, -32745, -9889, 13381, 11475, -11754, -20152, -15753, -8868, -22531, -23386, -22350, -14139, -9297, -13417, -9247, -10884, -16836, -12117, 6002, -5111, -8191, -10220, -3892, -10943, -15658, -7240, -852, 6756, 7021, 2961, 1104, -13449, -34736, -33000, -7531, -5819, -6122, -1569, -13988, -3822, 12326, 14798, 11447, 16003, 19471, 24956, 25543, 17115, 8966, 10213, 2230, -2852, 2481, 4127, -254, -10716, -12837, -14930, -16280, -10275, -12091, -12986, -13784, -22483, -20848, -17723, -11406, -4747, -13361, -5004, 9681, -3320, -10627, -23308, -30096, -26434, -27561, -23663, -11085, 3718, 6398, -8228, -5307, 2827, -4501, -2595, -686, -14652, -4024, 1703, -5416, -4250, -27, 4429, -11580, -12944, 3930, 5319, -7404, -8314, -1999, -11505, -28374]
5709b8374j0114P769J5018J4977l255M932K424p416k006K274J530R743L023M91
5695A1016j1124k6767J311J8707J1235m03m741j0614p893J283r43m786L699l742
5681b3762P940J0949n637M71j8189o173K5843Q488k1742k987K2065j231j2777
5668a6742J002n86j760N361L873J562k886J5682N512p341j0562j6699m552K0061
5654h075K282m51J276J0114J1168k056j793L269O702P24m039j1755j5165J0834
5640C035P623J614o560l829J24J2245J4448p494n77j5420Q96n259N276j197J837
5625F762r270k6166o429k62J568R982K6535J2173l793j3123L923m276j2038Q162
5611f252J1816L804k8311j0061R106l17M799N647p041J6325L438q603N98K810
$$ y = [-28374, -38488, -30719, -15701, -724, -3979, 953, 3377, -4039, -6045, -3771, -2241, 7502, 10525, 11016, -108, -26875, -25564, -6857, 4378, 3975, -766, -11380, -19273, -17990, -18933, -23719, -20020, -23762, -15822, -4873, -10510, -10039, -28228, -34401, -8558, -70, -21812, -24799, -2734, -3965, -16742, -15740, -16326, -18086, -12725, -8852, -7290, -10176, 5506, 11018, 3677, -6885, -23584, -28136, -8075, -5793, -6244, -4968, 5146, 16314, 14258, 12465, 15734, 22436, 23160, 19121, 7366, -7799, 3035, 10658, 12272, 5712, 1883, 2007, 14252, 28700, 21206, 20629, 5209, 6105, 846, 6122, 4925, 6762, -2508, -28674, -35103, -35365, -33797, -23815, 2720, 14893, 11100, -2023, 1900, -2376, -14414, -6252, 5564, 9368, -18943, -29004, -19898, -20215, -15416, -9769, -16810, -485, 2953, -5650, -5052, -2242]
5597b242q585o988J8977J9808l147r181k91J500n176q3n667m164k423M520J074
5582b068j144J1233K089j7641q192q524O689P340j2670l531Q695Q578P049K266
5568A69k6k467Q642M96q336r628K799R949K544j1094j0572J1644L754k1883N145
5553a8864J6451j1543j583Q443m565J2180L471J062j8403q786n392l025L473J0279
5539a6802J1000j2267K313J1032k218j6432o12L343o088k188p56Q026J6524m944
5525a0069J583j695n45J8522J4609j636r702j1159l04m695O700Q586j866j3173
5511d844P196l502j29Q290k134K162N589n593M54o568q703j5072l978J0541L151
5496a3140p086J0342J3935M705j7628j0544r544K2220Q038L964L995J0721L463
$$ y = [-2242, -10827, -17815, 1162, 20970, 17823, 8642, 8351, 9851, 4675, 4592, -1075, -5239, -7662, -3142, -2068, -3212, 8021, 10110, -7531, -15723, -24247, -17558, -10218, -22888, -26419, -17724, -9146, -2097, 169, 143, -2324, 6318, 6814, -1522, -11150, -8351, 1598, 4142, -6952, -17524, -5880, -2126, -24009, -18864, -2413, -13956, -15539, -7096, -11661, 519, 3990, 5052, -13351, -22137, -27529, -30554, -27081, -16802, -5802, -18069, -15756, -4724, -6942, -23374, -23986, -20643, -26731, -28919, -29675, -21649, -5125, -10069, -8486, -10181, -10726, 7796, 22405, 20769, 11067, -92, -396, -5091, 1609, 10195, 8329, -4844, 2352, -1150, -1279, 7011, 4877, 7039, 12628, 7035, 7489, 921, -7782, -22854, -26832, -16291, -13140, -20226, -9884, 4051, 8756, -8872, -19416, -28960, -6740, 1298, 5262, 9257, 19978, 23441]
5483B3441m156j7551p136m562J508J0616J0328M285l787r831m679J12K1N055O46
5468D310o497j1098J0241J6772p146L731l541q68O934p742j5215n433L335L78
5454a1839j1856k579p48J3646J2205M254m981J292M746J6395n517k235m749k2350
5440a4316p665J9419J2681j3147o074m534N663L821j5703N235J4488p021k580
5427i733J2591J996p208j327M343l81K971n631j2039L878J2107M094J0095L640
5413A9396j2081o297K286N73J451P376r389o295L052J193M145p720j7075M996
5399a4389K301J5074n286J3587k755k133l437N502J0050K981n683n748m397M184
5385I851q531J742q206P428m272k036J132o621O804R362M105j5240n480K6108
$$ y = [23441, 19285, 1734, -5402, -9964, -8456, 2160, 12488, 16773, 12986, 3155, -1524, -1412, -1391, 3664, 4310, -2187, -13285, -3044, 13728, 6582, 10313, 6772, 5904, 12838, 5096, -10119, -15552, -12217, -11839, -23695, -26274, -27022, -13376, -1171, 3083, -1898, -606, 4140, 20535, 15018, 12783, 8034, -14316, -21981, -2562, 10119, -3028, -9102, -13636, -7973, -4152, -19855, -14620, -132, -7153, -9733, 2858, 4854, -2354, -3681, 662, 281, 3252, -2379, -14418, -10540, 1567, 5661, 15756, 19396, 7315, 1018, 3304, 3877, 5328, 12704, 3315, -2980, 72, 1265, 5410, -2310, -19385, -14389, -12088, 2986, -2300, 11287, 8532, 6399, 2962, 8464, 18514, 21495, 15812, 10064, 5667, 9851, 1320, 3062, -5144, 2284, -1988, -4024, -2892, -9513, -2709, 6653, 10758, -4482, -9962, 16146]
5371A6146N321m531j5352k252J5678p990j9379L386Q609k067n71m795L496J105
5357c196q49N760J2603l790o993N153J720o776n17J5393Q649j3178j3873q774
5343h668m939L176J2298R146n312k6056j1674O402J7978J0202M555P737Q749l37
5329B3257p697j902j0398q580k970l357j5712Q002J4988n918p744O735M205P920
5315H29J0840k592j7962k904o086j065Q65R555J2518J513O822j142o770P519J0351
5300B2291L111n404j7050j4977l267P450Q276m968K973r889m747K4522J1352m147
5286A5526j4145o616o399o330K758J3625J7058l826n645J3971O480r280j8853
5273a676m548L785K782P101l430L469L912j1745o021n271n086l945O698N032p142
$$ y = [16146, 21467, 16936, 1584, -668, 15010, 7020, -12359, -8973, -364, -2431, -3002, -7797, -4301, -3196, -4045, 1715, 14318, 10528, 3535, 8688, 10408, 3632, 3115, 18508, 27157, 13979, 106, -8668, -13607, -10431, 1867, 11013, 5701, -20355, -32029, -25627, -7649, 2553, 7108, 14845, 23594, 23257, 15560, 13658, 3260, -5320, -8290, -11647, -27359, -19357, -4369, -10287, -18031, -11296, -7091, 829, 11669, 9077, -8885, -11789, -17875, -18940, -18075, -8520, 3998, 5511, 12333, 11191, 4421, 11940, 22291, 25402, 19998, 2948, -12029, -15296, -7846, 430, -4538, -1565, -11454, -16201, 8321, 19673, 15526, 1381, -5235, -11634, -17964, -15206, -1581, 15477, 11651, 6006, 19977, 26457, 17177, -1676, -6224, -2439, 343, 7444, 4014, 7483, 11395, -350, -6371, -11642, -16728, -20673, -13975, -8943, -16085]
5258a6085K391P078k928M959q18j3193k009J5283J1873m91N072j5661l677Q33
5244g373j283k162O059J3980p047L498K983n171M45K39R297m124J4668j1181o074
5229F754k864n803l743J474j987J2931J226j4721M699j092k2762P199J5123M832
5215A266j5359L157L758O922N123M252m821l315k083K115j1587k355J372L86L865
5200g304K895n335j022R911q695m759M834J101J3126J222K797K97R48O934l336
5185A3614L198l392k0456k331J1889j1258r587m818n555J4583n186r225Q120K465
5171a7939J070o40J338J5165K0255l155j1082l725P451J783j8714q899k061K817
5157a6336N810N765l496j0770O560l976j534K227m44Q382J1213j0630M536K276
$$ y = [-16085, -13694, -6616, -9544, -4585, -5403, -18596, -20605, -5322, 6551, 6060, 11132, -4529, -8206, -7373, -8656, -10818, -4759, 9221, 2174, 5672, 8655, 3484, 3929, 4168, 13465, 9341, 24009, 12828, 6754, 3890, -1913, -5656, -4182, -6169, 6762, 7988, -6733, -2034, -3126, -25888, -18689, -3566, 1266, -14093, -10936, -7178, -256, 4867, 9119, 4298, 983, -1100, 1015, -10572, -12927, -11555, -11169, -7304, -4409, -9744, -10766, -855, -9550, -14309, -9475, -8374, 4752, 5974, 8771, 9068, 10016, 16950, 13614, 16812, 13420, -7036, -9367, 2522, -8736, -18323, -23141, -28696, -14113, -19299, -28524, -20404, -17939, -16869, -17509, -16171, -1006, 19249, 16094, 5012, 1287, 8738, 10521, -8193, -17092, -19153, -16336, -10526, -4761, -8257, -19027, -12467, -16443, -17977, -15750, -16194, -7812, 3401, -7229, -2693, -417]
5143d17k378q340R482M467k3862j4152J906P917J4051J1913L485J1333J5246o949
5129B3702j8621j0199O083J0796M852j2399m407P430J287j0719m861o217l978
5116a7251Q769j0515j2564J6525J5508R35l723j843J0154J0512P765J835j4349
5103A1758r615j637P975k106j320l935J970o006p525K98J4775K081j015l711m988
5088c001N743O880N751M405J373p055j1441j530l812O309R38j967k666J945l908
5073b036j31M191j1932j0208K363J3255J3665n490j4312j6450P923J2373J3370
5060F581K2481J756J060o765j2498j9818J248J0712Q940L304n086j3871q951P173
5046c734K289J783Q158m209p959j0236j1431M589J7475J3755q214j7137J7666
$$ y = [-417, -2795, -11135, -1653, 2814, -21048, -35200, -33294, -25377, -11326, 587, 4072, 15405, 30651, 23702, 5081, -5118, 965, 11761, 16613, 4214, -193, 7237, 8524, -2195, -7056, -13273, -17251, -8482, -18997, -31561, -15036, 472, 1407, -2316, -4159, 5995, 16507, 24272, 26107, 11758, 2143, 506, 8481, 6375, 5055, 1120, 3090, -2916, -10441, -10143, 4632, 6713, 5698, 1987, -3001, 2742, 9622, 15373, 19778, 21151, 14096, 2655, 1125, -2687, 3622, 4560, 2593, -73, 1872, -2036, -2167, 2024, -9908, -20116, -17753, -4498, 9167, 3677, -10635, -27085, -19162, -6789, 6581, 29062, 30818, 31878, 25113, 12615, -7203, -5955, 4757, 13697, 17001, 11915, -1956, -10907, -3734, -1445, 338, 8496, 4287, -3672, -13908, -25339, -20750, -3275, 10480, 2266, -14871, 2795]
5033B795J2451j2468j0282J0424J0104r251m090o480j959R868J879k660j406j0901
5019a1976j3648J2846J6894l360R188m055j8639p081N129Q776O098l799P20R024
5005F117M158m122j6904j2806l471L069K533J0088K2580l428J716r314m332n832
4991i948q310J0566j912o054j3042J927J1140K0079L1345O932r735m076j8917
4978I995j4885M646n77o412Q621O763J464n296m588N955j3860j4211k177j2796
4964c7358n234R992J4263J889L696M145l686J49j5979O211R122K036r277J2095
4950g936J1205P51N5j07P099m036K686K225m673n205j1104J885J6847q749r291
4935h348J883J9328M616J091J94j5270j6494k887J6019j180m467j782o987M865
$$ y = [2795, 15246, 2778, -7504, 2920, 13024, 3773, -317, -6797, -8756, 1112, 2991, 331, -1075, -11976, -25624, -12778, 4116, 756, 9944, 5889, -12750, -19831, -14702, -5926, 172, -3627, -2907, 6117, 10275, 6153, -10751, -23557, -27028, -23959, -21426, -11338, 11242, 7814, 9530, 216, -4116, -9948, -18258, -7692, -9604, -15658, -28700, -26773, -15633, 4446, 35791, 42723, 32988, 28912, 9995, -4890, -244, -821, -7233, 1388, 8151, 9615, 4319, -269, 5686, -8174, -22385, -24562, -37358, -42592, -32600, -18337, -16448, -12752, -8607, -12293, -12144, -28123, -21912, -12790, -10754, -20031, -7936, 3269, 4020, 4075, 3968, 11067, 7031, 9717, 11942, 7269, 2064, -9040, -7155, 9692, 943, -8348, -6465, 12863, 17479, 18570, 18764, 3494, -13000, -15887, 132, -1048, -5515, -7297, -14284, -9419]
4921i419J6750Q995q939q228J0999P564j2892l675M866O41l238o186r037K0672
4907H873J937k57K049j4593r574K922n774k2657K793N028o040J6820J2418N952
4893a03K795N826P968p956m11p461P230p570q950p035j425k198J8401J0805j2143
4878b227L879J0776J946l128j01L663r131j0459M146P422r704m666J3080n239
4864B57q371Q141k098P040P460O449j764j6089o688r063L030O744N080J0659O075
4849A6862j983q997l123N60k682J6716K822j2531o804j71Q997J529j1374r019
4835i198n871M790M287p494N614K1973L902q619o859o996r955Q574P010O143q216
4820i15R69J9236r719j2113o443j008J870k872J0483l342p409p631J8428n488
$$ y = [-9419, 7331, 16326, 7387, -841, 10158, 17722, 4830, 1155, 6021, 6662, 3424, -2762, -11799, 8873, 10810, 10553, 12602, -1991, -11565, -8643, -14417, -37074, -34281, -29253, -35293, -18473, -6055, -103, 2692, 8518, 16486, 8530, 8119, 658, 7888, 318, -8632, -15667, -17092, -19290, -889, 9916, -2227, 1652, 12428, 14374, 11246, 11145, 14808, 5677, -4782, -636, 6786, -2918, -7584, 5496, 257, -8114, 27, -2071, 4969, 12429, 18878, 17114, 1025, -5663, -14726, -11696, -4952, 128, 10787, 16862, 14879, 5882, 2759, 3319, 637, 17353, 20175, 7644, 840, 669, 9666, 11195, -179, -9198, -15069, -10279, -5992, -13486, -7872, 14101, 18003, 9384, 2525, -4471, -14426, -5852, 1158, 7301, -915, 54, 19290, 9571, -2542, -8985, -9993, -8123, -10995, -512, -3854, -11263, -18894, -466, -5954]
4806e954N28N995j605O53O387J896j5345J879o388L718J1903P672k4489R52K303
4791i895R222N070j728l760n123o784m948K305p331n139P763M363L599P379J4539
4776I532L073J1679J435j3178j864o450j0672k731j5660N691J233L269M863M78
4762i302J361m579j774J3729L785Q023M945j2932j7553Q693J5700m354o980j005
4748b243l740L976l802j0261J564J7022K284j0939m326o193j3024n477M110N908
4734b5141r84M084P660K996j536R867R792J0721O828J3260k090j4020j0225j8590
4720g378o356J7286M916m225O665J0001n190J396o184r258k306j1517r394O311
4706a5233J0311L88M336l265J1086j3707j3287J0514L618L619q745o565P062q089
$$ y = [-5954, -5426, 569, -1036, -383, 6004, 7900, -7445, -5566, -11954, -8236, 3667, 11339, -13150, -12198, -9895, -673, 4397, 2669, -1091, -6214, -12998, -17946, -15641, -22972, -28111, -20348, -15985, -12386, -5007, 9532, 12605, 24284, 25719, 12541, 10677, 4227, -6445, -9176, -24836, -19145, -17912, -14643, -9780, -9302, -7941, -12520, -14294, -565, 3220, 11243, 16188, 3256, -14297, -5604, 10096, 5742, -1238, -2243, -5983, -2007, -5809, -16070, -14506, 2516, 4800, -6139, -10465, -16658, -29682, -35159, -31049, -25141, -26125, -22041, -14381, -11385, -12921, -3054, 6738, 17459, 24287, 37547, 35457, 21437, 11212, -7378, -13734, 3552, 8468, 4243, 10908, 20909, 15719, 17115, 10931, 1673, -633, -12150, -21544, -15233, -4922, -4534, -198, -3463, 7623, -6084, -19371, -8857, -5239, -1620, -10365, -16930, -9868, -17957]
4692a7957k65J8449J5042j693o573j878J7267J4799m355j6726n009q435K2361
4679B5027P763j1925j3993o660k347j319l402J0412q343m536K941k144p396m787
4665b0709K3024L308q553m628o867j0204l566n63L433Q273J0010J5668J6464J4362
4651C9452m7m497k0335p439M916k179k127o379k364p251l439L576Q176j0000Q44
4636i093j1719j0095R003J0330J4167J0856j7739j227Q894j276k333j1104J367
4623i969j887j1157K802Q114Q470m765l355R944O529m920o514j504l246j196j463
4608a4117K713m428j943M302Q063K625N089r240k217J0441P018Q208K372p480
4594A1406J927o142k622m488m250m954j633M407J0750L590K638l001j3551q112
$$ y = [-17957, -18222, 227, 15269, 13576, 7003, 5125, 22392, 37191, 32836, 16110, 11101, 2666, 25027, 32790, 20865, 6872, 212, -2135, -3454, -6856, 3556, -4787, -9323, -6382, -8526, -15922, -20709, 2315, 5623, -2930, -7558, -14425, -24629, -28195, -28758, -25325, -17052, -7042, 8626, 25090, 39452, 39405, 34908, 14573, 7134, 12050, 9871, 7744, 1365, -999, -8250, -11689, -8113, 63, -9937, -9093, -20812, -30907, -21904, -11574, 2593, 13449, -4290, -5517, 3377, 2101, -232, -11336, -9969, -11856, -23013, -20211, -12097, -3627, -8392, -11747, -1803, 4726, -194, -6708, -8212, -11458, -12654, -14117, -11404, -15832, -17775, -13473, -5410, -2785, 2304, -6936, -9153, 1288, 8306, 16514, 18886, 11406, 13333, 7191, 4569, 81, -4169, -9123, -10756, -6349, 4401, 7991, 10629, 7628, -5923, -14035]
4580a4035Q297q461j2807M301L440k015K2523P185J6845j135q547j3496j0096
4567h001r83o311J474J2333N549N787k462n899J1422o17k0945n632N18M774M431
4552d562J4819J6034O723m219j6801q885p153J585j061k1727o716Q094L757k760
4538b2872J2633m364J489Q615l572q287P574M163N122J109L001O151N101m120
$$ y = [-14035, -5738, -14199, -27006, -22705, -19265, -21280, 1243, 8428, 25273, 24138, 15591, 2095, -8001, -8984, -15295, -13821, -1488, 4061, 9848, 7386, 1487, 12909, 12292, -8653, -14285, -13767, -8993, -4562, 10257, 26291, 33014, 28795, 11994, 3109, -4044, -2459, -3520, -25247, -31963, -23869, -20112, -22872, -10239, -14603, -13114, -4499, -8071, -16358, -8784, -4621, 501, 1610, 4611, 10762, 15863, 11743]
$$ [...]
##END NTUPLES=NMR SPECTRUM
##END=
