##TITLE=Analysis number 318899
Compound Code cc 00287
Project Code adrs
Chemist Name prosynth
##JCAMPDX= 6.0         $$ Bruker NMR JCAMP-DX V2.0
##DATA TYPE= NMR SPECTRUM
##DATA CLASS= NTUPLES
##ORIGIN= Bruker BioSpin GmbH
##OWNER= nmr
$$ XWIN-NMR		Version 3.5
$$ Mon Apr 24 12:26:31 2006 GMT Daylight Time (UT+1h)  MAYBRIDGE\nmr@NMR_250MHZ
##.OBSERVE FREQUENCY= 250.131544655141
##.OBSERVE NUCLEUS= ^1H
##.ACQUISITION MODE= SIMULTANEOUS (DQD)
##.ACQUISITION SCHEME= undefined
##.AVERAGES= 16
##.DIGITISER RES= 18
##SPECTROMETER/DATA SYSTEM= dpx250
##.PULSE SEQUENCE= zg30
##.SOLVENT NAME= DMSO
##.SHIFT REFERENCE= (INTERNAL, DMSO, 0, 16.522)
##AUDIT TRAIL= $$ (NUMBER, WHEN, WHO, WHERE, WHAT)
$$ ##TITLE= Audit trail, XWIN-NMR		Version 3.5
$$ ##JCAMPDX= 5.01
$$ ##ORIGIN= Bruker BioSpin GmbH
$$ ##OWNER= nmr
$$ C:\u/data/dgb/nmr/ADRS/2850/pdata/1/auditp.txt
$$ ##AUDIT TRAIL=  $$ (NUMBER, WHEN, WHO, WHERE, WHAT)
(   1,<2006-04-24 12:26:09.06 +100>,<MAYBRIDGE\nmr>,<NMR_250MHZ>,
      <created by zg, POWCHK disabled, PULCHK disabled
       configuration hash MD5:
       84 BC 41 DB A1 6E 1D 46 DA 25 12 A5 C1 ED C5 3A
       data hash MD5: 64K
       00 E3 89 C8 C8 1B 5C 40 58 75 86 00 82 D8 BE 97>)
(   2,<2006-04-24 12:26:21.92 +100>,<MAYBRIDGE\nmr>,<NMR_250MHZ>,
      <Start of raw data processing
       ef LB = 0.3 FT_mod = 6 PKNL = 1 SI = 32K 
       data hash MD5: 32K
       69 0A 8D F5 60 60 D9 AF 4F 86 B8 3E E9 7C 04 EF>)
(   3,<2006-04-24 12:26:23.50 +100>,<MAYBRIDGE\nmr>,<NMR_250MHZ>,
      <apk 
       data hash MD5: 32K
       B5 DA FB CA 3E B9 92 9A FF 80 42 B6 CE 22 C5 64>)
(   4,<2006-04-24 12:26:24.39 +100>,<MAYBRIDGE\nmr>,<NMR_250MHZ>,
      <abs ABSG = 5 
       data hash MD5: 32K
       CB 1C E7 F8 B5 69 A1 BE DC 24 8E 93 B0 4D 5F 63>)
$$ ##END=
$$ 
$$ hash MD5
$$ 76 BA 68 07 97 BB 23 00 48 6E D2 61 F6 D2 B4 10
##$RELAX= 
##$RELAX= 
##$RELAX= 
##$RELAX= 
##$RELAX= 
##$RELAX= 
##$RELAX= 
$$ Bruker specific parameters
$$ --------------------------
##$DU= <C:\u>
##$EXPNO= 2850
##$NAME= <ADRS>
##$PROCNO= 1
##$TYPE= <nmr>
##$USER= <dgb>
##$AMP= (0..31)
100 100 100 100 100 100 100 100 100 100 100 100 100 100 100 100 100 100 
100 100 100 100 100 100 100 100 100 100 100 100 100 100 
##$AQSEQ= 0
##$AQ_mod= 3
##$AUNM= <au_zg>
##$AUTOPOS= <23 >
##$BF1= 250.13
##$BF2= 250.13
##$BF3= 250.13
##$BF4= 250.13
##$BF5= 500.13
##$BF6= 500.13
##$BF7= 500.13
##$BF8= 500.13
##$BYTORDA= 1
##$CFDGTYP= 0
##$CFRGTYP= 5
##$CHEMSTR= <none>
##$CNST= (0..31)
1 1 145 1 1 1 1 1 1 1 1 1 1 1 1 1 1 1 1 1 1 1 1 1 1 1 1 1 1 1 1 1 
##$CPDPRG= <>
##$CPDPRG1= <>
##$CPDPRG2= <>
##$CPDPRG3= <>
##$CPDPRG4= <mlev>
##$CPDPRG5= <mlev>
##$CPDPRG6= <mlev>
##$CPDPRG7= <mlev>
##$CPDPRG8= <mlev>
##$CPDPRGB= <>
##$CPDPRGT= <>
##$D= (0..31)
0 1 0 0 0 0 0 0 0 0.06 0 0 0 0 0 0 0.0002 0 0 0 0 0 0 0 0 0 0 0 0 0 0 
0 
##$DATE= 1145877968
##$DBL= (0..7)
120 120 120 120 120 120 120 120 
##$DBP= (0..7)
150 150 150 150 150 150 150 150 
##$DBP07= 0
##$DBPNAM0= <>
##$DBPNAM1= <>
##$DBPNAM2= <>
$$ [...]
##$SUBNAM6= <"">
##$SUBNAM7= <"">
##$SUBNAM8= <"">
##$SUBNAM9= <"">
##$SW= 20.6930455092707
##$SWIBOX= (0..15)
0 0 3 0 0 0 0 0 0 0 0 0 0 0 0 0 
##$SW_h= 5175.983436853
##$TD= 65536
##$TD0= 1
##$TE= 295.16
##$TE2= 300
##$TE3= 300
##$TEG= 300
##$TL= (0..7)
0 120 120 120 120 120 120 120 
##$TP= (0..7)
150 150 150 150 150 150 150 150 
##$TP07= 0
##$TPNAME0= <>
##$TPNAME1= <>
##$TPNAME2= <>
##$TPNAME3= <>
##$TPNAME4= <>
##$TPNAME5= <>
##$TPNAME6= <>
##$TPNAME7= <>
##$TPOAL= (0..7)
0.5 0.5 0.5 0.5 0.5 0.5 0.5 0.5 
##$TPOFFS= (0..7)
0 0 0 0 0 0 0 0 
##$TUNHIN= 0
##$TUNHOUT= 0
##$TUNXOUT= 0
##$USERA1= <user>
##$USERA2= <user>
##$USERA3= <user>
##$USERA4= <user>
##$USERA5= <user>
##$V9= 5
##$VALIST= <valist>
##$VCLIST= <CCCCCCCCCCCCCCC>
##$VD= 0
##$VDLIST= <DDDDDDDDDDDDDDD>
##$VPLIST= <PPPPPPPPPPPPPPP>
##$VTLIST= <TTTTTTTTTTTTTTT>
##$WBST= 1024
##$WBSW= 4
##$XGAIN= (0..3)
0 0 0 0 
##$XL= 0
##$YL= 0
##$YMAX_a= 356503
##$YMIN_a= -530064
##$ZGOPTNS= <>
##$ZL1= 120
##$ZL2= 120
##$ZL3= 120
##$ZL4= 120
##$ABSF1= 16.522
##$ABSF2= -4.171173
##$ABSG= 5
##$ABSL= 3
##$ALPHA= 0
##$AQORDER= 0
##$ASSFAC= 0
##$ASSFACI= 0
##$ASSFACX= 0
##$ASSWID= 0
##$AUNMP= <proc_1d>
##$AZFE= 0.1
##$AZFW= 0.1
##$BCFW= 0
##$BC_mod= 0
##$BYTORDP= 0
##$COROFFS= 0
##$CY= 12.5
##$DATMOD= 1
##$DC= 0
##$DFILT= <>
##$DTYPP= 0
##$F1P= 14.0000005364418
##$F2P= -0.99999901652339
##$FCOR= 0.5
##$FTSIZE= 32768
##$FT_mod= 6
##$GAMMA= 0
##$GB= 0
##$INTBC= 1
##$INTSCL= 1
##$ISEN= 128
##$LB= 0.3
##$LEV0= 0
##$LPBIN= 0
##$MAXI= 10000
##$MC2= 0
##$MEAN= 0
##$ME_mod= 0
##$MI= 0
##$NCOEF= 0
##$NC_proc= -4
##$NLEV= 6
##$NOISF1= 0
##$NOISF2= 0
##$NSP= 0
##$NTH_PI= 0
##$NZP= 0
##$OFFSET= 16.522
##$PC= 1
##$PHC0= 159.0674
##$PHC1= 9.05455
##$PH_mod= 1
##$PKNL= yes
##$PPARMOD= 0
##$PSCAL= 4
##$PSIGN= 0
##$REVERSE= no
##$SF= 250.13
##$SI= 32768
##$SIGF1= 0
##$SIGF2= 0
##$SINO= 400
##$SIOLD= 32768
##$SREGLST= <1H.DMSO>
##$SSB= 0
##$STSI= 32768
##$STSR= 0
##$SW_p= 5175.98343685301
##$SYMM= 0
##$S_DEV= 0
##$TDeff= 65536
##$TDoff= 0
##$TI= <Analysis number 999999
Compound Code 99
Book Reference 9
Project Code 9>
##$TILT= no
##$TM1= 0
##$TM2= 0
##$TOPLEV= 0
##$USERP1= <user>
##$USERP2= <user>
##$USERP3= <user>
##$USERP4= <user>
##$USERP5= <user>
##$WDW= 1
##$XDIM= 32768
##$YMAX_p= 337317022
##$YMIN_p= -523894
$$ End of Bruker specific parameters
$$ ---------------------------------
##NTUPLES= NMR SPECTRUM
##VAR_NAME=  FREQUENCY,     SPECTRUM/REAL,   SPECTRUM/IMAG
##SYMBOL=    X,             R,               I
##VAR_TYPE=  INDEPENDENT,   DEPENDENT,       DEPENDENT
##VAR_FORM=  AFFN,          ASDF,            ASDF
##VAR_DIM=   32768,         32768,           32768
##UNITS=     HZ,            ARBITRARY UNITS, ARBITRARY UNITS
##FACTOR=    0.157963299565203, 1,           1
##FIRST=     4132.6476996994, 0,             0
##LAST=      -1043.33573715361, 0,           0
##MIN=       -1043.33573715361, -523894,     0
##MAX=       4132.6476996994, 337317022,     0
$$ Real data points
##PAGE= N=1
##DATA TABLE= (X++(R..R)), XYDATA
$$ [...]
17124A2361910L777733N960696R236168J3134785J4954677J4403086J3450532
$$ 12361910 16139643 22100339 31336507 44471292 59425969 73829055 87279587
17117H7279587R050300L89771q447286j4873866j6369059j1298877n230166m34146
$$ 87279587 96329887 96719658 88272372 73398506 57029447 45730570 40500404 40066258
17109D0066258M200172R600029J4010280J4680653J4191841J2664020N309714
$$ 40066258 44266430 53866459 67876739 82557392 96749233 109413253 114722967
17102A14722967o243805j4430357j9663878j8834287j2939653q006405n122488
$$ 114722967 108479162 94048805 74384927 55550640 42610987 34604582 29482094
17095B9482094l680410k723918k082525j680021j388513j250706r28287p37493
$$ 29482094 25801684 23077766 20995241 19315220 17926707 16676001 15747714 15010221
17087A5010221o24773o19769m82024n91486n13790m65468m41598l40261o19241
$$ 15010221 14385448 13765679 13283655 12692169 12178379 11712911 11271313 10931052 10311811
17078A0311811n50107m75873n07349k61541k07428k03113l22045k12287j61915
$$ 10311811 9761704 9285831 8778482 8516941 8309513 8106400 7784355 7572068 7410153
17069G410153j77259j02117j61281q1767j84180l46148l76774j75392l4360j77664
$$ 7410153 7232894 7130777 6969496 6887729 6703549 6357401 5980627 5805235 5770875 5593211
17059E593211l06752j82159q3553j86623j93798k4175N5832q2416j59014J7868
$$ 5593211 5286459 5104300 5020747 4834124 4640326 4616151 4671983 4589567 4430553 4448421
17049D448421O497o8751k13805j16503j40960j00964l1776L2787j29730k29041
$$ 4448421 4454918 4386167 4172362 4055859 3914899 3813935 3782159 3814946 3685216 3456175
17039C456175j0583j6559r3150r2343J0647J32466L3280j84165j53179j17615
$$ 3456175 3445592 3429033 3335883 3243540 3254187 3386653 3419933 3235768 3082589 2964974
17029B964974k7168N9741r8414p2432N734n4329K39q7132q8933j5693l4499l8552
$$ 2964974 2937806 2997547 2899133 2826701 2832435 2778106 2778345 2691213 2602280 2586587 2552088 2513536
17017B513536O5707K4987o6296m9309j43151n4739K9353j77245l8789n175l5269
$$ 2513536 2579243 2604230 2537934 2488625 2345474 2290735 2320088 2142843 2104054 2098879 2063610
17006B063610p1876j12117M342j613n4311j80783n8857o7896n0669J32560J79749
$$ 2063610 1991734 1879617 1883959 1882346 1828035 1647252 1588395 1520499 1469830 1602390 1782139
16995A782139J07191L6715n8325j20055p726j6995J2453K5057K4463n7683p0903
$$ 1782139 1889330 1926045 1867720 1747665 1739939 1722944 1735397 1760454 1784917 1727234 1656331
16984A656331q4625Q1116M8218j3476J37827J92857J15345p7550p805m3288q9569
$$ 1656331 1571706 1652822 1701040 1687564 1825391 2018248 2133593 2056043 2048238 2004950 1915381
16973A915381L4237P9756J0101j79092m7673J7760q9413m4728R4342J11205j00671
$$ 1915381 1949618 2029374 2039475 1860383 1812710 1830470 1741057 1696329 1790671 1901876 1801205
16962A801205k00690j86969L3671O6022N0570N7666O8298J4776L1946R1503k7231
$$ 1801205 1600515 1413546 1447217 1513239 1563809 1621475 1689773 1704549 1736495 1827998 1800767
16951A800767k39425o0828N617O8723m3847m3120p293O2699m0399R799K9786l463
$$ 1800767 1561342 1500514 1506131 1574854 1531007 1487887 1480594 1543293 1502894 1512693 1542479 1539016
16939A539016j22746j23018P2310l4543p5715N9406M8687j5713p5567J9311M0564
$$ 1539016 1416270 1293252 1365562 1331019 1255304 1314710 1363397 1347684 1272117 1291428 1331992
16928A331992k2573J3758m3067k9333R7232J02942J85280J81728Q6995J82915
$$ 1331992 1309419 1323177 1280110 1250777 1348009 1450951 1636231 1817959 1904954 2087869
16918B087869K30516o2714j35555q0250j21753L8831O8886J16066j4906R3281
$$ 2087869 2318385 2255671 2120116 2039866 1918113 1956944 2025830 2141896 2126990 2220271
16908B220271O1853P3772K35406L52811M12531M09665N33937J045264J553141
$$ 2220271 2282124 2355896 2591302 2944113 3356644 3766309 4300246 5345510 6898651
16899F898651K767411M508309N320837L956404K955626L452025O10426n417343
$$ 6898651 9666062 14174371 19495208 23451612 26407238 29859263 30469689 25052346
16891B5052346o814106m339536k292704j025716k20437P63299J775827L096670
$$ 25052346 18238240 13898704 11606000 10580284 10359847 11123146 12898973 15995643
16883A5995643L221116J979051J869763J654043j478981n238229m818037k832203
$$ 15995643 19216759 21195810 23065573 24719616 23240635 18002406 13184369 10352166
16875A0352166j655513r21001n15996l93610j66606j20530p0812j36727j35432
$$ 10352166 8696653 7775652 7259656 6866046 6699440 6578910 6508098 6371371 6235939
16866F235939j14917j33659j80650K5849l355l6851J07973Q5580J77691K11519
$$ 6235939 6121022 5987363 5806713 5832562 5829207 5792356 5900329 5985909 6163600 6375119
16856F375119K50287M38454O54238Q38707J174901J420495J919717K961407M910185
$$ 6375119 6625406 7063860 7718098 8556805 9731706 11152201 13071918 16033325 20943510
16847B0943510Q655800J3252732J5145941J1346704Q827655R022618L59464j5468912
$$ 20943510 29599310 42852042 57997983 69344687 78172342 87194960 87554424 72085512
16839G2085512j8854256j2209312o296556k352393L96314L551337P777345J2489775
$$ 72085512 53231256 41021944 34725388 32372995 32769309 36320646 44097991 56587766
16831E6587766J2544051Q240320P583019O308067o084494j9429484j7902984j1123736
$$ 56587766 69131817 77372137 84955156 91263223 85178729 65749245 47846261 36722525
16823C6722525o535615m172128k810886k022942j558767j069992q10096p54773
$$ 36722525 30186910 26014782 23203896 21180954 19622187 18552195 17742099 16987326
16815A6987326o05753l42844l21926m81850l71482k35829j38515J998K36606L96673
$$ 16987326 16381573 16038729 15716803 15234953 14863471 14627642 14489127 14491125 14727731 15124404
16805A5124404N85857Q61383J277127J839749K811811M326291O762425J0814419
$$ 15124404 15710261 16571644 17848771 19688520 22500331 26826622 33589047 44403466
16797D4403466J6729777K1993487K3463771K2751512J9119264Q934287o162395
$$ 44403466 61133243 83126730 106590501 129342013 148461277 157395564 151233169
16790A51233169j8930615k8218443k7688396j9308791j1913851p597269n241275
$$ 151233169 132302554 104084111 76395715 57086924 45173073 37575804 32334529
16783C2334529l738308k850485k234471j694664j530288j258837r14180p50807
$$ 32334529 28596221 25745736 23511265 21816601 20286313 19027476 18113296 17362489
16775A7362489p01440n73771n06611n68941m23108m32497m45920m38956m70418
$$ 17362489 16661049 16087278 15580667 15011726 14588618 14156121 13710201 13271245 12800827
16766A2800827m79480m07444k69494l00019l37279k40391k21869o491j91156k0607
$$ 12800827 12321347 11913903 11644409 11344390 11007111 10766720 10544851 10538360 10347204 10326597
16756A0326597R5931J1725O2718J29301J21577J02655L63622O83725J132936J925604
$$ 10326597 10422528 10434253 10496971 10626272 10747849 10850504 11214126 11897851 13030787 14956391
16746A4956391L156497N073244O812100O897673O725574N764239K385593k507011
$$ 14956391 18112888 23186132 29998232 36895905 43621479 49385718 51771311 49264300
16738D9264300o267412q875437q308676n680470l483707k329098j508021j158023
$$ 49264300 42996888 34121451 25812775 20132305 16648598 14319500 12811479 11653456
16730A1653456r67058p16912m76124l93951m04832k63290k65455k35392l29758
$$ 11653456 10686398 9969486 9493362 9099411 8694579 8431289 8165834 7930442 7600684
16721G600684l47743j75321O3662O607j26369k27101j90534j44636k00014k58309
$$ 7600684 7252941 7077620 7141282 7147889 7021520 6794419 6603885 6459249 6259235 6000926
16711F000926j55986k97644j34436P285K3674r210Q4328o9412n7917j30872j27011
$$ 6000926 5844940 5547296 5412860 5420145 5443819 5434609 5518937 5449525 5391608 5260736 5133725
16700E133725k31006k13757j93742k42809q3133o3806r3528p7516j45501r3588
$$ 5133725 4902719 4688962 4495220 4252411 4169278 4105472 4011944 3934428 3788927 3695339
16690C695339j32868j45439j5165j14197o3604p997j49916n1968j54647l6260
$$ 3695339 3562471 3417032 3401867 3287670 3224066 3216069 3066153 3014185 2859538 2823278
16680B823278M6140l2585l3420q376p2782k2241j09925l5429J03302K73902J44626
$$ 2823278 2869418 2836833 2803413 2795037 2722255 2700014 2590089 2554660 2657962 2931864 3076490
16669C076490r1573j47145p8428L4828R0400P9889k6110j18793k15611k38287
$$ 3076490 2984917 2837772 2759344 2794172 2884572 2964461 2938351 2819558 2603947 2365660
16659B365660o7088r5741n280K8957O4861K620p8141r8637r7973j52066p5641
$$ 2365660 2298572 2202831 2197551 2226508 2291369 2293989 2215848 2117211 2019238 1867172 1791531
16648A791531R0797K8486j29729k7511o3438j01776J4694K3812M9517l9282o5985
$$ 1791531 1882328 1910814 1781085 1753574 1690136 1588360 1603054 1626866 1676383 1637101 1571116
16637A571116J6792m1532j06185j2696j4892l2047R4075n7009N4706k2697j08946
$$ 1571116 1587908 1546376 1440191 1427495 1412603 1380556 1474631 1417622 1472328 1449631 1340685
16626A340685k02679k7849J9471m8753K8204l2833l2770q3084o7681J32628Q5126
$$ 1340685 1138006 1110157 1129628 1080875 1109079 1076246 1043476 960392 892711 1025339 1110465
16615A110465O7244J14016n803k9572j0232p2638k5942J89763J07886J00325k7726
$$ 1110465 1177709 1291725 1285922 1256350 1246118 1173480 1147538 1337301 1445187 1545512 1517786
16604A517786k27040j82657n4938j7785n0060K4948J24838O4109O1957m6164j81164
$$ 1517786 1290746 1108089 1053151 1035366 985306 1010254 1135092 1199201 1261158 1214994 1033830
16593A033830O4662J45607J06349j56535j59200m5341n5820m485J5390m2098j00317
$$ 1033830 1098492 1244099 1350448 1193913 1034713 989372 933552 929067 944457 902359 802042
16582H02042M000l5884j00938j65067k6109M0359J4630M9260k0822K5992M6605
$$ 802042 806042 770158 669220 504153 478044 518403 533033 582293 561471 587463 634068
16571F34068O3969q9160k5006q9517p4228j5024J7297k1995j2493J28534m8377
$$ 634068 698037 608877 583871 494354 420126 405102 422399 400404 387911 516445 468068
16560D68068K817M4755o0904P066n9427n9698K5859k614j2300r8875j06005l3350
$$ 468068 470885 515640 454736 461802 402375 342677 368536 365922 353622 254747 148742 115392
16548A15392P0955j4525K1305K3684J00162O9780M1950o5425j03908j20046k839
$$ 115392 186347 171822 193127 216811 316973 386753 428703 363278 259370 139324 136485
16537A36485J92648L7018J6313j9808p7097j76290j4767R2772J06003k2966j2804
$$ 136485 329133 366151 382464 362656 285559 109269 94502 187274 293277 270311 257507
16526B57507k6109p9458p8608P0179N4264L9480n7153l88K8701q296l2282K2482
$$ 257507 231398 151940 73332 143511 197775 237255 180102 179714 208415 200119 167837 190319
16514A90319K7556P3285n3959k8208r4383R9988Q1363k5459p5025p3949j43919
$$ 190319 217875 291160 237201 208993 114610 214598 295961 270502 195477 121528 -22391
16503b2391n371K03193R1666n1582N7613M9090j55087n3402N9796l5192n2653
$$ -22391 -27762 175431 267097 215515 273128 322218 167131 113729 173525 138333 85680
16492H5680q6758k852J08546L0553P4637m9061j08859j18312j04158p1636n5039
$$ 85680 -1078 -3930 104616 135169 209806 160745 51886 -66426 -170584 -242220 -297259
16481b97259j0987R0469J02064K17540L7077j9512p0449K0357n8752q6326O0931
$$ -297259 -308246 -217777 -115713 101827 138904 119392 48943 69300 10548 -75778 -14847
16470a4847J06770k9294L2543p4765N0661Q5438j7321m1939r962L2574j10981
$$ -14847 91923 62629 95172 20407 71068 156506 139185 97246 87284 119858 8877
16459H877l1888j3199J41015o2205q6264J54086J21648m8763j06696O1304m7516
$$ 8877 -23011 -36210 104805 42600 -43664 110422 232070 183307 76611 137915 90399
16448I0399j78907m8057k8669L4002J68976R8362p8500J8839p8332j20649o573
$$ 90399 -88508 -136565 -165234 -131232 37744 136106 57606 76445 -1887 -122536 -129109
16437a29109J9523M6798R8308Q0135O3989r709L1310j19465l6636j27038K4387
$$ -129109 -109586 -62788 35520 115655 179644 169935 201245 81780 45144 -81894 -57507
16426e7507J00258K7775j07590j46752l3651J02725k217M7185J3067J27023L3434
$$ -57507 42751 70526 -37064 -183816 -217467 -114742 -116959 -69774 -56707 70316 103750
16415A03750n7019O9234k8740j0095K3447j64425l2452K1587M1267P9170n2039
$$ 103750 46731 115965 87225 77130 100577 -63848 -96300 -74713 -33446 45724 -6315
16404f315j5609P317p8798j33272k6070L3400K5222J31565m7914J3421K5464L5033
$$ -6315 -21924 -14607 -93405 -226677 -252747 -219347 -194125 -62560 -110474 -97053 -71589 -36556
16392c6556N529r5886j09605J12580L3741O3905J2147K1719j1353r9862K082M019
$$ -36556 -31027 -126913 -236518 -123938 -90197 -26292 -14145 7574 -3779 -103641 -101559 -97540
16380i7540L6024O4412j22718r497K8338n464Q5889J04200L8238n5146l2032n6923
$$ -97540 -61516 2896 -119822 -129319 -100981 -106445 -20556 83644 121882 66736 34704 -22219
16368b2219j8558R8507O8612P0505J05204k2359l8663j4540O2430j4679L7822
$$ -22219 -40777 57730 126342 196847 302051 279692 241029 226489 288919 274240 312062
16357C12062k9508j2561o0615n5286k552K1425q4670k5967J78088Q7765m3478
$$ 312062 282554 269993 209378 154092 151540 172965 88295 62328 240416 328181 284703
16346B84703K8192P7195M585j95937o9420q5390Q8027n6957N173O1576m5467K967
$$ 284703 312895 390090 394675 198738 129318 43928 131955 74998 80171 141747 96280 99247
16334I9247J405j21203o3616M3372J29032n676j29405L603R5331n1351o1272Q237
$$ 99247 100652 -20551 -84167 -40795 88237 82561 -46844 -43241 52090 739 -60533 -52296
16322e2296J4793k5442O033K1869k537P5849R0305j6238p8567J5726P6260J20956
$$ -52296 -37503 -62945 -56912 -35043 -37580 38269 128574 112336 33769 49495 125755 246711
16310B46711O503j428J11172L221r8893n5110J53874P9266J9290M7918J9937P3951
$$ 246711 253214 251786 362958 366179 267286 212176 366050 445316 464606 512524 532461 606412
16298F06412k0233m3659r4990j03995m5684l9829K1040J19154m6719o5626m3768
$$ 606412 586179 542520 447530 343535 297851 258022 279062 398216 351497 285871 242103
16287B42103j02857m2663m5096l5382J4931K3234N1857j7545K4034l204j6238
$$ 242103 139246 96583 51487 16105 31036 54270 106127 88582 112616 109412 93174
16276I3174j5048J5504l5290K6625l1426J0702R7456l4088J8117q1453k9669l4469
$$ 93174 78126 93630 58340 84965 53539 64241 161697 127609 145726 64273 34604 135
16264A35M7259p1035q9005R9197L29725O8956j48541p9742L0579M6534p3704P5481
$$ 135 47394 -23641 -112646 -13449 316276 385232 236691 156949 187528 234062 160358 235839
16252B35839J6135P4010J51104K3116m6971J9898p6655l9198j74611n3391o4084
$$ 235839 251974 325984 477088 500204 453233 473131 396476 357278 182667 129276 65192
16241F5192n8988j3434J3524n2433N9578Q1332J01894N2116o4374m5443o9026
$$ 65192 6204 -7230 6294 -46139 13439 94771 196665 248781 184407 138964 69938
16230F9938r3435j18495K9625R5633j30138q7866M2821J74204N8914m1172P4958
$$ 69938 -23497 -141992 -112367 -16734 -146872 -234738 -191917 -17713 41201 29 74987
16219G4987o1030P316Q7918j7111m9778j3303k4984p6973k9694j6466q0646M0775
$$ 74987 13957 21273 109191 92080 42302 28999 4015 -72958 -102652 -119118 -199764 -158989
16207a58989K5066J5265J67645P7982Q3026J3624j09109m7730R5825p3429q0843
$$ -158989 -133923 -118658 48987 126969 209995 223619 114510 66780 162605 89176 8333
16196H333O7065q6941k5609n032R1409Q2773k8609j42661o9953L175r9601q1149
$$ 8333 75398 -11543 -37152 -42184 49225 131998 103389 -39272 -109225 -106050 -205651 -286800
16184b86800J50051J56975N5326k1276J1553P675o6927j20618P3586l4823k2579
$$ -286800 -136749 20226 75552 54276 65829 73504 6577 -114041 -40455 -75278 -97857
16173i7857Q8554J05852L1847r0263j993J2241K5515r7873m5797r2650O759Q3532
$$ -97857 -9303 96549 128396 38133 36140 48381 73896 -23977 -69774 -162424 -155665 -72133
16161g2133M1773j4650j878N4829J5415r0373p6218j27372q8245J07668J11216
$$ -72133 -30360 -45010 -46888 7941 23356 -67017 -143235 -270607 -358852 -251184 -139968
16150a39968L1924m2142m7024O7114R7688q2263j90989j32296K37476P3028M4856
$$ -139968 -108044 -150186 -197210 -130096 -32408 -114671 -305660 -437956 -200480 -127452 -82596
16139h2596N2869j7379O5033n5091j55840r3354j4741J27115J41855O4476L7330
$$ -82596 -29727 -47106 17927 -37164 -193004 -286358 -301099 -173984 -32129 32347 69677
16128F9677M7489O1241N2640n7549n491P047o3780j39261J7540L3825n6213J9372
$$ 69677 117166 178407 231047 173498 168007 175054 111274 -27987 -10447 23378 -32835 -13463
16116a3463o4325k2185K7276m135n35O1964Q3373m6165j28777K2134R8K2851p6225
$$ -13463 -77788 -99973 -72697 -76832 -77367 -15403 67970 21805 -106972 -84838 -84740 -61889 -138114
16103a38114N6839j7632j04445J3121P3159L8642k436k9944j1117j9699R5682
$$ -138114 -81275 -98907 -203352 -190231 -117072 -78430 -80866 -110810 -121927 -141626 -45944
16092d5944N6047J7841p6352r03K02593J33234m6832j58074j1561j01964o9080
$$ -45944 10103 27944 -48408 -49311 153282 286516 239684 81610 70049 -31915 -100995
16081a00995L3312J7183P1804l4594l0412n654J07531r39j83025n0232N1456k52
$$ -100995 -67683 -50500 21304 -13290 -43702 -49356 58175 57236 -125789 -176021 -124565 -124817
16069a24817J6804o9637L7712P1657l4004l624K4849j20678N5392m290j2056q674
$$ -124817 -108013 -177650 -139938 -68281 -102285 -105909 -81060 -201738 -146346 -150636 -162692 -171366
16057a71366P55P2367N5778K0314J9407m5799k33O6759j01640j4102R7102O1806
$$ -171366 -170611 -98244 -42466 -22152 -2745 -48544 -48777 17982 -83658 -97760 -658 61148
16045F1148L5129J5627J52284l0167j16732J8202o6621m6440M9725j9864P0181
$$ 61148 96277 111904 264188 234021 117289 135491 68870 22430 72155 52291 122472
16034A22472L6993j70433m5141J12185O1940j1718K540m0476k7146j12117j3150
$$ 122472 159465 -10968 -56109 56076 118016 106298 108838 68362 41216 -70901 -84051
16023h4051l2379L9729J40965K2199L7326J597j11574M2437O3891k4338K2316
$$ -84051 -116430 -76701 64264 86463 123789 125386 13812 56249 120140 95802 118118
16012A18118k5430M1925Q4768j05986p2716J3241l2449N3417O3851j13446l3259
$$ 118118 92688 134613 219381 113395 40679 53920 21471 74888 138739 25293 -7966
16001g966m6435P3163O315n9125N6947l646J25932O529r9096M1882p8018j25186
$$ -7966 -54401 18762 25077 -34048 22899 19253 145185 151714 52618 94500 16482 -108704
15989a08704l9637o7255O9512N6870P5322q8849j00443m5613J60581K5203r3901
$$ -108704 -148341 -215596 -146084 -89214 -13892 -102741 -203184 -248797 -88216 -63013 -156914
15978a56914l2536k8851l029J4710P8104O6914O5252k3368n1896L9337P5274Q1585
$$ -156914 -189450 -218301 -221330 -206620 -128516 -61602 3650 -19718 -71614 -32277 42997 124582
15966A24582R2929j19962r4275M4911K3442J23577q9525j57751q6269O4102l7546
$$ 124582 217511 97549 3274 48185 71627 195204 105679 -52072 -138341 -74239 -111785
15955a11785J4401J38888O737q0927o5969k856O9010k0860L8924p7317k3178Q5151
$$ -111785 -97384 41504 48241 -32686 -98655 -101511 -32501 -53361 -14437 -91754 -114932 -29781
15943b9781K3575q5065j07566l7006J22264j06243N4235l3821j07679r2672O2271
$$ -29781 -6206 -91271 -198837 -235843 -113579 -219822 -165587 -199408 -307087 -399759 -337488
15932c37488J26375J83895O8540o988m7387j9380L0247M7234m9893q2957j2484
$$ -337488 -211113 -27218 41322 34334 -13053 -32433 -2186 45048 -4845 -87802 -100286
15921a00286r2724J4789Q2086L4731K3016l1474j31193o0713N9394m496M129r0478
$$ -100286 -193010 -178221 -96135 -61404 -38388 -69862 -201055 -261768 -202374 -206870 -202741 -293219
15909b93219J4557M3548P7227J05816m539O8058J17239J4625k5489R8483O6271
$$ -293219 -278662 -235114 -157887 -52071 -56610 11448 128687 143312 117823 216306 282577
15898B82577n8434k39223j73385J098O6446M5643J48114O1357r9405q0400L7030
$$ 282577 224143 -15080 -188465 -187367 -120921 -75278 72836 134193 34788 -45612 -8582
15887h582j9302q4912o8217M3676k1824M0938J56698N978J7779J33106J7884l0682
$$ -8582 -27884 -112796 -181013 -137337 -159161 -118223 38475 44453 62232 195338 213222 182540
15875A82540o9781j47157l5145Q2194J25767j8675j09426m1791J45309m9129r7782
$$ 182540 112759 -34398 -69543 12651 138418 119743 10317 -31474 113835 64706 -33076
15864c3076P6702M2876L72o2499J4473r5826o8848J02605M7912j35992o5154P002
$$ -33076 43626 86502 86874 24375 38848 -56978 -125826 -23221 24691 -111301 -176455 -169453
15852a69453L0561K876o5979k2627Q1654l7865P5369J14667K4015M9898L3699
$$ -169453 -138892 -136016 -201995 -224622 -142968 -180833 -105464 9203 33218 83116 116815
15841A16815m5601j35152j17177M2648L9726O2541o1083j43714l3879N9038R9078
$$ 116815 71214 -63938 -181115 -138467 -98741 -36200 -97283 -240997 -274876 -215838 -116760
15830a16760O2722j60682o8189R0738k6829K4632J03847J2389j2115m6496L5353
$$ -116760 -54038 -214720 -282909 -192171 -219000 -194368 -90521 -78132 -90247 -136743 -101390
15819a01390o7199m5801O5326P7860R8759k7926N2245R0214k8137p9375q3516
$$ -101390 -168589 -214390 -149064 -71204 27555 -371 51874 142088 113951 34576 -48940
15808d8940L3125Q9140N5748o5549m7472O0165j26551N3542M6670k8254k6887
$$ -48940 -15815 73325 129073 63524 16052 76217 -50334 3208 49878 21624 -5263
15797e263k5482K9272k8489j1999N0550M7938O7910j2169q3240j45939j40264
$$ -5263 -30745 -1473 -29962 -41961 8589 56527 124437 112268 29028 -116911 -257175
15786b57175j3510m9915J14004M2567k9306n201l0485l9851n020J2593n6328K0148
$$ -257175 -270685 -320600 -206596 -164029 -193335 -198536 -229021 -268872 -273892 -261299 -317627 -297479
15774b97479N6903J68637P5205K89K6180J34350k4459K1911j32793j13309M9741
$$ -297479 -240576 -71939 3266 3555 29735 164085 139626 161537 28744 -84565 -34824
15763c4824Q443j4695j07529o744N1827J1900o2290k0344J850J50886P4890j9605
$$ -34824 -26381 -41076 -148605 -155349 -103522 -91622 -153912 -174256 -172406 -21520 53370 33765
15751C3765K8936J07385p164N2668o2823n0658j259m8930k0714O1643j06419q4465
$$ 33765 62701 170086 162922 215590 152767 102109 100850 51920 31206 92849 -13570 -98035
15739i8035Q8292k2762l6715O8993Q9131k7851n1669j00368J06439N7340N1311
$$ -98035 -9743 -32505 -69220 -227 88904 61053 9384 -90984 15455 72795 124106
15728A24106N8139J01446l0068j0826n2192j29221j28722l0587M3573R4273l2010
$$ 124106 182245 283691 253623 242797 190605 61384 -67338 -97925 -54352 39921 7911
15717G911J11934J20684j59036o3459N5880j2829k0581J20983k4591n2647q1671
$$ 7911 119845 240529 81493 18034 73914 61085 40504 161487 136896 84249 2578
15706B578K1613K4322m8564k4240M5371r587j41473K7523Q8863P9840L9754j25469
$$ 2578 24191 48513 -51 -24291 21080 11493 -129980 -102457 -13594 66246 106000 -19469
15694a9469o3034J05018N1733o040j42340j22598K2103K6832K2739O1532J8684
$$ -19469 -82503 22515 74248 68208 -74132 -196730 -174627 -147795 -125056 -63524 -44840
15683d4840j5083K137m6873L7632p3148j02915k9416J08392M3978K7286q7029
$$ -44840 -59923 -57786 -104659 -67027 -140175 -243090 -272506 -164114 -120136 -92850 -179879
15672a79879j23095Q4541J63949J54558p8944n4916Q8991M1730k9455j18336j67150
$$ -179879 -302974 -218433 -54484 100074 21130 -33786 55205 96935 67480 -50856 -218006
15661b18006P5833N5989O5172M0922m9044l246p5772n9817O625P0653J4962L067
$$ -218006 -142173 -86184 -21012 19910 -29134 -32380 -108152 -167969 -161344 -90691 -75729 -72662
15649g2662L4626r5105l032j139p552J20893R3065j31642k837k2091M0831j878
$$ -72662 -38036 -133141 -136173 -137312 -144864 -23971 69094 -62548 -65385 -87476 -46645 -48523
15637d8523R1222J07935p9219l0669J4645l5568K3806P0503l0861o8817r5509
$$ -48523 42699 150634 71415 40746 55391 19823 43629 114132 83271 14454 -81055
15626h1055J05641O749P6006l9384r9534L5396K9101r0560K5949J37245L9868
$$ -81055 24586 31335 107341 67957 -31577 3819 32920 -57640 -31691 105554 145422
15615A45422j29900j01623j7577k27840J8799J16965O2993N3689M6555J6105m6124
$$ 145422 15522 -86101 -103678 -331518 -312719 -195754 -132761 -79072 -32517 -16412 -62536
15604f2536R692L5598l9185p0472J00859K1709J10171K5079m006p527K2027q4262
$$ -62536 -52844 -17246 -56431 -126903 -26044 -4335 105836 130915 126909 119382 141409 57147
15592E7147j19270J04609K8394l3905m8205j79962J2848J34616J27632L7727j1431
$$ 57147 -62123 42486 70880 36975 -11230 -191192 -178344 -43728 83904 121631 110200
15581A10200r6671P3410K666p659l4784l4658m1967l9659O0758O045o0592j2811
$$ 110200 13529 86939 89605 81946 47162 12504 -29463 -69122 -8364 -2319 -62911 -75722
15569g5722j2508K8991R7307M0211m3783J2036q977O6888N4770J2691j77999k3424
$$ -75722 -88230 -59239 38068 78279 34496 46532 37555 104443 159213 171904 -6095 -29519
15557b9519Q3511n3849j51801p7735j2323J43592O4933L7278K0756N3088p9345
$$ -29519 53992 143 -151658 -229393 -241716 -98124 -33191 4087 24843 77931 -1414
15546a414j09030q51N7001M4739m3325m252k6492J5344O9543j6626O011j12486
$$ -1414 -110444 -111295 -54294 -9555 -52880 -57132 -83624 -68280 1263 -15363 -9352 -121838
15534a21838N9624j19269N19J41604Q774J5361N6999q8596K8257N0284K5854Q3547
$$ -121838 -62214 -181483 -180964 -39360 -30586 -15225 41774 -46822 -18565 31719 57573 141120
15522A41120j64927p0735R653j01368R7033J17850Q2331J7277j7633j24904j74441
$$ 141120 -23807 -94542 -84889 -186257 -89224 28626 110957 128234 110601 -14303 -188744
15511a88744N5835J04359J49735m0973n6547M779k3468j0182J02598J4989q0265
$$ -188744 -132909 -28550 121185 80212 23665 28444 4976 -5206 97392 112381 32116
15500C2116j0998M0536L2744K2078N0534L3845K3878j16384n9349o5302p9958
$$ 32116 21118 61654 94398 116476 167010 200855 224733 108349 49000 -16302 -96260
15489i6260N6657J71539K5323j22633o7380j5348N2980L0881J01633k0955o1403
$$ -96260 -39603 131936 157259 34626 -32754 -48102 4878 35759 137392 116437 55034
15478E5034Q330n0522n933p1338M2288M1143n4723j1403n1302N665L0392L0377
$$ 55034 63364 12842 6909 -64429 -22141 19002 -35721 -47124 -98426 -92761 -62369 -31992
15466c1992K7057K9006o0507j904O9629m2185P2757r1571l3067Q6757q9295m6012
$$ -31992 -4935 24071 -36436 -38340 31289 -10896 61861 -29710 -62777 23980 -65315 -111327
15454a11327m0607l8909P1884J42840j5771M5809J1982q8749K5703J10360Q838
$$ -111327 -151934 -190843 -118959 23881 8110 53919 65901 -22848 2855 113215 122053
15443A22053J474j10552M909J54084j1454q2271p2015o0249J6679R0310J13984
$$ 122053 123527 12975 17884 171968 160514 78243 6228 -54021 -37342 52968 166952
15432A66952k6272j41881M8730l5729k2920L1185p588O6693q335l7338L9289n7263
$$ 166952 140680 -1201 47529 11800 -11120 20065 12477 79170 70835 33497 72786 15523
15420A5523K4796Q8378m9370o1710j9515j05462Q075M3613K4056P1333l5619M0833
$$ 15523 40319 128697 79327 17617 -1898 -107360 -99285 -55672 -31616 39717 4098 44931
15408D4931R1940j13293o5435o5683J6165M9369m8N2663m6485n2161K8838L57
$$ 44931 136871 23578 -41857 -107540 -91375 -42006 -42054 10609 -35876 -88037 -59199 -58842
15396e8842J5214o6670j0084k2813k2688J78015K4396n3855q9338k8591K6801
$$ -58842 -43628 -110298 -120382 -143195 -165883 12132 36528 -17327 -106665 -135256 -108455
15385a08455L2110j2382r8847n6961J3671L1088r9097l2849J03940J69762J9004
$$ -108455 -76345 -88727 -187574 -244535 -230864 -199776 -298873 -331722 -227782 -58020 -39016
15374c9016J7483k5485n0263J097N0465J9741p8380R1400N9056m1806j0724k3989
$$ -39016 -21533 -47018 -97281 -96184 -45719 -25978 -104358 -12958 46098 4292 -6432 -30421
15362c0421L4509L5108q0112q5645L6868J12390P5431n8165J3638r339j2096P127
$$ -30421 4088 39196 -40916 -126561 -89693 22697 98128 39963 53601 44262 32166 39293
15350C9293q9616n945N6244l416N388P7964J03220q8265o1180J5074j24948Q059
$$ 39293 -50323 -56268 -24 -3440 1948 79912 183132 94867 33687 48761 -76187 -68128
15338f8128R438J09397M9581k4569M7632o087J5787l1811o6918q4299R1228J51387
$$ -68128 -58690 50707 100288 75719 123351 117264 133051 101240 34322 -49977 41251 192638
15326A92638k5001j5582J907Q5826J9028q8485l9405n6159L8231j3816q0579k7779
$$ 192638 167637 152055 153962 239788 258816 170331 130926 74767 112998 99182 18603 -9176
15314i176K6617M4646l8652q1622K3768O1774J9494k3798P9972k1259M522K3108
$$ -9176 17441 62087 23435 -58187 -34419 27355 46849 23051 103023 81764 86286 109394
15302A09394j9152P2619q6202J5701p1426L5223M5634q208l1024r5177m5869R0825
$$ 109394 90242 162861 76659 92360 20934 56157 101791 93583 62559 -32618 -78487 12338
15290A2338j3651J6438n508r220p7837m2361p129J3640L537K6321J84315K1644
$$ 12338 -1313 15125 9617 397 -77440 -119801 -126930 -113290 -109753 -83432 100883 122527
15278A22527l6744m8255J9145r987K1969l9342j06768l2745l7294k6609l418J27395
$$ 122527 85783 37528 56673 46686 68655 29313 -77455 -110200 -147494 -174103 -177521 -50126
15266e0126J14991j0435m4240K8477l7478j73049p4230Q3383J14732k4582n0847
$$ -50126 64865 54430 10190 38667 1189 -171860 -246090 -162707 -47975 -72557 -123404
15255a23404M5625K2167k5619q4322J03754P6468L2067j81495l5956K8823J5681
$$ -123404 -77779 -55612 -81231 -165553 -61799 14669 46736 -134759 -170715 -141892 -126211
15244a26211J1566J16700R6243N521j40975L77P3521m957q9024K8460m8489J3020
$$ -126211 -114645 2055 98298 103819 -37156 -36779 36742 31785 -57239 -28779 -77268 -64248
15232f4248J25068J04769q4127m819J39378k0364j57348m8693k9659K1885r1472
$$ -64248 60820 165589 81462 76643 216021 195657 38309 -10384 -40043 -18158 -109630
15221a09630p8805M7554M3752Q7253N5592l049m2678j3105J0479N7663J9405m5149
$$ -109630 -188435 -140881 -97129 -9876 45716 42667 -11 -13116 -2637 55026 74431 29282
15209B9282n3335l2110J37837K9004l714J140L3845j79750K6326P2771j0240k8510
$$ 29282 -24053 -56163 81674 110678 106964 108104 141949 -37801 -11475 61296 51056 22546
15197B2546j06353N8972R2953p2914o7120L2814M0143O2140k9528n0667j38919
$$ 22546 -83807 -24835 68118 -4796 -71916 -39102 1041 63181 33653 -17014 -155933
15186a55933m3065J13067P3718m5979r1744J11669K2726r1214L3148K0055j4019
$$ -155933 -198998 -85931 -12213 -58192 -149936 -38267 -15541 -106755 -73607 -53552 -67571
15175f7571n3713m3122O1397M3053q392L2229L0032M2727L587J64176r8459r4749
$$ -67571 -121284 -164406 -103009 -59956 -68348 -36119 -6087 36640 40227 204403 105944 11195
15163A1195o028M515M2945j0456j46806m6558l6761P9149J04684m6498k8207N6467
$$ 11195 5167 9682 52627 42171 -104635 -151193 -187954 -108805 -4121 -50619 -78826 -22359
15151b2359K3780O0734J8464j36681L2149L1154m2338m55M2144N3266r0258k9151
$$ -22359 1421 62155 80619 -56062 -23913 7241 -35097 -35552 6592 59858 -30400 -59551
15139e9551P8025n7918r595k2715m573N3807o395j9360k6787o256j1709K7917
$$ -59551 18474 -39444 -49039 -71754 -76327 -22520 -28915 -48275 -75062 -81318 -93027 -65110
15127f5110L1499O9642L7982j6882L8405K9780j11078m5516J32201K7155j92016
$$ -65110 -33611 36031 74013 57131 95536 125316 14238 -31278 100923 128078 -63938
15116f3938k8210O1342J3775l3114l42l0775N1356K4411j72511J04352J52521
$$ -63938 -92148 -30806 -17031 -50145 -50487 -81262 -29906 -5495 -178006 -73654 78867
15105G8867J0301j14621j12871k211j127L2309o1516n9421L1151n0218J29894
$$ 78867 89168 -25453 -138324 -140535 -141662 -109353 -170869 -230290 -199139 -249357 -119463
15094a19463R7165J11193M2716p6389J24309J7442l6196j32590J08159k5288j13548
$$ -119463 -22298 88895 131611 55222 179531 196973 160777 28187 136346 111058 -2490
15083b490m3374Q559J75519N3002r5788m2335L6120J2028L7184L700k05630j20711
$$ -2490 -45864 -37305 138214 191216 95428 53093 89213 101241 138425 142125 -63505 -184216
15071a84216J60090J47450o7222j00192l1122K1867J82854J0938o4789j8669l4454
$$ -184216 -24126 123324 56102 -44090 -75212 -53345 129509 140447 75658 56989 22535
15060B2535J8463o1955j6163J01462J5140j09073o4533O4581k1734K2215l607
$$ 22535 40998 -20957 -37120 64342 79482 -29591 -94124 -29543 -51277 -29062 -32669
15049c2669j07963o135O8521p1742o0155L8981J87443L9757J01863J32446j08888
$$ -32669 -140632 -146767 -78246 -149988 -210143 -171162 16281 56038 157901 290347 181459
15038A81459j39471k5185j11778j33345j1193J5710J26811J94249J63917j4078
$$ 181459 41988 16803 -94975 -228320 -239513 -223803 -96992 97257 261174 247096
15028B47096n6104k4055q0590o4096j7794J650p8181M9441K0492r016Q7425m0865
$$ 247096 190992 166937 86347 22251 4457 6107 -72074 -22633 -2141 -11157 76268 35403
15016C5403k9807j09383n2010Q0524J70589J9649j04033J4105J6101k7477J6956
$$ 35403 5596 -103787 -155797 -75273 95316 114965 10932 25037 41138 13661 30617
15005C0617j9035j39454j8130J6615J20944J90066K2229k06523j47215o2689M4711
$$ 30617 11582 -127872 -146002 -129387 -8443 181623 203852 -2671 -149886 -212575 -167864
14994a67864p4591K2511J26408P6044N6589Q973L4534O2275J6770o8667l1385
$$ -167864 -242455 -219944 -93536 -17492 39097 48070 82604 144879 161649 92982 61597
14983F1597k7270Q0476L9458P0009j3204N9325L7171j28832o1264j3892j1339
$$ 61597 34327 114803 154261 224270 211066 270391 307562 178730 117466 103574 92235
14972I2235N718m1733O5502q4352j28953O3339J42552j8796m3397r1885J0980
$$ 92235 97953 56220 121722 37370 -91583 -28244 114308 95512 52115 -39770 -28790
14961b8790Q5074N4511p0524o3734k2665N4363N7752o3975r870J03848K589o586
$$ -28790 56284 110795 40271 -23463 -46128 8235 65987 2012 -7858 95990 98579 91993
14949I1993M6514R7281o8898n8063K0044n6217q8297n0320q3006L3068J89530
$$ 91993 138507 235788 166890 108827 128871 72654 -15643 -65963 -148969 -115901 73629
14938G3629J36686m9122r6652m1008J7525K4598J07136O8047O182p3461o9779
$$ 73629 210315 161193 64541 23533 41058 65656 172792 240839 247021 173560 103781
14927A03781o457n7276J1518J07903n5226m6226P149o2945j7673M0765p4706j6537
$$ 103781 97324 40048 51566 159469 104243 58017 65166 2221 -15452 25313 -49393 -65930
14915f5930P9501N7826l1768J4397q4673j6516P6712J21640L2663m5455Q04r1605
$$ -65930 13571 71397 39629 54026 -30647 -47163 29549 151189 183852 138397 139201 47596
14903D7596j9850P4006M4909m1344l3848N4183J7233j6522J2815j165Q3413o8215
$$ 47596 27746 101752 146661 105317 71469 125652 142885 126363 139178 138013 221426 153211
14891A53211j08319N4845J19083q6054r7349K2451n139R3446L9775j33889n8426
$$ 153211 44892 99737 218820 132766 35417 57868 52729 146175 185950 52061 -6365
14880f365K49O1071l947q4727J1557P4861j08199p8771J16068J45801j24279Q641
$$ -6365 -6116 54955 51008 -33719 -22162 52699 -55500 -134271 -18203 127598 3319 11960
14868A1960L2237n2463r5624J7905O4880L9810j2640m3117k2924l9613K8710Q0667
$$ 11960 44197 -8266 -103890 -85985 -21105 18705 6065 -37052 -59976 -99589 -70879 9788
14856I788J5446K4639Q416m8057L1057P437Q8147o5745k5054j0739Q291p5747
$$ 9788 25234 49873 58289 10232 41289 48726 136873 71128 46074 35335 43626 -32121
14844c2121J3823j06916J2577R23l0203K8133j14053N1328R3526l2728R3642N6037
$$ -32121 -18298 -125214 -112637 -111714 -141917 -113784 -227837 -176509 -82983 -115711 -22069 33968
14832C3968N6249K4958J13594q0116j34962J34J18988P557j30404p6380j5318
$$ 33968 90217 115175 228769 148653 13691 13825 132813 140370 9966 -66414 -81732
14821h1732l7242Q173R6404J39985J60054j35835l2430Q3636Q3894n3528l1457
$$ -81732 -118974 -110801 -14397 125588 285642 149807 117377 201013 284907 231379 199922
14810A99922n797j66399q3651l4329J14273M1495k4542r5163J8096Q2050l4660
$$ 199922 194125 27726 -55925 -90254 24019 65514 40972 -54191 -36095 45955 11295
14799A1295L3741n7366J5122O3353l2220L8191N3912r5134J2757L6510j02338
$$ 11295 45036 -12330 2792 66145 33925 72116 126028 30894 43651 80161 -22177
14788b2177N307P1528n8794J1350J0514K9320J17105p932j17719p5273Q7429M5239
$$ -22177 -16870 54658 -4136 7214 17728 47048 164153 156221 38502 -36771 50658 95897
14776I5897l444j19160J117J28372j7993j969m6027N3420j17374M3455J79700
$$ 95897 92453 -26707 -25590 102782 84789 82820 36793 90213 -27161 16294 195994
14765A95994m1618j01526k7918J01223J31497N3484j62806j29215N3592J31689
$$ 195994 154376 52850 24932 126155 257652 311136 148330 19115 72707 204396
14755B04396L0635P7360j2480p6179j03929q0229M8211m3437Q8197L8109j04859
$$ 204396 235031 312391 299911 223732 119803 39574 87785 44348 132545 170654 65795
14744F5795P946Q7090j0042L811k9273N4392R8127j48810m0967K5682O4047R1113
$$ 65795 73741 160831 150789 154600 125327 179719 277846 129036 88069 113751 177798 268911
14732B68911J02390j45021j41044k200P0997n1696o8499p555K4016L371n4490
$$ 268911 371301 226280 85236 83036 154033 102337 33838 26283 50299 53670 -820
14721h20p8Q606Q7001P0067k1781r1130M6352J00187m2847L466J26867L5443q1134
$$ -820 -898 7708 94709 164776 142995 51865 98217 198404 155557 159023 285890 321333 240199
14708B40199l2236N9713l9287j27491r2565P759j2036j0368J04495L0827R911
$$ 240199 207963 267676 228389 100898 8333 16092 4056 -6312 98183 129010 138921
14697A38921J7645o5274J6852Q4017L4692m9747k6480j24019k5391L8814O383
$$ 138921 156566 91292 108144 192161 226853 177106 150626 26607 1216 40030 46413
14686D6413n375J38302J11312m7405r7717j3326m6438n5970j1763q9765n6225
$$ 46413 41038 179340 290652 243247 145530 132204 85766 29796 18033 -71732 -127957
14675a27957J20922J31570m5189l0833k2927J5129l3921J03259N695R0417Q8790
$$ -127957 -7035 124535 79346 48513 25586 40715 6794 110053 115748 206165 294955
14664B94955l2632m5012k6412j54421n9391N2466r385L5339m6997q3572j7067
$$ 294955 262323 217311 190899 36478 -22913 29553 20168 55507 8510 -75062 -92129
14653i2129p3982M747J36409O4252o7793K5869M7021J14021l2796j4777P4624
$$ -92129 -166111 -161364 -24955 39297 -28496 -2627 44394 158415 125619 110842 185466
14642A85466l4350M1270n2499j1661m6133n3964L9189n4184M0790J47170K7987
$$ 185466 151116 192386 139887 128226 82093 28129 67318 13134 53924 201094 229081
14631B29081j21321j34587j567Q1537P188l3876j32231O7288J72653P8861j57059
$$ 229081 107760 -26827 -28394 53143 60331 26455 -105776 -38488 134165 213026 55967
14620E5967p6068o3159o6727L1935J16451j6033l157K6457O3716J16079J03033
$$ 55967 -20101 -83260 -149987 -118052 -1601 -17634 -20791 5666 69382 185461 288494
14609B88494o5060q3139p5354P4157N5881N6910k6751J4897k3874N3096N7865
$$ 288494 223434 140295 64941 139098 194979 251889 225138 240035 216161 269257 327122
14598C27122p401j97852j09150O5270O618O8846J15806l2189n6951K8204P5224
$$ 327122 319721 121869 12719 77989 84607 153453 269259 237070 180119 208323 283547
14587B83547J28302n0900r8355R0291P2844O932o4085j67744n1171p7226o6984
$$ 283547 411849 360949 262594 352885 425729 432661 368576 200832 149661 72435 5451
14576E451K1472K7216L8701L1464p936p141q495J00170m993R1136M0938o8973
$$ 5451 26923 54139 92840 124304 116368 109227 100732 200902 195909 287045 327983 259010
14564B59010n1299o5740j45420p1657Q875J19767O1423M8620R7151j36127o4939
$$ 259010 207711 141971 -3449 -75106 -66231 53536 114959 163579 260730 124603 59664
14553E9664L6126m1409Q3804p245J4373L6811Q3302J7149N9781J3699n7545n7451
$$ 59664 95790 54381 138185 130940 145313 182124 265426 282575 342356 356055 298510 241059
14541B41059L3301M6446J3577o9506j42429m5023J4879m6066K1043Q0486l0277
$$ 241059 274360 320806 334383 264877 122448 77425 92304 46238 67281 147767 117490
14530A17490P6687Q650j33645n962K8617p1719Q2295O4276p7143j56185J63954
$$ 117490 194177 202827 69182 63220 91837 20118 102413 166689 89546 -66639 97315
14519I7315J41038l6526p299j53994l216N6137R5621j29578O3480J10249l7559
$$ 97315 238353 201827 194528 40534 37318 93455 189076 59498 122978 233227 195668
14508A95668l5888J31737K3144j43583O9105R7574n5194j49527o4673M1727J22832
$$ 195668 159780 291517 314661 171078 240183 337757 282563 133036 68363 110090 232922
14497B32922q8472K234P8806p3825l8493O0396L5445N4166n3503L1621l6051L1694
$$ 232922 144450 146684 225490 151665 113172 173568 209013 263179 209676 241297 205246 236940
14485B36940o4168O9189Q227j22132k7942J05722J1277P0102L7627k3772l5800
$$ 236940 172772 241961 250188 128056 100114 205836 217113 287215 324842 301070 265270
14474B65270j46374p5603J62141l559n3360P8457M7708j1742j9784P9368r5068
$$ 265270 118896 43293 205434 201875 148515 226972 274680 262938 243154 322522 227454
14463B27454j06142K4532J95104n677q6007j7578p9912K4400o1405L1333J9670
$$ 227454 121312 145844 340948 335271 249264 231686 151774 176174 114769 146102 165772
14452A65772l5654l8105J17033p696j36421O2010R9784J09865K6824Q8362M8628
$$ 165772 130118 92013 209046 201350 64929 126939 226723 336588 363412 451774 500402
14441E00402M0697q4141j16181p2919p6055N502J13641J8630m3812P4010O2418
$$ 500402 541099 456958 340777 267858 191803 197305 310946 329576 285764 359774 422192
14430D22192q939p5413k3453k068j42108k2850m8K6488J32306R5070Q3992q2344
$$ 422192 413253 337840 314387 312319 170211 147361 147313 173801 306107 401177 485169 402825
14418D02825o5654K6832K6129r2426n268K7584l3774O9537N9039K4205M4438r739
$$ 402825 337171 364003 390132 297706 292438 320022 286248 355785 414824 439029 483467 473728
14406D73728l8996k3891n185q9065P7567M4912P077j19793m1214O1892J230O290
$$ 473728 434732 410841 405656 316591 394158 439070 446147 326354 285140 347032 348262 354552
14394C54552n5321O2024M4491J00410L8195L6840n9473M0539j1927q8130o402
$$ 354552 299231 361255 405746 506156 544351 581191 521718 562257 550330 462200 455798
14383D55798o1242n0025j0780J32496R2737j01491n7849M6304J7350Q094P2212
$$ 455798 394556 344531 333751 466247 558984 457493 399644 445948 463298 471392 543604
14372E43604l2365j62236p5670O8823J37614J25751J68858j18594o9424L7185
$$ 543604 511239 349003 273333 342156 479770 605521 774379 655785 586361 623546
14362F23546M8807L8345K6046J43698Q3707K0654L1821m9050j73698r3802n4898
$$ 623546 672353 710698 736744 880442 964149 984803 1016624 967574 793876 700074 645176
14351F45176K0232R3056o9281Q4053O6432l5534j07153l5775M4063R5640J1928
$$ 645176 665408 758464 689183 773236 839668 804134 696981 661206 705269 800909 812837
14340H12837k5392L9138J1688j0422q810l9757o4887p3147k1552m751J30960J08216
$$ 812837 787445 826583 838271 827849 819039 779282 714395 641248 619696 614945 745905 854121
14328H54121K0690L4750l7813o2875o0537n1382l2986j6522O480L8750L3331J9780
$$ 854121 874811 909561 871748 808873 748336 696954 663968 647446 653926 692676 726007 745787
14316G45787N1663P3037P3911O4676k7024j58106j89762j00038Q1727J1440l3266
$$ 745787 797450 870487 944398 1009074 982050 823944 634182 534144 615871 627311 594045
14305E94045J2489K5343J04090N5548O1407N6058L5608o9352j10429K0119P6205
$$ 594045 606534 631877 735967 791515 852922 908980 944588 875236 764807 784926 861131
14294H61131J52358L8220k69199j03643J2375P8094O7265m3061J16517r1606q5790
$$ 861131 1013489 1051709 782510 678867 691242 769336 836601 793540 910057 818451 732661
14283G32661P4574J26154L8847j24031N728L3943M3929J1208K7694O5907J2330
$$ 732661 807235 933389 972236 848205 853933 887876 931805 943013 970707 1036614 1048944
14272A048944m5733m9902p8265j0351J6450l384m257J08852J29754o80n6666J1522
$$ 1048944 1003211 953309 875044 864693 881143 877759 873502 982354 1112108 1111428 1054762 1066284
14260A066284L334O1105M5926j9496p6194J79297Q5309l0749q727N1614J31797
$$ 1066284 1069618 1130723 1176649 1157153 1080959 1260256 1345565 1314816 1306089 1357703 1489500
14249A489500L1591M332n4682P5135L7098L2332J3189k5402l109k9607J92808
$$ 1489500 1521091 1525423 1470741 1545876 1582974 1615306 1628495 1603093 1599984 1570377 1763185
14238A763185K9645n7238P0150R9598J47948P7607L9400j1466l4110M7507q6504
$$ 1763185 1792830 1735592 1805742 1905340 2053288 2130895 2170295 2158829 2124719 2172226 2085722
14227B085722Q8147O7812J5016J09322M9389j9622P4772J3687Q5036J68479R498
$$ 2085722 2173869 2241681 2256697 2366019 2415408 2395786 2470558 2484245 2569281 2737760 2747258
14216B747258P9642J10233O7188O739l3195M7432J04700J3794j09097k3760R1365
$$ 2747258 2826900 2937133 3004321 3011060 2977865 3025297 3129997 3143791 3034694 3010934 3102299
14205C102299R8760m3454K5055Q7839M016o558J28907K8267k7774Q9689k4505
$$ 3102299 3201059 3157605 3182660 3270499 3274515 3267957 3396864 3425131 3397357 3487046 3462541
14194C462541j4385P4745N6813J29944J09981j403J4861r612Q8743O8344J74135
$$ 3462541 3448156 3522901 3579714 3709658 3819639 3818236 3833097 3823485 3912228 3980572 4154707
14183D154707N9994R7854P6216O9743K0717J10107J41717J08156K34353J57598
$$ 4154707 4214701 4312555 4388771 4458514 4479231 4589338 4731055 4839211 5073564 5231162
14173E231162J13414M7900L2048K15536J83244J72270J59021N5323N8169P8070
$$ 5231162 5344576 5392476 5424524 5640060 5823304 5995574 6154595 6209918 6268087 6346157
14163F346157J01652L35022J79766P6544K79138K76893K54219K27512K30011K11045
$$ 6346157 6447809 6782831 6962597 7039141 7318279 7595172 7849391 8076903 8306914 8517959
14153H517959K39363K90470K53985L52644M59416L94612K41165L42695K62906
$$ 8517959 8757322 9047792 9301777 9654421 10113837 10508449 10749614 11092309 11355215
14144A1355215K99016M80758O09144M46764L41225M84250O15227O39972O37088
$$ 11355215 11654231 12134989 12744133 13190897 13532122 14016372 14631599 15271571 15908659
14135A5908659P26691P72160P82745P85191Q29805R72653R01545R98283J256756
$$ 15908659 16635350 17407510 18190255 18975446 19805251 20777904 21679449 22677732 23934488
14126B3934488J181893J196944J185905J425793J429545J443904J604405J689487
$$ 23934488 25116381 26313325 27499230 28925023 30354568 31798472 33402877 35092364
14118C5092364J767366J855255J894380K059246K020137K121514K087275K132108
$$ 35092364 36859730 38714985 40609365 42668611 44688748 46810262 48897537 51029645
14110E1029645K150113K196481K110108K143219K135684J941675J663225J591755
$$ 51029645 53179758 55376239 57486347 59629566 61765250 63706925 65370150 66961905
14102F6961905J251678R85980Q49446N63870K31599q4458k55335n81439p13564
$$ 66961905 68213583 69199563 70049009 70612879 70844478 70760020 70504685 69923246 69209682
14093F9209682j028187j092261j289366j406971j428765j608243j582800j571648
$$ 69209682 68181495 67089234 65799868 64392897 62964132 61355889 59773089 58201441
14085E8201441j641550j547904j589522j613779j697340j679866j423922j277404
$$ 58201441 56559891 55011987 53422465 51808686 50111346 48431480 47007558 45730154
14077D5730154j388822j459931j304312j221824j224097j124763r48769j083448
$$ 45730154 44341332 42881401 41577089 40355265 39131168 38006405 37057636 35974188
14069C5974188j053479j059067r32193q29416q83216q07754p74991p43974p74375
$$ 35974188 34920709 33861642 32929449 32100033 31216817 30409063 29634072 28890098 28115723
14060B8115723q10329n59506n99931o65527o89649o21051o16690m83884l13588
$$ 28115723 27305394 26745888 26145957 25480430 24790781 24169730 23553040 23069156 22755568
14051B2755568l61163m88829o00875m84170l42341m04864l58441l47030m09564
$$ 22755568 22394405 21905576 21304701 20820531 20478190 20073326 19714885 19367855 18958291
14042A8958291l53968l18298j95945l20150m66963l66077l15060l03780k72588
$$ 18958291 18604323 18286025 18090080 17769930 17302967 16936890 16621830 16318050 16045462
14033A6045462k52501k21719k03612j26847l24568l71221k29357k25574r3276
$$ 16045462 15792961 15571242 15367630 15240783 14916215 14544994 14315637 14090063 13996787
14024A3996787j44380k91305k55731j74493j58023k3149j69674k35181r7821k0908
$$ 13996787 13852407 13561102 13305371 13130878 12972855 12949706 12780032 12544851 12447030 12426122
14014A2426122j36038j44404k45514k82326k717n7283j42114n9462q4664Q2680
$$ 12426122 12290084 12145680 11900166 11617840 11615123 11557840 11415726 11356264 11271600 11354280
14004A1354280K696k01263j62449r1924j4575k8879K4199j24406j08577j8880
$$ 11354280 11356976 11155713 10993264 10901340 10886765 10857886 10882085 10757679 10649102 10630222
13994A0630222q4644j3023O9675l5545o4400Q592o6946j2063j56995m9403j3857
$$ 10630222 10545578 10532555 10602230 10566685 10502285 10510877 10443931 10431868 10274873 10225470 10211613
13983A0211613r3128p842K2470l6279l251M9015N5020k4198k03787j716m6852
$$ 10211613 10118485 10110643 10133113 10096834 10093583 10142598 10197618 10173420 9969633 9967917 9921065
13972I921065M4598J14835r6052k81250k8097k8823O755J37541L4050J34515L59
$$ 9921065 9965663 10080498 9984446 9703196 9675099 9646276 9653031 9790572 9824622 9959137 9959496
13961I959496n1118K6937q150N7168O5622J2593j2261L8437N5472O8654M5799
$$ 9959496 9908378 9935315 9927165 9984333 10049955 10062548 10050287 10088724 10144196 10212850 10258649
13950A0258649J09818J63871M9575R1294Q6343J91852N2705j19011J21191R9341
$$ 10258649 10368467 10532338 10581913 10673207 10759550 10951402 11004107 10885096 11006287 11105628
13940A1105628o702J96880R3976M4277R7925J22118O1145J81769J89751K13861
$$ 11105628 11098926 11295806 11389782 11434059 11531984 11654102 11715247 11897016 12086767 12300628
13930A2300628K0136J26815L28714L28981K00616K42819J81198K57259K82517
$$ 12300628 12320764 12447579 12776293 13105274 13305890 13548709 13729907 13987166 14269683
13921A4269683J88333K90584K24457L73654M14907L39602L27228M05609M29745
$$ 14269683 14458016 14748600 14973057 15346711 15761618 16101220 16428448 16834057 17263802
13912A7263802M74126M83809M11600N23196O74969O88608O29984P25593P56615
$$ 17263802 17737928 18221737 18633337 19156533 19831502 20520110 21150094 21875687 22632302
13903B2632302P30880P35748Q12397P69694R69951R93111R78204J082435J026718
$$ 22632302 23363182 24098930 24911327 25681021 26650972 27644083 28622287 29704722 30731440
13894C0731440J206767J406043J467881J353631J510699J554356J649663J774553
$$ 30731440 31938207 33344250 34812131 36165762 37676461 39230817 40880480 42655033
13886D2655033J838924J853422J942106J948152K029569J977857K071396J994752
$$ 42655033 44493957 46347379 48289485 50237637 52267206 54245063 56316459 58311211
13878E8311211J977535K040991J821671J667549J538286J348264J236497R56843
$$ 58311211 60288746 62329737 64151408 65818957 67357243 68705507 69942004 70898847
13870G0898847O54274K61952J03113k39802m91589p58812r10276j014230j308243
$$ 70898847 71553121 71815073 71918186 71678384 71186795 70427983 69517707 68503477 67195234
13861F7195234j439687j513206j722941j889133j870716j749809j704046j781200
$$ 67195234 65755547 64242341 62519400 60630267 58759551 57009742 55305696 53524496
13853E3524496j849228j714090j726364j804838j568944j403754j481689j385650
$$ 53524496 51675268 49961178 48234814 46429976 44861032 43457278 41975589 40589939
13845D0589939j411212j433977j224697j247933j226301j118931j017330r46400
$$ 40589939 39178727 37744750 36520053 35272120 34045819 32926888 31909558 30963158
13837C0963158r30976q94661r40713q59869o77951p69518q20167o67431o73641
$$ 30963158 30032182 29137521 28196808 27336939 26658988 25889470 25069303 24401872 23728231
13828B3728231q03647o82186o23986p13501n91335n84964m31243m03541m50208
$$ 23728231 22924584 22242398 21618412 20904911 20313576 19728612 19297369 18893828 18443620
13819A8443620m01300l09301l93141m29382m53326n55691l64441m14329m15116
$$ 18443620 18042320 17733019 17339878 16910496 16457170 15901479 15537038 15122709 14707593
13810A4707593l40771l01514k55895l43159l17810k50547k62993l70943l97783
$$ 14707593 14366822 14065308 13809413 13466254 13148444 12897897 12634904 12263961 11866178
13801A1866178k65437k60480k18626j89967j53330k43758k16145p2084j81418
$$ 11866178 11600741 11340261 11121635 10931668 10778338 10534580 10318435 10246351 10064933
13792A0064933k59397l50638k25750j16852q5252j76529j24772o8159j47996j92862
$$ 10064933 9805536 9454898 9229148 9112296 9027044 8850515 8725743 8657584 8509588 8316726
13782H316726j46702j28890k01412k12570r7948j24748j66474j57214k8325L7310
$$ 8316726 8170024 8041134 7839722 7627152 7529204 7404456 7237982 7080768 7052443 7089753
13772G089753r0427k10031j60166j27388n6853j07286j83032j23210q577L1437
$$ 7089753 6999326 6789295 6629129 6501741 6444888 6337602 6154570 6031360 6022783 6054220
13762F054220n2510m4127j07441j69712j63107o0788j47033o8333r1089j30919
$$ 6054220 6001710 5957583 5850142 5680430 5517323 5456535 5309502 5241169 5150080 5019161
13752E019161m6108q8757q8145Q7672J22341k4882K4637j6917j21714r1040o7691
$$ 5019161 4973053 4884296 4796151 4883823 5006164 4981282 5005919 4989002 4867288 4776248 4708557
13741D708557j01746j29602n9359j63008k06230r9190P6540L2800O7002j15950
$$ 4708557 4606811 4477209 4417850 4254842 4048612 3949422 4025962 4058762 4125764 4009814
13731D009814l9262j71264k1788P2522N4403M3428j49865j41257j00583n2921
$$ 4009814 3970552 3799288 3777500 3850022 3904425 3947853 3797988 3656731 3556148 3503227
13721C503227j09900J3919J2414K6834p5780j45699q1117r6168j49516j02318
$$ 3503227 3393327 3407246 3419660 3446494 3370714 3225015 3143898 3047730 2898214 2795896
13711B795896j8503J08405J38507M5813j08920j89222j29820L1753L5736K3323
$$ 2795896 2777393 2885798 3024305 3070118 2961198 2771976 2642156 2673909 2709645 2732968
13701B732968o1720p9828k5621k4512k3305J3134Q022j15580o7495m1563k8603
$$ 2732968 2671248 2591420 2565799 2541287 2517982 2531116 2539138 2423558 2356063 2314500 2285897
13690B285897p3482p463R0123J1745n4263j09620O517M4073k5746q2921p3478
$$ 2285897 2212415 2204952 2295075 2306820 2252557 2142937 2149454 2193527 2167781 2084860 2011382
13679B011382n6127o0702p1857j29421J07574k0885L8811n79O2051j09402L58
$$ 2011382 1955255 1894553 1822696 1693275 1800849 1779964 1818775 1818196 1880247 1770845 1771203
13668A771203M3395j15220j86423J4785P0031o508J7839n9672r7202O0424P3244
$$ 1771203 1814598 1699378 1512955 1527740 1597771 1591263 1609102 1549430 1452228 1512652 1585896
13657A585896j4226Q1052m9975j39866P9915O8568j35188j06805q2127j2046q7892
$$ 1585896 1571670 1652722 1602747 1462881 1542796 1611364 1476176 1369371 1287244 1275198 1187306
13646A187306M4028l1044k2978J8911J14995L5981o2454j42148J3958Q5802N6255
$$ 1187306 1231334 1200290 1177312 1196223 1311218 1347199 1284745 1142597 1156555 1242357 1298612
13635A298612r7397l1292J11290j1923J8790J178j47482j27359N25P9585J6622
$$ 1298612 1201215 1169923 1281213 1269290 1288080 1289258 1141776 1014417 1014942 1094527 1111149
13624A111149n508J38963M2127p5659l0979j11937q2584J6962J7628n4694k3321
$$ 1111149 1105641 1244604 1286731 1211072 1180093 1068156 985572 1002534 1020162 965468 942147
13613I42147O6123J09695j1683N1175L2822K7073n6985l9206m8204L9107q7095
$$ 942147 1008270 1117965 1106282 1157457 1190279 1217352 1160367 1121161 1072957 1112064 1024969
13602A024969j33803p7542j2877K7533O3153L7214P4373m7853o744N057r2553
$$ 1024969 891166 813624 800747 828280 891433 928647 1003020 955167 948423 953480 860927
13591H60927j26323j44442p066J43946k3001r8911J04598l4164j19681p2460l3160
$$ 860927 734604 590162 583096 727042 704041 605130 709728 675564 555883 483423 450263
13580D50263p630k0223l9871M0532k3645P8541Q1997j08430j3971J20401r769
$$ 450263 442633 422410 382539 423071 399426 477967 559964 451534 437563 557964 548195
13569E48195N0262q5320j02076o0451m0364J16898J11820P8024l9486K3097j3355
$$ 548195 598457 513137 411061 350610 310246 427144 538964 616988 577502 600599 587244
13558E87244M7440j0664k4836l7649n4968L2571J7096j21111l2263M9399m509
$$ 587244 634684 624020 599184 561535 506567 539138 556234 435123 402860 452259 447750
13547D47750j416N3214K1748k2266r3602L0054l8673L2810K5996J21216l8407
$$ 447750 446334 499548 521296 499030 405428 435482 396809 429619 455615 576831 538424
13536E38424o7092o5604j00399q1924l4990K0524l603R7186Q2745J25126L0090
$$ 538424 471332 405728 305329 223405 188415 208939 205336 302522 385267 510393 540483
13525E40483r3477j27733J15195R9546J6882J3683j21487n4356K4021N5822J0828
$$ 540483 447006 319273 434468 534014 550896 564579 443092 388736 412757 468579 479407
13514D79407j09172L7216l9832j42635k28Q8138k9936j03173m2465K35836J17409
$$ 479407 370235 407451 367619 224984 224756 312894 282958 179785 137320 373156 490565
13503D90565m8363j22206k0095N0810k0278N7663J3780l5152k5437q4681q4546
$$ 490565 442202 319996 299901 350711 330433 388096 401876 366724 341287 256606 172060
13492A72060P4543k7145J79R6525o8441K10P0605q9092j285P9779k1713J137J130
$$ 172060 246603 219458 219637 316162 247721 247931 318536 229444 228159 307938 286225 287362 288492
13479B88492L6135j05056m3625j821P6108k0189k208r844q05Q2709P2635N5081
$$ 288492 324627 219571 175946 174125 250233 230044 227836 217992 217187 299896 372531 427612
13467D27612q3891j37450o9132j38448Q1162J71702Q7313p2875k3006K7783O1329
$$ 427612 343721 206271 137139 -1309 79853 251555 338868 265993 242987 270770 332099
13456C32099N6797M2665L0526r7418K0884p198l7235r4046J15898Q7995o4106
$$ 332099 388896 431561 462087 364669 385553 378355 341120 247074 362972 450967 386861
13445C86861o4617m9090p6742j1977j0210q8752j11678n0428O3829J22955N5667
$$ 386861 322244 273154 196412 184435 174225 85473 -26205 -76633 -12804 110151 165818
13434A65818J08399m3221q550j5207p490J29909m5709j70981k8829L5873P3541
$$ 165818 274217 230996 222446 207239 199749 329658 283949 112968 84139 120012 193553
13423A93553n3893p469L1214j5773l8878k6671R7697M284q878n2578k128q191
$$ 193553 139660 132191 163405 147632 108754 82083 179780 184064 175186 122608 120480 112289
13411A12289m2243K7247m5088o084o6230N4049N0930K7703j4581N3071j2195P5541
$$ 112289 70046 97293 52205 46121 -20109 33940 84870 112573 97992 151063 138868 214409
13399B14409q1377o4833O9053j04474j9915L7645O4935m0491k8780K7659M1233
$$ 214409 133032 68199 137252 32778 12863 50508 115443 74952 46172 73831 115064
13388A15064J37010O7984j41028j5759Q4981j8495j03402n6392N1408Q1708o1069
$$ 115064 252074 320058 179030 163271 248252 229757 126355 69963 121371 203079 142010
13377A42010Q0713N1689l6648j3876p812j35214M2475J24284M0774k7662q2432
$$ 142010 222723 274412 237764 223888 216076 80862 123337 247621 288395 260733 178301
13366A78301r1240n462J6564J6106n3290K6423P3988J3295N086j01965j00695
$$ 178301 87061 81599 98163 114269 60979 87402 161390 174685 179771 77806 -22889
13355b2889K7219k3292K2005Q259j6407k2257l7703N797k1934M5090K4283k6704
$$ -22889 4330 -18962 3043 11302 -5105 -27362 -65065 -59268 -81202 -36112 -11829 -38533
13343c8533l3475l9618Q2352P5511P0091J9209n675l5979j60882Q5928J07354
$$ -38533 -72008 -111626 -29274 46237 116328 135537 129862 93883 -66999 18929 126283
13332A26283N5013J35048K1209m521j73434p5612M0744J0490K9349M2493R9246
$$ 126283 181296 316344 337553 333032 159598 83986 124730 135220 164569 207062 306308
13321C06308q8274m9045m9602p6365L1454N9862n7514J5018j7154R9560J0906
$$ 306308 218034 168989 119387 43022 74476 134338 76824 91842 74688 174248 185154
13310A85154j1076j5855n1103J4094J5383O059j6080j12843P8974J4136O6523
$$ 185154 174078 158223 107120 121214 136597 142656 126576 13733 92707 106843 173366
13299A73366j16982m5077J52829P3989M7882p6165j66733q7671K4974J07919K5800
$$ 173366 56384 11307 164136 238125 286007 209842 43109 -44562 -19588 88331 114131
13288A14131O3967j46397r4453N5484l6275K5058R1154M4317p0538k2970m02R0261
$$ 114131 178098 31701 -62752 -7268 -43543 -18485 72669 116986 46448 23478 23076 113337
13276A13337J69553K2342j19496o6653j6687m7577J20754J21952n4242n6091o8928
$$ 113337 282890 305232 185736 119083 102396 54819 175573 297525 243283 187192 118264
13265A18264j07179L0892l9387K9522R568r84N7433k2587l6561P675Q3837M265
$$ 118264 11085 41977 2590 32112 41680 40696 98129 75542 38981 46656 130493 134758
13253A34758M4406M9200L8965j21733p4035j5344j4922K9750j3998n1176M9137
$$ 134758 179164 228364 267329 145596 71561 56217 41295 71045 57047 5871 55008
13242E5008q7488O4393J8275q4698p6633o343R9298K2209M3357J70922k3482l2378
$$ 55008 -32480 31913 50188 -34510 -111143 -117486 -18188 4021 47378 218300 194818 162440
13230A62440J21059P6032n1902m4045J42203J6001j46400j46094o4241N0728o1664
$$ 162440 283499 359531 307629 263584 405787 421788 275388 129294 65053 115781 54117
13219E4117M2305r0732J1893l3077J26795J03317j13617Q9617O7447p942p7391
$$ 54117 96422 5690 17583 -15494 111301 214618 101001 190618 258065 250123 172732
13208A72732R0922M0273L4142j02104j10511Q8279l9738k3298P6075r136m9224
$$ 172732 263654 303927 338069 235965 125454 213733 173995 150697 226772 217636 168412
13197A68412j40O733o379O6459p5414n3283m4460N7157L6973K7045j31048n1563
$$ 168412 168272 175005 168626 235085 159671 106388 61928 119085 156058 183103 52055 492
13185D92J78229M3097k1909j3122j11449l7780K9868J58843Q4491o5146o4409
$$ 492 178721 221818 199909 186787 75338 37558 67426 226269 310760 245614 181205
13174A81205l4667K8236L9305l5775o8162l3583n6644N343l5199P9940Q8455M7636
$$ 181205 146538 174774 214079 178304 110142 76559 19915 25258 -9941 69999 158454 206090
13162B06090J32865L849q0306j80614k9484l1496l6172k7746K9934Q9592K3660
$$ 206090 338955 342804 262498 81884 52400 20904 -15268 -43014 -13080 76512 100172
13151A00172j7288j19630P2817M6995J06108L2574L6814r2264p4471j00144l7895
$$ 100172 82884 -36746 36071 83066 189174 221748 258562 166298 91827 -8317 -46212
13140d6212J02658l357p0625J05783j6859l8443O7232J13601j84477j0066l7550
$$ -46212 56446 53089 -17536 88247 71388 32945 100177 213778 29301 19235 -18315
13129a8315n0438O8035R3512r400K222n1774j3805j2526M8437K518r0191k0493
$$ -18315 -68753 -718 92794 83394 85616 33842 20037 7511 55948 58466 -31725 -52218
13117e2218l8408k1539m5326L3176m3j4524M3839J41057M3805p6564M4177Q0033
$$ -52218 -90626 -112165 -157491 -124315 -124358 -138882 -95043 46014 89819 13255 57432 137465
13105A37465N9583j00811k1786N54j69720p4632N8820q9647J9575Q8098M6701
$$ 137465 197048 96237 74451 75005 -94715 -169347 -110527 -200174 -180599 -92501 -45800
13094d5800P1088q887n3036q2116r3368J8479o390j1936J24635M7461p548J3371
$$ -45800 25288 16401 -36635 -118751 -212119 -193640 -200030 -211966 -87331 -39870 -47418 -34047
13082c4047k1719J62605Q7883J10476j7443r4203o8843N2647j54882j18631P5375
$$ -34047 -55766 106839 194722 305198 287755 193552 124709 177356 22474 -96157 -20782
13071b0782O4805J65076Q6730r9095q7059J472q3761j28265L2545R8469K4022
$$ -20782 44023 209099 295829 196734 109675 111147 27386 -100879 -68334 30135 54157
13060E4157O344Q6579L1520L0408n3500n7259k1969m7326j2088j17224j3822n7262
$$ 54157 60501 147080 178600 209008 155508 98249 76280 28954 16866 -100358 -114180 -171442
13048a71442N2522J5040J38534n6354n8505M92L8220l3559k8629R2969L3036o3760
$$ -171442 -118920 -103880 34654 -21700 -80205 -79713 -41493 -75052 -103681 -10712 22324 -41436
13036d1436j5221L6743r6160K444P8466R7063J598q4222n0333R702J8006J33654
$$ -41436 -56657 -19914 -116074 -113630 -35164 61899 63497 -20725 -71058 -61356 -43350 90304
13024I0304L2847K5705N1719o2915k9708l3243j65412j33831J911J45249R3204
$$ 90304 123151 148856 200575 137660 107952 74709 -90703 -224534 -222623 -77374 15830
13013A5830N196j92783p0288J35071J27478N4998j18022j43842q9740J63163J51360
$$ 15830 21026 -171757 -242045 -106974 20504 75502 -42520 -186362 -276102 -112939 38421
13002C8421j30897k5432j2337L0208L1109m6725p9998J7512K7580p568M0494N0704
$$ 38421 -92476 -117908 -130245 -100037 -68928 -115653 -195651 -178139 -150559 -158127 -117633 -66929
12990f6929o8917j8916o6504r1475K6682J43072J48944J7788M1640N8657R5203
$$ -66929 -135846 -154762 -221266 -312741 -286059 -142987 5957 23745 65385 124042 219245
12979B19245J7642N2100l2184k07491J8453p9771J452o709k3891M691J02644j0102
$$ 219245 236887 288987 256803 49312 67765 -12006 -10554 -17263 -41154 -36463 66181 56079
12967E6079K7631M1252l9210j338N0229M5956q5416l7903j09762n563P5421O5703
$$ 56079 83710 124962 85752 84414 134643 180599 95183 57280 -52482 -58045 17376 83079
12955H3079l727j3967j05562J23794j0104p3445K8865p5535o8293M1064P7693
$$ 83079 79352 65385 -40177 83617 73513 68 28933 -46602 -114895 -73831 3862
12944C862J58817P1698J1480j47190o6925r528n7947p0088n4016o957Q6486k6655
$$ 3862 162679 234377 245857 98667 31742 22214 -35733 -105821 -159837 -166794 -80308 -106963
12932a06963n9962m3783j0135J0918N5047J91438o785j44227j28122J09231K37940
$$ -106963 -166925 -210708 -220843 -209925 -154878 36560 29775 -114452 -242574 -133343 104597
12921A04597J10841R118j5073k488q3291q8262j20638K2849j1220N4459P4697
$$ 104597 215438 224556 209483 206995 123704 35442 -85196 -62347 -73567 -19108 55589
12910E5589j2046r6980m6887O9020k562k1143q2364K945R4165Q1427K3363K661
$$ 55589 43543 -53437 -100324 -31304 -33866 -55009 -137373 -134428 -40263 41164 64527 67188
12898F7188j1098O2272o280r9889q6682j27728o340J23154P9125K963j06004J201
$$ 67188 56090 118362 112082 12193 -74489 -202217 -208557 -85403 -6278 -3315 -109319 -108118
12886a08118L9612Q1525M3654k7848l65M1426P7177o4383K4922q7030q3183p4958
$$ -108118 -68506 13019 56673 28825 28460 69886 147063 82680 107602 20572 -62611 -137569
12874a37569j07218l9821M1701M7704J34721J8865R0852J397l662p0732N2680
$$ -137569 -244787 -284608 -242907 -195203 -60482 -41617 49235 50632 46970 -23762 28918
12863B8918l2076q0702n1925j4353L4918N6574R6067O361l8161r8336K255N0155
$$ 28918 -3158 -83860 -135785 -150138 -115220 -58646 37421 43782 5621 -92715 -90460 -40305
12851d0305j6106O2893n2075L4468J3613n9071O3456o2028p1862j06267N3752
$$ -40305 -56411 6482 -45593 -11125 2488 -56583 6873 -55155 -127017 -233284 -179532
12840a79532n8115O6288J63641j5670O553l9098m5773p6424l1124L0834O5897
$$ -179532 -237647 -171359 -7718 -23388 -16835 -55933 -101706 -178130 -209254 -178420 -112523
12829a12523J37315j9997O1236K9457L0421l0238r2813k1088j98m8707p981N2991
$$ -112523 24792 4795 66031 95488 125909 95671 2858 -18230 -18428 -67135 -75116 -22125
12817b2125O2263m9753N5022P7686m0629m6595K8609J09780L7456q9197n8451
$$ -22125 40138 -9615 45407 123093 82464 35869 64478 174258 211714 122517 64066
12806F4066n2441N0035N5695p6675k6423R584N0166P5000n4641o2301J2070J1448
$$ 64066 11625 61660 117355 40680 14257 23841 74007 149007 94366 32065 44135 55583
12794E5583Q3781l8370K3324N314j33602j03607Q7584M6461j1025p888j298n6866
$$ 55583 139364 100994 124318 129632 -3970 -107577 -19993 26468 15443 7555 6257 -50609
12782e0609J3680K3981P4643q0647o2709J58077J47509r1560o7568O1971q9530
$$ -50609 -36929 -12948 61695 -18952 -81661 76416 223925 132365 64797 126768 37238
12771C7238j23055l2657K3178L1593L1940l1956O5296R7700o4103q8944L9025
$$ 37238 -85817 -118474 -95296 -63703 -31763 -63719 1577 99277 35174 -53770 -14745
12760a4745j8347l3357O0823J07216L6418p0124N73k4705l8928J3899j22359p4195
$$ -14745 -33092 -66449 -5626 101590 138008 67884 68457 43752 4824 18723 -103636 -177831
12748a77831K56645J46738m4246o7647j49011O01k249N0635k2666r8745J53716
$$ -177831 78814 225552 181306 113659 -35352 -34751 -37000 13635 -9031 -107776 45940
12737D5940M9846K599M1198k9262j67928j70477N3346J94388O1425j20874n1034
$$ 45940 95786 98385 139583 110321 -57607 -228084 -174738 19650 81075 -39799 -90833
12726i0833r5316K8489L6056l7477R6305O1965K0765L0453q5972n1257m6867M339
$$ -90833 -186149 -157660 -121604 -159081 -62776 -811 19954 50407 -35565 -86822 -133689 -129350
12714a29350k6122q9302M3770K1088Q411j1375Q4623P2564n7661m9121Q096J01588
$$ -129350 -155472 -244774 -201004 -179916 -171505 -182880 -98257 -25693 -83354 -132475 -124379 -22791
12702b2791Q9393j13606j4584J24646o428J6063j0744l2025j24911L4124l3398
$$ -22791 66602 -47004 -61588 63058 56630 72693 61949 29924 -94987 -60863 -94261
12691i4261m7972J31450R8522l8843K888j529R98l5760K6869M4475O350J0655
$$ -94261 -142233 -10783 87739 48896 51784 50255 51253 15493 42362 86837 93187 103842
12679A03842K590j36206m6802M0604j04644N5968K6252o1456m9289J22671K7371
$$ 103842 106432 -29774 -76576 -35972 -140616 -84648 -58396 -119852 -169141 -46470 -19099
12668a9099J10444R4899p5020j66555j00369K505J20791N5709N0937n3301n749
$$ -19099 91345 186244 111224 -55331 -155700 -153195 -32404 23305 74242 20941 15192
12657A5192m7139k9516L2502K6812J7747L2004m8359r9479l918N471L9233m9672
$$ 15192 -31947 -61463 -28961 -2149 15598 47602 -757 -100236 -104154 -98683 -59450 -109122
12645a09122o4781Q1871K6357j3836r9366j00240l2959O1983R8456R7256N0149
$$ -109122 -173903 -92032 -65675 -79511 -178877 -279117 -312076 -250093 -151637 -54381 -4232
12634d232n47J3207L3761l4093m2580r747o865o786J9638q7979q4823J23519O8234
$$ -4232 -4779 8428 42189 8096 -34484 -44231 -51096 -57882 -38244 -126223 -211046 -87527 -19293
12621a9293N739l4814m2656n7446M9633L2001p0660l1857L4468J07424O3194L864
$$ -19293 -13554 -48368 -91024 -148470 -98837 -66836 -137496 -169353 -134885 -27461 35733 39597
12609C9597o4050p7832J52656j2985p4473j65083n9396R4935J15875J08078R9924
$$ 39597 -24453 -102285 50371 37386 -37087 -202170 -261566 -166631 -50756 57322 157246
12598A57246J12555p1406j55067n040J1044q717n3853k9584O4029J54385M6440
$$ 157246 269801 198395 43328 38288 49332 40615 -13238 -42822 21207 175592 222032
12587B22032m3733o733q7394j20108L3754Q3108N7328m0796r9033j9981l6656
$$ 222032 178299 171566 84172 -35936 -2182 80926 138254 97458 -1575 -21556 -58212
12576e8212k9272M523K2815J50497K197p7026j08965K3732O7520l9966Q6688J8293
$$ -58212 -87484 -82961 -60146 90351 92548 15522 -93443 -69711 -2191 -42157 44531 62824
12564F2824k7819O7531J64182N1260j46195r9183O9358P9451o7795l1414j12012
$$ 62824 35005 102536 266718 317978 171783 72600 141958 221409 153614 122200 10188
12553A0188q7617Q8490K8897p3613k0301m7911M0340J94689L4431p313K1083j44581
$$ 10188 -77429 11061 39958 -33655 -53956 -101867 -61527 133162 167593 160280 181363 36782
12541C6782o0770Q2404M9039J3830N067k2562Q2229Q723j81333r7368n6608p8739
$$ 36782 -23988 58416 107455 121285 126352 103790 186019 194742 13409 -83959 -140567 -219306
12529b19306j21296J60819J62824O3721L960j7118j12771j9458J6649O535N7952
$$ -219306 -340602 -179783 -16959 46762 50722 33604 -79167 -98625 -81976 -75441 -17489
12518a7489o7096j01539j1623J35864M8619r7445q3808l2331J66328L7647J83856
$$ -17489 -84585 -186124 -197747 -61883 -13264 -110709 -194517 -226848 -60520 -22873 160983
12507A60983M227k9506K6443n956l5772j29753J7926K935K0721p7564p6194K8932
$$ 160983 165210 135704 162147 156191 120419 -9334 8592 11527 32248 -45316 -121510 -92578
12495i2578J67750J31324j24824k8705M8524J6819o4574L1770j566j2220k2332
$$ -92578 75172 206496 81672 52967 101491 118310 53736 85506 83940 71720 49388
12484D9388r1063K8796l9963j5107N6605L8652M4863j9258m4854l9946J08674
$$ 49388 -41675 -12879 -52842 -67949 -11344 27308 72171 52913 8059 -31887 76787
12473G6787j2372j0838M9217k1855p072M019n0889r4427p9262J04048J27281P3469
$$ 76787 64415 53577 102794 80939 73867 77886 26997 -67430 -146692 -42644 84637 158106
12461A58106K2134j27013r8089k8424J48170P7877N0118J0050O847n9802k1335
$$ 158106 180240 53227 -44862 -73286 74884 152761 202879 212929 219776 159974 138639
12450A38639j17215j0459l2787j9064M6622R8991J688N2746j17737o906M5232
$$ 138639 21424 10965 -21822 -40886 5736 104727 106415 159161 41424 34518 79750
12439G9750k7043R2512n6969M299j8388k3464k7676O9085l3085k9505m0712P2974
$$ 79750 52707 145219 88250 92549 74161 50697 23021 92106 59021 29516 -11196 61778
12427F1778J9292Q1974N7168r0408q8137j28669m7031J0390n1349K3090J08940
$$ 61778 81070 163044 220212 129804 41667 -87002 -134033 -123643 -174992 -151902 -42962
12416d2962M8433n6053Q2638J29045m3825j38011N979j6371N2632J43637J0236
$$ -42962 5471 -50582 32056 161101 117276 -20735 -14756 -31127 21505 165142 175378
12405A75378O88O7221l3926q1582j89795j18403R1141k1913J37627K8646j12335
$$ 175378 176066 243287 209361 127779 -62016 -180419 -89278 -111191 26436 55082 -57253
12394e7253p0549R3402J70110m0307j38265k2497L6989N411N0562l9242j8402
$$ -57253 -127802 -34400 135710 95403 -42862 -65359 -28370 -22959 27603 -11639 -30041
12383c0041n4977j0567L6467m9217M3399K606L209O7701m9875j13414o671l0624
$$ -30041 -85018 -95585 -59118 -108335 -64936 -62330 -59121 8580 -41295 -154709 -161380 -192004
12371a92004j9167J7938j27459M5633K01342Q6407J21517j8038n0197m4958K8501
$$ -192004 -211171 -193233 -320692 -275059 -73717 12690 134207 116169 65972 21014 49515
12360D9515j1560n5383j09374m5223J06444j02543m6223J1419J6346k3298K6357
$$ 49515 37955 -17428 -126802 -172025 -65581 -168124 -214347 -202928 -186582 -209880 -183523
12349a83523J15551Q9992M1734n1318j52159O5260J1709J09528r4792k2200P3186
$$ -183523 -67972 22020 63754 12436 -139723 -74463 -62754 46774 -48018 -70218 2968
12338B968L4637j4780M917k4421o999r2029p1942j2309l6609L7662J46778J69576
$$ 2968 37605 22825 27742 3321 -3678 -95707 -167649 -179958 -216567 -178905 -32127 137449
12326A37449m716j94568o8568M6988O7810l8270n7576J2580L3432L8046J78006
$$ 137449 132733 -61835 -130403 -83415 -15605 -53875 -111451 -98871 -65439 -27393 150613
12315A50613O6897o0857j56611j28066K2632J81311m886j23081K3430l2636q5966
$$ 150613 217510 156653 42 -128024 -105392 75919 71033 -52048 -28618 -61254 -147220
12304a47220O9880P2971P9298m5148J4976P1608j03509m4210J5217l0701J4392
$$ -147220 -77340 -4369 74929 29781 44757 116365 12856 -31354 -16137 -46838 -32446
12293c2446K6503J4053L7520J7356o0392r4204j760J71838K1451m2573q2471p0865
$$ -32446 -5943 8110 45630 62986 2594 -91610 -93370 78468 99919 57346 -25125 -95990
12281i5990m6958J36700L3644k6913p0222q9088k7335J20927l3267L223m5154
$$ -95990 -142948 -6248 27396 483 -69739 -158827 -186162 -65235 -98502 -95279 -140433
12270a40433m3528J00151J13522Q016k9466q8595k066j4949J04514J3715M0040
$$ -140433 -183961 -83810 29712 37728 8262 -80333 -82399 -97348 7166 20881 60921
12259F0921M0386k9427N664J9240J07489l2929j14010k8560L1425m4224Q022K3300
$$ 60921 101307 71880 77544 96784 204273 171344 57334 28774 60199 15975 23997 47297
12247D7297m066L28O1407q7287n1995J0657n5944O009M954N2433P6961l6130q2255
$$ 47297 43231 43559 104966 17679 -34316 -23659 -79603 -73594 -68640 -16207 60754 24624 -57631
12234e7631J6405P0330P259n7262l5090l6642L9394J44907K4827j27250l9992
$$ -57631 -41226 29104 36363 -20899 -55989 -92631 -53237 91670 116497 -10753 -50745
12223e0745M9335j264K5214P7842q7547n5033O6904L5514K0979K8433Q4127o5157
$$ -50745 -1410 -2674 22540 100382 12835 -42198 24706 60220 81199 109632 193759 128602
12211A28602q3722J7271L1095L6874l8958q6145L3023k995p474j28524N347R1576
$$ 128602 44880 62151 93246 130120 91162 5017 38040 35045 27571 -100953 -95606 -4030
12199d030m7706n8954l7415m6947J06674J00896J9480L4674M0451k9457M4116
$$ -4030 -51736 -110690 -148105 -195052 -88378 12518 31998 66672 107123 77666 121782
12188A21782M7734j10862j5823J35781p150p5955p1774l3766M6656J00730K1314
$$ 121782 169516 58654 42831 178612 171462 95507 23733 -10033 36623 137353 158667
12177A58667k32820j49847L2600K2205j13069j07905O9257J73199J20043R593
$$ 158667 -74153 -224000 -191400 -169195 -282264 -390169 -320912 -147713 -27670 -18077
12167a8077J7547K1876j28987O8835Q4616J28351N4122j4366o3173Q4702L993
$$ -18077 -530 21346 -107641 -38806 45810 174161 228283 213917 150744 235446 239439
12156B39439q8687k41917o3394P4302N3210M1900k535J1322J5064n2347k7177
$$ 239439 150752 -91165 -154559 -80257 -27047 14853 12318 23640 38704 -13643 -40820
12145d0820J01834K7454m2895P601l0250k5077j0245R8207L4213P1699p2512o8307
$$ -40820 61014 88468 45573 53174 22924 -2153 -12398 85809 120022 191721 119209 50902
12133E0902K5529M7536j4304J229j6594l564N6244O5630r0905j49576J1246O8809
$$ 50902 76431 123967 109663 110892 94298 90734 146978 212608 121703 -27873 -16627 52182
12121E2182l1839K8319k7505J18632l3553n1002N4204M3272j46287o764K749K3313
$$ 52182 20343 48662 21157 139789 106236 55234 109438 152710 6423 -341 2408 25721
12109B5721k6783l8837j06360l2698K4796R4128K325M728K1269K0823K4792M9212
$$ 25721 -1062 -39899 -146259 -178957 -154161 -60033 -57708 -52980 -31711 -10888 13904 63116
12097F3116J7060o8072m3654l2225J9549P6002J03148K0815l5495M1787j9367
$$ 63116 80176 12104 -31550 -63775 -44226 31776 134924 155739 120244 162031 142664
12086A42664j1511o9277q0433J3357R7757R120q255k1010j4614j9511l4184q2284
$$ 142664 131153 61876 -18557 -5200 92557 101677 93422 72412 57798 38287 4103 -78181
12074g8181Q240J8557o0135j7492P7032L9248r3279k6996l349j254J11803J19843
$$ -78181 -69941 -51384 -111519 -129011 -51979 -12731 -106010 -133006 -136355 -137609 -25806 94037
12062I4037M5554R9500m6795m524o8377p5091r7288K7603N8469Q4563M1882k6134
$$ 94037 139591 239091 192296 187772 119395 44304 -52984 -25381 33088 117651 159533 133399
12050A33399q9079p7831O1337k0120N4786M4311m1362L9321k2673N1367K10955
$$ 133399 44320 -33511 27826 7706 62492 106803 65441 104762 82089 133456 344411
12039C44411K03653J83073K26900L20089J13371Q3869K46812J74037p9489k94451
$$ 344411 548064 731137 958037 1278126 1391497 1475366 1722178 1896215 1816726 1522275
12029A522275k37066o7226j20505r3619j1615J44637J2107j40219n9516m3524
$$ 1522275 1285209 1217983 1097478 1003859 992244 1136881 1148988 1008769 949253 905729
12019I05729K624L1936j7722K4265m1925J8121M6322j0064l8907J1167k1k6760
$$ 905729 908353 940289 922567 946832 904907 923028 969350 959286 920379 931546 931525 904765
12007I04765r0681M277l818q7651l0341K084M6887J2202j25229L855l9389o6131
$$ 904765 814084 818361 814543 726892 696551 698635 745522 757724 632495 636350 596961 530830
11995E30830o181J8265J04398J01466l787j97741R4544P4135K5814J5549l9902
$$ 530830 524649 542914 647312 748778 744991 547250 641794 715929 741743 757292 717390
11984G17390R2821L0990j00040r4791L4663N2239Q3580K0659o8132l5681m0984
$$ 717390 810211 841201 741161 646370 681033 733272 816852 837511 769379 733698 692714
11973F92714j6520J24170L2130j26031R9345J3238O1007O5839Q3406M8459K3592
$$ 692714 676194 800364 832494 706463 805808 819046 880053 945892 1029298 1077757 1101349
11962A101349m7971m5303L2711J8209N7831M4063l9036p31J03897J7963j691K6805
$$ 1101349 1053378 1008075 1040786 1058995 1116826 1160889 1121853 1121122 1225019 1242982 1241291 1268096
11950A268096Q1811J00077M1911J92394J49299J0427m812N977J58844J50391O0038
$$ 1268096 1349907 1449984 1491895 1684289 1833588 1844015 1839203 1845180 2004024 2154415 2214453
11939B214453J43202J61783J05032K23078L54031J73101K61361K43410K43057
$$ 2214453 2357655 2519438 2624470 2847548 3201579 3374680 3636041 3879451 4122508
11930D122508L60754L26669M74973N82346N85725Q79600Q86305Q17747J109686
$$ 4122508 4483262 4809931 5284904 5867250 6452975 7332575 8218880 9036627 10146313
11921A0146313J414780J709560K202124K805370L773076N031897P067738J0209303
$$ 10146313 11561093 13270653 15472777 18278147 22051223 27083120 34150858 44360161
11913D4360161J5418468K4799672L9842360N5293583N5958203M1117949L3910779
$$ 44360161 59778629 84578301 124420661 179714244 235672447 276790396 310701175
11906C10701175K6615847j2728884o3485617p2204096n1629702l2306692k0521319
$$ 310701175 337317022 324588138 261102521 188898425 137268723 104962031 84440712
11899H4440712j3693917r599855p140922n579946m499247l638394l022967k680906
$$ 84440712 70746795 61146940 54006018 48426072 43926825 40288431 37265464 34584558
11891C4584558k247594j932241j605114j487852j519715j149583r90096r53481
$$ 34584558 32336964 30404723 28799609 27311757 25792042 24642459 23652363 22698882
11883B2698882q09256q62886q81559p08994m66817n90662o08192n14825m69509
$$ 22698882 21889626 21026740 20145181 19436187 18969370 18378708 17770516 17255691 16786182
11874A6786182n50007n13805m13210l71876l41565m18105m70493m49383m66410
$$ 16786182 16236175 15722370 15309160 14937284 14595719 14177614 13707121 13257738 12791328
11865A2791328l83116l48788k03980l37796l82064m13552l40959k04031l00976
$$ 12791328 12408212 12059424 11855444 11517648 11135584 10722032 10381073 10177042 9876066
11856I876066k44758l43345k62647k51516j63288k44348k41705j68553k35255
$$ 9876066 9631308 9287963 9025316 8773800 8610512 8366164 8124459 7955906 7720651
11847G720651j44422j64429k52222j10352M206k00351j66823r1027p5042j51117
$$ 7720651 7576229 7411800 7159578 7049226 7053432 6853081 6686258 6595231 6520189 6369072
11837F369072j95990o1275k23273j06645j11590p4015j2824j98431j54466j52957
$$ 6369072 6173082 6111807 5888534 5781889 5670299 5596284 5583460 5385029 5230563 5077606
11827E077606o4482r6902J14196p8915j37857o9091r8469j59700j19095l7938
$$ 5077606 5013124 4916222 5030418 4951503 4813646 4744555 4646086 4486386 4367291 4329353
11817D329353j15806j46663j78547r6497p7779j77040p5079J6000p501p5704j77049
$$ 4329353 4213547 4066884 3888337 3791840 3714061 3537021 3461942 3477942 3470441 3394737 3217688
11806C217688j31584j8650k5228M5658N993o1698o3491j27453l70008l994P0997
$$ 3217688 3086104 3067454 3042226 3087884 3093877 3032179 2968688 2841235 2471227 2467233 2538230
11795B538230K1717J7994p315p3401O7151P0984q9138L225J00007K11309K30604
$$ 2538230 2559947 2577941 2570626 2497225 2564376 2635360 2546222 2549447 2649454 2860763 3091367
11784C091367J88371K11420O5055l9627k9014J16466q8634l37805k68385o4360
$$ 3091367 3279738 3491158 3556213 3516586 3487572 3604038 3515404 3177599 2909214 2844854
11774B844854j92300r0669J4747j7213r1404m3726m4122M4649m5418j37836J8926
$$ 2844854 2652554 2561885 2576632 2559419 2468015 2424289 2380167 2424816 2379398 2241562 2260488
11763B260488l2450r1051j36551j29716J6615L9744m8131m6808k6990O3510o4519
$$ 2260488 2228038 2136987 2000436 1870720 1887335 1927079 1878948 1832140 1805150 1868660 1804141
11752A804141j17016k6322O8642J20137O030j97791n9906O9324m0343j45377k00445
$$ 1804141 1687125 1660803 1729445 1849582 1855612 1657821 1597915 1667239 1626896 1481519 1281074
11741A281074r2890P3037p502L5585Q2477r0761P2394L1666j34952r0297j25508
$$ 1281074 1188184 1261221 1253719 1289304 1371781 1281020 1353414 1385080 1250128 1159831 1034323
11730A034323R025L2978k7477m0040n4966L2684o009m3317P3884q3977j20236
$$ 1034323 1043348 1076326 1048849 1008809 953843 986527 980518 937201 1011085 927108 806872
11719H06872j1498P2499L5682M128r3972n2797J07442R3963j12419j1109n182
$$ 806872 795374 867873 903555 907683 813711 760914 868356 962319 849900 838791 833609
11708H33609m6095r2532K0867M8730O8827k862j19979j39804J674o1487J04897
$$ 833609 787514 694982 715849 764579 833406 830544 710565 570761 572435 510948 615845
11697F15845J24715p1433q8553K2154q9672j18675n2641K1175J33382K6011K4655
$$ 615845 740560 669127 580574 602728 513056 394381 341740 362915 496297 522308 546963
11686E46963l0055J3341R527L3910L0092L1740j34530o9565R596r252o7316j44315
$$ 546963 516908 530249 539776 573686 603778 635518 500988 431423 441019 431767 364451 220136
11674B20136M0094l14M7635J5072l1066J3885Q853J7162o8288j4175J41951j19942
$$ 220136 260230 259916 307551 322623 291557 305442 314295 331457 263169 248994 390945 271003
11662B71003m8534Q5535R2673m4085j5620R6803K3462k1147j10561m926L6607
$$ 271003 222469 308004 400677 356592 340972 437775 461237 440090 329529 324603 361210
11651C61210K4313K9223O0806l7130j4307K100j03806m0034o9421R330K2030Q9002
$$ 361210 385523 414746 475552 438422 424115 426215 322409 282375 212954 222284 244314 333316
11639C33316l0682j73664j44964K8116K00695J33389p4983q692M2316p3848J0883
$$ 333316 302634 128970 -15994 12122 212817 346206 271223 262531 304847 230999 241882
11628B41882p3217o8583L6944J68425m9668j73831Q9637K5912r7243p2143K6711
$$ 241882 168665 100082 137026 305451 255783 81952 171589 197501 100258 28115 54826
11617E4826Q3310q455j27525n9166N9521N9354N7544j24641K8814J87812k7751
$$ 54826 138136 129681 2156 -57010 2511 61865 119409 -5232 23582 211394 183643
11606A83643J2586J4785k8165j3088p2150j75853p2023J59033J8305o1811j2321
$$ 183643 196229 211014 182849 169761 97611 -78242 -150265 8768 27073 -34738 -47059
11595d7059j6291J9530M6427P0148Q3110j08571K3958J32150n5101O0612o6491
$$ -47059 -63350 -43820 2607 72755 155865 47294 71252 203402 148301 208913 142422
11584A42422q0028L869N4197Q5376j35595j37633L7691Q2829O1272p1288O3211
$$ 142422 62394 66263 120460 205836 70241 -67392 -29701 53128 114400 43112 106323
11573A06323L2296J04100j13700r1695J05346J6428M3567k4284m6243M1863J05413
$$ 106323 138619 242719 129019 37324 142670 159098 202665 178381 132138 174001 279414
11562B79414O8824r6379p1120j44254j08130L1413k4023m8371K4195J22248M563
$$ 279414 348238 251859 180739 36485 -71645 -40232 -64255 -112626 -88431 33817 38380
11551C8380Q8929O3436j08041j07497K5941J52148J05666k2152j2832l466P6997
$$ 38380 127309 190745 82704 -24793 1148 153296 258962 236810 223978 220512 297509
11540B97509j48552j65924p7504k6780O1352l1113r756K577M9463M1786k2405
$$ 297509 148957 -16967 -94471 -121251 -59899 -91012 -100768 -98191 -48728 -6942 -29347
11529b9347k0276J37927J80385L1029j72534o5610J05533k8377K109r3711j10454
$$ -29347 -49623 88304 268689 299718 127184 61574 167107 138730 140839 47128 -63326
11518f3326j30624j02904o1998Q89P2682J64058R2032M3854O8402O1160l278q6545
$$ -63326 -193950 -296854 -358852 -357963 -285281 -121223 -29191 14663 83065 144225 140947 54402
11506E4402J1000o1401P1355m9964K20709K6297k40454n4197J00599l5970J44413
$$ 54402 65402 4001 75356 25392 246101 272398 31944 -22253 78346 42376 186789
11495A86789N5325j41163r5940L9956L2336M3305m1039o3700k2712J00363Q997
$$ 186789 242114 100951 5011 44967 77303 120608 79569 15869 -6843 93520 102517
11484A02517l9323k7389k2653j500K0714R1680L7327l1455L1224j3889q9682K0787
$$ 102517 63194 35805 13152 11652 32366 124046 161373 129918 161142 147253 57571 78358
11472G8358P550q507m4846R0762l8616j29891p6486R4631J3657n378l1569M4113
$$ 78358 85908 77401 32555 123317 84701 -45190 -121676 -27045 -13388 -18766 -50335 -6222
11460f222R9435N9180N386n6638m4792o9309k7554K4053M4728p473M9743P3436
$$ -6222 93213 152393 157779 101141 56349 -12960 -40514 -16461 28267 20794 70537 143973
11448A43973j29341j12059m3537J63068J53903L5729j00986n9043l1825j20530
$$ 143973 14632 -97427 -140964 22104 176007 211736 110750 51707 19882 -100648
11438a00648Q183O3796o7897J24575O2229l3285J4450J08698k5137k66184p6121
$$ -100648 -92465 -28669 -96566 28009 90238 56953 71403 180101 154964 -111220 -187341
11427a87341O9393Q1421M8916R9297m0111m5226j6217J48935Q958q3805o8009
$$ -187341 -117948 -36527 12389 111686 71575 26349 10132 159067 168025 84220 16211
11416A6211n0991N6420K7805q120K3302j547Q7108n2695j16585p7148k1096k312
$$ 16211 -34780 21640 49445 41325 64627 63080 150188 97493 -19092 -96240 -117336 -119648
11404a19648R5809k4403j02127M6936J19422M9460n693O4103l6195j00513r2817
$$ -119648 -23839 -48242 -150369 -103433 15989 65449 59756 123859 87664 -12849 -105666
11393a05666j61265J7156Q1958M9604J5324L6132M442J6748R131j7792P7421p9153
$$ -105666 -266931 -249775 -167817 -118213 -102889 -66757 -62315 -45567 -36436 -54228 23193 -55960
11381e5960m0587k1082L2004l4965J6658J7013k4033P0991J83980q0095p7685
$$ -55960 -96547 -117629 -85625 -120590 -103932 -86919 -110952 -39961 144019 63924 -13761
11370a3761L4644P2765n743j6693j820L6931p1506N6620o0177L988k2042l7853
$$ -13761 20883 93648 87905 71212 69392 106323 34817 91437 31260 35248 13206 -24647
11358b4647o0379m281P4745n5613j49243k010J36626m1933m0917j7222j3462n7576
$$ -24647 -85026 -89307 -14562 -70175 -219418 -221428 -84802 -126735 -167652 -184874 -198336 -255912
11346b55912Q8972J43787l4509j01154j7826J12316K8012J8708k5224M4418j6010
$$ -255912 -166940 -23153 -57662 -158816 -176642 -64326 -36314 -17606 -42830 1588 -14422
11335a4422L6105J36341L3738M1334m7756r6653j23887l4060O8329o567K8025
$$ -14422 21683 158024 191762 233096 185340 88687 -35200 -69260 -931 -7498 20527
11324B0527J1404j5763N0450m6436R2901m2047j29054P5707p3551p3929O0324
$$ 20527 31931 16168 66618 20182 113083 71036 -58018 17689 -55862 -129791 -69467
11313f9467M3187J126O760o025R2545Q7561n5265M5770M2033l9020j49388o274
$$ -69467 -26280 -25154 -18394 -24419 68126 155687 100422 146192 188225 149205 -183 -6457
11301f457P5329J10103N2581j4496k9313n2185o6363q5541o5989q528N5082Q7387
$$ -6457 68872 178975 231556 217060 187747 135562 69199 -16342 -82331 -90859 -35777 51610
11289E1610L1423r8410l939P5090N6848l5600o8894K0655P6622O4678p0029P6115
$$ 51610 83033 -15377 -19316 55774 112622 77022 8128 28783 105405 170083 100054 176169
11277A76169O4225J2326P433k3695L1258j4651j05958m0694p8518N2059J23472
$$ 176169 240394 252720 260153 236458 267716 253065 147107 106413 27895 79954 203426
11266B03426J66482J7557j72470k04233q3411N4551J04533l0328o0319J4962O1694
$$ 203426 369908 387465 214995 10762 -72649 -18098 86435 56107 -4212 10750 72444
11255G2444n3354o9953O5868J9921j10372n349M4612O6804M1727o2027l3467o6340
$$ 72444 19090 -50863 15005 34926 -75446 -80795 -36183 30621 72348 10321 -23146 -89486
11243h9486j02024R0005L415k6397K8307N3124N4405O563j00780q73Q6494n0006
$$ -89486 -191510 -101505 -98090 -124487 -96180 -43056 11349 17912 -82868 -83741 2753 -47253
11231d7253r3295j53938O3366J07465L8801K029R7012M7917l3062l8204N312k4289
$$ -47253 -140548 -294486 -231120 -123655 -84854 -82825 14187 62104 29042 -9162 -3850 -28139
11219b8139J7390J1629j79j2532J5483m6237m5189Q527l7162k5943j4747p188
$$ -28139 -10749 880 701 -11831 3652 -42585 -87774 -79247 -116409 -142352 -157099 -164287
11207a64287N5972m749l0167N0253P11m9508j04848q2808J4535q550J58513J69129
$$ -164287 -108315 -113064 -143231 -92978 -92267 -141775 -246623 -329431 -314896 -323446 -164933 4196
11195D196P7514K5445o918j62821o2229l5660N5471J00200L7678P149J8142k4129
$$ 4196 81710 107155 100237 -62584 -124813 -160473 -105002 -4802 32876 40025 58167 34038
11183C4038Q6875J5744o9315L1938l8154M2074j59260n6695k8305R1731J34648
$$ 34038 120913 136657 67342 99280 61126 103200 -56060 -112755 -141060 -49329 85319
11172H5319J29358n2932q1034q472l1579L270l5261O7573m120k8985M1317K3489
$$ 85319 214677 161745 80711 72239 40660 43930 8669 76242 72122 43137 84454 107943
11160A07943r2513l78p3674P785J16033k2419j04543m6403R7959R5043L0231m5434
$$ 107943 15430 15052 -58622 -50837 65196 42777 -61766 -108169 -10210 84833 115064 69630
11148F9630l590j5103l6893M171N2515l1583L0384k9727q2433q5121j03560O8764
$$ 69630 66040 50937 14044 18215 70730 39147 69531 39804 -42629 -127750 -231310 -162546
11136a62546J18728K2820p4102r1697P9754L4235O6310N6932q9922r3465K5321
$$ -162546 -43818 -20998 -95100 -186797 -107043 -72808 -6498 50434 -39488 -132953 -107632
11125a07632k1418m6742P9138J26949m7394j39006J9605q4075P2004N3197k758
$$ -107632 -129050 -175792 -96654 30295 -17099 -156105 -136500 -220575 -148571 -95374 -98132
11114i8132R9233O1553j7964r263m1333k4724P1814o0770K0876k8846p0923r6719
$$ -98132 1101 62654 44690 35427 -5906 -30630 41184 -19586 1290 -27556 -98479 -195198
11102a95198j9052Q4055J14054K8497J9810R9194m086q6690l7616p9724j0606
$$ -195198 -214250 -130195 -16141 12356 32166 131360 127274 40584 2968 -76756 -87362
11091h7362L578J09459k9524o019P8247J78762Q6416j83742j86361n4462R5130
$$ -87362 -83784 25675 -3849 -9868 68379 247141 333557 149815 -36546 -91008 4122
11080D122M5405Q1327p234o3132m3854J20782K104K4044L4717p9029l8892j2348
$$ 4122 49527 130854 123620 60488 16634 137416 139520 163564 198281 119252 80360 68012
11068F8012M2502p6109L167L3451q0646n8895J24169J15508j1791j6925P5630
$$ 68012 110514 34405 37572 71023 -9623 -68518 55651 171159 159368 142443 218073
11057B18073m298j44916j64494P086P7028P1847O5944k4141L7554p438l8035N1136
$$ 218073 213775 68859 -95635 -88549 -11521 60326 126270 102129 139683 132245 94210 145346
11045A45346J0827J9797j44419k7078P4170Q5065K8330J29224J10358l0257o8366
$$ 145346 156173 175970 31551 4473 78643 163708 192038 321262 431620 401363 332997
11034C32997J48684K8516r2204Q1548J13014N1919K2605J17174Q411N1429j1805
$$ 332997 481681 510197 417993 499541 612555 664474 687079 804253 812664 864093 852288
11023H52288j3483j55049j42669j6081N4635J60508Q4497r613K0451Q8274R1621
$$ 852288 838805 683756 541087 525006 579641 740149 824646 815033 835484 923758 1015379
11012A015379K0312j52847j84283m2156J22862l7021j6832O7501N6929J33933
$$ 1015379 1035691 882844 698561 656405 779267 742246 725414 792915 849844 983777
11002I83777K6233J63520n5287j24329j33218m6065q7169j21620j35499L7615
$$ 983777 1010010 1173530 1118243 993914 860696 814631 727462 605842 470343 507958
10992E07958L7913j0716M0824R2652n2821r9032n3358p9275j02976r5034k9890
$$ 507958 545871 535155 575979 668631 615810 516778 463420 384145 281169 186135 156245
10981A56245P583J28394l1069r7421K8525o9353q6899p2811p8173J46924N9625
$$ 156245 163828 292222 261153 163732 192257 122904 36005 -36806 -114979 31945 91570
10970I1570N2326m004O7326J62048o2611j42747k9535L0170O7775l2854j79729
$$ 91570 143896 139892 207218 369266 306655 163908 134373 164543 232318 199464 19735
10959A9735j67373K7458J6037m1779K533J46145M6809J09523J41859n6261j42008
$$ 19735 -147638 -120180 -104143 -145922 -143389 2756 49565 159088 300947 244686 102678
10948A02678p2690O6504k8193l9235J1434k4356J9867J35421K4499k4846o9202
$$ 102678 29988 96492 68299 29064 40498 16142 36009 171430 195929 171083 101881
10937A01881j55678o598K0765o046K6274N1814j15342j33544R2725Q7693M5133
$$ 101881 -53797 -60395 -39630 -45676 -19402 32412 -82930 -216474 -123749 -36056 9077
10926I077J56850p4188j96006K5720L2769k0297r3815m1865L9304J20268J11131
$$ 9077 165927 91739 -104267 -78547 -45778 -66075 -159890 -201755 -162451 -42183 68948
10915F8948Q2764O5068o2167n8991j01464J1753j3211L1859l5511j0177M9767
$$ 68948 151712 216780 154613 95622 -5842 5911 -7300 24559 -10952 -21129 28638
10904B8638j2145P9333N0782o0202N7073l7184j05431o316Q2639o0852j46962
$$ 28638 16493 95826 146608 86406 143479 106295 864 -5452 77187 16335 -130627
10893a30627j6628K0979K8870O4652J10886P0L7844n0790j9854M1687K8845p673
$$ -130627 -147255 -126276 -97406 -32754 78132 78202 116046 65256 45402 87089 115934 108261
10881A08261k2988J1277J7036o5675M4103j6306p1748J2028K4300n768O8495p268
$$ 108261 85273 96550 113586 47911 92014 75708 3960 15988 40288 34520 103015 95747
10869I5747n5884k3374o3605L5062R8985J0179K4331o1124j25412N0308J39634
$$ 95747 39863 16489 -47116 -12054 86931 97110 121441 60317 -65095 -14787 124847
10858A24847j7625R2694O316J0184j67301J2511j46378j01615J58222J78083k4646
$$ 124847 107222 199916 206232 216416 49115 61626 -84752 -186367 -28145 149938 125292
10847A25292Q3176R852q1396q5673K7031Q9239J5059j18854j14840k8914R2632
$$ 125292 208468 218320 136924 51251 78282 167521 182580 63726 -51114 -80028 12604
10836A2604O2957K704N3878L0923K4793n1503N5814N8048l5708o6375K7388r4517
$$ 12604 75561 78265 132143 163066 187859 136356 192170 250218 214510 148135 175523 81006
10824H1006O8467n5385Q0455q7035j30922q923P4719Q8973J27802j7486p2923
$$ 81006 149473 94088 174543 87508 -43414 -52337 22382 111355 239157 221671 148748
10813A48748k0774o4826r0916m7484q510m35k2624J21054N6364j09837l6983K6128
$$ 148748 127974 63148 -27768 -75252 -83762 -84197 -106821 14233 70597 -39240 -76223 -50095
10801e0095j1524Q2129N9340J02834j21328K913J01072n4009n4201j1018o7078
$$ -50095 -61619 20510 79850 182684 61356 64269 165341 111332 57131 46113 -20965
10790b0965q2734j3598J30853J26847k8882l7552R6624n660j09004K0219k6823
$$ -20965 -103699 -117297 13556 140403 111521 73969 170593 164933 55929 76148 49325
10779D9325L570J13856J9427J5231n536M9025K3335o4577r1530m7919L585j14043
$$ 49325 52895 166751 186178 201409 195873 244898 268233 203656 112126 64207 67792 -46251
10767d6251l1473Q7339K3317j56971j19317o1575R4193R5436k4349k4318M1028
$$ -46251 -77724 9615 32932 -124039 -243356 -304931 -210738 -115302 -139651 -163969 -122941
10756a22941N862l3524P6205m4660l0200O903J79086J00292J886r6860m4933N8376
$$ -122941 -117079 -150603 -74398 -119058 -149258 -142355 36731 137023 138909 42049 -2884 55492
10744E5492j57711L1447P4663l6816Q8557N5527k1249j6373P9128R1881K9500
$$ 55492 -102219 -70772 3891 -32925 55632 111159 89910 73537 152665 244546 274046
10733B74046p3099r3293L4851k263J04369P6700M0861N4342K58583K38294K18796
$$ 274046 200947 107654 142505 140242 244611 321311 362172 416514 675097 913391 1132187
10722A132187m0308j8850o4305j17319K984O8747m1410N5834J27424P4210L3553
$$ 1132187 1091879 1073029 1008724 891405 894389 963136 921726 977560 1104984 1179194 1212747
10711A212747K03446R9978J63916K7205p7857j28668j8189J1382r5208j468J49794
$$ 1212747 1416193 1516171 1680087 1707292 1629435 1500767 1482578 1493960 1398752 1397284 1547078
10700A547078J34275N9576K4879j0067k16709l1862L4798j7730j51257J3018J39451
$$ 1547078 1681353 1740929 1765808 1755741 1539032 1507170 1541968 1524238 1372981 1385999 1525450
10689A525450l2314j02398P6051J47505M8876j16055j26259j06861J565Q5752
$$ 1525450 1493136 1390738 1466789 1614294 1663170 1547115 1420856 1313995 1315560 1401312
10679A401312n0125j76453o605O6720m3912o5414p4396O620J04568N5949O8016
$$ 1401312 1351187 1174734 1168129 1234849 1190937 1125523 1051127 1057747 1162315 1218264 1286280
10668A286280M980o9134k2803k971o5681r6247n2344J09588N7480N6377k6550
$$ 1286280 1291260 1222126 1199323 1196352 1130671 1034424 982080 1091668 1149148 1205525 1178975
10657A178975j811k1306J9733K7759J20381n6983m3944Q7334J18029J28300K34555
$$ 1178975 1177164 1155858 1175591 1203350 1323731 1266748 1222804 1310138 1428167 1556467 1791022
10646A791022L30171J80821J63304P1146j37096n0307J51517j69922j89439n8479
$$ 1791022 2121193 2302014 2465318 2536464 2399368 2349061 2500578 2330656 2141217 2082738
10636B082738k8310J50124J07059J12516J68751K62778M71613L94175M25245N95338
$$ 2082738 2054428 2204552 2311611 2424127 2592878 2855656 3327269 3721444 4146689 4742027
10626D742027O03855O21982O63103M53180K67991K81733J88972N05680J054530
$$ 4742027 5345882 5967864 6630967 7084147 7352138 7633871 7822843 8328523 9383053
10617I383053J375916K092179K783444L466129M643940O225672P595446Q222253
$$ 9383053 10758969 12851148 15634592 19100721 23744661 29970333 37565779 45788032
10609D5788032Q136633P329469N895601L413626K23730j598010j066922J351067
$$ 45788032 53924665 61254134 67149735 70563361 70787091 69189081 68122159 69473226
10601F9473226N128715R589662J3534425J5700932J5246456J3039958R562767
$$ 69473226 74601941 84191603 97726028 113426960 128673416 141713374 151276141
10594A51276141K783597n962935j0629490q981693l422095L784941J1150478J7297634
$$ 151276141 154059738 148096803 137467313 128485620 125063525 128848466 139998944 157296578
10586A57296578J9851284J8346688J4401814P926056l391447j6290382k2461846
$$ 157296578 177147862 195494550 209896364 217822420 214430973 198140591 175678745
10579A75678745j9604173j2464556m844175J956370P039294R119371Q117973N224813
$$ 175678745 156074572 143610016 138765841 140722211 147761505 156880876 164998849 170223662
10571A70223662M19895p331181j5451371j8607625j5868483j0852014n981149
$$ 170223662 170643557 163312376 147861005 129253380 113384897 102532883 96551734
10564I6551734k304795K93125J418567R28030n13062k861133o088210q817634
$$ 96551734 94246939 94540064 95958631 96886661 96373599 93512466 87424256 78606622
10556G8606622r975436q948624p008556n343906m148348l119425k471085j955634
$$ 78606622 68631186 59682562 52674006 47330100 43181752 40062327 37591242 35635608
10548C5635608j526109j112444q61436o68283m26069n55513n70390n66174j049630
$$ 35635608 34109499 32997055 32135619 31467336 31041267 30485754 29915364 29349190 28299560
10539B8299560j515891j418267j352919j142583r24398o85945n56551m95751p78135
$$ 28299560 26783669 25365402 24012483 22869900 21945502 21259557 20703006 20207255 19429120
10530A9429120p02737n96521m05481l65175m37634m24823k01780k62046n04021
$$ 19429120 18726383 18129862 17724381 17359206 16921572 16496749 16294969 16032923 15528902
10521A5528902m26126l68004j92779l58616l72572m29562k99639k34895l30068
$$ 15528902 15102776 14734772 14541993 14183377 13810805 13381243 13081604 12846709 12516641
10512A2516641l27595l39721k21832j86279k58954k16536j77351k00714k13309
$$ 12516641 12189046 11849325 11627493 11441214 11182260 10965724 10788373 10587659 10374350
10503A0374350k19443k44994k18686j23956j84002j67852j57700j35001l09683
$$ 10374350 10154907 9909913 9691227 9567271 9383269 9215417 9057717 8922716 8613033
10494H613033k05504j49817p3730j16863j31830j09775r6609j61104k67366j38831
$$ 8613033 8407529 8257712 8183982 8067119 7935289 7825514 7728905 7567801 7300435 7161604
10484G161604o749q2897j10574j49442p3173j69267o6840l1249j40306l6452l0457
$$ 7161604 7154855 7071958 6961384 6811942 6738769 6569502 6502662 6471413 6331107 6294655 6264198
10473F264198j06294L7811J09382r4329j64515l7000n505m4084j30456k18041
$$ 6264198 6157904 6195715 6305097 6210768 6046253 6009253 6003748 5959664 5829208 5611167
10463E611167j08269M3265K2923N518Q4324j2063n3129j7092j30343o2496k16583
$$ 5611167 5502898 5546163 5569086 5574604 5658928 5646865 5593736 5576644 5446301 5383805 5167222
10452E167222k72664j04848R8584J57683M5342J4218q3381o5041j95052q3380
$$ 5167222 4894558 4789710 4888294 5045977 5091319 5105537 5022156 4957115 4762063 4678683
10442D678683r5426j38860p9861p3949o4108p7656L734K082m4036j47278r8870
$$ 4678683 4583257 4444397 4364536 4290587 4226479 4148823 4152557 4154639 4110603 3963325 3864455
10431C864455j09986j10955k828r7094j35838p2938l9741Q041N5082q5370o0392
$$ 3864455 3754469 3643514 3640686 3543592 3407754 3334816 3295075 3303116 3358198 3272828 3212436
10420C212436M664j19468j29878q8545l7456L4363k8615k2131p9980j41086p6343
$$ 3212436 3217100 3097632 2967754 2879209 2841753 2876116 2847501 2825370 2745390 2604304 2527961
10409B527961j08664p382n3037M2579o1670J51237J4430j01605q7604k9396j64877
$$ 2527961 2419297 2411915 2358878 2401457 2339787 2491024 2505454 2403849 2316245 2286849 2121972
10398B121972j18023l170p6284j11457m6711M3421O4644l4971o3842J4398K8797
$$ 2121972 2003949 2000779 1924495 1813038 1766327 1809748 1874392 1839421 1775579 1789977 1818774
10387A818774P449p61j295n5838j10314L3965k4780q3526l3549m4899j12141K5201
$$ 1818774 1826223 1825462 1824167 1768329 1658015 1691980 1667200 1583674 1550125 1505226 1393085 1418286
10375A418286L9212o6968q0913m3343J71750M2184k13063l0999O7062Q5799p489
$$ 1418286 1457498 1390530 1309617 1266274 1438024 1480208 1267145 1236146 1303208 1389007 1381518
10364A381518r9787j19945j13582o3321j3403Q5749P2385J757n7302m6543q8321
$$ 1381518 1281731 1161786 1048204 984883 971480 1057229 1129614 1131371 1074069 1027526 939205
10353I39205j2564K1213N4018j1899M9846R458N3900r1553j00717j76L8712L780
$$ 939205 926641 947854 1001872 989973 1039819 1049277 1103177 1011624 910907 910731 949443 953223
10341I53223k7744k1440j2284Q2842N1363p0105q2119m848Q6824M3000j09885
$$ 953223 925479 904039 891755 974597 1025960 955855 873736 868888 955712 998712 888827
10330H88827l3265j5932q7249J7891N5623O4587q0945r3854K0333L4302L1947
$$ 888827 855562 839630 752381 770272 825895 890482 809537 715683 736016 770318 802265
10319H02265j3969j23472q8090p6794q654L2656j2155K9886J47360o8735m5536
$$ 802265 788296 664824 576734 499940 491286 523942 511787 541673 689033 620298 574762
10308E74762r2710K7722l1607M3459l5348K818o7317J45784J8290R806J97806
$$ 574762 482052 509774 478167 521626 486278 489096 421779 567563 585853 595659 793465
10297G93465j39838j87513R6008P2594p8577r4059o3724n7183j5839L9486j26105
$$ 793465 653627 466114 562122 634716 556139 462080 398356 341173 325334 364820 238715
10286B38715o0978J13846R1547k3629n511M2152R52q9759m8921j07375O475J28405
$$ 238715 177737 291583 383130 359501 353990 396142 397094 307335 258414 151039 157514 285919
10274B85919L6807p151k7583R918K9691N1663O3241j2942J8704K1391j49066q151
$$ 285919 322726 315575 287992 297910 327601 379264 442505 429563 448267 469658 320592 312441
10262C12441J36167n4530k975j49680r8073N8181l0926L2433P1093j06155n2874
$$ 312441 448608 394078 391103 241423 143350 201531 170605 203038 274131 167976 115102
10251A15102N5813L499m6197q414O3589L3178J3696L6368N7253j8063Q6306p119
$$ 115102 170915 174414 128217 119803 183392 216570 230266 266634 323887 305824 392130 385011
10239C85011O3664o7959q8985R45J9866J27790J46684n7751l6128l5965L6601
$$ 385011 448675 380716 291731 292676 312542 440332 587016 529265 493137 457172 493773
10228D93773L7896R791r4199j32099p1527J15925L6119k3660j43791q2750N4659
$$ 493773 531669 541460 447261 315162 243635 359560 395679 372019 228228 145478 200137
10217B00137l4444m8286O8143k6212q1323k9567Q0411N7907K3348N3477J6230
$$ 200137 165693 117407 185550 159338 78015 48448 128859 186766 210114 263591 279821
10206B79821p883O8243O4115l5085n1831J02621M8398m7522n420l3862p0201L5524
$$ 279821 271938 340181 404296 369211 317380 420001 468399 420877 415457 381595 311394 346918
10194C46918j06858q7832M9218J47424L931j46850j40505j9181M0457K7121J10520
$$ 346918 240060 152228 201446 348870 352801 205951 65446 46265 86722 113843 224363
10183B24363j5270p955L9918r5841o9266M2605J32306Q3912J00171M422J3279
$$ 224363 209093 201138 241056 145215 75949 118554 250860 334772 434943 439365 452644
10172D52644O641K1173O4541J9479j10066j14475M7253R3248P8794J2029R1824
$$ 452644 459285 480458 544999 564478 454412 339937 387190 480438 559232 571261 663085
10161F63085Q0352R2198o324k1968p1252J13871N1972l5490O0456L63O5678N883
$$ 663085 743437 835635 829311 807343 736091 849962 901934 866444 926900 927263 992941 998824
10149I98824Q8805J43158J54493L1955j35187p3883L5880n0386j26341q4598r9397
$$ 998824 1087629 1230787 1385280 1417235 1282048 1208165 1244045 1193659 1067318 982720 883323
10138H83323J9258K9060M706l4942K5440L4249p9131l3758j38052r7824J3275
$$ 883323 902581 931641 936347 901405 926845 961094 881963 848205 710153 612329 625604
10127F25604J10364j5352j16121q1471j00801L6346K9793j20290m9938L2046m3510
$$ 625604 735968 720616 604495 523024 422223 458569 488362 368072 318134 350180 306670
10116C06670o9078K5989P2914o5320j96737j27065P6132J16035K6176n581o2719
$$ 306670 237592 263581 336495 271175 74438 -52627 23505 139540 165716 160135 97416
10105I7416m9955j1093j9427J4708J01046K7986J530n8077R0770K5040j18627
$$ 97416 47461 36368 16941 31649 132695 160681 162211 104134 194904 219944 101317
10094A01317K3578m7808l9228r459r207R5733K3830j1370K1087l5072Q5392l1422
$$ 101317 124895 77087 37859 28400 19193 114926 138756 127386 148473 113401 198793 167371
10082A67371r5702r7859k1826P7143K6798O086M8389J53770J16361o8535n5217
$$ 167371 71669 -26190 -48016 29127 55925 62011 110400 264170 380531 311996 256779
10071B56779o4901j61211N9880J83484j7627j21618K9839o3506j59388N4113J65339
$$ 256779 191878 30667 90547 274031 256404 134786 164625 101119 -58269 -4156 161183
10060A61183O0740n4320j4733k6381r5579j1640q6929m7227K19344J84366p3891
$$ 161183 221923 167603 152870 126489 30910 19270 -67659 -114886 104458 288824 214933
10049B14933K6016J659j06524l2114J1603p5472p2794L4226Q1502L7772p5147
$$ 214933 240949 242608 136084 103970 115573 40101 -32693 1533 83035 120807 45660
10038D5660k6445N4125J41600J7133r9108m7010O0243M1211l6484j02159J1951
$$ 45660 19215 73340 214940 232073 132965 85955 146198 187409 150925 48766 60717
10027F0717q6701J6854N2232r3225J20215J09792k8676J3074N0955j19060o5088
$$ 60717 -25984 -9130 43102 -50123 70092 179884 151208 164282 215237 96177 31089
10016C1089J00191j11188j05779L0572k1723p0657L1663O7444K47483L3911j9773
$$ 31089 131280 20092 -85687 -55115 -76838 -147495 -115832 -48388 199095 233006 213233
10005B13233O183m5396q3026N1831K706J08205K4304j47974j14179p6872L1907
$$ 213233 219416 174020 90994 142825 145531 253736 278040 130066 15887 -60985 -29078
9994b9078J03115q027k5734O8914K3863J7387p7828k3771M3775m4035M4822J26817
$$ -29078 74037 66010 40276 109190 133053 150440 72612 48841 92616 48581 93403 220220
9982B20220k3165j72796m1641K2807k4601k1239Q1396n8004K9510K47457J53918
$$ 220220 197055 24259 -17382 5425 -19176 -40415 40981 -17023 12487 259944 413862
9971D13862N328r6327j97321l6990n950P8491K1304j0059o9250O8401N9322J1343
$$ 413862 419190 322863 125542 88552 82602 161093 182397 172338 103088 171489 230811 242154
9959B42154j06228M3595m4939j7448m3074o7197J3683k5579r9811j5617j24049
$$ 242154 135926 179521 134582 117134 74060 6863 20546 -5033 -104844 -120461 -244510
9948b44510q3Q7751J86947M6208q369k4120R4857M1885K1879n8172r6154j8333
$$ -244510 -244593 -156842 30105 76313 67944 43824 138681 180566 202445 144273 48119 29786
9936B9786N9413J20160J32965k00404j70744J2890K2822J5568K9804Q6953J09578
$$ 29786 89199 209359 342324 141920 -28824 -15934 6888 22456 52260 139213 248791
9925B48791k3319L2576k3468K8540o9437l0466m8511m5410p611n0663q7558J0892
$$ 248791 225472 258048 234580 263120 193683 163217 114706 69296 61685 11022 -76536 -65644
9913f5644J62762J17388l9739l6294o3666J3458P2087J9904q3292j21775n0241
$$ -65644 97118 214506 174767 138473 74807 88265 160352 180256 96964 -24811 -75052
9902g5052M4485P1405J80782K2865j08813k06422P6880l7507q5052j3302M3032
$$ -75052 -30567 40838 221620 244485 135672 -70750 6130 -31377 -116429 -129731 -86699
9891h6699J01727J21290p478P08k07909q5858P7156Q5173j0016L7632O74j4114
$$ -86699 15028 136318 128840 129548 -78361 -164219 -87063 -1890 -11906 25726 26400 12286
9879A2286L55O8937R3373k8499p7401o5221m1088q8450o9573K4044K0045p6096
$$ 12286 12641 81578 174951 146452 69051 3830 -37258 -125708 -195281 -171237 -151192 -227288
9867b27288k967Q5707M3201N9584J10417j944p7984j15278P3521O0483J31021
$$ -227288 -230255 -144548 -101347 -41763 68654 66710 -11274 -126552 -53031 7452 138473
9856A38473J62066k7002l4694j62112p5413O1094N9095p8112l5527R7057l6555
$$ 138473 300539 273537 238843 76731 1318 62412 121507 43395 7868 104925 68370
9845F8370N475L3371M3699J1687K7640j02250O628N714o1778k4089P7068N6717
$$ 68370 73845 107216 150915 162602 190242 87992 94620 100334 38556 14467 91535 148252
9833A48252l045k6217J0657j7373j03976j8466M5004J5115k0314r723o944R3330
$$ 148252 145207 118990 129647 112274 8298 -10168 34836 49951 29637 19914 12970 106300
9821A06300J18071p3019j58151k5598k0390R8268K3542l3442q4701M9915Q0903
$$ 106300 224371 151352 -6799 -32397 -52787 45481 69023 35581 -49120 795 81698
9810H1698j37288o2681l6508K7931M1484Q5014K3449J07852m0055L07r890m2574
$$ 81698 -55590 -118271 -154779 -126848 -85364 -350 23099 130951 90896 91203 81313 38739
9798C8739P1965n22J7807o0759l4904q5891n5823N589Q9989M6632J01271o614
$$ 38739 110704 110182 127989 67230 32326 -53565 -109388 -103799 -13810 32822 134093 127479
9786A27479m0478P033J74908L5782j526m9907m3030j18825j06090r8844M7163
$$ 127479 87001 94034 268942 304724 303198 253291 210261 91436 -14654 -113498 -66335
9775f6335Q3729P2376o820m345R17O905j29072q6436m9665J2559J38883N6012
$$ -66335 17394 89770 82950 78605 79522 86427 -42645 -129081 -178746 -166187 -27304 28708
9763B8708P1300j956l2211j00759k8636j90525m7795J43573P4397l5561P6339
$$ 28708 100008 98052 65841 -34918 -63554 -254079 -301874 -158301 -83904 -119465 -43126
9752d3126L3894P2553J22921j2849r9796n7368J14201J0498J418k9445K2124p4518
$$ -43126 -9232 63321 186242 173393 73597 16229 130430 140928 142346 112901 135025 60507
9740F0507L8219j37742k4367M8915J0574j7991k1701m3997k7567Q5824Q1631j18502
$$ 60507 98726 -39016 -63383 -14468 -3894 -21885 -43586 -87583 -115150 -29326 52305 -66197
9728f6197O8592Q4588j02171N1005N0136j2132J6678K293J9890j31092P2648O0351
$$ -66197 2395 86983 -15188 35817 85953 73821 90499 92792 112682 -18410 54238 114589
9716A14589k9889k4728j5205R721j1394N151m8163j2606N3642M9078J352m3636
$$ 114589 84700 59972 44767 54488 43094 48245 82 -12524 41118 90196 91548 47912
9704D7912j18656j24160k9924M3660J30385P2104l0700n5649M5221j0438l0057
$$ 47912 -70744 -194904 -224828 -181168 -50783 21321 -9379 -65028 -19807 -30245 -60302
9693f0302j39034l9648J32269m2177o855J8496q2707M5234J24089L8311l6062
$$ -60302 -199336 -238984 -106715 -148892 -155747 -137251 -219958 -174724 -50635 -12324 -48386
9682d8386L5865J29721m9619r0460L829M3080P5520n5126j28382l4078p1003R1605
$$ -48386 -12521 117200 67581 -22879 -19050 24030 99550 44424 -83958 -118036 -189039 -97434
9670i7434Q2514m1336k1997o6229L3953P2852J40977M3949k35245j27331J0532
$$ -97434 -14920 -56256 -78253 -144482 -110529 -37677 103300 147249 -87996 -215327 -204795
9659b04795M087L1854J20593R8341q8167K1215l2302k059Q3634K7170K36548K25497
$$ -204795 -200708 -168854 -48261 50080 -38087 -16872 -49174 -51233 32401 59571 296119 521616
9647E21616R4173J9676m6339k21472j77158j08361L520k0572o0795k9138m4976
$$ 521616 615789 635465 589126 367654 190496 82135 85655 65083 4288 -24850 -69826
9636f9826j28072J08012P8316k4080j14821p5274J02119J02163O1658j85123p1440
$$ -69826 -197898 -89886 -11570 -35650 -150471 -225745 -123626 -21463 40195 -144928 -216368
9625b16368M3569M0700p5942p512l3302n3797J42858J24920M7778L2828m6363
$$ -216368 -172799 -132099 -208041 -215553 -248855 -302652 -159794 -34874 12904 45732 -631
9614f31k4740M8292j5263L9036k480j68671q7440J17732Q588L776j03224l852
$$ -631 -25371 22921 7658 46694 44214 -124457 -211897 -94165 -85577 -81801 -185025 -188877
9602a88877M8515m6338J00061M5056j2983o035o8300J0587j3538J01795O8509
$$ -188877 -140362 -186700 -86639 -41583 -54566 -60601 -128901 -118314 -131852 -30057 38452
9591C8452M8006J7762r67N4102q2866L3216j64345L1219l7689N5306K2611K8438
$$ 38452 86458 104220 103253 157355 74489 107705 -56640 -25421 -63110 -7804 14807 43245
9579D3245L0662k1857o5740P855P7868p6932n7035j14995p5151J00498R5837J12516
$$ 43245 73907 52050 -13690 -5835 72033 -4899 -61934 -176929 -252080 -151582 -55745 56771
9567E6771N37M7979j56486j91666j5372M3671P3324M6620j2694o0506j5957K3438
$$ 56771 57308 105287 -51199 -242865 -258237 -214566 -141242 -94622 -107316 -167822 -183779 -160341
9555a60341k5301R244O6463P3515L5774N7272r177n3117n2540m5690K4339J8325
$$ -160341 -185642 -176398 -109935 -36420 -646 56626 47449 -5668 -58208 -103898 -79559 -61234
9543f1234N3733J5321j36022O9297R1576K0507K6151Q1701K2905j16495K6171
$$ -61234 -7501 7820 -128202 -58905 32671 53178 79329 161030 183935 67440 93611
9532I3611O6985o9140k07269o2736J04086Q1827J35971o2110K5834n0202k7739
$$ 93611 160596 91456 -115813 -178549 -74463 7364 143335 81225 107059 56857 29118
9521B9118N1771J51873p8011k16471m6927k3480J8227r8540R364M4057K8268J49260
$$ 29118 80889 232762 154751 -61720 -108647 -132127 -113900 -212440 -203076 -159019 -130751 18509
9509A8509L7776l2426j8932l168k3528N6249k9774N7368J15295M9208m3866M8429
$$ 18509 56285 23859 4927 1759 -21769 34480 4706 62074 177369 226577 182711 231140
9497B31140K742j76632j6992p7836K5291K68329P3014j80767j40047N205K7534
$$ 231140 233882 57250 40258 -37578 -12287 256042 329056 148289 8242 13447 40981
9486D0981m3573J22618K5556n7285n4988q4083M05k2051N7326N383o6385p6728
$$ 40981 -2592 120026 145582 88297 33309 -50774 -50369 -72420 -15094 -9711 -76096 -152824
9474a52824N5675Q2434l0901o4513N7147j20107J13066J9470J3644R5715r2355
$$ -152824 -97149 -14715 -45616 -110129 -52982 -173089 -60023 -40553 -26909 68806 -23549
9463b3549L8618J5280l9051m1134j179R5878j22430m137O2503J3786K3464l089
$$ -23549 15069 30349 -8702 -49836 -51015 44863 -77567 -81704 -19201 -5415 18049 14960
9451A4960j08531k1087J32585R349P1918M2089p6837J4028J4375j27117j33388
$$ 14960 -93571 -114658 17927 27276 99194 141283 64446 78474 92849 -34268 -167656
9440a67656r4613J6524J6399O3489R1195R0055J41715p9836o1822m7278J4490
$$ -167656 -262269 -245745 -229346 -165857 -74662 15393 157108 77272 15450 -31828 -17338
9429a7338J2659J00144k9891r7359J1280j4894L699k2292J3806k2333j2728n7811
$$ -17338 -4679 95465 65574 -31785 -20505 -35399 -31700 -53992 -40186 -62519 -75247 -133058
9417a33058J50585M444p223M4806m759q8789M9118L8235N6179j9745r0905j03053
$$ -133058 17527 21971 14748 59554 54795 -33994 15124 53359 109538 89793 -1112 -104165
9405a04165k615p357J52044l5415l2428j13043j11828p7166K2945J15304n8651
$$ -104165 -106780 -114137 37907 2492 -29936 -142979 -254807 -331973 -309028 -193724 -252375
9394b52375L2961N1539j45035n6531P2858J02239J90682Q7361O8485R804l2182
$$ -252375 -219414 -167875 -312910 -369441 -296583 -194344 -3662 83699 152184 161988 129806
9383A29806p2096L3890K7203q2946k1940J9162K7503R0695M7152L2761q587m9729
$$ 129806 57710 91600 118803 35857 13917 33079 60582 151277 198429 231190 222603 172874
9371A72874O6122l5517l2108r2760p6116r6243N6479M6935M0678r0446j13054
$$ 172874 238996 203479 171371 78611 2495 -93748 -37269 9666 50344 -40102 -153156
9360a53156j2325L4525N6401P0062J2557l886P4504m6322j16439j10403L3219
$$ -153156 -165481 -130956 -74555 -4493 8064 4178 78682 32360 -84079 -194482 -161263
9349a61263R55p209L4877m7079o6578R047O6978m9978j4579J7704p303J20454
$$ -161263 -160308 -167517 -132640 -179719 -246297 -237250 -170272 -220250 -234829 -217125 -224428 -103974
9337a03974k0437R4866J10672J05638n3991k4374J7954O6555m7841q9258n0328
$$ -103974 -124411 -29545 81127 186765 132774 108400 126354 192909 145068 55810 5482
9326E482p1045o372N684O9157J5825K2633J7022n0814O826Q4387J013j0859m0271
$$ 5482 -65563 -71935 -66251 2906 18731 41364 58386 7572 14398 98785 99798 88939 48668
9313D8668r5739l9890O2612j835O7385L8009j00862j4383L1088n971l2768o0632
$$ 48668 -47071 -86961 -24349 -26184 41201 79210 -21652 -36035 -4947 -10918 -43686 -104318
9301a04318J3211J68507l8622L0495m224J0795j680m4595o665n8647P083O8432
$$ -104318 -91107 77400 38778 69273 65049 75844 74164 29569 22904 -35743 -28660 39772
9289C9772n6598n56J14529K6393K5199O1369O1370n2074m2738M2619J24349o4518
$$ 39772 -16826 -17382 97147 123540 148739 210108 271478 219404 176666 219285 343634 279116
9277B79116j07983n1779M7284j7841m9936k21752o0930N9823M3674L4828J73277
$$ 279116 171133 119354 166638 148797 98861 -122891 -183821 -123998 -80324 -45496 127781
9266A27781m860q4290q7362J0567p9186J9681J04289K5452r0172o9005J91765
$$ 127781 122921 38631 -48731 -38164 -117350 -97669 6620 32072 -58100 -127105 64660
9255F4660R1158J9994l4440j34214K5742l4041Q910O062l3434K6725J14373j8404
$$ 64660 155818 175812 141372 7158 32900 -1141 7769 13831 -19603 7122 121495 103091
9243A03091j23490j14055q559J05267J43685j27306l527L7883M6845j01168j5382
$$ 103091 -20399 -134454 -143013 -37746 105939 -21367 -24894 12989 59834 -41334 -56716
9232e6716N571o1397L9898J02448q0865j68635k3707M7509J02751r6221k928O3214
$$ -56716 -51145 -112542 -72644 29804 -51061 -219696 -243403 -195894 -93143 -189364 -192292 -129078
9220a29078P8093j4213m6936J10512J22100n5675r4295q9595l9772L6554J72448
$$ -129078 -50985 -65198 -112134 -1622 120478 64803 -29492 -119087 -158859 -122305 50143
9209E0143P5980j23904j5893N9582p9276M979J8538P6128r550j459N8230k5364
$$ 50143 126123 2219 -13674 45908 -33368 -28389 -9851 66277 56727 55268 113498 88134
9197H8134o1102K4179n3226q9884p5075r7570j0648M9168J12373J54784O1534
$$ 88134 27032 51211 -2015 -91899 -166974 -264544 -275192 -226024 -113651 41133 102667
9186A02667l5786j34501j4679j2536L996J42793J5112K5806R30k2371j35105k41
$$ 102667 66881 -67620 -82299 -94835 -90839 51954 67066 92872 93802 71431 -63674 -63915
9174f3915J50486o4158j82694P3832J06125n1456m2840L5058O0413m399p0122
$$ -63915 86571 22413 -160281 -86449 19676 -31780 -74620 -39562 20851 16452 -53670
9163e3670P409J11035n0124j75381k5066J57033J09987J1159j63852p726L2214
$$ -53670 -46261 64774 14650 -160731 -185797 -28764 81223 92382 -71470 -79196 -46982
9152d6982p7540P8075J02269m0153q4065l8857L8296J61784N8462j62570q6657
$$ -46982 -124522 -46447 55822 15669 -68396 -107253 -68957 92827 151289 -11281 -97938
9141i7938m645K7800m3163n0306N4397L6488l9304L0227J09500k8209r273J4942
$$ -97938 -102583 -74783 -117946 -168252 -113855 -77367 -116671 -86444 23056 -5153 -14426 516
9129E16k6385J5193r6363p5435j10881l0847N8725m2881J8615Q9710J43219J13620
$$ 516 -25869 -10676 -107039 -182474 -293355 -324202 -265477 -308358 -289743 -200033 -56814 56806
9117E6806j664J6174n5994k6769q0456k2332K4704N0190J12037K7089k3289r3332
$$ 56806 55142 71316 15322 -11447 -91903 -114235 -89531 -39341 72696 99785 76496 -16836
9105a6836l2520O7060n1318L3338K9822o1217j05684J2989L2765L770L8710m156
$$ -16836 -49356 17704 -33614 -276 29546 -31671 -137355 -124366 -91601 -87831 -49121 -53277
9093e3277l3722j11133N4121J07366J4766j08612M4126N3651l8956k875J19095
$$ -53277 -86999 -198132 -144011 -36645 -21879 -130491 -86365 -32714 -71670 -74545 44550
9082D4550j5507r0892QJ72271L4356Q1369k8656m2881K0380N2910M1085j7303
$$ 44550 29043 -61849 -61841 110430 144786 226155 197499 154618 174998 227908 268993 251690
9070B51690r5308j9727j04241j25827r5540M6343N1975k1059n3191j04236J14268
$$ 251690 156382 136655 32414 -93413 -188953 -142610 -90635 -111694 -164885 -269121 -154853
9059a54853R9408n679L8918L8341M7185k4149M4264L5011p2508m4693n9038m4170
$$ -154853 -55445 -61124 -22206 16135 63320 39171 83435 118446 45938 1245 -57793 -101963
9047a01963J1060q4186J04391P3186J3648q3822l193P7334Q0544J0705m6132K9953
$$ -101963 -90903 -175089 -70698 2488 16136 -67686 -70879 6455 86999 97704 51572 81525
9035H1525k862j62931P2012L3978p8530n3919j2381M5561N3457j08290k7091M1577
$$ 81525 78663 -84268 -12256 21722 -56808 -110727 -123108 -77547 -24090 -132380 -159471 -117894
9023a17894J10796M8956j50513q3914J46493J11308K6556n6910J05285q1936j00599
$$ -117894 -7098 41858 -108655 -192569 -46076 65232 91788 34878 140163 58227 -42372
9012d2372j13036j3565Q427l9413J52925J26607o047n9326J4023k0777P1852J75577
$$ -42372 -155408 -168973 -160546 -199959 -47034 79573 73526 14200 28223 7446 79298 254875
9000B54875m4818k07348J1233J14321L6593n7736R539j81231J8424O0460l6200
$$ 254875 210057 2709 13942 128263 164856 107120 116659 -64572 -46148 14312 -21888
8989b1888M1817j07792j15594K3683j4613r0315J43980M7869N1922O1495o981
$$ -21888 19929 -87863 -203457 -179774 -194387 -284702 -140722 -92853 -40931 20564 13583
8978A3583p2339l9314M1100K9370L0444N4936O5283k4416r147l4752j33479Q517
$$ 13583 -58756 -98070 -56970 -27600 2844 57780 123063 98647 89500 54748 -78731 -70214
8966g0214Q1951R282k0607n4736O4884M5446R3884j25683j07855l9953l1818L6226
$$ -70214 11737 21019 412 -54324 10560 56006 149890 24207 -83648 -123601 -155419 -119193
8954a19193m3029l7012J47834J96222M7150n5827r5161k3017R9508Q8966p321
$$ -119193 -162222 -199234 -51400 144822 191972 136145 40984 17967 117475 206441 199120
8943A99120R6180p530p4992o1876o1741o5725K6820l5601j73870J30088P9773
$$ 199120 295300 287770 212778 150902 89161 23436 50256 14655 -159215 -29127 50646
8932E0646J12078L4125j32504q7221L125N19o2671j21781l1733N127Q3432k5538
$$ 50646 162724 196849 64345 -22876 -19751 -19232 -81903 -203684 -235417 -230290 -146858 -172396
8920a72396N2070l2304J6266L6224P2113l092L6809P1035J0300K7784o9614N9481
$$ -172396 -120326 -152630 -136364 -100140 -28027 -31119 5690 76725 87025 114809 45195 104676
8908A04676O1857K5681k163j47808p4006o7959J9970J74499Q3693q4995j93382
$$ 104676 166533 192214 190051 42243 -31763 -99722 -79752 94747 178440 93445 -99937
8897i9937J17300J91783O2115r102J0163j76011N0885Q9066j32260l4783l7144
$$ -99937 17363 209146 271261 262159 272322 96311 147196 236262 104002 69219 32075
8886C2075j52448j14596n9963J9623P7208J80063M3730m8480l594l2921j09164
$$ 32075 -120373 -234969 -294932 -275309 -198101 -18038 25692 -22788 -26382 -59303 -168467
8875a68467l7383O7426J4125K8351r601O301O1052J42874M3653j14565N0195r6010
$$ -168467 -205850 -138424 -124299 -95948 -105549 -99248 -38196 104678 148331 33766 83961 -12049
8863a2049m5460J61620O3076j74688l9565J33021P5928r0947l5413m4186R3107
$$ -12049 -57509 104111 167187 -7501 -47066 85955 161883 70936 35523 -8663 84444
8852H4444P9722M140k4767m1175j20499Q3332M7449j154J18447k1940q7789r4154
$$ 84444 164166 168306 143539 102364 -18135 65197 112646 111492 229939 207999 120210 26056
8840B6056l7999j3143r7598L7710J20870Q3131Q3164l6562o8116l0508O3545M7367
$$ 26056 -11943 -25086 -122684 -84974 35896 119027 202191 165629 97513 67005 130550 177917
8828A77917n2852o4678m735L5071O2933Q9522j6555j50731j14524k5747P9267
$$ 177917 125065 60387 55652 90723 153656 243178 226623 75892 -38632 -64379 14888
8817A4888J08863m2364K5246j53374m7654O1661Q1904O9721q2075J4759J30544
$$ 14888 123751 81387 106633 -46741 -94395 -32734 49170 118891 36816 51575 182119
8806A82119k1669M6789Q5696o4538j98309l1456O0197p7695L7482J1010k1838
$$ 182119 160450 207239 292935 228397 30088 -1368 58829 -18866 18616 29626 7788
8795G788n4473N1995J20442K1699j45928j397q6140r3189R6129L9415l4777k8981
$$ 7788 -46685 5310 125752 147451 1523 126 -86014 -179203 -83074 -43659 -78436 -107417
8783a07417N6415l2614l7902O6572P0681o1504Q787L2148L9325q9401o6909m8958
$$ -107417 -51002 -83616 -121518 -54946 15735 -45769 -36982 -4834 34491 -54910 -121819 -170777
8771a70777L2112J36868l1129m5718P5739J33583Q2837j9439n6792j54025k1785
$$ -170777 -138665 -1797 -32926 -78644 -2905 130678 213515 194076 137284 -16741 -38526
8760c8526J22390k2316k3439L7214q1334K5449J38091N0192j18169l1533J13621
$$ -38526 83864 61548 38109 75323 -6011 19438 157529 207721 89552 58019 171640
8749A71640M855J2638j06271p2658j06174O944J9736Q1367n4464n3363L5614M1072
$$ 171640 176495 189133 82862 10204 -95970 -89026 -69290 12077 -42387 -95750 -60136 -19064
8737a9064q6707J5547j6605o638L4560O5974k1387J9174J48643n8615J5215L0693
$$ -19064 -105771 -90224 -106829 -113467 -78907 -12933 -34320 -15146 133497 74882 90097 120790
8725A20790j12650l9673J82652J2266n7379N0254j13671p4246o7239j8569M2873
$$ 120790 8140 -31533 151119 163385 106006 156260 42589 -31657 -98896 -117465 -74592
8714g4592k3782R8140K2864L4833K4353k794j3761k6101N4618P5829j2938l4046
$$ -74592 -98374 -234 22630 57463 81816 79022 65261 39160 93778 169607 156669 122623
8702A22623Q80N478k9543m5223q1774p3691N443J3159P3816Q708j1825P2233n972
$$ 122623 123503 128981 99438 54215 -27559 -101250 -95807 -82648 -8832 -124 -11949 60284 54312
8689E4312P8679O098q5777j19110k7171K2779J59198J5057r237j49j11800L5741
$$ 54312 132991 139089 53312 -65798 -92969 -70190 89008 104065 94828 94679 -17121 18620
8677A8620L4809q0033K5458J04358j4077j351O3887M6186j6332L8765N9864o643
$$ 18620 53429 -26604 -1146 103212 89135 87784 151671 197857 181525 220290 280154 273511
8665B73511M6869J9341r9011m7920M6232j71793o3436L8064L440K332m8121L0686
$$ 273511 320380 339721 240710 192790 239022 67229 3793 41857 45297 47629 -492 30194
8653C0194N9161k0342k5491J8293K8031q2335k518j01539n052Q0557N812j0811
$$ 30194 89355 69013 43522 61815 89846 7511 4993 -96546 -101598 -21041 -15229 -26040
8641b6040J06728k6330K4936L7518k3978n1152O2485m4134o9291r8917N8302M0907
$$ -26040 80688 54358 79294 116812 92834 41682 104167 60033 -9258 -108175 -49873 -8966
8629h966k6655o5752k3405O6902M8736N003o6184L4129N200k9070m3207j07059
$$ -8966 -35621 -101373 -124778 -57876 -9140 -4137 -70321 -36192 -30992 -60062 -103269 -210328
8617b10328k3971L8309P6633J38746Q771J60991K7865o6439m9629o0036M2187
$$ -210328 -234299 -195990 -119357 19389 28160 189151 217016 150577 100948 40912 83099
8606H3099j3267K707r4759j8324k0453P2149L1749L1944J7085j4688j51674R336
$$ 83099 69832 72539 -22220 -40544 -60997 11152 42901 74845 91930 77242 -74432 -65096
8594f5096Q9303o553r5462q6357m5626K2437P9173K0504O1189M8892j6964j25780
$$ -65096 24207 17654 -77808 -164165 -209791 -187354 -108181 -87677 -26488 22404 5440 -120340
8582a20340k423k883R992L3454J09153M9832o0220K619p2664R5341J7762K4545
$$ -120340 -122763 -125646 -115654 -82200 26953 76785 16565 19184 -53480 41861 59623 84168
8570H4168N242p4461L8899P4283l574j16317O037N5292L4705O667l5233L5874
$$ 84168 89410 14949 53848 128131 124557 8240 14277 69569 104274 110941 75708 111582
8558A11582o2894r6541M3981J26474R041j03612j37397j19485O372P3568K8804
$$ 111582 48688 -47853 -3872 122602 131643 28031 -109366 -228851 -222479 -148911 -120107
8547a20107O2997q099N1085J67022p8410L2324j00900j22579J38428R2418N033
$$ -120107 -57110 -65209 -14124 152898 74488 106812 5912 -116667 21761 114179 119212
8536A19212j66909m806O2574K32026l944p9348P305r895r1322o9840J22853Q7491
$$ 119212 -47697 -52503 10071 242097 238153 158805 166110 156215 64893 -4947 117906 205397
8524B05397j23000l8696J7213M6491j43521j35976K7359M2683j2917O9296q4842
$$ 205397 82397 43701 60914 107405 -36116 -172092 -144733 -102050 -114967 -45671 -130513
8513a30513n647r64R7099K6041j2110j07533k7453J33825P6585L6649j0504K6613
$$ -130513 -136160 -137124 -40025 -13984 -26094 -133627 -161080 -27255 49330 85979 75475 102088
8501A02088J327j42999M5162K7029L9620l5776J7979J30165j32383r0170k3019
$$ 102088 103415 -39584 5578 32607 72227 36451 54430 184595 52212 -37958 -60977
8490f0977k15L0722j5740o272L9536M1320l6144k2346r5544O0999N0289l3684
$$ -60977 -61192 -30470 -46210 -52482 -12946 28374 -7770 -30116 -125660 -64661 -14372 -48056
8478d8056J33287J0778P0528J18343j34765j10944n7280m3267p0497o7803J35587
$$ -48056 85231 96009 166537 284880 150115 39171 -18109 -61376 -131873 -199676 -64089
8467f4089L3662m6116J00744K8255K1788p1378o6645O7885L1555k2783J3999n5503
$$ -64089 -30427 -76543 24201 52456 74244 2866 -63779 4106 35661 12878 26877 -28626
8455b8626o588Q049j13100J4515N8781j7834j54175j631Q6497O9169R4385J3486
$$ -28626 -35214 -27165 -140265 -125750 -66969 -84803 -238978 -240609 -154112 -84943 9442 22928
8443B2928Q9199O422P3437o4922r5541n1723r4528l7970r896K8549R0805O717
$$ 22928 112127 118549 191986 127064 31523 -20200 -114728 -152698 -162594 -134045 -43240 -36523
8431c6523N5792o2468p0408p7806R5493K5649M4843m0127j12549k8631R0520l7107
$$ -36523 19269 -43199 -113607 -191413 -95920 -70271 -25428 -65555 -178104 -206735 -116215 -153322
8419a53322O1270Q8366Q3965N36K4864p6362l7842L1442j19678r4283o3210J14031
$$ -153322 -92052 -3686 80279 80815 105679 29317 -8525 22917 -96761 -191044 -254254 -140223
8407a40223O3132N8294k8487N8478K5276n7906J1800P4317l8468j1662N3911k3018
$$ -140223 -77091 -18797 -47284 11194 36470 -21436 -9636 64681 26213 14551 68462 45444
8395D5444r9870O3762K53541k9343j12364N3577L1474p3993k5979k5432p0089
$$ 45444 -54426 9336 262877 233534 121170 174747 206221 132228 106249 80817 10728
8384A0728o4009L8967n7685k857o1327M1801j6044n526k0436K1459J24550K835
$$ 10728 -53281 -14314 -71999 -74856 -136183 -94382 -110426 -115952 -136388 -114929 9621 12456
8372A2456J1415K2628Q0674p902m1098o2991n9532j13067M0137R1606M1741N3845
$$ 12456 23871 46499 127173 119271 78173 15182 -44350 -157417 -117280 -25674 16067 69912
8360F9912Q9657m2944j09192R6532k7116n4833J6320o2103k9513K6255K6213k0684
$$ 69912 159569 116625 7433 103965 76849 22016 38336 -23767 -53280 -27025 -812 -21496
8348b1496p085n7984O9769J7379O087k3037K2309q111M089j7091L5356N051m7216
$$ -21496 -28581 -86565 -16796 583 6670 -16367 5942 -2169 1920 -15171 20185 25236 -21980
8335b1980k2823j40019j21926J11425K04396j2704R2353L5742N557n7283l6560
$$ -21980 -44803 -184822 -306748 -195323 9073 -3631 88722 124464 130021 72738 36178
8324C6178m3322j22715M2411Q7879Q292J8277P4697P5230l9919k38090l3074K0342
$$ 36178 -7144 -129859 -87448 431 8723 27000 101697 176927 137008 -101082 -134156 -113814
8312a13814P370o8390j169M9999J7332l446J75196N7219j50665l9367j3490l2998
$$ -113814 -106444 -174834 -176003 -126004 -108672 -112118 63078 120297 -30368 -69735 -83225 -116223
8300a16223K2325P0080n7186j4214k8007R3175K9471m6967l8209j9488m7584p7280
$$ -116223 -93898 -23818 -81004 -95218 -123225 -30050 -579 -47546 -85755 -105243 -152827 -230107
8288b30107Q7671P5183k7058o677O8787J20832R0404r9466J003P519m7933p3647
$$ -230107 -142436 -67253 -94311 -100988 -32201 88631 179035 79569 80572 88091 40158 -33489
8276c3489N6430N0340K1620l2118j58930l5510P8285M1530Q1614m6478O1845J9229
$$ -33489 22941 73281 94901 62783 -96147 -131657 -53372 -11842 69772 23294 85139 104368
8264A04368J154l181j7262l134Q672Q4281n2674o3227P0369R7971n2319p0988
$$ 104368 105522 102341 85079 81945 90617 174898 122224 58997 129366 227337 175018 104030
8252A04030p0300q079M2773j02922n8099m601J6318L8647J77275N7179q9463j5476
$$ 104030 33730 25651 68424 -34498 -92597 -97198 -80880 -42233 135042 192221 102758 87282
8240H7282k7793p7020m5795p3078K5505L3513k3671K4362P2466j5356j4653Q4650
$$ 87282 59489 -17531 -63326 -136404 -110899 -77386 -101057 -76695 -4229 -19585 -34238 50412
8228E0412J6916L7345k04516j06114J17539Q7976M1131l7665l4726L257K089L3571
$$ 50412 67328 104673 -99843 -205957 -88418 -442 40689 3024 -31702 -28445 -26356 7215
8216G215M7400j19994n0446l6002K3352J16819P2073m3769k8144q7633l994m9120
$$ 7215 54615 -65379 -115825 -151827 -128475 -11656 60417 16648 -11496 -99129 -103123 -152243
8204a52243N4641L31O3572l6373k8104l0014J5770p5176o2844L8781R2123K6715
$$ -152243 -97602 -97271 -33699 -70072 -98176 -128190 -112420 -187596 -250440 -211659 -119536 -92821
8192i2821K2907K6919J1551n791R8526j2388J8105J71797r8302O24J9884J18147
$$ -92821 -69914 -42995 -31444 -37235 61291 48903 67008 238805 140503 141127 161011 279158
8180B79158k6875j02984n5156k7072j02161j20848m4839R2315J04330J36297J1050
$$ 279158 252283 149299 94143 67071 -35090 -155938 -200777 -108462 -4132 132165 143215
8169A43215p6499p7242L1298L2706o9588M7614k7692P6275J8116j50306m0497
$$ 143215 66716 -10526 20772 53478 -16110 31504 3812 80087 98203 -52103 -92600
8158i2600m6142l4582j613j6673K8191M9947J31140J27441o3367j37554Q2331
$$ -92600 -138742 -173324 -174937 -191610 -163419 -113472 17668 145109 81742 -55812 26519
8147B6519k8859l5538P2126O8504k2817p4291O3208r8430m185M7295P0856q6604
$$ 26519 -2340 -37878 34248 102752 79935 5644 68852 -29578 -33763 13532 84388 -2216
8135b216j38319K9726L4159N8374R7306K1078J7370r7338j00825L7772M4497Q746
$$ -2216 -140535 -110809 -76650 -18276 79030 100108 117478 20140 -80685 -42913 1584 10330
8123A0330m3077j4427j2300O328M8867J2637K9881J8885l8193r2355q4391J15974
$$ 10330 -32747 -47174 -59474 -53146 -4279 8358 38239 57124 18931 -73424 -157815 -41841
8111d1841P9414Q203q2417J2766l906j4949j0545N5476M2995P3761k4307J2153
$$ -41841 37573 45776 -36641 -23875 -27781 -42730 -53275 2201 45196 118957 94650 106803
8099A06803J82877j64474j08203N0947J2196o1799J9558R0064J6295k1505m491
$$ 106803 289680 125206 17003 67950 80146 18347 37905 127969 144264 122759 118268
8088A18268J4901l1680j0686J81862N7357j01433n7820r6847O9863J0452K8898
$$ 118268 133169 101489 90803 272665 330022 228589 170769 73922 143785 154237 183135
8077A83135n585J8644j52795N4875O5678j14755q2657L9784q2167M0223O6588
$$ 183135 177550 196194 43399 98274 163952 49197 -33460 6324 -75843 -35620 30968
8066C0968N2019J39573k0281N9628r9082j25776l5281k7629J00629M3396J0510
$$ 30968 82987 222560 202279 261907 162825 37049 1768 -25861 74768 118164 128674
8055A28674p52p9684m7235N2818j39588m7304J05078p1457p1781J5477j1358P2808
$$ 128674 127922 48238 1003 53821 -85767 -133071 -27993 -99450 -171231 -155754 -167112 -94304
8043i4304R7989Q6390Q0417K6947J2141o4402j36117j47603K9371N4384P1054
$$ -94304 3685 90075 170492 197439 209580 145178 9061 -138542 -109171 -54787 16267
8032A6267R6596J7863o4077K1693j01143n3402J04656J7270N9000p1680P958L7311
$$ 16267 112863 130726 66649 88342 -12801 -66203 38453 55723 114723 43043 51001 88312
8020H8312k6984J9198J19030J58455M9959j95445j46636p9154j03943N7925J15594
$$ 88312 61328 80526 199556 358011 407970 212525 65889 -13265 -117208 -59283 56311
8009E6311M2190K6646l3979J17123P1649r1672j18315L030l9389m6518O2121r714
$$ 56311 98501 125147 91168 208291 279940 188268 69953 72983 33594 -12924 49197 39483
7997C9483J4220Q1359n8878J35917q2419j31576o0398q0473M1298P8070P4868
$$ 39483 53703 135062 76184 212101 129682 -1894 -62292 -142765 -101467 -23397 51471
7986E1471J26023J06764r6555j7744R9662j48781k14389M4611l1903m4893L3989
$$ 51471 177494 284258 187703 169959 269621 120840 -93549 -48938 -80841 -125734 -91745
7975i1745O7832J31096M5331M1673r3462L1233l6736l9104j38268j7515J49427
$$ -91745 -23913 107183 152514 194187 100725 131958 95222 56118 -82150 -99665 49762
7964D9762o878k1513p5960k7274N5110Q8232l9687K9662j11938L57M3158n9781
$$ 49762 42884 21371 -54589 -81863 -26753 61479 21792 51454 -60484 -60127 -16969 -76750
7952g6750Q6333k9464n9144p3606N5984k0612m6320O2296J85149R3866q7370m1044
$$ -76750 9583 -19881 -79025 -152631 -96647 -117259 -163579 -101283 83866 177732 90362 49318
7940D9318K10433j2693j43275K9041p027r7709p1716q0792L8311J57690J17563
$$ 49318 259751 247058 103783 132824 125797 28088 -43628 -124420 -86109 71581 189144
7929A89144q718j42264o2577p6675o9819l367J08755J70636N3980Q869j33086
$$ 189144 180426 38162 -24415 -101090 -170909 -174276 -65521 105115 159095 167964 34878
7918C4878M1700j0055n1394j5830j2561m0401o56q2862Q1508R01P5412K0072n5207
$$ 34878 76578 66523 15129 -701 -13262 -53663 -54319 -137181 -55673 -54772 20640 40712 -14495
7905a4495j00376j4249k4961M3538J40516O1327M5370J1074o0211P6664M7087
$$ -14495 -114871 -129120 -154081 -110543 29973 91300 136670 147744 87533 164197 211284
7894B11284m7130j10460o5050L5584l7042J070m8241J592o201J42048k708j22752
$$ 211284 164154 53694 -11356 24228 -12814 -11744 -59985 -58393 -64594 77454 74746 -48006
7882d8006n5464j6443M5574P6909N1364p8977j19164J02408R3876M5025L3711
$$ -48006 -103470 -119913 -74339 2570 53934 -25043 -144207 -41799 52077 97102 130813
7871A30813M6419J12959k0159L7830l7561m4554o6501J887l7385j75491J19392
$$ 130813 177232 290191 270032 307862 270301 225747 159246 161133 123748 -51743 67649
7860F7649M7076m2386p3677L6970j5652k4932k7018n1677j619Q9428j2308P4762
$$ 67649 114725 72339 -1338 35632 19980 -4952 -31970 -83647 -85266 4162 -8146 66616
7848F6616l8904k9230j3801n8079k8048J28841N7611r0240m3839J1004R1818p8124
$$ 66616 27712 -1518 -15319 -73398 -101446 27395 85006 -5234 -49073 -38069 53749 -24375
7836b4375j35849R8499N6195o9975k0637J01375j3205N2663J837M111N5268K4500
$$ -24375 -160224 -61725 -5530 -75505 -96142 5233 -7972 44691 46528 50639 105907 130407
7824A30407j60162m1434Q0653J62652l5831j38482q5480N7048J16886j67667l8322
$$ 130407 -29755 -71189 9464 172116 136285 -2197 -87677 -30629 86257 -81410 -119732
7813a19732k2627Q6483O1872L9283q156l3360k9156P1658m8659K0250q1064L0841
$$ -119732 -142359 -55876 5996 45279 37123 3763 -25393 46265 -2394 17856 -63208 -32367
7801c2367J29136K8419K958J05239K3869n1882q9629j42948j50749j6023Q046
$$ -32367 96769 125188 128146 233385 257254 205372 115743 -27205 -177954 -193977 -185931
7790a85931O6636k5863j3054K2911j3914J3814m0510k7957N8238l5094Q4712j13712
$$ -185931 -119295 -145158 -158212 -135301 -149215 -135401 -175911 -203868 -145630 -180724 -96012 -209724
7778b09724j15968J07854M4811j5527J65107R8601r1789L2054j4586j1728N6791
$$ -209724 -325692 -217838 -173027 -188554 -23447 75154 -16635 15419 833 -10895 45896
7767D5896L0953j6498l8133O142p1268L271J28343n1609o8233m0550m9980q8139
$$ 45896 76849 60351 22218 28360 -42908 -39637 88706 37097 -31136 -71686 -121666 -209805
7755b09805o6854m560M0025r123j6055K9063N1711J5296M4010O575k6073r461
$$ -209805 -276659 -281219 -241194 -250317 -266372 -237309 -185598 -170302 -126292 -119717 -145790 -155251
7743a55251o1094P3460J17107M5661O6408l8539M2068o6398n9518O3082o298n4187
$$ -155251 -216345 -142885 -25778 19883 86291 47752 89820 23422 -36096 26986 20688 -33499
7731c3499R2617J50217j49343p2527N1982J0322J7458J767q4737p6676j29231
$$ -33499 59118 209335 59992 -12535 39447 49769 67227 68994 -15743 -92419 -221650
7720b21650l2370n4111P7522Q9939J33450K8170j9895N8313j7601r9970j36123
$$ -221650 -254020 -308131 -230609 -140670 -7220 20950 1055 59368 41767 -58203 -194326
7709a94326j26061J25281J06973n184k8030j176l0610q6085J6141M4189N4987
$$ -194326 -320387 -195106 -88133 -93317 -121347 -122523 -153133 -239218 -223077 -178888 -123901
7698a23901J03964K4272q5315l5303N2780Q6822j5083M6869o7773K6107L6416
$$ -123901 -19937 4335 -80980 -116283 -63503 23319 8236 55105 -12668 13439 49855
7687D9855n7786Q6750M1424m6033q4826j4100j892M8136J28598j5032k98m4458
$$ 49855 -7931 78819 120243 74210 -10616 -24716 -26608 21528 150126 135094 134796 90338
7675I0338j4545J10604j4036J3748k0080p2078l5554j78761l3892l2286k1720
$$ 90338 75793 186397 172361 186109 166029 93951 58397 -120364 -154256 -186542 -208262
7664b08262Q168P3573K37991K1620j18845l1825j01794L9585N0534j739q386j7827
$$ -208262 -200094 -126521 111470 133090 14245 -17580 -119374 -79789 -29255 -30994 -39380 -57207
7652e7207k1678r0192q405R5317M3835j08948O1228Q2701Q8950j8871r1879m0955
$$ -57207 -78885 -169077 -177482 -82165 -38330 -147278 -86050 -3349 85601 66730 -25149 -66104
7640f6104K2870r2692n8149P0386p715l729k1961O4096R8765k9309k7637L065
$$ -66104 -43234 -135926 -194075 -123689 -131404 -135133 -157094 -92998 5767 -23542 -51179 -48114
7628d8114L7728O6544M9843m2834j44827k1683j1623n1085o4014R7058M5952M853
$$ -48114 -10386 56158 106001 63167 -81660 -103343 -114966 -166051 -230065 -133007 -87055 -82202
7616h2202j04984L6517M4932L3506L2494n9952n2524J0560p3121O0708N8772M5857
$$ -82202 -187186 -150669 -105737 -72231 -39737 -99689 -152213 -141653 -214774 -154066 -95294 -49437
7604d9437M6478J17874j28904j17833n7584k878J58547r491j0625J0722r1821
$$ -49437 -2959 114915 -13989 -131822 -189406 -192284 -33737 -43228 -53853 -43131 -134952
7593a34952o2898K6681K4659l122L7305K7103o9113j3563N6854J8565Q4474J22398
$$ -134952 -197850 -171169 -146510 -149632 -112327 -85224 -154337 -167900 -111046 -92481 -8007 114391
7581A14391M1028j21387q5963P0916K3816o8162q7183P4347m1007L5240k4892
$$ 114391 155419 34032 -51931 18985 42801 -25361 -112544 -38197 -79204 -43964 -68856
7570f8856Q046P4902m4114j4385R5187l1255j44905j01569N2836l8978J0019P1170
$$ -68856 -60810 14092 -30022 -44407 50780 19525 -125380 -226949 -174113 -213091 -203072 -131902
7558a31902J58652j2438l5169o7827M1949n998P8227J11343p4634K5276k3726
$$ -131902 26750 14312 -20857 -88684 -46735 -52733 25494 136837 62203 87479 63753
7547F3753j7311n503j07381k42388r5822Q4748Q8059J42904j1695N987O3710R7148
$$ 63753 46442 40939 -66442 -308830 -404652 -319904 -231845 -88941 -100636 -94649 -30939 66209
7535F6209m1356p8758K6497L6932j8914r6214P3379O6827J9091K7659j9354M6348
$$ 66209 24853 -53905 -27408 9524 -9390 -105604 -32225 34602 53693 81352 61998 108346
7523A08346R682j73274j4029o5834j0076P7340J12869L5295p9078p0007m9722
$$ 108346 118028 -55246 -69275 -135109 -145185 -67845 45024 80319 1241 -68766 -118488
7512a18488j5256N8623Q3025R3275J540j72884j13523M2076J9728j1208M6711
$$ -118488 -133744 -75121 7904 101179 102719 -70165 -183688 -141612 -121884 -133092 -86381
7501h6381P5681M5444K0669l836j2974j43357q6612J08148O891o0202L553J12752
$$ -86381 -10700 34744 55413 51577 38603 -104754 -191366 -83218 -76327 -136529 -132976 -20224
7489b0224M934j28388p3175N5520M7756j8829J9982p6479N023J00180O0441R7646
$$ -20224 -15290 -143678 -216853 -161333 -113577 -132406 -112424 -188903 -183880 -83700 -23259 74387
7477G4387J11022L488l2448r9659j1375j1040m0202j21038j4155J11037K5028
$$ 74387 185409 188897 156449 56790 45415 34375 -5827 -126865 -141020 -29983 -4955
7466d955m537r1210O3402N036K5205K4006K2526O8098J50324P6337j01235p9383
$$ -4955 -9492 -100702 -37300 -32264 -7059 16947 39473 107571 257895 334232 232997 153614
7454A53614k2585j5236j15696m9222n1843R7150L7382L3979J5987j1313j89302
$$ 153614 131029 115793 97 -49125 -100968 -3818 33564 67543 83530 72217 -117085
7443a17085j28568o0759M2843N9904J75564J34779J8288j3634K774r708l9952
$$ -117085 -245653 -306412 -263569 -203665 -28101 106678 124966 111332 114106 104398 64446
7432F4446k1898k5389K9180j20997k9305R5463n195q8608J0121P5209l4108k6145
$$ 64446 42548 17159 46339 -74658 -103963 -8500 -13695 -102303 -92182 -16973 -51081 -77226
7420g7226K1160M3602j04367n9350P5539P7105m9220p345N8281l3896l846Q8802
$$ -77226 -56066 -12464 -116831 -176181 -100642 -23537 -72757 -80102 -21821 -55717 -59563 29239
7408B9239j05046J9490j000p9506o7033J08285J90527L4695j15511q4282k604
$$ 29239 -75807 -56317 -57317 -136823 -203856 -95571 94956 129651 14140 -70142 -72746
7397g2746J05024L0183J7165j08904J5077j0391l4379R7090K284r2882j10968
$$ -72746 32278 62461 79626 -29278 -14201 -24592 -58971 38119 40403 -52479 -163447
7386a63447j02007R3144N4933M7626j07667K6636M1069l6741O5094M4637J08300
$$ -163447 -265454 -172310 -117377 -69751 -177418 -150782 -109713 -146454 -81360 -36723 71577
7375G1577l6371Q1828M6188J2536K2113m3838q905n9596q1579n5768j02014j2164
$$ 71577 35206 117034 163222 175758 197871 154033 145128 85532 3953 -51815 -153829 -165993
7363a65993J01683R6054O5851j56250o9240K3115N8893j5784k689j5045K6784
$$ -165993 -64310 31744 97595 -58655 -127895 -104780 -45887 -61671 -64360 -79405 -52621
7352e2621R4695R5509k6554j12510j23373j23138N445J46198k8286q0132O8471
$$ -52621 42074 137583 111029 -1481 -124854 -247992 -242547 -96349 -124635 -204767 -136296
7341a36296M0519m8081n5547M5898R8107J34418j8834o0780j16628M3123L8736
$$ -136296 -95777 -143858 -199405 -153507 -55400 79018 60184 -596 -117224 -74101 -35365
7330c5365J22212L680l2491K113N9739j4630j38326j0755O5358l9192j48994O2154
$$ -35365 86847 90527 58036 60149 119888 105258 -33068 -43823 21535 -17657 -166651 -104497
7318a04497J14607J0562Q5877j03672j16877P1150L695o2053j7153M4339P8783
$$ -104497 10110 20672 106549 2877 -114000 -42850 -39155 -101208 -118361 -74022 4761
7307D761l724k2031N0304P3338N5135r2350l9004n1855j16879J12852L9115j7912
$$ 4761 1037 -20994 29310 102648 157783 65433 26429 -25426 -142305 -29453 9662 -8250
7295h250M2013L2204q5460Q740N9089k1746M499R4024m4982p2056l0963K3977
$$ -8250 33763 65967 -19493 -10753 48336 26590 31089 125113 80131 8075 -22888 1089
7283A089l9690J574Q991r2653K568M7777J07026j5581q7856j2380m1679k3260
$$ 1089 -38601 -37027 -28036 -120689 -118121 -70344 36682 21101 -66755 -79135 -120814 -144074
7271a44074P189r423l4408J15633P4560J02529k8458l2964K5267L1278j25349
$$ -144074 -136885 -146308 -180716 -65083 9477 112006 83548 50584 75851 107129 -18220
7260a8220o2628j18644j20041J08239L5153J043R9753M817K452l6482k2633J6029
$$ -18220 -80848 -199492 -319533 -211294 -176141 -175098 -75345 -70528 -68076 -104558 -127191 -111162
7248a11162O3815J31985O4867r8830n1462q1205M0949Q1239r5536K3687P1299
$$ -111162 -47347 84638 149505 50675 -787 -81992 -41043 40196 -55340 -31653 39646
7237C9646M4781M7627K86j57215j81865M8033k0135L6145J28015J05500j04231
$$ 39646 84427 132054 132340 -24875 -206740 -158707 -178842 -142697 -14682 90818 -13413
7226a3413o9510j9193J25856J32115P0960K3122k18166n8243j02035L2647J3960
$$ -13413 -82923 -102116 23740 155855 226815 249937 31771 -26472 -128507 -95860 -81900
7215h1900N977m7466j7556q774J3021J06898j1381n4703K2125R2076R6867L1726
$$ -81900 -75923 -123389 -140945 -149719 -136698 -29800 -41181 -95884 -73759 18317 115184 146910
7203A46910o361k1914p3335k4254J2340o9156n8296j08670j7725p2746K484J22814
$$ 146910 140549 118635 45300 21046 33386 -35770 -94066 -202736 -220461 -293207 -290723 -167909
7191a67909P6871p7654j11326J27288K03797O890M6865j8544j69925p1883n5536
$$ -167909 -91038 -168692 -280018 -152730 51067 57957 104822 86278 -83647 -155530 -211066
7180b11066J9539M3125m4974R8367L0220m1846m7763K1103M4004O6207Q7127l2935
$$ -211066 -191527 -148402 -193376 -95009 -64789 -106635 -154398 -133295 -89291 -23084 64043 31108
7168C1108M0934k3502p2544n7242o9074N48R5506L3567j94595R7960J15350j7284
$$ 31108 72042 48540 -24004 -81246 -150320 -149772 -54266 -20699 -215294 -117334 -1984 -19268
7156a9268r3197L9278Q6976M0103q8460j05173k5881K9265J7209J7703K3769J36238
$$ -19268 -112465 -73187 13789 53892 -34568 -139741 -165622 -136357 -119148 -101445 -77676 58562
7144E8562P258K90j12103K966J09199M9951J3188l5092n5891j29672P0303J07498
$$ 58562 65820 66110 -45993 -43027 66172 116123 129311 94219 38328 -91344 -21041 86457
7132H6457k019j0341J00866N3394j54622o1432l2765j56o2682j3382P6332N6452
$$ 86457 84438 74097 174963 228357 73735 12303 -20462 -20618 -83300 -96682 -20350 36102
7120C6102k6931l350O656o7309l4352l2082O892O6174L5849J9574J7960N1876
$$ 36102 9171 5821 12477 -54832 -89184 -121266 -114374 -48200 -12351 7223 25183 77059
7108G7059L7352O8463j0776q1855j79823q5723L0803J02719O1435o1904j38459
$$ 77059 114411 182874 172098 90243 -89580 -175303 -144500 -41781 19654 -42250 -180709
7097a80709P3375n2461L8229M0099J23936R2395j15236n6069l5390r1920o9312
$$ -180709 -107334 -159795 -121566 -81467 42469 134864 19628 -36441 -71831 -163751 -233063
7086b33063J78598J88529P8993J86254j27629k05938n941j06338N8144N7370p8575
$$ -233063 -54465 134064 213057 399311 271682 65744 59803 -46535 11609 68979 -9596
7075i596j5923K0469j1974m9750o3445M968O2751P6231L2073p1755j61486R3123
$$ -9596 -25519 -5050 -17024 -66774 -130219 -125251 -62500 13731 45804 -25951 -187437 -94314
7063i4314J28037R0664l3430m040p4123R7033l1372L9171J08581r2405j41503
$$ -94314 33723 124387 90957 86917 12794 109827 78455 117626 226207 133802 -7701
7052g701m7537J0219M854J5467K2641m273P0486N2033k4271m9933j7351O8141
$$ -7701 -55238 -45019 -40165 -24698 -2057 -6330 64156 116189 91918 41985 24634 92775
7040I2775K1853j51234o9389k7437J72718R6941n3789j93556p63O8389j2182J8226
$$ 92775 114628 -36606 -105995 -133432 39286 136227 82438 -111118 -111881 -43492 -55674 -37448
7028c7448q9691J06931L3091j04084R8302J1447K5220K1153k3929n019q3148j30413
$$ -37448 -127139 -20208 12883 -91201 7101 18548 43768 64921 40992 35973 -47175 -177588
7016a77588P7965O977J4646M1350L5169N2355k6291o2933o1561M0824q2846n1495
$$ -177588 -99623 -92646 -78000 -36650 -1481 50874 24583 -38350 -99911 -59087 -141933 -193428
7004a93428O1774j9481N2463j2092j8403J0785J32515J0424p4658j6818q0859
$$ -193428 -131654 -151135 -98672 -110764 -129167 -118382 14133 24557 -50101 -66919 -147778
6993a47778L5340M7302N3193q7519j14952m8199N0046N5234k8063l9097j8834
$$ -147778 -112438 -65136 -11943 -99462 -214414 -262613 -212567 -157333 -185396 -224493 -243327
6982b43327k5585J11761J4993K3749k0199L9499M9727P1986J3026j250l5639J32703
$$ -243327 -268912 -157151 -142158 -118409 -138608 -99109 -49382 22604 35630 34380 -1259 131444
6970A31444L2691n2982P078j63386j64105Q4602J09910m1517K1435J4331O8683
$$ 131444 164135 111153 118231 -45155 -209260 -124658 -14748 -56265 -34830 -20499 48184
6959D8184p2152l638R541P3066j663m9785j2673J9533O7356o7829J6800j40199
$$ 48184 -23968 -27606 -18065 55001 53338 3553 -9120 10413 77769 9940 26740 -113459
6947a13459j41016p5098L3226L2319l3333R3475J96811J00636R155p9161P590
$$ -113459 -254475 -329573 -296347 -264028 -297361 -203886 -7075 93561 102716 23555 31145
6936C1145m5899M33J28550J32658j24958k16152J0879j07p4504M8891J77571M7076
$$ 31145 -14754 -14321 114229 246887 121929 -94223 -83344 -83451 -157955 -109064 68507 115583
6924A15583p0233j23167m1719N2723j16925o0930R8831R0535L9284J7171Q7486
$$ 115583 45350 -77817 -119536 -66813 -183738 -244668 -145837 -55302 -16018 1153 88639
6913H8639M3094M6442k5129r1666n3953K895q86Q6572O7775m8909R4182L0553
$$ 88639 131733 178175 153046 61380 7427 10322 9436 96008 163783 114874 209056 239609
6901B39609o6866j31075N8675k3423j8752l4101j37864J4328Q1526J71113K4065
$$ 239609 172743 41668 100343 76920 58168 24067 -113797 -99469 -17943 153170 177235
6890A77235n7709j00253l5354q125k4398N2492P0192n5707n1762j40506j69458
$$ 177235 119526 19273 -16081 -24206 -48604 3888 74080 18373 -33389 -173895 -343353
6879c43353j22517J67777J62958L8116L6864p6525j12187m9926N780Q9820P5921
$$ -343353 -465870 -298093 -135135 -97019 -60155 -136680 -248867 -298793 -293013 -203193 -127272
6868a27272J00501J13805J2684n5524R7456j5010j31230Q68l3430k858P3206n6191
$$ -127272 -26771 87034 99718 44194 141650 126640 -4590 -3722 -37152 -40010 33196 -22995
6856b2995k8009J7523n5413P450J14741J03412O2884p0595r0897p3205r1683J51788
$$ -22995 -51004 -33481 -88894 -81444 33297 136709 199593 128998 38101 -35104 -126787 25001
6844B5001O7799r8680q3698L1895J2478J0601k062p1661L4098J8924K087l8170
$$ 25001 92800 -5880 -89578 -57683 -45205 -34604 -36666 -108327 -74229 -55305 -53218 -91388
6832i1388N4417q9199n6161j48J02326O3467J22626l2724j73680o2910P2956M8168
$$ -91388 -36971 -126170 -182331 -182479 -80153 -16686 105940 73216 -100464 -163374 -90418 -42250
6820d2250M0551O2358o1830Q9700j20417p5988K6238j4795o8687R7155J2933n5184
$$ -42250 -1699 60659 -1171 88529 -31888 -107876 -81638 -96433 -165120 -67965 -55032 -110216
6808a10216m1134P1182J13056k2435N6972J5123l9509J0987l7267K9554R5440
$$ -110216 -151350 -80168 32888 10453 67425 82548 43039 54026 16759 46313 141753
6797A41753j59427R963L2206k8410j6517n867M0821J25258q7400j28133o5403
$$ 141753 -17674 -7711 24495 -3915 -20432 -26299 14522 139780 52380 -75753 -141156
6786a41156N1867P5716J755P7196j20088j53097P6250R6218J68228o3842n0039
$$ -141156 -89289 -13573 -11818 65378 -54710 -207807 -131557 -35339 132889 69047 19008
6775A9008k287q8833k6345L4731K1489K0955m8023M6847O047J8487O5417J10162
$$ 19008 16721 -72112 -98457 -63726 -42237 -21282 -69305 -22458 -16411 2076 67493 177655
6763A77655L8987R2103j46336m8491o3825q2835p8661n9939J101m5586R4090J23645
$$ 177655 216642 308745 162409 113918 50093 -32742 -111403 -171342 -170241 -215827 -121737 1908
6751A908l9395p7229J389O6539J8623K8653j348p8835K565k0069O6502p4445R4771
$$ 1908 -37487 -114716 -113327 -46788 -28165 488 -860 -79695 -77130 -97199 -30697 -105142 -10371
6738a0371Q3295m4278l5839q4462o196j19274p6254R3427J67061M1757j72896
$$ -10371 72924 28646 -7193 -91655 -97851 -217125 -293379 -199952 -32891 8866 -164030
6727a64030j09777N2173R1761R2390P2464j16179m7120O2403j1885O0875j8286
$$ -164030 -273807 -221634 -129873 -37483 34981 -81198 -128318 -65915 -77800 -16925 -35211
6716c5211R4840Q0411N7142o0231p6251m0689q0357O9899L0502P1322m359l0556
$$ -35211 59629 140040 197182 136951 60700 20011 -60346 9553 40055 111377 107018 76462
6704G6462r9241o0645m1674R7575o1680n5905L9887q912K0353J6601R4289l0935
$$ 76462 -22779 -83424 -125098 -27523 -89203 -145108 -105221 -114133 -93780 -77179 17110 -13825
6692a3825j2239K4860L2321K0494l9354o8482m4509R4531j8974n0839j8661J04278
$$ -13825 -26064 -1204 31117 51611 12257 -56225 -100734 -6203 -25177 -76016 -94677 9601
6680I601q5756k1393J90981L5828m5204Q127j17014j33596l2490M2575j10513
$$ 9601 -76155 -97548 93433 129261 84057 92184 -24830 -158426 -190916 -148341 -258854
6669b58854l0498O1704J23149K2335Q0709M4458K6407L8443M6316j6136q2679
$$ -258854 -289352 -227648 -104499 -82164 -1455 43003 69410 107853 154169 138033 55354
6658E5354j84993Q1461K84872L5211j40916n2238p7370p6106L6534p0442j30243
$$ 55354 -129639 -48178 236694 271905 130989 78751 1381 -74725 -38191 -108633 -238876
6647b38876j7582K2575P3186J8950O8379j9978o0947Q6975J40815K5032o4451
$$ -238876 -256458 -233883 -160697 -141747 -73368 -93346 -154293 -67318 73497 98529 34078
6636C4078M4915O0737J0517j665k6095r0726o8391P253N917M6222M2485Q7972
$$ 34078 78993 139730 150247 148582 122487 31761 -36630 -29377 -23460 22762 65247 153219
6624A53219n2310m8241L0227q6006Q7868K443j01750o2460K561L4945O8649N5601
$$ 153219 100909 52668 82895 -3111 84757 87200 -14550 -77010 -74449 -39504 29145 84746
6612H4746P2424n4336p9134o8800j16767J8215R9285m6054r9633q269O4283K5412
$$ 84746 157170 102834 23700 -45100 -161867 -143652 -44367 -90421 -190054 -198323 -134040 -108628
6600a08628j6851l1594N9428M3286j3053n1059J4558R8594l5619m0206p8933M4675
$$ -108628 -125479 -157073 -97645 -54359 -67412 -118471 -103913 -5319 -40938 -81144 -160077 -115402
6588a15402M5200j6934o7829Q1185M7052J15133N8216j32226n2102R5900p1543
$$ -115402 -70202 -87136 -154965 -73780 -26728 88405 146621 14395 -37707 58193 -13350
6577a3350j24723n5062J21361p5849n8074J06541L7359J10155j70965q2441j1456
$$ -13350 -138073 -193135 -71774 -147623 -205697 -99156 -61797 48358 -122607 -205048 -216504
6566b16504M8759N799J05162M0059L8221j5024p885r0338m9195k0438k2387n9165
$$ -216504 -167745 -161946 -56784 -16725 21496 6472 -1413 -91751 -140946 -161384 -183771 -242936
6554b42936M2778J54460J04433O4493J8367K0944O7037P3264j36502K486r5527
$$ -242936 -200158 -45698 58735 123228 141595 162539 229576 302840 166338 168824 73297
6543G3297J6910J3030N715j20561j6839O9266m8727Q7038J26584j28o4181J75513
$$ 73297 90207 103237 108952 -11609 -28448 40818 -7909 79129 205713 205585 141404 316917
6531C16917M9735j08449j29872j13468p143l2978J903N2720j38250k2094m5766
$$ 316917 366652 258203 128331 14863 7720 -25258 -23355 29365 -108885 -130979 -176745
6520a76745J48391Q6616O0132N7362p8562n0451L6162K208o946M7758o5977r9858
$$ -176745 -28354 58262 118394 175756 97194 46743 82905 85113 78167 125925 59948 -39910
6508c9910o4038o988O3853k9123L7505N1839j6232j7428J22000K4639l665j06930
$$ -39910 -103948 -110936 -47083 -76206 -38701 13138 -3094 -20522 101478 126117 122452 15522
6496A5522K641J25890k8432m1582k437p0372j3114K5576K6568o6568L2829j539
$$ 15522 18163 144053 115621 74039 71602 1230 -11884 13692 40260 -26308 6521 4982
6484D982J97035J05457o8128q5622n0771J1992o9901j65323j49151M1157M824
$$ 4982 202017 307474 239346 153724 102953 114945 45044 -120279 -269430 -228273 -223449
$$ [...]
##END NTUPLES=NMR SPECTRUM
##END=
