##TITLE=Analysis number 314938
Compound Code cc 00506
Project Code adrs
Chemist Name prosynth
##JCAMPDX= 6.0         $$ Bruker NMR JCAMP-DX V2.0
##DATA TYPE= NMR SPECTRUM
##DATA CLASS= NTUPLES
##ORIGIN= Bruker BioSpin GmbH
##OWNER= NMR
$$ XWIN-NMR		Version 3.5
$$ Mon Oct 31 12:48:16 2005 GMT Standard Time (UT+0h)  MAYBRIDGE\NMR@NMR_250MHZ
##.OBSERVE FREQUENCY= 250.131544655141
##.OBSERVE NUCLEUS= ^1H
##.ACQUISITION MODE= SIMULTANEOUS (DQD)
##.ACQUISITION SCHEME= undefined
##.AVERAGES= 16
##.DIGITISER RES= 18
##SPECTROMETER/DATA SYSTEM= dpx250
##.PULSE SEQUENCE= zg30
##.SOLVENT NAME= CDCl3
##.SHIFT REFERENCE= (INTERNAL, CDCl3, 0, 16.522)
##AUDIT TRAIL= $$ (NUMBER, WHEN, WHO, WHERE, WHAT)
$$ ##TITLE= Audit trail, XWIN-NMR		Version 3.5
$$ ##JCAMPDX= 5.01
$$ ##ORIGIN= Bruker BioSpin GmbH
$$ ##OWNER= NMR
$$ C:\u/data/dgb/nmr/ADRS/11660/pdata/1/auditp.txt
$$ ##AUDIT TRAIL=  $$ (NUMBER, WHEN, WHO, WHERE, WHAT)
(   1,<2005-10-31 12:47:38.96 +000>,<MAYBRIDGE\NMR>,<NMR_250MHZ>,
      <created by zg, POWCHK disabled, PULCHK disabled
       configuration hash MD5:
       62 19 C7 07 E1 42 D1 B7 37 6C 3D D0 77 39 F9 E6
       data hash MD5: 64K
       13 08 E4 49 2E 00 57 26 FD B8 CE D7 3B 94 45 1A>)
(   2,<2005-10-31 12:47:55.60 +000>,<MAYBRIDGE\NMR>,<NMR_250MHZ>,
      <Start of raw data processing
       ef LB = 0.3 FT_mod = 6 PKNL = 1 SI = 32K 
       data hash MD5: 32K
       6B A7 A2 B0 9F E7 B6 4E 88 7E C0 FC C4 8A 74 78>)
(   3,<2005-10-31 12:48:01.52 +000>,<MAYBRIDGE\NMR>,<NMR_250MHZ>,
      <apk 
       data hash MD5: 32K
       F6 42 DC F0 B8 33 A2 5E 1E 1A 8C 29 75 E5 FF 9B>)
(   4,<2005-10-31 12:48:03.41 +000>,<MAYBRIDGE\NMR>,<NMR_250MHZ>,
      <abs ABSG = 5 
       data hash MD5: 32K
       79 DA 8B CA 59 F1 03 F1 93 4E 68 69 8D 15 F0 65>)
$$ ##END=
$$ 
$$ hash MD5
$$ 60 F2 16 00 4F 1F 38 7B E4 44 B8 A2 F9 96 CF C8
##$RELAX= 
##$RELAX= 
##$RELAX= 
##$RELAX= 
##$RELAX= 
##$RELAX= 
##$RELAX= 
$$ Bruker specific parameters
$$ --------------------------
##$DU= <C:\u>
##$EXPNO= 11660
##$NAME= <ADRS>
##$PROCNO= 1
##$TYPE= <nmr>
##$USER= <dgb>
##$AMP= (0..31)
100 100 100 100 100 100 100 100 100 100 100 100 100 100 100 100 100 100 
100 100 100 100 100 100 100 100 100 100 100 100 100 100 
##$AQSEQ= 0
##$AQ_mod= 3
##$AUNM= <au_zg>
##$AUTOPOS= <28 >
##$BF1= 250.13
##$BF2= 250.13
##$BF3= 250.13
##$BF4= 250.13
##$BF5= 500.13
##$BF6= 500.13
##$BF7= 500.13
##$BF8= 500.13
##$BYTORDA= 1
##$CFDGTYP= 0
##$CFRGTYP= 5
##$CHEMSTR= <none>
##$CNST= (0..31)
1 1 145 1 1 1 1 1 1 1 1 1 1 1 1 1 1 1 1 1 1 1 1 1 1 1 1 1 1 1 1 1 
##$CPDPRG= <>
##$CPDPRG1= <>
##$CPDPRG2= <>
##$CPDPRG3= <>
##$CPDPRG4= <mlev>
##$CPDPRG5= <mlev>
##$CPDPRG6= <mlev>
##$CPDPRG7= <mlev>
##$CPDPRG8= <mlev>
##$CPDPRGB= <>
##$CPDPRGT= <>
##$D= (0..31)
0 1 0 0 0 0 0 0 0 0.06 0 0 0 0 0 0 0.0002 0 0 0 0 0 0 0 0 0 0 0 0 0 0 
0 
##$DATE= 1130762857
##$DBL= (0..7)
120 120 120 120 120 120 120 120 
##$DBP= (0..7)
150 150 150 150 150 150 150 150 
##$DBP07= 0
##$DBPNAM0= <>
##$DBPNAM1= <>
##$DBPNAM2= <>
$$ [...]
##$SUBNAM7= <"">
##$SUBNAM8= <"">
##$SUBNAM9= <"">
##$SW= 20.6930455092707
##$SWIBOX= (0..15)
0 0 3 0 0 0 0 0 0 0 0 0 0 0 0 0 
##$SW_h= 5175.983436853
##$TD= 65536
##$TD0= 1
##$TE= 295.16
##$TE2= 300
##$TE3= 300
##$TEG= 300
##$TL= (0..7)
0 120 120 120 120 120 120 120 
##$TP= (0..7)
150 150 150 150 150 150 150 150 
##$TP07= 0
##$TPNAME0= <>
##$TPNAME1= <>
##$TPNAME2= <>
##$TPNAME3= <>
##$TPNAME4= <>
##$TPNAME5= <>
##$TPNAME6= <>
##$TPNAME7= <>
##$TPOAL= (0..7)
0.5 0.5 0.5 0.5 0.5 0.5 0.5 0.5 
##$TPOFFS= (0..7)
0 0 0 0 0 0 0 0 
##$TUNHIN= 0
##$TUNHOUT= 0
##$TUNXOUT= 0
##$USERA1= <user>
##$USERA2= <user>
##$USERA3= <user>
##$USERA4= <user>
##$USERA5= <user>
##$V9= 5
##$VALIST= <valist>
##$VCLIST= <CCCCCCCCCCCCCCC>
##$VD= 0
##$VDLIST= <DDDDDDDDDDDDDDD>
##$VPLIST= <PPPPPPPPPPPPPPP>
##$VTLIST= <TTTTTTTTTTTTTTT>
##$WBST= 1024
##$WBSW= 4
##$XGAIN= (0..3)
0 0 0 0 
##$XL= 0
##$YL= 0
##$YMAX_a= 472840
##$YMIN_a= -425047
##$ZGOPTNS= <>
##$ZL1= 120
##$ZL2= 120
##$ZL3= 120
##$ZL4= 120
##$ABSF1= 16.522
##$ABSF2= -4.171173
##$ABSG= 5
##$ABSL= 3
##$ALPHA= 0
##$AQORDER= 0
##$ASSFAC= 0
##$ASSFACI= 0
##$ASSFACX= 0
##$ASSWID= 0
##$AUNMP= <proc_1d>
##$AZFE= 0.1
##$AZFW= 0.1
##$BCFW= 0
##$BC_mod= 0
##$BYTORDP= 0
##$COROFFS= 0
##$CY= 12.5
##$DATMOD= 1
##$DC= 0
##$DFILT= <>
##$DTYPP= 0
##$F1P= 14.0000005364418
##$F2P= -0.99999901652339
##$FCOR= 0.5
##$FTSIZE= 32768
##$FT_mod= 6
##$GAMMA= 0
##$GB= 0
##$INTBC= 1
##$INTSCL= 1
##$ISEN= 128
##$LB= 0.3
##$LEV0= 0
##$LPBIN= 0
##$MAXI= 10000
##$MC2= 0
##$MEAN= 0
##$ME_mod= 0
##$MI= 0
##$NCOEF= 0
##$NC_proc= -3
##$NLEV= 6
##$NOISF1= 0
##$NOISF2= 0
##$NSP= 0
##$NTH_PI= 0
##$NZP= 0
##$OFFSET= 16.522
##$PC= 1
##$PHC0= 79.17577
##$PHC1= 6.403391
##$PH_mod= 1
##$PKNL= yes
##$PPARMOD= 0
##$PSCAL= 4
##$PSIGN= 0
##$REVERSE= no
##$SF= 250.13
##$SI= 32768
##$SIGF1= 0
##$SIGF2= 0
##$SINO= 400
##$SIOLD= 32768
##$SREGLST= <1H.CDCl3>
##$SSB= 0
##$STSI= 32768
##$STSR= 0
##$SW_p= 5175.98343685301
##$SYMM= 0
##$S_DEV= 0
##$TDeff= 65536
##$TDoff= 0
##$TI= <Analysis number 999999
Compound Code 99
Book Reference 9
Project Code 9>
##$TILT= no
##$TM1= 0
##$TM2= 0
##$TOPLEV= 0
##$USERP1= <user>
##$USERP2= <user>
##$USERP3= <user>
##$USERP4= <user>
##$USERP5= <user>
##$WDW= 1
##$XDIM= 32768
##$YMAX_p= 433290303
##$YMIN_p= -175156
$$ End of Bruker specific parameters
$$ ---------------------------------
##NTUPLES= NMR SPECTRUM
##VAR_NAME=  FREQUENCY,     SPECTRUM/REAL,   SPECTRUM/IMAG
##SYMBOL=    X,             R,               I
##VAR_TYPE=  INDEPENDENT,   DEPENDENT,       DEPENDENT
##VAR_FORM=  AFFN,          ASDF,            ASDF
##VAR_DIM=   32768,         32768,           32768
##UNITS=     HZ,            ARBITRARY UNITS, ARBITRARY UNITS
##FACTOR=    0.157963299565203, 1,           1
##FIRST=     4132.6476996994, 0,             0
##LAST=      -1043.33573715361, 0,           0
##MIN=       -1043.33573715361, -175156,     0
##MAX=       4132.6476996994, 433290303,     0
$$ Real data points
##PAGE= N=1
##DATA TABLE= (X++(R..R)), XYDATA
$$ [...]
20701 -793 1447 7105 58486 50008 21805 -28092 -42110 -28944 -15844 5169 -1680 -18078 -13955
20688 -13955 -23490 -41324 -23769 16241 45357 28177 14871 1170 -34893 -22782 34081 18546
20676 18546 -36641 -41789 -8794 19634 5264 6317 -1526 15262 30792 39799 9525 -13969
20664 -13969 29793 28846 24091 -14778 -31807 -37516 6287 46278 42748 30677 2334 -16640 -19386
20651 -19386 20652 39504 19833 -8125 -2606 29859 62579 50213 32012 -12971 6131 29246
20639 29246 6056 -18477 -19364 -12593 22335 53963 39250 13838 1689 -16045 6256 27498
20627 27498 -21960 -31648 19138 44975 32410 17060 11441 31793 19879 -18346 -19813 -41213
20615 -41213 -38346 -19964 -1324 -23621 -9297 -2510 28258 1270 -28257 -12105 -8539 -28866
20603 -28866 -57916 -77376 -68221 -60138 -64112 -37838 885 45780 58693 55209 69343 53650
20591 53650 32950 40412 10069 -19854 -23168 -58600 -43672 -36119 -50489 -62495 -2259 23320
20579 23320 7220 11818 2767 -20476 -20883 -18334 18607 10459 3646 -19378 -16091 -25396 -14608
20566 -14608 -26319 -53543 -48346 -82692 -91301 -91444 -60197 -42487 -10223 -9778 -28938 -38818 -69440
20553 -69440 -78889 -47074 -33681 -31328 -487 51629 65127 26173 -32754 -48013 -665 -11921
20541 -11921 -3516 -981 17021 15259 -7717 141 27455 11793 -12851 -25660 -14208 -40105
20529 -40105 -41719 -21533 -21689 -62906 -57745 -13666 -28018 -26074 -16382 11871 -1194 -35322 -39222
20516 -39222 -1269 35355 25747 -40400 -20802 32870 22764 -924 4247 -26486 -29448 -9105
20504 -9105 -16379 -28003 -25109 -52153 -75511 -74680 -49171 4005 42570 39263 32719 41299 31791
20491 31791 46899 6304 9597 -12693 -32867 -75038 -72507 -76959 -87797 -63262 -16545 -29433
20479 -29433 -41413 -45370 -50609 -23916 12199 16641 24128 64942 46001 1706 -30169 -41437
20467 -41437 -13585 7689 -9839 -61822 -95120 -104378 -60440 -18662 2950 7643 29114 19783
20455 19783 14635 13942 17112 10774 -40541 -7681 19943 30528 40048 7581 -44076 -49651 -31999
20442 -31999 -33610 -14547 -4946 -18163 -51139 11920 50222 55761 55377 35198 9338 34403 62943
20429 62943 27555 31004 59136 43678 11730 23837 34531 19788 49604 56041 54453 42030
20417 42030 30618 22119 26234 42611 54558 53587 54797 25287 22091 36385 35687 39162 41548 49989
20403 49989 8981 2665 -3525 9824 27490 27401 440 -30827 -44460 -34662 -54566 -59216 -20063
20390 -20063 -49200 -45595 -28385 -33970 -7894 7710 35799 67274 55865 48992 2346 -1366
20378 -1366 22536 54601 16008 -23982 4958 19607 24816 47577 43069 17608 1986 2124 34701
20365 34701 -12845 -47584 -41922 -26176 12776 52394 38445 45085 80161 50679 -8908 -60448
20353 -60448 -44112 -36523 6129 41698 50152 56749 61498 31065 61637 101372 74393 62649
20341 62649 59087 51622 68912 42991 21945 -13929 6000 1083 -2457 3473 -361 8124 31121
20328 31121 15807 17092 -24867 18149 41097 20861 48367 49970 48194 63724 81550 100831
20316 100831 50787 38917 65798 78960 58218 60616 27565 1486 -8049 -26031 -20964 -6365
20304 -6365 -54323 -24379 17589 41171 12488 -29520 -425 -6132 -12517 31836 36083 12177
20292 12177 32411 -3189 -60241 -87939 -56534 -31228 -46805 -29146 15691 40011 78867 117813
20280 117813 66820 39460 13881 54603 47019 63029 73791 80251 57182 36132 31492 8359
20268 8359 -4009 10508 40696 51839 43378 42737 56500 45430 -18487 -9972 -13843 -12104 16292
20255 16292 32474 24770 -2283 7854 44891 51948 65760 97392 43133 25314 32650 -4536
20243 -4536 -17039 -46944 11150 55106 27444 61631 95992 82646 47724 -12959 -56240 -41601
20231 -41601 -9603 -18872 12100 23543 23277 63705 82202 81107 55224 62159 75134 65131 35863
20218 35863 50270 77604 44135 28121 45986 13275 -16132 -51182 -95952 -80383 -47775 2180
20206 2180 26470 37449 55891 47365 8735 -2929 9415 29695 102587 81019 55917 38461
20194 38461 -2649 6065 7662 26996 22457 -8175 -27237 8553 37432 63380 -16247 -46735
20182 -46735 -29035 -3586 65205 101789 80236 56168 89359 111548 123961 106832 68778 57511
20170 57511 47586 7556 -22623 -30365 -12899 -17406 -37324 8208 25769 63793 89389 100430
20158 100430 97070 58519 38755 63286 88183 66114 91817 120677 76950 22314 30760 21020
20146 21020 1846 22730 11236 -32327 -44644 22302 41836 24262 14782 -1892 -26277 -26753
20134 -26753 6753 14177 3969 760 20570 55696 64284 35390 14253 14782 19543 20857 61575
20121 61575 70536 53293 79129 76771 72464 64606 80782 73354 56596 36436 54637 46752 35111
20108 35111 29024 24683 8346 -3052 -3342 -10229 22514 6620 22843 52248 57511 536 -20389
20095 -20389 -7883 -4685 -6131 20186 67613 109728 99374 75895 99515 126132 99022 108236
20083 108236 133348 136437 104448 65580 45613 37985 47703 -4507 -30106 -55949 -22710 1053
20071 1053 -27339 -11794 -18644 -41010 97 30674 12058 9241 24690 25654 43654 19233 27621
20058 27621 11973 18831 60069 60524 42491 26164 48749 69238 76254 44611 8238 -6683
20046 -6683 -7095 -4766 -16053 -14969 5790 36158 18375 8451 -1865 -487 524 -3940 -34659
20033 -34659 2289 46578 52729 57694 62363 36288 21510 13896 -18034 -75483 -47731 -2006
20021 -2006 17835 82974 92671 11200 -12 21384 -365 -18337 2565 51528 33964 27763
20009 27763 8464 6935 19125 35503 38941 58784 54226 5808 -12535 -1130 40362 36765
19997 36765 18995 15580 38209 48997 14930 -17261 -64999 -39502 -36260 -8790 7385 44882
19985 44882 57348 31993 31344 54197 114984 132250 82129 28178 -7514 3509 62570 63067
19973 63067 45619 32123 43012 46522 59565 28643 35699 47153 81280 84518 106481 91844
19961 91844 55015 35654 58329 56758 -4161 13881 58863 66731 93302 76344 94551 101725
19949 101725 92398 40005 -5858 -24728 -11171 -21043 758 -31182 -35706 24476 46766 40782
19937 40782 51409 46099 10715 8122 20158 -1846 17996 55806 44808 36830 100400 67890
19925 67890 81956 126337 137034 84366 46697 27346 31180 31571 66984 56263 51306 18558
19913 18558 7701 14776 29183 21161 40380 25623 17932 -17836 -37799 -21122 34623 34153 16352
19900 16352 54063 56068 -2931 4302 23026 21283 29188 35078 2384 14004 7963 -34995 -56047
19887 -56047 -57057 -45811 -38273 7678 36401 69989 89903 91213 56165 -23206 -28347 -16948
19875 -16948 13258 40360 24360 -22728 -27015 29988 43237 28251 41263 30249 41924 54464
19863 54464 73685 51630 26992 15431 31074 21758 35283 55923 29297 34101 42562 49996
19851 49996 61518 4504 -15821 -34913 -55169 -34986 8400 13594 3100 20160 45354 83641
19839 83641 56868 11082 11215 7257 -5479 1171 -37043 -41110 -10323 -35681 -72331 -37043 -11449
19826 -11449 7465 -11933 -1721 26646 26052 40881 51604 53626 67821 81079 39095 -1473
19814 -1473 -36658 -53912 -74434 -71319 -25659 -15395 -10025 -14869 -23746 -34425 -79589 -90595 -91831
19801 -91831 -51399 17102 94763 49989 -2166 -55301 -18224 2806 -1483 -22822 -13777 8263
19789 8263 37681 10608 2829 1448 10844 43853 99083 86845 64510 61420 65243 47404 35764
19776 35764 29588 38536 39540 58122 94872 116132 77776 23461 -13108 -20236 -11583 5907 21586
19763 21586 -3751 -17798 -2544 17790 43565 45424 57805 75456 91548 52505 47151 41481
19751 41481 22775 -27022 -85116 -100094 -64140 -47909 -38649 -28378 -26583 -14871 -24197 -26947
19739 -26947 -20513 -23028 17612 65077 48785 -83 -82685 -132530 -112044 -84555 -62066 -17992
19727 -17992 -23223 -47437 -69780 -48809 2156 18011 -4987 -15424 3299 22360 23314 54331
19715 54331 71294 57049 57117 31914 59995 86178 67259 49820 22223 37460 37774 2841 7166
19702 7166 24153 14913 54138 84664 78629 60295 52057 22540 32459 65302 91213 90406 49744
19689 49744 -898 -24356 40304 75612 77515 81106 77482 54583 43696 60104 63797 84655
19677 84655 40931 -1605 3368 31217 80926 109679 126687 81099 32985 21163 24380 53980
19665 53980 73331 60051 18499 42946 65850 71010 80553 95144 87188 37192 34491 40693 48199
19652 48199 63414 70648 48943 14829 -4328 17715 30276 18365 4854 6844 55734 67009
19640 67009 30727 58629 49238 36384 46925 38948 42420 25534 3250 -5594 15496 37521
19628 37521 27059 60637 52236 25300 -12290 -18163 1346 22176 32259 724 -35564 -42335
19616 -42335 -11413 50832 36377 16729 1957 23262 -4155 -14235 -18879 2774 27444 20468
19604 20468 -10975 -9468 -1717 15877 9524 28185 20286 21318 23030 3830 33 -19756 -50418
19591 -50418 -16760 38873 39121 26700 8336 18900 56916 77477 119667 151508 131550 55969
19579 55969 55933 36987 2246 20258 20790 -30218 -11664 39552 26406 18435 30177 69293 87636
19566 87636 43442 36587 47431 44751 31720 17621 24324 -14167 -14329 1881 15911 -9535 5480
19553 5480 15705 10533 -21192 -17261 3616 7988 28246 23116 10630 54508 65198 39919 -6256
19540 -6256 -4040 14711 15396 19692 27658 26691 24371 48832 30677 19363 32130 24768 8466 12925
19526 12925 20188 7045 31029 19565 37407 71690 84313 18732 2266 -4956 4475 2948
19514 2948 13040 -2240 41546 40430 -9872 -20780 10104 80823 112008 125574 104666 93801
19502 93801 98414 86895 72206 35106 27762 30482 58825 47109 53554 70664 47603 28606
19490 28606 45032 60168 45203 25358 5500 17866 22858 53612 74899 86331 65949 61571
19478 61571 46065 90837 138486 101842 75413 79907 89443 112947 134497 115604 100787 94726
19466 94726 123598 85355 81360 64426 58649 57645 72303 126632 171891 198515 170472 107888
19454 107888 108492 125443 116631 123321 137458 152304 186516 230127 266102 309076 298250 260697
19442 260697 244019 267101 288634 272795 261418 239239 276315 296636 318660 350143 348283 301642
19430 301642 232398 209267 174622 161459 215457 260643 317362 309361 298711 278218 280035 262913
19418 262913 251210 298647 274495 228538 244396 236006 209443 216924 207808 241149 303654 335584
19406 335584 342574 335679 290009 264915 322447 357652 326214 298093 294369 278970 277590 250327
19394 250327 195276 172007 198164 199494 169687 166875 158545 176243 176133 175353 235482 281042 302251
19381 302251 280652 192750 179767 196643 171688 177772 200627 214283 256122 252511 243556 226562
19369 226562 173194 148851 122732 82099 75488 68445 105357 100010 53651 55442 68978 78453
19357 78453 53360 60984 52038 66072 74476 91206 98893 138987 184928 167169 128132 84491
19345 84491 59394 53665 98659 139850 147699 114135 98618 70797 81211 100246 59022 35032
19333 35032 55976 81015 53859 61024 94709 115864 81513 88696 114128 88321 63914 66993
19321 66993 77300 100295 110887 51325 10815 419 26520 69823 94083 124373 102671 87248
19309 87248 83464 67369 120538 134277 94030 49057 34843 43756 46980 54593 105325 105104 60352
19296 60352 51345 12190 27640 32568 25182 36446 64458 73817 95536 93598 79146 78487 83796
19283 83796 71447 111996 100605 83709 57485 90541 124456 122683 91786 76590 48551 48007
19271 48007 48013 60193 58571 71113 86119 85550 61690 49639 71935 52752 52403 34756 42282 46603
19257 46603 45539 66649 60530 65454 105116 108414 64191 50409 38769 32224 45716 77011 83786
19244 83786 62878 39294 41387 71673 114330 129968 149425 134205 141712 164387 165071 114365
19232 114365 97758 79779 52260 77955 75217 97114 99865 88498 125058 142549 146474 122823
19220 122823 109724 112507 100803 74238 67123 74649 76820 60686 34063 28773 41482 60832
19208 60832 64538 86275 108851 93971 55819 13444 16208 70707 127634 119523 103559 137856
19196 137856 163188 140827 73266 63173 38031 47059 67144 64347 62630 52558 57761 96315
19184 96315 139297 145241 114417 136850 133792 119101 67626 71126 123010 143825 84012 45191
19172 45191 52904 117398 149939 162687 132729 97941 74825 44700 29832 57345 91884 146186
19160 146186 158619 134731 118198 91852 77366 95056 100476 72361 54392 87925 77342 82943
19148 82943 98604 101050 130528 141014 128427 80571 87983 73843 96628 124632 157219 139211
19136 139211 123327 92569 114508 116869 128574 123611 124194 103657 153296 183397 167490 120450
19124 120450 107105 151127 177529 146148 123257 128543 153628 133153 102139 100552 68933 62985
19112 62985 52186 87240 119645 125382 88632 88987 110223 126365 110139 134813 127904 123058 148981
19099 148981 142336 144962 121676 151748 185434 191089 185919 185543 195528 160145 172439 252066 229868
19086 229868 226522 228565 219024 267897 269925 275994 242946 249218 264217 257788 281136 324375 347105
19073 347105 360548 367149 356060 368369 377917 383376 405344 425359 406027 438431 413073 389724
19061 389724 421716 464402 429240 408879 417787 436819 440553 418414 454714 489384 525065 523708
19049 523708 503093 500309 517925 505838 508581 527930 545874 529000 512539 509260 539631 583571
19037 583571 588552 579995 539947 500645 498793 511816 508082 516279 510998 530862 555923 593979 595368
19024 595368 614319 649636 652686 681979 728115 740001 703976 725668 782374 806379 845527 850287
19012 850287 882033 936549 990665 992365 990461 978195 976785 1012029 1055371 1101265 1140452 1152571
19000 1152571 1200681 1260834 1290780 1328464 1323487 1347679 1357398 1401898 1414184 1502675 1618730
18989 1618730 1701947 1784664 1848619 1892496 1947301 2013834 2105750 2250500 2416811 2584042 2742401
18978 2742401 2881331 3030506 3239269 3452593 3712986 3985399 4256677 4499333 4686604
18969 4686604 4938442 5266478 5610499 5992417 6338115 6714999 7190385 7742661 8365285
18960 8365285 8939417 9328976 9442620 9542795 9578834 9555894 9585041 9727639 10130154 10800911
18950 10800911 11572212 12522316 13624868 14880428 16371487 18079397 19906384 21802875
18942 21802875 23685329 25513626 27661998 29833163 31627035 33347066 35985073 39871500
18934 39871500 44008753 46971280 47020339 42127547 36061549 32930798 31836194 31742003 32828666
18925 32828666 34724598 36642052 37848903 37398455 37147279 38658663 40795928 42320383
18917 42320383 42473894 42556897 44181505 47344080 51021044 54311743 56114409 55021219
18909 55021219 52028828 49745177 47152716 42733003 38122682 35943040 36359257 38482748
18901 38482748 41325787 43663166 44271338 41536136 37114841 34923068 35124292 36707892
18893 36707892 39267003 42580432 46670506 51018419 54960405 57385044 55481114 49379380
18885 49379380 43749064 39780476 38036664 38081286 38642805 38259298 35875160 34086293 34197258
18876 34197258 35834606 38976014 43411535 48320394 51861795 51711187 45458608 34181803
18868 34181803 25132237 20177718 17116369 14262916 11445350 9556979 8574059 8073156
18860 8073156 7894142 8029311 8415055 8946299 9351817 9389874 8689498 7421022 6283057
18851 6283057 5765648 5732660 5903226 6223164 6466800 6441544 5917370 5051428 4466290 4199226
18841 4199226 4087921 4005777 3751683 3273773 2822835 2565951 2384599 2174144 1841750 1518513
18831 1518513 1332149 1198774 1085965 1018151 942275 888093 867687 833027 806000 818050 855418
18820 855418 887477 867959 865762 852800 870668 915141 899873 899141 934121 981260 1005523 990495
18808 990495 1002458 1022197 1044808 1066587 1026124 997418 1016897 1044420 1021679 1056465 1097777
18797 1097777 1143349 1161180 1140152 1129456 1118553 1147467 1111339 1069108 1061642 1052044 1080403 1069132
18785 1069132 1034341 1056158 1078030 1068433 1044477 1024482 974007 959268 975449 986334 1030508
18774 1030508 1041556 1053367 1093327 1117980 1101616 1110386 1125022 1171256 1210531 1199598 1206860 1227025
18762 1227025 1244579 1221410 1261161 1292984 1313344 1359755 1346301 1294974 1257099 1246992 1308873
18751 1308873 1304441 1334618 1387688 1355051 1301484 1290617 1246999 1177371 1097641 1067230 1082768
18740 1082768 1107199 1104298 1097637 1105328 1057685 1021728 1030686 1009393 961966 909687 861805 827050
18728 827050 806544 751335 725733 732817 757250 785735 776985 729485 718751 723087 725391 732863
18716 732863 705261 660527 624403 619248 659712 667569 650639 657014 620317 598208 590724 564974
18704 564974 532147 511470 469401 459407 497876 537246 541835 551173 583135 551180 551072 575573
18692 575573 588241 564121 580664 601632 643667 656889 674059 640265 597140 585700 572322
18681 572322 573353 561439 541652 487447 456919 459755 459789 477447 461661 489094 463833 465898 479835
18668 479835 512418 529259 532767 533439 545295 559905 608719 626237 625772 624939 629270 628815 657598
18655 657598 694477 728300 757479 725042 717132 755849 775418 740935 722674 696816 765623 811308
18643 811308 772209 786270 787291 742381 725316 682432 684178 724465 737177 755385 745131 714437
18631 714437 706702 703682 750711 803788 845938 866099 955538 998971 1035626 1044835 1061743 1132338
18619 1132338 1157613 1148638 1155657 1190536 1219757 1230111 1241594 1292972 1331203 1307228 1304356 1325445
18607 1325445 1421745 1499686 1514310 1547283 1616297 1631007 1662599 1713045 1748074 1709992 1783402
18596 1783402 1831064 1838580 1867036 1920351 2041642 2208781 2358854 2482523 2615775 2760865
18586 2760865 2866027 2961225 3147049 3376344 3622596 3881388 4123915 4262991 4293819 4207601
18576 4207601 4207639 4289284 4411126 4583065 4770186 4943959 5135491 5293445 5340089 5337448 5367998
18565 5367998 5433268 5589371 5842345 6166992 6513962 6821255 7120237 7460497 7848891 8251352
18555 8251352 8746259 9344433 9959874 10677470 11509439 12397285 13432842 14574540 15755531
18546 15755531 16985101 18303814 19589767 20716140 21878877 23264634 24649122 25587694
18538 25587694 26349841 27292729 28219387 29547979 31523324 34016427 36777713 39547396
18530 39547396 42096973 44486388 45701503 45685328 46720708 48900021 51550761 55280612
18522 55280612 59881189 64232131 68202632 73693972 81519127 90780608 100008832 106900737
18514 106900737 107645723 101904019 92514881 83683199 76091706 69081182 65817677 66279784
18506 66279784 68041194 69295816 69033069 69677270 72947319 77614175 82130224 84650206
18498 84650206 85628588 87677483 90899441 95472936 101077423 105839155 107481260 103316874
18490 103316874 93141605 81271294 74048311 71308618 70317787 68641335 66419457 65525073
18482 65525073 65184494 63489163 61195118 59744062 60096111 62953944 68647732 76827857
18474 76827857 85715653 91648469 90790924 75481741 52539403 38577751 32300840 29844147
18466 29844147 29146716 28894781 27916729 25213468 21041726 17296455 14594556 12148505
18458 12148505 10490644 9734303 9392622 9283295 9294723 9361137 9469235 9572689 9619242 9658364
18448 9658364 9708176 9501823 8438438 6885690 5720588 4983913 4582215 4367364 4168610
18439 4168610 3963017 3705999 3496389 3378162 3335480 3321002 3319875 3246979 3153974 3003888
18429 3003888 2875589 2753320 2633222 2593384 2603193 2619583 2601519 2575025 2589532 2651478 2699348
18418 2699348 2756788 2718845 2640617 2555135 2468721 2400291 2435743 2513001 2598414 2635714 2664168
18407 2664168 2674325 2649895 2570309 2448716 2324771 2298635 2320991 2350221 2457069 2608543
18397 2608543 2729566 2821928 2889185 2888600 2857070 2865465 2865614 2878428 2919328 2917444 2927500 2842377
18385 2842377 2751638 2685258 2702965 2714666 2674889 2586848 2523674 2455699 2397793 2338218 2296433
18374 2296433 2264945 2283618 2292423 2337627 2369928 2364688 2347685 2347863 2407962 2443712 2476392 2485577
18362 2485577 2471402 2437985 2453342 2406216 2396323 2394715 2406671 2385495 2357520 2307093 2322587 2353769
18350 2353769 2385297 2464486 2522522 2531234 2508521 2443542 2379921 2372997 2306803 2199164 2138027
18339 2138027 2066802 1987323 1935887 1972722 2071054 2203406 2258020 2282266 2401721 2538836 2658685
18328 2658685 2784594 2915340 3020730 3074941 3076512 2998122 2975065 3009218 3042470 3099009 3261881
18317 3261881 3395334 3517004 3676875 3840447 3864258 3798741 3663617 3545179 3401991 3202768
18307 3202768 2924149 2631672 2420070 2212215 2015691 1908422 1882534 1877569 1784158 1579950
18297 1579950 1378762 1253680 1172949 1148455 1141088 1118347 1074482 1098608 1084733 1104899 1131801
18286 1131801 1155314 1139414 1154532 1225236 1297201 1345724 1413668 1426969 1431764 1475261 1570367
18275 1570367 1574554 1600530 1718660 1768752 1806851 1793247 1790667 1781492 1718286 1658909 1667251 1671854
18263 1671854 1645528 1551285 1468180 1401898 1294777 1121555 973785 832666 737307 703220
18253 703220 687749 625146 559986 504654 484631 416253 387682 385276 367108 360800 341945 332515
18241 332515 341611 326646 325695 326608 338451 368856 345951 315343 321101 381876 399363 407362 483159
18228 483159 496775 497709 514091 514781 503708 509396 492836 473453 470281 459446 494670 524076 500253
18215 500253 470200 465342 449118 382330 316214 319188 289116 312406 297378 250242 189506 163945
18203 163945 151789 188147 188619 176585 195277 199650 135103 96604 49268 59210 121155 168035
18191 168035 186656 166042 138225 129197 133746 178796 179496 197768 203787 149358 165457 165960 203372
18178 203372 217455 220280 216711 187681 204081 210191 219214 284852 277946 266198 264191 290953 302336
18165 302336 271251 309964 337685 376847 395298 388513 412068 443851 463389 490943 508693 566631
18153 566631 630576 679150 708686 716097 745337 819804 909987 968939 1010583 1057244 1122538 1222703
18141 1222703 1300425 1375629 1482018 1551069 1641624 1755407 1897147 2014672 2057826 2123376
18131 2123376 2251768 2380824 2507698 2681522 2837540 2959220 3104283 3271673 3460287
18122 3460287 3708776 3924792 4124890 4378197 4682637 5007364 5435115 5988991 6722696
18113 6722696 7606901 8720423 10074845 11719122 13816632 16569566 19823591 22760271
18105 22760271 25310188 28415519 32818397 38741743 45182912 49477352 49336511 38169137
18097 38169137 21310044 11774487 7308815 4950980 3615120 2706513 2090077 1691876
18089 1691876 1394539 1198492 987770 845056 760367 738140 664539 571691 514636 517993 490569
18078 490569 454346 438970 418709 368326 338199 388294 387452 363262 326736 291004 241033 240284
18066 240284 271165 290364 282973 264948 267512 295642 262055 185260 124927 89362 80227 93856
18054 93856 122262 105530 128418 96105 103633 127758 178479 180134 180271 176553 165543 183414 224478
18041 224478 252901 234158 248241 275335 285513 273695 222061 195801 220174 235096 291652
18030 291652 313098 291723 264605 256638 233594 267078 298879 300260 290827 283027 278491 271831 255791
18017 255791 319427 358974 340103 306863 265940 278936 306065 317717 341507 281060 215856
18006 215856 204903 197911 176813 195392 152203 119848 106102 121228 179350 204471 197353 199098
17994 199098 213121 248923 330022 314864 299186 374914 442890 462388 455799 420143 444288 464519
17982 464519 443748 443412 445933 398694 340372 308833 342080 338479 290449 248890 215095 182663
17970 182663 161967 169202 221394 239453 253165 251093 227098 168313 153394 157555 153740 140829
17958 140829 136860 149252 148584 140468 111318 64377 53645 70868 40344 62211 83668 109083
17946 109083 136290 158605 135120 141509 134415 127620 88865 81600 79960 111059 125438 139543
17934 139543 146206 150647 187329 232163 261920 275824 291520 258910 212891 184218 115206 77610
17922 77610 89390 71214 45046 39491 45177 36486 31333 39293 30123 53720 33872 -4 19106
17909 19106 49224 66628 86981 13133 3874 33737 39070 -414 -57459 -54179 2852 16534
17897 16534 37779 68570 62659 32047 8853 -8373 -28362 -18061 4064 33653 44259 30724
17885 30724 12222 16039 44770 58658 11511 7178 42720 17418 21863 14020 -16274 -21460 -14925
17872 -14925 43973 26518 -6003 1874 34719 37453 19204 6193 -28187 -14167 -21574 -70083
17860 -70083 -84412 -48325 -315 46808 43639 53447 40132 32262 65958 76236 50848 19415
17848 19415 7805 -3289 -37160 -63715 -52221 -47288 -30486 -40375 -35601 -39298 -48602 -32371 -11687
17835 -11687 -13526 -33899 -76441 -92542 -79027 -68485 -95795 -49922 -32360 -16691 6963 3736
17823 3736 -302 6943 6810 -37763 -36186 -22427 -22452 -6393 -6061 -496 2244 11585 18718 29249 35419
17808 35419 8057 -22698 -31364 -31294 -64353 -57528 -33379 17032 29620 4769 -39434 -40792 -13793
17795 -13793 -15906 -15920 -27967 -9201 15724 29516 38881 4387 49468 69482 73119 83789 63406
17782 63406 46514 37192 9603 14855 -16068 -38868 -57022 -52991 -28067 -14937 -10955 -51470
17770 -51470 -44762 -26900 -60041 -53401 -47110 -67895 -64849 1193 9818 -538 -6070 14987 -1323
17757 -1323 -17053 -33526 -24264 -10636 49902 61290 24518 17108 12026 16216 1384 -25495 -21693
17744 -21693 -3920 11321 10228 28916 32132 3678 -41632 -63686 -30741 -14412 -18527 -21689
17732 -21689 -13618 -40794 -54890 -55148 -17476 -14651 -35605 -74474 -111068 -105441 -66755 -71113 -59288
17719 -59288 -25420 -18490 -8550 -39249 -59273 -47406 -37723 1105 51810 41849 2653 -1393 955
17706 955 -14040 -20588 -48751 -68511 -62634 -23742 3583 1383 -7006 7690 38141 47088 14511
17693 14511 31435 3406 -28962 -3577 43571 24697 32382 -1567 -25679 -26846 -16077 -8705
17681 -8705 9336 4062 -1163 -10010 -35686 -42937 -53174 -54379 -49902 -18525 10706 36016 71041
17668 71041 69136 38624 -6795 30394 54830 35197 4882 27618 35541 30193 5168 4615 30124
17655 30124 19546 -6097 -59090 -87848 -103819 -56925 -19217 -45662 -42040 -441 168 -11689
17643 -11689 -18858 -53770 -33784 -11230 6705 -6053 -19621 2319 -1286 6385 42460 59191
17631 59191 16618 -34866 -46854 -68349 -39991 -38040 -40620 -7055 27573 65402 37163 8792
17619 8792 -1940 -46579 -44767 13011 28378 13391 10187 16309 -20482 -27264 -24616 -27940 -43869
17606 -43869 -51921 1993 50680 46402 59922 36008 19191 9367 20438 33013 34749 22379
17594 22379 18714 40495 86582 89188 58792 -8765 -1414 26560 7345 -9163 -4077 -14524
17582 -14524 -29787 -3061 20386 34806 57782 55361 17664 -33166 -87447 -101956 -72713 -25998
17570 -25998 -25796 -12800 -31800 -88617 -110580 -96920 -10856 51764 65962 22285 -6367 -276
17558 -276 5494 220 -4101 8981 17053 7351 28073 71957 53603 35316 53460 76741 86390
17545 86390 117623 134436 119605 99345 88833 88709 92198 101986 67668 42167 45941 65005 58648
17532 58648 65043 67061 61885 69485 101052 123566 172005 154291 132520 101584 70418 86652
17520 86652 81637 98272 132027 97356 98483 116034 150457 152570 105793 96381 97648 107106 93555
17507 93555 86252 81517 79463 116430 124181 107516 120219 108585 98377 85039 104214 121323
17495 121323 109509 77839 75303 43832 50127 68055 21599 11048 16528 19335 5845 26723
17483 26723 31704 68967 38575 11866 -1676 -19323 -16972 -14239 -17282 -14687 -77277 -102402 -94289
17470 -94289 -64798 -32936 11042 44344 40218 69830 94618 80250 57680 41721 53946 43485
17458 43485 7365 -22477 -10373 6354 18565 9813 17824 35297 35034 37693 47562 48890 44320
17445 44320 64717 100267 81265 60571 42335 87514 118749 100875 98813 143503 188962 184575
17433 184575 165986 154857 102027 51773 33210 43442 91378 89668 36922 38793 29025 11787
17421 11787 1658 -1723 -12881 -34636 -58762 -103105 -123682 -59216 -2827 7823 -8359 -52014
17409 -52014 -62266 -43938 -39160 -39111 -18425 -17548 34091 28440 61242 48364 44847 12192 -31518
17396 -31518 -10902 4979 13415 39737 24548 -863 -28355 -24516 30310 39398 15347 -6081
17384 -6081 -38155 -45427 -3602 30339 40781 73688 92220 41994 -32160 -53966 -20950 -29713
17372 -29713 -41239 -72354 -43114 -12147 -16500 -25747 -48058 -86446 -111059 -102279 -84396 -109673
17360 -109673 -81575 -73005 -61083 -85027 -60717 -47183 -52060 -42593 -44059 -50874 -54257 -48174 -33718
17347 -33718 -21164 -7534 -15486 -20715 6358 24745 6101 -37823 -59506 -68645 -67379 -55561
17335 -55561 -27102 -21482 -49049 -21468 10008 32451 40335 28837 -21684 -14236 -7068 -26631
17323 -26631 -66030 -62230 -35090 -34362 -40559 -31618 40807 23265 -3113 -19700 -57409 -82716 -32962
17310 -32962 6645 -3995 -42936 -79061 -51628 -56723 -48616 -47617 -76931 -85522 -46197 -17558 -474
17297 -474 -15626 -15598 -19959 -34448 -40292 -51059 -69125 -91711 -81123 -28855 4841 2170 10991
17284 10991 4152 -8199 692 -987 -14436 -4172 18419 11723 29146 11996 -13399 -41367
17272 -41367 -4861 7545 -63618 -78868 -53457 -8048 -11752 -43183 -66276 -31631 -4411 19273
17260 19273 52064 56483 28655 14048 9005 -7631 31488 73072 47245 33170 3667 3399
17248 3399 -12499 -16701 -5030 17772 938 27895 -5894 -59812 -33399 25671 24068 5467
17236 5467 -40582 -25700 -1137 27340 12092 -4360 5398 41840 51038 14682 24650 29605 19133
17223 19133 27403 -7700 -27423 -13790 10958 29227 45298 72379 77451 73387 13655 -15747
17211 -15747 -20229 -11974 40369 63242 76553 56262 -8748 -5166 24358 -11185 -25098 -6892
17199 -6892 -4257 -20487 -1004 19204 22495 -2617 -27928 10187 11174 -16886 -28143 -53359 -57007
17186 -57007 -61452 -28457 -34441 -44021 -36793 14681 36222 19665 3705 -8231 -12340 22029 14869
17173 14869 -3814 -10684 10029 -40527 -73575 -74241 -25352 -2933 -6718 -36438 -82495 -65496
17161 -65496 -31493 42806 23289 18504 10991 -36024 -43182 -43701 -27863 -8239 -2842 -33024 -65606
17148 -65606 -68198 -68377 -103460 -37438 14944 5586 34107 -25672 -38728 5110 -14172 -1275
17136 -1275 12896 2219 -17473 -16530 24042 25602 8132 -41234 -40029 1303 3069 1737 -13365
17123 -13365 -50739 -107209 -119621 -43847 -9510 16274 31380 63956 31723 2492 -9777 -40069
17111 -40069 -82214 -59295 -36341 -60598 -58357 -6327 14648 -11060 -28999 -34226 -71544 -79196
17099 -79196 -43587 -52321 -46047 -26969 -23955 6565 -14259 -13265 -22506 -8212 -9505 -36617 -52463
17086 -52463 -112808 -97157 -45383 -3760 21012 57772 85344 119687 79246 72219 69619 80320
17074 80320 26992 -4392 -22023 -26390 -14807 -10449 -3108 -3355 -44182 -43104 -28631 598 10553
17061 10553 18965 -7410 -43023 -56948 -51732 -37240 -72655 -72737 -60713 -47393 -41059 -31461 -42382
17048 -42382 -24142 -21381 6330 20939 -6321 -18366 -36860 -77273 -81138 -71016 -46948 -73655
17036 -73655 -71966 -44910 -12856 -31172 -19994 -18596 -5246 49506 24839 24581 14050 -11365
17024 -11365 333 12473 -35226 -23896 12053 7068 24147 -8661 -41440 -34254 -32455 -24773
17012 -24773 -6685 16416 34947 -25886 -56278 -48503 -27875 -38968 -14517 -3318 -14945 -1885
17000 -1885 -13406 -46398 -63150 -26843 15809 39061 26395 59482 48851 2352 -17012 20456
16988 20456 10012 31995 29170 -13148 8782 9095 16308 29018 19937 -13849 -14150 -19723 -36181
16975 -36181 -49688 -43908 -21909 -7746 40495 53394 58322 78551 19084 -51382 -2635 712
16963 712 -34488 -20283 -16332 -19802 1920 17706 47340 80281 51072 -36590 -90728 -107855
16951 -107855 -98607 -58341 -22966 -4965 -685 15323 -16155 -46125 -47393 -37051 -59875 -82553
16939 -82553 -85666 -31964 -30287 -1916 58614 59214 42638 10857 11120 3810 12288 23753 12799
16926 12799 34354 58113 58417 26857 -1241 -3071 -27126 -32139 -13226 -8841 27452 36039 27712
16913 27712 52927 54819 25757 -19626 -57371 -49114 -29762 -47820 -23238 -19572 -30176 -25127
16901 -25127 -39467 9257 22462 12577 18651 22370 762 -16307 19573 53860 45746 85201
16889 85201 129597 157846 158456 149058 155944 168672 146656 123189 136556 170589 144998 151648 160303
16876 160303 180668 207045 216766 228952 243965 256111 229776 216057 238609 250098 239091 265959
16864 265959 304430 357011 395074 394303 433058 410759 366965 337965 335749 318827 321379 361568
16852 361568 385052 376912 311199 321340 323796 259111 230436 230734 212034 203186 244810 286492
16840 286492 254548 187883 155385 187472 135557 101923 107766 119130 94264 130569 121904 77432
16828 77432 51773 63001 56832 43944 32811 55291 77113 75416 79699 42581 17203 34180
16816 34180 50749 27640 24008 26827 5295 2592 -26908 -18523 -1622 -24189 -29138 -33371 -45968
16803 -45968 -25392 -24286 -17728 -23023 -29224 -36575 -77544 -58299 -41990 -28856 -31929 -3002 26026
16790 26026 -48280 -85614 -62958 -58312 -32469 -19807 -49213 -105906 -134388 -67766 -22226 -2738
16778 -2738 -23723 -53119 -20622 -12839 -42461 -398 24462 9675 -2445 -12677 -27685 -16607
16766 -16607 8011 12004 -24334 -52978 -22201 -10729 -16709 -32352 -20774 -46176 -64691 -46809
16754 -46809 -63173 -77911 -66194 -25664 6986 -27603 -19451 -14960 -1147 15061 29249 35905
16742 35905 29472 41666 44345 16938 -15706 -36887 -35443 -40094 -44163 -33972 -25300 -52589 -59600
16729 -59600 -33430 -21537 3127 -4052 -37093 -39460 -5011 10102 14734 28470 19121 11737 -12050
16716 -12050 -37676 -6319 44155 23479 9203 -14320 -64624 -19663 14381 44277 64029 52678
16704 52678 68411 28241 -2591 27446 47535 52931 49525 37662 29180 -9565 -45656 6790
16692 6790 -270 -25597 -27899 1130 20556 6619 3055 -109 -21791 -54129 -52204 -52120 -39399
16679 -39399 -38490 -14699 -38610 -25851 -12609 -27174 -24980 -36509 -15696 17063 17300 17685 17699 -21303
16665 -21303 -36667 -38949 -21807 -6298 -11302 -7415 -15800 -9469 -18849 -17012 12281 -6401 -35650
16652 -35650 -10210 -19629 -11431 6677 -2869 -31413 -51989 -2103 13048 17922 5176 17374
16640 17374 -1629 36117 17018 -29545 -81142 -88037 -61888 -42891 -32041 -22883 -40770 -36301
16628 -36301 -51892 -35082 -39169 -23808 -28045 -44997 -52703 -20796 -31195 -18775 -14409 2618
16616 2618 12292 11066 14743 -13091 -15174 26017 -9292 -25700 3088 -4720 4337 9898 -21147
16603 -21147 -19299 -13631 -26840 -32666 -40802 -32170 -24509 -13538 4294 -10967 -33564 -17134 2406
16590 2406 48210 10518 -40933 -18059 1766 44344 39239 -13424 -42113 -68166 -33233 -9843
16578 -9843 61 8134 2439 -7324 18734 52368 77366 59394 24833 27785 37797 10376 -33363
16565 -33363 8026 8635 -42014 -63727 -76989 -86170 -68322 -60282 -62085 -40527 -20870 -9681 -316
16552 -316 -3134 -28349 -57302 -77573 -81012 -69191 -22647 92 16470 38498 18390 -17294
16540 -17294 -58007 -61870 -58973 -61446 -54711 -37658 22872 55991 56855 -4179 -46186 -41541 -36586
16527 -36586 -43491 -36747 -29728 3096 38927 34473 24613 21957 -15242 -25681 -5217 -38052 -33605
16514 -33605 -56103 -59001 -40742 -7288 -27626 -54114 -53501 -31381 -34796 -41066 -40673 -92185 -105931
16501 -105931 -60711 -26673 -36886 -55874 -48577 -32651 -20366 -39060 -51710 -84447 -56456 -45538
16489 -45538 -62716 -58108 -16314 4989 12011 15572 -21630 -27204 -1086 15793 35350 25083
16477 25083 -22940 -32338 -55107 -23958 -23918 1117 38156 47879 -2659 -8601 48515 89943 4845
16464 4845 -64546 -106341 -82894 -49697 -27919 15959 49058 47994 -8537 18305 32829 26450
16452 26450 19561 -18818 -35515 -68401 -62584 -30928 -51420 -93279 -70212 -21073 18138 -8143
16440 -8143 22687 40722 16398 8658 -17352 -3350 -5454 8213 30081 28705 49817 41657 27783
16427 27783 32905 10249 -32306 -548 -14483 -16335 -32997 -35911 -43884 -57993 -19799 22579
16415 22579 13710 -18060 10289 53628 69358 39981 36518 17785 -3248 -13541 -48337 -70042
16403 -70042 -72439 -70913 -100515 -82176 -74006 -77138 -67677 -62920 -1646 21802 -4177 -23666 -37188
16390 -37188 -69163 -100622 -35495 -29366 -33411 -9900 -16260 19303 14793 -55374 -125789 -138931
16378 -138931 -134090 -110551 -70491 -3036 22783 44236 16393 24425 26138 4130 -4741 -14038
16366 -14038 -18250 -25512 -21620 -15655 17191 22431 12816 15982 14824 -8814 -7954 -32740 -69058 -47546
16352 -47546 -19091 -38947 -43751 -53717 -53662 -29427 -39239 -21358 -35869 18202 42603 21423 14691
16339 14691 14349 11480 23263 -17360 -17351 14680 355 -18921 -45233 -84853 -71426 -29990 5865
16326 5865 34554 48545 4557 12290 15686 -8876 -14400 -15889 -2969 -7826 -37825 -78928 -77119
16313 -77119 -76155 -76869 -61975 -4310 -1355 13218 25486 33116 36807 60339 49155 -2529 -3014
16300 -3014 7703 30869 62198 25666 2345 2044 -844 7551 2363 -37367 -9683 38570 67226
16287 67226 81229 60287 60729 60767 -7139 -40361 -21212 -31932 -36126 -31660 -35236 -82699 -100224
16274 -100224 -73731 -91517 -112129 -71827 -46847 -390 5249 -26492 -22749 7134 21707 -20501
16262 -20501 -22572 -23402 -21766 -35113 -59932 -41376 -32170 -40429 -77392 -37683 -15347 -499 45130
16249 45130 82336 61264 66469 76256 15360 -14762 3168 -17126 -73172 -41907 17273 -557
16237 -557 -12387 -10380 -44074 -33041 -17454 -4787 7567 -20781 -57132 -51082 -20128 -21172 -28905
16224 -28905 -13677 -10219 -15050 -22218 -37114 -11646 19297 -1876 -14945 26867 29526 39653
16212 39653 46252 16465 -27716 -28520 -43952 -29427 -42177 -47092 -7762 1790 22295 42822 1413
16199 1413 -26785 -30125 -53730 -22978 -16560 -17786 -1628 44031 51109 37609 57533 -14358 -82850
16186 -82850 -85358 -43048 -1079 16652 -6623 -11743 -12446 30446 52184 45284 21744 11205 10963
16173 10963 -10618 -19528 1109 9484 20327 8902 10476 37087 74479 60318 12365 1897
16161 1897 -18946 -65669 -53844 -13488 -12051 -11511 1468 -11233 12124 36788 50639 11215
16149 11215 15281 54017 60600 36761 41667 40292 19323 5708 22183 38228 8790 32252
16137 32252 43709 61987 30729 3278 -24435 -32210 -30630 -36342 -37848 -39667 -39218 -50690 1690
16124 1690 35246 23843 34579 65673 47713 -2979 -29123 -50084 -40065 -7680 -141 -17296
16112 -17296 10232 12556 -4408 30586 20207 8632 40863 55756 42503 49709 -395 -38987
16100 -38987 -42100 -2974 25953 39547 43724 44680 27470 44835 23089 6437 21333 2158
16088 2158 -35875 -45644 -42419 -30359 5037 14231 -13890 3421 -11715 -54510 -35023 -15949
16076 -15949 5587 9287 -20032 -49134 -26400 -49776 -56920 -28714 1840 2544 26734 26015 24911
16063 24911 31004 21407 -19263 -1176 54115 46416 21516 39597 52582 61548 33520 -19646
16051 -19646 -52433 -35646 7167 9714 -17516 -13835 -3332 4674 23644 -3232 -411 -3232 -15353
16038 -15353 4634 -14587 -33561 3535 7465 -18894 -23570 -32427 -49584 -59333 -7277 643 39010
16025 39010 55063 50939 54351 48890 1273 -44026 -75883 -38428 -9530 19199 26296 133
16013 133 -21758 -22153 -11148 -5279 709 -9518 -308 50835 34264 -8278 850 26425 21481
16000 21481 2517 1658 -33946 5533 20797 12822 -34459 -62882 -34992 -30386 -62581 -27755
15988 -27755 -42377 -75976 -57375 -21903 11739 -634 8654 42792 34479 22333 14254 8777
15976 8777 20485 97138 80440 30203 21574 23266 36506 56171 47960 44964 82021 75388 36599
15963 36599 38692 50321 5796 13255 21171 -3860 4613 -19744 -31570 -13059 -7704 22716 64052
15950 64052 26134 -35934 -36134 -44886 -52571 -2674 2572 -6553 24680 24781 -7848 -8827 21759 47956
15936 47956 76660 52615 22210 22913 5456 21583 17823 2282 -1326 -12638 731 20185
15924 20185 12110 -9758 -42889 -42679 8269 19493 -8583 -44107 -52772 6286 75399 100178
15912 100178 75607 45788 66177 80053 59327 57706 64740 36405 38901 81656 111096 113972
15900 113972 110818 117850 128924 85625 70095 81494 98751 158495 184959 154578 143611 142849
15888 142849 169226 164333 180394 185939 237312 248719 232539 230711 248377 258650 276205 276199 280059
15875 280059 323513 332227 361611 392229 384543 426694 441649 492161 508598 566843 625225 678282
15863 678282 711971 738887 783744 797117 853120 878311 897450 958204 1031086 1113370 1185685
15852 1185685 1207310 1221954 1184347 1103700 1056790 1045084 1049710 1007642 931514 837670 814491
15841 814491 780547 706285 630266 555259 503314 432861 356152 363810 311739 304512 288670 298997
15829 298997 299650 299513 249080 212812 171031 183693 178771 131862 127457 102943 49361 39005 59629
15816 59629 65577 110410 132304 142540 97017 65782 89660 99108 63455 52218 81916 88839
15804 88839 104070 50193 57855 39421 47274 30231 53432 46736 62945 60430 38568 66118
15792 66118 72563 37290 6047 2955 4500 30412 69923 101932 116767 86127 24933 39162
15780 39162 42858 57530 57076 59501 53715 38190 21771 10660 34980 59862 67679 -1109 -14262
15767 -14262 -32426 20985 64494 67582 73625 44945 5481 17760 13862 -1980 -16766 -18556
15755 -18556 -32840 10763 26216 30612 17712 15765 29596 23797 13699 6746 16801 5366
15743 5366 -46181 -18196 28813 11773 50369 44109 -26352 -63134 -33670 -43361 -40085 19614
15731 19614 61196 60691 36179 -4096 -3508 -34071 -35397 -46400 -30797 -13205 -23443 6680 34263
15718 34263 35503 68349 90133 74659 35608 18031 -16087 -3520 12585 16690 18696 41175
15706 41175 15040 -14240 -16398 -44731 -21187 -33136 -32698 3241 40022 16831 38986 36892
15694 36892 16249 1886 4660 -35232 -70466 -60532 -46506 -7026 -21001 -44217 -31966 325
15682 325 36315 60894 43961 -855 -15253 -4658 3189 -18799 -12932 -2876 13453 -4721
15670 -4721 -9125 -4730 39205 39718 7110 25003 -9455 -43788 -27074 13106 19601 -4881 -20181
15657 -20181 -47490 -34478 -31328 -36321 -41434 -37758 -28208 -159 -20330 -36647 -61822 -55636 -9991
15644 -9991 -15421 -34239 -60242 -42264 15190 -34598 -76968 -92176 -46771 8481 -2592 -12482
15632 -12482 3019 -19227 -11177 -21658 -53129 -63370 -81013 -41609 -34241 -48631 -59376 -88352
15620 -88352 -64199 -21115 14075 17157 21435 -4178 -18988 17686 38517 22104 -1447 -1660
15608 -1660 9148 3035 -27796 -41859 -367 -29494 -38493 2715 -33894 11367 -2441 -44780
15596 -44780 -22621 25838 56205 45180 14697 -2958 1999 -5282 1023 -28686 -48922 -11264
15584 -11264 32989 -3154 -38811 -9134 17762 27036 10713 15335 44458 37425 14591 36066
15572 36066 16196 9304 -29750 -55498 -22017 -19069 -43104 -15339 -9267 -930 17893 23355 11183
15559 11183 -7334 -2627 9279 3717 -24885 -60993 -41016 -48469 -45927 -8915 52072 -1087
15547 -1087 -50426 -54200 -14669 -39080 -4601 32606 50452 50782 20570 55526 53677 -16229 -26022
15534 -26022 -32196 -75216 -94325 -98856 -81871 -333 24910 42952 28261 794 -27671 -25078
15522 -25078 -5423 25291 79853 91944 78233 39929 37452 23107 -72729 -107516 -118143 -33253
15510 -33253 21121 4295 19624 -6854 -10728 47735 42491 36841 24737 21418 -11939 -18178 10857
15497 10857 6056 -35431 -43119 -57473 -70747 -42334 4185 29494 24338 7922 -13321 -6892
15485 -6892 23698 55183 52352 51553 61116 43082 15927 -9360 -409 9900 -15572 -28306 26777
15472 26777 16707 -32889 -26313 6621 12884 -46960 -62254 -54225 -22637 25659 8176 1215
15460 1215 -28509 -23722 -35934 -43394 -25012 -37095 -50583 -40624 -25856 -6151 11587 -10875
15448 -10875 -5658 -25999 -62910 -36511 -10793 26691 46239 33933 -1252 -18609 -3865 1432
15436 1432 -26810 -14328 12271 35163 26937 -5352 -41994 -22262 4979 9180 6363 45864
15424 45864 8604 -20216 905 2700 29826 12252 -16824 -14535 -14035 -6715 -18963 -42944 -81158
15411 -81158 -57861 -12105 -21591 -20836 -15368 -11871 -18970 2707 -4296 -46373 -41017 -7876 -16390
15398 -16390 -49344 -61225 -55991 -73562 -73925 -41320 -36834 -23529 -33427 -34907 -75939 -77953 -37713
15385 -37713 -11084 -61738 -81191 -55069 -37682 9245 58312 50690 48368 9777 14153 57421
15373 57421 65024 47371 24475 47935 50167 16569 9263 18570 33829 18432 9142 10887 8665
15360 8665 -15360 -14501 -11008 -36683 -27014 12129 17059 52932 80577 58136 57625 78803 64539
15347 64539 42145 17700 11020 5901 -31127 8533 10108 -407 -19517 -19224 -40969 -40330 -39583
15334 -39583 2056 35485 13880 -35503 -72695 -42913 -20909 -29976 12322 -19233 -66624 -78129
15322 -78129 -63723 -58724 1183 50191 28648 5182 51701 56706 35276 -409 -13906 -6620
15310 -6620 -25371 -53545 -38694 27206 25819 26251 5288 -23956 -28558 -24858 31 26935 33343
15297 33343 41383 77834 51846 23979 -20519 -41895 -17833 -16502 7040 -16637 -30756 -37672
15285 -37672 -26590 -15683 9935 12187 -5907 14884 31082 20628 22384 34721 1729 -41306
15273 -41306 -30453 -37070 4350 83809 54630 -5904 15828 15614 14109 24069 26884 26960 43228
15260 43228 -4485 -15564 -8729 -5027 13077 -1046 25016 16219 -22533 -8172 36852 57502
15248 57502 33219 37572 22456 22328 45654 34527 -1531 15454 18916 12175 15001 -15737 -3080
15235 -3080 17822 1831 -18661 -24322 -50115 -81924 -80292 -92619 -60846 -13095 27454 16961
15223 16961 14438 -36117 -50111 4925 49743 64118 30069 10834 -2848 -11999 22684 33118
15211 33118 30351 25708 -722 -2535 6168 -7284 -39579 -10652 10358 3122 -4711 -34377 -13957
15198 -13957 -4853 -9707 -13208 -43985 -77759 -73129 -87147 -63999 -16119 -53817 -81868 -87463 -49834
15185 -49834 -8673 487 23031 2118 -41428 -11076 -13005 -55400 -76943 -78435 -73169 -72500 -58052
15172 -58052 -54340 -48175 -39623 -6838 -19967 -50408 -49548 -41974 6853 14722 -17784 93 13203
15159 13203 14373 -17195 6368 10095 -8280 -11954 -12699 -37598 -63487 -54368 -27312 -39376 -42819
15146 -42819 -3537 14552 -25798 -21854 -3991 21160 6278 15906 -1807 -27376 -78490 -111268
15134 -111268 -50213 6453 30596 12902 -15710 -37752 -45315 -2892 -13758 -61661 -29396 7935
15122 7935 -1971 -22932 -20129 -23268 -44284 -5162 7495 -21763 -55975 -68380 -20052 45071
15110 45071 76911 25575 -8516 -40277 -43488 -52313 -36302 -40026 -53644 -83253 -43634 -7228
15098 -7228 27022 38573 40227 26665 20644 2285 27693 49490 21220 7423 9537 39176
15086 39176 40132 28525 48672 32306 -10579 -35871 9214 36297 20669 19204 52324 63081
15074 63081 31314 5692 -7751 44663 33916 -26133 -50231 -54808 -43073 -49777 -53267 -39659
15062 -39659 -55956 -64441 -49171 -32210 9037 56830 74092 53441 39452 31793 16367 12151
15050 12151 25498 51910 31727 20095 -35082 -37218 19917 -553 22448 21814 -2306 -274
15038 -274 15147 22201 35501 7883 5048 -24296 -2723 -6856 -13644 -1506 5902 -24233 -56777
15025 -56777 -27141 -12349 -23857 -68176 -38751 -12864 -16769 33021 35463 30568 35325 50763
15013 50763 8887 -9575 6892 -12622 10102 29798 27685 -45655 -67751 -18661 -11230 -67130
15001 -67130 -60115 -42994 -91395 -102874 -79181 -71070 -38716 -59507 -58822 -81821 -58789 -48440
14989 -48440 -68210 -50247 -17660 14042 37455 9703 -1245 -61799 -87763 -74975 -41606 -44379
14977 -44379 -30037 -35773 -18721 -37782 -40418 -11500 25462 23996 -31145 -25015 -38169 -27482
14965 -27482 -12182 -33059 -70315 -1816 26599 19062 -45859 -37425 -30433 -41765 -44820 -5808
14953 -5808 -24662 -55326 -35004 1596 28421 83777 110208 74357 40329 19820 1480 -24491
14941 -24491 -42741 -44794 -46695 -31971 -20136 -30115 -53282 -80464 -34502 15315 3541 -10273
14929 -10273 -16954 -34266 -41102 -6854 25202 -13839 -2467 22230 15335 -848 -9361 16553
14917 16553 1479 -40544 -47454 -33252 -38904 -19412 230 -6970 -38311 -57893 -41267 55613
14905 55613 85202 69773 39219 1239 -20421 -58482 -75325 -9846 17937 -11193 881 49713
14893 49713 23005 -22360 -65920 -51263 -12195 -26872 -23737 -24918 -29235 -30920 -58080 -26085
14881 -26085 -45410 -61373 -36018 21073 32733 35715 39975 56450 28793 -12854 -37110 -67060
14869 -67060 -60218 -69344 -35582 2183 -9018 1396 7636 8778 -8316 -17800 -1366 11942 44835
14856 44835 55864 9534 -37269 -34427 -31698 -41304 -61359 -83899 -71911 -72545 -25337 -17350 -30698
14843 -30698 -25312 -50954 -63702 -54024 -18435 7692 -27789 -39682 -60573 -75721 -50680 -11085
14831 -11085 -6040 -42947 -40236 -33485 -41919 -58475 -3787 34606 59999 71418 83866 55835
14819 55835 43854 36868 24927 -4866 11590 15279 1594 -26991 -60312 -53742 -33392 -23545
14807 -23545 -71460 -66134 -73760 -43112 -19129 -32530 -41753 -35671 -59445 -56768 -12283 15581 13794
14794 13794 -4361 -32387 -16716 21493 64665 71386 48364 15042 430 -30175 -60045 -67399
14782 -67399 -46148 -21343 -27633 8317 17657 42069 56770 -17794 -63215 -51993 -6339 36662
14770 36662 27229 50625 109715 117121 79600 89019 74853 74811 49991 37124 18993 13219 -2277
14757 -2277 -52228 -72662 -55686 -3739 -4296 -49349 -59543 -82940 -71212 -39670 563 5469
14745 5469 56671 43628 36559 42844 6227 -31853 -75103 -88761 -54645 -31463 12540 30644
14733 30644 10502 14889 20394 -13396 -11693 12023 36563 15630 1960 20657 41759 30957
14721 30957 53033 34712 12435 7918 18028 33867 85764 94392 79541 44313 16660 39128
14709 39128 14417 -16837 -22240 -14706 -28404 -17302 -24513 -65422 -59066 -82697 -32860 28220
14697 28220 4021 -37541 -53552 -33798 -36778 -19413 991 52910 52997 28343 16752 24089 49791
14684 49791 30965 -7503 5622 29008 16581 9751 -50365 -94353 -86162 -79044 -32625 14694
14672 14694 17827 1193 -10882 -1130 8704 17617 24051 11154 37181 3447 -54656 -84790 -82302
14659 -82302 -78232 -36158 -10858 15874 54287 85448 83156 64143 25646 -25362 -45442 -41114
14647 -41114 -50283 -72790 -95172 -101619 -110452 -78582 -57621 -32945 -26056 10359 63015 80373
14635 80373 60947 67745 50580 32410 67073 25601 -38196 -20287 2102 -3019 -19899 -18103
14623 -18103 -2672 2234 -41924 -34421 -46135 -82510 -76812 -38557 -33701 -13933 -14167 1752 9727
14610 9727 6249 10319 22217 26081 -15387 -4057 12483 -17181 -33760 -22089 -17511 19978 13859
14597 13859 -4213 -7561 -6130 -44496 -25446 -9463 -874 10513 9936 -4268 -23391 -36415 2405
14584 2405 -246 20166 25405 9151 19281 13390 -5661 46863 48716 40671 52851 46331 -20393
14571 -20393 -57636 -69140 -59191 -40029 -23558 -30941 -54425 -48374 -35724 -32703 -12669 -3626 -12009
14558 -12009 -31385 -34005 -50493 -92716 -82414 -50588 -59772 -85163 -87588 -81069 -90353 -75728 -67634
14545 -67634 -78291 -77827 -72662 -105738 -105553 -58250 -14971 13439 -33551 -59262 -63674 -54853 -21371
14532 -21371 23511 37581 38827 -9879 -19447 -9608 -16017 2156 -6941 5355 16109 17014 -8831
14519 -8831 -23262 -34054 -21794 -22294 -7203 -13227 -8987 -15672 -2015 -35994 -2250 -2031 3607
14506 3607 25010 37009 42435 29025 -22949 -42655 -14720 -22942 -24704 -8755 26303 12151
14494 12151 -2226 -8036 -29236 10559 27534 14096 36643 37972 20011 15501 25776 21434
14482 21434 22670 -21919 -32648 1322 35603 14297 -17868 -20966 -20109 -1307 -6743 -8039 2576
14469 2576 2578 -4534 21323 42879 26310 15853 4643 13659 32589 14722 -3715 21525 -7370
14456 -7370 -58321 -67893 -18757 -17103 -41374 -27201 -19402 24900 33433 23757 16437 48475 32502
14443 32502 21301 51193 18636 -7723 20926 26155 36012 23929 48865 41096 28884 32734
14431 32734 16163 8422 19883 23774 -4045 -15866 -30464 -13008 46312 66596 11607 -39283
14419 -39283 -34980 -8614 2542 -5398 -28092 -35332 -37889 -20818 -20492 -29200 -29461 -69073 -68509 -35340
14405 -35340 -48850 -66756 -10666 -5896 -70991 -85983 -41866 -28188 -30592 -25005 12807 -2031
14393 -2031 31797 44322 39018 51714 68161 20151 16717 80573 84480 37081 -12520 2140
14381 2140 35923 28109 -13676 6507 22567 19659 -25430 -19194 -7301 -24438 7622 75896
14369 75896 48980 23086 -13435 -23277 5205 29842 7189 -28299 -11140 52735 64124 50206
14357 50206 56650 72532 72804 36542 29904 20768 42093 57257 12437 -4134 57408 47044 41185
14344 41185 58743 37418 -37400 -25269 4715 -30081 -26598 6128 11767 -18436 -66475 -68200
14332 -68200 -31123 -18890 16126 36046 9370 50294 25345 9645 -7799 1628 9437 -3855
14320 -3855 -17256 -70206 -101180 -72140 -38040 -7278 5529 -10997 -7543 1032 -27028 -9828
14308 -9828 8568 34612 19582 -16791 -37600 -44886 -24886 9662 -27913 -59259 -58570 -45639
14296 -45639 -36952 -37049 -97540 -101411 -70335 -35457 15247 7337 49644 101748 78496 71736 36764
14283 36764 34602 21466 31290 -22 -19690 -58267 -58090 -19658 1217 112 267 12139 58658
14270 58658 46340 -8035 -23877 -25244 -25440 3130 9875 30416 34728 34355 46762 1463 -37310
14257 -37310 -19508 8316 -6419 -22685 -5263 -24833 18567 44887 57073 55450 46049 48005
14245 48005 49639 28625 -11559 -22231 -21433 -48984 -28036 -15303 -20890 -25909 -29074 -42690 -28170
14232 -28170 -70034 -70991 -37885 -21535 -3837 -13126 -33369 -27918 -23019 14190 4548 3505 30233
14219 30233 65599 86695 44666 29191 56943 34598 26586 14084 -21325 -20580 3924 12679
14207 12679 3614 30198 58866 64426 40111 14869 -3123 20345 52471 40611 14728 -4134
14195 -4134 -18544 13471 -4304 -16735 -4810 52546 47521 -29860 -53358 -60796 -54281 -6111
14183 -6111 34455 1796 -37075 -63567 -53057 -68310 -70117 -82402 -56985 -16333 23044 38706
14171 38706 -22374 -38742 -24518 13717 33706 31640 32484 22491 37109 -9284 -55080 -34818
14159 -34818 -11379 22001 25616 -4173 5111 46786 45397 1380 -8772 -849 -58750 -85165
14147 -85165 -62710 -8692 6986 44610 59561 67147 56429 43289 -15644 -43038 -67250 -66862
14135 -66862 -41648 -59425 -34936 -21435 -22066 -32889 -48708 -33422 -42973 -29785 -26220 18990
14123 18990 69429 75153 78742 85283 87928 77098 106583 68216 66107 109215 58720 8728 -45102
14110 -45102 -19816 -5981 -6857 20673 31507 4319 -6054 5514 28621 25349 20965 -37613
14098 -37613 -92070 -102664 -36290 -6940 -10882 -40255 -11046 10212 21478 -19235 -34015 -5640
14086 -5640 10635 -30644 -42782 -47464 -26043 -24371 -60021 -76572 -122679 -126229 -110112 -95482
14074 -95482 -44436 -10771 -8166 -6585 -22646 14007 64489 20490 -18631 11840 4443 5430 5524
14061 5524 10422 42056 40559 9003 20872 31675 13424 -4588 7076 8977 -16491 -11559 -17805
14048 -17805 -8318 -14801 -18218 -31628 -7972 14537 22328 44681 55891 55537 53631 17920 29570
14035 29570 45678 55513 42071 20767 48343 27946 24959 63170 46649 17401 32690 5165
14023 5165 -36497 -54338 -21542 10824 14582 4974 -10158 26970 7258 -6238 6832 19724
14011 19724 27573 -7998 -24343 -23514 -21912 199 4193 -29831 -36793 -6959 -11251 -31151 -45834
13998 -45834 -89562 -89989 -78009 -66742 395 21233 33638 21527 -37775 -26824 9644 8982
13986 8982 -4076 -11973 -1270 -1340 -14343 2561 50381 16883 3009 19207 51466 68652 47524
13973 47524 31687 -2164 -31392 -35947 -60897 -75905 -78636 -64862 -67885 -25804 -1564 -2345 -12802
13960 -12802 1371 -9851 -14658 -22614 -4322 32018 22561 654 32748 64351 37734 20582
13948 20582 31708 37954 7205 26237 15794 -32817 -50657 -26723 30435 33127 -504 -35128
13936 -35128 -15561 22864 8120 3268 10203 -2906 13080 26569 25110 -3026 -1645 8284 42553
13923 42553 41795 47704 62968 58177 57310 23281 51923 73512 65287 27842 42736 19751 29294
13910 29294 24316 4769 -22229 11415 15580 17487 -8218 -59065 -58003 -84067 -92456 -84014 -99945
13897 -99945 -91628 -36038 -6667 -17492 -6035 10238 -38087 -80272 -55077 -10964 -16401 -26375
13885 -26375 -48733 -95249 -70420 -53247 -38932 -26547 -19513 -46747 -53419 -9476 3497 -9046
13873 -9046 -20306 -65422 -65262 -12478 -6806 -13418 -13916 -31606 -48710 -24920 -16780 7467 43086
13860 43086 32418 1854 -7452 -1155 -37873 -20022 -10879 -42568 -71285 -55085 -28090 -31234
13848 -31234 -100384 -82722 -34199 22148 53402 47813 -6077 -42335 -99284 -60583 -22053 -14979
13836 -14979 -50273 -83886 -51024 -49137 -48567 -7767 46950 20027 -28369 -60043 -41181 -51824
13824 -51824 -23291 -252 24741 27171 -12031 -61565 -99122 -76913 -68122 -40698 -24107 11366
13812 11366 48840 66839 12046 -5410 -19540 8657 24098 -45787 -74386 -100865 -92091 -61077
13800 -61077 -16161 51675 35825 20976 13123 -18451 -20402 -29450 -16824 -25055 -27179 -3537 8919
13787 8919 -1019 11519 41949 54078 33769 56559 77871 87447 56287 40125 59334 28924
13775 28924 17193 3735 -11117 -42073 -22440 -48840 -89038 -78681 -9147 13126 -2176 16687
13763 16687 -12187 41544 69110 26746 -42617 -56701 -52607 -56000 -28143 -7132 -16127 40002
13751 40002 84397 18460 -827 -14209 4994 19403 4335 -3167 -5088 12517 44965 10109
13739 10109 -19858 -9471 -17850 -81974 -76689 -45484 -34662 -51751 2808 48497 13681 -18305
13727 -18305 -11127 26233 26472 20919 21289 -7842 -5109 7423 13533 2653 -2136 -1968 9305 47783
13713 47783 94895 73465 12979 -46510 -80938 -72480 -24865 25047 48733 25541 16229 16748
13701 16748 13789 35988 31896 -23883 -18703 9445 30223 86275 90068 63931 18834 7409
13689 7409 3220 -28618 -70356 -45285 -4190 24125 -14920 -43272 -36464 -42472 -31974 -39069 -22448
13676 -22448 -5948 13975 36768 40008 25448 -25588 -26923 -6526 19791 58229 61824 19759
13664 19759 -14058 -27511 -15233 2085 20619 -4040 -616 79653 81114 37437 13146 18053
13652 18053 32427 27993 2852 -60595 -77506 -35266 -10231 -27732 -24050 31040 34831 -13339
13640 -13339 42048 61999 60409 43083 29031 25812 -26574 -7169 21712 35247 76088 48060
13628 48060 12439 -14297 -27119 -27434 -3646 -8311 -11919 10005 767 14058 8371 -28758 -47997
13615 -47997 -34168 -28448 -34173 -17001 -4663 1607 -29443 -51774 -33809 -17987 -75430 -99578
13603 -99578 -90407 -37186 -18796 -39644 -20702 -6405 -15845 30421 79351 74519 12465 -25881
13591 -25881 -75225 -71728 -38137 -35513 -69663 -62881 -30063 14263 51342 44101 55804 75935
13579 75935 59700 38366 28437 18507 13499 29492 51924 46265 17074 10529 36230 -24873 -36491
13566 -36491 5131 26518 27783 36291 38467 15860 923 -9705 -46844 -73415 -30378 -17169
13554 -17169 -12650 -46873 -36667 -15436 -24211 -16531 13722 19737 13434 -72 -8617 -14337 4776
13541 4776 35557 33869 23632 9983 -6986 -623 3000 -9917 11290 52806 20461 209
13529 209 -19407 -28096 -29031 -35761 -34341 -13886 6128 5675 -28751 -31062 -43334 -59699 -76257 -90009
13515 -90009 -39197 322 -633 -8526 1720 -27022 -52991 -52504 -78204 -86423 -64451 -59439 -55518
13502 -55518 -45257 -52088 -50930 -50754 -13633 -5856 18439 7030 -71 -13145 -65169 -52727 -24646
13489 -24646 40313 74191 45601 9936 10848 13527 -6859 39258 46570 28385 26965 -3089 -32157
13476 -32157 -18833 -12464 -36016 -37505 -7420 -20691 -64600 -119520 -98143 -51040 -9363 13842
13464 13842 -20619 -41971 -15439 14857 11697 19697 474 219 -659 10892 3795 -2327 31801
13451 31801 54899 59604 44225 45053 38236 2057 1279 -1797 6168 21035 27402 4185 -26790
13438 -26790 -57997 -33381 6766 8695 -542 45227 40697 18317 19651 21417 -16817 -2688 24292
13425 24292 55231 38882 3732 4561 21670 13272 -8115 -901 19604 -13440 -17318 44770 92419
13412 92419 102811 37799 50607 54657 34184 31316 8048 -13344 -27539 -34808 -38316 -350
13400 -350 41150 50453 35166 48524 23027 1452 -22335 12646 16146 17495 15297 36518 91441
13387 91441 84276 13462 2599 13438 49482 61822 35732 44688 59573 65736 76101 25457
13375 25457 9635 2037 3196 35137 56903 49660 25154 25179 -7690 -418 -10871 -30462 -69114
13362 -69114 -16488 20735 5319 4758 -8933 -12928 -36784 -55294 -16535 21850 -6442 -41218
13350 -41218 -43769 -40197 -50137 -33036 -55279 -78728 -38540 -450 1859 37467 40049 43111 33982
13337 33982 -8672 863 -11156 -41544 -39029 -5267 -2772 -9099 -12391 8468 5373 -12348 -13883
13324 -13883 18761 40963 4629 -14902 -26684 -36396 -23633 9724 15444 4880 18495 47493
13312 47493 53862 10689 17724 25975 31001 44564 41136 -18371 -27333 -42599 -44790 -20268 -2837
13299 -2837 14263 -46953 -42619 -70081 -59124 -33717 -20853 7848 4783 -1713 14645 45959
13287 45959 38452 54773 68564 48508 29218 35491 15523 17779 -45646 -60290 -36959 29014
13275 29014 20621 -5164 53514 71369 -14794 -53095 -34508 -38718 -19676 -35107 -45675 -24782
13263 -24782 -3526 -8234 -17849 5102 19446 10924 15792 33636 -2459 -17014 2360 14662
13251 14662 -4030 11113 30202 20984 26904 39360 20416 -11388 9672 7668 2844 -15503
13239 -15503 1052 11025 7228 25540 -4627 -19776 -36366 -72709 -70391 -60046 -74639 -27846
13227 -27846 -25659 -20093 -7632 -4178 -4438 10002 -1781 -35973 -37692 819 6830 -14842 -62990
13214 -62990 -56617 -2947 -6357 -6418 -12339 9255 -7922 -4876 6604 15528 28064 39674 -2872
13201 -2872 -30790 6294 29126 56414 59249 51429 65472 47403 25584 878 -3591 50484
13189 50484 49145 -28033 -45038 -44896 -64297 -44679 -31550 -37942 -37610 -33362 -40509 -21619 -34927
13176 -34927 -48282 -38223 -26340 -16763 -25186 -39519 -49079 -43596 -36919 -16495 14672 13277 39996
13163 39996 87039 102261 59352 79751 122781 103853 32115 19767 22031 49836 16172 432
13151 432 -59901 -75958 -94777 -90104 -42850 -33096 -40516 -53761 -20411 26389 31398 23616 3070
13138 3070 -33444 -63929 -81938 -55913 -24759 -14863 -32966 -3636 -7535 9056 34800 -23586
13126 -23586 -31783 41949 80374 28541 16515 31618 19991 -2319 18885 34990 267 -10395
13114 -10395 -10908 39488 27684 27772 46919 -18863 -41223 -20446 -53584 -94236 -89711 -55672 -8904
13101 -8904 -32685 -52111 -35476 -93182 -107073 -112468 -97277 -65955 -42320 -26012 -8449 5326
13089 5326 16390 -505 -27375 -23210 -20169 -67130 -63754 -25903 -5466 -24083 -27907 -64964 -109878
13076 -109878 -81686 -37747 -35747 -21497 -9639 6282 29334 35781 60582 94387 95473 37546
13064 37546 28173 32350 -17629 -21696 -35706 -35672 -43586 -22405 -38845 -47865 -15522 -10107 -20093 -144
13050 -144 39207 41149 61888 53335 25371 48821 77191 50351 30490 6268 -4376 -11393 -7657
13037 -7657 -43446 -2019 18376 53075 54859 109141 77652 53080 45491 -2793 -14196 12580
13025 12580 33717 14442 -6393 -5198 -21377 -12671 4666 29861 18311 31657 57958 21130
13013 21130 8971 2373 -2868 4366 31999 35282 8921 945 -31515 -27881 -12296 4938 -1778
13000 -1778 -60481 -96690 -62028 -64974 -74394 -93432 -65496 -30404 -5712 -48670 -71497 -57213
12988 -57213 -50189 -26509 -385 -3656 7702 14538 14634 2034 24927 6452 -26171 -27124 -11456
12975 -11456 -18701 -7452 -30247 -49494 -57474 -4027 2037 -33495 -34736 -50367 -20750 18953
12963 18953 22475 19728 -5735 28991 9822 15768 29430 24759 43303 38225 2709 -5318 -62924
12950 -62924 -49611 28240 99130 98275 43849 38405 -13614 -52712 -69914 -33139 -11360 -22070
12938 -22070 3803 17452 16945 20461 19424 44307 34182 47628 45745 36009 5428 24646 31879
12925 31879 26624 24398 22288 37526 13610 -17918 -15701 -21023 8359 37437 20972 16598 -2119
12912 -2119 6831 34796 59876 87432 46776 -9984 11816 -2051 -8375 3849 -6839 -27763
12900 -27763 -30203 -14720 -10462 1495 -16853 7257 3393 -28767 2632 -11095 -46529 -26877
12888 -26877 13425 21789 27082 72132 23358 1242 -19438 -43041 -52897 -47326 -50412 -29479 -57263
12875 -57263 -68484 -48249 -24520 -21161 -34988 -27433 -23304 -82905 -93163 -48891 -60256 -40735
12863 -40735 -47680 -73136 -49058 22470 55303 25391 11970 4975 -8011 7246 16184 34208
12851 34208 23332 50894 48366 79102 116582 125079 107858 99152 70051 33353 92382 69760
12839 69760 46140 13582 1274 20369 20294 -3994 -21946 17759 6341 -9459 -42122 -64577
12827 -64577 -45315 -5282 7695 535 -1905 10190 -1184 18091 18055 5117 8657 23021 39949
12814 39949 552 -29493 -16975 -29326 -74376 -72626 -3482 8861 -27915 -47687 -23783 6541
12802 6541 -24581 -13508 -8407 -10068 -28098 -32244 -17201 17961 23754 21524 -19755 -38155 -25844
12789 -25844 21971 -8036 -14818 -8257 -36632 -71206 -33049 -16800 14366 32540 28643 43074
12777 43074 27752 -4278 -27670 -25338 -12644 -17076 5348 23927 431 -26667 -22427 -11456
12765 -11456 -16718 35652 15952 -16630 -51359 -22583 -4377 -25366 -6768 -19035 -37399 -33467
12753 -33467 -4320 792 17560 37909 15185 -29270 -75455 -49749 -29216 449 940 -3072
12741 -3072 5676 6380 -4607 -14546 -18695 -10856 -32180 -37833 -35878 -7827 15081 29028 10803
12728 10803 -6741 -32351 -53410 -19642 6436 13869 26927 16128 12699 -5920 -875 31235
12716 31235 27704 17854 24230 24256 20599 -3101 -10279 -14116 19681 -13859 -2556 5563 -10918 -21742
12702 -21742 20225 49707 67971 61637 5052 -48710 -35406 14266 24377 30076 25924 34088
12690 34088 -7268 -45854 -59960 -46750 -22448 -29136 -12212 11697 -18328 -30690 -37653 -57584
12678 -57584 -67730 -41643 -32640 -23337 -25719 -17566 -22714 -75077 -71839 -66357 -14677 33331 43335
12665 43335 21429 761 5572 29611 5689 -34759 -76510 -101081 -90449 -34866 -22075 -23023
12653 -23023 -19182 -16538 -15285 22062 21823 -26608 -28261 -39215 -32771 -9549 -9765 -6701 -12603 -3204
12639 -3204 7676 14911 -11853 -17818 2113 43607 17334 -16459 -14991 15676 21285 -13078 -21580
12626 -21580 -1424 25454 38131 62300 45407 42714 47820 33092 -11928 -7481 4381 13493
12614 13493 9081 21438 24670 4458 23817 11451 -27747 -50147 -47131 15700 34131 37461
12602 37461 52317 32503 -11527 -57011 -26973 14095 49847 63832 30805 5146 22166 78520
12590 78520 114003 128196 120538 91689 38584 9626 12028 14077 -811 24343 37939 57133
12578 57133 56418 54904 58576 58570 21325 9071 9960 -18611 -26555 -6495 14715 48170 58305 26149
12564 26149 -34853 -27511 18034 61761 68001 38134 -7223 -47101 -36902 1075 -10724 35078
12552 35078 74840 55955 22729 -2677 -44337 -78491 -67008 -29976 -27324 -20189 -4381 -20302
12540 -20302 -26844 -43855 -71702 -35688 -30087 -11041 54157 65310 11835 -17347 -22426 -19042
12528 -19042 22522 61802 45552 11812 -35157 -37274 -29610 -16391 3791 19386 12191 41821
12516 41821 34163 -13170 -32842 -20009 -15979 -18956 -16596 9295 14777 17340 45594 34227 35412
12503 35412 18406 21873 20926 57490 49159 57126 65747 55621 50457 66538 75291 59993 45461
12490 45461 40010 11456 26316 73152 58767 49796 54991 8774 2537 12531 19280 -28434 -13688
12477 -13688 50358 68959 58986 39374 34698 45906 58303 77042 6759 -41256 -59284 -76352
12465 -76352 -67895 -17676 34538 77878 20647 3358 21376 71385 38165 11074 4326 24782
12453 24782 33670 23483 -4430 -9260 -11007 24703 53025 42484 22393 -26535 -55721 -54390
12441 -54390 -41184 -43094 -34393 -45034 -26755 -21069 -27440 -22740 -20594 -29548 -48493 -38493 -11981
12428 -11981 11584 11725 19372 -5824 -24875 23540 15600 5219 19163 15178 11665 -23548 -53629
12415 -53629 -21668 -29242 -40295 -33725 -25534 5627 699 9640 27919 20647 43003 48275 66313
12402 66313 55339 70236 63337 50512 45756 31493 7249 -8238 4751 -3763 -51075 -85687
12390 -85687 -52543 -23070 -4797 10826 -3373 -8828 19374 13319 4983 -15716 -26507 1791
12378 1791 31422 41369 43658 59932 69907 64689 52452 101460 91220 25941 28127 40967 59995
12365 59995 72853 51476 35783 -2078 23599 27580 37389 54436 30981 1472 -39384 -38027
12353 -38027 -11628 9393 98032 159874 108947 56201 36962 -950 -12328 -19744 -72740 -34321
12341 -34321 371 17887 34366 8788 -6412 -26728 -29088 -3873 22448 58854 95332 52050
12329 52050 32759 32915 52762 32278 42108 84968 63916 101671 157264 100141 33132 4578
12317 4578 4685 7772 -3286 18612 24518 -7458 3742 1276 29352 21397 -16636 -27674 -53754
12304 -53754 -81918 -75078 -34647 5477 -31644 -50568 -39563 9575 29128 -12086 -19092 -8793
12292 -8793 9567 4619 -32949 -4064 23436 -4182 2776 16345 24521 -15768 11489 59046
12280 59046 69967 51369 25706 69734 96579 69723 47401 2560 -6889 31942 45376 67746
12268 67746 24513 -5142 9167 8181 68910 111939 95765 50387 43058 25235 17561 -14450
12256 -14450 -23643 7943 38024 15418 9394 34568 71198 52624 30448 -3389 -24552 -29910
12244 -29910 -21961 -1060 -11948 23367 23126 -4782 13150 54920 24393 8644 7809 6346 -19645
12231 -19645 -26436 -29098 -43567 -30517 34138 30122 34440 55122 24161 30624 39865 2405 -21609
12218 -21609 -22394 -35974 -45871 -35126 22537 57096 1157 -56814 -73974 -63768 -30683 -28730
12206 -28730 -29883 -15536 -24241 -15225 -21045 -50087 -17323 6227 10403 15058 17347 43659 49366
12193 49366 37701 14460 -18869 -64532 -31969 14933 -7535 -25306 -39934 -41106 -8357 12115
12181 12115 19669 29298 7345 -46045 -26107 22294 -1541 -22378 -22052 -28714 4650 5949 -29329
12168 -29329 -18546 2889 54307 117445 121481 69275 47857 74510 65788 65016 37068 37768 18808
12155 18808 42561 54299 -2163 -53674 -59797 -38562 -45451 -10852 -18145 -30278 -42148 -2601
12143 -2601 -9853 -31214 -39108 -23628 30342 49314 30596 -9901 -23172 -23147 -58771 -36197 -2106
12130 -2106 15545 16563 9174 -1341 -36604 -14947 -21508 -44956 -22522 -8302 -14944 -39852 -43572
12117 -43572 -74052 -62763 -32349 -6442 14048 13783 -40972 -28725 -10789 12608 2472 21585
12105 21585 23969 -281 10159 12160 7641 3511 41901 77153 101405 54451 36447 57655
12093 57655 56100 22365 14733 31150 86243 109602 84737 59170 33822 31579 6492 -18972
12081 -18972 -4788 23704 30482 13626 29055 38677 18767 6737 -14216 -11377 -7730 -44012
12069 -44012 -48200 -53383 -563 5831 9684 32081 4715 -20254 -6608 22434 52098 27726
12057 27726 13793 39055 52662 51369 61605 41638 32550 42621 25670 -15748 -34960 -47634
12045 -47634 -84237 -82898 -34121 29141 58124 42351 19812 15365 14391 25145 30298 -6587 -10560
12032 -10560 -6080 -3561 -63711 -145861 -78056 -5722 32898 42418 42022 21445 -17617 -14385 -5446
12019 -5446 -24341 -50166 -61339 -50319 -35627 -42680 -16639 -17895 -45506 9114 24934 -6618
12007 -6618 -16686 30214 23407 12499 26860 -4161 -7247 -18559 -4242 10078 -34513 -47252
11995 -47252 -67849 -92919 -75384 -49264 -32152 -37105 12828 26533 -32679 -8354 59065 68545
11983 68545 57700 52941 70928 19354 -12845 43933 62555 38104 -11562 -3698 -13236 8554
11971 8554 8336 5350 -19922 -19206 1569 -627 -9194 -30093 -27269 28476 14346 -16745 -25717 -43614
11957 -43614 -51904 -62732 -20586 -6767 22148 37096 26683 51361 66515 35176 32214 10785
11945 10785 42447 41422 17032 -40301 -59987 -34865 774 12340 25502 -19173 -32500 -18296
11933 -18296 -14560 -6449 -12053 6392 -5056 -3297 -22506 -71935 -38379 24883 24625 441 -20016
11920 -20016 -2636 13356 -35490 -68363 -80771 -77801 -54469 -49082 -42187 -46371 -52337 -30733 -19123
11907 -19123 -25283 -14548 4455 2069 -1042 -8416 41144 65005 67402 55650 47037 13070 -18316
11894 -18316 677 -6114 -26715 -42204 -55297 -45479 -92127 -69831 -22083 25928 87167 69628
11882 69628 29997 -15011 -49471 -43261 -40005 -76823 -38003 -14503 -13685 -3889 -28725 6706 3788
11869 3788 32232 36641 2488 -11264 4575 6846 -27671 -20322 30382 47747 37319 40444 22183
11856 22183 12921 19075 33944 55049 32103 12468 41841 62050 79050 81383 32503 -12699
11844 -12699 21777 6616 -19698 -13110 -14066 -58543 -30793 -105 19923 -12879 3625 697
11832 697 -32850 -20608 -40642 -21344 10190 6726 -8862 44212 95260 60051 12008 -985
11820 -985 -1153 -42245 -77427 -96337 -92639 -66529 -52325 -30221 -24705 37316 52954 42018 32921
11807 32921 14121 22343 36123 60945 63046 60869 39384 22122 26721 29281 21417 54360 61949
11794 61949 -3677 -45813 -36062 3296 4696 40320 58921 48807 22972 5958 34884 111562
11782 111562 95346 10633 8861 21229 -7588 -7 -12627 -10708 17564 29180 2341 -32043
11770 -32043 -41104 1874 44043 32405 21812 -21528 -24411 6620 4074 -303 -16187 28710
11758 28710 77564 19005 1266 20422 6425 -38203 -78177 -95695 -55323 -10138 -19274 15453
11746 15453 -17300 -36152 -3819 18081 -16354 -28123 -14553 10803 -2576 -6799 -19208 -13509
11734 -13509 -20279 -27599 -14723 -60375 -72993 -13731 31405 28565 -5330 -4106 -14589 4581
11722 4581 19798 17236 -5693 -21604 -4706 43843 8066 -61761 -49662 -1596 -1322 -7121 -21033
11709 -21033 21079 60813 92616 52851 11228 38568 40200 5442 25280 36137 38925 32961
11697 32961 2311 11527 -3292 -22390 16170 49020 45392 16804 17726 65926 17360 2303
11685 2303 -177 -1233 830 43820 83913 33471 27179 6643 -32086 -55489 -64846 -56243 -17549
11672 -17549 37464 31330 -443 -265 20240 6968 4397 13528 -2836 2203 31599 47260 62881
11659 62881 14426 -23492 -9425 27840 20124 29771 5627 -27649 -48528 -21196 14643 25513
11647 25513 -5569 -41916 -34712 -37871 -55741 -48952 -16482 32552 36789 12772 16517 30103 11340
11634 11340 -16318 -26618 -14129 -298 14489 5229 21067 1900 -9455 -24951 -27211 -1997
11622 -1997 -495 17563 10565 7625 -57961 -89810 -49413 -23954 -1744 -11910 -12672 -3455 18329
11609 18329 41434 2209 -36369 7119 78099 102662 112820 90231 80545 25462 15071 718
11597 718 -1523 8257 -35880 -67866 -59970 -32183 -18014 -32102 -10496 -32877 -65426 -25040 3054
11584 3054 40158 -9056 -20212 6564 18800 13586 -3939 -2768 -28961 -25404 -33098 -5143 14119
11571 14119 -12420 2796 45655 24025 18565 11570 9503 -2271 -10009 -30206 -9694 33873
11559 33873 38419 27698 27527 -7591 2600 38974 71647 44183 -86542 -89561 -37203 -13331
11547 -13331 5331 30872 49531 34754 8110 8726 3880 15788 4025 -30081 -3882 8005
11535 8005 32987 76705 92954 100233 84977 57540 50858 51465 22841 40386 34093 8415 -26687
11522 -26687 -19816 -43517 -78763 -66197 -16451 -1777 9151 -3581 -8396 34818 88129 89327
11510 89327 82586 85259 76050 39122 7251 8088 10806 5335 7341 -11863 -16215 -1680 17030
11497 17030 15657 18948 5822 17163 36120 33644 81051 74081 43863 29596 38998 32126 28793
11484 28793 5815 33818 55893 68154 51916 20737 -6390 -19685 -33286 -49522 -37642 -20753
11472 -20753 -21844 24705 28229 4871 -35980 -52987 -38709 5339 16867 16153 16610 3922 -6633
11459 -6633 12699 48212 62585 55777 42637 60245 51333 54070 33545 50181 60590 67801 88614
11446 88614 82028 95474 100131 101998 94753 65082 90781 76108 47657 51727 14988 -6472 -29320
11433 -29320 -34187 -31080 -23883 -4487 10435 22840 -1517 -23205 13092 13127 -17666 -34855 -19874
11420 -19874 30362 -3063 -30021 10724 48572 50889 62818 34223 48659 75340 55339 19830
11408 19830 38153 28056 17349 27614 103615 120681 70925 32369 4468 33143 20524 -20459
11396 -20459 -60747 -58755 -14459 -17006 -33382 -12990 -1204 -8243 -16866 -28765 -1294 6097 47868
11383 47868 12064 -13117 10545 28795 18230 2957 -13033 -18138 22902 19175 35244 38773
11371 38773 789 -22148 -20510 -29892 -20175 8123 -9355 11472 31789 7940 -35822 -39166
11359 -39166 -15870 -15814 4307 44252 48827 12925 19130 19031 -30336 -64574 -67407 -79697 -49091
11346 -49091 -8996 26132 30697 59031 49156 38480 -5247 -7905 31756 33657 45054 18574
11334 18574 -10047 -5130 17738 40955 20320 -29089 -50935 -49306 -45629 -37492 -18571 20199
11322 20199 29114 -9637 -11152 12564 36247 62369 38554 -16267 -29899 -5274 22127 42819
11310 42819 59192 49326 48788 36985 44354 62842 65212 27040 45647 77031 29866 6995 18629
11297 18629 19223 16989 44625 87374 64352 53743 5056 -1159 39447 38384 -9176 -17744 21029
11284 21029 48765 23726 41502 76605 85008 97599 70354 64429 33890 14779 17380 34453
11272 34453 43358 45132 11421 -11759 -21533 -32495 -44630 -21284 -32889 2929 60106 124522
11260 124522 123645 68995 10970 -10940 -8736 -14492 -41593 -43407 -5762 38588 36255 1839 41069
11247 41069 38601 12584 -23639 -37275 -49985 258 22945 23909 -17041 -49838 -24622 15793
11235 15793 -5119 -56057 -57380 -29447 -40508 -7389 -17776 -13000 7142 23984 49507 12497
11223 12497 -28582 -9696 39593 59300 29684 33793 14689 -1048 -35485 -30189 -4579 34788
11211 34788 94814 101735 41136 25366 -5423 -37685 5801 35252 27410 19062 -22070 -33060
11199 -33060 5473 41432 10082 7449 9018 -19999 33474 86800 111311 127624 91648 18126
11187 18126 23411 57780 88604 78624 67605 82330 102068 100974 97983 152925 179261 161790
11175 161790 139205 150088 133744 84591 44667 30118 48395 53158 52695 81968 95245 97148
11163 97148 102292 97173 81643 134442 168423 189329 163845 165980 169957 158953 193491 196615 187469
11150 187469 193296 199218 211598 247778 289653 313868 300339 276904 316776 381432 385471 425811
11138 425811 476094 465593 501815 512264 589362 652897 744780 866635 1001477 1143408 1346506
11127 1346506 1663447 1975686 2249331 2503334 2804150 3215871 3702191 4258804 4617654
11118 4617654 4576580 3690501 2268953 1319707 883442 681502 544584 414831 341665 297107
11108 297107 241161 176156 137428 123407 113704 131437 143010 135135 109939 134334 147484 124455
11096 124455 97038 119299 93409 69515 49790 37593 87296 75924 83624 100217 89822 63379
11084 63379 56344 46615 81161 103097 106214 132644 121186 103399 90641 100862 118323 164954
11072 164954 154532 119744 68282 42954 44684 76946 85525 99892 86306 84843 60771 60825 28392
11059 28392 8184 30149 64229 61158 64539 61714 44850 66377 134290 145971 136433 155425
11047 155425 144002 88550 60439 49608 64722 79296 67733 104657 132130 161514 165690 145854
11035 145854 138445 144054 131777 145330 146860 167659 180751 169487 197653 183794 202437 228332
11023 228332 287196 258974 232632 230884 221636 196236 243664 305984 292180 256584 253253 278672
11011 278672 326073 348617 378870 410316 428393 465686 485618 458008 475903 527238 528375 590712
10999 590712 678490 689320 735759 813809 885487 977237 1112721 1258777 1439773 1655692 1899590
10988 1899590 2157998 2432577 2729060 3031679 3412261 3832765 4287414 4614330 4558113 3851275
10978 3851275 2799243 1961852 1391421 1060633 838297 608301 505946 462566 425684 375218
10968 375218 341496 341654 341996 343457 336956 356534 393037 374460 369992 360343 362773 344065 338509
10955 338509 339739 348468 422216 421576 379000 370457 385766 473019 597362 705925 796704 915386
10943 915386 1056846 1207327 1373985 1501413 1661730 1859383 2078140 2266846 2376352 2257481
10933 2257481 1774296 1145250 738542 503564 366355 267313 260984 245160 267765 284069
10923 284069 159690 80952 35396 58740 85160 95611 96810 50973 74843 90992 100490 96191
10911 96191 62642 71598 68009 110049 117568 89668 91583 119737 145013 171949 217954 199761
10899 199761 174293 183689 176328 168323 164003 128387 85217 80924 73612 87665 94113 112655 115625
10886 115625 113652 97893 81789 122226 158840 159215 129895 95712 72019 50178 35926 30062
10874 30062 43163 69182 51476 57301 59873 59538 79713 71394 58868 97489 79456 77244 69652
10861 69652 89498 66367 76847 61450 16088 -25197 25943 34681 53573 60695 35226 41571
10849 41571 63750 55468 73687 83135 70961 31596 20438 28927 9481 17768 27884 47761
10837 47761 29458 22620 25932 19972 -14945 -37075 -349 -2370 39356 82736 55601 49083 88483
10824 88483 76196 47692 29512 32205 60516 97529 95306 114339 136966 113579 65384 12299
10812 12299 35505 28454 44664 57127 70356 69600 80195 90196 133753 139373 125697 132242 179684
10799 179684 230976 186512 156252 208568 233924 204074 204464 186138 192984 184698 154187 151466
10787 151466 151827 180793 178291 175115 187001 216639 237132 242816 291199 346436 390327 417936
10775 417936 413056 370879 373316 374895 305384 269481 293965 288454 185153 147529 138782 89606
10763 89606 88821 71619 77358 44937 -23345 -7997 -10791 -7765 -46078 -86738 -68788 -39545 -60360
10750 -60360 -86243 -67024 -8200 9178 18132 -19009 -14094 -18079 -36369 -26866 -13285 -37124
10738 -37124 -9431 28403 33129 62880 60441 56769 120977 150333 125810 106161 49737 -64
10726 -64 -10832 -12639 29098 71444 83256 84202 100129 89318 56607 -5986 -6602 72820 160232
10713 160232 234375 239748 234952 249464 246148 270595 317775 347322 307694 258930 244146 281140
10701 281140 327091 388989 377488 326433 287112 284389 305133 339242 359018 364902 331048 319614
10689 319614 305169 282826 290889 332095 375478 325559 312812 344333 377425 411280 424618 432903
10677 432903 427290 359598 349970 403187 420373 440466 443336 425097 366864 349154 358579 416238
10665 416238 400544 413396 450176 477044 498575 527260 546887 577242 598651 583382 658843
10654 658843 695725 656658 591333 525711 492226 445211 410653 413879 392006 342207 317025 347366
10642 347366 373251 404825 405588 426440 426858 417304 463479 523765 584417 596106 571603 534518
10630 534518 543562 580488 579018 541680 535047 606955 626964 650658 668014 699052 712060 746295
10618 746295 766665 811751 859806 943609 979897 987464 992022 971357 969486 1003168 1064056 1110013
10606 1110013 1164510 1260386 1402047 1534733 1552394 1608578 1690977 1778454 1902043 2047818
10596 2047818 2228721 2406566 2575443 2725195 2815935 2864959 2933131 3031245 3041785 3083593
10586 3083593 3198346 3420694 3682556 3882662 4055823 4290706 4620615 4947787 5322786
10577 5322786 5741802 6207283 6666494 7168927 7648617 8167507 8769058 9351787 9890771
10568 9890771 10480273 11126204 11791829 12426530 13109564 13949796 14877526 15842935 16778631
10559 16778631 17755366 18692686 19653829 20735756 21915959 23197309 24607868 26054526
10551 26054526 27562352 29233990 31060318 33082074 35188305 37299490 39367905 41295952
10543 41295952 43486927 46422075 50189837 54961588 60968558 68571846 78255253 90237408
10535 90237408 104589810 121941701 143560500 169822124 196870237 221613644 247499106
10528 247499106 281507108 326445753 378123068 419994186 433290303 384632052 260507286
10521 260507286 154099386 96688436 65793071 47725774 36802142 29727434 24803366
10514 24803366 20976687 17772172 14913398 12589635 11149438 10364277 9824637 9317188
10506 9317188 8842790 8454509 8327187 8343987 8399005 8319521 8021354 7197480 6175894 5346435
10496 5346435 4621369 3979930 3376038 2903866 2585790 2371144 2184373 2047262 1933834
10487 1933834 1900992 1955823 1927375 1798895 1645046 1537839 1403437 1266920 1133278 1051491
10477 1051491 999567 990867 973267 933918 933756 911861 951874 955983 930285 862342 772885 673569
10465 673569 662630 682432 692264 677742 642541 651369 670782 690948 694368 670454 639058 614881
10453 614881 613030 675585 732628 720072 720684 657837 636842 624245 573450 562589 605495 612267
10441 612267 621446 642384 594659 530881 466509 435981 420050 419807 473169 509975 466360 451779
10429 451779 465022 510138 577499 582805 582376 525868 524885 563099 580229 624305 675846 645997
10417 645997 638695 602987 587344 662071 744624 832061 866314 891588 964462 1014003 1045164 1102181
10405 1102181 1174100 1192978 1256265 1390933 1518055 1657947 1778629 1946510 2222973 2501519
10395 2501519 2767891 3123596 3472768 3701481 3812367 3665790 3425625 3165915 2815617
10386 2815617 2310692 1728004 1278224 960142 711381 538797 414579 358556 287226 231440
10376 231440 204935 200504 191048 183082 191454 178300 163564 162478 114202 119438 119710 104646 95785
10363 95785 127877 185039 202882 187362 187109 185699 137847 63416 74181 122574 119578 94654
10351 94654 100362 129361 171712 180600 166017 127094 98926 130896 178030 215619 251287 303571
10339 303571 361742 329638 293034 305583 357099 450369 478670 380623 307927 302125 296321 302994
10327 302994 335637 411494 448402 432025 431893 439708 421578 412327 414942 415216 458773 454937 447359
10314 447359 466955 479821 539172 585308 576324 579783 602602 643968 641925 636627 649023 665444
10302 665444 716789 773858 786787 809467 853201 876117 863070 853335 939051 1006899 1044654 1046687
10290 1046687 1101315 1156951 1199624 1257636 1343660 1441686 1519087 1630678 1757125 1888736 2017043
10279 2017043 2235326 2415274 2590665 2797424 3009395 3276866 3528580 3711381 3779223 3690155
10269 3690155 3601738 3538654 3477948 3473672 3485099 3468975 3444757 3423761 3351444 3280569 3171897
10258 3171897 3014369 2853452 2691896 2500372 2322097 2150046 1956414 1745636 1610263
10249 1610263 1483901 1360239 1212159 1108809 1026374 963968 940915 859760 785718 742632
10239 742632 699196 682211 616650 559135 474704 422927 420244 442820 483312 504773 462277 393446
10227 393446 362858 350026 339254 327552 312599 294184 274078 278674 316723 299836 251520 281772
10215 281772 247724 205317 226025 255868 274296 278773 292286 270230 244923 235800 247356 236089
10203 236089 194140 202409 189757 142998 143404 166902 136818 110022 105679 92438 129482 143698
10191 143698 141337 135233 97435 35571 61570 77051 76542 72825 79806 78171 117267 152706 134202
10178 134202 132932 129355 119353 105305 57446 55469 96075 77948 63156 62175 60183 57745 76267
10165 76267 75375 103069 104577 114794 128269 93845 78009 83773 120382 144222 112150 117393 107430
10152 107430 92583 116525 121318 119045 197384 234806 205053 203450 235519 260298 299415 301824
10140 301824 288804 272366 271208 294455 324065 319516 321586 358369 372434 381913 406008 403952
10128 403952 416247 497176 552805 537652 546646 637168 691560 724982 831289 954822 1129736
10117 1129736 1303275 1511673 1762492 1946723 2111898 2366824 2749218 3125118 3491910
10108 3491910 3764547 3774104 3322731 2788491 2426434 2190507 1939883 1690568 1431109 1197150
10098 1197150 1002619 809649 637124 514347 434904 380795 345145 292996 222608 183187
10088 183187 204937 229969 196091 168316 153153 163871 164940 164566 135508 126780 131557 122736 77429
10075 77429 75346 83431 92731 84790 83914 88967 85797 122939 154565 142912 116110 94744 113879
10062 113879 105805 44171 37856 50614 59858 108059 153089 132302 89131 80959 100305 166925
10050 166925 186984 235826 225503 235383 274314 315534 336678 315333 360380 424660 433135 398496
10038 398496 269769 145500 85158 74001 65450 74274 36941 23707 7913 -9299 16360
10027 16360 12977 -28572 -66614 -46361 -1719 -2329 31252 23623 19090 29849 22548 -13833 -17918
10014 -17918 13910 80191 61509 44517 50062 53814 66709 64398 17036 -21074 -35069 -47323
10002 -47323 -35572 -36677 -39523 2975 54915 49194 70799 79719 83681 54556 5107 -43568 -26243
9989 -26243 -15734 -36232 -62923 -74954 -22726 -19299 -52560 -51631 -10078 -16522 -24782 -83625 -76118
9976 -76118 -98956 -107184 -39479 30200 40406 21656 19256 -9649 -33767 -28106 -19110 -18514 -9668
9963 -9668 167 -11392 -32300 -50379 -40369 -44482 -9616 31446 31085 52956 64541 12844 863
9950 863 28421 23563 -4136 -5041 31905 61667 26249 4976 6346 -40106 -98935 -106708 -64929
9937 -64929 -60070 -37629 -646 -4370 -31111 -47074 -38898 -14256 28429 60370 83539 67292
9925 67292 55661 60081 29308 19580 46766 66721 45173 8226 -2536 -6830 -1028 14656 74554
9912 74554 113891 62565 38194 47447 45665 29716 14792 -13242 -53217 -42682 -49112 -88004
9900 -88004 -67841 -45296 -57488 -67192 -57961 -64847 -73057 -60378 -37227 -8536 -13774 12044 12636
9887 12636 34877 37240 -521 7764 681 52228 52662 17735 20041 12264 -25056 -49835 -22680
9874 -22680 7755 26627 17928 10808 22200 42891 -575 -35117 -7805 8886 -1509 7567
9862 7567 15239 38506 -1254 -27568 -13780 -4429 13811 -959 43282 34300 63545 61035 66943
9849 66943 90748 45302 47366 66112 53027 12106 13811 12544 -26166 -60975 -36150 7091
9837 7091 -4368 -33927 -34942 -61216 -65608 -49426 -30788 -29079 -43333 -64210 -82536 -47110 -17292
9824 -17292 22210 42683 61152 16021 -228 25442 -7624 -44148 -1296 35192 27562 -24925
9812 -24925 -6488 2514 10478 61152 55567 79102 74771 79500 80141 64976 63843 26500 10294
9799 10294 -1902 -15512 10861 36513 21059 10761 61133 53424 32730 39318 35222 67803
9787 67803 45570 28759 12793 21784 38593 33141 -43935 -24959 36587 23427 5459 33433
9775 33433 30984 8137 6675 9509 -17942 -15535 3546 42147 77358 19143 -43022 -29606 12297
9762 12297 23578 14055 1231 -10648 -44396 -30309 14259 28739 33246 10299 -2287 -30438
9750 -30438 -24876 -52266 -14116 21440 9448 2483 -5944 8051 6174 29155 99220 133855 135433
9737 135433 48298 -18490 17655 43851 30298 7555 -40789 -34448 6847 47309 62852 5867
9725 5867 10076 49869 71649 46039 19795 50486 65186 42034 11397 -5160 27080 64274
9713 64274 57966 39688 -10507 35434 54730 35289 12503 -17501 -17285 31681 19918 12215 57
9700 57 4045 42430 -7094 -62716 -76185 -89312 -65532 -34105 -8730 -33558 -326 -8920 -40146
9687 -40146 -38991 -1335 60924 66832 72776 -4547 -60247 -39375 -28439 4855 31992 84863
9675 84863 69472 69406 62803 46997 -6337 -46118 -31505 5072 2559 -52172 -68257 -11782 -45734
9662 -45734 -45796 -40671 -25105 2991 194 20169 12289 -15623 -19377 -18896 -10856 16062 70043 76099
9648 76099 72153 44295 26144 -15611 -1284 -17306 -10850 -17988 -3465 -30615 -48779 -18322
9636 -18322 -47979 -50456 -46642 -35439 3997 29712 48347 48590 55270 18491 -17152 -7580 27764
9623 27764 56927 79414 51880 29485 37070 90505 49288 -291 -19728 11508 26896 -162
9611 -162 27185 29095 31962 17590 36926 40555 37264 28067 -4189 -4321 -9686 675 -2228 -9299
9597 -9299 2339 9380 23401 901 -15167 25185 48957 69963 65292 45765 59071 53371 25159
9584 25159 -697 1517 16082 40041 42166 26494 52082 78526 70848 37261 19762 -25328
9572 -25328 -44699 -12861 -15558 -19117 13479 43115 20713 -8494 7516 35184 35217 43923 29431
9559 29431 25855 31365 48739 10930 -38770 -49039 -105 12170 -8245 -53857 -45449 -7727
9547 -7727 4816 -27833 15124 34484 40726 58814 45655 -1092 -5329 -16875 14205 55146
9535 55146 76790 77826 74438 101221 41082 -15709 -22498 7090 66215 81738 25889 8930
9523 8930 33664 50378 48789 25451 -28947 -26401 -3028 16548 6672 -13953 7312 10556 7583
9510 7583 39330 50204 43997 32958 30551 4324 -19830 -19975 -27766 -11168 15796 33589 7863
9497 7863 -5537 -1045 23027 68714 58166 26123 57702 35968 5838 39708 23925 14955
9485 14955 27142 -743 -32587 -57711 -34993 26464 51644 41205 51786 29151 61288 73261
9473 73261 66195 65914 78607 56976 71801 41863 19892 25820 34200 38283 14464 -20908 -6491
9460 -6491 20639 53795 77824 96086 99185 91559 89082 110929 63483 60105 81073 91197 72404
9447 72404 36889 91340 113522 90756 102568 75788 30913 27653 59722 52824 6926 -13793
9435 -13793 2084 18428 10406 4349 22955 21561 41780 29475 35077 77774 96517 107540 131994
9422 131994 112763 121705 145237 124339 100503 74383 72686 75682 60702 61520 69212 84778 89868
9409 89868 52456 36707 90205 78471 26029 28982 39645 55660 100047 146780 141552 143756
9397 143756 171173 188592 160555 111493 104885 145806 150773 107640 87225 81508 72629 75661 81705
9384 81705 106132 108702 129308 178681 225226 207401 156058 153095 132516 165254 149593 157187
9372 157187 130435 104541 73634 84646 105299 121264 136221 120493 92523 60964 83654 69529
9360 69529 66386 101997 176245 204012 158807 124146 108903 102304 83085 85466 107898 123514
9348 123514 122477 156654 161972 115447 137529 164945 210134 198884 199940 173463 166509 147779
9336 147779 153313 140520 124887 152261 181206 170476 189289 184972 160639 170606 139010 146846
9324 146846 184854 185470 151735 103488 116000 177644 224330 224791 204077 207555 206896 197182 177095
9311 177095 198251 238683 248439 210073 226562 197612 157880 177848 238545 272470 267889 232889
9299 232889 192025 166376 132432 118969 108592 145370 186570 232115 244491 206894 212302 210104
9287 210104 253529 265343 269848 297487 273381 254190 207182 212023 214632 217998 261530 296475
9275 296475 306185 276616 289807 301715 315456 327025 323171 336410 355829 383259 424969 449043
9263 449043 481410 476587 427421 403736 408298 459261 449420 455108 456498 460482 435071 453720 516696
9250 516696 534692 496929 483508 496357 497153 478196 560594 570219 544272 532546 532476 572023 524744
9237 524744 492184 512912 538210 571968 616940 629552 647549 671968 681332 705976 745633 768498
9225 768498 790486 790246 802182 841684 830557 840052 881038 923045 913046 898560 927982 974324
9213 974324 966059 980824 1052255 1086011 1109406 1127975 1160919 1201913 1228006 1258200 1263787 1275690
9201 1275690 1310837 1325403 1330569 1323576 1372936 1458070 1508525 1553135 1567708 1581734 1589542 1594347
9189 1594347 1639364 1658206 1676635 1728394 1779462 1868222 1922166 1961335 1961791 1977355 2021315 2079385
9177 2079385 2117400 2150841 2151448 2168263 2212652 2238456 2264716 2276970 2313107 2309889 2357102 2387189
9165 2387189 2408626 2411817 2450494 2508634 2507475 2497780 2504323 2503625 2520041 2524957 2514528 2501117 2487671
9152 2487671 2507155 2524148 2502058 2488194 2463157 2435064 2405455 2385873 2360804 2316574 2281028
9141 2281028 2279786 2293001 2223024 2194676 2151945 2137477 2101802 2044877 1999911 1963369 1934221 1928232
9129 1928232 1892887 1839901 1735736 1657117 1651752 1664053 1651689 1618771 1601392 1572358 1560731
9118 1560731 1530516 1488517 1449579 1358705 1327504 1270155 1240302 1158580 1137424 1095614 1099329 1105410
9106 1105410 1087617 1051550 1010949 979001 983224 950516 907471 907183 895811 857022 847452 835366
9094 835366 751768 720808 720271 763423 767525 713132 677294 675389 693049 675254 692321 668226
9082 668226 673408 666146 665075 610763 571344 557392 538546 507552 529281 536630 539150 533700 542488
9069 542488 556784 544497 527003 510329 483992 458275 472094 474122 460062 466159 473766 437274
9057 437274 423407 393854 406916 413614 366074 349174 376449 343374 320676 298023 267135 292256
9045 292256 341830 322195 327049 321481 296589 309375 281797 279490 300744 252452 254498 276252
9033 276252 268284 293476 258929 259362 287865 294664 237532 224236 213387 226053 202085 220537
9021 220537 263366 268822 290473 302851 296657 261782 224511 225152 224556 240227 213495 222056 201068
9008 201068 198911 218823 227492 213880 224446 227912 181047 135480 151039 185192 133873 134909
8996 134909 186138 181226 164427 181009 191639 169549 217625 258852 238008 204934 188711 167431
8984 167431 146728 125784 129339 145199 186682 173297 168982 154010 127604 132182 163020 184622
8972 184622 205422 244292 231662 214269 202295 166393 140466 127014 161619 186977 218396 216031
8960 216031 233508 218595 202103 199776 197835 215710 268889 324289 352278 361758 395578 417180
8948 417180 470533 557905 576367 596420 635450 662326 655980 577493 491720 448091 361884 268318
8936 268318 237705 238773 246355 221344 181353 176694 146253 149894 189116 162589 158631 142905 140046
8923 140046 139820 138666 125693 138823 86174 93071 92462 117470 122876 127027 130771 91110 97396 68696
8909 68696 72591 69723 66455 79541 133133 141970 126156 102638 105905 106025 108484 147631 162684
8896 162684 105201 66429 52509 74112 72629 98034 116310 123024 109991 84251 100460 92817
8884 92817 113354 98769 74599 51049 36792 26700 52855 64944 44889 68907 112100 61332
8872 61332 17501 35090 24888 22225 15558 40083 37846 37315 19093 33764 54557 61843 61190
8859 61190 66158 82073 24577 29758 4096 -5308 11491 23566 -16582 -36095 -3623 21275
8847 21275 31012 42614 71458 73204 73143 88710 113256 67855 4098 -28331 16569 42919 47012
8834 47012 74046 94522 98400 78826 26341 35804 37801 18513 -18874 -19312 -13990 19192 45428
8821 45428 11155 -7711 -3294 -34088 -9027 10077 31473 35009 35376 30822 58326 74853 63674
8808 63674 82772 63315 53651 55166 58217 33254 62929 83973 47351 -4638 7919 27233
8796 27233 29431 48153 64999 69922 53063 -1161 -264 34645 48156 47316 67897 78300 34254
8783 34254 21918 38346 16169 -19062 -8022 -3752 -5123 15537 26540 39473 24148 6962
8771 6962 -12780 -12105 36630 59561 78241 41583 64197 91322 65364 43951 33367 35204 22248
8758 22248 35422 30322 8639 -9686 -7837 4793 14722 39752 43651 92837 83765 15922 -9001
8745 -9001 -23071 43043 70189 90311 66539 81809 62365 21258 22315 22340 29603 21278 42940
8732 42940 87200 71805 94760 78024 54646 63945 55456 54998 67624 7339 -50103 -27302 -8321
8719 -8321 -12991 -8568 22099 9423 16006 43758 46333 36886 42148 23657 59767 98743 105643
8706 105643 95539 49223 43917 27442 36776 27883 21673 -3713 -14756 22121 13355 6757 -38530
8693 -38530 -6411 60529 72933 81047 64143 42971 36831 31148 10709 -14189 -22204 21807 12461
8680 12461 224 21439 34425 32361 -22006 -47708 -43152 -39037 -39856 -44052 -42750 -5493 1712
8667 1712 -52110 -15255 13401 15291 -4689 9511 24308 4152 38809 50529 38800 44018
8655 44018 64006 88843 43324 3666 -33055 -23834 20175 32510 43460 10963 406 -60661
8643 -60661 -88327 -42687 39976 68100 -9236 -33742 -11795 -38237 -83033 -54439 2547 60186
8631 60186 13327 -42548 -27647 -12798 10882 -6154 -7641 14031 56805 79547 96555 56965
8619 56965 52121 41130 25856 48051 83966 67922 48564 71514 39741 22765 44387 66866
8607 66866 59088 33455 22159 -4477 -3223 34154 66533 87892 130189 143516 143394 95412 82469
8594 82469 64329 95475 103191 76507 77056 57650 17819 -37478 -69580 -56822 -5825 27472
8582 27472 44351 82737 85087 46736 81243 38949 19672 59788 47244 38868 12543 12919 26848
8569 26848 49650 55097 115756 130860 89760 62546 21576 -6513 -18632 -12984 -40353 -18919
8557 -18919 12307 55843 105277 118651 139056 122271 125538 115849 146958 131216 109254 104819
8545 104819 139103 181911 238888 295518 330665 334788 371816 385057 399370 412300 487876 546375
8533 546375 580122 560781 495683 379137 264882 142679 93621 62612 77674 54943 28149
8522 28149 -501 27391 73440 68433 65168 45146 27501 22426 70193 59483 10936 3108 -13285
8509 -13285 -20962 -37818 -6803 20562 50733 49081 65123 53574 51525 56842 63137 43496 31698
8496 31698 40908 11116 -13115 -31582 -33252 35720 70140 60261 69084 18251 -2576 -5757 -32587
8483 -32587 8626 40535 -12080 -57541 -61382 -46497 -18324 -32929 -14127 -17191 -19128 -29608
8471 -29608 -43784 -30077 -49503 -54365 -54587 529 74602 71769 71223 42066 52343 49385 82512
8458 82512 63600 26967 7857 -88 31058 21476 -14757 -10432 21112 38695 52192 51509 63618
8445 63618 64996 40584 34352 28888 39089 22775 -11304 -15957 -11436 9241 -1760 -13917 15575
8432 15575 33720 10300 48588 43496 -1068 25021 76155 102746 45935 56087 36955 12645
8420 12645 17040 9194 -20425 -6757 34995 35448 14178 20818 3344 -17885 -6093 14415 45312
8407 45312 24821 -30162 -52772 -41887 22768 64281 19276 31316 29892 -19612 -14091 4233
8395 4233 -30587 -102211 -103613 -71242 -23055 -7241 2508 14029 -26609 -33065 3671 30630 37453
8382 37453 16445 8861 -9275 1980 30572 11038 -16609 -25197 -4286 -2112 27751 22453 -6064
8369 -6064 8304 -3727 -23673 -34152 -47694 -47241 -34516 -11410 6857 8361 -519 21013 14754
8356 14754 -62337 -107337 -105016 -66390 -31438 -11014 -5825 -28552 -7317 -19995 -3434 16849
8344 16849 53582 41677 34505 70179 123049 94197 28335 2979 -681 -3182 -5937 -3628 53662
8331 53662 59033 62117 61986 50538 42302 14963 -25467 -22031 -44544 -49034 -44616 -55193 -62930 -38563
8317 -38563 -7870 -8636 -17106 20224 11835 -24284 -51838 -52910 -29888 8839 8777 -13686 -12231 12704
8303 12704 -480 6422 26339 43639 22558 34246 65328 41190 -4555 33602 40016 8769
8291 8769 -12090 -16481 23718 33110 29266 26051 -3908 -17332 -2243 37300 42694 -26466 -65326
8278 -65326 -72642 -79917 -55913 -15568 -28024 -31866 -21747 -10462 -43237 -62934 -43106 -21576
8266 -21576 -18830 -7923 -24062 -16433 981 5484 -13243 -42504 -52094 -12402 -16941 -46509 -22574
8253 -22574 19198 21217 11524 -2015 -15073 10238 12147 -5521 -30763 -25587 -26998 -58160 -77883
8240 -77883 -68767 -72575 -54950 -23606 -31378 -11304 -13526 -10356 -10227 -13694 -41423 -57111 -79922
8227 -79922 -50041 -38249 -11051 -43532 -73091 -42424 141 41587 46102 49596 60416 63211
8215 63211 92440 60708 14882 100 -9305 -14156 -24051 -46985 -26955 4241 18918 19463 -1151
8202 -1151 43403 22968 -224 -17466 4712 2922 -761 4046 5330 -9983 -29215 -12098 17393
8189 17393 -5132 -1769 15879 -2740 -42012 -58335 -62261 -94267 -52787 -10799 -3422 -939 -21373
8176 -21373 -2947 -24081 4750 9043 -25384 7102 19246 46524 28183 10081 -35259 -10584
8164 -10584 -9756 -44459 3941 -13847 10573 52993 20954 -9451 -32769 -46409 -30254 -35532
8152 -35532 1135 16719 -17666 -40184 -26733 -10221 -6113 -36203 -43590 -46081 -8999 18026
8140 18026 25908 43859 20131 -23528 -73417 -73605 -24414 -23511 -93893 -102029 -4890 20366 -24980
8127 -24980 -70501 -41405 10129 -16113 -68169 -53951 -17773 -51071 -51269 -37612 -58586 -72497
8115 -72497 -90918 -113944 -83314 -58674 -52934 5647 29533 26315 14986 17619 37640 29049 12450
8102 12450 -37531 -40588 -23934 -20825 -37530 -24539 -22714 -69095 -61645 -53715 -25795 -4214 -17730
8089 -17730 -6953 -27341 -42107 -45053 4624 30820 51525 34447 -13143 -35335 -17039 30658
8077 30658 16014 -15200 -38103 -8451 -3829 -5880 19645 2997 13374 -4948 12308 8965
8065 8965 -24986 -38238 -22359 35578 73813 42785 48455 39175 9580 10621 -6704 -17360 -22031
8052 -22031 -61525 -87542 -42073 3036 62301 65483 76921 114338 82978 32151 6565 3018
8040 3018 -27683 -28067 -16869 49335 49948 5009 3419 1590 10916 -12538 22202 11561 6436 11759
8026 11759 52535 24651 32498 71397 64947 58893 10562 -26477 -4515 25114 61738 88176
8014 88176 99306 85044 57360 33591 41990 23216 -22112 -17978 -7004 -7512 19697 17701 -10624
8001 -10624 5385 20432 -34639 -50217 -15472 -353 30752 -25345 -72731 -31996 13859 16691
7989 16691 23967 13712 7491 -24950 -37600 786 22935 13363 -27453 -44085 -24654 3737
7977 3737 -11963 4363 68086 71128 3296 -66792 -37993 787 2772 -26774 -12431 10700
7965 10700 5150 27149 7774 13866 10874 -40858 -48053 -53837 -69137 -94489 -74259 -35909 -9929
7952 -9929 9437 -21330 -5317 -16489 -31002 -11358 20613 42256 68057 80553 39674 18154
7940 18154 56265 34757 -7608 -17737 14223 39324 25243 -852 -2384 11599 -2912 -8415
7928 -8415 -24460 -15811 27392 22505 -11541 -13890 -6283 -80535 -62407 -31706 -32558 -34472 -20776
7915 -20776 14338 71 -32255 -39513 -39515 -31197 -20635 -25088 -33379 -30138 -31855 -4680 6934 -19506
7901 -19506 -46064 -29981 -37927 -24698 46596 65836 -704 -50016 -50619 -32115 -23838 -11684 -4587
7888 -4587 6983 34028 37361 -4348 -24359 7456 8020 41576 81751 45220 -106 -25204 -15574
7875 -15574 -31474 -14825 29313 13597 -17728 -40398 -4695 10781 32987 26065 9338 14569
7863 14569 29333 14688 -20659 -36403 -28413 -17175 -18992 -26969 -24114 7856 15431 35453 21470
7850 21470 -9638 -26597 -25822 -18066 -36384 -44701 -41703 -70501 -88276 -69310 -66478 -32833 1853
7837 1853 24780 56236 52128 -30956 -63497 -44773 -53108 -34653 8795 14678 11197 -16638 -12806
7824 -12806 12593 58724 37033 30269 60254 65030 55818 60004 83675 70428 48407 52508 25349
7811 25349 8832 13142 7294 52064 37740 60275 72531 75191 78458 43755 5221 -25689 -4847
7798 -4847 48162 71030 24551 -10653 -22354 -31307 10135 -8076 -59514 -41896 -13740 9527
7786 9527 27663 26034 59455 72548 28620 5533 44767 46060 -1562 -31489 -68814 -78252 -49594
7773 -49594 16206 33269 3525 -43724 -14566 -4067 -41078 -56061 -45860 -15986 19709 1513
7761 1513 6757 -13705 -59557 -47446 1608 -3710 6047 -15647 6401 41004 -1766 -45629 -78804
7748 -78804 -38193 -10191 -16740 -35604 -45537 -25245 23323 10140 908 -14981 -18657 5438 12481
7735 12481 -68112 -86954 -28703 -1418 -22616 5322 28800 40379 -6080 -40012 -29583 -17547
7723 -17547 1027 -12361 -25337 12189 29449 6528 11216 22666 -3809 -27677 -10881 -41894
7711 -41894 -2273 -10230 -40517 -47013 -37650 -32284 -36682 -27304 -11500 -2599 -3338 -3027 9711 55979
7697 55979 107178 117998 95345 28047 -11442 -22073 -1824 44207 19309 -23480 -41725 -96045
7685 -96045 -105243 -41092 -507 16251 31743 41318 17055 423 -24475 -9017 19626 32493
7673 32493 -12041 -71004 -87163 -55195 8026 -9289 -35872 -17023 -20036 -32556 -64974 -50750
7661 -50750 6329 17180 14187 -9416 -23945 -27100 -3202 -25526 -2370 13679 15888 43281
7649 43281 23676 18830 19503 33360 11532 -6659 -48805 -81094 -42626 -7997 33309 20563
7637 20563 -18434 -42784 -66730 -94970 -95431 -44730 25863 42095 18382 -4935 -46017 -87360
7625 -87360 -72442 -45368 -10723 12092 43473 6145 -29276 -48583 -54784 -43410 -29190 -17168
7613 -17168 -44837 -83077 -82636 -83107 -85998 -105936 -84850 -66562 -60754 -16118 -13250 -34252 -28330
7600 -28330 9568 976 -12984 42401 93488 46264 30486 30772 12216 18065 37367 62083 43888
7587 43888 56590 61153 50159 -3788 -62211 -77619 -90499 -56656 -60081 -77754 -55229 -24625
7575 -24625 -59087 -63495 -29550 -19188 -9088 -11764 -51277 -67589 -22630 21397 40509 35593
7563 35593 10595 -883 21817 24022 -7192 6992 14811 20045 20825 37035 46914 33598 14021
7550 14021 5998 23635 19701 29524 55195 40507 -10796 -28815 -39172 -32210 46225 65170 25857
7537 25857 -17466 -17168 -6216 -18220 -42641 -47078 -72496 -37550 5902 -22213 -37230 -25706
7525 -25706 21193 20518 -13281 -3048 -671 -5716 2282 -15438 -27795 4476 21056 32447 22388
7512 22388 -19482 -41537 -28434 1448 7819 -16920 -58858 -57912 -42941 -57309 -32595 -20106
7500 -20106 19778 68209 59428 -1886 -27362 -54777 -54303 -58694 -39098 -46168 -51041 -64472 -93106
7487 -93106 -59186 -53041 -32475 -24495 -44356 -22761 -56855 -23216 2782 -10446 -8039 -10566 -13336
7474 -13336 -27866 -37011 -59672 -76331 -63830 -32629 -35118 -29350 -34435 -25280 -22809 -22918 -12961 -3818
7460 -3818 -919 4509 5196 25176 18778 11914 6932 -3515 18203 15009 12869 -22309 -63577 -36382
7446 -36382 -44434 -5289 -44196 -76715 -77908 -44231 -17560 -16630 -32137 -20758 34547 55902 46281
7433 46281 3338 -40404 -56006 -52020 -64592 -85545 -78399 -15761 -4002 -15228 -65272 -3167
7421 -3167 27735 18620 -35316 -28796 -33185 -23396 -12519 -12612 -45674 -47116 1518 29209 30132 43356
7407 43356 71133 82662 29258 -8286 524 16685 -37151 -71490 -75725 -58426 -64189 -81977
7395 -81977 -67481 -31831 -6631 15793 -3263 -27761 -45844 -53917 -12951 3348 36453 28577
7383 28577 -16492 -13985 6975 -24080 -24828 50731 47468 -17724 -74440 -59755 -22116 -25189 -40197
7370 -40197 -38262 -33674 -29149 -23345 -24981 -20873 724 7040 24561 24236 34613 65435 6825 -54505
7356 -54505 -45951 -32829 -63135 -58996 -10754 11145 -7882 -5370 -25922 -13697 17745 10015 -6804
7343 -6804 -24975 3318 -44291 -38695 4768 1379 -44506 -60145 -62071 -80146 -93743 -87685 -46846
7330 -46846 -66721 -104122 -75610 -33859 -52909 -83774 -114011 -101604 -56986 -26512 -19199 -34564
7318 -34564 -5728 26811 4318 4471 -2170 -39262 -44604 -32869 -31082 -57034 -96711 -85220 -46252
7305 -46252 -60622 -34444 -23112 -32330 -49840 -63573 -63852 -45143 11073 12981 -45981 -47764 -20980
7292 -20980 -31956 -54045 -75615 -60948 -53690 -46114 -71877 -29046 4508 5330 -10952 -350 -857
7279 -857 -22406 -41313 -45186 -32145 -12169 -6574 -7248 -13691 29 -14223 -13955 3945 -31585 -62525
7265 -62525 -84388 -75928 -75971 -61834 -16872 1977 -25468 -3860 19878 40383 15010 -30387 -71288
7252 -71288 -66275 -55253 -29060 -36719 -44848 -25543 -16763 22879 34044 40803 33520 -869 8389
7239 8389 -4722 -19538 -33460 -49501 -44395 -40435 -75071 -59592 -64331 -36832 17292 50251 11673
7226 11673 -21482 -10411 -20994 -25446 -20589 11911 41566 43711 31872 29826 27174 40118 30608
7213 30608 -19927 -34443 -16082 -5152 -43629 -58707 -44936 -22171 5870 32484 14405 -14271
7201 -14271 12409 21775 5222 -5674 -21598 -3395 16826 -9494 -24667 -32551 -7377 5187
7189 5187 -8586 1906 10238 2462 -732 2885 57250 60614 37002 -991 -30767 3628 14739
7176 14739 -15577 -24301 -32069 -37988 -15977 -20609 -46207 -65101 -70672 -56210 -43515 -41271 -10273
7163 -10273 -53421 -91820 -75204 -53146 -66144 -79216 -61531 -40868 -34503 -46753 -56157 -101880
7151 -101880 -75183 -48819 -35114 -11111 -3291 4471 -5414 -43715 -70066 -47819 -44472 -50973 -45165
7138 -45165 -35520 -28980 10630 28588 20002 29282 48564 35188 27833 26245 4717 11716 74
7125 74 3303 -10083 -35839 -28268 -15458 -19385 -28503 -23368 7850 33581 47900 73755 71234 47987
7111 47987 23753 23026 22050 40744 42554 45147 5356 -35911 -71710 -84554 -60436 -20642 32018
7098 32018 17312 -10965 -3710 5079 -2908 56170 7354 -78589 -96738 -91786 -85774 -62346 -37842
7085 -37842 -23865 -21766 -46060 -35994 16342 10198 5703 -12944 -55839 -43848 -9742 7837
7073 7837 5304 43223 68276 78298 57097 4753 -41127 -64889 -88072 -53885 -37108 -2383
7061 -2383 -13846 -18005 -30394 -21515 -26607 -35738 -18186 -8459 7652 34175 55389 16796 -10023
7048 -10023 -1256 -80704 -129586 -127879 -115251 -81464 -86840 -44908 -43274 -34078 -22443 -59989 -54605
7035 -54605 -3801 -17789 -57538 -70806 -86298 -73368 -51742 -19983 -42598 -25891 -6527 -11008
7023 -11008 21088 14781 -10319 -15994 -46150 -36109 -1024 622 -40091 -20675 64800 99130
7011 99130 95760 68779 49517 -24517 -7214 3028 14234 17279 3987 -11011 7531 -11971
6999 -11971 -61946 -61652 -46065 -12356 -5369 -44808 -77028 -71899 -25842 -13157 -19309 -31574 -18372
6986 -18372 -1897 5985 -2820 11087 -20309 -36548 -13163 213 6024 16281 83000 106070
6974 106070 47557 39835 30 -13327 8779 2005 -52873 -49565 -20446 -18118 -46997 -47448 -50203
6961 -50203 -18977 -9077 -9821 10464 -9711 -24525 -27532 -39605 -36484 11855 30721 20400 11491
6948 11491 19747 -14162 -43418 -82150 -87379 -88037 -32381 -6200 -65331 -86363 -22756 5038 -1289
6935 -1289 -618 -12404 12305 35278 -14659 -12606 6775 15483 39847 19367 -27795 -37613 -45643
6922 -45643 -27421 739 17241 61581 72110 12356 29319 15690 1289 -11175 -58706 -40532
6910 -40532 -20922 -34768 9745 43472 20219 37286 40964 -9909 -52205 -34342 -23923 4494
6898 4494 -63942 -80605 -36702 4142 6888 -21171 -23251 22582 25712 12588 -23385 -12586 -7482
6885 -7482 -30583 -6236 4234 -3587 -798 -24317 -11668 9595 -4307 -16247 -2916 12943
6873 12943 53572 30170 -23531 5345 -8285 -47235 -76396 -81930 -79695 -38237 -25135 4245
6861 4245 24164 29603 19015 -18334 -36210 -26396 -2181 507 -14486 -17189 -9382 -8428 -16412 -44828
6847 -44828 -26601 -27505 -29943 -30812 -61584 -32520 1312 31419 3136 -48347 -78730 -34035 -17208
6834 -17208 -49125 -82836 -74082 -29691 20785 15696 7088 15846 5206 16231 9197 27033 24419
6821 24419 -10861 -60254 -55073 -6005 37621 100477 82558 28601 -7549 -39438 -35158 -19909
6809 -19909 -56755 -45280 -42869 -2236 -8450 -57807 -57540 -48775 -17549 17501 5031 -51755 -23760
6796 -23760 -5206 12072 -10788 -8450 -40098 -5689 13681 -2232 -11754 -12623 7555 -768 1055
6783 1055 24738 -9495 -65416 -73406 -51567 -49676 3459 42647 79682 48422 -23707 -31239 35911
6770 35911 17168 -12757 -17930 9218 44362 32703 31765 23986 13395 14929 21822 45808 11207
6757 11207 -17641 12699 14333 1 -2983 -7611 -47784 -51355 -41939 -39778 -35362 -14116 -32162
6744 -32162 -81850 -76030 -19349 7773 43761 63609 74004 13876 -22394 -13559 19203 23831
6732 23831 1996 -16953 40042 72954 111345 114243 65735 6692 4634 -21968 -48722 -33956
6720 -33956 -3080 -15027 -40260 -14884 -6701 -20630 -25343 -57492 -57030 -32139 -2342 5179 25585
6707 25585 57571 79528 48589 28182 12439 -1653 -18360 22329 31053 3298 16929 69302
6695 69302 75436 47611 38032 -10291 -5856 25288 81601 76405 39281 20543 4847 20668 34145
6682 34145 38076 29958 -20638 -21048 -9118 3714 7298 14374 18272 -14584 -48222 -62088 -11217
6669 -11217 -8450 -40911 -25363 -4834 -4376 23007 -20814 -23347 -2209 8774 3540 22843 16869
6656 16869 8593 10381 -5587 -18228 5387 34534 49041 60764 27905 -10161 7228 -5451
6644 -5451 -24848 11778 -26512 -46294 -23541 -27249 -26284 12111 -17511 -47346 -4827 33233 29301
6631 29301 34279 53799 45571 61824 25557 765 -31772 -54045 -75705 -54819 -32449 254
6619 254 13481 23934 -37380 -71781 -63390 -45604 -60622 -63385 -42789 37501 65708 72957 51414
6606 51414 46924 41319 28858 18919 -9419 -27961 -39751 -52524 -56634 -60126 -34343 -7732 -11029
6593 -11029 -13102 -19520 -9113 9802 42176 81576 68877 35278 -9067 -31302 -62743 -74010
6581 -74010 -36848 -64083 -88111 -46133 22433 65532 49263 -10693 -48522 -52761 -38218 -36906
6569 -36906 -54619 -49961 -2808 24660 29153 46847 27261 42562 55156 38378 9104 -6476
6557 -6476 8512 36473 12973 35285 38723 33295 28662 14951 -24266 -28505 -14086 -17469 -35249
6544 -35249 -25829 -21086 -2844 24905 -6870 -10919 129 15379 46656 36347 8571 -12139
6532 -12139 -46698 -72015 -41008 -6615 57959 74287 32975 -6658 -1015 2063 25330 15727
6520 15727 16649 55768 37942 33057 20647 -11454 -32025 21463 19466 -50879 -71839 -95190 -52782
6507 -52782 -70806 -29609 8487 46050 31066 31133 10992 36906 7316 9888 13346 -41034 -37686
6494 -37686 -9634 1270 -16836 -56271 -74857 -47431 -41135 -45544 -40628 -62147 -118570 -106717
6482 -106717 -96479 -75631 -49964 -17247 467 -16908 -31319 -43082 -55841 -46266 -35071 -25123
6470 -25123 -29263 -21530 -30325 -23686 -20682 -52890 -21319 2669 3222 -18991 -10721 -54081 -80315
6457 -80315 -70265 -19541 23952 7183 -7042 19037 25871 13164 -4531 -12947 31257 44007
6445 44007 9352 18656 -47673 -69843 -42319 -16710 -16513 -28535 19225 42187 65920 65235 28504
6432 28504 9745 1500 -8824 -39984 -41585 -17215 14115 31903 25181 -1023 -2626 -17406 -58985
6419 -58985 -73075 -53429 -48041 -57031 -16065 22270 24173 -34345 -75745 -61980 -41248 -40525 -50795
6406 -50795 -85250 -46024 -60778 -58975 -44072 -12074 24480 41823 23771 -5826 -21154 3696
6394 3696 25223 1759 -36548 -17280 -398 -3489 -27099 -74984 -108746 -56218 2779 7865
6382 7865 6494 -19778 8723 36793 31864 -28935 -22615 19066 53827 76099 54802 28730 -4209
6369 -4209 -43919 -58495 -37054 -24130 -24832 -12441 -12689 -25551 654 -11594 -40537 -32950 -31227
6356 -31227 -26756 25465 76544 42301 34714 40507 78957 57156 2830 -6601 -6023 25358 18926
6343 18926 -22315 10635 414 -2276 -8140 -39443 -83917 -39941 4270 27634 -12823 -33932
6331 -33932 -22737 -25766 -18953 -12726 -25169 -59372 -44439 -24103 -44162 -38919 -6724 19105 -20566
6318 -20566 -79925 -88118 -42618 -52407 -75813 -70169 -50417 -41379 -69847 -93921 -119877 -98973 -50322
6305 -50322 14653 26353 -22614 -2774 3272 -4576 20265 36495 5834 -6822 -4813 6784
6293 6784 34269 25568 36427 44102 23814 32239 48027 20522 20454 -8707 -17246 -27243 -35689 -38146
6279 -38146 -32351 -55849 -81519 -48522 -55292 -56602 -53376 -513 32488 -9198 -13589 16748 63228
6266 63228 66499 51156 43079 64697 31517 -33191 -27491 -58866 -73735 -73225 -56814 -24984 -13981
6253 -13981 -19794 -4059 -12708 12571 18834 17971 25009 46214 40687 71512 77855 85731 94340 41651
6239 41651 -6630 -24447 -14644 7919 15206 -27356 -29725 16517 69756 58844 4434 6719 -20405
6226 -20405 -15884 34115 52037 74522 56179 4248 -43447 -55278 -24819 26893 71562 49697
6214 49697 -43409 -27879 -20268 -30699 2412 4008 -31876 -35438 -68459 -124187 -120674 -79644 -61278
6201 -61278 -72666 -51255 -34251 -62415 -64750 -56968 -42019 10490 31225 -497 -47651 -68384
6189 -68384 -42607 -29896 -8506 -4969 -21218 -27830 -27474 -32814 -18337 -40941 -4607 11367 10900
6176 10900 17984 7776 13764 45658 38980 -13586 -3525 20210 46538 69373 38019 31286 7176
6163 7176 2603 -54650 -98382 -124667 -97396 -57413 -66774 -77001 -92057 -31916 -6799 -5185 -12033
6150 -12033 -36028 -34224 -25112 -20900 -23713 13705 38916 29892 -19067 -51561 -50778 -54174 -41266
6137 -41266 -34987 -42190 -39799 -10892 29507 28363 -5151 -9002 17397 24323 35159 -9545 -51406
6124 -51406 -71473 -25085 -13948 -34029 -21677 -9871 -14651 -19792 -13161 28891 45089 9502
6112 9502 13130 48059 40012 31652 23574 -8760 -47290 -65827 -70752 -46175 -7490 24106 17778
6099 17778 -6789 -11471 6494 -19700 512 17784 -2274 -18608 -23865 -20850 -42329 -61784
6087 -61784 -45783 -25041 -16173 14773 18770 5771 13831 33340 29642 50022 58647 36885 25390
6074 25390 -38769 -40201 24348 28802 -10492 -22856 -23827 -24304 -16480 5982 15285 -13050 -9237 -46349
6060 -46349 -51994 -62227 -26778 14835 34198 39932 14112 -39273 -63310 -31726 55518 84579
6048 84579 101226 43189 38396 27015 3142 17251 20376 1367 -5532 9845 1673 -12870 -34369
6035 -34369 -78947 -95187 -102563 -100029 -63954 398 16361 5808 3217 17464 -4874 13131
6023 13131 -11145 -6079 -5602 -32111 -32260 -46507 -40748 -36276 -23416 -2718 29471 34970 16090
6010 16090 13307 4646 -22481 -33942 -49044 -30003 7165 9117 19202 61533 54550 -5609 -39137
5997 -39137 -30761 -17488 -16225 4320 17877 -21536 -48646 -22439 17773 14240 -7321 7659
5985 7659 16597 -15355 -30780 -11506 5532 16284 57498 45075 82426 60607 60586 66131 54701
5972 54701 27203 10888 49304 73431 72591 57176 44787 21622 17997 -9058 -59815 -62790 -54329
5959 -54329 -30381 -30876 -45042 -34231 13588 4918 -784 12931 17814 20204 19974 3307 -27789
5946 -27789 -24169 12509 40642 7028 -272 9655 11690 18367 35298 12157 27550 39101 88538
5933 88538 80230 34743 188 11953 -15818 -4268 20049 23708 17004 9298 -2938 -8136 28467
5920 28467 60815 74276 53982 43397 26402 -242 -724 -21024 24927 70208 67322 38885
5908 38885 16413 863 15173 21676 -209 30647 11975 27034 15840 34241 53215 39630
5896 39630 40887 10254 44120 24111 35392 48251 45144 14775 -14928 -16219 2750 31364
5884 31364 25379 -6012 12139 43439 71907 61721 17955 -5649 -28103 9671 40751 53082
5872 53082 1365 -7630 -82254 -80138 -48771 -78699 -74179 -22647 -34844 6472 21876 -5210
5860 -5210 -9428 -10733 2442 -4612 -2473 -22463 -56779 -42120 3712 13118 -16115 -22085 -16241
5847 -16241 -31575 -11163 29826 30546 -9256 -49506 -63266 -17377 32141 31541 27222 6295 -27623
5834 -27623 4347 19891 12964 -21436 -18968 -24812 6940 18012 32021 61009 64871 49377 16574
5821 16574 26366 39559 -395 7630 -2229 31337 48626 611 -14768 14527 55745 85171
5809 85171 137121 121804 50416 -16977 -67006 -65635 -66398 -47670 -41303 -35629 -35601 -10923 2409
5796 2409 -1523 -24626 -16512 -44823 -37439 -24106 -15782 -25790 -19337 -5098 11054 7621 -10512
5783 -10512 -7733 52705 41039 731 5388 46928 15190 21551 -636 -4286 -3011 935 -13155
5770 -13155 3137 -20024 -24377 -15427 -43145 -52344 -83000 -78800 -53330 -65534 -50378 12391 25866
5757 25866 -1840 -26167 14790 9864 32835 50836 16523 17931 4367 -18921 -2275 -21505
5745 -21505 -32620 -65835 -74758 -42990 -29785 -7768 -6659 -59486 -57866 -41740 -26233 -33258 -25071
5732 -25071 -27421 -22444 -5012 1186 12454 30275 24733 21647 58286 59681 -2725 -44421 3603
5719 3603 -5469 4538 -12610 -78962 -65842 -9298 -18974 13014 50431 49601 24572 7768 -8262
5706 -8262 -47890 -49790 -49963 -34026 -27238 -14014 -51997 -18386 24781 54866 13605 -2500 -20149
5693 -20149 -20864 -34115 10028 1357 -26446 -9060 -6338 -1217 33078 9392 -4058 27027 64708
5680 64708 66363 55442 31046 -721 18242 12318 1455 -10685 -7241 -29464 -64771 -58223 -56857
5667 -56857 -86223 -87032 -53374 -12468 22421 7661 -3477 -17515 -14045 8644 4319 14597 68340
5654 68340 78957 50575 14883 -160 18564 21287 -14716 -52556 -37928 -16050 -37637 2842
5642 2842 30465 16828 21709 33976 -23353 -1644 21884 15302 6153 13580 17169 1179 -15749
5629 -15749 -761 26687 41539 18536 -12002 -62552 -54268 -33165 11277 18258 -25024 -33104
5617 -33104 -3625 32222 56100 21314 19488 15695 -8272 17912 -3358 -9946 -41750 -62920
5605 -62920 -21990 37596 61469 37949 -11313 -42159 -28914 -47638 -45302 12381 39925 24682
5593 24682 5355 1443 20854 34926 49977 33404 2164 -5572 -16505 -33080 -33806 -45184 -45030
5580 -45030 -24791 -36002 -79622 -88077 -59427 -28076 -19578 -16868 9348 -13341 -24219 -25119 14994
5567 14994 3657 -11008 -14821 -17298 -15176 6613 -5368 -9873 -12016 -74750 -55092 -51611 -26513
5554 -26513 -21410 -24761 -6936 13981 -7774 -34091 -46260 -18394 -3869 20178 -8621 -25069
5542 -25069 -33177 -46637 -49633 -17415 -19549 -1056 -4885 -40534 -61968 -39417 -10332 16039 -14447
5529 -14447 -19979 -30978 -26761 26489 34369 18284 17229 72320 60288 30994 24999 32154 100545
5516 100545 81244 66859 36568 5259 -21158 -29627 -25281 10837 15578 -3716 -12546 -11917 8396
5503 8396 23303 -14183 -18890 -35004 -35160 -47377 1950 -732 -54843 -63741 -6454 -50488 -65968
5490 -65968 -236 4954 -7652 24882 77711 58440 23480 -15532 -4014 21378 25548 6156
5478 6156 -12059 1140 16630 55966 61338 63400 80023 32413 -32055 -36083 -27602 -28358 -2848
5465 -2848 36579 20871 8199 49269 26989 21020 24096 9652 6934 -197 -51340 -58845 -38648
5452 -38648 22719 51349 5046 -21644 -17771 -21210 -40479 -84550 -67274 -40282 -43395 -49032 -92043
5439 -92043 -46733 -10931 1669 -12685 -7547 -26543 -31898 -57964 -35299 -31476 -47835 -62251
5427 -62251 -44597 -72914 -57063 -2455 57120 133802 134833 62757 8225 30810 71534 32638
5415 32638 -4232 -30739 -36901 -42025 -35727 -37053 -37736 26361 80534 86058 34210 6186 29461
5402 29461 55931 69918 64773 54550 49384 51240 28924 -14629 -28715 -10471 21760 37265
5390 37265 15334 44458 73361 45104 -14610 -28033 -13506 11153 44853 1450 -20772 -2239
5378 -2239 6952 18910 28119 49439 37169 34389 20627 8929 1014 -5626 -21284 -19596 -23632
5365 -23632 -2372 21903 33916 -10621 -20026 -16528 -62067 -33370 -23154 -6368 -5128 -18217
5353 -18217 -26105 -41740 -25362 -15123 -35409 -46200 -22203 -9658 28933 74038 30254 9441
5341 9441 -16497 -33704 -26595 -13635 -3391 14415 7960 -6791 -30660 -40417 5668 42032 76156
5328 76156 110949 96230 64754 30611 15219 11375 4402 46057 28814 -14755 -27563 -45213
5316 -45213 -9325 -40037 -5486 38700 20312 -2863 4633 23900 26114 9282 -366 2843 9709
5303 9709 3041 -13990 3412 3105 5900 42285 58725 16415 -2608 12915 35359 11515 16785
5290 16785 32786 27050 8835 -5128 16313 26480 -23931 -19436 38719 31500 26142 13500 -14813
5277 -14813 -29317 -17031 3732 29907 76624 84969 63831 39293 19696 19287 31839 12312
5265 12312 -14657 1556 20602 35573 11820 -17538 -56478 -3372 15226 -8994 -2551 -13320
5253 -13320 -28364 -26264 2310 2157 -12548 -7550 -7792 -11092 -20459 9300 4434 -19535 -45418 -55856
5239 -55856 -60561 -42477 -51648 -48545 -51245 -62855 -24264 33451 42850 67023 35825 -15165 27266
5226 27266 84614 16538 -34415 -40711 5920 14421 -36591 -24682 -9963 -33615 -34714 -246
5214 -246 -19301 -38111 -43170 -27523 -9626 -46302 -43694 -47188 -55194 -55915 -68891 -73014 -53209 -23339
5200 -23339 53 19264 4426 -11205 -21589 -47035 -38962 -12815 -8987 -9613 10374 41865 30345
5187 30345 54773 82648 75794 39350 64370 49501 31799 27667 -30593 -34695 -48294 -41613 -37413
5174 -37413 -80830 -93105 -84656 -89065 -75682 -49663 -897 -11213 -36510 5827 18525 -25408
5162 -25408 -43690 -29231 -13273 -25521 -4578 19521 27670 6094 -3668 -16198 10731 -5740
5150 -5740 -19871 -25398 15574 46249 -8170 10006 25725 6411 9502 22305 -18073 -496
5138 -496 47540 86390 128469 87453 2963 9680 5073 -8331 -15896 -18214 -1576 55720 30225
5125 30225 13285 2360 -7047 8710 3142 -6958 12329 37109 41502 23634 25152 29015 38146
5112 38146 48981 47491 68594 59244 28641 8980 -13077 -23886 24406 4395 -37864 -40155
5100 -40155 -38429 -26666 -12038 -17710 -29702 -15993 -32681 -62020 -41186 -14693 -11747 -92
5088 -92 -33467 -73918 -105142 -102639 -98386 -33142 -10854 -44213 -21172 40148 72295 45945 5123
5075 5123 -34964 -7358 16965 -18798 -121 3597 -29849 -29075 5734 22102 27199 5887 3317
5062 3317 -12482 -44743 -49987 -48775 -25360 -11858 -936 19710 10319 15557 33270 15157 -4393
5049 -4393 -35123 -30011 12904 38862 17600 6242 15799 21968 15583 46811 9304 -9684 11706
5036 11706 45744 56851 60178 16575 -19113 -11339 16774 1622 -7715 -35108 -29043 -16493 17371
5023 17371 63461 80333 36128 25237 51560 13953 -28562 862 39658 23233 -10491 -16722
5011 -16722 -6781 -23295 -21792 -4704 -11406 -25303 30693 90895 99283 89522 40852 -38211 -5482
4998 -5482 24802 19520 18355 29081 18351 -8233 -32528 -55841 -82189 -37529 -25437 -14133
4986 -14133 16425 4315 14121 -5635 -26298 -8197 8086 12621 16435 -71359 -109773 -138728
4974 -138728 -175156 -123690 -66979 -67715 -67286 -70034 -62385 -38859 -11633 15293 19260 9187 43238
4961 43238 40937 59522 40696 7382 19639 16741 28809 4116 -42289 -56249 -31740 -21854
4949 -21854 -28252 -25072 -21807 -41170 -56273 -23087 15046 24513 16847 -9495 -19182 8556 36428
4936 36428 37725 63536 77067 27150 20513 30860 21787 30665 63961 104754 62549 12280 3527
4923 3527 59499 52805 33978 40545 740 -20586 1957 11808 -16971 -16511 -17076 -25120 -3758 14341
4909 14341 -125 -1294 16362 30723 79129 69373 72640 53395 41336 48606 65491 44802 18729
4896 18729 -48858 -78762 -55375 -14981 -1877 45312 50127 25540 37937 26180 20471 20387 -11107
4883 -11107 14370 16527 -15968 -26010 589 11106 4782 -24358 -35366 -38297 -12851 22676
4871 22676 26060 17201 20682 36977 55582 71529 77471 77891 36373 29905 50184 62433 77581
4858 77581 40813 -6320 27418 44030 15673 -1687 -48132 -56794 -87045 -90987 -80924 -17822
4846 -17822 10498 -10646 -27542 -6732 2897 -18000 -66608 -123605 -121769 -116610 -80762 -74224 -49479
4833 -49479 -70511 -77325 -67016 -70687 -80072 -77977 -67989 -54359 -27796 8589 43745 30683 -2483
4820 -2483 -7056 -45866 -92951 -54409 1011 21721 39202 55563 68585 49698 43100 20922
4808 20922 -10402 -44486 -17692 -4457 -4867 33091 25477 -34034 -58234 -14520 -385 7631 18220
4795 18220 17897 16105 -846 -8865 -23788 -32258 -11729 33125 31524 18161 39089 18757 -3508
4782 -3508 -11393 -70085 -108148 -91879 -91667 -119424 -82481 -43252 -34448 -39323 -49049 -83740 -57814
4769 -57814 -27792 -5357 10159 57863 54261 29599 1705 -19993 -24290 5152 -15717 -63568
4757 -63568 -50624 -1739 5685 8908 3248 -19059 -34719 9842 44252 3197 -23617 -26255 22757
4744 22757 24921 44573 59380 53582 78126 64930 26177 -2 -2105 5205 39209 54199 24637
4731 24637 18242 18101 -11560 -4850 -4822 -13298 -13613 -5899 40188 48679 6193 8660 30539 18443
4717 18443 4725 52992 65056 39130 -16199 -12743 12236 46533 75001 40763 20610 21723
4705 21723 23624 -24361 -70162 -88630 -40303 -22007 -51823 -26453 17736 57030 87587 115033
4693 115033 79676 51314 24239 -32013 -53165 -7616 -3190 6391 7690 -19295 31260 46889
4681 46889 25658 42739 62371 47212 31062 40244 36494 9834 4140 49286 28678 18458
4669 18458 12765 -12828 -55845 -17072 12027 14132 21497 7814 -14462 1573 6642 -12024 -19852
4656 -19852 -12589 17415 40279 38047 32965 20564 1036 26625 61896 38653 20631 11739 25140
4643 25140 17701 12095 -5782 4692 -25330 -19202 -1698 10029 15209 -8857 -36706 -17654 19546
4630 19546 -13384 -65603 -81848 -60510 -23097 29126 19587 14549 7820 12116 33953 47315 22645
4617 22645 60338 74650 80173 100167 82946 36031 49274 48620 8549 11716 -26446 -20313 5355
4604 5355 25925 -4331 -2846 5416 5538 1810 17612 6624 -1928 -32713 -33517 -42145 -60548 -83687
4590 -83687 -88879 -52334 -7824 30236 38508 38890 37882 16956 400 8712 37433 56101 48429
4577 48429 14460 -43913 -29553 -56445 -67298 -62852 -45208 -20619 9177 2137 6602 6257 -20154
4564 -20154 -26493 -12183 1444 21211 9144 23992 39436 43398 32894 -796 -22728 -118
4552 -118 8642 8844 26871 50269 35834 22749 37390 16810 8542 29802 27537 46860 41880
4539 41880 13818 45920 30639 29519 33779 -26829 -60758 -70703 -70655 -57294 -45138 -4167 -10178
4526 -10178 -10378 78800 103028 57253 37842 56981 67238 16479 20332 2991 -14585 -10284 29026
4513 29026 40499 6105 3740 45559 35801 19219 3121 -164 -30183 12753 37475 26606
4501 26606 16802 27675 49248 50776 36672 6810 -32518 -53326 -56018 -77764 -51881 -49814 -28696
4488 -28696 18045 31734 43412 44941 28201 26206 6528 16771 35045 44613 44906 10741 -4410
4475 -4410 -2463 -21856 -50256 -58975 -42544 -41113 -3253 43053 35206 8367 -26128 -61722 -57014
4462 -57014 -38000 -27251 -9919 -17035 23221 -6203 -6297 28175 48523 45891 69901 69496 46714
4449 46714 -9107 -36977 -46301 -14864 13894 -8455 -21793 -18571 -33178 -54474 -66127 -58734
4437 -58734 -44843 -24488 -52160 -25185 -3585 -1176 -28762 -64405 -46017 -4534 13388 22187
4425 22187 -17769 -45395 -69694 -19589 28603 30447 18874 -5563 -21833 -4747 -5975 -13174
4413 -13174 -28575 18201 16604 17709 15745 4760 -13238 -17619 -43641 -41483 -37331 -22690 15630
4400 15630 -12524 -13231 -9568 -12846 -30501 -38838 -67864 -63937 -63582 -70248 -15142 92 -9744 -11798
4386 -11798 -33655 -17053 -10352 31358 45072 36936 -8546 -58370 -78515 -87338 -42830 -4725
4374 -4725 2966 -41846 -28360 -558 19952 22905 30400 -8965 -20017 7012 151 439 29216
4361 29216 40857 42990 56107 15314 -23058 -14222 -30146 -52763 -12951 -17469 699 50689
4349 50689 71463 59971 88076 71910 47345 39260 34882 -2225 -45218 -75482 -78730 -43199
4337 -43199 -24704 7117 11985 30511 7555 -10673 17003 3514 -12327 8304 -16384 -17523
4325 -17523 51567 6057 -57539 -42786 -49330 -82719 -76212 -59411 -35802 19023 53857 101342
4313 101342 99021 51629 17923 -35956 -30445 -11458 -24908 -24563 1520 99 29690 53443 45486
4300 45486 31202 3105 -28269 -35092 -22677 6589 44548 63858 64563 63440 74827 78035 95119
4287 95119 97793 50070 7084 -21665 -11256 14018 42263 773 -11715 -11471 -15136 -2264 31187
4274 31187 35181 76063 60802 29269 47777 22332 41465 46377 -31799 -78239 -59088 -22771
4262 -22771 -28789 -105463 -111966 -57203 -26461 -53480 -43210 -45358 -11512 38505 54858 49315 24662
4249 24662 16854 19518 3894 21355 44857 54176 -8986 -49067 -58477 -20145 -10498 -15786 4895
4236 4895 53495 33544 -12032 -4500 26071 56056 36258 16372 36382 48765 62713 9476
4224 9476 11083 -8 -17098 -6517 -10652 -71516 -45082 -2687 -3315 -7310 -2361 -21776 -39411
4211 -39411 -24706 -6377 -2192 3148 6582 17043 5941 -43329 -31108 9884 35581 28678 11957
4198 11957 -6270 -15679 1100 2407 -40561 -30191 -47212 -49201 -7463 40566 42383 -11263 -25626
4185 -25626 4721 -11673 -58457 -63217 -40240 -12692 -27099 -18888 -21545 -10118 -23719 -47133
4173 -47133 -57788 -38472 -23783 -12067 1459 -1177 -9042 36865 27086 -25722 -49571 -69787
4161 -69787 -97586 -110082 -108509 -80386 -53187 -19537 -900 11476 -34221 -69284 -61894 -45
4149 -45 8494 -29436 -42521 -19573 -5548 8749 -6737 -25201 -23707 -20456 -6443 -30812 -17101
4136 -17101 22317 45561 40705 27589 14517 2587 -2186 9587 -8556 -29765 9160 33491
4124 33491 19509 18149 -27677 -31162 -42778 -53689 -29402 -45163 -21883 6255 -12817 -52939
4112 -52939 -40467 -8696 -1950 13267 -5441 -5564 14612 18562 6460 31863 43374 18937 -1492
4099 -1492 4140 -36954 -67518 -42113 -32874 -22330 13994 -19260 -26171 -84842 -64599 -51524 -63850
4086 -63850 -65490 -32512 -22782 -40286 9253 35620 38151 10462 13521 26422 24703 18335 -17087
4073 -17087 -6292 20284 21449 -6425 -25065 -20110 -9080 23318 49339 75267 70314 30636
4061 30636 -21158 -23529 -21680 -3693 30161 63185 59629 26295 15708 -27709 -58170 -30387
4049 -30387 -28622 -65055 -82084 -60351 -24708 4123 17207 2757 -5566 -6538 6266 -1397 28887
4036 28887 41796 47356 45446 -3711 -29613 -8783 21743 22658 -3477 -2493 -17433 -18290 -16959 -5752
4022 -5752 -24122 -39999 -24674 -778 -28230 -58863 -82462 -64393 6752 65386 58588 49038
4010 49038 20097 -3525 -6244 15324 43291 58202 10175 19819 22287 2791 34251 103517
3998 103517 75242 7670 -31667 -19044 -12871 9352 44926 51102 50527 41604 57614 53362 16920
3985 16920 -13143 -18073 14201 28300 846 -19117 -6450 -12634 -32770 -51423 -40160 -19825
3973 -19825 -20743 1343 10719 -13749 -80256 -66200 -11999 8112 -10382 -10018 -4805 -12042 -8666
3960 -8666 34626 33171 -25546 -48732 -48814 -44322 -69665 -63363 -30820 -34243 -4905 -8541 -41559 -26811
3946 -26811 -9094 -6418 -25661 -51123 -55207 -44342 -59150 -16644 10277 19313 17106 26725 46575
3933 46575 85132 62269 3821 21740 14776 23136 16422 32323 32137 8853 -5983 -3927 37912
3920 37912 43643 46788 22211 -39009 -65305 -82501 -87914 -110128 -104353 -67268 -40441 -12115 26995
3907 26995 46041 25255 58060 18644 7734 -32785 -6612 40531 75052 72732 45006 790
3895 790 1994 3790 -36224 -61539 -22724 -5406 5132 8671 2988 20926 23037 4349 660
3882 660 25685 969 -21809 -18128 -28919 -9984 -8201 7811 1688 5558 -21509 -28410 -60154
3869 -60154 -17931 50477 29142 -2854 7645 4000 37107 37275 58519 95602 130612 111779
3857 111779 74344 26875 -11418 4535 2252 13652 4616 -17887 -14435 36059 40418 2226
3845 2226 2345 -9226 -25496 4713 11499 31221 33093 38938 43214 10610 2903 -14903 -33865
3832 -33865 -44429 -55614 -40934 -9999 32972 56246 48860 46575 34280 3700 -15019 -19936
3820 -19936 -34382 10348 24988 52855 59318 20180 -36397 -18839 38847 45773 55258 79728
3808 79728 106367 80910 74599 17159 -22382 -35376 -11321 -14596 12655 -2112 -33850 -28762
3796 -28762 -13403 -8174 24936 8537 -34626 -42443 -45871 -69398 -32150 -27830 -25590 -17605 -5845
3783 -5845 -33999 -54090 -60164 -83675 -53963 -50546 -30488 -16908 -11198 -18207 12384 38562 29186
3770 29186 11171 7487 32556 15439 8897 24564 30463 26506 39829 18870 -10281 -19518 2223
3757 2223 18372 15960 27245 40329 73191 58860 13720 16490 36962 5051 -33820 -79593
3745 -79593 -114834 -55288 -8451 47968 45147 42245 24910 11483 42352 32777 -8403 -2912 -14294
3732 -14294 -41394 -36249 -20398 -9065 -5611 32771 17859 22358 -4827 -21265 8790 27632
3720 27632 19688 27977 36619 33043 8040 68052 68081 60863 92305 59513 13655 22836 22899 38967
3706 38967 35457 3251 26812 10662 -40331 -18506 239 -14378 -26923 -27738 -2204 24970
3694 24970 5782 25102 14512 1011 11459 23966 17586 -1093 -25063 -33962 -14219 -271
3682 -271 -6502 -16856 -57650 -26660 1781 -6662 -17753 -49713 -91888 -34411 -3296 -14126 -1059
3669 -1059 5634 -9401 2414 -3956 -26050 -54464 -48331 -32459 -45332 -34379 -24778 -2982 29740
3656 29740 11259 -11471 7560 45425 41639 74223 76758 60970 81689 40395 -8102 11438
3644 11438 27476 39358 54004 87230 71656 23731 -2758 -49543 -41635 -47863 -40302 -11485
3632 -11485 -36988 -42311 -8566 26267 42030 25953 24028 46242 7854 14896 -2578 14069
3620 14069 34526 12363 25247 20737 29506 -8080 -3323 -29218 18419 49852 40763 7785 -28810
3607 -28810 7695 3924 -47404 -56914 8749 28813 -16290 -50708 -14562 7566 -1826 4584 15308
3594 15308 31585 6640 9563 -19943 -48000 -26346 -8814 -5257 -21362 12788 -14098 17235
3582 17235 45713 13015 9351 -14298 -22347 15318 21812 -7848 -18260 -38892 -640 47711
3570 47711 74147 82087 52698 -4513 -20431 -20217 27946 49559 35284 20663 14834 -47746 -63855
3557 -63855 -49593 4068 33181 1859 386 28068 19504 -51567 -54303 -26595 -64249 -75188
3545 -75188 -40754 -7380 -57725 -96156 -41440 -29347 25995 46530 9503 -16642 -6171 27882
3533 27882 7054 -7993 3596 35505 19378 35388 29620 5057 28028 5086 -12123 29869
3521 29869 44784 12433 -3020 16544 50830 2002 11997 -4981 -3883 23287 69674 76549
3509 76549 57714 27683 47717 81696 79043 63285 29438 21568 2223 28325 25280 -36207
3497 -36207 -57002 -46544 -10376 4031 28855 47802 25705 22316 47485 75061 51743 29677
3485 29677 53303 95362 86314 77082 83193 53644 58458 73735 42604 54560 45947 51782 56193
3472 56193 77366 60906 47208 20354 -1566 -29434 -44684 -47932 -46981 -36409 16302 10841 30355
3459 30355 64643 80890 51073 58750 71537 43901 33778 4345 12157 16917 -8315 -21211
3447 -21211 -44 34902 53702 50825 18285 -23432 -16642 16136 -8816 -32532 -31470 -33227 -6680
3434 -6680 13189 12005 8282 950 9581 52755 52553 -346 -413 34730 2411 -4844 -18301 -2340
3420 -2340 25454 41985 29532 -14156 -16861 -7905 9996 -24515 -37448 -1979 19586 28230 34374
3407 34374 8874 29023 71447 86544 56199 25372 799 17459 -10392 -11723 19352 27884
3395 27884 51973 46540 -38437 -44143 -6820 13653 14277 11784 3278 -5505 -701 -9414 -32831 -7940
3381 -7940 10799 12888 26685 40159 -3162 15016 17206 -19013 -11838 -21817 -27655 -3628 -3637 -28145
3367 -28145 -22261 -27668 -24279 -59343 -61148 -35663 1844 -36890 -59299 -85713 -49015 -11926 19271
3354 19271 -3232 -36198 -76752 -61391 -22972 -18971 -12202 -16938 -37300 -34422 -34991 -23246 4444
3341 4444 9932 13230 -20504 -50978 -29592 -21610 -9112 2984 13801 4837 -4768 -8556 34312
3328 34312 6373 -18814 942 10088 17406 30952 16389 -9038 8990 -8849 -39255 -13561
3316 -13561 -16704 5566 18853 -22862 -61172 -15985 6953 3981 35931 24977 -8782 4879
3304 4879 19716 30362 -8883 -73386 -82198 -71448 -91501 -91343 -56211 -24441 -643 -17689 -18181
3291 -18181 -12233 -23672 -17732 -24999 -17151 20899 54890 48070 49649 63037 79858 48766 27598
3278 27598 46275 68757 46778 26471 45124 24285 5852 -39600 -43769 -38597 -39697 -41412 -61520
3265 -61520 -67948 -31669 2387 26106 14213 -9323 -27326 -22453 -44011 -13539 32290 40915
3253 40915 -7463 3386 -26594 -32753 -36665 -18782 13097 6208 -7373 -4950 -29436 -63369 -17448
3240 -17448 -37628 -23858 -45737 -89738 -53981 -47606 -29049 -12276 -7358 31056 8976 5456
3228 5456 -41752 -29780 -14027 -29529 -6107 -8162 -38485 -42313 42092 65143 42149 6133
3216 6133 58153 94342 74976 26675 -772 4167 -8121 -15375 -67456 -95673 -68295 -17691
3204 -17691 33667 36298 59081 60586 47847 17563 36137 20789 -8470 -17455 -30317 -53128
3192 -53128 -17780 6768 32214 30773 18386 43332 45153 83444 83024 46683 59342 45329 47427
3179 47427 54346 37944 9686 23868 4782 -21086 -5343 -8011 -1866 46355 56259 28152 -6389
3166 -6389 39886 50098 22231 24423 28984 3109 -17173 -4774 21286 7344 20367 14646 36484
3153 36484 20312 4219 -45978 -55139 -14679 -10525 -56130 -48711 -40398 -21244 -21327 -31008 -60196
3140 -60196 -56824 -26843 -31447 -59590 -70194 -36672 -5678 -19558 35090 69710 68824 32948 -6374
3127 -6374 -30996 -17882 -47237 -67588 -83818 -66194 -22636 -4305 39223 62636 55813 67293
3115 67293 88648 106612 84478 42489 14480 16027 65019 47897 48642 45137 47244 13284 -35556
3102 -35556 -46167 -53001 -45213 -18602 -9495 -9408 6051 15298 15993 26325 29624 13701 31068 32159
3088 32159 44135 40009 64480 78784 47442 43759 10596 1476 46379 -12224 -57385 -46628
3076 -46628 26569 91749 71856 45214 22341 71714 75378 35859 20559 -7937 -33156 -60615
3064 -60615 -51197 -14262 27875 86361 115901 114267 94801 93533 42729 12236 14865 17295 11559
3051 11559 69 -8634 2129 -13688 -15253 12831 5341 -7567 -3269 -12098 -12434 -24237 -30001
3038 -30001 -77751 -89197 -70089 -20077 22682 49660 46827 45462 47585 42287 8346 -6172 -24671
3025 -24671 -31565 -50781 -54036 -54340 -59714 -45045 -47795 -18097 -28006 -19938 50743 51136 -631 40870
3011 40870 60735 37692 -6676 -28637 10738 37010 13532 40167 24793 -16719 -55483 -55854
2999 -55854 -49362 -63100 -31258 35293 36766 38282 55671 63677 23472 -4531 -5173 -32192 -52562
2986 -52562 -64261 -38407 -44247 -37122 -40667 -80900 -102572 -66942 -41231 -54599 -61578 -37864 25801
2973 25801 -5475 -54359 -27211 17096 -17338 -41053 -27136 -56452 -54517 -26219 -24005 -51831
2961 -51831 -65723 -74455 -69818 -6506 18147 -30102 -28973 -4609 -24405 -27860 -14130 -13896 -9465
2948 -9465 -25516 -9013 -27755 -34967 -29187 10648 2584 16831 -17513 20291 53991 59270 51428
2935 51428 58417 14274 -26778 -28787 3254 9547 -23006 -48312 -61738 -56677 -71698 -35112 -14044
2922 -14044 -4012 -8582 -2247 26994 28387 -4020 -18547 -49024 -79966 -60309 -75210 -62065
2910 -62065 -45457 -25693 -52181 -53860 -4170 7172 -11444 36410 25270 -16297 -31328 -25002
2898 -25002 -25015 -40598 -476 58056 34883 -707 37750 58193 30068 6646 -22375 -57208
2886 -57208 -80378 -59490 -27429 -44763 -39966 16521 53256 30142 -1615 -26310 -40365 5634
2874 5634 40961 33114 3165 -25782 -35407 -43911 -27666 -12998 5995 1050 1602 22892 82110
2861 82110 67874 58161 83618 51722 14209 12541 15831 -2047 -51508 -77283 -91450 -14276
2849 -14276 22779 14985 1363 -3606 -35886 -30854 7712 5063 18814 60296 43599 27957 3060
2836 3060 -2408 -10371 15515 34776 15276 -57965 -91588 -36839 -21053 335 528 -2411 5164
2823 5164 27914 19162 31383 24630 43096 27500 -10407 -9612 18173 41176 69261 35679 -1943
2810 -1943 -23818 -26420 -30412 12747 45780 39195 31047 62960 95875 54369 3055 -20585 -1929
2797 -1929 12987 24104 -2053 -15901 -32054 -44102 -55005 -66507 -28850 -3832 16907 76937
2785 76937 85196 36606 -273 83 2688 -3352 13722 13288 5347 33582 26826 -2034 24139 50570
2771 50570 34100 -7906 7990 36383 17706 53634 70110 9125 -36040 -24412 -35119 -18818
2759 -18818 15568 69287 50221 19757 -17835 -8220 4510 5854 -1387 -28358 -36815 -46000 -74481
2746 -74481 -87364 -59354 13907 9425 2508 4613 -4598 -21610 -27537 -15592 -41690 -65 14557
2733 14557 42733 40935 28306 57835 5955 -4131 27741 22590 21527 11355 -10377 -47151
2721 -47151 -57949 -75759 -77995 -62653 -59140 -62658 -27470 -25118 -10228 -44414 -43621 -15045 -55178
2708 -55178 -57532 2026 -5925 -34870 -47200 -65173 -51554 -71203 -58507 -22249 -192 9908
2696 9908 -2784 6769 -10521 10776 22014 10653 -19700 -23720 -42875 -59415 -44056 -34253 -31143
2683 -31143 -16488 -37682 -54441 -59448 -29726 2960 35995 60421 58664 54613 61174 46845 40885
2670 40885 31268 34560 62619 83409 65399 60525 40286 63749 84772 50027 15538 18408 23782
2657 23782 -153 -9592 -39766 -43761 -65460 -65773 -101434 -58072 -50151 -46165 -27598 11268 5062
2644 5062 4035 -26821 -68704 -80267 -55985 -26977 -6543 12182 -11896 -33942 -53953 -32739
2632 -32739 -44736 -53278 -34832 -11223 -23024 -24233 15907 -7389 -14463 -8742 -27219 -28469 -26200
2619 -26200 -33475 -10724 4957 17486 -2409 -2831 45037 18793 6381 11005 2850 28219 37930
2606 37930 33937 20819 -544 -39261 -54450 -11920 1369 -11719 -21031 -51342 -30999 -19720
2594 -19720 -19497 -18726 -32866 -61769 3619 15105 33809 28791 14138 -21269 -8712 29861 62585
2581 62585 49567 27760 50855 116273 115430 75398 22799 3948 -23360 -2022 22353 28749
2569 28749 17484 -35776 -70330 -78445 -48707 -11314 -10004 30936 54763 51456 71118 116382
2557 116382 94952 59752 21385 -24299 -35885 -78185 -67253 -57946 -29436 27027 41109 9244
2545 9244 19866 49833 16739 -38700 -43819 -27681 -2647 45813 46923 13684 37328 7792
2533 7792 55850 32455 3809 -2143 -16760 40726 79565 81941 55647 54756 74133 96096 49815
2520 49815 12843 -13719 -49133 -31475 -46607 -44384 -32898 -20928 16022 9881 277 -15597
2508 -15597 158 -29013 -45508 -12058 -26620 -58851 -48596 -51620 -21241 6389 47795 53731
2496 53731 16639 -22719 -18811 -14871 -2995 40377 61048 91021 97468 79122 54723 62448 47145
2483 47145 56267 70037 25849 -14420 -25954 -7790 2772 -8052 -32178 -44945 -98944 -103282
2471 -103282 -113070 -99471 -53524 -47195 -34425 3648 33005 36225 25682 44500 55001 -5474
2459 -5474 2035 31787 57573 64100 43653 5711 -19751 7103 34015 1325 -24947 6001
2447 6001 36187 33868 -5235 -42977 -47274 -4912 5884 -32941 -34210 6576 48208 61092 16166
2434 16166 29645 -21171 -57863 9557 79735 97771 82926 52735 1479 -10155 15288 15793
2422 15793 2092 26266 39706 -21466 -30607 -3602 -25562 -26755 -15064 -6952 -13484 -17790 -27899
2409 -27899 -3575 -10043 -15547 -20821 37908 30698 17789 14263 8857 40965 97617 83112 35322
2396 35322 27201 25865 21131 -5873 -8755 766 -9066 9737 51897 85728 87240 70362 22961
2383 22961 -21597 -37459 2055 19874 11330 38452 2216 -14974 -33562 -42215 -4442 28752
2371 28752 39248 24427 -39761 -258 4978 -6737 -4932 -10319 -19605 -53585 -66338 -48688 -36013
2358 -36013 -35908 -44856 -20353 20293 9603 14593 26586 7715 -5712 -8336 -1961 14192 43468
2345 43468 70555 66475 44187 70239 81508 62693 24404 25186 35502 5361 -34108 -16931
2333 -16931 -51059 -30143 -13372 -18863 -40277 -63941 -76703 -91475 -82104 -89916 -66479 -5152
2321 -5152 29346 19898 25855 -13763 -4182 -9660 1647 14828 -13810 -57803 -28735 4657 32214
2308 32214 41363 38261 28554 2705 -16822 -57378 -52907 -42815 -37724 -25843 514 991 -32371
2295 -32371 -48501 -36941 -35108 -48224 -40359 -42574 -24398 -44689 -61095 -43586 -28234 -23437 -14581
2282 -14581 -18296 -18570 -43441 -69768 -41988 -27437 -5971 -2036 11173 -7272 -24287 -54332 -83307
2269 -83307 -55312 -29457 -72136 -74086 -75876 -61914 -24580 -1831 7586 -8189 -5208 -23201 -13642
2256 -13642 -9251 -67325 -58296 -10291 -529 34698 -2075 -21158 -35364 -39912 -20947 -8594 25409
2243 25409 57887 34589 11911 27481 38046 61468 62497 61972 27754 7714 25803 32739 23712
2230 23712 37252 63556 48472 33712 40340 81393 99494 71313 24442 29511 4140 1681
2218 1681 3422 -8798 4320 26198 57652 40671 44778 36359 43503 27313 -5849 -24855 13295
2205 13295 22315 29664 2433 5283 15468 -16852 -20957 -17107 -19304 29916 16475 -32350 -9068
2192 -9068 34397 60153 46044 23977 -8899 -26141 -13526 -20074 -47403 -50306 -55780 -25077 6400
2179 6400 262 -16126 -29436 15932 24999 -27683 -22371 -22868 -27848 -21314 -22045 -32038 -33439 -4451
2165 -4451 -6204 2275 14425 7631 2794 17697 -2624 -16861 -57770 -43869 -12175 21508 6926
2152 6926 -26225 -673 54814 66298 60979 33696 21554 11018 70541 96032 82035 68480
2140 68480 34673 -1977 -27718 28746 55700 40359 8836 4769 3707 23103 88881 53291
2128 53291 42563 53674 49607 76897 83001 8138 -5978 -4954 -896 4283 16678 -20565 -900
2115 -900 26014 27071 6597 29077 43610 64387 39279 6239 -15147 22792 -8808 -32590
2103 -32590 -14693 37984 21377 -30143 -57599 -45991 -26456 -57093 -90108 -47367 -7686 33199
2091 33199 33455 39148 69975 82333 71235 44323 29341 18066 47496 77338 60262 18982
2079 18982 9360 30295 32187 5833 -7422 -21698 3467 37570 23708 18870 33156 1074
2067 1074 -26226 -51735 9469 86385 116106 97976 36142 -4621 -7641 -21736 18864 55119
2055 55119 53786 49076 -14964 -73033 -63891 -53740 -53347 -39768 -70755 -53626 -76622 -52859 -6929
2042 -6929 1430 -4956 -501 -38975 -40002 -6572 -3460 12736 24171 11866 57190 62649 18244
2029 18244 22156 -11389 -16186 19936 20732 26428 5070 -19167 11695 -4203 -48926 -7136 6557
2016 6557 -17219 -22037 -18274 14979 -9504 -44721 -65231 -87975 -89983 -77256 -38910 -20210 -13036
2003 -13036 -1997 -14347 19836 46284 42954 18869 -8144 -10919 -13573 -17327 -19772 5087 48578
1990 48578 14201 -54724 -83203 -73360 -65296 -83775 -111328 -71967 -14093 -2162 6917 -26874
1978 -26874 -45794 -37962 -43361 -26085 8896 -24604 -15177 -22640 -31673 641 3284 27103 38959
1965 38959 10621 2604 -14235 -14250 17166 31373 9446 2046 -12596 -159 -17930 -52655 -58259
1952 -58259 -48477 -15952 -5744 -17338 -26009 -49672 -89821 -75075 -25484 -32323 -8503 -22664
1940 -22664 -13837 3671 -2841 45367 62700 44582 49715 69229 67446 17679 -12083 -3270 -10911
1927 -10911 -16307 -26135 7967 23744 38972 49364 3664 -33514 -11503 10496 38011 50974
1915 50974 47208 18826 17933 16123 22185 -5478 3161 25599 68201 66115 1231 -8185 6461
1902 6461 -687 16289 15629 13230 3079 26782 59068 93988 66819 13969 -29236 -56090 -48579
1889 -48579 -82028 -75882 -72230 -69235 -75672 -81689 -113278 -69639 -33178 -27162 -12835 -6866 -25491
1876 -25491 -57466 -67721 -46662 -48812 -87093 -117286 -91917 -37692 -52085 -40739 9261 -15148
1864 -15148 -15232 13416 45226 10907 -11777 41449 39890 26921 61498 39167 -3220 47288 67073
1851 67073 64209 38180 4860 -39276 -60918 -50479 -45917 -44960 -41406 -36300 -6134 11896 14434
1838 14434 -54871 -72152 -44587 -35567 -32550 -24549 13914 4747 43105 58020 61976 54798 32158
1825 32158 43839 36563 -2017 29175 25603 18188 -9977 861 -9764 1604 -3947 -15584 -23314
1812 -23314 -29117 -7497 -843 -12472 15443 12380 28140 11356 14309 29554 12877 -25848 -6159
1799 -6159 32779 20538 27852 1620 -54220 -52928 -20511 29298 33078 -2513 20532 36213 -24640
1786 -24640 -49923 -36984 -40609 -52323 -61332 -26521 -5699 -22823 -13948 19910 42720 48874 34442
1773 34442 77935 58535 48594 30568 8031 15861 17504 47360 37371 18732 10633 51725 59544
1760 59544 95457 96822 53789 9613 -22474 1283 20803 34472 27950 28792 43665 35420 5695
1747 5695 -31923 -34069 -17176 -42604 -17187 25984 19769 3551 -25555 -46289 -2711 -5210 -11735
1734 -11735 39671 74365 52487 28684 18561 7473 26518 -5202 11869 35659 65983 65304
1722 65304 18741 -19917 9151 11136 5254 36977 42497 23358 -12040 -39928 -46038 -34380 -11015
1709 -11015 -34553 -18864 5062 -11146 -12227 -39501 -54440 -37074 -26682 -13209 -7959 8696
1697 8696 15183 26813 42318 64272 64852 26274 -48734 -67070 -27403 -9931 22848 13630 5505
1684 5505 -4262 -110 -9929 -254 -21633 -63918 -19046 -3016 43435 75195 51624 38789 62688
1671 62688 70116 54775 8962 -15435 -58670 -81196 -63442 -38860 -33036 -3308 -25949 -66411
1659 -66411 -34004 -16381 8616 8710 9926 12594 -34298 17900 17720 -8067 10781 2117 13344
1646 13344 -16658 -55517 -33870 22206 76374 42077 -6990 -50266 -48640 -18690 -25193 -37322
1634 -37322 -25413 5968 4813 -10202 887 24089 2429 -19577 -39942 589 38087 39448
1622 39448 49384 52193 55851 39562 9120 -53056 -116 24836 -12285 -45761 -9993 14502
1610 14502 -14244 -2563 -6390 4299 18632 12828 11241 -4267 6909 -142 -1149 18680 32706
1597 32706 -19563 -23787 -383 -8955 -32337 -37053 -57164 -41824 -5743 20397 41494 36712 37707
1584 37707 47956 40791 32382 -4987 11803 53813 51696 21386 12282 28019 35340 78540 58076
1571 58076 24312 80372 92405 100513 136711 144015 101344 57315 11080 -15031 12967 32478
1559 32478 15992 3166 63957 73428 20142 -26482 -415 83 40579 34679 18003 33942 37157
1546 37157 22915 -1564 18700 19850 -7848 -37397 2374 -6078 -40247 -70641 -40871 -68835
1534 -68835 -56617 7563 26026 14043 -34215 -53046 -45477 -28502 8952 32123 17917 22208
1522 22208 13240 41420 56019 63555 38464 25971 34106 8489 7149 22082 11928 603 -26818
1509 -26818 -22936 -14276 -4382 37853 55535 9018 24114 2365 -21178 -42340 -41721 -23678 -4544
1496 -4544 34301 30393 1955 -21216 -30171 -63680 -40498 15590 31465 -569 18192 31655
1484 31655 31234 45584 61361 78713 55403 19977 45616 34369 3395 -1321 2036 8255 37640
1471 37640 54124 34002 -7687 -82936 -48829 -26512 -28293 -19001 -18640 -42853 -49700 -297 -1624
1458 -1624 19036 3558 -6517 -40702 -33973 -37625 -30063 -48766 -72888 -56108 -25468 -14061 18634
1445 18634 28843 1558 -36808 -42473 -25731 -31335 -30536 -49952 -54900 -41978 -25889 -2315 -5942
1432 -5942 -25428 -10257 -14041 -63308 -46235 -50279 -73105 -69382 -45414 -16944 -684 7241 -17650
1419 -17650 21050 50899 65960 37384 -2401 16765 8563 33442 56289 54389 93898 105417
1407 105417 49354 27708 -647 -9580 25738 38353 21764 2553 14085 12186 54911 77632
1395 77632 64521 -1872 -20116 18934 14008 -33492 -38554 -43969 -38991 -6137 -5174 14071 25151
1382 25151 2353 -24050 -37028 -47621 -26405 3611 2811 9011 7727 -737 -12858 -66013 -82721
1369 -82721 -33868 3441 -27618 -23189 6223 1867 10715 35519 63334 43016 31983 26603 -39139
1356 -39139 -45617 -36272 -17364 -8204 3120 18235 15297 25316 6319 12535 34714 65109 55072
1343 55072 45135 18994 -6089 -859 -6264 18634 36679 27773 -4484 -24505 -70650 -85727 -51873
1330 -51873 -49235 -22014 -1618 890 -3279 -22659 -11103 39441 34139 7869 20020 36016 -23001
1317 -23001 -121476 -100151 -21529 7358 22739 21593 95173 81177 77931 75035 28173 -23338
1305 -23338 -18220 5363 -32869 -10342 19650 19880 45725 5432 -23930 -23241 -17062 -1626 18882
1292 18882 49006 -17112 -57325 -56843 -45027 -24639 -17121 8942 -23836 -40547 -8627 -38904
1280 -38904 -5019 16415 9699 35216 52271 61908 64436 21850 2559 -5495 19675 27274 38592
1267 38592 37150 33237 29435 30209 32481 60433 42269 11770 10691 29505 42964 53478 27369
1254 27369 29529 -34587 -42855 -23030 -59665 -54417 -26634 -16337 17919 48845 26859 16202
1242 16202 -60701 -82156 -39880 -29286 -27884 -22181 -12674 -19537 -52602 -56500 -23203 30483 34679
1229 34679 42128 44081 31002 -21711 -33022 -11690 -449 -2329 -19462 -24555 -19667 27731 17029
1216 17029 -11156 4105 15077 -9862 -34174 -47011 -45305 -35206 1927 22249 -3570 -35062
1204 -35062 -12870 20975 -1299 -34538 -29004 -33247 20788 55004 49894 4224 32932 49398
1192 49398 51637 21245 3397 -19251 -35674 -12525 -15846 -11097 -32383 -18283 9292 -14470
1180 -14470 580 18602 17605 33374 -10570 -51785 8801 34848 29868 35185 -31285 -38562 -9744
1167 -9744 47368 69884 74887 53212 45963 84809 114401 83380 59645 55792 31567 -643 -35937
1154 -35937 -51063 -40476 13829 46847 43021 12023 19730 32725 -24005 -47057 -12809 -27949
1142 -27949 -52167 -26029 35020 22136 -7588 -8667 -49178 -28427 -39371 -62989 -59609 -71632
1130 -71632 -35210 -41737 -53561 -36089 -14251 -22348 -14498 5527 -4505 1016 9195 -1666 421
1117 421 14385 -7267 7982 753 -44833 -63310 -54085 -47797 -28987 -30060 -38722 -1836 -29819
1104 -29819 -69101 -63816 -38152 -5067 27493 29122 14022 11206 21894 -4086 -30015 -2604
1092 -2604 29404 -16965 14394 80326 88997 81520 91129 82235 86362 75227 54802 45770 -14525
1079 -14525 1902 1546 -9827 -25136 -28437 6618 11381 -33977 -47324 -24260 -13488 1786 -16953
1066 -16953 -39207 -26847 -26407 -24763 -17411 -35317 -1093 -3894 -25571 -13875 45760 27222 13500
1053 13500 16762 24602 26837 41219 23156 -6525 29823 41707 22856 -16927 4659 1530 8760
1040 8760 8650 52697 71600 61242 60836 59388 62354 60621 43740 -34453 -75313 -66534 -32551 -44739
1026 -44739 -12869 6799 906 21338 48967 57570 4759 -4210 27081 44877 12942 -27605
1014 -27605 -54202 -26238 7384 -27214 -66561 -89037 -109246 -57377 -20831 -411 -10633 -45590
1002 -45590 -49566 -30324 -31490 10347 32053 16163 -21949 -41275 -43686 -26734 415 39158
990 39158 6546 -69797 -61837 -16555 26125 61411 43155 6985 -2361 -34007 -74080 -58892
978 -58892 33692 68273 29773 25267 34163 17083 -9251 31942 40986 29191 24722 -10668 -65838
965 -65838 -98579 -97222 -26805 9101 -513 -25902 -47484 8597 35495 -17844 3769 19835
953 19835 50030 4851 -10531 -25416 -45129 -61150 -52144 11073 17480 16632 23975 10363 -3614
940 -3614 -2719 -4283 -9993 -25699 -35687 6186 43160 32209 20573 10393 -56208 -77167 -68444
927 -68444 -21998 634 -6667 -11056 -28814 -36215 -24250 10338 32196 15525 -23567 -59989 -66459
914 -66459 -85627 -29077 9550 7332 1193 -26628 -22898 -10332 15219 11484 -3889 3891 18396
901 18396 6188 22207 33243 31894 53379 55897 11167 -15365 -26409 8201 61305 99618
889 99618 101016 52359 22781 62661 77368 46101 -16217 -65356 -30875 -32016 -15811 -15427 -3819
876 -3819 -32052 -27961 100 43204 6352 -32704 8674 12497 62836 84729 83200 29845 24173
863 24173 30824 18381 30156 50701 55271 2076 -5765 6349 -25581 -30982 -21062 -625 3084
850 3084 -20669 -54965 -72105 -37105 2635 20674 37299 50850 17898 -36618 -59832 -30676
838 -30676 9077 8757 23608 105074 118128 97760 110443 100297 90069 81117 41835 49221 59847
825 59847 35038 46767 67010 80421 65007 32253 -13824 22458 90090 56474 46262 13158
813 13158 -23537 -18556 -12760 -42764 -38956 14010 8724 -30261 -38150 -5790 11538 -16112 -71079
800 -71079 -79874 -61752 -23186 9511 49734 61808 42186 19230 9737 2267 22449 14785 -6814
787 -6814 1069 10083 47847 64618 66749 82963 94623 65254 -24834 -25267 -12123 -19551 -2975
774 -2975 -4616 -30204 -51101 -62261 -76428 -58694 -43768 -40772 -30153 -51726 -53976 -59252 -42343
761 -42343 -51828 -62132 -74384 -77715 -45292 -5063 1719 11881 26117 20536 18541 6164 14073
748 14073 42287 11485 -10746 -2561 19579 15839 -4756 -13482 2722 -18017 -52094 -18224 -6041
735 -6041 -2007 7080 26517 39238 31884 -13524 -70662 -72822 -30211 3026 27470 67507 82944
722 82944 55175 54392 37102 -4690 6948 -6375 182 -14845 -23821 -1494 28759 51727 28502
709 28502 -6344 -8188 -39080 -53893 -48929 -38847 -6229 -11908 -21948 -38772 -70143 -79998 -40281
696 -40281 -22418 -6755 -17942 5270 2199 14252 25635 -3560 31479 49748 48038 18375
684 18375 -7591 -67124 -41845 -41527 -89251 -104532 -60856 -16523 19530 -18585 -50297 -73297
672 -73297 -61975 -13218 -8363 -18836 -18633 3337 22881 45273 48680 47176 31368 4332 2036
659 2036 -4959 -34838 -17990 10534 -11971 -6420 -60863 -72774 -23985 -10923 13440 17549 26374
646 26374 13477 13663 11515 14588 2043 -4369 -2799 -31057 -16481 -3013 10134 -17114 -39370
633 -39370 -24213 -24645 -19570 -5166 2361 3502 -9254 -39481 -15041 42125 55048 3297 -14301
620 -14301 -6534 57848 98783 61383 12278 16262 33983 12084 7000 14569 7865 6629 -11205
607 -11205 3913 47292 47306 28389 6462 -10983 -26257 12121 61453 44792 2406 -14901 -10334
594 -10334 6391 4328 -2981 51842 48975 14570 -13089 23306 33052 31163 29501 857 9196
581 9196 -6321 36436 21516 16894 -905 -3733 -4558 -5434 -12302 -31105 21683 84823 66342 37689
567 37689 -10909 -47829 -45861 -44920 -6496 1428 3404 31198 -15745 -34411 -51586 -69890 -56333
554 -56333 -51131 -29033 33167 44800 29342 -152 -35088 -69444 -26804 42898 31988 15210
542 15210 32902 69222 58879 55223 47281 26394 23091 -20441 -43633 -1515 -13347 -49740 -39312
529 -39312 -56216 -79993 -73048 -95128 -70043 -40066 -23943 37577 73486 42140 -29940 -42079
517 -42079 -31869 -27316 -48456 -72016 -83778 -84288 -79780 -67420 -46256 -26510 -29147 -212 54688
504 54688 55216 3710 -25556 -4332 16977 35004 12044 3655 7682 41732 47626 23095 -31886
491 -31886 -29085 6642 394 -4445 19983 -6087 -7007 -11399 -56313 -90365 -38390 17069 19834
478 19834 -2649 -27944 -25971 -3350 12953 25343 10264 6876 15886 -15338 -44407 -29956 -13048
465 -13048 -16710 -34395 -24695 2690 40630 82247 28487 10474 25295 31256 15584 -1308 -5153
452 -5153 -12643 -23720 2361 9450 -11755 5348 16815 13505 17779 38216 23838 32361 -7079
439 -7079 -17911 -11932 -2748 29962 17759 51768 54244 46232 76182 77512 36499 23360 1563
426 1563 -8952 -36076 -31878 -49898 -56082 -40671 -10625 8940 -19594 -46037 -47676 -35241 -54113
413 -54113 -64676 -33240 -36882 -47686 -35568 -64396 -76903 -58289 -35782 -30429 -2913 12544
401 12544 -13535 -52542 -48420 -19527 -51752 -57338 -75783 -79671 -59982 -74778 -76192 -47757 -42122
388 -42122 7475 19535 38019 46866 18904 -20512 -4232 -1734 18618 34071 -14301 -37358
376 -37358 -52541 -44166 -20349 8317 -14893 -56274 -71688 -63870 -50754 -24368 -10476 -38429
364 -38429 -40855 -80264 -86602 -36723 -9583 -6134 -8903 -17340 -12858 -93314 -128892 -111657 -60434
351 -60434 -21788 -3262 -1612 -7819 -7810 -31761 -42306 900 58756 26680 2211 7727 -12629
338 -12629 -40296 -31739 -3950 5930 25944 12037 -13460 18386 26986 -31404 -22028 -33132 17568
325 17568 37071 22329 25407 10014 -22126 -34504 -39929 -50214 980 11683 24788 20005 -16134
312 -16134 -7236 17050 15670 38276 20791 24220 18165 47369 62113 34227 38378 67178 85161
299 85161 103804 89017 56490 5349 13814 -30642 -37369 -18030 18911 70036 67446 7769 -44172
286 -44172 -18369 -31675 -44343 -67566 -78049 -29984 13169 37716 12909 7388 22061 16723
274 16723 -8997 -60703 -35817 3060 14569 15983 2318 -1354 -13235 -17488 -24864 5136 47282
261 47282 51161 37894 17805 -11669 33510 40128 18693 10615 12504 11404 2990 -18705 -27991
248 -27991 -54880 -43256 5944 21629 5335 22558 16478 15509 32382 64809 31719 16568 -25395
235 -25395 -32358 -13258 32662 20191 2929 5954 -3025 -21389 -38087 -48679 -29384 646 -13202
222 -13202 -3721 -29253 -27643 -4267 9972 -20708 -6307 -3154 10582 -27906 -7147 11630 -10981
209 -10981 -32666 -19287 10961 5657 29713 28050 -21071 -32779 -47055 -63423 -46600 -14041
197 -14041 39280 35130 13231 17520 7139 1981 25155 26901 110 -13219 -62446 -54718 -23412
184 -23412 -23243 -9932 -25082 -21356 284 32959 22834 26820 3533 -4910 351 40600 75413
171 75413 56230 53729 22660 6681 8588 -8974 -17823 -26407 -46468 -31501 -446 37733 78756
158 78756 54848 16679 -11794 -11860 -5333 10883 14128 29667 58915 33659 18098 4352 23415
145 23415 34279 4204 -4268 -33398 -8592 22616 13663 25457 29457 6316 -255 -30748 -54086
132 -54086 -19301 8942 -11809 -26298 -25235 -23088 -10766 -38395 -74537 -58227 -21629 -12909 -21281
119 -21281 -29262 -23022 -23139 -19176 -35672 -15051 -17763 -23844 -21224 -29662 -20692 -33604 -59254 -55888
105 -55888 -57344 -45831 -34144 -29352 -27465 6942 13105 -24581 -24481 -18486 -29480 -67817 -83876
92 -83876 -74386 -78297 -71423 -57245 -25290 -19819 -19451 -785 -5452 -35510 -52918 -49592 -31664 1579
78 1579 -1264 -12840 10479 28122 23687 6605 -13925 -10736 -9637 -20249 -4264 -20893 -54736
65 -54736 -15961 29792 3280 -15116 19157 18584 27998 18038 26294 9314 -13763 -42437 -44509
52 -44509 -51916 -41347 -28018 -33976 -20280 -51622 -44082 -37575 -15114 -10230 -5153 -5301 -28370 -24204
38 -24204 1337 -8810 -55896 -49921 -13366 -18052 -10942 -10163 -22552 -16194 9125 9428 5969 -4775
24 -4775 -11949 -7036 14443 34176 22377 18371 27266 10436 18959 32456 51936 56560 81120 80110
10 80110 63880 52589 19123 -20448 -22615 -15911 -34038 -40985 -33461 -15850
0 -15850
$$ Imaginary data points
##PAGE= N=2
##DATA TABLE= (X++(I..I)), XYDATA
32767 91204 80464 99615 116912 84306 99917 112504 75930 51477 67339 99218 114557 109548
32755 109548 108079 110578 147478 141202 128729 111622 107366 118087 146571 193847 198214 193578 165865
32742 165865 133541 155882 161207 128076 100442 116721 130232 132581 128157 110880 143019 171580
$$ [...]
##END NTUPLES=NMR SPECTRUM
##END=
